##TITLE=Analysis number 317527
Compound Code mo 07746
Project Code qc-cat
Chemist Name chemcon
##JCAMPDX= 6.0         $$ Bruker NMR JCAMP-DX V2.0
##DATA TYPE= NMR SPECTRUM
##DATA CLASS= NTUPLES
##ORIGIN= Bruker BioSpin GmbH
##OWNER= nmr
$$ XWIN-NMR		Version 3.5
$$ Wed Feb 22 12:45:56 2006 GMT Standard Time (UT+0h)  MAYBRIDGE\nmr@NMR_250MHZ
##.OBSERVE FREQUENCY= 250.131544655141
##.OBSERVE NUCLEUS= ^1H
##.ACQUISITION MODE= SIMULTANEOUS (DQD)
##.ACQUISITION SCHEME= undefined
##.AVERAGES= 16
##.DIGITISER RES= 18
##SPECTROMETER/DATA SYSTEM= dpx250
##.PULSE SEQUENCE= zg30
##.SOLVENT NAME= DMSO
##.SHIFT REFERENCE= (INTERNAL, DMSO, 0, 16.522)
##AUDIT TRAIL= $$ (NUMBER, WHEN, WHO, WHERE, WHAT)
$$ ##TITLE= Audit trail, XWIN-NMR		Version 3.5
$$ ##JCAMPDX= 5.01
$$ ##ORIGIN= Bruker BioSpin GmbH
$$ ##OWNER= nmr
$$ C:\u/data/dgb/nmr/ADRS/16690/pdata/1/auditp.txt
$$ ##AUDIT TRAIL=  $$ (NUMBER, WHEN, WHO, WHERE, WHAT)
(   1,<2006-02-22 12:44:55.20 +000>,<MAYBRIDGE\nmr>,<NMR_250MHZ>,
      <created by zg, POWCHK disabled, PULCHK disabled
       configuration hash MD5:
       84 BC 41 DB A1 6E 1D 46 DA 25 12 A5 C1 ED C5 3A
       data hash MD5: 64K
       29 70 67 19 9F B7 58 3A BF BC 53 13 CA A2 DC A0>)
(   2,<2006-02-22 12:45:22.07 +000>,<MAYBRIDGE\nmr>,<NMR_250MHZ>,
      <Start of raw data processing
       ef LB = 0.3 FT_mod = 6 PKNL = 1 SI = 32K 
       data hash MD5: 32K
       99 AB C5 09 01 73 20 73 4C D8 2F 17 77 C6 EA E9>)
(   3,<2006-02-22 12:45:25.60 +000>,<MAYBRIDGE\nmr>,<NMR_250MHZ>,
      <apk 
       data hash MD5: 32K
       B5 AF 4B 13 F0 6F 70 66 3D 16 48 7D 2C F8 AD 88>)
(   4,<2006-02-22 12:45:27.17 +000>,<MAYBRIDGE\nmr>,<NMR_250MHZ>,
      <abs ABSG = 5 
       data hash MD5: 32K
       44 B7 A4 36 7E 98 3B EC 9D 10 FD FA 77 CA AA 85>)
$$ ##END=
$$ 
$$ hash MD5
$$ 13 27 61 DE 9D 75 B6 DD 6D 56 9A 4E BB 46 EE 7E
##$RELAX= 
##$RELAX= 
##$RELAX= 
##$RELAX= 
##$RELAX= 
##$RELAX= 
##$RELAX= 
$$ Bruker specific parameters
$$ --------------------------
##$DU= <C:\u>
##$EXPNO= 16690
##$NAME= <ADRS>
##$PROCNO= 1
##$TYPE= <nmr>
##$USER= <dgb>
##$AMP= (0..31)
100 100 100 100 100 100 100 100 100 100 100 100 100 100 100 100 100 100 
100 100 100 100 100 100 100 100 100 100 100 100 100 100 
##$AQSEQ= 0
##$AQ_mod= 3
##$AUNM= <au_zg>
##$AUTOPOS= <29 >
##$BF1= 250.13
##$BF2= 250.13
##$BF3= 250.13
##$BF4= 250.13
##$BF5= 500.13
##$BF6= 500.13
##$BF7= 500.13
##$BF8= 500.13
##$BYTORDA= 1
##$CFDGTYP= 0
##$CFRGTYP= 5
##$CHEMSTR= <none>
##$CNST= (0..31)
1 1 145 1 1 1 1 1 1 1 1 1 1 1 1 1 1 1 1 1 1 1 1 1 1 1 1 1 1 1 1 1 
##$CPDPRG= <>
##$CPDPRG1= <>
##$CPDPRG2= <>
##$CPDPRG3= <>
##$CPDPRG4= <mlev>
##$CPDPRG5= <mlev>
##$CPDPRG6= <mlev>
##$CPDPRG7= <mlev>
##$CPDPRG8= <mlev>
##$CPDPRGB= <>
##$CPDPRGT= <>
##$D= (0..31)
0 1 0 0 0 0 0 0 0 0.06 0 0 0 0 0 0 0.0002 0 0 0 0 0 0 0 0 0 0 0 0 0 0 
0 
##$DATE= 1140612289
##$DBL= (0..7)
120 120 120 120 120 120 120 120 
##$DBP= (0..7)
150 150 150 150 150 150 150 150 
##$DBP07= 0
##$DBPNAM0= <>
##$DBPNAM1= <>
##$DBPNAM2= <>
$$ [...]
##$SUBNAM7= <"">
##$SUBNAM8= <"">
##$SUBNAM9= <"">
##$SW= 20.6930455092707
##$SWIBOX= (0..15)
0 0 3 0 0 0 0 0 0 0 0 0 0 0 0 0 
##$SW_h= 5175.983436853
##$TD= 65536
##$TD0= 1
##$TE= 293.16
##$TE2= 300
##$TE3= 300
##$TEG= 300
##$TL= (0..7)
0 120 120 120 120 120 120 120 
##$TP= (0..7)
150 150 150 150 150 150 150 150 
##$TP07= 0
##$TPNAME0= <>
##$TPNAME1= <>
##$TPNAME2= <>
##$TPNAME3= <>
##$TPNAME4= <>
##$TPNAME5= <>
##$TPNAME6= <>
##$TPNAME7= <>
##$TPOAL= (0..7)
0.5 0.5 0.5 0.5 0.5 0.5 0.5 0.5 
##$TPOFFS= (0..7)
0 0 0 0 0 0 0 0 
##$TUNHIN= 0
##$TUNHOUT= 0
##$TUNXOUT= 0
##$USERA1= <user>
##$USERA2= <user>
##$USERA3= <user>
##$USERA4= <user>
##$USERA5= <user>
##$V9= 5
##$VALIST= <valist>
##$VCLIST= <CCCCCCCCCCCCCCC>
##$VD= 0
##$VDLIST= <DDDDDDDDDDDDDDD>
##$VPLIST= <PPPPPPPPPPPPPPP>
##$VTLIST= <TTTTTTTTTTTTTTT>
##$WBST= 1024
##$WBSW= 4
##$XGAIN= (0..3)
0 0 0 0 
##$XL= 0
##$YL= 0
##$YMAX_a= 340085
##$YMIN_a= -345477
##$ZGOPTNS= <>
##$ZL1= 120
##$ZL2= 120
##$ZL3= 120
##$ZL4= 120
##$ABSF1= 16.522
##$ABSF2= -4.171173
##$ABSG= 5
##$ABSL= 3
##$ALPHA= 0
##$AQORDER= 0
##$ASSFAC= 0
##$ASSFACI= 0
##$ASSFACX= 0
##$ASSWID= 0
##$AUNMP= <proc_1d>
##$AZFE= 0.1
##$AZFW= 0.1
##$BCFW= 0
##$BC_mod= 0
##$BYTORDP= 0
##$COROFFS= 0
##$CY= 12.5
##$DATMOD= 1
##$DC= 0
##$DFILT= <>
##$DTYPP= 0
##$F1P= 14.0000005364418
##$F2P= -0.99999901652339
##$FCOR= 0.5
##$FTSIZE= 32768
##$FT_mod= 6
##$GAMMA= 0
##$GB= 0
##$INTBC= 1
##$INTSCL= 1
##$ISEN= 128
##$LB= 0.3
##$LEV0= 0
##$LPBIN= 0
##$MAXI= 10000
##$MC2= 0
##$MEAN= 0
##$ME_mod= 0
##$MI= 0
##$NCOEF= 0
##$NC_proc= -4
##$NLEV= 6
##$NOISF1= 0
##$NOISF2= 0
##$NSP= 0
##$NTH_PI= 0
##$NZP= 0
##$OFFSET= 16.522
##$PC= 1
##$PHC0= 240.3879
##$PHC1= 4.927165
##$PH_mod= 1
##$PKNL= yes
##$PPARMOD= 0
##$PSCAL= 4
##$PSIGN= 0
##$REVERSE= no
##$SF= 250.13
##$SI= 32768
##$SIGF1= 0
##$SIGF2= 0
##$SINO= 400
##$SIOLD= 32768
##$SREGLST= <1H.DMSO>
##$SSB= 0
##$STSI= 32768
##$STSR= 0
##$SW_p= 5175.98343685301
##$SYMM= 0
##$S_DEV= 0
##$TDeff= 65536
##$TDoff= 0
##$TI= <Analysis number 999999
Compound Code 99
Book Reference 9
Project Code 9>
##$TILT= no
##$TM1= 0
##$TM2= 0
##$TOPLEV= 0
##$USERP1= <user>
##$USERP2= <user>
##$USERP3= <user>
##$USERP4= <user>
##$USERP5= <user>
##$WDW= 1
##$XDIM= 32768
##$YMAX_p= 322272447
##$YMIN_p= -419846
$$ End of Bruker specific parameters
$$ ---------------------------------
##NTUPLES= NMR SPECTRUM
##VAR_NAME=  FREQUENCY,     SPECTRUM/REAL,   SPECTRUM/IMAG
##SYMBOL=    X,             R,               I
##VAR_TYPE=  INDEPENDENT,   DEPENDENT,       DEPENDENT
##VAR_FORM=  AFFN,          ASDF,            ASDF
##VAR_DIM=   32768,         32768,           32768
##UNITS=     HZ,            ARBITRARY UNITS, ARBITRARY UNITS
##FACTOR=    0.157963299565203, 1,           1
##FIRST=     4132.6476996994, 0,             0
##LAST=      -1043.33573715361, 0,           0
##MIN=       -1043.33573715361, -419846,     0
##MAX=       4132.6476996994, 322272447,     0
$$ Real data points
##PAGE= N=1
##DATA TABLE= (X++(R..R)), XYDATA
$$ [...]
$$ plain form
15456 -4575 12464 -18286 -75228 -7390 58697 125601 195835 133017 -22239 -131294 -167686
15445 -167686 -151798 -216774 -170714 -14898 34223 37948 30862 33830 180140 254247 141952
15434 141952 116813 121132 62949 56877 49004 124936 180354 99998 25738 11372 18818 79853
15422 79853 117245 115794 32032 38243 43937 51014 75985 113379 161314 192298 138582 129969 142658
15409 142658 127490 113221 138577 166598 158342 183862 199830 142273 155923 200609 297500 222527
15397 222527 64147 38313 -2186 52381 128755 108837 129358 171192 184999 217311 211670
15386 211670 211683 227199 183411 151426 34737 -8041 141278 224560 275233 295342 217034 176893
15374 176893 173486 198430 182533 158363 140667 189864 230868 241105 201692 55953 21201
$$ packed form
15456d575J7039l0750n6942O7838O6087O6904P0234o2818j55256j09055l6392
15445a67686J5888o4976M6060J55816M9121L725p086K968J46310P4107j12295
15434A41952k5139M319n8183o072p873P5932N5418q0356p4260j4366P446O1035
15422G9853L7392j451q3762O211N694P077K4971L7394M7935L0984n3716q613J2689
15409A42658j5168j4269K5356K8021q256K5520J5968n7557J3650M4686R6891p4973
15397B22527j58380k5834m0499N4567P6374j9918K0521M1834J3807L2312n641
15386B11670J3J5516m3788l1985j16689m2778J49319Q3282N0673K0109p8308m0141
15374A76893l407K4944j5897k4170j7696M9197M1004J0237l9413j45739l4752
$$ plain form
15363 21201 62203 52977 113308 171617 208153 182555 143649 139845 94956 156702 192316 170002
15351 170002 95237 17325 -56567 -54313 25668 59672 109887 76054 116653 85249 132178 117775
15339 117775 87328 194471 43269 -27928 -25241 14312 -36400 -112356 -92719 55749 98080
15328 98080 160883 185228 216599 144109 125222 93498 96773 87021 71473 173898 140349 184424
15316 184424 194069 153365 78600 -595 88382 124286 89205 -12570 -26505 -63566 -115189
15305 -115189 -117789 -42881 57707 16835 -108222 -153316 -141183 -91944 -19169 41280 553
15294 553 -46039 -78085 26105 70582 137366 93701 67746 45044 107173 92238 -15633 -7229
15282 -7229 30192 11121 -1452 75583 98168 93464 24549 -16251 -67734 -155236 -64796 41617
$$ packed form
15363B1201M1002r226O0331N8309L6536k5598l8906l804m4889O1746L5614k2314
15351A70002p4765p7912p3892K254P9981L4004N0215l3833M0599l1404M6929j4403
15339A17775l0447J07143j51202p1197K687L9553n0712p5956J9637J48468M2331
15328I8080O2803K4345L1371p2490j8887l1724L275r752j5548J02425l3549M4075
15316A84424R645m0704p4765p9195Q8977L5904l5081j01775j3935l7061n1623
15305a15189k600P4908J00588m0872j25057m5094J2133M9239P2775O0449m0727
15294E53m6592l2046J04190M4477O6784m3665k5955k2702O2129j4935j07871Q404
15282g229L7421j9071j2573P7035K2585m704o8915m0800n1483q7502R0440J06413
$$ plain form
15270 41617 26903 -66575 -74594 -77431 -49752 -4450 54959 27758 3354 25017 27019 52310
15258 52310 9370 17059 -13803 -42017 6142 30022 43439 139827 35054 -28334 -82579 21437
15246 21437 81087 65233 13394 10061 44152 -63012 -68927 56586 47127 -14265 -47292 -54887
15234 -54887 -20086 -7928 -57112 -59096 -41179 -8512 37321 31254 44193 23596 128955 10823
15222 10823 34974 51074 77212 50359 44431 65261 133708 144137 213778 214509 138332 82981
15210 82981 187240 217138 127353 -16984 -21670 142797 224672 85337 -670 19873 56930
15199 56930 63174 116305 152594 179330 215038 259108 262491 322492 287424 244077 259548 300905
15187 300905 242430 129143 187513 123099 75873 -56747 -157972 -151794 -109594 -42297 -13450
$$ packed form
15270D1617j4714r3478q019k837K7679M5302N9409k7201k4404K1663K002K5291
15258E2310m2940P689l0862k8214M8159K3880J3417R6388j04773o3388n4245J04016
15246B1437N9650j5854n1839l333L4091j07164n915J25513r459o1392l3027p595
15234e4887L4801J2158m9184j984J7917L2667M5833o067J2939k0597J05359j18132
15222A0823K4151J6100K6138k6853n928K0830O8447J0429O9641P31p6177n5351
15210H2981J04259K9898q9785j44337m686J64467Q1875j39335q6007K0543L7057
15199E6930O244N3131L6289K6736L5708M4070L383O0001l5068m3347J5471M1357
15187C00905n8475j13287N8370o4414m7226j32620j01225O178M2200O7297K8847
$$ plain form
15176 -13450 -47954 24673 107197 51064 -17619 -5044 21704 39717 20190 16260 -18540 -33840
15164 -33840 9654 4139 -99188 -62650 2523 -21549 -53050 -33713 -58808 18291 93022 70054
15152 70054 123063 156131 155637 117717 128027 184920 165981 155258 182716 110980 4440 -5567
15140 -5567 -45225 -12857 71587 67439 99759 -20681 -8908 53359 -47299 -40150 14660 47013
15128 47013 59414 72007 53920 -8081 -38214 -14962 -55180 -67360 -50989 -103710 -95691 -139567
15116 -139567 -171979 -110077 -71181 -159523 -156361 -94864 -49703 -51117 -91052 -127904 -25483 68280
15104 68280 -34086 -102386 -1768 -7065 9609 43301 72208 35101 46383 114399 62332
15093 62332 29891 3020 53799 82571 -98070 -40985 45709 -61399 -122846 -153183 -128204
$$ packed form
15176a3450l4504P2627Q2524n6133o8683J2575K6748J8013j9527l930l4800j5300
15164c3840M3494n515j03327L6538O5173k4072l1501J9337k5095P7099P4731k2968
15152G0054N3009L3068m94l7920J0310N6893j8939j0723K7458p1736j06540j0007
15140e567l9658L2368Q4444m148L2320j20440J1773O2267j00658P149N4810L2353
15128D7013J2401J2593j8087o2001l0133K3252m0218j2180J6371n2721Q019m3876
15116a39567l2412O1902L8896q8342L162O1497M5161j414l9935l6852J02421R3763
15104F8280j02366o8300J00618n297J6674L3692K8907l7107J1282O8016n2067
15093F2332l2441k6871N0779K8772j80641N7085Q6694j07108o1447l0337K4979
$$ plain form
15082 -128204 -127368 -34464 -72311 -83697 -141330 -190861 -98340 -50088 -40278 14935 45081 105463
15070 105463 182494 16292 66876 94121 -60526 -34892 -56110 -6337 84732 92053 101750
15059 101750 21017 -13914 -56162 -18226 99081 77287 41583 44307 -64620 -78071 81951
15048 81951 116398 64099 31011 18936 -97092 -137712 -75891 -169790 -43080 34849 -8484
15037 -8484 -64968 -13279 57055 79644 -21442 -37368 -7560 -25218 -102169 -94000 -76684 -67352
15025 -67352 -170391 -231469 -52191 109193 206774 133998 44144 -19981 -55858 -71677 -29557
15014 -29557 13257 -844 -83606 -118832 -128677 -30369 -5797 -17539 -72469 -195884 -219252 -128937
15002 -128937 -146945 -179706 -124130 -48006 -44602 -7011 -18747 -48146 -38661 57007 95460 63788
$$ packed form
15082a28204Q36R2904l7847j1386n7633m9531R2521M8252R810N5213L0146O0382
15070A05463P7031j66202N0584K7245j54647K5634k1218M9773R1069P321R697
15059A01750q0733l4931m2248L7936J17307k1794l5704K724j08927j3451J60022
15048H1951L4447n2299l3088j2075j16028m0620O1821r3899J26710P7929m3333
15037h484n6484N1689P0334K2589j01086j5926K9808j7658p6951Q169J7316R332
15025f7352j03039o1078J79278J61384R7581p2776q9854o4125l5877j5819M2120
15014b9557M2814j4101q2762l5226r845R8308K4572j1742n4930j23415k3368R0315
15002a28937j8008l2761N5576P6124L404L7591j1736k9399R485R5668L8453l1672
$$ plain form
14990 63788 -27838 17324 14905 108634 271202 134957 84547 131815 61171 -45231 -118316
14979 -118316 -120142 -114846 -73611 -131995 -91856 104001 191271 125126 119056 42600 -92852 -195909
14967 -195909 -134067 -63588 70519 82847 54424 70670 3264 2019 41339 49441 82103 80867
14955 80867 16840 -57078 -65011 -71212 -74678 -40220 74725 102681 88873 63614 145766 168906
14943 168906 84437 -64192 -154974 -143319 -130109 -102295 -149152 -55797 63034 93226 66369
14932 66369 60523 134609 145692 35230 17603 -9839 -123009 -147672 -141147 -73868 -88746 -67963
14920 -67963 52989 157408 219115 191262 122041 69255 61517 -120178 -177415 -56298 -49302
14909 -49302 -70562 2961 -47159 -91126 -48354 41154 -3741 -22549 -59437 -91843 -52509 -37722
$$ packed form
14990F3788r1626M5162k419R3729J62568j36245n0410M7268p0644j06402p3085
14979a18316j826N296M1235n8384M0139J95857Q7270o6145o070p6456j35452j03057
14967a95909O1842P0479J34107J2328k8423J6246o7406j245L9320Q102L2662j236
14955H0867o4027p3918p933o201l466L4458J14945K7956j3808k5259Q2152K3140
14943A68906q4469j48629r0782J1655J3210K7814m6857R3355J18831L0192k6857
14932F6369n846P4086J1083j10462j7627k7442j13170k4663O525O7279j4878K0783
14920f7963J20952J04419O1707k7853o9221n2786p738j81695n7237J21117O996
14909d9302k1260P3523n0120m3967M2772Q9508m4895j8808l6888l2406L9334J4787
$$ plain form
14897 -37722 -120166 -207413 -319486 -309059 -134058 33382 69397 -44419 -50658 -12094 53951
14886 53951 84716 142014 93644 26574 -30734 -78641 -91442 -71548 -26589 -48253 -36851 -43451
14874 -43451 -119710 -94595 -20581 -70401 -83180 -48877 -32202 -51418 -23573 -123863 -100576
14863 -100576 93413 213847 175310 99328 16356 -37540 -62367 -158015 -152526 -93535 -70935
14852 -70935 -114942 -116844 -90535 -94552 -129204 -223246 -148606 -110630 -125377 -108856 -165139 -121155
14840 -121155 -157297 -71333 41015 97143 41757 -81351 -130271 44470 39415 60863 115023
14829 115023 154270 57724 -71541 -174073 -201915 -180847 -139514 -157701 -60150 -76500 -110851
14818 -110851 -114250 14736 4434 105440 143119 34416 -72285 -46097 31127 64421 12983
$$ packed form
14897c7722q2444q7247j12073J0427J75001J67440L6015j13816o239L8564O6045
14886E3951L0765N7298m8370o7070n7308m7907j2801J9894M4959k1664J1402o600
14874d3451p6259K5115P4014m9820j2779L4303J6675j9216K7845j00290K3287
14863a00576J93989J20434l8537p5982q2972n3896k4827r5648N489N8991K2600
14852g0935m4007j902K6309m017l4652r4042P4640L7976j4747J6521n6283M3984
14840a21155l6142Q5964J12348N6128n5386j23108m8920J74741n055K1448N4160
14829A15023L9247r6546j29265j02532k7842K1068M1333j8187R7551j6350l4351
14818a10851l399J28986j0302J01006L7679j08703j06701K6188P7224L3294n1438
$$ plain form
14807 12983 100608 88097 37276 -23657 -18870 -27265 -35192 -41469 -71467 -105761 -190170 -185213 -90568
14794 -90568 9567 36091 31796 -40297 -69042 -27856 -97089 -131826 -130990 -19148 36035 97691
14782 97691 100546 24293 23537 54347 85081 -49030 -30549 -28343 -75288 -39124 -6328 52526
14770 52526 -41329 -94066 -135191 -102372 86375 137083 36165 -52775 -75447 13404 18362
14759 18362 -22077 -25574 39766 70263 129119 35308 -40191 -162188 -171121 -92694 -20826 61286
14747 61286 86337 54429 29199 41984 113952 81493 -31982 15470 36697 96679 107966
14736 107966 25886 38508 86573 73464 40263 105408 74504 63524 59292 33654 -4845 115862
14724 115862 154322 -58026 -58407 109017 202114 221346 132906 32325 146901 129682 117839
$$ packed form
14807A2983Q7625j2511n0821o0933M787q395p927o277k9998l4294q4409M957R4645
14794i0568J00135K6524m295p2093k8745M1186o9233l4737Q36J11842N5183O1656
14782I7691K855p6253p56L0810L0734j34111J8481K206m6945L6164L2796N8854
14770E2526r3855n2737m1125L2819J88747N0708j00918q8940k2672Q8851M958
14759A8362m0439l497O5340L0497N8856r3811p5499j21997q933P8427P1868Q2112
14747F1286K5051l1908k5230J2785P1968l2459j13475M7452K1227N9982J1287
14736A07966q2080J2622M8065j3109l3201O5145l0904j0980m232k5638l8499J20707
14724A15862L8460k12348l81J67424R3097J9232q8440j00581J14576j7219j1843
$$ plain form
14713 117839 87688 93902 195103 210888 150781 226739 230379 252330 221947 192809 247148 250759
14701 250759 130745 173987 154875 159645 76218 -7362 -51163 -41621 -49445 -53756 -38378 -49963
14689 -49963 12474 -20072 63381 81042 -29147 -43581 35485 14272 57359 55845 15248 1545
14677 1545 31645 43387 62620 69996 27947 25778 9820 61456 -17948 -53819 -42987 -35623
14665 -35623 -77910 -103695 -59281 -24369 10224 15707 -154775 -173882 -63559 -18267 -42877
14654 -42877 -17866 78918 157398 166894 147487 164766 152002 97822 11573 -77214 -25728 41950
14642 41950 -10189 -92136 -93636 -73555 -68221 -37852 -35429 5911 -119652 -103129 16895 102156
14630 102156 149279 89360 -23708 -81512 -81738 -46649 -24079 -70941 -35945 46947 81100 13111
$$ packed form
14713A17839l0151O214J01201J5785o0107P5958L640K1951l0383k9138N4339L611
14701B50759j20014M3242j9112M770q3427q3580m3801R542p824m311J5378j1585
14689d9963O2437l2546Q3453J7661j10189j4434P9066k1213M3087j514m0597j3703
14677A545L0100J1742J9233P376m2049k169j5958N1636p9404l5871J0832P364
14665c5623m2287k5785M4414L4912L4593N483j70482j9107J10323M5292k4610
14654d2877K5011R6784P8480R496j9407J7279j2764n4180q6249q8787N1486O7678
14642D1950n2139q1947j500K0081N334L0369K423M1340j25563J6523J20024Q5261
14630A02156M7123n9919j13068n7804k26L5089K2570m6862L4996Q2892L4153o7989
$$ plain form
14618 13111 45086 104638 70096 -36110 -7455 -30674 -88314 -168728 -107643 7564 71196
14607 71196 103902 -25861 -65719 -23596 -109953 -85212 -103293 -108630 -4470 -9701 -25816 -45473
14595 -45473 -46301 3513 72068 6146 -44736 -117964 -78743 -68750 -118645 -86921 -99095 -34562
14583 -34562 -26123 -43533 -71816 -19066 -2032 -20418 21656 33346 -24080 -96288 -35637 41364
14571 41364 101984 26394 17520 82186 -19701 -17244 81111 57903 69418 94863 25348 -51675
14559 -51675 -120706 -171054 -85521 -110113 -200327 -164071 -89648 -83548 -7290 44315 36823 -40504
14547 -40504 -128075 -248765 -277503 -184940 -75429 -102533 -43508 40227 14168 -50499 -124672
14536 -124672 -56078 -58938 -144045 -42035 32454 88357 89133 111801 -11790 -66888 -40336 -81558
$$ packed form
14618A3111L1975N9552l4542j06206K8655k3219n7640q0414O1085J15207O3632
14607G1196L2706j29763l9858M2123q6357K4741j8081n337J04160n231j6115j9657
14595d5473q28M9814O8555o5922n0882p3228L9221R993m9895L1724j2174O4533
14583c4562Q439j7410k8283N2750J7034j8386M2074J1690n7426p2208O0651P7001
14571D1364O0620p5590q874O4666j01887K457R8355k3208J1515K5445o9515p7023
14559e1675o9031n0348Q5533k4592r0214L6256P4423O100P6258N1605p492p7327
14547d0504q7571j20690k8738R2563J09511k7104N9025Q3735k6059o4667p4173
14536a24672O8594k860q5107J02010P4489N5903P76K2668j23591n5098K6552m1222
$$ plain form
14524 -81558 -111469 -184334 -140918 -46289 -50524 -71469 -62845 -286939 -317481 -142626 -49670 -47882
14512 -47882 -33523 254 -7055 -58670 -112327 -53227 -49643 -59629 -67616 -81713 -95079 -166587
14500 -166587 -70957 -84051 -102121 -127881 -88593 -24880 -65898 -63162 -151925 -166988 -112645 -69349
14488 -69349 -34744 79870 208118 225083 56329 -17762 -1770 1985 62394 105626 14320
14477 14320 -23846 -32688 4191 65775 105207 56526 3361 -59249 -93909 -48344 -64126 -196838
14465 -196838 -161782 -27992 23672 27432 11622 -12097 -40383 33004 37270 -28100 -87473 -36806
14453 -36806 79456 179776 150890 169310 162581 144973 204867 240474 81918 -108743 -61744
14442 -61744 27899 18527 -6894 -20870 -24632 -14251 83788 193490 254264 200707 189855 101953
$$ packed form
14524h1558k9911p2865M3416R4629m235k0945Q624k24094l0542J74855R2956J788
14512d7882J4359L3777p309n1615n3657N9100L584r986p987j4097j3366p1508
14500a66587R5630j3094j8070k5760L9288O3713m1018K736q8763j5063N4343M3296
14488f9349L4605J14614J28248J6965j68754p4091J5992L755O0409M3232r1306
14477A4320l8166q842L6879O1584L9432m8681n3165o2610l4660M5565j5782j32712
14465a96838L5056J33790N1664L760j5810k3719k8286P3387M266o5370n9373N0667
14453c6806J16262J00320k8886J8420o729j7608N9894L5607j58556j90661M6999
14442f1744Q9643r372k5421j3976l762J0381R8039J09702O0774n3557j0852q7902
$$ plain form
14430 101953 -50855 -53945 -59533 -88208 -18969 15607 100193 37410 -7741 -15525 30068 126601
14418 126601 135284 63372 47191 -24253 -34606 -84548 -103550 -29338 43738 -65441 -30389
14407 -30389 82183 116479 39647 -23859 -90865 -151193 -145348 -187728 -137708 -149649 -147808 -184142
14395 -184142 -133777 -115135 -161349 -76668 -35185 -141232 -153685 -165326 -94992 -27820 -19639
14384 -19639 -62838 -69179 -52726 -2534 59405 62064 140086 76138 46792 90559 49463 -17071
14372 -17071 -38704 21540 26952 26083 40030 35106 18077 18821 12616 12989 -98317 -101740 -48459
14359 -48459 -122140 -140271 -71250 -2254 28933 84694 133643 159929 67641 -47226 -193102
14348 -193102 -215827 -135395 -54770 -66247 4411 -3418 -35119 3590 85399 161234 123590 -53048
$$ packed form
14430A01953j52808l090n588k8675O9239L4576Q4586o2783m5151p784M5593R6533
14418A26601Q683p1912j6181p1444j0353m9942j9002P4212P3076j09179L5052
14407c0389J12572L4296p6832o3506o7006o0328N845m2380N0020j1941J841l6334
14395a84142N0365J8642m6214Q4681M1483j06047j2453j1641P0334O7172Q181
14384a9639m3199o341J6453N0192O1939K659P8022o3948k9346M3767m1096o6534
14372a7071k1633O0244N412q69J3947m924j7029P44o205L73j11306l423N3281
14359d8459p3681j8131O9021O8996L1187N5761M8949K6286r2288j14867j45876
14348a93102k2725Q0432Q0625j1477P0658p829l1701L8709Q1809P5835l7644j76638
$$ plain form
14336 -53048 -110281 -67530 -59482 -24225 252 77552 232344 288157 109322 -729 -74869
14325 -74869 -133232 -133192 -78646 54784 48727 -56513 -21941 -8180 -7630 86837 42458 44106 50032
14312 50032 -14523 -121687 -182533 -110776 -151785 -123621 -148353 -227351 -241164 -165823 -103682
14301 -103682 -28768 41424 67671 85641 48963 55022 -19086 -39788 -44395 -40978 -119800 -161178
14289 -161178 -149198 -121363 -77612 -35460 -87731 -38897 -56364 -65069 -16915 -40505 -64098 22882
14277 22882 5110 -20237 43328 157518 224335 132907 70017 -15545 -46836 -38463 95417
14266 95417 170538 112870 -25381 -121933 -156673 -156980 -115110 -143608 -246645 -197953 -11019
14255 -11019 41492 19893 -35619 2740 -4365 -8268 25133 7521 -33165 -826 13482 9557
$$ packed form
14336e3048n7233M2751Q048L5257K4477P7300J54792N5813j78835j10051p4140
14325g4869n8363M0N4546J33430o057j05240L4572J3761N50R4467m4379J648N926
14312E0032o4555j07164o0846P1757m1009K8164k4732p8998j3813P5341O2141
14301a03682P4914P0192K6247J7970l6678O059p4108k0702m607L417p8822m1378
14289a61178J1980K7835M3751M2152n2271M8834j7467q705M8154k3590k3593Q6980
14277B2882j7772k5347O3565J14190O6817r1428o2890q5562l1291Q373J33880
14266I5417P5121n7668j38251r6552l4740l07M1870k8498j03037M8692J86934
14255a1019N2511k1599n5512L8359p105l903L3401j7612m0686L2339J4308l925
$$ plain form
14243 9557 7366 -42949 -102678 -137462 -194521 -145856 -23945 103933 54835 -1961 -11060 -2650
14231 -2650 -32208 -122483 -140930 -122635 -51839 20337 -64720 -174890 -132681 -47266 -52423 -109016
14219 -109016 -25005 3385 -33695 -63844 -4172 -46418 -110965 -96264 -57085 53597 86325
14208 86325 8291 53910 1594 1034 -13983 -27140 57687 -34006 -82091 -9317 34134 -40550
14196 -40550 -92026 -32742 4228 58878 -44 -37880 -41104 18579 29499 114908 143834 48100
14184 48100 109653 106773 43998 -12054 -40585 -121406 -60972 89532 123542 125735 38436 6084
14172 6084 38204 -78809 -161737 -54406 -12626 -20367 -31085 -69053 -113196 -63688 30565 91952
14160 91952 32943 32909 -17768 -64934 -54861 -114635 -80451 10581 -115361 -230784 -184746 -113760
$$ packed form
14243I557k191n0315n9729l4784n7059M8665J21911J27878m9098n6796r099Q410
14231b650k9558r0275j8447J8295P0796P2176q5057j10170M2209Q5415n157n6593
14219a09016Q4011K8390l7080l0149N9672m2246o4547J4701L9179J10682L2728
14208H6325p8034M5619n2316n60j5017j3157Q4827r1693m8085P2774M3451p4684
14196d0550n1476N9284L6970N4650n8922l7836l224N9683J0920Q5409K8926r5734
14184D8100O1553k880o2775n6052k8531q0821O0434J50504L4010K193q7299l2352
14172F084L2120j17013q2928J07331M1780p741j0718l7968m4143M9508R4253O1387
14160I1952n9009l4n0677m7166J0073n9774L4184R1032j25942j15423M6038P0986
$$ plain form
14148 -113760 -170599 -149505 -88312 -103766 -155779 -146358 -42433 24913 -33591 -139828 -113287
14137 -113287 -24485 47119 124370 -10122 -20535 -26414 -46891 -83241 -113169 -163804 -151352
14126 -151352 -48404 -44148 -42952 34206 118612 137399 185295 73183 9788 84114 71678
14115 71678 -60191 -31649 -46268 -51434 -10096 26224 70845 41403 41233 85082 -102488 -178907
14103 -178907 -140642 -177878 -184707 -146732 -114486 -57943 69918 180863 70144 46141 95892
14092 95892 167361 122116 132531 120060 149618 238425 143931 -14635 2593 -46500 -16885
14081 -16885 -39749 -125140 -169685 -102324 -23737 -47139 -50401 18623 66625 99685 131762 78731
14069 78731 70905 75118 61277 125751 147682 64095 44822 65841 79384 45988 16516 23410
$$ packed form
14148a13760n6839K1094O1193j5454n2013R421J03925O7346n8504j06237K6541
14137a13287Q8802P1604P7251j34492j0413n879k0477l6350k9928n0635J2452
14126a51352J02948M256J196P7158Q4406J8787M7896j12112o3395P4326j2436
14115G1678j31869K8542j4619n166M1338L6320M4621k9442j70M3849j87570p6419
14103a78907L8265l7236o829L7975L2246N6543J27861J10945j10719k4003M9751
14092I5892P1469m5245J0415j2471K9558Q8807r4494j58566J7228m9093K9615
14081a6885k2864q5391m4545O7361P8587k3402l262O9024M8002L3060L2077n3031
14069G8731p826M213j3841O4474K1931q3587j9273K1019J3543l3396k9472O894
$$ plain form
14057 23410 59234 -35994 41221 -12492 -23100 50241 135604 133764 126139 -3037 -92262 -55700
14045 -55700 -51772 36002 101237 61057 -46859 -58691 -57310 -162108 -197484 -152187 -98873 3423
14033 3423 61998 34020 -5121 -36696 -44891 -127227 -99409 -142578 -70071 59723 -42364 -99208
14021 -99208 -164468 -144942 -91609 -75628 -150043 -225682 -52925 -40751 -96228 -174223 -66614
14010 -66614 -29759 -92563 -203810 -289515 -209417 -195396 -160510 -76605 -91474 -265763 -286733
13999 -286733 -221167 -119671 -88504 -98459 -25441 -3301 -117559 -121900 -81079 -69512 17136
13988 17136 15766 -129879 -166610 -194533 -171446 -67284 -58894 -103101 -44703 -36016 -69116 -121277
13976 -121277 -202165 -241276 -252804 -214954 -133696 -153447 -200160 -213828 -271211 -191568 -95491
$$ packed form
14057B3410L5824r5228P7215n3713j0608P3341Q5363j840p625j29176q9225L6562
14045e5700L928Q7774O5235m0180j07916j1832J381j04798l5376M5297N3314J02296
14033C423N8575k7978l9141l1575q195q2336K7818m3169P2507J29794j02087n6844
14021i9208o5260J9526N3333J5981p4415p5639J72757J2174n5477p7995J07609
14010f6614L6855o2804j11247q5705Q0098J4021L4886Q3905j4869j74289k0970
13999b86733O5566J01496L1167r955P3018K2140j14258m341M0821J1567Q6648
13988A7136j370j45645l6731k7923K3087J04162Q390m4207N8398Q687l3100n2161
13976a21277q0888l9111j1528L7850Q1258j9751m6713j3668n7383P9643R6077
$$ plain form
13965 -95491 -9903 -16929 42064 78443 49942 110982 227066 237071 82010 -9070 38111
13954 38111 105726 137771 181259 180674 143041 157500 149532 166609 126740 120218 101989 112848
13942 112848 60437 22744 -12756 -1490 2196 24586 8018 28982 -13792 -89074 -88028 -218
13930 -218 53977 105308 86795 75712 64579 76061 78942 121172 115911 101365 110837 82644 51495
13917 51495 101255 128728 119516 63560 145364 175845 257848 268039 241281 252077 259082 302952
13905 302952 339961 308295 253399 114208 106955 213865 137632 81629 60770 55003 72914
13894 72914 122692 249210 302723 259629 163581 114423 103217 105543 145212 195414 188894 230588
13882 230588 280206 270032 177287 106449 74458 -47054 -106710 -5760 19280 -51947 -14061
$$ packed form
13965i5491Q5588p026N8993L6379k8501O1040J16084J0005j55061r1080M7181
13954C8111O7615L2045M3488n85l7633J4459p968J7077l9869o522j8229J0859
13942A12848n2411l7693l5500J1266L686K2390j6568K0964m2774p5282J046Q7810
13930b18N4195N1331j8513j1083j1133J1482K881M2230n261j4546R472k8193l1149
13917E1495M9760K7473r212n5956Q1804L0481Q2003J0191k6758J0796P005M3870
13905C02952L7009l1666n4896j39191p253J06910p6233n6003k0859n767J7911
13894G2914M9778J26518N3513m3094r6048m9158j1206K326L9669N0202o520M1694
13882B30588M9618j0174r2745p0838l1991j21512n9656J00950K5040p1227L7886
$$ plain form
13871 -14061 142923 257616 197441 121907 93947 91111 80034 99978 61527 -28774 -10437
13860 -10437 18452 90874 113416 131041 65999 9790 140357 120423 161583 148103 190308
13849 190308 240322 277626 169258 140394 121817 133123 46809 -15031 -24431 -45696 -2771
13838 -2771 20878 108574 54597 76199 155436 228935 154642 60397 66078 30245 -53133 13609
13826 13609 75408 14080 -76411 -139061 -201790 -203948 -190490 -71653 81513 106412 91168
13815 91168 60921 99758 107662 158475 149184 99712 -42163 -53304 11281 -66189 -104165 -56541
13803 -56541 -61107 -104956 -145907 -65908 -120899 -109611 24526 94277 34593 13669 73075 64322
13791 64322 -7612 -23691 8377 -37702 -87191 1761 -5871 -63611 -117275 -39519 73119 16403
$$ packed form
13871a4061J56984J14693o0175p5534k7960k836j1077J9944l8451r0301J8337
13860a0437K8889P2422K2542J7625o5042n6209J30567j9934M1160j3480M2205
13849A90308N0014L7304j08368k8864j8577J1306q6314o1840r400k1265M2925
13838b771K3649Q7696n3977K1602P9237P3499p4293r4245N681l5833q3378O6742
13826A3609O1799o1328r0491o2650o2729k158J3458J18837J53166K4899j5244
13815I1168l0247L8837P904N0813r291m9472j41875j1141O4585p7470l7976M7624
13803e6541m566m3849m0951P9999n4991J1288J34137O9751n9684k0924N9406q753
13791F4322p1934j6079L2068m6079m9489Q8952p632n7740n3664P7756J12638n6716
$$ plain form
13779 16403 240 -51235 5484 -22278 -183333 -206409 -149190 -45397 -31524 -53352 -18014
13768 -18014 -24489 -1662 5441 69844 67501 56415 42992 33936 -42343 -100427 37707 153951
13756 153951 48712 -120556 -178486 -108992 -123566 -150009 -126477 -77448 -79670 -147051 -163284
13745 -163284 -108409 5141 26069 38489 80739 25068 -72637 21036 31878 -43972 -167903
13734 -167903 -174293 -81983 12814 2149 -7493 -7475 -41638 -160758 -235096 -197257 -149607 -120271
13722 -120271 -40926 -152888 -149648 -93806 -64606 47923 134926 51966 -43439 -41799 15511
13711 15511 -51313 -185498 -224138 -118266 -67627 -116748 -204312 -197379 -155541 -65399 -69254 -71241
13699 -71241 -19617 -69858 -91487 -175092 -114943 -20130 -82396 -114897 -37957 5051 34485 -69824
$$ packed form
13779A6403j6163n1475N6719k7762j61055k3076N7219J03793J3873k1828L5338
13768a8014o475K2827P103O4403k343j1086j3423r056p6279n8084J38134J16244
13756A53951j05239j69268n7930O9494j4574k6443K3532M9029k222o7381j6233
13745a63284N4875J13550K0928J2420M2250n5671r7705R3673J0842p5850j23931
13734a67903o390R2310R4797j0665r642J8l4163j19120p4338L7839M7650K9336
13722a20271P9345j11962L240N5842K9200J12529Q7003q2960r5405J640N7310
13711A5511o6824j34185l8640J05872N0639m9121q7564O933M1838R0142l855j987
13699g1241N1624n0241k1629q3605O0149R4813o2266l2501P6940M3008K9434j04309
$$ plain form
13687 -69824 -195757 -178122 -86218 -4578 -22274 81529 144509 72094 47653 89131 168553
13676 168553 88675 -70874 -74452 -18274 45699 17874 -78778 -113293 -175939 -100180 -49286
13665 -49286 9337 73484 163557 158368 133444 22572 -35849 -56685 -2875 13227 -68545 -100987
13653 -100987 -10973 56662 17117 -68737 -80557 -154154 -55582 36538 147830 77506 31501
13642 31501 68010 72801 93837 103777 5368 -8737 87976 190155 200495 94227 6419 103671
13630 103671 136085 118417 70924 74310 -1802 15400 66351 59248 15723 4135 -47886 -91187
13618 -91187 -51730 56358 71129 -41064 -128146 -97689 -128478 -176787 -241542 -229378 -195106
13607 -195106 -163787 -195283 -247340 -200142 -154920 -73707 -15483 -41477 -42203 -44161 -99000 40473
$$ packed form
13687f9824j25933J7635R1904Q1640j7696J03803O2980p2415k4441M1478P9422
13676A68553p9878j59549l578N6178O3973k7825r6652l4515o2646P5759N0894
13665d9286N8623O4147R0073n189k4924j10872n8421k0836N3810J6102q1772l2442
13653a00987R0014O7635l9545q5854j1820p3597R8572R2120J11292p0324m6005
13642C1501L6509M791K1036R940r8409j4105R6713J02179J0340j06268q7808R7252
13630A03671L2414j7668m7493L386p6112J7202N0951p103m3525j1588n2021m3301
13618i1187L9457J08088J4771j12193q7082L0457l0789m8309o4755J2164L4272
13607a95106L1319l1496n2057M7198M5222Q1213N8224k5994p26j958n4839J39473
$$ plain form
13595 40473 47395 -49600 -62758 -53852 -39266 -31476 28095 8926 39646 36436 -6907 33511
13583 33511 116870 83077 -45307 -184135 -194159 -140839 -115938 -53419 -24133 -15138 -110255
13572 -110255 -183595 -174928 -54399 92759 86987 -23818 -108944 -97807 -135788 -57305 35675
13561 35675 33523 1386 -18784 -20410 25734 39073 -9924 -79109 -78380 -46480 -83996 -137641
13549 -137641 -41141 -124607 -255880 -254925 -226566 -330361 -288819 -179270 -72863 106138 97962
13538 97962 58443 -35103 -154232 -25893 58010 8808 7292 72559 18898 28588 -30413 -175075
13526 -175075 -163692 -71396 -37457 51224 98582 38696 -49974 -135591 -112259 -166637 -240002
13515 -240002 -204088 -110685 -140559 -183619 -125360 41599 32002 -96547 -82815 12364 14863
$$ packed form
13595D0473O922r6995j3158Q906J4586P790N9571j9169L0720l210m3343M0418
13583C3511Q3359l3793j28384j38828j0024N3320K4901O2519K9286Q995r5117
13572a10255p3340Q667J20529J47158n772j10805q5126J1137l7981P8483R2980
13561C5675k152l2137k0170j626M6144J3339m8997o9185P29L1900l7516n3645
13549a37641R6500q3466j31273R55K8359j03795M1542J09549J06407J79001q176
13538I7962l9519r3546j19129J28339Q3903m9202j516O5267n3661R690n9001j44662
13526a75075J1383R2296L3939Q8681M7358n9886q8670q5617K3332n4378p3365
13515b40002L5914R3403k9874m3060N8259J66959r597j28549J3732R5179K499
$$ plain form
13504 14863 -39176 -60915 41874 46524 -32591 30005 -893 37906 67396 107839 161668 131006
13492 131006 -56445 -115026 -83599 -82777 -50959 -25623 -126805 -129587 -81847 34949 151428
13481 151428 5552 -96349 -35205 25744 71085 34056 -49926 -163851 -197452 -140423 -12830
13470 -12830 89897 69233 -18249 -42614 -76543 -154425 -136213 -175067 -236300 -169504 -99074
13459 -99074 -32127 7631 -25173 -20688 61600 135114 97486 188032 145697 75835 -54768 -96266
13447 -96266 -133548 -131609 -139057 -189657 -299743 -249814 -169409 -95796 -88165 -118039 -125121 -95100
13435 -95100 -28453 22133 -5141 3721 4477 -72030 -13838 49028 36830 109661 132596 30537
13423 30537 830 -67813 -69532 -41172 -74312 -112001 -153925 -130905 -106098 32104 203075
$$ packed form
13504A4863n4039k1739J02789M650p9115O2596l0898L8799K9490M0443N3829l0662
13492A31006j87451n8581L1427Q22L1818K5336j01182k782M7740J16796J16479
13481A51428j45876j01901O1144O0949M5341l7029q3982j13925l3601N7029J27593
13470a2830J02727k0664q7482k4365l3929p7882J8212l8854o1233O6796P0430
13459i9074O6947L9758l2804M485Q2288P3514l7628R0546m2335o9862j30603m1498
13447i6266l7282J939p448n0600j10086M9929Q0405P3613P631k9874p082L0021
13435i5100O6647N0586k7274Q862P56p6507N8192O2866j2198P2831K2935j02059
13423C0537k9707o8643j719K8360l3140l7689m1924K3020K4807J38202J70971
$$ plain form
13412 203075 134933 48800 -55128 -63185 -159810 -185541 -196420 -202788 -127790 -54576 -65882 -49662
13400 -49662 -49461 -50361 -41847 -25359 -120493 -93875 13890 102103 137380 68777 -41750 -174923
13388 -174923 -174127 -61714 -23751 -16719 -40862 -29518 -35388 -111224 -145921 -132498 -181453 -143659
13376 -143659 -128956 -38853 -11548 -75612 -11526 -25520 -19839 -21670 -49145 -62162 -46986 11463
13364 11463 40032 35536 83598 142850 84710 59418 -39783 102476 186494 133085 95443 37134
13352 37134 -3709 -1822 -1196 30719 3809 -40276 -105809 -97718 -76342 -65874 -46453 -160888
13340 -160888 -120469 -131283 -216183 -318399 -188667 -61784 50893 28999 41964 150297
13330 150297 185984 149822 93983 85349 84035 76410 156953 174091 151262 167107 67868 -17740
$$ packed form
13412B03075o8142q6133j03928q057r6625k5731j0879o368P4998P3214j1306J6220
13400d9662K01r00Q514J6488r5134K6618J07765Q8213L5277o8603j10527j33173
13388a74923P96J12413L7963P032k4143J1344n870p5836l4697J3423m8955L7794
13376a43659J4703R0103K7305o4064O4086j3994N681j831k7475j3017J5176N8449
13364A1463K8569m496M8062N9252n8140k5292r9201J42259Q4018n3409l7642n8309
13352C7134m0843J887O26L1915k6910m4085o5533Q091K1376J0468J9421j14435
13340a60888M0419j0814q4900j02216J29732J26883J12677k1894J2965J08333
13330A50297L5687l6162n5839q634j314p625Q0543J7138k2829J5845r9239q5608
$$ plain form
13318 -17740 -107374 -14402 31279 -83534 -96202 4483 62189 41371 62849 47530 -30298
13307 -30298 -9439 -73672 -137314 -128435 -106829 -9679 -57087 -27823 -42598 -113216 -75086 -125729
13295 -125729 -114672 -82332 8847 62796 46436 76315 48776 42465 49788 92537 129388 102374
13283 102374 21816 45444 33880 108446 165189 171001 9308 -38953 42430 44888 -6796 -41088
13271 -41088 -21802 6178 64031 133153 81832 157056 128205 51407 -84769 -154091 -79151
13260 -79151 -52087 -108141 -139613 -155652 -164509 -183850 -215653 -107604 -114178 -34032 -74549 -101605
13248 -101605 -83544 -59696 -113519 -98414 -26783 68259 13690 -93437 -12152 48092 105037
13237 105037 176017 143785 75422 -24661 -126621 -71565 -19675 5356 60430 38189 5760
$$ packed form
13318a7740q9634R2972M5681j14813j2668J00685N7706k0818K1478j5319p7828
13307c0298K0859o4233o3642Q879K1606R7150m7408K9264j4775p0618L8130n0643
13295a25729J1057L2340R1179N3949j6360K9879k7539o311P323M2749L6851k7014
13283A02374q0558K3628j1564P4566N6743N812j61693m8261Q1383K458n1684l4292
13271d1088J9286K7980N7853O9122n1321P5224k8851p6798j36176o9322P4940
13260g9151K7064n6054l1472j6039q857j9341l1803J08049o574Q0146m0517k7056
13248a01605J8061K3848n3823J5105P1631R5042n4569j07127Q1285O0244N6945
13237A05037P0980l2232o8363j00083j01960N5056N1890K5031N5074k2241l2429
$$ plain form
13226 5760 9710 17087 103387 62334 96268 141646 21989 -7485 -53664 -100866 -75966 -91407
13214 -91407 -214096 -223709 -210781 -215991 -297814 -204940 -108681 -136741 -183083 -147723 -40203 23113
13202 23113 -28023 -42141 -138936 -141966 -100527 34123 92711 100353 35259 77975 874 -91124
13190 -91124 -60110 72630 77046 69989 71257 -27419 -124895 -126675 -88936 -67176 -37277 -37713 -48429
13177 -48429 -74706 -42983 -47988 -66534 -81416 -49775 -66571 -58427 21430 -11654 18010 60750
13165 60750 23130 41893 -19697 69118 71305 25426 25474 34745 -95030 -183455 -170755 -126907
13153 -126907 12972 -72019 -112861 -38056 -41745 -87391 -52148 -9970 1665 -79999 -88986 -17702
13141 -17702 48889 88924 126454 203912 157864 186253 120538 -20696 -58852 -38837 41116
$$ packed form
13226E760L950P377Q6300m1053L3934M5378j19657k9474m6179m7202K4900j5441
13214i1407j22689r613J2928n210q1823R2874R6259k8060m6342L5360J07520O3316
13202B3113n1136j4118r6795l030M1439J34650N8588P642o5094M2716p7101r1998
13190i1124L1014J32740M416p057J268r8676r7476j780L7739K1760K9899m36j0716
13177d8429k6277L1723n005j8546j4882L1641j6796Q144P9857l3084K9664M2740
13165F0750l7620J8763o1590Q8815K187m5879M8R271j29775q8425J2700M3848
13153a26907J39879q4991m0842P4805l689m5646L5243M2178J1635q1664q987P1284
13141a7702O6591M0035L7530P7458m6048K8389o5715j41234l8156K0015P9953
$$ plain form
13130 41116 42044 136019 129221 29889 77586 92121 100866 118389 104662 45713 -18816 -97436
13118 -97436 -105667 -106376 46715 86902 28825 24935 32747 106611 38732 11197 33093 47720
13106 47720 40420 75138 35017 -37701 -43873 -72527 -79160 182 11808 -47489 -105712 -91392
13094 -91392 18217 -54863 -112025 -59581 74030 46075 76398 87525 -8966 -17464 7365
13083 7365 -19653 -39135 -71133 -106675 -213751 -204631 -189456 -112439 -126189 -16882 -11826 14653
13071 14653 77624 39412 74616 149412 67343 -30368 -192764 -235435 -235320 -271175 -208452 -150654
13059 -150654 -75429 -45037 -76752 -4960 -12228 -70634 -76595 -154794 -174680 -163792 -257238 -257466
13047 -257466 -240412 -258305 -218850 -179805 -177903 -217948 -269534 -206297 -257533 -268554 -218107 -195796
$$ packed form
13130D1116R28R3975o798r9332M7697J4535Q745J7523j3727n8949o4529p8620
13118i7436q231p09J53091M0187n8077l890P812P3864o7879k7535K1896J4627
13106D7720p300L4718m0121p2718o172k8654o633P9342J1626n9297n8223J4320
13094i1392J09609p3080n7162N2444J33611k7955L0323J1127r6491q498K4829
13083G365k7018j9482l1998l5542j07076R120J5175P7017j3750J09307N056K6479
13071A4653O2971l8212L5204P4796q2069r7711j62396m2671J15l5855O2723N7798
13059a50654P5225L0392l1715P1792p268n8406n961p8199j9886J0888r3446k28
13047b57466J7054j7893L9455L9045J902m0045n1586O3237n1236j1021N0447K2311
$$ plain form
13035 -195796 -116010 -35703 56163 81384 136599 87888 48065 9327 33986 16743 67141
13024 67141 101642 26024 -4809 16343 86681 116666 21476 72036 153968 65211 -27712 -151658
13012 -151658 -153068 -109630 -133266 -199713 -110322 -138714 -149235 -82691 -86360 -94136 13128 -32509
13000 -32509 -50169 -58155 -36469 85734 107504 -2841 -32659 -26005 7177 -6221 -69168 -166447
12988 -166447 -165578 -132419 -148911 -65879 16332 91722 108395 -7039 -22513 -94585 -131247 -141825
12976 -141825 -103323 -67959 -31923 -23234 66170 -21134 -235541 -231266 -151030 -135583 -37780 -44505
12964 -44505 -87832 -120226 -175079 -129121 -64709 -53846 -6911 -30092 -29473 -61928 -222947 -264400
12952 -264400 -159355 -161950 -92695 -33409 -1591 -27595 -131661 -106769 -21857 -21591 -18381 -43563
$$ packed form
13035a95796P9786Q0307R1866K5221N5215m8711l9823l8738K4659j7243N0398
13024F7141L4501p5618l0833K1152P0338K9985r5190N0560Q1932q8757r2923j23946
13012a51658j410M3438k3636o6447Q9391k8392j0521O6544l669p776J07264m5637
13000c2509j7660p986K1686J22203K1770j10345k9818O654L3182j3398o2947r7279
12988a66447Q69L3159j6492Q3032Q2211P5390J6673j15434j5474p2072l6662j0578
12976a41825L8502L5364L6036Q689Q9404q7304k14407M275Q0236J5447R7803o725
12964d4505m3327l2394n4853M5958O4412J0863M6935k3181O19l2455j61019m1453
12952b64400J05045k595O9255N9286L1818k6004j04066K4892Q4912K66L210k5182
$$ plain form
12940 -43563 -33219 -133448 -130919 -93031 -76654 -28919 35470 137065 109836 94410 128920
12929 128920 120662 33016 -23441 -31559 -37645 -5270 109400 179462 32629 -85672 -120605
12918 -120605 -126677 -23495 100122 55 -153873 -168657 -106001 -130006 -30327 81940 -31896
12907 -31896 -63669 -17006 16920 66405 93511 122027 24871 -132251 -59996 -24330 22250
12896 22250 -9120 -23853 26428 94102 -28974 -202089 -123184 -66866 -75131 -74948 -109886 -101611
12884 -101611 -28740 -2574 -68897 -145998 -199056 -188563 -13893 -13970 59114 87333 160711 108996
12872 108996 132086 211081 233130 252487 86987 84490 66152 85639 3804 5872 26257 -20434
12860 -20434 -57026 5574 -90758 -143886 -178737 -86542 -59113 6883 9337 79833 121745 100161
$$ packed form
12940d3563J0344j00229K529L7888J6377M7735O4389J01595k7229j5426L4510
12929A28920q258q7646n6457q118o086L2375J14670P0062j46833j18301l4933
12918a20605o072J03182J23617j00067j53928j4784O2656k4005R9679J12267j13836
12907c1896l1773M6663L3926M9485K7106K8516r7156j57122P2255L5666M6580
12896B2250l1370j4733N0281O7674j23076j73115P8905N6318q265J83l4938Q275
12884a01611P2871K6166o6323p7101n3058J0493J74670p7P3084K8219P3378n1715
12872A08996K3090P8995K2049J9357j65500k497j8338J9487q1835K068K0385m6691
12860b0434l6592O2600r6332n3128l4851R2195K7429O5996K454P0496M1912k1584
$$ plain form
12848 100161 40373 61507 -21593 -30819 -40030 1592 -32298 -84039 -37950 -80452 -61915 -51767
12836 -51767 -97053 -61265 -163117 -286742 -317085 -303773 -155525 31287 -5353 -43706 -33524
12825 -33524 -96299 -54659 -63461 -93008 -58573 -124343 -67417 17325 -14248 -82052 -135703 -119967
12813 -119967 -148098 -10523 109778 11762 -121931 -138067 -54686 125804 116054 32725 78715
12802 78715 47932 -72779 -146230 -149217 -103059 -18434 -536 -68214 -207094 -304768 -154675
12791 -154675 -31487 474 -54667 -165569 -124730 -61197 -110600 -147012 -144631 -113201 -164817
12780 -164817 -92821 -63180 -130125 -146913 -106686 -96572 -155979 -34511 -4232 -11095 -39517
12769 -39517 -44984 -118523 -184279 -130524 -41397 -54995 -85328 -112479 -156361 -75357 23927 116952
$$ packed form
12848A00161n9788K1134q3100r226r211M1622l3890n1741M6089m2502J8537J0148
12836e1767m5286L5788j01852j23625l0343J3312J48248J86812l6640l8353J0182
12825c3524o2775M1640q802k9547L4435o5770N6926Q4742l1573o7804n3651J5736
12813a19967k8131J37575J20301r8016j33693j6136Q3381J80490r750q3329M5990
12802G8715l0783j20711p3451k987M6158Q4625J7898o7678j38880r7674J50093
12791a54675J23188L1961n5141j10902M0839O3533m9403l6412K381L1430n1616
12780a64817P1996K9641o6945j6788M0227J0114n9407J21468L0279o863k8422
12769c9517n467p3539o5756N3755Q9127j3598l0333k7151m3882Q1004R9284R3025
$$ plain form
12757 116952 57215 15983 -2715 -18697 -57241 -126318 -141062 -97024 -123077 44940 51075
12746 51075 29736 -8763 -58226 -47450 -127659 -188109 -124308 -114838 -192691 -177949 -95252 -85569
12734 -85569 -12633 62381 36878 -6253 12359 44976 57212 11134 -155898 -152823 -112728 -159179
12722 -159179 -87675 -122130 -117722 -83760 -70160 -98727 1133 36351 -54723 -54341 112491 120114
12710 120114 -12522 -42546 -63308 37069 60785 -612 -99457 -229361 -210119 -100787 -13456
12699 -13456 53328 16697 22470 -27007 -6793 -75051 -113514 -81738 -94475 -92588 -34314 19458
12687 19458 18000 -126340 -142196 -48779 -15806 -82603 -93995 -36866 -129131 -141175 -71979 -71314
12675 -71314 23641 39226 -12161 24151 -53185 -68540 -17466 33443 -12379 11618 107613 115672
$$ packed form
12757A16952n9737m1232j8698j5982l8544o9077j4744M4038k6053J68017O135
12746E1075k1339l8499m9463J0776q0209o0450O3801R470p7853J4742Q2697R683
12734h5569P2936P5014k5503m3131J8612L2617J2236m6078j67032L075M0095m6451
12722a59179P1504l4455M408L3962J3600k8567R9860L5218r1074L82J66832P623
12710A20114j32636l0024k0762J00377K3716o1397r8845j29904J9242J09332Q7331
12699a3456O6784l6631N773m9477K0214o8258l8463L1776j2737J887N8274N3772
12687A9458j458j44340j5856R3417L2973o6797j1392N7129r2265j2044O9196O65
12675g1314R4955J5585n1387L6312p7336j5355N1074N0909m5822K3997R5995Q059
$$ plain form
12663 115672 149313 101509 147696 57797 -120355 -204399 -212893 -179275 -150570 -122440 -52583
12652 -52583 -30523 22797 19147 27548 -17220 -88608 -110467 -126673 -98852 -70159 -53909 -73687
12640 -73687 -173924 -258059 -202714 -109300 -16545 60415 18719 4203 -27660 -113459 -87616
12629 -87616 -73031 -99327 -15728 12687 2944 96379 165121 84982 113867 89973 26120 58034
12617 58034 169106 114930 93803 111253 779 -82254 -59162 33558 124951 113017 84990
12606 84990 41084 47835 -2045 -10525 -51590 -42175 96448 82050 109475 111164 69509 92179
12594 92179 84626 22518 66444 119168 201545 273979 206299 170116 147026 63151 69516 68071
12582 68071 37725 38416 24072 25486 -77984 -45602 16892 56813 18982 28449 17907 -2118
$$ packed form
12663A15672L3641m7804M6187q9899j78152q4044q494L3618K8705K8130O9857
12652e2583K2060N3320l650Q401m4768p1388k1859j6206K7821K8693J6250j9778
12640g3687j00237q4135N5345R3414R2755P6960m1696j4516l1863q5799K5843
12629h7616J4585k6296Q3599K8415r743R3435O8742q0139K8885k3894o3853L1914
12617E8034J11072n4176k1127J7450j10474q3033K3092R2720R1393j1934k8027
12606H4990m3906O751m9880q480m1065R415J38623j4398K7425J689m1655K2670
12594I2179p553o2108M3926N2724Q2377P2434o7680l6183k3090q3875O365j445
12582F8071l0346O91j4344J414j03470L2382O2494L9921l7831R467j0542k0025
$$ plain form
12570 -2118 -10280 -4424 11836 -26172 -97056 -55133 14500 46551 37928 9385 -25160 53317
12558 53317 134030 93348 36488 47018 91870 74509 60246 69863 62588 76229 1730 -97792
12546 -97792 -69211 56582 122985 115179 129091 129691 20749 18986 -8278 66942 81015 -68947
12534 -68947 -47025 66868 81511 62147 -15929 -45543 1070 131374 215493 154650 59163
12523 59163 -15560 -39589 16856 93794 26239 -82194 -102111 -91476 -24478 54371 88376
12512 88376 31891 -9421 21283 67403 39656 -56614 -83462 -121850 -99741 -109154 -13856 -5168
12500 -5168 -48489 -68444 10320 65457 26269 -29005 41956 25743 81154 122285 98869 90703
12488 90703 100699 45084 119578 106161 129211 164968 32941 -10295 66792 81504 42060 120839
$$ packed form
12570b118q162N856J6260l8008p0884M1923O9633L2051q623k8543l4545P8477
12558E3317Q0713m0682n6860J0530M4852j7361j4263R617p275J3641p4499r9522
12546i7792K8581J25793O6403p806J3912O00j08942j763k7264P5220J4073j49962
12534f8947K1922J13893J4643j9364p8076k9614M6613J30304Q4119o0843r5487
12523E9163p4723k4029N6445P6938o7555j08433j9917J0635O6998P8849L4005
12512H8376n6485m1312L0704M6120k7747r6270k6848l8388K2109r413R5298Q688
12500e168m3321j9955P8764N5137l9188n5274P0961j6213N5411M1131k3416q166
12488I0703R996n5615P4494j3417K3050L5757j32027m3236P7087J4712l9444P8779
$$ plain form
12476 120839 144020 -29101 79092 257548 265583 223973 251421 170146 79080 146641 176933
12465 176933 168080 80130 42088 51485 109714 137852 172169 195126 179981 76689 117968 240562
12453 240562 266957 101599 100346 161622 163359 111875 105174 162939 99709 53534 84231 79668
12441 79668 80170 128885 158640 146352 67586 7131 48241 72148 45104 -63824 -27653 200459
12429 200459 236071 178686 151089 83235 142205 142100 192667 279292 201266 104887 53272 -87672
12417 -87672 -34220 96419 83182 83217 154532 187645 220775 298978 270387 246741 189403 197811
12405 197811 83193 66257 98007 104636 56781 93355 109272 129777 282452 313107 237184
12394 237184 234775 198120 235448 272166 200735 159264 186052 224755 298963 282008 283694 297074
$$ packed form
12476A20839K3181j73121J08193J78456Q035m1610K7448q1275r1066O7561L0292
12465A76933q853q7950l8042R397N8229K8138L4317K2957j5145j03292M1279J22594
12453B40562K6395j65358j253O1276J737n1484o701N7765o3230m6175L0697m563
12441G9668N02M8715K9755j2288p8766o0455M1110K3907k7044j08928L6171K28112
12429B00459L5612n7385k7597o7854N8970j05N0567Q6625p8026r6379n1615j40944
12417h7672N3452J30639j3237L5P1315L3113L3130P8203k8591k3646n7338Q408
12405A97811j14618j6936L1750O629m7855L6574J5917K0505J52675L0655p5923
12394B37184k409l6655L7328L6718p1431m1471K6788L8703P4208j6955J686J3380
$$ plain form
12382 297074 333091 360775 347498 286739 215673 141522 122025 177552 263193 288736 250929
12371 250929 175928 212848 278693 255702 289079 258754 214899 169433 184593 164904 153479
12360 153479 191182 261548 281133 283077 221162 289564 378313 338857 311414 265948 255432 231720
12348 231720 252831 219108 223276 242224 270316 283474 213854 70631 127970 284039 265012
12337 265012 286552 254297 259369 269346 308455 324567 341738 229172 128971 276471 294958
12326 294958 263385 221560 269864 273033 282869 296258 283082 310669 279464 245817 230266 151301
12314 151301 222090 153994 209722 257319 254818 191390 147811 177085 223237 284457 249879 205805
12302 205805 190292 233899 245967 258784 286078 243483 259737 235605 322525 237248 133165
$$ packed form
12382B97074L6017K7684j3277o0759p1066p4151j9497N5527Q5641K5543l7807
12371B50929p5001L6920O5845k2991L3377l0325m3855m5466J5160j9689j1425
12360A53479L7703P0366J9585J944o1915O8402Q8749l9456k7443m5466j0516k3712
12348B31720K1111l3723M168J8948K8092J3158o9620j43223N7339J56069j9027
12337B65012K1540l2255N072R977L9109J6112J7171j12566j00201J47500J8487
12326B94958l1573m1825M8304L169R836J3389j3176K7587l1205l3647j5551p8965
12314A51301P0789o8096N5728M7597k501o3428m3579K9274M6152O1220l4578m4074
12302B05805j5513M3607J2068J2817K7294m2595J6254k4132Q6920q5277j04083
$$ plain form
12291 133165 176553 192370 114181 74024 57612 100367 79207 151365 146902 106013 166942 186728
12279 186728 125036 112365 221708 203897 159144 135490 149468 171805 139340 180864 194327
12268 194327 151657 33555 46549 87313 135731 162926 190063 89785 -13173 -723 185741
12257 185741 259251 201950 147955 148984 144913 95047 36605 72021 209997 271060 227248 253987
12245 253987 244711 190780 95848 105206 162993 150442 144526 67329 3957 83022 128419 137743
12233 137743 143065 77221 57836 105171 36502 3817 13736 46404 159726 139526 270166
12222 270166 311896 216868 138971 127877 139787 111762 96017 133257 196661 269230 187618
12211 187618 90387 75342 67071 80070 39877 45703 60607 142282 165994 109114 84245 -14496
$$ packed form
12291A33165M3388J5817p8189m0157j6412M2755k1160P2158m463m0889O0929J9786
12279A86728o1692j2671J09343j7811m4753k3654J3978K2337l2465M1524J3463
12268A94327m2670j18102J2994M0764M8418K7195K7137j00278j02958J2450J86464
12257A85741P3510n7301n3995J029m071m9866n8442L5416J37976O1063m3812K6739
12245B53987r276n3931r4932R358N7787j2551n916p7197o3372P9065M5397R324
12233A37743N322o5844j9385M7335o8669l2685R919L2668J13322k0200J30640
12222B70166M1730r5028p7897j1094J1910k8025j5745L7240O3404P2569q1612
12211A87618r7231j5045q271J2999m0193N826J4904Q1675K3712n6880k4869r8741
$$ plain form
12199 -14496 -46936 -70902 -66465 -59864 -76584 -53356 32023 122788 140873 105537 29176 27087
12187 27087 154835 208955 189303 113600 88931 85148 119301 110360 107178 70159 120774 151855
12175 151855 135140 109682 125757 130609 107987 149330 213361 210009 233965 222827 257096 301933
12163 301933 319218 272094 224844 125547 63254 152957 231605 336031 388047 311823 219312
12152 219312 199206 176500 201193 239424 173619 133652 158079 225971 318734 399906 508863
12141 508863 504876 419122 271615 138346 -4033 -71124 -14688 54420 112249 164630 131640
12130 131640 65924 -3146 -60436 -10059 92860 96580 72577 68072 26575 -30799 -25476 144999
12118 144999 289844 133091 -17049 9520 487 36303 -79515 -63546 -64519 -8925 138501
$$ packed form
12199a4496l2440k3966M437O601j6720K3228Q5379R0765J8085l5336p6361k089
12187B7087J27748N4120j9652p5703k4669l783L4153q941l182l7019N0615L1081
12175A51855j6715k5458J6075M852k2622M1343O4031l352K3956j1138L4269M4837
12163C01933J7285m7124m7250r9297o2293Q9703P8648J04426N2016p6224r2511
12152B19312k0106k2706K4693L8231o5805l9967K4427O7892R2763Q1172J08957
12141E08863l987q5754j47507j33269j42379o7091N6436O9108N7829N2381l2990
12130A31640o5716o9070n7290N0377J02919L720k4003m505m1497n7374N323J70475
12118A44999J44845j56753j50140K6569r033L5816j15818J5969r73N5594J47426
$$ plain form
12107 138501 176140 161899 122781 11560 -64711 -53019 30865 11120 70787 115690 109512
12096 109512 180703 98283 76382 69978 50943 -6175 -33701 -22874 37379 30616 13627 26434
12084 26434 -18604 3236 13893 32462 -46083 -50525 -10756 97775 177052 178754 239266 194680
12072 194680 193466 125649 120406 110320 -7761 -27613 -20596 96033 115680 61460 -39711
12061 -39711 -48198 112295 217623 186420 239505 244970 243532 280282 295789 328635 285986 253195
12049 253195 305058 324982 246349 126451 204114 201439 271257 344038 340376 241963 190377 202675
12037 202675 270704 342670 360823 343285 399456 406643 389456 285498 298185 348203 408049
12026 408049 338105 330327 396125 401862 282697 192519 240479 293506 372851 355538 314557 344375
$$ packed form
12107A38501L7639j4241l9118j11221p6271J1692Q3884j9745N9667M4903o178
12096A09512P1191q2420k1901o404j9035n7118k7526J0827O0253o763j6989J2807
12084B6434m5038K1840J0657J8569p8545m442L9769J08531P9277J702O0512m4586
12072A94680j214o7817n243j0086j18081j9852P017J16629J9647n4220j01171
12061c9711q487J60493J05328l1203N3085N465j438L6750J5507L2846m2649l2791
12049B53195N1863J9924p8633j19898P7663k675O9818P2781l662r8413n1586J2298
12037B02675O8029P1966J8153j7538N6171P187j7187j03958J2687N0018N9846
12026D08049o9944p778O5798N737j19165r0178M7960N3027P9345j7313m0981K9818
$$ plain form
12014 344375 278286 192202 203802 354702 293573 335724 386731 365222 315288 335246 405603
12003 405603 444168 473711 476080 547089 528820 426485 510851 595986 612037 570620 659140
11992 659140 745526 748003 679025 683937 782631 751810 673748 692906 705177 750656 837882 913313
11980 913313 1013031 1041721 938273 954622 896719 855358 969327 1023784 1119927 1211867 1277522
11969 1277522 1400883 1479046 1498935 1474111 1363330 1478953 1673123 1851026 1914069 1913777 1881352
11958 1881352 1882559 1993045 2334745 2529839 2751048 3134284 3312652 3306906 3528280 3752878
11948 3752878 3988582 4371625 4818027 5246654 5749105 6280328 6986626 7841316 8860753
11939 8860753 10042169 11289813 12825674 14630573 16675910 19167026 22505397 26892081
$$ packed form
12014C44375o6089q6084J1600J50900o1129M2151N1007k1509m9934J9958P0357
12003D05603L8565K9543K369P1009j8269j02335Q4366Q5135J6051m1417Q8520
11992F59140Q6386K477o8978M912R8694l0821p8062J9158J2271M5479Q7226P5431
11980I13313R9718K8690j03448J6349n7903m1361J13969N4457R6143R1940O5655
11969A277522J23361P8163J9889k4824j10781J15623J94170J77903O3043k92l2425
11958A881352J207J10486L41700J95094K21209L83236J78368n746K21374K24598
11948C752878K35704L83043M46402M28627N02451N31223P06298Q54690J019437
11939H860753J181416J247644J535861J804899K045337K491116L338371M386684
$$ plain form
11931 26892081 32407912 39677779 49367780 62040516 78238050 97834206 119082959
11924 119082959 137602236 148401966 149152432 140548691 125374821 107012413 88478750
11917 88478750 72076833 58629475 48014824 39762767 33396750 28305595 24298242 21023914
11909 21023914 18408527 16233137 14501870 12958478 11779205 10813817 9820728 9026018
11901 9026018 8314943 7599150 7009055 6505670 6091482 5669683 5254462 4935568 4586542
11892 4586542 4335899 4146487 3920857 3663104 3506070 3483851 3316836 3023029 2790619 2753184
11882 2753184 2591958 2492735 2505353 2404754 2433132 2405330 2258401 2125565 2000721 1950551
11872 1950551 1913562 1854753 1805169 1662393 1479510 1377005 1432029 1401008 1304021 1160750
$$ packed form
11931B6892081N515831P269867R690001J2672736J6197534J9596156K1248753
11924A19082959J8519277J0799730P50466q603741j5173870j8362408j8533663
11917H8478750j6401917j3447358j0614651q252057o366017n091155m007353l274328
11909B1023914k615387k175390j731267j543392j179273r65388r93089p94710
11901I026018p11075p15793n90095n03385m14188m21799m15221l18894l49026
11892D586542k50643j89412k25630k57753j57034k2219j67015k93807k32410l7435
11882B753184j61226r9223J2618j00599K8378k7802j46929j32836j24844n0170
11872A950551l6989n8809m9584j42776j82883j02505N5024l1021r6987j43271
$$ plain form
11862 1160750 1062043 1008717 916056 959111 925615 800250 815991 838395 824352 840408 837774
11851 837774 795476 833227 866365 729832 657933 748425 688453 620540 553433 558203 581759
11840 581759 701862 658339 617634 605135 740335 712120 578864 564767 560615 590607 520188
11829 520188 537822 599606 586743 533509 549413 471290 267435 202554 359657 329020 184743
11818 184743 276265 379830 312839 376772 281885 221309 191399 252870 352781 444288 467431
11807 467431 516034 425683 346670 280337 229920 231069 226754 97265 -54556 -127140 -26111
11796 -26111 85180 146258 171750 108045 136058 264453 266188 251447 268699 270462 224687 263285
11784 263285 177864 157509 195665 192442 237802 251524 175037 109995 102060 120727 165110 199850
$$ packed form
11862A160750r8707n3326r2661M3055l3496j25365J5741K2404j4043J6056k634
11851H37774m2298L7751L3138j36533p1899R0492n9972o7913o7107M770K3556
11840E81759J20103m3523m0705j2499J35200k8215j33256j4097m152K9992p0419
11829E20188J7634O1784j2863n3234J5904p8123k03855o4881J57103l0637j44277
11818A84743R1522J03565o6991O3933r4887o0576k9910O1471R9911R1507K3143
11807D67431M8603r0351p9013o6333n0417J149m315j29489j51821p2584J01029
11796b6111J11291O1078K5492o3705K8013J28395J735j4741J7252J763m5775L8598
11784B63285q5421k0355L8156l223M5360J3722p6487o5042p935J8667M4383L4740
$$ plain form
11772 199850 163282 211298 215793 220850 285805 243507 267454 256533 295263 282632 224043 195039
11760 195039 110223 138257 214668 305116 315409 322957 222010 171841 289418 370087 334249
11749 334249 216773 287588 373153 389373 366553 378594 461593 400729 393345 347208 275366
11738 275366 289681 293140 260194 288951 306962 292642 322772 272137 249657 131935 93796
11727 93796 13564 -41983 -43239 1608 79406 59258 30555 -5313 34834 178908 163979 169716
11715 169716 294326 305897 261622 387602 349399 200000 149184 129456 162103 246579 233005
11704 233005 181934 93358 -8110 -33527 86153 251153 259175 216596 186123 126541 81754
11693 81754 113261 55070 45390 61053 115314 189487 139946 -9665 20828 115945 204957 200954
$$ packed form
11772A99850l6568M8016M495N057O4955m2298K3947j0921L8730j2631n8589k9004
11760A95039q4816K8034P6411R0448J0293P548j00947n0169J17577Q0669l5838
11749C34249j17476P0815Q5565J6220k2820J2041Q2999o0864p384m6137p1842
11738B75366J4315L459l2946K8757J8011j4320L0130n0635k2480j17722l8139
11727I3796q0232n5547j256M4847P7798k0148k8703l5868M0147J44074j4929N737
11715A69716J24610J1571m4275J25980l8203j49399n0816j9728L2647Q4476j3574
11704B33005n1071q8576j01468k5417J19680J65000Q022m2579l0473n9582m4787
11693H1754L1507n8191r680J5663N4261P4173m9541j49611L0493R5117Q9012m003
$$ plain form
11681 200954 197088 141942 129221 140104 61059 103605 139666 169307 298356 301804 215476 163446
11669 163446 44703 -93824 6566 28959 135725 267933 342262 291333 184377 60912
11659 60912 29401 23130 -45206 -54350 -99467 -11784 88620 173257 110639 30356 51936 117336
11647 117336 124729 134927 44274 38741 -13904 -32054 11121 24217 33127 33576 78854 -61592
11635 -61592 -145897 54842 114500 68848 33755 -90432 -93640 -93924 -98544 -23221 12130 169640
11623 169640 164111 232882 212833 121832 37863 -10390 -79226 -111945 2980 42584 15535
11612 15535 -71727 -26374 16991 -30858 -41807 3173 12348 -79130 -88877 -30620 -14214 -34766
11600 -34766 -120430 -162473 -187514 -195979 -133049 -162905 -126533 -3434 63292 -53433 -16192
$$ packed form
11681B00954l866n5146j2721J0883p9045M2546L6061K9641J29049L448q6328n2030
11669A63446j18743j38527J00390K2393J06766J32208P4329n0929j06956j23465
11659F0912l1511o271o8336r144m5117Q7683J00404Q4637o2618q0283K1580O5400
11647A17336P393J0198r0653n533n2645j8150M3175J3096Q910M49M5278j40446
11635f1592q4305K00739N9658m5652l5093j24187l208k84m620P5323L5351J57510
11623A69640n529O8771k0049r1001q3969m8253o8836l2719J14925L9604k7049
11612A5535q7262M5353M3365m7849j0949M4980R175r1478r747N8257J6406k0552
11600c4766q5664m2043k5041q465O2930k9856L6372J23099O6726j16725L7241
$$ plain form
11589 -16192 98505 268502 192513 145695 88502 39395 16924 -23821 3000 -25600 -70390
11578 -70390 -109869 -84088 9621 -52294 -74257 -6981 126504 133072 22014 -1770 17632
11567 17632 34119 123514 125734 -45992 -99661 -69882 -30725 -107459 -231229 -224711 -87948
11556 -87948 88534 162026 152605 28166 116729 11686 18256 53242 34895 -27593 38305
11545 38305 -27302 -53490 -67311 -118746 -105064 -101300 -103295 -71734 -86496 -173005 -265224 -222357
11533 -222357 -81537 -49501 -9777 -32601 -4669 -56112 -87321 -75624 -14296 -13736 2299 25756
11521 25756 -17149 31367 12725 -9592 -10265 -2895 -74229 -42410 9256 -14662 -24712 -11643
11509 -11643 96002 157518 89816 -8971 56410 62513 84172 144147 137572 54196 -38979 -22209
$$ packed form
11589a6192J14697J69997p5989m6818n7193m9107k2471m0745K6821k8600m4790
11578g0390l9479K5781R3709o1915k1963O7276J33485O568j11058k3784J9402
11567A7632J6487Q9395K220j71726n3669K9779L9157p6734j23770O518J36763
11556h7948J76482P3492r421j24439Q8563j05043O570L4986j8347o2488O5898
11545C8305o5607k6188j3821n1435J3682L764j995L1561j4762q6509r2219M2867
11533b22357J40820L2036L9724k2824K7932n1443l1209J1697O1328N60J6035K3457
11521B5756m2905M8516j8642k2317o73P370p1334L1819N1666k3918j0050J3069
11509a1643J07645O1516o7702r8787O5381O103K1659N9975o575q3376r3175J6770
$$ plain form
11497 -22209 13884 26599 -15633 -100307 -41347 167416 142606 -17569 -146928 -166501 -32162
11486 -32162 28440 11855 -38797 -17582 -37812 -91473 -69790 -59353 -19623 143006 145962 92682
11474 92682 -7869 -15233 -19943 -14683 76270 201055 293218 211691 183680 110886 32868 5495
11462 5495 -59706 -111909 -34827 -37655 -25268 -38121 -102832 8269 42488 2149 18240 3425
11450 3425 37339 19230 111283 133698 77775 -15875 18149 47479 58097 37131 -10823 -57192
11438 -57192 -73135 21085 94175 128331 41602 90190 209977 151008 86981 133067 67097
11427 67097 73853 32042 -8252 -62682 -89691 -138318 -73269 -63316 -163011 -278589 -108303 -9894
11415 -9894 -5218 -76375 -110175 -84603 -186057 -208064 -57368 -155806 -203388 -74548 -772
$$ packed form
11497b2209L6093J2715m2232q4674N8960K08763k4810j60175j29359j9573J34339
11486c2162O0602j6585n0652K1215k0230n3661K1683J0437L9730J62629K956n3280
11474I2682j00551p364m710N260R0953J24785R2163q1527k8011p2794p8018k7373
11462E495o5201n2203P7082k828J2387j2853o4711J11101L4219m0339J6091j4815
11450C425L3914j8109R2053K2415n5923r3650L4024K9330J0618k0966m7954m6369
11438e7192j5943R4220P3090L4156q6729M8588J19787n8969o4027M6086o5970
11427F7097O756m1811m0294n4430k7009m8627O5049R953r9695j15578J70286R8409
11415i894M676p1157l3800K5572j01454k2007J50696r8438m7582J28840P3776
$$ plain form
11404 -772 -71745 -112193 25787 -12266 -13299 2781 54506 128025 134081 35573 -101869 -83947
11392 -83947 -59588 -566 13140 -34044 -53350 -51739 -86614 -63683 -114473 -91294 -63013 50177
11380 50177 50402 34842 49350 33607 45191 27398 27718 91609 75209 9805 -53684 -10025
11368 -10025 67715 154151 119826 132317 163063 178580 149700 25860 53600 27427 64206
11357 64206 84452 69405 89286 147573 11708 -69294 -164481 -191002 -151235 -211258 -165443
11346 -165443 -184106 -122339 -58783 -52553 66193 97112 22256 9938 29579 67440 36316
11335 36316 -38092 17047 79226 15952 -30317 -104092 -154758 -82447 35735 61144 -10713
11324 -10713 -38102 -73463 -20843 -35027 -104202 -64367 125042 93917 -58078 -31943 4698
$$ packed form
11404g72p0973m0448J37980l8053j033J6080N1725P3519O056r8508j37442J7922
11392h3947K4359N9022J3706m7184j9306J611l4875K2931n0790K3179K8281J13190
11380E0177K25j5560J4508j5743J1584j7793L20O3891j6400o5404o3489M3659
11368a0025P7740Q6436l4325J2491L0746J5517k8880j23840K7740k6173L6779
11357F4206K0246j5047J9881N8287j35865q1002r5187k6521L9767o0023M5815
11346a65443j8663O1767O3556O230J18746L0919p4856j2318J9641L7861l1124
11335C6316p4408N5139O2179o3274m6269p3775n0666P2311J18182K5409p1857
11324a0713k7389l5361N2620j4184o9175L9835J89409l1125j51995K6135L6641
$$ plain form
11313 4698 7044 23584 52810 21284 34999 34543 14970 -13450 -60839 -64301 -34558 -182480
11301 -182480 -273186 -217237 -178005 -68330 -34188 -45944 -4568 126905 167076 160726 71009
11290 71009 123653 69262 41657 -12496 1201 -55430 -93602 -91797 -85291 -112881 -153970 -120131
11278 -120131 -71899 -34643 61800 145127 148096 45962 -43197 -15475 61961 101064 27231
11267 27231 -2352 30042 61417 49294 -19655 -60791 -107771 -7347 118863 78013 -20614
11256 -20614 -47464 -36838 48328 134148 80927 -9567 -10719 -62908 -12706 -11406 35207 83077
11244 83077 138901 149778 99502 20798 -13835 12888 107534 127066 89741 75061 94768 93047
11232 93047 45095 49854 58176 38008 59549 35618 -21759 39593 13932 20709 100386 -54663
$$ packed form
11313D698K346J6540K9226l1526J3715m56j9573k8420m7389l462K9743j47922
11301a82480r0706N5949L9232J09675L4142j1756M1376J31473M0171o350q9717
11290G1009N2644n4391k7605n4153J3697n6631l8172J805O506k7590m1089L3839
11278a20131M8232L7256R6443Q3327K969j02134q9159K7722P7436L9103p3833
11267B7231k9583L2394L1375j2123o8949m1136m6980J00424J26210m0850r8627
11256b0614k6850J0626Q5166Q5820n3221r0494j152n2189N0202J300M6613M7870
11244H3077N5824J0877n0276p8704l4633K6723R4646J9532l7325j4680J9707j721
11232I3047m7952M759Q322k0168K1541k3931n7377O1352k5661O777P9677j55049
$$ plain form
11220 -54663 -153857 -108726 14813 123668 180350 169582 212449 194554 -6615 -76919 -100001
11209 -100001 -42377 18207 53741 91961 133115 178847 207850 85258 -45015 -28545 -33331
11198 -33331 -18353 18518 51089 35958 -1438 -1869 47899 102564 6319 11348 74230 136392
11186 136392 178721 216483 53453 4557 12730 -51575 -103271 -76416 45565 121009 67054
11175 67054 43662 11212 -28681 -31639 44710 -94961 -131980 -86559 -108928 -61021 -30488 4796
11163 4796 -69850 -79298 -40614 -65859 -92951 -32211 -19263 -85711 -32375 -6827 -20 -14522
11151 -14522 -32113 43283 73712 27089 51647 188316 150472 81214 -8025 7907 65384
11140 65384 125061 101650 44757 13888 -54407 -119193 -15944 -15187 -87727 -93159 -69923 -75276
$$ packed form
11220e4663r9194M5131J23539J08855N6682j0768M2867j7895k01169p0304k3082
11209a00001N7624O0584L5534L8220M1154M5732K9003j22592j30273J6470m786
11198c3331J4978L6871L2571j5131l7396m31M9768N4665r6245N029O2882O2162
11186A36392M2329L7762j63030m8896Q173o4305n1696K6855J21981P5444n3955
11175F7054k3392l2450l9893k958P6349j39671l7019M5421k2369M7907L0533L5284
11163D796p4646r448L8684k5245k7092O0740J2948o6448N3336K5548O807j4502
11151a4522j7591P5396L0429m6623K4558J36669l7844o9258q9239J5932N7477
11140F5384N9677k3411n6893l0869o8295o4786J03249P57p2540n432K3236n353
$$ plain form
11128 -75276 -160283 -143282 -96535 -60793 -9564 33913 31017 -66218 -25374 -6171 37218 57482
11116 57482 88805 84633 -18551 -25459 79138 211695 215821 122302 88648 73336 122023 18917
11104 18917 -33406 -69250 -11528 -23739 3526 52063 70677 136079 130769 4390 31851 81629
11092 81629 72216 70394 104345 97450 66227 68115 -64371 1733 4916 153441 82594 1458
11080 1458 -44562 -15810 -49853 11900 12084 -58614 -37503 35307 20657 23428 50283 13360
11068 13360 -19451 62754 59756 70921 166205 309639 247506 150561 79266 116082 39870 -102896
11056 -102896 -195405 -132165 -77296 -119984 -11327 -8515 -87787 -4031 26073 25688 64781 115547
11044 115547 116111 88375 21251 85723 83456 121675 152963 183581 196550 168313 213537 275717
$$ packed form
11128g5276q5007J7001M6747L5742N1229M3477k896r7235M0844J9203M3389K0264
11116E7482L1323m172j03184o908J04597J32557M126r3519l3654j5312M8687j03106
11104A8917n2323l5844N7722j2211K7265M8537J8614O5402n310j26379K7461M9778
11092H1629r413j822L3951o895l1223J888j32486O6104L183J48525p0847q1136
11080A458m6020K8752l4043O1753J84p0698K1111P2810j4650K771K6855l6923
11068A3360l2811Q2205k998J1165R5284J43434o2133r6945p1295L6816p6212j42766
11056a02896r2509O3240N4869m2688J08657K812p9272Q3756L0104l85L9093N0766
11044A15547N64k7736o7124O4472k267L8219L1288L0618J2969k8237M5224O2180
$$ plain form
11032 275717 284806 206530 175396 208047 374769 421661 580303 643338 678346 708236 609389
11021 609389 528548 576111 512848 459553 542334 595820 699869 780914 860806 957379 1027662
11010 1027662 981445 819031 702374 791542 798354 826744 958298 943300 930738 960714 996893
10999 996893 901437 662100 500599 452992 470993 415334 381805 394773 369660 373061 435840
10988 435840 351658 308056 207078 120612 7513 -18975 23005 -7048 -14961 -30043 -202213
10977 -202213 -232608 -126099 -26266 -31698 77305 96709 64776 59853 2742 122777 151370
10966 151370 202920 114853 104220 62451 31313 -27931 -15841 39935 -18071 -77849 14221
10955 14221 90762 -1509 -56743 7843 52735 101276 150729 45774 13935 102361 60305
$$ packed form
11032B75717R089p8276l1134L2651J66722M6892J58642O3035L5008K9890r8847
11021F09389q0841M7563o3263n3295Q2781N3486J04049Q1045P9892R6573P0283
11010A027662m6217j62414j16657Q9168O812K8390J31554j4998j2562K9976L6179
10999I96893r5456k39337j61501m7607J8001n5659l3529J2968k5113L401O2779
10988D35840q4182m3602j00978q6466j13099k6488M1980l0053p913j5082j72170
10977b02213l0395J06509R9833n432J09003J9404l1933m923n7111J20035K8593
10966A51370N1550q8067j0633m1769l1138n9244J2090N5776n8006n9778R2070
10955A4221P6541r2271n5234O4586M4892M8541M9453j04955l1839Q8426m2056
$$ plain form
10944 60305 -137872 -171737 -181678 -79114 12361 131771 184754 242455 201434 82654 59839
10933 59839 97877 152637 94598 90306 146445 63215 1134 -34903 8129 -29212 -33974 -82805
10921 -82805 -90682 -57066 4493 133018 262741 426558 461351 358641 262347 240861 188420
10910 188420 204188 94839 -27870 -14943 -26807 -35584 39647 147658 72498 54198 110718
10899 110718 89052 -27443 -109380 -80934 -64526 9099 39542 42334 15116 28228 137822
10888 137822 90234 22945 658 105689 168399 186220 147218 127654 18389 75044 217228
10877 217228 297158 254408 193728 77093 53585 58709 -134593 -213871 -169570 -31006 -6826
10866 -6826 15602 83127 112401 84126 179004 132235 -12141 18698 -849 -102542 -90197
$$ packed form
10944F0305j98177l3865r941J02564R1475J19410N2983N7701m1021j18780k2815
10933E9839L8038N4760n8039m292N6139q3230o2081l6037M3032l7341m762m8831
10921h2805p877L3616O1559J28525J29723J63817L4793j02710r6294k1486n2441
10910A88420J5768j09349j22709J2927j1864q777P5231J08011p5160j8300N6520
10899A10718k1666j16495q1937K8446J6408P3625L0443K792k7218J3112J09594
10888A37822m7588o7289k2287J05031O2710J7821l9002j9564j09265N6655J42184
10877B17228P9930m2750o0680j16635k3508N124j93302p9278M4301J38564K4180
10866f826K2428O7525K9274k8275R4878m6769j44376L0839j9547j01693J2345
$$ plain form
10855 -90197 25413 114466 62670 78967 187275 270188 243226 269128 295623 195581 237900
10844 237900 223634 123706 -50712 -10457 82054 152379 146315 166310 156906 108188 154960 179011
10832 179011 212266 225354 168165 110372 58282 -32548 -10710 10259 67678 65348 39772 94132
10820 94132 181619 242139 231298 302937 217332 200879 200503 232635 287039 409136 465915 341607
10808 341607 167560 110656 204949 178944 132896 104276 49270 39635 117173 125082 149942 89962
10796 89962 41903 10197 -2122 106935 242464 244658 208044 202903 195341 181844 220877 184545
10784 184545 154080 52130 80572 121648 64848 36023 67733 37745 59235 73575 59480
10773 59480 108710 101138 76813 77169 71905 83405 45931 50484 56301 67971 1910 18218 15554
$$ packed form
10855i0197J15610Q9053n1796J6297J08308Q2913k6962K5902K6495j00042M2319
10844B37900j4266r9928j74418M0255R2511P0325o064J9995r404m8718M6772K4051
10832A79011L3255J3088n7189n7793n2090r0830K1838K0969N7419k330k5576N4360
10820I4132Q7487O0520j0841P1639q5605j6453l76L2132N4404J22097N6779j24308
10808C41607j74047n6904R4293k6005m6048k8620n5006r635P7538P909K4860n9980
10796H9962m8059l1706j2319J09057J35529K194l6614n141p562j3497L9033l6332
10784A84545l0465j01950K8442M1076n6800k8825L1710k9988K1490J4340j4095
10773E9480M9230p572k4325L56n264J1500l7474M553N817J1670o6061J6308k664
$$ plain form
10760 15554 -30123 -43054 -62029 -75870 -144623 -129111 -48106 12614 90042 207652 180577
10749 180577 45660 41532 -84727 -160175 -115866 -60834 26104 56117 118722 164057 237148
10738 237148 163266 90279 11634 -46240 -26100 -1832 82912 151727 158525 68813 -31065 18083
10726 18083 71033 47117 89096 140085 203504 231044 222489 258701 240106 273940 361658 328601
10714 328601 272968 262320 333093 267244 239730 341767 523758 590448 565201 548819 546042
10703 546042 549923 712199 891660 1008658 995893 1062224 1203174 1288744 1358759 1470184 1637255
10692 1637255 1656931 1555094 1506672 1578084 1520392 1453864 1426817 1272666 1025729 942834 997850
10681 997850 923093 762295 724246 666091 654179 605987 507158 518117 457895 274029 277954
$$ packed form
10760A5554m5677j2931j8975j3841o8753J5512Q1005O0720P7428J17610k7075
10749A80577j34917m128j26259p5448M4309N5032Q6938L0013O2605M5335P3091
10738B37148p3882p2987p8645n7874K0140K4268Q4744O8815O798q9712r9878M9148
10726A8083N2950k3916M1979N0989O3419K7540q555L6212j8595L3834Q7718l3057
10714C28601n5633j0648P0773o5849k7514J02037J81991O6690k5247j6382k777
10703E46042L881J62276J79461J16998j2765O6331J40950Q5570P0015J11425J67071
10692A637255J9676j01837m8422P1412n7692o6528k7047j54151k46937q2895N5016
10681I97850p4757j60798l8049n8155j1912m8192r8829J0959o0222j83866L925
$$ plain form
10670 277954 238115 242777 315481 313745 321378 344577 443872 439467 509010 557719 622396 589913
10658 589913 487913 496548 542146 514721 414589 359692 505918 585970 722552 829012 715051
10647 715051 846581 1002926 1005953 1186029 1308122 1408362 1578802 1713001 1800351 1746989
10637 1746989 1710402 1536048 1379049 1293012 1310424 1427465 1524930 1621967 1672916 1848302
10627 1848302 2091256 2326121 2848215 3372014 3670923 3924426 4345591 4641771 4970282
10618 4970282 5396438 6108411 7011585 8235469 9831002 12052872 15144835 19180614 24567774
10609 24567774 31382936 39299265 46889223 52571390 55653189 56108904 55018792 53793023
10601 53793023 53486099 55372695 60295681 68995365 81860758 97564664 112067825 120953672
$$ packed form
10670B77954l9839M662P2704j736P633K3199R9295m405O9543M8709O4677l2483
10658E89913j02000Q635M5598k7425j00132n4897J46226Q0052J36582J06460j13961
10647G15051J31530J56345L027J80076J22093J00240J70440J34199Q7350n3362
10637A746989l6587j74354j56999q6037J7412J17041R7465R7037N0949J75386
10627A848302K42954K34865N22094N23799K98909K53503M21165K96180L28511
10618D970282M26156P11973R03174J223884J595533K221870L091963M035779N387160
10609B4567774O815162P916329P589958N682167L081799M55715j090112j225769
10601E3793023l06924J886596M922986Q699684J2865393J5703906J4503161Q885847
$$ plain form
10593 120953672 122868860 119016272 111773871 103924683 98391437 97299788 101744360 112217480
10585 112217480 128665884 148290249 164832623 172145225 168825229 157477512 141665015
10578 141665015 125100753 111449528 102907687 100087831 102913460 110382796 119832307 126726735
10570 126726735 127144838 120645213 109140939 95207610 81614944 70556318 63034351
10563 63034351 59062146 57946720 58961514 60801460 61289843 59114982 54343812 47744972
10555 47744972 40371755 33109437 26726763 21672013 17938774 15106133 12850193 11196282
10547 11196282 9882811 8784868 7899997 7193373 6664272 6193287 5661110 5241329 4877794
10538 4877794 4465436 4123177 3792617 3589088 3454617 3326744 3153123 2947245 2697489
$$ packed form
10593A20953672J915188l852588p242401p849188n533246j091649M444572J0473120
10585A12217480J6448404J9624365J6542374P312602l319996j1347717j5812497
10578A41665015j6564262j3651225q541841k819856K825629P469336R449511O894428
10570A26726735M18103o499625j1504274j3933329j3592666j1058626p521967
10563F3034351l972205j115426J014794J839946M88383k174861m771170o598840
10555D7744972p373217p262318o382674n054750l733239k832641k255940j653911
10547A1196282j313471j097943q84871p06624n29101m70985n32177m19781l63535
10538D877794m12358l42259l30560k03529j34471j27873j73621k05878k49756
$$ plain form
10529 2697489 2604706 2558399 2458591 2339210 2125533 2009526 1935133 1807590 1583699 1521386
10519 1521386 1493240 1454708 1335458 1203284 1174670 1136170 1094531 1131934 1119621 1042128 1048291
10508 1048291 1010876 882825 834534 930548 932959 941498 1014048 978558 1034702 986878 780478
10497 780478 733891 826292 780684 688294 630722 623721 627482 740653 827700 808613 722532 706621
10485 706621 671841 601908 534698 579178 620782 674827 643171 654949 729214 927607 986880
10474 986880 1129100 1317914 1447032 1566325 1686348 1750330 1846256 1846249 1754928 1779071 1740013
10463 1740013 1570462 1326488 1178213 1076266 988262 829724 701012 559408 506629 502929
10453 502929 548902 670356 755618 801337 698630 652834 639859 592935 595268 552281 515523
$$ packed form
10529B697489r2783m6307r9808j19381k13677j16007p4393j27543k23891o2313
10519A521386k8146l8532j19250j32174k8614l8500m1639L7403j2313p7493O163
10508A048291l7415j28051m8291R6014K411Q539P2550l5490N6144m7824k06400
10497G80478m6587R2401m5608r2390n7572p001L761J13171Q7047j9087q6081j5911
10485G06621l4780o9933o7210M4480M1604N4045l1656J1778P4265J98393N9273
10474I86880J42220J88814J29118J19293J20023O3982R5926pr1321K4143l9058
10463A740013j69551k43974j48275j01947q8004j58538j28712j41604n2779l700
10453E02929M5973J21454Q5262M5719j02707m5796j2975m6924K333m2987l6758
$$ plain form
10442 515523 527293 564171 617216 649060 590498 539937 661412 778930 808220 825833 755009
10431 755009 674949 592812 720608 705710 728316 798575 871607 894508 877843 952221 1093039
10420 1093039 1156538 1185492 1289300 1378791 1429962 1521919 1676047 1733043 1626353 1509546
10410 1509546 1475377 1399538 1273985 1265802 1289715 1289468 1214602 1135483 1134105 1140455 1173282 1245517
10398 1245517 1150613 1072951 1121258 1147298 1068074 1060850 1013200 1043350 1118976 1136623 1154648
10387 1154648 1078718 895046 775362 852754 1035256 1127254 1198706 1207175 1150389 1104122 1113762
10376 1113762 1133613 1159645 1079509 1150668 1275603 1300240 1280254 1254045 1273648 1351383 1471439
10365 1471439 1569165 1599116 1577358 1480048 1417809 1533563 1686151 1673691 1706522 1856779 1808799
$$ packed form
10442E15523J1770L6878N3045L1844n8562n0561J21475J17518K9290J7613p0824
10431G55009q0060q2137J27796j4898K2606P0259P3032K2901j6665P4378J40818
10420A093039O3499K8954J03808Q9491N1171R1957J54128N6996j06690j16807
10410A509546l4169p5839j25553q183K3913k47p4866p9119j378O350L2827P2235
10398A245517r4904p7662M8307K6040p9224p224m7650L0150P5626J7647J8025
10387A154648p5930j83672j19684P7392J82502R1998P1452Q469n6786m6267R640
10376A113762J9851K6032q0136P1159J24935K4637j9986k6209J9603P7735J20056
10365A471439R7726K9951k1758r7310o2239J15754J52588j2460L2831J50257m7980
$$ plain form
10354 1808799 1880363 1945474 2017684 2125493 2025300 2001117 2131773 2231599 2277268 2315541 2384039
10343 2384039 2481385 2514644 2647889 2809707 3002737 3135995 3137999 3182458 3348881 3560311
10333 3560311 3742390 3977225 4304621 4649285 4770553 4932976 5226020 5530416 5882236
10324 5882236 6353022 6765146 7156795 7643012 8152491 8834499 9533465 10304123 11228018
10315 11228018 12230971 13360339 14703893 16267632 18056297 19967689 22112812 24611265
10307 24611265 27652437 31332419 35665012 41066929 47803250 56246175 66755954 79783064
10299 79783064 95782858 114846323 137117585 162208577 189125645 215993086 240056478
10292 240056478 259111058 272337591 279381667 279425183 271566197 256319419 235139876 210284681
$$ packed form
10354A808799P1564O5111P2210J07809j00193k4183J30656R9826M5669L8273O8498
10343B384039R7346L3259J33245J61818J93030J33258K004M4459J66423K11430
10333C560311J82079K34835L27396L44664J21268J62423K93044L04396L51820
10324E882236M70786M12124L91649M86217N09479O82008O98966P70658R23895
10315A1228018J002953J129368J343554J563739J788665J911392K145123K498453
10307B4611265L041172L679982M332593N401917O736321Q442925J0509779J3027110
10299G9783064J5999794J9063465K2271262K5090992K6917068K6867441K4063392
10292B40056478J9054580J3226533P044076M3516p858986j5246778k1179543k4855195
$$ plain form
10284 210284681 183822026 157957501 134135346 113422543 95861385 81199191 69153596
10277 69153596 59393768 51506433 45098469 39810919 35496519 31869175 28785517 26152152
10269 26152152 23936034 21941473 20224283 18582998 17094543 15782867 14565998 13500083
10261 13500083 12581919 11688464 10952110 10307541 9591594 8899687 8379913 7860058 7429636
10252 7429636 7196515 6965528 6684634 6403698 6115223 5920662 5824801 5675714 5549333 5408956
10242 5408956 5319840 5192962 5023420 4733023 4404249 4073556 3732696 3511191 3378181 3176585
10232 3176585 2954169 2863513 2792323 2773188 2681565 2539606 2519396 2466633 2353870 2349054 2313630
10221 2313630 2209232 2070215 1962376 1909907 1834675 1799798 1777018 1809233 1888242 1833096 1789281
$$ packed form
10284B10284681k6462655k5864525k3822155k0712803j7561158j4662194j2045595
10277F9153596r759828p887335o407964n287550m314400l627344l083658k633365
10269B6152152k216118j994561j717190j641285j488455j311676j216869j065915
10261A3500083r18164q93455p36354o44569p15947o91907n19774n19855m30422
10252G429636k33121k30987k80894k80936k88475j94561r5861j49087j26381j40377
10242E408956q9116j26878j69542k90397l28774l30693l40860k21505j33010k01596
10232C176585k22416r0656p1190j9135r1623j41959k0210n2763j12763m816l5424
10221B313630j04398j39017j07839n2469p5232l4877k2780L2215P9009n5146m3815
$$ plain form
10210 1789281 1755409 1713549 1677880 1608002 1640951 1607921 1643805 1693247 1602306 1635724 1804767
10199 1804767 1868242 1883356 1921968 1883305 1882591 1903936 1915190 1831179 1796611 1769366 1639136
10188 1639136 1507250 1545427 1650232 1687997 1692881 1602728 1468440 1340174 1347961 1361522 1381319
10177 1381319 1446610 1509412 1551105 1534818 1635899 1693937 1758101 1848341 1903490 1947994 1971963
10166 1971963 1938518 1783432 1798754 1762195 1736978 1795057 1871133 1983519 2141294 2195737 2188511
10155 2188511 2200151 2217757 2228585 2273288 2292888 2268686 2305051 2418432 2525060 2482039 2521578
10144 2521578 2591252 2487226 2365444 2345820 2357230 2349105 2352837 2266510 2290139 2377263 2351732
10133 2351732 2475873 2618499 2688763 2633228 2670157 2694459 2733742 2786325 2879873 2831053 2943852
$$ packed form
10210A789281l3872m1860l5669o9878L2949l3030L5884M9442r0941L3418J69043
10199A804767O3475J5114L8612l8663p14K1345J1254q4011l4568k7245j30230
10188A639136j31886L8177J04805L7765M884r0153j34288j28266P787J3561J9797
10177A381319O5291O2802M1693j6287J01081N8038O4164R0240N5149M4504K3969
10166A971963l3445j55086J5322l6559k5217N8079P6076J12386J57775N4443p226
10155B188511J1640J7606J0828M4703J9600k4202L6365J13381J06628m3021L9539
10144B521578O9674j04026j21782j9624J1410q125L732q6327K3629Q7124k5531
10133B351732J24141J42626P0264n5535L6929K4302L9283N2583R3548m8820J12799
$$ plain form
10122 2943852 3035741 3000586 2950810 2931663 2924829 3000799 3088793 3230668 3243833 3306171 3523295
10111 3523295 3764216 4020410 4185053 4330101 4559482 4837540 5220944 5573898 5988239
10102 5988239 6500654 6990828 7547340 8262254 8961494 9851934 10920532 12128874 13358524
10093 13358524 14747614 16316036 18211860 20435496 22928514 25768900 29112474 33206895
10085 33206895 38126122 44299391 52581147 63283679 77322462 95592934 118730967
10078 118730967 147246823 181420586 220422596 259186533 287534946 304858753 316259146
10071 316259146 322272447 316487744 297372172 270451890 238317091 203320089 169162052
10064 169162052 139114204 114171690 93921850 77918968 65478682 55774247 48247893
$$ packed form
10122B943852R1889l5155m9776j9147o834P5970Q7994J41875J3165O2338K17124
10111C523295K40921K56194J64643J45048K29381K78058L83404L52954M14341
10102E988239N12415M90174N56512P14914O99240Q90440J068598J208342J229650
10093A3358524J389090J568422J895824K223636K493018K840386L343574M094421
10085C3206895M919227O173269Q281756J0702532J4038783J8270472K3138033
10078A18730967K8515856L4173763L9002010L8763937K8348413J7323807J1400393
10071C16259146O013301n784703j9115572k6920282l2134799l4997002l4158037
10064A69162052l0047848k4942514k0249840j6002882j2440286r704435p526354
$$ plain form
10057 48247893 42228589 37429441 33547178 30191939 27149285 24634918 22483626 20581543
10049 20581543 18790310 17114520 15667917 14427281 13412010 12332878 11366812 10609811
10041 10609811 9923955 9156838 8505291 7901021 7491749 7176538 6817761 6462759 6178384
10032 6178384 5882985 5628381 5261845 5041377 4870756 4584984 4484031 4340955 4165631
10023 4165631 4019305 3928443 3833235 3792147 3813055 3726098 3774757 3827853 3745694 3499620 3295425
10012 3295425 3025107 2829778 2601589 2407570 2237072 1995611 1889808 1909521 1931010 1891438
10002 1891438 1754574 1598759 1540291 1584917 1551802 1491461 1461541 1392285 1310003 1332515 1326637
9991 1326637 1369889 1270655 1287430 1267537 1204756 1148394 1110755 1169490 1289329 1325019 1231181
$$ packed form
10057D8247893o019304m799148l882263l355239l042654k514367k151292j902083
10049B0581543j791233j675790j446603j240636j015271j079132r66066p57001
10041A0609811o85856p67117o51547o04270m09272l15211l58777l55002k84375
10032F178384k95399k54604l66536k20468j70621k85772j00953j43076j75324
10023D165631j46326r0862r5208m1088K0908q6957M8659N3096q2159k46074k04195
10012C295425k70318j95329k28189j94019j70498k41461j05803J9713K1489l9572
10002A891438j36864j55815n8468M4626l3115o0341k9920o9256q2282K2512n878
9991A326637M3252r9234J6775j9893o2781n6362l7639N8735J19839L5690r3838
$$ plain form
9980 1231181 1236846 1221153 1088742 939418 953936 968370 972897 950016 1010297 988564 1015488
9969 1015488 1073485 1060725 946611 950756 750966 707838 740213 727351 716293 667917 648712
9958 648712 563011 546600 543221 530263 575346 525196 471248 366620 288834 320013 327431 381814
9946 381814 358422 314880 402450 413478 421963 488020 499987 361394 313438 363428 369884 335323
9934 335323 434162 554402 520825 539945 601473 697766 739801 752527 758376 759494 830248 959595
9922 959595 1104477 1195294 1122426 1017370 912490 874509 814964 724268 635657 628640 802841
9911 802841 823316 903434 931300 963445 864199 820764 781625 718129 687467 634927 594754 539611
9899 539611 676889 889950 916542 872036 852320 931265 1059150 1265537 1500645 1537710 1519739
$$ packed form
9980A231181N665j5693j32411j49324J4518J4434M527k2881O0281k1733K6924
9969A015488N7997j2760j14114M145j99790m3128L2375j2862j1058m8376j9205
9958F48712q5701j6411l379j2958M5083n0150n3948j04628p7786L1179P418N4383
9946C81814k3392m3542Q7570J1028Q485O6057J1967j38593m7956M9990O456l4561
9934C35323R8839J20240l3577J9120O1528R6293M2035J2726N849J118P0754J29347
9922I59595J44882R0817p2868j05056j04880l7981n9545r0696q8611p017J74201
9911H02841K0475Q0118K7866L2145r9246m3435l9139o3496l0662n2540m0173n5143
9899E39611J37278K13061K6592m4506j9716P8945J27885K06387K35108L7065j7971
$$ plain form
9888 1519739 1587697 1708023 1794997 1854252 1811291 1737610 1646947 1494190 1455874 1423731 1361447
9877 1361447 1270297 1122675 1030294 908489 780921 719932 635908 541399 442620 447507 369988
9866 369988 475197 495147 496230 671409 634119 513260 505001 465326 447599 492230 379120
9855 379120 443331 493953 554181 514481 534733 454814 378132 357053 345410 328634 472729
9844 472729 488300 459369 339204 227105 256306 383394 429186 410037 456736 358079 423823
9833 423823 503697 518521 488216 480886 445965 386793 369313 427424 438795 389265 386615 349352
9821 349352 240678 195615 302953 363839 305600 275617 336535 370409 408825 425439 274411
9810 274411 258573 385529 394472 314878 178837 71494 36076 94579 219074 323330 432931
$$ packed form
9888A519739O7958J20326Q6974N9255m2961p3681r0663j52757l8316l2143o2284
9877A361447r1150j47622r2381j21805j27568o0989q4024r4509r8779M887p7519
9866C69988J05209J9950J083J75179l7290j20859q259l9675j7727M4631j13110
9855C79120O4211N0622O0228l9700K0252p9919p6682k1079j1643j6776J44095
9844D72729J5571k8931j20165j12099K9201J27088M5792j9149M6699r8657O5744
9833D23823P9874J4824l0305p330l4921n9172j7480N8111J1371m9530k650l7263
9821C49352j08674m5063J07338O0886n8239k9983O0918L3874L8416J6614j51028
9810B74411j5838J26956Q943p9594j36041j07343l5418N8503J24495J04256J09601
$$ plain form
9799 432931 457666 426071 423449 367053 330651 314083 313946 315158 355926 385747 401850 370420
9787 370420 323519 229917 223014 226009 291978 275260 235030 230785 252584 260240 249900 187635
9775 187635 195579 181717 172592 128767 207701 261533 230445 260533 213010 243875 328971 368999
9763 368999 384523 302692 251235 219845 320981 361915 331087 321468 343363 301785 335231 461748
9751 461748 605166 651808 617532 596434 527716 415256 339318 415708 344023 236466 385406
9740 385406 392734 287039 239109 189741 239865 301330 222198 155930 225427 250049 193487 159225
9728 159225 205189 297192 315261 325727 329334 401818 340326 257887 222719 215111 246310 326289
9716 326289 355693 356419 376362 416510 383183 392191 406312 328943 232634 230146 228390 175695 202798
$$ packed form
9799D32931K4735l1595k622n6396l6402j6568j37J212M0768K9821J6103l1430
9787C70420m6901r3602o903K995O5969j6718m0230m245K1799P656j0340o2265
9775A87635P944j3862r125m3825P8934N3832l1088L0088m7523L0865Q5096M0028
9763C68999J5524q1831n1457l1390J01136M0934l0828r619K1895m1578L3446J26517
9751D61748J43418M6642l4276k1098o8718j12460p5938P6390p1685j07557J48940
9740C85406P328j05695m7930m9368N0124O1465p9132o6268O9497K4622n6562l4262
9728A59225M5964R2003J8069J0466L607P2484o1492q2439l5168p608L1199P9979
9716C26289K9404P26J9943M0148l3327R008J4121p7369r6309k488j756n2695K7103
$$ plain form
9703 202798 215743 134436 230517 366556 319030 237980 167404 294554 434553 554879 619735
9692 619735 657482 724147 867384 894064 877982 957128 1073657 1137375 1065043 1029482 1059347
9681 1059347 1048726 1003818 993868 1143728 1323826 1419913 1473718 1658663 1793300 2020746 1990283
9670 1990283 1873897 1871905 1766282 1679026 1595543 1424233 1299937 1129931 996617 907271
9660 907271 749363 559878 493176 557885 544879 419073 485406 443563 460435 502465 460769
9649 460769 469541 530532 608759 728893 886611 896816 838653 717794 657977 604438 513261
9638 513261 499532 444767 466900 459836 422589 430706 464291 419242 390009 320534 256597 258405
9626 258405 163929 157296 209629 247482 229046 137352 117602 102031 132678 120181 138653 163888
$$ packed form
9703B02798J2945q1307R6081J36039m7526q1050p0576J27150J39999J20326O4856
9692F19735L7747O6665J43237K6680j6082P9146J16529O3718p2332l5561K9865
9681A059347j0621m4908r950J49860J80098R6087N3805J84945J34637K27446l0463
9670A990283j16386j992j05623q7256q3483j71310j24296j70006j33314q9346
9660I07271j57908j89485o6702O4709j3006j25806O6333m1843J6872M2030m1696
9649D60769Q772O0991P8227J20134J57718J0205n8163j20859n9817n3539r1177
9638E13261j3729n4765K2133p064l7247Q117L3585m5049k9233o9475o3937J808
9626B58405r4476o633N2333L7853j8436r1694j9750j5571L0647j2497J8472K5235
$$ plain form
9614 163888 92697 -6978 -35146 39977 4494 13312 109943 152684 76272 100316 145467 -11168
9602 -11168 41416 156656 154922 78066 380 -43556 113089 224246 168647 75985 3416
9591 3416 4460 67602 68715 98008 179214 176069 61594 -9739 -68632 53080 211493 179798
9579 179798 194711 221744 143387 53037 -66891 -67020 3150 16469 -29487 -904 20233 -41854
9567 -41854 37444 202532 174644 171985 146119 153660 44442 -10233 -52261 -19266 -42954 34762
9555 34762 58418 17126 21000 39753 137828 202872 294708 284217 186993 131993 153243 50804
9543 50804 62836 98159 98626 25967 -2388 10529 -51931 -66106 36043 -34077 56550 105624
9531 105624 130556 42262 111964 172653 192651 166568 133378 129082 82453 -24047 -18001 38272
$$ packed form
9614A63888p1191r9675k8168P5123l5483Q818R6631M2741p6412K4044M5151j56635
9602a1168N2584J15240j734p6856p7686m3936J56645J11157n5599r2662p2569
9591C416J044O3142J113K9293Q1206l145j14475p1333n8893J21712J58413l1695
9579A79798J4913K7033p8357r0350j19928j29P0170J3319m5956K8583K1137o2087
9567d1854P9298J65088k7888k659k5866P541j09218n4675m2028L2995k3688P7716
9555C4762K3656m1292L874J8753R8075O5044R1836j0491r7224n5000K1250j02439
9543E0804J2032L5323M67p2659k8355J2917o2460j4175J02149p0120R0627M9074
9531A05624K4932q8294O9702O0689J9998k6083l3190m296m6629j06500O046N6273
$$ plain form
9519 38272 87224 40645 -5036 -31531 -73674 -36601 -20985 60833 101199 -55036 -99726 -54093
9507 -54093 51171 182815 194749 175083 153167 55052 80663 77475 42938 67679 -3404 -55206
9495 -55206 -16785 79213 112780 105904 65429 -36459 -102802 -17211 -8424 12367 21094 7924
9483 7924 91349 140457 45356 51783 66793 407 73688 77818 138549 177995 141833 82663
9471 82663 56731 18254 79743 12023 -120429 -82258 37940 -3239 26652 118480 86226
9460 86226 69097 209700 252404 191432 194630 97487 119033 141139 51232 10622 5412 -6350
9448 -6350 -8593 60849 33818 10477 185544 124129 11440 41327 198873 94277 4447
9437 4447 56511 -3156 82461 141331 63733 93742 114892 245618 243683 187357 150420 137017
$$ packed form
9519C8272M8952m6579m5681k6495m2143L7073J5616Q1818M0366j56235m4690M5633
9507e4093J05264J31644J1934j9666k1916r8115K5611l188l4537K4741p1083n1802
9495e5206L8421R5998L3567o876m0475j01888o6343Q5591Q787K0791Q727j3170
9483G924Q3425M9108r5101O427J5010o6386P3281M130O0731L9446l6162n9170
9471H2663k5932l8477O1489o7720j32452L8171J20198m1179K9891R1828l2254
9460H6226j7129J40603M2704o0972L198r7143K1546K2106q9907m0610n210j1762
9448f350k243O9442k7031k3341J75067o1415j12689K9887J57546j04596q9830
9437D447N2064n9667Q5617N8870p7598L0009K1150J30726j935n6326l6937j3403
$$ plain form
9425 137017 136673 33789 -66943 107583 213823 166377 69673 99923 -6385 -69029 32022
9414 32022 15138 -29006 -18859 -73663 -75921 91361 133450 202451 203698 85042 80679 150800
9402 150800 177189 170017 154232 127247 84021 91202 168285 233479 362079 388192 223624 93680
9390 93680 33311 41372 57000 96774 159307 122319 9496 -28468 39364 -21310 -112375 -55012
9378 -55012 33180 30023 27837 76509 85662 58071 -6944 -40781 -18093 16901 -49187 -84349
9366 -84349 -78121 -105893 -107711 -137349 -195292 -153252 -40489 -17534 -48196 23874 106408 12537
9354 12537 27446 78355 176094 173925 123204 137961 172109 125275 144817 205551 176236 210062
9342 210062 162486 33014 -25630 34587 66009 -993 -65095 18241 100985 42159 20481
$$ packed form
9425A37017l44j02884j00732J74526J06240m7446r6704L0250j06308o2644J01051
9414C2022j6884m4144J0147n4804k258J67282M2089O9001J247j18656m363P0121
9402A50800K6389p172j5785k6985m3226P181P7083O5194J28600K6113j64568j29944
9390I3680o0369Q061J5628L9774O2533l6988j12823l7964O7832o0674r1065N7363
9378e5012Q8192l157k186M8672R153k7591o5015l3837K2688L4994o6088l5162
9366h4349O228k7772j818k9638n7943M2040J12763K2955l0662P2070Q2534r3871
9354A2537J4909N0909R7739k169n0721J4757L4148m6834J9542O0734k9315L3826
9342B10062m7576j29472n8644O0217L1422o7002o4102Q3336Q2744n8826k1678
$$ plain form
9331 20481 118469 134847 152592 83312 -22484 -74729 -35171 -5327 -21512 -129656 -221169
9320 -221169 -92378 -62759 15374 25926 80806 49325 1956 3403 -32906 -129374 -122737 -17254
9308 -17254 -6991 -104859 -136397 -87745 7921 29784 34435 58782 113623 29950 35326 28994
9296 28994 -4918 -1588 33813 105133 85534 141903 138196 51859 24957 73338 77102 2470
9284 2470 -64623 -87910 -52789 32307 37300 30518 56917 42720 76857 4798 -32492 34595
9272 34595 42084 -21671 -20534 -64479 -91724 -20782 53553 124127 73269 -35305 -18103 -28953
9260 -28953 -61403 -80857 -48043 52302 105363 -6009 -115605 -149807 -94763 72755 125266
9249 125266 95124 105137 71220 13744 -56419 41006 74905 -24455 -37593 -10196 -5450 -40235
$$ packed form
9331B0481R7988J6378J7745o9280j05796n2245L9558K9844j6185j08144r1513
9320b21169J28791K9619P8133J0552N4880l1481m7369J447l6309r6468O637J05483
9308a7254J0263r7868l1538M8652R5666K1863M651K4347N4841q3673N376o332
9296B8994l3912L330L5401P1320j9599N6369l707q6337k6902M8381L764p4632
9284B470o7093k3287L5121Q5096M993o782K6399j4197L4137p2059l7290O7087
9272C4595P489o3755J137m3945k7245P0942P4335P0574n0858j08574J7202j0850
9260b8953l2450j9454L2814J00345N3061j11372j09596l4202N5044J67518N2511
9249A25266l0142J0013l3917n7476p0163R7425L3899r9360j3138K7397M746l4785
$$ plain form
9237 -40235 53311 47066 -1059 31910 104553 104801 104688 51766 102834 103700 89231 105382 110698
9224 110698 4760 30288 86752 4573 18009 115362 90608 55310 61705 -653 21906 -58738
9212 -58738 -3258 48659 4586 89972 97080 63498 26486 -6435 80756 106847 77021 70061
9200 70061 28491 -6203 -17881 10903 12151 43713 -55541 -74293 1734 32352 -63184 -168745
9188 -168745 -201139 -91311 12744 -15956 -35942 -38235 -62700 40706 15757 -37940 -27964
9177 -27964 35630 -35243 1148 20869 8222 -96754 -63452 7997 104612 117712 139985 187373
9165 187373 185927 52521 20533 1288 6704 -50446 -101128 -117528 -45572 -30780 34818 131758
9153 131758 140808 34076 -123159 -157207 -113295 -58779 -56379 -63912 -62016 -52387 -124632 -110727
$$ packed form
9237d0235R3546o245m8125L2969P2643K48j13n2922N1068Q66j4469J6151N316
9224A10698j05938K5528N6464q2179J3436R7353k4754l5298O395o2358K2559q0644
9212e8738N5480N1917m4073Q5386P108l3582l7012l2921Q7191K6091k9826o960
9200G0061m1570l4694j1678K8784J248L1562r9254j8752P6027L0618r5536j05561
9188a68745l2394J09828J04055k8700j9986k293k4465J03406k4949n3697R976
9177b7964O3594p0873L6391J9721j2647j04976L3302P1449R6615J3100K2273M7388
9165A87373j446j33406l1988j9245N416n7150n0682j6400P1956J4792O5598R6940
9153A31758R050j06732j57235l4048M3912N4516K400p533J896R629p2245J3905
$$ plain form
9141 -110727 16321 -76924 -113157 -86732 -15459 17644 9827 36990 70231 48331 -4763 -88414
9129 -88414 -9554 -45942 -59968 43 69692 67440 40042 -31867 -101480 -84366 -86504 -51419
9117 -51419 21791 56475 103216 46312 -17210 -33649 -65905 -62386 -23437 -10045 -74214 -113269
9105 -113269 -133295 -51095 6276 -6352 -62071 -18123 42709 31922 17721 52721 29246 25690
9093 25690 22056 58467 51423 37658 121943 219354 95452 -40578 -22786 -79897 -181223 -218384
9081 -218384 -112036 -90245 14438 38176 27103 97730 82421 -106517 -187788 -218132 -117508
9070 -117508 12190 16 -64245 -53114 -36407 -21748 -72488 -105517 -102920 36622 51354
9059 51354 -38736 18393 93009 101113 147578 108075 114854 107596 106447 -25404 -109239 -159805
$$ packed form
9141a10727J27048r3245l6233K6425P1273L3103p817K7163L3241k1900n3094q3651
9129h8414P8860l6388j4026O0011O9649k252k7398p1909o9613J7114k138L5085
9117e1419P3210L4684M6741n6904o3522j6439l2256L519L8949J3392o4169l9055
9105a13269k0026Q2200N7371j2628n5719M3948O0832j0787j4201L5000k3475l556
9093B5690l634L6411p044j3765Q4285R7411j23902j36030J7792n7111j01326l7161
9081b18384J06348K1791J04683K3738j1073P0627j5309j88938q1271l0344J00624
9070a17508J29698j2174o4261J1131J6707J4659n0740l3029K597J39542J4732
9059E1354r0090N7129P4616Q104M6465l9503O779p258j149j31851q3835n0566
$$ plain form
9047 -159805 -137391 -137312 -52862 4573 -5475 66971 147328 16969 26844 5539 -44544 -122758
9035 -122758 -106014 -43654 -55391 -67197 -47195 -122769 -165770 -18437 -116909 -177962 -92721
9024 -92721 -9033 40337 -16599 -18462 -7161 35626 10021 17931 228 39578 44367 -64084
9012 -64084 -26171 70558 147155 171897 183512 192579 111072 -12219 -109460 -112153 -91795 -87881
9000 -87881 -132825 -123592 -28456 24356 -315 -19246 12282 84535 110578 44728 35767 8925
8988 8925 44162 58519 -41921 -113386 -33593 33209 -21582 -6006 -57696 -132910 -185886 -160225
8976 -160225 -96188 -90138 -49285 -30257 -2262 17531 17460 64234 67365 23184 726 -29555 -6406
8963 -6406 93750 39359 26239 32029 -96493 -128329 -50467 74040 104451 36494 84219 97355
$$ packed form
9047a59805K2414P9Q4450N7435j0048P2446Q0357j30359R875k1305n0083p8214
9035a22758J6744O2360j1737j1806K0002p5574m3001J47333r8472o1053Q5241
9024i2721Q3688M9370n6936j863J1301M2787k5605P910j7703L9350M789j08451
9012f4084L7913R6729P6597K4742J1615R067q1507j23291r7241k693K0358L914
9000h7881m4944R233R5136N2812k4671j8931L1528P2253K6043o5850q961k6842
8988H925L5237J4357j00440p1465P9793O6802n4791J5576n1690p5214n2976K5661
8976a60225O4037O050M0853J9028K7995J9793p1M6774L131m4181k2458l0281K3149
8963f406J00156n4391j3120N790j28522l1836P7862J24507L0411o7957M7725J3136
$$ plain form
8951 97355 92331 -8691 -77718 23947 5694 -54957 -111113 -98586 -4345 49836 43181 -11280
8939 -11280 -27047 111861 53920 17655 -3626 16430 51101 -72118 -78821 8936 44622 -713
8927 -713 68819 88102 174893 73886 147442 153491 144719 141750 -13741 -32756 63455 100088
8915 100088 108588 -8544 -105643 -151143 -76368 -85631 10097 134718 43081 -99098 -147194
8904 -147194 -114266 -91643 -42985 -822 -6598 49588 23495 8229 22874 -44403 -39611 -43817
8892 -43817 -10798 -109113 -83709 32146 79019 76845 78039 85974 102002 55228 66318 50043
8880 50043 72427 66795 68119 97385 45878 13028 -2582 9156 20228 14612 110816 188665
8868 188665 266505 216277 155618 143658 191884 98164 83780 170927 242033 181951 50396
$$ packed form
8951I7355n024j01022o9027J01665j8253o0651n6156J2527R4241N4181o655n4461
8939a1280j5767J38908n7941l6265k1281K0056L4671j23219o703Q7757L5686m5335
8927g13O9532J9283Q6791j01007P3556O049q772k969j55491j9015R6211L6633
8915A00088Q500j17132r7099m5500P4775r263R5728J24621r1637j42179m8096
8904a47194L2928K2623M8658M2163n776N6186k6093j5266J4645o7277M792m206
8892d3817L3019r8315K5404J15855M6873k174J194P935J6028m6774J1090j6275
8880E0043K2384n632J324K9266n1507l2850j5610J1738J1072n616R6204P7849
8868A88665P7840n0228o0659j1960M8226r3720j4384Q7147P1106o0082j31555
$$ plain form
8857 50396 88521 161852 141688 44754 -73550 -50818 -43626 -75406 -63315 -60368 -14028 64709
8845 64709 100983 14892 -92020 14345 110412 65465 14112 78029 85701 24653 85593 -29334
8833 -29334 -174606 -73015 85467 89276 10910 8814 33664 54219 126270 67555 -700 -63627
8821 -63627 -76308 -97614 -2074 53428 110229 169058 198607 191662 178067 51923 33550 25406
8809 25406 80626 77817 78457 24879 -31179 62869 36902 -5988 73665 102400 115816 53720
8797 53720 20706 22004 21211 -23 37806 8313 60001 83806 100714 95409 60397 -53896
8785 -53896 -63615 -138739 -174266 -217985 -175734 -123476 -48545 2333 59824 22793 2974 -54446
8773 -54446 -92201 -1722 96808 140934 183062 248184 184617 82288 61298 43850 100638 100299
$$ packed form
8857E0396L8125P3331k0164r6934j18304K2732P192l1780J2091K947M6340P8737
8845F4709L6274q6091j06912J06365R6067m4947n1353O3917P672o1048O0940j14927
8833b9334j45272J01591J58482L809p8366k096K4850K0555P2051n8715o8255o2927
8821f3627j2681k1306R5540N5502N6801N8829K9549o945j3595j26144j8373q144
8809B5406N5220k809O40n3578n6058R4048k5967m2890P9653K8735J3416o2096
8797E3720l3014J298p93k1234L7829k9493N1688K3805J6908n305l5012j14293
8785e3896r719p5124l5527m3719M2251N2258P4931N0878N7491l7031j9819n7420
8773e4446l7755R0479R8530M4126M2128O5122o3567j02329k0990j7448N6788l39
$$ plain form
8761 100299 126172 184395 197514 130620 71253 -149017 -130804 -20053 11561 1690 127026
8750 127026 116422 90810 145680 95120 -29036 -143227 -137708 -34428 16249 94357 52162
8739 52162 29189 103002 64363 179692 172867 30377 -32950 44046 164331 151298 136415
8728 136415 94649 38035 -4804 33466 94490 114060 131396 219410 285144 295863 310580 421808
8716 421808 461803 524481 471350 404501 338686 298782 315125 212309 213621 270853 316140 304656
8704 304656 293970 251398 162241 152527 124618 50286 -43231 -102094 -55389 -50557 -56902 -112881
8692 -112881 -119867 -21775 -37163 -100367 -107721 -96699 -31365 -2072 75572 91854 65944 76425
8680 76425 22620 45820 44020 62216 79031 -34184 -24647 -23479 104431 62124 83609 60906
$$ packed form
8761A00299K5873N8223J3119o6894n9367k20270J8213J10751L1614r871J25336
8750A27026j0604k5612N4870n0560j24156j14191N519J03280N0677P8108m2195
8739E2162k2973P3813l8639J15329o825j42490o3327P6996J20285j3033j4883
8728A36415m1766n6614m2839L8270O1024J9570J7336Q8014O5734J0719J4717J11228
8716D21808L9995O2678n3131o6849o5815l9904J6343j02816J312N7232M5287j1484
8704C04656j0686m2572q9157r714k7909p4332r3517n8863M6705M832o345n5979
8692a12881o986R8092j5388o3204p354J1022O5334K9293P7644J6282k5910J0481
8680G6425n3805K3200j800J8196J6815j13215R537J168J27910m2307K1485k2703
$$ plain form
8668 60906 57734 179308 208724 168924 116101 91713 163714 146077 207244 79208 51533 29513
8656 29513 26543 62227 70118 5550 -40498 -29373 25391 -66631 -54811 15708 -16261 40118
8644 40118 189038 209986 87949 16187 47847 23106 -59322 -26595 -43921 -68593 -25861
8633 -25861 9432 -21732 -6543 -49460 36672 6607 5655 -96326 -86984 -7453 40304 170911
8621 170911 123036 -64246 -113297 -27879 -52372 -24231 45889 102487 117193 90380 193213
8610 193213 116210 50658 89944 103897 56947 32018 12283 -19173 30718 103090 118462 28126
8598 28126 -37898 73568 124672 140737 178221 240290 294373 248165 257492 231402 146444 109761
8586 109761 125373 54823 -13369 19605 42008 151897 200266 281519 281444 309606 287488 248891
$$ packed form
8668F0906l172J21574K9416l9800n2823k4388P2001j7637O1167j28036k7675k2020
8656B9513k970L5684P891o4568m6048J1125N4764r2022J1820P0519l1969N6379
8644D0118J48920K0948j22037p1762L1660k4741q2428L2727j7326k4672M2732
8633b5861L5293l1164J5189m2917Q6132l0065r52j01981R342P9531M7757J30607
8621A70911m7875j87282m9051Q5418k4493K8141P0120N6598J4706k6813J02833
8610A93213p7003o5552L9286J3953m6950k4929j9735l1456M9891P2372J5372r0336
8598B8126o6024J11466N1104J6065L7484O2069N4083m6208R327k6090q4958l6683
8586A09761J5612p0550o8192L2974K2403J09889M8369Q1253p5K8162k2118l8597
$$ plain form
8574 248891 239475 279285 193757 175632 255330 307152 321000 298901 308928 288290 316174 356779
8562 356779 308230 249381 269385 143341 90068 47198 85171 68770 67696 98675 172246 306979
8550 306979 349854 291074 269496 205744 188144 134005 50150 -59859 -92990 -6578 43629
8539 43629 65218 112485 82273 42232 22208 155511 269034 294838 307433 251818 221436
8528 221436 306243 185463 167239 318161 356031 325470 291874 259478 214823 272857 184049
8517 184049 116726 150549 249080 250025 126575 78057 52826 40999 367 -94207 -52328 -49511
8505 -49511 -97107 -109585 -86398 47275 88383 75269 -13053 -49645 -12504 183783 228463
8494 228463 47659 32562 132989 61472 -64944 -91282 -89531 -51984 -34038 -54154 48275
$$ packed form
8574B48891r416L9810q5528j8125P9698N1822J3848k2099J0027k0638K7884M0605
8562C56779m8549n8849K0004j26044n3273m2870L7973j6401j074L0979P3571J34733
8550C06979M2875n8780k1578o3752j7600n4139q3855j10009l3131Q6412N0207
8539D3629K1589M7267l0212m0041k0024J33303J13523K5804J2595n5615l0382
8528B21436Q4807j20780j8224J50922L7870l0561l3596l2396m4655N8034q8808
8517A84049o7323L3823R8531R45j23450m8518k5231j1827m0632r4574M1879K817
8505d9511m7596j2478K3187J33673M1108j3114q8322l6592L7141J96287M4680
8494B28463j80804j5097J00427p1517j26416k6338J751L7547J7946k0116J02429
$$ plain form
8483 48275 90108 56006 81581 84931 94161 140724 187217 196512 269903 246906 201392 55832
8471 55832 83846 91004 49344 67345 117266 117101 94758 30513 -89371 -42164 49623 3258
8459 3258 -33237 90562 195433 235595 133506 9348 -14880 -42762 -36049 13386 114515
8448 114515 126214 91744 120826 216194 347083 303857 247513 291617 353548 363460 302210 152488
8436 152488 125370 165616 184894 106560 110259 87385 73370 66959 28305 92427 101675 60203
8424 60203 -58425 -51708 -42309 36640 80443 79346 121366 116569 109727 63880 50390 -8720 -21119
8411 -21119 -22755 103212 153498 57794 49186 -46215 -58991 -5209 -51802 -9315 122683 234918
8399 234918 226059 204736 133164 69777 58850 50506 53759 98771 161541 213891 262823 210067
$$ packed form
8483D8275M1833l4102K5575L350R230M6563M6493R295P3391k2997m5514j45560
8471E5832K8014P158m1660J8001M9921j65k2343o4245j19884M7207R1787m6365
8459C258l6495J23799J04871M0162j02089j24158k4228k7882O713M9435J01129
8448A14515J1699l4470K9082R5368J30889m3226n6344M4104O1931R912o1250j49722
8436A52488k7118M0246J9278p8334L699k2874j4015o411l8654O4122R248m1472
8424F0203j18628O717R399P8949M3803j097M2020m797o842m5847j3490n9110j2399
8411b1119j636J25967N0286r5704q608r5401j2776N3782m6593M2487J31998J12235
8399B34918q859k1323p1572o3387j0927q344L253M5012O2770N2350M8932n2756
$$ plain form
8387 210067 173823 191683 150255 123303 92941 121296 177279 178366 197083 106822 67729 75898
8375 75898 21528 60640 134680 110610 32082 98061 139611 126689 149299 82996 105078 117814
8363 117814 164754 118965 9759 -11276 -90671 -110223 -107598 -53370 -48058 75146 70815 -12158
8351 -12158 -63566 -32572 23424 10617 -23308 -36960 44043 2122 119648 150915 63126 -85793
8339 -85793 -59644 21659 63037 170060 235281 266614 149408 38911 80002 79823 14717 -17138
8327 -17138 -11685 90734 25053 -83477 -81689 -190068 -151243 -98724 11271 36425 -6284
8316 -6284 -61378 -100131 -85662 -14824 99935 -74538 -178029 -136889 -159888 -166016 -47604
8305 -47604 8165 12632 61400 20488 -36326 -48334 -124694 -16965 52003 66551 -529 -18432
$$ packed form
8387B10067l6244J7860m1428k6952l0362K8355N5983J087J8717r0261l9093Q169
8375G5898n4370L9112P4040k4070p8528O5979M1550j2922K2610o6303K2082J2736
8363A17814M6940m5789j09206k1035p9395j9552K625N4228N312J23204m331q2973
8351a2158n1408L0994N5996j2807l3925j3652Q1003m1921J17526L1267q7789j48919
8339h5793K6149Q1303M1378J07023O5221L1333j17206j10497M1091j79o5106l1855
8327a7138N453J02419o5681j08530J788j08379L8825N2519J09995K5154m2709
8316f284n5094l8753J4469P0838J14759j74473j03491M1140k2999o128J18412
8305d7604N5769M467M8768m0912n6814j2008p6360J07729O8968J4548o7080j7903
$$ plain form
8293 -18432 68530 -25221 -153451 -116751 -107688 -148380 -154324 -127304 -65932 -65610 -100793 -48841
8281 -48841 -80739 -30266 47935 27400 25964 61654 -64312 -156662 -111291 -132108 -23700 97488
8269 97488 144380 73533 45319 115677 165893 96365 116559 95237 186430 305423 185926
8258 185926 119668 111738 128012 118409 132290 49666 -8207 -108162 -32876 14850 -53306 -53214 -63502
8245 -63502 -55038 -90756 -106673 -3851 129438 28377 72468 67095 -4262 -2941 19478 116149
8233 116149 157825 145620 132372 109411 28769 37075 127167 150412 178169 142784 110501 121545
8221 121545 85445 94407 87215 136856 108166 104199 206107 170098 145570 150548 89079 39583
8209 39583 1719 1377 -36309 -66858 37230 110353 105930 81133 60907 18769 -105652 -137046
$$ packed form
8293a8432Q6962r3751j28230L6700R063m0692n944K7020O1372L22l5183N1952
8281d8841l1898N0473P8201k0535j436L5690j25966r2350M5371k0817J08408J21188
8269I7488M6892p0847k8214P0358N0216o9528K0194k1322R1193J18993j19497
8258A85926o6258p930J6274r603J3881q2624n7873r9955P5286M7726o8156R2j0288
8245f3502Q464l5718j5917J02822J33289j01061M4091n373p1357J321K2419R6671
8233A16149M1676j2205j3248k2961q0642Q306R0092K3245K7757l5385l2283J1044
8221A21545l6100Q962p192M9641k8690l967J01908l6009k4528M978o1469m9496
8209C9583l7864l42l7686l0549J04088P3123m423k4797k0226m2138j24421l1394
$$ plain form
8197 -137046 -67749 -21711 -31498 -19825 -25892 -20758 -24338 -24823 -115568 -159278 -30699 36808 59511
8184 59511 24911 48449 -6152 -39024 -116781 -163037 -142775 -75738 -40493 -17846 25346 -42734
8172 -42734 -13660 34252 7646 -26560 54973 83118 37041 -83560 -82398 -124053 -147614 -89637
8160 -89637 -65999 34100 156993 103939 22031 22339 27045 -63171 -73979 -27289 -80602 -72204
8148 -72204 -129711 -77900 -50967 -44670 -32429 25807 175896 280104 161424 22370 7499
8137 7499 100252 113155 151149 48909 30047 1612 -40344 -70094 109196 126998 7841
8126 7841 -55495 -125224 -28284 -1622 -18862 -8258 53889 57498 7606 -28884 22365 25902
8114 25902 33062 143853 50310 -36542 -28663 49566 -11658 -10943 55619 36745 -60241 -61883 -54438
$$ packed form
8197a37046O9297M6038r787J1673o067N134l580m85r0745m3710J28579O7507K2703
8184E9511l4600K3538n4601l2872p7757m6256K0262O7037L5245K2647M3192o8080
8172d2734K9074M7912k6606l4206Q1533K8145m6077j20601J162m1655k3561N7977
8160h9637K3638J00099J22893n3054q1908L08M706r0216j0808M6690n3313Q398
8148g2204n7507N1811K6933O297J2241N8236J50089J04208j18680j39054j4871
8137G499R2753J2903L7994j02240j8862k8435m1956k9750J79290J7802j19157
8126G841o3336o9729R6940K6662j7240J0604O2147L609m9892l6490N1249L537
8114B5902P160J10791r3543q6852P879P8229o1224P15O6562j8874r6986j642P445
$$ plain form
8101 -54438 -94416 -27338 34447 80112 91293 76812 18243 27353 56120 119612 122094 29950
8089 29950 -11997 -55995 51962 117113 138654 132721 115386 18176 -46286 -108281 -52169 -35671
8077 -35671 -68694 22502 28334 78649 10862 -16342 -7845 -54632 -29045 41171 103129 165573
8065 165573 69891 -70519 -71557 7785 29921 -111965 -257941 -156509 -76329 26731 -49420
8054 -49420 -53693 -55705 46501 139147 134466 141339 120843 117319 53381 -99816 -160686 -142263
8042 -142263 -4486 64459 -26251 -63986 -91813 -83911 -35271 62044 139643 157097 77888 60613
8030 60613 77084 170471 120956 -11096 -74678 -93915 -35433 24465 92464 91887 84027 39359
8018 39359 -14031 30371 112834 119216 52424 899 13392 73794 107463 142703 64360 -97627
$$ packed form
8101e4438l9978O7078O1785M5665J1181j4481n8569R110K8767O3492K482r2144
8089B9950m1947m3998J07957O5151K1541n933j7335r7210o4462o1995N6112J6498
8077c5671l3023R1196N832N0315o7787k7204Q497m6787K5587P0216O1958O2444
8065A65573r5682j40410j038P9342K2136j41886j45976J01432Q0180J03060p6151
8054d9420m273k012J02206R2646m681O873k0496l524o3938j53197o0870J8423
8042a42263J37777O8945r0710l7735k7827P902M8640R7315P7599J7454p9209j7275
8030F0613J6471R3387m9515j32052o3582j9237N8482N9898O7999n77p860m4668
8018C9359n3390M4402Q2463O382o6792n1525J2493O0402L3669L5240p8343j61987
$$ plain form
8006 -97627 -177958 -118888 -63714 -29918 4954 44794 72045 110148 74471 -5364 71740 130781
7994 130781 162072 117063 130672 123921 14360 -62567 -80772 -67082 -70915 -70660 -108760 -32409
7982 -32409 35891 75000 131996 268902 265342 164597 87224 -56162 -129472 -135612 -74145 114549
7970 114549 128237 2977 -16112 18534 -62573 668 92133 85757 39257 -25817 24261 108581
7958 108581 62442 42399 -93191 -81662 28326 -5180 -16918 -32465 7745 136244 138367
7947 138367 136495 115141 -41392 -97499 -66304 -30377 28487 34118 136986 203291 250207 141272
7935 141272 71704 128557 102258 -14087 -47002 -84414 -42186 -123718 -176375 -84018 -40629
7924 -40629 -24368 31503 53392 91399 63265 64746 151921 211148 169843 96592 128992 148599
$$ packed form
8006i7627q0331N9070N5174L3796L4872L9840K7251L8103l5677p9835P7104N9041
7994A30781L1291m5009J3609o751j09561p6927j8205J3690l833K55l8100P6351
7982c2409O8300L9109N6996J36906l560j00745p7373j43386p3310o140O1467J88694
7970A14549J3688j25260j9089L4646q1107O3241R1465o376m6500o5074N0078Q4320
7958A08581m6139k0043j35590J1529J09988l3506j1738j5547M0210J28499K123
7947A38367j872k1354j56533n6107L1195L5927N8864N631J02868O6305M6916j08935
7935A41272o9568N6853k6299j16345l2915l7412M2228q1532n2657R2357M3389
7924d0629J6261N5871K1889L8007k8134J481Q7175N9227m1305p3251L2400J9607
$$ plain form
7912 148599 95353 15396 380 63704 53419 5427 110319 106847 -16921 -108129 -67994
7901 -67994 134067 206691 229238 266372 236301 75112 9818 -102467 -191645 -124142 -22193
7890 -22193 14899 77885 59484 17582 1345 51808 183399 113357 -57566 -107860 -85702
7879 -85702 -129329 -91012 6010 2796 20181 40615 23966 -13932 19301 10182 33942 34483 -77742
7866 -77742 -131722 47613 203086 209988 85707 37967 69991 -13101 -62067 1022 6769 -52878
7854 -52878 -109063 -66614 -20841 -25391 -6392 95938 39408 13985 46251 82947 96029 59833
7842 59833 -49194 -119431 -70268 -33403 -83737 -70797 -28289 -6194 24927 -993 8210 -10408
7830 -10408 -14574 -8976 85172 152532 181390 152007 96045 84993 58191 153460 125003 28859
$$ packed form
7912A48599n3246p9957j5016O3324j0285m7992J04892l472j23768r1208M0135
7901f7994K02061P2624K2547L7134l0071j61189o5294j12285q9178O7503J01949
7890b2193L7092O2986j8401m1902j6237N0463J31591p0042j70923n0294K2158
7879h5702m3627L8317R7022l214J7385K0434j6649l7898L3233r119K3760N41j12225
7866g7742n3980J79335J55473O902j24281m7740L2024q3092m8966O3089N747n9647
7854e2878n6185M2449M5773m550J8999J02330n6530k5423L2266L6696J3082l6196
7842E9833j09027p0237M9163L6865n0334J2940M2508K2095L1121k5920R203j8618
7830a0408m166N598R4148O7360K8858k9383n5962j1052k6802R5269k8457r6144
$$ plain form
7818 28859 26246 60100 60023 135846 186014 155485 83378 110614 143188 120109 79158 34715 -66724
7805 -66724 -107631 -125237 -74140 43725 -31135 -114838 -105386 -130016 -118261 -38334 30277 134
7793 134 75627 48552 -42454 19258 -42511 -45398 -9180 23550 42462 160 -28841 -41195
7781 -41195 -140041 -46558 150697 154406 68376 56270 -30494 -62354 -49106 -9477 -17523 -4901
7769 -4901 34379 5851 -60608 -79149 -88502 -15943 26451 286 -22821 -62847 -44023 -3314
7757 -3314 14525 59373 40634 81336 126303 110218 92601 61264 14902 -12874 92127 129773
7745 129773 92789 -4216 23480 77012 15989 20004 37480 100594 129685 76768 -30464 -118984
7733 -118984 -90606 -84625 -88139 -92203 -125053 -83033 -10320 -3355 -128790 -133140 -63773 -18827
$$ packed form
7818B8859k613L3854p7P5823N0168l0529p2107K7236L2574k3079m0951m4443j01439
7805f6724m0907j7606N1097J17865p4860q3703R452k4630J1755P9927O8611l0143
7793A34P5493k7075r1006O1712o1769k887L6218L2730J8912m2302k9001j2354
7781d1195r8846R3483J97255L709q6030j2106q6764l1860J3248L9629q046J2622
7769d901L9280k8528o6459j8541r353P2559M2394k6165k3107m0026J8824M0709
7757c314J7839M4848j8739M0702M4967j6085j7617l1337m6362k7776J05001L7646
7745A29773l6984r7005K7696N3532o1023M015J7476O3114K9091n2917j07232q8520
7733a18984K8378N981l514m064l2850M2020P2713O965j25435m350O9367M4946
$$ plain form
7721 -18827 31123 -46040 -57849 -130442 -179895 -136638 -115416 -141383 -76712 -54188 -120085 -65493
7709 -65493 21031 158848 207123 141523 82828 132383 169565 178634 206461 123551 85486 17353
7697 17353 -24258 -35363 -16467 -10354 -26581 -57670 -109027 -27063 -15340 -81084 -71468 -46060
7685 -46060 -137695 -67130 -67908 -24597 13781 -51877 -88312 -89137 -88643 -104567 -20736 -20481 -47300
7672 -47300 -63970 -69480 -12961 -43102 19792 -21571 -5619 1124 16594 -21605 -35325 -55683
7660 -55683 -107202 -105736 -201480 -219830 -110970 -4768 7725 -62492 -105128 -16169 105606
7649 105606 56759 -28438 -14157 -135883 -179789 -104710 -44128 -33859 -29410 -70377 -69925 -112059
7637 -112059 -97522 -65309 -103337 -87354 -89509 -97831 -30677 76350 -18943 10289 -87744 -121470
$$ packed form
7721a8827M9950p7163j1809p2593m9453M3257K1222k5967O4671K2524o5897N4592
7709f5493Q6524J37817M8275o5600n8695M9555L7182R069K7827q2910l8065o8133
7697A7353m1611j1105J8896O113j6227l1089n1357Q1964J1723o5744R616K5408
7685d6060r1635P0565p78M3311L8378o5658l6435q25M94j5924Q3831K55k6819
7672d7300j6670n510N6519l0141O2894m1363J5952O743J5470l8199j3720k0358
7660e5683n1519J466r5744j8350J08860J06202J2493p0217m2636Q8959J21775
7649A05606m8847q5197J4281j21726m3906P5079O0582J0269M449m0967M52m2134
7637a12059J4537L2213l8028J5983k155q322O7154J07027r5293K9232r8033l3726
$$ plain form
7625 -121470 -190335 -46933 62519 -9427 26614 29291 -39361 -16849 72297 39749 -29323
7614 -29323 -66837 -212477 -146920 -23792 2872 -3972 -78553 -186255 -226048 -138599 4688
7603 4688 55085 -33763 -122348 -169981 -28062 115266 70184 -68804 -165030 -68156 -170588
7592 -170588 -176054 -100460 96399 243998 197554 140342 122758 -19492 -142148 -46994 -14022
7581 -14022 -68556 -81738 -59417 -72176 -154826 -72082 34567 29635 20127 -15016 -119656 -141423
7569 -141423 -101243 -37886 -96132 -40434 -86333 -115806 -167121 -80859 51593 49906 41763 36157
7557 36157 -28976 -56794 17010 18358 23237 -9327 -56514 -76892 -20915 64989 86576 115305
7545 115305 198549 233179 134481 81195 102081 59365 -103848 -132976 -133370 -66316 -53273 -35766
$$ packed form
7625a21470o8865J43402J09452p1946L6041K677o8652K2512Q9146l2548o9072
7614b9323l7514j45640O5557J23128K6664o844p4581j07702l9793Q7449J43287
7603D688N0397q8848q8585m7633J41919J43328m5082j38988r6226R6874j02432
7592a70588n466P5594J96859J47599m6444n7212j7584j42250j22656R5154L2972
7581a4022n4534j3182K2321j2759q2650Q2744J06649m932r508l5143j04640k1767
7569a41423M0180O3357n8246N5698m5899k9473n1315Q6262J32452j687q143n606
7557C6157o5133k7818P3804J348M879l2564m7187k0378N5977Q5904K1587K8729
7545A15305Q3244L4630r8698n3286K0886m2716j63213k9128l94O7054J3043J7507
$$ plain form
7533 -35766 -19349 -12466 -11012 25777 -80039 -103337 -82215 -75390 -5602 38116 210212 205476
7521 205476 112098 105123 17480 -125851 -184741 -273919 -169374 -58310 -28075 -75877 -30607
7510 -30607 -47408 -84556 -14631 -40623 -54253 -1903 53075 125479 25766 -165324 -176276 -168630
7498 -168630 -112329 -55099 -71101 -39116 49613 52580 -67074 -6120 52228 -28066 -68123 -35601
7486 -35601 -63823 -1129 -32847 -125258 -110111 -1020 10155 -12108 -104055 -216047 -236424
7475 -236424 -181017 -182647 -154754 -38217 -66300 -4445 34947 -7691 18208 -13941 60004 95038
7463 95038 102581 59675 22498 19605 27060 -8107 -14784 -8338 1474 -22369 2699 161544 142214
7450 142214 -5533 -36686 -66203 -98975 -110697 -91273 -128989 -70525 29944 96052 64255
$$ packed form
7533c5766J6417O883J454L6789j05816k3298K1122O825O9788M3718J72096m736
7521B05476r3378o975q7643j43331n8890q9178J04545J11064L0235m7802M5270
7510c0607j6801l7148O9925k5992j3630N2350N4978P2404r9713j91090j0952P646
7498a68630N6301N7230j6002L1985Q8729K967j19654O0954N8348q0294m0057L2522
7486c5601k8222O2694l1718r2411J5147J09091J1175k2263r1947j11992k0377
7475b36424N5407j630K7893J16537k8083O1855L9392m2638K5899l2149P3945L5034
7463I5038P543m2906l7177k893P455l5167o677O446R812k3843K5068J58845j9330
7450A42214j47747l1153k9517l2772j1722J9424l7716N8464J00469O6108l1797
$$ plain form
7439 64255 -22717 -97701 -127056 -147587 -155453 -122669 -50598 -50201 -56886 8376 -48809 -91237 -203942
7426 -203942 -273387 -211233 -123946 -146093 -85438 -617 9683 8226 40451 -13835 32771 27188
7414 27188 4427 -86617 -18942 120535 133242 117250 61831 15637 31010 8141 73231 75868
7402 75868 75830 48949 29116 22779 -739 4624 -4944 -21709 39209 23408 -50663 -39259 -24235
7389 -24235 64604 111782 -17027 -68307 13645 -17597 -162348 -159176 -75765 21260 48594 6098
7377 6098 -761 -9252 -27019 -11502 -50053 -49123 -105272 -106906 -168554 -159070 -159476 -81600 21881
7364 21881 36719 -22785 -28729 -8049 -109451 -136514 -175264 -162011 -56415 38153 37549 -78913
7352 -78913 -158962 -95642 -37087 -89223 -72637 -6587 -88735 -113947 -15416 -11115 -56027 -83021
$$ packed form
7439F4255q6972p4984k9355k0531p866L2784P2071L97o685O5262n7185m2428j12705
7426b03942o9445O2154Q7287k2147O0655Q4821J0300j457L2225n4286M6606n583
7414B7188k2761r1044O7675J39477J2707j5992n5419m6194J5373k2869O5090K637
7402G5868l8k6881j9833o337k3518N363r568j6765O0918j5801p4071J1404J5024
7389b4235Q8839M7178j28809n1280Q1952l1242j44751L172Q3411R7025K7334m2496
7377F098o859q491j7767J5517l8551R30n6149j634o1648R484m06P7876J03481
7364B1881J4838n9504n944K0680j01402k7063l8750J3253J05596R4568o04j16462
7352g8913q0049O3320N8555n2136J6586O6050q2148k5212R8531M301m4912k6994
$$ plain form
7340 -83021 -66641 -5383 -14643 -3349 -34032 -42103 -79821 -68433 -88493 -30062 72772 154540
7328 154540 39488 -113919 -95222 -16166 13760 -24147 15155 11285 10896 30885 -26012 -1740
7316 -1740 -30549 -8250 111161 138730 88100 83188 -20899 66994 120201 34808 -137703 -158199
7304 -158199 -150201 -133749 -130809 -108457 -85528 -71995 -80609 -61815 -74394 -83904 113570 44812
7292 44812 -39477 -15204 74895 36438 105437 103814 87016 120122 61231 8365 -112963 -42299
7280 -42299 -39353 -39846 -26756 -12957 28816 73532 20829 -65990 -136781 -157744 -114182 -95050
7268 -95050 -66462 13588 76365 21814 -100929 -153957 -135528 -24744 136404 118505 1335
7257 1335 -60812 -116319 -86701 -114807 -68879 -46573 -43381 17642 32659 -43900 -140348 -110012
$$ packed form
7340h3021J6380O1258r260J1294l0683q071l7718J1388k0060N8431J02834Q1768
7328A54540j15052j53407J8697P9056K9926l7907L9302l870l89J9989n6897K4272
7316a740k8809K2299J19411K7569n0630m912j04087Q7893N3207q5393j72511k0496
7304a58199P998J6452K940K2352K2929J3533q614J8794j2579r510J97474o8758
7292D4812q4289K4273R0099l8457O8999j623j6798L3106n8891n2866j21328P0664
7280d2299K946m93J3090J3799M1773M4716n2703q6819p0791k0963M3562J9132
7268i5050K8588Q0050O2777n4551j22743n3028J8429J10784J61148j7899j17170
7257A335o2147n5507K9618k8106M5928K2306L192O1023J5017p6559r6448L0336
$$ plain form
7245 -110012 -20358 121872 95411 72677 16680 47595 45250 -24920 -36886 -145708 -182668
7234 -182668 -54040 -60314 -108287 -92396 -4107 69866 85935 79419 181916 69747 -36826
7223 -36826 -120790 -216872 -236667 -108899 -45948 -13559 25437 73855 28468 115939 30013 -44518
7211 -44518 -109169 -116336 -79660 -144751 -187641 -143123 -182020 -208234 -221656 -162508 -31894 118760
7199 118760 123969 119226 136881 113276 187331 155030 37798 27186 48803 123489 66844 22370
7187 22370 10547 1281 38413 40568 8710 -104638 -130421 -153363 -108866 -82297 -117931 51862
7175 51862 143246 70623 13216 -8970 9949 37725 15333 -166772 -187042 -256586 -257121 -289342
7163 -289342 -286473 -226606 -61608 22614 -13393 -10280 22138 -12281 -32919 -38532 -31663 -61202
$$ packed form
7245a10012Q9654J42230k6461k2734n5997L0915k345p0170j1966j08822l6960
7234a82668J28628o274m7973J5891Q8289P3973J6069o516J02497j12169j06573
7223c6826q3964r6082j9795J27768O2951L2389L8996M8418m5387Q7471q5926p4531
7211d4518o4651p167L6676o5091m2890M4518l8897k6214j3422N9148J30614J50654
7199A18760N209m743J7655k3605P4055l2301j17232j0612K1617P4686n6645m4474
7187B2370j1823r266L7132K155l1858j13348k5783k2942M4497K6569l5634J69793
7175E1862R1384p2623n7407k2186J8919K7776k2392j82105k0270o9544n35l2221
7163b89342K869N9867J64998Q4222l6007L113L2418l4419k0638n613O869k9539
$$ plain form
7151 -61202 -74540 -89797 -77514 -112421 -153159 -180952 -26750 67541 43313 40311 62869 -6653
7139 -6653 -43912 -2077 30951 43684 -39887 14960 93175 124937 79781 26615 -50390 -106079
7127 -106079 -49460 48556 108390 154590 103715 -4621 -102406 -110873 -67442 -34386 -116755 -147018
7115 -147018 -129089 -98487 -1469 -93510 -203457 -216224 -151136 -51490 23594 21276 -16965 -38241
7103 -38241 95262 115391 -8413 -101149 -134262 -99123 -136885 -138564 -84845 -83267 -26166 -12642
7091 -12642 -30408 21649 93295 69510 80662 131725 27124 -67342 -24544 63480 130313 150685
7079 150685 76409 75151 -37907 -158792 -123066 -213528 -225695 -128541 -72254 -21798 13261
7068 13261 16771 -64508 -127131 -99669 -62405 -14575 -27711 -97699 -64225 2927 -24314 -89714
$$ packed form
7151f1202j3338j5257J2283l4907m0738k7793J54202R4291k4228l002K2558o9522
7139f653l7259M1835L3028J2733q3571N4847P8215L1762m5156n3166p7005n5689
7127a06079N6619R8016N9834M6200n0875j08336r7785q467M3431L3056q2369l0263
7115a47018J7929L0602R7018r2041j09947j2767O5088R9646P5084k318l8241k1276
7103c8241J33503K0129j23804r2736l3113L5139l7762j679N3719J578N7101J3524
7091a2642j7766N2057P1646k3785J1152N1063j04601r4466M2798Q8024O6833K0372
7079A50685p4276j258j13058j20885L5726r0462j2167R7154N6287N0456L5059
7068A3261L510q1279o2623K7462L7264M7830j3136o9988L3474O7152k7241o5400
$$ plain form
7056 -89714 -55635 -85857 -91231 -70966 -55686 17036 51203 -14034 21276 56223 63011 76217
7044 76217 44685 -5608 -24535 -31021 -126026 -110577 -48480 -25690 32001 -60990 -124878 -56439
7032 -56439 1870 61404 159526 123154 21119 -13921 -17159 -81925 -82433 11692 42287 30506
7020 30506 34968 22362 -4533 -67900 -155170 -107032 -69781 -46815 -13858 37188 115161 94367
7008 94367 -88637 -174970 -92300 -244 36570 6333 52942 81937 -591 -60830 -94136 52391
6996 52391 137146 58024 -40108 -137922 -170167 -222264 -181367 -169929 -194807 -175695 -42516 -102397
6984 -102397 -154844 -114164 -123825 -75301 -53582 -76505 -8348 1964 -16311 -2793 40566 26970
6972 26970 -61506 -186341 -213959 -103950 -45156 -135890 -160415 -86186 -51327 11426 62015
$$ packed form
7056h9714L4079l0222n374K0265J5280P2722L4167o5237L5310L4947O788J3206
7044G6217l1532n0293j8927o486r5005J5449O2097K2790N7691r2991o3888O8439
7032e6439N8309N9534R8122l6372j02035l5040l238o4766n08R4125L0595j1781
7020C0506M462j2606k6895o3367q7270M8138L7251K2966L2957N1046P7973k0794
7008I4367j83004q6333Q2670R2056L6814l0237M6609K8995q2528o0239l3306J46527
6996E2391Q4755p9122r8132r7814l2245n2097M0897J1438k4878J9112J33179n9881
6984a02397n2447M0680r661M8524K1719k2923O8157J0312j8275J3518M3359j3596
6972B6970q8476j24835k7618J10009N8794r0734k4525P4229L4859O2753N0589
$$ plain form
6961 62015 74481 141298 86632 -25521 -18364 -21188 -134388 -113975 -33453 22114 -11120 -54494
6949 -54494 -108757 -123939 -60412 -305 -62790 -93130 -20639 -40983 -46355 -11351 -41674 -99478
6937 -99478 -103 71151 93190 96629 74169 -9056 -23377 14296 -102863 -151364 -92756 69176
6925 69176 89951 -33003 -55227 59799 66047 183 -49552 -110604 -106282 -118855 -78400 -40527
6913 -40527 -38170 -10249 -59138 -146263 -182314 -285330 -339630 -176121 -168932 -86965 -75234 -95373
6901 -95373 -182111 -238345 -241316 -149797 -66620 -72078 -51519 -54041 -38837 -41936 -37805 9356 13191
6888 13191 68232 75017 16756 1233 71380 27827 -89637 -79460 -3244 -50389 -129421 -42484
6876 -42484 34508 88866 201284 174923 100355 24192 -1964 11021 -54007 -58265 -80391 -108077
$$ packed form
6961F2015J2466O6817n4666j12153P157k824j13200K0413Q0522N5567l3234m3374
6949e4494n4263j5182O3527O0107o2485l0340P2491k0344n372L5004l0323n7804
6937i9478R9375P1254K2039L439k2460q3225j4321L7673j17159m8501N8608J61932
6925F9176K0775j22954k2224J15026O248o5864m9735o1052M322j2573M0455L7873
6913d0527K357K7921m8889q7125l6051j03016n4300J63509P189Q1967J1731k0139
6901i5373q6738n6234k971R1519Q3177n458K0559k522J5204l099M131M7161L835
6888A3191N5041O785n8261j5523P0147m3553j17464J0177P6216m7145p9032Q6937
6876d2484P6992N4358J12418k6361p4568p6163k6156J2985o5028m258k2126k7686
$$ plain form
6864 -108077 -83846 -31512 -43623 -45571 -65340 52300 105817 143637 123693 87685 5416 -41783
6852 -41783 -98054 -139642 -192901 -137863 -136756 -215626 -234233 -292830 -186454 -163950 -102571 -57734
6840 -57734 -25837 23633 -31028 -102270 -146641 -30085 209487 279358 132689 73485 37728
6829 37728 -62467 -149705 -206219 -171246 -69970 -81289 -48190 -51784 -114462 -90942 -143720 -19823
6817 -19823 -80846 -119288 2076 -26777 -110557 -173153 -131575 -19057 -90082 -172307 -117297
6806 -117297 -134979 -98423 -77340 -128853 -9352 60954 62399 67684 70886 31878 27741 52319
6794 52319 29278 -61212 -56706 -102468 -87817 -828 14005 -13728 57865 12542 -106027 -162568
6782 -162568 -204388 -149859 -92525 -5773 9897 -58043 2724 32194 12007 -107908 -105229 -120906
$$ packed form
6864a08077K4231N2334j2111j948j9769J17640N3517L7820j9944l6008q2269m7199
6852d1783n6271m1588n3259N5038J107p8870j8607n8597J06376K2504O1379M4837
6840e7734L1897M9470n4661p1242m4371J16556K39572O9871j46669n9204l5757
6829C7728j00195q7238n6514L4973J01276j1319L3099l594o2678K3520n2778J23897
6817a9823o1023l8442J21364k8853q3780o2596M1578J12518p1025q2225N5010
6806a17297j7682L6556K1083n1513J19501P0306J445N285L202l9008m137K4578
6794E2319k3041r0490M506m5762J4651Q6989J4833k7733P1593m5323j18569n6541
6782a62568m1820N4529N7334Q6752J5670o7940O0767K9470k0187j19915K679j5677
$$ plain form
6770 -120906 -32556 -56575 -95756 -51596 -120144 -184169 -147214 -76258 -86768 -96060 -50106 -27142
6758 -27142 -78542 -110987 -58986 60997 110783 31489 59512 79909 76224 31264 26302 -20006
6746 -20006 -7819 -41889 -74394 -27757 69373 68688 27365 34767 59185 149739 120782 24899
6734 24899 -10425 -20700 17857 41388 73968 59049 97731 120800 134893 177700 99596 22718
6722 22718 40768 74933 -6622 -22726 -90790 -55739 -30889 -4050 -99063 -151531 -170217 -44239
6710 -44239 7927 -31239 -79084 -121762 -176433 -107251 17636 81969 68095 101133 73220 -46853
6698 -46853 -61291 -95619 -102939 -68528 -110833 -88575 -106343 -124395 -112249 -70523 100940 245212
6686 245212 203001 34227 1931 -8647 -63855 31834 28415 -3548 66480 44330 -86017
$$ packed form
6770a20906Q8350k4019l9181M4160o8548o4025L6955P0956j0510r292M5954K2964
6758b7142n1400l2445N2001J19983M9786p9294K8023K0397l685m4960m962m6308
6746b0006J2187l4070l2505M6637R7130o85m1323P402K4418R0554k8957r5883
6734B4899l5324j0275L8557K3531L2580j4919L8682K3069J4093M2807p8104p6878
6722B2718J8050L4165q1555j6104o8064L5051K4850K6839r5013n2468j8686J25978
6710d4239N2166l9166m7845m2678n4671O9182J24887O4333j3874L3038k7913j20073
6698d6853j4438l4328p320L4411m2305K2258j7768j8052J2146M1726J71463J44272
6686B45212m2211j68774l2296j0578n5208R5689l419l1963P0028k2150j30347
$$ plain form
6675 -86017 -109861 -86728 -39824 -16039 25038 26944 56381 52848 -21703 -81427 -66065 -81311
6663 -81311 -96545 7207 86775 -25304 -100314 -72047 -134151 -164302 -293606 -169327 -42056
6652 -42056 -8284 34844 102955 74571 -2157 75407 46806 12124 1606 3393 -142802 -176016
6640 -176016 -30958 69849 64009 83803 69138 41531 60175 -37728 -38462 74446 5903 -42678
6628 -42678 22760 -13265 -61861 -68997 -144351 -162532 -142344 -69068 -3547 -29190 43078 127958
6616 127958 195634 42789 -9740 -33675 -77533 3050 77935 82081 99720 47112 71028 63782
6604 63782 16524 -88093 -144289 -93658 -65561 19782 69773 59473 39451 15436 -34278 15572
6592 15572 27076 -145754 -300250 -359702 -300852 -156775 -166819 -125936 -113012 -117853 -156067
$$ packed form
6675h6017k3844K3133M6904K3785M1077J906K9437l533p4551n9724J5362j5246
6663h1311j5234J03752P9568j12079p5010K8267o2104l0151j29304J24279J27271
6652d2056L3772M3128O8111k8384p6728P7564k8601l4682j0518J787j46195l3214
6640a76016J45058J00807n840J9794j4665k7607J8644r7903p34J12908o8543m8581
6628d2678O5438l6025m8596p136p5354j8181K0188P3276O5521k5643P2268Q4880
6616A27958O7676j52845n2529k3935m3858Q0583P4885M146J7639n2608K3916p246
6604F3782m7258j04617n6196N0631K8097Q5343M9991j0300k0022k4015m9714M9850
6592A5572J1504j72830j54496n9452N8850J44077j0044M0883J2924m841l8214
$$ plain form
6581 -156067 -148345 -45912 -52872 -56804 -23818 -39931 -48995 -57917 14690 17657 -26259 -62164 1115
6568 1115 21608 72937 117368 101036 11940 -59054 -77221 -113338 -82970 -47921 -22252 -73088
6556 -73088 -89943 -5295 26380 19552 -18736 -102263 -130378 -174326 -156978 -91961 -73299 -88068
6544 -88068 33081 71061 69836 93453 68950 33693 -11136 -16483 -8955 15760 1252 -24310
6532 -24310 -6783 39478 -16943 -39496 -148381 -144653 -119484 -39466 4127 62263 -7986 -34100
6520 -34100 -60828 -95711 -23698 70393 63152 27384 -92086 -184145 -117492 -126282 -134995 -51817
6508 -51817 -129030 -178679 -150948 -188393 -235023 -172823 -155487 -112676 -19693 2879 7974 -1617
6496 -1617 -56516 -161391 -132438 -11644 44199 -37510 4176 117276 179862 184210 151819 115535
$$ packed form
6581a56067P722J02433o960l932L2986j6113r064q922P2607K967m3916l5905O3279
6568A115K0493N1329M4431j6332q9096p0994j8167l6117L0368L5049K5669n0836
6556g3088j6855Q4648L1675o828l8288q3527k8115m3948J7348O5017J8662j4769
6544h8068J21149L7980j225K3617k4503l5257m4829n347P528K4715j4508k5562
6532b4310J7527M6261n6421k2553j08885L728K5169Q0018M3593N8136p0249k6114
6520c4100k6728l4883P2013R4091p241l5768j19470r2059O6653q790q713Q3178
6508e1817p7213m9649K7731l7445m6630O2200J7336M2811R2983K2572N095r591
6496a617n4899j04875K8953J20794N5843q1709M1686J13100O2586M348l2391l6284
$$ plain form
6484 115535 28158 75245 23918 -63709 -85620 -67258 -23540 -25706 47641 120832 51520 -65149
6472 -65149 -66762 -50049 5608 150814 70966 33903 12586 19612 131871 91340 29783 -44237
6460 -44237 11255 48043 83335 97275 30958 -42063 -49268 -6721 28562 -37353 -7828 75043
6448 75043 63775 26125 12 9614 36830 141560 132763 54126 132842 186269 162637 173162
6436 173162 112847 21320 -9512 -3772 -57523 -101549 -45333 109187 79390 -16623 -101505 -209748
6424 -209748 -193639 -107917 -144623 -137620 -43074 -44189 -30570 46227 133829 211438 236661 260540
6412 260540 318383 278366 258455 155232 57935 75258 62010 10242 -91065 -98271 52722
6401 52722 99974 71360 28590 78581 34325 -48991 -65313 -24929 -123190 -94289 66896 225679
$$ packed form
6484A15535q7377M7087n1327q7627k1911J8362M3718k166P3347P3191o9312j16669
6472f5149j613J6713N5657J45206p9848l7063k1317P026J12259m0531o1557p4020
6460d4237N5492L6788L5292J3940o6317p3021p205M2547L5283o5915K9525Q2871
6448G5043j1268l7650k6113R602K7216J04730q797p8637P8716N3427k3632J0525
6436A73162o0315r1527l0832N740n3751m4026N6216J54520k9797r6013q4882j08243
6424b09748J6109Q5722l6706P003R4546j115J3619P6797Q7602P7609K5223K3879
6412B60540N7843m0017j9911j03223r7297J7323j3248n1768j01307p206J50993
6401E2722M7252k8614m2770M9991m4256q3316j6322M0384r8261K8901J61185J58783
$$ plain form
6389 225679 179762 50976 36580 114046 69517 -71835 -80685 -33956 74128 76386 -10785
6378 -10785 -75753 -2314 -9037 -55071 -21563 1976 36671 114379 174036 137041 91957 77804
6366 77804 106588 110935 104134 120142 88053 2744 -18577 -11755 40349 -11461 -4437 -75038 -180814
6353 -180814 -170493 -182983 45326 117745 83361 92204 96071 33041 19006 85253 72867 114510
6341 114510 137083 100389 14278 7236 79727 175834 177934 115133 106167 171585 213722 166159
6329 166159 93990 -20241 -98744 -56582 40881 63969 18406 123196 155427 74505 29396
6318 29396 63370 80363 87115 -50304 -73567 82588 61028 -6192 -11406 793 25976 -24356
6306 -24356 -120208 -56620 -19115 -104078 -87289 -70976 -150526 -133221 -21248 173 131963
$$ packed form
6389B25679m5917j28786j4396P7466m4529j41352q850M6729J08084K258q7171
6378a0785o4968P3439o723m6034L3508K3539L4695P7708N9657l6995m5084j4153
6366G7804K8784M347o801J6008l2089q5309k1321O822N2104n1810P024p0601j05776
6353a80814J0321j2490K28309P2419l4384Q843L867o3030j4035O6247j2386M1643
6341A14510K2573l6694q6111p042P2491R6107K100o2801q966O5418M2137m7563
6329A66159p2169j14231p8503M2162R7463K3088m5563J04790L2231q0922m5109
6318B9396L3974J6993O752j37419k3263J56155k1560o7220n214J2199K5183n0332
6306b4356r5852O3588L7505q4963J6789J6313p9550J7305J11973K1421J31790
$$ plain form
6295 131963 138025 98307 49097 47097 65842 95675 41252 -26568 -10033 52412 107162 45942
6283 45942 70871 158381 115110 13112 14185 11899 -67448 -75808 -89414 -34869 24766 25126 12866
6270 12866 -50855 -32303 -20127 -47434 -41655 -93916 -17677 18650 -9997 11228 21906 -18565
6258 -18565 -23671 8815 48271 41873 -42587 -57691 -144156 -145923 -74855 -125471 -188380 -240958
6246 -240958 -163942 -83723 -26375 -78846 -112213 -163068 -63861 -41789 -60362 -88450 25539
6235 25539 158761 70059 14155 -9112 -41815 -81716 -63675 27738 57813 70905 118129 81093
6223 81093 52661 -19539 -42379 -92923 -83311 -72596 2617 9134 1379 -49473 -54618 -52943 34917
6210 34917 42593 -17036 -131524 -116920 -3949 67112 93949 -2957 -44480 -87389 -52488 -42610
$$ packed form
6295A31963O062l9718m9210k000J8745K9833n4423o7820J6535O2445N4750o1220
6283D5942K4929Q7510m3271j01998J073k286p9347q360j3606N4545N9635L60j2260
6270A2866o3721J8552J2176k7307N779n2261P6239L6327k8647K1225J0678m0471
6258a8565n106L2486L9456o398q4460j5104q6465j767P1068n0616o2909n2578
6246b40958P7016Q0219N7348n2471l3367n0855R9207K2072j8573k8088J13989
6235B5539J33222q8702n5904k3267l2703l9901J8041R1413L0075J3092M7224l7036
6223H1093k8432p2200k2840n0544R612J0715P5213O517p755n0852n145J675Q7860
6210C4917P676n9629j14488J4604J12971P1061K6837r6906m1523m2909L4901R878
$$ plain form
6198 -42610 -9922 -100224 -5160 81477 132110 85110 102971 195959 165679 116524 120267 12088
6186 12088 -144269 -47172 45299 87912 45504 8467 39958 -64171 -231391 -257621 -274738
6175 -274738 -148290 -135416 -103175 -22704 86552 95186 109774 54881 46478 71829 -61 67440
6163 67440 66734 24726 6225 -102405 -70070 -18298 -70509 -2612 114036 185099 50904 -141609
6151 -141609 -216046 -76383 -102587 -140375 -134412 -247250 -236838 -153243 -28468 -31863 -57026
6140 -57026 -176841 -170741 -114125 -118429 -100940 -70507 -46506 -32951 227 43571 24251 -9358
6128 -9358 17611 -6003 -60855 -91434 -64068 16057 17764 -88240 -154373 -74186 -70942 -154574
6116 -154574 -177472 -152229 -215828 -196506 -106494 -86926 -95619 -136637 -96085 -92927 -46934 -38350
$$ packed form
6198d2610L2688r0302R5064Q6637N0633m7000J7861R2988l0280m9155L743j08179
6186A2088j56357R7097R2471M2613m2408l7037L1491j04129j67220k6230j7117
6175b74738J26448J2874L2241Q0471J09256Q634J4588n4893q403K5351p1890O7501
6163F7440p06m2008j8501j08630L2335N1772n2211O7897J16648P1063j34195j92513
6151a41609p4437J39663k6204l7788N963j12838J0412Q3595J24775l395k5163
6140e7026j19815O100N6616m304J7489L0433K4001J3555L3178M3344j9320l3609
6128i358K6969k3614n4852l0579K7366Q0125J707j06004o6133Q0187L244q3632
6116a54574k2898K5243o3599J9322R0012J9568q693m1018M0552L158M5993Q584
$$ plain form
6104 -38350 -47918 -46888 -71910 -44503 -63444 -64856 39253 160219 205463 158902 154938 174763
6092 174763 78491 19896 1981 -42619 -82995 -92474 -61163 -49087 -563 44586 -2891 30567
6080 30567 -21327 94133 111521 8122 18254 -18435 -5407 93331 181281 92420 151237
6069 151237 144032 89853 102120 15966 -35250 -46512 -73583 -111768 -188294 -236325 -203915 -46634
6057 -46634 112910 38780 66095 82754 -15616 42515 138475 227262 172623 50448 5637
6046 5637 -48454 -46969 -83579 -58881 -72970 -47913 -183812 -205227 -149967 -69450 -18820 -63393
6034 -63393 -155069 -140248 -150098 -230875 -176658 -64226 -42768 -25853 -122992 -103055 -152600 -117370
6022 -117370 -99974 -149638 -172015 -227989 -160912 -38823 4172 -59986 -182874 -126665 -27646
$$ packed form
6104c8350r568J030k5022K7407j8941j412J04109J20966M5244m6561l964J9825
6092A74763r6272n8595j7915m4600m0376r479L1311J2076M8524M5149m7477L3458
6080C0567n1894J15460J7388j03399J0132l6689J3028R8738Q7950q8861N8817
6069A51237p205n4179J2267q6154n1216j1262k7071l8185p6526m8031L2410J57281
6057d6634J59544p4130K7315J6659r8370N8131R5960Q8787n4639j22175m4811
6046E637n4091J485l6610K4698j4089K5057j35899k1415N5260Q0517N0630m4573
6034f3393r1676J4821r850q0777N4217J12432K1458J6915r7139J9937m9545L5230
6022a17370J7396m9664k2377n5974O7077J22089M2995o4158j22888N6209R9019
$$ plain form
6011 -27646 -53234 12512 39310 27586 83255 60892 -32793 -86332 -62511 -68027 -131331 -123105
5999 -123105 35796 77027 -95918 -187946 -171209 -85229 -51868 1098 -81351 -102287 -132426
5988 -132426 -165797 -168157 -167769 -182590 -169151 -147362 -82753 -18615 -40068 12354 24514 -4326
5976 -4326 -48862 -65064 -65367 -92403 -55842 -76862 -48757 -70241 -114987 -171557 -104338 -76492
5964 -76492 -41438 32724 23484 -27201 -55297 -32806 -106007 -167854 -174345 -84896 49907 161391
5952 161391 218178 62132 12341 -52232 -94881 -117441 -46583 7907 -52393 -81938 -9266
5941 -9266 91140 42888 33850 2690 -30413 36301 -22775 -86060 -66382 -41719 6577 56998
5929 56998 1716 -4215 -51056 -73160 -9251 26171 13794 -86188 -78964 -79595 -155322 -22283
$$ packed form
6011b7646k5588O5746K6798j1724N5669k2363r3685n3539K3821n516o3304Q226
5999a23105J58901M1231j72945r2028J6737Q5980L3361N2966q2449k0936l0139
5988a32426l3371k360L88j4821J3439K1789O4609O4138k1453N2422J2160k8840
5976d326m4536j6202l03k7036L6561k1020K8105k1484m4746n6570O7219K7846
5964g6492L5054P4162r240n0685k8096K2491p3201o1847o491Q9449J34803J11484
5952A61391N6787j56046m9791o4573m2649k2560P0858N4490o0300k9545P2672
5941i266J00406m8252r038l1160l3103O6714n9076o3285J9678K4663M8296N0421
5929E6998n5282n931m6841k2104O3909L5422j2377r9982P224o31p5727J33039
$$ plain form
5917 -22283 -20428 -75649 -123035 -159890 -163155 -166117 -201983 -157363 -49946 -51962 -18484 -1007
5905 -1007 60091 -35821 -50563 -23398 -58940 -11950 48739 74885 77695 79736 53071 -44199
5893 -44199 -122918 -115463 -98428 -32745 -12196 68435 96509 149294 122140 121930 127351 75180 -8028
5880 -8028 -18948 -18679 -20581 -14077 73669 16164 -79378 -178566 -169740 -82807 -67040 -100888 -124261
5867 -124261 -58437 35532 -37707 -91194 -58490 -136935 -94723 -86570 -20197 -44216 -80180 -107192
5855 -107192 -99403 -71303 -12682 -73531 -156209 -89216 71471 104136 137744 73983 1632 -102564
5843 -102564 -150516 -231762 -242568 -203129 -172964 -198247 -196256 -115016 -73998 46878 75865 -55584
5831 -55584 -111115 -109752 -11155 12527 -40146 -89051 -45103 -57470 -94350 -123540 -167977 -50585
$$ packed form
5917b2283J855n5221m7386l6855l265k962l5866M4620J07417k016L3478J7477
5905a007O1098r5912j4742K7165l5542M6990O0689K6146K810K041k6665r7270
5893d4199p8719P455J7035O5683K0549Q0631K8074N2785k7154k10N421n2171q3208
5880h028j0920K69j902O504Q7746n7505r5542r9188Q826Q6933J5767l3848k3373
5867a24261O5824R3969p3239n3487L2704p8445M2212Q153O6373k4019l5964k7012
5855a07192P789K8100N8621o0849q2678O6993J60687L2665L3608o3761p2351j04196
5843a02564m7952q1246j0806L9439L0165k5283J991Q1240M1018J20876K8987j31449
5831e5584n5531J363R8597K3682n2673m8905M3948j2367l6880k9190m4437J17392
$$ plain form
5819 -50585 17882 60841 -4933 -76818 -115530 -23395 -35096 -77574 19537 19265 -8779 7335
5807 7335 26642 55000 103245 176722 111696 23047 200 -3672 -30192 -47560 14600 25188
5795 25188 61687 82216 4223 -43803 14216 -60863 -152182 -148372 -176891 -175170 -177504 -235829
5783 -235829 -142606 -73235 -103581 -122505 -214435 -246871 -180356 -85309 9594 -74745 -173074 -177385
5771 -177385 -153139 -169299 -240080 -207828 -136186 -100491 -28161 5410 49810 48344 32590 -41223
5759 -41223 -117481 -15864 17695 -23731 20739 1514 53352 25454 -8609 121914 208249
5748 208249 164234 181504 255533 194877 76653 19407 -4020 -40494 -81024 -113181 -5414
5737 -5414 -64642 -122002 -97336 -23803 108819 85289 89592 147762 167279 238152 142309 34214
$$ packed form
5819e0585O8467M2959o5774p1885l8712R2135j1701m2478R7111k72k8044J6114
5807G335J9307K8358M8245P3477o5026q8649k2847l872k6520j7368O2160J0588
5795B5188L6499K0529p7993m8026N8019p5079r1319L810k8519J721k334n8325
5783b35829R3223O9371l0346j8924r1930l2436O6515R5047R4903q4339r8329m311
5771a77385K4246j6160p0781L2252P1642L5695P2330L3571M4400j466j5754p3813
5759d1223p6258J01617L3559m1426M4470j9225N1838k7898l4063J30523Q6335
5748B08249m4015J7270P4029o0656j18224n7246k3427l6474m0530l2157J07767
5737e414n9228n7360K4666P3533J32622k3530M303N8170J9517P0873r5843j08095
$$ plain form
5725 34214 22468 6800 -20091 -28606 45868 17260 41878 122295 63987 -18024 -33119 -28169
5713 -28169 14479 -12078 26706 54505 75114 63311 65368 22265 -56641 90040 126886 112967
5701 112967 186707 152356 81206 -36768 -131415 -95115 -76995 -172667 -53208 -6740 -71884
5690 -71884 -96525 -125769 -110697 -22847 87817 96757 -4629 -87744 -165631 -146249 -33552
5679 -33552 76176 156108 151791 130637 29846 -16600 -54780 -108039 -32601 132236 88963
5668 88963 89013 72337 107848 136616 58719 75468 83978 12395 -53807 23882 30034 23887 8172
5655 8172 -5038 19558 -70444 -24758 -6315 25118 -27873 -153902 -135898 -114778 -30148 64106
5643 64106 82691 61700 43967 -40931 -28583 22034 39650 59554 -15911 -10140 14017 106324
$$ packed form
5725C4214j1746j5668k6891q515P4474k8608K4618Q0417n8308q2011j5095M950
5713b8169M2648k6557L8784K7799K0609j1803K057m3103p8906J46681L6846j3919
5701A12967P3740l4351p1150j17974r4647L6300J8120r5672J19459M6468o5144
5690g1884k4641k9244J5072Q7850J10664Q940j01386q3115p7887J9382J12697
5679c3552J09728P9932m317k1154j00791m6446l8180n3259P5438J64837m3273
5668H8963N0j6676L5511K8768p7897J6749Q510p1583o6202P7689O152o147j5715
5655H172j3210K4596r0002M5686J8443L1433n2991j26029J8004K1120Q4630R4254
5643F4106J8585k0991j7733q4898J2348N0617J7616J9904p5465N771K4157R2307
$$ plain form
5631 106324 122757 146205 208003 220933 252253 254996 149853 52091 104859 138850 76539 -6346
5619 -6346 -98177 -114992 -119995 -208273 -157932 -125331 -132299 -76141 -86396 29024 22067 -82092
5607 -82092 -87246 40523 55660 27926 -19572 34637 133053 172179 80503 4143 40973 208108
5595 208108 237688 283168 312397 301674 290119 182506 125794 116731 35735 10648 56373 72605
5583 72605 51551 50295 80022 15112 -41824 3740 -53877 -35610 -4231 -23788 -24040 -16468 -60648
5570 -60648 -76657 -31614 32707 -1150 -47356 -31820 -50378 -12334 -25644 -94585 -87730 -25060
5558 -25060 -29269 -54634 -39543 27586 -40736 -7935 19863 -55661 -195282 -121106 -27265 -87212
5546 -87212 -24934 67413 109791 9356 -18004 -13091 57420 43436 53478 106382 86909 18360
$$ packed form
5631A06324J6433K3448O1798J2930L1320K743j05143r7762N2768L3991o2311q2885
5619f346r1831j6815n003q8278N0341L2601o968N6158j0255J15420o957j04159
5607h2092n154J27769J5137k7734m7498N4209R8416L9126r1676p6360L6830J67135
5595B08108K9580M5480K9229j0723j1555j07613n6712r063q0996k5087M5725J6232
5583G2605k1054j256K9727o4910n6936M5564n7617J8267L1379j9557k52P572m4180
5570f0648j6009M5043O4321l3857m6206J5536j8558L8044j3310o8941O855O2670
5558b5060m209k5365J5091O7129o8322L2801K7798p5524j39621P4176R3841n9947
5546h7212O2278R2347M2378j00435k7360M913P0511j3984J0042N2904j9473o8549
$$ plain form
5534 18360 8470 78033 127010 128437 60293 72845 129574 211916 124918 27153 -21168 -27175
5522 -27175 -110234 -110139 -64831 -71459 -51772 -97022 -71654 30821 75814 54541 97737 99452 57663
5509 57663 117960 156858 152882 87112 10006 -46111 -90593 -105038 -171053 -117389 -68423 -86256
5497 -86256 -176314 -139701 -41288 -20094 11297 -54455 50023 52254 3535 -34246 -59812 -3034
5485 -3034 -687 11137 23748 26738 -9078 18070 17610 -18843 -150460 -155259 -156212 -203898 -285168
5472 -285168 -321931 -309097 -204420 -108541 -123742 -202449 -179917 -136093 -88343 -17728 -2173
5461 -2173 -66637 2898 69472 -65999 -76280 -78563 -142319 -185347 -130330 -122879 -57663 -42665
5449 -42665 -24621 53479 20493 -93164 -131022 -23494 6214 -51253 -107777 -115440 -93504 12416
$$ packed form
5534A8360r890O9563M8977J427o8144J2552N6729Q2342q6998r7765m8321o007
5522b7175q3059R5M5308o628J9687m5250K5368J02475M4993k1273M3196J715m1789
5509E7663O0297L8898l976o5770p7106n6117m4482j4445o6015N3664M8966j7833
5497h6256r0058L6613R8413K1194L1391o5752J04478K231m8719l7781k5566N6778
5485c034K347J1824J2611K990l5816K7148m60l6453j31617m799r53m7686q1270
5472b85168l6763J2834J04677R5879j5201p8707K2532M3824M7750P0615J5555
5461b173o4464O9535O6574j35471j0281k283o3756m3028N5017P451O5216J4998
5449d2665J8044P8100l2986j13657l7858J07528K9708n7467n6524p663K1936J05920
$$ plain form
5437 12416 48948 121596 105332 105234 193699 290013 236020 62167 2226 -19872 -15539 14463
5425 14463 20534 51037 18145 -13283 -22615 -5900 -49802 -254551 -362570 -283112 -232574 -202623
5413 -202623 -103879 -9223 7291 32937 -36309 -50136 -54169 -8957 39887 -3621 14640 -57014
5401 -57014 -77087 -24287 -8245 -3406 4254 -2801 -40314 -36799 -36287 -68938 -63772 -86996 -84782
5388 -84782 -17314 46576 87327 -28771 -122705 -88631 -52436 -6103 -75954 -80574 -2732 906
5376 906 -70575 -133911 -120702 -8593 -61985 -2565 83580 32963 -2415 8518 -92905 -116594
5364 -116594 -120757 -129604 -140537 -250592 -140862 62477 -79719 -183243 -292828 -330176 -162015
5353 -162015 -54389 9443 -12949 18472 73474 97095 117340 64679 8101 -42030 -39627 -53265
$$ packed form
5437A2416L6532P2648j6264r8Q8465R6314n3993j73853n9941k2098M333L0002
5425A4463O071L0503l2892l1428r332J6715m3902k04749j08019P9458N0538K9951
5413b02623R8744R4656J6514K5646o9246j3827m033M5212M8844m3508J8261p1654
5401e7014k0073N2800J6042M839P660p055l7513L515N12l2651N166k3224K214
5388h4782O7468O3890M0751j16098r3934L4074L6195M6333o9851m620P7842L638
5376I06p1481o3336J3209J12109n3392N9420Q6145n0617l5378J0933j01423k3689
5364a16594m163q847j0933j10055J09730K03339j42196j03524j09585l7348J68161
5353a62015J07626O3832k2392L1421N5002K3621K0245n2661n6578n0131K403j3638
$$ plain form
5341 -53265 -12117 41923 -59843 -58741 -44429 -165075 -210188 -166277 -78216 25311 68411
5330 68411 25211 -119596 -151043 -210099 -212008 -138917 -23830 106035 8329 -45343 43338
5319 43338 94806 86034 55691 31034 -34951 -82915 -71371 -74352 -50923 -67772 22473 -10144
5307 -10144 14809 100279 33048 -71387 -132520 -147367 -107931 -98311 -31636 32090 6216 3078
5295 3078 -17040 -149162 -223018 -190098 -82848 -126393 -161588 -81064 -65132 -150214 -184897 -98175
5283 -98175 -54882 -111677 -117755 -96429 -131184 -196334 -250459 -257568 -135106 -817 89593 36090
5271 36090 -71478 -134449 -138128 -76148 -17019 95399 143027 67456 -52237 -87653 -42438
5260 -42438 47924 136884 64482 18368 -3168 -50869 -75114 -106899 -147095 -141569 -58675 -107457
$$ packed form
5341e3265M1148N4040j01766J102J4312j20646m5113M3911Q8061J03527M3100
5330F8411m3200j44807l1447n9056j909P3091J15087J29865r7706n3672Q8681
5319D3338N1468q772l0343k4657o5985m7964J1544k981K3429j6849R0245l2617
5307a0144K4953Q5470o7231j04435o1133j4847L9436R620O6675O3726k5874l138
5295C078k0118j32122p3856L2920J07250m3545l5195Q0524J5932q5082l4683Q6722
5283i8175M3293n6795o078K1326l4755o5150n4125p109J22462J34289R0410n3503
5271C6090j07568o2971l679O1980N9129J12418M7628p5571j19693l5416M5215
5260d2438R0362Q8960p2402m6114k1536m7701k4245l1785m0196N526Q2894m8782
$$ plain form
5248 -107457 -201778 -200088 -189775 -160263 -39364 88058 161637 125323 169913 200833 136953
5237 136953 148848 94468 73601 28869 -80092 -96436 -16800 19655 -57227 -156790 -100828
5226 -100828 -86636 43067 21408 -53553 24990 106493 15789 -115953 -138088 -67390 50893
5215 50893 31238 53178 151776 218943 127794 83017 40841 -8859 47317 94454 110770 94265
5203 94265 115044 56549 67670 98727 38856 7146 24694 -1508 38450 17841 98518 98015
5191 98015 122659 -57534 -53170 -33908 -58757 -82912 -90630 -79456 -11847 -76980 -65783 25040
5179 25040 -1446 48744 -13202 -73411 -27271 31109 49459 -9712 -65144 -60173 -3855 -4061
5167 -4061 35932 78942 -16054 29722 42841 -2281 -32147 -44739 -58376 -57429 -86263 -66197
$$ packed form
5248a07457r4321J690J0313K9512J20899J27422P3579l6314M4590L0920o3880
5237A36953J1895n4380k0867m4732j08961j6344P9636L6455p6882r9563N5962
5226a00828J4192J29703k1659p4961P8543Q1503r0704j31742k2135P0698J18283
5215E0893j9655K1940R8598O7167r1149m4777m2176m9700N6176M7137J6316j6505
5203I4265K0779n8495J1121L1057n9871l1710J7548k6202L9958k0609Q0677n03
5191I8015K4644j80193M364J9262k4849k4155p718J1174O7609o5133J1197R0823
5179B5040k6486N0190o1946o0209M6140N8380J8350n9171n5432M971N6318k06
5167d061L9993M3010r4996M5776J3119m5122k9866j2592j3637R47k8834K0066
$$ plain form
5155 -66197 -129183 -150417 -155137 -103555 -140337 -109451 -55877 -25919 13908 26838 -21860 -21289
5143 -21289 11168 -89182 -27052 68334 28097 -3859 -59874 -10010 20897 35168 53717 -29966
5131 -29966 26641 885 9073 8876 -12204 -92840 -77548 -66420 -61805 -69575 -40054 72958 126950
5118 126950 21194 -42142 -84701 -1996 3918 -36721 -27644 -8529 32656 -31138 -90719 -53774
5106 -53774 22675 112415 134422 114106 157694 111046 -15547 21672 128400 174561 81004
5095 81004 5247 -6467 -14229 -166823 -123781 -43729 -23739 -129365 -261581 -130226 33625
5084 33625 -3869 -36556 -46999 -22811 47674 73689 52304 -10531 -101355 -80186 -93875 -50722
5072 -50722 -150542 -113669 28146 -55460 -126858 -171169 -170948 -118322 -73669 -127384 -138950 -113291
$$ packed form
5155f6197o2986k1234m720N1582l6782L0886N3574K9958L9827J2930m8698N71
5143b1289L2457j00350O2130R5386m0237l1956n6015M9864L0907J4271J8549q3683
5131b9966N6607k5756Q188j97k1080q0636J5292J1128M615p770K9521J13012N3992
5118A26950j05756o3336m2559Q2705N914m0639R077J9115M1185o3794n9581L6945
5106e3774P6449Q9740K2007k0316M3588m6648j26593L7219J06728M6161r3557
5095H1004p5757j1714p762j52594M3042Q0052J9990j05626j32216J31355J63851
5084C3625l7494l2687j0443K4188P0485K6015k1385o2835r0824K1169j3689M3153
5072e0722r9820L6873J41815q3606p1398m4311K21N2626M4653n3715j1566K5659
$$ plain form
5060 -113291 -120292 -70380 -196731 -198785 -39248 91996 34299 -70570 -52552 40167 106393
5049 106393 145715 22844 -30754 -59649 18263 38201 -103125 -73057 77561 22072 -60766
5038 -60766 -66640 -129255 -92127 -86247 -36817 87248 203325 159082 80043 75187 119696 79002
5026 79002 49637 31093 -19938 -102504 -64505 -97367 -156706 -89981 -32207 8268 41058 69703
5014 69703 76499 -54377 -147429 -167789 -147462 -69290 -90039 -70391 -173639 -277528 -251083
5003 -251083 -98351 -58253 -179491 -171966 -100835 -7146 -25502 -16487 23941 73544 145660 139788
4991 139788 60122 4357 -140902 -110674 -96989 -17818 -17032 -30944 46509 161456 111817 -28076
4979 -28076 -131198 -99508 71618 154629 91220 117139 81736 51147 3221 -26980 42827
$$ packed form
5060a13291p001M9912j26351k054J59537J31244n7697j04869J8018R2719O6226
5049A06393L9322j22871n3598k8895P7912J9938j41326L0068J50618n5489q2838
5038f0766n874o2615L7128N880M9430J24065J16077m4243p9039m856M4509m0694
5026G9002k9365j8544n1031q2566L7999l2862n9339O6725N7774M0475L2790K8645
5014F9703O796j30876r3052k0360K0327P8172k0749J9648j03248j03889K6445
5003b51083J52732M0098j21238P525P1131R3689j8356R015M0428M9603P2116n872
4991A39788p9666n5765j45259L0228J3685P9171P86j3912P7453J14947m9639j39893
4979b8076j03122L1690J71126Q3011o3409K5919l5403l0589m7926l0201O9807
$$ plain form
4968 42827 56191 14667 38261 -45249 -87868 -104160 -71790 -83213 -194494 -220093 -131076 -191513
4956 -191513 -193429 -145939 -148268 -146840 -62721 -62100 -121878 -90630 -135746 -148548 -155461 -114899 -94872
4943 -94872 -127029 -82982 -55604 -12625 6000 73849 111547 54189 11836 114084 88255 -22834
4931 -22834 2776 -71435 -58658 -45374 -29654 -28868 -48023 -106734 -63678 13673 -21055 -112430
4919 -112430 -136228 -92098 -65864 -147885 10867 99458 -15009 -25230 -59083 -59015 -96694 -44803
4907 -44803 -68325 -57693 -31430 12695 -114401 -191345 -103764 -66976 29232 23308 -117069 -210842
4895 -210842 -220281 -178465 -195206 -75511 -3002 -496 23024 56573 46421 880 34136 110551
4883 110551 -19266 -49997 21313 -56704 -49607 -46292 -25145 -110235 267 104098 119101
$$ packed form
4968D2827J3364m1524K3594q3510m2619j6292L2370j1423j11281k5599Q9017o0437
4956a91513j916M7490k329J428Q4119O21n9778L1248m5116j2802o913M0562K0027
4943i4872l2157M4047K7378M2979J8625O7849L7698n7358m2353J02248k5829j11089
4931b2834K5610p4211J2777J3284J5720P86j9155n8711M3056P7351l4728r1375
4919a12430k3798M4130K6234q2021J58752Q8591j14467j0221l3853O8l7679N1891
4907d4803k3522J0632K6263M4125j27096p6944Q7581L6788R6208n924j40377r3773
4895b10842r439M1816j6741J19695P2509K506K3520L3549j0152m5541L3256P6415
4883A10551j29817l0731P1310p8017P097L315K1147q5090J10502J03831J5003
$$ plain form
4872 119101 82798 123626 124297 214416 135603 140060 175746 91601 71331 79426 91070 116962
4860 116962 -24749 -18277 -10391 16875 108978 22283 7764 -61432 -46125 -87740 -122410 -126080
4848 -126080 -90701 -64548 -12069 19896 -2276 59573 -24182 -62845 -73452 -113667 -90322 -116587
4836 -116587 -165039 -111058 -69500 -28064 -27454 8260 30231 26476 65567 -17487 -19447 1295
4824 1295 -63021 -56472 99812 160974 93810 -39611 -63845 -89276 -124008 -131707 -184467 -105881
4812 -105881 -42181 -59360 -46443 4790 30264 116878 183472 118882 69077 65208 64577 40977
4800 40977 74071 119774 112236 94324 128487 137881 179668 126877 -50970 -171141 -126725 -130147
4788 -130147 -126543 -104931 -20341 140964 161091 83062 -120400 -2482 38081 -59405 -181517
$$ packed form
4872A19101l6303M0828O71R0119p8813M457L5686q4145k0270Q095J1644K5892
4860A16962j41711O472P886K7266R2103q6695j4519o9196J5307m1615l4670l670
4848a26080L5379K6153N2479L1965k2172O1849q3755l8663j0607m0215K3345k6265
4836a16587m8452N3981M1558M1436O10L5714K1971l755L9091q3054j960K0742
4824A295o4316O549J56284O1162o7164j33421k4234k5431l4732p699n2760P8586
4812a05881O3700j7179J2917N1233K5474Q6614O6594o4590m9805l869o31k3600
4800D0977L3094M5703p538j7912L4163R394M1787n2791j77847j20171M4416l422
4788a30147L604K1612Q4590J61305K0127p8029k03462J17918M0563r7486j22112
$$ plain form
4777 -181517 -208252 -121944 -68408 -12270 -88604 -76625 17175 -48733 -152730 -208575 -237686
4766 -237686 -191517 -155035 -108430 -92892 -83308 -105534 -75621 -63595 -118747 -127054 -14752 12697
4754 12697 -170409 -81016 173324 220730 77720 91707 107121 131001 31412 49425 58567
4743 58567 10127 -80755 -57207 -18125 79892 23975 -76920 -143334 -64131 26847 22552 -82374
4731 -82374 19874 125007 122394 85847 44278 -57410 -131119 -179500 -165019 -215954 -189083
4720 -189083 -95932 -67799 -43396 -57087 -89808 -101914 -96153 -86274 -120689 -98342 -27483 -54157
4708 -54157 -5729 41959 -13808 13311 -20461 -47616 -80080 -138184 -203560 -160566 -119186 -120460
4696 -120460 -38804 59480 75180 45302 38292 14398 39711 -17743 69657 103178 98097 28049
$$ packed form
4777a81517k6735Q6308N3536N6138p6334J1979R3800o5908j03997n5845k9111
4766b37686M6169L6482M6605J5538R584k2226K9913J2026n5152q307J12302K7449
4754A2697j83106Q9393K54340M7406j43010J3987J5414K3880r9589J8013R142
4743E8567m8440r0882K3548L9082R8017n5917j00895o6414P9203R0978m295j04926
4731h2374J02248J05133k613l6547m1569j01688p3709m8381J4481n0935K6871
4720a89083R3151K8133K4403j3691l2721j2106N761R879l4415K2347P0859k6674
4708e4157M8428M7688n5767K7119l3772k7155l2464n8104o5376M2994M1380j274
4696a20460Q1656R8284J5700k9878p010k3894K5313n7454Q7400L3521n081p0048
$$ plain form
4684 28049 12164 -21172 -24838 -81975 33533 90242 72237 53189 114398 145797 105765 125614
4672 125614 84669 91206 -11603 -74152 -76200 -8765 105598 155253 60355 14791 -88987
4661 -88987 -93313 -160385 -149813 -157963 -31763 127168 2736 -135785 -147152 14629 162412
4650 162412 123628 -5412 -816 -26533 -68589 -14174 60903 47005 -112567 -126041 -124993 -98848
4638 -98848 -131138 -199757 -170837 -81230 -86010 58300 73248 145423 110974 85892 138872 -34729
4626 -34729 -164362 -117193 -25601 -37674 -27664 51082 60970 1098 -31778 -108379 -117514 -80471
4614 -80471 -89338 -143050 -94565 -75705 -13666 24324 -34293 -175030 -138254 9476 19328 -34602
4602 -34602 -36452 -57219 -140569 -216671 -206345 -131578 -110099 -218334 -146861 -48786 -81380 -65464
$$ packed form
4684B8049j5885l3336l666n7137J15508N6709j8005j9048O1209L1399m0032J9849
4672A25614m0945O537j02809o2549k048O7435J14363M9655r4898m5564j03778
4661h8987m326o7072J0572q150J26200J58931j24432j38521j1367J61781J47783
4650A62412l8784j29040M596k5717m2056N4415P5077j3898j59572j3474J048K6145
4638i8848l2290o8619K8920Q9607m780J44310J4948P2175l4449k5082N2980j73601
4626c4729j29633M7169R1592j2073J0010P8746R888n9872l2876p6601r135L7043
4614h0471q867n3712M8485J8860O2039L7990n8617j40737L6776J47730R852n3930
4602c4602j850k0767q3350p6102J0326P4767K1479j08235P1473R8075l2594J5916
$$ plain form
4590 -65464 -14041 28820 3744 -42776 22029 -31903 -90872 -82339 -46992 -77117 -168103 -134839
4578 -134839 -151649 -110312 28102 19927 -33163 -140281 -201058 -153459 -50846 -87089 -123211
4567 -123211 -54481 -13564 -94027 2595 35833 -99634 -182209 -143980 -140448 -19226 -29939
4556 -29939 -70593 6984 37246 90938 149115 47268 -2697 -50566 34965 59682 88244 120995
4544 120995 192147 220858 104496 90834 149642 146862 50106 -58321 -139342 -156611 4046
4533 4046 -62472 -156905 -97388 -26373 -67090 -47473 39547 8306 -7347 -24344 -53799 -98466
4521 -98466 -121055 -69062 -83963 -1928 76602 50451 -102302 -169082 -136580 -170011 -103177 42884
4509 42884 125422 57593 71862 39329 -142078 -65463 -7520 -14837 2036 -62676 -196053 -133000
$$ packed form
4590f5464N1423M2861k5076m6520O4805n3932n8969Q533L5347l0125r0986L3264
4578a34839j6810M1337J38414q175n3090j07118o0777M7599J02613l6243l6122
4567a23211O8730M0917q0463R6622L3238j35467q2575L8229L532J21222j0713
4556b9939m0654P7577L0262N3692N8177j01847m9965m7869Q5531K4717K8562L2751
4544A20995P1152K8711j16362j3662N8808k780r6756j08427q1021j7269J60657
4533D046o6518r4433N9517P1015m0717J9617Q7020l1241j5653j6997k9455m4667
4521i8466k2589N1993j4901Q2035P8530k6151j52753o6780L2502l3431O6834J46061
4509D2884Q2538o7829J4269l2533j81407P6615N7943p317J6873o4712j33377O3053
$$ plain form
4497 -133000 -73784 -63687 48891 -58076 -107742 -27761 53894 -54106 -61182 46058 78982
4486 78982 41428 41489 24713 -28973 -84395 -42475 6097 57313 143876 129601 162152 240131
4474 240131 198829 83343 -7542 -4956 45029 46673 15268 61024 115506 32932 -39519 -137855
4462 -137855 -108050 28018 55165 -47498 -95933 -202760 -233672 -227324 -289162 -211006 -193572
4451 -193572 -157806 -96599 -153618 -130111 -105736 -100631 -71595 33285 203224 198626 136206 59937
4439 59937 31279 103202 93004 97368 21068 2530 55660 63790 -40740 27045 135687 197253
$$ packed form
4497a33000N9216J0097J12578j06967m9666P9981Q1655j08000p076J07240L2924
4486G8982l7554O1j6776n3686n5422M1920M8572N1216Q6563j4275L2551P7979
4474B40131m1302j15486r0885K586M9985J644l1405M5756N4482q2574p2451r8336
4462a37855K9805J36068K7147j02663m8435j06827l0912O348o1838P8156J7434
4451a93572L5766O1207n7019K3507K4375N105K9036J04880J69939m598o2420p6269
4439E9937k8658P1923j0198M364p6300j8538N3130Q130j04530O7785J08642O1566
$$ [...]
##END NTUPLES=NMR SPECTRUM
##END=
