##TITLE=Analysis number 319623
Compound Code mo 07760
Book Reference 481/38
Project Code adrs
Chemist Name chrisr
##JCAMPDX= 6.0         $$ Bruker NMR JCAMP-DX V2.0
##DATA TYPE= NMR SPECTRUM
##DATA CLASS= NTUPLES
##ORIGIN= Bruker BioSpin GmbH
##OWNER= nmr
$$ XWIN-NMR		Version 3.5
$$ Mon May 22 12:34:19 2006 GMT Daylight Time (UT+1h)  MAYBRIDGE\nmr@NMR_250MHZ
##.OBSERVE FREQUENCY= 250.131544655141
##.OBSERVE NUCLEUS= ^1H
##.ACQUISITION MODE= SIMULTANEOUS (DQD)
##.ACQUISITION SCHEME= undefined
##.AVERAGES= 16
##.DIGITISER RES= 18
##SPECTROMETER/DATA SYSTEM= dpx250
##.PULSE SEQUENCE= zg30
##.SOLVENT NAME= CDCl3
##.SHIFT REFERENCE= (INTERNAL, CDCl3, 0, 16.522)
##AUDIT TRAIL= $$ (NUMBER, WHEN, WHO, WHERE, WHAT)
$$ ##TITLE= Audit trail, XWIN-NMR		Version 3.5
$$ ##JCAMPDX= 5.01
$$ ##ORIGIN= Bruker BioSpin GmbH
$$ ##OWNER= nmr
$$ C:\u/data/dgb/nmr/ADRS/4860/pdata/1/auditp.txt
$$ ##AUDIT TRAIL=  $$ (NUMBER, WHEN, WHO, WHERE, WHAT)
(   1,<2006-05-22 12:33:40.14 +100>,<MAYBRIDGE\nmr>,<NMR_250MHZ>,
      <created by zg, POWCHK disabled, PULCHK disabled
       configuration hash MD5:
       84 BC 41 DB A1 6E 1D 46 DA 25 12 A5 C1 ED C5 3A
       data hash MD5: 64K
       73 E3 5C 2E A7 52 83 86 77 95 56 51 EB A4 3B C7>)
(   2,<2006-05-22 12:34:04.23 +100>,<MAYBRIDGE\nmr>,<NMR_250MHZ>,
      <Start of raw data processing
       ef LB = 0.3 FT_mod = 6 PKNL = 1 SI = 32K 
       data hash MD5: 32K
       9D 45 13 69 47 54 5D 25 A0 96 56 A9 AF 85 7C 77>)
(   3,<2006-05-22 12:34:07.94 +100>,<MAYBRIDGE\nmr>,<NMR_250MHZ>,
      <apk 
       data hash MD5: 32K
       F5 36 8C 69 F0 66 20 07 C2 A9 23 4C 89 21 BA 2B>)
(   4,<2006-05-22 12:34:09.23 +100>,<MAYBRIDGE\nmr>,<NMR_250MHZ>,
      <abs ABSG = 5 
       data hash MD5: 32K
       D0 21 5A 97 95 C5 FF 9E C9 7F 1D 8E 38 BA CC 30>)
$$ ##END=
$$ 
$$ hash MD5
$$ D4 F2 5A F8 90 86 51 C8 7E 9C 1B E2 FC 0E 92 C1
##$RELAX= 
##$RELAX= 
##$RELAX= 
##$RELAX= 
##$RELAX= 
##$RELAX= 
##$RELAX= 
$$ Bruker specific parameters
$$ --------------------------
##$DU= <C:\u>
##$EXPNO= 4860
##$NAME= <ADRS>
##$PROCNO= 1
##$TYPE= <nmr>
##$USER= <dgb>
##$AMP= (0..31)
100 100 100 100 100 100 100 100 100 100 100 100 100 100 100 100 100 100 
100 100 100 100 100 100 100 100 100 100 100 100 100 100 
##$AQSEQ= 0
##$AQ_mod= 3
##$AUNM= <au_zg>
##$AUTOPOS= <26 >
##$BF1= 250.13
##$BF2= 250.13
##$BF3= 250.13
##$BF4= 250.13
##$BF5= 500.13
##$BF6= 500.13
##$BF7= 500.13
##$BF8= 500.13
##$BYTORDA= 1
##$CFDGTYP= 0
##$CFRGTYP= 5
##$CHEMSTR= <none>
##$CNST= (0..31)
1 1 145 1 1 1 1 1 1 1 1 1 1 1 1 1 1 1 1 1 1 1 1 1 1 1 1 1 1 1 1 1 
##$CPDPRG= <>
##$CPDPRG1= <>
##$CPDPRG2= <>
##$CPDPRG3= <>
##$CPDPRG4= <mlev>
##$CPDPRG5= <mlev>
##$CPDPRG6= <mlev>
##$CPDPRG7= <mlev>
##$CPDPRG8= <mlev>
##$CPDPRGB= <>
##$CPDPRGT= <>
##$D= (0..31)
0 1 0 0 0 0 0 0 0 0.06 0 0 0 0 0 0 0.0002 0 0 0 0 0 0 0 0 0 0 0 0 0 0 
0 
##$DATE= 1148297618
##$DBL= (0..7)
120 120 120 120 120 120 120 120 
##$DBP= (0..7)
150 150 150 150 150 150 150 150 
##$DBP07= 0
##$DBPNAM0= <>
##$DBPNAM1= <>
$$ [...]
##$SUBNAM7= <"">
##$SUBNAM8= <"">
##$SUBNAM9= <"">
##$SW= 20.6930455092707
##$SWIBOX= (0..15)
0 0 3 0 0 0 0 0 0 0 0 0 0 0 0 0 
##$SW_h= 5175.983436853
##$TD= 65536
##$TD0= 1
##$TE= 294.16
##$TE2= 300
##$TE3= 300
##$TEG= 300
##$TL= (0..7)
0 120 120 120 120 120 120 120 
##$TP= (0..7)
150 150 150 150 150 150 150 150 
##$TP07= 0
##$TPNAME0= <>
##$TPNAME1= <>
##$TPNAME2= <>
##$TPNAME3= <>
##$TPNAME4= <>
##$TPNAME5= <>
##$TPNAME6= <>
##$TPNAME7= <>
##$TPOAL= (0..7)
0.5 0.5 0.5 0.5 0.5 0.5 0.5 0.5 
##$TPOFFS= (0..7)
0 0 0 0 0 0 0 0 
##$TUNHIN= 0
##$TUNHOUT= 0
##$TUNXOUT= 0
##$USERA1= <user>
##$USERA2= <user>
##$USERA3= <user>
##$USERA4= <user>
##$USERA5= <user>
##$V9= 5
##$VALIST= <valist>
##$VCLIST= <CCCCCCCCCCCCCCC>
##$VD= 0
##$VDLIST= <DDDDDDDDDDDDDDD>
##$VPLIST= <PPPPPPPPPPPPPPP>
##$VTLIST= <TTTTTTTTTTTTTTT>
##$WBST= 1024
##$WBSW= 4
##$XGAIN= (0..3)
0 0 0 0 
##$XL= 0
##$YL= 0
##$YMAX_a= 465237
##$YMIN_a= -603001
##$ZGOPTNS= <>
##$ZL1= 120
##$ZL2= 120
##$ZL3= 120
##$ZL4= 120
##$ABSF1= 16.522
##$ABSF2= -4.171173
##$ABSG= 5
##$ABSL= 3
##$ALPHA= 0
##$AQORDER= 0
##$ASSFAC= 0
##$ASSFACI= 0
##$ASSFACX= 0
##$ASSWID= 0
##$AUNMP= <proc_1d>
##$AZFE= 0.1
##$AZFW= 0.1
##$BCFW= 0
##$BC_mod= 0
##$BYTORDP= 0
##$COROFFS= 0
##$CY= 12.5
##$DATMOD= 1
##$DC= 0
##$DFILT= <>
##$DTYPP= 0
##$F1P= 14.0000005364418
##$F2P= -0.99999901652339
##$FCOR= 0.5
##$FTSIZE= 32768
##$FT_mod= 6
##$GAMMA= 0
##$GB= 0
##$INTBC= 1
##$INTSCL= 1
##$ISEN= 128
##$LB= 0.3
##$LEV0= 0
##$LPBIN= 0
##$MAXI= 10000
##$MC2= 0
##$MEAN= 0
##$ME_mod= 0
##$MI= 0
##$NCOEF= 0
##$NC_proc= -4
##$NLEV= 6
##$NOISF1= 0
##$NOISF2= 0
##$NSP= 0
##$NTH_PI= 0
##$NZP= 0
##$OFFSET= 16.522
##$PC= 1
##$PHC0= 169.9392
##$PHC1= 2.161445
##$PH_mod= 1
##$PKNL= yes
##$PPARMOD= 0
##$PSCAL= 4
##$PSIGN= 0
##$REVERSE= no
##$SF= 250.13
##$SI= 32768
##$SIGF1= 0
##$SIGF2= 0
##$SINO= 400
##$SIOLD= 32768
##$SREGLST= <1H.CDCl3>
##$SSB= 0
##$STSI= 32768
##$STSR= 0
##$SW_p= 5175.98343685301
##$SYMM= 0
##$S_DEV= 0
##$TDeff= 65536
##$TDoff= 0
##$TI= <Analysis number 999999
Compound Code 99
Book Reference 9
Project Code 9>
##$TILT= no
##$TM1= 0
##$TM2= 0
##$TOPLEV= 0
##$USERP1= <user>
##$USERP2= <user>
##$USERP3= <user>
##$USERP4= <user>
##$USERP5= <user>
##$WDW= 1
##$XDIM= 32768
##$YMAX_p= 467599639
##$YMIN_p= -296780
$$ End of Bruker specific parameters
$$ ---------------------------------
##NTUPLES= NMR SPECTRUM
##VAR_NAME=  FREQUENCY,     SPECTRUM/REAL,   SPECTRUM/IMAG
##SYMBOL=    X,             R,               I
##VAR_TYPE=  INDEPENDENT,   DEPENDENT,       DEPENDENT
##VAR_FORM=  AFFN,          ASDF,            ASDF
##VAR_DIM=   32768,         32768,           32768
##UNITS=     HZ,            ARBITRARY UNITS, ARBITRARY UNITS
##FACTOR=    0.157963299565203, 1,           1
##FIRST=     4132.6476996994, 0,             0
##LAST=      -1043.33573715361, 0,           0
##MIN=       -1043.33573715361, -296780,     0
##MAX=       4132.6476996994, 467599639,     0
$$ Real data points
##PAGE= N=1
##DATA TABLE= (X++(R..R)), XYDATA
$$ [...]
15885g983J1988J926J0804j0951P924r727J5572q896k3835j6706K224K4604k0111
$$ -7983 4005 5931 16735 5784 13708 3981 19553 10657 -13178 -29884 -27660 -3056 -23167
15872b3167j2728r476j2419J5305L9966K8961j3011l8729N868K0901O486m1228
$$ -23167 -35895 -45371 -57790 -42485 -2519 26442 13431 -25298 -19430 1471 7957 -33271
15860c3271j3448J9000r30q95k201L968J8326N658M164q761k9212j230J7796J3816
$$ -33271 -46719 -27719 -28649 -29544 -31745 -27777 -9451 -3793 371 -8390 -37602 -38832 -21036 -7220
15846g220K3038k1322l1196j1824p228K0925J510L5287L2729M891k5809l7232
$$ -7220 15818 -5504 -36700 -48524 -55752 -34827 -33317 1970 34699 39590 13781 -23451
15834b3451K9155J4853K445k6914k0522L551J5156o93k3945J5685Q746M761K0455
$$ -23451 5704 20557 23002 -3912 -24434 -20883 -5727 -6420 -30365 -14680 -5934 -1173 19282
15821A9282j0589j9634k1215K0868K4409j4360k0734L458O12j7087m661R72K5139
$$ 19282 8693 -10941 -32156 -11288 13121 -1239 -21973 -18515 -17903 -34990 -39651 -38679 -13540
15808a3540J8281R3p081J7600O041K0768j1609m2029j927j0333k451K1750K630
$$ -13540 4741 4834 -2247 15353 21394 42162 30553 -11476 -13403 -23736 -26187 -4437 -1807
15795a807j9650j6922j4872M880K2383L3805J8218M60Q247k1858P483K88O45j296
$$ -1807 -21457 -38379 -53251 -48371 -25988 7817 26035 26495 34742 12884 20367 20655 21300 20004
15781B0004k2074r309n329K2504n300N124K8278K9644j3521j5283p75P166k0484
$$ 20004 -2070 -11379 -16708 5796 496 5620 33898 63542 50021 34738 33963 41129 20645
15768B0645l7499m274J7941j2167j5097q848L099K0614j3394k7185K169J8572
$$ 20645 -16854 -21128 -3187 -15354 -30451 -39299 -36200 -15586 -28980 -56165 -53996 -35424
15756c5424K1120j4616l5890J9411K3094K1769J3243N949R09j6755m6931J8025
$$ -35424 -14304 -28920 -64810 -45399 -22305 -536 12707 18656 19565 2810 -44121 -26096
15744b6096K4151J1300M256r332j4501n754J9281l558k709j473j7608K920L494
$$ -26096 -1945 9355 13611 4279 -10222 -15976 3305 -253 -2962 -4435 -22043 -19123 -15629
15731a5629o437j153O599j4815l743l1517j5244M9083L1053R573m1789J5935M2392
$$ -15629 -22066 -23219 -16620 -31435 -35178 -66695 -81939 -32856 -1803 7770 -34019 -18084 24308
15718B4308r479j0734J8327J8217J3058j1105k3543j0151p072J2376J2622k9348
$$ 24308 14829 4095 22422 40639 53697 42592 19049 8898 1826 14202 26824 -2524
15706b524k0414J5238J0521m52p864L653J7571o527J4764L2605p658j5166l078
$$ -2524 -22938 -7700 2821 2369 -5495 -1842 15729 9202 23966 56571 48913 33747 30669
15693C0669J991j4074m984R738j4085n132J8552k1053j4227k1077j2952N2653
$$ 30669 32660 18586 13602 23340 9255 4123 22675 1622 -12605 -33682 -46634 6019
15681F019K1664l5363j6289K7276J8676k1708m8886o79K0686J5267J1730j5508
$$ 6019 27683 -7680 -23969 3307 21983 275 -48611 -49290 -28604 -13337 -1607 -17115
15669a7115M90J1468J03k0050j6268J7945K0758K9056k3097k1409p574J0638j0731
$$ -17115 -16625 -5157 -5054 -25104 -41372 -23427 -2669 26387 3290 -18119 -25693 -15055 -25786
15656b5786J9517K12K5580o51p959O567j520N69j3463l695J9930J1659k0367k3991
$$ -25786 -6269 -6057 19523 18872 10913 17480 15960 16529 3066 -629 19301 30960 10593 -13398
15642a3398j9370R389N73k7282N946M5539J199J0637O395M379J3653m0389k699
$$ -13398 -32768 -23379 -22806 -50088 -44142 1397 2596 13233 19628 24007 37660 -2729 -5428
15629e428J9701L053j8513p546q728K1080O024j6186l0687j2661Q289M0246O870
$$ -5428 14273 17326 -1187 -8733 -17461 3619 9643 -6543 -37230 -49891 -41602 -1356 5514
15616E514J559k0103r462j6954P445K7550j712r779J2753J919j7423J3661N58
$$ 5514 7073 -13030 -22492 -39446 -32001 -4451 -6163 -15942 -3189 -1270 -18693 -5032 -4474
15603d474O609J368k3227L213R20r22j63K2165j4166l954j447M521J3773P910
$$ -4474 2135 3503 -19724 -16511 -15591 -16513 -16676 5489 -8677 -12631 -14078 -9557 4216 12126
15589A2126j0643j8841J076Q552j3889l113j4577K7041m969q564K0625j9204o917
$$ 12126 1483 -17358 -16282 -7730 -21619 -24732 -39309 -12268 -17237 -25801 -5176 -24380 -31297
15576c1297l0033R888K6693J994M326J1813j6004j0360r665j8199J9517K0542
$$ -31297 -61330 -51442 -24749 -22755 -18429 -6616 -22620 -32980 -42645 -60844 -41327 -20785
15564b0785k2496j2113N083L722k4082J2774J0479J7854J9335M689J7235j2386
$$ -20785 -43281 -55394 -50311 -46589 -70671 -57897 -47418 -29564 -10229 -5540 11695 -691
15552f91J0593O089k7737J8914l01m909l8245j1967K5168M1938J4361j4427k2975
$$ -691 9902 15991 -11746 7168 6867 1958 -36287 -48254 -23086 18852 33213 18786 -4189
15539d189o510J5772J9434N700J8146p506l98p604j0867l4406k092o027k2757
$$ -4189 -10699 5073 24507 30207 48353 40847 40449 32845 21978 -12428 -14520 -20547 -43304
15526d3304l1810k0666O461K0924K274r52k95K6246N719j1905P566K0167Q426
$$ -43304 -75114 -95780 -89319 -68395 -66121 -67073 -67368 -41122 -35403 -47308 -39742 -19575 -11149
15513a1149L4845r753o935L043K333K186m76l2467J3658L6119j6912l2710O744
$$ -11149 23696 13943 7008 10051 12384 14570 14094 -18373 -4715 31404 14492 -18218 -11474
15500a1474L1467M721k8285k4068l940N449O587N520j3641j7201l1269J0258Q816
$$ -11474 19993 24714 -3571 -27639 -31579 -26130 -19543 -14023 -27664 -44865 -76134 -65876 -57060
15487e7060L3081J9888m4184k1396K7071M5234L3086k757J6543P439k6681l1911
$$ -57060 -23979 -4091 -48275 -69671 -42600 2634 35720 32963 49506 56945 30264 -1647
15475a647m0219J2968J6460l613o237k2793o089N703K2654K0220R974J633Q805
$$ -1647 -41866 -28898 -12438 -16051 -22288 -45081 -51170 -45467 -22813 -2593 7381 9014 17819
15462A7819j996R139J5760k2109J595k4793n0598k2033K8649K8650Q954L4513
$$ 17819 15823 24962 40722 18613 20208 -4585 -55183 -77216 -48567 -19917 -10963 23550
15450B3550j3123l6348n36l26n27q325M855P812K1532k574q632L358j2240j2983
$$ 23550 10427 -25921 -26457 -26783 -27310 -35635 -30780 -22968 -1436 -4010 -12642 -9284 -21524 -34507
15436c4507K016K4668N677K029k4742j602L7292J6786L0937k666k5512k3651k4079
$$ -34507 -32491 -7823 -2146 -117 -24859 -26461 10831 27617 58554 55888 30376 6725 -17354
15423a7354J0163p829J3973J8865N705k3231j2622Q622J6521j9088k793J6074
$$ -17354 -7191 -15020 -1047 17818 23523 292 -12330 -3708 12813 -6275 -9068 7006
15411G006J3922j1593L816p629k5840j0808L9749M2861o595j6311j3207k0775
$$ 7006 20928 9335 13151 5522 -20318 -31126 8623 51484 44889 28578 15371 -5404
15399e404n941O30K0956K682O27n827J553j69k347k5972o21J0428k3222k2630
$$ -5404 -11345 -10715 10241 12923 13550 7723 9276 9107 6760 -19212 -19833 -9405 -32627 -55257
15385e5257M5988j330j1249L578Q054k836r012l14n196K0474k865o945m658K0559
$$ -55257 -9269 -10599 -21848 -18270 -10216 -13052 -22064 -22378 -27574 -7100 -9965 -16910 -21568 -1009
15371a009L3357J4879j3310m175p384J8218o250p420j6571k2093J848J3046P804
$$ -1009 32348 47227 33917 29742 22358 40576 34326 26906 10335 -11758 -9910 3136 10940
15358A0940P513l2877K9546J4080l9897j2236O052P742k148j5518l990m378M897
$$ 10940 18453 -14424 15122 29202 -10695 -22931 -16879 -9137 -11285 -26803 -30793 -35171 -30274
15345c0274J2252J3987J0530j980n568P689p726K2907L0347j8350k6960J179L958
$$ -30274 -18022 -4035 6495 4515 -1053 6636 -1090 21817 52164 33814 6854 8033 11991
15332A1991j283j5866M431J5872m226j212J5397q173p865K8752J9572j4191j2415
$$ 11991 10708 -5158 -727 15145 10919 9707 25104 16931 9066 37818 57390 43199 30784
15319C0784q551j602j446L157m5352j2187m798j7126K120L4191J4860o957O190
$$ 30784 22233 20631 19185 22342 -23010 -35197 -39995 -57121 -55001 -20810 -5950 -12907 -6717
15306f717k1013L457j4102j0696J1807K8911k738l272J314J538k2866j1382k0503
$$ -6717 -27730 -24273 -38375 -49071 -37264 -8353 -11091 -14363 -13049 -11511 -34377 -45759 -66262
15293f6262J5314L6124m577J0437j26J0850l50l03k8321j7438k3168j3694J9826
$$ -66262 -50948 -14824 -19401 -8964 -9090 1760 1410 1107 -27214 -44652 -67820 -81514 -61688
15280f1688o233j3054N2986M8416R951k3133n048J9135M596j9477j3766M428O244
$$ -61688 -67921 -80975 -27989 20427 30378 7245 2197 21332 25928 6451 -7315 -2887 3357
15267C357Q080R128o728j634k0595L438J2072j2261o595J457K3078P540q778J6516
$$ 3357 11437 20565 13837 12203 -8392 -4954 7118 -5143 -11738 -10281 12797 20337 11559 28075
15253B8075L022j6756N955L0084J0103k7132j6564l2054r192m749Q164L052O11
$$ 28075 31097 14341 20296 50380 60483 33351 16787 -15267 -24459 -29208 -21044 -17992 -17381
15240a7381J0371l262m2628o834M433m781j399K9708M439J2794J1739l518Q580
$$ -17381 -7010 -10272 -52900 -59734 -55301 -60082 -61481 -31773 -27334 -14540 -2801 -6319 2261
15227B261K352L28p839p207j0223k9270K5041J2801J7465P857m622q210J53r51
$$ 2261 4613 4941 -2898 -10105 -20328 -49598 -24557 -11756 5709 13566 8944 734 887 -64
15213f4k8807m553N955M0583K8312j9905l9406k6206r204Q097m279K4347J6909
$$ -64 -28871 -33424 -27469 13114 41426 21521 -17885 -44091 -53295 -45198 -49477 -25130 -8221
15200h221j4645j8520M817N695N327J8478O698j2666q073j4245L04R919K7695
$$ -8221 -22866 -41386 -36569 -30874 -25547 -7069 -371 -13037 -21110 -35355 -35051 -25132 2563
15187B563L2395k0767k3228m666q021o246L9528J9230k2849q379k090k2089q316
$$ 2563 34958 14191 -9037 -13703 -21724 -27970 11558 30788 7939 -440 -2530 -24619 -32935
15174c2935L1328k664j680j1670j5549K9071N21N572n761m831j587j2996o197
$$ -32935 -1607 -4271 -5951 -17621 -33170 -4099 -3578 1994 -3767 -8598 -10185 -23181 -29378
15161b9378N604J1968L4742q766k9339Q096K3162J9172q36k5916p313K262j3336
$$ -29378 -23774 -11806 22936 14170 -15169 -7073 16089 35261 34425 8509 1196 3458 -9878
15148i878J8314Q575k5866j0787J808J4736K6725k901m8676j6783J5031Q962J2037
$$ -9878 8436 17011 -8855 -19642 -17834 -3098 23627 20726 -27950 -44733 -29702 -20740 -8703
15135h703J2169r612l1609j2965J9143M104r490j4231Q454J8444L4364N040k1691
$$ -8703 3466 -6146 -37755 -50720 -31577 -27473 -36963 -51194 -42740 -24296 10068 15108 -6583
15122f583j3237j5561J4637J5898j0456R204q883j0718K6716q836j2023o314L420
$$ -6583 -19820 -35381 -20744 -4846 -15302 -6098 -14981 -25699 1017 -7819 -19842 -26156 -22736
15109b2736L1617J1353J820K2654l0536q74m847m7428J0680N660l086j8015M3712
$$ -22736 8881 20234 22054 44708 14172 13298 8451 -38977 -28297 -22637 -25723 -43738 -26
15096b6O0874J2902k7506m2406j5297O662J2397K5J6181J2936l870l216K951j272
$$ -26 60848 73750 46244 3838 -11459 -4797 7600 7625 23806 36742 32872 29656 32607 31335
15082C1335J4k9593q825L0481R116K7833Q834j6935j1689l1469j5872n389J9613
$$ 31335 31349 1756 -7069 23412 32528 60361 69195 52260 40571 9102 -6770 -12159 7454
15069G454j0636j8440m503K4245K401J1050P887k6427N757K1446j1019r335J795
$$ 7454 -3182 -21622 -26125 -1880 521 11571 19458 -6969 -1212 20234 9215 -120 1675
15056A675o51L249R54L087J2359J1340J0163j1422l3449p405KJ6504l288J0601
$$ 1675 1024 4273 5227 8314 20673 32013 42176 30754 -2695 -10100 -10098 6406 3118 13719
15042A3719k0068k7316k8229J1763L3094Q735j8188m411k850N177M613K1626L8273
$$ 13719 -6349 -33665 -61894 -50131 -17037 -8302 -26490 -30901 -33751 -28574 -23961 -2335 35938
15029C5938r771J0626k6039l6308K71j2208l2047J1420J4190K4270L4261j15J1478
$$ 35938 26167 36793 10754 -25554 -25283 -37491 -69538 -58118 -43928 -19658 14603 14488 25966
15016B5966j8441j7324K0957k539q348j5632j3552j5693J1512J8868j3665j9770
$$ 25966 7525 -9799 11158 8619 271 -15361 -28913 -44606 -33094 -14226 -27891 -47661
15004d7661M989J1014J5913p781N498K1767n564J7313J2170j9519j4053m39q468
$$ -47661 -42672 -31658 -15745 -23526 -18028 3739 -1825 15488 27658 8139 -5914 -6353 -14821
14991a4821J2677J7024J7883m4227K29K7978k2474J9264K1853p707O576j5844
$$ -14821 -2144 14880 32763 -11464 -11235 16743 -5731 13533 35386 27679 34255 18411
14979A8411k1570L042p939j9300J1007L3603j366k4399k4965r505k442M5111J2297
$$ 18411 -3159 -117 -8056 -27356 -16349 17254 15888 -8511 -33476 -42981 -45423 -312 11985
14966A1985k367K1285j1472J2370p759j8320r21m648P314j7233j2832j0814J1078
$$ 11985 9618 30903 19431 31801 24042 5722 4801 153 7467 -9766 -22598 -33412 -22334
14953b2334J4646N111J4242N557J721j2180n793q600k2259k3709J900o553r607
$$ -22334 -7688 -2577 11665 17222 18943 6763 970 -7630 -29889 -53598 -51698 -58251 -67858
14940f7858K76R87O496M989k270N628K5643M432n108r170j2584m722J3048n186
$$ -67858 -67582 -66595 -60099 -55110 -57380 -51752 -26109 -21677 -26785 -35955 -48539 -53261 -40213 -45399
14926d5399J4035P221n063p387J2524o270j618j2528K4088Q805n867j4652J1656
$$ -45399 -31364 -24143 -29206 -36593 -24069 -30339 -31957 -44485 -20397 -11592 -17459 -32111 -20455
14913b0455P239j0024P341M633j063j244k637J2496k6077l1936j480J4353q67
$$ -20455 -13216 -23240 -15899 -11266 -12329 -13573 -16210 -3714 -29791 -61727 -63207 -48854 -49721
14900d9721r420m515j1147K8570O0500N651k5499J1246J3112L296j9851j4053
$$ -49721 -59141 -63656 -74803 -46233 14267 19918 -5581 5665 18777 22073 2222 -11831
14888a1831q72j5808J0151M7708J4713p127j8550l7699j2349J8261n618q167K465
$$ -11831 -12703 -28511 -18360 29348 44061 36934 18384 -19315 -31664 -13403 -19021 -27188 -24723
14875b4723j7219K060R318N587j0354P289J2543p036J2132J162L862J4389l569
$$ -24723 -41942 -39882 -30564 -24977 -35331 -28042 -15499 -22535 -10403 -9241 -5379 9010 5441
14862E441q910j1509o213j0685J5389J4569O473K397r712J3924l1178j3793P754
$$ 5441 -3469 -14978 -21191 -31876 -16487 -1918 4555 6952 -2760 11164 -20014 -33807 -26053
14849b6053K078j2450J7603J0294J1658O961Q825j3308J1585j1547k2666j1614
$$ -26053 -23975 -36425 -18822 -8528 3130 10091 18916 5608 17193 5646 -17020 -28634
14837b8634j5880K9813N1956K0705o532k6011k2347Q743k437k5683r772j1876
$$ -28634 -44514 -14701 37255 57960 51428 25417 3070 11813 9376 -16307 -26079 -37955
14825c7955L1602K5840j5798j6155J1855n182M993O544j8799l537n510j7906K1812
$$ -37955 -6353 19487 3689 -12466 -611 -5793 -800 5744 -13055 -16592 -22102 -40008 -18196
14812a8196K6922J9434J0283o313k4360k1081Q373j4998q486j9320l9713J5697
$$ -18196 8726 28160 38443 32130 7770 -13311 -4938 -19936 -28422 -47742 -87455 -71758
14800g1758J8063n817O773M5040L7961J7048l0201k0058L3490J7061k2807k0672
$$ -71758 -53695 -59512 -52739 -7699 30262 47310 17109 -2949 30541 47602 24795 4123
14788D123k6381j0993L1317M071k5105j9480K1666K7641j6741j5167L511r735
$$ 4123 -22258 -33251 -1934 2137 -22968 -42448 -20782 6859 -9882 -25049 -21538 -31273
14776c1273K4135N24l360k2100j6845J3093j7947q939M3518K0684P207J0456j7309
$$ -31273 -7138 -6614 -9974 -32074 -48919 -35826 -53773 -62712 -19194 1490 8697 19153 1844
14763A844j0172p693J0852o529L633N99P433j0790k4511K273N270M902J9156K202
$$ 1844 -8328 -16021 -5169 -11698 -8065 -7466 -33 -10823 -35334 -33061 -27791 -22889 -3733 -1531
14749a531k0943j5238Q567L218o466p94K6103M770p128j2173j1448j5539K1611
$$ -1531 -22474 -37712 -29145 -25927 -32393 -33187 -7084 -2314 -9442 -21615 -33063 -48602 -26991
14736b6991P814o366j5534R399j8797j3605n910M2101N6069o673j4017l541j0860
$$ -26991 -19177 -25543 -41077 -31678 -50475 -64080 -69990 -27889 28180 21507 7490 3949 -6911
14723f911j0588j3151J0624k1148p084p401J2728L4092K6364J355n6983k7029
$$ -6911 -17499 -30650 -20026 -41174 -48258 -55659 -42931 -8839 17525 18880 -38103 -65132
14711f5132O754k304J4426K5157L7821J0905J328j0622M622k1250J250J3775l0908
$$ -65132 -58378 -60682 -46256 -21099 16722 27627 28955 18333 22955 1705 2955 16730 -14178
14698a4178j1301k1901J1196k721k659J9253j0898j584j9005r04K2109K7297J3695
$$ -14178 -25479 -47380 -36184 -38905 -41564 -22311 -33209 -34793 -53798 -54702 -32593 -5296 8399
14685H399l9289l4678r235K7462K5885j5289q28j80J1059N15N618J6080N670r04
$$ 8399 -30890 -65568 -74803 -47341 -21456 -36745 -37573 -37753 -26694 -26179 -20561 -4481 1189 285
14671B85l4918J0478N3994J4974l0329J0753j0645o493P62o542J5900l5775j8616
$$ 285 -34633 -24155 29839 44813 14484 25237 14592 8099 8861 2319 18219 -17556 -36172
14658c6172L1056M3922k4294k4947j4338l844l301o836K8003M2909j5407j7358
$$ -36172 -5116 38806 14512 -10435 -24773 -28617 -31918 -38754 -10751 32158 16751 -607
14646f07L038M498K9819r356j5185M731q038J359k107k3039k0037j3623M7560
$$ -607 2431 6929 36748 27392 12207 16938 8900 10259 8152 -14887 -34924 -48547 -987
14633i87K6079j0035k9114j2773J4752J0514j3621k7006J5191L884o258J8196
$$ -987 25092 15057 -14057 -26830 -12078 -1564 -15185 -42191 -27000 -23116 -29374 -11178
14621a1178J4491j7826j9853q40l176J6737k53n861p922k90L383L133q323J5412
$$ -11178 3313 -14513 -34366 -35206 -38382 -21645 -21898 -27759 -35681 -35971 -32588 -29455 -37778 -22366
14607b2366L2494J5777n219j8756k3428j9694j5165J3982K3970J4823p72J1128
$$ -22366 10128 25905 20686 1930 -21498 -41192 -56357 -42375 -18405 -3582 -4354 6774
14595F774J7762o603R891j7839k2542k4259j3754j8752J0145K4442K8137L287
$$ 6774 24536 17933 27824 9985 -12557 -36816 -50570 -69322 -59177 -34735 -6598 -3311
14583c311l438j9781k1717j7277j593J0546K9045J9297K5754j2659l6899k660
$$ -3311 -6749 -26530 -48247 -65524 -67117 -56571 -27526 -8229 17525 4866 -32033 -34693
14571c4693J3200J2504L398O052n068K6526J75l5464m947L893l1487j4618m597
$$ -34693 -21493 -8989 -5591 461 -4607 21919 22094 -13370 -18317 -14424 -45911 -60529 -65126
14558f5126Q599J6005K3503J8939K1682J2252J5310J2530k9718k7522k37J2630
$$ -65126 -56527 -40522 -17019 1920 23602 35854 51164 63694 33976 6454 6217 18847
14546A8847K8422J0488k5276k1137j3490J5755p601j5060N48J323j3032j4775
$$ 18847 47269 57757 32481 11344 -2146 13609 6008 -9052 -8504 -7181 -20213 -34988
14534c4988O434K8617Q714j3520j48j8227o226K4470k473J8762J223j7658P018
$$ -34988 -28554 63 8777 -4743 -4891 -23118 -29344 -4874 -7347 11415 12638 -5020 1998
14521A998j6176k8272o75j871r447J3181l857J1340J7766R62J5296m098O651J0841
$$ 1998 -14178 -42450 -43125 -44996 -54443 -41262 -45119 -33779 -16013 -15051 245 -3853 2798 13639
14507A3639j0763j2445K3576O763l607L457L840j3067p306n983j5339Q413k0659
$$ 13639 2876 -9569 14007 20770 17163 20620 24460 11393 4087 -1896 -17235 -8822 -29481
14494b9481N415O587l225l112r502J5860L8568K6235o862N699o969l4338j32l802
$$ -29481 -24066 -17479 -20704 -23816 -33318 -17458 21110 47345 40483 46182 39213 4875 4743 941
14480I41r364L0619k63j6735q350j7084p154N798M4612J5862k6911j4606M4106
$$ 941 -8423 22196 21933 5198 -3152 -20236 -27390 -21592 23020 38882 11971 -2635 41471
14467D1471N357k1083j8211q269O28n61o451q43J531Q96o273K3655j6294j9554
$$ 41471 46828 25745 7534 -735 -107 -668 -7119 -7962 -6431 -5535 -11808 11847 -4447 -24001
14453b4001J366M073j3934o531Q520Q63j0238r910M0871K1482J789Q435k6974
$$ -24001 -22635 -18562 -32496 -39027 -30507 -29644 -39882 -49792 -8921 12561 14350 22785 -4189
14440d189l0775J8348m279n382R663M6452J0621l0636K654j5435J1099J6916j1839
$$ -4189 -34964 -16616 -20895 -26277 -16614 29838 40459 9823 12477 -2958 8141 25057 13218
14427A3218L812R710j9748k0635L7393J7702q382O862k7654j4439q275K1542J0142
$$ 13218 17030 26740 6992 -13643 23750 41452 33070 39932 12278 -2161 -10436 11106 21248
14414B1248l4246k8495J4572R268M482O451K0121O81M276j5755l3217l731J0013
$$ 21248 -12998 -41493 -26921 -17653 -13171 -6720 13401 14082 18358 2603 -30614 -34345 -24332
14401b4332K6022K391k1463l4049j3267L1503p316Q73K8312M3190k879R438R185
$$ -24332 1690 4081 -17382 -51431 -64698 -33195 -40511 -39638 -11326 31864 28985 38423 47608
14388D7608j8986N047k3499j7884j7053K5525K1842q209p640l38p99j2289o201
$$ 47608 28622 33669 10170 -7714 -24767 758 22600 14391 6751 6413 5614 -6675 -12876
14375a2876J4724P877K915j5504o187K4918R3j1924P554o714O105K180k1624P870
$$ -12876 1848 9725 12640 -2864 -9051 15867 15960 4036 11590 4876 10981 13161 -8463 -593
14361e93j0034k4650K7043L759p056j467J8005k833l014K0260r070J1141L4562
$$ -593 -10627 -35277 -8234 -4475 -11531 -12998 5007 2174 -840 19420 10350 21491 56053
14348E6053l1536N812k0794k2030J1809K4582L583j7799r640J4763m796m7758
$$ 56053 24517 30329 9535 -12495 -686 23896 27479 9680 40 14803 10007 -37751
14336c7751K0455M5888L3142r634k8352j1154k4526J0602J2015N746L1867j0334
$$ -37751 -17296 28592 61734 52100 23748 12594 -11932 -1330 10685 16431 48298 37964
14324C7964k3646k6538k4774l204L0552M4767J1080l1878k3915J1224q119j5076
$$ 37964 14318 -12220 -36994 -40198 -9646 35121 46201 14323 -9592 1632 -6487 -21563
14312b1563k1804l703K9362J8203K518k6231k0784J2396j0236M98L3243K341r671
$$ -21563 -43367 -47070 -17708 495 3013 -23218 -44002 -31606 -41842 -41344 -8101 -5760 -15431
14299a5431J4757L6510J9129k8382j6754k7534j3945K403J947J2249J2137J8336
$$ -15431 -674 35836 54965 26583 9829 -17705 -31650 -29247 -27300 -15051 -2914 15422
14287A5422J8023K1627p022J522K2827k0621l7402k2928M390J487j2932K3047
$$ 15422 33445 55072 48050 49572 72399 51778 14376 -8552 -4162 -2675 -15607 7440
14275G440m611k0938L949PJ2825k342n793o1m416r113J051k0601k0492k365J2159
$$ 7440 2829 -18109 -14160 -14153 -1328 -3670 -9463 -9524 -13940 -23053 -22002 -42603 -63095 -65460 -53301
14260e3301K5399j1300j8j349n601J1781O16J0128M393l171J4886Q148q705K818
$$ -53301 -27902 -39202 -39220 -40569 -46170 -34389 -33773 -23645 -19252 -22423 -7537 611 -8094 -5276
14246e276m556J2329J7934j0385k0238O468J4840K9898l250k8961J244M778p875
$$ -5276 -9832 2497 20431 10046 -10192 -3724 11116 41014 37764 8803 10047 14825 6950
14233F950j4593M166K0309o388L0080K6227J6448Q122k0280m4924j4350k1040
$$ 6950 -7643 -3477 16832 10444 40524 66751 83199 91321 71041 26117 11767 -9273
14221i273Q140J851Q933O926j0761N292K660J164j936q417l6052j9538l022J4072
$$ -9273 -1133 718 9651 16577 5816 11108 13768 14932 12996 4579 -31473 -51011 -54033 -39961
14207c9961K3460J901P271q834L398J1063n541K6280K236q932k3156Q583j5948
$$ -39961 -16501 -14600 -7329 -16163 -12765 -1702 -7243 19037 21273 12341 -10815 -2232 -18180
14194a8180j1291L9206K2285j0243n2871k8601K1834K9329l266m343j1909P427
$$ -18180 -29471 9735 32020 21777 -31094 -59695 -37861 -8532 -11798 -16141 -28050 -20623
14182b0623J8707K9598p212l1173R253K9733N443l617J8258K875O96M807j3596
$$ -20623 -1916 27682 20470 -10703 -1450 28283 33726 30109 48367 51242 51938 56745 43149
14169D3149j9592J4528m33m1445j1958o907K9004O111k8310j3658j4000R233j0402
$$ 43149 23557 38085 37652 -3793 -15751 -22658 6346 12457 -15853 -29511 -43511 -34278 -44680
14156d4680J0531M102j0775J1034M2831k7185k974m317P562J3701J1920O196R315
$$ -44680 -34149 -30047 -40822 -29788 13043 -14142 -17116 -21433 -13871 -170 11750 17946 27261
14143B7261J37j153Q040p325j8786J862O188J5518P219K837j3493j0613j521N453
$$ 27261 27398 26245 34285 26960 8174 10036 16224 31742 38961 41798 28305 17692 16171 21624
14129B1624j9249j4152k2835r013l590K8237K2256k1952k2365J6937K4360J0305
$$ 21624 2375 -11777 -34612 -43625 -47215 -18978 3278 -18674 -41039 -24102 258 10563
14117A0563J3622J317k629J7054M596k2650j5060K6275Q690j8375l8675j9118
$$ 10563 24185 25502 22873 39927 44523 21873 6813 33088 41778 23403 -15272 -34390
14105c4390l5184l477L6271N4371O031r329j814j2054p172Q583r480q099J0786
$$ -34390 -69574 -73051 -36780 17591 23622 14293 12479 425 -6747 1836 -7644 -15743 -4957
14092d957j319K3812L3285j1287L910R811M165k7794o289r290j563M242j4232
$$ -4957 -6276 17536 50821 39534 43444 53255 57420 29626 23337 14047 12484 16726 2494
14079B494R221m929J7403K1647k3114k9753k637j2978P165K7552q269J28p419
$$ 2494 11715 6786 24189 45836 22722 -7031 -9668 -22646 -15481 12071 3802 3930 -3489
14066c489j7930J0296j5163j0409J8417J8054K3356p95k6729K508l6618K38K6793
$$ -3489 -21419 -11123 -26286 -36695 -18278 -224 23132 22337 -4392 -1884 -38502 -38264 -11471
14053a1471L572O180K2878M3234L4259l2788j9000k6363n542j35q107l367K0557
$$ -11471 -7899 -1719 21159 64393 98652 65864 46864 20501 14959 14824 6717 3350 23907
14040B3907K1351M268k4886R20j6359j4197K0928K1309O068k8423j2119j2638
$$ 23907 45258 49526 24640 25560 9201 -4996 15932 37241 43309 14886 2767 -9871
14028i871L0879J1966R867k173l5191k4704k123K9883j5374J0559M302j1164j5923
$$ -9871 21008 32974 42841 40668 5477 -19227 -21350 8533 -6841 3718 8020 -3144 -19067
14015a9067L310R756K2459j0938k8222j0543m292k062l087K773K5426K1597P955
$$ -19067 -15757 -6001 16458 5520 -22702 -33245 -37537 -39599 -42686 -39913 -14487 7110 15065
14002A5065r05j3453Q396P895L8431K3039l3797k3621j2712J6294q426L229O519
$$ 15065 14160 707 9103 16998 55429 78468 44671 21050 8338 24632 16206 19435 25954
13989B5954L687o526l762P981j3308L5477J0619j548m738o45j893n5695k5909
$$ 25954 29641 23115 19353 27334 14026 49503 60122 58574 53836 53191 51298 -4397 -30306
13976c0306N000L7626J5407l0224k9215L3491j3663k9534O438K781J4780J4623
$$ -30306 -25306 12320 27727 -2497 -31712 1779 -11884 -41418 -34980 -32199 -17419 -2796
13964b796J2526J9764o103j8020j9482K3703k588j0344N629L9246O116j3793l5723
$$ -2796 9730 29494 23391 5371 -14111 9592 7004 -3340 2289 41535 47651 33858 -1865
13951a865j5709J8973J3806L761K16j1119j2683l2839k806K6812J5971K0252P72
$$ -1865 -17574 1399 15205 18966 19182 8063 -4620 -37459 -40265 -13453 2518 22770 23542
13938B3542L237k3333j0209M376M520j384j2595N177J4347o81N314J089j232r670
$$ 23542 26779 3446 -6763 -2387 2133 749 -11846 -6669 7678 6997 12311 13400 12168 2498
13924B498j5783l4897K633K0596M829l174j0500j1725R407M3538L2171n716k7826
$$ 2498 -13285 -48182 -45549 -24953 -20124 -23298 -33798 -45523 -36116 7422 39593 33877 6051
13911F051k2617k567r261k21O280J1546J6841n843O132m828J1608K373l6070m4
$$ 6051 -16566 -19133 -28394 -28615 -22335 -10789 6052 209 6341 1513 13121 15494 -20576 -20620
13897b0620L2487K2035O37r459J0050p08j5650L183m566j2734j8213j0402K2690
$$ -20620 11867 33902 34539 25080 35130 34422 18772 21955 17389 4655 -13558 -23960 -1270
13884a270L436j0551L148j0210N546n861m292j9230M318R502K9534J3802Q888
$$ -1270 2166 -8385 -5237 -15447 -9901 -15762 -20054 -39284 -34966 -25464 4070 17872 26760
13871B6760P520O220P640K4736k2415j5515p02n170m498L239k2903J3266K7556
$$ 26760 34280 40500 48140 72876 50461 34946 34244 29074 24576 27815 4912 18178 45734
13858D5734J2387j9421k6269j0025k6688Q519J6089K7370J0065j9182J1043j8893
$$ 45734 58121 38700 12431 2406 -24282 -15763 326 27696 37761 18579 29622 10729
13846A0729l8219j7127J7550J0537Q878j2554j6092j1619J6366L2489L476n93
$$ 10729 -27490 -44617 -27067 -16530 -7652 -20206 -36298 -47917 -31551 938 4414 3821
13834C821M386J6778K6685J771l4035J4192N222l396j7412P838Q086K1209l24
$$ 3821 8207 24985 51670 53441 19406 33598 38820 35424 18012 25850 33936 55145 54821
13821E4821R652J6849k5779k8882k7140j8114K3443j9396j2853r81K5670M090
$$ 54821 64473 81322 55543 26661 -479 -18593 4850 -14546 -27399 -28380 -2710 1380
13809A380J7051n069Q562p622j5205N808J6518J0532m3480l2891K2083M3353J0486
$$ 1380 18431 13362 21924 14302 -903 4905 21423 31955 -11525 -44416 -22333 21020 31506
13796C1506J4404J3660l0661l2162k2547J4192J6734L1758J9503r798k5639j0581
$$ 31506 45910 59570 28909 -3253 -25800 -11608 5126 36884 56387 46589 20950 10369
13784A0369L626J5176j758m2203j4122J4059k203O133L2414J3100l9018J7911
$$ 10369 13995 29171 27413 -14790 -28912 -14853 -17056 -10923 21491 34591 -4427 13484
13772A3484K0924J1079l3383l1429j7465l6723m005M1556K0682N3515J8287k0458
$$ 13484 34408 45487 12104 -19325 -36790 -73513 -77518 -35962 -15280 38235 56522 36064
13760C6064m158k5027l1180K4123p228N396j255k1734j6205K116J6485L4863J5515
$$ 36064 31906 6879 -24301 -178 -7406 -2010 -3265 -24999 -41204 -39088 -22603 12260 27775
13747B7775j789K1203N950l870L830R023K7187J872j7297k6172k2886K2594q390
$$ 27775 25986 47189 53139 49269 53099 62122 89309 91181 73884 47712 24826 47420 39030
13734C9030j8478j6026R888J4968J2955j8126m1250P694J0096K2153J2936k0199
$$ 39030 20552 4526 14414 29382 42337 24211 -17039 -9345 751 22904 35840 15641
13722A5641j420j6317Q738K2199N088q70K4306o439K1484L7717p667o920j0781
$$ 15641 14221 -2096 6642 28841 33929 33059 57365 50926 72410 110127 102460 95540 84759
13709H4759r921j3585j8607j7620q510j033J4996R099k7067p233M0417K2424m524
$$ 84759 74838 61253 42646 25026 16516 15483 30479 39578 12511 5278 45695 68119 63595
13696F3595k0140j2191o414k1396Q921R894j2787m4971j4625j190K8115M6800
$$ 63595 43455 31264 24850 3454 12375 22269 9482 -35489 -50114 -51304 -23189 23611
13684B3611j3625r261R35p081J3863P666j1776r656M861K139k0007j5139Q550
$$ 23611 9986 725 1660 -5421 8442 16108 4332 -5324 -463 1676 -18331 -33470 -24920
13671b4920K4046K2177Q848o077Q53j0715J6335J6299q734M58j6698j5250K648
$$ -24920 -874 21303 30151 24074 24927 14212 30547 46846 38112 38570 21872 6622 9270
13658I270J7903K5261J9796o950m0322l0652J9218K5363j737K7234P769j8182
$$ 9270 27173 52434 72230 65280 24958 -5694 13524 38887 37150 64384 72153 53971
13646E3971j988o879K508j7334o518j0377j0210q938j40K1565k3453o762M020
$$ 53971 51983 45104 47612 30278 23760 13383 3173 -5765 -5905 15660 -7793 -14555 -10535
13633a0535J4042Q772M077j0560K844l506j3508L2806n090j6193j059L021k453
$$ -10535 3507 12279 16356 5796 8640 5134 -8374 24432 19342 3149 2090 5111 2658
13620B658k336P605L9717J2028j3621M030j4409l2324j883P979J348j3440k883
$$ 2658 322 7927 47644 59672 46051 50081 35672 3348 1465 9444 10792 -2648 -5531
13607e531j2910q76j068K8914L6533j1782m9811L75l933N881L7026L253l363j8403
$$ -5531 -18441 -19317 -20385 8529 45062 33280 -16531 -16156 -20089 -14208 22818 26071 22708 4305
13593D305j7734K1383M0109J2084m354k6376K5568l624Q585j4916n633k1914j1457
$$ 4305 -13429 7954 48063 60147 55793 29417 54985 51361 59946 45030 39397 17483 6026
13580F026k5165p955J7763J8153J2131j22l464K9764L850o459k0266q672K6736
$$ 6026 -19139 -27094 -9331 8822 20953 20831 17367 47131 50981 44522 24256 15584 42320
13567D2320j3954m1458j7072R687j994J2658J0974r864K1192K9034J9194j0329
$$ 42320 28366 -13092 -30164 -20477 -22471 -9813 1161 -8703 12489 41523 60717 50388
13555E0388r413J2996l2618j8077p135j869Q914K9033j3260k8970O249K3123l197
$$ 50388 40975 53971 21353 3276 -3859 -5728 3186 32219 18959 -10011 -3762 19361 16164
13542A6164j8472J581L187N559K2192N571p795N763j1479r016q784J0541n522
$$ 16164 -2308 -727 2460 8019 30211 35782 27987 33750 22271 13255 4471 15012 9490
13529I490q996J4077J920j5810j9902J9606J5369o718N94q500K528J7217L0893
$$ 9490 494 14571 16491 681 -19221 385 15754 9036 9630 1130 3658 20875 51768
13516E1768J165l3551m7349k8625Q998M5826J1529K0983k6081j8014K121j2465
$$ 51768 52933 19382 -27967 -56592 -47594 -1768 9761 30744 4663 -13351 -11230 -23695
13504b3695J3448J3659R468J1946o66m090j9785j3363j616j3418K0403L9159M937
$$ -23695 -10247 3412 12880 24826 24160 20070 285 -13078 -14694 -28112 -7709 31450 36387
13491C6387j3322o56J5207k6383J0515l313j1487K2399J8427L2710j0501j9352
$$ 36387 23065 22409 37616 11233 21748 18435 6948 29347 47774 80484 69983 50631
13479E0631N297Q80j0216k1368J6238J1381l3498j5625K1510p273r014R883L9
$$ 50631 55928 56808 46592 25224 41462 52843 19345 3720 25230 17957 8943 18826 18865
13466A8865Q801K0042j1614j161J0622l5359r67R730M760J87L65q774k6253L661
$$ 18865 27666 47708 36094 34933 45555 10196 9229 18959 23719 23906 24271 15497 -10756 -7095
13452g095J3406j4035o073P540Q158J8527R313L444O992l4721j2600Q014Q985
$$ -7095 6311 -7724 -13797 -6257 1901 20428 29741 33185 40177 5456 -7144 870 9855
13439I855K1290j5624j3494J5964J9420j3403K1101P685O873j3474m975q436P311
$$ 9855 31145 15521 2027 17991 37411 24008 45109 52794 59667 46193 41218 32782 40093
13426D0093J4813k130m1479k7167Q975k21J7452J6663J2909j3676J302j5021j6580
$$ 40093 54906 52776 11297 -15870 -6895 -7116 10336 26999 39908 26232 27534 12513 -4067
13413d067r486M3276K6707J5202j4690l1998j5230K0312k7412j3619K08j0936
$$ -4067 -13553 29723 56430 71632 56942 24944 9714 30026 2614 -11005 -10797 -21733
13401b1733M765Q222M600m250P099L5913p490N423N095O476K7571p371l5647m2453
$$ -21733 -16968 -8746 -4146 -8396 -1297 34616 27126 32549 37644 44120 71691 64320 28673 -13780
13387a3780j1477N822K7718L528L8890l543k5535j9473n777j0398N040q713j4920
$$ -13780 -25257 -19435 8283 11811 50701 47158 21623 2150 -3627 -14025 -8985 -17698 -32618
13374c2618m541P318K7046j0484j487J699K657R502J8153m031l2411k6717Q251
$$ -32618 -37159 -29841 -2795 -13279 -14766 -13067 -10410 -908 17245 13214 -19197 -45914 -37663
13361c7663R920m855L9708J0220j1704O90j0358q070K5644L0867K9467l0985l6291
$$ -37663 -27743 -32598 7110 17330 5626 6316 -4042 -12112 13532 44399 73866 42881 6590
13348F590n624J0604L0919J6327M292j7950o369K835m976L2555L445j5607J4273
$$ 6590 966 11570 42489 58816 63108 45158 38789 41624 36648 69203 72648 57041 71314
13335G1314J25j5117j3912k6684j8996r509j0620J4554L9155p68k0640L831J055
$$ 71314 71439 56322 42410 15726 -3270 -12779 -23399 -8845 30310 29542 8902 12733 13788
13322A3788j5357J0911L351M533K4638L0177J2678k6019p307K725J1050k8745
$$ 13788 -1569 9342 12693 17226 41864 72041 84719 58700 51393 54118 65168 36423
13310C6423j3556K4315K4591j9915l116M994o114j4655r515O660j1069Q925J9662
$$ 36423 22867 47182 71773 51858 48742 53736 47622 32967 23452 30112 19043 27968 47630
13297D7630N961K3j8435l3261m333M6468J1372l2922o149k5530q156J3209L085
$$ 47630 53591 53614 35179 1918 -2415 44053 55425 22503 16354 -9176 -17332 -4123 -1038
13284a038k126J7520q14J8200J4242j1191p661P833L0851Q175K0102k5010n11
$$ -1038 -3164 14356 13542 31742 45984 34793 27132 34965 65816 73991 94093 69083 68572
13271F8572k949k804j2623p7K0217j8798k4554n15L3130P180j2921Q7L914j8227
$$ 68572 65623 62819 50196 50119 70336 51538 26984 26469 59599 66779 53858 53945 57859 39632
13257C9632j3564o448K0251J3774l5712R391J9195J5978n277K6064k908k8712
$$ 39632 26068 19620 39871 53645 17933 27324 46519 62497 57220 83284 80376 51664
13245E1664J3016k1480j1964L3551J0771j374k1391l247L735p682k1563j565L0594
$$ 51664 64680 43200 31236 64787 75558 74184 52793 49546 53281 45599 24036 22471 53065
13232E3065P357J9639k4488j3964N696J449M1251o913k6701j4343Q222K4081j3889
$$ 53065 60422 80061 55573 41609 47305 48754 90005 83092 56391 42048 50270 74351 60462
13219F0462M658p841l783K3344k3598k3256M06K6710L3003n727l5989j29J5555
$$ 60462 65120 57279 53496 76840 53242 29986 30392 57102 90105 84378 48389 48260 63815
13206F3815k0059K0785O16j8109J3089P880k5106n034K9355J6890k0700L380j2040
$$ 63815 43756 64541 65157 47048 60137 68017 42911 37877 67232 84122 63422 66802 54762
13193E4762j3168k663k288O259L2124L8536K609j7284l573j0117n156p207r992
$$ 54762 41594 38931 36643 42902 75026 113562 116171 98887 95314 85197 80041 72834 62842
13180F2842J717k2308j4952J8988K4677L1948J8257k1763j6346L5190K9101o312
$$ 62842 64559 42251 27299 46287 70964 102912 121169 99406 83060 118250 147351 141039
13168A41039m240m477k0161k0411j994j6686j9790r590n478K8762n503q60j2219
$$ 141039 136799 132322 112161 91750 89756 73070 53280 43690 38212 66974 61471 60611 48392
13155D8392K2265J5587k773J742K622j2J4549j7670j3328o3J0899Q092k674k3744
$$ 48392 70657 86244 83471 85213 87835 87823 102372 84702 71374 71311 82210 90302 87628 63884
13141F3884j0714K5208L563k9041k4633J6245K5568M1433N855l7792j4180J0767
$$ 63884 53170 78378 81941 52900 28267 44512 70080 111513 117368 79576 65396 76163
13129G6163J8929J7749r890j8440r301J6628l095j8862K819j1682M276J4234j2924
$$ 76163 95092 112841 102951 84511 75210 91838 88743 69881 72700 61018 65294 79528 66604
13116F6604o715o347J1807M1204K8645k1220k3376k5898J7215R762l586j2037
$$ 66604 59889 53542 65349 106553 135198 113978 90602 64704 81919 91681 88095 76058
13104G6058k279P607N86l4474o179J1176K6800j5636Q976L2963L6717K108O253
$$ 76058 73779 81386 81972 47498 41319 52495 79295 63659 72635 105598 142315 144423 150676
13091A50676q668l0283j9742j9637J8727r382m2770Q69Q855n953m624J514K7448
$$ 150676 142008 111725 91983 72346 91073 81691 38921 39790 48645 42692 38068 39582 67030
13078F7030K5559K242K1437j455P86m0065P86l043P477O872m980Q22J3092p560
$$ 67030 92589 94831 116268 114813 115599 75534 76320 73277 80754 87626 82646 83468 96560 89000
13064H9000j8493P685L4454k4490K093j1841k8752J0087N1341J2204j4961j4566
$$ 89000 70507 78192 112646 88156 90249 78408 49656 59743 111084 123288 108327 93761
13052I3761J4951K171J1770n229j7566j0388M0134o624k1717k7603j8445J1829
$$ 93761 108712 110883 122653 117424 99858 89470 129604 122980 101263 73660 55215 67044
13040F7044M5682p46K655k1261k9578J6773K0917j9207q890K142L806n794L1761
$$ 67044 112726 111980 114635 93374 63796 80569 101486 82279 73389 75531 79337 73543 105304
13027A05304L497p339J4925Q515K0432m2463k3183j4123p264j0145N446P344K1652
$$ 105304 108801 101462 116387 124902 145334 102871 79688 65565 58301 48156 53602 60946 82598
13014H2598Q084j277o16P927K3436O207k915J4269j1039r120l638r101q297j5529
$$ 82598 90682 89405 88789 96716 120152 126359 123444 137713 126674 117554 113916 104815 96518 80989
13000H0989q213J0372J9725K0283k6390O305M4944J4938k1132j4646J5771R7r220
$$ 80989 72776 83148 102873 123156 96766 103071 148015 162953 141821 127175 142946 143043 133823
12987A33823k800j2513j919k3064J1466J4784J2527L3970J878O692K853J4682
$$ 133823 131023 118510 116591 93527 104993 119777 132304 166274 168152 174844 177697 192379
12975A92379O1659L5963L1281N1481L8468O1664N9287M4490P1149N4028K8786
$$ 192379 254038 290001 321282 372763 411231 472895 532182 576672 647821 701849 730635
12964G30635j7309K324j1779k4526k3857j8394j0977k9563p0849n2416n8944l4934
$$ 730635 713326 715650 703871 679345 655488 637094 626117 596554 525705 473289 414345 379411
12952C79411n515j6993K365Q490J2825L6223K9152J5352J0937L3068K8438K0862
$$ 379411 373896 356903 359268 367758 380583 416806 445958 461310 472247 505315 533753 554615
12940E54615L58Q385N0970M6191N2427O9635L8907J2823j3539J1950l353J3023
$$ 554615 554973 563358 614328 660519 712946 782581 821488 834311 820772 832722 829369 842392
12928H42392K3126K0534O9008M7145J7120N6068J6166m7245n4913m4771q5107
$$ 842392 865518 886052 955060 1002205 1019325 1075393 1091559 1044314 989401 944630 859523
12917H59523r4122j1868m8211p1427n1617j4421o4963k2148k4051j2861L2669
$$ 859523 765401 753533 705322 633895 582278 567857 502894 480746 456695 443834 476503
12906D76503M8293K4155K1881L1193N3627J9830M3260M1685q183o2783l5531l5717
$$ 476503 524796 548951 570832 602025 655652 675482 718742 760427 752244 689461 653930 618213
12894F18213n5965n2506k9482L591j0043k247L0666N9473M4248N0305M7658J6047
$$ 618213 562248 509742 480260 483851 473808 471561 502227 561700 605948 656253 703911 719958
12882G19958K660n0866j10632q0333l5347n9757k9596j9271j9392k7527k7296
$$ 719958 722618 671752 561120 480787 445440 385683 356087 336816 317424 289897 262601
12871B62601K771n2J2762j1009Q916J7492j9759r548k1219k0984K84j763K0324
$$ 262601 265372 265320 278082 267073 275989 293481 273722 264174 242955 221971 222255 220492 240816
12858B40816J3361K361N128j6099k9465j2586j6708m219M64K0202K3743k788k4458
$$ 240816 254177 256538 261666 245567 216102 203516 186808 182589 183053 203255 226998 224210 199752
12845A99752p169O804k478m036q045K187j6739P689L4855R045j8321m270K5946
$$ 199752 192583 199387 196909 192873 184828 187015 170276 177965 212820 221865 203544 199274 225220
12832B25220J2821J8738o76j7262k8825k4917m35k3418P58N723N583j0710j4074
$$ 225220 238041 256779 256103 238841 210016 185099 184664 161246 162004 167727 173310 162600 148526
12819A48526o087J1232J5885J945L6890j733j2793j4230J7433L389J5203R178
$$ 148526 142439 153671 169556 171501 208391 206658 193865 179635 197068 200457 215660 224838
12807B24838j6704k7660R342K9321j1777m794q803j6045L292R008K590j8981M677
$$ 224838 208134 180474 189816 219137 207360 202566 193763 177718 181010 190018 192608 173627 178304
12794A78304L2263L3976n075l746l6297N30L753J2748k5213Q622J8397K5166K2420
$$ 178304 210567 244543 239468 235722 199425 199955 203708 216456 191243 199865 218262 243428 265848
12781B65848k1284k1566j2585N180j416J3554J0053j1309j6377m754J8413M6248
$$ 265848 244564 222998 210413 215593 214177 227731 237784 226475 210098 205344 223757 270005
12769B70005J8673J4478k0687n484o835j132L5682k415r854K9380K6967P002j9147
$$ 270005 288678 303156 282469 276985 270150 269018 304700 302285 292431 321811 348778 355780 336633
12756C36633j9405L54m874Q414j594o015J4748k0452K4923L8840J3746j684K8598
$$ 336633 317228 317582 312708 321122 319528 313513 328261 307809 332732 371572 385318 383634 412232
12743D12232J8415L842L1103L8748N1444O6891P1564J21823J61433K12995K35068
$$ 412232 430647 434489 465592 504340 555784 622675 694239 816062 977495 1190490 1425558
12732A425558K53180K26841J47677r375j82277k66823k89333k59067j84327j16366
$$ 1425558 1678738 1905579 2053256 2043881 1861604 1594781 1305448 1046381 862054 745688
12722G45688q5923q4623m7073j8997j9944O817n478R826L5207q350o0963k7178
$$ 745688 659765 575142 528069 509072 489128 495945 490467 500293 535500 527150 466187 439009
12710D39009n474N661k5651k9120j9111J2439K2822R49j972k0986m0095k4710
$$ 439009 433535 439196 413545 384425 365314 377753 400575 401524 399552 378566 338471 313761
12698C13761l184J1202k5364m947J7737o370K670M616K1704O72L48j7046l4696
$$ 313761 310577 321779 296415 291468 309205 302835 305505 310121 331825 332497 332845 315799 281103
12685B81103j2185K2307k327k234K6499O8568L5777K2529J4674O915J7612R469
$$ 281103 268918 291225 288898 286664 313163 381731 417508 440037 454711 461626 479238 488707
12673D88707J0734K962J9474L5561N439j1103J7080K8123j1642j3670R084j6316
$$ 488707 499441 502403 521877 557438 562877 551774 568854 596977 585335 571665 580749 564433
12661E64433O438K9763j395J863R522J5415L4342Q19j5191J5443N045j1339J1361
$$ 564433 570871 600634 599239 601102 610624 626039 660381 661200 646009 661452 666497 655158 666519
12648F66519K4940J1087R984K4468j7964Q667L6401K0640K0481K0033L0419K1861
$$ 666519 691459 702546 712530 736998 719034 727701 764102 784742 805223 825256 855675 877536
12636H77536J2027J0652Q803N2736R570J3725L8819J5547K0074J8601L3224J7847
$$ 877536 889563 900215 909018 961754 971324 985049 1023868 1039415 1059489 1078090 1111314 1129161
12624A129161J8982L0771L2298n983k4364m98J0757L953L3979K1522J7195L7997
$$ 1129161 1148143 1178914 1211212 1205229 1180865 1180367 1191124 1195077 1229056 1250578 1267773 1305770
12612A305770L1566k292L1150K1929K0814L3931l1991N216M7321O5685O5926P4773
$$ 1305770 1337336 1335044 1366194 1388123 1408937 1442868 1410877 1416093 1463414 1529099 1595025 1669798
12600A669798L8428J1160M0204L1044j2293L82N013R481o240m332L919K4085N832
$$ 1669798 1708226 1719386 1759590 1790634 1778341 1778723 1783736 1793217 1786977 1782645 1786564 1810649 1816481
12587A816481K4258L2739L6158M3346N1532K4091N2825P6967O2412N8717N2641
$$ 1816481 1840739 1873478 1909636 1952982 2004514 2028605 2081430 2158397 2220809 2279526 2332167
12576B332167M2636O0078N9158O8959J02436J22850J08929P0309Q9185J40048
$$ 2332167 2374803 2434881 2494039 2562998 2665434 2788284 2897213 2967522 3056707 3196755
12566C196755J27767J54397J96656J97312K21846K68408L13197L03511L31101
$$ 3196755 3324522 3478919 3675575 3872887 4094733 4363141 4676338 4979849 5310950
12557E310950L61507M81492N76790O87246Q43873R82375J182399J462885J765106
$$ 5310950 5672457 6153949 6730739 7417985 8261858 9244233 10426632 11889517 13654623
12548A3654623K193268K836496L781691N111093O925174R096317J1198431J2505473
$$ 13654623 15847891 18684387 22466078 27577171 34502345 43598662 54797093 67302566
12540F7302566J2381754J0650938P819193M662679K197575J215497J431235J552010
$$ 67302566 79684320 90335258 98154451 102817130 105014705 106230202 107661437 109213447
12532A09213447M48047k281232o140912r775222j1746313j1565959r761603p227467
$$ 109213447 109661494 107380262 101239350 91464128 79717815 68151856 58390253 51162786
12524E1162786m790057k703596r93676M50434J789469L084549M175351M926479
$$ 51162786 46372729 43669133 42675457 43125891 44915360 47999909 52175260 57101739
12516E7101739N322135N273701M766659M057793L628245L740564M497044N841895
$$ 57101739 62423874 67697575 72464234 76522027 80150272 83890836 88387880 94229775
12508I4229775P382249Q315553P962890O239887L559070Q24320q78363r16350
$$ 94229775 101612024 109927577 117890467 124130354 127689424 128513744 127635381 126719031
12500A26719031P63167L664603O938913R794084J1364909J0897360P838602K647356
$$ 126719031 127482198 131146801 138085714 147879798 159244707 170142067 177980669 180628025
12492A80628025l696022r959320j4492965j6004388j4603576j1889643r274513
$$ 180628025 176932003 166972683 152479718 136475330 121871754 109982111 100707598
12485A00707598p479997o464206n877068n283411m411072l196141j716465O5616
$$ 100707598 93227601 86763395 80886327 75602916 71191844 67995703 66279238 66344854
12477F6344854K230962M747635P334566R505058J0463856R367137N984118J049339
$$ 66344854 68575816 73323451 80658017 90163075 100626931 109994068 115978186 117027525
12469A17027525m531277r292918j1775106j1611904r722129p010526m289375j864623
$$ 117027525 112496248 103203330 91428224 79816320 70094191 63083665 58794290 56929667
12461E6929667M15132K787485N361961P923793R790033J0177973Q403483M425854
$$ 56929667 57344799 60132284 65494245 73418038 83208071 93386044 101789527 106215381
12453A06215381q84578o422770j0775592j2597276j1916614r847685p423943n292299
$$ 106215381 105330803 98908033 88132441 75535165 63618551 53770866 46346923 41054624
12445D1054624l824668k874193k287018j944040j699891j543567j419577j305446
$$ 41054624 37229956 34355763 32068745 30124705 28424814 26881247 25461670 24156224
12437B4156224j154844j021582r46560q39153p65773o87589n91816n49167n41560
$$ 24156224 23001380 21979798 21033238 20194085 19428312 18740723 18148907 17599740 17058180
12428A7058180n13472m83230n41171n64802n13455m91023m93355n04696n20964
$$ 17058180 16544708 16061478 15520307 14955505 14442050 13951027 13457672 12952976 12432012
12419A2432012m44001m04435l83777l72862l59700l59654k97155k99369l05000
$$ 12432012 11988011 11583576 11199799 10826937 10467237 10107583 9810428 9511059 9206059
12410I206059l24876l03935k52354k52815k55379k34052k38037k21866k00762
$$ 9206059 8881183 8577248 8324894 8072079 7816700 7582648 7344611 7122745 6921983
12401F921983k35089k13545k24729k11635j66531j70776j54389j22076j50476
$$ 6921983 6686894 6473349 6248620 6036985 5870454 5699678 5545289 5423213 5272737
12392E272737j63257j54175j12054j08408j44300j27026j22313j10882j12989
$$ 5272737 5109480 4955305 4843251 4734843 4590543 4463517 4341204 4230322 4117333
12383D117333j34390j21189r6954j01536o0452o2191p1522p3341p2455j07137
$$ 4117333 3982943 3861754 3764800 3663264 3602812 3540621 3469099 3395758 3323303 3216166
12373C216166r3951q3753j00077j06365j20486q1098n4716q9339q9301j30401
$$ 3216166 3122215 3038462 2938385 2832020 2711534 2630436 2575720 2486381 2397080 2266679
12363B266679q3109o5331m8090k3298n3135n0699j7790n7640p2413m7216m6955
$$ 2266679 2183570 2118239 2070149 2046851 1993716 1943017 1925227 1867587 1795174 1747958 1701003
12352A701003l7338l3466l0891j4432k2230m334m8493n3128J965j8684k1746m3324
$$ 1701003 1663665 1630199 1599308 1584876 1562646 1558312 1509819 1456691 1458656 1439972 1418226 1374902
12340A374902m3133k1131l1240j7407k7971l888o836m2570J1697J9187L2914l0873
$$ 1374902 1331769 1310638 1279398 1261991 1234020 1230132 1223296 1180726 1192423 1211610 1244524 1213651
12328A213651l3215k1885l904j9597q720J0105K650J3791J5592L4730M6387R212
$$ 1213651 1180436 1158551 1154647 1135050 1126330 1136435 1139085 1152876 1168468 1203198 1249585 1258797
12316A258797j3173n402m0006m7525n2872m1163q026j5750j3368k4089k1586k2158
$$ 1258797 1245624 1240222 1200216 1152691 1099819 1058656 1050630 1034880 1021512 997423 975837 953679
12304I53679o767K4194j5757m0915l8612l705N198l4310j4118M291m984j6371
$$ 953679 946912 971106 955349 914434 875822 872117 877315 843005 828887 833178 828194 811823
12292H11823K1470K9350k071l806Q235J0447O7994P6537Q9619O1177O8501P8383
$$ 811823 833293 862643 860572 856766 865001 875448 943442 1019979 1109598 1170775 1239276 1317659
12280A317659Q2808P7232K8852q15p4053q0118q5933p2494p2308p2296o5351P07
$$ 1317659 1400467 1477699 1506551 1505736 1431683 1351565 1265632 1193138 1120830 1048534 983183 983890
12268I83890m86l3874k4541P670j8857j1976r228p874k1973l0070k342J0112N244
$$ 983890 983404 949530 924989 932659 913802 901826 892598 884724 862751 832681 830339 840451 845695
12255H45695r297m806n40J7449l3564J0992Q863M645K926k6032L555L3995M5718
$$ 845695 836398 831592 831052 848501 814937 825929 834792 839437 842363 816331 819886 853881 899599
12242H99599L7675L6787L5952j4537r139k1597m2099m3129l1061l5479k7377k0022
$$ 899599 937274 974061 1010013 995476 986337 964740 922641 879512 848451 812972 785595 765573
12230G65573l3231k0536N570j4905J4363n069j246j7843l8847k1215q594r885
$$ 765573 732342 711806 717376 702471 716834 711765 710519 692676 653829 632614 624020 614135
12218F14135r93l355j1196k2638j9352J8758j2289k3772k6030k0983M744J806
$$ 614135 613142 609787 598591 575953 556601 575359 563070 539298 513268 492285 497029 498835
12206D98835j7690l534j224J2651m540k1914m6199k7809q979j1734j1556j4827
$$ 498835 481145 477611 476387 489038 484498 462584 416385 388576 379597 367863 356307 341480
12194C41480O707j7642j5050M865J9504J130q380K0940J3534J3515n147r800M545
$$ 341480 348187 330545 315495 320360 339864 340994 332614 353554 367088 380603 375456 365656 370201
12181C70201k1829n101j603k6184m2501l5252j3779j9763m303q592k7282r091
$$ 370201 348372 343271 341668 315484 272983 237731 223952 204189 199886 191294 164012 154921
12169A54921Q89J2392K5118K2927R1R766O559q716l0109j4279P848Q49j3917m25
$$ 154921 155810 168202 193320 216247 216338 226104 232663 223947 193838 179559 187407 188256 174339 173914
12155A73914K6121k700p949J3603l677m916n246N350j721j7375l9669j4328J220
$$ 173914 200035 197335 189386 202989 199312 194396 189150 194500 192779 175404 135735 121407 122627
12142A22627L279J6409O996m539j5813j0821K1943J2382k3611L26K2791K2407
$$ 122627 125906 142315 149311 144772 128959 118138 140081 152463 128852 129178 151969 174376
12130A74376k1618R911J4953l547k7675J1105q730j8720J6061M938J551J2436
$$ 174376 152758 162669 177622 174075 146400 157505 148775 130055 146116 151054 152605 165041
12118A65041Q193M5671L695j6195K7661J9441M18k7793K879M8157L8420N1994
$$ 165041 173234 218905 222600 206405 234066 253507 253925 226132 229011 277168 315588 367582
12106C67582P1288N3828N7598J9845K062K5436O89N598j8340J3701L7259P991
$$ 367582 438870 492698 550296 570141 572203 597639 598328 603926 585586 599287 636546 644537
12094F44537l4098l2416k3596k1864o4012p6034l9811P656j9731J221K5053p93
$$ 644537 610439 578023 554427 532563 468551 392517 352706 360362 340631 341852 366905 366112
12082C66112J1609K5664M5543M9124K0225M2015M3511L4432K5080R581r895J1353
$$ 366112 377721 403385 448928 498052 518277 560292 603803 638235 663315 672896 663001 674354
12070F74354R089K109O339q194M961Q770M4172M6586J6877M7709M2041O7137N2281
$$ 674354 683443 685552 691891 683697 688658 697428 741600 788186 805063 852772 894813 961950 1014231
12057A014231J3733m5993l7383m1313n8691r1702o8145m6892m2195l5680l3399
$$ 1014231 1027964 981971 944588 903275 844584 752882 684737 637845 595650 559970 526571
12046E26571m1131q30l585j2760J1015J3415L3420L9420N2477N5369J9401R157
$$ 526571 485440 484610 481025 468265 479280 492695 526115 565535 618012 673381 692782 701939
12034G01939J0453l8554j2998o5303n6712k2097l7028n2111k2976M890k2711O8
$$ 701939 712392 673838 660840 595537 538825 516728 479700 427589 404613 409503 386792 386860
12022C86860K7694N2687N5309O6339K0787J4193k3214n2932n6458n7896m8319
$$ 386860 414554 467241 522550 588889 609676 623869 600655 547723 491265 433369 385050
12011C85050l3755m8386j0357L106j7919k1097r455L790o81J149k8230o516j7066
$$ 385050 351295 302909 292552 295658 277739 256642 247187 250977 250296 251445 223215 216699 199633
11998A99633j0157J6291R422j6564R659k6354R141N559k5563J9235K8325j7196
$$ 199633 189476 205767 215189 198625 208284 181930 191071 196630 171067 190302 218627 201431
11986B01431P788k7491j91J8052J5990k5758n0837k6264M425J8575k0141N784
$$ 201431 209219 181728 181537 199589 215579 189821 138984 112720 117145 135720 115579 121363
11974A21363K1614n704m956J1997J2166l7680j1870L987J0435K348J8172J1994
$$ 121363 142977 137273 132317 144314 156480 118800 106930 110917 121352 123700 141872 153866
11962A53866m4760Q216J9818L833k3403O714K4795j3435m932r496j3483K4038
$$ 153866 109106 117322 137140 140973 117570 124284 149079 135644 130712 121216 107733 131771
11950A31771o893k243K2757L744q420p327J8455P803m1719j4278L3677K231J6994
$$ 131771 124878 122635 145392 149136 140716 133389 151844 159647 117928 103650 137327 139558 156552
11937A56552j2511j0307j9550r154K1963Q557l1152j773J8355R077R226j3655
$$ 156552 144041 133734 114184 105030 126993 135550 104398 102625 120980 130057 139283 125628
11925A25628P05M926M245J5089O35p057J0580M397k9941l0162J187J6359m97k256
$$ 125628 126333 131259 135504 150593 151228 144171 154751 159148 129207 99045 100232 116591 116094 113838
11911A13838j6211K3823M7444j3003k4036l162l0730J4028L2451m214J3320O650
$$ 113838 97627 121450 168894 155891 131855 128693 97963 111991 144442 140228 153548 160198
11899A60198p632J2728J1589n67k5272r796k0140j0539j43R42L1100L742j1819
$$ 160198 152566 165294 176883 176316 151044 141248 121108 110569 110426 111368 142468 146210 134391
11886A34391m269l100O707K2188J6130O844K7858l1806j7955J2218J1503k643
$$ 134391 130122 127022 133729 155917 172047 178891 206749 174943 156988 169206 180709 178066
11874A78066J0879k568Q782j9465O595M11K237j0484L826P88l8362j3635K8067
$$ 178066 188945 186377 195159 175694 182289 182700 184937 174453 178279 179067 140705 127070 155137
11861A55137J9171R002K0202j735K3522M0534p948j4752l5218k3041Q720K2938
$$ 155137 174308 183310 203512 201777 225299 265833 257885 243133 207915 184874 193594 216532
11849B16532N832n1295m3546M846J1069K2951K6740L8264O840L738R573j4401
$$ 216532 222364 171069 127523 132369 143438 166389 193129 231393 238233 241971 251544 237143
11837B37143m270m7699j9889M1856o237k0095K3216J9445J3658J8866M531L549
$$ 237143 232873 185174 165285 207141 200904 180809 204025 223470 237128 255994 260525 264074
11825B64074M8199L9277J03960J01321N9887K4832J882l9077m8593m5345o2385
$$ 264074 312273 351550 455510 556831 616718 641550 643432 604355 555762 510417 448032
11814D48032n1407n4529j1633m7323k560J2235K3114Q541l3677M593J6965J7242
$$ 448032 396625 342096 330463 283140 280580 292815 315929 324470 290793 295386 312351 329593
11802C29593K7975J3705M7801K6150N3221m684j3991Q34K3945L4647k97k2199
$$ 329593 357568 371273 419074 445224 498445 493761 479770 480604 504549 539196 538899 516700
11790E16700j1121M075L1809M5444K3533K7648K3474l3802l5925l8562k5220l9897
$$ 516700 505579 509654 541463 586907 610440 638088 661562 627760 591835 553273 528053 488156
11778D88156j8185J630J1095k3587k8902l489l1388k5505k2662j7600k4577k1323
$$ 488156 469971 471601 482696 459109 430207 426718 395330 369825 347163 329563 304986 283663
11766B83663j2107n010r76R97K7011K7N700p224j2011K0380J8283K6450P0080
$$ 283663 271556 266546 265570 266567 293578 293605 299305 292081 280070 300450 318733 345183 415263
11753D15263O7361L7419K3823j9825m5629m3622o6512n5226k6803k1510M642N68
$$ 415263 482624 520043 543866 524041 478412 434790 368278 313052 286249 264739 269381 269949
11741B69949j342j7798j8624m8111l8070o489J7305K1604J5427J6161O565J5159
$$ 269949 268607 250809 232185 184074 146004 139515 156820 178424 193851 210012 216577 231736
11729B31736L862K273j3963l7136l4036l292K9807L6314R960k2304k6402k256
$$ 231736 235598 237871 223908 186772 152736 149444 179251 215565 225525 203221 176819 174563
11717A74563J9564K815k0168k1416j3555L719J1464J5062j9419k7019l1844r337
$$ 174563 194127 196942 176774 155358 141803 145522 156986 172048 152629 125610 93766 84429
11705H4429K0331K4537J1352L5462K4856P374j9521l0087r193K5133O757m655
$$ 84429 104760 129297 140649 176111 200967 208341 188820 158733 149540 174673 181430 176775
11693A76775k6299k1361k853j036J0019K0052J2104L8284M389l994k3023m867
$$ 176775 150476 129115 126262 125226 135245 155297 167401 205685 210074 206080 183057 178190
11681A78190k4377J476J928J4942J8815J6893p965Q149j4052j9345J9928K0157
$$ 178190 153813 155289 157217 172159 190974 207867 199902 208051 193999 174654 194582 214739
11669B14739l0999J854J5827l9307l0183J2299K0924l1878m074J6660J2546L342
$$ 214739 183740 185594 201421 162114 131931 144230 165154 133276 129202 145862 158408 161750
11657A61750j217K951k547q673K6331K5751k6608j3404K4261J3743j4738m729
$$ 161750 160533 163484 160937 152264 178595 204346 177738 164334 188595 202338 187600 182871
11645A82871M527R090k2459l01O374J1983n522m1283j6941L419j824K3493L2330
$$ 182871 187398 196488 174029 173728 180102 192085 186563 145280 128339 131758 129934 153427 185757
11632A85757K8509O181l1212j5795J2047q574r113n849J3215K3753K0217k1128
$$ 185757 214266 220447 189235 173440 185487 176913 167800 161951 175166 198919 219136 198008
11620A98008l1372K323k243j0441Q076J7302K3348n998k0456K6699N628K5247
$$ 198008 166636 168959 166716 156275 164351 181653 205001 199003 178547 205246 210874 236121
11608B36121R064k1135l6232n408P926J8064j1209j8496q469j646N764N619j730
$$ 236121 245185 224050 187818 182410 190336 208400 197191 178695 170226 168580 174344 179963 178233
11595A78233l1290k5141m304k0068j3728L899K2926L1374l12K1247J5741m381
$$ 178233 146943 121802 117498 97430 83702 87601 110527 141901 141589 162836 178577 174196
11583A74196J0709K7998J4358k2698r308K540p30q405J2968L906J5096J638k676
$$ 174196 184905 212903 227261 204563 195255 197795 197065 188660 201628 205534 220630 222268 219592
11570B19592j9749j6113k5125j6336J6257P288M258n805O381K7146q796Q223K097
$$ 219592 199843 183730 158605 142269 158526 165814 170072 164267 170648 197794 188998 197221 199318
11557A99318n889J1502J3410L2099M5302J8923P060M5484J9096N6382J04077J16415
$$ 199318 193429 204931 218341 250440 295742 314665 321725 367209 386305 442687 546764 663179
11545F63179J15760J10532N4646j0162l8189m1829o7924n3547l2696m5885m4320
$$ 663179 778939 889471 944117 933955 895766 853937 786013 732466 699770 653885 609565
11534F09565n0722l8514J2168J7036O745j8515m2297j092J4438K1815r584k5366
$$ 609565 558843 520329 532497 549533 556278 537763 495466 494374 508812 530627 521043 495677
11522D95677K20M4247P8389N0003O8778N9350J8690L1992K4133J5883J1670M8701
$$ 495677 495897 540144 618533 668536 737314 796664 815354 847346 871479 887362 899032 947733
11510I47733P0034K8108K9356p013n2853m3945j0386K649k7862j8001M8080L0016
$$ 947733 1017767 1045875 1075231 1068218 1015365 971420 961034 963683 935821 917820 965900 995916
11498I95916L2895J5248k506M4907Q9262O8634L3374O040j0574m2188r2103o6364
$$ 995916 1028811 1044059 1041553 1086460 1175722 1244356 1277730 1283770 1273196 1231008 1138905 1072541
11486A072541o7894n5139j1437L295J4862R707o39j582K9357J5641L3143P0387
$$ 1072541 1004647 949508 938071 941366 956228 965935 965296 963714 993071 1008712 1041855 1112242
11474A112242P5050P4804P8961M2839L7338K2207j6117m4313n9612m7992r98j4046
$$ 1112242 1187292 1262096 1341057 1383896 1421234 1443441 1427324 1383011 1323399 1275407 1274409 1260363
11462A260363q578K9390K4743N7654P9059O7165O1052K4526j7621k2735l2478
$$ 1260363 1251785 1281175 1305918 1363572 1442631 1509796 1570848 1595374 1577753 1555018 1522540
11451A522540j6564M404o356p135j0103K2879n85K5468j0234j2283J3364j3434
$$ 1522540 1505976 1510380 1504024 1496889 1486786 1509665 1509080 1534548 1524314 1512031 1525395 1511961
11439A511961M277K1277L0254O2168O3264M5456L2387P6787R5287J22283J73821
$$ 1511961 1516238 1537515 1567769 1629937 1693201 1738657 1771044 1847831 1943118 2065401 2239222
11428B239222J86775K16746K27442K37403K73773K44056K28959J86433J45321
$$ 2239222 2425997 2642743 2870185 3107588 3381361 3625417 3854376 4040809 4186130
11419D186130J68917K26889L18623M28693N20638O70791Q61065J109862J491312
$$ 4186130 4355047 4581936 4900559 5329252 5849890 6520681 7381746 8491608 9982920
11410I982920K003847K722948L770716N394421P830299J1021525J4020363J5100419
$$ 9982920 11986767 14709715 18480431 23874852 31705151 42726676 56747039 71847458
11402G1847458J3037837Q101595J008800p093637j3380873j4907737j2302798
$$ 71847458 84885295 92986890 93995690 86902053 73521180 58613443 46310645
11395D6310645q687772n842057l906527k645699j896675j340378q50497m33168
$$ 46310645 37622873 31780816 27874289 25228590 23331915 21991537 21141040 20707872
11387B0707872k6001M80985J171559K115022L383041M798760N720444O146388
$$ 20707872 20681871 21162856 22334415 24449437 27832478 32631238 38351682 44498070
11379D4498070O340321N749958L604162J320410J90644r29958j983742p16761
$$ 44498070 50838391 56588349 60192511 61512921 61703565 60773607 58789865 58073104
11371E8073104L055318P502803J0665667J1048991Q445078L796222k179130p634081
$$ 58073104 61128422 68631225 79296892 90345883 98790961 102587183 100408053 92773972
11363I2773972r553035p267759l621762j122012j24568n89898k795037n197447
$$ 92773972 83220937 75953178 72331416 71209404 71084836 70494938 67699901 62502454
11355F2502454n755013n648608o151799o021909m773190l341358k229795j482988
$$ 62502454 56747441 51098833 44947034 38925125 34151935 30810577 28580782 27097794
11347B7097794r49922n02411j16831J82263N64257J083379J760454K657192M071916
$$ 27097794 26147872 25645461 25528630 25710893 26275150 27358529 29118983 31776175 35848091
11338C5848091O174771Q865725J1447318J2446185J0714930O352590J01868o996613
$$ 35848091 42022862 50888587 62335905 74782090 85497020 91849610 91951478 84954865
11330H4954865j2561517j4112905j2022400q686486n953226m148069l041709k324425
$$ 84954865 72393348 58280443 46258043 37571557 31618331 27470262 24428553 22104128
11322B2104128j827146j520439j279541j107981r19512p65758o51302n77902m57051
$$ 22104128 20276982 18756543 17477002 16369021 15449509 14683751 14032449 13454547 12997496
11313A2997496l63760l39753l12703l08396l55264l61811l66728l68833l50909
$$ 12997496 12633736 12293983 11981280 11672884 11317620 10955809 10589081 10220248 9869339
11304I869339l81706l58330l77422l53593l46523l40903l06544k71187k40026
$$ 9869339 9487633 9129303 8751881 8398288 8051765 7710862 7404318 7133131 6893105
11295F893105k42546k52680j97948k09824k14624j85511j88086j47721j12186
$$ 6893105 6650559 6397879 6199931 5990107 5775483 5589972 5401886 5254165 5141979
11286E141979j26289j21856j25281j33422j56282j72194j38058j46049j24979
$$ 5141979 5015690 4893834 4768553 4635131 4478849 4306655 4168597 4022548 3897569
11277C897569r5501j46393j45355r6707m5997j6565k5123q0177j10513q8405n7936
$$ 3897569 3802068 3655675 3510320 3413613 3367616 3351051 3325928 3245751 3135238 3046833 2988897
11266B988897o7217n8725l5715n8171j00492q1426o0723o8224n5923k2057n7441
$$ 2988897 2921680 2862955 2827240 2769069 2668577 2587151 2526428 2458204 2402281 2380224 2322783
11255B322783o2133k6512k5309k1065k2996J7686L745L141l182k1733m8166j06710
$$ 2322783 2260650 2234138 2208829 2187764 2164768 2182454 2186199 2189340 2186158 2164425 2116259 2009549
11243B009549j06271r2709o8196m4495m8402m0486m2626l2373k8810j0788p310
$$ 2009549 1903278 1810569 1742373 1697878 1649476 1608990 1566364 1533991 1505181 1494393 1487083
11232A487083n453n1902l5037J0319Q53l4640m4253L6189N5458J9396p574l6341
$$ 1487083 1481630 1429728 1394691 1405010 1405863 1371223 1326970 1363159 1418617 1438013 1430439 1394098
11220A394098o101L7687J5996k599K022M6539M4634L6880L1893N3085L8164q500
$$ 1394098 1387997 1425684 1441680 1439081 1441103 1487642 1532276 1569156 1601049 1654134 1692298 1683798
11208A683798m1530n2373q1210m1627n351m662l7362m5989k5210n9387l7536m1165
$$ 1683798 1642268 1589895 1508685 1467058 1461707 1457045 1419683 1373694 1348484 1289097 1251561 1210396
11196A210396k8577k461L0552N2393J5135J9337K840L513j1849k9043j836N129
$$ 1210396 1181819 1179358 1209910 1262303 1277438 1296775 1299615 1303128 1291279 1262236 1260400 1265529
11184A265529J3988M660n033j0558L6427O2888M8507O3049P0021N1095N7803O5481
$$ 1265529 1279517 1284177 1279144 1268586 1305013 1367901 1416408 1479457 1549478 1600573 1658376 1723857
11172A723857M1218j6118l0266l2013m2238l1404k7001j911j4497q406K3057L4845
$$ 1723857 1765075 1748957 1718691 1686678 1644440 1613036 1586035 1584124 1569627 1561221 1584278 1619123
11160A619123L6979Q8892O5186K4080P6369J11483J47467J56217J77314J97978
$$ 1619123 1656102 1744994 1810180 1834260 1910629 2022112 2169579 2325796 2503110 2701088
11150B701088K17047K58226K14067K41931K56378K39182K41431K94813L43636
$$ 2701088 2918135 3176361 3390428 3632359 3888737 4127919 4369350 4664163 5007799
11141E007799M22604N29370O71471R10275J238932J624773K207427L103614M448302
$$ 5007799 5430403 5959773 6631244 7541519 8780451 10405224 12612651 15716265 20164567
11132B0164567O517619R458359J2655735J4303866J2819915Q551937K269854n652171
$$ 20164567 26682186 36140545 48796280 63100146 75920061 84471998 86741852 81089681
11124H1089681j2432561j4443992j2021918q434106n598077l769856k589594j804980
$$ 81089681 68657120 54213128 42191210 33757104 28159027 24389171 21799577 19994597
11116A9994597j280893r37430n72052k83658K0594K82922N69768R12201J373722
$$ 19994597 18713704 17776274 17204222 16920564 16941158 17224080 17793848 18706049 20079771
11107B0079771J961142K687446L527303M430101N183921N615239N641105N301352
$$ 20079771 22040913 24728359 28255662 32685763 37869684 43484923 49126028 54427380
11099E4427380M542435L622830L175952L155506L770596N273958O491409O012646
$$ 54427380 58969815 62592645 65768597 68924103 72694699 77968657 84460066 90472712
11091I0472712L989115J018593k716438o295369p686684o339272l830915k018981
$$ 90472712 94461827 95480420 92763982 86468613 78781929 72442657 68611742 66592761
11083F6592761j358002j238745j247114j778971k877931l839989m426902m723773
$$ 66592761 65234759 63996014 62748900 60969929 58091998 54252009 49825107 45101334
11075D5101334m674925m121160l457425k755487k029105j522196j146695q36065
$$ 45101334 40426409 36305249 32847824 30092337 28063232 26541036 25394341 24558276
11067B4558276n87880k40737P3711M71566J001626J656284K524914L832241N885844
$$ 24558276 23970396 23729659 23803370 24274936 25276562 26932846 29457760 33290001 39175845
11058C9175845Q824179J2322562J4846002J4232826J0108280L749694m488431
$$ 39175845 48000024 60322586 75168588 89401414 99509694 103259388 98770957
11051I8770957j2882869j6827343j5095314j1029767p486215n113186l653845
$$ 98770957 85888088 69060745 53965431 42935664 35449449 30336263 26682418
11044B6682418k734294k152026j774495j486238j213589r83346p98042o71775
$$ 26682418 23948124 21796098 20021603 18535365 17321776 16338430 15540388 14868613
11036A4868613n78965m74828l95369l62475l60230l45680l39527l68149l95822
$$ 14868613 14289648 13814820 13419451 13056976 12696746 12351066 12011539 11643390 11247568
11027A1247568l99538m17204m22675m15334m30843m18768l67737l52741l40797
$$ 11247568 10848030 10430826 10008151 9592817 9161974 8743206 8375469 8022728 7681931
11018G681931l19961k68846k64327k83492k49602k15590k15058j82592j53242
$$ 7681931 7361970 7093124 6828797 6545305 6295703 6080113 5865055 5682463 5529221
11009E529221j70142j80505j72047j50613j32739j27833j33402j61936j73809
$$ 5529221 5359079 5178574 5006527 4855914 4723175 4595342 4461940 4300004 4126195
11000D126195j49364r7446r1212j19174j14084p2202j01771j07823r0066o7597
$$ 4126195 3976831 3879385 3788173 3668999 3554915 3482713 3380942 3273119 3183053 3115456
10990C115456r7322n5784p3288q5155n6432n6034p6808p3539l5554n2331k8948
$$ 3115456 3018134 2962350 2889062 2803907 2747475 2691441 2614633 2541094 2505540 2453209 2424261
10979B424261j1725j9694m0547j0996k8443k2470p7894r5808o0841o4184p0971
$$ 2424261 2412536 2392842 2352295 2341299 2312856 2290386 2212492 2116684 2055843 1991659 1920688
10968A920688p5741o5203n3635n3836m0032n0541m6570m2852n5322k6165n989
$$ 1920688 1844947 1779744 1726109 1672273 1632241 1581700 1535130 1492278 1436956 1410791 1404802
10957A404802l5699k4972p08j0571j8919j6195r460k5255j9334k9453m3084k0659
$$ 1404802 1369103 1344131 1343423 1332852 1313933 1297738 1288278 1263023 1243689 1214236 1171152 1150493
10945A150493m223M7701N6726N5692L7120J2213J715j7935l1315o3460n6468j9964
$$ 1150493 1146270 1193971 1250697 1306389 1343509 1355722 1357437 1339502 1308187 1244727 1188259 1168295
10933A168295n469n0241q7384o8107m5831l5571m2332k0328m1798j9872m075k5157
$$ 1168295 1162826 1112585 1025201 957094 911263 875692 833360 813032 771234 751362 747287 722130
10921G22130o516o005k218J0716j2364q527P266Q509N6629N7364L4795M5782M1483
$$ 722130 715614 709609 707391 718107 705743 697216 704482 712991 769620 826984 861779 907561 949044
10908I49044O4874L0829l6273n5354o1707n1360o9005m0604k2777k8195k1137
$$ 949044 1013918 1044747 1008474 953120 891413 840053 771048 730444 707667 679472 658335
10897F58335j8842k8962j6058l2277l3381q315j090j3947o008k496m2583n1869
$$ 658335 639493 610531 594473 562196 528815 520500 519410 505463 499455 496959 454376 402507
10885D02507j0466j701l1753k5555m713q074L005j51K8185L1330J4521J7753k4174
$$ 402507 392041 390340 358587 333032 328319 320245 323250 323099 351284 382614 397135 414888 390714
10872C90714l1458k2604J3087K9604Q906L4132M3171M4604K1962p959l4687k8636
$$ 390714 359256 336652 349739 379343 388249 422381 465552 510156 532118 524159 489472 460836
10860D60836k4631p077k8433q599m089k0273J6839j5514j6219k7952m6598o044
$$ 460836 436205 429128 400695 392096 388007 367734 384573 369059 352840 324888 278290 272246
10848B72246Q629l0777L498K3387k434n49j3926J6265R354L453j0288j2460K2161
$$ 272246 280875 250098 253596 276983 274549 274000 260074 276339 285693 289146 278858 266398 288559
10835B88559j0969j6475l894Q897L7477J0693k6554k3308R267Q983J675J4510
$$ 288559 277590 261115 257221 266118 303595 314288 287734 264426 273693 282676 284351 298861
10823B98861O905l564j2185l0662j9740k90J297J6535O83Q652K2480k6261k8314
$$ 298861 305766 302202 290017 259355 239615 239325 240622 257157 257840 266492 288972 262711 234397
10810B34397J0061J1535m093Q302K2464p767k680J6625K7361R320K3675l1334
$$ 234397 244458 255993 251900 260202 282666 274899 272219 288844 316205 325525 349200 317866
10798C17866j2400j6860r636l2651j3523M50J843j2060J4902J8242L328k5097
$$ 317866 305466 288606 278970 246319 232796 233246 235089 223029 237931 256173 259501 234404
10786B34404m2613k4248l3231m951K3786P535J7549J8934n137L656p079K0919
$$ 234404 191791 167543 134312 129361 153147 160682 178231 197165 192028 195684 188605 209524
10774B09524o680k7057j7214q865j7569P828K1543L3765J597k6512m418P047L107
$$ 209524 202844 175787 158573 149708 132139 139967 161510 195275 196872 170360 165942 172989 176096
10761A76096J1551L310R711J6099L7539L2861J1439J2766J5784p923j0122m7571
$$ 176096 187647 190957 200668 216767 254306 287167 298606 311372 327156 319233 309111 261540
10749B61540n777J7292k2649k9094j6436J575l609l0359k9793j8424K2737O531
$$ 261540 255763 273055 250406 221312 204876 206451 202842 172483 142690 124266 147003 153534
10737A53534K506L0347p79n050J0769J0949J7260j6369J7967J4991m915L5480
$$ 153534 156040 186387 185608 180558 191327 202276 219536 203167 221134 236125 231210 266690
10725B66690M5350J1027K5680J2302L9144N6984P9664M3529R255k7097r7218q5949
$$ 266690 312040 323067 348747 361049 400193 457177 536841 580370 589625 562528 465310 379361
10713C79361P96L5059J5844j3617j766M1956O6636M6973P2124O1772L9557j3274
$$ 379361 380157 415216 431060 417443 415677 457633 524269 571242 643366 705138 744695 731421
10701G31421k1460k0898m2292o6598l7654q138p813J1980M5808Q6284J11377J70769
$$ 731421 709961 689063 646771 580173 542519 534381 526568 538548 584356 670640 782017 952786
10689I52786K44842K75992K83102L47151L74055K10815P5040J16837m3015k83338
$$ 952786 1197628 1473620 1756722 2103873 2477928 2688743 2763783 2880620 2837605 2554267
10679B554267k79267k32813k68129k71304k04014j44688j22597m8884j8022N168
$$ 2554267 2275000 2042187 1774058 1502754 1298740 1154052 1031455 982571 964549 969717
10669I69717L3644l271m7515j4521j8327j3586m0879n0105m2717m4314j4124Q17
$$ 969717 1003361 1000090 952575 938054 919727 906141 865262 815157 772440 728126 714002 714819
10657G14819L1292j0852m8855l4143j3185l5409o2957k3258l4517o8816N663J8749
$$ 714819 746111 735259 686404 652261 639076 603667 540710 517452 482935 414119 419782 438531
10645D38531j7585J390N715n885J8295K0829L03j1757M635K8220M6964K9856M2776
$$ 438531 420946 422336 428051 422166 440461 461290 461593 449836 454471 482691 529655 559511 602287
10632F02287N9606M6543P2322J4004l7174o1205q2401o7922o6918m5558l0561
$$ 602287 661893 708436 780758 794762 757588 696383 613982 546060 479142 433584 403023
10621D03023m2132k7814j1479j9908k5771n954N006J4831N026k0781P319k239
$$ 403023 360891 333077 321598 301690 275919 269965 274971 289802 294828 274047 281366 279127
10609B79127k0166p528N327j1655J6214k7300n6007j3841n412o601J0674L3578
$$ 279127 258961 251433 256760 245105 261319 234019 178012 164171 158759 152158 162832 196410
10597A96410L8271J7604o105M88m023p31r099K0819K343J537J7905L0477N048
$$ 196410 234681 252285 246180 246668 242645 241914 232815 253634 255977 257514 275419 305896 310944
10584C10944j6650j9570j2867k1898j6700m175K9208q113r347l1915j7628J7058
$$ 310944 294294 274724 261857 239959 223259 219084 248292 240179 230832 198917 181289 198347
10572A98347N43j1053N434J1366k4094n682M102r879k718j5536O14L5771O6484
$$ 198347 198890 187837 193271 204637 180543 174861 178963 169084 166366 150830 151444 187215 253699
10559B53699n311K6496L9604L1377j6734j5867k8983k1097l5725n927L509k4940
$$ 253699 248388 274884 314488 345865 329131 313264 284281 263184 227459 221532 225041 200101
10547B00101l8520k1618K0809K5940L9764M4743K5926j186j1455L313p771k842
$$ 200101 161581 139963 160772 186712 226476 271219 297145 295959 284504 287817 280046 277204
10535B77204k041J5845K053j9811k9512K414J863k4092j5445R501J6016J4013
$$ 277204 275163 291008 293061 273250 243738 246152 248015 223923 208478 217979 233995 248008
10523B48008j1255mK3753N1983J9036K981M5242L7307M5565K6061M9711L2639
$$ 248008 236753 236749 260502 312485 331521 334502 379744 417051 462616 488677 538388 571027
10511E71027O187O380k5145l2147m4377k0291j9365k7871k0057l3368k0821k1445
$$ 571027 577214 583594 558449 526302 481925 461634 442269 414398 394341 360973 340152 318707
10499C18707j1298M261k073j0950K5887K7378k169J126K3466j1096K890l7310
$$ 318707 307409 311670 309597 298647 324534 351912 349743 350869 374335 363239 366129 328819
10487C28819K004m421m3555m0139j9051l7322p8563n1288o3786p0602o5360n3453
$$ 328819 330823 326402 282847 242708 223657 186335 107772 56484 -7302 -77904 -143264 -196717
10475a96717p3849k0053R316j5477J2236O0448M5920P1926N6258O0789O0404L3638
$$ -196717 -270566 -290619 -281303 -296780 -284544 -224096 -178176 -106250 -49992 10797 71201 104839
10463A04839N6569N0778Q630J4978L0649N2505M4121j465M024j9469j9418N43
$$ 104839 161408 212186 220816 235794 266443 318948 363069 361604 365628 346159 326741 327284
10451C27284k3839q603m859J4805M6952M128N305P273L3174M4233K1811L0894
$$ 327284 303445 294842 289983 304788 351740 355868 361173 368446 401620 445853 467664 498558
10439D98558M9109Q0052J5726j3026K954j7056j9496k5773r666M854J1296L3380
$$ 498558 547667 627719 643445 630419 633373 616317 596821 571048 561382 566236 577532 610912
10427F10912M1660J5277j291P257M1338O3646M6561J6671J6637N0196K5755j827
$$ 610912 652572 667849 666558 673815 715153 778799 825360 842031 858668 908864 934619 932792
10415I32792J2320M2366L4706L240k7159J0460L8498O733j4520l7327K756o86
$$ 932792 945112 987478 1022184 1025424 998265 1008725 1047223 1053956 1039436 1002109 1004865 1004179
10403A004179l0648l6665k8777J6713M550l6606l4579J5364N1621M5427j5321
$$ 1004179 973531 936866 908089 924802 929352 892746 858167 873531 925152 970579 955258
10392I55258k6169K2473K8908j2453j8219J3683j7901N545M6803L0077J9918M3092
$$ 955258 929089 951562 980470 968017 949798 963481 945580 951125 997928 1028005 1047923 1091015
10380A091015L7844L2622M6765J6930o659J727K3254K5843k1686k3697J5374M7015
$$ 1091015 1128859 1161481 1208246 1225176 1218517 1220244 1243498 1269341 1247655 1223958 1239332 1286347
10368A286347L899k2928j2675J451k1979k8843l6847q542J8695P172n166o205
$$ 1286347 1290246 1267318 1254643 1256094 1234115 1205272 1168425 1159883 1178578 1185750 1180584 1174379
10356A174379L0758J3144N862k0275n677M2861O7372O9634Q7293J06017J42246
$$ 1174379 1205137 1218281 1224143 1203868 1198191 1241052 1308424 1378058 1465351 1571368 1713614
10345A713614J62550J40518R3379N9908L4137q927n605q825m3870k3583K9713
$$ 1713614 1876164 2016682 2110061 2169969 2204106 2195179 2189574 2180749 2136879 2113296 2143009
10334B143009M4898L6983M3381N9699R5873Q9684J13455R7408J56954J64741J44069
$$ 2143009 2187907 2224890 2268271 2327970 2423843 2513527 2626982 2724390 2881344 3046085 3190154
10323C190154J49086J45693J65380J52027J75856J73365J56775J52220K49388
$$ 3190154 3339240 3484933 3650313 3802340 3978196 4151561 4308336 4460556 4709944
10314D709944L05534K95626M04066N44832O70662Q64852J104171J334406J503340
$$ 4709944 5015478 5311104 5715170 6260002 6930664 7795516 8899687 10234093 11737433
10305A1737433J622237J633375J761534J676012J668486J852417K106626K399272
$$ 11737433 13359670 14993045 16754579 18430591 20099077 21951494 24058120 26457392
10297B6457392L040782L959980N241543P378443J1035952J7195674K7886942M2524876
$$ 26457392 29498174 33458154 38699697 46078140 57114092 74309766 102196708 144721584
10289A44721584N1819164N2891811O0356601O9428647M6671095J7079629J4977652
$$ 144721584 196540748 249432559 309789160 379217807 425888902 442968531 457946183
10282D57946183R653456l4643837o6503730n3358225m1199318n4253613n6194178
$$ 457946183 467599639 432955802 366452072 313093847 271894529 217640916 161446738
10275A61446738l7240064k2220407j3973409r583129p187900n594022m341031
$$ 161446738 124206674 101986267 88012858 78429729 71241829 65647807 61306776
10268F1306776l605658l227376k656457k099280j914456j702068j376962j209066
$$ 61306776 57701118 54473742 51817285 49718005 47803549 46101481 44724519 43515453
10260D3515453j411203j419833j243915j313956j581002j635215j556886j517523
$$ 43515453 42104250 40684417 39440502 38126546 36545544 34910329 33353443 31835920
10252C1835920j498812j455539j433392j389888j285025j167475j068937r89798
$$ 31835920 30337108 28881569 27448177 26058289 24773264 23605789 22536852 21547054
10244B1547054q94912q33451p68579p20582o63973n97074n55079n40292n26753
$$ 21547054 20652142 19818691 19050112 18329530 17665557 17068483 16513404 15973112 15446359
10235A5446359m93029m42281m46457m85074m67414m57067m36876m17249l59839
$$ 15446359 14953330 14511049 14064592 13579518 13112104 12655037 12218161 11800912 11441073
10226A1441073l46744l22729k98293l11642l17245k41453k27092k35412k58707
$$ 11441073 11094329 10771600 10473307 10161665 9844420 9602967 9375875 9140463 8881756
10217H881756k53301k58335k17698k08206k72795k47479k62657k42755k10081
$$ 8881756 8628455 8370120 8152422 7944216 7671421 7423942 7161285 6918530 6708449
10208F708449k11573k17526j87481j98420j62559j59401j27801j13440j51510
$$ 6708449 6496876 6279350 6091869 5893449 5730890 5571489 5443688 5330248 5178738
10199E178738j50784j46198j21343j37008j81514j30839j03066j12547j09973
$$ 5178738 5027954 4881756 4760413 4623405 4441891 4311052 4207986 4095439 3985466
10190C985466j18809j28464j23203r6175j13553r0658p6494j05263q9889r0155
$$ 3985466 3866657 3738193 3614990 3518815 3405262 3314604 3238110 3132847 3042958 2952803
10180B952803n3560o6175j02420q4210p5191p6764m8846l0751o3098m4322m7854
$$ 2952803 2899243 2833068 2730648 2646438 2571247 2494483 2445637 2414886 2351788 2307466 2259612
10169B259612l1572m6561o3442q7536n5795o2483n7182m7381p1495r4089o7208
$$ 2259612 2228040 2181479 2118037 2030501 1974706 1912223 1855041 1807660 1736165 1642076 1574868
10158A574868k3712l3258q9621r2357o4647m5221m8348o2042n4077q1228m5153
$$ 1574868 1551156 1517898 1428277 1335920 1271273 1226052 1177704 1115662 1061585 980357 935204
10147I35204p3954p6217q1316m5148l2319j5447k6906k6741k0719k4997o7611
$$ 935204 861250 785033 703717 658569 626250 610803 583897 557156 536437 511440 443829
10136D43829j9077j8572m5727l3306o0534o2241n134K4513K293R854N0766J7806
$$ 443829 424752 406180 360453 327147 266613 204372 199238 223751 226044 235898 286664 304470
10124C04470M3909L007j6926K8053J8802j8019j6777k9042k5977L000Q252J4250
$$ 304470 348379 351386 334460 362513 381315 363296 346519 317477 291500 294500 302752 317002
10112C17002J4217N910j3665K0352K8829P217J6870K3212L5713L6071R022J1118
$$ 317002 331219 337129 323464 343816 372645 379862 396732 419944 455657 491728 500750 511868
10100E11868M7449M0330N1795J23468J27098N6810M8216L1437l5452p6292n5901
$$ 511868 559317 599647 651442 774910 902008 958818 1007034 1038471 1003019 926727 870826
10089H70826n2859p7936q2266l7989m7548m9025l6302l2004l5168n055K3643p168
$$ 870826 817967 740031 657765 619776 572228 523203 486901 454897 419729 414674 438317 431149
10077D31149r293k3180k1357p814j6428j2022j3347k4862M4942L0640J99J5059
$$ 431149 421856 398676 377319 369505 353077 341055 327708 302846 347788 378428 378627 393686
10065C93686J250o848o006K3660J8283J4168k0829l8719j1102j1612q66k1546
$$ 393686 394936 388088 382082 405742 424025 438193 417364 378645 367543 355931 355065 333519
10053C33519K19L2784J1176n209K081M7274K7862Q645L5738k105j0762M144P013
$$ 333519 333738 366522 377698 372489 374570 421844 449706 458351 494089 491984 481222 485366 492379
10040D92379J3559k9536k6508l2300L285k943L901q650q203j4392n299K3595K3608
$$ 492379 505938 476402 449894 417594 420879 417936 421837 413187 404984 390592 385293 408888 432496
10027D32496K5293J8406L4085N4521O9778Q0874R8832K07000M58741P20492O45545
$$ 432496 457789 476195 510280 564801 634579 715453 814285 1021285 1480026 2200518 2846063
10016B846063L01372J81426n5010r71040p93512l82725j61925r0412p8229k0383
$$ 2846063 3147435 3328861 3273851 2302811 1509299 1126574 964649 874237 796008 775625
10006G75625L004p358l3933l3558j2293m0164k5176n830j0841J8499k2867m0923
$$ 775625 778629 771271 737338 703780 691487 651323 626147 620317 609476 627975 605108 564185
9994E64185l8388l971j1477k9545n0185l8729l2172j8607K3739J2386J4424N795
$$ 564185 525797 521826 510349 480804 430619 391890 359718 341111 364850 377236 391660 397455
9982C97455J6901J3856m145l58J1068Q750Q291j7332k5262q456J3241L7628K5308
$$ 397455 414356 428212 424067 423709 434777 443527 451818 434486 409224 400768 414009 451637 476945
9969D76945M3417M3812R650R89j5697j8335j5897j8395k6765l4537k1455j6418
$$ 476945 520362 564174 573824 574813 559116 540781 524884 506489 479724 445187 423732 407314
9957D07314j1319J1214J3207j5898l1523k0781J1690K4851r194O625L2912L630
$$ 407314 395995 407209 420416 404518 372995 352214 363904 388755 379561 386186 419098 422728
9945D22728K9875J0270k9617k6920m2833R470L2691M80k1835j6314K4722O085
$$ 422728 452603 462873 433256 406336 363503 372973 405664 406144 384309 367995 392717 398802
9933C98802k9082R77J3699K7773L1690Q198j4200j3789l7204j5519k0843N567
$$ 398802 369720 370697 384396 412169 443859 452057 437857 424068 386864 371345 350502 356069
9921C56069K1186j1431q228K3861j7544k8851m334J4694j0140P714L5799K48K1355
$$ 356069 377255 365824 357596 381457 363913 335062 330728 345422 335282 342996 378795 379043 400398
9908D00398K9711K479L3594J1024j877p647J0197k0596l5757k9102j4807J4066
$$ 400398 430109 432588 466182 477206 475329 467682 477879 457283 421526 392424 377617 391683
9896C91683J7395J7033q55K583K1090M2468j6807L3883Q0133R3939J66298K13328
$$ 391683 409078 426111 425256 427839 448929 491397 474590 508473 588606 682545 848843 1062171
9884A062171K71838K89723K97384L62778K53065J11510P2840N9299j64571l21135
$$ 1062171 1334009 1623732 1921116 2283894 2536959 2648469 2721309 2780608 2616037 2294902
9874B294902l10580k66260k90047k75517k14000j10426m6718k8300m6081p2936
$$ 2294902 1984322 1718062 1428015 1152498 938498 828072 781354 753054 706973 634037
9864F34037m2220n1677l4703l599k7383j0665k08K848j5894k6792l7324l966L218
$$ 634037 591817 540140 505437 501838 474455 463790 463582 466430 450536 423744 386420 382454 385672
9851C85672J365k0625j8489J4623R937j8663j5336n726j6317k8454k0043R511
$$ 385672 387037 366412 347923 362546 372483 353820 338484 332758 316441 287987 267944 277455
9839B77455j7332J2865j7554m1285K3281K0746k704j7077r448j1054J3164L1604
$$ 277455 260123 272988 255434 214149 237430 258176 255472 238395 228947 217893 231057 262661
9827B62661j8906o015K7100p708n897J0462n339q111o409j6595K096j3653k6444
$$ 262661 243755 237740 264840 257132 251235 261697 256358 248247 241838 225243 227339 213686 187242
9814A87242k592m666n224j4429k0196j1084K6469j3709L096K4190N721q974j2388
$$ 187242 184650 179984 174760 160331 140135 129051 155520 141811 144907 169097 174818 165844 153456
9801A53456Q844j957J8929K8725J4076o958j7142K3653n88k0768J5961J8185r75
$$ 153456 162300 160343 179272 207997 222073 215115 197973 221626 221038 200270 216231 234416 233441
9788B33441k108J8246J7602K477j9090j8267J525P422P945K714m2495l8815K5518
$$ 233441 231333 249579 267181 269658 250568 232301 233826 241248 249193 251907 209412 170597 196115
9775A96115L8444J1535J6301k70K6818N5773Q412m4016k7413j4216q655J3033
$$ 196115 234559 246094 262395 262125 288943 344716 353128 309112 281699 267483 258828 271861
9763B71861L654n492p898j3851J4562L1456P669p005K995N357L9247M7725L1006
$$ 271861 275515 270023 262125 248274 262836 294292 301961 294956 297951 303308 342555 390280 421286
9750D21286q338P664M933J3636J0311P73K2165K8623P638m885o083j778o792K7155
$$ 421286 412948 420612 425545 439181 449492 450265 472430 501053 508691 503806 497723 495945 489153 516308
9736E16308O278o406j308p059K966J3366K9310Q155M774k5747n576J7223j5597
$$ 516308 522586 516180 514872 507813 510779 524145 553455 561610 566384 540637 535061 552284 536687
9723E36687j2508J9890J623K0788L2617L566J4911K6752L2433N9100K2168k8678
$$ 536687 524179 544069 545692 566480 599097 602663 617574 644326 676759 735859 758027 729349
9711G29349k7463K949J3885p150J0877J5330o372n416m132R483Q992J236J7801
$$ 729349 701886 704835 718720 711570 722447 737777 731405 725989 721857 731340 740332 741568 759369
9698G59369j910J5244O3757K3707K723R497J0888j5591M798L6081N387J5567N6534
$$ 759369 757459 772703 836460 860167 862890 872387 883275 867684 872482 908563 913950 929517 986051
9685I86051N5650L6217M2061K0328j9726l3773L3415O0913J7011M0471N7393O7774
$$ 986051 1041701 1077918 1119979 1140307 1120581 1086808 1120223 1181136 1198147 1238618 1296011 1363785
9673A363785N5927K3574J2336K7532N2833O9123O8722P1146R0597P2728J00084
$$ 1363785 1419712 1443286 1455622 1483154 1535987 1605110 1673832 1744978 1835575 1908303 2008387
9662B008387J24261J86445K31662L04425L14841L59197M83676O16536Q19395J120281
$$ 2008387 2132648 2319093 2550755 2855180 3170021 3529218 4012894 4629430 5448825 6569106
9652F569106J609243K221409K942845L394246L247326K382036R97992p16936k369087
$$ 6569106 8178349 10399758 13342603 16736849 19984175 22366211 23364203 22647267 20278180
9643B0278180l279251l068610k312826j594526j067417p02015m98712l22806k25355
$$ 20278180 16998929 13930319 11617493 10022967 8955550 8253535 7754823 7432017 7206662
9634G206662j61830n7973L6016J56075K34841L69578N23285P90742J118811J435592
$$ 7206662 7044832 6986859 7022875 7178950 7413791 7783369 8306654 9097396 10216207 11651799
9624A1651799J697681J866715K031075K036349J860226J837019K157276K370563
$$ 11651799 13349480 15216195 17247270 19283619 21143845 22980864 25138140 27508703
9616B7508703K268923K263399K536557K711044K774115L165746L496784K963326
$$ 27508703 29777626 32041025 34577582 37288626 40062741 43228487 46725271 49688597
9608D9688597J465874m66403j978536k597571k235352j364229q62748r05203j646590
$$ 49688597 51154471 50688068 48709532 46111961 43876609 42512380 41649632 40744429 39097839
9599C9097839l048849l797578l509045k936641k365673j702888j023419m29077
$$ 39097839 36048990 32251412 28742367 25805726 23440053 21737165 20713746 20284669
9591B0284669J74776Q52075J518323K079236K366770K523749K600397K114750
$$ 20284669 20459445 21311520 22829843 24909079 27275849 29799598 32399995 34514745
9583C4514745J335462R36289P33978L67138L71563J449400L380535N424395O850988
$$ 34514745 35850207 36786496 37520474 37887612 38259175 39708575 43089110 48513505 55364493
9574E5364493P313417O944886N683618L170027J24333k306125m322954o227711
$$ 55364493 62677910 69622796 75306414 78476441 78600774 76294649 71971695 65743984
9566F5743984p391854o587737m378973k322092j184513p10676p79228j590765
$$ 65743984 58352130 51764393 47385420 45063328 43878815 43168139 42388911 40798146
9558D0798146k476221k635378k500729k667970k751359k242836j541713q29880
$$ 40798146 38321925 35686547 33185818 30517848 27766489 25523653 23981940 23152060
9550B3152060k26397L13991Q79050J511936K083009K667762L043695K888100K123675
$$ 23152060 22925663 23239654 24118704 25630640 27713649 30381411 33425106 36313206 38436881
9541C8436881J320174N97277j84708j02331J097250K451742L096959K872426J918206
$$ 38436881 39757055 40354332 40169624 40067293 41164543 43616285 46713244 49585670 51503876
9532E1503876M18602j047486k068502k701595k877065k748922k807083l039033
$$ 51503876 51922478 50874992 48806490 46104895 43227830 40478908 37671825 34632792
9524C4632792k771610k243735k110910k203660k108100j944882j891457j744291
$$ 34632792 31861182 29617447 27506537 25302877 23194777 21249895 19358438 17614147
9516A7614147j438814j111094q78420o99288n66542m28458l36414k59646j58412
$$ 17614147 16175333 15064239 14185819 13486531 12919989 12491531 12155117 11895471 11737059
9507A1737059r9074k7444P8415K07048L94729P14940J103608J620703K150829
$$ 11737059 11637985 11610541 11688956 11896004 12290733 13005673 14109281 15729984 17880813
9498A7880813K506642K331783J543492L37040j129219k523251l236238k994920
$$ 17880813 20387455 22719238 24262730 24599770 23470551 20947300 17711062 14716142
9490A4716142k293135j619385j134526q48073o44962n23774m60878l81580l47094
$$ 14716142 12423007 10803622 9669096 8821023 8176061 7652287 7191409 6809829 6462735
9481F462735l36003k80073k47359k51033k03139j90740k03887j55673j30962j35289
$$ 6462735 6126732 5846659 5599300 5348267 5145128 4954388 4750501 4594828 4463866 4328577
9471D328577j51551j40836j23029j05828j00075r0867j25277j35881j34690r5488
$$ 4328577 4177026 4036190 3913161 3807333 3707258 3616391 3491114 3355233 3220543 3125055
9461C125055r3345j05708j18088r7035j01015q7532o0629p0683q4439o4099l1843
$$ 3125055 3031710 2926002 2807914 2710879 2609864 2522332 2461703 2391020 2306581 2242482 2210639
9450B210639o0496n6264j01446q8566o2380n9845p9294l6583j12j1813n7080o6075
$$ 2210639 2150143 2093879 1992433 1903867 1841487 1781642 1702348 1665765 1665653 1653840 1596760 1530685
9438A530685p3216n1848l7283j6771j060l9508o3268o5632k0280L856r902l0319
$$ 1530685 1457469 1405621 1368338 1351567 1350507 1310999 1247731 1182099 1161819 1165675 1155773 1125454
9426A125454p345J050K720l3804j3644l5781l9886r428k7991k0606j7142l707
$$ 1125454 1118109 1119159 1121879 1088075 1074431 1038650 998764 989336 961345 940739 923597 919890
9414I19890j2907r580p154j8672n9564l4912k4755m3467k6618j0216j7828j180
$$ 919890 906983 897403 890249 871577 812013 777101 752346 708879 682261 672045 654217 653037
9402F53037R83Q104K1513k1925n3757J502M1885j8996j1816J9963M361k8402k2727
$$ 653037 654020 662124 683637 661712 607955 609457 651342 632346 620530 640493 644854 616452 593725
9389E93725p063R420P828Q999L451K643K1268K059k3139k981j0575l3933j4354
$$ 593725 586662 596082 603910 612909 616360 619003 640271 642330 619191 616210 605635 571702 557348
9376E57348L439j7819k594L0019j6557j7552J2413j2330j3569k6392j2613O158
$$ 557348 560787 542968 540374 570393 553836 536284 548697 536367 522798 496406 483793 489951
9364D89951J1796j1408j1697l747K0715Q571l437J2067j0609k892p427R277J592
$$ 489951 501747 490339 478642 474895 495610 504181 500744 512811 502202 499310 491883 501160 502752
9351E02752l922K661k8946k4353J2998K6267J4700O062j6745m857j3890P471j5427
$$ 502752 498830 501491 472545 448192 461190 487457 502157 508219 491474 486617 472727 480198 464771
9338D64771K965L9837n38R026k1838l1010p005j6117J4783m081J5436K8816K3238
$$ 464771 467736 507573 507035 516061 494223 463213 456208 440091 454874 450793 466229 495045 518283
9325E18283k156L437p737j9494q804l5953j7497J789P23O151J6436J4679r445
$$ 518283 516127 519564 511827 492333 483529 447576 430079 431868 432591 438742 455178 469857 460412
9312D60412j0703j6966J3939J1464K4705p46j1088J050j9201L9285K6032p249
$$ 460412 449709 432743 446682 458146 482851 482105 471017 472067 452866 492151 518183 510934
9300E10934k5914j2540N750J7620l829j5653J228Q966K7981J5103q353l929J7332
$$ 510934 485020 472480 478230 495850 492021 476368 477596 486562 514543 529646 521293 517364 534696
9287E34696r076K3726J6217k347j5569j761J912j2102K3004J4781O285K1811K0535
$$ 534696 525620 549346 565563 563216 547647 545886 547798 535696 558700 573481 579766 601577 622112
9274F22112J314k635J748Q729Q41K6600L1340M125M327O256k4713L5009L0763
$$ 622112 623426 620791 622539 631268 632109 658709 690049 694174 698501 704757 680044 715053 745816
9261G45816K8574l269j4036J0731L0542J9060J2311j68j3499M2685J5273K3040
$$ 745816 774390 771121 757085 767816 798358 817418 829729 829561 816062 858747 874020 897060
9249H97060L9424K2884j462K7527J4193R383j0002k6349k1341P87K4675N6332
$$ 897060 936484 959368 957906 985433 999626 1009009 999007 972658 951317 952104 976779 1033111
9237A033111L6279K3320N1923N752l9448l5858J3398K4060L709K5008L2040J8048
$$ 1033111 1069390 1092710 1144633 1150385 1110937 1075079 1088477 1112537 1116246 1141254 1173294 1191342
9225A191342J4903J6626L6959O729N8576J7758J6897N4453L9203L2746K103J0807
$$ 1191342 1206245 1222871 1259830 1266559 1325135 1342893 1359790 1414243 1453446 1486192 1488295 1499102
9213A499102N4212M0416J3990O0650P3803M1971L6715K1396J1273L0827K6326
$$ 1499102 1553314 1593730 1607720 1668370 1742173 1784144 1820859 1842255 1853528 1884355 1910681
9202A910681J1659L6602L1037L9887N6273k3307K135L7981J7870M3937M7350J8117
$$ 1910681 1922340 1958942 1989979 2029866 2086139 2062832 2064967 2102948 2120818 2164755 2212105 2230222
9190B230222J4665M9086R9669J11822O3115N7192P4356O6592N1010O6768R7943
$$ 2230222 2244887 2293973 2393642 2505464 2568579 2625771 2700127 2766719 2817729 2884497 2982440
9179B982440R4383Q7418P4157N1000J14764J68132J61933J29961J27480J14688
$$ 2982440 3076823 3164241 3238398 3289398 3404162 3572294 3734227 3864188 3991668 4106356
9169D106356J24253J20055J32944J26776J17332J45652J49911J56854J82740J56870
$$ 4106356 4230609 4350664 4483608 4610384 4727716 4873368 5023279 5180133 5362873 5519743
9159E519743J61364K00152K23100K21780K22607K61436K85846L12162L30949L45397
$$ 5519743 5681107 5881259 6104359 6326139 6548746 6810182 7096028 7408190 7739139 8084536
9149H084536L65770M23847M40403M43560N01918N64375N88247O54346P17088P29691
$$ 8084536 8450306 8874153 9314556 9758116 10260034 10824409 11412656 12067002 12784090 13513781
9139A3513781P83709Q53319R21702J005830J102470J188994J266400J377979J481668
$$ 13513781 14297490 15150809 16072511 17078341 18180811 19369805 20636205 22014184 23495852
9130B3495852J588998J703554J816492J919988K047551K174400K254439K232262
$$ 23495852 25084850 26788404 28604896 30524884 32572435 34746835 37001274 39233536
9122C9233536K236394K224708K129413J964552J733462J440772J082811O82190
$$ 39233536 41469930 43694638 45824051 47788603 49522065 50962837 52045648 52727838
9114E2727838L29712j11963n37612r05415j199253j461026j661778j806294j900922
$$ 52727838 53057550 52945587 52407975 51502560 50303307 48842281 47180503 45374209 43473287
9105D3473287j909321j891292j853239j779107j719727j630166j520192j417252
$$ 43473287 41563966 39672674 37819435 36040328 34320601 32690435 31170243 29752991
9097B9752991j380260j297750j208438j132491j051312j005646r54794q92578
$$ 29752991 28372731 27074981 25866543 24734052 23682740 22677094 21722300 20829722
9089B0829722q37963q05756p23515o69570o40408o26981o12915n85922n61574
$$ 20829722 19991759 19186003 18462488 17792918 17152510 16525529 15912614 15326692 14765118
9080A4765118n27125m82798m94508m74184m41576m07777m06966m00839l64668
$$ 14765118 14237993 13755195 13260687 12786503 12344927 11937150 11530184 11129345 10764677
9071A0764677l65436l21166l09926k99400k71465k79703l10700k60778k26256
$$ 10764677 10399241 10078075 9768149 9468749 9197284 8917581 8606881 8346103 8119847
9062H119847k32697k34340k20575j95708k18634j93004j78424j88845k06485j91993
$$ 8119847 7887150 7652810 7432235 7236527 7017893 6824889 6646465 6457620 6251135 6059142
9052F059142j56578j43708j56247j70669j57724j34306j12202j24009j37889j20934
$$ 6059142 5902564 5758856 5602609 5431940 5274216 5139910 5027708 4903699 4765810 4644876
9042D644876j12506j11503j36415q3478q7757j02125j16071j01007p3359q2653
$$ 4644876 4532370 4420867 4284452 4200974 4113217 4011092 3895021 3794014 3720655 3638002
9032C638002q5937j03461q8452j03857j00779o8933p2846n6817l3452m3683p7662
$$ 3638002 3552065 3448604 3360152 3256295 3155516 3086583 3013737 2956920 2923468 2879785 2802123
9021B802123o1113o9157p3896n9426l9056n0969m4833m7046m8870n7942n3313
$$ 2802123 2741010 2671853 2597957 2538531 2499475 2448506 2403673 2356627 2307757 2249815 2196502
9010B196502k5072j4537n2117q8979m7422j5651l6097o3929o7052j8643l5150
$$ 2196502 2171430 2156893 2104776 2015797 1968375 1952724 1916627 1852698 1785646 1767003 1731853
8999A731853l7721l9249k2489o8065m8561m3821l3320N743O363o6600o1532j4958
$$ 1731853 1694132 1654883 1632394 1564329 1515768 1471947 1438627 1444370 1450733 1384133 1322601 1307643
8987A307643k7443j1198l6949n8809l7563k3969l7235m3769M001o641J2282k2451
$$ 1307643 1280200 1269002 1232053 1173244 1135681 1111712 1074477 1030708 1034709 1028068 1040350 1017899
8975A017899j0234k3548l2452l980j5378J47K7629k4349j1410M595l7353k8889
$$ 1017899 1007665 984117 951665 947685 932307 932454 960083 935734 924324 928919 891566 862677
8963H62677j4858n899j6478j2980k5386k9705j8061J3478j3778Q522N311k5759
$$ 862677 847819 841920 825442 812462 787076 757371 739310 752788 739010 747532 752843 727084
8951G27084j9531k4800o809k8305l86J1701l0980k958n540k494k0934L001j5797
$$ 727084 707553 682753 675944 647639 647253 658954 627974 625016 619476 616982 596048 599049 583252
8938E83252p6O662r20K5124K7277m0058j3651Q211J6897j992k5713l1675k6057
$$ 583252 583176 589838 588918 614042 641319 601261 587610 595821 612718 610726 585013 553338 527281
8925E27281l042J6715K91J0032j4364J163n273N339N397k271n002n658j45M00
$$ 527281 524239 540954 541245 551277 536913 538076 532803 538142 543539 541268 536266 530608 530463 530863
8911E30863j8211j9133K945j8694m4309k8868j297J2153j0307k9880Q404J8865
$$ 530863 512652 493519 496464 477770 433461 404593 403296 415449 405142 375262 383666 402531
8899D02531j9633k4549n912K5960K9001j3417l9825J1699K398k8942k3285K295
$$ 402531 382898 358349 352437 378397 407398 393981 354156 365855 368253 339311 316026 318321
8887C18321Q410O514J2641M756Q450K039j8358p375k0714j088J1544N205j1342
$$ 318321 326731 333245 345886 350642 359092 361131 342773 335398 314684 313596 325140 330345 319003
8874C19003J6219R56M70l2431N995J1273R809j379L892j79l9814k9632n563o999
$$ 319003 335222 336178 336648 304217 310212 321485 331294 329915 333807 333628 293814 264182 258619 251620
8860B51620J7201J7846k9412l037k451o250j779N299J9531Q32j7659l564m835
$$ 251620 268821 286667 257255 254218 251767 245517 243738 249037 268568 269400 251741 248177 243342
8847B43342l376J5934O47k7030m0573j262j0021j7053J5025K0343j7549l8295
$$ 243342 239966 255900 256547 229517 188944 187682 177661 160608 175633 195976 178427 140132
8835A40132J4879J1044MJ9723q50n468n620j917j2251j8998J7943J2492k0990
$$ 140132 155011 166055 166059 185782 184932 179464 173844 171927 159676 140678 158621 171113 150123
8822A50123r07K0957k0282k3647J0572K2729q644l0901K1699l654p697l289k1894
$$ 150123 149216 170173 149891 126244 136816 159545 150901 120000 141699 138045 130348 127059 105165
8809A05165m149P005o077j6997j5223O968o711N875J7196K0736j7704p062n618
$$ 105165 101016 108021 101944 84947 69724 76692 69981 75856 93052 113788 96084 89022 83404
8796H3404j6179J027o201J7460R227o479n684M635k0910J9494L1309j9163j5618
$$ 83404 67225 68252 62051 79511 88738 82259 76575 81210 60300 79794 111103 91940 76322
8783G6322k781l4903j5859K5418K9800l365k2605p173P034J901R158o050j751
$$ 76322 73541 38638 22779 48197 77997 74632 52027 44854 51888 53789 62947 56897 55146
8770E5146q772l1508j4225K7026J8964J4172j6207K967l403m517N822K11N412
$$ 55146 46374 14866 641 27667 46631 60803 44596 47563 44160 39643 45465 45676 51088
8757E1088j4616J1999K2158j4867j1665J1185J0823L851j6889q744j7522M2q140
$$ 51088 36472 48471 70629 55762 44097 55282 66105 69956 53067 44323 26801 26843 18703
8744A8703j8745O242K0956o275K9566R440j0023j8540l429J4806J4774j9636M673
$$ 18703 -42 6200 27156 20881 50447 59887 49864 31324 27895 42701 57475 37839 42512
8731D2512K7930J8508j7951j4947m74j454n844l6189O962J266K656K4221K6609
$$ 42512 70442 88950 70999 56052 55578 54124 48280 12091 19053 20319 22975 47196 73805
8718G3805J3985L0891K3115j5026n8464n5064j1221M175K1971j3357l069R206
$$ 73805 87790 118681 141796 126770 68306 13242 2021 6196 28167 14810 11741 20947
8706B0947j1552J6664J9953l405k0953n360K0061Q781Q557K457M756J5238l617
$$ 20947 9395 26059 46012 42607 21654 16294 36355 45136 53693 56150 60906 76144 72527
8693G2527k8936L4574J4603n03j7159l4363J2421j0266M392J2760L2283j8482
$$ 72527 43591 78165 92768 92265 75106 40743 53164 42898 47290 60050 92333 73851
8681G3851l2964j5269j3865j0061J4055k711J120k5478O238M1440J6966j4041
$$ 73851 40887 25618 11753 1692 15747 13036 14156 -11322 -5084 36356 53322 39281
8669C9281j9828L3236l604j5836J0348J5343P17j0569k0612J6595J780j8140n1769
$$ 39281 19453 52689 49085 33249 43597 58940 59657 49088 28476 45071 46851 28711 -23058
8656b3058p795m986K9687J6828J2060J9222j4950L477K7196j8388J2783J4429
$$ -23058 -30853 -35839 -6152 10676 22736 41958 27008 30485 57681 39293 52076 66505
8644F6505j4321m8927J543J2561o433j2874j4183J3857M1572J7507M788k703k4030
$$ 66505 52184 3257 4800 17361 10928 -1946 -16129 -2272 39300 56807 61595 58892 34862
8631C4862j686N232J7876J396m1060j1678L9655L3491J629j0188P679P816o390
$$ 34862 33176 38408 56284 57680 16620 4942 44597 78088 79717 69529 77208 85024 78634
8618G8634P394J2639r29L070O720l7076M218K4963o460L672M217j4062P500O311
$$ 78634 86028 98667 97738 100808 107528 70452 74670 99633 93173 96845 101062 87000 94500 100811
8604A00811k7784j3220K211r731m79p371J1039J2959o608l0773j5801j2380N661
$$ 100811 73027 59807 62018 52287 51808 44437 55476 68435 61827 31054 15253 2873 8534
8591H534k0436J0431K8405J5967k7405k209K0885M436K8847K9030O925M827j3067
$$ 8534 -11902 -1471 26934 42901 15496 13287 34172 38608 67455 96485 103410 108237 95170
8578I5170j5805J1909J4209k4225k3423L4173L7393N0508N0925M2180R010l749
$$ 95170 79365 91274 105483 81258 57835 92008 129401 179909 230834 273014 282024 278275
8566B78275M290k4614r786K2182j5343k6377p748K1421m769k4128k0909k1785
$$ 278275 282565 257951 248165 270347 255004 228627 220879 242300 237531 213403 192494 170709
8554A70709k0715j6924J1604Q459r680j0558J052q427L0460j043l0637k2592k7076
$$ 170709 149994 133070 144674 153133 143453 132895 133947 125520 155980 154937 124300 101708 74632
8541G4632J746j4608n615J7582n144N607O252Q441K05q898k2823P234P830j8859
$$ 74632 76378 61770 56155 73737 68593 74200 80452 88893 89098 80200 57377 64611 72441 53582
8527E3582j0881N459P374k2964l6362j4730j4499K4433M8612K1195k6191j3822
$$ 53582 42701 48160 55534 32570 -3792 -18522 -33021 -8588 40024 61219 35028 21206
8515B1206J9926j3427j1193J0251j0963q637N028m453j9403J0024K3305J199j3943
$$ 21206 41132 27705 16512 26763 15800 7163 12191 7738 -11665 -1641 21664 22863 8920
8502H920K8648K6426O152L089k7671k8472J1601L4091k0195l820j0800j7250M281
$$ 8920 37568 63994 70146 73235 45564 17092 28693 62784 42589 38769 27969 10719 15000
8489A5000j7039q13Q475L3138j349N138m344p656J3411P370O570j2825m2221J097
$$ 15000 -2039 -2852 5623 38761 37412 42550 38206 30550 43961 51331 57901 45076 2855 3952
8475C952Q997j432O844m764O09k1370l576K129K8204P559k0946K828m528J2274
$$ 3952 12949 11517 18361 13597 14206 -7164 -10740 -8611 19593 27152 6206 9034 4506 16780
8461A6780J3794l8049j1825j5367k3469N42K5608K6440J1613o900j4272q453j2189
$$ 16780 30574 -7475 -19300 -34667 -58136 -57594 -31986 -5546 6067 -833 -15105 -23558 -35747
8448c5747O03J9893J6066m734j9280J8613J2768k3478j7516P540J6488j1980j2501
$$ -35747 -35144 -15251 815 -3919 -23199 -4586 8182 -15296 -32812 -25272 -8784 -20764 -33265
8435c3265K3834K4074l96k2456j9513K073k995j5066J7907Q741j3587j2253M464
$$ -33265 -9431 14643 14247 -8209 -27722 -25649 -28644 -43710 -25803 -17062 -30649 -42902 -38438
8422c8438K8788l290o0399l3374L8674K3577J0148K3895O783O239O944j6787j7069
$$ -38438 -9650 -12940 -73339 -106713 -68039 -44462 -34314 -10419 -3636 2603 9547 -7240 -24309
8409b4309q219J4727m639j6342J4496K9196l265j7929n117L661l4573k3489J0771
$$ -24309 -32528 -17801 -22440 -38782 -24286 4910 1645 -16284 -21401 -17740 -52313 -75802 -65031
8396f5031M1659K2967M526j2999L161j1955j6689l0552N955k837K3953L7998n048
$$ -65031 -23372 -405 4121 -8878 -5717 -17672 -34361 -64913 -58958 -61795 -37842 156 -4892
8383d892k820j6216M0214J4360j3529R614l2205j6821J2810j3145k0761J9583
$$ -4892 -7712 -23928 16286 30646 17117 26731 -5474 -22295 -9485 -22630 -43391 -23808
8371b3808J334j4700R860o581N040J2705J4913L0487P581k2234j6094K2074m17
$$ -23808 -22474 -37174 -27314 -33895 -28855 -16150 -1237 29250 36831 14597 -1497 20577 20160
8358B0160j434r047l0935l5048J4101L5620M846k4982l0491O706K8116L3588R418
$$ 20160 18726 9679 -21256 -56304 -42203 -6583 -1737 -26719 -57210 -50504 -22388 11200 20618
8345B0618k5044L694m730l138j339K42J1744j132j1650m217L259L14M070P36M617
$$ 20618 -4426 -732 -5462 -8600 -9939 -9697 2047 915 -10735 -14952 -11693 -11379 -7309 -6573 -1956
8330a956Q336j5273J9907l171K3942K0850J0389k9020k3570L566R947j0312o44
$$ -1956 6380 -8893 11014 7843 31785 52635 63024 34004 10434 14000 23947 13635 12991
8317A2991K3496j5946j9144l754o785p321j1408O037J6014J3361n921j4688j998
$$ 12991 36487 20541 1397 -2357 -9142 -16463 -27871 -21834 -5820 7541 1620 -13068 -15066
8304a5066j1454J4706N530l5384M828J6295J8865O514q919J4788J6973Q85j8855
$$ -15066 -26520 -11814 -6284 -41668 -36840 -20545 -1680 4834 -4085 10703 27676 28561 9706
8291I706p328K31N042k7404j5462J3214K0601L355o351P79j1228J631M3934K7746
$$ 9706 2378 2609 7651 -19753 -35215 -22001 -1400 1955 -4396 -3617 -14845 -13214 30720 58466
8277E8466o353M81m76r211k3421k0657k3169J1441N190K2690K9777J823p56j7337
$$ 58466 52113 52594 52118 42907 19486 -1171 -24340 -12899 -7709 14981 44758 46581 45825 28488
8263B8488k9707k1588Q578m288J5889J0405p061j7592n80m42k8307j8147K5822
$$ 28488 -1219 -22807 -14229 -18517 -2628 7777 716 -16876 -17456 -17898 -46205 -64352 -38530
8250c8530J9441P762j623p445k211m738Q620r119j3484J1864J049N330r060J5816
$$ -38530 -19089 -11327 -12950 -20395 -22606 -27344 -18724 -27843 -41327 -29463 -28414 -23084 -32144 -16328
8236a6328j5342J1609K2585j643n389O948j4645l333K3031J2828m166o253p139
$$ -16328 -31670 -20061 2524 881 -4508 2440 -12205 -15538 7493 20321 16155 9902 2763
8223B763R824j9713l0508J843o888J7716J743j8100L0860J4994Q918j6460k0898
$$ 2763 12587 -7126 -37634 -35791 -42679 -24963 -23220 -41320 -10460 4534 13452 -3008 -23906
8210b3906l7429j614J9805M1422j1884k6536M376M216M011J4616l514q048J1526
$$ -23906 -61335 -62949 -43144 -1722 -13606 -40142 -35766 -31550 -27539 -12923 -16437 -24485 -12959
8197a2959M603Q358p343K110J3650K1455k1357k7743K815p866n880j084L5955
$$ -12959 -8356 2 -7341 -5231 8419 29874 8517 -19226 -16411 -24277 -30157 -31241 4714
8184D714K8259j2875k37n604J977J000R400j4392l0638J2494K4860j1975N607
$$ 4714 32973 20098 19861 14257 16234 17234 26634 12242 -18396 -5902 18958 6983 12590
8171A2590n526n105p254J229R586o047r874l2294j0K1424K8818j4110j691N450
$$ 12590 7064 1959 -5295 -4066 5520 -527 -10401 -42695 -42705 -21281 7537 -6573 -8264 -2814
8157b814M377P396P181J3940p407r189l7889m856K6609P823r023K7351K0914o322
$$ -2814 1563 8959 16140 30080 22673 13484 -24405 -29261 -2652 5171 -3852 23499 44413 38091
8143C8091l5120L620Q880J7590K0960k1597q709q005r495j5701M5K2846N063J7243
$$ 38091 2971 6591 15471 33061 54021 32424 23715 15710 6215 -9486 -9441 13405 18468 35711
8129C5711Q328j5856m922J271J8037O787r400r209Q880j681j3191J5676M815k320
$$ 35711 44039 28183 23261 24532 42569 49356 39956 30747 39627 37946 24755 40431 45246 42926
8115D2926J9331M461k0993L219m374J0411q020j6781k6590j1320o74j1500L649
$$ 42926 62257 66718 45725 48944 44570 54981 46961 30180 3590 -7730 -8404 -19904 -16255
8102a6255K2828N843K5135K2454J9592O74k9566k3293M51j7990r770L5805r882
$$ -16255 6573 12416 37551 60005 79597 80271 50705 27412 27863 9873 103 35908 26026
8089B6026k4091K2783K5997J672Q781o419k6071j0209L1575m951j4035J2443K0010
$$ 26026 1935 24718 50715 52387 61168 54749 28678 18469 50044 45093 31058 43501 63511
8076F3511O209K338j764l3850m173J6281o022k7439l4178l1393J6264J911K942
$$ 63511 69720 72058 70294 36444 32271 48552 42530 15091 -19087 -50480 -34216 -32305 -29363
8063b9363K8633L3180k548P386N468l981l2614o701J7115k0544j766K4648N571
$$ -29363 -730 32450 29902 37288 42756 38775 6161 -540 16575 -3969 -5735 18913 24484
8050B4484r961k0393r361J5734K0129M3195M0743L9112J3428R02k234J0777J855
$$ 24484 14523 -5870 -15231 503 20632 63827 104570 143682 157110 158012 155778 166555 168410
8037A68410p818l0512k3694M572k0666k4598O542r377j8312l267l17Q092O670
$$ 168410 160592 130080 106386 110958 90292 65694 72236 62859 44547 41280 40963 49055 55725
8024E5725k712l2355q628K6795K816K1602M1720m094M083j1776J1403L4701K1503
$$ 55725 53013 20658 12030 38825 41641 63243 104963 100869 104952 93176 104579 139280 160783
8011A60783K6657Q096k6498n1218l5730j9918r948P374q915k0575j0958J193L6711
$$ 160783 187440 195536 169038 117820 82090 62172 52224 59598 50683 30108 19150 20343 57054
7998E7054j0745j462l0182K3202J4673j2334K964k2866k991L3678J0301P56j3792
$$ 57054 46309 44847 14665 37867 52540 40206 43170 20304 17313 50991 61292 62048 48256
7985D8256R766J0143R13J0664j8981k4127j6193o721O726K3198K8947l762j8555
$$ 48256 58022 68165 69078 79742 60761 36634 20441 13720 20446 43644 72591 68829 50274
7972E0274k0041J7925N0278P3308P4448J3056o032J6566j906n4393m8475m5040
$$ 50274 30233 48158 98436 171744 246192 259248 253216 269782 267876 213483 165008 119968
7960A19968k9566O67n818k0369j4336j3141P653J7546n273m944p597j6930j3290
$$ 119968 90402 91069 85251 64882 50546 37405 45058 62604 57331 52387 44790 27860 14570
7947A4570O50m382Q268n905K6287n087j0443j5360j0411J6268L2447r880p834
$$ 14570 15220 10838 19106 13201 39488 34401 23958 8598 -1813 14455 46902 37022 29188
7934B9188J3996K114l724L2123O349k8450k3393J180N2705K3900j0547L9537K4311
$$ 29188 43184 45298 41574 73697 80046 51596 28203 29383 82088 105988 95441 134978 159289
7921A59289K4449J2346J480k9912k3539n924j2669k7894k6961j4792L738K36k0638
$$ 159289 183738 196084 197564 167652 144113 138189 125520 97626 70665 55873 59611 59847 39209
7908C9209p369j4322M528j0699k8132K5776K5836J7486K7195j4115k7679m8l3235
$$ 39209 31840 17518 22046 11347 -16785 8991 34827 52313 79508 65393 37714 37666 4431
7895D431J5681J5114j2795k8468n943m328p6O600n023p032j6722j2941l397L5194
$$ 4431 20112 35226 22431 -6037 -11980 -16308 -16384 -9784 -14807 -21839 -38561 -51502 -54899 -19705
7881a9705L095L0197J8229N781m37j0925n7375j9408J6186O780J8872J2449J0747
$$ -19705 -16610 13587 31816 37597 37160 26235 -31140 -50548 -34362 -27582 -8710 3739 14486
7868A4486J0319m26k9801j1896k717j7541o95K1218K7361k450k3736Q824K1431
$$ 14486 24805 24379 -5422 -17318 -20035 -37576 -38271 -17053 10308 7858 -15878 -7054 14377
7855A4377j0400k249o187K365M762O056J7880L374j7186k1104K0227J1571k7747
$$ 14377 3977 1728 -4459 -2094 2668 8724 26604 29978 12792 -8312 11915 23486 -4261
7842d261k9439L494K0816j6260K586J7298J8660K65n914j681J0733R027K2888
$$ -4261 -33700 -30206 -9390 -25650 -23064 -5766 12894 13159 7245 5564 16297 25324 48212
7829D8212p867m0028k6111J0679L4432r686m0855j8295J0239K4257K3673J2249
$$ 48212 40345 317 -25794 -15115 19317 9631 -31224 -49519 -39280 -15023 8650 20899
7817B0899J613j3951m2262N717j4116N715K2100L8410l445j7659m0198k1293P758
$$ 20899 22512 8561 -33701 -27984 -42100 -36385 -14285 24125 20680 3021 -37177 -58470 -50712
7804e0712J3535K9757k0222l1938J9891J0381j8976j5989K6871L7052R721j4510
$$ -50712 -37177 -7420 -27642 -59580 -39689 -29308 -48284 -64273 -37402 -350 9371 -5139
7792e139o174J3189N210j981j8268j2237m399O49k729n312k0558j7605k697J010
$$ -5139 -11313 1876 7086 5105 -13163 -25400 -29799 -29150 -31879 -37191 -57749 -75354 -78051 -77041
7778g7041K394P929m539K471N365O965J9148J2964J1770Q556j9919j9844p424
$$ -77041 -74647 -66718 -71257 -68786 -63421 -56456 -37308 -24344 -12574 -4018 -23937 -43781 -51205
7765e1205J4662M861J1449k161o261N937j3317K697j0584r828P72J7735N128j2949
$$ -51205 -36543 -31682 -20233 -22394 -28655 -22718 -36035 -33338 -43922 -53750 -52978 -35243 -30115 -43064
7751d3064P044J4431r574q224o484K0772L9790K0601j2623l2832J0530K090k943
$$ -43064 -36020 -21589 -31163 -39387 -45871 -25099 14691 35292 22669 -10163 367 2457 -486
7738d86j3850k364l0104q087K0047q826p648J3105J063O597j7692K3523L1221
$$ -486 -14336 -16700 -46804 -54891 -34844 -43670 -51318 -38213 -37150 -30553 -48245 -24722 6499
7725F499j322j6237j2180k3079R144l223N300j1547J1067k464N674J1506l504
$$ 6499 5177 -11060 -23240 -46319 -37175 -40398 -35098 -46645 -35578 -38042 -32368 -20862 -24366
7712b4366j4587K623m335j2887O179j5290R715K020n459M0543m671l7647l4950
$$ -24366 -38953 -36330 -40665 -53552 -47373 -62663 -52948 -50928 -56387 -15844 -20515 -58162 -93112
7699i3112K9067N9019P188J003m0074k5298K9311Q733j1516k1952n19L3035K9992
$$ -93112 -64045 -5026 2162 3165 -36909 -62207 -32896 -24163 -35679 -57631 -58150 -25115 4877
7686D877j5083j0754o66j9245m349M0023J5767L032J3629j6561O585l195k8867
$$ 4877 -10206 -20960 -21626 -40871 -45220 -5197 10570 13602 27231 10670 17255 14060 -14807
7673a4807L661K41k2715q77J3949J5761O227j5225J196J7058j4201M779L9852
$$ -14807 -11146 -10905 -33620 -34497 -20548 -4787 1440 -13785 -12589 4469 -9732 -4953 34899
7660C4899K8484l8178n0307J0766k98J4496n784J8734K0991j2653J9992l826o464
$$ 34899 63383 25205 -25102 -14336 -14634 -138 -5922 12812 33803 21150 41142 37316 30852
7647C0852J4762j4566k9200k5981J4878j09q174M709Q257K48J134m2754j408O366
$$ 30852 45614 31048 1848 -24133 -9255 -9364 -17538 -12829 -4572 -4324 -3190 -45944 -47352 -40986
7633d0986J5029J9371q29M3151k658l209j0801k1837k982j6999K4635k2105r231
$$ -40986 -25957 -6586 -7415 35736 33078 29869 19068 -2769 -5751 -22750 1885 -20220 -29451
7620b9451J086J0368Q783r468r828j2318k1305R431L3963O292j685m511K7500
$$ -29451 -28365 -17997 -9214 -18682 -28510 -40828 -62133 -52702 -18739 -12447 -14132 -18643 8857
7607H857o409k3743k2842Q155M184Q676n537L3187l876j0875K6855q53m1756j6420
$$ 8857 2448 -21295 -44137 -35982 -31798 -23122 -28659 4528 652 -10223 16632 15779 -25977 -42397
7593d2397J9949j7981j6492k537K3005K4244n932o806J0485J0184k3452j1111
$$ -42397 -22448 -40429 -56921 -59458 -36453 -12209 -18141 -24947 -14462 -4278 -27730 -38841
7581c8841j4033q676j6799l4417J3344K0961K035J7306M2930L2349j0935j4983
$$ -38841 -52874 -61550 -78349 -112766 -99422 -78461 -76426 -59120 -16190 16159 5224 -9759
7569i759O088J215p046k5503P984l779J208j0909j108J1305L809Q417K0430j1240
$$ -9759 -3671 -2456 -9502 -35005 -27021 -30800 -29592 -40501 -41609 -30304 -26495 -18078 2352 -8888
7555h888m2166n60K2147J4782O075J2573j4953q517j1971o240k6123j6042J6148
$$ -8888 -51054 -51614 -29467 -14685 -8610 3963 -10990 -19507 -31478 -37718 -63841 -79883 -63735
7542f3735Q046J9941J5389j810k0023j356L5287J6524k820p100j0436k6399o75
$$ -63735 -55689 -35748 -20359 -22169 -42192 -43548 -8261 8263 5443 -1657 -12093 -38492 -39167
7529c9167j5173j3044J0060K3946j0150j5578j0342J1006k923M923j9804N500
$$ -39167 -54340 -67384 -57324 -33378 -43528 -59106 -69448 -58442 -61365 -56442 -76246 -70746
7517g0746J3575Q002J0622K1569j2544m7869p442J164M64K7638M2704J066j7375
$$ -70746 -57171 -49169 -38547 -16978 -29522 -77391 -84833 -83669 -83205 -55567 -12863 -11797 -29172
7504b9172q19R830J9131J8959j7245k3345J3289K1923m3706k8224k964m339J1317
$$ -29172 -29991 -20161 -1030 17929 684 -22661 -9372 12551 -31155 -59379 -62343 -66682 -55365
7491e5365L8310R072J3821r237k0655J24L143N253N234K199J4968q424p608k6477
$$ -55365 -17055 -7983 5838 -3399 -24054 -23930 -20787 -15534 -10300 -8101 6867 -1557 -9165 -35642
7477c5642l379L4491J2980J7296J6468l7916k8422j0875J2596l142j2791j2346
$$ -35642 -39021 -4530 8450 25746 42214 4298 -24124 -34999 -22403 -25545 -38336 -50682
7465e0682J1644J4700j2989p576J7245M999m138J4457M209k1560j3752K779k0823
$$ -50682 -39038 -24338 -37327 -44903 -27658 -22659 -26797 -12340 -8131 -29691 -43443 -40664 -61487
7452f1487k2764L6232M7181J8824l1530j8364R539J2427m266j3268R379k699l600
$$ -61487 -84251 -48019 -838 17986 -13544 -31908 -22369 -9942 -14208 -27476 -18097 -20796 -24396
7439b4396m471J3204j0967j0467j3883K306K4160o60M097k848N929k1551j900
$$ -24396 -28867 -15663 -26630 -37097 -50980 -48674 -24514 -25174 -21077 -23925 -17996 -39547 -41447
7426d1447K6723J9944j0609m5136k6961Q72m223R241n065j3526K2684K0703o421
$$ -41447 -14724 5220 -5389 -50525 -77486 -76614 -80837 -71596 -76661 -90187 -67503 -46800 -53221
7413e3221R149J3426O290l949J0592j041R13j1741J1327j1066K002L9853K191
$$ -53221 -44072 -30646 -24356 -28305 -17713 -18754 -17841 -29582 -18255 -29321 -27319 12534 14725
7400A4725l5966n334j335P669L2238m889K749L240J9041k4181j3950J5787j3405
$$ 14725 -21241 -26575 -27910 -20241 11997 7108 9857 13097 32138 7957 -5993 9794 -3611
7387c611k1245K0771N534j3132j1354K5386j3676j5444j0643O928M932k616K0761
$$ -3611 -24856 -4085 1449 -11683 -23037 2349 -11327 -26771 -37414 -30486 -25554 -28170 -7409
7374g409M785j5146K2359J4655k8861Q218K4803j7263k914K7206J4308k2655p368
$$ -7409 -2624 -17770 4589 19244 -9617 -1399 23404 6141 3227 30433 44741 22086 14718
7361A4718j0065K676n1903l6946J3260L1249J2086kK550k871m144J1476J0163
$$ 14718 4653 7329 -44574 -81520 -68260 -37011 -24925 -24927 -22377 -25248 -29392 -17916 -7753
7348g753p509l3136r631J8047K4887R812j1444p371J4803J5200M905N093J6963
$$ -7753 -15262 -48398 -58029 -39982 -15095 -5283 -16727 -24098 -9295 5905 10810 15903 32866
7335C2866k7486l0340p369J5761J3546O92M949o214j1438J5664j3063m5138L603
$$ 32866 5380 -24960 -32329 -16568 -3022 -2330 2619 -3595 -15033 631 -12432 -57570 -53967
7322e3967K9338n787J713k0014j5346l930K1508K3316O381R383j2646M312J0462
$$ -53967 -24629 -30416 -28703 -48717 -64063 -67993 -46485 -23169 -16788 -7405 -20051 -15739 -5277
7309e277j9195J0094m734m513j2540r247j588j3578j5628N076J9666M0507Q317
$$ -5277 -24472 -14378 -19112 -23625 -36165 -45412 -47000 -60578 -76206 -71130 -51464 -10957 -2640
7296b640p922m920j0661J1112j4166p253J4601K244m073J9865j9077l9549l0277
$$ -2640 -10562 -15482 -26143 -15031 -29197 -36450 -21849 -19605 -23678 -3813 -22890 -62439 -92716
7283i2716R763K6694J8559J8770J3613Q654j0939q374j1277l621N482K0481l2336
$$ -92716 -82953 -56259 -37700 -18930 -5317 3337 -7602 -15976 -27253 -30874 -25392 -4911 -37247
7270c7247p898K1928k0249O302J5562J1904J4221p915J0555J7617r133J2962j4007
$$ -37247 -45145 -23217 -43466 -37164 -21602 -9698 4523 -3392 7163 24780 15647 28609 14602
7257A4602p184l574k5997r785r184J7328J5891k2767m5661k1288J8841R793P96
$$ 14602 7418 3844 -22153 -31938 -41122 -23794 -7903 -30670 -76331 -97619 -78778 -68985 -68189
7244f8189M271N480K3735J7262J3451q184k302L2872K586l3399k3218q913K365
$$ -68189 -63918 -58438 -34703 -17441 -3990 -12174 -14476 18396 20982 -12417 -35635 -44548 -42183
7231d2183K8053L5287q343k238n017j6816j4884q729m279j6705j0679N0892J9631
$$ -42183 -14130 21157 12814 10576 5559 -11257 -26141 -34870 -39149 -55854 -66533 -15641 3990
7218C990M242K163L640j8040q581o3l0015j3520k31J3850R194J0625J8306J3481
$$ 3990 8232 10395 14035 -4005 -12586 -12649 -42664 -56184 -56415 -42565 -33371 -22746 -4440 9041
7204I041l689J0284k9635j226j0484Q235J7344l377k5468j3942k5J405M019p873
$$ 9041 5352 15636 -13999 -15225 -25709 -17474 -130 -3507 -28975 -42917 -42942 -41537 -37518 -45391
7190d5391O114R185K886J2155j3518M803j8574k978L2963R095J1595p244k6160
$$ -45391 -39277 -30092 -27206 -15051 -28569 -23766 -42340 -45318 -12355 -3260 8335 1091 -25069
7177b5069N844J5557o868j438P23j0199j093j2320L0270q178r036L170k1850J1712
$$ -25069 -19225 -3668 -10536 -11974 -11251 -21450 -22543 -34863 -4593 -12771 -21807 -18637 -40487 -28775
7163b8775J808j5968j2381J4544J7848R312l646j6761L2523K0772k3584l6869
$$ -28775 -26967 -42935 -55316 -40772 -22924 -13612 -17258 -34019 -1496 19276 -4308 -41177
7151d1177j4005l287N469J2273j2474Q972L4788K5488q253j7468j5123K1538K5324
$$ -41177 -55182 -58469 -53000 -40727 -53201 -44229 -9441 16047 7794 -9674 -24797 -3259 22065
7138B2065m70k7608j3674k526p413m145j0648K860l08J8449J4424q762J7773L891
$$ 22065 21595 -6013 -19687 -22213 -29626 -33771 -44419 -41559 -41867 -23418 -8994 -17756 17 3908
7124C908J021J4083k1552j9418L640N967J6655j8780k766O914P877J9417l514
$$ 3908 4929 19012 -2540 -21958 -18318 -12351 4304 -14476 -17242 -10328 -2451 16966 13452
7111A3452k0491k5975J6242N762J065M346r964J8646p622j6714J2946J0694J0666
$$ 13452 -7039 -33014 -16772 -11010 -9945 -5599 -15563 3083 -4539 -21253 -8307 2387 13053
7098A3053j1389M240J9112o925l5312l1849J9757L0164j6295j6700J556M6004
$$ 13053 1664 5904 25016 18091 -17221 -49070 -29313 851 -15444 -32144 -30588 15416
7086A5416k374N948j9217j0559j571J4915K1291k385o717k7334L171j6437n997
$$ 15416 13042 18990 -227 -10786 -12357 2558 23849 21464 14747 -12587 -9416 -25853 -31850
7073c1850N901K2983N314k557k3082M379K243j9642k2369j3131n789K5332L3399
$$ -31850 -25949 -2966 2348 -209 -23291 -18912 -16669 -36311 -58680 -71811 -77600 -52268 -18869
7060a8869J0910P636K030j063J0303K5611J6512p470k5529j8282j3360k1559N433
$$ -18869 -7959 -323 1707 644 10947 36558 53070 45600 20071 1789 -11571 -33130 -27697
7047b7697p163P590j548Q315l026J9088J2799j9498l5871p364K8856J9392n176
$$ -27697 -34860 -27270 -28818 -20503 -23529 -4441 8358 -11140 -47011 -54375 -25519 -6127 -11303
7034a1303j9010k004j0578K2014l269k4929L0195L0009q026J0060r872j1359o250
$$ -11303 -30313 -32317 -42895 -20881 -24150 -49079 -18884 11125 3099 13159 3287 -8072 -14322
7021a4322J109k1820J1955j291j7547K898R912J0352K4845q763j8600O796J2452
$$ -14322 -13213 -35033 -23078 -24369 -41916 -39018 -29106 -18754 6091 -2672 -21272 -14476 -2024
7008b024K4405k5783n024J1948j1107p259m417m898l4541k2751O08L2583K7070
$$ -2024 22381 -3402 -8426 3522 -7585 -14844 -19261 -24159 -58700 -81451 -80843 -48260 -21190
6995b1190k3746j0959K7570K2618K9901k4274k7796k0037O332J8349n97J2874
$$ -21190 -44936 -55895 -28325 -5707 24194 -80 -27876 -47913 -41581 -23232 -23829 -10955
6983a0955M818L777M452m114j4377l0633j9904l2829l412L3839L7447K2180J9845
$$ -10955 -6137 -2360 2092 -2022 -16399 -47032 -66936 -99765 -103177 -69338 -31891 -9711 10134
6970A0134P297k0205j4218j7854L3802o996k3945K4551J928l2927j8295K1807
$$ 10134 17431 -2774 -16992 -34846 -1044 -8040 -31985 -7434 -5506 -38433 -56728 -34921
6958c4921J8297j731j4780r786l143J0081J0094j4640O163J6791j8090J455J8849
$$ -34921 -16624 -18355 -33135 -42921 -46064 -35983 -25889 -40529 -34366 -17575 -35665 -34210 -15361
6945a5361O077n81l2903k660L0881J6011j4460k3890P620J5139r478K2410M980
$$ -15361 -9284 -9865 -42768 -45428 -14547 1464 -12996 -36886 -29266 -14127 -23605 -1195 3785
6932C785J597j4016p861p347J6864J4343k5956k3981J9091K7761m399J228j0733
$$ 3785 5382 -8634 -16495 -23842 -6978 7365 -18591 -42572 -23481 4280 -119 1109 -9624
6919i624K0166n960l3139j2063j5836k520K1277L0056L0971k4197j9087N762O930
$$ -9624 10542 4582 -28557 -40620 -56456 -58976 -37699 -7643 23328 -869 -19956 -14194 -7264
6906g264m509l322M329J5768J4269j6763o677J0756j9697k4942o062j664J0212
$$ -7264 -11773 -15095 -10766 5002 19271 2508 -4169 6587 -13110 -38052 -44114 -45778 -35566
6893c5566m715Q032K2836J215j8273j985Q009k3898j0691M165N827J6724J8354
$$ -35566 -40281 -32249 -9413 -8198 -26471 -28456 -20447 -44345 -55036 -50871 -45044 -28320 -9966
6880i966J7919q57j3486j5991k1918J7674M3943K579Q403K5003R0l292j5979K267
$$ -9966 7953 7096 -6390 -22381 -44299 -26625 17318 19897 28300 53303 53393 50101 34122 36389
6866C6389J8354O646j9858j1558m817n396N161K4548K202k4153l5195j7184J6814
$$ 36389 54743 61389 41531 29973 25156 19760 24921 49469 51671 27518 -7677 -24861 -8047
6853h047l179Q981M064p808P021j5478j0784o485J0658O816J2358m449o038L444
$$ -8047 -11226 -2245 1819 -5989 1032 -14446 -25230 -31715 -21057 -14241 -1883 -6332 -12370 -8926
6839h926j5104n531P007J9827L4374J1826k6469j2679J911m738J7592j9299n3981
$$ -8926 -24030 -29561 -22554 -2727 31647 43473 17004 4325 6236 1498 19090 -209 -54190
6826e4190p640M187L440J3365P741j1064j3510J9902K2234J9529L210n891o879
$$ -54190 -61830 -57643 -54203 -40838 -33097 -44161 -57671 -37769 -15535 3994 7204 1313 -5566
6813e566O312q236J5073R842k3568o0161q340J4891J2319J4042R079R71K1205
$$ -5566 746 -7490 7583 17425 -6143 -66304 -74644 -59753 -47434 -33392 -24313 -23342 -2137
6800b137j0990j3399k2666J8065J6095n220k1290J3278N366J0681l788j3038j1978
$$ -2137 -13127 -26526 -49192 -31127 -15032 -20252 -41542 -28264 -22898 -12217 -16005 -29043 -41021
6787d1021k5025r332J333K8118J272J9574J7717J7224N475J5772J5267p559O064
$$ -41021 -66046 -75378 -74045 -45927 -44655 -25081 -7364 9860 15335 31107 46374 38815 44879
6774D4879N767k2483k1290q783j3841K0055J7009q702n717p608O926j4522R645
$$ 44879 50646 28163 6873 -1910 -15751 4304 21313 12611 6894 -714 6212 -8310 1335
6761A335j3489J3213m150j6824p547J1175J9799j9318N828k473J964Q469K1534
$$ 1335 -12154 1059 -3091 -19915 -27462 -16287 3512 -15806 -9978 -12451 -10487 -2018 19516
6748A9516K4132k183l3273l1835j5606L0427m73j7553K3285M0574o565o21J8359
$$ 19516 43648 41465 8192 -23643 -39249 -8822 -9295 -26848 -3563 37011 30446 29825 48184
6735D8184j0361k9620k4544Q131J0031j8687k0655K4780L3976K0741j1639p130
$$ 48184 37823 8203 -16341 -8210 1821 -16866 -37521 -12741 21235 41976 30337 23207
6723B3207m865j7492J2816k1671j4087o840P828l802J31k320j2241J9461J5460
$$ 23207 18342 850 13666 -8005 -22092 -28932 -21104 -24906 -24775 -27095 -39336 -19875 -4415
6710d415J5550r72m15P084N78j9298K2313J0618L060j0989J8772O097Q34j8142
$$ -4415 11135 10163 9748 16832 17410 -1888 20425 31043 34103 23114 41886 47983 48817 30675
6696C0675R826r608k2576q417K53M6008j4374J480J8406m336j0757k7151m093
$$ 30675 40501 30893 8317 -100 153 46161 31787 33267 51673 47337 36580 9429 5336
6683E336j1443j6635o057N119J49J5014j0727R330n507j6417J6179J2316K0611
$$ 5336 -6107 -22742 -28799 -23680 -23531 -8517 -19244 -9914 -15421 -31838 -15659 -3343 17268
6670A7268J1245l5704j5107L966N958O724j7713j5126o114K780l683K7099J1791
$$ 17268 28513 -7191 -22298 -18332 -12374 -5650 -23363 -38489 -44603 -41823 -45506 -18407 -6616
6657f616k084j3750j6921N260P052K1538k3411j8309K0286m90R819n82j1892k262
$$ -6616 -8700 -22450 -39371 -34111 -27059 -5521 -28932 -47241 -26955 -27445 -17626 -18208 -30100 -32362
6643c2362P995n466l094K4166j9427L6018r731p88k835j5161J034q057j0249K3112
$$ -32362 -24367 -29833 -32927 -8761 -28188 7830 -1901 -2689 -5524 -20685 -19651 -27708 -37957 -14845
6629a4845q257k4896m435M843P895q178k328J2818j0438L3710J7087j8129j2584
$$ -14845 -23102 -47998 -52433 -47590 -39695 -47873 -50201 -37383 -47821 -14111 2976 -15153 -27737
6616b7737j5618Q968K4764K4312q75J937n064k1587k3916l663K5137K8266J0676
$$ -27737 -43355 -34387 -9623 14689 13814 15751 10687 -10900 -34816 -38479 -13342 14924 25600
6603B5600J2266m2822k3734Q572Q101K5020k0915l4771J7602K3536J165m61K857
$$ 25600 37866 -4956 -28690 -20118 -12017 13003 -7912 -42683 -25081 -1545 -380 -841 2016
6590B016K1236J2297j3242k9065l372J1985j3942k2900k1409N814J300J928R696
$$ 2016 23252 35549 22307 -6758 -10130 1855 -12087 -34987 -56396 -50582 -49282 -47354 -37658
6577c7658r746P094J083N945J5763K0932q447J14J3234J145J3404j0174j0110
$$ -37658 -47404 -40310 -39227 -33282 -17519 3413 -5034 -4920 8314 9459 22863 12689 2579
6564B579j202j919J683k36j7192K097J4490o793k2362j3863K5931J021j3513M371
$$ 2579 1377 -542 1141 905 -16287 -14190 300 -6493 -28855 -42718 -16787 -15766 -29279 -24908
6550b4908K8711K563o788O394l224j2991l208J6073k4325q629J2277O339j0632
$$ -24908 3803 6366 -422 5972 2748 -10243 -13451 2622 -21703 -30332 -18055 -11716 -22348
6537b2348J2538K753k4430j25j1294L606k8545j010J0906n164K2070O633l422
$$ -22348 -9810 -7057 -31487 -31612 -42906 -39300 -67845 -68855 -57949 -63113 -41043 -34410 -37832
6524c7832J4649k1236P54J9042Q612K66R098r563O206r47J993j7216j1369J1883
$$ -37832 -23183 -44419 -43665 -24623 -16011 -15745 -6647 -16210 -10004 -10951 -8958 -26174 -37543 -25660
6510b5660L8571k3861j6067K4742j5267j9940Q053J1479J3782o473N914P066j2296
$$ -25660 12911 -10950 -27017 -2275 -17542 -37482 -29429 -17950 -4168 -10641 -4727 2339 -9957
6497i957r575K663j0937j8813J3343J1907P823K476j5097j8313N366J228n912
$$ -9957 -19532 -16869 -27806 -46619 -33276 -21369 -13546 -11070 -26167 -44480 -39114 -37886 -43798
6484d3798k380L919J5905K1305j8993J8017m48j170P831j1189k603K7594L265
$$ -43798 -46178 -42259 -26354 -5049 -24042 -6025 -6473 -7643 188 -11001 -13604 13990 17255
6471A7255j6145k1534j1586Q807R891j0952j611O834K2230Q711J3746l496R030
$$ 17255 1110 -20424 -32010 -23203 -13312 -24264 -25875 -19041 3189 11900 25646 22150 31180
6458C1180J6630K6465m434k3756k5450K4283r237j9061q319r037j5532k3608n469
$$ 31180 47810 74275 69841 46085 20635 44918 35681 16620 8301 -736 -16268 -39876 -45345
6445d5345J5142l86R097J8181L4922k579j4411O419j7440m1723j0203J5640J6968
$$ -45345 -30203 -30589 -21492 -3311 31611 29032 14621 21040 3600 -38123 -48326 -32686 -15718
6432a5718Q16j9564m846J2811M3187J3041L09j4806j8757j0224J793j127m431
$$ -15718 -14902 -34466 -39312 -26501 16686 29727 30036 15230 -3527 -13751 -11958 -13085 -17516
6419a7516J550K0377L570J0349o475o037J7198r855k6532k0883M557N0112j6497
$$ -17516 -15966 4411 7981 18330 11855 5818 23016 13161 -13371 -34254 -29697 20415 3918
6406C918j3818k079L526J5344J1446j84l3066k5929K1388K2315Q836l290j2562
$$ 3918 -9900 -11979 -8453 6891 18337 18153 -14913 -40842 -19454 2861 11697 8407 -4155
6393d155j1000r662J4038j9356p31L3857j1416k0561J3922J7902k0292L691o575
$$ -4155 -15155 -24817 -10779 -30135 -30866 2991 -8425 -28986 -15064 2838 -17454 -13763 -20338
6380b0338p97K7381j0089j8747J5701J9823j283k9575k628J0303j4887N51L4270
$$ -20338 -21135 6246 -3843 -22590 -6889 12934 11651 -17924 -20552 -10249 -25136 -24585 9685
6367I685K1006L6209p659p326j024K0640j3068m3030j9821k5293j0004K9301L195
$$ 9685 30691 66900 59241 51915 50891 71531 58463 15433 -4388 -29681 -39685 -10384 -7189
6354g189n991Q567L620L421J2320n494k5244n952j464L131J8547p696J3182L6373
$$ -7189 -13180 -4613 -993 2428 14748 9254 -15990 -21942 -23406 -20275 -1728 -9424 3758 40131
6340D0131r887L381Q110J4026k2255k3482j6478j4465j3888k0383J4703K1713
$$ 40131 30244 33625 41735 55761 33506 10024 -6454 -20919 -34807 -55190 -40487 -18774
6328a8774J832l374j9006p579M3791k41l160P480k8757j164K8127J5079J0694
$$ -18774 -16942 -20316 -39322 -46901 -3110 -3351 -6511 969 -27788 -28952 -825 14254 24948
6315B4948L978p128J1704l6153l8202K1539K4637k3208j4155J5851L5731j2935
$$ 24948 28926 21798 33502 -2651 -40853 -19314 5323 -17885 -32040 -16189 19542 6607
6303F607j4783j5175k0332l4852j0509K0795J3073J8687o121J5989p325J0211
$$ 6607 -8176 -23351 -43683 -78535 -89044 -68249 -55176 -36489 -42610 -26621 -33946 -23735
6291b3735J178R181r25j9921P858k0652J0538p832p832r01K952k353m833K4730
$$ -23735 -22557 -13376 -14301 -34222 -26364 -47016 -36478 -44310 -52142 -53043 -50091 -52444 -57277 -32547
6277c2547K0233R490j8642J0102J9370J4487l2301p573K5972M931j6711j2983
$$ -32547 -12314 -2824 -21466 -11364 8006 22493 -9808 -17381 8591 13522 -3189 -16172
6265a6172j6438j3007J8276K5729J0942q824N594j6603J155j4345o561J518J6561
$$ -16172 -32610 -45617 -27341 -1612 9330 506 6100 -10503 -9348 -23693 -30254 -28736 -12175
6252a2175J2501R103p696Q081k0347k5936p065r782J6055m985M712O982R90L1573
$$ -12175 326 9429 1733 9814 -10533 -36469 -43534 -53316 -37261 -42246 -37534 -30552 -29562 2011
6238B011l48J3115J567j1886k7979n222J7530n889M145j6650p30L0411M328P444
$$ 2011 1663 14778 16345 4459 -23520 -28742 -11212 -17101 -12956 -29606 -30336 75 4403 11847
6224A1847j6075j4691M777K517O96k0546k4357J3773J024J8020Q609J7979Q658
$$ 11847 -4228 -18919 -14142 -11625 -10929 -31475 -55832 -42059 -41035 -23015 -14406 3573 12231
6211A2231P748j2520p848J191J5041Q334P984l9179j272j2009L1185L3568j9502
$$ 12231 19979 7459 -389 802 15843 24177 32161 -7018 -8290 -20299 10886 44454 24952
6198B4952k3876k3069K3983K1579J1323m403m541l1960j4233K3181j1137j4533
$$ 24952 1076 -21993 1990 23569 34892 30489 25948 -6012 -20245 2936 -8201 -22734
6186b2734k247M707q490j6869j2423J7271L5278J6058K778k2332J6897m219k6138
$$ -22734 -24981 -20274 -28764 -45633 -58056 -40785 -5507 10551 13329 -9003 7894 3675 -22463
6173b2463J285o854J3680m44k2773q133Q328J9965k776K7464j1480M454R591J3609
$$ -22463 -21178 -28032 -14352 -14796 -37569 -45702 -37374 -17409 -20185 7279 -4201 253 9844 23453
6159B3453l8353m822J596L442J8957l717J0012K2193O912l100k4861j3600K0588
$$ 23453 -14900 -19722 -18126 -14684 4273 556 10568 32761 39673 36573 11712 -1888 18700
6146A8700j1902j7882k082R707j8888n066K8525J6432L0971r011l0079k5097j9943
$$ 18700 6798 -11084 -13166 -3459 -22347 -27413 1112 17544 48515 39504 9425 -15672 -35615
6133c5615m238M343L0319K6008J1330k8385j8418m422K646J5811j3450j3185l970
$$ -35615 -39853 -35510 -5191 20817 32147 3762 -14656 -19078 -16432 -621 -14071 -27256 -31226
6120c1226J9769k693o167M951N953k6462P551M1643O794r16k912j511k8568n277
$$ -31226 -11457 -14150 -20317 -15366 -9413 -35875 -28324 13319 20113 19197 16285 14774 -13794 -19071
6106a9071J4581Q752R380O493J9614R414J6710o915j4563o355l1358p321j3459
$$ -19071 -4490 4262 13642 20135 39749 49163 65873 58958 44395 38040 6682 -639 -14098
6093a4098k5135j6737m124K2858K6184J0586o32O797n103J387k597Q406l156j6924
$$ -14098 -39233 -55970 -60094 -37236 -11052 -466 -1098 5699 596 1983 -614 7792 4636 -12288
6079a2288J1648o611J2364j6874J890K6060J5562q25J669P657j8242n34J3575
$$ -12288 -640 -7251 5113 -11761 -9871 16189 31751 30926 32595 40252 22010 21476 35051
6066C5051j4928l3204m4325K4790N3345P906O152K531m515p712l718k7547l31
$$ 35051 20123 -13081 -57406 -32616 20729 28635 34787 37318 32803 25091 21373 -6174 -6505
6053f505J628j3330k1770m969J0889l0146K1222L2454J428j3168J700O916n798
$$ -6505 -4877 -18207 -39977 -44946 -34057 -64203 -42981 -10527 -9099 -22267 -20567 -13651 -19449
6040a9449J100N996L4781k2821m6992q403R090K1034k2127j7534j609j1094J207
$$ -19449 -18349 -12353 22428 -393 -47385 -55788 -46698 -25664 -47791 -65325 -66934 -78028 -76821
6027g6821Q924J7525K1137L2489L5573l879k4613q547o881n846P613j3427k9180
$$ -76821 -67897 -50372 -29235 3254 38827 34948 10335 1788 -5093 -10939 -3326 -16753 -45933
6014d5933P149n505p245l277k645M1370J0409n281J0103L2648r281k6555k6156
$$ -45933 -38784 -44289 -51534 -54811 -57456 -16086 -5677 -10958 -855 31793 22512 -4043 -30199
6001c0199j3190p04K3023L7570j3841k4031n870j1762m779K7478J5396J271k0147
$$ -30199 -43389 -44093 -21070 16500 2659 -21372 -27242 -39004 -43783 -16305 -909 362 -19785
5988a9785n193l194j1084L4504L8693J7315L965j9857k1068J1490q690k2519m816
$$ -19785 -24978 -28172 -39256 -4752 33941 51256 55221 35364 14296 25786 17096 -5423 -10239
5975a0239p74o063Q355m212m306R888K0658k881J4805R492j0762j9547k6950o325
$$ -10239 -11013 -17076 -8721 -12933 -17239 -7351 13307 10426 25231 34723 23961 4414 -22536 -28861
5961b8861p07j4768k2746l1267M0816L5843J4701L501j923p514q564K009Q332
$$ -28861 -29568 -44336 -67082 -98349 -57533 -21690 -6989 -3488 -5411 -12925 -21489 -19480 -11148
5948a1148j0786M823J9103j4747j6079j018J4675J4954J4636J5517o314q14J8377
$$ -11148 -21934 -17111 1992 -12755 -28834 -29852 -15177 -223 14413 29930 23616 22802 41179
5935D1179r431j2111J14j2724Q627Q997J9979l194o279l0737l889j4720K3978
$$ 41179 31748 19637 19751 7027 15654 24651 44630 41436 35157 4420 531 -14189 9789
5922I789k3963j3440J6512J4720o381J322q096j646J3878o57N887l460J9115M581
$$ 9789 -14174 -27614 -11102 3618 -2763 -1441 -9537 -11183 2695 2038 7925 4465 23580 28161
5908B8161j0311l5453R265Q953K7974O021l0402p110L3157j9517J6806j202k7532
$$ 28161 17850 -17603 -8338 615 28589 34610 4208 -2902 30255 10738 27544 26342 -1190
5895a190k322o580k7238K7087R295P54R878J431j1342J52l858k0j6598k5542K203
$$ -1190 -3512 -10092 -37330 -10243 -948 -194 9684 11115 -227 -75 -3933 -3953 -20551 -46093 -43890
5880d3890j579K5417J59J1943J4596J3212j1047k4894j0512j0382q292J2366J9917
$$ -43890 -45469 -20052 -19893 -7950 6646 19858 8811 -16083 -26595 -36977 -45269 -32903 -12986
5867a2986j0719J2306k2090k4484O077J5264j905O821J4526J9248n909L664N049
$$ -12986 -23705 -11399 -33489 -57973 -51896 -36632 -38537 -31716 -17190 2058 -3851 -187 4862
5854D862p783k6801N164O788k5150j6143k3940j748J6310j255j175K5425K3837
$$ 4862 -2921 -29722 -24558 -17770 -42920 -59063 -83003 -84751 -68441 -69696 -70871 -45446 -21609
5841b1609J1271Q121J086k6289Q380J3634P244Q732J2960k196k3102p112n613
$$ -21609 -10338 -2217 -1131 -27420 -19040 -5406 1838 10570 23530 21334 -1768 -8880 -14493
5828a4493J7117Q198q358O187q357q248k963n538J3882J897J867r781j4243k5121
$$ -14493 2624 10822 2464 8651 294 -7954 -10917 -16455 -2573 -676 1191 -8590 -22833 -47954
5814d7954J0007P073k2154q868K3049k656Q28O397k3448K4733L4882N895o059
$$ -47954 -37947 -30874 -53028 -61896 -38847 -41503 -40675 -34278 -57726 -32993 1889 7784 1725
5801A725n837M619P978k4482j9089K0739M5193J7800P787m8758j4452j7414m336
$$ 1725 -4112 507 8485 -15997 -35086 -14347 30846 48646 56433 7675 -6777 -24191 -28527
5788b8527R241k121j2079j2485O143O303j0370J2852J1175j932k0102J7569K3290
$$ -28527 -19286 -21407 -33486 -45971 -39828 -33525 -43895 -31043 -19868 -21800 -41902 -24333 -1043
5775a043Q028j5328k1422j2166J5784K173k3606j6635K0171L8909Q295p970j0366
$$ -1043 6985 -8343 -29765 -41931 -26147 -23974 -47580 -64215 -44044 -5135 3160 -4810 -15176
5762a5176n55J3546k8448j4509K4556m259n662K7171J0451K186J0018J5209O046
$$ -15176 -15731 -2185 -30633 -45142 -20586 -24845 -30507 -3336 7115 9301 19319 34528 40574
5749D0574n2394k4503k453R492k4432r040J5365N047P069R056J2408pl4853L11
$$ 40574 -11820 -36323 -38776 -29284 -53716 -62756 -47391 -42344 -35275 -26219 -13811 -13818 -48671 -48360
5735d8360N094L9992K4411p962M11k405m741n889M62j133j5276J7930N439k71
$$ -48360 -43266 -3274 21137 13175 13586 11181 6440 551 1013 -120 -15396 2534 7973 7702
5721G702j589j2039j8365m988m808l5174k5774J7403L7054K1444J1178j72J043
$$ 7702 6113 -5926 -24291 -29279 -34087 -69261 -95035 -77632 -40578 -19134 -7956 -8128 -7085
5708g085J471j590K1708n546O125k2011k0230J3735K702k072R605l32L223J5218
$$ -7085 -5614 -7204 14504 8958 15083 -6928 -27158 -13423 -10721 -12793 -3188 -3520 -297 14921
5694A4921L859p970j9278j2863o741j962Q535L1641J2707l3381j1232J972J1056
$$ 14921 18780 10810 -8468 -21331 -28072 -30034 -21499 10142 22849 -10532 -21764 -19792 -8736
5681h736J1279N675j9454j5807K2405J0425J2934L199j4231j8775j6784o50N441
$$ -8736 2543 8218 -11236 -27043 -4638 5787 18721 21920 7689 -11086 -27870 -28520 -23079
5668b3079J0834J666k76J568r293K3198j0694J222J8439j8260j4159O160K685
$$ -23079 -12245 -10579 -10855 -9287 -18580 4618 -6076 -4854 13585 -4675 -18834 -12674 -9989
5655i989j3607m843J4546R969K0345o841N621J1828j4306p020q934n025m144j0596
$$ -9989 -23596 -28439 -13893 -3924 16421 9580 15201 27029 12723 5703 -3231 -8256 -12400 -22996
5641b2996L0055M1740J3223j4563J235j9240k1337k5120J671K3667k5315k4012
$$ -22996 7059 48799 62022 47459 48694 29454 8117 -17003 -15332 8335 -16980 -40992
5629d0992J6215J7202R079k2146k0172R167M0355K0924k6192j1427k0923M041
$$ -40992 -24777 -7575 1504 -20642 -40814 -31647 8708 29632 3440 -7987 -28910 -24869
5617b4869J3045J923J5828J1548j4773k3861j4324m422L7395J0620q27q876k3183
$$ -24869 -11824 -9901 5927 17475 2702 -21159 -35483 -39905 -2510 8110 7283 -1593 -24776
5604b4776j4200L0633J3229J4276J4126q215j5556l6273j3180K2658K989r680
$$ -24776 -38976 -8343 4886 19162 33288 25073 9517 -26756 -39936 -17278 -14289 -23969
5592b3969n487K8406L707j0084r806K763j0498L076J9284J2216r222L411J1246
$$ -23969 -29456 -1050 2657 -7427 -17233 -14470 -24968 -21892 -2608 9608 386 3797 15043
5579A5043J2829l0222j6922M1202J8827j9570k3624J9703J0552k406L336j2495
$$ 15043 27872 -2350 -19272 21930 40757 21187 -2437 17266 27818 25412 28748 16253
5567A6253m88o645j3414m814k014J2135q738K1284K7431j0450j6183l4255k0013
$$ 16253 15765 9120 -4294 -9108 -11122 1013 -7725 13559 40990 30540 14357 -19898 -39911
5554c9911J3141N198O731K7771J3148O622p331j3385j7572n853j4373j5316o466
$$ -39911 -26770 -21572 -14841 12930 26078 32700 25369 11984 -5588 -11441 -25814 -41130 -47596
5541d7596J5658J7078k288Q503J6938J1955k4035q853l272R644K1107J3333M511
$$ -47596 -31938 -14860 -17148 -8645 8293 20248 -3787 -12640 -15912 -6268 14839 28172 32683
5528C2683j3340k9669Q716K5700Q577o295L589l2294k8483K7364j1863J7648J5202
$$ 32683 19343 -10326 -1610 24090 32667 26372 29961 -2333 -30816 -3452 -15315 2333 17535
5515A7535L499L175j626j7814j5786O228m944J710J1950j2330m50J0259j4387
$$ 17535 21034 24209 22583 4769 -11017 -4789 -9733 -8023 3927 -8403 -8853 1406 -12981
5502a2981k1590J0555M2280m819l4495Q661k6047m927L3147N251k387J1958J6388
$$ -12981 -34571 -24016 18264 13445 -21050 -12389 -38436 -43363 -10216 -4965 -7352 4606 20994
5489B0994M910m681l1036r981J8390j0097j2742j3387J6825k589k1346J208M459
$$ 20994 25904 21223 -9813 -19794 -1404 -11501 -24243 -37630 -20805 -23394 -44740 -43532 -39073
5476c9073J145J891K3069M460K9091q982n5782j6782q609M5218M8262j7976k2482
$$ -39073 -37928 -36037 -12968 -8508 20583 11601 -44181 -60963 -69572 -24354 23908 5932 -16550
5463a6550J3963K3038o938j5406n727j2810m083j6210p805K2739L2115j79P403
$$ -16550 -2587 20451 13513 -1893 -7620 -20430 -24513 -40723 -48528 -25789 6326 6147 13550
5450A3550K1049j4428j9384r055j0149m283L646k831K3327K108J3882J7542J5381
$$ 13550 34599 20171 787 -8268 -18417 -22700 -19054 -21885 1442 3550 17432 34974 50355
5437E0355j2739n4756Q927K8138n542j470K4094m483k9822m3404O959K9157K4403
$$ 50355 37616 -17140 -8213 19925 14383 12913 37007 32524 2702 -40702 -33743 -4586 19817
5424A9817q707J0900j0453K567J534k0140j5262K892K1238L4260N357j713J983
$$ 19817 11110 22010 11557 14124 15658 -4482 -19744 -16852 4386 38646 44003 42290 44273
5411D4273p051j2488l8728k2350L6774N783k4457p003J9177r659j1959j5497p20
$$ 44273 37222 24734 -13994 -36344 430 6213 -18244 -25247 -6070 -15729 -27688 -43185 -43905
5398d3905M5092K0451l2128J1353j085l9704j2000Q230J1336K4525K2510p872
$$ -43905 1187 21638 -10490 863 -222 -39926 -51926 -43696 -32360 -7835 14675 6803
5386F803l6572k193j789o430K1307M4202J0584k6682j8524m30n363j6543J1819
$$ 6803 -29769 -31962 -33751 -40181 -18874 25328 35912 9230 -9294 -9724 -15087 -31630 -19811
5373a9811N1340M253o301J1912l3703O46L4517K651l1960j4171k0405j1907O777
$$ -19811 31529 35782 29481 41393 7690 8336 42853 45504 13544 -627 -21032 -32939 -26162
5360b6162P14N2823J9624k9364m1909K4868K5833K364j5767j6084k2331j7509
$$ -26162 -25448 27375 46999 17635 -24274 594 26427 28791 13024 -3060 -25391 -42900
5348d2900J4751m767J1214R363r819k1075J1457K3578J8553j494R59O422o369
$$ -42900 -28149 -32916 -21702 -12339 -22158 -43233 -31776 -8198 10355 8861 9820 16242 9873
5335I873m786k4260j0550K0088Q0L618M130k9384l974n586k9176K7364J9816K047
$$ 9873 5087 -19173 -29723 -9635 -9555 -5937 -1807 -31191 -35165 -40751 -69927 -42563 -22747 -20700
5321b0700Q402k781o946k8668R687J9701J5996J6672K3042J4955l4383n2991j8232
$$ -20700 -12298 -15079 -22025 -50693 -41006 -21305 -5309 11363 34405 49360 14977 -38014 -56246
5308e6246K7298k0855o045K7438J8569j9481j6607j3090K1359Q082R83K5415L0765
$$ -56246 -28948 -49803 -55848 -28410 -9841 -29322 -45929 -59019 -37660 -29578 -28595 -3180 27585
5295B7585K1778k597j4158l006m016k4361r06o085r030J0744J248M168m340j1443
$$ 27585 49363 46766 32608 29602 25586 1225 319 -5766 -14796 -4052 -2804 1364 -2976 -14419
5281a4419J695L1672K2494j7904k7523j963J5555j2585j9544J4233J9469J5090
$$ -14419 -12724 18948 41442 23538 -3985 -5948 9607 -2978 -22522 -8289 11180 26270
5269B6270p14l2135j7722j9232p173J0859J9176J8028j9030j5308J7075k256r886
$$ 26270 25556 -6579 -24301 -43533 -50706 -39847 -20671 -2643 -21673 -36981 -19906 -22162 -32048
5256c2048o298L3004L1086M11J8305j7772k9424j4942j1771n736j3317K88J0337
$$ -32048 -38346 -5342 25744 26155 44460 26688 -2736 -17678 -29449 -35185 -48502 -48214 -37877
5243c7877M71O199J1052j8506P782O425M330K7428m870j720K9973k2817m2931
$$ -37877 -37406 -31207 -20155 -38661 -30879 -24454 -20124 7304 2434 714 30687 7870 -35061
5230c5061J9422J9189R158j9045N79n227j237l0501J6119Q031L756l668N735K978
$$ -35061 -15639 3550 12708 -6337 -5758 -10985 -12222 -42723 -26604 -18573 -14817 -18485 -12750 -9772
5216i772J5051J352k5237j1309P258K5200K8638j1254k4770j9977j0309n518O423
$$ -9772 5279 6631 -18606 -29915 -22657 2543 31181 19927 -4843 -24820 -35129 -40647 -34224
5203c4224j510n374K3699N676K5437j9785K159J1165j14p319q04K1724Q009j7575
$$ -34224 -35734 -41108 -17409 -11733 13704 -6081 -3922 7243 7129 -190 -994 20730 28739 11164
5189A1164j1643j8924q069k828L4569J9422L160j7785J885Q026j4402j8625K73
$$ 11164 -479 -19403 -27472 -30300 4269 23691 26851 9066 10951 18977 4575 -14050 -13777
5176a3777M274M740l417j6812O647N34j3466n159R780K0826J8079k7001m6689
$$ -13777 -9503 -4763 -8180 -24992 -18345 -17811 -31277 -36436 -26656 -5830 12249 -14752 -61441
5163f1441J1235j0813J34K0979K3696k37Q470L3186J89l3646m542Q593k4296O325
$$ -61441 -50206 -61019 -60885 -39906 -16210 -16447 -7977 25209 25398 -8248 -12790 -4197 -28493 -22168
5149b2168n65r126p256J6502K2265K3798J5983j6136k1158j8431j7757J0270L2247
$$ -22168 -22733 -31859 -39115 -22613 -348 23450 39433 23297 2139 -16292 -34049 -23779 8468
5136H468K4517k648O392k6333j5437j877k8312l3029K0489J263J4808M5008K2162
$$ 8468 32985 30337 36729 10396 -5041 -6918 -35230 -68259 -47770 -46507 -31699 13309 35471
5123C5471m4117j8408K8566J6524L152k7426j8614l184R249n639j5687K2950M753
$$ 35471 -8646 -27054 1512 18036 21188 -6238 -24852 -28036 -18787 -24426 -40113 -17163 -12410
5110a2410l7507K8304J2287j4880K929K817L434M615J998J8698L111j2811n7653
$$ -12410 -49917 -21613 -9326 -24206 -21277 -18460 -15026 -10411 -8413 10285 13396 585 -57068
5097e7068q696K2248L0842J3781j0139n28N601R262o50J2176J0044p34J999N141
$$ -57068 -65764 -43516 -12674 1107 -9032 -9560 -3959 5303 4653 16829 26873 26139 28138 33279
5083C3279J3703o953j0988j7130j0880O774o781n109n358m129r05j0861k075r15
$$ 33279 46982 40029 29041 11911 1031 7805 1024 -4085 -9443 -13572 -14477 -25338 -27413 -28328
5069b8328o574Q015l374J5088K6031J7047j3053n1358p414L086K6625K2135N171
$$ -28328 -34902 -26887 -30261 -15173 10858 27905 14852 -36506 -43920 -40834 -14209 7926 13097
5056A3097R727L0668l706m6957l8228j5309Q89J5699J1068J1991K7172m272K6152
$$ 13097 22824 53492 49786 2829 -35399 -50708 -49819 -34120 -23052 -11061 16111 11839 37991
5043C7991K0248O305k920k3188j8854m16k3928P831K0649r155j1208j1873P278
$$ 37991 58239 64544 61624 38436 19582 19166 -4762 3069 23718 14563 3355 -8518 -1240
5030a240j6356k7708J4804L3344K5658K1450j9423k7588n834n475J282k2721L135
$$ -1240 -17596 -45304 -30500 2844 28502 49952 30529 2941 -2893 -8368 -7086 -29807 -26672
5017b6672M483o99j3238N570M483m675J3574R018j0445J775j3179j716M4621K6420
$$ -26672 -22189 -22888 -36126 -30556 -26073 -30748 -17174 -8156 -18601 -16826 -30005 -31721 12900 39320
5003C9320j5273j6626j0187j2098m137r379J0547K0291J396P024R55j3428J4311
$$ 39320 24047 7421 -2766 -14864 -19001 -28380 -17833 2458 3854 10878 11833 -1595 12716
4990A2716L12k0433J2895J7456k5907L0991j0232k2182Q105k5966n309m539p457
$$ 12716 13028 -7405 5490 22946 -2961 28030 17798 -4384 3721 -22245 -27554 -32093 -39550
4977c9550p774K7319k466O652J186k6098K4271J2696k7219k3134J7340Q479R051
$$ -39550 -47324 -20005 -22471 -15819 -14633 -40731 -16460 -3764 -30983 -54117 -36777 -28298 -19247
4964a9247L383M072j0271L157K576N205J4717J2347l4089l2092m558L0341L625
$$ -19247 -15864 -11792 -22063 -18906 -16330 -11125 3592 15939 -18150 -50242 -54800 -24459 -20834
4951b0834N971K5394K4868J600j8511k653j8690p449R395J8701J524k1296k1667
$$ -20834 -14863 10531 35399 36999 18488 15835 -2855 -10304 -909 17792 19316 -1980 -23647
4938b3647o44K0976J5879p959k7274k131J5975j0743J5637O110m227j6590o220
$$ -23647 -24291 -3315 12564 4605 -22669 -24800 -8825 -19568 -3931 2179 -2048 -18638 -24858
4925b4858R84j9012j3045K2403P350k3261J6327M4811J7110m027k0205r865j124
$$ -24858 -23874 -42886 -55931 -33528 -26178 -49439 -33112 11699 28809 24782 4577 -5288 -6412
4912f412j3275L7563K0214l0235j8091L3419l596j7546R505K3373J335j3625m2215
$$ -6412 -19687 17876 38090 7855 -10236 23183 19587 2041 11546 34919 36254 22629 -19586
4899a9586N444O976l0595m122Q754J8229m146J7328K6419K912j6771j7084j517
$$ -19586 -14142 -7166 -37761 -41883 -33129 -14900 -19046 -1718 24701 27613 10842 -6242 -7759
4886g759P888k5272j4538J9659J6152O053o455J5087J2545Q986n105k7095p108
$$ -7759 129 -25143 -39681 -20022 -3870 2183 -4272 10815 23360 32346 27241 146 -6962
4873f962j5815Q565k200M506j0745Q307k679J6198o676j5829j5210L4827L0276
$$ -6962 -22777 -14212 -16412 -11906 -22651 -14344 -17023 -825 -7501 -23330 -38540 -3713 26563
4860B6563m797k4419j0151K704j9428q040j044K3658K215M572j0442J2407J0291
$$ 26563 21766 -2653 -12804 -10100 -29528 -37568 -38612 -14954 -12739 -8167 -18609 -6202 4089
4847D089J923j4289J1350l105o429k938K625j425J0141n368m038P512j2196j2525
$$ 4089 6012 -8277 3073 -32 -6461 -9399 -6774 -8199 1942 -3426 -7464 48 -12148 -24673
4833b4673j7686J625L0206p756J1856n713k1727j6029N290k0213M304k957K5243
$$ -24673 -42359 -40734 -10528 -18284 -6428 -12141 -33868 -49897 -44607 -64820 -60516 -63473 -38230
4820c8230J1875j2927K6563J2038J1880m014p858q509j3687j6316r849j227J3471
$$ -38230 -26355 -39282 -12719 -681 11199 7185 -673 -9182 -22869 -39185 -49034 -50261 -36790
4807c6790J3623O335n557m530J3103j5309K9467J8949l886r662j3388J2103J0495
$$ -36790 -23167 -16832 -22389 -26919 -13816 -29125 342 19291 15405 5743 -7645 4458 14953
4794A4953j9455K860J2932J9072J7397k5288k3148K7835J4554l2547j3020P88
$$ 14953 -4502 -1642 11290 30362 47759 22471 -677 27158 41712 9165 -3855 -3067
4782c067J916p060l030L947J8462k8532m70J9506O840P756j8616q469J8664j340
$$ -3067 -1151 -8211 -11241 -7294 11168 -17364 -17834 1672 8512 16268 -2348 -10817 7847 6507
4768F507J414L532L192r000m14p58J501m686k9529j75p36K3453j800O490P129
$$ 6507 7921 11453 14645 5645 5231 4473 5974 1288 -28241 -28416 -29152 -5699 -7499 -1009 6120
4753F120J9073L252r703k1015l24J27j4209M785p470j4160R541J2145j3426R885
$$ 6120 25193 28445 18742 -2273 -2597 -2470 -16679 -11894 -19364 -33524 -23983 -11838 -25264 -15379
4739a5379L50J104k7865p829L1279O222R856j3962M821L984j5200k8046J1171
$$ -15379 -15029 -13925 -41790 -49619 -18340 -12118 -2262 -16224 -11403 -7419 -22619 -50665 -39494
4726c9494K2103j4975j798n304P958O547J4857o633N05J5459O293j2033j5248
$$ -39494 -17391 -32366 -34164 -39468 -31510 -24963 -10106 -16739 -16234 -775 5518 -6515 -21763
4713b1763J5969j9621j5322o650M732K1616N152L997Q516J974j6836k672J11N453
$$ -21763 -5794 -25415 -40737 -47387 -42655 -21039 -15887 -11890 -3374 -1400 -18236 -20908 -20797 -15344
4699a5344J5480p285m778J4093R875j0934n599k5900M392J979n002K76m292q032
$$ -15344 136 -7149 -11927 2166 12041 1107 -4492 -30392 -26000 -24021 -29023 -28747 -33039 -41071
4685d1071J5229j572n477r672K3633L6763L914n223L411k0867j9802J4094J8758
$$ -41071 -25842 -27414 -32891 -42563 -18930 17833 21747 16524 19935 -932 -20734 -6640 12118
4672A2118K391q042m054j1344J0014j6030L197q305O646q911L6847J3303r266
$$ 12118 14509 6467 2413 -8931 1083 -14947 -11750 -20055 -13409 -22320 14527 27830 18564
4659A8564j0844J558J7303k925j5000q015l2022L708K4059K0564j4064l826O56
$$ 18564 7720 9278 26581 23656 8656 641 -31381 -27673 -3614 16950 2886 -940 -284
4646b84j8312j8101J2202L1036n418l5460J1818Q945N191j7613n768k579J2605
$$ -284 -18596 -36697 -24495 6541 1123 -34337 -22519 -13574 -8383 -25996 -31764 -34343 -21738
4633b1738N257R702J3283j25j6736m453J5146j7571k3674q012L255K4359Q048
$$ -21738 -16481 -6779 6504 6379 -10357 -14810 336 -17235 -40909 -48921 -45666 -21307 -13259
4620a3259j5737M182m864J3081J6285K2442M190q339J7890k2461n6624k2911l344
$$ -13259 -28996 -24814 -29678 -16597 -312 22130 26320 17981 35871 13410 -43214 -66125 -69469
4607f9469K9472J7177O592m195r07N077L825j7248m0689J0619J1882J3259J9137
$$ -69469 -39997 -22820 -16228 -20423 -21330 -16253 -12428 -29676 -70365 -59746 -47864 -34605 -15468
4594a5468J0580n683j327j0531L010j4932N638K500l313K5475K7054k1197k8159
$$ -15468 -4888 -10571 -11898 -22429 -19419 -34351 -28713 -26213 -29526 -4051 23003 1806 -26353
4581b6353J9330J5972K568m625L2297j6383j1953P79L1887j495O970N151k4836
$$ -26353 -7023 8949 11517 6892 39189 22806 10853 11632 43519 42024 48994 54145 29309
4568B9309m0401K424k847J6949l274j9452L1245J0619j0559l6898n735L636Q299
$$ 29309 -11092 -8668 -11515 5434 2160 -17292 13953 24572 14013 -22885 -28620 -24984 -16685
4555a6685L0978Q226R429j150k7259L453J0171K289l282R46J7268p847k4129n128
$$ -16685 14293 22519 31948 30798 3539 6992 17163 19452 16170 17116 34384 26537 2408 -2720
4541b720P910k950J8340J0000j0197j8075j1403m539j1517j6225L2894J5877J3867
$$ -2720 5190 2240 20580 30580 20383 2308 -9095 -13634 -25151 -41376 -8482 7395 21262
4528B1262l1503j2327k4207O571K5905p382j3556L315L681N173J0056J3156K805
$$ 21262 -10241 -22568 -46775 -40204 -14299 -21681 -35237 -31922 -28241 -23068 -13012 144 2949
4515B949N783J6912l206P893P315k8178j8282k414J9512M2416L301j5650j282
$$ 2949 8732 25644 22438 30331 37646 9468 -8814 -11228 8284 50700 54001 38351 37069
4502C7069n253m466q043J804k0580q748L9082N006l4046J4147J4016j1890k416
$$ 37069 31816 27350 19307 21111 531 -8217 30865 35871 1825 15972 29988 18098 15682
4489A5682P288K1471L436j697J692m3267j0779j600J41N846K8248K220j3965k7224
$$ 15682 22970 44441 47877 46180 47872 4605 -6174 -7774 -7633 -1787 26461 28681 14716 -12508
4475a2508j5320J0648K1664j2863M884j0183l077j2063J9995J0265J6628J3384
$$ -12508 -27828 -17180 4484 -8379 -3495 -13678 -16755 -28818 -8823 1442 18070 31454
4463C1454j823j0610J5678k5111q176R190j7360j7709j0604J1750J6666K1267
$$ 31454 29631 19021 34699 9588 1412 10602 -6758 -24467 -35071 -23321 -6655 14612
4451A4612K1449J1873p911m394j6837n180r021Q481J4053k0932j4967K5103K979
$$ 14612 36061 47934 40023 35629 18792 13612 4591 13072 27125 6193 -8774 16329 19308
4438A9308o577j5698M893R61r214o111j76P851N710J1683p94l1779n144r611J7430
$$ 19308 12731 -2967 1926 2887 -6327 -12438 -12614 -4763 947 12630 11836 -19943 -25087 -34698 -17268
4423a7268K1263J6927p353o398j7772p638j4722K1957M830R028J9445L732j6684
$$ -17268 3995 20922 13569 7171 -10601 -18239 -32961 -11004 -6174 2854 22299 26031 9347
$$ [...]
##END NTUPLES=NMR SPECTRUM
##END=
