##TITLE=Analysis number 315045
Compound Code mo 07766
Project Code adrs
Chemist Name endeavour
##JCAMPDX= 6.0         $$ Bruker NMR JCAMP-DX V2.0
##DATA TYPE= NMR SPECTRUM
##DATA CLASS= NTUPLES
##ORIGIN= Bruker BioSpin GmbH
##OWNER= NMR
$$ XWIN-NMR		Version 3.5
$$ Thu Nov  3 13:41:39 2005 GMT Standard Time (UT+0h)  MAYBRIDGE\NMR@NMR_250MHZ
##.OBSERVE FREQUENCY= 250.131544655141
##.OBSERVE NUCLEUS= ^1H
##.ACQUISITION MODE= SIMULTANEOUS (DQD)
##.ACQUISITION SCHEME= undefined
##.AVERAGES= 16
##.DIGITISER RES= 18
##SPECTROMETER/DATA SYSTEM= dpx250
##.PULSE SEQUENCE= zg30
##.SOLVENT NAME= DMSO
##.SHIFT REFERENCE= (INTERNAL, DMSO, 0, 16.522)
##AUDIT TRAIL= $$ (NUMBER, WHEN, WHO, WHERE, WHAT)
$$ ##TITLE= Audit trail, XWIN-NMR		Version 3.5
$$ ##JCAMPDX= 5.01
$$ ##ORIGIN= Bruker BioSpin GmbH
$$ ##OWNER= NMR
$$ C:\u/data/dgb/nmr/ADRS/11890/pdata/1/auditp.txt
$$ ##AUDIT TRAIL=  $$ (NUMBER, WHEN, WHO, WHERE, WHAT)
(   1,<2005-11-03 13:40:33.47 +000>,<MAYBRIDGE\NMR>,<NMR_250MHZ>,
      <created by zg, POWCHK disabled, PULCHK disabled
       configuration hash MD5:
       62 19 C7 07 E1 42 D1 B7 37 6C 3D D0 77 39 F9 E6
       data hash MD5: 64K
       91 1F F0 D1 03 90 B1 33 5A A1 A4 1E E7 9E F3 1C>)
(   2,<2005-11-03 13:41:01.28 +000>,<MAYBRIDGE\NMR>,<NMR_250MHZ>,
      <Start of raw data processing
       ef LB = 0.3 FT_mod = 6 PKNL = 1 SI = 32K 
       data hash MD5: 32K
       82 70 57 66 BF BB 89 6E B2 96 A5 9A D6 0D FD B9>)
(   3,<2005-11-03 13:41:04.85 +000>,<MAYBRIDGE\NMR>,<NMR_250MHZ>,
      <apk 
       data hash MD5: 32K
       F8 C5 59 2B 5B 10 34 47 75 D9 EC 69 34 3C 62 64>)
(   4,<2005-11-03 13:41:07.02 +000>,<MAYBRIDGE\NMR>,<NMR_250MHZ>,
      <abs ABSG = 5 
       data hash MD5: 32K
       96 B3 93 E4 43 C5 D7 0C D6 AD C1 49 72 6D D3 87>)
$$ ##END=
$$ 
$$ hash MD5
$$ CC D4 D1 0F 45 4E B3 57 A5 80 57 9F 70 65 28 28
##$RELAX= 
##$RELAX= 
##$RELAX= 
##$RELAX= 
##$RELAX= 
##$RELAX= 
##$RELAX= 
$$ Bruker specific parameters
$$ --------------------------
##$DU= <C:\u>
##$EXPNO= 11890
##$NAME= <ADRS>
##$PROCNO= 1
##$TYPE= <nmr>
##$USER= <dgb>
##$AMP= (0..31)
100 100 100 100 100 100 100 100 100 100 100 100 100 100 100 100 100 100 
100 100 100 100 100 100 100 100 100 100 100 100 100 100 
##$AQSEQ= 0
##$AQ_mod= 3
##$AUNM= <au_zg>
##$AUTOPOS= <6 >
##$BF1= 250.13
##$BF2= 250.13
##$BF3= 250.13
##$BF4= 250.13
##$BF5= 500.13
##$BF6= 500.13
##$BF7= 500.13
##$BF8= 500.13
##$BYTORDA= 1
##$CFDGTYP= 0
##$CFRGTYP= 5
##$CHEMSTR= <none>
##$CNST= (0..31)
1 1 145 1 1 1 1 1 1 1 1 1 1 1 1 1 1 1 1 1 1 1 1 1 1 1 1 1 1 1 1 1 
##$CPDPRG= <>
##$CPDPRG1= <>
##$CPDPRG2= <>
##$CPDPRG3= <>
##$CPDPRG4= <mlev>
##$CPDPRG5= <mlev>
##$CPDPRG6= <mlev>
##$CPDPRG7= <mlev>
##$CPDPRG8= <mlev>
##$CPDPRGB= <>
##$CPDPRGT= <>
##$D= (0..31)
0 1 0 0 0 0 0 0 0 0.06 0 0 0 0 0 0 0.0002 0 0 0 0 0 0 0 0 0 0 0 0 0 0 
0 
##$DATE= 1131025231
##$DBL= (0..7)
120 120 120 120 120 120 120 120 
##$DBP= (0..7)
150 150 150 150 150 150 150 150 
##$DBP07= 0
##$DBPNAM0= <>
##$DBPNAM1= <>
##$DBPNAM2= <>
$$ [...]
##$SUBNAM7= <"">
##$SUBNAM8= <"">
##$SUBNAM9= <"">
##$SW= 20.6930455092707
##$SWIBOX= (0..15)
0 0 3 0 0 0 0 0 0 0 0 0 0 0 0 0 
##$SW_h= 5175.983436853
##$TD= 65536
##$TD0= 1
##$TE= 296.16
##$TE2= 300
##$TE3= 300
##$TEG= 300
##$TL= (0..7)
0 120 120 120 120 120 120 120 
##$TP= (0..7)
150 150 150 150 150 150 150 150 
##$TP07= 0
##$TPNAME0= <>
##$TPNAME1= <>
##$TPNAME2= <>
##$TPNAME3= <>
##$TPNAME4= <>
##$TPNAME5= <>
##$TPNAME6= <>
##$TPNAME7= <>
##$TPOAL= (0..7)
0.5 0.5 0.5 0.5 0.5 0.5 0.5 0.5 
##$TPOFFS= (0..7)
0 0 0 0 0 0 0 0 
##$TUNHIN= 0
##$TUNHOUT= 0
##$TUNXOUT= 0
##$USERA1= <user>
##$USERA2= <user>
##$USERA3= <user>
##$USERA4= <user>
##$USERA5= <user>
##$V9= 5
##$VALIST= <valist>
##$VCLIST= <CCCCCCCCCCCCCCC>
##$VD= 0
##$VDLIST= <DDDDDDDDDDDDDDD>
##$VPLIST= <PPPPPPPPPPPPPPP>
##$VTLIST= <TTTTTTTTTTTTTTT>
##$WBST= 1024
##$WBSW= 4
##$XGAIN= (0..3)
0 0 0 0 
##$XL= 0
##$YL= 0
##$YMAX_a= 518291
##$YMIN_a= -511952
##$ZGOPTNS= <>
##$ZL1= 120
##$ZL2= 120
##$ZL3= 120
##$ZL4= 120
##$ABSF1= 16.522
##$ABSF2= -4.171173
##$ABSG= 5
##$ABSL= 3
##$ALPHA= 0
##$AQORDER= 0
##$ASSFAC= 0
##$ASSFACI= 0
##$ASSFACX= 0
##$ASSWID= 0
##$AUNMP= <proc_1d>
##$AZFE= 0.1
##$AZFW= 0.1
##$BCFW= 0
##$BC_mod= 0
##$BYTORDP= 0
##$COROFFS= 0
##$CY= 12.5
##$DATMOD= 1
##$DC= 0
##$DFILT= <>
##$DTYPP= 0
##$F1P= 14.0000005364418
##$F2P= -0.99999901652339
##$FCOR= 0.5
##$FTSIZE= 32768
##$FT_mod= 6
##$GAMMA= 0
##$GB= 0
##$INTBC= 1
##$INTSCL= 1
##$ISEN= 128
##$LB= 0.3
##$LEV0= 0
##$LPBIN= 0
##$MAXI= 10000
##$MC2= 0
##$MEAN= 0
##$ME_mod= 0
##$MI= 0
##$NCOEF= 0
##$NC_proc= -5
##$NLEV= 6
##$NOISF1= 0
##$NOISF2= 0
##$NSP= 0
##$NTH_PI= 0
##$NZP= 0
##$OFFSET= 16.522
##$PC= 1
##$PHC0= 62.52707
##$PHC1= 9.503307
##$PH_mod= 1
##$PKNL= yes
##$PPARMOD= 0
##$PSCAL= 4
##$PSIGN= 0
##$REVERSE= no
##$SF= 250.13
##$SI= 32768
##$SIGF1= 0
##$SIGF2= 0
##$SINO= 400
##$SIOLD= 32768
##$SREGLST= <1H.DMSO>
##$SSB= 0
##$STSI= 32768
##$STSR= 0
##$SW_p= 5175.98343685301
##$SYMM= 0
##$S_DEV= 0
##$TDeff= 65536
##$TDoff= 0
##$TI= <Analysis number 999999
Compound Code 99
Book Reference 9
Project Code 9>
##$TILT= no
##$TM1= 0
##$TM2= 0
##$TOPLEV= 0
##$USERP1= <user>
##$USERP2= <user>
##$USERP3= <user>
##$USERP4= <user>
##$USERP5= <user>
##$WDW= 1
##$XDIM= 32768
##$YMAX_p= 324610088
##$YMIN_p= -378071
$$ End of Bruker specific parameters
$$ ---------------------------------
##NTUPLES= NMR SPECTRUM
##VAR_NAME=  FREQUENCY,     SPECTRUM/REAL,   SPECTRUM/IMAG
##SYMBOL=    X,             R,               I
##VAR_TYPE=  INDEPENDENT,   DEPENDENT,       DEPENDENT
##VAR_FORM=  AFFN,          ASDF,            ASDF
##VAR_DIM=   32768,         32768,           32768
##UNITS=     HZ,            ARBITRARY UNITS, ARBITRARY UNITS
##FACTOR=    0.157963299565203, 1,           1
##FIRST=     4132.6476996994, 0,             0
##LAST=      -1043.33573715361, 0,           0
##MIN=       -1043.33573715361, -378071,     0
##MAX=       4132.6476996994, 324610088,     0
$$ Real data points
##PAGE= N=1
##DATA TABLE= (X++(R..R)), XYDATA
$$ [...]
30431 -690 -41313 -164507 -171776 -167296 -107439 -52484 8919 -1937 -77838 -57786 5112 27663
30419 27663 68633 55499 26213 38202 36988 -19159 -6019 4625 29396 -17699 -4365 -9110
30407 -9110 34690 10495 -40826 -3745 37756 65512 79522 10662 -64725 -105492 -23297 44772
30395 44772 15633 -122751 -184771 -201269 -87822 -60919 -69064 -27813 -56247 -57251 -91133 -28470
30383 -28470 43312 21846 -11805 -33189 -39693 -101745 -81652 -70015 -32580 6059 28684 -19663
30371 -19663 -79209 -124882 -163936 -212362 -176745 -135582 -126174 -80237 -86432 -129853 -136109 -100179
30359 -100179 -17270 81179 -9786 -155959 -144073 -140036 -83643 -113171 -198363 -215217 -253071
30348 -253071 -190158 -3907 45337 -15430 14511 131616 139648 133677 109553 61206 -3597
30337 -3597 -26135 -14740 -10396 -14983 -63193 -41238 27550 84561 68131 3199 92394 142576
30325 142576 65015 61912 45573 32456 19883 38191 80553 135188 87595 92631 87047 32720
30313 32720 25678 58959 83052 157357 191921 168780 136997 69450 -14401 28843 136703 29289
30301 29289 -97220 -103245 -127663 -5790 4781 -16215 55881 15714 -36971 -8570 -41144
30290 -41144 -1194 -29495 -109241 -101238 -52650 -16298 -29327 -17492 -5386 -4804 -45394 -102325
30278 -102325 -103726 -77872 -46740 -76364 -46903 141567 196011 25405 -13045 -52780 -57274
30267 -57274 -82791 -47454 -7161 10637 -7731 -15897 85672 73131 91101 56348 4353 -61668
30255 -61668 -59090 -35772 -58926 -79198 -36030 5943 -27367 -141942 -189930 -249367 -221100 -93804
30243 -93804 -28829 26755 41348 -55552 -102701 -52169 -61656 -33726 79578 65847 50512 110169
30231 110169 104764 19932 -86437 -133098 -140510 -154888 -103358 -4001 99233 101601 45253 -19539
30219 -19539 31355 60503 26675 114472 135390 87489 30341 30924 4707 -13039 -35316 -105016
30207 -105016 -68515 -14472 7602 81655 137792 119511 69575 45538 100814 79874 67412
30196 67412 111404 121450 56164 43763 11170 -24117 26078 35138 32025 -39221 -13488 38355
30184 38355 83545 80530 56729 47331 20068 -11175 -112143 -80879 -29190 -1617 -12045 -82019
30172 -82019 -24055 -68709 -7928 32929 74083 -6680 36519 106222 58088 24965 32932 42460
30160 42460 37373 98015 77249 32659 38462 14343 43127 73271 102942 102205 -5200 -24884
30148 -24884 -29652 -29444 -137882 -166742 -103245 -76886 -80516 -55446 88888 123022 76733 40768
30136 40768 -62660 -70813 -118879 -126940 -44353 93724 133364 159056 116643 2051 -57115
30125 -57115 -76003 -92912 -108147 -102820 -99405 -90822 -116794 -124408 -124045 -108054 -77345 -80778 -58333
30112 -58333 -66447 -155286 -235502 -144713 -67315 -50241 -74038 -144063 -144218 -125533 -82206 52546
30100 52546 111483 158176 148884 173252 152087 126312 91711 -2104 -49600 9861 29242 36185
30088 36185 -17898 -101795 -56098 40709 35654 43429 19495 -22198 38866 87131 83160 113612
30076 113612 15041 -41045 -56571 -13704 -56562 -24483 56434 46598 5532 -141005 -166060
30065 -166060 -156048 -211818 -147700 -31721 92316 73075 -5997 41466 89753 54061 73634
30054 73634 126862 100503 36945 26690 3046 -11862 -27571 -4063 -41964 -29929 -861 -55534
30042 -55534 -199741 -181672 -108066 -148813 -40676 36349 18597 -7433 -25440 -45373 -68955
30031 -68955 -74805 -49284 10781 35910 70472 44080 -14200 57392 69369 98052 131529 126983
30019 126983 81293 51829 -21539 -20954 7526 11257 33180 3016 63298 10393 25598 64694
30007 64694 123213 157491 96735 25867 20194 31959 -24136 -16780 -7018 33156 40215 -29226
29995 -29226 -19697 16827 -28509 -110086 -72815 -3288 90623 127808 92580 55021 56944 40785
29983 40785 -48234 -52146 -17920 33371 64148 2180 -39642 -79383 -70020 4914 146549 144840
29971 144840 62941 82043 36998 -33956 4012 -30171 -10196 -56140 -65925 -12789 87328
29960 87328 149331 105110 29643 -33696 -24952 -10838 -11027 12933 -99557 -34465 116834 207354
29948 207354 143558 83723 151865 126453 94239 48255 -42669 -51787 -71472 -77732 -3608 -75541
29936 -75541 -114788 60070 112373 71754 110315 68583 71907 150287 106533 12813 -64107 -93951
29924 -93951 -13138 35229 67703 116677 101988 2164 -31166 25317 42149 65872 112392 71070
29912 71070 -15731 -57862 -78113 -56257 -13294 22624 -28641 -9710 47992 39056 24337 -22982
29900 -22982 -3460 30350 25659 39002 35720 81543 64419 44005 -75148 -54985 -48105 50973
29888 50973 145258 32978 -3818 28559 29794 57747 86415 29750 -37963 -45428 12713 -38518
29876 -38518 -99672 -167093 -122951 -70929 -25526 101560 166741 148134 127385 15220 -32638
29865 -32638 14211 9642 22678 80752 96085 90242 119530 103039 45527 64614 -7728 -49837
29853 -49837 -52720 -28366 61799 -14641 -29894 4016 11912 -16095 -9864 64102 138118 171042
29841 171042 163661 148180 99071 21407 -52178 -117948 -32080 11388 80974 76458 4955 22096
29829 22096 20123 -9272 -75342 -78300 -89878 -78710 -85405 -109683 -133913 -23291 65062 98588
29817 98588 20154 -14802 -59831 -91846 -48755 -33466 -12002 -70203 -97889 -80428 46704
29806 46704 90837 -4369 -96405 -145450 -118587 -149046 -124669 -119249 -19161 849 78268 183073
29794 183073 160866 107897 72825 49214 119276 156408 124331 61089 55188 9758 -17114 -76329
29782 -76329 27267 122589 96330 -50636 -79367 42013 86882 11598 -7555 -44705 -171076
29771 -171076 -185177 -93207 60471 124244 -26889 -104833 -117665 -141585 -77972 -18741 71096
29760 71096 9594 -44831 -16097 8514 81012 63500 25473 7871 -59253 -75465 -122909 -98591
29748 -98591 -31272 -8587 -20151 120 -34073 21632 32409 134839 246643 183413 246085
29737 246085 249539 155348 9632 -117441 -126075 -20331 9099 59553 101660 94580 30050
29726 30050 -7330 -5017 52332 65594 97498 119187 29724 -15128 40361 96341 56133 20493
29714 20493 74897 50167 35163 37485 57093 18535 -127 -29223 -102066 -111974 -124709 -72163
29702 -72163 -11550 -53333 -125449 -24484 46085 46360 -87803 6300 -37227 -119457 -26253 27082
29690 27082 24021 2100 -131463 -163373 -99613 -133101 -169142 -110073 -40785 -36635 -90365 -79893
29678 -79893 -6720 37929 25199 23977 -21287 -76004 -43297 3663 -7670 -14126 -44309 -69988
29666 -69988 -45007 61908 115947 59410 35837 117465 116011 77047 40402 -47386 -103743 -54052
29654 -54052 -6804 -74449 -35391 -57421 -62940 -33571 25252 -20649 -4259 24989 38391 10385
29642 10385 -71898 -20430 -33018 -138293 -159669 -135070 -33116 119777 152931 134413 68447
29631 68447 16189 43164 50011 83399 76063 36394 -25274 -29056 -55354 -100771 -127177 -84598
29619 -84598 -58096 -52283 -65629 -49647 -44026 -48261 -80600 -117543 -93840 -72008 -81715 -45022
29607 -45022 116 53490 -51057 -108748 -96696 -81261 -154090 -190038 -176634 -25613 26496
29596 26496 -70335 32986 70271 -12787 -116958 -145279 -179527 -109497 -173528 -64780 -63445
29585 -63445 -68259 -44449 -137268 -193132 -157350 -131209 -64120 -66496 -126680 -145144 -70154 14990
29573 14990 8921 60664 11019 -87683 -83350 5217 66401 71754 6722 -24791 27928 31884
29561 31884 80304 114290 140342 188186 178480 122962 90507 -39325 -42685 144940 193851 95684
29549 95684 2910 -76069 -72609 -622 67975 100007 75915 98794 112615 188358 119356 47644
29537 47644 2910 20195 108283 100687 178730 130302 54697 -25599 11333 -8123 14363 -24425
29525 -24425 -85388 -65555 -24514 55116 115583 5737 -85851 -87783 -5210 42013 -36701 -49298
29513 -49298 -114371 -138924 -63424 -54947 -50613 -86563 43410 133790 113556 168787 143074 26989
29501 26989 58613 85763 117069 127511 72960 75833 66810 141516 172322 153205 51402 22099
29489 22099 111799 66136 25645 15486 66799 64924 26788 -104842 -182279 -188851 46113 256135
29477 256135 180858 37354 1316 9592 -72158 -101178 -92937 -45038 -25940 -19723 -67001 -157937
29465 -157937 -136489 -125846 -69492 -45531 -43218 -14221 -4767 9006 -2082 -93261 -96375 -84607
29453 -84607 -76359 9689 33499 109003 68635 7350 68243 2319 -87972 -27944 -806 3974
29441 3974 -34799 -116312 -105962 1333 54504 -23539 -122708 -155161 -111250 -67533 21228 -65483
29429 -65483 -157885 -138027 -77238 -1280 11494 23681 34138 58890 30166 46307 99471 137799
29417 137799 137568 133977 301 -24801 -57473 -109480 -66417 -43265 85078 130680 119171 181144
29405 181144 135826 -18346 -96019 -71993 -22861 -40195 13524 57367 49830 9447 -9583
29394 -9583 -26311 -111306 -198912 -191266 -112435 -56496 -21951 -67785 -66730 -10716 -1904 1894 -32615
29381 -32615 -128594 -215245 -175162 -141260 -174344 -65149 -71827 -133545 -163596 -24705 -8647
29370 -8647 -67857 -117315 -163162 -140646 -135869 -128518 -92872 -23055 16712 43078 37634 30671 -31261
29357 -31261 -65572 -99462 -103836 -72046 -29945 -39267 -51611 -4480 -3493 30299 91817 93803 32583
29344 32583 67833 71002 61800 14760 -79844 -165542 -116558 -68529 -50944 -36197 -14715 2857
29332 2857 43596 132092 72270 51497 10951 20515 21110 -45676 -7154 75456 114817 97881
29320 97881 22732 -5006 21263 21930 -46725 1279 35090 -23185 -46216 11197 56931 64726
29308 64726 55220 23303 29905 113604 141722 214151 170714 104643 39127 -23998 -81681 -92289
29296 -92289 -22055 -10647 -40186 -5536 9508 28627 37733 59434 10077 23181 -49815 -38202
29284 -38202 -49023 -115635 -82751 -10729 7087 78499 -18195 -63052 -113236 -149872 -123018 -116692
29272 -116692 -58071 14237 55553 106170 148374 172140 147704 123420 133299 121019 115584 39154
29260 39154 -34374 -70362 7672 -37003 -106175 -89855 47760 97056 -31403 10144 22559
29249 22559 31410 135368 158362 47295 -43610 -104848 -135230 -85112 -18760 61028 35273
29238 35273 -52319 -79776 -95600 -73840 -21404 77040 102283 -53100 -77673 -53037 34340
29227 34340 15832 4788 10384 51520 70694 85453 72420 -10592 38124 12428 -253 136768
29215 136768 246412 243098 196053 121180 49016 1611 3248 -42150 -80271 -94213 -93512 -218473
29203 -218473 -284601 -156279 -18748 55674 19824 -49238 -166925 -112680 -21997 52621 8649
29192 8649 -2525 -24369 69427 51604 8249 58659 881 -31662 3062 11079 -41089 -67522
29180 -67522 -124208 -95530 -100824 -133532 -75258 -49598 -32502 -7163 57627 75010 11571 -19722
29168 -19722 30781 39446 -21738 1573 -110431 -105242 -91050 -45424 45838 34957 -38107 -2352
29156 -2352 28607 40432 37828 128567 143915 76619 2050 -38063 -87655 -160653 -112625 3756
29144 3756 78299 -31549 -118568 -27467 69161 33838 37271 48897 49433 61319 95196 8822
29132 8822 45819 42317 -26617 -7093 83046 39774 53036 78886 -5232 3413 34192 139250
29120 139250 162975 96336 92897 44173 46534 118615 116498 116967 142409 209658 175469 151105
29108 151105 69831 36117 60476 59093 49163 66759 37045 -36320 -20487 2054 3269 -9273
29096 -9273 -39776 -6404 100740 82660 76007 54093 26385 45447 102395 88685 100068 33248
29084 33248 -26033 -10284 -38503 -624 29676 75369 98801 -26928 -146246 -60332 76251
29073 76251 68765 -20638 -85673 -136816 -48625 27320 49787 25765 -10350 -70239 -101720 -122542
29061 -122542 -110033 -50021 40486 3390 -18283 -21447 -22994 -43979 -73304 -65301 -49183 14361
29049 14361 72163 84034 51165 21817 86983 36459 -20801 41916 44206 -88154 -105155 -102854
29037 -102854 1159 82731 50208 16824 -113374 -201917 -202494 -87259 -5604 34446 11281
29026 11281 -10335 -18857 -54568 -567 -15438 -70112 -95686 -47199 -45008 -85067 -24377 96121
29014 96121 131583 183759 141643 90596 49319 -88420 -127060 -81341 -1509 -38431 -25605
29003 -25605 19497 115859 69043 49688 64634 42216 44486 73629 83445 59010 88743 99625
28991 99625 -12810 -126501 -53330 94341 117281 61301 25171 -62002 -165050 -185515 -123649
28980 -123649 -76034 -147 -2823 -889 22099 818 11801 16213 -672 39358 -23366 -59809
28968 -59809 -110477 -9723 20107 104804 96971 -22235 -46359 6422 67249 71332 112547 137947
28956 137947 171431 164391 123894 65407 33081 -4422 -71674 -22571 -16461 -13114 42622 39348
28944 39348 -94876 -122018 -64617 15306 54460 2791 -9492 41149 68486 60866 -26528 -4091
28932 -4091 -20707 -16213 65777 32676 81566 81930 -1021 -22684 37587 74836 -1751 34707
28920 34707 44638 -229 -49257 -92591 -27657 -54093 -19818 10426 -5395 49377 12055 30747
28908 30747 75165 126460 213532 231805 70697 23009 88631 112004 -14097 -56883 7202
28897 7202 98752 103868 147031 115617 51126 15072 -79550 5389 52448 57068 31686 13654
28885 13654 45602 59329 92098 194060 241495 188268 151166 225497 230579 191642 147222 183262
28873 183262 254943 201004 65521 69654 179770 217141 85348 56114 63002 111970 58846
28862 58846 -32415 -14388 -26926 -30737 -12351 26202 14147 -3061 20521 43710 31160 45039
28850 45039 57521 89589 113819 133072 184399 135271 53379 35496 -70384 -157728 -170182
28839 -170182 -138957 -184347 -202845 -184454 -38422 -51649 -71386 -43340 -7854 -60304 -79058
28828 -79058 -14640 11913 -29478 9732 29203 -60216 -136467 -206764 -117445 -77616 -59843 -40111
28816 -40111 108553 20502 -5267 73582 119573 143022 21221 20013 31826 27484 88317 18151
28804 18151 -67284 -87361 -44288 -52634 865 52996 89944 16143 -67642 -49505 29828 10313
28792 10313 19880 14805 -12465 -11913 -12153 -22716 -11280 39194 76933 3976 -39620 -92977 -130182
28779 -130182 -162225 -167842 -42673 42070 15555 -575 -61639 -136211 -125126 27204 158965
28768 158965 210435 135804 46574 98726 66366 -77451 -115298 -17236 -39072 4500 29437
28757 29437 89363 135253 160542 145647 236834 234911 175154 171088 211992 135216 91254 9465
28745 9465 -4036 33723 -21765 -144229 -134991 -129472 -24202 60440 81553 9771 -67056 -166608
28733 -166608 -143227 -140122 -151112 -128556 -187037 -149842 -87268 -83371 -11696 -15294 -74737 34062
28721 34062 109868 115625 67674 -1319 -20043 -27514 -16922 -96763 -152475 -101704 -74546 -28517
28709 -28517 -89174 -42161 39990 57846 -3383 -42523 47379 215341 104077 87736 65825
28698 65825 -63 -62691 -97290 -105647 -44354 -18710 2456 9740 8427 110378 104970 95892
28686 95892 116301 177387 170465 125156 105554 126834 137373 101112 71236 -11583 -42489 42892
28674 42892 33401 11409 19775 44790 17456 -60355 -9433 72906 38944 26917 730 -46245
28662 -46245 -64489 -85051 -23474 40717 45853 69669 24945 41155 19926 64138 120217 138915
28650 138915 70617 11046 -20155 -43648 -17396 90031 91075 6975 -41920 -55170 -31856
28639 -31856 -5027 49493 -52956 -67258 -1715 39746 -35866 -82533 -48782 43825 -15686
28628 -15686 -151141 -217649 -165179 -93068 -102607 -25714 -24717 -104891 -66201 10005 -6890 -45276
28616 -45276 -73701 11339 -30117 -23764 6601 43181 87818 89899 99400 119993 107949 43830
28604 43830 -14154 10169 58407 -29372 -47764 -105768 -57300 37230 10809 25914 48751 66718
28592 66718 2445 -19926 -5725 108184 180365 158603 56785 47156 85426 189375 149047
28581 149047 43145 60856 54292 -38301 -47818 -28485 -36284 -46480 -40789 -65631 -51181 28186
28569 28186 28263 -47855 -121616 -129303 5207 13549 53591 46571 564 37585 -37231 -56839 -63848
28556 -63848 -72413 -24431 49045 43545 60997 30762 7597 78089 75462 140798 210804 105102
28544 105102 27594 3877 -10236 -985 -17891 -39024 -5156 16489 -1027 -5201 66086 98841
28532 98841 42411 24661 -14674 11754 59873 6961 -23552 -31441 -13394 1112 20009 -46703
28520 -46703 -116408 -167697 -185571 -137304 -132164 -137540 -58103 -5120 61389 94057 30641 -70789
28508 -70789 -37199 -35700 -106145 -78164 -55895 -95516 -110302 -40180 -67971 -96787 -97261 -67323
28496 -67323 24774 16301 12125 -16951 67197 67977 30787 -5694 -98743 -104538 -54008 -18345 -89903
28483 -89903 -55978 -27553 36916 -1677 10517 23888 -12231 -50211 -17580 -24029 35460 54101
28471 54101 -47063 -36906 -68617 -129658 -165784 -114269 -8882 37416 16526 -7618 -66451
28460 -66451 -2829 50969 113289 133667 107463 107607 67224 -8507 -106460 -42686 69375 101342
28448 101342 172688 110937 105920 153865 195673 181085 147109 57969 23490 89745 117764 124432
28436 124432 35738 56467 100043 140464 126375 70778 49847 14720 -3302 10850 -11740
28425 -11740 25942 103311 106256 39996 171 96865 211470 170815 159114 101487 52013 19090
28413 19090 41058 46584 -41233 -54738 -21501 -61969 19312 51156 27499 -38135 -20415 49670
28401 49670 15843 -127057 -174166 -82120 4513 60692 24273 35307 52042 61758 101454 100391
28389 100391 91730 83754 78798 25938 -152 6826 15535 58207 39999 14323 -39594 -55558
28377 -55558 -19615 -19335 33933 97220 42419 -24148 -8556 43440 40987 -50917 -178867 -170468
28365 -170468 -111949 56232 134643 140075 85987 106694 64368 74256 119444 88994 57024 -57693
28353 -57693 -2650 15794 -46204 -59720 -49725 74 17471 99803 178018 53440 -5650 61197
28341 61197 45686 37176 52293 24602 5218 -104039 -126916 5456 -12322 -44927 122010
28330 122010 176837 110475 -2933 -57640 -20605 -50363 -35479 -9811 -83990 -89387 -85747 4785
28318 4785 80413 23822 -4139 -45064 -71832 -75262 -143981 -169351 -67036 3287 37005 16365
28306 16365 10100 -29762 -7243 -72951 -120459 -131940 -67042 6481 -10099 -86512 -85362 -111864
28294 -111864 -128500 -101817 -39207 -43195 -47113 -44517 35900 7955 -8281 -15286 -95885 -8031
28282 -8031 73967 62032 -5498 -19639 -30573 34783 -32191 -81659 -34599 -66511 -20826 -4839
28270 -4839 -66442 -50792 -4675 39534 30974 48640 89817 24598 -1710 96719 120262 -7605
28258 -7605 45713 82542 95628 124642 156927 170714 126964 137049 129999 126357 116651 20601
28246 20601 20032 29195 71689 -42731 -86539 -52048 -34307 -97238 -64787 39996 106448 45154
28234 45154 8394 80754 143887 69821 68354 -15214 -58317 14839 5986 -13314 -3610 -41074
28222 -41074 -138397 -142723 -147036 -39947 103970 65752 15280 161223 81277 -8073 162 28310
28210 28310 -4247 -13162 59223 -11019 -113547 -61287 28031 14761 15649 -12571 -66391 28492
28198 28492 59341 4211 57399 32075 31527 114557 76086 16613 5608 32365 29476 31707
28186 31707 35505 111283 95053 121387 103260 90944 74096 29597 -12981 -77376 -93207 -52562
28174 -52562 33389 101945 92500 89230 62400 -42472 -64915 89514 109815 566 -9744
28163 -9744 -91539 -40043 20105 -14002 -45945 -7866 79614 44397 50378 66608 103010 112048
28151 112048 -13319 -55574 -5177 -98151 -154756 -171478 -130820 -98926 -112111 -103080 -80899
28140 -80899 -108576 -49285 -26801 -17889 -91017 -144392 -145741 -71421 -21923 -10638 12523 6630
28128 6630 30412 92841 198825 216957 115093 -56688 -19947 48074 90049 97885 16155
28117 16155 73937 136739 140282 100498 94167 125420 198538 151178 35846 -3918 129020 146462
28105 146462 90920 45563 17848 47665 65459 59166 40079 -22072 -59190 -75852 -96521 -91236
28093 -91236 -34948 -36538 -28846 39976 -4636 -85953 -82851 -111776 -128947 -153583 -121292 -147467
28081 -147467 -129598 -1774 169842 89989 9760 -16406 -60581 -59163 9573 70206 149442
28070 149442 74093 5954 21364 -2261 -3420 32687 19903 -80524 -29378 52179 54174 -5693
28058 -5693 20314 -47263 -121942 -147388 -175121 -215293 -151363 -189554 -94024 -113722 -135049 -144675
28046 -144675 -171546 -205422 -163909 -203020 -212674 -117247 -111230 -44984 33886 56127 2099 -55640
28034 -55640 -36154 -7709 -29011 -83083 -67079 6581 39798 -1765 -4786 20868 30557 10161
28022 10161 270 -44909 -97845 -142748 -56805 -3088 -8001 54706 17280 -5072 -50258 -92115
28010 -92115 -98919 -118273 -36650 52954 116402 162982 138820 178070 138497 67973 22093 1378
27998 1378 -71790 -88947 -34642 -77027 -123380 -61772 8392 -29144 -78856 -21910 33515 4689
27986 4689 34790 52653 35017 -66949 -21112 42493 56958 48351 15814 -102613 -54007 17484
27974 17484 62479 53414 32868 148805 111573 52930 69830 141779 188990 157048 74522 35346
27962 35346 -10102 68772 45838 42695 101849 1775 -69492 -99502 -118631 -183047 -188666 -74397
27950 -74397 -79339 -87211 -58751 28985 67687 48992 -4290 -54537 -49762 -14723 -35926 -42141
27938 -42141 -55938 -110430 -107711 -127120 -140539 -46410 88056 147811 210693 231057 218445 137750
27926 137750 41887 -34172 -48046 8648 54517 114458 77754 92745 96147 42846 91284 97769
27914 97769 64887 57423 52443 -86123 -146549 -71067 -1505 7360 -36495 -42540 -38605 -69877
27902 -69877 -118535 -82231 -39024 -13169 13575 59350 17643 -47748 -88175 -28733 8804 78574
27890 78574 63667 132829 179459 182276 204443 120177 68655 12608 -70625 -99498 -102554 -83887
27878 -83887 -40102 33367 168753 148650 158128 145263 164815 111518 74985 81079 55312 14863
27866 14863 28180 -41726 -67930 -25756 -61412 -41680 97373 183305 71299 -99022 -123781
27855 -123781 -30006 48245 -22914 -125818 -99431 -68692 -75323 -95402 -63959 -69225 -57845 -5329
27843 -5329 80563 103133 77623 127116 162934 112252 48699 50009 80633 52441 85422 44536
27831 44536 -14235 -103484 -43876 -59989 -154101 -190333 -148205 -58072 8462 -25807 -58815 -117807
27819 -117807 -181214 -79398 37233 103024 90226 -3860 -23028 54066 49337 12313 25962
27808 25962 19691 6663 -19457 -38814 21376 50128 -5219 -100874 -58961 -12656 10588 94476
27796 94476 123145 104371 135831 86047 7735 66413 126759 50342 -87114 -3766 66207
27785 66207 16570 99608 83683 -87514 -107685 -49426 -53063 -12216 -44871 -44364 4677 -24647
27773 -24647 -32301 -13471 -26011 5793 -45374 -41533 -74846 -65483 -118624 -135730 -89695 -89117 -136761
27760 -136761 -182359 -144735 -69862 19977 33193 2321 -37416 15465 97035 60324 -107082
27749 -107082 -88736 -25068 569 -2345 -56916 -125156 -136788 -94552 -20763 68757 117420 162150
27737 162150 52246 -114445 -153899 -140225 -78084 -17932 24499 133298 206620 218967 166233
27726 166233 143198 244139 164419 67240 92317 100367 121298 233272 176288 124953 46197
27715 46197 47501 102183 112994 383 -113286 -95516 46100 53835 11723 26614 32009 20052
27703 20052 69707 12728 -7586 -37589 -21627 15364 39324 -29305 -53744 -44258 37238 41178
27691 41178 46783 25185 47158 -9732 -76976 -15764 92999 17102 -4001 1498 -49873 -193064
27679 -193064 -250975 -195729 -114523 -30525 -17512 12901 104459 113405 103013 77224 -9690 -1098
27667 -1098 122725 192521 169334 107781 36855 -32397 -558 48771 -25192 -8354 -13698 16179
27655 16179 32208 -31660 -59044 -129146 -157078 -73319 -36734 -28587 49160 57850 -2213 -85094
27643 -85094 -118130 -90575 -130307 -154568 -101286 -93608 -106595 -48042 -8573 -25914 -120874 -179122
27631 -179122 -170903 -88779 -62111 498 55897 -13282 -28894 -15658 -116488 -21535 56092
27620 56092 85816 47017 -26887 -66916 -160362 -112113 -85656 -100769 -68347 -64399 3480 112109
27608 112109 164127 130390 31282 -1390 -9208 -48533 -81643 -29661 -26383 -139378 -170060 -83870
27596 -83870 -62838 -15628 -39034 -9827 45972 23094 -62833 -127783 -182181 -164484 -132323 -150372
27584 -150372 -194137 -151393 -109869 -15751 37762 -287 33181 49002 91674 7876 24902
27573 24902 71128 107724 87427 12481 1174 15562 46949 39049 40782 37562 19944 46884
27561 46884 95022 114143 41314 -49789 -57854 21696 -19823 11434 5485 -89902 -62352 10723
27549 10723 66969 -711 -35537 -49090 -54746 -12604 15231 -56277 -44446 -56181 -129394 -169921
27537 -169921 -119302 61573 63283 81200 60661 -5140 14716 42729 -61053 -93221 -30930
27526 -30930 -30010 5830 -29101 -35157 -81745 -73360 -102446 -80876 -94088 -107591 -63253 -28940
27514 -28940 -38062 -28808 -18935 39887 21609 -3915 -11712 44502 83688 110105 12191 -57375
27502 -57375 -47986 -37816 72176 54757 50477 56215 99271 48152 30363 89610 114951 60439
27490 60439 30110 47603 101252 164806 214730 210967 62022 -8800 -63638 -75610 -35554 60608
27478 60608 257191 316400 258689 172740 116838 44434 -33468 -96502 -62353 -109571 -114167 15834
27466 15834 -38484 -58901 19200 -26275 -47032 -90067 -126359 -59093 -40162 -63136 -30968 74734
27454 74734 20011 -15821 -85214 -31339 158854 160183 138305 94677 117256 59501 21035 24613
27442 24613 76722 64284 -9324 -37060 11034 12777 74818 134868 158531 182143 175255 146484
27430 146484 106644 156730 209781 135311 70088 -24189 4158 129129 229653 139641 6335
27419 6335 -23806 3664 110681 142586 86125 156923 183222 105653 -21670 -43671 10239
27408 10239 -9842 39104 -37235 -195908 -220326 -83378 -88746 -118095 -39725 -11846 -112948
27397 -112948 -160257 -138804 -124141 -94745 -44540 -41596 -124141 -191173 -160073 -72288 -394 27453
27385 27453 83599 64687 30108 16743 86619 60775 44526 -1348 -37225 -8616 -90379 -142937
27373 -142937 -80002 -81077 -43671 93974 30138 -14989 -36979 -36916 86278 131168 182309 254014
27361 254014 234956 111114 63099 31224 102655 78096 39314 60434 -61294 -102606 -67686
27350 -67686 -23514 -58986 -20464 -594 -1396 2986 -21971 3800 14471 -92906 -126140 -81945
27338 -81945 15019 -20004 -21066 -109276 -145549 -81633 -1053 84686 124123 82688 -35655 -81459
27326 -81459 -11381 3544 -66263 -20888 110538 97202 174544 149965 106582 144655 43791
27315 43791 -19294 -92203 -35436 14851 53510 6259 -50922 -45073 -23977 -31178 11772 -5277
27303 -5277 -27215 -112809 -125368 -11955 5585 -59082 2912 36118 -11387 -84130 -72950 -102844
27291 -102844 -140500 -133013 -106599 -18236 75132 140612 186489 160680 25268 -1364 58652
27280 58652 -12980 -28034 15712 -77823 -84540 31624 17977 39444 82394 79605 113751 194947
27268 194947 213329 134136 10458 -132466 -115367 -3920 -10325 36113 53600 -64250 -79779
27257 -79779 -85782 -49285 -38034 -68264 -78331 -61156 -5802 -48807 -4864 15434 5087 -57320
27245 -57320 -80947 -128214 -119474 -70303 -67344 -74035 43181 88633 18860 -8345 -19161 2707
27233 2707 15206 -43292 -34952 -6041 -48793 -34385 55766 79988 67211 38528 34926 34795 5754
27220 5754 -77449 -156224 -189464 -158025 -72142 -58433 -103021 -104767 -128089 -150315 -79125 -22104
27208 -22104 15312 -68676 -94913 -35373 -13518 -79374 -140697 -143144 -78068 32104 74469 73336
27196 73336 23789 14112 14881 6323 100611 117535 163528 157894 55666 53834 82054 57119 85610
27183 85610 105422 26049 -23552 -1972 -29050 -121379 -300778 -230711 -78663 -51906 -117586
27172 -117586 -149632 -50505 4496 3506 25885 20363 23580 -11973 -56221 44015 188519 173327
27160 173327 105059 26703 -39935 -64308 -130781 -154059 -99156 -105464 -83550 -62491 -47638 6416
27148 6416 42085 36788 -27860 -53218 -78634 -17897 109919 147050 21173 -18366 19220 41585
27136 41585 -1866 -12487 15794 -24843 4447 61252 115046 116222 106477 110926 52963 230
27124 230 60554 -3704 -3004 -270 21868 23594 -65294 -80707 -42202 -50802 -162755 -92187 -98765
27111 -98765 -14061 -46073 -108685 -37148 -9170 -80979 -59693 -116668 -123125 -30760 -21722 -65532
27099 -65532 -147388 -100820 -30284 -33110 -108450 -77659 -6753 -14101 16092 86345 136579 154997
27087 154997 102961 13434 -27795 -92854 -51874 -77604 -134951 -71426 -32615 59423 73805
27076 73805 122987 168611 191647 139737 145683 155594 85702 76521 63109 67055 142880 92375
27064 92375 -44796 -75960 -77901 -22802 8302 -94319 -128650 -80239 -8780 -48447 -82886
27053 -82886 -137707 -97968 -69083 -111682 -182156 -187676 -91647 -94672 -107097 -83077 -3164 139959
27041 139959 106475 129476 3664 -55770 19636 -27657 -31569 -119141 -114945 -6502 67271
27030 67271 37637 -109928 -201314 -133029 -69332 -95278 -54227 15192 -2424 48106 -5587
27019 -5587 -4583 -7361 51442 21183 -57991 30065 62911 27997 82044 100570 78467 49164
27007 49164 -73693 -64016 -41712 -8773 19739 68762 70660 45325 77344 6017 -66245 -56860
26995 -56860 -110305 -36775 14940 -19834 -1293 2481 -38866 -56761 -98668 -21647 -14268 -9718
26983 -9718 -98308 -142491 -114097 -56234 -70736 -83357 -53995 -73497 -127806 -123893 -19400 -12556
26971 -12556 -5605 -59893 -97811 -77574 -33869 22369 14730 37131 58247 142785 176123 112439
26959 112439 156123 200714 154924 6841 -39116 19058 10713 -45158 -10777 1967 67228
26948 67228 31869 -273 22770 36044 45327 -49985 71549 135234 87628 79946 -2552 -52841
26936 -52841 -55006 -36982 -70106 -12620 69852 68891 158557 148613 134173 48875 -18872 -61352
26924 -61352 -111373 -75106 -29683 33985 -48281 -143992 -107018 -4754 46476 53880 21539 -49841
26912 -49841 -42985 23431 32290 92450 60339 -13562 -93822 -117564 -101881 -11796 -35249 -104181
26900 -104181 -59352 -24464 -29013 18258 -2802 -1494 26645 -21467 -9938 19661 128033 172675
26888 172675 147667 55801 -44302 -4734 16361 13781 -7870 -82666 -66431 -134287 -65096
26877 -65096 1520 -45214 -165320 -137414 -70179 -8406 -28204 -63508 -106123 -43659 15038
26866 15038 27810 -45455 -30875 -55285 -90810 -25502 -28425 3096 8710 -6397 26575 -27087
26854 -27087 -104718 20050 42691 30107 -8010 -63375 -127737 -140112 -12135 20524 -55433
26843 -55433 24461 19397 -17976 7771 56017 23753 3056 -25690 36760 42431 34183 21239
26831 21239 12361 81593 72215 -33029 27062 -9442 -1051 -68553 -34566 38802 59457 45300
26819 45300 5109 88533 50384 -12257 -56302 -60578 -94569 -118302 -155950 -171015 -80972 6104
26807 6104 -5932 14836 6806 -29860 -104748 -205449 -165583 -55110 -26040 -57366 -27104 29423
26795 29423 6067 -96338 -108060 -36873 -57077 -122524 -47853 7466 51527 51803 -1391 -35615
26783 -35615 65145 83951 84990 117408 23186 -34420 4878 -32761 -33310 44006 80830 52977
26771 52977 -7755 -41254 20788 135815 184633 197302 104792 84923 118288 176092 155639
26760 155639 129616 112835 58977 1662 47148 -29120 -39987 -9199 -59552 -127248 -91868
26749 -91868 -130978 -185638 -68772 -56312 -23358 136501 167572 143077 80596 26703 101613
26738 101613 81200 31382 -16412 1441 8998 36517 49398 76410 64266 54311 90018 176366
26726 176366 171583 109547 83405 -11757 -21010 -34849 -33940 -28415 -83530 -208268 -265453 -252320
26714 -252320 -173103 -99571 -39603 22807 17817 4443 -28289 -33367 -37472 59814 100521 143208
26702 143208 114349 61881 -661 -36580 60194 126691 27913 3398 60540 148991 139180 49043
26690 49043 -38124 -13667 14833 47526 -47912 -49122 -47990 3664 87117 45529 61797 101370
26678 101370 30567 48415 58379 -14353 6042 78123 126091 100775 115003 94439 25883 53742
26666 53742 85286 -25589 -8817 125085 105924 42568 -31429 -64451 -45211 -49674 -131702
26655 -131702 -89739 -7903 6404 55073 127170 137588 5184 19824 -71507 -116402 -109812
26644 -109812 -46438 71719 85161 65927 6831 -49297 17686 112688 130310 143401 86549
26633 86549 44513 86658 -5330 -16815 50016 42675 30079 24807 115637 145962 72336 46508
26621 46508 96538 167014 182989 85800 9011 -59195 -5894 3683 -57097 -93974 -92079 -120681
26609 -120681 -58434 50753 62480 49894 -51167 -26813 71349 50852 -1722 -10903 -104835
26598 -104835 -141514 -114677 -108439 -121817 -115809 -128170 -75371 -54562 29964 -54877 -33866 -7454
26586 -7454 -6660 1325 -35729 18447 20223 37520 -37339 -74817 -39573 23084 137159 184038
26574 184038 109089 82335 33726 -8312 -72906 -124772 193 73075 81559 90801 150416 128340
26562 128340 115426 41002 -41195 -130027 -145847 -150955 -212398 -166193 -114613 -59662 -106978 -72778
26550 -72778 -88586 -94806 -60892 -46989 6313 27924 71919 85344 -31661 -147288 -144445 -141640
26538 -141640 -222225 -239152 -191380 -150951 -42322 26684 -3931 -110813 -35530 -35138 -49295
26527 -49295 45109 97278 60068 39147 33553 -58335 -72731 -64990 -12552 -38463 -163446 -205677
26515 -205677 -72259 64403 94345 27103 11490 12359 8817 78692 40986 -40563 -76726 -96727
26503 -96727 -22740 12367 -18440 -49722 -164637 -206189 -156296 -114252 -100397 -131793 -160633
26492 -160633 -209487 -193297 -171416 -55304 31694 16243 62631 5460 -48750 -32468 -35015
26481 -35015 -17598 -38621 20627 -7528 -75711 -139765 -220571 -159220 -142467 -170653 -32852
26470 -32852 107198 152184 177324 171442 75194 90688 64974 67033 28056 108451 99363 175456
26458 175456 237275 268795 256804 144766 111658 205203 144185 137141 71608 -86478 -84331
26447 -84331 -96702 -99801 -91543 -37621 -13079 -17338 -76556 -72229 18202 -38496 -26162 -49540
26435 -49540 -97313 -120870 -140414 -65948 -70176 -18452 -14548 -102582 -23962 50089 -40565 -114302
26423 -114302 -107153 -35934 -78431 -101385 -125038 -48004 -26013 -46557 -60319 -110948 -118723 5410
26411 5410 14847 -16692 77739 97488 37793 -18245 -77359 -44579 33649 -12757 -56161 55379
26399 55379 110970 67558 8136 -106639 -201867 -203286 -118550 6809 77336 30575 -66604
26388 -66604 -106144 -81340 26791 106802 49082 -43155 -25501 14520 24387 41384 72206 134197
26376 134197 146781 140733 69184 47176 188942 149453 54928 19595 10867 49334 173668
26365 173668 252613 87782 -19146 22949 59754 29615 45149 27480 4400 -13949 -13428
26354 -13428 5074 705 -63746 -102039 -48601 -35113 -3870 -28485 -127044 -141907 -148299 -175201
26342 -175201 -207694 -125990 -167152 -93757 -62193 -46763 -29464 -64490 -175203 -186035 -26393
26331 -26393 28063 76814 121037 113885 22828 -41551 -40310 -103000 -72095 -86418 -44168 -109852
26319 -109852 -156601 -86195 -16826 -44026 -106793 -186190 -191724 -159960 -149935 -112727 -166163 -162395
26307 -162395 -182888 -192603 -78290 63680 53919 -62138 -81481 -52572 4270 -8285 23437
26296 23437 40725 -6819 -13472 -31137 -110486 -80855 52336 54238 15859 -98221 -98226 -17139
26284 -17139 78958 27192 87989 139632 71747 7509 -7923 39263 22404 61020 -31310 11906
26272 11906 97053 136079 6339 -12782 7527 109436 82969 62094 -40904 -41112 -36867 -7329
26260 -7329 -10797 -24347 17440 51041 -51732 -70372 -25732 -16015 -46967 -21788 -13636 -20044
26248 -20044 -86411 -84207 -76930 -85582 -109636 -91112 -4755 76168 134060 116398 111173 65531
26236 65531 71488 -19257 -124130 -103768 -90281 -56098 -69542 -42319 -20596 9031 31504 71333
26224 71333 116078 141217 70069 -22708 27914 -10961 -109204 -95485 -3856 34607 77492 20870
26212 20870 22266 -3748 -25092 -42694 72852 155491 81423 23128 -60472 31796 94103 23278
26200 23278 -48389 -73812 -60010 -15984 22074 -39936 -43447 -18460 -120993 -151239 -153783 -117976
26188 -117976 -2310 15805 -3397 -94285 -130518 -110345 -134482 -132373 -113004 -34345 -21083
26177 -21083 -13000 -72569 -80588 -11420 60328 90078 -6675 -30914 -112133 -63655 76543 75427
26165 75427 20839 -116714 -189593 -164089 -67986 -21195 -30122 20388 69850 13181 -67423 -102423
26153 -102423 -49018 -16786 -128428 -165510 -160855 -148006 -81721 71503 141271 101811 55234
26142 55234 52180 65460 74056 111853 131499 112354 58829 35454 84383 134105 151646 115018
26130 115018 117014 110158 49362 65961 38826 69638 37955 140119 128888 88971 56633 35543
26118 35543 61349 101424 70169 42486 -3298 -52049 -78337 -65088 -30428 -72624 -94705 -140258
26106 -140258 -135828 -120689 -92232 -109100 -49907 2650 -11434 -93110 -112183 -151040 -154986 -101546
26094 -101546 -157927 -155809 -64359 -41745 -37030 -45646 -86957 -77179 1380 29179 31671 20795
26082 20795 43724 22796 5274 13477 -113112 -121207 -89570 -96867 -30656 77929 12717 -68567
26070 -68567 -43111 -22385 -37602 85902 158599 114219 80852 65407 73609 -26925 -157622
26059 -157622 -199980 -135850 -30355 -22326 -38628 23794 74869 169313 179937 195336 88017
26048 88017 -938 27321 -26799 -22607 -68271 -110732 -157224 -187214 -183089 -119273 -16649 -21830
26036 -21830 -1183 -23692 -47896 -68985 -47896 -94319 -137268 -162567 -124550 -36039 -83307 -29820
26024 -29820 6956 -77223 -106819 -157375 -183784 -109374 5158 71037 134153 116108 318
26013 318 -50651 343 73456 95515 77281 110729 27519 52979 67178 31232 22735 80041
26001 80041 117083 34467 8730 -69237 -59727 42739 32953 63955 123888 158785 97406 17091
25989 17091 -32583 -27816 -82417 -58709 47892 62463 57794 44179 -19554 -107959 -51292 28589
25977 28589 110320 146225 51205 130173 172132 148043 53933 -95154 -150386 -162102 -136390
25966 -136390 -43590 57428 76060 81623 23624 -85335 -44211 -11925 -85292 -69837 -41875
25955 -41875 -38897 -70827 12248 109162 119667 82331 149364 94984 -60475 22312 53678 2441
25943 2441 -86520 -62500 -40082 -60228 -33448 -46107 -80602 -44721 6445 -18965 31212 -60106
25931 -60106 -118204 -128821 -170047 -156257 -143592 -125535 -198732 -147646 -81728 -95827 -101936 -13328
25919 -13328 -49943 -143987 -106525 -38064 9026 -43609 -22004 -8622 11819 -70250 -64131 -49943
25907 -49943 -15799 37487 35990 6679 -11506 -152375 -124207 -132504 -205497 -258477 -245145 -94845
25895 -94845 66471 140805 120169 3367 61546 50962 26288 64675 66644 -482 1688 19204
25883 19204 104688 98865 54891 -51770 -86399 -122206 -88526 -31880 -25367 -57517 -90409 -73224
25871 -73224 -53180 38705 -22981 -115344 -155949 -63209 -89879 -64186 -44538 56663 96589
25860 96589 60104 11932 -23878 -74164 -67961 -90665 -160207 -53133 -13404 -84188 -17980 9378
25848 9378 15056 65121 23455 29138 15231 -758 -18349 -113250 -80652 -58656 10718 76355
25836 76355 82070 -28826 -111808 -141657 -116934 -22814 20424 2378 -56027 -64003 -1172 38258
25824 38258 76274 60806 38494 -38022 -93955 -163091 -83253 -42893 -141393 -108632 -10231 36095
25812 36095 -42890 -84537 -56449 13452 78866 -64879 -50126 4130 -91350 -87095 31258
25801 31258 107188 87695 -35619 -130729 -143989 -111882 -76022 -70993 1290 88348 -16453
25790 -16453 -96754 -83212 -54460 -14517 -87363 -74119 -129077 -154280 -85706 6884 -2012 23106
25778 23106 67637 67844 39895 10839 125408 181352 106453 47254 78777 131230 90331 19729
25766 19729 100706 123157 95678 82480 132125 61804 86924 177947 190654 178363 142670 130619
25754 130619 55323 13147 13714 -19073 4339 8673 -32808 -46983 -2020 -27114 -22199 -73851
25742 -73851 -108763 -12922 -709 16944 48884 60834 19584 -41066 -19203 -55386 -77601 -38452
25730 -38452 -10934 -21719 67456 155042 237692 226425 120976 3311 -86098 -137752 -174802
25719 -174802 -213462 -230883 -159761 -113348 -89357 -661 6540 8248 -35307 -79188 -70440 -102931
25707 -102931 -105420 -94639 -38380 89661 130398 205483 182597 97479 11647 106605 109912 -15337
25695 -15337 34964 66710 294 -108281 -100679 -6832 94018 106704 1130 27377 61344
25684 61344 -19531 -7210 38615 66422 48728 16173 -16951 -50078 -113614 -136099 -135890 -90159
25672 -90159 -17267 -40295 -39863 -41216 -31933 -35170 -95993 -84755 17030 19991 11 -48642 49261
25659 49261 78617 139874 126785 108035 150761 190079 153370 153543 85327 94080 52810 108096
25647 108096 111190 145612 171455 84444 41584 48522 15656 4928 -30209 -12053 58553 56927
25635 56927 -11149 17472 31372 -26552 -115832 -187461 -53391 52414 46986 37903 50063 -47270
25623 -47270 -91585 -49505 -19366 31944 62913 73930 49826 84780 91531 26217 -385 -61960
25611 -61960 -55299 -815 15473 45486 72027 -13758 -64166 -104367 -86886 -44003 -66756 -38768
25599 -38768 -95170 -102066 -97008 -130687 -33107 10233 109788 45145 -72476 -108492 -136238 -183233
25587 -183233 -146383 -153452 -138373 -131551 -99646 -159196 -113007 -42302 4964 97018 148273 64213
25575 64213 -34176 -75535 -57721 -74879 -114415 -69255 -57435 -83048 -45039 7087 -63054 -109949
25563 -109949 -67113 -24775 -11022 -39899 -24827 -19073 76734 47132 28441 114137 147031 103597
25551 103597 46116 19689 100528 107607 139530 128714 94459 72462 85944 80554 161912 211385
25539 211385 104860 70424 54169 8938 -82349 -35974 6436 -12248 88026 37845 -22100
25528 -22100 66805 79569 75361 19691 3739 14821 7520 -7947 -61409 -79077 8322 89391
25516 89391 -13364 -73968 -160080 -189875 -122301 -97740 -23340 -51449 -27079 -21934 -16772 -31099
25504 -31099 -26814 -71821 -164955 -100880 -74847 -58391 -52984 -141694 -152897 -167470 -148872 -86057
25492 -86057 -124170 -122728 -67243 -107365 -116749 -129099 -104401 -41749 -18247 5820 9849 51771
25480 51771 30571 45630 41907 -4242 -49819 11252 76126 79650 16621 -70928 -101083 -87350
25468 -87350 -6950 -28492 -122033 -67424 -32233 -19209 -77473 -128811 -140699 -186859 -87137 16903
25456 16903 -110467 -54279 -6640 18963 -49137 -97624 -168165 -185391 -108106 -127599 -157784
25445 -157784 -191519 -154492 -121617 -128224 -128382 -80117 -7721 40387 105945 33336 1201 90506
25433 90506 34662 -35770 -57367 -60002 -36020 -8775 -17312 33247 24125 -12804 10457 19283
25421 19283 -45559 -43528 -107739 -189719 -218671 -107703 3220 23543 -13903 -7623 -85894 -45661
25409 -45661 -12546 -16705 -12600 -78107 -46387 -417 -108365 -142762 -168230 -156140 -67693 -52134
25397 -52134 -55533 53381 29115 9738 87828 89454 54259 -32776 -65611 33899 21867 37085
25385 37085 104318 127992 119826 1437 -164738 -73310 8732 1246 -45294 -106369 -137990 -82049
25373 -82049 -21353 41691 -9397 -98718 -97101 -108738 -143330 -57940 65719 44803 -30556 -96424
25361 -96424 -81922 -62691 -61431 -18525 13113 35443 38888 -71765 -79279 -11413 58293 67954
25349 67954 10419 -87065 -62419 -75667 -185861 -104220 -52294 -87365 -146377 -178836 -125941
25338 -125941 -46934 -76831 -143994 -89440 -88529 -68824 5363 -2479 -31684 -176451 -228955 -116129
25326 -116129 -15031 58524 19639 -14443 -66657 -59444 -55035 7729 846 -77948 -98557 -159647
25314 -159647 -80609 -32971 -37563 37257 90725 67819 -13727 -26108 -12494 -7115 -36193 8682
25302 8682 77062 41277 -38122 -101619 -94317 -145385 -140478 16392 88770 15632 -20451 -32818
25290 -32818 -83843 -101814 -173288 -316747 -310198 -256190 -243741 -106502 5858 -105505 -150206
25279 -150206 -108059 -85717 -42215 -41892 -23133 9258 -15809 2788 14721 1633 38263 3880
25267 3880 -61506 -48299 -1353 32029 -20036 -23568 -1284 -30033 -57865 -119612 -166108 -158665
25255 -158665 -61035 -12271 -40257 -46747 -29495 -48771 -42387 31413 51125 33107 1129 102830
25243 102830 151193 115674 156086 209536 118137 113489 58701 67251 50383 22876 62212 82420
25231 82420 -19438 -103500 -103650 -81350 -55490 -66604 -53828 -82081 -66349 -33602 30246 -619
25219 -619 24093 -7299 12856 35004 85641 86057 34335 37758 -1265 -72056 -107174 -63943 -84392
25206 -84392 12657 77269 -35852 -143032 -181784 -170038 -140854 -118381 -72525 47241 61037
25195 61037 61161 8066 -68602 -60908 4343 -38196 -78196 -16611 -8992 -12991 54737 92860 17800
25182 17800 -258 36518 74057 52985 -103008 -129302 -111924 -63512 -84710 -113443 -191097
25171 -191097 -222825 -199842 -124481 -144133 -194036 -220571 -179075 -162006 -249588 -254435 -170902 -58782
25159 -58782 8359 -55610 -24514 6529 -46543 -196922 -201810 -55282 -11003 -26295 -115726
25148 -115726 -137449 4762 18311 48306 43940 13453 -37399 -40930 -12918 -11427 29912 -4617
25136 -4617 -153549 -152816 -105972 -111803 -160084 -175424 -196573 -108057 -21363 -73100 -160366 -108848
25124 -108848 -93892 -63370 -57989 -70260 -56250 -100018 -96168 -9623 2406 -15384 16323 -51540
25112 -51540 -24064 21011 36791 2888 -21760 -4475 83504 85946 61176 85146 -60566 -130878
25100 -130878 -112892 -94098 -122975 -160263 -49319 10464 17052 37129 35863 85282 114331 76696
25088 76696 -1503 -34441 -29493 2934 22338 -66715 -55632 7788 10127 -12809 42091 -11973
25076 -11973 -32789 1365 -44251 -115009 -25204 69985 255697 281076 202830 124191 112383
25065 112383 128932 70371 -4778 56833 112689 78675 -5175 -26393 -15484 34332 110624
25054 110624 -3552 -48897 -84053 -73186 -11695 -36697 -122765 -89753 -84070 -189270 -130582
25043 -130582 -61898 -129147 -190710 -120919 11870 9742 -89811 -159338 -102622 -17885 -20217 -74245
25031 -74245 -162600 -131988 -85120 -86435 -101465 8001 10001 17563 19667 101309 120840 81662
25019 81662 41914 21992 -71191 -26288 37770 -17734 22921 46721 49983 -33071 4937 43865
25007 43865 39909 31852 16169 -14727 -24770 37510 78195 70021 135015 43581 21588 51633
24995 51633 56882 67672 36642 -1455 -37071 -69947 -95191 -3568 40846 46540 12855 17549
24983 17549 22045 76902 75580 9186 9321 -12428 -51506 -107196 -137036 -146508 -99099 -67486 -70511
24970 -70511 -24916 15544 4070 -1052 65574 121697 46908 -57316 -108363 -66277 6432 -47103
24958 -47103 -27159 60649 125752 264641 166365 -5746 -83828 -108019 -156737 -148175 -118967
24947 -118967 -138769 -96747 -37870 56154 102408 29662 -119003 -166425 -165554 -177970 -22641
24936 -22641 52520 4319 25237 30906 -10248 28924 -1288 40670 -32160 -148863 -120437 24062
24924 24062 -11432 -61195 -52927 8136 18840 42863 66662 28748 5389 78078 55656 27875
24912 27875 -1610 29532 32958 -42854 -22387 23896 -58879 -25269 82020 175122 131747 80462
24900 80462 -1668 -45959 29794 -803 -76966 -96233 -67133 -65593 -124028 -109292 -7176 53176
24888 53176 74783 55439 75124 81795 -31793 -11140 309 -42446 -32632 -38767 -23402 -56182
24876 -56182 -12480 40442 84512 1424 -16037 -6277 24422 58265 93503 88173 19806 7521
24864 7521 -62992 -13826 84 -15901 -41453 -3562 923 -35677 -115009 -95735 10868 52926
24852 52926 69850 123829 39360 -72278 -20041 -77055 -76624 -101504 -109222 -111679 -101797 -130789
24840 -130789 -122168 -91910 -69559 -45574 -40821 -79384 -30233 10574 27397 66510 66686 -4003
24828 -4003 20842 28026 2485 22774 -2853 -27437 -81940 -61238 -25873 -16138 -59335 -59800 -40183
24815 -40183 -46451 30364 75370 62734 40394 44988 108847 139749 99678 91590 53129 408
24803 408 -99492 -77438 -46310 -40602 -147186 -90773 4458 28541 -10551 32262 15416 -139520
24791 -139520 -207082 -200636 -239743 -139215 -33384 3855 -17036 -53060 -118967 -6989 22690
24780 22690 102323 108029 76062 -12634 -81495 -55809 -9040 -23696 -2420 66808 61592 -20679
24768 -20679 4889 47697 12171 -79440 -119602 -80552 -119304 -144847 -79599 -31189 -9987 56177
24756 56177 51800 -54300 -118258 -63637 -29012 -129170 -233409 -194745 -162429 -168058 -105355
24745 -105355 -107902 -77928 -40962 -39753 -61585 -113951 -102108 -63760 -137552 -190013 -202092 -173189
24733 -173189 -161138 -77931 11270 35355 33997 29225 64313 41600 13629 -46580 -88648 -137263
24721 -137263 -84589 -28360 -44021 55688 50263 -51824 -276359 -247354 -146200 -139517 -86770
24710 -86770 -63086 5758 -20315 10574 81193 75525 -9983 -78412 -88415 -68972 -54222 -65164
24698 -65164 19739 156413 154034 50960 40861 106209 100276 15444 -27619 -26644 -12612 -30866
24686 -30866 -74053 -56794 38811 192815 153137 24666 -116258 -39767 44906 -4981 19157
24675 19157 -23383 -94867 -108997 -136934 -211808 -180319 -88286 -14295 74695 86374 130165 219512
24663 219512 240121 154669 92235 4399 -563 39133 55857 18002 -2339 7420 69528 68728
24651 68728 124047 106993 127665 146361 26422 15403 21100 88199 64497 11923 119481
24640 119481 111559 30626 -11600 5188 83927 13335 -102595 -150334 -102330 -93513 -145541 -174323
24628 -174323 -132209 -92064 -21253 -65497 28557 -49723 -112954 -117052 -144039 -127290 -122407 -162206
24616 -162206 -195762 -237760 -224831 -141770 -48823 -44168 16126 31518 14957 14890 -33628 -53522
24604 -53522 -9019 -6493 -11279 -86095 -26541 -34481 -68462 -49949 -36590 -101873 -60482 17106
24592 17106 45300 52287 53803 56824 37492 34194 92000 64004 59568 78325 90126 116714 43859
24579 43859 -49135 -77425 -103359 -115966 -59824 -93630 -73656 -26304 13439 62903 73961 4615
24567 4615 -112463 -91295 34450 16074 -19374 52436 93308 46514 -11355 -57176 -172385
24556 -172385 -271370 -139409 15205 23811 -46930 -71763 -67451 -89420 -59129 21766 20270 -58938
24544 -58938 -31561 42537 3995 -89083 -115819 -182540 -207726 -283125 -215380 -238814 -177087 -92084
24532 -92084 -11951 -42081 -81923 -93136 -122860 -64344 -96453 -102523 -70403 20074 -23545 -101389
24520 -101389 -99335 -78623 -39293 41 -59323 -57567 -25982 -45840 -46248 -89259 -78419 4293
24508 4293 -17463 -61352 -2927 20322 36460 5414 -4038 -80060 -16323 16150 61172 25193
24496 25193 -959 -74930 -17075 -43741 -95281 -69523 -176856 -274167 -224910 -161308 -186618
24485 -186618 -140531 -137706 -66963 -21290 -120136 -68256 28302 17294 -34745 -88317 -86010 -62641
24473 -62641 14641 20686 43724 21031 109774 69799 -13651 -53386 -46995 23510 -3249 -120467
24461 -120467 -97633 -26238 -61599 -73013 -78539 -58329 -29193 36381 41561 20808 -62182 11102
24449 11102 49215 93637 88667 103233 125123 43162 46733 109027 166268 23306 -35788 -17257
24437 -17257 4244 22390 -35880 -65031 -8823 -27545 5993 -56356 -53345 -47208 -53076 -13178
24425 -13178 4811 -37238 -81355 -151288 -125833 -175378 -166615 -139716 -114856 -208018 -208746 -157618
24413 -157618 -190894 -110945 -45028 -51560 -89589 -166343 -160461 -83477 41105 30231 -6039 -36057
24401 -36057 -102651 -96741 -126573 -100584 -124075 -48449 -78294 -41366 61873 57147 23590 46318
24389 46318 34642 -20211 -92954 -157110 -140860 -230228 -265270 -239349 -225934 -231890 -114536 -66684
24377 -66684 -73353 -57243 -94700 -182698 -170793 -183904 -231700 -204069 -105077 -42148 -86513 -145141
24365 -145141 -101777 -74518 18324 46553 -44011 -48580 -127810 -130693 -182199 -159903 -29102 32765
24353 32765 86354 31818 12963 45910 100179 145728 182291 223290 158851 93521 -10773
24342 -10773 -145808 -97013 -63706 -57511 -61379 -73152 -118701 -126248 -59684 -45625 -153061 -126982
24330 -126982 -92247 -114472 -114570 -43874 23099 39758 52140 -67935 -131121 -111839 -126509 -69030
24318 -69030 -56045 -110060 -37156 -8597 18544 -34621 20578 30964 -96994 -237337 -261901
24307 -261901 -177440 -65869 -38747 -67951 -57736 -33234 -6117 46658 37330 -12467 26922
24296 26922 20573 -29217 -74120 -45397 -90948 -184885 -145735 -158256 -180248 -135864 -94232 -28483
24284 -28483 90736 83258 56632 116952 256096 238336 118122 17773 -54451 -84057 -120229
24273 -120229 -98624 -10717 60828 105443 29928 42241 -49263 -77302 -49989 -45494 -51073 -708
24261 -708 93486 132322 58170 76973 57533 27623 52983 -26103 35567 94458 -14924 -87128
24249 -87128 -24265 -54291 -42053 -22332 -2139 27250 54080 102047 47612 -10932 29385 -9749
24237 -9749 -39357 -85535 -108246 -99141 -52817 136828 214340 88345 34789 52557 17960 -60620
24225 -60620 -71715 11271 -21163 -52526 -121215 -204236 -158750 -157591 -166816 -113101 -1834 19595
24213 19595 6907 16128 76973 10210 -35912 4610 -67499 -69436 -98204 -23010 -83833 -38943
24201 -38943 -17662 66288 140754 166332 150503 144807 93768 11975 -43366 -39096 -78269 -73366
24189 -73366 -47218 37635 92584 83403 71754 51418 65267 79833 88702 42921 42177 72082
24177 72082 6106 -101512 -129841 -34611 -108276 -201631 -190361 -103210 46396 73983 22846
24166 22846 -59928 -90317 -26998 14514 23039 42348 132837 210811 271296 209430 153177 60476
24154 60476 8873 -3799 62116 64070 -8333 -11476 -20183 -54919 -112237 -117631 -54090 -77727
24142 -77727 -88737 -114268 -80008 116894 206063 114994 85451 102535 129314 121878 147853 114311
24130 114311 -14507 -90065 -99844 -76697 -24712 -75163 22324 33161 56947 102479 54253
24119 54253 41418 -20680 10168 98340 120665 79872 63347 130375 147818 154702 173493 131976
24107 131976 -5781 -59147 17976 -30380 214 -52957 -73288 -56371 -29950 -45661 -64598
24096 -64598 -23188 26524 -39466 -127756 -115768 -78940 18763 84021 5699 -149362 -153611 -136381
24084 -136381 -96040 -19904 -21176 -1132 63537 87565 93861 97755 97187 139475 182331 101624
24072 101624 112071 91413 -15824 -25647 -8904 -12225 -55309 -114309 -73631 38173 -29327
24061 -29327 37666 73105 84808 136573 55241 25570 35028 152353 107518 20062 29274 986
24049 986 -36300 -56790 -56640 -110671 -187640 -184823 -223160 -200377 -121394 -69921 -104510 -32139 75174
24036 75174 78492 40797 11860 -35065 -4627 13697 64128 44065 63727 84129 632 -123198
24024 -123198 -113434 -112234 -135297 -47076 -46630 -148836 -151604 -80079 11339 40228 117546 72433
24012 72433 9080 45605 8458 15168 -41926 -26224 4229 -41640 -46984 -37 73311 -35328
24000 -35328 -107189 -79790 -39171 32099 82822 58517 -5622 -38743 52462 98180 43764 101617
23988 101617 132436 84730 43796 71774 206244 200122 197202 73158 -106406 -94004 1302
23977 1302 21931 -27201 11839 -72657 -245441 -298323 -221487 -126968 -105433 -106708 -192773 -112843
23965 -112843 6886 -2460 -2589 -13572 -56733 -398 36046 51929 104643 85633 118318 209335
23953 209335 173282 63721 23813 -100539 -110210 -129080 -98729 -94654 -9910 -7548 70423 116960
23941 116960 44379 -35188 -28572 -41093 -88090 -93672 -62074 -78026 -104744 -91524 -12113 -36225
23929 -36225 -95545 -48713 91159 171548 159688 45128 -49295 -78043 6930 81647 22393
23918 22393 69097 86682 -8698 865 105611 112559 118291 20025 -49183 8127 35380 6024
23906 6024 -1214 11147 113746 134548 122308 65718 4446 -45923 -40825 -46069 -76691 7744
23894 7744 117575 118991 115872 99802 56100 112638 90707 100293 6465 -21573 47960 28949
23882 28949 21750 76574 127666 97673 59046 43456 128916 207915 145645 70468 67482 58226
23870 58226 124228 140652 162499 160676 217567 173163 23568 -39302 49079 147978 137337 -17703
23858 -17703 -97239 -44418 4240 -57848 -194012 -171252 -35888 60823 69536 38394 -54633
23847 -54633 -106736 -24268 -37069 43641 82441 5052 -12519 -9337 26112 48127 20687 86784
23835 86784 92044 38001 20729 39881 118575 106211 7330 -16670 -74703 -84721 9029 -8635
23823 -8635 -44811 -39423 -43635 -28543 -25504 -36193 24058 113703 129426 149495 119773 91999
23811 91999 100459 131149 40241 -23467 -17544 -7013 -10032 -158365 -199103 -161338 -60636 39975
23799 39975 -12123 -8818 26246 12469 25082 54471 128768 145366 79442 -65054 -118260 -122420
23787 -122420 -90718 -8986 -76120 -160104 -122306 -108369 -50292 -77743 -157097 -187876 -125582
23776 -125582 -120402 -158819 -142245 -35349 30783 55746 92282 106892 95168 120823 126245 157176
23764 157176 99415 2403 -14633 38650 110870 143471 133337 78716 63141 7215 -67136
23753 -67136 -95551 -42929 -32142 -81937 -76645 -119921 -108660 -22579 27821 -44360 -22910 4780
23741 4780 53154 70553 -27882 -113167 -75654 7625 77691 134331 165729 141534 18121 36294
23729 36294 78483 80901 114300 92910 94797 83099 117226 102305 65419 5920 -37234 -60612
23717 -60612 -63510 57066 137498 146188 70854 -30382 -80562 -92091 -79318 -99465 -93701 -19745
23705 -19745 28601 17200 27839 -3640 49217 64335 71353 99386 166339 251176 100587 81623
23693 81623 93705 4389 -31628 -41977 -7590 93145 42610 7918 -30398 -41992 19662
23682 19662 115976 107378 59121 45806 -12375 -15256 88365 102069 46563 -3956 -39079 70093
23670 70093 189284 152726 62918 51939 79077 72326 -24225 32471 -6599 -29915 -28836 45093
23658 45093 122237 100802 10484 -20140 69304 56429 52328 111622 155520 125296 176280 176081
23646 176081 158219 179694 151181 22408 62856 59568 20102 94769 150001 110695 83493
23635 83493 99876 -14301 -118924 -152470 -189050 -195401 -119355 -49519 70546 160400 191350
23624 191350 135579 52466 115195 130153 67071 -13530 -104019 -88377 -13008 -10806 -28241 -70373
23612 -70373 -26433 -13082 90842 134470 124974 -20258 9634 5095 -66610 -59094 -22269 -3150
23600 -3150 5576 90233 127443 140693 118667 95355 3342 -126095 -110956 -23903 -54989 -44417
23588 -44417 37987 53298 63939 52252 -14866 -94996 -54734 83276 66635 101142 89146
23577 89146 28557 -9401 -55473 -12153 75751 102338 247708 290841 261059 105471 93245
23566 93245 45650 50928 119544 186581 181139 92481 147748 249214 206646 132257 48492 -8782
23554 -8782 21929 29717 83488 109263 86369 77408 104077 138992 165784 150410 161664 103622
23542 103622 81449 -9793 58307 147271 146996 80281 86625 12498 -94845 -63055 -103294 -156818
23530 -156818 -117055 -39360 48440 135073 140104 61575 38986 75694 101366 125214 145686 90833
23518 90833 -2338 30326 87838 67953 45559 115755 113693 46417 -33213 -51591 20304 15088
23506 15088 -38077 -32218 18695 49840 94739 113250 94729 194023 152311 140064 131008 212009
23494 212009 183187 154134 128069 110500 21247 -38379 -59372 -38655 10592 125238 126198 142214
23482 142214 79332 7973 -6309 23430 14782 30215 86358 83691 62635 93310 129912 124061
23470 124061 106470 107688 49719 -110065 -143181 -56700 -47887 -99295 -132372 -122993 -166754 -137208
23458 -137208 -48472 35398 91943 113232 101056 63465 45774 -10603 66593 102790 20740
23447 20740 -8003 36984 -18227 5692 -4210 12116 41072 132868 191410 164903 246111 269151
23435 269151 196315 149659 144336 114291 100355 45917 -9592 -72629 -4709 28764 -62435 -132084
23423 -132084 -96094 -43790 66517 222447 264689 231195 159358 119152 48468 -16043 24645
23412 24645 15224 38140 92945 72516 80170 133404 111296 105442 112174 38600 -25466 18120
23400 18120 -3222 2108 18264 143280 164790 70026 41184 42590 -15672 12602 2368 2435
23388 2435 67297 116383 145952 54596 19026 52532 84472 49984 90849 97930 28911 79350
23376 79350 158949 144340 185918 123464 164843 141308 90434 53165 43531 44065 64420 65286 40445
23363 40445 73525 72412 86914 198545 258423 241588 255158 182944 165424 198926 215234 186967
23351 186967 146432 81797 60041 21237 65329 97379 20869 4286 21389 15808 -37416 83389
23339 83389 164775 146523 119562 36966 -9149 71454 84289 75164 63153 69668 157786 210082
23327 210082 163552 116768 31077 15818 67473 112922 160305 166699 71389 -7471 18074 121385
23315 121385 228352 198931 198914 297951 235366 104958 39980 25362 33554 41296 39361 41280
23303 41280 26515 8317 -27565 -78069 -55120 -22282 -62266 -5875 -5684 82475 176387 105872
23291 105872 38756 33997 5330 1809 28835 79670 196125 233708 229205 237565 168822 160672
23279 160672 151257 90028 155037 205294 219095 201190 144379 140950 148105 193459 216019 150717
23267 150717 89325 47197 98493 101759 143878 193780 208654 230452 218380 135894 86697 83770
23255 83770 80296 -79745 -51212 117328 161935 170926 144578 150274 115719 54792 60934 162875
23243 162875 224104 255194 208246 179915 114250 85364 83557 157378 161379 161646 126307 95289
23231 95289 132791 127234 114562 59014 -8552 34160 101192 134429 99539 153846 153492 178017
23219 178017 185315 209164 186291 158263 148333 241687 284517 258737 77684 43501 63660 86577
23207 86577 118200 175719 208643 170579 157973 91515 124926 188500 127411 111579 72519 73250
23195 73250 70918 114608 94360 3375 -25861 33118 23876 68758 95242 213925 309498 228181
23183 228181 171128 39426 10934 33426 75475 187735 86366 57987 112278 76593 128310
23172 128310 247912 239329 110224 76774 95423 124018 152981 161107 95431 56379 62074 127024
23160 127024 174299 163516 86405 -23729 -2719 1981 117427 217059 166081 204179 220795
23149 220795 129725 126870 107705 27159 -4785 82653 127837 115603 108036 114339 102258 78147
23137 78147 193449 142577 169805 178472 186166 176219 177815 124002 43718 64671 83827 190834
23125 190834 142876 83118 163845 129368 104991 97256 23867 -39372 -43764 33996 96130 58276
23113 58276 74873 128641 134663 89780 39914 78645 95303 130092 112791 58562 100350 184680
23101 184680 267765 266191 313720 268620 267410 120046 67505 58446 47325 81383 145296 154364
23089 154364 150959 102132 48899 -27077 -56008 41513 84856 60807 68009 147070 141969 93951
23077 93951 64334 54225 64474 50707 46160 92997 171923 251869 201535 73247 98650 120873
23065 120873 154430 172859 187236 180810 171337 158672 215174 305530 369564 441334 309754 277949
23053 277949 353271 397344 370115 304227 216954 200800 172582 148196 125122 94392 18096
23042 18096 -73296 50731 139386 120665 107333 29486 23533 116963 123484 178429 239726 207920
23030 207920 235853 158333 126278 64476 63446 -28137 8809 82758 82819 35761 61790 74881
23018 74881 122845 76870 81096 108939 106311 165768 161910 227412 209290 179596 142499 155098
23006 155098 233637 227583 254495 242608 201151 185016 130160 140370 108824 104014 145679 303519
22994 303519 222045 179468 196628 209049 191013 156956 192271 307626 335385 325255 246362
22983 246362 170315 170812 211627 204874 202337 236288 272579 257050 139591 29653 52397 75107
22971 75107 69784 84503 132116 123908 184444 163522 177257 205391 192881 141192 123071 163707
22959 163707 236842 351805 371396 329790 226896 202699 228762 207594 254039 168334 69435
22948 69435 153393 230208 101299 108603 61861 80974 193922 275601 288154 248171 188640
22937 188640 147134 88108 68653 135367 148551 116060 127269 164223 267312 152007 148028
22926 148028 180884 177136 180099 130271 129421 103372 186079 280106 235538 238898 238023 232180 219036
22913 219036 198013 86612 144112 185101 149937 133051 123270 136556 84681 69818 175717
22902 175717 182906 129687 147164 116370 106277 193984 375553 390418 347238 367413 317585
22891 317585 296721 384817 356136 276465 196143 134353 135129 191012 239564 253871 320831 268419
22879 268419 223215 260089 225659 245818 187303 168091 233768 255324 304947 345627 297927
22868 297927 296674 244311 257089 276660 273659 243227 271049 149675 197824 307294 240598
22857 240598 300800 303617 278100 431434 458704 481741 387219 373891 371505 366778 289478 166688
22845 166688 141348 127868 239266 244731 245114 265162 267848 271913 234840 291122 279790 273796
22833 273796 293871 274438 371142 376216 245014 236576 305391 295617 276353 283619 339078 345720
22821 345720 364219 267450 150734 153787 181072 245387 191388 218702 212594 169890 201642 205466
22809 205466 226151 298748 290523 296910 331957 321774 239227 198387 245653 273757 315502 309058
22797 309058 219943 177395 167546 124998 167638 300945 378501 451917 372103 293545 209610
22786 209610 118838 8439 48518 145639 175733 193735 189941 310655 348239 305241 283194
22775 283194 186158 135267 141231 202289 275178 316316 366146 335445 282758 236629 273796 256845
22763 256845 196701 162834 189992 91576 68129 141890 228479 147439 169721 229579 203738
22752 203738 218558 251605 246221 266965 271997 200516 200669 209153 199700 100940 222043 284252
22740 284252 302519 289414 302296 439611 420622 335106 406478 440083 415855 368580 346590
22729 346590 299053 160068 126026 198354 285674 348228 368891 311126 226870 296737 324335
22718 324335 388074 379933 429845 407664 340383 229849 280404 312771 379999 324116 360774
22707 360774 430775 371322 452224 473448 342237 293996 308181 288087 287253 331527 293735 157833
22695 157833 101134 220907 222216 191821 143273 255936 302630 317817 234762 257624 292496
22684 292496 297879 311045 265743 249116 282756 237024 249304 287816 372202 443481 465116 512213
22672 512213 473852 329214 299313 301794 331250 392681 461952 442039 535450 558882 519690
22661 519690 476340 364736 325961 386437 397941 317731 321146 321316 307225 279312 296393 457687
22649 457687 516763 480986 458536 517341 590681 517287 421234 401037 401377 319204 262860 357310
22637 357310 420126 412204 451900 480799 486095 464774 441783 416713 437387 412661 389239 445119
22625 445119 402955 405081 464515 531508 598642 602651 487173 383185 346459 400204 402708 441975
22613 441975 497214 500447 404549 402308 472766 479067 546623 592479 554696 481370 418301 336755
22601 336755 273014 251681 337214 413150 421913 396365 364117 286694 320673 283169 327647 376816
22589 376816 387080 322844 390910 435463 432224 438674 444387 402286 289843 256651 303166 410794
22577 410794 473888 456309 466811 444483 369854 264222 259186 347291 375502 378912 372783 430465
22565 430465 575058 490844 431310 445810 485969 475013 465425 474663 466389 476270 425176 463780
22553 463780 473079 424884 410498 484013 436867 367775 343128 312472 370355 407492 420334 427610
22541 427610 543781 596193 546250 522222 493688 441777 426108 446169 436058 420545 422764
22530 422764 455555 499729 463765 499374 503363 501229 477178 396268 371087 412424 470403 556113
22518 556113 513847 561668 561999 485714 521236 481113 442433 422062 473595 461992 472679 587377
22506 587377 612932 580549 478569 488399 557809 538096 588351 620279 561382 519132 524015 559945
22494 559945 541485 474664 448927 504025 528473 597625 590918 521458 548948 615157 613022 605945
22482 605945 611376 502899 425225 451039 476041 552434 541385 617554 645196 589539 613392
22471 613392 691774 716461 574648 551641 657427 553824 499020 544441 682123 641404 490643
22460 490643 520688 458436 426796 436071 502880 632675 681170 628012 534119 506625 519704
22449 519704 567148 543659 521197 591464 627035 670621 632797 553959 496547 452492 464377
22438 464377 498163 571917 573875 584521 537110 574712 692787 694203 568905 518875 612490
22427 612490 617859 613633 583528 510102 470896 527880 584649 636531 615499 555889 557758 501194
22415 501194 436684 510801 610094 619895 629317 638255 689441 676192 637701 636804 635241 619771 585156
22402 585156 628981 641775 644415 597548 600839 637366 594714 628851 629707 732275 766535 705053
22390 705053 640145 650522 601101 686782 801289 766102 764917 743467 675027 657051 647843 678976
22378 678976 661666 623222 665017 616901 459272 479221 657257 730214 599394 615953 641181
22367 641181 635601 668663 656925 641981 747098 737977 776375 794451 727004 700345 703565 672081
22355 672081 689544 662156 683468 718973 764892 763032 722968 731555 810140 913096 930296 872318
22343 872318 792468 905360 902339 828162 764763 743606 726593 747571 729777 792296 811685
22332 811685 858321 934658 972344 991263 814938 697612 697994 771516 819542 929011 900352
22321 900352 850266 826515 832356 823648 720721 771559 758905 795174 921254 945939 956140
22310 956140 940044 905712 825772 889214 931287 910368 809382 837797 865481 886650 851546
22299 851546 826320 828463 870187 810444 793221 845521 849773 793262 789563 744568 654977 713319
22287 713319 859989 914660 931748 920184 923726 1038116 1110224 1018640 989852 983392 1065783
22276 1065783 1026302 891831 769286 774351 865248 1012362 992917 1007687 989983 911684 839635
22265 839635 764787 870698 907695 875016 807142 845611 897883 930162 998608 1014558 1059427
22254 1059427 1087899 1032361 977938 956676 959097 896891 892700 935533 925534 871408 916109 914466
22242 914466 956579 999237 1001855 1042477 994615 1003982 1034041 992271 1038113 1059261 1093471 1158698
22230 1158698 1155942 1059882 961746 1030539 1072369 979623 955367 997983 1087345 1106719 994356
22219 994356 991749 1066403 1038904 1049761 1004550 958485 1048907 1066496 1051871 990826 980434 1074497
22207 1074497 1008310 960031 1030863 1057014 1094066 1070253 1087692 1162859 1148290 1207029 1132627
22196 1132627 1050571 1051844 1069891 1079665 1170622 1176347 1192390 1169945 1110126 1107964 1083680 1125361
22184 1125361 1173355 1169000 1162752 1182755 1234919 1300024 1257181 1226725 1180932 1149883 1064046 1024321
22172 1024321 1082252 1184183 1189670 1185992 1284609 1268554 1242553 1178841 1118597 1194724 1288386
22161 1288386 1236684 1183781 1245428 1242172 1219279 1250191 1354670 1316835 1249187 1180263 1188336
22150 1188336 1156654 1191883 1208635 1237404 1218081 1254219 1195098 1227394 1162365 1177168 1207131
22139 1207131 1238265 1337613 1451747 1482478 1457422 1327618 1307423 1376342 1401914 1348946 1315612
22128 1315612 1429042 1461786 1335036 1227335 1257074 1349160 1350830 1406802 1378443 1453087 1511228
22117 1511228 1576913 1601715 1581779 1569326 1517405 1514012 1531235 1581594 1592300 1534558 1600960
22106 1600960 1549608 1546919 1602061 1613741 1541965 1558203 1550853 1546628 1546704 1529887 1613072 1592285
22094 1592285 1504150 1453958 1523074 1634305 1678380 1720785 1705566 1695593 1646375 1576422 1562764
22083 1562764 1680399 1840552 1902656 1754228 1663094 1719167 1779493 1828134 1694538 1633292
22073 1633292 1603894 1625853 1655272 1634449 1676685 1807299 1887249 1820994 1861442 1834163 1790604
22062 1790604 1824319 1870769 1869067 1851440 1777932 1643366 1628475 1562816 1694916 1842950 1867629
22051 1867629 1890248 1835192 1831228 1823875 1875172 1953830 1938580 1968155 2009115 1876641 1799811
22040 1799811 1823460 1902312 2010255 2030161 2051073 2017306 2000718 1995446 2040327 2062155 2085150
22029 2085150 2000080 1986891 1996645 2048233 1981192 1904967 1890718 1999800 2074034 2039416 2109292
22018 2109292 2124920 2226226 2288967 2216115 2046302 1928967 1990939 2106577 2113581 2117411 2151424
22007 2151424 2172935 2208272 2210641 2240988 2163100 2087894 2169183 2220543 2153099 2139996 2227171
21996 2227171 2286829 2369739 2378175 2330740 2301413 2176547 2206412 2314514 2320804 2387427 2406223
21985 2406223 2384166 2349458 2383515 2373415 2353572 2442197 2344337 2370106 2378018 2417311 2359663
21974 2359663 2380397 2336569 2312438 2415176 2387875 2329742 2311842 2313545 2330821 2367825 2353340
21963 2353340 2429682 2610410 2628581 2601478 2643007 2584990 2621776 2591135 2582000 2701219 2700695
21952 2700695 2679652 2715831 2728076 2745651 2762449 2824078 2838603 2744756 2719562 2769710 2743572
21941 2743572 2746754 2843112 2955466 2929321 2916263 2927915 2901371 2963583 3018614 3011886 2925174
21930 2925174 2969313 3029800 3021501 3116332 3202537 3185551 3245026 3193026 3127758 3043665 3015400
21919 3015400 3085730 3187659 3255479 3266977 3309709 3385382 3364795 3236760 3268281 3262342 3245202
21908 3245202 3384815 3452184 3413957 3387972 3362045 3397978 3393581 3402825 3353364 3349399 3374703 3438706
21896 3438706 3454953 3351065 3356778 3371614 3461056 3500979 3552317 3603705 3639159 3673014 3622669
21885 3622669 3635118 3788580 3828127 3875134 3977488 3987645 4001003 4046867 3951670 3843786 3820852
21874 3820852 3939462 4081352 4146152 4091347 4038596 4062275 4032357 4028860 3990029 4073581 4084502
21863 4084502 3976899 3959844 4069909 4144841 4184728 4151289 4209720 4253245 4284891 4274775 4294588
21852 4294588 4353661 4412594 4473727 4510174 4524756 4565546 4568883 4538128 4554631 4602864 4689836
21841 4689836 4729620 4709877 4687788 4672487 4703845 4724174 4727733 4745174 4789966 4821146 4805051
21830 4805051 4851834 4876083 4904753 4995258 5025422 4999319 5015661 5017543 5026665 5124774 5111884 5061256
21818 5061256 4980769 5029099 5063771 5190370 5400357 5426060 5359406 5296032 5288744 5422652 5444258
21807 5444258 5497957 5584710 5582845 5542858 5541181 5602153 5728596 5799955 5856134 5887256 5914590
21796 5914590 5931842 5977553 6061606 6081558 6094283 6048158 6008402 6131246 6250945 6230931 6238769
21785 6238769 6315615 6289361 6278279 6403156 6405106 6330209 6299253 6453017 6516576 6654484 6800522
21774 6800522 6944753 6989650 6968393 6902419 6815521 6770379 6927617 7120674 7164538 7170815 7240097
21763 7240097 7283765 7322497 7348061 7358230 7354122 7409901 7526266 7511761 7583936 7682034 7720473
21752 7720473 7761026 7879845 7886381 7972463 8135974 8243330 8266363 8334490 8417219 8443756 8519918
21741 8519918 8515616 8438514 8533752 8709064 8774392 8831252 8864310 8927898 8994408 9104204 9084924
21730 9084924 9090940 9220848 9285475 9420461 9488664 9600879 9626220 9719680 9752960 9854354 10023622
21719 10023622 10088451 10188484 10112709 10100497 10210494 10360039 10470834 10484311 10546886 10739054
21709 10739054 10892151 10951041 11037458 11130624 11259678 11376312 11397346 11318954 11314483 11392441 11471372
21698 11471372 11501240 11629487 11816025 11950750 12073303 12142655 12239281 12412996 12533770 12719829
21688 12719829 12829788 12814296 12839208 12780234 12894477 13035946 13243814 13476404 13561105 13701481
21678 13701481 13819414 13956074 14098945 14238872 14336540 14385648 14549420 14721239 14819346 14887374
21668 14887374 15013262 15282159 15473900 15648237 15820335 15966595 16122913 16254410 16424509
21659 16424509 16553502 16649795 16777970 16955963 17142687 17419674 17546684 17708958 17783884 18058027
21649 18058027 18308116 18503804 18759157 18964666 19129106 19226925 19315745 19623188 19827458 19945251
21639 19945251 20122898 20286973 20598625 20834779 21043833 21200329 21456144 21853291 22135334
21630 22135334 22365338 22569267 22831979 23124470 23366848 23680644 23868236 24210687 24531580
21621 24531580 24837908 25046744 25232244 25486483 25861475 26153843 26517566 26873677 27256234
21612 27256234 27624393 28001195 28258479 28384206 28661778 29062438 29501207 29902705 30340672
21603 30340672 30749232 31180985 31637675 32026167 32442392 32788596 33180764 33612271 34021001
21594 34021001 34474985 34968697 35357333 35776938 36309655 36824911 37258987 37788259 38344257
21585 38344257 38870884 39453870 40156893 40804549 41394620 41992393 42484661 43237217 44157615
21576 44157615 44904525 45571605 46029223 46569595 47160038 47877750 48640885 49324728 50014522
21567 50014522 50798217 51590058 52387177 53204621 54118587 54997831 55805662 56712961 57529831
21558 57529831 58355288 59430086 60445208 61490871 62510736 63535196 64607050 65744537
21550 65744537 66955681 68066656 69151917 70273902 71560708 72744047 73972839 75269580
21542 75269580 76577131 77981311 79302765 80736478 82264046 83706677 85266726 86826935
21534 86826935 88412610 90021534 91636767 93294856 95016469 96736207 98615650 100491618
21526 100491618 102356240 104282235 106266305 108252130 110229449 112318369 114432271 116631840
21518 116631840 118835637 121065054 123343763 125628129 127919976 130423096 132841009 135321925
21510 135321925 137816266 140302536 142880947 145475110 148104800 150696943 153452040 156231899
21502 156231899 159069206 161879137 164704191 167513670 170376232 173163062 175982784 178876779
21494 178876779 181848859 184805814 187721861 190648613 193531355 196410463 199286722 202102792
21486 202102792 204827809 207555577 210263006 212925256 215291654 217532004 219598482 221468159
21478 221468159 223384059 225273764 227047176 228778871 230559041 232230631 233742252 235123149
21470 235123149 236243921 237090412 237767803 238421009 238870256 239057618 239212626 239051713 238671816
21461 238671816 238127281 237544182 236858717 235947285 234974212 233786946 232528822 231161328 229668986
21452 229668986 227966144 226148415 224246833 222245405 220173676 217911048 215528771 213129128
21444 213129128 210667921 208088058 205405127 202800023 200105119 197368412 194584223 191652764
21436 191652764 188719736 185778204 182740134 179818753 176908181 174041077 171183092 168278287
21428 168278287 165419822 162557619 159717071 156971104 154236131 151466837 148669233 145886836
21420 145886836 143178719 140512333 137948724 135488506 133051120 130609868 128187640 125793819
21412 125793819 123432925 121145304 118911541 116604953 114504810 112430092 110363409 108311365
21404 108311365 106277258 104269121 102377222 100471719 98621774 96845073 95040458 93263495
21396 93263495 91604698 89905286 88171479 86612834 85063205 83528692 82102138 80621707
21388 80621707 79248465 77874142 76506861 75213256 73874527 72641064 71434403 70216158
21380 70216158 69164406 68083460 66892884 65794440 64646690 63547912 62613752 61697956
21372 61697956 60729318 59758327 58811088 57869673 56930148 55930266 54972754 54086239 53230754
21363 53230754 52474678 51737172 50957238 50220791 49456672 48832099 48162573 47409249 46607218
21354 46607218 45887468 45236748 44570840 43979699 43393288 42792217 42222031 41612174 41044817
21345 41044817 40505865 40024854 39419835 38819681 38366632 37929334 37400426 36924966 36379714
21336 36379714 35818947 35377543 35055935 34569618 34045133 33566589 33176885 32697527 32181653
21327 32181653 31752252 31442664 31100845 30700809 30329539 29930201 29621794 29293469 29003586
21318 29003586 28662126 28166890 27673821 27355494 27190321 26967152 26631264 26275270 26046914
21309 26046914 25794782 25422830 25057061 24713641 24428147 24237141 24060128 23805233 23549531
21300 23549531 23388475 23107460 22748324 22504613 22277388 22084750 21888660 21682451 21474026
21291 21474026 21219965 21007229 20780120 20492705 20228493 20026409 19728840 19450085 19274807
21282 19274807 19212654 19135755 18954097 18719074 18609443 18528902 18479426 18407542 18449149 18646672
21272 18646672 18777938 18803187 18574061 18262272 17821359 17335698 17031734 16792547 16593901
21263 16593901 16415657 16241777 16038808 15930615 15825797 15711724 15701154 15727626 15715313 15729831
21253 15729831 15660600 15582911 15397470 15170620 15045324 14889263 14757413 14762449 14713887 14711150
21243 14711150 14706127 14525729 14314464 14134234 13827699 13573187 13365172 13245792 13148290 12999381
21233 12999381 12909798 12663680 12459255 12472553 12457464 12392783 12398230 12423763 12499445 12470233 12601405
21222 12601405 12628184 12408939 12256214 12096401 11886228 11715770 11616172 11565872 11534832 11525872
21212 11525872 11497280 11430170 11260794 11083048 10784187 10647593 10545047 10382858 10253820 10173706
21202 10173706 9971559 9840515 9753693 9604608 9492379 9409057 9337941 9288982 9260069 9144522
21192 9144522 8996694 8964862 8931722 8850892 8776295 8750672 8663194 8619973 8590034 8569573 8539291
21181 8539291 8451809 8357371 8339588 8314522 8280979 8239506 8204178 8064478 7876924 7895758 7834232
21170 7834232 7780743 7711706 7757320 7722905 7673894 7656397 7764616 7732082 7606598 7546599 7537508
21159 7537508 7550997 7498920 7421718 7374317 7361085 7383812 7330599 7254543 7103231 7135700 7177475
21148 7177475 7089679 7000908 6917687 6761272 6640554 6596494 6585724 6624697 6569706 6507730 6465413
21137 6465413 6270803 6251871 6336506 6336269 6260298 6172584 6197577 6122849 6148724 6230076 6244458
21126 6244458 6178361 6112493 5974198 5914239 5873277 5796080 5787125 5766630 5675564 5591005 5560010
21115 5560010 5539162 5483661 5509953 5515085 5417227 5376758 5336120 5253757 5181918 5179891 5216349 5252703
21103 5252703 5194991 5196780 5258519 5151157 5078509 5109646 5102181 5052057 4985468 4973272 4963032
21092 4963032 4857690 4836138 4865191 4894883 4862966 4715282 4620925 4656826 4601029 4599393 4687582
21081 4687582 4747348 4703428 4684187 4730520 4773787 4781075 4783990 4663725 4570347 4557457 4669312
21070 4669312 4661868 4589407 4576068 4622947 4571522 4534329 4446607 4396328 4411780 4352397 4385850
21059 4385850 4368237 4345824 4370222 4307755 4392963 4409970 4272171 4186997 4118336 4052857 3975297
21048 3975297 3965887 3973702 3996523 4025514 3982259 3950818 3911209 3948581 4055607 4049756 4074417 4053124
21036 4053124 4036008 4021018 3946812 3866776 3880031 3926827 3877411 3885209 3847639 3837474 3774993
21025 3774993 3729888 3757648 3837442 3768140 3812750 3824442 3816783 3870459 3865507 3789616 3709554 3653955
21013 3653955 3651455 3630266 3629493 3635630 3605698 3567398 3529512 3455358 3576649 3640779 3622778 3605042
21001 3605042 3514040 3424019 3436630 3569333 3573219 3548902 3601156 3593369 3545350 3531455 3521251
20990 3521251 3495288 3389314 3349323 3359667 3368089 3457188 3540405 3474543 3446108 3427561 3395120
20979 3395120 3353275 3270007 3293171 3419742 3388971 3324920 3425590 3466424 3437334 3411089 3482463
20968 3482463 3551123 3692334 3775777 3738554 3758252 3779505 3767083 3764568 3844009 3915697 3977210
20957 3977210 3938626 3932574 4011478 4128758 4246405 4378671 4454984 4623359 4788218 4903857
20947 4903857 5215950 5618190 6024775 6395583 6672743 6901047 7136894 7606168 7876788
20938 7876788 7903050 7978219 8163217 8426652 8805478 9489089 10245077 11115078 11923622 12707482
20928 12707482 13602902 14629999 15806368 16965376 17946526 18968002 20213863 21919574
20920 21919574 24449271 28015968 33065806 40113654 50047122 64862884 88045435 124891522
20912 124891522 177364052 234172227 276058232 293360903 293135370 295609648 309320558
20905 309320558 322590985 318147628 286700272 241024566 198170947 168419607 158310140
20898 158310140 170398427 206256497 258577330 303739695 324610088 320136600 308261892
20891 308261892 307063848 313682762 310827609 284713935 236710248 182669400 134538975
20884 134538975 98420673 74219057 58498079 47819194 40210764 34416714 29968426
20877 29968426 26632901 24010839 21850094 20232125 18982826 17830647 16744143 15669413
20869 15669413 14555285 13512372 12518364 11679101 10999378 10364388 9881361 9550633 9195342
20860 9195342 8966048 8674650 8369137 8107630 7830708 7584176 7305186 6862276 6430360
20851 6430360 6136233 5790202 5468728 5172034 4927549 4673344 4493081 4368228 4290920 4186156
20841 4186156 4044253 3990189 3987762 3944153 3889458 3719845 3609519 3556886 3536092 3570236 3539112
20830 3539112 3495893 3499157 3497768 3339286 3185625 3116044 3075895 2968685 3044728 3046920 2958168
20819 2958168 2932642 2852669 2842062 2791246 2706638 2599761 2546539 2655822 2686641 2604069 2628447
20808 2628447 2603221 2551808 2557440 2499685 2488022 2474806 2362063 2373846 2330125 2412245 2414760
20797 2414760 2353837 2335933 2256915 2274466 2243329 2139927 2231105 2252750 2240111 2202414 2196045
20786 2196045 2243903 2263547 2217154 2162169 2247336 2310626 2315967 2251137 2185694 2223713 2228926 2161432
20774 2161432 2153116 2187521 2235689 2231126 2131381 2210055 2242612 2252121 2354656 2475366 2494941
20763 2494941 2479135 2564282 2504677 2329497 2197277 2129881 2063643 2087304 2014107 1893771 1988655
20752 1988655 2213440 2263543 2222115 2171477 2143294 2011862 2101043 2196818 2181871 2211815 2238765
20741 2238765 2197235 2216931 2272846 2343576 2380035 2411066 2422094 2351377 2352952 2356836 2424308 2461079
20729 2461079 2482079 2502662 2583770 2661531 2673323 2776385 2902861 3184183 3465851 3851710
20719 3851710 4258840 4489317 4696526 4694707 4482326 4411827 4529536 4712502 5049764 5594128
20709 5594128 6224176 6793008 7141366 7146677 7139855 7135349 7330293 7650892 7969524 8252439
20699 8252439 8616402 9152535 9818544 10603792 11524762 12796312 14422876 16612610 19505622
20690 19505622 23355187 28820790 36724347 48891056 68447882 100740802 149761754
20683 149761754 207496792 249598679 253379036 220171920 174413740 138276514 119430559
20676 119430559 117476038 133612175 171234117 225714899 272320525 280688329 242762465
20669 242762465 182487956 128601608 91977992 69491629 55709798 47093221 41866931
20662 41866931 39007439 37744843 37736492 39261605 42960477 49723480 61567596 82338183
20654 82338183 118351707 173935945 237483470 277909505 272470918 228998587 177136596
20647 177136596 139525192 121784349 122199109 141245055 180946919 233926675 273815374
20640 273815374 273781694 231805240 172422867 120799413 85508671 63314608 49108965
20633 49108965 39494551 32791266 28036534 24424366 21308861 18703361 16642830 15047681
20625 15047681 13856613 12967870 12286100 11638629 10939462 10154045 9418192 8831978 8420343
20616 8420343 8396598 8552495 8521260 8121080 7586877 7011247 6406787 6020123 5734607 5521419
20606 5521419 5563671 5693912 5818118 5616266 5151320 4568685 4121524 3808347 3479938 3298831
20596 3298831 3301886 3260072 3053712 2910084 2872142 2870746 2794024 2716785 2675572 2522400 2329138
20585 2329138 2309774 2295285 2297849 2240705 2119033 2097634 2088252 2062510 2040149 1951969 1880816
20574 1880816 1899314 1883963 1927511 1818674 1733442 1752180 1815083 1802113 1627747 1573078 1636800
20563 1636800 1713578 1755079 1797215 1778346 1721706 1763536 1790996 1746269 1756084 1657240 1698343
20552 1698343 1818449 1684964 1589738 1539266 1596801 1571160 1603914 1597281 1605650 1561086 1514905
20541 1514905 1463733 1395199 1426105 1514419 1442567 1383181 1438337 1390740 1321169 1316980 1351066
20530 1351066 1312858 1402514 1433029 1405039 1359968 1317964 1348400 1304200 1306432 1324008 1262240
20519 1262240 1157840 1111352 1172711 1211230 1197259 1096133 1052600 1079393 983321 945131 946533
20508 946533 1027051 1016706 1021411 1075391 1165482 1234304 1229711 1235382 1186073 1078393 988964 1001629
20496 1001629 951153 900413 852806 828812 842832 841614 878626 1002821 1065588 954013 919297
20485 919297 913036 918137 982952 898642 932030 1049937 1151852 1138172 1079145 1127252 1137153 1024101
20473 1024101 1022910 1055268 1106732 1043927 992785 1017165 900276 810512 758431 767302 843756
20462 843756 877788 985504 1087143 1029044 932039 902222 910279 859837 810944 828355 787278
20451 787278 798255 850415 928759 951074 1010461 1123065 1093619 964184 858963 876928 1005757
20440 1005757 998133 968531 920526 820507 733065 805443 849922 878228 898189 848374 869310
20429 869310 915279 915050 900177 922151 889786 770538 842122 985619 1061548 1035491 927264
20418 927264 940599 911442 954685 1011782 925870 837810 758490 814504 839604 861263 805617
20407 805617 712457 713138 795499 843164 785031 828352 858583 893055 968065 1027801 1040356 1028736
20395 1028736 1029205 1045436 1050721 1060336 1090031 1058362 1074827 1046076 943172 860501 810729 755538
20383 755538 760704 816139 818749 864242 831754 828987 811714 814581 859539 870065 873944 830232
20371 830232 826182 943346 1070275 1026286 899559 834598 801014 806577 778003 793595 766595
20360 766595 733284 767608 868225 843939 695024 625214 707271 785401 800165 826338 766696
20349 766696 737566 735509 704806 730241 747226 795496 747438 705536 704483 733855 779777 802062
20337 802062 846217 797163 805142 825947 878742 889666 925019 1052576 1304784 1592249 1801738
20326 1801738 1907890 2064877 2113973 2099133 2074058 2117781 2119468 2051806 1862393 1552173 1394734
20315 1394734 1361093 1422024 1621797 1792941 1938575 2166574 2219659 2186151 2234964 2280775
20305 2280775 2229575 2087015 1820183 1560926 1362738 1215147 1137986 1115847 993779 930700
20295 930700 968835 910311 834640 854389 898448 950245 1023565 1147900 1234536 1257530 1227373
20284 1227373 1146675 1054338 966539 934037 1045948 1102354 1139533 1169265 1292998 1391060 1442683
20273 1442683 1510164 1514781 1416789 1338180 1228015 1137221 1094381 1057233 1055747 1132984 1174951
20262 1174951 1196967 1145242 1031373 938870 839704 708949 775747 842798 848732 844196 791436
20251 791436 746919 797440 803961 803599 671308 573044 581487 650614 663318 630708 683256 713877
20239 713877 778991 967203 1118517 1104269 1087157 1081021 1016964 902687 770106 844912 915709
20228 915709 1001979 1088179 1199033 1227761 1304345 1328611 1399157 1392458 1305108 1179521 1114882
20217 1114882 1125016 1130033 1103230 1095965 1095791 1119053 1108363 1071788 978998 837310 788256 711883
20205 711883 652713 560305 526298 543169 579643 517414 502063 500838 435311 435989 431694 511554
20193 511554 544267 500251 439165 426961 336953 329202 383628 436660 450293 536244 505150 500011
20181 500011 425090 308959 260489 305905 335456 387821 457918 543262 615723 585276 503810
20170 503810 497720 475183 590136 589927 575868 625607 579206 512650 500562 538031 534716 512025
20158 512025 480346 522232 469482 399656 404222 499653 534026 526933 498125 493225 488607 446855
20146 446855 424776 423778 360599 344045 463019 480073 397819 348078 419373 459530 411855 406060
20134 406060 371115 450178 470115 449473 427592 462894 496843 512457 515017 497895 487060 384823
20122 384823 401089 482570 550380 562639 522973 488527 525770 512943 536477 690581 728390
20111 728390 689288 682432 759954 785123 890768 1015187 1189921 1395612 1443898 1438742 1370678
20100 1370678 1300432 1173903 1149931 1228016 1370731 1401245 1506079 1548464 1465462 1384208 1274003
20089 1274003 1090663 1059662 956944 914351 908670 918636 845514 773488 759309 790015 808630
20078 808630 944838 1058729 1177164 1312989 1477265 1616319 1579643 1440986 1386546 1246301
20068 1246301 1202142 1256728 1252764 1384810 1448268 1523248 1572117 1490982 1301450 1139281 1000428
20057 1000428 844273 683081 576915 622857 622608 521558 564928 604069 563153 512611 468127
20046 468127 444166 445534 612650 646004 647508 517030 443726 429929 427800 379698 388753 374569
20034 374569 332393 254074 200505 186515 234239 325752 441315 552750 614934 598747 613644
20023 613644 507267 394383 416048 496531 506170 409504 400651 381260 368671 341210 351327
20012 351327 402768 402950 346974 361429 396643 368612 420434 556839 601943 542499 576854 572984
20000 572984 514114 451296 401245 280917 262213 309435 214008 215271 248077 234516 246984
19989 246984 242558 264166 303865 296500 401522 382037 348824 326529 378114 369440 399154 425170
19977 425170 482342 533401 404145 331014 435814 454552 386609 381338 371444 403025 374208
19966 374208 330690 243366 284989 256444 216307 267510 269862 252361 283943 324330 324821 367513
19954 367513 419846 397368 395982 418122 427062 440106 346995 390989 325657 396341 468920 352708
19942 352708 313838 409354 511811 527974 478977 481117 428271 380219 428189 458108 479097
19931 479097 527615 486500 417906 407447 400939 351217 433121 552758 581904 587993 435530
19920 435530 359296 444557 448778 456423 404006 370109 343528 311728 282113 285396 303446 383103
19908 383103 500295 465921 314350 205439 161613 268126 412169 526142 531114 453403
19898 453403 511299 525115 494179 387130 288202 218357 338236 510544 445058 403706 489268
19887 489268 440901 415097 472920 478124 484721 517209 435429 494973 522338 486495 453470 441081
19875 441081 515393 496625 422785 387876 425145 501910 553597 525190 537364 568351 576807 630948
19863 630948 544843 530752 480238 522686 496982 535502 614658 612449 679186 864543 867064 719845
19851 719845 607734 549986 556140 527727 577911 592154 746476 883852 921405 963582 940283
19840 940283 854305 824592 837806 832949 775600 762747 733337 858347 920391 940481 898342
19829 898342 843231 835653 871093 851351 772048 719123 700610 710326 699084 722947 726075 672634
19817 672634 664364 638154 743017 858880 883270 846155 864352 918087 969169 1019422 1046966
19806 1046966 1095684 1185047 1351493 1467829 1433693 1437895 1483355 1526701 1586579 1493024 1467685
19795 1467685 1631395 1936143 2113212 2212503 2389628 2580266 2565434 2470644 2513678 2648133
19785 2648133 2827244 3054027 3319119 3549283 3897321 4424254 4863084 5191590 5577710
19776 5577710 6072693 6726736 7405342 8147199 8952980 10148992 11800476 14189182 17495800
19767 17495800 22436295 30055454 41981210 60458992 86720533 114169594 126552491
19760 126552491 121273916 107933977 90307734 74559193 66286932 67136535 77930357
19753 77930357 99639468 129063847 150867043 155281592 154043039 153841081 157414734 159302990
19745 159302990 149039985 130923785 109756634 88967619 74185931 68037171 70960685
19738 70960685 83285174 104296486 124830067 128536366 116659520 98098532 75775458
19731 75775458 55797086 41629727 32658496 26959316 23215461 20722900 19201719 18490181
19723 18490181 18149603 18011027 18093487 18652021 19699278 21614177 24796514 29811175 37849215
19714 37849215 50849649 71610281 101473418 132456854 145406427 138496513 122780515
19707 122780515 102249499 84495279 75486533 76544712 88161067 110948575 140798933
19700 140798933 162410755 167607486 167616158 170123414 178453330 183101636 170297835 148438489
19692 148438489 122985571 97978291 80725359 73832024 77119066 90817531 113843021
19685 113843021 135841356 139254143 125844208 105026736 80361958 58276606 42551901
19678 42551901 32288656 25439934 20781572 17598866 15238372 13411913 12004721 10853147
19670 10853147 9921812 9044127 8279233 7608804 6897329 6267201 5812801 5338020 5009178
19661 5009178 4708412 4313965 4023674 3748339 3483512 3232742 3067439 2956145 2900812 2804042
19651 2804042 2654205 2498184 2448136 2426396 2373620 2253024 2096829 1972490 1958512 1912279
19641 1912279 1835460 1741491 1745515 1771175 1679366 1648566 1725944 1632055 1573016 1533714 1492749
19630 1492749 1468053 1449015 1458809 1454784 1410871 1343255 1327225 1299940 1293882 1222293 1159502 1170212
19618 1170212 1231512 1182990 1146367 1169786 1193894 1248719 1214879 1108689 970171 941355 984650
19607 984650 981161 946459 905790 898620 920243 951626 943877 882317 874024 842505 755540 682671
19595 682671 687873 723081 851188 897173 849736 757670 735216 644265 661849 788664 815727
19584 815727 876961 823642 811435 745857 737533 800524 795748 750564 729511 660919 646437 692196
19572 692196 590657 518702 642445 790004 740792 677658 647870 723447 735193 656096 635037
19561 635037 655933 684830 678637 634338 658906 635607 600114 618481 576926 494982 509308 528683
19549 528683 489615 462468 470636 457841 486376 500280 484432 538329 523631 648766 597059
19538 597059 523369 449003 405621 261657 170167 252836 352335 448539 514778 532163 530325
19527 530325 498328 433832 385194 339621 304272 363005 379707 373794 341001 297235 369578 455834
19515 455834 513504 411344 295461 339597 413533 405530 423057 385575 289898 285177 385471
19504 385471 448659 421227 437068 461433 549060 626874 520560 363740 357796 324940 333766
19493 333766 289950 355947 429869 502219 526875 488962 511560 522794 574613 503229 385682
19482 385682 350718 330385 329378 224278 196456 204312 308864 357645 389760 424083 457230
19471 457230 368703 399232 409588 364572 333869 290891 215950 187009 202859 292064 275400
19460 275400 313370 365931 359770 352898 397044 396719 394344 375567 363032 394740 444851 447211 409121
19447 409121 384930 397847 365238 425614 438455 394746 434343 447781 380021 369239 292328
19436 292328 224639 213781 215668 268482 278846 261413 268313 276307 311498 251626 179393 163256
19424 163256 137135 150880 203369 205905 253958 273883 345618 321006 268633 224134 193960 199075
19412 199075 85613 14023 5394 61347 194575 333363 354041 314273 319544 264931 246653
19401 246653 290591 332639 246631 284009 376102 423140 371597 377800 388107 326560 307014 202041
19389 202041 226151 326477 276528 272433 323346 317027 353803 314376 267904 285345 349020 356317
19377 356317 302390 283465 261232 164596 91945 84200 129361 203507 194550 68709 54454 53707
19365 53707 32037 102888 175374 183208 50429 63062 180655 200026 172559 198481 192329 150592
19353 150592 97133 122932 103044 139880 167430 110647 108650 125645 194629 230149 237461 279306
19341 279306 204083 192750 181581 204189 235118 158016 27071 -32183 76766 162167 214223
19330 214223 215595 145034 175056 213706 262484 289390 270048 211698 191005 210494 178592 185845
19318 185845 248650 263685 287022 370062 359693 301601 415453 447937 482416 674524 891045
19307 891045 1025206 1036396 1059203 1010572 928001 938443 991853 915120 710794 611804 461979
19296 461979 383298 297412 398889 502560 409048 395414 337973 256843 336487 334186 236962
19285 236962 284986 347410 354017 352018 401984 494558 585678 728012 826708 962910 998835
19274 998835 830878 857077 978460 1102270 1093271 969690 909462 724682 488527 382367
19264 382367 372199 359533 363496 419586 569792 621003 659609 765234 928883 1016109 1027520
19253 1027520 1026360 885945 912564 847745 777465 682208 512080 456156 392273 309681 251600
19242 251600 297141 411894 397152 381424 341622 348662 260636 318742 322563 449711 613299
19231 613299 716423 833411 912171 1018815 1091345 1075823 1154042 1163668 1186550 1295196 1390332
19220 1390332 1476809 1528675 1472082 1417214 1281405 1178072 1145680 1157848 1035580 913845
19210 913845 778446 689473 665601 635890 667326 735784 824949 969720 886738 776311 675960
19199 675960 610912 443358 380020 307925 284057 357266 408345 307033 309581 288302 160018
19188 160018 220096 255435 249604 332648 413192 457836 494854 534704 678767 917784 936088
19177 936088 862106 779832 735649 677177 590021 590529 722012 844814 946453 995587 961263
19166 961263 971360 900893 979864 1012365 912076 748134 685478 667034 609463 674022 782198
19155 782198 808365 967542 1011421 997147 1006464 940308 744765 563263 394749 352078 267324
19144 267324 187501 218920 245450 338736 300955 172871 146226 183642 171882 282221 285748
19133 285748 241193 244611 276676 231635 164974 221477 284655 258960 209175 291125 348336 327315
19121 327315 173554 147804 167046 182682 128257 139492 241106 316510 262088 264284 277936
19110 277936 165988 54747 -33493 31839 119378 210576 207034 154229 164346 181982 206514
19099 206514 164975 123505 173766 226421 191616 94932 95232 53978 -10978 24869 93100 108064
19087 108064 104492 116820 151405 174350 104768 92368 113703 183328 220025 231372 207053 193249
19075 193249 240354 188246 26217 -48161 -33225 84524 183224 318258 394477 345522 235184
19064 235184 167742 206338 191051 155958 145427 131876 113301 113919 104548 67210 129530 143855
19052 143855 176012 158663 99585 47824 95599 147166 141687 149058 185246 271114 405539 594266
19040 594266 720651 829553 875358 793348 636758 582142 564915 490000 376840 347735 453729
19029 453729 565770 622808 570169 532259 464113 444339 394209 275400 263678 191328 140630
19018 140630 209639 203773 230380 291193 362226 437027 511028 542964 609307 606569 503561 415648
19006 415648 399701 308143 240046 370961 515044 716022 857974 912018 833210 817959 674302
18995 674302 527967 432282 338786 311614 308551 313849 275974 233065 168333 239242 308041 328942
18983 328942 307447 248580 179489 87617 95544 152528 200767 202344 218813 168018 146851 94011
18971 94011 56906 51250 32855 6595 83247 185704 296535 289619 204619 167301 48967
18960 48967 68891 212626 278872 291811 220369 126727 94250 108693 110946 158596 284087
18949 284087 337022 336041 316476 273630 111397 91414 143844 164410 143573 70690 34209 125269
18937 125269 186857 177994 172146 175394 173374 83872 -3825 -4422 93126 203704 279023 321427
18925 321427 357571 211080 61990 -51172 -64668 -22528 -44352 15190 156061 166851 66145
18914 66145 2819 19535 60640 145503 223300 199659 256708 263489 241385 232678 233154 198526
18902 198526 196263 219665 161371 168840 148793 84120 125559 164241 141596 93981 125570 97811
18890 97811 131543 194783 274191 293456 256901 155306 126568 169630 163037 199696 292517 342886
18878 342886 358807 270350 163566 161446 172467 304107 361835 258744 220985 308975 319360
18867 319360 225340 181408 283035 357952 385353 389697 247156 147399 195545 258145 283831
18856 283831 325292 324802 323502 394978 455594 428971 417081 324263 284396 309553 401032 374035
18844 374035 335218 387131 475796 430817 393089 428342 391101 355458 353237 424380 397821 428507
18832 428507 519735 519922 590360 726583 751923 673893 653367 653422 580724 532742 593553 660380
18820 660380 773149 812793 778104 804677 851824 834223 911700 1057802 1201850 1201577 1228686
18809 1228686 1263003 1324488 1407391 1483023 1569530 1627881 1854909 2243279 2647269 2972714
18799 2972714 3186834 3321187 3595994 3932859 4220798 4537147 4856139 5272846 5870600
18790 5870600 6579799 7570268 8797453 10439777 12680022 15820539 20417806 27263824
18782 27263824 38064804 55926196 85375521 127632810 166482599 176871873 162395914
18775 162395914 149053840 154963410 175260981 181728801 157362101 117305621 82078813
18768 82078813 58540430 44127849 35216564 29368946 25092817 21972075 19859831 18583310
18760 18583310 17782225 17330366 17373026 18082000 19345692 21208309 23861229 28020626 34880697
18751 34880697 46116416 64424982 93514893 132686978 165663951 172109206 158635992
18744 158635992 148284706 155457043 173008235 175222438 150253545 113171905 81781065
18737 81781065 61359980 49438340 42728353 39517840 39470610 42733301 50359167 64969403
18729 64969403 90334000 126521041 158896207 166210244 152827319 141094065 146152367
18722 146152367 162910460 166773248 143912182 108058848 76743227 55546618 42247244
18715 42247244 33811427 28169477 24267390 21395066 19339180 17996462 17060117 16409565
18707 16409565 16255958 16796963 17768395 19227894 21397846 24885542 30846083 40674039
18699 40674039 57170598 84468327 122548480 154185521 158073820 142268059 131087190
18692 131087190 138833086 157520706 159682599 133712249 96639253 66173243 46553385
18685 46553385 34539916 26809841 21622966 17924200 15185354 13115500 11468608 10225541
18677 10225541 9093613 8216530 7662120 7333989 6989187 6380088 5809922 5415893 5158116
18668 5158116 4980334 4636904 4145273 3655792 3321832 3035126 2884563 2801559 2589200 2486900
18658 2486900 2472490 2295506 2214472 2211775 2088967 1955375 1891728 1891362 1812232 1709294 1619876
18647 1619876 1574396 1567255 1587606 1531198 1415799 1310345 1230949 1265667 1267473 1235872 1171415
18636 1171415 1099687 1054770 1033260 1084953 1149393 1136814 1163572 1211220 1208627 1186403 1168165
18625 1168165 1137110 1144954 1132884 986653 903317 813410 776361 801458 786619 773832 765922
18614 765922 749172 765425 727204 642355 673588 801293 801166 706359 667959 725553 817506 789363
18602 789363 745634 778100 786965 745975 766700 744113 679836 649827 621109 608592 555745 592921
18590 592921 576258 545971 444046 404194 458863 426969 482870 482409 448803 443735 432137 445952
18578 445952 473553 657978 667208 608075 572128 559284 486862 454190 488138 491206 334272
18567 334272 232539 338682 502798 653882 697869 539394 459779 352617 302233 380640
18557 380640 440864 435234 484967 472837 400619 322779 345945 446131 520502 397671 306174
18546 306174 213010 229049 294907 288527 251742 309475 408277 452824 339415 363025 430927
18535 430927 417987 425833 435589 472375 481942 429658 410449 459547 454453 418398 411930 566474
18523 566474 558496 483647 461048 481654 383251 352214 433019 502645 569328 506049 422964 442031
18511 442031 367451 282809 242055 215323 239838 258854 317543 321370 312079 301591 349155 399542
18499 399542 384545 347326 364305 429405 426513 441104 440303 428838 396187 383669 447898 563169
18487 563169 604646 537667 531301 440505 283883 243172 351454 442302 451064 446848 389835 468524
18475 468524 471554 481289 434666 429111 454409 436414 456713 473049 440719 444264 418050 447800
18463 447800 428854 344698 270128 298255 241699 156421 180999 257673 344207 382954 338458
18452 338458 368159 376772 305825 231191 100510 56637 207239 260119 263041 332781 342361 300524
18440 300524 257158 326313 316776 296410 278569 256459 191972 116542 180525 150591 165411 133075
18428 133075 151211 110653 87878 126386 74759 87837 229790 162029 122183 154948 97138
18417 97138 40695 -20593 66703 151584 114761 133208 154562 163291 210545 209936 152003 135236
18405 135236 176109 155046 152653 173818 131115 81649 65161 36362 108054 164170 221844 228678
18393 228678 281535 177094 106392 158597 116860 1535 121073 161063 114285 31162 40925
18382 40925 67646 107395 102343 66718 152463 216834 219719 258111 184996 163659 196731 181649
18370 181649 99824 80678 94095 156906 218432 201792 212890 148265 87705 53630 101957
18359 101957 125250 124647 197858 172112 90793 62744 27419 22746 5417 71001 74061 24866
18347 24866 29384 -12735 -13040 2332 -40926 55048 72539 114965 153549 150925 100844 77874
18335 77874 174492 249837 187002 88656 95256 199241 145576 158738 151670 124629 123955 99723
18323 99723 163840 125140 45337 -19076 94790 163675 174754 95537 44966 145311 197975
18312 197975 158576 99093 66351 28945 13610 57396 63271 31137 52364 125643 196042 221335
18300 221335 191431 145090 169763 249398 246688 201758 164237 127030 103331 89719 45043 16446
18288 16446 78525 134403 150907 152373 92959 -14307 4920 59255 119903 77170 8459 79941
18276 79941 111370 123853 100157 62565 134092 134888 105261 61835 35734 57160 98427 134470
18264 134470 248528 260261 163271 127257 138818 132542 164640 196927 170240 240634 360078
18253 360078 368972 308110 205966 193258 256397 335556 449200 479867 572800 724429 896142
18242 896142 985470 884943 851204 880468 981602 1081557 1068714 871319 678888 477483
18232 477483 376938 364241 394644 529129 457930 328793 306040 277054 203332 218724 207304
18221 207304 226189 258417 312811 412696 405936 424137 469983 523761 584002 697578 823091
18210 823091 885302 969104 1029100 978859 980533 997328 962936 820640 608325 447092 408828
18199 408828 365775 451983 466371 492612 517843 546782 601646 795538 907123 981944 907178
18188 907178 835558 850964 846401 802428 781188 724004 646601 562776 502294 412146 235880
18177 235880 177189 214277 238597 226758 135566 181712 238127 258816 189907 160707 233160
18166 233160 269779 264750 298063 452215 589535 723352 818224 874294 950164 883130 855102
18155 855102 939250 982978 819045 636049 556564 424715 302043 248870 189718 125483 194492
18144 194492 231815 221892 148371 148271 214148 185994 129331 94038 25619 18511 70359 109662
18132 109662 127053 36445 90943 189546 188392 94719 -37849 -47116 -13822 -65289 -14401 3135
18120 3135 -54747 -154510 -125967 -26970 16139 25635 -78890 -149380 -1625 102945 140267
18109 140267 222868 235087 268510 197446 58039 30574 62163 103578 90024 109154 123126
18098 123126 71177 129454 100582 29415 87455 44398 27261 44847 35712 5923 79908 153343
18086 153343 146377 126284 104104 121732 96679 101208 108674 53610 12866 41959 66963 5558
18074 5558 83186 84806 137987 163509 322366 232564 160699 83527 110100 202177 185380 117070
18062 117070 79107 125309 197590 203002 202848 165749 123057 181987 215281 111246 85373 93172
18050 93172 140528 156847 108544 79321 80503 -10 19606 16932 55394 84298 32895 -14310
18038 -14310 44638 102135 103479 77308 41942 103108 200738 143643 72389 70109 121997 160711
18026 160711 71402 -69529 2653 49321 42860 38692 -34689 -14589 89590 130966 166927
18015 166927 180059 162754 233184 219252 128586 81719 44317 40214 73525 96129 129190 102782
18003 102782 3396 -47608 -20429 -118314 -131121 -22961 -31456 -21966 -922 48912 35658 46053
17991 46053 129609 130718 80712 59297 -10816 -29156 80946 180752 199904 69589 103852
17980 103852 66370 51573 28729 49446 145304 163999 129369 165287 143435 72871 127420
17969 127420 143337 96570 139018 129817 92929 44840 63426 46324 -44284 -7760 52262 53878
17957 53878 132675 170204 142106 128438 155061 106011 82111 128989 161853 173745 166607 139592
17945 139592 55266 100699 101497 56337 42231 50279 92258 112831 6245 -99075 -33163 33188
17933 33188 102142 70373 137535 184670 195096 182976 249519 371684 266704 149217 167153
17922 167153 78222 -36938 -47594 85910 181723 229941 190207 64120 59614 89783 62724
17911 62724 -50432 -103804 -19836 33776 33425 67758 109723 97227 112589 103529 76292 106486
17899 106486 69888 158298 179463 137718 136923 108485 73069 35418 52516 40053 35028 30032
17887 30032 114750 131480 86611 171884 165487 152022 109207 40861 -21623 -47029 9352 -22148
17875 -22148 -115730 -90311 -47927 10426 -29379 -26538 56028 158728 175948 155825 169946 129690
17863 129690 1270 -19394 7777 -4746 12467 22276 -10460 31127 44210 91706 120150
17852 120150 96840 -15611 -53146 15489 107566 33151 -105571 -31084 91195 66093 -32248
17841 -32248 -56844 -43572 -60098 -119736 -32734 79585 86346 51618 -13664 -64609 -17958 29651
17829 29651 70178 62523 -24293 -162201 -157805 -44650 36995 87123 112647 68979 171633
17818 171633 161718 140989 170681 201700 195751 119289 50153 74523 36401 3065 49764 14841
17806 14841 -60207 69470 133684 96011 52565 47483 34563 82102 77690 76521 143349 38804
17794 38804 46070 -23299 -138058 -119021 23851 113693 26445 -37605 13556 97992 160533
17783 160533 107739 -38317 -31992 47508 65401 12387 -65360 -43687 -10507 -56469 -26426
17772 -26426 -11320 53775 58913 91702 127579 117012 106968 77257 90207 55206 121241 218975
17760 218975 324256 298823 127957 34409 -26406 -38855 79820 29650 14951 -4787 -22056
17749 -22056 29777 43752 -69389 -137959 -76225 -43292 -42619 -48602 -29386 -20594 -66967 -41143
17737 -41143 92365 107895 23617 37432 10725 -21251 -26306 -74213 -82813 -120128 -76320 -7006
17725 -7006 -36900 -10098 23304 79803 -2063 34970 63815 -1583 -40278 3848 -13737 -27099
17713 -27099 -52736 646 93358 124544 114012 100769 6346 -93252 -73264 -58384 -53820 15810
17701 15810 -8399 36731 19318 -17779 77385 202540 193522 184283 67847 40213 39927 41941
17689 41941 11625 -39491 -79238 1256 97036 175128 151441 58472 -3024 88778 147096 86194
17677 86194 35125 8379 -5081 -59887 -49874 3024 66869 214957 216349 186246 138642 134170
17665 134170 117423 175825 102764 76905 111302 119621 -7542 -42154 -3722 48360 77281
17654 77281 78497 116177 146262 178598 140320 -15673 -77604 -94545 -33931 4993 -14733 46921
17642 46921 55063 69387 -32719 45739 31619 -19394 -20778 -53821 -12382 11380 123078 193544
17630 193544 157649 198463 172803 186349 139822 57074 71364 148579 191204 194005 196827 249480
17618 249480 258591 170499 96945 465 -69189 -67517 -83327 -93824 -115617 -141280 -114127 -60927
17606 -60927 42623 84180 25184 -27522 -15016 -38429 -15285 -45671 -83084 -187634 -192181
17595 -192181 -117231 -60007 -39562 29153 49111 -42410 -167265 -166314 -150037 -182547 -187749 -263455
17583 -263455 -205479 -102607 67890 41428 -86756 -46593 -41904 70039 178809 181523 145879
17572 145879 49034 6106 -25742 -52514 -137313 -155480 -163115 -221042 -176468 -100854 -111080 -65663
17560 -65663 44479 45541 76908 148022 107693 107578 101404 49509 48151 3812 -71296 -81261 5656
17547 5656 79633 -26921 -95191 15194 57375 92764 81111 101005 165605 62754 8015
17536 8015 49003 117028 90233 1253 10600 36712 54071 112589 210509 249550 213664 123514
17524 123514 104525 13222 14188 11867 24912 58488 36797 108916 132419 68005 53924 89934
17512 89934 81290 6084 -9139 106942 116011 54997 66261 78899 192744 113518 33933 -34120
17500 -34120 -92665 -71080 -75284 -88510 33935 34060 -3734 -53071 -132969 -70164 101853 209310
17488 209310 227395 177068 233327 120150 -46335 -98092 -76097 21537 92853 80874 6451
17477 6451 18583 11762 -27718 82121 77030 107878 70439 -6044 -61355 -93287 -84380 -98253
17465 -98253 -91467 -95173 -53312 3185 42419 -73130 -177331 -176404 -66576 4445 36038 131619
17453 131619 142591 199843 225332 120574 127932 126731 76510 -31466 -58355 2391 68513
17442 68513 14801 -18377 -12063 -40579 -77324 -93908 -85984 -99227 -48152 1108 -30248 -11159
17430 -11159 -20902 66294 60229 87330 31866 -42713 -31630 7532 43656 76257 27881 47755
17418 47755 57066 79727 104950 12723 70413 15556 21494 40158 66401 42342 -64368 -73916
17406 -73916 32016 77598 98407 134215 87748 1414 -19378 -12298 -40366 -29937 24882 36175
17394 36175 -14006 -35621 -14486 -59269 -95090 -54037 53576 56218 17570 -23287 -62964 -13777
17382 -13777 24800 99878 102989 58754 9166 13898 19341 27532 9303 -90397 -129210 -62540
17370 -62540 -39216 -129071 -119617 9150 46986 -40741 -105318 -89079 -16134 43799 77020 155025
17358 155025 135880 169881 117085 59435 106974 55985 -83628 -134076 -11582 56591 63937
17347 63937 92089 80702 65069 -262 -79957 -28088 -50235 -54475 -47425 -101359 -129300 -164650
17335 -164650 -113632 -26286 29290 24960 30334 68834 33984 33323 58642 81355 105401 216041
17323 216041 162253 5477 -112319 -150747 -159496 -60504 61597 3020 96681 150644 128416
17312 128416 89408 19197 40249 43173 49074 55382 36677 22064 8335 -10896 37745 16322
17300 16322 -58143 -84294 -104416 -101197 -89258 -16113 5298 6033 3538 -44094 -19718 8047
17288 8047 65555 101631 -69242 -90103 -99995 -121521 -16448 -376 -33599 -58157 -133734 -129112
17276 -129112 -78716 -60801 -81286 -66744 -67786 -83125 -51238 32432 52245 124124 220074 147008
17264 147008 65914 61047 -85723 -14147 -405 -72805 -100845 -127549 -41619 -35995 -67488 -58772
17252 -58772 38148 98973 38832 14501 -7422 55110 -5056 -2302 117359 152549 146482 39786
17240 39786 -51774 -78501 -101412 -23939 88064 31330 12586 5352 -11113 44949 52391 51419
17228 51419 87787 92146 64929 -12323 -83395 -98067 -122019 -112794 -52407 -103483 -116993 -6561
17216 -6561 13014 26544 18855 -13847 9163 -48362 -164006 -244864 -237560 -189332 -219576 -144088
17204 -144088 -50837 -14145 -125834 -74849 22058 97555 66079 7773 75720 90640 58143
17193 58143 17483 32136 -38256 21941 167738 165399 34937 -41203 47231 122135 237379
17182 237379 158531 110820 28615 -3969 26043 7387 1136 -18158 -84549 -34510 45205 45714
17170 45714 36146 21535 -22571 13379 -59250 -64823 107185 94930 -25276 -81619 -4467 13965
17158 13965 10520 69925 152352 126997 58586 94159 28083 11851 33143 -8908 17309 37777
17146 37777 17331 -40392 -58076 24427 50956 48715 76450 34679 -7679 55647 61362 24341
17134 24341 64902 31227 46087 30490 -54205 -21090 -35281 -81471 -120463 -116380 -58750 -75769
17122 -75769 -132361 -115791 -140392 -33135 94206 64067 -15091 -76733 -63451 11486 32464
17111 32464 94223 124569 72483 8975 -5783 -17129 -44223 -16708 9961 -49096 -44035 47409
17099 47409 106994 70632 27695 63143 -2122 -60518 1075 95679 126367 81038 125370 71229
17087 71229 19406 -139684 -157822 -165355 -146984 -92338 -146304 -41881 -20560 -123362 -101113
17076 -101113 -109194 -170865 -171151 -67634 8736 48161 10961 40679 79979 83123 -20267 -154436
17064 -154436 -96186 4455 28638 23926 49809 90661 117036 146292 189613 145026 92235
17053 92235 64693 122031 196781 124026 23770 -23097 9806 20390 -22046 -87811 -101502
17042 -101502 -50318 -34086 -73809 -48520 -19417 -81944 -117532 -106680 -25819 93743 20145
17031 20145 16677 -30469 -55558 42827 88751 48660 -8028 -53780 -88375 -49831 -51547 -27717
17019 -27717 -73596 -85009 17528 99633 113829 -17342 -90260 -97472 -110140 -108965 -134045 -176833
17007 -176833 -172370 -22892 78835 24608 53931 -29738 -14261 -111861 -172822 -91861 -66319
16996 -66319 -132100 -107206 -122087 -111643 -24886 -72465 -76092 -12589 71775 58940 90518 91100
16984 91100 60430 -49177 -109048 -73191 -126393 -173194 -219803 -119682 -107718 -83604 -53515
16973 -53515 -59629 -115747 -134009 -118553 -12681 38266 5971 116973 84159 10535 34455
16962 34455 -11939 -95675 -32661 -62517 -186512 -136070 -137916 -143728 -81071 4370 64099 46810
16950 46810 -388 -15301 40547 -17352 -82560 -70175 -50797 -108325 12382 133581 14801
16939 14801 -11979 -13454 62797 71983 -24064 -56793 -115800 -78850 -33972 -33903 1908 5521 -41925
16926 -41925 -58454 -47168 -12404 -13572 13695 11270 -13859 -9569 -55878 -6558 70704 132735
16914 132735 115012 38932 -67597 -51547 -71764 -98997 -23759 93997 87095 94295 18924
16903 18924 -31065 -11737 -19163 -51116 -13382 -57221 -106736 -137799 -137551 -131777 -87614 -90494 10071
16890 10071 -46075 -76960 -69580 -88123 -106440 -68698 -62016 34557 89565 40227 -50220 -27015
16878 -27015 52542 28417 -18808 -52735 -97622 -83452 -44361 -56454 -16187 46042 70799 57951
16866 57951 -87573 -155855 -112056 -24095 -25084 -25690 -68568 -31660 24092 -17749 52090 11259
16854 11259 38849 93775 114048 114847 69611 15991 -29596 -37146 -11798 -46397 -72112 -48452
16842 -48452 -56132 -89118 -56846 -95404 -154821 -145165 -63876 25017 -9791 -77175 -101710 -124546
16830 -124546 -163692 -123138 -17825 143364 190790 144219 89601 43825 -68758 -47992 41343
16819 41343 56404 53769 59439 17357 -43851 49472 61974 29061 24207 55472 29477 -68388
16807 -68388 -134983 -97017 -58507 -156248 -136274 -120429 -84417 -17599 -16083 -50142 10927 45309
16795 45309 23727 27078 2330 -20784 34869 35582 65247 7818 -44731 -1813 119018 123979
16783 123979 96956 56686 90129 52926 -32458 -65750 -109799 -167064 -110039 -7694 -97925
16772 -97925 -155222 -12899 48841 85365 39520 19828 -1363 52395 53996 -22587 -7879 21874
16760 21874 12128 -19107 -96160 -144202 -57772 28967 -24373 -78776 -42202 -19810 -16752 -70669
16748 -70669 -136112 -93936 -60701 -45440 4916 -13755 -29568 -73160 -34119 48624 78761 55315
16736 55315 11269 -44952 -7879 16546 29357 51111 6278 -97045 -43068 -23942 2234
16725 2234 28708 37383 -1032 -11096 26459 89498 147141 193132 180573 106002 82671 99258
16713 99258 128727 92719 51672 24404 21255 -30972 -84628 -1402 29626 37701 59942 88878
16701 88878 86470 80710 394 109609 212265 133963 -9204 -139003 -126665 -86295 -71152
16690 -71152 -21847 -13454 26709 97068 42645 987 11440 21167 76942 42750 -31625 -69923
16678 -69923 -116753 -89383 -56553 -51420 -64838 -97769 -74490 -48931 -56150 -126535 -19458 -79963
16666 -79963 -105234 -57866 -25156 17686 41894 129681 158126 198508 103939 73376 38242 83514
16654 83514 53595 23781 64013 66641 -1859 -73651 -104163 -79098 -50780 -77646 -58870 -66870
16642 -66870 -47908 -82986 -136038 -168023 -111850 -83173 -30066 11748 58748 -1365 -23806 -51442
16630 -51442 -78742 -213145 -265280 -247276 -231062 -234825 -140185 -109704 -161507 -111114 -64212 -163686
16618 -163686 -86978 100039 93364 27065 79073 110250 32466 -98381 -116599 -150254 -75430
16607 -75430 57909 177168 148299 105115 -19258 19744 62009 117384 103618 63881 50333
16596 50333 86299 101370 36035 -42684 -150067 -300528 -291636 -219641 -175750 -174565 -120950 -119528
16584 -119528 -141447 -91763 -42729 55867 120118 117955 74974 -5482 41232 87350 144302 155422
16572 155422 102783 49130 78510 112332 64017 40042 25431 1788 -22189 -17215 10681 -57621
16560 -57621 -129645 -131930 -102282 8375 64568 23051 -41011 -37348 -33794 -50307 -47506 -63892
16548 -63892 -56606 95975 131224 106564 119999 92134 74495 21948 -70213 -62169 7550 -30314
16536 -30314 31944 33945 -58810 -66540 23738 143940 121210 73079 40751 44158 24029 77259
16524 77259 127974 38105 -51631 -79537 -111530 -74720 -44428 -13759 3771 1176 -31264 -80922
16512 -80922 -98071 -58668 -150770 -155879 -41325 -38610 95112 156113 85165 71004 62527 -6490
16500 -6490 -50504 -152995 -158970 -74853 -115547 -99492 -69728 -170613 -83150 75260 55273
16489 55273 55934 75169 84025 87851 131077 224132 165339 58356 -29692 43846 50099 70276
16477 70276 57722 -42742 -79021 -10532 48829 119167 92726 16614 -85405 -102839 -34418
16466 -34418 40715 20525 -76188 -32364 -43003 -72426 -36366 17532 -779 -53140 -44854 -70047
16454 -70047 -32283 -39062 -70298 -16954 -12699 -57000 -20271 -24102 18989 1064 63393 82249
16442 82249 114183 22246 -88887 -133036 -144258 -201874 -139670 -135778 -91862 -78246 -64977 -47966
16430 -47966 -55447 -38804 -29581 -46278 -67151 -117113 -118863 -64343 22326 -50918 -85764 -116287
16418 -116287 -205820 -159617 -50455 -47833 -44304 88909 65517 28529 -49232 -83864 -53065
16407 -53065 63120 113068 76152 42803 12530 9721 -29626 42846 84849 158982 175208 155441
16395 155441 64389 9601 -42013 -125457 -119266 -56559 -11388 75083 73065 57048 81346 164611
16383 164611 196217 163029 130260 122441 116458 -33181 -3566 92440 47297 21588 -107655
16372 -107655 -102737 -66304 -4182 27960 25244 -55584 -106219 -101517 -71355 -56653 -63261 -10089
16360 -10089 -23885 -13114 -35340 -59959 -94281 -72934 -43652 -1051 57859 67379 35563 -72114
16348 -72114 -156370 -142231 -21541 -80219 -175921 -146963 -82607 -27624 -49558 -122906 -92740
16337 -92740 -25549 -9248 103605 144900 78187 -3495 -89135 -71904 -57221 27965 97337
16326 97337 97117 26212 -43163 -195919 -180686 -78708 -6179 -26470 -26557 -20100 -25788 52402 170580
16313 170580 95870 49979 58415 16213 -102170 -114677 -73590 -79676 -24857 5962 8739 31224
16301 31224 7799 -14427 18925 -78461 -86245 -101884 -144650 -98553 -66748 -87973 -196483 -106271
16289 -106271 -7131 -69851 -99754 -156643 -76617 -51117 -128670 -168233 -254920 -185917 -127413
16278 -127413 -146925 -118458 -198428 -235702 -150666 -34426 -61647 -8924 9072 -35500 -96851
16267 -96851 -144698 -90486 -115095 -159655 -184531 -155053 -112343 -102871 -32454 -4377 68311 21778
16255 21778 -49550 -171133 -160934 -98933 -119922 -170141 -180907 -175798 -183150 -159377 -178611 -61067
16243 -61067 43432 85303 46479 45530 118390 75480 12185 -8916 41222 14495 66621 101364
16231 101364 69727 -20578 -140047 -98084 -59478 -157975 -163745 -161624 -163040 -115220 -69920 -262
16219 -262 35943 -16835 -122074 -123350 -100055 -36812 -58251 -74217 -72485 22224 3899 -64341
16207 -64341 27710 80067 121340 63890 8526 3775 -33327 -100749 -54517 -52631 -30136 -25203
16195 -25203 2428 -1206 -52743 -84467 -20790 9204 1953 -18038 -78299 -71209 -34190 -57448
16183 -57448 -15824 49271 100291 129014 31900 -36429 -123013 -179225 -192844 -208706 -143109 -63372
16171 -63372 -56763 -34633 -24906 -122651 -139503 -55321 -80822 -79824 -67266 -22751 43031 93121
16159 93121 23700 26368 92882 -39555 -111135 -95828 -107954 -90575 -28554 123910 31802
16148 31802 1346 62027 46703 37259 -17402 -42546 -104155 -150235 -149453 -141832 -186638 -228632
16136 -228632 -161270 -38684 8689 -71041 -88067 -45780 -44344 -71054 -78830 -86602 -14297 63015
16124 63015 115532 106760 55079 111270 63252 -12152 10559 36570 34119 -50034 -62848 -94521
16112 -94521 -155495 -150147 -80809 13089 45683 52722 1268 9824 83317 30662 -13911 -96101
16100 -96101 -148271 -128540 -138877 -178092 -139459 -46914 41732 -5842 -59692 -88382 -65062 -79697
16088 -79697 -33539 -68434 -108559 -127358 -88410 -62100 -68578 -82233 -13933 70450 162182 139730
16076 139730 141065 15785 55475 125970 84324 72419 89476 30968 -37655 -46203 -60851 -82693
16064 -82693 -18089 -33502 -55184 -1089 64132 105391 61497 -94688 -177254 -7021 -19700
16053 -19700 -50830 23540 -82350 -83024 -7382 55657 59515 92354 206557 76197 -48328
16042 -48328 -49005 -43006 -39251 -34519 -3734 76555 83553 60754 -42804 -136474 -176283 -129229 -93050
16029 -93050 -62533 -74644 -120110 -67007 23198 -9174 -75801 -55676 -150081 -190125 -59987
16018 -59987 -438 -35378 -92210 -101037 -108583 -144765 -114332 -43359 -24636 -14841 62470 104775
16006 104775 75413 30983 -20678 -78534 -140606 -170937 -172903 -219379 -142201 -89418 -77778 -36137
15994 -36137 44099 82595 34851 -14215 -82962 -80930 -19769 -22046 -34238 35525 82152 42611
15982 42611 36324 33026 21060 156703 90836 -12877 -66597 -35471 -90660 -57835 -13667 12534
15970 12534 40252 -32018 -25603 -40232 -18435 59800 83629 66073 -8970 -111232 -152579 -121878
15958 -121878 -152251 -125549 -117824 -136026 -80707 -42624 -186507 -171966 -141990 -81538 -85795 -39448
15946 -39448 -16640 3648 33043 46594 72269 -30365 -48221 7232 -83583 -163123 -151034
15935 -151034 -235589 -106170 -20901 -61888 -56289 -15508 26431 19146 35254 109368 112929 159558
15923 159558 95555 67536 95103 -17758 -74290 -60356 15894 -11933 -66758 -91682 -115291
15912 -115291 -92301 3635 36920 27335 -57462 -34401 -70804 -59094 19730 41144 -14864 -12896
15900 -12896 60674 71647 30657 62943 81592 -13877 -98060 -99876 -41963 -67377 -109764 -67528
15888 -67528 -21670 -14811 -3064 5681 120603 123727 144717 131942 52533 -11542 -5038 -11921
15876 -11921 -7225 -5377 -87363 -118991 -33610 -39545 11874 45586 80171 55706 65194 675
15864 675 7936 -73902 -72897 74719 154443 103157 14740 -80853 -112795 -137369 -196751 -179737
15852 -179737 -111509 -111210 -65150 -119831 -153781 -175045 -164978 -143320 -139384 -114042 -59508 -79459
15840 -79459 1039 -74604 -57564 23764 57447 106689 124870 8908 -216749 -295885 -217385
15829 -217385 -171589 -112403 -100885 -31400 -153182 -216205 -129754 -62500 1244 64992 87819
15818 87819 92842 132705 85470 50829 17948 30854 -25372 -57373 -93235 -237211 -237893 -150487
15806 -150487 -77382 -28025 -16251 -44647 -88990 -141398 -158660 -116161 -43751 -24926 -59034
15795 -59034 -16002 107184 34329 -104029 -84625 -30217 35234 -21206 -103382 -44448 -13246
15784 -13246 -33997 -55749 -92885 -144504 -155069 -80213 -14937 -58909 48272 140174 174513
15773 174513 91526 64033 18046 -50376 -43552 -65007 -72766 -34059 -116431 -12626 88446
15762 88446 80405 6217 -49654 -82695 -90750 -55199 34789 -9532 -51333 -10816 4446 14671
15750 14671 38051 80840 108658 96358 151692 34834 -61900 -72474 -48358 -11961 22798
15739 22798 49839 67748 20693 57500 -18506 -87231 -55813 -62905 -102134 -131234 -144139 -252027
15727 -252027 -156266 -84315 -18892 -741 -10932 -45600 -107294 -157255 -14759 -8147 -67373
15716 -67373 46283 122692 90787 44850 9753 89197 57523 92110 17171 -43834 -57975
15705 -57975 -25344 28639 -70116 -124522 -92802 -128885 -106452 -70637 -116189 -164543 -59329
15694 -59329 -56277 -23869 14135 14745 24198 47728 31451 -78961 -64256 51693 89528 53736
15682 53736 24420 107856 144626 25827 -13524 -33246 -10577 -69730 -153062 -152903 -97158 -49444
15670 -49444 -61150 -130564 -163651 -126289 5963 19793 19535 -71374 -114989 -157110 -109971 -63353
15658 -63353 -74845 -22671 -43720 -79187 18455 9285 68835 94364 20945 -14121 -19043 -116221
15646 -116221 -102783 -40520 56280 111312 53764 885 -60168 -96816 -95317 -104509 -111472 -87806
15634 -87806 -43780 -77360 -54584 -20140 18440 -98591 -112994 -76707 -155440 -161026 -175541 -115553
15622 -115553 -1754 21741 71641 -20191 -7861 83465 119778 13289 -20207 -47304 -75236
15611 -75236 -74902 -31385 -2023 14297 -39914 -34261 -5035 -47192 -42405 55900 36431 -17582
15599 -17582 -52883 -8386 29643 44903 -1467 -29373 -72838 -112534 -74682 -60005 7762 38139
15587 38139 -10479 -31690 -32187 -23043 25100 -19815 18847 64875 -23202 -49180 -72062 -78254
15575 -78254 -146806 -203554 -221829 -175265 -153188 -126176 -81213 -50286 -37640 -86027 -173965 -193675
15563 -193675 -164218 -137934 -47993 -53827 -77183 -131223 -79465 -54303 -111515 -130974 -18387
15552 -18387 -15235 22051 45046 43417 21548 -69161 -93607 -122840 -119418 -72157 -134201 -122306
15540 -122306 -13731 76249 76007 57285 -16679 -12965 38604 43443 -52640 -128203 -74760 13362
15528 13362 8450 -72238 -95980 -22226 -22448 54363 28708 35571 91596 14703 -92121 -148922
15516 -148922 -95547 35933 61195 107319 51056 -33899 -114798 -155481 -154991 -202619 -229623 -201836
15504 -201836 -133292 -104591 29447 23541 -54908 -84134 -124967 -137677 -175923 -170918 -116037 -90909
15492 -90909 -24344 -61417 -159796 -126736 -57343 -12567 -62014 -52152 -46051 5057 -33229 32489
15480 32489 6824 -47626 -9618 128692 149174 22991 -65821 15664 27270 38156 54403
15469 54403 61392 13470 -25359 -52755 -74611 -219828 -280166 -252988 -170978 -76821 54935
15458 54935 30460 -25875 -5260 22242 -106407 -171073 -140523 -121303 -162931 -192760 -202038 -144029
15446 -144029 -124931 -144583 -131530 -58550 -134647 -125805 -102476 -73723 -121788 -142077 -185072 -173537
15434 -173537 -98081 -14008 -36547 -96516 -91560 -130786 -106165 -8500 -48645 -20713 2593 24053
15422 24053 18791 -126129 -138129 -130338 -101296 -122825 -97947 -46658 -11102 -46885 -20960 47690
15410 47690 -15466 36821 97309 94132 85236 41157 -57721 -134143 -119790 -121084 -112602 -166158
15398 -166158 -54817 86598 79302 52657 24174 14577 -9038 -47428 6865 78779 49731
15387 49731 14332 18168 49378 76655 61587 72009 46908 39853 -54347 -76313 -23927 21005
15375 21005 -67404 -102550 -26071 -3757 -18959 23956 -37453 -119212 -84813 -157295 -175132 -153143
15363 -153143 -216203 -289728 -184803 -129888 -135575 -94680 -41600 75875 96548 53531 8967
15352 8967 -101684 -132036 -91006 -77425 -96731 -39478 17482 -55204 -53924 5677 -11866 -78348
15340 -78348 -35442 76650 67217 16466 -30973 -82006 -29044 -50234 -70016 -14412 62915 34665
15328 34665 -6982 -90477 -78221 -63553 -135608 -167974 -91498 -36538 -16891 -25705 5054 22318
15316 22318 40748 7407 -17133 -44808 -35933 -24834 19032 -82097 -116193 -102088 -67473 -135019
15304 -135019 -172800 -174551 -150049 -126475 -58815 -34689 -65239 5096 -8081 -49159 -63727 -64262
15292 -64262 -79174 -121622 -123433 29232 83212 54239 -24867 -79418 -158767 -130850 -71601 -109328
15280 -109328 -138739 -103067 -60905 57588 151136 107278 74728 63045 -9291 -42068 -44925
15269 -44925 -94914 -147875 -68259 -20037 -113118 -135791 -133335 -181107 -114337 -42557 -32793 -7051
15257 -7051 16531 -56940 -75394 -67226 -33607 15153 -15097 -18073 40549 15528 -60556 -102558
15245 -102558 -176774 -236681 -133182 -49447 -46334 -27943 -50463 -2624 55755 28428 -23331
15234 -23331 -47551 -52897 -70364 -52564 -57405 -65489 -52486 -160620 -192217 -100871 -23012 -52403
15222 -52403 47703 70780 74438 114269 106012 33565 69590 80166 118026 103156 29872 25408
15210 25408 -50340 -83592 -48623 -49006 -74857 -92450 -102046 -61942 -107311 -136223 -174663 -161760
15198 -161760 -161682 -237616 -227758 -210328 -114203 -29400 61703 110877 132226 146839 155814 107656
15186 107656 20318 -119874 -201640 -125927 -97864 -93540 -84368 5598 53617 112754 48037 -4091
15174 -4091 95243 86108 -13315 -5477 -45751 -28469 -21206 23860 73641 25968 -11840 3743
15162 3743 -27161 5479 50466 38764 12151 -27115 -80827 -55425 -59083 -47299 -41022 -74155
15150 -74155 -114379 -99737 -181010 -233874 -247546 -177684 -41676 -84302 -140003 -105393 -134871
15139 -134871 -151852 -114130 -55215 2703 116660 112522 47373 6842 -35988 -67996 -37517
15128 -37517 -61829 -133028 -156674 -127712 -71039 67233 113314 88588 6196 18650 23976 -116361
15116 -116361 -150645 -98585 -116714 -100639 -60925 -97190 -122328 -94842 -47662 -48791 -174335
15105 -174335 -237111 -166181 -125300 -108949 35960 76791 32538 -30588 3947 27105 -32986
15094 -32986 -92899 -35006 11510 55583 28412 16806 60785 26814 -85954 -99673 -77658
15083 -77658 -161064 -215049 -145605 -105124 -99277 -85309 -112491 -87874 -130061 -152915 -115108 -75883
15071 -75883 -62599 -85283 -50168 -22394 32511 35539 -12050 27476 -9978 -78709 -111943 -189797
15059 -189797 -272101 -242806 -136060 -120481 -46935 11863 -27893 18132 154249 179840 115543
15048 115543 74467 21592 -5557 32217 5436 49889 105651 51593 36033 53843 -41523
15037 -41523 -113083 -43716 31193 16401 17282 -35327 -4848 64394 110773 21299 -133702 -60337
15025 -60337 8406 -107885 -112359 -123700 -207218 -208607 -306203 -315990 -349823 -206459 -95995 -23465
15013 -23465 5881 53085 22099 71557 45435 35859 8734 -24325 69205 53163 -100246 -49891
15001 -49891 -45075 -61812 31320 3177 7184 -52469 -99440 -36933 76207 104961 71960 49111
14989 49111 22257 1936 18065 -15409 -25452 -50563 -31980 43319 -215 31863 88991 55292
14977 55292 -29682 29981 -22928 -16859 27878 34707 -23598 -38016 -86036 -44886 -62028 -77216
14965 -77216 -71249 -118027 -79775 -22042 687 -58997 -58250 -66477 -99524 -101504 -94301 -58669 -35751
14952 -35751 -12986 27854 57155 -22675 9295 -11204 -112077 -124051 -35282 -27563 -23543 -61130
14940 -61130 -73598 -63512 -25675 -4449 -34376 -25218 33417 -11237 56387 56960 15403 -11397
14928 -11397 -21838 -13757 -57750 -76653 -9668 87515 27789 16555 62660 16253 -48523 -106699
14916 -106699 2477 91184 99250 23832 -107999 -130916 -65710 8048 -4549 134 38795
14905 38795 55858 -23472 -104661 -64686 7039 91879 44942 10430 40932 92027 181399 155136
14893 155136 84808 35316 8789 6079 9526 -2841 -25507 -38620 -17604 77629 92970 25119
14881 25119 61825 67305 86367 102305 118237 -3165 -3981 10498 -32562 -60755 -49037 -50377
14869 -50377 18072 23618 -14318 13991 -54227 -96081 -77680 -135335 -156831 -110515 -75549 -19364
14857 -19364 18645 -35768 -74130 -95824 -40648 -24863 -54194 -115014 -56606 -51251 -37250 -19304
14845 -19304 -94576 -116670 -126300 -95680 -118157 -82709 -46250 -93786 -82891 -67078 5792 39377
14833 39377 1992 -88011 -112072 -45333 -82593 -120872 -118469 -23614 -3035 -30975 -87841 -65481
14821 -65481 -129206 -213724 -202899 -82292 -53451 -3405 45834 40867 -22142 -83785 -133520 -161151
14809 -161151 -139027 -68352 -40520 -70392 -84838 -60919 -47597 -80725 14461 102523 7601
14798 7601 19713 -15432 -95455 -125160 -87429 -96146 -68902 -104134 -98436 -70569 -88923 -83287
14786 -83287 -49515 -20738 -58039 -190703 -272344 -234889 -74065 -132508 -90558 10549 78386
14775 78386 82584 59211 33078 76694 13454 -25721 -77530 -44662 55884 93266 32224 -1211
14763 -1211 9532 95873 69671 -10175 11066 -5578 -72631 -44940 38094 121264 130386 148636
14751 148636 92547 79423 15138 46748 11302 -38909 -69803 -23111 -85146 -23796 18545
14740 18545 45748 112332 155844 91689 -101611 -147610 -168230 -166872 -83945 -6573 -26896 -36346
14728 -36346 -59443 -15960 38395 27498 -61162 -95229 -77708 -53860 -5481 30630 -7114 -90238
14716 -90238 -80236 -119 93475 102068 -23503 2783 45053 78570 35382 16842 -67460 -164209
14704 -164209 -238056 -293822 -370696 -301493 -171557 -100944 -130332 -109256 -100562 -151268 -138628
14693 -138628 -65784 24399 34178 -156 28075 -51857 -87549 -71771 -38328 -69286 -110832 -122875
14681 -122875 -154224 -130528 -140041 -215098 -261765 -191059 -141491 -75338 -825 41925 -13413 -73576
14669 -73576 18866 54751 24083 -51717 -32126 33149 -35928 -101701 -60541 -108937 -116016 -131242
14657 -131242 -69280 -49567 -110021 -102494 -16250 -28798 -75292 -123703 -115345 -59795 57300 48658
14645 48658 -11396 -31205 -15487 -108224 -74605 -101102 -160811 -194753 -152685 -175977 -176757 -151566
14633 -151566 -95691 -33698 -59608 -40700 7938 3128 -116088 -180197 -148749 -108723 -160923
14622 -160923 -145469 -94884 -126253 -139182 -63394 -94556 -82390 -17593 40756 37651 861 -48621
14610 -48621 -73378 -68454 14463 -53258 24024 174659 143941 33912 -48484 -298 8436 -18222
14598 -18222 66880 53576 -8826 -46912 -58544 -105402 -68360 79812 135341 -21550 -33953
14587 -33953 9864 -43853 3697 103216 50898 49395 55036 -5141 -103848 -133181 -120638 -82190
14575 -82190 -133172 -137823 -75551 18691 106739 168683 70138 -44235 -32453 4511 57153 117377
14563 117377 122265 118232 56057 46068 -14851 -77447 -69260 -4157 -32177 -148774 -117367 -24495
14551 -24495 -91478 -76147 -141496 -153542 -52291 -18867 -61474 -141828 -182287 -191985 -163231 -93646
14539 -93646 -99773 -14253 -22587 -23150 119369 82170 34274 -71313 -75692 -25136 4632 39620
14527 39620 14318 21757 55083 -85 -107721 -169186 -164445 -130053 -67586 -79156 -140583 -150562
14515 -150562 -62733 -23838 -33797 -122712 -227936 -154154 -73012 -15573 94039 156997 99898
14504 99898 126241 12088 -98566 -25426 23738 39105 -18535 -146450 -241614 -176893 22366
14493 22366 86875 -47728 -49717 -75853 -52437 -55082 26698 68679 -61332 -63502 -32810 -42206
14481 -42206 52292 143053 160003 171303 94668 90754 100072 -4943 14846 4875 14378 -46088
14469 -46088 -72601 31898 27530 8532 68020 116458 84114 24828 -7738 -81451 -90283 -142808
14457 -142808 -167431 -113426 -76597 -131898 -91715 29621 -1955 -10432 -62872 -61154 -38337 -76247
14445 -76247 -178138 -223255 -274306 -219306 -146757 -66142 19478 84054 89932 77164 118073 88071
14433 88071 61698 -35757 -20681 -95877 -161920 -105104 -25750 -14814 -159749 -178621 -125088
14422 -125088 -80499 -73650 -53388 -40604 53493 116915 70733 81110 152154 87325 46103 30882
14410 30882 14383 -7222 -55518 -96597 -34916 -98316 -35083 51182 97315 77894 59020 70230
14398 70230 53092 -34873 -7487 -21662 1414 33094 -1865 -48808 -62521 -68244 -46688 37124
14386 37124 -12775 -102635 -155995 -165224 -156759 -176636 -184458 -171775 -246151 -233764 -161013 -110896
14374 -110896 -90953 -15721 -2473 -5612 -10608 -56 58693 79062 48309 55214 147156 103698
14362 103698 35360 -6344 50174 86847 38332 -19010 -45155 -30143 65121 83378 60465
14351 60465 90943 30790 37962 20558 56483 192560 266218 162770 48369 44024 130931
14340 130931 4280 -96089 -171962 -84354 -59257 -103217 -87199 -40502 3192 106230 117615
14329 117615 108482 80472 -41406 41717 127568 112439 70410 51933 -13971 -3418 69670
14318 69670 37136 12258 24678 -104884 -124883 -72208 -39309 -87616 -89999 -109170 -25894 -13020
14306 -13020 -30426 -89544 -126189 -91170 -74968 -98554 -137641 13014 61715 -10265 -44610
14295 -44610 -36848 -28814 -28869 -15300 6497 43214 89112 -21222 -155439 -217297 -154842 -87808
14283 -87808 -121451 -95242 -40290 -29635 30933 -25819 -1750 25801 -85177 -64323 -6467
14272 -6467 -28804 -81275 -177157 -209556 -197248 -49871 -11090 -50949 -4409 -11572 -29347 -106612
14260 -106612 -218407 -203406 -144933 -171923 -188818 -101776 4023 38803 31511 -26421 -5715
14249 -5715 -54600 -65907 93726 129303 67190 -30271 -84484 -72699 -52696 -56228 -62997 -12416
14237 -12416 -20623 -39333 -8163 19412 1983 42578 58938 122002 84405 35423 27039 132239
14225 132239 187319 169982 91173 -56460 -77562 -74493 -62011 -20894 -49289 -131219 -163440
14214 -163440 -50194 13824 -23725 -96555 -40983 36634 23639 -3688 -4310 57532 147108 27786
14202 27786 -69333 -23485 -10964 12927 -12199 -28673 -6042 -52380 4556 1008 -3010 -10328
14190 -10328 -110107 -167479 -202019 -257673 -263324 -250162 -186820 -112295 -28007 -38671 -64976 3327
14178 3327 22777 -2573 -50689 -42513 -55618 -159987 -97159 -38444 -52070 -66914 -46350 34583
14166 34583 7190 -1945 -11308 70049 125445 25070 -1432 35563 -26357 -43672 -25082 -34504
14154 -34504 -103066 -37004 -56532 -56914 59886 -6492 -17475 6643 105690 174430 169054 177209
14142 177209 144239 127126 7059 -90650 -72642 12642 71279 -10280 -49776 -34893 -55951
14131 -55951 -46854 18081 21304 28536 41397 51015 92652 78020 44985 -68120 -96799 -59737
14119 -59737 -67426 -158432 -145317 -127016 -111093 -106011 -72254 -9165 -41629 -16551 15595 -75917
14107 -75917 -156478 -129722 -150389 -115900 -91817 -59556 -84443 -120684 -77032 -17467 34735 20589
14095 20589 -9172 -23389 -117717 -154357 -146796 -107538 -34967 51643 74334 -72785 -33750 -45450
14083 -45450 -77763 -55121 -20427 -19158 -51438 19677 84591 101885 28186 -6555 34978 38714
14071 38714 -50112 -104268 -118034 -123500 -45114 -34675 -20575 65284 132815 92793 -46106 -174592
14059 -174592 -146901 -91553 -110524 -139382 -110600 38112 109606 147104 88303 51062 18822
14048 18822 -75747 -96316 -47842 69227 66029 87101 81408 54416 39876 84264 112714 25110
14036 25110 36407 -36482 -22944 26786 -79126 -65292 28169 98929 112827 88254 29628
14025 29628 -105918 -102939 -90727 -152139 -172372 -129605 -45866 10262 -6240 52578 130535 67875
14013 67875 16478 45718 -52671 -7884 73405 147038 157856 145941 208646 64842 -12660
14002 -12660 -35206 -92787 -135923 -128640 -33586 -91563 -98515 -51669 -90038 -212689 -195928 -199124
13990 -199124 -129183 -153315 -81573 15496 5979 46887 142254 147833 132952 65454 82007 131563
13978 131563 85365 58293 113680 83123 -2246 8371 -78959 -236624 -276905 -254593 -210965
13967 -210965 -138203 -53471 -44175 -81915 -57661 -72160 -161264 -118877 -2982 41184 -6858
13956 -6858 -20117 -45410 -81611 31978 93621 95420 -7123 -48221 -85800 -84050 -138656 -134104
13944 -134104 -94454 -100144 -154970 -101560 -111750 -72614 -39803 -86743 -125198 -77300 -53760 -114947
13932 -114947 -174531 -196355 -108452 -54151 -72522 -59344 -39918 21325 94564 90497 -31593
13921 -31593 -58772 10840 51701 53470 -46208 -120508 -181194 -185609 -115047 -150416 -129055 -67096
13909 -67096 -23424 -1017 18990 22856 -9447 -24686 -29814 -31101 -137265 -110993 -59741 -7678
13897 -7678 81770 72918 -20727 -49457 -106528 -18087 25578 33297 -16760 -10387 19706 -13946
13885 -13946 41711 32075 49923 39311 53856 -19175 -61634 -40435 -56875 -51685 12133 60515
13873 60515 2639 9017 2141 -26271 -82146 -65951 -2974 -47724 -43405 7115 3435 46735
13861 46735 90285 62865 24458 -78352 3350 -10854 -79302 -142965 -196946 -113229 -102169
13850 -102169 -119589 -161076 -188907 -149988 -112462 -87192 -149819 -204636 -246447 -204138 -67431
13839 -67431 18264 -31614 -2766 121230 45696 -89668 -66222 -77250 3660 -10415 -41793
13828 -41793 -66558 -76583 6059 -23882 -57718 -19299 -150697 -76188 35411 52036 118001
13817 118001 88324 17023 -28072 63710 60924 -58383 -106287 -86140 -56668 -45217 -54234 7885
13805 7885 6481 24955 -1600 -51347 -85388 -202851 -96892 63842 40610 -4206 -80684
13794 -80684 -88863 -22568 33380 72879 105028 46451 97566 60849 -32637 25898 64928 11669
13782 11669 -34356 -59172 -116032 -113838 -115579 -85260 -115315 -192825 -94244 -32183 7462 72976
13770 72976 36223 78014 -10661 -26052 -36769 -4762 48681 103384 112297 72778 65117 82725
13758 82725 93482 38178 6410 -47933 -45998 -76793 -124765 -90987 -113874 -134024 -70326 -50577
13746 -50577 -32789 -89791 -83725 -157053 -102565 -32808 -43430 -168768 -155877 -66650 -96389 -81611
13734 -81611 63821 65760 -19359 8382 -22676 -84001 -42558 8700 26307 19941 5446 43417
13722 43417 -4654 -129651 -142328 -24135 4117 24031 105621 98036 29140 -38102 -109925
13711 -109925 -24839 73836 -42661 -69417 -14886 99804 65312 33115 17630 -46619 -80202
13700 -80202 -49094 -14417 -45503 -38781 -159968 -144076 -69681 -93940 -130482 -101372 -96807 -26738
13688 -26738 9171 113944 139748 139049 184842 228408 215861 194837 303706 261315 149867
13677 149867 103403 99409 34628 22332 80588 114670 109592 -338 -43715 -59583 -85129 -62376
13665 -62376 -53043 -71165 -47746 73778 96986 12033 56221 193041 324821 370462 262227
13654 262227 155880 114633 39788 -4038 -3579 16136 93344 65140 33779 70337 80648 52383
13642 52383 23333 -22900 -126896 -48209 -8885 15578 47180 137657 92756 59524 146934
13631 146934 183412 217758 208933 242745 352645 433437 408707 246403 183726 200850 179496
13620 179496 120115 48906 -49110 -78957 119937 168654 81105 19384 46139 18644 38133
13609 38133 85733 177221 140494 85861 25073 -13668 -54854 -79814 -110099 -100053 -38132 34488
13597 34488 33481 10389 -159058 -248261 -153586 -85005 -16435 65858 64718 103914 109609 55146
13585 55146 65146 54350 19483 -1931 -32098 2920 27762 66090 35730 92016 49947 -67588
13573 -67588 -36954 -90955 -60569 -36697 -3534 28768 11379 -7963 -98905 -51669 -62669 -34745
13561 -34745 68039 88170 58505 32859 -12633 -37810 13324 -6333 -68930 -107785 -93018
13550 -93018 -130044 -85512 -36933 101426 170019 55501 38554 78140 102554 41781 39260
13539 39260 60053 86327 2938 42285 73104 24140 42887 87920 50163 -40529 -28059 11476
13527 11476 -49670 -98072 -88253 -148361 -129692 -147839 -180849 -186749 -179462 -136631 -109324 -121867
13515 -121867 -143577 -63119 -57454 -25428 -3657 -108426 -168058 -107200 -56795 33581 147065
13504 147065 56171 -78465 -128610 -107210 -48566 -2958 66463 121577 89678 20367 35073
13493 35073 -3367 44190 72195 137283 172102 82677 51289 -7594 8161 58160 97630 66002
13481 66002 180975 205287 166954 157428 103128 99528 29457 -16044 3588 -83079 -137665 -199348
13469 -199348 -193017 -110311 -27744 46839 7084 -56884 -56030 66023 152855 113913 85659 67247
13457 67247 17682 40925 113279 128114 56376 14696 -36405 -23884 -83197 -111249 -211732
13446 -211732 -170818 -116429 -40449 -20485 -21961 -1958 121941 166436 47632 -65092 -64946
13435 -64946 5504 55298 32002 -8658 -60992 -105687 -43893 -94338 -98094 -39621 -6260 -29075
13423 -29075 -79815 -52338 76028 82709 55237 25241 27339 -18958 -15456 9156 23948 49722
13411 49722 115987 122372 158760 149670 103215 630 -2394 60093 90085 77555 128211 182763
13399 182763 151273 7661 -34095 -3312 -73718 -15803 21332 49265 5328 -81663 -143201
13388 -143201 -130661 -133477 -140343 -171852 -154385 -80211 -33074 67593 -3707 -35069 -11804 -45832
13376 -45832 -2969 -28209 -76131 -31654 -606 -37720 -45178 -93124 -90625 27303 67668 -45494
13364 -45494 7123 80977 132545 204673 167949 76663 79737 -21118 -21004 44051 82921 1338
13352 1338 21328 -35689 -45295 23206 73387 16826 28055 -6198 -82626 -56075 -38165 -71739
13340 -71739 -145697 -87340 -79962 -83860 19933 33558 -4638 -103 35460 14783 -56402 -58288
13328 -58288 -115941 -133912 -70594 -37228 3582 -252 -21756 -25977 -15722 63259 29873 43527
13316 43527 31681 -11555 -59729 -115545 -95456 -89759 -38828 -20188 -64493 -39855 39221 89818
13304 89818 83762 66164 122225 109912 44699 59204 -52820 -129939 -104921 26915 -6509
13293 -6509 -126104 -84227 -12599 77633 162791 87730 7469 27733 -24084 -18199 39067 -44283
13281 -44283 -99014 -23623 130409 135642 167788 158475 40069 -33212 -76687 -88509 -43460 -51543
13269 -51543 -16183 54784 91390 96108 140245 64148 34013 53687 98895 77757 57713 8677
13257 8677 10192 7441 61656 80393 9292 -45999 -78837 -95291 -91615 -83597 -7934 -8622 26895
13244 26895 109126 5434 -121356 -28417 34916 35332 -3958 -54413 -125814 -98193 -158196 -173036
13232 -173036 -136113 -161625 -142912 -93512 -103483 17941 21685 -21238 -48162 -31920 -26039 -42917
13220 -42917 84148 112991 -21025 -103183 -49323 82118 123068 107583 103932 84374 -12551
13209 -12551 46769 52343 -22911 -42357 -20683 62324 91330 36604 5313 -4206 -76921 -155609
13197 -155609 -86212 -38068 20335 54317 -4604 -138986 -111642 -39394 -46991 26494 -35595
13186 -35595 -76005 -144848 -51584 54024 -18854 -22579 -36351 -41536 57219 29524 -23640 -66656
13174 -66656 -119094 -149021 -187178 -195985 -104522 -107176 -147548 -177231 -106440 -145788 -61574 20806
13162 20806 48448 61878 80675 7849 3340 -86905 -41213 138025 201787 180170 143132 79989
13150 79989 3756 -19587 45113 109525 104808 120205 118736 152648 168325 106956 92993 10115
13138 10115 -96131 -20134 -60208 -39976 8443 -113418 -152825 -59056 -22125 -65382 -152027
13127 -152027 -58912 -19344 46449 51750 44065 -67381 -163550 -162452 -149503 -106723 32258 102156
13115 102156 24638 -60039 -21768 -78237 -68369 -66345 -100782 -129819 -111301 -73647 27410 33996
13103 33996 -25811 -67332 -62334 -67720 -55232 8701 88982 42248 18022 -123472 -132222 -116110
13091 -116110 -231168 -157896 -46573 -43606 -21278 58963 31404 -139553 -153716 -84401 -81649
13080 -81649 -2744 -17666 -99104 -143555 -104730 -78669 53177 121135 32749 -13609 -77576
13069 -77576 -65160 -27085 6659 3919 -99471 -72981 -24736 -84210 -133534 -50887 21977 37879
13057 37879 63171 88619 75836 123219 83573 -13747 -46326 84734 120545 87034 49350
13046 49350 -1164 -10454 -111032 -91389 -29961 -41906 -44748 -21431 7861 -66 -5753 -46433
13034 -46433 -70877 -72822 17447 -48775 -136846 -72864 -75436 -108278 -152013 -60072 24960 28165
13022 28165 -20107 11673 6084 42237 44531 40921 60355 36483 -21519 -13130 -33261 -98506
13010 -98506 -48774 -49856 -55702 -18507 -8354 -26892 -18252 -38250 -70822 -69994 -5442 -21996 -27081
12997 -27081 73827 98922 34827 30616 -65077 -128518 3081 59224 63365 24976 -65879 -18621
12985 -18621 32009 -28727 22948 92708 117452 116202 114486 75405 18572 68365 31415 -20635
12973 -20635 -19250 -70314 -156529 -145276 -119843 -181243 -173461 4940 127547 60756 -112452
12962 -112452 -169908 -39829 43412 47680 9604 -76785 -106995 -135282 -77073 34356 -120199
12951 -120199 -218522 -130863 -136323 -114096 -149981 -154103 -137241 21010 176771 117691 -22572
12940 -22572 -26162 -42737 -76825 -53 38312 144456 162054 123366 50430 107557 149058 225565
12928 225565 196345 83753 20222 79712 213092 167734 44013 1049 26252 57165 76482
12917 76482 119377 52895 -867 -35590 -121985 -177265 -177130 -87208 -62400 -405 9713 16416
12905 16416 74269 33759 66246 144947 136614 47479 35063 86497 93913 103292 20355 -21008
12893 -21008 -83803 11421 68176 134451 173677 47363 35106 90079 124203 14393 -30267
12882 -30267 -73778 -7934 53466 -65057 -108088 -73491 -96085 -97321 -9497 13392 -12784 36732
12870 36732 73786 8442 -85877 -101748 -91530 -114487 -76999 -53990 -53145 18771 -13440 -8864
12858 -8864 37302 6527 11222 -21446 21708 74471 64577 67500 34240 12697 681 117554
12846 117554 145375 140052 81427 155453 210451 126600 76103 91156 21143 -39125 -7578 102065
12834 102065 211471 99900 18529 102159 147173 136458 56001 16576 124603 105956 42775
12823 42775 14053 -36264 -64297 -55100 97281 194692 108804 86862 52384 44521 -11658 -114237
12811 -114237 -109467 -92340 -73869 -45532 20280 33829 6257 81941 116304 64847 168567
12800 168567 227576 150653 111500 26088 -16920 -77947 -64171 -83706 -2275 -15561 -39580
12789 -39580 -117609 -124110 -62226 -18658 -11689 -71004 -12037 54665 109027 78221 57239 18190
12777 18190 -7599 -26771 10102 29459 101210 107458 155162 209392 150739 157937 138822 161630
12765 161630 175228 133974 54131 68149 28338 -11971 76078 83281 94055 97614 131614 145134
12753 145134 179379 135997 68714 -39836 -106003 27863 54106 165603 194306 195409 210545
12742 210545 247940 260212 192255 156115 107589 83074 104473 131376 63971 44571 91300
12731 91300 98643 90892 111107 184431 162164 33897 -40082 -120700 -131270 -34537 32137 64597
12719 64597 59461 -8957 31320 45904 105095 181187 160761 188242 166384 104550 104675 99800
12707 99800 83735 86995 85677 113564 211212 210181 126392 128202 165516 200491 162696 153975 197190
12694 197190 218707 269101 263031 154520 133384 125176 81483 70308 96225 154057 117251 89585
12682 89585 112693 150349 201901 177560 143426 147709 142131 145927 76254 15637 65461 36063
12670 36063 36600 59734 -23561 -11651 40515 -65255 52067 212940 242703 229194 130923
12659 130923 95120 151103 163741 162591 141915 107778 177103 211287 166352 184254 134899 5892
12647 5892 -85334 -97203 -10705 48028 93412 84790 63148 21461 14953 89954 131955 105892
12635 105892 98976 79246 19453 70896 65374 114905 111652 100152 37262 -40009 28567 59139
12623 59139 109008 156731 129108 158007 92032 -28898 29374 125716 112749 112417 221203 202786
12611 202786 103667 32996 -50508 -85785 -10423 105457 143804 72080 81109 149557 118113
12600 118113 117486 180035 150086 88781 25495 58627 86600 90688 -2702 4996 -16671 29329
12588 29329 44504 60251 114557 155382 103674 15123 19539 86861 58204 139816 153812 141577
12576 141577 120584 57069 20389 24495 55976 128277 97261 86576 122496 159262 23044
12565 23044 17487 68108 158915 207603 198502 298164 281646 260406 205776 109251 14736 27208
12553 27208 170435 285237 237135 109304 31176 101793 69410 36669 7631 40987 71109
12542 71109 77129 104237 151569 173969 174187 194378 190188 222174 267674 167383 53272 133545
12530 133545 180168 109729 94168 123465 133109 116403 165697 186475 310025 343405 368227
12519 368227 315822 287838 310308 283169 199430 220431 231320 237086 244791 193725 227670 261817
12507 261817 248440 211405 221426 274724 310977 348202 273833 228337 263814 232449 253098
12496 253098 329680 401877 343035 350402 372565 440773 382157 273905 251745 235328 215645
12485 215645 343132 316769 320116 307869 321781 275386 306993 307114 343047 362429 338757 292702
12473 292702 182228 229530 312564 305739 318884 273493 263845 308251 214367 272158 347552 263034
12461 263034 209470 234513 277883 385766 411384 349005 303322 268440 295641 197125 156869
12450 156869 206045 220918 285011 253129 351304 470445 509002 378607 306419 265241 331477
12439 331477 430453 441836 423302 412910 371274 300745 320823 337301 283318 230144 271061
12428 271061 220465 188791 296093 320487 262063 243242 393732 373955 384845 397386 319862
12417 319862 250693 171400 218748 388199 354370 359556 343044 389039 504721 491062 460422
12406 460422 477864 445912 453061 367208 354959 368522 393402 383259 429590 452901 437860 352935
12394 352935 400279 514796 552668 538002 552143 487234 492406 629243 592214 641683 717416
12383 717416 700579 642282 569680 501676 468771 591534 632883 633578 631094 557672 489518 510602
12371 510602 506187 455248 356285 356153 349320 325031 443314 509194 580941 564386 562560 672285
12359 672285 750010 756923 700996 643302 654613 620235 574899 630009 661692 738028 728211 747508
12347 747508 722034 754046 804558 839715 803102 750260 585378 500565 573960 647172 622880
12336 622880 629933 667183 745008 682960 709994 657167 571463 613337 611965 656544 663939 652215
12324 652215 677374 649866 685344 696044 738538 731918 718763 707751 737692 753456 830259 822217
12312 822217 783695 832767 896336 868471 769733 694622 685880 641153 653756 748143 762302 799125
12300 799125 873741 876109 882147 917942 946074 872859 904649 943501 911814 859541 906463 895842
12288 895842 907553 845698 840372 830418 935372 896751 906272 904379 962443 1028015 1094887 1112883
12276 1112883 1014170 1042592 1107906 1064635 1046670 1065488 1123231 1071057 1009298 1062769 1014711
12265 1014711 1000295 940803 926970 943598 928143 940501 951672 922674 1033839 1020654 1112347
12254 1112347 1137527 1155382 1223447 1293780 1235130 1258166 1306909 1268491 1298738 1344678 1284311
12243 1284311 1217611 1209850 1205501 1131137 1141612 1229150 1264033 1257482 1198761 1261884 1383350 1425665
12231 1425665 1370827 1346246 1427147 1512142 1543855 1570061 1563633 1437015 1339972 1422892 1582289
12220 1582289 1701667 1649352 1574836 1680390 1703825 1625243 1635613 1703452 1692746 1643641 1557606
12209 1557606 1575285 1731557 1839989 1872216 1791447 1759207 1779014 1785694 1866600 1972474 2032681
12198 2032681 2053054 1998395 1954350 1975490 1962453 1998991 2075441 2120132 2159372 2185521 2178559
12187 2178559 2168807 2197419 2214273 2166087 2288211 2391774 2410382 2406614 2463315 2495968 2543941
12176 2543941 2500810 2444604 2508530 2601101 2631625 2619144 2639820 2678379 2634641 2585677 2630294
12165 2630294 2724316 2827298 2925330 2855840 2791014 2890728 3002538 3015789 3081922 3174909 3163808
12154 3163808 3231915 3278963 3285214 3298545 3269392 3352075 3434033 3457536 3507980 3641834 3702695
12143 3702695 3697603 3684664 3691823 3837474 3955736 3992360 3972326 4041587 4082966 4147908 4204036
12132 4204036 4279565 4390188 4424216 4459841 4514750 4581615 4763267 4841927 4845061 4901801 5000467
12121 5000467 5028745 5151691 5341296 5495334 5471177 5400606 5449723 5578812 5737783 5750682
12111 5750682 5771703 5871401 6019119 6190247 6264910 6302984 6414178 6598380 6757563 6836476
12101 6836476 6871388 6963549 7036196 7192448 7318586 7508806 7547250 7621021 7747072 7882822
12091 7882822 8085292 8311834 8460774 8665753 8847771 8874240 9121787 9441778 9668123 9807941
12081 9807941 9994877 10193644 10345744 10548568 10855676 11215048 11537402 11787467 12062546
12072 12062546 12341450 12533249 12644324 12787100 13054855 13330809 13602812 13889027 14169706
12063 14169706 14398553 14721790 15159600 15561863 16013186 16332257 16534974 16761586 17084009
12054 17084009 17441475 17860218 18287143 18821010 19367891 19815270 20306201 20748889 21127214
12045 21127214 21541619 22069574 22605329 23148321 23687233 24235006 24821318 25433542 26027877
12036 26027877 26625342 27227407 27950151 28664041 29402438 30154372 30908941 31668189 32438861
12027 32438861 33130915 33741015 34288842 34880605 35468118 36064688 36753968 37320307 37933901
12018 37933901 38516144 39114648 39799497 40294619 40813084 41360370 41819616 42155646 42568797
12009 42568797 42957810 43274973 43579622 43768597 44008689 44083348 44137576 44173147 44052350 44001218
11999 44001218 43911725 43687122 43460683 43158031 42803251 42495060 42243142 41878635 41421877
11990 41421877 40847984 40334690 39811505 39145408 38479399 37889873 37349297 36768410 36135258
11981 36135258 35537398 34880976 34243742 33614938 32914445 32212463 31547654 30973331 30279538
11972 30279538 29574888 28891967 28245759 27568174 27038340 26581650 26090567 25531389 24975785
11963 24975785 24490152 23999952 23430471 22890674 22317740 21743556 21271627 20812778 20493162
11954 20493162 20116734 19646945 19195312 18809392 18391664 17987155 17680212 17279766 16885414
11945 16885414 16584096 16207002 15759031 15363215 15010337 14626366 14397400 14082493 13772156
11936 13772156 13572366 13312155 13125080 12860185 12531746 12345659 12183147 11911276 11602064
11927 11602064 11394458 11123330 10897238 10782224 10626275 10408476 10110865 9915565 9830478
11918 9830478 9709105 9540162 9391135 9154712 8992613 8855693 8638508 8427567 8261799
11909 8261799 8124337 7952385 7888363 7773706 7510573 7281212 7040862 6942682 6943697 6882863
11899 6882863 6714844 6593783 6594093 6485239 6453609 6494823 6367814 6250876 6076797 5954108
11889 5954108 5877870 5873222 5818344 5658232 5593075 5572879 5445328 5307637 5195596 5164780 5178875
11878 5178875 5194513 5131757 5014880 4827755 4674418 4562714 4551656 4595319 4533623 4440856
11868 4440856 4403799 4325165 4259845 4259266 4218731 4147092 4128022 4064168 4030681 4014100 3931090 3806685
11856 3806685 3702316 3671286 3612588 3562711 3570735 3528649 3417346 3354232 3364280 3430190 3468095
11845 3468095 3448724 3344149 3247211 3159749 3176517 3186166 3192841 3231994 3141024 2951082 2880720
11834 2880720 2880140 2906795 2948357 3012012 2966671 2877114 2853574 2783494 2700400 2569554 2562079 2512003
11822 2512003 2470720 2445814 2414732 2454356 2482216 2433778 2506800 2424473 2428512 2425479 2441824 2436399
11810 2436399 2359029 2334360 2253876 2291414 2306872 2359539 2294801 2162925 2101693 2072003 2037014
11799 2037014 2010221 1957764 2016466 2034863 2033787 1973877 2011371 1978714 1908212 2032211 2030906
11788 2030906 1959776 1897972 1861122 1760374 1728971 1711291 1694549 1662529 1666196 1703902 1706197
11777 1706197 1776594 1823918 1741664 1737012 1734608 1710626 1749881 1692032 1593540 1549645 1492396 1486411
11765 1486411 1494391 1455769 1413814 1351584 1325722 1324322 1320564 1331718 1355412 1366406 1384297 1287490
11753 1287490 1322137 1381903 1387319 1329131 1362903 1385975 1309134 1300950 1302766 1337876 1399786 1375319
11741 1375319 1391328 1388775 1353636 1367770 1377172 1365373 1293927 1291857 1315313 1319936 1416361 1418239
11729 1418239 1349537 1215867 1238910 1275403 1214038 1115488 1160489 1190265 1181222 1189776 1177251
11718 1177251 1179301 1143965 1142125 1183520 1225631 1154021 1034322 1017115 1085798 1141627 1146554 1160275
11706 1160275 1070104 1009118 1000219 934101 904986 872613 860311 887119 933591 985104 1032338
11695 1032338 1135116 1076688 1021369 1026504 959438 905915 839957 750521 770382 739516 752152
11684 752152 794572 799920 732010 827547 962246 944728 854664 781677 736079 745657 800054 838344
11672 838344 892864 913785 927936 765541 703422 654554 621567 585523 589342 700534 761637
11661 761637 768670 754833 712593 618719 616534 695257 752162 720895 691824 726300 679940 710201
11649 710201 809999 805278 840796 867707 878788 881589 857278 824101 741738 655087 758250 858286
11637 858286 769307 766137 743769 763619 729567 745650 728764 731252 821670 810895 771777 828461
11625 828461 920826 1027023 1093169 992681 1050241 1188268 1360445 1556525 1942310 2401062
11615 2401062 2706692 2765358 2500106 2093197 1695394 1320984 1010434 906686 831511 763772
11605 763772 712808 612239 594414 607034 649560 620954 615550 601686 576220 537695 545335 485169
11593 485169 400528 351008 382750 435719 390291 393948 350250 258557 270991 376388 415457
11582 415457 394072 458097 353553 359383 471218 451341 387732 353877 315999 365800 407659
11571 407659 506287 608252 649850 671774 532314 379311 319228 349504 466865 543246 637592
$$ [...]
##END NTUPLES=NMR SPECTRUM
##END=
