##TITLE=Analysis number 316468
Compound Code mo 07770
Book Reference 444/68
Project Code adrs
Chemist Name howarde
##JCAMPDX= 6.0         $$ Bruker NMR JCAMP-DX V2.0
##DATA TYPE= NMR SPECTRUM
##DATA CLASS= NTUPLES
##ORIGIN= Bruker BioSpin GmbH
##OWNER= nmr
$$ XWIN-NMR		Version 3.5
$$ Mon Jan 16 14:58:47 2006 GMT Standard Time (UT+0h)  MAYBRIDGE\nmr@NMR_250MHZ
##.OBSERVE FREQUENCY= 250.131544655141
##.OBSERVE NUCLEUS= ^1H
##.ACQUISITION MODE= SIMULTANEOUS (DQD)
##.ACQUISITION SCHEME= undefined
##.AVERAGES= 16
##.DIGITISER RES= 18
##SPECTROMETER/DATA SYSTEM= dpx250
##.PULSE SEQUENCE= zg30
##.SOLVENT NAME= CDCl3
##.SHIFT REFERENCE= (INTERNAL, CDCl3, 0, 16.522)
##AUDIT TRAIL= $$ (NUMBER, WHEN, WHO, WHERE, WHAT)
$$ ##TITLE= Audit trail, XWIN-NMR		Version 3.5
$$ ##JCAMPDX= 5.01
$$ ##ORIGIN= Bruker BioSpin GmbH
$$ ##OWNER= nmr
$$ C:\u/data/dgb/nmr/ADRS/14800/pdata/1/auditp.txt
$$ ##AUDIT TRAIL=  $$ (NUMBER, WHEN, WHO, WHERE, WHAT)
(   1,<2006-01-16 14:58:12.89 +000>,<MAYBRIDGE\nmr>,<NMR_250MHZ>,
      <created by zg, POWCHK disabled, PULCHK disabled
       configuration hash MD5:
       62 19 C7 07 E1 42 D1 B7 37 6C 3D D0 77 39 F9 E6
       data hash MD5: 64K
       03 76 C4 FF DE 42 D6 72 86 62 DD 73 27 84 18 28>)
(   2,<2006-01-16 14:58:30.48 +000>,<MAYBRIDGE\nmr>,<NMR_250MHZ>,
      <Start of raw data processing
       ef LB = 0.3 FT_mod = 6 PKNL = 1 SI = 32K 
       data hash MD5: 32K
       6D B6 DD FA EF 54 E8 5E 80 77 1C 06 8A C0 03 B9>)
(   3,<2006-01-16 14:58:33.00 +000>,<MAYBRIDGE\nmr>,<NMR_250MHZ>,
      <apk 
       data hash MD5: 32K
       65 89 A2 66 9B 71 DE 27 C2 0D 53 0E 15 3C 12 63>)
(   4,<2006-01-16 14:58:33.70 +000>,<MAYBRIDGE\nmr>,<NMR_250MHZ>,
      <abs ABSG = 5 
       data hash MD5: 32K
       A6 33 35 A7 0F 6E 78 F7 71 ED E6 FE E4 5F 8E 3F>)
$$ ##END=
$$ 
$$ hash MD5
$$ E2 4D CF 8E 58 92 3D 63 2D 27 D4 A5 0E 23 37 55
##$RELAX= 
##$RELAX= 
##$RELAX= 
##$RELAX= 
##$RELAX= 
##$RELAX= 
##$RELAX= 
$$ Bruker specific parameters
$$ --------------------------
##$DU= <C:\u>
##$EXPNO= 14800
##$NAME= <ADRS>
##$PROCNO= 1
##$TYPE= <nmr>
##$USER= <dgb>
##$AMP= (0..31)
100 100 100 100 100 100 100 100 100 100 100 100 100 100 100 100 100 100 
100 100 100 100 100 100 100 100 100 100 100 100 100 100 
##$AQSEQ= 0
##$AQ_mod= 3
##$AUNM= <au_zg>
##$AUTOPOS= <42 >
##$BF1= 250.13
##$BF2= 250.13
##$BF3= 250.13
##$BF4= 250.13
##$BF5= 500.13
##$BF6= 500.13
##$BF7= 500.13
##$BF8= 500.13
##$BYTORDA= 1
##$CFDGTYP= 0
##$CFRGTYP= 5
##$CHEMSTR= <none>
##$CNST= (0..31)
1 1 145 1 1 1 1 1 1 1 1 1 1 1 1 1 1 1 1 1 1 1 1 1 1 1 1 1 1 1 1 1 
##$CPDPRG= <>
##$CPDPRG1= <>
##$CPDPRG2= <>
##$CPDPRG3= <>
##$CPDPRG4= <mlev>
##$CPDPRG5= <mlev>
##$CPDPRG6= <mlev>
##$CPDPRG7= <mlev>
##$CPDPRG8= <mlev>
##$CPDPRGB= <>
##$CPDPRGT= <>
##$D= (0..31)
0 1 0 0 0 0 0 0 0 0.06 0 0 0 0 0 0 0.0002 0 0 0 0 0 0 0 0 0 0 0 0 0 0 
0 
##$DATE= 1137423491
##$DBL= (0..7)
120 120 120 120 120 120 120 120 
##$DBP= (0..7)
150 150 150 150 150 150 150 150 
##$DBP07= 0
##$DBPNAM0= <>
##$DBPNAM1= <>
$$ [...]
##$SUBNAM7= <"">
##$SUBNAM8= <"">
##$SUBNAM9= <"">
##$SW= 20.6930455092707
##$SWIBOX= (0..15)
0 0 3 0 0 0 0 0 0 0 0 0 0 0 0 0 
##$SW_h= 5175.983436853
##$TD= 65536
##$TD0= 1
##$TE= 294.16
##$TE2= 300
##$TE3= 300
##$TEG= 300
##$TL= (0..7)
0 120 120 120 120 120 120 120 
##$TP= (0..7)
150 150 150 150 150 150 150 150 
##$TP07= 0
##$TPNAME0= <>
##$TPNAME1= <>
##$TPNAME2= <>
##$TPNAME3= <>
##$TPNAME4= <>
##$TPNAME5= <>
##$TPNAME6= <>
##$TPNAME7= <>
##$TPOAL= (0..7)
0.5 0.5 0.5 0.5 0.5 0.5 0.5 0.5 
##$TPOFFS= (0..7)
0 0 0 0 0 0 0 0 
##$TUNHIN= 0
##$TUNHOUT= 0
##$TUNXOUT= 0
##$USERA1= <user>
##$USERA2= <user>
##$USERA3= <user>
##$USERA4= <user>
##$USERA5= <user>
##$V9= 5
##$VALIST= <valist>
##$VCLIST= <CCCCCCCCCCCCCCC>
##$VD= 0
##$VDLIST= <DDDDDDDDDDDDDDD>
##$VPLIST= <PPPPPPPPPPPPPPP>
##$VTLIST= <TTTTTTTTTTTTTTT>
##$WBST= 1024
##$WBSW= 4
##$XGAIN= (0..3)
0 0 0 0 
##$XL= 0
##$YL= 0
##$YMAX_a= 401464
##$YMIN_a= -380782
##$ZGOPTNS= <>
##$ZL1= 120
##$ZL2= 120
##$ZL3= 120
##$ZL4= 120
##$ABSF1= 16.522
##$ABSF2= -4.171173
##$ABSG= 5
##$ABSL= 3
##$ALPHA= 0
##$AQORDER= 0
##$ASSFAC= 0
##$ASSFACI= 0
##$ASSFACX= 0
##$ASSWID= 0
##$AUNMP= <proc_1d>
##$AZFE= 0.1
##$AZFW= 0.1
##$BCFW= 0
##$BC_mod= 0
##$BYTORDP= 0
##$COROFFS= 0
##$CY= 12.5
##$DATMOD= 1
##$DC= 0
##$DFILT= <>
##$DTYPP= 0
##$F1P= 14.0000005364418
##$F2P= -0.99999901652339
##$FCOR= 0.5
##$FTSIZE= 32768
##$FT_mod= 6
##$GAMMA= 0
##$GB= 0
##$INTBC= 1
##$INTSCL= 1
##$ISEN= 128
##$LB= 0.3
##$LEV0= 0
##$LPBIN= 0
##$MAXI= 10000
##$MC2= 0
##$MEAN= 0
##$ME_mod= 0
##$MI= 0
##$NCOEF= 0
##$NC_proc= -3
##$NLEV= 6
##$NOISF1= 0
##$NOISF2= 0
##$NSP= 0
##$NTH_PI= 0
##$NZP= 0
##$OFFSET= 16.522
##$PC= 1
##$PHC0= 88.61721
##$PHC1= 6.406919
##$PH_mod= 1
##$PKNL= yes
##$PPARMOD= 0
##$PSCAL= 4
##$PSIGN= 0
##$REVERSE= no
##$SF= 250.13
##$SI= 32768
##$SIGF1= 0
##$SIGF2= 0
##$SINO= 400
##$SIOLD= 32768
##$SREGLST= <1H.CDCl3>
##$SSB= 0
##$STSI= 32768
##$STSR= 0
##$SW_p= 5175.98343685301
##$SYMM= 0
##$S_DEV= 0
##$TDeff= 65536
##$TDoff= 0
##$TI= <Analysis number 999999
Compound Code 99
Book Reference 9
Project Code 9>
##$TILT= no
##$TM1= 0
##$TM2= 0
##$TOPLEV= 0
##$USERP1= <user>
##$USERP2= <user>
##$USERP3= <user>
##$USERP4= <user>
##$USERP5= <user>
##$WDW= 1
##$XDIM= 32768
##$YMAX_p= 337195730
##$YMIN_p= -277888
$$ End of Bruker specific parameters
$$ ---------------------------------
##NTUPLES= NMR SPECTRUM
##VAR_NAME=  FREQUENCY,     SPECTRUM/REAL,   SPECTRUM/IMAG
##SYMBOL=    X,             R,               I
##VAR_TYPE=  INDEPENDENT,   DEPENDENT,       DEPENDENT
##VAR_FORM=  AFFN,          ASDF,            ASDF
##VAR_DIM=   32768,         32768,           32768
##UNITS=     HZ,            ARBITRARY UNITS, ARBITRARY UNITS
##FACTOR=    0.157963299565203, 1,           1
##FIRST=     4132.6476996994, 0,             0
##LAST=      -1043.33573715361, 0,           0
##MIN=       -1043.33573715361, -277888,     0
##MAX=       4132.6476996994, 337195730,     0
$$ Real data points
##PAGE= N=1
##DATA TABLE= (X++(R..R)), XYDATA
$$ [...]
20051f2341J8494P1464L6718l2404n0049k0058M3313O5835N5682K806p9521k8336
20039B1603o4814M839M7035L4017L1189l7908o8318k8882j6108M7783q636n4648
20027i2848P014K1853K5577L0620l2516O602J3456l5050J950K3176j089M3302
20015A2047R5529J8591l0364O211m7223l4007J8935K2889l7166n2360n4418l5478
20003a16814J23851O2325n1871j2446k1474p750J7283J8996M2833l174j1520K52
19991D0491j5115l0054M839L1644O3130M188p7990p9876n2834j3679L7766J02346
19979A4856L2309J2606L1518O1700q4581j38433J6102L1379K0497K4635k3252
19968f64k1888k6512k43K208j8227m107j7700m894J3282n0313L7159M0878K6705
$$ plain form
20051 -62341 -43847 27617 64335 31931 -18118 -38176 5137 70972 126654 129460 49939 21603
20039 21603 -43211 -38372 8663 42680 73869 35961 -32357 -61239 -77347 -29564 -38200 -92848
20027 -92848 -85834 -63981 -38404 -7784 -40300 -33698 -20242 -55292 -53342 -30166 -31255 12047
20015 12047 107576 126167 95803 102014 54791 20784 39719 62608 25442 -26918 -81336 -116814
20003 -116814 7037 69362 17491 5045 -16429 -24179 -6896 12100 54933 51759 40239 40491
19991 40491 25376 -4678 161 31805 94935 99123 21133 -58743 -111577 -125256 -87490 14856
19979 14856 47165 59771 91289 152989 68408 -70025 -53923 -22544 -2047 22588 -664
19968 -664 -22552 -49064 -49307 -47099 -65326 -69433 -87133 -92027 -78745 -129058 -91899 -51021 -24316
19955b4316l5188N953J5289Q623K1849M5194j6796l8377M0337N4352N3985L1154
19943A62059K665J3202J3219m253m9858r5651m941J8236r433j2667n5206L360
19931a9268K3978J4762O415J5257k8516L4935L5336J2189n7140k1056j3588K8625
19919C1929L5312j2606M346j3158k5808M773K1879p707m0466m7154N630J7827
19907b5203J9250k5380P516K5407p630L0438L2893k0296j9289K8378m4330L698
19895E452o7848j2234N2666M4208k7050r896r3013N7253L7385J2039o1783j6207
19883g9028L4231K7244P846p417L5811K3806O870K7843l8229M20M043m3208j2675
19870a2443n1498o100L5589L4805K6600N9830J8814R430o4092r8031m1673l01
$$ plain form
19955 -24316 -59504 -53551 -38262 -29639 -7790 37404 20608 -17769 22568 76920 130905 162059
19943 162059 164724 177926 191145 186892 137034 41383 36442 54678 45245 32578 -22628 -19268
19931 -19268 4710 19472 25887 41144 12628 47563 82899 95088 37948 16892 3304 31929
19919 31929 67241 54635 58981 45823 20015 24788 46667 38960 -1506 -48660 -43030 -25203
19907 -25203 -5953 -31333 -23817 1590 -6040 24398 57291 36995 17706 46084 1754 5452
19895 5452 -62396 -74630 -21964 22244 -4806 -14702 -107715 -50462 -13077 -1038 -62821 -79028
19883 -79028 -44797 -17553 -9707 -17124 18687 42493 49363 77206 38977 39397 43440 232 -12443
19870 -12443 -63941 -70041 -34452 353 26953 86783 105597 115027 50935 -47096 -88769 -89070
19858h9070K3748K1824Q2960r143p0772k9933N6828M423J6437l4703j8548P0914
19846B4965j563P827L2864L7099p7663l2221m12R520M8383j8664p4413m0855L1467
19833e3666J6321P2917O1089l1216r6519m583J2679N4012M2161L6436P59l1586
19821G8804j134M0455m9901m2976M2453K767m0457J6989n8339n8378n1453k3856
19809a45026P219L1464j2987K9310j2455k3824Q1400O5053L32m3973K3948L8782
19797C9243n119o496m0077J8085K4643k7915m9662J2454k1626k9872K9075J6144
19785d1123k2242r562J571J2989J1596J3114L6161J7974k1282J5772j8241o4130
19773f7403j636K0849K6851J3425L2289J9641R406L6705J8685j1157m0455r789
$$ plain form
19858 -89070 -65322 -43498 39462 30319 -40453 -70386 -13558 -9135 7302 -27401 -45949 24965
19846 24965 23402 31229 64093 101192 23529 -8692 -9104 416 48799 30135 -44278 -85133 -53666
19833 -53666 -37345 35572 96661 65445 -31074 -35657 -22978 31034 73195 109631 110390 78804
19821 78804 77670 118125 68224 25248 67701 70468 30011 47000 -11339 -69717 -121170 -145026
19809 -145026 -137807 -106343 -119330 -90020 -102475 -126299 -44899 20154 20486 -23487 461 39243
19797 39243 34124 27628 -12449 5636 30279 2364 -47298 -34844 -56470 -86342 -57267 -41123
19785 -41123 -63365 -72927 -71356 -58367 -46771 -33657 2504 20478 -804 14968 -3273 -67403
19773 -67403 -69039 -48190 -21339 -7914 24375 44016 53422 90127 108812 97655 57200 47411
19761D7411j5721j9859J5539K1696N0394O7010p8425q3104j4752J4535N4193k9844
19749B9073K6042j8860q112j173o391m568k7919K1346k600O2819l885j4680q886
19736D2206n055N4464K9095l2034n6890m2061j2527K3269K6552l2984l4011K2456
19724a7520l8488l5025J6848M641R0590K5136p1576n1053j6347M9682N2507M2065
19712E1460r395l274L2287j3232k4185m222N853k7179o2498l5140l2134K9366
19700i2293O7982K8026R909m267j6263P4241N6164O461n056o0913k6429m9039
19688a1477J4634K321K2532N971k2880L8899M0904l4612j2956k6683n6136o9332
19676a08815N9955L1322L7939L8130K2252l0084R778k1989r9512l2765P4459K7972
$$ plain form
19761 47411 31690 11831 27370 49066 99460 166470 88045 4941 -9811 4724 58917 29073
19749 29073 55115 36255 28143 26970 20579 16011 -11908 9438 6838 69657 65772 51092 42206
19736 42206 37151 91615 120710 88676 31786 -10275 -22802 467 27019 -5965 -39976 -17520
19724 -17520 -56008 -91033 -74185 -69544 21046 46182 -25394 -76447 -92794 -43112 9395 51460
19712 51460 42065 38791 71078 57846 33661 29439 35292 8113 -54385 -89525 -121659 -92293
19700 -92293 -24311 3715 13624 9357 -6906 67335 123499 129960 124904 63991 37562 -11477
19688 -11477 3157 5478 28010 33981 11101 50000 90904 56292 43336 16653 -39483 -108815
19676 -108815 -48860 -17538 20401 58531 80783 50699 60477 38488 -61024 -93789 -19330 8642
19664H642K456K3761L4534j2484k4918n7483j3656q829p764L8258J2356K7298
19652B2171J5730O1548R821j3170l6618k5089N3326l6022r447j5149K3700K268
19640E3069l8841j6422k9353N5052M6856J7743j5893r391l7372k6350M6675m0697
19628E076l7772L020M3257m2598o1554L0542L2175J8467j7603n5783P1004Q2838
19616G1069j6850m5761O350L441l731O566J4015L217M0918Q0617k6005n9896o8152
19603E798n8511l3981J02344l4518n8620J0822N6437n606M500J5726M0473J631
19591D6495J2624L3882J7964q940n1173o017K3987l528r2917q1102O6160N4488
19579A1923J363k4888K613M4683M4723J637m4960m053J7457j8220r7149l661R6910
$$ plain form
19664 8642 11098 34859 69393 56909 31991 -25492 -39148 -47977 -55741 -17483 -5127 22171
19652 22171 37901 99449 109270 96100 59482 34393 87719 51697 42250 27101 50801 53069
19640 53069 14228 -2194 -31547 23505 70361 88104 72211 62820 25448 -902 45773 5076
19628 5076 -32696 -29676 13581 -29017 -90571 -60029 -27854 -9387 -26990 -82773 -11769 71069
19616 71069 54219 8458 14808 18249 14518 21084 35099 38316 79234 159851 133846 73950 5798
19603 5798 -52713 -86694 15650 -18868 -77488 -66666 -10229 -15835 -11335 4391 44864 46495
19591 46495 59119 93001 110965 102025 50852 44835 68822 65294 -27623 -108725 -42565 11923
19579 11923 13286 -11602 -8989 35694 80417 82054 37094 33041 50498 32278 -64871 -68532 28378
19566B8378k8473j2563q993M619j1017L1811k4572k1441M0929k5978p2101k8358
19554a27759n80m305k884L0460M6754M2351J1120J8141m284j8475R626K5975k0327
19541E813K5755l4396o9156J3639Q4353m3855m8221k0625K4510R6065J9220M912
19529E8014Q976K0003l4719r9669k789K3165Q060n885N2937j87l5322N58N507
19516a351N0100k3118j9774k0126p0629J5241N2206M1360J9031K0942N899L2685
19504A02466L809j7094k8824l9130k1395o094L1915J3735j4114j3766K9827p463
19492C3872m911K6230M2726j2151j01085j717O3576M2753J0965r580l6094M635
19480E9219K7460n2706j2336L6737J5773l4560l1243J1538k841k2773k5862K1906
$$ plain form
19566 28378 -95 -12658 -21651 -17032 -28049 3762 -20810 -42251 -1322 -27300 -99401 -127759
19554 -127759 -128339 -132644 -135528 -105068 -58314 -15963 -4843 13298 9014 -9461 165 26140 5813
19541 5813 31568 -2828 -71984 -58345 26008 -17847 -66068 -86693 -62183 33882 53102 58014
19529 58014 66990 86993 52274 -47395 -50184 -27019 -18959 -24844 28093 27906 -7416 -6858 -1351
19516 -1351 48749 25631 5857 -14269 -84898 -69657 -17451 23909 42940 63882 69781 102466
19504 102466 106275 89181 60357 21227 -168 -6262 25653 39388 25274 11508 41335 33872
19492 33872 28961 55191 97917 85766 -15319 -17036 46540 89293 100258 90678 54584 59219
19480 59219 86679 33973 21637 58374 74147 39587 8344 19882 17041 -5732 -31594 -9688
19468i688J7922J1129j4541N5187O8566n8828r5106k4985K2648O499K5865L6739
19456D1407m3037m2753J5079j6632K8975j4001j4510Q20l2424j0519j3006O7347
19444c3254N7920J08742j1919j03201k2989M3977O603L564r315L1217K3958n1809
19432D3494O069K2309m9163j9101M3572K9189J940m4514l082n5162p949L6295
19420C897J8494O008R588J1486L0706q937k2467p8978J714L6290j826k057K6458
19407C0376k0596m185n2750k2615o821J7904J0058K7002k1808r745Q2522K9306
19395E8648o0166l9635L0008L4389K2272J9448L7030K9997j2990p3049o14p655
19383C7683K3314L0234j401j576n52j7478J5893M4449K8866p2096l5453m5702
$$ plain form
19468 -9688 8234 19363 4822 60009 128575 69747 -25359 -50344 -27696 -21197 4668 41407
19456 41407 -1630 -44383 -29304 -45936 -16961 -30962 -45472 -44652 -77076 -87595 -100601 -33254
19444 -33254 24666 133408 121489 18288 -4701 39276 45879 49443 40128 71345 95303 43494
19432 43494 49563 71872 22709 3608 47180 76369 78309 33795 30713 -24449 -32398 3897
19420 3897 22391 28399 37987 49473 80179 71242 48775 -30203 -28489 7801 5975 3918 30376
19407 30376 9780 5595 -47155 -69770 -76591 -58687 -48629 -21627 -43435 -53180 29342 58648
19395 58648 -1518 -41153 -11145 23244 45516 64964 101994 131991 119001 45952 45338 37683
19383 37683 60997 91231 89830 88254 87702 70224 86117 130566 159432 87336 51883 6181
19371F181k7371L9154J8023q2854m3189j6718r288M8299K6328N0427K1342m7163
19359a6829m639N2059k6599j8156J8130m9104J5004L4197K0001K6907k97J179
19347E1853k4265k42J9177K9899j5076q462L0057k8941p0313Q875L553k376m3223
19334d9484l5318J5001O3134L1835M25q8015l222M0376j0784K1790k4817l3828
19322g2907L1126P1131q3l5661n5051q11M6882j8242R427J9116l0819j0601Q6171
19309C9678R3697k017j4978j3863K4144n0688q5473J5364J5672k5249l104N2814
19297D5997l5692l5528P2464K6728k7478N1042K263j0304j1177N962k3302n3333
19285G642n5586k6201K9577j5830j2998N3424L0079n897k1770l922M0520J381
$$ plain form
19371 6181 -21190 17964 35987 -46867 -90056 -106774 -116062 -67763 -41435 8992 30334 -16829
19359 -16829 -21468 30591 3992 -14164 3966 -45138 -30134 4063 24064 50971 50674 51853
19347 51853 27588 27346 46523 76422 61346 52884 82941 54000 -16313 -7438 -3885 -6261 -49484
19334 -49484 -84802 -69801 -6667 25168 25593 -62422 -65644 -25268 -36052 -14262 -39079 -72907
19322 -72907 -41781 29350 29267 -6394 -61445 -62256 -15374 -33616 -24189 -5073 -35892 -46493 39678
19309 39678 133375 131358 116380 102517 126661 75973 -9500 5864 21536 -3713 -6817 45997
19297 45997 10305 -25223 47241 73969 46491 97533 99796 89492 78315 84277 60975 7642
19285 7642 -47944 -74145 -44568 -60398 -73396 -19972 10107 4210 -17560 -21482 19038 20419
19273B0419l9905l3188N2332M8134R875K0379m9137n7007r377m053N2531m355
19261F648J279L0794L9901P5209k1288m2147n2952m0839L8670L2674j5952l574
19249D8423l0855j4515l8026K1263N9599l3979l2175J2040J115K1836N9748J2996
19237H7470o9168l9090J5381P943n0226M3820N6774O9539j6529n7197l0080O8452
19225H7089m2890l2045j8210j7318R124k79K2681K6330p628N1123q583o0258M4458
19212E3594K8542l9998J9368M5709k1744n1014l842j2277L4290l8354n0184k6982
19200f2892N6713J7741m4409l0378j3354O6320M3772P187J7513j7241J8119q229
19188E0862k9249L1473k9573l1751K9249N0385N6259n6766n1802J1703n892j9440
$$ plain form
19273 20419 -19486 -52674 -342 47792 57667 78046 28909 -28098 -37475 -41528 11003 6648
19261 6648 7927 38721 78622 153831 132543 90396 37444 -3395 35275 67949 51997 48423
19249 48423 17568 3053 -34973 -13710 45889 11910 -20265 -8225 -7110 14726 74474 87470
19237 87470 18302 -20788 -5407 2536 -47690 -3870 52904 122443 105914 48717 18637 87089
19225 87089 44199 12154 -6056 -23374 -14250 -14529 8152 34482 26854 77977 69394 9136 53594
19212 53594 82136 42138 61506 107215 85471 34457 30615 18338 52628 14274 -35910 -62892
19200 -62892 -6179 11562 -32847 -63225 -76579 -10259 33513 40700 58213 40972 59091 50862
19188 50862 21613 53086 23513 -8238 21011 71396 127655 70889 19087 30790 24898 5458
19176E458L6355p652o155N548k7258r671j374N7283n6544p712R193K0381k8809
19163a0957k18M1942K2897Q236J3078j6966L7700J5425J0249k8996j7231O8511
19151A43670k4925p9369K2972L4514k9486l3092l3164j8605n604M8269k4842n364
19139e026N8920l380K898M5882N154k8845J2627L6265J1781n0755l0610m8185
19127F726j2146K6263M1740k9034j4606N5730K7078N436N672M5715o0445l1217
19115F6912l0815j8811J8588R301J5789l4634Q614p924p1630M3938M3902L3856
19103G7086l5292j3645j4337K2371k1946r750K4847O5954K5762J0038k946n4428
19091G3714M395M5144K5347L5110M3217O9794J3735n1091o7922m9151J184J9949
$$ plain form
19176 5458 41813 34161 28006 33554 6296 -3375 -4749 52534 -4010 -11722 -2529 17852 -10957
19163 -10957 -11175 30767 53664 61900 74978 58012 95712 111137 121386 92390 75159 143670
19151 143670 118745 39376 62348 96862 67376 34284 1120 -17485 -23089 25180 338 -5026
19139 -5026 53894 50514 53412 99294 104448 75603 88230 124495 136276 85521 54911 6726
19127 6726 -5420 20843 62583 33549 18943 74673 101751 107187 112859 158574 98129 66912
19115 66912 36097 17286 35874 45175 60964 26330 34944 27020 -44610 -672 43230 77086
19103 77086 41794 28149 13812 36183 14237 4487 29334 95288 121050 131088 128142 73714
19091 73714 78109 123253 148600 183710 226927 296721 310456 259365 191443 142292 143476 163425
19079A63425k5481j6812k8327l8489K1573O167K5437J664P683Q194R551R330n2189
19066I1726m9335r964m643l2869J952M1995K5303o526Q5003O5590Q6116o234J5611
19053C03725j0979J9284L2064L1378N2635K9437n1476m4759j6308q2068n2510
19042B10423R970K1781K9334M3151O0483J0791j2104l4013n1030l4884n1563m1924
19030A60415K5825m3124M0298j6000l1581p3536J547O2041J3172M526n9063l7272
19018D7248k8621K3362L8678L7362M4551O0977L3559L1285j0299o2268j2148j0492
19006A93194k2857N2738Q9422R131L3L089k179N170n194L2009j3131K4216o3040
18993C02601l1854J3189J0126M323m6992o9160p9026k9941j6582L9424J5739J5915
$$ plain form
19079 163425 137944 121132 92805 54316 75889 82056 107493 109157 116840 125034 134585 143915 91726
19066 91726 42391 32427 27784 -5085 -3133 38862 64165 57639 142642 208232 294348 288114 303725
19053 303725 292746 312030 344094 375472 428107 457544 406068 361309 345001 262933 210423
19042 210423 220393 242174 271508 314659 375142 385933 373829 339816 288786 253902 202339 160415
19030 160415 186240 143116 183414 167414 135833 62297 63844 125885 139057 143583 84520 47248
19018 47248 18627 41989 80667 118029 162580 223557 257116 288401 278102 215834 203686 193194
19006 193194 170337 223075 312497 321628 321661 324750 322571 327741 322547 354556 341425 365641 302601
18993 302601 270747 283936 294062 298385 251393 182233 103207 73266 56684 96108 111847 127762
18981A27762P0471M1409p0960l2109L9655K3032J3299J5440K3736m0099q7319
18970A24317L405j2342J9973P8177O2694L997L014l3220j4930o3098o2245k6357
18958H3385K3445J2301J94P583L7157m534l2948L9202P9220n2306p3030j4929
18946A04740O332r23j5332m8224q833J8050P9673L2655J3660k9361n698n2236
18934I4503O21j9680p178M3147J9875l2247j8507M0663K1374J304m966j4077k3755
18921A01077J2629n0972N0084K1226l7452n1222Q916Q3665N369k0603L7460j1046
18909A49131K4505P5786j1657J1436m8507j8332j2122l0180k7158L3889q5502
18898F1289k7689J3472M7688N1481m4274n6786k5256Q2059P3648L917O278m211
$$ plain form
18981 127762 198233 239642 168682 136573 176228 199260 212559 227999 251735 211636 124317
18970 124317 127722 115380 135353 213530 276224 280221 283235 250015 235085 171987 109742 83385
18958 83385 106830 119131 119325 126908 164065 159531 126583 165785 245005 192699 119669 104740
18946 104740 111072 110149 94817 46593 37760 55810 135483 168138 181798 152437 146739 94503
18934 94503 95124 75444 68266 111413 131288 99041 80534 121197 142571 143875 138909 124832 101077
18921 101077 113706 62734 112818 134044 96592 45370 54286 137951 143320 122717 160177 149131
18909 149131 173636 249422 237765 249201 200694 182362 170240 140060 112902 146791 61289
18898 61289 33600 47072 94760 146241 101967 45181 19925 101984 175632 179549 185827 181616
18886A81616l6311o245q94J9509k4218n457j205N3450l2846l3731k3309J0554
18874A00913k9197k6355P094O3645k9550l7446q521P075o616J5322O1978J9367
18862A37709J2026K447j5944M108k0528l9505m1553K544J6819R631j0049K4654
18850H2359J9813k380j8057Q060m3063J0301Q3222M0787k612p306K1831J7110
18838B10065J7703n9444j20770L5296L376p6219k1530O2026L2875O490j5010n569
18826F9289J3264m9409l858M7870q520J9125M360k2343n1472j4194N7535L1490
18814I3137m9050M838R4926L140k5839k7802l3639J4541K6414M2699l5435k714
18802A05216j2208K1882Q927L1079J1543J0999j9858J4111J3872j3671m5958J1203
$$ plain form
18886 181616 145305 139060 138166 157675 133457 128000 126795 180245 147399 113668 90359 100913
18874 100913 71716 45361 52455 116100 86550 49104 40583 47658 41042 56364 118342 137709
18862 137709 149735 152182 136238 140346 119818 80313 38760 41304 58123 67754 57705 82359
18850 82359 102172 99792 81735 89795 46732 57033 140255 181042 178430 171124 192955 210065
18838 210065 227768 168324 47554 82850 86226 10007 -11523 50503 83378 89868 74858 69289
18826 69289 82553 33144 29286 77156 68636 87761 92121 69778 18306 4112 61647 93137
18814 93137 44087 48925 143851 146991 121152 93350 59711 74252 100666 143365 107930 105216
18802 105216 93008 114890 123817 154896 166439 177438 157580 171691 185563 171892 125934 137137
18790A37137M9205j17L0599j3293j5234L0901r076k2142m974o329J7964j6432
18778A78209k9668L2530P48J2320L6927k9687n8878N4679J12530J44198K59880
18767G13788K37571q7443j84460j98724j26529p5996n965k1222j9680L913k4556
18756B10697k2355n3032J8555J6685k3668L5469k8750o3993M1197L8399K3901
18745A93105l410L0365J1969J1011J0444j362l7896j9158k0793m723j0741J3890
18733A72701k77M6466P3638l6316n6525K0775O0488L0729k9280n8664L462k5264
18721B01933J7145M9706j358p6623l1054j6398l3437O8167J6420K8854l272j7731
18709B02352n952M1612L7782j8161q7518o1561j7057O6866k0722O3375M5167l5729
$$ plain form
18790 137137 186342 186225 216824 203531 188297 219198 210122 187980 183006 176677 194641 178209
18778 178209 148541 181071 181819 194139 231066 201379 142501 197180 309710 453908 713788
18767 713788 951359 863916 679456 480732 354203 278207 272242 251020 231340 235253 210697
18756 210697 188342 135310 153865 170550 146882 182351 153601 89608 130805 169204 193105
18745 193105 189695 220060 232029 243040 253484 252122 214226 195068 174275 169552 158811 172701
18733 172701 172424 218890 292528 256212 199687 220462 280950 311679 282399 223735 227197 201933
18721 201933 219078 268784 267426 190803 159749 143351 109914 178081 194501 223355 220083 202352
18709 202352 196400 238012 275794 257633 170115 108554 91497 158363 137641 201016 246183 210454
18697B10454L5038L7031P362J6935M7209l4130J8517j4168p0173j9677n699l359
18685B25340L0975j7424M6898K4087Q2481M1995m3469o2536m4749o223M345o086
18673B75634J5490P5727p231J024j104L1038M643q593j3258r576K2027r31o8879
18660C16011n8977R839J588K363K1689K9402L7456J893M5524k1103K9894L2836
18648D48415k9139k5581j4437J5690Q393L4166k3470L277N3364K1481P4176L432
18636E69767L9207O6496r629j5579K0294J07781L1052M1747M3046J7175l9947
18625H71410o1665l794K0989L2183K9473m383L0166j3961l4379K266J3588M7580
18613I29473j3913M8140O7805J7094O712M8419N3133J48009P2168N3135N3002
$$ plain form
18697 210454 245492 282523 289885 306820 354029 319899 338416 324248 254075 234398 228699 225340
18685 225340 256315 238891 285789 309876 392357 434352 390883 328347 283598 277375 281720 275634
18673 275634 291124 366851 359620 360644 359540 390578 395221 386628 373370 363794 385821 384890 316011
18660 316011 257034 266873 268461 270824 292513 321915 359371 361264 406788 385685 415579 448415
18648 448415 419276 393695 379258 394948 403341 437507 414037 417314 470678 492159 566335 569767
18636 569767 608974 675470 665841 650262 670556 778337 809389 851136 894182 911357 871410
18625 871410 809745 805951 826940 859123 888596 884213 914379 900418 866039 868305 881893 929473
18613 929473 915560 963700 1031505 1048599 1055311 1103730 1156863 1304872 1377040 1430175 1483177
18602A483177J21623J03739J22849L01385L93279N81585Q26034J341553J977246
18593G252470K278709K564883L418217K839573J212098J086447m4316j712702
18585A8895379j673077j122003j61481J080138J691443K980477L506629J256704
18577B6454209L98382m69474l072641l832641l749282l635659k987644k182494
18569F922756j438882q85653n17916l42809j72475l4613Q1786N9165O0420R1415
18559C823194J38433J21651J92871K82480M03622O20558R51400J323529K021616
18550I879354L253576M976115O322841O459525N238051L968970K139356K098341
18542D4336129J533507p23117p39407r54921j351955O42330K326743L011582M152924
$$ plain form
18602 1483177 1604800 1708539 1831388 2132773 2526052 3107637 3933671 5275224 7252470
18593 7252470 9531179 12096062 15514279 18353852 19565950 20652397 20608081 18895379
18585 18895379 17222302 16100299 15938818 17018956 18710399 21690876 25197505 26454209
18577 26454209 26852591 26383117 23310476 19477835 15728553 12092894 9105250 6922756
18569 6922756 5483874 4598221 4080305 3737496 3565021 3530408 3612194 3671359 3731779 3823194
18559 3823194 3961627 4083278 4276149 4558629 4962251 5582809 6534209 7857738 9879354
18550 9879354 13132930 18109045 24431886 30891411 36129462 40098432 42237788 44336129
18542 44336129 45869636 45146519 44407112 43452191 42100236 42742566 45069309 48080891 52233815
18533E2233815L447258K391133L171340o15127l884241m454535p422085q558362
18525C6309196p537998o664125n363685l781082k405563j361025n51075J31598
18517H776241R65496K027547L059157L333422K281204k37811k188649l040700
18509A4975907k561497j535939n36213M71489J495387K814602M071825N395157
18501B4590718O230186O364161N606356M142610K854542P12972j02112r82236
18493D9417197l953845n362776m224096j820826J375115L608299M984001O316549
18485E0339618M517238R26600m13214l959542q181126q693385p549264o485053
18477B0501872n002906l537918k248001j341662o17968l0246L86431Q80024J651718
$$ plain form
18533 52233815 55681073 58072206 61243546 60628419 56744178 52289643 44867558 36309196
18525 36309196 28771198 22107073 16743388 12962306 10556743 9195718 8644643 8776241
18517 8776241 9741737 11769284 14828441 18161863 20443067 20205256 18016607 14975907
18509 14975907 12414410 10878471 10342258 10813747 12309134 15123736 19195561 24590718
18501 24590718 30820904 37185065 42791421 46934031 49788573 50501545 50399433 49417197
18493 49417197 45463352 40100576 35876480 34055654 35430769 39039068 44023069 50339618
18485 50339618 54856856 55783456 55370242 51410700 43229574 34536189 26986925 20501872
18477 20501872 15498966 11961048 9713047 8371385 7753417 7723171 8109602 8989626 10641344
18468A0641344K983322M658883N635006N381634K952443O90359q57098j614366
18460C0471527k799322l883936l921938k874116j081188O28180J672981K132667
18452B0344855K142376K709491L443216L861257K789632J001260k285733n014449
18444B8991905o191738n609294m007964k446436j101670J47685J649994K922592
18436A4355074L085697J814537q50731k838989l651471l131147k208115j459668
18428E115187r24415n85786l43711j71431j09302L3876J85798K77117N45972Q03809
18418D827114J095618J833381L175540M578200N009684L748317N6509l012322
18410B1312041m619692m180471k908174j579416l38052P36543K028097L044818
$$ plain form
18468 10641344 13624666 18283549 23918555 29300189 32252632 32942991 32085893 30471527
18460 30471527 27672205 23788269 19866331 16992215 15911027 16539207 18212188 20344855
18452 20344855 22487231 25196722 28639938 32501195 35290827 36292087 34006354 28991905
18444 28991905 22800167 17190873 13182909 10736473 9634803 9782488 11432482 14355074
18436 14355074 17440771 19255308 18404577 15565588 11914117 8782970 6574855 5115187
18428 5115187 4190772 3604986 3261275 3089844 2980542 3014418 3200216 3477333 4023305 4827114
18418 4827114 5922732 7756113 10931653 15509853 20519537 24267854 24324363 21312041
18410 21312041 16692349 12511878 9603704 8024288 7686236 8422779 10450876 13495694
18402A3495694K931591J169686j366992l137049l578062k865729k063138j341201
18394C244800q15150m68939l13681k73542j39950j25436p1174o3122j03228n9761
18384H10817m340q5482n7569m1965o2254j8681P5550J03792P536J1892o4379q4951
18372E89966j12717m2910L6331J9781L8513p566j0649j1920p7028o5353p0150
18361B86298O5224Q4755K3076j33015j00640k6078L7481L4019l8412k747L9490
18350B69451p594j7176N9435p744M183J3900l5275l6580K429k808M0796q567l2323
18337B42127J9714O219k5165l1953L3305K9066o2062q7363j3603P3229M73p302
18325A76685k2609J9922O401l4804k6143J9463L2263M4054n171j0020n0951m9381
$$ plain form
18402 13495694 16427285 17596971 16229979 13092930 9514868 6649139 4586001 3244800
18394 3244800 2429650 1960711 1647030 1373488 1233538 1108102 1036928 973806 870578 810817
18384 810817 806477 720995 663426 621461 559207 540526 616076 719868 727404 739296 674917 589966
18372 589966 477249 434339 470670 490451 528964 521398 510749 498829 421801 356448 286298
18361 286298 351522 436277 459353 326338 225698 199620 237101 271120 232708 229961 269451
18350 269451 261857 244681 304116 296372 300555 314455 279180 242600 245029 242221 283017 274450 242127
18337 242127 261841 268060 242895 210942 244247 273313 211251 123888 110285 183514 183987 176685
18325 176685 154076 173998 180399 145595 119452 138915 171178 215232 210061 200041 149090 99709
18313I9709L9280K4949m2192O4308K0695m7267p039m7477L0529K8966L8179M0177
18301B42817K7201J5934m1264k7602K7539L7385L3319n5221o0590J710L7706P5632
18289C14566L0949l6486m9405j8301P755M3223L4670q0419k0775K8588j7001J1287
18277B48651j620n1031L982K412Q104N7233M4332m5622o0209j391n652j6461j041
18264A81687k9061k0593P122N7853J00839K6934J1632j5315p0033l8640N5667
18253B68092Q0585O3862P8657J2642q6179m5330K811J7073j3716o8993p8563K1474
18241B52415O4249o625m2467J0199N6061J45494k8754o2465l7627Q134k0329j159
18229C37126M226j5600J7258L8132J9057j0657k5171k3763L0515n2880L357m950
$$ plain form
18313 99709 138989 163938 121746 186054 206749 159482 152443 104966 135495 164461 202640 242817
18301 242817 270018 285952 244688 217086 244625 282010 315329 260108 199518 201228 238934 314566
18289 314566 345515 309029 259624 241323 249078 292301 326971 246552 225777 254365 237364 248651
18277 248651 247031 196000 199982 202394 210498 267731 312063 266441 206232 204841 199189 182728 181687
18264 181687 152626 132033 139155 197008 297847 324781 336413 321098 251065 212425 268092
18253 268092 348677 412539 491196 503838 417659 372329 375140 392213 378497 309504 230941 252415
18241 252415 316664 310039 267572 277771 333832 479326 450572 388107 350480 358614 338285 337126
18229 337126 341352 325752 343010 381142 400199 389542 364371 340608 371123 318243 321600 316650
18217C16650k5115o8944J5892M8224M4043N9633r635k9686K9597N9947M5888K8646
18205E15140J3675l1910p131r510j2938N6926P9629M5729k1399O797K5410j0406
18193F50012J134R1440N9817j0747k7518j4123k597l0088M3653J17726J02679
18182I81388J40576J60256O684J9440M6715l3112n1979J8786J03809J23236P8091
18171A593890J7713K5554J09746J65915K12492K03436L01234L54679M75196O25755
18161D085610Q28134J099348J759138K678982M276208O212327P544023P089791
18153C5573561L872953j22372l311648l285806p57289K908926N554591M904642
18145D5337558J069190m231259p942443q764321p452599n330548l364854k054822
$$ plain form
18217 316650 291535 222591 238483 286707 330750 390383 380748 351062 380659 440606 486494 515140
18205 515140 528815 496905 489774 480264 467326 524252 603881 649610 628211 635008 660418 650012
18193 650012 651146 742586 802403 791656 764138 750015 747418 717330 760983 878709 981388
18182 981388 1121964 1282220 1288904 1308344 1355059 1321947 1269968 1288754 1392563 1515799 1593890
18171 1593890 1611603 1637157 1746903 1912818 2125310 2328746 2629980 2984659 3459855 4085610
18161 4085610 4913744 6013092 7772230 10451212 14727420 20939747 28483770 35573561
18153 35573561 39446514 39324142 36012494 32726688 31969399 34878325 40432916 45337558
18145 45337558 46406748 42175489 34233046 25468725 18016126 12685578 9320724 7265902
18137G265902j243151q53656n47346l75878k09501j23559j38809J8119J07067
18128C899188J53321J96059K74486K51648K06955K99320M10278N61549N73027
18119F825831P75081J153334J588277K152228L004919M374962O944675J1948556
18111C8767863K2851156M4869034N2756055M29123k2710246k3262599j8414720
18104I5285666j4248184j2781085r564165l654310L270256P923905P065211J287090
18096G4584384p091414j2945671j4264436j2061335q564190n518711l487456k097158
18088H554013j210680q12127m98363l62348j53234J1760R0386J96532L71735O67350
18078F855024R94860J353673K066548L392596M961795O018221O721932N165858
$$ plain form
18137 7265902 6022751 5169095 4621749 4245871 4036370 3912811 3774002 3792121 3899188
18128 3899188 4052509 4248568 4523054 4774702 4981657 5280977 5691255 6252804 6825831
18119 6825831 7600912 8754246 10342523 12494751 15499670 19874632 26819307 38767863
18111 38767863 61619019 106488053 159244108 159673231 136962985 113700386 95285666
18104 95285666 81037482 68256397 58692232 55037922 58308178 66232083 73297294 74584384
18096 74584384 67492970 54547299 40282863 28221528 19657338 14138627 10651171 8554013
18088 8554013 7343333 6531206 6032843 5670495 5517261 5529021 5619407 5815939 6187674 6855024
18078 6855024 7849884 9203557 11270105 14662701 19624496 25642717 32364649 37530507
18070C7530507L035925R10610k031241k697330k325763j131148L93427M71990
18062C4156977N35657M98786K39986M83119K51477j075790k461545l936682l581345
18053B5110640j841204P30281K692523K664060O39502k305085m793418n442867
18045A7454432m839237l527523k318078j461948q87950m81492k47601j92928j44655
18036C353020l9061O1562J11537K13599K07490K00290J96364K31230K77033L38004
18026E151068P21653J086526J539995K397475L598744M610000N401626M948665
18018B9455752L306577J946419p4804j30656J202429L395295N610176O135547
18010E0846735M975147J525175j996124n281427o515534n430165l505456j211888
$$ plain form
18070 37530507 40566432 41477042 39445801 36748471 34422708 33291560 33684987 34156977
18062 34156977 34692634 35191420 35431406 35914525 36166002 35090212 32628667 28691985 25110640
18053 25110640 23269436 23999717 26692240 29356300 29995802 27690717 22897299 17454432
18045 17454432 12615195 9087672 6769594 5307646 4419696 3938204 3690603 3497675 3353020
18036 3353020 3313959 3375521 3487058 3700657 3908147 4108437 4304801 4536031 4813064 5151068
18026 5151068 5872721 6959247 8499242 10896717 14495461 19105461 24507087 29455752
18018 29455752 32762329 34708748 34633944 34503288 35705717 39101012 44711188 50846735
18010 50846735 55821882 57347057 55350933 50069506 43553972 38123807 34618351 33406463
18002C3406463l89433o74575j418741k852004m464845m907953m748817l706124
17994A0243971k610399j738309j120210q00600n75864l77151k93087k20727j14903
17985B392721k4935o2109j46088k05195j04506l5573M1067P1697O7939L4514P0291
17974B099823J41592J50754R4815O6651p255N5187J37642K05450L05418N09495
17964C759572P83218J234019J872784K843006L887153M597896M847129L316011
17956B7140788J875016j5094j397830j280892j001250q8013k8928l96581j146392
17947B3660824k590066l676746l972932l728816k856223j982074j264756q00349
17939B788862n54006l42645k23894k09735j13540q4452n1941j7954P338r5498
$$ plain form
18002 33406463 33017030 32342455 30923714 28071710 23606865 18698912 13950095 10243971
17994 10243971 7633572 5895263 4775053 3974453 3398589 3021438 2728351 2507624 2392721
17985 2392721 2367786 2305677 2159589 1954394 1849888 1814315 1855382 1927079 1995018 2029532 2099823
17974 2099823 2241415 2392169 2486984 2553635 2546380 2601567 2739209 2944659 3250077 3759572
17964 3759572 4542790 5776809 7649593 10492599 14379752 18977648 23824777 27140788
17956 27140788 29015804 29000710 27602880 26321988 25320738 25232725 25203797 24807216 23660824
17947 23660824 21070758 17394012 13421080 9692264 6836041 4853967 3589211 2788862
17939 2788862 2234856 1892211 1668317 1458582 1345042 1260590 1208649 1190695 1198033 1102535
17929A102535j03258r8086n7227o6254q2422p1907k1337j9764m6037p8270n5099
17918D02874K4456m1483m0110j17205m7014J04860j0474o0282j3120N7363l8738
17907B21127p9602p875k33J2473N8065n787o3230N0446M3656K5065q1108n0460
17895A22537J3761j8838J4274p504j5113j2618J9544R399K7675p7807m9669m4605
17883a8964M047Q246K1578J2483N6640M2139L9049J2938q2454l8743M894J6376
17871G8229n7134l0823J3685K4832J8109l677O106j8502J4416l9111l3021L430
17859b3461J8320K8055J9133J1947j3423K3499N0589K4644p0727k8974k6984o0352
17847d7734L0866j341n1145L3516O5164L9671L320r4481q357J0911K9086J3319
$$ plain form
17929 1102535 999277 901191 843964 777710 695288 623381 602044 582280 536243 457973 402874
17918 402874 427330 385847 345737 228532 181518 286378 275904 215622 202502 259865 221127
17907 221127 141525 133650 133417 145890 203955 198168 134938 185384 229040 254105 172997 122537
17895 122537 136298 117460 131734 124230 109117 96499 116043 125442 153117 75310 25641 -18964
17883 -18964 -14917 -6671 14907 27390 84030 126169 165218 178156 95702 56959 61853 78229
17871 78229 21095 -9728 3957 28789 46898 43221 49327 30825 45241 6130 -26891 -23461
17859 -23461 -5141 22914 42047 53994 40571 64070 114659 139303 68576 39602 12618 -47734
17847 -47734 -16868 -18209 -69354 -35838 29326 68997 72317 -22164 -30521 -19610 9476 22795
17835B2795j4815M4409J0805J4085j2625j9041p8447q832P4440J4798K1500j3943
17823E5129J8239k777l6869k3219J3247N7296l3669j9767l7603l2786K97M5882
17811C400k8916m4245M6435M897j1893M1536K7002p0760p054J5563K2848O3082
17799F1895n2785m8825j2046L7431R440m6584M1558K6238j4398K331k2623k4726
17787d3094k0349J2240k5490o3793J2833L7690J1087J9635k1894m330L0010R2836
17775C7381j3105j1240K9671K5320l5893k8887J044l6619l3539J1934M1128l6744
17763d9549K0838J9497R1438r12p4157j9720L3479N2196K9170j3606J948K4607
17751A15229n7286j3776K533K1020r967R294N1838J1365p1659j09363N939J5108
$$ plain form
17835 22795 7980 52389 63194 77279 64654 45613 -32834 -41666 32774 47572 69072 55129
17823 55129 73368 70591 33722 10503 23750 81046 47377 27610 -9993 -42779 -42482 3400
17811 3400 -25516 -69761 -23326 -18429 -30322 11214 38216 -32544 -39598 -24035 -1187 61895
17799 61895 9110 -39715 -51761 -14330 -4890 -51474 -9916 16322 1924 4255 -18368 -43094
17787 -43094 -63443 -51203 -76693 -140486 -127653 -89963 -78876 -59241 -81135 -85465 -55455 37381
17775 37381 24276 13036 42707 68027 32134 3247 4291 -32328 -65867 -53933 -12805 -49549
17763 -49549 -28711 -9214 82224 81312 7155 -12565 20914 73110 102280 88674 90622 115229
17751 115229 57943 44167 46700 67720 57753 67047 118885 130250 58591 -50772 -44833 -29725
17739b9725m944j5165j4434n3572M5294M2867P9638L1601m4554o3864J2637L244
17727a0977j3238K8072k4403l2490N5989K8963j3334k1371L6201J962J5140m6374
17715D140j22564j3808J18924L1502j0216n4616l1817m1023K6663K4074K8637
17704d0104L7904Q045J947J4329Q741m1374L6045j6887k1769j5403J1718p6230
17692i3038k9807j6803Q903N4959O8155K6950o9579J5572O4424l5143k7525J4481
17680a8451j7436m4132J0657O9710N1497j9053p673r73j8570k6052o1000m0613
17668a22089K5837O4393M9727j6314l9495k0723l3424L1966n142J2708k7008j1227
17656i0791M1888l3246k6643l766n7150M8031P5761K0065o3268J9394K2132l3328
$$ plain form
17739 -29725 -34669 -49834 -64268 -117840 -72546 -29679 49959 81560 37006 -26858 -14221 -10977
17727 -10977 -24215 3857 -20546 -53036 2953 31916 18582 -2789 33412 35374 50514 4140
17715 4140 -118424 -132232 -13308 18194 7978 -46638 -78455 -119478 -92815 -68741 -40104
17704 -40104 -2200 5845 7792 22121 30862 -10512 25533 8646 -13123 -28526 -16808 -93038
17692 -93038 -122845 -139648 -130745 -75786 -7631 19319 -50260 -34688 29736 -5407 -32932 -18451
17680 -18451 -35887 -80019 -69362 348 51845 32792 25119 24146 5576 -20476 -81476 -122089
17668 -122089 -96252 -31859 17868 1554 -37941 -58664 -92088 -60122 -65264 -52556 -79564 -90791
17656 -90791 -48903 -82149 -108792 -112558 -169708 -121677 -45916 -25851 -89119 -69725 -47593 -80921
17644h0921L7065j7710P0996M2602o037j0635L3709P2063J9864m945k0233J7448
17632A53266N068J996l5463Q270K803J1460l180J162J2850J3118k9008k1041m3033
17619G8268n5173n3448n9471r832N0066K1167n3742k5629M899L6767M2632j8668
17607d2164j5660N981L1200j0179p7417n7581J03004N4243r070K4068J13052M0982
17595A60459j03668l8855k5662M6354N889K9197q067M0234J08705O8158O1339
17584C44083L6818N912n5067m1334M6786R0340L215l6674m9243n7392o8316l2586
17572A86542l3584p6560J7088m365o8719j7671j4495j8493N2268O065l2713j4597
17560a9234k5272M447M315L3010j6708n6071J8995M9817J9640O2847L1124K8470
$$ plain form
17644 -80921 -43856 -61566 9430 52032 45995 35360 69069 141132 160996 156051 135818 153266
17632 153266 158334 160330 124867 133137 135940 147400 144220 145382 158232 171350 142342 121301 78268
17619 78268 23095 -30353 -89824 -99656 -49590 -28423 -82165 -107794 -102895 -66128 -23496 -42164
17607 -42164 -57824 -51843 -20643 -30822 -108239 -165820 -62816 -8573 -17643 6425 119477 160459
17595 160459 56791 17936 -7726 38628 44517 73714 65647 105881 214586 282744 344083
17584 344083 380901 386813 331746 290412 337198 427538 430753 394079 344836 287444 219128 186542
17572 186542 152958 76398 93486 89121 20402 2731 -11764 -30257 22011 28076 -4637 -19234
17560 -19234 -44506 -40059 -35744 -2734 -19442 -75513 -56518 -6701 12939 75786 106910 135380
17548A35380M1305l4887P091O105N4126K8149K9406l6961m936j2331l6534j7097
17536A58816k4193O4364K3364K607l1911o3525j0591k670J3675J0940m1123o9757
17524B9996l8390L0155K6175l8367n90j0610m2061J9076O5935J8101n9932M728
17512D216P92l6272K0531m522m7672L1096M4362P0417q287p5938m5431J0379k383
17499c8712m877K4452N2588J04898J5429M2184N238k0891N7332n894L4685R3975
17487C60407O8333m614j2626r2187j04195l9581k0138j8490j1706k8729J4019
17476A10493k3524n6925j9561N5200l0151p0898k3881J9817N938k2577r112J8997
17464d6184k4887m1783L7887O8283R495k8947R331J13993K3340j6760n1008j3782
$$ plain form
17548 135380 176685 141798 148889 154994 209120 237269 266675 229714 224778 212447 175913 158816
17536 158816 134623 198987 222351 224958 193047 129522 118931 116261 129936 140876 99753 29996
17524 29996 -8394 21761 47936 9569 8979 -1631 -43692 -24616 41319 59420 -512 4216
17512 4216 5008 -31264 -10733 -15255 -62927 -31831 12531 82948 74661 -1277 -46708 -36329 -38712
17499 -38712 -43589 -19137 33451 138349 153778 195962 201200 180309 237641 231747 266432 360407
17487 360407 428740 424126 411500 319313 215118 175537 155399 136909 125203 96474 110493
17476 110493 86969 30044 10483 65683 35532 -35366 -59247 -39430 -33492 -56069 -65181 -46184
17464 -46184 -71071 -112854 -74967 -6684 2811 -26136 -16805 97188 120528 103768 52760 38978
17452C8978J2696N786o2661q2891Q7068K1031M7720J14689J41491K54091J13481
17441F91479j72611j82880o5946r553k1754p0372l3369L3355L5728m4303l3457
17430A26317j8474L7763P48l3034l7940L8453N9390m7225k3154o3268j0904j6765
17418A1907o0086Q93N4311N6486K1362j9499r6553l5726k9977N3717k5767l3584
17406a02516n4064K8821J03730P4720o0922p9526R628N877M8190M2627K5116l3141
17394H540J211O563q18l4781n8766J7068k2190l5112M9660N7364m0330k0784L3194
17381c9181P772J5921P401o4912R937L7496j0702q3768J7921K116L3686L9239
17369b7074P8354M5383l210m4820m2461l3132L2838l686J2658j8832P338P992
$$ plain form
17452 38978 51674 57460 -5201 -88092 -1024 20007 67727 182416 323907 577998 691479
17441 691479 518868 335988 270042 260489 238735 168363 134994 168349 204077 159774 126317
17430 126317 107843 145606 146354 113320 75380 113833 173223 125998 102844 39576 28672 11907
17418 11907 -48179 -47286 7025 63511 84873 65374 -31179 -66905 -96882 -43165 -68932 -102516
17406 -102516 -156580 -127759 -24029 50691 -10231 -89757 -80129 -74252 -26062 16565 41681 8540
17394 8540 9751 16314 15496 -19285 -78051 -60983 -83173 -118285 -68625 -11261 -51591 -72375 -39181
17381 -39181 -31409 -15488 -8087 -72999 -63062 -25566 -36268 -120036 -102115 -99999 -66313 -27074
17369 -27074 51280 96663 93453 48633 6172 -26960 5878 2192 14850 -3982 3356 11348
17357A1348l8693j9158P1674O319J4668K6329N469L9974M0444J1077l7885Q569
17345A40135j05881r4022J2676l9723p244m86l5023L988O2604P3523N7964K2625
17333I1136q0207o6469j206m674n9802m2282L7069P9275P3067J9874j5389m6314
17321a5922N845m330N6681k9317k2242m3642k4110l731p571J7298J4459K6125
17309c0457L297j4993l8472O5191K1129j8165K1967l3837l6893Q2988L9286p128
17297E3913q646k4893r1516M148Q72K6062L4659R4487L9371l3492n1864q878j5444
17284A8779Q949j5683o2798o4412L8800K1493L59k4734k0382J4969M8883L8641
17272B864m1210k9032j5624K7058K7922l0062k3798L5843Q2250K4136j3456m7983
$$ plain form
17357 11348 -27345 -46503 25171 31490 46158 72487 77956 117930 158374 169451 131566 140135
17345 140135 34254 -59768 -47092 -86815 -94059 -94545 -129568 -125580 -62976 10547 68511 91136
17333 91136 10929 -55540 -56746 -61420 -121222 -163504 -126435 -47160 25907 45781 30392 -15922
17321 -15922 -10077 -14407 42274 12957 -9285 -52927 -77037 -80768 -88339 -71041 -56582 -30457
17309 -30457 -27160 -42153 -80625 -15434 5695 -12470 9497 -24340 -61233 21755 61041 53913
17297 53913 45267 20374 -71142 -66994 -66122 -40060 -5401 89086 128457 94965 43101 34223 18779
17284 18779 27728 12045 -50753 -115165 -76365 -54872 -54513 -79247 -99629 -84660 -35777 2864
17272 2864 -38346 -67378 -83002 -55944 -28022 -58084 -81882 -46039 36211 60347 46891 -1092
17260a092o0948J4737M0132O1898K2716K2410M99p3223j7231K4656j1585m6010
17248b3041m6108M1334M2265N1474N6052n475j3135m3025m4947L3763J3256O639
17236F9052l1950n0024P1067P5996j6882l0483l1034l6812j6518j6471n4259j3494
17224h1812j0249j3202P173L0066m903l0964O2237K7323l7410k3321m8790M2145
17212h1707L7340o2326l1609J208K2692J9131M6998J2170m2283q12M3488R410
17200b6300l4877j9598L8750N901K3647K9507k6507K2574q080m3501j0807p2369
17188a21660L1353P4404M0869o5630n0505K0724k5052l2795N7417K9011J135J1810
17176b8919L4531j6038j7571M2612k3613l9227M6426K6379l0786q489J9756J8367
$$ plain form
17260 -1092 -62040 -47303 -7171 54727 77443 99853 100352 27129 9898 34554 22969 -23041
17248 -23041 -69149 -27815 14450 65924 121976 116501 103366 60341 15394 49157 62413 69052
17236 69052 37102 -12922 58145 134141 117259 86776 55742 18930 2412 -14059 -68318 -81812
17224 -81812 -92061 -105263 -98090 -68024 -72927 -103891 -41654 -14331 -51741 -75062 -123852 -81707
17212 -81707 -44367 -106693 -138302 -137094 -114402 -95271 -48273 -36103 -78386 -79198 -35710 -26300
17200 -26300 -61177 -80775 -42025 -36124 -12477 17030 -9477 13097 5017 -38484 -49291 -121660
17188 -121660 -90307 -15903 24966 -40664 -91169 -70445 -95497 -128292 -70875 -41864 -40729 -28919
17176 -28919 5612 -10426 -27997 14615 -8998 -48225 -1799 24580 -6206 -14695 5061 23428
17164B3428J3206j4951j0434K9484J0699J0999m6587M1019M9935j9716r7740n888
17152a6546j9204k6438L8932j0638k3689k0496l4622M4118M3430K7303L5554j8166
17140A9538n5152k7047L8330O6198L0970n6453n4775Q577P284L323k9j1190l8676
17127f9102l794M5141j9156M6676L3840k0370l8850M6079N6954j687n7389j8874
17115e32N5887P3297J71J4048j1888l3544q7826p0149k5832j2319l876N5754k7257
17102g4066l3650J8234K9322J0120j4392L348J6573j4658J4868J8085L5632k279
17090G137J9996j8167M3164K7043n7330k4091n0463P797O5982k3002K5573n374
17078A8265r365j7409l7070J6247o862J2348j8361J1901k148K2471P907J5839
$$ plain form
17164 23428 36634 21683 11249 40733 51432 62431 15844 56863 106798 87082 -10658 -16546
17152 -16546 -35750 -62188 -23256 -33894 -57583 -78079 -112701 -68583 -25153 2150 37704 19538
17140 19538 -35614 -62661 -24331 41867 72837 16384 -38391 -29814 -22530 -19207 -19236 -30426 -69102
17127 -69102 -72896 -27755 -46911 -235 33605 13235 -25615 20464 77418 75731 18342 -532
17115 -532 55355 128652 128823 142871 130983 97439 9613 -60536 -86368 -98687 -102563 -46809 -74066
17102 -74066 -107716 -89482 -60160 -50040 -64432 -61084 -44511 -59169 -44301 -26216 9416 7137
17090 7137 27133 8966 52130 79173 21843 -2248 -52711 -44914 21068 -1934 23639 18265
17078 18265 8900 -8509 -45579 -29332 -36194 -23846 -42207 -30306 -32454 -9983 -2076 13763
17066A3763o0013n7668M8128J7915q0420L3625N8728P9249K3370l8725l5089m9257
17054d6394k2003O4489N1390p5562j4408N1900K4692K4480k7105l4750o711K2136
17042A2154j5413N2996J406p8608m1210N0159K0559l7362Q620P1P4551O8546q3418
17029C3051k9092k3520j5253l4521J4829K2617O764l5568K4956l645J3491k9193
17017e5084L7197O2274l5363p9306k2498j0431L5350K2039N4381j3874J7802n985
17005F502P0143j9887l4091m6595r888O137M2373n1681K4685K5585N639L15l641
16992A5596j3358o127l4945J1534J7723J7177N2213o352m4802m86L8804J9644
16980F6621j4406r543j1159p1M5773o593n8135l0121M391O2560M429q304o0319
$$ plain form
17066 13763 -46250 -103918 -55790 -37875 -118295 -84670 -25942 53307 76677 37952 2863 -46394
17054 -46394 -68397 -3908 47482 -28080 -42488 9412 34104 58584 31479 -3271 -9982 12154
17042 12154 -3259 49737 51143 -27465 -68675 -18516 2043 -35319 -26699 -26628 47923 116469 33051
17029 33051 3959 -19561 -34814 -69335 -54506 -31889 -25125 -60693 -35737 -39382 -25891 -55084
17017 -55084 -17887 44387 9024 -70282 -92780 -103211 -67861 -45822 8559 -5315 12487 6502
17005 6502 76645 56758 22667 -23928 -33816 -27679 14694 -36987 -12302 13283 18922 19237 15596
16992 15596 2238 -3889 -38834 -27300 -9577 7600 59813 53461 8659 8173 46977 66621
16980 66621 52215 42672 31513 31442 77215 70622 12487 -17634 -13243 49317 53746 45442 -14877
16967a4877j4223K12K2815p0630l8474M2009J6004K2844K1137P7452Q944o7315
16955E898p4240R244L3632L6432N0493j1042n6972l8988L875J3638j1566J5418
16943b4178K5105M4379j4258L3234p165l7940o2225Q04n164J5534O8888L8798
16931G5812l9358o4382l1691L5986L1032q616P316J9403m417n1890J4092K2014
16919E301l9682j7603q215L5312p143r485j9757K2581J3336r832K9431k6193n5026
16906h6975K2336L4243N8842L3249p910j6534m119j2557q2170M8274N9775N249
16894E1703n8886m0489L2754L5669J8096K7358j4826J5382O349M3834j867l2737
16882H2340n4569m7767j209R05r7891p1638O0431K8923L4457J945k5505K6071
$$ plain form
16967 -14877 -29100 -28888 -6073 -76703 -115177 -73168 -57164 -34320 -13183 64269 73213 5898
16955 5898 -68342 -59098 -25466 10966 61459 50417 -6555 -45543 -41668 -28030 -39596 -24178
16943 -24178 927 45306 31048 64282 57117 19177 -43048 -42244 -47408 -31874 37014 75812
16931 75812 36454 -27928 -59619 -23633 7399 -1217 6099 25502 21085 -30805 -16713 5301
16919 5301 -34381 -51984 -60199 -24887 -32030 -41515 -61272 -38691 -25355 -35187 -5756 -31949 -86975
16906 -86975 -64639 -30396 28446 61695 53785 37251 33132 20575 -61595 -13321 46454 51703
16894 51703 -7183 -47672 -14918 20751 38847 66205 51379 66761 73110 116944 115077 82340
16882 82340 27771 -19996 -21205 -20300 -118191 -189829 -129398 -100475 -66018 -64073 -89578 -63507
16870f3507r134l4301k1927J9236K3949M9778l8567p1977Q341N1336K7563K9568
16858b9642j0129j2277j3097j2229P0693L7430Q83o0289m6918l359n0757L9884
16846h9807P0192k0441P968M74L0658Q379J4170K0984L8896m212k782k8228q428
16833C7823l8742l6197L2227L6181l4183j3552Q568l6650k2393M0285Q0291M4794
16821I8452o1534k1651j3257k4533M4082o542m5578J7894L1655k4974k0925L111
16809b3800j2211Q637J1400J2923R2742j9106p5918k908j959M7135R530m942o6555
16796b5032l6233Q7756M4508p4387O960P718k9883k580J0048M185k1007N1373
16784B3426N5302j3727P394m6768L736o0384q227l7476N3991L915K683J7485J2326
$$ plain form
16870 -63507 -72641 -106942 -128869 -109633 -85684 -35906 -74473 -146450 -138109 -86773 -59210 -29642
16858 -29642 -39771 -52048 -65145 -77374 -6681 30749 31632 -28657 -75575 -78934 -129691 -89807
16846 -89807 -19615 -40056 -32088 -31614 -956 7423 21593 42577 81473 77261 74479 46251 37823
16833 37823 -919 -37116 -4889 31292 -2891 -16443 -7875 -44525 -66918 -26633 53658 98452
16821 98452 36918 15267 2010 -22523 21559 15017 -30561 -12667 18988 -5986 -26911 -23800
16809 -23800 -36011 -27374 -15974 -3051 89691 70585 -5333 -8241 -10200 36935 46465 41523 -25032
16796 -25032 -61265 26491 70999 -3388 3572 11290 -18593 -21173 -11125 -6940 -27947 23426
16784 23426 78728 65001 72395 25627 29363 -31021 -39248 -76724 -22733 -18818 -16135 1350 13676
16771A3676K8270m914O852k1364m0002o8815L5068K0582J203R720m050j5127k6465
16758f5366j8136K7420p011O3566j0396j8601m6802n24L1250K982P635J5397k1165
16745c9751m0561n1380K9826J9910M8515j5921l5856j9110K2549J3821N6947M5732
16733C4721k7520k1439p3569J6712l5485k4095J2990M8450P560j007M790J9792
16721c8100k3974K7148K6836j7938L7215k9876j8662K5666n1913q1392N0172N3913
16709d0905k2311N7010K0929P385Q84o0754j8935J523K6684j0075j3653m009J0868
16696d5359m1637m5573K1111O8056K9694n1923k9379P651L5205J088k5467N4943
16684b1590M3850k7254m8149k7378J04199M1875j1359P508j9781o2035r698M0228
$$ plain form
16771 13676 41946 37032 43884 22520 -17482 -86297 -51229 -30647 -29444 -19724 -23774 -38901 -65366
16758 -65366 -83502 -56082 -63093 473 -9923 -28524 -75326 -75850 -44600 -41618 -33983 -18586 -39751
16745 -39751 -80312 -131692 -101866 -81956 -33441 -49362 -85218 -104328 -81779 -67958 -11011 34721
16733 34721 7201 -14238 -87807 -71095 -106580 -130675 -117685 -69235 -61675 -62682 -57892 -38100
16721 -38100 -62074 -34926 -8090 -26028 11187 -18689 -37351 -11685 -63598 -144990 -94818 -40905
16709 -40905 -63216 -6206 14723 22108 22992 -37762 -56697 -55174 -28490 -38565 -52218 -56227 -45359
16696 -45359 -86996 -132569 -111458 -43402 -13708 -65631 -95010 -87359 -52154 -51066 -76533 -21590
16684 -21590 22260 -4994 -53143 -80521 23678 65553 54194 61702 41921 -20114 -29812 10416
16672A0416Q257K093m4532J5732K9643M6123l060L2415j8364j4902M9217k1196
16660I1842m1076k4067k7926m1704L7042N2472J4144r4963o8005M9370K4473j7204
16648d5602J778k8126j8537O2205J254m8288l1370M0356N6330j8764J7143P6527
16636F4906K8577l7473m6765q8147J8708N7156L9161K2064j4701M826l2408k8680
16624a2776L8815L130m8305q1998M7097Q3219p148k8712m7161j7996K0589O6891
16612A5645l0342m8741l8974k3223N9333R5953N4401k4553K0233J0436o529o8017
16600A5622l3154n343K7091L6401k4178m418M082k3323l1598l2315l632P499N951
16587f1315L5940j2333m3063N4881J0823j6858O712K0625l3700p555j9509K2664
$$ plain form
16672 10416 18673 20766 -23766 -8034 21609 67732 64672 97087 78723 63821 113038 91842
16660 91842 50766 26699 -1227 -42931 -5889 46583 60727 -34236 -102241 -52871 -28398 -45602
16648 -45602 -43824 -71950 -90487 -28282 -27028 -75316 -106686 -66330 -10000 -28764 -11621 64906
16636 64906 93483 56010 9245 -78902 -60194 -3038 36123 58187 43486 48312 15904 -12776
16624 -12776 26039 29169 -19136 -101134 -54037 29182 22034 -6678 -53839 -71835 -51246 15645
16612 15645 -14697 -63438 -102412 -125635 -66302 29651 84052 59499 79732 90168 83639 15622
16600 15622 -17532 -22875 4216 40617 16439 12021 16103 -7220 -38818 -71133 -74765 -67266 -61315
16587 -61315 -25375 -37708 -80771 -25890 -15067 -31925 -25213 -4588 -38288 -45843 -65352 -42688
16575d2688J2247R854j5406k7665l3300k8703j1673Q0885N3021q9928p6516M6169
16563a23703L8688K1012J3003j5246n7036K5505N0450L5239j4142J9278R275j2208
16551i885L646L4894K2311r992l0242J2496J1044j1358r665n652L8919L4321j5140
16538F5697o1053o1280k085Q7255j4492n9870L4536L8173l5272n4180J3353R146
16526d0072l626O353J4633m6151N886k9703K8872M8205n0625J9996M6523R2879
16514I3170J7979j5391k2165J626m3493p0682l4895l4464k6486J9647O1769M4615
16502h770N6441l0325L893q385R801j6448n41j0516J0896n393j0546K9682J6131
16489C5920K362k979L5156n0681n5062k3057L2763P257k4854k7193p422M699K7446
$$ plain form
16575 -42688 -30441 -20587 -35993 -63658 -96958 -125661 -137334 -56449 -3428 -93356 -169872 -123703
16563 -123703 -85015 -64003 -51000 -66246 -123282 -97777 -47327 -12088 -26230 -6952 2323 -9885
16551 -9885 -6239 28655 50966 40974 10732 23228 34272 22914 13249 7597 46516 80837 65697
16538 65697 4644 -56636 -58721 28534 14042 -45828 -11292 26881 -8391 -62571 -49218 -40072
16526 -40072 -43698 -37345 -22712 -68863 -62977 -92680 -63808 -15603 -66228 -46232 291 93170
16514 93170 111149 95758 73593 75219 31726 -38956 -73851 -108315 -134801 -115154 -53385 -8770
16502 -8770 47671 17346 21239 12854 22655 6207 5666 -4850 6046 653 -9893 19789 35920
16489 35920 38282 35303 70459 19778 -35284 -58341 -25578 -18321 -43175 -70368 -77790 -73091 -45645
16476d5645J25953M1300j8150K4942m0425q2868n1597k6477Q099O5087K6487k1229
16464E477J5089p443o287N1143o061Q178k7345l3221l4660n0945J8686m415J4767
16451e7037P223R453N8134K4794m3019j1754O4192k9075j6151j2616J9029j5189
16439b016K1544K6015O450j4871j2271K3499J7254j6347o313k3473p479n94K4749
16426C6147M5721p1886J6752J716j0355M335J3503J2127K1410K455j8262K0878
16414G4541P856m0072l8988k2144n2918K3508N0855j0545o8694j6464k0973M6031
16402f8007L2896j128M7296O349K2616l406m209l6723J8049o5917M143j0479K875
16389e5645M6816L7927p1395K3368P9448q814r0399p1989K3386N915J2138j5046
$$ plain form
16476 -45645 80308 121608 103458 128400 87975 5107 -46490 -72967 -64868 219 26706 5477
16464 5477 20566 13123 6836 57979 51918 60096 32751 -470 -35130 -86075 -67389 -71804 -57037
16451 -57037 -49814 -40361 17773 42567 -452 -12206 51986 22911 6760 -5856 13173 -2016
16439 -2016 19528 45543 51993 37122 24851 48350 65604 49257 42944 19471 11992 11398 36147
16426 36147 81868 9982 26734 28450 18095 22430 35933 48060 69470 71925 53663 74541
16414 74541 82397 42325 3337 -18807 -71725 -48217 2638 -7907 -76601 -93065 -114038 -68007
16402 -68007 -35111 -36239 11057 17406 40022 36616 32407 -4316 13733 -52184 -48041 -58520 -55645
16389 -55645 -8829 29098 -42297 -18929 60519 51705 -38694 -110683 -87297 -81382 -69244 -84290
16377h4290r992L9371J9120K0520J6636K5864k1447R784O154j635k4416j9182
16365b3513N501Q498k9255o1631n7045K3310L4971N7404Q539R652m6259n776K0122
16352e5482p2243J2671Q4327M6272n8153m7624L3790O0023K1062l738K7609j455
16340D7059K631K0435L0504J5564k1957q574m687m0116k8564j9526p021j0630
16328b4882j3930J224j2754O2168J7132o7502K5174P1086p587n0663m1851j5867
16316e8252L6861N2949m574J0467M5876k2620l702j8851r2114r898J4802R321
16304c9735N8400N5782K5619p165m7455m8420m8998j2453K8708K7031j7925q97
16292b7508j2436L5884l3756L4361j1115k4182j6618K4596K0566l2677k3762o642
$$ plain form
16377 -84290 -94282 -54911 -35791 -15271 1365 27229 5782 15566 21720 20085 -4331 -23513
16365 -23513 -18012 -9514 -38769 -100400 -157445 -134135 -99164 -41760 -33221 -23569 -69828 -75604 -55482
16352 -55482 -127725 -115054 -30727 15545 -42608 -90232 -56442 3581 24643 20905 48514 47059
16340 47059 49690 70125 100629 116193 94236 85662 80975 40859 12295 -7231 -14252 -24882
16328 -24882 -38812 -37588 -50342 11826 28958 -38544 -13370 57716 50129 -534 -42385 -58252
16316 -58252 -21391 31558 26984 37451 83327 60707 57005 38154 -53960 -63858 -49056 -39735
16304 -39735 18665 74447 100066 92901 45446 -2974 -51972 -64425 -35717 -8686 -26611 -27508
16292 -27508 -39944 -4060 -37816 -3455 -14570 -38752 -55370 -30774 -10208 -42885 -66647 -73289
16280g3289L8897O1806Q548m8654q8840J2206K91j5014L7838j2862L5243k3356
16268f7186N5647N6791q9001k7350J6020L5320L2972k7213L6252M4575K5999l5204
16256E7622l4511q612k4097l1161N6395k4524L556P1095k6467l6309j2008J0915
16244A894M0092J9115j9979l4462l6331q955N2697P3869k5982K557k6032k3261
16232A5222J705l874J4525k8266n538K7092L4719l9900l7057J3441N9774L4194
16220H6037n9171o1633K5861Q781N5612k9930m4497R894J5163K1968L8623k652
16208F4056n6622k2365j775L2048l2637k2539J4827L4978M0019k5180J4097k9672
16196I235m4937K6742L3900O2501m0077k9692L2613J4796l8072o640P499M5941
$$ plain form
16280 -73289 -34392 27414 35962 -12692 -101532 -89326 -89035 -104049 -66211 -79073 -43830 -67186
16268 -67186 -11539 45252 -43749 -71099 -55079 -19759 13213 -14000 22252 66827 92826 57622
16256 57622 23111 14499 -9598 -40759 15636 -8888 -5332 65763 39296 2987 -9021 1894
16244 1894 41986 61101 41122 6660 -29671 -38626 14071 87940 61958 64515 38483 15222
16232 15222 16927 13053 27578 -688 -6226 20866 55585 15685 -21372 -7931 51843 86037
16220 86037 26866 -34767 -8906 -125 55487 25557 -18940 -9046 6117 28085 66708 64056
16208 64056 7434 -14931 -16706 15342 -17295 -39834 -25007 9971 49990 24810 38907 9235
16196 9235 -35702 -8960 24940 87441 47364 17672 50285 65081 27009 20369 27868 73809
16184G3809m8691r5373L4183j4088j4942M8063N7642k3011o0545M9390k5185P337
16172a1411M2415k7852l6400j871O155M0684P3319l5586p0878o0566j1508L8665
16160e4834j0396j8564Q616M2042M0886J5573p137J1694j1216o5116o8941R866
16148a07527K8141L893q293l930L2487L9109O0914K2777L780j6622j0630L6511
16136H0610m3643j5157j3196k0352k2690J4361p1K336l302p9357l0120O4273O8788
16123B480K6871L1530r0742r635l6175n7998M7799L4742K3242K3467l6742l4261
16111g5422K6522L6474O938K2710M3854K9089n2608m9511j2889r950K5065K4044
16099A4316L4927l547q807n2093k9720j2058l2479J9565O1362J06797n6060p7748
$$ plain form
16184 73809 25118 -70255 -36072 -50160 -65102 -17039 40603 17592 -42953 6437 -18748 -11411
16172 -11411 31004 3152 -33248 -35119 -28964 11720 85039 49453 -21425 -81991 -93499 -54834
16160 -54834 -65230 -83794 -75178 -33136 7750 23323 16186 27880 16664 -48452 -117393 -107527
16148 -107527 -79386 -75493 -83786 -87716 -55229 -16120 44794 67571 71351 54729 44099 80610
16136 80610 36967 21810 8614 -11738 -34428 -20067 -20138 -17802 -21104 -100461 -130581 -66308 2480
16123 2480 29351 60881 -29861 -39496 -75671 -133669 -85870 -51128 -27886 -4419 -41161 -75422
16111 -75422 -48900 -12426 -5488 17222 61076 90165 37557 -11954 -24843 -34793 -9728 14316
16099 14316 49243 45696 36889 -15204 -44924 -56982 -89461 -69896 -8534 98263 42203 -35545
16087c5545K8869R579l4833m1951L8182q228m724L709N6555K3614l4984o0606
16075f0363L1887N4455j406R120l6145J9430K8759l5505K9552K9954L9010m822
16063A03926M5339k8892q049l0269j8717O5194m2727m3363p1794r0477n393L1364
16051i3858J6627J6515M389n4023K3371M4679J7103L2538R0817j5747j7167j1326
16039E3918n8010l5226K9385K0292p076K8612n4238j6277m0932l978O8219J0410
16027d901P243L6857m741k8960l4472O49J5147J2674j3765k5835k123L3907J5560
16014G240m2496K4791K1531m4096M9896J4107k8m3753j1740P5416m6139n7293
16002e2564L5647L2247M4550N7118o1620m9016J1570J9104n0930k2103J3112j3926
$$ plain form
16087 -35545 -6676 2903 -31930 -73881 -35699 -43927 -48651 -44942 11613 35227 243 -60363
16075 -60363 -28476 25979 24573 33693 -2452 16978 45737 10232 39784 69738 108748 103926
16063 103926 149265 120373 112324 82055 63338 128532 85805 42442 -29352 -119829 -125222 -93858
16051 -93858 -77231 -60716 -56327 -110350 -86979 -42300 -25197 7341 98158 82411 65244 53918
16039 53918 -4092 -39318 -9933 10359 3283 31895 -22343 -38620 -79552 -83530 -15311 -4901
16027 -4901 2342 39199 34458 5498 -28974 -28325 -13178 -504 -14269 -40104 -42227 -8320 7240
16014 7240 -35256 -10465 11066 -33030 16866 30973 30945 -12808 -24548 50868 4729 -52564
16002 -52564 -16917 15330 59880 116998 55378 6362 17932 37036 -13894 -35997 -22885 -36811
15990c6811o2245K7270P6046o239J4027P360J5889Q692l5885m2477J0584O7484
15978D3695K3027K8485K4193o2399K3836k0552L2337k1608K590O090k1295K8551
15966H6950J0342k3403l2346M075R569k9335j1853O716N6781K9741m9442p105
15954E0690L755m3991L2015M2380M424m7571j2439L2572J0457K5722m0530l4153
15942B3331q227j6420K1582l1294j823L5571j2833k4784l5687k5542k674L1698
15930d7102j2226l5628j7229J033O5444Q2145Q3019n4157j7978L0199j3916r3759
15918c0155l9124M2954L4911J1241k6561K001k8862J0327K0577p800J095n4390
15906f3786J6513j9345k6979L0476L6650k7284J4375M2609L6051j612l4886j0284
$$ plain form
15990 -36811 -99056 -71786 4260 -1979 12048 19408 35297 43989 8104 -34373 -23789 43695
15978 43695 66722 95207 119400 57001 80837 60285 92622 71014 73604 79694 58399 86950
15966 86950 97292 73889 41543 45618 55187 25852 13999 20715 77496 107237 57795 50690
15954 50690 54445 10454 42469 84849 89273 41702 29263 61835 72292 98014 57484 23331
15942 23331 15104 -1316 20266 -11028 -12851 22720 9887 -14897 -50584 -76126 -78800 -47102
15930 -47102 -59328 -94956 -112185 -111152 -45708 36437 119456 65299 47321 77520 63604 -30155
15918 -30155 -69279 -26325 8586 19827 -6734 -4733 -33595 -23268 -2691 -10491 -9396 -63786
15906 -63786 -47273 -66618 -93597 -63121 -26471 -53755 -39380 3229 39280 37668 2782 -7502
15894g502j4493k5630N5497J3637M357O3140J1477k306j3110k5212n2074J1879
15882A9660P249n4856l7406j8140L5138n291j7458N8335k7405r9301J5025J6424
15870a08026K9608K8937L475j2871J902N4469R846n9737m9806N3737j4539n5493
15858a18498J2833J3060k0592k6243L321L2974L5069L2936L9026j8669L2796m4288
15846b6275r3766L5506k1178j2652M3413K6372N6069N7598k3990k6033n0327M481
15834c0782M2265j3964j1555M0034K9583K4906J5462k9516p6409J1909k2124J2050
15822h141L000L8286m511l5062K5946P0093R364o2811o0201K3444M5255r703r070
15809B5889m4658k6235O6113m5386l8735N0966N8392M3228R917q0632m4540m6940
$$ plain form
15894 -7502 -21995 -47625 7872 21509 25866 89006 100483 98177 85067 59855 7781 19660
15882 19660 26909 -27947 -65353 -83493 -48355 -53646 -71104 -12769 -40174 -139475 -124450 -108026
15870 -108026 -78418 -49481 -46006 -58877 -56975 -2506 7340 -52397 -102203 -48466 -63005 -118498
15858 -118498 -105665 -92605 -113197 -139440 -136119 -103145 -68076 -35140 3886 -14783 18013 -26275
15846 -26275 -120041 -84535 -105713 -118365 -74952 -48580 7489 65087 41097 15064 -35263 -30782
15834 -30782 11483 -2481 -14036 25998 55581 80487 95949 66433 -9976 1933 -20191 -8141
15822 -8141 -5141 33145 28634 -6428 19518 89611 98975 36164 -24037 -593 44662 34959 25889
15809 25889 -18769 -45004 21109 -24277 -63012 -12046 46346 89574 99491 18859 -25681 -72621
15797g2621l5911n9812L6473J15753P7643P636q1887j6733P1902O3645m506j9680
15785H1902j8004P177J8738j7546k867k8256m5587O4692L0053q1165m4493M1525
15773F169j7107j8254L1748Q310P000P7087M2042p2104k2975l7157j7812O9601
15761E6548M9403m8575o0466l9602O003O4733L6647m2825j6664J3171j2664j5502
15749i793P5249K2801k8137K1612K4250m3869n2395K2308L0339k3680j3837K8922
15737E3770K564l3769K9699L2009l1294l5953j4853L257l2435P831L2789J027
15725A4642p6832M6364M6104O79k5065p1432K8654L2681K4756N7016K706l8574
15713D1699k341l0371J3722p0175l699J6875k4729N1440K4673l3283m4396K4761
$$ plain form
15797 -72621 -108532 -168344 -131871 -16118 61525 69161 -12726 -29459 42443 106088 101582 81902
15785 81902 63898 71075 89813 72267 69400 41144 -4443 60249 90302 9137 -35356 6169
15773 6169 -10938 -29192 2556 10866 17866 94953 136995 64891 41916 4759 -13053 56548
15761 56548 105951 57376 -3090 -42692 -36689 28044 64691 21866 5202 18373 5709 -9793
15749 -9793 65456 88257 60120 81732 105982 62113 9718 32026 62365 38685 24848 53770
15737 53770 56334 22565 52264 84273 52979 17026 2173 5430 -27005 -19174 13615 14642
15725 14642 -62190 -15826 30278 30957 5892 -65540 -36886 -4205 20551 77567 80273 41699
15713 41699 39358 8987 22709 -47466 -51165 -34290 -59019 -7579 17094 -16189 -60585 -35824
15701c5824J9724m2265O234L5928K7178k0200n0986L9139P8709j055m1961n1440
15689c6819m5026j8918L1274Q3050J4093K1467M800J7658J4456P455m5852j6847
15677C0791k349O7415L1555l5932l8290K2165o4572o9892M4881J5768K7998L0953
15665F0491o845P665J7316Q230o2J4974l4229J8630j9659L2507P886j4689K646
15652I4861k6213j03467o112m1614Q3039N3125j305L2327N001J538M735m0523
15640E5392m4663K6900K1704L0488J7022o103n160P966j8510n9721J1190n6347
15628a9842j03M7936j5072p752M226o912M2784L6103J5639o7249p0206k7027L160
15615f4315l1209J9207q72J7543J3179p494r585l4757m4588j2999Q636K0625N6288
$$ plain form
15701 -35824 -16100 -58365 -52131 -16203 10975 -9225 -60211 -21072 57637 56582 14621 -36819
15689 -36819 -81845 -100763 -69489 13561 27654 49121 53921 71579 86035 93490 47638 30791
15677 30791 28442 95857 127412 91480 53190 75355 10783 -59109 -14228 1540 29538 60491
15665 60491 53646 61311 78627 86857 86795 101769 67540 86170 66511 99018 106904 92215 94861
15652 94861 68648 -34819 -40931 -82545 494 53619 52314 84641 89642 91180 95915 55392
15640 55392 10729 37629 59333 89821 106843 100740 95580 103546 85036 25315 36505 -19842
15628 -19842 -19945 27991 12919 5167 9393 2481 45265 81368 97007 29758 -40448 -67475 -64315
15615 -64315 -95524 -76317 -77189 -59646 -46467 -53961 -63546 -98303 -142891 -155890 -147254 -126629 -70341
15602g0341Q2221P5085j700L5264M6745o87l9074j0896r949p0060q8676j0591
15590f2659L102K4626m394M7993M7642Q576P259j2339l9930P828J1782r2440j2806
15577f5760J4739N8656J5044j7075M3778m9210n0534j8154o048J07414L3263p583
15565E8530j6556m2547o1619K958J7675J2839J5212p8201k6389J6523R8148P3202
15553F9775K0623k8318q757J3652K773J7529K0756K3899p359j9272o3248o014
15541C6039k2694o3643K8787O6873J2765K386l6752j6685l0892k7669p914M6172
15529a3227Q722K4643p6153l6300M2033j2549L6979P1369l2031k5843o9884M6228
15517c6013N2705N7951L6819k5427o2093m2545J5465o5001o683l395l0241K5230
$$ plain form
15602 -70341 11880 86965 85265 120529 167274 166587 127513 116617 106668 36608 -52068 -62659
15590 -62659 -59557 -34931 -39325 8668 56310 64886 72145 59806 19876 27704 39486 -52954 -65760
15577 -65760 -51021 7635 22679 5604 49382 172 -50362 -68516 -74564 32850 66113 58530
15565 58530 41974 -573 -62192 -59234 -41559 -28720 -13508 -91709 -118098 -101575 -3427 69775
15553 69775 90398 62080 53323 66975 69748 87277 108033 131932 124573 105301 42053 36039
15541 36039 13345 -50298 -21511 45362 58127 60513 23761 7076 -23816 -51485 -59399 -13227
15529 -13227 -4505 20138 -56015 -92315 -50282 -62831 -25852 45517 13486 -12357 -82241 -36013
15517 -36013 16692 74643 111462 86035 23942 -18603 -3138 -68139 -74822 -78217 -108458 -83228
15505h3228l129M2963P2554M6986j5062j8638j7139j9164K6466J9231m0302k6760
15493a5222k8077J0013O6564M559q685m5700k4027K3425J8386L8270L5458k6532
15481D8432m0769n2829l4703j3258M9431M2444M0257K940k1298k2676o624J2564
15469C911K2267o1l9898k8701k5794m838L6848P5661J9028o387L2383l5847j6736
15456C1836J2640L0553j8118j383O026n1588j1964J6288m3004j3059K0974j5319
15444c6118l6465m348N9488N6961p05m3545l651j5994N2675L3044k1282J980K5928
15431F7968j3573J2693j1344k2219k8413k6628l2110M624L2682O277o028J7591
15419A520o6994L1692J0866j5552K3646p896M7780o084o238k13J6734R087j6673
$$ plain form
15505 -83228 -86357 -43394 29160 76146 61084 42446 25307 6143 32609 51840 11538 -15222
15493 -15222 -43299 -33286 33278 37837 29152 -16548 -40575 -17150 1236 39506 74964 48432
15481 48432 7663 -45166 -79869 -93127 -43696 -1252 39005 41945 20647 -2029 -8653 3911
15469 3911 26178 26117 -13781 -42482 -68276 -73114 -36266 39395 58423 52036 84419 48572 31836
15456 31836 44476 75029 56911 55528 61554 9966 -1998 14290 -28714 -41773 -20799 -36118
15444 -36118 -72583 -76931 -17443 39518 38813 -4732 -8383 -24377 28298 61342 40060 42040 67968
15431 67968 54395 67088 55744 33525 5112 -21516 -53626 -49002 -16320 -10043 -16071 1520
15419 1520 -65474 -33782 -22916 -38468 -14822 -22718 25062 18978 12740 12527 29261 38348 21675
15406B1675p990J408P58N964P022l9668J7919N580O963J2547o801l6941K6469
15393A4905j6048r1891j7445K1818Q328J05794J2449l4181n340j6150o427L178
15381b1010L111R576o947L0733k8877k6768j5936J2265O8720M3779m841p494k5575
15368C0736J4312n2103k8421r250k917M839K6680O9046k0929m6132K2374j0079
15356a844k5063J2109J1745L4074L0502l8326j6400L0374k778l1702n035n179
15344g523k7041J2543K7744j254j5342m1093L0764K4846K582m6698L6586R5979
15332I2093j0723j5423L0177k7780q254k681n5191K5625l2047R064L9111J3787
15320E7758l9708j0051O762K7338M5762l4031Q615Q3835n4254j9284O403k2290
$$ plain form
15406 21675 13685 15093 15851 21815 28837 -10831 7088 12668 19631 32178 25377 -11564 14905
15393 14905 -1143 -93034 -110479 -88661 -80333 25461 37910 3729 -1611 -17761 -24188 -21010
15381 -21010 -17899 -8323 -15270 15463 -13414 -40182 -56118 -43853 24867 68646 63805 56311 30736
15368 30736 45048 -7055 -35476 -44726 -47643 -42804 -16124 52922 31993 -14139 8235 -1844
15356 -1844 -26907 -14798 -3053 31021 61523 23197 6797 37171 34393 2691 -2344 -7523
15344 -7523 -34564 -22021 5723 4469 -10873 -51966 -21202 3644 6226 -40472 -3886 92093
15332 92093 81370 65947 96124 68344 60090 57409 2218 27843 -4204 4860 43971 57758
15320 57758 18050 7999 14761 42099 87861 53830 62445 146280 92026 72742 79145 56855
15308E6855J5140k2093o7847K0992L9938J389j4827M0936j3791R062j8498n4336
15296g080r783Q261L7527Q555n8333k5212K1908N7629K7159m1986m6972k0016
15284d8343J1206J9679J2878Q5324M327p6872j0907k6851J892N0590K1228L6033
15272H0184L4142m513p6571q712l333l9790J1052k7731O3331j288J445P792L7111
15259G3119L620N5162o1000m2590j0825M122l1853j1269L7179j0481k821J8593
15247B0956J3926k6396p113j4727M3208N6272J5730j0890K7500q922j6494m2619
15235E0431o2610m8807P370L3663Q3137k4083J367M5254K9072k1141l2457k7775
15223C3421j9168l4807j8791N1085O2564J2000m79k0845r0199k9816j877l4353
$$ plain form
15308 56855 71995 49902 -17945 3047 42985 44374 29547 70483 56692 65754 47256 -7080
15296 -7080 -16863 -8602 28925 37480 -20853 -46065 -24157 33472 60631 18645 -28327 -48343
15284 -48343 -37137 -17458 -4580 80744 85071 8199 -2708 -29559 -27667 22923 44151 80184
15272 80184 114326 109813 33242 24530 21197 -18593 -7541 -35272 28059 26771 28216 36008 73119
15259 73119 76739 131901 70901 28311 17486 21608 -10245 -21514 15665 5184 2363 20956
15247 20956 34882 8486 1373 -13354 29854 86126 101856 90966 118466 109544 93050 50431
15235 50431 -12179 -60986 -53616 -19953 63184 39101 40468 85722 114794 93653 61196 33421
15223 33421 14253 -20554 -39345 11740 74304 86304 85825 64980 -25219 -55035 -56912 -91265
15211i1265j7606J6175N4942L6598O1824j3140o386n0549R618K8276j0758l6236
15199a8507m7081k3426L8843N1017N6624N8820m5853l6098j2000n1666k7437P143
15187d9621N6430P3679n081K0864n4677p2117k6727L0365O1199j2978m6270q714
15175c3648k1288K8545K4651j5745K6341N1028N597J1151m3449l1023n3688o645
15163e8173K5856M0143k792l6452L8753J3722m3753K257N4202j590k7614R70M8186
15150E3715L5930m5264o766n4354o0568K6473J2302R148N0270k9047k4605n7799
15138i0565K4067O155L5811K7877k4371l4411L8028N8241k1757J5342k7135n5605
15126d8323N2053Q5863k9936q2362m188O6814J2337J2079n3036l9153l783R002
$$ plain form
15211 -91265 -108871 -92696 -37754 -1156 60668 47528 41142 -9407 211 28487 17729 -18507
15199 -18507 -65588 -89014 -50171 846 57470 116290 70437 34339 22339 -29327 -56764 -49621
15187 -49621 6809 80488 75407 96271 41594 -30523 -57250 -26885 34314 21336 -24934 -33648
15175 -33648 -54936 -26391 -1740 -17485 8856 59884 65481 76632 33183 2160 -51528 -58173
15163 -58173 -32317 7826 5034 -31418 7335 21057 -22696 -20439 33763 32173 4559 5529 53715
15150 53715 89645 44381 37615 -16739 -77307 -50834 -38532 -29384 20886 -8161 -32766 -90565
15138 -90565 -66498 -60343 -24532 3345 -21026 -55437 -17409 40832 19075 34417 7282 -48323
15126 -48323 3730 89593 59657 -22705 -26893 39921 52258 64337 11301 -27852 -31635 -22633
15114b2633l988j0429M9767K3430K9234l0006J2544J0801o6567p4185J909J1935
15102f8188K3069k4765m6569j2074M8839Q6965p12k5504l3258N306N2413K4242
15090B9764m345k6191L1589p585j1896M7156L5958L8870O938p9020m2294M6108
15078F5052L3536K0174L0696l6144q3218k1652j2395o05L2532R1510K8594l3254
15066A14826l3952L721P8804o4333o0808L047K5343N2387k1867k6764m513l1982
15054C3909k4951L6142J8074L9096J8995L1154k1329k6143p803M236J5222J9874
15042A36476n1509j9473K2220k1847o0445R851J08798k1567l1540n2427O063r646
15030A4954J1814L4842k536k5793P902M9838L5022o286k5144M0543o395m5240
$$ plain form
15114 -22633 -26621 -37050 12717 36147 65381 35375 47919 58720 -7847 -82032 -80123 -68188
15102 -68188 -45119 -69884 -116453 -128527 -79688 7277 6565 -18939 -52197 -46891 5522 29764
15090 29764 25419 -772 30817 23232 11336 58492 94450 133320 140258 61238 18944 65052
15078 65052 98588 118762 149458 113314 30096 8444 -3951 -4556 27976 119486 148080 114826
15066 114826 80874 84595 163399 99066 38258 41305 66648 119035 97168 70404 65891 33909
15054 33909 8958 45100 63174 102270 121265 152419 131090 104947 97144 101380 116602 136476
15042 136476 84967 65494 87714 65867 5422 15273 124071 102504 70964 18537 24600 14954
15030 14954 26768 61610 59074 33281 41183 91021 126043 119757 94613 135156 128761 83521
15018H3521k5874N3267L6343k7205q8079p4282j8805L4926J8853j3921J6507k561
15006g310K0059l8650m705j8618R480J6727k7166k5617L0090k9278J785P1296
14994a907N6358P7330M5722n9131o6939K0463k378M403l5613j0626N1880K0508
14982A00070r500l5903p2790m0080J2760J9824n0457j5643K8312L9514N2567Q6449
14970A15123J9399O1002l1770o9136j4809n140k4516l814l4047j4354l8836o5675
14958a06573K6427M2498M5935M0835M0194m5830o641M7736O724O2063N9376n3154
14946A59590o1702j4079j051k3339r3089Q688J7017j000M7892M0497J0179j560
14934H8043n6149n2476j7001M8116Q7739J4297J5445J1292j0459l593K3800P7000
$$ plain form
15018 83521 57647 110914 147257 120052 31973 -42309 -61114 -26188 -7335 -21256 -4749 -7310
15006 -7310 12749 -25901 -30606 -49224 -39744 -23017 -50183 -75800 -45710 -74988 -73203 -1907
14994 -1907 54451 131781 177503 118372 51433 71896 69518 73921 38308 27682 79562 100070
14982 100070 90570 54667 -18123 -58203 -45443 -25619 -76076 -91719 -63407 -23893 28674 115123
14970 115123 134522 195524 163754 94618 79809 74669 50153 46339 12292 -2062 -40898 -106573
14958 -106573 -80146 -37648 8287 49122 89316 43486 36845 84581 91305 153368 212744 159590
14946 159590 97888 83809 82758 59419 -33670 -24982 -7965 -8965 38927 79424 89603 88043
14934 88043 31894 -20582 -37583 10533 98272 112569 128014 139306 128847 125254 149054 226054
14922B26054L2045P0344Q8397P6431J43875J77685K53910J90434K31518K06012
14912A696705J09517L7682n7386j18885j88593k26867k80494j96848j68931k15790
14902C90110j18164m8674L1510l1063l0947r9286o8566j1904J8260L6841J0535
14891G8652J2914l0929R878K3131k2965j06260J830L9611o760k3645M1466M6976
14879F3899j1703K577l0961K5174Q754k0271k7142k0330J05657m414m9872m2245
14867h77m4393P1675N0103M7090k9733j6558j1707j3115o494k9871K1305r40K9858
14854F6343P5655M52l7440q3428n8456j4j0848O3823O7367K7328k8615k1994J289
14841F1462j8813O571j5893N5351j245j9694j023J254o806o205j4882M2689L7727
$$ plain form
14922 226054 258099 328443 416840 493271 637146 814831 1068741 1259175 1490693 1696705
14912 1696705 1806222 1843904 1786518 1667633 1479040 1252173 971679 774831 605900 390110
14902 390110 271946 223272 254782 223719 192772 93486 24920 13016 31276 68117 78652
14891 78652 91566 60637 70515 93646 70681 -35579 -33749 5862 -898 -24543 16923 63899
14879 63899 52196 54773 23812 48986 57740 37469 10327 -10003 95654 91240 41368 -877
14867 -877 -45270 26405 76508 123598 93865 77307 65600 52485 45991 16120 37425 36485 66343
14854 66343 141998 142450 105010 21582 -36874 -36888 -47736 16087 83454 110782 82167 60173 61462
14841 61462 42649 49220 33327 88678 87433 67739 66716 67970 61164 54959 40077 82766 120493
14828A20493P390n8797j8056j1947k768L6835O415M6125j9225o2879k9388R795
14816B3993J4869J8568K5652K16L075o225j9134N3188j4658J8773J6090m991m7421
14803H1995l8021M1148q864m844K2696l7184k4934j1187l6709O9977P0576M6749
14791A71398N690m8069k9872p5384J5752J2189J0411L0245P5409q627k3067j5874
14779A20201J0056N0643p43n9800r375k5701l3298N6162M6430o1042n2618P3157
14767A14072O3653K3727j7020l7751J6966K9031j2794j6227k7811K1784J2681
14756A70311j8415l7819N384p159O9133J5030l5118j9304N8926k8413r9600R625
14744H2581j1039Q687K0589k8280M8919l3872r1139n4821P4505J15988L811r2250
$$ plain form
14828 120493 127883 69086 51030 39083 36315 73150 79565 125690 106465 43586 14198 23993
14816 23993 38862 57430 83082 83298 86373 80148 61014 114202 99544 118317 134407 129416 81995
14803 81995 43974 85122 76258 71414 94110 56926 31992 20805 -15904 54073 124649 171398
14791 171398 177088 129019 99147 23763 39515 51704 62115 92360 167769 159142 136075 120201
14779 120201 130257 180900 180157 120357 110982 85281 51983 108145 154575 93533 40915 114072
14767 114072 177725 201452 184432 146681 163647 192678 179884 163657 135846 157630 170311
14756 170311 151896 114077 119461 112302 181435 196465 161347 142043 200969 172556 72956 82581
14744 82581 71542 80229 100818 72538 121457 87585 -3554 -58375 16130 132118 135929 43679
14732D3679l7486l3163O3836J03964M0570n4021r166k0198K6324J0892K5678q173
14720A52736J2576J6794K543M749M2095j1397k2168L8875M3720k1228J017K2685
14708B82997j9169l5616q4182q9477N6367N3667o836j4923j5443j2168N1600P7638
14696B44455M7188J5064o0391l5345k2138l4588K3979J9071p4308l3385R626k3053
14684G6175j2234j6785N744Q0442J7068m0564n561q6049o0006j1081L9289M0982
14672B7420l7837j6140N3878j8016k1508K0208J3885K188J4942M4917O8403k162
14660A50178k2142k1352M7088J19862M4450m3138P587N4208M0688o2544N0402
14649C65287P3361K0733n8035M2172K7752j0900k8434j4675p5413o9409K5253
$$ plain form
14732 43679 6193 -26970 36866 140830 181400 127379 118213 98015 124339 135231 160909 152736
14720 152736 165312 182106 184649 189398 231493 220096 197928 236803 280523 259295 260312 282997
14708 282997 263828 228212 144030 54553 110920 164587 157751 142828 127385 115217 166817 244455
14696 244455 291643 306707 246316 210971 188833 154245 178224 197295 122987 89602 99228 76175
14684 76175 63941 47156 52900 133342 150410 109846 104285 18236 -41770 -52851 -13562 27420
14672 27420 -10417 -26557 27321 9305 -12203 8005 21890 24078 39020 83937 152340 150178
14660 150178 128036 106684 153772 273634 318084 274946 282533 336741 377429 314885 365287
14649 365287 438648 459381 401346 443518 471270 460370 431936 417261 341848 272439 297692
14638B97692L7781K0903J55m1703m7563P832l6956l6503L9680J5479j4937q6810
14626A55050k5114N7153K4566P2980j3736J6535j2956j3119l7443n1055M7451
14615B20312J5745n1069K3138K0561l9592j2843l8403j6873R1419P9376m0060
14604B51711N1115P3156Q9147J36299J09355J01189P8076K3279M3900k782r8279
14593H56166k8757l7694O859m6921p1468P20o728j5038L3897p166p1713r7035
14581E15122o5610n0728p3654m3763k7130J0351J8482L8657m956n1219j1121J3659
14569B68090R971l7949K612N1154J7099k2236q16K4140Q35J7829j7772J9745J8348
14556C51050l0162l3123J7885L9015L419p313N0807J4981m5625R940m9831j9651
$$ plain form
14638 297692 335473 356376 356531 314828 267265 275097 238141 201638 241318 256797 241860 155050
14626 155050 129936 187089 211655 284635 270899 287434 274478 261359 223916 172861 220312
14615 220312 236057 184988 208126 228687 189095 176252 137849 120976 212395 291771 251711
14604 251711 302826 375982 465129 601428 710783 811972 890048 913327 957227 954445 856166
14593 856166 827409 789715 796574 749653 678185 678905 672177 657139 691036 683870 612157 515122
14581 515122 449512 398784 325130 281367 254237 264588 283070 321727 316771 265552 254431 268090
14569 268090 278061 240112 242724 293878 310977 288741 287925 312065 312900 330729 312957 332702 351050
14556 351050 320888 287765 305650 344665 348084 340771 391578 406559 360934 370874 321043 301392
14544C01392N2275K5896k450k135Q1044K4535L342k3976L945N6929J4649Q1897
14532F17343L7434j9649j7805L872n5174L8119J7915m3098m0507L6881Q6634P3545
14520G35510M5828l1602l0670P1772R8764N1507N1407k1408Q1233K7255L2489
14509A112085K7681R7711P9401q662P1191J36376Q653j293M8626P2638N5019J03116
14497A802542J41464J53282L2043R0339J74924J70553J18171J47177J45188K42798
14487C218481K08473K35465L73454M91314O21553P57465R60735J114237J299150
14478I280327J543150J641303J684790J686558J811006K096650K485443L277265
14470B5506492M634716O805404J0914624J7942803K7223490L6666235M4505556
$$ plain form
14544 301392 353667 379563 377113 374978 456022 480557 483899 459923 463868 520797 535446 617343
14532 617343 654777 635128 617323 621195 566021 604140 622055 578957 538450 575331 661965 735510
14520 735510 781338 749736 719066 790838 889602 941109 992516 971108 1052341 1079596 1112085
14509 1112085 1139766 1237477 1316878 1308216 1379407 1515783 1524436 1523143 1571769 1644407 1699426 1802542
14497 1802542 1944006 2097288 2129331 2219670 2394594 2565147 2683318 2830495 2975683 3218481
14487 3218481 3426954 3662419 4035873 4527187 5148740 5906205 6866940 7981177 9280327
14478 9280327 10823477 12464780 14149570 15836128 17647134 19743784 22229227 25506492
14470 25506492 30141208 36946612 47861236 65804039 93027529 129693764 174199320
14463A74199320M5761331M4083116L5895447K4709291J2547225l539003j6109560
14456C17547167l0122089l9868424m5890280m7513646m2312577l3920722k3877460
14449E4041969j5352999r279096n610736l524667k464155j845392j642418j478396
14441A2844110j329439j318297j320740j273707j169342j014037q21888o47972
14433C948688m59341l16325l50786k13351j42059j89042j93184j54304j36247
14424A794049j39864j30720r5938j17621r3237n8903m4541m2837o5356j00640
14414I04392k2901l4144k4490k8326l9603q6131p1991o4964j6053P6357L1441
14403F23587m9670L8634k8111l1592j3166R38N1373k0100j18406O52m252j4816
$$ plain form
14463 174199320 219960651 264043767 299939214 324648505 337195730 333656727 317547167
14456 317547167 287425078 247556654 201666374 154152728 111840151 77919429 54041969
14449 54041969 38688970 29409874 23799138 20274471 17810316 15964924 14322506 12844110
14441 12844110 11514671 10196374 8875634 7601927 6432585 5418548 4596660 3948688
14433 3948688 3489347 3173022 2822236 2608885 2466826 2277784 2084600 1930296 1794049
14424 1794049 1654185 1523465 1427527 1309906 1216669 1157766 1113225 1070388 1005032 904392
14414 904392 881491 847347 822857 794531 754928 668797 596806 531842 515789 592146 623587
14403 623587 573917 612551 584440 552848 539682 540620 591993 571893 453487 454139 449887 435071
14391D35071k0230l8453L7983l6869m8843j123O4147n5859j3668l5727l7006k5060
14379B24363J1281L8496j5105J5736M0404O1182O4573J5281j1572K8481O8044
14368E41164k195q8847k0253J5175o626m3105o2909k0647j4064o6180n1448J2756
14356A92821k4886q177j652O0828j6134p3611k332O998p643K4564o593n5620p2982
14343A5581K7939l0766l6487M8315k0244l1873L8608J5829j09355k9082M6325
14332f5210O2396Q4839N0478K4508L8402M2021J0875n4990k8966l5893r3451m294
14320C0715o409j99M2874Q9913j331l8083q1794q1154k774L5201N016M2057J0816
14307D4848K0537N669k3095j2939M0590J08266J49927J18693J22093R4978Q6632
$$ plain form
14391 435071 414841 376388 414371 377502 328659 327536 391683 335824 322156 286429 249423 224363
14379 224363 235644 274140 259035 274771 315175 376357 440930 456211 444639 473120 541164
14368 541164 538969 450122 429869 445044 438418 395313 332404 311757 297693 231513 180065 192821
14356 192821 167935 159758 158106 218934 202800 129189 126857 133855 126212 150776 144183 88563 15581
14343 15581 43520 12754 -23733 24582 4338 -27535 11073 26902 -82453 -111535 -65210
14332 -65210 -2814 82025 132503 157011 195413 237434 248309 193319 164353 128460 35009 30715
14320 30715 24306 24107 66981 156894 155563 117480 35686 -45468 -48242 -13041 -8025 34032 44848
14307 44848 65385 71054 47959 35020 75610 183876 333803 452496 574589 669567 756199
14296G56199J22580K4595m8273j10207j44664j68530j60391o0439p7874p9582
14286E3414k5017P40K082m8085m7816j0213q0292m7994K0037P6889N3281k4600
14274g7574r7361J0067m5624o5610J149k935L7903L3344p537N9080P072J9548
14262a28478L541j0741M9596N7938M3531J3268J3751K4609o3744l0101O5732Q1033
14250A19935Q507k2416L7560j3295j5011m0495n3998j0694L591J658M4637L4387
14238I4366n348K121k7754J681o158L682L171k9558q4822l6693K3472k1186M0561
14225d2465m456l8426m6026n5983J4112L4968L8963K2201Q080M81J655M4541K6233
14212C878n3542j8120J8396O5662r539J820R218R337p2412q066J7486P4439K4953
$$ plain form
14296 756199 878779 903374 855101 744894 600230 431700 271309 210870 132996 53414
14286 53414 28397 29137 31219 -16866 -64682 -74895 -155187 -203181 -183144 -106255 -52974 -77574
14274 -77574 -174935 -164868 -210492 -276102 -274953 -277888 -239985 -206641 -214178 -155098 -148026 -128478
14262 -128478 -124937 -135678 -86082 -28144 15387 28655 42406 67015 3271 -26830 38902 119935
14250 119935 128442 106026 143586 130291 115280 74785 20787 10093 13684 15342 59979 94366
14238 94366 89018 91139 63385 65066 58908 62590 65761 36203 -48619 -85312 -61840 -83026 -42465
14225 -42465 -46921 -85347 -131373 -187356 -173244 -138276 -99313 -77112 -69032 -68551 -66896 -22355 3878
14212 3878 -49664 -67784 -49388 16274 6735 8555 17773 27110 -45302 -53368 -35882 38557 63510
14199F3510n3642j0292J2421k2763M5699k4060J279N493r985l0563M8394N2790
14187G8281K0217k2721o7069m921j3533m7254j0380J3220J8837l5043j7699Q2926
14175e139o674p7478Q695L5012j1077M0653j7086k9255K6978M9600R295L4164
14163E7688j3281j23819q7011M339M187r406K4342J9167J9950N4063N0565N8628
14151E9412k8679p0200n347N1400L3076n822l8700N088J5009J8225R5147l7240
14139I1369R817m0330n6736L1426j8578k4897l2426K8398N7665M3705K203l9656
14127E1960o7323q1236l138O4864M6096k4482J6430K440L09n9438J5651K0286
14115a7581J3894J4739q351p535k3143n4653j8714K7358L3767J4224J8340N0675
$$ plain form
14199 63510 9868 -424 11997 -10766 34933 10873 12152 17645 7660 -22903 25491 78281
14187 78281 98498 75777 8708 3787 -9746 -57000 -67380 -54160 -35323 -70366 -88065 -5139
14175 -5139 -11813 -89291 -80596 -45584 -56661 -16008 -33094 -62349 -35371 14229 23524 57688
14163 57688 44407 -79412 -166423 -162084 -157897 -167303 -142961 -123794 -103844 -49781 784 59412
14151 59412 30733 -39467 -44814 6586 39662 33840 -4860 228 15237 33462 128609 91369
14139 91369 101186 60856 4120 35546 16968 -7929 -40355 -11957 45708 89413 91616 51960
14127 51960 -15363 -96599 -99737 -34873 11223 -13259 3171 5611 5920 -53518 -37867 -17581
14115 -17581 -3687 11052 2701 -4834 -27977 -82630 -101344 -73986 -40219 -25995 -7655 43020
14103D3020k555J0864r219j8045l5258l3877j8602k0864K130J7839K1432m3661
14091h6796J3250N1991o627L6856P645j4013o0790j468J17611N6283k9976j530
14079H2436l3330n3184r1450j9570N5838k0832J7908n2250j3019M5906J03422
14068B1875L4761L3015l3195j8280J7924K8867m5877q5189L1441k9987j9234K9293
14056c4586L988L6737L0211o220J1828M975m063R59m3161L3412l5560q929j0320
14043b0729j843K4694L4984Q658L3134j27736l2239R9185j1294J8437n265J6552
14031C6538o056Q480L8244p121J5688Q146l399q217k5135l8163K7231O1638j7434
14018I0440J1800m202m5937p9011o890P3703N1519J9394N5551J14704Q2737J97928
$$ plain form
14103 43020 40465 51329 42110 24065 -11193 -45070 -63672 -84536 -82406 -64567 -43135 -86796
14091 -86796 -73546 -21555 -28182 8674 16319 2306 -58484 -59952 57659 113942 83966 82436
14079 82436 49106 -4078 -95528 -115098 -59260 -80092 -62184 -114434 -127453 -81547 21875
14068 21875 56636 89651 56456 38176 56100 84967 39090 -46099 -14658 -44645 -63879 -34586
14056 -34586 -30598 6139 36350 30130 41958 46933 42870 43829 668 34080 -1480 -10409 -20729
14043 -20729 -22572 2122 37106 45764 78898 -48838 -81077 18108 6814 25251 19986 36538
14031 36538 30482 38962 77206 70085 85773 93919 90520 82303 57168 19005 46236 107874 90440
14018 90440 102240 98038 52101 -26910 -33800 39903 91422 110816 166367 281071 363808 561736
14006E61736K88430J95813J93296J98485J54590P2783L3106P482o8730j51581
13996A485410k26452k73494k52260k36291j57346p5519o0328k9284k2032j2944
13986A39460r178l8464o3582K9735J9990K6050p459o860J1304O0967J06715R4344
13974C63022L6497M7463n956N9114K003k9524K4979L8875m2539q6738r2842l6912
13962B77442p4522p9162q6401n4448j5953k179j6392j0068l7896l4609Q6919N6190
13950H921j4731P4567J0310o0796m6228n0317J3232n300j0941r108L0205M4578
13938a5608O8658O8119p3433n3818J8440l0813j8959L9180l3156j3259K9868P009
13926g772J5138m1478m128J0143n5182j382J6317J5230m196j8298j0150M4079
$$ plain form
14006 561736 850166 1045979 1239275 1437760 1592350 1665133 1698239 1705721 1636991 1485410
13996 1485410 1258958 985464 733204 496913 339567 264048 203720 174436 152404 139460
13986 139460 130282 91818 28236 57971 77961 104011 96552 89692 100996 161963 268678 363022
13974 363022 399519 446982 441026 500140 502143 472619 497598 536473 493934 407196 314354 277442
13962 277442 202920 123758 37357 -17091 -33044 -35223 -51615 -61683 -99579 -134188 -47269 8921
13950 8921 -5810 68757 79067 18271 -27957 -78274 -65042 -70342 -81283 -90391 -60186 -15608
13938 -15608 53050 121169 47736 -6082 12358 -18455 -37414 1766 -31390 -44649 -14781 -7772
13926 -7772 7366 -34112 -38240 -28097 -83279 -84661 -68344 -53114 -57310 -75608 -85758 -41679
13914d1679L6610L5007O566R540L968j9198j1736m1144k5254r368J8459k5165
13902f3394p8226M9590O5136K5080K3239k3668k8410L9444K9250k6142o0601j4081
13890f2783R492P5944M1436j4807n17l312o3569k0366q841k065M8412O7903j6583
13877E0344J3232j3632j0596L2733m07J085m3842j1702m2560o2948Q505k2886
13865a02674l3487J4089O6673P1364J6146J2677O36n393L6979O5571k8923m2129
13853G1529k1346N1365N0788k3468J162m2685k9933N796J2188r1551m6042K3491
13841c8706Q546M4887N552n0294k1155J2899K4656R167l4358l9965K2684J9021
13829c7066O2172K0489l3247K2708L8318m6851l4155M608N5759K0639J9112k1000
$$ plain form
13914 -41679 -5069 29938 36504 46044 50012 30814 19078 -22066 -47320 -56688 -38229 -63394
13902 -63394 -141620 -92030 -26894 -1814 21425 -2243 -30653 8791 38041 11899 -48702 -62783
13890 -62783 -53291 22653 64089 49282 48765 45453 -18116 -38482 -47323 -49388 -976 66927 50344
13877 50344 63576 49944 39348 72081 71674 72759 28917 17215 -25345 -88293 -79788 -102674
13865 -102674 -136161 -122072 -55399 15965 32111 44788 45424 40031 77010 142581 113658 71529
13853 71529 50183 101548 152336 128868 130030 87345 57412 63208 75396 -16155 -62197 -38706
13841 -38706 -30160 14727 20279 -30015 -51170 -38271 -13615 -4448 -38806 -78771 -56087 -37066
13829 -37066 25106 45595 12348 35056 73374 26523 -7632 -3024 52735 73374 92486 71486
13817G1486l9156j69L6274n3324j8205M5340m7681o4256N753K553M0247N8770
13805C7632j2475m728M0838Q950q2002k149N3766L2940O547j9314k9339j0031
13793B0635N9946L8159l2012j7077j0875L157l1069K0542j1851o271J6306m5282
13781D308k2767M2876M2167J0905l3541j480n278p136j3297j01291l6387n626
13769a26547L5189K0515k4571k2393k1444O2557M2431N0019K7438j7360j7385
13758H449j8394J0587J6204L35k9146M2821M6486J0929j6011m5247m3827J6506
13746c08l887l4444j1299Q162K3942J9999J8152K3375p1672J8109K5548m2313
13734b6636k6092M7918L3569k5077q8985J7137M4986l9487k3715L6327K9001J1541
$$ plain form
13817 71486 32330 32161 68435 15111 -3094 42246 -5435 -69691 -63938 -61385 -21138 37632
13805 37632 25157 20429 61267 70217 -11785 -13934 39832 72772 79319 60005 30666 20635
13793 20635 80581 118740 86728 69651 58776 61933 30864 51406 39555 33284 49590 4308
13781 4308 -18459 24417 66584 77489 43948 42468 37190 30054 16757 -84534 -120921 -126547
13769 -126547 -91358 -70843 -95414 -117807 -139251 -76694 -34263 15756 43194 25834 8449
13758 8449 -9945 642 16846 17181 -11965 30856 77342 88271 72260 27013 -16814 -308
13746 -308 -4195 -38639 -49938 -41776 -17834 2165 20317 43692 -27980 -9871 15677 -26636
13734 -26636 -52728 -4810 28759 3682 -85303 -68166 -23180 -62667 -86382 -50055 -21054 -9513
13722i513M1480K8830N6494j2247r598j2284M446l4160m7506n924L0332L8357
13710F8707K1176r4177o9113O1311J5836k5222l858Q9304K6643J5563N0533k9363
13698A27340n9629l3379l7785J4399Q096r243p9302N730M5560M3132n853p4420
13686e5354M7249L3246l0278L7662M1591m492o577K4460K1490K0290j3854N841
13674A21274j9274K2227J5749J9751m1886J6534M992J9804J869l2421r025m7819
13662G1775O3896m451p7357n0679l8669l228J4481J1621N3363J1650K0880l736
13650F9546J90l21l5989j8941M668O6308o8876q069j5621l2601J7672M0265M78
13637A8709L6438k8029n4O054j4840k0261j2024o3149j0068J5771K0252j0678
$$ plain form
13722 -9513 31967 60797 117291 105044 95446 83162 87608 53448 5942 18 30350 68707
13710 68707 89883 -4294 -73407 -12096 3740 -21482 -25340 63964 90607 106170 156703 127340
13698 127340 67711 34332 -3453 10946 19042 9799 -69503 -63773 -18213 24919 19066 -55354
13686 -55354 -8105 25141 -5137 32525 74116 69624 63047 87507 108997 129287 115433 121274
13674 121274 102000 124227 139976 159727 117841 134375 139367 159171 161040 128619 119594 71775
13662 71775 135671 131220 53863 3184 -35485 -38713 -24232 -12611 40752 52402 73282 69546
13650 69546 69736 69415 33426 14485 19153 85461 16585 8516 -7105 -39706 -22034 18231 18709
13637 18709 55147 27118 27064 33118 18278 -1983 -14007 -77156 -87224 -71453 -51201 -61879
13625f1879p849N571J470K1365L803l2311J8653J06592K7947n458k6554n982j6776
13612B8592q8263J7292M7506n458j7653j4286l516K1068j2198O354l5951K4799
13600c1714J7898r935m1205J4661j23K0134N9909J6298m4118n2552k2466O664
13588f6549O694K3246J4599J900N4005J4668J522m2565o6546K0785Q149p015k2030
13575e9137n049L5836q458M3928j4783q618n460K5601l027q015r029J0635O3198
13562E7622R3508o3397p4445P354L3292j0104n0373j1816r119J6624l0986J1045
13550c0795j5795J6312N7351P1622M782p9763o2473R608K5726j9954K5411N5076
13538E7108k5872j756l1198n9125o712J9359K6880q191Q464M0845P1168M8260
$$ plain form
13625 -61879 -69728 -64157 -62687 -41322 -37519 -69830 -51177 55415 83362 77904 51350 45368 28592
13612 28592 -59671 -42379 5127 -331 -17984 -32270 -35786 -14718 -26916 -20562 -56513 -31714
13600 -31714 -13816 -23751 -64956 -50295 -50418 -30284 29625 45923 1805 -50747 -73213 -66549
13588 -66549 -59855 -36609 -22010 -20110 33895 48563 50085 7520 -59026 -38241 -30092 -37107 -59137
13575 -59137 -64186 -28350 -36808 7120 -7663 -16281 -21741 3860 833 -7182 -16211 -5576 57622
13562 57622 151130 87733 13288 20642 53934 43830 -6543 -18359 -27478 -10854 -41840 -30795
13550 -30795 -46590 -30278 27073 98695 103477 23714 -38759 -29151 -3425 -23379 2032 57108
13538 57108 31236 29480 -1718 -60843 -67555 -48196 -21316 -29507 -21043 19802 90970 139230
13526A39230p3849p5909k0985J6030M1988p031j4683M5479K0517N1989L1763n4886
13514I9653k9727p8449k7176K622K8557j5763o0507l0282L5179l8805M1379L8707
13502c4612J0764L3203J4201O104k7392M373P655L8050J335j9069l8947o0750
13490f5085J0191j9665L1667M5671L0162j9958l9397j6325P74J825K2043J3296
13478d801J2377K7022J2081o47n3375N9404j1420o0459j0338K2575m9575m4179
13466a01335L515K8182L2691K5841J7714k0148l6635M6665J4689l2820l446k4231
13454d9318l2565m8001l5732N9542M2470l4812j5600M0639O0866M616l1452m8175
13442h7522P656O4855j104K2104O0046N1912j0358L8953n5990K223L3941R315
$$ plain form
13526 139230 65381 -10528 -31513 -15483 26505 19474 4791 50270 70787 122776 154539 99653
13514 99653 69926 -8523 -35699 -33077 -4520 -20283 -80790 -111072 -75893 -114698 -73319 -34612
13502 -34612 -23848 9355 23556 29660 2268 6641 14296 52346 53681 34612 -4335 -65085
13490 -65085 -54894 -74559 -42892 2779 32941 12983 -26414 -42739 -41965 -40140 -18097 -4801
13478 -4801 7576 34598 46679 46032 -7343 52061 40641 -19818 -30156 -7581 -57156 -101335
13466 -101335 -97820 -69638 -36947 -11106 6608 -13540 -50175 -3510 11179 -21641 -25087 -49318
13454 -49318 -81883 -129884 -165616 -106074 -63604 -98416 -114016 -73377 -12511 -7895 -39347 -87522
13442 -87522 -79866 -15011 -16115 5989 66035 117947 107589 146542 90552 92775 126716 136031
13430A36031k9626l5294k1877K0269j5010r5464l5969J426L074j7607O8141N2476
13418C0570K0453K3176n2063l2739k3952q908m132j4030k2560J1157M4016P905
13406b1107M2148M1752J0223j7322Q340K6386P129k4432l6348k2181k9685l0456
13394d5553Q158k4316R22o738m429k5884Q2247N1708k933m457J0064k3451p0880
13381e5542l3117m8047K0056P6734K7686J2105j7686j8912O963R0467M3052J6754
13369A20513l8186n6188J0017o993n144o682L1640k6081q5117n609l2685K310
13357i8205K0144O1174Q391k5081K1053l9184j4641M3470L2840K4363N805o429
13345C3700K3991K647P215n0391r413R431l4067M248K7673Q209j5207L7249J258
$$ plain form
13430 136031 106405 71111 49234 69503 54493 -40971 -76940 -75514 -72440 -90047 -21906 30570
13418 30570 51023 74199 22136 -10603 -34555 -43463 -47595 -61625 -84185 -73028 -29012 -21107
13406 -21107 21041 62793 73016 55694 64034 90420 97549 73117 36769 14588 -15097 -45553
13394 -45553 -37395 -61711 -60789 -67527 -71956 -97840 -15593 36115 33182 28725 38789 15338 -55542
13381 -55542 -88659 -136706 -116650 -39916 -12230 -125 -17811 -36723 -29760 60707 103759 120513
13369 120513 82327 26139 36156 29163 24019 17337 48977 22896 -62221 -67830 -100515 -98205
13357 -98205 -78061 -16887 -8496 -33577 -12524 -51708 -66349 -22879 9961 34324 40129 33700
13345 33700 57691 60338 67553 17162 7749 17180 -16887 -12639 15034 23243 8036 45285 46543
13332D6543m1280l3286k7847k4006M1133L8665M7725o5281n0589j3008L6524O4614
13320A9907M0956l1098j29749m6555k8348N5992O3486N1L6019l0415k1721N5764
13308a5711k3978n3260K3000N9598K2718R501J4187K4844j6066j4609m0166J1954
13296B012n918N0323j3613l8454k8649j329L1720J1195K2348q378m136K0073j3555
13283B3639l1075p091j9261j456M5355m6249k5943Q0340o6375P839M8988j1509
13271b798j1112O2559K3054M2393q844k8103j095m5523l0663j4051n3471M186
13259f3468P3328K8808m8209l3776l4653L3346M5953L2222K4305j3701n5493r8122
13247a09460J7887N5897Q5623k0572p1948n6551K4895M3648m4727k5073L9438
$$ plain form
13332 46543 5263 -28023 -55870 -79876 -38743 -78 47647 -17634 -68223 -81231 -44707 19907
13320 19907 60863 29765 -99984 -146539 -174887 -118895 -55409 -55358 -19339 -49754 -71475 -15711
13308 -15711 -39689 -92949 -69949 -10351 12367 21868 36055 60899 44833 30224 -9942 2012
13296 2012 -3906 46417 32804 -5650 -34299 -35628 -3908 7287 29635 21257 17121 37194 23639
13283 23639 -7436 -14527 -33788 -35244 10111 -36138 -62081 18259 -48116 -40277 8711 -2798
13271 -2798 -13910 48649 71703 114096 105252 77149 76054 30531 -132 -14183 -67654 -63468
13259 -63468 9860 38668 -9541 -43317 -77970 -44624 1329 33551 57856 44155 -11338 -109460
13247 -109460 -91573 -35676 49947 29375 -42573 -99124 -74229 -30581 -75308 -100381 -60943
13236f0943N6506N1202J1244q9703m7386j832Q5650N2848k6612k6939m8457k2065
13224f6487K549M4111J0585K9058j6344p4651l1259J2220P3519J6391K1062O3669
13212H4423K8217J1585k8206k6387j4147K0173m1849m1992l7262m2071K8394O0704
13200A582k1717J9431k274k026M6438Q741k9726n8808L8090o302n1119O4881N9068
13187F6259l4573m9462P6864M5780O403p1564J878O044J341k996j4351k2261l9130
13174b9768j4345M2751p698J5175J0260L6156K4873N648l5453n5077K1633M6151
13162F0306J050l9549n016L6571l9961M1338j2635j1936J0406J2834Q5093o446
13150A32055n5417o2079j06336j9007L1360P8705L236N661M3164J0118J3508M6958
$$ plain form
13236 -60943 -4437 46765 58009 -31694 -79080 -80912 4738 57586 30974 4035 -44422 -66487
13224 -66487 -63938 -19827 -9242 19816 3472 -71179 -102438 -90218 -16699 -308 20754 84423
13212 84423 112640 124225 96019 69632 55485 75658 33809 -8183 -45445 -87516 -59122 1582
13200 1582 -20135 -704 -2978 -5004 41434 50175 20449 -38359 -269 -6571 -57690 7191 66259
13187 66259 31686 -17776 59088 104868 111271 39707 41585 47629 48970 45974 31623 9362 -29768
13174 -29768 -44113 -1362 -9060 6115 16375 52531 77404 83052 47599 -7478 14155 60306
13162 60306 61356 21807 16791 53362 13401 54739 42104 30168 40574 53408 138501 132055
13150 132055 76638 14559 -91777 -110784 -79424 -719 2517 8178 51342 61460 74968 121926
13138A21926K215m3712q4027n1646l6668O4688J1191m4544O0831K9477k1173L774
13126A2332q438k5754J2856o8739q758R2218L1397N5933N0747j52609q0503L3337
13114e5981L5627N5357o973J8728L4742M0936K2613o7165m6495J8557j9851j5795
13102A4300M012L279o813N849L564j8120l3534K389r348J775P424q4087k2811
13089a32121J7961N6916K4527M8186N372K7212J8596m1046k6107Q675j2509m3972
13077d8310j6094L8052K0733j8247M1915k0896l864q096K824j2134R756L9585
13065B5224K4976J8913j3636l7115p642L5083K2299K8843q808J780M464l2635
13053F1746k6074M4374j1922l1118O247L4574l8754J5500j8519l4897q362K3823
$$ plain form
13138 121926 124141 80429 -3598 -55244 -91912 -27224 -16033 -60577 254 29731 8558 12332
13126 12332 3894 -21860 -9004 -77743 -86501 5717 37114 93047 143794 -8815 -89318 -55981
13114 -55981 -20354 35003 28030 46758 81500 122436 145049 77884 31389 49946 30095 14300
13102 14300 18312 21591 14778 20627 24191 6071 -27463 -25074 -34422 -32647 -25223 -109310 -132121
13089 -132121 -114160 -57244 -32717 15469 20841 48053 66649 25603 -504 8171 -4338 -48310
13077 -48310 -64404 -26352 -5619 -23866 18049 -2847 -6711 -14807 -11983 -24117 -14361 25224
13065 25224 50200 69113 55477 18362 10720 45803 68102 96945 88137 89917 94381 61746
13053 61746 35672 80046 68124 37006 43253 77827 39073 54573 36054 1157 -7205 16618
13041A6618J3490j4801J9458J8283K8080J9422n9579j0494Q84J8475K8926M0134
13029A18896L735j0949l9994p928m5131j6633k3855K1683P490j5879j8095Q589
13017a8071n219O4092K2189l2805j7522K8045l8387l9964L9342J1964k4608r848
13005b0792l233m9131m2106O4186M2065k2277m44L1151j8639J3369q009J4828
12993I68L328n3148m3028P394M0255K0781j7647J2750J0193N3814M6138m6120
12981C5678J2936k8310j578k2183o8001K8382K0112O2472r04m1277p1029N5934
12969a7768Q3298L9952m9872j45981m7522M7823J3280L647M563l1665k7754j1000
12957a38999P120N6387K3682O9578N9390j4809r170k2822l1149R530M1754j7424
$$ plain form
13041 16618 30108 15307 34765 53048 81128 100550 40971 30477 31361 49836 78762 118896
13029 118896 122631 111682 71688 63760 18629 1996 -21859 -176 7314 -8565 -26660 -18071
13017 -18071 -23290 40802 62991 30186 12664 40709 2322 -37642 1700 13664 -10944 -20792
13005 -20792 -24025 -73156 -115262 -51076 -9011 -31288 -31732 -581 -19220 -5851 -13860 968
12993 968 4296 -48852 -91880 -84486 -44231 -23450 -41097 -28347 -18154 35660 81798 35678
12981 35678 48614 20304 18726 -3457 -71458 -43076 -22964 39508 38604 -2673 -73702 -17768
12969 -17768 65530 105482 55610 -90371 -137893 -90070 -76790 -73143 -68580 -100245 -127999 -138999
12957 -138999 -131879 -75492 -51810 17768 77158 62349 53179 30357 -792 8738 50492 33068
12945C3068n531k3055l0200K069j276j3958N0829M0075p7076O108k6168j5121
12933f0236J0209R4337N4599p429k2911R153J3307o8593n1966J4151Q9015L1233
12921A04869p7707k4289k7019j9028m20J0643l0875n9409K5969N3210L6487j621
12909i190m9904M4756K0867J05448m5874p3254l3578R364L7596q886o0440J0709
12897e2386m11p1146j0051L9883Q2363O625J3989k6269k9371j993j7956N0965
12885a5758j4880j0138M3486K7619j3480L024O5097K1390l3103o694J9622L4522
12873A20707m8533l3811l93k4958N420l0897l80N9155K5055q1941j5752j8995
12861d5323k3369p639O9750L9957n7933l0315j654K050L38j0632N2473L5955O237
$$ plain form
12945 33068 27537 4482 -25718 -23649 -24925 -38883 11946 52021 -25055 -18947 -45115 -60236
12933 -60236 -50027 44310 98909 91480 68569 77722 91029 22436 -29530 -15379 73636 104869
12921 104869 27162 2873 -24146 -43174 -43594 -32951 -63826 -123235 -97266 -44056 -7569 -9190
12909 -9190 -59094 -14338 6529 111977 66103 -7151 -40729 -31365 6231 -2655 -63095 -52386
12897 -52386 -52797 -123943 -133994 -94111 -11748 -5123 8866 -17403 -46774 -48767 -66723 -15758
12885 -15758 -30638 -40776 2710 30329 16849 19873 84970 106360 73257 66563 86185 120707
12873 120707 72174 38363 37970 13012 18432 -12465 -12845 46310 71365 -10576 -26328 -45323
12861 -45323 -68692 -76331 -6581 33376 -24557 -54872 -56526 -54476 -54138 -64770 -12297 23658 29895
12848B9895M1458K864K9666J2731n5873j5339K6473l6754j1443o871n885J7223
12836B8145J0405K1011j1613K3297m3060L065l3872k3845K1475J8417j5613J6800
12824A4612L9326N477m3028j0441q846j7540M7532J5317k4044r663J1839J8184
12812C8725R368n0994o7046L6986K6837K3837K8711N448r135k3336l5374j1696
12800b7669K3162L0871m3730n250K7352k5490j3072j2248J10151J1901j5887j1060
12788D9031m9588o5949o4378o891J15861N2259n7371k2515M9040l6441n2724J2257
12776g7409J5112J5969O6607Q7096k9080r9420r0329L6430L6397Q941J3238K2807
12764F359k3315k0135j4066K3616N1896n0408j06502M6465M401j8571l5723L8123
$$ plain form
12848 29895 71353 74217 103883 116614 60741 45402 71875 35121 23678 16807 10922 28145
12836 28145 38550 59561 47948 71245 28185 31250 -2622 -26467 -4992 13425 -2188 14612
12824 14612 53938 59415 16387 5946 -2900 -20440 27092 42409 18365 8702 20541 38725
12812 38725 48093 -2901 -69947 -32961 -6124 17713 46424 51872 42737 19401 -15973 -27669
12800 -27669 -4507 26364 -17366 -22616 4736 -20754 -33826 -46074 64077 75978 60091 49031
12788 49031 -557 -66506 -130884 -137775 -21914 30345 -27026 -49541 -501 -36942 -89666 -77409
12776 -77409 -62297 -46328 20279 107375 78295 -21125 -111454 -75024 -38627 -29686 -16448 6359
12764 6359 -16956 -37091 -51157 -27541 24355 -26053 -132555 -86090 -81689 -100260 -135983 -97860
12752i7860J07432Q5525l3282n3031k8710M6640k9462K9294L4552K049j971j4656
12740D6520l0870J3833k4005k9631r009n039J6346j2398O636K961J2119m977j3610
12727c1124P9353P7734k0198j1397o0501J4812K5207m2142o1157L992O0462R777
12715D4818j9698J390o0449m9577j4302m6532P4966J16941K8529p813l841m7749
12703A6683l3827J2211J2209k6989l4941n3636K4273N3496L9812n3682j6594J3123
12691d7862n5914O2891N4702j0926J7339j125P478J1294J25m6933N3190k9431
12679A4828j0414L117K6442N380J7869k4471n834j1359N112J1498l664m6859l0085
12666d8440m8153L9443L6379L3001R314J4448j1696k0429P254K5187k3785p8979
$$ plain form
12752 -97860 9572 95097 61815 8784 -19926 26714 -2748 26546 61098 63147 61176 46520
12740 46520 15650 29483 5478 -24153 -33162 -38201 -21855 -34253 -27617 -24656 -12537 -17514 -31124
12727 -31124 48229 125963 105765 94368 33867 48679 73886 31744 -29413 -25421 35041 44818
12715 44818 25120 26510 -33939 -83516 -97818 -144350 -69384 47557 76086 68273 64432 16683
12703 16683 -17144 -4933 7276 -19713 -54654 -108290 -84017 -30521 9291 -44391 -60985 -47862
12691 -47862 -103776 -40885 13817 2891 20230 19105 26583 37877 38002 -8931 44259 14828
12679 14828 4414 7531 33973 39353 57222 32751 26917 15558 20670 32168 28504 -18355 -48440
12666 -48440 -96593 -57150 -20771 12230 21544 35992 24296 3867 11121 36308 12523 -66456
12654f6456l2886K9261j4750J1743Q4492L4763j882m2007j000o904m4832n3801
12642a04259J9751M8562K4484m6517M2749K7526n0827m9460K5060m0903M6458
12631e7376N0476L0586m7677n482R5265j876k0542J5032j6353r3528J8442K0769
12619a2264L0316l8191L4369J0077o4016O2231M4811p4992k5206K6802L2167L754
12607B9858k2387l395K5152J2983L1544R753j5158K4317M4849j1419n8592j7075
12595E0430J082K8778J0363l4598o7086o6807M7409P2008N2186l6050k7405M1816
12583G2126m840M933L4450K6184l4866m5825m4725n6134j6316O3865L2905j9929
12571A1828l9683k9144P0542J4131j2446q1305q688R5313J11723j4062n5256J8135
$$ plain form
12654 -66456 -99342 -70081 -84831 -73088 11404 46167 44285 2278 1278 -5626 -50458 -104259
12642 -104259 -84508 -35946 -11462 -57979 -15230 12296 -38531 -87991 -62931 -103834 -57376
12631 -57376 -6900 23686 -23991 -29473 65792 63916 43374 58406 42053 -51475 -33033 -12264
12619 -12264 18052 -20139 14230 24307 -39709 22522 67333 -7659 -32865 -6063 26104 29858
12607 29858 7471 4076 29228 42211 73755 83508 68350 92667 137516 126097 67505 50430
12595 50430 51512 80290 90653 56055 -11031 -77838 -30429 41579 93765 57715 30310 72126
12583 72126 67286 72219 106669 132853 97987 52162 7437 -48697 -65013 -1148 31757 11828
12571 11828 -27855 -56999 13543 27674 15228 -66077 -74765 20548 132271 118209 62953 81088
12559H1088j9995k7644k8136j2250Q666m8645J4184O0752l0112j3549L7516j3772
12547H103J2656P748m4382p3581n532K3858L6475L5396P4743L6118m1987l1983
12535C7632q5399P78K7666k7587q428J3286k3217J5596J2505k6299k1026J8511
12523f5982K3622l4118j9291P947M9119O142L9490N2283r79k4963L7108J4860
12511H5238l7797p637K7188j9515k8667m996O6526k6129o2279N283m5986k0248
12499f9019N4062P3632M7518J0406j4015o7289l4235K9316o930n4320q264K7686
12487a1452L831J7547m8757M6838O1959n2859o5149O676P4123O82J2596R571j117
12474E4489j1975l1869o3019K4420M3828O1566n9941k604M1446M6073M483j0676
$$ plain form
12559 81088 61093 33449 5313 -6937 1729 -46916 -32732 28020 -2092 -15641 21875 8103
12547 8103 20759 28507 -15875 -89456 -94988 -71130 -34655 741 75484 111602 69615 37632
12535 37632 -47767 -46989 -19323 -46910 -55338 -42052 -65269 -49673 -37168 -63467 -84493 -65982
12523 -65982 -42360 -76478 -95769 -87822 -38703 -32561 6929 59212 58233 33270 70378 85238
12511 85238 47441 39804 66992 47477 18810 13814 80340 54211 -8068 -2785 -48771 -69019
12499 -69019 -14957 58675 106193 116599 102584 35295 1060 30376 23446 -30874 -39138 -11452
12487 -11452 -7621 9926 -38831 8007 69966 17107 -48042 -41366 32757 33439 46035 55606 54489
12474 54489 42514 10645 -52374 -27954 15874 77440 17499 14895 56341 102414 106897 96221
12462I6221o5175n3024M0291N3451k4220k9958j7415j5964M5857j1175n5445K1711
12450a4845J19462j4831l7229j1662M1327l4599L2836J4507L2025M257m9063K2329
12438A04514o2811q3924m0654L1902o884L5335J4074m3125O0197j3954L5416m313
12426B5773m3028K3724J2745N4711J32096R8032P5883L4762r3777j40497j20302
12415F0122N5336Q495o7583l9330J3246j5349J8504L8341k2816p130J3116P879
12403F2831J2575j8685m2335K6315k395J1402j1301o0388j1541O8388J5101n8931
12391h964r286N466K4935Q2248L9587Q454k3264o4375m7924m2350K2493p685k1813
12378d2478R899J0963j4120l4858l8444p635N0360M1071j3796K909O5759M3356
$$ plain form
12462 96221 31046 -21978 18313 71764 47544 17586 171 -15793 30064 18889 -36556 -14845
12450 -14845 104617 89786 52557 40895 82222 47623 80459 94966 126991 131248 82185 104514
12438 104514 41703 -42221 -82875 -50973 -57857 -22522 -8448 -51573 8624 -5330 30086 25773
12426 25773 -17255 6469 19214 73925 206021 304053 379936 414698 320921 180424 60122
12415 60122 115458 123953 56370 17040 30286 14937 33441 71782 48966 41836 54952 62831
12403 62831 75406 56721 14386 40701 38306 49708 38407 -21981 -33522 34866 49967 -8964
12391 -8964 -18250 -12784 12151 94399 133986 142440 119176 54801 6877 -35473 -12980 -20665 -42478
12378 -42478 -32579 -21616 -35736 -70594 -109038 -116673 -66313 -25242 -39038 -36129 29630 72986
12366G2986p5754n0101J673K0844j0692L3827L4943r775N0070l249L4320n292
12354I3800L234M8683m7212l84J5370j1988k0877j7097p1374K6603P1889k0151
12342G0496k7101n3402l5580M2126J6331O681m4934J810N4986J4088p0659o8714
12330i3872k075j7188N9956k208K4837N4839K3907o1023p2706K4127P5021L7777
12318E1392J2507J2355j9028n1476j1881j5294L6494J4122k4337m4289l2853j3386
12306h5674M5723p074J0563L8002P680l136J286Q906p001l2868M5250j2321l8555
12293b9219j228k0889K8010O6660L4233p2073m4540m134r456K833J1745P7625
12281C9567P348j6165K657j3857R087p9787K1662P0759n5808k357n395p237j2541
$$ plain form
12366 72986 -2768 -52869 -51196 -30352 -41044 -7217 27726 17951 68021 64772 99092 93800
12354 93800 97034 145717 98505 98121 113491 101503 80626 63529 -7845 18758 90647 70496
12342 70496 43395 -10007 -45587 -3461 12870 19551 -25383 -23573 31413 45501 -25158 -93872
12330 -93872 -95947 -113135 -53179 -55387 -30550 24289 48196 -12827 -85533 -61406 13615 51392
12318 51392 63899 76254 57226 5750 -6131 -21425 15069 29191 4854 -39435 -72288 -85674
12306 -85674 -39951 -47025 -36462 1540 9220 6084 7370 16276 9275 -23593 21657 9336 -29219
12293 -29219 -30447 -51336 -23326 43334 77567 5494 -39046 -43180 -52636 -49803 -38058 39567
12281 39567 46915 30750 33407 19550 28637 -51150 -29488 41271 -14537 -16894 -22289 -29526 -42067
12268d2067J2371N4397l5348M75j381k0361L7191J2939k791J7930L700L1080N8534
12255A26669p0549p4331l7012R62K0569J5923K9204Q556j6052n1458j1562O7291
12243H210j7585q247L2650L2870j4700J878o890q7605k8527J3239Q546M3791Q2869
12230F0499P563l2658k4713p3773l7373L9266N7R181L1779M7169R949j6035r137
12217A1774L7000j4239m0522J2628j5747k4250j769L394N8666l4869J2396K7979
12205C2441M5055J8474k3550k24l8280k0421j0877j4990J2539M7529j2802l440
12193C1454m2781j6865J3889m3883j2000L4050j537P588P7975R525l4000K2634
12181D6049J693l5545O53K1411K9560p1244O378k151N892k9185k0336o5391O281
$$ plain form
12268 -42067 -29696 24701 -10647 -10172 -11553 -31914 5277 18216 15425 33355 37055 68135 126669
12255 126669 56120 -18211 -55223 -54261 -33692 -17769 11435 19991 3939 -47519 -59081 8210
12243 8210 -9375 -17622 15028 47898 33198 35076 28186 -59419 -87946 -74707 -66161 -22370 60499
12230 60499 68062 35404 10691 -63082 -100455 -61189 -61132 -51951 -20172 26997 36946 20911 11774
12217 11774 48774 34535 -5987 6641 -9106 -33356 -35125 -31731 26935 -7934 4462 32441
12205 32441 77496 95970 72420 72196 33916 13495 2618 -12372 167 47696 34894 31454
12193 31454 -11327 -28192 -14303 -58186 -70186 -36136 -37673 -30085 47890 57415 23415 46049
12181 46049 47742 12197 12850 34261 63821 -7423 -1045 -3196 2696 -26489 -46825 -112216 -105935
12168a05935L7813R671M6396M6223m5723k3590p057P7785J9537N58K0246m2462
12156C3462j9816M5925q098p1794j789M6034M2288k0995l0633M9768j9529m4605
12144B18k0588q29M2578L6627l3304L9056L6901k1343J481k998j334j3166j4947
12131D8352p708k7869J8887J2620j9207M6303m4312j9768l3099k1945L2632M6418
12119C1304m9212k6624J4522J1971J8437M3760M7747K3148n6710j3555j2617L284
12107C5455k4993p4464K3716r731l7996K2614O7426n6578l6796K2522k3725j234
12095i3784K9276J8794K5268j5919j564M9958m0870j2387m2699o2125M9104R3604
12083c344k4040r5169j4464J09694K9861J4780r802k1682J2325N1044k0850j2995
$$ plain form
12168 -105935 -68122 -58451 -12055 34168 -11555 -35145 -42202 35583 55120 55678 75924 33462
12156 33462 13646 59571 51473 -20321 -22110 23924 66212 45217 14584 64352 44823 218
12144 218 -20370 -21199 21379 58006 24702 63758 100659 79316 80797 77799 76465 63299 48352
12131 48352 40644 12775 31662 44282 25075 71378 27066 7298 -25801 -47746 -15114 31304
12119 31304 -17908 -44532 -30010 -18039 398 44158 91905 115053 58343 44788 32171 35455
12107 35455 10462 -64002 -40286 -50017 -88013 -65399 2027 -54551 -91347 -68825 -92550 -93784
12095 -93784 -64508 -45714 -20446 -36365 -37929 12029 -28841 -41228 -83927 -146052 -96948 -3344
12083 -3344 -27384 -122553 -137017 -27323 2538 17318 7516 -14166 -1841 49203 28353 15358
12071A5358K5290O9487N0524n5333q5221j9214J223l0604J0716O297O977L1230
12059B6730K9189J8822P54l0773q866O137j9368p132j2283m6450l5138j0531J8185
12046g0724K9862L3999M9456L7772j9173n0604K3445L906o1441l7491j526j5992
12034g8511m2387l243M6274L8553p544j0215q044L9036M3070L5902K1062M0584
12022A14537l6681r6348m7405m304L4809L2545l1591L048J5892j9389r473j742
12010d6102K4786K067m0520r988O3693K3701j1545k4575k5014j0613j7910N0P8674
11997F704P5320r168m8291k1040q396R685L0324k6554m9762j8330J5356N9769
11985A5617J3444q776K3169J0161k876l6450l4490Qn2917K1590K3904L6483J6438
$$ plain form
12071 15358 40648 110135 160659 105326 20105 891 2114 -28490 -17774 -11477 -4500 26730
12059 26730 55919 74741 75495 44722 35856 41993 22625 15493 3210 -43240 -78378 -88909 -70724
12046 -70724 -40862 -6863 42593 80365 61192 10588 34033 37939 -23502 -60993 -62519 -78511
12034 -78511 -120898 -124141 -77867 -39314 -46858 -57073 -65117 -26081 16989 52891 73953 114537
12022 114537 77856 -18492 -65897 -70201 -35392 -2847 -34438 -31390 -15498 -34887 -44360 -46102
12010 -46102 -21316 -19249 -59769 -69757 -6064 17637 6092 -18483 -43497 -54110 -72020 -71970 6704
11997 6704 82024 72856 24565 3525 -4871 4814 35138 8584 -41178 -59508 -44152 15617
11985 15617 29061 20285 43454 53615 50739 14289 -20201 -20193 -73110 -51520 -27616 8867 25305
11972B5305o10j0513n2298j5091N1749M4660l1235M8474L0223l4114p2255l3446
11960d9151N878L1115O6637P2369j4414j3433m7120j3054k2336j2399L1873j5986
11948A9979J4597n5276j1141M551M7447N0174k3992q8705q364J0330r311m7314
11936i7025m220O0056P1129l6672m3072J7109K0237J4970O384q82m6500m6686
11924h5172j3850L241P7433O5517o6654n6228M2374M5769j6251k9931j9891J0554
11912d3089L9987j2251j3491p425J02795O6859m2155j03105o0559M6562N1064
11901B5192l16k699J4044j3935J0854L8389N9623n1960r3194p8138M0222N4850
11889B932M1596K1990m3983k4897m3251J9526J1523j2017l5321m5291M926j5302
$$ plain form
11972 25305 24695 14182 -38116 -53207 -1458 43202 11967 60441 90664 56550 -15705 -49151
11960 -49151 -43273 -12158 54479 126848 112434 99001 51881 38827 16491 4092 35965 19979
11948 19979 34576 -20700 -31841 -27290 20157 70331 46339 -42366 -50730 -40400 -49711 -97025
11936 -97025 -101245 -41189 29940 -6732 -49804 -32695 -12458 2512 8896 8014 -38486 -85172
11924 -85172 -99022 -95781 -18348 47169 -19485 -75713 -33339 12430 -3821 -33752 -53643 -43089
11912 -43089 -3102 -15353 -28844 -36269 66526 133385 91230 -11875 -72434 -25872 25192
11901 25192 24876 22177 36221 22286 33140 71529 131152 79192 -14002 -92140 -51918 2932
11889 2932 44528 66518 22535 -2362 -45613 -26087 -14564 -26581 -61902 -107193 -102267 -117569
11877a17569L4251N2490n33j0228J0558M5375K3806l2286k9451J0029K571O0280
11865D9293m500j4562l035q810p795O14m6722k6888K1175O700k6587m5969k1964
11852a29050J6299K5474O7622O579n7671K2988j6605O836j6324j3364J9364M4559
11840b3293K1104k1829K2039k2728k3770q7641n5937P0491N4254J3388L5033N6825
11828C7936l430L4912O0081k9952l0455k2515n166L3405N806p3773p1586J6435
11816d8302J6512J5998J1024N994j7306k5073j3903j2170m180n3820K9869j8360
11804a13717n8594R1785P5834n812j0161j9106R968l8333L5242k7582O715L1007
11792b2754J8210k154P669M6690p987j6361L7617j7696q5274j1776L3017L1056
$$ plain form
11877 -117569 -83318 -30828 -31361 -41589 -31031 14344 38150 5864 -23587 -13558 -10987 49293
11865 49293 44793 30231 27196 18386 10591 11205 -35517 -62405 -41230 -34530 -61117 -107086 -129050
11852 -129050 -112751 -87277 -19655 -13076 -70747 -47759 -64364 -57528 -73852 -87216 -67852 -23293
11840 -23293 -2189 -24018 -1979 -24707 -48477 -136118 -192055 -121564 -67310 -53922 -18889 37936
11828 37936 34506 69418 129499 99547 69092 46577 41411 74816 80622 6849 -64737 -48302
11816 -48302 -31790 -15792 -4768 1226 -16080 -41153 -55056 -67226 -71406 -125226 -95357 -113717
11804 -113717 -172311 -80526 -4692 -10504 -20665 -39771 -29803 -68136 -32894 -60476 -53761 -22754
11792 -22754 -4544 -6698 971 47661 39674 23313 60930 43234 -42040 -53816 -20799 10257
11780A0257k3531J8283M83L8116p964m1955l2776K3795R227k3860L6241M6367
11768E2683k0305k3620k1717j7810M6058N7566p468k9376j1815o2758p0395k3377
11756a32334k7722K1151q108n6704N9332J02573Q1492R374m6069j0508j1943m7114
11744f6580j2990j3593j2380J00349O8127K8251o7424r5836j0429R6404M3270
11733E7169j2841k2262k521K0802n2287o9127K4544J0248q576L9207j8467L2509
11721a602J929N495P728k1670M76K985k374J1369p0412k9753K0985J3782l6392
11708i7454j0701O5852j758J5006L2055n812Q265k8176j1930R99l1653J5723K2521
11695b7063L582m67k2229J2857m5710j0192m504K5346J3014J1283O6901L0413
$$ plain form
11780 10257 -13274 5009 5492 43608 35644 -6311 -39087 -15292 -6065 -29925 6316 52683
11768 52683 32378 8758 -12959 -30769 15289 72855 65387 36011 24196 -38562 -108957 -132334
11756 -132334 -160056 -138905 -147013 -203717 -144385 -41812 39680 49054 2985 -7523 -19466 -66580
11744 -66580 -79570 -93163 -105543 -5194 62933 91184 23760 -72076 -82505 13899 57169
11733 57169 44328 22066 19545 40347 -11940 -81067 -56523 -46275 -54851 -15644 -34111 -1602
11721 -1602 327 5822 13550 -8120 -7644 -4659 -7033 4336 -66076 -95829 -74844 -61062 -97454
11708 -97454 -108155 -42303 -44061 -29055 3000 -2812 5453 -22723 -34653 -33654 -65307 -49584 -27063
11695 -27063 -23481 -23948 -46177 -33320 -79030 -89222 -93726 -68380 -55366 -44083 22818 53231
11683E3231n021N783K2146L0730J5548j7128k7600m8184J6760K9329j6082n4137
11671E375j1685m3643J3836P5364l2942p9706N69K0916M0681m073K450l6217l3393
11658h2468L936l1693J8245P1755M5691m5902j2057N989K8101J9658L0822o6222
11646a4145k972M2084l584j0225K4316L3623K0062p5700L5584K2201l5502j09696
11634g3954j6731j5468L176J6127m718l2689L181P4619P6041M945N0622Q4148
11622A69299n9925n3797k5035j8742L3957L7511J0360n707n8115l8775N7247K6325
11610G4603K940q2849q4949L6218J13695L2697n0458n9943l3805P9321J09066
11599A36536l2343R05J4656l6646n1150k7626o834O4179o014j2063R686k951l4861
$$ plain form
11683 53231 48210 53993 76139 106869 122417 105289 77689 29505 46265 75594 59512 5375
11671 5375 -6310 -49953 -36117 39247 6305 -73401 -72832 -51916 -11235 -15308 -12858 -49075 -82468
11658 -82468 -78532 -110225 -91980 -20225 25466 -20436 -32493 -26504 1597 21255 52077 -14145
11646 -14145 -17117 24967 21383 11158 35474 69097 89159 13459 49043 71244 35742 -73954
11634 -73954 -90685 -106153 -102977 -86850 -91568 -124257 -121076 -46457 29584 34529 85151 169299
11622 169299 109374 55577 30542 11800 45757 83268 93628 87921 29806 -8969 48278 74603
11610 74603 77543 -5306 -90255 -54037 59658 92355 41897 -18046 -51851 27470 136536
11599 136536 104193 105098 119754 83108 31958 4332 -2502 61677 55663 43600 53286 50335 15474
11586A5474m2259K7797J2575j0590P2021J9665N8611l8133q1583K2412M650N330
11574F5970m178m3785m3151J7880J2342r903k3663k9663m7287J6594L3724K0673
11562c4447J7988p073l2725L0892L2109k7229k4675J1896Q625R967k8520l4633
11550g7825M280j4177N7749Q8876J9963R096P721k4277r635L1104j8553o1616
11538A2706l2842o019L332k291j080k4865o6823m4794N5449M5086m0403k0230
11526a22774M855K890j2201j9688k7823L1471K2756N356K7852N1715j1549J8341
11514b8799K9133L7057K1j7659l2188J6496l33k6215L0929L2145l9180j4998j5780
11501b9371m1768L8R054m4260j5801r94K6126L3384M3374L8630N2754m2602j0169
$$ plain form
11586 15474 -26785 1012 13587 2997 75018 94683 153294 115161 33578 55990 60640 65970
11574 65970 61792 18007 -25144 -7264 5078 -4825 -28488 -58151 -105438 -88844 -55120 -34447
11562 -34447 -16459 -23532 -56257 -25365 6744 -20485 -45160 -33264 -24639 -14672 -43192 -77825
11550 -77825 -73545 -87722 -29973 58903 78866 87962 95683 71406 61771 92875 74322 12706
11538 12706 -20136 -26155 -22823 -25114 -26194 -51059 -117882 -162676 -107227 -62141 -102544 -122774
11526 -122774 -117919 -115029 -127230 -146918 -174741 -143270 -120514 -115158 -87306 -35591 -47140 -28799
11514 -28799 334 37391 37412 19753 -12435 4061 3728 -22487 8442 40587 1407 -13591 -29371
11501 -29371 -71139 -71101 -62047 -106307 -122108 -123102 -96976 -63592 -20218 18412 71166 28564 18395
11488A8395j7469n282k9271j9025M7589n5744M85K6825M9678J1306l9852J5059
11476B694J9953k8839n368j7569O7116K7781l7736k4782k5218Q368J1139N6485
11464E4024j9676L401L1160l3234j5816O4571M0728m0008n1362n0173j05702J1675
11452a10412K7317o041k3800m2055J1361L8967N2893K4501M0276L0669N2947K1592
11440A18215n9427n2756J7772j1010l4899O218K6297r993q2560k1036j0576P3142
11428d0613K8266l4954k5151m1050J9168K1447K9959O6019k0255k8925j8507J3914
11416c0682R3254J3885n9609n8004K4050J6597J4223k7836l3784M5027k6787N038
11404b4628N27j6584K8336j5210K5927O0105j2611n062K0320L1223k772l4508
$$ plain form
11488 18395 926 -4356 -33627 -52652 -5063 -60807 -60322 -33497 16181 27487 -12365 2694
11476 2694 22647 -6192 -11560 -29129 37987 65768 28032 3250 -21968 -13600 -2461 54024
11464 54024 34348 37749 68909 35675 19859 84430 125158 85150 33788 -16385 -122087 -110412
11452 -110412 -83095 -89136 -112936 -154991 -143630 -104663 -51770 -27269 13007 43676 96623 118215
11440 118215 58788 6032 23804 12794 -22105 -15887 10410 417 -82143 -103179 -113755 -40613
11428 -40613 -12347 -47301 -72452 -113502 -94334 -72887 -42928 23091 2836 -26089 -44596 -30682
11416 -30682 62572 76457 16848 -41156 -17106 -509 13714 -14122 -47906 -2879 -29666 -24628
11404 -24628 -24101 -40685 -12349 -27559 -1632 58473 45862 40800 61120 92343 89571 55063
11392E5063k5063M5148n6229J7941k2769P932l2454J8850k4184p3991k8631Q567
11380a09820L7558k9991o068K1468O4683M7478J00089j11052m7489J1047J0662
11369a1435P1459j1090o8096j7434L6893J1783j4023K1020P6803M846n1506j3176
11357C6044p933K4808P070J992k0415l8315J8426O140N9984L6691n7726k0624
11345D6142k7411m2474n5307J3837M2871N602R993n821Q139L0068O434K4983k901
11332E4155k3367k5912o1034m1194K6082N8904N5680K8378K4146K359k5194o8518
11320D485j9075n10j8591K116J09334J4401m0137l7483m46R428q386M045o1460
11307d2279r9786J0440L1539M9751M8149n9971k3819k261k1998K4515K3571j3070
$$ plain form
11392 55063 30000 75148 18919 36860 14091 22023 -10431 8419 -15765 -89756 -118387 -109820
11380 -109820 -72262 -102253 -108321 -86853 -22170 25308 125397 14345 -33144 -22097 -11435
11369 -11435 60024 48934 -19162 -36596 297 12080 -1943 19077 95880 100726 49220 36044
11357 36044 28111 52919 59989 61981 41566 3251 21677 27817 87801 124492 66766 46142
11345 46142 18731 -23743 -79050 -65213 -22342 -16740 -6747 -12568 -4429 25639 32073 57056 54155
11332 54155 30788 4876 -56158 -97352 -71270 -12366 43314 71692 95838 98197 73003 4485
11320 4485 -14590 -15100 -33691 -31575 77759 92160 52023 14540 14094 23522 15136 19181 -42279
11307 -42279 -142065 -131625 -100086 -50335 -2186 -62157 -85976 -88237 -110235 -85720 -62149 -75219
11295g5219n0715O058O5842M7668L5587L9671p9464M2605N7503K6150k1824k6695
11283F7167k5570j3017k1038L8256O874j3725m0196j2709l9829j0467K4564R1821
11271E2131J3069k6540l3636p1560r0504n669P1458J586M3606L0180Q084k5727
11259c3522j3712N7881j4169q178N4453j2574k109L7569j749p2455j02193J9272
11247i1486R784O150N364P172K7406j1122l3797O0070J3356R493r368k2447n2334
11234h1759j9613O1826j6214L9544M1463J5026P0717j0n0420k2418n8047L2298
11222A2393J9884n0755J1156M612P692J2189L8050K8477k3109q303k4221k4632
11210C433K691p0995k9211M4515K2859l9069K0546K537K0872j706P973K0621k9170
$$ plain form
11295 -75219 -125934 -119876 -54034 -6366 29221 68892 -10572 32033 89536 115686 93862 67167
11283 67167 41597 28580 7542 45798 52672 38947 -1249 -13958 -53787 -64254 -39690 52131
11271 52131 65200 38660 5024 -66536 -157040 -162709 -91251 -89665 -46059 -15879 -7795 -33522
11259 -33522 -47234 10647 -3522 -11700 42753 30179 28070 65639 63890 -8565 -110758 -91486
11247 -91486 -81702 -75552 -70188 -63016 -35610 -46732 -80529 -20459 -7103 2390 -6978 -29425 -81759
11234 -81759 -101372 -39546 -55760 -16216 25247 40273 110990 110980 60560 38142 -19905 12393
11222 12393 32277 -18478 -7322 -2710 4982 17171 55221 83698 60589 52286 28065 3433
11210 3433 6124 -64871 -94082 -49567 -26708 -65777 -45231 -42694 -21822 -23528 -15555 5066 -24104
11197b4104n1325M6050l2578q7117K2158J565j945J8659j9703j6623m868N2144
11185i7687N6279O0771L2842n11m357N289n2185O345M1353J3274J7414j19158
11173d0331m1957L7670J4434n677L6019L1611Q429m9056o061O791m5827m9109
11161a03064N236q019J0308J4620L6471m218j8756M0274J031L8701K1942k9843
11149D683n4353J4570N5072O5448q3280n1273l2r128J6875N3736j7167O456k6354
11136b4747m7929L2715M9401j5522m1553N384m9718J2195j4998J9538j7433O8551
11124b4116K4645M4520M8929q9083n6058j386n91p407k0167O6962J0136k8120
11112c1736L867J2450k5914J4405O9354J9487m4326j0143k9550L6110J2975M6996
$$ plain form
11197 -24104 -75429 -29379 -61957 -149074 -126916 -125351 -127296 -108637 -128340 -144963 -149831 -97687
11185 -97687 -41408 19363 52205 51694 47337 52626 441 6786 48139 61413 78827 -40331
11173 -40331 -82288 -44618 -30184 -35861 158 31769 40198 -8858 -14919 -8128 -53955 -103064
11161 -103064 -97828 -105847 -95539 -80919 -44448 -48666 -67422 -27148 -26117 12584 34526 4683
11149 4683 -49670 -35100 19972 85420 2140 -49133 -49165 -58293 -41418 12318 -4849 1607 -24747
11136 -24747 -72676 -39961 9440 -6082 -47635 -42251 -91969 -79774 -94772 -75234 -92667 -24116
11124 -24116 529 45049 93978 4895 -51163 -52549 -53140 -60547 -80714 -13752 -3616 -31736
11112 -31736 -27869 -15419 -41333 -26928 42426 61913 17587 7444 -22106 14004 26979 73975
11100G3975M3261j0570n0738m0589m944K6679J0891M8164m817p2065L154n6316
11088c3915j6398k4493j2452P1630L4503K4672j101L7404K296m6140m176J4138
11076D5968L4958k6410r9275P281Q7008K1549l5933p7005K1817M9346K4937q200
11064D6041k0054J6179J4546K5902j1822o4468k1684N945M79Q4688j9380j47981
11052i1609m4053J6166l0773K1161q059J5659L5940P6746J0479j8617J6962o965
11040f963r601m2849k5293K1572J0826m4202q0496K3656J02555K9961L3784j3160
11028b10j0111k2919k9498N2872R6918L59l3667J2642n5143m2757M3885O6166
11016G8537j0049n7691o016M22k9995N0399k5009k5470P4032J3542k7264J8192
$$ plain form
11100 73975 117236 106666 55928 15339 10395 37074 47965 96129 91312 19247 22401 -33915
11088 -33915 -50313 -74806 -87258 -15628 18875 43547 42446 79850 82146 36006 31830 45968
11076 45968 80926 54516 -44759 -37478 49530 71079 35146 -41859 -20042 29304 54241 46041
11064 46041 25987 42166 56712 82614 70792 6324 -15360 -9415 -8936 75752 56372 -91609
11052 -91609 -135662 -119496 -150269 -129108 -137167 -121508 -85568 -8822 1657 -16960 2 -6963
11040 -6963 -16564 -59413 -84706 -63134 -52308 -96510 -177006 -153350 -50795 -20834 12950 -210
11028 -210 -10321 -33240 -62738 -9866 87052 87411 53744 66386 11243 -31514 12371 78537
11016 78537 68488 10797 4781 5203 -24792 25607 598 -24872 49160 62702 35438 53630
11004E3630J1087l0035p5468m695N1373m2046L3860Q87l0544m7867N9679k0081
10992d0220j4219K7537k6622l7435J6565p950k6323m4424K0516N7599Q612M5140
10980b1224J3943K6083J8460L2657O3406k8665o4271q2205k8213M9851K988P109
10968a0081k5059r514m7192j5252L7281O1847K4939j0448r919J8462r914r6471
10956i1321k749N4342J708k876N3970j6472O2472K1653m5496o660o9l7581k4595
10943c3674n4218J0356O802n4536o769J3732N3419O680k6521P995l5599n0935
10931a63268L4784J4854K288j5749N1598N7113K749n620J8482M4525L4727o9726
10919F757j9119L7064r513m6055L6378N8013k3072m1116n1161R3398P5204j6127
$$ plain form
11004 53630 64717 34682 -40786 -45481 5892 -36154 -2294 -1407 -31951 -79818 -20139 -40220
10992 -40220 -54439 -26902 -53524 -90959 -74394 -82344 -108667 -153091 -132575 -74976 -66364 -21224
10980 -21224 -7281 18802 37262 69919 133325 104660 40389 -41816 -70029 -20178 -17190 -10081
10968 -10081 -35140 -44654 -91846 -107098 -69817 -7970 16969 6521 -3398 15064 5150 -91321
10956 -91321 -94070 -39728 -38020 -40896 13074 -3398 59074 80727 35231 28571 28502 -9079 -33674
10943 -33674 -87892 -77536 -70734 -125270 -132039 -118307 -64888 -58208 -84729 -76734 -112333 -163268
10931 -163268 -128484 -113630 -111342 -127091 -75493 -18380 -15631 -21251 -2769 41756 76483 6757
10919 6757 -12362 24702 15189 -30866 5512 63525 40453 -663 -51824 41574 116778 100651
10907A00651k4059l4128o7276l003O9387L8607P0406P3092k7500r8802j17231
10896a9856r4556p234N9334O1739k233L074j417j3948J0858L8385m7074n0719
10884f3647J0422j4304k0486l8334J4347M0487J3728j1263M884M0324j6717o261
10872d6820k5769q325L1861J3274L3872j4126j3342j7758M2687M9951j9305p1821
10860d5621K8804L4546J2884k5250O499p927j3014P374P545j4244N6648q214k5188
10847A4842Q8j0654j0204K3854k2588n543m784j4111J6840L1380J969o968j6016
10834a895j7409L9156q390O7749K7506m1995r6179K0550L7765l5231n4062L4473
10822b7962K5966n808m6421k7754J8937j5419K2781K1192L4518l1292m3791O343
$$ plain form
10907 100651 76592 42464 -24812 -27815 41572 80179 150585 223677 196177 97375 -19856
10896 -19856 -114412 -121646 -62312 -573 -2806 268 -1149 -15097 -4239 34146 -12928 -63647
10884 -63647 -53225 -67529 -88015 -126349 -112002 -71515 -57787 -69050 -64166 -23842 -40559 -46820
10872 -46820 -72589 -80914 -49053 -35779 -1907 -16033 -29375 -47133 -4446 45505 26200 -45621
10860 -45621 -16817 17729 30613 5363 11862 3935 -9079 -1705 5840 -8404 48244 40030 14842
10847 14842 14930 4276 -5928 17926 -4662 -10205 -14989 -29100 -12260 19120 21089 14121 -1895
10834 -1895 -19304 19852 11462 79211 106717 64722 -31457 -10907 26858 -8373 -62435 -27962
10822 -27962 -1996 -7804 -54225 -81979 -63042 -78461 -55680 -34488 30 -31262 -75053 -68710
10810f8710M8791J1751p546J2050j431k7207N079K5264N4714R772n3105K082J7163
10797B8667J2388r138k0340m5593o769M748M2719N5874O68o0023o364J1059m2913
10784c5017l2494J2644M8209K9927k3719o0742j5524J3137L8315J0841m1221j9524
10772g5168O1210j4615K8510M3363p128j1260l8083o397J9530m364m4231L119
10760d5514p843j9202j3247K4852J6261r611K8036O4025L9485O2298k6194o1589
10748E1757r0581j1082M4666n6q646J9859J2357L733J9701j896j8924j8577j3074
10735a0763j4927K5934K2877j9884m5528k2357l9381k2332l4842k0668Q246L0605
10723a43020R7718R9282k9820m083O0830j6865J0120K3302J8916m870N8169j7032
$$ plain form
10810 -68710 -19919 -8168 -15714 -3664 -5095 -32302 -27223 -1959 52755 62527 9422 11504 28667
10797 28667 41055 31917 11577 -34016 -40785 -36037 6682 62556 63224 3201 -3163 7896 -35017
10784 -35017 -67511 -54867 -6658 23269 -450 -61192 -76716 -63579 -25264 -14423 -55644 -75168
10772 -75168 -13958 -28573 -63 43300 36172 24912 -13171 -19568 -38 -4402 -48633 -45514
10760 -45514 -53357 -72559 -85806 -60954 -44693 -54304 -26268 37757 77242 139540 113346 51757
10748 51757 -38824 -49906 -5240 -5296 -13942 5917 18274 22007 41708 39812 20888 2311 -10763
10735 -10763 -25690 244 23121 3237 -42291 -64648 -104029 -126361 -161203 -181871 -173625 -143020
10723 -143020 -45302 53980 24160 20077 80907 64042 74162 97464 116380 111510 169679 152647
10711A52647n6502K0015p2262n7621k4799q079M4026K9588l4639p3250k3490O6963
10699c7403K5335O993n3511L157j0652k0132k3653p980P3006M6341j9219r8288
10687a16006J6128k856P033M8358M0790q217R398n1670J7606M1495j941l0842
10675c0724j800N245M2792K4196l3431l5182M7981K5387q73k6588p244l3763n6484
10662h0488N1406Q437j8756j3840P0198M7551o1370q6413K5307P4764J1348l2463
10650d319m1885K4611N0616J6325k8373n3368L5119L3114m8127r268k4059l1276
10638h0890L0232J39637J6879r4706l2822o0402m9800P2727O3605L0987k440M39
10626C3446o301j4456K4658M822l2097p7750K388L9497K6156j1980L3156Q7082
$$ plain form
10711 152647 96145 116160 43898 -13723 -38522 -46601 -2575 27013 -7626 -80876 -104366 -37403
10699 -37403 -12068 -5075 -58586 -55429 -66081 -86213 -109866 -117846 -44840 1501 -17718 -116006
10687 -116006 -99878 -102734 -95701 -47343 -6553 -14770 -5372 -57042 -39436 2059 118 -30724
10675 -30724 -32524 -27279 15513 39709 6278 -28904 19077 44464 43591 17003 9759 -24004 -80488
10662 -80488 -29082 -20645 -39401 -53241 16957 64508 3138 -83275 -57968 16796 28144 -4319
10650 -4319 -46204 -21593 29023 45348 16975 -36393 -1274 31840 -16287 -25555 -49614 -80890
10638 -80890 -50658 88979 105858 11152 -21670 -82072 -131872 -59145 4460 35447 33007 33446
10626 33446 27145 12689 37347 42169 10072 -67678 -65290 -25793 363 -11617 21539 108621
10614A08621k5184j09266j440K324K7902k6514l0620j0623K1553J8683K0731j8783
10602b2616n1455J5740J1801o016j1859J2416N4949o6184k2709P4256K5201J4
10590A3538K4984K4651l3084m9798l5202L3668J6339j1561P4884P539p6772l4236
10578d5050O6551J7985K1305p375m2647P7015j8690n0520M0220j9902n3509j2234
10566b6851J00006N6820m6668j23292p0319K7535k140N0254K6713M667K3013j0917
10554H821O4774L2657m1770Q423L6129K4350j4812o4916J874J6978o4665n7811
10542d9968P93N7074J3361j0779K6110j5282l9669j7774O1140J451K015j0787
10530A7685m683P948J0047k9314L656j9405M5250j1532l6362J3538L1456O8416
$$ plain form
10614 108621 83437 -25829 -27269 -24945 2957 -23557 -54177 -64800 -43247 -24564 -3833 -22616
10602 -22616 -74071 -58331 -46530 -52546 -64405 -51989 2960 -63224 -85933 -11677 13524 13538
10590 13538 38522 63173 30089 -19709 -54911 -21243 -4904 -16465 58419 65958 -10814 -45050
10578 -45050 21501 39486 60791 53416 10769 87784 69094 18574 58794 38892 -14617 -26851
10566 -26851 73155 129975 83307 -39985 -110304 -82769 -84909 -34655 -7942 -3275 19738 8821
10554 8821 73595 106252 64482 72905 109034 133384 118572 53656 55530 72508 7843 -49968
10542 -49968 -49175 7899 21260 10481 36591 21309 -18360 -36134 25006 26457 28472 17685
10530 17685 13002 20950 30997 1683 5339 -14066 31184 19652 -16710 -3172 28284 96700
10518I6700J929n827j5389j1702j8160N4592K5028n2158m8150l22k5262O1561
10506F2840J2198j534j6941k9711j8154o9r919Q798k0283m6839Q2494l625j5957
10493C298r184R749J9581l9364K7344j4102l3569q479J8245L8171m0769p010m511
10480d0600M729j389R294M1763K7489k7834p2925L9676J2747l7007n8101m4318
10468a46476L7397M1091k7613k3691N3314O2999M9391r6m4472m6594l759K3393
10456b5116J0546p0009L5559L5989j1681k4930K0522J7519j1904M7317L1710m0273
10444A5249j2737L159M9126O3356K4725j2416m3969n098j6708p346n0425J0807
10432A7723M2118k2349R411n0630o2285K1496Q5991O3356k6309j7958m541j0872
$$ plain form
10518 96700 98629 92802 77413 65711 47551 102143 127171 75013 26863 26541 1279 62840
10506 62840 75038 73504 56563 26852 8698 8629 -1290 7508 -12775 -59614 22880 19255 3298
10493 3298 -5886 3863 23444 -15920 11424 -2678 -36247 -44726 -26481 11690 -29079 -36089 -40600
10480 -40600 -35871 -37260 -27966 13797 41286 13452 -59473 -19797 -7050 -44057 -102158 -146476
10468 -146476 -109079 -67988 -95601 -119292 -65978 -2979 46412 46316 1844 -44750 -48509 -25116
10456 -25116 -14570 -84579 -49020 -13031 -24712 -49642 -29120 -11601 -23505 23812 55522 15249
10444 15249 2512 5671 54797 118153 142878 130462 86493 81395 64687 57341 6916 17723
10432 17723 59841 37492 46903 -3727 -66012 -44516 41475 104831 78522 60564 56023 45151
10420D5151l2135o8526k0175P6155M6767J3664l2332n383R519j7598K3048O3015
10408A01170k8191r8222m2679Q0231l5701m3252o592L4431k81k5744n488K2605
10396d7713L3010K9633j5131M325L2840n2012n3915o457j2638L0884L2170J2250
10384a2754m6263q2092K6575L3188J3320N4339j4427l4306J1105l9393o524N1946
10372d5286Q3300P532m9437k8104O477J2945J86O3902Q0010o6835J1865n4618
10360B1937k8762o341O9825m2449l6843j3029L883R9789J3199m562j1728j77N6575
10347A21317j1428o5879l7015J1264r492Q975m940M8919O370p7715L0584K1823
10335D2783m4729n9841p402M6495P0282O095J8408q954K6671K8218j1725m9371
$$ plain form
10420 45151 13016 -55510 -75685 470 47237 60901 28569 23186 32705 15107 38155 101170
10408 101170 72979 -25243 -67922 12309 -23392 -66644 -73236 -38805 -39086 -64830 -70318 -47713
10396 -47713 -14703 14930 -201 4124 36964 -15048 -68963 -75420 -88058 -57174 -25004 -12754
10384 -12754 -59017 -141109 -114534 -81346 -68026 -13687 -28114 -62420 -51315 -90708 -97232 -45286
10372 -45286 38014 45546 -3891 -31995 -25518 -12573 -12387 51515 131525 64690 76555 21937
10360 21937 -6825 -13166 56659 14210 -22633 -35662 -31779 68010 81209 76647 64919 64742 121317
10347 121317 109889 44010 6995 18259 8767 17742 12802 61721 68091 -9624 20960 42783
10335 42783 -1946 -61787 -69189 -22694 47588 53683 72091 63137 89808 118026 106301 56930
10323E6930J7298L4116n2621k5723o6524k0639N5055K431j8097o268Q673L4857
10311A9488L2952j3790m7915k7846j2689p2133k3373N0927L7352K2627N1119K6394
10299D3113l4743j9484k1707J1804l220K558L1802j0998j9350r643m614j949N8827
10286B2396J11248J0197l5392j1274R49L101r6000k2454L201K7603l1434r761
10274b7620j5251R4116M0862p6825m111j0481l5942k294J1568O937L9472N1527
10262G1958R640l1726m3096p658q031l0408o0770j3953N1865M3683M1260J1050
10250C3814l8483k4278n58j409q795k3704K2112N9607j9514m4093k0003K9991
10238c5313O9057J2821k6579J388J5629q2682j0214l0460J0167N029O906J9709
$$ plain form
10323 56930 74228 108344 55723 30000 -36524 -57163 -2108 323 -17774 -24042 -15369 19488
10311 19488 52440 38650 -9265 -37111 -49800 -121933 -145306 -94379 -57027 -34400 16719 43113
10299 43113 8370 -11114 -32821 -21017 -24237 -21679 10123 -875 -20225 -29868 -34482 -36431 22396
10286 22396 133644 143841 108449 97175 98124 101225 5225 -17229 -14028 13575 -17859 -27620
10274 -27620 -42871 51245 92107 15282 11171 690 -35252 -37546 -25978 -19041 20431 71958
10262 71958 81598 49872 6776 -882 -8913 -39321 -100091 -114044 -62179 -18496 22764 33814
10250 33814 -4669 -28947 -29505 -30914 -39709 -63413 -41301 18306 -1208 -45301 -65304 -35313
10238 -35313 33744 46565 19986 21374 37003 -45679 -55893 -86353 -76186 -71157 -64251 -44542
10226d4542k0546O40M0232K9198j7650M7742l052P210k2503l1469K3420Q251n2278
10213c5347r041K9566K4144j5389j2L5566j69j2244j6133o2463J4480k0647J0333
10200e7356n7564o8147N0572M1876j1644O1712O0052L2188K9881l0289m2381k2147
10188a3247l421K3488Q327r5129k2730O8487L0732n351M1718M5796l0888l9509
10176H273n5953k5680M8964O8944k5982L2344J7376l4446j967j2100r526j6865
10164f618M355O890o8568l8415m846K4534K0072l1179J8431J00078P2502o5610
10152C1626m2185M5964m991J1311J9876J5412m4386K759j0704m9822l5351j174
10140f1665K0413J0476N7483L7532L2170k743r881m555k6844m2472K3843p60n0999
$$ plain form
10226 -44542 -65088 -64448 -24216 4982 -12668 35074 32022 39232 16729 -14740 8680 16931 -35347
10213 -35347 -44388 -14822 9322 -6067 -6079 29487 29318 17074 941 -61522 -47042 -67689 -57356
10200 -57356 -114920 -183067 -132495 -90619 -102263 -40551 19501 51689 81570 51281 8900 -13247
10188 -13247 -16668 6820 15147 -79982 -102712 -34225 -3493 -8844 32874 78670 47782 8273
10176 8273 -47680 -73360 -24396 44548 18566 50910 68286 33840 31873 19773 10247 -6618
10164 -6618 -2263 4627 -63941 -102356 -107202 -82668 -62596 -93775 -75344 24734 97236 31626
10152 31626 -10559 35405 30414 41725 61601 77013 32627 35386 24682 -25140 -60491 -61665
10140 -61665 -41252 -30776 26707 64239 96409 93666 83785 79230 52386 9914 33757 32997 -18002
10127a8002j0700N1612k6850q6276l1339P858L4394N8563L2880N029j8730n8710
10115f0271J9430L3892j2351J8574J1463l8061p6515N193P3656N8163m1681k9266
10103c7774m4836j7104k11L7162K9918O862j0902M7784O07J966M3258L2336n412
10090H3654n9315m8267J6895j907m6697j0204O1982p192j3071k6199k3718J2188
10078f1851L2130K1711K1833N3668J5717p0073m7021k2346l7737M5249Q6583j457
10066C6406J7615M3002p6071l1119j8021k3444j7957K0398K8209P1699M9360m6914
10054E3163j2614k5230j9023L7525N9267l883k28L2283J7561p2658j03785o0512
10042i8134k468J4195J8950P8575k849J6267K6453j9815j9366K1220J478k7524
$$ plain form
10127 -18002 -28702 22910 -3940 -90216 -121555 -113697 -79303 -20740 12140 17169 -1561 -60271
10115 -60271 -40841 -6949 -19300 -726 10737 -27324 -103839 -98646 -24990 33173 -8508 -37774
10103 -37774 -82610 -99714 -99925 -62763 -32845 -25983 -36885 10899 11506 13472 56730 89066 83654
10090 83654 24339 -23928 -7033 -8940 -55637 -65841 -3859 -11051 -24122 -50321 -74039 -61851
10078 -61851 -29721 -8010 13823 67491 83208 13135 -33886 -56232 -93969 -48720 37863 36406
10066 36406 54021 97023 20952 -10167 -28188 -51632 -69589 -49191 -20982 50717 100077 53163
10054 53163 40549 15319 -3704 33821 93088 89205 88977 121260 138821 66163 -37622 -98134
10042 -98134 -100602 -86407 -67457 11118 8269 24536 50989 31174 11808 33028 34506 6982
10030F982j13P408J9469p771l8330j3300M8406N0715K4771j2752k3705L368k4830
10017D0318l3034q9272J7230M5752N4138l8633m785K5022j0525k9494O9105K4017
10005F9839N578n2823l3774p729N2221j2551k0389P1855J6907n1559o6056J8551
9993i930J2601L9995K247L4410j1858j5867M6218k087K286l5932o6818j4328K827
9980a6236J4135K8647j3141n2207M7585O6576l1271n8319Q597N0425J9161l2237
9968C1715K8306k1324l7236R543R65q993o641m4495k21L0004p511p599k5569O3988
9954D932P4971k4364M9870L1905J01868M3818m0330j02316k9514k5880K3976K789
9942A11725P8910R4271O2902J04165K69773L92808P7649l08965l23141k26094
$$ plain form
10030 6982 6869 14277 33746 25975 -12355 -25655 22751 73466 98237 85485 61780 65148 40318
10017 40318 7284 -81988 -64758 -19006 35132 -3501 -8286 16736 6211 -23283 45822 69839
10005 69839 75417 22594 -11180 -18909 33312 20761 372 72227 89134 37575 -28481 -9930
9993 -9930 2671 42666 44913 79323 67465 51598 97816 95729 98015 62083 -4735 -19063 -16236
9980 -16236 -2101 26546 13405 -38802 8783 75359 44088 -14231 -5634 44791 63952 31715
9968 31715 60021 38697 1461 11004 11969 2976 -3665 -48160 -48381 -18377 -25888 -33487 -59056 4932
9954 4932 79903 55539 105409 137314 239182 283000 242670 140354 110840 84960 108936 111725
9942 111725 190635 284906 347808 451973 721746 1114554 1192203 883238 560097 334003
9932C34003j76416j23760p049K413J270J0849Q754J9002l7611l9080K9648k559
9920A9464j0621M24k9441j7818P90q275K5028k1123j795l2263L9659O0923M3920
9907F8872j0968q8255m2679L4527M7366j8767L1696L6216k234l830k4203r9858
9895g2117r294J5380L5146M0608O1503n469L500j8524o498L8802j4313n4283q6390
9882g1949k5836J6582J9477L140P5364J05180J61619Q2427l2976r3113q4989p8637
9870G6289o653k0344l8223L5684J2549M84l9762K2874J9621J02811O896q1058
9858I1168k8686m268k2400j06132J6123L6377N71m27J0694p134K2468l0324m7180
9845f9150j3602O557O091q933J6075L7394j445k9571K8489M0475j2777M1009L0968
$$ plain form
9932 334003 157587 33827 26778 29191 30461 41310 50064 69066 31455 -7625 22023 19464
9920 19464 8843 9267 -20174 -37992 -37202 -45477 -20449 -41572 -43367 -75630 -35971 24952 68872
9907 68872 57904 -30351 -73030 -38503 8863 -9904 21792 58008 55774 51944 27741 -72117
9895 -72117 -81411 -66031 -30885 9723 71226 65757 69257 50733 44235 83037 68724 14441 -71949
9882 -71949 -97785 -81203 -61726 -58586 16778 121958 283577 366004 333028 239915 154926 76289
9870 76289 69636 49292 11069 46753 59302 59786 20024 42898 62519 165330 172226 91168
9858 91168 62482 58214 35814 -70318 -54195 -17818 -17247 -17674 -6980 -14114 8354 -21970 -69150
9845 -69150 -82752 -76195 -70104 -79037 -62962 -25568 -27013 -56584 -28095 12380 -397 40612 71580
9832G1580p338l9631J0326M829l8270q6009o158Q9883j1861N8324J7148R4l9601
9819B3316j7698J9906k648k3470l0695l3740O830l4988l7725l528j14K5306M5492
9806f3756R4746M7488j5496q856L2430j3637l9869j7275L8822k6435m2451r6804
9794a11093p4338L3486Q8812Q8542j636k4923L589M574k706o651o0780l0476K0129
9781g3471K2018l6748J6796m1N389N113M2558L7610m1645k4444O6765L9810j7058
9768D2652j9030J0382M7843l3373m7170k549R860j5839m6131K2303N0277J3520
9756C2745l4499M4798M4410J547r792K627J1733j3195l48n0056n403l8591l1677
9743d5701K4036j1407J2628n918m7394l4364K5056Q0201P1404o9777m5129K7239
$$ plain form
9832 71580 64242 24611 34937 39766 1496 -84513 -90671 -788 -12649 45675 62823 62917 23316
9819 23316 5618 25524 22876 -594 -31289 -65029 -58199 -93187 -130912 -134440 -134554 -109248 -63756
9806 -63756 30990 78478 62982 54126 86556 72919 33050 15775 54597 28162 -14289 -111093
9794 -111093 -185431 -151945 -63133 25409 23773 -1150 2439 7013 4307 -2344 -63124 -93600 -73471
9781 -73471 -51453 -88201 -71405 -71446 -66057 -60944 -18386 19224 -22421 -46865 19900 59710 42652
9768 42652 23622 34004 81847 48474 1304 -1245 8615 -7224 -53355 -31052 19225 32745
9756 32745 -1754 43044 87454 89001 79209 81836 93569 80374 80026 29970 24567 -14024 -45701
9743 -45701 -21665 -33072 -20444 -26362 -73756 -108120 -83064 -2863 68541 -1236 -46365 -19126
9731a9126J8521M431M718M1841j6691l5833N7364j8134m3017j9612k7894m5891
9719i9323J5970O0894Q594k9866m3817K0933K185Q764K2233m703l6841K949K15
9706g1813J4713L3997Q4948R877m6336m9855j5436p100J9170M5024n0199K5951
9694g059K6710P987k2910j2020n1325J390j6033j3950L9519P049j8595k7988K8028
9681e9197M662k6419N7632M7102N6281p5110q5129k091L0863N279O7859O9436
9669I1168j3926j6826p0371k5842Q701M8212O2567K162k9403m866j3573k8791
9657I212K0546l5039R59j5049m5467r818l3482k0119j493L1554J05498R4464J4593
9644A16359m0779q8052J4238l7558p0906K5598N7005K465l9305j2310N1501M8900
$$ plain form
9731 -19126 -605 3826 8544 50385 33694 -2139 55225 37091 -5926 -25538 -53432 -99323
9719 -99323 -83353 -22459 -13865 -43731 -87548 -66615 -64430 -55666 -33433 -38136 -74977 -72028 -71813
9706 -71813 -57100 -23103 61845 71722 25386 -24469 -39905 -47005 -27835 17189 -33010 -7059
9694 -7059 19651 27638 4728 -7292 -58617 -57227 -73260 -87210 -47691 -40642 -59237 -87225 -59197
9681 -59197 -54535 -80954 -23322 23780 80061 4951 -80178 -82269 -51406 -46127 21732 91168
9669 91168 77242 60416 -9955 -35797 -27096 21116 83683 85845 56442 51576 38003 9212
9657 9212 29758 -5281 -4322 -19371 -64838 -74656 -108138 -128257 -129750 -98196 7302 101766 116359
9644 116359 75580 -12472 1766 -35792 -106698 -81100 -24095 -21630 -60935 -73245 -21744 27156
9632B7156K5070J0657m562j0662p1653K5053L0671L585J6919L1320K5599J8904
9620A28057k4273l7288l1357l4162k2652J4063o092j0050P603p106l4696m831
9608f2784j1446l4987O4699P167l2013J374Q6037j9838J6636M1820l8112j7374
9596A179K062J592K3012r121j2914P772K5829k6818n9314J6851k0913K0396L915
9583b6472j6422K18j6443k9807j719O023M5417J18832l7678k8144j1201K1439
9571B4043J295J1084j357j0152n0518P00P1401L6507K2036o0468n0427j1581J3901
9558c536N0628r612J8543L6842K9356k0436o1112k4016n023R3209k4821o0904
9546A9118P701R037j9435l3175M9020J7887l2873k6322M1536J2986r929K6018
$$ plain form
9632 27156 52226 62883 58321 47659 -23994 1059 31730 35315 52234 83554 109153 128057
9620 128057 103784 66496 35139 977 -21675 -7612 -13704 -23754 -16151 -23257 -57953 -62784
9608 -62784 -74230 -109217 -44518 -37351 -69364 -67990 18047 -1791 14845 56665 18553 1179
9596 1179 3241 4833 27845 18724 5810 13582 39411 12593 -46721 -29870 -50783 -30387 -26472
9583 -26472 -42894 -42676 -59119 -88926 -90645 -84622 -39205 79627 41949 13805 2604 24043
9571 24043 25338 36422 35065 24913 -25605 -24905 46496 83003 105039 44571 -5856 -17437 -3536
9558 -3536 47092 37480 56023 92865 122221 101785 40673 16657 11634 104843 80022 19118
9546 19118 26819 35856 16421 -16754 32266 50153 17280 -9042 32494 45480 35551 61569
9534F1569k547M351o732o0922q706r044J0996j6593l8741n930K9651K5688J56
9521a6804M106k6354k7429Q8003K753J3649j749L7088j9141K8242j9723J7639
9509H0280k1052p4699P2790k747K2382k9805m3790l5096J968k1033L6917Q1581
9497F7696l8753m0524N3791K1579o8767l1756P6357j9979J0826M4860O2561n771
9485A32120n6928j7384L853Q065J6307k9249q510o4053m0707R095p98p651K8292
9472b7548O843M8775N0566n7683p324J5297J7995Q587N3183j7641l2763L053K7167
9459H8507J8293m630k5735k2276K1366K400o8477o4918K0542R3455J0557k7637
9447D1447P0660m389l3411M5678k2887j11156n3439O739l8873M9388P5464K2260
$$ plain form
9534 61569 59022 63373 56641 -4281 -12987 -22031 -11035 -27628 -66369 -72299 -42648 -16960 -16804
9521 -16804 -12698 -39052 -66481 21522 24275 37924 36175 73263 54122 82364 62641 80280
9509 80280 59228 -15471 57319 54572 76954 47149 3359 -31737 -29769 -50802 -13885 67696
9497 67696 28943 -11581 42210 63789 -4978 -36734 39623 19644 30470 75330 137891 132120
9485 132120 75192 57808 61661 69726 86033 56784 48274 -15779 -56486 -47391 -48189 -55840 -27548
9472 -27548 -20705 28070 78636 20953 13629 28926 46921 55508 108691 91050 58287 61340 88507
9459 88507 106800 102170 76435 54159 75525 77925 9448 -55470 -34928 58527 69084 41447
9447 41447 112107 107718 74307 119985 97098 -14058 -67497 -60758 -99631 -50243 25221 47481
9435D7481o3492j5649m3425L8272O8205K3729L7560M4265j1658j1568r594n151
9423I8975o0310m4000k1864K9759R3573O3905n1567n7302m8678j5084L3653q942
9411A2118J9937K3916J3550j9788j2430k6492k6920M2645K9712J6498m0162R134
9399D1718J8536J6928k1978j4119j7819K3897J8080k1969J621P827L097K9271
9387H5090k7874k1566r881k0579p7817j0665O4563k69l038M0196K8301N165o4287
9374a2661l6786L2810N6700K1877l5115j6428L509R994K5933K0340j3198k2901
9362C4074m7329k3065L0593L0627K8564K4174n4103k2014K7350N2761K5455l559
9350A03528j8145o2050p5439J0157R0652l4773o5481j1424M0824L8105k4401K3910
$$ plain form
9435 47481 -16011 -31660 -75085 -36813 31392 55121 92681 136946 125288 113720 104126 98975
9423 98975 38665 -5335 -27199 2560 96133 160038 108471 51169 2491 -12593 21060 12118
9411 12118 32055 55971 69521 49733 37303 10811 -16109 26536 56248 72746 32584 41718
9399 41718 60254 77182 55204 41085 23266 47163 65243 43274 44895 52722 55819 85090
9387 85090 57216 35650 25769 5190 -72627 -83292 -18729 -18998 -22036 18160 46461 51626 -12661
9374 -12661 -49447 -16637 40063 61940 26825 10397 13906 23900 49833 70173 56975 34074
9362 34074 -13255 -36320 -5727 24900 53464 77638 23535 1521 28871 81632 107087 103528
9350 103528 85383 23333 -52106 -41949 48703 13930 -51551 -62975 -22151 15954 -8447 15463
9338A5463j4205j0757k839K6871K8626O0754O5651L2631L9218q3057o0977M6630
9326A44009k6760k6418J0668n0569p2062k1336m3979O6555J5841K170j6907J0604
9314h184J393P436k4215o942L0867L9552K2288O554j8555j5632N398M798K7377
9301G2135N2329l872j1482l1978l7439j7733N7699N0168L9751j6221O635M805
9289A64797k3888j2500k4510o4557L7938J0642o0965k0953R0655P1007Q809m9238
9277A27237K5021M972k4322k5763M5336L7710k5621r2885o7653J7368J06323L7105
9265A64828l202m2686q1674J5936L9365M3459P4862l664p2208n3808O5046N4165
9253B00419K632l8335p5071l2748J9931N4812P8904L0376o6320k6276k2692j1297
$$ plain form
9338 15463 1258 -9499 -12338 14533 43159 103913 169564 202195 241413 158356 97379 144009
9326 144009 117249 90831 101499 50930 -21132 -42468 -86447 -19892 -4051 -1881 -18788 -8184
9314 -8184 -6791 645 -23570 -30512 355 39907 62195 68749 50194 34562 39960 44758 72135
9301 72135 124464 120592 109110 77132 39693 21960 79659 129827 169578 153357 159992 164797
9289 164797 140909 128409 103899 39342 77280 87922 26957 6004 96659 167666 176475 127237
9277 127237 152258 157230 132908 107145 152481 190191 164570 71685 4032 21400 127723 164828
9265 164828 161626 118940 37266 53202 92567 136026 210888 207224 135016 81208 146254 200419
9253 200419 203051 164716 89645 56897 76828 131640 210544 240920 174600 148324 125632 114335
9241A14335K2295N131o3239M0046K8961q616n5518N4580J7409L6144j9877o5101
9229A06550L949O2031J5610j0957J6995L1777K4407L337J4008J8822l1717l5076
9217B19736O6402N0467P8746J1645p6138L5885L1007N8555O4698K4525l8331l1628
9205D95569k9531N9936J09082L7176Q8831N1850j3832J2896M9527J893P640J4734
9193H85771R2057J10179M4701N4059J05019P9906J26379J62182J45350K07202
9183B012805K16572K85110K31035L46772L79880M62976N44198N82783P07702R76586
9173F746419J246929J552648K071116K701595L399069M401798N621597O477087
9165C4218258O171593L867072o8482l821524n907508o381410n702278m694620
$$ plain form
9241 114335 136630 141761 78522 118568 147529 138913 83395 137975 155384 191528 171651 106550
9229 106550 110499 172530 188140 177183 194178 225955 250362 253699 267707 286529 254812 219736
9217 219736 286138 336605 415351 426996 350858 386743 417750 476305 541003 565528 527197 495569
9205 495569 466038 525974 635056 672232 761063 812913 799081 811977 861504 863397 871037 885771
9193 885771 977828 1088007 1132708 1186767 1291786 1371692 1498071 1660253 1805603 2012805
9183 2012805 2229377 2514487 2745522 3092294 3472174 3935150 4479348 5062131 5769833 6746419
9173 6746419 7993348 9545996 11617112 14318707 17717776 22119574 27741171 34218258
9165 34218258 40389851 44256923 44188441 40366917 34459409 28077999 22375721 17681101
9157A7681101l678740k787827k094837j550407j186118r55704p02481o23283n34791
9148C566913m35121l41452l40633k74708j69278j90412j08139j28441j52781p3731
9138A352217r8689j03616r3222o0667o7439j8393o0904o0872j01773l0565m0973
9127F15104l6028k3673J7038k6321r5903m6444J881o8896q2361O8639N9713l9562
9115C43187o8972p1214M6647k656o0048m4885L9457O8463O9378k259j15745j7130
9103A84223N162j5007j1440J5374m0487L2913P310K613k3458o4307J5977L4768
9091A43641J3108J3349K5571n0259j9694L222k6818N9068K3092J2125j9445m4862
9079A32098j4667N710K2184n428q256j8648N1664k5422j4890j137r5314k2473
$$ plain form
9157 17681101 14002361 11214534 9119697 7569290 6383172 5427468 4724987 4101704 3566913
9148 3566913 3131792 2790340 2449707 2174999 2005721 1815309 1707170 1578729 1425948 1352217
9138 1352217 1253528 1149912 1056690 996023 928584 910191 849287 788415 686642 656077 615104
9127 615104 579076 555403 572441 546120 450217 403773 405654 336758 254397 323036 382749 343187
9115 343187 274215 203001 249648 246992 186944 142059 181516 249979 319357 317098 201353 184223
9103 184223 189385 174378 162938 178312 137825 170738 178048 180661 157203 92896 108873 143641
9091 143641 156749 170098 195669 145410 125716 128938 102120 161188 184280 196405 176960 132098
9079 132098 117431 123141 145325 139897 131641 112993 164657 139235 124345 123208 27894 5421
9067E421j6908j5490Q279J6162L3043L4469k7184P7454P835k9044q250L0525J2350
9054A28662l0503J3054M1411k417o6425k5718o723l942N983j3994Q214j4248k8253
9041E101O5201M4928o464R66J3768q84l5275n1420r6075n544L5756J9093J5058
9028D209m7152n1993J0785M639L2755M8893P9780M7868k8711M1337m5739m4998
9016E1673M6423j3634n455J1505m2610n2392J0723O676m5033K4057O8358P8559
9004A38850J467p7298m869L0133k7412J7198K0043m5339q6925L4647K6178N666
8992C2339J8246J825m9536M4986J6602k6917J99k709j0864K0016M3556J3321o9062
8979C2002m7035K1374k2161m1860J108J295P308M2622m032k3348j8506j255j1464
$$ plain form
9067 5421 -11487 -26977 -18698 -2536 30507 64976 37792 115246 123081 94037 85787 116312 128662
9054 128662 98159 111213 152624 150207 83782 58064 51341 47399 53382 39388 47602 33354 5101
9041 5101 70302 115230 108766 109732 123500 122616 87341 35921 -60154 -65698 -29942 -10849 4209
9028 4209 -42943 -94936 -84151 -79512 -46757 2136 81916 129784 101073 142410 96671 51673
9016 51673 98096 84462 79007 90512 47902 -4490 6233 12909 -32124 -8067 60291 138850
9004 138850 140317 63019 58150 88283 60871 78069 98112 52773 -34152 495 26673 32339
8992 32339 50585 52410 2874 47860 64462 37545 37744 35035 24171 44187 87743 101064 32002
8979 32002 -15033 6341 -15820 -57680 -56572 -55277 -47969 -5347 -9379 -32727 -51233 -52488 -63952
8966f3952L854R164K2780K7440K655j3996M0016j7761l9634N7249L1809m1710
8954A7914J3589L5481m0463L903L547k9082m4279K9305J7446m0727l799N3263
8942A6098j0086n7635J8827l124N1834j2455O4630L9646n0357k4043m1142j105
8930h912Q3136n8869p026k3942o115N6573L0750m268K598n5736J4067M9815o4562
8917G509l0460k8741J6017M6173N091j8022m0325k609K08J1515K2991r713k3069
8904d3435J6842L3221O685l4967k5884K4465J4915J2602J4894K0342M0440k1533
8892E8587l7405j9147k4174J7693K1476k272k7840K4263k1933o4482j8683M4560
8880d9357N0152K1703J0044q070m4311J808R209P425R4157P1855l1084q0447r787
$$ plain form
8966 -63952 -60098 -50934 -28154 -714 1941 -12055 27961 10200 -29434 27815 59624 17914
8954 17914 31503 66984 26521 30424 33971 4889 -39390 -10085 7361 -33366 -37165 16098
8942 16098 6012 -51623 -32796 -35920 15914 3459 68089 107735 57378 33335 -7807 -8912
8930 -8912 74224 15355 8329 -15613 -21728 34845 65595 61327 63925 8189 22256 72071 7509
8917 7509 -22951 -51692 -35675 10498 15589 -2433 -42758 -45367 -45159 -33644 -10653 -20366 -43435
8904 -43435 -26593 6628 13313 -21654 -47538 -23073 -8158 4444 19338 39680 80120 58587
8892 58587 21182 2035 -22139 -4446 17030 14758 -13082 11181 -10752 -75234 -93917 -49357
8880 -49357 795 22498 32542 24472 -19839 -18031 -8822 -1397 92760 164615 133531 53084 43297
8867D3297j2966k6189N1881N8777j4752j1372L262l1272M5336J2300j4812L3515
8855A37005l47n27j3372J507m4053n8610n58J7233R109L2586L9746r3581j03532
8842g7394j1564R5047m6037m1032M3605Q6249l3269k0991M4458P114M0700k7892
8830E8994l5070m3614R165n8885K271P8227R7360r906r9463k1858M6284K3214
8818D6719j1610n780m4341N786r250o9647p567N1498N7585O0118l678N8719L582
8805A32134j47609k4887N8322P8475j8327o0575J9164J2006L3066q009m652k0086
8793D9022n52o86j4719n609j5769m3107n718P562L1005J0849J6169Q835o2129
8780b4847J080J9462k3233K4407k250k7117k1618k7105o3003m2509N3673P1075
$$ plain form
8867 43297 30331 4142 56023 114800 100048 88676 91938 60666 106002 118302 103490 137005
8855 137005 136658 136131 122759 124266 80213 21603 21045 38278 47387 79973 119719 26138 -77394
8842 -77394 -88958 6089 -39948 -80980 -37375 48874 15605 -5386 39072 46186 86886 58994
8830 58994 23924 -19690 -10525 -69410 -67139 11088 108448 98542 -921 -22779 23505 46719
8818 46719 35109 29329 -15012 -9226 -18476 -88123 -95690 -44192 13393 73511 69833 128552 132134
8805 132134 -15475 -40362 17960 96435 78108 17533 36697 48703 81769 73760 69108 49022
8793 49022 48470 47784 33065 27456 11687 -31420 -37138 -29576 1429 12278 28447 37282 -24847
8780 -24847 -23767 -4305 -27538 -3131 -5381 -32498 -54116 -81221 -144224 -186733 -133060 -61985
8768f1985O5537L8501N8095r265J4455l622l6252o3183l2566k706j8258n4415
8756a05664J3374J17716O4697m1666k2158R379k9510m137K2228n2231j3059N1217
8744A0186j7944j6843j1101j3330o6845L377J1774K2485l2150O2718K8981m4989
8732f3681j3544J1815N9524N0215M1902Q153j3504r0292l0452M9151L7358m4874
8720A771K0693O1662K3148m3847n8490l1454K7844k6787l3562L057k1254M4954
8708c2265M9600L9909J9410o8974m942P266o545J8897L8155P35m410J9204j8143
8695E7897J1199m9392k3564k7841J0543M4167k6903J1562j4388n4701o404L5750
8683c2075R664p274L770J8930j2367K198J6394N7003L2016n6836o3377q458M9460
$$ plain form
8768 -61985 3552 42053 100148 90883 105338 101716 65464 2281 -30285 -32991 -51249 -105664
8756 -105664 -92290 25426 90123 48457 26299 35678 6168 2031 24259 -27972 -41031 10186
8744 10186 -7758 -24601 -35702 -49032 -115877 -112500 -100726 -78241 -110391 -47673 -18692 -63681
8732 -63681 -77225 -65410 -5886 44329 86231 94384 80880 -9412 -39864 9287 46645 1771
8720 1771 22464 84126 107274 63427 4937 -26517 1327 -25460 -59022 -55965 -77219 -32265
8708 -32265 17335 57244 76654 7680 2738 10004 3459 22356 60511 61246 56836 76040 57897
8695 57897 69096 19704 -3860 -31701 -21158 23009 -3894 7668 -6720 -61421 -67825 -32075
8683 -32075 -22411 -29685 -25915 -6985 -19352 -17154 -760 56243 88259 31423 -31954 -40412 9048
8670I048K9515m1077l8693N3241O797Q0327l2229k1175k8874P951N518K7679j5426
8657D2602j5661l4394L7k5527M2917j1080M6049K3766J6117j6906M0755J9203
8645A27878K3660K5085q2937k1103J6544p6985k6713L1346L8216q178o0363q820
8633b2370J1525p249M9573P0029m6759l9913m7637N5550J3824p341P73O8245l9279
$$ plain form
8670 9048 38563 -2514 -41207 12034 18831 99158 66929 45754 16880 24831 30349 58028 42602
8657 42602 26941 -7453 -7416 -32943 9974 -1106 44943 68709 84826 67920 108675 127878
8645 127878 151538 176623 93686 72583 89127 12142 -14571 16775 54991 46813 -13550 -22370
8633 -22370 -10845 -18094 31479 101508 54749 14836 -32801 22749 36573 29232 30005 98250 58971
$$ [...]
##END NTUPLES=NMR SPECTRUM
##END=
