##TITLE=Analysis number 313466
Compound Code cc 10413
Book Reference 441/137
Project Code adrs
Chemist Name colinb
##JCAMPDX= 6.0         $$ Bruker NMR JCAMP-DX V2.0
##DATA TYPE= NMR SPECTRUM
##DATA CLASS= NTUPLES
##ORIGIN= Bruker BioSpin GmbH
##OWNER= NMR
$$ XWIN-NMR		Version 3.5
$$ Fri Sep  9 11:25:28 2005 GMT Daylight Time (UT+1h)  MAYBRIDGE\NMR@NMR_250MHZ
##.OBSERVE FREQUENCY= 250.131544655141
##.OBSERVE NUCLEUS= ^1H
##.ACQUISITION MODE= SIMULTANEOUS (DQD)
##.ACQUISITION SCHEME= undefined
##.AVERAGES= 16
##.DIGITISER RES= 18
##SPECTROMETER/DATA SYSTEM= dpx250
##.PULSE SEQUENCE= zg30
##.SOLVENT NAME= CDCl3
##.SHIFT REFERENCE= (INTERNAL, CDCl3, 0, 16.522)
##AUDIT TRAIL= $$ (NUMBER, WHEN, WHO, WHERE, WHAT)
$$ ##TITLE= Audit trail, XWIN-NMR		Version 3.5
$$ ##JCAMPDX= 5.01
$$ ##ORIGIN= Bruker BioSpin GmbH
$$ ##OWNER= NMR
$$ C:\u/data/dgb/nmr/ADRS/9160/pdata/1/auditp.txt
$$ ##AUDIT TRAIL=  $$ (NUMBER, WHEN, WHO, WHERE, WHAT)
(   1,<2005-09-09 11:25:07.17 +100>,<MAYBRIDGE\NMR>,<NMR_250MHZ>,
      <created by zg, POWCHK disabled, PULCHK disabled
       configuration hash MD5:
       62 19 C7 07 E1 42 D1 B7 37 6C 3D D0 77 39 F9 E6
       data hash MD5: 64K
       ED BD CF BD 3C 66 16 ED E0 C8 09 27 B3 BF DD 16>)
(   2,<2005-09-09 11:25:19.33 +100>,<MAYBRIDGE\NMR>,<NMR_250MHZ>,
      <Start of raw data processing
       ef LB = 0.3 FT_mod = 6 PKNL = 1 SI = 32K 
       data hash MD5: 32K
       EA D0 A4 E8 D3 1A 36 88 59 B0 38 71 A3 4E CC 19>)
(   3,<2005-09-09 11:25:21.19 +100>,<MAYBRIDGE\NMR>,<NMR_250MHZ>,
      <apk 
       data hash MD5: 32K
       35 4E EF FD 48 B6 2B 29 0B 4D 2E 42 C9 DD 19 7E>)
(   4,<2005-09-09 11:25:21.92 +100>,<MAYBRIDGE\NMR>,<NMR_250MHZ>,
      <abs ABSG = 5 
       data hash MD5: 32K
       28 8B E0 3F 3C 53 29 F6 CD 3D 2B 35 5E A8 00 CA>)
$$ ##END=
$$ 
$$ hash MD5
$$ C7 1C B3 FB FC 34 DE A9 D2 4E 3B 3C 4A 86 D0 1F
##$RELAX= 
##$RELAX= 
##$RELAX= 
##$RELAX= 
##$RELAX= 
##$RELAX= 
##$RELAX= 
$$ Bruker specific parameters
$$ --------------------------
##$DU= <C:\u>
##$EXPNO= 9160
##$NAME= <ADRS>
##$PROCNO= 1
##$TYPE= <nmr>
##$USER= <dgb>
##$AMP= (0..31)
100 100 100 100 100 100 100 100 100 100 100 100 100 100 100 100 100 100 
100 100 100 100 100 100 100 100 100 100 100 100 100 100 
##$AQSEQ= 0
##$AQ_mod= 3
##$AUNM= <au_zg>
##$AUTOPOS= <16 >
##$BF1= 250.13
##$BF2= 250.13
##$BF3= 250.13
##$BF4= 250.13
##$BF5= 500.13
##$BF6= 500.13
##$BF7= 500.13
##$BF8= 500.13
##$BYTORDA= 1
##$CFDGTYP= 0
##$CFRGTYP= 5
##$CHEMSTR= <none>
##$CNST= (0..31)
1 1 145 1 1 1 1 1 1 1 1 1 1 1 1 1 1 1 1 1 1 1 1 1 1 1 1 1 1 1 1 1 
##$CPDPRG= <>
##$CPDPRG1= <>
##$CPDPRG2= <>
##$CPDPRG3= <>
##$CPDPRG4= <mlev>
##$CPDPRG5= <mlev>
##$CPDPRG6= <mlev>
##$CPDPRG7= <mlev>
##$CPDPRG8= <mlev>
##$CPDPRGB= <>
##$CPDPRGT= <>
##$D= (0..31)
0 1 0 0 0 0 0 0 0 0.06 0 0 0 0 0 0 0.0002 0 0 0 0 0 0 0 0 0 0 0 0 0 0 
0 
##$DATE= 1126261506
##$DBL= (0..7)
120 120 120 120 120 120 120 120 
##$DBP= (0..7)
150 150 150 150 150 150 150 150 
##$DBP07= 0
##$DBPNAM0= <>
##$DBPNAM1= <>
$$ [...]
##$SUBNAM7= <"">
##$SUBNAM8= <"">
##$SUBNAM9= <"">
##$SW= 20.6930455092707
##$SWIBOX= (0..15)
0 0 3 0 0 0 0 0 0 0 0 0 0 0 0 0 
##$SW_h= 5175.983436853
##$TD= 65536
##$TD0= 1
##$TE= 295.16
##$TE2= 300
##$TE3= 300
##$TEG= 300
##$TL= (0..7)
0 120 120 120 120 120 120 120 
##$TP= (0..7)
150 150 150 150 150 150 150 150 
##$TP07= 0
##$TPNAME0= <>
##$TPNAME1= <>
##$TPNAME2= <>
##$TPNAME3= <>
##$TPNAME4= <>
##$TPNAME5= <>
##$TPNAME6= <>
##$TPNAME7= <>
##$TPOAL= (0..7)
0.5 0.5 0.5 0.5 0.5 0.5 0.5 0.5 
##$TPOFFS= (0..7)
0 0 0 0 0 0 0 0 
##$TUNHIN= 0
##$TUNHOUT= 0
##$TUNXOUT= 0
##$USERA1= <user>
##$USERA2= <user>
##$USERA3= <user>
##$USERA4= <user>
##$USERA5= <user>
##$V9= 5
##$VALIST= <valist>
##$VCLIST= <CCCCCCCCCCCCCCC>
##$VD= 0
##$VDLIST= <DDDDDDDDDDDDDDD>
##$VPLIST= <PPPPPPPPPPPPPPP>
##$VTLIST= <TTTTTTTTTTTTTTT>
##$WBST= 1024
##$WBSW= 4
##$XGAIN= (0..3)
0 0 0 0 
##$XL= 0
##$YL= 0
##$YMAX_a= 568017
##$YMIN_a= -544955
##$ZGOPTNS= <>
##$ZL1= 120
##$ZL2= 120
##$ZL3= 120
##$ZL4= 120
##$ABSF1= 16.522
##$ABSF2= -4.171173
##$ABSG= 5
##$ABSL= 3
##$ALPHA= 0
##$AQORDER= 0
##$ASSFAC= 0
##$ASSFACI= 0
##$ASSFACX= 0
##$ASSWID= 0
##$AUNMP= <proc_1d>
##$AZFE= 0.1
##$AZFW= 0.1
##$BCFW= 0
##$BC_mod= 0
##$BYTORDP= 0
##$COROFFS= 0
##$CY= 12.5
##$DATMOD= 1
##$DC= 0
##$DFILT= <>
##$DTYPP= 0
##$F1P= 14.0000005364418
##$F2P= -0.99999901652339
##$FCOR= 0.5
##$FTSIZE= 32768
##$FT_mod= 6
##$GAMMA= 0
##$GB= 0
##$INTBC= 1
##$INTSCL= 1
##$ISEN= 128
##$LB= 0.3
##$LEV0= 0
##$LPBIN= 0
##$MAXI= 10000
##$MC2= 0
##$MEAN= 0
##$ME_mod= 0
##$MI= 0
##$NCOEF= 0
##$NC_proc= -2
##$NLEV= 6
##$NOISF1= 0
##$NOISF2= 0
##$NSP= 0
##$NTH_PI= 0
##$NZP= 0
##$OFFSET= 16.522
##$PC= 1
##$PHC0= 125.2696
##$PHC1= 4.553833
##$PH_mod= 1
##$PKNL= yes
##$PPARMOD= 0
##$PSCAL= 4
##$PSIGN= 0
##$REVERSE= no
##$SF= 250.13
##$SI= 32768
##$SIGF1= 0
##$SIGF2= 0
##$SINO= 400
##$SIOLD= 32768
##$SREGLST= <1H.CDCl3>
##$SSB= 0
##$STSI= 32768
##$STSR= 0
##$SW_p= 5175.98343685301
##$SYMM= 0
##$S_DEV= 0
##$TDeff= 65536
##$TDoff= 0
##$TI= <Analysis number 999999
Compound Code 99
Book Reference 9
Project Code 9>
##$TILT= no
##$TM1= 0
##$TM2= 0
##$TOPLEV= 0
##$USERP1= <user>
##$USERP2= <user>
##$USERP3= <user>
##$USERP4= <user>
##$USERP5= <user>
##$WDW= 1
##$XDIM= 32768
##$YMAX_p= 266268577
##$YMIN_p= -711803
$$ End of Bruker specific parameters
$$ ---------------------------------
##NTUPLES= NMR SPECTRUM
##VAR_NAME=  FREQUENCY,     SPECTRUM/REAL,   SPECTRUM/IMAG
##SYMBOL=    X,             R,               I
##VAR_TYPE=  INDEPENDENT,   DEPENDENT,       DEPENDENT
##VAR_FORM=  AFFN,          ASDF,            ASDF
##VAR_DIM=   32768,         32768,           32768
##UNITS=     HZ,            ARBITRARY UNITS, ARBITRARY UNITS
##FACTOR=    0.157963299565203, 1,           1
##FIRST=     4132.6476996994, 0,             0
##LAST=      -1043.33573715361, 0,           0
##MIN=       -1043.33573715361, -711803,     0
##MAX=       4132.6476996994, 266268577,     0
$$ Real data points
##PAGE= N=1
##DATA TABLE= (X++(R..R)), XYDATA
$$ [...]
17144a216K66J211k825j49M234K111J578l452k185j38J115j488J169O01J256k656
17128e68k087J380l071k371J985j902j09L509J779q52J922k056j805O19J246P79
17112a602J769l021j279K503J80l676j296N34M451J786k336Q03J492m24J841J705
17096C430j58m57k782j082L183J184r79k263N83j155R3l058J439J998o28L227
17080B575l014l682J558J401k796O3P34q89j546K396J459P81KK00n34J629J567
17063A904Q16l012l421K580J168j107j069m73j065J457j273J637J365Q56n76J30
17047h3k22K132M422l19k069j341M37j920m405l256j101K060L148J102J694m51
17031a72J814k759l582l39J259M234M49j587K47j265k856%O58K282J727N90j237
$$ plain form
17144 -1216 -950 261 -2564 -2713 1521 3632 5210 1758 -427 -565 550 -938 231 832 2088 -568
17128 -568 -2655 -1275 -4346 -6717 -4732 -6634 -6743 -3234 -1455 -2307 -385 -2441 -4246 -3627 -2381 -1602
17112 -1602 167 -2854 -4133 -1630 -1450 -5126 -6422 -5888 -1437 349 -1987 -1184 308 -116 1725 3430
17096 3430 3272 2815 33 -1049 2134 3318 2339 76 659 -496 -403 -3461 -2022 -24 -652 2575
17080 2575 -439 -4121 -2563 -1162 -3958 -3895 -3161 -4050 -5596 -3200 -1741 -960 -958 -758 -1292 337 1904
17063 1904 2720 -292 -3713 -1133 35 -1072 -2141 -2614 -3679 -2222 -3495 -1858 -493 363 -213 -83
17047 -83 -305 1827 6249 5930 3861 2520 2957 1037 -3368 -6624 -7725 -5665 -2517 -1415 279 -172
17031 -172 1642 -1117 -4699 -5038 -3779 455 904 -683 -436 -1701 -4557 -4557 -3899 -1617 110 700 -537
17014e37j143K492P67l049K995j494l668M78p95J461L345J83J436J35j855J30
16998H81j537q19r91m79M627K968k015k650j688P40l403K123J919l279n08j434
16982e545R80L386R39k729k745J417Q74K518l13L34R19N85K54k799m431j11K006
16965d461j867r09K385N501R5j222k861M59P02M10Q47k57J725o99K795P48n01
16948B890m98k737k288L332K860m83l251k401l63J494J302m243l709l32K713K29
16932e485k850j957N223N822j852k623N78J203l444N73L260K439R44k914k064
16917c147J200J982K225j163k305k034k07j049Q83j584q57J580J884O24L204R39
16901B175m359k161K415k104k24j741J450L09N31K668J181j813j931j365M262
$$ plain form
17014 -537 -1680 812 1579 -1470 1525 31 -3637 -3159 -3954 -2493 852 1035 2471 2606 751 881
16998 881 -656 -1475 -2466 -2945 1682 4650 2635 -15 -1703 -963 -4366 -2243 -324 -3603 -4111 -5545
16982 -5545 -4565 -1179 -240 -2969 -5714 -4297 -3423 -905 -1218 -884 35 620 874 -1925 -6356 -6467 -4461
16965 -4461 -6328 -7237 -4852 649 744 -478 -3339 -2880 -2178 -1768 -921 -1178 547 -152 2643 3391 2890
16948 2890 2392 -345 -2633 699 3559 3076 -175 -2576 -2939 -1445 -143 -4386 -8095 -8427 -5714 -5485
16932 -5485 -8335 -10292 -5069 753 -1099 -3722 -3144 -1941 -5385 -4812 -1552 887 1831 -1083 -3147
16917 -3147 -1947 35 2260 1097 -1208 -3242 -3449 -4498 -3615 -5199 -6056 -4476 -2592 -1968 1236 2175
16901 2175 -2184 -4345 -1930 -4034 -4258 -5999 -4549 -4240 -3709 -1041 140 -1673 -3604 -4969 -707
16886g07L458k37j431J687l878r45K361m313r41M971M80l853K824N33j039j79
16870a209K711K951J733k437M18j965k270n025r99N65K435J826j861k347K244
16855c230J934l003k298l933j36K992J645J528Q83o28M4J240L496J380J831j379
16839B366j820M13J262K094l01R55k327m294K854K23j681O72k650j802J593j605
16823d048J011J297k602k960K369N3m43k805l254J05K279O55P51J702L085J884
16807i21L273j026m806r58L02J495P92j037k10K621R51J845j535P29k337n98l954
16790e374j127J224K618K802L050k176k702l529q10L425O447M214j882m875q92
16775D13J432j544p70N9m285k467M799M255l71k78J087l53k14J387J752l13j826
$$ plain form
16886 -707 2751 2514 1083 2770 -1108 -2053 308 -4005 -4946 25 505 -3348 -524 9 -1030 -1209
16870 -1209 1502 4453 6186 3749 4167 2202 -68 -5093 -6092 -5527 -3092 -1266 -3127 -5474 -3230
16855 -3230 -1296 -4299 -6597 -10530 -10666 -7674 -6029 -4501 -3618 -4246 -4202 -2962 534 1914 3745 2366
16839 2366 546 959 2221 4315 4014 4969 2642 -1652 1202 1425 -256 416 -2234 -4036 -2443 -4048
16823 -4048 -3037 -1740 -4342 -7302 -4933 -4880 -5323 -8128 -11382 -11277 -8998 -8343 -7592 -5890 -2805 -921
16807 -921 2352 1326 -3480 -4438 -4136 -2641 -1849 -2886 -3096 -475 476 2321 786 1515 -822 -1420 -5374
16790 -5374 -6501 -5277 -2659 143 3193 1017 -1685 -5214 -6024 -2599 3848 8062 6180 1305 413
16775 413 1845 301 -469 -410 -4695 -7162 -2363 1892 1521 1243 2330 1977 1763 3150 4902 4589 2763
16758B763q53j411m040n42K144J976J59O08L40k415N38J530M35k110O95J525k248
16741i06k076P88M86K669K540K75J745J795j904n087k298J026K340l33k225Q73
16725b92J021L069K70M76q67l461n75j249j840M18M586k45M33K052r68r41j221
16708F66O85j592J003l10o09N2J02j727J676k12l106r9j527O60K691J668J563
16691A584j703k255K232K404l695l658L722K117l745k635j108j281J581O280K237
16676B077J121J198j119j21n14J829J345r69j220l85k51j499q29J297j657k687
16660b384N53L120o41k02K942k04L215L835j964j78J932J738j118K340O405O497
16644B5886O309K023j146l49j284k761N76L725l291l987m245m480l701j826j332
$$ plain form
16758 2763 1910 499 -3541 -4083 -1939 37 196 804 1144 -1271 -733 797 1232 -878 -183 1342 -906
16741 -906 -2982 -2194 -1708 961 3501 3776 5521 7316 5412 325 -1973 -947 1393 1060 -1165 -292
16725 -292 729 3798 4068 4544 3677 216 -359 -1608 -3448 -3030 1556 1311 1744 3796 2828 1887 666
16708 666 1351 -241 762 452 -157 -105 -3 -1730 -54 -266 -3372 -3471 -4998 -4338 -1647 21 1584
16691 1584 -119 -2374 -142 2262 -1433 -5091 -1369 748 -2997 -5632 -6740 -8021 -6440 -160 2077
16676 2077 3198 4396 3277 3156 2642 4471 5816 4847 3627 3242 2991 1492 663 1960 303 -2384
16660 -2384 -1831 1289 648 446 3388 3184 6399 10234 8270 8092 10024 11762 10644 12984 19389 25886
16644 25886 32195 34218 33072 32723 31439 28678 29254 32979 29688 25701 21456 16976 13275 11449 10117
16629A0117K28j341K77o64k573R36p07k122j702l334k146L160J863K00o87M51
16613A956k374P59N08j089m172J572M699L907k8m276j343p03n20k258L085L836
16597C559j881J655K05j598o54L766J844m35l59l22m42r54n25j740j010K593j714
16580A988k259J264K831q98O79J450k96J709J092J860j863j419r70j745K967K627
16564I017j62m096j414J080o50P57j491j421k207r24L336K526N00k08K894q74
16548F663p22J763J491k86J6L03m638r36K384O11j785l022r6J173J426K81O48
16531E274j084j057q53j12J612K699l67l7P28o88J157j037l96J147K665j03j929
16514G619L841J258Q93L139K799J409N112O496P329N377J2423J6482J8867K3625
$$ plain form
16629 10117 10345 9004 9281 8617 6044 6980 6273 4151 2449 -885 -3031 129 1992 2192 1505 1956
16613 1956 -418 341 849 -240 -4412 -2840 1859 5766 5738 1462 119 -584 -1104 -3362 -277 3559
16597 3559 1678 3333 3538 1940 1286 5052 6896 6461 6102 5780 5338 4384 3859 2119 1109 3702 1988
16580 1988 -271 993 3824 2926 3605 5055 4759 6468 7560 9420 7557 6138 5168 3423 6390 9017
16564 9017 8855 4759 3345 4425 3775 4532 3041 1620 -587 -1511 1825 4351 4851 4643 7537 6663
16548 6663 5941 7704 9195 8909 8925 9228 4590 3654 6038 6649 4864 1842 1746 2919 4345 4626 5274
16531 5274 4190 3133 2280 2168 3780 6479 6112 6075 6803 6115 7272 6235 5839 6986 9651 9548 7619
16514 7619 11460 12718 13611 16750 19549 20958 26070 32566 39895 45272 57695 74177 93044 116669
16500A16669K6579K5347K9915M1764M3790M6004L3739J3000j739j669K412Q41
16488C76652j2439k5994m2480m7345l8773k9617k8137k8355k5270k1062k0328
16477E6852j2481q742n790k682o894m455k556L23q09j583l431L428J080k447K86
16462A0099J199j04j476K59j00J673j188p24j575k04J33k753j444J870K398K249
16446A0312l632m281L374M71N80K66m92N04L15J739o31j318k066R4j138N86K070
16429F753J83j067K97j419J148J921j61L34J9p25j757j943R21O99j970r25M609
16412F917L94j408L48L4l803m042J866J514K451K14P03k218K185L506O48J898
16396A1207O28K259M623j302J344N088L95l632R32K810K060j890o114j325Q27
$$ plain form
16500 116669 143248 168595 198510 240274 284064 330068 363807 376807 375068 373399 375811 376652
16488 376652 364213 338219 295739 248394 209621 180004 151867 123512 98242 77180 56852
16477 56852 44371 35629 29839 27157 20263 15808 13252 13575 12766 11183 7752 11180 12260 9813 10099
16462 10099 11298 11194 9718 9977 9877 11550 10362 9638 8063 7859 7992 5239 3795 5665 8063 10312
16446 10312 6680 2399 5773 6244 6824 7090 6598 7102 7417 9156 8525 7207 5141 5235 4097 4683 6753
16429 6753 6936 5869 6166 4747 5895 7816 7655 7989 8008 7283 5526 3583 4504 5203 3233 2308 6917
16412 6917 7311 5903 6251 6285 2482 -1560 306 1820 4271 4485 5188 2970 5155 8661 9309 11207
16396 11207 11835 14094 18717 17415 18759 23847 24242 20610 21542 24352 26412 24522 18408 17083 17910
16381A7910j227m79m167k913Q78M956K641o51k801m566l468J198L599K68l499
16366G679k6J573K316J044j40l97J455j630k656j315k36J081J640M61l783k073
16350D993o73K35R16j734L24L60j92K081L157J154j584j667K350K731j234j40
16334A1077J712j728r33n10O44K40n821J292L66k40o00K021p62K01j524M553K440
16317A2428o066p844K422N272P02J1j67j833Q27K815K005m76q72k950l73J450
16301G351J698R05N002m197k266k064j282Q74K021J161p65Q69P37l15o80J723
16285A0772N52j400l288Mj560k00P81J208k015K8O636K169l921k759j038L578
16269I547J969K590J624l013k884J721j313j009q53MK38k159J58M485M69l41J968
$$ plain form
16381 17910 16683 16204 12037 9124 10002 14958 17599 16948 14147 9581 6113 7311 10910 11178 7679
16366 7679 7653 9226 11542 12586 12446 12049 13504 11874 9218 7903 7667 8748 10388 10849 7066 4993
16350 4993 4320 4555 5471 3737 4061 4421 4229 6310 9467 10621 9037 7370 9720 12451 11217 11077
16334 11077 12789 11061 10128 9618 10262 10502 4681 5973 6339 6099 5499 7520 6758 6959 5435 9988 12428
16317 12428 6362 -1482 940 6212 6914 6925 6758 4925 5752 8567 10572 10096 9224 6274 5901 7351
16301 7351 9049 9954 14956 10759 8493 6429 5147 6021 8042 9203 8438 9307 10044 9729 9049 10772
16285 10772 11324 9924 6636 6640 5080 4880 5661 6869 4854 4882 11518 13687 9766 7007 5969 9547
16269 9547 11516 14106 15730 12717 9833 11554 10241 9232 8379 8383 8621 6462 6620 11105 11574 11233 13201
16252A3201k451n957j441L748K062j295k450r35l263j150J086j437J374J793q1
16237B804k540R44L354L377k58j981o83j15L643K16J893L987O21L80p26k329k939
16220I648m13j1J296J680k687r31J304J715K852J10l144j302P31K912J127k096
16204A2791j090k298j020M00k706K271K211J549K869M297k10J390K643J677P30
16189B5504N07M790K532k098j536j993K159K098p28k394M68k225j602K578r6o37
16173B7327j411L66L305L405K979k076J128N304M288L572j04q13R91J874M442
16158E4577K714j730k672N04k794j172p52k360j106n18j863L825k822p762n385
16143C0684L146L349j790k023J05l9k258j963L591L992k182o479k841l403n478
$$ plain form
16252 13201 10750 4793 3352 7100 9162 7867 5417 4482 1219 69 1155 -282 1092 2885 2804
16237 2804 264 1208 4562 7939 7681 5700 5017 4902 8545 8761 10654 14641 15262 15642 14916 12587 9648
16220 9648 9235 9224 10520 12200 9513 8582 9886 11601 14453 14563 11419 10117 10848 13760 14887 12791
16204 12791 11701 9403 8383 8783 6077 8348 10559 12108 14977 19274 19064 20454 23097 24774 25504
16189 25504 26011 30801 33333 31235 29699 27706 29865 31963 31235 28841 29309 27084 25482 28060 27964 27327
16173 27327 25916 26282 29587 32992 35971 33895 35023 40327 44615 48187 48083 47270 48261 50135 54577
16158 54577 57291 55561 52889 53393 50599 49427 48675 46315 45209 44691 42828 46653 43831 36069 30684
16143 30684 33830 37179 35389 33366 33471 33432 31174 29211 32802 36794 34612 28133 25292 21889 16411
16128A6411p797j2636j1582j7393k0781k4835k5548k3295j4498n567j1293j0709
16116a69523p730m324M046J0090J4626J8042J1878Q500J1793Q688J0789J0578
16104g2547Q394N625M014O541R5J088q25l233j631k739k760J448J921l42J111
16089e3840L24M099R616J1500J3772J1762Q444Q589J3174J5476J7551J2365P991
16076H0823N03J518L544M607j156m917m995r44l2m356j958k941k681m5m305k567
16060F0098K298J613J774L282L622M145K858m67j12L601L352M861j369j057n239
16045H3260q663j288O063P055J616j590J359J872q15L973N129J584j243j295r25
16030I6092K426J781j69j135p31Q8n97J490M766K042j151j43L834P253M484m52
$$ plain form
16128 16411 8614 -4022 -15604 -32997 -53778 -78613 -104161 -127456 -141954 -147521 -158814 -169523
16116 -169523 -177253 -181577 -177531 -167441 -152815 -134773 -122895 -114395 -102602 -93914 -83125 -72547
16104 -72547 -64153 -58528 -54514 -47973 -47878 -46790 -47615 -50848 -52479 -55218 -57978 -56530 -54609 -54951 -53840
16089 -53840 -53516 -49417 -39801 -28301 -14529 -2767 5677 14266 27440 42916 60467 72832 80823
16076 80823 81326 82844 86388 90995 89839 84922 79927 78983 78951 74595 72637 69696 67015 66970 62665 60098
16060 60098 62396 64009 65783 69065 72687 76832 79690 79223 79111 82712 86064 90925 89556 88499 83260
16045 83260 74597 73309 79372 86427 88043 86453 87812 89684 88869 92842 97971 99555 98312 97017 96092
16030 96092 98518 100299 100130 98995 98264 98352 97755 99245 104011 106053 104902 104759 108593 115846 120330 119878
16014A19878j397l214k602J385L165K555M39L234N661N655J762J087O111O174
16000A49893P20k148L602Q757O00k909J99k149J289N390L840L493N171L289L173
15985A82210O474P537R833J1122J2794J2588J0363J2465J3957R331J6079K0702
15973C25455J8965K2628K5546K8851L8202M8096M7668N2327O1486O2593P0990
15962H02807Q1401Q1418P5066O4892O0676P0544R1987J06060J13590J11640J19077
15951A779158J48206J94913K50469L00813L37099L77900M56421N93882Q19327
15942E258188J180584J763892K657856L696205M546059M898679M754198M881679
15934C3637340N914847P448402Q313992P041420L872986O63230o04439J93201
$$ plain form
16014 119878 118481 115267 112665 114050 117215 119770 120209 123443 129104 134759 136521 137608 143719 149893
16000 149893 150613 148465 152067 160824 161424 158515 158714 156565 157854 163244 167084 170577 175748 179037 182210
15985 182210 188684 196221 206054 217176 229970 242558 252921 265386 279343 288674 304753 325455
15973 325455 344420 367048 392594 421445 459647 507743 555411 607738 669224 731817 802807
15962 802807 884208 965626 1040692 1105584 1166260 1236804 1328791 1434851 1548441 1660081 1779158
15951 1779158 1927364 2122277 2372746 2673559 3010658 3388558 3844979 4438861 5258188
15942 5258188 6438772 8202664 10860520 14556725 19102784 24001463 28755661 33637340
15934 33637340 39552187 47000589 55314581 62356001 66228987 66892217 66287778 66480979
15926F6480979R77636p2884l064220o516532p929096p468592o152137n110922
15918C1144232m981492n162710m865230m117679l080860k119500j451320j024654
15910D340787p49125n56546m12983l11366k57313k18276j84180j55017j23760
15901A372221r3547p1228n5914m2061m3483m4622n2205m2939l4992l2266m0435
15890H18529n5255o2637o4637n7485m8312m7669m5987m1711l5672k9983k4860
15879C04321k0296j5319j0324j2219j3124q320p502p921p942n619k500l737j0297
15866A79201j1100o664m852m684n994q016o262o399p630n803n653k899p248n387
15852I0610l852j386k18L56r28k204n49j744K957Q29r00k753o30k028l334O92
$$ plain form
15926 66480979 67458615 67385731 64321511 57804979 49875883 42407291 36255154 31144232
15918 31144232 26162740 21000030 16134800 12017121 8936261 6816761 5365441 4340787
15910 4340787 3591662 3035116 2622133 2310767 2053454 1835178 1650998 1495981 1372221
15901 1372221 1278674 1207446 1151532 1109471 1065988 1021366 969161 926222 891230 858964 818529
15890 818529 763274 700637 636000 578515 530203 482534 436547 394836 359164 329181 304321
15879 304321 284025 268706 258382 246163 233039 224719 217217 209296 201354 195735 193235 189498 179201
15866 179201 168101 161437 156585 151901 145907 137891 131629 125230 117600 111797 106144 103245 95997 90610
15852 90610 86758 85372 85154 85510 84582 82378 81829 80085 83042 83871 82971 80218 79588 77560 74226 74918
15836G4918j508j820K84P20n592n140k110j200J214l293l440M67n484m56J381
15821D8941l46r07j76M288j50K388J634K883J24o13M121j404k90k838n300j634
15805E0721j249l432k056j716m822k174m348o665K669N148K744R62k541n255l7
15790B7949l361m130n807l227o029r433o328l871m555j111j729k520P62M473J2988
15775e929J7531J2670J4465P799Q867J1672J3730J3468R134K832J098j46L54P55
15761A08300J736l317q50m914o062k205j548j208J030L001K347M944Q792J2389
15747A22435J4217J4001J3832J4298J3921J7070J1202N727j849j3876p808o243
15735A96927j1188j6290k3407k6813k3541k0970j7829j5282j5318j1889j0618
$$ plain form
15836 74918 73410 71590 71874 72594 67002 61862 59752 58552 59766 56473 53033 53500 48016 47560 48941
15821 48941 48595 47688 47512 51800 51650 54038 55672 58555 58679 58066 62187 60783 60493 57655 52355 50721
15805 50721 49472 46040 43984 42268 37446 35272 30924 24259 26928 32076 34820 35782 33241 27986 27949
15790 27949 24588 20458 14651 11424 5395 -4038 -10366 -14237 -18792 -19903 -21632 -24152 -23390 -18917 -5929
15775 -5929 11602 24272 38737 46536 55403 67075 80805 94273 103407 106239 107337 107191 107545 108300
15761 108300 110036 106719 105869 100955 94893 92688 91140 89932 90962 93963 96310 101254 110046 122435
15747 122435 136652 150653 164485 178783 192704 209774 220976 226703 224854 210978 203170 196927
15735 196927 185739 169449 146042 119229 95688 74718 56889 41607 26289 14400 3782
15724C782n932m106p65j461j26p51L66M32J021K319K865R92P39K944j688j985
15708a354J590K45j992K166N23M65K207k17j986J698J912J41j715q43J240j216
15692B864k48K899K057k69L268J082n93j367o86O18k724k182P64j576j849j579
15676D79O16l104m244l58M209J915l623j864j604O97q09n13L781J128J537k341
15660d098k422q5o31m90M344J871K56j670p07P47j202J193K125j114l221M09N194
15643D99r58j630J94j558K066J207J701J285k187k069J423J78P10J574J456j081
15627B810k260m111j726L471J477K921K822K470Q89o29k819O15J329k679J538
15612F118J410l574n290q77M036L27N51j618l808j984J310M72R93K881o287k022
$$ plain form
15724 3782 -2150 -6256 -7021 -8482 -8608 -9359 -8993 -8561 -7540 -5221 -2356 -1364 -625 2319 631 -1354
15708 -1354 236 481 -1511 655 1178 1643 3850 3633 1647 3345 5257 5398 3683 2840 4080 2864
15692 2864 2616 5515 7572 7303 10571 11653 11060 9693 9007 9625 6901 4719 5483 3907 2058 479
15676 479 1095 -2009 -6253 -6611 -2402 -487 -4110 -5974 -7578 -6881 -7690 -8203 -4422 -3294 -1757 -4098
15660 -4098 -6520 -6605 -7236 -7726 -3382 -1511 -1255 -2925 -3632 -2885 -4087 -2894 -769 -1883 -5104 -4695 499
15643 499 -459 -2089 -1895 -3453 -1387 -180 1521 2806 619 -1450 -27 151 861 2435 3891 2810
15627 2810 550 -3561 -5287 -1816 -339 2582 5404 7874 8763 8134 5315 5930 7259 4580 6118
15612 6118 7528 3954 -1336 -2213 1823 2150 2701 1083 -2725 -4709 -3399 -2927 -1934 947 -5340 -7362
15596g362j327K780L617j046J5P30k85O13J909j614l034J476L407K782k138k069
15580a546m48k010k556l91j367J877n65M722J882l858R49k717k851j058J242O36
15564h059n98j407J920j061l433L512l84N66K667K001o89j813l073J407n15J991
15548f968K710j190m028L50l384R87J532J411K363J429J046j033Q77j38k46j21
15532d403J631j948J254j316J413n43N04N08J69J628l145k440Q8k827p06J667
15516h466j645j561k740q19L667J069l727j615M839N803Q62j84P24Lk545j893
15500h228k183j349K094L60k288k266R58K141K423Q12q38J378k173l97l72K87
15484i641o76J589M20J161j096j437K686J604l340q31K350J587k89N60J53J58
$$ plain form
15596 -7362 -8689 -5909 -2292 -3338 -3323 -2593 -2878 -2265 -356 -1970 -5004 -3528 -121 2661 523 -1546
15580 -1546 -1994 -4004 -6560 -6951 -8318 -6441 -7006 -2284 -402 -4260 -3311 -6028 -8879 -9937 -8695 -8059
15564 -8059 -8657 -10064 -8144 -9205 -12638 -9126 -9510 -8944 -6277 -4276 -4965 -6778 -9851 -8444 -8959 -6968
15548 -6968 -4258 -5448 -9476 -9126 -12510 -11523 -9991 -8580 -6217 -4788 -3742 -4775 -3898 -4036 -4282 -4403
15532 -4403 -2772 -4720 -3466 -4782 -3369 -3912 -3408 -2900 -2731 -1103 -4248 -6688 -6600 -9427 -10133 -8466
15516 -8466 -10111 -11672 -14412 -15231 -11564 -10495 -14222 -15837 -10998 -5195 -4333 -4517 -3793 -3790 -6335 -8228
15500 -8228 -10411 -11760 -9666 -9306 -11594 -13860 -12902 -10761 -8338 -7526 -8364 -6986 -9159 -9556 -9928 -9641
15484 -9641 -10317 -8728 -8308 -7147 -8243 -9680 -6994 -5390 -8730 -9561 -7211 -5624 -5913 -5353 -5200 -5042
15468e042m459M08K902N570J885J361K06R62k182m74J232J703J676k049l190q40
15452c31j035J002K77k744k215J767R28o06j043p41J425k077m67N93N213R09k287
15435a432k147j511J284j69j570N81p71N081J942k585J179J441j592k562j183
15420d014p25J792J893K561J955j806k224j587p22Q09k222m232J158N875k366
15405c855N99L204k983k988N36Q48r70M39K087N165J111j29O02j239j297Q58l83
15388A605O48J782K935j528n99k14k33P27P10K216K527J463J084q0M608P202M132
15371B8985P882J2911K0317K2928K5891K3991K1846K7524M1528N0155M1094K6798
15359C51850Q570K22J107L416O881q885k8511m5575m2905l5965l2390k4981k8691
$$ plain form
15468 -5042 -9501 -9093 -6191 -621 1264 2625 2831 3793 1611 1137 2369 4072 5748 3699 509 -331
15452 -331 -1366 -364 -87 -2831 -5046 -3279 -2351 -2957 -4000 -4741 -3316 -5393 -5860 -5267 -54 855 -1432
15435 -1432 -3579 -5090 -3806 -3975 -5545 -4964 -5735 -654 1288 -1297 -118 1323 -269 -2831 -4014
15420 -4014 -4739 -2947 -1054 1507 3462 1656 -568 -2155 -2877 -2068 -4290 -8522 -7364 -1489 -3855
15405 -3855 -3256 -52 -3035 -6023 -5487 -4639 -5609 -5170 -3083 2082 3193 3064 3666 2427 1130 1988 1605
15388 1605 2253 4035 6970 5442 4843 4629 4396 5123 5833 8049 10576 12039 13123 13043 17651 24853 28985
15371 28985 36867 49778 70095 93023 118914 142905 164751 192275 233803 283958 325052 351850
15359 351850 360420 360642 361749 365165 372046 363161 334650 289075 246170 210205 177815 152834 124143
15346A24143k8219k4868j7092j5078j0066r642o807k782l801j021J540l9p46l208
15332B314n83j083j182Q49K158J178j455l94K922q2k370k049q34K879K815j123
15316C960k502q22J623L351L14n185k959L9q84l05j43m14K482j83m569o26K883
15299c940o72l278l81j33q59J757M068J045m82j025R85Q4l327J948K68j225J955
15282c212Q66ml952L32N98N46J059j411P69n49q88J062N45J291J181P94k431j713
15264e117o69j728J796K018l03L18j634P85P54k508J362M694K590l059l35J85
15248h51j343o40J179n32J241K522j205k976j800J911J345K67l00R69k573j178
15232c964J066L726K189k85Q9j587j041N68o620k998K737K756j94j139k261L125
$$ plain form
15346 124143 95924 71056 53964 38886 28820 19178 12371 9589 5788 4767 6307 6268 5522 2314
15332 2314 1731 648 -534 315 2473 3651 2196 1802 4724 4642 2272 223 -611 2268 5083 3960
15316 3960 1458 636 2259 5610 5924 739 -2220 -2181 -3065 -3370 -3513 -3927 -1445 -1628 -6197 -6823 -3940
15299 -3940 -4612 -7890 -8271 -8404 -9263 -7506 -3438 -2393 -2875 -3900 -2915 -2831 -6158 -4210 -3942 -5167 -3212
15282 -3212 -2346 -2350 -6302 -5970 -5372 -4826 -3767 -5178 -4409 -4958 -5846 -4784 -4239 -2948 -1767 -973 -3404 -5117
15264 -5117 -5786 -7514 -5718 -3700 -4003 -3685 -5319 -4534 -3780 -6288 -4926 -232 2358 -701 -1036 -851
15248 -851 -2194 -2834 -1655 -2187 -946 1576 371 -2605 -4405 -2494 -1149 -882 -1182 -213 -2786 -3964
15232 -3964 -2898 828 3017 2732 2821 1234 193 761 -5859 -8857 -6120 -3364 -3558 -4697 -6958 -3833
15216c833J327M35j610J644P33j523p9J982K58k044j111L258L350n67j772J15
15200E63O97m115J347J496j153l90P49r85j817j620J355m5J79K562L029l060j676
15183b884M91J65n54j486J280m14Q50q16L02J459P29j150J665M75J23L092K113
15166E440J55o76l110l09K17J01j355j954O92l31j587o06N97k804N48Q55j76K512
15148a791M943P8m820j365p38J208L826n99k947k066R17j608Q13j288n38J905
15132d070Q00j208O29k17n32K11L186J86j075l727j731l1K830J202l28k35k554
15115f664k194M648M489Q78J977P35k149m096r4J542L686k193q48J464N85j955
15099a89m112L107L888N73q39j082j560K476J356k364k881J214j875J441R15k6
$$ plain form
15216 -3833 -2506 -2071 -3681 -2037 -1304 -2827 -2906 -924 -666 -2710 -3821 -563 2787 2220 448 563
15200 563 1260 -2855 -1508 -12 -1165 -1555 -806 -1791 -3608 -5228 -3873 -3918 -3739 -1177 1852 -1208 -2884
15183 -2884 -2393 -2228 -2782 -4268 -2988 -3402 -2552 -3368 -3066 -1607 -878 -2028 -363 112 235 3327 5440
15166 5440 5595 4919 1809 1500 1717 1818 463 -1491 -799 -1130 -2717 -3323 -2726 -5530 -4982 -4127 -4303 -1791
15148 -1791 3152 3230 -1590 -2955 -3693 -2485 1341 742 -2205 -4271 -3354 -4962 -4149 -5437 -5975 -4070
15132 -4070 -3270 -4478 -3849 -4066 -4598 -4387 -1201 -1015 -2090 -5817 -7548 -7579 -4749 -3547 -3875 -4110 -6664
15115 -6664 -8858 -4210 279 1157 3134 3869 1720 -2376 -2470 -928 2758 565 -283 1181 1766 -189
15099 -189 -4301 -1194 2694 3267 2428 1346 -214 2262 3618 1254 -1627 -413 -2288 -847 68 42
15083D2j227k773J008N164n87r93k165j842Q65J898J033J33o24R56J761k029n262
15066d642j847J762L770k28k329K040M293r08k223l876L113o43k114o89J892M81
15050b148K274l472k467k421Q78J726k33j30p03M90L500j406R43l654L197j842
15034e468N03M09J289k396k605L121M519k14J417m07k187J173m40J982L6K255
15018B987J67k198k662l603J031K755j666j385l08o00J753K471k568k842K420
15003d248j157J475J663J98K265J161J042k126j973j82j892j219L143M355N948
14988H453L046M80j961j0419j1541n634O30J014L254R530O941P074K470q27k269
14973A0241J359L547K894J711l607j0638r420p387q651k862J669N869Q649P409
$$ plain form
15083 42 -1185 -3958 -2950 2214 1627 634 -1531 -3373 -2508 -610 423 556 -68 888 2649 620 -4642
15066 -4642 -6489 -4727 -957 -1185 -3514 -1474 2819 1911 -312 -4188 -1075 -1718 -3832 -4521 -2629 -2148
15050 -2148 126 -3346 -5813 -8234 -7356 -5630 -5863 -5993 -6696 -6206 -2706 -4112 -3169 -6823 -3626 -5468
15034 -5468 -4965 -4556 -3267 -5663 -8268 -5147 -628 -842 575 168 -2019 -846 -1286 696 732 2987
15018 2987 3154 956 -1706 -5309 -4278 -1523 -3189 -4574 -4882 -5482 -3729 -1258 -3826 -6668 -4248
15003 -4248 -5405 -3930 -2267 -2069 196 1357 2399 273 -1700 -1882 -3774 -4993 -1850 2505 8453
14988 8453 11499 11979 10018 -401 -11942 -17576 -16946 -15932 -12678 -3148 3793 10867 13337 12510 10241
14973 10241 11600 15147 18041 19752 16145 5507 -3913 -11300 -19951 -22813 -21144 -15275 -6626 783
14959G83K939l390n763j292j457k399j70M827m85Q19Q57R18p62L399L27n99O59
14942g89K684q25j307j58L221l110j356j408J282J006K806jm27j47l969m012K171
14925d339M01j037P51J729n6Q18l14k266L519J619j331j978J852O05j294J076
14909b45J491j330o31R15r61l343k26r95N53r35k428k297K349K57Q28N277K174
14892D53l106j383K335j189O54o3n7j587j527n26K632J914q01p99R08J390m40
14875a192J168l52R35k61O59J058J020k807L22M15j369o962J133J707L2J799K202
14858d93J479J519j325J954K991k932j416j045j126J184j961k868Q30O6o22j32
14842c897o2N78K188j746O92N79j192l345K515K202J370j928n858l131L779K771
$$ plain form
14959 783 3722 332 -5431 -6723 -8180 -10579 -10749 -5922 -6407 -5588 -4731 -3813 -4575 -1176 -849 -1448 -789
14942 -789 1895 1070 -237 -395 2826 -284 -1640 -3048 -1766 -760 2046 2045 1618 1471 -2498 -6510 -4339
14925 -4339 -3938 -4975 -4224 -2495 -2551 -1733 -2047 -4313 -794 825 -506 -2484 -632 -27 -1321 -245
14909 -245 1246 -84 -715 200 -761 -4104 -4330 -5325 -4772 -5707 -8135 -10432 -8083 -7826 -6998 -1721 453
14892 453 -2653 -4036 -1701 -2890 -2236 -2299 -2356 -3943 -5470 -5996 -3364 -1450 -2251 -3050 -2142 -752 -1192
14875 -1192 -24 -376 559 298 957 2015 3035 228 550 965 -404 -7366 -6233 -4526 -4494 -2695 -493
14858 -493 986 2505 1180 3134 6125 3193 1777 732 -394 790 -1171 -4039 -3209 -3143 -3765 -3897
14842 -3897 -3959 -3381 -1193 -2939 -2247 -1668 -2860 -6205 -3690 -1488 -118 -2046 -7904 -11035 -7256 -4485
14826d485J282k006l35K099J082j726K839M036j848o83r15o77j746k017l036K453
14810e683P73m337l59O049K691R6M07j381k688J210j145K680P77j342j551k23
14794d026M55P98m08j003K170O49p46j399J829L947J106r26L58P81l559l494M52
14777c016j159R34M025k087k880o72J789M99K040q87j538M05k735k70K589J840
14761a123P37j728k438J966J776n351q73J564r25L780L739k634k666J035N83p34
14745c292l240q29P45M493k028n158k720K095k206K428M704M237j25P02L014M69
14729C289O9k020n051j589L372J81r18Q66J038n08J216K721l301k779k525O78
14713e261J168m58J350L117K833l01j395O9j349k418l351n26j120P05R93K136
$$ plain form
14826 -4485 -3203 -5209 -5544 -3445 -2363 -4089 -1250 2786 938 255 -660 -1337 -3083 -5100 -8136 -5683
14810 -5683 -4910 -9247 -9606 -3557 -866 -770 -363 -1744 -4432 -3222 -4367 -1687 -910 -2252 -3803 -4026
14794 -4026 -3571 -2773 -3181 -4184 -2014 -1365 -2111 -3510 -1681 2266 3372 2446 2804 3585 26 -3468 -3016
14777 -3016 -4175 -3241 784 -1303 -4183 -4855 -3066 -2567 -527 -1414 -2952 -2547 -5282 -5552 -2963 -1123
14761 -1123 -386 -2114 -4552 -2586 -810 -6161 -7034 -5470 -6395 -2615 1124 -1510 -4176 -3141 -2558 -3292
14745 -3292 -6532 -7361 -6616 -2123 -4151 -9309 -12029 -9934 -12140 -9712 -5008 -771 -896 -194 2820 3289
14729 3289 3358 1338 -3713 -5302 -1930 -1749 -2667 -1801 -763 -1271 -55 2666 -635 -3414 -5939 -5261
14713 -5261 -4093 -4551 -3201 -84 2749 2448 1053 1122 -227 -2645 -5996 -6522 -7642 -6937 -5944 -3808
14697c808K717J349K616J782k723l434K162R79r75K92p12m32k13K042o01K39k064
14680g84q34n79N40j172K67P83J095Q83o48j960m457k919K736K770L398l237k466
14663f584M447R09j277k325j065j435O6K354K187L088J088M02K437R85k178L81
14647C480j244k060r52j963k296K167K676K60N63l900k440k326q99K965M659J052
14631b58K253J033j878l225j215N72M619K761j605j144j505j199O81k228M319
14616A981L12l909j127n56J263k419r0j41R04K098L24p78j955j022j04R0k586
14599g715l40r43k197L788K624N421Q35j543k956Q48r1P10K899k971J87l69j734
14582c547r2k59K765j865j356J89K558j935l737N79k39M406K403j93J62J108J839
$$ plain form
14697 -3808 -1091 258 2874 4656 1933 -1501 661 1640 665 957 245 -187 -400 1642 1041 1280 -784
14680 -784 -1618 -2197 -1657 -2829 -2562 -1779 -684 199 -449 -2409 -6866 -9785 -7049 -4279 -881 -4118 -6584
14663 -6584 -2137 -1228 -2505 -4830 -5895 -7330 -7264 -4910 -2723 365 1453 1855 4292 5277 3099 3480
14647 3480 2236 176 -776 -2739 -5035 -2868 -192 68 631 -3269 -5709 -8035 -8934 -5969 -1310 -258
14631 -258 1995 3028 1150 -2075 -3290 -2718 1901 4662 3057 1913 408 -791 -110 -2338 1981
14616 1981 2293 -1616 -2743 -3299 -2036 -4455 -4545 -4686 -3782 -1684 -1360 -2138 -4093 -5115 -5219 -5129 -7715
14599 -7715 -8055 -8998 -11195 -7407 -4783 638 1473 -70 -3026 -2178 -2269 -1559 1340 -1631 -1444 -1813 -3547
14582 -3547 -3639 -3898 -1133 -2998 -4354 -4165 -1607 -3542 -7279 -6700 -6939 -2533 -130 -323 -161 947 2786
14565B786j540j540L2N13l503k77k128L47M955N90j017m271O38K434J25j414k426
14548e696K865K359r1K006L18k508l388k094J559J386j876j782j270N10l20M306
14532c716M036J114j133n273j847K033J135Q17j796j8J58k9M093J694Q21j326
14516G63j854N82r37j514M60j89n72n78j667r06K596R4K039N618l51l314m60o20
14498h10J646K99l332k665J035M25K895l71N79L34l668l72K87J402q77n68K510
14481a251J720j14M51k316j583N130M502j791k302m203M70R21j142Q97l012l727
14465g350J471L864L501R66j756m092j275M10L0J54k479j9J993M048J833J327
14449B626o81k333l65j084j750R60J07j702n16J801J298j662l426P15M196J44
$$ plain form
14565 2786 1246 -294 -262 251 -3252 -3529 -5657 -5310 -355 235 -782 -5053 -4415 -1981 -1856 -3270 -5696
14548 -5696 -2831 -472 -563 1443 1761 -747 -4135 -6229 -4670 -3284 -5160 -6942 -8212 -7702 -8022 -3716
14532 -3716 320 1434 301 -4972 -6819 -4786 -3651 -2834 -4630 -4648 -4490 -4519 -426 1268 2089 763
14516 763 -1091 -509 -1446 -2960 -2500 -2689 -3261 -3839 -5506 -6412 -3816 -3722 -1683 3935 3584 270 -190 -810
14498 -810 836 1135 -2197 -4862 -3827 -3402 -507 -878 -299 35 -3633 -4005 -3718 -2316 -3193 -3761 -1251
14481 -1251 469 355 806 -1510 -3093 2037 6539 4748 2446 -1757 -1287 -366 -1508 -611 -3623 -7350
14465 -7350 -5879 -2015 1486 2452 696 -3396 -4671 -4261 -4231 -4077 -6556 -6575 -4582 -534 1299 2626
14449 2626 1945 -388 -753 -1837 -3587 -2627 -2520 -4222 -4738 -2937 -1639 -3301 -6727 -6012 -1816 -1672
14433a672j604j079K576J685K01J117q87m91l043j16L027J373k343L599N67l347
14417d37O24k573m178k78K032J357n87P66L222R33m180o87L125J298k710L10N15
14400a448j199n52N15k641J122M389K597L682r39r81n14m38o89j791m443j604
14384d934K979J892l253l817Q3J174j478j462M537j015n00K49RK610J062K43j497
14367c118j349r05N359K770n220k553L18J337k409l57j299K420L3j24K1k90L447
14350a919P53J717m8j145K795q43j008Q02J84k747j287m335L38K456l308K984
14334d611L623K665J115R56L390J236R32N42L169Q13m161m788k90k191j050J059
14318B409J30k550l266j567J330J185k24J81j132j377J524M472O62L36K74n74
$$ plain form
14433 -1672 -3276 -4355 -1779 -94 107 1224 337 -154 -3197 -3313 -286 1087 -1256 2343 2910 -437
14417 -437 187 -2386 -6564 -6842 -4810 -3453 -4040 -3274 -52 881 -3299 -3986 -861 437 -2273 -1963 -1448
14400 -1448 -2647 -3199 -2684 -5325 -4203 186 2783 6465 5526 4545 4031 3593 2904 1113 -3330 -4934
14384 -4934 -1955 -63 -3316 -7133 -7050 -5876 -7354 -8816 -4279 -5294 -5794 -5545 -5536 -2926 -1864 -1621 -3118
14367 -3118 -4467 -5372 -13 2757 -2463 -5016 -4698 -3361 -5770 -6127 -7426 -5006 -4973 -5097 -5076 -5366 -1919
14350 -1919 -1166 551 503 -642 2153 1310 302 1104 1288 -1459 -2746 -7081 -6743 -4287 -7595 -4611
14334 -4611 -988 1677 2792 3748 7138 8374 9306 9848 13017 13830 9669 4881 4591 2400 1350 2409
14318 2409 2539 -11 -3277 -4844 -3514 -2329 -2553 -2372 -3504 -4881 -3357 1115 1777 2113 2387 1813
14302A813L61n06m647j54K759J494k19J249K508J106k451p43J953J226k460o27
14286B662k487j920j043J401j81j787J103k777j752M71N815K106k090n19j959
14271b957r08m46M77P79K827n1j264J85O18K044J231j809L676K216J787j691k383
14254D331k794Q57m26J453j218J466L55J727J191k621k127l859l95K393J661m79
14238A515j575N78J776n18j122O46o49p65Q79N57j471l66J931r73k038K49J580
14221B34O25j230J781j425k589R23j23R83J584J188l825j268L050o86k094K930
14205E8M838l218j297J174q55j057m53P57j329k389j997LK248M315M158l72j300
14188C284j330K217J384L11k101m014j234p69K775j06L177K349J049j362J825
$$ plain form
14302 1813 2174 1668 -2979 -3133 -374 1120 901 2150 4658 5764 3313 2570 4523 5749 3289 2662
14286 2662 175 -1745 -2788 -1387 -1568 -3355 -2252 -5029 -6781 -6310 -495 1611 -479 -998 -2957
14271 -2957 -3865 -4311 -3834 -3055 -228 -279 -1543 -1358 -740 1304 2535 726 4402 6618 8405 6714 4331
14254 4331 1537 2394 1968 3421 2203 3669 4024 5751 6942 4321 2194 -1665 -2060 333 1994 1515
14238 1515 -60 518 2294 1776 654 1300 651 -114 765 1322 -149 -515 1416 443 -1595 -1346 234
14221 234 859 -371 1410 -15 -2604 -1681 -1804 -821 763 1951 -1874 -3142 -92 -778 -2872 58
14205 58 4896 1678 381 1555 700 -357 -810 -53 -1382 -3771 -5768 -5765 -3517 798 4956 4584 3284
14188 3284 1954 4171 5555 5866 3765 -249 -1483 -2252 523 417 3594 5943 6992 5630 7455
14173G455l026q86j298M36K166L976m433l347J172q36M494L028k008l38L263K605
14157A2423n29q87M618O568J6996J5064J1536M51n785o207n597m055l71K551O043
14142E2819P824P834J107o704j2820j0891j0819o486l644m749m766k250j22j313
14128E020o87j070J14K398M218K851m297k744p09j652k536l705k308J175O40K03
14112c089L168q83j657K019L423L96K90O14K684L61L938j059j246l489o035k351
14096b916J737L339O87J02J196L971j073J095j125l81M29m0L53l594K45n63p10
14079B752K777l278l077o81Q54L87j677k169J005K483R50k10j679L581L924m40
14063E502Q8k217j387L172J810K858q34J192K226j171j484m03M98j547l916r71
$$ plain form
14173 7455 4429 3543 2245 2681 4847 8823 4390 1043 2215 1379 5873 8901 6893 6555 9818 12423
14157 12423 11894 11007 15625 22193 39189 54253 65789 66240 60455 54248 48651 44596 44225 46776 52819
14142 52819 60643 68477 69584 62880 50060 39169 28350 21864 18220 13471 8705 6455 6333 5020
14128 5020 4333 3263 3377 5775 9993 12844 8547 5803 5094 3442 906 -2799 -5107 -3932 -3292 -3089
14112 -3089 79 -804 -2461 -442 2981 3377 3667 4281 6965 7326 11264 10205 8959 5470 -565 -2916
14096 -2916 -1179 2160 2847 2949 4145 8116 7043 8138 7013 6632 7061 7021 7374 3780 4025 3462 2752
14079 2752 5529 2251 -826 -1507 -653 -266 -1943 -4112 -3107 -624 326 116 -1563 2018 5942 5502
14063 5502 5590 3373 1986 5158 6968 9826 8992 10184 12410 11239 9755 9352 9850 8303 4387 3416
14047C416j328j880P40l12k06J310J747m21p99k840N18N676J500j707r26j143
14031C345L38l555k673j128J600M77j828J674j214L496J217k809k776K284L187
14016A635K633n99r67k16k435J023L001K313l356j686L02L809J113J452k844l781
14000A397K513K96M72j87r15k607k064K905q20l543J054K636J54O93J790j514
13984B260K86k261J437L75q77k47O06j035O6M228L074l699j898j02j125J73J511
13967B772m32j413J115J926k16r83k260l411J520J293j950J693K442l28M12L46
13951B526o89R0L56P44j644j205J368K117P49j15K34l436j135K128J870J902j474
13934D386O3O277M977J310r61m155l636l12l00j339L75J439l362k917j286J979
$$ plain form
14047 3416 2088 208 948 636 430 1740 3487 3066 2267 -573 -55 5621 7121 5414 4488 3345
14031 3345 3683 128 -2545 -3673 -2073 -1596 -3424 -1750 -2964 532 1749 -1060 -3836 -1552 1635
14016 1635 4268 3669 2702 2486 51 1074 4075 6388 3032 1346 1648 5457 6570 8022 5178 1397
14000 1397 3910 4206 4678 4491 3576 969 -1095 1810 990 -2553 -1499 1137 1291 1984 3774 2260
13984 2260 2546 285 1722 2097 1220 973 1579 544 610 4838 7912 4213 2315 2213 1088 1261 2772
13967 2772 2340 927 2042 3968 3752 2769 509 -2902 -1382 -89 -2039 -346 2096 1768 2180 2526
13951 2526 1837 1927 2283 3027 1383 178 1546 3663 4412 4297 4531 1095 -40 2088 3958 5860 4386
13934 4386 4449 10726 15703 17013 16052 11897 8261 7949 7649 6310 6685 8124 4762 1845 559 2538
13918B538L294P16K88l318l292J20P62K014O75K227L166l589j808q63m31R05j688
13901A716m38M69Kk69L23J468k192l132J246M348K825o423m034K753M807J524
13885D993k784k372r18j876J571p16k73j269K053M853L482k353k81J553l567j348
13869G48J598J351k736K131k764k066K500k89o55j183j585J212L654k34j591J813
13853A904J063k183l045k587N153K269j469j749j477M087O196N952J071m43k209
13838A2533k949k859j848j621M39M14j538O07J401P74j189k91j946j85N300J211
13822H253j268l675j911K43j946P35J520M47q59j494J487j776p7k319j770J689
13806b721k91J507J612J807N28K7j380K093j373J932K055j244l40P32J105n85
$$ plain form
13918 2538 5832 6548 6836 3518 226 346 1108 3122 3797 6024 9190 5601 3793 2930 2499 3404 1716
13901 1716 1278 1747 1749 1480 1803 3271 1079 -2053 -807 3541 6366 -57 -4091 -1338 3469 4993
13885 4993 2209 -163 -1081 -2957 -1386 -2102 -2375 -3644 -1591 3262 6744 4391 4110 5663 2096 748
13869 748 2346 3697 961 3092 328 -1738 762 473 -182 -1365 -2950 -1738 1916 1682 91 1904
13853 1904 2967 784 -2261 -4848 305 2574 1105 -644 -2121 1966 8162 14114 15185 14742 12533
13838 12533 9584 6725 4877 3256 3695 4109 2571 3178 4579 5353 4164 3873 1927 1742 7042 8253
13822 8253 6985 3310 1399 1642 -304 431 1951 2398 1539 45 1532 -244 -321 -2640 -4410 -2721
13806 -2721 -3012 -1505 107 1914 2442 2469 1089 3182 1809 3741 5796 4552 4212 4944 6049 5464
13790E464p82j660o06k117j916M84J507q14j051J207N59j659p41K445j901k951
13774d532K391n00O6J462K227O22Q03l982k888k76K384J167J45K300J219k08r68
13757A432j067j712K176K419K650J948j10K2m845O54J35p66p46k202J59J428K989
13740D564J349k529J48P85q07k269q35J483K065L526K253j702n59n34L11P58K560
13723A0567p63j222j128o58l267n03q16j599R25j040j177k69J190l41L17K562
13707B778l438j515J537O3M617K850J91m254k239R32n51n31J791J640l49q5J005
13690D442q03M84L006p48k583k98k119J956m10J276j42J009L340p4j603j396P3
13673E410l692l121q46J966L783K689K467J267N71N09j061j92K07j009k328k485
$$ plain form
13790 5464 4682 3022 2416 299 -1617 -1133 374 -440 -1491 -284 275 -1384 -2125 320 -1581 -4532
13774 -4532 -2141 -2641 -2575 -1113 1114 1736 2539 -1443 -4331 -4607 -2223 -1056 -911 1389 2608 2400 1432
13757 1432 365 -1347 829 3248 5898 7846 7736 7758 2913 3567 3702 2936 2190 -12 147 1575 4564
13740 4564 5913 3384 3532 4317 3510 1241 406 1889 3954 7480 9733 8031 7472 6938 7249 8007 10567
13723 10567 9804 8582 7454 6796 3529 3026 2210 611 1536 496 -681 -950 240 -101 216 2778
13707 2778 -660 -2175 -638 -575 4042 6892 7083 2829 590 1522 971 440 2231 3871 3522 3437 4442
13690 4442 3639 4123 7129 6381 3798 3500 1381 3337 2927 4203 4061 5070 8410 8336 6733 5337 5410
13673 5410 1718 -1403 -2249 -283 3500 6189 8656 9923 10494 11003 9942 9750 9957 8948 6620 4135
13657D135k577P25J45j451K327J264q33P46M63j26p55j495K44l31R3r70M586n78
13639E612N21K462q10k331k996j61J846N57q93J933J837j237j448J247K097j363
13623F873L61J338k924l374N89J797K647K749M074n15n1R15l326l929L880K087
13607A3191k744j536k646j265j432O09p80j929J324r22m1K788N15j424K776L023
13591I507J075J81N27M58j011m513l752J188J563P71L93j416K31R07K446J614
13575A0169J022l067j142J046N02J36M36j485l202j666l9J683L469L824N90k354
13559I922k679k677j213J4j171k655J841K124j32K276L690m60J082p58k262l798
13543C144j298P33k530R46K571N89j92J565k5M922M789k547l135j477l912l322
$$ plain form
13657 4135 1558 2283 2428 977 3304 4568 3735 4481 4944 4818 4063 2568 2812 2481 2574 1604 6190 5612
13639 5612 6133 8595 7785 5454 2458 2297 4143 4700 3807 5740 7577 6340 4892 6139 8236 6873
13623 6873 7234 8572 5648 2274 2863 4660 7307 10056 14130 13615 13564 14479 11153 7224 11104 13191
13607 13191 10447 8911 6265 5000 3568 4177 3397 1468 2792 1870 1829 4617 5132 3708 6484 9507
13591 9507 10582 10763 11290 11748 10737 6224 2472 3660 5223 5994 6387 4971 5202 6109 8555 10169
13575 10169 11191 8124 6982 8028 8530 8666 9102 7617 4415 2749 2710 4393 7862 11686 12276 9922
13559 9922 7243 4566 3353 3367 2196 -459 1382 3506 3374 5650 9340 8880 9962 9204 6942 3144
13543 3144 1846 2579 49 995 3566 4155 3963 5528 5503 10425 15214 12667 9532 8055 4143 821
13527H21q09J868k68N130K023l162n20l55k89m415j488M782K724L187l3l628J29
13510E697K284l54o2L44j514q82j346K00J540j750K719L395K182k480k867R24
13494H030j62j967L34l435n435j449R88L578M752J026j272K027J820J838L129
13479A3802k896j1Q3l774l432k743K312J66R41K319J932j527o39j491K843N00
13463H385r82q13R17j501J047K713K878j593l340m686j306K741J779J65q26J014
13447F592j212n9L413j345k78K212j880L352J235q05j23M54L62l376P66k271o40
13430F397k246n81J887L314L22k312j4M193o92j707k51k686k393K440O78o27J932
13413G654Q78J780J036k023K53K263n38j466K98j107k502J512K110K85J862k320
$$ plain form
13527 821 12 1880 1612 6742 8765 5603 5083 4728 4439 24 -1464 3318 6042 9229 9196 5568 5697
13510 5697 7981 7627 7565 7909 6395 5513 4167 4367 5907 4157 6876 10271 12453 9973 7106 8030
13494 8030 7868 5901 6235 2800 -2635 -4084 -3096 482 5234 6260 4988 7015 8835 10673 13802
13479 13802 10906 10895 10978 7204 3772 1029 3341 3507 4448 6767 8699 7172 6533 5042 7885 8385
13463 8385 7403 6590 7507 6006 7053 9766 12644 11051 7711 3025 1719 4460 6239 6404 5578 6592
13447 6592 5380 5321 8734 7389 7111 9323 7443 10795 12030 11225 11102 11556 11918 8542 9308 7037 6397
13430 6397 4151 3570 5457 8771 9093 6781 6767 10960 10268 8561 8310 5624 3231 5671 6349 5722 7654
13413 7654 8532 10312 11348 9325 9578 11841 11303 9837 10135 9028 6526 8038 10148 10433 12295 9975
13397I975K00m7k505J39j431j064K105J08J590j66J126k632l73N308M97j964q63
13380A0003m55k97j287O17K382K29p15J392J113j472k25R47j367l970M26l62J044
13363H003Q88J302K172p14l434l096p45J350n3L77N34K037J652P1o11p75J053
13346A0011J876l90k672P38K430j671K528K883n3k009j564j586m268J077J620
13331H950J058J494j047p47j907o79n89J265j810k924o0J342M589K281L887j22
13315A4981r70K70l915k348P09M274k244J77O49l377k944J357J196j211l332O07
13299C879K478R73J944J894M8J670p46K490L70l67J153Q02J374K569n41k307R79
13282A8662j502q05m12r78l814k968m0J894p89K050L995k618o88J012M54j07J622
$$ plain form
13397 9975 10175 10128 7623 7762 6331 5267 7372 7480 9070 8904 10030 7398 7025 12333 12830 10866 10003
13380 10003 9548 9251 7964 8581 10963 11192 10477 11869 12982 11510 11285 12232 10865 6895 7321 6959 8003
13363 8003 8891 10193 12365 11651 8217 5121 4376 5726 5673 6050 6584 8621 10273 10344 9733 8958 10011
13346 10011 11887 11497 8825 9563 11993 10322 12850 15733 15680 13671 12107 10521 6253 7330 8950
13331 8950 10008 11502 10455 9708 7801 7122 6533 7798 5988 3064 3004 4346 8935 11216 15103 14981
13315 14981 14011 14281 10366 8018 8727 13001 10757 10934 11583 8206 5262 6619 7815 6604 3272 3879
13299 3879 6357 7330 9274 11168 11216 12886 12140 14630 15000 14633 15786 16588 17962 20531 19990 17683 18662
13282 18662 17160 16355 15943 14965 11151 8183 8143 10037 9248 11298 15293 12675 11987 12999 13453 13346 14968
13265A4968M452j402j513k696j378o44P33J661k269m406j266R40N72K224J646
13250A1622J449K262K465k80j419j854r87M15K823R70k665l567k616n64L223l87
13234A0890m675J681L261P95K11j812R7P82K105J054o47m62j125K020j596R36
13218A3515k234p16P363M817J827k533m152M738l964o326L83n81R41R0j82K28
13202A3214q94J97k84K880J287J324L059M60j658m622p58K577J646L11j599l421
13186A3719L077J730j786j665j515o63P44L420J7k133l932j018J022L045J619
13171A5681M321q93k880r0o3r81M75L240k386l915j36J658K639q03j698K25J931
13154A6325Q10L33q44j302j314J410K194K068Q96j682J090J263r7J442o87Q07
$$ plain form
13265 14968 19420 18018 16505 13809 12431 11787 12520 14181 11912 7506 6240 7180 7752 9976 11622
13250 11622 13071 15333 17798 17518 16099 14245 13258 13673 16496 17466 14801 11234 8618 8054 11277 10890
13234 10890 6215 7896 11157 11952 12163 10351 10448 11230 13335 14389 13742 13280 12155 14175 12579 13515
13218 13515 11281 10565 17928 22745 24572 22039 17887 22625 18661 12335 12718 12137 13078 13168 12986 13214
13202 13214 12320 12517 12233 15113 16400 17724 20783 21243 19585 14963 14205 16782 18428 18739 17140 13719
13186 13719 16796 18526 16740 15075 13560 12897 13641 17061 17078 14945 11013 9995 11017 14062 15681
13171 15681 20002 19109 16229 16139 16076 15095 15570 18810 16424 12509 12373 14031 16670 15867 14169 14394 16325
13154 16325 17135 17468 16624 15322 14008 15418 17612 19680 20576 18894 19984 21247 21150 22592 21905 22712
13138B2712K403L112j882k029k331l5j80l625J531q8j014j897L371L598j171n197
13122A7278l87n09l425J482L20L207K185L153N588o77j539m22k478m986m368k925
13106A1497n811o580k503l890M90P759J3039Q066P815N322P83J459j242l642k187
13091C0375J363J705J996M437K321k11K557M285O341Q321R814Q931O091P026J0088
13076A05440J3798J5064J6291K1236L8399N9172R9088J65872K50128K98156K66813
13065A349457J38309m6681k07821k85567k67493k01649j35084q3412n4929m0762
13055A64368k6484j9956j7096j4822r864o274m581n309j506o188n616P08k469
13042D4911l587j824j091N84K575j186j994M08l380k617k071j004K275R3J574
$$ plain form
13138 22712 25115 28227 26345 24316 21985 21950 21770 18145 19676 19588 18574 16677 20048 23646 22475 17278
13122 17278 16891 16382 12957 14439 14759 17966 20151 23304 28892 28215 26676 26254 23776 18790 14422 11497
13106 11497 5686 -894 -3397 -7287 -6797 962 14001 22067 29882 35204 35987 37446 36204 32562 30375
13091 30375 31738 33443 35439 39876 42197 41986 44543 48828 55169 63490 73304 82235 88326 95352 105440
13076 105440 119238 134302 150593 171829 210228 269400 368488 534360 784488 1082644 1349457
13065 1349457 1487766 1441085 1233264 947697 680204 478555 343471 260059 205130 164368
13055 164368 137884 117928 100832 86010 76146 69872 65291 59982 58476 52288 46672 47380 44911
13042 44911 41324 39500 38409 38993 41568 40382 38388 38796 35416 32799 30728 29724 31999 32092 33666
13027C3666q48j746j431m85J0R4l047k089J772K757K962j927j049L354K549J498
13011C6040n93l176n295m81K290j591l643J273L323K133L939L354J926j930L58
12996C7927J695l46j636j860j657l0k980j469N33J215k08P8L690O25P68J999M504
12979D2848k778m348j010j752K092K60M419L055k399j046j243l069k326k125K849
12964C3427k884k835m51l595m48j183n97R65p48l982J558j216n30M85k265j352
12948A4349m069l898J250J070K520R215J1674R518Q212j460j928m277n730m102
12934C2344k434J061J872L12q11O29J169R8Q6J787m330l099p76J798J778J539
12918C3023j41J385J399K407J384K74K277K081K322M153N81j114J302L474j452
$$ plain form
13027 33666 32818 31072 29641 29156 29166 29260 26213 24124 25896 28653 31615 29688 28639 31993 34542 36040
13011 36040 35447 32271 26976 26495 28785 27194 23551 24824 28147 30280 34219 37573 39499 37569 37927
12996 37927 39622 39276 37640 35780 34123 34093 31113 29644 30177 31392 31184 31262 34952 35577 36345 38344 42848
12979 42848 40070 35722 34712 32960 35052 35312 39731 42786 40387 39341 38098 35029 32703 30578 33427
12964 33427 30543 27708 27257 23662 23214 22031 21434 22399 21651 17669 19227 18011 17481 17966 15701 14349
12948 14349 10280 6382 7632 8702 11222 20437 32111 41629 49841 48381 46453 42176 36446 32344
12934 32344 29910 30971 32843 33155 32344 32973 34142 34240 34326 36113 31783 28684 27908 29706 31484 33023
12918 33023 32882 34267 35666 38073 39457 39731 42008 44089 46411 50564 51145 50031 51333 54807 53355
12903E3355o162m093q81L12J453K339M670R708J0078J0238O492K308N360N939
12889A01116J048n833q895p277n557k781k561j226L415L585L496J904K628o59
12875H2403l272M87J937P113J6396J3698J3804J0648N095K171j113r216j1126
12862A29025p731r125m468L895L889O264P91n89k229m094o228o829l303k475n550
12847I1243n375j926j561m470n885k343L245J576L751N612n63K506P733R218O644
12832A09405m920k2501m7461q7374j33989j66969j59988j10966l7975L4776Q6702
12821e41260J04965R2316P5249N3143L8139L0574K6716J6265J2776Q822J100n863
12809h7058k057j504k07M397P070O236O40m335p274o351p501r496j0323j5111
$$ plain form
12903 53355 47193 43100 42219 42531 43984 46323 50993 60701 70779 81017 87509 89817 95177 101116
12889 101116 102164 96331 87436 80159 74602 71821 69260 68034 71449 75034 78530 80434 83062 82403
12875 82403 79131 79618 81555 88668 105064 118762 132566 143214 148309 150480 149367 140151 129025
12862 129025 121294 112169 107701 111596 115485 121749 122540 121951 119722 115628 109400 102571 99268 96793 91243
12847 91243 85868 83942 82381 77911 72026 69683 72928 74504 78255 83867 83304 85810 93543 102761 109405
12832 109405 104485 81984 34523 -52851 -186840 -353809 -513797 -624763 -662738 -627962 -541260
12821 -541260 -436295 -343979 -268730 -215587 -177448 -146874 -120158 -103893 -91117 -82295 -81195 -87058
12809 -87058 -89115 -90619 -90826 -86429 -79359 -73123 -72483 -76818 -84092 -90443 -97944 -107440 -117763 -132874
12795a32874k3894k1611r035K0283O0053Q8214Q8170P6499N3547K7165J1530K390
12783B40437l768o804n962r070j1871q089q467p750j1384j3273p825j1609j3487
12770A21078j1378j0485j0468j1993j1223n259M792K0966L5545N3008O0206M5534
12758B80323J7679j0242l3963m1459m1180k8877k0244j1231L980J6639L1314L9188
12746B01927L7910K1014M846m419j5379j8935j1489m873l46j800L058p10o337
12733B04467o263o101o833m242j778K410K792J335K142n56J880M957N837Q816
12719B08863R218Q390J0342J7347K0366K0532J9335J2370P652M533q84j393K008
12706C38679P744Q882J1030J0373R240M363L93k973j870L362J4385K3640K8328
$$ plain form
12795 -132874 -156768 -178379 -187414 -167131 -107078 -18864 69306 145805 199352 226517 238047 240437
12783 240437 236669 229865 223903 214833 202962 194873 186406 178656 167272 153999 146174 134565 121078
12770 121078 109700 99215 88747 76754 65531 60272 65064 86030 121575 174583 234789 280323
12758 280323 298002 287760 253797 212338 171158 142281 122037 110806 114786 131425 162739 201927
12746 201927 239837 260851 265697 261278 245899 226964 215475 210602 210256 208456 211514 210804 204467
12733 204467 198204 192103 185270 181028 179250 181660 184452 185787 187929 187373 189253 194210 200047 208863
12719 208863 218081 226471 236813 254160 274526 295058 314393 326763 334415 338948 338064 336671 338679
12706 338679 346423 355305 366335 376708 385948 390311 390704 387731 385861 389223 403608 427248 455576
12693D55576K5652J8601R932L631N790O731J4999L2505L8356L3475K9548L0287
12681G05083L4233L9447M3096M4339M4830L9406L8861L8363M5890O1026P9258
12670A213832R9169J05604J04179R1133Q4161R0137J06269J29410J58361J88442
12660B370697K16186K43200K78632L34075M18493N41770P14615R18503J086632
12651G122803J175843J194813J205361J290191J518074J895534K400842L040133
12643B0843594L948126N518887Q497826J4202900K4313631L8607094N0954207
12636A66886265N1381856L5539908Q586433j9857583m0982557m8878240m3823616
12629A08852466l2319544k1487248j3982115r413801o725175n057294l888358
$$ plain form
12693 455576 481228 499829 509761 513392 519182 525913 540912 573417 611773 645248 674796 705083
12681 705083 739316 778763 821859 866198 911028 950434 989295 1027658 1073548 1134574 1213832
12670 1213832 1313001 1418605 1522784 1613917 1698078 1788215 1894484 2023894 2182255 2370697
12660 2370697 2586883 2830083 3108715 3442790 3861283 4403053 5117668 6036171 7122803
12651 7122803 8298646 9493459 10698820 11989011 13507085 15402619 17803461 20843594
12643 20843594 24791720 30310607 38808433 53011333 77324964 115932058 166886265
12636 166886265 218268121 253808029 262394462 242536879 201554322 152676082 108852466
12629 108852466 76532922 55045674 41063559 31649758 24924583 19867289 15978931
12622A5978931k969655k208736j589564j122120q16208o85373o72556o99879o86480
12613D528360o12206n02802m00874l19395k59617k20349j87172j64836j53716
12604A707393j43520j34424j18967r7553p2454m9206l5639l5353m7347n5978n5762
12593H61190n2809m4519l3424k7884k5901k4099k7151k7191k1793k0708j7497
12582E38214j0391j1737j7865k4693l1504k5652j7389j0792k037K659k164j6777
12570C69872j8532k2309k2454j8972j4080j0512n135o112j1809j4832j2474j2821
12558A99830j0481l360J762O595P740L021M393N258l149m205l430j595k896p546
12544A91937r269r184o594m991n394m826p299r627q240n343k172J999L174M482
$$ plain form
12622 15978931 13009276 10800540 9210976 8088856 7272648 6587275 5914719 5214840 4528360
12613 4528360 3916154 3413352 3012478 2693083 2433466 2213117 2025945 1861109 1707393
12604 1707393 1563873 1429449 1310482 1212929 1140475 1091269 1055630 1020277 972930 916952 861190
12593 861190 808381 763862 730438 702554 676653 652554 625403 598212 576419 555711 538214
12582 538214 527823 516086 498221 473528 442024 416372 398983 388191 386154 388813 386649 369872
12570 369872 351340 329031 306577 287605 273525 263013 257878 251766 239957 225125 212651 199830
12558 199830 189349 185989 187751 194346 202086 205107 209500 214758 211609 207404 203974 202379 199483 191937
12544 191937 182668 173484 166890 161899 156505 151679 144380 134753 126513 121170 118998 120997 124171 128653
12530A28653K754J512q856j9059k3337k1201j2196j279J5942K7879L4613L6690
12518A62115L5222K3547P504p334k4958m2253n1229n1520m6069k1847L519K7873
12506A4570L9346L7509K7302J2743M646r372j3263j5231j5981j6084j5722j7637
12494C2826j4583j3754j1213j2340j3458j1679j1145j2302q905o997o244k228
12482i2022J2862L5051O4704Q5149Q7867P0124M1833R646r916j9918j7455j2216
12470B55709j6110j2551r493j0431j1183n774K51N600L825M833L881j084q068
12457A99405k464m00K732J2087J8189J9116K8845M1150N7348Q1863J09482J17300
12445F84653Q1532O908p5264j35026j66057j55290j15379o9839m0736k3940j2061
$$ plain form
12530 128653 131407 132919 124063 105004 81667 60466 48270 46991 62933 90812 125425 162115
12518 162115 197337 220884 228388 221054 196096 153843 102614 51094 5025 -16822 -13303 14570
12506 14570 53916 91425 118727 131470 136116 126744 113481 98250 82269 66185 50463 32826
12494 32826 18243 4489 -6724 -19064 -32522 -44201 -55346 -67648 -76553 -83550 -89794 -92022
12482 -92022 -79160 -44109 20595 105744 193611 263735 305568 315214 305298 285380 267925 255709
12470 255709 239599 227048 217555 207124 195941 190167 190418 196018 199843 204676 208557 207473 199405
12457 199405 196941 196541 199273 211360 229549 248665 277510 318660 376008 457871 567353 684653
12445 684653 766185 773093 697829 562803 396746 241456 126077 56238 15502 -8438 -20499
12434b0499l285K62M031O345M679O011Q294P827J984k563k977m081m466J017J867
12419D446j477l522n542m608J38L730k86M994Q28O662M487P89j292n121o117l737
12403e628l615P95K588N835Q030P132M369N202L621L156L25n039n337k344K24
12388A9314J377k176l282j966m647m189j548J170l385k956j499l286j579p08K36
12373i124N625O895L105N471M351q30j846o508q009j330r50Q15j74l056p29M324
12357a970L863L148L133J174M56K378K999L065J935J253l685P49Q51j825k467
12342A5057N63J982j455q42L532P662O376j863o671q250q915o654m671j373J361
12327d161N477J2357P700K462K257J75m096k377j399k623r48j725j691j452k45
$$ plain form
12434 -20499 -23784 -23522 -19491 -13146 -8467 -2456 5838 13665 15649 13086 10109 6028 1562 2579 4446
12419 4446 2969 -553 -6095 -10703 -10565 -6835 -7121 -2127 -1299 5363 9850 10639 9347 4226 -1891 -5628
12403 -5628 -9243 -8448 -5860 -25 8005 15137 19506 24708 28329 31485 31810 26771 21434 19090 19314
12388 19314 20691 18515 15233 13267 8620 4431 2883 4053 668 -2288 -3787 -7073 -8652 -9360 -9124
12373 -9124 -3499 3396 6501 11972 16323 15493 13647 7139 -870 -2200 -3150 -2335 -2509 -5565 -6294 -1970
12357 -1970 1893 5041 8174 9348 9804 12182 15181 18246 20181 21434 17749 18498 19349 17524 15057
12342 15057 15620 17602 16147 15305 18837 26499 32875 31012 24341 16091 7176 522 -4149 -5522 -4161
12327 -4161 1316 13673 21373 23835 26092 26267 22171 19794 18395 15772 14824 13099 11408 9956 9711
12312I711L108N55K102J002K945M011O371P595M649m329j1422j5719q486k470
12298c77K88J061j308K653J1496J1286O725P41o597p476o481n737j303q96O73
12283D748j689j169O39Q16k186k92m235j800q21K96r79j829j048P2K473L322K478
12266a204r46J449N583L171R52Q91m030l206j701j437l481J90J533L190K808K32
12250C994n90L722M643J68k110k114K29m046o073J539K586r5j033m32J564J071
12234C023k682j231k847k333L802k047q87R8R43J470q12N291K507K357P670K090
12218A6412J138K927M946O554O760K341P376N688O608J1361J3841J4684K1085
12205A21721K8766M1985O8490J16779J96297K68798K95611K33657P8226j05867
$$ plain form
12312 9711 12819 13374 15476 16478 19423 23434 29805 37400 42049 37720 26298 10579 2093 -377
12298 -377 -89 972 -336 2317 13813 25099 31824 32565 25968 18492 12011 6274 4971 4075 4748
12283 4748 3059 1890 2529 3345 1159 867 -3368 -5168 -5989 -5693 -6672 -8501 -9549 -9477 -7004 -3682 -1204
12266 -1204 -2150 -701 4882 8053 9005 9896 5866 2660 959 -478 -3959 -3769 -2236 954 3762 3994
12250 3994 3404 7126 11769 11937 9827 7713 7942 3896 -2177 -638 1948 1853 820 388 1952 3023
12234 3023 341 -890 -3737 -6070 -2268 -4315 -5202 -5104 -4161 -2691 -3503 1788 4295 6652 14322 16412
12218 16412 17550 20477 25423 31977 38737 41078 48454 54142 60750 72111 85952 100636 121721
12205 121721 150487 192472 260962 377741 574038 842836 1138447 1372104 1450330 1344463
12195A344463k41794k88862k51961j78503j14771p0417m7759l6508k7915j8501
12185F7472j2310q044n112m976l832k58J85q02k297k319k795P22N631L383K789
12170C7437J003K962P21J725K159k729n164m859p711n794m244p282o055j203p19
12155B47J420l748j761q60K933Q09J358K268k670M66J250l001j309K664K354k091
12139C29k992k411K139N13J144l45l807M59k793l441j458M615N672J618j922k530
12123e210m310J176K746J862J416r49M061K13j721l529j439N71K726L421j086
12108e2j613k826Q86J654J839J682J217j840l782K148L756k174j15L040P03j086
12092C437j989R31J988j429k161k091k373K769J377J822j966k091j296O38l70
$$ plain form
12195 1344463 1102669 813807 561846 383343 268572 198155 150396 113888 85973 67472
12185 67472 55162 47118 42006 37030 33198 32940 33125 32323 30026 27707 24912 25634 31265 34648 37437
12170 37437 38440 41402 42123 43848 46007 43278 38114 33255 25544 19750 15506 8224 2169 966 247
12155 247 1667 -2081 -3842 -4702 -1769 -960 398 2666 -4 462 1712 -1289 -2598 66 2420 329
12139 329 -2663 -5074 -2935 -2422 -1278 -1623 -5430 -4971 -7764 -11205 -12663 -8048 -2376 -758 -2680 -5210
12123 -5210 -9520 -8344 -5598 -3736 -2320 -3269 792 1005 -716 -4245 -5684 -5113 -2387 1034 -52
12108 -52 -1665 -4491 -3605 -1951 -112 1570 2787 947 -2835 -687 3069 895 780 3820 4523 3437
12092 3437 1448 2379 4367 2938 777 -1314 -3687 -918 459 2281 315 -1776 -3072 -2434 -2804
12077b804J413J62l082l77J945n14N80k61m92K747J975J036L552k75j114M270
12061H761J331l117k601k40l210r57j165k268j588l6k552k677K219L458J873n45
12045c314j28o06n7K531J770J049r0k011L32l31j326O77J504L324J293K694K48
12028G559j329r65j922J665j53j520m64p42R09j292j715r63m74J265L966L650
12012G475n59l214p66K120j102J942J142j529o530l395k19k064j597J436K690
11997d170J792j28K252r92l279J312K886j484k771j003L323J715j76j29J44q36
11981a544M88l47J815j890l390J202N184L510j192k424j415R03n47L230j736K19
11965B066L587k319J23m027j252J09k54q94K394L884J774k73k412M97K946l275
$$ plain form
12077 -2804 -1391 -1229 -4311 -4688 -2743 -3257 -2677 -2938 -3430 -683 1292 2328 5880 5605 4491 8761
12061 8761 10092 6975 4374 4134 924 -33 -1198 -3466 -5054 -5090 -7642 -10319 -8100 -4642 -2769 -3314
12045 -3314 -3442 -4048 -4105 -1574 196 1245 1155 -856 -524 -855 -2181 -1504 0 3324 4617 7311 7559
12028 7559 6230 5265 3343 5008 4855 3335 2871 2129 3038 1746 31 -932 -1406 -141 3825 7475
12012 7475 6916 3702 2936 5056 3954 5896 7038 5509 -1021 -4416 -4635 -6699 -8296 -6860 -4170
11997 -4170 -2378 -2506 -254 -1246 -4525 -3213 -327 -1811 -4582 -5585 -2262 -547 -723 -852 -708 -1544
11981 -1544 -1056 -1403 412 -1478 -4868 -3666 1518 5028 3836 1412 -3 900 353 3583 1847 2066
11965 2066 5653 3334 3457 -570 -1822 -1713 -1967 -2861 -467 3417 5191 4918 2506 3003 5949 2674
11949B674k093r3J328K10j018m86J705j305L722Q16j94k337q96m703l112j29K630
11932c281k633k06L402J363m47j141j157J546M535L078K10l440m31L215j39l714
11916G60k52K731N407J0703J4246J0500l412r734o501o033o570m258n546l705
11902a664o3K75L640j729K76N646K519l88k530M24Q10k236l561L75l130Q07J456
11885I27R4j190o0o99n099l022K334P16J012N771O9n06J103J430K017k702Q01
11868B996J382k369m207k710q50o46k365K802K278K473K934l560o449J100L662
11853c529K621K316J283J831j868j720J255j79rJ80l9K866L274j427l870m195
11837a210R57n06k496J722N413J184j832J613k307j892k65J583J331K41J463j875
$$ plain form
11949 2674 581 488 1816 2026 1008 522 2227 922 4644 5460 5266 2929 2033 -2670 -5782 -5911 -3281
11932 -3281 -5914 -6120 -2718 -1355 -1802 -2943 -4100 -2554 1981 5059 5269 1829 1398 4613 4474 760
11916 760 508 3239 8646 19349 33595 44095 40683 30949 24448 18415 11845 7587 2041 -1664
11902 -1664 -1727 -1452 2188 459 735 6381 8900 8512 5982 6406 7216 4980 1419 1794 -1336 -529 927
11885 927 1021 -169 -229 -928 -6027 -9049 -6715 -5999 -4987 784 853 347 1450 2880 4897 2195 2996
11868 2996 4378 2009 -2198 -4908 -5758 -6404 -8769 -5967 -3689 -1216 1718 -1842 -8291 -7191 -3529
11853 -3529 -908 1408 2691 4522 2654 934 2189 2010 2001 2181 2142 5008 8282 6855 2985 -1210
11837 -1210 -253 -759 -3255 -1533 3880 5064 3232 4845 2538 646 381 1964 3295 3536 4999 3124
11821C124l047r04J6j360Q80N46K714K817O31k398J49L89m4j638q8K326q23k784
11803E06j573J275M20n055k993k06N026J679J47K01J9L105K402j873k817Q42L087
11786D192K682J006J607O944N799K773n997n611L75l341j719l253j197K101M732
11771A1093n54O25j300J30K09j136J175K333J285J0220J3294J0416J120j3413
11757C5497j4318m136n389l372m52r84j144k293o3j430R47L479o38n67M60j546
11741D051k73K234k185J001k538j02L08l70J363J727j536q60M134J289j066k635
11725D542M078J28j833L247j802j305k118j645j381p60j971j332K73L500R95J803
11709D419k52m3k162J357K965j01p0k792l206k11K244m6O20J295n15l705j081
$$ plain form
11821 3124 77 -827 -811 -2171 -1291 -745 1969 4786 5417 3019 3168 3557 3513 1875 1787 4113 3290 506
11803 506 -1067 208 628 -4427 -7420 -7626 -2600 -921 -774 -573 -554 2551 4953 3080 263 1105 4192
11786 4192 6874 7880 9487 16431 22230 25003 19006 13395 13770 10429 8710 5457 4260 6361 11093
11771 11093 10539 11164 9864 9994 10203 9067 10242 12575 13860 24080 37374 47790 48910 35497
11757 35497 21179 17043 11654 8282 7830 6846 5702 3409 3346 1916 2863 6342 5704 5137 5597 4051
11741 4051 3778 6012 3827 4828 2290 2188 2496 2126 3489 5216 3680 2820 6954 8243 7177 4542
11725 4542 8620 8748 6915 10162 8360 7055 4937 3292 1911 1151 -820 -2152 -1879 1621 2616 4419
11709 4419 4167 4124 1962 3319 6284 6183 6113 3321 115 -96 2148 2102 2722 4017 3502 -203 -1284
11692a284M11q10Q24K865k715J468L817P2p07O07K55l556k618J322J170j056k529
11675b464L911J265J697l44j211j87L195M869j051l778m733l110j222j997K304
11660b856L452L71Q5n36j956R76O381K55M88j146l009l018k33j387j238J174M564
11643B367M526j48n318j139L474K265j341l263r00K585N81k016j670J24j972m366
11627f211l49K159P013R62J79K303n06j584l558l038k22L625J759J559M212K083
11611A0386l02J142j459J064k272j439J066Q6m90k949n622j588K682K943N34M49
11595D231J40j234P97M16J593R03j603j578q6o63j860j225k081L520J475j062
11579A683k404M25K083N5l15L747Q83l379M23J118k337%J807l772j502K047M034
$$ plain form
11692 -1284 -873 -1683 -859 2006 -709 759 4576 4648 3941 4548 4803 1247 -1371 -49 1121 65 -2464
11675 -2464 1447 2712 4409 4065 2854 2667 5862 10731 9680 5902 1169 -1941 -3163 -5160 -2856
11660 -2856 596 967 1052 516 -1440 -464 5917 6172 6660 5514 2505 -513 -746 -2133 -3371 -2197 2367
11643 2367 6893 6745 1427 288 3762 6027 4686 1423 523 3108 3689 1673 3 127 -1845 -6211
11627 -6211 -6560 -4401 2612 3574 3753 6056 5550 3966 408 -2630 -2852 773 2532 4091 8303 10386
11611 10386 10084 11226 9767 10831 8559 7120 8186 8272 7782 4833 -789 -2377 305 3248 3782 4231
11595 4231 4371 3137 3934 4350 5943 6846 5243 3665 3579 2916 1056 -169 -2250 1270 2745 1683
11579 1683 -721 -296 1787 1842 1527 5274 6157 2778 3201 4319 1982 1982 3789 17 -1485 562 4596
11562D596J421o65k509j829j187K031M68j47K60K24N16M3j775L734J586O96k113
11545E350k960j849l76Q04Q48k93J16q18L957K469J679J485j305J237r13j354
11529H077j368l246j753J578J986J770k00l022j338n18l13O38R51P03j153k170
11513F22L694K068J01M41J109j307L72l94J160r80j215K58Q29m90p41m379l257
11496b109k846O08M527L243n25j699J979rj299L372mL36L299L782j593m003l855
11479C204K012l93M86J512N0k899k080J571J879o77l74P75L06k422N53P12K836
11462G051J662P91j811k976M391o32k635k008M00K050K63j79p73m88R53J979Q64
11445H902o13O22K709J466j897k21q43l479k519n86J280K104j222J53N25K657
$$ plain form
11562 4596 6017 5352 2843 1014 -173 1858 2326 2179 2439 2663 3179 3222 1447 5181 6767 7463 5350
11545 5350 2390 541 165 969 1817 1524 1640 822 4779 7248 8927 10412 9107 10344 9431 8077
11529 8077 6709 3463 1710 3288 5274 7044 6844 3822 2484 1966 1653 2291 3242 3945 2792 622
11513 622 4316 6384 6485 6926 8035 6728 7100 6706 7866 6886 5671 5929 6758 6268 5527 1148 -2109
11496 -2109 -4955 -4347 180 3423 2898 1199 3178 3169 1870 5242 5238 5574 8873 12655 11062 7059 3204
11479 3204 5216 4823 5309 6821 6871 3972 1892 3463 5342 4665 4291 5066 5372 2950 3503 4215 7051
11462 7051 8713 9504 7693 4717 9108 8476 5841 3833 4233 6283 6546 6367 5594 5106 6059 8038 8902
11445 8902 8289 8911 11620 13086 11189 10968 10125 6646 4127 3541 4821 6925 5703 5856 6381 9038
11429I038J051Q37q14O35k67j569l843j270M949K573j845k325P14l321n89N69
11413D523K599Q78k737k045J31k568j539K177J481K467k11j641Q82J660M029J933
11397A2019k490j811N21k995N44J625l674l435j995Q05n07M768N668J173k073
11382H143Q22J467j500K645J038m677J09J873J14L88l113L49K376K223j071n990
11366E196l34J43k275R82M003N188j414n631p52j790J343J121J495K217K77k839
11350F930j44m22k037L18K140j921j792n80j29K253k033J407L427j831l339K49
11334B496L005L054R66J471R15Q17k841J454J090J12k779O12j77R43k267k217
11318F654k303M261K654q1j916K8m01J302j186J899L760m90j088K737m110q77
$$ plain form
11429 9038 10089 10926 10112 10747 10480 8911 5068 3798 8747 11320 9475 7150 7864 4543 3954 4523
11413 4523 7122 8000 5263 3218 3349 781 -758 1419 2900 5367 5156 3515 4397 6057 10086 12019
11397 12019 9529 7718 8239 5244 5788 7413 3739 304 -1691 -886 -1393 3375 9043 10216 8143
11382 8143 8965 10432 8932 11577 12615 7938 8047 9920 10034 10422 7309 7658 10034 12257 11186 5196
11366 5196 4862 5005 2730 3712 7715 12903 11489 5858 5106 3316 4659 5780 7275 9492 9769 6930
11350 6930 6786 6364 4327 4645 6785 4864 3072 2492 2363 4616 2583 3990 7417 5586 2247 2496
11334 2496 5501 8555 9521 10992 11907 12724 9883 11337 12427 12539 9760 10372 10195 11138 8871 6654
11318 6654 4351 8612 11266 11185 9269 9297 8896 10198 9012 10911 14671 14181 13093 15830 11720 10843
11302A0843K666k325j136l29N77J08q06j22j840j399j458J617Q85l6L095K861
11286A3201Q9j339L67L23j820K013o37j171J908L412J007p098j406M38l157K213
11270H343L245j134M487K041k758j107m50j28J06j303m126L75L630o0l348m176
11254C637J114L28J446J673j272j083k484j258k254j283J855K528M277K245Q22
11239A0291K529K130K211K13m818k314j120l973L11M477M03O75k71J32m08O39
11223A1107L942L692k199K737L074j146k752k098M6k55J006k72k123l136k396
11208I227M185K750K000m80J87m82J818N419J650K423L167N820K16L475M330P259
11192E2964P712L215M899J0762J0292J0595K1883L7161O6763J23452J91198K11847
$$ plain form
11302 10843 13509 11184 10048 9719 10296 10404 9598 9476 7636 6237 4779 6396 7281 7245 10340 13201
11286 13201 13290 11951 12318 12641 10821 12834 12197 11026 12934 16346 17353 10255 8849 9287 6130 8343
11270 8343 11588 10454 14941 16982 14224 13117 12667 12539 12645 11342 7216 7591 11221 11161 7813 3637
11254 3637 4751 5079 6525 8198 6926 5843 3359 2101 -153 -1436 419 2947 7224 9469 10291
11239 10291 12820 14950 17161 17374 12556 10242 9122 5149 5460 9937 10340 11015 10744 10876 10468 11107
11223 11107 15049 18741 16542 19279 22353 21207 18455 16357 16403 16148 17154 16882 14759 11623 9227
11208 9227 13412 16162 18162 17682 17869 17387 19205 24624 26274 28697 31864 37684 37900 41375 45705 52964
11192 52964 60676 63891 68790 79552 89844 100439 122322 159483 226246 349698 540896 752743
11180G52743J60974P6029L8q2518j68730k04694j70574j14758o8672m4801k6711
11169A08326j6724j6449j0871q838r000j505m343m216l281j934m204m841j265
11156B0855k059k694L91J511J097K959L122N11o42j291l580l201M90k085l163
11141A2221k01k94K627K146p27j184J008q75j055J277N53K319J76N86m17J154
11125A9314l21J341Q9k662k566j039j335M14j358L816J767L313L98J19l520l053
11109A4717J798Q27k903j271J387l17j183J054J034J220J05k588k283p84N112
11094A5925K589m04J021L135J704j687j867L5L80j99j481r48j899l360j496L801
11078A5249M863K03j149j284L754K187N42M062M058J902j12J073J945J203L583
$$ plain form
11180 752743 913717 989746 989784 907266 738536 533842 363268 248510 179838 135037 108326
11169 108326 91602 75153 64282 55444 46444 44939 40596 36380 33099 31165 26961 22120 20855
11156 20855 18796 16102 16493 18004 19101 22060 25182 25693 25051 23760 20180 16979 17469 15384 12221
11141 12221 12020 11726 14353 16499 15772 14588 15596 14721 13666 14943 15496 17815 17991 18577 18160 19314
11125 19314 18993 20334 20423 17761 15195 14156 12821 13235 11877 15693 17460 20773 21171 21290 17770 14717
11109 14717 16515 17342 14439 13168 14555 14238 13055 14109 15143 16363 16468 13880 11597 10813 15925
11094 15925 18514 18110 19131 22266 23970 22283 20416 20451 20831 20632 19151 18203 16304 12944 11448 15249
11078 15249 20112 20315 19166 17882 21636 23823 24365 28427 32485 34387 34275 35348 37293 38496 42079
11063D2079N478P320N916P674R164P574J7024K1659L2391O3772J15220J75931
11051E11202J83243J09625K0701P155K1118k8302j29607j86307j63532j08368
11041B36928o6297m3838k6754j3161j2274j3007o637q947o379l081m011l582j804
11028B7156m098j214K170J160q50L244j820j819j87k43J201J584J014j864J38
11013B5572l177j640j185L077L353j323j118O04l314k130K143K514j97K54J423
10998B4856k90J08L690l764p44L666p71l236l4o5j414O24J804K129K390k253m782
10981B1914k511j478N56N12L128q27o74R88K535L72k151j333j14O68q86K448M44
10964B3591j182n301m291M97K208K86k880K735L136J590R55K710q93r84J604J17
$$ plain form
11063 42079 47557 54877 60793 68467 77631 85205 102229 123888 156279 220051 335271 511202
11051 511202 694445 804070 824771 831926 853044 824742 695135 508828 345296 236928
11041 236928 170631 126793 100039 86878 74604 61597 54960 46013 39634 36553 32542 28960 27156
11028 27156 23058 21844 24014 25174 24324 27568 25748 23929 23742 23499 24700 26284 27298 25434 25572
11013 25572 22395 20755 19570 22647 26000 24677 23559 24163 20849 18719 20862 23376 23179 23433 24856
10998 24856 24566 24674 28364 24600 23856 27522 26751 23515 23481 23416 22002 22626 24430 26559 28949 26696 21914
10981 21914 19403 17925 18481 18993 22121 21294 20620 21608 24143 24515 22364 21031 20917 21585 20699 23147 23591
10964 23591 22409 17108 12817 13314 15522 15808 12928 15663 18799 20389 21344 24054 23161 22177 23781 23898
10948B3898J741J650P71Q74L64j722j50l191j585K13J086j015j668k32P82L275
10932B5091K547n323p12K549J013j583pJ697j157R60Q50j193J513l52n37l87j218
10915B3751J192J013J582l73j914k287N71l86l495j377j037j469p86L017r00k74
10899A6828R79J099j806O47Q64J397J68q99K77p9J821N57K465p84M93j737K215
10882B4505J717r68L830K408m55j393K658J565J398j13j209K749M65J237r27J348
10866C8815m94l208j879k229P36k108l54J185L265N28k197p85O87P82k88j443
10850C1013m235m73M99L77K044l9p22O40P6j59M12j0m248j411j832Q47J110J082
10832B4971J694J91J004J464J142J520j275K659j647J267k97k152K500K886o13
$$ plain form
10948 23898 25639 27289 28060 28934 29298 27576 27426 24235 22650 22863 23949 22934 21266 21034 21816 25091
10932 25091 27638 22315 21603 24152 25165 23582 23575 25272 24115 25075 25925 24732 26245 25893 25356 24969 23751
10915 23751 24943 25956 27538 27165 25251 22964 23535 23149 19654 18277 17240 15771 14985 18002 17102 16828
10899 16828 17807 18906 17100 17747 18611 20008 20176 19277 19554 19475 21296 21853 24318 23534 24027 22290 24505
10882 24505 26222 25254 29084 31492 31037 29644 32302 33867 35265 35152 33943 36692 37157 38394 37467 38815
10866 38815 38321 35113 33234 31005 31741 29633 29279 30464 33729 34257 32060 31275 31962 32744 32456 31013
10850 31013 26778 26305 26804 27181 29225 29186 28464 29104 29180 29021 29433 29423 25175 23764 21932 22779 23889 24971
10832 24971 26665 26856 27860 29324 30466 31986 30711 33370 31723 32990 32693 30541 33041 35927 35314
10817C5314k08j052P68J406n73k58J82J993k754k004J05N74n90J80M325L74O6
10800C7848K75j606R92J952Q04k51k581r47j097k432J460K205r36k390k264n12
10784C0520j460K254K242K275k656l4p47j413J175K835J527N55m116n307n220
10769B2430o154o648m434l001Q473J1010K862j166L353L845M190O536M271K196
10755D7763j309p63J361K921J866O52n64L3J423J131M16K538L837M883J941L94
10739F8523l56k596Q84M312M028j46k512o12k304N03K278L189P63M732L713O936
10723I1335L820K157L991Q469R092Q745J5515J3865J8854K2429L0110M4346Q0570
10710C53298J39295K30143L22869L22482J74773k5947j10949j9016J08213J00235
$$ plain form
10817 35314 35106 34054 34822 36228 35655 35397 35579 37572 34818 32814 32919 33493 32903 33083 37408 37782 37848
10800 37848 38123 36517 37509 39461 40265 40014 37433 36486 35389 32957 34417 36622 35686 33296 31032 30520
10784 30520 29060 31314 33556 35831 33175 33141 32394 30981 32156 34991 36518 37073 32957 27650 22430
10769 22430 16276 9628 5194 2193 10666 21676 24538 23372 26725 30570 34760 41296 45567 47763
10755 47763 46454 45691 47052 49973 51839 52491 51927 51960 53383 54514 54930 57468 61305 66188 68129 68523
10739 68523 68167 65571 66455 70767 74795 74649 72137 71525 69221 69724 72002 75191 75954 80686 84399 91335
10723 91335 95155 97312 101303 109772 118864 127609 143124 156989 175843 198272 228382 272728 353298
10710 353298 492593 722736 1045605 1368087 1542860 1516913 1405964 1386948 1495161 1595396
10700A595396o7831k59778l31442k76623j89883j21125p7166n1972l6804k7634
10690A55138k0435j6588r885l944q231r119n984n31m46n37n62K533j911m599m379
10675G0520J94l09k395j448l784p089L58J117J279O11j598O49L861j41K120N703
10659F9648j412j941j23m295k18l781l561J92J760K637n27k820k639j706r65J22
10643E0371R64Q26o12M382N003K659K404q73J854J204j1j976k697k257m41J697
10627F2497k68k413k491j746l569k795k09j54o30l77l826j801k789m77o9n743
10611C3140m927k800r84Q960J2155O709M184J83K034N615N887K804K563M395j243
10596G8675m347q620n681o1J853j281P37j338l011n18j602k099M356J606r5j301
$$ plain form
10700 1595396 1527565 1267787 936345 659722 469839 348714 271548 219576 182772 155138
10690 155138 134703 118115 108230 104286 96055 86936 80952 80421 79975 79438 78876 81409 79498 74899 70520
10675 70520 70714 70405 68010 66562 62778 55689 56047 57164 58443 59054 57456 58105 61966 61825 63945 69648
10659 69648 68236 66295 66172 61877 61659 57878 54317 54509 56269 58906 58379 55559 52920 51214 50249 50371
10643 50371 51335 52161 51549 55931 60934 63593 65997 65124 66978 68182 68171 66195 63498 61241 60800 62497
10627 62497 62229 59816 57325 55579 52010 49215 49006 48852 48222 47845 44019 42218 39429 38952 38883 33140
10611 33140 28213 25413 24429 33389 45544 52253 56437 56620 58654 64269 70156 72960 75523 79918 78675
10596 78675 74328 65708 60027 59966 61819 60538 61275 59937 56926 56408 54806 52707 57063 58669 58574 57273
10580E7273k929Q27M076O549N695L843J599j639Q96J262K361K771j699k894n04
10565G7487P7l794k865k72L484O073R613N834J067O614J4201J1619P347N677j308
10550A40854k362m203j815l625m268k740k721l268q11k184L057O912N624J797
10536A30247J97J1222J8608J7972J4110L977J804Q961M968P650K839j169m498
10523B16888j221o774q003o698j467j457k585k138l265k750m082j0018j1195q923
10509A46312n730k288o129p796k437J934M130J029K782P83L145J0585P004J537
10495A54861j2000k6029n0045r6007j52271j75204j28357l8745J4187o693o7641
10484e83944q6404m1455L7813J00138J17039J01847Q0788N3096L0720J9935J6832
$$ plain form
10580 57273 54344 55171 59247 65796 71491 75334 76933 75294 76190 77452 79813 82584 80885 77991 77487
10565 77487 77564 73770 70905 70633 74117 80190 89803 95637 96704 103318 117519 129138 136485 142162 140854
10550 140854 138492 134289 132474 128849 124581 121841 119120 115852 115041 112857 115914 122826 128450 130247
10536 130247 130444 141666 160274 178246 192356 196333 198137 207098 212066 219716 222555 221386 216888
10523 216888 215667 208893 200890 194192 192725 191268 188683 186545 183280 180530 176448 166430 155235 146312
10509 146312 140582 138294 132165 124369 121932 123866 127996 129025 131807 132590 135735 146320 153324 154861
10495 154861 142861 116832 66787 -29220 -181491 -356695 -485052 -523797 -509610 -516303 -583944
10484 -583944 -670348 -711803 -673990 -573852 -456813 -354966 -274178 -221082 -190362 -170427 -153595
10473a53595J6327J7231J2928O106K601J27Q21l049k193l649m555l680r641j6651
10459a40872k1958k6321k5449J72M7608P7178P2278M1848J0920K0227N8541Q7201
10447B01373Q3574N1344J7352J75n989q861q848j0241j1438j6874j6550r476j2216
10434B53325k2141k2183j0166o619j1788j9251j2501O631L4987M5548M3534L7267
10422C16643K0174k911q754K49J9692K8071n0l9479n5420k6197J2531L1365K0130
10409C16044M831k063M437K1496K3993J8547J0025J044n308r483q472o843N242
10396C73490J5057J0405M638m533q707m96M406n07j1839r805k175L731N137R779
10382C88581K1019L7964N1178M5268J9433M849P243K3653L2801J6650j0755j9285
$$ plain form
10473 -153595 -137268 -120037 -107109 -101003 -98402 -98275 -97454 -100503 -102696 -106345 -110900 -114580 -124221 -140872
10459 -140872 -162830 -189151 -214600 -214428 -166820 -89642 -17364 24484 35404 55631 114172 201373
10447 201373 284947 336291 353643 353818 347829 338968 330120 319879 308441 291567 275017 265541 253325
10434 253325 231184 209001 198835 192216 180428 161177 148676 155307 190294 235842 279376 316643
10422 316643 336817 333906 325152 325401 345093 373164 373114 333635 278215 252018 264549 295914 316044
10409 316044 320875 318812 323249 344745 368738 387285 397310 398354 393046 383563 375091 368248 373490
10396 373490 388547 398952 403590 399057 390350 389854 394260 393753 381914 372109 369934 373665 378802 388581
10382 388581 409600 447564 498742 544010 563443 568292 575535 599188 631989 648639 637884 618599
10370F18599j2408l607O54M340J318k657L13L678P21P585J7664K7845K9381K0372
10356G13798J0909R763J3719K0968L2658M2380M8125M1386K7810K2607L1220M8838
10344A064181O0999O9479O2337O2739O4704O1853N6866O4114Q7866J06689J25655
10333A887482J31413J21216J08509J11481J35799J86224K30808K59749K77857
10324C450538L19578M09623N45870O82093P23323O30594N28974N84996Q13078
10315H688667J055681J176237J231000J390888J743754K184358K570107K926219
10307B2966911L505965M732902P062665J1100952J8061477L0057842M6920900
10300A44409614N8177736M7546719J6134508j4140661k0047689L51157K0153029
$$ plain form
10370 618599 606191 602584 603238 607578 608896 606239 606552 610230 610951 618536 636200 664045 693426 713798
10356 713798 724707 734470 748189 769157 801815 844195 892320 933706 961516 984123 1015343 1064181
10344 1064181 1125180 1194659 1256996 1319735 1384439 1446292 1503158 1567272 1655138 1761827 1887482
10333 1887482 2018895 2140111 2248620 2360101 2495900 2682124 2912932 3172681 3450538
10324 3450538 3770116 4179739 4725609 5407702 6131025 6761619 7290593 7875589 8688667
10315 8688667 9744348 10920585 12151585 13542473 15286227 17470585 20040692 22966911
10307 22966911 26472876 31205778 38268443 49369395 67430872 97488714 144409614
10300 144409614 202587350 250134069 266268577 252127916 232080227 232431384 252584413
10293B52584413J3591293j5383817m3804997n3167001m4790166l1453327k0879938
10286E6696460j3869689r418990o596774m852700l791379l052925k421069j850402
10278A0842532j344777r21870o71233o26926o59627n94391l98808k17354k28631
10269E178915m18619n93204o07918m98394l54074k43171j91437j67058j52302
10260A952738j47604j32890j06492p7565o1684n7733o6445p0992o7629o2466n5966
10249A045272m8773l8733k5748k1399k9060l7708m9562m4122k7251j4627q707
10238F99582j5115k6896l1111l2116k4646j7456q128r370j9897k3943k4584k6701
10226D39619k6772k6454k4949j9602j3123j1351q969p101r522r410n730j441J506
$$ plain form
10293 252584413 266175706 250791889 206986892 153819891 109029725 77576398 56696460
10286 56696460 42826771 33407781 26811007 21958307 18166928 15114003 12692934 10842532
10278 10842532 9497755 8575885 7904652 7277726 6618099 6023708 5624900 5407546 5178915
10269 5178915 4760296 4167092 3559174 3060780 2706706 2463535 2272098 2105040 1952738
10260 1952738 1805134 1672244 1565752 1488187 1426503 1368770 1302325 1231333 1163704 1101238 1045272
10249 1045272 996499 957766 932018 910619 881559 843851 794289 750167 722916 708289 699582
10238 699582 684467 657571 626460 594344 569698 552242 544114 534744 514847 490904 466320 439619
10226 439619 412847 386393 361444 341842 328719 317368 308399 301298 291776 282366 276636 275195 276701
10213B76701J894P975J2354O762m800q727r373o147l360r40q640j9733j6408j0170
10199B17388m545l575l139m822j53k099m547r943j3094j4152j4163q115q235j441
10185A25365R603K0813K1468J6682J3959J5137K2872K7840K036l0045m3193l4032
10173A68505k5268j5647J71k85r337j9205j5266N636L3870M2520K6449J940j0984
10160A83099j3347j6633j6077k4160k8856k2916k0734k2730k5772k7867k3212
10149e9205j5536j9671j6470o028J2090M6777Q0301Q3780N8844J9922J3568M5446
10137B43818O9603P1148M1571J963k2458k4910k1670j7853j2946j1376p512l599
10125C05779j991k416n066n411n270L175J0675J1114J1529J2873J8525K6341M5831
$$ plain form
10213 276701 278595 286570 298924 305686 300886 292159 282786 276639 273279 272339 263699 243966 227558 217388
10199 217388 212843 209268 206129 201307 201154 199055 194508 184565 171471 157319 143156 135041 126806 125365
10185 125365 134968 155781 177249 193931 207890 223027 245899 273739 275775 245730 202537 168505
10173 168505 143237 127590 127761 127476 118139 98934 83668 89304 123174 165694 192143 194083 183099
10160 183099 169752 153119 137042 112882 84026 61110 40376 17646 -8126 -35993 -59205
10149 -59205 -74741 -94412 -110882 -116910 -104820 -58043 22258 106038 164882 184804 198372 243818
10137 243818 313421 384569 426140 428103 405645 380735 359065 341212 328266 316890 309378 305779
10125 305779 303788 301372 296306 290895 285625 288800 299475 310589 322118 334991 353516 379857 425688
10112D25688P2857J05914J27270J15831N1014m2706r3331p1600o270J3113m3880
10101F53900j27006j70959j47340r6636n6737l8645k0121o883K003N337N602Q33
10089C348K680L561M620M443K342P44l910k902j119l110m423n936k502j311J182
10074b293K488K689M97J603k63k682j10L178P77l832m275O84P359K537j619K409
10058I147Q232P150N761N391M190J872r9j732m690n797n048J621J742q259p592
10043A1889o567n135l652o15l945k626K891L478J281L635M808L638L663J327J453
10028A5523j117J008j343l69k121l658j730j295k030J013M482K703J851K86L19
10013A3522K852J248j671L862N14k196R54R07J575k631l836j651J721p77p04j788
$$ plain form
10112 425688 498545 604459 731729 847560 898574 855868 762537 690937 684667 697780 653900
10101 653900 526894 355935 208595 111959 55222 16577 -3544 -10427 -8424 -3087 2515 3348
10089 3348 6028 9589 14209 18652 20994 21738 17828 14926 13807 10697 6274 338 -2164 -3475 -2293
10074 -2293 195 2884 3381 4984 4721 2039 1929 5107 5884 2052 -2223 -1539 5820 8357 6738 9147
10058 9147 17379 24529 30290 35681 39871 41743 41644 39912 35222 29425 24377 25998 27740 19481 11889
10043 11889 5322 187 -3465 -4080 -8025 -10651 -7760 -4282 -3001 634 5442 9080 12743 14070 15523
10028 15523 14406 15414 14071 13702 11581 7923 6193 4898 2868 3881 8363 11066 12917 13203 13522
10013 13522 16374 17622 15951 19813 20327 18131 19085 19992 21567 18936 15100 13449 15170 14393 13689 11901
9997A1901m671m589l838K77J129J104J907M810J0368J0750P36o851L67O814J2887
9982D3101N196m114p319o521Q38J951k8l481l235r58q73j799m245j827m965k167
9966I554j111n272l031k978k123K039L389K425K951M87o70k332l487O73J076J151
9950B741K45J368l827k94N74J575L491J81K894k970j974l09r1l747l671J289K031
9933d94J595l814m39N5K157L558L990M03r01R36j421j013N250M786j22l078m999
9916F449r59N909J291k59q08j409M957O103N965K411K684P35K871P389P439K658
9900E3426L545N756O198P752J1463J4530J9066J7189K5250L6441O6109J19082
9888C85807K02772K99927L39388K35266K7744j06687o0821P5023J23089n905k10289
$$ plain form
9997 11901 7230 2641 -1197 -920 209 1313 3220 8030 18398 29148 29884 23033 23400 30214 43101
9982 43101 48297 44183 36864 30343 31181 33132 33104 29623 26388 25430 24557 22758 18513 16686 11721 9554
9966 9554 8443 3171 140 -2838 -4961 -2922 467 2892 5843 6330 5660 3328 -159 514 1590 2741
9950 2741 2986 4354 527 233 807 2382 5873 6054 8948 5978 4004 3695 3604 -143 -3814 -2525 -494
9933 -494 1101 -2713 -3152 -3097 -940 2618 6608 7011 6110 7046 5625 4612 9862 14648 14526 11448 6449
9916 6449 5490 11399 12690 12431 11623 10214 15171 21274 27239 29650 32334 33069 35940 43329 50768 53426
9900 53426 56971 62727 68925 76677 88140 102670 121736 138925 164175 200616 266725 385807
9888 385807 588579 888506 1227894 1463160 1490904 1384217 1323396 1398419 1521508 1515603 1305314
9877A305314l22474k97065k11042j35148q8669o2102m2632k6262k2109j5791j5265
9866F6755j4141r862o024n203l117o088k083P30q33p287m065k500k142n058l283
9851d201j849m74J527N708P050Q96l089l021j196K572J426J034p20o69M2k224
9835B812k258L69J0056Q896O458K549j058k052J486L824K424j909n641m920l915
9820A7121q0M90J104n352l992q88R36K143J7k140J08K704J337L884k044n788l886
9803E674j7j058l761N52L593J606l534n315l75J676J708J77n81k503J437L249
9787B528J097J771R96p50j488K102k094k96k29M09J026J246L754J529m029m010
9771C562m60J069J470K885q76p78m62J68k155n05J033K320j27o23J070K398M82
$$ plain form
9877 1305314 982840 685775 474733 339585 250916 188814 146182 119920 97811 82020 66755
9866 66755 52614 42752 36728 31525 28408 22320 20237 20967 20134 12847 8782 6282 4140 -918 -4201
9851 -4201 -6050 -6524 -4997 711 7761 8657 5568 2547 1351 3923 5349 6383 5663 4994 5036 2812
9835 2812 554 923 10979 19875 26333 28882 27824 25772 27258 31082 33506 31597 25956 21036 17121
9820 17121 17041 17531 18635 13283 9291 8403 9339 11482 11499 9359 9467 12171 13508 17392 15348 9560 5674
9803 5674 5657 4599 838 1390 4983 6589 3055 -2260 -2635 -959 749 926 345 -2158 -721 2528
9787 2528 3625 5396 6392 5642 4154 6256 4162 3866 3637 4046 5072 6318 10072 11601 7572 3562
9771 3562 3102 4171 5641 8526 7650 6872 6410 6578 4423 3918 4951 7271 7144 6521 7591 9989 10471
9754A0471L20J086O26k001m945k558L264r60j639R16O74n17O77K459j804l861
9738B208j796j703Q06J718R40L7J274L047K131R21k232l083K945M771J609R38
9722A4531J048j721k684j415l36J990J410k551j198k65q98Q67L941j019J26L00
9706A2126R56K60J472K8j127K110J272J991K825J135K153J012r90r48J581k95
9690B5561l089q56k354m186l529P11j240k44K229J952j060K430O265J261n08L604
9674B6947K208M982Q149Q720K407o19n34k779o464j0069q457m104k064k891j422
9659A4010l69o07j988l33k247O75M848L052n07j211k719p82O42m425k216J392
9643G215Q29M97J077k095j243p42K424L242j895L050N10K959J191j616J14j254
$$ plain form
9754 10471 10791 11877 12503 10502 5557 2999 6263 5303 3664 4580 5254 4737 5414 7873 6069 2208
9738 2208 412 -1291 -485 1233 2173 2210 3484 6531 8662 9583 7351 4268 7213 11984 13593 14531
9722 14531 15579 13858 11174 9759 9423 11413 12823 10272 9074 8809 7911 8778 12719 11700 11826 12126
9706 12126 13082 13342 14814 14842 13715 15825 17097 19088 21913 23048 25201 26213 25223 24275 25856 25561
9690 25561 22472 21616 19262 15076 11547 12258 11018 10774 13003 14955 13895 16325 22590 23851 23343 26947
9674 26947 29155 34137 42286 51006 53413 52794 52260 49481 43017 32948 24491 20387 18323 15432 14010
9659 14010 13641 13034 11046 10713 8466 9141 13989 17041 16534 15323 12604 11822 12464 8039 5823 7215
9643 7215 8044 8541 9618 7523 6280 5538 7962 11204 9309 12359 12869 15828 17019 15403 15517 14263
9627A4263k46m69k59J586M049J400m599o14J812O76q85O8n68l436j634M61J057
9610A2662M005q29J791n67J81K967k85k482n42p92J850J512j266r45M15j103L687
9593B0259L787j589l505j91K327j490O24L055K408M284L676Q272J3925J1030K814
9578F9686q151j0336j2171o817k942l588L06J60N37j011n36q44j814q95n19M979
9562B6044j279k662j907L48o92m58R53K496N37o15j957K69j521P28n60k678L83
9545A7429K375l435k487j17L746M010j633q01K820J912P47L726j101m441O23J864
9529B5237K248N229O862R396J0406P986M844j036o242j0962q697r037o715n398
9515B4121l670j407L413K155l57l43N81n21L607j69m03J696j817j251K328K10
$$ plain form
9627 14263 14017 13548 13289 14875 18924 20324 15725 15111 16923 17599 16714 16782 16214 12778 11144 11605 12662
9610 12662 16667 15838 17629 17062 17243 20210 19925 17443 16901 16109 17959 19471 18205 17260 17675 16572 20259
9593 20259 24046 22457 18952 18761 21088 19598 20222 23277 25685 29969 33645 41917 55842 66872 69686
9578 69686 61535 51199 39028 32211 29269 25681 25987 26147 26684 25673 25137 24293 22479 21584 21065 26044
9562 26044 24765 22103 20196 20544 19852 19394 20347 22843 23380 22765 20808 21077 19556 20284 19724 17046 17429
9545 17429 19804 16369 13882 13765 17511 21521 19888 19087 21907 23819 24566 28292 27191 22750 23373 25237
9529 25237 27485 32714 39576 48972 59378 67364 72208 71172 64930 53968 45271 36234 29519 24121
9515 24121 20451 19044 22457 24612 24255 23912 24493 23972 27579 27410 27007 28703 26886 25635 27963 28173
9499B8173j948k557J367L292K46P3J179p3l034J456L358k258j383J421O71o98
9483B9285l843k100K472p49J938j076J277K823M383j28q12L778L774O8o290k744
9467C2056n8k628N88q43J564m39j18J583j422l322l599L67N53P2l54J878L634
9450B9512r16m227k437J621K024K808J325n87J393L982M79m75k955J36K907J50
9434C4740k472m33N521O941K685L546m756n420K0q79j805J478J0J753j680k041
9418C7208j052Q97k450J192O41N19O34k399q51L852q2r5j962n81J938J73l85j629
9400C5568J292L812N085O024K930j776k941k077r61O1k456p08j971m052P24L593
9384D2147k278j699L723k512R09O87J995K899R64j444o94o628l436K596K507J572
$$ plain form
9499 28173 26225 23668 25035 28327 28573 28646 29825 29752 26718 28174 31532 29274 27891 29312 29983 29285
9483 29285 25442 23342 25814 25065 27003 25927 27204 30027 34410 34282 33470 37248 41022 41090 34800 32056
9467 32056 31998 29370 29958 29115 30679 30240 30122 31705 30283 26961 23362 23729 24282 24354 24000 25878 29512
9450 29512 28596 24369 21932 23553 25577 28385 29710 29123 30516 34498 34977 34502 31547 31683 34590 34740
9434 34740 32268 31835 37356 44297 46982 50528 45772 40352 40372 39493 37688 39166 39176 40929 39249 37208
9418 37208 36156 37053 34603 35795 36436 36955 37589 35190 34339 38191 38109 38014 36052 35471 37409 37582 37197 35568
9400 35568 36860 40672 45757 51781 54711 52935 49994 47917 46956 47017 44561 43853 41882 37830 38554 42147
9384 42147 39869 38170 41893 39381 40290 40977 42972 45871 46835 45391 44697 38069 34633 37229 39736 41308
9368D1308L806K151M36j987k262j89J330j882M166N44J784M384j906O0o61R13
9352E1995j020J023Q37L32l19M40j954k812j69K447J618K418l996l585j565q47
9336D4843J912M18K65l06k093K264K067R33k107l39J262j606P59J796J389K197
9320E3654J60j698J867j486K73J154J216k288K84q7O25J328j957J811N422j488
9304E8790j460Q37L218j665j107O54N19L302J382Q43M187M100O65J555L611Q937
9288H8368J1508J2646R064L140p205j1509q604n907q700n016r83m630p80j396
9274F9996J060p09j69L791L523N122M620L015K802l308k734N73k009o33J107l125
9258H2922J426l080J596l38k91k447k014j56L027l15r0m550K544K946j398k593
$$ plain form
9368 41308 45114 47265 47701 45714 43452 43263 44593 42711 46877 47421 49205 53589 51683 51743 51082 51995
9352 51995 50975 51998 52835 53167 52848 53288 51334 48522 48353 50800 52418 54836 50840 47255 45690 44843
9336 44843 46755 47173 47438 47132 45039 47303 49370 50303 48196 47857 49119 47513 48272 50068 51457 53654
9320 53654 53814 52116 53983 52497 52770 53924 55140 52852 53136 53049 53674 55002 53045 54856 60278 58790
9304 58790 57330 58167 61385 59720 58613 59267 59786 63088 64470 65313 69500 73600 74265 75820 79431 88368
9288 88368 99876 112522 121586 124726 117521 106012 97408 91501 82801 77785 76802 72172 71392 69996
9274 69996 71056 70347 70178 73969 77492 82614 87234 90249 93051 89743 87009 87582 85573 84940 86047 82922
9258 82922 84348 81268 82864 82526 82235 79788 77774 77618 80645 80330 80240 75690 78234 81180 79782 77189
9242G7189K091J357k022K29K312Q029K149L092M276J970j863m650k644j166m05
9227H9944k453k231k993j088P08J993K010j816K043j303J381L073J18P29L096
9212I3211j332p45J748l01P67j14P75j352K126J162m77q7r36j200K946K472L649
9195A02312Q25l778k717j399J381J915K631K345K197J057J193j052J9j455J440
9180A06914n49l944q05O54R83m4j70J443J70J312K44K012J334L241R47l012r27
9163A09803K002j173K69K360J045K393J70K019R62J303J129j108K473K128r2J508
9147A27191N32k980L774L908J905K782q34l390q5O33n03O51r6K508L478N207J788
9130A46469r32K78K621K797K292L396n64J243J603K001N79K347j769J13K146M424
$$ plain form
9242 77189 79280 80637 78615 78844 81156 89185 91334 94426 98702 100672 98809 94159 91515 90349 89944
9227 89944 87491 85260 82267 81179 81887 83880 85890 84074 86117 84814 86195 89268 89386 90115 93211
9212 93211 91879 91134 92882 92581 93348 93234 94009 92657 94783 95945 95468 95381 94445 93245 96191 98663 102312
9195 102312 103137 99359 96642 95243 96624 98539 101170 103515 105712 106769 107962 106910 106929 105474 106914
9180 106914 106365 102421 101616 102270 103253 103209 103039 104482 104652 105964 106208 108220 109554 112795 113742 110730 109803
9163 109803 111805 110632 110901 113261 114306 116699 116869 118888 119850 121153 122282 121174 123647 125775 125683 127191
9147 127191 127723 124743 128517 132425 134330 137112 136278 132888 132803 133436 132933 133584 133488 135996 139474 144681 146469
9130 146469 145537 145815 148436 151233 153525 156921 156357 157600 159203 161204 161783 164130 162361 162474 164620 169044
9114A69044o1K090K62K568L963J371J611K146K118M409K234J268K236M847K171
9099B02277k76K829M372j38j480p94J326k295L312M256M88L673M144L219K250
9084B27163K51J725K738Q615N547N15l233N45J68J271N90n96J85K666L939J007
9068B53096R37K258J946l865m084m111k838l59P5j402k005J325j58l952l276m022
9052B29565J834j655n244r178o039m111n348p805q300j1037j1003j0207p937r454
9038A34081j1311j2111q377l118J184L826M058J928O058P475N284N777R971P853
9024A52578Q353P782R985P676R838J0264P896J0683P424O471P576P310O859Q985
9010B69680P801P186P075Q795J2502J1416J4326J5535J3179J3905J4603J3127
$$ plain form
9114 169044 168983 171073 171335 173903 177866 179237 180848 182994 185112 189521 191755 193023 195259 200106 202277
9099 202277 202001 204830 209202 209064 207584 206790 208116 205821 209133 213389 213877 217550 221694 224913 227163
9084 227163 227414 229139 231877 240492 246039 246554 243321 243866 244034 245305 245895 245299 245484 248150 252089 253096
9068 253096 254033 256291 258237 254372 250288 246177 243339 242980 243055 241653 239648 240973 240815 236863 233587 229565
9052 229565 231399 229744 224500 215322 209283 205172 199824 192019 183719 172682 161679 151472 143535 134081
9038 134081 122770 110659 102282 99164 100348 104174 108232 110160 116218 123693 128977 134754 144725 152578
9024 152578 160931 168713 178698 186374 196212 206476 214372 225055 232479 238950 246526 253836 260695 269680
9010 269680 277481 284667 291742 300537 313039 324455 338781 354316 367495 381400 396003 409130
8998D09130J3421J8309J2705J2993J3267J0692J1369O406P951R859J2521J0495
8986E49118L974N999P974M094P531O432Q389J3143J1248P972R320J2242R441J2575
8972F69452J4091J5113J1985J0785J0061J0645J1204R890R829J2663J2304J5381
8960H13403J5667J4413J5461J3175J2495J7439J6219J3755J5791J4960J5456J4472
8948I92706R198J3327J6695K0773K3221J7241J6688K3572K3872K4770K4028K5214
8936A231305K5274K9476K6027K7411K6519L0324L6159L6470L4445L3485L5960
8925A572855L5589M0474M3794M1019M3299M4371M6997M9414N1441N3714N5348
8914B078315N6548O1747O2559O3533O8135P2431P7176P6304Q1908Q7317R0313
$$ plain form
8998 409130 422551 440860 453565 466558 479825 490517 501886 508292 516243 526102 538623 549118
8986 549118 553092 559091 567065 571159 578690 585122 593511 606654 617902 625874 635194 647436 656877 669452
8972 669452 683543 698656 710641 721426 731487 742132 753336 763226 773055 785718 798022 813403
8960 813403 829070 843483 858944 872119 884614 902053 918272 932027 947818 962778 978234 992706
8948 992706 1001904 1015231 1031926 1052699 1075920 1093161 1109849 1133421 1157293 1182063 1206091 1231305
8936 1231305 1256579 1286055 1312082 1339493 1366012 1396336 1432495 1468965 1503410 1536895 1572855
8925 1572855 1608444 1648918 1692712 1733731 1777030 1821401 1868398 1917812 1969253 2022967 2078315
8914 2078315 2134863 2196610 2259169 2322702 2390837 2463268 2540444 2616748 2698656 2785973 2876286
8903B876286R3522R6115J01664J10438J13720J20893J32279J39047J51295J56694
8893D091953J57356J70856J82662J95683K07144K17692K34538K47543K64345K85126
8883F254898L04941L25963L51316L78428M06194M39142M69665N08577N54240N96890
8873A0590254O53735P10867P73405Q46362R25208J007985J101613J212190J335455
8864A9157074J464582J609258J764708J935461K122383K321121K529483K748404
8856C5652474K965857L174137L354391L497668L571375L551950L406959L115866
8848F2290677K665722K052603J306104M69090m04582j247403k005997k634994
8840F2491220l102334l414301l580228l617481l555871l424407l247117l038076
$$ plain form
8903 2876286 2969808 3065923 3167587 3278025 3391745 3512638 3644917 3783964 3935259 4091953
8893 4091953 4249309 4420165 4602827 4798510 5005654 5223346 5457884 5705427 5969772 6254898
8883 6254898 6559839 6885802 7237118 7615546 8021740 8460882 8930547 9439124 9993364 10590254
8873 10590254 11243989 11954856 12728261 13574623 14499831 15507816 16609429 17821619 19157074
8864 19157074 20621656 22230914 23995622 25931083 28053466 30374587 32904070 35652474
8856 35652474 38618331 41792468 45146859 48644527 52215902 55767852 59174811 62290677
8848 62290677 64956399 67009002 68315106 68784196 68379614 67132211 65126214 62491220
8840 62491220 59388886 55974585 52394357 48776876 45221005 41796598 38549481 35511405
8832C5511405k813771k590139k367951k161673j967065j789060j623645j469012
8824A8729089j333283j211969j102656j004144r13949q33663p64068o97542o38241
8815A0229574n87906n41558n02378m65571m26391l94652l64455l36512l15881
8806F294270k94854k75068k57925k39112k25448k16112k01218j86686j71781j63089
8796D062977j57068j48310j40935j32604j24673j14625j10926j09922j01427r7617
8786B824870r2352q7703q1855p8957p5180p7113p4540o8706o7470o1634n5668
8775B003692n6279n5646n6878n0359m7110m5206m0809m3958m0330l8881l6211
8764A492025l5708l7773l3007l1464k8908k7646k8722k4929k4287k4302j9660
$$ plain form
8832 35511405 32697634 30107495 27739544 25577871 23610806 21821746 20198101 18729089
8824 18729089 17395806 16183837 15081181 14077037 13163088 12329425 11565357 10867815 10229574
8815 10229574 9641668 9100110 8597732 8132161 7705770 7311118 6946663 6610151 6294270
8806 6294270 5999416 5724348 5466423 5227311 5001863 4785751 4584533 4397847 4226066 4062977
8796 4062977 3905909 3757599 3616664 3484060 3359387 3244762 3133836 3023914 2922487 2824870
8786 2824870 2732518 2644815 2562960 2484003 2408823 2331710 2257170 2188464 2120994 2059360 2003692
8775 2003692 1947413 1891767 1834889 1784530 1737420 1692214 1651405 1607447 1567117 1528236 1492025
8764 1492025 1456317 1418544 1385537 1354073 1325165 1297519 1268797 1243868 1219581 1195279 1175619
8753A175619j7830j9777k4148k5768k7824k5450k5278k3233j9426j9103j9214
8742I28568j7349j9547j9458j7639j1676j2943j2153j2650j6365j5935j0607j1394
8730G50852j4848j2655j0968r832q522j1610j2895j3325j0140j1044j2170j2327
8718F10516q106j3079r714o061p861q822m791q866j1878j1678j0461p830j0448
8705D90921r509p691o997o210o278k702j323l295l541k036n401J383L156K814
8691D43291P790k22K009P057K272q10J675J523J590J301o23l211M04L076K248
8676D69370J35k950l195K074r91j076J626M767j81m241n208M49M009N248J937
8661D71773J075L857J903m415n313k822m262r650j4805j6154j8972j3213j2543
$$ plain form
8753 1175619 1157789 1138012 1113864 1088096 1060272 1034822 1009544 986311 966885 947782 928568
8742 928568 911219 891672 872214 854575 842899 829956 817803 805153 788788 772853 762246 750852
8730 750852 736004 723349 712381 702549 694027 682417 669522 656197 646057 635013 622843 610516
8718 610516 602410 589331 579617 573556 565695 556873 552082 543216 531338 519660 509199 501369 490921
8705 490921 481412 473721 466724 460514 454236 451534 450211 446916 443375 441339 435938 437321 440477 443291
8691 443291 451081 450859 452868 459925 462197 461387 463062 464585 466175 467476 466853 463642 464046 467122 469370
8676 469370 469505 466555 463360 465434 464443 463367 464993 469760 469579 465338 460130 460579 464588 469836 471773
8661 471773 472848 476705 478608 474193 468880 466058 461796 452146 437341 421187 402215 389002 376459
8648C76459j7237j5166j0269r695j4104j4979j2360r014q214j0566n770m793n671
8635B38621l407m313o000o551n117n262k787p60l830m926l025m523J837l02k088
8620A87567n843o91q92n519l187K558j488l675k908l326L46n66j302l365k59j164
8604A56286o30K02k270m862j037o71J275j925l85k481m452m216n412n010j447
8589A22965M28M108q12j220r25k728o58l174l147l08k129o56o55L04J132Q91J103
8572A14519J143n47k252l794j336p7j624q09P22J95Q99j632n88R27q19j058j062
8555A02807l08l097k043q10j342K141pL90k759l24n35j887k793j380R60o30j934
8538H6449j05l12r60P31M238L48J510j287k261j289p27o0L77k306l955J612K408
$$ plain form
8648 376459 359222 344056 333787 324092 309988 295009 282649 273635 265421 254855 249085 244292 238621
8635 238621 235214 230901 224901 218350 213233 207971 205184 204424 200594 195668 192643 188120 189957 189655 187567
8620 187567 181724 181033 180141 174622 171435 173993 172505 168830 165922 162596 162942 162376 161074 157709 157450 156286
8604 156286 155656 155858 153588 148726 147689 147018 148293 146368 145983 143502 139050 134834 129422 124412 122965
8589 122965 123393 127501 126689 125469 124544 121816 121158 117984 114837 114529 112400 111744 111089 111393 112525 113416 114519
8572 114519 115662 115115 112863 109069 107733 107656 106032 105223 105945 106140 107039 105407 104819 105746 104927 103869 102807
8555 102807 102499 99402 97359 96549 95207 97348 97341 97731 94972 94648 94113 92226 89433 88053 89013 88383 86449
8538 86449 86344 86032 85072 85803 90041 90389 91899 90612 88351 87062 86335 86275 86652 84346 80391 82003 84411
8521H4411k712m022l533j071L388K263J756j325m13L46l208l001J933j071l987
8506F9754q42K928K977n20j125K669L754r28l765l351l333r0L952J517J509j855
8490G3251k67m73o11o15L204K561p19L59o26J509J482m50J524j273l960l212j685
8473F9999n051l333J572J100J362k807k52M72J660M826Q713N574J913n928r856
8458F9964j1983o182l11K578j83j241n469L00K797M83L684K740q02l332j934j4
8442E1095o65K65k995k063P12J936j650j631m03O3l00j591k025j022K136J011
8426D2873l94K336j822n490J180N558R777J5820J9429J3290m805j9511j6209p922
8412E4110m094k718K059J527o90j457k004l634p71l199l072j98l259J798P01P29
$$ plain form
8521 84411 81699 77677 74144 73073 76461 78724 80480 79155 78742 79088 75880 72879 74812 73741 69754
8506 69754 68912 71840 74817 74297 73172 75841 79595 78667 74902 71551 68218 68128 72080 73597 75106 73251
8490 73251 72984 72511 71900 71285 74489 77050 76331 76690 76064 77573 79055 78605 80129 78856 74896 71684 69999
8473 69999 64948 61615 63187 64287 65649 62842 62590 63062 64722 69548 78261 83835 85748 79820 69964
8458 69964 57981 51799 51488 54066 53883 52642 47173 47473 50270 50753 54437 57177 56375 53043 51109 51095
8442 51095 50430 50695 47700 45637 46349 48285 46635 45004 44601 44664 44364 42773 40748 39726 41862 42873
8426 42873 42479 44815 42993 37503 38683 44241 54018 69838 89267 102557 97752 78241 62032 54110
8412 54110 50016 47298 49357 50884 50194 48737 46733 43099 42328 39129 36057 35859 32600 34398 35099 35828
8396C5828J73j689k781j092J07M445P31K01p49L16q66j742N94Q93J446K155L706
8379D1676K872L80J955L828J0406J4642J0938K007p972r679j1372p672j093l363
8365D7553J212P894J77o777o116k576k387k420P47K663J429k494j83l55r33J780
8349C9214k297l110l581n35L90J149m85j99M383K899K115J177L85L432O886N621
8333E7444n39n791p137q122n712N53Q50n207j421J058L807J576j827j629m15L708
8317C1196k28L398K418l5k54m268j867k052l853l299K15o3K225K118k575k667
8301B0409J220P29j986q06J663K506j541m903j292l236q61K028L100P76K086J193
8285B1085k689R73R39q13o30k659m037R60K53J870m245R24L120L302J906r99j122
$$ plain form
8396 35828 36001 34312 31531 30439 30546 34991 35722 35923 35174 35490 34624 32882 33476 34369 35815 37970 41676
8379 41676 44548 44928 46883 50711 61117 75759 86697 88704 80732 71053 59681 52009 50916 47553
8365 47553 48765 56659 56836 50059 43943 41367 38980 36560 37307 39970 41399 38905 38722 38367 37434 39214
8349 39214 36917 33807 30226 29691 30081 31230 30745 30546 34929 37828 39943 41120 41505 44937 51823 57444
8333 57444 56905 51114 43977 35855 30143 30696 31546 26339 24918 25976 29783 31359 29532 27903 27488 31196
8317 31196 30968 34366 36784 36749 36495 32227 30360 28308 24455 21156 21371 21308 23533 25651 23076 20409
8301 20409 21629 22358 20372 19566 21229 23735 22194 17291 15999 12763 11902 13930 17030 17806 19892 21085
8285 21085 18396 19369 20308 19495 18865 16206 12169 13129 13382 15252 11007 11931 15051 18353 20259 19260 18138
8268A8138L450P35m007k459K360j0j114J791j761n515L175M388K983M68k479N28
8252B0671k794o157k356N72p57j688J457J255l62l06j351r84K935L384k026l359
8236H134M532K894J86j926j459l595J526L116J167k53K689j955n5N96j598l65
8220A3634K220J851k298k195m384Q59L049j789j663J145o51m343l18K404J832
8205I353M29J405k85p1K85k074l170j512R54J790P51K149J52M66J262J915K3m569
8187I253O58o51j510m171K126J745n75K060J61J803j092l471l248L239K753j580
8171G500j169O50M180K084l472n794l17J931m29n1J630j141M61L615l92J529k856
8154G959r66M403J528k305%J22j376o746j859k41j102J202M73J312J425j783m131
$$ plain form
8268 18138 21588 22323 18316 15857 18217 18207 17093 18884 17123 11608 14783 19171 22154 22622 20143 20671
8252 20671 17877 11720 9364 9936 9179 7491 8948 10203 9841 9535 8184 7200 10135 13519 11493 8134
8236 8134 12666 15560 15746 13820 12361 8766 10292 13408 14575 14322 17011 15056 15001 15597 13999 13634
8220 13634 15854 17705 15407 13212 8828 9687 12736 10947 9284 10429 9778 5435 5117 7521 9353
8205 9353 9782 11187 10902 10831 11116 9042 5872 4360 5314 7104 7855 10004 10156 10622 11884 13799 13822 9253
8187 9253 9911 9260 7750 3579 5705 7450 6875 8935 9096 10899 9807 6336 3088 6327 9080 7500
8171 7500 6331 6981 11161 13245 9773 3979 3662 5593 5164 5113 6743 5602 6063 9678 9286 10815 7959
8154 7959 6993 11396 12924 10619 10619 10741 9365 2619 760 519 -583 619 1092 2404 3829 2046 -2085
8137b085R77N48J160K623J305J225J92l514O55M694n55L04j047l31j034k512o78
8120A927N41k504k78k8J458r02Q76K610L188p15K924j025l615k999J810J597P44
8103E609K796J532j246k054K31j973j163L53K164k559m2L592k378k524j776j575
8087a013k0K513L133K340j3n54l065K544k378k958j178M19N60j819J288J299M071
8070E169J208K246K043K25n36m31l176k617J792K100j788p74q04j323L68J060
8054D762l19N02m34K663J065R52j145m789n883K24L392j958l757K018M150k39
8038A204p40L10J406J133j32j06m99J001J868J710j120k865j576L072L984J621
8022A0271j251j720j197r4J103l847j042o35l62K002J249j299l710j892L099J554
$$ plain form
8137 -2085 -1108 -560 600 3223 4528 5753 5945 2431 3086 7780 7225 7529 6482 6151 5117 2605 1927
8120 1927 2468 -36 -314 -342 1116 214 1090 3700 6888 6173 9097 8072 4457 1458 3268 4865 5609
8103 5609 8405 9937 8691 6637 6868 4895 3732 4085 6249 3690 3648 7240 4862 2338 562 -1013
8087 -1013 -1033 1480 4613 6953 6940 6386 3321 5865 3487 529 -649 -230 330 -1489 -201 1098 5169
8070 5169 6377 8623 10666 10891 10355 9924 6748 4131 5923 8023 6235 5461 4657 3334 3702 4762
8054 4762 4443 4945 4511 7174 8239 9191 8046 3257 -2626 -2402 990 -968 -4725 -2707 1443 1204
8038 1204 464 774 2180 3313 3181 3075 2576 3577 5445 7155 6035 3170 1594 4666 8650 10271
8022 10271 9020 7300 6103 6009 7112 3265 2223 1588 1226 3228 4477 3178 -532 -2424 675 2229
8006B229l88O32k540J03J00k58k801R52K028l37K328J654J237l77k264k432M24
7989B90J172N12n77K265k95j333J030l0J0m22o03j801J799L527L83p56k131l727
7971f87o866n692l056M234R222O292P474p81m209l348p059L605J1951J6323J2328
7956C9731n464j7651j8753q750M327N917M544r35n373p536m180j239J922M974
7942h466M934J582j001Q08N08k461J138n23K475M650J369k504r90R68o30k312
7926d55K032K681j226j141l007J032K936J449L853j160k876j874o29K236J064
7911D915k475P01L836J284j379N8q57k029j45J201k076K628K619K588M64l035
7895H298l88j420K003J98J485j277J727L430o36l842J12j07l83L17J125k37J683
$$ plain form
8006 2229 1841 2473 -67 36 136 -122 -2923 -1971 57 -280 2048 3702 4939 4562 2298 -134 290
7989 290 1462 1974 1397 3662 3367 2034 3064 3034 3044 2622 2019 218 2017 5544 5927 5171 3040 -687
7971 -687 -7553 -13245 -16301 -12067 -2845 3447 10921 10140 5931 2583 -4476 -871 11080 27403 39731
7956 39731 34267 16616 -2137 -10887 -6560 -643 3901 2966 -2407 -9943 -14123 -15362 -13440 -8466
7942 -8466 -3532 -1950 -2951 -2143 -1635 -4096 -2958 -3481 -1006 3644 5013 2509 1519 2487 1857 -455
7926 -455 1577 4258 3032 1891 -1116 -84 2852 4301 8154 6994 4118 2244 1615 3851 4915
7911 4915 2440 3141 6977 8261 6882 6940 6083 4054 3909 5110 3034 5662 8281 10869 11333 8298
7895 8298 7910 6490 8493 8691 10176 8899 10626 14056 13420 9578 9690 9583 9200 9517 10642 10405 12088
7878A2088j856J288L144j114l293o691j43J199K726M039m831l826J415j314l279
7863d48K739M935q22k507k589j628K575N257J087k502m278J582L127P76o35J846
7847H515K450l07O12l222r90L019P56j439r55O74J924J313l837p184J50p6j850
7830d47L153K880Q47M14K946J77k011k299j430m5m47j818J787K488J233l578k23
7813C627j263o192J878L004J511j047L41J802L88j089J72K537J607l73p47r98
7797E158k884j706L65K526K285p81l0j666J990K836l489m139n81J776K370J169
7781E199J0J369O17l427l518k240k098l73p28K674O31Q9R05J4n65j122K27j285
7763c621Q53J989K851m443k51J825K29m31j807K27J17k54o64l0k371j255K558
$$ plain form
7878 12088 10232 11520 14664 13550 10257 3566 3423 4622 7348 11387 6556 2730 4145 2831 -448
7863 -448 2291 7226 6404 3897 1308 -320 2255 7512 8599 6097 1819 3401 6528 7304 6669 8515
7847 8515 10965 10658 11270 8048 7058 10077 10833 9394 8439 9113 11037 12350 8513 1329 1479 1403 -447
7830 -447 2706 5586 6433 6847 9793 9970 7959 5660 4230 4185 3738 1920 3707 6195 7428 3850 3627
7813 3627 2364 -3828 -1950 1054 2565 1518 1859 3661 4049 2960 3132 5669 7276 6903 6156 5158
7797 5158 2274 568 933 3459 5744 4963 4933 3267 5257 8093 4604 465 -116 1660 4030 5199
7781 5199 5209 6578 7195 3768 250 -1990 -4088 -4461 -5189 -2515 -1884 -1795 -890 -876 -1441 -2563 -2336 -3621
7763 -3621 -2768 -779 2072 -2371 -2622 -797 -568 -999 -2806 -2579 -2462 -2716 -3380 -3410 -5781 -7036 -4478
7746d478Q00m26J557M876K303l605k97P62j770j13N10k974j813j103J019J475
7730c277k32L50K40p76m66j187J667L106K272n3j041O61k83j354P18Q82k419k193
7712c385q43J422N35R93k933N15p86P27K59m49J455J767j307K45j008j656K15
7695d234L55L2O89K395j243M66L42M53L81M361K09k234j248J08N61n28k360m462
7677e957j828p2K8L08K441M756M632l594k234k451p80J452L759r31m022j243J911
7660c825K02k606J366L040r99j517j419J676j86j911r52O14N20J073K36n23N56
7643d655k088l55K327N73l672L92N922L038l630m427m13k519P44p4m4K125L530
7626c226J453l037J271j69k308K734j764r15l62K99K177l371K59K032N78j684
$$ plain form
7746 -4478 -3678 -4104 -2547 2329 4632 1027 730 1492 -278 -391 119 -2855 -4668 -5771 -4752 -3277
7730 -3277 -3509 -3159 -2919 -3695 -4161 -5348 -3681 -575 1697 1644 603 1264 981 -373 345 1227 -1192 -3385
7712 -3385 -4228 -2806 -2271 -1278 -4211 -3696 -4482 -3755 -3496 -3945 -2490 -723 -2030 -1785 -2793 -4449 -4234
7695 -4234 -3879 -3847 -3158 -763 -2006 -1540 -1198 -745 -364 3997 4206 1972 724 832 1393 865 -1495 -5957
7677 -5957 -7785 -7857 -7829 -7521 -5080 -324 4308 714 -1520 -3971 -4751 -3299 460 -471 -4493 -5736 -3825
7660 -3825 -3623 -6229 -4863 -1823 -2822 -4339 -5758 -4082 -4268 -6179 -7131 -6517 -5997 -4924 -4688 -5211 -4655
7643 -4655 -6743 -7098 -4771 -4198 -7870 -7478 -1556 1482 -2148 -6575 -6988 -9507 -8763 -8837 -8881 -6756 -3226
7626 -3226 -1773 -4810 -3539 -3708 -6016 -3282 -5046 -5961 -6323 -6024 -3847 -7218 -6959 -4927 -4349 -6033
7610f033L57K700M64K07k007M75K037l920j82K960J560p02p14m46k110j063J713
7593d704K1j877l410Q6M730K677j464K083o84Q5j231K79K817k698k286r89j521
7576h086r13J652K508k462L84K676J610J889q07p05J645J945k849l138J281J360
7560b010l82l31L545M84j996J042k112k279K898K52j835K28r57J699J010J100
7544C56m95m833P47J884Q05j561m3k21k373p96L239K410m58J437j731l85j555
7527c573k392L243M186j529n226J869J101j621K57L30M79j224O5R45k424K38J489
7510c787k324j95R68P41j098k625j906L369N480P25j124k470m91l22L4j372j371
7493g768J051J067k751l253K340N255P92L605P74j080J109R8k900j501p8l314
$$ plain form
7610 -6033 -5676 -2976 -2512 -2305 -4312 -3837 -1800 -5720 -5902 -2942 -1382 -2084 -2798 -3244 -5354 -6417 -4704
7593 -4704 -4683 -6560 -9970 -9884 -5154 -2477 -3941 -1858 -2542 -2457 -3688 -3409 -592 -3290 -5576 -6565 -8086
7576 -8086 -8999 -7347 -4839 -7301 -6917 -4241 -2631 -742 -1549 -2254 -609 1336 -1513 -4651 -3370 -2010
7560 -2010 -2392 -2723 822 1306 -690 352 -1760 -4039 -1141 -889 -2724 -2496 -3453 -1754 -744 356
7544 356 -139 -4972 -4225 -2341 -1536 -3097 -3140 -3361 -5734 -6530 -3291 -881 -1339 98 -1633 -2018 -3573
7527 -3573 -5965 -2722 1464 -65 -5291 -3422 -2321 -3942 -3685 -3355 -2876 -4100 -4035 -3090 -5514 -5276 -3787
7510 -3787 -6111 -6306 -5338 -4597 -5695 -8320 -10226 -6857 -1377 -652 -1776 -4246 -4737 -5059 -5025 -6397 -7768
7493 -7768 -6717 -5650 -8401 -11654 -9314 -4059 -3267 338 1112 32 1141 1239 -1661 -3162 -3240 -6554
7477f554j180N358j466n67K920m65q68m12n95P49K517k655J735p80l21J389K716
7460A521J62n54j300Q85J69n69j632k797q06P88N45O26Q1J024k596J804k347j712
7442f708Q68M168O04r03J758K539j672k158K30o30q68p52j439J297L051j275r29
7425b819K516J898l88l19O43o13O41q45L74r24j330j835Q9Q23j2k73J779L07j397
7406a685l549J785Q40l251j484K358J760L128m26J925l510j52M88N641J59k138
7390A889k155K87J82J281j338k018N68K687j710J383Q1m067j633j348k576N08
7374g979J699K314K422J076J676j750l392l259L525K273J076J208j893j174j149
7359c327J672P18J65J914j048j605k681j758K165L00n38j639r23K9L727O93k351
$$ plain form
7477 -6554 -7734 -2376 -3842 -4409 -1489 -1954 -2822 -3234 -3829 -3080 -563 -3218 -1483 -2263 -2584 -1195 1521
7460 1521 1683 1129 -171 714 883 314 -1318 -4115 -4921 -4133 -3588 -2962 -2881 -1857 -4453 -2649 -4996 -6708
7442 -6708 -5840 -1672 -1068 -1971 -213 2326 654 -1504 -1274 -1904 -2772 -3524 -4963 -3666 -615 -1890 -2819
7425 -2819 -303 1595 1207 888 1531 918 1559 714 1088 164 -1166 -3001 -2912 -2089 -2101 -2374 -595 -288 -1685
7406 -1685 -5234 -3449 -2609 -5860 -7344 -4986 -3226 -98 -524 1401 -2109 -2261 -1773 3868 4027 1889
7390 1889 -266 21 203 1484 146 -1872 -1304 1383 -327 1056 1137 -2930 -4563 -5911 -8487 -7979
7374 -7979 -6280 -3966 -1544 -468 1208 -542 -3934 -7193 -3668 -1395 -319 889 -1004 -2178 -3327
7359 -3327 -1655 -937 -772 1142 94 -1511 -4192 -5950 -3785 -3485 -4023 -5662 -6585 -6556 -2829 -2136 -4487
7342d487j022J196j040K595M073L215j454k689j637j209j683r03j32J454K080
7327a643j409j147K646l05j239j154J83O9l2O2K248Q5k135k060L181K67q91J304
7309a970J50J468P03k122l97l922J561K933K95O64j396j625r0M520K066J41j749
7292A230k721n46n50j453k787j627M28K724O41m31K83j040M696J554l08l696K753
7275h50k086m848J322J942K737M96L61r78k061o24Q60L218j146l872l045j01N08
7258h167K233L783K180k167j521l53rJ037L02k585q5L95j147J028N908K70K209
7241C311p54l002o29n83J428p97L0j706n003l19K62M04N65K780k91k083j302N91
7223g098O85K018K489Q99j117K985J501l017k217K066q8k700p85K364J661k674
$$ plain form
7342 -4487 -5509 -4313 -5353 -2758 1315 4530 3076 387 -1250 -2459 -4142 -5045 -5177 -3723 -1643
7327 -1643 -3052 -4199 -1553 -1858 -3097 -4251 -4068 -3999 -4031 -3969 -1721 -1636 -3771 -5831 -2650 -2383 -3274 -1970
7309 -1970 -1820 -352 351 -1771 -2168 -6090 -4529 -1596 -1301 -637 -2033 -3658 -3748 772 2838 2979 1230
7292 1230 -1491 -2037 -2587 -4040 -6827 -8454 -8026 -5302 -4661 -5092 -4809 -5849 -1153 401 93 -3603 -850
7275 -850 -2936 -7784 -6462 -4520 -1783 -1287 -926 -1904 -3965 -4589 -3729 -511 -1657 -5529 -8574 -8675 -8167
7258 -8167 -5934 -2151 29 -2138 -3659 -4012 -4021 -2984 -2682 -5267 -5352 -4957 -6104 -5076 832 1102 3311
7241 3311 2557 -445 -1074 -1657 -229 -1026 -996 -2702 -7705 -8024 -7762 -7358 -6793 -4013 -4304 -6387 -7689 -7098
7223 -7098 -6413 -4395 -1906 -1007 -2124 861 2362 -655 -2872 -806 -894 -3594 -4379 -2015 -354 -3028
7207c028l689O13L909K117Q64j705o02Mj9j194j439j60q04L4N6j717J149l43L91
7188e563J787L31l03L95j729o53J205q72k74O94m09k41L419J450p00k031k662
7171f156k329L857K019K58n47k09J07j608K081Q28J879r86n82J605j401l222j242
7154e648M763J10j146o67l43j770j372J390j313p17K442P9k955J965L020j559
7138c721l36j243J13K60j550J231L47n08j165N885Q87m704l889O62R1j013N06
7121h147L612J803O63k997j723P95j5J428K97n80J252J929j551n276j332n02K17
7104a0127J794K565k73J636J399J158j668j109K845j788k949j49O27Q37J087k741
7088f856j926K544K460K04J496k365P85M06L770J347N64q71j703J8j097l124O94
$$ plain form
7207 -3028 -6717 -6104 -2195 -78 786 -919 -1521 -1517 -1536 -2730 -4169 -4329 -5133 -5099 -5043 -6760 -5611 -5954 -5563
7188 -5563 -3776 -3445 -3748 -3353 -5082 -5735 -4530 -5402 -5676 -4982 -5391 -5632 -2213 -763 -1463 -3494 -6156
7171 -6156 -8485 -4628 -2609 -2351 -2898 -3107 -3000 -4608 -2527 -1699 180 -806 -1388 217 -1184 -4406 -5648
7154 -5648 -885 -775 -1921 -2588 -2931 -4701 -6073 -4683 -5996 -6713 -4271 -4192 -7147 -5182 -2162 -3721
7138 -3721 -4057 -5300 -5187 -4927 -6477 -5246 -4899 -5407 -6572 -687 200 -4504 -8393 -7731 -7640 -8653 -8147
7121 -8147 -4535 -2732 -2069 -5066 -6789 -5994 -6009 -4581 -4284 -4864 -3612 -1683 -3234 -8510 -9842 -10344 -10127
7104 -10127 -8333 -5768 -6041 -4405 -3006 -1848 -3516 -4625 -1780 -3568 -6517 -6666 -6039 -5202 -4115 -6856
7088 -6856 -8782 -6238 -3778 -3574 -2078 -4443 -3658 -3252 518 1865 2429 1558 -145 -127 -1224 -4348 -3654
7071c654J471M38N502J286m835k852L505n0M40n46Q5o15k073j339j350j781O99
7054e669J451K149R04l97k718r89j926k001J685J810L66N4K753n79m467J608j225
7037g191k844J791k233J83K228K27Q38J809M15R82n14M059M69m20q17L04j5q23
7019a552R13l75j239o319m786r56L043K901K676J576J515j734l847J166L624M914
7003A520J278l7j621p54K96k040R6L653j449m30m391k743J217Q21n11O32K64j394
6985e593K191J837k063O65k70K244r57l400j833k174K970J894j444n71k847L98
6969h953P15M465N82j270k564j906L037k142p78K708Q26j328j5q36k13L422L805
6952d45j587j075P61L631O21o0l938O56q23j204L060R57l125l113k50J464l727
$$ plain form
7071 -3654 -2183 -1745 3757 5043 208 -2644 861 811 1251 705 790 175 -1898 -3237 -4587 -6368 -5669
7054 -5669 -4218 -2069 -1165 -1562 -4280 -5269 -7195 -9196 -7511 -5701 -5335 -5281 -2528 -3107 -7574 -5966 -7191
7037 -7191 -10035 -8244 -10477 -10294 -8066 -7839 -7001 -5192 -4777 -3795 -4309 -250 219 -201 -1018 -714 -729 -1552
7019 -1552 -639 -1014 -2253 -8572 -13358 -14314 -11271 -8370 -5694 -4118 -2603 -4337 -8184 -7018 -3394 1520
7003 1520 2798 2761 1140 386 682 -1358 -1262 2391 942 512 -3879 -6622 -5405 -4584 -5095 -4463 -4199 -5593
6985 -5593 -3402 -1565 -3628 -2963 -3233 -989 -1946 -5346 -7179 -9353 -6383 -4489 -5933 -6504 -9351 -8953
6969 -8953 -8238 -3773 -3191 -4461 -7025 -8931 -5894 -8036 -8814 -6106 -5280 -6608 -6623 -7459 -7672 -4250 -445
6952 -445 -2032 -3107 -2346 1285 1906 1846 -2092 -1436 -2259 -3463 -403 554 -2571 -5684 -5934 -4470 -8197
6935h197j44q42M922K434l463p26o75L715K167L70j859J18j560m69K157Q0l079
6918e051q32n74K430K114j859O22J307j231p53q23K865K102l343j669J592j238
6902d341j72K632O95P45k553R45k614j969j052K211L740j481l356N58J516k03
6886d699O95j112k25k451L04j069j451J817L026K410m28q29J912k705j540j160
6870g505l572k024L255M047J789o59j85j580J959L32k09K910o72j478j882K437
6854c037M196j774m298P9o90K7J221k783J266K956O34k898M064K018p36k565k395
6837d715j478L205k273K073J258j47L460k112K889J344m032k319k771n24N6p27
6821f813K67O65j168j556J30M458o04p22n28q19K900M954K039k349j001j757k903
$$ plain form
6935 -8197 -8341 -9183 -4261 -1827 -5290 -6016 -6691 -2976 -809 -439 -2298 -2180 -3740 -4209 -2052 -1972 -5051
6918 -5051 -5883 -6457 -4027 -1913 -3772 -3150 -1843 -3074 -3827 -4650 -1785 317 -3026 -4695 -3103 -4341
6902 -4341 -4513 -1881 -1186 -441 -2994 -2049 -4663 -6632 -7684 -5473 -1733 -3214 -6570 -6012 -4496 -4699
6886 -4699 -4004 -5116 -5341 -7792 -7488 -8557 -10008 -8191 -5165 -2755 -3183 -4012 -2100 -4805 -6345 -7505
6870 -7505 -11077 -13101 -9846 -5799 -4010 -4669 -4854 -6434 -4475 -4143 -4352 -1442 -2114 -3592 -5474 -3037
6854 -3037 1159 -615 -4913 -4834 -5524 -5497 -4276 -7059 -5793 -2837 -2203 -5101 -1037 981 245 -2320 -4715
6837 -4715 -6193 -2988 -5261 -3188 -1930 -2077 1383 -729 2160 3504 -528 -2847 -5618 -6142 -6086 -6813
6821 -6813 -6546 -5881 -7049 -8605 -8475 -4017 -4621 -5343 -5871 -6690 -3790 1164 3203 854 -147 -1904 -4807
6804d807J785J395K439K19j402k906Q67j044q74j092l81K398J981O55l676o09
6788e052N48j06j410p84J956J573R40q38O40p74j597K558L42j991l142j41L591
6771c687L516j086p06r21k228j56j627r51K28Q6M353n95j706M36K167K27k24J421
6753a453j51m72R79k478J07K220q13n60l882j940J850J332J686J832l142l608
6737h493j486J427L876q07j930l237J161J746L362K616J390L20K13K993j060k853
6721g62K595m254k941L154P63j794m211J057K698j086l181J280J870K814K67k061
6705c792k612L25L186j120j257j448q86K148L465j50j840k938p09P071L112L543
6689F098J407l987l069k074l005J30M02J726M24p23o21K552J062L0l37l02j775
$$ plain form
6804 -4807 -3022 -1627 812 1031 -371 -3277 -2410 -3454 -4328 -5420 -5801 -3403 -1422 -767 -4443 -5052
6788 -5052 -4504 -4610 -6020 -6804 -4848 -3275 -2335 -3173 -2533 -3307 -4904 -2346 -2004 -3995 -7137 -7278 -3687
6771 -3687 -171 -1257 -1963 -2884 -5112 -5268 -6895 -7846 -7618 -7532 -3179 -3774 -5480 -5044 -2877 -2650 -2874 -1453
6753 -1453 -1604 -2076 -1097 -3575 -3468 -1248 -2061 -2621 -6503 -8443 -6593 -5261 -3575 -1743 -4885 -8493
6737 -8493 -9979 -8552 -4676 -5483 -7413 -10650 -9489 -7743 -4381 -1765 -375 -55 158 3151 2091 -762
6721 -762 1833 -2421 -5362 -2208 -1445 -3239 -7450 -6393 -3695 -4781 -7962 -6682 -4812 -1998 -1731 -3792
6705 -3792 -6404 -6079 -2893 -4013 -5270 -6718 -7604 -5456 -1991 -2141 -3981 -6919 -7628 -557 2555 6098
6689 6098 7505 3518 449 -1625 -4630 -4500 -4098 -2372 -1948 -2671 -3292 -740 322 352 15 -287 -2062
6672b062j82n83j772j737k449Q52N742N639K19k581O27j091j03J20j14O06n01
6655F30k300K96N27q49j8r76J460K67o35L47o74k123l91N54J125k42m25K579K050
6636A202j519j365R76L093j718l801j181J562N84r30m241q6N469N818K961j354
6620E470m477p60J861K152r73j976m341j459j62j237R0m26j45L360J091L34J760
6603A62J016J558O6j187j334k173l840k396O36R66K201K821J186O86p61j03l67
6586h63l193j245r82k340K450L069k602k157J57J258k798j599K173L108l513k116
6570a1193M445N892R53R99k110k564j615k931k117L14J448K65o62J41P41L900
6554d094L642l039k297R52R33N23j581J031j331P49J621P2J774J034P49J843p42
$$ plain form
6672 -2062 -2244 -2827 -4599 -6336 -8785 -7933 -2191 3448 3667 1086 1713 622 519 639 525 1131 630
6655 630 -1670 -1374 -847 -1696 -1714 -2690 -1230 -963 -1598 -1251 -1925 -4048 -4439 -3885 -2760 -3002 -3427 -848 1202
6636 1202 -317 -1682 -706 2387 669 -3132 -4313 -2751 -2167 -3097 -7338 -7424 -1955 3863 6824 5470
6620 5470 993 233 2094 4246 3273 1297 -3044 -4503 -4665 -5902 -5812 -6238 -6383 -3023 -1932 -1598 162
6603 162 1178 2736 2802 1615 281 -1892 -5732 -8128 -7492 -6526 -4325 -1504 -318 368 -393 -496 -863
6586 -863 -4056 -5301 -6283 -8623 -6173 -3104 -5706 -7863 -7706 -6448 -9246 -10845 -8672 -5564 -9077 -11193
6570 -11193 -6748 -856 97 1096 -1014 -3578 -5193 -8124 -10241 -9927 -8479 -8214 -8876 -8735 -7994 -4094
6554 -4094 -452 -3491 -5788 -4836 -3903 -3380 -4961 -3930 -5261 -4512 -2891 -2819 -1045 -11 738 2581 1839
6537A839j704k244j175j117J720L756N10K379j256k748j553J478J794J560p97
6522B442k523l896J519N36J775K769j374j588K041Jj672J78N53K713K099P19k915
6505C377k097l058J009L28K858m38n031L59K268J250o17k827j636J796j268q41
6489d568J62M32M78J787j010j027kJ579J697J250m65k301p51m33R0l220r39n30
6471g771K506j33l04M578K960o39j305k929n578N73J681p27Q81K166q73l65K667
6454b612l01j114j926R4N62r22j033%L244K790K447o55j964J165J398k34q16R96
6436A119q20n241n59j179L017L560K520k087j989L922k441l442j185N6K036M2
6420b671P91m97RL97k654j914J756j931m32K828k279J990M560j625l67l05k247
$$ plain form
6537 1839 135 -2109 -3284 -4401 -2681 1075 1585 3964 2708 -40 -1593 -115 1679 3239 2442
6522 2442 -81 -3977 -2458 -1922 -147 2622 1248 -340 1701 1702 30 208 761 3474 5573 6292 3377
6505 3377 1280 -1778 -769 -441 2417 1979 -3052 -2693 -425 825 208 -2619 -4255 -2459 -3727 -4568
6489 -4568 -4406 -3974 -3496 -1709 -2719 -3746 -3748 -2169 -472 778 313 -1988 -2739 -3172 -3082 -6302 -7241 -7771
6471 -7771 -5265 -5398 -5702 -1124 1836 1197 -108 -3037 -8615 -8042 -6361 -7088 -6207 -4041 -4914 -5279 -2612
6454 -2612 -2913 -4027 -5953 -5859 -5297 -6219 -7252 -7252 -4008 -1218 1229 574 -1390 -225 1173 939 123 1119
6436 1119 299 -4942 -5501 -6680 -3663 -103 2417 330 -1659 2263 -178 -3620 -4805 -4749 -2713 -2671
6420 -2671 -1880 -2377 -2368 -1971 -4625 -6539 -4783 -6714 -7146 -4318 -6597 -4607 -47 -1672 -2039 -2344 -4591
6403d591J345J545K066L972J862j865j126J483l006j167O22k891n404k033J810
6388g378K619K532L12R54m37k38O35j130J157k15p40J387j142o72k180q60K669
6371b727K153j972l450j775J442K726k318J552O49N25L459M918k620k601m12q21
6355a272J079m75j881l023l25k756P77J731P02m06N64J659K906j706r53j85Q99
6338b665j722m036NJ487L114J185j56k461n3j748K187q48n13R26L439m99q87k597
6320e842l819R97L967N469K723k036l24j187j752j968l62R14k420j534k82j192
6304h648K897K957K934J03p85p9K81l187j719J290K646J943q29j763j231J162
6288b028M26J214J47j105L638J200k947j79k115r45j668k658l72K918L530O87
$$ plain form
6403 -4591 -3246 -1701 365 4337 6199 4334 3208 4691 1685 518 1140 -1751 -7155 -9188 -7378
6388 -7378 -4759 -2227 -1915 -961 -1398 -1636 -1001 -2131 -974 -1189 -1929 -542 -1684 -2356 -4536 -5396 -2727
6371 -2727 -574 -2546 -5996 -7771 -6329 -3603 -5921 -4369 -3720 -3195 264 5182 2562 -39 -451 -1272
6355 -1272 -193 -668 -2549 -5572 -5897 -8653 -7876 -6145 -5443 -5849 -5285 -3626 -720 -2426 -3379 -3564 -2665
6338 -2665 -4387 -8423 -8418 -6931 -3817 -2632 -2788 -5249 -5302 -7050 -4863 -5711 -6224 -5298 -1859 -2358 -3245 -5842
6320 -5842 -9661 -8664 -4697 772 3495 1459 1135 -52 -1804 -3772 -4134 -3220 -5640 -7174 -7456 -8648
6304 -8648 -5751 -2794 140 243 -542 -621 -340 -3527 -5246 -3956 -1310 633 -196 -1959 -3190 -2028
6288 -2028 -1602 -388 -241 -1346 2292 3492 545 366 -1749 -2694 -4362 -7020 -7392 -4474 -944 -257
6272b57p91M41J195Q09k091m423j231p32K331N666K69l864P41L69p64j308K23
6255c417J407j314j923L48K614K166K340j637J766N77k119k565j379l194J350
6240d980L495J427K164j80J078k398k712j126M64K125o16j999n19L41J386K387
6224C37P40j591j072j087L04O07m075q58n17M15O49M177L49p3Q29q70j696j01
6206c533K751R20L03k247J099J845L01j069r77J953J302j263j227k119k770j78
6190d909K771o10P55J308J067p22j151j023K29J085r77j218j071J931J138O0J321
6173a6k378k592k760M66N7P57j633K05L223J135k225K026R26l70o83K466J570
6156A74L29J008q96l992r58J795J602K207j48k016O06J341J718k253j116K36n36
$$ plain form
6272 -257 -1048 -607 588 1397 -694 -5117 -6348 -7080 -4749 917 1186 -2678 -1937 -1568 -2332 -3640 -3417
6255 -3417 -2010 -3324 -5247 -4899 -2285 -119 2221 584 2350 2927 808 -1757 -3136 -6330 -4980
6240 -4980 -1485 -58 2106 1926 3004 606 -2106 -3232 -2768 -643 -1259 -3258 -3777 -3436 -2050 337
6224 337 1077 -514 -1586 -2673 -2369 -1762 -5837 -6695 -7212 -6797 -6148 -1971 -1622 -1695 -866 -1736 -3432 -3533
6206 -3533 -782 138 441 -1806 -707 1138 1439 370 -607 1346 2648 1385 158 -1961 -4731 -4909
6190 -4909 -2138 -2748 -1993 -685 382 -340 -1491 -2514 -2285 -1200 -2177 -3395 -4466 -2535 -1397 -1337 -16
6173 -16 -2394 -4986 -7746 -7280 -7223 -6466 -8099 -7894 -4671 -3536 -5761 -3735 -2809 -3179 -3862 -1396 174
6156 174 503 1511 615 -3377 -4335 -2540 -938 1269 1121 -895 -289 1052 2770 517 -599 -363 -899
6139h99J84O78K165k616k722n49Q24R73j002K17j31K190l03Q25j990L42L149J552
6121B887j693J278L0k369k218L464J283l31k016l204r47J96q1N69K631L156j597
6104A038K178p39k351L058K01j295k164J86J276k159k42j411l765J028J794R39
6088b428M506p36N77j508q60K328K346l260l678k88j71j178j145m11k305J218
6072f993L441l60k613J717l251j697K230l14j263K337p62Q05K283q4K40K68j391
6055e407k523J948K128L82l675J486K233K531J232j114n8P66J116p40o38n109
6039e442J742K999M74l099j424Q0O86k073K93j052j231N73L177K272j187j428
6023d640J293Q24K49r24J945j34N85j090j930N44q4L598L529j514Q78q20j391
$$ plain form
6139 -899 -715 -37 2128 -488 -3210 -3759 -2935 -1962 -2964 -2747 -2878 -688 -991 -166 -2156 -1814 1335 2887
6121 2887 1194 2472 2502 133 -2085 1379 2662 2331 315 -2889 -3836 -3640 -3721 -3152 -521 2635 1038
6104 1038 3216 2477 126 3184 3385 2090 -74 112 1388 -771 -1013 -2424 -6189 -5161 -3367 -2428
6088 -2428 2078 1342 1919 411 -449 1879 4225 965 -2713 -3001 -3172 -4350 -5495 -5906 -8211 -6993
6072 -6993 -3552 -3912 -6525 -4808 -8059 -9756 -7526 -7840 -9103 -6766 -7528 -6723 -4440 -4524 -4284 -4016 -5407
6055 -5407 -7930 -5982 -3854 -3472 -7147 -5661 -3428 -897 335 -779 -837 -71 1045 305 -333 -5442
6039 -5442 -3700 -701 -227 -3326 -4750 -4670 -3984 -6057 -5764 -6816 -8047 -7474 -4297 -2025 -3212 -4640
6023 -4640 -3347 -2523 -2274 -3198 -1253 -1387 -802 -1892 -3822 -3278 -3362 236 3765 2251 3129 2309 918
6006I18p96K39J641K340j381n697j068J690P74J948m674j603k3L918o15l402O69
5989e122K529J330K263j643j715L474J603j23l633m3M836J419k104k328n299j038
5973e594j283m491K727K471K493J452j836J343J184K4n98J345J035r65n3n54k592
5956c892K336j254K240L019O76p74l370M13k317l431k058K388k03k762L73K742
5940e874J626J338k415K257L533J60J255l065k868j343J269K605K864J938k133
5925A147k039j253j562K69q76J957L29l3o22j029K9k59o60J002L389M781j02j455
5907C013R3K057k537m770R43o71l337Q30k53J378l4J170M37r09j21r90J322J980
5889c99j455l814N46O37K142j430J99L962J696Q19K689K71l805k835o59K19J64
$$ plain form
6006 918 122 361 2002 4342 2961 -2736 -3804 -2114 -1340 608 -4066 -5669 -5692 -1774 -2389 -5791 -5122
5989 -5122 -2593 -1263 1000 -643 -2358 1116 2719 2596 -1037 -1080 3756 5175 3071 743 -4556 -5594
5973 -5594 -6877 -11368 -8641 -6170 -3677 -2225 -4061 -2718 -1534 -1510 -2108 -763 272 -693 -746 -1300 -3892
5956 -3892 -1556 -2810 -570 2449 3125 2351 -1019 -606 -2923 -6354 -8412 -6024 -6227 -8989 -8616 -5874
5940 -5874 -4248 -2910 -5325 -3068 465 625 1880 -1185 -4053 -5396 -4127 -1522 1342 3280 1147
5925 1147 -892 -2145 -3707 -3438 -4314 -2357 -2028 -2061 -2683 -3712 -3683 -3942 -4602 -3600 -211 4570 4468 3013
5907 3013 3106 5163 2626 -2144 -1201 -1872 -5209 -4379 -4632 -3254 -3288 -2118 -1681 -2590 -2711 -3701 -2379 -399
5889 -399 -1854 -5668 -5122 -4485 -2343 -3773 -3574 388 2084 2903 5592 5863 2058 -777 -1436 -1217 -1053
5872a053L120K018n89k904n90n45o46J884j140J095m0o90M84J688l274j804o99
5855c685j102J4N28M0n09K360N7j341O67j261q70K471J347N65j701j723j13O78
5837c578q41PK226K472J631k270j814j319l399K655K83J02J785M27o75J09m16
5820b615o2m06j451k552L376K919K152L198l387n27j53l398p52K28K266r22j873
5803c959j288o39j113K466K381j231O60K015j463j20J133m023R97K806n96j906
5787c880j583P86j044j831k248M452K786N51J903k37K152j074k443K63k235k05
5771c887J364J491k004k9m01j82Q10j1j672j317k13j15J764j430L127J000K313
5754F08j125k546m865K69J781l20k058o2J612K341K711L945P17m73j557K92j507
$$ plain form
5872 -1053 2067 4085 3496 592 2 -543 -1189 695 -445 650 610 -80 404 2092 -1182 -2986 -3685
5855 -3685 -4787 -4773 -4245 -4205 -4714 -2354 -2297 -3638 -2971 -4232 -5102 -2631 -1284 -719 -2420 -4143 -4256 -3578
5837 -3578 -4419 -4412 -2186 286 1917 -353 -2167 -3486 -6885 -4230 -3947 -3845 -2060 -1633 -2308 -2199 -2615
5820 -2615 -2677 -3083 -4534 -7086 -3710 -791 1361 4559 1172 645 492 -2906 -3658 -3430 -1164 -2086 -3959
5803 -3959 -5247 -5886 -6999 -4533 -2152 -3383 -2723 -708 -2171 -2291 -1158 -5181 -4184 -1378 -1974 -3880
5787 -3880 -5463 -4677 -5721 -7552 -9800 -5348 -2562 -2011 -108 -345 1807 733 -1710 -1447 -3682 -3887
5771 -3887 -2523 -1032 -3036 -3065 -3466 -3648 -2838 -2849 -4521 -5838 -6051 -6166 -4402 -5832 -2705 -1705 608
5754 608 -517 -3063 -7928 -7659 -5878 -6198 -8256 -8318 -6706 -4365 -1654 2291 3008 2535 978 1270 -237
5737b37k331K40k95k66j951J250J899r53Q27j538k490j249M208J432P03J287L8
5720E74k072m02k303j161l145L877n47J406K567K374l24l469j452M29K272L08
5704a068L9j78l32L188O45j230k82p49J183Q9k683q6L043p89r87J057l606j073
5686c819J803L266K535l490m50K265j647j905m546j012K574K804J63j484j846
5671d789L29j753l23K154R33k776K06N1J776j087k759J133J278J116M56K811L679
5654B435N043J49j808l365j756J806K70k667j662j69q22K270P96j548k666k80
5638c974l82o75K26K509J717j488m57j865r46L164K682L707J062m076n965o930
5622a1691k737k81N543L985J946m25n482n236k358O337P288O331M559J875L202
$$ plain form
5737 -237 -2568 -2328 -2623 -2889 -4840 -3590 -1691 -2644 -1817 -3355 -5845 -7094 -2886 -1454 -751 536 574
5720 574 -1498 -1900 -4203 -5364 -8509 -4632 -5179 -3773 -1206 1168 844 -2625 -4077 -3648 -1376 -1068
5704 -1068 -1029 -1207 -1539 1649 2294 1064 782 33 1216 1305 -1378 -1464 1579 790 -197 860 -2746 -3819
5686 -3819 -2016 1250 3785 295 -155 2110 463 -1442 -5988 -7000 -4426 -1622 -1459 -2943 -4789
5671 -4789 -4460 -6213 -6536 -4382 -3449 -6225 -6019 -5968 -4192 -5279 -8038 -6905 -5627 -4511 -4055 -1244 2435
5654 2435 7478 7627 5819 2454 698 2504 2774 107 -1555 -1724 -2546 -276 520 -1028 -3694 -3974
5638 -3974 -4356 -5031 -4805 -2296 -579 -2067 -2524 -4389 -5335 -2171 511 4218 5280 1204 -4761 -11691
5622 -11691 -14428 -14709 -9166 -5181 -3235 -3660 -9142 -14378 -16736 -10399 -3111 3220 7779 9654 12856
5607A2856m389n193l301j627L831J767l28K546j392k949j928j397K599j329j10
5592c44j134J645J389j653J481J077l673l809k372R18o49L41J585J81J810L775
5576E68K600j322k590J237J607J623k366K619l33j349k017q63K404k446j144J321
5560d51J789j959J880j33l61M46k590N299J487k665K081mj254j360l223k178Q25
5543b371r50N94K632N42P59p81L97J616Q16j492n53k354j728K95r84P85r78O52
5525c103J158Q30j951q73J264n19J089K337J97K578J385k731j352K394k628Q79
5509I54k2P53J089Q42l31j020j775o03j460r88rJ310j330Q71K004j692j041K090
5491c58J68K975j009n69%m81n028J053R37l183j360K779J837K152j219k147J500
$$ plain form
5607 12856 8467 3274 -27 -1654 2177 3944 3616 6162 4770 1821 -107 -1504 1095 -234 -344
5592 -344 -1478 167 1556 -97 1384 2461 -1212 -5021 -7393 -6475 -7124 -6783 -5198 -5017 -3207 568
5576 568 3168 1846 -744 493 2100 3723 1357 3976 3643 2294 277 -586 1818 -628 -1772 -451
5560 -451 1338 -621 1259 1126 765 1211 -1379 3920 5407 2742 4823 4819 3565 2205 -1018 -3196 -2371
5543 -2371 -3321 -2727 -95 447 1206 425 822 2438 3254 1762 1209 -1145 -2873 -2578 -3562 -2777 -3755 -3103
5525 -3103 -1945 -1115 -3066 -3939 -2675 -3194 -2105 232 429 3007 4392 1661 309 2703 75 954
5509 954 932 1685 2774 3616 3285 2265 490 -113 -1573 -2561 -2570 -1260 -2590 -1719 285 -1407 -2448 -358
5491 -358 -190 2785 1776 1207 1207 726 -4302 -3249 -2312 -5495 -6855 -4076 -2239 -87 -1306 -3453 -1953
5474a953j35K101R87j028l105O0l708K146J916J204J146J968K227m019j506j474
5458c173k948K121N50K685O51j130R89j345N54J628p11r96k384N14J241o41p45
5441c140n43K77N89j445k030K410J491N34r5L21n32L201O67j089L28j841n67L25
5423a139q89O75j69P65p77k424K34M254M07k45k878N53J397k441m553p3o46K840
5405e109L034P88K449m17j826r83J411k668l388M70R77J797m75O32K986L177L219
5388F074l411m023J608j309j340O41q28L90j260l42Q73R95J914p01k385J933K16
5371i55O00q94o00j418l13j561j018p34K748L242J646l142o87J395k60m059k934
5354h944J640L042J489j545j197P2M056L343M326j530j767J165J070j496k827
$$ plain form
5474 -1953 -2088 13 1000 -28 -3133 -3073 -6781 -4635 -2719 -1515 -369 1599 3826 -193 -1699 -3173
5458 -3173 -6121 -4000 -3450 -765 -114 -1244 -255 -1600 -1046 582 -129 -1125 -3509 -2995 -1754 -2395 -3140
5441 -3140 -3683 -3406 -2817 -4262 -6292 -3882 -2391 -1857 -1952 -1631 -2163 1038 1705 616 944 -897 -1464 -1139
5423 -1139 -2028 -1353 -1522 -757 -1534 -3958 -3724 530 937 692 -2186 -1633 -236 -2677 -7230 -7303 -7949 -5109
5405 -5109 -2075 -1287 1162 745 -1081 -2064 -653 -3321 -6709 -6239 -5262 -3465 -3940 -3308 -322 2855 6074
5388 6074 2663 -1360 248 -1061 -2401 -1760 -2588 -2198 -3458 -3800 -2927 -1932 -18 -719 -3104 -1171 -955
5371 -955 -355 -1249 -1849 -3267 -3580 -5141 -6159 -6893 -4145 -903 743 -2399 -3086 -1691 -1951 -6010 -8944
5354 -8944 -7304 -4262 -2773 -4318 -5515 -5443 -1387 1956 6282 4752 2985 4150 5220 3724 897
5339H97l108J530K225k237k416N13k326J944K573J379n93q01j809R06J928j414
5323h09j339J685m555j652j109J076M180O83k415l89O17J532M861j887k894K560
5307A45L241J980J747n20k091R63K5L91m511j865j59K16J238P27k270P91L51j248
5289h49J043J21J409k634j737J745R6K190Q57q7P47p83j069J069o79k042j425
5272b028J160K578J089j959k01L091J377Q18n228k122K822N70J89N94J706R30
5256E386j676m594j389j44k218j015j308k07L32J222L422J92o07l79J048m95k201
5239d631J06J268J76k84P0J646M75o61k856n57L73K807L89R28K242p58k607l299
5221e173j075j153j857J959L276j586j729j215J918L327K693J654n12k773m680
$$ plain form
5339 897 -2211 -681 1544 -693 -3109 -2596 -4922 -2978 -405 974 381 -420 -2229 -1323 605 -809
5323 -809 -2148 -463 -5018 -6670 -7779 -6703 -2523 -1840 -4255 -4644 -4027 -2495 2366 479 -2415 145
5307 145 3386 5366 7113 6593 4502 5465 5490 5881 1370 -495 -654 -438 800 1527 -743 48 399 -849
5289 -849 194 315 1724 -910 -2647 -902 -806 1384 2241 2154 2901 2118 1049 2118 1439 -603 -2028
5272 -2028 -868 1710 2799 840 639 3730 5107 5925 697 -1425 1397 1967 2156 2750 4456 5386
5256 5386 3710 -884 -2273 -2417 -4635 -5650 -6958 -7165 -6833 -5611 -2189 -1997 -2604 -2983 -1935 -2430 -4631
5239 -4631 -4525 -3257 -3081 -3365 -3295 -1649 -1174 -1835 -4691 -5248 -4875 -2068 -1679 -751 1491 733 -1874 -5173
5221 -5173 -6248 -7401 -9258 -7299 -4023 -5609 -7338 -8553 -6635 -3308 -615 1039 527 -2246 -6926
5206f926q54J004j428r41K265L542K871j145j552k70j82O95K882o73l62o31j900
5189c605L058M083n44m396k464N57K138M043K78k828k72p74J188J046k979j752
5173c223K601N56P26j36j665l948k128K449K880R29J263J783l75k572j269L27
5157a802L857l6P54r54k52j664m458J30J386P121K065j328o290l871q00q5K045
5140d182M42o39J324K941jm37q09J294K663p32n13M92k65j210j494J80j791N235
5122B498L363k240p27J804R82j065l109m247L27j004J527N122r25l083N30K25
5106b2o9j019Q74o30R76J384M58K517K31l59l342k988j526K550J24J292m66J690
5088A675J198k274l665p98K756l80k762K186M035q06j781k22L741K640m763k233
$$ plain form
5206 -6926 -7780 -6776 -8204 -9145 -6880 -3338 -467 -1612 -3164 -3434 -3616 -2921 -39 -712 -1074 -1705 -3605
5189 -3605 -547 3536 2992 -1404 -3868 -3311 -1173 2870 3148 320 48 -726 462 1508 -1471 -3223
5173 -3223 -622 -66 660 524 -1141 -5089 -7217 -4768 -1888 -959 304 2087 1712 -860 -2129 -1802
5157 -1802 2055 2019 2773 1819 1567 -97 -4555 -4425 -3039 4082 6147 4819 -1471 -5342 -6142 -6227 -4182
5140 -4182 -3740 -4379 -3055 -114 -115 -552 -1361 -67 2596 1864 1351 1843 1578 368 -1126 -946 -2737 2498
5122 2498 5861 3621 2894 4698 5680 4615 1506 -2741 -2414 -3418 -1891 3231 2306 -777 -247 -22
5106 -22 -91 -1110 -236 -866 110 1494 1952 4469 4700 4341 999 -1989 -3515 -965 -841 451 -15 1675
5088 1675 2873 599 -3066 -3864 -1108 -1488 -4250 -2064 1971 1165 -616 -838 2903 5543 780 -1453
5072a453L438R65M52l24j566j598j078J085j430n40M26J926R45J754M610J65k196
5055E581Q58r59j77l742m768j287K537L30k218L72j073N48K954K975M54k43k594
5038d52k397K08l63J541l352R13K727P06l14L209j275l14P5m85J687j484m986
5021d356m66L002j214j850R32M77j355P61J012J937J45k598N0j290n72L727K38
5004a420j070K276L928j175m877L16K540M56m0j520J197N9J513j749j5m40n982
4987f003M33K490M25k283K485K726J500k785l419O97K500J252k39j76j017J307
4971a07J636m80l960k215j828R61L470L946p40l984k341j218K203J85n29L08L064
4954a629L964j5m827j685J497J89J762J967j178k62o90l08j085j868L272K570
$$ plain form
5072 -1453 1985 2950 3402 3078 1512 -86 -1164 -79 -1509 -2049 -1623 303 1248 3002 7612 7777 5581
5055 5581 6439 5480 5303 1561 -3207 -4494 -1957 -1627 -3845 -3473 -4546 -3998 -1044 1931 2385 2142 -452
5038 -452 -2849 -2641 -3004 -1463 -4815 -3902 -1175 -469 -783 2426 1151 837 912 427 2114 630 -4356
5021 -4356 -4822 -1820 -3034 -4884 -3952 -3475 -4830 -4069 -3057 -1120 -975 -3573 -3523 -4813 -5385 -1658 -1420
5004 -1420 -2490 -214 3714 2539 -2338 -2022 518 974 934 -586 611 670 2183 434 419 -21 -6003
4987 -6003 -5570 -3080 -2655 -4938 -2453 273 1773 -1012 -4431 -3734 -1234 18 -221 -397 -1414 -107
4971 -107 1529 1049 -2911 -5126 -6954 -5993 -2523 1423 683 -3301 -5642 -6860 -4657 -4472 -5001 -4693 -1629
4954 -1629 2335 2320 -2507 -4192 -2695 -2506 -744 1223 45 -217 -907 -1215 -2300 -4168 -896 1674
4938A674j412j376J593J113j526J283n11l846l479K116J513R84j317J29K979L79
4922B96J311K206j063m02k70j285o29L499K147k489j053m045j647l422L330M183
4906F67l43k7j009M75J524j547k543J021K019K838l555k627l86K916O36r76k132
4889c049m115p71L759J51L865P32m80oK463j497k481n46J708J665j224K121o07
4872A688p51j994l164o21J285L135j095m80M02K426J760J54k757p58K142l320
4856a948l760J717P77r11J554K249J146k828k983k415l54j687J494K291L624Q86
4840a148m310k930k096m38M50L604P772K176j886Q7k07j857K68J133L315J039
4824D972k907j882l891n84J282j363j202J532O060K565k148j953j524O85J146
$$ plain form
4938 1674 262 -1114 479 1592 66 1349 838 -3008 -6487 -4371 -2858 -1874 -3191 -3062 -83 296
4922 296 1607 3813 2750 2348 2078 793 164 3663 5810 3321 2268 -1777 -3424 -6846 -3516 667
4906 667 324 297 -712 -237 1287 -260 -2803 -1782 237 3075 -480 -3107 -3493 -577 59 -917 -3049
4889 -3049 -7164 -7935 -4176 -4025 -160 572 92 86 2549 1052 -1429 -1975 -267 1398 174 2295 1688
4872 1688 937 -1057 -4221 -4842 -3557 -422 -1517 -1997 -1595 831 2591 2745 -12 -770 1372 -1948
4856 -1948 -5708 -3991 -3214 -4125 -2571 -322 824 -2004 -4987 -7402 -7756 -9443 -7949 -5658 -2034 -1148
4840 -1148 -5458 -8388 -10484 -10922 -10472 -6868 904 3080 1194 1281 1074 -783 -515 618 3933 4972
4824 4972 2065 183 -3708 -4292 -3010 -4373 -5575 -4043 2017 4582 2434 481 -1043 -358 788
4809G88j499j696r59r21p98j55N14K751L586n76R84J596J398k128p57J232L52
4792C712n852j02J867j700K93K642J304l558k149M98j080J346J18j782o26j6J362
4775c723K411j357N02J756J771O0m749J647J963l30K03Q65J29k719k169K270K57
4758a213j09k94n121j928L360K229M6L23j5k709L6N432K371p5m60k717J290k933
4740b487o833o37L61J232M033j067M5K283m79j095J295N84J095j471j307M205
4724b43K292l13j592k964j254J402K634J381J529j567j767J718j365j844j451
4709c404j782L268K031j958m581j423J942J487J077n49n74M02J858j200N69m78
4693c315J773J626K287p39O51p56j74m68R25N66m10K61k61j077q33k324o54N653
$$ plain form
4809 788 -711 -2407 -3366 -4287 -5085 -5240 -4726 -1975 1611 1035 2019 3615 5013 2885 2128 3360 3712
4792 3712 -2140 -2242 -375 -2075 -1782 860 2164 -1394 -3543 -3045 -4125 -2779 -2661 -4443 -5069 -5085 -3723
4775 -3723 -1312 -2669 -2167 -411 1360 1420 -3329 -1682 281 -49 154 1019 1148 -1571 -3740 -1470 -1213
4758 -1213 -1322 -1616 -6737 -8665 -5305 -3076 -3030 -2707 -2722 -5431 -5395 37 2408 2333 1873 -844 446 -2487
4740 -2487 -9320 -9957 -9596 -8364 -4331 -5398 -5353 -3070 -3549 -4644 -3349 -2765 -1670 -3141 -4448 -243
4724 -243 2049 1736 144 -2820 -4074 -2672 -38 1343 2872 1305 -462 1256 -109 -1953 -3404
4709 -3404 -5186 -1918 113 -1845 -6426 -7849 -5907 -4420 -3343 -3892 -4466 -4064 -2206 -3406 -2837 -3315
4693 -3315 -1542 84 2371 1632 2283 1527 1353 885 1810 2376 1966 2227 1966 889 56 -2268 -2922 2731
4675B731N210K08M42k374k101k308k306J254L023K298j651o701k422K167M132
4660A602J356l330n244L078L990M980M035l349n262q23K503N07o94J455l000k67
4644A537J513P19N10j303k675m561J904L186l36J393J252K91k969j546M15J598
4628I28m04p85k80P90k800r95j520L392K646N4j101q95k563j84J113K15K201l278
4610c466j867O07j000J57oK340L804P27K45l700J115Q69L369k918k674L899r54
4593E47k150j046K0k063L794L331j042l157r75j783J063J983J352N077J151l437
4577B665r78q49j540p59L382J115l184k087p34P16L022L044k703j939J638L327
4561D136K141J344k004l941j22k818j607j987j472J54J660K396L604n41R12o38
$$ plain form
4675 2731 7941 8149 8591 6217 4116 1808 -498 756 3779 6077 4426 -2275 -4697 -2530 1602
4660 1602 2958 -372 -5616 -2538 1452 6432 10467 7118 1856 1033 3536 4043 3349 4804 1804 1537
4644 1537 3050 3769 4279 2976 301 -4260 -2356 830 494 1887 3139 3430 461 -1085 -670 928
4628 928 524 -261 -541 249 -2551 -3546 -5066 -1674 972 1026 -75 -970 -3533 -3717 -2604 -2389 -188 -3466
4610 -3466 -5333 -4726 -5726 -5569 -5575 -3235 569 1296 1541 -2159 -1044 -175 3194 276 -2398 1501 547
4593 547 -1603 -2649 -2629 -4692 -898 2433 1391 -1766 -2741 -4524 -3461 -1478 -126 4951 6102 2665
4577 2665 1687 838 -702 -1461 1921 3036 -148 -2235 -2969 -2253 769 3813 1110 -829 809 4136
4561 4136 6277 7621 5617 1676 1554 -1264 -2871 -4858 -6330 -6176 -4516 -2120 1484 943 1855 1217
4545A217j057k338j847K253K643K433R05M65j164q31j709j342o3K614K637P99
4529E615N22K227j599j819k777J641K003N67l935m068Q18J649l129K382R58j174
4513a19K59ql19k8j644k183Q73J740j250k190J81K159j284J348O948j55Q81k453
4495B756j138K200q28p83K782k03P63k227K786k027o00J890k240k886J965m30
4479A780j951L093p1j494j563j03k194J87L580K843k146o71n88M57J32l417j488
4462c614m71j676n94K903N049L941k414k423l883j757K212L186k261l648J851
4447c599L050J046K936l60j5j957j902r64P42k618J31J57l00M836L91N92k67O62
4429B561q79J20p68J14j078K381m64n419k246L635O642k270l888k953O90K868
$$ plain form
4545 1217 160 -2178 -4025 -1772 871 3304 4209 4674 3510 2679 970 -372 -435 2179 4816 5615
4529 5615 6137 8364 6765 4946 2169 3810 5813 6380 2445 -1623 -805 844 -2285 97 1055 -119
4513 -119 140 132 -187 -215 -1859 -4042 -3169 -1429 -2679 -4869 -4688 -2529 -3813 -2465 4483 4328 5209 2756
4495 2756 1618 3818 2990 2207 4989 4786 5549 3322 6108 4081 3481 5371 3131 245 2210 1780
4479 1780 -171 2922 2851 1357 -206 -309 -2503 -2316 1264 4107 1961 1290 702 1159 1291 -2126 -3614
4462 -3614 -4085 -5761 -6355 -3452 1597 5538 3124 701 -3182 -4939 -2727 459 -1802 -5450 -3599
4447 -3599 -549 497 3433 3073 3058 1101 -801 -1765 -1023 -3641 -3510 -3353 -3653 1183 1574 2166 1899 2561
4429 2561 1682 1802 1034 1148 70 2451 1987 -3432 -5678 -2043 4599 2329 -1559 -4512 -3822 -954
4413i54K919j040j411j877J556J105Q27j671l627J334L676J494M89k562l125p53
4397c620K538K45r01J055J656L85l731K33K670n5k165k074K92j741J649J705K038
4380A79l95J17N59M79j683n60j989J419k169k220Q08N240N252J164m013m468O72
4363a608J296j261K185R66N62N71L40q98l158n33K674k955l047L54J704K271O19
4346H2l395r68M75K571r07J061k186J714P66L07J698K905M07j722j15R33J432
4329E058M36k07l438j276j638r16N2L8k227n96K255K470K134J28j51l22K427O9
4311D296j986P37K97j08P42j545k024o04J871J836K219k237l681j926r86J23L556
4294E80k069J001j297j780M55J540o71j964l580j022J910J183K772j020q00j418
$$ plain form
4413 -954 1965 925 -486 -2363 -807 298 1125 -546 -4173 -2839 837 2331 2820 258 -2867 -3620
4397 -3620 -1082 -837 -1738 -683 973 1358 -2373 -2140 530 475 -1690 -3764 -3472 -5213 -3564 -1859 179
4380 179 -216 -99 460 939 -744 -1304 -3293 -1874 -4043 -6263 -5455 -215 5037 6201 2188 -2280 -1608
4363 -1608 -312 -1573 612 1578 2140 2711 3051 2153 -1005 -1538 1136 -1819 -4866 -4512 -2808 -537 82
4346 82 -3313 -4281 -3806 -1235 -2142 -1081 -3267 -1553 -787 -480 1218 4123 4530 2808 2693 3626 5058
4329 5058 5494 5287 1849 573 -1065 -1981 -1929 -1891 -4118 -4714 -2459 11 2145 2273 2122 1800 4227 4296
4311 4296 2310 3047 3344 3236 3978 2433 409 -195 1676 3512 5731 3494 -187 -2113 -3099 -2976 580
4294 580 -1489 -488 -1785 -3565 -3110 -1570 -2241 -4205 -7785 -8807 -6897 -5714 -2942 -3962 -4762 -6180
4278f180r16L681K781J72L503k025k750R56k301j197K306J283L01p42j154j963
4262d245j125K281J899N40L192j207M025K356k746j274j246l899n%l279k179J658
4245e254L843L84n1Q43L156P82J683j772k138J955j473N80J048P76j628j154k69
4228A311j310L12l860k790m61L116J378k295J702K114l87q3J11L085L262k493
4212B712k765n118k332J595L797L329o6m261M25K478j417k093N60j126R45K425
4196i12R98j222K206M829p35k983j242k393k621k69K46P71k50r3K903n74n00K034
4178A93j058L634J297j383k504l323n7j210q76R85M030Q93K436k784l37J645P16
4161B297K281L475R04m089j691J437k433n174m24J488J565K67K727L642j007m26
$$ plain form
4278 -6180 -7096 -3415 -634 -462 3041 1016 -1734 -778 -3079 -4276 -1970 -687 -386 -1128 -2282 -4245
4262 -4245 -5370 -3089 -1190 -650 2542 1335 5360 7716 4970 3696 2450 -1449 -1454 -1454 -4733 -6912 -5254
4245 -5254 -1411 -1027 -1078 -235 2921 3703 5386 3614 1476 3431 1958 2538 3586 4362 2734 1580 1311
4228 1311 1 313 -3547 -6337 -6798 -3682 -2304 -4599 -2897 -783 -1170 -1253 -1142 1943 5205 2712
4212 2712 -53 -5171 -7503 -5908 -2111 1218 1152 -3109 -2684 -206 -1623 -3716 -3156 -4282 -3337 -912
4196 -912 86 -1136 1070 5899 5164 2181 939 -1454 -4075 -4344 -4098 -3327 -3577 -3670 -767 -1341 -1841 193
4178 193 -865 2769 4066 2683 179 -3144 -3201 -4411 -5287 -4302 -272 621 3057 273 -64 1581 2297
4161 2297 4578 8053 8957 4868 3177 4614 2181 -2993 -3417 -1929 -364 -97 2630 6272 5265 4839
4145D839k315p598J865M340J211j236j639j162k335j807K573K803k793l023M266
4130b011M470j40m655L773M086j395j327k11j069k284J39J225k251o46L676j302
4114G8k167k94Q48K84l584k085J581P31R06L31k445L518K728j0j597q76K207J882
4096B036j997j233P39k83K606O11O61J153o28J721m218m446K513M752q84M14j297
4079B220R91j376j092j14l374J478L618j757k653p18p23L073J771r88k181PK348
4062E30q60k291J768j116j376O99L376k399j343K719Q85l74R06O52J060M0K003
4045D879M08m175j932j059l302j946n31N933M218N17n6r92l082j514m51Q35o93
4028b943J735Q83l26Q83K034L25k122l290j754L070N049K184p7j388k304kK871
$$ plain form
4145 4839 2524 -5074 -3209 1131 2342 1106 -533 -1695 -4030 -5837 -3264 -461 -3254 -6277 -2011
4130 -2011 2459 2319 -2336 1437 5523 4128 2801 2590 1521 -763 -624 601 -1650 -2296 1380 78
4114 78 -2089 -2383 -1535 -1251 -4835 -6920 -5339 -4608 -3702 -3371 -5816 -2298 430 420 -1177 -2053 154 2036
4096 2036 39 -1194 -455 -738 1868 2479 3140 4293 3665 5386 1168 -3278 -765 3987 3103 3517 2220
4079 2220 3211 1835 743 629 -2745 -1267 2351 594 -2059 -2777 -3500 -427 1344 356 -1825 -1818 530
4062 530 -330 -2621 -853 -1969 -3345 -2646 730 -1669 -3012 -293 592 218 1124 1776 2836 2876 4879
4045 4879 5287 1112 -820 -1879 -5181 -7127 -7658 -1725 2493 3010 2954 1962 -1120 -2634 -3085 -2250 -2943
4028 -2943 -1208 -325 -651 232 2266 2591 469 -2821 -4575 -1505 3544 5728 5651 4263 1959 1957 4828
4011D828j017K10k461J76n33k264K58k79K717j387j367j049j890J686L705k851
3995a518j159J718K954j299Q64L57J760j193j775Jk243k440P43L665J681L48J30
3978B594J29K766Q49M25j691j753Q23K005m74j984L60J088J135k241j442k478
3962A11j046J124J776n16P17K622p85Q89m039j392K029K825J702j142r72J45O47
3945D695j556j389j682L77K771N096J74k471J51j835K87j507j05J71K388k207
3929C358l303Q21n34M03j818j336L716J126q86L23j394k007J760J671L54j64o54
3912A436J041m899L470L87k07k35R28J086k986M22J200J307J081j827k440P10
3896D74j183r05M63L104p14p23J307j412J426n14r31K28k673L636L071k302k258
$$ plain form
4011 4828 3811 4021 1560 1736 1203 -1061 -803 -1082 1635 248 -1119 -2168 -4058 -2372 1333 -1518
3995 -1518 -2677 -959 1995 696 1560 1917 3677 2484 709 710 -1533 -3973 -3230 435 2116 2464 2594
3978 2594 2723 5489 6338 6763 5072 3319 4142 6147 5673 3689 4049 5137 6272 4031 2589 111
3962 111 -935 189 1965 1449 2166 4788 4003 4892 853 -539 1490 4315 6017 4875 3903 4048 4695
3945 4695 3139 1750 68 445 3216 8312 8486 6015 6166 4331 4618 3111 3006 3177 5565 3358
3929 3358 55 876 342 745 -1073 -2409 1307 2433 1547 1870 476 -1531 229 1900 2254 2090 1436
3912 1436 2477 -2422 1048 1435 1228 993 1921 3007 21 443 1643 2950 4031 2204 -236 474
3896 474 -709 -1614 -1151 1953 1239 516 1823 411 1837 1323 392 620 -2053 1583 4654 2352 94
3879I4O04K629l25P27K013m75q0j940J151k90l017R48Q29j835l033J237o30n23
3861a916O26K722j554k357J681L769j294k132j321N42j30J8Q37P98J97M22J566
3844B474k808L070K606P83N52O31q31k669p82J75k344o08J253k14r17r28P08M41
3826E92j420O50J021p32j106k202J482M794Q35k10k397j2K750K441j392n73l29
3809D192k73J027j826O65n57m570j134J166K23M0K012P66l280m32J729J529J426
3792B703j176j568Q92J403k93j941j38J620P61L06l316L42O04k79J579o29l064
3775b194M582L151l860l913K584K498l336J399j261j125k31mk296m339L028N525
3759B08J272K084j501k823k146Q29J405j032J959L00J867J563l67q53j30k716
$$ plain form
3879 94 698 3327 3002 3729 5742 5267 5187 3247 4398 4108 1091 2039 2868 1033 -2000 -763 -1393 -1916
3861 -1916 -1290 1432 -122 -2479 -798 2971 1677 -455 -1776 -1234 -1364 -1346 -509 289 486 908 2474
3844 2474 -334 2736 5342 6125 6677 7308 6477 3808 3026 3201 857 249 1502 1288 371 -557 151 592
3826 592 -828 -178 843 111 -995 -3197 -1715 3079 3914 3704 1307 1295 4045 6486 5094 4521 4192
3809 4192 3919 4946 3120 3785 3228 -1342 -2476 -1310 -1087 -1047 965 1731 -1549 -1981 -252 1277 2703
3792 2703 1527 -41 851 2254 1961 20 -118 1502 2263 2569 -747 -405 199 -80 1499 870 -2194
3775 -2194 2388 5539 1679 -2234 350 2848 -488 911 -350 -1475 -1706 -1710 -4006 -8345 -5317 208
3759 208 1480 3564 2063 -760 -2906 -2077 -672 -1704 255 555 2422 3985 3618 2765 2635 -81
3743h1j477J011j105L282K581l084K062L441k051k465oJ424k130K91J447j179
3727A961K159l65m2K574R4k910l241J043j425k365M81j41L455N82o301j291J392
3710d340N201j059j982M071J419L7M47O26L473r45l038k10K456k661l371J684
3694A808l393Q54M938m492l293J744M822j537P49O9j138K8j734O68o8j621P14
3677h82l294j292M086L955L043K3k268K253j738n442k9N992L646n113k854j26
3661d0K080l78k407L810P83n274j991K52k233n48j29M378N886K590po040o260
3644e528k11N771K268J230p1q42K75K405N72k379J376n53j629j336o15J466j03
3627B096O07j61j152m09J312k925o3j589Q31K655J483P01q21j263m401j109M766
$$ plain form
3743 -81 -1558 -547 -1652 1630 4211 1127 3189 6630 4579 2114 2108 3532 1402 1693 3140 1961
3727 1961 4120 3755 3713 6287 6381 3471 230 1273 -152 -2517 -2036 -2177 1278 1860 -4441 -5732 -4340
3710 -4340 861 -198 -2180 1891 3310 3347 3794 4420 7893 6948 3910 3700 6156 3495 124 1808
3694 1808 -1585 -731 4207 -285 -3578 -1834 2988 1451 2200 2269 1131 1159 -575 93 25 -1596 -882
3677 -882 -4176 -5468 -1382 2573 5616 5639 3371 5624 3886 -1556 -1585 4407 8053 2940 86 -40
3661 -40 2040 1662 -745 3065 3848 -1426 -3417 -3165 -5398 -5946 -6075 -1697 4189 6779 6772 732 -5528
3644 -5528 -5739 32 2300 3530 3459 2617 2892 5297 5869 3490 4866 4313 2684 1348 733 2199 2096
3627 2096 2703 2542 1390 981 2293 -632 -695 -2284 -1453 1202 2685 3386 2565 1302 -3099 -4208 558
3610E58K924j211O35q13k082j364O59J447o55j793J625j281O54J934K55J664J269
3593D425m62m08q39O94j341k070K086j599O08K509J867j508k975k828j328L021
3577a48K053r0k380j264L238L458M18k839o164j121P55J230J141Q50J907r10k665
3560b531j138mQ85j281M526K941J225j802J368K65k251k502P74J396l13j535j174
3543a151K084Q87j557J319J756L463p95n397k686K327J02L758o70l311j110m98
3527a479L61J893o0k465L35R12m20P20Q21L239o10o01p50j258O75l74n95N276
3509E620j877o003K25J290Q82L82j038J00k407j570P65K580K312K516P64j593
3493B948j994k95J87k205k445l296P58P42M641l11N4J828J389K221J75l879K3
$$ plain form
3610 558 3482 2271 2906 2093 11 -1353 -694 753 98 -1695 -70 -1351 -697 1237 1492 3156 4425
3593 4425 3963 3555 2716 3410 2069 -1 2085 486 1094 3603 5470 3962 987 -1841 -3169 -148
3577 -148 1905 1815 -565 -1829 1409 4867 5285 2446 -3718 -4839 -4084 -2854 -1713 -863 1044 134 -2531
3560 -2531 -3669 -3673 -2788 -4069 457 3398 4623 2821 4189 4454 2203 -299 475 1871 1558 23 -1151
3543 -1151 933 1820 263 1582 3338 6801 6006 609 -2077 250 352 4110 3440 129 -981 -1479
3527 -1479 -1118 775 715 -1750 -1415 -503 -923 -203 618 3857 3247 2646 1896 638 1313 939 344 5620
3509 5620 3743 -2260 -2035 -745 137 519 -519 -419 -2826 -4396 -3631 -1051 1261 3777 4541 2948
3493 2948 954 659 846 -1359 -3804 -7100 -6342 -5600 -959 -1270 -1216 612 2001 4222 4397 518 541
3476E41j341j577m99J785K288J500r71n49J370k54p30l044L04n50N68J512J388
3459A741K870m815m235j95J648K296l89j150p03L83J653K219k078j059j295K070
3443a039L173J412m747k093K144L257Q43q10Q31q53Q51k351O10L841O12j519k313
3426A849k579o33m6J523J005j892J353J688K053O75R02Q2n326j503J65O26k388
3409b446r23J831J89Q11j26M610J328Q25l440r80J243J282n60k361n9j84k4k173
3391a157j359q34p58K294k5JJ785K213J7J237m13j043n83R26J145p69j937M68
3373A208J347j347j327J642j96n09j6M79K373J437j851l143P97L736O00k056k388
3356G86J256R47j293L742M084k65l15l473K02J263k157j24l228j193J59m04m077
$$ plain form
3476 541 -800 -2377 -2876 -1091 1197 2697 1726 1177 2547 2293 1563 -1481 -1177 -1727 -1159 353 1741
3459 1741 4611 -204 -4439 -4634 -2986 -690 -1079 -2229 -2932 -2549 -896 1323 -755 -1814 -3109 -1039
3443 -1039 2134 3546 -1201 -3294 -1150 2107 2950 2140 2971 2118 2969 618 1228 5069 5681 4162 1849
3426 1849 -730 -1363 -1409 114 1119 -773 580 2268 4321 4996 5898 5980 654 -849 -684 -58 -2446
3409 -2446 -3369 -1538 -1349 -538 -664 3946 5274 6099 2659 1679 2922 4204 3644 1283 1224 1040 1016 -1157
3391 -1157 -2516 -3350 -4108 -1814 -1839 -1838 -53 2160 2177 3414 3001 1958 1375 2301 3446 2677 740 1208
3373 1208 2555 1208 -119 1523 1327 818 802 1281 3654 5091 3240 97 894 4630 5230 3174 786
3356 786 2042 2989 1696 5438 9522 9257 8942 5469 5671 6934 4777 4653 1425 232 391 -13 -4090
3339d090J206N584K064j99L288j089l361l984j485Q20l022J64M69Q04L391K358
3323B918J950K85J49j223j176l076k626K83N62J549K404K05l29K08J054k099P11
3306A749K77m5K170J926J503o32k326l64N14K403J20J768k580p007l780L922K847
3289B465Q50L00K646j253k311k648p92K968M306M357J461j520m759m265j163k352
3273a710j799j829L477M33j333K01J243m08J119K287L194K155k07l080k138j345
3257B60j689O95K89j859P80M357J020k136p51K162p32j541m343m198K824Q102
3241C240Q33k083o3J259O8k986m899J971J98L319K199K510J321k317k086j690
3225G94K667J466L014m70m154j857j81L072J536k012K411o85j83K050k52l846
$$ plain form
3339 -4090 -2884 2700 4764 4565 7853 6764 3403 -581 -2066 -1246 -4268 -4104 -3635 -2831 560 2918
3323 2918 4868 5153 5302 4079 2903 -173 -2799 -2516 -1954 -405 1999 2204 1875 2083 3137 1038 1749
3306 1749 2026 1981 4151 6077 7580 6948 4622 4258 4772 7175 7295 9063 6483 -524 -4304 -382 2465
3289 2465 3315 3615 6261 5008 2697 49 -743 2225 6531 10888 12349 10829 6070 1805 642 -1710
3273 -1710 -3509 -5338 -1861 -1428 -2761 -2560 -1317 -1725 -606 1681 4875 7030 6823 3743 1605 260
3257 260 -1429 -734 -445 -2304 -1524 2833 3853 1717 966 3128 2396 855 -3488 -7686 -4862 3240
3241 3240 4073 1990 1927 3186 3254 268 -4631 -2660 -2462 857 3056 5566 6887 4570 2484 794
3225 794 3461 4927 7941 7471 3317 1460 1279 4351 5887 3875 6286 5601 5418 7468 7216 3370
3209C370l202K342P01k519m460p41L01K232P69N34K058j905k793K635L252k294
3193B80k359K923J445J035O17r25j883j04j737p8k011O08j406j9J776K394k035
3176a479K164J975n90l382k597MP53J039O73J020m876K218K942K321J408j135
3160B458j732o130o50L952j325r59J865J288j192l889Q13M295K899L00J152J874
3144E019l572j828L246R00p88l194J038m129l938J36J852l002k671K352J632J646
3128e301J092J994m33L560J432o88j054K979J347j291J694q45k557K89q64j974
3112f20J231M205J184J97l067l201l307J58M83M053K930N17M69Q31q52k947O32
3095B896J045M001j376n531p96R00j991j389K117Q75R10J188m878j062K439M33
$$ plain form
3209 3370 168 2510 3211 692 -3768 -4509 -4208 -1976 -1207 -673 1385 -520 -3313 -678 2574 280
3193 280 -2079 844 2289 3324 3941 3016 1133 1029 -708 -786 -2797 -2189 -3595 -3614 -1838 556 -1479
3176 -1479 685 2660 2070 -1312 -3909 -3905 -3152 -2113 -1440 -420 -5296 -3078 -136 2185 3593 2458
3160 2458 726 -5404 -6054 -2102 -3427 -4386 -2521 -1233 -2425 -6314 -5501 -1206 1693 1993 3145 5019
3144 5019 1447 -381 2865 3765 2977 -217 821 -3308 -7246 -7110 -5258 -8260 -10931 -8579 -6947 -5301
3128 -5301 -4209 -2215 -2648 912 2344 1656 602 3581 4928 3637 5331 4486 1929 2218 1354 -620
3112 -620 611 4816 6000 6197 3130 -71 -3378 -3220 -2737 1316 4246 4763 5232 6063 5211 2264 2896
3095 2896 3941 7942 6566 1035 239 1139 -852 -2241 -124 751 1661 2849 -2029 -3091 -652 -219
3079b19Q06m95J065J681O47k320k883p01N86L48m17j651Q73L885J361k040n177
3062d651K747M831p84j21r53L431j538m484O50k49j761O48N22K294K79J488m17
$$ plain form
3079 -219 587 92 1157 2838 3485 1165 -1718 -2419 -1833 -1485 -1902 -3553 -2680 1205 2566 526 -4651
3062 -4651 -1904 2927 2143 2022 1069 4500 2962 -1522 -872 -1121 -2882 -2234 -1712 582 861 2349 1932
$$ [...]
##END NTUPLES=NMR SPECTRUM
##END=
