##TITLE=Analysis number 320291
Compound Code cc 43413
Book Reference 484/52/6
Project Code adrs
Chemist Name laurenf
##JCAMPDX= 6.0         $$ Bruker NMR JCAMP-DX V2.0
##DATA TYPE= NMR SPECTRUM
##DATA CLASS= NTUPLES
##ORIGIN= Bruker BioSpin GmbH
##OWNER= nmr
$$ XWIN-NMR		Version 3.5
$$ Wed Jun 21 08:46:03 2006 GMT Daylight Time (UT+1h)  MAYBRIDGE\nmr@NMR_250MHZ
##.OBSERVE FREQUENCY= 250.131544655141
##.OBSERVE NUCLEUS= ^1H
##.ACQUISITION MODE= SIMULTANEOUS (DQD)
##.ACQUISITION SCHEME= undefined
##.AVERAGES= 16
##.DIGITISER RES= 18
##SPECTROMETER/DATA SYSTEM= dpx250
##.PULSE SEQUENCE= zg30
##.SOLVENT NAME= CDCl3
##.SHIFT REFERENCE= (INTERNAL, CDCl3, 0, 16.522)
##AUDIT TRAIL= $$ (NUMBER, WHEN, WHO, WHERE, WHAT)
$$ ##TITLE= Audit trail, XWIN-NMR		Version 3.5
$$ ##JCAMPDX= 5.01
$$ ##ORIGIN= Bruker BioSpin GmbH
$$ ##OWNER= nmr
$$ C:\u/data/dgb/nmr/ADRS/1140/pdata/1/auditp.txt
$$ ##AUDIT TRAIL=  $$ (NUMBER, WHEN, WHO, WHERE, WHAT)
(   1,<2006-06-21 08:45:39.32 +100>,<MAYBRIDGE\nmr>,<NMR_250MHZ>,
      <created by zg, POWCHK disabled, PULCHK disabled
       configuration hash MD5:
       E2 DF 36 D8 04 B2 41 60 5A D7 A3 38 5A 4B D0 FE
       data hash MD5: 64K
       CB 77 31 F7 B8 37 FC E0 FB C5 69 8B EC 00 AF B4>)
(   2,<2006-06-21 08:45:53.82 +100>,<MAYBRIDGE\nmr>,<NMR_250MHZ>,
      <Start of raw data processing
       ef LB = 0.3 FT_mod = 6 PKNL = 1 SI = 32K 
       data hash MD5: 32K
       FB 0D 6C 6D 9B CC CB 6F 59 4F D9 2B 85 33 27 B2>)
(   3,<2006-06-21 08:45:55.41 +100>,<MAYBRIDGE\nmr>,<NMR_250MHZ>,
      <apk 
       data hash MD5: 32K
       C0 8F 6E F4 C7 30 97 BB C0 80 DE 2C 65 3C 5E 97>)
(   4,<2006-06-21 08:45:56.16 +100>,<MAYBRIDGE\nmr>,<NMR_250MHZ>,
      <abs ABSG = 5 
       data hash MD5: 32K
       E5 6B BD A5 E9 15 79 13 AC B9 63 BF 14 FA B3 C3>)
$$ ##END=
$$ 
$$ hash MD5
$$ 88 86 44 C2 BF 57 49 B1 53 EF 6F 72 33 7F 21 0B
##$RELAX= 
##$RELAX= 
##$RELAX= 
##$RELAX= 
##$RELAX= 
##$RELAX= 
##$RELAX= 
$$ Bruker specific parameters
$$ --------------------------
##$DU= <C:\u>
##$EXPNO= 1140
##$NAME= <ADRS>
##$PROCNO= 1
##$TYPE= <nmr>
##$USER= <dgb>
##$AMP= (0..31)
100 100 100 100 100 100 100 100 100 100 100 100 100 100 100 100 100 100 
100 100 100 100 100 100 100 100 100 100 100 100 100 100 
##$AQSEQ= 0
##$AQ_mod= 3
##$AUNM= <au_zg>
##$AUTOPOS= <4 >
##$BF1= 250.13
##$BF2= 250.13
##$BF3= 250.13
##$BF4= 250.13
##$BF5= 500.13
##$BF6= 500.13
##$BF7= 500.13
##$BF8= 500.13
##$BYTORDA= 1
##$CFDGTYP= 0
##$CFRGTYP= 5
##$CHEMSTR= <none>
##$CNST= (0..31)
1 1 145 1 1 1 1 1 1 1 1 1 1 1 1 1 1 1 1 1 1 1 1 1 1 1 1 1 1 1 1 1 
##$CPDPRG= <>
##$CPDPRG1= <>
##$CPDPRG2= <>
##$CPDPRG3= <>
##$CPDPRG4= <mlev>
##$CPDPRG5= <mlev>
##$CPDPRG6= <mlev>
##$CPDPRG7= <mlev>
##$CPDPRG8= <mlev>
##$CPDPRGB= <>
##$CPDPRGT= <>
##$D= (0..31)
0 1 0 0 0 0 0 0 0 0.06 0 0 0 0 0 0 0.0002 0 0 0 0 0 0 0 0 0 0 0 0 0 0 
0 
##$DATE= 1150875938
##$DBL= (0..7)
120 120 120 120 120 120 120 120 
##$DBP= (0..7)
150 150 150 150 150 150 150 150 
##$DBP07= 0
##$DBPNAM0= <>
##$DBPNAM1= <>
$$ [...]
##$SUBNAM7= <"">
##$SUBNAM8= <"">
##$SUBNAM9= <"">
##$SW= 20.6930455092707
##$SWIBOX= (0..15)
0 0 3 0 0 0 0 0 0 0 0 0 0 0 0 0 
##$SW_h= 5175.983436853
##$TD= 65536
##$TD0= 1
##$TE= 294.16
##$TE2= 300
##$TE3= 300
##$TEG= 300
##$TL= (0..7)
0 120 120 120 120 120 120 120 
##$TP= (0..7)
150 150 150 150 150 150 150 150 
##$TP07= 0
##$TPNAME0= <>
##$TPNAME1= <>
##$TPNAME2= <>
##$TPNAME3= <>
##$TPNAME4= <>
##$TPNAME5= <>
##$TPNAME6= <>
##$TPNAME7= <>
##$TPOAL= (0..7)
0.5 0.5 0.5 0.5 0.5 0.5 0.5 0.5 
##$TPOFFS= (0..7)
0 0 0 0 0 0 0 0 
##$TUNHIN= 0
##$TUNHOUT= 0
##$TUNXOUT= 0
##$USERA1= <user>
##$USERA2= <user>
##$USERA3= <user>
##$USERA4= <user>
##$USERA5= <user>
##$V9= 5
##$VALIST= <valist>
##$VCLIST= <CCCCCCCCCCCCCCC>
##$VD= 0
##$VDLIST= <DDDDDDDDDDDDDDD>
##$VPLIST= <PPPPPPPPPPPPPPP>
##$VTLIST= <TTTTTTTTTTTTTTT>
##$WBST= 1024
##$WBSW= 4
##$XGAIN= (0..3)
0 0 0 0 
##$XL= 0
##$YL= 0
##$YMAX_a= 375561
##$YMIN_a= -568946
##$ZGOPTNS= <>
##$ZL1= 120
##$ZL2= 120
##$ZL3= 120
##$ZL4= 120
##$ABSF1= 16.522
##$ABSF2= -4.171173
##$ABSG= 5
##$ABSL= 3
##$ALPHA= 0
##$AQORDER= 0
##$ASSFAC= 0
##$ASSFACI= 0
##$ASSFACX= 0
##$ASSWID= 0
##$AUNMP= <proc_1d>
##$AZFE= 0.1
##$AZFW= 0.1
##$BCFW= 0
##$BC_mod= 0
##$BYTORDP= 0
##$COROFFS= 0
##$CY= 12.5
##$DATMOD= 1
##$DC= 0
##$DFILT= <>
##$DTYPP= 0
##$F1P= 14.0000005364418
##$F2P= -0.99999901652339
##$FCOR= 0.5
##$FTSIZE= 32768
##$FT_mod= 6
##$GAMMA= 0
##$GB= 0
##$INTBC= 1
##$INTSCL= 1
##$ISEN= 128
##$LB= 0.3
##$LEV0= 0
##$LPBIN= 0
##$MAXI= 10000
##$MC2= 0
##$MEAN= 0
##$ME_mod= 0
##$MI= 0
##$NCOEF= 0
##$NC_proc= -4
##$NLEV= 6
##$NOISF1= 0
##$NOISF2= 0
##$NSP= 0
##$NTH_PI= 0
##$NZP= 0
##$OFFSET= 16.522
##$PC= 1
##$PHC0= 174.2265
##$PHC1= 4.391262
##$PH_mod= 1
##$PKNL= yes
##$PPARMOD= 0
##$PSCAL= 4
##$PSIGN= 0
##$REVERSE= no
##$SF= 250.13
##$SI= 32768
##$SIGF1= 0
##$SIGF2= 0
##$SINO= 400
##$SIOLD= 32768
##$SREGLST= <1H.CDCl3>
##$SSB= 0
##$STSI= 32768
##$STSR= 0
##$SW_p= 5175.98343685301
##$SYMM= 0
##$S_DEV= 0
##$TDeff= 65536
##$TDoff= 0
##$TI= <Analysis number 999999
Compound Code 99
Book Reference 9
Project Code 9>
##$TILT= no
##$TM1= 0
##$TM2= 0
##$TOPLEV= 0
##$USERP1= <user>
##$USERP2= <user>
##$USERP3= <user>
##$USERP4= <user>
##$USERP5= <user>
##$WDW= 1
##$XDIM= 32768
##$YMAX_p= 272154735
##$YMIN_p= -119360
$$ End of Bruker specific parameters
$$ ---------------------------------
##NTUPLES= NMR SPECTRUM
##VAR_NAME=  FREQUENCY,     SPECTRUM/REAL,   SPECTRUM/IMAG
##SYMBOL=    X,             R,               I
##VAR_TYPE=  INDEPENDENT,   DEPENDENT,       DEPENDENT
##VAR_FORM=  AFFN,          ASDF,            ASDF
##VAR_DIM=   32768,         32768,           32768
##UNITS=     HZ,            ARBITRARY UNITS, ARBITRARY UNITS
##FACTOR=    0.157963299565203, 1,           1
##FIRST=     4132.6476996994, 0,             0
##LAST=      -1043.33573715361, 0,           0
##MIN=       -1043.33573715361, -119360,     0
##MAX=       4132.6476996994, 272154735,     0
$$ Real data points
##PAGE= N=1
##DATA TABLE= (X++(R..R)), XYDATA
$$ [...]
18490B26548Q316K6471K1126L7722K9026M5585Q7316Q8564J12695J40176Q4374
18479I07919N1051M3532N5846L131n5913l3509j2642M05K8925P1560J19526J11155
18467A290986Q8560O9966R2544M1366r009l1233p924j2273k180L1653P9788R8895
18455A731139J29116J81490K25118K15761K68419L92513N02261O29899R77459
18446E253175J583521K424286L232564L584731L911125M521478M694058L618491
18438C2823429K319424K207899J118918j835423k739228r87514L50235R6119p1091
18429C3282768J264197K350442J829668Q86450Q86004k54546l387736m614893
18421C2242354l494568k945188l499887l838370l031745k006122j356446r54250
$$ y = [226548, 234864, 261335, 282461, 320183, 349209, 394794, 482110, 570674, 683369, 823545, 907919, 958970, 1002502, 1058348, 1061479, 1005566, 972057, 959415, 959820, 988745, 1060305, 1179831, 1290986, 1379546, 1449512, 1542056, 1583422, 1574413, 1543180, 1535256, 1522983, 1520803, 1552456, 1632244, 1731139, 1860255, 2041745, 2266863, 2482624, 2751043, 3143556, 3645817, 4275716, 5253175, 6836696, 9260982, 12493546, 16078277, 19989402, 24510880, 29204938, 32823429, 35142853, 37350752, 38469670, 36634247, 33895019, 32907505, 33257740, 33353859, 33282768, 34546965, 36897407, 38727075, 39613525, 40499529, 40244983, 36857247, 32242354, 28747786, 25802598, 22302711, 18464341, 15432596, 13426474, 12070028, 11115778]
18413A1115778p50565o10032m45142l46053k35698j79117q3045J1175O3974J59435
18403H700710L52200N02567P51822J321165K187541L165899L655071L897343M546165
18394B9080483N002095M112179K483032K194144J438279j574645l367050j662093
18386C7706424P6251L1786m03587Q59746K333388K136091R76154Q64670J3829
18377D4594752l081638n144827m191132l379592l749877m272585l532905k333299
18369A4908897j567144j138598q59473o88822o18306n59623m54675l88497l45778
18360H287981l65482l28151k85888k32147k40543k39188k16192j98098k06867
18351E975425k12493j78137k01734k17109j78104j42310j20421r8324j36159j36434
$$ y = [11115778, 10365213, 9755181, 9310039, 8963986, 8728288, 8549171, 8466126, 8477301, 8541275, 8700710, 9052910, 9555477, 10307299, 11628464, 13816005, 16981904, 20636975, 24534318, 29080483, 34082578, 38194757, 40677789, 42871933, 44310212, 42735567, 39368517, 37706424, 37782675, 37814461, 37410874, 38270620, 40604008, 42740099, 43716253, 44580923, 44594752, 41513114, 36368287, 32177155, 28797563, 25047686, 20775101, 17242196, 14908897, 13341753, 12203155, 11343682, 10654860, 10036554, 9476931, 9022256, 8633759, 8287981, 7922499, 7594348, 7308460, 7076313, 6835770, 6596582, 6380390, 6182292, 5975425, 5762932, 5584795, 5383061, 5165952, 4987848, 4845538, 4725117, 4626793, 4490634, 4354200]
18341D354200j05939r6512q6711q7560r7802q1767p8277q6698p8805j08828q6934
18330C358367p4479p6549n4856o8204m1829q2240j08218o0936n5004m0018m8287
18319B647747n7677p0060l7312l2242n4440q2421m6026n2753p4210m8834k6629
18308B065143n5043n3956l9559n0623p071n1666k6392m0340m8084m7837m6510
18297A598062q927j4594m6058m4434m3708m1727m6958k7142l4040l6610N118l7893
18285A221089j9644p193l6457k4420j5050j1087k6662m5409l6579L634j2225j0726
18273I79271j2945p494j175k9440k2461k2142k1282j6998Q961r798k4916j6147
18261H03434K151m458j7960l3329k724R376l8384k5523k7301j3355j6686J1920
$$ y = [4354200, 4248261, 4151749, 4065038, 3977478, 3879676, 3797909, 3719632, 3632934, 3554129, 3445301, 3358367, 3283888, 3207339, 3152483, 3084279, 3042450, 2960210, 2851992, 2791056, 2736052, 2696034, 2647747, 2590070, 2520010, 2482698, 2450456, 2396016, 2313595, 2267569, 2214816, 2140606, 2091772, 2065143, 2010100, 1956144, 1916585, 1865962, 1858891, 1807225, 1780833, 1740493, 1692409, 1644572, 1598062, 1589135, 1574541, 1528483, 1484049, 1440341, 1398614, 1351656, 1324514, 1290474, 1253864, 1258982, 1221089, 1201445, 1194252, 1157795, 1133375, 1118325, 1107238, 1080576, 1035167, 998588, 1002222, 989997, 979271, 966326, 958832, 957657, 928217, 905756, 883614, 862332, 845334, 854295, 844497, 819581, 803434, 805585, 801127, 783167, 749838, 747114, 756490, 718106, 692583, 665282, 651927, 635241, 647161]
18249F47161j6146l1733n3177m841K6605j6452J1077M508r072j3084r855j2789
18237E22202o691P676J263j3229n675j1038n819j700l7473j0962N730j5328J395
18224D30351R16j5126j287P513L7693l1138l0511n1254k1289J0053j0472j804
18212C23645l704K465j1803k1435K3109O080Q685j0466j5866J6690O012k8857
18200B94555k5237l1664M123J1596J5567P440J2126k8759k5717k1507J0011k662
18188B19872k6351n16K9963J3165j4120J3346J3696O429o364l9855n511R924P127
18175B20805l1071j3286K2446P042j1342j9790n813j4263p77o519K5004P053J9347
18162A98836P284Q79O315L33j0321J8442k4169m9634k3057M5111L7946j2072j5357
$$ y = [647161, 631015, 599282, 546105, 541264, 567869, 551417, 562494, 567002, 557930, 544846, 534991, 522202, 515511, 523187, 524450, 511221, 505546, 494508, 488689, 486989, 449516, 438554, 444284, 428956, 430351, 431267, 416141, 414854, 422367, 460060, 428922, 398411, 347157, 325868, 335921, 325449, 323645, 319941, 322406, 310603, 289168, 312277, 318357, 327042, 316576, 300710, 317400, 323412, 294555, 269318, 237654, 241777, 253373, 268940, 276380, 288506, 259747, 234030, 212523, 222534, 219872, 193521, 193005, 222968, 236133, 222013, 235359, 249055, 255484, 249120, 209265, 203754, 213678, 220805, 189734, 176448, 198894, 205936, 194594, 174804, 168991, 154728, 153951, 147432, 172436, 179489, 198836, 206120, 206999, 213314, 213647, 203326, 221768, 197599, 147965, 124908, 170019, 207965, 195893, 180536]
18149A80536K1670J4442K3438L238k6958l1336k1063L4428J5074k1286m905P876
18137A95154j1766K0094L8104J3444K4913M9525J0165J0352j044M3072P0748M2037
18125E04798K7124M9757O9179J17706J22304J46693J84575L34241N02476O99862
18115B758715J122774K029162L917053O906168P343576L931458L097536N9156
18107C1165598p951338r078718m687937k354716j334007q33808n69224l75844
18099C980006k44358j81935j50077k14002k43756j56791j05742q5692j06662j24109
18089B366882q4154m5770m4545m0166o2293o6514p2881n8750l2359m0938o3055
18078A755457j28679j14667p4873n2700m2705p6482q2601k7406k3022k5347j6394
$$ y = [180536, 202206, 216648, 240086, 243324, 216366, 185030, 163967, 198395, 213469, 192183, 187278, 195154, 183388, 203482, 241586, 255030, 279943, 329468, 339633, 349985, 348941, 392013, 462761, 504798, 531922, 581679, 650858, 768564, 890868, 1037561, 1222136, 1556377, 2058853, 2758715, 3881489, 5910651, 9827704, 16733872, 24077448, 28008906, 31106442, 31165598, 23214260, 14135542, 9447605, 7092889, 5758882, 4925074, 4355850, 3980006, 3735648, 3553713, 3403636, 3189634, 2945878, 2789087, 2683345, 2597653, 2490991, 2366882, 2282728, 2236958, 2192413, 2152247, 2089954, 2023440, 1950559, 1891809, 1859450, 1818512, 1755457, 1626778, 1512111, 1437238, 1384538, 1341833, 1265351, 1182750, 1155344, 1132322, 1106975, 1090581]
18067A090581l7783m8827l0251l3300k4581L643j6134p492O9842N3491M2833M2442
18055A104464N9560N8550Q563K1196L4093J0913P111J1J827J5927j8803l2711
18043A270701j5329j9849R56J6261J7665l9193q7315o1560l1107j9223p5610r7113
18031H59284m9438j5603n6968n5760l7698k9609k8857l9726n8135n0718l4476
18020D02296O47j0626J0280N305L601L316j9288K0283k8083l8105O104k964m2929
18007C09837k7001J2545R377j7085n510l7504J6736k6848k5635J7927J4088J0149
17995B51076r505r163J6175n4411j7916j2329J171J5290K3043J7877M467K6715
17983B52490j203k1545l0801J5593J4756J1272K9289o724k1907k7271j8073k5489
$$ y = [1090581, 1052798, 1003971, 973720, 940420, 915839, 919482, 903348, 895856, 965698, 1019189, 1062022, 1104464, 1164024, 1222574, 1231137, 1252333, 1286426, 1297339, 1304450, 1304461, 1306288, 1322215, 1303412, 1270701, 1255372, 1235523, 1236479, 1252740, 1270405, 1231212, 1143897, 1082337, 1051230, 1032007, 956397, 859284, 809846, 794243, 737275, 681515, 643817, 614208, 585351, 545625, 487490, 436772, 402296, 402943, 392317, 402597, 407902, 411503, 414819, 395531, 415814, 387731, 349626, 355730, 352766, 309837, 282836, 295381, 304758, 287673, 282163, 244659, 261395, 234547, 208912, 226839, 240927, 251076, 241571, 232408, 248583, 194172, 176256, 163927, 165098, 180388, 203431, 221308, 225775, 252490, 251287, 229742, 198941, 214534, 229290, 240562, 269851, 263127, 241220, 213949, 195876, 170387]
17971A70387q893J6652Q191j1549k804j056m087j9305k4816q971J2154j5642j1032
17958I9229M946K7684K1381K2965j9957k0629k5138m403J6793J3789J1984J1978
17946A60622j8561P590J2239M5280J6551K2980M053N349J2680K2069m264m9660
17934B36928k5168j908J9169K8083J0521k390J845O511J7924J467p632l7112l0945
17921B17293k0412j1097q424m5461j8389J9694k9024j6327k197n039j1104j0078
17909E9435O565J2625k937J7848q08m708J5490j698j7352o503N5567O5599L3460
17896B32583k409k0011O176L0520O261J0049J2439n462n463J0321L355R652o618
17883B81393k5974j3065L4894K6588K0116k2703n7567l3308p879k7617l2406k3496
$$ y = [170387, 161494, 178146, 186337, 174788, 171984, 170928, 166841, 147536, 122720, 113749, 125903, 110261, 99229, 104175, 131859, 153240, 176205, 156248, 135619, 110481, 106078, 122871, 136660, 148644, 160622, 142061, 149651, 161890, 207170, 223721, 246701, 250754, 256103, 268783, 290852, 286588, 236928, 211760, 209852, 229021, 257104, 267625, 265235, 267080, 273591, 291515, 292982, 285350, 248238, 217293, 196881, 185784, 177360, 131899, 113510, 133204, 104180, 87853, 85656, 80617, 69513, 59435, 66000, 78625, 75688, 93536, 92728, 88020, 103510, 101812, 84460, 77957, 133524, 199123, 232583, 230174, 210163, 216339, 246859, 253120, 263169, 275608, 270146, 264683, 275004, 278359, 288011, 281393, 255419, 242354, 277248, 303836, 323952, 301249, 243682, 210374, 202495, 174878, 142472, 118976]
17871A18976l644k9743R11L693j6386j7119P307r089l99j174l2472r507L0879
17858D2233J9331p818j4690K3272M98j237N606j5794q451O987r934q786K3726
17845E4943J8429J8322L656m286J4837M1648j3598m1969j8861j5472r388k088
17833D6173J0581j034j620L3183L3046k7860k5377K49j4627j167q6J7956N520
17820G4937o998O319R581j646j081J502J1669P233j5552K109J270p20Q027k831
17806I3819L441k1100l858N805q709J587o339J7234k2153n822K3677j9425P389
17793F5546j3947k6639M785L1668j9087q966m169J6541K5376o76l089m616O728
17780F9455j4187r546J3609q099j3668j1710j287J2243L3013J0057L5610J5536
$$ y = [118976, 115332, 85589, 86500, 90193, 73807, 56688, 63995, 54906, 54507, 53333, 20861, 11354, 42233, 61564, 53746, 39056, 62328, 62826, 61589, 67195, 51401, 42950, 49937, 40003, 31217, 54943, 73372, 91694, 95350, 91064, 105901, 147549, 133951, 91982, 73121, 57649, 48261, 46173, 56754, 55720, 54100, 87283, 120329, 92469, 67092, 67341, 52714, 51547, 51461, 69417, 74937, 67939, 74258, 83839, 82193, 81112, 82614, 94283, 101516, 85964, 88073, 89343, 88623, 96650, 93819, 97260, 76160, 72302, 78107, 69398, 70985, 64646, 81880, 59727, 53905, 77582, 58157, 65546, 51599, 24960, 29745, 61413, 42326, 33360, 29191, 45732, 71108, 70432, 67343, 62727, 69455, 55268, 45722, 59331, 51232, 37564, 25854, 24567, 36810, 69823, 79880, 115490, 131026]
17768A31026j7342k3055l5354j4909K5686L8739P327o652j2713r177n527l7945
17756D0104K1930j200m800p180J8651r157J121l207j6076k6256k7938j79J9571
17743E384o932k8264M85l369j0390P777K2278P808L784K6447M736j6833m232k2045
17729a3366O160N283K8655j7058j2163j9156k590J6011J8854k3565J0384K8828
17717B6277K5778k901K7884N4035O3838N3639J1780k3382l4100k6188k5149k9658
17705A21853o1564l5693J6614L736j5921K1662j4430j5381R862L6748P036K4356
17693I8878j6421r557o537j2528l2633J9017m860J1361L0556L3644P2311N4072
17681B37303M2498L3742j0198o809k0493o4349m9923m5305k8116O20M594P912
$$ y = [131026, 113684, 90629, 55275, 40366, 66052, 104791, 112118, 105466, 92753, 83576, 78049, 40104, 62034, 60834, 56034, 48854, 67505, 58348, 59469, 56262, 40186, 13930, -14008, -14187, 5384, -1548, -29812, -29327, -32696, -43086, -35309, -13031, -5223, -1439, 25008, 29744, 12911, 8679, -13366, -7206, -1923, 26732, 9674, -2489, -21645, -24235, -8224, 10630, -12935, -2551, 26277, 52055, 49154, 77038, 131073, 194911, 248550, 260330, 236948, 202848, 176660, 151511, 121853, 60289, 24596, 41210, 44946, 29025, 50687, 36257, 20876, 30738, 67486, 74522, 98878, 82457, 72900, 66363, 53835, 21202, 40219, 35359, 46720, 77276, 110920, 183231, 237303, 279801, 313543, 303345, 296536, 276043, 211694, 161771, 116466, 88350, 88970, 93564, 101476]
17669A01476J7771K5159L9729P6866K2454r714l4662l6418k3737o360l2441l7908
17657A02215k7343N007P268O766j2285j5016k6283l081j7326j1029K1046L2149
17645F2088p233j2307J1811n964k8297K5818N4314L2789N4794J8607J8761J4134
17633B39315R693n7811k5000j9494m1267l2681j9399l5928N455J4423P586L14
17621D5206k3428m1590J845O395L105J6332J7624J2470J1102N48m0746j8648K6787
17608A7002P867M683o860n920m999O889J5024L752K0050N183j0470k3328j998
17595B6875j8995k7544J4901L4121n877j4735o909k5848K9580N5571K2994k2705
17583F1429l3829l6083j8111q820M4598K1325r142J1260K4064K1332k0128m4900
$$ y = [101476, 119247, 144406, 184135, 261001, 283455, 273741, 239079, 202661, 178924, 172564, 140123, 102215, 74872, 79879, 87147, 93913, 81628, 66612, 40329, 37248, 19922, 8893, 29939, 62088, 54855, 42548, 54359, 48395, 20098, 45916, 100230, 133019, 187813, 206420, 225181, 239315, 249008, 191197, 166197, 146703, 105436, 72755, 53356, 17428, 22883, 37306, 44892, 45206, 21778, -19812, -17967, -11572, -8467, 7865, 25489, 37959, 49061, 49609, 8863, -9785, 17002, 24869, 29552, 22692, 16772, 11773, 18662, 33686, 37438, 57488, 62671, 52201, 28873, 26875, 7880, -19664, -4763, 29358, 23481, 8746, 1837, -24011, 5569, 61140, 84134, 61429, 27600, -8483, -26594, -35414, 9184, 30509, 21367, 32627, 56691, 78023, 57895, 12995]
17571A2995J7280J3790j350m5893j2127K9352j79j9107J8740J6412J7767J0481
17559E8161j2254l0946j3326p932J141j2847J777J6023P616J5162K049m0207m8424
17546f4007j1013L3664L6486L174n387j7280Q69j0041J4864o983j313l135K278
17533b7824K3365j6178k544k540m791k05J1050j564O374j7356j8673q978O853
17520e3011J7295O329J5269j4061J6149J3582O873p85K739J1275R257n078k8861
17507c028k0724R924N071j5139o197L5006P215j8842j2824K4238M0029l7508k0799
17494a3578J4787J7662N069j1209k6272R083M005j2890r959K2492J5071p459l6039
17481b9237k0410l621M1002K292p358J8087K4995Q201n292k4629J7596K1944l413
$$ y = [12995, 30275, 44065, 42715, -3178, -15305, 14047, 13868, -5239, 13501, 29913, 47680, 58161, 45907, 14961, 1635, -6297, -5156, -18003, -16226, -203, 7413, 22575, 24624, -15583, -64007, -75020, -41356, -4870, -1696, -7083, -24363, -23494, -33535, -18671, -25654, -26967, -30102, -27824, -4459, -20637, -23181, -25721, -30512, -30717, -19667, -21231, -14857, -32213, -50886, -59864, -53011, -35716, -29387, -14118, -28179, -12030, 1552, 8425, 7640, 10379, 21654, 30911, 25833, -3028, -23752, -13828, -8757, -23896, -30093, 4913, 12128, -6714, -19538, 4700, 44729, 7221, -13578, 1209, 18871, 23940, 12731, -13541, -4458, -453, -13343, -23302, -810, 14261, 6802, -29237, -49647, -53268, -12266, -9974, -17332, 755, 25750, 33951, 28659, 4030, 21626, 43570, 40157]
17468D0157j8434L565K625m835K307Q553l513o822p144l0818j7125J2146N863
17455a3475l44m669J2081L7193Q375j1313k2060K7275J3014J2268N1192M8683
17443A58220L7751m766n6961m7272p993j7021l1137r40J5854j1097j8372J5343
17431C1609J299J5109M123j5585j9895K43N512j5892J8671L2186n992P843m513
17418E4718j4166j1312J2440j5087l7536n379K8364j3244J2253K0112j2943o204
17406A2016p676O866K1286j0783k1679J8593Q145k2779k3878P317r986Q121M8963
17393C4526J0423j6139j8679j3938p450l312K1209J3246M750j2837j1647p627
17381g475J181J1028K3102Q306j6708j0054m936q651k9806l5271P047K6860L2589
$$ y = [40157, 21723, 25288, 27913, 23078, 25385, 33938, 30425, 23603, 16459, -14359, -31484, -19338, -13475, -13819, -18488, -6407, 30786, 39161, 27848, 5788, 33063, 46077, 58345, 109537, 158220, 195971, 191205, 134244, 86972, 78979, 61958, 30821, 29881, 45735, 34638, 16266, 31609, 32908, 48017, 52140, 36555, 16660, 16903, 22415, 6523, 25194, 57380, 51388, 59231, 54718, 40552, 29240, 41680, 26593, -10943, -16322, 12042, -1202, 11051, 31163, 18220, 12016, 4340, 11206, 32492, 21709, 30, 18623, 26768, 3989, -19889, -12572, -22558, -14437, 34526, 44949, 28810, 10131, -3807, -11257, -14569, 6640, 19886, 24636, 11799, 152, -7475, -6294, 4734, 27836, 36142, 19434, 9380, 4444, -4207, -34013, -69284, -62237, -35377, -2788]
17368b788K9629J2164p883j112O212J1098j9045k4914m651L2446J4890J864j7088
17355C0822j7946K3743L0290j4866K4515J1850l4034l6664J7392M413k1625k1904
17343d014k227q938K7635K0104J6330j1523l1879k0107K433R20K2436o732r412
17330d974p023J8765J6965n868k3284J577J4941L914K6718j3484l9792l6575L453
17317d4667K8479K6334K0259j883j3725K5639N077q528K299R686O088J8243j2335
17304F0966j3033n807k4235k2610K7128m421P528N4684K7942l8250n2037J8656
17292C6511M5265n783j4576K041K1337q51j4438q262k6194K0860J9142j1062j4519
17279D9471L917J6313n308j0124J7071k1395j7500L5656J0130J2166K9607p227
$$ y = [-2788, 26841, 39005, 31122, 30010, 36222, 47320, 28275, 3361, -1290, 31156, 46046, 47910, 30822, 12876, 36619, 66909, 52043, 76558, 88408, 54374, 17710, 35102, 39515, 17890, -4014, -6241, -15179, 12456, 32560, 48890, 37367, 5488, -14619, -12186, -11266, 11170, 4438, -4974, -11997, 6768, 23733, 17865, -5419, -3842, 11099, 15013, 41731, 28247, -11545, -48120, -44667, -16188, 10146, 30405, 28522, 14797, 40436, 45513, 36985, 39284, 48970, 55058, 73301, 60966, 47933, 42126, 17891, -4719, 22409, 17988, 25516, 80200, 108142, 69892, 17855, 36511, 81776, 75993, 61417, 63458, 84795, 83944, 69506, 61244, 35050, 55910, 75052, 63990, 49471, 53388, 69701, 64393, 54269, 71340, 49945, 32445, 68101, 78231, 90397, 120004, 112777]
17267A12777k9824k6246j8166K9956K7797r948J989k335K3953k0841p473Q79j2897
17254F9621J6520J6034o158J2047J0745K3770J1354l1479k1022Q054P117K0341
17242A36944J3630J5803J7088j3009k1907j2893K7809L4434J9735O735j1654m677
17230B08038M0349K8302J8728j0882k955J8527N4474M9469j964J8458N8863N4554
17218E33961Q1278O6542R1275J10833J10156Q0253N6515N9383J02851J42356J51799
17207A587202K04989L37046M23794N73474P60792J100088J721558K710204M141545
17198A3560692N917770P498314Q204210P143502M398328N97335l640384o863123
17190C6816644p784466o909911n221242l460294k185930j427897r57767o75326
$$ y = [112777, 82953, 56707, 38541, 68497, 96294, 86346, 88335, 86000, 109953, 89112, 81639, 82518, 69621, 86141, 102175, 96017, 108064, 118809, 142579, 153933, 122454, 101432, 109486, 116603, 136944, 150574, 166377, 183465, 170456, 148549, 135656, 163465, 197899, 217634, 224369, 212715, 208038, 248387, 276689, 295417, 284535, 281580, 300107, 354581, 404050, 402086, 420544, 479407, 533961, 615239, 681781, 773056, 883889, 994045, 1074298, 1130813, 1190196, 1293047, 1435403, 1587202, 1792191, 2129237, 2553031, 3126505, 3887297, 4987385, 6708943, 9419147, 13560692, 19478462, 26976776, 35180986, 42324488, 46722816, 47320151, 43679767, 36816644, 29032178, 22122267, 16901025, 13440731, 11254801, 9826904, 8869137, 8193811]
17182H193811n16575m61795l68174k83877j81226p4698L7580J34256K74739M40411
17172G194452O68445J052452J694332K719217M191910N918813P383345P792299
17164C8615265O551552L741332j770l998930o752028p267979o129857m220201
17156B0537384k264554o44905Q77173K581199M436910O153844P111268O538191
17148D5326510M315710R48403k899347o115516p464332o902307n455644l851328
17140A7902149k571229j714877j205730q77022o66371n57253m90201m17132l44716
17131I057618k30563j04064Q523J34763K70978M54750P67190J318503K211328
17122A3889026L546944N171153O596139P299156O451183M012665N48207l282816
$$ y = [8193811, 7677236, 7215441, 6847267, 6563390, 6382164, 6307466, 6345046, 6479302, 6754041, 7194452, 7862897, 8915349, 10609681, 13328898, 17520808, 23439621, 30822966, 38615265, 45166817, 48908149, 48906379, 44907449, 38155421, 30887442, 24757585, 20537384, 18272830, 17627925, 18505098, 21086297, 25523207, 31677051, 38788319, 45326510, 49642220, 50590623, 47691276, 41575760, 34111428, 27209121, 21753477, 17902149, 15330920, 13616043, 12410313, 11533291, 10866920, 10309667, 9819466, 9402334, 9057618, 8827055, 8722991, 8731514, 8866277, 9137255, 9592005, 10359195, 11677698, 13889026, 17435970, 22607123, 29203262, 36502418, 42953601, 46966266, 47514473, 44231657]
17114D4231657o285595p241271o538833n074513l455820k263047j527219j093485
17106A0751874q10134o19203n02280l99993l03903k42653k05571k03730k43105
17097G221302k75394l25839l52828l74784l13609k44808k01961j91465j38915
17088D801699j51302j72552j58663j13663q5634j04958p3650n9007o7491p3602
17078C741177k7842M711Q509N9952J03754J24828J46509J47041J42149O8533k463
17067D516858m6612j65402k89338l01895l07571k75979j80278j32306j20785r6462
17057B600230p1739r5084j05301q1369k4148m7400n4717n9328k7328J6366J8367
17046B068549J4139N7582O6120O2020Q1822P6953M4690L4956K3617j2149n2365
$$ y = [44231657, 37946062, 30704791, 24165958, 19091445, 15635625, 13372578, 11845359, 10751874, 9941740, 9322537, 8820257, 8420264, 8116361, 7873708, 7668137, 7464407, 7221302, 6945908, 6620069, 6267241, 5892457, 5578848, 5334040, 5132079, 4940614, 4801699, 4650397, 4477845, 4319182, 4205519, 4119885, 4014927, 3941277, 3882270, 3814779, 3741177, 3713335, 3718046, 3726555, 3786507, 3890261, 4015089, 4161598, 4308639, 4450788, 4519321, 4516858, 4470246, 4304844, 4015506, 3713611, 3406040, 3130061, 2949783, 2817477, 2696692, 2600230, 2528491, 2433407, 2328106, 2246737, 2222589, 2175189, 2120472, 2061144, 2033816, 2050182, 2068549, 2082688, 2140270, 2206390, 2268410, 2350232, 2427185, 2471875, 2506831, 2530448, 2518299, 2465934]
17035B465934r9074j26580j25136q6849m7370m4364J5526L0611Q0859J13956P5125
17024B252638J3265j9082k9095j17859j52738j29369j08338j40240j11333j18722
17014A339127q7500k6343n4888n5684l7880k4718l4277k1880L923M525m559l3485
17002I66361j454L2051O5186Q5553P7250R8119Q5730J06503P4610N7257J7777
16991A664943k2335p5249j17285j21977j22153j29712j31923o9966k8331m1832
16981H04180m3069l8940k7016m3844k1068j6777k5840k2865j0895j524r47j2432
16969E38963K041l845p922j5701o997J0640n1677m4608k1055N508j568k3433j1605
16956C68741J6480j562l073K0709J4605m693j316M594m6234n4397O665r605J5964
$$ y = [2465934, 2366860, 2240280, 2115144, 2028295, 1980925, 1936561, 1952087, 1982698, 2063557, 2177513, 2252638, 2265903, 2246821, 2217726, 2099867, 1947129, 1817760, 1709422, 1569182, 1457849, 1339127, 1251627, 1225284, 1170396, 1114712, 1076832, 1052114, 1017837, 995957, 999880, 1004405, 999846, 966361, 964907, 996958, 1062144, 1147697, 1224947, 1323066, 1408796, 1515299, 1589909, 1647166, 1664943, 1642608, 1567359, 1450074, 1328097, 1205944, 1076232, 944309, 874343, 846012, 804180, 761111, 722171, 695155, 651311, 630243, 613466, 587626, 564761, 553866, 552342, 551395, 538963, 541004, 537159, 529237, 513536, 506539, 517179, 465502, 420894, 399839, 405347, 403779, 380346, 368741, 385221, 383659, 380586, 401295, 415900, 411207, 409891, 414485, 368251, 313854, 320519, 310914, 326878]
16943C26878L9362k9644k7781k854k089j2798j7119l8331K775J3768J2084k006
16931B62245o190K5147K1038J1565j5083k4042l6296r265p545J912R81l3212K0380
16918B11635J0643K017j1083J908K3234j747k7079l4450N445J0013Q161n975j2095
16905A80627K2606K0693O675j6549m0328n165K0456P407k7499m2155j3763r23
16893A12082K7429J3226L721P850j6674k3452J5532J7387k6658p336j2553m3347
16881F7207j6653J8234J4022L532K3757j9535p448J0407Q31K877J0864k3853O086
16868I0328k316K369p685J8336J0120k8056j8839L1423K4955M213K487P207L4809
16855A69351K276q230j7671m9854j9967L268K1010J870l3993k6766r789J1794
$$ y = [326878, 366240, 336596, 308815, 305961, 303872, 291074, 273955, 235624, 238399, 252167, 264251, 262245, 256055, 281202, 302240, 313805, 298722, 274680, 238384, 229119, 221574, 223486, 224467, 191255, 211635, 222278, 224295, 213212, 215120, 238354, 236607, 209528, 175078, 180523, 190536, 198697, 192722, 180627, 203233, 223926, 230601, 214052, 173724, 168559, 189015, 196422, 168923, 126768, 113005, 112082, 139511, 152737, 156458, 164308, 147634, 124182, 139714, 157101, 130443, 123107, 110554, 67207, 50554, 68788, 82810, 86342, 110099, 90564, 83116, 93523, 94354, 97231, 108095, 84242, 90328, 88012, 90381, 82696, 101032, 111152, 83096, 64257, 95680, 120635, 124848, 127335, 134542, 169351, 171627, 163397, 145726, 95872, 75905, 79173, 100183, 102053, 68060, 41294, 31505, 43299]
16843D3299k935k114J8356J9487R365k0389o474K834J7225L0217o773l1259p831
16830F3008K0375P313J109j4954J1452J7073K468j2330m197k8867m5264J1559
16818B8745J5709K1982R902o599P942J8958M893k448k785j2791k851k5792l2701
16805B2164K3541J9759k4109j6022q496n339l365q597k2983K5567N1360j070l0916
16792B1494p583p155N459J4730l277j0312M954L7012R583J1575j4108o125P993
16779F4240J7471J3615R47l1175k0911l5382j9780K8062k780o400K6166L2523
16767F6596j9834l9699k010J0022n465O678k996l048J3676L073o634j0773K2478
16754C2064M653k1550j2883k1474M349k0800L969L6024J4650L1083L4384j4554
$$ y = [43299, 40364, 38250, 56606, 76093, 85458, 65069, 58595, 61429, 78654, 108871, 102098, 70839, 63008, 83383, 90696, 91805, 76851, 88303, 105376, 107844, 95514, 91317, 62450, 17186, 28745, 44454, 66436, 76338, 69739, 77681, 96639, 101532, 99084, 96299, 83508, 80657, 54865, 22164, 45705, 65464, 41355, 25333, 16837, 11498, 8133, -464, -23447, 2120, 53480, 52410, 21494, 13911, 6756, 12215, 26945, 23668, 13356, 18310, 55322, 64905, 76480, 62372, 56247, 64240, 81711, 95326, 96273, 65098, 44187, 8805, -10975, 17087, 14307, 7907, 34073, 66596, 46762, 7063, 5053, 15075, 9610, 16288, 13292, 10244, 23920, 26993, 20359, 9586, 32064, 36717, 15167, 2284, -19190, -14841, -35641, -31672, 4352, 19002, 50085, 84469, 69915]
16742F9915l7451k2957k468l3241r663L1847l8m0879O613K4947Q551n371M500
16729e695j5277k911N507R058j0395k0432J3129J5453k426j2779L5928R982j7271
16716A871P893J5194J2689P488k8612k3978J973J7941O540j7795j6481k6277J1697
16703b9857J3333k328m719l6814J3689O3799L0237k2543K166J5012j1945r56J7155
16690D6229j3099l5136n61L3390L0017j9798l9447J8117Q439K0103k889L8763
16678H4128P2358J676k4271l2185O624K0158J9446M8057R852m804l961k2689j6883
16665A57506k2871l9567p226j4229l2014o742j0809L645J3064L672K602M460p076
16652D4415K6782J0704j1904R591J851l251l485J7133n426J2650J2580L4349L9093
$$ y = [69915, 32464, 9507, 7039, -26202, -35865, -4018, -4056, -44935, -38322, -13375, -4824, -10195, -5695, -20972, -23883, -18376, -9318, -19713, -40145, -27016, -11563, -13989, -26768, 9160, 19142, 1871, 9764, 24958, 37647, 45135, 16523, -7455, -5482, 12459, 18999, 1204, -15277, -41554, -29857, -16524, -18852, -23571, -60385, -46696, 17103, 47340, 24797, 26963, 41975, 30030, 29074, 46229, 33130, -2006, -2567, 30823, 60840, 41042, 1595, 19712, 28151, 48254, 45365, 84128, 156486, 158162, 133891, 101706, 108330, 128488, 147934, 195991, 205843, 201039, 197078, 174389, 157506, 134635, 95068, 87842, 73613, 41599, 34857, 24048, 27693, 40757, 44429, 47031, 51491, 44415, 71197, 81901, 69997, 79588, 81439, 78188, 74703, 91836, 86410, 99060, 111640, 145989, 185082]
16639A85082L1526n712k4093o6669j5933O3k736P309r749J1016L3521K9428K7832
16626B00885K5237M3982J3141k6430m1534m1975l1720k0367L878j0975k3924k6611
16614F3587n86l9990l055J175K3085J5435q557J4781k9749m133L1007J0134j5591
16601E7543k8795K7312M1877M3725N3856K3819j963J8590K6826k3793Q388j0446
16589B36939n0993q2830n6177j2267N196j596j8176j2928Q142J0210R70k257N548
16576B9781J1408R460p904k1922j2408J6990J4348o183O274l4091l0657M588K4771
16563D455K1528q677k1347l036K0239J1676l6293m2432J6218J1979l449K0488
16551h651K9035K498m440J2043J5508r141k3143k2171O650K2492N073k965J5069
$$ y = [185082, 216608, 210896, 186803, 120134, 104201, 104264, 101528, 108837, 99088, 110104, 143625, 173053, 200885, 226122, 270104, 283245, 256815, 215281, 173306, 141586, 121219, 125097, 114122, 90198, 63587, 63001, 23011, 19956, 21131, 44216, 59651, 51094, 65875, 36126, 31993, 63000, 73134, 57543, 28748, 56060, 97937, 141662, 195518, 219337, 217374, 235964, 262790, 238997, 247385, 236939, 185946, 103116, 46939, 34672, 39868, 38272, 20096, 7168, 15310, 25520, 26490, 24233, 29781, 41189, 50649, 42745, 20823, 8415, 25405, 39753, 33570, 39844, 5753, -24904, -20316, 4455, 25983, 17306, -4041, -7077, 13162, 24838, -11455, -53887, -37669, -25690, -29139, -8651, 20384, 22882, 18442, 30485, 45993, 36852, 13709, -8462, -1812, 20680, 25753, 22788, 37857]
16538C7857J082j6540J2832J063l0764k4388O606J3342k861M685K0417M748r053
16525A9026k2017m284j1250j4056j5426K630N969o159L3603L4856j0987M533J0431
16512B6869n16L6N775j9233M828J6340K1148q070k0833k1995Q564K5299q147j838
16498B8227n106P163k5676j7531k5676J986L665J2020L4611P20j4230J41k542
16485b228P924R514j8225n846R555j0599j1121K2507m119r413J6104O162J1953
16472B2168j8769j9143K2841L7073j0382j4961p608J0239k973J2052j233m397
16460B4907k3534j6354j5171n44k7283R233N672n089L3548J648M28o337k1872
16447d0748J2775p121k0295l29K7384J0299j4102J202r243k650J4875j1676J8625
$$ y = [37857, 38939, 22399, 35231, 36294, 5530, -18858, -12252, 1090, -1771, 2914, 23331, 28079, 19026, -2991, -7275, -18525, -32581, -48007, -45377, -39408, -45567, -11964, 22892, 11905, 16438, 26869, 26353, 26389, 32164, 12931, 17759, 34099, 55247, 47177, 26344, 4349, 12913, 38212, 30065, 28227, 23121, 30284, 4608, -12923, -38599, -36613, -32948, -20928, 13683, 14403, 173, 314, -2228, 5696, 15210, -3015, -8861, 694, -9905, -21026, 1481, -2638, -12051, 4053, 10215, 22168, 3399, -15744, 7097, 44170, 33788, 18827, 11219, 21458, 18485, 30537, 29304, 24907, 1373, -14981, -30152, -30696, -57979, -48746, -43074, -48163, -14615, -12967, -12539, -18876, -40748, -27973, -35094, -55389, -55718, -28334, -18035, -32137, -30935, -40178, -42828, -27953, -39629, -21004]
16434b1004J3702j0659j2935M093N594O615P261J5323l969k6498J4845L7791n742
16421B4417k2214j9986K562J8985k663L283J937j4844k6968M480l016j7945J8376
16408c3596K4167P258j1337N472K1090j5402j1062n4721p082J4749K7573K0162
16396a2729K1339L1928m0738P525L038l716j5000k3104j8125Q638K097J2323R584
16383a6940R068K5177j1397M041j3419j9139N908J7375R525j0932j5269N336J1992
16370A326k0843j4361J1098j376k728K8307J2666K0034j0739l5256j262l1025
16358d4159l170P091J9789j3656O567o36r033l564j7060L765J121L0690K7190
16345D935N555j0937R184K788J0636k0932m6699k3548J0667K0399j3438l3334
$$ y = [-21004, -7302, -17961, -30896, -26803, -21209, -14594, -7333, 7990, 4021, -22477, -7632, 30159, 24417, 2203, -17783, -15221, 3764, 1101, 4384, 6321, -8523, -35491, -31011, -34027, -51972, -33596, -9429, -2171, -13508, -8036, 13054, -2348, -13410, -68131, -75213, -60464, -32891, -12729, 8610, 40538, -200, 7325, 10363, 6647, -8353, -31457, -49582, -40944, -38847, -26524, -16940, -7872, 17305, 5908, 9949, -3470, -22609, -16701, 674, 10199, -733, -16002, -10666, 1326, -19517, -33878, -22780, -24156, -26884, 1423, 14089, 34123, 23384, -11872, -13134, -44159, -47329, -40238, -20449, -34105, -27538, -28174, -37207, -40771, -57831, -54066, -52945, -22255, 4935, 10490, -447, 8737, 11525, 22161, 1229, -45470, -69018, -58351, -37952, -51390, -84724]
16333h4724J1585M9604M220J047k77J4381q963q502J1011j2006p660L828K6570
16320A14m2836k2901k2363M5310K1159L3007K0096r60j3918j7190j393j6282j9771
16307c7928N945J8583L1485m8563k0824j7057J4300M4514l0419n959j6022j919
16295f3864N300P744J2094J4516o594K3480p080O414j0680r88K1002q432R790
16282B702J8294m368j4566K0631j7986k1272K084J474j1977r988j5122o468N698
16269e0864K0628l5674P182J1644o940l365K94J6390J8905j0875N85J8082k58
16256a4266m420J4950J5160M436j0482P548J2273k031K113L2405j2558o398k5771
16243A2959j3593j4164j1012j9881J864O891l2365j4635L1758R514K614K2091
$$ y = [-84724, -73139, -23535, -19315, -18268, -18545, -4164, -13127, -21629, -10618, -22624, -30284, -26456, 114, -42722, -65623, -87986, -42676, -21517, 11490, 31586, 30626, 16708, -482, -1875, -18157, -37928, -31983, -13400, 18085, -30478, -51302, -68359, -54059, -9545, -39964, -45923, -61945, -63864, -58564, -50820, -38726, -24210, -30804, -7324, -14404, -7990, -18670, -19658, 1344, -7088, 2702, 20996, 16628, 2062, 22693, 4707, -16565, -14481, -13007, -24984, -34972, -50094, -56562, -50864, -30236, -65910, -58728, -47084, -54024, -57389, -57095, -40705, -21800, -32675, -32090, -14008, -14266, -18686, -3736, 11424, 15860, 5378, 12926, 25199, 23168, 25281, 57686, 45128, 38730, 12959, -634, -14798, -25810, -45691, -43827, -36936, -69301, -83936, -52178, -42664, -40050, -17959]
16231a7959k0228q876m82j5167L8640J8517j5629k871l454o652L6840K5049j968
16218B5760N412j1804n189j2337j3472j2208P711n853j0908n860J0776k2113k1933
16205g2018L3321J6729J5789K9185L425k6195L24j1957k6150q863L3987R977j2322
16192a4768j4199J3617o740j3311j4670L183K408k931k6112K312K6848r976j6622
16179g0961j202K325l625P794n938j831L7133K7408p485k0343j5047r818K5698
16166c5892R905K727k1469J9763N69k125M1580J7236j9176j890j1071n420j7527
16153b2790R216L1293J6411o783n011q412l8772o015L1636M2927j6570q938j1593
16140F599l8439k5563O050q262j035M634L5417L1236J659L733L123j0451M818
$$ y = [-17959, -38187, -47063, -47545, -62712, -24072, -5555, -21184, -24055, -27509, -34161, 2679, 27728, 25760, 31172, 19368, 14179, 1842, -11630, -23838, -16127, -21980, -32888, -38748, -27972, -50085, -72018, -38697, -21968, -6179, 23006, 26431, 236, 560, -11397, -37547, -46410, -12423, -2446, -14768, -28967, -15350, -22090, -35401, -50071, -46888, -44480, -47411, -73523, -71211, -44363, -54339, -70961, -72163, -69838, -73463, -65669, -71607, -73438, -36305, -8897, -16382, -36725, -51772, -61590, -35892, -25987, -23260, -44729, -24966, -24397, -26522, 15058, 32294, 13118, 11228, 157, -5263, -22790, -13574, 17719, 34130, 27347, 22336, 13924, -24848, -30863, 773, 43700, 27130, 18192, 6599, -31840, -57403, -51353, -59615, -60650, -56016, -20599, 10637, 12296, 16029, 19152, 8701, 13519]
16127A3519j591k9637l141J7110J3645j3386k7703q122K4039J0810K2386M637
16115B2566j5494q20J5943k795l5094k9255J0904j222J103J9931j964j8387r377
16102d3961p364K99J9136j895j9621l628k176q361J9323O634J2914j9579n425
16089e3704K2141O938j6865r589J5614J0515k0551K7076K4758j1789M363J498
16077D05p136j9806J9234j969R516J0429Q106j3360j5803l5556j5893J8029M774
16064c9030K376p609J7578J2383O440j9886Q141M6591J1805j4638l0478k5232
16052c1559R225R364J7154m75k686j7045r18K0943m310j7379J8354L8125j8375
16039B0418l9593K340J2601J8314L0789n826j1871k8990j3517l500J5035L7948
$$ y = [13519, 11928, -17709, -20850, -3740, 9905, -3481, -31184, -39306, -15267, -4457, 17929, 22566, 7072, 6252, 22195, 19400, -15694, -44949, -34045, -35267, -34164, -14233, -16197, -34584, -43961, -51325, -51026, -31890, -33785, -53406, -57034, -59210, -67571, -48248, -41614, -28700, -48279, -53704, -31563, -24625, -41490, -51079, -35465, -24950, -45501, -18425, 6333, -5456, -1093, 405, -6731, -26537, -7303, -9272, 244, 10673, 18779, 5419, -10384, -45940, -61833, -43804, -39030, -36654, -44263, -26685, -14302, -7862, -27748, -19607, 26984, 38789, 24151, -6327, -31559, -22334, -12970, 4184, 3709, 1023, -16022, -16940, 4003, -307, -17686, 668, 38793, 20418, -19175, -16835, -4234, 14080, 44869, 39043, 27172, -1818, -15335, -18835, -3800, 34148]
16027C4148j4873j4464l0439L684Q103J9051j1130j2455R731Q468J4043P443k6270
16014d960K247m224l5327J166J6764J8634j6646m400k0680k2298K1797J2582n381
16001d0726J2328J1212J8152j6092j7463k5237R262J1415j9730l0782Q646J4468
15989f4547K274J8405L0493J3209r570j7652J2661p735j2034M067j248m526r162
15976d5365j1058J3445k519m382J3021m112J2496m741k2028J4682L4381O991j2074
15963a1263p704J4780K20N010r049q547J9624K5640L731p645l5052J5010p916
15950c161k3479J2918P307j6443N180j351k0829K3102L2337L1273r370m1181l0240
15937c3937n354q643K3417J8634J7889n93m971k3027n167J1935j7111o436j0875
$$ y = [34148, 19275, 4811, -25628, -21944, -13841, 5210, -5920, -18375, -8644, -176, 13867, 21310, -4960, -2713, -6937, -42264, -41098, -24334, -5700, -22346, -26746, -47426, -69724, -47927, -35345, -40726, -28398, -17186, 966, -15126, -32589, -57826, -48564, -37149, -56879, -87661, -79015, -64547, -62273, -43868, -13375, -166, -9736, -27388, -14727, -22462, -34496, -30429, -31677, -36203, -45365, -56423, -42978, -45497, -49879, -36858, -40970, -28474, -33215, -55243, -40561, -6180, 811, -11263, -18967, -4187, -3967, 1043, -8006, -16553, 3071, 28711, 32442, 24797, -10255, 4755, -3161, -26640, -13722, -6415, -22858, -17678, -19029, -39858, -16756, 15581, 46854, 37484, -3697, -33937, -39291, -47934, -24517, -5883, 12006, 11413, 6442, -16585, -21752, -9817, -26928, -33364, -44239]
15924d4239k877J6128j8481l2315K1897N4415l073k5044J44p364j564L7476O961
15911B064j812k6258p291p520N996j134J0956L3290K2422j3740j4911k35k3589
15898b1762q756K4611m136k7057j9958J5672K7017J0540j4262O845J9115K1339
15886B9208J0465m848j6358j6173l944J6518O045J0419O81m8676l4289L331K5669
15873b1952J7762K0965J2427k8034k3522O694J4480J5670K7712R019j1828o713
15861C2680l9481o536J3815k796K2799L3355l5867k3452J0612n469K918R391P639
15848A9608j3552n963P655J6327m4023l0215j5532J4094L4762n610n742K912N469
15835a9810J8221j9177J1837j4588k3783J6488K7246k6346l3178K7642L0227k217
$$ y = [-44239, -47116, -30988, -49469, -81784, -59887, -5472, -8545, -33589, -33445, -40809, -42373, -4897, 2064, 252, -26006, -33297, -40817, -34821, -35955, -24999, 8291, 30713, 16973, 2062, 1827, -21762, -30518, -5907, -10043, -37100, -57058, -41386, -14369, -3829, -18091, -11246, 7869, 29208, 39673, 34825, 18467, 2294, -1650, 14868, 20913, 31332, 32013, -16663, -50952, -47621, -21952, -4190, 16775, 29202, 1168, -22354, -15660, -1180, 14490, 42202, 51221, 39393, 32680, -6801, -13337, 478, -2318, 20481, 53836, 17969, -5483, 5129, -340, 2578, 11969, 19608, 6056, 93, 7748, 24075, -19948, -50163, -65695, -51601, -16839, -22449, -28191, -25279, -19810, -1589, -20766, -8929, -23517, -47300, -30812, -3566, -29912, -63090, -35448, -5221, -7438]
15823g438k3098R851k3344K19Q338J1789K514J9708L684j8651j605o276r580n647
15809c9536l7132j2312N31K5804l639j1328r735J2495K0796J5949k715J9863L0961
15796A0002k806j3202j0704l6529p942Q312M2752o046l7527k3566R883L3369K7509
15783f495l869l1248k1190Q41K2308M647k0133j1493r065p095L1358K4297j2971
15770d0108J6448K2914q586J4820O158o174N999J1748k0225l4843j7539j1046
15758f0434L198Q288P916l885O136L8499N170k4831N511J9471p486L862r904j1626
15744b0115N975K4677j4529j7056j2360j005J3284J4711r904k5493j1271N3028
15732e8L9147j1485Q054J546k4598l4602j191j9788m432p86M671l759J4708L32
$$ y = [-7438, -30536, -20685, -44029, -43810, -35472, -23683, -21169, -1461, 2223, -16428, -18033, -24309, -33889, -39536, -76668, -88980, -88449, -62645, -66284, -77612, -87347, -74852, -54056, -38107, -40822, -20959, 10002, 7196, -6006, -16710, -53239, -61181, -52869, -10117, -16163, -53690, -77256, -67373, -34004, -6495, -10364, -41612, -62802, -61961, -39653, -35006, -55139, -66632, -75697, -82792, -51434, -27137, -40108, -23660, -746, -9332, 5488, 11646, 5472, 11471, 23219, 2994, -31849, -49388, -60434, -57236, -48948, -41032, -44917, -38781, -282, 4888, -19943, -14432, 5039, -2447, 1415, -8489, -20115, -14140, 10537, -3992, -21048, -33408, -34413, -21129, -6418, -16322, -41815, -53086, -58, 39089, 27604, 35658, 37204, 12606, -21996, -23187, -42975, -47407, -48193, -43522, -47281, -32573, -32241]
15718c2241j9844j399m113J4498j818J8008J1978M355j5435J5907r225j6295P859
15705b7765N736m07N27J4290K3728K949k5010k5541K1327K6657R95l622P424n06
15691B0782k6132k1504j062N086L1781j4253l907k5775m451J8125k2134p411l876
15678e4731j1689L091j2611L0366l858j5390L2007M3015l6297j2488j7648l2176
15666h8409J5173L8030K1667l1561J598J0415L662Q249J0817J8506J3816j1521
15654A0442j6891r239P367K0721m797j0328J2181M399J758J4844m0887k6678J6173
15641b0935K5880R578p914k2889k3182O118M606J7985q677j8854k383K8425K069
15628a0173j7376k8299J3750L324R641L4254j7653L536j7342p653M878k6490q857
$$ y = [-32241, -52085, -53484, -57597, -43099, -44917, -26909, -14931, -10576, -26011, -10104, -19329, -35624, -27765, -22029, -22436, -21909, -7619, 16109, 19058, -5952, -31493, -10166, 16491, 17486, 13864, 21288, 20782, -5350, -26854, -27916, -22830, 8951, -5302, -9209, -34984, -39435, -21310, -43444, -50855, -54731, -66420, -63329, -75940, -45574, -49432, -64822, -32815, 10200, -26097, -38585, -56233, -88409, -73236, -35206, -13539, -45100, -43502, -33087, -29425, -21176, -10359, 8147, 21963, 10442, -6449, -15688, -8321, 12400, 7603, -2725, 9456, 13855, 15613, 30457, -10430, -37108, -20935, 4945, 14523, 6609, -16280, -39462, -33344, -28738, -10753, -19430, -38284, -40667, -12242, -10173, -27549, -55848, -42098, -38774, -29133, 5121, -12532, -8996, -26338, -33991, -29113, -55603, -64460]
15615f4460L4341J4941Q698q517k2804K1075J5885o824j3702l3836m745L583k5303
15602h1668m152J9821K6930K0071k0872P46K1560L023K5559o62j9798l8700R912
15589c8230K6428K1951m3346j95K1019P530J2817l236j3714m776o092o313k652
15576b8809J5437l5747k7100J4185L3184o279P640K0155r843L1784M479l6335
15564a7249n03K429N854J720j7123m6573l1189L4005L3460n820l081j447k516
15551d8033J098K7713Q688J541K6293o263l9487j6403J5668K5039N894j2765m9667
15538f0684j1360R686j5459k788R416K7647j7760l5102J059J5805K6133Q37k6720
15525g9290p704J4995L402o16j3467J4324M7939K1290N458m991k6146K978N348
$$ y = [-64460, -30119, -15178, -6480, -14997, -37801, -16726, -841, -7665, -21367, -55203, -59948, -56365, -81668, -85820, -65999, -39069, -18998, -39870, -39124, -17564, -14541, 11018, 10356, -9442, -48142, -38230, -11802, 10149, -33197, -33392, -12373, -4843, 7974, 4738, -8976, -13752, -19844, -26157, -28809, -13372, -49119, -76219, -62034, -28850, -35129, -27489, -7334, -17177, 14607, 19086, -17249, -17752, -15323, -9469, -7749, -24872, -71445, -102634, -68629, -35169, -40989, -44070, -45517, -48033, -46935, -19222, -10534, -8993, 17300, 11037, -28450, -44853, -29185, -4146, 1748, -11017, -60684, -72044, -62358, -77817, -80605, -71189, -43542, -61302, -96404, -95345, -79540, -53407, -52570, -79290, -86994, -71999, -68597, -69213, -82680, -68356, -20417, 873, 6331, 1340, -24806, -21828, -16480]
15512a6480N103J503k4159m748p47Q911O33j2259j4984j7652J2164L1903j3265
15499d4077l5667j630K1389L0481j1208K0719K1005j0553j9338j5320N725N277
15487c3197j2608J4463M9186J320k7761o561J5277k547k7678k0336K8426J3073
15475h943Q102J2089o339j324M946j486K052k1778j6874n044M9578K595l218j4133
15461B23q518N236j1048k6899M128K657r558j318J9549K7158m105j9376j1557
15448c3428k0017p842K2127O898n15l094k2732P891O19K0038R56J656L9808l667
15434H698n9948j4916J7003J8845J3768L681N429j8789J2119J5277p653M727k371
15421d130k7373r088J2708K2079Q867k2258o522Q35k4262k1684O876n393n611
$$ y = [-16480, -11377, -9874, -34033, -38781, -39528, -30617, -29984, -42243, -57227, -74879, -62715, -30812, -44077, -79744, -81374, -59985, -29504, -40712, -19993, 1012, -9541, -28879, -44199, -38474, -33197, -45805, -31342, 17844, 19164, -8597, -15158, 119, -2428, -30106, -50442, -22016, -8943, -841, 11248, 4909, 3585, 8531, 7045, 9097, -12681, -29555, -34599, 14979, 17574, 14356, 223, -8295, -3059, -14107, -41006, -36878, -34221, -43779, -45097, -25548, 1610, -2495, -21871, -33428, -53445, -61287, -39160, -32262, -32777, -35871, -58603, -50712, -50093, -30055, -29099, -27443, 12365, 8698, -51250, -66166, -49163, -30318, -16550, -12869, -7440, -26229, -14110, 1167, -6486, -1759, -4130, -31503, -40591, -27883, -5804, 3063, -19195, -25717, -24882, -49144, -70828, -63952, -69345, -74956]
15408g4956r238J3431L0927J8521J8332L638j2596J2267q534j1156m20j5655j100
15395c6539K7588o47r860p575m283J3046Q91j3439J0480J8113J5602l98o510k3021
15381a6552q957K307q752n209R576l32O298J9625l806k9938J799K9477P939J2862
15367A6337k0080o464L1083J1362j7413j2193j5979j1016K2787J8494k0568j610
15355e260r469j0847j0759q4q205j1860K5275L9583m81k1421k0584M076R172l672
15341b4536J195o243p123O023K1169n97l5950k2375J1903L1046j2742l0324Q172
15328f0382R840J0397O248K277N556j6241q041J6752M504J7266K548m131k1735
15315c5142J3151J9465l264j2211j9986j1970j7794J7179m745j4973Q210L652
$$ y = [-74956, -84194, -70763, -39836, -21315, -2983, 655, -11941, 326, -8208, -19364, -19784, -35439, -36539, -8951, -9598, -19458, -27033, -31316, -18270, -17379, -30818, -20338, -2225, 13377, 12979, 6469, -16552, -25509, -23202, -31954, -37163, -27587, -27919, -21621, -1996, -5802, -35740, -33941, -4464, 3475, 16337, -3743, -10207, 20876, 32238, 14825, 2632, -13347, -24363, -1576, 16918, -3650, -5260, -14729, -25576, -36335, -36419, -44624, -56484, -31209, 8374, 7893, -13528, -34112, -30036, -20864, -24536, -23341, -29584, -36707, -30684, -9515, -10112, -46062, -68437, -56534, -25488, -38230, -68554, -60382, -50542, -40145, -33897, -31620, -26064, -42305, -50346, -33594, -29090, -11824, -9276, -13407, -35142, -21991, -2526, -5790, -18001, -37987, -49957, -67751, -50572, -55317, -70290, -62080, -58428]
15303e8428N619K9554k3594j6391J0068L6256O420O150q50k2349o842r355K2882
15290b0860K6250J4532l3526n0875J9402K4059j2607o259R68Q496J2422M550m0670
15277e4118j8583l175M262M3368K0195J075k988j682j3146R877j0341k2001k0411
15264f7668K3706l008k0460j1068Q845J4155L3468K263J4134L2511j7201j0901
15252a224k5337o355L074j4978M234q268j2797K4210J8175K6447L182J674L235
15239A5272j8596k2043j496J462J0355j7147r089j0914o512R076J544J6969O091
15226b5028J3855M342j9494R79Q386K6271P070l1524k769J7909K5323J8467j5356
15213B8431l2873k0947J1853L0979o747J0016p76k2408J684n500L597r564k472
$$ y = [-58428, -52809, -23255, -46849, -63240, -53172, -16916, -10496, -4346, -5196, -27545, -34387, -43742, -20860, 5390, 19922, -13604, -64479, -45077, -21018, -33625, -39884, -38916, -30420, -17998, -13448, -54118, -72701, -75876, -71614, -28246, -8051, -6976, -9964, -11646, -24792, -14915, -25256, -47257, -67668, -43962, -46970, -67430, -78498, -69653, -55498, -22030, -19767, -5633, 26878, 9677, -1224, -26561, -32916, -29842, -44820, -40586, -48854, -61651, -37441, -19266, 7181, 10363, 12037, 15272, -3324, -25367, -26863, -25401, -15046, -32193, -41282, -52196, -58708, -49632, -48088, -31119, -25028, -11173, -6831, -26325, -25346, -16960, 9311, 16381, -15143, -17912, -3, 25320, 43787, 28431, -4442, -25389, -13536, 17443, 10696, 20712, 19936, -2472, -788, -6288, -2691, -12255, -14727]
15200a4727K6820J1431O095j7146k7800k5560k2303j920n857J2594J4684m555
15188d8244J0113L2424M39j489R375k91P704j1265M80k048k3807q194J1390l636
15174b7049k6501q091K5168R462K183j065K0575j6980m1497k7394J2600L9850
15162c8739K4337M5842K111j3637j8278j4083R787j9960O660K6520l0084m3007
15150f2531k8448J2241J3144J2188l188j0217J5217L5091k0140O481J497j4840
15138d3505M485P56n707L9819J9710j4670j7079J030L2746N093K559j6907l6700
15125b8370o688j7294O754L0252M614j3296J2966m036k4744n497N151j9888J192
15112e8884K3029L4704j4209P05M155l305m2085p632j0601j529K9916L3431J7332
$$ y = [-14727, 12093, 23524, 29619, 12473, -15327, -40887, -63190, -65110, -70967, -58373, -43689, -48244, -38131, -5707, -5268, -6757, 2618, 2327, 10031, -1234, -754, -2802, -26609, -34803, -23413, -27049, -53550, -61641, -36473, -27011, -24828, -25893, -5318, -22298, -63795, -91189, -78589, -38739, -14402, 31440, 33551, 19914, 1636, -12447, -2660, -22620, -15960, 10560, -19524, -62531, -90979, -78738, -65594, -53406, -56594, -66811, -51594, -16503, -36643, -30162, -28665, -43505, -39020, -38264, -43971, -4152, 15558, 888, -16191, -15161, 17585, 22678, 25237, 8330, -28370, -35058, -52352, -45598, -15346, -10732, -24028, -11062, -15098, -39842, -45339, -40188, -60076, -58884, -35855, -1151, -15360, -14655, -10500, -13805, -55890, -63522, -74123, -75652, -45736, -12305, 5027]
15099E027q692N262Q360l854O118O891K112m2995k6765J6110J1306N431p154O109
15085a6734L976K473j7090m153j165j4446R640k529l480J1251J2585K7205n574
15072A959k2758J972j7247j9433j2583j8427n18K4303K5099J0781K1202K741K6720
15059B3811R155j5449m7927j2727J4600l849j7605N313Q630j397L360k6806j0976
15046g1867J3437L173L7980J1141J3991n218k5416l4246j6818o373L9581J3259
15034b7376M431M40k4732Q877K0565J6609o43k616n262L340j3569j3247Q091J0621
15020a4471O290k7j3815j062J635p0Q357j7018p260j442m815J3284K6354r208
15006a3268j3992Q328J8293q705l5437N121J3977J9365K0356l3543k8444J570
$$ y = [5027, -3665, 1597, 9957, 6103, 12221, 19112, 21224, -21771, -48536, -32426, -21120, -15689, -22843, -16734, -12758, -10285, -27375, -31528, -32693, -47139, -37499, -40028, -43508, -32257, -19672, 7533, 1959, -20799, -18827, -36074, -55507, -68090, -86517, -87035, -62732, -37633, -26852, -5650, -2909, 23811, 32966, 17517, -30410, -43137, -28537, -32386, -49991, -44678, -36048, -37445, -34085, -60891, -71867, -58430, -55257, -17277, -6136, 7855, 2637, -22779, -57025, -73843, -80216, -40635, -27376, -22945, -22505, -47237, -38360, -17795, -1186, -1829, -4445, -9707, -6367, -19936, -33183, -25092, -14471, -8181, -8208, -22023, -23085, -21450, -21520, -13163, -30181, -37441, -38883, -43698, -30414, -4060, -13268, -27260, -18932, -639, -9344, -44781, -39660, -25683, -6318, 14038, -19505, -47949, -46379]
14994d6379K1537j4177R380J5613J8624N562j8807k7647r662J2128j1034N519
14982c9343j3034M673J3262k3364L0788j576l2659K412J9072M6958K5516j2099
14970B0606m1143k5614J8968n12K8501J0521n814j8744J592J628L338j769J0106
14957A664j6715l1636l952J3817J9087J89K7260K0877j9744k3139J8770J0332
14945A6810K4625j356k1997k8721n328j0750M913j1814j5485O365K6240M7308
14933C0810P146o759k7125k5669j3810Q001j4166j0908J0124O018N117j8022P838
14920d1405J4968j1428k2330r158J8988K1274O851O288l4593k1795K1525K7571
14908b3244L703m256k21L812Q050J4181R1k2482j8916M902K5936K0765j2294n477
$$ y = [-46379, -24842, -39019, -29639, -14026, 4598, 10160, -8647, -36294, -45956, -33828, -44862, -39343, -52377, -47704, -34442, -57806, -27018, -28594, -61253, -58841, -39769, 7189, 32705, 20606, -20537, -46151, -27183, -27695, 806, 11327, 5513, -13231, -11639, -10011, -6673, -8442, 1664, -15051, -46687, -50639, -36822, -17735, -17546, 9714, 30591, 10847, -12292, 6478, 16810, 41435, 40079, 18082, -10639, -15967, -26717, -21804, -33618, -49103, -42738, -16498, 30810, 37956, 31197, 4072, -21597, -35407, -27406, -41572, -52480, -42356, -36338, -31221, -49243, -41405, -26437, -37865, -60195, -69353, -50365, -29091, -22240, -15952, -50545, -72340, -50815, -23244, -19541, -23797, -24018, -20206, -12156, 2025, 2116, -20366, -39282, -34380, -8444, 12321, 27, -5450]
14894e450m972P436M86j5314j1750N307o261j7537Q606L9321K1408j0772j6159
14881e651n04R659J051J7517k0346k7977J133k1418l209q37J1769Q552m189m380
14867c8830o656j7172l669K6473m299K008K9040J0752k5503k2785K4824K8449
14855B632J2705J1034l8466l6727k5499J7435K8194M523j2038J9448J3700l2691
14843c5750j4742L8483K3274r233j5390j7825k996j878K4454p520n088j6690n514
14830d6415j1803K526J5816M1042O59j543J6499l3452j9665J4985k1869j4600
14818e7820M2686q366j1677J3523M680m908j5713N250l324J9544Q363J4816K508
14805I562m8274j443L7641K7165Q803M456j100j7999r728J3844K1660k399l070
$$ y = [-5450, -10422, -2986, -2500, -17814, -29564, -24257, -30518, -48055, -39449, -128, 21280, 10508, -5651, -6155, 3504, 4555, 22072, 1726, -26251, -25118, -46536, -49745, -50582, -38813, -30261, -34450, -38830, -45486, -62658, -66327, -39854, -44153, -42145, -13105, -2353, -27856, -50641, -25817, 2632, 15337, 26371, -12095, -48822, -74321, -56886, -28692, -24169, -36207, -16759, -3059, -35750, -50492, -12009, 11265, 2032, -13358, -31183, -34179, -36057, -11603, -19123, -24211, -40901, -46415, -58218, -55692, -39876, 1166, 1825, 282, 16781, -16671, -36336, -21351, -43220, -57820, -15134, -23500, -35177, -21654, -16974, -21882, -37595, -32345, -35669, -16125, -7762, 7054, 9562, -38712, -40155, -2514, 24651, 33454, 37910, 36810, 18811, 9083, 22927, 44587, 42188, 39118]
14792C9118J071m8135k1890K196j5340O284J2785q956L3034J6853j7249k9781
14780c0010j1718R081J0980l740q810k8917l556J5922P161O540J4839J3235j1306
14767b0299K8459M184J41O254o017j7150j9774m744j0150k6061k2897J8203K4020
14754d5831K499K5570K655j2138J4699n442j4584j7813J1221j7632j4349L897
14742f7248K2721J4682L187j145J6937Q847J136P875P627j5378k2788r955m0176
14729g3678j2604J3258J3465j035K7918L2914L9579r310l5952j9540L396l585
14717b5174m942J2711L289J5740L8498R328r77q31M995p868k3681J682J1666J6463
14703E0899l4240l5871k6683j1609J9274J1495M025N902J3004p025Q843M103m0323
$$ y = [39118, 40189, -7946, -29836, -27640, -42980, -36696, -23911, -32867, 167, 17020, -229, -30010, -41728, -32647, -21667, -25407, -34217, -63134, -66690, -50768, -43607, -37067, -22228, -8993, -20299, 8160, 12344, 12485, 18739, 12722, -4428, -24202, -28946, -39096, -65157, -88054, -69851, -45831, -43332, -17762, -15107, -27245, -12546, -17988, -32572, -50385, -39164, -56796, -71145, -67248, -44527, -29845, -26658, -27803, -10866, -2019, -883, 6992, 14619, -759, -23547, -33502, -73678, -86282, -73024, -59559, -60594, -32676, 238, 39817, 30507, -5445, -24985, -21589, -25174, -30116, -17405, -14116, 1624, 40122, 49450, 48473, 47642, 52637, 44769, 21088, 22770, 34436, 50899, 16659, -19212, -45895, -57504, -38230, -26735, -22710, -16808, -3804, -10829, -1986, 2117, -38206]
14690c8206r935P127J2438n820k702J7803K2063L1668N95j8446K280j7625n08
14677G32j6004j8988m2215m644k631k88J6454K2181K3846J2753j7006Q76n844
14664c0778J066M154L1752J5917j5477j1093J9581n807k3935N59P96L255R142
14651h68M597k0640l4790K3519K9752j9355k1648j572n495L1016J6703J6864J2824
14638C0907P267J155N619J283l3389j9804j7519l6425k0973J1361J5068n307J3569
14625d7188M4978K0489J3738j1400l3217p941K1110J0887k4245j283o291k2138
14613d2501K2747M479l846N897j1876j9821j6773l610P751J0534M310J2368J6295
14600a4046m69Q710K0764J6086K6879j0876R690J3859l6098j9042j8986j3368
$$ y = [-38206, -48141, -41014, -28576, -34396, -37098, -19295, 2768, 34436, 35031, 16585, 18865, 1240, 732, -15272, -34260, -76475, -81119, -83750, -84038, -67584, -45403, -21557, -8804, -25810, -24934, -30778, -29712, -25558, 6194, 22111, 6634, -4459, 15122, 9315, -14620, -14061, -13265, -10010, -868, 3729, -16911, -51701, -28182, 1570, -17785, -39433, -41005, -46500, -15484, 1219, 18083, 30907, 38174, 39329, 44948, 46231, 12842, -6962, -24481, -60906, -81879, -70518, -55450, -60757, -47188, -2210, 18279, 32017, 20617, -12600, -20541, 569, 11456, -12789, -14072, -20363, -42501, -19754, -15275, -19121, -13224, -25100, -44921, -61694, -65304, -57553, -47019, -42709, -30341, -14046, -14515, -5805, 14959, 31045, 57924, 47048, 56738, 70597, 34499, 15457, -3529, -16897]
14588a6897P423q52M030r27J9662J511l626L580l0651M894J9603P429k7825m042
14574a6688j9941M343K4635p172j8381J4625R463j1929r497K2319J1839j4442
14562a0826j4119L254q363j322K2584p109o824j3443j1610J4516J3882P988j4323
14549b5715n423K8432J13m432m694k0023l77k232j3309m737J1461J2212J1580
14536a7144j24k3311n298K889K104l873l9763n938J0584J7846R404J2031K8328
14523a2265P869J3558r410L983O684K4026j4224n667k0253j6205o771J0248R670
14510h757m319r085O220R647K3438J2608k5309k2594j8882K2313L0024q110k9130
14497b1936j1667m973L642K133J3266q261k5046k2429K2454N904K3682J1002J3209
$$ y = [-16897, -9474, -10326, -6296, -7223, 12439, 13950, 10324, 13904, -16747, -11853, 7750, 15179, -12646, -16688, -36629, -32286, -7651, -14823, -33204, -18579, -9116, -21045, -30542, -8223, 3616, -10826, -24945, -21691, -30054, -31376, -8792, -15901, -22725, -36168, -47778, -33262, -19380, -11392, -25715, -31138, -2706, -2593, -7025, -11719, -31742, -32119, -34351, -47660, -52397, -40936, -28724, -17144, -17268, -40579, -45877, -42988, -40884, -44757, -84520, -90458, -79874, -62028, -52624, -40593, -12265, -4396, 9162, -248, 3735, 10419, 34445, 20221, 14554, -5699, -21904, -28675, -18427, -8757, -13076, -22161, -15941, -6294, 17144, 29752, 4443, -18151, -37033, -14720, 15304, 7194, -21936, -33603, -38576, -34934, -32801, -19535, -27796, -52842, -75271, -52817, -46913, -23231, -12229, 980]
14484I80L197k0476m562J9442R170n862K73m185J306J1020j5727j9290j2734j5493
14470e2941K185R893j1364O698L9143L2101j2583j0325p184j1975J056m545N364
14457a4477P201n207m566j4854kJ656m668p72L8812K6967k0507Q618N448j0507
14443A3142q343k8343K7287L1684j1250K8169K0093j1244N601q510m697k0932
14431C2657l7945p533Q434J3558j5868O106p751J0913l5026k2597K0249K9035
14419e768l390j0210M5635p362l2987p799K1479R664Q848K6201j9405k6069k8956
14406c0119L971J7660r988J918K972j349K1822n256l0345j6080L2254l248l1968
14393d7756q854j4479p365J5056K6877N986o229K0558J0300l2911l800l9913J562
$$ y = [980, 4177, -16299, -20861, -1419, 7751, 1889, 2162, -2023, -717, 10303, -5424, -24714, -37448, -52941, -50756, -40863, -52227, -45529, -6386, 25715, 13132, 2807, -4377, -16352, -15296, -19841, -14477, -7276, -12483, -17049, -31903, -31905, -30249, -34917, -35689, 3123, 30090, 9583, 18201, 23649, 13142, 4799, -23544, 3743, 35427, 24177, 52346, 72439, 61195, 66796, 58286, 53589, 32657, -5288, -12821, -4387, 9171, -6697, -591, -8342, 2571, -32455, -55052, -34803, -5768, -9158, -19368, 26267, 18905, -14082, -21881, -402, 9262, 18110, 44311, 24906, -1163, -30119, -26148, -8488, -18476, -16558, -13586, -14935, 6887, 1631, -28714, -44794, -12540, -15788, -47756, -56610, -71089, -78454, -63398, -36521, -30535, -36764, -16206, -5906, -38817, -42617, -82530, -80968]
14380h0968J3551J6681M231L94P897O395m518J7448L1204M892J5964m0446m7131
14367e4406J3416J4959N77J1914Q890K6990k771j0320j2361j7108J4167Q406J0003
14354A2356j3169j4442O837K3061m013j2640k283J6423m378k9371l3308J858J591
14341e1478o000L6677J0159j1153j9947P637J1177K7530J3970K626k4684j8229
14329b1715K2424R071j1052J891P298j605o575L18M200O020m375m59R495p215
14315G721j098l133j360k669j4573O668L35l795K8429K301k4320p774J1259l1073
14301c3082j935O030j400j8984k5365J7533J2426J3147p058k8270M652K8385P006
14288b6915j3589j5420O815J5450J3706Q902n806Q517r89O646J816r241j4817
$$ y = [-80968, -67417, -50736, -46505, -46111, -38214, -31819, -36337, -18889, 12315, 17207, 33171, -7275, -54406, -40990, -26031, -25454, -13540, -4650, 22340, 19569, 9249, -3112, -20220, -6053, 2353, 12356, -813, -15255, -8418, 14643, 10630, -2010, -4293, 12130, 7752, -21619, -54927, -53069, -51478, -57478, -20801, -10642, -21795, -41742, -34105, -22928, 4602, 18572, 21198, -3486, -21715, 709, 9780, -1272, 619, 7917, 6312, -263, 55, 4255, 10275, 5900, 5441, 14936, 7721, 6623, 3490, 2130, -539, -15112, -8444, -8109, -11904, 16525, 18826, -5494, -13268, -2009, -33082, -35017, -28987, -30387, -49371, -74736, -57203, -44777, -31630, -38688, -66958, -62306, -33921, -26915, -40504, -55924, -49109, -33659, -19953, -11051, -16857, -8340, -9329, -2683, -867, -10108, -24925]
14275b4925K7945L813J3335r612o593k635k2289R024j0878j6642p287j930r75
14262d9649J9210k52J0754M1856J9327l8334k656K1915p43j7023R541L5684K5187
14249G4817J698O713j1640k5061O685O725l1555j8003N281l6j3338j6711L0718
14236A6293J2414l575k6120m1487k6839K1634J4032K7484N6088O96m8069n3431
14224e0880L647L4229J0774j4982j0382N138j5372J2229K0277n461m996j617J4783
14211b613O254k3754J2714K8910K7706l7779k0818J5775J8011L860p519L572j802
14198B2517r41k985q678k95j9346J2058Q817J9211J5815l6412k0158J7567k833
14185D337j5727N146j8954N602K4689O413k3794j1663j764M1450L4207N084r102
$$ y = [-24925, 3020, 6833, 20168, 10556, 3963, 1328, -20961, -11937, -22815, -39457, -46744, -48674, -49649, -30439, -30691, -19937, 21919, 41246, 2912, 256, 22171, 21428, 4405, 13946, 49630, 74817, 76515, 83228, 71588, 46527, 53212, 59937, 28382, 10379, 15660, 15624, 2286, -14425, 16293, 28707, 25132, -988, -42475, -69314, -47680, -33648, -6164, 49924, 50620, 2551, -50880, -47233, -13004, -2230, -17212, -27594, -22456, -37828, -25599, -5322, -10783, -15779, -17396, -2613, 3641, -20113, -7399, 21511, 49217, 11438, -9380, 6395, 24406, 28266, 20747, 24319, 22517, 21576, 18591, 9913, 9618, -9728, 2330, 11147, 30358, 46173, 9761, -10397, 7170, 4337, -11390, -6244, -25198, -19596, 5093, 11506, -12288, -23951, -25715, 15735, 49942, 55026, 45924]
14172D5924k1261k7200j5061J3754L25j6865j0401K0871K4338O155P98P322O592
14159C5291n5334m6213m534J6582n125l00K857N5648J9439o072j226J8457r588
14146A9882n699K831j3260r373R866R323J2090K930K4050k1941j7269k4538j5963
14133b7071J5137m474j490J6583Q593p427j5826Q849M7326J2769j3834M92n48
14120C9079j4683J0672m13j3422p848k6976O049K0031k0707j4223J1841q094k3692
14107d2386M183P76K2668J7859K2906j2996L398l0870J0916M5830l711j1051l0026
14094b504j1215j4509m781Q394Q355P187j321K5857j1126m1717M654J9291q89
14081a4324J363J8158M7102j0239k8645j6364k2953m074K0078L3498j1363j3613
$$ y = [45924, 24663, -2537, -17598, -3844, -3519, -20384, -30785, -9914, 14424, 20579, 21377, 28699, 35291, -20043, -66256, -70790, -54208, -59333, -59633, -56776, -1128, 18311, 12239, 11013, 29470, 19882, 14183, 17014, 3754, -5619, 4247, 13570, 25660, 28590, 52640, 30699, 13430, -11108, -27071, -11934, -16408, -17898, -1315, 7278, -149, -15975, -7126, 40200, 52969, 39135, 39627, 39079, 24396, 35068, 34655, 21233, 13385, -13591, -7542, 12489, -8218, -22441, -10600, -18694, -42386, -38203, -37427, -14759, 3100, 26006, 13010, 16408, -14462, -3546, 42284, 38573, 27522, -2504, -13719, -28228, -33009, -24615, -16260, -9073, -10394, 15463, 4337, -37380, -32726, -13435, -14324, -12961, 5197, 52299, 42060, 13415, -2949, -25902, -29976, -9898, 23600, 12237, -1376]
14069a376J5182K5012j2840r064n134j5178N464j2798k8241o950R696L712p609
14056d0124j0026j0112J9763R527J2099P362K5803L2216l0032l7822K49n794M251
14043b2640L5011L0820Q648o352j1535k2032l280M903k0904q281J5137K9426j585
14030B7336k7813j5410R74K6153K2760j1837j4597J3406P325p21J802J8582O303
14017E4263j2891k7659n098M5804J9001p397K4709M6216K8215L7469O708K546
14005B11886K0144P5930O1350M5591N3363P2492J06184J55182K49578L69667N03520
13994A924887O20621P40709P78986P19724N81289L62290J09639k10632m25321
13985E202192o11731p66027p01407o13215n20152l65654k48364j82724j26544
$$ y = [-1376, 13806, 38818, 25978, 16914, 11780, -3398, 2066, -10732, -38973, -45923, -36227, -32515, -40124, -50150, -60262, -40499, -30972, -18873, -11511, 14292, 46508, 16476, -21346, -21097, -26891, -22640, 12371, 43191, 51839, 45487, 33952, 11920, 8640, 13543, -7361, -15642, -505, 28921, 27336, -477, -15887, -14913, 11240, 34000, 22163, 7566, 20972, 28297, 27576, 29378, 47960, 54263, 41372, 13713, 8615, 54419, 73420, 66023, 90732, 136948, 165163, 202632, 209340, 211886, 232030, 307960, 369310, 414901, 468264, 540756, 646940, 802122, 1051700, 1421367, 1924887, 2545508, 3286217, 4065203, 4784927, 5366216, 5728506, 5838145, 5627513, 5202192, 4590461, 3824434, 3123027, 2509812, 1989660, 1624006, 1375642, 1192918, 1066374]
13976A066374q8164p3841n5011r7858p2816n2599o0309k5587j9443m2187j8582
13965D59977l8978k0192J9971J8827o568l4415l9848j9274n2706m108L1856j790
13953C12752l9926l0760J1343L2559k0854k0286n282m4300k0626j6153J2665P464
13941A78596L462J2500j4062j1274K6682J7806l2799j2792K770M0015l551o1383
13929A45970j7783q179r26K4896l464j945J1829j3815O178q27J4074j5596p342
13916A33070m8990k1111M1592Q860n1535p631K1797J0492Q441j6420m908j1177
13904F2480p292l6142q040L2682J7182K4769J6461K495J70j0051n2556k5258k935
13891A3965q632J0411J1773K681K0868R861J9221j0592j4290j4734P268K0138
$$ y = [1066374, 978210, 904369, 849358, 751500, 678684, 626085, 565776, 540189, 520746, 478559, 459977, 420999, 400807, 420778, 439605, 433037, 398622, 358774, 339500, 286794, 282686, 314542, 312752, 272826, 242066, 253409, 285968, 265114, 244828, 239546, 195246, 174620, 158467, 171132, 178596, 182058, 194558, 180496, 169222, 195904, 213710, 180911, 168119, 170889, 210904, 207353, 145970, 128187, 120008, 119082, 143978, 140514, 138569, 150398, 136583, 142761, 141934, 156008, 140412, 133070, 84080, 62969, 104561, 113421, 61886, 54255, 76052, 86544, 94985, 78565, 73657, 62480, 55188, 19046, 11006, 43688, 60870, 85639, 102100, 104595, 104765, 94714, 42158, 16900, 13965, 5333, 15744, 27517, 30198, 51066, 60927, 80148, 69556, 55266, 40532, 47800, 67938]
13879F7938k1864j935j8444k3371J801P641J2126l576J3203J8729r8j6960j7722
13866A7468j3472K0142j4176j79K0131J373j5368j1743O113p386K1639P105K4401
13853E6048J4632k5113O539L7493J3468J639m207j4579l1741l973M824l5944l0630
13840a1544k2396R579J7158J8890J0781n166j3200J3366J4305k5342N395J8054
13828B9880j1148J2455K0011Q70l2194m238j9045j5186J2017L750j6464J580J2688
13815e024R308k3761K4727j1572j4708j559J5367n522k4282q217J8800J9820M3420
13802C6797m865k1608L741L186L117J3848l196l4248K0821K3986K3249J8972m2533
13789D1267p567M841K0682N11J2450k1609j7804j8838j9839L253J1483Q100J4492
$$ y = [67938, 46074, 44139, 25695, 2324, 4125, 11766, 23892, 20316, 33519, 52248, 52150, 35190, 17468, 3996, 24138, 9962, 9783, 29914, 31287, 15919, 4176, 10289, 2903, 24542, 31647, 56048, 70680, 45567, 52106, 89599, 103067, 104706, 100499, 85920, 54179, 50206, 55030, 19086, -11544, -33940, -24361, -7203, 11687, 22468, 17302, 4102, 17468, 31773, 6431, 11826, 29880, 18732, 31187, 51198, 52068, 19874, 15636, -3409, -18595, -6578, -2828, -19292, -17712, -5024, 4284, -19477, 5250, -6322, -21030, -22589, -7222, -12744, -37026, -45243, -26443, -6623, 36797, 31932, 10324, 14065, 17251, 20368, 34216, 31020, -3228, 17593, 41579, 64828, 83800, 41267, 33700, 38541, 59223, 59734, 72184, 50575, 32771, 13933, -5906, -2653, 8830, 16930, 31422]
13776C1422k5115K264q92j095k9823N664L684j4715J5466K8302j3358j0329J8372
13763I847L0234J0673p68m1937k2485J2058J3099J9759p821l7481q982L2088J2495
13750B0779J8260k4996l4661m169k903R036k1376J9409L1953k19j9209o043J1084
13737c055n907J6340m24m897J5980J2978M215n086J302O021n544o955j7830J5130
13723B2268l490k3418r250P377m275M174J0844J315J5792p255k681j5110j4625
13710a8334o438k0229l962J6186J1758p06M945K8042Q253j7976j0137l743K1215
13697H874j5109K2979k006o676J5880J5067j229L561q900r031j7821p463J4095
13684A2221k087j9631L102L0374J4794J490J6984O6j4007J5259L516K088L5790
$$ y = [31422, 6307, 8571, 7679, 6584, -23239, -17575, -13891, -28606, -13140, 15162, 1804, -8525, 9847, 40081, 50754, 49986, 8049, -14436, -2378, 10721, 30480, 22659, -14822, -23804, 8284, 20779, 39039, 14043, -20618, -24787, -27690, -18654, -40030, -20621, 11332, 11113, -8096, -14139, -3055, -8962, 7378, 6954, 2057, 18037, 31015, 35230, 30144, 31446, 37467, 31923, 24968, 7138, 22268, 18778, -4640, -13890, -6513, -10788, -6614, 4230, 5545, 21337, 14082, 11401, -3709, -18334, -24772, -45001, -48963, -32777, -21019, -21725, -16780, 11262, 19515, 1539, -8598, -12341, 8874, -6235, 16744, 14738, 8062, 23942, 39009, 37780, 41341, 32441, 23410, 5589, -1874, 12221, 10134, -9497, -6395, 23979, 38773, 40263, 57247, 57313, 43306, 58565, 62081, 64169, 99959]
13671I9959L8941O0567N7792K5826J3234N6306J07542J63201K18225K80765L43790
13660A466148L48756L02964K55408J22240j7679j27605k35075l18187l06635k99807
13650A190528k48571j92777j33611j09371l6736p675K111k7468m4410k5940k9685
13639C36395k7597k2414K26n314j6600j6452K4849r105M273j3244m1208l1247
13627A82562j0104k1735k1914k603j3385J8152r261j7145K599r225K49K3310l701
13614A17799j1263j9430k1437K015K7490Q886L431L018j3399J148l6704k1125
13602D0429k108J0518L0943J0812R495J8912K2628j1852j888m801k5321J1538
13590A09305J5087L963m548m1226l3937j476l340l754J1915k5956P945k1938K639
$$ y = [99959, 138900, 199467, 257259, 283085, 296319, 352625, 460167, 623368, 841593, 1122358, 1466148, 1814904, 2117868, 2373276, 2495516, 2477837, 2350232, 2115157, 1796970, 1490335, 1190528, 941957, 749180, 615569, 506198, 469462, 461787, 463898, 436430, 392020, 366080, 336395, 308798, 286384, 286610, 281296, 264696, 248244, 273093, 263988, 268261, 255017, 213809, 182562, 172458, 150723, 128809, 126206, 112821, 130973, 121712, 104567, 107166, 97941, 98190, 121500, 117799, 106536, 87106, 65669, 67684, 95174, 104060, 107491, 110509, 97110, 98258, 61554, 40429, 38321, 48839, 79782, 90594, 100089, 119001, 141629, 129777, 127889, 123088, 97767, 109305, 124392, 128355, 123807, 82581, 48644, 47168, 43828, 40074, 51989, 26033, 33978, 12040, 14679]
13577A4679J1141J1243K5427K2620J4597k0011l5040J6548j7345k6205o904K4567
13565C5317L1310j6481j8661j5824q091J3389M733J8209L761j7033k9921K4770
13553B5478r468k3694l111K2378K0218M024R855j6571K799J2046M781j3122o053
13540B9560J8571k8889m0915P130J180j6867L3890j1661Q9K9269K0824M3034J0733
13527I5948k4489m5521J813j4629J9359M572q396o45k4063K652P46k8433O682
13514a4404o193J4136J9908k6194k8852J0253K5394k5576n478J3924N907q411
13502b5586J6028K3757L884l908n525J0652o561r077j978P04m848k8395k9320
13489f0173Q212J8744J2899q414M757r706k5694J8443L9307K072P424O208Q261
$$ y = [14679, 25820, 37063, 62490, 85110, 99707, 79696, 44656, 61204, 43859, 17654, 10750, 35317, 66627, 50146, 31485, 15661, 7570, 20959, 25692, 43901, 47662, 30629, 708, 25478, 16010, -7684, -10795, 11583, 31801, 35825, 45680, 29109, 31908, 43954, 48735, 35613, 29560, 48131, 19242, -21673, -14543, -13363, -30230, 3660, -8001, -7912, 21357, 42181, 85215, 95948, 71459, 25938, 27751, 13122, 32481, 37053, 28657, 28012, 3949, 6601, 7347, -21086, -14404, -20597, -6461, 13447, -12747, -41599, -31346, -5952, -31528, -37006, -23082, -17175, -25586, -9558, 14199, 18083, 14175, 8650, 19302, 12741, 3664, 1686, 2390, -2458, -30853, -60173, -51961, -33217, -20318, -28732, -23975, -33681, -59375, -40932, -1625, 447, 7871, 14079, 22340]
13476B2340q321j9876j0349l047j3330J6279K6751r824j6276k0442J3330K1215
13464a550n481l7147J0141J7375J4588L1433R52r76j7771j9990K5797n697k9643
13451a7969k0474j0433P826K9927J4709J8624J5857P047l8201j2631L7159L269
13439C4710L216j0053k9272Q334L178j0016M541O433j2081l910K2868q422k7095
13426a7569l932K1333K0853r370k0538j0623J979O913K389J12L4023j3515k5813
13413a3758J688L2052m488l291j8906O121J238M671l127j1227J0102r09R903N337
13399A5406p401j871K6145K5176K5451j5228j3303k723r446o701k3505J7266m60
13386B8806k6408j4497l309K1066O896Q932k2901J2365o238q768L0335J6581J1128
$$ y = [22340, 14019, -5857, -16206, -19253, -32583, -16304, 10447, 623, -15653, -36095, -22765, -1550, -7031, -44178, -34037, -16662, -2074, 29359, 30311, 29335, 11564, -8426, 17371, 11674, -17969, -38443, -48876, -41050, -11123, 3586, 22210, 38067, 45114, 6913, -5718, 31441, 34710, 37926, 27873, -1399, 6935, 10113, 97, 4638, 11071, -1010, -4920, 17948, 9526, -17569, -21501, -168, 20685, 11315, -9223, -19846, -17867, -10954, -8565, -8453, 25570, 12055, -13758, -12070, 19982, 15494, 12203, -6703, -582, 656, 5327, 2200, -9027, 1075, 166, 10069, 15406, 8005, 6134, 32279, 57455, 82906, 67678, 54375, 51652, 42206, 35505, 12000, 29266, 28806, 2398, -12099, -15408, 5658, 12554, 21486, -1415, 10950, 4712, -4056, 26279, 42860, 53988]
13373E3988j958j2131N576k1335l9247J7484J7235j2176J8206N140l1802k4665
13361b5685l569K9414M896j6100K5330J0500J072K1044o085j5685n563L385j3971
13348H983j3432j666J0745K828P233j2924q016O439K2402m387j0031K838K4202
13335C5214J1348l019m3710j321L719J1578J2127o02m630K6370J4605j7804k9636
13322A4239l3163J9230K0708l799q303J0074L1418L290l8656j5824M882J3857
13310A7953l437K347K8594K4526k7676l6563k2133l792K4221Q613J8619m690l354
13297B3228o346J3187m065Q106k993o892K274P14L791j114M984j567L6252K5321
13283I4880p604O662j5824l5443j8638P888M511P640p985K0044k1778n980j3232
$$ y = [53988, 52030, 39899, 45475, 24140, -15107, 2377, 19612, 7436, 25642, 30782, -1020, -25685, -29254, 160, 5056, -11044, 14286, 24786, 25858, 46902, 40817, 25132, 19569, 22954, 8983, -4449, -6115, 4630, 7458, 14691, 1767, -6249, 190, 22592, 18205, 8174, 11012, 35214, 46562, 43543, -167, -1488, 2231, 13809, 25936, 25334, 20704, 47074, 61679, 43875, 14239, -18924, 306, 21014, 17215, 8912, 18986, 50404, 53694, 15038, -786, 4096, 17953, 14516, 16863, 45457, 69983, 42307, 5744, -16389, -20181, 4040, 12653, 31272, 26582, 23228, 16882, 30069, 26004, 34110, 31117, 24225, 26499, 27213, 31004, 29890, 34874, 33307, 69559, 94880, 87276, 93938, 78114, 42671, 24033, 31921, 36432, 44072, 36087, 56131, 34353, 28373, 15141]
13270A5141J082k60M674N713J5283n663k3140j1743J0106J6996k7206j8903J0073
13257g847J7901N633J0458K5R678M750o697k1275N744P334k4278O304N276n146
13243G860j0886k398l24L4714r983m48o133K8365k547p861l0828K8451K3869K5781
13229G7632m433j5828q938k1554J5676J0857J357j1164p555q787J2437j5123J5504
13216D0081p516j6419j9713k4622J3384j1725j1969O344j7999J0563o973K5876
13204b0688J5161j1920j8208k368K9517N322L676L465j7107J2922M911K1688R819
13191C6190k1099j4716N822L2637K1828k2367p038O520L2125q654k6785L193p875
13178B9781J8178J5738r905k6107j1282j9488J4570k542Q098K4409o571j2605
$$ y = [15141, 16223, 15963, 20637, 26350, 41633, 35970, 12830, 1087, 11193, 28189, 983, -17920, -7847, 10054, 15687, 26145, 26170, 35848, 40598, 33901, 12626, 18370, 25704, 1426, 7730, 13006, 7860, -3026, -5424, -5748, 28966, 18983, 18535, 12402, 40767, 38220, 30359, -469, 27982, 51851, 77632, 73199, 57371, 48433, 26879, 42555, 53412, 54769, 43605, 36050, 27263, 39700, 24577, 40081, 32565, 16146, -3567, -28189, -14805, -26530, -38499, -32155, -50154, -39591, -46564, -20688, -5527, -17447, -35655, -38023, -8506, -3184, 492, 3957, -13150, -228, 4683, 26371, 36190, 15091, 375, 6197, 38834, 60662, 38295, 31257, 37777, 69902, 61248, 34463, 37656, 29781, 47959, 63697, 53792, 27685, 16403, -3085, 11485, 8943, 17041, 41450, 34879, 22274]
13166B2274k8132J6109L7728L1514k5400k7484L5706J1128J3002J7508K3113L3090
13154A60156M7058N1014J14734J42166J67967J77218J59637J67767J11992Q7690
13144A387399L4044l0862j06111j48527j76723j50863j41019j34982q6896n0621
13134C94839n7585p633k8540k6857R930k660m0552m4848P644O612j8449L478j1402
13121A83977k1213m38k680j906l7098k1029J5965K1639m136j6485k7711j6269
13109G2616j0916j8285O929K7532o518k5097K966J7425j0558l736L0028q647j0858
13096F2881L5655R43q148P784j8263r374K7940L8201l1370n013J9779k0801l9325
13083F0889k0434P112k476j4735j2721K7170J6341j7283Q605L3901J3360j8031
$$ y = [22274, -5858, 10251, 47979, 79493, 54093, 26609, 62315, 73443, 86445, 103953, 127066, 160156, 207214, 258228, 372962, 515128, 683095, 860313, 1019950, 1187717, 1299709, 1387399, 1421443, 1390581, 1284470, 1135943, 959220, 808357, 667338, 532356, 445460, 394839, 337254, 329621, 301081, 274224, 284154, 281494, 240942, 196094, 203738, 210350, 191901, 195379, 183977, 162764, 162326, 159646, 157740, 120642, 99613, 115578, 137217, 133081, 116596, 88885, 72616, 61700, 43415, 50344, 77876, 71358, 46261, 49227, 66652, 56094, 52358, 82386, 73739, 62881, 98536, 99479, 91331, 99115, 80852, 71478, 99418, 137619, 106249, 101236, 121015, 100214, 60889, 40455, 47567, 45091, 30356, 17635, 44805, 61146, 43863, 52468, 86369, 99729, 81698]
13071H1698o29P565J7028k0056k757R916O808k5867P942J7631l7696l8502M147
13058B7228J9571j0434L8639L7180p074K451j7094o983k5953r079J4430l6052
13046B6830k0417l003O333L3396N683j2317l774j1939m942L1113K7168l414k2486
13033D8231P486m962r963K0632K8242m558j0084j4731O759L4004k794k1662k0891
13020E5709J379P696J6776l35j1008k246k5199l0699N718Q496j1169J7242K3934
13007E6294K197j0160o386j8775P644l095O466J2338J330j067j310n841j596O948
12993D4987j6019q220K4385j7565k394M008J2581K8100K6121J7616j3529n173
12981I4898J5863L4153J3254k220q183K048k796j4249J6776L8831K0876M3630
$$ y = [81698, 81069, 88634, 105662, 85606, 82849, 92765, 99573, 73706, 81648, 99279, 61583, 23081, 27228, 46799, 36365, 75004, 112184, 105110, 107561, 90467, 83484, 57531, 48452, 62882, 26830, 6413, 3410, 9743, 43139, 48822, 36505, 32731, 20792, 15850, 46963, 74131, 70717, 48231, 55717, 50755, 40792, 61424, 89666, 85108, 75024, 60293, 67052, 101056, 98262, 76600, 55709, 57088, 64784, 81560, 81225, 70217, 67971, 42772, 12073, 17791, 26287, 15118, 32360, 56294, 58491, 48331, 41945, 23170, 30814, 27719, 34185, 46523, 47853, 46786, 45476, 39635, 38039, 44987, 28968, 20748, 45133, 27568, 25174, 29182, 41763, 69863, 95984, 113600, 100071, 94898, 110761, 144914, 158168, 155948, 147765, 149813, 147017, 132768, 149544, 188375, 209251, 252881]
12969B52881J6352R156n43j4402k7256k6776L502o552l537r170k2298j0645m612
12956A56100L69R558j7608o0161K554K0208Q531J6590J7239k34n840M739j9613
12943A32432O53J0331R076j5409j9875k5814k8327K6165q436j6345K5538j274
12931H8715r457K3000J4725l701k019K3763J7396J0659p796j9378k2975m4765
12919F8167P088K0814K9539l245M376k0928m905R775J7336J6662K2743L1344j0671
12906A88095k2652N568q711k1732L1444K6523k7228l0993l110M554k1605l58j5094
12893A04701p090R103J6355K4319P682r548K3146J7190K214P865j2878q466j3530
12880A61063J9198J0924k428j9382l163j2548l3704k853J7993M48n925r247k3602
$$ y = [252881, 269233, 278389, 277846, 263444, 236188, 209412, 212914, 206362, 202825, 193655, 171357, 160712, 156100, 156469, 166027, 148419, 88258, 90812, 111020, 119551, 136141, 153380, 153146, 147306, 152045, 132432, 133085, 143416, 152492, 137083, 117208, 91394, 63067, 89232, 80796, 64451, 89989, 88715, 79258, 102258, 116983, 113282, 111263, 135026, 152422, 163081, 155285, 135907, 112932, 68167, 75255, 96069, 125608, 122363, 126739, 105811, 100906, 110681, 128017, 144679, 167422, 198766, 188095, 165443, 171011, 162300, 140568, 172012, 198535, 171307, 140314, 137204, 141758, 120153, 119795, 104701, 97611, 106714, 123069, 147388, 155070, 145522, 168668, 185858, 188072, 195937, 183059, 174593, 161063, 180261, 191185, 188757, 169375, 166212, 153664, 119960, 117107, 135100, 135548, 129623, 120376, 96774]
12867I6774k0799l76R108P165n510O9R170J1479J3459L5052L0963J7063l145M243
12853B04715J6407k709K0954J359J0257j06J168N2604L0126L3119J926l1671N987
12840C44136j3720J2088K8859J6668m833J2808K1423L0714R558l67m839J8342
12828D70837n073j6895k2666J993k2414j8250J9100J5853L941o206j5016K4777
12816D29981J0172K4164J575J3962k6011n081j9653n0216j4118J4648L9660K9675
12804D48758k0616j7470q105M0264L0709j2467L3463O8732L4568k4797j2612m2071
12792E18356j8513L382K7696K9Q77Q203J5641J3030J8966p808J1745K5064M2620
12779F59288L3627K8974N6693K4878J0375J7747M2578M4764M5955K4568L5954
$$ y = [96774, 75975, 75599, 84707, 91872, 86362, 86431, 95601, 107080, 120539, 155591, 186554, 203617, 200472, 204715, 221122, 218413, 239367, 240726, 250983, 250877, 252045, 304649, 334775, 367894, 369820, 338149, 344136, 330416, 342504, 371363, 388031, 383198, 396006, 417429, 448143, 457701, 457334, 452495, 470837, 465764, 448869, 426203, 428196, 405782, 387532, 406632, 422485, 426426, 420220, 405204, 429981, 440153, 464317, 465892, 479854, 453843, 448762, 429109, 378893, 364775, 379423, 419083, 448758, 428142, 410672, 402567, 442831, 473540, 461073, 494536, 563268, 597836, 573039, 560427, 518356, 499843, 503225, 530921, 530950, 531827, 540030, 555671, 568701, 587667, 579859, 591604, 616668, 659288, 692915, 721889, 778582, 803460, 813835, 831582, 874160, 918924, 964879, 989447, 1025401]
12768A025401M5002N9833N8975N2342K3624O1233P5799N7160P5585P9173N4946
12757A669073M1163R3942Q4245N3115J14605J43366J45385J69516J73827J95344
12747B883581K15042K61626K73891L48965M03371M66206N49778O42969P77383
12738F822812R03202J060585J265014J441742J642463J831104K107748K515166
12730A9589836L184059M264262O053250R109477J4001291K0230569K5973872L1612959
12722A34019575L6048673L4694667K9573878K3348711J3323947J145284r816940
12715B62337795j9070485k6750351l2269618l1725315k8622604k4898100j8347635
12708H0653687j2286971q337247o017738m646037l774432l280761k985605k711680
$$ y = [1025401, 1070403, 1130236, 1189211, 1241553, 1265177, 1326410, 1402209, 1459369, 1534954, 1614127, 1669073, 1710236, 1804178, 1888423, 1941538, 2056143, 2199509, 2344894, 2514410, 2688237, 2883581, 3098623, 3360249, 3634140, 3983105, 4386476, 4852682, 5402460, 6045429, 6822812, 7726014, 8786599, 10051613, 11493355, 13135818, 14966922, 17074670, 19589836, 22773895, 27038157, 33091407, 42200884, 56202175, 76432744, 102406616, 134019575, 170068248, 204762915, 234336793, 257685504, 271009451, 272154735, 262337795, 243267310, 216516959, 184247341, 152522026, 123899422, 99001322, 80653687, 68366716, 60029469, 54011731, 49365694, 45591262, 42310501, 39324896, 36613216]
12700C6613216k487137k281640k086545j846561j626593j444820j230451j080107
12692B2529362r79686q77725p43851o59417o18059n96117n82432n31797m69453
12683A6470825m55169m55597l89064l45676l46032l59708l38015l42361l54863
12674A3084340l73098l74820l60160l43954k99087l04768k82819k44260j95654
12665A0305720j56254j26668j26320j91379j65966j99291k12904k11144k23105
12656H692689k31935k27938k23570k25619j90694j87049k06093j95048k19786
12647F784957j87332j59796j39499j05182q9028q0641o5726n9367o9334r7783
12637E731269j41190j63477j42023j02684j15616j23241j05465j25322j22869
$$ y = [36613216, 34126079, 31844439, 29757894, 27911333, 26284740, 24839920, 23609469, 22529362, 21549676, 20671951, 19928100, 19268683, 18650624, 18054507, 17472075, 16940278, 16470825, 16015656, 15560059, 15170995, 14825319, 14479287, 14119579, 13781564, 13439203, 13084340, 12711242, 12336422, 11976262, 11632308, 11333221, 11028453, 10745634, 10501374, 10305720, 10149466, 10022798, 9896478, 9705099, 9539133, 9339842, 9126938, 8915794, 8692689, 8460754, 8232816, 8009246, 7783627, 7592933, 7405884, 7199791, 7004743, 6784957, 6597625, 6437829, 6298330, 6193148, 6104120, 6023479, 5957753, 5898386, 5829052, 5731269, 5590079, 5426602, 5284579, 5181895, 5066279, 4943038, 4837573, 4712251, 4589382]
12628D589382j01268j10234j09434r8024j17253j04630r7593p8434p4858n2959
12618C644695n9872p9295l7809p3613j18951j23009p1046k6472m1770m4799m5965
12607B922094k9244l1059l5949k6268J8006N3441J04132J08717J67290J87736
12597C438896J80677P5859j4849j02270j70965j84840j94728j60797j27967r4002
12587B645014p0651p0786m6771m7349n4959m2865m6838l2960l3909k9248m5140
12576B123538o7466l5684k3693l7890l2944m9208p4052m0444j0700m7714j901
12565A701842k1141l4884k0417l0649k6271N3k095j4714N412L5196K6482m729
12553A614085R585l6072l1820n5970r2705j10680l6338j9911M077k9048o8848
$$ y = [4589382, 4488114, 4377880, 4268446, 4170422, 4053169, 3948539, 3850946, 3772512, 3697654, 3644695, 3584823, 3505528, 3467719, 3394106, 3275155, 3152146, 3081100, 3054628, 3012858, 2968059, 2922094, 2892850, 2861791, 2825842, 2799574, 2817580, 2871021, 2975153, 3083870, 3251160, 3438896, 3619573, 3695432, 3680583, 3578313, 3407348, 3222508, 3027780, 2866983, 2739016, 2645014, 2574363, 2503577, 2456806, 2409457, 2354498, 2311633, 2264795, 2231835, 2197926, 2168678, 2123538, 2056072, 2020388, 1996695, 1958805, 1925861, 1876653, 1802601, 1762157, 1751457, 1703743, 1701842, 1680701, 1645817, 1625400, 1594751, 1568480, 1568533, 1566438, 1551724, 1557136, 1592332, 1618814, 1614085, 1623670, 1587598, 1555778, 1499808, 1407103, 1296423, 1260085, 1240174, 1244251, 1215203, 1146355]
12542A146355l6209m7460m5491k6728l3979m4882q187m297l1502m1758r621R28
12530H17169k2986k8282K2171L910j7187q66r544L2022K0556j8213j1067k9269
12518G58414j3552j017j6533N543j6700j9890j5809l3074K3150J0567j0248j3483
12506F57368m331J2381m07j6327p968n436j084J5952P361j3228l9599k2993k6408
12493E55281k6232j4859K4128j5081k7101k4782K4746M348p745l3673k5787K4298
12481D57541K2084L387r667L0701m306j2738n52j9056k1311k7607L8133M2771
12469D99380p778k6833j6179k9788j4248J3517k5425j1631L4718j0212j5755q242
12457C81524p431J032Q049J9203J3922J2850k296m440P672m108k5552l8712l3330
$$ y = [1146355, 1110146, 1062686, 1017195, 990467, 956488, 911606, 903419, 899122, 867620, 825862, 816241, 817169, 794183, 765901, 788072, 791982, 774795, 773929, 764385, 796407, 816963, 798750, 787683, 758414, 744862, 743845, 727312, 732855, 716155, 696265, 680456, 647382, 670532, 681099, 670851, 657368, 653037, 665418, 665011, 648684, 640716, 635280, 634196, 650148, 657509, 644281, 604682, 581689, 555281, 529049, 514190, 538318, 523237, 496136, 471354, 496100, 500448, 492703, 459030, 433243, 457541, 479625, 483012, 473345, 504046, 499740, 487002, 486450, 467394, 446083, 418476, 456609, 499380, 491602, 464769, 448590, 418802, 404554, 418071, 392646, 381015, 415733, 405521, 389766, 381524, 374093, 375125, 383174, 402377, 416299, 429149, 426853, 422413, 430085, 425977, 400425, 361713, 328383]
12444C28383q693J0318J6674M3439P915k7756l0749j4612J6478M294J5622J6427
12432C77740j1293j2819j4132j6355p864Q240m876M2702J1871j3795k6791k8213
12420C04415J2226J8962j7698P801K832j1252k40Q567J0753J4063J7496k0482
12408C47443k4348J23J1360R594j679j4717k83J9277O879j1311j5639j9753o050
12395C00896K4492K1082J34o726J1826p930j1842k5525N015N919j9766j260L5779
12382C32094j8935k6421J6743q047P863L0308J8180o933k2120M014K4782K3656
12370C75184l661k9765N97Q343R556n636j3263K9984O617j0736n789L2833K5533
12357D19797J2530j1418j3160l6714k2820m283N714N922N668M6588J6268J8603
$$ y = [328383, 319690, 330008, 346682, 390121, 398036, 370280, 339531, 324919, 341397, 345691, 361313, 377740, 366447, 353628, 339496, 323141, 315277, 323517, 318641, 361343, 373214, 359419, 332628, 304415, 316641, 335603, 317905, 325706, 328538, 317286, 317046, 325613, 336366, 350429, 367925, 347443, 323095, 323218, 334578, 344172, 342493, 327776, 327493, 346770, 353649, 342338, 326699, 306946, 300896, 325388, 346470, 346604, 339878, 351704, 343774, 331932, 306407, 311422, 317341, 297575, 296315, 332094, 313159, 286738, 303481, 295434, 303297, 333605, 351785, 344852, 322732, 326746, 351528, 375184, 371523, 341758, 342355, 350698, 360254, 354618, 341355, 371339, 377956, 367220, 361431, 394264, 419797, 432327, 420909, 407749, 371035, 348215, 343932, 349646, 355568, 361236, 407824, 424092, 442695]
12345D42695j5074k6883r052L3350L0794J9645p677J5815N115l3284n254m517
12333D45673J3555J2616R555J0184N7221O7891J20831J52409J19744R6625K9709
12322A136013l7854q7194o2404p1633m4855m529j4469K7188J3264J2399L3998
12311H99924L5556K221K5380L6216L2453L8342L9230L3900O709J4042N5815O4706
12299A284494L1958L4965J7994M9919O3856N5610R3820J32134J45495J77279K45840
12288B333364K62827K45149K75927L58277L79232L71143L01134K25343R5141o0379
12278D787158j61487j78478k05131k30109k45598k05038q9633J2287Q4124J32416
12268C700511J34707J03004M0064j5622l1367o8984p2320m0949n7530j2680K3421
$$ y = [442695, 427621, 400738, 391686, 425036, 455830, 475475, 467798, 483613, 488728, 455444, 450190, 445673, 459228, 471844, 481399, 491583, 548804, 616695, 737526, 889935, 1009679, 1106304, 1136013, 1098159, 1010965, 948561, 876928, 832073, 827544, 813075, 840263, 853527, 865926, 899924, 935480, 937701, 963081, 999297, 1031750, 1070092, 1109322, 1143222, 1149931, 1163973, 1219788, 1284494, 1316452, 1351417, 1369411, 1419330, 1483186, 1538796, 1632616, 1764750, 1910245, 2087524, 2333364, 2596191, 2841340, 3117267, 3475544, 3854776, 4225919, 4527053, 4752396, 4847537, 4787158, 4625671, 4447193, 4242062, 4011953, 3766355, 3561317, 3471684, 3483971, 3568095, 3700511, 3835218, 3938222, 3978286, 3962664, 3931297, 3862313, 3789993, 3749044, 3691514, 3678834, 3702255]
12257C702255R757o331L3967P7916J14091J92141K02123K30334J83439P4759m7631
12246D766820j40107j19132j17630p7095J9945J41161K15997L18578M66894O09153
12236F084584P25317O53369M19944R0059k85687n00382m19018k02747L8426J75726
12226F779591K49911K30639J80331K02178K95581L84693N31867O14578N97310
12217A0066679N92253M73756M13694L70075L14715L62703L82977L36717K89865
12208A3603434L18014N50336Q88309J371189K020448K983330M499664O713308
12200C2948032R558740J2609477J4245044J2719884Q344245K241470n022942j0845279
12192G6798671j1937938r063668n530126l013479j465224n20605Q9674O05859
$$ y = [3702255, 3712012, 3705681, 3739648, 3817564, 3931655, 4123796, 4325919, 4556253, 4739692, 4814451, 4766820, 4626713, 4507581, 4389951, 4312856, 4332801, 4473962, 4689959, 5008537, 5475431, 6084584, 6809901, 7463270, 7883214, 7973273, 7687586, 7187204, 6768186, 6565439, 6603865, 6779591, 7029502, 7260141, 7440472, 7642650, 7938231, 8322924, 8854791, 9469369, 10066679, 10658932, 11132688, 11546382, 11916457, 12231172, 12593875, 12976852, 13313569, 13603434, 13921448, 14471784, 15360093, 16731282, 18751730, 21735060, 26234724, 32948032, 42506772, 55116249, 69361293, 82081177, 90425422, 92666892, 87643950, 76798671, 64860733, 55797065, 50266939, 47253460, 45788236, 45267631, 45357305, 45963164]
12184D5963164J321444K137733K702804K675943K168846J277266J89797m52329
12176E7984668k48333O56151J817404K827222L380984L441510L090553K133740
12168G5083899M28237j276412k093309j849751r10531M42481J968516L689816
12160G5482946O104340J0031971J6665417K6392106L6002509L8435017L0763609
12153B39877915J6790339l045978k6468339l9837100l6346633k5457947j5859241
12146A09653016r532800n795606l443703j632110N2769J387791J983746J515685
12138I4188788J83650j497603l161276m303292m397406l442825k191315j153620
12130G4225101m00671O1454l3935o50589j674549k721285l159888k710679j782328
$$ y = [45963164, 47284608, 49422341, 52125145, 54801088, 56969934, 58247200, 58436997, 57984668, 57736335, 58392486, 60209890, 63037112, 66418096, 69859606, 72950159, 75083899, 75512136, 74235724, 72142415, 70292664, 69382133, 69824614, 71793130, 75482946, 81587286, 91619257, 108284674, 134676780, 170679289, 209114306, 239877915, 256668254, 253622276, 227153937, 187316837, 150970204, 125512257, 109653016, 100120216, 94324610, 90880907, 89248797, 89301566, 90689357, 92673103, 94188788, 94372438, 92874835, 89713559, 85410267, 81012861, 77570036, 75378721, 74225101, 73824430, 73885884, 73851949, 73201360, 71526811, 68805526, 65645638, 62934959, 61152631]
12121F1152631q96681k34128K80848R23543K079461M289309P634016J1151885
12113H6380884J2663241J0695028N916481j182672r616330j5342205j5749085
12106G3765342j2755410r035288o049643m101948k789522j908870j345637r88380
12098C4790644q30394q61721q34284q85235q98305q59593q39790q65713q88738
12089B7026871r91921j062596j093427j004431q33349o70321n72667n88193o50635
12080A9559331p17932p78759q21181p53841o57840n60465m67365m03148l76058
12071A4022742l52406l53747k78845k97482k95870k51260k24757k32564k25135
12062A1510676j34800r2377r8601j02931j53287j76285k09813k59323k98898k68928
$$ y = [61152631, 60255950, 60021822, 60302670, 61226213, 63305674, 67594983, 75228999, 86380884, 99044125, 109739153, 115655634, 114472962, 104856632, 89514427, 73765342, 61009932, 51974644, 45925001, 41823053, 39033531, 37124661, 35779024, 34790644, 33960250, 33098529, 32264245, 31379010, 30480705, 29621112, 28781322, 27915609, 27026871, 26034950, 24972354, 23878927, 22874496, 22041147, 21370826, 20798159, 20209966, 19559331, 18841399, 18062640, 17241459, 16487618, 15829778, 15269313, 14801948, 14398800, 14022742, 13670336, 13316589, 13037744, 12740262, 12444392, 12193132, 11968375, 11735811, 11510676, 11375876, 11283499, 11184898, 11081967, 10928680, 10752395, 10542582, 10283259, 9984361, 9715433]
12052I715433k05878k21299j64388j59695j66894j53817j23855j02918k1192J4453
12042H409950K4595p8937j33012j87368k75170l03844k94327k85097k57045k42275
12032F377470k06848j53092j00818r8680q5511j11761j12919j12509j16712j26459
12022E152161j53944j32124j42803j09716q3837o0926q6751p7294q8488q9970
12012D126308j10240j19623j19753n9070l8988o4445m8930m9717o0995l8573n9098
12001C356876o4887p2928q0831n5384q1476q5716n9687o2117o9946n8815k9225
11990B635864k4425m0951l8030l9497l1701m0122o6183k7999k4483m6079k1608
11979B234786l2936l3834m6580n7447m6494n7377m5718k3073m3749n8168k2148
$$ y = [9715433, 9509555, 9288256, 9123868, 8964173, 8797279, 8643462, 8519607, 8416689, 8395497, 8409950, 8434545, 8355608, 8222596, 8035228, 7760058, 7456214, 7161887, 6876790, 6619745, 6377470, 6170622, 6017530, 5916712, 5818032, 5732521, 5620760, 5507841, 5395332, 5278620, 5152161, 4998217, 4866093, 4723290, 4613574, 4529737, 4468811, 4382060, 4304766, 4216278, 4126308, 4016068, 3896445, 3776692, 3717622, 3678634, 3614189, 3565259, 3515542, 3454547, 3415974, 3356876, 3291989, 3219061, 3138230, 3082846, 3001370, 2915654, 2855967, 2793850, 2723904, 2665089, 2635864, 2611439, 2570488, 2532458, 2492961, 2461260, 2421138, 2354955, 2326956, 2302473, 2256394, 2234786, 2201850, 2168016, 2121436, 2063989, 2017495, 1960118, 1914400, 1891327, 1847578, 1789410, 1767262]
11968A767262l9687l1661n4271l6945k1106J0052l0400j9184k3056k4676o029
11957A490299k0778r263o661l4657m0906m6430l1279n584j2709Q196M937l4911
11945A260254l0218k3381n518r132J5031l2033l6457l9831k9006R055o516o602
11933A065646p849o458K925J2195L3937L076l9200k8168n0246m7407M198J8026
11921I60675n5402k5399j3744r412l5999k1414N652J0937o809o581J7753p895
11909H12362k7646j8305l7827m0315l706q01k1798K629J0597q17j5560m9896J6553
11896F25470J7452O006k6686n4186j8070L590J2000P828o185l031m662j6112L561
11883E46975J3285l4119l3457l0254j8371k7926p353P496K9422M043J833J1191
$$ y = [1767262, 1727575, 1695914, 1641643, 1604698, 1583592, 1593644, 1563244, 1544060, 1521004, 1496328, 1490299, 1469521, 1460258, 1453597, 1418940, 1378034, 1331604, 1300325, 1294741, 1282032, 1290228, 1295165, 1260254, 1230036, 1206655, 1201137, 1192005, 1207036, 1175003, 1138546, 1098715, 1069709, 1078764, 1072248, 1065646, 1057797, 1051339, 1054264, 1066459, 1100396, 1103472, 1064272, 1036104, 985858, 938451, 942649, 960675, 905273, 879874, 866130, 856718, 820719, 799305, 804957, 815894, 809085, 802504, 820257, 812362, 784716, 766411, 728584, 688269, 684563, 683762, 661964, 664593, 675190, 674373, 658813, 608917, 625470, 642922, 648928, 622242, 568056, 549986, 553576, 565576, 573404, 567219, 564188, 559526, 543414, 546975, 560260, 526141, 492684, 462430, 444059, 416133, 408780, 416276, 445698, 449741, 451574, 462765]
11871D62765P203j2759l7226P891o232j3709M763j69j2401k6426K691M388k0314
11858C60465k0740j53J7740J4328l3431k2817J2958k988K060k694k7212j8931
11846B78585K3722n005p558l9452P515J4975k887K201J4265J4889j1122l4988
11834B55140k5523p29o842K670K4194J6999Q047j9492j1349P889J2601j4239j4045
11821B35321k7813k6593J842O130J8477N869L359k1383j6625m515P292k006k4618
11808A54737K7838K205m202O547j7144r381k4191J3066O508J9271M649j1795o791
11795A61317m929r657m246K533L5702j0253l4733j8450Q954K3526Q058m8011k4518
11782H5293J908K0161J3328j55J1387k0758m0364j331J9215K4371p767j545j8655
$$ y = [462765, 469968, 457209, 419983, 427874, 421642, 407933, 412696, 412527, 400126, 373700, 376391, 380779, 360465, 339725, 339572, 357312, 371640, 338209, 315392, 328350, 325362, 327422, 324728, 297516, 278585, 302307, 297302, 289744, 250292, 257807, 272782, 269895, 272096, 286361, 301250, 290128, 255140, 229617, 228888, 222046, 224716, 248910, 265909, 273956, 254464, 243115, 251004, 263605, 249366, 235321, 207508, 180915, 182757, 188887, 207364, 213233, 216592, 195209, 178584, 174069, 181361, 179355, 154737, 182575, 184780, 180578, 187125, 169981, 160600, 136409, 149475, 155983, 175254, 179903, 168108, 161317, 156388, 146731, 142485, 145018, 180720, 170467, 135734, 117284, 126238, 149764, 157822, 109811, 85293, 87201, 107362, 120690, 120535, 131922, 111164, 70800, 69469, 88684, 113055, 105288, 103743, 85088]
11769H5088K993K9501R11K2438K3789j290J2386J57l8216j989M4364K9454q292
11756B01294j1890Q389k2327l318M2991L3840N0889Q9140Q2547O4653L689l5116
11744E04781n2317k4101j60n5020m0383j9663j1730K1970J0689J6026j5312m828
11732C29952J0569j4125n527L7929K7238K685J885Q548K5410K1160K5186q200
11720D62710L2931p608l4464P548L1241r844q003K1093K1758n527n293Q8369J08896
11707G03807J87028K04861J89443J15536L4495m5690j18422j81722k04511j58687
11697G26138j02861o8309m3546l8588j8932M253l518k2410J3013N814j2334m1965
11685C96755M183Q300L3487R933j7676J3243j5624k0708k9041P988J4216Q469
$$ y = [85088, 88081, 117582, 118493, 140931, 164720, 163430, 175816, 175973, 137757, 135768, 180132, 209586, 201294, 189404, 197793, 175466, 172148, 215139, 248979, 299868, 389008, 471555, 536208, 539897, 504781, 452464, 428363, 428203, 373183, 332800, 313137, 301407, 323377, 334066, 350092, 334780, 329952, 340521, 326396, 320869, 358798, 386036, 388721, 390606, 399154, 424564, 445724, 470910, 462710, 495641, 488033, 453569, 461117, 492358, 482514, 474511, 495604, 517362, 511835, 506542, 594911, 703807, 890835, 1095696, 1285139, 1400675, 1435170, 1389480, 1271058, 1089336, 884825, 726138, 623277, 554968, 511422, 472834, 453902, 458155, 454637, 432227, 445240, 451054, 438720, 396755, 400938, 409238, 442725, 452658, 434982, 448225, 432601, 411893, 382852, 390840, 405056, 413525]
11673D13525K5824Q117j6477j9176p881k664Q402M5073K2735K2291M7087O7105
11661F13961K591j2166m1758p4615o2674p0732l0081r035K677l1458l4616q787
11649B43307k3484j9315J602k8936l4398j5039J4044p906j1615m945J7L054N963
11636A22349J8492j1218m378J6189J5360q155l4519j1266k6503j9399n607K3683
11624G5028R456k4334Q228N682N001J6373K8872J0541l0936l874l7137k3217n984
11611C3699m361O534K564K5300o961k982l7635m0168m67L8776M9639j0854r59
11598E2125J2571p016k3900r882o13M2704K8120L906p941L4840k793l7392m0157
11585D4572J4004l01k6033k3885K8074J9069L037q160j6545L1952N315j5831k3818
$$ y = [413525, 439349, 447466, 430989, 411813, 403932, 401268, 409670, 454743, 477478, 499769, 546856, 613961, 616552, 604386, 562628, 488013, 425339, 354607, 324526, 315491, 318168, 286710, 252094, 243307, 219823, 200508, 202110, 173174, 138776, 123737, 137781, 129875, 118260, 113315, 113332, 116386, 122349, 140841, 129623, 125245, 141434, 156794, 148639, 114120, 102854, 76351, 56952, 51345, 75028, 84484, 60150, 68378, 74060, 79061, 95434, 124306, 134847, 103911, 100037, 62900, 39683, 33699, 29338, 35872, 38436, 63736, 56775, 53793, 16158, -24010, -24477, 14299, 63938, 53084, 52125, 64696, 57680, 33780, 23898, 23285, 65989, 94109, 98015, 90074, 124914, 122121, 84729, 44572, 58576, 58275, 32242, 8357, 36431, 55500, 58537, 50377, 33832, 65784, 71099, 55268, 31450]
11572C1450J9373p088R609J7100L969l6153k1811k6168j0551k161J0910r324j9631
11559d0476m129L6485L6090j631J1444M5282J9733j3706j7887l4220p138o36n061
11546B4150O904k317l983l270M46J4271q725j9650o406J6705Q239j1573j8384
11533c593n760k8992L405m843J4283J1216K273k5591P952K630L855N041J7225
11520h99o110j2087J3495K0042l159j9442O251k957K2534K1099l986K564k7587
11507I758K926K5806j4742j8061L850j7736j4641l81m872p995M489p223J6713
11494b2109J3629k266N433R900Q661K9318J0649k2588j3595K0352Q576n858m779
11481C5323r543M089P060K2159j0873n936k2950j9839J5650l579k556l756m212
$$ y = [31450, 50823, 43735, 53344, 70444, 74413, 38260, 16449, -9719, -20270, -22431, -11521, -20845, -40476, -44605, -8120, 27970, 26339, 37783, 83065, 102798, 89092, 71205, 36985, 29847, 29211, 24150, 31054, 28737, 24754, 21484, 21930, 36201, 27476, 7826, 1420, 18125, 26364, 14791, -3593, -9353, -38345, -34940, -39783, -25500, -14284, -12011, -37602, -29650, -27020, -23165, -18124, -899, -7009, -19096, -5601, 14441, 11282, -8160, -1909, -4866, 17668, 38767, 34781, 37345, 9758, 12684, 38490, 23748, 5687, 9537, -8199, -22840, -23221, -28093, -36088, -31599, -38822, -22109, -8480, -10746, -5313, 4587, 13248, 42566, 53215, 30627, 17032, 37384, 45960, 40102, 35323, 25780, 29869, 36929, 59088, 48215, 42279, 19329, -510, 15140, 11561, 9005, 5249, 1037]
11468A037k946K140K4415l326j2484Q265l697K6814L779j1507k7701L823N647
11455A4259j1074k330J9400K6690n419j8715J0230R139J1335j6827j801M279n507
11442C3659J8445k7635j8730K9534K9782j2447j6955J3480K9535j9251j6287J9093
11430F2223j4186k6423k3165J8454K5638J6794j663l9291J6214K5410l245k110
11418E4650j6355m1034k8193K585M4751k3231K2045m17k8533n321K3642J997L0756
11405C7342J8321k6298p227J4846n246J1018R078k1887N89k975k2182J5406L302
11392B4087j9995K257J3409J1171m772k5184k0291l604K3325L8970r632n983m037
11379A9721l0339j0176M958K1160J8909n091J3904j2741k888K527n637j0072R287
$$ y = [1037, -1909, 231, 24646, 21320, 8836, 17101, 13404, 40218, 43997, 32490, 4789, 8612, 14259, 3185, 855, 20255, 46945, 41526, 22811, 33041, 42180, 53515, 36688, 34887, 39166, 33659, 52104, 24469, 5739, 35273, 65055, 52608, 35653, 49133, 78668, 59417, 43130, 62223, 48037, 21614, -1551, 16903, 42541, 59335, 57672, 18381, 34595, 60005, 56760, 54650, 38295, -2739, -30932, -28347, 16404, -6827, 15218, 14801, -13732, -19053, 4589, 6586, 37342, 55663, 29365, 22138, 36984, 31738, 42756, 51834, 29947, 30536, 27561, 5379, 20785, 24087, 4092, 6349, 19758, 30929, 26157, 973, -19318, -22922, 403, 39373, 29741, 23758, 19721, -10618, -20794, -15836, 5324, 24233, 19142, 33046, 20305, 17417, 19944, 14307, 4235, 13522]
11366A3522J414o933k0321K357L4883R873j8150J20M3854j3072j6080Q07n527
11353B6747l5756n5R897Q495m141l665J528K475k6484Q052j7719J0438J5208j0724
11339a5704J634q919l26J7665J8768m33P925Q271O554k8420j2457J7830O616J9321
11325C8325J2046m2574O606J4869j1237k0008r442K0574M371o443J7959K7775
11313E2821l3415j4944J5164J9981k0956k1311l309K2524m133j9010K005J4708
11301A0125k0394k4226k0698J2930L1902n952j3704j2017J3198j46J0198M7987
11289B9203k503q575j2525m308j747l852k6064O985M559J0487J6967M621j008
11276A2240n1503j8788J0171k787n468N449J6385J3928K552J7953j3346O72K3332
$$ y = [13522, 14936, 8003, -12318, -9961, 24922, 34795, 16645, 16765, 60619, 47547, 31467, 32274, 26747, -9009, -9064, 833, 9328, 5187, 1522, 3050, 5525, -20959, -12907, -30626, -20188, -4980, -15704, -14070, -22989, -23315, -5650, 13118, 12685, 20610, 28881, 35435, 7015, -5442, 12388, 19004, 38325, 50371, 7797, 14403, 29272, 18035, -1973, -11415, 9159, 13530, 7087, 25046, 52821, 19406, 4462, 19626, 39607, 18651, -2660, -5969, 16555, 12422, -6588, -4583, 10125, -10269, -34495, -55193, -42263, -10361, -16313, -30017, -42034, -28836, -28982, -18784, 29203, 26700, 18125, 5600, 1292, -455, -4307, -30371, -23386, -18827, -8340, 8627, 13248, 12240, -39263, -58051, -47880, -50667, -56135, -50686, -34301, -20373, -17821, 132, -13214, -12542, 10790]
11263A0790J0705n838O69j541k2089J3919J4030j6337K3618j3311J381J6811J0286
11250D3093r914k5234l1262j6801O704j297J0103L1537Q011l3802p399J2056O022
11237h183O778j348j4642j2850J6050L0804M406j5575j6127m966j3841J8320Q716
11224b458K7813L202j4556N909O024m053k253k0056j1263J192J6017J8208J3334
11211C7060o03j2236m769J9425P900K00q754R743p994j5053J0075k1918j8303
11198e227K092K093J6366j1505J4951J6100k2367p340L1420M859j6656p859j3262
11185C665l4382L808J5948P016m594L6614M138r073j5568n983j5734J0453L4864
11172C1172m001j1567r819L5711R077j2574r038l0121j8418K2473Q343J1749j2372
$$ y = [10790, 21495, 15657, 16326, 14785, -7304, 6615, 20645, 4308, 27926, 14615, 15996, 32807, 43093, 33179, 7945, -23317, -40118, -33414, -34711, -24608, 6929, 14940, -18862, -26261, -14205, -8183, -1405, -2753, -17395, -30245, -14195, 16609, 21015, 5440, -10687, -15653, -29494, -11174, -2458, 25355, 28557, 14001, 19910, 25934, 21881, 19628, -428, -11691, -10499, 5518, 23726, 37060, 36457, 24221, 19452, 38877, 46777, 46977, 38223, 47966, 39972, 24919, 34994, 13076, -5227, -3135, -1042, 15324, 3819, 18770, 34870, 12503, 5163, 36583, 41442, 24786, 16927, 3665, -30717, -26909, -10961, -3945, -8539, 28075, 32213, 23140, 7572, 1589, -14145, -3692, 31172, 27171, 15604, 5785, 41496, 50573, 37999, 28961, -1160, -19578, 2895, 11238, 22987, 10615]
11159A0615r938o606k5066k2056N458J8624J6762k248r994K9968j1258l1283K9687
11146g335K8581j8115j816J8930J0731l532P481M131N326j3186l150l1964J5212
11133A1294Q617j8333p916O472k6622j3141J3733k1409M567j3478j6063L271J0707
11120e8301J8121j04P693l386l4598R253L3276K8379o645m144R171J2937K1583
11107C3235p859q048k894K1639M297p669J2995j5605o509k8043m206j9780P45
11094b7702L183j2227J5764K3822K3020O177k1695j6061K187J4448n31M323J3204
11081B7912J5023j0739j1872m1749k2544K0596L3381m776j0774K7213j1701l7667
11069b7697Q895N2946K3790j9371l5287l9216q290m98j4096o872J0577L3493j5288
$$ y = [10615, 677, -5929, -30995, -53051, -47593, -28969, -12207, -14455, -24449, 5519, -5739, -37022, -7335, 21246, 3131, 1315, 20245, 30976, 27444, 34925, 39056, 44382, 31196, 28046, -3918, 11294, 19911, 1578, -6338, 134, -26488, -39629, -25896, -47305, -42738, -56216, -72279, -69008, -58301, -40180, -40284, -32591, -35977, -70575, -61322, -28046, 333, -6312, -10456, -1285, 11652, 33235, 25376, 17328, 14434, 36073, 40370, 32701, 45696, 30091, 23582, -4461, -8667, -28447, -27702, -24519, -36746, -20982, 2840, 25860, 32037, 10342, -5719, -3532, 10916, 10385, 14708, 27912, 42935, 32196, 20324, -21425, -43969, -23373, 10008, 5232, -5542, 21671, 9970, -27697, -18802, 34144, 57934, 38563, 3276, -35940, -44230, -44728, -58824, -65696, -55119, -21626, -36914]
11056c6914k352L9418K2054l948k7879j4930k6417k685K3209J1219J3066J3424
11044G265r940k555j2964l198M0947j7324l2323j2051l919q535J1547j00l381
11031d6531J5032J4741O910J4948j6763J928J3898O08K3J958j4356j5718j4391
11018c7713j928M3826L0002K077l853m8542R561n364j7484K0582K1716k092J7396
11005B8184k5152k3942K377K3159O627k8128J2782Q437k3347O047K1074j3934
10993e816k1958j3641J6829K4492R817K1068R234O703l6991q869k735R901k8807
10980b0773j089J4045R24R020m646l1425K5641R203J7119R990l8198j0490m266
10967b4945J9167J9928M0267K2682p866k8383J3890l10O956j4710k5751j0501
$$ y = [-36914, -39266, 152, 22206, 18258, -9621, -24551, -50968, -53653, -30444, -19225, -6159, 7265, -2675, -5230, -18194, -21392, 19555, 2231, -30092, -42143, -46062, -54597, -43050, -43150, -46531, -31499, -16758, -9848, 5100, -11663, -9735, 4163, 4771, 4794, 6752, -7604, -23322, -37713, -39641, 4185, 34187, 36264, 32411, -16131, -6570, -11934, -29418, -8836, 12880, 10788, 28184, 3032, -20910, -18533, 4626, 11253, -16875, -4093, 4344, -19003, -12956, 8118, -5816, -27774, -41415, -24586, -94, 9723, 30791, 40025, 46728, 9737, 868, -1867, 8034, -20773, -21862, -7817, -6893, 2127, -2519, -33944, -8303, 900, 18019, 28009, -10189, -20679, -24945, -5778, 14150, 54417, 77099, 69233, 40850, 54740, 54430, 61386, 46676, 20925, 10424]
10955A0424j9587P782j2143q544L5748J0648k9582m6941j1283K7418L4444k278
10943c894J2314J7768k9567r446j4792L2058L5421q892j6942p830j4970j2830
10931b1602L815L6296J3006k3726q926R680j5776J60j0859q147P551q859N148
10918b2239K6779J1594p35K1557m625M727j2777J960o178J6139M261j1424k6487
10905B552j0690j2057k4919N640L6935q499l433R801K3689J9326P527k2317m6220
10892b2665n391L219K4554O839Q466J3738j1438l3569j0977K962J560J4475p688
10879a5915j0266Q608K188j0179J0756J1906J3516J2517j5950j0856r113M093
10867h695N1297M567R122n582J304o606j9621j9429J5897k327j997k129K0756
$$ y = [10424, -9163, -1381, -13524, -22068, 13680, 24328, -5254, -52195, -63478, -36060, -1616, -3894, 8420, 26188, -3379, -12825, -27617, 4441, 39862, 30970, 14028, 6198, -8772, -21602, -17787, 18509, 31515, 7789, -1137, 8543, -7233, -7073, -17932, -26079, -18528, -27387, -22239, 4540, 16134, 15399, 36956, 32331, 37058, 24281, 26241, 20063, 36202, 40463, 29039, 2552, -8138, -20195, -45114, -39474, -2539, -11038, -14471, -4670, 19019, 38345, 45872, 23555, -22665, -28056, -24837, -283, 6556, 15022, 28760, 17322, -16247, -27224, -24262, -22702, -8227, -15915, -26181, -17573, -15385, -25564, -14808, -2902, 10614, 23131, 7181, -3675, -12788, -8695, 42602, 47169, 56291, 50709, 52013, 45407, 25786, 6357, 22254, 19927, 17930, 15801, 36557]
10854C6557N720J100J7069j918R831Q536L6129l89l3621j7147l7668l5927l3902
10841d5630J3418K9259k376O869k1932Q695k1994J2954K9410k70L650K2046L931
10828C8030J800k9437K5929K9669q591N676L63o198k2133k4716l982j941N395
10815I864o54K2517l700k0478p339j8122J7764M4658Q472q740l2665j0164n644
10802d231J6065J1785j4260j3309P655j4230O55J3719k077j976P545K6365j7054
10789A6652q231n018q423L033J1622q537j1077j1056M290L2697K5664o876q938
10776B5802J971K1775j7816j7060J6053q037o310q546k6053j2408J4703J5051
10764h75Q103J6158n482j0715k4070j8923J4032L9990J0558R171p2k1141N96j2629
$$ y = [36557, 42277, 43377, 60446, 58528, 68359, 76895, 113024, 112635, 79014, 61867, 24199, -11728, -45630, -32212, -2953, -5329, 1540, -20392, -11697, -33691, -20737, 8673, 8403, 12053, 34099, 38030, 39830, 10393, 36322, 65991, 57400, 63076, 63439, 57241, 35108, 10392, 6410, 4469, 9864, 9210, 31727, 28027, 7549, 210, -17912, -148, 44510, 52982, 44242, 11577, 1413, -4231, 11834, 23619, 9359, -3950, 3705, -10525, -9870, 3849, 1772, -204, 7341, 33706, 16652, 8421, 3403, -5020, -1987, 9635, 1098, -9979, -21035, -16745, 15952, 41616, 34740, 25802, 27773, 49548, 31732, 14672, 30725, 22688, 16378, 7832, -18221, -30629, -15926, -875, 7228, 23386, 17904, 7189, -16881, -35804, -21772, 18218, 28776, 37947, 37875, 16734, 17330, 4701]
10750D701l207m947N22j3979L70K0933k0573l294q339k2352J6237K2022N989J355
10736d562J8724K0848p352k754o43l33Q794P448p746o54j2379N122J8531L227
10722D6271o353K536P107N902m125l457j1785K3925M8857R789m4101j8206j2045
10709D4315j4688N010j6975l671j5386m297J3643J4653l7687P520J0656J0839
10697A3932K123o694J4286K014l5872j0001K903J8024L8550J9014M489l2715m3945
10684a3892K1563J7066j4290k0814j3267k69K506N452J761J2083J6566J022K2360
10671C7847P265l1292J0170J7864o680N910l9496l2897L2351K4190L8036N357
10659F8625m0780j7649j363O847j5587J278m757j7213k950J8864R628J620J4553
$$ y = [4701, 1494, -3453, -2931, -16910, -16540, 4393, -16180, -19474, -27813, -50165, -33928, -11906, -5917, -4562, 14162, 35010, 27658, 24904, 24261, 23928, 32722, 40170, 32424, 31770, 19391, 24513, 43044, 46271, 39918, 42454, 49561, 55463, 51338, 47881, 36096, 60021, 108878, 118667, 74566, 56360, 44315, 29627, 34637, 17662, 13991, -1395, -5692, 7951, 22604, -15083, -7563, 3093, 13932, 16055, 9361, 23647, 25661, -10211, -20212, -17309, 715, 39265, 58279, 62768, 30053, -13892, 7671, 24737, 10447, -10367, -23634, -23903, -21397, -15945, -14184, -2101, 14465, 15487, 37847, 45112, 13820, 23990, 41854, 35174, 41084, 1588, -31309, 1042, 25232, 63268, 68625, 27845, 10196, 8833, 15680, 93, 1371, -3386, -20599, -23549, -4685, 4943, 6563, 21116]
10646B1116j9192L881J2261J8314J1845j892j0802M849K351k4217J0672J1645
10634D0831k6695k144J8992r345j1824k7925N701J290n517K3232J1553r315P191
10621A6025k458j1733J0770M203J3649q049k3519J1120K1064L668J0013Q771k4335
10608B9189q719k834J9773M0440j9557n2181j1922M76L197O697M056k727p781
10595a893k6106P431J1713j4J0961K7312k733J7928K208k5984j8426q100K2123
10582A6420j7430Q690K9022K7039j1035j5509J2437K5017j9555J3301j2731k2954
10570C2712j6361j1540J3230J6666n42l0473n579J2662K1039k4757k0842J6150
10558B365j7941j1197Q912K573Q674J6861J1369L4433J0134q836m8964R985K9606
$$ y = [21116, 1924, 5805, 18066, 36380, 48225, 46333, 35531, 40380, 42731, 18514, 29186, 40831, 14136, 11992, 30984, 21639, 9815, -18110, -12409, -11119, -16636, 6596, 18149, 8834, 16025, 13567, 1834, 12604, 16807, 30456, 22407, -1112, 10008, 31072, 34740, 44753, 53524, 29189, 20470, 17636, 37409, 77849, 58292, 6111, -5811, -5335, -2138, 4559, 8615, 5888, -1893, -27999, -20568, -8855, -8869, 2092, 29404, 26671, 44599, 46807, 20823, 2397, -5703, 16420, -1010, 7680, 36702, 63741, 52706, 37197, 49634, 74651, 55096, 68397, 55666, 32712, 16351, 4811, 18041, 34707, 34165, 3692, -1887, 10775, 31814, 7057, -13785, 2365, -15576, -26773, -17861, -15288, -6614, 10247, 21616, 56049, 66183, 57347, 8383, 18368, 47974]
10545D7974j0032j5622J5075P049j5775r978m1753p039K3147M7863L3323j8688
10533E5544j3022R473J0392O03k9550j6747k1525o78L294L3750L7905P62q027
10520F2174k175j4621O669K463L839l199m518J2380j1408j0337J2970k0557k2951
10507A0729K0617K5844j4265j3571r391J3390J9059O012k2149N534k1416j8402
10495A991J0339K4132J980J4484L0270N114k6428l4998j7387M269P018K4687J1607
10482E7078k463o514k3700j3414Q325K0646J6200N864Q893o007k6649l4973M3095
10469D6381J7497j5446l1508M147J9982J2572n140J5451J1050k8783L135K1788
10457G1126j127J299o50n921k6451m868K9088J0391l4714j305O36k0430m491N954
$$ y = [47974, 37942, 22320, 37395, 44444, 28669, 18691, -23062, -30101, -6954, 40909, 74232, 55544, 42522, 51995, 62387, 62990, 33440, 16693, -4832, -5510, -2216, 31534, 69439, 70201, 62174, 59999, 45378, 52047, 54510, 58349, 55150, 50632, 63012, 51604, 41267, 54237, 33680, 10729, 31346, 57190, 42925, 29354, 19963, 33353, 52412, 58424, 36275, 41809, 20393, 1991, 12330, 36462, 38442, 52926, 83196, 88310, 61882, 26884, 9497, 13766, 20784, 45471, 57078, 54615, 48101, 24401, 10987, 19312, 39958, 56158, 62022, 70915, 64908, 38259, 3286, 46381, 63878, 48432, 16924, 21071, 41053, 53625, 48485, 63936, 74986, 46203, 49338, 71126, 69999, 71298, 70648, 64727, 38276, 33408, 62496, 72887, 38173, 36868, 37504, 17074, 12583, 18537]
10443A8537P334j3842J736n835m5464J451K2792L3190K4522j1226k2398r235P873
10430I435J4826N609K7908L6065j6511n738J3904M884l3000m483M647J128J8718
10417G7392L787k9424j0519K466j7886M795j429l71k5184q588M3473K5345k999
10404F0858j5568l3633j5692K8205J6323K5050j0378K1322J0960k7145L381J9197
10392H2880J4878j2674q344K706k3392j4432j5955j8893N1852J8424j0635K666
10380F9081J3873r238j465J762J4551J2259J0006j0340J5161j3649k2412m226
10368G5363k28N671K2440J2931J288k5793j5461J5830M523O622J2020k2406k7410
10355F5390j3191K804j1734j0960R191L849o803p957M2627K2332j5312k4514J4016
$$ y = [18537, 25871, 12029, 13765, 7930, -37534, -36083, -13291, 19899, 44421, 33195, 10797, 1562, 9435, 24261, 29870, 57778, 93843, 77332, 71594, 85498, 90382, 57382, 52899, 57546, 58674, 77392, 81179, 51755, 41236, 43702, 25816, 30611, 29182, 28811, 3627, -4961, 38512, 63857, 60858, 45290, 11657, -4035, 24170, 40493, 65543, 55165, 76487, 87447, 60302, 63683, 82880, 97758, 85084, 76740, 79446, 56054, 41622, 25667, 6774, 58626, 77050, 66415, 69081, 82954, 73716, 72251, 74013, 88564, 100823, 110829, 100489, 115650, 102001, 79589, 75363, 75135, 80806, 103246, 116177, 117465, 91672, 76211, 92041, 96564, 103186, 115206, 92800, 65390, 52199, 55003, 43269, 32309, 41500, 45349, 38546, 30589, 73216, 95548, 80236, 55722, 69738]
10342F9738J7900K0686m672m1111p776L5845L5062J0737k9450j6898J5866J5902
10330A21829J8870k798o523K6532K6849k3040j13j525l9154r882j696Q858q177
10317A10030K342m985j8330R912J3716j5366j5176J3706J7174j1443q955K0861
10305A13486M6969k8860o3415L468K8177L9647J0814j1288k7577l2687q775J7978
10293H7937L578R215J9569K6247p168j9613P298l893p968K8496J4488J06j5733
10280A42559j5166J6157J5267K6456J3108P843M447q208k7116q571K1965M1539
10268B30280J0910k6744J9421M3439L0459k38J5296L0418L2613K6784K2887M5603
10256D81128N3702R3357Q4563R5748K06314L24861M82407O23703P38422Q51207
$$ y = [69738, 87638, 108324, 103652, 62541, 54765, 90610, 125672, 136409, 106959, 90061, 105927, 121829, 140699, 137901, 131378, 157910, 184759, 161719, 161606, 160081, 120927, 111045, 109349, 118207, 110030, 112372, 107387, 89057, 98969, 112685, 97319, 82143, 95849, 113023, 101580, 92625, 113486, 160455, 131595, 68180, 71648, 99825, 139472, 150286, 138998, 111421, 78734, 69959, 87937, 91515, 100730, 120299, 146546, 139378, 119765, 127063, 123170, 115202, 143698, 158186, 158292, 142559, 127393, 143550, 158817, 185273, 198381, 206224, 210671, 202463, 175347, 166776, 188741, 230280, 241190, 214446, 233867, 277306, 307765, 307527, 322823, 353241, 385854, 412638, 435525, 481128, 534830, 628187, 712750, 808498, 1014812, 1339673, 1822080, 2445783, 3184205, 4035412]
10246D035412Q57531P59718P03671N76168L28718R3570k07020m61951n74354o42291
10236E469172o97752p18085p14900o75869m99407l55510k14073j57954j10439
10227A325183o3997r9277q4776q1256o9316k4139q472j2091n8446o6524m6941
10216G09948l9259m6854m4477q237M099N197j2111k1014k1493M561L937m3079
10204D91218k1000J4433n653M56m951k3428q545R507j2160Q32j8523k4568j3896
10191C83722j2917j7304l922j364L5194j0247q140O643J468j0938k902j2821J7497
10178C63969k071j1625Q564L8894l284j1753P868Q722J435m729K0435o436j6706
10165C93283l4238l5544l2153M730K5941j386n717j5657k2215r45J8999K662n9690
$$ y = [4035412, 4892943, 5652661, 6356332, 6932500, 7261218, 7354788, 7147768, 6685817, 6111463, 5469172, 4771420, 4053335, 3338435, 2662566, 2163159, 1807649, 1593576, 1435622, 1325183, 1261186, 1161909, 1077133, 995877, 926561, 902422, 893950, 881859, 823413, 756889, 709948, 670689, 623835, 579358, 571121, 575220, 580417, 568306, 547292, 525799, 530360, 534297, 491218, 470218, 484651, 478998, 479454, 474503, 451075, 442530, 452037, 439877, 440709, 422186, 397618, 383722, 370805, 353501, 349579, 348215, 383409, 373162, 365022, 371665, 373133, 362195, 359293, 346472, 363969, 361898, 350273, 358837, 397731, 394447, 382694, 390562, 399284, 400719, 395990, 416425, 409989, 393283, 359045, 323501, 291348, 296078, 322019, 320633, 314916, 299259, 277044, 276099, 295098, 297760, 238070]
10152B38070j4881p988j101L4233J2601J3916M467k027q689k4741N6J5752J4460
10139B74128J1135K358L4163L020K8766O7193O9161O6622N8780L6877M2579N6412
10127G51194M1792k202k273l5353q0386j00629r6247l5633m1623k8184j4411l1451
10115C24594k1079J3234j497J0764j893k7815j4281L622j1490J3021K082l819
10103B85443O931j949m429o320j4187M015J9784J4163K2511M0682L5248M6592
10091D48484P8693R5017Q6680R2697J38421J02782O3361L0092K3631k8477n8487
10080A072894j21498j48585j06676r2578o4279o4862p1477j8710J9003p452p668
10069C88112l900J033l8471l0041q376o468j6136Q073j507q982K7991N005j0132
$$ y = [238070, 223189, 215201, 214100, 248333, 260934, 274850, 279317, 277290, 268601, 243860, 243916, 259668, 274128, 285263, 287621, 321784, 324804, 353570, 420763, 489924, 556546, 615326, 652203, 694782, 751194, 792986, 790784, 788511, 753158, 672772, 572143, 475896, 440263, 398640, 370456, 356045, 324594, 303515, 316749, 315252, 326016, 324123, 296308, 282027, 285649, 274159, 287180, 289262, 285443, 292374, 290425, 285996, 279676, 265489, 269504, 289288, 303451, 325962, 366644, 401892, 448484, 527177, 622194, 708874, 801571, 939992, 1042774, 1106135, 1136227, 1159858, 1131381, 1072894, 951396, 802811, 696135, 603557, 539278, 474416, 402939, 384229, 403232, 395780, 388112, 384212, 385245, 346774, 316733, 308357, 301889, 285753, 293826, 292319, 283337, 311328, 316333, 306201]
10056C06201J865K4184L7482J49R13j3912J6470K5791N3344N7799P3061J14983
10044F98330J03288P3994N8204O8245j7274r0138j02028j08909p3403o3849p6551
10033D69909m2131j8974J1836k6708m585m1646l7935p138k0955J5780K5992R009
10021C32454k8513k7617p859Q27P513j8854O306Q200J0952J2032K1766O062j4979
10008C08290O560l638K5467K7355J6561L065K3868L1182K9496J6951p554j3982
9996D63621N242l5465l5745k4063j6430k7678j7245O790j3772r03J17k1966l1174
9983B51329l379J5042J8560J590k6967k2415j1294k1336j4940L670J6612J0006
9971B16478J5983J5803J6324J6607J8752j6537j4139k1954k3143L1529J9r548
$$ y = [306201, 308066, 332250, 369732, 369881, 370794, 356882, 373352, 399143, 452487, 510286, 583347, 698330, 801618, 875612, 933816, 1002061, 984787, 894649, 792621, 683712, 610309, 546460, 469909, 427778, 408804, 420640, 393932, 389347, 347701, 309766, 302628, 281673, 297453, 323445, 332454, 303941, 276324, 268465, 269292, 276805, 257951, 264257, 272457, 283409, 295441, 317207, 323269, 308290, 314850, 311212, 336679, 364034, 380595, 383660, 407528, 438710, 468206, 485157, 477603, 463621, 468863, 433398, 397653, 373590, 357160, 329482, 312237, 319027, 305255, 304352, 304469, 282503, 251329, 247950, 262992, 281552, 283142, 256175, 233760, 222466, 201130, 186190, 189860, 206472, 216478, 232461, 248264, 264588, 281195, 299947, 283410, 269271, 247317, 224174, 255703, 255722, 246174]
9959B46174j5307l0394R75K5263P206J0984l881k6757j1128J9934Q809k3858j8778
9946A89242K6069L5945K252l0667j6067m439k486J7405K9651L575r668q921J2404
9933B44295J2732j4818l886J5275K263K4656K0808K5754J789L4731L2167J2901
9921D08667j867j3702j2532j6250p34r628j9323q090O850M84k7326j3268J8532
9908C11813M228m402R364M5932l315J757n097J5751J3381J2511k484q506j3225
9895C77708q377l0555L058n164j5915q463R701k217P576M129K3576J4202R629
9882C78888p673K028j3299P928L0980K2496K52j0194j8322Q405m053m0296j6133
9869C41007j1566j1235K210R903j0713K7662L6614L6877m472l1273k960j5454
$$ y = [246174, 230867, 200473, 201448, 226711, 233917, 244901, 241020, 214263, 203135, 223069, 231878, 208020, 189242, 215311, 251256, 253508, 222841, 206774, 202335, 199849, 217254, 246905, 250480, 240812, 231891, 244295, 257027, 242209, 238323, 253598, 255861, 280517, 301325, 327079, 328868, 363599, 395766, 408667, 406800, 393098, 380566, 364316, 363582, 353954, 334631, 326541, 333391, 333875, 306549, 293281, 311813, 316041, 311639, 321003, 366935, 363620, 365377, 360280, 376031, 389412, 401923, 399439, 390933, 377708, 369331, 338776, 341834, 336670, 320755, 312292, 321993, 319776, 327352, 331481, 355057, 369259, 378888, 371215, 373243, 359944, 367872, 398852, 421348, 421600, 411406, 393084, 401489, 397436, 357140, 341007, 329441, 318206, 320416, 330319, 319606, 347268, 383882, 420759, 416287, 385014, 382054, 366600]
9857C66600R157J2124j1916k0377k60J9750P460M008j177k4171j2067K4743J8778
9844C92652k1402j5466L2585r095j7804j6940K5810L5481L3721K3031j4562j878
9832D46133M1218P091k8041o60J2118j5169N320K8278n122n312j7658k6736O383
9819D47843o092j919M065R436R346M0702K3760j3043L1374M8633M0653K2945L1889
9806F89592k304k1902p796L160J4461L3735k1534j6479J9403K8340K157N1438
9794G72271L9833O6360P0273P7854J15914R7350J23083J55771K05919K09835J80282
9783B114745J56042J35981J32803J27329P5490L6988R6516J70578J72418J70914
9773C389804P3069m2277n3995p1245j04308j32304j36775j16370r2953p2580p0857
$$ y = [366600, 375757, 387881, 375965, 355588, 355328, 375078, 382538, 386546, 385369, 361198, 349131, 373874, 392652, 371250, 355784, 388369, 379274, 361470, 344530, 370340, 405821, 439542, 462573, 448011, 446133, 487351, 494442, 466401, 465741, 477859, 462690, 468010, 496288, 491166, 485854, 468196, 441460, 447843, 441751, 439832, 443897, 453333, 462679, 503381, 527141, 514098, 545472, 594105, 634758, 657703, 689592, 687288, 665386, 657590, 660750, 675211, 708946, 687412, 670933, 690336, 718676, 720833, 772271, 812104, 878464, 948737, 1026591, 1142505, 1239855, 1362938, 1518709, 1724628, 1934463, 2114745, 2270787, 2406768, 2539571, 2666900, 2742390, 2779378, 2875894, 3046472, 3218890, 3389804, 3462873, 3420596, 3366601, 3295356, 3191048, 3058744, 2921969, 2805599, 2712646, 2640066, 2569209]
9762B569209j2795L8885J05669J76778K55756M01688N27491O96533Q52930Q58313
9752F470457P42452N39462K04486o4696j87946k38862l03677l34884l57518l63041
9742F106233k81723k12576j37702j42316j31532p8288o0921l0232J765R0452K11458
9731E334618L68622M64869N01413M87553N49778O03850N93416O90242Q76316J150356
9721A1621033J625620K285589L302857M810663O934308R810668J3005293J4854869
9713F8250900J3325603R146639L368484m432411j1374268j3019900j0739460p849516
9705D6676071n321027l342258j739977l98952P99785K125072L593852M916235
9697D7308801N932108O534410O614519N777530M571876L870984L147252K112906
$$ y = [2569209, 2556414, 2595299, 2700968, 2877746, 3133502, 3535190, 4062681, 4759214, 5612144, 6470457, 7212909, 7752371, 7956857, 7892161, 7704215, 7465353, 7161676, 6826792, 6469274, 6106233, 5824510, 5611934, 5474232, 5331916, 5200384, 5122096, 5061175, 5030943, 5032708, 5123160, 5334618, 5703240, 6168109, 6669522, 7157075, 7706853, 8310703, 8904119, 9594361, 10470677, 11621033, 13246653, 15532242, 18835099, 23645762, 30580070, 40390738, 53396031, 68250900, 81576503, 90723142, 94091626, 89659215, 78284947, 65265047, 54525587, 46676071, 41355044, 38012786, 36272809, 35873857, 36673642, 38798714, 42392566, 47308801, 53240909, 59775319, 66389838, 72167368, 76739244, 80610228, 83757480, 85870386]
9689H5870386J504845J063467j15441k021963l499219m151758m489100m279305
9681F9881912l238194j854219n66163Q54117L160531O971429J2521572K0131016
9673A07862001K9624166L7784720L7188858K7205133J3446549o798090k9800098
9666B16513239l9169578l4141364k5205117j6772773j0368355n936958k879284
9659H2039810r63534L42777J555138K509076L119556L656642M025861L509756
9651I9795082K235098J060874K55505o03454j548845k080822k880602m567862
9643I1664974o305501p268449p462357o725583n247569l709860k240949q87657
9635E1817049M43431J855253L535435N638317Q181081J0687196J1840522J0151340
$$ y = [85870386, 87375231, 88438698, 88323257, 86301294, 82802075, 78650317, 74161217, 69881912, 66643718, 64789499, 64223336, 65077453, 68237984, 75209413, 87730985, 107862001, 137486167, 175270887, 212459745, 239664878, 253111427, 246313337, 216513239, 177343661, 143202297, 117997180, 101224407, 90856052, 84919094, 82039810, 81076276, 81419053, 82974191, 85483267, 88602823, 92259465, 96285326, 99795082, 102030180, 103091054, 103346559, 102743105, 101194260, 99113438, 96232836, 91664974, 85359473, 78091024, 70628667, 63903084, 58655515, 54945655, 52704706, 51817049, 52260480, 54115733, 57651168, 63289485, 71470566, 82157762, 93998284, 104149624]
9627A04149624N959213K56076o897789j2856660j4267816j2191929r318065o684196
9619D8148458m753554l378114k504964j988756j703760j543753j346855j212605
9611B9716097j129034j083595j002157r22917q68654q13868p66058o80202n68037
9602B1881575n01793m07543l44281l75098l49974l03790k14198j10203J211J66651
9592A9442557K51886K86738K07138J5507k53134n05806o86037q21089q45745p79962
9582A6312053o61968n85644o22475o95708o70578n67659m65521l60675l05281
9573A1376544k07575j13070p7491o7778r6588q7997j05372j35060j36563j76209
9563A0172841k14358k37334k96176l01723k77951k29142j76260j51420j95849
$$ y = [104149624, 110108837, 110364913, 103467124, 90610464, 76342648, 64150719, 54832654, 48148458, 43394904, 40016790, 37511826, 35523070, 33819310, 32275557, 30928702, 29716097, 28587063, 27503468, 26501311, 25578394, 24709740, 23895872, 23129814, 22449612, 21881575, 21379782, 20972239, 20627958, 20252860, 19902886, 19599096, 19384898, 19274695, 19275906, 19442557, 19694443, 19981181, 20188319, 20203826, 19950692, 19444886, 18758849, 17937760, 17092015, 16312053, 15650085, 15064441, 14441966, 13746258, 13075680, 12508021, 12042500, 11681825, 11376544, 11168969, 11055899, 10978408, 10910630, 10814042, 10726045, 10620673, 10485613, 10349050, 10172841, 9958483, 9721149, 9424973, 9123250, 8845299, 8616157, 8439897, 8288477, 8092628]
9554H092628k42997k52366k26224k27895k20722j74562j45068j42980j50306r6918
9544F212590j22105j55290j81402j79629j60664j20927j25256j25835j09995q1718
9534D849769j43056j40071q9068o5447q2038q9168p5549o9925o9124p2132p3727
9523C880464o6031o8699n4965n5275p1093o2425o5133p0947o3659o2130o0128
9512C179979l2922o7321q5954m8706n8399n7274l3953j4923m0503l4481j9295
9501B686248l5129o5852n6488j1283l4462o1866o0761o8576m7983m7955k8459
9490B167434k2929m6401l2220m6590m2949k4353l0076o1452l6761j8423n598J6028
9478A815710l6118m3924q333k3784k0475k4808k8113j9832j467j9468m8788j6656
$$ y = [8092628, 7849631, 7597265, 7371041, 7143146, 6922424, 6747862, 6602794, 6459814, 6309508, 6212590, 6090485, 5935195, 5753793, 5574164, 5413500, 5292573, 5167317, 5041482, 4931487, 4849769, 4706713, 4566642, 4477574, 4412127, 4330089, 4240921, 4165372, 4095447, 4026323, 3954191, 3880464, 3814433, 3745734, 3690769, 3635494, 3564401, 3501976, 3436843, 3365896, 3302237, 3240107, 3179979, 3147057, 3079736, 2993782, 2945076, 2886677, 2829403, 2795450, 2780527, 2740024, 2705543, 2686248, 2651119, 2585267, 2528779, 2517496, 2483034, 2421168, 2360407, 2291831, 2243848, 2195893, 2167434, 2144505, 2098104, 2065884, 2019294, 1976345, 1951992, 1921916, 1860464, 1823703, 1805280, 1799682, 1815710, 1779592, 1735668, 1727335, 1703551, 1683076, 1658268, 1630155, 1610323, 1608856, 1589388, 1540600, 1523944]
9466A523944l8106l6232m9260k2130J6241O87k7215j9009J3070l7183l7771j8742
9454A268294n277l4353j5296J7547l281l6481j5864j7164l858j9675n2540q428
9442A073624n318J2391k7797j5400o181k426j5589n1851j0417J0595J0792J2595
9430I85018k4449j0209o570Q415o285O793m2866k7345k2184j5973k997J978J3788
9417H57114Q908j2079k1245n4815k6328n026Q869l353R819K8341j7048j1338N298
9404G67117J5146k5355q397n329l0865r975O329O785j9160j433K0404l4764j5641
9391F64862J9376j6017k2587Q406J7859N167R076M9471Q4155M8419M3927Q9980
9379A002094N6292L024l2129n8124n6264o2231o3251r1492m0932l0087j9261J6681
$$ y = [1523944, 1485838, 1449606, 1400346, 1378216, 1394457, 1395144, 1367929, 1348920, 1361990, 1324807, 1287036, 1268294, 1263017, 1228664, 1213368, 1230915, 1227634, 1191153, 1175289, 1158125, 1154267, 1134592, 1082052, 1073624, 1068306, 1080697, 1052900, 1037500, 1031319, 1028893, 1013304, 961453, 951036, 961631, 972423, 985018, 960569, 950360, 943790, 952205, 945920, 952713, 909847, 882502, 860318, 844345, 841348, 843326, 857114, 866022, 853943, 832698, 777883, 751555, 746529, 755398, 752045, 761864, 790205, 773157, 761819, 767117, 782263, 756908, 748511, 743182, 712317, 702342, 708671, 715456, 696296, 694863, 715267, 680503, 664862, 684238, 668221, 645634, 654040, 671899, 677066, 686142, 735613, 819768, 868187, 912114, 1002094, 1058386, 1061410, 1029281, 971157, 914893, 852662, 789411, 697919, 656987, 626900, 607639, 624320]
9367F24320q367k0692k0638l135l0106j0732k4150Q145J9252L4185R894N179l611
9354E79544m32Q505K967q111j4784J1129m394k8374m8974j5748J4985L0797J9720
9341E46830k4753L968K9990M3324J9574K7802K5650M0566J8677j9244k492m194
9329G05698m2653o8860n3583N206K582N481L727m077P247K796k2313M950q582
9316E37619j1642R020n142k7189j7050j4333r432j1984r412M1835N2051k0163
9304E14178j1746m912P900K0716J3142L2915K5551Q8591R5204R2314J32471R6129
9292A102453P2618P6713m250o7281q0928q5834o6054l7419p3167p5532o3432l2160
9280F65727j6088r68r466l6583j2682j0254K3242M1565j1036k7076k9724r759
$$ y = [624320, 615953, 595261, 574623, 571488, 541382, 530650, 506500, 514645, 533897, 568082, 577976, 583155, 579544, 579112, 587617, 590584, 582473, 567689, 578818, 574424, 546050, 497076, 481328, 496313, 527110, 546830, 522077, 526045, 556035, 599359, 618933, 646735, 672385, 712951, 731628, 712384, 709892, 705698, 663045, 594185, 540602, 545808, 548390, 553871, 557598, 553521, 560768, 563564, 541251, 546201, 537619, 525977, 534997, 529855, 502666, 485616, 471283, 461851, 449867, 440455, 482290, 534341, 514178, 502432, 497520, 505420, 526136, 539278, 572193, 597744, 686335, 781539, 873853, 1006324, 1102453, 1175071, 1251784, 1247534, 1180253, 1099325, 1013491, 947437, 910018, 836851, 761319, 697887, 665727, 649639, 648671, 639205, 602622, 589940, 579686, 602928, 644493, 633457, 606381, 576657, 566898]
9268E66898O918J6073q046n670J1470K0214J9733Q646L041K7884K7368K0048M0098
9255G54675O7081J06660J43736J15033J22281J46977O2280J2142m5488l1386o1641
9244A392350r0143j09258r5286r8136n3724l9067n8739l6307l591l6369l4226
9233G37504m69j034j8980j8353J4140L532k4856n487j8762k1508M147J4066J3912
9220F77852J3483p204l1101J9950K6205r734L0212N7075K7614O9714R8935P5668
9208A048669M5071N9690L2995o770j32j947k6414m0291n4275o4828p1090o0705
9196H59973k8265n118l2105j7218j0784j5736K6710J1705k8438l2099k8641K4402
9184G24386J4924q499M294J544j431J469j8794J4393P567l9374q172J602o739
$$ y = [566898, 573816, 589889, 581843, 576173, 587643, 607857, 627590, 636236, 639277, 667161, 694529, 714577, 754675, 821756, 928416, 1072152, 1187185, 1309466, 1456443, 1518723, 1530865, 1485377, 1453991, 1392350, 1302207, 1192949, 1097663, 999527, 945803, 906736, 847997, 811690, 808099, 771730, 737504, 737035, 736001, 717021, 698668, 712808, 716340, 691484, 685997, 667235, 645727, 649874, 663940, 677852, 691335, 684131, 653030, 672980, 699185, 689451, 719663, 776738, 804352, 874066, 973001, 1048669, 1093740, 1153430, 1186425, 1179655, 1179523, 1177576, 1151162, 1110871, 1056596, 991768, 920678, 859973, 831708, 826590, 794485, 777267, 766483, 750747, 777457, 789162, 760724, 728625, 699984, 724386, 739310, 730811, 735105, 736649, 735218, 736687, 717893, 732286, 739853, 700479, 692307, 693909, 687170]
9171F87170J9038J5307j1782L842L2992M0331L2740K6477k7718l6005L974J0972
9159G97338l494l6615l4014J2210L6538J0752k7174l1838J012O216L1810J9161
9147G81902J9102q298K7654O846k2673m4332o838Q987K0295L6916j297l871j7548
9134G96845R081K3928K5410P816l341j1155J7780L107L2120J7325J364l6890k8993
9121H54397M021J0985K6963K0584J3625m5422O157J3133O99N353L0572K4475J9164
9108I84706L0640r017n39J7405Q045j318K370k3351J5704L884j7100j057j8301
9095I92071k0077j495K7215M1728L8828O060l936J3320J7867j2559N86M2857L4855
9082A177320J6710P202J3604O244j0566q268j4768J6192J7328j0978J0913K0276
$$ y = [687170, 706208, 721515, 709733, 713575, 746567, 786898, 819638, 846115, 818397, 782392, 786366, 797338, 793844, 757229, 723215, 735425, 771963, 782715, 755541, 723703, 724715, 730931, 762741, 781902, 801004, 792706, 820360, 827206, 804533, 760201, 753363, 762350, 782645, 819561, 818264, 814393, 796845, 805926, 829854, 855264, 863080, 859739, 848584, 866364, 869471, 901591, 918916, 920280, 883390, 854397, 858418, 869403, 896366, 916950, 930575, 885153, 891310, 904443, 905142, 910495, 941067, 965542, 984706, 1015346, 1006329, 1005790, 1023195, 1031240, 1029922, 1032292, 1008941, 1024645, 1028529, 1011429, 1010372, 992071, 971994, 970499, 997714, 1039442, 1078270, 1084330, 1080394, 1093714, 1111581, 1099022, 1099608, 1142465, 1177320, 1194030, 1201232, 1214836, 1221080, 1210514, 1202246, 1187478, 1203670, 1220998, 1210020, 1220933, 1241209]
9070A241209J537K0086L2259J482J5105K5054J464L1820J0675J3711n385k6259
9058A362758k804L0756o474O192K7417M3452J5682J0634J0579L394J1681J4311
9046A527578N085J2293L1415L4012K1953N825M8922L5621L297n629J9894M328
9034A744594M507R407j017O538K2750K5133K4645j5153K5746L1183L6024K3472
9022A937829K5142K2579J5196J9485K3269L462J2196M2323K8560K6346K7533J212
9010B185132K9077K1353L2583L1115K2569J7082K4903J2003M4391O2156M5132
8999B527496M9331L4439M1845K8461J3467L8892M5588M7871K4075K2167L8068
8988B911700N0520N7917M7416L8636M8030M9582L4313L4227N6455O7537M1894
$$ y = [1241209, 1242746, 1262832, 1295091, 1296573, 1311678, 1336732, 1338196, 1370016, 1380691, 1394402, 1389017, 1362758, 1359954, 1390710, 1384236, 1390428, 1417845, 1461297, 1476979, 1487613, 1498192, 1501586, 1513267, 1527578, 1532663, 1544956, 1576371, 1610383, 1632336, 1638161, 1687083, 1722704, 1726001, 1720372, 1740266, 1744594, 1749101, 1758508, 1757491, 1764029, 1786779, 1811912, 1836557, 1821404, 1847150, 1878333, 1914357, 1937829, 1962971, 1985550, 2000746, 2020231, 2043500, 2046962, 2059158, 2101481, 2130041, 2156387, 2183920, 2185132, 2214209, 2235562, 2268145, 2299260, 2321829, 2338911, 2363814, 2375817, 2420208, 2482364, 2527496, 2576827, 2611266, 2653111, 2681572, 2695039, 2733931, 2779519, 2827390, 2851465, 2873632, 2911700, 2962220, 3020137, 3067553, 3106189, 3154219, 3203801, 3238114, 3272341, 3328796, 3396333, 3438227]
8977C438227N1295L8239M0474N6638L1658L4558P6003Q0109P5851O7296M2135
8966D032483M9031P1665O3078O9052O4835J01419J00978O1274O0119P9220R4468
8955D847622P4096Q8512P7955R9184J11285J02417Q9561Q0968J07563J09772R4207
8944E883142R5003R8224J28318J43829J15626J38052J30724J58144J63114J52943
8934G207119J22313J37514J48069J56826J54301J43244J63062J89046J80776J81650
8924H783920K13039K19021K12214K38070K40814K26439K44020K27145K35349K70759
8914A1110790L07747L10711L03036L00631L07948L28502L10118L22891M14681
8905A4017055M01797L81572M34379M51506M22984M30789M79416M96609M78878
$$ y = [3438227, 3489522, 3527761, 3568235, 3624873, 3656531, 3691089, 3767092, 3847201, 3923052, 3990348, 4032483, 4081514, 4153179, 4216257, 4285309, 4350144, 4451563, 4552541, 4613815, 4673934, 4753154, 4847622, 4921718, 5010230, 5088185, 5187369, 5298654, 5401071, 5490632, 5571600, 5679163, 5788935, 5883142, 5978145, 6076369, 6204687, 6348516, 6464142, 6602194, 6732918, 6891062, 7054176, 7207119, 7329432, 7466946, 7615015, 7771841, 7926142, 8069386, 8232448, 8421494, 8602270, 8783920, 8996959, 9215980, 9428194, 9666264, 9907078, 10133517, 10377537, 10604682, 10840031, 11110790, 11418537, 11729248, 12032284, 12332915, 12640863, 12969365, 13279483, 13602374, 14017055, 14418852, 14800424, 15234803, 15686309, 16109293, 16540082, 17019498, 17516107, 17994985]
8896A7994985N17620N25939N53822O00264N92238O06804N83472O36813O96981
8887B3308938O94891O73062P16086P55738P81005Q13927P87617P84210Q09376
8878C0124850Q24326Q28491Q42682Q48249Q70682Q54806Q10853Q41339Q33630
8869C7679908Q16115P43511P59387P30615O55511O36848N77715N59328N25187
8860D3684125M27271L56323L14148K05181J57241J12365N7928k4348j26219j56895
8850D5007120k01944k75949l33140l77074m05445m66584n43421n64859n84795
8841D1253909o24300o40652o64209o47806o87298o84702p09641p18152p22610
8832C5154539o86433o72212p06836o68295o62223o79787o75976o59047o37748
$$ y = [17994985, 18512605, 19038544, 19592366, 20192630, 20784868, 21391672, 21975144, 22611957, 23308938, 24003829, 24676891, 25392977, 26148715, 26929720, 27743647, 28531264, 29315474, 30124850, 30949176, 31777667, 32620349, 33468598, 34339280, 35194086, 36004939, 36846278, 37679908, 38496023, 39239534, 39998921, 40729536, 41385047, 42021895, 42599610, 43158938, 43684125, 44111396, 44467719, 44781867, 44987048, 45144289, 45256654, 45314582, 45290234, 45164015, 45007120, 44805176, 44529227, 44196087, 43819013, 43413568, 42946984, 42403563, 41838704, 41253909, 40629609, 39988957, 39324748, 38676942, 37989644, 37304942, 36595301, 35877149, 35154539, 34468106, 33795894, 33089058, 32420763, 31758540, 31078753, 30402777, 29743730, 29105982]
8823B9105982o19888o25056n91041n84701n88147n77509n56509n18066m99370
8814B3945695n15337n31310m79454m87538m55059m24186m24868m05983m26921
8805A9795039m17627l95305l93894l90144l60463l43146l43986l55376l53826
8796A6441272l73155k90853k96147k85073k79794k89958k88245k76166k79708
8787A3782173k36594k60987k54055k41411k61663k24447k20731k12429k03203
8778A1666653k19109k09307j79375j93351k14422j91616j97220j69345j77100
8769I915808j71613j59762j77612j38631j36005j66177j67472j38758j42187j49182
8759H368409j25084j31814j29864j33428j27280j58429j10489q6410j21670j27992
$$ y = [29105982, 28486094, 27861038, 27269997, 26685296, 26097149, 25519640, 24963131, 24445065, 23945695, 23430358, 22899048, 22419594, 21932056, 21476997, 21052811, 20627943, 20221960, 19795039, 19377412, 18982107, 18588213, 18198069, 17837606, 17494460, 17150474, 16795098, 16441272, 16068117, 15777264, 15481117, 15196044, 14916250, 14626292, 14338047, 14061881, 13782173, 13545579, 13284592, 13030537, 12789126, 12527463, 12303016, 12082285, 11869856, 11666653, 11447544, 11238237, 11058862, 10865511, 10651089, 10459473, 10262253, 10092908, 9915808, 9744195, 9584433, 9406821, 9268190, 9132185, 8966008, 8798536, 8659778, 8517591, 8368409, 8243325, 8111511, 7981647, 7848219, 7720939, 7562510, 7452021, 7365611, 7243941, 7115949]
8749G115949j07483r8266r9888j24936r4545q9316j10563p5665r1806j01699j04236
8738F017546j01914q8156p7229r2538r7074r0324p9743p8366m9289o5182n3120
8727E144611p6977q7652m8641m6049r0272j03684n2974m6950p9181o4007k2280
8716D425944m6619q2364o5567l1717n0153p3843p6097l6396k7891p5771p3956
8705C785570m6345k5082k0850p1778p2759l6817m1411m6716m5040m3738m2677
8694C292357l0906m4582m0799k9560m1950l3803m7426m7752l8796k5141k5976
8683B885666l3503l1115k0963l4146m4299n4709l0615j5983P455m0711n0305k5639
8671B511133m3501o7213n0726j978m1588l3843k5771k6553l0848N904k0059l0536
$$ y = [7115949, 7008466, 6910200, 6810312, 6685376, 6590831, 6501515, 6390952, 6315287, 6223481, 6121782, 6017546, 5915632, 5827476, 5750247, 5657709, 5560635, 5470311, 5390568, 5312202, 5262913, 5197731, 5144611, 5067634, 4979982, 4931341, 4885292, 4795020, 4691336, 4638362, 4591412, 4512231, 4448224, 4425944, 4379325, 4296961, 4231394, 4199677, 4149524, 4075681, 3999584, 3963188, 3935297, 3859526, 3785570, 3739225, 3714143, 3693293, 3621515, 3548756, 3511939, 3470528, 3423812, 3378772, 3335034, 3292357, 3261451, 3216869, 3176070, 3146510, 3104560, 3070757, 3023331, 2975579, 2936783, 2911642, 2885666, 2852163, 2821048, 2800085, 2765939, 2721640, 2666931, 2636316, 2620333, 2627788, 2587077, 2536772, 2511133, 2467632, 2400419, 2349693, 2347715, 2306127, 2272284, 2246513, 2219960, 2189112, 2195016, 2174957, 2144421]
8659B144421o589p217n1232l4589k1484R713j8315k1061j017k3401o0933j4804
8647A893492k1881k1626q318j7105k9831k3308J125l0715k2049j3623j454R480
8635A714187n032j7177m6079k4341j6169k2733l0161k6966l2613J1260J3981n020
8623A513137q009j4278k1502M584n869j0421j6672J0483j9022l9312J6937L1163
8611A441219P944K5187L8553P2019J30444J83141K08184K10844J49652O1212r0029
8600B438370k36454k42368j86587j50040j06539q9320o3391m312l1847l2569j2667
8589A282276j9039m7322J2578l803J9283p943n170l29m101P929j0252k3994j7215
8576A182898K0738J6149k7019j5184Q775J396K8823N230j0043K0533N3702Q0117
$$ y = [2144421, 2137832, 2130615, 2079383, 2044794, 2023310, 2033023, 2014708, 1993647, 1992630, 1969229, 1908296, 1893492, 1871611, 1849985, 1841667, 1824562, 1794731, 1771423, 1772548, 1741833, 1719784, 1706161, 1704707, 1714187, 1709155, 1691978, 1645899, 1621558, 1605389, 1582656, 1552495, 1525529, 1492916, 1504176, 1518157, 1513137, 1505128, 1490850, 1469348, 1473932, 1468063, 1457642, 1440970, 1451453, 1432431, 1393119, 1410056, 1441219, 1449163, 1474350, 1512903, 1584922, 1715366, 1898507, 2106691, 2317535, 2467187, 2528399, 2438370, 2201916, 1959548, 1772961, 1622921, 1516382, 1427062, 1363671, 1359359, 1327512, 1294943, 1282276, 1263237, 1215915, 1228493, 1224690, 1243973, 1236030, 1230860, 1230531, 1226430, 1234359, 1224107, 1200113, 1182898, 1203636, 1219785, 1192766, 1177582, 1186357, 1187753, 1216576, 1221806, 1211763, 1232296, 1285998, 1366115]
8564A366115J17465K17500L16900N02184N32794L37837J60740r5515n13856n98378
8554B343786m24123k69798j58845j32107r3956p1254o3766k2740j6787l609j1155
8543A075646k6639n167j937m005l1967q824n745q991k6131K425k125J0540j4560
8530I52520m2660k2768m113J2791k1830j2448J4887J473J687K1970N3034P6927
8518A031470J05537J85398K57668K24333J12102K5920j43352k90267k63709j61096
8508A084004j11872r6774l6294m396m16n1149k0017O044l5930k0452j0903J888
8496G03733k1484m6056j1331K1518J3365J3911j4184k1651O775j2745Q053J1517
8484F51421j3375k0558n526k7679k1285k4504l1091J9461M2619q152k1157q340
$$ y = [1366115, 1483580, 1701080, 2017980, 2520164, 3052958, 3390795, 3551535, 3456020, 2942164, 2343786, 1919663, 1649865, 1491020, 1358913, 1264957, 1193703, 1129937, 1107197, 1090410, 1086801, 1075646, 1049007, 1043840, 1041903, 1037898, 1005931, 997107, 991362, 982371, 956240, 958665, 956540, 967080, 952520, 909860, 887092, 882979, 895770, 873940, 861492, 876379, 877852, 879539, 901509, 954543, 1031470, 1137007, 1322405, 1580073, 1804406, 1916508, 1942428, 1799076, 1508809, 1245100, 1084004, 972132, 875358, 839064, 834668, 834252, 783103, 763086, 769130, 733200, 712748, 701845, 703733, 682249, 636193, 624862, 646380, 659745, 673656, 659472, 637821, 644596, 631851, 639904, 651421, 638046, 617488, 611962, 584283, 562998, 538494, 507403, 526864, 569483, 561331, 540174, 531834]
8472E31834r443K722j5420k2890k1446q655J8207J0954M077L039j4384L655k3428
8459D58822j6848L2516n159K900k4104j3364Q618K088k652k627k935J224J4365
8446D52844N527l2520o244j0633r031K0458j0559l307Q960j9040k8850J5634k648
8433C80591j0760k0569q386L2309L1194j8765j2753m747k5550k0449j2572L177
8421C12720L3378K2948m63P758j1514l8689o816Q768K3369j5233j8623J414K2712
8408C41729L3691l127k0870k0559n041R835P924L629l1372p247k5311j7237N285
8395B71329O795K0455J3385j5036r100o671l36m718j1990k092K640L4573p52L700
8381C02182l841j7184j7781J5128K6838J1512Q026j9160j2039k5078j312k2668
$$ y = [531834, 522391, 525113, 509693, 486803, 465357, 456702, 474909, 485863, 489940, 492979, 478595, 482250, 458822, 441974, 474490, 469331, 472231, 448127, 434763, 443381, 445469, 442817, 440190, 437255, 438479, 452844, 458371, 425851, 419607, 408974, 399943, 420401, 409842, 406535, 415495, 396455, 367605, 383239, 380591, 369831, 349262, 340876, 373185, 404379, 385614, 372861, 368114, 342564, 322115, 309543, 312720, 346098, 369046, 368583, 376341, 364827, 326138, 319322, 328090, 351459, 336226, 317603, 319017, 341729, 375420, 372293, 351423, 330864, 325823, 335658, 343582, 347211, 315839, 308592, 283281, 266044, 271329, 278124, 298579, 311964, 296928, 287828, 281157, 280821, 276103, 264113, 262021, 264661, 299234, 298482, 302182, 298341, 281157, 263376, 278504, 305342, 316854, 324880, 305720, 293681, 268603, 267291, 244623]
8369B44623m0195M709M093K4139J046J293K7174j7441l5043k1453J1823M5405
8357B50173J9827m6099r462M4862K3123Q97k9080n589j1121r512J4591O218k3320
8344B25508l499Q100J2686k836J1491j2177k6370j561o458L475K0029p999n140
8331B15249k7078K4222K6723k4137j8534oq032J981J2144k2175p141M139L0597
8318B07952L5675M947j967k2307n750Q898j9677l0310k6774m1Q367K0006M937
8305A83956P555j9894R127K786P743Q728N298J1904o741k7673O241J9235j2496
8292A95769m324K4436J0816r804l381K431q707j2999k5011j7561O672N856k6963
8279A37230K4424K0152j545P70k0581p38m878J7742J0337k2625j822J0547j969
$$ y = [244623, 204428, 209137, 213230, 237369, 238415, 239708, 266882, 249441, 214398, 192945, 204768, 250173, 270000, 223901, 214439, 259301, 282424, 283321, 254241, 248652, 237531, 228019, 242610, 248828, 225508, 222009, 230109, 242795, 239959, 251450, 239273, 212903, 211342, 204884, 208359, 228388, 220389, 215249, 188171, 212393, 239116, 214979, 196445, 196439, 188407, 190388, 202532, 180357, 173216, 177355, 207952, 243627, 248574, 246607, 224300, 218550, 227448, 207771, 177461, 150687, 150646, 159013, 179019, 183956, 191511, 171617, 180744, 183530, 191273, 200001, 205299, 217203, 210462, 182789, 189030, 208265, 195769, 191445, 215881, 226697, 216893, 213512, 215943, 207236, 194237, 169226, 151665, 158337, 164193, 137230, 161654, 181806, 180261, 181031, 160450, 159712, 154834, 172576, 182913, 160288, 158466, 169013, 167044]
8266A67044J5820K090k1508k1825k6848J0793J2530K828m651o692p05j6460L180
8253A15596j0671K8004j6883k052P814L1454K8334j346J820k7157N517M980m564
8240A60846k1814j3394l0438k8587L887K0186N413k8301K4462K4999Q895l9J4729
8227A40844M142j5157k620j2969l677J7453Q476k0470j8648j2548N483J4316K7763
8214A32388K3916j6628j5139r523k1556J7905M154M329j9315j6667K4884J5863
8202A24611l4903l7864R594M8096j6117O634L2083J6518p260k3777j4561P187
8190A10241J8513k66r925R329j09L442o458k250k7676k7534j0346K8245J9634
8177A04840K3846P553q63j8439J336k3R876o062N56Q093R48J887q041p618j334
$$ y = [167044, 182864, 184954, 163446, 141621, 114773, 125566, 138096, 140924, 136273, 129581, 128876, 112416, 115596, 104925, 132929, 116046, 113994, 121808, 153262, 181596, 180250, 182070, 154913, 160430, 165410, 160846, 139032, 125638, 95200, 66613, 70500, 90686, 96099, 67798, 92260, 117259, 126154, 126115, 140844, 144986, 129829, 127209, 114240, 110563, 128016, 136492, 116022, 97374, 84826, 90309, 104625, 132388, 156304, 139676, 124537, 115014, 93458, 111363, 115517, 119846, 100531, 83864, 108748, 124611, 89708, 51844, 61438, 109534, 93417, 100051, 132134, 148652, 141392, 117615, 103054, 110241, 128754, 128488, 118563, 127892, 127783, 131225, 124767, 122517, 94841, 67307, 56961, 85206, 104840, 128686, 136239, 135376, 116937, 118273, 118250, 128126, 122064, 122620, 130713, 131661, 133548, 125507, 117889, 116555]
8162A16555n5561m4617L0581q086k0987J6179K5046K4068J3982P019q419K972
8150I8732K5759O75l6630r724P810J7991O886p199j2535J8028Q549l573K7924
8137A42693p662j693j707j7861o205K1731j0103r637k3748j8200J5709k802P321
8124H7836j961j2367l33J6966p657J6397K2871N661k6140K1574O026j4089n04
8111A14280j6002J0372K467k3052K0137P910j3200o945j9789L81R840J1877l529
8098I4747l867j2591o529j5582K5552J4090l802l4131J2650J3592K1539J043j5952
8085I0759j5542R97k5494J319J401j2914O078J526J5317j677k53j0403J1542k830
8071E9826Q091K2292M971p819K002J4900j9843k0039l2720L420L1068O583J0091
$$ y = [116555, 60994, 16377, 46958, 38872, 17885, 34064, 59110, 83178, 97160, 104179, 95760, 98732, 124491, 125166, 88536, 78812, 86622, 104613, 111499, 104300, 91765, 109793, 118342, 114769, 142693, 135031, 133338, 131631, 113770, 107565, 129296, 119193, 109556, 85808, 67608, 83317, 80515, 87836, 85875, 73508, 73175, 90141, 82484, 98881, 121752, 127413, 101273, 122847, 128873, 114784, 114280, 98278, 108650, 111117, 88065, 108202, 116112, 102912, 95967, 76178, 76559, 86399, 98276, 94747, 90880, 78289, 71760, 56178, 81730, 95820, 92018, 57887, 70537, 84129, 105668, 106711, 90759, 75217, 76214, 50720, 52039, 53440, 40526, 46604, 48130, 63447, 61770, 61517, 51114, 62656, 59826, 67917, 90209, 95180, 87361, 89363, 104263, 84420, 64381, 31661, 35081, 66149, 72732, 82823]
8058H2823K3060K2774K3043o204k9976r531j4724p781q651l247j9093j3026N436
8045D4903k4022j0003J8383N4102J8915L9866l09l1209k1531l4035k0233j253
8033C3574k363L2210J028l9921j4576k1607L318J9575L0112n411j2480J4457K7860
8020F5776o76N983J0504k0772J1585K182j1979o356l239j4227k580l588M977m739
8006C2851r493O006p732j4451L061o622k9348R994K2081K8972J5963k4889j4558
7993A1835j0497M369L3774j378J531l825O326J9210L3483k909L570l0293j1860
7980E3336J3780K0631k0839J6210k2625j9878N6076p394l3400k863K5391J0802
7968H9227j3650k1277r974J3515j4045j6872k3210J8448P344J8199K2399j4774
$$ y = [82823, 105883, 128657, 151700, 145496, 115520, 105989, 91265, 83484, 74833, 71586, 52493, 39467, 44903, 20881, 10878, 29261, 83363, 102278, 142144, 141835, 110626, 89095, 55060, 34827, 33574, 31211, 63421, 64449, 24528, 9952, -11655, -8337, 11238, 41350, 35939, 23459, 37916, 65776, 65100, 71083, 81587, 60815, 72400, 74582, 62603, 56247, 53008, 38781, 36201, 32613, 37590, 32851, 23358, 29364, 21632, 7181, 10242, 3620, -25728, -15734, 6347, 35319, 51282, 26393, 11835, 1338, 5707, 39481, 38103, 39634, 35809, 42135, 61345, 94828, 91919, 95489, 65196, 53336, 67116, 87747, 66908, 83118, 60493, 40615, 96691, 89297, 55897, 53034, 78425, 89227, 75577, 54300, 44326, 57841, 43796, 26924, 3714, 22162, 29506, 47705, 70104, 55330]
7956E5330P861J4035l498n936j5732l464L0061J0436j7778k4535m221L7485j0137
7943F9907M388l573k7928L042J791j4266j5069o110J7186P481k533l71K1355K1787
7929G7087M190o232o763K7873J2194q895l5985k0598K5417M350j9671j495k2271
7916B9201k3756J8389R704J6904K5544P258R078K112l4293j3314Q18R186K9568
7903H6399j6008j3027J7081J0705N085L284j7717k7906J411J7629L509N83J9578
7890I0606n774l3215k2609J299K7982J6552K23m187R699m648k459P975J685j4834
7876F8295M828J5123l2077J6213J1531l1906k0810J066J9860J9407o675n4173
7864A0682k5957J3727L5939M2922l9238q181K0119j1674N477j3024K548k3637
$$ y = [55330, 63191, 77226, 73728, 67792, 52060, 48596, 78657, 89093, 71315, 46780, 42559, 80044, 69907, 74295, 70722, 42794, 45836, 47627, 33361, 18292, 12182, 29368, 36849, 34316, 33945, 55300, 77087, 81277, 75045, 68282, 96155, 108349, 99454, 63469, 42871, 68288, 72638, 52967, 51472, 29201, 5445, 23834, 33538, 50442, 75986, 83244, 92322, 94434, 60141, 46827, 47645, 56831, 86399, 70391, 57364, 74445, 85150, 90235, 93519, 75802, 47896, 49307, 66936, 70445, 71028, 90606, 84832, 51617, 29008, 30307, 58289, 74841, 75064, 70877, 80576, 75928, 73469, 81444, 83129, 68295, 73123, 88246, 56169, 72382, 83913, 52007, 31197, 32263, 52123, 71530, 64855, 10682, -15275, -1548, 34391, 77313, 38075, 29894, 50013, 38339, 43816, 30792, 33340, 9703]
7852I703k0152j3308K6261J5578j6997m438O64p159K7720K129J1433K2480k488
7839E1426k3210j0995O465R860J5797o255p236O693Q05j7508r77J1031o975J0180
7825C9101l409L059J6209j8204k3428k888K1368R466P893P738J0556j6473k0010
7812C0978r702j0795j356R651J7287j4291J4303L627P700O280k4789j3056J9176
7799C5013P124j2427k4130K550Q861p989r805J8235J6836K7020l093K6297n028
7786G9464k7609l1066K3241O71l0671k3025j1828L0372L1845l83n540R057k735
7773D1793k9050o36M2431J3228k6919j7348J7757J4296n632n996L1198M2715M851
7760A22688m3002l8781N980J3619m657j1977k2912k7106j2367j0128p82o528J3839
$$ y = [9703, -10449, -23757, 2504, 18082, 1085, -3353, -2689, -9848, 17872, 20001, 31434, 53914, 51426, 28216, 17221, 23686, 33546, 49343, 43088, 35852, 42545, 43350, 25842, 24865, 35896, 28921, 39101, 35692, 38751, 54960, 36756, 13328, 10440, 31808, 41274, 49167, 56905, 67461, 50988, 30978, 21276, 10481, 9125, 18776, 36063, 21772, 36075, 39702, 47402, 53682, 28893, 15837, 35013, 42137, 29710, 5580, 8130, 16991, 9002, -803, 17432, 34268, 61288, 58195, 84492, 79464, 51855, 20789, 44030, 44701, 14030, -8995, -20823, 9549, 41394, 41011, 35471, 44528, 41793, 12743, 12107, 54538, 67766, 40847, 23499, 41256, 55552, 49920, 43924, 75122, 117837, 122688, 79686, 40905, 46885, 60504, 55847, 43870, 20958, -6148, -18515, -28643, -29425, -35953, -22114]
7747b2114M3426J6518P87j565K267k0109J2569J3617m784k3318l1703Q518J5173
7734I282j4559M449P744J9687J9763K0334q550j6284j7992J6654m768L36m819
7721C1277J4619M0600K6746j3751n4104l5217r008m647K3343k5234K2104N643
7709B2371k6558L0842J7150j8334l8685o311J2728L1123J4625n386R043J3938
7697E6546l7803l3272k144k34J5752j2363j583M74p110m387K7949j6392m521Q686
7683a0402N457P211m699Q391L922K4186K5362j8330P014M2738O468M691j2953
7670H9056n7065k0646M188j8895K6725l01j0864J6008p483k3291Q568J4033K0471
7657D0504K4671O732k5291j4402r757k5953j5781L659m366r086l94k0778K5858
$$ y = [-22114, 21312, 37830, 38617, 37052, 39319, 19210, 31779, 45396, 40612, 17294, -14409, -5891, 9282, -5277, -828, 6916, 26603, 46366, 66700, 58150, 41866, 23874, 40528, 35760, 36096, 31277, 45896, 86496, 113242, 99491, 45387, 10170, 1162, -3485, 19858, -5376, 16728, 22371, -4187, 26655, 43805, 25471, -13214, -19525, -6797, 24326, 38951, 33565, 42608, 56546, 18743, -14529, -16673, -16907, -1155, -13518, -15101, -14627, -21737, -26124, 1825, -14567, -19088, -10402, -4945, 2266, -2433, 5958, 9880, 34066, 59428, 41098, 48112, 90850, 97318, 102009, 89056, 31991, 11345, 15533, -3362, 23363, 23062, 12198, 28206, 20723, -2568, 6000, 20033, 40504, 65175, 71907, 46616, 32214, 22457, -3496, -19277, -15618, -19984, -29070, -29464, -50242, -24384]
7644b4384L2442k7784r938L3594Q968r954k4590K2593J7968q549M363j4487j3994
7631a3752L0741J5556r620l2402J161K0143L259j4492J0904K5810r393p229p660
7618A3026k9515j0540J612K4782K8314N464k2508O439J0219l2932K44L2681l322
7605B3964j3745k5867L199r777n540J899N754r368j4236L5115L1519K8098m351
7592D6664k7730l2432j475J2503L973J9111k0253j5039k84K007L0405N4829m277
7579F8002l5317m0876r502L4410K1714m570m870R117o997k1012l1097P706L5721
7566B2429M6780n277k4106P304j4974n2768j4734K6320J5345J1779M698j4564
7554H232K5486J1611l1586j8982J0606r497j2438K287m426K5512j1390p301k3426
$$ y = [-24384, 8058, -19726, -29664, 3930, 12898, 2944, -21646, 947, 18915, 10366, 14729, 242, -13752, 16989, 32545, 22925, -9477, -8316, 11827, 15086, 594, 11498, 37308, 27915, 20686, 13026, -16489, -27029, -25417, -635, 27679, 33143, 10635, 17074, 27293, -5639, -5395, 27286, 23964, 10219, -15648, -12449, -22226, -27766, -25867, -20113, -29481, -43717, -8602, 22917, 51015, 46664, 18934, -13498, -14973, -2470, 1503, 20614, 361, -14678, -14962, -12955, 17450, 72279, 68002, 32685, -8191, -17693, 16717, 38431, 33861, 28991, 38108, 31111, 10099, -20998, -13292, 22429, 69209, 63932, 39826, 47130, 32156, -20612, -35346, -9026, 6319, 18098, 22796, 8232, 33718, 45329, 13743, -5239, 5367, -4130, -16568, -14281, -18707, 6805, -4585, -11886, -35312]
7541c5312j489J1705R460n804r318j6850M1795J0818Q076J3690N033M41j2502
7528A9743l5803J0742M7794Q863k6095j7435J2347J32O281P727j5608o509j1460
7515G19k008j5196L2537J1399j6631j1826Q338J791r3Q827K0586J8332n861k4036
7501B6878n190K0876n821j6725j7257J8195j3543j0015m403J2059p782j8643p807
7488b9178K9087K5959J6547J2814q727m885L94j0640R456j5915K774M67K19q301
7474B0071j1520j6919j737J6965K531j5937J341l178r923p620J5458L978O220
7461b70j2302m642M73K1003J1883O94q49K347m0o443R881p309l6551m24K7483
7446D934j4224j1465k6661K0857K8372m975k4264m9694o917L0573M0138N386j4445
$$ y = [-35312, -36801, -25096, -15636, -21440, -30758, -47608, -5813, 5005, 13081, 26771, 31804, 32245, 19743, -16060, -5318, 42476, 51339, 25244, 7809, 20156, 20288, 26569, 34296, 18688, 12179, 719, -1289, -16485, 16052, 27451, 10820, -1006, 7332, 9123, 9030, 17857, 38443, 56775, 50914, 26878, 21688, 42564, 36743, 20018, 2761, 20956, 7413, -2602, -7005, 5054, -2728, -21371, -29178, -91, 25868, 42415, 55229, 46502, 41617, 42011, 31371, 40827, 24912, 27686, 28153, 28372, 20071, 8551, -8368, -10105, 6860, 9391, -6546, -5205, -8383, -18306, -25926, -10468, -6490, -270, -12572, -17214, -16741, 4262, 16145, 16839, 15990, 18337, 18297, 11854, 21735, 14426, -22125, -22549, 4934, -9290, -20755, -47416, -26559, 1813, -3162, -27426, -77120, -84037, -53464, -13326, -7940, -22385]
7433b2385K3384L6795J625j0879j5547j1222J451J7861L959j6579j4690L325M65
7420b437K7782M315p802j7424O32o934m619m100q882K0371l566j9351N046K1541
7406D572J0469n27m166J6632j0077k3375N9051K9884j9439k119j0416m903j6770
7393B8816r080L159j2290n708J3584j50k7916J535m65J0927q64M6245J2631k2597
7379C7827k8627J537K7342N663j5240L558n836l6266K126J485J736J2098P072
7366A4475K2271k4975k0554o602q085K3239J4980J7556k8354k0787L4651N080
7354B2895l1766l09L355j0399l01j6850L221J8611J6011k8402l6875M775K8199
7341b7835J83J2647K0528m878k265N643n879K1793l062j8296l801J4653K6377
$$ y = [-22385, 999, 37794, 39419, 28540, 12993, 1771, 3222, 21083, 25042, 8463, -6227, -2902, -2437, 25345, 29660, 21858, 4434, 5066, -1868, -6487, -10587, -19469, 902, -2664, -22015, -16969, 4572, 15041, 14514, 10348, 26980, 16903, -6472, 52579, 82463, 63024, 60905, 50489, 45586, 28816, 19736, 22895, 10605, 4897, 18481, 18331, -9585, -8050, -8515, 2412, 1548, 47793, 60424, 37827, 9200, 10737, 38079, 43742, 28502, 32060, 26224, -10042, -7916, -6431, -4695, 7403, 14475, 36746, 11771, -8783, -15385, -23470, -231, 14749, 32305, 3951, -16836, 17815, 22895, -8871, -9180, -5825, -16224, -16525, -33375, -30154, -11543, 4468, -23934, -60809, -56034, -27835, -27652, -15005, 5523, 645, -1620, 4023, -1856, 19937, 16875, -1421, -5222, 9431, 35808]
7328C5808o190n0136m0379n57K8885K3847J2946K2990P102K0612j6970l9880j3132
7315a5054K2133J3156k0780j1201K1369p578r398Q303r49R957L250r918n182j5831
7301a7723j5927j1812R240M952K923K896J8618j3918J1269J5400j2776J4252R643
7288A7037P108j5877Q632K6212q236j1638j4280j5736n771K0166k5841j7401J9679
7275a5946J5869j2201o093j7218L7797L2766R770N019J415l3025r153J8295l887
7262B3408R664j6917J46k975j6078q385K7599J4030j3845j893m077j427k965N145
7248A1430j5791k130J0493j3268j5708j6041K2158j0088J2094K1568N268j4536
7236d551k517k241J54N993M350P782K468Q02j1843p880k4349R789R219J5077M104
$$ y = [35808, 29618, -20518, -60897, -61454, -32569, -8722, 4224, 27214, 34316, 54928, 37958, -1922, -15054, 7079, 20235, -545, -11746, 9623, 2045, -7353, 950, 1, 9958, 13208, 3290, -1892, -17723, -33650, -45462, -36222, -31270, -28347, -25451, -6833, -20751, -9482, 5918, -6858, 7394, 17037, 24145, 8268, 16900, 43112, 34876, 23238, 8958, -6778, -12549, 7617, -18224, -35625, -15946, -77, -12278, -18371, -35589, 2208, 34974, 44744, 49763, 51178, 18153, 9000, 27295, 23408, 33072, 16155, 16301, 13326, -2752, -11137, 16462, 30492, 16647, 14754, 10677, 9250, 6285, 11430, -4361, -6491, 4002, -9266, -24974, -41015, -18857, -28945, -16851, 4717, 9985, -4551, -7068, -9309, -9155, -3162, 1188, 8970, 11438, 12240, 397, -7483, -31832, -22043, -12824, 2253, 6357]
7221F357k612j213K7239l824K078m711j928M39J0321K5853j0312j8055q525m086
7207A7021M555k8521J1309L3730l8218j5278M972M923L645j3203K1409J2310k0268
7194a614j3182R526k0606n839M428K4666J9178K9128p276o802M218K1874L4684
7181I2383P725l6738o6060j0085J1025k0560k4784K7014K8111k0121j6293l448
7169c1831j07M23O453Q192J6908P357o686J8110m765l557j66j5050J018p546l656
7154a4903n015n970J331J5312J5407R137l973J702J6139j707R967N323k8647j0183
$$ y = [6357, 3745, 2532, 29771, 25947, 28025, 23314, 21386, 21825, 32146, 57999, 47687, 29632, 21107, 17021, 21576, -6945, 4364, 38094, -124, -15402, -10430, -5507, -1862, -15065, 6344, 18654, -1614, -14796, -5270, -25876, -31715, -27287, -2621, 16557, 45685, 38409, 31607, 35825, 57699, 92383, 100108, 63370, -2690, -12775, -1750, -22310, -47094, -20080, 8031, -12090, -28383, -31831, -31938, -31515, -25062, -16870, 38, 7395, 709, 18819, 14054, 10497, 10331, -4719, -3701, -11247, -14903, -19918, -25888, -24557, -9245, 6162, 15299, 11326, 13028, 29167, 27460, 37427, 42750, 14103, 3920]
$$ [...]
##END NTUPLES=NMR SPECTRUM
##END=
