##TITLE=Analysis number 320132
Compound Code cc 44210
Book Reference 489/89
Project Code adrs
Chemist Name colinb
##JCAMPDX= 6.0         $$ Bruker NMR JCAMP-DX V2.0
##DATA TYPE= NMR SPECTRUM
##DATA CLASS= NTUPLES
##ORIGIN= Bruker BioSpin GmbH
##OWNER= nmr
$$ XWIN-NMR		Version 3.5
$$ Wed Jun 14 15:14:12 2006 GMT Daylight Time (UT+1h)  MAYBRIDGE\nmr@NMR_250MHZ
##.OBSERVE FREQUENCY= 250.131544655141
##.OBSERVE NUCLEUS= ^1H
##.ACQUISITION MODE= SIMULTANEOUS (DQD)
##.ACQUISITION SCHEME= undefined
##.AVERAGES= 16
##.DIGITISER RES= 18
##SPECTROMETER/DATA SYSTEM= dpx250
##.PULSE SEQUENCE= zg30
##.SOLVENT NAME= CDCl3
##.SHIFT REFERENCE= (INTERNAL, CDCl3, 0, 16.522)
##AUDIT TRAIL= $$ (NUMBER, WHEN, WHO, WHERE, WHAT)
$$ ##TITLE= Audit trail, XWIN-NMR		Version 3.5
$$ ##JCAMPDX= 5.01
$$ ##ORIGIN= Bruker BioSpin GmbH
$$ ##OWNER= nmr
$$ C:\u/data/dgb/nmr/ADRS/770/pdata/1/auditp.txt
$$ ##AUDIT TRAIL=  $$ (NUMBER, WHEN, WHO, WHERE, WHAT)
(   1,<2006-06-14 15:13:47.82 +100>,<MAYBRIDGE\nmr>,<NMR_250MHZ>,
      <created by zg, POWCHK disabled, PULCHK disabled
       configuration hash MD5:
       E2 DF 36 D8 04 B2 41 60 5A D7 A3 38 5A 4B D0 FE
       data hash MD5: 64K
       DF E5 AB A8 DC 1E C2 5A 54 4E 10 E7 41 98 84 33>)
(   2,<2006-06-14 15:14:01.60 +100>,<MAYBRIDGE\nmr>,<NMR_250MHZ>,
      <Start of raw data processing
       ef LB = 0.3 FT_mod = 6 PKNL = 1 SI = 32K 
       data hash MD5: 32K
       20 6F EB 61 E1 23 EB 3A E3 10 93 47 E9 BD C2 C6>)
(   3,<2006-06-14 15:14:03.18 +100>,<MAYBRIDGE\nmr>,<NMR_250MHZ>,
      <apk 
       data hash MD5: 32K
       69 08 2A C8 B0 80 A4 2F B4 A6 62 C2 5F 3D 60 C5>)
(   4,<2006-06-14 15:14:04.04 +100>,<MAYBRIDGE\nmr>,<NMR_250MHZ>,
      <abs ABSG = 5 
       data hash MD5: 32K
       7A 4C 53 8A BE 12 74 CA 7A FC DC C1 07 6F 01 AA>)
$$ ##END=
$$ 
$$ hash MD5
$$ 23 0C 33 F1 23 A5 9D 0C B7 E6 38 9C D2 A3 E0 D1
##$RELAX= 
##$RELAX= 
##$RELAX= 
##$RELAX= 
##$RELAX= 
##$RELAX= 
##$RELAX= 
$$ Bruker specific parameters
$$ --------------------------
##$DU= <C:\u>
##$EXPNO= 770
##$NAME= <ADRS>
##$PROCNO= 1
##$TYPE= <nmr>
##$USER= <dgb>
##$AMP= (0..31)
100 100 100 100 100 100 100 100 100 100 100 100 100 100 100 100 100 100 
100 100 100 100 100 100 100 100 100 100 100 100 100 100 
##$AQSEQ= 0
##$AQ_mod= 3
##$AUNM= <au_zg>
##$AUTOPOS= <45 >
##$BF1= 250.13
##$BF2= 250.13
##$BF3= 250.13
##$BF4= 250.13
##$BF5= 500.13
##$BF6= 500.13
##$BF7= 500.13
##$BF8= 500.13
##$BYTORDA= 1
##$CFDGTYP= 0
##$CFRGTYP= 5
##$CHEMSTR= <none>
##$CNST= (0..31)
1 1 145 1 1 1 1 1 1 1 1 1 1 1 1 1 1 1 1 1 1 1 1 1 1 1 1 1 1 1 1 1 
##$CPDPRG= <>
##$CPDPRG1= <>
##$CPDPRG2= <>
##$CPDPRG3= <>
##$CPDPRG4= <mlev>
##$CPDPRG5= <mlev>
##$CPDPRG6= <mlev>
##$CPDPRG7= <mlev>
##$CPDPRG8= <mlev>
##$CPDPRGB= <>
##$CPDPRGT= <>
##$D= (0..31)
0 1 0 0 0 0 0 0 0 0.06 0 0 0 0 0 0 0.0002 0 0 0 0 0 0 0 0 0 0 0 0 0 0 
0 
##$DATE= 1150294426
##$DBL= (0..7)
120 120 120 120 120 120 120 120 
##$DBP= (0..7)
150 150 150 150 150 150 150 150 
##$DBP07= 0
##$DBPNAM0= <>
##$DBPNAM1= <>
$$ [...]
##$SUBNAM7= <"">
##$SUBNAM8= <"">
##$SUBNAM9= <"">
##$SW= 20.6930455092707
##$SWIBOX= (0..15)
0 0 3 0 0 0 0 0 0 0 0 0 0 0 0 0 
##$SW_h= 5175.983436853
##$TD= 65536
##$TD0= 1
##$TE= 295.16
##$TE2= 300
##$TE3= 300
##$TEG= 300
##$TL= (0..7)
0 120 120 120 120 120 120 120 
##$TP= (0..7)
150 150 150 150 150 150 150 150 
##$TP07= 0
##$TPNAME0= <>
##$TPNAME1= <>
##$TPNAME2= <>
##$TPNAME3= <>
##$TPNAME4= <>
##$TPNAME5= <>
##$TPNAME6= <>
##$TPNAME7= <>
##$TPOAL= (0..7)
0.5 0.5 0.5 0.5 0.5 0.5 0.5 0.5 
##$TPOFFS= (0..7)
0 0 0 0 0 0 0 0 
##$TUNHIN= 0
##$TUNHOUT= 0
##$TUNXOUT= 0
##$USERA1= <user>
##$USERA2= <user>
##$USERA3= <user>
##$USERA4= <user>
##$USERA5= <user>
##$V9= 5
##$VALIST= <valist>
##$VCLIST= <CCCCCCCCCCCCCCC>
##$VD= 0
##$VDLIST= <DDDDDDDDDDDDDDD>
##$VPLIST= <PPPPPPPPPPPPPPP>
##$VTLIST= <TTTTTTTTTTTTTTT>
##$WBST= 1024
##$WBSW= 4
##$XGAIN= (0..3)
0 0 0 0 
##$XL= 0
##$YL= 0
##$YMAX_a= 361361
##$YMIN_a= -573573
##$ZGOPTNS= <>
##$ZL1= 120
##$ZL2= 120
##$ZL3= 120
##$ZL4= 120
##$ABSF1= 16.522
##$ABSF2= -4.171173
##$ABSG= 5
##$ABSL= 3
##$ALPHA= 0
##$AQORDER= 0
##$ASSFAC= 0
##$ASSFACI= 0
##$ASSFACX= 0
##$ASSWID= 0
##$AUNMP= <proc_1d>
##$AZFE= 0.1
##$AZFW= 0.1
##$BCFW= 0
##$BC_mod= 0
##$BYTORDP= 0
##$COROFFS= 0
##$CY= 12.5
##$DATMOD= 1
##$DC= 0
##$DFILT= <>
##$DTYPP= 0
##$F1P= 14.0000005364418
##$F2P= -0.99999901652339
##$FCOR= 0.5
##$FTSIZE= 32768
##$FT_mod= 6
##$GAMMA= 0
##$GB= 0
##$INTBC= 1
##$INTSCL= 1
##$ISEN= 128
##$LB= 0.3
##$LEV0= 0
##$LPBIN= 0
##$MAXI= 10000
##$MC2= 0
##$MEAN= 0
##$ME_mod= 0
##$MI= 0
##$NCOEF= 0
##$NC_proc= -2
##$NLEV= 6
##$NOISF1= 0
##$NOISF2= 0
##$NSP= 0
##$NTH_PI= 0
##$NZP= 0
##$OFFSET= 16.522
##$PC= 1
##$PHC0= 171.5755
##$PHC1= 4.635991
##$PH_mod= 1
##$PKNL= yes
##$PPARMOD= 0
##$PSCAL= 4
##$PSIGN= 0
##$REVERSE= no
##$SF= 250.13
##$SI= 32768
##$SIGF1= 0
##$SIGF2= 0
##$SINO= 400
##$SIOLD= 32768
##$SREGLST= <1H.CDCl3>
##$SSB= 0
##$STSI= 32768
##$STSR= 0
##$SW_p= 5175.98343685301
##$SYMM= 0
##$S_DEV= 0
##$TDeff= 65536
##$TDoff= 0
##$TI= <Analysis number 999999
Compound Code 99
Book Reference 9
Project Code 9>
##$TILT= no
##$TM1= 0
##$TM2= 0
##$TOPLEV= 0
##$USERP1= <user>
##$USERP2= <user>
##$USERP3= <user>
##$USERP4= <user>
##$USERP5= <user>
##$WDW= 1
##$XDIM= 32768
##$YMAX_p= 297004860
##$YMIN_p= -46201
$$ End of Bruker specific parameters
$$ ---------------------------------
##NTUPLES= NMR SPECTRUM
##VAR_NAME=  FREQUENCY,     SPECTRUM/REAL,   SPECTRUM/IMAG
##SYMBOL=    X,             R,               I
##VAR_TYPE=  INDEPENDENT,   DEPENDENT,       DEPENDENT
##VAR_FORM=  AFFN,          ASDF,            ASDF
##VAR_DIM=   32768,         32768,           32768
##UNITS=     HZ,            ARBITRARY UNITS, ARBITRARY UNITS
##FACTOR=    0.157963299565203, 1,           1
##FIRST=     4132.6476996994, 0,             0
##LAST=      -1043.33573715361, 0,           0
##MIN=       -1043.33573715361, -46201,      0
##MAX=       4132.6476996994, 297004860,     0
$$ Real data points
##PAGE= N=1
##DATA TABLE= (X++(R..R)), XYDATA
$$ [...]
18756E9974N016J3639r623n481m343J604M808j683l528J0866l556j4345q108q734
18742C6506L921J5071K33j368Q277O017l629n410n136l737l910J478N335L962
18728E7610j55j2237J8532K475q5J2471O097m052l771l879j711l963J377R03K233
18713G1845q893j0398O145J1782K31M776l809p605L847j051M489O395k839q695
18699F6220m935m748P107l524n876o306J0558J2864j662K488L42o4q80K212L649
18684G7445j54l252j684m386m855r616M396l344K407M971m391N154R64M755M635
18669G3045p328L841L696j1376K533p61k94M121j0096p869O091j0321P726J4020
18655F7028m415j0516l679o332J426K001j244j0375O278Q543J694q26q04L136
$$ plain form
18756 59974 64990 78629 69006 63525 59182 60786 65594 63911 60383 71249 67693 53348 45240 36506
18742 36506 40427 55498 55731 54363 62640 68657 65028 59618 54482 50745 46835 48313 53648 57610
18728 57610 57455 45218 63750 66225 66140 78611 84708 80656 76885 73006 71295 67332 68709 69612 71845
18713 71845 62952 52554 58699 70481 70712 75488 71679 64074 67921 66870 71359 77754 74915 66220
18699 66220 61285 56537 63644 60120 54244 47938 58496 71360 69698 72186 72528 72464 71584 73796 77445
18684 77445 77291 74039 72355 67969 63114 53498 57894 54550 56957 61928 57537 62691 63655 68410 73045
18669 73045 65717 69558 73254 61878 64411 63650 63356 67477 57381 49512 55603 45282 53008 67028
18655 67028 62613 52097 48418 42086 43512 45513 44269 33894 40172 48715 50409 49583 48779 51915
18641E1915K821k249N426O974k426j132L096M666J05r17o533j99J14J0881J390
18626G3932k645o457p99lJ953o333n997L759J2664J683n443Q683J4457O589n622
18611I0421o253J782N118N663L387l703Q393J9925R965J2906K0550J9535l591
18598A84098j0325N96L683k242N684J2314l700l547k115O395p011k032N67O72
18584A83037k693m873r837j929j803L469J0021J0915J3164L203J3666J8553Q550
18571B43443k909j0843Q345K4416Q763p846j3978j844q979r948L703L0031J2120
18558B74474K387j1887R617J6940r80J3461J7526J8912K9222K1893J5235K9584
18546D36384O283m887l12K7633M0455M8074N6788O6466O2537O1023J9497o054
$$ plain form
18641 51915 54736 52487 57913 64887 62461 61329 64425 69091 69196 68279 61746 61547 61661 72542 73932
18626 73932 71287 64830 64031 64028 65981 59648 53651 57410 70074 71757 66314 74997 89454 96043 90421
18611 90421 84168 85950 91068 96731 100118 96415 104808 124733 134698 147604 168154 187689 184098
18598 184098 173773 174369 178052 175810 181494 193808 190108 186561 184446 190841 183830 181798 182365 183037
18584 183037 180344 175471 165634 163705 161902 165371 175392 186307 199471 202674 216340 234893 243443
18571 243443 240534 229691 238036 262452 271215 263369 249391 247547 238568 228620 232323 262354 274474
18558 274474 276861 264974 274591 291531 290551 304012 321538 340450 369672 391565 406800 436384
18546 436384 442667 437780 437468 465101 505556 553630 610418 676884 739421 800444 819941 813887
18534H13887k3091l7123m5782l3155r97J8681M6977M7306K9841R044R801J3355
18522H48744K8099L5223N4068Q0126R7204J12019J32159J40925J68740K19764
18512A917071K59624L27198M31576N82171Q13434J216136J928109L145869M674854
18503A5296042N599748N369342N166047N150583K635298j632127l467909l771034
18495C0345990n366298o112429m451583k387275j101745l58815J70433P39956
18487A1478234J525336K537494L427942L648535L353714L309895L189327K221077
18479C4691554J353864J175951R98347R18694Q72388K98558p069N04197Q68050
18470D1674534L50635l87161m28701k72691o88591j243007k044432k993968l207763
$$ plain form
18534 813887 790796 753673 707891 674736 673739 692420 739397 786703 816544 825588 835389 848744
18522 848744 876843 912066 966134 1046260 1143464 1255483 1387642 1528567 1697307 1917071
18512 1917071 2176695 2503893 2935469 3517640 4331074 5547210 7475319 10621188 15296042
18503 15296042 20895790 26265132 31431179 36581762 39217060 37584933 34117024 30345990
18495 30345990 24979692 18867263 14415680 12028405 10926660 10567845 10738278 11478234
18487 11478234 13003570 15541064 18969006 22617541 25971255 29281150 32470477 34691554
18479 34691554 36045418 37221369 38219716 39138410 40010798 40309356 40302287 40806484 41674534
18470 41674534 42025169 41638008 41209307 40936616 40248025 39005018 36960586 33966618 30758855
18461C0758855l300721l915978l906843k785973j502577n54286J17103P59294
18453A5668874J690702L250902N533252P605691P570622N676095M496385K712983
18445E4205506k435285o670967o516347o062164o855293o094353l939829k299845
18437A3331423j402421q90153o55109n84104n40339n18731n12847n08844n06625
18428G212250m80903m16705l45492k98274k50528k20787j98067j76770j61762
18419D662962j54108j66576j84425j81411j48819j38739j09556q1076q7035r5677
18409C315540r8041j12852j46011j45748j41100j39479j03607r2957q4764p2679
18399B178302p2737o3618n4480n3160m7024k6155k6390k2325m551N2482J06209
$$ plain form
18461 30758855 27458134 23542156 19635313 16849340 15346763 14792477 14909580 15668874
18453 15668874 17359576 20610478 26143730 33749421 41320043 46996138 51492523 54205506
18445 54205506 51770221 45099254 38582907 32520743 25665450 19571097 15631268 13331423
18437 13331423 11929002 11038849 10383740 9799636 9259297 8740566 8227719 7718875 7212250
18428 7212250 6731347 6314642 5969150 5670876 5420348 5199561 5001494 4824724 4662962
18419 4662962 4508854 4342278 4157853 3976442 3827623 3688884 3579328 3498252 3411217 3315540
18409 3315540 3217499 3104647 2958636 2812888 2671788 2532309 2428702 2335745 2250981 2178302
18399 2178302 2105565 2041947 1987467 1934307 1887283 1861128 1834738 1812413 1807862 1860344 1966553
18388A966553J28175P1466j1622m0908j27794k12808j75932r7382l5379K037P335
18377A473741J484o988k4180o3664q6574r0104r6228j03314q3908m9419n1091
18366H19755l2177j7617k9078j8688j2255j4641j8994k0014k8085k3433k7809
18355E76964k4909j7158k4008l2221l3418j4047j1623r548o263k980n562n866
18343C89361o039j879L358N490K9768N1841O1883O6543N1445M7953K1198j8510
18331G02412l7083m7138m6747l8422j5023N44K469P135q70k2669l0236n2029m0495
18318C81848l4833j6860p12j0470j3046j2477n93J6074J3980K5448M0528K9512
18306D18399K5301J9147J691j0761l6636m6693m5788l5963j6312m190J162q907
$$ plain form
18388 1966553 2094728 2166194 2154572 2113664 1985870 1773062 1597130 1499748 1464369 1466406 1473741
18377 1473741 1475225 1468237 1444057 1380393 1293819 1203715 1107487 1004173 920265 870846 819755
18366 819755 787578 769961 740883 722195 709940 695299 676305 656291 628206 604773 576964
18355 576964 552055 534897 510889 478668 445250 431203 419580 410032 403769 400789 395227 389361
18343 389361 383322 381443 384801 390291 420059 471900 533783 600326 651771 699724 720922 702412
18331 702412 665329 618191 571444 533022 517999 518543 521012 528147 527277 504608 474372 422343 381848
18318 381848 347015 330155 329443 318973 305927 293450 292857 308931 322911 348359 388887 418399
18306 418399 443700 462847 464538 453777 417141 370448 324660 288697 272385 268195 269357 260450
18294B60450j1960j1121j6860j048L528O9j6378j0700J688m602k770L74j621P689
18280A96738r08l502r814o006L812m282o743k976k465O527N833J1131N068o654
18266A85759P195j1287j8817L641J755j6373n169N245j3495j197R097N705l636
18253A48423n483P223r820r223k332j769M357o90J461n899r948J53N65j0771o954
18238I9293J218J954J216q593m539L185o488o109Q007P906J3860l283M892K1014
18224A33533R232P647K447N308J5198J0112o11j0058L574J67j2704j3543o753
18211A43549O269o005p740K691J0817K308l991L263K499j5843p580p677j5909
18198A06651J293N078k903L037J852R627j2261j6314m300R9n588l45J9903J5001
$$ plain form
18294 260450 248490 237369 220509 219461 222989 223058 206680 195980 197668 193066 190296 190670 189049 196738
18280 196738 195830 192328 182514 176508 180320 176038 169295 166319 163854 170381 176214 187345 192413 185759
18266 185759 192954 181667 162850 166491 168246 151873 146704 151949 138454 137257 146354 152059 148423
18253 148423 142940 150163 140343 131120 128788 127019 131376 130686 132147 126248 116300 116453 117018 106247 99293
18238 99293 100511 102465 103681 95088 90549 93734 87246 81137 89144 97050 110910 107627 112519 133533
18224 133533 142765 150412 152859 158167 173365 183477 182866 172808 176382 176549 163845 150302 143549
18211 143549 149818 143813 136073 138764 149581 151889 147898 151161 153660 137817 130237 122560 106651
18198 106651 107944 113022 110119 113156 115008 124635 112374 96060 91760 91859 86271 85926 105829 120830
18184A20830J2026m428o899l949r429j2528m638M133q5o838k798J4473J2293j2632
18170I9531P763K1122Q9P35J6572J1844K0583O690J0428K5212J5169n418j0723
18157B19597p554j4323j1654j0605o265N29j8334m415K223L423k915j0414M444
18144A43737J0687Q403J3955R54M57R830J3444L359P864K2838P29O307K2317Q777
18130B73658K5638L2932K5253J6192K5848K5197L4941L8937M2317N7119J02409
18119G00441J12022J43728K17444L14273M49420P12757J259974K256734L482428
18110I649221L370522J101176l3845p6893k704562m262752k508818j221860o54631
18101B657558l70659k13956r5689k6341K4758P873l5947q7457j10940q9026m4961
$$ plain form
18184 120830 132856 128428 121529 117580 108151 95623 90985 95118 95033 88195 85397 99870 112163 99531
18170 99531 107294 128416 128505 129240 145812 157656 178239 184929 195357 220569 235738 230320 219597
18157 219597 212043 197720 186066 175461 169196 169725 151391 146976 149199 152622 149707 139293 143737
18144 143737 154424 162827 176782 177736 178193 188023 201467 204826 212690 235528 236257 242564 264881 273658
18130 273658 299296 332228 357481 373673 399521 424718 459659 498596 540913 598032 700441
18119 700441 812463 956191 1173635 1487908 1937328 2650085 3910059 6166793 9649221
18110 9649221 13019743 14120919 14087074 14010181 11305619 7042867 4534049 3312189 2657558
18101 2657558 2286899 2072943 1977254 1950913 1975671 1983544 1947597 1860140 1749200 1660174 1615213
18090A615213l925L2931M4159N0456M8459M6800L0936N0211R2533J48094K53855
18079B409722L66912M76095O30634Q85226J369677K235255L736064N730172O532008
18070B4371765M311782J363928M9136k556367n973909n259775k201179M82881
18062A4588262K959172N014909M916442K221905J23985j121246m445456o685831
18054A7572142n061376k879650j615483r65578n90652l92595k75428j64883j08840
18045E517657j27276j50437j54057j24778j26581j52295j60896j54988j17063
18036D249286p6001n6713o0851q2372j34836j72380j73200j34572m4737O2098
18026C375722J79586K75519L70063N17914P68640J206607K037473L420555M789985
$$ plain form
18090 1615213 1611288 1644219 1688378 1738834 1787293 1834093 1865029 1915240 2007773 2155867 2409722
18079 2409722 2776634 3252729 3883363 4768589 6138266 8373521 12109585 17839757 24371765
18070 24371765 28683547 30047475 30096611 27540244 21566335 16306560 14105381 14588262
18062 14588262 17547434 22562343 27478785 29700690 29824675 28703429 24257973 17572142
18054 17572142 12510766 9631116 8015633 7050055 6459403 6066808 5791380 5626497 5517657
18045 5517657 5390381 5239944 5085887 4961109 4834528 4682233 4521337 4366349 4249286
18036 4249286 4173285 4116572 4055721 3973349 3838513 3666133 3492933 3358361 3313624 3375722
18026 3375722 3555308 3830827 4200890 4718804 5487444 6694051 8731524 12152079 16942064
18017A6942064M432753K123556N07494n64600l302763m746219k978993o73634
18009A1739658J299544L225704M345065L153569Q30138k88432j931868m852454
18001A7520924n151770l268358j822104j045516o44392m26988l06899k20671j52105
17992D482121j38528j70549k22733k15789k00357j75326j59603j61320j56055
17983B881861j19522q6553p1898o7854o6873p5085p9745j02458j43095j23687
17973A945091j12407r9375r6274q6627p2981o0732o2748o3268o2610m4773l5023
17962A148273j7563l5742k3794p114M469r598k0172k5923k4974k2772j9332k4184
17950I21574k6008k4325j4566j8578j3711p958q326j5058k4502l8921m3900k0522
$$ plain form
18017 16942064 21374817 23498373 24005867 23441267 20138504 15392285 12413292 11739658
18009 11739658 13039202 16264906 20609971 23763540 24593678 24305246 22373378 17520924
18001 17520924 12369154 9100796 7278692 6233176 5588784 5161796 4854897 4634226 4482121
17992 4482121 4343593 4173044 3950311 3734522 3534165 3358839 3199236 3037916 2881861
17983 2881861 2762339 2675786 2603888 2536034 2469161 2394076 2314331 2211873 2068778 1945091
17973 1945091 1832684 1733309 1637035 1550408 1477427 1416695 1353947 1290679 1228069 1183296 1148273
17962 1148273 1130710 1094968 1071174 1064060 1068529 1058931 1038759 1012836 987862 965090 945758 921574
17950 921574 895566 871241 856675 838097 824386 816428 808102 793044 768542 729621 685721 665199
17938F65199l2576l4778k2894k3743k0507j2657k0928j1053m232n973R417n27
17926D84748j0590k870R12j1546j5710j2250r709k4095k2958k3956k1238k7533
17914C03205j7245k8826m459j0235r458L606j5537k497o273j238m617m751m823
17901A96852o218k24P55r409j1292k771Q997O991K456L387j2214j4117r310p653
17887A46230m911M568J0917m574n193j127M80q845K229J9835L255N518K954n051
17873A66285j8585j0234L783K480J862J7779K0881K730O210J5968l314j4569j296
17860A89980L860m724J734M595K5912K1728J455j0457j6621j1381j2200q963k363
17847A82555m055j041n081j688N593j137m806J291R537M611j851O855L604j2062
$$ plain form
17938 665199 632623 597845 574951 551208 530701 518044 497116 486063 481831 475858 485275 484748
17926 484748 474158 471288 472200 460654 444944 432694 422985 398890 375932 351976 330738 303205
17914 303205 285960 257134 252675 242440 232982 236588 221051 218554 212281 211043 206426 201675 196852
17901 196852 190634 190410 191165 181756 170464 167693 176690 183681 186137 189524 177310 163193 153883 146230
17887 146230 141319 145887 156804 152230 147037 145910 146390 137545 139774 159609 162864 168382 171336 166285
17873 166285 147700 137466 141249 143729 145591 163370 184251 186981 193191 209159 205845 191276 189980
17860 189980 193840 189116 190850 195445 221357 243085 244540 234083 217462 206081 193881 184918 182555
17847 182555 178500 177459 172378 170690 176283 175146 170340 171631 181168 185779 183928 190783 194387 182325
17833A82325j5902r06J859j6864O68r9O461P986J942k240N289r648P034q63l376
17818A63666l512J2055J9363J6271J2952J6255J958j8046j1455j7796j297N624
17806A96038P650N922J8688K3859J5236J891P444K771n711p043p259N10J8842
17793B78838J0190O298o566K349J9506J1276J6365P354K4580K1146L8703L8827
17781D68866N5021Q5200R8803J09606J09908J01751J19895R9124O0979N5796M2380
17770A407329L1324L3623M1605Q6317J50760J89662K46682L21519M50216O34414
17760C593451Q73421J259375J857797K813090M280634O074732P472780P543215
17752C5768495N905499K946913p05236m247846o734964p463691o391554m435531
$$ plain form
17833 182325 166423 165517 167376 150512 151180 151081 157542 165528 167470 165230 170519 160871 167905 167042 163666
17818 163666 160154 172209 191572 207843 220795 237050 239008 220962 209507 191711 190414 196038
17806 196038 203688 209610 228298 252157 267393 269284 276728 279499 273788 266745 259486 259996 278838
17793 278838 289028 295326 288760 291109 310615 321891 338256 345610 370190 391336 430039 468866
17781 468866 523887 609087 707890 817496 927404 1029155 1149050 1248174 1309153 1364949 1407329
17770 1407329 1438653 1472276 1513881 1600198 1750958 1940620 2187302 2508821 2959037 3593451
17760 3593451 4466872 5726247 7584044 10397134 14677768 20752500 28225280 35768495
17752 35768495 41673994 44620907 43915671 39667825 32932861 25469170 19077616 14642085
17744A4642085k632999j386688n94771k2160M79483J040361J753976K830127M376987
17735B0486401O193725P471930P284368N348082K106504j702525n236873p554680
17727C4396932p959589o613551m608504k908889j799061j158938p71367n22832
17719H054201l80181l37908l61534m11762m31199l88549l55018k97317k43080
17710D847653k12641j85402j57519j50796j58115j80669k05907k10309k12492
17701C173803j90891j67210j47572j29695r9511j16010j10110p0212p1401q5589
17691A985602q8862p6087o8039p2996o4135n7687m1904m6434n1740l8371m2290
17680A337057n3320l6513k6463l4787l7829m5399l0567k4312l6925l7866k3279
$$ plain form
17744 14642085 12009086 10622398 10027627 10005467 10484950 11525311 13279287 16109414 20486401
17735 20486401 26680126 34152056 41436424 46784506 48891010 47188485 41951612 34396932
17727 34396932 26437343 19823792 15215288 12306399 10507338 9348400 8577033 8054201
17719 8054201 7674020 7336112 6974578 6562816 6131617 5743068 5388050 5090733 4847653
17710 4847653 4635012 4449610 4292091 4141295 3983180 3802511 3596604 3386295 3173803
17701 3173803 2982912 2815702 2668130 2538435 2438924 2322914 2212804 2142592 2071191 1985602
17691 1985602 1896740 1820653 1752614 1679618 1615483 1557796 1515892 1469458 1417718 1379347 1337057
17680 1337057 1283737 1247224 1220761 1185974 1148145 1102746 1072179 1047867 1010942 973076 949797
17669I49797l1718l2061k2432j8573j3718r241k2385k6634k6804k5020j9605l1302
17657F70304k5603j3336k6046k2602n436j4318k2513k1484l7999j5095j5559r021
17645D41292j2868q706J09p139k3236l3213k3920j6692j7980j8080j5159n087
17633B59321N21j5558j3603l216R951j1918k6236q741j5681j4174k495r461J008
17620A49718n621m479L096j802j6853j3986j818J0320Q988k522q647R717J1795
17607A37906J897r623r712l286m922l288m333o005L452N270r044P731K810k359
17593A06494R096j34l932L48q932L897R214n057J2492J3725j8067k6215q703J5354
17579I9580N130k647j5367L232J0475J789J523N754J3920J2451p955j853l648
$$ plain form
17669 949797 918079 886018 863586 845013 831295 822054 799669 773035 746231 721211 701606 670304
17657 670304 644701 631365 605319 582717 577281 562963 540450 518966 480967 465872 450313 441292
17645 441292 428424 419718 419827 412688 389452 356239 332319 315627 297647 279567 264408 259321
17633 259321 259842 244284 230681 227465 237416 225498 199262 190521 174840 160666 158171 148710 149718
17620 149718 144097 139618 142714 140912 124059 110073 108255 118575 127563 125041 116394 126111 137906
17607 137906 139803 130180 120468 117182 112260 108972 104639 98634 102086 107356 98312 106043 108853 106494
17593 106494 115590 115456 111524 111872 102940 106837 116051 110994 123486 137211 119144 92929 84226 99580
17579 99580 104710 102063 86696 89928 100403 102192 103715 109469 123389 135840 127885 126032 122384
17566A22384m624n726m468l670j789j0965o752L35O766K632o726o36O819Q298
17552A01878N489P622K014J467M112J7915K3629L2570K4323P844p366k3676l4622
17539A63199j5852n96R080J4040L2134K8913J270k5960k8313l2119k4252j7264
17527A04280j0493K436M927k929J775j3498k283J1270k564q750K797N484Q305
17514A00757N744J353Q766M770K692j2646K127k319r556j4682j1963L149P834
17501H6026L054r004k977j1759o530M959J1310J6920L6450K1365J4318M580l692
17488A65020j455j6252l5538l066P990J3083J8083J8883R494M677m525k5083l5329
17475A15982l1455j6764N720L760m919m659j5587k413n046o893J996J2633L772
$$ plain form
17566 122384 117760 112034 107566 103896 102107 91142 84390 84725 91491 94123 87397 86761 93580 101878
17552 101878 107367 114989 117003 118470 122582 140497 164126 196696 221019 228863 221497 197821 163199
17539 163199 147347 146751 155831 169871 202005 230918 232188 206228 177915 145796 121544 104280
17527 104280 93787 96223 101150 98221 99996 86498 84215 95485 92921 84171 86968 92452 100757
17514 100757 106501 107854 116620 121390 124082 111436 113563 111244 101688 87006 75043 78192 86026
17501 86026 89080 80076 77099 65340 58810 63769 75079 91999 128449 149814 164132 168712 165020
17488 165020 163565 147313 111775 108709 116699 129782 147865 166748 176242 180919 176394 151311 115982
17475 115982 84527 67763 73483 77243 72324 67665 52078 49665 44619 37726 39722 52355 56127
17462E6127j3997n427n405Q19J580K282J564N603j810l332N732k978k527N949
17448D4180O176O856J6826J4581J7552L388n824J1866J878l7957k0488r852P743
17435E6925L143R282K708J59o612p372J0554m898L693J1658L960M248p062N659
17421H6045R513J857p451J668O953J9666K8289L4687J8147J0654J7945q42j493
17408B25638J174j0945j0081j3685r848k1463j9116p820j1907P726J2287K4605
17396A66565K3979J9638O638Q794R255L868k227N121J4142j456m189k4837m0346
17383A84945k1173j0408j0913o9j61J2690K8933J7396K3208J9269J9823J5666
17371B79206J3722L8108M8049L5282J8823J1928n501j4554o593P544J625j4464
$$ plain form
17462 56127 42130 36703 31298 32117 33697 35979 37543 43146 41336 38004 43736 40758 38231 44180
17448 44180 50356 57212 74038 88619 106171 109559 103735 115601 117479 79522 59034 49182 56925
17435 56925 60068 69350 72058 72217 65605 58233 68787 63889 67582 79240 83200 87448 80386 86045
17421 86045 95558 97415 89964 91632 98585 118251 146540 181227 199374 210028 227973 227131 225638
17408 225638 226812 215867 205786 192101 182253 160790 141674 133854 121947 129673 141960 166565
17396 166565 190544 210182 216820 225614 234869 238737 236510 241631 255773 254317 250128 225291 184945
17383 184945 163772 153364 142451 142382 142221 154911 183844 201240 224448 243717 263540 279206
17371 279206 292928 331036 379085 414367 433190 445118 439617 425063 418470 426014 427639 413175
17359D13175j9254m0766m4094k5879j2577k4767k3162k9467j7523j7480j0031
17348A48175j2519j5254o995j6608r706k516n558j6986n675K418N835r197r640
17335D5774o727J870K398M924l951j747q603j0930K746M355J3704J572p98M162
17321D8749j0073j5463J882L254Q108K378l408R07K52K890r402o8L925k967L897
17306C4861K418k495k655O66j3078m483p664q503M447N483M0j059N630R50N767
17291B0325L662q81o135M253J3916n642j5532K538K886n742l310m734O538J2073
17277B4215J893o676R06L74l37J694M759N891l48k371q190L010J530l475L577
17262B6452N406j373p761k94l681O682j01l210l286K582J279j016j298j0079r466
$$ plain form
17359 413175 393921 353155 309061 283182 270605 245838 222676 193209 175686 158206 148175
17348 148175 135656 120402 113407 96799 87093 84577 79019 62033 56358 58776 64611 55414 45774
17335 45774 39047 40917 43315 48239 44288 42541 33938 23008 25754 30109 43813 45385 44587 48749
17321 48749 38676 23213 25095 28349 36457 38835 35427 36334 36586 39476 30074 30006 33931 30964 34861
17306 34861 37279 34784 32129 32795 19717 15234 7570 -933 3514 8997 9037 7978 13608 14558 20325
17291 20325 23987 23106 16971 21224 35140 29498 13966 16504 19390 13648 10338 5604 12142 24215
17277 24215 26108 19432 20338 20712 20375 22069 26828 32719 32371 30000 21810 24820 26350 22875 26452
17262 26452 31858 30485 22724 22430 18749 25431 25330 22120 18834 21416 22695 21679 20381 10302 836
17247H36M233J392Q566O057j546L687j32n32L044J0566j1r964K615J134j9836
17232A0109l172K518m59N710O31n69j873J4255k881p565j3176m326M660N564L026
17217A2452O831l283q568n613N457N993K0717M475j1777q641J5033K120n460j1658
17203A8078K842l841p631M317M383K912M797o773r89j222p671q090j1519O003
17189d404O151J2080O293P171k06j0137n254N07Q702Q495K4624J3982L325J6212
17175H7541L4887L9849L1833J6911J1768L017q805k8457k8827k7891k8273j7429
17163H6124j3596m537n457O083J5199O574J2073J1763J9862N5249N4478K1204
17151B65019R089L257j0531k0656m3932m5884k8753j6280j2427k1720j2442k69
$$ plain form
17247 836 5069 6461 15027 21084 19538 23225 23093 22561 25605 36171 36160 26196 28811 29945 10109
17232 10109 6937 9455 8996 14706 15337 14768 12895 27150 24269 16704 3528 -798 3862 9426 12452
17217 12452 19283 16000 7432 1819 7276 13269 33986 38461 26684 18043 33076 35196 29736 18078
17203 18078 20920 17079 9448 13765 18148 21060 25857 19084 18095 16873 9202 1112 -10407 -4404
17189 -4404 1747 13827 20120 27291 27085 16948 11694 12201 20903 29398 54022 68004 71329 87541
17175 87541 122428 162277 194110 211021 222789 225806 217001 188544 159717 131826 103553 86124
17163 86124 72528 67991 62534 68617 83816 90390 102463 114226 134088 189337 243815 265019
17151 265019 274108 277365 266834 246178 202246 156362 127609 111329 98902 77182 64740 64471
17139F4471j549m524p415r603q094m11J3454m911m818Q215J355l127M069N29K455
17124E0096P427q409j0599K677Q223K120j0500k540J3525L53q101P419n911j2323
17110C3457r896l440P440L234o024L131L079J6792m175j4183L223l28L407M104
17096C9821M490P681q693j6455n051P239Q38J0611M84j7573R17N439j492J5290
17082D3546Q599r486j8615r688m026O574J1451M554k587k973P982q637Q751N710
17068D1155P421j802l140n724R029K0328J2032K0009J7335R847j0894J0690N804
17055A32090P60K858K38J577k555l149O793j595P051O89n473q401Q03r043p275
17040A15368j4060n350l242j1350L464j0062J206J006j9662q303J946J468n037
$$ plain form
17139 64471 62922 58398 50983 41380 33286 32875 46329 41418 36600 44815 46170 43043 47112 47641 50096
17124 50096 57523 49114 38515 41192 49415 51535 41035 38495 52020 52373 44272 51691 45780 33457
17110 33457 23561 20121 27561 30795 24771 27902 30981 47773 43598 29415 32638 32310 35717 39821
17096 39821 44311 51992 43299 26844 21793 29032 29870 40481 40965 23392 24309 29748 28256 43546
17082 43546 52145 42659 24044 14356 10330 16904 28355 32909 30322 27349 35331 26694 35445 41155
17068 41155 48576 46774 43634 37910 46939 67267 79299 99308 116643 126490 115596 126286 132090
17055 132090 132850 135708 135946 137523 134968 131819 138612 137017 144068 144757 139284 130883 131686 122643 115368
17040 115368 101308 95958 92716 81366 84830 74768 75974 76980 57318 49015 50961 52429 47392
17027D7392j0133N339l271k190N475j2281J246L243n235OL335J1829K0193R711
17013G4659j5516j0151j1892p703l35j1014j3242N946J3860q640j2747Q916J4755
17000B6896O300l797k271Q147Q505l372o197R845Q307J0804j615j0554n506j001
16986D4491R436n411l097J2926J7229O44q805N65L529r22J901p115k660J0525
16972G3236L812P494J3165L073k019m07J0934j2063j3012n368L883m955N044O564
16958H9381Q871Q014n17j0610M281J1997j146J638L351j8119n183m098k409M367
16944H9818Q93R700J5266m512j673J666j980Q688P614n136J196l114k275L324
16930A19475R732p05n231j5485j825Q915m80J0232O991J2960J1449Q362r787p546
$$ plain form
17027 47392 37259 42598 39327 37137 42612 30331 31577 34820 29585 29591 32926 44755 64948 74659
17013 74659 59143 48992 37100 29397 29062 18048 4806 10752 24612 15972 3225 12141 26896
17000 26896 33196 29399 27128 35275 43780 40408 34211 44056 52363 63167 61552 50998 45492 44491
16986 44491 53927 48516 45419 58345 75574 76218 67413 67978 71507 70585 72486 65371 62711 73236
16972 73236 77048 84542 97707 100780 98761 98354 109288 97225 84213 78845 82728 77773 82817 89381
16958 89381 98252 106266 105749 95139 99420 111417 110271 111909 115260 97141 91958 87860 85451 89818
16944 89818 90711 100411 115677 111165 109492 111158 109178 117866 125480 120344 121540 118426 116151 119475
16930 119475 129207 128502 123271 107786 105961 114876 114396 124628 131619 144579 156028 164390 154603 147057
16916A47057O015m602L773R953R339R218J6627J0566L325R935J7657J97o175O986
16902B39871J7251J1250J5464P434J5553M457N387L2162K5845L4034N8552N2248
16890E19508M8464O5069O6010P7047P8861P7889Q8699R7502J12241J08240J15448
16879A454978J40589J60038J71814K13549K65096L21384M58922O77617R50596
16870D814583J405989K203869L544479N219696N980291M537579K634603K202680
16862C2543769J303821j70690j88551o33112j323897j853786m124134n886732
16854A9666688m501705k350545r19447j3920P55300J727703L224606M896359N298400
16845B7783439L575264J915998J589104M90215p07625n75692j147815j694123
$$ plain form
16916 147057 153072 148470 152243 162196 171535 180753 197380 207946 211271 221206 238863 239060 232885 239871
16902 239871 257122 268372 283836 291270 306823 311280 316667 348829 374674 408708 467260 519508
16890 519508 567972 633041 699051 776098 854959 932848 1021547 1119049 1231290 1339530 1454978
16879 1454978 1595567 1755605 1927419 2140968 2406064 2727448 3186370 3863987 4814583
16870 4814583 6220572 8424441 11968920 17188616 23168907 27706486 30341089 32543769
16862 32543769 33847590 33676900 33488349 32855237 31531340 29677554 25553420 19666688
16854 19666688 15164983 12814438 11894991 11881071 12636371 14364074 17588680 22485039 27783439
16845 27783439 31358703 33274701 34863805 35354020 34646395 34070703 32922888 31228765
16837C1228765k395345m797493n991837m362732k497934j423015r19314o91936
16829H149159n57179m11628l23293l03319l28379l69773l91916l62062l27924
16820D773686l07649k65483k14329j94712j82381j71913j49852j32035j17264
16811C038068j24226j14361j04700j13502j22402j19680j08351r7658r6683o7373
16801A969132o3468o8843o5867n7948o3618n9029m8560n6265m9345m5212m8446
16790A342531n3116m1180m8849m5383l7076k6622l4491l8537l0300k4927k6414
16779I35636l0384j2242p876l3096l7506k5772j2949j5888j7258k0362j9907l0774
16767F71622l2413k5492k3085k2918k7269k5393j0783j1560j2784j9800k9682
$$ plain form
16837 31228765 28833420 24035927 18044090 13681358 11183424 9760409 8841095 8149159
16829 8149159 7591980 7180352 6857059 6553740 6225361 5855588 5463672 5101610 4773686
16820 4773686 4466037 4200554 3986225 3791513 3609132 3437219 3287367 3155332 3038068
16811 3038068 2913842 2799481 2694781 2581279 2458877 2339197 2230846 2133188 2036505 1969132
16801 1969132 1905664 1836821 1770954 1713006 1649388 1590359 1541799 1485534 1436189 1390977 1342531
16790 1342531 1289415 1248235 1199386 1154003 1116927 1090305 1055814 1017277 986977 962050 935636
16779 935636 905252 893010 885134 852038 814532 788760 775811 759923 742665 722303 702396 671622
16767 671622 639209 613717 590632 567714 540445 515052 504269 492709 479925 460125 430443
16756D30443k3027j1914j2703q923K186j6183j9312k0961j5698o117j8880j3043
16744B65868j0475m341q352K114m035p997k8788j7383o527o472P554n995k2499
16731A52672k0462j687k02j433Q418j2193n412K230j1017j0774l958k683L775
16718I7274N254J961J067J484J8638n398j2452j3556o904J3455l560j1302O724
16705I2685R052r79q544p850N530j3715j3204M208J0214P78n606N613L489M485
16691H6156J457p056R38J5187J1602j0632n772k008n42k996l265m117L79M112
16677H3443n573j868p142m193j481r194J4289N337N193Q463k818j1909k224N884
16663G6207l39k531j878K249Q60j6220j410P457M960l421K303q626j6722q125
$$ plain form
16756 430443 407416 395502 382799 373876 376062 359879 340567 319606 303908 297791 278911 265868
16744 265868 255393 251052 242700 244814 240779 232782 203994 186611 180084 173612 181166 175171 152672
16731 152672 132210 130523 130321 128888 137306 125113 119701 121931 110914 100140 96182 93499 97274
16718 97274 102528 104489 105556 107040 125678 120280 107828 94272 87368 100823 97263 85961 92685
16705 92685 101737 100758 92214 84364 89894 76179 62975 67183 77397 78175 72569 78182 81671 86156
16691 86156 87613 80557 81495 96682 108284 97652 91880 89872 89330 86334 83069 78952 79331 83443
16677 83443 77870 76002 68860 64667 63186 53992 68281 73618 78811 87274 84456 72547 70323 76207
16663 76207 75868 73337 71459 73708 74568 58348 56938 64395 69355 65934 68237 59611 42889 34764
16649C4764J713M886q63O75M521P539Q673p699J5512J678J638l82n421l560N308
16634F8982j2479j3828p513k593P19L854J4686O151k798p312n077m486l906O127
16620D0527J491j0556j3420J39j243O487J314L436M002q773j2473j4659l727R261
16606A806P352J0651l496k865P39L871M14l204j293l446M848R017m18J122K491
16591B7589l88p056K377j4782j0242J2823J870P655M454k898K201n171k576p367
16577H489l490P44p066K616j596J195J2028R321k668o492o411n746R60L363K823
16562H070q87J8603Q703l688m717O411O081p169j1200q453o822j0079j789j812
16548h748J0965J9151N285k23n792j7277J792R099P72r310k831o011k3R047J5228
$$ plain form
16649 34764 36477 41363 40500 41175 45696 53235 61908 54209 69721 71399 73037 72655 67234 63674 68982
16634 68982 56503 42675 35162 32569 33288 37142 51828 57979 55181 47869 42792 38306 34400 40527
16620 40527 42018 31462 18042 18181 16938 23425 24739 28175 32177 23404 10931 -3728 -7455 1806
16606 1806 9158 19809 16313 13448 14187 18058 18472 15268 13975 10529 15377 24394 23976 25098 27589
16591 27589 27201 20145 22522 7740 -2502 10321 12191 19846 24300 21402 23603 18432 15856 8489
16577 8489 4999 5743 -1323 1293 -303 892 12920 22241 19573 13081 6670 924 1884 5247 8070
16562 8070 7183 25786 34489 30801 26084 32495 38576 31407 20207 11754 4932 -5147 -6936 -8748
16548 -8748 2217 21368 26653 26430 20638 3361 5153 14252 15024 5714 2883 -3128 -3151 5896 21124
16533B1124R388K719o2J589j5529j8618k39R725l798J476j892m24R285J756j4630
16518A870j1839K894q55j030L244M185k970J5679j01l403q06r16J020l852n987
16503b867J3135L186K35r077L729J9455P120j8258r022L204K60k845m076j4207
16489a0028p523R491J1541N6p094Q130P567n618j4058Q21O627L940j3477m775
16475a4400J1064P532l53N373J545l027j80L152R453j773j7889K306O685J328
16461A0816r141K806M593J27p040o348K024N562p598r000J5139k402l656K785
16447a333O29l358K136R647N194j7249j0328P053j23o067M622Q608Q031Q6m004
16432C544J4961j227j4921j301K576P59j174r874M170J0073M798m576m35J5104
$$ plain form
16533 21124 30512 33231 33169 34758 19229 611 372 10097 6299 7775 5883 5459 14744 16500 1870
16518 1870 -9969 -7075 -7930 -8960 -5716 -1531 -4501 11178 11077 7674 6868 5952 6972 3120 -2867
16503 -2867 10268 13454 13689 4612 8341 27796 34916 16658 7636 10840 11100 8255 4179 -10028
16489 -10028 -17551 -8060 3481 3537 -3557 4573 12140 6522 -7536 -6715 -88 3852 -9625 -14400
16475 -14400 -3336 4196 3843 9216 10761 7734 7554 10706 20159 18386 497 2803 9488 10816
16461 10816 1675 4481 9074 9201 2161 -4187 -2163 3399 -4199 -13199 1940 -462 -4118 -1333
16447 -1333 -704 -4062 -1926 7721 12915 -4334 -14662 -7609 -7732 -13799 -9177 -569 7462 7548 3544
16432 3544 18505 17278 2357 1056 3632 4391 3217 -6657 -2487 7586 12384 7808 7373 22477
16418B2477m86k956l658q363p777R24J0044L87O679o549o964L013l71J1624M412
16403B2436p534j1696p817J1529K564J0590J0495o85O932q754j0090k2245j860
16390f135R020n865l367O760N558m751J689q261k775q217L250K776o586R022P014
16375h68n786J5151J248p813J1574J5955P252j1349j2910l522p426k589M841K761
16361F519n52L992M144j6527j781P500L91R440O561l798m013l459q653P839J6494
16346B4097N573p975o644l318j977n579q535l968N53J503O351P139P172j7361
16332b969J945P524l635P327m022j384M84J4119R550k558q204q586J111L349k752
16317A1299k855N159J9424K4448J9984J9304J9588K0724J5338J1567J1615N324
$$ plain form
16418 22477 21991 19035 15377 7014 -763 161 10205 10592 17271 10722 3758 6771 6400 18024 22436
16403 22436 14902 3206 -4611 6918 9482 20072 30567 29882 36814 28060 17970 -4275 -6135
16390 -6135 2885 -2980 -6347 413 5971 1220 2909 -5352 -8127 -16344 -13094 -10318 -16904 -7882 -868
16375 -868 -6654 8497 9745 1932 13506 29461 36713 25364 12454 8932 1506 -1083 3758 6519
16361 6519 5967 9959 14103 -2424 -4205 3295 3686 13126 19687 15889 11876 8417 -236 7603 24097
16346 24097 29670 21695 15051 11733 9756 4177 -4358 -8326 -7773 -6270 81 7220 14392 -2969
16332 -2969 -1024 6500 2865 10192 6170 4786 5270 19389 28939 26381 18177 9591 10702 14051 11299
16317 11299 8444 13603 33027 57475 77459 96763 116351 137075 152413 163980 175595 180919
16305A80919n19p105p928r134k8531l4401j0609K662m065j1735q03K4603J9418
16292A12772K5246K0464J0694O520J1243k168M143m458K777j6384k0634k3871
16280A26344k9585k5994j8654r821n54K150k43j5152l830J281O59J0612O915k485
16266D1643m362q075M360q069o373k765p650N258L845Q91l918J518k191n880l260
16251D972N038j1993k383j088L463J0240K461m818Q827k220J868J0622j0480j2216
16237B293j3016L177J3648R159p565p112k418j0735N278q65R122K045J472J0114
16223A4597L615k564j3764j1532p67J1304J081J108J890R960R98O953M449j1337
16209A5991J060Q480r061l861O328k912J287q900l037M41Q21j379k105j2803p041
$$ plain form
16305 180919 180400 173295 165367 156233 127702 93301 82692 85354 81289 69554 68751 93354 112772
16292 112772 138018 158482 169176 175696 186939 184771 188914 184456 187233 170849 150215 126344
16280 126344 96759 70765 52111 42290 41736 43886 43643 28491 24661 25942 26601 37213 44128 41643
16266 41643 37281 29206 33566 25497 19124 16359 8709 13967 17812 18703 14785 16303 14112 8232 4972
16251 4972 10010 -1983 -4366 -5454 -1991 8249 10710 5892 14719 12499 14367 24989 14509 2293
16237 2293 -10723 -7546 6102 15261 7696 584 -1834 -12569 -7291 -8156 966 3011 4483 14597
16223 14597 18212 15648 1884 -9648 -10415 889 1970 3078 4968 14928 15926 22879 27328 15991
16209 15991 17051 25531 16470 12609 18937 16025 17312 8412 5375 5816 6637 5258 3153 -9650 -16691
16194a6691o210q72j572k580J8538N444L422J153J6403J770p552L866P301l598
16180A8822n104j6800p025P686o809q937m671k423K0761O727k1661n475j0986
16167c5895L331P855P406J4349o338j546p67M420Q605l215j1049p454m27R019
16153a1706K727O941R15j794k161j534m786J586L094P009N628O822O410j4190
16139D961m377p638p213N838N351p46j388J1869O789n012j6454n776J221P763
16125d812K363k382J0267K303J569j1678O205o762o8M853k447m063j1115p894
16111b3661L629Q711J0607K441j4587M022J4360M418m743m61j390q096j2095J539
16097a5306R865K627n683j4840p2J1049N648k500l579rk659n19R073O261j971
$$ plain form
16194 -16691 -22901 -23773 -25345 -27925 -9387 -3943 -521 632 17035 18805 11253 15119 22420 18822
16180 18822 13718 -3082 -10107 -2421 -9230 -18167 -22838 -25261 -4500 2227 -19434 -24909 -35895
16167 -35895 -32564 -24709 -17303 -2954 -9292 -10838 -11605 -7185 1420 -1795 -12844 -20298 -20725 -11706
16153 -11706 -8979 -2038 -1123 -2917 -5078 -6612 -11398 -9812 -6718 291 5919 12741 19151 4961
16139 4961 584 -7054 -14267 -8429 -3078 -3824 -5212 6657 13446 8434 -8020 -13796 -12575 -4812
16125 -4812 -2449 -4831 5436 7739 9308 -2370 3835 -2927 -2995 1858 -589 -4652 -15767 -23661
16111 -23661 -20032 -11321 -714 1727 -12860 -8838 5522 9940 5197 4736 3346 -4750 -16845 -15306
16097 -15306 -5441 -2814 -8497 -23337 -23409 -12360 -6712 -9212 -12791 -12800 -15459 -15978 -6905 -644 -2615
16082b615o153r845L5O705J57N658L112Q127O607J564j0891k969n274J0892K462
16067G572K461j47o709k16j5538Q353j285N307L492N255L003k064r522N491l328
16052B125m866o571n216l24K636n234J0857N744N320J128M540K513M290j1130
16038E812n363K774k213l504K3789Q675q147j1544P743j0717m252J0760l736j4280
16024d203M786M859M343n77L234J2809M582P907O193j746j0301o517j2026m245
16010I098L568l57m314j0157n891L588q388n751N738J2379M87n175j513R177R672
15995A2161n929k697r37m540J1022K999M710l407M16J352o922o943m47m588l739
15980g489o696k097M100P131m228M082N272J1842R602l44m621L367M651j093o945
$$ plain form
16082 -2615 -8768 -18613 -18578 -11873 -11716 -6058 -2946 5181 11788 13352 2461 -508 -5782 5110 7572
16067 7572 10033 9886 3177 2961 -12577 -4224 -5509 -202 3290 8545 11548 9484 -38 5453 2125
16052 2125 -2741 -9312 -14528 -14852 -12216 -17450 -6593 -849 4471 5599 10139 12652 16942 5812
16038 5812 449 3223 1010 -2494 21295 29970 21823 10279 18022 7305 3053 13813 10077 -4203
16024 -4203 583 5442 9785 9208 12442 25251 29833 37740 43933 42187 31886 25369 13343 9098
16010 9098 12666 12309 7995 -2162 -8053 -4465 -12853 -18604 -12866 -487 0 -5175 -6688 2489 12161
15995 12161 6232 3535 2598 -1942 9080 12079 16789 13382 13798 15150 8228 1285 838 -3750 -7489
15980 -7489 -14185 -16282 -12182 -5051 -9279 -5197 75 11917 21519 21175 16554 19921 24572 23479 16534
15965A6534j1948l507J7082Q419P949p645j4812K00J513k650L741N028m952n84
15951A4368R482n899j5109m632k852l530m691j1165L940N881J3031O785J4521
15938B0130L755l942K035O223J91k141j7319q399L160J1762n038j034j0289N112
15924D206M358j2198k727N97M405K471m30l010n738m297m650j937n671J1147Q115
15909e359O348o984m23M837k398j056K269J0376M308q52l210j8384l684R571J2228
15894G587J5424P866j1068j7670K19M383N708R338o489q228o132j5534Q4L160
15880a1352m789K247k604J9155o04L181J1954J69j0360p131L75m139n344Q906
15866c36M787p718k816l818m268O914J4993R541k010p657k485M850L083r348m900
$$ plain form
15965 16534 4586 1079 18161 26580 34529 26884 12072 12272 13785 11135 14876 19904 14952 14368
15951 14368 23850 17951 2842 -1790 -4642 -8172 -12863 -24028 -20088 -14207 -1176 5609 20130
15938 20130 23885 19943 21978 28201 28392 26251 8932 533 3693 15455 10417 9383 -906 4206
15924 4206 8564 -3634 -6361 -5764 -1359 1112 682 -2328 -8066 -12363 -17013 -18950 -24621 -13474 -5359
15909 -5359 989 -5995 -6418 -1581 -3979 -5035 -2766 7610 11918 11066 7856 -10528 -14212 -4641 7587
15894 7587 23011 30877 19809 2139 2358 6741 12449 21787 15298 7070 938 -14596 -14512 -11352
15880 -11352 -16141 -13894 -16498 2657 2053 5234 17188 17357 6997 -134 241 -3898 -9242 -336
15866 -336 4451 -3267 -6083 -9901 -14169 -7255 7738 17279 15269 7612 5127 9977 13060 3712 -1188
15851a188l113K975N275o949q643K815Q781k565q446N774J3593J8128P811n789
15837B8459k0153q760O92k817j4686j2679R818R123n08j0758M275Q635Q834L176
15823B651M885J043o294m0P940p352J268J0733n013n328Q532j58J441Q492q383
15808A4417m889j2366r832M904Q269P581n077j4926K610O162N167N356L140q903
15794A613k022Q077N51J130P154j0833k395J242J0000Q274j678j659L447p519
15780A5382N25q45j339j4832r953J1058J1291L751p71j515j4780N40j842o590
15766i920k560n652N368J3736K120m301L181J1387l074J942k186n690J1203R57
15752A6511j388q847O161k193p744j1407J72L610q359P653Q8J35N372R429N513
$$ plain form
15851 -1188 -4301 -1326 3949 -3000 -11643 -8828 -47 -2612 -11058 -5284 8309 26437 34248 28459
15837 28459 8306 -454 238 -2579 -17265 -29944 -20126 -11003 -11511 -22269 -17994 -9359 -525 2651
15823 2651 7536 8579 2285 2245 10185 2833 4101 14834 9821 4493 13025 12867 14308 22800 14417
15808 14417 9528 -2838 -12670 -7766 503 8084 3007 -11919 -9309 -3147 2020 7376 10516 1613
15794 1613 -409 7668 8219 9349 16503 5670 3275 4517 14517 22791 21113 19454 22901 15382
15780 15382 15907 15062 13723 -1109 -11062 -4 11287 15038 14267 12752 -2028 -1488 -3330 -9920
15766 -9920 -12480 -18132 -12764 972 3092 -1209 1972 13359 10285 12227 10041 4351 15554 16511
15752 16511 15123 6276 12437 10244 2500 -8907 -8735 -5125 -13484 -5831 -5743 -5608 -236 9193 14706
15737A4706J300L51l665k317l38l58l576L184o520j850m14O90j4645O28J906J818
15721i100m748J5270J2965M261N568K696L106o865j4493J413r734m902L83O779
15707B599K916n71K166p076p82N945P274M249M750j3479n302P139L201j70Q014
15692B0873l653j1077P078l191q06O225p899k435L023n580n045j86J4395j0373
15678A349r907M874l291J793p923j318K82M784O728K3702Q12q876J795K756j0803
15663F757o166p67P531Q553J79j0713o308m418J236J6853k964r025j848R61m287
15648d426j0636J2501J6307j5020j3043J2374J4266o165Q4N383p79M31j2946j0022
15634a1691k110J1583o753n81r3O856k122j2473K5980Q886j6565o535n009r236
$$ plain form
15737 14706 16006 16357 12692 10375 10037 9679 6103 9287 2767 917 503 1193 -13452 -12824 -10918 -9100
15721 -9100 -13848 1422 14387 18648 24216 26912 30018 23153 8660 10073 339 -4563 -4180 2599
15707 2599 5515 4944 7110 34 -748 5197 12471 16720 21470 7991 2689 9828 13029 12859 20873
15692 20873 17220 6143 13221 10030 9224 15449 7550 5115 8138 2558 -2487 -2673 11722 1349
15678 1349 -8558 -3684 -6975 -5182 -13105 -14423 -14141 -9357 -2629 21073 21885 13009 14804 17560 6757
15663 6757 591 -176 7355 15908 16087 5374 -934 -5352 -4116 12737 9773 748 -1100 -139 -4426
15648 -4426 -15062 -2561 13746 -1274 -14317 -1943 12323 6158 6242 11625 10846 11277 -1669 -11691
15634 -11691 -13801 -2218 -8971 -9552 -9645 -2789 -4911 -17384 8596 17482 917 -5618 -10627 -19863
15620a9863K6J2774J1059O422k751j69P903k453r111J5572m562j6081R13j543
15606a864J825J5160j0595j4637q822P690M289L741q873L86J1534j189n06O812
15592D951N890J1164o434j1288L402J2535M209J006m416l406j427j4074m902L650
15578H60O755J2226o707L430M659k926j1975j1189k193P700j53J0625Q278N839
15564B5229n589j022L263N914R308r244j6813L314O50n9o135L14p172K40J726
15549C924l70l152j2142m106J3553M49J576m271J700J1464J5357M767r749j3713
15535E287k0190J213P747Q624n035j8847L880J0096j497O450N86M776M425m75
15521G040p863p956J0427J2896k554p985j3852k640N688K969l815J3061J5616
$$ plain form
15620 -19863 -19837 -7063 3996 10418 7667 7498 15401 12948 3837 19409 14847 -1234 -321 -1864
15606 -1864 -39 15121 4526 -10111 -18933 -11243 -6954 -3213 -12086 -11700 -166 -1355 -1861 4951
15592 4951 10841 22005 15571 4283 7685 20220 24429 25435 21019 17613 16186 2112 -2790 860
15578 860 7615 19841 13134 16564 21223 18297 6322 -4867 -7060 640 487 11112 19390 25229
15564 25229 19640 18618 21881 27795 37103 27859 11046 14360 15010 14951 8816 9130 1958 2198 3924
15549 3924 3554 402 -11740 -15846 -2293 -1844 -268 -4539 -2839 8625 23982 28749 19000 5287
15535 5287 -14903 -13690 -5943 2681 -2354 -21201 -17321 -7225 -8722 -2272 -1686 3090 7515 7040
15521 7040 -823 -8779 1648 14544 11990 4005 -9847 -12487 -6799 -3830 -7645 5416 21032
15508B1032k718k531m597M501J228j5659j7404K368P106Q338K1281o93q762J335
15494A4825j2368l731N409j264o514N612J761r002J2713M884q513M388N448j6277
15480b629j7360K056J6526M380o14q735o707Q10O106Q856M316K961k670j3152
15466e856r281j688Q281k655p068q002Q53n011K876J1764k041r844P539K498j780
15451a9415Q65k328J5373J0622L62k1890N681Q729J057J734J0949j500q246N852
15437G845q901K993J2018M230j2533j0524j1102N504M117j148p196O591L483k613
15423g236P044K457Q570j557n348j8447p484j0138L869J3604P603k808O063Q326
15409D518K572j0323N11K065j1771j1374J6485R837r365j9182O477N264J140p113
$$ plain form
15508 21032 18314 15783 11186 15687 16915 1256 -16148 -13780 -6674 1664 22945 22252 13490 14825
15494 14825 2457 -1274 4135 2871 -3643 1969 3730 -5272 7441 12325 3812 8200 13648 -2629
15480 -2629 -19989 -17933 -1407 2973 2359 -6376 -13083 -12273 -6167 2689 7005 9966 7296 -5856
15466 -5856 -15137 -16825 -8544 -11199 -18267 -26269 -25416 -30427 -27551 -15787 -17828 -27672 -20133 -17635 -19415
15451 -19415 -18550 -20878 -5505 5117 5479 -16411 -10730 -2001 -944 790 11739 10239 1993 7845
15437 7845 -1056 1937 13955 18185 5652 -4872 -15974 -10470 -6353 -7501 -14697 -8106 -4623 -7236
15423 -7236 -192 2265 10835 9278 3930 -14517 -22001 -32139 -28270 -14666 -7063 -9871 -3808 4518
15409 4518 7090 -3233 -2722 -657 -12428 -23802 -7317 2520 -6845 -26027 -19550 -14286 -13146 -20259
15395b0259l778L734n631N229Q294J5405n64n438M290m709K45O525j2195n987
15381a4839m926m110q589k373P834P561J1056J2950L783q481j9852n17l66p373
15367b8242J2979Q411M747j4224j129R400j994m841P069J3959M719o683p183j1824
15353a4836L821k565J225p879k373Q873O001L84p470j2736k042J0505Q307M707
15339f078j3243m553R359R035O220Q732N409l453l336j3293o619o81M979P488
15325c4M450j7977j4093j19n54M239j624k824O376R26J7690K012j4417j082O306
15310a0725J8548p849q510Q1J9215k734r585j311J3038L845k05l089q444l581
15296a306J926n648N378M214q671n031j675J0381L406o452j4674J178L425j0401
$$ plain form
15395 -20259 -24037 -20303 -25934 -20705 -12411 2994 2430 -3008 1282 -3427 -3182 3343 -8852 -14839
15381 -14839 -19765 -23875 -32464 -34837 -27003 -19442 -8386 4564 8347 -134 -19986 -20503 -20869 -28242
15367 -28242 -15263 -6852 -2105 -16329 -17458 -8058 -10052 -14893 -7824 6135 10854 4171 -3012 -14836
15353 -14836 -11015 -13580 -12355 -20234 -22607 -13734 -7733 -7349 -14819 -27555 -29597 -19092 -10785 -6078
15339 -6078 -19321 -23874 -14515 -5480 740 9472 14881 11428 8092 -5201 -11820 -12501 -7522 -34
15325 -34 4416 -13561 -27654 -27773 -28327 -24088 -25712 -28536 -22160 -21234 -3544 -1532 -15949 -17031 -10725
15310 -10725 7823 -26 -8536 -8455 10760 8026 -1559 -2870 10168 14013 13808 10719 2275 -1306
15296 -1306 620 -5028 350 4564 -4107 -9138 -10813 -432 2974 -3478 -18152 -16974 -13549 -23950
15282b3950k414N483J8432J1086r59J526K252L528j2187j1420j778Q287J853m436
15268d697J495l425j142J996L617L998P81j1781J2767K974k04n294K388Q428o168
15253E733j8396N489K800k309j776K780L38m576j693N619l151l578J864M499K57
15238f100n762J42J800R791o540j348J148J4905j3880q940K439M327P382K136
15224A500r90J228K500r293l75Q316L091j4J0616m301j0145J378o273o157n305
15209a4224j212O335k156K160K183Q590o068k073j050M247j8393k328J8850O964
15195A825J911P928j944q443j2718k130J0062K2576k701m10q557P77Q627J630
15181A8433j8778p188J663j43N659N276O752L957K897o740j9099r51J1749O083
$$ plain form
15282 -23950 -26364 -20881 -2449 8637 7678 9204 11456 14984 2797 -8623 -10401 -2114 -261 -4697
15268 -4697 -3202 -6627 -7769 -5773 -2156 1842 2623 -9158 3609 6583 6379 1085 3473 11901 5733
15253 5733 -12663 -7174 -4374 -6683 -8459 -5679 -5341 -9917 -11610 -5991 -9142 -12720 -10856 -6357 -6100
15238 -6100 -11862 -11720 -9920 -129 -6669 -8017 -6869 8036 -5844 -14784 -12345 -8018 -636 1500
15224 1500 510 1738 4238 -5055 -5430 2886 5977 5963 16579 12278 2133 3511 -2762 -8919 -14224
15209 -14224 -15436 -9101 -11257 -9097 -6914 1676 -4392 -6465 -7515 -3268 -21661 -23989 -5139 1825
15195 1825 3736 11664 9720 1277 -11441 -13571 -3509 19067 16366 15956 7399 8176 16803 18433
15181 18433 -345 -7533 -5870 -6013 -354 4922 11674 15631 18528 11788 -7311 -8262 3487 9570
15167I570m752J194L478o512r362K031L418M361J620j138j959N367n317N16m800
15152b285o600J039n362N193J2799N306P775k599m726q777j0233o673Q571n314
15138a1886J2293L648j5445N16R016j0607m436O343M256n91L908K3823N264k4566
15124A536j7807J1095l123j4290l16K2642J0393R631n555o824j709J322o266j0687
15110i958K555P742J1327m140p277j111L345n563l806L547O027R483N194k158
15096A5207j754l258n245k834M289R73n532n70k74j3247K774J0312q594r363J7641
15081E25J1861o819k724O976K208j0796j0955M248k880O785n195l167L871K211
15067c851L492N078j310n456L239N222j5477j3704J2032J0855M287m255n85P512
$$ plain form
15167 9570 4818 6012 9490 2978 -6384 -4353 -935 3426 5046 3908 1949 7316 1999 2515 -2285
15152 -2285 -8885 -7846 -13208 -8015 4784 10090 17865 15266 10540 1763 -8470 -15143 -6572 -11886
15138 -11886 407 4055 -11390 -10874 -1858 -12465 -16901 -10558 -6302 -6893 -2985 20838 26102 1536
15124 1536 -16271 -5176 -8299 -22589 -22905 -263 10130 19761 14206 7382 5673 6995 729 -9958
15110 -9958 -7403 339 11666 7526 249 -862 2483 -3080 -6886 -3339 2688 12171 17365 15207
15096 15207 13453 10195 4950 2116 6405 7378 1846 1276 1002 -12245 -9471 841 -7753 -17116 525
15081 525 12386 5567 2843 9819 12027 1231 -9724 -5476 -8356 -1571 -6766 -9933 -6062 -3851
15067 -3851 -359 4719 3409 -2047 1192 6414 -9063 -22767 -10735 120 4407 152 -433 7079
15053G079k116o726o085P494n632o503L253M227l214j274K046k684O42o108l501
15038a9102q124L438J9662J652n479R338O179j0305l135P290K784j2648k205O972
15024c683P216M877j2097Q753M886J734R110j8378q37J7311J232p234j0813n083
15010c006n793j33J2733P7j7470k676O462j955l748m775L162O39M537J0855P887
14995F796o94k547J491K186R740J439q832p850m730r060l604M406J6011l403j5183
14980a3834p113q132R815J0726Q098k839j2684L15j213R605L734o905Q916l766
14966e277L496L558K869R754R259l835k188p392m452R776r770j4350Q22m20k708
14951a0858Q356l337m916J862O746p51r238l520L936j311k271n443P658N951Q759
$$ plain form
15053 7079 4963 -1763 -7848 -354 -5986 -12489 -9236 -5009 -8223 -9497 -7451 -10135 -9493 -15601 -19102
15038 -19102 -27226 -23788 -4126 -2474 -7953 1385 7564 -2741 -5876 1414 4198 -8450 -10655 -3683
15024 -3683 3533 8410 -3687 5066 9952 11686 20796 2418 1581 18892 20124 12890 2077 -3006
15010 -3006 -8799 -8932 3801 3878 -13592 -16268 -9806 -11761 -15509 -20284 -17122 -16483 -11946 -1091 6796
14995 6796 6102 3555 5046 7232 16972 18411 9579 1729 -3001 -12061 -15665 -11259 4752 1349 -13834
14980 -13834 -20947 -29079 -19264 -8538 -440 -3279 -15963 -15648 -16861 -7256 -3522 -10427 -1511 -5277
14966 -5277 -1781 1777 4646 14400 23659 19824 17636 10244 5792 15568 5798 -8552 -7730 -8150 -10858
14951 -10858 -2502 -5839 -10755 -8893 -2147 -2898 -12136 -15656 -11720 -13031 -15302 -20745 -13087 -7136 1623
14936A623j3002M860O668r593J230R29j3293M859L010K366q324N440J7234Q215
14922A2222M801k029j376p024l03m642n714L67J0540L565j2149k747o699k877
14908a4065q076R956J3997P228o51p804k625r065N462J2851K056K417j3026p687
14894i032O776J1884N314q838o971K609L569k840q028n079m344n74P533m550o10
14879a3181m122O360J1218L782N843j0790m838K823j410J547J2341l264j5662
14866i353Q323l584n165Q722M687P508J706n646j5470o518m975O126j731O039
14852i331n485p567N073K4J905J1546Q23K668p337j3184L980P803L426q31r544
14837a6031k709J3972L390M572L624l877p980M142p913kR952N232J876R354l526
$$ plain form
14936 1623 -11379 -6519 149 -9444 -8214 -7285 -20578 -15719 -12709 -10343 -18667 -13227 4007 12222
14922 12222 17023 14994 13618 6594 6291 1649 -4065 -3698 6842 10407 -1742 -4489 -11188 -14065
14908 -14065 -22141 -12185 1812 9040 8389 585 -2040 -11105 -5643 7208 9264 11681 -1345 -9032
14894 -9032 -2256 9628 14942 6104 -867 1742 5311 2471 -5557 -10636 -14980 -15554 -8021 -12571 -13181
14879 -13181 -17303 -10943 275 4057 9900 -890 -5728 -2905 -4315 -2768 9573 6309 -9353
14866 -9353 -1030 -4614 -9779 -1057 3630 11138 12844 7198 -8272 -14790 -19765 -13639 -15370 -9331
14852 -9331 -14816 -22383 -17310 -17286 -15381 -3835 -3012 -344 -7681 -20865 -16885 -9082 -5656 -6487 -16031
14837 -16031 -18740 -4768 -1378 3194 6818 2941 -5039 -897 -8810 -8812 1140 6372 8248 17602 14076
14822A4076k2320p651r051L221M143N285J0945K035j44J6118m441j8038L067J104
14808a651J2485L128j7503j0695n666K148J0969J6229L029m816j1239k475J86
14795e871Q890J614L981J3721M532L015j74r092M38P089j566q12j4205o316P842
14780A3086p435l514Q077J045r498J464m479K096j2R71J4022O092n01j2990r919
14765a495k700K927M772p668o893m046q82J1600j860n711J1184L351n894J65j627
14750d777J772L948O336j494M089J37j413n749k704k052m345J753K0789J3686
14736B9976m783k8029J001J085p879Q477J0747N683j0623p360O687O211j0980
14723B13j2185m22L172l175L601K111R192r178k343m47Q229K313M476R536J14
$$ plain form
14822 14076 -8244 -15895 -24946 -21725 -17582 -12297 -1352 683 539 16657 12216 -5822 -2755 -1651
14808 -1651 10834 13962 -3541 -14236 -19902 -17754 -6785 9444 12473 7657 -3582 -6057 -5871
14795 -5871 3019 4633 8614 22335 26867 29882 29708 20616 21054 28143 26577 25765 11560 5244 13086
14780 13086 5651 2137 10214 11259 1761 3225 -1254 842 830 1801 15823 21915 21414 8424 -1495
14765 -1495 -4195 -1268 3504 -4164 -11057 -15103 -15985 -4385 -6245 -11956 -772 2579 -3315 -3150 -4777
14750 -4777 -3005 943 7279 5785 9874 10011 8598 2849 145 -1907 -6252 -4499 16290 29976
14736 29976 25193 -2836 -1835 -750 -8629 -152 10595 16278 5655 -1705 4982 11193 213
14723 213 -11972 -12394 -9222 -12397 -8796 -6685 2507 -6671 -9014 -9461 -1232 1081 5557 15093 15207
14708A5207j765j3757P478J0181M17o118J4086J2194q073j6786j8139K291k05
14695b989Q563J1680j2163p905l843L216K086j1075J949L293q925O956N537p867
14681a1487m348J0336J1833K621q879K082n31J1235J361o250k076L406J087p309
14667C081j7120K954J6367Q625k881j6319J33J7526P75r092k08q846P145J020
14653C160l237N85K234K066p593N186K685O339P718J239j0911j8866o433j115
14639a6943J1964k277j4484p095K265J5832J9223K449n953k789k005J0180l64
14626A0003p768j184k0460m133q663J398J0478K2891P225N230Q392k255q358j0878
14612A918l108l373k624j29k06m908j0002nK955k995L983J1138k11o369o398j64
$$ plain form
14708 15207 13442 -315 7163 17344 17761 11643 25729 37923 29850 13064 -5075 -2784 -2989
14695 -2989 5574 17254 5091 -2814 -6657 -3441 -1355 -12430 -10481 -7188 -16113 -9157 -3620 -11487
14681 -11487 -15835 -5499 6334 8955 76 2158 1627 12862 14223 7973 5897 9303 10390 3081
14667 3081 -14039 -11085 5282 13907 11026 -5293 -5160 12366 13141 4049 3841 -5005 2140 3160
14653 3160 -77 508 2742 4808 -2785 2401 5086 11425 19143 20382 9471 -9395 -15828 -16943
14639 -16943 -4979 -7256 -21740 -28835 -26570 -10738 8485 10934 4981 2192 187 10367 10003
14626 10003 2235 1051 -19409 -23542 -32205 -30807 -20329 2562 9787 15017 23409 21154 12796 1918
14612 1918 -1190 -4563 -7187 -7316 -7522 -12430 -22432 -22437 -19482 -22477 -18494 -7356 -7567 -13936 -20334 -20498
14596b0498J1484J5645j70J374J75j992l234k287L092o098p196r326j25N415m123
14581a7864K84J917l949l166O629Q717n345l958O757N306J5216L906K200M161
14567B0811p867r809J899N097j1895j345J1456J676l208N512k244M507n364J1289
14553B0515M024o297j7045k448r918P820J1493j1457K202n580p060n555p029M065
14539b2270J3048P638p885j5948Q6Q552J0508Q983J2210r85P36n98j346j0024
14525B705J452P095L670k810j0862n368l369k235N715J1023J0753p998q806N71
14511A536q276Q406Q59m621M997K220l799n528l008n321J2296O632m608j745J433
14496A473o401J6959M798j5751j0381O749L952M461K581r183q596J2473J7785
$$ plain form
14596 -20498 -9014 6631 6461 7835 8010 6018 2784 497 3589 -2509 -9705 -19031 -19156 -13741 -17864
14581 -17864 -17580 -15663 -19612 -22778 -16149 -7432 -12777 -16735 -9978 -4672 10544 14450 16650 20811
14567 20811 12944 3135 5034 10131 -1764 -3109 8347 10023 6815 12327 10083 14590 9226 20515
14553 20515 24539 18242 1197 -1251 -11169 -3349 8144 -3313 -1111 -6691 -13751 -19306 -26335 -22270
14539 -22270 -9222 -1584 -9469 -25417 -25331 -16779 -6271 2712 14922 13937 14673 14075 12729 2705
14525 2705 4157 11252 14922 12112 1250 -4118 -7487 -9722 -4007 7016 17769 9771 965 1536
14511 1536 -6740 1666 2525 -2096 2901 5121 1322 -4206 -7214 -12535 -239 6393 1785 40 1473
14496 1473 -4928 12031 16829 1078 -9303 -2554 1398 5859 8440 -743 -9339 3134 20919
14483B0919N620j1170j4656o687L015M134o138M532N172P256k659j9298k553L528
14469h985J0722k686M513j271l909K493o592l269J602J0543J0435K371q64r725
14455E378K510m401J0381J2862L359N195j1575j327r160P676j2480j4699N391
14442h90Q201M279P760l823l280J286l848j325j599Q032m976j2838P583J2927
14428A7489k349L935P852p430q314j0094Q312M152n701j5916J0094j894n85N018
14414D569O530J1311j2212j1951o736M862O574N555R996R641M808j3391l55o700
14400A2501j1707l782K946P178l488n941j09k722N278r4O963Q04j4442j0864o186
14385b3665M739K485J2066K107p418J169j23l845J563L710O430N962J199k688
$$ plain form
14483 20919 26539 15369 713 -5974 -2959 1175 -4963 -431 4741 11997 9338 -9960 -12513 -8985
14469 -8985 1737 -949 3564 2293 -1616 877 -5715 -8984 -7382 3161 13596 15967 15103 5378
14455 5378 7888 3487 13868 26730 30089 35284 23709 22382 13222 20898 8418 -6281 -890
14442 -890 7311 11590 19350 15527 12247 13533 9685 8360 6761 14793 9817 -3021 4562 17489
14428 17489 15140 19075 26927 19497 11183 1089 9401 13553 7852 -8064 2030 136 -449 4569
14414 4569 11099 22410 10198 -1753 -8489 -3627 2947 8502 18498 28139 32947 19556 19201 12501
14400 12501 794 -2988 -42 7136 3648 -2293 -2402 -5124 154 60 7023 7827 -6615 -17479 -23665
14385 -23665 -18926 -16441 -4375 -2268 -9686 -8517 -8640 -12485 -10922 -7212 -782 5180 6379 3691
14371C691r38N616J358k171K082l590k535j2291j7136p043J1237K0260L92L571
14357B503Q113n333L39M515k01J872K233L716o939j7607r525P308K6073N218r1
14342B2194L803l334p960j3344r054N156Q828j443L475K781Q543R28j2154m886
14328C533l382l078j3435L052J3880o668n633J926L085k794L371N729Q639q410
14314a85j750r80p162k075J1689J6952j562o192j789R53l186j28N213l297n589
14299I12j0382j6666L393Q216M408m241l177K718J5414J3619r053l124r692o179
14285a3834L537M535K935J6935M091l398r052k502K492P71p136L323P85J147k540
14270B089p620O840P330j139p930l205k401o821O941J2463J952N332o738q602
$$ plain form
14371 3691 2753 8369 9727 7556 9638 6048 3513 -8778 -25914 -32957 -21720 -1460 -1068 2503
14357 2503 10616 5283 5622 10137 9936 11808 14041 17757 10818 -6789 -16314 -9006 17067 22285 22194
14342 22194 25997 22663 14703 1359 -7695 -2539 6289 4846 8321 11102 19645 20573 8419 3533
14328 3533 151 -2927 -16362 -13310 570 -6098 -11731 -9805 -6720 -9514 -6143 -414 8225 -185
14314 -185 -1935 -2915 -10077 -12152 -463 16489 14927 8735 6946 7899 4713 4585 9798 6501 912
14299 912 -9470 -26136 -22743 -14527 -10119 -14360 -17537 -14819 595 14214 5161 2037 -7655 -13834
14285 -13834 -10297 -5762 -2827 14108 18199 14801 5749 3247 5739 6510 -626 2697 3482 4629 2089
14270 2089 -5531 1309 8639 7500 -430 -3635 -6036 -12857 -5916 6547 8499 13831 7093 -1509
14256a509n252k272k742P287j553k374R054L671K793n656p463K625j515K819o57
14241b744J210L326j5039n867Q738Q963J130l601r374m678k023J5324L83j5644
14227a9896p764O95J2200J0912q751q258J001N032J2014J3299M152L536m155k120
14213A1897j2421m765J3698L545n565p293q439N714K814l869O586n012p638L585
14199g163J0198Q000Q701m969j2602j129p582j6466Q57J0829O699K3967q342j2029
14185a031q98j637q09R09l446k548p159O737p11J2581Q731q634o507l523L918
14170d027Q744O889j0786j6975K719m139j075J4630Q022l082k153m41k144l179
14156f997M141J4722K317j2582K659K786K169l719m986k717j2871j07Q376J2347
$$ plain form
14256 -1509 -6761 -9033 -11775 -4488 -6041 -8415 639 4310 7103 1447 -6016 -3391 -4906 -2087 -2744
14241 -2744 -1534 1792 -13247 -19114 -10376 -1413 -283 -3884 -13258 -17936 -19959 -4635 -4252 -19896
14227 -19896 -27660 -26965 -14765 -3853 -12604 -20862 -19861 -14829 -2815 10484 14636 18172 14017 11897
14213 11897 -524 -5289 8409 11954 6389 -904 -9343 -3629 -815 -4684 1902 -3110 -10748 -7163
14199 -7163 3035 11035 19736 14767 2165 1036 -6546 -23012 -22155 -11326 -4627 19340 10998 -1031
14185 -1031 -1929 -3566 -4375 -3466 -6912 -9460 -16619 -9882 -10593 1988 10719 2085 -4422 -7945 -4027
14170 -4027 4717 11606 820 -16155 -13436 -17575 -18650 -4020 4002 920 -1233 -1674 -3818 -6997
14156 -6997 -2856 11866 14183 1601 4260 7046 9215 5496 510 -2207 -15078 -15185 -6809 5538
14142E538K524o331J210k918j621P83r213P882o504m937L828R538Q038R855j3022
14127D650o132K139O910r359o939K004M213l48m652k763k613J817L121P239O581
14112E868n043j688l014N703j221q199R173K298K704l341k988J0361N332j1665
14098D280r234K37L394N688j2366M689J3574r84j6474l651j6608L452R825L61
14084a3817P202O599k7k149p00Q477n749k182N834O111j5631j470O814l374J1449
14069G387L48j2433j0401P479R042J241j0984L216J552j3948K181P916J1280p248
14055c372j8040j675O879J1532P904j0256J7249J0509n093j2658r705n421O82
14042a1465N929L193k46Q759M778l304M373N843j962l826q684P586J0196j735
$$ plain form
14142 5538 8062 1731 2941 23 -1598 -815 -10028 -2146 -8650 -13587 -9759 -221 7817 17672 4650
14127 4650 -1482 657 7567 -1792 -8731 -6727 -2514 -2862 -7514 -10277 -12890 -11073 -7952 -713 5868
14112 5868 825 -863 -3877 1826 605 -7594 1579 3877 6581 3240 252 10613 15945 4280
14098 4280 -4954 -4717 -1323 4365 -8001 -3312 10262 9278 -7196 -10847 -27455 -24003 -14178 -13817
14084 -13817 -6615 -16 -43 -2192 -2892 5585 -164 -2346 3488 9599 -6032 -7502 -688 -4062 7387
14069 7387 7735 -4698 -15099 -7620 1422 2663 -8321 -5105 -3553 -17501 -15320 -7404 3876 -3372
14055 -3372 -21412 -23087 -16208 -4676 3228 -7028 10221 20730 15637 2979 -6726 -12147 -11465
14042 -11465 -5536 -2343 -2589 6170 10948 7644 12017 17860 15898 12072 3388 10974 21170 19435
14028A9435k543r018J948n227N148J0753j707P165P1j9603j8604P050J510l603
14014g225j37j624M861N678K496O201K603R070K285P1l361n682O751n278r763
13999F946j2911j0989J2979L652o58j483K242L542N806K065k596j3511j202R507
13985C389J1390L735j0641k1356o102L044N816N823k297P17k64j1464m24J2655
13971e979Q653q1J3242k597l451k646j6526m78N315o387O393J2825L527r642J461
13956C629J0518J640o794r00k489k235k759O722m035j2012L73J2478J22q804k002
13941f548M767j945J0848Q410j2732L661R211m885j4922k0871m492K3193j931
13928h236q425J3569M295O565M90J3419M367L352k096n268q299j4552m525J30
$$ plain form
14028 19435 16892 7874 9822 4595 9743 20496 18789 25954 26025 6422 -12182 -5132 -3622 -7225
14014 -7225 -7362 -8986 -4125 1553 4049 10250 12853 21923 24208 24279 20918 15236 21987 16709 6946
13999 6946 -5965 -16954 -3975 -323 -981 -2464 -222 3320 9126 11191 8595 -4916 -6118 3389
13985 3389 14779 18514 7873 -13483 -19585 -16541 -10725 -4902 -7199 -6482 -6746 -18210 -18634 -5979
13971 -5979 2674 2593 15835 13238 9787 7141 -9385 -9863 -4548 -10935 -4542 8283 11810 2168 3629
13956 3629 14147 15787 8993 8093 5604 3369 610 7332 3297 -8715 -8342 4136 4258 -4546 -6548
13941 -6548 -1781 -3726 7122 15532 2800 6461 15672 10787 -4135 -25006 -29498 -6305 -8236
13928 -8236 -16661 -3092 1203 7768 8258 21677 26044 29396 27300 22032 13733 -819 -5344 -5214
13914e214l031o057n662m027J2952J3397l929n204J505K10j3377L390N975L694
13900e378n071l484n304K821O684L725L207M04O03k953j1323M572P14N761J0735
13885E713L739k904r104l868L022P732q494m572J894p44K858K317O47L987m817
13870b594L518q89l861M476j221N48P65r556L46M19N347N080J2298J183m100p868
13854C891l610J97m238M105l501K97J167n92j99j744j830p331l135K1924J1911
13839A7312M015J2169m670n809j727r232o079L432R504p87j4413L58K050Q40L585
13824A0548M084k3o413r141p635R972Q341n903j1587n505L048Q753L163L748O212
13809A1662R945M869N71M740j5404j1486l250m277K59K0176J1165L097j489p820
$$ plain form
13914 -5214 -8245 -14302 -19964 -23991 -11039 2358 -1571 -6775 -5270 -5060 -18437 -15047 -9072 -5378
13900 -5378 -10449 -13933 -19237 -16416 -9732 -6007 -2800 -2396 -1793 -4746 -16069 -11497 -10783 -5022 5713
13885 5713 9452 6548 -2556 -6424 -3402 4330 -4164 -8736 -6842 -7586 -4728 -2411 -1764 2223 -2594
13870 -2594 924 35 -3826 650 -571 -23 742 -8814 -8468 -8049 -2702 2378 14676 15859 11759 3891
13854 3891 281 478 -3760 345 -3156 -2859 -1692 -2284 -2483 -4227 -6057 -13388 -16523 5401 17312
13839 17312 21327 33496 28826 23017 21290 12058 5979 9411 18915 18128 3715 4073 6123 6963 10548
13824 10548 14632 14609 8196 -945 -8580 1392 9733 3830 -7757 -13262 -10214 -1461 1702 5450 11662
13809 11662 21607 26476 27047 31787 16383 4897 1647 -2630 -2371 17805 28970 32067 30578 22758
13795B2758p203j1367k193J9663P942j6366l555q039k083m251N276L839L920j0187
13781a846j1593m900R235J1356R932J731m514n332q366J703K268k206k020j509
13767f061n962l60N363R395l451l419n250R875q782j2596L291J3836R041J1358
13753A6278j06m44J846J902M725K469K055r628J226m327q577r499q778l353J0464
13738c747J7091l936j0455Q45K920M097p558O223j143M493o521M232O796m776
13724H561k644j2806k241K311j375l865N903P538J548L033O560k937j433L267
13710A1420m860J141R18N491Q71J667R040j726j0707Q82J292l781k443K449Q512
13695B0166Q188j056r934N448J340j1072o326n211L234J254M390m827J0220M244
$$ plain form
13795 22758 15555 4188 1995 21658 29600 13234 9679 1640 -443 -4694 582 4421 8341 -1846
13781 -1846 -13439 -18339 -9104 2252 12184 13915 9401 4069 -4297 -2594 -326 -2532 -4552 -6061
13767 -6061 -12023 -12383 -7020 2375 -1076 -4495 -9745 130 -8652 -21248 -17957 -4121 4920 16278
13753 16278 16172 15728 17574 19476 24201 26670 28725 19097 20323 15996 7419 -2080 -10858 -14211 -3747
13738 -3747 13344 9408 -1047 -202 2718 6815 -743 5480 4337 8830 2309 6541 13337 8561
13724 8561 5917 -6889 -9130 -6819 -8194 -12059 -6156 1382 2930 5963 12523 9586 8153 11420
13710 11420 6560 7701 8619 14110 14981 16648 25688 23962 13255 14137 15429 11648 9205 11654 20166
13695 20166 28354 27298 17364 22812 24152 13080 6754 1543 4777 6031 10421 5594 15814 20058
13681B0058p102N081Q915o165j2543k937J194O771R597j3187j2644o817M662J0474
13667E357J7618o896q860n576r395J0152R31q13K16k349r721p292k038o005K966
13652b1705J4216N92O420m743N046Q390K342j242m973l369Q712n420m005N612
13638E873K049L238P827j1902j9727N729P725p375l022J2003k005j3508k707j0025
13624b5827J376J6938J0092m698n481k405M410J745n987k685K798J549K269k217
13610h123L105Q849J1556j658k762P784P881M352k563m509n009j9984Q17P203
13596F939O20J3495J7394r55m892m473m756K818l211n649j2695j0722l490J0546
13582I69M397R285q330m964R259L593m601n096o432J4307N855J876q601L664m421
$$ plain form
13681 20058 12956 18037 26952 20787 8244 5307 6501 13272 22869 9682 -2962 -9779 -5117 5357
13667 5357 22975 16079 7219 1643 -7752 2400 3331 2518 2734 385 -9336 -16628 -18666 -24671 -21705
13652 -21705 -7489 -6897 -477 -5220 -174 8216 10558 9316 4343 974 9686 4266 261 5873
13638 5873 7922 11160 18987 7085 -12642 -6913 812 -6563 -9585 2418 413 -13095 -15802 -25827
13624 -25827 -24451 -7513 2579 -2119 -7600 -10005 -5595 -3850 -9837 -12522 -9724 -8175 -5906 -8123
13610 -8123 -5018 3831 15387 13729 10967 18751 26632 30984 28421 23912 18903 -1081 -264 6939
13596 6939 7559 21054 38448 37493 32601 28128 23372 26190 22979 17330 4635 -6087 -9577 969
13582 969 5366 14651 6321 1357 10616 14209 9608 4512 -1920 12387 18242 20118 11517 15181 10760
13567A0760r276m280J361L333p654K69R067K347M583qJ874n185m063J6063j201
13552A7990j9787j3919N644J046N343J3741N744n44j4495N084J0529J0385M90
13539B7251j1703M002j28j3365o576Q202k62o531J384J3076j19o600q880o695
13525f944j442J5601O894K740q627o714K727j19K246J4020m585J285j1840m494
13511G48K2494k886j0177o319K154J1401J277P413q065j1993p796k114O035O737
13497H909m263q412P416J2470M158j1576N087R048k718j2903R323J131n009k006
13483A0655j0381q873O322K2793Q849j1976m380p466k0217r27K0485J1258L890
13470B0032j3825Q93K872J75O732M151r098q944J0963M825j4437q007k505K770
$$ plain form
13567 10760 1484 -2796 -1435 1898 -5756 -5487 3580 5927 10510 10502 12376 7191 3128 19191 17990
13552 17990 -1797 -15716 -10072 -9026 -3683 10058 15802 15258 763 5847 16376 26761 27251
13539 27251 15548 19550 19422 6057 -519 7683 7421 890 2274 15350 15231 8631 -249 -6944
13525 -6944 -8386 7215 14109 16849 8222 1508 4235 4116 6362 20382 15797 17082 5242 748
13511 748 23242 20356 10179 3860 6014 17415 18692 26105 18040 6047 -1749 -3863 2172 8909
13497 8909 4646 -3766 3650 16120 20278 8702 13789 22837 20119 7216 16539 17670 12661 10655
13483 10655 274 -8599 -2277 20516 29365 17389 13009 5543 -14674 -15601 4884 16142 20032
13470 20032 6207 7100 9972 10147 16879 21030 11932 2988 13951 18776 4339 -3668 -6173 -3403
13456c403J335j148P511l57K222P870k052j2327j5315J2585N486P64k693N016
13442E494L310M421k093J104n668r573Q2q864J508K463k268m514K862Q391N108
13427A763m180Q685J4446m006K67j0610K744J1975j2743j1232J2961L068k148
13414A0990O168j788m467P293Q222j0306j406N774Q101j0453j3083O000N049J6684
13400C2778m391j3576j3345l426R735L03P653O805m283n599l390q511m647k960
13386f854p476l943j128j296Q221J3259M088J690L978J4001J6936n433j7911j0096
13372H036k289j733O554n62J58N978O466L662K55P542l469K150o211r981j092
13357A5464m004N160j1402j0251N610l858R5J4436m369J0696J9l374J3016R477
$$ plain form
13456 -3403 -2068 -3216 4295 3938 6160 14030 11978 -349 -15664 -3079 2407 3171 478 5494
13442 5494 8804 13225 11132 12236 6568 -3005 -2923 -11787 -10279 -7816 -10084 -14598 -11736 -3345 1763
13427 1763 -2417 6268 20714 16708 16975 6365 9109 21084 8341 -2891 10070 13138 10990
13414 10990 17158 15370 10903 18196 26418 16112 14706 20480 28581 18128 5045 11045 16094 32778
13400 32778 28387 14811 1466 -1960 7775 8078 15731 22536 18253 12654 9264 753 -3894 -6854
13386 -6854 -14330 -18273 -19401 -20697 -12476 783 4871 6561 10539 24540 41476 36043 18132 8036
13372 8036 5747 4014 10568 10006 10164 16142 22608 26270 26525 34067 30598 32748 26537 16556 15464
13357 15464 11460 16620 5218 -5033 577 -3281 -3186 11250 6881 17577 17596 14222 27238 36715
13343C6715p37L167M864k655j3747j2372L639p908j027n716N93N220O58j394k550
13328F750N32M730m414j275l60M012M177R939m540J503R692Q10j1998n093m021
13313A0444L386J269m538k777L731l62K465N471M766R41Q675R28L271K102q772
13298C1000j7945n718N179j6821r613l10P500R537k712l360k864j986K0874N983
13284A8744o186K661P72J171J788J855O162j2537n912M191j140o39j857J5245
13270B4318M715p695R793J832j3312n830j0456N489P492M257k667L278j6662m402
13256A50R665J1093P622Q77m018m257j176K804o045n435Q824l029K321N155j174
13241B3377k721j768l264K680Q619L453k387l178K321q748p17O10n091J4799J2243
$$ plain form
13343 36715 35978 39145 44009 41354 27607 15235 18874 10966 9939 4223 4816 10036 10694 9300 6750
13328 6750 7282 12012 7598 6323 5963 9975 14152 24091 19551 21054 30746 31556 19558 14465 10444
13313 10444 13830 15099 10561 7784 11515 11153 13618 19089 23855 24796 33471 34399 37670 39772 31000
13298 31000 13055 7337 12516 -4305 -13918 -14228 -6728 2809 97 -3263 -6127 -8113 12761 18744
13284 18744 12558 15219 15991 17162 18950 20805 26967 14430 8518 12709 11569 10930 9073 24318
13270 24318 29033 21338 31131 32963 19651 13821 3365 8854 16346 20603 17936 21214 4552 150
13256 150 9815 20908 28530 29407 25389 21132 19956 22760 16715 11280 20104 17075 19396 24551 23377
13241 23377 20656 18888 15624 18304 26923 30376 27989 24811 27132 18384 17667 18277 13186 27985 40228
13226D0228k370o517j3328n729m286k296n293r35O024P183k967Q62R39J90R391
13211B1096j94R275J1916l98k3591j7162P614K3208K757p40q561r270P534J5077
13197C8561K01o875K734p29j0579p445n543n479K546N443k465J597J7668J1223
13183D0858j08J007j0207J6m815j6199K274M105k768K969M813L917J95P490P927
13168D1474k842N970p367m771J376L503J69M794k264J4833j0566j1285O95j7532
13154A6187r667L291O922J3441K179P121k568m341J277j0810p726l915K256k438
13140A1209j2618O802J6087J1638R032o462n850l932m299N409l473Q897J2161
13127D4601j5860j2713o260Q929P897K722n010l778N567L784j2556m38j862N996
$$ plain form
13226 40228 37858 31341 18013 12284 7998 5702 409 -526 5498 12681 9714 10576 11515 11705 21096
13211 21096 20902 30177 42093 41695 18104 942 8556 31764 34521 33781 25220 15950 23484 38561
13197 38561 38762 31887 34621 33892 23313 15868 10325 4846 7392 12835 10370 11967 29635 40858
13183 40858 40750 41757 31550 31566 26751 10552 12826 16931 14163 17132 21945 25862 26057 33547 41474
13168 41474 38632 44602 37235 32464 33840 37343 37512 42306 40042 54875 44309 33024 33719 16187
13154 16187 6520 9811 16733 30174 32353 39474 36906 32565 33842 23032 15306 11391 13647 11209
13140 11209 -1409 5393 21480 33118 42150 35688 29838 25906 21607 27016 23543 32440 44601
13127 44601 28741 16028 9768 18697 26594 29316 24306 20528 26095 29879 17323 16885 15023 21019
13113B1019O380k157Q865Q726n099j1871m882j733K246n14l29K174k288l724J2864
13098B9677q74M815J2241O339n127n151L027m197m904P818Q263j319q147N896
13084D8357K194J749l385k399j2992k576M704m211N326N693n931j1580J003M500
13070C0452p135j2383M283J6369L103l582k721p889P151J1583K427m79l344J4095
13056E1930J1289m108j9986o824J0154O540N95R955j352j2304j968j881k780p643
13042C1617o918J568l562k860L979j817P501J3846Q983Q275J2863o161j6810k08
13028E0296J227o52j2329n550O608N195o928r631R75m383k012m245J3373L355
13014C5299K695j098J2121K3794P833N091J7353K1665J5959J0981J8395L1646
$$ plain form
13113 21019 27399 25242 34107 42833 37734 25863 20981 19248 21494 20980 20651 22825 20537 16813 29677
13098 29677 28803 33618 45859 52198 47071 41920 44947 40750 35846 43664 51927 50608 42461 48357
13084 48357 50551 52300 48915 46516 33524 30948 35652 31441 36767 42460 36529 24949 25952 30452
13070 30452 23317 10934 15217 31586 34689 31107 28386 20497 27648 39231 41658 41179 37835 51930
13056 51930 63219 59111 39125 32301 42455 48995 49590 59545 58193 45889 43921 42040 39260 31617
13042 31617 24699 26267 22705 19845 23824 22007 29508 43354 52337 60612 73475 67314 50504 50296
13028 50296 51523 50871 38542 32992 39600 44795 37867 28236 29211 24828 22816 18571 31944 35299
13014 35299 37994 36896 49017 72811 80644 85735 103088 124753 140712 151693 170088 201734
13002B01734L5861P6352J34864K15363K91813K96981J89220O8800n4664j87732
12992A268592k86655k81443k05514j10449n8508l7898k2650j8066p51j0603j1131
12981B24924j4453j3506j7350j8720j1376j0620m298K589M120k440k1242L614
12969A21242R993p58p203J38L079q589q106l654Q254O6j9729m153m119R199J4021
12954A09681r725m192n269j0626K176O707j4818n292K864J0536J4201N048j5001
12941H6290j0003o340q041j396K588K087p88K742M970J245M579K836R510k510
12927H7769j4638l366J2608L426j3603l041m63J72K779q496k788n856n143K224
12913E1584J251N735o09m743J461q72K543q77r657M770L748J770J0593J2327j887
$$ plain form
13002 201734 237595 313947 448811 664174 955987 1252968 1442188 1510988 1456324 1268592
12992 1268592 981937 700494 494980 384531 326023 288125 265475 247409 246658 236055 224924
12981 224924 210471 196965 179615 160895 149519 138899 134601 137190 141310 138870 117628 121242
12969 121242 131235 130477 123274 123412 126491 117902 109796 106142 114396 114462 94733 90580 86461 95660 109681
12954 109681 99956 95764 90495 79869 82045 88752 73934 68642 71506 82042 96243 101291 86290
12941 86290 76287 69947 61906 60510 63098 65185 64397 67139 72109 73354 77933 80769 90279 87769
12927 87769 73131 69765 82373 85799 72196 69155 68692 68864 71643 63147 60359 54503 49360 51584
12913 51584 52835 58570 57961 53218 54679 53807 56350 55473 45816 50586 54334 56104 66697 79024 77137
12898G7137j5131n288q479n932J63o110N452P704L631L102M908k77o386J082J1453
12883F7029j2669j4790O13J0830L855P61M336r41j2347n375J5096J4960N137o50
12869G5845m458N913n713m513o040p529L794j771o817k709l382Q192O25j198M988
12854E5227L668K527Q16M084P829K287J659j5430j54L254J879N346q640n359P164
12839F6157M305J765Q224J2010Q109R479J283n964q724k320r91P348n546o533
12825H8602m285j0397P425K8777K2856J5867J9466K1101J4597P710K655j9778
12813A94596l3346j6107J085p569m218j0790M370p707p811N448N451O189Q058
12800A37649J441M877n728j1373R466M873O551n588J928j5556k1837j56P159K089
$$ plain form
12898 77137 62006 56718 48239 42307 42470 36360 41812 49516 53147 56249 61157 60880 54494 55576 67029
12883 67029 54360 39570 40183 51013 54868 55629 59965 59024 46677 41302 56398 71358 76495 75845
12869 75845 71387 77300 71587 67074 61034 53505 57299 55528 48711 46002 42620 50812 51437 50239 55227
12854 55227 58895 61422 62238 66322 74151 76438 78097 62667 62513 65767 67646 72992 64352 58993 66157
12839 66157 70462 72227 80451 92461 100570 110049 111332 105368 96644 94324 93333 100681 95135 88602
12825 88602 84317 73920 81345 110122 132978 148845 168311 189412 204009 211719 214374 194596
12813 194596 161250 145143 146228 138659 134441 123651 128021 120314 112503 117951 123402 129591 137649
12800 137649 139090 143967 138239 126866 136332 141205 147756 142168 144096 128540 106703 106547 113706 115795
12786A15795l956L75j2795l859R897j0205N925n752k896k332o303J3783N729p634
12772I5772N922j216j4298P576N445l714m770L578j037n295K539K250R672J1011
12758A13435J3591J629o552J1257K3681K7666K6002L343r582q560n046o721j6887
12745A67256j4631j6831j7996k017q133K975L379j0484O438K2928L73m39l370
12732A29448j2831k4656k7618k0513l085P178K441p125o77n772L070K350J5379
12719E7589K2257K76P099J4905J7606M042J696P442J2799L819J8667N956K109
12706A76262k420k0207k3820r503k417N418Q877k78O586O535K234O130N614J5559
12692A74570J4662m352k0461J0745K7934L4106L9566M1740J9140k5536m2144l8777
$$ plain form
12786 115795 111839 112214 99419 95560 105457 95252 101177 95425 92529 90197 83894 97677 103406 95772
12772 95772 101694 100478 86180 93756 99201 95487 90717 94295 93258 87963 90502 92752 102424 113435
12758 113435 127026 128655 122103 133360 157041 184707 210709 214052 204470 195910 190864 184143 167256
12745 167256 152625 135794 117798 115781 107648 110623 114002 103518 109956 132884 133257 132818 129448
12732 129448 116617 91961 64343 43830 40745 47923 50364 43239 42562 36790 39860 42210 57589
12719 57589 79846 80122 87221 102126 119732 123774 125470 132912 145711 149530 168197 174153 176262
12706 176262 173842 153635 129815 120312 117895 123313 132190 131912 138498 145033 147267 153397 159011 174570
12692 174570 189232 184880 164419 175164 203098 237204 276770 318510 337650 312114 269970 231193
12680B31193j0330j2863p109K3317J9607K4325K2013J8243J9354M359k727J194
12668C30576P32o432K172j0870M448m659J1849K207J2530J5253r087R672N571
12655C63962L583J0344R335K844j0858k0119j9695j1921Q63P9O48Q347J9261Q30
12641C57503j1021O200K866J5913j999M452J0882J9714K0792J7899K2284K5811
12629D91296L154j3788N890K3816J9469K1790J9523K4488J6272R285o397k888
12617F11910l517Q200K0290J6953J6106J4512M2505M7332M3161M6901L4205L4865
12605I33423M5683M2532K6501J1767J0635L309Q364J9848L6728K9845N1773Q1422
12593A301830J04303J02748J10945J13739J05572J12384J33556J69210K37772
$$ plain form
12680 231193 220863 208000 200891 224208 243815 268140 290153 308396 327750 332109 329382 330576
12668 330576 331308 324876 327048 316178 320626 315967 327816 330023 342553 357806 348719 358391 363962
12655 363962 367545 377889 387224 390068 379210 359091 339396 327475 328338 328417 329065 337412 356673 357503
12641 357503 346482 352682 355548 371461 369462 373914 384796 404510 425302 443201 465485 491296
12629 491296 494450 480662 486552 510368 529837 551627 571150 595638 611910 621195 614798 611910
12617 611910 608393 616593 636883 653836 669942 684454 726959 774291 817452 864353 898558 933423
12605 933423 979106 1021638 1048139 1059906 1070541 1073850 1082214 1102062 1138790 1168635 1220408 1301830
12593 1301830 1406133 1508881 1619826 1733565 1839137 1951521 2085077 2254287 2492059
12584B492059L26082M09484M90036N65368O06572O37070P21165Q45516J011267
12575H104619J266626J653361K121995K630209L129147L826064N019232P119499
12567C4870752J0886624J7896723L0253778M7366286N9660890N4059000L2949329
12560B87943382R061478j5828141m2816023o0895247n6953080l6927052k0049119
12553F3536198j0987210o412550l901444k380195j555273j424509j909882k564708
12545C2400427k920336k830230k463982k044337j682690j403438j166618r76861
12537A6911935q68139q08651p74101p52547p21756o44127n79445n09031m63904
12528A0790234m29026m06388l97278l80658l78485l73154l77671l70064l51892
$$ plain form
12584 2492059 2818141 3227625 3717661 4283029 4889601 5526671 6247836 7093352 8104619
12575 8104619 9371245 11024606 13146601 15776810 18905957 22732021 27751253 34870752
12567 34870752 45757376 63654099 93907877 141274163 200935053 254994053 287943382
12560 287943382 297004860 281176719 238360696 177465449 120512369 83585317 63536198
12553 63536198 52548988 46136438 42234994 39854799 38299526 36875017 34965135 32400427
12545 32400427 29480091 26649861 24185879 22141542 20458852 19055414 17888796 16911935
12537 16911935 16043796 15235145 14461044 13708497 12986741 12342614 11763169 11254138 10790234
12528 10790234 10361208 9954820 9557542 9176884 8798399 8425245 8047574 7677510 7325618
12519G325618l43621l13146k80397k31203j97805j83844j89696j83220j80457
12510E222229j73005j83431j80897j60866j54018j55324j58334j29009j25179
12501C802166j30291j27241r6472r0995p2249p2825p1441q8166r2720r1949q2535
12490B785282o9732p3028p7864n5748m9619o4992o8366o7193o4076o5421n7447
12479B071796m7049l5592l1344j9715j779j6357l5466o3276n9336p1239j03052
12468A587591r1727p5022o7626o6746n6577l7360o434J7889M6895J11993K01879
12457A564755L27897M16370M29383L05282R1780j30998l48860m94303n04119l79628
12447A277559k29813j41316j10429n9511l2515j9672p959M609K5211L6199J4689
$$ plain form
12519 7325618 6981997 6668851 6388454 6157251 5959446 5775602 5585906 5402686 5222229
12510 5222229 5049224 4865793 4684896 4524030 4370012 4214688 4056354 3927345 3802166
12501 3802166 3671875 3544634 3448162 3357167 3284918 3212093 3140652 3052486 2959766 2867817 2785282
12490 2785282 2715550 2642522 2564658 2508910 2459291 2394299 2325933 2258740 2194664 2129243 2071796
12479 2071796 2024747 1989155 1957811 1938096 1936317 1919960 1884494 1821218 1761882 1690643 1587591
12468 1587591 1495864 1420842 1353216 1286470 1229893 1192533 1186099 1203988 1250883 1362876 1564755
12457 1564755 1892652 2309022 2738405 3043687 3135467 3004469 2655609 2161306 1657187 1277559
12447 1277559 1047746 906430 796001 736490 703975 684303 676344 680953 706164 742363 757052
12436G57052l981n2019j01076j01397p7493l7201k895R058J754j3031j3947k1047
12424C43777j6963q1K3685J6365M467j7037k3489l3419k2605J669n111o191n683
12411B59384k438K779J7092Q422j743j572R010Q362J0948M149M68m493R754J1628
12397C31750J888L788j4021j2746j7922m466P381j1075j4189L574P303j1646r722
12384B59897M78M385J9794O392O0k0530j7749j3355l0689m5508n0846j7472m118
12371I0739J2801K721j772J916O093J0718O487N868J0379R54q449J0507J6362
12358A65324K568p030j6642M570j675N780J184O368K57j0459N47q748P767O731
12344A56542K010o049j528P115k141j5019p277R235j81j3092m914j0272m076L716
$$ plain form
12436 757052 753071 701052 599976 498579 421086 383885 380990 390048 391802 378771 364824 343777
12424 343777 326814 326733 350418 366783 371250 354213 330724 297305 274700 276369 271258 265067 259384
12411 259384 256946 259725 276817 285239 283496 281924 290934 299296 310244 314393 314861 310368 320122 331750
12397 331750 333638 337426 323405 310659 292737 288271 295652 284577 270388 273962 281265 269619 259897
12384 259897 260375 264760 284554 290946 291006 270476 252727 239372 208683 163175 112329 94857 90739
12371 90739 103540 106261 104489 106405 112498 123216 129703 135571 145950 146904 138455 148962 165324
12358 165324 167892 160862 144220 148790 147115 152895 154079 160447 160704 150245 150792 142044 149811 156542
12344 156542 158552 152503 150975 158090 155949 140930 133653 142888 142707 129615 124701 114429 110353 114069
12330A14069m69r725j5455M269L337j2339o920J1491j2325j0794m992o617k217
12317E1313L434J5059P936o060O466m20q139o960j1152j5360k257K533L301j3527
12303B6167j2808p560j491J3555J5317k90Q3M754j3699O292P590n434j7678k1304
12289f506r805M458J0206O459K095R312J0889N613n71q973J872N565Q614m043
12275C5185r811j8478j7145R053J2293P167r287j0634O319J3185J6770J6972K215
12262E3804j6037j0823N631o479n960k088Q62K878N712O177q605n782j009P142
12248B5423p415j0241o787K930j890N431P117P31J317k927r681R15J0967O064
12234B1954L766J1569o558M411j2378k513M8N469L509R042P479l66j3498r675
$$ plain form
12330 114069 113600 103875 88420 92689 96026 83687 76767 88258 75933 65139 60147 53530 51313
12317 51313 54747 69806 77742 71682 78148 77728 69589 62629 51477 36117 33860 36393 39694 26167
12303 26167 13359 5799 4308 17863 33180 32890 32973 37727 24028 30320 37910 32476 14798 -6506
12289 -6506 -16311 -11853 -1647 4812 6907 16219 27108 32721 32150 23177 25049 30614 39228 35185
12275 35185 25374 6896 -10249 -1196 11097 18264 8977 -1657 4662 17847 34617 51589 53804
12262 53804 37767 26944 32575 26096 20136 18048 18910 21788 27500 33677 25072 19290 18281 25423
12248 25423 18008 7767 980 3910 2020 7451 14568 15299 16616 13689 4008 4923 15890 21954
12234 21954 25720 37289 30731 35142 22764 20251 20299 25768 29277 38319 45798 45432 31934 22259
12220B2259K860j0134L933K241p643n773p544K754J1051M034n241m149m655j1463
12206g470K935J4434N994Q039K443L891k2852j4799K019P470P03m11J025l277
12192A44k057J28J0140k437o876m366M667m945j197O168M839O240Q093o46r640
12177H255n360J3472Q788n819o590N992K61M209J7404p818j6660q413j91n134
12163B396K25n423p247m026M711R363J5085o390m455m047N594J5011J1567J106
12149C3470j1414l218J0106q251m884m686M50P777J2280j116j1710j2128Q781
12136A5457L041O218J9364K484J7165K4800R446J0639K3853L3229N0338P0998
12124B87032J19011J94223K69454K91367K39427J09096k2142j56099k63717k99296
$$ plain form
12220 22259 25119 14985 18918 21159 13516 7743 199 2953 14004 18038 12797 8648 3993 -7470
12206 -7470 -4535 9899 15893 23932 26375 30266 7414 -7385 -5366 2104 2807 2396 3421 144
12192 144 -1913 -1785 8355 5918 -958 -5324 -657 -5602 -6799 -631 4208 10448 18541 17895 8255
12177 8255 2895 16367 25155 19336 12746 18738 18999 23208 40612 32794 16134 7721 7530 2396
12163 2396 2621 -2802 -10049 -14075 -9364 -1 15084 8694 4239 192 5786 20797 32364 33470
12149 33470 22056 18838 28944 20693 15809 11123 11573 19350 31630 30514 18804 6676 15457
12136 15457 18498 24716 44080 46564 63729 88529 97975 108614 132467 165696 216034 287032
12124 287032 406043 600266 869720 1161087 1400514 1509610 1487468 1331369 1067652 768356
12114G68356k38878j46924p6641m4369k8599q818p980j1808j841R050m994k3679
12102A82875k5908k5049n864r602m942j9665j2584K238J38L005Q647j7578p849
12089F7862o148n139k951P285N721R321P6r005j0015k510j7646r734j3860o95
12075A2562J4825J2330R63q952J377J772L531O381K939q196p126M274L296r457
12061C0519j952n805j6346r653N437N737l261L799j410R920J1949q021q281n223
12047G409R986l492J576o243L8n477M82L686p012K409J5979j080Q390q696j0258
12032G697n151p022k007j317l94M65Q88R45q135k159l484M232l02o276M339k947
12016b0628p993Q944J6677J1240K222p925j0027j1457R534J8434O720j4509m373
$$ plain form
12114 768356 529478 382554 305913 261544 232945 224127 216147 204339 202498 211548 206554 182875
12102 182875 156967 131918 126054 116452 111510 91845 79261 81499 81637 84642 93289 75711 67862
12089 67862 61714 56575 53624 60909 66630 75951 76027 67022 57007 54497 36851 27117 13257 12562
12075 12562 27387 39717 40680 31728 33105 34877 38408 44789 47728 39532 32406 36680 39976 30519
12061 30519 28567 22762 6416 -3237 2200 7937 4676 8475 7065 16985 28934 20913 12632 7409
12047 7409 17395 13903 15479 9236 9274 3797 4279 7965 953 3362 19341 18261 26651 17955 7697
12032 7697 2546 -4476 -6483 -7800 -8194 -7729 -6841 -5896 -14031 -16190 -19674 -15442 -15744 -22020 -17681 -20628
12016 -20628 -28621 -19677 -3000 8240 10462 2537 -7490 -18947 -9413 9021 15741 1232 -3141
12003c141J724L642j1680o86K5772J0394r964j4687m827k195L736N540N951K00
11989I779j0973j7677M658R253P93P79J450J0731l328j3923p963O012N361j906
11975f954L770R409M329M444l575R381J301o803n621m948J837N638L009J3857
11961B9074j866j2274j3773r584q003R702J1165j1671j4560M086J0304k957L981
11948f376m980O161N101K84m049R065O96r504L894P657q218m723K451K305K208
11933A972L251J53l309j3175P728P039Q862P099J738Q27r439j0671r084N27P948
11918A466O938M889O688J2319L221j1921j1125j3603j4302L024M056J181J3078
11905E909O303m383j4181o2K236k721N742L569j0365K0112P792o379m569r21o996
$$ plain form
12003 -3141 -1417 2225 -9455 -10141 15631 26025 16061 1374 -3453 -5648 -1912 3628 9579 9779
11989 9779 -1194 -18871 -14213 -4960 -4167 -3388 -1938 8793 5465 -8458 -16421 -10409 -5048 -6954
11975 -6954 -3184 6225 10554 14998 11423 20804 22105 15302 9681 4733 6570 12208 15217 29074
11961 29074 27208 14934 1161 -8423 -16426 -6724 4441 -7230 -21790 -17704 -7400 -10357 -6376
11948 -6376 -11356 -5195 -94 190 -3859 5206 5902 -3602 292 7949 -269 -4992 -2541 -236 1972
11933 1972 5223 5376 2067 -11108 -3380 3659 12521 19620 21358 22185 12746 2075 -7009 -6482 1466
11918 1466 8404 13293 19981 32300 35521 23600 12475 -1128 -15430 -12406 -8350 -7169 5909
11905 5909 12212 7829 -6352 -6414 -4178 -6899 -1157 2412 -7953 12159 19951 13572 9003 8082 1086
11890A086o52j715l065p346Q521M774J2097K484m363j5513L693J4685Q92r557
11876F021k477l295j4182j992Q245o405Q145J1379Q947N668k911j2595n993m558
11862f003J2835J5302o974j0559q898j486l09O036J703M578L91j108J174o532
11848A50M02J901J341O38j881l596r627J6978L64p713n320M759j3576J79l942
11833a8943J4737J1628O67p190o088K934J228L587O375K543J1321J1055j1761
11820B2093r948m17k012k598R699n39K132N916J143P016j1683j7318o434L775
11806H25P213K957Q89m531m113J1832O325q78j0944j2040j2628P044L661P6o383
11791a0695n058n805M145J632Q108J7075L754N587N985n516J505O920j1315L729
$$ plain form
11890 1086 434 -1281 -4346 -11692 -3171 1603 13700 16184 11821 -3692 1 14686 15578 6021
11876 6021 3544 249 -13933 -15925 -7680 -14085 -5940 5439 14386 20054 17143 4548 -1445 -6003
11862 -6003 6832 22134 15160 4601 -4297 -5783 -6092 -56 1647 6225 6616 5508 6682 150
11848 150 552 2453 3794 4432 2551 -1045 -10672 6306 6670 -1043 -6363 -1604 -15180 -15001 -18943
11833 -18943 -4206 7422 8089 899 -5189 -2255 -1027 2560 8935 11478 22799 33854 22093
11820 22093 12145 11728 9716 7118 16817 16278 18410 24326 25469 32485 20802 3484 -2950 825
11806 825 8038 10995 11884 7353 3240 15072 21397 20519 9575 -2465 -15093 -8049 -4388 -4312 -10695
11791 -10695 -15753 -21558 -17413 -15781 -7673 9402 13156 18743 24728 19212 20717 27637 16322 20051
11777B0051m371q653l067J3301L413K629k941j2629r311j041K965m717Q224n73
11763C280j7627j1272k374P337Q379N763J2481m848j21M936J2119n83j4437n155
11749b122N57n096k821R588J5978P532k345j0571n728k321j1154j471K798N016
11735b160o070m822m575R674N695k952m29J1149J028j3704n234m661P037J703
11721h321m147O004J1331L119j762K813q325q969P56k657o888j4854k16O395J0841
11706a4880Q843L618O600j595O007L00j3220J340J1041J327J722p299J090L409
11692H303K957l273j1031J1983K652q986m55M526P552R056M083J536j2033o481
11678A0389J560k618p229q718j076J571M334j0783j1640K031J1517J569J1883
$$ plain form
11777 20051 15680 7027 3960 17261 20674 23303 20362 7733 -1578 -2619 346 -4371 3853 3280
11763 3280 -14347 -25619 -27993 -20656 -12277 -6514 5967 1119 998 5934 18053 17470 3033 -2122
11749 -2122 -1565 -6661 -9482 106 16084 23616 21271 10700 4972 2651 -8503 -9974 -7176 -2160
11735 -2160 -8230 -13052 -17627 -7953 -2258 -5210 -5639 5510 6538 -7166 -12400 -17061 -10024 -8321
11721 -8321 -12468 -6464 4867 7986 6224 9037 712 -8257 -7501 -10158 -17046 -31900 -32116 -25721 -14880
11706 -14880 -6037 -2419 4181 2586 8593 8893 -4327 -2987 8054 9381 11103 3804 4894 8303
11692 8303 11260 7987 -3044 8939 11591 2605 2150 6676 14228 23284 27367 28903 16870 10389
11678 10389 11949 9331 2102 -6616 -7692 -6121 -1787 -12570 -24210 -22179 -10662 -9093 2790
11665B790J5619q920l152O847N23j800K564J454k971L305L155N987R999L609j2286
11650B6723r538j8891p162k398m57p203m097K224N962m476L931L045M376R064
11636A103R988K058n313q550q18J1165o854M175L050n185r24l965O797j8920r48
11621a3141j390L727O668L641k283p992m621J8755J7525Q02J429j2845j1020o60
11607a405N63n066Q569J1854p622m941P418j904l921M012q169K1802J7948k399
11593C6739k899M485K4811L0852Q193m21o372k9842k7534k0644j9076r434P10
11580a0432j164M149R334M530r65j4405J627L192j433j1836R842M124K128K488
11566A179j729j8623Q05J4378n343L851M875n881j737M969o816O794J2436K661
$$ plain form
11665 2790 18409 9489 6337 13184 13707 11907 14471 15925 12954 16259 19414 25401 35400 39009 26723
11650 26723 17185 -1706 -8868 -11266 -11723 -18926 -23023 -20799 -14837 -19313 -15382 -12337 -7961 1103
11636 1103 11091 13149 7836 -714 -1532 9633 2779 6954 10004 4819 3895 -70 6727 -12193 -13141
11621 -13141 -14531 -10804 -4136 -495 -2778 -10770 -15391 3364 20889 21691 23120 10275 -745 -1405
11607 -1405 -842 -5908 2661 14515 6893 1952 9370 7466 3545 7557 -612 21190 39138 36739
11593 36739 33840 38325 63136 93988 102181 101760 95388 65546 38012 17368 -1708 -11142 -10432
11580 -10432 -11596 -7447 1887 6417 5452 -8953 -7326 -4134 -5567 -17403 -7561 -3437 -1309 1179
11566 1179 -550 -19173 -18368 -3990 -9333 -5482 -607 -6488 -8225 -3256 -10072 -3278 9158 11819
11552A1819q658o074K51l951J840o52O80l234r192k93K07p502l721n74N962n289
11536b8381K135J8922J0304N038Q975j3142j1074K670m230l818o5P201J531o861
11522a0795k620l364Q503R964j3086M643J3251N871p747k158l177K276o47K905
11508C819M707j664j703m768J95L570K641r203K692J0739p907r003r352o637M260
11493a7614R37P690O412r41J1697J2539L307l116l350L457M604r142m764q703
11479C013n794M922M863L558m80r088j0553n9K090j108N660q385l180L392n941
11464a7090K583Q504k245j720L596n776M399J114K389Q607Q102J447p022n902
11450I86j754l487M056j93N787J212q036l74J1761Q742L704j1055j712l217k084
$$ plain form
11552 11819 3161 -2913 -2662 -6613 -4773 -5425 -4745 -7979 -17171 -17464 -17257 -24759 -28480 -29054 -23092 -28381
11536 -28381 -26246 -7324 2980 8018 16993 3851 -7223 -4553 -8783 -12601 -12666 -5465 -3934 -10795
11522 -10795 -13415 -16779 -8276 1688 -11398 -6755 6496 12367 4620 2462 -715 1561 914 3819
11508 3819 8526 6862 5159 391 586 4156 6797 -2406 286 11025 3118 -5885 -15237 -21874 -17614
11493 -17614 -16677 -8987 -2575 -3516 8181 20720 24027 20911 17561 21018 25622 16480 11716 3013
11479 3013 -2781 2141 7004 10562 10082 994 -9559 -9618 -7528 -8636 -2976 -11361 -14541 -11149 -17090
11464 -17090 -14507 -6003 -8248 -9968 -6372 -12148 -7749 -6635 -4246 4361 12463 13910 6888 986
11450 986 -768 -4255 -199 -392 5395 6607 -1429 -1803 9958 18700 22404 11349 9637 6420 4336
11435D336o131l496L395L553M905m495j4321o114J3172M747m882m735m300n40
11421a4906M678K301j1870m874Q710J312k460R973M682J249M117j548l683K727
11407D08l676q603k194O524J6840Q5L228k807m186q685j4627j1029o158J5080
11393a9800L920o465P62R730K3617j1164j2785m795J9883J6054j9009l099J1119
11380G968O939j2547j1746r12p390j707M57Q613p751j0246J0340J811n581o569
11366b8321n930N038J2863J312l27Q182n440k04N425J594j450Q604Q359m444j3787
11351h526r55n791R59K082l045O392n862K434n029q915K90J1078M737J153j920
11336a0918j994O751J3543j3732l693L489j5701p687J9250j337J0425J3494O236
$$ plain form
11435 4336 -1795 -5291 -1896 1657 6562 2067 -12254 -18368 -5196 -449 -5331 -10066 -14366 -14906
11421 -14906 -10228 -7927 -19797 -24671 -15961 -14649 -17109 -7136 -2454 -1205 2912 1364 -2319 408
11407 408 -3268 -11871 -14065 -7541 9299 9384 12612 9805 5619 -3066 -17693 -28722 -34880 -19800
11393 -19800 -15880 -22345 -21583 -11853 11764 600 -12185 -16980 2903 18957 -52 -3151 7968
11380 7968 14907 2360 -9386 -10298 -17688 -19395 -18938 -10325 -18076 -28322 -17982 -16171 -21752 -28321
11366 -28321 -34251 -29213 -16350 -15038 -15365 -7183 -12623 -12827 -7402 -5808 -7258 1346 9705 5261 -8526
11351 -8526 -9481 -15272 -14313 -12231 -15276 -8884 -14746 -12312 -17341 -26256 -25966 -14888 -10151 -8998 -10918
11336 -10918 -12912 -6161 7382 -6350 -10043 -6554 -22255 -29942 -10692 -12029 -1604 11890 18126
11323A8126p041j5774j2153l19M247Q214l826M764Q894N909L821n307R90k011
11309H534P102j171q321M886Q156p420n394j2632r571j19O181P371P799m432J0225
11294A1194N827p240l037p100q364J3660P415n196k157J008o058j789n432R164
11280A895P560Q16r239k450m9j001n005O781o281j0932J3974P604q340p05P230
11265A858m23j2315q746K496J2131J435j2557o543j1529R089J5455J1466J2070
11252A3887o375j0929k413p153M716R009l087J0836o040l559O202J1368L408m270
11238A5600n312q206j1286m754l517J804P099J113Q232L347j393o894j4240o383
11224b4790P246M398K02J3767J6112J3454q722j3706J3046Q416n955j2245n944
$$ plain form
11323 18126 11085 -4689 -16842 -17161 -12914 -4700 -8526 -3762 5132 11041 14862 9555 10545 8534
11309 8534 15636 14465 6144 11030 19186 11766 6372 -6260 -15831 -15950 -9769 -2398 5401 969 11194
11294 11194 17021 9781 6744 -356 -8720 4940 12355 7159 5002 6010 -48 -1837 -7269 1895
11280 1895 9455 10271 1032 -1418 -1467 -2468 -7473 -692 -6973 -17905 -3931 3673 -4667 -5372 1858
11265 1858 1435 -10880 -19626 -17130 -4999 -3564 -16121 -22664 -34193 -25104 -9649 1817 13887
11252 13887 7512 -3417 -5830 -12983 -8267 742 -2345 8491 2451 -1108 5094 16462 19870 15600
11238 15600 10288 2082 -9204 -13958 -17475 -15671 -8572 -7459 773 4120 2727 -4167 -18407 -24790
11224 -24790 -17544 -13146 -12944 823 16935 30389 21667 7961 21007 29423 23468 11223 5279
11211E279J600L019R697m935L77r556k10J7957J0601j0922n741p200p318m393
11197a745n388J6909J0494R086O977J8440N866O818J2902J3942J776n48O57m319
11183I1867j5318j6634j3285r538N73M527N407K820l092q239j3975j423L027J1103
11169C7820L346O228Q841L241j1670o057r200k201R453q320r222M955q534j2879
11155E801L663J5872O111M190O848p039l058o426j0203j976j1210O408Q557l656
11141A3882j7270J3556L226j1071K081j2393j5408J435N097J4722J1028J1685
11129B0570j1292k767k93M752R52r088n840O998j1462K478J9480j382m411j220
11115G475R15J734L608N273l412q867M253M530K056p65p570K64j0902M025N01
$$ plain form
11211 5279 6879 9898 19595 14660 15037 5481 5271 23228 33829 22907 17166 9966 2648 -1745
11197 -1745 -7133 9776 20270 29356 36333 54773 60639 67457 80359 94301 96077 95529 96186 91867
11183 91867 76549 59915 46630 37092 37665 42192 47599 50419 47327 39088 25113 23690 26717 37820
11169 37820 41166 47394 56235 59476 47806 41749 32549 30348 39801 31481 22259 27214 18680 5801
11155 5801 9464 25336 31447 35637 42485 35446 32388 25962 15759 13783 2573 8981 17538 13882
11141 13882 -3388 10168 13394 2323 4404 -7989 -23397 -21962 -16865 -2143 8885 20570
11129 20570 9278 6511 6218 10970 11922 2834 -3006 3992 -7470 -4992 14488 13106 8695 7475
11115 7475 8390 10124 13732 19005 15593 6726 10979 15509 17565 16800 9230 9494 -1408 2617 3118
11100C118m096K432o209J0125J4405j543j8530M010j2632l370L031J0124n54m426
11086d115Q301J7638N80p560j0783J2767K831j2502O15j0555k425Q789j261L631
11072E951J484j0446j0191L935J2605J910l650k163R513o622l931N642r84p083
11058d030N292J1534P586N4j2999n867O69q213J404Q762m551p887r182J361M470
11043a1597n705k473N724J8337L863j296K369o150J481M803J851J741J446P928
11029B2322j2245n800L77q622k034R4o880j6104J1781J7231N950m908k979k141
11015c958o437m913M177N666M425q902l113R225K429J69M032J0214J238r313j0364
11000e425m252o040j556P73O927L985j045j2931p512J1463N576N62n28L075Q063
$$ plain form
11100 3118 -978 1454 -4755 5370 19775 18232 -298 3712 -8920 -12290 -9259 865 311 -4115
11086 -4115 4186 21824 22404 14844 4061 16828 19659 7157 7772 -2783 -5208 3581 2320 5951
11072 5951 7435 -3011 -13202 -9267 3338 5248 1598 -565 8948 2326 -1605 4037 3053 -4030
11058 -4030 1262 12796 20382 20436 7437 1570 2239 -5974 -4570 4192 -359 -8246 -17428 -16067 -11597
11043 -11597 -17302 -19775 -14051 4286 8149 6853 9222 3072 4553 9356 11207 12948 14394 22322
11029 22322 10077 4277 4654 -3968 -6002 -5908 -12788 -28892 -17111 120 6070 1162 -1817 -3958
11015 -3958 -10395 -15308 -11131 -5465 -1040 -9942 -13055 -3830 -1401 -1232 2800 13014 14252 4939 -5425
11000 -5425 -9677 -15717 -17273 -16500 -9573 -5588 -6633 -19564 -27076 -15613 -10037 -9475 -10003 -6928 1135
10985A135R047M577k642N499r366j3788j348j344m949m06N437n168J223L424O935
10970a734l948j3661p132o696M778K82n917J5400K1278j68k773K11r519o265N494
10955a0370LK553P345Q252k740p66p76J561N359J628o840J7m505k26o475M29p07
10938f258K847r760N405J3569K161K462M118Q485p231j0709j2807j1557P161J5142
10924C028J3817j802j5835o886j1793M900n564o222N534j939L201N415M121l099
10910a3124l403J0871N302k187r870J0171J4630M9j0774j3478j3708K190P292
10897a6039L066l737j0720M643N667J953J519m466N86N821o650j1096R756j487
10883b1184m120q035k63R059L297J0166K0956J5528k750j2744j2442j230p496
$$ plain form
10985 1135 10182 14759 12117 17616 8250 -5538 -6886 -8230 -13179 -13585 -8148 -13316 -12093 -8669 -1734
10970 -1734 -5682 -19343 -26475 -33171 -28393 -28111 -34028 -18628 2650 2482 -291 -80 -9599 -15864 -10370
10955 -10370 -10367 -7814 -469 7783 5043 4277 3501 5062 10421 12049 5209 5226 721 495 -5980 -5551 -6258
10938 -6258 -3411 -13171 -7766 5803 7964 10426 14544 23029 15798 5089 -7718 -19275 -12114 3028
10924 3028 16845 15043 -792 -7678 -19471 -14571 -20135 -26357 -20823 -22762 -19561 -14146 -10025 -13124
10910 -13124 -16527 -5656 -354 -2541 -12411 -2240 12390 12439 1665 -11813 -25521 -23331 -16039
10897 -16039 -12973 -16710 -27430 -22787 -17120 -15167 -13648 -18114 -17528 -11707 -18357 -29453 -19697 -21184
10883 -21184 -25304 -33339 -33602 -24543 -21246 -11080 9876 25404 22654 9910 -2532 -3762 -11258
10870a1258o621K772M413o459J636Q545l509L054P533m67O190P533k057K24L43
10855A1872j2265j0240J668L211Q521Q665Q234m627j3529l165m00K357p584M702
10841b580p704l805J4329O662k1808j6643q964K0517J9545l574l764Q02L052Q731
10827D796L773n82J0540J0246r988n442q212n266r499k086L34k999J4060J3844
10813A3519m322k217k337j415J878N00m318p808l002P910Q048m5o872j673P385
10798E231j309k484K708J340p273p671L836Q744P911j6585j0049P530R204l610
10784b477m469N734Q772n252q138O637j2667n397J1P19J2169J151o949o844P164
10769i836P848p436n90l316Q221j0985K5O588N235q936m917J0987P135j0736k666
$$ plain form
10870 -11258 -17879 -15107 -10694 -17153 -15517 -6972 -10481 -7427 106 -361 5829 13362 11305 11529 11872
10855 11872 -393 -10633 -8965 -5754 2767 11432 19666 15039 1510 -1655 -2055 302 -7282 -2580
10841 -2580 -10284 -14089 240 6902 -14906 -31549 -40513 -19996 -451 -4025 -7789 -6987 -3935 4796
10827 4796 8569 7987 18527 28773 18785 13343 5131 -135 -9634 -11720 -11386 -14385 -325 13519
10813 13519 9197 6980 4643 3228 5106 5606 1288 -6520 -9522 -1612 6436 6391 -481 -2154 5231
10798 5231 3922 1438 4146 5486 -1787 -9458 -5622 3122 11033 -5552 -15601 -8071 1133 -2477
10784 -2477 -6946 -1212 7560 2308 -5830 807 -11860 -17257 -17246 -16527 -4358 -3207 -10156 -17000 -9836
10769 -9836 -1988 -9424 -10014 -13330 -5109 -16094 -16069 -9481 -4246 -13182 -18099 -7112 23 -10713 -13379
10754a3379N452N603P387m605r842j3250J1272N520J126O795L546l337J964J0163
10740A4415N499p991j2162l937K419N983l10l1490l268N479J2736l516J0581N852
10726B90L733o120O034M268l066M094K841K850j4661j032j0435j1657j1685R547
10712b4999K603j36Q316R62m366j1737n567J1210L541R580J4243N414j1830L129
10698C63L875j750P372j1062j683J120o630P514l308m101Q656R43N072j4847K645
10683e821J0026P162j1044o919r75j1860j427L23r982J6771P812j193p811K709
10669a2229P517J1953K924p585m198q030Q869j916M805M268n614j109J186Q095
10655H936N335L210l942P119O627q837j1876q525j348n070l722K617K989J1972
$$ plain form
10754 -13379 -7927 -2324 5063 458 -9384 -22634 -11362 -5842 -4716 2079 5625 2288 4252 14415
10740 14415 19914 11923 -239 -4176 -1757 4226 3916 -27574 -30842 -25363 -12627 -16143 -5562 290
10726 290 4023 -2097 3937 8205 5139 9233 12074 14924 263 -769 -11204 -22861 -34546 -24999
10712 -24999 -22396 -22532 -14216 -13254 -17620 -29357 -34924 -23714 -20173 -10593 3650 9064 -2766 363
10698 363 4238 2488 9860 -1202 -2885 -1765 -8395 -881 -4189 -8290 366 1309 6381 -8466 -5821
10683 -5821 4205 11367 323 -6596 -7571 -19431 -20858 -20535 -30517 -13746 -5934 -7127 -14938 -12229
10669 -12229 -4712 7241 10165 2580 -1618 -9648 -779 -2695 2110 6378 764 -345 841 8936
10655 8936 14271 17481 13539 20658 27285 18448 6572 -1953 -3301 -8371 -12093 -9476 -6487 5485
10641E485K195l750m372J923r828O996M867p821K747Q880J361n962n02o640o173
10626a0594n06Q053k22k144o193m52o416N971P441L152L41K459j483N864Q184
10611A3455k022p701j8100K086L623M162k113Q06k93j370J6379J100Q262O155
10597B4429r087j3905j399k557o1m482N86l755K459K946J4051Q896N041J809q026
10582A6945o294o797K0094M788n277j1491q483N12O888O58j5994r336K6280R497
10568B1990m332K87R825j6587j1660N598j742j5333l749K853P773M434K929K504
10554D790m88N632P018M562l097n223j2468q708J5112L828j1900j4650P131J9438
10540A0977J0092m247o575m499N267M492j1790n422o765m021J1006J7177k635
$$ plain form
10641 5485 7680 3930 -442 1481 -8347 -1351 3516 -4305 -1558 7322 8683 2721 2219 -4421 -10594
10626 -10594 -11100 -3047 -3269 -5413 -11606 -12058 -18474 -12503 -5062 -1910 -1569 890 -593 5271 13455
10611 13455 11433 3732 -14368 -12282 -8659 -4497 -6610 -5804 -6097 -7467 8912 10012 18274 24429
10597 24429 15342 1437 38 -2519 -2580 -7062 -6476 -10231 -7772 -4826 9225 18121 23162 24971 16945
10582 16945 10651 3854 23948 28736 23459 11968 3485 3997 10885 11543 -4451 -13787 12493 21990
10568 21990 17658 17945 27770 11183 -477 5121 3379 -11954 -15703 -12850 -5077 -643 2286 4790
10554 4790 4302 9934 16952 21514 18417 13194 726 -7982 7130 10958 -942 -15592 -8461 10977
10540 10977 21069 16822 10247 5748 11015 15507 3717 -1705 -8470 -12491 -1485 15692 13057
10527A3057o83L560K309M459n083o129j6581j936M04N583j756Q966M647K915j186
10512A2546j0387R53n067q043n978O254O092L23j689m675q314r0J3002M31O741
10497B099j194Q243L603j111m981q274l119n670N071l459M052M531j741Q156J471
10482G677p629L753P85N79R958j0310j5452M88L709l2j9342O505J9084J3651Q368
10467B1792J861M652q293J948n213K873N00l545M460P33l690m861q455L915j2628
10452c951K548l60m102K119j853J1658P111r86n259l840l224m810K349Q256m241
10437A415n37R81J6527j2542j4559M623R46N162r834K267O515j3197o906m470
10423b3609J6073J5199K054M292n267j153P152j563j3205n63r38o219o680m205
$$ plain form
10527 13057 12374 15934 18243 22702 17619 11490 -5091 -7027 -6623 -1040 -2796 6170 10817 13732 12546
10512 12546 2159 3112 -1955 -9998 -15976 -9722 -3630 -3307 -4996 -9671 -17985 -18075 -5073 -4642 2099
10497 2099 905 9148 12751 11640 6659 -1615 -4734 -10404 -5333 -8792 -4740 -209 -1950 6206 7677
10482 7677 48 3801 4586 5165 15123 4813 -10639 -10151 -6442 -6474 -25816 -19311 -227 13424 21792
10467 21792 23653 28305 20012 21960 16747 19620 20120 16575 21035 21768 18078 13217 4762 8677 -3951
10452 -3951 -1403 -1763 -5865 -3746 -5599 6059 13170 12184 6925 3085 -139 -4949 -2600 5656 1415
10437 1415 878 1859 18386 5844 -8715 -4092 -3146 2016 -7818 -5551 964 -12233 -19139 -23609
10423 -23609 -7536 7663 9717 14009 8742 7589 14741 13178 -27 -590 -1528 -7747 -14427 -18632
10409a8632p56R170J8271l252j2156o733K709J1247L218P151p932j0617o91Q280
10395g23Q563Q191K261j3505r485r578j0503O607Q194Q698K083O892L348O40K213
10380A3896k957L261J896J511J683j6597j328L403K684j0494j1214p449R606J0430
10366a669l628j2827L737J7053J620M845l46J2826k652j5566j4698P281l119o653
10352a3796R645M416m481M883l883K752J834m525L667o090m314J0337J0726n012
10338F159q369O002J6098j0697j7369J8109J144j0364k457R938J2165n261l367
10325A1731j1395J50k657p288j295O036R457J4328N83n700j3655L881J8814J660
10311B4650l673k735j5513o906p415L713Q468N145J870m64N723J5596p311p234
$$ plain form
10409 -18632 -19388 -10218 8053 4801 -7355 -14088 -11379 -132 3086 10237 2305 -8312 -9003 -723
10395 -723 7840 16031 18292 4787 -4698 -14276 -24779 -18172 -9978 -1280 803 7695 11043 11683 13896
10380 13896 10939 14200 16096 17607 19290 2693 1365 4768 7452 -3042 -14256 -21705 -12099 -1669
10366 -1669 -5297 -18124 -14387 2666 4286 9131 8785 21611 18959 3393 -11305 -4024 -7143 -13796
10352 -13796 -4151 265 -4216 667 -3216 -464 1370 -3155 512 -5578 -9892 445 11171 6159
10338 6159 -2210 3792 19890 9193 -8176 9933 11077 713 -1744 8194 20359 15098 11731
10325 11731 336 486 -2171 -9459 -10754 -4718 4739 19067 19650 13950 295 4176 22990 24650
10311 24650 20977 18242 2729 -4177 -11592 -7879 589 5734 7604 7140 12863 28459 21148 13914
10297A3914o600m858L969j3019J836J1618l61l697J2762J2243R716j138r17N597
10283D1065q89k821k956N287J1188l234N216O747J0990J3014J5258K2247J4351
10270A35463j640P210J4636L4927N1459P9476J16183J91180K38099K69670K36084
10259A372747J54728Q3774j486n2800n953N6644M2272j2380j07252k00825k65554
10248A063915k60486j97075j19688q0545n3263l6347j9522j0926k1287j3130j7658
10237B33988o538k1680j7596k772j8740p843J055m879j1588j6192j3380o364K260
10224A09731j2797k2440M614j2215k691l961l872l010L912O072r099R177j747
10211F1674l812j7740n887M530J3390P048K049o917n897K258J0668J1384j401
$$ plain form
10297 13914 7314 2456 6425 -6594 -4758 6860 6499 2802 15564 27807 37523 36385 35468 41065
10283 41065 40176 37355 34399 39686 50874 47640 52856 59603 70593 83607 98865 121112 135463
10270 135463 133823 141033 155669 190596 242055 321531 437714 628894 866993 1136663 1372747
10259 1372747 1527475 1611249 1609763 1556963 1551010 1607654 1649926 1637546 1530294 1329469 1063915
10248 1063915 803429 606354 486666 406121 352858 316511 296989 286063 264776 251646 233988
10237 233988 227450 205770 188174 185402 166662 158819 159874 154995 143407 127215 113835 107471 109731
10224 109731 96934 74494 79108 66893 64202 60241 56369 53359 57271 63343 54244 63421 61674
10211 61674 57862 40122 34235 38765 52155 59203 61252 54335 48438 50696 61364 72748 71347
10198G1347p653j2752j5567K102r230m285J5938O214p316R841L551j0442K42l428
10184C8562j020L376L390Jq487N763Q511J349O676r489k1502r352p517M828M791
10169A9880J6531J4567J0513j3160q080K758P783J6577J8473K5180N3429O0160
10157B24611M3289M8236O1711O6411O1540M2353Q085l983l3567l5457m2922o4362
10145C75945o5089n4211m5371m8512l5372k0962m68j600j1043K992J020p437o65
10132H9227k1008p683n628O097j871p988K042J0393r334j0424q492N095L164R28
10118D4518P541r040l338K299j675Q56p8R485J272O904k734m858J0723r714j2956
10103C9205q079R441R677j839j1221o833R166J819j540m391Q83J0659m186Q601
$$ plain form
10198 71347 63694 50942 35375 37477 28247 23962 39900 46114 38798 48639 52190 41748 41990 38562
10184 38562 37542 40918 44308 44309 35822 41585 50096 51445 58121 48632 27130 17778 10261 15089 19880
10169 19880 36411 50978 61491 48331 40251 43009 50792 67369 85842 111022 164451 224611
10157 224611 267900 316136 377847 444258 505798 548151 556236 552253 518686 483229 440307 375945
10145 375945 310856 256645 211274 162762 127390 106428 105960 104360 93317 96309 97329 89892 89227
10132 89227 68219 60536 54908 61005 59134 51146 53188 63581 54247 43823 35331 40426 43590 44518
10118 44518 52059 43019 39681 41980 40305 41161 41083 50568 51840 58744 56010 51152 61875 52161 39205
10103 39205 31126 40567 50244 48405 37184 30351 39517 41336 39796 35405 36288 46947 42761 51362
10089E1362N565N399K786J1251K0109K6361J6505J1460K966P25K7060K7207K2620
10076B31376M0033M8454O6966J37074K13019L25104N89763J032252J367506Q33988
10066D885535L5649L0086l51028j518674j247312o11881k96743j66027j16663
10057F42942p6277l5633j5508N741k17j1848l8644o5059l2294m558k7838l8410
10045C02397j3971k0202k6058j1497j0420j7446o192j3506j3503j3101m669J2149
10033A63981J6683n5q603j8227k4289j03q061l075k0379j3098j0054L888M358
10020H2966Q468j1582J422l237q857k224Q78j73O557l381j2146j0306K592J538
10006E2515l793r74j344r819N913Q929n931j5024Q068K1773J762j1844q666J0325
$$ plain form
10089 51362 56927 62326 65112 76363 96472 122833 139338 150798 153764 154489 181549 208756 231376
10076 231376 271409 319863 386829 523903 736922 1062026 1651789 2684041 4051547 4885535
10066 4885535 4921184 4951270 4600242 3081568 1834256 1222375 925632 759605 642942
10057 642942 566665 531032 515524 521265 521048 509200 470556 405497 373203 368645 340807 302397
10045 302397 288426 268224 242166 230669 220249 202803 196611 183105 169602 156501 151832 163981
10033 163981 180664 180609 172006 153779 129490 129387 121326 118251 97872 84774 74720 78608 82966
10020 82966 91434 79852 81274 78037 69180 66956 67834 67661 74218 70837 58691 48385 50977 52515
10006 52515 48722 47748 46404 36585 42498 51427 45496 30472 38540 60313 62075 50231 41565 51890
9992E1890q93j5671k428j142K120O001q721r499M451K240O955J1699q237p774
9978C0991k808j2591K074Q101j0613p043L946P93p366P74N401n634r50R065k196
9963A1944l270J5791M584K46j219k774O301r9O23M152m036J3173J4645J4650L3265
9948A07976K7629J9745J4917J0000J041q557q220j4794k8348l2035k3682k2568
9936D3104q831q7M129l050m29n766L578O09j6326k4584m406J453O968J2756M084
9921A3202R588K830j1012j6261o377J6474K022N828j0358j376Q278J336q174P764
9907A3764J5516l734o02L233K851j2636l09Q787L51o851r917j399n154O282J1861
9892B2043l193J7113O136L411K961j307p827j5983K316J552m221k741p161O268
$$ plain form
9992 51890 50997 35326 32898 31756 33876 39877 31156 21657 26108 28348 35303 47002 38765 30991
9978 30991 28183 15592 17666 25767 15154 8111 12057 12850 5484 6258 11659 6025 5075 14140 11944
9963 11944 8674 24465 29049 29295 28076 25302 31603 31504 32127 36279 32243 45416 60061 74711 107976
9948 107976 135605 155350 170267 180267 181308 172751 164531 149737 121389 89354 65672 43104
9936 43104 34273 34186 38315 35265 34836 29070 32648 33257 16931 -7653 -12059 -10606 -3638 9118 13202
9921 13202 22790 25620 14608 -1653 -8030 8444 10466 16294 5936 4560 12838 14174 6000 13764
9907 13764 29280 25546 24944 28177 31028 18392 18083 26870 27221 20370 10453 9054 3900 10182 22043
9892 22043 18850 35963 42099 45510 48471 47164 39337 23354 25670 27222 23001 20260 13099 19367
9878A9367R525l031r25j0783l937l390P027J0684M761r662n164q075N835P181
9864A9413l007p575K240r972P413K090j3816r144J0050O829o520p226K125j1996
9850a9096p511J0458J9975P419j645j425o869O64L427p339R136J158j2860k080
9836f588m687R467R557O812O349o793p094o830n210J2388R625q583j6974j0163
9822a8724M015Q174J0928n07k453K800j090l95N244n666j001l175P879J0332n463
9807A0898r114k619l518M655m234P934L166n127r178M20j3091M967k85l874l777
9792b2777P067J245J3846M872k945J555q049j5897k095R628N157O752J3085K88
9778A1732j258m036n957n796o337j571M437L209M769P276Q84p932k856q21j1558
$$ plain form
9878 19367 28892 25861 24936 14153 10216 6826 13853 24537 29298 19636 14472 6397 12232 19413
9864 19413 16406 8831 11071 1099 8512 10602 -3214 -12358 -2308 4521 -1999 -9225 -7100 -19096
9850 -19096 -26607 -16149 3826 11245 9600 8175 1306 1970 5397 -1942 7194 8352 -4508 -6588
9836 -6588 -11275 -1808 7749 14561 20910 14117 7023 193 -5017 7371 16996 8413 -8561 -18724
9822 -18724 -14709 -6535 4393 3886 1433 4233 3143 2748 7992 2326 1325 -1850 6029 16361 10898
9807 10898 1784 -835 -4353 302 -3932 4002 7168 2041 -7137 -6717 -19808 -14841 -15126 -19000 -22777
9792 -22777 -15710 -14465 -619 4253 1308 2863 -5186 -21083 -23178 -13550 -8393 -1641 11444 11732
9778 11732 10474 6438 481 -5315 -11652 -13223 -8786 -5577 -808 6468 7352 -580 -3436 -4257 -15815
9763a5815o051M001L743J2603N652J561k021l216O576j598J1465K954j2141j2507
9749d794q512r776L480J0823p06M529k134O82O688J8021l415j2046q635M329J087
9734c79K230j520k031O266r294m201k060q063J184J2543j232r500m86J5159N83
9719h01r926J657j245j1647m497L035M226n857K711L382J3369M43j2577N272J0019
9704b436j348n619p548j0347O894J4288k07p727J2217M435n593j8350n523k603
9690b9467J0025J707m37J0805J7368L176m227r899j1209o122J6503J1110j138
9677H195q100q55k51L67N867q456M028N130J796L108l829n133O337Q569o168r662
9661I43K868k97R195N546o50k596k216k951P809o393k078j4524K617J0463l446
$$ plain form
9763 -15815 -21866 -17865 -14122 -1519 4133 5694 3673 457 7033 5435 16900 19854 7713 -4794
9749 -4794 -13306 -23082 -19602 -8779 -9485 -4956 -7090 -6408 280 18301 14886 2840 -5795 -1466 -379
9734 -379 1851 331 -1700 4566 -4728 -8929 -10989 -19052 -17868 -5325 -6557 -16057 -16543 -1384 -801
9719 -801 -10727 -9070 -10315 -21962 -26459 -23424 -19198 -25055 -22344 -18962 -5593 -5150 -17727 -12455 -2436
9704 -2436 -3784 -9403 -16951 -27298 -20404 -6116 -6323 -14050 -1833 2602 -2991 -21341 -26864 -29467
9690 -29467 -19442 -17735 -18172 -7367 10001 13177 8950 -949 -12158 -18280 -1777 9333 8195
9677 8195 95 -760 -1011 -644 5223 -3233 795 5925 7721 10829 7000 1867 8204 16773 10605 943
9661 943 3811 3514 12709 18255 17605 15009 12793 9842 17651 11258 9180 -5344 -2727 7736 4290
9646D290K034Q6n150j1385J2976P829M442j3737p053n467l878O484q383m815R972
9631a1755N72J0745k163m641k234o086K96N899M119j7954M372l134J698r63J646
9616a9583O624J6544N208n278l946o346N529N526J0147j318r206L467q181q663
9602i476n44O286K158m620M372P768L756p028M253j109m453r947M755N162L630
9587D963R17J5k643q747K032O547j2844L476Q566L804o604q25n281r042l127k938
9571b1731J6058L202n414l692k320J926l433r26R161J567K826n491m435o50M781
9556h571J0008J7236N657m412K811l267k956j0202j1181p915L597J889m804O578
9542e532J4593p246o353R940k309j5521L560L752n43M307p116J5221j574j4651
$$ plain form
9646 4290 6324 6410 1260 -10125 2851 10680 15122 1385 -5668 -11135 -15013 -8529 -16912 -21727 -11755
9631 -11755 -11183 -438 -2601 -7242 -9476 -15562 -15266 -9367 -5248 -23202 -18830 -21964 -20266 -21229 -19583
9616 -19583 -12959 3585 8793 3515 -431 -6777 -1248 4278 14425 13107 3901 7368 -813 -9476
9602 -9476 -10020 -3734 -1576 -6196 -1824 5944 9700 2672 6925 5816 1363 -8584 -3829 1333 4963
9587 4963 5880 5895 3252 -5495 -3463 3084 -9760 -6284 2282 6086 -518 -1343 -6624 -15666 -18793 -21731
9571 -21731 -5673 -2471 -7885 -11577 -13897 -11971 -15404 -16330 -7169 -5602 -2776 -8267 -12702 -13352 -8571
9556 -8571 1437 18673 24330 19918 22729 19462 16506 6304 -4877 -12792 -9195 -7306 -12110 -5532
9542 -5532 9061 1815 -4538 5402 3093 -12428 -8868 -5116 -5659 -1352 -8468 6753 5179 -9472
9528i472j603M015q388j0443L689N778m841j1656K903L1482M821j578J821K776
9514I304m666j0474J1966M618J060p50j0979j3169J0368K2478Q160o081j7392
9501D443j8858p910L841M017l89J1608P676l492k0417j2548L777R696k768M870
9487a6454Q093k255q170l018J179L620j1201L267K5181R702j1396j5707J0152
9474g007Q866Q46J2496J4762j996o935j6098p595J0617j474j4326L837K716J5792
9460A4501l259m634k614r377J3780J6347j238q474j258K46p368J235k426O832
9446A2293L691n734p120m610m69m413p78M016l061N42J142K91m801m965l425l091
9430b0492N697O398J0690K207j109N380k567P990O477r853r742j24J0802K04m125
$$ plain form
9528 -9472 -11075 -7060 -15448 -25891 -22202 -16424 -21265 -32921 -30018 1464 6285 4707 6528 9304
9514 9304 4638 -5836 6130 10748 11808 11058 79 -13090 -2722 19756 27916 21835 4443
9501 4443 -14415 -22325 -18484 -14467 -14856 -3248 4428 936 -19481 -32029 -28252 -18556 -21324 -16454
9487 -16454 -8361 -10616 -18786 -21804 -20625 -17005 -28206 -24939 242 9944 -1452 -17159 -7007
9474 -7007 1859 2705 15201 29963 27967 21032 4934 -2661 7956 6482 -7844 -4007 -1291 14501
9460 14501 11242 6608 3994 -5383 8397 24744 23506 15032 13774 14020 6652 7887 5461 12293
9446 12293 15984 10250 3130 -1480 -1949 -6362 -7140 -3124 -6185 -5643 -4501 -4210 -9011 -13976 -17401 -20492
9430 -20492 -14795 -8397 2293 4500 3391 8771 6204 14194 20671 10818 1076 952 11754 11958 7833
9415G833j6520p811N678O444M195K929k543o7P55q001r812Q127J2246R218j4694
9400b023R675l86r280l437q590L173L350Q270m559j3245n312J0397K0351P655
9386A6039p326l710m22J158l387p208l711L808K312J678M90Q77j373j4146m742
9371a9663J0329J3422j028K093q699j5237L179J1178l495m686l886M388O845r494
9357a4754j930L993o471L305O651N757K388L074J990J953R50l840m223j050J4331
9342A2124O97p743J449O006q46J4176r653j1850n55r5L361K288q840j8008l171
9327b0660P057O289J3092k91j3396n187R873J9778O920j4571m158P038o853Q155
9313A3086j839q292p674j6147qJ093J0852J4233J4732o55o10l85J898j1105j3385
$$ plain form
9415 7833 -8687 -16498 -10820 -4376 -181 2748 205 138 893 -7108 -16920 -8793 3453 12671 -2023
9400 -2023 7652 7266 -2014 -5451 -14041 -10868 -7518 752 -3807 -17052 -22364 -11967 8384 16039
9386 16039 8713 5003 4581 5739 2352 -4856 -8567 -4759 -2447 -769 -279 598 -775 -14921 -19663
9371 -19663 -9334 4088 3060 5153 -3546 -18783 -15604 -4426 -7921 -12607 -16493 -12105 -5260 -14754
9357 -14754 -16684 -12691 -19162 -15857 -9206 -3449 -1061 2013 4003 5956 6906 3066 -1157 -2207 12124
9342 12124 12821 5078 6527 12533 11687 25863 16210 4360 3805 3710 7071 9359 519 -17489 -20660
9327 -20660 -13603 -7314 5778 5487 -7909 -13096 -3223 16555 23475 8904 4746 11784 4931 13086
9313 13086 11247 2955 -4719 -20866 -20874 -19781 -8929 5304 20036 19381 18771 18386 20284 9179 -4206
9298d206j2253J953J1111J863k781N372j2316j0667K881o311l253O88O970R298
9284a1651J5969L314r679m482p247k178j861M144J3414N694n506M811O705J0320
9270B1767o804p518m686P784R285j2109m306m542Q418q406j3676J0560J4904j354
9256I317k0100r612Q390M705n981M383m260O976R378L46j7565j2019J2998J1831
9242a213M894N399N72J925k325m995j6986n263R992M126m003K478M107R783Q553
9227A7044j0323o146J27Q645l445J74P282P640j4036L064N722j4894j3461j0249
9213b2856M708J2081L120Q568N223p704j091J4211L158m645k033P190m559p294
9199H077p734j663o79P036N735p255j969R348l507j2472j7011p72O458J0666M266
$$ plain form
9298 -4206 -16459 -14506 -3395 -1532 -4313 1059 -11257 -21924 -19043 -25354 -28607 -27919 -20949 -11651
9284 -11651 4318 7632 -2047 -6529 -13776 -15954 -17815 -13671 -257 5437 -69 4742 11447 21767
9270 21767 14963 7445 2759 10543 19828 7719 3413 -1129 7289 -1117 -14793 -4233 10671 9317
9256 9317 -10783 -20395 -12005 -7300 -13281 -8898 -13158 -6182 3196 3542 -14023 -26042 -13044 -1213
9242 -1213 3681 9080 9652 11577 9252 4257 -12729 -17992 -8000 -3874 -7877 -5399 -1292 8491 17044
9227 17044 6721 575 702 9347 5902 6076 13358 20998 6962 10026 15748 854 -12607 -22856
9213 -22856 -18148 -6067 -2947 5621 10844 3140 2049 16260 19418 14773 12740 19930 15371 8077
9199 8077 343 -1320 -1999 5037 10772 3517 1548 10896 7389 -5083 -22094 -22866 -16408 -5742 -1476
9184a476L606J429r874l223R497R943P883K334M564o829j356J1801M319r909r05
9169B1804J39l909j0490J0242M357L433r103N280m78Q60R226J9194j7909o532
9155B6114M249j2816M019Q534O394l311j5654N258R794M477r856o047l445N906
9141B3616k179k890l91L34Q92j372K937M459k452N763L874J020P093l778j3699
9126B3227R771K661k76M08p440R451K0039Q635q241j3113o516Q594J1802j430
9112E7572o189r210q415j760O569P473J771J2904J6741J425j1649j3171J506J869
9098E7436J4959P999O950p360j496N65L848n783J583L791K623P443P203p0O132
9083A05823M555R637K037J7213K8334J5707J2068K0025J4459K6207L4837M4915
$$ plain form
9184 -1476 2130 3559 -6315 -9538 -41 9902 17785 20119 24683 17854 16498 28299 32618 22709 21804
9169 21804 21943 18034 7544 17786 22143 25576 16473 21753 21275 22135 31361 50555 32646 26114
9155 26114 30363 17547 21566 30100 36494 33183 17529 22787 32581 37058 27202 21155 17710 23616
9141 23616 21437 18547 18156 18490 19382 18010 20947 25406 22954 28717 32591 33611 40704 36926 23227
9126 23227 32998 35659 35383 35791 28351 37802 57841 66476 58235 45122 38606 47200 59002 57572
9112 57572 51383 42173 33758 31998 38567 46040 47811 60715 77456 78881 67232 54061 55567 57436
9098 57436 72395 80394 87344 79984 78488 79053 82901 77118 78701 82492 85115 92558 99761 99691 105823
9083 105823 110378 120015 122052 139265 167599 183306 195374 215399 229858 256065 290902 335817
9071C35817M4615M2276M4743P1077Q6044J06809J42619J81954K29152L15062M25005
9060B025173N35198O55275O97186N82874L56724P2417k29745n14927o55729o35398
9050B889048n28256m11656k98078k15905j66291j32548r4061p7109o4930o7547
9040H32667o6585n0105m5694m5609l5609m6893k5971m0499m2610l3179r744k011
9028C88158o243j6307l0836k2995j1977j9446q684l368j020o649j4039n535p355
9015B33704j9753j4073k3304r88o235j3173M775o266j3180m828N85K723j0075
9002A29912j0819o904j733j368r49r779n762K264n663r053j906o815Q842J2149
8988I2416l978J3521Q25o426m696j7496O431M716k192o067J0296J6770M689l421
$$ plain form
9071 335817 380432 422708 467451 538528 624572 731381 874000 1055954 1285106 1600168 2025173
9060 2025173 2560371 3215646 3912832 4495706 4852430 4924847 4695102 4180175 3524446 2889048
9050 2889048 2360792 1949136 1651058 1435153 1268862 1136314 1042253 965144 900214 832667
9040 832667 766082 715977 670283 624674 589065 542172 516201 475702 433092 399913 390169 388158
9028 388158 381915 365608 334772 311777 299800 280354 271670 268302 267282 260633 246594 241059 233704
9015 233704 213951 199878 176574 175586 169351 156178 160953 154687 141507 136679 137264 139987 129912
9002 129912 119093 112189 110456 109088 108139 98360 92598 94862 89199 80146 78240 71425 80267 92416
8988 92416 88438 101959 102784 96358 91662 74166 80597 85313 83121 77054 87350 104120 108809 105388
8974A05388k337j6608k2069n547M222M590j2031Q771R992n255j6047m360J351
8961E0060P467Q870M099j868j3369j6168K712K706n632j017J1509r98o307j1879
8947C0185k1184k1258J6016R303J8709K651j7687K101L0165N453K959l464j500
8934E2449k731J896K288n84q911m600q452o345J5567l57j4831P361n584o448K20
8919B0938K941K345Q14n290Q747o13j2612m859J680J133q860J063N500L579J4868
8904C1374M753m237P162p252j2432q50J4607N820K475Q570K3673K2270J5257K302
8890A13492p346k4409k6638j7214j4629m575J5470M102n320l590l494p967p450
8877A0432Q303j4546r029L490R382O356o377m032k773N992J9439j807k885M380
$$ plain form
8974 105388 103051 86443 64374 58827 63049 67639 55608 64379 74371 69116 53069 48709 50060
8961 50060 57527 66397 70496 68628 55259 39091 41803 44509 38877 37860 49369 48371 42064 30185
8947 30185 9001 -12257 3759 13062 31771 34422 16735 18836 49001 54454 57413 53949 52449
8934 52449 49718 51614 53902 53318 44407 39807 31355 25010 40577 40220 25389 32750 27166 20718 20938
8919 20938 23879 26224 27038 21748 30495 29882 17270 12411 14091 15224 6364 7427 12927 16506 31374
8904 31374 36127 31890 39052 31800 19368 18518 33125 38945 41420 49990 73663 95933 111190 113492
8890 113492 106146 81737 55099 37885 23256 18681 34151 38253 32933 29343 25849 17882 10432
8877 10432 18735 4189 -4840 -1350 8032 14388 8011 3979 1206 7198 26637 24830 21945 26325
8863B6325o716m447M355K946l261O194K601o338l618j1528n230R793n683J823
8849G216n850k266J6017J4711Q854R59j4461j4818N86R153K141n481N794n817
8835A6738o921k0659J231Q003K0122N916k0073k539L536l250K54N191O160R991
8821B3700M654j141j1545j4551M819R218J6396j3978o901m927o602M273P347J7354
8807B8116L0451K7464J3527K0096N459j5980k6458k2730j8388j5139l589p953
8795A4876l915K27J014l961j2762M447J0916J0102Q284K845j691n57q942k431
8781A8452L381J693O674o186J770O418m525l505j0617l093j816p736J780j388
8767A302N700L390L787Q964N270M18l443q905k701P89j530n451o492k599Q749
$$ plain form
8863 26325 19609 15162 19517 22463 19202 25396 27997 21659 18041 6513 1283 11076 5393 7216
8849 7216 1366 -900 15117 29828 38682 39641 25180 10362 10948 20101 22242 16761 22555 16738
8835 16738 9817 -10842 -9611 -1608 18514 24430 4357 1818 5354 2104 2358 7549 13709 23700
8821 23700 28354 27213 15668 1117 5936 15154 31550 17572 10671 5744 -858 3415 10762 28116
8807 28116 58567 86031 99558 119654 125113 109133 82675 59945 41557 26418 22829 14876
8795 14876 10961 11188 12202 8241 -4521 -74 10842 20944 29228 32073 30382 29825 20883 18452
8781 18452 21833 23526 30200 24014 25784 32202 27677 24172 13555 10462 8646 910 2690 1302
8767 1302 7002 10392 14179 23143 28413 28831 25388 16483 13782 14571 13041 7590 1098 -1501 7248
8752G248J1332J0187j1146j0708l001p970N52J6504j524n572j519r534O15J1966
8738G430J2603l715j7114j1835K912J0959J530k681M239m589K52o859p411J2914
8724a365J4531k0489j6296j119J4117m588k058L641K759J4607J1531K132j8094
8711f91k814K921J0658Q356o458O622P637j382o69k570l066K977k923l315o809
8696H474r54O89P041m74o987L4O500K464k975Q495J4522J2279n321k2039n728
8681A6020N658R760j2943j6362q9R868O68j178O46J1552P134p772N195O056k891
8666C1322j4576n466K066m180K70k97p847K014O910J0088p542P743J5625j986
8652C4144j7262k2693k472J8374J887Q123L596j188k292L20k120L138Q480j311
$$ plain form
8752 7248 18580 28767 17621 6913 3912 -4058 -3506 12998 11474 5902 4383 -5151 -4536 7430
8738 7430 20033 16318 -796 -12631 -9719 1240 2770 89 4328 -261 -9 -6868 -14279 -1365
8724 -1365 13166 -7323 -23619 -24738 -10621 -15209 -17267 -13626 -10867 3740 15271 17403 -691
8711 -691 -3505 -584 10074 18430 11972 18594 26231 24849 24180 21610 18544 21521 18598 15283 8474
8696 8474 7520 8209 15250 14776 7789 7823 14323 16787 13812 22307 36829 49108 43787 21748 16020
8681 16020 21678 31438 18495 2133 2044 11912 12580 11402 12048 23600 30734 22962 28157 34213 31322
8666 31322 16746 11280 13346 9166 9436 9139 1292 3306 10216 20304 12762 20505 36130 34144
8652 34144 16882 -5811 -8283 10091 11978 20101 23697 22509 20217 20537 18417 21555 30035 28724
8638B8724n604R512J4963k19P01k482l077J3961j128j4051k860J6471N395J2977
8624G3283R982L107K0292K0798J9144K2722N6049Q4031J17552J09936N1578M287
8612E92761k8299r1969j19964r5377o4715l8865j6801j5758O632j1834r662o580
8600I9569j1807l829m16o269m270n694j4537o720o489Q519K049k620j3872n53
8586C3061L645J5851R873R311R19o202m096l583j6056j7388n210j791q481n024
8572D829J793O369p57J1912O826m897J104K969L962p661p561q880k186J0059J619
8557A9500o060p579n121P165P904P272j255n481N321p361l898O580K838j2716
8543G109p930M987Q171K87r633O866K490M553J309j0374j149p80j0690O653K0005
$$ plain form
8638 28724 23120 32632 47595 47376 48077 45595 42518 56479 55351 41300 38440 54911 60306 73283
8624 73283 83265 86372 106664 127462 146606 169328 225377 309408 426960 536896 588474 592761
8612 592761 564462 472493 352529 257152 192437 153572 136771 121013 127645 115811 106149 99569
8600 99569 87762 83933 83517 77248 72978 67284 52747 46027 39538 48057 50106 47486 33614 33061
8586 33061 36706 52557 62430 71741 72660 66458 62362 58779 42723 25335 20125 18334 9853 4829
8572 4829 6622 12991 12234 24146 30972 26075 27179 30148 34110 26449 18888 10008 7822 17881 19500
8557 19500 13440 5861 740 7905 15809 23081 21826 16345 21666 14305 10407 16987 19825 7109
8543 7109 -821 4166 12337 12624 2991 9857 12347 16900 18209 7835 6686 5906 -4784 1869 21874
8528B1874K917m761M092P032o753N39J565J3114q824j9933j1526j1969q957j797
8514b3387M338m888Q49j770J7972P065O164N601L271J960j2002j447L30k540j437
8499G9l101J973j0537j3684o529K571O119Q54J5005Q137J1805m80p686R69J352
8484F847n865q171l13R581m793L970O137p256l92M145m934l487R882N302r592
8469A061k932P895N744P341o496n794o233p617R942Q046J164R467j1106L186K529
8454A6197k937K73J1737o6l984n206m985J545J241K102n242J174m723o653P42
8439A215m600k627n108J0310K4964Q445J4643j1076p684l92j0599k0305k394O872
8425A664K337p6N659j006k368j1321r139O203O233J0514j0429n583o017P696L269
$$ plain form
8528 21874 24791 20030 24122 31154 24401 24940 26505 39619 30795 10862 -664 -12633 -21590 -23387
8514 -23387 -19049 -23937 -23088 -24858 -6886 179 6343 11944 15215 17175 5173 3726 4056 1516 79
8499 79 -3022 -1049 -11586 -25270 -31799 -29228 -23109 -22255 -7250 887 12692 12212 4526 5495 6847
8484 6847 982 -7189 -7502 2079 -2714 1256 7393 137 -255 3890 -1044 -4531 5351 10653 1061
8469 1061 -1871 6024 11768 19109 12613 6819 586 -7031 2911 10957 12121 21588 10482 13668 16197
8454 16197 13260 13533 25270 25204 21220 16014 11029 12574 13815 15917 10675 11849 7126 473 1215
8439 1215 -3385 -6012 -11120 -810 24154 32599 47242 36166 28482 28090 17491 -2814 -5208 1664
8425 1664 4001 3925 9584 8578 6210 -5111 -14250 -8047 -1814 8700 -1729 -7312 -13329 -5633 -2364
8410b364j355j348K718j414%n166o50M218L053p890q909K549J9643N614p648l797
8394b746p342Q810l808L618k090j0385m527J0969J6447M661R79j2980j181J2099
8380A2524J928q832k614p950m147Q820M512j6248n243Q172K0393j893m222M460
8366I660M576l469j778p230K454k60Q639j535J153j6341j2541J1758P691j0291
8352g514k158J8425K7j4782o359J1014J2778n400M115R860P99K042p102j0297
8338E448o477J0594K65P260J87n87P472k916o211n169j0650p432j619O542R002
8323E709L282N565r337P22L226Q363j264p816K076j8295k343K600J185k295r729
8308a8351O659P812O959M348R285l883j2616M596q568N49M153j1885m850l224
$$ plain form
8410 -2364 -3719 -5067 -2349 -3763 -3763 -8929 -9579 -5361 -2308 -10198 -19107 -16558 3085 8699 1051 -2746
8394 -2746 -10088 -1278 -5086 -1468 -3558 -13943 -18470 -7501 8946 13607 14586 1606 425 12524
8380 12524 14452 5620 3006 -4944 -9091 -271 4241 -12007 -17250 -9078 11315 9422 5200 9660
8366 9660 14236 10767 8989 1759 4213 3953 12592 11057 12210 -4131 -16672 -4914 2777 -7514
8352 -7514 -9672 8753 8780 -6002 -12361 -1347 11431 6031 10146 20006 20805 22847 15745 5448
8338 5448 -1029 9565 9830 17090 17277 16690 24162 21246 15035 9866 -784 -8216 -9835 -3293 5709
8323 5709 8991 14556 5219 5941 9167 17530 16266 8450 10526 -7769 -10112 -7512 -6327 -8622 -18351
8308 -18351 -11692 -3880 3079 7427 16712 12829 213 4809 -3759 -3210 943 -10942 -15792 -19016
8294a9016p7J1018n910l380L045Q389N056j461j472n637k58M720Lj2442q199K458
8278b3163J350J2067J6540m084o2R864p787q376r2J0322O340j2039M462j483m626
8263g67j19j982R074J3420m622j0021r629J1955K514j462o039j88p677k129L606
8248d066N415O555n020j7123j42J872M232J0097n232q864N752K199K127R522Q880
8233A6204j0599j9034M160J0736m37r29o738K464M831N441r31m383N430j907j360
8218B948q488l07K984J3286J0785n999j1437k532O436J121j0384j5150Q257J8564
8204A0084O446j4099J587L436q052J2637m82P781M381q371j2712r427M009m764
8190g546J2573J2383K266k221o812j1508j392O681J1442J3804n224j1296o874
$$ plain form
8294 -19016 -19093 -8075 -13985 -17365 -14320 -5931 -875 -2336 -3808 -9445 -9703 -4983 -4980 -17422 -25621 -23163
8278 -23163 -21813 -9746 6794 2710 2648 12512 4725 -3651 -3743 6579 12919 880 5342 3859 -767
8263 -767 -886 -2868 6206 19626 15004 4983 -4646 7309 9823 8361 2322 2134 -5543 -7672 -4066
8248 -4066 1349 7904 2884 -14239 -14381 -12509 -8277 1820 -3412 -12276 -6524 -4325 -2198 7324 16204
8233 16204 5605 -13429 -9269 1467 1030 101 -6637 -4173 658 6099 5168 785 6215 4308 2948
8218 2948 -5540 -5847 -2863 10423 21208 15209 3772 1240 7676 8797 -1587 -16737 -8480 10084
8204 10084 16530 2431 4018 7454 -598 12039 11557 19338 23719 15348 2636 -6791 -2782 -7546
8190 -7546 5027 17410 19676 17455 10643 -865 -2257 4424 15866 29670 24446 13150 6276
8177F276m698m842P072P089J1599o930j7153j3954K679O033O948J373O762m098
8163D156j1499q963R406O16k382P80J528J600m626L785K322R060O682P339O353
8148B6157k418k264j1192j2298m472J0579J6031k699m329l257j2556R080O909
8135A3271n194q693k049j43j640P624N603K732j0278L43k243J905J0528k631q389
8120G46p535j320J0435J2982j043j4611L358q505l968J3959K3556m489k097r874
8106A1594j7504K298J1290J2476o185j3885p337R030J6134O7l090m215P845N855
8092B4373p760q965M899N983O313O336j0120j3327J4719J1886l096K120p652l238
8078B2471j1601J111K39R061p813j1565j174N505M30j6533r767N131J4353p330
$$ plain form
8177 6276 1578 -3264 3808 10897 22496 15566 -1587 -15541 -12862 -6829 119 1492 8254 4156
8163 4156 -7343 -16306 -6900 -6284 -8666 -7886 -6358 -4758 -9384 -5599 -3277 5783 12465 19804 26157
8148 26157 23739 21475 10283 -2015 -6487 4092 20123 17424 13095 9838 -2718 6362 13271
8135 13271 8077 -616 -2665 -2808 -4448 3176 8779 11511 1233 1576 -667 1238 11766 9135 746
8120 746 -6789 -8109 2326 15308 14265 -346 3012 -5493 -9461 4498 28054 23565 21468 11594
8106 11594 -5910 -3612 7678 20154 13969 84 -7253 1777 17911 17978 14888 10673 18518 24373
8092 24373 16613 7648 12547 18530 24843 31179 21059 7732 22451 34337 31241 33361 25709 22471
8078 22471 10870 11981 12220 21281 13468 1903 729 6234 6664 -9869 -19636 -14505 -152 -7482
8064g482M864P212r76K362n68Q642r65k043J375P68O822N983l342o398j1996M840
8048I098O610M307q563L972j0408j0034J5151P839L826Q429o246M525j2636j3336
8034B534o051J0839k832r295m183M574M712l470m05M163N452J3039J772m893j1593
8019D363r524J2582K785j3573p308Q803J816K267r20L325L495M75m71n468k941
8004b94J1335j1544n550k995j4787J9699J6869m757J1007J240n630m616r464K903
7990C416M773R801L044q107j0675K252j700n128J24m53J230K746M016R047O018
7975B0404K129k739j3308l415L780P435j1906r64L125j182J0036O166j224J6593
7961C4930O820k1526j306J5953Q25j9826j2477r839o596R60J8310P184n891j252
$$ plain form
8064 -7482 -2618 4594 3618 5980 5412 14054 13089 11046 12421 13189 20011 25994 22652 16254 4258 9098
8048 9098 15708 20015 11452 15424 5016 -5018 10133 17972 21798 30227 23981 28506 15870 2534
8034 2534 -3517 7322 4490 -4805 -8988 -4414 298 -3172 -3577 586 6038 19077 20849 15956 4363
8019 4363 -5161 7421 10206 -3367 -10675 -1872 -56 2211 1291 4616 8111 8586 8115 2647 -294
8004 -294 11041 -503 -6053 -9048 -23835 -4136 12733 7976 18983 20223 14593 9977 513 3416
7990 3416 8189 17990 21034 12927 2252 4504 2804 -2324 -2200 -2653 -1423 1323 5339 14386 20404
7975 20404 22533 19794 6486 3071 6851 14286 2380 1416 4541 3359 13395 19561 18337 34930
7961 34930 41750 20224 18918 34871 35696 15870 3393 -6446 -13042 -12082 6228 13412 7521 6269
7947F269N651J3969j67j2047j965q41j063n741Q478J754j015q505m489M622N459
7932A0369k810p961m280L371m736k275p322p180M452P315J4218o480j0006R881
7918c444N866J2883q218o098m255j603l804J1041L640j824Q953L221J521J559
7904A9438Q87j758l999o862o557q166J3018K615k080N533M140m257q057n017J5761
7889A4639J2456j4854m846N369O42l170p15K131p415r453n39n179O260P734o902
7874c842o831r081J5922J6484M963j193l345k126m708j0547n611K220L641o776
7860a0830m95K969L123R703q764Q27n201j1542q570J5266J0743l438j5636m800
7846b6645J0480P79Q462J362r523j2000L440p61k15O349R994M400l959n82n30
$$ plain form
7947 6269 11920 25889 25722 13675 11710 10869 9806 4065 12543 14297 13282 4777 288 4910 10369
7932 10369 7559 -402 -4682 -1311 -6047 -8322 -15644 -22824 -18372 -11057 3161 -3319 -13325 -3444
7918 -3444 2422 15305 7087 989 -3266 -4869 -8673 2368 6008 4184 13137 16358 17879 19438
7904 19438 20325 18567 14568 7706 1149 -7017 6001 8616 6536 12069 16209 11952 3895 -1122 14639
7889 14639 27095 12241 7395 12764 13406 10236 9521 11652 4237 -5216 -5755 -10934 -4674 3060 -3842
7874 -3842 -10673 -19754 -3832 12652 17615 16422 13077 10951 6243 -4304 -9915 -7695 -4054 -10830
7860 -10830 -11325 -8356 -5233 4470 -4294 -3467 -8668 -20210 -28780 -13514 -2771 -6209 -21845 -26645
7846 -26645 -16165 -15386 -6924 -5562 -15085 -27085 -23645 -24406 -24621 -18272 -8278 -3878 -7837 -8419 -8949
7831h949J5376K025q405j0070j0790k108R187R351O221p432K197j782m43L336
7817b286l760j344q894J24M794P77m824l47M333K080l968p576N91J0151j154k181
7801a3484J882J456j261k543J0936L07p89p754j862N256O071J1834N369L432J512
7786B0362j2398r396j4008K647O105J1109o779j2694O007m351L520J0400p40m532
7772d748j2985l39J4707J8489l756j7747j830o518J527k606m043J1457R467J3275
7758A4350l511k566K54J3412l743j349j0848j7211l750m928J1111L44J223P032
7744a80J792N031K007j5278o400Q852R949M723j1880j707j7296j0828O493J3320
7730a1402l021o600J3018O837J0858K145j5213K494M768o640J1637K713j0082
$$ plain form
7831 -8949 6427 8452 47 -10023 -20813 -22921 -13734 -4383 1838 -5594 -3397 -5179 -5622 -2286
7817 -2286 -6046 -7390 -16284 -16160 -11366 -10589 -15413 -15760 -11427 -9347 -13315 -20891 -20300 -10149 -11303 -13484
7801 -13484 -11602 -10146 -11407 -13950 -3014 -2707 -3496 -11250 -13112 -7856 -1785 10049 15418 18850 20362
7786 20362 7964 -1432 -15440 -12793 -6688 4421 -2358 -15052 -9045 -13396 -9876 524 -216 -4748
7772 -4748 -17733 -18072 -3365 15124 11368 -6379 -8209 -14727 -13200 -15806 -19849 -8392 1075 14350
7758 14350 10839 8273 8527 21939 18196 16847 5999 -11212 -14962 -19890 -8779 -8435 -7212 -180
7744 -180 1612 6643 8650 -6628 -13028 -4176 5773 10496 -1384 -3091 -20387 -31215 -24722 -11402
7730 -11402 -14423 -21023 -8005 -1168 9690 11835 -3378 -884 3884 -2756 8881 11594 1512
7717A512p69K120P463j985k204j315r458o405j947Q200q872n396p087n298J676
7702b9765J4262P339J2290K102j2492q530m964J0141r49J927J171j514N736o218
7688i464o432o007j903J5535O876j527p946N952k867J965r78M240m263q308M397
7673a0730M110k258k724j213J0785k888n252O042K803L795J1095Q4j4119j3221
7659a3691n197P980L407j2290M471j327j7549K330J6943N399q299P787p507k37
7645a7780J198L350R540O575k983j0899Q749J225m353k16R781J3110m084j1398
7631A815j4854N162j205j315J836m936M278P191j0018j2604l618J4087Q693R103
7617C615K171j2100m613O230J4155L212K034k895j3441n07o996m997r422L685
$$ plain form
7717 1512 743 2863 10326 8341 6137 4822 -4636 -11041 -12988 -4788 -13660 -19056 -26143 -31441 -29765
7702 -29765 -15503 -8164 4126 6228 -6264 -14794 -19758 -9617 -10566 -8639 -7468 -8982 -3246 -9464
7688 -9464 -15896 -21903 -23806 -8271 -1395 -2922 -10868 -4916 -7783 -5818 -6796 -2556 -6819 -15127 -10730
7673 -10730 -6620 -8878 -11602 -12815 -2030 -4918 -10170 -4128 -1325 2470 13565 13649 -470 -13691
7659 -13691 -18888 -10908 -7501 -19791 -15320 -16647 -34196 -31866 -14923 -9524 -17823 -10036 -17543 -17780
7645 -17780 -16582 -13232 -3692 2883 -100 -10999 -2250 -1025 -5378 -5594 4187 17297 13213 1815
7631 1815 -13039 -7877 -9082 -10397 -8561 -13497 -9219 -2028 -12046 -24650 -28268 -14181 -5488 3615
7617 3615 5786 -6314 -10927 -4697 9458 12670 14704 11809 -1632 -2139 -9135 -14132 -23554 -19869
7603a9869R014O817j0175P16J8344M307m297m983l926o865k374m996L165j0335
7589b5457r744K303J9922P547L473j0483o97O616R72o385Q257Q73j489J675j527
7574d144j8886o124J3434J5750P32m832P972J158L82o021L612N476m022n073k821
7559c407J2257J632n913K264m648J1389M409o815r177O622K324j581o86q892j4158
7544a4380j0079J1398J7294j37q300N902J299J3864n522j3101j3574p730N829
7531a7237J3839k211J691J1031m006l216p064j524l993J2174J627p07J6067J784
7517A8255n740j0245l724k083n620P900N995o422j0172N319k148M100j287l582
7503i454R715m06j8061N032K0218L074K66j217o242K710o092j0450r697q99K805
$$ plain form
7603 -19869 -10855 -4038 -14213 -13497 4847 9154 4857 -126 -4052 -10917 -13291 -18287 -15122 -25457
7589 -25457 -35201 -32898 -12976 -5429 -1956 -12439 -13136 -6520 -5548 -11933 -3676 -2803 -4292 -2617 -4144
7574 -4144 -23030 -29154 -15720 30 762 -4070 3902 5060 5442 -579 3033 8509 4487 -586 -3407
7559 -3407 8850 10482 4569 6833 2185 13574 17983 11168 1991 8613 10937 9356 8670 -222 -14380
7544 -14380 -24459 -13061 4233 4096 -4204 1698 2997 16861 11339 -1762 -15336 -23066 -17237
7531 -17237 -3398 -5609 -3918 7113 3107 -109 -7173 -8697 -12690 -516 1111 404 16471 18255
7517 18255 12515 2270 -1454 -3537 -9157 -1257 4738 -1684 -11856 -6537 -8685 -4585 -5872 -9454
7503 -9454 261 -145 -18206 -13174 7044 10118 10384 9167 2925 5635 -457 -10907 -20604 -21503 -18698
7488a8698J1628N048M373J3212R77K327q473N477k701O710o832r569m72j87J0342
7473A3162J627p496j4120L416K439P900P190j488L548q868j4295o950J1436Q659
7459F160k2M964n233j3991o813q232l147N317J5076Q052O501j786q352l940j392
7444f838N691r049Q051J763n55L744O165l803p956j64o432m636k965M440K2825
7429A0281J0425M051p261l887q715j0523K867K071M984M598M736p474q938N075
7415B290M048l886n738j0931r985j047J3770N326M412J816P540o457p159P63J1516
7400F278q20L561m71j0300p757R060J1532N894O871m322j992J518n382r328p917
7385c575n963K608m140p476o127J633Q599R167J0224J3502K129p176n021j364
$$ plain form
7488 -18698 -7070 -2022 2351 15563 16540 18867 10394 15871 13170 19880 13048 3479 3007 2820 13162
7473 13162 14789 7293 -6827 -3411 -972 6928 14118 12630 16178 7310 -6985 -13935 -2499 6160
7459 6160 6138 11102 5869 -8122 -14935 -23167 -26314 -20997 -5921 2131 8632 6846 -1506 -5446 -6838
7444 -6838 -1147 -10196 -2145 -382 -937 2807 8972 5169 -2787 -2951 -9383 -14019 -16984 -12544 10281
7429 10281 20706 24757 17496 13609 4894 -5629 -2762 -691 4293 8891 13627 6153 -2785 2290
7415 2290 6338 2452 -3286 -14217 -24202 -25249 -11479 -6153 -1741 75 7615 1158 -6001 -5238 6278
7400 6278 5458 9019 8548 -1752 -9509 -449 11083 16977 23848 19526 17534 19052 13670 4342 -3575
7385 -3575 -9538 -6930 -11070 -18546 -24673 -23040 -14441 -5274 4950 18452 20581 13405 8384 7020
7371G020j3369m598l645N03o838L559R681K422q838J343R361l174m873k903p60
7356a5109l649M691L599R697J7372J3j2543n312k785N382n475L78Q90J82o218
7341h887m402J81O412m341O33J3790n360j2245n07N783J1357o95J738l397j344
7326a284J277l048J1534N145j1759j2028J588m731J598j2491r07M799K981J2062
7312e264k92p13k984k284k593J098m735J26R344O107n771j0979n287M961r91o055
7296b6312P101l552l034Q478Q079l366j6144p576J7147J4236K821P031L470j3560
7282e181k578j928j502QL704J401J2549P631K152r533j4190O013j267L61R152
7267F792k175q938n273J2614q71p459m439M727O696P899K680q819j4699Q573J3486
$$ plain form
7371 7020 -6349 -10947 -14592 -14089 -20927 -17368 -7687 -5265 -14103 -12760 -3399 -6573 -11446 -14349 -15109
7356 -15109 -18758 -14067 -10468 -771 16601 16614 4071 -1241 -4026 1356 -4119 -3741 -2851 -2669 -8887
7341 -8887 -13289 -13108 -6696 -11037 -10404 3386 -1974 -14219 -14726 -8943 2414 1719 3457 60 -1284
7326 -1284 -7 -3055 8479 13624 1865 -10163 -8575 -13306 -11708 -24199 -25106 -20307 -17326 -5264
7312 -5264 -5556 -6269 -9253 -11537 -14130 -13032 -17767 -17641 -8297 -2190 -7961 -18940 -24227 -19266 -20257 -26312
7296 -26312 -19211 -22763 -25797 -17319 -9240 -12606 -28750 -36326 -19179 -4943 -2122 4909 8379 -5181
7282 -5181 -7759 -9687 -11189 -11181 -7477 -6076 6473 14104 16256 6723 -7467 -1454 -2721 -2360 6792
7267 6792 4617 -4321 -9594 3020 2149 -5310 -9749 -5022 1674 9573 12253 3434 -11265 -2692 10794
7252A0794l601m213N840n18l863o454p672n924N975R610N39P24l861j3969m717
7237b1310N269L798m00L93k95L073J868m030M661R275q971L698K431l794R959
7222E625j827L05j900P424O933K179K563k1895q385p709q858Q113M821Q290J0054
7207E733L289M678j782q381Q228j878k383q647l37k360p015p19J64k123j0241
7192b3774l510J0479O722M215p71Q244J872k42l484K305j0435l119l284j63M67
7177a4478M410M531M285J0535K0251q906j8412q909J1268J3427p101j9628j6130
7164b4857o717R156P737k924q05J8380O817m359m394J177l037k558m309k62J0725
7149b30M55J1306j977k0420j066N355L228m870M403O192L769J2266q1n515r573
$$ plain form
7252 10794 7193 2980 8820 8302 4439 -2015 -9687 -15611 -9636 -26 513 1237 -2624 -16593 -21310
7237 -21310 -16041 -12243 -12643 -12250 -12545 -9472 -7604 -11634 -6973 2302 -6669 -2971 -540 -4334 5625
7222 5625 3798 4103 2203 9627 16560 18739 21302 -593 -8978 -16687 -25545 -17432 -12611 -4321 5733
7207 5733 9022 13700 11918 3537 11765 9887 7504 -1143 -1480 -3840 -10855 -11574 -11410 -13533 -23774
7192 -23774 -27284 -16805 -10083 -5868 -6639 1605 3477 3235 -249 2056 -8379 -11498 -14782 -14945 -14478
7177 -14478 -10068 -5537 -1252 9283 29534 20628 2216 -6693 4575 18002 10901 -8727 -24857
7164 -24857 -31574 -22418 -14681 -17605 -18410 -30 6787 2428 -1966 -789 -3826 -6384 -10693 -10955 -230
7149 -230 225 11531 9554 -10866 -11932 -6577 -3349 -8219 -3816 2376 6145 18411 18330 12815 3242
7134C242j1279m431o876K411Q675J286j0144m689J2150P609m499j1734o668J0945
7120a4002J0348J3717M700j396K356K529j2342m194n182L990p937n421K581J0799
7106E46q13O137k880N361R40n565m333n66j58l447Q119J427q531o464m917O993
7090h151L39q785n347K624M784r686m185j841q53P585J4902L132Q30Q612J4498
7075A8458j994n340O106K87r756n781n553p061k012J23M06N74J073N874J843j369
7059d122m454j2158q981n759J4436J6257L935J4696j624j4460k144K426N528O546
7045A0122M344r899O580l633k730K351L279N823J353j5777n191k528m003J569
7031h340L332l315P126J1788l331q456j1557j1782R075R99r204J3165J4174L287
$$ plain form
7134 3242 -8037 -12468 -19344 -16933 -8258 -6972 -17116 -21805 -9655 -2046 -6545 -18279 -24947 -14002
7120 -14002 -3654 10063 14763 13367 15723 18252 5910 1716 -3466 524 -7413 -12834 -10253 546
7106 546 -267 5870 2990 8351 9291 3726 -607 -1173 -1331 -4778 3341 4768 -3763 -10227 -15144 -8151
7090 -8151 -7812 -16597 -21944 -19320 -14536 -24222 -28407 -30248 -31101 -23516 -8614 -5482 -4652 3960 18458
7075 18458 16464 11124 17230 17517 7761 1980 -3573 -10634 -12646 -12523 -12117 -11543 -10470 -4596 -2753 -4122
7059 -4122 -8576 -20734 -29715 -35474 -21038 -4781 -846 13850 12226 -2234 -4378 -1952 3576 10122
7045 10122 14466 4567 11147 7514 4784 7135 10414 16237 17590 1813 -3378 -5906 -9909 -8340
7031 -8340 -5008 -8323 -1197 10591 7260 -1196 -12753 -24535 -15460 -14461 -23665 -10500 3674 6961
7017F961j3965j1750N69K0439J1442j424j4903r021k877P1J1626k632O443j450
7003d71o145K96Q101q124L39n326j1726O365M083J240M83N861M992p413k179j6516
6987b6140O171Q873J0428J0998n942q293p13R545n662j4062M240o805n494K923
6973a9933J1835m329K605R593O629l372N098K519L886k188j8161j268L19N841
6959i26l874m47R046N137r836j2272l91l263L572J5044q765q437J1363J594j2710
6944a5165j4765j141L435J5135J4102k234k808L368J115n20p218j590L615P80
6930c891K058o168o873j802J3926J4582l05p47k55r258q713k024M652O737l866
6915a947j4541j2383l513J4267J6208J4882n704k316O035j352o104j3188r787
$$ plain form
7017 6961 -7004 -18754 -18185 2254 13696 12272 -2631 -11652 -14529 -14458 -2832 -5464 979 -471
7003 -471 -6616 -6320 1781 -6343 -6004 -11330 -23056 -16691 -12608 -11368 -10885 -5024 -32 -7445 -9624 -26140
6987 -26140 -19969 -11096 -668 10330 4388 -3905 -4618 4927 -735 -14797 -10557 -17362 -22856 -19933
6973 -19933 -8098 -12427 -9822 -229 6400 3028 8126 10645 14531 12343 -5818 -7086 -6767 -926
6959 -926 -4800 -5247 3799 8936 -900 -13172 -13563 -16826 -13254 1790 -6975 -15412 -4049 -2455 -15165
6944 -15165 -29930 -31071 -27636 -12501 1601 -633 -3441 -73 1042 522 -6696 -8286 -4671 -3891
6930 -3891 -1833 -8001 -14874 -16676 -2750 11832 11527 10780 10525 1267 -7446 -9470 -4818 1919 -1947
6915 -1947 -16488 -28871 -32384 -18117 -1909 12973 7269 4953 10988 9636 3532 -9656 -19443
6902a9443K792K739R248R192o102r140o522o43j425Q976m664m90N611N74J1869
6887B572J1225N653k189q175r54J2828n226r682j0802K952M813O443l199j2661
6873f402l158O361N311K730O216K293j3923M815j652K327L39n959K989n61n043
6858c317p976J1647P219N620P863q420j4012o670l706O928K229l775N785r36o239
6843g760L811Q484n252j6517k278J292L409J2581L66R83N682j1191Q32J59K629
6828b770N120p56j2086q516J714J5794N907j8872o373J4801J8982K973j3033j1193
6814h308j103M405N403J1533K942M36m267j2897j4008k685J6664n877l560M511
6800f811L515R126R89j2839J752N80O345P203j372n888q799m83m308N821o45r613
$$ plain form
6902 -19443 -16651 -13912 -4664 4528 -1574 -10714 -17236 -17879 -19304 -10328 -14992 -15482 -9871 -9297 2572
6887 2572 13797 19450 17261 9086 8132 20960 15734 6052 -4750 -1798 3015 9458 6259 -6402
6873 -6402 -9560 -3199 2112 4842 11058 13351 -572 4243 2591 4918 5257 -702 2287 1726 -3317
6858 -3317 -11293 354 7573 13193 21056 12636 -1376 -8046 -11752 -4824 -2595 -6370 -585 -1521 -7760
6843 -7760 -3949 4535 -717 -17234 -19512 -18220 -14811 -2230 -1864 -881 4801 -6390 -5558 -5399 -2770
6828 -2770 2350 1594 -10492 -19008 -17294 -1500 4407 -14465 -20838 -6037 12945 15918 2885 -8308
6814 -8308 -9411 -5006 397 11930 14872 15308 11041 -1856 -15864 -18549 -1885 -7762 -11322 -6811
6800 -6811 -3296 5830 6819 -6020 -4268 -3688 2657 9860 8488 2600 -6199 -6682 -10990 -5169 -5814 -15427
6784a5427N961J1092p334n251K408q052j821J1949k282J1555R677R173q514j4457
6770a323o131J789N03M470L426k638N750M279N390K864P844M9j8862q283o102
6755f975o868j9446J621P670J0985M700N647J3274Q31Q32j1267j5434q849K220
6741b1059M011P278M49n977m599o765J3017J129j0277l705Q381J1624L541r147
6727a2099m972l966M953P945j974N850Q601k16n494M692j2840p677R479Q010J092
6712A384k533l039m108R148K03n262l624J0061J830j2834p687k099P609R9j482
6697a2334Q099l409n404N050K721j1481j1594p22j75L5j0023K435J7847J4636
6683d319o744r611k329l300m668J6578J415J001J7214L460q5m476K480n778J222
$$ plain form
6784 -15427 -9466 1626 -5708 -10959 -8551 -16603 -18424 -6475 -8757 2798 12475 21648 13134 -1323
6770 -1323 -7454 -5665 -5162 -692 2734 96 5846 10125 15515 18379 26223 26272 7410 -873 -6975
6755 -6975 -13843 -33289 -31668 -23998 -13013 -8313 -2666 10608 11439 12271 1004 -14430 -23279 -21059
6741 -21059 -17048 -9770 -9321 -15298 -19897 -26662 -13645 -12516 -22793 -26498 -18117 -6493 -2952 -12099
6727 -12099 -17071 -21037 -16084 -8139 -10113 -4263 4338 4122 -1372 3320 -9520 -17197 -7718 292 1384
6712 1384 -1149 -4188 -8296 852 1055 -4207 -7831 2230 4060 -8774 -16461 -18560 -10951 -10852 -12334
6697 -12334 -4235 -7644 -13048 -7998 -5277 -16758 -28352 -29074 -29249 -29214 -39237 -36802 -18955 -4319
6683 -4319 -11063 -20674 -23003 -26303 -30971 -14393 -12978 -11977 5237 8697 8612 4136 6616 838 2060
6668B060K588n767n906O79n197K306P288J3249l085n836l202r177j460O338L709
6653a413o010j3855J113K3781l668J697J6323l029p988R78P037j057l195k51J429
6638A1892k262j1334j0634k324O346k377j1670n754J1537Q782j1799l748J2033
6625a1312J5361P434J2587j4284n819M582J12j532r936L918J2146o450j586j2324
6611g103k936L348n596q053K349M504K277n255K70Q129J6536M392j1431k429M980
6596C982Q65k905q332n172J355l027l690k331J382P622j100o684j1467J8797R719
6581i86l411K526q133M843j3276p787l823P969P758j962J0084M233L079j2958
6567a1844r469K312K5785L545j5788q930J2507q021l384j588l435l304J735O982
$$ plain form
6668 2060 4648 -1119 -7025 -6346 -11543 -9237 -1949 11300 8215 2379 -823 -10000 -11460 -5122 -1413
6653 -1413 -7423 -21278 -20165 3616 -52 1645 17968 14939 6951 7929 14966 13909 10714 10463 11892
6638 11892 9630 -1704 -12338 -14662 -8316 -10693 -22363 -28117 -16580 -7798 -19597 -23345 -11312
6625 -11312 4049 11483 24070 9786 3967 8549 8661 7129 -2807 1111 13257 6807 5221 -7103
6611 -7103 -10039 -6691 -12287 -20340 -17991 -13487 -11210 -16465 -16195 -8066 8470 12862 1431 -998 3982
6596 3982 4847 1942 -6390 -11562 -10207 -13234 -16924 -19255 -17873 -10251 -11351 -18035 -29502 -10705 -986
6581 -986 -4397 -1871 -10004 -5161 -18437 -26224 -30047 -22078 -14320 -16282 -6198 -1965 1114 -11844
6567 -11844 -21313 -19001 6784 10329 -5459 -14389 -1882 -9903 -13287 -14875 -18310 -21614 -19879 -12897
6553a2897M922J0896R977l755j056r163k849r569k638L655J0246N117j027j3742
6539a1883m588N872J0023K679n984l312j0830q760J114J7351J5022R682j7238
6526h52j5739n537J183P698k48p876k541J0501K361N174j0617j0661N738L748
6512a7668J0000R831l703k647K571l48m505J0922k929m170p725Q470J4845L089
6498A6033j6773p573J843k492R877J879j323P346n523j0165J5328j0249j1365
6485a3157R463R400L49R634o366l634M150J1336m068j336p730l977K929j5652
6471h659q275J0585J0131kJ0814m999j0513P040N555R660j330j4143O753q60m729
6456G028j6414r816j357N739o372j5135J1360J2897r715L345p304q728L567M082
$$ plain form
6553 -12897 -7975 2921 12898 9143 8087 -1076 -3925 -13494 -16132 -12477 -2231 2886 1859 -11883
6539 -11883 -16471 -10599 -576 2103 -3881 -7193 -18023 -26783 -25669 -8318 6704 16386 -852
6526 -852 -16591 -22128 -20945 -13247 -13495 -21371 -23912 -13411 -11050 -5876 -16493 -27154 -21416 -17668
6512 -17668 -7668 2163 -1540 -4187 -1616 -1964 -6469 4453 1524 -2646 -10371 -1901 12944 16033
6498 16033 -740 -8313 -6470 -8962 915 2794 1471 8817 3294 -6871 8457 -1792 -13157
6485 -13157 -3694 5706 6055 15689 9323 5689 9839 21175 17107 15771 8041 4064 6993 -8659
6471 -8659 -16934 -6349 3782 3780 14594 9595 -918 6122 11677 21337 20007 5864 12617 11757 7028
6456 7028 -9386 -19202 -20559 -14820 -21192 -36327 -24967 -12070 -21785 -18440 -25744 -34472 -30905 -26823
6442b6823J1850Q283Q415p76k122j944K857j0319M252J203K050m040j1010J0897
6428g227K361K865L028P085L706q827q744L100L039n61n180O043R17n292j3930
6413a7617o899o142K35P497J1041O246k537k625j3353P612J1969J07l117m557
6399a2140Q313J148J0291k14j0616m007p641n145R795j227j126J0242m288q467
6385a5082Q84k436M541O908O769r315J177L938j358q624K418J303j2J03k761l276
6369a4823M355J458J0924J4998n85j2375K896P894K971K925k1998q880J489j889
6355a0640P721J059l525O073Q8O142Q501j030J405n611M357L51j267n77j4005
6340i58j0291M593k523p494j0410P361J5017l205j841R44Q263J4205l204l923
$$ plain form
6442 -26823 -14973 -6690 1725 949 -1173 -3117 -260 -10579 -6327 -5124 -3074 -7114 -18124 -7227
6428 -7227 -4866 -2001 1027 8112 11818 2991 -5753 -2653 386 -175 -5355 688 1605 -3687 -17617
6413 -17617 -24516 -30658 -30423 -22926 -11885 -5639 -8176 -10801 -24154 -16542 -4573 -4466 -7583 -12140
6399 -12140 -3827 -2679 7612 7398 -3218 -7225 -14866 -20011 -10216 -11443 -12569 -2327 -6615 -15082
6385 -15082 -14198 -16634 -12093 -5185 1584 -7731 -6554 -2616 -3974 -12598 -10180 -8877 -8889 -8786 -11547 -14823
6369 -14823 -10468 -9010 1914 16912 16327 3952 6848 14742 17713 20638 -1360 -10240 -8751 -10640
6355 -10640 -2919 -1860 -5385 688 776 6918 15419 14389 15794 10183 14540 14891 13624 13047 -958
6340 -958 -11249 -6656 -9179 -16673 -27083 -19722 -4705 -7910 -9751 -8807 -544 13661 10457 6534
6326F534r10o232j3028N532P448m219m054K132J813J0087M934j1096m489J699
6312c849J4687J5614J324j8789p574L104j119j663o687m978L651K573L601ol267
6297c378p734j225P63J077L021J5761O394j3471r729Q312L740K94n93j500N136
6282F868L080j0944p746p198j0569j122Q702Q971J155J0703J4753r3j3305n176
6268a921q699m877M256K076j3271j048L178j0276R792K7656K68L395q568l262
6254a301k740N952M698j448l026j765p56Q93o048p879R538o133j041L510J1001
6239C455P408K412m634m894o503K883p83k840K523P389J806M902m054q733r8J190
6223A429n236n373J1942l6K477M116J248n950q849K927Q344j3384j6742m500l70
$$ plain form
6326 6534 5624 -608 -13636 -8104 -656 -4875 -8929 -6797 -4984 5103 10037 -1059 -5548 -3849
6312 -3849 10838 26452 27776 8987 1413 4517 3398 1735 -4952 -9930 -6279 -3706 -105 -111 -3378
6297 -3378 -11112 -12337 -11574 -10497 -7476 8285 14679 1208 -8521 -209 3531 3825 3232 1732 6868
6282 6868 9948 -996 -8742 -15940 -26509 -27631 -18929 -9958 -8803 1900 16653 16560 3255 -1921
6268 -1921 -10620 -15497 -11241 -9165 -22436 -23484 -20306 -30582 -20790 6866 7134 10529 1961 -1301
6254 -1301 -4041 1911 6609 5161 2135 370 -386 507 -5541 -13420 -3882 -10015 -11056 -7546 3455
6239 3455 10863 13275 8641 3747 -2756 127 -656 -3496 -973 6416 8222 13124 9070 337 239 1429
6223 1429 -3807 -9180 2762 2726 5203 9319 10567 4617 -4232 -1305 7039 -6345 -23087 -27587 -27957
6208b7957J4690N271K097P788L561j517N720l515n979K337M63l953m230m542R241
6193e25J3112k576L348L802K189M2n878J1973N933q256j8048M625J081j4830M190
6178A82r946j1770K275J9177R464m255J721k694m374J0634P012q222m665j858
6164B681J1410J0434j3305o916O054l800o895j0919P125m479j0980n20N437k24
6150a4897K098K480l925n073n03P259M1j704o362k866L309P874j210j586R110
6135e955Q531j940N735Q126r129j3909l591R94P551P154R35J19o979N077q4q223
6119e588L3K6465k723o19Q766l674j841j836N778k1030o145j274m364k618j2240
6104b2910K086J1735k012p810J3301J2286k61n970j995L877O132q294j8407O937
$$ plain form
6208 -27957 -13267 -7996 -5899 1889 5450 3933 9653 6138 159 2496 2959 -994 -5224 -9766 -525
6193 -525 12587 10011 13359 17161 19350 19392 13514 25487 31420 23164 5116 9741 10822 -4008 182
6178 182 -9764 -21534 -19259 -82 9382 5127 6848 4154 -220 10414 17426 9204 4539 2681
6164 2681 14091 24525 11220 4304 10358 6558 -337 -11256 -4131 -8610 -19590 -20110 -14673 -14897
6150 -14897 -12799 -10319 -14244 -19317 -19820 -12561 -12520 -14224 -20586 -23452 -20143 -12269 -13479 -15065 -5955
6135 -5955 2576 636 6371 14497 5368 -8541 -12132 -11138 -3587 3567 4502 4621 -2358 2719 2635 -5588
6119 -5588 -5555 20910 18187 17568 26334 22660 20819 18983 24761 3731 -2414 -3688 -8052 -10670 -22910
6104 -22910 -20824 -9089 -11101 -18911 -5610 6676 6415 445 -1550 2327 8459 165 -18242 -11305
6090a1305J0127N638j0980o587n939N626J5106M640n17l292j153p241K1494N495
6076B1112o75N33r141l977o584q672n273P002P86m866j2500j745J2312K0264R793
6061A8369j5055o100m50r561Q35O128m211j47l407O321O489k384j5084j515R921
6046i851k582M611J3593k102p544m049l458n568o718k466J1548N59J0795Q499
6032E267j0572k745K921J0537r80O269q363p475j4098q325J5941J2q669l243R426
6017a4097J6298N859q971N482L514Q922n5o090j1427q608o774p292O853M720j2491
6002b4157Q567K148q794J4558J1150L101M242l518l618J3246k090q916p186M279
5988C012j5325J122R930Q918J1177m508o002N02l919q500L582P703n623l317Q517
$$ plain form
6090 -11305 -1178 4460 -6520 -13107 -19046 -13420 1686 6326 5809 2517 1364 -5877 15617 21112
6076 21112 20437 20970 11829 7852 1268 -7404 -12677 -5675 -4889 -9755 -22255 -24000 -11688 8576 18369
6061 18369 3314 -2786 -3236 -12797 -11962 -5834 -10045 -10192 -13599 -7278 -789 -3173 -18257 -19772 -9851
6046 -9851 -12433 -7822 5771 3669 -3875 -7924 -11382 -16950 -23668 -26134 -14586 -14027 -3232 5267
6032 5267 -5305 -8050 -5129 5408 4428 10697 2334 -5141 -19239 -27564 -11623 -11611 -20280 -23523 -14097
6017 -14097 2201 8060 -911 4571 8085 17007 16952 10862 -565 -9173 -15947 -23239 -16386 -11666 -24157
6002 -24157 -15590 -13442 -22236 -7678 3472 6573 10815 7297 3679 16925 14835 5919 -1267 3012
5988 3012 -12313 -11191 -1261 7657 18834 14326 8324 8826 4907 -3593 -11 7692 2069 -1248 7269
$$ [...]
##END NTUPLES=NMR SPECTRUM
##END=
