##TITLE=Analysis number 318118
Compound Code cc 11747
Book Reference 471/30/2
Project Code adrs
Chemist Name carlr
##JCAMPDX= 6.0         $$ Bruker NMR JCAMP-DX V2.0
##DATA TYPE= NMR SPECTRUM
##DATA CLASS= NTUPLES
##ORIGIN= Bruker BioSpin GmbH
##OWNER= nmr
$$ XWIN-NMR		Version 3.5
$$ Thu Mar 16 08:39:48 2006 GMT Standard Time (UT+0h)  MAYBRIDGE\nmr@NMR_250MHZ
##.OBSERVE FREQUENCY= 250.131544655141
##.OBSERVE NUCLEUS= ^1H
##.ACQUISITION MODE= SIMULTANEOUS (DQD)
##.ACQUISITION SCHEME= undefined
##.AVERAGES= 16
##.DIGITISER RES= 18
##SPECTROMETER/DATA SYSTEM= dpx250
##.PULSE SEQUENCE= zg30
##.SOLVENT NAME= CDCl3
##.SHIFT REFERENCE= (INTERNAL, CDCl3, 0, 16.4531)
##AUDIT TRAIL= $$ (NUMBER, WHEN, WHO, WHERE, WHAT)
$$ ##TITLE= Audit trail, XWIN-NMR		Version 3.5
$$ ##JCAMPDX= 5.01
$$ ##ORIGIN= Bruker BioSpin GmbH
$$ ##OWNER= nmr
$$ C:\u/data/dgb/nmr/ADRS/830/pdata/1/auditp.txt
$$ ##AUDIT TRAIL=  $$ (NUMBER, WHEN, WHO, WHERE, WHAT)
(   1,<2006-03-16 08:39:16.34 +000>,<MAYBRIDGE\nmr>,<NMR_250MHZ>,
      <created by zg, POWCHK disabled, PULCHK disabled
       configuration hash MD5:
       84 BC 41 DB A1 6E 1D 46 DA 25 12 A5 C1 ED C5 3A
       data hash MD5: 64K
       5A 5E 17 00 9F A7 23 C1 CB 6C 2F FF D4 6C 73 6F>)
(   2,<2006-03-16 08:39:32.58 +000>,<MAYBRIDGE\nmr>,<NMR_250MHZ>,
      <Start of raw data processing
       ef LB = 0.3 FT_mod = 6 PKNL = 1 SI = 32K 
       data hash MD5: 32K
       B4 D4 D1 08 4A 57 20 AD 74 01 F9 2F FC 5A 33 FE>)
(   3,<2006-03-16 08:39:36.58 +000>,<MAYBRIDGE\nmr>,<NMR_250MHZ>,
      <apk 
       data hash MD5: 32K
       0B 3C 73 69 E9 BF 2C E3 DF 2C F7 09 3F D6 88 76>)
(   4,<2006-03-16 08:39:38.03 +000>,<MAYBRIDGE\nmr>,<NMR_250MHZ>,
      <abs ABSG = 5 
       data hash MD5: 32K
       15 8B F1 E4 6F DD 00 84 ED F9 98 28 22 22 91 42>)
$$ ##END=
$$ 
$$ hash MD5
$$ 3D 1D 21 5C CC 1A 2E 71 54 6A 76 45 D9 53 A7 BD
##$RELAX= 
##$RELAX= 
##$RELAX= 
##$RELAX= 
##$RELAX= 
##$RELAX= 
##$RELAX= 
$$ Bruker specific parameters
$$ --------------------------
##$DU= <C:\u>
##$EXPNO= 830
##$NAME= <ADRS>
##$PROCNO= 1
##$TYPE= <nmr>
##$USER= <dgb>
##$AMP= (0..31)
100 100 100 100 100 100 100 100 100 100 100 100 100 100 100 100 100 100 
100 100 100 100 100 100 100 100 100 100 100 100 100 100 
##$AQSEQ= 0
##$AQ_mod= 3
##$AUNM= <au_zg>
##$AUTOPOS= <5 >
##$BF1= 250.13
##$BF2= 250.13
##$BF3= 250.13
##$BF4= 250.13
##$BF5= 500.13
##$BF6= 500.13
##$BF7= 500.13
##$BF8= 500.13
##$BYTORDA= 1
##$CFDGTYP= 0
##$CFRGTYP= 5
##$CHEMSTR= <none>
##$CNST= (0..31)
1 1 145 1 1 1 1 1 1 1 1 1 1 1 1 1 1 1 1 1 1 1 1 1 1 1 1 1 1 1 1 1 
##$CPDPRG= <>
##$CPDPRG1= <>
##$CPDPRG2= <>
##$CPDPRG3= <>
##$CPDPRG4= <mlev>
##$CPDPRG5= <mlev>
##$CPDPRG6= <mlev>
##$CPDPRG7= <mlev>
##$CPDPRG8= <mlev>
##$CPDPRGB= <>
##$CPDPRGT= <>
##$D= (0..31)
0 1 0 0 0 0 0 0 0 0.06 0 0 0 0 0 0 0.0002 0 0 0 0 0 0 0 0 0 0 0 0 0 0 
0 
##$DATE= 1142498354
##$DBL= (0..7)
120 120 120 120 120 120 120 120 
##$DBP= (0..7)
150 150 150 150 150 150 150 150 
##$DBP07= 0
##$DBPNAM0= <>
##$DBPNAM1= <>
$$ [...]
##$SUBNAM7= <"">
##$SUBNAM8= <"">
##$SUBNAM9= <"">
##$SW= 20.6930455092707
##$SWIBOX= (0..15)
0 0 3 0 0 0 0 0 0 0 0 0 0 0 0 0 
##$SW_h= 5175.983436853
##$TD= 65536
##$TD0= 1
##$TE= 294.16
##$TE2= 300
##$TE3= 300
##$TEG= 300
##$TL= (0..7)
0 120 120 120 120 120 120 120 
##$TP= (0..7)
150 150 150 150 150 150 150 150 
##$TP07= 0
##$TPNAME0= <>
##$TPNAME1= <>
##$TPNAME2= <>
##$TPNAME3= <>
##$TPNAME4= <>
##$TPNAME5= <>
##$TPNAME6= <>
##$TPNAME7= <>
##$TPOAL= (0..7)
0.5 0.5 0.5 0.5 0.5 0.5 0.5 0.5 
##$TPOFFS= (0..7)
0 0 0 0 0 0 0 0 
##$TUNHIN= 0
##$TUNHOUT= 0
##$TUNXOUT= 0
##$USERA1= <user>
##$USERA2= <user>
##$USERA3= <user>
##$USERA4= <user>
##$USERA5= <user>
##$V9= 5
##$VALIST= <valist>
##$VCLIST= <CCCCCCCCCCCCCCC>
##$VD= 0
##$VDLIST= <DDDDDDDDDDDDDDD>
##$VPLIST= <PPPPPPPPPPPPPPP>
##$VTLIST= <TTTTTTTTTTTTTTT>
##$WBST= 1024
##$WBSW= 4
##$XGAIN= (0..3)
0 0 0 0 
##$XL= 0
##$YL= 0
##$YMAX_a= 343957
##$YMIN_a= -304992
##$ZGOPTNS= <>
##$ZL1= 120
##$ZL2= 120
##$ZL3= 120
##$ZL4= 120
##$ABSF1= 16.45312
##$ABSF2= -4.240053
##$ABSG= 5
##$ABSL= 3
##$ALPHA= 0
##$AQORDER= 0
##$ASSFAC= 0
##$ASSFACI= 0
##$ASSFACX= 0
##$ASSWID= 0
##$AUNMP= <proc_1d>
##$AZFE= 0.1
##$AZFW= 0.1
##$BCFW= 0
##$BC_mod= 0
##$BYTORDP= 0
##$COROFFS= 0
##$CY= 12.5
##$DATMOD= 1
##$DC= 0
##$DFILT= <>
##$DTYPP= 0
##$F1P= 14.0000005364418
##$F2P= -0.99999901652339
##$FCOR= 0.5
##$FTSIZE= 32768
##$FT_mod= 6
##$GAMMA= 0
##$GB= 0
##$INTBC= 1
##$INTSCL= 1
##$ISEN= 128
##$LB= 0.3
##$LEV0= 0
##$LPBIN= 0
##$MAXI= 10000
##$MC2= 0
##$MEAN= 0
##$ME_mod= 0
##$MI= 0
##$NCOEF= 0
##$NC_proc= -4
##$NLEV= 6
##$NOISF1= 0
##$NOISF2= 0
##$NSP= 0
##$NTH_PI= 0
##$NZP= 0
##$OFFSET= 16.45312
##$PC= 1
##$PHC0= 177.9571
##$PHC1= 8.035585
##$PH_mod= 1
##$PKNL= yes
##$PPARMOD= 0
##$PSCAL= 4
##$PSIGN= 0
##$REVERSE= no
##$SF= 250.130017226462
##$SI= 32768
##$SIGF1= 0
##$SIGF2= 0
##$SINO= 400
##$SIOLD= 32768
##$SREGLST= <1H.CDCl3>
##$SSB= 0
##$STSI= 32768
##$STSR= 0
##$SW_p= 5175.98343685301
##$SYMM= 0
##$S_DEV= 0
##$TDeff= 65536
##$TDoff= 0
##$TI= <Analysis number 999999
Compound Code 99
Book Reference 9
Project Code 9>
##$TILT= no
##$TM1= 0
##$TM2= 0
##$TOPLEV= 0
##$USERP1= <user>
##$USERP2= <user>
##$USERP3= <user>
##$USERP4= <user>
##$USERP5= <user>
##$WDW= 1
##$XDIM= 32768
##$YMAX_p= 401085253
##$YMIN_p= -399466
$$ End of Bruker specific parameters
$$ ---------------------------------
##NTUPLES= NMR SPECTRUM
##VAR_NAME=  FREQUENCY,     SPECTRUM/REAL,   SPECTRUM/IMAG
##SYMBOL=    X,             R,               I
##VAR_TYPE=  INDEPENDENT,   DEPENDENT,       DEPENDENT
##VAR_FORM=  AFFN,          ASDF,            ASDF
##VAR_DIM=   32768,         32768,           32768
##UNITS=     HZ,            ARBITRARY UNITS, ARBITRARY UNITS
##FACTOR=    0.157963299565203, 1,           1
##FIRST=     4115.41900842369, 0,            0
##LAST=      -1060.56442842932, 0,           0
##MIN=       -1060.56442842932, -399466,     0
##MAX=       4115.41900842369, 401085253,    0
$$ Real data points
##PAGE= N=1
##DATA TABLE= (X++(R..R)), XYDATA
$$ [...]
$$ plain form
17370 13854 -14802 41464 43767 19725 28062 -54178 -158200 -166724 -124602 -58475 70509 69250
17358 69250 86396 33596 -12368 -69872 9206 102302 74295 86408 49312 9786 27051 63274
17346 63274 40262 32108 69245 -63824 -143316 -150720 -32610 51814 40630 -3576 42318 -59046
17334 -59046 -114677 -162647 -75048 20606 26281 -6870 -79305 -146115 -112433 -137982 -129485 -45906
17322 -45906 18746 53393 -42474 -99797 -54270 -69244 -36866 -161 -23979 33866 31488 54450
17310 54450 141029 102398 -38849 -48744 30112 71213 127313 125620 166140 156561 85969 -21835
17298 -21835 -72514 -13056 16762 16591 5123 -81158 -116331 -106046 -163444 -138000 -16390 13154
17286 13154 -2156 53853 -12776 -85159 -74427 -16602 84173 215941 147025 45384 -75266
$$ packed form
17370A3854k8656N6266K303k4042Q337q2240j04022q524M2122O6127J28984j259
17358F9250J7146n2800m5964n7504P9078R3096k8007J2113l7096l9526J7265L6223
17346F3274k3012q154L7137j33069p9492p404J18110Q4424j1184m4206M5894j01364
17334e9046n5631m7970Q7599R5654N675l3151p2435o6810L3682k5549Q497Q3579
17322d5906O4652L4647r5867n7323M5527j4974L2378L6705k3818N7845k378K2962
17310E4450Q6579l8631j41247r895P8856M1101N6100j693M0520r579p0592j07804
17298b1835n0679N9458K9818j71j1468q6281l5173J0285n7398K5444J21610K9544
17286A3154j5310N6009o6629p2383J0732N7825J00775J31768o8916j01641j20650
$$ plain form
17275 -75266 -14958 40026 44281 -9066 55447 -33363 -42552 -83585 -159202 -101783 -15156 53458
17263 53458 60725 -124716 -263341 -188270 -151053 -139779 -76959 -101672 -82606 6604 -15775
17252 -15775 -59560 -121246 -82284 14456 97280 85585 128305 113519 61619 143980 221501 187176
17240 187176 139917 86902 -40842 -114206 -29379 46742 7933 44106 80789 45643 41361
17229 41361 38275 76863 75796 36086 -29553 -114696 -159950 -167820 -55116 -61210 -101975 -127307
17217 -127307 -112380 -22716 -66067 -22090 -53727 -61745 -47964 -113577 -203170 -215492 -104568
17206 -104568 -93182 -90938 -43092 -13208 -76147 -79064 -29028 15165 -29036 2746 55171 -550
17194 -550 -124432 -85214 -98439 -98543 -55714 -81173 -99403 -207522 -212513 -41147 48025 -15458
$$ packed form
17275g5266O0308N4984M255n3347O4513q8810r189m1033p5617N7419Q6627O8614
17263E3458P267j85441j38625P5071L7217J1274O2820k4713J9066Q9210k2379
17252a5775m3785o1686L8962R6740Q2824j1695M2720j4786n1900Q2361P7521l4325
17240A87176m7259n3015j27744p3364Q4827P6121l8809L6173L6683l5146m282
17229D1361l086L8588j067l9710o5639q5143m5254p870J12704o094m0765k5332
17217a27307J4927Q9664m3351M3977l1637q018J3781o5613q9593j2322J10924
17206a04568J1386K244M7846K9884o2939k917N0036M4193m4201L1782N2425n5721
17194e50j23882L9218j3225j04M2829k5459j8230j08119m991J71366Q9172o3483
$$ plain form
17182 -15458 -86449 -117005 -105859 -130123 -66564 -34004 -40150 -37322 -65167 -23419 18218 59521
17170 59521 102440 155841 109221 66684 123396 72527 47159 40374 53475 -37387 -133033 -125844
17158 -125844 -169736 -104028 -13267 16388 47132 69933 90282 153021 127836 86833 60972
17147 60972 -4270 115344 88478 75481 129942 142104 128044 91747 132735 93488 89453 91889
17135 91889 70535 36293 -47602 -151793 -79553 -36492 31862 69101 76650 37950 -10645 -153419
17123 -153419 -165295 -86834 -124619 -127729 -177865 -266267 -224944 -168961 -218512 -253751 -151783
17112 -151783 -63620 -89515 -161354 -99600 -3565 -16046 -46057 -20151 93366 61766 71888
17101 71888 -3320 -24771 -12614 -7864 -22324 -53290 -68783 -28380 57250 -52198 -209358
$$ packed form
17182a5458p0991l0556J1146k4264O3559L2560o146K828k7845M1748M1637M1303
17170E9521M2919N3401m6620m2537N6712n0869k5368o785J3101r0862r5646P189
17158a25844m3892O5708R0761K9655L0744K2801K0349O2739k5185m1003k5861
17147F0972o5242J19614k6866j2997N4461J2162j4060l6297M0988l9247m035K436
17135I1889k1354l4242q3895j04191P2240M3061O8354L7239P549l8700m8595j42774
17123a53419j1876P8461l7785l110n0136q8402M1323N5983m9551l5239J01968
17112a51783Q8163k5895p1839O1754R6035j2481l0011K5906J13517l1600J0122
17101G1888p5208k1451J2157M750j4460l0966j5493M0403Q5630j09448j57160
$$ plain form
17090 -209358 -229582 -160761 -118398 -132200 -31833 96382 42965 -30352 -11439 -11864 5476
17079 5476 -34262 -71278 60111 177858 129584 68832 -36814 40127 24434 -5616 27819
17068 27819 -15281 -37076 -68625 -73940 -103555 -72546 -28050 19953 25060 28629 39047 -12530
17056 -12530 -78823 2654 4499 31066 99684 46700 -31181 -23550 -67891 -41746 1312 -135866
17044 -135866 -185386 -92371 45898 48961 1177 11922 37933 61715 -39687 -56180 58568
17033 58568 43105 21843 61791 102043 140848 14176 140404 239864 209747 155776 158683
17022 158683 96277 21690 16890 53076 28558 57501 29093 33555 82762 81327 60698 127650
17010 127650 245784 232319 172076 97878 62592 -4061 -52135 -677 30926 105113 198990
$$ packed form
17090b09358k0224O8821M2363j3802J00367J28215n3417p3317J8913m25J7340
17079E476l9738l7016J31389J17747m8274o0752j05646P6941j5693l0050L3435
17068B7819m3100k1795l1549n315k9615L1009M4496M8003N107L569J0418n1577
17056a2530o6293Q1477J845K6567O8618n2984p7881P631m4341K6145M3058j37178
17044a35866m9520R3015J38269L063m7784J0745K6011K3782j01402j6493J14748
17033E8568j5463k1262L9948M0252L8805j26672J26228R9460l0117n3971K907
17022A58683o2406p4587m800L6186k4518K8943k8408M462M9207j435k0629O6952
17010A27650J18134j3465o0243p4198l5286o6653m8074N1458L1603P4187R3877
$$ plain form
16999 198990 238295 177580 43984 30646 20708 8375 -14586 57194 20712 22065 -74343 3598
16987 3598 10076 8478 110062 157438 104399 -3010 -20830 5963 33350 139423 120996 63013
16975 63013 -779 39987 50610 32632 -41299 18584 120726 167193 165068 202635 133615 -26067
16963 -26067 -52045 42150 77501 -14583 79984 105624 -28495 21298 76203 33258 94811
16952 94811 128599 109647 113512 121211 100543 70666 7115 -17203 3477 49515 -35334 -29492
16940 -29492 65671 48311 -98125 -131997 -72954 55392 33582 2741 -25597 -39127 -39348 -66940
16928 -66940 -120967 -240957 -158493 -57194 -35211 6346 34269 86920 119182 60127 22010
16917 22010 81113 104384 68922 94513 134934 56962 17667 30629 82105 26220 -58022 -71735
$$ packed form
16999A98990L9305o0715j33596j3338r938j2333k2961P1780l6482J353r6408P7941
16987C598O478j598J01584M7376n3039j07409j7820K6793K7387J06073j8427n7983
16975F3013o3792M0766J0623j7978p3931N9883J02142M6467k125L7567o9020j59682
16963b6067k5978R4195L5351r2084R4567K5640j34119M9793N4905m2945O1553
16952I4811L3788j8952L865P699k0668k9877o3551k4318K0680M6038q4849N842
16940b9492R5163j7360j46436l3872N9043J28346k1810l0841k8338j3530k21k7592
16928f6940n4027j19990Q2464J01299K1983M1557K7923N2651L2262n9055l8117
16917B2010N9103K3271l5462K5591M0421p7972l9295J2962N1476n5885q4242j3713
$$ plain form
16905 -71735 -80907 -110140 -119709 -84529 -139126 -145213 -71386 -29422 -10577 -54124 35984 122972
16893 122972 68563 45403 76404 48028 58046 105555 -56588 -156781 -184005 -12165 125059
16882 125059 61513 -3585 -48628 -9991 95166 63206 87878 -55548 -45273 -35507 -50546
16871 -50546 -130264 -92083 -113180 -227927 -161209 -89838 -8662 91183 95138 -74226 -217736
16860 -217736 -252864 -218269 -111987 708 64817 29279 3435 13893 -7991 -58668 -150885
16849 -150885 -172658 -79602 -75636 -82654 -92496 -87042 1280 16597 -90836 9726 205805 246526
16837 246526 161663 68544 100253 106006 224463 334730 209464 160569 107489 74812 79046
16826 79046 53570 17852 -73375 -89406 -60990 5864 133723 65849 9007 3898 -55426 -5808
$$ packed form
16905g1735r172k9233r569L5180n4597o087P3827M1964J8845m3547R0108Q6988
16893A22972n4409k3160L1001k8376J0018M7509j62143j00193k7224J71840J37224
16882A25059o3546o5098m5043L8637J05157l1960K4672j43426J0275R766j5039
16871e0546p9718L8181k1097j14747O6718P1371Q1176R9845L955j69364j43510
16860b17736l5128L4595J06282J12695O4109l5538k5844J0458k1884n0677r2217
16849a50885k1773R3056L966p018r842N454Q8322J5317j07433J00562J96079M0721
16837B46526q4863r3119L1709N753J18457J10267j25266m8895n3080l2677M234
16826G9046k5476l5718r1227j6031K8416O6854J27859o7874n6842n109n9324M9618
$$ plain form
16814 -5808 90493 -31774 -3258 51684 -6317 -60529 -30868 22050 -12849 -22514 -64681 -92550
16802 -92550 -42869 -34902 -149709 -113923 -65795 -71340 -166263 -242183 -275612 -303234 -207339 -18601
16790 -18601 60768 -31455 9369 48857 34059 6188 -5987 29053 -60985 -174146 -188689
16779 -188689 -92505 -89487 -60554 -60780 -54329 -48456 26251 -149474 -164939 -53782 -82265 -39061
16767 -39061 96949 36326 -54701 -72483 -144667 -77427 -78535 1958 43195 15361 -8060 -16131
16755 -16131 -47964 -73003 50708 93739 95468 37677 -69633 -10008 -11422 6459 21783 46711
16743 46711 -129157 -219466 -171804 -84572 -440 63111 49008 29942 46715 22539 97007
16732 97007 4999 -22995 66101 63019 -23645 19412 57198 130162 80476 -51261 -86427 -55585
$$ packed form
16814e808R6301j22267K8516N4942n8001n4212K9661N2918l4899r665m2167k7869
16802i2550M9681P967j14807L5786M8128n545r4923p5920l3429k7622R5895J88738
16790a8601P9369r2223M0824L9488j4798k7871j2175L5040r0038j13161j4543
16779a88689R6184L018K8933k26O451N873P4707j75725j5465J11157k8483M3204
16767c9061J36010o0623r1027j7782p2184O7240j108Q0493M1237k7834k3421q071
16755a6131l1833k5039J23711M3031J729n7791j07310N9625j414J7881J5324K4928
16743D6711j75868r0309M7662Q7232Q4132O3551j4103j9066J6773k4176P4468
16732I7007r2008k7994Q9096l082q6664M3057L7786P2964m9686j31737l5166L0842
$$ plain form
16720 -55585 -39315 -26923 -52441 -84517 -88300 -60082 -129508 -133176 -16953 46022 -96850 -157999
16708 -157999 -157208 -72706 -19869 -8411 -42475 3815 40746 -40078 -89123 -129723 -64731 -42440
16696 -42440 -39143 -96111 -187234 -131937 -148398 -194183 -132977 -174623 -114571 -61354 -21456 35273
16684 35273 -56 -1879 -69220 -34503 31765 81971 145799 110759 162345 56510 -27617 -142216
16672 -142216 -150119 -169264 -142861 -120091 -74323 -49067 -35518 -10006 -79255 -45475 -56742 -88733
16660 -88733 -61406 -17982 9058 57119 99414 77559 106152 112177 155443 107199 -74380 -82301
16648 -82301 37107 59972 -4222 -46937 -47164 14367 -1901 -1225 -16013 -82639 -64665 9610
16636 9610 5852 31639 59432 27191 974 -31720 66377 145180 65918 106243 79152 18461
$$ packed form
16720e5585J6270J2392k5518l2076l783K8218o9426l668J16223O2975j42872o1149
16708a57999P91Q4502N2837J1458l4064M6290L6931q0824m9045m0600O4992K2291
16696d2440L297n6968r1123N5297j6461m5785O1206m1646O0052N3217L9898N6729
16684C5273l5329j823o7341L4717O6268N0206O3828l5040N1586j05835q4127j14599
16672a42216p903j9145K6403K2770M5768K5256J3549K5512o9249L3780j1267l1991
16660h8733K7327M3424K7040M8061M2295k1855K8593O025M3266m8244j81579p921
16648h2301J19408K2865o4194m2715k27O1531j6268O76j4788o6626J7974P4275
16636I610l758K5787K7793l2241k6217l2694R8097P8803p9262M0325k7091o0691
$$ plain form
16624 18461 -28419 -16134 99762 141997 198367 131801 101906 104666 92349 14855 -91705
16613 -91705 -123971 -109437 -73363 -1856 45409 47340 88879 125586 84902 83895 6678 -125417
16601 -125417 -153703 -150598 -87009 -100752 -64333 -14993 -22315 -83199 -50391 -36868 -8604 -24948
16589 -24948 -50905 -4789 26239 15138 -53066 -84331 64951 35962 -15825 -159027 -252197
16578 -252197 -251568 -207483 -103097 -17935 14724 -4563 -110999 -129218 -17258 43467 31249
16567 31249 -106474 -244227 -119907 -117917 -74694 5645 -30645 -82211 -38977 -24133 27644
16556 27644 -18612 -119547 -119240 -82210 -95991 -80968 -7901 -50807 -106770 -87414 -38806 -88695
16544 -88695 -95576 34283 112309 169806 141020 168478 204269 174789 18021 14714 19885 56977
$$ packed form
16624A8461m6880J2285J15896M2235N6370o6566k9895K760j2317p7494j06560
16613i1705l2266J4534L6074P1507M7265J931M1539L6707m0684j007p7217j32095
16601a25417k8286L105O3589j3743L6419M9340p322o0884L2808J3523K8264j6344
16589b4948k5957M6116L1028j1101o8204l1265J49282k8989n1787j43202r3170
16578b52197O29M4085J04386Q5162L2659j9287j06436j8219J11960O0725j2218
16567C1249j37723j37753J24320J990M3223Q0339l6290n1566M3234J4844N1777
16556B7644m6256j00935L07L7030j3781J5023P3067m2906n5963J9356M8608m9889
16544h8695o881J29859P8026N7497k8786K7458L5791k9480j56768l307N171L7092
$$ plain form
16532 56977 84264 -111291 -155570 -30960 24984 11712 -36643 -14930 -21136 -42261 -56006
16521 -56006 85013 128191 52198 113872 184660 118505 99079 124712 122304 67313 106603 175841
16509 175841 72471 -7241 -73968 -168731 -94002 -7339 -25140 -26466 -138025 -65281 19272
16498 19272 -78829 -564 6208 -9557 65309 53852 17290 61020 143056 268977 197336 127638
16486 127638 74112 75159 34498 74609 75041 85443 32428 -86551 -169768 -58282 4451 -10499
16474 -10499 25874 48345 8205 -60128 -101546 -141456 -107405 -114124 -91579 -13375 51441 54204
16462 54204 -45942 19842 42396 20171 15892 -76195 -116453 -108953 -45200 10348 11277 20430
16450 20430 -89271 -85582 -98021 -63858 -19135 -31024 -95823 -99232 -233055 -135806 101944
$$ packed form
16532E6977K7287j95555m4279J24610N5944j3272m8355K1713o206k1125j3745
16521e6006J41019M3178p5993O1674P0788o6155j9426K5633k408n4991L9290O9238
16509A75841j03370p9712o6727r4763P4729Q6663j7801j326j11559P2744Q4553
16498A9272r8101P8265O772j5765P4866j1457l6562M3730Q2036J25921p1641o9698
16486A27638n3526J047m0661M0111M32J0402n3015j18979q3217J11486O2733j4950
16474a0499L6373K2471m0140o8333m1418l9910L4051o719K2545P8204O4816K763
16462E4204j00146O5784K2554k2225m279r2087m0258P500O3753N5548R29R153
16450B0430j09701L689j2439L4163M4723j1889o4799l409j33823R7249K37750
$$ plain form
16439 101944 62882 -6864 24255 124921 300178 170616 -34337 -175779 -87496 -14303
16429 -14303 10907 65806 92721 910 -30674 -53999 -48825 -105664 -115424 -69987 36900 -6898
16417 -6898 -45104 -73025 -76207 29249 149937 143773 116147 58290 13975 -85977 -55378 43978
16405 43978 25052 -52035 -70616 -112732 -12929 39287 23736 -72291 -167713 -57180 19903
16394 19903 -171 -73523 -215848 -146285 16375 70767 82880 78577 79860 59934 -16275 -7968
16382 -7968 -20278 1066 351 -83905 -122668 -165857 -162381 -135847 -46255 30767 11397 -70239
16370 -70239 -98685 -124355 -138237 -101814 -30123 -29093 69914 120772 129517 172186 171608 12119
16358 12119 58649 27342 -80085 -134900 -46457 21475 140571 234424 229468 148653 78348
$$ packed form
16439A01944l9062o9746L1119J00666J75257j29562k04953j41442Q8283P3193
16429a4303K5210N4899K6915r1811l1584k3325N174n6839r760M5437J06887m3798
16417f898l8206k7921l182J05456J20688o164k7626n7857m4315r9952L0599R9356
16405D3978j8926p7087j8581m2116R9803N2216j5551r6027r5422J10533P7083
16394A9903k0074p3352j42325O9563J62660N4392J2113m303J283j9926p6209Q307
16382g968j2310K1344p15q4256l8763m3189L476K6534Q9592P7022j9370q1636
16370g0239k8446k5670j3882L6423P1691J030R9007N0858Q745M2669n78j59489
16358A2119M6530l1307j07427n4815Q8443O7932J19096R3853m956q0815p0305
$$ plain form
16347 78348 -53266 -168768 -257227 -270034 -176904 -70461 -4434 13877 2354 -8472 -53449
16336 -53449 -3110 30530 21453 124690 121089 58630 15814 -108195 -140263 -156784 -194874 -209775
16324 -209775 -129047 -103771 -34354 8697 30836 133645 174799 142229 172019 180570 98888
16313 98888 82497 93008 83046 -17419 -65710 -110975 -154122 -101911 -70903 -13025 78064 54229
16301 54229 28240 20256 -3721 -95910 -122367 -158960 -40216 30869 -28777 -148 38480 104693
16289 104693 111358 143026 173848 76085 28664 54517 -38108 -85283 -159765 -175140 -132851 -83515
16277 -83515 -62114 -87678 -70400 -91238 -26604 98349 139381 19210 -75359 -95361 -89969
16266 -89969 -26851 -73385 -135915 -87175 -101496 -32402 -58876 -30958 -28883 -81358 -89211 -103334
$$ packed form
16347G8348j31614j15502q8459j2807R3130J06443O6027J8311j1523j0826m4977
16336e3449N0339L3640r077J03237l601o2459m2816j24009l2068j6521l8090j4901
16324b09775Q0728K5276O9417M3051K2139J02809M1154l2570K9790Q551q1682
16313I8888j6391J0511r962j00465m8291m5265m3147N2211L1008N7878R1089k3835
16301E4229k5989p984k3977r2189k6457l6593J18744P1085n9646K8629L8628O6213
16289A04693O665L1668L0822r7763m7421K5853r2625m7175p4482j5375M2289M9336
16277h3515K1401k5564J7278k0838O4634J24953M1032j20171r4569k0002N392
16266h9969O3118m6534o2530M8740j4321O9094k6474K7918K075n2475p853j4123
$$ plain form
16254 -103334 -95487 -125654 -81624 -39972 -68380 -129330 -144744 -92013 -118415 -134998 -121111 -141887
16242 -141887 -57781 -4364 29568 17840 15244 30868 98340 -40058 -49874 61868 47427
16231 47427 -85349 -161205 -142758 -174191 -85981 -74817 -38265 72275 124412 26543 75779
16220 75779 106304 113260 16378 54544 45195 83052 167269 231063 118738 56017 15332 32759
16208 32759 -52360 -111094 -150849 -168972 -17422 109481 72894 48675 20388 -39132 -72031
16197 -72031 -41112 13366 97084 87652 86353 109343 202855 289927 306439 315701 153345 195933
16185 195933 199735 121428 94703 52989 -31069 -107828 -109208 -134128 -118446 -29316 -89242 -74822
16173 -74822 -17239 -27298 21781 47882 51456 134981 175503 48146 71973 98398 38933 -81594
$$ packed form
16254a03334P847l0167M4030M1652k8408o0950j5414N2731k6402j6583J3887k0776
16242a41887Q4106N3417L3932j1728k596J5624O7472j38398r816J11742j4441
16231D7427j32776p5856J8447l1433Q8210J1164L6552J10540N2137r7869M9236
16220G5779L0525O956r6882L8166r349L7857Q4217O3794j12325o2721m0685J7427
16208C2759q5119n8734l9755j8123J51550J26903l6587k4219k8287n9520l2899
16197g2031L0919N4478Q3718r432j299K2990R3512Q7072J6512R262j62356M2588
16185A95933L802p8307k6725m1714q4058p6759j380k4920J5682Q9130n9926J4420
16173g4822N7583j0059M9079K6101L574Q3525M0522j27357K3827K6425n9465j20527
$$ plain form
16161 -81594 -58413 65042 153134 223554 75036 -28443 52953 82035 22495 41137 -8536
16150 -8536 -1360 26811 93316 108679 181699 219059 185316 207130 52760 -14414 129547 138365
16138 138365 59555 116825 162549 187616 36193 -60824 26900 120600 -18070 -112163 -41809
16127 -41809 -4127 -99903 -163240 -105649 35583 52947 -34511 21035 31019 -83656 -133594
16116 -133594 -64720 -31527 18277 96117 123827 110091 123553 73508 90069 242354 243407
16105 243407 109160 73313 83674 96687 7434 1373 -22195 2027 96611 105046 55100 12749
16093 12749 7863 -5366 -28507 19371 113733 105075 97766 64560 31017 43646 18306 -76551
16081 -76551 -89718 -103878 -57340 -100796 -106058 5074 -45404 -54311 -26891 32653 -7121 -62246
$$ packed form
16161h1594K3181J23455Q8092P0420j48518j03479Q1396K9082n9540J8642m9673
16150h536P176K8171O6505J5363P3020L7360l3743K1814j54370o7174J43961Q818
16138A38365p8810N7270M5724K5067j51423r7017Q7724R3700j38670r4093P0354
16127d1809L7682r5776o3337N7591J41232J7364q7458N5546R984j14675m9938
16116a33594O8874L3193M9804P7840K7710j3736J3462n0045J6561J52285J053
16105B43407j34247l5847J0361J3013q9253o061k3568K4222R4584Q435m9946m2351
16093A2749m886j3229k3141M7878R4362q658p309l3206l3543J2629k5340r4857
16081g6551j3167j4160M6538m3456n262J11132n0478q907K7420N9544l9774n5125
$$ plain form
16069 -62246 -121415 -110512 -83903 33500 75421 -2441 -36634 65761 76501 67896 7869
16058 7869 -33792 15136 35060 52823 -18056 66549 118352 117871 139381 86400 10562 -105708
16046 -105708 -79477 -124959 -232676 -282755 -239867 -277142 -173313 -61269 -81982 -141289 -141633
16035 -141633 -32935 18878 11944 37236 72141 53448 94939 164828 153722 160689 42103
16024 42103 -15527 8840 87835 80301 29728 66313 58586 83664 78907 170649 205563 159956
16012 159956 -20159 -141872 -30559 145194 190928 -27486 -146483 -108665 -8818 39195
16002 39195 -57409 -196078 -191612 -173612 -116459 -53651 -102219 -51359 -38932 -122702 -93538 -28877
15990 -28877 -142238 -81888 -1658 49677 47815 2422 -57738 -117187 -115631 -88071 -137802 -42995
$$ packed form
16069f2246n9169J0903K6609J17403M1921p7862l4193J02395J0740q605o0027
16058G869m1661M8928J9924J7763p0879Q4605N1803m81K1510n2981p5838j16270
16046a05708K6231m5482j07717n0079M2888l7275J03829J12044k0713n9307l44
16035a41633J08698N1813o934K5292L4905j8693M1491O9889j1106O967j18586
16024D2103n7630K4367P8995p534n0573L6585p727K5078m757R1742L4914m5607
16012A59956j80115j21713J11313J75753M5734k18414j18997L7818R9847M8013
16002C9195r6604j38669M466J8000N7153O2808m8568N0860J2427q3770K9164O4661
15990b8877j13361O0350Q0230N1335j862m5393o0160n9449J556K7560m9731R4807
$$ plain form
15978 -42995 -59 53796 45634 69348 12846 12795 128736 147981 87153 125172 171278 109416
15966 109416 32631 13682 -85104 -26058 9531 20882 4373 47538 105365 60495 79989
15955 79989 97483 86239 27100 -65881 -68096 -67460 -77294 -64754 -6390 52571 23296 -36663
15943 -36663 16522 2601 -80619 -106100 -67217 -30766 -83495 -192820 -154693 -152262 -119557 -61310
15931 -61310 -21075 47745 118513 93243 138051 124475 -22112 19759 96647 141371 54913
15920 54913 -42362 -6255 140673 83689 34044 59283 75849 32528 -63379 -70136 5940 58454
15908 58454 160440 271719 272881 163204 83679 48450 43381 49411 -17213 -25774 -78523 -69417
15896 -69417 10131 14610 -26363 -54132 -103080 -126986 -106988 -31694 -155174 -149373 -62328 -49731
$$ packed form
15978d2995M2936N3855q162K3714n6502n1J15941J9245o0828L8019M6106o1862
15966A09416p6785j8949r8786N9046L5589J1351j6509M3165N7827m4870J9494
15955G9989J7494j1244n9139r2981k215O36r834J2540N8364N8961k9275n9959
15943c6663N3185j3921q3220k5481L8883L6451n2729j09325L8127K431L2705N8247
15931f1310M0235O8820P0768k5270M4808j3576j46587M1871P6888M4724q6458
15920E4913r7275L6107J46928n6984m9645K5239J6566m3321r5907o757P6076N2514
15908E8454J01986J11279J162j09677p9525l5229n069O030o6624q561n2749R106
15896f9417P9548M479m0973k7769m8948k3906J9998P5294j23480N801Q7045J2597
$$ plain form
15884 -49731 -25898 14809 -77691 -130048 -115432 -74350 -128584 -119983 -83920 -68563 -104897 -47315
15872 -47315 44723 77267 29655 14575 17076 -26913 -24090 -42133 133 -78569 -152842 -58801
15860 -58801 21079 44816 117617 189889 180442 97476 7233 33458 58163 15317 -87411 23281
15848 23281 100275 92781 -70776 -118612 -104725 -152521 -88686 34990 56053 -39694 -83612
15837 -83612 -121583 -69523 91915 9582 29157 18247 -6748 -797 1093 -39105 -30511 -64565
15825 -64565 18781 112944 32965 6468 -27848 -108977 -107217 -59024 -9141 -39747 16154 -11415
15813 -11415 14740 24420 19054 97636 190581 164230 78568 -30550 -153409 -119053 -93866 -52576
15801 -52576 -11785 106620 189589 160687 84309 77918 -20756 -71852 -91610 -35790 10929 18227
$$ packed form
15884d9731K3833M0707r2500n2357J4616M1082n4234Q601L6063J5357l6334N7582
15872d7315R2038L2544m7612j5080K501m3989K823j8043M2266p8702p4273R4041
15860e8801P9880K3737P2801P2272r447q2966r0243K6225K4705m2846j02728J10692
15848B3281P6994p494j63557m7836J3887m7796O3835J23676K1063r5747m3918
15837h3612l7971N2060J61438q2333J9575j0910k4995N951J890m0198Q594l4054
15825f4565Q3346R4163p9979k6497l4316q1129J760M8193M9883l0606N5901k7569
15813a1415K6155R680n366P8582R2945k6351q5662j09118j22859L4356K5187M1290
15801e2576M0791J18405Q2969k8902p6378o391r8674n1096j9758N5820M6719P298
$$ plain form
15789 18227 -31430 58686 57964 45285 27577 -16263 59972 17959 -79029 -192012 -141332 -170623
15777 -170623 -147726 -132589 -82526 -13743 24612 106227 -8936 -166176 -153068 -84462 -76032
15766 -76032 -117248 -150592 -221332 -237135 -187604 1733 8695 -20977 -65954 -56629 -34243 -44793
15754 -44793 -31422 -76360 -170054 -159436 -155650 -187093 -113935 -29684 113577 126611 43060 -65534
15742 -65534 -51225 -38183 -30225 -58124 -65643 -130060 -184209 -198830 -211356 -231369 -170267 -151774
15730 -151774 -41195 89465 152843 239216 210694 139670 49349 -75333 -99536 -172907 12673
15719 12673 100603 88802 96048 80794 72937 20932 12072 114933 144419 20613 -33607 56955
15707 56955 155140 233926 313853 152123 40688 -28237 8042 -35407 -63079 21979 78649
$$ packed form
15789A8227m9657R0116p22j2679j7708m3840P6235m2013r6988j12983N0680k9291
15777a70623K2897J5137N0063O8783L8355Q1615j15163j57240J3108O8606Q430
15766g6032m1216l3344p0740j5803M9531J89337O962k9672m4977R325K2386j0550
15754d4793J3371m4938r3694J0618L786l1443P3158Q4251J43261J3034q3551j08594
15742f5534J4309J3042P958k7899p519o4417n4149j4621j2526k0013O1102J8493
15730a51774J10579J30660O3378Q6373k8522p1024r0321j24682k4203p3371J85580
15719A2673Q7930j1801P246j5254p857n2005q860J02861K9486j23806n4220R0562
15707E6955R8185P8786P9927j61730j11435o8925L6279m3449k7672Q5058N6670
$$ plain form
15696 78649 5324 -34369 -134091 -141553 17515 -25542 -154541 -202536 -93016 -50817 9802
15685 9802 88477 171316 111264 30919 80906 80617 80809 138688 181644 112941 52183 -3642 56799
15672 56799 100642 81211 848 -26053 -53028 -81698 -127671 -60125 -42528 13724 -42616 -37424
15660 -37424 8775 -12880 10755 -69182 -53906 -43647 -40309 -26410 -91748 -152055 -154113 -96998
15648 -96998 -4776 47086 -23069 29835 137964 135014 79908 44383 -6613 33682 34897 37604
15636 37604 -9554 -10637 51887 52501 113322 112659 131940 69419 24058 -11342 79847 99088 -6537
15623 -6537 -53588 -71082 -25403 104517 154496 103484 46895 -3885 -2376 4659 -23609 -48727
15611 -48727 -71291 -79338 -98539 -105148 -152117 -192009 -169676 -162699 -157167 -200882 -258517 -196672
$$ packed form
15696G8649p3325l9693r9722p462J59068m3057j28999m7995J09520M2199O0619
15685I802P8675Q2839o0052q0345M9987k89J92N7879M2956o8703o0758n5825O0441
15672E6799M3843j9431q0363k6901k6975k8670m5973O7546J7597N6252n6340N192
15660c7424M6199k1655K3635p9937J5276J0259L338J3899o5338o0307k058N7115
15648i6998R2222N1862p0155N2904J08129k950n5106l5525n0996M0295J215K707
15636C7604m7158j083O2524O14O0821o63J9281o2521m5361l5400R1189J9241j05625
15623f537m7051j7494M5679J29920M9979n1012n6589n0780J509P035k8268k5118
15611d8727k2564q047j9201o609m6969l9892K2333O977N532m3715n7635O1845
$$ plain form
15599 -196672 -145211 -212915 -251812 -110877 -111528 -198086 -156068 -103585 -104283 -101006 -150997 -126175
15587 -126175 -62084 -84749 -47775 -25650 -107688 -139004 -59455 59789 77379 -18060 -46085
15576 -46085 -41710 115204 108412 108266 58317 -13313 35471 -2996 -20299 -881 20457 9446
15564 9446 -14572 -48891 -102174 -101320 -112852 -89453 -105648 -120826 -28915 69689 29322 -9829
15552 -9829 -16839 27119 114134 153460 100102 -11595 -54210 23578 91986 119263 180882 48734
15540 48734 46059 55844 63213 102953 103919 69335 27089 -6350 -71079 -42542 -5198 -43176 -75388
15527 -75388 -175257 -191275 -241346 -165237 -118090 -114690 -10474 45086 25750 -102311 -107625 -71593
15515 -71593 -48634 1470 -13583 -19745 -44633 -63221 5358 -84866 -44266 -16807 -113292 -154087
$$ packed form
15599a96672N1461o7704l8897J40935o51q6558M2018N2483o98L277m9991K4822
15587a26175O4091k2665L6974K2125q2038l1316P9549J19244J7590r5439k8025
15576d6085M375J56914o792j46m9949p1630M8784l8467j7303J9418K1338j1011
15564I446k4018l4319n3283Q54j1532K3399j6195j5178R1911R8604m0367l9151
15552i829p010M3958Q7015L9326n3358j11697m2615P7788O8408K7277O1619j32148
15540D8734k675R785P369L9740R66l4584m2246l3439o4729K8537L7344l7978l2212
15527g5388r9869j6018n0071P6109M7147L400J04216N5560j9336j28061n314L6032
15515g1593K2959N0104j5053o162k4888j8588O8579r0224M0600K7459r6485m0795
$$ plain form
15503 -154087 -159998 -138405 -21738 78966 82666 57342 -3942 -78699 -86471 24633 121720
15492 121720 170478 95747 -4221 -16707 -1455 57601 10144 5254 -16431 51841 91503 115459
15480 115459 71913 -21367 -100356 -92216 -48648 -53603 -103583 -127021 -153214 -211296 -243916 -101264
15468 -101264 -113055 -166652 -109870 -57040 -85410 -69746 -7635 -40114 -13955 4036 -14335
15457 -14335 6135 -63193 -50850 -90024 17274 105767 62762 72541 121904 86861 -36881
15446 -36881 -146906 -143187 -172362 -203189 -131397 -125337 -96316 -30447 -74792 -75960 -94161 -158923
15434 -158923 -195165 -184107 -246508 -185587 -52584 88896 37569 -46633 -93376 -183575 -141624
15423 -141624 -59883 -10676 -48070 -134483 -45045 -25489 -10125 90832 -18062 -83126 -127035
$$ packed form
15503a54087n911K1593J16667J00704L700k5324o1284p4757p772J11104R7087
15492A21720M8758p4731r9968j2486J5252N9056m7457m890k1685O8272L9662K3956
15480A15459m3546r3280p8989Q140M3568m955m9980k3438k6193n8082l2620J42652
15468a01264j1791n3597N6782N2830k8370J5664O2111l2479K6159J7991j8371
15457a4335K0470o9328J2343l9174J07298Q8493m3005R779M9363l5043j23742
15446c6881j10025L719k9175l0827P1792O060K9021O5869m4345j168j8201o4762
15434a58923l6242J1058o2401O0921J33003J41480n1327q4202m6743r0199M1951
15423a41624Q1741M9207l7394q6413Q9438J9556J5364J00957j08894o5064m3909
$$ plain form
15412 -127035 -22935 3954 96164 48258 1347 -81840 -23721 34882 93578 130115 216049
15401 216049 143999 76370 -15169 -108200 -85190 -74002 -18992 -52494 -90183 -29044 -36076 -167450
15389 -167450 -210849 -200022 -169306 -153044 -121399 -86524 -130465 -172098 -122311 15067 125994
15378 125994 108136 48689 18956 -53992 -91671 -48540 -32682 -35778 102410 164222 105218
15367 105218 75292 -71312 -177686 -81241 -12717 56981 36299 -93409 -243393 -192171 -277641
15356 -277641 -358812 -233320 -62110 -117866 -159238 -116826 -118321 -116594 -107639 -28928 -47200 -61990
15344 -61990 -186335 -220266 -121076 -232249 -209690 -116964 -103410 -95472 -132405 -69464 52229
15333 52229 -15991 -89755 -117351 -93069 -46245 28799 8094 -25131 -20668 -52576 -46196 -97876
$$ packed form
15412a27035J04100K6889R2210m7906m6911q3187N8119N8603N8696L6537Q5934
15401B16049p2050o7629r1539r3031K3010J1188N5010l3502l7689O1139p032j31374
15389a67450m3399J0827L0716J6262L1645L4875m3941m1633M9787J37378J10927
15378A25994j7858n9447k9733p2948l7679M3131J5858l096J38188O1812n9004
15367A05218k9926j46604j06374R6445O8524O9698k0682j29708j49984N1222q5470
15356b77641q1171J25492J71210n5756m1372M2412j495J727Q955P8711j8272j4790
15344f1990j24345l3931R9190j11173K2559R2726J3554P938l6933O2941J21693
15333E2229o8220p3764k7596K4282M6824P5044k0705l3225M463l1908O380n1680
$$ plain form
15321 -97876 -2721 82088 93549 152358 131851 54957 47038 18377 -24104 -123318 -119243 -74188
15309 -74188 28059 -11359 -111096 -97970 -25296 -3002 -13481 -190988 -302967 -265928 -55023
15298 -55023 36971 -4004 -118367 -231175 -302219 -349183 -244993 -72425 19407 -20897 -109748
15287 -109748 -84626 3473 -59856 -142116 -165179 -199919 -105190 -12613 -798 -13996 34280
15276 34280 -9017 4642 -4995 -82781 -90631 -98394 -20113 -19155 -112049 19924 32313 1712
15264 1712 -74739 -173186 -269047 -163786 -62426 -75814 -126382 -145562 -138626 -104364 -46178 -7605
15252 -7605 67554 118153 50357 59284 83297 53561 91957 13415 53378 54778 47038 26915
15240 26915 -43822 -42206 -83198 -148697 -17839 -20678 -102134 -123793 -144603 -98381 -164966 -146629
$$ packed form
15321i7876R5155Q4809J1461N8809k0507p6894p919k8661m2481r9214M075M5055
15309g4188J02247l9418r9737J3126P2674K2294j0479j77507j11979L7039K10905
15298e5023R1994m0975j14363j12808p1044m6964J04190J72568R1832m0304q8851
15287a09748K5122Q8099o3329q2260k3063l4740R4729R2577J1815j3198M8276
15276C4280m3297J3659r637p7786p850p763P8281R58r2894J31973J2389l0601
15264A712p6451r8447r5861J05261J01360j3388n0568j9180O936L4262N8186L8573
15252g605P5159N0599o7796Q927K4013k9736L8396p8542L9963J400p740k0123
15240B6915p0737J616m0992o5499J30858k839q1456k1659k0810M6222o6585J8337
$$ plain form
15228 -146629 -196909 -226815 -241263 -235447 -107164 -70289 -90552 -114598 -64026 -57270 69119
15217 69119 154612 166314 118936 74577 -33335 -59034 -157435 -221491 -233719 -145990 -75288
15206 -75288 -40715 -114322 -158110 -31602 124945 90582 -65502 53296 143349 93207 18671
15195 18671 10626 83648 129298 -13060 -45546 -62889 -5871 97154 70373 53526 -25478
15184 -25478 -25284 -61268 -50031 -131431 -182202 -204818 -201781 -112637 -46645 -98530 -150408 -72661
15172 -72661 -27494 -2207 113581 101657 93561 142510 181217 227452 199165 147010 90970 39903
15160 39903 -15289 6170 -12722 18067 -28444 -70422 -25026 -61169 -79338 11159 101000 47567
15148 47567 14530 117606 139826 119487 107393 90507 77322 76473 -582 -3785 -40884 -114450
$$ packed form
15228a46629n0280k9906j4448N816J28283L6875k0263k4046N0572O756J26389
15217F9119Q5493J1702m7378m4359j07912k5699r8401o4056j2228Q7729P0702
15206g5288L4573p3607m3788J26508J56547l4363j56084J18798R0053n0142p4536
15195A8671q045P3022M5650j42358l2486j7343N7018J03025k6781j6847p9004
15184b5478J94l5984J1237q1400n0771k2616L037Q9144O5992n1885n1878P7747
15172g2661M5167K5287J15788j1924q096M8949L8707M6235k8287n2155n6040n1067
15160C9903n5192K1459j8892L0789m6511m1978M5396l6143j8169R0497Q9841n3433
15148D7567l3037J03076K2220k0339j2094j6886j3185q49p7055l203l7099p3566
$$ plain form
15136 -114450 -99003 -59216 -28571 -61028 -95091 -136970 -224662 -235596 -136576 -128081 -213480 -161692
15124 -161692 -105496 -92632 -103400 -28144 -13936 27495 -19574 -61106 -79578 -95049 -29605
15113 -29605 16349 -680 20793 47096 -56670 -142239 -70288 -118656 -126996 -135254 -122927 -101169
15101 -101169 -53851 -114466 -72636 -43478 -47625 103980 116838 51149 -31842 -76568 -122042
15090 -122042 -119812 -110494 -122307 -9690 -40493 -143158 -166523 -93456 8517 -25082 -62180
15079 -62180 -170940 -243452 -111435 -71586 -7932 36117 57193 -58829 -197564 -207213 -60086
15068 -60086 -68166 -209837 -194033 -125383 -107107 -48603 -65687 -65700 -74172 -188247 -290511 -285883
15056 -285883 -181233 -122912 -157876 -37561 77332 106778 92021 128929 122485 -51068 -164961
$$ packed form
15136a14450J5447L9787L0645l2457l4063m1879q7692j0934R9020Q495q5399N1788
15124a61692N6196J2864j0768P5256J4208M1431m7069m1532j8472j5471O5444
15113b9605M5954j7029K1473K6303j03766q5569P1951m8368q340q258J2327K1758
15101a01169M7318o0615M1830K9158m147J51605J2858o5689q2991m4726m5474
15090a22042K230R318j1813J12617l0803j02665k3365P3067J01973l3599l7098
15079f2180j08760p2512J32017L9849O3654M4049K1076j16022j38735r649J47127
15068f0086q080j41671J5804O8650J8276N8504j7084j3q472j14075j02264M628
15056b85883J04650N8321l4964J20315J14893K9446j4757L6908o444j73553j13893
$$ plain form
15045 -164961 -97496 -13025 124050 137995 111382 140375 55123 23563 63148 42980 21508
15034 21508 8801 -11689 -98198 -63098 48781 102735 135705 204854 208550 112092 6379
15023 6379 13117 89365 26669 727 10809 10722 -33940 -105026 13160 36671 23233 342
15011 342 -53386 -9287 -41945 -18283 64784 60811 -7836 -149471 -239629 -201248 -12565 64823
14999 64823 5353 -32119 -64844 -136221 -187699 -86336 -124877 -81901 49178 97881 48751
14988 48751 88036 137635 117515 82281 22709 10377 -20160 -203052 -237044 -71763 82422
14977 82422 -7354 -33803 -74896 -106823 -123357 -45680 -3419 -37277 15084 60524 7549 -22671
14965 -22671 92729 32272 -38374 -57811 -53701 32651 72019 35508 -67143 -118404 7057
$$ packed form
15045a64961O7465Q4471J37075J3945k6613K8993q5252l1560L9585k0168k1472
15034B1508j2707k0490q6509L5100J11879N3954L2970O9149L696r6458j05713
15023F379O738P6248o2696k5942J0082q7m4662p1086J18186K3511j3438k2891
15011C42n3728M4099l2658K3662Q3067l973o8647j41635r0158L8381J88683P7388
14999F4823n9470l7472l2725p1377n1478J01363l8541M2976J31079M8703m9130
14988D8751L9285M9599k0120l5234n9572j2332l0537j82892l3992J65281J54185
14977H2422q9776k6449m1093l1927j6534P7677M2261l3858N2361M5440n2975l0220
14965b2671J15400o0457p0646j9437M110Q6352L9368l6511j02651n1261J25461
$$ plain form
14954 7057 51489 -21617 -127543 -123535 -91462 -73066 -69063 29593 94378 24812 100523 123009
14942 123009 96179 91232 -9477 -38698 36705 -49101 -123990 -120551 -139219 -101675 -142045 -138565
14930 -138565 -103424 -82063 -118203 -88275 -64107 -28441 -88418 -34671 -12527 -44688 -92729
14919 -92729 29215 61254 111005 -28782 -64991 -111104 -235548 -223877 -244815 -241956 -219718
14908 -219718 -276576 -198761 -142313 -221209 -293491 -163430 -146817 -115672 -145009 -102944 97080
14897 97080 184793 141413 98231 34639 44973 27748 -8287 59513 110695 26605 -47131 -84016
14885 -84016 -167853 -159944 -80914 -3777 -16007 -39194 18273 77807 27809 5106 23362 99091
14873 99091 151845 184844 116770 91597 90722 113974 74096 -18673 -60892 2081 150618 210762
$$ packed form
14954G057M4432p3106j05926M008L2073J8396M003R8656O4785o9566P5711K2486
14942A23009k6830m947j00709k9221P5403q5806p4889L439j8668L7544m0370L480
14930a38565L5141K1361l6140K9928K4168L5666n9977N3747K2144l2161m8041
14919i2729J21944L2039M9751j39787l6209m6113j24444J1671k0938K859K2238
14908b19718n6858P7815N6448p8896p2282J30061J6613L1145k9337M2065K00024
14897I7080Q7713m3380m3182o3592J0334j7225l6035O7800N1182q4090p3736l6885
14885h4016q3837P909P9030P7137j2230k3187N7467N9534m9998k2703J8256P5729
14873I9091N2754L2999o8074k5173q75K3252l9878r2769m2219O2973J48537O0144
$$ plain form
14861 210762 155194 111395 56276 62521 24546 158249 237274 250100 196743 96284 42309
14850 42309 -8619 23488 57700 117728 227752 228144 97055 74344 59575 21332 48253 48862
14838 48862 -19897 116222 145890 125916 145209 144462 166542 167508 144724 164777 194990 115089
14826 115089 10786 -10173 -32202 -81975 -159652 -126945 -127747 -73546 11782 13891 -136738 -151345
14814 -151345 -93368 23377 34036 -54442 -49488 -39763 32006 95476 7317 -71445 -54509 -89913
14802 -89913 -150823 -159892 -123852 -63573 -7966 24639 44550 2712 -58868 -93972 -84889 -132108
14790 -132108 -220271 -172675 -36496 71498 13832 -37827 -29008 -13902 -56711 -8041 52914
14779 52914 65811 86291 33556 81760 102274 89529 36851 -118838 -98513 -13777 12397
$$ packed form
14861B10762n5568m3799n5119O245l7975J33703P9025J2826n3357j00459n3975
14850D2309n0928L2107L4212O0028J10024L92j31089k2711j4769l8243K6921O09
14838D8862o8759J36119K9668j9974J9293p47K2080R66k2784K0053L0213p9901
14826A15089j04303k0959k2029m9773p7677L2707q02N4201Q5328K109j50629j4607
14814a51345N7977J16745J0659q8478M954R725P1769O3470q8159p8762J6936l5404
14802h9913o0910r069L6040O0279N5607L2605J9911m1838o1580l5104R083m7219
14790a32108q8163M7596J36179J07994n7666n1659Q819J5106m2809M8670O0955
14779E2914J2897K0480n2735M8204K0514j2745n2678j55689K0325Q4736K6174
$$ plain form
14768 12397 14805 22324 20733 18667 35211 28580 -75892 -173255 -165076 -149683 -97673 -36154 43797
14755 43797 85497 -13023 -17396 72312 -5310 16933 95446 89940 104926 163428 214972 119621
14743 119621 55004 4292 -19556 -48500 -146784 -119996 -99422 -124020 -155984 -200073 -126898
14732 -126898 -10955 120976 148715 82075 77854 37054 15073 -25230 8260 14897 -30436
14721 -30436 14946 156851 165615 89530 45354 3301 81228 125495 50676 -36804 -118412 -83106
14709 -83106 16846 41428 -14082 -45042 -53073 38651 -38107 -87706 -39480 -83649 -94869 -140526
14697 -140526 -213036 -213582 -104592 -109065 -89990 -41993 10211 -61538 -104600 -99287 -74764 -41178
14685 -41178 -139586 -146414 -66619 -98194 -165348 -67788 90091 74424 139380 193659 195892 193136
$$ packed form
14768A2397K408P519j591k066J6544o631j04472r7363Q179J5393N2010O1519P9951
14755D3797M1700r8520m373Q9708p7622K2243P8513n506J4986N8502N1544r5351
14743A19621o4617n0712k3848k8944r8284K6788K0574k4598l1964m4089P3175
14732a26898J15943J31931K7739o6640m221m0800k1981m0303L3490O637m5333
14721c0436M5382J41905Q764p6085m4176m2053P7927M4267p4819q7480q1608L5306
14709h3106R9952K4582n5510l0960q031R1724p6758m9599M8226m4169j1220m5657
14697a40526p2510n46J08990m473J9075M7997N2204p1749m3062N313K4523L3586
14685d1178r8408o828P9795l1575o7154R7560J57879j5667O4956N4279K233k756
$$ plain form
14673 193136 131480 74011 48627 21669 18543 -76805 -17719 -50540 -91981 -62783 6732 -36349
14661 -36349 -85535 -42157 -43987 10580 47257 119308 106861 76485 38918 2684 -83284 -146553
14649 -146553 -172972 -180132 -196061 -235313 -216719 -189587 -99075 20912 52580 71013 48019
14638 48019 43424 10097 106659 182407 155502 21490 -74242 -76326 -5214 -57558 -38369 65137
14626 65137 42948 90064 67422 36036 -22170 -127759 -272396 -222619 -75491 -34252 36159
14615 36159 70573 -13557 6778 36388 10560 -103745 -154005 -163226 -117788 -142323 -72091 -95503
14603 -95503 -42322 93626 37861 -47466 -141403 -219481 -88673 -2860 -77531 -15153 -38080
14592 -38080 -78935 -101638 -92781 69551 170019 95925 66721 107510 17008 -72875 -102090
$$ packed form
14673A93136o1656n7469k5384k6958l126r5348N9086l2821m1441K9198O9515m3081
14661c6349m9186M3378j830N4567L6677P2051j2447l0376l7567l6234q5968o3269
14649a46553k6419p160j5929l9252J8594K7132R0512J19987L1668J8433k2994
14638D8019m595l3327R6562P5748k6905j34012r5732k084P1112n2344J9189J03506
14626F5137k2189M7116k2642l1386n8206j05589j44637M9777J47128M1239P0411
14615C6159L4414q4130K0335K9610k5828j14305n0260r221M5438k4535P0232k3412
14603i5503N3181J35948n5765q5327r3937p8078J30808Q5813p4671O2378k2927
14592c8080m0855k2703Q857J62332J00468p4094k9204M0789r0502q9883k9215
$$ plain form
14581 -102090 -94105 -27521 -43619 -35497 -61902 -101746 -148710 -134531 -111499 -143619 -113748 -152442
14569 -152442 -205229 -145605 -111039 -61946 -32758 -19552 -51164 18641 133807 239811 228426
14558 228426 115728 59950 17685 110804 130458 6041 -39397 6808 -4755 -52562 -132705
14547 -132705 8680 53980 32069 38841 44272 89942 93200 60145 56054 54409 -44538 -96549
14535 -96549 8048 30322 75743 86385 130772 151810 132009 146629 113926 48543 97550
14524 97550 37526 113355 82679 53670 82528 132402 168926 178154 169355 175554 132665 74461
14512 74461 67842 45967 -70997 -91323 -202338 -152337 63981 125431 69680 39206 -104588
14501 -104588 -118006 35314 139736 198285 75399 6957 -3204 60667 43748 -71748 -118169
$$ packed form
14581a02090P985O6584j6098Q122k6405l9844m6964J4179K3032l2120K9871l8694
14569a52442n2787N9624L4566M9093K9188J3206l1612O9805J15166J06004j1385
14558B28426j12698n5778m2265R3119J9654j24417m5438M6205j1563m7807q0143
14547a32705J41385M5300k1911O772N431M5670L258l3055m091j645r8947n2011
14535i6549J04597K2274M5421J0642M4387K1038j9801J4620l2703o5383M9007
14524I7550o0024P5829l0676k9009K8858M9874L6524R228q799O199m2889n8204
14512G4461o619k1875j16964k0326j11015N0001K16318O1450n5751l0474j43794
14501a04588j3418J53320J04422N8549j22886o8442j0161O3871j6919j15496m6421
$$ plain form
14490 -118169 -50199 94 -49640 -36692 10370 21041 39604 -66965 -117701 -106974 -62274
14479 -62274 -79944 -29168 14648 29269 -21948 -11335 -8104 -82291 -143871 -73205 -76394 -876
14467 -876 73744 86996 23693 84207 192353 69459 -92091 -123268 -118147 -80047 43849
14456 43849 122061 71032 5376 -43368 -161470 -127544 -100794 -92319 -72387 1406 -23691 -19399
14444 -19399 -127948 -169186 -95441 1380 -18426 -82734 -123369 -149392 -119256 -88206 -57100
14433 -57100 -1302 84790 113520 173316 230884 145218 19935 7658 -59813 -165975 -160410
14422 -160410 -117059 -131381 -91002 13030 108716 66544 16559 53680 69907 -1771 -20952
14411 -20952 -17055 -117785 -180072 -164542 -162755 -203881 -256045 -242387 -119138 -19607 23012 -35624
$$ packed form
14490a18169O7970N0293m9734J2948M7062J0671J8563j06569n0736J0727M4700
14479f2274j7670N0776M3816J4621n1217J0613L231p4187o1580P0666l189P5518
14467h76P4620J3252o3303O0514J08146j22894j61550l1177N121L8100J23896
14456D3849P8212n1029o5656m8744j18102L3926K6750Q475J9932P3793k5097M292
14444a9399j08549m1238P3745R6821j9806o4308m0635k6023L0136L1050L1106
14433e7100N5798Q6092K8730N9796N7568q5666j25283j2277o7471j06162N565
14422a60410M3351j4322M0379J04032R5686m2172m9985L7121J6227p1678j9181
14411b0952L897j00730o2287J5530J787m1126n2164J3658J23249R9531M2619n8636
$$ plain form
14399 -35624 -18981 96285 157272 139465 63805 -51300 -19642 52919 -9437 -85566 -89293
14388 -89293 -20635 -87432 -6562 -55674 -88104 -88017 -155556 -183819 -156589 -81442 7466 18733
14376 18733 63913 7330 -103490 -158665 -117334 41214 64311 94483 -55400 -106705 -77391
14365 -77391 -27988 -157243 -116265 -163533 -93820 -54189 -91016 -112255 -108136 -81462 -13319 -16292
14353 -16292 -80431 -74074 52346 119521 3196 -14137 48766 24907 129261 106800 9540
14342 9540 9083 -6638 -34104 -55961 -72837 -97455 -98489 -132080 -196567 -166047 -93116 -25638
14330 -25638 -27289 27546 60534 8104 255 26013 -11786 8327 19009 19428 -21740 -46632
14318 -46632 -12444 -55707 -36119 -87008 -40647 -112861 -196532 -84415 -122395 -201190 -238027
$$ packed form
14399c5624J6643J15266O0987j7807p5660j15105L1658P2561o2356p6129l727
14388h9293O8658o6797Q0870m9112l2430Q7o7539k8263K7230P5147Q8908J1267
14376A8733M5180n6583j10820n5175M1331J58548K3097L0172j49883n1305K9314
14365g7391M9403j29255M0978m7268O9713L9631l6827k1239M119K6674O8143k973
14353a6292o4139O357J26420O7175j16325j7333O2903k3859J04354k2461r7260
14342I540m57j5721k7466k1857j6876k4618j034l3591o4487L0520P2931O7478
14330b5638j651N4835L2988n2430p849K5758l7799K0113J0682M19m1168k4892
14318d6632L4188m3263J9588n0889M6361p2214q3671J12117l7980p8795l6837
$$ plain form
14307 -238027 -218720 -160219 -100537 -59941 -24128 112176 191757 131950 31019 1916 -4547
14296 -4547 -12628 11756 -25906 -121527 -151583 -155639 -104814 -38447 -21473 -24760 -19956 20333 19641
14283 19641 -1502 -42479 -61062 -50405 -35972 -75026 -4119 143370 79876 -48974 -18058
14272 -18058 -31112 -53772 -38427 81437 43848 -168288 -163234 -63874 11134 37869 90689
14261 90689 68818 -62092 -79352 -62692 -58364 4707 22530 -82700 -145785 -120150 -113139 -44798
14249 -44798 59426 1941 -60669 -199 15035 47159 63120 49377 80792 46456 15340
14238 15340 -65810 -53272 -3386 -7959 -58050 -40914 -32098 2749 42669 25131 4730 -73348
14226 -73348 15116 66226 32980 72945 46995 -26915 1328 91890 52448 -44180 -126377 -111092
$$ packed form
14307b38027J9307N8501N9682M0596L5813J36304P9581n9807j00931k9103o463
14296d547q081K4384l7662r5621l0056m056N0825O6367J6974l287M804M0289o92
14283A9641k1143m0977j8583J0657J4433l9054P0907J47489o3494j28850L0916
14272a8058j3054k2660J5345J19864l7589k12136N054R9360P5008K6735N2820
14261I0689k1871j30910j7260J6660M328O3071J7823j05230o3085K5635P011O8341
14249d4798J04224n7485o2610O0470J5234L2124J5961j3743L1415l4336l1116
14238A5340q1150J2538M9886m573n0091J7136Q816L4847L9920j7538k0401p8078
14226g3348Q8464N1110l3246L9965k5950p3910K8243R0562l9442r6628q2197J5285
$$ plain form
14214 -111092 -145126 -106572 -102536 -179950 -64799 -1172 31447 48908 56941 4961 -12492 -37187
14202 -37187 -101126 -155399 -131205 -117040 -103293 -136798 -64015 -28301 -46836 -27556 -22786 43604
14190 43604 124780 10907 -76195 -168651 -222569 -259508 -179880 -55106 41454 -39956 -3077
14179 -3077 36160 12371 43370 -51558 -17217 42026 68332 12678 57627 50566 -50094 -162619
14167 -162619 -166835 -186381 -215191 -160377 -125447 -196011 -248503 -284671 -163755 -136565 -131550 -58282
14155 -58282 -24251 46937 -10954 -68155 -87305 -19468 89912 52432 -19281 49485 27075
14144 27075 -80711 -139667 -137447 -135177 -153033 -97215 -85623 -68769 -92616 -35100 -11841 -47798
14132 -47798 -471 53272 126041 98228 7212 31762 53732 51539 67544 104537 113963 47287
$$ packed form
14214a11092l4034L8554M036p7414J15151O3627L2619J7461Q033n1980j7453k4695
14202c7187o3939n4273K4194J4165J3747l3505P2783L5714j8535J9280M770O6390
14190D3604Q1176j13873q7102r2456n3918l6939P9628J24774R6560q1410L6879
14179c077L9237k3789L0999r4928L4341N9243K6306n5654M4949p061j00660j12525
14167a62619m216j9546k8810N4814L4930p0564n2492l6168J20916K7190N015P3268
14155e8282L4031P1188n7891n7201j9150O7837J09380l7480p1713O8766k2410
14144B7075j07786n8956K220K270j7856N5818J1592J6854k3847N7516K3259l5957
14132d7798M7327N3743P2769k7813r1016K4550K1970k193J6005L6993R426o6676
$$ plain form
14120 47287 43047 66360 -75661 -109478 -2071 -14067 70156 -55789 14105 155634 12737
14109 12737 -37413 8326 34943 -40204 -137052 -109613 -84093 -130703 -134787 -44903 99984 152087
14097 152087 50237 43015 32231 -30989 -61948 -114734 -217625 -204758 -249089 -193230 -202597
14086 -202597 -134949 -81357 -9913 29942 -21892 -10835 47788 21509 -69620 -94594 -102577 -36327
14074 -36327 67003 91766 53484 -14429 -37518 -63649 -84733 -60075 23420 32224 -5752 -28519
14062 -28519 4064 -20931 14982 -127481 -207084 -173683 -130168 -92198 -148160 -152126 -111030 -71096
14050 -71096 9285 31997 31145 -24673 -5388 94920 192116 160977 196885 132558 77859 23280
14038 23280 19597 9852 -42072 7997 -86 18095 40272 124814 66038 -31228 -125191 -142646
$$ packed form
14120D7287m240K3313j42021l3817J07407j1996Q4223j25945O9894J41529j42897
14109A2737n0150M5739K6617p5147r6848K7439K5520m6610m084Q9884J44887N2103
14097A52087j01850p222j0784o3220l0959n2786j02891J2867m4331N5859r367
14086b02597O7648N3592P1444L9855n1834J1057N8623k6279r1129k4974p983O6250
14074c6327J03330K4763l8282o7913k3089k6131k1084K4658Q3495Q804l7976k2767
14062b8519L2583k4995L5913j42463p9603L3401M3515L7970n5962l966M1096L9934
14050g1096Q0381K2712q52n5818J9285J00308R7196l1139L5908o4327n4699n4579
14038B3280l683r745n1924N0069q083J8181K2177Q4542n8776r7266r3963j7455
$$ plain form
14026 -142646 -69180 -36870 26341 31916 -29278 -106677 -68442 10794 48728 140355 196714 150536
14014 150536 222823 227398 192297 142937 48674 798 -30187 -14267 70979 51456 78860 42995
14002 42995 26110 -30009 4697 -38432 -55979 -67329 -28438 -3154 54966 78833 61543 6765
13990 6765 -9963 -52005 -133960 -213271 -264191 -194751 -162937 -116354 -39451 7010 1551 23543
13978 23543 -17957 -21854 20793 -55000 -22230 11662 -39651 -141753 -232178 -131100 -40572
13967 -40572 -40488 -126573 -200831 -149236 -161000 -188499 -123845 -81260 -54723 -7882 27843 -2004
13955 -2004 -42673 -55799 -45617 7889 57042 56329 129218 154677 58363 4577 -31065 -129290
13943 -129290 -101291 -31341 -796 -66034 -71126 -78223 4098 35267 -4443 -30429 -81427 -114785
$$ packed form
14026a42646P3466L2310O3211N575o1194p7399L8235P9236L7934R1627N6359m6178
14014A50536P2287M575l5101m9360r4263m7876l0985J5920Q5246j9523K7404l5865
14002D2995j6885n6119L4706m3129j7547j1350L8891K5284N8120K3867j7290n4778
13990F765j6728m2042q1955p9311n0920O9440L1814M6583P6903M6461n459K1992
13978B3543m1500l897M2647p5793L2770L3892n1313j02102r0425J01078R0528
13967d0572Q4q6085p4258N1595j1764k7499O4654M2585K6537M6841L5725k9847
13955b004m0669j3126J0182N3506M9153p13P2889K5459r6314n3786l5642r8225
13943a29290K7999O9950L0545o5238n092p097Q2321L1169l9710k5986n0998l3358
$$ plain form
13931 -114785 -118509 -41291 -62214 -55813 39660 88381 86558 -23944 -100354 -66029 25254 21035
13919 21035 33308 96575 13446 -49599 -49051 -72980 25735 52834 54363 93547 82441 99442
13907 99442 109298 127317 65234 54087 157591 146447 120278 132894 184660 -29975 -148831
13896 -148831 -129406 26910 31645 1716 -42299 -71303 -103392 -129939 -102168 -123445 -110386
13885 -110386 -86967 -89366 -178132 -132877 -79138 -96917 -48974 84473 133286 92729 -4225
13874 -4225 -35607 -76143 -107052 -119573 -187231 -185745 -236146 -168144 3389 55358 27316 38025
13862 38025 -21732 -105944 -96192 -107857 -62795 16882 55135 60024 99420 142475 27909 59903
13850 59903 86649 68044 109745 146586 99434 46026 -85115 -160902 -102112 -24835 -10084
$$ packed form
13931a14785l724P7218k0923O401R5473M8721j823j10502p6410L4325R1283m219
13919B1035J2273O3267q3129o3045N48k3929R8715K7099J529L9184j1106J7001
13907I9442R856J8019o2083j1147J03504j1144k6169J2616N1766k14635j18856
13896a48831J9425J56316M735k9929m4015k9004l2089k6547K7771k1277J3059
13885a10386K3419k399q8766M5255N3739j7779M7943J33447M8813m0557r6954
13874d225l1382m0536l0909j2521o7658J486n0401O8002J71533N1969k8042J0709
13862C8025n9757q4212R752j1665M5062P9677L8253M889L9396M3055j14566L1994
13850E9903K6746j8605M1701L6841m7152n3408j31141p5787N8790P7277J4751
$$ plain form
13839 -10084 -57877 -38448 -5913 46299 -46680 -52381 59406 24396 34063 161564 188637 177342
13827 177342 84189 3351 5123 53474 5531 -118396 -324508 -155415 -94008 -103538 -38536
13816 -38536 25986 -25880 -44408 18200 16406 -112358 -88643 -28798 -8649 54457 154904
13805 154904 190959 264840 251848 72760 42026 60740 24375 -18968 -52319 -86635 -166502
13794 -166502 -136715 -48260 -73127 36440 59897 28907 46413 -72056 -131178 -133214 -99085
13783 -99085 -80585 -54943 -34287 -44083 -109835 -52809 33756 11522 43140 3643 -65948 -90940
13771 -90940 -52377 57297 93515 -16521 -103208 -124703 -61966 34735 91581 87464 187068
13760 187068 188291 137267 83780 -624 -31021 -97748 -123845 -8688 18933 -79377 -130814
$$ packed form
13839a0084m7793J9429L2535N2212r2979n701J11787l5010R667J27501K7073j1295
13827A77342r3153q0838J772M8351m7943j23927k06112J69093O1407r530O5002
13816c8536O4522n1866j8528O2608j794j28764K3715N9845K0149O3106J00447
13805A54904L6055P3881j2992j79088l0734J8714l6365m3343l3351l4316p9867
13794a66502K9787Q8455k4867J09567K3457l0990J7506j18469n9122k036L4129
13783i9085J8500K5642K0656r796o5752N7026Q6565k2234L1618l9497o9591k4992
13771i0940L8563J09674L6218j10036q6687k1495O2737R6701N6846m117R9604
13760A87068J223n1024n3487q4404l0397o6727k6097J15157K7621r8310n1437
$$ plain form
13749 -130814 -234772 -238526 -183158 -57230 1065 24476 104095 34029 -14759 11149 -9458
13738 -9458 -47306 -126121 -165765 -56002 16225 -131285 -185698 -151588 -73657 -81214 -132069 -263585
13726 -263585 -194474 -29436 59102 83675 134686 130867 56289 43823 34932 35118 -54325 -38414
13714 -38414 64112 83228 55674 -1024 3175 84290 80591 46163 56637 15908 -89049 -116492
13702 -116492 -109691 -185227 -186262 -137642 -50751 14416 52496 -42620 -50069 -33064 -84357 -56659
13690 -56659 -125754 -232943 -211357 -124531 -56832 -33256 -5091 -52982 -76852 -111659 -138197
13679 -138197 -213864 -153935 -61151 -57921 -45761 -85044 -214268 -278689 -208392 -151971 -136148
13668 -136148 -129723 -139373 -176890 -153819 -165280 -24606 96287 69763 41116 44725 127706 84417
$$ packed form
13749a30814j03958l754N5368J25928N8295K3411P9619p0066m8788K5908k0607
13738i458l7848p8815l9644J09763P2227j47510n4413L4110P7931p557n0855j31516
13726b63585O9111J65038Q8538K4573N1011l819p4578j2466q891J86q9443J5911
13714c8414J02526J9116k7554n6698M199Q1115l699l4428J0474m0729j04957k7443
13702a16492O801p5536j035M8620Q6891O5167L8080r5116p449J7005n1293K7698
13690e6659o9095j07189K1586Q6826O7699K3576K8165m7891k3870l4807k6538
13679a38197p5667N9929R2784L230J2160l9283j29224o4421P0297N6421J5823
13668a36148O425r650l7517K3071j1461J40674J20893k6524k8647L609Q2981m3289
$$ plain form
13656 84417 91912 17016 -69275 -100564 -81493 -95826 -75335 -62079 -68231 -133213 -127031 -116343
13644 -116343 -17986 120472 143599 53538 60045 148047 227243 126348 46465 35967 44412
13633 44412 -48047 -77926 -68105 3865 34514 -5676 55957 43306 154374 146564 89423 158360
13621 158360 114856 41249 16062 29350 29203 10848 -62074 -122102 -92336 -68338 -112673 -128359
13609 -128359 -84858 -141130 -108498 -59675 -98849 -72222 13888 6453 -79977 -84929 -179051 -119924
13597 -119924 -33845 -70241 -85630 25975 61181 123476 78935 49550 -2496 -12988 -30158
13586 -30158 -14907 -132465 -258821 -175881 -113984 -132891 -153504 -211023 -195108 -144301 -120925
13575 -120925 -21557 29157 -33173 -68469 -26961 -97012 -88623 -97345 -150758 -151460 -198958 -257552
$$ packed form
13656H4417P495p4896q6291l1289J9071j4333K0491J3256o152o4982O182J0688
13644a16343R8357J38458K3127r0061O507Q8002P9196j00895p9883j0498Q445
13633D4412r2459k9879R821P1970L0649m0190O1633j2651J11068p810n7141O8937
13621A58360m3504p3607k5187J3288j47j8355p2922o0028K9766K3998m4335j5686
13609a28359M3501n6272L2632M8823l9174K6627Q6110p435q6430m952r4122N9127
13597a19924Q6079l6396j5389J11605L5206O2295m4541k9385n2046j0492j7170
13586c0158J5251j17558j26356Q2940O1897j8907k0613n7519J5915N0807K3376
13575a20925R9368N0714o2330l5296M1508p0051Q389q722n3413p02m7498n8594
$$ plain form
13563 -257552 -189920 -573 181904 127953 58372 62778 147095 124359 64547 46495 36392
13552 36392 1767 -50196 -25015 50876 48963 -29985 19743 83506 69390 161420 282884 183467
13540 183467 43004 54553 184951 176686 119246 63332 45358 -5925 41382 98964 125073
13529 125073 41606 -68060 -45140 -14420 -50312 -38115 87569 22809 36438 10022 19599
13518 19599 -107285 -130829 -157176 -204638 -104306 11493 44310 53519 -59602 -107234 -160036
13507 -160036 -151390 -75030 15051 -24732 -83471 -50729 5658 69952 132615 111006 -8400
13496 -8400 -88826 -97890 -32879 -47782 -13897 54501 -22177 -26762 -56898 -46708 42379 61987
13484 61987 -68905 -183160 -119516 -33427 26815 2021 -46633 -63088 -65056 -3736 79978
$$ packed form
13563b57552O7632J89347J82477n3951o9581M406Q4317k2736n9812j8052j0103
13552C6392l4625n1963K5181P5891j913p8948M9728O3763j4116R2030J21464r9417
13540A83467j40463J1549J30398q265n7440n5914j7974n1283M7307N7582K6109
13529A25073q3467j09666K2920L0720l5892J2197J25684o4760J3629k6416R577
13518A9599j26884k3544k6347m7462J00332J15799L2817R209j13121m7632n2802
13507a60036Q646P6360R0081l9783n8739L2742N6387O4294O2663k1609j19406
13496h400q0426r064O5011j4903L3885O8398p6678m585l0136J0190Q9087J9608
13484F1987j30892j14255O3644Q6089O0242k4794m8654j6455j968O1320Q3714
$$ plain form
13473 79978 71590 -31601 34142 89938 144844 108685 -70298 -174327 -192468 -147606 -10106
13462 -10106 71666 131952 118218 33470 -31605 4860 35204 33400 103335 54013 -11725 -14747
13450 -14747 -59875 -118719 -21407 60716 119763 163866 133986 93485 35079 44778 123157 127608
13438 127608 -28917 -103590 -114651 -83905 -41946 -5557 -103923 -125447 -118189 14905 47894
13427 47894 35393 -29658 -69028 -101531 -177148 -165867 -114964 -86895 -101480 -147122 -71293 -43255
13415 -43255 -18144 32283 48823 -7634 -66426 -19349 40489 -70793 -85482 -57692 13544
13404 13544 -10466 17326 80208 136379 161651 70288 118697 131081 38845 -48711 -106945 -68158
13392 -68158 -22601 -99003 -86126 -129205 -66809 -16380 65837 41300 63831 3929 -56497 23517
$$ packed form
13473G9978q388j03191O5743N5796N4906l6159j78983j04029j8141M4862J37500
13462a0106Q1772O0286j3734q4748o5075L6465L0344j804O9935m9322o5738l022
13450a4747m5128n8844R7312Q2123N9047M4103k9880m0501n8406R699P8379M451
13438A27608j56525p4673j1061L0746M1959L6389r8366k1524P258J33094L2989
13427D7894j2501o5051l9370l2503p5617J1281N0903K8069j4585m5642P5829K8038
13415d3255K5111N0427J6540n6457n8792M7077N9838j11282j4689K7790P1236
13404A3544k4010K7792O2882N6171K5272r1363M8409J2384r2236q7556n8234L8787
13392f8158M5557p6402J2877m3079O2396N0429Q2217k4537K2531n9902o0426Q0014
$$ plain form
13380 23517 94063 -7318 -37084 65084 122897 24386 -1739 57795 26256 -34758 -54255
13369 -54255 -23613 115 -72895 -34879 46250 92273 2933 55075 99610 82982 53281 8793
13357 8793 58407 159292 176316 129687 40573 47815 31826 -42742 -5349 33249 2930 -17157
13345 -17157 61643 -23014 -80059 -61816 -44456 -134948 -135443 -179225 -267754 -253060 -249262 -197065
13333 -197065 -140346 -123630 -95467 25224 66164 75382 66030 -11375 93152 128720 146177
13322 146177 136496 68780 66416 26323 22556 -1669 -51735 -107369 -95945 -70298 -24371 24185
13310 24185 39512 52532 79380 32007 -73549 -96411 -19796 99512 68518 16479 -6367
13299 -6367 -79930 -88930 -131398 -81398 -8942 55072 94656 64058 -29160 -60842 -141722 -172313
$$ packed form
13380B3517P0546j01381k9766J02168N7813r8511k6125N9534l1539o1014j9497
13369e4255L0642K3728p3010L8016Q1129M6023q9340N2142M4535j6628k9701m4488
13357H793M9614J00885J7024m6629q9114P242j5989p4568L7393L8598l0319k0087
13345a7157P8800q4657n7045J8243J7360r0492m95m3782q8529J4694L798N2197
13333a97065N6719J6716K8163J20691M0940R218r352p7405J04527L5568J7457
13322A46177r681o7716k364m0093l767k4225n0066n5634J1424K5647M5927M8556
13310B4185J5327J3020K6848m7373j05556k2862P6615J19308l0994n2039k2846
13299f367p3563r000m2468N0000P2456O4014L9584l0598r3218l1682q0880l0591
$$ plain form
13287 -172313 -49586 -28590 -84612 -98309 30830 120080 186255 197017 46681 -73655 -111623
13276 -111623 -123950 -62228 -76290 -74791 -65443 -26728 107724 101441 2216 -90795 -141949 -172185
13264 -172185 -162789 -45993 -6544 -93397 -101624 -13617 35963 69614 113138 122896 187138 139965
13252 139965 83518 181377 126624 36375 -10806 -80002 -62819 -47017 -60149 -128481 -30301
13241 -30301 44326 -47691 -125562 -57201 -92798 -140366 -168763 -172104 -162163 -88803 -2459 -73574
13229 -73574 -76158 -57299 -84596 -97828 -144686 -128464 -43508 33579 -9215 -11371 40648 -24325
13217 -24325 -60460 27890 116191 116639 95464 101645 158029 100201 -178335 -201065 -121956 -64271
13205 -64271 -42355 -15145 88839 48848 12171 91768 151129 198247 256067 242921 263164
$$ packed form
13287a72313J22727K0996n6022j3697J29139Q9250O6175J0762j50336j20336l7968
13276a11623j2327O1722j4062J499R348L8715J34452o283r9225r3011n1154l0236
13264a72185R396J16796L9449q6853q227Q8007M9580L3651M3524R758O4242m7173
13252A39965n6447R7859n4753r0249m7181o9196J7183J5802j3132o8332R8180
13241c0301P4627r2017p7871O8361l5597m7568k8397l341R941P3360Q6344p1115
13229g3574k584J8859k7297j3232m6858J6222Q4956P7087m2794k156N2019o4973
13217b4325l6135Q8350Q8301M48k1175O181N6384n7828k78536k2730P9109N7685
13205f4271K1916K7210J03984l9991l6677P9597N9361M7118N7820j3146K0243
$$ plain form
13194 263164 311580 360376 311633 234907 193269 188205 159014 105300 41983 -65296 -29575
13183 -29575 18066 -38311 29769 117759 89742 -24731 -20070 54872 19912 58357 -32203 -110026
13171 -110026 -12500 51772 100387 71279 23731 -26420 -24061 -5395 35267 45442 51045 72398
13159 72398 135672 202579 275263 310724 410737 555864 700090 826644 1038231 1077664 971358
13148 971358 829968 646281 576242 474850 290226 224611 223923 139449 74103 214812 223893
13137 223893 194987 99183 144170 135216 129778 98089 46956 30964 7650 -65440 -112054 -30277
13125 -30277 37467 196773 182546 43959 -26237 -60198 -133197 -125792 -106220 -85199 -67168
13114 -67168 -12668 118038 148444 151438 197841 400265 681000 930282 1167869 1237139 1189576
$$ packed form
13194B63164M8416M8796m8743p6726m1638n064k9191n3714o3317j07279L5721
13183b9575M7641n6377O8080Q7990k8017j14473M661P4942l4960L8445r0560p7823
13171a10026R7526O4272M8615k9108m7548n0151K359J8666M0662J0175N603K1353
13159G2398O3274O6907P2684L5461J00013J45127J44226J26554K11587L9433j06306
13148I71358j41390j83687p0039j01392j84624o5615o88q4474o5346J40709R081
13137B23893k8906r5804M4987q954n438l1689n1133j5992k3314p3090m6614Q1777
13125c0277O7744J59306j4227j38587p0196l3961p2999P405J9572K1021J8031
13114f7168N4500J30706L0406K994M6403K02424K80735K49282K37587O9270m7563
$$ plain form
13103 1189576 1089678 917983 737472 549398 313094 182521 135290 145433 202168 187760
13093 187760 157154 112506 80268 24688 -23635 11067 67366 162535 222623 218678 108999
13082 108999 57618 72040 10983 -43008 -142136 -168511 -72050 -43260 -23077 -19041 41327 35544
13070 35544 9867 50269 205381 246558 133170 126574 172060 195951 291626 289951 356780 456821
13058 456821 452078 344179 273009 224276 229481 259639 151180 54929 22699 100094 38726
13047 38726 50107 102280 44683 25718 52524 146488 246754 148549 36264 -35222 -93670
13036 -93670 -116368 -110371 -12693 -2971 -76326 -115369 -69788 -114998 -92117 -55822 63827 205076
13024 205076 149828 126195 47592 -27031 68851 20537 -8085 101680 104192 -7174 -26598
$$ packed form
13103A189576r9898j71695j80511j88074k36304j30573m7231J0143N6735j4408
13093A87760l0606m4648l2238n5580m8323L4702N6299R5169O0088l945j09679
13082A08999n1381J4422o1057n3991r9128k6375R6461K8790K0183M036O0368n783
13070C5544k5677M0402J55112M1177j13388o596M5486K3891R5675j675O6829J00041
13058D56821m743j07899p1170m8733N205L0158j08459r6251l2230P7395o1368
13047C8726J1381N2173n7597j8965K6806R3964J00266r8205j12285p1486n8448
13036i3670k2698N997R7678R722p3355l9043M5581m5210K2881L6295J19649J41249
13024B05076n5248k3633p8603p4623R5882m8314k8622J09765K512j11366j9424
$$ plain form
13013 -26598 62259 240740 240398 141807 157669 186056 128140 121427 119534 -19287 -87027 -147495
13001 -147495 -116630 18819 158655 185840 196760 8302 -109608 -48197 -35690 -25421 42254
12990 42254 156383 162966 83747 87496 147388 121860 112860 107129 101677 77036 146648 112963
12978 112963 85658 152576 161159 152116 89092 332 -120106 -175566 -207727 -114714 -55062 -79424
12966 -79424 -20845 35204 102993 97126 69731 -12242 -71506 -194249 -177761 -67429 -33683
12955 -33683 43051 1352 -25112 -5378 50110 144601 160285 152644 66413 43946 14502 -7596
12943 -7596 14124 -48661 -47154 -58047 -4911 43938 -105480 -195177 -182139 -106345 -114764 -33737
12931 -33737 -54057 -171463 -106921 10011 49111 67514 73420 22994 -115424 -169059 -128371
$$ packed form
13013b6598Q8857J78481l42r8591J5862K8387n7916o713j893j38821o7740o0468
13001a47495L0865J35449J39836K7185J0920j88458j17910O1411J2507J0269O7675
12990D2254J14129O583p9219L749N9892k5528r000n731n452k4641O9612l3685
12978A12963k7305O6918Q583r043o3024q8760j20438n5460l2161R3013N9652k4362
12966g9424N8579N6049O7789n867k7395q1973n9264j22743J6488J10332L3746
12955c3683P6734m1699k6464J9734N5488R4491J5684p641q6231k2467k9444k2098
12943g596K1720o2785J507j0893N3136M8849j49418q9697J3038P5794q419Q1027
12931c3737k0320j17406O4542J16932L9100J8403N906n0426j38418n3635M0688
$$ plain form
12920 -128371 -58342 24865 -41194 -141877 -197956 -128655 37481 48632 24479 95237 -10241
12909 -10241 -74584 -44331 28793 16625 2748 101295 38213 -55418 -84017 3774 -23026 -170502
12897 -170502 -143501 -84037 -126005 -60790 -28505 -3317 -751 -59451 -79718 -66635 -42567 -12808
12885 -12808 41568 96135 174541 151574 100438 26322 -80513 -99506 -17422 60337 -21232
12874 -21232 94170 146003 28596 8440 56893 -7900 -70092 -83726 -120791 -215419 -179386
12863 -179386 -83251 -52608 -61240 -93798 -144638 -140718 -193622 -135503 -59933 -79301 -153547 -102415
12851 -102415 -133811 -82299 -71800 -7365 -30869 35478 3680 -70589 -41649 9337 75517
12840 75517 87453 6660 -73475 -56619 71619 217056 186407 160494 58793 -539 -47829
$$ packed form
12920a28371P0029Q3207o6059j00683n6079O9301J66136J1151k4153P0758j05478
12909a0241o4343L0253P3124j2168j3877R8547o3082r3631k8599Q7791k6800j47476
12897a70502K7001N9464m1968O5215L2285K5188K566n8700k0267J3083K4068K9759
12885a2808N4376N4567P8406k2967n1136p4116j06835j8993Q2084P7759q1569
12874b1232J15402N1833j17407k0156M8453o4793o2192j3634l7065r4628L6033
12863a79386R6135L0643q632l2558n0840L920n2904N8119P5570j9368p4246N1132
12851a02415l1396N1512J0499O4435k3504O6347l1798p4269K8940N0986O6180
12840G5517J1936q0793q0135J6856J28238J45437l0649k5913j01701n9332m7290
$$ plain form
12829 -47829 7263 -122610 -167150 -97939 30807 108983 -7414 -53342 24070 56286 130315
12818 130315 183577 182692 110347 102634 124393 156185 133828 52037 39646 104484 148472 99788
12806 99788 32500 -23036 -83878 9497 29356 -75583 -116671 -92174 -120259 -122801 -104568 -90985
12794 -90985 -26600 24921 144427 113780 -85572 -148261 -38498 -47869 -61882 -26667 -36450
12783 -36450 6941 94756 163606 249181 246171 110250 137209 81569 -7424 -133905 -163281
12772 -163281 -184021 -191727 -113636 -124195 -168666 -161442 -155385 -124900 -132018 -66304 -19340 -60254
12760 -60254 -41898 10491 29046 69161 203715 175388 56171 66016 79994 13087 -72152
12749 -72152 -101148 38128 36027 104172 108058 48809 89121 187466 175425 124382 62105 161977
$$ packed form
12829d7829N5092j29873m4540O9211J28746P8176j16397m5928P7412L2216P4029
12818A30315N3262q85p2345p713K1759L1792k2357q1791j2391O4838M3988m8684
12806I9788o7288n5536o0842R3375J9859j04939m1088K4497k8085k542J8233J3583
12794i0985O4385N1521J19506l0647j99352o2689J09763r371j4013L5215r783
12783c6450M3391Q7815O8850Q5575l010j35921K6959n5640q8993j26481k9376
12772a63281k0740p706P8091j0559m4471P224O057L0485p118O5714M6964m0914
12760f0254J8356N2389J8555M0115J34554k8327j19217R845J3978o6907q5239
12749g2152k8996J39276k101O8145L886n9249M0312R8345j2041n1043o2277R9872
$$ plain form
12737 161977 140973 179439 188042 130231 80183 112448 99274 183249 285852 189982 98781
12726 98781 130544 95079 115821 110251 117509 173173 230899 272624 190949 105774 159228 252215
12714 252215 312439 197179 139271 103164 31577 -40538 -102111 -48143 145236 313118 267720
12703 267720 307736 230149 160579 143984 182971 138454 23923 -23456 2570 23096 -59329
12692 -59329 -159907 -158413 -89204 -99728 -7151 31998 56354 33774 28897 -30340 -182981 -148159
12680 -148159 -18450 96513 104309 -15244 -159385 -194173 -123769 -44163 -20251 -79698 -161096
12669 -161096 -125390 -98249 -51477 74415 94868 -12799 -29745 -53909 -67836 -119097 -139871
12658 -139871 43294 148797 -464 -83972 -108145 -93503 33406 84685 35286 30489 115868
$$ packed form
12737A61977k1004L8466Q603n7811n0048L2265j3174Q3975J02603r5870r1201
12726I8781L1763l5465K0742n570P258N5664N7726M1725q1675q5175N3454R2987
12714B52215O0224j15260n7908l6107p1587p2115o1573N3968J93379J67882m5398
12703B67720M0016p7587o9570j6595L8987m4517j14531m7379K6026K0526q2425
12692e9329j00578J494O9209j0524R2577L9149K4356k2580m877n9237j52641L4822
12680a48159J29709J14963P796j19553j44141l4788P0404P9606K3912n9447q1398
12669a61096L5706K7141M6772J25892K0453j07667j6946k4164j3927n1261k0774
12658a39871J83165J05503j49261q3508k4173J4642J26909N1279m9399m797Q5379
$$ plain form
12647 115868 128336 254664 489039 720443 1004142 1276604 1667484 1925816 2156589 2156897
12637 2156897 1860038 1504595 1186185 807206 542810 382599 285774 229675 138275 179997
12627 179997 258202 212803 110606 106654 168191 181887 151486 136569 142514 136344 203466 178992
12615 178992 144826 94870 21198 -10541 -47365 49244 130671 46460 65891 52031 -125870
12604 -125870 -208192 -87975 51272 95870 137039 118938 4224 -94691 -100737 -77138 -29890
12593 -29890 -35509 20421 -31751 -118913 -109379 -48130 -9828 8910 46275 118244 85357 29940
12581 29940 9509 -7993 14359 39837 -74355 -20333 38659 -70437 -78983 60945 30812
12570 30812 6712 71245 78984 10864 -26119 -51984 -37623 56920 101575 32758 -15377 -78416
$$ packed form
12647A15868J2468J26328K34375K31404K83699K72462L90880K58332K30773L08
12637B156897k96859l55443l18410l78979k64396j60211r6825n6099r1400M1722
12627A79997P8205m5399j02197l952O1537J3696l0401j4917N945o170O7122k4474
12615A78992l4166m9956p3672l1739l6824R6609Q1427q4211J9431j3860j77901
12604a25870q2322J20217J39247M4598M1169j8101j14714r8915o046K3599M7248
12593b9890n619N5930n2172q7162R534O1249L8302J8738L7365P1969l2887n5417
12581B9940k0431j7502K2352K5478j14192N4022N8992j09096q546J39928l0133
12570C0812k4100O4533P739o8120l6983k5865J4361R4543M4655o8817m8135o3039
$$ plain form
12558 -78416 -56534 24470 -29331 -91392 -56077 -68207 -36810 93838 110524 69116 94163
12547 94163 20173 474 -20016 -50629 -110993 -7836 37757 63672 102127 56771 -55968
12536 -55968 -76566 -20011 -40439 -60098 -24529 114336 196878 148639 69143 -38465 -63850
12525 -63850 54040 149420 72718 30119 121827 150668 127890 128244 71656 123306 160764 48466
12513 48466 44465 113624 35749 3065 161050 168869 169336 95886 70387 73889 128140 169653
12501 169653 43658 -51905 41443 139162 159314 108517 -254 -33049 -44459 -21563 -119230
12490 -119230 -76949 -42326 -96822 -97586 -8893 -60652 -76628 3380 38787 4932 29289 41464
12478 41464 9952 -75455 -5747 47458 15541 17995 155782 142450 3598 -6610 -26720
$$ packed form
12558g8416K1882Q1004n3801o2061L5315j2130L1397J30648J6686m1408K5047
12547I4163p3990j9699k0490l0613o0364J03157M5593K5915L8455m5356j12739
12536e5968k0598N6555k0428j9659L5569J38865Q2542m8239p9496j07608k5385
12525f3850J17890R5380p6702m2599R1708K8841k2778L54n6588N1650L7458j12298
12513D8466m001O9159p7875l2684J57985P819M67p3450k5499L502N4251M1513
12501A69653j25995r5563R3348R7719K0152n0797j08771l2795j1410K2896r7667
12490a19230M2281L4623n4496p64Q8693n1759j5976Q0008L5407l3855K4357J2175
12478D1464l1512q5407O9708N3205l1917K454J37787j3332j38852j0208k0110
$$ plain form
12467 -26720 -13351 44871 67611 35126 -83721 -97594 -101764 43560 220534 194229 76939
12456 76939 106034 149303 119233 111410 75493 -75664 -156435 -134083 -47920 62570 106122
12445 106122 64848 41053 -13303 -26474 13142 3599 83425 71089 80250 38887 883 -34671
12433 -34671 -50899 -25219 53995 54931 -43654 -65654 -8441 1719 14333 55258 124450 40190
12421 40190 -48303 -7977 71458 67428 11787 87864 431 -19962 57666 66569 74350 -54841
12409 -54841 -206363 -203160 -113690 -67737 -89823 53583 52950 22092 23223 -120052 -106732 -48428
12397 -48428 -61312 -61441 42652 151420 142836 123374 113395 -35074 -31403 -70066 -46039 -31705
12385 -31705 -59610 -77849 -100988 -6 111974 171750 245788 188096 116230 112755 51367
$$ packed form
12467b6720J3369N8222K2740l2485j18847j3873m170J45324J76974k6305j17290
12456G6939K9095M3269l0070p823l5917j51157q0771K2352Q6163J10490M3552
12445A06122m1274k3795n4356j3171L9616r543P9826j2336R161m1363l8004l5554
12433c4671j6228K5680P9214R36r8585k2000N7213J0160J2614M0925O9192q4260
12421D0190q8493M0326P9435m030n5641P6077q7433k0393P7628Q903P781j29191
12409e4841j51522L203Q9470M5953k2086J43406o33l0858J131j43275J3320N8304
12397d8428j2884j29J04093J08768q584j9462r979j48469L671l8663K4027J4334
12385c1705k7905j8239k3139J00982J11980N9776P4038n7692p1866l475o1388
$$ plain form
12374 51367 20111 -126063 -106950 24399 23674 172079 199492 113954 39950 -87307 -197060
12363 -197060 -154104 -41756 90031 113190 78959 20221 -8473 -120603 -227449 -223638 -144564
12352 -144564 -77396 -62245 44498 24130 45946 25455 -1423 -49539 21073 91254 141917
12341 141917 107397 -5587 -5974 5410 163580 213138 246737 232314 187544 94857 75798
12330 75798 39063 14996 4041 170364 147727 186580 164116 240328 190655 176116 126882
12319 126882 86795 82801 68318 29255 99262 152570 132279 104261 188296 100933 -40870
12308 -40870 -89287 -127283 -189119 -241026 -261890 -189290 -145498 -116482 -99710 -97545 -55909 -90977
12296 -90977 -113634 -109050 -86487 -11971 53750 22840 -76171 -206616 -176364 -67780 17773
$$ packed form
12374E1367l1256j46174J9113J31349p25J48405K7413q5538p4004j27257j09753
12363a97060M2956J12348J31787K3159l4231n8738k8694j12130j06846L811P9074
12352a44564O7168J5151J06743k0368K1816k0491k6878m8116P0612P0181N0663
12341A41917l4520j12984l87J1384J58170M9558L3599j4423m4770r2687j9059
12330G5798l6735k4067j0955J66323k2637L8853k2464P6212m9673j4539m9234
12319A26882m0087l994j4483l9063P0007N3308k0291k8018Q4035q7363j41803
12308d0870m8417l7996o1836n1907k0864P2600M3792K9016J6772K165M1636l5068
12296i0977k2657M584K2563P4516O5721l0910r9011j30445L0252J08584Q5553
$$ plain form
12285 17773 89523 -19222 -28328 -22388 -1467 -29608 57707 106204 34449 38448 155406 101592
12273 101592 5575 -88463 -126543 -57706 63746 33593 40638 52423 62149 11269 -111262
12262 -111262 -147124 -126057 -110896 -99987 -8702 -8474 -1148 151434 120786 69519 125582 108672
12250 108672 81181 35184 131705 123373 66070 18658 28800 86446 12260 -79610 -91790 -110885
12238 -110885 -135718 -214081 -88429 -49853 -35524 38173 76272 138792 142565 80667 72243 89492
12226 89492 90848 55414 24287 -90433 -203202 -187959 -102268 -54419 -123052 -66920 -11657
12215 -11657 21849 -56060 -13856 20964 37211 33420 -22329 -51780 35041 125726 105037 5268
12203 5268 63853 -38829 -89576 -3682 -47371 -61186 23860 52943 28168 -20922 -42496 42346
$$ packed form
12285A7773P1750j08745r106N940K0921k8141Q7315M8497p1755L999J16958n3814
12273A01592r6017r4038l8080O8837J21452l0153P045J1785R726n0880j22531
12262a11262l5862K1067J5161J0909R1285K28P326J52582l0648n1267N6063j6910
12250A08672k7491m5997R6521q332n7303m7412J0142N7646p4186r1870j2180j9095
12238a10885k4833p8363J25652L8576J4329P3697L8099O2520L773o1898q424J7249
12226H9492J356l5434l1127j14720j12769J5243Q5691M7849o8633N6132N5263
12215a1657L3506p7909M2204L4820J6247l791n5749k9451Q6821R0685k0689r9769
12203E268N8585j02682n0747Q5894m3689j3815Q5046K9083k4775m9090k1574Q4842
$$ plain form
12191 42346 124281 104475 17882 -2279 -65379 -95310 -169349 -211385 -224844 -129034 -35953 -65631
12179 -65631 -140657 -76536 -14606 62993 22789 7347 10079 -16565 -19345 80294 120544 47398
12167 47398 -71814 -121602 -8252 124558 184055 120431 78087 37230 -56340 -173100 -165357
12156 -165357 -124228 -173098 -141064 -21302 -29050 -139333 -86640 -22876 25112 47366 31023
12145 31023 -39929 -163298 -136495 -85165 -14631 42879 105609 98921 102522 56102 26940 -28998
12133 -28998 -72687 -201609 -74740 60950 37480 73800 100263 -66147 -79150 -141173 -104577
12122 -104577 -59281 -101931 -96509 -71936 -69928 -86879 -142450 -176269 -153977 -83804 -34875 101735
12110 101735 112041 46421 68047 27005 61050 95357 89577 101272 100267 99672 90588 87041 63079
$$ packed form
12191D2346Q1935j9806q6593k0161o3100k9931p4039m2036j3459R5810R3081k9678
12179f5631p5026O4121O1930P7599m0204j5442K732k6644k780R9639M0250p3146
12167D7398j19212m9788J13350J32810N9497o3624m2344m0857r3570j16760P743
12156a65357M1129m8870L2034J19762p748j10283N2693O3764M7988K2254j6343
12145C1023p0952j23369K6803N1330P0534N7510O2730o688L601m6420k9162n5938
12133b8998m3689j28922J26869J35690k3470L6320K6463j66410j3003o2023L6596
12122a04577M5296m2650N422K4573K008j6951n5571l3819K2292P0173M8929J36610
12110A01735J0306o5620K1626m1042L4045L4307n780J1695j005n95r084l547k3962
$$ plain form
12097 63079 18657 -53428 100994 260801 333726 227994 253959 277850 278247 239297 92029
12086 92029 -26512 22059 32833 8083 45200 181225 165279 55949 34908 112064 195408
12075 195408 218627 163622 127065 133458 92064 -5525 60413 111929 35787 -40021 -66692 -8377
12063 -8377 40488 -100347 -112723 -75522 -74220 49532 64047 -6309 20274 23854 -57128 -156114
12051 -156114 -154545 -8141 13445 -21230 66464 158892 218330 277255 274213 244302 162942 52077
12039 52077 -3129 21968 -11502 -170280 -142475 -145711 -108825 -112190 -88409 -9601 -59707 43653
12027 43653 72505 115414 120653 80040 108202 156523 191238 124084 125718 107852 155035 306391
12015 306391 399990 408162 420398 382047 473925 465668 389118 297864 354231 354281 436792 607601
$$ packed form
12097F3079m4422p2085J54422J59807P2925j05732K5965K3891L97l8950j47268
12086I2029j18541M8571J0774k4750L7117J36025j5946j09330k1041P7156Q3344
12075A95408K3219n5005l6557O393m1394r7589O5938N1516p6142p5808k6671N8315
12063h377M8865j40835j2376L7201J302J23752J4515p0356K6583L580q0982r8986
12051a56114J569J46404K1586l4675Q7694R2428N9438N8925l042k9911q1360j10865
12039E2077n5206K5097l3470j58778K7805l236L6886l365K3781P8808n0106J03360
12027D3653K8852M2909N239m0613K8162M8321L4715o7154J634j7866M7183J51356
12015C06391R3599Q172J2236l8351R1878q257p6550r1254N6367N0Q2511J70809
$$ plain form
12003 607601 924281 1175932 1409687 1810823 2291635 2569128 2532207 2216080 1717944 1309043
11993 1309043 998611 779168 613300 398908 184105 62918 40894 37720 121357 278257
11983 278257 212219 94763 23313 113953 65594 -17640 -96703 -20136 -60814 -91660 -68100
11972 -68100 28375 132879 138983 165959 115496 54564 -61139 -147813 -116349 -169671 -248155
11961 -248155 -230346 -26555 37258 54158 84947 99774 153190 97443 21418 64342 28602
11950 28602 121328 209581 194524 228385 222409 120015 98573 122735 12245 -1293 -51059
11939 -51059 -63800 -107005 -170476 -57501 52784 120493 195074 212569 150437 136727 62964
11928 62964 71992 146536 228728 293151 194540 224801 272571 206017 55000 121603 258501
$$ packed form
12003F07601L16680K51651K33755M01136M80812K77493l6921l16127m98136m08901
11993A309043l10432k19443j65868k14392k14803j21187k2024l174Q3637J56900
11983B78257o6038j17456p1450R0640m8359q3234p9063P6567m0678l0846K3560
11972f8100R6475J04504O104K6976n0463o0932j15703q6674L1464n3322p8484
11961b48155J7809K03791O3813J6900L0789J4827N3416n5747p6025M2924l5740
11950B8602R2726Q8253j5057L3861n976j02394k1442K4162j10490j3538m9766
11939e1059j2741m3205o3471J12975J10285O7709P4581J7495o2132j3710p3763
11928F2964R028P4544Q2192O4423r8611L0261M7770o6554j51017O6603J36898
$$ plain form
11917 258501 347087 419028 493166 555071 618093 694822 615670 552468 633134 471384 391276
11906 391276 481609 400307 189175 228477 374056 400974 382609 269935 288332 383649 570993
11895 570993 536264 510932 513357 571860 599104 535816 482456 542252 527031 515606 540250 595667
11883 595667 691433 766080 810308 853962 932616 979760 985200 935521 983342 1216757 1355542
11872 1355542 1486132 1571085 1741681 1818154 2057257 2202178 2379991 2551901 2819597 3097455
11862 3097455 3526284 3955021 4590080 5362059 6338681 7430111 8905836 10671200 12619736
11853 12619736 14903157 17595809 21144005 26219513 33523752 44903448 63586415 96199538
11845 96199538 150482039 225355214 304249211 367016774 401085253 396737144 353415541
$$ packed form
11917B58501Q8586P1941P4138O1905O3022P6729p9152o3202Q0666j61750q0108
11906C91276R0333q1302k11132L9302J45579K6918j8365j12674J8397R5317J87344
11895E70993l4729k5332K425N8503K7244o3288n3360N9796j5221j1425K4644N5417
11883E95667R5766P4647M4228M3654P8654M7144N440m9679M7821K33415J38785
11872A355542J30590Q4953J70596P6473K39103J44921J77813J71910K67696K77858
11862C097455M28829M28737O35059P71979R76622J091430J475725J765364J948536
11853A2619736K283421K692652L548196N075508P304239J1379696J8682967L2613123
11845I6199538N4282501P4873175P8893997O2767563L4068479m348109m3321603
$$ plain form
11838 353415541 288823538 223119421 165151289 118603443 85518632 63587639 49229770
11831 49229770 39580246 32709349 27694190 24054264 21261775 18929604 16993649 15135013
11823 15135013 13365550 11797677 10460835 9376303 8585332 7897554 7251942 6622352 6183687
11814 6183687 5741369 5403559 4999180 4595952 4288172 4049343 3824200 3520422 3397803
11805 3397803 3314338 3177612 3174041 3058825 2801894 2624415 2533647 2468621 2435335 2365355 2284296
11794 2284296 2225886 2134405 2108302 1986859 1904363 1811921 1704208 1547889 1519693 1511380 1364266
11783 1364266 1244356 1175505 1209399 1122385 950895 907229 907727 922517 914633 814581 832971
11772 832971 792593 769764 632965 486341 446411 579079 680845 629584 482955 416104
$$ packed form
11838C53415541o4592003o5704117n7968132m6547846l3084811k1930993j4357869
11831D9229770r649524o870897n015159l639926k792489k332171j935955j858636
11823A5135013j769463j567873j336842j084532p90971o87778o45612o29590m38665
11814F183687m42318l37810m04379m03228l07780k38829k25143l03778j22619
11805C397803q3465j36726l571j15216k56931j77479r0768o5026l3286o9980q1059
11794B284296n8410r1481k6103j21443q2496r2442j07713j56319k8196q313j47114
11783A364266j19910o8851L3894q7014j71490m3666M98J4790p884j00052J8390
11772H32971m0378k2829j36799j46624l9930J32668J01766n1261j46629o6851
$$ plain form
11762 416104 483693 546556 508111 556172 570793 435195 380643 435929 501673 453657 421554
11751 421554 399932 428024 420517 402923 431720 496884 472876 456127 452240 399490 299537 342421
11739 342421 408945 427895 392472 346585 303611 298817 277819 329064 353430 312127 274718 342368
11727 342368 367590 417848 331118 239320 164529 256487 365131 335009 352836 337135 403255
11716 403255 443841 458034 464547 488177 526089 455786 246270 184448 225945 274592 309651
11705 309651 292796 349870 382417 329511 245206 345376 445907 458654 363179 261920 180597
11694 180597 234092 275068 294918 437239 597707 625098 566880 728619 907052 1194787
11684 1194787 1490031 1730809 1927336 1846333 1534965 1215578 908979 592285 384532 168085
$$ packed form
11762D16104O7589O2863l8445M8061J4621j35598n4552N5286O5744m8016l2103
11751D21554k1622K8092p507j7594K8797O5164k4008j6749l887n2750r9953M2884
11739C42421O6524J8950l5423m5887m2974m794k0998N1245K4366m1303l7409O7650
11727C42368K5222N0258q6730r1798p4791R1958J08644l0122J7827j5701O6120
11716D03255M0586J4193O513K3630L7912p0303k09516o1822M1497M8647L5059
11705C09651j6855N7074L2547n2906q4305J00170J00531J2747r5475j01259q1323
11694A80597N3495M0976J9850J42321J60468K7391n8218J61739J78433K87735
11684A194787K95244K40778J96527q1003l11368l19387l06599l16694k07753k16447
$$ plain form
11674 168085 59301 175713 260515 298579 197006 -2658 -36683 3054 -37301 -98589 -160687
11663 -160687 -229160 -206190 -159409 -87679 -90521 -22888 -26916 20366 31064 -32173 -54618 33270
11651 33270 -4175 50633 239062 342180 315437 273036 226802 140842 104082 196574 138386
11640 138386 68988 146162 124618 140859 169990 85892 62273 57730 -1191 29537 71306 -44095
11628 -44095 -181076 -84443 84769 16700 -76434 27191 40948 -46642 -7525 -57354 8611
11617 8611 41834 80609 69515 7056 34728 70440 88048 99717 80362 54396 -81825 -35901
11605 -35901 26179 -5148 22331 38066 21739 -65437 -135358 -103901 -19646 117794 121605 64997
11593 64997 41342 -18313 -59057 -58464 -12163 64726 153940 129913 -36811 -60110 46349 18999
$$ packed form
11674A68085j08784J16412Q4802L8064j01573j99664l4025L9737m0355o1288o2098
11663a60687o8473K2970M6781P1730k842O7633m028M7282J0698o3237k2445Q7888
11651C3270l7445N4808J88429J03118k6743m2401m6234q5960l6760R2492n8188
11640A38386o9398P7174k1544J6241K9131q4098k3619m543n8921L0728M1769j15401
11628d4095j36981R6633J69212o8069r3134J03625J3757q7590L9117m9829O5965
11617H611L3223L8775j1094o2459K7672L5712J7608J1669j9355k5966j36221M5924
11605c5901O2080l1327K7479J5735j6327q7176o9921L1457Q4255J37440L811n6608
11593F4997k3655n9655m0744N93M6301P6889Q9214k4027j66724k3299J06459k7350
$$ plain form
11581 18999 -8609 2336 159108 248686 121939 53791 74274 102130 -8102 -59752 7606
11570 7606 33133 106327 182687 172212 187108 197245 183220 211700 147090 167914 84716 83021
11558 83021 150612 62999 112080 128940 36627 28400 51287 134211 168841 124308 64156 73172
11546 73172 59307 18017 51398 110104 140251 73225 9076 11187 -63322 -102004 -60391 -41369
11534 -41369 -77074 43291 105399 81771 101747 49885 94619 121425 72409 74288 114467 118837
11522 118837 115469 91598 164295 174923 188524 159379 97362 60348 10464 -30429 -90800 -114257
11510 -114257 -88032 -4981 -18854 36015 19387 80919 6075 -447 15135 43789 39047 3069
11498 3069 51165 98782 84734 67835 85328 146017 129984 99155 99706 74605 76575 80867 93870
$$ packed form
11581A8999k7608J0945J56772Q9578j26747o8148K0483K7856j10232n1650O7358
11570G606K5527P3194P6360j0475J4896J0137j4025K8480o4610K0824q3198j695
11558H3021O7591q7613M9081J6860r2313q227K2887Q2924L4630m4533o0152R016
11546G3172j3865m1290L3381N8706L0147o7026o4149K111p4509l8682M1613J9022
11534d1369l5705J20365O2108k3628J9976n1862M4734K6806m9016J879M0179M370
11522A18837l368k3871P2697J0628J3601k9145o2017l7014m9884m0893o0371k3457
11510a14257K6225Q3051j3873N4869j6628O1532p4844o522J5582K8654m742l5978
11498C069M8096M7617j4048j6899J7493O0689j6033l0829N51k5101J970M292J3003
$$ plain form
11485 93870 70396 109974 140839 123901 155129 129224 59762 125653 78481 -62225 -31546
11474 -31546 35889 -26572 -90292 -133914 -232299 -201477 -93845 -29549 -68716 -38001 67312
11463 67312 126020 129533 55182 18558 16952 105690 160803 193243 268376 164500 11547 23809
11451 23809 21801 16251 85700 23353 73684 109792 47473 3746 8042 -12860 40267 10404
11439 10404 21837 77789 57523 4919 -31015 -4545 -28860 -39671 -29205 3009 -30384 -122636
11427 -122636 -186745 -80403 -106343 -125090 -75038 31861 68064 142279 131933 99950 17932
11416 17932 -47152 -63326 -53159 -62233 -34385 -73189 -40481 -58567 -85098 56676 163327
11405 163327 134992 30109 22301 -25602 27800 82164 109513 135431 92632 109485 224339
$$ packed form
11485I3870k3474L9578L0865j6938L1228k5905o9462O5891m7172j40706L0679
11474c1546O7435o2461o3720m3622r8385L0822J07632O4296l9167L0715J05313
11463F7312N8708L513p4351l6624j606Q8738N5113L2440P5133j03876j52953J2262
11451B3809k008n550O9449o2347N0331L6108o2319m3727M296k0902N3127k9863
11439A0404J1433N5952k0266n2604l5934K6470k4315j0811J0466L2214l3393r2252
11427a22636o4109J06342k5940j8747N0052J06899L6203P4215j0346l1983q2018
11416A7932o5084j6174J0167r074K7848l8804L2708j8086k6531J41774J06651
11405A63327k8335j04883p808m7903N3402N4364K7349K5918m2799J6853J14854
$$ plain form
11394 224339 247816 128920 -53857 -43092 86585 130621 31551 86552 -804 -100844 -83186
11383 -83186 -22449 -112734 -31044 -3044 143276 114994 104683 171134 232301 178716 96487
11372 96487 -47567 -70320 -82430 -96631 -26861 -28696 -89910 -28473 20882 12704 22656 -27311
11360 -27311 -76499 -113923 -145309 -181771 -75633 -69136 -92756 -101262 -160280 -39236 12739 -56410
11348 -56410 -91226 14474 -44515 -62135 30112 -35601 43183 7675 -1819 139399 112304
11337 112304 138822 63990 51736 182172 239142 147552 28570 -78033 -144092 -120116 -34255
11326 -34255 -28185 -57918 -85192 -112090 -13662 32525 70830 48832 18726 -11744 -22733 29631
11314 29631 138265 177739 173776 90815 19373 1353 -48433 -37828 -50761 -39928 -28386 -1711
$$ packed form
11394B24339K3477j18896j82777J0765J29677M4036r9070N5001q7356j00040J7658
11383h3186O0737r0285Q1690K8000J46320k8282j0311O6451O1167n3585q2229
11372I6487j44054k2753j2110j4201O9770j835o1214O1437M9355q178R952m9967
11360b7311m9188l7424l1386l6462J06138O497k3620q506n9018J21044N1975o9149
11348e6410l4816J05700n8989j7620R2247o5713P8784l5508r494J41218k7095
11337A12304K6518p4832j2254J30436N6970r1590j18982j06603o6059K3976Q5861
11326c4255O070k9733k7274k6898R8428M6187L8305k1998l0106l0470j0989N2364
11314B9631J08634L9474l963q2961p1442j8020m9786J0605j2933J0833J1542K6675
$$ plain form
11302 -1711 -54665 38894 -17727 -35124 -72788 -176020 -200771 -115420 -93086 -144643 -110960 61014
11290 61014 169325 141593 125275 73961 -15214 -57161 -1819 93008 86501 61614 -13626 -111480
11278 -111480 -27255 19866 47748 -4361 -124536 -89871 -61181 -27629 -36353 -31944 73101
11267 73101 110537 51805 62582 20582 -26720 -49257 16320 60507 46910 -21127 -73344 -126842
11255 -126842 -25227 11043 -43921 30451 50945 -80779 -113646 -69050 -97207 -204666 -261993
11244 -261993 -180682 -144546 -110943 -214009 -140993 -97306 -230487 -276623 -182174 -133918 -144685
11233 -144685 -188113 -223958 -143388 -72346 39449 140784 222443 234950 125933 -50196 -83594
11222 -83594 -70762 2257 -4656 68800 133775 136572 121644 -18325 -128728 -94704 44682
$$ packed form
11302a711n2954R3559n6621j7397l7664j03232k4751Q5351K2334n1557L3683J71974
11290F1014J08311k7732j6318n1314q9175m1947N5342R4827o507k4887p5240r7854
11278a11480Q4225M7121K7882n2109j20175L4665K8690L3552q724M409J05045
11267G3101L7436n8732J0777m2000m7302k2537O5577M4187j3597o8037n2217n3498
11255a26842J01615L6270n4964P4372K0494j31724l2867M4596k8157j07459n7327
11244b61993Q1311L6136L3603j03066P3016M3687j33181m6136R4449M8256j0767
11233a44685m3428l5845Q0570P1042J11795J01335Q1659J2507j09017j76129l3398
11222h3594J2832P3019o913P3456O4975K797j4928j39969j10403L4024J39386
$$ plain form
11211 44682 99079 25314 -16705 -146507 -187165 -42334 -6079 -59028 -4515 18330 -6597
11200 -6597 -23342 -4175 28295 3419 42527 62673 29122 -64865 -58861 -69426 -116925 -78700
11188 -78700 -92955 -98128 -131806 -126300 2592 -61505 -45743 -15585 -16689 28624 18272 18239 59647
11175 59647 57503 91755 97247 105000 82142 28177 -25797 -47474 -63426 -83951 -116029 -223717
11163 -223717 -179062 -120162 -103375 -82977 -58148 -129755 -108692 4868 17453 -56029 -154418
11152 -154418 -178745 -133043 -167934 -54264 58711 105795 150161 170302 244781 256006 174191
11141 174191 99746 35776 -10633 -85266 -80753 -182677 -90876 20764 -4335 -89193 -85258
11130 -85258 -81157 -31769 43336 45190 80437 144139 118346 16260 -80687 -82923 -66392 -74862
$$ packed form
11211D4682N4397p3765m2019j29802m0658J44831L6255n2949N4513K2845k4927
11200f597j6745J9167L2470k4876L9108K0146l3551r3987O004j0565m7499L8225
11188g8700j4255n173l3678N506J28892o4097J5762L0158j104M5313j0352l3M1408
11175E9647k144L4252N492P753k2858n3965n3974k1677j5952k0525l2078j07688
11163b23717M4655N8900J6787K0398K4829p1607K1063J13560J2585p3482r8389
11152a54418k4327M5702l4891J13670J12975M7084M4366K0141P4479J1225q1815
11141A74191p4445o3970m6409p4633M513j01924R1801J11640k5099q4858L935
11130h5258M101M9388P5105J854L5247O3702k5793j02086r6947k236J6531q470
$$ plain form
11118 -74862 -36350 -7740 70058 37136 -62385 -122450 -123370 -39029 122426 175777 26510 -19100
11106 -19100 -59159 -68285 -81349 -92446 -62600 -58135 -44225 53467 41134 5545 -149958 -279164
11094 -279164 -280908 -198144 -153785 -152259 -158142 -182902 -227329 -216878 -105731 19822 49217 -42294
11082 -42294 -106102 -20486 -29919 -147644 -129269 -73655 -65318 -115095 -100272 -94007 -38008 7991
11070 7991 -99120 -94895 -59782 -14661 4355 -107728 -42679 -8111 20447 -31653 -120159 -71076
11058 -71076 -63078 -59525 -138597 -176131 -198956 -111402 -82893 -25192 -43490 3531 32290 125019
11046 125019 198837 167756 163103 167344 316837 606119 892018 1345964 1699067 1845381 1898882
11035 1898882 1851203 1684593 1418173 969388 668273 521726 431217 374311 322647 242869
$$ packed form
11118g4862L8512K8610P7798l2922r9521o0065r20Q4341J61455N3351j49267m5610
11106a9100m0059r126j3064j1097K9846M465J3910R7692j2333l5589j55503j29206
11094b79164j744Q2764M4359J526n883k4760m4427J0451J11147J25553K9395r1511
11082d2294o3808Q5616r433j17725J8375N5614Q337m9777J4823O265N5999M5999
11070G991j07111M225L5113M5121J9016j12083O5049L4568K8558n2100q8506M9083
11058g1076P998L553p9072l7534k2825Q7554K8509N7701j8298M7021K8759R2729
11046A25019P3818l1081m653M241J49493K89282K85899M53946L53103J46314N3501
11035A898882m7679j66610k66420m48785l01115j46547r0509n6906n1664p9778
$$ plain form
11025 242869 269388 258239 311577 323804 350031 337628 208969 90349 54334 77097 74601
11014 74601 124913 110179 92943 91763 -19042 -74253 18015 38467 -58620 -114817 -14621
11003 -14621 126727 79636 561 -32520 -74056 -22599 106068 128434 138179 48639 64915
10992 64915 -14001 -55226 -27933 -60003 -160706 -143287 -235831 -230440 -180819 -40828 16134
10981 16134 52838 56368 50847 -10716 -60808 -40916 -13507 67683 148210 175549 139203 9565
10969 9565 42779 57030 -14849 -63362 -99654 -46939 5559 40237 124272 86762 26988 -78795
10957 -78795 -110330 -113014 -149443 -293856 -326829 -200937 -18110 8993 89954 112216 45057
10946 45057 27544 -54853 -103038 -517 -1710 -132334 -174512 -61682 42996 96337 121726
$$ packed form
11025B42869K6519j1149N3338J2227K6227j2403j28659j18620l6015K2763k496
11014G4601N0312j4734j7236j180j10805n5211R2268K0452r7087n6197J00196
11003a4621J41348m7091p9075l3081m1536N1457J28667K2366R745q9540J6276
10992F4915p8916m1225K7293l2070j00703J7419r2544N391M9621J39991N6962
10981A6134L6704L530n521o1563n0092J9892K7409Q1190Q0527K7339l6346j29638
10969I565L3214J4251p1879m8513l6292N2715N2498L4678Q4035l7510n9774j05783
10957g8795l1535k684l6429j44413l2973J25892J82827K7103Q0961K2262o7159
10946D5057j7513q2397m8185J02521j193j30624m2178J12830J04678N3341K5389
$$ plain form
10935 121726 43963 16572 -63378 -178439 -223442 -191892 -69455 -4620 22753 -2221 47459
10924 47459 81484 -844 -28681 -55085 -33141 131429 127295 27528 -82835 -32658 -6340
10913 -6340 -75210 -125817 -273673 -245003 -220054 -296341 -231591 -175611 -211955 -182870 -139929 16993
10901 16993 136122 140213 126375 114045 93849 -75587 -88862 5402 -21029 28435 -2666
10890 -2666 27650 197845 286684 267568 305795 254558 210928 52620 -19305 24046 57456
10879 57456 24824 -71234 -79763 34500 -34660 -13767 -27416 -19022 -49960 -51348 -119452 -153644
10867 -153644 -99733 4710 19378 -44916 -90009 -119047 -132217 -81252 -61041 -82246 -210939
10856 -210939 -272723 -228685 -247876 -112107 -31609 49726 80579 2422 -105252 -152745 -146390
$$ packed form
10935A21726p7763k7391p9950j15061m5003L1550J22437O4835K7373k4974M9680
10924D7459L4025q2328k7837k6404K1944J64570m134r9767j10363N0177K6318
10913f340o8870n0607j47856K8670K4949p6287O4750N5980l6344K9085M2941J56922
10901A6993J19129M091j3838j2330k0196j69436j3275R4264k6431M9464l1101
10890b666L0316J70195Q8839j9116L8227n1237m3630j58308p1925M3351L3410
10879E7456l2632r6058q529J14263o9160K0893j3649Q394l0938j388o8104l4192
10867a53644N3911J04443J4668o4294m5093k9038j3170N0965K0211k1205j28693
10856b10939o1784M4038j9191J35769Q0498Q1335L0853p8157j07674m7493O355
$$ plain form
10845 -146390 -91070 -96264 -135936 -101274 -194046 -156752 -93986 -19118 -21822 -31825 -18982 -97334
10833 -97334 -11915 118513 219078 197542 128091 51177 -84883 -207591 -233412 -198930 -131997
10822 -131997 -27378 52825 94760 58201 20092 -5701 -46909 -87179 -89546 -85285 -154996 -217662
10810 -217662 -195693 -138823 -132091 -146334 -59713 86197 114956 107182 11956 -66185 -107633 -78038
10798 -78038 -15758 -37618 -17969 -3682 54871 17495 -34489 -36945 7015 -74534 -111079 -148354
10786 -148354 -173325 -166932 -84834 -29146 46112 31367 -30039 -39491 9242 -64900 -65666 22389
10774 22389 43078 48633 71317 18988 149633 155371 176140 183254 94947 47971 162463 196056
10762 196056 102681 170123 236073 211315 123686 155945 228625 163718 56716 -13786 103033
$$ packed form
10845a46390N5320n194l9672L4662r2772L7294O2766P4868k704j0003J2843p8352
10833i7334Q5419J30428J00565k1536o9451p6914j36060j22708k5821L4482O6933
10822a31997J04619Q0203M1935l6559l8109k5793m1208m0270k367M261o9711o2666
10810b17662K1969N6870O732j4243Q6621J45910K8759p774r5226p8141m1448K9595
10798g8038O2280k1860J9649J4287N8553l7376n1984k456M3960q1549l6545l7275
10786a48354k4971O393Q2098N5688P5258j4745o1406r452M8733p4142p66Q8055
10774B2389K0689N555K2684n2329J30645N738K0769P114q8307m6976J14492L3593
10762A96056r3375O7442O5950k4758q7629L2259P2680o4907j07002p0502J16819
$$ plain form
10751 103033 87766 49693 -41792 -84826 -83589 -43687 68376 98954 112774 90521 120997
10740 120997 171688 129516 88136 -110054 -215717 -259371 -194201 -78324 -77245 -114732 -94627
10729 -94627 -8346 -19173 37439 119279 118944 159404 220580 222234 100127 76520 142500 195859
10717 195859 181166 107215 14835 24834 6310 28187 -40138 -64840 -10240 13156 -7932 -73674
10705 -73674 -45086 -39736 3542 -22322 32486 96985 88230 60666 -38589 -1970 92669 60573
10693 60573 59941 -25539 -19895 20700 -45990 -28879 -50264 -20888 47875 62374 7288 39909
10681 39909 9288 -93509 -116064 -88025 -23938 -26182 -31874 -59721 -83519 -595 9330 -14401
10669 -14401 28626 104311 72057 -30258 -8204 -3587 22831 103426 251567 221983 99115
$$ packed form
10751A03033j5267l8073r1485m3034J237L9902J12063L0578J3820k2253L0476
10740A20997N0691m2172m1380j98190j05663m3654O5170J15877J079l7487K0105
10729i4627Q6281j0827N6612Q1840l35M0460O1176J654j22107k3607O5980N3359
10717A95859j4693p3951r2380R999j8524K1877o8325k4702N4600K3396k1088o5742
10705g3674K8588N350M3278k5864N4808O4499q755k7564r9255L6619R4639l2096
10693F0573o32q5480N644M0595o6690J7111k1385K9376O8763J4499n5086L2621
10681C9909l0621j02797k2555K8039O4087k244n692k7847k3798Q2924R925k3731
10669a4401M3027P5685l2254j02315K2054M617K6418Q0595J48141k9584j22868
$$ plain form
10658 99115 29512 -72058 55952 132538 53626 45966 67244 71752 55830 45444 44640 59913
10646 59913 132638 120740 84871 100243 39189 -32187 -97018 -3456 48610 69941 63980 28813
10634 28813 -37559 79322 111144 109732 56317 -51642 -49004 -45947 -97977 -137420 -63385 -64569
10622 -64569 -68711 -36042 -2668 -46804 -48212 90146 104653 -37348 -91193 -170811 -223735 -238620
10610 -238620 -205209 -136276 -167820 -132729 -28498 -25788 -121346 -234586 -217366 -128993 -114328
10599 -114328 -50708 -22667 -50415 -113461 -123631 -111660 -112328 -156091 -143517 -128778 -164713 -252509
10587 -252509 -261721 -166343 -72268 -110605 -121478 -57170 -2588 -10481 -86550 -82344 -45322 53156
10575 53156 128283 116375 49156 7007 21800 2258 -85531 -74159 86494 215601 245779
$$ packed form
10658I9115o9603j01570J28010P6586p8912p660K1278M508j5922j0386q04J5273
10646E9913P2725j1898l5869J5372o1054p1376o4831R3562N2066K1331n961l5167
10634B8813o6372J16881L1822j412n3415j07959K638L057n2030l9443P4035j184
10622f4569m142L2669L3374m4136j408J38358J4507j42001n3845p9618n2924j4885
10610b38620L3411O8933l1544L5091J04231K710r5558j13240J7220Q8373J4665
10599a14328O3620K8041k7748o3046j0170J1971o68m3763J2574J4739l5935q7796
10587b52509r212R5378R4075l8337j0873O4308N4582p893p6069M206L7022R8478
10575E3156P5127j1908o7219m2149J4793j9542q7789J1372J60653J29107L0178
$$ plain form
10564 245779 165326 129800 -35894 -46216 -49153 -32119 4044 84392 83029 44698 -9405 -16943
10552 -16943 -37492 -69059 -24542 -21298 -53679 3192 62992 98172 58206 112207 136634 6285
10540 6285 -10835 32635 17747 -24857 42914 -81 -48844 -15940 -436 -49118 -89059 -47670
10528 -47670 145332 147472 83597 -26927 -130189 -210149 -239853 -147331 -167368 -229921 -146406
10517 -146406 -76308 -35572 -78975 -107491 -32343 -11440 -49435 -10835 -97510 -45853 -27315
10506 -27315 -51177 41819 72728 80064 -14087 -28045 33033 -27616 -66340 -131029 -172271 -37817
10494 -37817 17006 36383 -13350 -30718 15850 -66290 -129310 -44178 534 -17413 -33878 -90532
10482 -90532 -33362 -87009 -94496 -124358 -98413 -64849 -57863 -98727 -71185 -85043 -56390 63981
$$ packed form
10564B45779q0453l5526j65694j0322k937J7034L6163Q0348j363l8331n4103p538
10552a6943k0549l1567M4517L244l2381N6871N9800L5180l9966N4001K4427j30349
10540F285j7120M3470j4888m2604O7771m2995m8763L2904J5504m8682l9941M1389
10528d7670J93002K140o3875j10524j03262p9960k9704R2522k0037o2553Q3515
10517a46406P0098M0736m3403k8516P5148K0903l7995L8600q6675N1657J8538
10506b7315k3862R2996L0909P336r4151j3958O1078o0649l8724o4689m1242J34454
10494c7817N4823J9377m9733j7368M6568q2140o3020Q5132M4712j7947j6465n6654
10482i0532N7170n3647p487k9862K5945L3564O986m0864K7542j3858K8653J20371
$$ plain form
10470 63981 5671 4479 110044 137686 161212 97100 57134 78992 40584 -117403 -118432 -56354
10458 -56354 17554 35564 -50693 -165009 -215095 -167455 -86044 -73578 -53102 34808 71966
10447 71966 47821 -21864 -5232 -15394 -7703 49043 54194 7072 -15175 34975 30875 -54334
10435 -54334 -47038 -47620 -198716 -208517 -115578 -78333 -21080 -420 -39505 -141676 -123945 9233
10423 9233 38644 -53167 -31726 24719 -95008 -83691 -54952 -48341 -18554 -16003 4493 43143
10411 43143 24899 -12956 -9474 53567 107631 86343 91959 114604 51962 -92286 -91884 -103392
10399 -103392 -32250 5877 74402 221483 291727 252805 211501 145472 40586 22603 16519
10388 16519 -74926 -76246 -100902 13927 3971 -62417 -73705 -102116 43477 107401 118842 47753
$$ packed form
10470F3981n8310j192J05565K7642K3526o4112l9966K1858l8408j57987j029O2078
10458e6354P3908J8010q6257j14316n0086M7640Q1411J2466K0476Q7910L7158
10447G1966k4145o9685J6632j0162P691N6746N151m7122k2247N0150m100q5209
10435e4334P296n82j51096r801R2939L7245N7253K0660l9085j02171J7731J33178
10423I233K9411r1811K1441N6445j19727J1317K8739O611K9787K551K0496L8650
10411D3143j8244l7855L482O3041N4064k1288N616K2645o2642j44248M02j1508
10399a03392P1142L8127O8525J47081P0244l8922m1304o6029j04886j7983o084
10388A6519r1445j320k4656J14829r956o6388j1288k8411J45593O3924J1441p1089
$$ plain form
10376 47753 -3812 99459 49192 -63616 -16916 17177 6904 32368 36860 -12887 -171987
10365 -171987 -162176 -113123 -131147 -167766 -114429 30172 19558 1314 21610 60677 46807
10354 46807 -40017 18500 -24034 -133033 -120969 -122225 -73781 -63823 6090 19936 80689 115683
10342 115683 51253 -31166 10429 44319 18531 -137511 -69062 -61926 -80576 -30220 -37366 -94159
10330 -94159 -161310 -136632 -94730 -58686 16887 -49168 -127177 -123451 -140795 -131810 -146757 -250745
10318 -250745 -274004 -262736 -315880 -126353 -44662 -9522 -35551 -42348 -55040 -74022 -98633
10307 -98633 -138955 -113116 -1512 119437 84768 -10361 37101 283 76673 93115 106222
10296 106222 64646 -51951 34836 17796 68850 124153 133363 15861 -76919 -80491 -87307 -74651
$$ packed form
10376D7753n1565J03271n0267j12808M6700L4093j0273K5464M492m9747j59100
10365a71987R811M9053j8024l6619N3337J44601j0614j8244K0296L9067j3870
10354D6807q6824N8517m2534j08999J2064j256M8444R958O9913J3846O0753L4994
10342A15683o4430q2419M1595L3890k5788j56042O8449P136j8650N0356p146n6793
10330i4159o7151K4678M1902L6044P5573o6055p8009L726j7344Q985j4947j03988
10318b50745k3259J1268n3144J89527Q1691L5140k6029o797j2692j8982k4611
10307i8633m0322K5839J11604J20949l4669r5129M7462l6818P6390J6442J3107
10296A06222m1576j16597Q6787j7040N1054N5303R210j17502r2780l572o816J2656
$$ plain form
10284 -74651 -145749 -108497 -28163 -6172 -60955 -116692 -180273 -144605 -91460 -18837 17064 -31575
10272 -31575 21875 -20351 -81782 -116278 -52570 18046 26311 9784 -27721 -42288 -7955 22762
10260 22762 -61559 -43848 58570 168970 144493 54837 19 -10601 27213 -12581 -92012
10249 -92012 -82600 -83198 -27192 30577 26661 -92671 -232353 -259161 -141655 -123088 -68826 -99565
10237 -99565 -19921 128888 152955 110621 80161 91856 11150 16398 61866 -11817 28414 138127
10225 138127 144551 41774 994 11286 20164 152 -86803 -61204 -16789 -23661 -22585 -34103
10213 -34103 13225 58323 -12837 -97477 -100011 -20847 53224 43249 -39805 -77664 -56531 -33416
10201 -33416 -27457 -6430 27177 78285 58232 -46320 -16016 -14761 -72983 -55055 -12349 80243
$$ packed form
10284g4651p1098L7252Q0334K1991n4783n5737o3581L5668N3145P2623L5901m8639
10272c1575N3450m2226o1431l4496O3708P0616Q265j6527l7505j4567L4333L0717
10260B2762q4321J7711J02418J10400k4477q9656n4818j0620L7814l9794p9431
10249i2012R412n98N6006N7769l916j19332j39682k6808J17506J8567N4262l0739
10237i9565P9644J48809K4067m2334l0460J1695q0706N248M5468p3683M0231J09713
10225A38127O424j02777m0780J0292Q878k0012q6955K5599M4415o872J076j1518
10213c4103M7328M5098p1160q4640k534P9164P4071r975q3054l7859K1133K3115
10201c3416N959K1027L3607N1108k0053j04552L0304J255n8222J7928M2706R2592
$$ plain form
10189 80243 136181 110191 70219 163610 230173 187373 31446 -79175 -87361 -83471 -49438 -21030
10177 -21030 -84962 -103102 -110158 -85055 -39597 10963 49856 1548 17563 -68919 -94399 -16696
10165 -16696 -40524 -7226 -45651 -84006 -5844 25531 81242 124716 260514 313349 208487
10154 208487 154346 19013 47869 178417 144651 124846 94753 79055 -44413 -64168 -93777
10143 -93777 383 5827 38786 31276 14290 81754 21119 24757 -27966 105670 179365 188040
10131 188040 116370 -59166 -115127 -152601 -84200 -88977 -162242 -149607 -114942 -56963 -47946 -49066
10119 -49066 -99950 -136928 -130076 -58642 -101287 -72604 35705 52100 -10255 54766 73010 47935
10107 47935 37489 60542 44295 -57558 -113848 -118757 -92362 -16598 105589 192238 35341
$$ packed form
10189H0243N5938k5990l9972R3391O6563m2800j55927j10621q186L890L4033K8408
10177b1030o3932j8140p056K5103M5458N0560L8893m8308J6015q6482k5480P7703
10165a6696k3828L3298l8425l8355P8162L1375N5711M3474J35798N2835j04862
10154B08487n4141j35333K8856J30548l3766j9805l0093j5698j23468j9755k9609
10143i3777R4160N444L2959p510j6986O7464o0635L638n2723J33636P3695Q675
10131A88040p1670j75536n5961l7474O8401m777p3265J2635L4665N7979R017j120
10119d9066n0884l6978O852P1434m2645K8683J08309J6395o2355O5021J8244k5075
10107D7935j0446K3053j6247j01853n6290m909K6395P5764J22187Q6649j56897
$$ plain form
10096 35341 -109771 -135538 -88275 -76850 -98322 -131904 -18868 -16906 -55607 -29136 11458
10085 11458 -30705 -76518 -103443 -109891 -38678 -40471 -15529 2158 72737 79395 64534 93988
10073 93988 35881 63522 74844 31289 -39656 -40887 -25195 -10307 28724 132124 200476 136904
10061 136904 38728 -2069 -24397 11103 -10281 61650 107529 118351 128345 147538 91323 37018
10049 37018 90748 111966 205392 392497 665301 628642 527562 468939 389946 393395 254376
10038 254376 59272 -35759 13134 42356 115813 119396 105874 -17974 -52258 30711 -18920
10027 -18920 -69972 -25052 -36508 -15391 25366 42638 117310 124651 -15091 -74863 39099
10016 39099 18070 -33089 -42043 -67241 -6516 -7846 27740 -44768 -31008 -54229 -61744 -86386
$$ packed form
10096C5341j45112k5767M7263J1425k1472l3582J13036J962l8701K6471M0594
10085A1458m2163m5813k6925o448P1213j793K4942J7687P0579O658j4861K9454
10073I3988n8107K7641J1322m3555p0945j231J5692J4888L9031J03400O8352o3572
10061A36904r8176m0797k2328L5500k1384P1931M5879J0822R994J9193n6215n4305
10049C7018N3730K1218R3426J87105K72804l6659j01080n8623p8993L449j39019
10038B54376j95104r5031M8893K9222P3457L583j3522j23848l4284Q2969m9631
10027a8920n1052M4920j1456K1117M0757J7272P4672P341j39742n9772J13962
10016C9099k1029n1159q954k5198O0725j330L5586p2508J3760k3221p515k4642
$$ plain form
10004 -86386 -205548 -229562 -239999 -173526 -60204 -74820 -143148 -94359 -56875 -18399 28195
9993 28195 44341 14050 80207 60011 2399 18829 -13166 6722 80607 56449 25761 57097
9981 57097 135627 23912 -110935 -172624 -187674 -186452 19855 36170 -29035 34413 49501
9970 49501 138024 157676 36301 -121170 -94142 -98105 -68465 40281 9843 -78428 -5087
9959 -5087 -14054 -43849 -12198 56059 32992 -36864 -67866 -90500 -43140 55851 118293 40135
9947 40135 29652 20954 35610 -19164 -382 13205 -26031 -27403 -44216 -144335 -206074 -87299
9935 -87299 -37291 -53785 -20280 -24991 43982 44703 89772 134287 47390 -46957 -53103 -61136 -65720
9922 -65720 -52439 7476 -14970 -1337 -34757 -50222 -60430 -43093 10831 36883 -75391 -55869
$$ packed form
10004h6386j19162k4014j0437O6473J13322j4616o8328M8789L7484L8476M6594
9993B8195J6146l0291O6157k0196n7612J6430l1995J9888P3885k4158l0688L1336
9981E7097P8530j11715j34847o1689j5050J222K06307J6315o5205O3448J5088
9970D9501Q8523J9652j21375j57471K7028l963K9640J08746l0438q8271P3341
9959e087q967k9795L1651O8257k3067o9856l1002k2634M7360R8991O2442p8158
9947D0135j0483q698J4656n4774J8782J3587l9236j372j6813j00119o1739J18775
9935h7299N0008j6494L3505m711O8973P21M5069M4515q6897r4347o146q033m584
9922f5720J3281N9915k2446J3633l3420j5465j0208J7337N3924K6052j12274J9522
$$ plain form
9910 -55869 18663 -27260 -133830 -117534 -30893 -56211 17336 -25136 -49414 -48926 -10422 48359
9898 48359 -1037 -55216 53222 50472 12984 48609 61492 127408 127533 106902 31089 43485
9886 43485 45726 -79730 -90102 35375 -22529 -65806 -24390 -102 -10317 65984 110611 123065
9874 123065 79126 5478 77174 56320 129619 172869 110765 82031 107534 101671 39649 64035
9862 64035 72082 92480 91590 71234 215764 287720 246906 200275 247885 268299 225939 286136
9850 286136 635672 1020588 1553143 2357884 3576243 4924509 5531566 5200292 4414480
9841 4414480 3499413 2638710 1832151 1199450 865990 705597 541538 419063 307970 313530
9831 313530 277648 229465 271287 133232 155215 145422 147311 162574 179982 209358 244995 116487
$$ packed form
9910e5869P4532m5923j06570J6296Q6641k5318P3547m2472k4278M88L8504N8781
9898D8359m9396n4179J08438k750l7488L5625J2883O5916J25k0631p5813J2396
9886D3485K241j25456j0372J25477n7904m3277M1416K4288j0215P6301M4627J2454
9874A23065m3939p3648P1696k0854P3299M3250o2104k8734K5503n863o2022K4386
9862F4035Q047K0398q90k0356J44530P1956m0814m6631M7610K0414m2360O0197
9850B86136L49536L84916N32555Q04741J218359J348266O07057l31274p85812
9841D414480r15067q60703q06559o32701l33460j60393j64059j22475j11093N560
9831C13530l5882m8183M1822j38055K1983r793J889J5263J7408K9376L5637j28508
$$ plain form
9819 116487 128034 168033 196370 234828 246994 191871 190351 85769 102216 89692 -8243 17137
9807 17137 143406 137380 111558 91216 -66978 -26819 -62244 -119738 -120644 -41433 -16876 -13546
9795 -13546 -29792 3873 58902 101956 194800 93030 -5200 6813 -105128 -201695 -171443
9784 -171443 -152891 -91650 -135624 -184019 -177883 -48969 -20470 -84269 -55683 -128556 -195762 -239137
9772 -239137 -247848 -56235 45054 -37125 -51314 -72306 -75219 -232989 -257081 -99424 -27594
9761 -27594 -49953 -103381 -26638 113432 225530 228098 92658 -87459 -92985 -16796 -3668
9750 -3668 6346 44476 -33161 -73853 -57022 -44989 -64151 -56131 -54807 -47120 32778 36037 53688
9737 53688 65289 18986 -14691 -1769 -32276 -174587 -203449 -123848 -85954 -169244 -322362
$$ packed form
9819A16487J1547L9999K8337L8458J2166n5123j520j04582J6447j2524r7935K5380
9807A7137J26269o026k5822k0342j58194M0159l5425n7494r06P9211K4557L330
9795a3546j6246L3665N5029M3054R2844j01770r8230J2013j11941r6567L0252
9784a71443J8552O1241m3974m8395O136J28914K8499o3799K8586p2873o7206m3375
9772b39137q711J91613J01289q2179j4189k0992k913j57770k4092J57657P1830
9761b7594k2359n3428P6743J40070J12098K568j35440j80117n526P6189J3128
9750c668J0014L8130p7637m0692J6831J2033j9162Q020J324P687P9898L259J7651
9737E3688J1601m6303l3677J2922l0507j42311k8862P9601L7894q3290j53118
$$ plain form
9726 -322362 -238291 -130349 16108 59190 44791 -36295 -128979 -155320 -47001 104548 63497
9715 63497 81194 77749 26659 34783 73359 100328 61471 -62861 14091 150080 166672 -3794
9703 -3794 -35596 -4813 -23015 46216 -37562 -70942 -10039 -38064 -140019 -152770 -121171 -64992
9691 -64992 -71632 -116315 -112273 -86805 -70576 -110088 -67394 36578 14328 -102140 -124337 -140269
9679 -140269 -122957 -26817 17981 21183 41973 10170 63855 -5040 -78109 -13279 37298 112690
9667 112690 41030 -38552 -41983 -12041 74955 71347 63722 185908 84647 18115 8958 -111116
9655 -111116 -165361 -44703 -17521 96479 204124 269070 218251 102569 62397 70219 69154
9644 69154 -6014 -50004 -24964 -73850 -48875 17199 65844 3726 -19456 -35049 -26147 -65572
$$ packed form
9726c22362Q4071J07942J46457M3082j4399q1086r2684k6341J08319J51549m1051
9715F3497J7697l445n1090Q124L8576K6969l8857j24332P6952J35989J6592j70466
9703c794l1802L0783j8202O9231q3778l3380O0903k8025j01955j2751L1599N6179
9691f4992o640m4683M042K5468J6229l9512M2694J03972k2250j16468k2197j5932
9679a40269J7312R6140M4798L202K0790l1803N3685o8895p3069O4830N0577P5392
9667A12690p1660p9582l431K9942Q6996l608p625J22186j01261o6532r157j20074
9655a11116n4245J20658K7182J14000J07645O4946n0819j15682m0172P822j065
9644F9154p5168m3990K5040m8886K4975O6074M8645o2118k3182j5593Q902l9425
$$ plain form
9632 -65572 22613 63107 7692 -82023 -131317 -79960 -123557 -150027 -39989 -46748 16916 128661
9620 128661 105472 10003 1529 -44296 -61134 -39210 -12261 -138278 -135291 -73662 -20578 11776
9608 11776 -38604 -63957 -47721 -46078 -101017 -146566 -38743 24743 -15729 -37800 58321 46494
9596 46494 24928 -1753 -12634 -10193 -24743 60509 -39468 -69655 -57442 -112617 -33855 -91532
9584 -91532 -200149 -161433 -95577 -152941 -245386 -319865 -293146 -217631 -232327 -146730 -28644
9573 -28644 1897 -14582 -1743 35846 -56760 -107351 -96375 -66972 -191472 -237705 -129821
9562 -129821 -116028 -38533 -2614 -46338 -100224 -123172 -43403 -66142 -103604 -46465 -526 -27056
9550 -27056 25130 66132 68276 -1087 -146731 -198109 -148551 -139413 -129879 -114622 -107092 -5547
$$ packed form
9632f5572Q8185M0494n5415q9715m9294N1357m3597k6470J10038o759O3664J11745
9620A28661k3189r5469q474m5825j6838K1924K6949j26017K987O1629N3084L2354
9608A1776n0380k5353J6236J643n4939m5549J07823O3486m0472k2071R6121j1827
9596D6494k1566k6681j0881K441j4550Q5252r9977l0187J2213n5175P8762n7677
9584i1532j08617L8716O5856n7364r2445p4479K6719P5515j4696Q5597J18086
9573b8644L0541j6479J2839L7589r2606n0591J0976K9403j24500m6233J07884
9562a29821J3793P7495L5919m3724n3886k2948P9769k2739l7462N7139M5939k6530
9550b7056N2186M1002K144o9363j45644n1378M9558R138R534J5257P530J01545
$$ plain form
9538 -5547 18525 44458 33340 65418 57214 -88249 -151800 -152858 -170111 -189139 -151440 -35143
9526 -35143 28764 -51640 -117825 -14193 39526 110069 85549 -6994 -81513 -46963 -53814 -26613
9514 -26613 -105320 -108189 -5254 40346 19574 58626 152808 123509 91250 80404 106605 122594
9502 122594 174572 80924 91034 78102 124589 101045 107924 138765 11535 -56590 -121381 -201154
9490 -201154 -149055 -91411 -92097 -55916 -24947 33920 51135 60164 -55256 -119300 -158918 -115796
9478 -115796 -158056 -207914 -177884 -114729 12215 146357 142178 97038 4000 -25935 19349
9467 19349 54466 79527 -17627 -40550 -31856 -24452 18701 58388 50708 35321 16103 -43409
9455 -43409 -105902 -20981 -4397 -3050 14533 60272 42487 4730 -69008 -195740 -221460 -119658
$$ packed form
9538e547K4072K5933j1118L2078q204j45463o3551j058j7253j9028L7699J16297
9526c5143O3907q0404o6185J03632N3719P0543k4520r2543p4519L4550o851K7201
9514b6613p8707k869J02935M5600k0772L9052R4182k9299l2259j0846K6201J5989
9502A22594N1978r3648J0110j2932M6487k3544O879L0841j27230o8125o4791p9773
9490b01154N2099N7644o86L6181L0969N8867J7215R029j15420o4044l9618M3122
9478a15796m2260m9858L0030O3155J26944J34142m179m5140r3038k9935M5284
9467A9349L5117K5061r7154k2923Q694P404M3153L9687p680j5387j9218n9512
9455d3409o2493Q4921J6584J347J7583M5739j7785l7757p3738j26732k5720J01802
$$ plain form
9443 -119658 -98580 -44854 117534 177408 170092 107664 37928 -57662 -66216 -2582 96638 145738
9431 145738 41627 -40919 -152147 -68782 -35339 25911 76701 119797 157854 131919 154536
9420 154536 189076 95274 60998 -22116 -81204 -41512 -56194 -19911 63414 103351 77024 108563
9408 108563 100185 6177 -4321 -15935 77289 -14287 -57689 -132743 -178556 -117541 71718 95507
9396 95507 124602 115964 147816 135819 81943 71508 53358 54824 30740 -11201 -37002 -100076
9384 -100076 -92563 -96239 32220 23912 53017 34705 -66376 -161543 -113835 -78403 -47746 -61847
9372 -61847 -68177 -63327 -128118 -22277 35295 86564 192575 92494 41758 107443 35981 -81650
9360 -81650 52990 157112 23179 32227 41295 64666 75080 75134 78946 34224 115543 144704
$$ packed form
9443a19658K1078N3726J62388N9874p316o2428o9736r5590q554O3634R9220M9100
9431A45738j04111q2546j11228Q3365L3443O1250N0790M3096L8057k5935K2617
9420A54536L4540r3802l4276q3114n9088L9692j4682L6283Q3325L9937k6327L1539
9408A08563q378r4008j0498j1614R3224r1576m3402p5054m5813O1015J89259K3789
9396I5507K9095q638L1852j1997n3876j0435j8150J466k4084m1941k5801o3074
9384a00076P513l676J28459q308K9105j8312j01081r5167M7708L5432L0657j4101
9372f1847o330M850o4791J05841N7572N1269J06011j00081n0736O5685p1462j17631
9360h1650J34640J04122j33933R048R068K3371J0414N4L812m4722Q1319K9161
$$ plain form
9348 144704 283521 196387 -39665 -71180 -33019 -37543 68303 -39671 -46732 18230 78006
9337 78006 114847 168291 141368 56681 -67442 -65528 -3650 21200 63875 2588 19723 50208
9325 50208 38335 46730 26390 39138 160550 119859 108360 147542 156202 120413 135061 143982
9313 143982 81464 108621 131310 142230 216565 261519 68563 -10019 23445 30406 6273 4853
9301 4853 82083 133856 130156 218320 293650 266754 244896 262684 200201 288163 240560 147325
9289 147325 117203 137766 102365 123692 258213 315292 407057 576853 731313 783162 801318
9278 801318 833453 903428 983758 1196423 1413401 1720349 2176387 2827812 3601296 4683395
9268 4683395 6453290 9243288 13615366 19428399 25080878 27526470 26358694 23285130
$$ packed form
9348A44704J38817q7134k36052l1515L8161m524J05846j07974p061O4962N9776
9337G8006L6841N3444k6923q4687j24123J914O1878K4850M2675o1287J7135L0485
9325E0208j1873Q395k0340J2748J21412m0691j1499L9182Q660l5789J4648Q921
9313A43982o2518K7157K2689J0920P4335M4954j92956p8582L3464O961k4133j420
9301D853P7230N1773l700Q8164P5330k6896k1858J7788o2483Q7962m7603r3235
9289A47325l0122K0563l5401K1327J34521N7079R1765J69796J54460N1849J8156
9278H01318L2135O9975Q0330K12665K16978L06948M56038O51425P73484J082099
9268D683395J769895K789998M372078N813033N652479K445592j167776l073564
$$ plain form
9260 23285130 19382706 15044005 11225236 8389761 6325577 4965773 4091426 3413291
9252 3413291 2852117 2472710 2083555 1724802 1549453 1329337 1111745 948257 890530 784210
9242 784210 648948 619888 576776 431717 376148 439474 442628 465247 332745 213092 302180
9231 302180 306536 366574 373558 272948 169382 106810 132270 254749 216061 124430 140877
9220 140877 199866 207486 155038 111289 133039 121753 131413 188887 115738 39801 28711 30928
9208 30928 95912 187508 165809 113836 62058 123601 89622 4084 -44499 -12777 76089 26788
9196 26788 80803 167943 80452 52594 50712 109748 73529 134475 264037 339166 266641 211158
9184 211158 148948 40824 -29671 -81356 -24227 -66205 -59994 -81039 -101530 -109982 -18022 18839
$$ packed form
9260B3285130l902424m338701l818769k835475k064184j359804q74347o78135
9252C413291n61174l79407l89155l58753j75349k20116k17592j63488n7727j06320
9242G84210j35262k9060m3112j45059n5569O3326L154K2619j32502j19653Q9088
9231C02180M356O0038O984j00610j03566o2572K5460J22479l8688r1631J6447
9220A40877N8989P620n2448m3749K1750j1286R660N7474p3149p5937j1090K217
9208C0928O4984R1596k1699n1973n1778O1543l3979q5538m8583L1722Q8866m9301
9196B6788N4015Q7140q7491k7858j882N9036l6219O0946J29562P5129p2525n5483
9184B11158o2210j08124p0495n1685N7129m1978O211k1045k0491q452R1960L6861
$$ plain form
9172 18839 -22834 -86709 -91727 -127271 -34384 26258 -2436 -64615 -83331 -95990 -12681 61398
9160 61398 113487 72582 -1218 44480 97594 25127 80234 21370 13576 36838 70363 86001
9148 86001 136300 212044 340553 322920 285001 246194 195636 75062 -68054 5561 105437
9137 105437 83182 63869 116710 175027 186862 142561 149927 112559 107894 62440 51973 69012
9125 69012 24775 -47314 -113072 -162940 -113437 78289 140673 -15957 16257 147343 250011
9114 250011 237906 226054 239889 98154 -31226 5419 5082 -39905 -70835 -22110 -64604 -104294
9102 -104294 -182588 -137349 -160777 -105826 -6171 11524 -1115 -55849 -36629 -25585 57138 70571
9090 70571 1736 36130 43227 19590 -77511 -133751 -105913 -33389 30518 101313 162111 54866
$$ packed form
9172A8839m1673o3875n018l5544R2887O0642k8694o2179j8716j2659Q3309P4079
9160F1398N2089m0905p3800M5698N3114p2467N5107n8864p794K3262L3525J5638
9148H6001N0299P5744J28509j7633l7919l8807n0558j20574j43116P3615R9876
9137A05437k2255j9313N2841N8317J1835m4301P366l7368m665m5454j0467J7039
9125F9012m4237p2089o5758m9868M9503J91726O2384j56630L2214J31086J02668
9114B50011j2105j1852J3835j41735j29380L6645l37m4987l0930M8725m2494l9690
9102a04294p8294M5239k3428N4951R9655J7695j2639n4734J9220J1044Q2723J3433
9090G0571o8835L4394P097k3637r7101n6240K7838P2524O3907P0795O0798j07245
$$ plain form
9078 54866 -86049 -208675 -101658 -98578 -99059 -60957 -83164 40107 -6803 -50318 1484 15169
9066 15169 -21008 76308 171125 41355 -48731 -121163 -28469 19044 -9171 20732 50321 94960
9054 94960 117991 148999 220900 200271 185813 64798 9079 -35778 -63346 75685 158942
9043 158942 129282 99264 32855 39127 124854 1281 -141470 -197272 -144653 -114491 -10018
9032 -10018 88335 149406 107499 100919 28719 79551 95195 6377 -49563 -36682 -30005 -62093
9020 -62093 67837 11479 -122032 -119149 -129235 -127636 -103381 -61903 -16391 9280 -73422 -44827
9008 -44827 53584 51728 47299 26649 -47792 -110751 -161463 -198476 -208501 -175379 -65679 -13642
8996 -13642 30718 3371 49287 82276 99954 76750 -29352 -137361 -159339 -91758 -10699
$$ packed form
9078E4866j40915j22626J07017L080m81L8102k2207J23271m6910m3515N1802J3685
9066A5169l6177R7316R4817j29770r0086p2432R2694M7513k8215K9903K9589M4639
9054I4960K3031L1008P1901k0629j4458j21015n5719m4857k7568J39031Q3257
9043A58942k9660l0018o6409O272Q5727j23573j42751n5802N2619L0162J04473
9032a0018R8353O1071m1907o580p2200N0832J5644q8818n5940J2881O677l2088
9020f2093J29930n6358j33511K883j0086J599K4255M1478M5512K5671q2702K8595
9008d4827R8411j856m429k0650p4441o2959n0712l7013j0025L3122J09700N2037
8996a3642M4360k7347M5916L2989J7678k3204j06102j08009k1978O7581Q1059
$$ plain form
8985 -10699 73928 95332 88783 89199 99802 115270 94174 44241 104259 204528 171835 124105
8973 124105 72633 34530 -7224 -6106 11337 103426 295333 232102 23953 101992 44423
8962 44423 63845 92219 35031 44114 63487 92552 13695 727 11274 55549 82195 -39070
8950 -39070 -95493 -60978 -14055 -17587 -73790 -89106 -64692 5177 -16471 -28451 12498 -25822
8938 -25822 12862 -34162 -79779 -18532 6798 -17440 -23055 -41617 -60406 -94446 -53258 11338
8926 11338 -15723 -58966 -88272 -146424 -186396 -126911 -57602 -18030 43274 8108 -34971 63274
8914 63274 155990 127316 157583 133737 107075 208701 323456 354128 362556 256779 173946
8903 173946 42359 -14503 6307 -18685 -1754 35138 75792 46251 -13675 -35725 -4220
$$ packed form
8985a0699Q4627K1404o549M16J0603J5468k1096m9933O0018J00269l2693m7730
8973A24105n1472l8103m1754J118J7443R2089J91907o3231k08149P8039n7569
8962D4423J9422K8374n7188R083J9373K9065p8857j2968J0547M4275K6646j21265
8950c9070n6423L4515M6923l532n6203j5316K4414O9869k1648j1980M0949l8320
8938b5822L8684m7024m5617O1247K5330k4238n615j8562j8789l4040M1188O4596
8926A1338k7061m3243k9306n8152l9972N9485O9309L9572O1304l5166m3079R8245
8914F3274R2716k8674L0267k3846k6662J01626J14755L0672Q428j05777q2833
8903A73946j31587n6862K0810k4992J6931L6892M0654k9541n9926k2050L1505
$$ plain form
8892 -4220 22029 78947 55359 -66600 -46320 -36924 -72392 -16600 88349 200387 134326 -8246
8880 -8246 24712 80471 55395 -10731 -27820 -10336 5781 54562 -2506 14685 187954 236159
8868 236159 259934 263190 182328 61895 85053 92601 114235 81318 63335 145054 167851 102339
8856 102339 73692 3526 -24369 -38043 -103704 -160738 -145611 -121872 -55701 -27987 93108
8845 93108 156772 99973 88162 153975 90576 28425 83097 120945 229950 278149 300028 315514
8833 315514 265187 163011 141217 120435 78782 114334 104355 180678 182576 173159 174680 10985
8821 10985 16767 68734 20881 15138 82150 45849 -29134 42373 141301 73657 28710 43803
8809 43803 -862 -18526 39036 63467 -12590 539 16139 57705 129828 152989 205014 182711
$$ packed form
8892d220K6249N6918k3588j21959K0280R396l5468N5792J04949J12038o6061j42572
8880h246L2958N5759k5076o6126j7089J7484J6117M8781n7068J7191J73269M8205
8868B36159K3775L256q0862j20433K3158P548K1634l2917j7983Q1719K2797o5512
8856A02339k8647p0166k7895j3674o5661n7034J5127K3739O6171K7714J21095
8845I3108O3664n6799j1811O5813o3399o2151N4672L7848J09005M8199K1879J5486
8833C15514n0327j02176k1794k0782m1653L5552r979P6323J898r417J521j63695
8821A0985N782N1967m7853n743O7012l6301p4983P1507R8928o7644m4947J5093
8809D3803m4665j7664N7562K4431p6057J3129J5600M1566P2123K3161N2025k2303
$$ plain form
8797 182711 63015 -6351 32029 -12138 13791 51902 31023 -19373 78887 217819 201033
8786 201033 27177 63608 68180 113795 71418 -61916 -22909 -105213 -115110 -17963 15133 54462
8774 54462 139029 97047 -1619 -78597 -101427 -34206 56081 173014 268770 235045 230156 246043
8762 246043 121643 81877 102458 91025 79982 15214 -20330 -52099 -122942 -16583 -11016
8751 -11016 -90460 -18236 -26348 -103130 -122448 -159082 -130629 -70489 -35336 69002 198521 251204
8739 251204 279000 131115 158711 169981 118688 170233 121429 -2246 -12112 -24308 27074
8728 27074 20819 46914 92456 89252 -8789 -1107 21181 -58487 -12444 115547 217877 200100
8716 200100 139502 180684 246364 156110 145144 135487 180273 158209 82156 71764 44671 12163
$$ packed form
8797A82711j19696o9366L8380m4167K5929L8111k0879n0396R8260J38932j6786
8786B01033j73856L6431M572M5615m2377j33334L9007q2304r897R7147L3096L9329
8774E4462Q4567m1982r8666p6978k2830O7221R0287J16933R5756l3725m889J5887
8762B46043j24400l9766K0581j1433j1043o4768l5544l1769p0843J06359N567
8751a1016p9444P2224q112p6782j9318l6634K8453O0140L5153J04338J29519N2683
8739B51204K7796j47885K7596J1270n1293N1545m8804j23675r866j2196N1382
8728B7074o255K6095M5542l204r8041P682K2288p9668M6043J27991J02330j7777
8716B00100o0598M1182O5680r0254j0966r657M4786k2064p6053j0392k7093l2508
$$ plain form
8704 12163 43503 11828 80357 218077 186905 40146 27244 77442 118051 55938 75193
8693 75193 124487 189251 172095 40589 -37755 55269 128438 58119 139714 132297 95486 16987
8681 16987 66893 157861 67184 -1608 104582 223602 175063 84814 7715 11282 70926 80207
8669 80207 119322 173670 133973 153534 157570 134551 148478 254437 287015 191890 81628 25205
8657 25205 96567 148976 133603 128934 30138 -23260 -613 27971 18242 4445 3133 102992
8645 102992 341115 553325 859159 1184503 1310085 1256053 1039759 943241 855594 722022
8635 722022 506483 502735 553958 383069 310134 240186 183578 155591 173369 275808 274162
8624 274162 340416 348032 298726 253813 166551 13623 70540 87499 100587 201246 202075 171460
$$ packed form
8704A2163L1340l1675O8529J37720l1172j46759j2902N0198M0609o2113J9255
8693G5193M9294O4764j7156j31506p8344R3024P3169p0319Q1595p417l6811p8499
8681A6987M9906R0968r0677o8792J06190J19020m8539r0249p7099L567N9644R281
8669H0207L9115N4348l9697J9561M036k3019J3927J05959L2578r5125j10262n6423
8657B5205P1362N2409j5373m669r8796n3398K2647K8584r729j3797j312R9859
8645A02992K38123K12210L05834L25344J25582n4032k16294r6518q7647j33572
8635G22022k15539l748N1223j70889p2935o9948n6608k7987J7778J02439j646
8624B74162O6254P616m9306m4913q7262j52928N6917J6959J3088J00659Q29l0615
$$ plain form
8612 171460 254701 244291 194996 146646 69006 99723 227703 345534 379097 314636 353267
8601 353267 596001 831902 1142857 1668897 2384752 2967077 2977404 2720692 2361144 1930229
8591 1930229 1455223 1161184 936809 760965 767821 789534 782331 772902 716886 800455 754377
8580 754377 672656 575088 502031 567837 513030 406548 320824 349052 306766 248675 181966
8569 181966 70321 23395 63093 143538 160965 182529 202640 197635 230104 296926 269379 216974
8557 216974 210731 296899 355005 414872 662887 939998 1333694 1468610 1201318 1055286 792582
8546 792582 631611 512471 474475 434729 351670 303564 307218 300147 243339 243393 262701 185370
8534 185370 193284 147507 90741 35955 20900 -46038 -68614 35161 70887 99970 153879 110638
$$ packed form
8612A71460Q3241j0410m9295m8350p7640L0717J27980J17831L3563o4461L8631
8601C53267K42734K35901L10955N26040P15855N82325J0327k56712l59548m30915
8591A930229m75006k94039k24375j75844O856K1713p203r429n6016Q3569m6078
8580G54377q1721r7568p3057O5806n4807j06482q5724K8228m2286n8091o6709
8569A81966j11645m6926L9698Q0445J7427K1564K0111n005L2469O6822k7547n2405
8557B16974o243Q6168N8106N9867K48015K77111L93696J34916k67292j46032k62704
8546G92582j60971j19140l7996l9746q3059m8106L654p071n6808N4J9308p7331
8534A85370P914m5777n6766n4786j5055o6938k2576J03775L5726K9083N3909m3241
$$ plain form
8522 110638 36946 -85674 -127474 -108077 -105019 -119703 -24960 -14199 -33286 57389 11847 25097
8510 25097 51106 33919 -22137 -11341 20489 25163 27665 75814 112550 102239 37860 -26378
8498 -26378 -96772 -119992 960 70531 31215 14088 112693 117816 80606 57359 102752 47372
8486 47372 56694 42465 18506 66665 -6516 26859 63246 121242 50821 25589 -44711 -69655
8474 -69655 -47421 -15210 -84146 -101461 -81124 -24277 -61331 -10319 -11483 -2088 -119915 -4000
8462 -4000 -13216 -91110 -69622 -44868 -26123 -15680 -25916 -11048 62169 -67519 -184204 -149397
8450 -149397 -63619 55249 43828 2735 -76088 -188342 -256911 -144559 55444 134879 144077
8439 144077 263329 222159 105318 -46468 -111613 -31513 -22439 34267 101309 -17603 -87345
$$ packed form
8522A10638p3692j22620m1800J9397L058j4684R4743J0761j9087R0675m5542J3250
8510B5097K6009j7187n6056J0796L1830M674K502M8149L6736j0311o4379o4238
8498b6378p0394k3220J20952O9571l9316j7127R8605N123l7210k3247M5393n5380
8486D7372R322j4229k3959M8159p3181L3375L6387N7996p0421k5232p0300k4944
8474f9655K2234L2211o8936j7315K0337N6847l7054N1012j164R395j17827J15915
8462d000r216p7894K1488K4754J8745J0443j0236J4868P3217j29688j16685L4807
8450a49397Q5778J18868j1421m1093p8823j12254o8569J12352K00003P9435R198
8439A44077J19252m1170j16841j51786o5145Q0100R074N6706O7042j18912o9742
$$ plain form
8428 -87345 -60018 9821 -16348 -19925 8760 24767 -34278 -22026 39551 121047 145951 145404
8416 145404 144190 194155 139974 22560 125947 218495 121843 3806 6563 -13818 -53496
8405 -53496 -12890 -70149 -54966 -23881 -145329 -220676 -147016 -101019 -55506 -10555 19932 -20312
8393 -20312 -89915 -143628 -50852 6869 67015 105364 151101 187304 139166 -23594 -29338 -72530
8381 -72530 -115847 -4277 62145 41176 -42494 -30638 -89329 -61920 36582 24207 -24407 3681
8369 3681 -93562 -147189 -110676 -59224 37224 16216 -27244 -15229 133218 134561 127596 88743
8357 88743 59920 49678 44291 -4229 66104 167198 230656 272162 218011 193913 183440 136282
8345 136282 31104 -52506 -13421 -26127 -35752 -99960 -31028 57689 82466 144524 104441 -12217
$$ packed form
8428h7345K7327O9839k6169l577K8685J6007n9045J2252O1577Q1496K4904n47
8416A45404j214M9965n4181j17414J03387R2548r6652j18037K757k0381l9678
8405e3496M0606n7259J5183L1085j21448p5347P3660M5997M5513M4951L0487m0244
8393b0312o9603n3713R2776N7721O0146L8349M5737L6203m8138j62760n744m3192
8381g2530m3317J11570O6422k0969q3670J1856n8691K7409R8502j2375m8614K8088
8369C681r7243n3627L6513N1452R6448k1008m3460J2015J48447J343o965l8853
8357H8743k8823j0242n387m8520P0333J01094O3458M1506n4151k4098j0473m7158
8345A36282j05178q3610L9085j2706r625o4208O8932Q8717K4777O2058m0083j16658
$$ plain form
8333 -12217 99729 112322 -74573 -153670 -114898 -99459 -61364 -67346 -89883 -56477 2434 10998
8321 10998 -17680 -11603 95634 53251 20349 29927 4002 22504 -85606 -199273 -64831
8310 -64831 22745 56297 57049 67497 40455 -49790 -26048 -18050 6932 27230 49549 -30884
8298 -30884 -16510 82829 152799 121690 138896 206612 183332 57487 -24700 251 41687 5683
8286 5683 974 -56440 -89897 45268 93722 11288 52852 4734 -4584 -30288 59194 94329
8274 94329 134107 110696 123437 28096 75412 71295 -3115 -22914 -119609 -143891 -135690 -195086
8262 -195086 -137543 -23906 -35330 -40438 -82691 -96042 -59126 -99659 -160438 -105053 -1195
8251 -1195 -29209 5708 -23977 -69513 -30943 -57911 -53296 -86367 -36956 -53514 -50334 20599
$$ packed form
8333a2217J11946J2593j86895p9097L8772J5439L8095n982k2537L3406N8911Q564
8321A0998k8678O077J07237m2383l2902R578k5925J8502j08110j13667J34442
8310f4831Q7576L3552P52J0448k7042r0245K3742P998K4982K0298K2319q0433
8298c0884J4374R9339O9970l1109J7206O7716k3280j25845q2187K4951M1436l6004
8286E683m709n7414l3457J35165M8454q2434M1564m8118r318k5704Q9482L5135
8274I4329L9778k3411J2741r5341M7316m117p4410j9799r6695k4282Q201n9396
8262a95086N7543J13637j1424n108m2253j3351L6916m0533o0779N5385J03858
8251a195k8014L4917k9685m5536L8570k6968M615l3071M9411j6558L180P0933
$$ plain form
8239 20599 -24255 -22648 32289 12316 -15540 -70028 -37694 -28004 -45962 -4908 57161 19600
8227 19600 -77936 -25254 10242 54941 -12885 -151022 -177645 -140451 -127760 -67264 2834 32667
8215 32667 25366 14086 -6996 -88237 -119613 -122156 -96853 -117728 -142523 -18778 71499 -24284
8203 -24284 -41676 -107728 -38275 27188 97343 126387 -10963 -114788 -105011 -50182 2261 77219
8191 77219 87850 29486 -99850 -90891 -48119 -63852 7662 54897 75327 179000 109759 48018
8179 48018 -19622 -48520 -85003 -81647 -59298 -44426 -9053 24635 22135 70018 -7363 -92923
8167 -92923 -108366 -109192 -120464 -151400 -126287 -139301 -124939 -62645 -66723 -89100 -50932 22940
8155 22940 -12324 27350 113834 54826 -77222 -147325 -178186 -184128 -196149 -120917 -32332 19307
$$ packed form
8239B0599m4854J607N4937j9973k7856n4488L2334R690j7958M1054O2069l7561
8227A9600r7536N2682L5496M4699o7826j38137k6623L7194J2691O0496P0098K9833
8215C2667p301j1280k1082q1241l1376k543K5303k0875k4795J23745R0277r5783
8203b4284j7392o6052O9453O5463P0155K9044j37350j03825R777N4829N2443P4958
8191G7219J0631n8364j29336Q959M2772j5733P1514M7235K0430J03673o9241o1741
8179D8018o7640k8898l6483L356K2349J4872L5373L3688k500M7883p7381q5560
8167i2923j5443q26j1272l0936K5113j3014J4362O2294m078k2377L8168P3872
8155B2940l5264L9674Q6484n9008j32048p0103l0861n942j2021P5232Q8585N1639
$$ plain form
8143 19307 -57204 -37599 5122 -10463 42388 78164 130704 86150 32302 72075 77079 -29371
8131 -29371 -51951 -14804 -18611 -26048 -41616 -95540 -96129 -76239 41222 90340 80370 -47323
8119 -47323 -68146 21955 109789 49549 -68100 -69356 -23188 -79992 -20443 -5932 24749 107755
8107 107755 121695 66244 137364 198704 135336 124670 64086 51441 6971 -32597 -11836 -47997
8095 -47997 -96096 -71789 8990 68737 116720 130192 203629 160903 149443 126067 31941 -78528
8083 -78528 -20198 -10627 -21434 -47260 -41514 -40725 -28178 2022 -58256 -62954 26601 26093 29621
8070 29621 111595 54189 46050 63160 25982 -17285 -60425 -32313 -18607 29482 21436 75067
8058 75067 11188 -134256 -104769 -103088 -94993 -43657 -26393 12196 49452 -17142 -40173 37018
$$ packed form
8143A9307p6511J9605M2721j5585N2851L5776N2540m4554n3848L9773N004j06450
8131b9371k2580L7147l807p437j5568n3924n89J9890J17461M9118r970j27693
8119d7323k0823R0101Q7834o0240j17649j256M6168n6804N9549J4511L0681Q3006
8107A07755J3940n5451P1120O1340o3368j0666o0584j2645m4470l9568K0761l6161
8095d7997m8099K4307Q0779N9747M7983J3472P3437m2726j1460k3376r4126j10469
8083g8528N8330R571j0807k5826N746P89J2547L0200o0278m698Q9555n08L528
8070B9621Q1974n7406q139J7110l7178m3267m3140K8112J3706M8089q046N3631
8058G5067o3879j45444K9487J681Q095N1336J7264L8589L7256o6594k3031P7191
$$ plain form
8046 37018 72776 59394 -12300 101753 216915 154089 85140 35378 10014 34023 89427
8035 89427 73750 12985 39374 82230 31423 -60004 -31008 7667 -57028 -25851 -29575 -11778
8023 -11778 -34679 -74880 -8413 -34998 -51062 -13234 -51168 -52060 -70977 -64701 49083 103273
8011 103273 49862 19128 -34219 38729 262890 171311 144983 107079 135401 157489 48047
8000 48047 82623 155279 148063 104539 158847 168304 167763 99800 138275 90902 6356 47846 114356
7987 114356 163110 222314 114865 60997 124751 79494 24608 -34915 -49373 -32155 22512
7976 22512 -11256 25870 18686 -107191 -138314 -37275 39052 14676 -25718 61710 72568 70791
7964 70791 11919 131822 152121 34027 -16121 -46400 -34354 61745 175313 161513 54159
$$ packed form
8046C7018L5758j3382p1694J14053J15162o2826o8949m9762k5364K4009N5404
8035H9427j5677o0765K6389M2856n0807r1427K8996L8675o4695L1177l724J7797
8023a1778k2901m0201O6467k6585j6064L7828l7934q92j8917O276J13784N4190
8011A03273n3411l0734n3347P2948K24161r1579k6328l7904K8322K2088j09442
8000D8047L4576P2656p216m3524N4308R457n41o7963L8475m7373q4546M1490O6510
7987A14356M8754N9204j07449n3868O3754m5257n4886n9523j4458J7218N4667
7976B2512l3768L7126p184j25877l1123J01039P6327k4376m0394Q7428J0858j777
7964G0791n8872J19903K0299j18094n0148l0279J2046R6099J13568j3800j07354
$$ plain form
7953 54159 74471 95016 180897 88149 -39709 -2346 163643 162946 38546 -31466 12721 132050
7941 132050 125227 113184 94327 60999 104707 106550 91368 70333 115555 227399 254784 272353
7929 272353 118876 67751 55990 -34687 55675 126746 62965 84157 78835 57771 31830 -51783
7917 -51783 19923 58208 124319 207374 189612 123094 134233 53184 34051 105577 42281 3571
7905 3571 124144 138012 37413 17799 92244 170141 200506 247308 206339 157703 107254 82285
7893 82285 116496 191063 247918 96749 -29480 -69591 -58715 -30368 22858 -36223 -13882
7882 -13882 47596 117150 189323 97459 83137 147994 133929 29688 -11838 65174 88487 -51599
7870 -51599 -187506 -146852 -78772 -61184 7647 15084 84276 56219 93050 82376 80082 10774
$$ packed form
7953E4159K0312K0545Q5881r2748j27858L7363J65989o97j24400p0012M4187J19329
7941A32050o823j2043j8857l3328M3708J843j5182k1035M5222J11844K7385J7569
7929B72353j53477n1125j1761r0677R0362P1071o3781K1192n322k1064k5941q3613
7917e1783P1706L8285O6111Q3055j7762o6518J1139q1049j9133P1526o3296l8710
7905C571J20573J3868j00599j9614P4445P7897L0365M6802m0969m8636n0449k4969
7893H2285L4211P4567N6855j51169j26229m0111J0876K8347N3226n9081K2341
7882a3882O1478O9554P2173r1864j4322O4857j4065j04241m1526P7012K3313j40086
7870e1599j35907M0654O8080J7588O8831P437O9192k8057L6831j0674k294o9308
$$ plain form
7858 10774 -23683 -82364 -80739 33683 -10835 29762 89788 108645 99863 66533 -5611 -42633
7846 -42633 -95950 -90949 -38282 23292 57354 75551 49520 -29469 -102102 -13866 37438 -13407
7834 -13407 -83675 13158 55629 97978 104740 46845 -64335 -33648 -24558 -32531 -62513 11935
7822 11935 53121 33938 49325 90608 87018 98876 126099 58699 116236 111590 97240 87044
7810 87044 179294 217527 154005 82594 62859 16124 104933 33847 -49621 13499 -21833 -75543
7798 -75543 -70237 -37864 -62267 -23854 -21106 17445 11184 66039 69173 58777 30504 -137858
7786 -137858 -242099 -262479 -182588 3760 87297 160350 179237 107210 16455 13447 54014
7775 54014 -23703 4172 111578 119612 7714 -133612 -139198 -40950 51946 142719 161582 95542
$$ packed form
7858A0774l4457n8681J625J14422m4518M0597O0026J8857q782l3330p2144l7022
7846d2633n3317N001N2667O1574L4062J8197k6031p8989p2633Q8236N1304n0845
7834a3407p0268R6833M2471M2349O762n7895j11180L0687R090p973k9982P4448
7822A1935M1186j9183J5387M1283l590J1858K7223o7400N7537m646j4350j0196
7810H7044R2250L8233o3522p1411j9735m6735Q8809p1086q3468O3120l5332n3710
7798g5543N306L2373k4403L8413K748L8551o261N4855L134j0396k8273j68362
7786a37858j04241k0380P9891J86348Q3537P3053J8887p2027r0755l008M0567
7775E4014p7717K7875J07406Q034j11898j41326n586R8248R2896R0773J8863o6040
$$ plain form
7763 95542 -18176 13758 15335 -104437 -160435 -117141 -44469 53672 126003 181350 159840 149162
7751 149162 54667 -19595 -44062 17961 37381 41159 -19163 5805 57850 37890 28634 61671
7739 61671 71341 80525 99200 147016 178584 194255 101273 28679 4043 -246 16167 -55139
7727 -55139 -10329 71045 92767 78919 48306 101669 123136 6508 34018 41374 8933 30982
7715 30982 66190 -13372 -178607 -206459 -283991 -188022 -88832 -95573 -66945 -24226 -18462 -43269
7703 -43269 -89676 -76671 13627 -23753 -48534 8841 -39034 -92498 -101948 27854 3587 -91479
7691 -91479 -120137 -99759 -169790 -142148 -93066 42323 63333 42044 -43247 -58890 -8620 78816
7679 78816 93551 107226 147248 106865 128022 32706 -3400 19836 54260 94036 62019 44302
$$ packed form
7763I5542j13718L1934J577j19772n5998M3294P2672R8141P2331N5347k1510j0678
7751A49162r4495p4262k4467O2023J9420L778o0322K4968N2045j9960r256L3037
7739F1671R670R184J8675M7816L1568J5671r2982p2594k4636m289J6413p1306
7727e5139M4810Q1374K1722j3848l0613N3363K1467j16628K7510P356l2441K2049
7715C0982L5208p9562j65235k7852p7532R5969R9190o741K8628M2719N764k4807
7703d3269m6407J3005R0298l7380k4781N7375m7875n3464r450J29802k4267r5066
7691i1479k8658K0378p0031K7642M9082J35389K1010k1289q5291j5643N0270Q7436
7679G8816J4735J3675M0022m0383K1157r5316l6106K3236L4424L9776l2017j7717
$$ plain form
7667 44302 68135 92030 91783 117946 75654 32727 90396 78913 107582 72862 88063 123762
7655 123762 99827 153069 152818 181412 143936 42645 94620 120369 117177 59342 81155 33155
7643 33155 -19101 22751 -13739 22728 9990 44464 -42107 -48978 5609 -57059 -68421 -64946
7631 -64946 -103572 -20177 4921 -63776 -136277 -59819 3267 -56374 -37698 -43469 19266 6827
7619 6827 -128778 -176865 -99642 -99139 -173616 -173723 -19527 58647 -34765 -62055 -103311 -40060
7607 -40060 -23269 8708 -23549 -53988 -62656 -36806 9073 -12603 31619 22215 -45330 -10601
7595 -10601 42457 69422 -12313 23111 -47388 -145949 -231786 -225489 -178546 -167790 -189189 -90902
7583 -90902 64310 52523 58789 15795 71122 91066 -20026 -36198 36073 31411 -87815 -172407
$$ packed form
7667D4302K3833K3895k47K6163m2292m2927N7669j1483K8669l4720J5201L5699
7655A23762k3935N3242k51K8594l7476j01291N1975K5749l192n7835K1813m8000
7643C3155n2256M1852l6490L6467j2738L4474q6571o871N4587o2668j1362L475
7631f4946l8626Q3395K5098o8697p2501P6458O3086n9641J8676n771O2735j2439
7619F827j35605m8087P7223N03p4477j07J54196P8174r3412k7290m1256O3251
7607d0060J6791L1977l2257l0439q668K5850M5879k1676M4222r404o7545L4729
7595a0601N3058K6965q1735L5424p0499r8561q5837O297M6943J0756k1399R8287
7583i0902J55212j1787O266m2994N5327J9944j11092j6172P2271m662j19226q4592
$$ plain form
7571 -172407 -116437 -157358 -37487 32271 70515 112844 77930 -24512 -39891 -85139 20000
7560 20000 -6470 54189 28383 10513 76127 155518 173026 -16586 -159697 -160970 -185203 -115185
7548 -115185 43349 104743 23083 -89569 -57493 -27835 -74771 -9147 39173 -26854 -97937
7537 -97937 -174590 -125796 -58886 -107181 -52986 40145 196843 218931 50236 22088 21949 -76259
7525 -76259 -80131 30675 14476 -32493 -11648 31434 -35053 -87546 -71842 -196835 -249045 -174585
7513 -174585 -127538 -125807 -90748 78951 139432 95506 143308 117622 32551 -104559 -114964
7502 -114964 -109002 -21341 16745 77302 -5415 -131820 -184912 -171118 -171899 -111654 91825 87136
7490 87136 -51468 -116033 -155388 -49113 -10836 -31768 -69105 84606 171781 83643 21933
$$ packed form
7571a72407N5970m0921J19871O9758L8244M2329l4914j02442j5379m5248J05139
7560B0000k6470O0659k5806j7870O5614P9391J7508j89612j43111j273k4233P0018
7548a15185J58534O1394q1660j12652L2076K9658m6936O5624M8320o6027p1083
7537i7937p6653M8794O6910m8295N4195R3131J56698K2088j68695k8148j39r8208
7525g6259l872J10806j6199m6969K0845M3082o6487n2493J5704j24993n2210P4460
7513a74585M7047J731L5059J69699O0481m3926M7802k5686q5071j37110j0405
7502a14964N962Q7661L8086O0557q2717j26405n3092J3794p81O0245K03479m689
7490H7136j38604o4565l9355J06275L8277k0932l7337J53711Q7175q8138o1710
$$ plain form
7479 21933 -20340 -122734 -80660 -98850 -105874 -63820 -32894 17984 57801 41289 -53848 -51177
7467 -51177 -50620 -9780 -130702 -129451 -30037 87635 82923 45156 50732 139551 170285 97941
7455 97941 -34784 -100512 -77381 36432 122902 16770 -73684 -165163 -140877 -63423 -204632
7444 -204632 -190711 -128754 -31762 -87574 -164334 -105585 -45322 -25345 -17921 43579 67172 10224
7432 10224 -69197 -131760 -139115 -123515 -103870 -113258 -101270 -74477 -3996 -6196 -126096 -155003
7420 -155003 -259198 -194172 -165702 -193866 -237467 -252247 -237320 -231955 -227806 -119503 -60909 -32398
7408 -32398 -7657 -34444 -47027 -86266 -72661 -138943 -158331 -160777 -135234 23877 -28098 -18817
7396 -18817 -37571 -34656 -11081 -52508 -56755 -31913 -63831 -18786 -11516 -42743 -86794 -60352
$$ packed form
7479B1933m2273j02394M2074j8190p024M2054L0926N0878L9817j6512r5137K671
7467e1177N57M0840j20922J251R9414J17672m712l7767N576Q8819L0734p2344
7455I7941j32725o5728K3131J13813Q6470j06132r0454r1479K4286P7454j41209
7444b04632J3921O1957R6992n5812p6760N8749O0263J9977P424O1500K3593n6948
7432A0224p9421o2563p355J5600J9645r388J1988K6793P0481k200j19900k8907
7420a55003j04195O5026K8470k8164m3601j4780J4927N365M149J08303N8594K8511
7408c2398K4741k6787j2583l9239J3605o6282j9388k446K5543J59111n1975R281
7396a8817j8754K915K3575m1427m247K4842l1918M5045P270l1227m4051K6442
$$ plain form
7384 -60352 -21027 -1018 59094 68354 17743 -14552 -18617 -28037 -65797 -17834 -31427 -33739 -13898
7371 -13898 -20506 -76688 -8964 61823 41275 6794 43609 133589 210307 165826 126099 23567
7359 23567 -68657 -129380 -149981 -78787 -64765 -127552 7431 65147 -19370 -112537 -117396 5579
7347 5579 176944 187393 107622 26019 4400 36994 -56718 -33320 93687 73644 -46060
7336 -46060 -66735 15845 125056 195420 160686 76722 14383 -37650 38253 -54739 -42580 -75667
7324 -75667 -203909 -198716 -136468 -187512 -160014 -120989 -41601 1495 3784 -48105 -43115 -34252
7312 -34252 3282 54821 3074 -26806 -53057 -53661 -44453 -45993 -47612 -2665 43461 30216 -11456
7299 -11456 -1520 126035 156408 158529 66207 120900 158387 136733 -36007 -31632 109388 161800
$$ packed form
7384f0352L9325K0009O0112R260n0611l2295m065r420l7760M7963j3593k312J9841
7371a3898o608n6182O7724P0787k0548l4481L6815Q9980P6718m4481l9727j02532
7359B3567r2224o0723k0601P1194J4022o2787J34983N7716q4517r3167m859J22975
7347E579J71365J0449p9771q1603k1619L2594r3712K3398J27007k0043j19704
7336d6060k0675Q2580J09211P0364l4734q3964o2339n2033P5903r2992J2159l3087
7324g5667j28242N193O2248n1044K7498L9025P9388M3096K289n1889M990Q863
7312c4252L7534N1539n1747k9880k6251o04R208j540j619M4947M6126j3245m1672
7299a1456R936J27555L0373K121r2322N4693L7487k1654j72740M375J41020N2412
$$ plain form
7287 161800 72944 -11443 27323 -27965 9661 -46793 65892 100233 101390 10640 -134668
7276 -134668 -31146 -33768 -9863 18623 19024 12318 126641 116254 -8187 156232 255825 175245
7264 175245 145793 102651 77629 65086 92614 78952 -7110 -87871 -177347 -68538 -26857
7253 -26857 -73811 18651 61776 32089 97141 139236 143304 127445 -4349 33303 144461 133342
7241 133342 130980 234947 228900 140437 83207 118414 65072 -45338 -56141 -61133 -56955 3587
7229 3587 7648 -81127 -66254 -34805 16854 8215 -25054 -120637 -122379 -58511 -10813 -50550 -111168
7216 -111168 -120622 -21203 59073 167683 198639 106616 -67018 -87867 -81097 -25031 -63751 -63526
7204 -63526 -18775 78786 123816 64139 25637 18714 93583 62084 -66476 -112429 -50111 23740
$$ packed form
7287A61800q8856q4387L8766n5288L7626n6454J12685L4341J157r0750j45308
7276a34668J03522k622K3905K8486M01o706J14323j0387j24441J64419R9593q0580
7264A75245k9452m3142k5022j2543K7528j3662q6062q0761q9476J08809M1681
7253b6857m6954R2462M3125k9687O5052M2095M068j5859j31794L7652J11158j1119
7241A33342k362J03967o047q8463n7230L5207n3342j10410j0803m992M178O0542
7229C587M061q8775J4873L1449N1659q639l3269r5583j742O3868M7698l9737o0618
7216a11168r454R9419Q0276J08610L0956r2023j73634k0849O770N6066l8720K25
7204f3526M4751R7561M5030n9677l8502o923P4869l1499j28560m5953O2318P3851
$$ plain form
7192 23740 56190 27251 22979 -18443 -76400 53107 190237 225131 124269 63245 28695
7181 28695 -25884 -71486 -98007 -122637 -147556 -127768 -112591 -196484 -159072 -74522 -47131 -111189
7169 -111189 -146015 -137724 -141597 -68468 -26198 -120880 -125226 -30262 -68070 435 9892 -117
7157 -117 64836 104106 45052 7361 -598 -42672 -50086 6033 -38674 3513 46497 64823 23278
7144 23278 -113893 -147801 -84108 -29410 16036 -24741 -22770 -75149 -141962 -236092 -214439 -107667
7132 -107667 8567 55958 66840 -20882 -63358 -105129 -52191 -42179 -14143 49614 69894
7121 69894 4548 40504 63438 53268 71570 147765 202970 155946 60094 85008 110903 80437
7109 80437 7359 26085 86474 148419 37723 93292 157212 185227 229614 279368 286749 204555
$$ packed form
7192B3740L2450k8939m272m1422n7957J29507J37130L4894j00862o1024l4550
7181B8695n4579m5602k6521k4630k4919J9788J5177q3893L7412Q4550K7391o4058
7169a11189l4826Q291l873P3129M2270r4682m346R4964l7808O8505R457j0009
7157a17O4953L9270n9054l7691p959m2074p414N6119m4707M2187M2984J8326m1545
7144B3278j37171l3908O3693N4698M5446m0777J971n2379o6813r4130K1653J06772
7132a07667J16234M7391J0882q7722m2476m1771N2938J0012K8036O3757K0280
7121F9894o5346L5956K2934j0170J8302P6195N5205m7024r5852K4914K5895l0466
7109H0437p3078J8726O0389O1945j10696N5569O3920K8015M4387M9754P381q2194
$$ plain form
7097 204555 228255 223059 166932 131702 91777 207084 258928 354233 428842 410366 611640
7086 611640 817095 1066451 1500215 2079320 2558984 2494389 2271685 1934643 1380222 863056
7076 863056 678758 642369 524585 373486 424426 350567 280644 196116 161794 153486 150726
7065 150726 139567 58526 7184 89679 139557 113755 5584 18208 11328 21160 70661 123498
7053 123498 146539 77692 -74238 -90472 8292 -4363 -65169 -38872 23975 75416 18726
7042 18726 95513 898 -7521 43658 -22993 -27439 -134460 -185576 -138781 -106625 -24149 68062
7030 68062 20334 -32619 -12870 1101 39032 72973 -38828 -86755 -75497 -75125 17779 91318
7018 91318 108676 50363 155302 105968 95492 62364 -51624 -57734 4736 -14949 -132987
$$ packed form
7097B04555K3700n196n6127l5230l9925J15307N1844R5305P4609j8476K01274
7086F11640K05455K49356M33764N79105M79664o4595k22704l37042n54421n17166
7076H63056j84298l6389j17784j51099N0940p3859o9923q4528l4322q308k760
7065A50726j1159q1041n1342Q2495M9878k5802j08171J2624o880R832M9501N2837
7053A23498K3041o8847j51930j6234R8764j2655o0806K6297O2847N1441n6690
7042A8726P6787r4615q419N1179o6651m446j07021n1116M6795L2156Q2476R2211
7030F8062m7728n2953J9749J3971L7931L3941j11801m7927J1258L72R2904P3539
7018I1318J7358n8313J04939m9334j0476l3128j13988o110O2470j9685j18038
$$ plain form
7007 -132987 -191595 -72075 110455 56925 42041 31939 25204 -9520 59013 32250 51697
6996 51697 53409 75645 98413 40496 60383 56254 137396 235024 281594 344622 381997 271090
6984 271090 162241 135721 153025 122083 101382 91056 112072 53242 -24970 -27485 28945 22521
6972 22521 6831 -98714 -89034 -79282 -76157 -25831 -48163 -4515 31504 -41522 -78743 -27724
6960 -27724 -33634 -827 30505 63108 5797 -16478 94076 115929 30291 -31637 -39271 12435
6948 12435 110993 140916 148285 103443 54565 14342 11069 50753 47141 52200 42463 51995 179536
6935 179536 183689 140934 81734 10582 110369 75967 -37378 -63929 -19155 -80335 -104372 -148517
6923 -148517 -166319 -126657 -13943 101643 181154 97281 121124 163862 187391 70343 -47865
$$ packed form
7007a32987n8608J19520J82530n3530j4884j0102o735l4724O8533k6763J9447
6996E1697J712K2236K2768n7917J9887m129Q1142R7628M6570O3028L7375j10907
6984B71090j08849k6520J7304l0942k0701j0326K1016n8830p8212k515N6430o424
6972B2521j5690j05545R680R752L125N0326k2332M3648L6019p3026l7221N1019
6960b7724n910L2807L1332L2603n7311k2275J10554K1853q5638o1928p634N1706
6948A2435R8558K9923P369m4842m8878m0223l273L9684l612N059r737R532J27541
6935A79536M153m2755n9200p1152R9787l4402j13345k6551M4774o1180k4037m4145
6923a48517j7802L9662J12714J15586P9511q3873K3843M2738K3529j17048j18208
$$ plain form
6912 -47865 -67724 3484 131473 195519 254774 244585 197331 168489 90120 127778 126648 93189
6900 93189 100057 266946 275133 301064 353741 456999 544854 491241 470955 411154 248520 205105
6888 205105 270349 274263 208608 139671 89654 56504 48438 -10646 -128590 -24708 73861 58063
6876 58063 64590 191868 235731 187468 107121 151133 89113 -59895 -142784 -33771 3003
6865 3003 25007 -15273 -33289 126982 126533 117683 88738 72114 59126 -35868 -72683 -49458
6853 -49458 1884 -62409 28741 28775 -26320 13404 -51306 -69217 -276 -44348 -74831 -65994 -66468
6840 -66468 -69289 -99281 -84266 -224765 -320640 -232523 -142217 -133834 -77668 -69039 -101109 -69365
6828 -69365 -14943 8108 14465 -34418 -148655 -63882 -18178 -10892 -29892 -56282 -43973 -64387
$$ packed form
6912d7865j9859P1208J27989O4046N9255j0189m7254k8842p8369L7658j130l3459
6900I3189O868J66889Q187K5931N2677J03258Q7855n3613k0286n9801j62634m3415
6888B05105O5244L914o5655o8937n0017l3150q066n9084j17944J03882R8569j5798
6876E8063O527J27278M3863m8263q0347M4012o2020j49008q2889J09013L6774
6865C003K2004m0280j8016J60271m49q850k8945j6624j2988r4994l6815K3225
6853d9458N1342o4293R1150L4n5095L9724o4710j7911O8941m4072l0483Q837m74
6840f6468k821k9992J5015j40499r5875Q8117R0306Q383N6166Q629l2070L1744
6828f9365N4422K3051O357m8883j14237Q4773M5704P286j9000k6390J2309k0414
$$ plain form
6816 -64387 -2147 120158 96996 -33647 -24074 -64391 -111956 -90081 -70125 92216 278460
6805 278460 370044 266056 260512 283338 278082 172323 -23536 5016 211681 209424 282588
6794 282588 317031 358267 300499 192017 125848 149401 147842 50221 76345 147864 224247 291084
6782 291084 141098 95610 83680 130252 111684 87883 137497 60696 26474 6202 -48049
6771 -48049 -969 146061 183014 125351 98531 128925 31658 56603 211240 314451 367171
6760 367171 393462 398504 442697 456999 345611 336408 271484 158787 286063 400719 387287
6749 387287 490907 620832 669949 702022 867468 1001833 1151957 1421604 1906900 2440494
6739 2440494 3113700 3589829 3669188 3326702 3092314 2855512 2621978 2480254 2458643 2492721
$$ packed form
6816f4387O2240J22305k3162j30643R573m0317m7565K1875J9956J62341J86244
6805B78460R1584j03988n544K2826n256j05759j95859K8552K06665k257P3164
6794B82588L4443M1236n7768j08482o6169K3553j559r7621K6124P1519P6383O6837
6782B91084j49986m5488j1930M6572j8568k3801M9614p6801l4222k0272n4251
6771d8049M7080J47030L6953n7663k6820L0394r7267K4945J54637J03211N2720
6760C67171K6291N042M4193J4302j11388r203o4924j12697J27276J14656j3432
6749C87287J03620J29925M9117L2073J65446J34365J50124K69647M85296N33594
6739B440494O73206M76129P9359l42486k34388k36802k33534j41724k1611L4078
$$ plain form
6729 2492721 2647702 2897152 3331133 3755917 4409586 5368630 6651307 8567396 11223445
6720 11223445 15226903 21602085 32110551 49013193 71664831 90404754 94267715 85653070
6712 85653070 72848764 58184009 43161061 31104053 22650139 17193163 13533016 10867667
6704 10867667 8979353 7657236 6596853 5778190 5065103 4420572 3850154 3518228 3523201
6695 3523201 3604713 3621231 3827240 4179534 4293374 4022334 3600802 3264504 2729471 2241882
6685 2241882 1766071 1474020 1394217 1451974 1253219 1056549 1106136 1023883 890530 996913
6675 996913 1031063 1094948 1054405 998951 923174 910593 946629 822651 711441 621231 581161
6664 581161 528734 350235 302854 229788 218258 265908 278002 275860 258467 194297 200587 268938
$$ packed form
6729B492721J54981K49450M33981M24784O53669R59044J282677J916089K656049
6720A1223445M003458O375182J0508466J6902642K2651638J8739923L862961q614645
6712H5653070j2804306j4664755j5022948j2057008q453914n456976l660147k665349
6704A0867667j888314j322117j060383q18663p13087o44531n70418l31926M973
6695C523201Q1512J6518K06009L52294J13840k71040m21532l36298n35033m87589
6685B241882m75811k92051p9803N7757j98755j96670M9587q2253j33353J06383
6675I96913L4150O3885m0543n5454p5777j2581L6036j23978j11210r0210m0070
6664E81161n2427j78499m7381p3066j1530M7650J2094k142j7393o4170O290O8351
$$ plain form
6652 268938 374377 366957 237441 208908 285145 287997 165381 207521 268968 163111 177716
6641 177716 139811 92295 160090 119599 68159 15586 -23900 7298 43830 71342 113927 153701
6629 153701 125047 239244 269992 215528 82430 56689 49525 94986 84778 208891 234076
6618 234076 138917 167640 227236 204753 42014 -34148 -16187 16794 83850 90203 128583 156299
6606 156299 255955 278495 186830 177108 136485 99289 105464 31897 61311 99870 133378 129822
6594 129822 83044 78260 41607 49287 69181 37367 110408 142291 73148 62887 75148 99209
6582 99209 130145 179945 215483 187623 20734 -34360 5452 90766 26567 -20564 43280 180323
6570 180323 341915 483237 545687 766740 915248 932203 873691 875695 697035 462169 352259
$$ packed form
6652B68938J05439p420j29516k8533P6237K852j22616M2140O1447j05857J4605
6641A77716l7905m7516O7795m0491n1440n2573l9486L1198L6532K7512M2585L9774
6629A53701k8654J14197L0748n4464j33098k5741p164M5461j0208J24113K5185
6618B34076r5159K8723N9596k2483j62739p6162J7961L2981O7056O353L8380K7716
6606A56299R9656K2540r1665r722m0623l7196O175p3567K9414L8559L3508l556
6594A29822m6778m784l6653P680J9894l1814P3041L1883o9143j0261J2261K4061
6582I9209L0936M9800L5538k7860j66889n5094L9812Q5314o4199m7131O3844J37043
6570A80323J61592J41322O2450K21053J48508J6955n8512K004j78660k34866j09910
$$ plain form
6559 352259 301206 225401 152187 189035 106056 -16734 -44383 -41733 -61591 18858 125851
6548 125851 139647 55115 19877 22506 55916 120115 154813 146842 62196 24345 17300 112007
6536 112007 130574 58516 43983 -3276 -58570 -44529 65816 126693 -7060 -106212 -193793
6525 -193793 -180873 -104617 -20246 -16810 112793 86468 48337 29596 7677 10185 67730 80557
6513 80557 122629 133365 90032 38829 49269 3835 -25160 -37820 42508 69642 43965 46035
6501 46035 106297 217976 87269 -55400 -23827 31871 -40697 -18187 42438 155755 78599
6490 78599 -40431 -94517 -868 44293 -29945 -111121 -92101 12442 154302 131538 -17029
6479 -17029 -5325 -41883 -36930 -106354 -165107 -94541 49397 68773 -12621 -18139 67458 170566
$$ packed form
6559C52259n1053p5805p3214L6848q2979j22790k7649K650j9858Q0449J06993
6548A25851J3796q4532l5238K629L3410O4199L4698p971q4646l7851p045R4707
6536A12007J8567p2058j4533m7259n5294J4041J10345O0877j33753r9152q7581
6525a93793J2920P6256Q4371L436J29603k6325l8131j8741k1919K508N7545J2827
6513H0557M2072J0736m3333n1203J0440m5434k8995j2660Q0328K7134k5677K070
6501D6035O0262J11679j30707j42669L1573N5698p2568K2510O0625J13317p7156
6490G8599j19030n4086R3649M5161p4238q1176J9020J04543J41860k2764j48567
6479a7029J1704l6558M953o9424n8753P0566J43938J9376q1394n518Q5597J03108
$$ plain form
6467 170566 72749 -58112 -48256 -16620 71 -74160 -86699 -27032 -77840 -82455 -155917 -144189
6455 -144189 -106521 -147044 -101171 -52208 -41600 -118646 -107925 16180 71941 64171 13179 9029
6443 9029 -20195 -35974 -62176 -107367 -24107 196010 243568 138764 33782 -47499 -8327
6432 -8327 33345 52461 8029 -15741 -109410 -83570 -69687 -72806 -111658 -77287 2612 -44040
6420 -44040 -6925 22733 -49308 -81494 -65767 -59887 -53035 32603 84128 74876 -10239 118511
6408 118511 221611 300979 225815 136081 -49362 -54360 9938 -19342 41696 10939 -20263
6397 -20263 -45151 -106074 -39911 -95775 -138993 -107370 -113140 -45433 25297 130997 45350 -16150
6385 -16150 -69731 18178 6322 -21978 -24942 -98950 -74234 -78645 -40093 9189 -9370 119211
$$ packed form
6467A70566r7817j30861R856L1636J6691p4231j2539N9667n0808m615p3462J1728
6455a44189L7668m0523M5873M8963J0608p7046J0721J24105N5761p770n0992m150
6443I029k9224j5779k6202m5191Q3260K20117M7558j04804j04982q1281L9172
6432h327M1672J9116m4432k3770r3669K5840J3883l119l8852L4371P9899m6652
6420d4040L7115K9658p2041l2186J5727N880O852Q5638N1525r252q5115J28750
6408A18511J03100P9368p5164q9734j85443m998O4298k9280O1038l0757l1202
6397b0263k4888o0923O6163n5864m3218L1623n770O7707P0730J05700q5647o1500
6385a6150n3581Q7909j1856k8300k964p4008K4716m411L8552M9282j8559J28581
$$ plain form
6373 119211 173841 176016 168124 126899 74182 51005 -9637 -53156 -84461 -18983 40151 124286
6361 124286 84178 193 -43432 -124625 -79111 -89831 -42477 26194 73153 112291 45384 19409
6349 19409 22623 57227 117216 222701 146276 89259 54104 171555 312624 278262 199695
6338 199695 262442 348885 290130 246348 209739 171634 107277 65617 -23432 -90341 37712
6327 37712 69839 81823 66974 -16107 -47374 713 -119660 -183401 -128761 -65766 -87206 -84536
6315 -84536 -109638 -132763 -151000 -77700 -52173 -68508 -173756 -128298 -26194 -49480 -67326
6304 -67326 -89362 -115682 -58418 -29340 54655 -2598 34501 75401 51578 144253 155151 82431
6292 82431 64039 60997 66673 104046 145671 64715 29817 68824 -534 -56468 -52108 3081
$$ packed form
6373A19211N4630K175p892m1225n2717k3177o0642m3519l1305O5478N9134Q4135
6361A24286m0108q3985m3625q1193M5514j0720M7354O8671M6959L9138o6907k5975
6349A9409L214L4604N9989J05485p6425n7017l5155J17451J41069l4362p8567
6338A99695O2747Q6443n8755m3782l6609l8105o4357m1660q9049o6909J28053
6327C7712L2127J1984j4849q3081l1267M8087j20373o3741N4640O2995k1440K670
6315h4536k5102k3125j8237P3300K5527j6335j05248M5458J02104k3286j7846
6304f7326k2036k6320N7264K9078Q3995n7253L7099M0900k3823R2675J0898p2720
6292H2431j8392l042N676L7373M1625q0956l4898L9007o9358n5934M360N5189
$$ plain form
6280 3081 15221 24621 12229 22323 32755 -33325 6297 91358 140328 103282 55111 54467 83338
6267 83338 74812 79195 40209 -47770 -23372 -61995 -76688 49817 -3920 -85160 -150662 -99606
$$ packed form
6280C081J2140R400j2392J0094J0432o6080L9622Q5061M8970l7046m8171o44K8871
6267H3338q526M383l8986q7979K4398l8623j4693J26505n3737q1240o5502N1056
$$ [...]
##END NTUPLES=NMR SPECTRUM
##END=
