##TITLE=Analysis number 319879
Compound Code cc 44813
Book Reference 438/142
Project Code adrs
Chemist Name antons
##JCAMPDX= 6.0         $$ Bruker NMR JCAMP-DX V2.0
##DATA TYPE= NMR SPECTRUM
##DATA CLASS= NTUPLES
##ORIGIN= Bruker BioSpin GmbH
##OWNER= nmr
$$ XWIN-NMR		Version 3.5
$$ Thu Jun  1 12:50:46 2006 GMT Daylight Time (UT+1h)  MAYBRIDGE\nmr@NMR_250MHZ
##.OBSERVE FREQUENCY= 250.131544655141
##.OBSERVE NUCLEUS= ^1H
##.ACQUISITION MODE= SIMULTANEOUS (DQD)
##.ACQUISITION SCHEME= undefined
##.AVERAGES= 16
##.DIGITISER RES= 18
##SPECTROMETER/DATA SYSTEM= dpx250
##.PULSE SEQUENCE= zg30
##.SOLVENT NAME= CDCl3
##.SHIFT REFERENCE= (INTERNAL, CDCl3, 0, 16.522)
##AUDIT TRAIL= $$ (NUMBER, WHEN, WHO, WHERE, WHAT)
$$ ##TITLE= Audit trail, XWIN-NMR		Version 3.5
$$ ##JCAMPDX= 5.01
$$ ##ORIGIN= Bruker BioSpin GmbH
$$ ##OWNER= nmr
$$ C:\u/data/dgb/nmr/ADRS/120/pdata/1/auditp.txt
$$ ##AUDIT TRAIL=  $$ (NUMBER, WHEN, WHO, WHERE, WHAT)
(   1,<2006-06-01 12:50:02.86 +100>,<MAYBRIDGE\nmr>,<NMR_250MHZ>,
      <created by zg, POWCHK disabled, PULCHK disabled
       configuration hash MD5:
       E2 DF 36 D8 04 B2 41 60 5A D7 A3 38 5A 4B D0 FE
       data hash MD5: 64K
       72 67 0C 2C B7 CA DE 39 01 C5 30 CD 3F B8 FF CB>)
(   2,<2006-06-01 12:50:24.96 +100>,<MAYBRIDGE\nmr>,<NMR_250MHZ>,
      <Start of raw data processing
       ef LB = 0.3 FT_mod = 6 PKNL = 1 SI = 32K 
       data hash MD5: 32K
       F3 88 E2 EE DC 64 83 67 30 51 B5 BB 71 9B 9B 62>)
(   3,<2006-06-01 12:50:30.32 +100>,<MAYBRIDGE\nmr>,<NMR_250MHZ>,
      <apk 
       data hash MD5: 32K
       0B 59 CA A6 B0 80 97 45 8B 1B C3 85 55 A5 D0 37>)
(   4,<2006-06-01 12:50:32.25 +100>,<MAYBRIDGE\nmr>,<NMR_250MHZ>,
      <abs ABSG = 5 
       data hash MD5: 32K
       57 F1 1B 95 B8 53 D1 AA E3 03 69 C3 D8 90 F8 E0>)
$$ ##END=
$$ 
$$ hash MD5
$$ D0 7C C0 74 F7 E2 06 09 61 CE A4 2C 19 CB 18 26
##$RELAX= 
##$RELAX= 
##$RELAX= 
##$RELAX= 
##$RELAX= 
##$RELAX= 
##$RELAX= 
$$ Bruker specific parameters
$$ --------------------------
##$DU= <C:\u>
##$EXPNO= 120
##$NAME= <ADRS>
##$PROCNO= 1
##$TYPE= <nmr>
##$USER= <dgb>
##$AMP= (0..31)
100 100 100 100 100 100 100 100 100 100 100 100 100 100 100 100 100 100 
100 100 100 100 100 100 100 100 100 100 100 100 100 100 
##$AQSEQ= 0
##$AQ_mod= 3
##$AUNM= <au_zg>
##$AUTOPOS= <26 >
##$BF1= 250.13
##$BF2= 250.13
##$BF3= 250.13
##$BF4= 250.13
##$BF5= 500.13
##$BF6= 500.13
##$BF7= 500.13
##$BF8= 500.13
##$BYTORDA= 1
##$CFDGTYP= 0
##$CFRGTYP= 5
##$CHEMSTR= <none>
##$CNST= (0..31)
1 1 145 1 1 1 1 1 1 1 1 1 1 1 1 1 1 1 1 1 1 1 1 1 1 1 1 1 1 1 1 1 
##$CPDPRG= <>
##$CPDPRG1= <>
##$CPDPRG2= <>
##$CPDPRG3= <>
##$CPDPRG4= <mlev>
##$CPDPRG5= <mlev>
##$CPDPRG6= <mlev>
##$CPDPRG7= <mlev>
##$CPDPRG8= <mlev>
##$CPDPRGB= <>
##$CPDPRGT= <>
##$D= (0..31)
0 1 0 0 0 0 0 0 0 0.06 0 0 0 0 0 0 0.0002 0 0 0 0 0 0 0 0 0 0 0 0 0 0 
0 
##$DATE= 1149162597
##$DBL= (0..7)
120 120 120 120 120 120 120 120 
##$DBP= (0..7)
150 150 150 150 150 150 150 150 
##$DBP07= 0
##$DBPNAM0= <>
##$DBPNAM1= <>
$$ [...]
##$SUBNAM7= <"">
##$SUBNAM8= <"">
##$SUBNAM9= <"">
##$SW= 20.6930455092707
##$SWIBOX= (0..15)
0 0 3 0 0 0 0 0 0 0 0 0 0 0 0 0 
##$SW_h= 5175.983436853
##$TD= 65536
##$TD0= 1
##$TE= 295.16
##$TE2= 300
##$TE3= 300
##$TEG= 300
##$TL= (0..7)
0 120 120 120 120 120 120 120 
##$TP= (0..7)
150 150 150 150 150 150 150 150 
##$TP07= 0
##$TPNAME0= <>
##$TPNAME1= <>
##$TPNAME2= <>
##$TPNAME3= <>
##$TPNAME4= <>
##$TPNAME5= <>
##$TPNAME6= <>
##$TPNAME7= <>
##$TPOAL= (0..7)
0.5 0.5 0.5 0.5 0.5 0.5 0.5 0.5 
##$TPOFFS= (0..7)
0 0 0 0 0 0 0 0 
##$TUNHIN= 0
##$TUNHOUT= 0
##$TUNXOUT= 0
##$USERA1= <user>
##$USERA2= <user>
##$USERA3= <user>
##$USERA4= <user>
##$USERA5= <user>
##$V9= 5
##$VALIST= <valist>
##$VCLIST= <CCCCCCCCCCCCCCC>
##$VD= 0
##$VDLIST= <DDDDDDDDDDDDDDD>
##$VPLIST= <PPPPPPPPPPPPPPP>
##$VTLIST= <TTTTTTTTTTTTTTT>
##$WBST= 1024
##$WBSW= 4
##$XGAIN= (0..3)
0 0 0 0 
##$XL= 0
##$YL= 0
##$YMAX_a= 485729
##$YMIN_a= -359016
##$ZGOPTNS= <>
##$ZL1= 120
##$ZL2= 120
##$ZL3= 120
##$ZL4= 120
##$ABSF1= 16.522
##$ABSF2= -4.171173
##$ABSG= 5
##$ABSL= 3
##$ALPHA= 0
##$AQORDER= 0
##$ASSFAC= 0
##$ASSFACI= 0
##$ASSFACX= 0
##$ASSWID= 0
##$AUNMP= <proc_1d>
##$AZFE= 0.1
##$AZFW= 0.1
##$BCFW= 0
##$BC_mod= 0
##$BYTORDP= 0
##$COROFFS= 0
##$CY= 12.5
##$DATMOD= 1
##$DC= 0
##$DFILT= <>
##$DTYPP= 0
##$F1P= 14.0000005364418
##$F2P= -0.99999901652339
##$FCOR= 0.5
##$FTSIZE= 32768
##$FT_mod= 6
##$GAMMA= 0
##$GB= 0
##$INTBC= 1
##$INTSCL= 1
##$ISEN= 128
##$LB= 0.3
##$LEV0= 0
##$LPBIN= 0
##$MAXI= 10000
##$MC2= 0
##$MEAN= 0
##$ME_mod= 0
##$MI= 0
##$NCOEF= 0
##$NC_proc= -5
##$NLEV= 6
##$NOISF1= 0
##$NOISF2= 0
##$NSP= 0
##$NTH_PI= 0
##$NZP= 0
##$OFFSET= 16.522
##$PC= 1
##$PHC0= 18.54715
##$PHC1= 4.834706
##$PH_mod= 1
##$PKNL= yes
##$PPARMOD= 0
##$PSCAL= 4
##$PSIGN= 0
##$REVERSE= no
##$SF= 250.13
##$SI= 32768
##$SIGF1= 0
##$SIGF2= 0
##$SINO= 400
##$SIOLD= 32768
##$SREGLST= <1H.CDCl3>
##$SSB= 0
##$STSI= 32768
##$STSR= 0
##$SW_p= 5175.98343685301
##$SYMM= 0
##$S_DEV= 0
##$TDeff= 65536
##$TDoff= 0
##$TI= <Analysis number 999999
Compound Code 99
Book Reference 9
Project Code 9>
##$TILT= no
##$TM1= 0
##$TM2= 0
##$TOPLEV= 0
##$USERP1= <user>
##$USERP2= <user>
##$USERP3= <user>
##$USERP4= <user>
##$USERP5= <user>
##$WDW= 1
##$XDIM= 32768
##$YMAX_p= 504239529
##$YMIN_p= -79846
$$ End of Bruker specific parameters
$$ ---------------------------------
##NTUPLES= NMR SPECTRUM
##VAR_NAME=  FREQUENCY,     SPECTRUM/REAL,   SPECTRUM/IMAG
##SYMBOL=    X,             R,               I
##VAR_TYPE=  INDEPENDENT,   DEPENDENT,       DEPENDENT
##VAR_FORM=  AFFN,          ASDF,            ASDF
##VAR_DIM=   32768,         32768,           32768
##UNITS=     HZ,            ARBITRARY UNITS, ARBITRARY UNITS
##FACTOR=    0.157963299565203, 1,           1
##FIRST=     4132.6476996994, 0,             0
##LAST=      -1043.33573715361, 0,           0
##MIN=       -1043.33573715361, -79846,      0
##MAX=       4132.6476996994, 504239529,     0
$$ Real data points
##PAGE= N=1
##DATA TABLE= (X++(R..R)), XYDATA
$$ [...]
$$ plain form
18589 330670 362040 392083 411807 416820 424181 446220 461302 459599 445081 444199 463355 473352 478443
18576 478443 475907 454981 428357 402474 379820 336525 292390 238848 203467 188358 173904 143501
18564 143501 128665 129147 136693 140288 126249 124331 126822 148387 146344 140184 128484 117007 95691
18551 95691 89985 86705 79439 76285 70215 93261 99069 101797 103498 83927 67905 75532 71346 79618
18537 79618 89316 96245 113889 128490 127117 107167 132378 164564 189567 236685 263444 272742
18525 272742 277927 282660 286700 254153 228026 242087 250717 250095 253602 267705 265999 277353 282103
18512 282103 267274 238931 188186 157310 128552 111722 115585 112729 107682 105020 102174 102370 85507
18499 85507 76026 71539 73560 79645 82285 90716 96817 103612 117466 116630 95823 114997 140124 156503
$$ packed form
18589C30670L1370L0043J9724N013P361K2039J5082j703j4518q82J9156R997N091
18576D78443k536k0926k6624k5883k2654m3295m4135n3542l5381j5109j4454l0403
18564A43501j4836M82P546L595j4039j918K491K1565k043o160j1700j1477k1316
18551I5691n706l280p266l154o070K3046N808K728J701j9571j6022P627m186Q272
18537G9618R698O929J7644J4601j373j9950K5211L2186K5003M7118K6759R298
18525B72742N185M733M040l2547k6127J4061Q630o22L507J4103j706J1354M750
18512B82103j4829k8343n0745l0876k8758j6830L863k856n047k662k846J96j6863
18499H5507r481m487K021O085K640Q431O101O795J3854q36k0807J9174K5127J6379
$$ plain form
18485 156503 152224 176718 202767 220179 261867 306710 335896 337988 353610 389408 421835 433495
18473 433495 437672 433075 422786 424111 438450 442245 458206 457613 453407 429144 409744 384134 351772
18460 351772 314512 287871 255831 216375 186230 169369 159246 146682 150012 127643 108052 109294
18448 109294 127281 133546 116031 95868 82417 81142 94853 117404 136001 141226 144056 142309
18436 142309 163225 176083 176901 182130 216933 261735 286228 317078 333305 339352 335806 331920 327505
18423 327505 305653 293857 301789 324562 344643 358697 387413 395397 377112 348140 301387 266765
18411 266765 240715 216620 180344 171020 166033 180177 187144 182938 171037 167506 174048 167983 160602
18398 160602 147559 149762 155228 156937 153626 160624 159128 150159 170267 161489 143285 127406 135438
$$ packed form
18485A56503m279K4494K6049J7412M1688M4843K9186K092J5622L5798L2427J1660
18473D33495M177m597j0289J325J4339L795J5961n93m206k4263j9400k5610l2362
18460C51772l7260k6641l2040l9456l0145j6861j0123j2564L330k2369j9591J242
18448A09294J7987O265j7515k0163j3451j275J3711K2551J8597N225K830j747
18436A42309K0916J2858Q18N229L4803M4802K4493L0850J6227O047l546l886m415
18423C27505k1852j1796P932K2773K0081J4054K8716P984j8285k8972m6753l4622
18411B66765k6050k4095l6276r324m987J4144O967m206j1901l531O542o065p381
18398A60602j3043K203N466J709l311O998j496q969K0108q778j8204j5879Q032
$$ plain form
18385 135438 149027 158025 161148 151780 141010 153014 153916 163591 147571 136503 142353 140188 139048
18372 139048 128175 131454 127525 121885 130912 128712 135051 146311 161626 164834 162705 147402 151203
18359 151203 162497 168643 169821 175297 187886 205755 207539 213044 211659 204632 196896 166148 141047
18346 141047 137605 150433 150208 147491 157517 164209 143985 127530 119906 115458 126854 139189 141747
18333 141747 156553 153826 129439 109879 97412 81736 80607 72465 76210 90111 98662 103021 124149
18320 124149 136242 144938 144987 147017 164519 167318 170396 166235 147694 143197 145006 148600 158380 156738
18306 156738 151848 143694 138022 145988 166412 172249 176015 163345 176377 183655 188192 186944 184161
18293 184161 181556 174016 187302 189788 186562 198719 209035 193801 185997 183702 183775 190222 185078 214864
$$ packed form
18385A35438J3589Q998L123r368j0770J2004R02R675j6020j1068N850k165j140
18372A39048j0873L279l929n640R027k200O339J1260J5315L208k129j5303L801
18359A51203J1294O146J178N476J2589J7869J784N505j385p027p736l0748k5101
18346A41047l442J2828k25k717J0026O692k0224j6455p624m448J1396J2335K558
18333A41747J4806k727k4387j9560j2467j5676j129q142L745J3901Q551M359K1128
18320A24149J2093Q696M9K030J7502K799L078m161j8541m497J809L594R780j642
18306A56738m890q154n672P966K0424N837L766j2670J3032P278M537j248k783
18293A84161k605p540J3286K486l226J2157J0316j5234p804k295P3O447n144K9786
$$ plain form
18279 214864 224177 243530 262878 281288 294669 301871 305089 307850 315658 325884 346760 357437
18267 357437 360120 378446 387293 390510 376258 390814 393221 385764 386120 390088 387874 404505 416721
18254 416721 416475 432156 436349 419968 411418 411998 422945 450623 475687 507481 537309 558904 560018
18241 560018 549255 571441 595806 616940 635544 671768 698023 724444 748924 763673 768906 758268
18229 758268 756458 760705 758714 752296 767540 789353 794740 805375 839407 874349 910409 944566
18217 944566 986956 1024062 1028249 1029105 1029996 1014031 983995 969872 979831 998487 1045433 1116226 1197765
18204 1197765 1318608 1434076 1523835 1594907 1626097 1630400 1599894 1554862 1494031 1444303 1391388
18193 1391388 1311242 1267231 1225294 1189227 1163080 1159986 1173968 1196842 1231230 1276392 1314043
$$ packed form
18279B14864R313J9353J9348J8410J3381P202L218K761P808J0226K0876J0677
18267C57437K683J8326Q847L217j4252J4556K407p457L56L968k214J6631J2216
18254D16721k46J5681M193j6381q550N80J0947K7678K5064L1794K9828K1595J114
18241E60018j0763K2186K4365K1134J8604L6224K6255K6421K4480J4749N233j0638
18229G58268j810M247j991o418J5244K1813N387J0635L4032L4942L6060L4157
18217I44566M2390L7106M187Q56Q91j5965l0036j4123R959J8656M6946P0793Q1539
18204A197765J20843J15468Q9759P1072L1190M303l0506m5032o0831m9728n2915
18193A391388q0146m4011m1937l6067k6147l094J3982K2874L4388M5162L7651
$$ plain form
18182 1314043 1363113 1433273 1513896 1609160 1721458 1859167 2038530 2222989 2388136 2536534
18172 2536534 2700382 2871712 3025572 3149659 3277608 3423550 3624605 3870900 4146872
18163 4146872 4436840 4787536 5230703 5770242 6465506 7460232 8961117 11214635 14316385
18154 14316385 18238861 23148775 29299794 36219466 42978907 49087697 54678711 59365126
18146 59365126 62272379 63561578 64148694 64660349 64406838 64721477 66687956 69322712 71260647
18137 71260647 72730713 73747359 73035053 69974936 65047108 59197597 51714030 43924851
18129 43924851 37233934 31620270 26629373 22633546 19940717 18206602 17051687 16261210
18121 16261210 15729156 15377463 15170931 15061789 15038868 15090480 15255785 15558392 16026848 16827919
$$ packed form
18182A314043M9070P0160Q0623R5264J12298J37709J79363J84459J65147J48398
18172B536534J63848J71330J53860J24087J27949J45942K01055K46295K75972
18163D146872K89968L50696M43167N39539O95264R94726J500885K253518L101750
18154A4316385L922476M909914O151019O919672O759441O108790N591014M686415
18146E9365126K907253J289199N87116N11655k53511L14639J966479K634756J937935
18137G1260647J470066J016646p12306l060117m927828n849511p483567p789179
18129D3924851o690917n613664m990897l995827k692829j734115j154915p90477
18121A6261210n32054l51693k06532j09142k2921N1612J65305L02607M68456Q01071
$$ plain form
18111 16827919 18176081 20510540 24483504 30387088 37377972 44373110 51915414 60712736
18103 60712736 69187994 75658567 78384933 79572399 80548047 80747225 80709790 80708499 79880363
18094 79880363 79924288 82123012 85191390 87518743 89399259 90863078 90287773 86853528
18086 86853528 80981678 73930385 64993488 55373516 46840360 39663647 33276611 28023721
18078 28023721 24313466 21795675 19994430 18633941 17531759 16589081 15755911 14975938
18070 14975938 14253233 13595032 13039351 12538548 12081406 11647339 11236161 10826946 10428497
18061 10428497 10025514 9624624 9267073 8947104 8661111 8377201 8110935 7867912 7630525
18052 7630525 7422051 7220808 7046812 6917591 6835603 6779237 6751433 6737772 6739058 6759744 6812070
$$ packed form
18111A6827919J348162K334459L972964N903584O990884O995138P542304Q797322
18103F0712736Q475258O470573K726366J187466R75648J99178l7435j291q28136
18094G9880363M3925K198724L068378K327353J880516J463819n75305l434245
18086H6853528n871850p051293q936897r619972q533156p176713o387036n252890
18078B8023721l710255k517791j801245j360489j102182r42678q33170p79973
18070A4975938p22705o58201n55681n00803m57142m34067m11178m09215l98449
18061A0428497m02983m00890l57551l19969k85993k83910k66266k43023k37387
18052G630525k08474k01243j73996j29221q1988n6366k7804j3661J286K0686N2326
$$ plain form
18041 6812070 6921516 7117775 7466828 8061409 9054152 10687736 13131703 16405374 20375236
18032 20375236 24800862 29054729 32539888 34989512 35992489 35517712 33510858 30563052
18024 30563052 28360975 27281159 27513502 29071708 31187028 32980943 34027920 33847793
18016 33847793 32312750 29244847 24969568 20873009 17284464 14404805 12466377 11256064
18008 11256064 10459564 9890440 9453296 9113695 8872756 8698420 8543362 8417125 8320047
17999 8320047 8274936 8301081 8381997 8578883 8912192 9403092 10129030 11253048 13021297 15749811
17989 15749811 19611096 24600894 30647045 37457374 44435226 51208038 57528617 62777693
17981 62777693 66850595 69180064 70260369 71340857 72259174 72976283 73445179 72673133 71478599
$$ packed form
18041F812070J09446J96259L49053N94581R92743J633584K443967L273671L969862
18032B0375236M425626M253867L485159K449624J002977m74777k006854k947806
18024C0563052k202077j079816K32343J558206K115320J793915J046977j80127
18016C3847793j535043l067903m275279m096559l588545k879659j938428j210313
18008A1256064p96500n69124m37144l39601k40939j74336j55058j26237r7078
17999H320047m5111K6145Q0916J96886L33309M90900P25938J124018J768249K728514
17989A5749811L861285M989798O046151O810329O977852O772812O320579N249076
17981F2777693M072902K329469J080305J080488R18317P17109M68896p72046j194534
$$ plain form
17972 71478599 70829209 70260139 69902709 69018885 66881042 64144716 60498189 55852951 50309682
17963 50309682 43427918 36639987 30730251 25765631 22149134 19678183 17937167 16633458
17955 16633458 15593015 14719398 14018035 13473904 13031754 12674256 12423999 12220097 12056029
17946 12056029 11952651 11921692 12001900 12238045 12717933 13605989 15151041 17698433 21584231
17937 21584231 26876732 33367157 40705722 47989041 54080796 58457914 60467041 59873950
17929 59873950 56695591 51546283 47251555 44826577 44537648 46613318 49960453 52997042
17921 52997042 54931150 55008456 52832297 48232184 41319240 34254351 27886206 22592110
17913 22592110 18849102 16366825 14680501 13415930 12419700 11614248 10911515 10274108 9732608
$$ packed form
17972G1478599o49390n69070l57430q83824k137843k736326l646527m645238n543269
17963E0309682o881764o787931n909736m964620l616497k470951j741016j303709
17955A6633458j040443q73617p01363n44131m42150l57498k50257k03902j64068
17946A2056029j03378l0959Q0208K36145M79888Q88056J545052K547392L885798
17937B1584231N292501O490425P338565P283319O091755M377118K009127n93091
17929E9873950l178359n149308m294728k424978k88929K075670L347135L036589
17921E2997042J934108P7306k176159m600113o912944p064889o368145n294096
17913B2592110l743008k482277j686324j264571r96230q05452p02733o37407n41500
$$ plain form
17904 9732608 9245656 8799904 8389601 8032331 7714750 7451916 7206223 6987406 6780124
17895 6780124 6584268 6367398 6132231 5903768 5659983 5392371 5140669 4914920 4707380
17886 4707380 4528342 4374686 4224802 4073865 3940770 3806566 3685261 3600649 3537658 3454862
17876 3454862 3353397 3257741 3167126 3087781 3017033 2964495 2926866 2867849 2800705 2733601 2664566
17865 2664566 2575475 2498985 2424758 2336590 2253722 2178937 2100312 2032205 1966712 1896713 1845012
17854 1845012 1831622 1793004 1748012 1711193 1663767 1610522 1546084 1515000 1490923 1451528 1409259
17843 1409259 1379851 1368309 1345010 1314574 1273862 1221034 1181256 1160988 1138562 1110926 1103963
17832 1103963 1105388 1092202 1070717 1054973 1029498 997628 979679 957047 927827 906666 879352
$$ packed form
17904I732608m86952m45752m10303l57270l17581k62834k45693k18817k07282
17895F780124j95856k16870k35167k28463k43785k67612k51702k25749k07540
17886D707380j79038j53656j49884j50937j33095j34204j21305q4612o2991q2796
17876C454862j01465r5656r0615p9345p0748n2538l7629n9017o7144o7104o9035
17865B664566q9091p6490p4227q8168q2868p4785p8625o8107o5493o9999n1701
17854A845012j3390l8618m4992l6819m7426n3245o4438l1084k4077l9395m2269
17843A409259k9408j1542k3299l0436m0712n2828l9778k0268k2426k7636o963
17832A103963J425j3186k1485j5744k5475l1870j7949k2632k9220k1161k7314
$$ plain form
17821 879352 861112 868652 862344 855932 856850 855522 833300 790728 758655 749580 742980 728616 694412
17808 694412 681134 685393 695949 686676 669686 682223 688046 680410 666307 668434 677129 697383 719155
17795 719155 733399 740280 752828 773077 783010 775608 759507 748770 748570 735211 708971 692747
17783 692747 681498 660156 661648 656429 656344 651770 647616 653274 651226 648966 630449 623650 617415 606236
17769 606236 585405 573160 563072 575877 578574 582049 571229 561382 551114 554811 545515 539782 537134
17756 537134 552001 570237 561187 553438 557172 570102 598962 639989 660068 693515 741728 784098
17744 784098 828148 858175 886484 917033 926870 937748 923263 903448 898708 906428 903482 894810
17732 894810 894536 890783 883199 858250 843612 828776 817269 830793 838833 838595 830716 839269 872084
$$ packed form
17821H79352j8240P540o308o412R18j328k2222m2572l2073r075o600j4364l4204
17808F94412j3278M259J0556r273j6990J2537N823p636j4103K127Q695K0254K1772
17795G19155J4244O881J2548K0249R933p402j6101j0737k00j3359k6240j6224
17783F92747j1249k1342J492n219q5m574m154N658k048k260j8517o799o235j1179
17769F06236k0831j2245j0088J2805K697L475j0820r847j0268L697r296n733k648
17756E37134J4867J8236r050p749L734J2930K8860M1027K0079L3447M8213M2370
17744G84098M4050L0027K8309L0549R837J0878j4485j9815m740P720k946q672
17732H94810k74l753p584k4949j4638j4836j1507J3524Q040k38p879Q553L2815
$$ plain form
17719 872084 889201 888458 905686 927711 961447 1001188 1048902 1097324 1135953 1172137 1205577 1253440
17707 1253440 1309975 1349286 1404586 1475133 1586224 1717182 1866950 2059625 2279907 2513315
17697 2513315 2795268 3120951 3476053 3849829 4269913 4736704 5242535 5780789 6333745
17688 6333745 6908915 7601252 8404244 9243396 10210434 11609071 13688185 16733227 21134243
17679 21134243 27278994 35324062 44985262 55674111 66600205 76938864 86014236 93452863
17671 93452863 99310924 103913793 107678791 110987299 114010603 116416347 117075737 114562071
17663 114562071 107993074 97474303 84186130 69888150 56422493 45165114 36676084
17656 36676084 30662666 26510957 23615909 21527737 19987659 18815579 17890423 17142228
$$ packed form
17719H72084J7117p43J7228K2025L3736L9741M7714M8422L8629L6184L3440M7863
17707A253440N6535L9311N5300P0547J11091J30958J49768J92675K20282K33408
17697B513315K81953L25683L55102L73776M20084M66791N05831N38254N52956
17688F333745N75170O92337Q02992Q39152R67038J398637K079114L045042M401016
17679B1134243O144751Q045068R661200J0688849J0926094J0338659R075372P438627
17671I3452863N858061M602869L764998L308508L023304K405744O59390k513666
17663A14562071o568997j0518771j3288173j4297980j3465657j1257379q489030
17656C6676084o013418m151709k895048k088172j540078j172080r25156p48195
$$ plain form
17648 17142228 16535172 15998350 15498214 15057727 14696338 14382547 14160729 13992431 13877487
17639 13877487 13805727 13760096 13743122 13787320 13948425 14292933 14887818 15826908 17277710 19503131
17629 19503131 22803066 27538680 34032762 42230381 51876332 62526057 73761218 85340479
17621 85340479 97064889 108599564 119370010 128665066 136140617 142054902 146151049 147399681
17613 147399681 144602384 137536385 127926050 117141043 106246200 96064090 86737862
17606 86737862 77636646 68068107 57831999 48289569 40488130 34800897 30956362 28332188
17598 28332188 26440463 24982206 23803043 22787976 21871109 21046291 20308317 19620745 18974732
17589 18974732 18372886 17814666 17335711 16968491 16727196 16558404 16481642 16534713 16799108 17404654
$$ packed form
17648A7142228o07056n36822n00136m40487l61389l13791k21818j68298j14944
17639A3877487p1760m5631j6974M4198J61105L44508N94885R39090J450802K225421
17629A9503131L299935M735614O494082Q197619R645951J0649725J1235161J1579261
17621H5340479J1724410J1534675J0770446R295056P475551N914285M096147J248632
17613A47399681k797297p065999r610335j0785007j0894843j0182110r326228
17606H6737862r101216r568539j0236108r542430p801439n687233l844535k624174
17598B8332188j891725j458257j179163j015067r16867q24818p37974o87572o46013
17589A8974732o01846n58220m78955l67220k41295j68792p6762N3071K64395O05546
$$ plain form
17579 17404654 18550050 20529664 23825016 29112010 36995188 47533595 59885485 72487919
17571 72487919 83854958 93262768 100112574 103645502 103350924 100089263 96098312 93365806
17563 93365806 92258365 92028387 91168662 87886803 80714899 69870243 57332652 45821147
17555 45821147 36865532 30645663 26556184 23791374 21833592 20365815 19221490 18267871
17547 18267871 17435185 16685519 16007893 15391753 14817590 14296922 13823859 13414694 13089012
17538 13089012 12813981 12551708 12316573 12120345 12018277 12092440 12460164 13268442 14748431
17529 14748431 17218060 20869956 25573059 30764963 35660994 39783067 43063177 45158342
17521 45158342 45825115 44981832 43303022 42073634 41574283 41629466 41771715 41137721 38903225
$$ packed form
17579A7404654J145396J979614L295352N286994P883178J0538407J2351890J2602434
17571G2487919J1367039R407810O849806L532928k94578l261661l990951k732506
17563I3365806j107441k29978q59725l281859p171904j0844656j2537591j1511505
17555D5821147q955615o219869m089479k764810j957782j467777j144325r53619
17547A8267871q32686p49666o77626o16140n74163n20668m73063m09165l25682
17538A3089012k75031k62273k35135j96228j02068P4163L67724Q08278J479989
17529A4748431K469629L651896M703103N191904M896031M122073L280110K095165
17521D5158342O66773q43283j678810j229388m99351N5183J42249o33994k234496
$$ plain form
17512 38903225 34740281 29128469 23587641 19014689 15766019 13630168 12175292 11132067
17504 11132067 10358701 9779027 9310647 8903162 8552320 8215853 7886389 7572489 7271302
17495 7271302 6960380 6654832 6352922 6087003 5854732 5621582 5368514 5145995 4941074
17486 4941074 4731030 4524377 4322494 4158027 4024962 3905527 3783526 3651421 3533848
17477 3533848 3429631 3325878 3234142 3134767 3047476 2972778 2921570 2869602 2818841 2786279 2773359
17466 2773359 2747009 2724292 2682069 2623731 2558308 2474427 2394516 2315727 2242657 2181530 2143935
17455 2143935 2101633 2087161 2067542 2032081 1984665 1946444 1896199 1829875 1741610 1638658 1548566
17444 1548566 1479596 1430501 1405445 1390863 1375099 1353988 1333971 1305208 1296131 1272960 1249349
$$ packed form
17512C8903225m162944n611812n540828m572952l248670k135851j454876j043225
17504A1132067p73366n79674m68380m07485l50842l36467l29464l13900l01187
17495G271302l10922l05548l01910k65919k32271k33150k53068k22519k04921
17486D941074k10044k06653k01883j64467j33065j19435j22001j32105j17573
17477C533848j04217j03753r1736r9375q7291p4698n1208n1968n0761l2562j2920
17466B773359k6350k2717m2223n8338o5423q3881p9911p8789p3070o1127l7595
17455B143935m2302j4472j9619l5461m7416l8221n0245o6324q8265j02952r0092
17444A548566o8970m9095k5056j4582j5764k1111k0017k8763r077k3171k3611
$$ plain form
17433 1249349 1194331 1144461 1102703 1087676 1057099 1042205 1025198 999937 985148 952302 944497
17422 944497 952226 937593 928769 923551 906929 907217 907416 893155 858041 827843 806115 792648 782781
17409 782781 764468 760527 775374 771349 731547 697425 679854 647257 613507 587102 547512 537852
17397 537852 538624 519430 509091 493183 474554 451378 435407 425023 429830 433977 426702 435166 444706
17384 444706 438315 433608 457053 452871 440430 420989 421062 402234 378852 366396 367150 373961 380198
17371 380198 378999 385651 385459 374759 363928 359920 355215 365205 363435 343154 338276 336077 325442
17358 325442 323612 317066 291828 265733 266333 264906 263416 255412 241582 226219 207713 197493 195275
17345 195275 195385 206148 202315 194145 194114 202085 205217 181597 183044 196446 197008 201421 203547 212395
$$ packed form
17433A249349n5018m9870m1758j5027l0577j4894j7007k5261j4789l2846p805
17422I44497P729j4633q824n218j6622K88J99j4261l5114l0198k1728j3467r867
17409G82781j8313l941J4847m025l9802l4122j7571l2597l3750k6405l9590r660
17397E37852P72j9194j0339j5908j8629k3176j5971j0384M807M147p275Q464R540
17384D44706o391m707K3445m182j2441j9441P3j8828k3382j2456P54O811O237
17371C80198j199O652j92j0700j0831m008m705R990j770k0281m878k199j0635
17358C25442j830o546k5238k6095O00j427j490q004j3830j5363j8506j0220k218
17345A95275J10J0763l833q170l1P971L132k3620J447J3402N62M413K126Q848
$$ plain form
17331 212395 213983 207544 193537 196220 204762 200754 201366 217236 224323 200169 170966 172033 173734
17318 173734 169831 173933 171263 166064 175218 187810 183966 151006 135020 130519 126870 124565 134843
17305 134843 131024 140522 145521 144163 136295 144715 148475 142359 138254 132360 132803 120778 119647 119969
17291 119969 113882 111476 94897 85248 72307 66694 71349 92583 114775 112774 98862 105197 119707
17278 119707 116445 130877 128944 116019 114325 127536 127141 109679 107162 103680 102500 103712 103439 98800
17264 98800 103810 98255 103224 97018 91083 90630 77099 66463 66170 76361 86797 77293 75857 76423
17250 76423 84424 81238 63833 66267 89711 96334 79536 67796 58136 61024 58073 63686 64437 60316
17236 60316 48625 41651 47890 64709 59412 56585 65834 75805 67325 72667 87789 108493 112374
$$ packed form
17331B12395J588o439j4007K683Q542m008O12J5870P087k4154k9203J067J701
17318A73734l903M102k670n199R154J2592l844l2960j5986m501l649k305J0278
17305A34843l819R498M999j358p868Q420L760o116m105n894M43j2025j131L22
17291A19969o087k406j6579r649j2941n613M655K1234K2192k001j3912O335J4510
17278A19707l262J4432j933j2925j694J3211l95j7462k517l482j180J212k73m639
17264I8800N010n555M969o206n935m53j3531j0636k93J0191J0436r504j436N66
17250G6423Q001l186j7405K434K3444O623j6798j1740r660K888k951N613P51m121
17236F0316j1691o974O239J6819n297k827R249R971q480N342J5122K0704L881
$$ plain form
17223 112374 103774 83143 73753 72072 56151 64208 79672 66441 54752 65524 74036 49454
17211 49454 44552 50075 35659 35283 42807 56072 59075 65686 64115 65968 78370 93653 89351 86665
17197 86665 78091 72124 60763 58617 66761 61447 55063 73752 81678 79029 89209 115013 143956
17184 143956 160975 202111 241163 299433 366675 421964 478224 531449 571118 594267 598251 609623
17172 609623 616911 618459 610458 611247 581594 541994 494213 436195 385421 333212 279174 230972
17160 230972 192777 174433 151337 135624 125240 120100 125853 133380 131972 125870 121907 105019 96930
17147 96930 88690 102747 135927 127792 114352 123751 131014 137340 144766 149467 145645 143972 140864 149760
17133 149760 178498 232770 295901 347053 419588 495578 551238 598063 643025 673836 689394
$$ packed form
17223A12374q600k0631r390j681j5921Q057J5464j3231j1689J0772Q512k4582
17211D9454m902N523j4416l76P524J3265L003O611j571J853J2402J5283m302k686
17197H6665q574n967j1361k146Q144n314o384J8689P926k649J0180K5804K8943
17184A43956J7019M1136L9052N8270O7242N5289N6260N3225L9669K3149L984J1372
17172F09623P288J548q001P89k9653l9600m7781n8018n0774n2209n4038m8202
17160B30972l8195j8344k3096j5713j0384n140N753P527j408o102l963j6888q089
17147I6930q240J4057L3180q135j3440R399P263O326P426M701l822j673l108Q896
17133A49760K8738N4272O3131N1152P2535P5990N5660M6825M4962L0811J5558
$$ plain form
17122 689394 692893 684061 669883 662167 654640 642080 594643 547459 490799 450122 417257 393927
17110 393927 392669 399772 415269 415229 425458 431270 424658 417171 402626 397168 393746 379508 366572
17097 366572 349094 301643 267859 233154 212241 190902 165975 149834 133726 126244 119735 128411
17085 128411 129684 104901 101546 124794 146419 155381 162500 176302 185025 191945 213114 218363 225418
17072 225418 221213 216660 236645 239349 236271 250461 279393 317501 366327 428533 495379 543444
17060 543444 569331 586462 596442 582117 575573 561347 543337 525219 516480 516106 483840 430194
17048 430194 365248 312703 264082 205122 177792 149968 130428 132881 124934 117976 118022 109285 114354
17035 114354 139056 138559 123847 112809 101302 95269 99900 108262 111041 105197 109431 110388 113932 120115
$$ packed form
17122F89394L499q832j4178p716p527j2560m7437m7184n6660m0677l2865k3330
17110C93927j258P103J5497m0J0229N812o612p487j4545n458l422j4238j2936
17097C66572j7478m7451l3784l4705k0913k1339k4927j6141j6108p482o509Q676
17085A28411J273k4783l355K3248K1625Q962P119J3802Q723O920K1169N249P055
17072B25418m205m553J9985K704l078J4190K8932L8108M8826O2206O6846M8065
17060E43444K5887J7131R980j4325o544j4226j8010j8118q739l74l2266n3646
17048D30194o4946n2545m8621n8960k7330k7824j9540K453p947o958M6q737N069
17035A14354K4702m97j4712j1038j1507o033M631Q362K779n844M234R57L544O183
$$ plain form
17021 120115 131645 135375 153272 177870 203370 214521 227713 257085 268324 286134 297274 298542
17009 298542 304355 306604 297465 298150 295431 284743 264673 235065 186150 160513 145377 116092 87295
16996 87295 67460 65399 87207 91178 85096 73287 57716 52272 78475 80114 54706 49960 58913
16983 58913 59360 48368 30426 12322 7197 173 14244 36742 63344 52040 42705 45052 52908
16970 52908 62844 62937 51627 46685 50147 44323 28767 26519 16491 32935 42490 59689 63317 71808
16956 71808 86094 70989 63473 63202 59438 38503 29574 24076 26555 23373 19596 24272 24777 21337
16942 21337 15444 8063 11847 11693 12252 24012 32575 20111 28350 43261 27011 20452 24015 9384
16928 9384 -2418 9730 589 -10335 8024 7286 654 11337 33491 26989 20646 19162 21024
$$ packed form
17021A20115J1530L730J7897K4598K5500J1151J3192K9372J1239J7810J1140J268
17009B98542N813K249r139O85k719j0688k0070k9608m8915k5637j5136k9285k8797
16996H7295j9835k061K1808L971o082j1809j5571n444K6203J639k5408m746Q953
16983E8913M47j0992j7942j8104n125p024J4071K2498K6602j1304r335K347P856
16970E2908R936R3j1310m942L462n824j5556k248j0028J6444R555J7199L628Q491
16956G1808J4286j5105p516k71l764k0935q929n498K479l182l777M676N05l440
16942B1337n893p381L784j54N59J1760Q563j2464Q239J4911j6250o559L563j4631
16928I384j1802J2148r141j0924J8359p38o632J0683K2154o502o343j484J862
$$ plain form
16915 21024 26065 37178 54744 34589 20307 7018 -124 -5738 9124 13635 27951 37810 32473
16902 32473 22016 28865 40169 45117 48135 33526 19745 2848 17681 43374 44968 31118
16890 31118 38140 24072 1291 2487 17511 48926 41236 7335 -2463 6066 9251 5926 -6905
16877 -6905 -5038 808 13334 36152 38679 38955 40665 44685 53384 54681 73710 84285 79536 66137
16863 66137 71331 75712 68746 55976 53175 47444 50767 42696 43700 56772 49909 57547 70357 69987
16849 69987 59527 38968 38633 25657 10338 -12847 -2943 23779 48121 59346 57565 56393 50541
16836 50541 24527 6883 18734 36350 51411 38424 35404 35776 37488 30578 38617 40417 46213
16823 46213 46187 42649 47254 44927 49657 47542 44206 36932 38238 34131 28472 23889 17542 24284 36572
$$ packed form
16915B1024N041J1113J7566k0155j4282j3289p142n614J4862M511J4316R859n337
16902C2473j0457O849J1304M948L018j4609j3781j6897J4833K5693J594j3850
16890C1118P022j4068k2781J196J5024L1415p690l3901r798Q529L185l325j2831
16877f905J867N846J2526K2818K527K76J710M020Q699J297J9029J0575m749j3399
16863F6137N194M381o966j2770k801n731L323q071J004J3072o863P638J2810l70
16849F9987j0460k0559l35j2976j5319k3185R904K6722K4342J1225j781j172n852
16836E0541k6014j7644J1851J7616J5061j2987l020L72J712o910Q039J800N796
16823D6213k6l538M605k327M730k115l336p274J306m107n659m583o347O742J2288
$$ plain form
16808 36572 51787 41188 31285 17214 14334 11306 12223 16657 17015 104 -3055 -12203 -4237 14083
16794 14083 21899 20704 22949 20971 10507 19137 21109 16593 10844 6923 -10643 -4704 10745 10279
16780 10279 1181 1572 -17224 -26539 -25160 -4208 5950 -4572 -18846 -13424 -7083 3510 -7956
16767 -7956 -12798 -2846 5183 -6910 -13479 -6943 -384 11375 4186 -10760 -14979 -2392 -3427 -7464
16753 -7464 -4149 -7207 -2356 -16629 -46468 -46685 -19876 -492 7234 7401 9159 -2184 -10361 -15636
16739 -15636 -19853 -24470 1572 -4028 -2034 -6034 -2029 -377 -2755 -1401 1847 -1800 2556 25327
16725 25327 18439 4965 -7245 7900 21160 15919 1367 -16109 -14489 -8503 -3951 -15744 -8418
16712 -8418 -4111 -10400 -27996 -24574 -9819 -8659 -8939 -1632 7204 5557 2360 -4607 -25536 -20185
$$ packed form
16808C6572J5215j0599r903j4071k880l028R17M434L58j6911l159r148P966J8320
16794A4083P816j195K245j978j0464Q630J972m516n749l921j7566N939J5449m66
16780A0279r098L91j8796r315J379K0952J0158j0522j4274N422O341J0593j1466
16767g956m842R952Q029j2093o569O536O559J1759p189j4946m219J2587j035m037
16753g464L315l058M851j4273k9839k17K6809J9384P726J67J758j1343q177n275
16739a5636m217m617K6042n600J994m000M005J652k378J354L248l647M356K2771
16725B5327o888j3474j2210J5145J3260n241j4552j7476J620N986M552j1793P326
16712h418M307o289j7596L422J4755J160k80P307Q836j647l197o967k0929N351
$$ plain form
16698 -20185 -7327 -8803 -16516 -6513 -845 -4576 -16894 -25821 -30369 -25033 -20153 -2644 -2697 -6047
16684 -6047 3443 12038 13751 10589 -3717 -4007 -14726 -16746 -5885 -7823 -12914 -21192 -27961 -7066
16670 -7066 12753 23678 13171 -4845 -2003 -1661 -9391 -3252 9171 -5103 -1037 -2701 320
16657 320 4355 7832 9032 6420 6260 3765 -4231 -6736 -9967 -2304 22582 9561 6535 7793 16589
16642 16589 35110 44339 23856 10739 15722 6946 -2917 2835 22370 8812 -11637 -20031 -9886
16629 -9886 -422 -4170 6414 2561 -5328 -9023 -15026 882 4784 4897 20396 37163 52830 65167
16615 65167 55363 53882 65293 66679 76432 87853 79280 75826 64359 57517 58760 64771 49021
16602 49021 42427 39133 28623 16739 11265 28393 41410 40705 27798 37516 32806 33499 20555
$$ packed form
16698b0185J2858j476p713J0003N668l731j2318q927m548N336M880J7509n3l350
16684f047R490Q595J713l162j4306k90j0719k020J0861j938n091q278o769K0895
16670g066J9819J0925j0507j8016K842L42p730O139J2423j4274M066j664L021
16657C20M035L477J200k612j60k495p996k505l231P663K4886j3021l026J258Q796
16642A6589J8521R229k0483j3117M983q776r863N752J9535j3558k0449q394J0145
16629i886R464l748J0584l853p889l695o003J5908L902J13J5499J6767J5667J2337
16615F5167r804j481J1411J386R753J1421q573l454j1467o842J243O011j5750
16602D9021o594l294j0510j1884n474J7128J3017p05j2907R718m710O93j2944
$$ plain form
16589 20555 27883 22968 10027 13063 20258 16208 31900 36654 49584 51005 58259 74294 55565
16576 55565 32972 38887 36101 5895 6122 4280 55 -5061 -6014 -7007 5035 -5260 -25087 -49118
16562 -49118 -44871 -32549 -37945 -27706 -39839 -55301 -39881 -24527 -19399 -24256 -42803 -38103 -32015
16549 -32015 -6751 10727 10968 3721 5736 4670 532 1105 -5237 -5982 14068 18696 14145 8613
16535 8613 15959 14261 11911 15689 13825 8637 3309 16812 20355 15255 15909 14505 27283 22739
16521 22739 18325 24878 32146 30972 46853 58442 77863 72363 51453 40023 46902 48155 36639
16508 36639 41536 26088 2100 -2627 3245 -539 3489 26856 20384 -13129 -29482 -24814 -26196
16495 -26196 -19187 -13439 -21766 -5216 4750 5557 13673 10961 3133 12208 13262 -181 2206 4063
$$ packed form
16589B0555P328m915j2941L036P195m050J5692M754J2930J421P254J6035j8729
16576E5565k2593N915k786l0206K27j842m225n116r53r93J2042j0295j9827k4031
16562d9118M247J2322n396J0239j2133j5462J5420J5354N128m857j8547M700O088
16549c2015K5264J7478K41p247K015j066m138N73o342p45K0050M628m551n532
16535H613P346j698k350L778j864n188n328J3503L543n100O54j404J2778m544
16521B2739m414O553P268j174J5881J1589J9421n500k0910j1430O879J253j1516
16508C6639M897j5448k3988m727N872l784M028K3367o472l3513j6353M668j382
16495b6196P009N748q327J6550R966Q07Q116k712p828R075J054j3443K387J857
$$ plain form
16481 4063 875 -552 8677 10495 -14476 -21953 -23256 -15356 -12454 -12487 -12516 -19633 -28068 -31620 -21856
16466 -21856 -15107 -13539 -5415 -12450 -31918 -16383 -744 -13623 -19411 -22166 -14000 -7816 -5956
16453 -5956 -4746 5823 8131 2548 -6175 -2984 -2725 3126 -4308 8756 18402 11527 16962 20727
16439 20727 2433 6765 30358 18021 19300 21232 -1802 -18548 -13598 -16393 -5424 -8124 -28392
16426 -28392 -19305 -3968 6664 -7028 -18645 -28348 -26231 -27055 -31474 -30258 -20238 -26070 -21522
16413 -21522 2337 10603 2330 -13212 -12723 7537 1926 3353 -884 -22739 -16665 -6467 -5972 -3542
16399 -3542 -2443 19782 15573 15171 35425 30826 29860 39504 33309 25319 9349 -2962 11020 20461
16385 20461 14217 2833 -16399 -4878 -13516 -8143 -1324 8660 18514 23798 17106 10263 -11532
$$ packed form
16481D063l188j427R229J818k4971p477j303P900K902l3k9p117q435l552R764
16466b1856O749J568Q124p035j9468J5535J5639j2879n788k755Q166O184J860
16453e956J210J0569K308n583q723L191K59N851p434J3064R646o875N435L765
16439B0727j8294M332K3593j2337J279J932k3034j6746M950k795J0969k700k0268
16426b8392R087J5337J0632j3692j1617r703K117q24m419J216J0020n832M548
16413b1522K3859Q266q273j5542M89K0260n611J427m237k1855O074J0198M95K430
16399c542J099K2225m209m02K0254m599r66R644o195p990j5970j2311J3982R441
16385B0461o244j1384j9232J1521q638N373O819R984R854N284o692o843k1795
$$ plain form
16372 -11532 -14219 -13884 -17391 2148 5352 -4608 -13472 -32416 -39041 -29942 -17052 -23972 -35656 -36559
16358 -36559 -37607 -39311 -48309 -52890 -30064 -10353 -7724 -9864 7240 19187 21902 7154 11140
16345 11140 7317 -2135 -21289 -26081 -11325 -3479 -17498 -30071 -17023 764 -21052 -22885 -6569
16332 -6569 -10805 -31957 -20924 -21715 -32855 -22914 -16507 -12575 -3920 -5785 -7420 -14801 -23496 -36264
16318 -36264 -42253 -41690 -37731 -36190 -18437 -14828 1025 323 2277 12097 4422 -1205 5806 15134
16304 15134 16153 15073 16822 19715 20716 3647 -11929 -19074 -36252 -48896 -43856 -16070 -11939
16291 -11939 -15407 -11249 -9628 -18245 -32784 -30514 -27542 -12936 -4264 -509 5048 -11528 2122
16278 2122 16800 7287 -2765 -1484 75 507 -7182 -18726 -19262 -3941 4125 5297 -8787 -8723
$$ packed form
16372a1532k687L35l507J9539L204r960q864j8944o625R099J2890o920j1684r03
16358c6559j048j704q998m581K2826J9711K629k140J7104J1947K715j4748L986
16345A1140l823r452j9154m792J4756P846j4019j2573J3048J7787k1816j833J6316
16332f569m236k1152J1033p91j1140R941O407L932Q655j865j635p381q695j2768
16318c6264n989N63L959J541J7753L609J5853p02J954R820p675n627P011R328
16304A5134J019j080J749K893J001j7069j5576p145j7178j2644N040K7786M131
16291a1939l468M158J621q617j4539K270K972J4606Q672L755N557j6576J3650
16278B122J4678r513j0052J281J559M32p689j1544n36J5321Q066J172j4084O4
$$ plain form
16264 -8723 -876 -13934 -27701 -4156 -18663 -34173 -13466 9487 640 -5971 -6314 3119 10331
16251 10331 -12133 -8865 -837 4790 -15624 -23935 -26056 -28811 -21498 -19127 -22734 -7569 -5446 -13221
16237 -13221 -9977 -8504 -4263 -11448 -28650 -14816 8259 20593 -7767 -32071 -27139 -23302 -17595
16224 -17595 -20234 -26730 -31898 -42979 -48376 -49751 -49359 -40031 -32100 -25407 -21703 -20930 -22657 -27673 -39212
16209 -39212 -40948 -48808 -49260 -37302 -10829 -1117 1180 -1335 4303 -18264 -44365 -33915 -30977
16196 -30977 -20827 -21696 -32241 -18372 -19448 -17281 -19416 -18563 -16647 -20557 -18952 -8090 -15144 -20147
16182 -20147 -4589 -398 -9546 -24215 -19508 -2312 -24400 -40141 -31473 -20855 -27152 -30224 -24054
16169 -24054 -21404 -22284 -35973 -41340 -52609 -46939 -45640 -33821 -17558 -19432 2463 22062 25849
$$ packed form
16264h723P847j3058j3767K3545j4507j5510K0707K2953q847o611l43R433P212
16251A0331k2464L268Q028N627k0414q311k121k755P313K371l607J5165K123p775
16237a3221L244J473M241p185j7202J3834K3075J2334k8360k4304M932L837N707
16224a7595k639o496n168j1081n397j375L92R328P931O693L704P73j727n016j1539
16209c9212j736p860m52J1958K6473R712K297k515N638k2567k6101J0450K938
16196c0977J0150q69j0545J3869j076K167k135Q53J916l910J605J0862p054n003
16182b0147J5558M191r148j4669M707J7196k2088j5741Q668J0618o297l072O170
16169b4054K650q80j3689n367j1269N670J299J1819J6263j874K1895J9599L787
$$ plain form
16156 25849 11517 6829 2519 3516 5768 4240 2928 1852 -6444 -18959 -20378 -34566 -26929 -24427
16142 -24427 -38232 -13988 4571 7681 7556 13200 20091 11281 6996 6582 5026 -5518 -6362 -7827
16128 -7827 -1569 -7182 3546 10183 20368 12487 -2666 -14277 -19801 -16934 -11404 -10168 -4504 -6138
16114 -6138 -3072 15291 8082 12079 15130 8622 2438 3015 -2675 12503 28815 25166 9295 1074
16100 1074 -3757 -14833 -9957 -4057 -1428 8647 6896 -23859 -36656 -25396 -17068 -12823 -9446
16087 -9446 2543 16618 14838 19411 20674 8631 9507 19957 18273 24350 16694 -6077 -6773 407
16073 407 -2985 -8220 -6407 -12115 -26812 -22932 -12633 -22586 -28586 -35215 -36037 -30068 -35262 -38295 -37689
16058 -37689 -22396 -25698 -24755 -18099 -22120 -21917 -34360 -32960 -20535 -22329 -19771 1008 1387 -90
$$ packed form
16156B5849j4332m688m310R97K252j528j312j076q296j2515j419j4188P637K502
16142b4427j3805K4244J8559L110j25N644O891q810m285m14j556j0544q44j465
16128g827O258n613J0728O637J0185p881j5153j1611n524K867N530J236N664j634
16114f138L066J8363p209L997L051o508o184N77n690J5178J6312l649j5871q221
16100A074m831j1076M876N900K629J0075j751l0755j2797J1260Q328M245L377
16087i446J1989J4075j780M573J263j2043Q76J0450j684O077p656k2771o96P180
16073D07l392n235J813n708j4697L880J0299r953o000o629q22N969n194l033O06
16058c7689J5293l302R43O656m021K03j2443J400J2425j794K558K0779L79j477
$$ plain form
16044 -90 6910 14780 -899 -15233 -13550 -4655 -8520 -20056 -37448 -39553 -37313 -25059 -20726 -3415
16030 -3415 1437 -3786 -7333 -4592 -6201 -9487 -13149 -5583 726 19099 18558 12871 -4893 -13829
16016 -13829 -4294 2234 5707 -8477 -11686 -3961 -14383 -17916 -26530 -30343 -35457 -31586 -14858 -13854
16002 -13854 -25135 -46488 -39916 -20039 -7276 8081 12869 -4934 -25272 -26120 -42226 -50121 -57784
15989 -57784 -45761 -19524 -14995 -1549 -7193 -3705 -3179 -16572 -13098 2204 2338 -5180 -7665 15382
15975 15382 19774 19240 14365 6303 1601 10914 2257 4446 -10551 -31083 -13552 -6339 2441 18352
15961 18352 1908 -927 5462 -10468 -7205 1899 1204 -13926 -18301 -9316 -14966 -13617 -16448 -24333
15947 -24333 -23867 -19903 -20983 -9704 -5702 -14689 -16667 -20874 -13443 -8925 -28527 -34924 -24969 -7043
$$ packed form
16044i0P000P870j5679j4334J683Q895l865j1536j7392k105K240J2254M333J7311
16030c415M852n223l547K741j609l286l662P566O309J8373n41n687j7764q936
16016a3829R535O528L473j4184l209P725j0422l533q614l813n114L871J6728J004
16002a3854j1281k1353O572J9877J2763J5357M788j7803k0338q48j6106p895p663
15989e7784J2023K6237M529J3446n644L488N26j3393L474J5302J34p518k485K3047
15975A5382M392n34m875q062m702R313q657K189j4997k0532J7531P213Q780J5911
15961A8352j6444k835O389j5930L263R104o95j5130m375Q985n650J349k831p885
15947b4333M66L964j080J1279M002q987j978m207P431M518j9602o397R955J7926
$$ plain form
15933 -7043 -13125 -8918 361 -5599 -10017 -15789 -20407 -26445 -26402 -26516 -21093 -27912 -36886 -37807 -33090 -26866
15917 -26866 2177 191 -2084 3653 8553 -4022 -22784 -26793 -33391 -31312 -21156 -35548 -39349
15904 -39349 -30228 -21771 -29139 -17213 -4223 275 7169 1177 -1751 419 -5524 -1898 -18893 -42394
15890 -42394 -67829 -62230 -58857 -57721 -50759 -33980 -24952 -7873 22337 47908 76651 85678 80273
15877 80273 66617 68960 71969 38748 17576 4966 -21093 -36711 -32227 -46250 -59835 -51183
15865 -51183 -34180 -17056 -27838 -14935 -18392 -9663 -6596 -5300 -16201 -16439 -11329 -23598 -23701
15852 -23701 -25180 -33293 -23797 -16847 -19158 -11881 -8430 -7986 -28529 -41526 -37989 -19950 -16060 -31000
15838 -31000 -47550 -33493 -21201 -36175 -29506 -13133 -12423 -13089 -2828 -2552 10 -14234 -26470
$$ packed form
15933g043o082M207R279n960m418n772m618o038M3j14N423o819q974r21M717O224
15917b6866K9043j986k275N737M900j2575j8762m009o598K079J0156j4392l801
15904c9349R121Q457p368J1926J2990M498O894n992k928K170n943L626j6995k3501
15890d2394k5435N599L373J136O962J6779R028J7079L0210K5571K8743R027n405
15877H0273j3656K343L009l3221k1172j2610k6059j5618M484j4023j3585Q652
15865e1183J7003J7124j0782J2903l457Q729L067J296j0901k38N110j2269j03
15852b3701j479q113R496O950k311P277L451M44k0543j2997L537J8039L890j4940
15838c1000j6550J4057J2292j4974O669J6373P10o66J0261K76K562j4244j2236
$$ plain form
15825 -26470 -26919 -29862 -23114 -19250 -25804 -32911 -24821 -15019 -18227 -39960 -49082 -41176 -18817 -11550
15811 -11550 -21253 -20519 -8071 -3653 5083 453 -3237 -4850 -9657 -15141 -17762 -37422 -33959 -37969
15797 -37969 -25868 -2688 -17361 -30205 -11231 -11208 -20255 -9192 -1334 -1787 -8959 -26661 -29129
15784 -29129 -25577 -31806 -23074 -12624 -4938 295 2040 -1353 -8241 8227 8623 -2338 -6895 -18729
15770 -18729 -23084 -16804 -5334 -2202 -17539 -47196 -54793 -26202 -14996 -12876 -10722 -26187 -34953
15757 -34953 -35451 -44290 -51295 -31063 -43692 -30656 -12067 3957 12716 -1041 6100 19829 12669
15744 12669 -3446 -7999 -26933 -28540 -30991 -21491 11154 21801 13278 16372 7274 12736 4065
15731 4065 -12243 -14099 -7781 -5606 -22851 -25119 -31853 -23561 -11557 -16528 -19365 -12925 -8004 -6376
$$ packed form
15825b6470m49k943O748L864o554p107Q090R802l208k1733r122P906K2359P267
15811a1550r703P34J2448M418Q736m630l690j613m807n484k621j9660L463m010
15797c7969J2101K3180j4673j2844J8974K3r047J1063P858m53p172j7702k468
15784b9129L552o229Q732J0450P686N233J745l393o888J6468L96j0961m557j1834
15770a8729m355O280J1470L132j5337k9657p597K8591J1206K120K154j5465q766
15757c4953m98q839p005K0232j2629J3036J8589J6024Q759j3757P141J3729p160
15744A2669j6115m553j8934j607k451R500L2645J0647q523L094r098N462q671
15731D065j6308j856O318K175j7245k268o734Q292J2004m971k837O440M921J628
$$ plain form
15717 -6376 -17969 -14282 -4416 -13193 -15702 -12339 -2539 -241 -20322 -23942 -5697 -15977 -25691 -20036
15703 -20036 -23219 -18195 -9771 10990 21368 10748 3645 12915 19426 13948 -3840 556 -6720
15690 -6720 -24155 -17568 -8140 -15424 -15512 -6993 -8152 -11550 -649 1010 2233 -4626 1237 17877
15676 17877 26936 25102 24535 18240 278 -9217 -8214 -3686 -45 9400 5579 -7733 -8639 -16011
15662 -16011 -15283 -9476 -7199 -10657 -15456 -8488 343 -2023 2938 2413 -1824 -14016 -6041 -7976 -22211
15647 -22211 -33144 -24127 -17854 -27886 -20193 -13186 -22482 -19681 -22396 -23846 -30335 -26396 -10286 303
15633 303 14 -9332 -18710 -26836 -29694 -9856 -2321 -13549 -29726 -37810 -31007 -25538 -27904 -30374
15619 -30374 -29413 -26730 -23724 -35733 -29437 2316 10215 -9475 -8231 -6953 -13144 -8058 -33 1668
$$ packed form
15717f376j1593L687R866q777k509L363R800K298k0081l620J8245j0280r714N655
15703b0036l183N024Q424K0761J0378j0620p103R270O511n478j7788M396p276
15690f720j7435O587R428p284q8Q519j159l398J0901J659J223o859N863J6640
15676A7877R059j834n67o295j7962r495J003M528L641R445l821j3312r06p372
15662a6011P28N807K277l458m799O968Q831k366M961n25m237j2192P975j935j4235
15647b2211j0933R017O273j0032P693P007r296K801k715j450o489L939J6110J0589
15633C03k89r346r378q126k858J9838P535j1228j6177q084O803N469k366k470
15619c0374R61K683L006j2009O296L1753P899j9690J244J278o191N086Q025J701
$$ plain form
15605 1668 -2803 -8381 -13707 -37187 -49181 -32506 -22240 -29353 -33117 -21232 -11692 -15984 -19772
15592 -19772 -28845 -32455 -19133 -7861 -15603 -30376 -13830 -7991 -3423 1404 -10441 -14882 -22938
15579 -22938 -30447 -34305 -30301 -22563 -11533 -13046 -4401 17240 15868 1256 -11425 -23315 -25278
15566 -25278 -22399 -20781 -19849 -14420 -17123 -28698 -39814 -33010 -35987 -37765 -38417 -37829 -43040 -47864 -33736
15551 -33736 -14861 -21537 -23813 -25290 -20892 -25119 -26821 -26395 -9166 -15551 -18286 -11993 -2355 1441
15537 1441 -7207 -26923 -46052 -41648 -21753 -21428 -23729 -27722 -28235 -25052 -20918 -25234 -15820 -8027
15523 -8027 -11875 -20736 -30780 -35172 -23740 -15978 -7095 9307 13549 -2964 -15614 -30515 -39781
15510 -39781 -40228 -34459 -39832 -36042 -30137 -26036 -10759 2593 5496 4781 6262 -2041 -16694 -16300
$$ packed form
15605A668m471n578n326k3480j1994J6675J0266p113l764J1885R540m292l788
15592a9772r073l610J3322J1272p742j4773J6546N839M568M827j1845m441q056
15579b2938p509l858M004P738J1030j513Q645K1641j372j4612j2681j1890j963
15566b5278K879J618R32N429k703j1575j1116O804k977j778o52N88n211m824J4128
15551c3736J8875o676k276j477M398m227j702M26J7229o385k735O293R638L796
15537A441q648j9716j9129M404J9895L25k301l993n13L183M134m316R414P793
15523h027l848q861j0044m392J1432P762Q883J6402M242j6513j2650j4901r266
15510c9781m47N769n373L790N905M101J5277J3352K903p15J481q303j4653L94
$$ plain form
15496 -16300 -6305 -120 17750 25286 -1319 -21217 -34828 -34703 -22598 -11563 -15419 -15718 -9603
15483 -9603 -10471 -9065 -10729 -27391 -24978 -16842 -19383 -9881 -11596 -31381 -34698 -25181 -9481 -23453
15469 -23453 -29125 -40776 -28101 -14345 -22041 -38227 -56996 -61390 -39611 -37370 -34277 -35141 -22986
15456 -22986 -22994 -25753 -22964 -22504 -25061 -20730 -13100 -12928 -15748 -25598 -20898 -17568 -26662 -27088 -9239 -13459
15440 -13459 -21969 -16327 -10095 -12603 -9994 -15783 -25363 -20266 -10565 -2492 -1190 1193 -8378 -6672
15426 -6672 -9970 -11455 -12886 -19063 -26948 -9138 -1236 -7075 -16872 -10447 -17225 -26267 -34170 -53330
15412 -53330 -61852 -51433 -42925 -41529 -42129 -37241 -44567 -48268 -46902 -38239 -36888 -33838 -23741 -24288
15398 -24288 -16002 -23534 -34388 -11726 -1681 6994 649 1216 -7567 -22201 -20820 -11314 -641
$$ packed form
15496a6300R995O185J7870P536k6605j9898j3611J25J2105J1035l856k99O115
15483i603q68J406j664j6662K413Q136k541R502j715j9785l317R517J5700j3972
15469b3453n672j1651J2675J3756p696j6186j8769m394K1779K241L093q64J2155
15456b2986qk759K789M60k557M331P630J72k820r850M700L330r094m26J7849m220
15440a3459q510N642O232k508K609n789r580N097R701Q073J302K383r571J706
15426f672l298j485j431o177p885J7810P902n839r797O425o778r042p903j9160
15412e3330q522J0419Q508J396o00M888p326l701J366Q663J351L050J0097n47
15398b4288Q286p532j0854K2662J0045Q675o345N67q783j4634J381R506J0673
$$ plain form
15385 -641 5420 -8660 -3268 11589 2141 -7784 -9446 -8512 -13809 -11710 -6462 -8918 -11460 -13426 -8041
15370 -8041 7276 -119 -20412 -29254 -30633 -26153 -33708 -34778 -19236 -628 -2428 -18242 -16722
15357 -16722 -12309 -6325 4598 -4085 4313 8347 -903 3552 8759 14869 2783 1007 80 -2759
15343 -2759 -3542 -18505 -12474 -13262 -8603 -20555 -24757 -19844 -29812 -28579 -21799 -18284 -15777 -20990 -23549
15328 -23549 -40015 -44107 -24250 -15061 -26144 -26650 -26153 -36186 -43400 -42109 -42619 -13074 -13722 -19315
15314 -19315 -31045 -37266 -27567 -33557 -45076 -48574 -28720 -11399 -17983 -28570 -21099 -7308 -2060
15301 -2060 -2648 -9406 -13417 -27056 -40225 -35739 -20708 -1364 1235 -15620 -13980 3079 15616
15288 15616 26665 15234 2247 -9066 -10048 -31596 -35145 -24160 -15794 -9650 24986 11789 -5722
$$ packed form
15385f41O061j4080N392J4857r448r925j662R34n297K099N248k456k542j966N385
15370h041J5317p395k0293q842j379M480p555j070J5542J8608j800j5814J520
15357a6722M413N984J0923q683Q398M034r250M455N207O110j2086j776r27k839
15343b759p83j4963O031p88M659j1952m202M913r968J233O780L515K507n213k559
15328b3549j6466m092J9857R189j1083n06M97j0033p214J291n10K9545o48n593
15314a9315j1730o221R699n990j1519l498J9854J7321o584j0587P471J3791N248
15301b060n88o758m011j3639j3169M486J5031J9344K599j6855J640J7059J2537
15288A5616J1049j1431j2987j1313r82k1548l549J0985Q366O144L4636j3197j7511
$$ plain form
15275 -5722 -2953 12360 21112 21429 930 -20853 -23181 -17000 -20002 -12047 -6482 -12317 -29811 -30592
15261 -30592 -36434 -38914 -43364 -25351 -2727 6638 11512 1841 -13984 -18533 -19147 -20662 -22253 -12896
15247 -12896 -32539 -41364 -22776 -31208 -46921 -55326 -48858 -52122 -57371 -50712 -43115 -43409 -47266 -31984
15233 -31984 -25600 -32220 -33549 -38799 -44975 -35850 -22240 -26987 -36528 -37215 -32770 -35512 -25809 -16193
15219 -16193 -4180 -17239 -20913 -17376 -385 -1553 -11688 -19184 -39958 -24603 -12228 -14113 -6533
15206 -6533 15665 21480 20079 27373 29558 19286 6496 14042 21850 13149 10214 6681 9714 5485
15192 5485 -12852 -9588 -28037 -36860 -22500 -25133 -32491 -34737 -17859 -6399 -5799 -89 -1276 -4673
15178 -4673 -14390 -28404 -21758 -8463 -16791 -16881 -17758 -33811 -30958 -20515 -22896 -11435 -16386 -34969
$$ packed form
15275e722K769J5313Q752L17k0499k1783k328O181l002P955N565n835j7494p81
15261c0592n842k480m450J8013K2624R365M874r671j5825m549o14j515j591R357
15247a2896j9643q825J8588q432j5713q405O468l264n249O659P597k94l857J5282
15233c1984O384o620j329n250o176R125J3610m747r541o87M445k742R703R616
15219a6193J2013j3059l674L537J6991j168j0135p496k0774J5355J2375j885P580
15206f533K2198N815j401P294K185j0272j2790P546P808q701k935l533L033m229
15192E485j8337L264j8449q823J4360k633p358k246J6878J1460O00N710j187l397
15178d673r717j4014O646J3295q328r0q77j6053K853J0443k381J1461m951j8583
$$ plain form
15164 -34969 -41629 -26434 -14371 -32889 -32571 -35714 -40573 -39620 -34412 -32964 -31451 -25847 -20321 -17661
15150 -17661 -12415 -4151 3982 3741 -6918 -8015 -22152 -26874 -34770 -42022 -53818 -65601 -48141
15137 -48141 -28897 -14381 -28287 -26345 -13444 -12652 -3722 -5835 -335 -1149 -18107 -30392 -39348
15124 -39348 -20077 -12725 -9847 -13006 -9617 -4742 -19453 -28951 -19662 -20310 -30783 -47470 -59922
15111 -59922 -70556 -52574 -28633 -15509 -6504 1304 -2230 -12728 -2942 -21136 -42853 -33537 -14942
15098 -14942 -16243 -31297 -36164 -29279 -25765 -27478 -27670 -18781 -4216 -6352 -29569 -28155 -8368 11838
15084 11838 18189 8878 -6530 -15102 -9704 -12091 -11734 -23690 -25547 -32478 -35883 -27581 -14643 -14275
15070 -14275 -12236 -9298 -5021 8588 8099 3503 3598 -1955 -8394 -6257 -15307 -11456 -5533 -12909 -13411
$$ packed form
15164c4969o660J5195J2063j8518L18l143m859R53N208J448J513N604N526K660
15150a7661N246Q264Q133k41j0659j097j4137m722p896p252j1796j1783J7460
15137d8141J9244J4516j3906J942J2901P92Q930k113N500q14j6958j2285q956
15124c9348J9271P352K878l159L389M875j4711r498R289o48j0473j6687j2452
15111e9922j0634J7982K3941J3124R005P808l534j0498R786j8194k1717R316J8595
15098a4942j301j5054m867O885L514j713j92Q889J4565k136k3217J414J9787K0206
15084A1838O351r311j5408q572N398k387L57j1956j857o931l405Q302J2938L68
15070a4275K039K938M277J3609m89m596R5n553o439K137r050L851N923p376n02
$$ plain form
15055 -13411 -21427 -23907 -20245 -13195 793 1483 -2803 -8484 -10877 -6916 -1512 3292 8769 7119
15041 7119 -13732 -16647 -8839 -4298 -4474 -8095 -17301 -36405 -48051 -36735 -16592 -14614 -5669 -5521
15027 -5521 -5283 5312 18469 25040 19780 1819 -8919 -17515 -22998 -24007 -20713 -15309 -9838 -12503
15013 -12503 837 15043 -2220 -19868 -10561 -5735 -11577 -7 11851 17264 11337 9889 1085
15000 1085 -9537 -12921 -24284 -28406 -23349 -15639 -24973 -20419 -21528 -28892 -32663 -27512 -33051 -32711
14986 -32711 -24132 -23049 -27302 -15948 -7346 4912 -10710 -16630 -21914 -22653 -7145 551 -6388 -19034
14972 -19034 -32237 -29699 -30847 -31940 -15794 5666 9681 16326 14508 9389 -3556 -14002 -27805
14959 -27805 -15216 -14353 -15177 -12437 -28356 -46177 -37055 -36178 -34150 -46807 -47299 -50272 -63951 -67579
$$ packed form
15055a3411q016k480L662P050J3988O90m286n681k393L961N404M804N477j650
15041G119k0851k915P808M541j76l621r206j9104j1646J1316K0143J978Q945J48
15027e521K38J0595J3157O571n260j7961j0738q596n483j009L294N404N471k665
15013a2503J3340J4206j7263j7648R307M826n842J1570J1858N413n927j448q804
15000A085j0622l384j1363m122N057P710r334M554j109p364l771N151n539L40
14986c2711Q579J083m253J1354Q602J2258j5622n920n284p39J5508P696o939j2646
14972a9034j3203K538j148j093J6146K1460M015O645j818n119j2945j0446j3803
14959b7805J2589Q63q24K740j5919j7821R122Q77K028j2657m92k973j3679l628
$$ plain form
14945 -67579 -44596 -19702 -30300 -29915 111 8904 -11262 -8501 -39368 -57643 -38642 -25693
14933 -25693 -17803 -32748 -30073 -19972 -4502 -6404 -24601 -20632 -20591 -16353 -13924 -391 10719
14920 10719 -7770 -35736 -29191 -23826 -40500 -41107 -32925 -24983 -24108 -8059 2841 -4281 -8828 -10391
14906 -10391 -5415 -6114 -15686 -25911 -28114 -21434 -19743 -15660 -11552 -22147 -29435 -15755 3610 5685
14892 5685 -2 -5135 -15478 -29662 -21006 -1148 -12148 -19706 -13591 -18410 -18313 -9150 -18345 -24061
14878 -24061 -22800 -33277 -40023 -41847 -38549 -26266 -14373 5469 6029 -9446 -28982 -31144 -21029
14865 -21029 -9631 -6647 -32836 -39453 -25078 -17459 -10160 2693 2893 -15776 -25372 -33935 -41119
14852 -41119 -38127 -43215 -27266 -2763 1955 -4314 9858 10077 16071 24117 12854 -779 -10778
$$ packed form
14945f7579K2983K4894j0598L85L0026Q793k0166K761l0867j8275J9001J2949
14933b5693P890j4945K675J0101J5470j902j8197L969M1M238K429J3533J1110
14920A0719j8489k7966O545N365j6674o07Q182P942Q75J6049J0900p122m547j563
14906a0391M976o99r572j0225k203O680J691M083M108j0595p288J3680J9365K075
14892E685n687n133j0343j4184Q656J9858j1000p558O115m819R7R163r195n716
14878b4061J261j0477o746j824L298J2283J1893J9842N60j5475j9536k162J0115
14865b1029J1398K984k6189o617J4375P619P299J2853K00j8669r596q563p184
14852d1119K992n088J5949K4503M718o269J4172K19N994Q046j1263j3633r999
$$ plain form
14839 -10778 -29223 -38794 -44927 -25584 -17226 -15206 -26743 -24663 -26217 -24868 -37678 -34037 -32327
14826 -32327 -30228 -40446 -36401 -47714 -54282 -24205 -22743 -30970 -30982 -24353 -24048 -11633 -6228 -17291
14812 -17291 -35542 -47102 -40938 -28720 -39494 -45617 -47407 -49017 -28641 3159 1456 -8096 -21343
14799 -21343 -27042 -23649 -20457 -23736 -21576 -24065 -8877 2133 -2360 -5251 8233 1544 -4666 -2710
14785 -2710 -2274 -10226 -14493 -24332 -25610 -14038 1059 8192 -6970 -14748 -34534 -16924 -655
14772 -655 25772 38958 23729 2105 -11373 -15625 3653 27347 21144 -2444 -5494 -9838 -17193
14759 -17193 -34759 -30375 -27444 -34321 -17002 6391 41739 62119 84671 88477 94157 90304 77727
14746 77727 77267 71410 54136 14464 -21864 -44032 -67619 -62064 -41099 -36854 -50136 -32704 -12597
$$ packed form
14839a0778j8445r571o133J9343Q358K020j1537K080j554J349j2810L641J710
14826c2327K099j0218M045j1313o568L0077J462q227j2O629L05J2415N405j1063
14812a7291j8251j1560O164J2218j0774o123j790j610K0376L1800j703r552j3247
14799b1343n699L393L192l279K160k489J5188J1010m493k891J3484o689o210J956
14785b710M36p952m267r839j278J1572J5097P133j5162p778j9786J7610J6269
14772f55K6427J3186j5229k1624j3478m252J9278K3694o203k3588l050m344p355
14759a7193j7566M384K931o877J7319K3393L5348K0380K2552L806N680l853j2577
14746G7727m60n857j7274l9672l6328k2168k3587N555K0965M245j3282J7432K0107
$$ plain form
14733 -12597 -21113 -13181 -6830 -14937 -27343 -33696 -39862 -35697 -21172 -19942 -12160 3687 -2978 -10164
14719 -10164 -4553 -12761 -26332 -24319 -21407 -23332 -15828 -5750 5645 570 -12869 -6500 616
14706 616 10283 11224 9669 3352 -16540 -36126 -39720 -28088 -36480 -29738 -33981 -51131 -34260 -28810
14692 -28810 -9959 -92 843 -15691 -26698 -37678 -32015 -40315 -45347 -28140 -26691 -29792 -22161
14679 -22161 -16086 -20776 -17641 -11769 -14523 -24571 -17506 -1438 5604 -12139 -14294 -17822 -22969 -21874
14665 -21874 -24057 -33046 -39161 -43814 -36884 -31260 -26797 -21306 -20863 610 -5707 -13026 -8881 -10937
14651 -10937 -23338 -11027 -5114 -6587 -1190 2975 -212 -2668 -18143 -18566 -2438 3201 -7518
14638 -7518 -6521 -10656 -2822 12135 30973 23566 5791 -10556 -4448 -918 -10876 -19207 -19612 -16618
$$ packed form
14733a2597q516P932O351q107j2406o353o166M165J4525J230P782J5847o665p186
14719a0164N611q208j3571K013K912j925P504J0078J1395n075j3439O369P116
14706F16R667R41j555o317j9892j9586l594J1632q392O742m243j7150J6871N450
14692b8810J8851R867R35j6534j1007j0980N663q300n032J7207J449l101P631
14679b2161O075m690L135N872k754j0048P065J6068P042j7743k155l528n147J095
14665b1874k183q989o115m653O930N624M463N491M43K1473o317p319M145k056
14651a0937j2401J2311N913j473N397M165l187k456j5475m23J6128N639j0719
14638g518R97m135P834J4957J8838p407j7775j6347O108L530r958q331m05K994
$$ plain form
14624 -16618 -20739 -11347 -30018 -33246 -28482 -35704 -28698 -12967 6541 15153 11987 12565 8515 5418
14610 5418 -20153 -39044 -34344 -31142 -21142 -16216 -15962 -22940 -27595 -20668 -11504 -10708 -5510 -18168
14596 -18168 -16883 -19176 -37542 -51092 -18977 11931 -4762 -18942 -11541 4777 2413 -9849
14584 -9849 -18759 -7716 2619 -2619 -1570 19299 31047 38433 23526 3764 -6711 -3192 1711
14571 1711 11434 11187 13994 10328 4304 -7939 -16385 -14958 -19791 -27839 -29540 -41100 -50583 -48521
14557 -48521 -37901 -14447 -26345 -34786 -33610 -40188 -44394 -58031 -51712 -51730 -57487 -38255 -4156
14544 -4156 2605 -1508 -21164 -25166 -13414 -26279 -29622 -33951 -34151 -32248 -35730 -46587 -38392 -26604
14530 -26604 -7374 -2854 9594 22474 19421 9084 2275 -775 -8476 -14030 -7857 -11755 -25845
$$ packed form
14624a6618m121R392j8671l228M764p222P006J5731J9508Q612l166N78m050l097
14610E418k5571j8891M700L202J0000M926K54o978m655O927R164P96N198j2658
14596a8168J285k293j8366j3550L2115L0908j6693j4180P401J6318k364j2262
14584i849q910J1043J0335n238J049K0869J1748P386j4907j9762j0475L519M903
14571A711R723k47K807l666o024j2243q446J427m833q048j701j1560r483K062
14557d8521J0620K3454j1898q441J176o578m206j3637O319j8n757J9232L4099
14544d156O761m113j9656m002J1752j2865l343m329k00J903l482j0857Q195J1788
14530b6604J9230M520J2448J2880l053j0337o809l050p701n554O173l898j4090
$$ plain form
14517 -25845 -20652 -29922 -38278 -38755 -33208 -32321 -22668 -14139 -11985 -27150 -32187 -32696 -13249 -2236
14503 -2236 730 -3576 -23523 -28335 -31017 -19812 -17896 -10417 8472 16681 2006 -7203 -23694
14490 -23694 -42619 -46052 -33602 -23973 -13567 -6949 6357 31477 16470 4191 3519 12723 6001
14477 6001 4565 -44 -9601 7964 16831 24992 23898 17380 8123 14965 11800 12474 7537 10758 14558
14462 14558 31654 13488 -7930 -13330 -7284 6776 -2901 -15722 2836 8730 7948 2808 -10499
14449 -10499 990 16696 -486 -31132 -38170 -48064 -46104 -32225 -21609 -18179 -47032 -59223
14437 -59223 -48807 -54531 -29073 -18910 -3796 9799 -4404 -3516 8891 -4677 1575 9071 10546
14424 10546 -6243 -16032 -7378 -108 -17777 -8795 2223 -17309 -27061 -6020 -16107 -37872 -27273
$$ packed form
14517b5845N193r270q356m77N547Q87R653Q529K154j5165n037n09J9447J1013
14503b236K966m306j9947m812k682J1205J916P479J8889Q209j4675r209j6491
14490b3694j8925l433J2450R629J0406O618J3306K5120j5007j2279o72R204o722
14477F001j436m609r557J7565Q867Q161j094o518r257O842l165O74m937L221L800
14462A4558J7096j8166k1418n400O046J4060r677j2821J8558N894p82n140j3307
14449a0499J1489J5706j7182l0646p038r894J960J3879J0616L430k8853j2191
14437e9223J0416n724K5458J0163J5114J3595j4203Q88J2407j3568O252P496J475
14424A0546j6789r789Q654P270j7669Q982J1018j9532r752K1041j0087k1765J0599
$$ plain form
14411 -27273 -18872 -10841 -21317 -15350 -5299 -2201 -911 -15797 -25428 823 -1366 -17480 -31228
14398 -31228 -41437 -31048 -33025 -21369 -13270 -14578 -25746 -30343 -15657 -13050 -31744 -38306 -34330
14385 -34330 -30918 -15532 -22366 -17180 7197 13612 5567 652 -4857 -7860 12176 19250 31693
14372 31693 26888 1596 10148 10662 -7697 -6522 843 1604 6183 5034 11549 25240 24922 9277
14358 9277 22073 18104 -50 -1295 4799 4634 -9216 -27427 -34723 -27537 -35212 -28919 -19425 -27648
14344 -27648 -12651 -8721 -1684 -836 3157 -3670 -22911 -51045 -56418 -47214 -34875 -25957 -16603 -14161
14330 -14161 -23328 -16900 -282 -14289 -27950 -24465 -21516 -10557 -1540 3750 3088 -22050 -25990
14317 -25990 -15049 -9723 -15185 -23096 -32085 -33321 -38950 -41584 -37275 -31390 -20433 -13247 -5665 9376
$$ packed form
14411b7273Q401Q031j0476N967J0051L098J290j4886r631K6251k189j6114j3748
14398c1228j0209J0389j977J1656Q099j308j1168m597J4686K607j8694o562L976
14385c4330L412J5386o834N186K4377O415q045m915n509l003K0036P074J2443
14372C1693m805k5292Q552N14j8359J175P365P61M579j149O515J3691l18j5645
14358I277J2796l969j8154j245O094j65j3850j8211p296P186p675O293R494q223
14344b7648J4997L930P037Q48L993o827j9241k8134n373R204J2339Q918R354K442
14330a4161r167O428J6618j4007j3661L485K949J0959R017N290o62k5138l940
14317b5990J0941N326n462p911q989j236n629k634M309N885J0957P186P582J5041
$$ plain form
14303 9376 17656 15566 10798 8804 19354 9663 -5713 -15560 -20196 -19790 -33719 -30424 -13923 -9997
14289 -9997 -17481 -24639 -32523 -14604 -2373 1261 -6890 -16414 600 2201 3218 -5532 -14257 -18623
14275 -18623 -15864 -8106 -21589 -25015 -31158 -25294 -22206 -20326 -26897 -36989 -34321 -20398 -5241
14262 -5241 -69 -6578 -11765 7722 1808 483 8916 19472 5689 1190 12005 6710 3041 -2722
14248 -2722 536 -7033 -18192 -6130 9072 7410 10164 14389 12027 10991 19733 6238 -1841 -10099
14234 -10099 -11229 -23323 -25627 -32159 -17253 -11660 -8836 -11015 -14590 -13800 -4338 -5757 -17563 -10971
14220 -10971 -5998 -19453 -23714 -25715 -31007 -21250 -5883 -12542 -34764 -43122 -44153 -43389 -18147 -12784
14206 -12784 -13490 -8086 -9756 -21467 -22717 -24952 -18435 -7554 -9588 -11347 -5626 3998 2327 -13782
$$ packed form
14303I376Q280k090m768j994J0550r691j5376r847m636M06j3929L295J6501L926
14289i997p484p158p884J7919J2231L634q151r524J7014J601J017q750q725m366
14275a8623K759P758j3483l426o143N864L088J880o571j0092K668J3923J5157
14262e241N172o509n187J9487n914j325Q433J0556j3783m499J0815n295l669n763
14248b722L258p569j1159J2062J5202j662K754M225k362j036Q742j3495q079q258
14234a0099j130j2094k304o532J4906N593K824k179l575P90R462j419j1806O592
14220a0971M973j3455m261k001n292R757J5367o659k2222q358j031P64K5242N363
14206a2784p06N404j670j1711j250k235O517J0881k034j759N721R624j671j6109
$$ plain form
14192 -13782 -14557 -8080 -4608 -20350 -15960 -546 -12896 -15450 -17530 -16272 -19761 -25708 -28274 -20972
14178 -20972 -7169 -9403 19 9292 16827 19755 1469 5318 16089 521 -9522 11737 12291
14165 12291 -183 -16501 -28903 -24945 -19230 -42143 -52818 -52513 -53921 -50812 -39137 -33119 -39870
14152 -39870 -50148 -43373 -26564 -15946 -11931 -26302 -50465 -53725 -31231 -10733 530 7399
14140 7399 9056 1089 -9827 -18519 -23056 -23230 -25355 -17704 -11992 -19040 -21415 -6078 808 9973
14126 9973 4179 1016 3806 1681 2009 -14088 -16723 -19179 -16150 -6930 1228 -1076 8565 2834 9550
14111 9550 13029 8685 2318 -12550 -12690 -4817 -8590 -20045 -15991 -21306 -27694 -23286 -11397 -8376
14097 -8376 -4156 -17471 -29589 -39516 -42568 -44845 -38769 -47305 -48427 -57489 -36535 -10732 -6180 -9655
$$ packed form
14192a3782p75O477L472j5742M390J5414j2350k554k080J258l489n947k566P302
14178b0972J3803k234R422R273P535K928j8286L849J0771j5568j0043K1259N54
14165A2291j2474j6318j2402L958N715k2913j0675L05j408L109J1675O018o751
14152c9870j0278O775J6809J0618M015j4371k4163l260K2494K0498J1263O869
14140G399J657p967j0916q692m537j74k125P651N712p048k375J5337O886R165
14126I973n794l163K790k125L28j6097k635k456L029R220Q158k304R641n731O716
14111I550L479m344o367j4868j40P873l773j1455M054n315o388M408J1889L021
14097h376M220j3315j2118r927l052k277O076q536j122r062K0954K5803M552l475
$$ plain form
14083 -9655 1649 9928 494 -7476 -13731 -23015 -20181 -12449 -14693 -20563 -18566 -21246 -28552 -33421
14069 -33421 -13934 -25676 -42499 -31111 -42880 -49254 -19453 -8897 -17868 -20825 -8624 -2645
14057 -2645 -11758 -16612 -24996 -16741 6205 8356 -14549 -9088 5006 -10549 -14236 -13614 -7658 -4641
14043 -4641 -9983 -15754 -9561 -13391 -18485 -24960 -24812 -30233 -32825 -28345 -8492 -8441 -9338 -23287 -28639
14028 -28639 -22272 -21736 -15319 -12115 783 5507 2634 11403 21850 22696 25511 36333 26165 27681
14014 27681 21371 16102 -2454 -12349 -12087 -11051 -11807 -12071 -9628 -3756 288 -19714 -30852 -35846
14000 -35846 -45224 -52144 -65541 -71828 -69436 -58765 -48704 -35719 -39614 -33272 -36300 -47850 -32016
13987 -32016 -8085 5363 -649 -6642 -27434 -32501 -10603 -13981 -8743 -1054 -5646 -18521 -30681
$$ packed form
14083i655J1304Q279r434p970o255r284K834P732k244n870J997k680p306m869
14069c3421J9487j1742j6823J1388j1769o374K9801J0556q971k957J2201N979
14057b645r113m854q384Q255K2946K151k2905N461J4094j5555l687O22N956L017
14043d641n342n771O193l830n094o475J48n421k592M480J9853N1q97j3949n352
14028b8639O367N36O417L204J2898M724k873Q769J0447Q46K815J0822j0168J516
14014B7681o310n269j8556r895K62J036p56k64K443N872M044k0002j1138m994
14000c5846r378o920j3397o287K392J0671J0061J2985l895O342l028j1550J5834
13987c2016K3931J3448o012n993k0792n067K1898l378N238P689m592j2875j2160
$$ plain form
13974 -30681 -40049 -28588 -28424 -32134 -19990 -24592 -42451 -44866 -23646 -8988 -1932 -19363 -18868
13961 -18868 -10124 5032 7061 352 -8346 2956 10158 27861 24478 9202 -5376 1724 21441
13948 21441 19994 20911 19708 16765 3865 16943 26591 3790 -12512 -18846 -10653 -14768 -17325 -25712
13934 -25712 -39275 -26856 -41327 -39144 -19168 -18407 -13120 -11458 17346 19050 12857 12305 18235 21462
13920 21462 32448 52384 43754 51922 48610 35783 17167 6430 -863 -9928 -34000 -46679 -56396
13907 -56396 -52506 -52902 -48455 -31047 -18232 -14159 -9644 -4795 -21607 -21293 -15683 -8461 -9586 -5265
13893 -5265 -9426 -15195 -452 8661 24221 16925 7181 9629 18297 24388 20769 18851 13307 17281
13879 17281 19399 745 -1978 382 -24715 -33940 -23108 -19255 -31232 -20724 -25756 -30299 -25881
$$ packed form
13974c0681r368J1461J64l710J2144m602j7859k415K1220J4658P056j7431M95
13961a8868Q744J5156K029o709q698J1302P202J7703l383j5276j4578P100J9717
13948B1441j447R17j203k943j2900J3078R648k2801j6302o334Q193m115k557q387
13934b5712j3563J2419j4471K183J9976P61N287J662K8804J704o193n52N930L227
13920B1462J0986J9936q630Q168l312j2827j8616j0737p293r065k4072j2679r717
13907e6396L890l96M447J7408J2815M073M515M849j6812L14N610P222j125M321
13893e265m161n769J4743R113J5560p296r744K448Q668O091l619j918n544L974
13879A7281K118j8654k723K360k5097r225J0832L853j1977J0508n032m543M418
$$ plain form
13866 -25881 -23789 -12072 -18287 -23573 -26870 -32920 -40493 -32004 -26383 -23016 -13279 -10079 -30912 -38207
13852 -38207 -46048 -29110 -12239 -18576 -14332 6641 5262 11580 7110 1621 -1345 446 12558
13839 12558 3792 -850 1812 14861 8350 1380 -9365 -17891 -12642 1165 1508 -21948 -27366 -14234
13825 -14234 563 -6016 -14666 -17318 -18153 -9965 -10013 -11657 -4528 1520 -2006 -10869 -6826 -9842 16575
13810 16575 28292 8772 -21419 -28038 -20406 -12847 -11037 -1339 6281 2660 4212 -6410 -14093
13797 -14093 -11499 -2414 6582 12578 713 -8951 -10342 -16815 -27680 -24415 -17755 -26649 -29998 -14184
13783 -14184 -9515 -5706 8241 15616 11804 5420 11854 1812 6667 10003 16671 17304 8401 6953
13769 6953 -4570 -1851 4214 16480 28306 13162 4524 -8660 -633 -8725 -34972 -32344 -12325
$$ packed form
13866b5881K092J1717o215n286l297o050p573Q489N621L367R737L200k0833p295
13852c8207p841J6938J6871o337M244K0973j379O318m470n489k966J791J2112
13839A2558q766m642K662J3049o511o970j0745q526N249J3807L43k3456n418J3132
13825a4234J4797o579q650k652q35Q188m8j644P129O048l526q863M043l016K6417
13810A6575J1717j9520l0191o619P632P559J810R698P620l621J552j0622p683
13797a4093K594R085Q996N996j1865r664j391o473j0865L265O660q894l349J5814
13783a4184M669L809J3947P375l812o384O434j0042M855L336O668O33q903j448
13769F953j1523K719O065J2266J1826j5144q638j3184Q027q092k6247K628K0019
$$ plain form
13756 -12325 1352 -5931 -12043 -18518 -5850 1318 -19332 -25524 -17586 -19760 -27194 -21904 -11923 -17460
13742 -17460 -777 8633 10845 10563 11570 6364 11358 21919 18025 26219 36514 70208 70080 51397
13728 51397 33551 25271 10970 3665 15497 25561 42137 46335 39131 40588 55365 60091 63030
13715 63030 52810 49787 60548 75764 102514 123328 152922 182635 215675 261686 308778 342058
13703 342058 382417 414424 457817 486495 521677 591718 638769 665533 695738 710334 718246 746883
13691 746883 779609 783862 780217 761929 740477 725404 715212 698182 661061 618637 586491 564577
13679 564577 540662 487255 465160 431600 387547 355092 319507 272754 245602 216006 193415
13668 193415 192074 176570 148671 138804 137763 147836 123588 107365 100963 97882 94665 84125 75777
$$ packed form
13756a2325J3677p283o112o475J2668P168k0650o192P938k174p434N290R981n537
13742a7460J6683R410K212k82J007n206M994J0561l894Q194J0295L3694j28j8683
13728E1397j7846q280j4301p305J1832J0064J6576M198p204J457J4777M726K939
13715F3030j0220l023J0761J5216K6750K0814K9594K9713L3040M6011M7092L3280
13703C42058M0359L2007M3393K8678L5182P0041M7051K6764L0205J4596P912K8637
13691G46883L2726M253l645j8288k1452j5073j0192j7030l7121m2424l2146k1914
13679E64577k3915n3407k2095l3560m4053l2455l5585m6753k7152k9596k2591
13668A93415j341j5504k7899r867j041J0073k4248j6223o402l081l217j0540q348
$$ plain form
13655 75777 68126 59601 50006 55301 41761 48516 67219 72399 66369 61539 65314 63076 69178 91774
13641 91774 78045 69930 59097 56428 57659 59951 48517 41899 38108 34328 34614 26611 5401 24364
13627 24364 40010 38005 41868 64937 70310 60460 52746 40312 53131 59250 53022 58832 70263
13614 70263 65747 59994 36625 30321 31368 27220 37490 46819 26370 16409 34521 47815 54419
13601 54419 51092 50975 46269 43761 40461 39115 28766 40176 44829 41108 36686 26167 26798 25444
13587 25444 2688 -10083 -16212 -13762 3839 20749 25188 24409 33664 34628 40055 50125 44237 47829
13573 47829 37811 20623 10875 6031 4206 3883 -1209 -1294 25944 26778 9541 2976 10442 2156
13559 2156 -5859 -8403 -6090 -3537 15140 32317 31500 29090 32569 33255 17928 12529 19036 23117
$$ packed form
13655G5777p651q525r595N295j3540O755J8703N180o030m830L775k238O102K2596
13641I1774j3729q115j0833k669J231K292j1434o618l791l780K86q003k1210J8963
13627B4364J5646k005L863K3069N373r850p714j2434J2819O119o228N810J1431
13614G0263m516n753k3369o304J047m148J0270R329k0449r961J8112J3294O604
13601E4419l327j17m706k508l300j346j0349J1410M653l721m422j0519O31j354
13587B5444k2756j2771o129K450J7601J6910M439p79R255R64N427J0070n888L592
13573D7829j0018j7188r748m844j825l23n092q5K7238Q34j7237o565P466q286
13559B156q015k544K313K553J8677J7177q17k410L479O86j5327n399O507M081
$$ plain form
13545 23117 1873 -7696 12236 25321 27778 34038 31681 43118 45190 29685 25243 33198 14603
13532 14603 22728 20088 30752 20703 7687 8041 14834 38729 44767 49843 44823 37764 38690 23624
13518 23624 7696 13546 23680 22729 19451 18873 34965 32788 29428 22787 26405 16573 21888 18905
13504 18905 17525 16339 5654 14023 21088 35135 43378 56887 50109 37870 38952 45355 43530
13491 43530 35737 39385 35928 28554 21853 29638 10267 3446 8863 29823 55171 44388 4976
13478 4976 -19021 -2883 26610 40214 54394 52509 37167 10712 4678 15409 3107 15572
13466 15572 17512 14361 9165 27078 42224 57997 62380 43799 38502 43762 54469 48911 31975
13453 31975 32917 43307 20540 20353 30254 39101 30199 21576 22532 34353 44626 40451 43664 42996
$$ packed form
13545B3117k1244r569J9932J3085K457O260k357J1437K072j5505m442P955j8595
13532A4603Q125k640J0664j0049j3016L54O793K3895O038N076n020p059R26j5066
13518B3624j5928N850J0134r51l278n78J6092k177l360o641L618r832N315k983
13504A8905j380j186j0685Q369P065J4047Q243J3509o778j2239J082O403j825
13491D3530p793L648l457p374o701P785j9371o821N417K0960K5348j0783l9412
13478D976k3997J6138K9493J3604J4180j885j5342k6455o034J0731j2302J2465
13466A5572J940l151n196J7913J5146J5773M383j8581n297N260J0707n558j6936
13453C1975R42J0390k2767j87R901Q847q902q623R56J1821J0273m175L213o68
$$ plain form
13439 42996 45786 45179 54659 53297 38617 26019 18762 4457 -721 17376 38820 40651 56553
13426 56553 73022 71487 78676 89450 102579 87596 75055 59671 49880 46666 32874 35299 34159
13413 34159 24309 10107 18824 40402 54298 57335 60530 49620 38131 41419 48125 51995 53663
13400 53663 37124 25454 19220 16755 8948 9974 5782 1128 1292 1797 13991 32085 31101 25654
13386 25654 13581 400 3950 26983 52837 75032 86048 61597 51839 41985 33380 26607 29098
13373 29098 27288 31080 30900 23946 18770 29963 35426 46936 44593 29925 22209 24940 35942 50350
13359 50350 72237 54205 50331 72200 79076 67303 58005 51408 33251 37316 52096 50988 46460
13346 46460 61167 59715 56091 46322 41020 50034 61964 75787 82731 93190 94672 89459 68731
$$ packed form
13439D2996K790o07R480j362j4680j2598p257j4305n178J8097K1444J831J5902
13426E6553J6469j535P189J0774J3129j4983j2541j5384r791l214j3792K425j140
13413C4159r850j4202Q717K1578J3896L037L195j0910j1489L288O706L870J668
13400E3663j6539j1670o234k465p807J026m192m654J64N05J2194J8094r84n447
13386B5654j2073j3181L550K3033K5854K2195J1016k4451r758r854q605o773K491
13373B9098j810L792j80o954n176J1193N463J1510k343j4668p716K731J1002J4408
13359E0350K1887j8032l874K1869O876j1773r298o597j8157M065J4780j108m528
13346D6460J4707j452l624r769n302R014J1930J3823O944J0459J482n213k0728
$$ plain form
13333 68731 51398 29604 32275 49154 70361 87022 80684 60897 50517 49084 59351 42333
13321 42333 32438 48493 49312 44865 45268 58284 73773 62463 48866 50096 56590 55723 56105 50273
13307 50273 59327 65505 56402 48902 32835 28203 46321 60748 70717 63746 61492 60673 73907 65092
13293 65092 55077 44609 41863 49753 50871 43602 45655 48052 37960 29456 33204 35203 9924
13280 9924 5722 10321 7047 4317 6672 12719 26959 30480 27220 23998 31585 28287 18691 29905
13266 29905 21274 22474 52970 53183 45395 52834 53448 68374 79991 70833 67378 73990 68644 56335
13252 56335 46209 45429 48161 53899 45416 44000 43981 71861 95665 88352 69666 74232 69713 76426
13238 76426 87899 105800 117440 117802 107448 108772 105785 121880 135317 127710 144230 161796 190261
$$ packed form
13333F8731j7333k1794K671J6879K1207J6661o338j9787j0380j433J0267j7018
13321D2333r895J6055Q19m447M03J3016J5489j1310j3597J230O494q67L82n832
13307E0273R054O178r103p500j6067m632J8118J4427R969o971k254q19J3234q815
13293F5092j0015j0468k746P890J118p269K053K397j0092q504L748J999k5279
13280I924m202M599l274k730K355O047J4240L521l260l222P587l298r596J1214
13266B9905q631J200L0496K13p788P439O14J4926J1617r158l455O612n346j2309
13252E6335j0126p80K732N738q483j416j9K7880K3804p313j8686M566m519O713
13238G6426J1473J7901J1640L62j0354J324k987J6095J3437p607J6520J7566K8465
$$ plain form
13225 190261 223394 258333 288392 331982 407591 511814 648030 835793 1076443 1349268
13215 1349268 1663201 1992018 2301933 2540382 2709796 2786880 2749651 2600992 2363683 2071997
13205 2071997 1751566 1460367 1208422 1002091 847918 735255 656489 587985 550922 515034
13195 515034 480293 451166 433679 400915 363728 324530 286887 264144 256999 262896 245484 224848
13183 224848 221304 211674 202251 198659 204192 201433 205326 191926 176096 156744 145726 142123 142489
13170 142489 136110 124588 123281 143216 158304 168425 165079 152715 126483 112499 118770 118962 125244
13157 125244 127245 119355 111275 114392 120351 127504 125904 131637 123281 112521 107734 122544 141723
13144 141723 143912 144255 148451 153167 141052 138446 145563 134626 115183 117542 108663 108127 124432 126847
$$ packed form
13225A90261L3133L4939L0059M3590P5609J04223J36216J87763K40650K72825
13215A349268L13933L28817L09915K38449J69414P7084l7229j48659k37309k91686
13205B071997l20431k91199k51945k06331j54173j12663p8766o8504l7063l5888
13195E15034l4741k9127j7487l2764l7187l9198l7643k2743p145N897j7412k0636
13183B24848l544r630r423l592N533k759L893j3400j5830j9352j1018l603L66
13170A42489o379j1522j307J9935J5088J0121l346j2364k6232j3984O271J92O282
13157A25244K001p890q080L117N959P153j600N733q356j0760m787J4810J9179
13144A41723K189L43M196M716j2115k606P117j0937j9443K359q879n36J6305K415
$$ plain form
13130 126847 130014 125073 116717 106576 103738 99413 115935 121697 133187 121402 108769 102922 114788
13117 114788 123879 109158 102922 112489 88040 85936 103949 108836 116376 113484 113515 143507 157741
13104 157741 156763 144058 135624 151758 173022 170923 166195 175941 168440 155999 168350 162247 150213
13091 150213 136431 132040 125204 119621 114722 113649 107314 97280 84527 77268 87576 80137 62583
13078 62583 71032 81425 90779 94392 90198 83068 72625 74796 81617 84679 84387 90668 81858 80192
13064 80192 90587 91928 95707 93004 101098 112981 119977 114837 126595 145007 146517 143804 137659
13051 137659 124476 139583 143875 152864 170390 165952 174605 194098 219774 245746 247676 274495
13039 274495 307068 310014 318327 343776 366597 391759 396800 387072 371593 369111 349816 310923
$$ packed form
13130A26847L167m941q356j0141k838m325J6522N762J1490j1785j2633n847J1866
13117A14788R091j4721o236R567k4449k104J8013M887P540k892L1K9992J4234
13104A57741r78j2705q434J6134K1264k099m728R746p501j2441J2351o103j2034
13091A50213j3782m391o836n583m899j073o335j0034j2753p259J0308p439j7554
13078F2583Q449J0393R354L613m194p130j0443K171O821L062k92O281q810j666
13064H0192J0395J341L779k703Q094J1883O996n140J1758J8412J510k713o145
13051A37659j3183J5107M292Q989J7526m438Q653J9493K5676K5972J930K6819
13039B74495L2573K946Q313K5449K2821K5162N041r728j5479k482j9295l8893
$$ plain form
13027 310923 295871 279722 264565 245773 243806 254929 267263 251584 242637 236393 212499 205139
13015 205139 203338 201350 196223 172215 171302 159015 148248 153356 167811 197650 216700 218459 234271
13002 234271 246776 259875 270695 262389 256356 250057 232449 227755 225289 239780 236715 194677 174819
12989 174819 161693 142039 128145 114859 110211 111865 119087 105365 72336 33553 320 -27476
12977 -27476 -45494 -32965 -26535 -22199 -14748 1956 14741 39473 59963 90039 128297 148440
12965 148440 179776 196060 205300 212023 218055 210549 207035 211057 215937 227710 209947 193947 195423
12952 195423 196910 209364 205278 180425 183775 208343 212178 232787 254126 286793 306867 330470
12940 330470 352409 346648 336630 344862 357669 385912 401806 399069 392863 395210 393368 401962 405767
$$ packed form
13027C10923j5052j6149j5157j8792j967J1123J2334j5679q947o244k3894p360
13015B05139j801j988n127k4008r13j2287j0767N108J4455K9839J9050J759J5812
13002B34271J2505J3099J0820q306o033o299j7608m694k466J4491l065m2038j9858
12989A74819j3126j9654j3894j3286m648J654P222j3722l3029l8783l3233k7796
12977b7476j8018J2529O430M336P451J6704J2785K4732K0490L0076L8258K0143
12965A48440L1336J6284R240O723O032p506l514M022M880J1773j7763j6000J476
12952A95423J487J2454m086k4853L350K4568L835K0609K1339L2667K0074K3603
12940C30470K1939n761j0018Q232J2807K8243J5894k737o206K347j842Q594L805
$$ plain form
12927 405767 400038 390338 370777 362334 395215 449621 488500 530140 589186 656435 736724 840365
12915 840365 925443 1025715 1100225 1176799 1224209 1241455 1236903 1207236 1176664 1146482 1113970
12904 1113970 1080704 1031625 973320 932493 899394 881256 878626 877144 868665 865230 872237 867430
12892 867430 857837 869699 871386 873621 887167 892891 909468 937772 955253 963435 948121 947903 943079
12879 943079 934370 926247 913992 904142 890361 885558 869950 872732 886445 890254 880083 881856 896117
12866 896117 918380 953042 975032 1016423 1057442 1077044 1087482 1116867 1143265 1174087 1204520
12855 1204520 1240128 1257682 1267285 1273936 1297388 1315721 1331619 1352286 1373550 1415003 1456605 1487239
12843 1487239 1523025 1555800 1573459 1595043 1633481 1673911 1723170 1794454 1904483 2044836 2187243
$$ packed form
12927D05767n729r700j9561q443L2881N4406L8879M1640N9046O7249Q0289J03641
12915H40365Q5078J00272P4510P6574M7410J7246m552k9667l0572l0182l2512
12904A113970l3266m9079n8305m0827l3099j8138k630j482q479l435P007m807
12892H67430r593J1862J687K235J3546N724J6577K8304J7481Q182j5314k18m824
12879I43079q709q123j2255r850j3781m803j5608K782J3713L809j0171J773J4261
12866H96117K2263L4662K1990M1391M1019J9602J0438K9385K6398L0822L0433
12855A204520L5608J7554R603O651K3452J8333J5898K0667K1264M1453M1602L0634
12843A487239L5786L2775J7659K1584L8438M0430M9259P1284J10029J40353J42407
$$ plain form
12832 2187243 2354088 2529139 2706593 2876395 3042659 3196632 3325670 3443395 3553907
12823 3553907 3670333 3830574 3996342 4177675 4401094 4672463 5002222 5379952 5831810
12814 5831810 6364317 6983862 7684374 8489193 9454531 10554767 11811656 13295968 15032904
12805 15032904 17077510 19438473 22174822 25315503 28921647 33094393 38028641 44145569
12797 44145569 52189696 63417136 79796855 103611057 136434595 178626169 229526518
12790 229526518 287121530 347693741 405716653 454508694 488913694 504239529 499171934
12783 499171934 474177305 433361361 381435947 324035241 266876191 214755409 171784389
12776 171784389 139426562 117010964 101692050 90681190 82223678 75344450 69456008
$$ packed form
12832B187243J66845J75051J77454J69802J66264J53973J29038J17725J10512
12823C553907J16426J60241J65768J81333K23419K71369L29759L77730M51858
12814E831810N32507O19545P00512Q04819R65338J100236J256889J484312J736936
12805A5032904K044606K360963K736349L140681L606144M172746M934248O116928
12797D4145569Q044127J1227440J6379719K3814202L2823538M2191574N0900349
12790B29526518N7595012O0572211N8022912M8792041L4405000J5325835n067595
12783D99171934k4994629m0815944n1925414n7400706n7159050n2120782m2971020
12776A71784389l2357827k2415598j5318914j1010860q457512o879228n888442
$$ plain form
12769 69456008 64242668 59543273 55235180 51280433 47726902 44569683 41787727 39355738
12761 39355738 37247057 35356299 33633926 32053825 30589288 29208781 27894713 26677590
12753 26677590 25528451 24434930 23411572 22472528 21577314 20724496 19933133 19213278 18545349
12744 18545349 17928097 17373568 16875162 16444540 16057178 15724517 15414716 15123371 14847716
12735 14847716 14543245 14195145 13811105 13415528 12984198 12505859 12021519 11540293 11072139
12726 11072139 10614106 10203231 9824701 9466192 9132126 8814008 8538801 8285198 8038232
12717 8038232 7799139 7559441 7337494 7124930 6919344 6718388 6528420 6353135 6190504
12708 6190504 6039325 5889591 5742437 5583622 5436004 5288244 5158377 5019261 4862855
$$ packed form
12769F9456008n213340m699395m308093l954747l553531l157219k781956k431989
12761C9355738k108681j890758j722373j580101j464537j380507j314068j217123
12753B6677590j149139j093521j023358r39044q95214q52818p91363p19855o67929
12744A8545349o17252n54529m98406m30622l87362l32661l09801k91345k75655
12735A4847716l04471l48100l84040l95577m31330m78339m84340m81226m68154
12726A1072139m58033m10875l78530l58509l34066l18118k75207k53603k46966
12717H038232k39093k39698k21947k12564k05586k00956j89968j75285j62631
12708F190504j51179j49734j47154j58815j47618j47760j29867j39116j56406
$$ plain form
12699 4862855 4717149 4560298 4409773 4290013 4165321 4020483 3890389 3768151 3652497
12690 3652497 3536862 3409181 3301544 3210489 3128571 3059256 2998172 2951857 2923211 2889968 2837821
12679 2837821 2787704 2725788 2672607 2616262 2534632 2454149 2405546 2359281 2299459 2241514 2186288
12668 2186288 2117364 2056858 1992253 1912957 1851730 1769645 1687332 1624538 1571320 1518135 1464725
12657 1464725 1410233 1362266 1324654 1274860 1222660 1165981 1129001 1087495 1054261 1024317 986142
12646 986142 943600 919628 887689 837701 801511 756792 715022 686227 663711 658707 642162 619236
12634 619236 617361 610794 621136 618669 602667 608531 628204 640707 654965 659494 667167 681036 673968
12621 673968 661065 656734 637971 603753 565342 533158 508759 492961 486657 492671 493459 494834 500362
$$ packed form
12699D862855j45706j56851j50525j19760j24692j44838j30094j22238j15654
12690C652497j15635j27681j07637r1055q1918o9315o1084m6315k8646l3243n2147
12679B837821n0117o1916n3181n6345q1630q0483m8603m6265n9822n7945n5226
12668B186288o8924o0506o4605p9296o1227q2085q2313o2794n3218n3185n3410
12657A464725n4492m7967l7612m9794n2200n6679l6980m1506l3234k9944l8175
12646I86142m2542k3972l1939m9988l6190m4719m1770k8795k2516n004j6545k2926
12634F19236j875o567J0342k467j6002N864J9673J2503J4258M529P673J3869p068
12621F73968j2903m331j8763l4218l8411l2184k4399j5798o304O014P88J375N528
$$ plain form
12608 500362 524028 535827 546662 572871 627917 686567 734554 793418 831618 850145 874762
12597 874762 875829 870528 855929 841552 824607 797696 760813 732867 703356 686575 693614 702879
12585 702879 697098 675083 646211 613981 584881 554968 520842 483552 448060 410333 395594 383390
12573 383390 355610 345036 329269 320669 321976 318918 334352 351656 344956 349594 352918 351601 356470
12560 356470 369003 376107 382145 392379 400901 391566 386174 376187 387325 399748 405325 414312 444036
12547 444036 453500 444257 418893 383263 361286 357004 344334 333706 326434 318129 322971 341525 355778
12534 355778 367562 377587 384763 392987 388789 372979 365728 335003 313223 307914 298390 288620 271193
12521 271193 248893 231826 221476 212098 195409 186411 179921 166561 137636 122219 123066 132702 141368
$$ packed form
12608E00362K3666J1799J0835K6209N5046N8650M7987N8864L8200J8527K4617
12597H74762J067n301j4599j4377j6945k6911l6883k7946k9511j6781P039R265
12585G02879n781k2015k8872l2230k9100k9913l4126l7290l5492l7727j4739j2204
12573C83390k7780j0574j5767q600J307l058J5434J7304o700M638L324j317M869
12560C56470J2533P104O038J0234Q522r335n392r987J1138J2423N577Q987K9724
12547D44036R464r243k5364l5630k1977m282j2670j0628p272q305M842J8554J4253
12534C55778J1784J0025P176Q224m198j5810p251l0725k1780n309r524r770j7427
12521B71193k2300j7067j0350r378j6689q998o490j3360k8925j5417Q47R636Q666
$$ plain form
12508 141368 149801 131035 120567 135858 153623 176611 170700 154195 145693 149894 137543 133367
12496 133367 135166 131194 111620 110986 121204 112157 102588 107749 119003 135550 137099 135694 129638
12483 129638 131992 126082 127283 124140 118898 112262 103824 85154 79262 76487 91563 65355 53852
12470 53852 48218 54427 64568 57453 62647 67073 64518 68521 74528 77249 61650 38187 46975 50888
12456 50888 44853 62253 61393 52071 46340 70315 76079 63181 57773 65589 56913 68624 66452 64806
12442 64806 84796 76342 73839 71465 61528 54551 60493 68965 81937 82871 79841 72449 86146 85953
12428 85953 75491 82669 90869 97497 102600 110803 109607 95624 80579 90897 106099 124087 116191
12415 116191 119039 120374 107812 105709 101376 103108 118523 110624 93514 86863 90058 88081 89232
$$ packed form
12508A41368Q433j8766j0468J5291J7765K2988n911j6505q502M201j2351m176
12496A33367J799l972j9574o34J0218r047r569N161J1254J6547J549j405o056
12483A29638K354n910J201l143n242o636q438j8670n892k775J5076k6208j1503
12470E3852n634O209J0141p115N194M426k555M003O007K721j5599k3463Q788L913
12456E0888o035J7400q60r322n731K3975N764j2898n408P816q676J1711k172j646
12442F4806J9990q454k503k374r937o977N942Q472J2972R34l030p392J3697j93
12428H5953j0462P178Q200O628N103Q203j196j3983j5045J0318J5202J7988p896
12415A16191K848J335j2562k103m333J732J5415p899j7110o651L195j977J151
$$ plain form
12402 89232 94600 96863 94979 112376 109006 90641 84267 89027 114343 130925 131177 110338 102821
12389 102821 113684 119250 132421 149292 143401 126510 130650 141073 139060 141181 162373 174013
12377 174013 168133 158319 169903 196656 212300 224699 231661 232682 247689 298608 346235 395670
12365 395670 461915 543855 662948 826369 1046740 1320650 1639706 1973962 2315159 2612428
12355 2612428 2841476 2970568 2993772 2914695 2759764 2539837 2260808 1936752 1620120 1353560
12345 1353560 1155529 1025748 935292 874171 820579 760268 717482 708165 707842 676610 648089
12334 648089 626681 612738 579328 572577 572072 566142 596943 639345 693373 743480 795585 849162
12322 849162 884610 891742 899218 866682 802292 721568 637566 592118 573022 575301 591485 605047
$$ packed form
12402H9232N368K263j884J7397l370j8365o374M760K5316J6582K52k0839p517
12389A02821J0863N566J3171J6871n891j6891M140J0423k013K121K1192J1640
12377A74013n880r814J1584K6753J5644J2399O962J021J5007N0919M7627M9435
12365C95670O6245Q1940J19093J63421K20371K73910L19056L34256L41197K97269
12355B612428K29048J29092K3204p9077j54931k19927k79029l24056l16632k66560
12345A353560j98031j29781r0456o1121n3592o0311m2786r317l23l1232k8521
12334F48089k1408j3943l3410o751n05n930L0801M2402N4028N0107N2105N3577
12322H49162L5448P132P476l2536o4390q0724q4002m5448j9096K279J6184J3562
$$ plain form
12310 605047 607053 610755 619428 626707 650499 650564 616116 567196 516749 483758 475363 450315 436316
12297 436316 432006 419703 422079 427217 439197 437951 428761 424779 445406 456841 463595 481458 480428
12284 480428 473233 460111 428873 380958 343868 327928 325554 307203 308285 322226 324213 321602
12272 321602 321884 306465 289254 290251 303260 322411 330298 324772 323611 314392 291749 274959 268400
12259 268400 272916 263806 255155 250774 246641 232961 220637 221973 210815 211476 217074 216927 207785 209771
12245 209771 197253 186834 172400 165004 168212 168821 164736 151263 145543 149384 151743 146530 142347
12232 142347 156748 159746 158897 155876 147466 145450 152534 168168 176355 154937 141638 146784 159812
12219 159812 152801 150423 148435 149526 161603 155665 143655 137790 125509 117581 120376 109606 103026
$$ packed form
12310F05047K006L702Q673P279K3792O5l4448m8920n0447l2991q395k5048j3999
12297D36316m310j2303K376N138J1980j246r190l982K0627J1435O754J7863j030
12284D80428p195j3122l1238m7915l7090j5940k374j8351J082J3941J987k611
12272C21602K82j5419j7211R97J3009J9151P887n526j161r219k2643j6790o559
12259B68400M516r110q651m381m133j3680j2324J336j1158O61N598j47r142J986
12245B09771j2518j0419j4434p396L208O09m085j3473n720L841K359n213m183
12232A42347J4401K998q49l021q410k016P084J5634Q187k1418j3299N146J3028
12219A59812p011k378j988J091J2077n938j2010n865j2281p928K795j0770o580
$$ plain form
12206 103026 109320 117423 122377 131131 120256 116340 117859 113148 125940 126543 133044 124411 130482 142253
12192 142253 138880 131154 124386 135329 146311 157418 134946 144385 162038 151989 138063 109446
12180 109446 111978 132323 124204 130092 145692 148309 150528 163171 168773 170353 161706 142523 140867
12167 140867 150972 153045 146670 146759 134292 151961 160894 168189 153089 166410 194334 211799 228601
12154 228601 238148 238018 237239 247826 277451 299987 318289 334090 340997 342348 342830 338750 324355
12141 324355 329732 342246 381863 438002 514114 601046 696381 789614 865406 916442 941112 925737
12129 925737 892814 827279 760283 718668 707296 706565 722267 735420 747123 732703 726251 723516
12117 723516 718641 700315 701720 741568 758956 785368 800968 801965 813437 840244 840521 833171 834077
$$ packed form
12206A03026O294Q103M954Q754j0875l916J519m711J2792O03O501q633O071J1771
12192A42253l373p726o768J0943J0982J1107k2472R439J7653j0049j3926k8617
12180A09446K532K0345q119N888J5600K617K219J2643N602J580q647j9183j656
12167A40867J0105K073o375Q9j2467J7669Q933P295j5100J3321K7924J7465J6802
12154B28601R547j30p79J0587K9625K2536J8302J5801O907J351M82m080j4395
12141C24355N377J2514L9617N6139P6112Q6932R5335R3233P5792N1036K4670j5375
12129I25737l2923o5535o6996m1615j1372p31J5702J3153J1703j4420o452k735
12117G23516m875j8326J405L9848J7388K6412J5600R97J1472K6807K77p350R06
$$ plain form
12104 834077 832747 840503 846889 857636 879728 888516 929939 1011413 1150419 1335708 1550895 1783279
12092 1783279 2023176 2213606 2321244 2333032 2287134 2132797 1879713 1606458 1399888 1259731
12082 1259731 1175264 1126492 1104472 1093282 1086465 1086935 1079123 1092841 1095472 1082092 1069676 1039237
12070 1039237 1014293 1001283 974246 941355 917377 887226 878034 863128 845012 833661 824649 804864
12058 804864 792786 769120 754640 743627 764278 809829 862998 936005 1004767 1061408 1085455
12047 1085455 1085107 1043466 968338 870148 779193 696895 632203 564691 523085 504837 481912 466697
12035 466697 453597 435495 421944 401892 390465 374442 367915 346050 323528 318311 319271 322500
12023 322500 325040 337649 340983 321370 295331 292203 309333 312959 296772 288827 296223 290184 268944
$$ packed form
12104H34077j330P756O386J0747K2092Q788M1423Q1474J39006J85289K15187K32384
12092A783279K39897J90430J07638J1788m5898j54337k53084k73255k06570j40157
12082A259731q4467m8772k2020j1190o817M70p812J3718K631j3380j2416l0439
12070A039237k4944j3010k7037l2891k3978l0151r192j4906j8116j1351r012j9785
12058H04864j2078k3666j4480j1013K0651M5551N3169P3007O8762N6641K4047
12047A085455l48m1641p5128r8190r0955q2298o4692o7512m1606j8248k2925j5215
12035D66697j3100j8102j3551k0052j1427j6023o527k1865k2522n217R60L229
12023C22500K540J2609L334j9613k6039l128J7130L626j6187p945P396o039k1240
$$ plain form
12010 268944 277823 273919 247401 249188 260605 267561 261001 256923 255200 259974 264165 237223 208138
11997 208138 201183 224474 232028 233627 246604 275096 279381 270726 259315 249563 244478 229605 215679
11984 215679 209980 203288 204016 213490 214052 209918 210129 201624 203229 203670 210422 212337 213307 210423 201043
11969 201043 189392 194245 210540 212870 205365 205470 215876 212137 183135 172366 184945 187999 183929
11956 183929 176900 195436 206757 214578 227179 229610 221831 212941 222294 220288 227018 229568 255250
11943 255250 265480 277717 259530 285126 276515 268128 290155 289275 284965 288699 305163 289885 263480
11930 263480 266737 260762 265972 277611 282374 276712 268166 276255 291989 291455 291909 324324 324690 337344
11916 337344 356922 369755 368955 378614 393898 396553 406126 424526 426611 440222 455216 459578 453259
$$ packed form
12010B68944Q879l904k6518J787J1417O956o560m078j723M774M191k6942k9085
11997B08138o955K3291P554J599J2977K8492M285q655j1411r752n085j4873j3926
11984B15679n699o692P28R474N62m134K11q505J605M41O752J915R70k884r380
11969B01043j1651M853J6295K330p505J05J0406l739k9002j0769J2579L054m070
11956A83929p029J8536J1321P821J2601K431p779q890R353k006O730K550K5682
11943B55250J0230J2237j8187K5596q611q387K2027q80m310L734J6464j5278k6405
11930B63480L257n975N210J1639M763n662q546Q089J5734n34M54L2415L66J2654
11916C37344J9578J2833q00R659J5284K655R573J8400K085J3611J4994M362o319
$$ plain form
11903 453259 436737 416767 410924 414611 414291 409116 422729 412394 390863 384269 381105 377349 380019
11890 380019 381014 364636 361416 355411 341675 331773 327608 337820 355266 346638 356218 373034 369569
11877 369569 379844 387425 391654 378065 397074 414021 433525 444902 435281 423758 419967 431348
11865 431348 447979 445948 418079 410419 418704 420563 421587 394117 386040 390781 389724 384690 385651 380014
11851 380014 377913 380135 364257 354347 356571 366359 354070 338167 336364 355412 385347 402094 425613
11838 425613 444688 460104 458942 454830 468941 485941 494114 518405 563306 586688 600398 615731
11826 615731 646248 675777 716293 752712 754298 742748 753241 775672 783216 806889 838280 862533
11814 862533 877368 892228 907062 914054 919940 942283 969866 1003228 1027150 1034345 1049354 1080830
$$ packed form
11903D53259j6522j9970n843L687l20n175J3613j0335k1531o594l164l756K670
11890C80019R95j6378l220o005j3736r902m165J0212J7446q628R580J6816l465
11877C69569J0275P581M229j3589J9009J6947J9504J1377r621j1523l791J1381
11865D31348J6631k031k7869p660Q285J859J024k7470q077M741j057n034R61n637
11851C80014k101K222j5878r910K224R788j2289j5903j803J9048K9935J6747K3519
11838D25613J9075J5416j162m112J4111J7000Q173K4291M4901K3382J3710J5333
11826F15731L0517K9529M0516L6419J586j1550J0493K2431P544K3673L1391K4253
11814H62533J4835J4860J4834O992N886K2343K7583L3362K3922P195J5009L1476
$$ plain form
11802 1080830 1113467 1133562 1149729 1201967 1258325 1317204 1365058 1417335 1481334 1534376 1572127
11791 1572127 1622327 1691379 1750162 1792402 1828714 1871371 1928707 2000453 2076787 2183204 2300658
11780 2300658 2449620 2663161 2910606 3173689 3435072 3669656 3852259 3963900 3984609 3897113
11770 3897113 3745008 3576903 3435405 3345359 3317235 3325722 3343291 3371812 3422285 3505963 3597656
11759 3597656 3705495 3837892 3994094 4164096 4334144 4439200 4474735 4425394 4293857 4145490
11749 4145490 4020532 3913862 3836236 3762694 3748382 3782933 3866977 3990570 4169768 4423428
11739 4423428 4771755 5203005 5724823 6294872 6848418 7360377 7827099 8206647 8495932
11730 8495932 8705720 8885069 9120789 9539094 10189729 11036591 11981760 12935994 13852724
$$ packed form
11802A080830L2637K0095J6167N2238N6358N8879M7854N2277O3999N3042L7751
11791A572127N0200O9052N8783M2240L6312M2657N7336P1746P6334J06417J17454
11780B300658J48962K13541K47445K63083K61383K34584J82603J11641K0709q7496
11770C897113j52105j68105j41498r0046k8124Q487J7569K8521N0473Q3678R1693
11759C597656J07839J32397J56202J70002J70048J05056L5535m9341j31537j48367
11749D145490j24958j06670p7626p3542j4312L4551Q4044J23593J79198K53660
11739D423428L48327M31250N21818N70049N53546N11959M66722L79548K89285
11730H495932K09788J79349K35720M18305O50635Q46862R45169R54234R16730
$$ plain form
11721 13852724 14747783 15569950 16229792 16712330 17104479 17602226 18255054 18990646 19748671
11712 19748671 20616601 21869291 23870941 26774901 30532872 34951571 39933020 45677424
11704 45677424 52643481 61336106 71849556 83574506 95315078 106207703 116248495
11697 116248495 125202790 131176150 131578237 126151785 118029126 110571599 104430896 98777627
11689 98777627 93557501 89713969 88006192 88414822 90387945 93272281 96578924 100189582
11681 100189582 103902864 107040729 108999441 110201840 112070248 115790714 121092342 126717979
11673 126717979 131709453 135926561 139272949 141147022 141257933 140567831 140737024 143143180
11665 143143180 148510088 157247576 169770633 186617446 208462892 235319000 265103443
$$ packed form
11721A3852724Q95059Q22167O59842M82538L92149M97747O52828P35592P58025
11712A9748671Q67930J252690K001650K903960L757971M418699M981449N744404
11704D5677424O966057Q692625J0513450J1724950J1740572J0892625J0040792
11697A16248495Q954295N973360M02087n426452q122659p457527o140703n653269
11689I8777627n220126l843532j707777M08630J973123K884336L306643L610658
11681A00189582L713282L137865J958712J202399J868408L720466N301628N625637
11673A26717979M991474M217108L346388J874073J10911o90102J69193K406156
11665A43143180N366908Q737488J2523057J6846813K1845446K6856108K9784443
$$ plain form
11658 265103443 293458015 316586662 333641633 344821715 347516662 337144097 313403490
11651 313403490 283300773 255350353 233127599 215867380 201960508 190405956 181184089
11644 181184089 174862593 171442886 170040249 169524973 168903236 167153288 163217648 156794447
11636 156794447 149157990 142344832 137525547 134388831 131990838 129722090 127561562 125465651
11628 125465651 122929504 119441956 115299719 111712867 110026891 110871453 114096443 119094055
11620 119094055 125269121 132577833 141285888 150602259 158106489 161745985 161798930 159643113
11612 159643113 154800574 145029139 130110596 113611969 99647004 89494395 82099285
11605 82099285 75967913 70099978 64361947 59177882 54923952 51641691 49126044 47097748
$$ packed form
11658B65103443K8354572K3128647J7054971J1180082K694947j0372565k3740607
11651C13403490l0102717k7950420k2222754j7260219j3906872j1554552r221867
11644A81184089o321496l419707j402637n15276o21737j749948l935640o423201
11636A56794447p636457o813158m819285l136716k397993k268748k160528k095911
11628A25465651k536147l487548m142237l586852j685976Q44562L224990M997612
11620A19094055O175066P308712Q708055R316371P504230L639496N2945k155817
11612A59643113m842539r771435j4918543j6498627j3964965j0152609p395110
11605H2099285o131372n867935n738031n184065m253930l282261k515647k028296
$$ plain form
11597 47097748 45395410 43964339 42762280 41625616 40444698 39152368 37820382 36555848
11589 36555848 35353429 34092284 32643359 30995377 29365515 27939325 26792587 25890971
11581 25890971 25152739 24456261 23733073 22948143 22056427 21049301 19978763 18901793 17919525
11572 17919525 17064370 16324762 15686632 15145945 14674528 14270643 13941778 13647816 13399340
11563 13399340 13186141 13028690 12924193 12838000 12750632 12638308 12467970 12237450 11956591 11597336
11553 11597336 11168909 10716363 10297928 9931743 9600240 9334245 9125693 8945229 8767565
11544 8767565 8628706 8572942 8586621 8641914 8707560 8751873 8743190 8620207 8336922 7942103 7469583
11533 7469583 6985941 6520143 6103597 5731093 5424952 5202247 5038134 4900569 4777022
$$ packed form
11597D7097748j702338j431071j202059j136664j180918j292330j331986j264534
11589C6555848j202419j261145j448925j647982j629862j426190j146738r01616
11581B5890971p38232o96478p23188p84930q91716j007126j070538j076970r82268
11572A7919525q55155p39608o38130n40687m71417m03885l28865k93962k48476
11563A3399340k13199j57451j04497q6193q7368j12324j70338k30520k80859l59255
11553A1597336m28427m52546m18435l66185l31503k65995k08552j80464j77664
11544H767565j38859n5764J3679N5293O5646M4313q683j22983k83285l94819m72520
11533G469583m83642m65798m16546l72504l06141k22705j64113j37565j23547
$$ plain form
11524 4777022 4659421 4549598 4443573 4327486 4221734 4088914 3948299 3814107 3672209
11515 3672209 3525086 3407721 3290449 3202637 3131818 3049083 2967633 2876956 2792471 2709660 2635426
11504 2635426 2571982 2507186 2454875 2426005 2374791 2319715 2293687 2250953 2194709 2130028 2043744
11493 2043744 1972423 1898921 1827507 1750817 1722215 1692192 1635973 1596902 1562225 1507594 1466965
11482 1466965 1434688 1412993 1389853 1373751 1342282 1312278 1289375 1285398 1282675 1275503 1264867 1259909
11470 1259909 1259485 1257587 1256609 1233804 1215846 1197220 1163433 1138531 1111568 1090546 1078642 1068970
11458 1068970 1052006 1041352 1032915 1021425 1001142 988760 958231 940649 929236 923269 932198 926799
11446 926799 893706 873263 867995 857399 835848 827893 812170 787387 766843 758774 738851 709716
$$ packed form
11524D777022j17601j09823j06025j16087j05752j32820j40615j34192j41898
11515C672209j47123j17365j17272q7812p0819q2735q1450r0677q4485q2811p4234
11504B635426o3444o4796n2311k8870n1214n5076k6028m2734n6244o4681q6284
11493B043744p1321p3502p1414p6690k8602l0023n6219l9071l4677n4631m0629
11482A466965l2277k1695k3140j6102l1469l0004k2903l977k723p172j0636m958
11470A259909m24j898r78k2805j7958j8626l3787k4902k6963k1022j1904r672
11458A068970j6964j0654q437j1490k0283j2382l0529j7582j1413n967Q929n399
11446I26799l3093k0443n268j0596k1551p955j5723k4783k0544q069j9923k9135
$$ plain form
11434 709716 702786 713553 720649 733432 741352 746245 750148 743427 748704 739751 716388 696724 684913
11421 684913 670716 653672 638341 645532 637498 620243 593261 576659 570107 569155 561674 527730 529145
11408 529145 546853 557069 548932 540369 534710 528233 535456 534527 539735 527530 511640 499954 494109
11395 494109 478260 465781 459480 459880 464891 445416 435150 420407 395379 379058 372611 370006 370170
11382 370170 372238 374245 361080 331979 327874 320412 309838 289402 298812 312410 318455 319065 318235
11369 318235 313578 316255 306811 283915 276313 286853 293372 299407 295341 287826 276843 270887 260548
11356 260548 241218 237756 250456 241791 232266 214949 211152 216483 222937 229759 213071 189625 171579
11343 171579 168273 163244 161894 159296 169849 175463 184837 188470 159007 142974 142113 145391 143417 148389
$$ packed form
11434G09716o930J0767P096J2783P920M893L903o721N277q953k3363j9664j1811
11421F84913j4197j7044j5331P191q034j7255k6982j6602o552r52p481l3944J415
11408E29145J7708J0216q137q563n659o477P223r29N208j2205j5890j1686n845
11395D94109j5849j2479o301M00N011j9475j0266j4743k5028j6321o447k605J64
11382C70170K068K007j3165k9101m105p462j0574k0436R410J3598O045O10q30
11369C18235m657K677r444k2896p602J0540O519O035m066p515j0983n956j0339
11356B60548j9330l462J2700q665r525j7317l797N331O454O822j6688k3446j8046
11343A71579l306n029j350k598J0553N614R374L633k9463j6033q61L278j974M972
$$ plain form
11329 148389 139308 140131 124410 123997 131756 125941 110347 107416 124146 116948 117705 121571 123814 121470
11315 121470 117808 129370 119263 116530 115527 100285 104751 121890 105167 100913 100823 106432 113603
11302 113603 124890 122526 113075 108155 109194 111261 119176 132743 122229 109466 99089 97663 101663
11289 101663 84442 105697 127963 126262 130583 143126 146888 136045 129845 132322 136266 133976 128923
11276 128923 136781 143717 157974 191794 210415 200770 183533 188391 213879 222355 215210 232697 273835
11263 273835 304390 337738 376442 439371 534778 627314 692053 740980 761808 750119 717958
11252 717958 672676 618326 568680 540814 508377 498635 495522 499963 506846 493323 503283 513940
11240 513940 526554 537028 534347 531845 578916 630397 679156 704419 722401 742765 770381 782431
$$ packed form
11329A48389r081Q23j5721m13P759n815j5594k931J6730p198P57L866K243k344
11315A21470l662J1562j0107k733j003j5242M466J7139j6723m254r0N609P171
11302A13603J1287k364r451m920J039K067P915J3567j0514j2763j0377j426M000
11289A01663j7221K1255K2266j701M321J2543L762j0843o200K477L944k290n053
11276A28923P858O936J4257L3820J8621r645j7237M858K5488Q476p145J7487M1138
11263B73835L0555L3348L8704O2929R5407R2536O4739M8927K0828j1689l2161
11252G17958m5282n4350m9646k7866l2437r742l113M441O883j3523R960J0657
11240E13940J2614J0474k681k502M7071N1481M8759K5263J7982K0364K7616J2050
$$ plain form
11228 782431 795931 806429 813953 807077 785939 767100 791400 840240 926296 1060877 1218026
11217 1218026 1430605 1671488 1885966 2045134 2151937 2174082 2082390 1884138 1637726 1409677
11207 1409677 1227947 1070350 933823 851084 808939 782483 757940 746687 738918 737848 729086
11196 729086 721818 722384 711861 723365 741669 737300 730792 720775 714448 713106 704187 697208 698365
11183 698365 692985 690155 684637 667355 657357 677351 712923 754123 817162 874342 928793 979604
11171 979604 991072 982478 925202 820597 715603 617002 526612 469397 416438 373992 347796
11160 347796 334073 330431 320110 307303 301728 277906 269680 259104 229946 210716 203377 208735
11148 208735 201901 183442 178057 196543 206080 209039 205178 210033 198049 192530 197992 203438 181629
$$ packed form
11228G82431J3500J0498P524o876k1138j8839K4300M8840Q6056J34581J57149
11217A218026K12579K40883K14478J59168J06803K2145r1692j98252k46412k28049
11207A409677j81730j57597j36527q2739m2145k6456k4543j1253p769j070q762
11196G29086p268N66j0523J1504J8304m369o508j0017o327j342q919o979J157
11183F98365n380k830n518j7282r998J9994L5572M1200O3039N7180N4451N0811
11171I79604J1468q594n7276j04605j04994r8601r0390n7215n2959m2446k6196
11160C47796j3723l642j0321j2807n575k3822q226j0576k9158j9230p339N358
11148B08735o834j8459n385J8486R537K959l861M855j1984n519N462N446k1809
$$ plain form
11135 181629 163853 164163 165789 167581 168008 157804 147902 148610 147043 130794 121940 124747 118627 123967
11121 123967 109690 101400 108617 104595 99697 105183 116138 123841 124307 123234 133882 120987 114608
11108 114608 92978 81142 86455 79795 59091 59052 57158 44931 42853 50086 53389 73553 73241 54528
11094 54528 42540 35639 17577 21065 24272 24135 45518 57183 53963 31761 26913 29607 41633
11081 41633 34139 20325 33741 39020 48802 60797 55033 44970 45374 34800 23997 17805 20501
11068 20501 23757 15518 17654 36316 28222 15764 18799 19925 22914 24745 21063 12927 19822 24879
11054 24879 20188 36525 58258 41240 21594 14758 11863 16998 16363 10511 13507 19437 31468
11041 31468 29488 33619 32965 31986 26215 29232 30479 33719 33032 27700 45383 53619 35495 22806
$$ packed form
11135A81629j7776L10J626J792M27j0204r902P08j567j6249q854K807o120N340
11121A23967j4277q290P217m022m898N486J0955P703M66j073J0648j2895o379
11108A14608k1630j1836N313o660k0704l9j894j2227k078P233L303K0164l12j8713
11094E4528j1988o901j8062L488L207j37K1383J1665l220k2202m848K694J2026
11081D1633p494j3814J3416N279R782J1995n764j0063M04j0574j0803o192K696
11068B0501L256q239K136J8662q094j2458L035J126K989J831l682q136O895N057
11054B4879m691J6337K1733j7018j9646o836k895N135o35n852K996N930J2031
11041C1468j980M131o54r79n771L017J247L240o87n332J7683Q236j8124j2689
$$ plain form
11027 22806 28786 38337 37546 29666 20539 19512 22403 27435 18209 16935 14902 22558 46074 47955
11013 47955 56572 49240 33930 791 -6719 3088 -6226 -9717 -3518 11960 28848 21981 1973
11000 1973 -227 14855 31155 38549 38349 38994 18554 917 8426 7997 1715 -3021 -2659 29732
10986 29732 39095 31871 21404 38579 48858 43319 42667 37187 21261 17107 8637 26618 36441
10973 36441 33682 30426 32506 43438 51467 38808 37756 30364 30044 24134 19558 17656 17126 16917 9942
10958 9942 20048 26209 24970 25949 30739 33942 31796 17093 5919 988 7145 28955 24581 33527
10944 33527 31736 21180 24190 25308 26395 28078 32625 20134 3839 4138 7858 11063 23594 14120
10930 14120 -896 4540 19891 9624 6698 -2688 -3195 3161 -1717 712 413 10978 13802 25600
$$ packed form
11027B2806N980R551p91p880r127j027K891N032r226j274k033P656K3516J881
11013D7955Q617p332j5310l3139p510R807r314l491O199J5478J6888o867k0008
11000A973k200J5082J6300P394k00O45k0440j7637P509m29o282m736L62L2391
10986B9732R363p224j0467J7175J0279n539o52n480j5926m154q470J7981R823
10973C6441k759l256K080J0932Q029j2659j052p392l20n910m576j902n30k09o975
10958I942J0106O161j239R79M790L203k146j4703j1174m931O157K1810m374Q946
10944C3527j791j0556L010J118J087J683M547j2491j6295K99L720L205J2531r474
10930A4120j5016N436J5351j0267k926r386n07O356m878K429k99J0565K824J1798
$$ plain form
10916 25600 21161 30444 28626 26624 28885 24031 29197 22926 22475 11895 9857 13401 21397 33638
10902 33638 41163 32267 28662 23662 14163 8841 -1892 1444 19300 42476 59233 73746 84104
10889 84104 56834 21958 905 -1935 9874 23103 13142 16810 44036 60493 42874 7345
10877 7345 -4704 -11530 -10939 -5548 -12486 5102 11007 -1666 5505 29328 48121 54365 41470
10864 41470 29208 16639 27894 30447 27045 18626 25072 15057 -6147 -1826 2356 -1845 -16277
10851 -16277 -19266 -9497 14923 20016 8513 1393 16060 37613 43891 32498 23269 25531 33438
10838 33438 28576 16178 1642 -16222 -9920 592 5708 12712 27079 41575 53308 56570 74351
10825 74351 101206 113660 102171 105415 90916 84825 64004 24895 8299 12891 -1276 173
$$ packed form
10916B5600m439R283j818k002K261m854N166o271m51j0580k038L544P996J2241
10902C3638P525q896l605n000r499n322j0733L336J7856K3176J6757J4513J0358
10889H4104k7270l4876k1053k840J1809J3229r961L668K7226J6457j7619l5529
10877G345j2049o826N91N391o938J7588N905j2673P171K3823J8793O244j2895
10864D1470j2262j2569J1255K553l402q419O446j0015k1204M321M182m201j4432
10851a6277k989R769K4420N093j1503p120J4667K1553O278j1393r229K262P907
10838C3438m862j2398j4536j7864O302J0512N116P004J4367J4496J1733L262J7781
10825G4351K6855J2454j1489L244j4499o091k0821l9109j6596M592j4167J449
$$ plain form
10813 173 8076 17035 24966 36071 46293 56396 57433 56863 45222 33937 35692 40055 34229 16216
10799 16216 16409 13776 12941 23864 13418 4740 8777 -1252 -1264 -4742 12028 33621 36962 22530
10785 22530 34909 53722 66612 72327 68576 53860 45811 56263 72581 66262 57115 63726 76785
10772 76785 92320 105643 121572 138306 157218 167808 153907 117483 63473 36089 27556 11956
10760 11956 9497 27495 41627 35827 42380 53252 43347 27523 38361 50138 60751 42894
10748 42894 33709 36560 26340 6350 22856 49958 56569 63007 57843 55152 64000 68595 67537
10735 67537 64385 36899 37703 39147 47473 37263 22521 15640 17409 22655 27550 15423 1989
10722 1989 16293 20963 34277 42240 25123 8201 11459 26428 34449 29425 32818 35146 26969
$$ packed form
10813A73P903Q959P931J1105J0222J0103J037n70j1641j1285J755M363n826j8013
10799A6216J93k633q35J0923j0446q678M037j0029j2l478J6770K1593L341j4432
10785B2530J2379J8813J2890N715l751j4716q049J0452J6318o319r147O611J3059
10772G6785J5535J3323J5929J6734J8912J0590j3901l6424n4010k7384q533j5600
10760A1956k459J7998J4132n800O553J0872r905j5824J0838J1777J0613j7857
10748D2894r185K851j0220j9990J6506K7102O611O438n164k691Q848M595j058
10735F7537l152k7486Q04J444Q326j0210j4742o881J769N246M895j2127j3434
10722A989J4304M670J3314P963j7117j6922L258J4969Q021n024L393K328q177
$$ plain form
10709 26969 29805 50851 75518 70824 51119 48673 54157 37013 31012 19923 20520 28298 9079
10696 9079 -874 -5577 986 29900 33291 22219 15679 28772 35676 34964 26759 39856 32364 30191
10682 30191 34295 28365 33637 49264 40545 39015 32041 37650 36860 41497 45987 48763 44854 27952
10668 27952 23943 22694 22635 10411 12803 19681 22611 31541 37095 49359 44755 35733 42584 41054
10654 41054 46194 42282 35672 27960 13706 31239 61391 68021 64423 60558 38338 29891 40239
10641 40239 41213 47384 52020 54885 56663 54652 64534 64729 56169 55772 51565 50640 38144 25954 8671
10626 8671 15984 30079 38197 34566 39716 21300 14301 18370 35322 55065 50763 60141 70853
10613 70853 64194 38295 19045 35140 53756 67776 70545 67741 53437 56059 69397 71087 61576
$$ packed form
10709B6969K836K1046K4667m694j9705k446N484j7144o001j1089N97P778j9219
10696I079r953m703O563K8914L391j1072o540J3093O904p12q205J3097p492k173
10682C0191M104n930N272J5627q719j530o974N609p90M637M490K776l909j6902
10668B7952m009j249n9j2224K392O878K930Q930N554J2264m604r022O851j530
10654D1054N140l912o610p712j4254J7533L0152O630l598l865k2220q447J0348
10641D0239R74O171M636K865J778k011R882J95q560l97m207r25j2496j2190j7283
10626H671P313J4095Q118l631N150j8416o999M069J6952J9743m302R378J0712
10613G0853o659k5899j9250J6095J8616J4020K769k804j4304K622J3338J690r511
$$ plain form
10600 61576 58144 53746 63941 76617 74884 72279 78387 65807 62412 57189 45428 50723 51251 61626
10586 61626 68830 51108 44548 61750 70057 54870 54498 52642 57667 52765 46788 34239 42591 54236
10572 54236 44670 50704 43863 26118 30799 43546 47475 49177 57947 47023 47779 49387 45376 35167
10558 35167 33306 26929 13889 17750 23225 40034 47374 52733 48522 31284 10350 10395 9522 20920
10544 20920 21662 33321 30923 27295 39900 56577 58633 56556 44605 40124 46962 67273 54182
10531 54182 39681 50800 60862 76162 73942 83943 84468 89229 75921 70949 74372 67641 42221
10518 42221 42335 39738 39494 61402 70334 77646 93850 85738 64978 49769 53146 46608 47235 49405
10504 49405 55509 45840 44213 51889 49093 50402 51066 51796 70199 77229 68247 55528 45489 34907
$$ packed form
10600F1576l432m398J0195J2676j733k605O108j2580l395n223j1761N295N28J0375
10586F1626P204j7722o560J7202Q307j5187l72j856N025m902n977j2549Q352J1645
10572E4236r566O034o841j7745M681J2747L929J702Q770j0924P56J608m011j0209
10558C5167j861o377j3040L861N475J6809P340N359m211j7238k0934M5q73J1398
10544B0920P42J1659k398l628J2605J6677K056k077j1951m481O838K0311j3091
10531E4182j4501J1119J0062J5300k220J0001N25M761j3308m972L423o731k5420
10518D2221J14k597k44K1908Q932P312J6204q112k0760j5209L377o538O27K170
10504D9405O104r669j627P676k796J309O64P30J8403P030q982j2719j0039j0582
$$ plain form
10490 34907 39536 45437 64877 83711 75484 70193 70884 74699 90980 103356 98566 97347 106528 108090
10476 108090 108050 94879 103893 101343 95170 87538 75168 62751 61989 57348 52652 42018 43853 55133
10462 55133 57922 64453 76981 71077 64686 46052 47818 44159 56872 70866 73747 94098 103382
10449 103382 108892 132584 157510 175026 188254 201611 222012 232128 227229 192347 164582 144065
10437 144065 115327 104653 119074 107317 82153 97204 103820 93872 91560 87524 76660 76050 71387
10424 71387 68104 95385 104238 106028 103579 71953 61505 52301 67331 92478 109524 113641 107209
10411 107209 96911 96437 93954 83657 94005 102462 90216 85222 94230 86824 81721 85838 88727
10398 88727 101979 115386 102906 94136 87888 91948 96767 98021 107998 108158 112429 117855 114103 97302
$$ packed form
10490C4907M629N901J9440J8834q227n291O91L815J6281J2376m790j219R181J562
10476A08090m0j3171R014k550o173p632j2370j2417p62m641m696j0634J835J1280
10462E5133K789O531J2528n904o391j8634J766l659J2713J3994K881K0351R284
10449A03382N510K3692K4926J7516J3228J3357K0401J0116m899l4882k7765k0517
10437A44065k8738j0674J4421j1757k5164J5051O616r948k312m036j0864o10m663
10424G1387l283K7281Q853J790k449l1626j0448r204J5030K5147J7046M117o432
10411A07209j0298m74k483j0297J0348Q457j2246m994R008p406n103M117K889
10398H8727J3252J3407j2480q770o248M060M819J254R977J60M271N426l752j6801
$$ plain form
10384 97302 90754 95636 106203 118694 120641 111949 106162 112246 126015 122159 105071 105410 121141
10371 121141 132360 113906 98328 113631 125039 126573 109255 100553 113761 132796 129298 115342
10359 115342 127128 132460 123169 136214 147240 170434 173966 161998 149787 178914 186467 175023
10347 175023 168559 163531 158522 140998 141885 151036 153370 143657 123459 125246 120745 117296 121553 129234
10333 129234 146858 160218 146792 141206 148632 141241 145718 142678 149393 153038 146646 143366 135445
10320 135445 150332 154750 163812 173112 173579 197894 201739 195499 197493 190205 174160 172152 160156
10307 160156 142852 137353 147630 149773 154825 176446 184054 188195 191370 179709 174790 181776 191431
10294 191431 182896 178817 174079 177115 167111 164978 159351 158912 166334 160516 145697 136080 146260 157291
$$ packed form
10384I7302o548M882J0567J2491J947q692n787O084J3769l856j7088L39J5731
10371A21141J1219j8454j5578J5303J1408J534j7318q702J3208J9035l498j3956
10359A15342J1786N332r291J3045J1026K3194L532j1968j2211K9127P553j1444
10347A75023o464n028n009j7524Q87R151K334r713k0198J787m501l449M257P681
10333A29234J7624J3360j3426n586P426p391M477l040O715L645o392l280p921
10320A35445J4887M418R062R300M67K4315L845o240J994p288j6045k008j1996
10307A60156j7304n499J0277K143N052K1621P608M141L175j1661m919O986R655
10294A91431q535m079m738L036j0004k133n627m39P422n818j4819r617J0180J1031
$$ plain form
10280 157291 139433 129876 140585 135971 146247 161901 154982 174958 179565 181685 204480 205228 184900
10267 184900 187061 201860 201200 190894 196388 193711 183519 189070 185091 177474 161467 147370 180250
10254 180250 197871 213703 214344 201967 201323 234317 254113 277251 284980 278151 286128 328749 368172
10241 368172 388188 419115 468174 542104 678968 880064 1142802 1435225 1758688 2151454
10231 2151454 2595730 2952056 3116606 3198673 3288540 3319854 3099626 2670577 2280546 1981888
10221 1981888 1705049 1382360 1090572 896003 775831 684952 609765 573821 555094 540925
10211 540925 522600 519525 515811 505291 501934 481850 469598 475799 492710 503154 537994 570252
10199 570252 588541 611649 633175 630660 608901 590230 547963 522501 482469 432105 412172 379391
$$ packed form
10280A57291j7858r557J0709m614J0276J5654o919J9976M607K120K2795P48k0328
10267A84900K161J4799o60j0306N494k677j0192N551l979p617j6007j4097L2880
10254A80250J7621J5832O41j2377o44L2994J9796K3138P729o829P977M2621L9423
10241C68172K0016L0927M9059P3930J36864K01096K62738K92423L23463L92766
10231B151454M44276L56326J64550Q2067Q9867L1314k20228m29049l90031k98658
10221A981888k76839l22689k91788j94569j20172r0879p5187l5944j8727j4169
10211E40925j8325l075l714j0520l357k0084j2252O201J6911J0444L4840L2258
10199E70252J8289K3108K1526k515k1759j8671m2267k5462m0032n0364j9933l2781
$$ plain form
10187 379391 359220 358590 360907 352019 354625 333808 327657 319674 322946 312170 289537 296738 307942
10174 307942 314064 314127 308741 305560 311185 312655 309734 317608 334645 353237 369186 409369 475252
10161 475252 548622 640501 736879 839363 932070 1038503 1134671 1201263 1241668 1246378 1195321
10150 1195321 1124362 1039412 931791 846430 777528 724734 699156 661440 619577 587608 553681
10139 553681 500663 467515 439260 412110 412166 408239 413132 412212 411067 413375 419924 431481 427708 424448
10125 424448 428118 437062 442099 447720 472161 522182 603366 707987 849524 984834 1131145
10114 1131145 1290455 1450226 1586653 1683535 1713469 1716116 1695807 1632099 1548551 1467945 1376290
10103 1376290 1303448 1257258 1213684 1144858 1064269 974804 883202 788183 703802 646330 604433
$$ packed form
10187C79391k0171o30K317q888K606k0817o151p983L272j0776k2633P201J1204
10174C07942O122O3n386l181N625J470k921P874J7037J8592J5949M0183O5883
10161D75252P3370R1879R6378J02484R2707J06433R6168O6592M0405M710n1057
10150A195321p0959q4950j07621q5361o8902n2794k5578l7716m1863l1969l3927
10139E53681n3018l3148k8255k7150N6l927M893r20j145K308O549J1557l773l260
10125D24448L670Q944N037N621K4441N0021Q1184J04621J41537J35310J46311
10114A131145J59310J59771J36427R6882K9934K647k0309o3708q3548q0606r1655
10103A376290p2842m6190m3574o8826q0589q9465r1602r5019q4381n7472m1897
$$ plain form
10092 604433 582878 566202 541454 516483 506642 481008 465001 461137 466281 477971 497891 496656
10080 496656 487001 472285 488201 505441 546694 608279 658517 721855 797334 879773 974490 1080496
10068 1080496 1180967 1275707 1359077 1405130 1437210 1457142 1441718 1391942 1300354 1171077 1050477
10057 1050477 962185 899910 831276 766113 695660 628627 580374 550959 543637 539943 536648 536417
10045 536417 552569 617730 743346 873484 942338 961504 989904 1023215 1025136 875660 674818
10034 674818 570167 537055 511329 497585 480715 479521 487876 522116 560711 593858 631856 671846
10022 671846 717737 752336 756193 746756 709640 657271 620871 564441 507754 461650 424182 413513
10010 413513 407325 397746 410088 412633 384146 341250 324278 330722 341315 336385 327970 324003 328800
$$ packed form
10092F04433k1555j6676k4748k4971r841k5634j6007l864N144J1690J9920j235
10080D96656r655j4716J5916J7240M1253O1585N0238O3338P5479Q2439R4717J06006
10068A080496J00471R4740Q3370M6053L2080J9932j5424m9776r1588j29277j20600
10057A050477q8292o2275o8634o5163p0453o7033m8253k9415p322l694l295k31
10045E36417J6152O5161J25616J30138O8854J9166K8400L3311J921j49476k00842
10034F74818j04651l3112k5726j3744j6870j194Q355L4240L8595L3147L7998L9990
10022F71846M5891L4599L857r437l7116n2369l6400n6430n6687m6104l7468j0669
10010D13513o188r579J2342K545k8487m2896j6972O444J0593m930q415l967M797
$$ plain form
9997 328800 329548 321128 327269 338922 332773 332161 352295 365516 387449 374390 369302 383700 403900
9984 403900 415743 412543 389337 377004 369140 380339 391126 387674 378211 388448 380179 384547 389695
9971 389695 413998 433099 445745 451978 459239 472525 471393 492258 508501 511005 515679 529731 565638
9958 565638 615151 693689 806006 929839 1049255 1153671 1254646 1338214 1420842 1487698 1554551
9947 1554551 1662789 1811624 1938283 2048710 2153666 2237067 2235965 2087231 1840651 1671301
9937 1671301 1593950 1543267 1512704 1485546 1446758 1354677 1230754 1085748 982200 911765 854091
9926 854091 809516 773038 739889 713655 686759 675729 666950 648007 626234 631638 635492 646314
9914 646314 636371 626875 631322 636325 645460 648203 640074 636407 640336 652467 651019 637589 640955 649865
$$ packed form
9997C28800P48q420O141J1653o149o12K0134J3221K1933j3059n088J4398K0200
9984D03900J1843l200k3206j2333p864J1199J0787l452r463J0237q269M368N148
9971C89695K4303J9101J2646O233P261J3286j132K0865J6243K504M674J4052L5907
9958E65638M9513P8538J12317J23833J19416J04416J00975Q3568Q2628O6856O6853
9947A554551J08238J48835J26659J10427J04956Q3401j102j48734k46580j69350
9937A671301p7351n0683l0563k7158l8788r2081j23923j45006j03548p0435n7674
9926H54091m4575l6478l3149k6234k6896j1030q779j8943k1773N404L854J0822
9914F46314r943r496M447N003R135K743q129l667L929J2131j448j3430L366Q910
$$ plain form
9900 649865 630167 607419 575068 552729 550481 552311 550236 540371 520215 528402 536591 530104 525181
9887 525181 532390 529226 529989 524704 504079 485651 487180 519589 541983 538493 556632 580572 615405
9874 615405 628196 639671 653698 658680 680110 709145 720413 744155 765955 782765 814645 835543
9862 835543 857532 878502 877915 882088 905716 926222 932537 897156 887571 888746 898481 912642 933131
9849 933131 957943 997667 1029011 1054815 1067616 1114928 1144623 1180611 1218700 1241527 1254354 1290715
9837 1290715 1324215 1345207 1366996 1399703 1440004 1484908 1534330 1584469 1627763 1677097 1727397
9826 1727397 1794661 1858466 1946620 2050310 2150125 2253071 2375805 2503483 2640348 2785276
9816 2785276 2970817 3207984 3479749 3739323 4009508 4285072 4516746 4686265 4811183 4933991
$$ packed form
9900F49865j9698k2748l2351k2339k248J830k075r865k0156Q187Q189o487m923
9887E25181P209l164P63n285k0625j8428J529L2409K2394l490J8139K3940L4833
9874F15405J2791J1475J4027M982K1430K9035J1268K3742K1800J6810L1880K0898
9862H35543K1989K0970n87M173K3628K0506O315l5381r585J175R735J4161K0489
9849I33131K4812L9724L1344K5804J2801M7312K9695L5988L8089K2827J2827L6361
9837A290715L3500K0992K1789L2707M0301M4904M9422N0139M3294M9334N0300
9826A727397O7264O3805Q8154J03690R9815J02946J22734J27678J36865J44928
9816B785276J85541K37167K71765K59574K70185K75564K31674J69519J24918J22808
$$ plain form
9806 4933991 5105877 5314407 5560645 5841901 6105681 6310114 6386893 6248498 5939976 5615157
9796 5615157 5340131 5133264 4954352 4801046 4703813 4676760 4716750 4792067 4910687 5109424
9786 5109424 5402900 5828300 6422035 7260633 8385373 9721961 11138944 12564342 13928796
9777 13928796 15041876 15644991 15652406 15228584 14533275 13660344 12673971 11681573 10834919 10189541
9767 10189541 9690596 9253546 8842225 8518305 8354629 8369242 8518404 8780023 9167200 9661156
9757 9661156 10214963 10814526 11446062 12098413 12802394 13568430 14509403 15748046 17478825
9748 17478825 19972995 23477168 27997370 33264942 39014433 45324313 52428990 60457178
9740 60457178 69715177 80847153 93705222 106498642 117855472 128375223 137790515
$$ packed form
9806D933991J71886K08530K46238K81256K63780K04433P6779j38395l08522l24819
9796E615157k75026k06867j78912j53306r7233k7053L9990P5317J18620J98737
9786E109424K93476M25400N93735Q38598J124740J336588J416983J425398J364454
9777A3928796J113080O03115P415m23822o95309q72931r86373r92398q46654o45378
9767A0189541m98945m37050m11321l23920j63676J4613J49162K61619L87177M93956
9757I661156N53807N99563O31536O52351P03981P66036R40973J238643J730779
9748A7478825K494170L504173M520202N267572N749491O309880P104677Q028188
9740F0457178R257999J1131976J2858069J2793420J1356830J0519751R415292
$$ plain form
9733 137790515 142856966 139770199 129067907 116097202 103861545 92502354 82454368
9726 82454368 74970237 71312325 71942294 76471290 84020503 93829100 105598600 118831746
9718 118831746 132149552 143803548 152971105 159821813 164355335 165940725 164539702 161128932
9710 161128932 156337066 150654493 144656558 138927242 133973185 130130241 128129316 129214967
9702 129214967 134430381 144221039 159130417 180414078 209804807 247835418 290365698
9695 290365698 328311999 355066997 371617505 379403323 373053649 345261537 299532284
9688 299532284 252549179 215441342 189070576 170889105 158445258 150337096 145775191
9681 145775191 144247751 145384403 148545160 152921746 158124586 163954759 170111470 176101141
$$ packed form
9733A37790515N066451l086767j0702292j2970705j2235657j1359191j0047986
9726H2454368p484131l657912O29969M528996P549213R808597J1769500J3233146
9718A18831746J3317806J1653996R167557O850708M533522J585390j401023l410770
9710A61128932m791866n682573n997935n729316m954057l842944k000925J085651
9702A29214967N215414R790658J4909378K1283661K9390729L8030611M2530280
9695B90365698L7946301K6754998J6550508P785818o349674k7792112m5729253
9688B99532284m6983105l7107837k6370766j8181471j2443847q108162m561905
9681A45775191j527440J136652L160757M376586N202840N830173O156711N989671
$$ plain form
9673 176101141 180937108 183629150 183534808 180135494 173429718 164078425 152481535 138991609
9665 138991609 124760895 111146770 99753205 92084908 88528919 88778235 92356626 98646676
9657 98646676 107162535 117758658 129958161 141824227 150053797 152864223 151643587 147757381
9649 147757381 140462112 128359279 113268397 99933663 90024990 82531868 76417602 70767320
9641 70767320 64821787 58423347 52316274 47222859 43331430 40349274 37958951 36018962
9633 36018962 34404081 32971223 31645910 30368569 29151028 27968918 26832824 25734871
9625 25734871 24711622 23841076 23155384 22617494 22219579 21961339 21815295 21771646 21848943 22088066
9615 22088066 22480058 22994048 23536499 23999365 24355815 24470749 24123195 23241583 21948236
$$ packed form
9673A76101141M835967K692042r4342l399314o705776r351293j1596890j3489926
9665A38991609j4230714j3614125j1393565p668297l555989K49316L578391O290050
9657I8646676Q515859J0596123J2199503J1866066Q229570K810426j220636l886206
9649A47757381p295269j2102833j5090882j3334734r908673p493122o114266n650282
9641G0767320n945533o398440o107073n093415l891429k982156k390323j939989
9633C6018962j614881j432858j325313j277341j217541j182110j136094j097953
9625B5734871j023249q70546o85692n37890l97915k58240j46044m3649P7297K39123
9615B2088066L91992N13990N42451M62866L56450J14934l47554q81612j293347
$$ plain form
9606 21948236 20397914 18716028 17079793 15706581 14679751 13897169 13258140 12708304 12243956
9597 12243956 11837165 11453047 11089720 10780615 10530211 10359958 10258949 10221728 10236065 10290257
9587 10290257 10378500 10457575 10438379 10299211 10104107 9856430 9556109 9183755 8778864 8423163
9577 8423163 8163589 7982555 7804570 7586501 7301293 6954519 6586938 6198624 5844629 5555625
9567 5555625 5311975 5087461 4859502 4679306 4519086 4366909 4226890 4103789 4005159 3893877
9557 3893877 3767559 3642502 3530037 3434725 3331719 3232478 3136304 3043183 2948630 2867624 2794314
9546 2794314 2735317 2671917 2596028 2527010 2465965 2373961 2324237 2283676 2212099 2153075 2116403
9535 2116403 2071975 2052115 2038573 1997217 1955196 1911357 1872493 1844345 1791956 1750432 1692709
$$ packed form
9606B1948236j550322j681886j636235j373212j026830p82582o39029n49836m64348
9597A2243956m06791l84118l63327l09105k50404j70253j01009l7221J4337N4192
9587A0290257Q8243P9075j9196j39168j95104k47677l00321l72354m04891l55701
9577H423163k59574j81034j77985k18069k85208l46774l67581l88314l53995k89004
9567E555625k43650k24514k27959j80196j60220j52177j40019j23101r8630j11282
9557C893877j26318j25057j12465r5312j03006r9241r6174r3121r4553q1006p3310
9546B794314n8997o3400p5889o9018o1045r2004m9724m0561p1577n9024l6672
9535B116403m4428j9860j3542m1356m2021m3839l8864k8148n2389m1524n7723
$$ plain form
9524 1692709 1654933 1638540 1617291 1594268 1567506 1528109 1487172 1455822 1437727 1405997 1388550
9513 1388550 1387276 1389492 1395859 1372599 1371178 1385549 1395554 1395400 1375617 1353362 1338196 1324447 1310365
9500 1310365 1279533 1238341 1203466 1177785 1163543 1161205 1175851 1168898 1162357 1162904 1144622 1124852
9488 1124852 1100647 1101930 1106149 1099651 1081675 1071457 1052432 1040917 1020639 1004820 984357 972377
9476 972377 975018 953270 936671 942359 922606 908185 908572 924411 926443 930776 935476 940286 947286
9463 947286 939099 906851 875628 869296 866840 857545 849886 817525 806405 810513 812232 818457 811495
9450 811495 821938 808300 799086 779857 773206 774559 763442 753380 758772 755740 764296 758272 767328
9437 767328 760714 735992 708550 705545 705965 708164 695028 677782 664406 648298 645083 652499 640535
$$ packed form
9524A692709l7776j6393k1249k3023k6762l9397m0937l1350j8095l1730j7447
9513A388550j274K216O367k3260j421J4371J0005j54j9783k2255j5166j3749j4082
9500A310365l0832m1192l4875k5681j4242k338J4646o953o541N47j8282j9770
9488A124852k4205J283M219o498j7976j0218j9025j1515k0278j5819k0463j1980
9476I72377K641k1748j6599N688j9753j4421L87J5839K032M333M700M810P000
9463I47286q187l2248l1223o332k456r295p659l2361j1120M108J719O225o962
9450H11495J0443j3638r214j9229o651J353j1117j0062N392l032Q556o024R056
9437G67328o614k4722k7442l005M20K199j3136j7246j3376j6108l215P416j1964
$$ plain form
9424 640535 637006 625316 630409 637347 633514 632635 618807 605164 606111 614726 592704 581240 574393 564902
9410 564902 559813 547567 557084 570062 578337 575027 569817 572254 582054 586202 587644 597767 594324 581519
9396 581519 579024 558901 545396 555592 562515 550813 546387 545648 534601 524846 527913 525874 528976
9383 528976 538217 536318 535456 528751 514745 511608 517975 520188 533605 537813 543859 548799 558036 555987
9369 555987 568876 576445 608110 653969 702163 737310 765712 807818 848341 896639 913343 908029
9357 908029 904066 887317 859044 813749 752425 707675 680191 653716 627239 611153 621721 627110
9345 627110 627941 607400 600034 601463 604753 594469 600830 620607 627186 638360 638443 653903 687738 709987
9331 709987 736348 756044 762387 790824 833726 890703 954963 1018297 1112074 1216317 1335056
$$ packed form
9424F40535l529j1690N093O938l833q79j3828j3643R47Q615k2022j1464o847r491
9410E64902n089j2246R517J2978Q275l310n210K437R800M148J442J0123l443j2805
9396E81519k495k0123j3505J0196O923j1702m426p39j1047r755L067k039L102
9383E28976R241j899q62o705j4006l137O367K213J3417M208O046M940R237k049
9369E55987J2889P569L1665M5859M8194L5147K8402M2106M0523M8298J6704n314
9357I08029l963j6749k8273m5295o1324m4750k7484k6475k6477j6086J0568N389
9345F27110Q31k0541p366J429L290j0284O361J9777O579J1174Q3J5460L3835K2249
9331G09987K6361J9696O343K8437M2902N6977O4260O3334R3777J04243J18739
$$ plain form
9320 1335056 1465400 1574572 1671040 1754331 1838466 1891132 1885453 1853040 1786426 1737934 1681015
9309 1681015 1611243 1508825 1417075 1322597 1234548 1168523 1134500 1116552 1108950 1100134 1093880 1077963
9297 1077963 1070236 1079948 1086158 1073860 1055922 1055865 1050166 1038073 1034119 1040629 1054335 1082883 1103927
9284 1103927 1149185 1221888 1317819 1395509 1482766 1581985 1675138 1758279 1845317 1948251 2047600
9273 2047600 2149082 2227822 2310976 2376615 2410849 2378403 2299810 2213625 2118924 1981920 1827154
9262 1827154 1692390 1572407 1496245 1465091 1434057 1410813 1390373 1363641 1322628 1275671 1229448
9251 1229448 1202498 1211515 1215089 1214926 1215016 1215586 1235922 1257688 1291034 1339751 1396724 1455463 1523093
9238 1523093 1557275 1570445 1610981 1673712 1742442 1787660 1836173 1906400 2000768 2107414 2228959
$$ packed form
9320A335056J30344J09172R6468Q3291Q4135N2666n679l2413o6614m8492n6919
9309A681015o9772j02418r1750r4478q8049o6025l4023j7948p602q816o254j5917
9297A077963p727R712O210j2298j7938n7n699j2093l954O510J3706K8548K1044
9284A103927M5258P2703R5931P7690Q7257R9219R3153Q3141Q7038J02934R9349
9273B047600J01482P8740Q3154O5639L4234l2446p8593q6185r4701j37004j54766
9262A827154j34764j19983p6162l1154l1034k3244k0440k6732m1013m6957m6223
9251A229448k6950R017L574j63R0N70K0336K1766L3346M8717N6973N8739O7630
9238A523093L4182J3170M0536O2731O8730M5218M8513P0227R4368J06646J21545
$$ plain form
9227 2228959 2348514 2445847 2492015 2519212 2539190 2515701 2483675 2414801 2322128 2200793 2066270
9216 2066270 1955235 1893686 1842788 1807567 1807844 1821145 1824019 1839998 1847320 1864601 1889901 1925204
9204 1925204 1940267 1945138 1961508 1974603 1983890 1998697 2013144 2020406 2032937 2054520 2070712 2103117
9192 2103117 2141377 2178895 2255818 2344087 2428976 2529083 2625949 2702472 2767644 2807474 2826850
9181 2826850 2818741 2800002 2781173 2767125 2755999 2723274 2695412 2700094 2699527 2695878 2720087 2728440 2759033
9168 2759033 2809385 2833047 2839379 2871788 2905520 2916779 2956201 3006750 3033029 3072228 3118638 3168657
9156 3168657 3222821 3280569 3334789 3371664 3398140 3439002 3499986 3569860 3625461 3684359 3740290
9145 3740290 3801481 3859850 3921317 3991439 4071515 4168435 4245952 4325478 4432956 4538907 4613700
$$ packed form
9227B228959J19555R7333M6168K7197J9978k3489l2026o8874r2673j21335j34523
9216B066270j11035o1549n0898l5221K77J3301K874J5979P322J7281K5300L5303
9204A925204J5063M871J6370J3095R287J4807J4447P262J2531K1583J6192L2405
9192B103117L8260L7518P6923Q8269Q4889J00107R6866P6523O5172L9830J9376
9181B826850q109j8739j8829j4048j1126l2725k7862M682n67l649K4209Q353L0593
9168B759033N0352K3662O332L2409L3732J1259L9422N0549K6279L9199M6410N0019
9156C168657N4164N7748N4220L6875K6476M0862O0984O9874N5601N8898N5931
9145C740290O1191N8369O1467P0122Q0076R6920P7517P9526J07478J05951P4793
$$ plain form
9134 4613700 4712744 4819488 4933846 5061403 5190624 5313067 5439262 5584383 5724200 5876952
9124 5876952 6039452 6218932 6382287 6551590 6733429 6935287 7137620 7339558 7554579 7792379
9114 7792379 8040381 8311428 8586971 8880565 9182441 9516077 9882149 10249709 10627000 11032514
9104 11032514 11469499 11940424 12441993 12986376 13543804 14142092 14783588 15460873 16197563
9095 16197563 16995041 17825043 18716709 19686237 20731058 21874462 23119836 24446786 25896660
9086 25896660 27476007 29200492 31081366 33130552 35352836 37803016 40493005 43442869
9078 43442869 46721241 50331124 54322917 58740368 63643749 69086823 75133627 81839129
9070 81839129 89282627 97542119 106664282 116624058 127409195 139007206 151216193 163781595
$$ packed form
9134D613700R9044J06744J14358J27557J29221J22443J26195J45121J39817J52752
9124E876952J62500J79480J63355J69303J81839K01858K02333K01938K15021K37800
9114G792379K48002K71047K75543K93594L01876L33636L66072L67560L77291M05514
9104A1032514M36985M70925N01569N44383N57428N98288O41496O77285P36690
9095A6197563P97478Q30002Q91666R69528J044821J143404J245374J326950J449874
9086B5896660J579347J724485J880874K049186K222284K450180K689989K949864
9078D3442869L278372L609883L991793M417451M903381N443074O046804O705502
9070H1839129P443498Q259492R122163R959776J0785137J1598011J2208987J2565402
$$ plain form
9062 163781595 176359299 188513224 199662521 209246781 216752246 221715663 223817442 222943513
9054 222943513 219174460 212847709 204411928 194438242 183514047 172171176 160853861 149895047
9046 149895047 139505329 129789090 120800260 112539309 104973040 98108846 91870186 86188068
9038 86188068 81012358 76295781 71995070 68061299 64444461 61110332 58028789 55179389
9030 55179389 52555978 50122304 47852279 45724134 43727445 41884372 40127665 38487452
9022 38487452 36973447 35536522 34156765 32858979 31643223 30488415 29388129 28364448
9014 28364448 27392348 26472107 25617034 24790742 23982597 23211742 22500431 21821799 21167188
9005 21167188 20538369 19939650 19360317 18798093 18246683 17727616 17219833 16713155 16217420
$$ packed form
9062A63781595J2577704J2153925J1149297R584260P505465M963417K101779q73929
9054B22943513l769053o326751q435781r973686j0924195j1342871j1317315j0958814
9046A49895047j0389718r716239q988830q260951p566269o864194o238660n682118
9038H6188068n175710m716577m300711l933771l616838l334129l081543k849400
9030E5179389k623411k433674k270025k128145j996689j843073j756707j640213
9022C8487452j514005j436925j379757j297786j215756j154808j100286j023681
9014B8364448r72100r20241q55073q26292q08145p70855p11311o78632o54611
9005B1167188o28819n98719n79333n62224n51410n19067n07783n06678m95735
$$ plain form
8996 16217420 15756997 15321735 14907868 14480818 14059783 13677764 13328603 12978496 12628675
8987 12628675 12287377 11952721 11627849 11311176 11012452 10734244 10452974 10187472 9938186
8978 9938186 9712146 9484370 9260156 9033709 8805728 8589279 8398538 8214674 8013194 7796475
8968 7796475 7613158 7432235 7258206 7103873 6939058 6779778 6606680 6451027 6304753 6154357
8958 6154357 6014407 5887817 5767752 5640238 5508448 5404116 5303077 5200063 5083672 4969660
8948 4969660 4877780 4797302 4694956 4601702 4498642 4418220 4344436 4260737 4186782 4088247 4004931
8937 4004931 3937947 3862656 3775675 3701657 3624173 3548949 3473601 3417431 3343207 3266159 3229042
8926 3229042 3205950 3169506 3120126 3071338 3059018 3042919 3006744 2996918 3026747 3059219 3096495 3135173
$$ packed form
8996A6217420m60423m35262m13867m27050m21035l82019l49161l50107l49821
8987A2628675l41298l34656l24872l16673k98724k78208k81270k65502k49286
8978I938186k26040k27776k24214k26447k27981k16449j90741j83864k01480k16719
8968G796475j83317j80923j74029j54333j64815j59280j73098j55653j46274j50396
8958F154357j39950j26590j20065j27514j31790j04332j01039j03014j16391j14012
8948D969660r1880q0478j02346r3254j03060q0422p3784q3699p3955r8535q3316
8937D004931o6984p5291q6981p4018p7484p5224p5348n6170p4224p7048l7117
8926C229042k3092l6444m9380m8788j2320j6099l6175r826K9829L2472L7276L8678
$$ plain form
8914 3135173 3189726 3255789 3347325 3474487 3598866 3750728 3942943 4208940 4577216 5118771
8904 5118771 5969051 7385954 9715129 13143472 17123790 20467181 22589166 24209906
8896 24209906 25492941 25256827 22118172 16865880 12388464 9565752 7879425 6808616
8888 6808616 6062532 5534672 5135747 4808705 4555141 4329187 4117061 3909384 3712151 3549765
8878 3549765 3393081 3243729 3104361 3002165 2896453 2787114 2695063 2613233 2547729 2473795
8868 2473795 2428433 2368381 2311437 2262382 2211539 2144575 2079331 2028443 2003017 1956811 1912193
8857 1912193 1867872 1830462 1800161 1778299 1739735 1696598 1653589 1629791 1604195 1572977 1537478
8846 1537478 1512532 1476842 1466795 1450704 1413980 1364217 1330564 1309085 1294342 1271084 1253028
$$ packed form
8914C135173N4553O6063R1536J27162J24379J51862J92215K65997L68276N41555
8904E118771Q50280J416903K329175L428343L980318L343391K121985J620740
8896B4209906J283035k36114l138655n252292m477416k822712j686327j070809
8888F808616p46084n27860l98925l27042k53564k25954k12126k07677j97233j62386
8878C549765j56684j49352j39368j02196j05712j09339r2051q1830o5504p3934
8868B473795m5362o0052n6944m9055n0843o6964o5244n0888k5426m6206m4618
8857A912193m4321l7410l0301k1862l8564m3137m3009k3798k5596l1218l5499
8846A537478k4946l5690j0047j6091l6724m9763l3653k1479j4743k3258j8056
$$ plain form
8835 1253028 1240602 1213097 1197657 1174877 1173405 1161551 1149332 1140606 1136765 1116097 1100573 1088512
8823 1088512 1072821 1037167 1029742 994432 977808 971248 965446 968415 971624 958025 948488 936154 935998
8810 935998 937393 918468 902289 883550 891524 880809 863553 866672 865946 858359 849773 828374 818261
8797 818261 810696 794921 775738 767090 757743 764285 758674 755761 741254 748257 730801 720375 701127
8784 701127 694770 687619 673486 649287 631734 609703 594003 590031 593657 610346 604492 597729 599177
8771 599177 581454 578325 566042 536746 511781 518424 531217 528654 521210 511913 525634 547555 514073
8758 514073 494344 507793 514223 504045 490802 482095 479820 478514 483036 477953 465807 444549 433296
8745 433296 433073 441428 449746 432390 415724 426933 408475 405581 408608 401508 382400 382105 380161 373948
$$ packed form
8835A253028j2426k7505j5440k2780j472j1854j2219q726l841k0668j5524j2061
8823A088512j5691l5654p425l5310j6624o560n802K969L209j3599r537j2334j56
8810I35998J395j8925j6179j8739P974j0715j7256L119p26p587q586k1399j0113
8797H18261p565j5775j9183q648r347O542n611k913j4507P003j7456j0426j9248
8784G01127o357p151j4133k4199j7553k2031j5700l972L626J6689n854o763J448
8771E99177j7723l129j2283k9296k4965O643J2793k563p444r297J3721K1921l3482
8758E14073j9729J3449O430j0178j3243q707k275j306M522n083j2146k1258j1253
8745D33296k23Q355Q318j7356j6666J1209j8458k894L027p100j9108k95j944o213
$$ plain form
8731 373948 377471 376053 380179 380591 389424 400313 405365 393365 388158 385754 381469 384848 375016 370971
8717 370971 371982 371641 398899 425643 430897 436409 442207 433659 434965 429764 420507 407303 399780 397539
8703 397539 397247 404592 415252 412445 435492 443149 449454 439539 431185 417768 424324 427822 434801 441295
8689 441295 452155 481075 539697 615480 689225 751720 791923 815729 839586 808951 720663 624588
8677 624588 574673 553932 552316 552702 546221 526660 514952 509591 508278 516189 529822 530742 527325 520964
8663 520964 508909 489946 484173 501123 505680 510199 512607 524158 537293 541670 545790 539272 538007
8650 538007 537960 538641 556968 584682 586805 586211 592874 602196 611195 641271 672647 704041 737938 764599
8636 764599 839463 924973 980208 1047782 1119363 1198501 1296331 1391935 1495630 1568969 1607209
$$ packed form
8731C73948L523j418M126M12Q833J0889N052j2000n207k404m285L379r832m045
8717C70971J011l41K7258K6744N254N512N798q548J306n201r257j3204p523k241
8703C97539k92P345J0660k807K3047P657O305r915q354j3417O556L498O979O494
8689D41295J0860K8920N8622P5783P3745O2495M0203K3806K3857l0635q8288r6075
8677F24588m9915k0741j616L86o481j9561j1708n361j313P911J3633R20l417o361
8663E20964j2055j8963n773J6950M557M519K408J1551J3135M377M120o518j265
8650E38007m7O81J8327K7714K123n94O663R322Q999L0076L1376L1394L3897K6661
8636G64599P4864Q5510N5235O7574P1581P9138R7830R5604J03695P3339L8240
$$ plain form
8625 1607209 1607503 1574671 1511161 1437703 1325151 1185356 1060468 943595 842150 760082 695969
8614 695969 638151 606183 582993 555890 540734 521985 519701 483938 452772 427401 401614 384675
8602 384675 381931 367833 352508 330741 312650 305179 301383 272958 272770 284920 310146 304295 309093
8589 309093 303470 300922 289988 281236 286488 283573 292217 308009 323162 312520 277367 247149 242635
8576 242635 235884 230061 203524 204454 202082 182129 178224 222291 262456 292352 311262 298686 283172
8563 283172 268507 262977 253356 256491 228298 198744 188130 165672 148568 146146 158886 185704
8551 185704 159819 165136 173965 176171 163694 150349 142030 150137 148608 151438 133409 126941 122837
8538 122837 124121 137996 137779 142885 128717 119871 101294 95059 90128 83609 101403 113264 121208
$$ packed form
8625A607209K94l2832o3510p3458j12552j39795j24888j16873j01445q2068o4113
8614F95969n7818l1968k3190k7103j5156j8749k284l5763l1166k5371k5787j6939
8602C84675k744j4098j5325k1767j8091p471l796k8425j88J2150K5226n851M798
8589C09093n623k548j0934q752N252k915Q644J5792J5153j0642l5153l0218m514
8576B42635o751n823k6537R30k372j9953l905M4067M0165K9896J8910j2576j5514
8563B83172j4665n530r621L135k8193k9554j0614k2458j7104k422J2740K6818
8551A85704k5885N317Q829K206j2477j3345q319Q107j529K830j8029o468m104
8538A22837J284J3875k17N106j4168q846j8577o235m931o519J7794J1861P944
$$ plain form
8525 121208 143718 152101 153647 139037 153779 154303 153695 136968 122618 113317 110024 94708 67711
8512 67711 60359 74550 87708 90149 99623 93914 95189 100209 109098 105202 100745 129386 138750 134645
8498 134645 142139 154048 154770 167141 181688 176866 160562 147768 140216 141804 146358 149041 135647
8485 135647 122467 120414 124119 107462 73675 64919 74276 55571 54073 70364 87550 85890 70985
8472 70985 74292 80725 81403 85934 83183 80725 80579 86656 99226 95547 73670 50631 57709 77252
8458 77252 83832 86022 80146 77659 68051 82320 92479 83568 81143 90574 77818 58008 38208
8445 38208 28959 31365 37258 36543 49549 55437 52600 36459 28008 33858 58726 52442 46491 48094
8431 48094 38505 42659 43517 40894 44082 43678 45647 28084 14617 32915 52759 58066 61679 66799
$$ packed form
8525A21208K2510Q383J546j4610J4742N24o08j6727j4350r301l293j5316k6997
8512F7711p352J4191J3158K441R474n709J275N020Q889l896m457K8641R364m105
8498A34645P494J1909P22J2371J4547m822j6304j2794p552J588M554K683j3394
8485A35647j3180k053L705j6657l3787q756R357j8705j498J6291J7186j660j4905
8472G0985L307O433O78M531k751k458j46O077J2570l679k1877k3039P078J9543
8458G7252O580K190n876k487r608J4269J0159q911k425R431j2756j9810j9800
8445C8208r249K406N893p15J3006N888k837j6141q451N850K4868o284n951J603
8431D8094r589M154Q58k623L188m04J969j7563j3467J8298J9844N307L613N120
$$ plain form
8417 66799 78107 84485 95058 105507 93350 73130 59155 57909 54051 64212 69201 68183 62265
8404 62265 61755 73133 81700 74631 76316 71546 75701 76124 69272 48754 43047 42114 51163 59157 78949
8389 78949 81710 88472 92124 85985 74124 66099 49286 37813 43139 45964 49767 38779 43838 58408
8375 58408 58508 59315 50248 44640 39778 42547 45275 47880 42983 39070 36046 9182 22297 45940
8361 45940 50646 46822 47829 42406 50990 54324 54480 51947 47599 52374 48070 66002 67633 62247 62087
8346 62087 59855 58876 50627 63200 68372 56221 33874 43562 38424 37061 33321 19030 28920 46109
8332 46109 46577 35385 30990 43493 43579 35860 28380 32749 38022 25204 22842 19951 29573 31731 41120
8317 41120 45865 29677 18070 27405 27624 13080 7043 18921 23247 31917 40473 30842 42847 57947
$$ packed form
8417F6799J1308O378J0573J0449j2157k0220j3975j246l858J0161M989j018n918
8404F2265n10J1378Q567p069J685m770M155M23o852k0518n707r33R049P994J9792
8389G8949K761O762L652o139j1861q025j6813j1473N326K825L803j0988N059J4570
8375E8408J00Q07r067n608m862K769K728K605m897l913l024k6864J3115K3643
8361D5940M706l824J007n423Q584L334J56k533m348M775m304J7932J631n386j60
8346F2087k232r79q249J2573N172j2151k2347R688n138j363l740j4291R890J7189
8332D6109M68j1192m395J2503Q6p719p480M369N273j2818k362k891R622K158R389
8317D1120M745j6188j1607R335K19j4544o037J1878M326Q670Q556r631J2005J5100
$$ plain form
8303 57947 71510 59656 50088 51233 44900 57066 55728 47069 51540 46725 38357 54357 53713 57495
8289 57495 68917 68524 53211 51373 52664 57375 56639 42077 33460 32804 26991 6129 9958 28796
8275 28796 24660 27954 35233 29227 29307 35153 36491 38527 45078 48850 52670 44039 42019 36749 43129
8260 43129 41076 44609 38466 38529 41460 42313 38910 36024 22905 -979 2539 12180 21792 23085 13039
8245 13039 4096 7704 2540 24824 35378 27320 18519 16186 16120 9857 7280 -3082 5757 24076
8231 24076 37962 48363 38986 14080 7476 14810 15588 24214 16521 34393 41102 51679 53031 38887
8217 38887 20887 17302 23152 31029 48801 57036 35107 29513 29720 33200 26235 26890 12398 20031
8203 20031 11322 8035 25865 32831 45382 51028 45136 37408 31453 37506 47047 54201 36858 33243
$$ packed form
8303E7947J3563j1854r568J145o333J2166j338q659M471m815q368J6000o44L782
8289E7495J1422l93j5313j838J291M711p36j4562q617o56n813k0862L829J8838
8275B8796m136L294P279o006Q0N846J338K036O551L772L820q631k020n270O380
8260D3129k053L533o143O3K931Q53l403k886j3119k3884L518R641R612J293j0046
8245A3039q943L608n164K2284J0554q058q801k333o6o263k577j0362Q839J8319
8231B4076J3886J0401r377k4906o604P334P78Q626p693J7872O709J0577J352j4144
8217C8887j8000l585N850P877J7772Q235k1929n594K07L480o965O55j4492P633
8203B0031q709l287J7830O966J2551N646n892p728n955O053R541P154j7343l615
$$ plain form
8189 33243 31170 25131 24696 40207 32745 16036 42133 59677 45248 32452 32374 30410 33461 43624
8175 43624 61907 69310 68514 63055 48032 52194 51683 51332 63693 77559 73693 51636 58319 78514
8161 78514 84817 81377 63179 57721 58484 48714 47158 57879 66486 74791 68254 71960 56196 46190
8147 46190 40704 49646 42030 31329 11081 2179 -4755 6012 3876 17849 53397 72408 65257
8134 65257 45467 46957 47251 51209 48511 33530 37471 42268 40915 44203 43848 40000 32719 44967
8120 44967 51812 57178 65813 66346 80272 84702 72426 77018 63409 32366 24917 38658 64225
8107 64225 80847 66061 63152 50498 31726 36799 48102 63848 51516 40642 41105 58538 57329
8094 57329 57901 79615 79476 77913 65284 56196 77210 117645 125074 123807 114054 98220 122542 139149
$$ packed form
8189C3243k073o039m35J5511p462j6709K6097J7544j4429j2796p8j964L051J0163
8175D3624J8283P403p96n459j5023M162n11l51J2361J3866l866k2057O683K0195
8161G8514O303l440j8198n458P63r770j556J0721Q607Q305o537L706j5764j0006
8147D6190n486Q942p616j0701k0248q902o934J0767k136J3973L5548J9011p151
8134F5257j9790J490K94L958k698j4981L941M797j353L288l55l848p281J2248
8120D4967O845N366Q635N33J3926M430j2276M592j3609l1043p449J3741K5567
8107F4225J6622j4786k909j2654j8772N073J1303J5746j2332j0874M63J7433j209
8094E7329N72K1714j39j563j2629r088K1014M0435P429j267r753j5834K4322J6607
$$ plain form
8080 139149 164538 160894 153528 145387 137974 150862 148964 150539 157305 165327 182432 177092 137989
8067 137989 129420 128774 123308 110763 114482 129255 150369 161160 161132 161142 156129 156185 157831 160269 172648
8052 172648 165126 166054 166083 167187 151550 137949 137493 142954 168100 173749 172685 188953 200700 204210
8038 204210 202568 201251 213556 221727 225176 226748 240527 257396 267612 258527 259686 245642 219504
8025 219504 196202 179362 161091 156572 137843 111767 129002 128986 113535 119297 104967 114392 117548
8012 117548 116943 133674 154761 149937 156375 152386 133967 124278 132805 121205 108554 112189 104053
7999 104053 97995 80246 73064 58619 62714 76134 90045 96290 107205 92700 95942 105789 123797
7986 123797 132379 141724 131414 121640 119802 110049 105105 103436 94811 92376 80771 68608 40751
$$ packed form
8080A39149K5389l644p366q141p413J2888j898J575O766Q022J7105n340l9103
8067A37989q569o46n466j2545L719J4773K1114J0791k8J0n013N6J646K438J2379
8052A72648p522R28K9J104j5637j3601m56N461K5146N649j064J6268J1747L510
8038B04210j642j317J2305Q171L449J572J3779J6869J0216r085J159j4044k6138
8025B19504k3302j6840j8271m519j8729k6076J7235j6j5451N762j4330R425L156
8012A17548o05J6731K1087m824O438l989j8419r689Q527j1600j2651L635q136
7999A04053o058j7749p182j4445M095J3420J3911O245J0915j4505L242R847J8008
7986A23797Q582R345j0310r774j838r753m944j669q625k435j1605j2163k7857
$$ plain form
7973 40751 48346 65026 76061 77399 73345 71886 69576 57661 55023 57957 79181 95948 87522
7960 87522 93122 109518 118590 111621 98480 100351 80336 71394 68285 63662 69691 73583 72088 52033
7946 52033 30771 38358 31036 17796 18459 16754 2680 16647 20388 20491 30810 37857 41387 39695
7932 39695 34502 43758 47244 37262 28561 30763 52588 55794 35824 31034 29587 26709 18113 11811
7918 11811 7654 -1968 -11775 12855 47027 61719 53634 55328 67560 65361 43549 58724 72493
7905 72493 69791 82017 80445 53286 54856 55476 48266 43341 28594 32598 35889 23941 12342 10160
7891 10160 -520 -5102 -4489 -18713 -26272 -23532 -4794 -2953 -5732 -1077 3618 3394 4371 5563 8695
7876 8695 25862 39581 28920 18199 21058 28239 40949 34498 31388 18723 1408 -7169 1414
$$ packed form
7973D0751P595J6680J1035J338m054j459k310j1915k638K934K1224J6767q426
7960H7522N600J6396R072o969j3141J871k0015q942l109m623O029L892j495k0055
7946E2033k1262P587p322j3240O63j705j4074J3967L741J03J0319P047L530j692
7932C9695n193R256L486r982q701K202K1825L206j9970m790j447k878q596o302
7918A1811m157r622r807K4630L4172J4692q085J694J2232k199k1812J5175J3769
7905G2493k702J2226j572k7159J570O20p210m925j4747M004L291j1948j1599k182
7891A0160j0680m582O13j4224p559K740J8738J841k779M655M695k24R77J192L132
7876H695J7167J3719j0661j0721K859P181J2710o451l110j2665j7315q577Q583
$$ plain form
7863 1414 6081 8114 12040 3521 -1586 9025 15710 1511 -14958 -5454 19330 20902 23640 6710
7849 6710 -1239 12410 13138 7971 -9785 -4177 7235 6057 3833 -5823 -15566 -16521 -16843 -22430 -17420
7834 -17420 -10866 -26188 -19270 7001 5809 2629 -1675 -7917 -12511 -10691 -3378 -5529 -3574 5118
7820 5118 14815 22704 9981 7805 20189 29193 31038 31876 28924 26629 22769 23536 8075 -6750
7806 -6750 -15754 -9973 14939 9002 1796 3649 -6265 -7146 1806 11692 8315 -4263 -8219 2840
7792 2840 -7192 -31831 -33543 -13445 -316 4326 10615 13437 12543 19776 -369 6168 17610 17387
7778 17387 13714 2305 14569 31364 36316 12547 6883 13417 9984 13122 10359 11202 16841 3898
7764 3898 -4538 -18539 -18638 5038 24134 32020 42138 51823 56024 50778 44786 19365 10369 12310
$$ packed form
7863A414M667K033L926q519n107J0611O685j4199j6469R504K4784J572K738j6930
7849F710p949J3649P28n167j7756N608J1412j178k224r656r743r55l22n587N010
7834a7420O554j5322O918K6271j192l180m304o242m594J820P313k151J955Q692
7820E118R697P889j2723k176J2384R004J845Q38k952k295l860P67j5461j4825
7806f750r004N781K4912n937p206J853r914q81Q952R886l377j2578l956J1059
7792B840j0032k4639j712K0098J3129M642O289K822q94P233k0145O537J1442k23
7778A7387l673j1409J2264J6795M952k3769n664O534l433L138k763Q43N639j2943
7764C898q436j4001r9K3676J9096P886J0118R685M201n246n992k5421q996J941
$$ plain form
7750 12310 24590 19249 6609 9596 18121 25883 27238 35858 28162 7342 -8715 -16744 -10390 -3587
7736 -3587 4589 5351 24847 17378 8144 4020 20142 26811 17567 18057 10920 -560 -1579 -3194 7649
7721 7649 4301 2445 6204 710 -39 9809 11964 17847 11559 9684 13415 11120 16246 26482 20173
7706 20173 26180 20132 19685 22447 8958 9786 15839 10759 14774 5147 2448 12242 9914 5263 10346
7691 10346 20278 15048 10917 1591 -5035 -1619 -156 10120 22150 20147 21116 34896 29788 10344
7677 10344 24208 38956 31706 17719 16205 25105 18777 23598 11933 -3639 -10516 -19566 -16491
7664 -16491 4497 19307 13194 11263 20012 20534 3325 -1817 -4810 -2420 12355 21261 28278 15302
7650 15302 5415 5816 -10684 -24568 -30507 -24644 -29689 -12845 -2761 7023 -1243 -6233 1532 3791
$$ packed form
7750A2310J2280n341j2640K987Q525P762J355Q620p696k0820j6057q029O354O803
7736c587Q176P62J9496p469r234m124J6122O669r244M90p137j1480j019j615J0843
7721G649l348j856L759n494p49R848K155N883o288j875L731k295N126J0236o309
7706B0173O007o048m47K762j3489Q28O053n080M015r627k699R794k328m651N083
7691A0346R932n230m131r326o626L416J463J0276J2030k003R69J3780n108j9444
7677A0344J3864J4748p250j3987j514Q900o328M821j1665j5572o877r050L075
7664a6491K0988J4810o113j931Q749N22j7209n142k993K390J4775Q906P017j2976
7650A5302r887M01j6500j3884n939N863n045J6844J0084R784q266m990P765K259
$$ plain form
7636 3791 -9892 -8788 -5607 -7899 -5561 -19897 -30512 -27165 -27422 -6630 16750 7109 -2484 2065
7622 2065 6164 -2200 -10389 -10075 -482 -2899 711 -23421 -15294 75 -11977 -14300 -2194 14442
7608 14442 23661 26157 15542 -36 -11584 -31745 -25747 -15063 -14165 -15456 -17332 -13884 -619
7595 -619 370 -12543 -25 20158 22401 17416 17886 11536 9750 23979 24237 6640 -1451 -7498 -15455
7580 -15455 -6468 -18748 -35209 -24711 -10286 -7455 -4551 -11009 -24141 -34313 -21552 -7814 -14060
7567 -14060 -13774 -12567 -18027 -32294 -37353 -38032 -47671 -60436 -42929 -17015 -8126 -4115 -5641 -288
7553 -288 -23068 -51217 -53030 -47682 -31547 -12814 -11840 -10946 -9816 6030 17398 14828 4855 -1
7539 -1 828 -6892 -3090 -1326 -14075 -18578 -20213 -11685 1272 -3901 -9724 -16876 -8993 3097 17594
$$ packed form
7636C791j3683J104L181k292K338j4336j0615L347k57K0792K3380r641r593M549
7622B065M099q364q189L14R593k417L610k4132Q127J5369j2052k323J2106J6636
7608A4442R219K496j0615j5578j1548k0161N998J0684Q98j291j876L448J3265
7595f19R89j2913J2518K0183K243m985M70o350j786J4229K58j7597q091o047p957
7580a5455Q987j2280j6461J0498J4425K831K904o458j3132j0172J2761J3738o246
7567a4060K86J207n460j4267n059o79r639j2765J7507K5914Q889M011j526N353
7553b88k2780k8149j813N348J6135J8733R74Q94J130J5846J1368k570r973m856
7539aQ29p720L802J764j2749m503j635Q528J2957n173n823p152P883J2090J4497
$$ plain form
7524 17594 5419 -13714 -17031 -10776 -14541 -14496 -19476 -19414 -19110 -19639 -18935 -16726 -19252 -32043 -37820 -48747
7508 -48747 -38139 -21048 -20588 -11266 14167 35396 16170 -8421 -8696 6570 14232 5246 2328
7495 2328 -6352 -2617 10642 1987 -20427 -27384 -25380 -4994 4172 7275 6934 4363 5165 -1205 -1840
7480 -1840 -1282 -1965 -6000 -35841 -37928 -23954 -18240 -22699 -17455 -9936 -11100 -17393 -21016 -21342 -3891
7465 -3891 8063 10331 1662 -4234 -27919 -17816 -4257 6846 -1652 -2413 -4821 -857 4592 -7376
7451 -7376 -15494 -10589 -4350 -26936 -39275 -20769 -19974 -30506 -24614 -25312 -17545 -16963 -21495 -9846
7437 -9846 665 -10272 -23536 -21984 -17881 -17112 -13211 -13322 -5212 -3531 1797 1040 -7057 2770 5252
7422 5252 2015 -12437 -21201 -26461 -17304 -4546 41 324 -12 -16760 -26294 -26552 -16591 -10491 -12385
$$ packed form
7524A7594j2175j9133l317O255l765M5m980O2L04n29P04K209k526j2791n777j0927
7508d8747J0608J7091M60R322K5433K1229j9226k4591k75J5266P662q986k918
7495B328q680L735J3259q655k2414o957K004K0386R166L103l41k571Q02o370o35
7480a840N58o83m035k9841k087J3974N714m459N244P519j164o293l623l26J7451
7465c891J1954K268q669n896k3685J0103J3559J1103q498p61k408L964N449j1968
7451g376q118M905O239k2586j2339J8506P95j0532N892o98P767N82m532J1649
7437i846J0511j0937j3264J552M103P69L901j11Q110J681N328p57q097R827K482
7422E252l237j4452q764n260R157J2758M587K83l36j6748r534k58R961O100j894
$$ plain form
7407 -12385 -25932 -32288 -12132 1848 4145 -4285 -26432 -50690 -62193 -79846 -79178 -64864 -40504
7394 -40504 -40757 -67728 -61215 -44102 -20226 -10461 -13585 -26809 -27818 -33269 -30224 -2898 4321 -8132
7380 -8132 -4227 -12800 -32210 -37878 -22897 555 6818 6781 3812 -3832 -12736 -21440 -5765 12200
7366 12200 2952 -3123 7132 5645 4365 7505 14358 31109 25784 9367 7128 11074 5952 -10470
7352 -10470 -15393 -9723 -19015 -26083 -17222 3826 16523 11709 -7357 -12099 -5690 -4059 8563 15724
7338 15724 8748 705 -3766 13851 28632 22805 10210 -6887 -28634 -23216 -26211 -19645 -2642
7325 -2642 -4378 -20344 -17735 -8569 -8718 -21433 -20776 -20180 -19642 -24993 -26662 -33469 -17604 -3904 11500
7310 11500 30801 30849 7577 -5806 -3076 -10791 575 320 -1040 3263 1814 -3038 -8802 -11435
$$ packed form
7407a2385j3547o356K0156J3980K297q430k2147k4258j1503j7653O68J4314K4360
7394d0504k53k6971O513J7113K3876R765l124j3224j009n451L045K7326P219j2453
7380h132L905q573j9410n668J4981K3452O263l7k969p644q904q704J5675J7965
7366A2200r248o075J0255j487j280L140O853J6751n325j6417k239L946n122j6422
7352a0470m923N670r292p068Q861K1048J2697m814j9066m742O409J631J2622P161
7338A5724o976q043m471J7617J4781n827j2595j7097k1747N418k995O566J7003
7325b642j736j5966K609R166j49j2715O57N96N38n351j669o807J5865J3700J5404
7310A1500J9301M8k3272j3383K730p715J1366k55j360M303j449m852n764k633
$$ plain form
7296 -11435 -8586 -12869 -6712 2139 5745 1884 2363 -2680 -9995 -22174 -26837 -22272 -27697 -25329 -26733
7281 -26733 -19536 254 846 3016 -2946 -19940 -29911 -37653 -43433 -26201 -7798 -12818 -18896 -21412
7267 -21412 -26638 -29953 -33652 -40966 -38575 -30056 -21102 -6387 -8520 -35029 -27631 -22069 -19668 -17337
7253 -17337 -5028 -1814 -5947 -7708 -12886 -10059 -22042 -24497 -10531 -8942 -6747 -11608 -19237 -11457
7239 -11457 -15215 -17136 -14243 -12881 -8693 3151 16252 7791 5140 -2711 -5530 12 -7903 -10779
7225 -10779 -11358 -28994 -15785 8629 22849 35763 27784 21990 5742 -9187 -14166 67 -6844
$$ packed form
7296a1435K849m283O157Q851L606l861M79n043p315j2179m663M565n425K368j404
7281b6733P197J9790N92K170n962j6994r971p742n780J7232J8403n020o078k516
7267b1412n226l315l699p314K391Q519Q954J4715k133k6509P398N562K401K331
7253a7337J2309L214m133j761n178K827j1983k455J3966J589K195m861p629P780
7239a1457l758j921K893J362M188J1844J3101q461k651p851k819N542p915k876
7225a0779n79j7636J3209K4414J4220J2914p979n794j6248j4929m979J4233o911
$$ [...]
##END NTUPLES=NMR SPECTRUM
##END=
