##TITLE=Analysis number 319943
Compound Code cc 45806
Book Reference 468/82
Project Code adrs
Chemist Name colinb
##JCAMPDX= 6.0         $$ Bruker NMR JCAMP-DX V2.0
##DATA TYPE= NMR SPECTRUM
##DATA CLASS= NTUPLES
##ORIGIN= Bruker BioSpin GmbH
##OWNER= nmr
$$ XWIN-NMR		Version 3.5
$$ Mon Jun  5 10:36:48 2006 GMT Daylight Time (UT+1h)  MAYBRIDGE\nmr@NMR_250MHZ
##.OBSERVE FREQUENCY= 250.131544655141
##.OBSERVE NUCLEUS= ^1H
##.ACQUISITION MODE= SIMULTANEOUS (DQD)
##.ACQUISITION SCHEME= undefined
##.AVERAGES= 16
##.DIGITISER RES= 18
##SPECTROMETER/DATA SYSTEM= dpx250
##.PULSE SEQUENCE= zg30
##.SOLVENT NAME= CDCl3
##.SHIFT REFERENCE= (INTERNAL, CDCl3, 0, 16.522)
##AUDIT TRAIL= $$ (NUMBER, WHEN, WHO, WHERE, WHAT)
$$ ##TITLE= Audit trail, XWIN-NMR		Version 3.5
$$ ##JCAMPDX= 5.01
$$ ##ORIGIN= Bruker BioSpin GmbH
$$ ##OWNER= nmr
$$ C:\u/data/dgb/nmr/ADRS/270/pdata/1/auditp.txt
$$ ##AUDIT TRAIL=  $$ (NUMBER, WHEN, WHO, WHERE, WHAT)
(   1,<2006-06-05 10:36:25.75 +100>,<MAYBRIDGE\nmr>,<NMR_250MHZ>,
      <created by zg, POWCHK disabled, PULCHK disabled
       configuration hash MD5:
       E2 DF 36 D8 04 B2 41 60 5A D7 A3 38 5A 4B D0 FE
       data hash MD5: 64K
       09 79 4D C8 E2 F7 08 B2 6E 32 86 05 65 40 B1 EA>)
(   2,<2006-06-05 10:36:38.67 +100>,<MAYBRIDGE\nmr>,<NMR_250MHZ>,
      <Start of raw data processing
       ef LB = 0.3 FT_mod = 6 PKNL = 1 SI = 32K 
       data hash MD5: 32K
       C6 35 25 14 36 46 31 F4 FF A5 A3 1A AE 92 1F 0C>)
(   3,<2006-06-05 10:36:40.31 +100>,<MAYBRIDGE\nmr>,<NMR_250MHZ>,
      <apk 
       data hash MD5: 32K
       C1 F8 48 29 C1 40 04 FB 3E 03 9A C1 36 33 99 28>)
(   4,<2006-06-05 10:36:41.22 +100>,<MAYBRIDGE\nmr>,<NMR_250MHZ>,
      <abs ABSG = 5 
       data hash MD5: 32K
       A6 3F 84 11 81 E0 31 EC 1D 61 B1 A9 85 7F DA 80>)
$$ ##END=
$$ 
$$ hash MD5
$$ CB 79 A6 0F D9 85 A0 4E 2D 96 27 6C 33 AB 30 53
##$RELAX= 
##$RELAX= 
##$RELAX= 
##$RELAX= 
##$RELAX= 
##$RELAX= 
##$RELAX= 
$$ Bruker specific parameters
$$ --------------------------
##$DU= <C:\u>
##$EXPNO= 270
##$NAME= <ADRS>
##$PROCNO= 1
##$TYPE= <nmr>
##$USER= <dgb>
##$AMP= (0..31)
100 100 100 100 100 100 100 100 100 100 100 100 100 100 100 100 100 100 
100 100 100 100 100 100 100 100 100 100 100 100 100 100 
##$AQSEQ= 0
##$AQ_mod= 3
##$AUNM= <au_zg>
##$AUTOPOS= <6 >
##$BF1= 250.13
##$BF2= 250.13
##$BF3= 250.13
##$BF4= 250.13
##$BF5= 500.13
##$BF6= 500.13
##$BF7= 500.13
##$BF8= 500.13
##$BYTORDA= 1
##$CFDGTYP= 0
##$CFRGTYP= 5
##$CHEMSTR= <none>
##$CNST= (0..31)
1 1 145 1 1 1 1 1 1 1 1 1 1 1 1 1 1 1 1 1 1 1 1 1 1 1 1 1 1 1 1 1 
##$CPDPRG= <>
##$CPDPRG1= <>
##$CPDPRG2= <>
##$CPDPRG3= <>
##$CPDPRG4= <mlev>
##$CPDPRG5= <mlev>
##$CPDPRG6= <mlev>
##$CPDPRG7= <mlev>
##$CPDPRG8= <mlev>
##$CPDPRGB= <>
##$CPDPRGT= <>
##$D= (0..31)
0 1 0 0 0 0 0 0 0 0.06 0 0 0 0 0 0 0.0002 0 0 0 0 0 0 0 0 0 0 0 0 0 0 
0 
##$DATE= 1149500184
##$DBL= (0..7)
120 120 120 120 120 120 120 120 
##$DBP= (0..7)
150 150 150 150 150 150 150 150 
##$DBP07= 0
##$DBPNAM0= <>
##$DBPNAM1= <>
$$ [...]
##$SUBNAM7= <"">
##$SUBNAM8= <"">
##$SUBNAM9= <"">
##$SW= 20.6930455092707
##$SWIBOX= (0..15)
0 0 3 0 0 0 0 0 0 0 0 0 0 0 0 0 
##$SW_h= 5175.983436853
##$TD= 65536
##$TD0= 1
##$TE= 295.16
##$TE2= 300
##$TE3= 300
##$TEG= 300
##$TL= (0..7)
0 120 120 120 120 120 120 120 
##$TP= (0..7)
150 150 150 150 150 150 150 150 
##$TP07= 0
##$TPNAME0= <>
##$TPNAME1= <>
##$TPNAME2= <>
##$TPNAME3= <>
##$TPNAME4= <>
##$TPNAME5= <>
##$TPNAME6= <>
##$TPNAME7= <>
##$TPOAL= (0..7)
0.5 0.5 0.5 0.5 0.5 0.5 0.5 0.5 
##$TPOFFS= (0..7)
0 0 0 0 0 0 0 0 
##$TUNHIN= 0
##$TUNHOUT= 0
##$TUNXOUT= 0
##$USERA1= <user>
##$USERA2= <user>
##$USERA3= <user>
##$USERA4= <user>
##$USERA5= <user>
##$V9= 5
##$VALIST= <valist>
##$VCLIST= <CCCCCCCCCCCCCCC>
##$VD= 0
##$VDLIST= <DDDDDDDDDDDDDDD>
##$VPLIST= <PPPPPPPPPPPPPPP>
##$VTLIST= <TTTTTTTTTTTTTTT>
##$WBST= 1024
##$WBSW= 4
##$XGAIN= (0..3)
0 0 0 0 
##$XL= 0
##$YL= 0
##$YMAX_a= 406907
##$YMIN_a= -547108
##$ZGOPTNS= <>
##$ZL1= 120
##$ZL2= 120
##$ZL3= 120
##$ZL4= 120
##$ABSF1= 16.522
##$ABSF2= -4.171173
##$ABSG= 5
##$ABSL= 3
##$ALPHA= 0
##$AQORDER= 0
##$ASSFAC= 0
##$ASSFACI= 0
##$ASSFACX= 0
##$ASSWID= 0
##$AUNMP= <proc_1d>
##$AZFE= 0.1
##$AZFW= 0.1
##$BCFW= 0
##$BC_mod= 0
##$BYTORDP= 0
##$COROFFS= 0
##$CY= 12.5
##$DATMOD= 1
##$DC= 0
##$DFILT= <>
##$DTYPP= 0
##$F1P= 14.0000005364418
##$F2P= -0.99999901652339
##$FCOR= 0.5
##$FTSIZE= 32768
##$FT_mod= 6
##$GAMMA= 0
##$GB= 0
##$INTBC= 1
##$INTSCL= 1
##$ISEN= 128
##$LB= 0.3
##$LEV0= 0
##$LPBIN= 0
##$MAXI= 10000
##$MC2= 0
##$MEAN= 0
##$ME_mod= 0
##$MI= 0
##$NCOEF= 0
##$NC_proc= -3
##$NLEV= 6
##$NOISF1= 0
##$NOISF2= 0
##$NSP= 0
##$NTH_PI= 0
##$NZP= 0
##$OFFSET= 16.522
##$PC= 1
##$PHC0= 169.2734
##$PHC1= 6.252482
##$PH_mod= 1
##$PKNL= yes
##$PPARMOD= 0
##$PSCAL= 4
##$PSIGN= 0
##$REVERSE= no
##$SF= 250.13
##$SI= 32768
##$SIGF1= 0
##$SIGF2= 0
##$SINO= 400
##$SIOLD= 32768
##$SREGLST= <1H.CDCl3>
##$SSB= 0
##$STSI= 32768
##$STSR= 0
##$SW_p= 5175.98343685301
##$SYMM= 0
##$S_DEV= 0
##$TDeff= 65536
##$TDoff= 0
##$TI= <Analysis number 999999
Compound Code 99
Book Reference 9
Project Code 9>
##$TILT= no
##$TM1= 0
##$TM2= 0
##$TOPLEV= 0
##$USERP1= <user>
##$USERP2= <user>
##$USERP3= <user>
##$USERP4= <user>
##$USERP5= <user>
##$WDW= 1
##$XDIM= 32768
##$YMAX_p= 471876802
##$YMIN_p= -196252
$$ End of Bruker specific parameters
$$ ---------------------------------
##NTUPLES= NMR SPECTRUM
##VAR_NAME=  FREQUENCY,     SPECTRUM/REAL,   SPECTRUM/IMAG
##SYMBOL=    X,             R,               I
##VAR_TYPE=  INDEPENDENT,   DEPENDENT,       DEPENDENT
##VAR_FORM=  AFFN,          ASDF,            ASDF
##VAR_DIM=   32768,         32768,           32768
##UNITS=     HZ,            ARBITRARY UNITS, ARBITRARY UNITS
##FACTOR=    0.157963299565203, 1,           1
##FIRST=     4132.6476996994, 0,             0
##LAST=      -1043.33573715361, 0,           0
##MIN=       -1043.33573715361, -196252,     0
##MAX=       4132.6476996994, 471876802,     0
$$ Real data points
##PAGE= N=1
##DATA TABLE= (X++(R..R)), XYDATA
$$ [...]
18525G3422O230R758J550q375n913j0030R187j5442k0091J2179J2508Q750J1597
18512H5330R548j2263j008K0259N062Q635J1566O739K1011L1418K3028K6791L6078
18499B72194L4095M2148N4964O1994N3801M1333P695j3455k6321k4620j3601k3736
18487D66491m0623m6589m5111l3134l4363j0802k9927m9937l8368n842r485K088
18475A24398J971o519k3224j010j372M936l011k035R499R849N327l248R248O073
18461A30882l960q772R284K1796m918Q784K3056k410K3496L9781L8980L1597K9089
18448C36685L5423K4199J7026K7762J7837J301n3028k6261j8290k5838k2975l7377
18436B76464m1747j0604J8963K4992K7755O0935N5353L4439L3906K6843L050k1051
$$ plain form
18525 73422 79652 89410 90960 82585 76672 66642 75829 60387 40296 52475 64983 73733 85330
18512 85330 94878 82615 81607 101866 106928 115563 127129 133868 154879 186297 209325 236116 272194
18499 272194 306289 348437 403401 465395 519196 560529 568224 554769 528448 503828 490227 466491
18487 466491 425868 379279 334168 301034 266671 255869 225942 176005 137637 131795 122310 124398
18475 124398 126369 119850 96626 95616 94244 99180 96169 94134 103633 113482 118809 115561 124809 130882
18461 130882 126922 118150 127434 149230 144312 153096 176152 173742 197238 237019 275999 307596 336685
18448 336685 372108 396307 413333 441095 458932 460233 407205 380944 362654 336816 313841 276464
18436 276464 234717 224113 243076 268068 295823 356758 412111 446550 480456 507299 510349 489298
18424D89298n2919n5049l9585m3597l7534k3360k7197q849J7871J6793J8004M6316
18412C00192L8932M8515O4221O5287M3574K8909J6592p438o617j5570k5779l5937
18400E14881l6219m4938j1560K430J1035P056J64j7340j5185k6748k9569l4986
18388C19021m3297k1414k8706j1508p340j6906j9520l418J0524n784j075J6295
18376A86872J9965j2836n056j608K2007N970l520K4079l785O510M2823K7737K2117
18363C31275J3805L421r750j94K3064J2075Q592Q771K5649J6680M705L0934L323
18350D72350P594J0095J9515L812k660j2395l2178m6155m4443k3529n237k8114
18338C18655k4269p048q817j4560j6012j1954j2823J6733p188k3657n931k1J4823
$$ plain form
18424 489298 436379 381330 341745 298148 260614 237254 210057 201208 219079 235872 253876 300192
18412 300192 339124 387639 451860 517147 560721 589630 606222 598784 592167 576597 550818 514881
18400 514881 478662 433724 422164 424594 435629 442685 442849 425509 410324 383576 354007 319021
18388 319021 275724 254310 225604 214096 206756 189850 170330 166912 177436 171652 170577 186872
18376 186872 206837 194001 188945 187337 209344 215314 211794 235873 232088 238598 281421 309158 331275
18363 331275 345080 348501 338751 338557 361621 373696 382288 391059 416708 433388 438093 469027 472350
18350 472350 479944 490039 509554 513366 510706 498311 466133 419978 375535 352006 346769 318655
18338 318655 294386 287338 278521 263961 247949 235995 223172 239905 232717 209060 203129 203108 217931
18325B17931q847O48K5j3017p231j0008j580J516M594K659j043L1004L8487L0787
18311B85925J9362K3780L2865O2015O0292N4670J8105m999j936n312P818p057
18299E45528n2067p0348j8627l2017m2327m3082l3601o349K182N586P262J3477
18287B75617n139j3271q504j8862J1928J5523K922j0070q776m804j1006q934m271
18274B12353l1710j3719O816K166p328J2979M98n936q570m698j0693k6229q490
18261A17439O452J138J5342K3848J6028j8858j9982O581P232P954J7308q235j2717
18248A59530q08K1363K0724J4592J2736J9813n924J829J9531J7616L218O425K5408
18235C16053J6622J1431K4126J9723K7999M0915m171O305Q088M583K9294J2990
$$ plain form
18325 217931 209084 209732 209757 196740 189509 179501 177921 179437 184031 186690 185647 216651 255138 285925
18311 285925 305287 329067 361932 423947 484239 538909 557014 552015 550079 544767 552585 545528
18299 545528 493461 423113 404486 372469 330142 287060 253459 247110 249292 254878 262140 275617
18287 275617 270478 257207 248703 229841 241769 257292 260214 250144 241368 236564 225558 216624 212353
18274 212353 180643 166924 173740 175906 168578 181557 182055 176119 167549 162851 152158 125929 117439
18261 117439 123891 125029 140371 164219 180247 161389 141407 147988 155220 163174 180482 172247 159530
18248 159530 158722 180085 200809 215401 228137 247950 242026 243855 263386 281002 284220 290645 316053
18235 316053 332675 344106 368232 387955 415954 456869 452698 459003 467091 471674 500968 513958
18223E13958n0754m4713l8747l5791j0519k0328j7825k3828m911K715K0090M98
18211B89845J1805M1285M9267O2563N2269M9998M6877J5202m802j0778m7938m8489
18199E07104l4754m5680l2942j4448r923O750M267L3014M2746N8708Q0619R9643
18187F95104J05680J47997J52807J46547J18683R2583Q9840O8143L8031P461j9495
18176A643381q4761r6424q3814m8626k6440n0270q6155r1786p5861q2697q0359
18165H36188q1598o8953n6562l0236l8867m110q311k1788j5856j7976k0900J1710
18153D82741L1393N379j0790J428J4374R747N806j0352K8605M9962L6525L8382
18141F83200M9844M4586L5448J6492K6743L7643N5531N6577M3484L9898M9204
$$ plain form
18223 513958 463204 418491 379744 343953 333434 313106 295281 271453 266542 269257 289347 289845
18211 289845 301650 342935 392202 454765 507034 557032 603909 619111 614309 603531 555593 507104
18199 507104 472350 426670 393728 379280 369357 376107 380374 413388 456134 514842 595461 695104
18187 695104 800784 948781 1101588 1248135 1366818 1459401 1549241 1617384 1655415 1662876 1643381
18176 1643381 1558620 1462196 1378382 1329756 1303316 1253046 1166891 1075105 999244 916547 836188
18165 836188 754590 685637 629075 598839 559972 555862 547551 525763 509907 491931 471031 482741
18153 482741 514134 519513 508723 510151 524525 534272 540078 529726 558331 608293 644818 683200
18141 683200 733044 777630 813078 829570 856313 893956 949487 1006064 1049548 1089446 1138650
18130A138650M9609L2744L9018O3692L5178N2896O5099J03312J45776J87696K71908
18119B185578M11359O24722J116901J989218K863924K818056J836849J284099
18111A5130706P21313l93249J84431n98245m363539m015515j999142j019080n92165
18102C055515l79714k48108j57606j42770j24515r2481q0877o7922o3528n9411
18092A638583l8516l1943l1922k0908k2946k7428j4815j2000k2135k4625k1060
18081A370285l9761j7941l554R629j51j2925R063J6729N836J4979M134q142m703
18068A343478M4955L8681M0868P0194Q6229R7036J34679J76679K33326L29960
18058B596085N09394P93905J121146J313799J263901J217318J292919J320139
$$ plain form
18130 1138650 1188259 1221003 1260021 1323713 1358891 1411787 1476886 1580198 1725974 1913670 2185578
18119 2185578 2596937 3221659 4338560 6327778 9191702 12009758 13846607 15130706
18111 15130706 15852019 15458770 15643201 15044956 10681417 6665902 4666760 3647680 3055515
18102 3055515 2675801 2427693 2270087 2127317 2002802 1910321 1829444 1761522 1697994 1638583
18092 1638583 1600067 1568124 1536202 1515294 1492348 1464920 1450105 1438105 1415970 1391345 1370285
18081 1370285 1330524 1312583 1309029 1318658 1318507 1305582 1314645 1331374 1337210 1352189 1356323 1348181 1343478
18068 1343478 1388433 1427114 1467982 1538176 1624405 1721441 1856120 2032799 2266125 2596085
18058 2596085 3105479 3899384 5020530 6334329 7598230 8815548 10108467 11428606
18050A1428606J350582J239164P54421N98989Q90420J107633R38448L58478J55786
18041A8822527N98970N13539o89839j643351j585484j200001r74668j496546k302330
18032A0042817k152179j397820p77583m99974l47977k13356j45332j05930n3946
18023D348720k3853j0265l684M8174R3205J00010J22488J44688J69758K11138
18013E200379K86841L87402N01981N93059P67300J091392J556677K300132L477668
18004A6162831N095357O484792O768422O381122O479581O775677O811341O314021
17996F7273144L577103K45357j51626J209348J820946m56657l107189j845226
17988F8565200M64109n67562l319968l621072j657886J182751L221553K678807
$$ plain form
18050 11428606 12779188 14018352 14772773 15371762 16262182 17369815 18308263 18666741 18822527
18041 18822527 19421497 19935036 19245197 17601846 16016362 14816361 13841693 12345147 10042817
18032 10042817 7890638 6492818 5715235 5215261 4867284 4653928 4508596 4402666 4348720
18023 4348720 4324867 4314602 4310918 4359092 4452297 4552307 4674795 4819483 4989241 5200379
18013 5200379 5487220 5874622 6376603 6969662 7736962 8828354 10385031 12685163 16162831
18004 16162831 21258188 27742980 34511402 40892524 47372105 54147782 60959123 67273144
17996 67273144 70850247 71095604 70943978 72153326 73974272 73517615 70410426 68565200
17988 68565200 69029309 68461747 65141779 61520707 59862821 61045572 64267125 66945932
17980F6945932K015428K832056K644688Q34933R8442j965297o774791r671197
17972E6960194j1997222j1189324p003034l999440k461122j590687j124803q96677
17964A6697885p76998p53854p74874q18882q03605p46738p08086n63870m14261
17955A0336717l15418k40417j49089p1787j2941L5493P5069J06395J64409K82069
17945A0210500M32047O05957Q86320J341241K187758L671492N892887Q097334
17937C3325536R133108Q957496P776877M689054K280556J315322l372009p389688
17929E6716252p818178j0090390q027850m327779k512044j658297j218451j475529
17921A9587734j863370k153931k422860j836124j189723q23005o00617m43626
$$ plain form
17980 66945932 68961360 71793416 74438104 75273037 75371479 73406182 66631391 56960194
17972 56960194 44962972 33773648 26770614 22771174 20310052 18719365 17594562 16697885
17964 16697885 15920887 15167033 14392159 13573277 12769672 12022934 11314848 10750978 10336717
17955 10336717 10021299 9780882 9631793 9560006 9547065 9582558 9657627 9764022 9928431 10210500
17945 10210500 10642547 11248504 12134824 13476065 15663823 19335315 25228202 33325536
17937 33325536 42458644 51416140 59193017 63882071 66162627 67477949 64105940 56716252
17929 56716252 48898074 38807684 30779834 26452055 23940011 22281714 21063263 19587734
17921 19587734 17724364 15570433 13147573 11311449 10121726 9298721 8698104 8254478
17913H254478l68375l16768k81766k32535k23571k11773j93889j11842j00779
17904F213180p7671p0276q5814r2359r9936j23508q8452r7807j27184m2577N4158
17893E361754J23122J69195K71742M21916O31939J011535J689876K499117L144008
17884A5324204L369503L232378K407198J177331Q16938k41287k297142k748896
17876B1040227l760642m131311k598153j433315q26803m98520k88308j49416m6814
17867G306945O0197K16053L86122O15392R06565J304067J929290K880001M309268
17858A9913900O181196Q094199R491706R874844Q986690P023351M512625J468374
17850G5546885k087894n642729q771016j0340621r929590q056615n462026l099993
$$ plain form
17913 8254478 7886103 7569335 7287569 7055034 6831463 6619690 6425801 6313959 6213180
17904 6213180 6135509 6065233 5979419 5887060 5787124 5663616 5575164 5477357 5350173 5307596 5361754
17893 5361754 5484876 5654071 5925813 6347729 6979668 7991203 9681079 12180196 15324204
17884 15324204 18693707 21926085 24333283 25510614 26327552 26086265 23789123 21040227
17876 21040227 17279585 13148274 10550121 9116806 8290003 7791483 7503175 7353759 7306945
17867 7306945 7367142 7583195 7969317 8584709 9491274 10795341 12724631 15604632 19913900
17858 19913900 26095096 34189295 43681001 53555845 62542535 69565886 74078511 75546885
17850 75546885 73458991 67816262 59045246 48704625 38775035 30718420 25256394 22156401
17842B2156401j282658R8172J482969L176919N280380P455680R189635R901504
17834E7459002R285405P420148M876514J876930j712907n549710r048120j1204081
17826E3403181j1183595r589087p058977m725242l111075k156502j572127j180090
17818A2826486r24719p01331n78496n04535m44597l70984l21494k78043k35445
17809H466842k27263k50880k46886k70671k81142k65361k99194l44175l37309
17800E943961l25831k87986k44481k35726k17978j72653j56364j50836j39240
17791D012866j36566j34447j25254j14021q9875r1431j02013r0300q9706r7642
17781B941611j04762q6290p2139p0649o5983n5895p9385p7683o9567l8067n3683
$$ plain form
17842 22156401 20873743 20971915 22454884 25631803 30912183 38367863 47557498 57459002
17834 57459002 66744407 74164555 79041069 80917999 79205092 73655382 64607262 53403181
17826 53403181 42219586 32630499 25571522 20846280 17735205 15578703 14006576 12826486
17818 12826486 11901767 11200436 10621940 10117405 9672808 9301824 8980330 8702287 8466842
17809 8466842 8239579 7988699 7741813 7471142 7190000 6924639 6625445 6281270 5943961
17800 5943961 5618130 5330144 5085663 4849937 4631959 4459306 4302942 4152106 4012866
17791 4012866 3876300 3741853 3616599 3502578 3412703 3321272 3219259 3128959 3039253 2941611
17781 2941611 2836849 2750559 2678420 2607771 2541788 2485893 2406508 2328825 2259258 2221191 2167508
17770B167508m9402n2832o3912l5057n4797n0080m8626n6661l0832k0170o1972
17759A643167m2974m4127l8966m7471k3290k8170l4621l3764k7017l2992l109
17748A286666l720k2643j4259k7731k9065m9409m0954p127k7971k7684l0396l0537
17736I75170o668j5118l7987l828j4532m3k202j5326l931Q275M535R770k534k9356
17722H66225k1583j8089k5320m2279l1285m0985m6294l184O288m996j2618p499
17710F18381q588l641k1823l3906j5112k5170j8126R804k839m136j6210m3403
17698D35231o943l391q448k1205l153K1349p085k0899q215j3638j5679k0507o980
17685C20437J070J617K4555j4757r578j95L68k3886j2484R891j1788j1911k159
$$ plain form
17770 2167508 2118106 2065274 2001362 1966305 1911508 1861428 1812802 1756141 1725309 1705139 1643167
17759 1643167 1600193 1556066 1517100 1469629 1446339 1418169 1383548 1349784 1322767 1289775 1286666
17748 1286666 1282946 1260303 1246044 1218313 1189248 1139839 1098885 1091758 1063787 1036103 1005707 975170
17736 975170 968502 953384 915397 911569 897037 896994 894792 879466 875535 883810 888345 898115 895581 866225
17722 866225 844642 826553 801233 758954 727669 686684 640390 637206 643494 638498 625880 618381
17710 618381 609793 606152 584329 550423 535311 510141 492015 501819 498980 494844 478634 435231
17698 435231 428288 424897 416449 395244 392091 413440 406355 385456 377241 363603 347924 327417 320437
17685 320437 321507 323124 347679 332922 323344 323149 323517 299631 287147 297038 285250 273339 271180
17672B71180L1748N773l5688q082J994k630k2327l411P176M66K960j1641m086
17659B33432q548k36J1399o836O622j1866j3532j47j6328O167k898j2247j0243
17646A74739J6336R131k1176j6662j6330L796j0000J3138L261j2691K2051J9853
17634A85446J1219k9401o588o201j2546j805K173k448J8280N019J5018M727k5408
17621A57485k1280j8690R182J3088L5417K7943j535M540j0831P161j017l609P006
17608B04860J6335K7793K4850J3203O988p427j077P433M4401O1336M1842L6481
17596D77018M4819O6619L2748J6605j2006k9676l0280l6356j4312j1913m5105
17585D58161m9983l9818l1018j7280K1841K3110M2347K8943K9790K7004K4557
$$ plain form
17672 271180 302928 308701 273013 264931 266925 264295 241968 238557 245733 246199 249159 237518 233432
17659 233432 224884 224648 236047 229211 235833 223967 210435 210288 193960 200127 197229 184982 174739
17646 174739 191075 200206 179030 162368 146038 149834 139834 152972 156233 143542 165593 185446
17634 185446 196665 167264 160676 154475 141929 140124 142297 139849 158129 163148 178166 182893 157485
17621 157485 136205 117515 126697 139785 175202 203145 201610 206150 195319 202480 201463 197854 204860
17608 204860 221195 248988 273838 287041 294029 286602 285525 292958 337359 398695 440537 477018
17596 477018 521837 588456 621204 637809 625803 596127 565847 529491 515179 503266 458161
17585 458161 408178 368360 337342 320062 341903 365013 407360 436303 466093 493097 517654
17574E17654L4866L5477Q656j2643l1306l8209j9885k0826l3086k5103l0264j8005
17562C67326j6901j560L417j3315K1312L5397K8618N4434Q4338J13554R5452P9434
17550H51506R4430J02654Q9319P9311M8243j3356n1464n0450n5351q2643j26648
17539H85551j47597j07474m3422k7697k1669N2r224n046Q670K3775L8339L9379
17527F33637N6782M7918L1515L0951L7915K2306L5684K0642j574R155P181L674
17515I35786K0531M2744N5116N2626M3172P9682Q5398R7622J06387J37387J16457
17504A772908R1542J18744J26782J44139J69195J70554J98256L07857M03606N20692
17494D024275P17414R32080J220254J720321K617382M182857O341442P729504
$$ plain form
17574 517654 552520 587997 596653 584010 552704 514495 494610 473784 440698 415595 385331 367326
17562 367326 350425 348865 352282 338967 360279 395676 424294 478728 563066 676620 772072 851506
17550 851506 945936 1048590 1137909 1217220 1265463 1252107 1200643 1150193 1094842 1012199 885551
17539 885551 737954 630480 587058 559361 537692 537744 528520 523474 532144 555919 594258 633637
17527 633637 690419 738337 769852 800803 838718 861024 896708 917350 915776 924931 932112 935786
17515 935786 956317 999061 1054177 1106803 1149975 1229657 1315055 1412677 1519064 1656451 1772908
17504 1772908 1864450 1983194 2109976 2254115 2423310 2593864 2792120 3099977 3503583 4024275
17494 4024275 4741689 5673769 6894023 8614344 11231726 15414583 21756025 29485529
17486B9485529O973735N189283L905444K033228R77330J387262j879042n019110
17478D3053659j679835J779973K111864J586728M83438r46162r17767l474882
17470D1997016r107013r464187n883713l262833j962112j256493q66688n99770
17462I594207m28708l16912k21952j05980k9616N355M7123O5418J7738J3699Q3763
17451H724135J70054K68472M28611P81088J401809K417281L934120N486619N964981
17442B9577170N008560L756181K556589J267405J047818K73481k632130k745165
17434C8109909K22835J552759J258231P61543n78565j237404j444481n434211
17426C3210616q706608o638750l830713k280060j470988j018021p45363n89362
$$ plain form
17486 29485529 36459264 41648547 45553991 47587219 48564549 49951811 48072769 43053659
17478 43053659 41373824 43153797 45265661 46852389 47335827 46389665 45471898 41997016
17470 41997016 32890003 23425816 17542103 14279270 12317158 11060665 10193977 9594207
17462 9594207 9165499 8848587 8626635 8520655 8491039 8496394 8543517 8608935 8626673 8640372 8724135
17451 8724135 8894189 9162661 9591272 10372360 11774169 14191450 18125570 23612189 29577170
17442 29577170 34585730 38341911 40898500 42165905 43213723 43487204 40855074 38109909
17434 38109909 38332744 39885503 41143734 41905277 41326712 40089308 38644827 33210616
17426 33210616 24504008 17865258 14034545 11754485 10283497 9265476 8520113 7930751
17418G930751m51673l70629l03017k61627k21538k14077j91416k00584k39632
17409E476558k26582k37276k47456k45842k21636j88287j63580j80467j93827
17400C571605j68800j43922j36060r8995j03560j26922q4465p2992j05074q6957
17390B443858o9652p4736p4911n3475n2861n7245n8901l6073n3843p1459m7506
17379A793196m9938m1365j3457n554N657J2854K762M027L681M5046L5085p487
17367A784507j9063n9526n7695o2561o6546q0273q3567q9828q4651p1853m7115
17356A061829k7846l0229k3799l4435m2200j5975l4771j5912q668J2820q859l1129
17344H00826k2277j5358k3446j6557j5044k2221k7933k7036k2087j4200j6807
$$ plain form
17418 7930751 7479078 7108449 6805432 6543805 6322267 6108190 5916774 5716190 5476558
17409 5476558 5249976 5012700 4765244 4519402 4297766 4109479 3945899 3765432 3571605
17400 3571605 3402805 3258883 3122823 3023828 2920268 2793346 2708881 2635889 2530815 2443858
17390 2443858 2374206 2299470 2224559 2171084 2118223 2060978 2002077 1966004 1912161 1840702 1793196
17379 1793196 1743258 1701893 1688436 1682882 1688539 1701393 1704155 1708182 1711863 1756909 1791994 1784507
17367 1784507 1765444 1705918 1648223 1585662 1519116 1438843 1355276 1265448 1180797 1108944 1061829
17356 1061829 1033983 1003754 979955 945520 903320 887345 852574 836662 827994 840814 831955 800826
17344 800826 778549 763191 739745 723188 708144 685923 657990 630954 608867 594667 577860
17333E77860j1471r670k8364j8905J419k9666l4521K3935J7425N249k9845o082
17321D57364q920k9469q952l722r021P915m317j6140k2060j376p896J0699L742
17308C67847m624q189k9457k0139J544M716J7975R550p088j929j1688Q29k2569
17295B96778o557M255j2766j7179m086j5756M589j1972j0121J862r040k321Q453
17282B26139o783j322J7578J1995R632L6750L1846M6569L7553J8818L4922L2762
17270D96459j095l61j1847l5706k4616l9632m7168l2053m3166m327q028R464K13
17257B58137K3600K7781K8297M4937N0599M1045M5930K4410J7294J003l0075p0628
17245D62330o5853o7931n7232j8355j1773m158r955k0427j4965J3455k788q636
$$ plain form
17333 577860 566389 556719 528355 509450 510869 481203 446682 470617 488042 493291 463446 457364
17321 457364 448444 418975 410023 406301 397280 405195 400878 384738 362678 361302 353406 364105 367847
17308 367847 363223 355034 325577 305438 306982 311698 329673 339223 332135 330206 318518 319347 296778
17295 296778 290221 294476 281710 264531 260445 244689 249278 237306 227185 229047 220007 217686 226139
17282 226139 219356 218034 235612 247607 257239 293989 325835 372404 409957 428775 463697 496459
17270 496459 495364 495003 483156 447450 422834 383202 336034 303981 260815 256488 248460 257924 258137
17257 258137 281737 309518 337815 382752 433351 474396 520326 544736 562030 563033 532958 462330
17245 462330 396477 328546 271314 252959 241186 237028 227073 206646 191681 205136 202348 193712
17233A93712j7649n956J1546p932j8768R148K498j0719k0523J3963r63j0753q551
17220A29053K1275L881K556j0715j5993j1961O852N260L816j431L650J9047o186
17207A49104j4508K0478J9865Q650k1384m599j6373K397j3599o481J4302j2968
17195A24884j428R528P258j5568n996o62R577J4337j4985j9351J7713Q370o944
17182A26733j1501j7150J1824J7733J1332j3435j1645k0177l845o469R007J7143
17170A09550R144n4j300K0219J4202J5457L121q810M746J5573j1501J3808M072
17157A88227j7436j2525l113M438n911L984J2271J2448L5659j2335o97P32j9823
17144A85919N2R702N536L56r989j6883j8383j7276l639J4810q423j624K6544P371
$$ plain form
17233 193712 176063 170107 181653 173721 154953 164101 166599 155880 135357 149320 148357 137604 129053
17220 129053 150328 154209 156765 146050 130057 118096 124948 130208 134024 132593 136243 155290 149104
17207 149104 134596 155074 174939 183589 162205 157606 141233 143630 130031 123550 137852 124884
17195 124884 123456 132984 140242 124674 118678 118016 127593 141930 126945 107594 125307 133677 126733
17182 126733 115232 98082 109906 127639 138971 125536 113891 93714 89869 83400 92407 109550
17170 109550 118694 118640 117340 137559 151761 167218 170339 161529 166275 181848 170347 184155 188227
17157 188227 170791 158266 155153 159591 153680 157664 169935 182383 218042 205707 205010 205742 185919
17144 185919 185971 195673 201209 201565 191576 174693 156310 139034 135395 150205 141782 140158 166702 174073
17130A74073o583M820j366o818O589M259K4444m033j1143k5694j077Q87J4165
17117A72523N327K793J6634o163L469Q081N53K0168O558N909M279K2494J2961
17104B75586L219j0843r538K8458L7918J3419k44n90J179j2326m516J1956K7458
17091C61136R086j2822Q311J8104K1940K0279J2211K6164L7296K1524L7862L6480
17079E97571J5774L3421M4310N1785N5736N6220J01895J18577Q6438J11779J42609
17068A416115J57648J74639J78876K08099J99470J91701K46445K98263L03775
17059C375031L15394L68004M64006O31746Q47977J151264J586500K425756L847788
17050A5013466N905484P711234P844239O864431O733889O774795O536459O187216
$$ plain form
17130 174073 167490 172310 170944 164126 170715 174974 199418 195385 184242 158548 157471 158358 172523
17117 172523 177850 180643 197277 191114 194583 202664 203217 223385 229943 235852 240131 262625 275586
17104 275586 278805 267962 258424 286882 324800 338219 337975 337385 338564 326238 321722 333678 361136
17091 361136 370222 357400 365711 383815 405755 426034 438245 464409 501705 523229 561091 597571
17079 597571 613345 646766 691076 742861 798597 854817 956712 1075289 1161727 1273506 1416115
17068 1416115 1573763 1748402 1927278 2135377 2334847 2526548 2772993 3071256 3375031
17059 3375031 3690425 4058429 4522435 5154181 6002158 7153422 8739922 11165678 15013466
17050 15013466 20918950 28630184 36474423 43338854 50072743 56847538 63383997 69571213
17042F9571213J402622n315344o490458n099039l275146m694073r056667q560906
17034B8482202m839708j998976J2633J960081M209629O227450O767560N929837
17026D6750708N656088N816594N532673N505522J965516m856893o864859n727993
17018E3777356l915798m313824q680197r544317o342082l731705k303331j523252
17010A3422850j126822r14676p65036o21739n32840m82713m61301m59233m01059
17001G657431l52298l29345l04244k78583k61038k36209k26687k41772k46326
16992E180929k28296k05226j72142j76147k01531j86672j61948j52843j32936
16983C563188j16456q7353r7880r3148j06130q5895o9382m6369n9943m7840m0850
$$ plain form
17042 69571213 70973835 65658491 59168033 54068994 50793848 46099775 37043108 28482202
17034 28482202 23642494 21643518 21656151 23616232 27825861 34053311 40820871 46750708
17026 46750708 52406796 58223390 63756063 69261585 71227101 66370208 59505349 53777356
17018 53777356 49861558 45547734 36867537 27323220 20981138 17249433 14946102 13422850
17010 13422850 12296028 11381352 10616316 9994577 9461737 8979024 8517723 8058490 7657431
17001 7657431 7305133 6975788 6671544 6392961 6131923 5895714 5669027 5427255 5180929
16992 5180929 4952633 4747407 4575265 4399118 4197587 4010915 3848967 3696124 3563188
16983 3563188 3446732 3359379 3261499 3168351 3062221 2976326 2906944 2860575 2800632 2752792 2711942
16972B711942n7046q0840q2211n8043p9644j12002r4255n6012n3894k5482j2777
16961A999736l1514n0392m9081m1290m2409o7863p7063o6359o0753m5637m0216
16950A427159m2677n8204m6041l8367m4259k4242k3299k5833j1373j7084k4320
16939A071460n1641k3015k3106j896J1330K3051j6673j5315Q53J528j7626j4784
16927I44166l3810m9733m3013j4140Q372J7991J457o407k266O618M010k4980o0812
16914G47453n7267m4021k9238k7913k6793j6839j0119j4707j2028Q829j3867k1213
16902D82277j2402j5129j7106j2224Q858j973j6371k676J335l062m855j8802m421
16889C83449k3900k6811n706K615o721j1463j6491l781j5577R643k3204k0180
$$ plain form
16972 2711942 2654896 2574056 2491845 2433802 2354158 2242156 2147901 2091889 2037995 2012513 1999736
16961 1999736 1968222 1917830 1868749 1827459 1785050 1717187 1640124 1573765 1513012 1467375 1427159
16950 1427159 1384482 1326278 1280237 1241870 1197611 1173369 1150070 1124237 1112864 1095780 1071460
16939 1071460 1019819 996804 973698 971802 983132 1006183 989510 974195 975048 976576 958950 944166
16927 944166 910356 860623 817610 803470 811842 829833 831290 824883 822617 829235 833245 808265 747453
16914 747453 690186 646165 616927 589014 562221 545382 535263 520556 508528 517357 503490 482277
16902 482277 469875 454746 437640 425416 434274 432301 415930 413254 414589 411527 406672 387870 383449
16889 383449 359549 332738 327032 329647 322926 311463 294972 291191 275614 285257 262053 241873
16877B41873R340J9112J955p782m5708k8594J4100P660J0095O112M707J4932K256
16864B50058Q183K4823L5642M9124L2642L6833K7473N211J4707Q739j1380l0529
16852D51526l5887k0446r491l7789o0700l4711k2388p092J485L64K3695M9399
16840B97965L1886K1106L5331J3804K951J6950L9422K5189k9991m9973j1133j0215
16828C83292j2480k8541m8786l8944j3613p466l722k1087q557j7137j5336J5126
16816A82749l263l3724l9531r070J4399J1036p976p813n133j839O988k084l818
16803A00921o838J0907l125p850J1583M789J2037k650j6705J3305J1673o033k5946
16790I6068k0672p534J5631L478n543l74Q222n029J3942J5750L206l0196j5223
$$ plain form
16877 241873 251213 270325 272280 264498 218790 190196 204296 211956 222051 228163 232870 247802 250058
16864 250058 258241 283064 318706 367830 400472 437305 464778 469989 484696 493435 482055 451526
16852 451526 415639 395193 385702 347913 287213 252502 230114 223022 224507 224871 248566 297965
16840 297965 329851 350957 386288 400092 403043 419993 459415 484604 454613 404640 393507 383292
16828 383292 370812 342271 293485 254541 240928 233462 229740 208653 200096 182959 167623 182749
16816 182749 179486 145762 106231 97161 111560 122596 114620 106807 101674 99835 106823 104739 100921
16803 100921 94083 104990 101865 94015 105598 110387 122424 119774 103069 116374 128047 122014 96068
16790 96068 75396 67862 83493 86971 81428 81054 89276 84247 98189 113939 117145 86949 71726
16777G1726Q167o760k03J741j3216j229K041L344m561N63J7457P127K178J8306
16763A06681k422l4205j9954J856L5179Q132J4267j053P190j6647j4429k9274
16751E5321k285K2667J9472q143R614j125r838k2564j4079p909o110K0911Q082
16738F4014J4576J1111j9388j0385j4114j2901M968O13M105l613j2101k1922k6707
16725b1744o353Q391K1871P691j3782L800J1246J2388L023o860K32R861J719J8154
16711D9637p549j8556K75P007N497K023l80J3305r597k0444k4012P540J0921j307
16697A4360J7606p773m1936J2142K0063Q639j1545k164K839j962j3606j9838J7770
16684e405J2251q096J3081j2181m725m926j3326J0008r50K2727K3150J4734k719
$$ plain form
16777 71726 79893 73133 72930 74671 61455 60226 62267 65611 61050 61613 79070 86197 88375 106681
16763 106681 104259 70054 50100 51956 87135 95267 109534 108481 115671 99024 84595 55321
16751 55321 53036 75703 95175 87032 96646 95521 85683 63119 49040 41131 35021 55932 64014
16738 64014 78590 89701 70313 59928 45814 32913 37881 38494 42599 38986 26885 4963 -21744
16725 -21744 -28097 -19706 2165 9856 -3926 -126 11120 23508 26531 19671 19903 29764 31483 49637
16711 49637 42088 23532 23807 30814 36311 38334 37954 51259 41662 21218 -2794 4746 15667 14360
16697 14360 31966 24193 -17743 -5601 14462 23101 11556 9392 12231 10269 -3337 -23175 -5405
16684 -5405 6846 -1250 11831 -350 -5075 -10001 -23327 -13319 -14269 8458 31608 46342 43623
16671D3623O20Q486r533k5941k2803O083J9291L983o158j3549j319j96J4162Q896
16657B5645Q590l943k7403n401M282J3271K4946J4358j0705k035j505j5788m043
16644B0269Q671O155P062j5271j5183M995L973K844j5966N328J2582k559L646
16631B6546K931J681K339j0853N850n324J6362j25j3601K06J8280j696j6654M446
16617C0388J3246Q322l712N237K1718Q331m577P298N891L628n790m5355q093j0600
16603B5932j4297J2195J6619N341k3887K3127J3880J4497k876Q227K843q804j4722
16590E8075q855P125M990n85J1914k653J350j55k3377m401l832j803j8735k2598
16576c540k533n654j326R674m207J6054M961o588n768q901L125j585K0575L163
$$ plain form
16671 43623 44243 52729 43196 17255 -5548 535 19826 23809 17651 4102 2783 2587 16749 25645
16657 25645 34235 30292 2889 -2512 1770 15041 39987 54345 43640 41605 40100 24312 20269
16644 20269 28940 35095 42157 26886 11703 16698 20671 23515 7549 12877 25459 22900 26546
16631 26546 29477 31158 33497 22644 28494 23170 39532 39407 25806 26012 44292 42596 25942 30388
16617 30388 43634 51956 48244 53481 75199 83530 78953 86251 92142 95770 89980 44625 36532 25932
16603 25932 11635 23830 40449 45790 21903 45030 58910 73407 70531 78758 81601 72797 58075
16590 58075 49220 56345 61335 60750 72664 70011 71361 71206 47829 43428 39596 37793 19058 -3540
16576 -3540 -6073 -11727 -13053 -3379 -7586 8468 13429 6841 1073 -7828 -4703 -6288 14287 17450
16562A7450J5842J5134L014o318j5291P944K284k113k324Q155j4858L003lj3982
16548A7937o240P762J0125J4852J3076p688j1229j0869j7804M345K4425j1764
16536B6928j1471j0433J1825J4188M015j8032j3237J4064j7119k3365j662J5756
16524h543O491j4182n882J4208j872k613P45K0325k955m749j826o849K0477J1197
16510B3972p285N941j2727Q512p228Q66k40J834m430q721l27K0058R695R71L190
16495C4081K5624K6407L7780N1412L8384L6412M6379M1845J4923L1328j7210m0275
16483C27090l2508j7031j7863n4309o2885m1483r599J6481K5387J8836L9159K8744
16471B20019K6855M7770K4153L5977M2007J9800j3573m3002l8679k6339k9356
$$ plain form
16562 17450 33292 48426 51440 45122 29831 37775 40059 37946 35622 43777 28919 31922 31919 17937
16548 17937 11697 19459 29584 44436 57512 49824 38595 27726 9922 14267 38692 26928
16536 26928 15457 5024 16849 31037 35052 17020 3783 17847 728 -22637 -24299 -8543
16524 -8543 -2052 -16234 -22116 -7908 -9780 -12393 -11648 8677 5722 973 -853 -7702 12775 23972
16510 23972 16687 22628 9901 18413 11185 12051 11811 13645 9215 494 167 20225 29920 30891 34081
16495 34081 59705 86112 123892 175304 213688 250100 296479 338324 353247 384575 367365 327090
16483 327090 294582 277551 259688 205379 142494 101011 91412 107893 133280 152116 191275 220019
16471 220019 246874 294644 318797 354774 396781 416581 403008 360006 321327 294988 265632
16460B65632n5238k9520l2861l2598l0260k1720P803k019r832j8873q713j8689
16448A3112J6935L5234Q315j1615j4281K947K991j0144j0740q520l099K941M781
16435B8857n489j9588k736L370j3381K0484J0108K880n631J5086J1304q632k2989
16422A3643Q815n895j2074m629J4524L0525n728J162q119j2862r669q195j1607
16409a0109n172J3452K0310n718j3220m364J4489k080K4809k858n267j4274l574
16396F424m023l308j553L662R599J0246j1972l205k729Q909l337j828k047p029
16382b191n29Q984j6969j0434R505J2431O464O205N71J1536p384r129j026J495
16368I529j3013k784r587J1427n69P182J4592J2461J1414M55m628k2754k528p232
$$ plain form
16460 265632 210394 180874 148013 115415 85155 63435 71238 69219 59387 40514 31801 13112
16448 13112 30047 65281 73596 61981 47700 50647 53638 43494 32754 24234 21135 24076 28857
16435 28857 23368 3780 1044 4414 -8967 11517 21625 24505 18874 33960 45264 36632 13643
16422 13643 22458 16563 4489 -140 14384 44909 39181 40343 32224 19362 9693 1498 -10109
16409 -10109 -15281 -1829 18481 12763 -457 -4821 9668 7588 32397 29539 24272 9998 6424
16396 6424 2401 -907 -2460 1202 10801 21047 9075 5870 3141 12050 8713 6885 4838 -2191
16382 -2191 -2720 6264 -10705 -21139 -11634 797 7261 13466 14037 25573 18189 9060 8034 9529
16368 9529 -3484 -6268 -15855 -4428 -4997 2185 16777 29238 40652 41107 36479 13725 11197 3965
16354C965P132J3176o85j4978j0596m777O539J0154l523q160n456J0581k300Q645
16340I717M387L176q94p527j6676j4087k867l36J0244L984P809N604L370j4207
16326h303j1460R481J4607J1155j344Q294p123j5765k288R270Q969R935r735k122
16312A3571o975Q386J5735J1241J525o541j0296k9821q356r752j4617M198P968
16299b3734O730j0016j6308Q78O357J9212M390R169q90j4565J298J6680J4486
16286A3687J8577n931j5194m604J1538q204l637N284R329j601k332k1597j6687
16273b1372J3150O162N096j1489j6260Q093J9673Q458M322j709l0635M279K2408
16260A0176Q548j241k5887J435n04L903J76k547P723J0234n980j7744J6107n47
$$ plain form
16354 3965 11097 24273 23588 8610 -1986 -6763 -224 9930 6407 -1753 -7209 3372 1072 9717
16340 9717 14104 17280 16386 8859 -7817 -21904 -24771 -25107 -14863 -10879 -3070 2534 5904 -8303
16326 -8303 -19763 -10282 4325 15480 14136 22430 15307 -458 -2746 6524 15493 25428 15693 13571
16312 13571 6596 14982 30717 41958 43483 36942 26646 -3175 -11531 -21283 -35900 -31702 -23734
16299 -23734 -17004 -27020 -43328 -42450 -36093 -16881 -12491 -3322 -4212 -18777 -17479 -799 13687
16286 13687 32264 26333 11139 6535 18073 9869 6232 11516 20845 19244 16912 -4685 -21372
16273 -21372 -8222 -2060 3036 -8453 -24713 -16620 3053 11511 15833 14124 -16511 -12232 10176
16260 10176 18724 17483 -8404 -6969 -7473 -3570 -3394 -5941 1782 12016 6036 -11708 4399 3852
16246C852m360j71m456K921p323J5288J0391J3277j4745l4748o958L7286J5213
16233B5467j2526j97o587M794Q958j3672o272J3764R155l960N69m573m731N800
16219A5989J3914j7865l2425K401J1955J6304R808r960O268L664j2910n388O26
16206B381j2183O959K6919K9828q261l2540k4344p384K410M989P868L851J4703
16193A5196j1284r169O63L548J1526j883j0421R094m604j1032j5666L433J0210
16180a0389Q955J3480P259M311q501j6498r269N510J6694K09p477k2698j2382
16167c0796J0357K1371Q428J1737j2343p302l313J477k004N500l362P247l58j800
16153D839J2991j2581j2081J2638o064K138m027M220k805P156Q478k202L849r840
$$ plain form
16246 3852 -508 -679 -5135 -2214 -9537 5751 16142 29419 14674 -20074 -27032 10254 25467
16233 25467 12941 12744 6157 10951 19909 6237 -35 13729 22884 18924 19493 14920 10189 15989
16219 15989 29903 12038 -20387 -17986 -6031 10273 20081 10121 16389 20053 7143 1755 2381
16206 2381 -9802 -2843 24076 53904 45643 13103 -11241 -18625 -16215 -11226 -3358 493 15196
16193 15196 3912 -5257 -4594 -1046 10480 8597 -1824 7270 2666 -8366 -24032 -20599 -10389
16180 -10389 -1434 12046 19305 23616 15115 -1383 -10652 -5142 11552 11761 4284 -18414 -30796
16167 -30796 -20439 932 9360 21097 8754 1452 -1861 -384 -2388 3112 -250 6997 6639 4839
16153 4839 17830 5249 -6832 5806 -258 1880 -2147 2073 -732 6424 14902 12700 16549 6709
16139F709j9002k9590p348K2609K9052J5340j9307j9506l300J4787J8963j201
16127H206Q719m648j326J82k526K4909N099j5032o558j2852R917R787m946P862
16113B6793J474J676R507j2802j7627j5271O308Q092L747p907j6802J626n901
16100a7087l485L318M070k459j154M663J765j777j3246J1450Q968j6833l178K0776
16086d209P456k0112k287J074p332J6769J7361j5689q710K7601r06j3342J5095
16073A2769J8399j880n060o468n103K558j0974o860m102N763N648M39J945Q960
16059A6034Q126l33q644l316M486m316j9176K0388L352P317J62j0362r617j690
16045B411J5391p28j9697k0741N203J5090J5830q944j8732J2059J6331M39q744
$$ plain form
16139 6709 -12293 -41883 -49231 -26622 2430 17770 -1537 -21043 -24343 -9556 9407 8206
16127 8206 16925 12277 10951 11133 8607 33516 38615 23583 17025 4173 14090 23877 18931 26793
16113 26793 28267 29943 39450 26648 9021 -6250 58 8150 11897 3990 -12812 -11186 -17087
16100 -17087 -20572 -17254 -13184 -15643 -16797 -12134 -10369 -12146 -25392 -13942 -4974 -21807 -24985 -4209
16086 -4209 3247 -16865 -19152 -18078 -25410 -8641 8720 -6969 -15679 11922 11016 -2326 12769
16073 12769 31168 29288 24228 17760 12657 15215 4241 -2619 -6721 -958 4690 5129 7074 16034
16059 16034 24160 23827 15183 11867 16353 12037 -7139 13249 16601 23918 24080 13718 4101 2411
16045 2411 17802 17074 -2623 -23364 -18161 -3071 12759 3815 -14917 -2858 13473 13912 5168
16032E168O737P049J3432j4506k0497j3921P297J7650N006j6458m381J5556J598
16019I730l472j1641Q242k6773j1122K4550K3267L773o518q506q848o123J869
16006a1572Q312K2938l754O93j8659j0025P776J154Q096o781j9205k508J0165
15993a3370J1998l638q996O403J665l617q66q940q353M711J7068M172l181J933
15979c011k522k8470n554J9094K9593J779k4364N163L577J077J9725k361m651
15966I075o193m958n772j893J0185j715l625L906R61r445m791J8401j490j4937
15952a2291J0036r980J5100k774j8407j148j7322m924Q939J6137R487R49O98P05
15938d795m439N387n006k754J5498j2708q012q386p560O865J3093j2932j7841
$$ plain form
16032 5168 11905 18954 32386 17880 -2617 -16538 -9241 8409 13415 -3043 -7424 8132 9730
16019 9730 6258 -5383 2859 -23914 -35036 -10486 12781 16554 10036 1530 -7318 -13441 -11572
16006 -11572 -3260 19678 15924 16617 -2042 -12067 -4291 -3137 4959 -1822 -21027 -23535 -13370
15993 -13370 -1372 -5010 -14006 -7603 -5938 -9555 -10421 -19361 -27714 -23003 -5935 -1763 -4944 -3011
15979 -3011 -5533 -34003 -39557 -20463 9130 10909 -13455 -8292 -4715 -3638 16087 13726 9075
15966 9075 2882 -2076 -7848 -9741 444 -1271 -4896 -990 -29 -9474 -14265 4136 2646 -12291
15952 -12291 -2255 -12235 2865 91 -18316 -19464 -36786 -41710 -32771 -16634 -7147 -6198 -5500 -4795
15938 -4795 -9234 -3847 -8853 -11607 3891 -8817 -16829 -25215 -32775 -25910 -12817 -25749 -43590
15925d3590J4653J1275K719j4167J285L0832R81J0782l191p894j558K2532J0938
15912C5597R705k259m664k3669k2484r544r969n233J3141J1941r495n469P783
15899a4619J4603J2868M150j5404m570J2725k146q417l715J4066K086n700j9438
15886a3511q554J2621J6048j2317p482o621O863P394J035O811k719J0648J0710
15873B0926j2467j9496J956k473K3054k089j4176n724k607J6874n689j7327J830
15860a7408J9278J4732R618m707K061k643j8311j7334j1377J3764J1521P117J0651
15847A6962P262N325L16k137k362j2316j3815j3255m98r421J5452l470m417j3555
15833b9929J2610K5616J348K0601q255j9208O959R0n187j2409L54N154J4455k9725
$$ plain form
15925 -43590 -28937 -17662 -14943 -29110 -27825 3007 3988 14770 11579 3685 2127 24659 35597
15912 35597 45302 43043 38379 14710 -7774 -17318 -27287 -32520 -19379 -7438 -16933 -22402 -14619
15899 -14619 -16 12852 17002 1598 -2972 9753 7607 -810 -4525 9541 11627 5927 -13511
15886 -13511 -22065 -9444 6604 -5713 -13195 -19816 -12953 -5559 -4524 2287 -432 10216 20926
15873 20926 8459 -11037 -9081 -11554 11500 9411 -4765 -10489 -13096 3778 -1911 -19238 -17408
15860 -17408 1870 16602 26220 21513 23574 20931 2620 -14714 -26091 -12327 -806 6311 16962
15847 16962 24224 29549 29865 27728 25366 13050 -765 -14020 -14518 -23939 -8487 -11957 -16374 -29929
15833 -29929 -17319 8297 9645 30246 21991 2783 9742 9832 4645 -7764 -7410 -2256 12199 -17526
15819a7526o025O901j5239J2927L573k038K5453O689j5232k4609k68K9973K3643
15806B8222j4687j1893o862j1958N591Q778j0899j1929q686N241K043P559K8135
15793H655Q969j1377j8736J4003q679l809K2519m833k0574M015Q084K1415J5269
15780C4921P667k6151k7226K859K198N587l131j4742J2729L107n884p811J026
15767a4851K19N718J4597J58j2244K405j5315j4728M607J587M327K694K1612K3785
15753B4571l47m542k0167n827r333R682m250J6016L08p943j5380j5669n701J0076
15739b8506P955J4150J7941L57j0078j3780K3238L155p736j5622q02O975K7112
15726B4359N577k1476k5528k1388M920K6219J30j9626n035J0209J2763J2521m174
$$ plain form
15819 -17526 -23551 -16650 -31889 -18962 -15389 -17427 8026 14715 -517 -25126 -25394 4579 28222
15806 28222 13535 1642 -5220 -17178 -11587 -2809 -13708 -25637 -34323 -29082 -27039 -19480 8655
15793 8655 17624 6247 -12489 1514 -7165 -10974 11545 6712 -13862 -9847 -1763 19652 34921
15780 34921 42588 16437 -10789 -7930 -5732 -145 -3276 -18018 -5289 -2182 -8066 -15877 -14851
15767 -14851 -14632 -8914 5683 5841 -6403 -3998 -19313 -34041 -29434 -27847 -23520 -20826 786 24571
15753 24571 24224 19682 -485 -6312 -15645 -5963 -10213 5803 6111 -1832 -17212 -32881 -38582 -28506
15739 -28506 -20551 -6401 11540 11897 1819 -11961 11277 14432 6696 -8926 -9728 -2753 24359
15726 24359 29936 8460 -17068 -38456 -33536 -7317 -7187 -26813 -31848 -21639 -8876 3645 -529
15713e29q145m354j4976J3701J7502j4702j0695M772J4888J225K014R019j3850
15700d130l8505j0166Q759J7392K0978j407q624J993j0259N631R606m431j1563
15687b4726O348R596R87O178O427Q543K269O609K743m241k0052k1017J1266J2279
15673C209p6J5880m029l847J6503o781L847J3090j439l6487j082O800q651P100
15659D037P09o742L659q237p533K675J9664K120r426l746p717p985N378q398Q620
15644a2922J5980m829K451P675j1084j1416Q368M809o065J2123K2183L652j1632
15631A9293l891R668j5563k0132k0541R052O135J1996j2456J0369J1222Q296J1726
15618B5174M268k4129J630P921j8254j4423K4839J8476j902o738j8581J944N706
$$ plain form
15713 -529 -8674 -13028 -28004 -14303 3199 -11503 -22198 -17426 -2538 -1313 701 9720 -4130
15700 -4130 -42635 -52801 -44042 -26650 -5672 -7079 -15703 -13710 -23969 -18338 -8732 -13163 -24726
15687 -24726 -18378 -8782 -7795 -1617 4810 13353 15622 22231 24974 20733 681 -20336 -9070 3209
15673 3209 3133 19013 14984 11137 27640 20859 24706 37796 36357 -130 -1212 5588 -3063 4037
15659 4037 4746 -1996 1663 -6574 -14107 -11432 8232 10352 926 -2820 -10537 -18522 -13144 -21542 -12922
15644 -12922 3058 -1771 680 8355 -2729 -14145 -5777 -968 -7033 5090 27273 30925 19293
15631 19293 15402 25070 9507 -10625 -31166 -22114 -15979 -3983 -16439 -6070 5152 13448 25174
15618 25174 29442 5313 6943 14864 -3390 -17813 7026 25502 23600 16862 -1719 225 5931
15605E931O43j331J770j3767J2654P095N547k0228j169L184O044J1948Q235m883
15591B1673j4517k8690M460p88j4869Q36K627m87J2774k8197q969L0159K2316
15578a672J959J563p840j0408j0393n27J5977J6340P059j234O77l886j808n300
15564E07K993k266j0007Q112Q308J732j7368j2986n055j480q20L098M997K1718
15550A483J4343j328L641K798j5717j1673k7851k2248n38L1601P584j4424J904
15537c0425J312P286R993K6116o423k6148n807J0415j5215P185M965r493j1304
15524c7543o026R670K0540n112J1142J0101J7746r226k9559k291J6051L323K1119
15511A9935N867j5882R266J8064n437J0337q873M806o746j8908j8779N683L134
$$ plain form
15605 5931 6574 5243 7013 -6754 5900 12995 18542 -1686 -2855 329 6373 18321 26556 21673
15591 21673 7156 -21534 -17074 -17862 -32731 -31895 -29268 -29755 -16981 -45178 -54147 -23988 -1672
15578 -1672 287 1850 -5990 -16398 -26791 -27318 -11341 4999 12058 10824 11501 7615 5807 507
15564 507 3500 1234 -8773 -661 7647 9379 -7989 -20975 -26030 -27510 -28330 -25232 -20235 1483
15550 1483 15826 14498 18139 20937 5220 -6453 -34304 -56552 -57090 -25489 -17905 -32329 -30425
15537 -30425 -29113 -21827 -11834 14282 7859 -18289 -24096 -13681 -28896 -21711 -16746 -26239 -37543
15524 -37543 -43569 -33899 -13359 -18471 -7329 2772 20518 11292 -18267 -20558 -4507 -1184 19935
15511 19935 25802 9920 19186 37250 31813 42150 33277 38083 31337 12429 -6350 -667 2467
15498B467N895J7625j0776j6864k241J1767j46o70r049J1526R705L743R51n504
15484A8429q519L891P783k4279k6942j8628L331K8781J3898L73r767P832j4396
15471a8213l348J4543J84j037O705P109N262J1852j2556j4002k1081q179K3980
15458h781j502r512J8202O812K628M622j27j1667O678J7669j478k777N049l590
15444B2226O43j7234j2136j1000Q247J1809O242J2041j4228j9558j4863J2124
15432a5687Q515J5052K5918P830P696j5961j231J8357r661k3901k8003j5151k385
15419b8612j0441r894K861Q590J726K4755K0347P760q938j6464N269J849j1900
15406a3092j802J4770o589K683P650N819Q576k487j9551M100Q910k4890j7985
$$ plain form
15498 2467 8362 25987 15211 -1653 -3894 7873 7727 7057 -1992 9534 19239 22982 23933 18429
15484 18429 9910 13801 21584 -2695 -29637 -48265 -44934 -16153 -2255 -1882 -11649 -3817 -18213
15471 -18213 -21561 -7018 -6834 -7871 -1166 5943 11205 23057 10501 -3501 -24582 -32761 -8781
15458 -8781 -10283 -19795 -1593 5219 7847 12469 12342 675 7353 25022 23544 20767 25816 22226
15444 22226 22869 5635 -6501 -17501 -9254 2555 8797 20838 6610 -12948 -27811 -15687
15432 -15687 -7172 7880 33798 41628 49324 33363 32132 50489 40828 16927 -11076 -26227 -28612
15419 -28612 -39053 -48947 -46086 -37496 -35770 -11015 9332 17092 8154 -8310 -3041 -1192 -13092
15406 -13092 -14894 -124 -6713 -4030 3620 9439 18015 15528 -4023 77 8987 -15903 -33888
15393c3888r23q087M049J0869J0874J1809N898J6898k6048q558l760k919K8169
15380D383J2778J0505R379j663k3r757k4048j8095j1690R087J1198q460j0571
15367b6977K1129J1567q232j0081k247k060k038L1123N511j8363P228R2J1383
15354A8035r063k3098p099J766Q214p927n469R556j6809q470q815N172j828J3309
15340c2526M42J6559J2728j3006j1190j3535J0332J3996J4847J5621O423j9214
15328A477p951k6515k5L1303M950r225K253k106j5452k2870M069K8737J6042q502
15314c815j1402j4202k0177o198K4098J8310l095J2453q56J3221K495k67j247
15301I318j7864m891O688J0341j092p093J1744l247j0022j4963M996J6031J228
$$ plain form
15393 -33888 -34811 -42898 -38849 -27980 -17106 -5297 601 17499 -8549 -17107 -20867 -23786 4383
15380 4383 17161 27666 37045 35382 35359 25602 1554 -16541 -28231 -19144 -7946 -16406 -26977
15367 -26977 -5848 5719 -2513 -12594 -14841 -16901 -18939 12184 17695 -668 6560 6652 18035
15354 18035 8972 -14126 -21225 -19459 -11245 -19172 -24641 -15085 -31894 -40364 -49179 -44007 -45835 -32526
15340 -32526 -32084 -15525 -2797 -15803 -26993 -40528 -30196 -16200 -1353 14268 20691 1477
15328 1477 -6474 -32989 -33014 -1711 3239 -5986 -3733 -5839 -21291 -44161 -40092 -11355 4687 -3815
15314 -3815 -15217 -29419 -49596 -55794 -31696 -13386 -16481 -4028 -4884 8337 10832 10565 9318
15301 9318 -8546 -13437 -6749 3592 2500 -4593 7151 3904 -6118 -21081 -16085 -54 1174
15288A174J115P050L224k661o507j8172J4399l940r240J888j2846j7328J5953
15275b5891J3699O676K55P51J831j856j172j1459L09M601J2991j2970j0194R760
15261a2669R593l129J0349J6704m57L1p21o888k351j254J3494K174Q257P005L25
15246D0463j6337k1729j0730K543Q664j488p15R074R56j363k319J5238J703q100
15232A5860j2036k091k57J0106M661r430j1245K762M57L178P140K315J3278M689
15218B9387q643p645l045J8j9789J2126L147k317j3970j1000L303j2353j2364
15205d3145K6726K6359m373k566k602L346k117R952j56k0198j1159J266K0991
15192B324J8069j5079k0920n210K509K49o572L082K2829J373p401J5154K003K0265
$$ plain form
15288 1174 2289 9339 12563 9902 3395 -14777 -378 -4318 -13558 -11670 -24516 -41844 -25891
15275 -25891 -12192 -5516 -5261 -4510 -2679 -4535 -5707 -17166 -16857 -12256 735 -12235 -22429 -12669
15261 -12669 -3076 -6205 4144 20848 20391 20422 19701 12813 10462 9208 22702 24876 33133 40138 40463
15246 40463 24126 2397 -8333 -5790 2874 1386 671 9745 10701 9338 7019 22257 23960 15860
15232 15860 3824 1733 1476 11582 16243 6813 -4432 -1670 -1213 1965 9105 11420 24698 29387
15218 29387 20744 13099 10054 10072 -9717 2409 5556 3239 -10731 -21731 -18428 -30781 -43145
15205 -43145 -16419 9940 5567 3001 399 3745 1628 11580 11424 -8774 -19933 -18667 2324
15192 2324 20393 5314 -15606 -20816 -18307 -18058 -24630 -21548 1281 2654 -4747 10407 12410 32675
15178C2675K4861K314o45r387k9510j9954n309J1260J0086m02k667q570j7802
15165a3050n547q718P67K4147l822j2998J1249o113j3125O91j1838n940J9398
15152b4899K0970M468o583O959L34P467O967k6045j0830J8003K111J0642R255
15139A8819p586Q519r950p716m988K8855O854k3607j2011P989L606M907J2864
15126B6555J1810J081j0613k3819Q022m983k084j6316L366n762r081M541P305
15113i978N173j602m822L875j2075j2417j0629N730K0681J8517O661j4922n558
15100a1366J3551J832r321l884o500P445k982J1333M794o000k7943J130J7542
15087a0369o19J3746o740R483j474M597p583j0169M611o963R136J379n325r207
$$ plain form
15178 32675 57536 59850 59205 49818 20308 354 -4955 6305 16391 15989 13322 4752 -13050
15165 -13050 -18597 -27315 -26548 -2401 -6223 -19221 -7972 -14085 -27210 -26519 -38357 -44297 -24899
15152 -24899 -3929 539 -6044 915 1249 8716 15683 -10362 -21192 -3189 -1078 9564 18819
15139 18819 11233 19752 9802 2086 -2902 25953 32807 9200 -2811 5178 8784 13691 26555
15126 26555 38365 39446 28833 5014 13036 8053 5969 -10347 -6981 -12743 -21824 -17283 -9978
15113 -9978 -4805 -6407 -11229 -7354 -19429 -31846 -42475 -36745 -16064 2453 9114 -5808 -11366
15100 -11366 2185 4017 -5304 -9188 -15688 -8243 -11225 108 4902 -1098 -29041 -27911 -10369
15087 -10369 -10988 2758 -3982 5501 4027 8624 1041 -9128 -4517 -11480 -2344 -965 -6290 -15497
15073a5497m148K185m490J2195L9077l634j3146m1309J0944O643J052L157k733
15060i704r020q947j907j064Q837J5933K1870j520j0623J842m793m531j9095J8638
15046d084L470K8505N163l765O32l131j9724M028l646j6861J2171J5141J1116
15033B9015J458k4874q87K628J1259o471M406K001J6027j0814k0873P631J426
15020A1932J651m822n522j3725o899J3363J4077l119P683K0738j8826l0211j3324
15007b7004N794Q755J0473O561L587J1324K8712j2076m328m069j0628L802j1233
14994I670j923j239K342N48J378R308j7268l266O185o732j0151j5941p471J3163
14980b1397m33J3062K5169o138q166P400n874K607o627o570j0133K695J4118J2055
$$ plain form
15073 -15497 -19645 -17460 -21950 -9755 29322 25688 12542 -28767 -17823 -11180 -10128 -6971 -9704
15060 -9704 -18724 -27671 -29578 -30642 -21805 -5872 15998 14478 3855 5697 904 -3627 -22722 -4084
15046 -4084 -614 27891 33054 29289 29921 26790 7066 11094 7448 -9413 2758 17899 29015
15033 29015 30473 5599 4712 7340 18599 12128 16534 18535 34562 23748 2875 10506 11932
15020 11932 13583 8761 3239 -10486 -17385 -4022 10055 6936 14619 35357 16531 -13680 -27004
15007 -27004 -21210 -12455 -1982 4579 8166 19490 48202 36126 31798 27729 17101 20903 9670
14994 9670 7747 6508 8850 9398 10776 20084 2816 -450 5735 -997 -11148 -27089 -34560 -21397
14980 -21397 -21830 -8768 16401 10263 2097 9497 3623 6230 -397 -6967 -17100 -14405 -287 11768
14966A1768N810J7812J642j4335R73L5k2450r572q035R764J8433l272k3130l89
14952a4946K7528J5597j2634l7367J563J3955K2872J9352q326k9687q236J0478
14940A49J8790L791l840l5531l0606K0169J6606P065K1281r213k2697J0988l540
14927f588r65K436k142k291J8708j313o766J7131K072q107q616J4011M109j2423
14913I256m146R929j1579K741J0526k557l333L012L276m886N180j089k0423r62
14899e055J2192P601N085j0145o118j6514n848J0882J2827J0837K12j3182r648
14886f874M005k2772j0862j278J5118o890P55K533O154l164O21J4795r354j957
14872a9170j2574M03K1602K0393J510j779q221m63J2612K463Q151m423J001J1787
$$ plain form
14966 11768 17578 35390 37032 22697 23670 23705 1255 -8317 -16352 -6588 11845 8573 -14557 -14946
14952 -14946 12582 28179 15545 -21822 -20259 -6304 16568 35920 27594 -2093 -10329 149
14940 149 18939 22730 18890 -16641 -47247 -27078 -10472 -3407 17874 8661 -14036 -3048 -6588
14927 -6588 -7553 -5117 -7259 -9550 9158 7845 1079 18210 20282 12175 3559 17570 21679 9256
14913 9256 5110 15039 3460 6201 16727 14170 10837 13849 17125 12239 17419 16330 -4093 -5055
14899 -5055 7137 14738 19823 9678 3560 -12954 -18802 -7920 4907 15744 15956 2774 -6874
14886 -6874 -2869 -25641 -36503 -37781 -22663 -29553 -28798 -26265 -20111 -23275 -22654 -7859 -17213 -19170
14872 -19170 -31744 -31341 -9739 10654 12164 10385 2164 1701 14313 16776 24927 20504 21505 33292
14858C3292j0605k7152l420m92J6847L4810n678k6232N337j3902k3528j376J096
14845b1003j3768J28P466N259J9786K5p873M67q319j822O47J4508M921J374j2653
14830a0857q94m850J6562j6427n841L132M15J5548J6466o250j9153K506J4206
14817D563p40Q113K2160N004o2l2106l4291K747L263p543j544P028j7352N931
14803c4829J4673R420j4050l664N893N329R765K2651o748j3408l0013Q728L3770
14790G517Q403r007M144J46J515J2165p009j25j1894j1923o455j1787J1305N586
14776g419j998P815J1601N510n364o757l249q691J8496r782j6749L250P967p388
14762a2758l239J3577L336J854m21J516l450m516m551l367P447l286j0986p469
$$ plain form
14858 33292 22687 -4465 -7885 -8377 8470 43280 37602 11370 16707 2805 -20723 -22099 -21003
14845 -21003 -34771 -34643 -27177 -21918 -2132 -2107 -9980 -9513 -17832 -19654 -19007 -4499 422 1796 -10857
14830 -10857 -11751 -16601 -39 -16466 -22307 -19175 -18760 -3212 13254 7004 -12149 -9643 4563
14817 4563 3823 11936 34096 39100 39038 6932 -27359 -24612 -21349 -28892 -30436 -23408 -40760 -34829
14803 -34829 -20156 -10736 -24786 -28450 -22557 -17228 -7463 15188 8440 -4968 -34981 -26253 7517
14790 7517 15920 6913 11057 11203 12718 24883 17874 17749 5855 -6068 -12523 -24310 -13005 -7419
14776 -7419 -9417 -1602 9999 15509 10145 3388 139 -8552 9944 162 -16587 -13337 -5370 -12758
14762 -12758 -15997 -2420 916 2770 2349 3865 415 -4101 -8652 -12019 -4572 -7858 -18844 -26313
14748b6313Q616J4671o574O981M110q59j670K18K5132L629q883K672k3116k1469
14734b2855o779K3512K686j3140n717R426k180j1779k2522j604J2369K3574L9567
14721B4558K5943q494q334Q2R746j9707j0000r186k1794j301R629j044J0538K914
14707C550K45j138J2033J0289k2289K523K0345j9627L27J3761l046j6361j7313
14694a6701J5775j3087j901J458J942P722n333J975K0501J368O2j1318N585J5967
14680B4015j1814j1297J719m141j2700j1355O549J155J7656Q641p35J294l541
14667E446L951n706k296Q233M706q148p879K216l799r601m092J2817k524O446
14653b30J5643k1262j555j5523j619L237J4365J9145j0493k0438J2183j041J1645
$$ plain form
14748 -26313 -17697 -3026 -9600 -2619 1491 632 -1038 -820 24312 27941 19058 21730 -1386 -22855
14734 -22855 -29634 -6122 -3436 -16576 -22293 -12867 -15047 -26826 -49348 -50952 -38583 -15009 24558
14721 24558 50501 42007 33673 33755 43501 23794 13794 4608 -17186 -18487 -8858 -9902 636 3550
14707 3550 3795 2657 14690 24979 2690 5213 25558 5931 6258 20019 16973 612 -16701
14694 -16701 -926 -14013 -15914 -14456 -12514 -4792 -10125 -8150 12351 13719 13781 2463 8048 24015
14680 24015 12201 904 2623 -1518 -14218 -25573 -19024 -17869 -213 8428 7693 8987 5446
14667 5446 9397 3691 1395 9628 14334 6186 -1693 523 -3276 -12877 -16969 -4152 -6676 -230
14653 -230 15413 -5849 -7404 -22927 -24546 -21309 -6944 12201 1708 -18730 -6547 -7588 4057
14640D057P52j8257o672J5157n317k2970M790j703L303o198k2051J2580K4720
14627a7809L691L658j4892j5060O400Q612l300q18L515M190J068O067m02r487
14613b4567J2070j6401m152J1122R801L1038O959J828l523n375j4708p827j926
14600e661Q693P201k6005j9203J9731O743J1839J40q997n013l141K792J2407j508
14586A8L83J158l903m033k0376k904J7372R759J7124J3979j1267k5349J1346J0832
14572A4139J210J1518q683j0039K31r602P791P60o723K120K6881n038j3723j9554
14558h712p458J649J0463O087p913K387j5941L429Q099J0864J4023m899k0595
14545h517m966Q487p796k099Q411K634m284j42J30J706j516J372L845N100o473
$$ plain form
14640 4057 4809 -13448 -20120 -4963 -10280 -33250 -28460 -30163 -26860 -33058 -55109 -42529 -17809
14627 -17809 -14118 -10460 -25352 -40412 -34012 -25400 -28700 -29518 -26003 -21813 -20745 -14678 -15080 -24567
14613 -24567 -12497 -28898 -33050 -21928 -12127 18911 25870 27698 24175 18800 4092 -3735 -5661
14600 -5661 3032 10233 -15772 -34975 -15244 -8501 3338 3478 -5519 -10532 -13673 -10881 1526 18
14586 18 401 1559 -2344 -6377 -26753 -29657 -12285 -2526 14598 28577 17310 -8039 3307 14139
14572 14139 15349 26867 18184 8145 8376 -1226 6565 7325 602 2722 29603 24565 10842 -8712
14558 -8712 -16170 -14521 -4058 2029 -5884 -3497 -19438 -16009 -7910 2954 16977 12078 -8517
14545 -8517 -13483 -4996 -12792 -14891 -6480 -3846 -8130 -8272 -8142 -6436 -7952 -6580 -2735 2365 -4108
14530d108m656N763m389J5399Q911k1621l839J2650O289j412O948l106n054j2734
14516d959J08j709o697K868O339o201p986J9992k88q729j2563R980J8481l405
14502E231m577j5110k1468l446K2566p256J4501l79Q071K364J0840m20K283j2572
14488F28k1193j5865L1729J6166n321J8369j0078k325j6923p038Q05Q831p2j367
14474c654J7083K0476K0998k2880o307M847Q410j0632l2872q828K300k588j4007
14461b7654O168O761K539K967R954n482o267J4478J1792J0738n048j2726R76J382
14447A0578o796m780m988l693Q164O880m400k7406J5072K1227p550j1423m973
14434a4088P579J142r14R570k0538R449J6700r612Q69j302p139M359j874k936
$$ plain form
14530 -4108 -8764 -3001 -7390 8009 16920 -4701 -8540 4110 10399 8987 15935 12829 7775 -4959
14516 -4959 -4851 -6560 -13257 -10389 -4050 -10251 -18237 1755 1467 -7262 -19825 -9845 8636 5231
14502 5231 654 -14456 -35924 -39370 -16804 -24060 -9559 -9938 -1867 497 11337 10917 13200 628
14488 628 -20565 -36430 -4701 11465 6144 24513 14435 12110 -4813 -11851 -11046 -2215 -2287 -3654
14474 -3654 13429 33905 54903 32023 25716 30563 38973 28341 -4531 -13359 -11059 -13647 -27654
14461 -27654 -21486 -14725 -12186 -9219 735 -4747 -11014 3464 15256 25994 20946 8220 9196 10578
14447 10578 3782 -998 -5986 -9679 -1515 5365 965 -26441 -11369 9858 2308 -9115 -14088
14434 -14088 -6509 -5367 -6281 3289 -17249 -7800 8900 -712 157 -1145 -8284 -3925 -5799 -8735
14420h735O64J1828N62r342o601J8858Q933j7550k949P985j1849P809J5568J985
14406A7166j858j4719L849N168q006r309O051J9466J1640r496j8008j1233J1594
14393B305Q717j3311R60O16j0792l916J3436J4806M287K201L637j9286k734J200
14379B126k2074K159J1830J5592J955q271j0087N282J8803o061j2184L784J1294
14366A4148j7764M991J1516L735l740l567r716K072O920P965J63j277j4045M737
14352F138J5074J801Q15j3620l113N67Q642O408j0394l507O049m133j9299K1234
14338A2662J2763j6156J0576M570j2811j1707j8428R561J2250r466J0081J890
14326E785l2944J7538K0766l74o773p575r458J1457J3355O916p743k804M152k1602
$$ plain form
14420 -8735 -8071 3757 4319 -5023 -11624 7234 16167 -1383 -4332 3653 -8196 -387 15181 17166
14406 17166 15308 589 4438 9606 1600 -7709 -1658 17808 29448 19952 1944 -9289 2305
14393 2305 11022 -2289 -1329 -713 -11505 -15421 -1985 12821 17108 19309 22946 3660 926 2126
14379 2126 -19948 -17789 -5959 9633 11588 3317 -6770 -1488 17315 11254 -930 2854 14148
14366 14148 -3616 1375 12891 16626 12886 9319 -397 1675 8595 16560 16723 15446 1401 6138
14352 6138 21212 23013 23828 10208 7095 7662 16304 22712 12318 8811 14860 10727 -8572 12662
14338 12662 25425 9269 19845 24415 11604 -103 -18531 -8970 3280 -6186 3895 5785
14326 5785 -27159 -9621 11145 10771 3998 -3577 -13035 -1578 11777 18693 10950 8146 12298 -9304
14312i304q693j6320M060K6353R244J213q569L671R595j1680L46J8320q86j6157
14298A193m716K607J6288l926P797J6550j2231k6072j941K4623J4392R72M162
14285C9698n495j5153k8717R604J8766R085j0454K930K961k476O374j3031l805
14272A0287j0991l598J0229K931N032J5264O91r652j9213j7012J898K5782J8608
14259C0256j5148n151Q579L507r887j6114j4636j3024J4437J4802l1377k768M643
14246c1881N096l008L043J0045P503j639j4015J7028j30j7622j4803P718N988
14233b6677j691L346m72O237k282k0282j4391l130j1845J5570J4905k463l226
14220d6401J1369K8269L154J0630r655j3291R108m59j59M831O10R684Q338m552
$$ plain form
14312 -9304 -17997 -34317 -30257 -3904 5340 6553 -2016 1655 11250 -430 -84 18236 17350 1193
14298 1193 -3523 -916 15372 11446 19243 35793 23562 -2510 -4451 20172 34564 35536 39698
14285 39698 34203 19050 -9667 -63 18703 27788 17334 20264 23225 20749 27123 14092 10287
14272 10287 -704 -4302 5927 8858 13890 29154 29845 20193 980 -16032 -14134 11648 30256
14259 30256 15108 9957 18536 22043 12156 -3958 -18594 -31618 -17181 -2379 -33756 -36524 -31881
14246 -31881 -26785 -29793 -26750 -16705 -9202 -10841 -24856 -7828 -7958 -25580 -40383 -32665 -26677
14233 -26677 -28368 -25022 -25494 -19257 -21539 -41821 -56212 -59342 -71187 -55617 -40712 -43175 -46401
14220 -46401 -35032 -6763 -3609 7021 -2634 -15925 -6817 -7276 -7435 -2604 -1994 7690 16028 11476
14206A1476j6404J0466L449j2395P332L761j9407m673O550L0185m621j5014k0051
14193a9346j663N978J0074k0149O016J6031J714R78n8J5467k0878k478J2200q158
14179d272l908R059K048j3429k643j132K1676J271j4026j4261j3875K2084R531
14166a877q727R08J0699K2072j5531j0699N780r474j6372K844J5683P32N382O026
14152G446K542l265j0762r771O048k208j5528l77J35J1017M619O141k4752j7017
14138d5732P980M963r941J3920K9759J1841L960M416l318j6239m246K1471J163
14125A9997j1630m536P902j654l568K746P35j2759J3198K598R4L288j8604p397
14111i590q873L0069j436q172j0360j4838K0050O258q45p060j0660r535J6097
$$ plain form
14206 11476 -4928 5538 8987 -3408 3924 7685 -11722 -16395 -9845 20340 15719 705 -19346
14193 -19346 -21009 -15031 -4957 -25106 -19090 -3059 -1345 -367 -425 15042 -5836 -8314 3886 -4272
14179 -4272 -8180 879 2927 -10502 -13145 -14277 7399 8670 -5356 -19617 -33492 -11408 -1877
14166 -1877 -10604 -9696 1003 23075 7544 -3155 2625 -6849 -23221 -20377 -4694 -3962 1420 7446
14152 7446 9988 6723 -4039 -13810 -7762 -9970 -25498 -25875 -25740 -14723 -10104 -3963 -28715 -45732
14138 -45732 -37752 -32789 -42730 -28810 949 12790 16750 21166 17848 1609 -2637 18834 19997
14125 19997 8367 3831 11733 10079 6511 9257 9992 -2767 10431 13029 13123 16411 -2193 -9590
14111 -9590 -18463 11606 10170 1998 -8362 -23200 -3150 3108 2263 -4797 -15457 -24992 -8895
14098h895k972m540J9563O260j8335O063J7410J4246K1752j9288k6685J0695K7726
14085D3000M969r498j6904l2292j5031K5452K2346J997j0598M039O921j138r246
14072A4017r827j5854K4950J3714o763p704j1442Q406J1557j1839k93K672J345
14059A2939N858j9323O34j927R719m728M669k877J4518K88j1905J4576J1098p011
14045B6528L717j343L217j0932K902Q168j1240k5216j646J9319J6255j8820k3391
14032a2482k0181P246P305P258O002Q257m405K246J0747j3835j4321n62j9285
14019c6010o569P258J7148J2040J3665J1574j3935q392L662L812j8334K2579P524
14006A6022M717k040K19m643p142j1152J0496p935o267o577Q701J9938j0660j3422
$$ plain form
14098 -8895 -11867 -16407 3156 9416 -8919 -2856 14554 28800 50552 31264 4579 15274 43000
14085 43000 47969 38471 21567 -10725 -25756 -304 22042 24039 13441 17480 24401 23263 14017
14072 14017 4190 -11664 13286 27000 20237 12533 1091 9497 21054 9215 8922 11594 12939
14059 12939 18797 -526 108 -1819 7900 3172 7841 4964 19482 19770 7865 22441 33539 26528
14045 26528 30245 28902 32119 21187 24089 32257 21017 -4199 -5845 13474 29729 10909 -12482
14032 -12482 -32663 -25417 -18112 -10854 -4852 3405 -1000 1246 11993 -1842 -16163 -16725 -36010
14019 -36010 -42579 -35321 -18173 -6133 7532 19106 5171 -3221 441 4253 -14081 8498 16022
14006 16022 20739 18699 18918 14275 7133 -4019 6477 -1458 -7725 -14302 -5601 14337 3677 -9745
13992i745Q191N146j0987j6312Q306J753J7972P361k686J2597n130k7484L551
13979g467j3521m622M273j002l620J7796N444N614K0936K050j0392j2951p078
13966d540j4897N814o47J3079N45j7443l878k158j7707m66K4805J4521j6379J6110
13952c241O737j945J2185j1834r137j0008J7296o092q56K4950J2998k4289j9959
13939a3195j3948J7816J0342o056p736k772K0883j0130k7314m950J7022o92j826
13926b2556m930R958P529K7217Q290r239k5376j0266P109J6476P232j090k0653
13913a0299q328J6098k2811o102J6613p196q659Q790m370O190J0520P932R955
13900H333M248K3144k97q96j8018j3335N184Q800J3974N107j5220j1852m912k532
$$ plain form
13992 -9745 -1554 3592 -7395 -23707 -15401 -13648 4324 11685 8999 21596 16466 -11018 -7467
13979 -7467 -20988 -25610 -21337 -22339 -25959 -8163 -2719 2895 23831 25881 15489 2538 -4540
13966 -4540 -19437 -13623 -14270 -1191 -646 -18089 -21967 -24125 -41832 -42298 -17493 -2972 -19351 -3241
13952 -3241 3496 1551 13736 1902 -7235 -17243 53 -6039 -6895 18055 31053 6764 -13195
13939 -13195 -27143 -9327 1015 -5041 -12777 -15549 5334 -4796 -32110 -37060 -20038 -20730 -22556
13926 -22556 -27486 -17528 -9999 17218 25508 16269 -9107 -19373 -12264 4212 11444 10354 -10299
13913 -10299 -18627 -2529 -25340 -31442 -14829 -22025 -30684 -21894 -26264 -20074 -9554 -1622 8333
13900 8333 12581 35725 35428 34532 16514 3179 8363 17163 31137 36244 21024 9172 4260 1728
13886A728p704n083o207J6561m755J5217J0175q218j5282j1435J3340p126M344
13873d445J3345Q379J787j4488j1906o906j6893j9332J957J2449J8250k439Q948
13860a1294K152J2404p979j6825j8472K2541J3204n706J6224J242N549K2318k345
13847C3013n497l7121k5423n363L989N069K105J5730M144p432j4971r150J3198
13834b7709j5727k029J4949J7473j1852j4274J0189j922O840J7553J5273K682
13822A1446P73P34J2646p235m365K538r337l620K980K351o348j2782j1952p540
13808b9711J3667m85J3727Q909O116n866n088J469n265j2329j1757M493q739K1344
13794i515J909J1279M292p831q401M96N473P501O249p932j1104L844Q736J6691
$$ plain form
13886 1728 -5976 -11059 -17266 -705 -5460 9757 19932 11714 -3568 -15003 -1663 -8789 -4445
13873 -4445 8900 17279 19066 4578 -7328 -14234 -31127 -50459 -48502 -36053 -17803 -20242 -11294
13860 -11294 -9142 3262 -4717 -21542 -40014 -17473 -4269 -9975 6249 7491 13040 35358 33013
13847 33013 27516 -9605 -35028 -40391 -36402 -31333 -29228 -13498 -9354 -16786 -31757 -40907 -27709
13834 -27709 -43436 -45465 -30516 -13043 -24895 -39169 -28980 -30902 -24062 -6509 8764 11446
13822 11446 12219 12953 25599 18364 13999 16537 7200 3580 6560 8911 2563 -10219 -22171 -29711
13808 -29711 -16044 -16529 -2802 6107 12223 6357 1269 2738 -2527 -14856 -26613 -22120 -30859 -9515
13794 -9515 -7606 3673 7965 134 -8267 -7771 -2298 5203 11452 3520 -7584 -3740 4996 21687
13780B1687J0603l3361j3453O426O169j2066j632P760J559k826j1155j286R433
13767a2142m057K251L1580M188j8186P122J4632k1863R091J0646J0445p292k9576
13754c161N273K611Q03N217j546K0802J4454J7165q163k0643O198p927l3534j2574
13740a5025O706O256j3737p440P291L29N88O945j336p239J6232o767J9118J6673
13726B8594L871j4550l035j0515j6723p875O780L110J3793n353p422O021K0474
13713A7170j0481m371J908j120L005j3600k841M264P44l281R606q934K066J4441
13699H576M561L380J0689j0168j3468P176Q282k0697m408J318J6624J1751j8387
13686E229j4331q857P745K8299K1351J851j4628l1372j1503N05p197K2150J0072
$$ plain form
13780 21687 32290 -1071 -14524 -8098 -1929 -13995 -15627 -7867 -6308 -9134 -20289 -21575 -12142
13767 -12142 -16199 -13948 17632 21820 3634 10756 25388 3525 12616 23262 33707 26415 -3161
13754 -3161 2112 4723 5526 10743 9197 29999 44453 61618 53455 32812 39010 31083 -2451 -15025
13740 -15025 -8319 -2063 -15800 -23240 -15949 -15620 -15032 -8087 -9423 -16662 -430 -7197 11921 28594
13726 28594 32465 17915 14880 4365 -12358 -20233 -13453 -10343 3450 -1903 -9325 -3304 17170
13713 17170 6689 2318 4226 3106 6111 -7489 -10330 -6066 -5322 -8603 1003 -7931 -5865 8576
13699 8576 13137 16517 27206 17038 3570 10746 19028 -1669 -6077 -4759 11865 23616 5229
13686 5229 -9102 -17959 -10214 18085 39436 41287 26659 -4713 -16216 -15711 -22908 -758 9314
13673I314j3195o388r512J5934K3761J2101k2168j2535j521o2M177R377j0153
13660h70J4287J0749j1252O312J5935J0792j7166j6902k9176j0284L271K7520
13648C216K2643N728q047k1729j4599K796N710J8813N8L534N70k8417m255n038
13634a9017k983J3661k108r967K558p281J1863p288m18M336n97R426m142J1586
13620c71J0175J17m909K688o390P723K13M332q326J3163l30j3537M135q683P085
13605G085j8116L904K2961J196l033P245j8866j247J4786j2052j8029n465k096
13592b1727k989P325J4517J1130J614M602l934j2563j0814O873M458O90K184J3805
13578A5171K730J5087N159k4753k0926J2060J4426J819O642J3532J931k5890J789
$$ plain form
13673 9314 -3881 -10269 -19781 -3847 19914 32015 9847 -2688 -4209 -4271 -94 9283 -870
13660 -870 13417 24166 12914 19226 35161 45953 28787 11885 -17291 -27575 -24304 3216
13648 3216 25859 31587 23540 1811 -12788 -9992 -4282 14531 14589 18123 18693 -9724 -13979 -19017
13634 -19017 -22000 -8339 -10447 -20414 -17856 -25137 -13274 -20562 -20980 -16644 -17241 -7815 -11957 -371
13620 -371 9804 9921 5012 7700 1310 9033 9246 13578 5252 18415 18085 4548 8683 0 7085
13605 7085 -11031 -7127 15834 17030 13997 21242 2376 1129 15915 3863 -14166 -19631 -21727
13592 -21727 -24716 -17391 -2874 8256 9870 14472 10538 -2025 -12839 -5966 -1508 -818 1366 15171
13578 15171 17901 32988 38147 13394 -7532 4528 18954 20773 27415 40947 42878 16988 18777
13565A8777o084M443P414J3544j919o701M421M739M925J035j5105q025k6936j4693
13551b0165K2032l632J099J734p535R946l37k972K0316J5038q355k9758n370P408
13537e51N375r547O164J3480n382R777M587k902r579Q256m219m277K55J496j2051
13522H82n548Q849J2073l613R772j222O914N21J5425Q599J3891k1308l1961J2519
13508B5793J3193j2919k6303P9L0151J6951Q491J837j6849k0851k703j0355O614
13495A3129K0592n554k2577o182o918r53O278J1816L293q369J530l91n523N285
13481E456L328N874j0392j0335O512j2541j2797J9550j580l05N553J7417l476
13468A2264j1045L921j1866K323K1639K7245p061j9017j678N822Q239l405N434
$$ plain form
13565 18777 12693 17136 24550 38094 36175 29474 33895 38634 43559 44594 29489 21464 -5472 -20165
13551 -20165 1867 -1765 -666 1068 -6467 3479 3142 170 20486 35524 27169 -2589 -7959 -551
13537 -551 4824 -4723 1441 14921 9539 19316 23903 21001 11422 19678 15459 11182 11437 12933 882
13522 882 -4666 4183 16256 12643 22415 21193 28107 28628 44053 52652 66543 45235 13274 25793
13508 25793 38986 26067 -236 -157 29994 46945 55436 57273 40424 19573 16870 6515 13129
13495 13129 33721 28167 5590 -592 -7510 -8463 -2185 9631 12924 4555 6085 5694 171 5456
13481 5456 8784 14658 4266 -6069 443 -12098 -24895 -5345 -6925 -7230 -1677 15740 12264
13468 12264 1219 5140 -6726 -4403 17236 44481 37420 18403 16725 22547 30786 27381 32815
13455C2815J8812P632k5039k1638N468k918j6419j7288J504J7032J1843K4946
13443C6750r325o513m407N588J9510J1696k1042k8434Q038Q706j829j6401o989
13430d652j2519r169O145J1733O086o70j264J1509q955N822J2942J7987P201Q911
13416E1107L008Q597r330m985r392o573K8019N630l2523O69j033l903m802J271
13402B5760p611l495K5248K6087k0389k4785q805L4871N862k2657O024j6457j4393
13389E260j555J1741J4628l659J3800Q78J520p082r797K0320m930N886j468R027
13375E4569M166p330j3557j9113J0557K5572J1373j1021P000j3834r950J2285
13363E0717L391k857Q361O440o191l1982m699k127J1257q634n531q110K781n205
$$ plain form
13455 32815 51627 59259 34220 12582 18050 15132 -1287 -18575 -17071 -39 11804 36750
13443 36750 27425 20912 16505 22093 41603 53299 32257 3823 11861 20567 18738 2337 -4652
13430 -4652 -17171 -26340 -20195 -8462 -2376 -3046 -4310 7199 -1756 4066 17008 34995 42196 51107
13416 51107 54115 62712 53382 48397 39005 32432 60451 66081 33558 34227 33194 29291 24489 25760
13402 25760 18149 14654 39902 65989 45600 20815 12010 46881 52743 30086 36110 19653 5260
13389 5260 3705 15446 30074 26415 40215 41093 42613 35531 25734 46054 41124 47010 45542 54569
13375 54569 58735 51405 37848 18735 29292 54864 66237 55216 62216 48382 38432 50717
13363 50717 54108 51251 59612 66052 59861 27879 23180 21053 32310 23676 18145 10035 12816 7611
13349G611J866L554n039J978K2607j1094j308N080K308Q641j027J94q016MO305
13334C3664p824k956J0571k702O125M167L081K5018r710k4105K42j2696k0165
13321B710j3143r356K847j75J5418Q279q720P520O942K515r094J4992J6367q511
13307B8591j0254j3612J1354k0346o411J3528K791M106J4228J4463q755N391K0667
13294E5741j1357j649j060j406n000k5038J3672J5291j4334p478J2602p311p183
13281A5490J777K7116r828j2128j8148J4607P671J2746n347j0919k494j7482R874
13268A2935J8533M543j3734R298K1070j1506j4923L129K476K6753N121m104r434
13255E0157m220M613J2087j6216k7525l067J7941o60j1657j3548r8K6772R822
$$ plain form
13349 7611 9477 13031 7992 9970 32577 21483 20175 25255 27563 36204 35177 35371 27355 27359 33664
13334 33664 25840 22884 33455 30753 36878 41045 44126 69144 59434 35329 35571 22875 2710
13321 2710 -10433 -19789 -16942 -17117 -1699 6580 -2140 5380 12322 14837 5743 20735 37102 28591
13307 28591 18337 4725 16079 -4267 -10678 2850 5641 9747 23975 38438 29683 35074 55741
13294 55741 44384 42735 41675 40269 35269 10231 23903 39194 24860 17382 29984 22673 15490
13281 15490 17267 44383 34555 22427 4279 18886 26557 39303 33956 23037 20543 3061 12935
13268 12935 31468 36011 22277 31575 52645 41139 26216 29345 31821 58574 63695 59591 50157
13255 50157 45937 50550 62637 46421 18896 15829 33770 33110 21453 7905 7807 34579 44401
13242D4401o512m386J4967J5288k714j733j285M602L373r919j5884M618J2925
13229E7741n414j3854q06L849m129O98n848j7467l589J1820m955J3692M968p40
13215C5966o986Q957M236m866r851k8514k2707J027L242n497K2243R717L518P94
13201A1279k152J158P2J3636L563o028K8896q64q866J3025J7150K541j1892k250
13187E9268K197L760j7357j7443J1203j581m404O68k1249J9656J4049j151q992
13174C8624p953j3622j862L434J7490R005J1911R784m91p236j2964p180o807J1215
13160D3348J8724J8963J6722j213k2268j6796l343J6171J855j0207J8253J8795
13148I9004j666J632Q477j5657l491J9034J5453n160p991n033k48J1554J8609
$$ plain form
13242 44401 37889 33503 48470 63758 61044 59311 58026 62628 66001 56082 40198 44816 57741
13229 57741 52327 38473 37667 41516 37387 38085 32237 14770 11181 23001 18046 31738 36706 35966
13215 35966 28980 37937 42173 37307 27456 -1058 -23765 -22738 -19496 -24993 -2750 6967 10485 11279
13201 11279 9127 10285 10357 23993 27556 21528 50424 49560 40694 53719 70869 73410 61518 59268
13187 59268 61465 65225 47868 30425 41628 40047 35643 36311 15062 34718 48767 47616 38624
13174 38624 30671 17049 15187 18621 36111 45116 57027 66811 66320 59084 46120 38940 32133 43348
13160 43348 62072 81035 97757 96544 74276 57480 54137 70308 72163 61956 80209 99004
13148 99004 97338 98970 107447 91790 88299 107333 122786 117626 109635 104602 104354 115908 134517
13135A34517J3634N5435O9710P9669J23514K10755L29295M96043N07766L71140
13125B391478K60503J53643j9140l5185j30141o00019o79369m06840k28440j34869
13115E71621r6785n9217m5203k2934k7115m2380k8439O686k8509l1538q248K514
13103A90453J9591J489j0148O687p562k08J0232J694P992J9651r849L0559L3971
13090B94552M6063O2095P2231J24406K10197L24628L77902L84349L09036K19450
13080B424909J25747M4017r2713k88087m77243n08566l52635j86494j39496r5738
13070D53701n7426k9359j4596k3875j6500N898m883k9187k0601N379j0947j3337
13058B44267M896M943J1371k8655l8805k6637k1139O805j527L522J0650K455j0142
$$ plain form
13135 134517 148151 203586 273296 352965 476479 687234 1016529 1512572 2020338 2391478
13125 2391478 2651981 2805624 2786484 2751299 2621158 2021139 1341770 934930 706490 571621
13115 571621 474836 415619 370416 347482 320367 277987 249548 256234 227725 196187 187939 190453
13103 190453 210044 211533 201385 208072 200510 200302 210534 212228 220220 239871 230022 260581 294552
13090 294552 340615 402710 474941 599347 809544 1134172 1512074 1896423 2205459 2424909
13080 2424909 2550656 2594673 2501960 2213873 1736630 1228064 875429 688935 549439 453701
13070 453701 396275 366916 352320 328445 311945 317843 312960 283773 263172 268551 257604 244267
13058 244267 249163 254106 265477 236822 198017 171380 150241 157046 155519 159041 169691 172146 162004
13045A62004j4284R07K2694j073k7615j2650n508j342l05j5829q981l70j3805
13032H3843j7659J2702M5340J2760k5367k2938j5225m37K1264k767j0736L404
13020H4184p318j0856J027J4147K1247N2J3623j151j2005j5776k6570J1322K1749
13007I3675O770j1518N128K59j0983L054Q320j4465L921j0154r456R421j9999
12994E3973k5379p944Q796K9574J5027J239j964k398N01M210J1099p79j6872j0392
12980E8691N455K8734p667j0401L132O969q771j1869J1402J8449Q944N61l1393
12967G2236k8939P489O203j0222l198K100K990J420P72P424K6881Q654j0764K7229
12953A10275K4519J9331J7795j1054j6268N944L481J17R616o873O448p658k929
$$ plain form
13045 162004 147720 148627 171321 170248 142633 129983 124475 123133 122828 106999 98018 97648 83843
13032 83843 66184 78886 124226 136986 111619 88681 73456 73019 94283 91516 80780 84184
13020 84184 76866 66010 67037 81184 102431 102483 116106 114955 102950 87174 60604 71926 93675
13007 93675 100445 88927 94055 94314 83331 86385 94705 80240 84161 74007 64551 73972 53973
12994 53973 28594 20650 29446 59020 74047 75286 73322 70924 71425 75635 86734 85955 69083 58691
12980 58691 64146 92880 85213 74812 77944 84913 76142 64273 75675 94124 103068 103629 72236
12967 72236 43297 50786 56989 46767 43569 45669 48659 50079 50851 58275 85156 93810 83046 110275
12953 110275 134794 154125 171920 160866 144598 150542 154023 154140 163756 156883 163331 155673 152744
12940A52744J5778l476j5925k5154l3460J1076R10n903j0193q656k714P378K0310
12927A02715p945k0081j4281O268J1844j4131k7693Q149J3784O907P231j0065
12915F2702L980k617p931p045m970k500J0892J8442L4159J6984J642n913j0544
12902A07281K7889N8627O9955R5280P7825K4791k5319l9324n5581o0562m2961
12891B37901j2649l5861l8193M78J16O139L308j981j5777O049J6295K030k0973
12878A46882r432K4352R545K45k2705j276p458m737O376q103N779k008l44J3425
12864A50541J7784o633j3600k019k7596j8375j4239R255O956J1585J9598M230
12852A37487j906J981k97R659L340L45N927l64L962J9437K0697K5014L6057J8076
$$ plain form
12940 152744 168522 165046 149121 123967 90507 101583 102493 96590 86397 77741 75027 82405 102715
12927 102715 94770 74689 60408 66676 78520 64389 36696 44845 58629 65536 72767 62702
12915 62702 66682 64065 56134 49089 44119 41619 52511 70953 105112 122096 123738 117825 107281
12902 107281 135170 193797 263752 359032 436857 461648 436329 397005 341424 280862 237901
12891 237901 225252 189391 151198 151676 151792 157931 161239 159258 143481 149530 165825 167855 146882
12878 146882 137450 161802 171347 171592 148887 147611 140153 135416 141792 133689 139468 137460 137116 150541
12864 150541 168325 161692 148092 146073 118477 100102 85863 95118 102074 113659 133257 137487
12852 137487 135581 137562 137265 146924 150264 150609 156536 156172 160134 179571 200268 225282 261339 279415
12838B79415J167j3063j8348l3732k313q781l1186k6687P037n081k0241j1826
12826A16361l883N015Q614m93j1840k7161k5582N328k132j0093K003K2145K1957
12813A00239Q575J0688J0552K1136q06n806J0202J2716o177P64j937r580j6718
12800A33848j3430r296k6037l739p889J4537K4799o501o298k0859o389k682K1288
12787I1352J6775J4263J5311J3625J8410J6299J3817L6100O528K5051Q1912R0653
12775D40096M3819K9399N006L059K4364M6646L8878K9666k415n190m8002m9307
12763E56019l0708k7383j1001k203J084l951J8615K1888j9875j9778j7302K0973
12751D86378J6803L325J5496J9811L1527J5687m071o560k7147l1085j3973j7529
$$ plain form
12838 279415 280582 267519 249171 215439 213126 204345 173159 146472 153509 148428 128187 116361
12826 116361 112478 117493 126107 125614 113774 86613 61031 66359 64227 54134 56137 78282 100239
12813 100239 108814 119502 130054 151190 150384 144578 154780 167496 161319 162083 160146 150566 133848
12800 133848 120418 111122 85085 81346 73457 87994 112793 106292 99994 79135 72746 70064 91352
12787 91352 108127 122390 137701 151326 169736 186035 199852 235952 242480 267531 349443 440096
12775 440096 483915 513314 518320 521379 545743 592389 631267 660933 658518 653328 605326 556019
12763 556019 525311 497928 486927 484724 485808 481857 500472 522360 502485 482707 465405 486378
12751 486378 503181 506506 522002 541813 573340 589027 584956 578396 551249 520164 506191 488662
12739D88662o515j453m548n524L1308J2540L629L6652m383l455K6299J3446r734
12726E76924J0120k1571q728m83J8539L6725K2718L492q620J522K1433J8765N299
12713F76135R203j0200K9224O8404O2627P2440N7078L0277K402J5397L5213M3520
12701A091720L1637L1523O5834O6953M2806L6475K5367J0653L0114K8579K6548
12690A488209M8836J02931J32983J44077J60033J36036J44778J33475J15014J03323
12680B709695J37779J73863J92180K39621K83860K85073L17623L13980L61251
12671E014925M40516N01604N84044O86964P30409Q15943R68319J176961J387576
12662A2307261J678038K061116K629087L360562M164358N093213O298002Q119866
$$ plain form
12739 488662 482147 480694 476146 470622 501930 514470 518099 554751 550368 546913 573212 586658 576924
12726 576924 587044 565473 556745 556262 574801 611526 634244 637736 629116 630638 652071 670836 676135
12713 676135 685338 675138 704362 772766 835393 907833 964911 995188 997590 1012987 1048200 1091720
12701 1091720 1123357 1154880 1220714 1287667 1330473 1366948 1392315 1402968 1433082 1461661 1488209
12690 1488209 1537045 1639976 1772959 1917036 2077069 2213105 2357883 2491358 2606372 2709695
12680 2709695 2847474 3021337 3213517 3453138 3736998 4022071 4339694 4653674 5014925
12671 5014925 5455441 5957045 6541089 7228053 7958462 8774405 9742724 10919685 12307261
12662 12307261 13985299 16046415 18675502 22036064 26200422 31293635 37591637 45711503
12654D5711503J1153549J6315381K5605528M1292289O1200234P5084280P3306927
12647C49669691N8874788L8801039J8781274N750010j1422348m5986847q2203101
12640C32264506r6004822p3062427m2150030k4072684j5108497j0322071p585980
12633F3957995n969548m991244m407782l938711l397121k892370k435398k031925
12625C3893896j798855j618067j475726j366116j232806j156661j069183j059254
12617B3117228j041511r99967q96840q14967p48062o82597o46585o46995o46759
12608A5992945n84775n91352n90395n35842m93433m56745m19564l88520l84480
12599A1547839m03577l88287l90130l70685l59871l44733l26586l00385k65312
$$ plain form
12654 45711503 56865052 73180433 98785961 140078250 201278484 276362764 349669691
12647 349669691 408544479 447345518 466126792 471876802 460454454 414467607 332264506
12640 332264506 236259684 163197257 121047227 96974543 81866046 71543975 63957995
12633 63957995 57988447 52997203 48589421 44650710 41253589 38361219 35925821 33893896
12625 33893896 32095041 30476974 29001248 27635132 26402326 25245665 24176482 23117228
12617 23117228 22075717 21075750 20178910 19363943 18615881 17933284 17286699 16639704 15992945
12608 15992945 15408170 14816818 14226423 13690581 13197148 12740403 12320839 11932319 11547839
12599 11547839 11144262 10755975 10365845 9995160 9635289 9290556 8963970 8663585 8398273
12590H398273k53471k33512k27664k22754k17804j97223k02006j94630j93701
12581F455508j31877j18909j18115j49891j51672j31884j49733j77108j34070
12572E192249j18357j55665j32558j11486j04346j16221j04725j30129j40531
12563D078231j16169j00440j01351j11263j25160r6756p3794r5257q9244q7858
12553C080939p1765o9637r3170r8891p6085p1329p3270p8601o7580n5863p0273
12542B254475o3343k7668l4435n6083o6692o4244n8120m1786n7657l4804l5224
12531A714419m5310m8331l1663j2993j4760p080K0807K8360O467k8075m7417m1019
12519A493405J571K3672M091J728j8245m3498o1464o0823n3980k4395k2630k5975
$$ plain form
12590 8398273 8144802 7911290 7683626 7460872 7243068 7045845 6843839 6649209 6455508
12581 6455508 6323631 6204722 6086607 5936716 5785044 5653160 5503427 5326319 5192249
12572 5192249 5073892 4918227 4785669 4674183 4569837 4453616 4348891 4218762 4078231
12563 4078231 3962062 3861622 3760271 3649008 3523848 3427092 3353298 3258041 3168797 3080939
12553 3080939 3009174 2939537 2846367 2747476 2671391 2600062 2526792 2448191 2380611 2324748 2254475
12542 2254475 2191132 2163464 2129029 2072946 2006254 1942010 1883890 1842104 1784447 1749643 1714419
12531 1714419 1669109 1620778 1589115 1576122 1561362 1554282 1575089 1603449 1609916 1581841 1534424 1493405
12519 1493405 1494976 1518648 1522739 1524467 1506222 1462724 1401260 1340437 1286457 1262062 1239432 1213457
12507A213457k8385k7567m0252l5161m4358n3525k1605m201k2483l2797j5707
12496H87416l5815l5837n437O121K2161M642K280k88J1224j1155j2752k5962n7544
12483G49054q6841p9567n4544n3689k0594K035J1481K032r488Q321J3918J2063
12471D94181N712l740j7726l4979k0661J452N668l118j2779k8357k3707j2473
12459C49473O677j0916j7303j3582l4796k1630q755k3804j720K5304J3095K3730
12447B85773j872j8462K54K3051k1620j5765j1519j5476J6827J4399J5559K2599
12435B93748j2311J256O632k710j9860j1165m249r731M391J2810j3542k2682p281
12422B15306N288K6925O057j7658j2794j4768j5649r040K230j7196J1238j6503
$$ plain form
12507 1213457 1185072 1157505 1117253 1082092 1037734 984209 962604 958403 935920 903123 887416
12496 887416 851601 815764 810327 816448 838609 843251 845531 845243 856467 845312 832560 806598 749054
12483 749054 662213 582646 528102 474413 453819 455854 467335 469367 459879 468200 482118 494181
12471 494181 499893 496153 478427 443448 422787 424239 429907 426789 414010 385653 361946 349473
12459 349473 356150 345234 327931 314349 279553 257923 249168 225364 223644 248948 262043 285773
12447 285773 283901 265439 265693 288744 267124 251359 239840 224364 241191 255590 271149 293748
12435 293748 281437 282693 289325 286615 266755 255590 251341 241610 246001 258811 245269 222587 215306
12422 215306 220594 247519 253576 235918 223124 208356 192707 183667 185897 168701 179939 163436
12410A63436N691J2700m74J3483K3253Q70K2207o904l10j3463L812m451q963j9052
12396A91835j0521l51q369o468J0715M554J5408J2572r178j1248p993J426R244
12383A91626N48j3818r089L243o970p709o527q088k835P363O50P566M714j9657
12369A41017k1214p607O832O477M835p932j1256N31m769j2417n561k4375j2624
12356E1937j1362p326r585k3003j8472K2818j4537l3723J1388J6731j2440Q12
12344b6762m11J2196j4466M35K8380K175J583L0648k092N881j524m570P00J2998
12330D5171r431k9466J5613N382q885N049O240Q894o009k678K3092M990o951j2631
12316C8380Q070j2401j7974R62J2702l64J5134n380R58R06o784j5625J725J3297
$$ plain form
12410 163436 169127 181827 181353 194836 218089 218959 241166 234262 233952 220489 224301 219850 210887 191835
12396 191835 181314 180963 172594 166126 176841 181395 196803 209375 200197 188949 180956 182382 191626
12383 191626 192174 178356 169267 172510 165540 157831 151304 143216 140381 147744 148394 155960 160674 141017
12369 141017 119803 112196 119028 125505 130340 122408 111152 111683 106914 94497 88936 64561 51937
12356 51937 40575 33249 23664 661 -17811 5007 -9530 -43253 -31865 -15134 -27574 -26762
12344 -26762 -27173 -14977 -29443 -29008 -628 1547 3130 33778 31686 37567 36043 31473 32173 45171
12330 45171 35740 6274 21887 27269 18384 23433 29673 38567 32558 29880 52972 57962 51011 38380
12316 38380 46450 34049 16075 17037 29739 29375 44509 39129 40087 40993 34209 18584 20309 33606
12302C3606P217l584q749R370J8182r831r816j583O559Q781j266j5124o958J1621
12288C8425Q650j0892o606K827Q429k635n972j3843N066K9402Q903j3781J585
12275D9558r271l281m712J3489k454l478K045j2836m452Q81p957J1602J9295O025
12261E4454m670j6298j0525p305N381J2208j224K3678J9577K517Q425j0417O81
12248G6482m061k5008l691j497n80k0450P796J771m546n318K6070J1660r52J9556
12234G7232J9392j8452r510k1667N686L543m593J0064M508K776j2296J355L49
12221E8387q267J4502L2497J5436K5341K0576J8475K9339M8809O4929J09128J65089
12209E94241K46852L51095M01549L75642K86564J80615Q4754Q14r8501l10151
$$ plain form
12302 33606 40823 37239 28490 37860 56042 46211 36395 34812 41371 50152 48886 33762 26804 38425
12288 38425 47075 36183 29577 32404 40833 38198 32226 18383 23449 52851 61754 47973 49558
12275 49558 40287 37006 32294 45783 43329 39851 41896 29060 24608 25489 17532 29134 48429 54454
12261 54454 49784 33486 22961 15656 21037 33245 32021 55699 75276 77793 86218 75801 76482
12248 76482 72421 47413 43722 42225 41645 21195 28991 30762 26216 20898 46968 58628 57676 77232
12234 77232 96624 78172 68662 46995 52681 56224 51631 61695 66203 68979 56683 58038 58387
12221 58387 50120 64622 97119 112555 137896 158472 176947 206286 255095 320024 429152 594241
12209 594241 841093 1192188 1593737 1969379 2255943 2436558 2521312 2522126 2423625 2113474
12199B113474m74219m86324l15067j85787j21636p7851m3745k1089n0909l6580
12189C00267k3595j308o079j0555o192j6224m106j0081j5069l2991j6675o607
12177A50785k5223j3208o461J249M385J5130L9843m953k070o956k8591j3243N307
12164A15994o285j0345Q741N035k7272n786K6164Q897K179K569l1076j5205K525
12151G6135J0359R941k2789p965J8736p169L851N874M418k1116j2798K236K462
12138F2175j7846r335M385K7846J2526j5718o210r434Q685K571M891l418j6429
12125D4689j2559O65L311k0465M123J8135K53l586P072J788l739p206l576P571
12111C6476k1300J1692R660J0088j002q933L596P841j1228k2137R626J2222n970
$$ plain form
12199 2113474 1639255 1152931 837864 652077 530441 452590 408845 387756 336847 300267
12189 300267 276672 275364 269285 258730 252538 236314 232208 222127 207058 174067 157392 150785
12177 150785 125562 112354 105893 107142 111527 126657 166500 161547 159477 152521 123930 110687 115994
12164 115994 109709 99364 108105 113140 85868 80082 106246 115143 117322 119891 88815 73610 76135
12151 76135 86494 96435 73646 65681 84417 77248 81099 86973 91391 70275 57477 59713 62175
12138 62175 44329 34994 39379 67225 79751 64033 57823 48389 57074 59645 64536 61118 44689
12125 44689 32130 32795 36106 15641 19764 37899 38152 34566 41638 43426 39687 32481 28905 36476
12111 36476 15176 26868 36528 46616 45614 36681 40277 48118 36890 14753 24379 36601 30631
12098C0631j7134k1119R519o99J3045J5193M546j1971l2358l432J1768L869K745
12085D603m795k21L061J4670K859r18J1503J7363R077l9294k5839N770Q095k035
12071C899M611M16m85J0382q117J0236Q221J4531l851q358Q394j2185j0211K0503
12057C7986N064j5341j7574k228K215J4362J0153o141j6910j6768N771J0188K0341
12044C1118m0k0766J0212J1235n018J4062j7478q998j1080J7229J5454o848j0679
12031A8403N146L77j6863p727q083K460J4057N126K535J538j2220p130N052J224
12017C895P917J1064k0736P95J2429j5814l966J1251J8310m48j9098j5363O043
12004c721J5921k525l036K1901J2427n771j4862q842j9411j2693J4112O127P918
$$ plain form
12098 30631 13497 -7622 1897 1198 14243 29436 33982 22011 -10347 -13779 -2011 1858 4603
12085 4603 -192 -413 2648 17318 20177 19259 30762 48125 57202 17908 -7931 -2161 5934 3899
12071 3899 8510 8926 8441 18823 10706 20942 29163 43694 39843 31485 39879 27694 17483 37986
12057 37986 43050 27709 10135 7907 10122 24484 34637 28496 11586 -5182 589 10777 31118
12044 31118 31078 10312 20524 31759 26741 40803 23325 14327 3247 20476 35930 29082 18403
12031 18403 23549 23926 7063 -664 -8747 -6287 7770 12896 15431 16969 4749 -2381 2671 3895
12017 3895 11812 22876 2140 2935 15364 -450 -4416 6835 25145 24697 5599 -9764 -3721
12004 -3721 12200 9675 6639 28540 40967 35196 20334 11492 -7919 -20612 -6500 -373 7545
11991G545N755L769N883j2496P185j1664o54J4532n87N360M797Q594n244j5299
11977A7476o234J0618l2761R663J8112k446o25n262n558L407qJ5457p962k120
11963A1757k5454o322J9594j0667j1298M266M309K374J2971L4123n507j1474m04
11950A8268R443Q725k7748O588J0432k1094J321l2970J3539K3700N873M233J1934
11937C2244j4250k2628r934k213J2993N667R525K68L603j6383j0321P481J4474
11924A0526J1320K081R802m418k3949n076K020p57j7554K177P351L434O729K246
11910E932j744j3255p43L973K070j0741J7780J7333M324j2829j0532m442P215
11897D341r466n753j4874L414J5456K440j1111K1566j6292j9357r49l979M902
$$ plain form
11991 7545 13300 17069 22952 10456 17641 5977 5323 19855 19268 24628 29425 38019 32775 17476
11977 17476 11242 21860 -10901 -1238 16874 14428 13803 8541 2983 6390 6382 21839 13877 11757
11963 11757 -13697 -20019 -425 -11092 -22390 -18124 -13815 -11441 1530 35653 30146 18672 18268
11950 18268 27711 36436 8688 15276 25708 4614 5935 -27035 -13496 10204 16077 20310 32244
11937 32244 17994 -4634 -14568 -16781 -3788 1879 11404 11672 15275 -1108 -11429 -3948 10526
11924 10526 21846 23927 33729 29311 5362 286 2306 1549 -16005 -13828 -6477 -3043 3686 5932
11910 5932 4188 -9067 -9810 -5837 -3767 -14508 3272 20605 24929 12100 1568 -2874 4341
11897 4341 -5125 -10878 -25752 -22338 -6882 -4442 -15553 6013 -10279 -29636 -30585 -34564 -29662
11884b9662p657p835J299J0743J7592R426j2260j2826J7581K5456Q652J6663m636
11871C2536j3521j2934n058l259l7139l2173K9206K3078J3493q913k1840l3J3140
11858b3417K0228m076j4461K098K3601O366K098M864K959Q97k1478J744M281K49
11844E953J2231J8817K219r824j0470j1626k383p587m810L930j275J1915K0516
11831B7606K1009j4786j7776J3346j18n918j8958j3778r548Q962O11Q63O265q45
11817c065K3783j8827j2320m111O819n963J2417O337j8644m44J604O642J0258
11804D486j3511j1188J8613j2448p419J992P655m240o649M137M180J6237R652
11791A1497J0748n887k1279K719k479Q506m318Q809r204L135k922j43O597O11
$$ plain form
11884 -29662 -37319 -45154 -43855 -33112 -15520 -6094 -18354 -31180 -13599 11857 20509 37172 32536
11871 32536 19015 6081 1023 -2236 -39375 -71548 -42342 -19264 -5771 -14684 -36524 -36557 -23417
11858 -23417 -3189 -7265 -21726 -19628 3973 10339 12437 17301 20260 21157 -321 1423 5704 5953
11844 5953 18184 37001 39220 29396 18926 7300 4917 -2670 -7480 -3550 -4825 7090 27606
11831 27606 48615 33829 16053 29399 29281 23363 4405 -9373 -18921 -9959 -9348 -8485 -2220 -3065
11817 -3065 20718 1891 -10429 -14540 -7721 -13684 -1267 5070 -13574 -14018 -12414 -5772 4486
11804 4486 -9025 -20213 -1600 -14048 -21467 -19475 -11820 -16060 -22709 -18572 -14392 1845 11497
11791 11497 22245 16358 -4921 -2202 -4681 3825 -493 8316 -888 2247 -675 -818 5779 6390
11777F390k7296J722K756l964J5841J4905J1204q62j5146r508L570Q83J8739K0087
11763C9321q280q520p491J297p039q6j2285J4976j768J2833p868r985J783O580
11749A3468p225n737l276P334m119k784R722L901J0784J8217m341j1969l972O622
11735B6625j795j5025j5901j8674R838j61J9593o681l407Q147q219j789j0791
11722a8240R288N182p250p651Q000J6181J9256M589k1099N552m75j1708p97n318
11708d490L635Q288n351p326N706J8582Q014J335j2441M723j6478j7496K48M970
11694h081M102K6252P16j9009n833k6291p555K3222n798j2056J6555K9140j220
11681A4144j1040k444R942J4001L61k4066j4694O870R879R391K569K334j8071
$$ plain form
11777 6390 -20906 -19184 -16428 -20392 -4551 10354 21558 20696 5550 -3958 -388 495 19234 39321
11763 39321 31041 22521 15030 16327 9288 9202 -3083 11893 10125 22958 15090 5105 6888 13468
11749 13468 6243 506 -2770 4564 445 -2339 7383 11284 22068 40285 35944 23975 20003 26625
11735 26625 24830 9805 -6096 -24770 -14932 -15093 4500 -2181 -5588 2559 -5660 -7449 -18240
11722 -18240 -8952 -3770 -11020 -18671 -10671 5510 24766 29355 8256 13808 13333 1625 828 -4490
11708 -4490 -855 7433 2082 -5244 462 19044 27058 28393 15952 20675 4197 -13299 -13051 -8081
11694 -8081 -3979 22273 22989 3980 -1853 -28144 -35699 -12477 -18275 -30331 -13776 15364 14144
11681 14144 3104 660 10602 24603 24964 898 -13796 -6926 2953 12344 14913 17247 -824
11668h24j2051k0319k709J1378J3547o588l469J1764J4195J3533l740K845j5667
11655A895j2289O869P399p480K780O689J730Q575q285j5214P047J2670L996j5534
11641H48j1104J3750R880K314p043o656J1876K4208q852k1148r480l297N029R340
11627I665l699M850l872J5984J2319r815N063O64j2J4209m46n225j061q11l3747
11612D066k596J5719P573J8965j2781k6704j8892K2152M459j0784N296j0524p463
11599a1514J47J6353R649j2774j2291N557l403q171K3628K503l189J924K8139
11586C6558O408k940l5492k3093J131J4206j219K270M492n510J7670Q681k1981
11573A181Q776K6530k3410j6906J7255N194j2932j5357j8124Q646J7299Q537J2763
$$ plain form
11668 -824 -12875 -33194 -35903 -24525 -10978 -17566 -21035 -9271 4924 18457 14717 17562 1895
11655 1895 -10394 -3525 3874 -3606 -826 5863 7593 16168 7883 -7331 -284 12386 16382 848
11641 848 -10256 3494 13374 15688 8645 1989 13865 38073 29221 8073 -1407 -4704 325 9665
11627 9665 5966 10816 6944 22928 35247 25432 30495 31159 31147 45356 44910 39685 38624 37813 4066
11612 4066 1470 17189 24762 43727 30946 4242 -14650 7502 11961 1177 6473 -4051 -11514
11599 -11514 -11367 4986 14635 1861 -10430 -4873 -8276 -16447 7181 9684 6495 8419 36558
11586 36558 42966 40026 4534 -18559 -17428 -3222 -4441 -2171 2321 -3189 14481 23162 1181
11573 1181 9957 36487 13077 -3829 13426 18620 5688 -9669 -27793 -19147 -1848 6689 19452
11560A9452n878j5218K257J2967l472K1910p443j2133k1L876R67r37k9277n735
11546a8685J4789J5313j4951r824K5379L113k6318j3869J9679M98q642o599M95
11533a9622J0749Q534K2251M834j2969j0177J135l665J7342Q922k0652j2467j8774
11520b4559j8668K904j5027R522Q349K1819r375j980Q922J2230J3483j8048p965
11507a8393J138J0376p352l095J4580J3077k5525p40J2162J0386J3648j994p114
11494A1154k1516Q815M931J0949M518j276Jk2015j9090Q787N770l565p752J3842
11480f447q555o987l215J0196o431M222O281k702j0173r501K0902K519j1505J5580
11466e816J4682j1311P982P856q094n826K600k23J1373N823k820n163K246n370
$$ plain form
11560 19452 13574 -1644 613 13580 10108 32018 24575 12442 12421 16297 17264 16327 -12950 -18685
11546 -18685 -3896 11417 -3534 -13358 12021 15134 -11184 -25053 -5374 -4876 -13518 -20117 -19622
11533 -19622 -8873 -339 21912 26746 13777 3600 4735 1070 18412 27334 6682 -5785 -24559
11520 -24559 -43227 -40323 -55350 -45828 -37479 -15660 -25035 -27015 -18093 -5863 7620 -10428 -18393
11507 -18393 -17255 -6879 -14231 -17326 -2746 10331 -15194 -15934 -3772 6614 20262 18268 11154
11494 11154 -10362 -1547 3384 14333 18851 17575 17576 -4439 -23529 -14742 -8972 -12537 -20289 -6447
11480 -6447 -15002 -21989 -25204 -15008 -21439 -17217 -10936 -13638 -23811 -33312 -12410 -9891 -21396 -5816
11466 -5816 8866 -2445 5537 13393 5299 -527 2073 1850 13223 19046 16226 11063 13309 7939
11452G939M710j7425M148j9396j3567Q381L272K1554J5101j0226o170j710J2350
11439H961P799M531J0524o777j81p183m373M763j6225j648J093o93k382K0921
11425A9130L531Q691K896Q63j4440l0501k5613k71J2373J8034J8692j3852K825
11412B358K395j3610J5818R895n184O795q374L726N253k6055R70K2643P409l286
11398B0753j832K6784p071l3079k7754J1850Q890J1125o536J3129J6914K00r567
11385B3806m214J9895J901m897p978j6487o761R084J7067j5k0626k4144j1907
11372b5276K8221P76j2801K373K509j0351K9699K2258j3087l4835q351J8814J9317
11359A9266m112m356m715k385p413M136M483p67j1616o400q19p825l281L698J283
$$ plain form
11452 7939 12649 -4776 -628 -20024 -33591 -25210 -21938 -384 14717 4491 -1679 -3389 8961
11439 8961 16760 21291 31815 25038 24857 17674 13301 18064 1839 191 1284 591 -1791 19130
11425 19130 22661 31352 34248 35111 20671 -9830 -35443 -35714 -23341 -5307 13385 -467 2358
11412 2358 4753 -8857 6961 16856 11672 18467 10093 13819 19072 -6983 -6013 16630 24039 20753
11398 20753 18921 45705 38634 5555 -22199 -10349 -1459 9666 3130 16259 33173 33373 23806
11385 23806 19592 39487 41388 36491 28513 12026 5265 14349 31416 31401 10775 -13369 -25276
11372 -25276 2945 3721 -9080 -6707 -4198 -14549 15150 37408 24321 -10514 -18865 -51 19266
11359 19266 15154 10798 6083 3698 -3715 421 4904 4137 -7479 -13879 -14698 -22523 -25804 -22106 -20823
11344b0823J7395j724j540J8657R000q804j2935q896j0058L186N189J8141n630
11331A158Q624J1660l426r429j032J2040o429j0737P313j1411j485L564j9821
11318a9411k2492J7473P113j5012J1906L68j2304K7001J1267j5956j6205J5520
11306a0732L9947J2209p034k0417o159j3627J2066N749q499r640j1238j1011j1668
11293d0054K8054P090j4555J913J1243j020K185K641j7469l280P972j3867n677
11280c4824j096K484J2595l270m341l222J7823J5325j2275p534J5831R456j9149
11267a2197Q78K482R915M88L70O353l654N065K665L713p422j0309K518r599k8525
11252c7259J3509K260N218Q357m655k639J3201j292j9132Q301M089P473J3908
$$ plain form
11344 -20823 -3428 -5152 -6692 11965 20965 12161 -774 -9670 -19728 -16542 -11353 6788 1158
11331 1158 9782 21442 18016 8587 7555 19595 13166 2429 9742 -1669 -3154 410 -19411
11318 -19411 -41903 -24430 -17317 -32329 -20423 -20055 -32359 -5358 5909 -10047 -26252 -10732
11306 -10732 29215 41424 34390 13973 7814 -5813 6253 12002 3503 -6137 -17375 -28386 -40054
11293 -40054 -12000 -4910 -19465 -17552 -6309 -7329 -5144 -2503 -19972 -23252 -15280 -29147 -34824
11280 -34824 -35920 -33436 -20841 -24111 -28452 -31674 -13851 1474 -10801 -18335 -2504 6952 -12197
11267 -12197 -11319 -8837 1078 1566 1936 8289 4635 9700 12365 16078 8656 -1653 865 -8734 -37259
11252 -37259 -23750 -21490 -16272 -7915 -12570 -15209 -2008 -3300 -22432 -14131 -10042 -2569 11339
11239A1339J4973R449N653j4094k7747Q86J1117j571k7081k929l845j0905J2375
11226b2380J1751O812J1611J1168o731L374J3458l018q114k910j0119m860k0035
11213a9993M357J6632m024j4798J6228J3101J6997j798j885j1102O584J7444R657
11200D7400j714J1620K820P987J4L314j5640q007j8498q673M124M95j5966l6394
11186b7118k9014K5778K4784k822j1613L188L685J1206K4375j5275j0851k793
11174f470M921n077O775j4337p867K912J4018q948O081Q869J202q61j0859M489
11160e152l016j123J7747J169j0474j94K658R919j29j1126r033K4468K164J9878
11146C7756J463j06K1778K005j1420o764l230j0452n683r235j6798n089Q212N007
$$ plain form
11239 11339 26312 35761 41414 27320 -427 459 11576 10005 -17076 -20005 -23850 -34755 -22380
11226 -22380 -10629 -3817 7794 18962 12231 15605 29063 26045 17931 15021 4902 42 -19993
11213 -19993 -15636 996 -3028 -17826 -1598 11503 28500 26702 24817 13715 20299 37743 47400
11200 47400 45686 57306 60126 68113 68127 71441 55801 47794 29296 20623 24747 25242 9276 -27118
11186 -27118 -56132 -30354 -5570 -8392 -20005 -16817 -13132 -1926 22449 7174 -3677 -6470
11174 -6470 -1549 -6626 149 -14188 -22055 -19143 -5125 -14073 -7992 877 2079 1218 -9641 -5152
11160 -5152 -8168 -9291 8456 9625 -849 -1043 1615 11534 11405 279 -8754 15714 17878 37756
11146 37756 39219 39113 60891 62896 51476 44712 41482 31030 25347 16112 -686 -5775 2437 7444
11132G444j254j8897j8663O795J979M34q00O195j1015N534k972J3370L182K1441
11118A2773j7390k4778P760L316k6298k7674J3002L7940K6490j3147J56M063J3381
11105I594k0907q416n779j6186O584J0238J0130Q087j0344J1375J0821M119j994
11092G322j2566j8005J0261J5806N449j0270p155O378J4615j7058q686o427J4532
11079e804L1632J2364j5898k5791j0547L803L616R433J3933j3034k5339k734k0310
11066d4676L339K5800J8245J4018N924k548n93k225o586j6429n298j9936j376
11053c2341K2608M685K1844J6666j96j2973j2251L317J187k2732k756R070k903
11040f775n994K2157n60j5145J941j1838m724J8350K0738j2816p302J632n342
$$ plain form
11132 7444 6190 -12707 -31370 -24575 -22596 -22162 -22962 -16767 -27782 -22248 -25220 -11850 -8668 12773
11118 12773 -4617 -29395 -21635 -18319 -44617 -72291 -59289 -21349 5141 -8006 -7850 -3787 9594
11105 9594 -11313 -19729 -25508 -41694 -35110 -24872 -14742 -6655 -16999 -5624 5197 9316 7322
11092 7322 -5244 -23249 -12988 2818 8267 -2003 -9158 -2780 11835 -5223 -13909 -20336 -5804
11079 -5804 25828 38192 22294 -3497 -14044 -10241 -6625 2808 16741 3707 -21632 -24366 -44676
11066 -44676 -41337 -15537 2708 16726 22650 20102 19509 17284 10698 -5731 -11029 -30965 -32341
11053 -32341 -9733 -5048 16796 33462 33266 20293 8042 11359 12546 -10186 -12942 -3872 -6775
11040 -6775 -12769 9388 8828 -6317 -4376 -16214 -20938 -2588 18150 5334 -1968 -336 -5678
11027e678j4278O031K580K4850J7369J0216p579n859r61k4119o324j0752L216
11014a1288R933J2596J536l693k0217r842J1955k636l877j5794R402J6741j1629
11001a6813K761M57J431p898R245J2390Q1R432J436j2269K775N420n328j1751
10987h631j264j3525j4902J5663K4544J315K2725n625M409k7595j4285q045l32
10974b5548K7130N833j7897j3382j2482J0971J4589J469P972j3248k1537O225
10962b9905J108M466R044R887j2015N041l43J316P256N499J5151K516j1405k509
10948E107q045O079o051Q412j8522L62N11Q277L2651j2101j1734j7046k924j1192
10934b6216L604J089l551L578J4905j7823l845o0J5544K200R990J2426L56j2424
$$ plain form
11027 -5678 -19956 -13925 -11345 13505 30874 41090 33511 27652 26691 2572 -3752 -14504 -11288
11014 -11288 -1355 11241 12777 9084 -11133 -20975 -9020 -11656 -15533 -31327 -21925 -5184 -16813
11001 -16813 -14052 -13595 -12164 -20062 -10817 1573 1654 11086 12522 253 3028 8448 3120 -8631
10987 -8631 -9895 -23420 -38322 -22659 1885 3200 25925 20300 24709 -2886 -17171 -25216 -25548
10974 -25548 1582 7415 -10482 -23864 -36346 -25375 -10786 -9317 -1345 -14593 -36130 -29905
10962 -29905 -28797 -24331 -15287 -5400 -17415 -12374 -12717 -11401 -4145 1354 16505 19021 7616 5107
10948 5107 -2938 3141 -2910 5502 -13020 -12658 -12147 -3870 28781 16680 4946 -12100 -15024 -26216
10934 -26216 -22612 -21523 -25074 -21496 -6591 -24414 -28259 -28319 -12775 -10575 -585 11841 12197 -227
10920b27j2124K1962j429P7J2155K650P301p100j7133q262j230q233k7618O431
10906c2780J8756K69Q367R645p450p923p165k755R393n229J288L36K0803N059
10892A0614j1948K080j041j4962K945Q90l167o546J5668L245m983M970L925r066
10878g376n64J2064k6776o945K414n626J4439J5154j3402R084J1385J0523j791
10865A2583P6M044m177k1551k995M387J0857O014R749O459J386k8284k3488q592
10851c3532J3809l175Q301J2622j8102j3356Q688J0579q243q630p215J615J0028
10838b6611Q426J0545J3550p944k5758O733L054K624J2352j2196J1105Q913p303
10825b510o537k483M860m490O681j8492j0122K463R540L623j812m620k750J5550
$$ plain form
10920 -227 -12351 9611 8182 8259 20414 23064 30365 23265 6132 -2130 -3360 -11593 -39211 -32780
10906 -32780 -14024 -13755 -5388 4257 -3193 -11116 -18281 -21036 -11643 -16872 -15584 -15248 5555 10614
10892 10614 -1334 746 -295 -15257 -12312 -11422 -14589 -21135 -5467 -2222 -7205 -2235 1690 -7376
10878 -7376 -7940 4124 -22652 -29597 -27183 -32809 -18370 -3216 -16618 -7534 3851 14374 12583
10865 12583 12659 16703 12526 -9025 -12020 -7633 3224 9238 18987 25446 26832 -1452 -24940 -33532
10851 -33532 -19723 -22898 -14597 -1975 -20077 -33433 -24745 -14166 -22409 -31039 -38254 -36639 -26611
10838 -26611 -18185 -7640 5910 -2034 -27792 -21059 -18005 -15381 -3029 -15225 -4120 4793 -2510
10825 -2510 -9047 -11530 -6670 -11160 -4479 -22971 -33093 -30630 -21090 -17467 -19279 -23899 -26649 -11099
10811a1099R052j9380K008J6492J3167k306K163n623j5663p135p079J215R383
10798a4805n513k0059K739J3909J7757l914n823P604J4432J1716P049p848r50
10785A6294j0311M186R61N928L093o401k462r937j6008j0650K054l469K6032L860
10771C170K1565j113j9001p267J912J4318J326J1237O14l061N937k7638k515J7983
10757A7467p449j6288r895O832r24p253J010L47O746Q231j0435j7388K760J8596
10743g643r65L511Q797Q0r215p966K246L823r25J3890L263J2120J8660k9j7469
10728B2178r158k347k3189j3458J871J4126J1590P381J0845o754k1962p517M730
10715a1664K363p844m227k45K7163l998k4456j321Q798J4807m234L866K5365p159
$$ plain form
10811 -11099 -2047 -21427 -19419 -2927 10240 7934 10097 4474 -11189 -18324 -25403 -24188 -14805
10798 -14805 -20318 -40377 -37638 -23729 -5972 -9886 -15709 -8105 6327 18043 25092 17244 16294
10785 16294 5983 10169 11130 17058 20151 13750 11288 1351 -14657 -25307 -23253 -26722 -690 3170
10771 3170 24735 23622 4621 -2646 -734 13584 14910 26147 26761 23700 29637 1999 -516 17467
10757 17467 10018 -6270 -16165 -9333 -10257 -17510 -16500 -16153 -9407 -1176 -11611 -28999 -26239 -7643
10743 -7643 -8608 -5097 3700 3780 -5435 -13401 -11155 -7332 -8257 5633 8896 21016 39676 39647 22178
10728 22178 13020 10673 -12516 -25974 -24103 -9977 1613 8994 19839 13085 -8877 -16394 -11664
10715 -11664 -9301 -17145 -21372 -21617 5546 1548 -22908 -24229 -15431 -624 -4858 -992 24373 17214
10701A7214P380Q919r406q366J691j3802j0698J7672J7544j1449Q22j6587n871
10688d937L030j4726j186P709Q245P589j6782q26Q804k2725o539K670p087P913
10674b8848K0488L4786N419j3578j1603k0342n896J1839P715J1631k21M190P196
10661B2776l718R340n658r763j0424p673m038k913J0235J9138M184j3936P668
10648A5218l015q571Q635j324m687j8240j112M300j0718P743P023O720Q709k1238
10634a0557J05J936j1090M819J9833j1814o530J12J2723q598n969j671N428L008
10620h265O133l02P030J4697j9427J0259K1403o074L565r017p438M815K0684M554
10606D2617m229p082M02o670L336k4098j6733j7724M748m839J5477J5433J0972
$$ plain form
10701 17214 24594 33513 24107 15741 17432 3630 -7068 10604 28148 16699 17521 934 -4937
10688 -4937 -1907 -16633 -17819 -10110 -1865 5724 -11058 -11884 -3080 -25805 -32344 -29674 -36761 -28848
10674 -28848 -8360 26426 31845 18267 6664 -13678 -19574 -7735 -20 11611 11390 15580 22776
10661 22776 19058 28398 22740 12977 2553 -5120 -9158 -12071 -1836 17302 21486 7550 15218
10648 15218 12203 3632 12267 10943 6256 -11984 -13096 -8796 -19514 -11771 -4748 1972 10681 -10557
10634 -10557 -10452 -8516 -19606 -14787 5046 -6768 -13298 -13186 -463 -9061 -15030 -16701 -11273 -8265
10620 -8265 -2132 -2434 4596 19293 -134 10125 31528 25454 29019 20002 12564 17379 38063 42617
10606 42617 38388 31306 31708 25038 28374 4276 -12457 -30181 -25433 -30272 -14795 638 11610
10593A1610N851Q406j2822j52J7819K7943K0587J1928M296J4441L1969J3474K8620
10580A83970K2464O691J3770K3807q349j99j0621j4336r542k4219l2344l7153
10568A13939l8043p083Q1r201M058j3022J224l327M540Q729O510j7735k2849j2617
10554A5204r42Q845L642k781j7145r694k060n852O015J1525R532J2263n780l5474
10540a2702M101K271j2473L0389K7994r471k4568L429m717j5036j8432l486k381
10527c5082J4471J5127J5603j876j0695J9689J684k2519J2789J5662J6904Q920
10515E0677k514j5925q235q276l390J2310j5334j771K769j2287K019K516J3047
10502A5606J6251j0553j6286r11K1987k069k2096L012J9296j8266q92m515n560
$$ plain form
10593 11610 17461 25867 13045 12893 30712 58655 79242 91170 95466 109907 141876 155350 183970
10580 183970 206434 213125 226895 250702 242353 242154 231533 217197 207655 183436 151092 113939
10568 113939 75896 68813 68894 59693 63751 50729 51953 48626 53166 61895 68405 50670 27821 15204
10554 15204 14262 23107 26749 23968 6823 -2871 -4931 -10783 -4768 6757 16289 28552 22772 -12702
10540 -12702 -8601 -6330 -18803 11586 39580 30109 5541 8970 4253 -10783 -29215 -32701 -35082
10527 -35082 -20611 -5484 10119 8243 -2452 17237 18921 -3598 9191 24853 41757 50677
10515 50677 48163 32238 24003 15727 12337 24647 9313 7542 10311 -1976 43 2559 15606
10502 15606 31857 21304 5018 4107 26094 24025 1929 4941 24237 5971 5079 564 -4996
10489d996R71O668p310O35M14L552N642m722K0569j6729k7050O457J9786J686
10475E573K99K312j1801q268P103q197P913M702J542k0305n430J7765O958P291
10461G457J4080J978N779j656l860j377j4240k9553j3447K600K0168J5482j2075
10448h664j1270o185j7291p55K1116J6636m973K727J0873J466J5875L23n197K831
10434A7512K275j783k2467j2175J5359K3252j2291O001Q411K1464R162k3784k9391
10421A545k0748K163o55J9229p69m280J5145Q52k729p253p964j9479L026K7181
10407E264O340j2107j0150M537L2666J5314o370j9807j8314J1803n99K162J1939
10394B2678l309M11j8535q11r267O833K6330J6891n040K4945K0315p22n307o629
$$ plain form
10489 -4996 -4025 2643 -4667 -4032 -3618 -66 5576 854 21423 4694 -22356 -15899 3887 5573
10475 5573 5872 8184 -3617 -11885 -4782 -12979 -5066 -364 1178 -19127 -24557 -6792 166 7457
10461 7457 21537 23515 29294 27638 23778 22401 8161 -21392 -34839 -32239 -12071 3411 -8664
10448 -8664 -19934 -26119 -43410 -44165 -23049 -6413 -11386 -8659 2214 3680 19555 19878 14681 17512
10434 17512 19787 18004 -4463 -16638 -1279 21973 9682 15683 24094 45558 54720 30936 1545
10421 1545 -19203 -17040 -17695 1534 765 -3515 11630 12482 9753 2500 -5464 -24943 -21917 5264
10407 5264 11604 -503 -10653 -6116 26550 41864 35494 15687 -2627 9176 8577 10739 22678
10394 22678 19369 19780 1245 434 -8833 -2000 24330 41221 36181 61126 81441 80719 75412 68783
10380F8783L24o426n045n125J2582p467j1516j2740j4503Q703j8816j211J0452
10367A7995j474j696j1363k384P491L159P587K1677p018k2546k2955n734O641
10354a0620M478J3412M819l563K192Q484j8432m879P592J47P839K527j0065m995
10340a064j9407k642k08K0022L3969j2624k3126N48P797O498R925j9813J1087
10327A0962Q112J3590N325l262j7448P747K982j227J2725n398j7983j8948j0297
10314a3120L532Q119J5455N242L915J3197j7591k5419k5054r761k97J3922O099
10301b1761J3976O4n854O096J5862r50J789k2719R589R876J4975J6549r517J661
10287B9636J5646j2975l8053j7872K9989R627l889q952r616M678j3046j5879J7880
$$ plain form
10380 68783 69107 62681 57636 52511 65093 57626 46110 33370 18867 27570 8754 7543 17995
10367 17995 16521 14825 3462 1078 8569 11728 19315 40992 33974 11428 -11527 -17261 -10620
10354 -10620 -6142 7270 12089 8526 10718 19202 770 -4109 3483 3630 11469 13996 3931 -1064
10340 -1064 -20471 -23113 -23321 -3299 30670 18046 -5080 -4532 3265 9763 19688 -125 10962
10327 10962 19074 32664 37989 34727 17279 25026 28008 26781 39506 34108 16125 -2823 -13120
10314 -13120 -9588 -1469 13986 19228 23143 36340 18749 -6670 -31724 -41485 -41782 -27860 -21761
10301 -21761 -7785 -7721 -13575 -7479 8383 7433 9222 -13497 -3908 5968 20943 37492 27975 29636
10287 29636 45282 32307 -5746 -23618 6371 15998 12109 3157 -6459 -1781 -14827 -30706 -12826
10274a2826J3816Q727M199l664n69J449R173R41n238k447n502k155N426J2310
10260B3640j3279o431j1923m137J743J541J9654mj1156k944j2325M370r867r267
10246c0385k726J964k588J5919Q928L131M33j2287j3345j439K935L811K0333J9282
10232A3966M390j9666K176m594M438J9869k0720k1965J0034R394k028O241k812
10219a277N150J314j5786k169L027q529j1435k2580M363J4601K4364Q086p110
10206g981J3712M160j2507n046l469M627N316J3613J8224j2972j6453o388J6497
10193A1333J1323q852j6961j9628j4172j7561J6439K0105J2011J2489R550J4240
10181C0316j6481k3399k0453P999n757l528R362N002M61q938j477J4635K150K033
$$ plain form
10274 -12826 990 9717 13916 10252 9683 11132 20305 21246 16008 13561 8059 5904 11330 23640
10260 23640 10361 3930 -7993 -12130 -10387 -8846 10808 10804 -352 -3296 -15621 -11251 -21118 -30385
10246 -30385 -33111 -31147 -33735 -17816 -8888 -5757 -5324 -17611 -30956 -32395 -29460 -25649 -5316 13966
10232 13966 18356 -1310 866 -3728 710 20579 -141 -22106 -12072 -2678 -4706 1535 -1277
10219 -1277 3873 5187 -10599 -12768 -9741 -18270 -29705 -52285 -47922 -33321 -8957 -871 -7981
10206 -7981 5731 9891 -2616 -7662 -11131 -6504 -1188 12425 30649 17677 1224 -5164 11333
10193 11333 22656 13804 -3157 -22785 -36957 -54518 -38079 -17974 -5963 6526 16076 30316
10181 30316 13835 -9564 -30017 -22018 -27775 -31303 -21941 -16939 -16478 -25416 -26893 -12258 -10108 -8075
10167h075J577O229N470L635N971k1864l2913R034P427J4303J8717K441o542p117
10153a707J492P264n803R207n823n879R460q562j6459q373J3696M148M086k030
10139e283Q208N011o155k8452j4508J5392K4024R700J0671q378j289K974l072
10126H843k6574o377j749Q990J8444J0588l560R618j370k866l260j4435l367q727
10112a5802n693M952j2855J2298n702L408K1468J1764k1831p796q478j104P146
10099a8225J6889O387k331j4584P183J9174k912j684M83J7424J7395j6186j6197
10086A2816N270P162j2370j4954J6375k039P55k61R064k865N029j8661l1887j1207
10072c7773J6374K4538K5786n683j0340L765J734m669l81j1237p758Q761P008
$$ plain form
10167 -8075 -6498 -269 5201 8836 14807 -7057 -39970 -30936 -23509 -9206 9511 11952 5410 -1707
10153 -1707 -215 7049 1246 10453 4630 -1249 8211 -351 -16810 -25183 -11487 -7339 -3253 -5283
10139 -5283 2925 7936 1781 -26671 -41179 -25787 -1763 7937 18608 10230 8941 11915 8843
10126 8843 -17731 -24108 -25857 -16867 1577 12165 8605 18223 16853 13987 10727 -3708 -7075 -15802
10112 -15802 -21495 -16543 -29398 -17100 -22802 -19394 2074 13838 -7993 -15789 -24267 -25371 -18225
10099 -18225 -1336 5051 2720 -11864 -4681 14493 11581 9897 10380 27804 45199 29013 12816
10086 12816 18086 25248 12878 -2076 14299 12260 13015 12754 21818 18953 23982 5321 -26566 -37773
10072 -37773 -21399 3139 28925 23242 12902 16667 18401 13732 13351 2114 -5644 3117 10125
10059A0125k835n173j4777r787J1385K8349n663o86M069o652l321j759R724p300
10045E699p176M165Q622K548j3953j7995j0781K0725J9635R558k3838k3393L064
10032b3120J6137P791j234q000p224p302K916J376j1057L958J017K9030J0893
10019A5181L355L521l935p212p858Q776M01j8101K689J1049J455Q640P0q518q089
10004A424O426N629r309K488o258J187n1r893P30n824J2181P627o177o457O226
9989e1J8770n582m692J1925R199l2981l1118L518m1p642j1244J2412J1647J6597
9975i283R893j9102k529J6712o401j2459J0404J5451p160q630p875q062K2733
9962f308J688j4718j1390j0008k0619L155J5042k552k472J6690O021n983J2331
$$ plain form
10059 10125 7290 2117 -12660 -22447 -11062 17287 11624 10938 15007 8355 5034 3275 12999 5699
10045 5699 -1477 2688 11310 13858 -95 -18090 -28871 -8146 11489 21047 -2791 -26184 -23120
10032 -23120 -6983 808 -426 -8426 -15650 -22952 -20036 -18660 -29717 -25759 -24742 4288 15181
10019 15181 18536 22057 18122 10910 3052 11828 12229 -5872 -3183 7866 9321 17961 18031 9513 1424
10004 1424 7850 13479 4170 6658 400 1587 1536 -8357 -7627 -13451 -1270 6357 180 -6277 -51
9989 -51 18719 13137 8445 20370 29569 -3412 -34530 -31012 -31053 -38695 -49939 -37527 -25880 -9283
9975 -9283 610 -18492 -21021 -4309 -10710 -23169 -12765 2686 -4474 -13104 -20979 -29041 -6308
9962 -6308 -4620 -19338 -30728 -40736 -61355 -58200 -43158 -45710 -48182 -31492 -25471 -31454 -19123
9949a9123J5201l417J255m557J01Q381J3333J8645j7319k4009J3427p270Q82M509
9935C9k3385M3P466k287k799O108k885J4684J2325J1632q085p078m528j9650J249
9920a7151J9184K313j9833J4191n295J5447k844K543J3711k802j7170o222L34
9907c594O429J6968r727j0319R147q910p426j090N698O258j1701k4604j6954J2231
9893c7594L8307K2471r269j2423N699K393J832N372p970n650j1474q513P807J5736
9879F724J0252q519o899J171J0959j702j3697k7242K9554J4034j4456k1905p121
9866b8847N75M554J6780K0246r279o339j4862j5281j2299J3262J8438J3605j0264
9853i711j9043J5289P642J5362J7462n052j1806j0453j685j1377K0387J6408m018
$$ plain form
9949 -19123 -3922 -7339 -6084 -10641 -10540 -2159 11174 29819 12500 -11509 1918 -5352 -4470 39
9935 39 -23346 -23303 -15837 -18124 -20923 -14815 -17700 -3016 9309 20941 12856 5778 1250 -18400 -17151
9920 -17151 2033 4346 -15487 -1296 -6591 8856 6012 8555 22266 19464 2294 -3928 -3594
9907 -3594 2835 19803 10076 -243 8904 -6 -7432 -8522 -2824 3434 -8267 -32871 -49825 -37594
9893 -37594 713 23184 13915 1492 7191 9584 11416 16788 8818 3168 -8306 -16819 -9012 6724
9879 6724 16976 8457 1558 2729 13688 11986 -1711 -28953 601 14635 179 -21726 -28847
9866 -28847 -28272 -23718 -6938 13308 4029 -2310 -17172 -32453 -44752 -31490 -13052 553 -9711
9853 -9711 -28754 -13465 -5823 9539 27001 21949 10143 -310 -1995 -13372 7015 23423 19405
9840A9405k0352q179J1880j719J6722o736O990m790n254Q696J3110l353n195l914
9826A7311L506k175j3392q167O376J2077J2812j469r978j2253M710M66R904M858
9812B4586k3965k1439j3007R155J1911Q592m462L434N411J718O991J4852L942
9799B7719j5751L654J2666j5212j9074j310k488J1858k5270j2502o223m435J6355
9786c0013L4277J0098k6599j6124K84J677j070j44J4557Q416j29J575l669m307
9772a1171O460n554j040J6976K4647p405P05O53j5044q778k061O585J2505k4446
9758f968j6388Q690l022K191L0286J3674l276o241k1704l250l817l737p666m410
9744b5638p204j705J4536J0625J2314L873j814R996J844L898j3091j8843K223
$$ plain form
9840 19405 -947 -9126 2754 1035 17757 11021 18011 13221 7967 16663 29773 26420 21225 17311
9826 17311 20817 18642 5250 -2917 3459 15536 28348 26879 16901 4648 9358 9824 19728 24586
9812 24586 621 -20818 -33825 -24670 -12759 -4167 -8629 -5195 216 1934 8925 23777 27719
9799 27719 11968 15622 28288 13076 -5998 -7308 -9796 2062 -23208 -35710 -41933 -46368 -30013
9786 -30013 4264 14362 -12237 -28361 -28077 -26400 -27470 -27614 -13057 -4641 -4770 -3195 -6864 -11171
9772 -11171 -4711 -10265 -11305 5671 30318 22913 23618 24271 9227 449 -1612 4973 17478 -6968
9758 -6968 -23356 -14666 -17688 -15497 14789 28463 25187 18946 -2758 -6008 -9825 -13562 -21228 -25638
9744 -25638 -32842 -34547 -20011 -9386 2928 6801 4987 14983 16827 20725 7634 -11209 -8986
9731h986j1444J703L2623L479k035j1905q808J5716J5716N78J527j7952j035j3258
9717d081J2586J048Q962J4927o709l924j7192j5814J2395K2672M141p29M777k1133
9703A1926k0322l849o953Q61L409J3378L107j7174k7034K2606M999p146r324o21
9689c2137K7767J4731L279j848r453l2892k528L3787K5094J2033j7103j5855K069
9676F944o074l836P02p129k0511O846J1732J2928J7976J150J32j3367J1598K296
9662B1387J1191j3738J0395j7634j1233Q887K808N804p380j118K752l072j4671
9649e622Q862j8589k5482J1733J0285j3595k293k737J4828K8725J5742o820L561
9636A8598j4110l486O85J228J1391Q742j7407j0943K4991N954l623J187k1482
$$ plain form
9731 -8986 -20430 -18727 13896 17375 15340 3435 -5373 10343 26059 26637 28164 10212 9177 -4081
9717 -4081 8505 9553 18515 33442 26733 22809 5617 -10197 2198 24870 29011 28282 33059 11926
9703 11926 -8396 -12245 -19198 -18337 -14928 -1550 1557 -15617 -42651 -20045 -15046 -22192 -31516 -32137
9689 -32137 -4370 10361 13640 11792 2339 -30553 -33081 706 25800 37833 20730 4875 6944
9676 6944 870 -2966 -2264 -9393 -29904 -23058 -11326 1602 19578 20728 20860 7493 19091 21387
9662 21387 32578 18840 29235 11601 368 9255 12063 17867 10487 9369 12121 9049 -5622
9649 -5622 3240 -15349 -40831 -29098 -18813 -32408 -34701 -37438 -22610 6115 21857 15037 18598
9636 18598 4488 1002 1687 2915 14306 23048 5641 -5302 19689 25643 22020 23207 1725
9623A725k7606l650p26O423J9592J2082N754J460q783r289N824o137O080R459
9609A2208m654j0904p165L85j1049P337M962J5820J2135O196j8337j4112K337
9596d841Q177j4552j1289J727Q720J8621J3388j4330p673M860M747n031J1591
9583A4115J3159j8987j7400k140k370J003r944Q166m317k549J2407K6584m173
9570A3554j313M261l05m590k1260q632K2717K1511J251p777r059m15J422o905
9556D460J9495k642j3357r736r9p45J5896P792j2435j0050o67L901J2400m604
9542I609j0039J2800K6665j037P68l610q125j0139j3244k1694M590J3467R268
9529I279O124j9204p400M171M227N32J243j6168Q212L428K424q515J800J3073
$$ plain form
9623 1725 -25881 -29531 -30257 -23834 -4242 7840 13594 15054 6271 -3018 2806 -3331 2749 12208
9609 12208 7554 -3350 -10515 -10130 -21179 -13842 -8880 6940 19075 25271 6934 -7178 -4841
9596 -4841 3336 -11216 -22505 -20778 -12058 6563 19951 5621 -2052 2808 7555 2524 14115
9583 14115 27274 8287 -9113 -11253 -13623 -12620 -22564 -14398 -18715 -21264 -8857 17727 13554
9570 13554 12241 16502 16197 11607 -9653 -18285 4432 25943 27194 19417 10358 9943 11365 4460
9556 4460 23955 21313 7956 -1780 -1879 -2624 13272 21064 8629 -1421 -2088 1813 14213 9609
9542 9609 -430 12370 39035 37998 38766 35156 27031 16892 3648 -18046 -13456 11 9279
9529 9279 15403 -3801 -11201 -7030 -2803 -2271 -1028 -17196 -8984 -5556 -3132 -11647 -9847 3226
9515C226N09j948R764j685m243k3711l973J785J2157J9250O335p888r308j3587
9501a3317k546J8161J7178l89k6457k8517J1433K1494L376o648j1082j4254j927
9488c3495n62L281o53N625K3365R346j3528p10K6776j6988k2708J3460K1989n722
9474I476k0537j7234L983J6859N813O802J698o966K782m102j6917p533J6233L376
9460f267n774O661L649J2371J3720K96k3660q978K22L664N445Q876o092j0657
9446f524O580m426K233L1431K56m644o230j2359r018L756N120l434L07K64J5327
9431A8639j0977j0110J300k3211n655J4869J7967Q23J625j181R28O065J7721l469
9417B5334p702p624j3107J0560L125n656k587O362j0855k0633j5083N643J4477
$$ plain form
9515 3226 3735 1787 11551 9866 5623 -18088 -22061 -20276 -8119 11131 17466 9578 270 -13317
9501 -13317 -15863 2298 19476 19087 -7370 -35887 -24454 -2960 416 -6232 -17314 -31568 -33495
9488 -33495 -34057 -30776 -31429 -25804 -2439 6907 -6621 -7331 19445 2457 -20251 -6791 15198 9476
9474 9476 -11061 -28295 -24312 -7453 -1640 5162 6860 -106 2676 -1426 -18343 -25876 -9643 -6267
9460 -6267 -12041 -5380 -1731 10640 24360 24656 996 -7982 -7760 -4096 1349 10225 4133 -6524
9446 -6524 56 -4370 -2137 29294 29550 24906 18676 6317 -2701 1055 6175 2741 3048 3312 18639
9431 18639 7662 -2448 -1148 -24359 -30014 -15145 2822 3645 5270 4089 5017 11082 28803 25334
9417 25334 17632 10008 -3099 7461 10586 4930 2343 8705 -2150 -22783 -37866 -32223 -17746
9404a7746R445J7593j1655k0839M059K1195o277J876J3265Q216R02l661J984j3634
9390D723M802j102n083K868P14o307o24O233k444k8085j320M032J1872L5719O339
9375C2337P051p126k5417r452R190J7231J2645k944j4561J468j617j2779J1195
9362A7221k920j4337p834j203n178J0053O349k025j7016q329J4551J4601j978
9349A955J3714q199k1257m010K4968P931o076j6684J213O417j0312j1857M046
9336a8151O111J4306J825r298J0134p962j1206O44j7897n82J6722J5858j4156
9323a3652p212j6536j7110M280Q233P692n803J6195J7231j5551o092j402P560
9310b2167K7115M631l1031J5507K6100K6653n159j4364j5486K454q908J6611M700
$$ plain form
9404 -17746 -8301 9292 -2363 -23202 -19143 2052 -4225 -2349 10916 19132 20034 16373 18357 4723
9390 4723 9525 8423 3340 6208 6922 615 -9 6224 3780 -24305 -25625 -21593 -9721 25998 32337
9375 32337 39388 32262 6845 -2607 6583 23814 36459 33515 18954 20422 18805 6026 17221
9362 17221 14301 -36 -7870 -9073 -14251 -4198 2151 126 -16890 -25219 -10668 3933 1955
9349 1955 15669 7470 -13787 -17797 7171 15102 9026 -7658 -6445 -28 -10340 -22197 -18151
9336 -18151 -12040 2266 4091 -5207 4927 -3035 -14241 -13597 -31494 -32076 -15354 504 -13652
9323 -13652 -20864 -37400 -54510 -50230 -41997 -34305 -40108 -23913 -6682 -22233 -28325 -29727 -22167
9310 -22167 4948 9579 -21452 -5945 20155 46808 41649 27285 11799 14253 5345 21956 26656
9297B6656l2366o151K29n873K355j9332j1868K6892Q401k5090j839J7200j873
9284b2659p332l733J2713J4758o774k1235o212j456o508J7176J506L869J4948
9271a0939R186j4589N224O840J859k164l916J7446J3218o012k991j5720j4270
9258a6828m520R981L460J304J252J7210J6329J1180O099J0527j371j0893O385
9245E0115k2975k084N776p606M879L5175j3970l1714j0300J528k2379k850J34
9232a6271R069J3852p191J731J0288M811k0054P181P806n408M191l697P579j1541
9218B346j800K562r998j7790k864N427M354J4256J0835j1349N604J1484J2625
9205B5692J1296J1855j0775M207K916j2929k1231j0519J0571K1705J220q28J0025
$$ plain form
9297 26656 -5710 -11861 -11632 -17505 -15150 -34482 -46350 -19458 -11057 -36147 -37986 -20786 -22659
9284 -22659 -29991 -33724 -21011 -6253 -13027 -34262 -40474 -41930 -48438 -31262 -29756 -25887 -10939
9271 -10939 -1753 -16342 -11118 -4278 -2419 -4583 -8499 8947 22165 16153 13162 -2558 -16828
9258 -16828 -21348 -11367 -7907 -6603 -5351 11859 28188 39368 45467 55994 54623 43730 50115
9245 50115 27140 25056 30832 23226 28105 63280 49310 17596 7296 8824 -13555 -16405 -16271
9232 -16271 -7202 6650 -541 1190 11478 16289 -3765 3416 11222 5814 10005 6308 13887 2346
9218 2346 546 3108 -6890 -24680 -27544 -22117 -17763 -3507 7328 -4021 1583 13067 25692
9205 25692 36988 48843 38068 42275 45191 32262 11031 512 11083 32788 34008 33180 43205
9192D3205J992N800j0431n373j6915j74j8507p632J1890k4473r777K5085N861
9179E51J9883R607j1935l342L869J6455p367o861J2347J1071p533j1609O187L925
9165C5248k2964j0359m240Q046R554J059J3656J8066n581M616k057r926j9185
9152A5933j1003K558P497P469j965L13R386m453j976j4685L353J529J054j509
9138A3501j418O543J2504J450q127M944m250J823m067N300p843l110j0J5565P136
9123C9941j149l431l078J9039N267N877m359M640J0425J0150m256J2181J1855
9110A03102M91q929m821p341J4561j6058L202J8315L2324M821N031R646L2830
9097A87174J7923N405R525L6967J1590Q177J7815K5021M2004O3720N2914O0439
$$ plain form
9192 43205 45197 50997 40566 35193 18278 18104 -403 -8035 3855 -20618 -30395 -5310 551
9179 551 20434 30041 18106 14764 18633 35088 27721 20860 33207 44278 36745 25136 31323 35248
9165 35248 12284 1925 -2315 5731 15285 16344 30000 48066 42485 47101 45044 35118 15933
9152 15933 4930 7488 14985 22454 20489 20802 30188 25735 23759 9074 12427 13956 15010 13501
9138 13501 12083 18626 31130 32580 24453 29397 25147 26970 22903 28203 20360 17250 17240 32805 39941
9123 39941 38792 35361 32283 51322 56589 62466 58107 62747 73172 83322 79066 91247 103102
9110 103102 103593 94664 89843 82502 97063 81005 84207 102522 134846 139667 144698 154344 187174
9097 187174 205097 210502 220027 256994 268584 276761 294576 319597 361601 425321 478235 538674
9085E38674O9662R0728J16748J26977J85582K40439L15762M58618N62922O82971
9075C389083P62212P39050N86201M28799K15191l0031k82234n48377q09887q55539
9065C594468p03460n52213m05412k61066k04055j61617j31700r4350r3341q6311
9055I00943o1784o5612o3745m2715k3810n2940m6564l0558j6121p002k4162k2390
9043D43540l0372O052j3704j278k4861m0856j9606r086M552j1005q912j6533j3938
9030B63993j8761K799k369p942q639M920J1584j3542J124k4929l0734j7093K20
9017A60631q388k7004o153l691K1323N304q823k2232n843J861K315J1087N494
9004A25881j8323j7607O181J0147l132O695o532m76L260p873o959j0628j2139
$$ plain form
9085 538674 608336 699064 815812 942789 1128371 1368810 1684572 2143190 2706112 3389083
9075 3389083 4151295 4890345 5476546 5905345 6120536 6090505 5808271 5259894 4450007 3594468
9065 3594468 2891008 2338795 1933383 1672317 1468262 1306645 1174945 1080595 987254 900943
9055 900943 839159 773547 709802 667087 643277 590337 543773 513215 497094 490092 465930 443540
9043 443540 413168 419220 405516 404238 379377 338521 318915 309829 314381 303376 294464 277931 263993
9030 263993 245232 248031 245662 237720 229081 234001 245585 232043 233167 208238 177504 160411 160631
9017 160631 152243 125239 119086 115395 136718 142022 133199 110967 105124 106985 109300 120387 125881
9004 125881 107558 89951 96132 106279 103147 109842 103310 102834 106094 98221 91262 80634 68495
8991F8495j0400J0715o434j8284Q943p398j5498l434M9576K9061p150k1242j9666
8978E7284o567N927j6049q044k82O863j64J6511n032j4767P471L923j1674O508
8964D1908K3392R130o222j0021j6986j7544J5051K6723R422k1397l2067j3018
8952H371l956R324j2395j39L3263m021j6650j1850n972Q971K7554J0334o566j6977
8938A9291R215K0768j1525j1917J3999k815K552j7023j2449j607K1056j1160q185
8925A0200Q412J3081n155l3891K184J1168K517J9222j9155k068J3926j2063j2762
8912d384k649L911N686Q291p624o404j2383R554J5071M178N01J029k894k9735
8898a7852J586J0968r262J3928J2720p889J2423N487j3116o67P926J266j4854
$$ plain form
8991 68495 58095 68810 62376 44092 53035 45637 30139 26705 76281 105342 98192 76950 57284
8978 57284 50717 56644 40595 32551 32269 39132 38968 55479 50447 35680 43151 47074 35400 41908
8964 41908 65300 74430 68208 58187 41201 23657 38708 65431 74853 53456 21389 8371
8952 8371 4415 13739 1344 1205 34468 30447 13797 1947 -4025 4946 32500 42834 36268 19291
8938 19291 28506 49274 37749 25832 39831 37016 39568 22545 10096 8489 29545 18385 10200
8925 10200 18612 31693 26538 -7353 -5169 5999 8516 27738 8583 6515 20441 8378 -4384
8912 -4384 -7033 -3122 2564 10855 3231 -3173 -15556 -6002 9069 13247 13748 14777 11883 -17852
8898 -17852 -16266 -5298 -14560 -632 12088 4199 16622 22109 8993 8326 16252 17518 2664
8885B664O513K7285J6065r008k4247l4921P866J367K0118K6581L897N080n6j2818
8871C6386l765L584J9327j2645J081j1912k843J3281j2241l172J2762l467k2498
8858A3878k7995o071Q254J1152j0578N035J7310j51j6334l642K127J2807Q521
8845A4313P172K3919J5603j2625k0308j3253O710J6508Q49l774Q579O37J41K1251
8831F5722M373M1R511J5937J2168l2199k5127Q756P526k2110J2543N34q931J6426
8817F5170M977j0493k4720n539J890r062j152n637r483k8838p712R948O661N781
8803h209j9564p220K5583P506p179J5299J6857q816k0289j0549l039J5462J9609
8790A5451Q514J4097J042j4162O836q747o380p651K1813L7984k88p244j7032j1455
$$ plain form
8885 2664 9177 36462 52527 43519 19272 -15649 -7783 -6416 13702 40283 44180 49260 49204 36386
8871 36386 32621 36205 55532 42887 43968 32056 29213 42494 30253 27081 39843 36376 13878
8858 13878 -14117 -20188 -11934 -782 -11360 -6325 10985 10834 -5500 -9142 -7015 5792 14313
8845 14313 21485 45404 61007 48382 28074 14821 21531 38039 38888 35114 43693 44330 44471 65722
8831 65722 70095 70136 79647 95584 107752 75553 50426 59182 66708 44598 57141 57675 48744 65170
8817 65170 70147 59654 34934 29395 31285 22223 21071 15434 5951 -22887 -30599 -20651 -13990 -8209
8803 -8209 -27773 -34993 -9410 -1904 -9083 6216 23073 14257 -6032 -16581 -19620 -4158 15451
8790 15451 23965 38062 39104 24942 31778 23031 16651 9000 30813 68797 68509 61265 44233 32778
8776C2778L390j247K0696j2928j1319M062j4352j5615j3916m840l52J4573Q762
8763I692J304n285j515N219r12J8182j1127k2883l184R645M009j3897K050K0343
8749A1641J2214J0504l825q791k0601k6210P688O664k511r077j1517K3197J6993
8736F369K3689o779j2866K189j541k1215l089O913R379J2415l480j8550R392K5518
8722B8344Q582j5253k0981o052O578M641J0559N6N828j8397k0220M753L716n444
8708a3290L2326J0187J0027q189J180j2912j4114k8783n691N308N671J4940m928
8695h268m007J0667J5458p46K515M015j7251o942P639M605L67q50o947j1517p160
8680a8422l677K0161J9529J8747m083j6309o195r481J226Q823j2433j076j0344
$$ plain form
8776 32778 36168 34921 55617 42689 31370 35432 21080 5465 -8451 -13291 -13643 930 9692
8763 9692 10996 5711 4196 9415 8503 26685 15558 -7325 -10509 -864 3145 -10752 -8702 11641
8749 11641 23855 34359 30534 21743 1142 -25068 -17380 -10716 -13227 -22304 -33821 -10624 6369
8736 6369 30058 23279 10413 12602 11061 -10154 -13243 -6330 3049 15464 11984 -6566 2826 28344
8722 28344 36926 21673 692 -5360 1218 5859 16418 16474 22302 3905 -16315 -11562 -7846 -13290
8708 -13290 19036 29223 39250 31061 32241 19329 5215 -23568 -29259 -23951 -18280 -3340 -8268
8695 -8268 -12275 -1608 13850 13104 15619 19634 2383 -4559 3080 7685 8052 7202 255 -11262 -18422
8680 -18422 -22099 -1938 17591 36338 32255 15946 9751 270 1496 10319 -2114 -3190 -13534
8667a3534R326J9397m650j3901J1665J3067J112l497m939Q759R530N415k119j1704
8653B3927K956J1819j5629j3493n496J8392K3628J4008P709j6504K105p66l332
8640D9324r414k4054p373j4128K2736M051j3357q086j0515J4942j2853J944J4934
8627H151N689j0793M310r671k797R804M889j2540N214K1854J2764K9l1864j4169
8613i130P443K3196J3893J0138j1484k8622m630J5989J6452j7713j8521j835R720
8600D896q400J465k951J064N486l185M859J8635k50j0331J3244K5360L00j5547
8586C4645k4625P904N685j154O201P280J0970j8183p546J2712K315m250P012k7781
8572A1185M49O034R532j2262r439n424O876l48o647k624k728j1384L809L958L776
$$ plain form
8667 -13534 -4208 15189 10539 -3362 8303 21370 22482 18985 14046 22805 32335 37750 35631 23927
8653 23927 26883 38702 23073 9580 4084 22476 46104 60112 67821 51317 53422 52656 49324
8640 49324 39910 15856 8483 -5645 17091 21142 7785 -301 -10816 4126 -8727 -6783 8151
8627 8151 13840 3047 7357 -2314 -5111 4693 9582 -2958 2256 24110 36874 36903 5039 -9130
8613 -9130 -1687 21509 35402 45540 34056 5434 804 16793 33245 15532 -2989 -4824 4896
8600 4896 -3504 -2039 -4990 -3926 1560 -1625 3234 21869 21619 11288 24532 49892 50192 34645
8586 34645 10020 17924 23609 22455 28656 35936 46906 28723 21177 33889 36204 31954 38966 11185
8572 11185 11634 17668 27200 14938 5499 75 6951 6603 -44 -2668 -5396 -16780 -12971 -9013 -5237
8557e237O304J6503J6627P990K837k812R240j9361k7561j5235j5948R669J7605
8544F21r690j830R20m20K149k647J182m315N22r148K0813k343j8568r202K1441
8529a0515j844J4297k649L339K7941o223j0717j416R090K800N296r862j5453j3752
8515i668j5286m17L692Q302O845k646m598K493j7722K000l226J5538j2007j042
8501b7742M853J0791N904J0416j5237R53j5638M451L7370J7902P026J339k5195
8488A7193j7524o003O7k449k0308N451L667j5053p538J9229R042j0450N13k482
8474b6645k985K0814P334k95J777p749P6M604o680n285k0265l711L2530n772j1144
8459b3396L34N285J2288r245R283N131n761K299J2120m921J214q482m919k878
$$ plain form
8557 -5237 1067 17570 34197 42187 45024 42212 51452 32091 4530 -10705 -26653 -16984 621
8544 621 -9069 -10899 -9979 -10399 -8250 -10897 -9715 -14030 -13508 -22656 -1843 -4186 -22754 -31956 -10515
8529 -10515 -12359 1938 -711 2628 30569 24346 13629 12213 21303 24103 29399 19537 4084 -9668
8515 -9668 -24954 -25371 -21679 -13377 -6532 -9178 -13776 -11283 -29005 -27005 -30231 -14693 -26700 -27742
8501 -27742 -22889 -12098 -6194 4222 -11015 -10062 -25700 -21249 16121 34023 41049 42388 17193
8488 17193 -331 -6334 -6267 -8716 -29024 -23573 -19906 -34959 -42497 -23268 -14226 -24676 -24163 -26645
8474 -26645 -29630 -8816 -1482 -1777 0 -7749 -7673 -3069 -9749 -15034 -35299 -39010 -6480 -12252 -23396
8459 -23396 -23062 -17777 -5489 -14734 -5451 -320 -6081 -3782 8338 3417 4631 -3851 -8770 -11648
8445a1648L610l616L275m629n142L545j3595R185J2102n682j9827K0027K4513
8432A2118n921rj2349O119n719J0693J9547L21j1499N496K516q915l400k5077
8418a6079l324J7033J798k213j3253j9020o043M374J8061K7652q888O601K614
8405I313p305J3006J4035k6687l1374r219j791K3381K8701J6556J1345j7451j871
8392B0639n464J916j1150j0567n151l897M152K1781N923k1219p467K3354J6060
8379B8910L630k1189l880q934n460K662M445j4652J2358K4612n893k8859m179
8366a6429j1877K3336L3470N017j7828p574R626n317M555n145J7314J2177n728
8353C5597j6280k462k602k897M946L222j4229j6436j1456r12q818J8027J4323
$$ plain form
8445 -11648 -8038 -11654 -8379 -13008 -18150 -14605 -28200 -19015 -6913 -12595 -32422 -12395 12118
8432 12118 6197 6188 -6161 -42 -5761 4932 24479 24800 13301 18797 21313 12398 8998 -16079
8418 -16079 -19403 -2370 -572 -2785 -16038 -35058 -41101 -36727 -18666 8986 98 6699 9313
8405 9313 2008 15014 29049 2362 -29012 -38231 -40022 -16641 12060 28616 39961 22510 20639
8392 20639 15175 17091 5941 -4626 -9777 -13674 -9522 12259 18182 -3037 -10504 12850 28910
8379 28910 32540 11351 7471 -1463 -6923 -4261 184 -14468 -2110 22502 16609 -12250 -16429
8366 -16429 -28306 -4970 28500 33517 15689 8115 17741 12424 16979 11834 29148 41325 35597
8353 35597 19317 16855 14253 11356 16302 19524 5295 -11141 -22597 -23509 -32327 -14300 23
8340B3Q243m140p317J8415K263K8644J2196m205q734j2119j8328p995r184J7626
8326A5388J6321j2773j9577j3983l744J9741J9259M113j8092j305r880N612j1488
8313a0408J1892L0332J9605m212j4506j4191k1212R373r978P014O698m687j023
8300D697l095J554m938J544J0358p956r296J0030K1686j0000n180k4169J786K6578
8286A3599k903m87J935M08q749p325j5512J1843K4106R688n827j160J19r315P40
8271A1160M223j1191O601R332o246m415p932k9174j497L1929J0955O117J8716
8258C8578j8499k4556N572Q26q577o258J7467J1961M911Q61j6280p333J4046K587
8244A5306M739l4575l8525J8018J5258K7661J9210k153l568p884k173j3358r138
$$ plain form
8340 23 8266 4126 -3191 15224 17487 46131 58327 54122 45388 33269 14941 6946 -2238 15388
8326 15388 31709 18936 -641 -14624 -18368 1373 20632 24745 6653 5348 -4532 1080 -10408
8313 -10408 1484 31816 51421 47209 32703 18512 -2700 6673 -3305 3709 10407 5720 4697
8300 4697 1602 3156 -1782 -238 10120 2164 -7132 2898 24584 14584 9404 -14765 -12979 13599
8286 13599 10696 10209 12144 12552 3803 -3522 -19034 -7191 16915 26603 20776 19616 19735 10420 11160
8271 11160 15383 4192 10793 20125 13879 9464 1532 -27642 -29139 2790 13745 19862 38578
8258 38578 20079 -4477 1095 1921 -6656 -12914 4553 16514 21425 22286 6006 -1327 12719 15306
8244 15306 20045 -14530 -53055 -35037 -19779 7882 27092 24939 21371 13487 11314 -2044 -11182
8231a1182M730O970J6234o759M516J0604J2715j422k1790k1230M672J3465J578
8218A3101k686j875J251L307J6930k254j529j4549k2665J007K240J548M718j133
8204b589k830L543J879l1789l869p778J5782L7802J2677N044k4971l4136M980
8191b6255K2996R353O243n856j3486j2353O270K1525j2158k4979J4536J6923k240
8178E19m42Q107K989n535j2018j952J7909q375J791n637L257L734j065K651p568
8163a635j7828j0396J4290P513N925P020N509J2984m591M353m816k6452j225K0433
8149A1084m566P370n978j5555k132r11p462R747M702q920p235k091N446R650Q043
8134A192J6114r135J667N335M454Q000q623j5501J0951j3274j7015M178N736N794
$$ plain form
8231 -11182 -6452 518 16752 9993 14509 25113 37828 36406 14616 -6614 -1942 11523 13101
8218 13101 10415 8540 9791 13098 30028 27774 26245 11696 -10969 -9962 -7722 -6174 -1456 -2589
8204 -2589 -5419 -1876 3 -31786 -35655 -43433 -27651 10151 22828 27872 2901 -31235 -26255
8191 -26255 -3259 6094 12337 6481 -7005 -19358 -13088 8437 -3721 -28700 -14164 2759 519
8178 519 77 8184 11173 5638 -6380 -8332 9577 1202 2993 -2644 613 4347 3282 5933 -1635
8163 -1635 -19463 -29859 -15569 -8056 -2131 4889 10398 23382 18791 23144 18328 -8124 -9349 11084
8149 11084 6518 13888 7910 -7645 -9777 -10688 -18150 -8403 -3701 -12621 -19856 -21947 -16501 -6851 1192
8134 1192 17306 8171 9838 15173 19627 27627 19004 3503 14454 1180 -15835 -11657 -5921 -127
8120a27O659J0408j1121j1719p508j3073j9209J4868J2789J0939j722N591O927
8107C702l531P431j2891L774P984p976L961K0252q089l0597j3800R67l168J4732
8093a7249K3972J838R607K977l2041r439K7941K6809L198q945l0770k149M684
8080D33K1935J5265j0725q419j3902N037O000o851l144O226O042J7210l783k6609
8066D715L653o26m857j0875m858J102O524J1203N549J1463n162o828O952j0210
8052G745n058Q700Q076j4743q088L886J401k580J0013K552r103j1580M162j620
8038f237J7361M467k266q635J4462K0546J509j2882k5490J3033Q259L017o300
8025B0844j2582N21j0609L532J1154J510M073J0214M524J4847O36o151j8582l1614
$$ plain form
8120 -127 6532 16940 5819 -5900 -13408 -26481 -45690 -30822 -18033 -7094 -8816 -3225 3702
8107 3702 171 7602 -5289 -1515 6469 -1507 2454 22706 14617 -15980 -29780 -28813 -31981 -17249
8093 -17249 6723 8561 18168 21145 -10896 -20335 7606 34415 37613 28668 -2102 -4251 433
8080 433 22368 37633 26908 18489 4587 9624 15624 8773 5629 11855 17897 35107 31324 4715
8066 4715 8368 7742 2885 -7990 -12848 -11746 -5222 5981 11530 22993 17831 11003 17955 7745
8052 7745 2687 11387 19463 4720 -3368 518 1919 -661 9352 11904 2801 -8779 -4617 -6237
8038 -6237 11124 15591 13325 4690 19152 39698 41207 28325 2835 15868 24127 27144 20844
8025 20844 8262 8783 -1826 1706 12860 14370 18443 28657 33181 48028 48664 42513 23931 -7683
8011g683o8J4795P172L900J9283P367r971j3947j719j6620L924o436q369j3423
7997b1795k3573J5757J5290O40R148M896P602L818J5582P123p204k0635L654J5834
7983B6137k4827j1501M096J9336M502J5159O866l649k64j8561j3730Q852J6863
7970B9279K749P8J253p196p279K1281K325j3519j6257n156M162n445J960K1724
7956B9959k342l06j3570p430j6546n850J5862P000J0990m832k675M774R893j1701
7942A3226q201J7727R799o016q53J4036m466j9533k3728L651J5864j3193k883
7929d570q04P238R568L17P414l698n377J0111Q880q877l43Q773J0501O199k6629
7914A8703j9633r994p230K050J0962J4920j400j742J318P663O296J566j41j14
$$ plain form
8011 -7683 -7751 7044 14216 18116 37399 44766 34795 20848 19129 2509 6433 -3 -8372 -21795
7997 -21795 -45368 -29611 -14321 -13681 -4533 363 7965 11783 27365 34488 27284 6649 10303 26137
7983 26137 1310 -10191 -6095 13241 17743 32902 39768 36119 35855 17294 3564 12416 29279
7970 29279 32028 32106 33359 26163 18884 40165 42490 28971 12714 7558 11720 6275 8235 29959
7956 29959 27617 27311 13741 6311 -10235 -16085 -223 6777 17767 12935 10260 15034 24927 13226
7942 13226 5025 22752 32551 26535 25682 39718 35252 15719 -8009 -4358 11506 -1687 -4570
7929 -4570 -5374 1864 11432 11749 19163 15465 10088 20199 29079 20202 19859 28632 39133 45332 18703
7914 18703 -930 -10924 -18154 -16104 -5142 9778 8378 6636 7954 15617 21913 23479 23338 23224
7900B3224k8724j635J0174j112L249Q361q028p420K2237j3141q691p025J423M879
7886b229J2994J5496l005k921j761o242m0061j0048R737J3708J0349l87r060R059
7872d371J6391J8711j9740M201O1j2255k136R929J819Q522k3900m880K2389J8293
7858C3034j0125k1573j6764j354j121K7011K2684j4626j2133j6973p038K2937
7846C959K5581l573J4652j6724k9544j0854M512O178m796m372J0912j775M786
7833a058M855M106L428q990P611Q746j6197j0105r810M578l660J6634K5616Q627
7819C4381J289p512j0218j5911J897j4295j4799K928P852j7919K61m903K4493
7806a2456J0476j2158O055L1324J9143j1829k6333l1674l395L2676K088k6246
$$ plain form
7900 23224 -5500 -7135 3039 1927 5176 13537 5509 -1911 20326 7185 -1506 -8531 -7108 -2229
7886 -2229 10765 26261 23256 20335 18574 12332 -27729 -37777 -28040 -14332 -3983 -4370 -13430 -4371
7872 -4371 12020 30731 10991 15192 15253 2998 862 10791 12610 21132 -2768 -7648 14741 33034
7858 33034 22909 1336 -15428 -16782 -17903 9108 31792 17166 5033 -11940 -18978 3959
7846 3959 29540 25967 40619 23895 -5649 -16503 -11991 -5813 -10609 -14981 -4069 -5844 -1058
7833 -1058 3797 7903 11331 2341 9952 18698 2501 -7604 -17414 -12836 -16496 138 25754 34381
7819 34381 35670 28158 17940 2029 3926 -10369 -25168 -22240 -14388 -32307 -32046 -36949 -12456
7806 -12456 -1980 -14138 -8083 23241 42384 30555 4222 -27452 -30847 1829 3917 -22329
7794b2329l7N526J5131P057j4746j2967O295J957J968Q210n051Q84L364q595L157
7779a0176m540J0443K1883J8285R109p561j8635j1010J3212O688l022r504j4687
7766D85O077J2820o843n109r677N546J0975J4466N161j0648k1469o535k228j4163
7752b1142J623K2601P582j4527o387j0638j1977j1621R469K7683L6244j6743j3714
7739a547L718j2293Q452O438l334O755R217k923j6617J8543q407j5631K943J6647
7725A1961J4695L766m676j698k4442k9114R900K3971N559q913j0499J0333p341
7712f498K4983J5473m379k007j672q278j9142O591k423j1623l45l090l679k23
7698a6312p516k4159J690J2147O280O111j2791N884M965K238J2206j1220p270
$$ plain form
7794 -22329 -22366 -16840 -1709 5348 -9398 -22365 -16070 -14113 -12145 -3935 -8986 -8102 -4738 -13333 -10176
7779 -10176 -14716 -4273 17610 35895 45004 37443 18808 7798 21010 27698 24676 15172 485
7766 485 6562 19382 12539 7430 -2247 3299 14274 28740 33901 23253 1784 -4751 -6979 -21142
7752 -21142 -19519 3082 10664 -3863 -10250 -20888 -32865 -44486 -35017 -7334 28910 12167 -1547
7739 -1547 2171 -10122 -1670 4768 1434 8189 17406 14483 -2134 16409 8002 -7629 -4686 11961
7725 11961 26656 30422 25746 24048 -394 -29508 -19608 4363 9922 1009 -9490 843 -6498
7712 -6498 18485 33958 29579 27572 25900 17622 -1520 5071 2648 -8975 -9320 -12410 -16089 -16312
7698 -16312 -23828 -47987 -46297 -34150 -27870 -21759 -34550 -28666 -23701 -21463 -9257 -20477 -27747
7685b7747n502J4375J2026R649p895k954p250j4K6607J0728J585l1782k5201q988
7671d2363J4151m587m954L102O306R144L932Q870P077P666q657l220l588J607
7657e514o996p004K0469M106J5948J362j7184j7416j4890J6370J5158j4417Q0
7644i928p565k912J085O803J136J5233J9250Q191j8028k60L22l335k678o507M407
7629E214O240j2419R038J0042J5800q032o441j6205J251j489m894l343O11N272
7615F45l426p295J3930K288j350J371j1463o592p093n336k892q649N591K1055
7601i216R599K418K681m491j3118J6832J1670r445o240j0803N19n509P81J514
7587a2808J9056J0208k515M813L609j5513l127j2339j0498q022J4208k809k519
$$ plain form
7685 -27747 -33249 -18874 -6848 2801 -5094 -8048 -15298 -15312 11295 22023 23608 -8174 -33375 -42363
7671 -42363 -28212 -32799 -37753 -34651 -28345 -19201 -15269 -6399 678 8344 -313 -3533 -7121 -5514
7657 -5514 -12510 -19514 955 5061 21009 22371 5187 -12229 -27119 -10749 4409 -10008 -9928
7644 -9928 -17493 -20405 -19320 -12517 -11381 3852 23102 31293 13265 13005 13327 9992 7314 807 5214
7629 5214 11454 -965 8073 18115 33915 25883 19442 3237 4488 2999 -1895 -5238 -4627 645
7615 645 -2781 -10076 3854 6142 4792 6163 -5300 -11892 -18985 -24321 -27213 -35862 -30271 -9216
7601 -9216 383 2801 5482 991 -12127 4705 16375 6930 690 -10113 -9594 -15103 -14322 -12808
7587 -12808 6248 16456 13941 18754 22363 6850 3723 -8616 -19114 -27136 -12928 -15737 -18256
7574a8256L475Q503K2175j2110j8817J4544Q120j0501P222q845N394j0346J4432
7561D990R867K749p025k1714l783O808r170j2397P12M025N011J6066J0225J404
7547G768l4059k598K5923J6993L520j652J0215k3960k2235q18J3922J8671J0277
7534B1967j4676Q879o072j1317j2989O27j0380K2550K3331N807j7436j1024M267
7521C534j5964m400O190j014O986j0379j590J8276m234M982K577K367J4748J2167
7507C4246j5015l747j5021n191J5381J309l091J9927j7435j3476r81Q531Q357
7494A3794j9018l892K386o629m473J0109j1757j4321J3941P530J6213r337k6413
7481c1867J058P653K1854L28o846r786n452J0216K005n715J0084K464n608Q979
$$ plain form
7574 -18256 -14781 -6278 15897 3787 -15030 -486 7634 -2867 4355 -4490 904 -9442 4990
7561 4990 14857 17606 10581 -11133 -14916 -8108 -17278 -29675 -28963 -24938 -19927 -3861 6364 7768
7547 7768 -26291 -28889 -2966 14027 17547 15895 26110 2150 -20085 -20903 -6981 11690 21967
7534 21967 7291 16170 10098 -1219 -14208 -13581 -23961 -1411 21920 27727 10291 -733 3534
7521 3534 -12430 -16830 -10640 -11654 -4668 -15047 -16637 1639 -2595 2387 4964 7331 22079 34246
7507 34246 19231 15484 463 -4728 10653 11962 8871 28798 11363 -2113 -3094 5437 13794
7494 13794 -5224 -9116 -6730 -13359 -17832 -7723 -19480 -33801 -19860 -12330 3883 -5454 -31867
7481 -31867 -30809 -23156 -1302 -974 -7820 -17606 -23058 -12842 -10837 -16552 -6468 -4004 -9612 -633
7467f33K4452m880j017k0011O805J369r521J1802k947l233j1152K275j322N582
7453b431m978R162j1320k480m848J4059J3531j7816q779K2527J6453L076r767
7440A6389k76K3261R608m278k2153k3680j7127J2305R406O386l619k3179J397
7427a5560K556J076K070p934j1051J0140K166J793J1348J2948K795j6394n045
7414i092L115L886M848O529j917J356M482n200r301q719l245K030r903k0626k821
7399d4578J0054P021J1270J1258J390N221L638J2251j1235j0122N559k196o999
7386g468l947j3042R353R032J2578j7308k687J5733Q560q031Q594J0529o026r88
7372A4882J037j9378j3828m090J336L560J188Q442J7890j3225j0746J847o584
$$ plain form
7467 -633 23819 18939 17922 -2089 4716 6085 -3436 8366 5419 2186 -8966 -6691 -8013 -2431
7453 -2431 -7409 1753 -9567 -12047 -16895 -2836 10695 -7121 -15900 6627 23080 26156 16389
7440 16389 16113 39374 48982 44704 22551 -1129 -18256 -5951 3455 9841 6222 -16957 -15560
7427 -15560 -13004 -11928 -9858 -17792 -28843 -18703 -16537 -14744 -3396 9552 12347 -4047 -9092
7414 -9092 -5977 -2091 2757 9286 7369 8725 13207 8007 -1294 -10013 -13258 -11228 -21131 -41757 -44578
7399 -44578 -34524 -27503 -16233 -4975 -3585 1636 5274 17525 6290 -3832 1727 -469 -7468
7386 -7468 -11415 -24457 -15104 -6072 6506 -10802 -13489 2244 10804 2773 11367 21896 15870 14882
7372 14882 15919 -3459 -17287 -21377 -20041 -16481 -15293 -6851 11039 -2186 -12932 -11085 -17669
7359a7669Q290J9049P452J2773j2003k0960j4139o439J2989p478R063J6443j215
7346F156M297J657j5995L380l364Q93j222Q1J0290L895k149Q91K305M036o454
7331H697l0313k830M160M848J4532J0116r597N118R358q162L066p529n32q882
7317g950j0042j62R534O248j0025j9848J0333J8269P993k74R78K356J6328j1698
7303A2040j3009j1669N311j0138J6302J0943J3951l30P866p623r073p703J0582
7290A7450k509k3836j859K28r598P314Q675j761J1198J0858n545M147Q738k1220
7276B280j3987j1670m708P828o35K416M01J937K0291P800K0403K906j9503j1810
7262C949P869L353Q296J0857r916k0992q838Q135N782R493J1996j9575j2857P576
$$ plain form
7359 -17669 -9379 9670 17122 29895 17892 -3068 -17207 -23646 -10657 -18135 -9072 7371 6156
7346 6156 10453 12110 -3885 -505 -3869 -2976 -4198 -4117 6173 10068 7919 8810 11115 15151 8697
7331 8697 -21616 -24446 -20286 -15438 -906 9210 -387 4731 14089 5927 8993 1464 932 -7950
7317 -7950 -17992 -18154 -8620 -2372 -12397 -32245 -21912 -3643 4350 4076 5054 7410 23738 12040
7303 12040 -969 -12638 -7327 -17465 -1163 9780 23731 23401 31267 23644 14571 6868 17450
7290 17450 14941 -8895 -10754 -10526 -20124 -12810 -4135 -5896 5302 16160 10615 14762 23500 2280
7276 2280 -11707 -23377 -28085 -20257 -20892 -18476 -18075 -16138 4153 11953 32356 35262 15759 3949
7262 3949 11818 15171 23467 34324 24408 3416 -5422 2713 8495 17988 29984 10409 -2448 5128
7248E128J6290j813j8296R762N210J3434j4301p822P439M768j7100k0859M96J6275
7234a389J1725j8340j7530l76M080J231R423J9302L797j5883O325p914p599j71
7220a3319q053Q742Q34O349M951R088J0735P590j8043j9240J023K742o835N015
7206h421J7328J0921j1247L536P287j228j8663j1760M632J4425Q269j6929J911
7193F1J3788Q480q275j1703r901j1227j5231Q536J4872m786J1501J1387K053J2675
7179B2230J472K123n861j6377R30P74j2806k0021o41R628M7619N065q128l1112
7165e105j3784j3756N59J7363J2394L746L506q294L752P429j4984J0134o6n524
7151b630j0021k1136j026N442m880P096J4851O913j2736q065k444J6035k006p64
$$ plain form
7248 5128 21418 19605 1309 11071 16281 29715 15414 7592 15031 19799 2699 -18160 -17664 -1389
7234 -1389 10336 -8004 -25534 -25910 -21830 -20599 -11176 8126 11923 -3960 2365 -5549 -13148 -13319
7220 -13319 -21372 -12630 -11796 -5447 -496 8592 19327 26917 8874 -10366 -9343 -6601 -13436 -8421
7206 -8421 8907 19828 8581 12117 19404 18176 -487 -12247 -7615 6810 15079 -1850 61
7193 61 13849 22329 14054 2351 -7550 -18777 -34008 -25472 -10600 -15386 -3885 7502 9555 22230
7179 22230 23702 25825 19964 3587 4517 5291 -7515 -27536 -28177 -18549 29070 34135 26007 -5105
7165 -5105 -18889 -32645 -32086 -14723 -2329 1417 4923 -3371 381 7810 -7174 2960 2894 -2630
7151 -2630 -12651 -33787 -34813 -29371 -34251 -27155 -12304 -5391 -18127 -26192 -28636 -12601 -14607 -15371
7137a5371j7360J6290J1536j6414L708J1149O126M268K930Q095o572J4211J286
7124B3882N977o790j147N113L765j1262n418K492J455K389k329j1486r381n934
7110h674R161j2050k2850q955J3765r120k37n169N954J2831j5379K136Q981N069
7096b4537q541k583J7790J7622K2060o382j8915p358M259j0717K720J0626o144
7083a0100p209r987j408L735k603R899l956j4226K0609L10k1705m478L0354r563
7069b0328J3664J1941m865R160o649j5648L73R724J0127L623p751q055j3819L212
7055a5291j7610p286K2910K3012L98R2l782Q680l346j6373j6223j3444J8594M276
7041a5393J6364J790k2309l679J857j4516k870J9060Q724J0763J0658Q248o929
$$ plain form
7137 -15371 -32731 -16441 -4905 -21319 -17611 -6462 -336 3932 6862 14957 8385 22596 23882
7124 23882 29859 23069 21922 27035 30800 19538 14120 16612 18067 20456 18127 6641 -2740 -8674
7110 -8674 487 -11563 -34413 -43368 -29603 -38723 -38960 -44129 -38175 -25344 -40723 -38587 -29606 -24537
7096 -24537 -33078 -35661 -17871 -249 21811 15429 -3486 -10844 -6585 -17302 -14582 -3956 -10100
7083 -10100 -17309 -27296 -28704 -24969 -27572 -17673 -21629 -35855 -15246 -14936 -36641 -41119 -10765 -20328
7069 -20328 -6664 5277 412 9572 2923 -12725 -12352 -2628 7499 11122 3371 -4684 -18503 -15291
7055 -15291 -32901 -40187 -17277 5735 6133 6225 2443 11123 7777 -8596 -24819 -38263 -19669 -15393
7041 -15393 971 2761 -19548 -23227 -21370 -35886 -38756 -19696 -10972 -209 10449 18697 11768
7028A1768k908o461O735j2821o331M121k2054k3306K3821K5627R564J9825J1067
7015C8647j2244m900j3533R024P890j3629j6600j4424O281J2687q204P034J0397
7002H426P62J5052j1475k1051j457J812r871l459L961n915J556J0409M795r07
6988g362J9493o719Q809P720q359r278j571m803j5845q17j292j2350n148M900
6974c2622L874K4607j0960l0261R63J5120P716K31J8516m024J7401M097k5603
6961a0945k2625J7237q657J869L993j8023m684K7065K2576l551O021p480o192
6948c396n773L497n348j7404j2492J3274K42P261j832m051J2224O169J1865j9480
6934a5244j2632O098N27L465M911m287j1574k0384L7683K2133j089j2098M684
$$ plain form
7028 11768 8860 2399 9134 -3687 -10018 -5897 -27951 -51257 -27436 -1809 7755 27580 38647
7015 38647 26403 21503 7970 16994 24884 11255 -5345 -19769 -13488 -801 -9005 -1971 8426
7002 8426 9188 24240 12765 -8286 -9743 -7931 -17802 -21261 -17300 -23215 -21659 -11250 -6455 -7362
6988 -7362 12131 5412 14221 21941 13582 4304 2733 -2070 -17915 -18732 -20024 -32374 -37522 -32622
6974 -32622 -28748 -4141 -15101 -45362 -44399 -29279 -21563 -21332 -2816 -6840 10561 14658 -10945
6961 -10945 -33570 -16333 -24990 -23121 -19128 -37151 -41835 -14770 7806 4255 10276 2796 -3396
6948 -3396 -9169 -5672 -11020 -28424 -40916 -27642 -27400 -20139 -21971 -26022 -13798 -7629 4236 -15244
6934 -15244 -27876 -21778 -21251 -17786 -12875 -17162 -28736 -49120 -11437 10696 9607 -2491 2193
6921B193j2598l715k888J125j3047j851J6045M630m356Q563o585j6930m238j593
6907c5245L24J1837J666O947P649L259J2131K2478M669k3777k0341j0252o90r278
6893b8623m384O270n979L716o507K742K2823J60J3188N74p323O766j0634O93J5851
6878I333N899j5849k6234j602J6350K7164j3895l5335J0611K0102M276K172N540
6865H532L10J333l656J434j6236O638P628J6761J1501k419J23j1324k8775j8844
6851b6994L480Q316j4156K4275J2542K647q886l417j5420J286J9308L816N721
6838A2518o296m897M808n366r953O734J2708j3495j3319k200K1251J4137J451
6825A8081j877j2603J0692j1533j2454P110J5315o744k308J148J207R948J0724
$$ plain form
6921 2193 -10405 -14120 -17008 -15883 -28930 -30781 -14736 -10106 -14462 -5899 -12484 -29414 -33652 -35245
6907 -35245 -34921 -23084 -21418 -14471 -6822 -3563 8568 31046 35715 11938 -8403 -18655 -19345 -28623
6893 -28623 -33007 -26737 -32716 -29000 -35507 -32765 -9942 -9782 3406 3980 -3343 3423 -7211 -6518 9333
6878 9333 15232 -617 -26851 -28453 -12103 15061 1166 -34169 -23558 -3456 820 2992 8532
6865 8532 8842 10175 6519 7953 -8283 -1645 5983 22744 34245 31826 31949 20625 -8150 -26994
6851 -26994 -23514 -15198 -29354 -5079 7463 10110 1224 -2193 -17613 -16327 2981 6797 12518
6838 12518 6222 1325 6133 767 -9186 -2452 10256 -3239 -16558 -18758 2493 16630 18081
6825 18081 16204 3601 14293 2760 -9694 -2584 12731 5987 3679 4827 6034 15982 26706
6812B6706n198j7826p634n340O80J1115J8672j7635n60P306J637k8310j1962M661
6798b3688J0714J6816L2965K5906J2020j623j4664o855m512Q125j7273j8246j9461
6785B24j1392l624K2630J5689j2000k9307O06j4489k941N960j306j308J2535j62
6771a8885p820N434p86k902n361J697k968j410J976J2935Q863M345R381Q432j3572
6756f41j1273K228J1491j0663q208J18J4171O144P14l139m096L616M68j473p742
6741h285K134R20J3639N786j3550K195J9493m946o688j5199O158M448p305j5844
6727a7044q106K0280r0p18k51J8828l592p657M103Q53n754k882J1914m281r05
6712D698n086j8178o983J7804p116J6324l995k1228p663M767J0728j629n57K276
$$ plain form
6812 26706 21508 3682 -3952 -9292 -8612 2503 21175 3540 2980 10286 11923 -16387 -28349 -23688
6798 -23688 -12974 3842 36807 62713 74733 73110 58446 51591 47079 55204 37931 19685 224
6785 224 -11168 -14792 7838 23527 11527 -17780 -17174 -31663 -34604 -28644 -29950 -31258 -18723 -18885
6771 -18885 -26705 -21271 -22057 -24959 -30320 -28623 -31591 -33001 -31025 -18090 -9227 -4882 4499 12931 -641
6756 -641 -11914 -9686 1805 -8858 -17066 -16948 -2777 3367 4081 942 -3154 462 930 -543 -8285
6741 -8285 -6151 -5231 8408 14194 644 2839 22332 17386 10698 -4501 1657 6105 -1200 -17044
6727 -17044 -25150 -4870 -4960 -5678 -5929 12899 9307 1650 5753 6606 852 -2030 9884 5603 4698
6712 4698 -388 -18566 -25549 -7745 -14861 1463 -2532 -23760 -31423 -26656 -15928 -17557 -18114 -15838
6698a5838O144J9956j0579m368O913J95Q645j546q153P748j3437p427j0136m930
6684b6813N789M269R396J0988J8119k577j0491L603q38n094j0017j0j5391k121
6670b1188K4269J3747j935j5577j3295K539K0350l786k5173j6148P58K11k880
6657c8108O50K1518J7730k62q035O09q272K960K1305J3031o154j77n554l335k1052
6642a3146j7436P035O925l907j3311j2179j3793O135O289N602K6399O161l461
6629a2687N785L576J466m102Q912k601m366m614p727J477J0556M178j4087n686
6615a9920m281J1171j304o079K826O531p07j548N683j1033J895J0641j6633p996
6601c0754l139m738j5481K3206K0589o896K7323J7777k314p234j6030O224r410
$$ plain form
6698 -15838 -9694 10262 -317 -4685 2228 2423 11068 9522 1369 9117 -4320 -11747 -21883 -26813
6684 -26813 -21024 -16755 -7359 3629 21748 19171 8680 12283 11445 6351 -3666 -3676 -19067 -21188
6670 -21188 3081 16828 14893 -684 -13979 -11440 8910 5124 -20049 -36197 -35439 -35228 -38108
6657 -38108 -37458 -15940 1790 1528 -6507 -5898 -14170 -11210 10095 23126 16972 16795 11241 7906 -13146
6642 -13146 -30582 -23547 -16622 -20529 -33840 -46019 -59812 -53677 -47388 -41786 -15387 -9226 -12687
6629 -12687 -6902 -3326 -1860 -5962 2950 349 -4017 -8631 -16358 -14881 -4325 -147 -14234 -19920
6615 -19920 -24201 -13030 -14334 -20413 -17587 -11056 -11763 -13311 -7628 -18661 -16766 -6125 -22758 -30754
6601 -30754 -33893 -38631 -54112 -30906 -10317 -17213 10110 27887 25573 18339 2309 8533 -877
6588h77K085L617M667p53K5149j1803j2946J179O491J911J11r119k0714O392J5610
6573A1000l16j1605j3582J0164J4297J881Q682n519P098O868o985k1732K386Q80
6559C517j0148N362m179N918j30m495r51l647p306q111j3295r276m676K0608K18
6544c0591J1815J11J4625N1q340J0381q283n79K0038J2495n322j6007o945j3726
6530b0277j3108Q550K0615J2291k468l672o271k626j4161j5343J5771J5056L219
6517b424J1248J7676o136j0108l402K054k445J4047n543k3252j6242j3605J0460
6504b7672K4940P7n000P585K1767l243j1819m622J0480J8295j1960p877J1337
6491B2288L164q610J364k5599m36J342k941n221N119L0190L103j3375P442J1323
$$ plain form
6588 -877 1208 4825 9492 8739 33888 22085 9139 10318 16809 18720 18831 9712 -11002 -4610 11000
6573 11000 10684 -921 -14503 -4339 9958 11839 20521 15002 22100 28968 21983 251 2637 3517
6559 3517 -6631 -1269 -5448 470 340 -4155 -5106 -8753 -16059 -24170 -37465 -46741 -51417 -30809 -30591
6544 -30591 -18776 -18665 -4040 -3989 -12329 -1948 -10231 -10810 9228 21723 16401 394 -6551 -20277
6530 -20277 -33385 -24835 -4220 8071 5603 1931 -4340 -6966 -21127 -36470 -20699 -5643 -2424
6517 -2424 8824 26500 20364 10256 6854 8908 6463 20510 14967 -8285 -24527 -38132 -27672
6504 -27672 -2732 -2655 -7655 -70 21697 18454 6635 2013 12493 30788 18828 10951 22288
6491 22288 25452 16842 18206 -7393 -7829 -6487 -9428 -14649 -9530 20660 23763 10388 17830 29153
6477B9153l430l633q181l2549l985M940K015k684m654m960j29J280J484q470O12
6462c3191L787m688n336N065J748J0463L569J640J2400j7381o870K1475J3468
6449F149R571m451p640j1558l435J56j5890M782P454n292J7129J2067J1457J1228
6435C1727n364Q442j7886k1838R610J4721l727n262p97r023l463J4269j9986J0004
6421A427L7008q063K404j2626r547j4708j5719j2701p609l794J1154J7730J1301
6408c743j6408k8712j5716k37M4076N630m774j410n806j931P318K179l726J5332
6394g928J4069L511m435q811k603n210j6615J2552j922K0206J3153j5115r817
6381h965j718j3715N87K2254J177J575J6577j0997O864j1146j7037M494N648j422
$$ plain form
6477 29153 25723 22090 13909 -18640 -22625 -17685 -15670 -18354 -23008 -27968 -28097 -26817 -25333 -33803 -33191
6462 -33191 -29404 -34092 -39428 -34363 -32615 -22152 -18583 -16943 -4543 -21924 -28794 -7319 6149
6449 6149 15720 11269 3629 -7929 -11364 -11208 -27098 -22316 -14862 -20154 -3025 9042 20499 31727
6435 31727 26363 34805 16919 -4919 4691 19412 15685 10423 9626 603 -2860 11409 -8577 1427
6421 1427 38435 30372 32776 20150 10603 -4105 -19824 -32525 -40134 -43928 -32774 -15044 -3743
6408 -3743 -20151 -48863 -64579 -64816 -20740 -15110 -19884 -21294 -27100 -29031 -21713 -19534 -23260 -7928
6394 -7928 6141 9652 5217 -3594 -6197 -11407 -28022 -15470 -17392 2814 15967 852 -8965
6381 -8965 -10683 -24398 -23811 -1557 -380 1195 17772 6775 13639 2493 -14544 -10050 -4402 -5824
6367e824p209q188J4637K624M038m312m892J950j253J4590J4744K2745r993k0733
6353A2924j8038j1222n703J1400j946p31Q553K0090j0507k5121o716r885Q65n860
6339d1897K144K029K4757k287J2491J9432j532k2193p338J7703M714o435P143
$$ plain form
6367 -5824 -13033 -21221 -6584 -3960 78 -4234 -9126 -7176 -8429 6161 20905 43650 33657 12924
6353 12924 -5114 -16336 -22039 -10639 -12585 -13316 -4763 15327 4820 -20301 -27017 -36902 -36037 -41897
6339 -41897 -39753 -37724 -12967 -15254 -2763 16669 15137 -7056 -14394 3309 8023 1588 8731
$$ [...]
##END NTUPLES=NMR SPECTRUM
##END=
