##TITLE=Analysis number 316221
Compound Code cc 12305
Project Code adrs
Chemist Name fudan
##JCAMPDX= 6.0         $$ Bruker NMR JCAMP-DX V2.0
##DATA TYPE= NMR SPECTRUM
##DATA CLASS= NTUPLES
##ORIGIN= Bruker BioSpin GmbH
##OWNER= nmr
$$ XWIN-NMR		Version 3.5
$$ Thu Jan  5 13:23:34 2006 GMT Standard Time (UT+0h)  MAYBRIDGE\nmr@NMR_250MHZ
##.OBSERVE FREQUENCY= 250.131544655141
##.OBSERVE NUCLEUS= ^1H
##.ACQUISITION MODE= SIMULTANEOUS (DQD)
##.ACQUISITION SCHEME= undefined
##.AVERAGES= 16
##.DIGITISER RES= 18
##SPECTROMETER/DATA SYSTEM= dpx250
##.PULSE SEQUENCE= zg30
##.SOLVENT NAME= CDCl3
##.SHIFT REFERENCE= (INTERNAL, CDCl3, 0, 16.522)
##AUDIT TRAIL= $$ (NUMBER, WHEN, WHO, WHERE, WHAT)
$$ ##TITLE= Audit trail, XWIN-NMR		Version 3.5
$$ ##JCAMPDX= 5.01
$$ ##ORIGIN= Bruker BioSpin GmbH
$$ ##OWNER= nmr
$$ C:\u/data/dgb/nmr/ADRS/14270/pdata/1/auditp.txt
$$ ##AUDIT TRAIL=  $$ (NUMBER, WHEN, WHO, WHERE, WHAT)
(   1,<2006-01-05 13:23:12.30 +000>,<MAYBRIDGE\nmr>,<NMR_250MHZ>,
      <created by zg, POWCHK disabled, PULCHK disabled
       configuration hash MD5:
       62 19 C7 07 E1 42 D1 B7 37 6C 3D D0 77 39 F9 E6
       data hash MD5: 64K
       A2 13 F2 3D B3 E6 6E C1 2A 63 B1 38 2B DC 3E F6>)
(   2,<2006-01-05 13:23:24.70 +000>,<MAYBRIDGE\nmr>,<NMR_250MHZ>,
      <Start of raw data processing
       ef LB = 0.3 FT_mod = 6 PKNL = 1 SI = 32K 
       data hash MD5: 32K
       FB 1B 69 1B 59 9C B6 72 72 43 06 9D 7D 28 71 EC>)
(   3,<2006-01-05 13:23:26.52 +000>,<MAYBRIDGE\nmr>,<NMR_250MHZ>,
      <apk 
       data hash MD5: 32K
       91 7B 34 3F 72 9F 73 30 B2 5E B9 FE 37 12 50 0F>)
(   4,<2006-01-05 13:23:27.32 +000>,<MAYBRIDGE\nmr>,<NMR_250MHZ>,
      <abs ABSG = 5 
       data hash MD5: 32K
       83 91 1E AD D2 84 61 16 E0 C8 FC 82 C2 85 A5 FB>)
$$ ##END=
$$ 
$$ hash MD5
$$ 59 23 05 CB 84 06 1E DD 50 FD F1 CF 90 39 78 2F
##$RELAX= 
##$RELAX= 
##$RELAX= 
##$RELAX= 
##$RELAX= 
##$RELAX= 
##$RELAX= 
$$ Bruker specific parameters
$$ --------------------------
##$DU= <C:\u>
##$EXPNO= 14270
##$NAME= <ADRS>
##$PROCNO= 1
##$TYPE= <nmr>
##$USER= <dgb>
##$AMP= (0..31)
100 100 100 100 100 100 100 100 100 100 100 100 100 100 100 100 100 100 
100 100 100 100 100 100 100 100 100 100 100 100 100 100 
##$AQSEQ= 0
##$AQ_mod= 3
##$AUNM= <au_zg>
##$AUTOPOS= <46 >
##$BF1= 250.13
##$BF2= 250.13
##$BF3= 250.13
##$BF4= 250.13
##$BF5= 500.13
##$BF6= 500.13
##$BF7= 500.13
##$BF8= 500.13
##$BYTORDA= 1
##$CFDGTYP= 0
##$CFRGTYP= 5
##$CHEMSTR= <none>
##$CNST= (0..31)
1 1 145 1 1 1 1 1 1 1 1 1 1 1 1 1 1 1 1 1 1 1 1 1 1 1 1 1 1 1 1 1 
##$CPDPRG= <>
##$CPDPRG1= <>
##$CPDPRG2= <>
##$CPDPRG3= <>
##$CPDPRG4= <mlev>
##$CPDPRG5= <mlev>
##$CPDPRG6= <mlev>
##$CPDPRG7= <mlev>
##$CPDPRG8= <mlev>
##$CPDPRGB= <>
##$CPDPRGT= <>
##$D= (0..31)
0 1 0 0 0 0 0 0 0 0.06 0 0 0 0 0 0 0.0002 0 0 0 0 0 0 0 0 0 0 0 0 0 0 
0 
##$DATE= 1136467391
##$DBL= (0..7)
120 120 120 120 120 120 120 120 
##$DBP= (0..7)
150 150 150 150 150 150 150 150 
##$DBP07= 0
##$DBPNAM0= <>
##$DBPNAM1= <>
##$DBPNAM2= <>
$$ [...]
##$SUBNAM7= <"">
##$SUBNAM8= <"">
##$SUBNAM9= <"">
##$SW= 20.6930455092707
##$SWIBOX= (0..15)
0 0 3 0 0 0 0 0 0 0 0 0 0 0 0 0 
##$SW_h= 5175.983436853
##$TD= 65536
##$TD0= 1
##$TE= 294.16
##$TE2= 300
##$TE3= 300
##$TEG= 300
##$TL= (0..7)
0 120 120 120 120 120 120 120 
##$TP= (0..7)
150 150 150 150 150 150 150 150 
##$TP07= 0
##$TPNAME0= <>
##$TPNAME1= <>
##$TPNAME2= <>
##$TPNAME3= <>
##$TPNAME4= <>
##$TPNAME5= <>
##$TPNAME6= <>
##$TPNAME7= <>
##$TPOAL= (0..7)
0.5 0.5 0.5 0.5 0.5 0.5 0.5 0.5 
##$TPOFFS= (0..7)
0 0 0 0 0 0 0 0 
##$TUNHIN= 0
##$TUNHOUT= 0
##$TUNXOUT= 0
##$USERA1= <user>
##$USERA2= <user>
##$USERA3= <user>
##$USERA4= <user>
##$USERA5= <user>
##$V9= 5
##$VALIST= <valist>
##$VCLIST= <CCCCCCCCCCCCCCC>
##$VD= 0
##$VDLIST= <DDDDDDDDDDDDDDD>
##$VPLIST= <PPPPPPPPPPPPPPP>
##$VTLIST= <TTTTTTTTTTTTTTT>
##$WBST= 1024
##$WBSW= 4
##$XGAIN= (0..3)
0 0 0 0 
##$XL= 0
##$YL= 0
##$YMAX_a= 339280
##$YMIN_a= -321534
##$ZGOPTNS= <>
##$ZL1= 120
##$ZL2= 120
##$ZL3= 120
##$ZL4= 120
##$ABSF1= 16.522
##$ABSF2= -4.171173
##$ABSG= 5
##$ABSL= 3
##$ALPHA= 0
##$AQORDER= 0
##$ASSFAC= 0
##$ASSFACI= 0
##$ASSFACX= 0
##$ASSWID= 0
##$AUNMP= <proc_1d>
##$AZFE= 0.1
##$AZFW= 0.1
##$BCFW= 0
##$BC_mod= 0
##$BYTORDP= 0
##$COROFFS= 0
##$CY= 12.5
##$DATMOD= 1
##$DC= 0
##$DFILT= <>
##$DTYPP= 0
##$F1P= 14.0000005364418
##$F2P= -0.99999901652339
##$FCOR= 0.5
##$FTSIZE= 32768
##$FT_mod= 6
##$GAMMA= 0
##$GB= 0
##$INTBC= 1
##$INTSCL= 1
##$ISEN= 128
##$LB= 0.3
##$LEV0= 0
##$LPBIN= 0
##$MAXI= 10000
##$MC2= 0
##$MEAN= 0
##$ME_mod= 0
##$MI= 0
##$NCOEF= 0
##$NC_proc= -4
##$NLEV= 6
##$NOISF1= 0
##$NOISF2= 0
##$NSP= 0
##$NTH_PI= 0
##$NZP= 0
##$OFFSET= 16.522
##$PC= 1
##$PHC0= 92.01691
##$PHC1= 6.361784
##$PH_mod= 1
##$PKNL= yes
##$PPARMOD= 0
##$PSCAL= 4
##$PSIGN= 0
##$REVERSE= no
##$SF= 250.13
##$SI= 32768
##$SIGF1= 0
##$SIGF2= 0
##$SINO= 400
##$SIOLD= 32768
##$SREGLST= <1H.CDCl3>
##$SSB= 0
##$STSI= 32768
##$STSR= 0
##$SW_p= 5175.98343685301
##$SYMM= 0
##$S_DEV= 0
##$TDeff= 65536
##$TDoff= 0
##$TI= <Analysis number 999999
Compound Code 99
Book Reference 9
Project Code 9>
##$TILT= no
##$TM1= 0
##$TM2= 0
##$TOPLEV= 0
##$USERP1= <user>
##$USERP2= <user>
##$USERP3= <user>
##$USERP4= <user>
##$USERP5= <user>
##$WDW= 1
##$XDIM= 32768
##$YMAX_p= 496746081
##$YMIN_p= -401169
$$ End of Bruker specific parameters
$$ ---------------------------------
##NTUPLES= NMR SPECTRUM
##VAR_NAME=  FREQUENCY,     SPECTRUM/REAL,   SPECTRUM/IMAG
##SYMBOL=    X,             R,               I
##VAR_TYPE=  INDEPENDENT,   DEPENDENT,       DEPENDENT
##VAR_FORM=  AFFN,          ASDF,            ASDF
##VAR_DIM=   32768,         32768,           32768
##UNITS=     HZ,            ARBITRARY UNITS, ARBITRARY UNITS
##FACTOR=    0.157963299565203, 1,           1
##FIRST=     4132.6476996994, 0,             0
##LAST=      -1043.33573715361, 0,           0
##MIN=       -1043.33573715361, -401169,     0
##MAX=       4132.6476996994, 496746081,     0
$$ Real data points
##PAGE= N=1
##DATA TABLE= (X++(R..R)), XYDATA
$$ [...]
19038B038204q8481j15359j52845j79626o6189j35841p3279k8306o1439m8134
19028A088705j00996j73816J6582J34p5348p9615K5482j50508j07799k2337n8046
19017C62438O6752Q9827R313j71207l9392J440m17O955O3060Q9860M4816P9479
19005F02924K476K2909P323O6026O7357j01240j14159m5435J40075J4657j042
18994F61871O3475J58430P1902O9859j0875j0149K3959j92025k20374m3801m6554
18983E25718j757L4276r6614J2234K5901k7343l521O0077j18199J9307M5566R4489
18971E70134L7886j3021n5938j18214L6682m9858r2551K1457M7183Q7750m9452
18960D22058p6555L855M0763o8177j8213q6521j7639o826o981K3687j7073j2456
$$ plain form
19038 2038204 1949723 1834364 1681519 1501893 1435704 1299863 1226584 1198278 1136839 1088705
19028 1088705 987709 813893 830475 830609 755261 675646 701128 550620 442821 420484 362438
19017 362438 429190 519017 528330 357123 317731 319171 318754 325709 388769 478629 523445 602924
19005 602924 605400 628309 635632 701658 769015 667775 553616 508181 648256 662913 661871
18994 661871 725346 883776 955678 1025537 1014662 1004513 1028472 836447 616073 572272 525718
18983 525718 523961 558237 461623 473857 499758 472415 468894 528971 410772 430079 475645 570134
18971 570134 608020 594999 539061 420847 457529 407671 315120 336577 383760 471510 422058
18960 422058 345503 349358 390121 321944 303731 217210 199571 192745 185764 209451 192378 179922
18948A79922n6184M1763p6891j1626K3170O3082k6464O0130J80343K0491j1830
18937C85906j02519N8220L8616n2843m5772O6706P8103K8766n1575M9483J46735
18926E99826k4012j21381O6517O5608o4825L4282j14123L0992R023o9301j46970
18915B65636p4694L7808j2382R1548M7720J003q6879j40996r3190M5052p0546
18904A0080O8785J23249L215k5690K1604q4274p0031M3784R8284o995J0084N8019
18892B50114J55696M8682k8524n0785j30053q8702P3322J12580j0426p5441m1787
18881B14676l4490O7267O6828r9711l4678N7723O7621M842o8015N8545M0742L1883
18869C73233j5840j38486j93264o715J47208n580M954p8202j9471n6374L2651
$$ plain form
18948 179922 123738 165501 88610 76984 100154 163236 136772 196902 377245 397736 385906
18937 385906 283387 341607 380223 327380 281608 348314 426417 455183 403608 453091 599826
18926 599826 575814 454433 520950 586558 521733 556015 441892 472884 481907 412606 265636
18915 265636 190942 228750 216368 307916 355636 356639 269760 128764 35574 80626 10080
18904 10080 78865 202114 205329 179639 201243 116969 46938 90722 189006 182011 192095 250114
18892 250114 405810 454492 425968 375183 245130 156428 229750 342330 331904 256463 214676
18881 214676 180186 247453 314281 214570 179892 237615 305236 310078 242063 300608 341350 373233
18869 373233 357393 218907 25643 18928 166136 160556 165510 87308 67837 11463 44114
18858D4114L1602J3371q9646P1759l0032p5500J9077M0019n0202o3527O3602P9377
18846E4014m7471l0238J09083J26210K5548m6812j58893n6124L3043N3242N0299
18835A11901J8271j0820M2859P9345k8322j89510K0817K5041O5152P4797o8009
18824A41522p2612l697L4717K4157L6251L3452o0550p6471J4135J05764K4361
18813B01029q6183O2117k2657j2431J7340j9715j0322o0811K4626n4109n5688
18802a6804R8068N5417q0154p7914O3393J5250Q0011j2542J085L8562Q852m2462
18790A30762l7464j9081k9267K1823M055J4724J51162J44806k431m4322q9821
18779B44946l8990r1222K5179N7108O6733J16078K3063O2367N6146R402l5795
$$ plain form
18858 44114 75716 89087 -559 71200 41168 -34332 -15255 24764 -25438 -88965 -25363 54014
18846 54014 6543 -23695 85388 211598 237146 190334 31441 -24683 8360 61602 111901
18835 111901 130172 119352 162211 241556 213234 23724 44541 69582 134734 209531 141522
18824 141522 68910 65213 99930 124087 160338 193790 133240 56769 70904 176668 201029
18813 201029 114846 176963 154306 141875 159215 139500 129178 68367 92993 38884 -16804
18802 -16804 81264 136681 56527 -21387 42006 57256 137267 124725 125810 164372 173224 130762
18790 130762 93298 74217 44950 66773 70828 85552 236714 381520 379089 334767 244946
18779 244946 205956 114734 139913 197021 263754 379832 402895 465262 521408 530810 495015
18768D95015j9982P1033P0382Q4241j05104r9895N524r9873j76952q3365O234
18757A47258Q1718r1291j85433r1095J04373J62447m2356J5492N6486K8597K408
18746A88604N0479j6693K1411J730j4579K2008K9237q6844k2682K2282o9990n8159
18734F6804n80J37449R7231M3271O197J8632j21013j7200n4796Q1820O3175j01149
18722B19841l9686J37640M8289o8391q7603o052L2354P340P5269J52955K3110
18711D95066p6735n4147m533o4806o8267l7124N2604N9803n9931n996N3861J01563
18699C91358L8051r9614j24047P3340J68273L1479q3225q6652n8771o3330p8523
18688A08339N0211K7799k4944n4067K0098J5315n9300j6761j5521J04119K30340
$$ plain form
18768 495015 475033 546066 616448 700689 595585 495690 501214 401341 224389 141024 147258
18757 147258 228976 137685 -47748 -138843 -34470 127977 85621 101113 157599 186196 188604
18746 188604 239083 222390 243801 245531 230952 252960 282197 195353 172671 194953 124963 66804
18734 66804 66224 203673 300904 344175 350372 369004 247991 230791 175995 257815 320990 219841
18722 219841 180155 317795 366084 297693 210090 204038 236392 243732 319001 471956 495066
18711 495066 418331 364184 359651 294845 226578 189454 242058 301861 241930 235934 289795 391358
18699 391358 429409 329795 205748 279088 447361 478840 395615 308963 250192 186862 108339
18688 108339 158550 186349 161405 107338 127436 142751 83451 66690 51169 155288 385628
18677C85628j7851N586Q8869l9027o8197L516n0714n4587R9879j0068r3835N7201
18665C06400K3734Q2324J6370N3134O5534l1647K1224j5530M6849J01828N365
18654F75585j8068L4323m98N3751R0403Q5786l5748k4827k1759L348Q5927N7247
18642I85470p6382L3162Q5567K9750m8733m432N9000J65698J7270K6282j1187
18631A261465N2936J69376J74398J42073P152J00430K20846J61244K8548Q8814
18621B407282J26518Q2996J41840J93696K24067K38859J59044J80502K51993K08813
18611D215610J95312K66531L27734L04628K16830L11360L92150L08822K55425
18602F794402N15754N66254O02710O24911O09904Q07239R36715J077927J300445
$$ plain form
18677 385628 367777 373363 462232 423205 355008 358524 307810 253223 353102 343034 249199 306400
18665 306400 330134 412458 428828 481962 547496 515849 537073 521543 568392 670220 675585
18654 675585 657517 691840 691342 745093 835496 921282 885534 860707 838948 842296 928223 985470
18642 985470 909088 942250 1027817 1057567 1008834 1004402 1063402 1229100 1246370 1272652 1261465
18631 1261465 1314401 1483777 1658175 1800248 1807400 1907830 2128676 2289920 2318468 2407282
18621 2407282 2533800 2616796 2758636 2952332 3176399 3415258 3574302 3754804 4006797 4215610
18611 4215610 4410922 4677453 5005187 5309815 5526645 5838005 6230155 6538977 6794402
18602 6794402 7310156 7876410 8479120 9104031 9713935 10521174 11457889 12535816 13836261
18593A3836261J334979J516923J780705K063439K803507L301028K885528J201470
18585C0723840J60070n8894r71123j611048q12158P52610J605689J96879j431057
18576B8554808j852818k703649l937764l831719k680878j424781n54235k54198
18568A1314766j31890K647J90810L68088M92440O05008N23981O90369P19333P24331
18558A5499883Q70713R55594J072367J090889J318825J526605J828843J999317
18550B6163036K145778K552100K993247L459458M013635M849058N794045P119890
18542E9090247P074212L859603J199906P84670o67690k700582k855467o34359
18534F5150540J321790m99482l890485m545582m550654n469594n093397m013237
$$ plain form
18593 13836261 15171240 16688163 18468868 20532307 23335814 26636842 29522370 30723840
18585 30723840 30883910 30825016 29853893 28242845 27430687 28183297 29788986 29985865 28554808
18576 28554808 26701990 23998341 20060577 16228858 13547980 12123199 11568964 11314766
18568 11314766 11182876 11185523 11376333 11744421 12236861 12841869 13365850 14056219 14775552 15499883
18558 15499883 16370596 17326190 18398557 19489446 20808271 22334876 24163719 26163036
18550 26163036 28308814 30860914 33854161 37313619 41327254 46176312 51970357 59090247
18542 59090247 66164459 70024062 71223968 72008638 71340948 68640366 65784899 65150540
18534 65150540 66472330 65972848 62082363 57536781 52986127 47516533 42423136 38409899
18526C8409899m012166l481890l159509l736024m025701l240031j841872r79910
18518A3932796n88825j98062O996O7519J62273J09695K18231L39935M94880O33941
18508A5179379Q56193Q56006R67983J011434J109421J477829J629204J755153
18500B4842602J984552K346984K906107L248533L688087M368131N391646O692873
18492E5469515O786647L613689l3439j295086k931034n169667m858263k082095
18484D9500267Q56795K995294K568617n12904k487619l242000n020669o215376
18476C8442405m997637k702801r66853M7755Q01020J564516K315028K779615L413094
18467D0696142M236987N250614M783550L381456K478554L82078k234121l224481
$$ plain form
18526 38409899 34397733 30915843 27756334 24020310 19994609 16754578 14912706 13932796
18518 13932796 13343971 13145909 13152905 13220424 13382697 13492392 13710623 14050558 14545438 15179379
18508 15179379 16035572 16891578 17859561 18870995 19980416 21458245 23087449 24842602
18500 24842602 26827154 29174138 32080245 35328778 39016865 43384996 48776642 55469515
18492 55469515 62256162 65869851 65836412 64541326 61610292 56440625 51582362 49500267
18484 49500267 50357062 53352356 55920973 55408069 52920450 49678450 44657781 38442405
18476 38442405 33444768 30741967 29775114 29822869 30623889 32188405 34503433 37283048 40696142
18467 40696142 44933129 50183743 54967293 58348749 60827303 61209381 58975260 55750779
18459E5750779k935092k489420r50542J327049K313818J352095M55920j845449
18451E2979158n039448o553817o760334o660324n583636l916015k389920j343397
18443A4732267p94250m57200j21422J25758J47093J21230K82303N77220N88655
18434A5201654N87490Q64146R34275R50207J065955J197800J339794J527488J915295
18425B5584104K226606K502111K905551L462898M124009M370161L972961M000270
18417E3148671L724415K903520K578883J592622Q33258L29761r68480j762420
18409F2380230j862355j665151j369437j363329j976668k446707l489557n678049
18401D2528977o629123o209445n986108n315100l872870k457039j555680r70729
$$ plain form
18459 55750779 52815687 50326267 49375725 50702774 53016592 54368687 54824607 52979158
18451 52979158 47939710 41385893 34625559 27965235 22381599 18465584 16075664 14732267
18443 14732267 13938017 13480817 13359395 13485153 13632246 13753476 14035779 14612999 15201654
18434 15201654 15789144 16653290 17587565 18537772 19603727 20801527 22141321 23668809 25584104
18425 25584104 27810710 30312821 33218372 36681270 40805279 45175440 49148401 53148671
18417 53148671 56873086 59776606 62355489 63948111 64781369 65111130 64142650 62380230
18409 62380230 60517875 58852724 57483287 56119958 54143290 51696583 48207026 42528977
18401 42528977 35899854 29690409 23704301 18389201 14516331 12059292 10503612 9532883
18393I532883o97543n26206l48952j27182r5835O2837P0708O0157R8081J39082
18383H168030J78568L07711K88562M65644N07249N72291P59269Q70891J090903
18374A3209118J188941J368647J760239K088511K385757K101732J409706R76889
18366B6489540k92472j458103j529917j408082j058984m67856k60870m31640n43122
18357A9038494j563578k403275k569711k598400k550013k030024j221646q06396
18349C295451o02642l87992j90032k38419k48074j15819j03219o3944r8639p9415
18339A167256o3149M4285J6895q8628j3331l0806r9204q8648L7687j2449l0189
18328H39719l8926p2320K7190n3034j06072j5503j02190L0092R4993k4923l344
$$ plain form
18393 9532883 8835340 8309134 7960182 7833000 7737165 7800002 7870710 7930867 8028948 8168030
18383 8168030 8346598 8654309 8942871 9408515 9915764 10488055 11247324 12118215 13209118
18374 13209118 14398059 15766706 17526945 19615456 22001213 24102945 25512651 26489540
18366 26489540 26197068 24738965 23209048 21800966 20741982 20274126 20013256 19581616 19038494
18357 19038494 17474916 15071641 12501930 9903530 7353517 5323493 4101847 3295451
18349 3295451 2692809 2304817 2114785 1876366 1628292 1512473 1409254 1345310 1246671 1167256
18339 1167256 1104107 1148392 1165287 1076659 1063328 1032522 933318 844670 882357 869908 839719
18328 839719 800793 728473 755663 702629 596557 581054 478864 508956 603949 579026 575682
18317E75682L284N3702k6421O7408L3592n4629j05064j15769n422j6428j67391
18306B42544m8668Q8536k126j3987j8271J2389O903k7542J0347K36K9277P8484
18294C58122P9903m2123j09187q8817K897k5099O4777J4395j4907j5227J8495
18283B43229o2588j07866l5775q147l295K7422M6262k9023p0914Q0306J73100
18272B52711J9738l2264j10559L9944N8507q204Q4556K4908r074r902j5423n2558
18260B42380q3657j5611K10098l4746k6555R0440m7886j78167j11575j8254L0600
18249E7067N5564L7393k6227m8100k6512J16182J8692o9319K0360L5533o7648
18238A02985K6003n0976K8468J23369M399j25733Q4884O6709P534k0276N1481
$$ plain form
18317 575682 578966 632668 606247 673655 707247 652618 547554 431785 426363 409935 242544
18306 242544 193876 282412 280286 266299 248028 260417 267320 239778 250125 250361 279638 358122
18294 358122 438025 395902 286715 197898 200795 175696 240473 254868 239961 224734 243229
18283 243229 180641 72775 37000 28853 25558 52980 99242 70219 -695 79611 252711
18272 252711 272449 240185 129626 169570 228077 219873 304429 329337 320263 310361 294938 242380
18260 242380 158723 143112 353210 318464 291909 382349 334463 156296 44721 26467 57067
18249 57067 112631 150024 123797 75697 49185 165367 184059 114740 135100 170633 102985
18238 102985 128988 78012 106480 229849 234248 108515 193399 260108 267642 247366 298847
18227B98847J06422j1381J6527k3808m6417j06601N2766j770K0547M1209j48157
18216A98184p0927m2470K0525O5933P8329q9685l2221j430O4826P4689J28726
18205C94479o5228l3418K1644l1543K8235N9499M9289N9277l1927p7951J22740
18194D95096K2824j61547n8187J3909l3372L260Q5678m9663J7401R4873J20940
18183E51212p1820K410l0522m9757L3895J0327R9898M0212o2862N1720R9695J22301
18171G96709J38197j4106k0963p6282N737P9295P4665J02931R4994N566Q4324
18160A271067J05751J18065J07794K5024J20368k3016P242J65775J68660K08837
18150B275567J80497J98232P3751J16741K1299R5607K39478K94799J29807J94552
$$ plain form
18227 298847 405269 393888 410415 386607 340190 233589 286355 284585 305132 346341 198184
18216 198184 127257 84787 105312 171245 249574 159889 127668 126238 191064 265753 394479
18205 394479 329251 295833 317477 285934 314169 373668 422957 482234 450307 372356 495096
18194 495096 517920 356373 298186 312095 278723 281983 367661 317998 335399 430272 551212
18183 551212 479392 481802 451280 401523 435418 445745 545643 585855 522993 574713 674408 796709
18171 796709 934906 920800 899837 823555 829292 908587 983252 1086183 1181177 1186743 1271067
18160 1271067 1376818 1494883 1602677 1627701 1748069 1725053 1732295 1898070 2066730 2275567
18150 2275567 2456064 2654296 2728047 2844788 2866087 2961694 3201172 3495971 3625778 3820330
18140C820330K27338J95081K93218L51566L59301L64704L74846N16989N44162
18131G047535M79955N66805N47020P56646Q16929P67283Q54566Q65946J124677
18122A3827362J191199J382453J765110J973146K190229K460211K930813L649451
18114C1369974M688946N713419O534626P655700R844142J2950213J3466275K929429
18106I5152724n957462o041732j0396995j9116976j8922391j2133641p031079
18099A5552448m038908k498253j721195j357529r36614p28047o62158m10716k92224
18090B906804l28736k75283j83074l50981j09496j37096j65347M0511m933L662
18080A396031o8794r0828p4738j5409m7260l4514M3821q3859j22300L467N0789
$$ plain form
18140 3820330 4047668 4242749 4535967 4887533 5246834 5611538 5986384 6503373 7047535
18131 7047535 7527490 8094295 8641315 9397961 10214890 10982173 11836739 12702685 13827362
18122 13827362 15018561 16401014 18166124 20139270 22329499 24789710 27720523 31369974
18114 31369974 36058920 41772339 48306965 55962665 65806807 78757020 92223295 95152724
18106 95152724 89195262 83153530 72756535 53639559 34717168 22583527 15552448
18099 15552448 11513540 9015287 7294092 5936563 4999949 4271902 3609744 3199028 2906804
18090 2906804 2578068 2302785 2119711 1768730 1659234 1522138 1356791 1397302 1392369 1396031
18080 1396031 1327237 1236409 1161671 1146262 1099002 1064488 1108309 1024450 902150 905617 956406
18069I56406m1643K4172L8789P679N8o350K872j6236j29591n1655n6725q2667
18057F45109k3780N3494l409p1726m2196l6577j02605j03767J1150K132n8626
18046B69199L4357M561K9579j9249r314o3423j24407q1564P0417Q7672P7483j665
18034B73646M4632P2141l9742L0438L6638m2015l6986M3199k101K0753J05820
18023E06423K3917m0109o214M0733N5823O268M2714M3468K1220K6980j34305j30013
18011D56905P6760J09363m7494q5236l0821p2946J3549J18780j0023l4356k1629
18000D72852M112P0801J04295j1259m3831q5309J36631M8758p6096J899j1067
17989F11786J5208N320l8763n2652L3414J7858l6673q7401l0298n8129L6345J34063
$$ plain form
18069 956406 914763 938935 977724 985403 985461 979111 981983 965747 836156 784501 727776 645109
18057 645109 621329 674823 671414 599688 557492 520915 418310 314543 325693 327825 269199
18046 269199 303556 308117 337696 318447 309133 245710 121303 39739 110156 197828 275311 273646
18034 273646 318278 390419 350677 381115 417753 375738 338752 381951 379850 400603 506423
18023 506423 530340 490231 484017 524750 580573 586841 629555 673023 694243 721223 586918 456905
18011 456905 533665 643028 595534 510298 479477 406531 420080 538860 528837 494481 472852
18000 472852 476964 547765 652060 640801 596970 511661 648292 697050 620954 622853 611786
17989 611786 626994 632314 593551 540899 574313 592171 555498 468097 437799 379670 416015 550078
17977E50078J5600R267l8589m3854j24070j9337J20373J33291r1370j27446N2972
17966D36915K1877M9498m623J4588j1190l9825o9449p4922R1066L3876J21058
17955E68869M3207p1470P1030N2894L9862n5960J3119r8205j03859m2617k0456
17944C96414O474j1008N2563J7721l4296n6280j4836O9809j44765r7165L0168
17933B14799o2760l2744l3502l4332o011j4822m4125r214k4172m4139J59470J42400
17921B10848J3316J05302m2871J0898m349K7632J5058j08454J9075J01570M3942
17910C91967l7991P6981L7191j4125N7417j4374n7322j08527k4571K928j3141
17899B96433k2198L6570j6295L1706j0460J1845M82p4670l9980j2902N4949j27740
$$ plain form
17977 550078 565678 574945 536356 492502 368432 349095 469468 602759 511389 383943 436915
17966 436915 458792 508290 503667 518255 507065 467240 397791 322869 413935 447811 568869
17955 568869 612076 540606 611636 664530 704392 648432 661551 563346 459487 416870 396414
17944 396414 402888 391880 444443 462164 427868 371588 356752 426561 281796 184631 214799
17933 214799 152039 119295 85793 51461 45450 30628 -13497 -22711 -46883 -91022 68448 210848
17921 210848 224164 329466 286595 297493 293144 320776 335834 227380 246455 348025 391967
17910 391967 353976 430957 468148 454023 511440 497066 439744 331217 306646 309574 296433
17899 296433 274235 310805 294510 326216 315756 327601 328083 253413 213433 200531 255480 127740
17887A27740l0797Q0190J5069j3380J9876J0967p3301j17569J29070l2685l4951
17876H0229L3243j9067m504O7737p3478j6486m2074Q1806P524j5958M4373M0039
17864A83384P572M0519m3458L7888P5227n0038j03862K2945o3326O3314R8737
17853B68902n7425j8018k0406l5902k3756q443J5908n983N8412k2560j1112m8931
17841I0686r6037R1457j9812j07479J393M406J38311M4975j3776o0186K4151q663
17829H9426k7605L9046L410M2637p0835k8378l48J5609p166Q4242N0824M2406
17817B33268M996J31j14786q7933k6127R9719l2552m2499k5815o4247m0703q968
17805a05516J19668l608l9724O8929M280N595n2338j1372P9765n688p807k0793
$$ plain form
17887 127740 96943 177133 192202 178822 198698 209665 136364 18795 147865 115180 80229
17876 80229 113472 94405 89901 157638 84160 67674 25600 107406 114930 98972 143345 183384
17864 183384 190956 231475 188017 225905 301132 251094 147232 170177 106851 170165 268902
17853 268902 211477 193459 173053 137151 113395 104952 120860 114877 173289 150729 139617 90686
17841 90686 -5351 86106 66294 -41185 -39792 -35386 102925 147900 134124 73938 98089 89426
17829 89426 61821 100867 104277 146914 76079 47701 47353 62962 55796 140038 190862 233268
17817 233268 238264 238395 123609 35676 9549 109268 76716 34217 8402 -55845 -96548 -105516
17805 -105516 14152 10544 -29180 39749 44029 49624 -2714 -14086 65679 59991 52184 31391
17793C1391n5992r986k1518n0587l9602r447O6097O6094j12381l1101J31846J06117
17781G0931j02336j1748L0983j7925P4249M5526j1728l8432P28j06370p9418R1569
17769e3971Q1500J6780j0866K3080K7278J15442K8434p9260r8708k0298o4933
17758c5522O818N8525O7799m1100m7125J0101o3918R207P6567K00200p1931j40375
17746B9246K2545n673k026k8096j0198m6874l2184J07561P8030J7512k856q227
17734A18760n5925j19877m7220L5122O51n0568o8129Q1757J66855O211j52605
17723h4968j9208R5176L4846l4832m2332m4195J1953J61509N3725n1960q8459
17712h745L9482p861K3523J2432K6815M1935n6033L695P2811P420p4694j21847
$$ plain form
17793 31391 -24601 -34587 -56105 -106692 -146294 -155741 -89644 -23550 -135931 -167032 -35186 70931
17781 70931 -31405 -43153 -12170 -30095 44154 89680 77952 39520 40248 -66122 -145540 -53971
17769 -53971 27529 44309 33443 56523 83801 199243 227677 148417 49709 29411 -35522
17758 -35522 -28704 29821 97620 56520 9395 19496 -44422 -35215 41352 241552 169621 29246
17746 29246 51791 46118 44092 15996 5798 -41076 -73260 34301 112331 129843 126987 118760
17734 118760 62835 -57042 -104262 -69140 -68489 -119057 -187186 -105429 61426 67637 -84968
17723 -84968 -104176 -9000 25846 -8986 -51318 -95513 -83560 77949 131674 79714 -8745
17712 -8745 30737 22876 46399 58831 85646 127581 71548 75243 148054 155474 80780 -41067
17700d1067L8204P5446j38952k3119n1535n0899J04425O2087Q6970J05242k0664
17689A46138r0595n996j6428l6442k2262j4780J06436L7405k5930J4176o149M2578
17677A28151o5349p700q7671m3691k7394l4205N0710J23210J71942J6223p0265
17666A53961o2260j14943p7743O7060M6576k4069l3009j1902j3129K6332p8637
17655a21763j32579P4428Q2931N8461n882j2823j37042o2711K3739l0063k165
17644b65469N9269k9791j4196K2525J5149k8274M755J50303J56170K2971p2074
17633B1338l2621K5910K381O735j1875M9425r4098r3323Q6699l2621q7186Q439
17621a50797J35578k1145k6079L6069L4027l4437O1328J00375q2002J3108L5680
$$ plain form
17700 -41067 -2863 72583 -66369 -89488 -141023 -191922 -87497 -25410 61560 166802 146138
17689 146138 55543 49547 33119 -3323 -25585 -40365 66071 103476 77546 91722 85573 128151
17677 128151 62802 55102 -32569 -76260 -103654 -137859 -87149 36061 208003 224226 153961
17666 153961 91701 -23242 -100985 -33925 12651 -11418 -44427 -56329 -69458 -43126 -121763
17655 -121763 -254342 -179914 -96983 -38522 -44404 -57227 -194269 -256980 -233241 -263304 -265469
17644 -265469 -206200 -235991 -250187 -227662 -212513 -240787 -236032 -85729 70441 93412 21338
17633 21338 -11283 14627 17008 23743 11868 61293 -32805 -126128 -39429 -72050 -159236 -150797
17621 -150797 -15219 -36364 -62443 -26374 7653 -26784 34544 134919 52917 66025 101705
17610A01705J0392l7723l0817o2067J40147n1798J6180l9281L2273N1396k1270
17599A09137K6685j21091q4132j8328l4358K1713J9150Q6147K2848Q4591q3350
17588B9012m9235o0006n0328M3993J44276N5818k6227o6014p902j3258K9425P2169
17576A01723j2347p3129j4668J551m5168k7237n3188R8488J40560m7021r7317
17565b7753l3144p738j30743n7600J06764J22247L3479m6233j19833n7357j01
17554b18012J5301l4408k8004R2814J62853P5817p476n5920o6331Q816M9914J8010
17542A3374j5433q4893r1040K5634J18586l9110R181j25687J330J6792m9967l1821
17530b53054O3166O9140o1816n7681l6724M0653J61325L8573L7304j19399K2922
$$ plain form
17610 101705 112097 74374 43557 -18510 121637 69839 86019 46738 79011 130407 109137
17599 109137 135822 14731 -69401 -87729 -122087 -100374 -81224 4923 27771 112362 29012
17588 29012 -20223 -80229 -130557 -86564 57712 113530 87303 21289 13387 129 29554 101723
17576 101723 89376 16247 1579 3130 -42038 -69275 -122463 -23975 116585 69564 -27753
17565 -27753 -60897 -68635 -199378 -256978 -150214 -27967 5512 -40721 -160554 -217911 -218012
17554 -218012 -202711 -237119 -265123 -172309 -9456 66361 58885 2965 -63366 -54550 -4636 13374
17542 13374 -2059 -86952 -177992 -152358 -33772 -72882 -63701 -189388 -188058 -171266 -221233 -253054
17530 -253054 -189888 -120748 -182564 -240245 -276969 -236316 -74991 -36418 886 -118513 -95591
17519i5591l036k5598M9843J66877Q6898j73120m5513M3023j3334r253o465J11813
17507H6544l3772o6497L4037R9316j1424k0143l9195R0047j8829n1526N0173j08450
17495A0281p4044Q397l3237n5531q0729P3003J22031j6244q1398o723M2480l152
17483i4866P9254P5933m4017K0569L617M2409P6696l3999n1584l5873l6021k0205
17471a8087M5904L8630R013N5440N6645j68719j08803P5988M5153j6079J41779
17460A56864J755j51907M4243M2092J18090k3414j2718l4263J8542L0370L4210
17449B23864J33757M2913O6176n631j7247J54456J28531o4664q2550j6903j04544
17438D58158j18083j09140j59567o6893l3835J5447J23429p8648l862J53586N8298
$$ plain form
17519 -95591 -98627 -124225 -74382 92495 179393 6273 -39240 3783 -9551 -18804 -25269 86544
17507 86544 52772 -13725 20312 119628 108204 88061 48866 138913 120084 68558 118731 10281
17495 10281 -63763 -55366 -88603 -144134 -224863 -151860 -29829 -46073 -127471 -134194 -91714 -94866
17483 -94866 -15612 60321 16304 36873 40490 82899 159595 125596 74012 38139 2118 -18087
17471 -18087 27817 66447 75460 130900 187545 18826 -89977 -13989 31164 15085 156864
17460 156864 158619 6712 50955 93047 211137 187723 175005 140742 159284 189654 223864
17449 223864 357621 400534 466710 461079 443832 598288 726819 662155 579605 562702 458158
17438 458158 340075 230935 71368 4475 -29360 -13913 109516 30868 27006 180592 238890
17427B38890n4370j05455j24371l247p2892o5621l9598l0791M1302J29511J8183
17416f8459j4545j16545N027J21216N0445M5457o0179o9482q936k5635M1249K9965
17404g0422o931Q4089L7682J1470o9858l0676k0599L6635O3819O9829q1639r9359
17392g5960P4088J4055O7354j6434j271j8857R1440K8111j38600n7564n3010j03037
17380a89685N6044P5539K6881N7688L0164j629p064P775r2603p5065n1583q2537
17368b46075P9081O3575P7584P1109N1682k1286K9642j57803n0542K418K3344
17357g7271J6450l7865l5181k0450q488j69008L2900J31607M8558K5817K8835
17346f4096o283J9481L3345M2364K5308m4472j22283n1063j0124O6949k4912k5822
$$ plain form
17427 238890 184520 79065 -45306 -48553 -121445 -187066 -226664 -257455 -216153 -86642 -68459
17416 -68459 -83004 -199549 -194522 -73306 -22861 22596 -37583 -107065 -116001 -141636 -100387 -70422
17404 -70422 -77353 6736 44418 55888 -13970 -44646 -65245 -28610 35209 105038 23399 -75960
17392 -75960 -1872 12183 79537 63103 61832 42975 134415 162526 23926 -33638 -86648 -189685
17380 -189685 -133641 -58102 -31221 26467 56631 55002 47938 55713 -36890 -111955 -163538 -246075
17368 -246075 -166994 -103419 -25835 45274 96956 75670 105312 -52491 -103033 -100615 -77271
17357 -77271 -60821 -98686 -133867 -154317 -162805 -331813 -298913 -167306 -118748 -92931 -64096
17346 -64096 -70379 -50898 -17553 24811 50119 5647 -116636 -167699 -177823 -110874 -135786 -161608
17334a61608n518K7054O9923J0995L8510N620j8251Q122j02617M9713K1784q2892
17322a39165R725J03097R8992p5168m1708n774Q700Q4601R7149l2910m8699j17043
17310e8203j24028p3066K6953O4404N8738P7204Q7296P444p74m7624K372l6267
17298a5551M1878j5242M5678L545r6683o7401k9296N4396O9943Q374q6926m8781
17286a36066K709J1635m081k4955o4031R1312N3336N1133k8349M7440q005J6538
17274H616n8713j4036L1564N129P1188M5594n590j5647n9089K149O3493J1050
17262H5708m5429j46476n232j7551J19530J16773p629j47151m8323K3716M3411
17251b8653J00228j7928p2607l7243j1468k3442j475N2343L1146J2646J50610
$$ plain form
17334 -161608 -167126 -140072 -70149 -59154 -20644 -15024 -33275 -25153 -127770 -78057 -56273 -139165
17322 -139165 -129440 -26343 72649 -2519 -44227 -50001 -41301 43300 140449 107539 58840 -58203
17310 -58203 -182231 -255297 -228344 -163940 -105202 -27998 59298 66742 65968 18344 20716 -15551
17298 -15551 26327 11085 56763 60308 -36375 -103776 -133072 -78676 -8733 -359 -87285 -136066
17286 -136066 -133357 -121722 -125803 -150758 -214789 -123477 -70141 -19008 -47357 83 -7922 8616
17274 8616 -50097 -64133 -32569 -27440 43748 89342 83752 68105 9016 11165 74658 85708
17262 85708 40279 -106197 -111429 -128980 -9450 107323 99694 -47457 -95780 -72064 -28653
17251 -28653 71575 53647 -18960 -56203 -67671 -91113 -92588 -40245 -9099 3547 154157
17240A54157P8797p0673p6152o5532l9347j08462M3882O3225K409J13353m8274
17229D7383r1061r7330M135O0836P9338j4892J0921L8474p8088n5156L6370J38441
17217G9371R5758j20300j15868J6118J45385j09250j02680M4505p464o575Q584
17206g2416l3276o6371q4169o7189n186P1673R1270J59044o5509J0777o6772L0660
17194i7464L2121m4947j31671M7491O7965N0935j4951P5802Q1743j04958k3412
17183f1346l5437n3545O7886O4957l6785m2922Q4799J8145m3893K1581j18481
17172a35041p4205N610l1408M6480J24086J940j02655J3170N8402N2797R8976
17161E8152m0870m9238p9852m3864K138R1264j0913N4478r6445q6281J17720R1020
$$ plain form
17240 154157 232954 162281 86129 20597 -18750 -127212 -83330 -20105 -17696 95657 47383
17229 47383 -43678 -141008 -136873 -76037 3301 -11591 -670 37804 -40284 -95440 -59070 79371
17217 79371 175129 54829 -61039 -44921 100464 -8786 -111466 -66961 -74425 -81000 -72416
17206 -72416 -105692 -172063 -256232 -323421 -328607 -256934 -165664 -6620 -72129 -61352 -128124 -97464
17194 -97464 -65343 -110290 -241961 -194470 -126505 -75570 -90521 -14719 67024 -37934 -61346
17183 -61346 -96783 -150328 -82442 -17485 -54270 -97192 -12393 5752 -38141 -16560 -135041
17172 -135041 -209246 -203636 -235044 -188564 -64478 -62538 -165193 -152023 -93621 -40824 58152
17161 58152 17282 -31956 -111808 -155672 -153534 -62270 -73183 -18705 -115150 -201431 -83711 7309
17149G309k0562n2049j4013j7838J17161n8097n0755O1435m4305o1307j9775R5580
17137e7216l619p9156J4089P0436N9173K9155j7364p5430j4230L3876L7778l7667
17125d0175k4968o1863O7081p092n9143L9686M3063K0798L4341k6377q463l8476
17113f1588J6260J742n263k0090L6255J05583P6271O1822j18423m1138o7488j6803
17101c2860K8445M9932l7163j34288K5870K1733q581K6028O4610O5280R2416J8772
17089A80194j13530K8115q0072k485J14764K8015o0361j14449o6909M7211k6706
17078f6213L9012L3460j5805R4044Q0078l8899P1787o6681m4149J6647j8495o6280
17066A8506m1040P671n2684R1825j711o858k0827o1393Q2886k5859k1744J943
$$ plain form
17149 7309 -13253 -65302 -79315 -97153 20008 -38089 -88844 -27409 -71714 -133021 -152796 -57216
17137 -57216 -60835 -139991 -125902 -55466 3707 32862 15498 -59932 -74162 -40286 -2508 -40175
17125 -40175 -65143 -127006 -59925 -67017 -126160 -86474 -43411 -22613 11728 -14649 -23112 -61588
17113 -61588 -45328 -43586 -48849 -68939 -32684 72899 149170 210992 92569 51431 -16057 -32860
17101 -32860 -4415 45517 8354 -125934 -100064 -78331 -86912 -60884 3726 69006 161422 180194
17089 180194 66664 94779 14707 12222 126986 155001 94640 -19809 -86718 -39507 -66213
17078 -66213 -27201 6259 -9546 84498 164576 125677 197464 130783 86634 103281 84786 18506
17066 18506 -22534 -14863 -67547 24278 22567 15709 -5118 -66511 16375 -9484 -31228 -29285
17054b9285q1858J8299R541j5704K1134P8563R076j1368L0984L1759o394o1759
17042g012j17248k3240P090J2158K5388N5290K3354l1842k0483J758O8203k9096
17030c5680p5461L6916R471J9621P3861j13984l0310r177q0695J9079M0886M5701
17018i9772J11923l7071n5876n624l6033j065K9227n4474M9901J6523N4702K7616
17006b3J573m047J5648L4160O1066N8642J178p3361o0459r0010n031O2580K0651
16993B2567N2085p2892m2260R0659R2872j269q3691n8127P0437J16803J14615
16982C01799j40103p1595j6916M5730q990o7279R4015q7711o9740R2274j4161
16971E7323M5867j26798r3024K2386j3764r555j3645l9958M3737J14357M4866
$$ plain form
17054 -29285 -111143 -92844 -83303 -99007 -77873 690 9766 -1602 29382 61141 54747 -7012
17042 -7012 -124260 -147500 -140410 -128252 -102864 -47574 -24220 -56062 -76545 -74787 -6584 -35680
17030 -35680 -111141 -74225 -64754 -45133 28728 -85256 -115566 -124743 -205438 -186359 -145473 -99772
17018 -99772 12151 -24920 -80796 -86420 -122453 -123518 -94291 -148765 -98864 -82341 -27639 -23
17006 -23 1550 -2497 13151 47311 108377 167019 168197 94836 34377 -55633 -60664 1916 22567
16993 22567 74652 1760 -40500 50159 143031 141762 58071 -56 70381 187184 301799
16982 301799 161696 90101 73185 118915 109925 42646 136661 48950 -20790 71484 57323
16971 57323 103190 -23608 -116632 -94246 -108010 -117565 -131210 -171168 -127431 -13074 31792
16960C1792n8165K1500J7762p287J7036J6764n4843O308M4923j06293o971j2641
16948i0115j11551J708J6502J99348o9154r9224J16068l3666o9406J9396O5879
16937e4215L4808m97n5916n6711K2372k6580j9550M2008R1957N7219o8891q4961
16925a18957r0841L4674J83659J51470l2523j0070j25754j22035p044M6906k578
16914i3093n0129M9763O9906M2675p3241k2876O2186O0114P1176N7420N302j20284
16902E8919J3851M4664k89k8796o0997q5466m9146M9859O1172M5828R055J377
16890F0031m9990j58651k4245M414J7904k5607P3841Q2019r3253m5136J05811
16879e2862J60464R1028k1923j48354j52252J23851J24995J9219l9369o8746o7975
$$ plain form
16960 31792 -26373 -4873 12889 5602 22638 39402 -15441 -9133 35790 -70503 -77474 -90115
16948 -90115 -201666 -199958 -183456 15892 -53262 -152486 -36418 -70084 -139490 -120094 -54215
16937 -54215 -19407 -19904 -75820 -132531 -110159 -136739 -156289 -114281 -22324 34895 -33996 -118957
16925 -118957 -209798 -175124 8535 160005 127482 117412 -8342 -130377 -137421 -90515 -93093
16914 -93093 -143222 -93459 -23553 19122 -54119 -76995 -14809 45305 116481 173901 179203 58919
16902 58919 72770 117434 117145 88349 27352 -58114 -107260 -57401 3771 49599 58654 60031
16890 60031 10041 -148610 -172855 -168441 -150537 -176144 -102303 -20284 -113537 -158673 -52862
16879 -52862 107602 198630 176707 28353 -123899 -48 124947 144166 104797 36051 -31924
16868c1924j2613J2951J2688n352q641L2094M4835L5668O0968j0299q3148q6060
16856c8833p0315p4363K167J31374J22332k454j05616K6990O0912N1656j33409
16845b9559K982N074j11041o2314P2104O1287q615L7871J22957J2915q096J3021
16833A08586o9797J4880j0005j0634l0044l1193k4419N8355k8311L1533j2143
16822c192K0649K4571K2271k5221p4724M8778L0204K1782L4064n6679n3459N7208
16810D6252J1125m4993Q0144j3248p6613m3036j5462n4890n5256m3511N0389J75232
16798A6133J17749k8904J759K9790O359n8781j12478j4236j2666L1540j5526M72
16786c8789R1772l8890J8149K0723m9509j36270j06646P495n2444k2042O3906
$$ plain form
16868 -31924 -44537 -31586 -18898 -24250 -32891 -797 44038 79706 140674 130375 47227 -38833
16856 -38833 -109148 -183511 -181344 -49970 72362 69908 -35708 -8718 52194 103850 -29559
16845 -29559 -26577 -21503 -132544 -194858 -122754 -61467 -70082 -32211 90746 103661 95565 108586
16833 108586 38789 53669 43664 33030 2986 -28207 -52626 5729 -22582 8951 -3192
16822 -3192 17457 42028 64299 39078 -35646 13132 43336 65118 99182 42503 -10956 46252
16810 46252 57377 12384 92528 79280 2667 -40369 -55831 -110721 -165977 -209488 -159099 16133
16798 16133 133882 104978 106737 136527 142886 84105 -28373 -42609 -55275 -23735 -39261 -38789
16786 -38789 52983 14093 32242 52965 3456 -132814 -239460 -231965 -284409 -306451 -242545
16775b42545Q5170J42635l6525k5692L878N4123L8319j64220r9474j7101K6983
16764b34449J49182J04324K1967k1470j15550K7458J4044L550q0952j7413M5188
16753a04121M4123K5929j00803O1877M1442M1382Q6978K9852l6560k6182M196
16742F8113J0719k1559l4704N3499L7708l8427O9980J4179n5575M930n7378k7155
16730B4330J4507o4710p5180j3745Q6596L8049M601q8617j20663N365M6452K11560
16718F8545l4220o5637N957l9154j8750L846K6243J16429k7510o6013j14822N456
16706a39630J17286N46J6929j8172j06946J3782J11152J6282n6771R5291L8604
16695H8353J611p2222P3678l0561o9668j8338J0166q3112n7166p8694J8932J56608
$$ plain form
16775 -242545 -157375 -14740 -51265 -76957 -73079 -18956 19363 -144857 -244331 -261432 -234449
16764 -234449 -85267 19057 41024 19554 -95996 -68538 -54494 -50944 -131896 -149309 -104121
16753 -104121 -59998 -34069 -134872 -72995 -31553 9829 96807 126659 90099 63917 68113
16742 68113 78832 57273 22569 76068 113776 75349 145329 159508 103933 108863 51485 24330
16730 24330 38837 -25873 -101053 -114798 -28202 9847 14448 -74169 -194832 -189467 -143015 68545
16718 68545 34325 -31312 -25355 -64509 -83259 -79413 -53170 63259 35749 -30264 -145086 -139630
16706 -139630 -22344 -21798 -4869 -23041 -129987 -116205 -5053 11229 -45542 49749 88353
16695 88353 89964 17742 91420 60859 -8809 -27147 -16981 -100093 -157259 -235953 -217021 -60413
16683f0413m519l1006N2081O4180J38867M1187o1736k5306m8298n7661r242J5039
16671A3173J2238m4421k8775n3270n751J3841P3747k4035N5776J6418J00387O1082
16659A90410j33123o7924P315L768J1359k8275n4539R7932M0630j64117m5302
16648a41866Q986j6624l8104m552P3027M3835o2807J07884k2098n5929p0792m994
16636a84034j0496P4107N3728R6046J07219k3124j92982l0522M1455J00488k0112
16625A1773L3603P7168O871n4769m866m7711r510Q286L087j39170j2267M7595
16613g9910Q7196o3710j06551R310k3863J5368O1111j6212l5366N3831l5422o1361
16601a95579l8366l1O4952p1189L0836n7009L0306O6827J01030N3164O3496l0101
$$ plain form
16683 -60413 -64932 -95938 -43857 20323 159190 200377 138641 113335 65037 7376 -1866 13173
16671 13173 25411 -19010 -47785 -101055 -106806 -92965 -19218 -43253 12523 28941 129328 190410
16659 190410 57287 -10637 -3322 446 11805 -16470 -71009 26923 67553 -96564 -141866
16648 -141866 -132880 -149504 -187608 -192160 -119133 -75298 -138105 -30221 -52319 -108248 -179040 -184034
16636 -184034 -194530 -120423 -66695 29351 136570 113446 -79536 -110058 -68603 31885 11773
16625 11773 45376 122544 129415 74646 69780 22069 12559 20845 23932 -115238 -127505 -79910
16613 -79910 7286 -56424 -162975 -153665 -177528 -162160 -101049 -117261 -152627 -98796 -134218 -195579
16601 -195579 -233945 -233976 -169024 -240213 -209377 -266386 -236080 -169253 -68223 -15059 48437 18336
16589A8336j01029R651L7792k7753l337j13331l1432j122l3282J06929N4559r5121
16577a79140N7649m5020J8540j5878J3721O5812K7748J2226j22108n6657L8154
16566a84953J3129R885l273J11566J10809n0503j94796l4547J40138J31368Q4907
16555A33730r211O7350j12515j21451J5008o2861M8535O9617O802l5441p5292
16544g5729j46973L521Q5250R8846R5774P6613Q659j708m797O694r4966m5646
16532E538N344P2341N8535r8159j88251P768R3219N6688O0696p0795k6943J8964
16520e055l1782M1591J2340K1393K0989l4922M6543j3220j46244l8814K7445L9909
16508e9827p0806j3393J9865N4112M0470J7903o5177m2731l5668P4953Q0090q0262
$$ plain form
16589 18336 -82693 -73042 -35250 -63003 -66340 -179671 -211103 -212225 -245507 -138578 -84019 -179140
16577 -179140 -121491 -166511 -147971 -163849 -150128 -84316 -56568 -44342 -166450 -223107 -184953
16566 -184953 -171824 -161939 -165212 -53646 57163 6660 -188136 -222683 -82545 48823 133730
16555 133730 124519 191869 79354 -42097 -27089 -89950 -41415 28202 35004 -437 -75729
16544 -75729 -222702 -219181 -133931 -35085 60689 137302 145961 144253 139456 146150 51184 5538
16532 5538 10882 83223 141758 43599 -144652 -136884 -43665 13023 73719 2924 -24019 -5055
16520 -5055 -36837 4754 17094 38487 59476 24554 71097 57877 -88367 -127181 -99736 -59827
16508 -59827 -130633 -144026 -124161 -70049 -29579 -11676 -76853 -119584 -155252 -80299 -209 -80471
16496h0471J5729p0832M5538J60210j2165M2727k2616l9948R9462O8922q3061
16485A23495K0695J0810M0237l9728p4771L1369L2839O0985j1521j9245p9541
16474I5624p0460P0083K035l5299k0663P4970K4844j11700R7006N8367j06937
16463G7870n4243N9824j7925O41o4113N3017j3532p8821m8521o9385J3723m8762
16451a90227N4692J23766J15030N4086p5365r3236J19705l7641m4262o6070k1394
16440f0916N1481J5827l554o5888n9129l689m2471j7633J9994K8890J16857J38464
16428A18233j7862q6974j35155P615J5402Q361p6395J16624O5158j6850Q4853
16417H3010M0973K2073j14104R586J0299o475j01948j28046k9365r064R6721k5586
$$ plain form
16496 -80471 -64742 -135574 -90036 70174 58009 100736 78120 38172 137634 206556 123495
16485 123495 144190 155000 195237 155509 80738 112107 144946 205931 194410 175165 95624
16474 95624 25164 95247 97282 61983 41320 116290 141134 29434 126440 184807 77870
16463 77870 23627 83451 65526 66167 2054 55071 41539 -37282 -85803 -155188 -141465 -190227
16451 -190227 -135535 -11769 103261 157347 81982 -11254 108451 70810 26548 -39522 -60916
16440 -60916 -9435 6392 2838 -63050 -122179 -125868 -168339 -185972 -165978 -137088 -20231 118233
16428 118233 100371 13397 -121758 -114143 -98741 -90380 -166775 -50151 15007 -1843 83010
16417 83010 123983 146056 31952 41538 51837 45362 -56586 -184632 -213997 -223061 -126340 -151926
16405a51926j8410J3578J25145O7824o983o5079K5915k759L4289p8550j07914
16394a64870K6592Q5858J18905P902q3780o4558j21818K7616Q7780R5182j3366
16383A443O2275O5033J4201k9659k7892J2464r845L5653O3491r0612p5167M5651
16371F7036l8275L4571j6906l6015q001K7160l899K4524n3045o4065o1121M1010
16359h7026l867P6947J7101r8168p4138L7950J36090L0264l7911K165Q7282k2828
16347F3861r5280m0249l4219j6948J0609j200o438J4473K6456J27564K9468q1174
16335c077p8884k2479p050L9906l623J6333j08718J5278O1143N4964L3105P0050
16323F6948m4087N0930K8558N665R447K1888m7616o6213n0695J4616M3781P239
$$ plain form
16405 -151926 -170336 -156758 -31613 36211 29228 -35851 -9936 -12695 21594 -56956 -164870
16394 -164870 -138278 -52420 66485 74387 -9393 -73951 -195769 -168153 -80373 14809 1443
16383 1443 63718 128751 142952 113293 85401 97865 88020 123673 187164 96552 21385 67036
16371 67036 28761 63332 46426 10411 2410 29570 25671 50195 -2850 -66915 -128036 -87026
16359 -87026 -90893 -13946 3155 -95013 -169151 -131201 4889 35153 -2758 -593 86689 63861
16347 63861 -31419 -71668 -105887 -122835 -112226 -113426 -119864 -105391 -78935 48629 78097 -3077
16335 -3077 -81961 -104440 -111490 -71584 -75207 -58874 -167592 -152314 -91171 -36207 -3102 66948
16323 66948 22861 73791 102349 108014 117461 139349 91733 25520 -25175 -10559 33222 40461
16311D0461l4791M7158r6741K7353o6501k6824J0986L4121L9038k0420k6557o0150
16299a32867n1431J4490J5020N0376j2536n6736J3479R1779r589P442J03633O6937
16287I9997o4322J4306j25463m940K8943n9490L1490M0472M6720L5515O3067N451
16275A11746k6215O962m2652K4089L2875j50338o1804J7621M7109R175n0159n0268
16263a31859J8128O1489P223k2918m44J03989J6004n9189o6934r355P9255J42107
16251A37496p431q3720o1005r4461J7748P8661l226n7102q6298l8948K4186N7418
16239a16682K7549k0587j0278R099P0065k5125q9884R6253l1617k8617O197O9070
16227d4557K9154q7205J4065J26393M1092o6144q302J3980j097m6539q367l9689
$$ plain form
16311 40461 5670 52828 -43913 -16560 -83061 -109885 -98899 -64778 -25740 -46160 -72717 -132867
16299 -132867 -184298 -169808 -154788 -104412 -116948 -173684 -160205 -68426 -78015 -70573 33060 99997
16287 99997 35675 49981 -75482 -80422 -51479 -110969 -79479 -39007 7713 43228 106295 111746
16275 111746 85531 92493 49841 73930 106805 -43533 -105337 -87716 -40607 -31432 -81591 -131859
16263 -131859 -113731 -52242 -45019 -67937 -68381 35608 51612 -7577 -74511 -83866 -4611 137496
16251 137496 130065 46345 -14660 -109121 -91373 -12712 -15938 -73040 -159338 -198286 -174100 -116682
16239 -116682 -89133 -109720 -119998 -110899 -40834 -65959 -155843 -59590 -91207 -119824 -113627 -44557
16227 -44557 -15403 -102608 -88543 37850 78942 12798 4496 18476 17379 -29160 -37527 -77216
16215g7216k9578L134J63593L8549j07220l7989M0839P1639L5516j20592j27547
16204a46872m7133R9686j386o5868M0563J32698k5531l0928L7160j9431L9577
16193A2535R3271J0871q0915n7951K3286J17382P8575n671n1681r8370j52500
16182a11168J00126j3467j39626k5288L0035J15532O1919K6902J5878j30197o7783
16171a37137K6977M6343k4040M673R8085n5992r3752o9305k9078Q1016J07342
16160d4868M6531P8364l0899k6113N9361P355n1832k8119m060L6078l9466p5501
16148g3169K3241M4616Q608L8257o2750p3436M8246l7357R4138R5689j8519l517
16136H4047q6567r6845J2552N1608K1865L34m17N6567m3826R064k2052j78313
$$ plain form
16215 -77216 -106794 -103660 59933 98482 -8738 -46727 -5888 65751 101267 -19325 -146872
16204 -146872 -194005 -94319 -95705 -161573 -121010 11688 -13843 -44771 -7611 -27042 12535
16193 12535 105806 116677 35762 -22189 1097 118479 197054 191383 139702 41332 -111168
16182 -111168 -11042 -24509 -164135 -189423 -159388 -43856 18063 44965 60843 -69354 -137137
16171 -137137 -110160 -63817 -87857 -83184 14901 -41091 -134843 -204148 -233226 -152210 -44868
16160 -44868 1663 80027 49128 23015 82376 89731 37899 9780 5720 41798 2332 -73169
16148 -73169 -49928 -5312 3296 41553 -21197 -94633 -46387 -83744 10394 106083 87564 84047
16136 84047 -2520 -99365 -86813 -35205 -13340 -13006 -13423 43144 -682 8382 -13670 -191983
16124a91983L4230J10896j6724r512j3935P957l3353r9955Q7379J26100J9480
16113B0580l1635n1411M8662M4410Q2451l9004k632M0900m9857J9889N9218n4024
16101H7547j04552o9960M4576J0481m0931k0668o9770K6513M1663p0102N1342
16090a13861J59732j02655j27500r1767k6228J17549J29407k3240j08838m5760
16080b33161J32872O8466j2841J169L624P1145P3897j36030j19586L6796M227
16069a09422j108j3285K1212K2165R8325L5015O6878p7705p0177Q4855K3818r1406
16057a0835q3162L5143J07083J7221J3142M2584l339j8656j05417j0705M1398
16046B4457r4610r1675L4840J38469P4831k0280m5690j2581j2870k9895M8413
$$ plain form
16124 -191983 -157753 -46857 -63581 -73093 -87028 -79071 -112424 -212379 -125000 1100 20580
16113 20580 -11055 -62466 -13804 30606 113057 74053 71421 112321 62464 82353 141571 87547
16101 87547 -17005 -86965 -42389 -31908 -72839 -93507 -163277 -136764 -95101 -165203 -113861
16090 -113861 45871 -56784 -184284 -276051 -302279 -184730 -55323 -78563 -187401 -233161
16080 -233161 -100289 -31823 -44664 -43495 -39871 31274 105171 -30859 -150445 -113649 -109422
16069 -109422 -110530 -123815 -102603 -80438 17887 52902 119780 42075 -28102 56753 80571 -10835
16057 -10835 -93997 -58854 48229 65450 78592 121176 117837 99181 -6236 -16941 24457
16046 24457 -70153 -161828 -126988 11481 86312 66032 20342 7761 -5109 -35004 13409
16035A3409Q5428J1116N4401L6698j52564j26329L7435j0630N4573L5282o5368
16024b6549o7100k802j3763n7749J41336N946l5213k6759k4818l9186j4722K0988
16012a40391O110N8719J9313R928N3910J18601L4541l2505n6933R5389l7524q603
16000A20555o32p4847n4464k6003j7402l504K1992K1616L0410J3106k6376j6966
15988a2515O8128J17496p5751o6460J5898N3584o7065n702k1587K5878N82r0571
15976e8085R989K5423o879m4162l0403K4749l2875l8897o9045N7328J63252J6906
15964A7301j12494q6928J01552J26268J7558k4393l0685n5575j6238R1700o5842
15953c7776l4542J2245J7794O1044O4174j07675j04318L1854P5813j24268j10248
$$ plain form
16035 13409 98837 109953 164354 201052 48488 -77841 -40406 -51036 3537 38819 -26549
16024 -26549 -93649 -96451 -110214 -167963 -26627 -20681 -55894 -82653 -107471 -146657 -161379 -140391
16012 -140391 -134281 -75562 -56249 -46321 7589 126190 160731 128226 71293 166682 129158 120555
16000 120555 119923 45076 -9388 -35391 -52793 -56297 -34305 -12689 17721 30827 4451 -12515
15988 -12515 55613 173109 97358 30898 46796 100380 33315 27613 6026 31904 32486 -58085
15976 -58085 -48096 -22673 -29552 -73714 -104117 -79368 -112243 -151140 -220185 -162857 395 17301
15964 17301 -95193 -182121 -80569 45699 63257 38864 8179 -47396 -63634 28066 -37776
15953 -37776 -72318 -60073 -42279 18765 82939 -24736 -129054 -97200 -21387 -145655 -255903
15942b55903k831K13825J01160j8106k040o3772l2008k9316r2890Q3522J62086
15931F3727n5916K3848O274p5155j1491l2953l8893j3306j703L1470O5804l5659
15919g3953k2640K1328j1329n3815o1737K2984R1584P0360O8315j634K0290j8686
15907E1067j6371j9355K0130P6386k4288j22354n7169m1074J3868O9406J36933
15896H7179J7939m5081P6796J65004n1115k06436n9166N5143M985r5770j9850
15885g0372j1100q082O6418R7281q14p6210k6958N415l0004J14321N4226l9338
15873G4783n9744N3907O3173M9696j13134r6333J21688N9290j56811r0202J8764
15862g4923L7945J8923K0352P1729k102l64K3929l2187q1981L382J4318r0031
$$ plain form
15942 -255903 -258734 -44909 56251 38145 36105 -27667 -59675 -88991 -181881 -98359 63727
15931 63727 7811 31659 37933 -37222 -48713 -81666 -120559 -133865 -135568 -104098 -38294 -73953
15919 -73953 -96593 -75265 -86594 -140409 -202146 -179162 -87578 -17218 51097 49463 69753 51067
15907 51067 34696 15341 35471 111857 87569 -34785 -91954 -133028 -119160 -49754 87179
15896 87179 105118 60037 136833 301837 250722 44286 -14880 40263 45248 -50522 -70372
15885 -70372 -81472 -89554 -23136 74145 73331 -2879 -29837 -24422 -54426 59895 114121 74783
15873 74783 15039 68946 132119 181815 68681 -27652 94036 153326 -3485 -93687 -74923
15862 -74923 -36978 -18055 2297 74026 71924 71560 95489 63302 -18679 -15297 -979 -91010
15850i1010Q7832N2541l7916m1138p6706k0016P7817R3141K9574l1485o511K571
15838C8694n901o1926K7814O3343m9021l5598j4016J03731L9165M6586k1934P751
15826A38688j03037j9766N3560P8795L791l7496J6669N442j53837l5779N9234
15815F264k7312r8857K8327p047r593l293n260j8697K2168Q396j5329l394J71590
15802D7963Q9329L5900R471J4759j40897k3888j41499p4410m1087L04J66143K10364
15790A52452K3065j17449r3295p1176P2950j6771j5143K8096J2003L5931L8366
15779D9029M9167L9734p2652n0711j24139j2944J9798K3765o0046J5152Q2656
15768d1191p9435p932L8146J10425R7270j80016k18074J1342Q8320P9149K1008
$$ plain form
15850 -91010 -3178 49363 11447 -29691 -106397 -126413 -48596 44545 74119 42634 36123 38694
15838 38694 32793 -29133 -1319 62024 13003 -22595 -36611 67120 106285 152871 130937 138688
15826 138688 35651 15885 69445 148240 152031 114535 131204 136646 -17191 -52970 6264
15815 6264 -21048 -119905 -91578 -98625 -108218 -111511 -116771 -135468 -113300 -104904 -120233 -123627 47963
15802 47963 137292 173192 182663 197422 56525 32637 -108862 -183272 -224359 -224055 -57912 152452
15790 152452 175517 58068 -35227 -106403 -33453 -50224 -65367 -37271 -25268 10663 49029
15779 49029 98196 137930 65278 14567 -109572 -122516 -102718 -78953 -138999 -123847 -41191
15768 -41191 -120626 -128558 -90412 20013 117283 -62733 -280807 -269465 -181145 -101996 -80988
15757h0988O3219P8089n8909q2355N1234m5739n608Q1120J9515o7163p485R6164
15745D1094q9382k3475k8147m2097N1531M4356j73305O6727Q5928Q3052Q3676
15734I9958n843r5992n201j1723k7346K1127N4761j1408r0684j0572J03977K5916
15722D6970p6102l4436m5549J317J20604R0862n7068r1963J1857N1550o3444q1172
15710a26574M015m6238Q6760L3968P4048r892r3400q549N8244q7869J6665Q6191
15698a2631l7930j3875L6415j05995j13936K1636Q8786O0364R1572N4521j606
15687F7321k5186n4753k1277j3112q3510l5849l3686M2347N2074L561P0578O4969
15675C3477R941m4035N7566O7021m3204r1144M0162O0161N9270l4211p9009M633
$$ plain form
15757 -80988 -17769 60320 1411 -80944 -29710 -75449 -81057 63 19578 -47585 -55070 41094
15745 41094 -48288 -71763 -99910 -142007 -90476 -46120 -219425 -152698 -66770 16282 99958
15734 99958 94115 -1877 -7078 -18801 -46147 -25020 29741 18333 -72351 -82923 21054 46970
15722 46970 -29132 -63568 -109117 -107800 12804 103666 46598 -45365 -33508 18042 -45402 -126574
15710 -126574 -122559 -168797 -82037 -48069 25979 16087 -77313 -85862 -27618 -115487 -98822 -12631
15698 -12631 -50561 -64436 -28021 -134016 -247952 -226316 -137530 -77166 14406 68927 67321
15687 67321 42135 -12618 -33895 -47007 -130517 -166366 -200052 -157705 -105631 -102070 -31492 33477
15675 33477 43418 -617 56949 123970 80766 -10378 29784 89945 149215 115004 35995 40628
15663D0628p4581M4890l926N3457J3153q60n0334j0233m8476l2053J9381n5987
15651a04941j30571Q2787J20877P5641k941M5550j6774r7793J789Q1893K9937
15640H5454J926M6637k3009m1043j343l0891q1430L6696J05322r4044m7415J5471
15628b7669j03175P5216N976K3060O1109m2091m841o6806j03785M4901Q665Q1736
15616d7704o122n9227K8788M2371J6030L3641N582K4047l9803j24367o8737N9140
15604a36361N3557N7036Q3878k9575j76286p819j8038K2189o1069k7219k997M2402
15592b00302P9767R3394q0199j21452J3802J19650j8716N8040M6461K5915R2544
15581A08904l7537j13149R4905L2060M7675l8308j02052l9357M01K5121J9353
$$ plain form
15663 40628 -33953 10937 7011 60468 73621 72761 22427 12194 -36282 -68335 -48954 -104941
15651 -104941 -235512 -152725 -31848 43793 40852 86402 69628 -28165 -26376 55517 85454
15640 85454 87380 134017 111008 69965 68622 37731 -43699 -7003 98319 4275 -43140 -27669
15628 -27669 -130844 -55628 -49652 -26592 34517 -7574 -12415 -79221 -183006 -138105 -129440 -47704
15616 -47704 -53826 -113053 -84265 -41894 -25864 7777 13359 37406 -2397 -126764 -195501 -136361
15604 -136361 -82804 -25768 58110 28535 -147751 -155570 -173608 -151419 -212488 -239707 -242704 -200302
15592 -200302 -120535 -27141 -107340 -228792 -214990 -95340 -114056 -56016 -9555 16360 108904
15581 108904 71367 -41782 53123 85183 132858 94550 -7502 -46859 -46458 -21337 -1984
15570a984P1793p761n2807m6786K4994J16188n1779J6919J3334l6683l3690j096
15558A0642L4147o3209n5848k4005J07292O7692j6661j1885N6246p3663j20380
15547h9632L8231r322l9834K722K5906R0308J3473p5618l8726J72954n7136q8843
15535e5517M7285L002k3416L9027N6851M9959o2715q8491J6512o8665j72189m3335
15523c01692Q2678Q5216M9957p118K567n3278o0052K8382j1M3152O0965J1280
15511e7954m3465K9328k811N1106P1984K1578J4846P9511p4519q3464J1970n3792
15499c5682P159J5074j9679J19768m5594p9625L6799l8227n3813J0663K1570O9427
15487G840m3147N6353n4764j49406l5524M2230J20725N8826m4046L355l1603j00116
$$ plain form
15570 -1984 69809 62048 9241 -37545 -12551 103637 51858 68777 82111 45428 11738 10642
15558 10642 44789 -18420 -74268 -98273 9019 76711 60050 48165 104411 30748 -89632
15547 -89632 -51401 -60723 -100557 -97835 -71929 18379 31852 -43766 -82492 90462 33326 -55517
15535 -55517 -8232 -5230 -28646 10381 67232 117191 54476 -34015 -17503 -86168 -258357 -301692
15523 -301692 -219014 -133798 -83841 -90959 -88392 -141670 -201722 -173340 -173351 -130199 -69234 -57954
15511 -57954 -101419 -72091 -74902 -23796 48188 69766 84612 164123 89604 6140 18110 -35682
15499 -35682 -28523 -13449 -33128 86640 41046 -38579 -1780 -40007 -93820 -83157 -61587 7840
15487 7840 -35307 21046 -33718 -183124 -218648 -176418 -55693 3133 -40913 -37558 -69161 -169277
15475a69277L2380Q0228R624p6088M6805M8827m8743q10O9994N9224n945M1997
15463H8216P0954O9071o8613q9598o6231O2966J35287k2060m1371j7699O0580
15452A81502J1179m7295P523L0797l2941j02048k6903K4194j5057k0740L6177
15441D6388J06713M1045k9483j23826j1841p3398r8098m4173L7317M7545M5483
15430e6328Q141r6191L9936P7820Q1905K9095k9201j2855m63o7551q7781j12686
15418b26159J1607P0182J36650R1472m276K1169N9797j47824J5429J7231o5524
15407b0246P2092o23o6614j86321N6984J13393J33218N07k8386L0743Q9082M8848
15395B42677q8517o3027l4674r519L6881o2955m4154o9911j4629j6148J2464J08744
$$ plain form
15475 -169277 -136897 -56669 -47045 -123133 -76328 -27501 -76244 -77054 -7060 52164 46219 88216
15463 88216 159170 228241 159628 70030 3799 66765 202052 179992 138621 120922 181502
15452 181502 192681 145386 152909 183706 150765 48717 21814 46008 30951 10211 46388
15441 46388 153101 194146 164663 40837 28996 -44402 -142500 -186673 -149356 -101811 -56328
15430 -56328 -48187 -144378 -104442 -26622 55283 84378 55177 42322 41859 -25692 -113473 -226159
15418 -226159 -214552 -144370 -7720 83752 79476 100645 160442 12618 28047 45278 -20246
15407 -20246 51846 51223 -15391 -201712 -144728 -31335 101883 102390 74004 104747 193829 242677
15395 242677 154160 91133 56459 46940 83821 20866 -23288 -93199 -107828 -123976 -111512 -2768
15383b768J4091m2262M879n7010j03298j7930Q4126J06706M0571l403J0312J3134
15371D7148J5603p0032p772N6064M9533r1885l3069P5947L3656n4665L8496J6125
15359G5149k0817k5248M635M5530m3820M732q545m2574P3140o5410k3893Q9510
15347F2389n9063j53284J7004N6353J68081L1263k2537n2634K1476M5295j4742
15336I9601o3680m7372K0632M7216N6567J03M8728L0983P4861Q1946j89814j31770
15324B8001o1595m1705l3189R6711M6792J1657j6472l1791n9755O4964R4827q9766
15312H679q6310o2380m0237M5601k3489l9159m5630M5209r414J03024J00870o5423
15300f8659j17985r589n600J25331R8394l4898o7207p1812j11150o6574O2933
$$ plain form
15383 -2768 11323 -30939 -26060 -83070 -186368 -204298 -120172 -13466 27105 23702 34014 47148
15371 47148 62751 -7281 -15053 41011 90544 -1341 -34410 41537 75193 20528 59024 75149
15359 75149 54332 29084 33719 79249 35429 40161 31616 -10958 62182 -3228 -27121 62389
15347 62389 3326 -149958 -132954 -76601 91480 122743 100206 47572 69048 114343 99601
15336 99601 35921 -11451 9181 56397 112964 113067 161795 192778 267639 349585 159771 28001
15324 28001 -33594 -75299 -108488 -11777 35015 46672 30200 -1591 -61346 3618 98445 8679
15312 8679 -77631 -140011 -180248 -134647 -158136 -197295 -242925 -197716 -207130 -104106 -3236 -68659
15300 -68659 -186644 -196233 -201833 -76502 21892 -13006 -80213 -152025 -263175 -329749 -266816
15289b66816J39971M4863L0429k1096O7279j3573N1211K0880O4180J083Q351K2940
15277A49702O259o8129j51J08401j02463K9407P1846m0214L7868k9769k0236N0207
15265A92728n5065j31099l2852J6120J10786j41188q7940O7316o003n0551M7078
15254g0670N9325Q6914m1067K7214m5109J2280j4982l8060j9015m8735O615L4893
15242e0397L4747J800P716J1400k91J03390J00952j16641j30286m9979M5980j0117
15230e1726l5567J9246m0208k8595j3086J6569J12324R6267p4870k2264j1941
15219c3851R0190j4831m2884K0437k1666l4780p479J2725Q7862P5969J3454K8066
15207A73212J2811l1058j0885j00451j09422J24883J23660l6620L8666O2684L2759
$$ plain form
15289 -266816 -126845 -81982 -51553 -72649 -5370 -18943 32268 53148 117328 118411 126762 149702
15277 149702 155961 87832 87681 196082 93619 123026 194872 154658 192526 162757 142521 192728
15265 192728 137663 6564 -26288 -10168 100618 -40570 -128510 -61194 -67197 -117748 -70670
15254 -70670 -11345 75569 34502 61716 16607 28887 13905 -24155 -43170 -91905 -85290 -50397
15242 -50397 -15650 -13850 -6134 5266 4975 108365 209317 92676 -37610 -87589 -41609 -51726
15230 -51726 -87293 -68047 -108255 -136850 -149936 -133367 -21043 75224 354 -21910 -33851
15219 -33851 56339 41508 -1376 19061 -2605 -37385 -44864 -32139 55723 131692 145146 173212
15207 173212 186023 154965 144080 43629 -65793 59090 182750 146130 184796 247480 280239
15196B80239Q5883K6878l1411K6289o8317J4263k9943r8703o5732k4426j11589
15185C431m6534m8988K8240J04905n8632k7164P8710J85142K8997j03755o9899
15174G4453n6707k8603j45225N2622J49409N6016n5539j54757m5389K1745K0299
15163a11676N6667P6181J5550r5591N5589p7324r0140J9753O5494K4911R5704
15152C5118j5657o7423M3648J26669K4407l5818j00483q4271O9015k4851j5990
15141d5636M0175p1423K2752l191p6532N7895O2191K8452K7775L1089m7973k2237
15129C337K1881r5651j01934O0810M2025r445L7272M2987K3700m3872L2625N6381
15117G0116r7275P2623J23257J868q4057j24262o6147P3949N5650J4738L3300
$$ plain form
15196 280239 366122 393000 361589 387878 319561 333824 303881 205178 139446 115020 3431
15185 3431 -43103 -92091 -63851 41054 -17578 -44742 33968 219110 248107 144352 74453
15174 74453 17746 -10857 -156082 -103460 45949 101965 46426 -108331 -153720 -131975 -111676
15163 -111676 -55009 21172 36722 -58869 -3280 -80604 -170744 -150991 -85497 -60586 35118
15152 35118 19461 -47962 -4314 122355 146762 110944 10461 -73810 -4795 -29646 -45636
15141 -45636 -5461 -76884 -54132 -57323 -133855 -75960 -13769 14683 42458 73547 25574 3337
15129 3337 25218 -70433 -172367 -111557 -69532 -78977 -41705 1282 24982 -18890 13735 70116
15117 70116 -27159 45464 168721 170589 86532 -37730 -103877 -29928 25722 40460 73760
15106G3760K2077j2275p4232J26144K2775j17971k8142M3129k3878n2135P2309
15095E1561Q1151K1213l0777n1605p6937O9541j03379l4604J25579J07000l4799
15084A23944R319K1299j17034l5861P3856k9382o025p6266p1397O9305j2707k2058
15072g3007Q15J2234j10146n8758o4210l0544P9503M1868L9813J33112L8389P4977
15060H4046K2896j14648q0660R227m0931M2131j1651N3155J8612m5356J3391N8039
15048H251k366K0458K9486m5954M692L7766r775k1367q1286Q277M2967N9903L4200
15035H5252K0390k2592m5998l4501K7253O1597l769q1927M4142o983J2825J090
15023E6779j2590n4084r7016N516k0288M209l8841J951O1065n027l1599M3079
$$ plain form
15106 73760 95837 83562 9330 135474 158249 40278 12136 55265 31387 -20748 51561
15095 51561 132712 153925 123148 71543 -5394 64147 -39232 -73836 51743 158743 123944
15084 123944 133263 154562 37528 1667 75523 46141 40116 -36150 -107547 -38242 -50949 -73007
15072 -73007 -72192 -59958 -170104 -228862 -293072 -323616 -244113 -202245 -162432 -29320 9069 84046
15060 84046 106942 -7706 -88366 -79139 -120070 -77939 -89590 -36435 -17823 -63179 -49788 8251
15048 8251 5885 26343 55829 9875 14567 52333 42558 21191 -60095 -51818 -8851 51052 85252
15035 85252 105642 83050 37052 2551 29804 91401 87632 5705 49847 42864 55689 56779
15023 56779 44189 -9895 -106911 -101395 -121683 -117474 -156315 -154364 -93299 -98326 -129925 -86846
15011h6846M0077O4250M4969q5062K1090N0281P537j7374R1246O9933p9700q572
14999A11829j9103m4005M9273J2422j47434p5396N1765P8493o4091r1972j1836
14988a50055J19371n195m6444N7829J21775n5606r936L1367l1568j03175M9056
14977b2581P9074K5597Q231M4186P8221k4141j05301q5313j66310j3361J57109
14966b4589J25970n0950m2959n6911j412m3590k1417K9447P7812J9917k1630n8446
14954f8758n5166o9043O3467K7820Q1996k4157k9489j6922Q3650p8601o8715N1303
14942a02615Q924M9489j3706j4308M5501J60736J412j18049K3976J48783r1055
14931I9088j63210k6043K4741p7269m274j5241k545K2423L2421k7314M1771J6472
$$ plain form
15011 -86846 -46769 17481 62450 -22612 -1522 48759 56296 38922 130168 200101 120401 111829
14999 111829 92726 48721 97994 110416 -37018 -112414 -60649 17844 -46247 -138219 -150055
14988 -150055 -30684 -35879 -82323 -24494 97281 41675 31739 63106 31538 -71637 -22581
14977 -22581 56493 82090 90321 134507 212728 188587 83286 -2027 -168337 -181698 -24589
14966 -24589 101381 50431 7472 -49439 -50851 -94441 -115858 -86411 -8599 11318 -10312 -68758
14954 -68758 -123924 -192967 -129500 -101680 -19684 -43841 -73330 -90252 -6602 -85203 -153918 -102615
14942 -102615 -93691 -44202 -57908 -72216 -26715 134021 135433 17384 41360 190143 99088
14931 99088 -64122 -90165 -65424 -142693 -146967 -162208 -164753 -142330 -109909 -137223 -95452 -78980
14919g8980j7904O1216Q3479L0425L1891l1450r1238n8859N8533K3315o0929k3884
14907g4385j4205p0826J0453P8024q759K2372M0420l5094K0046n5968j2648k7139
14895a27709P960O9465j2075J8726j49484J7551Q5204J2757P1442R5394p2045
14884A7186O493M8157J6809m7399j36335k5316P1307l7265q8014m3679n5287j538
14872b74881J48639J88943Q0253p1269m8634n1272K5540j8074n0110P2770o7478
14861f5573m2031K3711J06024J47100l9363j34997n6972M1123K5382o965m0282
14850d2843J0441J1416P8845p0804n8940r0714o2149l016J00345Q0058L3420m5847
14838e9788J22236M9417r5130n7295O9691P0138K6557M3087r3151K9287N3085
$$ plain form
14919 -78980 -96884 -35668 47811 78236 110127 78677 -12561 -71420 -12887 10428 -50501 -74385
14907 -74385 -88590 -159416 -148963 -70939 -79698 -57326 -16906 -52000 -31954 -87922 -100570 -127709
14895 -127709 -119749 -50284 -62359 -43633 -193117 -175566 -90362 -77605 -6163 89231 17186
14884 17186 23679 71836 88645 41246 -95089 -120405 -49098 -86363 -174377 -218056 -273343 -274881
14872 -274881 -126242 62701 142954 71685 23051 -28221 -2681 -20755 -70865 1905 -65573
14861 -65573 -107604 -83893 22131 169231 129868 -5129 -62101 -20978 4404 -2561 -42843
14850 -42843 -32402 -20986 57859 -12945 -71885 -162599 -224748 -227764 -127419 -47361 -13941 -59788
14838 -59788 62448 111865 16735 -40560 29131 99269 125826 168913 75762 105049 158134
14827A58134o3705J4948j3085o3293L1996j8075l0127Q940L5107J3408l3860p0558
14815c0170l3469N8455l2317m7420o5426m5323J9700N6157J2412k3846L7300n4426
14803a48373n0659P9976J44999L1109Q515o8289j161J1035J6398K1600j1758P265
14791D0657j8301l6057o2276L1422M0891K54O068q6154p5465r414M6620R9005
14779b2750J1956M8876M5482O4438l3916j77479l4214P9836M4314n186q3724q660
14767g1027O3909M8168L8198r5306n6139O2278K7994j8021N4799j3967J43089
14756A83975P4210j35648j06515l8230L6325M8387K0307j50907j26306o0287J34018
14745a20671J55314M8808j25741j37081k5512J7800L6528J8831K4550N4490n8048
$$ plain form
14827 158134 94429 109377 96292 32999 64995 46920 16793 25733 60840 74248 40388 -30170
14815 -30170 -63639 -5184 -37501 -84921 -150347 -195670 -175970 -119813 -107401 -131247 -93947 -148373
14803 -148373 -199032 -119056 25943 57052 65567 -2722 -3883 7152 23550 45150 33392 40657
14791 40657 22356 -13701 -75977 -44555 -3664 -3410 2658 -83496 -158961 -168375 -121755 -22750
14779 -22750 -10794 38082 83564 148002 114086 -63393 -97607 -17771 26543 21357 -62367 -71027
14767 -71027 -7118 41050 79248 -16058 -72197 -9919 18075 54 54853 40886 183975
14756 183975 258185 122537 16022 -22208 14117 62504 82811 -68096 -194402 -254689 -120671
14745 -120671 34643 83451 -42290 -179371 -204883 -187083 -150555 -131724 -107174 -52684 -110732
14734a10732k6384P2357J28585l5310p6454P9345L6710K3107j6845k1245j8247
14723C4887L4669J8381Q9103n5902k6236o7082p8333l8098n5783R3290J03864
14712E2760N7221p8427l0713M5265p0226j4300M8598k7404k9595n4873k0665k8422
14700a50781O8710K0002n4389j20343N4857P4960L5987j07976P9530R5208N4961
14689E0726n5921L5291O6782Q9018j2311k2844m9394r4853l7997k4336k8169K9553
14677e4455K4154j6222M4128q499J8521O452q721q744j7568q6591m7754P8016
14665g7283J09387Q5976n9012r0300n8574R0502O1823o6958m661q8986M090P9912
14653a4084k9571J7776K6535p7277n3151J31482P4271q360l7161J9406J0107J4841
$$ plain form
14734 -110732 -137116 -64759 63826 28516 -47938 31407 68117 91224 74379 53134 34887
14723 34887 69556 87937 177040 121138 94902 27820 -50513 -88611 -144394 -51104 52760
14712 52760 109981 31554 841 46106 -24120 -38420 10178 -17226 -46821 -101694 -122359 -150781
14700 -150781 -82071 -62069 -116458 -236801 -181944 -106984 -70997 -178973 -99443 -4235 50726
14689 50726 -5195 30096 96878 185896 173585 150741 101347 6494 -31503 -55839 -84008 -54455
14677 -54455 -30301 -46523 -2395 -10894 7627 14079 5358 -3386 -20954 -107545 -155299 -77283
14665 -77283 32104 118080 59068 -31232 -89806 696 62519 -4439 -9100 -98086 -93996 -14084
14653 -14084 -43655 -25879 656 -76621 -129772 1710 75981 67621 30460 49866 59973 74814
14641G4814n6322j3628J4096k5008M1974j6685k1143J52798n4446j05152M0207
14630C1505J4255J14010p7109l4896l5273J5350R9038K6386n3577n4036K5229
14619G0882k0569m4244L5919N9593l4457q6853k3563L5986J0855k0379k08J16095
14607I9057n8426m6923L5496q1012O8402P2903n0926q5625o5515j0483N3197K1137
14595d8718Q8679P9184l726j782q3843o7505N5917r4401k4609k9876o9997J12346
14583h8331Q5398p9304m2332J02368L8331l7515M1003M1651j8513l0627q5165
14572g3036j2746l0311M3287K6649n1336J7977n5418m587N9302L3109J49465J13887
14560B16242j63233j44465P2956L3808m1109q0544J3423L6532N5411N2389j50936
$$ plain form
14641 74814 18492 4864 18960 -6048 35926 19241 -1902 150896 96450 -8702 31505
14630 31505 45760 159770 82661 47765 12492 27842 126880 153266 99689 45653 70882
14619 70882 50313 6069 41988 101581 67124 -19729 -43292 -7306 3549 -16830 -17038 99057
14607 99057 40631 -6292 29204 -51808 16594 89497 38571 -47054 -112569 -123052 -69855 -48718
14595 -48718 39961 119145 115419 113637 29794 -37711 18206 -76195 -100804 -130680 -200677 -88331
14583 -88331 -2933 -82237 -124569 -22201 16130 -21385 19618 61269 42756 12129 -73036
14572 -73036 -85782 -116093 -72806 -46157 -97493 -79516 -134934 -139521 -80219 -47110 102355 216242
14560 216242 53009 -91456 -18500 15308 -25801 -106345 -92922 -56390 -979 51410 -99526
14549i9526r3590J10715L4004O6396J0974L7568m1226q3381k5269m9544j02004
14538b34883n9112J87249J19473o9095j9918J86400R7189M4610m6263p2270j34570
14527a190M6499j03946p1077j3287q3708P9113J17140O1955N4826k1150j34888
14516f9713n9831K5075q989k5417r703O0839K7540p261J8732N1312r5292P851
14504h4857q19K9773P6017l2897R914O889m5021J4219N6650J26253J34909M1184
14492C32214p7676o9325m4523p6105p4200J5158k2220Q577J3062M2989M4292M6912
14480A39155N8087N0266j20886l2935p6691o5767n3226p835m8893r388j9463j0346
14468a97922J8829K9353J2561J93P4289O633M8611p226o8613k2977P7364L2632
$$ plain form
14549 -99526 -193116 -82401 -48397 17999 28973 66541 25315 -58066 -83335 -132879 -234883
14538 -234883 -293995 -106746 12727 -56368 -76286 110114 207303 251913 205650 133380 -1190
14527 -1190 45309 -58637 -129714 -143001 -226709 -147596 -30456 31499 86325 65175 -69713
14516 -69713 -129544 -104469 -113458 -138875 -148578 -87739 -60199 -67460 -48728 2584 -92708 -84857
14504 -84857 -85676 -55903 20114 -12783 -2869 4020 -41001 -26782 29868 156121 291030 332214
14492 332214 254538 185213 140690 64585 -9615 5543 -16677 -8100 4962 47951 92243 139155
14480 139155 197242 247508 126622 93687 16996 -48771 -101997 -109832 -158725 -168113 -187576 -197922
14468 -197922 -179093 -149740 -137179 -136986 -62697 -56064 -7453 -14679 -83292 -106269 -28905 3727
14456C727m9157l3144p608J01526k1648l4752N7780o1105m6765j0472n0708O0236
14444i2090P7365J7093K3711k5715p7304J5890p0514N7358J80428m6432N373N9078
14432A24241j2332q0109n4306O442k3402j06146N4999J24783J4736J2776O937
14421F8619o2706k0662N400O3048j0108k7077p1793n2105M2582p0120N7966P2209
14409d747K5494j17659j3663M7294L2371n174J22580M8684J201J1364m1298j17939
14397a1492O211o8136j33256m8917M3625J41306O405M7043K6001k8623j5966M7021
14385A1222j3052n8464m0439O748J8454k0847K4064O1004N2859O4259Q372j70016
14373e5836K6382k7165n2399P8178J18281l6122k1346k9267N1609P0807L9526
$$ plain form
14456 3727 -45430 -78574 -86182 15344 -6304 -41056 16724 -44381 -91146 -101618 -152326 -92090
14444 -92090 -14725 2368 26079 364 -76940 -61050 -131564 -74206 106222 59790 65163 124241
14432 124241 111909 31800 -22506 -16064 -39466 -145612 -90613 34170 48906 61682 68619
14421 68619 5913 -14749 -9349 53699 43591 16514 -55279 -107384 -64802 -134922 -76956 -4747
14409 -4747 20747 -96912 -110575 -63281 -30910 -36084 86496 135180 136381 147745 106447 -11492
14397 -11492 -5281 -73417 -206673 -255590 -211965 -70659 -64254 -17211 8790 -19833 -35799 11222
14385 11222 -1830 -60294 -100733 -93985 -75531 -96378 -72314 -11310 41549 105808 114180 -55836
14373 -55836 -29454 -56619 -109018 -30840 87441 51319 29973 706 52315 123122 162648
14362A62648q7845m9565k0468q0931l3453J931N200J3663L7547O7722L5221l009
14350D8661l4270k9332n9143R6013J43692R360J1453q7346j33432L0655O6759
14339F3070O9570N0285n526j10778j03665k3245J07214J69347K7195P09N060n6710
14327A92526p0195m8404n9664N982m6776l4257J34096K0834q5319n6579K7978
14316a9778R245n6390J3369J45483K668K3165j03035l0734m2378J0105M1929K0594
14304A4243P9271m7094j1134m4776K6399M2945j2695j53887M5007P8981O9127
14293H6387m5223m2658P116r1488L9313N1075p6517L8245Q5518k5490l1958N9015
14281E3335l8327n1793J9898M2535O1626N4333R713r099L8219r3242j79427m2609
$$ plain form
14362 162648 74803 25238 4770 -76161 -109614 -107683 -102483 -88820 -51273 16449 51670 48661
14350 48661 14391 -14941 -74084 21929 165621 174981 186434 99088 -34344 -3689 63070
14339 63070 132640 182925 177399 66621 -37044 -60289 46925 216272 243467 244176 249236 192526
14327 192526 122331 73927 14263 20245 -26531 -60788 73308 94142 8823 -47756 -19778
14316 -19778 -10533 -66923 -53554 91929 94597 117762 14727 -16007 -58385 -48280 -6351 14243
14304 14243 93514 46420 35286 -9490 16909 59854 47159 -106728 -61721 17260 86387
14293 86387 41164 -1494 5622 -85866 -46553 4522 -71995 -33750 51768 26278 -5680 53335
14281 53335 15008 -36785 -16887 25648 87274 141607 151320 142221 180440 87198 -92229 -134838
14269a34838o1624M641N6228J49692J41372P2108m6999o1807m4957o7349O737
14258A3204K2807j7821J07337R6124o2592n5410o7027j38914l8708O585P8257
14247e6158r4454N780O1257O4520o051J8895N7625J62067l5584j2683r5365j1220
14235E8629j5769m9200j0975L4981P2511k9818j09748P7756K9287m0854N1098
14224F7898J31334o4165j06740R5886M4074l7025j41144M6035P3899K3046n9141
14213G3957M1288j0964j25258Q6192Q2938J5006q952m9089K8475p0542j11537
14202d8486P102m3075K7592j053J07843Q2090N1210r7575J2542O0788j2560r7936
14190D8482m9382N5698R9791J6478m7288q4846j23369O7331Q0859K2385k4479
$$ plain form
14269 -134838 -196462 -191821 -135593 14099 155471 227579 180580 118773 73816 6467 13204
14258 13204 36011 18190 125527 221651 159059 103649 36622 -102292 -141000 -134415 -56158
14247 -56158 -150612 -144832 -83575 -19055 -25106 -6211 51414 213481 177897 165214 69849 58629
14235 58629 42860 -6340 -17315 17666 90177 60359 -49389 28367 57654 16800 67898
14224 67898 199232 135067 28327 124213 168287 131262 -9882 36153 110052 133098 73957
14213 73957 115245 104281 -20977 65215 148153 163159 154207 105118 133593 63051 -48486
14202 -48486 -41384 -84459 -56867 -57920 49923 132013 183223 85648 98190 158978 146418 48482
14190 48482 -900 54798 154589 171067 123779 38933 -84436 -17105 63754 86139 61660
14179F1660l5789m842k2053R8336M9403O4404k6524l6980l5782j1593J19549j2510
14167B07279p1822L4207O4892K0106Q7217Q2571J09915N8056Q3490J03528M0934
14156H20373L5906N5648P5160K0453R7853J31577K00540J90544K02219K52095
14146B082368K73771P3062m3861j05471j44968m45326m99353k51517k27490j72971
14136E38244j81159p0779M4580J25980N2283p6144j66654r4602P609P875k8440
14125A58793R1720j05906j02874k0763l900M4488n8511n726j1997l1587l3139
14114g9402K0725L754j2805P5623N3515K3666J12713Q5287j66784p2238l257o7416
14102b6619J1139J12179n510l4780l230k6477j3186J17955Q3253n2945R995l145
$$ plain form
14179 61660 25871 21029 -1024 97312 146715 211119 184595 147615 111833 100240 219789 207279
14167 207279 135457 169664 234556 254662 341879 424450 534365 592421 675911 779439 820373
14156 820373 856279 911927 987087 1007540 1105393 1236970 1437510 1628054 1830273 2082368
14146 2082368 2356139 2429201 2385340 2279869 2134901 1689575 1190222 938705 711215 538244
14136 538244 357085 286306 330886 456866 509149 433005 266351 171749 179358 187233 158793
14125 158793 250513 144607 41733 20970 17070 61558 3047 -2679 -14676 -46263 -79402
14114 -79402 -58677 -54923 -67728 7895 61410 85076 197789 283076 116292 44054 40797 -26619
14102 -26619 -15480 96699 91189 56409 53179 26702 13516 131471 214724 161779 171774 168629
14090A68629j0662Q3408M5383n728n1716O5902R0950j5043N191k6381n2139k4298
14078B73496M5141K0683r1629P661P3696K2947k3058M4668O9683Q483J1323M6949
14066E10043k9647J3979l6642m7707J22329J03240M34K9415O8284M9827O9570
14055H53125J30836j1572L227P5495J51701J87211J27455K65182K20493K18386
14045B221539L47974L77038N14851O16805N19347J44471k07316l03058n43660
14036C687991r37036r10412o47992l87130k66032j76302k5464L7577k9320L388
14026C49268o0975j03098K263L3254O8601J858j0032m5128j61164O2091K6607
14015A63545j21117J2295M4610P7233O3249L6755o2367n8085l9832l4945k897
$$ plain form
14090 168629 157967 241375 286758 281030 229314 295216 386166 371123 376314 349933 297794 273496
14078 273496 318637 339320 247691 255352 329048 351995 328937 373605 443288 451771 463094 510043
14066 510043 480396 494375 457733 410026 532355 635595 636029 665444 733728 783555 853125
14055 853125 983961 972389 975616 1051111 1202812 1390023 1517478 1782660 2003153 2221539
14045 2221539 2569513 2946551 3461402 4078207 4597554 4742025 4534709 4231651 3687991
14036 3687991 2750955 1840543 1192551 805421 539389 363087 337623 375200 345880 349268
14026 349268 288293 185195 187458 220712 289313 291171 281139 236011 74847 136938 163545
14015 163545 42428 54723 99333 176566 239815 276570 214203 156118 116286 81341 78444
14004G8444O1946l3686N8343L1168q5494n019o693q2825o8906J0187K1991K100
13992a8444O3096Q3822R460o5059M9503O3475j11688m6326O4711J9406m7062J145
13980F6039p7011N0096O8012N6532l3663n3049l4649N0322J11146k060m60q6154
13968A15101R611K6303M6009k9839j1958J9552R4365M6286o2477l3796j02092
13957A17065q0402j17843K3617M8949j6993l6053r6868J09987O3056L8459L1096
13946H4070n5256J8251P742o249R212M3511N0818M6442k1685N1640K2954J806
13934B53256M1530L5548p7600l6691P7018O5900n2405Q3571N1391n4267o607p7852
13922C02792j15927l4247l300N574j39758K6635j0055q8344K5359O275L4718J40056
$$ plain form
14004 78444 140390 106704 165047 196215 110721 105702 99009 16184 -52722 -42535 -20544 -18444
13992 -18444 44652 128474 137934 72875 122378 185853 74165 27839 92550 111956 64894 66039
13980 66039 -10972 39124 107136 163668 130005 76956 42307 92629 203775 201715 201255 115101
13968 115101 124712 151015 197024 167185 155227 174779 269144 315430 252953 219157 117065
13957 117065 36663 -81180 -57563 -8614 -25607 -61660 -158528 -48541 14515 52974 84070
13946 84070 28814 47065 54807 48558 57770 101281 152099 198541 176856 228496 251450 253256
13934 253256 294786 330334 252734 216043 293061 358961 306556 390127 441518 387251 380644 302792
13922 302792 186865 152618 149318 154892 15134 41769 31714 -56630 -31271 -24996 9722 149778
13910A49778J4414j8193q0841R788J18557K3070j00092r8296k8465j6775J31918
13899A04863J02415N6232K1931l2321j31991n442M3073J6754K0499o4813q8516
13888D2684L7932P9515j0288J1700p6361k7232l872l4533K2367j9606K8967q311
13876D2962n3127j16218r5081N3954O8601P9690L1437Q168J18925K5638l3890
13865A31059j22802o1860k9291J44451J28029q5543m7361J9456k0653P5481J049
13854A32015L0414M7775K0478l8881L4778l9490P612J26972N0490p1815j44524
13843A55824o4889J2866J46978J22888K2968j45934j05891m4324o743O6827M8247
13832B08817j7663J5830M0350k4039p0482j35876N8914J03557P3874O8855M9099
$$ plain form
13910 149778 164192 145999 65158 74946 193503 216573 116481 18185 -10280 -27055 104863
13899 104863 207278 263510 285441 253120 121129 115687 158760 175514 196013 131200 42684
13888 42684 80616 160131 149843 161543 85182 57950 54078 19545 41912 22306 51273 42962
13876 42962 -10165 -126383 -221464 -167510 -98909 -19219 12218 20386 139311 164949 131059
13865 131059 8257 -53603 -82894 61557 189586 104043 56682 76138 55485 130966 132015
13854 132015 162429 210204 230682 191801 226579 187089 194701 321673 372163 300348 155824
13843 155824 90935 103801 250779 373667 396635 250701 144810 100486 93743 160570 208817
13832 208817 191154 206984 247334 223295 152813 16937 75851 179408 253282 322137 371236
13821C71236K0046l38Q3231N968k3378M7421l8184R484j507m3764p4989j4115
13809C41111J22280J62898Q0440n7833j36786M5579Q8463j9021k4817M6599M230
13798F53143M7214m9860J120J2597P6264R5087J19937l8153j28701j31706P817
13787F64759J16975J6477K8362l4307n1R0530R1349q2178J0433m6506n5868K4703
13775H24678J3902l0789N6440Q7803Q0620J14055P5071N4726J0904m3386N2082
13764A296106J84755P584K3654R1991N5226N8250k3825J48885J57481J16089L1011
13753B147207n9025Q3704N6123l5917k1823O8527J43130J31688J17786K12325
13743B843725K61907J46483N9644J17507J32530J39389O6021K03519K98206J06734
$$ plain form
13821 371236 391282 390944 474175 480143 456765 504186 466002 475486 473979 430215 355226 341111
13809 341111 463391 626289 706729 648896 512110 557689 646152 627131 602314 648913 653143
13798 653143 700357 650497 651617 664214 740478 835565 955502 917349 788648 656942 664759
13787 664759 781734 798211 826573 792266 792215 882745 974094 891916 902349 855843 799975 824678
13775 824678 838580 807791 864231 952034 1032654 1146709 1221780 1276506 1287410 1244024 1296106
13764 1296106 1480861 1488445 1512099 1604090 1659316 1717566 1693741 1842626 2000107 2116196 2147207
13753 2147207 2088182 2171886 2228009 2192092 2170269 2238796 2381926 2513614 2631400 2843725
13743 2843725 3105632 3252115 3311759 3429266 3561796 3701185 3767206 3970725 4268931 4375665
13733D375665J05224K13660L28283L10124L43837K40083K22298L81308M60583
13724F981065L76962M00202L85285M79997N54486O51568P04459O73613P84912
13715A1992549Q14044Q71505Q38636R16045J011061J099714J117977J212474J206534
13706B1080539J287779J327530J465291J504400J584148J744462K004363K279344
13698C4277856K360315K382981K687622L053716L303228L598808L914951M388213
13690E9967690M790684N181339N554596N909495O431750P432865Q651930R986777
13682A13907126J1458608J2865247J4396052J6691084J9945853K3596553K7480972
13675B40341495L2325939M0344699N2363572O6406537N7419106P544733k8855906
$$ plain form
13733 4375665 4480889 4694549 5022832 5332956 5676793 5916876 6139174 6520482 6981065
13724 6981065 7358027 7758229 8143514 8623511 9177997 9829565 10534024 11207637 11992549
13715 11992549 12806593 13678098 14516734 15432779 16443840 17543554 18661531 19874005 21080539
13706 21080539 22368318 23695848 25161139 26665539 28249687 29994149 31998512 34277856
13698 34277856 36638171 39021152 41708774 44762490 48065718 51664526 55579477 59967690
13690 59967690 64758374 69939713 75494309 81403804 87835554 95268419 103920349 113907126
13682 113907126 125365734 138230981 152627033 169318117 189263970 212860523 240341495
13675 240341495 272667434 313012133 365375705 431782242 489201348 496746081 467890175
13668D67890175m1393435o8477775r4873341q5581729n6530376l4162937k1207501
13661F5663081j3794764r572426o856557n251665m099262l288603k801845k514182
13653A7483777k166225j818321j556709j284449j035889q55838o68097n28929
13645G569320m58409l34455j58729l18186l50481k83834l41834k73116k69917
13636D780359k44594k01058j04207l45399k51310l0924J2233m9940j57596j56558
13626C251006j95931j61605j50632j50882j95693j81674j41571j36130n7430j17681
13616A761777j51914r1958N877p8984r4628m1821N1012P3571n6951J07q1659q6829
13604A207600L502l6192q5256o1792j00467q4296n6095M7792K0219j92113o0942
$$ plain form
13668 467890175 426496740 358018965 263145624 177563895 121033519 86870582 65663081
13661 65663081 51868317 42295891 35439334 30187669 26088407 22799804 19997959 17483777
13653 17483777 15317552 13499231 11942522 10658073 9622184 8766346 8098249 7569320
13645 7569320 7110911 6776456 6617727 6299541 5949060 5665226 5323392 5050276 4780359
13636 4780359 4535765 4334707 4230500 3885101 3633791 3602867 3615100 3565160 3407564 3251006
13626 3251006 3055075 2893470 2742838 2591956 2396263 2214589 2073018 1936888 1879458 1761777
13616 1761777 1609863 1517905 1523782 1444798 1350170 1308349 1359361 1432932 1375981 1376088 1294429 1207600
13604 1207600 1211102 1174910 1089654 1027862 927395 843099 787004 834796 855015 662902 601960
13593F01960L4501K2035k9785L0227J22709K9200j58266j96549o1145N5579J36914
13582E87380L1308l3951n0095l7828K3981J4124O6755L0766o5664m2033q9614
13571D35129J19336J22830J0022m6133o1984j41282k6661P1944o6873Q8460J4733
13560E19521r1588k849J0602K7195m3511n3800r0918l6996K9135N3289L6480Q3910
13548D40470j08188p8724l4410O6731j6261K5126m1849m5726l8185R4841p2457
13537A91368j24932K6238K38200J52829K060m1549p4700l645J0775N0352L7524
13526D64520j13938p7904j3055q6557o6229Q333M1600N7095O6835L8963Q3277
13515D02940O3201k9603p185m5946k9093J5370l2171o9528J0537Q8695P71k3401
$$ plain form
13593 601960 636461 658496 628711 658938 781647 810847 652581 456032 394887 450466 587380
13582 587380 618688 584737 534642 496814 520795 534919 601674 632440 566776 524743 435129
13571 435129 554465 677295 687317 641184 579200 437918 411257 483201 416328 504788 519521
13560 519521 427933 425084 435686 462881 419370 365570 274652 237656 266791 320080 356560 440470
13548 440470 332282 253558 219148 285879 269618 294744 252895 207169 168984 263825 191368
13537 191368 66436 92674 330874 483703 485763 444214 369514 365869 376644 426996 464520
13526 464520 350582 272678 259623 173066 106837 115170 156770 213865 280700 319663 402940
13515 402940 466141 436538 429353 383407 354314 369684 337513 267985 278522 367217 367988 344587
13503C44587o3018l9109O5593J7012n7150K0173M190k4596l0607J3238L5979n1633
13491B34659j3082M101l3715m2379K1648J38822L8663q6773M7041k0423n337p868
13479B75357r6441O10J08307M7632j0688p7739r1399r745Q886O7556j8282o0800
13467A43254q118L6683O0774O5737l7941Q7197r920l5155r962j35205J2329L309
13455A72982j12668J1531J54279N9186q7692M6210J8754q1108r1536m512j2936
13444G2490J4813O1271Q911k7762p204Q5450P0271o0963l9340k6375K3505O7043
13432B42110j03872j58914J02890l1512j7126N3155L8083m6904p5644n0116J796
13421d6054J8050q4635K3869J06296R5187N7757m2992P395J21979O1704j17952
$$ plain form
13503 344587 281569 242460 308053 325065 267915 288088 292278 267682 237075 250313 286292 234659
13491 234659 221577 225678 191963 149584 171232 310054 348717 261944 308985 288562 283225 275357
13479 275357 178916 179526 287833 335465 324777 247038 155639 145894 154780 222336 204054 143254
13467 143254 135136 171819 232593 298330 260389 347586 337666 302511 292549 157344 169673 172982
13455 172982 60314 71845 226124 285310 197618 243828 262582 181474 89938 85426 72490
13444 72490 87303 148574 157485 129723 122519 207969 278240 217277 177937 151562 175067 242110
13432 242110 138238 -20676 82214 50702 33576 86731 124814 77910 2266 -47850 -46054
13421 -46054 -28004 -112639 -88770 17526 112713 170470 127478 134873 256852 318556 200604
13410B00604j34081o743n8552p6006Q7281O1674J6588l5307N2848L5075O4518
13399B07899r3808o7087N4323Q4041j4532m4819L8466l7697P052J2654Q972K0516
13387A75980p7954j52507o9195K8430l9955k0699N5695J06981Q346J78913n522
13376A88513k54931k7016L0709R1432N6184k5533L0620n1827r5895l0720J26610
13365C8146M4925n6489N5983K2556j3565r5135P0563j9468l0955N5515J92606
13354B64682R9311n3805j75906l8327J0783m5976R3569p1105j11294p474N4479
13343A8937j4351K7669q3796Q3036Q8276p6225n2577N806Q0532M0093Q325p6573
13331D9152n6213l7371M0366M250K5186J05172N5106j15415n7625L3654l3874
$$ plain form
13410 200604 66523 59780 1228 -74778 12503 74177 90765 55458 108306 143381 207899
13399 207899 114091 47004 101327 185368 170836 126017 164483 126786 133838 146492 155464 175980
13387 175980 98026 -54481 -123676 -95246 -135201 -155900 -100205 6776 15122 194035 188513
13376 188513 -66418 -93434 -62725 28707 84891 59358 89978 38151 -57744 -88464 38146
13365 38146 83071 26582 82565 105121 91556 -3579 66984 47516 16561 72076 264682
13354 264682 363993 310188 134282 95955 106738 60762 154331 83226 -28068 -35542 18937
13343 18937 4586 32255 -51541 31495 119771 43546 -9031 -3225 77307 117400 125725 49152
13331 49152 -7061 -44432 -4066 184 25370 130542 185648 70233 12608 46262 12388
13320A2388n5617M8859J4325K9099K5864m9033j15572R0353K5314M8653n947l7469
13308C1217O2162L094j3011m9922l1139l00j7817k1452P4099R8921j04226m9784
13296a8158L4335l3066J9278M7249J3992l139r7355m1275k2256P8485L7521N814
13284B1425l0881K4040J6678M836n8590L756R463M4287O1318j02490m4563J25917
13272G5196J41554j02854j01326m0616n1916O0251O8467L5583q4786j4463N3167
13261C8257O4568J24875o1j00788k1628N8480j46200j4456R7764N5705j9625m6592
13249I0299L729J136m0806Q1618K2881K364k2638j2306n1089l7746j1571K8697
13237E4568k8149J3087N1177M5658N1273O2724r9546n3902p4656k4474J32028
$$ plain form
13320 12388 -43229 5630 19955 49054 74918 25885 -89687 666 25980 74633 68686 31217
13308 31217 93379 96473 83462 33540 2401 2101 -15716 -37168 36931 135852 31626 -18158
13296 -18158 16177 -16889 2389 49638 63630 60491 -36864 -78139 -100395 -21910 15611 21425
13284 21425 -9456 14584 31262 36098 -22492 -18736 -9273 35014 96332 -6158 -50721 75196
13272 75196 216750 113896 12570 -28046 -79962 -19711 48756 84339 -447 -14910 38257
13261 38257 102825 227700 227639 126851 105223 163703 17503 3047 100811 156516 136891 90299
13249 90299 94028 95164 54358 135976 158857 161221 138583 126277 75188 37442 25871 54568
13237 54568 26419 39506 90683 136341 187614 250338 150792 96890 22234 -2240 129788
13226A29788O9821k9600n8637n5073n5374j0052Q2473Q821P1376m399q7024P6105
13214A38225R4436N1226q5234k8194M8842p408n025J18584J42635j02287o7829
13203B97971J05775J62065J29605Q7615P9312J40993o691J4653J91679K12221
13193A415198J61237K74274L81091L60495J2699j59674j80053k56734m44495m60533
13183A103505k61222j96066k20869j15494j25646o5289k4873r128P5864N0725
13173B11507m0976q3160r5997n3224p921J74315O7523n7651j02371n6235L1451
13162a2739J2922J92R9882o898p3888R7618Q329P96O6185L7267L669m0604j05290
13149H7441j3503J070j7000m5167j0428o721M8749O8287M7028M7830o5462p7281
$$ plain form
13226 129788 199609 170009 111372 56299 925 -9127 73346 82167 153543 149144 62120 138225
13214 138225 232661 283887 198653 170459 219301 211893 206868 325452 468087 365800 297971
13203 297971 403746 565811 695416 783031 862343 1003336 996645 1011298 1202977 1415198
13193 1415198 1576435 1850709 2231800 2592295 2604994 2445320 2265267 2008533 1564038 1103505
13183 1103505 842283 646217 425348 309854 184208 118919 94046 84918 160782 211507
13173 211507 170531 87371 -8626 -61850 -69771 104544 172067 114416 12045 -44190 -12739
13162 -12739 183 375 100257 93359 19471 117089 125418 126214 192399 229666 233335 192731 87441
13149 87441 73938 75008 58008 12841 2413 -4308 44441 112728 159756 207586 142124 64843
13137F4843j3893j6157l5973K9735O418q629p0813J1933q949R527j8578P2031
13125B1495J6981J7815n4479J5303Q1207m6707j79118n1295N6367J9413L7021
13114f5997O2098J28097N7994o6842m9444L2784l9437j17769m3028M6621q5537
13103a40460l9463O2088M2081R063M7880P3978J04003O9162l5849p2727o2754
13092E7002m6450L8408j05850q7269k6816O305Q1693P0780P3603L6048j311j91
13080I5952q3535K0098l7201n8545l5898J5611J41140O4121j38764l7494J3198
13069d1317Q1358k3072o8837k474M6953j1029p835M938j5830j3122l9453m2166
13057a31886O7233p1651J2517J17605n8758k420K7195n064J05207N9922L4787
$$ plain form
13137 64843 50950 34793 -1180 28555 34973 26344 -44469 -32536 -41485 -31958 -50536 21495
13125 21495 38476 56291 1812 17115 98322 51615 -127503 -178798 -122431 -103018 -65997
13114 -65997 -3899 124198 182192 115350 65906 98690 59253 -58516 -101544 -54923 -140460
13103 -140460 -179923 -117835 -75754 -66691 -18811 55167 159170 228332 192483 119756 57002
13092 57002 10552 48960 -56890 -144159 -170975 -164670 -82977 -12197 61406 97454 96143 95952
13080 95952 12417 32515 -4686 -63231 -99129 -83518 57622 121743 -17021 -54515 -41317
13069 -41317 40041 16969 -51868 -54342 -7389 -18418 -26253 -21315 -37145 -50267 -89720 -131886
13057 -131886 -64653 -136304 -123787 -6182 -64940 -67360 -40165 -45229 59978 119900 154687
13046A54687L077j09595j65592l7952J31068Q0106k7178J0253r525P1022l2873
13035F7498K4475j04051n1885J15794R925M465m5406k5503k7835P5888K9375l3083
13023C9657J7381o6257m3659N5882k7434j31809l207O3227o6193Q971M3641m9257
13011a59057r908N6095j4636Q0499P0033Q1991M4304p6879k591l5648j42435o5332
12999a73564O7036J36860J5274o5077M5145M6159k570M4524L8760J6247P502K0292
12987A96588l4990j74430j7458M9401R9431j20297m1719O4716J4408M594K1179
12976F1423l8773o1640M7495O4476L3480j561K2971k0289p8905r4008N2457K4933
12964A2059N572N043K4529r440N8980N1531n9409o2366o6343K2385k10J6738r7827
$$ plain form
13046 154687 157764 48169 -117423 -155375 -24307 55799 28621 38874 29349 100371 67498
13035 67498 91973 -12078 -63963 51831 61756 66221 20815 -4688 -32523 43365 72740 39657
13023 39657 57038 -9219 -52878 3004 -24430 -156239 -159446 -96219 -162412 -153441 -109800 -159057
13011 -159057 -168965 -112870 -127506 -47007 23026 105017 149321 72442 69851 34203 -108232 -173564
12999 -173564 -106528 30332 45606 -19471 25674 71833 69263 113787 152547 168794 176296 196588
12987 196588 161598 -12832 -30290 19111 118542 -1755 -43474 21242 35650 40244 61423
12976 61423 22650 -38990 8505 72981 106461 104900 127871 107582 28677 -65331 -12874 12059
12964 12059 17631 22674 47203 37763 96743 148274 88865 26499 -39844 -17459 -17669 -931 -98758
12951i8758k4625p076L8439Q3539O9981n2224n5480M2077L0114m2295p7511r0504
12939a84323l2208L1560K8183O3797O1050k1452k317r1977q805J02753n9281k8841
12927a41861m9014J9033R0280j2958n2259N2577p2369k1000O3404j4874J18572
12916b0469R3809J5646K1428K1562L2008p1339l4644J6885k3510R0135l9787p6285
12904B5439L3666k2071r0483P842r6060K0269J2385q380J61447K0540j7206l0207
12892A7181r3409P754Q2221M6190J8054M9073m6104q4376J15111J03594r6206
12881A19083j73228l0095J974N7105J15713j7388o2291o4495J83M7344L1050P9476
12869A04431p4450j57891J307K2191J0424J3959l771K1233P8779J00667J9809
$$ plain form
12951 -98758 -123383 -130459 -92020 -8481 61500 9276 -46204 -4127 25987 -16308 -93819 -184323
12939 -184323 -216531 -184971 -156788 -92991 -31941 -53393 -55710 -147687 -156492 -53739 -113020 -141861
12927 -141861 -190875 -171842 -81562 -94520 -146779 -94202 -166571 -187571 -124167 -139041 -20469
12916 -20469 73340 88986 110414 131976 163984 92645 58001 74886 51376 141511 101724 25439
12904 25439 59105 37034 -53449 -45607 -141667 -121398 -109013 -117393 44054 64594 47388 17181
12892 17181 -76228 -68474 13747 59937 77991 127064 80960 -3416 111695 215289 119083
12881 119083 -54145 -84240 -82266 -25161 90552 73164 10873 -53622 -53439 -6095 24955 104431
12869 104431 29981 -127910 -126603 -104412 -93988 -80029 -83800 -62567 16212 116879 136688
12858A36688j72182k3214K7231R1806J25306n9980j80790j02619L1844J00434
12848b5476p3318O8618J47682M466r6495m5751l4487J30709O0254o9230N6552
12837A23524p0163j17263L3993j4236P013N9040n6047k1286l096K3141j3225R514
12825c9091n6999j0992R129N5371k6284M1424K1324m7376j14147K9375N1485k087
12813h8868n2416n1064L6764J06188N8861m9823K1669K4533q440k4580J15986
12802H8810L1993K2277l2038j3549j7571k0494M499O2509n0196l8278M2514q2830
12790b354r3267L7381K8799q1308k9034O3231J6889q4346R005P7588J20933P3190
12778A36707j12493o7005k6506k1099p3409P0247R8494k386q033M6506L8335q655
$$ plain form
12858 136688 -35494 -58708 -31477 60329 185635 125655 -55135 -157754 -125910 -25476
12848 -25476 -98794 -30176 117506 121972 25477 -20274 -54761 75948 136202 66972 123524
12837 123524 53361 -63902 -29909 -44145 -37132 21908 -34139 -55425 -58521 -35380 -48605 -39091
12825 -39091 -96090 -107082 -97953 -42582 -68866 -27442 -6118 -53494 -167641 -138266 -86781 -88868
12813 -88868 -141284 -192348 -155584 -49396 9465 -40358 -18689 5844 -2596 -27176 88810
12802 88810 120803 143080 111042 97493 79922 59428 63927 126436 76240 37962 80476 -2354
12790 -2354 -95621 -58240 -29441 -110749 -139783 -76552 -59663 -144009 -135004 -57416 63517 136707
12778 136707 24214 -42791 -69297 -90396 -163805 -93558 4936 2550 -5483 41023 79358 70703
12766G0703O3030l4498r5903K5701J08110q9321o0830j4555J32546M0264r2413
12755E2834j50258j04891J07719Q3497j5544k61Q0367l8642L1583p7767o9278
12744a00641J27114R391p8587K3811P1522N4463m8926l951J19228n2364j34588
12733a3528p4475n1658n0399J02527Q3574K0284k0983j20749n2562J28461k983
12722e2491l0788k7792n2990o2629K2953J23532J447J9423L5741n9552m1445j6666
12710a41257k6383K1519M7203J41642J26138m4140j10173o9958n2582K0304L6052
12699e1635K5413N0134L2629J773J05604p7783j29166J0845M6557l8766k9452
12688e3847j6716N7121L9880j7609j48723q3527K4786P0131J19594K9248k8385
$$ plain form
12766 70703 133733 99235 3332 29033 137143 47822 -13008 -27563 104983 145247 52834
12755 52834 -97424 -202315 -94596 -11099 -26643 -26904 53463 14821 46404 -31363 -100641
12744 -100641 26473 35864 -42723 -18912 52610 107073 58147 54196 173424 121060 -13528
12733 -13528 -88003 -139661 -190060 -87533 -3959 16325 -4658 -125407 -177969 -49508 -52491
12722 -52491 -83279 -111071 -164061 -226690 -203737 -80205 -78758 -59335 -23594 -83146 -124591 -141257
12710 -141257 -167640 -146121 -98918 42724 168862 124722 14549 -55409 -107991 -87687 -51635
12699 -51635 -26222 23912 56541 58314 163918 86135 -43031 -32186 14371 -24395 -53847
12688 -53847 -70563 -13442 26438 8829 -139894 -223421 -198635 -128504 -8910 20338 -8047
12677h047N5095R5951m5750Q5396n2093j37636j56976J0208J16235K970O2591
12666B7944J29210R4813j15105j25923o9637J17822k6975J13035l0826n8487n212
12655E0659j9469n4734p1314j7804l9985j8915O9711J30274M0853k3432o8338
12644b2494R572N0028j09483k1160N3656J52459R556j26378j361P3506q7581k2859
12632d2539N3822o157K3631m1773K4887Q867l1280P6826L8700k0238K0287R92
12620A06025K3797L218q6300r17J11796N6110n8477j4552p9745m0294n8620q0100
12608a18059n546L2478K6378n3578m6963j6350K7233J49375J10708o1163m2564
12597A949P0219q947k2361l1395N422q5739q1677L0556N8742n6359N9383P1874
$$ plain form
12677 -8047 47048 142999 97249 182645 130552 -7084 -164060 -153852 -37617 -34647 27944
12666 27944 157154 251967 136862 10939 -58698 59124 32149 145184 114358 55871 50659
12655 50659 31190 -23544 -94858 -112662 -152647 -171562 -101851 28423 69276 45844 -22494
12644 -22494 -12922 37106 -72377 -93537 -39881 112578 122134 -4244 -5605 67901 -19680 -42539
12632 -42539 11283 5126 28757 -13016 11871 20738 -10542 66284 104984 84746 105033 106025
12620 106025 129822 133040 46740 45823 157619 213729 155252 140700 60955 20661 -37959 -118059
12608 -118059 -123605 -91127 -64749 -118327 -165290 -181640 -154407 -5032 105676 44513 1949
12597 1949 72168 63221 40860 9465 14887 -70852 -152529 -121973 -63231 -119590 -60207 11667
12585A1667n5711l3153N5783Q2644L9972j17676j14533j1751L0040Q7070M8690
12574B3042k4757N4360m6655O5880k6760q1523l2251J4480o5403K5457L9585N6751
12562B206M195M8755K6759O7244q6005j13319k321O7125M9016N1414o7889j47056
12550i9876M237n406N5897P0493q5542o3696n2176O6136J50439N2488O309j24385
12538b5082j15775j80477J13500J91781J3501m2470l4967P1024L8187j11787n4582
12527a37147J02218K698R586K8405J7616L2569m3238R1031j0322o4266l7194J5464
12515G420p4397k5532R7211m9748p385M699P0118l1644N3213K2381j29508q5646
12503a48818Q7807k8253Q711l6274R3037P2600q6874o7802l3125J4558j907Q7836
$$ plain form
12585 11667 -44044 -77197 -21414 61230 101202 -16474 -131007 -142758 -112718 -25648 23042
12574 23042 -1715 52645 5990 71870 45110 -36413 -68664 -54184 -119587 -94130 -54545 2206
12562 2206 6401 55156 81915 149159 63154 -50165 -52486 14639 63655 115069 47180 -99876
12550 -99876 -95639 -101045 -45148 25345 -60197 -123893 -176069 -109933 40506 92994 99303 -25082
12538 -25082 -140857 -321334 -207834 -16053 -2552 -45022 -79989 -8965 29222 -82565 -137147
12527 -137147 -34929 -32231 -22645 5760 23376 55945 12707 103738 93416 29150 -8044 7420
12515 7420 -66977 -92509 4702 -45046 -52431 -47732 22386 -9258 43955 66336 -63172 -148818
12503 -148818 -61011 -89264 -80553 -116827 -23790 48810 -38064 -105866 -138991 -124433 -126340 -38504
12491c8504P5256O2592k0273n1940J6052j7254n0368j22725J874J09855J3959
12480b1476k951M5914J1461M054k4117q7916K2477K041J5807R0946l6799n7357
12468c7916o9390L7992J07239j93q0822o24O6501j60229m0346J04813L8157N9432
12456B4614j911j69370o1134J6082N0394n9386K6746P4859N3266Q188L0377K8976
12444B1701k7331N1072o2343l6585r761p9979m0301n6117M1661J30650q8149j7961
12432a73443J21908J6351n6076p288N1306J1670j11227J5965L7924m119J1199
12421h5830K7102P7062k3782n0391J4652r371L3940m0855O7137P3231K109l8207
12409D6797l8524r364j299N7201m6117j7299R7241J0944o828J8797o7880p9438
$$ plain form
12491 -38504 36752 99344 79071 27131 43183 25929 -24439 -147164 -145290 -35435 -21476
12480 -21476 -24427 21487 32948 37002 12885 -75031 -52554 -50513 -34706 56240 19441 -37916
12468 -37916 -107306 -69314 37925 37732 -43090 -43714 22787 -137442 -177788 -72975 -34818 24614
12456 24614 22703 -146667 -207801 -191719 -141325 -200711 -173965 -99106 -45840 -37652 -7275 21701
12444 21701 -5630 45442 -16901 -53486 -63247 -143226 -183527 -239644 -197983 -67333 -155482 -173443
12432 -173443 -51535 -35184 -91260 -98548 -47242 -35572 -146799 -130834 -92910 -97029 -85830
12421 -85830 -58728 18334 -5448 -55839 -41187 -50558 -16618 -57473 9664 82895 85004 46797
12409 46797 8273 -1091 -2390 54811 8694 -8605 88636 99580 92752 111549 43669 -35769
12397c5769L5412L3767j01123N9473Q3054R143J10813j972j74536q2630J9715
12386d4653O7260L3528m5436M3257N0581l9342r004k2290o1668n7826N0529k3124
12374e8188L8105Q4867K6425J5520r1478k9648J82o8282o4129Q7860M7655N0797
12362C9686j142k9340L934m4779M4103K0267R848m7095m2675O1287L8821J1932
12350F4847R5262L5029o1396q7505r2288o7583k9798J04108J17478k9303m2217
12339F634l883K2223k4551k2549j7869K2024K0304K1801o636p5736q7445q1177
12327b26860J79596P4917L1093L2201J1604r900n006n5954j4297L0672N371Q3440
12315A36877M2966o1177r8083m842M1746O7490l8361P7073J8752j08555j11921
$$ plain form
12397 -35769 -357 33410 -67713 -8240 74814 83957 194770 192798 18262 -64368 -44653
12386 -44653 22607 56135 10699 53956 104537 65195 56191 33901 -27767 -85593 -35064 -58188
12374 -58188 -20083 64784 91209 106729 15251 -14397 -14215 -82497 -146626 -58766 -11111 39686
12362 39686 38544 9204 13138 -31641 12462 32729 42577 -4518 -47193 14094 52915 64847
12350 64847 160109 195138 133742 46237 -46051 -113634 -143432 -39324 78154 48851 6634
12339 6634 2751 24974 423 -22126 -39995 -17971 2333 24134 17498 -58238 -145683 -226860
12327 -226860 -47264 27653 58746 90947 102551 92651 87645 31691 17394 48066 53437 136877
12315 136877 179843 118666 20583 15741 57487 124977 86616 163689 182441 73886 -38035
12304c8035M8875M6224L5334M3458l6069L6122l8682q2514m8328J5408j38645
12293a56852n7523J116Q4835R9808J7991L1228O092O034M7314j27991j04515J8889
12281a33574R2869P0765n3028n5106J181K4315J7712m1209M5793L8780r0113j6579
12269i8194Q6553M7521K219M671n6445l5426j2835J663q940k3801N0991J1888
12257c0135O2734L7522J3805j04275r0713J7488n6643n2937J4007n1839Q0677
12246a60309K9655P5819K3334p8620m057J01277m7904N4095N2056R732l7081j24606
12234a06609R4756K1254K4420J14Q222k5385L9503M2504K5595L1781j91967l9256
12222g5068m78m932N1093M3035M7769M5037J6556j06817l9583J7855N1744K7290
$$ plain form
12304 -38035 10840 57064 92398 135856 99787 135909 97227 14713 -33615 -18207 -156852
12293 -156852 -214375 -213259 -128424 -28616 -10625 20603 26695 32729 80043 -47948 -152463 -133574
12281 -133574 -40705 30060 -22968 -78074 -76893 -52578 -34866 -76075 -30282 8498 -81615 -98194
12269 -98194 -11641 35880 38099 42770 -13675 -49101 -61936 -60273 -69213 -93014 -42023 -30135
12257 -30135 32599 70121 83926 -20349 -111062 -93574 -150217 -203154 -189147 -240986 -160309
12246 -160309 -130654 -54835 -31501 -110121 -114178 -12901 -60805 -6710 45346 55078 17997 -106609
12234 -106609 -11853 9401 33821 33935 42157 16772 56275 98779 124374 156155 -35812 -75068
12222 -75068 -75546 -80478 -29385 13650 61419 106456 123012 16195 -23388 -5533 46211 73501
12210G3501j1039J03278p3104m4660r0251j2033Q7085N4981m655N3688o8105l526
12198F5160L7144j655k8354r624j1103P5861O2847n8082l1633j2477p6412J0397
12186B2069L9141o4371j1414M8151j0141M3236Q60j5403O9833J3132K1653Q2194
12174B38940N4184L8402J9991L6367J936o2855p8689l6086K0363J52156O1633
12163D46342L1806N9204J9826R6998q2033L3162N8905M1959O6104m8010M1118
12152G65381l2214L1976L64l969J14929M2307j41383k59721M5991K7919n8142
12141E33438l7125l8433M3619J16303N8417q892q808k8983l2120J7475m6760p8067
12129D90064M7629l9988j9286p9939j1746l991N653l1821r7494j7610L9036o2905
$$ plain form
12210 73501 62462 165740 92636 47976 -42275 -54308 32777 87758 83103 136791 68686 65160
12198 65160 102304 100649 72295 62671 51568 127429 190276 132194 100561 88084 11672 22069
12186 22069 61210 -3161 -14575 33576 23435 66671 67531 52128 121961 135093 156746 238940
12174 238940 293124 331526 351517 387884 389820 326965 248276 212190 232553 384709 446342
12163 446342 478148 537352 557178 654176 572143 605305 664210 706169 772273 724263 765381
12152 765381 733167 765143 765507 761538 876467 918774 777391 517670 563661 591580 533438
12141 533438 496313 457880 501499 617802 676219 667327 658519 629536 597416 614891 568131 490064
12129 490064 537693 497705 478419 398480 386734 382743 388396 356575 259081 241471 280507 217602
12117B17602j0759K2219O8191Q347l4199j87256o1215J1355Q9492o8282M5112
12106A00607j03746r9755J498M9971L8108K390j0814M209q0047M3531P123J26934
12094H0009K4473m0576k7255k7249P700m4472q2499m2272P1621N3571L9874p6125
12082f3200j26436K23J00335K0057N5373J7792M8948n5599l5681l3368j7489k6950
12070a15995r1035P8622J43355K151J5803m2560K1314R936L6507l5856m169p4770
12058e6697q2309M6514L7703k2792m8576n873M7968j0366m0561p2257j2360J34096
12046h5510J53167K9125K3401m6792O083o6466k5695q7031K1291k2064M5706K0605
12034c4180q415K7893n2875O9916O6807q5238J1676M5375J8276J6054j28886q2812
$$ plain form
12117 217602 206843 229062 297253 305600 271401 84145 22930 34285 123777 55495 100607
12106 100607 -3139 -102894 -101396 -51425 -13317 -10927 -21741 -17532 -97579 -54048 -46925 80009
12094 80009 104482 63906 36651 9402 17102 -27370 -109869 -152141 -80520 -26949 12925 -63200
12082 -63200 -189636 -189413 -89078 -69021 -13648 4144 53092 -2507 -38188 -71556 -89045 -115995
12070 -115995 -207030 -128408 14947 17098 32901 -9659 11655 21591 58098 22242 18073 -56697
12058 -56697 -139006 -92492 -54789 -77581 -126157 -132030 -84062 -94428 -134989 -207246 -219606 -85510
12046 -85510 67657 96782 120183 73391 79474 13008 -12687 -99718 -78427 -100491 -54785 -34180
12034 -34180 -42595 -14702 -67577 2339 69146 -16092 -4416 40959 59235 75289 -53597 -136409
12022a36409q5952n6698J07181j5061l1848j3726M0384L2710P33j1814K7482M5875
12010i7143l827L8982M5612j7903m8566N0216j5461m3955k2326m5027M0895l7814
11998a56317J05819K03627N5347m3956N718m866p3583m58J72p0893j24674m082
11986a08146o577Q1189J31701o6182l3604l4338O751l2503Q6829j350M0611m8056
11974A6325J5251k0677Q305q447J952j29235L4465R8693J0955m4559N9952k5600
11962A7380L0287K9730N7190J1857k9001l6007n3040p482Q9527q1528l4238O262
11950I37K765Q7218N5464Q9707n8019k3739L6982p7899j53190q6646L9299J05817
11938A8696J20615p9628j60028n7726Q0443O7799m7917k4375m1457k1979K2968
$$ plain form
12022 -136409 -222361 -279059 -171878 -186939 -218787 -232513 -192129 -159419 -158686 -170500 -143018 -97143
12010 -97143 -100970 -61988 -16376 -34279 -82845 -32629 -48090 -92045 -114371 -159398 -118503 -156317
11998 -156317 -50498 153129 208476 164520 170238 165372 91789 91331 91503 20610 -104064 -108146
11986 -108146 -114723 -33534 98167 31985 -1619 -35957 -29206 -61709 25120 23770 64381 16325
11974 16325 31576 10899 19204 10757 12709 -116526 -82061 16632 27587 -16972 42980 17380
11962 17380 47667 77397 134587 146444 117443 81436 28396 20914 110441 28913 -5325 937
11950 937 3702 90920 146384 236091 178072 154333 191315 113416 -39774 -126420 -87121 18696
11938 18696 139311 59683 -100345 -158071 -77628 -9829 -57746 -82121 -123578 -145557 -122589
11927a22589O2436J16723Q1287q4882j00262o5863j8931K5697O8038O7922o8440
11916c8864r3542O2045N3190k2252J1796K985n1736M3850K3070q825K5778m785
11904B710J1654O9317n271n1434M8023R715n5938L0127m5005m2702N643M9689
11892B6528J20838L8568j63123m4851N9934n3612P915n116j9151J6381n6466o142
11880g8297N1383K2281r7608n2211l3871l5178O3718J09649J0617Q9354N1651
11869A01488p5405o0475R2862N0514m9252r4605J3304m9954o93K6098k315N3788
11857E355O214K6492O006l4116o5799Q9173M3632n1315m7073J6571p1058r4439
11845a70357K1892K2380L4376l9748O524J07911O3226J6448r2515M0784K3973
$$ plain form
11927 -122589 -60153 56570 137857 52975 -47287 -113150 -132081 -106384 -38346 29576 -38864
11916 -38864 -132406 -70361 -17171 -39423 -27627 -24642 -76378 -32528 -9458 -18283 7495 2710
11904 2710 14364 83681 78410 26976 74999 84714 28776 58903 13898 -28804 -23161 26528
11892 26528 147366 185934 22811 -22040 37894 -15718 -7803 -12919 -32070 -15689 -72155 -78297
11880 -78297 -26914 -4633 -102241 -154452 -188323 -223501 -159783 -50134 -39517 49837 101488
11869 101488 26083 -34392 58470 108984 59732 -34873 -21569 -71523 -72216 -46118 -48433 5355
11857 5355 11569 38061 44067 9951 -55848 33325 76957 25642 -21431 -4860 -75918 -170357
11845 -170357 -148465 -126085 -91709 -131457 -124933 -17022 46204 62652 -29863 10921 34894
11834C4894o5087q9363N6544J22993K585k8291k1573L2917m2971k1589r9568l7493
11822a56002K4202k2083j10393K8541K7002L8374L9069R7919J60859N1580r204
11811A69864K660r6364q5294L6541Q44o2590l4387p211L7648N2249Q566P9748
11799A02274L3606n5167l3661o2438k502P7110P061J573O0918N2804j15095j39183
11787g2700p8605N6607J53452L3029K5078l6546P805L1355k6099q1473N63l9312
11775b6846Q8789o3088q0300J0421L5986l6252M1481N2268k2395j13145m7468
11764a60549P9311K9380n7896M308J95184R0321o0238j43469k2153M4085P0160
11753F8444O1063r0686j19220J7671O0313m7664K8682l234J09983o1450m726N6778
$$ plain form
11834 34894 -30193 -119556 -63012 59981 62566 34275 12702 45619 2648 -18941 -118509 -156002
11822 -156002 -131800 -153883 -264276 -235735 -208733 -170359 -131290 -33371 127488 179068 169864
11811 169864 172524 76160 -9134 27407 28251 -34339 -68726 -75937 -38289 13960 22526 102274
11799 102274 135880 80713 47052 -15386 -17888 59222 66283 67856 128774 181578 66483 -72700
11787 -72700 -151305 -94698 58754 91783 116861 80315 88120 119475 93376 11903 12466 -26846
11775 -26846 61943 -1145 -81445 -71024 -35038 -71290 -29809 22459 64 -113081 -160549
11764 -160549 -81238 -51858 -109754 -105446 89738 180059 119821 -23648 -45801 -1716 68444
11753 68444 129507 38821 -80399 -62728 -2415 -50079 -21397 -24631 85352 23902 19176 75954
11741G5954k4519j22761l4200K3610k0858P932o396N9730j12154j5833J26845
11730d2650L9697L363j0643P3357p31k2401O0801J629K5950R388n0625r3381o1819
11717f8065L8127K846k2586j4554J39749Q1966n040o0799k4013j6013J2390N3796
11705A17804l4308n5594M0563k6521Q573J2982n7978o3761j46261O4714J19251
11694b0536J11104M7551P8934k744j20968q0697L3429J22294K9098j93040q3140
11683g8715o4414P5174K7292n2146O2083K4720r610M9484j06302r3961J5359J52900
11671A864M942L1762k7590J1452q1817J0025L7773j9472j22558j08167J12402
11660a49384J41374N962R169O7087j43195p6782J69948K3634o1101M7499O6577
$$ plain form
11741 75954 51435 -71326 -105526 -81916 -102774 -94842 -101238 -41508 -153662 -169495 -42650
11730 -42650 -2953 410 -10233 63124 62393 39992 100793 102422 128372 137760 87135 -6246 -68065
11717 -68065 -29938 -27092 -49678 -64232 75517 157483 152443 91644 67631 51618 64008 117804
11705 117804 83496 27902 68465 41944 50517 63499 5521 -58240 -204501 -139787 -20536
11694 -20536 90568 138119 217053 214309 93341 12644 46073 168367 197465 4425 -78715
11683 -78715 -143129 -67955 -40663 -92809 -30726 -6006 -15616 33868 -72434 -166395 -151036 1864
11671 1864 6806 38568 10978 22430 -59387 -49362 -11589 -31061 -153619 -261786 -149384
11660 -149384 -8010 -2048 7121 74208 -68987 -145769 24179 47813 -13288 34211 100788
11649A00788p6417O594l9505o4829r7589k094Q9915m385P7880l258j9928k6678
11637e9506L1484j7872m528K5028M5207m3330k5180J5254L9732k0722O1648O1261
11625A08476q343N2946N2276J7412q466p9766o4834n4004o4421k5132m3884N5964
11613f1776Q4544L3347k8408L7717N4634k274j16781O1315J2964j6683l7147K6025
11601D7477k0692j1511J2499N3386M6524j21486o1698j854P3939J11176j10161
11590A7599j28464j3900O03o715N5528R0683J7435N5918L3175m0488l1977q074
11578D1323L865K9007k887l2855O123o53j13650p6412O5561J36182R8227j7022
11566A36809n1481J2410J2445l7327L210k1691n7887J9m8843m6020J8878J21038
$$ plain form
11649 100788 24371 30965 -8540 -73369 -170958 -173052 -83137 -87522 -9642 -12900 -32828 -59506
11637 -59506 -28022 -45894 -50422 -25394 19813 -23517 -48697 -33443 6289 -14433 47215 108476
11625 108476 100133 153079 205355 222767 214301 134535 69701 15697 -48724 -73856 -117740 -61776
11613 -61776 22768 56115 27707 65424 120058 117784 1003 62318 75282 58599 21452 47477
11601 47477 26785 15274 27773 81159 127683 6197 -55501 -57355 16584 127760 17599
11590 17599 -110865 -124765 -124162 -130877 -75349 15334 32769 88687 121862 81374 49397 41323
11578 41323 45188 74195 71308 38453 44576 43923 -69727 -146139 -80578 55604 153831 136809
11566 136809 85328 97738 110183 72856 76066 54375 -3512 -3493 -52336 -98356 -79478 41560
11554D1560N6612k1126q3952J1192J21447q4991j21948l9671m1796J36137Q3232
11543E6696q2403m0410J038l6198j3699L5378n1699L2005p088O57J31936K5414
11531E1627j17477r273m9246P6587L0919p1910n0637J0759Q1041J241k6053P7292
11519D870j6414J4061m3817k5033N9014j16921r8940P5317P9964K8041J920N1463
11507A3525k5898o5269r7815P9447J33358J40725j09885k20227L4698Q7756K8469
11496a116p775l6319J07417N4506K0951m0641j2013m2164o4457j07462k2539O2549
11484h9063j8286r60Q5654O7483m2970q9863j267O0139q631n0997m4158k3081
11472a56000J29393P601q3463k4893L0704L7233k4437K8007j4224m7694R094M2763
$$ plain form
11554 41560 98172 77046 -6906 4286 125733 40742 -81206 -120877 -162673 -26536 56696
11543 56696 -25707 -66117 -65079 -101277 -114976 -79598 -131297 -99292 -106380 -105723 26213 51627
11531 51627 -65850 -75123 -124369 -47782 -16863 -88773 -139410 -128651 -47610 -46369 -72422 4870
11519 4870 -11544 2517 -41300 -66333 -7319 -124240 -223180 -147863 -67899 -39858 -37938 13525
11507 13525 -12373 -77642 -175457 -96010 37348 178073 68188 -152039 -117341 -29585 -1116
11496 -1116 -8891 -45210 62207 116713 137664 97023 85010 42846 -21611 -129073 -151612 -89063
11484 -89063 -107349 -108309 -22655 44828 1858 -88005 -89272 -29133 -37764 -88761 -132919 -156000
11472 -156000 -26607 -19006 -102469 -127362 -96658 -59425 -83862 -55855 -70079 -117773 -108679 -65916
11460f5916N0750M8294K9379o2972n5776O4013O8138m2809Q4749L2454r2693j29552
11448g1941k3014l2609L0507j9510j02469K7365K3664j1497J66227O0479o941
11437D0261K2931K2368j11817M7014P5104K1270k2752J9752j10598j0701L4889
11426B7721J2896K4044p957N9009k5768K1035P3564M6036k8127j49047j77780
11415a24374J874M6867P9214K6131O6883j1039R9382J2126r9580r4560o6264j03295
11403a66635l1072J68395M5954j09631J5717q440n7014J12503K4962l9306Q806
11392c5761M7856m4106n1749l5927o5016K3783K9154q30M5905P0070M1893j2901
11380A2371N030r3710l7005N6685k0887P9009L0472K9670O8759K7861k2009n399
$$ plain form
11460 -65916 -15166 33128 62507 -465 -56241 7772 75910 33101 117850 150304 57611 -71941
11448 -71941 -94955 -127564 -97057 -116567 -219036 -191671 -168007 -179504 -13277 47202 40261
11437 40261 63192 85560 -26257 20757 95861 117131 94379 114131 3533 -7168 27721
11426 27721 40617 64661 56704 115713 89945 110980 184544 230580 202453 53406 -124374
11415 -124374 -122500 -75633 3581 29712 96595 85556 184938 197064 97484 2924 -63340 -166635
11403 -166635 -197707 -29312 16642 -92989 -77272 -85712 -142726 -30223 -5261 -44567 -35761
11392 -35761 12095 -32011 -83760 -119687 -184703 -160920 -131766 -132596 -86691 -16621 25272 12371
11380 12371 17401 -76309 -113314 -56629 -77516 1493 31965 61635 130394 158255 136246 130847
11368A30847j28156q375O3165o566P3686L5949k3122p0874j46476j53570M9371
11357a84121J06799N8618r7154J8003J08542J13020L4855o5507n4337n1829q247
11346b1358k9642J3789m7261q274N8950p2494l773R0897L1600K4530l8065N7519
11334E6418P7647j61390o3167Q3822L0697p2633n0277p747M2860L4164O814M0209
11322A7417O2740p4611j00538J7823Q9348n0183J8569K6881l5616K1792m0007
11311d6385o3887l1772M7147O9186M9895J7162O149M9049l659p4270O4698o8892
11299A4421n9680o3735J39476K3010J0438j04827m0982R6751J12933L3254M8019
11288B09078l4687o167o2077p1581n8481J2738j23519j63196j8570J57339J07881
$$ plain form
11368 130847 2691 -5684 57481 50915 124601 160550 137428 66554 -79922 -233492 -184121
11357 -184121 -77322 -18704 -115858 -97855 10687 123707 158562 93055 38718 -13111 -21358
11346 -21358 -51000 -37211 -84472 -92746 -33796 -106290 -110063 -19166 12434 36964 -1101 56418
11334 56418 134065 -27325 -90492 -6670 24027 -48606 -98883 -106630 -63770 -29606 -22792 17417
11322 17417 80157 5546 -94992 -77169 12179 -38004 -19435 7446 -28170 -6378 -46385
11311 -46385 -110272 -142044 -94897 -25711 24184 41346 47495 96544 92885 18615 83313 14421
11299 14421 -45259 -108994 30482 53492 63930 -40897 -81879 14872 127805 161059 209078
11288 209078 174391 168224 106147 34566 -23915 -11177 -134696 -297892 -316462 -159123 -51242
11277e1242O5608l2220R7221J08191p3027o1062Q237O6936K9152L9322m4238l5193
11265A17685M0504j05374k0323R151K4717K5416k9905M1502o0441j40562q831
11254a06461M0098M7518J02966o8485r8285l9654m2297o238P803L755J11559J17692
11242F9971K4890M5619p6833r5938o7677Q6104K5107m9624j9391k9231N4950K8331
11230c722K1433n6427m4634J8872O737Q679Q0608J1644k949p775n8963m6333j32982
11217b05812k9308J52484J78056k6047o7501M4957L4641L6J1457n1836L4885O5433
11205A41445K3625j07879J4986P7009N6218n4323k0968Q6434Q5758m1854j4367
11194B46084q0171k9757n8601m7926j18613o975K0504P5296m9469K4509l356J81288
$$ plain form
11277 -51242 14366 -17854 79367 187558 114531 53469 61706 128642 157794 197116 152878 117685
11265 117685 158189 52815 32492 41643 66360 91776 61871 103373 42932 -97630 -106461
11254 -106461 -66363 -18845 84121 15636 -82649 -122303 -164600 -170838 -163035 -159280 -47721 69971
11242 69971 94861 140480 63647 -32291 -99968 -13864 11243 -38381 -57772 -87003 -32053 -3722
11230 -3722 17711 -38716 -83350 -64478 -57741 -49062 31546 43190 40241 32466 -26497 -72830 -205812
11217 -205812 -235120 -82636 95420 69373 1872 46829 81470 81506 92963 41127 76012 141445
11205 141445 165070 57191 72177 149186 205404 151081 130113 216547 302305 260451 246084
11194 246084 165913 136156 77555 29629 -88984 -95959 -75455 -159 -49628 -25119 -28475 152813
11182A52813P1528k5928j0961N2942k3341P635k1299o2282q1569N8017j08395
11171I160q5338K5798K4267k9730j9113P1513L8766J3705L0490k3305J355M3494
11159A01062k1272j74211j785L8745l9360p9983j02659l8179L6649O3107J08936
11148a08950K4832P9784l9434k4505J2413m6896j12384M2590M2606O5571L8275
11137b6098R337K0142M6555J155r291o6331k175l7326M522R583j22744R007Q6514
11124g7150N3953N6306j04077k7274R4132K4522n9949p363N9141j0949N7266R713
11112F8271P997M4126j5323j6933Q4786k3691j97549n8780J0085Q7945J72660
11101A63594N1514k6541r7380j7372J799k2315K0811j01042q4960N5869L1552
$$ plain form
11182 152813 224341 198413 187452 240394 217053 224688 203389 141107 59538 117555 9160
11171 9160 -76178 -50380 -26113 -55843 -74956 -3443 35323 49028 79518 56213 57568 101062
11159 101062 79790 -94421 -96206 -57461 -96821 -176804 -279463 -317642 -280993 -217886 -108950
11148 -108950 -84118 -4334 -43768 -68273 -55860 -102756 -215140 -172550 -129944 -64373 -26098
11137 -26098 -16761 3381 49936 51091 41800 -24531 -26706 -64032 -59510 -49927 -172671 -163664 -77150
11124 -77150 -23197 33109 -70968 -98242 -4110 20412 -39537 -46900 12241 1292 58558 68271
11112 68271 76268 120394 105071 88138 172924 149233 -48316 -107096 -97011 -9066 163594
11101 163594 215108 188567 91187 73815 75614 53299 74110 -26932 -111892 -56023 -24471
11090b4471L3K5267N2471N2414j1994p9321j3972k1819m613Q2366k2757q2097
11078d8493k9091k4628r6868L0343M0689J37717K4723j6229j26790n6635J62252
11067c010J567m2007n9251Q0117m2727n2821O6570O5681k6177l9847n9119P6238
11055c4786J8398Q0364l0062j15020J3371J0230J596k2002O079M595J65017n3556
11043D4224J1326P0290k9866r6542n3755m610J2054k8234l5173Q879N9318J06436
11031F4347J01599m2663L4542o4196o5722M1698M3173l1753o1681j0633j185L4598
11019D2124k114L6818k6524Q515r4660k4800q732m3004L8156L4360j2722p7642
11007a30225q5951R788K1453M5615Q6288L9881J34123k584r3612p3194n6606J7976
$$ plain form
11090 -24471 -24438 829 53300 105714 93720 14399 427 -21392 -26005 56361 33604 -48493
11078 -48493 -77584 -102212 -199080 -168737 -128048 9669 34392 18163 -108627 -165262 -3010
11067 -3010 -1443 -43450 -102701 -22584 -65311 -118132 -51562 14119 -12058 -51905 -111024 -34786
11055 -34786 -16388 63976 33914 -81106 -67735 -57505 -55909 -77911 -71832 -67237 97780 44224
11043 44224 55550 125840 95974 -568 -54323 -58933 -46879 -75113 -110286 -101407 -42089 64347
11031 64347 165946 123283 157825 93629 27907 69605 112778 81025 19344 8711 7526 42124
11019 42124 40010 76828 50304 58819 -35841 -60641 -69373 -112377 -74221 -39861 -52583 -130225
11007 -130225 -216176 -206388 -184935 -139320 -53032 -13151 120972 118388 24776 -48418 -105024 -87048
10995h7048M3011j880K0828l465L7236j8264L429j8220L3030q469n8136J2152
10983d5796J777o8569j22982n199J05369Q1957K3694L6251n1703p6544M6981M2559
10971c2205o7965j41262J6639r435J72723j4524N4613K8135N1607q105m4518m1515
10959c5812R2625M8736k3510l6928m1009K9541n1301k4996M0719M9170k7944k7890
10947h599n4563j12604o7914R1746j8273k274N3982P7208l6685J6223O1833L0840
10935C0920K3541J52688q7579m4813Q7940P924J9205j05478q2058p5860m4503
10924a18073l4421J2979R8191J43464N6239N668L3606k9814M477L5466j35386
10913G2396K4741M1523k5683j5732r1458l7169K96L1830L4037Q3068m997R737
$$ plain form
10995 -87048 -44037 -45917 -25089 -28554 8682 -9582 -6153 -24373 8657 188 -57948 -45796
10983 -45796 -44019 -112588 -235570 -240769 -135400 -53443 -29749 6502 -45201 -121745 -74764 -32205
10971 -32205 -100170 -241432 -224793 -234228 -61505 -76029 -21416 6719 58326 50221 5703 -35812
10959 -35812 56813 105549 82039 45111 4102 33643 -17658 -42654 -1935 47235 19291 -8599
10947 -8599 -63162 -175766 -243680 -151934 -170207 -172481 -118499 -41291 -77976 -61753 80 30920
10935 30920 54461 207149 119570 74757 162697 170621 189826 84348 2290 -73570 -118073
10924 -118073 -152494 -139515 -41324 102140 158379 164047 197653 167839 172316 207782 72396
10913 72396 97137 138660 112977 97245 5787 -31382 -31086 744 34781 117849 112852 122589
10901A22589j16236j05545K4758N7836O7710k922m9134K8832N5218N7219r8656
10890D1669q0563N7136J6489L8398r435j5512k7725O358p8984J9769R5708J2251
10878G5559M0767L4112q0613q4421K626m5251j41281n9144J14411J04699M0972
10867B436j27893l4058L9234J6041P9518J17993k4594J2141O8118N9481L7963
10856B46380j28895p5268P85N1911p1202k0498O0707M0914M0494P311P5451J4149
10844B42239O7206J30018k3512j57290k475j2053K5322J09588J07276L4669q8794
10833D32194J06482K3142J23594R9857l4140l2111P8543Q4775M2802O9791J71567
10822A166496J70277K01104L90356L75572K11669q3821k39731k22405l76019m27371
$$ plain form
10901 122589 6353 -99192 -74434 -16598 51112 48190 -944 27888 83106 140325 41669
10890 41669 -38894 18242 34731 73129 63694 48182 20457 26815 -52169 -32400 63308 75559
10878 75559 116326 150438 69825 -14596 -11970 -57221 -198502 -257646 -143235 -38536 2436
10867 2436 -125457 -159515 -120281 -104240 -24722 93271 68677 80818 148936 208417 246380
10856 246380 117485 42217 43002 94913 23711 3213 63920 104834 145328 152639 228090 242239
10844 242239 309445 439463 415951 258661 256186 244133 269455 379043 486319 520988 432194
10833 432194 538676 561818 685412 785269 751129 719018 797561 882336 925138 994929 1166496
10822 1166496 1336773 1537877 1928233 2303805 2515474 2431653 2191922 1969517 1593498 1166127
10812A166127l60109k55183k68162m8243J0013q8216l8180k6360J8738j3423n9070
10801C7932j03457M8818k6718n2924j822L9864l5449j08988N2331R9565J0341
10790d0507j4178K5386Q0933o5456r7043j5388r8029o9695l3306P0141R7711L4194
10778a25237J785K8841j5718Q596J9799P1906J2747P40j11056l2845J2749K965
10766a24728N8854J9133j115N8228n3984j04349K1566J7797P9759q459P8464m428
10754C6738J1094j4315l0563o4012O6280M5466j01970r442q0847J44102J47630
10743A50161m7726j33057l0795K9320J547l2363j5109J9753Q875L0711N5979Q7762
10731A25058k362n9735j41398j5445J2038j0951o88K3871R5682L2501l0361o1005
$$ plain form
10812 1166127 806018 550835 282673 234430 244443 156227 118047 91687 110425 97002 37932
10801 37932 -65525 -16707 -43425 -96349 -98171 -58307 -93756 -202744 -150413 -50848 -40507
10790 -40507 -54685 -29299 51634 -13822 -110865 -126253 -224282 -293977 -327283 -257142 -159431 -125237
10778 -125237 -123452 -94611 -110329 -101733 -81934 -10028 2719 3459 -107597 -140442 -127693 -124728
10766 -124728 -65874 -46741 -47856 10372 -43612 -147961 -126395 -108598 -28839 -37298 41166 36738
10754 36738 47832 33517 2954 -61058 5222 50688 -51282 -60724 -141571 2531 150161
10743 150161 102435 -30622 -61417 -32097 -30550 -62913 -78022 -58269 -49394 -18683 37296 125058
10731 125058 122696 62961 -78437 -93882 -81844 -92795 -93483 -69612 26070 58571 28210 -32795
10719c2795O8063j418N1740N9866j6332n0922j25487L9051r937J788l0445n1471
10707i8299p1593L456K453M7203l4815q3194R868L2069Q2395m611k4309Q5100
10695e4277N7683p70R0736P1651m4511j30592K9419M4958o0279k2303J4531M4886
10683D1132p4983j35700j4609O1766k0443O1548R9218k4100o7294o5101L5872
10672a02694L15J6543J8197m5356P7653J9813j30169l8429Q959P6579o526k106
10660a07221J03184Q5910J33574m607k10447n2076O7204m7891m4088M9415j15366
10649a42409m6735P6632l0474r5954n0050J00148J19639J31331J34247l1739m6595
10638A18041q2582m4092R0831j3190L7024n1835K5171k1567j57471o0341J0907
$$ plain form
10719 -32795 35268 33850 85590 145456 129124 78202 -47285 -8234 -18171 -16383 -46828 -98299
10707 -98299 -169892 -166436 -163983 -116780 -151595 -234789 -224921 -192852 -110457 -115068 -139377 -54277
10695 -54277 3406 2636 93372 165023 120512 -10080 19339 64297 4018 -18285 -3754 41132
10683 41132 -33851 -169551 -184160 -122394 -142837 -81289 17929 -6171 -73465 -138566 -102694
10672 -102694 -102379 -85836 -67639 -112995 -35342 -15529 -145698 -184127 -175168 -98589 -105115 -107221
10660 -107221 -4037 81873 215447 210840 393 -51683 15521 -32370 -76458 -27043 -142409
10649 -142409 -189144 -112512 -142986 -238940 -288990 -188842 -69203 62128 196375 164636 118041
10638 118041 35459 -8633 82198 69008 106032 54197 79368 57801 -99670 -160011 -149104
10627a49104Q8824R3864l12m1469r2523p1167N468K7199J11871Q0122N2768K3540
10615A29081L7686k6430j49673l616P017K6530J7009R2492m1287m7366L8490m3822
10603C6111K6196m0799L4136j2568Q34M9659o4656l040m129n4106p2115R687J34959
10590D0169L806j21329n6492K1981N4356K2178k3467O2897k7762R2049k8030n0415
10578a0059P2406p7658r1781L2006Q7043J24650r042K443o1818j39137O43j0444
10566h0748j2597O1325J08870J9286M3701o988j01496j32998o7533K804Q0904
10555h5470Q2702Q2686J7224n8354j15906j07350L8979L6752j5510L5901L981
10544h4365K7805N4198N3868q0613m4425l0450J14874J19372R131j04982R5318
$$ plain form
10627 -149104 -60280 33584 33272 -8197 -100720 -171887 -166419 -139220 -27349 52773 105541 129081
10615 129081 166767 140337 -9336 -12952 -5935 20595 37604 130096 88809 41443 79933 36111
10603 36111 62307 21508 55644 43076 43910 93569 28913 25873 21744 -32362 -104477 -94790 40169
10590 40169 43975 -77354 -133846 -111865 -57509 -35331 -58798 4099 -23663 68386 40356 -10059
10578 -10059 62347 -15311 -107092 -75086 11957 136607 127565 130008 68190 -70947 -70304 -80748
10566 -80748 -93345 -32020 76850 96136 139837 132849 31353 -101645 -169178 -166374 -85470
10555 -85470 -2768 79918 97142 38788 -77118 -184468 -145489 -108737 -124247 -88346 -84365
10544 -84365 -56560 -2362 51506 -29107 -73532 -103982 10892 130264 139395 34413 129731
10533A29731L8374q2085k1451J413r3573n9398L3096K5116J017p8212k7670k1756
10521a55398l9971P4318M5621J0326N6179J3715j61489M5729J37779J1172j86525
10510a48544r24P1234n811o3892K0655O6070j7114l0035m8558J17628M530k768
10498c7529r0574m2008j4926O3383q70J19299K529o3459o410k5767P1456n3804
10486g8680O7886Q1932R1050M5273k8383l8580m1034P207p8365l813j7790n9742
10474e3039K1936o0763L1280O2600N9576o6144j1589L7711j5151o0695J826O2290
10462I838k4085k1881K5103L3765K0430K4853q85k9985n4954J5276M9713N0535
10450I7723q8105J428K2248r0404L939P4427l873n9007m90M4149j9511r5587m7676
$$ plain form
10533 129731 168105 86020 64569 65982 -27591 -86989 -53893 -28777 -27760 -105972 -133642 -155398
10521 -155398 -195369 -121051 -75430 -65104 -8925 4790 -156699 -110970 26809 37981 -148544
10510 -148544 -149468 -78234 -84045 -147937 -127282 -61212 -78326 -108361 -156919 -39291 -34761 -37529
10498 -37529 -128103 -170111 -185037 -121654 -122524 -3225 -696 -64155 -70565 -96332 -24876 -78680
10486 -78680 -10794 71138 162188 207461 179078 140498 99464 106671 28306 24493 6703 -53039
10474 -53039 -31103 -91866 -60586 2014 61590 -4554 -16143 21568 6417 -54278 -52452 9838
10462 9838 -14247 -36128 -11025 22740 43170 68023 67138 37153 -17801 -2525 47188 97723
10450 97723 9618 11046 33294 -57110 -53171 21256 17383 -41624 -42114 2035 -17476 -113063 -160739
10437a60739N0717N0128J1676k1769K052p3329l5588P8097M0499k794l8246K9756
10425f9540J16264j9285L453K7771L740O341p0312n9593k9632K2576q064k2222
10413i8503n9607L3790O2721p6763j9517j4507M647M2571J07929M4553j1196o2742
10401d6624l0831L2772P9683p7930j06737P5021J66535k7607m6372j1020r6148
10390h9258J9783L6064J9599k1150O2929M3213m932O1796M3643o2337m4438m9272
10378A5640m2272M7167O6073L9410n5816k4110l2173N087j7614K2765L211L7220
10366F4588M9632J1824M1778Q4423q0882n535l7774P0503K8662P1296N2447P3845
10354D24807K5982j5645J9775J13431N8879L4174O1085J20880J50381J3221J67086
$$ plain form
10437 -160739 -110022 -59894 -48218 -69987 -67935 -141264 -176852 -98755 -58256 -61050 -99296 -69540
10425 -69540 46724 27439 30892 58663 62403 68744 -1568 -61161 -90793 -68217 -76281 -98503
10413 -98503 -158110 -124320 -61599 -138362 -157879 -172386 -167739 -125168 -17239 27314 16118 -46624
10401 -46624 -77455 -44683 35000 -42930 -149667 -74646 91889 64282 17910 6890 -89258
10390 -89258 -69475 -33411 -13812 -34962 27967 71180 66248 128044 171687 109350 64912 15640
10378 15640 -26632 20535 86608 126018 70202 46092 13919 19006 1392 24157 27368 64588
10366 64588 114220 126044 167822 252245 171363 165828 128054 198557 227219 298515 350962 424807
10354 424807 450789 435144 454919 568350 627229 661403 722488 843368 993749 1006970 1174056
10343A174056R5364r3056p4217l6403j64382j38133q2085n0144j73867q7389R335
10332C79079q411k37462j56907l4474m8442k4205L5509O5001K0531K8065J17057
10321A35341o0327O421K5856l913J8198j281k796m8397M51N815l9562O7122M48
10308A03376q8046j16742P954Q1559M5992j3338q1080K0018j11671j00053P803
10297b44228J61222J12876j38133j24308J28300R5530K9612k2056n2372Q941n0256
10286i4872J0739o8104m4214O0885J04337L3640j2195l1461J1351N3124R0093
10275A13323J06642p1563j31524L1718k6991o9873J7792j2107j1271K0969j2551
10264d5436L5395J29359K8886j16328k4758N6518J0498l9065l2504o0829P3753
$$ plain form
10343 1174056 1269420 1176364 1102147 1065744 901362 763229 681144 631000 457133 369744 379079
10332 379079 370668 133206 -23701 -58175 -106617 -130822 -95313 -30312 -9781 18284 135341
10321 135341 75014 81435 107291 103378 121576 120295 117499 69102 69553 75368 35806 102928 103376
10308 103376 15330 -101412 -93458 -11899 34093 20755 -60325 -40307 -151978 -252031 -244228
10297 -244228 -83006 29870 -108263 -232571 -104271 -8741 20871 -1185 -53557 -44616 -94872
10286 -94872 -84133 -152237 -196451 -135566 -31229 2411 -9784 -41245 -29894 23230 113323
10275 113323 219965 148402 16878 48596 21605 -48268 -30476 -42583 -53854 -32885 -45436
10264 -45436 -10041 119318 148204 31876 7118 63636 74134 35069 2565 -58264 15489
10253A5489K1627k5757K4116o6126k6696O3114J3799p680j00915n7324L9318J09668
10241B633R9378m046j12019j6677l7293J7989J6388l8137M360J0042J6780P2983
10229C2381R0867r8085j7855K3656m483j6078m4772k7680K9844O5731L6399j03354
10217c3429M4042j4524l271j1385L4805O1085r3963r7246o4633P6398N4466P663
10205c9992M7813p518L4080n9646j21194k6501k064O2458N6974Q7759Q7693q5311
10193C4551k6309J4330J18466r093n5850r005K1969j0440j16107j14574Q6029
10182f6033L3549k3697p5390K1184M0312J16438M2450j03138o5353J98P6248L003
10170b29K0598R1862p8843k9571l4492L2318P0849l0763j63932L749P7651L2151
$$ plain form
10253 15489 37116 11359 35475 -30651 -57347 5767 19566 11886 -89029 -146353 -107035 2633
10241 2633 102011 97965 -14054 -30731 -68024 -50035 -33647 -71784 -67424 -57382 -40602 32381
10229 32381 123248 25163 7308 30964 26481 10403 -34369 -62049 -32205 33526 69925 -33429
10217 -33429 10613 -3911 -7182 -18567 16238 77323 -16640 -113886 -178519 -102121 -47655 -39992
10205 -39992 7821 303 34383 -25263 -146457 -172958 -175022 -112564 -55590 32169 119862 34551
10193 34551 8242 22572 141038 131945 76095 67090 89059 78619 -37488 -152062 -66033
10182 -66033 -32484 -56181 -131571 -110387 -70075 46363 88813 -14325 -79678 -79480 -3232 -229
10170 -229 20369 112231 33388 3817 -30675 1643 72492 41729 -122203 -118454 -40803 -8652
10158h652k1920J7968k2010L9161O0285L3585P710j14006K2284O6627j30369k7542
10146g6879M5969M398M2885n5867j24718m3532L1391M2059P938J23658R4444k245
10134H9501m7768N5238J2946N822J9927l2329K6361m8458L3411N885n1487j0180
10122E8869L0456L6709P317o2823n3648n0681Q290J9512k2090P3364P140j19027
10110f6612j00066l6235O4221K4567l7177j05528K2293M290J25373J15821m9284
10099c8337M9179J14034k6575o6592j68270p5558L5541J88007J798p528R0808
10088I6507P170J6435o1407r7251m1909Q1582k644K7408j4659o3726N9772k7769
10076b0491n0942k0227P6544L1689O566k2960j19678n9110J97R2887N2803M0094
$$ plain form
10158 -8652 -30572 -12604 -34614 4547 64832 98417 106127 -7879 14405 81032 -49337 -76879
10146 -76879 -30910 -26512 16373 -39494 -164212 -207744 -176353 -134294 -126356 -2698 91746 89501
10134 89501 41733 96971 109917 115739 135666 103337 129698 81240 114651 120536 69049 58869
10122 58869 89325 126034 133351 70528 16880 -33801 -25511 -5999 -28089 45275 52415 -66612
10110 -66612 -166678 -202913 -138692 -114125 -151302 -256830 -234537 -230247 -104874 10947 -38337
10099 -38337 10842 124876 98301 31709 -136561 -212119 -176578 11429 13227 5699 96507
10088 96507 103677 120112 58705 -38546 -80455 1127 -1517 25891 11232 -52494 7278 -20491
10076 -20491 -71433 -91660 -15116 16573 23139 179 -119499 -178609 -178412 -85525 -32722 7372
10064G372n9350J4989j1544L5102O5059j6170j13527p1488J8031P4574m9844j0820
10052a17616M8375p5479p5510l9847J33917L6382J21783Q7889j1833q5664k8652
10041f255L4844K6830j14510j39610J45618O6289j09675M9178j1129k0438R1538
10030A2680L5092r6782R305O4565p6883J3420j599p0487N5698k3367L6229P3352
10018C1223M5237K3038J7064j6413k3297j29627l4842J0356m9456M9970k4315
10007a01062M0791J0354j4721j9603j5279N0684N9090L9876m8692o1553J25285
9996F5170R0496o5024M6500M7055o1341j06598j20237N1556N1088m332q237J18632
9984A04728J10167n3754j33693l2012M0741n8020j05880m2387j9891N5438J47842
$$ plain form
10064 7372 -51978 -36989 -48533 -13431 51628 35458 -78069 -149557 -131526 -56952 -106796 -117616
10052 -117616 -69241 -144720 -220230 -260077 -126160 -89778 32005 119894 108061 22397 -6255
10041 -6255 28589 55419 -59091 -198701 -53083 13206 -96469 -47291 -58420 -78858 12680
10030 12680 47772 -49010 -39705 24860 -52023 -38603 -40202 -110689 -54991 -78358 -42129 31223
10018 31223 76460 99498 116562 100149 76852 -52775 -87617 -77261 -126717 -76747 -101062
10007 -101062 -60271 -49917 -64638 -84241 -99520 -48836 10254 50130 1438 -60115 65170
9996 65170 155666 90642 137142 184197 122856 16258 -103979 -52423 -1335 -5667 -13904 104728
9984 104728 214895 161141 27448 -4564 36177 -21843 -127723 -170110 -190001 -134563 13279
9973A3279l0450p3227L4182k2039j1046Q0956J03287L1479j01363k0198O8845
9962G3705k4861j4255M2526m4427q2188n0746K5294P7185K8283k511n3420O0724
9950C5309K7689r4745O59J42047K8468q0179p8205J1722r1580o0212M9809K0683
9938h8535j5547L7797M4066M3158j7235j0753q0070j24775n512K3228J8588J5814
9926a59776J37962R2051R796M3078R7625o0724p4318j6156R96k2523M1910M0680
9914A30601p0588n2455J1455j7083j6262j0916J3326R3407P6002j00876q1267
9903b4656m1007j5850J8508j7872J35830O3459L0274K8205k4682q1446j33033
9892f2270n2576K9990O5701l8660j1N3547N953l2268P395l7403j5263k2820O2911
$$ plain form
9973 13279 -17171 -90398 -56216 -78255 -89301 -8345 94942 126421 25058 4860 73705
9962 73705 48844 34589 77115 32688 -49500 -100246 -74952 2233 30516 28005 -25415 35309
9950 35309 62998 -31747 -31088 110959 139427 59248 -18957 -7235 -98815 -159027 -109218 -88535
9938 -88535 -104082 -66285 -22219 20939 3704 -7049 -87119 -211894 -217406 -194178 -175590 -159776
9926 -159776 -21814 70237 80033 123111 220736 160012 85694 69538 70534 48011 89921 130601
9914 130601 60013 7558 19013 1930 -14332 -25248 -11922 81485 157487 56611 -24656
9903 -24656 -65663 -81513 -63005 -80877 54953 118412 148686 176891 152209 70763 -62270
9892 -62270 -114846 -84856 -19155 -57815 -57826 -4279 1674 -30594 -23199 -60602 -75865 -98685 -35774
9879c5774m0225M7996J06465j7182n7604j04120R4406Q1730n4173r5219J73523
9868I9823J37614M474r5655N6203R154k4443j03921m7245m74m7497j9240P8634
9856D7427K1662j24078m5216o1500L9068Q0865p970r3750K9629N7988M3792L1095
9844A9012N2859m2230j3010M8150m8125k19N0200N7103p607o5514j8275M306j8122
9831A8528J7741L7048q1627M8051p3503Q302N0815M7356q7165J0051O0135J0238
9819F5970K6777o1756N5533J8631J6347r9939m052k8579l1953j6431p1674o8154
9807a99280l0065R3949J36373K0582j1707N0612R8717J7339p3160n9957M359M0566
9795H8328p920n8020N150K7199o3566p7212L5609M6283p7514R4110O3887j60029
$$ plain form
9879 -35774 -75999 -28003 78462 61280 3676 -100444 -6038 75692 21519 -73700 99823
9868 99823 237437 241911 146256 202459 211613 187170 83249 36004 35530 -11967 -31207 47427
9856 47427 69089 -54989 -100205 -161705 -122637 -41772 -49742 -143492 -113863 -55875 -12083 19012
9844 19012 71871 29641 16631 64781 16656 16437 66637 123740 116133 50619 32344 36650 18528
9831 18528 36269 73317 -8310 39741 -33762 -25460 25355 72711 -14454 -4403 55732 65970
9819 65970 92747 30991 86524 105155 121502 21563 17511 -11068 -43021 -59452 -131126 -199280
9807 -199280 -229345 -135396 977 21559 9852 60464 159181 176520 103360 43403 47762 88328
9795 88328 80408 22388 27538 54737 -8829 -86041 -50432 -4149 -81663 12447 76334 -83695
9783h3695r9605o2634P9937J70605r793n6510O4140N353L1035m3989K629n1280
9771e3807j1485j186K2546N0852J6609p5625j19879k7598Q4621P4368R7408K1075
9759G7899M7976M2004O6322j31057p4739N9142q6142m844J20312j1550j71993
9748f6670r7564P0201J37505m3817K7665p5889J2837l175O3830Q7488l173q0044
9736B9194O5044M0694o0373j06989O503K4927l626j7280K9207J1455m5664L5042
9724H134J1600O2749l6691m1714n3564K5430L2155n5632q4693m693j2046K883
9712a46082J12807L1756p537m7058j0864J01538L5940n2129L1706L5040k854l5991
9700D6272L1080k2704k1267K0948j3279k2541n8652k5754M5527J04653J7202o0350
$$ plain form
9783 -83695 -183300 -245934 -165997 4608 -5185 -61695 2445 7798 38833 -5156 -2527 -53807
9771 -53807 -65292 -66478 -43932 6920 23529 -52096 -171975 -199573 -114952 -40584 56824 77899
9759 77899 125875 167879 234201 103144 28405 87547 1405 -3439 116873 105323 -66670
9748 -66670 -164234 -94033 43472 -345 27320 -48569 -35732 -38907 24923 112411 109238 29194
9736 29194 94238 134932 74559 -32430 -25927 -1000 -4626 -21906 7301 18756 -26908 8134
9724 8134 19734 82483 45792 4078 -49486 -24056 8099 -47533 -132226 -136919 -148965 -146082
9712 -146082 -33275 -1519 -9056 -56114 -66978 34560 70500 18371 50077 85117 82263 46272
9700 46272 77352 54648 33381 54329 41050 18509 -40143 -65897 -20370 84283 101485 41135
9688D1135j52453J6896J36412J26727n8866j01075L4522K7892j1994k6234o3571
9677c0609Q9487l3413K6772M3029L9862m794n8360r580n552P577M8200m4396l5969
9664C2254J4015l7769J6305J7273j32136L2421J3308o8549o0659n4365J9674Q1500
9652a26728j0520O093r3901P280N1647M5192L2487L1265Q9050M4385L1319J6435
9640A24004m3254M4730P219k1988j29204l9274m797L915L8422k6593p5276n2710
9628a74806L9608K03390J15931o7856p8339n9887M5293n8316m8737j570N2478
9617c2811M6413R9560j0216p9244m1119K5724J20870M8199p0676k6940n7397j14983
9605i2620k6875J9697k0299j20718M0717K0644K2318N1250m5300o9221K1181J4903
$$ plain form
9688 41135 -111318 -94422 41990 168717 109851 8776 43298 71190 59196 32962 -30609
9677 -30609 58878 25465 52237 95266 135128 130334 71974 62394 56842 64419 112619 68223 32254
9664 32254 46269 8500 24805 42078 -90058 -57637 -44329 -112878 -173537 -227902 -208228 -126728
9652 -126728 -137248 -131155 -225056 -217776 -166129 -120937 -88450 -57185 31865 76250 107569 124004
9640 124004 80750 125480 132699 110711 -18493 -57767 -62564 -58649 -20227 -46820 -122096 -174806
9628 -174806 -135198 68192 184123 116267 37928 -21959 23334 -34982 -83719 -85289 -32811
9617 -32811 13602 113162 102946 23702 -17417 8307 129177 177376 106700 79760 22363 -92620
9605 -92620 -119495 -99798 -120097 -240815 -200098 -179454 -157136 -105886 -151186 -220407 -199226 -184323
9593a84323k5096J77703K5329K9696M7628k8329q2757R808J7297k2370M8311j28721
9581a15824k0845R9664k618p5976R1300L8991Q49J04797L1299Q7184j2067r3910
9569A32844l8781O8198J07469q154o0764p0716n3115r009m4415Q0014O980o3258
9557D7293j8091l683J4769j9033l6783o0014q764M5010N4315N5257N1984J7277
9545A39537j32079p9227p9213p811R1455Q2961q9134n8266O434K8882J0568N6139
9533b9754K7603k8579K4457l7687p2437k3291N2056q78O1644J8336n9382p802
9521g5714k3234O3855J21461K9038r0946j2374L4975l4330L9605K9222j8642O8061
9509A30977L324n1687n5546l7319j9464o5062n6447p8892L003J64444J17273l0133
$$ plain form
9593 -184323 -209419 -31716 -6387 23309 70937 42608 -40149 -30341 -13044 -35414 12897 -115824
9581 -115824 -136669 -37005 -39623 -115599 -24299 14692 15541 120338 151637 238821 226754 132844
9569 132844 94063 162261 269730 261576 200812 130096 76981 67972 23557 103571 110551 47293
9557 47293 29202 25519 40288 21255 -15528 -75542 -84306 -39296 15019 70276 122260 139537
9545 139537 7458 -71769 -150982 -158793 -67338 15623 -73511 -131777 -125343 -96461 -85893 -29754
9533 -29754 -2151 -30730 -6273 -43960 -116397 -139688 -87632 -88510 -26866 -8530 -67912 -75714
9521 -75714 -98948 -35093 86368 115406 24460 12086 47061 12731 52336 81558 62916 130977
9509 130977 134301 82614 27068 -10251 -29715 -94777 -151224 -230116 -227113 -62669 54604 24471
9497B4471o719N6312q8187n8635m7492R816O2740p859L706L2161J0602N4304n8733
9484a3513K1113p2145M2226n695K4908J8437l1239n5873R8437J9293m2529l9040
9472c5620j9551L1381J29383j4549r4191o5763M6392p9289m2681O0355Q6549j6166
9460a3750m2188n696M8035Q6788j3392N9685O0142j19675k14524M429J34014k7332
9448d3464p0425J11048P149K781k7355o2672L0187L2704j8022j1600K4974M0309
9436A5614L4662M3279n4871O7626J1217n0263o0886m7215R49M5199l2127n4727
9424h1543r911p2061N4563K7454k1659n0575r2824R7221Q1982Q1357N6061o1187
9412H878j17595M7604k0086n2660M7138P6656O721N6550J2634l6012r7958l9460
$$ plain form
9497 24471 17752 74064 -14123 -72758 -120250 -110434 -47694 -55553 -51847 -19686 -9084 45220 -13513
9484 -13513 7600 -64545 -22319 -28014 -3106 15331 -15908 -71781 26656 45949 3420 -35620
9472 -35620 -55171 -23790 105593 91044 -3147 -68910 -22518 -101807 -144488 -84133 2416 -13750
9460 -13750 -55938 -61634 -13599 73189 59797 119482 179624 59949 -154575 -150146 -16132 -43464
9448 -43464 -113889 -2841 4308 7089 -20266 -82938 -52751 -20047 -38069 -49669 -24695 15614
9436 15614 50276 93555 38684 106310 117527 67264 6378 -40837 -39888 5311 -26816 -81543
9424 -81543 -91454 -163515 -108952 -81498 -103157 -153732 -246556 -149335 -67353 14004 70065 8878
9412 8878 -108717 -61113 -81199 -133859 -86721 -10065 -3344 53206 65840 29828 -68130 -107590
9400a07590K4672P0437Q3439M4653j14785J566K2331m3260q374j7261k2909J1918
9388e5163L9096r0645m7166M0809P2660o4741M0187m1297Q5142J28415P3630j34948
9376D5979j05817m053o2545J632l8206M460R853m787k3180L1690k1673J2550N6964
9363i7133k2602J04365J19390k4106j28578L8232L3558k1731o0791m0292M4921
9352e4767m5737P756K6721q9976J0852P5729J20431J26511m3954n3829p3608q8127
9340h1998p7782L8063L1540j1163L8398J58624R6959l7705k86j7394M9406o3416
9328A23246r5210l4203J9065p1825p4667o6745o9409j0379Q7307J57436K1293
9317a4091K2144K007l1142J8862L5308j03101j35141J46734N6360O5858J4574
$$ plain form
9400 -107590 -82918 -12481 70958 115611 826 2392 24723 -18537 -26911 -44172 -67081 -55163
9388 -55163 -16067 -106712 -153878 -113069 -40409 -105150 -64963 -106260 -21118 107297 180927 45979
9376 45979 -59838 -63891 -126436 -124804 -163010 -158550 -148697 -153484 -176664 -144974 -166647 -154097 -97133
9363 -97133 -119735 -15370 104020 79914 -48664 -10432 23126 1395 -59396 -99688 -54767
9352 -54767 -100504 -92748 -66027 -156003 -145151 -69422 51009 177520 133566 79737 6129 -81998
9340 -81998 -159780 -121717 -90177 -101340 -62942 95682 192641 154936 154650 137256 186662 123246
9328 123246 28036 -6167 12898 -58927 -133594 -200339 -269748 -280127 -192820 -35384 -14091
9317 -14091 8053 10060 -21082 -2220 33088 -70013 -205154 -58420 -2060 63798 78372
9306G8372l1418L1766K8120m631j1912L0163Q4831q296j82774j98925m6632O2117
9294a69219J6010P39J1740r9689k3476J11471J33801N9665l8809j1400m6470m7827
9282a03464J18160J74173r3673q6178J4032M6908n9015m8285N1181N4739Q728
9271G7306k2103j30128r0828P485K261J50531J19380q5631j05854N0851j6618
9260d3348l4461J6060M0036l168K9426J3273j432n62m0950j0474J0582l4361o1346
9247a20725J4215j4173N4733J06161p9661j50859N2687J35468J29500K5764k7138
9236A25972j04533j2336n8814n1394L5624J9231l0741m942P0023J02196l0728
9225E9558m8749l2548P7847R461j4773o0908p7502P8905Q1325R8384Q3562p3067
$$ plain form
9306 78372 46954 78720 106840 102209 90297 120460 205291 196995 14221 -184704 -231336 -169219
9294 -169219 -153209 -152470 -140730 -240419 -263895 -152424 -18623 41042 2233 -9167 -55637 -103464
9282 -103464 14696 188869 95196 9018 23050 69958 10943 -37342 13839 68578 77306
9271 77306 55203 -74925 -165753 -158268 -156007 -5476 113904 28273 -77581 -26730 -43348
9260 -43348 -77809 -61749 -21713 -24881 4545 17818 16386 15824 -25126 -35600 -25018 -59379 -120725
9247 -120725 -106510 -120683 -65950 40211 -39450 -190309 -137622 -2154 127346 153110 125972
9236 125972 21439 9103 -49711 -101105 -65481 -46250 -76991 -81933 -11910 90286 59558
9225 59558 10809 -21739 56108 65569 50796 -10112 -87614 -8709 72616 171000 254562 181495
9213A81495r5608j658J07393M70j02054j1186l599k6653N9834M1791j4911k3602
9201A11712P5277k4734j06042q49L0523j9876L3317L1344k037N70L5597K4430
9189A89232j12826j011m2591q5077J57899N3897L3898l5075k0744j10359l4907
9178g664R5544j9304P7944K9377n5278M8926Q7588j8767j57707j3242K1261M1290
9166A29968P9288Q9055Q1299l4729j08652l3954P5625j2012o7905M3063O9661
9155C10707N5032P7399J6245m146Q0192J05973K9023L868M7657N6983L8899R5764
9143I13596N7057J7971Q0902q6j16382Q0468P0436M9361R9546O7677N6871J27514
9131A504931J5466J539K9763K7836Q2043L7298R6657L0376R0200N3173J84353
$$ plain form
9213 181495 85887 84229 191622 192092 90038 78852 75253 48600 108434 150225 135314 111712
9201 111712 186989 162255 56213 55364 85887 66011 99328 130672 128635 129205 164802 189232
9189 189232 76406 75395 32804 -52273 105626 159523 193421 158346 137602 27243 -7664
9178 -7664 87880 68576 146520 175897 120619 169545 257133 238366 80659 67417 88678 129968
9166 129968 209256 298311 379610 344881 236229 202275 277900 265888 197983 241046 310707
9155 310707 365739 443138 459383 455237 535429 641402 670425 674293 721950 778933 817832 913596
9143 913596 970653 988624 1069526 1069440 953058 1033526 1103962 1153323 1252869 1320546 1377417 1504931
9131 1504931 1520397 1521936 1551699 1579535 1661578 1698876 1795533 1825909 1916109 1969282 2153635
9120B153635Q6120J09199Q9433J01407J31714L8600Q5184Q6170J23486K08252
9110C213200J48831L6469J53006K26164J86298M06951M53935K93779M39878N47059
9100F105570N84999P72571R81408R03656R48106J199396J368735J392290J288253
9091A5544984J030571O83232J1289o29168j101255j507169j806370j731361j611600
9082H883153j494978j261281r63974q37734n83306m01365m46968l57551k79771
9073B256225k32401k05039j73912j87609k05034l4727J3759r1642q9523j03686
9063I46411m4363l5877m6548n7600p0871j24530q8823K4118P4770J2124l5631
9052E53180k8132p6290m5201k7951n7312K7983l6187j15922r2576R6485M8388
$$ plain form
9120 2153635 2239755 2348954 2438387 2539794 2671508 2710108 2795292 2881462 3004948 3213200
9110 3213200 3362031 3398500 3551506 3777670 3963968 4370919 4824854 5118633 5558511 6105570
9100 6105570 6690569 7463140 8444548 9348204 10296310 11495706 12864441 14256731 15544984
9091 15544984 16575555 17258787 17270076 16640908 15539653 14032484 12226114 10494753 8883153
9082 8883153 7388175 6126894 5162920 4325186 3741880 3340515 2893547 2535996 2256225
9073 2256225 2023824 1818785 1644873 1457264 1252230 1217503 1231262 1139620 1050097 946411
9063 946411 902048 866171 819623 762023 691152 566622 477799 501917 576687 588811 553180
9052 553180 525048 448758 403557 375606 318294 346277 310090 194168 101592 198077 246465
9041B46465N3455k7455j825L9525K5124k1782N543p1856j5090O1527J07879m7184
9029C54326p1908o4978n4605P4132l847n9132j13567M21M5914L5681l6811j6786
9017H8840Q601L5312l8402K8092Q4273R367j8603l4693m8052l1119m90j11583
9005b8457k8362P8689J17803p0398j10644M3920J8240n4731p1682P7293M2568
8994A4239J3913j34702k0381R2198M1516j2009M2182J12107J9627n8764j3674
8983I6252j10906m7002l500M7620J11772L6729L0872q1530k3622l3419l4851J56153
8971A44568Q0016J1830k21m094J6901l5780p3844m2762l9291n3813q5268l087
8959h4845J17239J8268P9558m9064j0937n6540P0261J12837N9975o7252j00650
$$ plain form
9041 246465 299920 272465 270640 310165 335289 313507 319050 247194 232104 293631 401510 354326
9029 354326 282418 217440 162835 236967 233120 173988 60421 60842 106756 142437 105626 88840
9017 88840 97441 132753 94351 122443 206716 216083 197480 162787 114735 83616 83126 -28457
9005 -28457 -56819 21870 139673 69275 -41369 2551 20791 -33940 -105622 -28329 14239
8994 14239 28152 -106550 -126931 -34733 6783 -5226 36956 149063 168690 109926 96252
8983 96252 -14654 -61656 -65156 -17536 94236 130965 161837 80307 56685 23266 -11585 144568
8971 144568 224584 236414 236193 232099 249000 213220 139376 96614 57323 3510 -81758 -84845
8959 -84845 32394 50662 130220 81156 70219 13679 83940 196777 256752 189500 88850
8948H8850m8494O8668J29856K1879j47923n5259O3332P1741o2672L1174j5695
8937A45457M4827k1330K5911J30672J2298q5864q5082n519k3334o8429j40432
8926g0825P8157J6720K3927m8326J2535m0618P3505o8669j21599o0022O2617M4604
8914i7994J8908K3265L9794O5336o29l1466k6379K443J8728J11077n579p5859
8902D1645m2786j9405M7272Q9738p5539o9928j01269L4748L0256m311J1940K600
8890e5039j30087M5661J7555J7712J204j04578k6009J15458J1471L2545N0268
8879b3839L1943R824p7726L6894Q1913K598j15853j20451n0688L6144M5854K9334
8867a14053j3011k3176J9568L6894o520P2581L4674m092m3833L6057O2721N4892
$$ plain form
8948 88850 40356 109024 238880 260759 112836 57577 120909 192650 129978 161152 145457
8937 145457 190284 168954 194865 325537 337835 251971 166889 161370 138036 69607 -70825
8926 -70825 7332 24052 47979 -347 12188 -28430 45075 -23594 -145193 -205215 -142598 -97994
8914 -97994 -79086 -55821 -16027 49309 48680 17214 -9165 -6722 12006 123083 117504 41645
8902 41645 -1141 -20546 26726 116464 40925 -29003 -130272 -95524 -65268 -69579 -57639 -55039
8890 -55039 -185126 -139465 -121910 -104198 -102994 -207572 -233581 -118123 -106652 -74107 -23839
8879 -23839 8104 17928 -59798 -22904 59009 61607 -54246 -174697 -225385 -189241 -143387 -114053
8867 -114053 -127064 -150240 -130672 -93778 -100298 -27717 6957 2865 -40968 -4911 57810 112702
8855A12702M1479r599K8083R3792N5656j14686j02017P4214L4565m7757j37545
8844B8887n352J15969p374k3344n9625o4943O354J12417o1512K9568N0606q4592
8832C7059l3276r4933p5158J36727J39453o8577m3390n6407q2845n8934Q5381
8821a14900O5666j7085K8187N4447M3339P726L6245j3436k2372n2313m5827N6283
8809B5960k0167m4611L7447N0737K5229n1403L8885N5879J03664Q899r248P1608
8797B92879n4357o7563l2400j54449r8813R0945R0435l8914P1579L659j7085l2376
8785E3540o9135L188K7052Q6132r2340p2501N3356P7291N3570j5529j5240l6932
8773E2452k5061K3168N6782O6244n9938q7910k9803p9923N5582K6794l0629l5397
$$ plain form
8855 112702 154181 144582 172665 266457 322113 207427 105410 179624 214189 166432 28887
8844 28887 23535 139504 132130 108786 49161 -15782 -9428 102989 41477 71045 121651 37059
8832 37059 3783 -91150 -166308 -29581 109872 41295 -2095 -58502 -141347 -200281 -114900
8821 -114900 -49234 -66319 -38132 16315 59654 67380 103625 90189 67817 15504 -30323 25960
8809 25960 5793 -38818 -1371 49366 74595 23192 62077 117956 221620 230519 221271 292879
8797 292879 238522 170959 138559 -15890 -114703 -23758 66677 27763 99342 103001 85916 53540
8785 53540 -15595 -12407 14645 100777 8437 -64064 -10708 66583 120153 104624 89384 52452
8773 52452 27391 50559 107341 173585 113647 25737 -4066 -83989 -28407 -1613 -32242 -67639
8761f7639K0532J20282N7979l5341p4942m6192M0878Q0021J00343K4677j815n2090
8749A66693o1823m9003p7403l9631J9673L0270m2231N8785j0247j2414P0369Q3190
8737A36228r650j45321j1294P0512k3220q0281M7389J20088o5062q1559J47010
8726A04840P8598m038j27696o6102j7548P0516r28m7163n6754J5012K5795J658
8714b3810p0477L1170J9558L9025K9053r252m7238J7533Q3707L8446j34789r4748
8702a21822o5495o3361Q4974P6664O6580m6160N0200J06438l0561l0J1820l3168
8690C6079j46733j26990j2373J15011P8584j0764p48K941J9958K2742k0160k4531
8678f6984O8732N0070l7541K0701m9672l0568J524Q4746k3652p4880j6760K0070
$$ plain form
8761 -67639 -47107 73175 131154 95813 20871 -25321 15557 95578 195921 220598 218783 166693
8749 166693 104870 55867 -21536 -61167 -41494 -11224 -53455 5330 -4917 -17331 53038 136228
8737 136228 126578 -18743 -30037 40475 17255 -63026 -15637 104451 39389 -42170 104840
8726 104840 183438 179400 51704 -14398 -31946 38570 37642 -9521 -66275 -51263 -25468 -23810
8714 -23810 -94287 -63117 -43559 -4534 24519 15267 -31971 -14438 69269 107715 -27074 -121822
8702 -121822 -187317 -250678 -165704 -89040 -22460 -68620 -18420 88018 57457 57427 69247 36079
8690 36079 -110654 -237644 -250017 -135006 -56422 -67186 -67934 -64993 -45035 -22293 -42453 -66984
8678 -66984 1748 51818 14277 34978 -14694 -45262 -43738 41008 17356 -57524 -74284 -54214
8666e4214P5734J1622M2154O9923J0230n3671L4955p3089R3944q238j31871o71
8654A6808N7907J7974m0865m3878p34p0417k4263k4297Q0877J6214N8568R4138
8642A38032j32092o6015j9910L247N1416J05335r449l9338M4268P5109m3251j4128
8630I3224L1031j22555m835J9091J9317J25629N0369q8707l9004N610q3720K4507
8618B9957J51565J5288k261M8215P2438q3730j11176j10580m2174N0234P0475
8607H8251L7668O0936O5784j9501k6960n9018m4802J4944L570q5917P702O9051
8595A11708J9903n4595j7321k1326q6052M4626J9309L9383M835l2827N9522M8966
8583A36131q599O456o6916p4372L0838k2696M7779M9065l1830o9751o1525L2453
$$ plain form
8666 -54214 21520 33142 75296 145219 155449 101778 136733 63644 157588 149350 17479 16808
8654 16808 74715 92689 51824 7946 7212 -63205 -87468 -111765 -30888 -14674 43894 138032
8642 138032 5940 -60075 -79985 -76738 -25322 80013 70564 31226 75494 150603 107352 93224
8630 93224 124255 1700 -3135 15956 35273 160902 211271 122564 83560 89170 5450 29957
8618 29957 181522 196810 194549 242764 315202 231472 120296 9716 -32458 17776 88251
8607 88251 125919 186855 252639 233138 206178 147160 102358 117302 120872 34955 42657 111708
8595 111708 131611 77016 59695 38369 -47683 -3057 16252 55635 60470 27643 87165 136131
8583 136131 127532 133988 67072 -7300 23538 842 48621 97686 65856 -3895 -65420 -32967
8571c2967N9584M4510n5976j18893o7477R0069P2579L3449Q0806j07498j19619
8560a21433K7789J21773J04461p5638J6921o6543P7543Q0668m0523K794k7954
8549I9858K0275o8883m6199l6202Q4314O2530K558q346o1703j6802j6502k3361
8537h463r4903r5588Q7064J03261m6463J05990Q7436K4653n5376j06566o0426
8526e9381N2526K9221o9087m825J10267J0828l9583l9134O7718l5952l3693j4033
8514b5128j22195Q3253N2117k4436l353M7401K5555L2890j52076j8223m4949N6882
8502i2262O7543N0398n9420l7435L6410K6652j3637r1405K2450P3378m9775R7550
8490C0447k2544n8114M6437J35758L1469q1435j51307Q4733K6044o953j02386
$$ plain form
8571 -32967 26617 71127 15151 -103742 -171219 -81150 -8571 24878 105684 -1814 -121433
8560 -121433 -93644 28129 132590 56952 73873 7330 84873 165541 125018 127812 99858
8549 99858 120133 51250 5051 -31151 53163 115693 118251 109905 48202 31400 14898 -8463
8537 -8463 -103366 -198954 -111890 -8629 -55092 50898 138334 162987 107611 1045 -59381
8526 -59381 -6855 22366 -46721 -51546 58721 69549 29966 -9168 58550 22598 -11095 -25128
8514 -25128 -147323 -64070 -11953 -36389 -39742 7659 33214 66104 -85972 -104195 -149144 -92262
8502 -92262 -24719 25679 -33741 -71176 -34766 -8114 -21751 -113156 -90706 -17328 -67103 30447
8490 30447 7903 -50211 -3774 131984 163453 82018 -69289 15444 41488 34535 -67851
8479f7851r7462N8697N8916O469l669n9883P8297K1453Q5586L555j14023n7554
8467h7469O9713O238j5867M4798N1458m0085K4360J2183j06l1237P043O049q900
8454C8178m8978k5701k0923o7632L947N9921P0653J58610P4752j8567j00383P584
8442A31461m3609K3420k1829j26751q9166q4283k7366R5044Q8488M2244K6710
8431A4363r980j6740m9234L409L6777m2240p3918J12478J33424k2557p4452l0260
8419a8930o2689N1676K863j169N637N8937N6o1850M4455J04472P7298N3951j8828
8406B35879l3785m9766r7087p2655J913j1368R092N3434L1545Q4183k2327j13091
8394A5967j17647R1622O2607n7436N0109O4602O2642n6405n0310l4781P5259R2126
$$ plain form
8479 -67851 -165313 -106616 -47700 -41231 -44900 -104783 -26486 -5033 80553 84108 -29915 -87469
8467 -87469 -17756 -11518 -27385 17413 68871 28786 53146 65329 65223 33986 41029 47078 38178
8454 38178 -10800 -36501 -57424 -125056 -121109 -61188 9465 168075 242827 224260 123877 131461
8442 131461 87852 111272 89443 -37308 -126474 -210757 -238123 -143079 -54591 -12347 14363
8431 14363 4383 -12357 -61591 -58182 -21405 -63645 -137563 -25085 108339 85782 11330 -18930
8419 -18930 -81619 -29943 -27080 -28249 -22612 36325 36381 -25469 18986 123458 200756 254707 235879
8406 235879 202094 152328 55241 -17414 -15501 -26869 -17777 35657 67202 151385 129058 15967
8394 15967 -101680 -10058 52549 -4887 45222 109824 172466 116061 65751 30970 106229 198355
8382A98355n9897m1840l1071l9553L406P2L6255p6554o0350m3264M6901J05439
8370C7899k1590m3038p5374L8426j9035q8162J20435M509n0936M6764l1208L0078
8358e1232N0625p6887o0922R5425R829j2686N9664L7118R897p9900n9363J6582
8346f1850q5863M3528Q5769o0806m6653q040O3021N8381O2033O1303m8709p1455
8334i341n9161L9889Q8149O4525j2076p0577j7688k8847j0327n7954N8620L6742
8322B1954l8448l4926Q5149j10505l5217L5634M1440N8878m3588p0270j63376
8311b53275j2414J17165K9342M3965K9057k5856J0497n317o8441k1083J30651
8300b5709J53408o3960r0774L7101J1516k1989p7399N136J1603P5204n1554k1413
$$ plain form
8382 198355 138458 96618 65547 25994 29400 29472 65727 -10827 -71177 -114441 -67540 37899
8370 37899 16309 -26729 -102103 -63677 -82712 -170874 -50439 -45930 -96866 -50102 -81310 -51232
8358 -51232 -607 -77494 -138416 -42991 -33162 -45848 13816 50934 60831 -19069 -78432 -61850
8346 -61850 -147713 -104185 -18416 -79222 -125875 -133915 -70894 -12513 49520 110823 62114 -9341
8334 -9341 -68502 -28613 59536 124061 111985 41408 23720 -5127 -15454 -73408 -14788 21954
8322 21954 -16494 -51420 33729 -76776 -111993 -76359 -34919 23959 -19629 -89899 -253275
8311 -253275 -265689 -148524 -119182 -75217 -46160 -72016 -61519 -66836 -135277 -156360 -25709
8300 -25709 127699 63739 -27035 10066 21582 -407 -77806 -72670 -61067 14137 -37417 -58830
8288e8830n8113r8297Q1588k3407R947J4569Q0340N4044M8621J8120K6791m7213
8276D8160l7289K0004R589J7626p2637q011p7379J1963l9420P9079J03233N4360
8264A09278L7919O5644r2305j36876O6469M2963r7117j03297j5201L8572k0149
8253a04100l9643J0865J9330L7100l12p5219l7399M4269P242r6200L5692L0319
8241a68056P4330J44766L1645l0391m6027p8967P07R4063M9741K803j15082N2722
8229A2254j628K5897j0969J7761Q0452l5107m244K9527M0519j5152m9996n5684
8217C3630k0511r7660j49470R6685j0554L5769o6586N4921O0606q9767M3052J02685
8205g200L8202k5376j9125J3556q645j01829l9778j7019J22866J09378p9699L2336
$$ plain form
8288 -58830 -116943 -215240 -133652 -157059 -147112 -132543 -52203 1841 50462 68582 95373 48160
8276 48160 10871 30875 40464 58090 -14547 -22558 -99937 -87974 -127394 -48315 54918 109278
8264 109278 147197 212841 120536 -16340 50129 93092 -4025 -107322 -122523 -83951 -104100
8253 -104100 -143743 -132878 -113548 -76448 -76760 -151979 -189378 -145109 -137867 -234067 -198375 -168056
8241 -168056 -93726 51040 82685 52294 6267 -72700 -71993 22070 71811 74614 -40468 12254
8229 12254 10626 36523 25554 43315 123767 88660 84416 113943 154462 139310 89314 33630
8217 33630 13119 -84541 -234011 -137326 -147880 -112111 -178697 -123776 -63170 -152937 -109885 -7200
8205 -7200 31002 5626 -13499 57 -8588 -110417 -150195 -167214 -44348 65030 -14669 17667
8193A7667K1180k3087o5212L9223K7332k4832k5479P5354J6973j13397l188N2191
8181e275j7144j6643j3481K7531k3520J2054n4508L0691M0024J13867P3505P4512
8169B41613L9328j50007j12952J5987L3449K9722j0950r6432O6005l594l0401
8158B1768j05362J4779j9371R9563J04296K951o5740m8751K3153J9296P6760j9180
8146A04162p9833n3154M0586N5685m5344L4552o2126q9807Q08J07154P9211n6481
8134C5413J20977L7283o0607j38892K8191J13781m1969L5312R04j02215J290N0445
8122G9913L7803o1019q8813N4432M4067K9043j9137p2535n2136l3964R8652J9020
8110C5326N2631k5347k9537P948j8340N7108n94j1281r871m3965q2733R4338J14185
$$ plain form
8193 17667 38847 15760 -49452 -10229 17103 -7729 -33208 42146 59119 -54278 -57466 -5275
8181 -5275 -22419 -39062 -52543 -25012 -48532 -36478 -90986 -60295 -20271 93596 167101 241613
8169 241613 280941 130934 17982 33969 67418 97140 86190 -10242 55763 52169 21768
8158 21768 -83594 -68815 -88186 11377 115673 118624 52884 4133 27286 46582 123342 104162
8146 104162 24329 -28825 11761 67446 22102 56654 -5472 -95279 -94471 12683 91894 35413
8134 35413 156390 193673 133066 -5826 22365 136146 94177 129489 130393 28178 29468 79913
8122 79913 117716 56697 -32116 22316 66383 95426 76289 3754 -48382 -82346 16306 35326
8110 35326 87957 62610 33073 41021 22681 79789 79195 67914 58043 14078 -68655 25683 139868
8097A39868N791K2136o91J5222j08098m4466J3011K6978K8374P1204N3180o5074
$$ plain form
8097 139868 145659 167795 167104 182326 74228 29762 42773 69751 98125 169329 222509 157435
$$ [...]
##END NTUPLES=NMR SPECTRUM
##END=
