##TITLE=Analysis number 320035
Compound Code cc 47709
Book Reference 451/161
Project Code adrs
Chemist Name evam
##JCAMPDX= 6.0         $$ Bruker NMR JCAMP-DX V2.0
##DATA TYPE= NMR SPECTRUM
##DATA CLASS= NTUPLES
##ORIGIN= Bruker BioSpin GmbH
##OWNER= nmr
$$ XWIN-NMR		Version 3.5
$$ Fri Jun  9 11:47:31 2006 GMT Daylight Time (UT+1h)  MAYBRIDGE\nmr@NMR_250MHZ
##.OBSERVE FREQUENCY= 250.131544655141
##.OBSERVE NUCLEUS= ^1H
##.ACQUISITION MODE= SIMULTANEOUS (DQD)
##.ACQUISITION SCHEME= undefined
##.AVERAGES= 16
##.DIGITISER RES= 18
##SPECTROMETER/DATA SYSTEM= dpx250
##.PULSE SEQUENCE= zg30
##.SOLVENT NAME= CDCl3
##.SHIFT REFERENCE= (INTERNAL, CDCl3, 0, 16.522)
##AUDIT TRAIL= $$ (NUMBER, WHEN, WHO, WHERE, WHAT)
$$ ##TITLE= Audit trail, XWIN-NMR		Version 3.5
$$ ##JCAMPDX= 5.01
$$ ##ORIGIN= Bruker BioSpin GmbH
$$ ##OWNER= nmr
$$ C:\u/data/dgb/nmr/ADRS/490/pdata/1/auditp.txt
$$ ##AUDIT TRAIL=  $$ (NUMBER, WHEN, WHO, WHERE, WHAT)
(   1,<2006-06-09 11:46:53.17 +100>,<MAYBRIDGE\nmr>,<NMR_250MHZ>,
      <created by zg, POWCHK disabled, PULCHK disabled
       configuration hash MD5:
       E2 DF 36 D8 04 B2 41 60 5A D7 A3 38 5A 4B D0 FE
       data hash MD5: 64K
       0E EA C9 7E A6 AD CD C3 10 F9 4B DF D6 9A 62 C2>)
(   2,<2006-06-09 11:47:10.34 +100>,<MAYBRIDGE\nmr>,<NMR_250MHZ>,
      <Start of raw data processing
       ef LB = 0.3 FT_mod = 6 PKNL = 1 SI = 32K 
       data hash MD5: 32K
       EE BD FB 3B AD 5A 49 91 F6 E4 65 F7 1A 79 C0 DA>)
(   3,<2006-06-09 11:47:14.73 +100>,<MAYBRIDGE\nmr>,<NMR_250MHZ>,
      <apk 
       data hash MD5: 32K
       45 DF 17 61 1A 7C 01 09 79 48 05 68 6C 50 6E 6B>)
(   4,<2006-06-09 11:47:16.23 +100>,<MAYBRIDGE\nmr>,<NMR_250MHZ>,
      <abs ABSG = 5 
       data hash MD5: 32K
       02 1F 30 8C 9B 73 FB EE 14 E8 5B 43 93 65 63 9B>)
$$ ##END=
$$ 
$$ hash MD5
$$ DF 57 30 78 41 2D 9B 86 9C 78 F0 92 91 3E 4A C8
##$RELAX= 
##$RELAX= 
##$RELAX= 
##$RELAX= 
##$RELAX= 
##$RELAX= 
##$RELAX= 
$$ Bruker specific parameters
$$ --------------------------
##$DU= <C:\u>
##$EXPNO= 490
##$NAME= <ADRS>
##$PROCNO= 1
##$TYPE= <nmr>
##$USER= <dgb>
##$AMP= (0..31)
100 100 100 100 100 100 100 100 100 100 100 100 100 100 100 100 100 100 
100 100 100 100 100 100 100 100 100 100 100 100 100 100 
##$AQSEQ= 0
##$AQ_mod= 3
##$AUNM= <au_zg>
##$AUTOPOS= <32 >
##$BF1= 250.13
##$BF2= 250.13
##$BF3= 250.13
##$BF4= 250.13
##$BF5= 500.13
##$BF6= 500.13
##$BF7= 500.13
##$BF8= 500.13
##$BYTORDA= 1
##$CFDGTYP= 0
##$CFRGTYP= 5
##$CHEMSTR= <none>
##$CNST= (0..31)
1 1 145 1 1 1 1 1 1 1 1 1 1 1 1 1 1 1 1 1 1 1 1 1 1 1 1 1 1 1 1 1 
##$CPDPRG= <>
##$CPDPRG1= <>
##$CPDPRG2= <>
##$CPDPRG3= <>
##$CPDPRG4= <mlev>
##$CPDPRG5= <mlev>
##$CPDPRG6= <mlev>
##$CPDPRG7= <mlev>
##$CPDPRG8= <mlev>
##$CPDPRGB= <>
##$CPDPRGT= <>
##$D= (0..31)
0 1 0 0 0 0 0 0 0 0.06 0 0 0 0 0 0 0.0002 0 0 0 0 0 0 0 0 0 0 0 0 0 0 
0 
##$DATE= 1149850011
##$DBL= (0..7)
120 120 120 120 120 120 120 120 
##$DBP= (0..7)
150 150 150 150 150 150 150 150 
##$DBP07= 0
##$DBPNAM0= <>
##$DBPNAM1= <>
$$ [...]
##$SUBNAM7= <"">
##$SUBNAM8= <"">
##$SUBNAM9= <"">
##$SW= 20.6930455092707
##$SWIBOX= (0..15)
0 0 3 0 0 0 0 0 0 0 0 0 0 0 0 0 
##$SW_h= 5175.983436853
##$TD= 65536
##$TD0= 1
##$TE= 296.16
##$TE2= 300
##$TE3= 300
##$TEG= 300
##$TL= (0..7)
0 120 120 120 120 120 120 120 
##$TP= (0..7)
150 150 150 150 150 150 150 150 
##$TP07= 0
##$TPNAME0= <>
##$TPNAME1= <>
##$TPNAME2= <>
##$TPNAME3= <>
##$TPNAME4= <>
##$TPNAME5= <>
##$TPNAME6= <>
##$TPNAME7= <>
##$TPOAL= (0..7)
0.5 0.5 0.5 0.5 0.5 0.5 0.5 0.5 
##$TPOFFS= (0..7)
0 0 0 0 0 0 0 0 
##$TUNHIN= 0
##$TUNHOUT= 0
##$TUNXOUT= 0
##$USERA1= <user>
##$USERA2= <user>
##$USERA3= <user>
##$USERA4= <user>
##$USERA5= <user>
##$V9= 5
##$VALIST= <valist>
##$VCLIST= <CCCCCCCCCCCCCCC>
##$VD= 0
##$VDLIST= <DDDDDDDDDDDDDDD>
##$VPLIST= <PPPPPPPPPPPPPPP>
##$VTLIST= <TTTTTTTTTTTTTTT>
##$WBST= 1024
##$WBSW= 4
##$XGAIN= (0..3)
0 0 0 0 
##$XL= 0
##$YL= 0
##$YMAX_a= 328007
##$YMIN_a= -500000
##$ZGOPTNS= <>
##$ZL1= 120
##$ZL2= 120
##$ZL3= 120
##$ZL4= 120
##$ABSF1= 16.522
##$ABSF2= -4.171173
##$ABSG= 5
##$ABSL= 3
##$ALPHA= 0
##$AQORDER= 0
##$ASSFAC= 0
##$ASSFACI= 0
##$ASSFACX= 0
##$ASSWID= 0
##$AUNMP= <proc_1d>
##$AZFE= 0.1
##$AZFW= 0.1
##$BCFW= 0
##$BC_mod= 0
##$BYTORDP= 0
##$COROFFS= 0
##$CY= 12.5
##$DATMOD= 1
##$DC= 0
##$DFILT= <>
##$DTYPP= 0
##$F1P= 14.0000005364418
##$F2P= -0.99999901652339
##$FCOR= 0.5
##$FTSIZE= 32768
##$FT_mod= 6
##$GAMMA= 0
##$GB= 0
##$INTBC= 1
##$INTSCL= 1
##$ISEN= 128
##$LB= 0.3
##$LEV0= 0
##$LPBIN= 0
##$MAXI= 10000
##$MC2= 0
##$MEAN= 0
##$ME_mod= 0
##$MI= 0
##$NCOEF= 0
##$NC_proc= -5
##$NLEV= 6
##$NOISF1= 0
##$NOISF2= 0
##$NSP= 0
##$NTH_PI= 0
##$NZP= 0
##$OFFSET= 16.522
##$PC= 1
##$PHC0= 172.3645
##$PHC1= 9.436136
##$PH_mod= 1
##$PKNL= yes
##$PPARMOD= 0
##$PSCAL= 4
##$PSIGN= 0
##$REVERSE= no
##$SF= 250.13
##$SI= 32768
##$SIGF1= 0
##$SIGF2= 0
##$SINO= 400
##$SIOLD= 32768
##$SREGLST= <1H.CDCl3>
##$SSB= 0
##$STSI= 32768
##$STSR= 0
##$SW_p= 5175.98343685301
##$SYMM= 0
##$S_DEV= 0
##$TDeff= 65536
##$TDoff= 0
##$TI= <Analysis number 999999
Compound Code 99
Book Reference 9
Project Code 9>
##$TILT= no
##$TM1= 0
##$TM2= 0
##$TOPLEV= 0
##$USERP1= <user>
##$USERP2= <user>
##$USERP3= <user>
##$USERP4= <user>
##$USERP5= <user>
##$WDW= 1
##$XDIM= 32768
##$YMAX_p= 412812369
##$YMIN_p= -751604
$$ End of Bruker specific parameters
$$ ---------------------------------
##NTUPLES= NMR SPECTRUM
##VAR_NAME=  FREQUENCY,     SPECTRUM/REAL,   SPECTRUM/IMAG
##SYMBOL=    X,             R,               I
##VAR_TYPE=  INDEPENDENT,   DEPENDENT,       DEPENDENT
##VAR_FORM=  AFFN,          ASDF,            ASDF
##VAR_DIM=   32768,         32768,           32768
##UNITS=     HZ,            ARBITRARY UNITS, ARBITRARY UNITS
##FACTOR=    0.157963299565203, 1,           1
##FIRST=     4132.6476996994, 0,             0
##LAST=      -1043.33573715361, 0,           0
##MIN=       -1043.33573715361, -751604,     0
##MAX=       4132.6476996994, 412812369,     0
$$ Real data points
##PAGE= N=1
##DATA TABLE= (X++(R..R)), XYDATA
$$ [...]
19150B186k9455j31441J7725M8015R6695q0673J05068j06814j08078k92263j01459
19139e80494J02031J25014J37702Q0140K0736K3801O5954N6609J60662J39422
19129C31577j51067k45788m0766K16662M5079j22871j70746n6515p9333P9455
19119a94313J60241J35450J6234J7094M0583n1495k40738j04402K13507J74566
19109A66727N8029l6705J95936K4479m6473r0814j52090j68755P840l5924J32049
19098E4299L27618p6403p8161j50429J24096j01146q8146P9119K9279k11743l9786
19087a31403J18150M4403J3133n3905j70050q9147j1753k82082K12615O0015K04395
19076h5629L6952P82J40228l676l6596n3681J74079J45566k18490L4100J24307
$$ y = [2186, -27269, -158710, -140985, -92970, 3725, -76948, 28120, -78694, -186772, -479035, -580494, -478463, -353449, -215747, -135607, -114871, -91070, -25116, 31493, 192155, 331577, 180510, -65278, -106044, 110618, 155697, 32826, -137920, -194435, -273768, -194313, -34072, 101378, 117612, 134706, 175289, 123794, -116944, -221346, -7839, 166727, 224756, 188051, 383987, 408466, 361993, 271179, 119089, -49666, -41826, -77750, 54299, 381917, 305514, 227353, 76924, 201020, 99874, 11728, 90847, 120126, -91617, -131403, -13253, 31150, 44283, -9622, -179672, -268819, -280572, -562654, -350039, -290024, -85629, -48677, -47895, 92333, 88657, 52061, -1620, 172459, 318025, 99535, 133635, 257942]
19065B57942q3888j01313j04704J04387k32586o6260N9244M8423M7735M0888J19504
19054H9372o5871l80683O9557K55587J34320j06690k60157l5932K84937K77489
19044B61929n2874l08337N3542J42566J18276M012j06981L2929j74556j63279
19034a92773N3224J84743J22099j9420N3123o3972k42758r3999J48267j31135
19024a82601M4660R6604r6381J32710J20081J55447j11852o1652p2476r5327j08460
19013a79247O011J9297j2790q7165N0702K5441J07517J78472J66247p8384j64333
19002C1768j36363M9844J74986J03818K6720O1831J0983j26826k60971R4512K36349
18991B66651K40970K8588k12956q6956M3934P7149J95215L25585K49321K50632
$$ y = [257942, 174054, 72741, -31963, 72424, -160162, -226422, -167178, -118755, -71020, -30132, 89372, 23501, -357182, -287625, -32038, 102282, -4408, -264565, -300497, -15560, 261929, 209055, -99282, -45740, 96826, 215102, 219114, 112133, 145062, -29494, -192773, -139549, 45194, 167293, 147873, 200996, 137024, -105734, -199733, -51466, -182601, -137941, -41337, -137718, -5008, 115073, 270520, 158668, 97016, 24540, -70787, -179247, -173236, -153939, -166729, -253894, -203192, -177751, -70234, 108238, 274485, 196101, 31768, -104595, -54751, 120235, 224053, 250773, 312604, 323587, 196761, -64210, 30302, 266651, 507621, 536209, 323253, 236297, 280231, 357380, 552595, 878180, 1127501, 1378133]
18981A378133L04357K16798k7278j01138p088k12609q480m9305j45578J29592
18971A477404K34000K11659q3261j20297m4582J3283j94009j44964j00783M8855
18961A297305j83959m52240k40695j32904q1720j26320j19474J8178J63007R5510
18951B36688m1243J47412K671J24865q2263j91457q9843j71938q167l1996P3851
18940c1420J53382l30111N5465M31k09514Q2597K09455K73012K9255l4929k44312
18929d6689K09171K18878j47409j34910J2662J02399j68002k64874J0029J2372
18919a96373j3087J55606K16374J37657p0890k68942k53123m1149K36990J99338
18909A02401j00973j84839l5188q7280l1709L63761R4119L4343J19381n3165q6517
$$ y = [1378133, 1682490, 1899288, 1872010, 1770872, 1763784, 1551175, 1542695, 1493390, 1347812, 1477404, 1711404, 1923063, 1839802, 1719505, 1674923, 1688206, 1494197, 1349233, 1248450, 1297305, 1113346, 661106, 420411, 287507, 205787, 79467, -40007, -21829, 141178, 236688, 195445, 342857, 345528, 470393, 388130, 196673, 106830, -65108, -73275, -105271, -31420, 121962, -208149, -152684, -152253, -361767, -279170, -69715, 203297, 232552, 197623, -46689, 162482, 381360, 233951, 99041, 111703, 214102, 46100, -218774, -208745, -196373, -209460, -53854, 162520, 300177, 229287, -39655, -292778, -333927, -96937, 102401, 1428, -183411, -218599, -305879, -337588, 26173, 120292, 154635, 274016, 220851, 134334]
18898A34334k78997l5168L14138L4654Q9373J47942p4791o6016j85177l6473O3547
18887A07366R241P314j08321k01208j20908J46359K40752L8099j47218j51154
18877a79678M3469R5488R4614R0651j02992j05728R3321J13381P6215k3324J9427
18866B14844j19580q5159Q415J36346o1067L0996k45536r0413q5743P0257K30086
18855C446N9765J02004k83276k07674R1739L3825P4959J69279j10256k6928K3404
18844f9713k1967r5487R9197N3760K53889m7107j2065j58677N9039J9431M7814
18833A28114N4466q4357k27312r2263M2393J88452J39299M8072j15057K4872J02167
18822B08846K1587o9658k4953J7335n1459l3946n4560o7761p29j93197n376N1724
$$ y = [134334, -144663, -179831, 134307, 168961, 258334, 406276, 331485, 265469, 80292, 43819, 107366, 116607, 123921, 15600, -185608, -306516, -160157, 80595, 118694, -28524, -179678, -136209, -40721, 53893, 144544, 41552, -64176, 29145, 142526, 218741, 195417, 214844, 95264, 10105, 18520, 154866, 93799, 124795, -120741, -211154, -296897, -226640, 3446, 63211, 165215, -118061, -325735, -233996, -200171, -125212, 44067, -66189, -93117, -69713, -91680, -187167, -87970, -34210, 219679, 172572, 160507, 1830, 60869, 80300, 128114, 182580, 98223, -129089, -221352, -178959, 9493, 148792, 196864, 81807, 106679, 208846, 230433, 160775, 135822, 153157, 101698, 67752, 13192, -54569, -55298, -248495, -253871, -202147]
18810b02147q8541j44158r1249k08634J65615Q617m2335L31638K01878J55268
18800H5952J33131j2442m5367j28517m3161j01962p6061J9749j26022J03252J07566
18789h3882Q3487k1460p3515j17289J19597J27596m6495r4008O0164l8280P7205
18778f880K46147N5723k16974Q2304K48756J94710K15137L14001R3497j55367
18768A071054k01089q974n9878k68209l11023p947P8192K943j20274r6828j35045
18757e7078p6074O6916L11064J06799J0053P1605j49472J54230J00609p6244j15671
18746C46737j02393L8499l4951n8102j1894j7422N4859K13694k1497J05326m2707
18735D70149L323M9874r1792j99738M1135N0517k49811j21813N8226K31055J42115
$$ y = [-202147, -290688, -434846, -526095, -734729, -569114, -560497, -602832, -271194, -69316, 85952, 219083, 206641, 161274, 32757, -10404, -112366, -188427, -168678, -294700, -191448, -83882, -395, -21855, -95370, -212659, -93062, 34534, -11961, -105969, -45805, -84085, -6880, 239267, 294990, 78016, 160320, 409076, 603786, 818923, 1132924, 1226421, 1071054, 869965, 860991, 801113, 532904, 221881, 213934, 292126, 295069, 174795, 77967, -57078, -133152, -66236, 244828, 351627, 361680, 433285, 283813, 438043, 538652, 462408, 346737, 244344, 282843, 247892, 189790, 177896, 160474, 215333, 429027, 407530, 512856, 470149, 473472, 523346, 431554, 231816, 272951, 323468, 73657, -48156, 10070, 241125, 383240]
18724C83240j54556k40783L8148J81208n4453J7045J54782k66316j19562J3969
18714d7278O0626J89452J4785j63943l17362J04997J97287j84926o2548M1370
18704a67540J44221K87592q1638k8036k353n4248M5157K8158o8188O4371k6601
18693A40895o5054R8390J79012K05723N8353O2502k78099k64125j60923J7736
18683e590m5330q481J36731P0724M7011q7063p4096j06174j73526J77345J92769
18672A24320j54667j24017n9769o429J69726L6524n3515J8523J15677M3178J82810
18661B92361n0131K2107j67384q1923Q3301k3137m3310J01941p1099M5185o9316
18650C8595N7839j29972p4291N0216J98403N4022k08868o6419m5004o874j41926
$$ y = [383240, 228684, -12099, 26049, 207257, 152804, 169849, 324631, 58315, -61247, -47278, 13348, 202800, 217585, 53642, -263720, -158723, 38564, -146362, -208910, -167540, -23319, 264273, 182635, 154599, 152246, 97998, 143155, 171313, 103125, 167496, 140895, 75841, 174231, 353243, 558966, 617319, 679821, 401722, 137597, -23326, -5590, -50920, -59401, 77330, 148054, 195065, 108002, 33906, -72268, -245794, -68449, 124320, -30347, -154364, -214133, -220562, -50836, -14312, -67827, -49304, 66373, 109551, 292361, 242230, 264337, 96953, 15030, 98331, 75194, 31884, 133825, 62726, 107911, 38595, 96434, -33538, -107829, -57613, 140790, 194812, -14056, -80475, -125479, -132353, -274279]
18639b74279N5299J06567Q9935J93979j42417J1415l3031J6581K448r9815J5869
18628e7449q8077R3644J99460m0644L0920j47194m0091L5191r2471j06010p372
18617b20093M3820L6161J36622k5665J9525l9223O4047J38764N2015q4107j32481
18606a0615l0102R9760J1367K57202r220K4506o2528j8597n1066n6630l5853j33618
18594a5394k27483Q7157K72115l8583j31387J02577K61947J23846l7316M8000
18584D45479j62155L3204r4257q5981J14232P6871r796p7827j09541j44251L9559
18573B5537J81792K7935k23597k06072j05652J09251K23357p4039J5512R0471
18563F4495J25554j834o1667J305P0989j4024q9087j27530L3671j2475Q591k28187
$$ y = [-274279, -218980, -112413, -22478, 171501, 29084, 40499, 7468, 24049, 26497, -73318, -57449, -145526, -51882, 147578, 106934, 137854, -9340, -49431, -14240, -106711, -212721, -220093, -176273, -140112, -3490, -29155, -9630, -48853, 15194, 153958, 205973, 121866, -10615, -40717, 59043, 70410, 327612, 318392, 342898, 280370, 261773, 210707, 154077, 118224, -15394, -242877, -155720, 116395, 77812, -53575, 49002, 310949, 434795, 397479, 445479, 283324, 316528, 222271, 136290, 250522, 327393, 317597, 239770, 130229, -14022, 25537, 207329, 235264, 11667, -194405, -300057, -190806, 32551, -41488, -25976, 64495, 190049, 188215, 126548, 127853, 198842, 184818, 95731, -31799, 1872, -10603, -2012, -230199]
18551b30199L2437L02669K11939J50378L1906l20507k02052q3614K94778J08012
18541B95747o6202o6045k17859q5464K53821r8178m481J93519K19871J51056j44945
18530D30840j37371m1098J02971j37502r7950R5978m4846J53356k2709r4540l0561
18519A76568j3625N3642J7N9385J5219o1656N8097k05142q4499j0472j08641q5631
18507b06738j21413L7735J5868J95941Q7257J75271r721k3749o3445R1161J12653
18496B90820q710J53054J13450j20688N6018J8244j23908k3372l0302M7632r7857
18485B74381j47734o1041L18148L2861J40566j62197l96390j47369P0307O4339
18475a4129J04160j82791k21154P1377L42239J89431o5230j9822j12940p1433
$$ y = [-230199, -197762, 104907, 316846, 467224, 499130, 178623, -23429, -107043, 187735, 295747, 229545, 163500, -54359, -139823, 113998, 15820, 11339, 204858, 424729, 575785, 430840, 293469, 252371, 355342, 217840, 119890, 215868, 171022, 324378, 301669, 207129, 176568, 162943, 216585, 216602, 275987, 291206, 229550, 287647, 82505, -1994, -12466, -121107, -206738, -328151, -290416, -274548, -78607, 8650, 183921, 174200, 150451, 87006, 178167, 290820, 282110, 435164, 548614, 427926, 483944, 502188, 378280, 354908, 324606, 372238, 274381, 126647, 65606, 383754, 416615, 557181, 394984, -1406, -148775, -78468, -14129, 90031, -92760, -313914, -242537, 99702, 289133, 223903, 204081, 91141, 19708]
18465A9708K68955J54302L7490J79466L483n8231o1479L8683j08479l2874K5293
18454D66317L6597J42882O0572J76572l6780Q7325l2750j61723R5013J14236J00089
18443A048350j9791k93299k81918J23787K10841J57811L3551J82556J92651j25097
18433A229442j07664j97739o4748J06998n0155L5028K28295O747j6743Q3314J05472
18422A358247P4136j7325j70025k04671K20816K32340o3365n4073J27517J13076
18412A616673K59238K87860K69182K45670o260l23209j06559K5619k51952j11564
18402A904698r7615j65407k43663l5469J31127p2193o2258J40363J52600J99853
18392A852036K03330K30519Q7240j42389M38882M33920L46807M67859J74606Q3615
$$ y = [19708, 288663, 442965, 480455, 659921, 663404, 605173, 543694, 582377, 473898, 441024, 466317, 502914, 645796, 706368, 882940, 846160, 933485, 900735, 739012, 834025, 948261, 1048350, 1028559, 735260, 453342, 577129, 787970, 945781, 979332, 1161888, 1354539, 1229442, 1121778, 924039, 859291, 966289, 916134, 951162, 1179457, 1186204, 1169461, 1252775, 1358247, 1432383, 1415058, 1245033, 1040362, 1261178, 1493518, 1430153, 1376080, 1503597, 1616673, 1875911, 2163771, 2432953, 2678623, 2672363, 2349154, 2242595, 2268214, 2016262, 1904698, 1807083, 1641676, 1398013, 1362544, 1493671, 1421478, 1359220, 1499583, 1652183, 1852036, 2055366, 2285885, 2373125, 2230736, 2669618, 3103538, 3450345, 3918204, 4092810, 4176425]
18382D176425o1393q0268J94851r042j99246m7298n3061m8409j9626P7653J20325
18371D050911Q7406M00723M04652J77331K81906L56473M00088O36639M69365N31389
18361G796883M73065M75765N60216L94086O57001O77098R37207J165491J598059
18352A4734871K010879K740816L978002N199654P976835J3332370K1851388L1289255
18344A03114070L5482623L0503440K3541919K4246897L0192954K2378604l29084
18337B69131423j6325292j0710535K592685N984159J73362m298486m67477O076370
18329B52156209J5709860K0127197M345681j9163818k7575625k0396844j7162935
18322B08039725k8071102l9501171l5720475k2407544j3086559q217297n566043
$$ y = [4176425, 4115032, 4034764, 4229615, 4220573, 4021327, 3974029, 3920968, 3872559, 3852933, 3930586, 4050911, 4138317, 4539040, 4943692, 5121023, 5402929, 5759402, 6159490, 6796129, 7265494, 7796883, 8269948, 8745713, 9305929, 9700015, 10357016, 11034114, 11971321, 13136812, 14734871, 16745750, 19486566, 23464568, 28664222, 36641057, 49973427, 71824815, 103114070, 138596693, 169100133, 192642052, 216888949, 247081903, 269460507, 269131423, 252806131, 242095596, 244688281, 250672440, 250845802, 246547316, 246079839, 252156209, 267866069, 287993266, 292338947, 273175129, 245599504, 225202660, 208039725, 179968623, 140467452, 104746977, 82339433, 69252874, 61035577, 55469534]
18315E5469534m391483l731302l190797k618010k142677j781490j478665j514088
18307C4621022j576269j640750j233608j186431j025980j256277j096538p22786
18299B4882383p24641j123847j042225o49807o14126q32546q47811q63773p97474
18290A7386133m71634q38630o18007l87719m69446k92493n50073m67441n16487
18281A2774203l78180n64872m48561l28304o12517m66614l62350j71261k27590
18272I213954m20027l14949l76299k99178k15719j95970k36501l98952k27633
18263F528726k47390j3732p1005l14226l27545q2802j52194k13007j57715R248
18253D958358k07729l28865k12936j10810j82048j0948P5743j74691k21983j39138
$$ y = [55469534, 51078051, 47346749, 44155952, 41537942, 39395265, 37613775, 36135110, 34621022, 33044753, 31404003, 30170395, 28983964, 27957984, 26701707, 25605169, 24882383, 24157742, 23033895, 21991670, 21341863, 20727737, 19895191, 19047380, 18183607, 17386133, 16914499, 16075869, 15457862, 15070143, 14600697, 14308204, 13758131, 13290690, 12774203, 12396023, 11831151, 11382590, 11054286, 10441769, 9975155, 9612805, 9441544, 9213954, 8793927, 8478978, 8102679, 7803501, 7587782, 7391812, 7155311, 6756359, 6528726, 6281336, 6267604, 6196599, 5882373, 5554828, 5472026, 5319832, 5106825, 4949110, 4958358, 4750629, 4421764, 4208828, 4098018, 3915970, 3905022, 3980765, 3806074, 3584091, 3444953]
18243C444953k7354J2762j18223N8464p1442j09649j27133K2098P0039M026m5091
18232C113450o9219k12496j88828k71080k9262m925j92035q7588M1803o7297m5331
18221A987192N3665l29406k03138q6209q5849J16088K70291r6046k05042J42192
18211A563738q9493J4785Q2794K464K9066j2613Q217L3160J08132o558L3135R6901
18199A863728j79667o331j95085j54697J1597m3257k33804j57908K9507K00691
18189A134774P1202m3411p3358K56641J20277k70872j22781r2467k8133J12071
18179A063943j1776J9431l8112R6773P7352j58009L2502J96233J48147j42041
18169A284443j49205j66346J97757K50301m1017k00024l04993j61368J16426P0525
$$ y = [3444953, 3417599, 3430361, 3312138, 3370602, 3299160, 3189511, 3062378, 3084476, 3154515, 3158541, 3113450, 3044231, 2831735, 2642907, 2371827, 2342565, 2337640, 2145605, 2058017, 2099820, 2032523, 1987192, 2040857, 1711451, 1508313, 1422104, 1336255, 1452343, 1722634, 1626588, 1421546, 1563738, 1474245, 1489030, 1571824, 1574288, 1603354, 1590741, 1598958, 1632118, 1740250, 1733692, 1766827, 1863728, 1684061, 1677730, 1482645, 1327948, 1339545, 1296288, 1062484, 904576, 934083, 1134774, 1205976, 1162565, 1089207, 1345848, 1466125, 1195253, 1072472, 980005, 951872, 1063943, 1052167, 1071598, 1033486, 1130259, 1207611, 1049602, 1082104, 1278337, 1426484, 1284443, 1135238, 968892, 1166649, 1416950, 1375933, 1175909, 870916, 709548, 825974, 896499]
18159H96499K05126J46938j5834k17731L2752Q9229R837k77490m02013r496J18065
18148E75882K94042Q8415K18479K61280j8214j32167n0988J96998J83723J56065
18138A773515N6772j5465P7120L09941K27425O6140M1016L69781L46821N28208
18128C781274L75381L61115N92234R39082J093322J279100J631763K196261K993260
18119A5242792M081444O525846J1067920J9456258L3596376M7026007L7885493
18112A74882136J4242826J574599K6337L312259l7509161n9713407l3770888j6670557
18104D6374144r216309n993754m172258k823689k051534j656669j301166j409357
18096A7749408j248656j027183n49730p87901p39159o73222n37566o62896o51480
$$ y = [896499, 1101625, 1248563, 1232729, 1014998, 1047750, 1136979, 1146816, 869326, 467313, 457817, 575882, 869924, 958339, 1176818, 1438098, 1419884, 1287717, 1236729, 1433727, 1617450, 1773515, 1830287, 1814822, 1891942, 2201883, 2429308, 2495448, 2536464, 2906245, 3253066, 3781274, 4156655, 4517770, 5110004, 6049086, 7142408, 8421508, 10053271, 12249532, 15242792, 19324236, 25850082, 36918002, 56374260, 89970636, 136996643, 174882136, 189124962, 190699561, 190725898, 194038157, 156528996, 96815589, 63044701, 46374144, 37157835, 31164081, 26991823, 24168134, 22116600, 20459931, 19158765, 17749408, 16500752, 15473569, 14923839, 14135938, 13396779, 12723557, 12185991, 11523095, 10871615]
18087A0871615l08992l25357n82403m90402l18569m32567m36466m08055k24600
18078G344204l85970n92552l83232N4743J84921j3957k69873k67508l08918j56161
18068E205697q0580k03784j69316j29699j62308m22586l37790j12151J6708j04923
18058C499268j87409k05748o5346j96214J2530R1185k3780j47822M9285l66520
18048B459429j99865K388M09197K16780p0250m3464r9759j16548r8524l09990
18038B149394j33096k29k07709j87341r9417r2355N4750L6097J884k28896k10388
18027A082694J50646O2007l0210R2632j97j63078q7444R1736j67150r5217r2389
18016H44030k4457r5217r9280J64285J12199j12715k3281P4280K79179M3635j53467
$$ y = [10871615, 10562623, 10237266, 9654863, 9164461, 8845892, 8413325, 7976859, 7568804, 7344204, 6958234, 6365682, 5982450, 6037193, 6222114, 6208157, 5938284, 5670776, 5361858, 5205697, 5125117, 4921333, 4752017, 4622318, 4460010, 4037424, 3699634, 3587483, 3604191, 3499268, 3311859, 3106111, 3040765, 2844551, 2857081, 2948266, 2924486, 2776664, 2825949, 2459429, 2259564, 2261952, 2671149, 2887929, 2817679, 2774215, 2674456, 2557908, 2459384, 2149394, 2016298, 2016069, 1808360, 1621019, 1521602, 1429247, 1483997, 1520094, 1521978, 1293082, 1082694, 1233340, 1295347, 1265137, 1357769, 1357572, 1194494, 1107050, 1198786, 1031636, 936419, 844030, 819573, 724356, 625076, 789361, 901560, 788845, 765564, 839844, 1119023, 1162658, 1009191]
18005A009191j09268K46815K83790j06514k52284O3454K8431K64575l3913k85280
17995A108997l67991q9769k0006j11069M7355J1025o3283k05415L5351K89228
17985F34423L75978J86619J89206J25722j9862N1422q424J653M5684K7876j95906
17974A414391o7716k3020R4167K6417J17558r8896j24599L43j9121r4052o5055
17963A160417J56772J9595Q9435J41966p6160l3628k18860j65071J8290M4078
17953A136834J47777N0083j14436j71040J08862J2163J06630J90516K85587j2028
17943A740948n0275l14929k80183L09098R383j46522N2034L21493J83946k5196
17933A799797k0504Q7789j429L5479p0291m2141Q6857m6465p998m2525j83282
$$ y = [1009191, 899923, 1146738, 1430528, 1324014, 1071730, 1135184, 1163615, 1428190, 1394277, 1108997, 741006, 651237, 631231, 520162, 567517, 578542, 515259, 309844, 345195, 634423, 1010401, 1197020, 1386226, 1511948, 1492086, 1543508, 1535084, 1536737, 1582421, 1610297, 1414391, 1346675, 1323655, 1417822, 1444239, 1561797, 1462901, 1338302, 1338645, 1319524, 1225472, 1160417, 1317189, 1336784, 1426219, 1568185, 1492025, 1458397, 1239537, 1074466, 1092756, 1136834, 1284611, 1334694, 1220258, 1049218, 1158080, 1170243, 1276873, 1467389, 1752976, 1740948, 1690673, 1375744, 1095561, 1404659, 1414042, 1267520, 1319554, 1641047, 1824993, 1799797, 1779293, 1867082, 1865653, 1901132, 1830841, 1788700, 1875557, 1829092, 1821094, 1778569, 1595287]
17922A595287m5846j1433J80172J47037K06347J92127K08672J70461M08579N51678
17912C603081J98322K17004M02009P1905j35432q6917j56299o8747N817L63759
17902D414502L18394L58560P18987R03666J185414J172678J036231J061084J234786
17893A2404302J369599J847412K163597K672876L910632N409376Q349230J3654703
17885E1781727K1587772L0594303L8459659M1623995L8896679K9287638J5464566
17878B67696339n83381j7237156l1124102l9795881m0327493l3266897k3198647
17871H2162782j4315002q013814m264275j962704l48694J487349M290849Q383772
17863F7420263J4712108K3977531L4908364M4384109M8019902M4150339L2764963
$$ y = [1595287, 1549441, 1538008, 1718180, 1865217, 2071564, 2263691, 2472363, 2642824, 3051403, 3603081, 3801403, 4018407, 4420416, 4492321, 4356889, 4269972, 4113673, 4044926, 4050743, 4414502, 4732896, 5091456, 5810443, 6714109, 7899523, 9072201, 10108432, 11169516, 12404302, 13773901, 15621313, 17784910, 20457786, 24368418, 29777794, 38127024, 51781727, 73369499, 103963802, 142423461, 184047456, 222944135, 252231773, 267696339, 267112958, 249875802, 218751700, 178955819, 138628326, 105361429, 82162782, 67847780, 59833966, 55569691, 53606987, 53258293, 54745642, 59036491, 67420263, 82132371, 106109902, 141018266, 185402375, 233422277, 277572616, 310337579]
17856C10337579J6529680j966190k1758290l8405495m8372941m8831015m1093036
17849A26440292k9148512j8891794j1811987p822387n713902m385298l573766
17842D5092646k975268k491032k305480j696429j453623j444948j681464j489886
17834B9554516j423285j713867j420501r43222o74511p31358q43145o96144m69811
17825B0638672m71375o17589p21163r22861r57493q49701o83313q83328p11056
17816A3820793n79098o04850m46265m06376l09371m68918m54070k85406k90648
17807I975791l69388l07113l45268l18958k18302k86403l84972m24434m02670
17798F918283q3092k89075j55880n5491r4479j92169k77540k30276j07104r6526
$$ y = [310337579, 326867259, 324901069, 303142779, 264737284, 216364343, 167533328, 126440292, 97291780, 78399986, 66587999, 58765612, 53051710, 48666412, 45092646, 42117378, 39626346, 37320866, 35624437, 34170814, 32725866, 31044402, 29554516, 28131231, 26417364, 24996863, 24053641, 23379130, 22647772, 21804627, 21108483, 20638672, 20167297, 19549708, 18828545, 17905684, 16948191, 16098490, 15415177, 14531849, 13820793, 13241695, 12636845, 12190580, 11784204, 11474833, 11005915, 10551845, 10266439, 9975791, 9606403, 9299290, 8954022, 8635064, 8416762, 8130359, 7745387, 7320953, 6918283, 6835191, 6546116, 6390236, 6334745, 6240266, 6048097, 5770557, 5540281, 5433177, 5336651]
17788E336651j04637l45808r0439J76418O6470j48839k08842k09748k05689k55238
17778D010299j28990j51250N233J1080q5953n0636j03701k42099l50702k27530
17768B685751J74890O1127j57356k7593Q1303j10810P1390K6903l5704k03301
17758B566600j98360j70108l7380k85734n1436K28015J04072j74277J9805R856
17748B011053j67789j29449K8681K8897k11791j26333m8846J71557N277k07680
17738A353577k11519P510J40070K5931r7170J3502o773k4950j18991J70868N5137
17727A307192R5853k994o90L25403J12656j04984N2832j48006q3215j50503r2954
17716A310590N6140J55800q6589m6588N70j80585O6309J01310K05316J91064J36178
$$ y = [5336651, 5232014, 4886206, 4795767, 4972185, 5038655, 4889816, 4680974, 4471226, 4265537, 4010299, 3881309, 3730059, 3735292, 3746372, 3660419, 3609783, 3506082, 3263983, 2913281, 2685751, 2860641, 2921768, 2764412, 2736819, 2818122, 2707312, 2778702, 2805605, 2769901, 2566600, 2368240, 2198132, 2160752, 1875018, 1823582, 2051597, 2155669, 1981392, 2001197, 2011053, 1843264, 1713815, 1742496, 1771393, 1559602, 1433269, 1384423, 1555980, 1561257, 1353577, 1142058, 1149568, 1289638, 1315569, 1218399, 1231901, 1225128, 1200178, 1081187, 1252055, 1307192, 1403045, 1400051, 1399361, 1724764, 1837420, 1732436, 1785268, 1637262, 1554047, 1403544, 1310590, 1366730, 1522530, 1435941, 1389353, 1389923, 1209338, 1275647, 1376957, 1582273, 1773337, 1909515]
17705A909515J69084O0167J1017J19714p6934r0386n8201K29833J36673K44891
17695B655373J44610o0675j50012R3459L21238q2712j20843P108o6411J18166
17685B859301J56209J59346J05746m7869R4970K1834P2756j99166k76808M5385
17675B991704j27494k41120j13638j71619n0323k66367m15320j95827J4297J1526
17665A435819R526N8419j36202k9059Q8561p2885L02482K39697P9338r4708K2818
17654A903806N6835j32765j09060J57268J07624R9190q9335j32575n6299O8587
17644A873276J91685k3367j41027j95550R0634J24770L18810J11512L22584J05737
17634B779064K50931K75519K87059J92696J53170N8767j10973P0080L73779J36171
$$ y = [1909515, 2078599, 2138766, 2149783, 2269497, 2192563, 2102177, 2043976, 2273809, 2410482, 2655373, 2799983, 2739308, 2589296, 2682755, 3003993, 2921281, 2800438, 2807546, 2741135, 2859301, 3015510, 3174856, 3280602, 3232733, 3327703, 3349537, 3422293, 3223127, 2946319, 2991704, 2864210, 2623090, 2509452, 2337833, 2287510, 2021143, 1605823, 1409996, 1424293, 1435819, 1445345, 1503764, 1367562, 1338503, 1427064, 1354179, 1656661, 1896358, 1975696, 1880988, 1903806, 1960641, 1827876, 1718816, 1876084, 1983708, 2082898, 1993563, 1860988, 1804689, 1873276, 2064961, 2041594, 1900567, 1705017, 1795651, 1920421, 2239231, 2350743, 2673327, 2779064, 3029995, 3305514, 3592573, 3785269, 3938439, 3997206, 3886233, 3956313, 4330092, 4466263]
17624D466263K13992M37533L76000L87443M56774L28678O95904J063918R10005
17615I336510Q21212J041616J273658J587708J951324K567443L650814N137200
17607B7367485Q093530J3224826J9805578K2569017J8675355J6842616K2430900
17600A49009307L4367029L3500649Q967769k472400K69639R141495Q398771k6179565
17592B15002694l6387897k3786997j3849697r988951j9534385k3317812j3890758
17585G4246197n408597P83004O891138J3205828J6324205J3778196J2867201J7074456
17577A49761628K7012956K7611967O990966l602370j248169O168529O280351k2944384
17569A96031474l3154536k1892947j3420027r690150j7964025k2462464j4999769
$$ y = [4466263, 4680255, 5117788, 5493788, 5881231, 6338005, 6666683, 7362587, 8426505, 9336510, 10157722, 11199338, 12472996, 14060704, 16012028, 18579471, 22230285, 27367485, 35461015, 48685841, 68491419, 91060436, 109735791, 126578407, 149009307, 183376336, 216876985, 225844754, 223372354, 223641993, 232783488, 241182259, 215002694, 178614797, 154827800, 140978103, 130989152, 111454767, 88136955, 74246197, 68837600, 69620604, 76511742, 89717570, 106041775, 119819971, 132687172, 149761628, 176774584, 204386551, 211377517, 207775147, 206526978, 212695507, 218975858, 196031474, 162876938, 140983991, 127563964, 117873814, 99909789, 77447325, 62447556]
17562F2447556q796501n544300m239988l539512k948172k240303j786582j594559
17554C1757639j685750j606825j496180r77769j121851r41644r98196r61381r13658
17545B1054385o93648p07950n39492n24573o74413p68006p74782n05110o09377
17536A5257034o59800n63655p55590o07609o22623n16168l36692l17062l88636
17527A0489199k01644j65057m86512l24720j09887n15955n83571q3827m7383p6906
17517G893737n41064m69890p3312j01793n5453k89598j95286k01731j74232l03367
17507E488011k16476j05073q5276j69268j1145j27711j23050p0371j1456j98735
17497D369450j18674k99178j94237j26706k0953j33424j09638o279j06297k14842
$$ y = [62447556, 53651055, 48106755, 43866767, 40327255, 37379083, 35138780, 33352198, 31757639, 30071889, 28465064, 26968884, 25991115, 24869264, 23927620, 22929424, 21968043, 21054385, 20360737, 19652787, 19113295, 18588722, 17914309, 17146303, 16371521, 15866411, 15257034, 14597234, 14033579, 13277989, 12670380, 12047757, 11531589, 11194897, 10877835, 10489199, 10287555, 10122498, 9635986, 9311266, 9201379, 8685424, 8101853, 8018026, 7970643, 7893737, 7352673, 6882783, 6809471, 6707678, 6652225, 6362627, 6167341, 5965610, 5791378, 5488011, 5271535, 5166462, 5081186, 4911918, 4900773, 4773062, 4650012, 4579641, 4568185, 4369450, 4250776, 3951598, 3757361, 3630655, 3609702, 3476278, 3366640, 3360361, 3254064, 3039222]
17487C039222j44452L6969j21953m2230O1379k85461j24145l4241j83209l79979
17477A821900k02268J90185L23986R6695r8846j97739q5373J68028m5725k20646
17467A750197l3937n883q8164l6071l5839M909N4245q3262k16769o5274P6699
17456A320851L0932l5207L4273J85931R1077L628j05535K35167L47021K25118
17446B333256L83261M36533J28644L6728j51429l50530n7377p1384k81969j92585
17436B213148l04196l81034m16723N2426K28421o8916j26722L3396J43620J17366
17426A490786J65451J9659q2423J21328L90590K56400J30005j09224j19802k10364
17416B052406l36288k21462j44304M0757m4507L5916n0359l23634k5335J75066
$$ y = [3039222, 2894770, 2931739, 2809786, 2767556, 2828935, 2543474, 2419329, 2385088, 2201879, 1821900, 1619632, 1809817, 2133803, 2230498, 2131652, 1933913, 1848540, 2016568, 1970843, 1750197, 1716260, 1710377, 1622213, 1586142, 1550303, 1555212, 1609457, 1526195, 1309426, 1244152, 1320851, 1351783, 1316576, 1350849, 1536780, 1627857, 1631485, 1525950, 1761117, 2108138, 2333256, 2716517, 3153050, 3281694, 3318422, 3166993, 2816463, 2759086, 2687702, 2405733, 2213148, 1908952, 1527918, 1111195, 1163621, 1392042, 1323126, 1196404, 1229800, 1373420, 1490786, 1656237, 1675896, 1593473, 1714801, 2105391, 2361791, 2491796, 2382572, 2262770, 2052406, 1716118, 1494656, 1350352, 1391109, 1346602, 1382518, 1332159, 1008525, 983190, 1158256]
17406A158256l0225k54276p650O0894k28439j7373K59878R0451q3639K4385j5844
17395I56418j18637j512K681J8548K6040j48016j28718j31520P8290o4516q7301
17384D01757K475K42621j59817j20870L72847M37897J26352r767K04150J31191
17374A628836J79979q4181j64400k36736j21246L5016K64268J4520l44883m0919
17364A130254O3400K9653L6053J86885q4612k12415o7716J60529K95354P8966
17354A616351p591M2149J94578p9147j94385j45178k7064J9267M45672O45380
17344B510032N24959L79599J12089j91143l23486n80914m34195j16240j53631
17335A727070k36023k39908q1482o1027j89350J61L5654M4808r1390J41329J27106
$$ y = [1158256, 1128031, 873755, 866105, 926999, 698560, 681187, 941065, 1031516, 947877, 972262, 956418, 837781, 836269, 838950, 857498, 883538, 735522, 606804, 475284, 553574, 489058, 401757, 404232, 646853, 487036, 366166, 739013, 1176910, 1303262, 1293495, 1497645, 1628836, 1808815, 1724634, 1560234, 1323498, 1202252, 1237268, 1501536, 1516056, 1171173, 1130254, 1193654, 1223307, 1259360, 1446245, 1361633, 1149218, 1081502, 1242031, 1537385, 1616351, 1608760, 1650909, 1845487, 1766340, 1571955, 1426777, 1399713, 1418980, 1864652, 2510032, 3034991, 3414590, 3526679, 3335536, 3012050, 2431136, 1996941, 1880701, 1727070, 1491047, 1251139, 1169657, 1108630, 919280, 919441, 955095, 999903, 908513, 1049842, 1176948]
17324A176948K07074J88002J73303K27428j03823L2776j11064r0234n0446r5369
17314A554595m06220j74600Q6155k41065j15663J71836P3178o771j22104k42679
17304E76662j85520J39152J28982J46065k7770J0251j42746j36520M4658j2152
17294E41062j65077j2964J96163Q4049j18375j10947n9667L598q2775q0114r2387
17283A02566O5862J49766Q3506r7999k8527J06478J1082j53694J56386J38373
17273E33799J65369J2766j95212k31100j20242j52470R7380J11920M1095M554
17263B67859j05814k12353k2973J55378N4018O4375O1678K7005j03547j65999
17253A9627r8005J55066J04637J45602j57903o4141p4607L25820L34328n3827
$$ y = [1176948, 1384022, 1572024, 1745327, 1972755, 1868932, 1901708, 1790644, 1700410, 1649964, 1554595, 1148375, 973775, 1059930, 818865, 703202, 875038, 948216, 941445, 819341, 576662, 391142, 530294, 659276, 805341, 777571, 787822, 645076, 508556, 553214, 541062, 375985, 363021, 559184, 643233, 524858, 413911, 354244, 357842, 275067, 194953, 102566, 168428, 318194, 401700, 303701, 275174, 381652, 392734, 239040, 395426, 533799, 699168, 711934, 516722, 285622, 165380, 12910, 110290, 222210, 263305, 267859, 162045, -50308, -73281, 82097, 136115, 200490, 262168, 289173, 185626, 19627, -78378, 76688, 181325, 326927, 169024, 104883, 30276, 356096, 690424, 636597]
17243F36597m6176j07780j50458n7231r8330m8584m6951k10689j0348r1851n8842
17232b90643K42191k2107Q017J02190m2042L1340o3078j14474L3066p377J96350
17221G3433J74638j07099k52900l3714K79575q7565p791M6562K6528K97356R0910
17210D99933k34470R850J0829j25385r6889R6453J57432q3017L6379o8057j67521
17199C5537j04556Q4583O2646L716R563N1391q0140L8902n0133j23702J85082
17188A12889K19553l8591n9312k1635k50011P5197N3308r082o6975j51914M3877
17177i2696J75039J18000k219n0898k67242J73353L7896k17971O2519L7700L0977
17166D458K35040n0652j54178j6258q5796Q888l8014R3320p7345k83K24383K15945
$$ y = [636597, 590421, 482641, 332183, 274952, 176622, 128038, 81087, -129602, -139950, -231801, -290643, -48452, -70559, -62542, 39648, -2394, 28946, -34132, -148606, -115540, -122917, 73433, 248071, 140972, -111928, -145642, 133933, 46368, 38577, 85139, 111667, 409023, 499933, 265463, 275313, 286142, 160757, 63868, 160321, 317753, 234736, 271115, 203058, 35537, -69019, 15564, 78210, 81926, 91489, 142880, 62740, 101642, 51509, -72193, 112889, 332442, 293851, 234539, 212904, -37107, 38090, 91398, 82316, 15341, -136573, -92696, 82343, 200343, 198124, 147226, -120016, 53337, 91233, -126738, -64219, -26519, 4458, 239498, 188846, 34668, 18410, -67386, -58498, -96512, -3192, -80537, -80820, 143563, 359508]
17154C59508K53373j96784k95748Q5390J80274o291j67007q8201J51971J14185
17144C90670m1900j70789j18628P8J55107q3772o7533K37570P2038J98112O6654
17133F37607k05850k1311J87098n2213k31657j91371J1655J33542p6462j06503
17123H4535P8752n1328M4796K24748N7153K5057l5470k08463q0802L4450j5437
17112A57991k27007N6208J24769J14801j75763j36735m2213J027J59940K32655
17102B65673K10242j47351l08130R9698j15141k79461j6013O4287j0730J80498
17092e6428K35913q4889j01778j46731Q7366J34096J22158P0102j62477J39591
17082B36923J80N1519j0049m4412l668K86351L37770L7788P8079m8063J31636
$$ y = [359508, 612881, 416097, 120349, 205739, 386013, 379722, 212715, 124514, 276485, 390670, 348770, 177981, 59353, 59431, 214538, 130766, 63233, 300803, 372841, 570953, 637607, 431757, 410446, 597544, 545331, 313674, 122303, 133958, 267500, 191038, 84535, 163287, 111959, 156755, 381503, 438656, 463713, 428243, 219780, 138978, 173428, 157991, -69016, -12808, 111961, 226762, 50999, -85736, -127949, -126922, 33018, 265673, 475915, 328564, 20434, 120132, 4991, -274470, -290483, -226196, -236926, -56428, 179485, 94596, -7182, -153913, -66547, 67549, 189707, 259809, 97332, 236923, 237103, 288622, 278573, 234161, 230493, 516844, 854614, 892402, 970481, 922418, 1054054]
17071A054054J79047J17547m8869j00417J03993J25643O2843k00687k57953n2264
17061I82937O061j90406n605q9761l27808N8620R0197K08664L10246m6551J20384
17050A116978J67955K10528J18407j34554j56723l8044J90056n649j74797j55547
17040A138610k12173j60412L7075J00897k50531j71908j73256O2609N1314J15560
17030E37785k37006l50465M470K92268K0136j73477r7932q1973J36130J7672O157
17019G3765j7896J54566K51263J11451Q3797j43466n6906j04674o8570J27225
17009D10555K20330J17362q9547k70873j76265O8101K41931O3998K92145J03592
16999I81329k76354n7055M07998O8544n1432p2955J50867J58600j29099j18067
$$ y = [1054054, 1233101, 1350648, 1301779, 1201362, 1305355, 1430998, 1493841, 1293154, 1035201, 982937, 988998, 798592, 792987, 703226, 375418, 434038, 524235, 732899, 1043145, 996594, 1116978, 1284933, 1495461, 1613868, 1479314, 1322591, 1284547, 1474603, 1468954, 1294157, 1138610, 926437, 766025, 803100, 903997, 653466, 481558, 308302, 370911, 422225, 537785, 300779, -49686, -45216, 247052, 267188, 93711, -4221, -86194, 49936, 67608, 73765, 55869, 210435, 461698, 573149, 656946, 513480, 456574, 351900, 283330, 410555, 630885, 748247, 658700, 387827, 211562, 279663, 521594, 585592, 877737, 981329, 704975, 647920, 1055918, 1124462, 1073030, 1000075, 1150942, 1309542, 1180443, 1062376]
16989A062376K26632J14281n5117q1652k91p8968k20379J27483J31248L133j82653
16978A046093j57434m1938j947J3992M836k3644J58767J35956J3435K18065m7491
16967A318690p5362j50386k9189p6205J24214l4777K1618l20302k55730k7960
16957D94611K53099J24718J0115J97900J1292l3710K63786L2263J53147O5797
16947A573018q9325p0160j46843l4523J29265L7053J76853J19173Q08l1249O2249
16936A726319K39031L5261k04559M4644K72447L86775K17855K90597P5026J15008
16926C198404P0917K2542k6548J92222N00528J57416M8986J22867K16659K58298
16916D762291J79257L94351M23838J03660J20489M62603O39064N03056N87843
$$ y = [1062376, 1289008, 1403289, 1348172, 1266520, 1266229, 1187261, 966882, 1094365, 1225613, 1228746, 1046093, 888659, 846721, 844774, 858766, 863602, 839958, 998725, 1134681, 1148116, 1366181, 1318690, 1243328, 1092942, 1063753, 987548, 1111762, 1076985, 1098603, 778301, 522571, 494611, 747710, 872428, 882543, 1080443, 1091735, 1058025, 1321811, 1354074, 1507221, 1573018, 1483693, 1413533, 1266690, 1232167, 1361432, 1398485, 1575338, 1694511, 1695319, 1664070, 1726319, 1965350, 2000611, 1796052, 1840696, 2113143, 2499918, 2717773, 3008370, 3083396, 3198404, 3269321, 3291863, 3265315, 3457537, 3958065, 4115481, 4164467, 4287334, 4503993, 4762291, 4941548, 5335899, 5759737, 5863397, 5983886, 6446489, 7085553, 7588609, 8176452]
16907H176452Q89673J114806J563563K171199K660290L614784N415376Q389802
16899C3995945J3290078J9020439K2511231K2407163J9814499J7867255J8708158
16892A67614768J3960459M406866o346667j3911844j2440894j4049987j8925794
16885A20306907k1316315k0552412j3315437n682468m82564M197944R818765J7667482
16877I0641902K8611862L7905681L9815433L6068786L0761158L0811301K6793183
16870C21409306J0399323p738732k4470330k6469462k4930691l2562430l8833158
16863A76803826m1369804l3191071k0526259j2085715q069783n962575m219489
16856E1379130l406621k749304k284768k086751j898723j657980j430182j277674
$$ y = [8176452, 9066125, 10180931, 11744494, 13915693, 16575983, 20190767, 25606143, 33995945, 47286023, 66306462, 88817693, 111224856, 131039355, 148906610, 167614768, 181575227, 185982093, 179635426, 165723582, 153282688, 139232701, 120306907, 98990592, 78438180, 65122743, 59440275, 58957711, 63155655, 72974420, 90641902, 119253764, 157159445, 196974878, 233043664, 263804822, 294616123, 321409306, 331808629, 324069897, 299599567, 273130105, 248199414, 215636984, 176803826, 135434022, 102242951, 81716692, 69630977, 61561194, 55598619, 51379130, 47972509, 45223205, 42938437, 40851686, 38952963, 37294983, 35864801, 34587127]
16848C4587127p94514r16284n77222n23899o35117m67221l80923m17977l31826
16839B9542144m20848k20124k47272k5085J90194M98493R08331J090735J699071
16830C3015639K975745M758668Q186477J3825657K4315404L9279943M7569388
16823A73926921L2709708J2647268K971587L862773k884853m4585621m5824800
16816A32822983j8832053J733184K0352392L7374145L7582107J8160593L315398
16809B32508749j251407K425076k0393686n1051603l0731294l676308J3450052
16802A41279579J4507004M620348r51570j668571l51180j8890585l1022734j7374530
16794I0147761m409086O468657J7631825K2907709J3966582K941351k002419j034440
$$ y = [34587127, 33792613, 32876329, 32299107, 31775208, 31140091, 30672870, 30291947, 29873970, 29542144, 29121296, 28901172, 28653900, 28628815, 28819009, 29317502, 30225833, 31316568, 33015639, 35991384, 40750052, 48936529, 62762186, 87077590, 126357533, 173926921, 206636629, 219283897, 222255484, 226118257, 223233404, 178647783, 132822983, 113990930, 115724114, 136076506, 173450651, 211032758, 229193351, 232508749, 231257342, 233682418, 213288732, 162237129, 131505835, 127829527, 141279579, 155786583, 160406931, 159455361, 157786790, 157435610, 138545025, 107522291, 90147761, 85738675, 92207332, 109839157, 132746866, 146713448, 149654799, 147652380, 146617940]
16786A46617940o438704l1268625l0331177j7342653r593452n828386m256347
16779D1558596k855016k099884j801371j734922j705022j422204j419219j322020
16771B7198938j568991j474600q17321n55901l55387n62504p40035q81913p72878
16762A9469408j081550p77938p52663q89504r12527o87612l34925o37112j82948
16753A3212629l80100m32832m52663l37745m97092k86638l16884l85680j15281
16744A0007714l09440k98266j91658j91233J9556k48833l44950l17862k85003
16735G840025n93921m21773j20282j04316k18831j42214j62123k64475j34722
16726E677368j13998k67331k02661k26828M8681K3712o3791p6848j79508m12983
$$ y = [146617940, 140179236, 108910611, 78579434, 61236781, 51643329, 45814943, 41558596, 38703580, 36603696, 34802325, 33067403, 31362381, 29940177, 28520958, 27198938, 25629947, 24155347, 23338026, 22782125, 22426738, 21864234, 21124199, 20242286, 19469408, 18387858, 17609920, 16857257, 15967753, 15055226, 14367614, 14032689, 13395577, 13212629, 12832529, 12399697, 11947034, 11609289, 11112197, 10825559, 10508675, 10122995, 10007714, 9698274, 9400008, 9208350, 9017117, 9036673, 8787840, 8442890, 8125028, 7840025, 7246104, 6824331, 6704049, 6599733, 6380902, 6238688, 6076565, 5812090, 5677368, 5563370, 5296039, 5093378, 4866550, 4915231, 4938943, 4875152, 4798304, 4618796, 4205813]
16716D205813l65824k0179M1470O582p4701j41328j10561R4484J43453j21143
16706C658066l93948l59199k17988m4751J37463m1131r8874k91711j13285R8719
16696B333361K90670Q7878j47035k24511R7569J28444j54230q4161l1843r3583
16686B202559j87312j24634m0813J12j24132k49879o0069L4495J00604M1785j2265
16675A580451K0229p8560N6108R8023j12506r8432j08987j72046j34661o0165
16665I89454P7723M9332R1774J43886J30147n5549m135k2688J03288O6453k0766
16654A548919l0825j11446K5685k457j13709j87422j23210J4525N4609j28634
16644I46035K7036J26890j87481j72958N3319J13686j70060J65895J08478l6039
$$ y = [4205813, 3839989, 3819810, 3861280, 3867862, 3793161, 3651833, 3541272, 3635756, 3779209, 3658066, 3264118, 2904919, 2686931, 2642180, 2779643, 2738512, 2639638, 2347927, 2234642, 2333361, 2624031, 2711909, 2564874, 2340363, 2437932, 2566376, 2412146, 2327985, 2296142, 2202559, 2015247, 1890613, 1849800, 1849912, 1725780, 1475901, 1415832, 1450327, 1550931, 1592716, 1580451, 1600680, 1522120, 1578228, 1676251, 1563745, 1465313, 1356326, 1184280, 1049619, 989454, 1067177, 1116509, 1208283, 1352169, 1482316, 1426767, 1422632, 1399944, 1503232, 1569685, 1548919, 1518094, 1406648, 1432333, 1429876, 1316167, 1128745, 1005535, 1020060, 1074669, 946035, 973071, 1099961, 912480, 739522, 792841, 906527, 736467, 902362, 1010840, 974801]
16634I74801K9123q0265Q17j70744m28965J27748L1159J06758K41291J0936j13339
16623G29320j24638m9691j47127P6834J55895n5511o8885j05382P6693P3770r895
16612E51383J14687p8389k62447m6820J94712J27981J71069J40252j60046l2681
16602G19701P066O2335p7206k00735j32710j69159O3995K68557K04102o4877n2235
16591F28834j42622j53490K35503J27197R2495P7690j22291J9069j58761j6447
16581E87177n8037O0063j32522l01001l3046j4554R0156K91220m3021j93845J79504
16570D32094j50137j41501J34832m0849k535K8872p8169n1145j34634Q2057J11049
16559A89934R669Q4861p2246p586M8402n5513k17944o0440l5331J28573J35843
$$ y = [974801, 1003924, 923659, 924476, 753732, 324767, 452515, 483674, 590432, 831723, 842659, 729320, 604682, 554991, 407864, 484698, 640593, 585082, 516197, 410815, 487508, 561278, 551383, 666070, 587681, 325234, 278414, 473126, 601107, 772176, 912428, 752382, 719701, 726767, 789102, 711896, 511161, 378451, 209292, 273287, 541844, 745946, 681069, 628834, 486212, 332722, 568225, 695422, 787917, 865607, 743316, 762385, 603624, 587177, 529140, 589203, 456681, 155680, 122634, 108080, 198236, 489456, 446435, 252590, 432094, 281957, 140456, 275288, 234439, 231904, 260776, 182607, 131462, -3172, 78885, 189934, 199603, 284464, 212218, 204632, 253034, 197521, -20423, -80863, -116194, 12379, 148222]
16548A48222N4408j10116L9265K32249M6956k0090p8686J28597l0164n5422j82461
16537A72758j09160j67026R4576J82827K08802M1623p9790j26211j41724l2168
16527D4507Q956J00066j61203r7991J44131P7096j3966Q7525o5999O3126N687
16516A91935r848L7688J47959J37936M7398L1992l26149l44168O6862R7090L1390
16505A10085J40132k58289Q6663L7572j5002n6043l9563N0719j93102k36037J0027
16494c62838L9282J11058L23633K68346P8393m880q6312l4492Q4970j36489n7355
16483B23316L2241p6219J66827l6477p6743j47897N3615L2706j62889m0000M2748
16472A1228K05346j32544p4407k5561p2401O5552J30435O3410J1860j90013k7987
$$ y = [148222, 202630, 92514, 131779, 364028, 410984, 390894, 312208, 440805, 410641, 355219, 172758, 63598, -103428, -8852, 173975, 382777, 424400, 344610, 218399, 76675, 44507, 53463, 153529, -7674, -105665, 38466, 115562, 101596, 189121, 123122, 186248, 191935, 182087, 219775, 367734, 505670, 553068, 585060, 258911, -85257, -18395, 78695, 110085, 250217, -8072, 78591, 116163, 101161, 45118, 5555, 56274, -136828, -372865, -362838, -323556, -212498, 111135, 379481, 457874, 452994, 366682, 332190, 417160, 280671, 223316, 255557, 179338, 346165, 309688, 232945, 85048, 138663, 171369, 8480, -31520, 11228, 216574, 84030, 9623, -15938, -88339, -22787, 107648, 171058, 182918, -7095, -35082]
16461c5082N7934q8205j0789N448j23522M4484j67758r2114N1731J20607J39724
16450i7542J27210p6422k79490O5829Q9231j51785K38143J61382J25058r9087
16440A02527L3389O3530k81109l3229J15048J17250P189r7126l0100j8947j09045
16429a30623n3190p6477j10512L5794J09580N2458J21703R5497J35523N9156K2398
16418B61307j48454q8650J05292Q6411P6598Q549j02216l50862M9955M7960J14383
16407F0273L2199j34042j70606O0584J8989O707P5415J2006k7043J84089R2833
16396B11404m3898k6233R9343Q8260J04261K8495j03213k04946o2558J47933N2114
16385B90962j4311J00109j09373r3364k06745J68563J58923j0020q0827j1253
$$ y = [-35082, 22852, -65353, -76142, -70694, -194216, -149732, -317490, -409604, -357873, -237266, -97542, 29668, -46754, -326244, -260415, -171184, -322969, -84826, 76556, 201614, 102527, 135916, 199446, -81663, -114892, 156, 117406, 124595, 27469, -2631, -21578, -130623, -183813, -260290, -370802, -335008, -225428, -172970, -51267, 44230, 179753, 238909, 261307, 112853, 24203, 129495, 215906, 292504, 301053, 198837, -152025, -102070, -54110, 60273, 92472, -41570, -212176, -151592, -132603, -125896, -50481, -38475, -65518, 118571, 211404, 167506, 141273, 240616, 328876, 433137, 461632, 358419, 153473, 90915, 238848, 290962, 276651, 376760, 267387, 174023, -32722, 135841, 294764, 284744, 203917, 192664]
16375A92664k01211j34913J08920K05970R7877J39345M919o8577j95357n015J04120
16364B48742k602m4245j30960j20886m5699M3928J62085J27127Q9038r9389J4097
16353B41236k1967r8845j0168j26300j9202J27034r0467j34444J90505K30109
16343B87491J08443J36422j72758P3638k4891K15599K22889J72068K53159K00938
16333A472998Q2741m2466r3883o4188k11398j50712k56461j15531j6885P4453
16323F78668J4093o606n7775k82309l3287J11917K46865J95271Q4244K25500P6749
16312A253330J20955j06708k12814j51876Q9589Q5579o6049j84236l46553k49628
16302B31589O2596J04675K00327J62690k04716j91100j92778j3835P9554j48330
$$ y = [192664, -8547, -143460, -34540, 171430, 269307, 408652, 413571, 344994, 149637, 144622, 248742, 246140, 201895, 70935, -49951, -95650, -51722, 110363, 237490, 326528, 227139, 241236, 219269, 120424, 110256, -16044, -35246, 91788, 1321, -133123, 57382, 287491, 395934, 532356, 359598, 433236, 408345, 623944, 846833, 1018901, 1272060, 1472998, 1555739, 1513273, 1419390, 1355202, 1143804, 993092, 736631, 621100, 604215, 678668, 692761, 686155, 628380, 346071, 312784, 424701, 671566, 866837, 951081, 1176581, 1253330, 1374285, 1267577, 1054763, 902887, 992476, 1078055, 1012006, 827770, 481217, 231589, 294185, 398860, 599187, 761877, 557161, 366061, 173283, 159448, 239002, 90672]
16292I0672K7990j6768R7500Q0080j90993k54637M9021K01380j9155j63806l0874
16281a29590N519J02677J22274M8987k72946j13477K18421K45472M3543J17420
16271C88300K1254J5997j1079l9705R0378L30857N6544J39968Q1382O3649R6968
16260A234513k61361k16985J14703J05204O8516K1058Q8671K06112j11637n7501
16250A191293n27j19050j03164p9494j22857K23102K06917J57214J67530O5509
16240A586473k23176n36316m98912p014J41208K91064L28629J07701P9598M0311
16230A309566j48409l8181r527j46956k961j41634j52168j93328r3179k56592
16220A26631j44496J73079O2931j42443J84610J68025J74101j17935N0738m8496
$$ y = [90672, 118662, 101894, 199394, 279474, 88481, -166156, -117135, 84245, 65090, -98716, -129590, -124071, -21394, 100880, 149867, -123079, -236556, -18135, 227337, 270880, 388300, 409554, 425551, 414472, 374767, 465145, 796002, 852546, 992514, 1073896, 1137545, 1234513, 973152, 756167, 870870, 976074, 1044590, 1065648, 1154319, 1360431, 1248794, 1191293, 1190766, 1071716, 968552, 889058, 766201, 989303, 1196220, 1353434, 1520964, 1586473, 1363297, 826981, 328069, 321055, 462263, 753327, 1081956, 1189657, 1269255, 1309566, 1161157, 1122976, 1113449, 966493, 963532, 821898, 669730, 476402, 383223, 126631, -17865, 155214, 218145, 75702, 260312, 428337, 602438, 484503, 535241, 486745]
16210D86745j95466k46760K2896J21083k34999j59074K00131J26746q215J83242
16200B96329n9482p2445k00563J1876J62311q3465O9091k03350j78634Q5783J81731
16189I182P3154q0109J04093r250j58665o5735p2459l3974j04983k3350K06158
16178a55938K36289J36270M4241j11905k4253j17126J82240j7339j35676j51142
16168a14339M7726J06540K2061J23379J19143k2157q5608j27665j70189O2172
16158c8937j00925J47878J12169k71453j55443J0494N4592l5769j10853P4565
16148c13682Q1006j7988p7153M6920J27321J45352J12194Q4345n2315j37446K06507
16137B05061L9460j92518j5757J09710p0076j74362J7044Q3512k9301p9159J17495
$$ y = [486745, 291279, 44519, 67415, 188498, -46501, -205575, -5444, 121302, 113087, 296329, 236847, 164402, -36161, -24285, 138026, 54561, 123652, -79698, -258332, -172549, 9182, 82336, 2227, 106320, 97070, -61595, -127330, -199789, -233763, -338746, -362096, -155938, 80351, 216621, 260862, 148957, 124704, 7578, 189818, 172479, 36803, -114339, -66613, 39927, 61988, 185367, 304510, 282353, 196745, 69080, -101109, -38937, -139862, 8016, 120185, -151268, -306711, -296217, -241625, -277394, -388247, -313682, -232676, -250664, -327817, -280897, -153576, -8224, 103970, 188315, 136000, -1446, 205061, 244521, 52003, 36246, 145956, 75880, -98482, -81438, 2074, -27227, -106386, 11109]
16126A1109K61674p7373Q0428j22616J13738O8243j88841r7594j2110n8478J50728
16115A28908j12183Q926n1182k8485M5023j03369j0943L5907Q8674j94096j97812
16104c90632J28741K91867K0133O4631m039M2527Q6030n5262J18928J50372j33585
16093C19711j7605o9381j27654L1371p660j29231j66744K3229J63845r4629k41364
16082c16112M1570L02306K62323j3786j35843o7442j75649j8921J53243J03941
16072A35630n7377j07868n6624J31741q1365m8752P7677l1903J2349L6638P9651
16061H9797J19930j11579p1567j75488M4232p7098J32000j5138N8834L71239J25660
16050D90822l51983r2909M9469N5177K3843j60029j07204L5258M0376M1982J7586
$$ y = [11109, 272783, 195410, 275838, 153222, 266960, 335203, 146362, 48768, 36658, -21820, 128908, 16725, 25651, -25531, -54016, -8993, -112362, -123305, -87398, 1276, -192820, -390632, -261891, 29976, 50109, 114740, 110701, 153228, 239258, 183996, 302924, 453296, 319711, 302106, 232725, 105071, 136442, 128782, -449, -167193, -143964, 19881, -74748, -316112, -274542, 27764, 290087, 276301, 140458, 73016, -102633, -121554, 31689, 135630, 78253, -29615, -86239, 45502, -35863, -84615, -6938, -38841, -26492, 10146, 89797, 209727, 98148, 26581, -148907, -104675, -181773, -49773, -64911, -6077, 365162, 490822, 138839, 45930, 95399, 150576, 174419, 14390, -92814, -57556, -17180, 24802, 42388]
16039D2388N5958m8778j53445o1485k6586P2776J65774k6197N0416P1661L6972
16028A79454r643j02829n7086J02701q6723m396l3686j97486j5905J38592J80900
16017I3893l9687p0148j63154M6117J50852q1059J4689R9707k36013j61511L07539
16006c8775K62339Q4219K5624m5873O5506K5826k5458l03656q0132K1385q0651
15995h9646J0440Q1036q4299n8284J6992k1359J3661o826N4626J32079J06621
15984A55041j00245j59148K4757L50273O0713j01688J9964J29791j39283k46216
15974f041q4915M8088P2770l977L9137J15645r804J21633P076o9460k6904k2537
15962A80711k4594j89475j90160M8722J99481k875M1981N8133R963k292r1854
$$ y = [42388, 98346, 49568, -103877, -165362, -191948, -119172, 46602, 20405, 70821, 142482, 179454, 169811, 66982, 9896, 112597, 25874, 21478, -12208, -209694, -225599, -87007, 93893, 54206, -15942, -179096, -132979, 17873, -63186, -48497, 51210, -184803, -346314, -38775, 223564, 307783, 333407, 287534, 353040, 378866, 353408, 49752, -30380, -8995, -89646, -79206, 1830, -82469, -140753, -123761, -145120, -131459, -138285, -83659, 48420, 155041, 54796, -104352, -79595, 270678, 331391, 229703, 249667, 379458, 240175, -6041, -90956, -42868, 29902, 25925, 65062, 180707, 170903, 292536, 299612, 230152, 203248, 180711, 156117, -33358, -223518, -174796, 24685, 21810, 63791, 121924, 131887, 129595, 37741]
15951C7741J58783M4401k7810j5645o2230l3911j19906O5223k5365n3124m2378
15940g4221O3062j21727j15010J01544J29192p9314j9954O7101N6828P9812m1051
15929D6262l7471L934n9827J72015J77268q3692r5030p388j28895M7269J4513
15918D8958n615p2763M030m3220j28974J95518k9738r6848K17715l0006N4097
15907A13154J24045l27053p2236k3927J59434M2450J36387n5726k15875M7672
15897g1675P8969K7970j40403R939J5755K6342q0601n1125J9477J22261j34010
15886a77101r9415J3416j55096n7140J4296n8075P5327J40212J52521L9432k72368
15875c83991J1998J52923R3416j54250L1115Q0475q2231q2323n694J51285P2681
$$ y = [37741, 196524, 240925, 213115, 197470, 135240, 101329, -18577, 46646, 21281, -31843, -74221, -11159, -132886, -247896, -146352, -17160, -96474, -116428, -49327, 7501, 87313, 46262, 8791, 12725, -47102, 124913, 302181, 218489, 123459, 116071, -12824, 34445, 48958, 43343, -29420, -25390, -68610, -197584, -2066, -31804, -128652, 89063, 59057, 113154, 237199, -89854, -162090, -186017, -26583, 15867, 152254, 96528, -119347, -71675, 7294, 35264, -105139, -95200, -79445, -53103, -133704, -184829, -165352, -43091, -177101, -276516, -263100, -418196, -475336, -461040, -519115, -443788, -303576, -151055, -111623, -383991, -371993, -219070, -125654, -279904, -248789, -168314, -250545, -332868, -338562, -187277, -114596]
15864a14596j82968j0093q6675J62955J37558J03170l0068k54770L4612J76000
15854f4875J45249K23281j43740m1705k2370l2448p6839n9882J74294R7383k09210
15843a0862j73432l3996p8781N3118O7144K02503n097p996P8219J31381j66874
15832E5327o4450r6495j10094j8820J18393J91173p8300j23139M903K01078J09263
15821A88839j41759k33252j8395J04285J6439R9537j80246o9160K6810J19081
15811h7821J05603J39473N2703j10860p9347j54890o0631Q6987K79069J08357
15801B78643p2248j98800Q617j54956k19230j7160O7477K00723J03197m5756j11725
15790a61218M7019k35575J52873R8009J60371m8167j6508J13987k7900k1564j20219
$$ y = [-114596, -297564, -307657, -394332, -231377, -93819, 9351, -20717, -275487, -240875, -64875, 80374, 303655, 159915, 118210, 95840, 63392, -13447, -73329, 100965, 198348, -10862, -184294, -218290, -297071, -243953, -176809, 25694, 20597, 12601, 90820, 222201, 55327, -9123, -105618, -215712, -234532, -116139, 75034, -3266, -126405, -121502, 79576, 188839, 47080, -186172, -204567, -100282, -83843, 15694, -164552, -233712, -206902, -87821, 17782, 157255, 209958, 99098, 19751, -135139, -195770, -108783, 170286, 278643, 206395, 7595, 16212, -138744, -357974, -375134, -307657, -106934, -3737, -49493, -161218, -114199, -349774, -196901, -98892, 61479, 13312, -3196, 110791, 82891, 61327, -58892]
15779e8892J1133J56459J6714j58842j18688k4550j1149R4712R9559J71308N3263
15768B31027K4031j66531J36487J92989o422K7193N1945p7906l13611n0178J95892
15757B44916j10193j11679l5380j0484O9515K9309o3482R6394p0049k18018r4370
15746b73521J42206J63616J5862r8785J3946Q7381L7184p2679J55175n9887O9918
15735A80416j10919j55805J55495J17327R6902j13217j21697l0563o6111j4560
15725f2732k8345Q2031K16641M2182k58684N0719J2173j62003n135J81019o5881
15714A985J74273J33864r9975M9474J73214r4666j60677Q404J33046k97472p4802
15703e3332J04751J68162j6979M4803L4570o5974L8981L2226j07066j48501R6920
$$ y = [-58892, -47759, 108700, 125414, -33428, -152116, -176666, -187815, -93103, 6456, 177764, 231027, 255058, 88527, 225014, 418003, 411581, 438774, 490719, 412813, 99202, 49024, 244916, 134723, 23044, -12336, -22820, 46695, 76004, 12522, 108916, 38867, -179151, -273521, -131315, 32301, 48163, -50622, -36676, 50705, 87889, 15210, 170385, 110498, 180416, 69497, -86308, 69187, 186514, 283416, 170199, 48502, 17939, -48172, -62732, -91077, -9046, 207595, 249777, -8907, 41812, 53985, -108018, -113153, 67866, 1985, 176258, 310122, 210147, 259621, 432835, 338169, 177492, 185896, 318942, 21470, -53332, 51419, 219581, 202602, 247405, 281975, 216001, 254982, 287208, 180142, 31641, 128561]
15692A28561Q7116O962r9051j73169r9814p7917q8452N9794P4414J83415j1497
15681i638K6822J34328p9924J15681Q1936j65558l39388k6034M0023J04845J69025
15670E2118K7200K8008J29773p9324J1521J4802K21316K6728k00047l77136j31720
15659b76761K10316O7649j26266j15288L4331J45055Q0239L2017J8362J71058
15649B40712j42941j37112P9165N3262k55938j26340K22248O7414J09549O6034
15639A76053l6697M5224O32j04328J99482K76423n4417K14653j18353m90655k98437
15628a90420J16711J4092J84062k43815p386L28709J14844o437N9638L4777j9831
15617C84944j29538r4624m7410J34524j4155k59209K02750N9962k16708r8483
$$ y = [128561, 215677, 222639, 123588, -49581, -149395, -227312, -315764, -255970, -181556, 1859, -9638, 17184, 151512, 71588, 187269, 269205, 103647, -235741, -261775, -221752, -116907, 52118, 79318, 107326, 237099, 157775, 169296, 184098, 405414, 432142, 232095, -145041, -276761, -66445, 1204, -125062, -240350, -206019, -60964, 19275, 51292, 69654, 240712, 97771, -39341, 39824, 93086, -162852, -289192, -66944, 470, 110019, 176053, 139356, 184580, 185212, 80884, 280366, 556789, 502372, 717025, 598672, 108017, -190420, -73709, -59617, 124445, -119370, -126756, 201953, 316797, 310360, 369998, 404775, 384944, 255406, 160782, 113372, 247896, 233741, -25468, 177282, 237244, 20536, -77947]
15607g7947n175q9040k8802K73131N5679J95979n8330r7175o4142r4750P3250
15596H2678n6890J0247L9775P6247k52094N381K38366j52116j31148P9640j3189
15585g3103r3686q1492r9789l0550Q424J18714K38210M7986p3277j2702O0114
15574H849n3667k7494M517j39746o7231k00303q521J98908J61053O9905M9692
15563d038p8236k9586N7855J9055J47592n0469M6361J42097J23214o6369r0767
15552B16709j62482j75298M0258J15928r9203k7542M37403K56796p6104k22085
15542C04380j66524J30717J4244K3251J8588k45719Q7873K3649P4331m2293n101
15531B17396m7663q2393Q3277k05295j57854K4272J79505m5906J56536J20662
$$ y = [-77947, -83122, -172162, -200964, 72167, 127846, 323825, 265495, 168320, 104178, 9428, 82678, 25788, 36035, 75810, 152057, -100037, -94656, 143710, -8406, -139554, -59914, -73103, -166789, -248281, -348070, -378620, -370196, -251482, -13272, 34714, -38563, -51265, 8849, -44818, -72312, -67795, -207541, -274772, -475075, -483596, -284688, -123635, -53730, -4038, -82274, -111860, -54005, -34950, 112642, 62173, 108534, 250631, 373845, 307476, 216709, 54227, -121071, -80813, 35115, -64088, -91630, 345773, 602569, 526465, 304380, 137856, 268573, 282817, 306068, 324656, 78937, 166810, 190459, 264790, 222497, 217396, 169733, 87340, 170617, -34678, -192532, -168260, 11245, -34661, 121875, 242537]
15521B42537l00027j03100j13282o9375K72923J58176o394j8278P3454r2784k509
15510D1341l3713j32813j02036K8043K5773M9777J4260j9711k16303Q3775L68648
15499A07041m6097j45403O9818J10197p895j82626j01894O1697J17632n9348k2130
15488i9008q4946o2856j49768K0887J54135J22752K67121J33884j11480o7235
15478A23486M9174J61387O8191j36650m09559k05296j6819O3228m5442Q4087J84920
15467g9293J75530L5049j8802l6339p0199o944j39125q119J22782K32915p6872
15456A30583q2093j09774K8139K40469P0227j49209K5836J8362l32027j66977
15446c26464l1108L29118k3026p8435R6120N7741k287j12181j81459N7715J72590
$$ y = [242537, -57490, -160590, -273872, -343247, -70324, 87852, 81458, 63180, 136634, 43850, 41341, 7628, -125185, -227221, -199178, -173405, -123628, -109368, -129079, -345382, -261607, 107041, 60944, -84459, -14641, 95556, 87661, -94965, -196859, -135162, -17530, -76878, -99008, -183954, -246810, -396578, -375691, -221556, -98804, 168317, 302201, 190721, 123486, 172660, 334047, 402238, 265588, -143971, -349267, -366086, -302858, -348300, -264213, -79293, 96237, 131286, 112484, 76145, 5946, -998, -140123, -148242, -25460, 207455, 130583, 48490, -61284, -33145, 207324, 277551, 128342, 154178, 172540, -159487, -326464, -357572, -28454, -51480, -129915, -33795, 23946, 21659, -90522, -271981, -214266, -41676]
15435d1676q7390k9881J32802l8750P7737l5085n6160R7652l3778n821L0153j81215
15423a71412J0486J73849J66722j17383k36016R6068K22987m2640p3317M4477
15413G3821r0495P7517K58149k15860k66856j71517o0417o9742Q8915K86293J12791
15402B2599K109n7427J22831R6131r1730J54059J9897j2033K3678K3728K1597
15391C25439l0676k63397J66141o0833k56112j7936n1166J66289l4775j89957
15381b46983l238J01001j39812J4533J75014j5331n9306k18832J07085j68447
15371d54316q9909J54468J84134P3394k9314p5727J58513K0989J31653j85182
15361a11297j40674o0623k1186K86848L21711J97690k1221j61426j00043r8570
$$ y = [-41676, -129066, -158947, -26145, -64895, 12842, -22243, -78403, 19249, -14529, -20350, 9803, -171412, -160926, 12923, 179645, 62262, -173754, -77686, 145301, 102661, 29344, 73821, -16674, 60843, 318992, 103132, -163724, -335241, -395658, -465400, -376485, -90192, 22599, 24708, -32719, 90112, 186243, 94513, 248572, 268469, 256436, 280114, 303842, 325439, 294763, 31366, 197507, 136674, -119438, -137374, -188540, -22251, -57026, -246983, -250221, -149220, -289032, -274499, -99485, -114816, -174122, -392954, -285869, -454316, -544225, -389757, -205623, -132229, -161543, -237270, -78757, -57768, 73885, -111297, -251971, -312594, -333780, -46932, 274779, 472469, 451248, 289822, 189779, 91209]
15351I1209q6267J2159L2509p7385k14361K18079o2973k12452k9728P8240J83849
15340f7121J01219l1806r1276L68549R6246j4380k8242j48301L1273j82991j99959
15329a66789J54937K05213n3144j5906J69021Q9665n9705j27590K1179r1371K13978
15318C39488J87938m25395l34349J52364K315J8888K94319L1684o9845n138q667
15307A83602Q5893n7702j25301j43578o5895J26664n2081J00446p7053p5260J15867
15296A5602q7292K5551J87780r699l9298n1535j0161m0459k52983j89444J47652
15285c04286K240r8117L15160K84735J49401j45990j48871j47367O2393k42782
15275b73484J11061J93709l1325M492o5954M4894M0868j14514j89729o7351j7145
$$ y = [91209, 4942, 17101, 49610, -27775, -242136, -24057, -87030, -299482, -329210, -250970, -67121, 34098, 2292, -88984, 279565, 375811, 361431, 333189, 184888, 216161, 33170, -166789, -11852, 193361, 140217, 124311, 293332, 382997, 323292, 195702, 216881, 125510, 339488, 527426, 102031, -232318, -79954, -77639, -58751, 235568, 267252, 197407, 192269, 183602, 269495, 211793, 86492, -57086, -122981, 3683, -48398, 52048, -25005, -100265, 15602, -71690, -46139, 141641, 131942, 92644, 41109, 30948, -9511, -262494, -451938, -304286, -302046, -400163, -85003, 199732, 349133, 203143, 54272, -93095, -30702, -273484, -162423, 31286, -39, 4453, -61501, -16607, 24261, -90253, -279982, -347333, -364478]
15264c64478R4753Q4541K00261O7645k0054O3755q5344R0323j860p098j31901
15253i457j38345q8997k7761M353N7059Q7175n1047k2489j5032K45498K25653
15242B66610J93214j74932R014j71842k15829J09959Q6471J29139J81752r3629
15232C19927p8964K8533q8342r9879j9390J38262J50027r4529k40801j6887O8732
15221F6689N8927o9364R1264J29804j06930j51795j00805K12115K6579R7873J0038
15210B64395R176P8781M6282l6323j61224O512j01475r6046L748j14241k8528
15199a28943K1923K16414j68895o4698J53850O2527j33235k9610J92217M4354
15189A65904o7915j112j0588r1927j40019k9309O0264q2233O4874J67588j51012
$$ y = [-364478, -269725, -185184, 15077, 82722, 62668, 126423, 41079, 131402, 129542, 122444, -9457, -147802, -236799, -264560, -260207, -203148, -115973, -167020, -189509, -204541, 40957, 266610, 459824, 284892, 293906, 122064, -93765, 16194, 102665, 231804, 413556, 319927, 240963, 269496, 181154, 81275, 61885, 200147, 350174, 255645, 14844, -2043, 66689, 125616, 56252, 147516, 277320, 170390, 18595, -82210, 129905, 156484, 254357, 264395, 273571, 352352, 398634, 362311, 201087, 207599, 106124, 10078, 13826, -100415, -128943, -107020, 109394, -59501, -124199, 29651, 92178, -41057, -70667, 121550, 165904, 97989, 96877, 86289, -5638, -145657, -174966, -114702, -196935, -132061, 35527, -115485]
15178a15485k48559K3037j13107J15310K32372J87515p1254j38148M0813k7123
15168a14629j04452q8729J64158P3376m0029J74352K63331K5739j95013j98636
15158d0532p5862q5412J65274R1949o5603J0742j10060l13378q8068K40011J58543
15147a12396l90K1755J20983j63204m2876o3136J39114n8596N0325J1413j18357
15136b15365J62508M3207j66268k61126k8260L06820K10710Q2834j41946j15795
15126a22681K36280J10125j50868k89109P7364O0426j3524k68247k21036K00667
15116c80603K01300J01118J24736j42557l2806J80072o227k20387P1218M3992
15106f0144k48705J80705K99776M6157M3477m8251p8803j00569p2184k8129M6637
$$ y = [-115485, -364044, -341007, -454114, -338804, -106432, 81083, 9829, -128319, -87506, -114629, -219081, -307810, -143652, -70276, -110305, 64047, 327378, 353117, 158104, -40532, -116394, -201806, -36532, 55417, -10186, 556, -109504, -422882, -510950, -270939, -112396, -112786, -91031, 29952, -133252, -176128, -239264, -100150, -158746, -108421, -97008, -215365, -52857, -9650, -175918, -437044, -465304, -158484, 52226, 135060, -6886, -122681, 113599, 223724, 72856, -216253, -138889, -78463, -91987, -360234, -581270, -380603, -179303, -78185, 46551, -96006, -128812, 51260, 45033, -175354, -104136, -60144, -308849, -128144, 171632, 217789, 261266, 213015, 134212, 33643, -38541, -66670, -20033]
15095b0033j11683q0150L3043L47303k155j49107q3970p6630j21573N6845j1038
15084b19148j80959k6310N7508Q295J86701K14524J02656J06573J9106j25792
15074A43154q2297j01848N0014j39542K15929j41090n3160j43437J26546K08701
15064H2970o408n9048j04458M2486J5077J1780j28144Q4410J1457j01283j24408
15053b75569p0479n3006q4511J14141J05930j27806J13620K11547J24334m5931
15043A2270J44149L4524j06711O259j38894n9588R0680m0063q4932J2113p8413
15032b08606L100K19302P931K8204K5001K9273q0777j26063k24J25563K02162
15021B24866K9615j65034O1755K8341n675N1122R0301O8464J34820O0230J87252
$$ y = [-20033, -131716, -211866, -178823, 168480, 166325, 17218, -66752, -143382, -264955, -208110, -219148, -400107, -426417, -368909, -360614, -173913, 40611, 143267, 249840, 268946, 143154, 60857, -40991, 9023, -130519, 85410, -55680, -108840, -252277, -125731, 82970, 76562, 17514, -86944, -44458, -29381, -17601, -145745, -61335, -49878, -151161, -275569, -346048, -399054, -483565, -369424, -263494, -391300, -277680, -66133, 58201, 12270, 156419, 190943, 84232, 90491, -48403, -107991, -17311, -57374, -142306, -130193, -208606, -205506, 13796, 21727, 49931, 74932, 104205, 23428, -102635, -102859, 22704, 224866, 254481, 89447, 151202, 179543, 173868, 224990, 315291, 383755, 518575, 578805, 766057]
15010G66057Q7674l8009J38496K56495J61477m9662n2901j04274k86299l14712
15000E64342j06271n2555k5149l21569k14543J02519K41516K21757m3270k96171
14990G0606j02438l9688k8385j12187n9335R0185K78551N6832j96300r7058J06341
14979c2876l3412N4245R8882N4174k2210r2460L2272j59809p2371L1665N1602
14968i0298O7751P6749j81730p863M5947O776M8415M4467o7478M6632P2678M9832
14956A11878l9871p2166j81941q1253P4522j7209J01362j34484r8381Q8476K03726
14945d5341K145O3408o9676j19419J67800j32311l79627J18915M94187K93685
14935C93766J2948j65084k2483o0219m0829m7818k14890j5429J56919r3720O672
$$ y = [766057, 853731, 815722, 954218, 1210713, 1372190, 1322528, 1269627, 1165353, 879054, 564342, 458071, 405516, 380367, 58798, -155745, -53226, 188290, 410047, 366777, 70606, -31832, -71520, -99905, -212092, -271427, -181242, 97309, 154141, -42159, -139217, -32876, -66288, -12043, 86839, 141013, 118803, 26343, 58615, -101194, -173565, -141900, -90298, -22547, 54202, -127528, -135391, -89444, -82668, -34253, 10214, -57264, -10632, 62046, 111878, 72007, -159, -182100, -263353, -188831, -206040, -104678, -239162, -337543, -249067, -45341, -43196, 20212, -49464, -168883, -1083, -133394, -513021, -394106, 100081, 393766, 406714, 241630, 219147, 158928, 118099, 70281, -144609, -160038, -3119, -96839, -90167]
14924i0167j04435k39808L8998J68097J53298Q3304M5304n9026k17711j39881
14914c62027L03902p759O560P1318m3043k7613J70033K24941j86489r8635j6622
14903C4566J75701m7713j30093j02402J32458K13873j02538j09816k3989J32897
14893A72944J70018L2111j09022o1109J66663J90755J64996j0146k12060n9516
14883D45634M883M1359j71975k31846r341n0702J22439L69033k67091k72885L3537
14872A3045P55m4768J5440p5841O1211R8038o2780m9189J74270L36459Q4574j64793
14860C86421j60540l57401p5965K04183J38842j02400j12655P4922J305Q2831
14850G9543K9245j13670j5361l3271m9203M9215q0521N547k2473K28549l3475
$$ y = [-90167, -194602, -434410, -395412, -227315, -74017, 9287, 54591, -4435, -222146, -362027, -58125, -65884, -59324, 11994, -31049, -58662, 111371, 336312, 149823, 51188, 34566, 210267, 162554, 32461, -69941, 62517, 276390, 173852, 64036, 40047, 172944, 342962, 375073, 266051, 204942, 371605, 562360, 727356, 717210, 505150, 445634, 450517, 491876, 319901, 88055, 78714, 28012, 150451, 519484, 252393, -20492, 13045, 13800, -30968, -15528, -91369, -30158, 67880, 5100, -44089, 130181, 466640, 551214, 386421, 225881, -131520, -207485, -3302, 135540, 33140, -79515, -4593, -3288, 79543, 108788, -4882, -20243, -53514, -102717, -53502, -134023, -128476, -150949, 77600, 44125]
14839D4125j17699M6431K96656O2884k01563j60598l4024P3774k9102M0554j17537
14828i6099N1493K09264J19912n27l2722K3163J35995j09381m13973j7225J11259
14817a8841n4175J09529Q4347J47522j38621k04770q5785J60005J87421J28078
14807C14710j70143k17173L4152Q6430J72738j53106J05406k1385M8492q9709
14797A10412q0716j5290M8913K07296q7573M9479M3321k82441j25084L7044N4835
14786c9804n9071R7191J26348R2963M7818J10699j12774o1776m8191j4019k41572
14775a02188k66203R768J30099Q0410p6148N7724J74332L7163p3458Q3239K22709
14764B77447q5512o3070j28709j14816O8888K3588J58587O8094j67331N7641J12430
$$ y = [44125, -73574, -27143, 269513, 332397, 130834, -29764, -63788, 9986, -19116, 21438, -96099, -44606, 164658, 284570, 284043, 251321, 274484, 410479, 301098, -112875, -130100, -18841, -73016, 36513, 120860, 268382, 129761, -75009, -160794, -789, 186632, 314710, 144567, -72606, -38454, 47976, 220714, 67608, 173014, 151629, 200121, 110412, 29696, 14406, 63319, 270615, 183042, 232521, 275842, -6599, -131683, -94639, -39804, -98875, -1684, 124664, 217627, 265445, 376144, 263370, 201594, 153403, 139384, -102188, -368391, -358623, -228524, -148114, -224262, -166538, 7794, 44957, -28501, 54738, 277447, 191935, 128865, 156, -114660, -45772, -22184, 136403, 204497, 37166, 94807, 207237]
14753B07237j41482J3744J3413M7210q0318j46207r3328J59446J20216k25715
14743a25784o3358K20337j78841j11514K12318J53638o728j06883M3267P1495
14733A07947o0747j05802O2956m8203k0565p4625J64725J23283k056Q6946k322
14722B31537j08152q2905J82607J74581j8862P1759r3836J50422L58844q5694
14712G80301R9189J27884j45078M3913N3403j75203J18308m3462P5826K75125
14702A210206N2860J912j0009J0689J65771J23281J67146O750r555J58476Q7229
14691A964756O0072k9707J49882r1340k59662J64024O8919K0944k3102j56061
14681A868725j76810O0137K119j80225j37619q2422j7521j67568o7564L6297j62274
$$ y = [207237, 65755, 79499, 92912, 140122, 59804, -86403, -179731, -20285, 99931, -125784, -189142, 31195, -147646, -259160, -46842, 106796, 100068, -6815, 36452, 107947, 47200, -58602, 4354, -43849, -64414, -139039, 25686, 148969, 146913, 233859, 231537, 123385, 40480, 223087, 397668, 378806, 450565, 356729, 507151, 865995, 780301, 879490, 1007374, 862296, 906209, 959612, 784409, 902717, 859255, 935081, 1210206, 1263066, 1264978, 1254969, 1265658, 1431429, 1554710, 1721856, 1728606, 1719051, 1877527, 1964756, 2024828, 1995121, 2145003, 2053663, 1794001, 1958025, 2026944, 2047888, 2024786, 1868725, 1691915, 1752052, 1754171, 1573946, 1436327, 1353905, 1336384, 1168816, 1101252, 1137549, 975275]
14670I75275K3254l001k50265j43139P771L1561O4890j4245j46637O1906J06834
14659G14204k25811J41538j58170k35162Q0420K2981K85p7869l6354K24907p0905
14648C80064j07995o6575O9758J28772N31j00328M605K47814R85j88176k32973
14637A36482K2238j12617j40197j46642K45737M3092K6600J4436K5914J05261
14627B20304j86587J7261L9056O547K45926J55613j17416j52984k36279P8267
14617F9708M8135j19898J37807P0420k4818L4647j08512J53124J6461j15597j34790
14606B6687j12226R9619J18134k647q3246n2260o6235K53538K17784p4333l2433
14595B92382j1652k67707K2367J68402q2604j90760n9881l6984l3632L7235J23156
$$ y = [975275, 998529, 995528, 745263, 602124, 609895, 641456, 706346, 692101, 545464, 607370, 714204, 488393, 629931, 471761, 236599, 317019, 340000, 340285, 262416, 226062, 450969, 380064, 272069, 205494, 275252, 404024, 404555, 304227, 308832, 556646, 557631, 369455, 136482, 158720, 46103, -94094, -240736, 5001, 48093, 74693, 89129, 115043, 220304, 33717, 50978, 90034, 96581, 342507, 498120, 380704, 227720, -8559, 69708, 117843, -2055, 135752, 206172, 181354, 216001, 107489, 260613, 277074, 161477, 26687, -85539, 14080, 132214, 129567, 46321, -5939, -72174, 181364, 399148, 324815, 292382, 280730, 13023, 35390, 203792, 121188, -69572, -129453, -166437, -200069, -162834, -39678]
14584c9678k6880M8219J52312J82389j53035m0202J31556j34330l02449N7455
14574a24643K24741m8906p5281m3356P5307K00909L2415l5648R900j24703J35433
14563B26168l5757L2884j22812l39465J7260J02089o4463K3104K73671K47606
14553C60285Q3207l9536j47040m2973q104J64883j14713j2454Q7670O8405l1001
14542C68629J01586K00404K2704p7097j71910n1715l07388j16005R3704J9581
14532H2493j88631p7701N7312o2120J77468j43743J30815M1124l7675n9169j8719
14521i8546J0461J14815j80639o6537J27811J48864J6128j4572J4168j31578j70726
14510b30351j11115J69994Q5050r532J70163K1699k66719l8901j25317J7924K54040
$$ y = [-39678, -66558, -18339, 133973, 316362, 163327, 123125, 254681, 120351, -182098, -124643, 100098, 51192, -24089, -67445, 7862, 208771, 241186, 205538, 215438, 90735, 226168, 190411, 223295, 100483, -238982, -221722, -119633, -184096, -160992, 112679, 360285, 443492, 403956, 256916, 213943, 205839, 370722, 256009, 243555, 331225, 399630, 368629, 470215, 670619, 693323, 616226, 444316, 392601, 85213, -30792, 62912, 82493, -106138, -183839, -126527, -188647, -11179, -154922, -24107, 17017, -20658, -79827, -98546, -88085, 26730, -153909, -220446, -92635, 56229, 72357, 57785, 71953, -59625, -230351, -341466, -171472, -86422, -95954, 74209, 95908, -170811, -209712, -335029, -317105, -63065]
14499f3065J89673q3082p4508k6627P643l2504J08458J78502k9594Q1684J30633
14488C87213J34765L8124Q8081j15340j84233j00941P2859J14396j36970j78149
14478A19805m1884j21421J44052R6934J6605J51517J21252n7453p1878o7921l01285
14467a1677o3777J89731P5215m7301l4091N776K5959O9585N8205j16628p2873
14456G8124R522k00033j32648K455J92199J53240k496P2582L1055p2207j78432
14445d6639o6444q5385J48088M7949N0205J83165j96980j5790j12989J01835J65066
14434A72081m777n4139j33495J24407J11937J24693j95462O6519m6618J60827
14424C25973J34267j02558l97966r8291J5885K0751k8368J31594J67693K9356
$$ y = [-63065, 126608, 43526, -30982, -57609, -49966, -82470, 25988, 204490, 174896, 256580, 387213, 521978, 560102, 648183, 532843, 348610, 247669, 320528, 434924, 297954, 119805, 77921, -43500, 100552, 197486, 214091, 365608, 486860, 429407, 357529, 289608, -11677, -75454, 114277, 189492, 142191, 108100, 113876, 139835, 209420, 267625, 150997, 78124, 87646, -112387, -245035, -242580, -50381, 102859, 100363, 172945, 204000, 131793, -46639, -113083, -198468, -50380, -2431, 47774, 230939, 33959, 18169, -94820, 7015, 172081, 167304, 113165, -20330, 104077, 216014, 340707, 145245, 211764, 165146, 325973, 460240, 357682, -40284, -138575, -122690, -101939, -130307, 1287, 168980, 198336]
14414A98336O8833p0813k16171l3491O1378L966J07544p7795j47600j7295J71778
14403D8670K29902j4837j68692q9411o8986K16736N5671k54524R3379L62904J96828
14392F07640j33871k20177j45876l6604M2817o3047j21212J8115p3205j53213
14382b78633J07516K0928J54477J14719Q4914M1860J1617j00066k01042r981N4622
14371I31J99308K06343J10563J59285J12013L7204q3609j76003l06084K7494m1284
14360B46161K34410K53349J19622K09370J10136J87224J96253K36387O3804k87099
14350A569617j10764L2352N6677J94334Q5970R543r1488N0068L74874O2608n9247
14339B174544j58170n8891J23794K85131Q8279J2686l9603l64116j12876j13041
$$ y = [198336, 267169, 196356, -19815, -53306, 8072, 12038, 119582, 41787, -105813, -123108, 48670, 278572, 263735, 95043, 5632, -63354, 153382, 209053, -45471, 47908, 410812, 607640, 473769, 253592, 107716, 71112, 113929, 50882, -70330, -52215, -125420, -278633, -171117, -150189, 4288, 119007, 203921, 245781, 257398, 157332, -43710, -53691, 931, 200239, 406582, 517145, 676430, 788443, 825647, 742038, 566035, 259951, 287445, 246161, 480571, 733920, 853542, 1062912, 1173048, 1360272, 1556525, 1792912, 1856716, 1569617, 1458853, 1491205, 1547882, 1742216, 1828186, 1837729, 1746241, 1796309, 2171183, 2233791, 2174544, 2016374, 1957483, 2081277, 2366408, 2454687, 2467373, 2427770, 2063654, 1950778, 1837737]
14329A837737J05535L65937J13693j3659q9433J1072J99413K21851k55294Q2753
14319B579605L04852J53740Q4141M0202j39659Q9697K14727J35958J06747J1452
14309C581462N9081j42470J77136J10868o1553J17422Q9947J09484J59647K67376
14299D468400J69888K04738J21678K71259L05839L46345L10594K57943K62221
14290F718905L61577M63515M54577K39514L72265M62860O32955P21159O49570
14281A1076897L95350M48574O87085Q82221J029265J110423J122822J087513J268973
14272A9109123J510321J849673J870810J753690J728420K053127K349542K634796
14264C4859502L051483L470546L292711L899079M467220M789248N325427N848310
$$ y = [1837737, 1943272, 2309209, 2422902, 2409243, 2319810, 2330882, 2530295, 2752146, 2496852, 2579605, 2884457, 3038197, 3122338, 3162540, 3022881, 3112578, 3327305, 3463263, 3570010, 3581462, 3640543, 3498073, 3675209, 3786077, 3724524, 3841946, 3931893, 4041377, 4201024, 4468400, 4638288, 4843026, 4964704, 5235963, 5541802, 5888147, 6198741, 6456684, 6718905, 7080482, 7543997, 7998574, 8238088, 8610353, 9073213, 9706168, 10427327, 11076897, 11472247, 11920821, 12607906, 13490127, 14519392, 15629815, 16752637, 17840150, 19109123, 20619444, 22469117, 24339927, 26093617, 27822037, 29875164, 32224706, 34859502, 37910985, 41381531, 44674242, 48573321, 53040541, 57829789, 63155216, 69003526]
14256F9003526O509189P302388P903550Q672308R792388J0836557J1580874J2711447
14248A44312227J3616500J4797625J6151528J7249575J8047414J9019228J9655221
14241B62849318K0136979K0294423K0149366J9244782J7475865J5719350J3571183
14234C89441266J0735585P534207M388546P12765k866865n820978q829484j1518978
14226C83776064j3585573j5470846j6405338j7102502j7761727j7530263j7139137
14219B68780678j6559510j5767683j4779863j3857771j3323555j2542742j1573276
14212A70376278j0623664r884957r075664q550384p785494p086924o576471o175798
14204A04616922n724237n429008n078496m809772m249229m099043l608898l310915
$$ y = [69003526, 75512715, 82815103, 90718653, 99390961, 109183349, 120019906, 131600780, 144312227, 157928727, 172726352, 188877880, 206127455, 224174869, 243194097, 262849318, 282986297, 303280720, 323430086, 342674868, 360150733, 375870083, 389441266, 400176851, 407711058, 412099604, 412812369, 409945504, 404124526, 395295042, 383776064, 370190491, 354719645, 338314307, 321211805, 303450078, 285919815, 268780678, 252221168, 236453485, 221673622, 207815851, 194492296, 181949554, 170376278, 159752614, 149867657, 140791993, 132241609, 124456115, 117369191, 110792720, 104616922, 98892685, 93463677, 88385181, 83575409, 79326180, 75227137, 71618239, 68307324]
14196F8307324l296970l081553k617633k610176k556723k345588j987590k002458
14188D7808633k165945k047198k022331j838148j647766j651405j449654j320581
14180C3665605j254109j154465j003943j032405r58090q51070j023427r27181
14172B5460915q12106r20390q28208p36571j011785r28091n79195m87625p76473
14163A8380471o75165o92012m28606k97794l58226n92215l58349l03745l58974
14154A4315385n47988o47259l83724m08687n25124k71697k70736l79799k72721
14145A0607650l65462k80970m64929j91234m20339o48181m5413k8228n17768k38692
14135G406434n085J21197l32026m11274j41230l70852k30469N0316l81314p4840
$$ y = [68307324, 65010354, 61928801, 59311168, 56700992, 54144269, 51798681, 49811091, 47808633, 45642688, 43595490, 41573159, 39735011, 38087245, 36435840, 34986186, 33665605, 32411496, 31257031, 30253088, 29220683, 28262593, 27411523, 26388096, 25460915, 24648809, 23728419, 22900211, 22163640, 21151855, 20223764, 19644569, 19156944, 18380471, 17705306, 17013294, 16584688, 16286894, 15928668, 15336453, 14978104, 14674359, 14315385, 13767397, 13120138, 12736414, 12327727, 11802603, 11530906, 11260170, 10880371, 10607650, 10242188, 9961218, 9496289, 9305055, 8884716, 8236535, 8191122, 8162894, 7645126, 7406434, 7401349, 7522546, 7190520, 6779246, 6638016, 6267164, 6036695, 6087011, 5705697, 5630857]
14125E630857k4230j63793j18905j24242k06670j51891k2897o4620j3857j16594
14115D623158N7211k33053k73734j91776J8734k82498m3492M9907L1673n9835
14105C696295l34067k72155k66984J14838K90197o7805m25546o891J8856j17791
14095B628947j436J57914M7117O8954r3054n8652m0449j49006j08923p6053J99236
14084B574595k79137j82675K4656j70213r1870J29622q9420k8799o3557O1411
14074A884613p54J3288j69322L2510J11992O6001J21022K5560j25359p6152J4335
14063A897734j36720o741p9893K5237O6599j51053k08882j09977k15723j76662
14053I03919J56916P504J16457K1853M2326q0674j5891L4285o4741j0298J54459
$$ y = [5630857, 5606627, 5442834, 5323929, 5199687, 4993017, 4841126, 4818229, 4753609, 4739752, 4623158, 4680369, 4447316, 4173582, 3981806, 4000540, 3718042, 3674550, 3724457, 3756130, 3696295, 3362228, 3090073, 2823089, 2937927, 3228124, 3160319, 2734773, 2727882, 2746738, 2628947, 2627511, 2785425, 2832542, 2901496, 2808442, 2749790, 2709341, 2560335, 2451412, 2375359, 2574595, 2295458, 2112783, 2137439, 1967226, 1875356, 2004978, 1915558, 1886759, 1823202, 1884613, 1883859, 1897147, 1727825, 1760335, 1872327, 1938328, 2059350, 2084910, 1959551, 1883399, 1897734, 1761014, 1754273, 1674380, 1699617, 1766216, 1615163, 1406281, 1296304, 1080581, 903919, 1060835, 1068339, 1184796, 1206649, 1248975, 1168301, 1152410, 1186695, 1121954, 1111656, 1266115]
14042A266115K01109J28355j20507l12590r6906j21107q7834K21732K79872p453
14032A350786k04822q7229m6217J34091o5794J36911p6043n4021L584O7741Q1705
14021A240692j42539j72956K3725J26011p8001N1541K56270N6422j22045l31653
14011I07467p2101J40711J85278k7337P640n5335j27232k15659K23177N2790j98463
14000H20936j39026r896j19526J76584M7661n4426j64359q2917k8636J31402J54940
13989G32737J67912J69352M348k48229k5680N8718p4977J6293r1659p8055l2709
13978E98051R7525K63117p4689j99839j47793p177L2645N9741k0651j8344n9143
13967E23443r1834p9485J65828J31677J75012O7832j81876j06008j8498k68613
$$ y = [1266115, 1467224, 1595579, 1475072, 1162482, 1065576, 944469, 856635, 1078367, 1358239, 1350786, 1145964, 1058735, 1012518, 1146609, 1080815, 1217726, 1141683, 1087662, 1091246, 1158987, 1240692, 1098153, 925197, 948922, 1074933, 996932, 1048473, 1304743, 1361165, 1239120, 907467, 835366, 976077, 1161355, 1134018, 1141658, 1086323, 959091, 743432, 966609, 1019399, 820936, 681910, 672014, 552488, 729072, 776733, 722307, 557948, 475031, 446395, 577797, 732737, 900649, 1070001, 1074349, 826120, 800440, 859158, 784181, 800474, 708815, 630760, 598051, 695576, 958693, 884004, 684165, 536372, 529195, 561840, 621581, 600930, 582586, 523443, 431609, 352124, 517952, 649629, 824641, 892473, 710597, 604589, 586091, 317478]
13957C17478j5389J31157l4190k5932J93444n6216k0391L8337o4134J30269L0109
13946F24542r0162j90364j67308R4212J50912M2583r8401n4542N3826P0520R7764
13935E33582O3930J19273o4001k60917l72928J7356L05185J35437K03695p9899
13925F00713j71042P7179J89738k41786k41711J01795L6497j4040J49177j07191
13915C79329k0591K2171j49505k29148L19701j12824j73300J8891Q3749J23413
13905B61886L0844n7964R3389J25223l5860o9807j56051K6312k3006J3701J9473
13894B28140q6733j60684k1816j27315L6666o4646r1442J47100J29671r8450J48431
13883C8922L6686o2373J42492j87411N5978J50591P0971j4714K4185J46296J23234
$$ y = [317478, 302089, 433246, 399056, 373124, 566568, 510352, 489961, 528298, 464164, 594433, 624542, 534380, 344016, 176708, 270920, 421832, 464415, 366014, 311472, 365298, 435818, 533582, 597512, 716785, 652784, 391867, 18939, 36295, 341480, 476917, 680612, 600713, 429671, 506850, 696588, 454802, 213091, 314886, 351383, 337343, 486520, 379329, 358738, 380909, 231404, 2256, 321957, 209133, 35833, 54724, 138473, 261886, 292730, 234766, 328155, 453378, 417518, 347711, 191660, 217972, 194966, 208667, 228140, 141407, -19277, -41093, -168408, -131742, -196388, -287830, -140730, -11059, -109509, 38922, 75608, 13235, 155727, -31684, 24294, 174885, 245856, 231142, 255327, 401623, 524857]
13872E24857M2363j58666K0788l4490J01079R602k21604J05362P1290j51550j56700
13861A52331J50679J38825j5332n9238O6343j54771k0192R3448n3702R2659j42436
13850B48614l3835n6966J62869J0998j60794j30881j14300J90863J99057j15536
13840B00089j05450J06518J40659Q9336l39962j08386N4540q3796j21633J01264
13830f6821J40562j42915q1592J56174q3570j9479N1818Q498J45704K26533m7409
13819B87503R5617j31445p9171K88291j40703l17186p5577N2339N2601j07730
13809g5461p5732K73560K64327R8634n1366k4821j41951k51791J71544R9125j9759
13798B66309q0097o2529J02623J84919l9459l6473R2689o0908J79596J21097J38145
$$ y = [524857, 567220, 408554, 429342, 394852, 495931, 505533, 283929, 389291, 460581, 309031, 152331, 303010, 441835, 426503, 367265, 433608, 278837, 258645, 352093, 298391, 391050, 248614, 214779, 157813, 320682, 331680, 170886, 40005, -74295, 116568, 315625, 200089, 94639, 201157, 341816, 431152, 91190, -17196, 37344, -46452, -168085, -66821, 73741, -69174, -150766, 5408, -78162, -97641, -45823, -37325, 108379, 334912, 287503, 383120, 251675, 172504, 460795, 320092, 2906, -72671, -20332, 32269, -75461, -151193, 122367, 386694, 485328, 433962, 409141, 267190, 15399, 186943, 286068, 266309, 186212, 123683, 226306, 411225, 371766, 335293, 427982, 367074, 546670, 667767, 805912]
13787H05912J31831L24737j66493j9364M5362R0639P6286P156m4795R1259q3323
13776A259207K32225N17786M0220N5410Q680m4192M1190L10454J72258l4049r7051
13765B462138j4917r7208L9386l2675j30414k73685k98964j69443M8580J45409
13755A678207q1476j49871O6179m5953j72593r3086j4340k43151k24456p5974
13745F43486J89450n0069j65949o2081L797K0168m0651q6402p4198j33130m2712
13734B01709J34590L1828L6630N3549J37272O0186j77857R4976J23282J29053
13724H25218j3257l12839k50790Q4134j93182O3065K87492O5684j56282K09076
13714F08319O9670k78738p11j04658J68140J10740q5890o5490N108l8891L7008
$$ y = [805912, 937743, 1262480, 1095987, 1076623, 1121985, 1212624, 1288910, 1296066, 1251271, 1342530, 1259207, 1491432, 2009218, 2049438, 2104848, 2113528, 2069336, 2110526, 2420980, 2593238, 2559189, 2462138, 2447221, 2350013, 2389399, 2356724, 2226310, 1952625, 1653661, 1484218, 1532798, 1678207, 1596731, 1446860, 1513039, 1467086, 1294493, 1201407, 1187067, 943916, 719460, 643486, 832936, 782867, 616918, 554837, 558634, 578802, 538151, 451749, 377551, 244421, 201709, 336299, 368127, 404757, 458306, 595578, 655764, 477907, 572883, 696165, 825218, 811961, 499122, 248332, 332466, 139284, 202349, 489841, 555525, 399243, 608319, 677989, 399251, 398540, 293882, 462022, 572762, 486872, 421382, 426490, 387599, 424607]
13703D24607K49764N1208k2023j73018l66889l4527J64262r7018q621n2475J90332
13692C25602J15495L5102j02919p5396K2363n4413l1134m0180l4381M5188m6363
13681A58964m0388J07272O6183j70740k34205J6120N972k07306J5188M6743j80392
13670d16589j10424K39177J38442j10234k7491P0607J77648J54812O5667K4985
13660B06600k3919m7314k34464p5540J87359O8888J1177l3726L7329n4191j90321
13649a48122n6510m351L7765j16770r8893J16565J23884M0719J74965J77561m6582
13638B00231l6501m0853p5151j53026J68802J32635r7640P3947j82930r9460J45211
13627C5265J68102L2227j40253m0367j20201J19122K02374j02204m980j7654J9746
$$ y = [424607, 674371, 725579, 703556, 530538, 163649, 129122, 293384, 196366, 187745, 135270, 325602, 441097, 476199, 373280, 297884, 320247, 265834, 234700, 194520, 160139, 205327, 158964, 118576, 225848, 292031, 121291, -112914, -96794, -90822, -298128, -282940, -236197, -416589, -527013, -287836, -149394, -259628, -287119, -216512, -38864, 115948, 181615, 206600, 182681, 135367, -99097, -174637, 12722, 81610, 92787, 59061, 96390, 42199, -148122, -204632, -208983, -171218, -287988, -386881, -270316, -146432, -105713, 69252, 246813, 200231, 163730, 122877, 47726, -105300, 63502, 196137, 98497, 172444, -10486, -109946, 35265, 203367, 235594, 95341, 54974, -65227, 53895, 256269, 154065, 149085, 131431, 151177]
13616A51177j59764j81144J06109l1437R2293K21203J11145q6253m9921j39906
13606C3502M3036m9392K5731m6935l51J3688J09181P7852J6022K18229Q4962k80797
13594B44728j75983m6949m9017j74850j65050k1154p61J77603l1105n3229k7708
13583c23475R5736K6578j49363J06114M48291K29699j18967l2911r4230K4688
13573B12160N6601j43148j68595r8022R6136J43743M4122N8482O72J81979m4991
13562C39139j99813k37670k54920r7191J575J3183K90128J78730J95697M0737
13552B69595m03877j57338K8298J02561K85705j677l8708J01069N7754o6296k23353
13541d6267L2442k777j10927M0859Q5052P4424j39309p5932L8247r5929j45797
$$ y = [151177, -8587, -189731, -83622, -115059, -22766, 198437, 309582, 223329, 173408, 33502, 76538, 27146, 52877, 5942, 5591, 19279, 128460, 206312, 222334, 440563, 525525, 244728, 68745, 21796, -27221, -202071, -367121, -388275, -389036, -211433, -242538, -295767, -323475, -227739, -201161, -350524, -244410, 203881, 433580, 314613, 281702, 187472, 212160, 268761, 125613, -42982, -141004, -44868, 98875, 142997, 201479, 202151, 384130, 339139, 139326, -98344, -353264, -450455, -448880, -435697, -145569, 33161, 228858, 269595, -134282, -291620, -263322, -160761, 124944, 123267, 84559, 185628, 243382, 177086, -46267, -13825, -16602, -127529, -86670, -1618, 72806, -66503, -142435, -104188, -200117, -345914]
13530c45914O1790n212k26080j10221M0136L39075K44044J17232k48817o0694
13520a94661J25820q421K2329O9493K11991p3838o6473J64018k06122k03640r5473
13509b54977L2715J76330L30795O0094R3478M3161m7569j01471j281J9335q1867
13498B68743m9398q2529n461j02374q3996l4829N9625o2638j43700l2561N0806
13487b18312P5547O056J56843L26922k915j28575K2026p3732L2855n2032J94760
13476C39443K16543p8991K2281r2008j29199o5613N4230J3397n2553N2870J12057
13465C92457j10456r2416l0155R5428q382n5093k41154L7051N5073L191j8187
13454B7357K6150R6779R980N9699j80350j00650J02217J70245q6387k5087k307
$$ y = [-345914, -284124, -289336, -515416, -625637, -585501, -246426, -2382, 114850, -133967, -194661, -68841, -77262, -54933, 14560, 226551, 152713, 86240, 250258, 44136, -159504, -254977, -222262, -45932, 284863, 344957, 438435, 481596, 434027, 332556, 331275, 350610, 268743, 219345, 136816, 131355, 28981, -55015, -89844, -30219, -92857, -236557, -269118, -218312, -142765, -136709, 20134, 347056, 344141, 215566, 237592, 163860, 196715, 144683, 339443, 555986, 476995, 499276, 407268, 278069, 212456, 266686, 280083, 227530, 280400, 392457, 282001, 189585, 159430, 254858, 246476, 191383, -49771, -12720, 42353, 45544, 27357, 53507, 150286, 160266, 219965, 39615, -61035, 41182, 211427, 125040, 99953, 97646]
13443I7646o0204K7299k15667q1762J24321o7361l2149q004J25225M2009J04087
13432E5440j5153n4046O8867j16138J6071j7312j03944N9404K40952q003J06733
13421B32871R9474n7758j32752j34778j4352l7567j2817K7777n4596R6597M2610
13410E4709R6787j5048j90573j9333M2725o4287j52775K80426J41305N3784k421
13399B25299R3346K1406q5981J9509j50440K03519Q2615n9255n6870n6966J81510
13388D17692J19547j30058k20613j98838m451M6708K824n818m8451O6730L1770
13377G7042j01804P3996L55649L1281j27401k11601n3398J55306p7295J01875
13367B23650J73713m1488o5745k07334j98354L5762N8625l7043j775J43023J31427
$$ y = [97646, 37442, 64741, -150926, -232688, -108367, -175728, -207877, -215881, -90656, -48647, 55440, 40287, -13759, 55108, -61030, -44959, -62271, -166215, -106811, 134141, 126138, 232871, 332345, 274587, 141835, 7057, -7295, -44862, -57679, -29902, -84498, 12099, 54709, 151496, 136448, -54125, -73458, -30733, -95020, -247795, 32631, 173936, 227720, 225299, 318645, 340051, 254070, 273579, 123139, 326658, 409273, 350018, 293148, 236182, 417692, 537239, 407181, 186568, -12270, -16721, 29987, 32811, 26993, -21458, 45272, 77042, -24762, 49234, 404883, 436164, 308763, 97162, 43764, 199070, 121775, 223650, 397363, 355875, 290130, 82796, -115558, -79796, -21171, -58214, -59989, 83034, 214461]
13356B14461L8749k03808o0533J0589k8754O2191n4153M7555P6143J27755j43544
13345H6651l9788J35055j31568j68810j48136J63147J01796J40726j86151j73824
13335b20902K5764J20597J75611Q0962k00691J3384M2461m1656k5239J63743j7495
13324A16539j34045J3685J72515n3479J3925J96517J90178k65992M9901k65246
13314C4498j75693k0619j76873O8145K30587J29882k4798j98443N9423K35244
13304A61353Q2606k36401m2673P5107j49165M5989J71086J40254P8167M8926L1705
13293D06954r4470j71362Q834l6506J02420j46270j87189k58904L7650J12234
13283b26609J30237J99876L0628P0570M3526j28928J47907K1177P351K6570k10709
$$ y = [214461, 253210, 49402, -11131, -542, -29296, 32895, -21258, 26297, 102440, 230195, 86651, 46863, 181918, 50350, -118460, -266596, -103449, -1653, 139073, -47078, -220902, -195138, -74541, 101070, 182032, -18659, -5275, 37186, -4470, -29709, 134034, 116539, -17506, -3821, 168694, 115215, 129140, 325657, 515835, 249843, 299744, 34498, -141195, -161814, -338687, -270542, -39955, 89927, 65129, -133314, -73891, 161353, 243959, 7558, -35115, 39992, -109173, -63184, 107902, 248156, 326323, 375249, 406954, 312484, 141122, 149956, 113450, 215870, 69600, -117589, -376493, -338843, -226609, -96372, 103504, 134132, 204702, 248228, 119300, 267207, 288384, 295735, 322305, 111596]
13272A11596m8767j56258K0741K01677m5935j0274K150K1547J62389N4378j736
13261C11508j90201k01385l1458K51601J42035j51124n4779k5743k4865Q4193
13251A09782N2761J48979k68484j09794O0898o6985M2288O9517K09599j9108J15877
13240C45330M6836j46355o4988p7600P9144r4963J07407Q0117k07293j01178Q0066
13229D6523L15481K6633l43960l6020J27577J26403j0650k43728k16940K9470
13219a79211J02111p1270o1801O0641J15438J3422l4260O5658L7432n8922j66515
13208a77277J124J4551n2403N421J60289J82454j1491l006q7844P8771N2520j8033
13196A45076J7104l5961M8973p1480k92157m8422R02J95390J42303j54657j1083
$$ y = [111596, 62829, -93429, -72688, 128989, 83054, 72780, 74930, 96477, 258866, 313244, 311508, 121307, -80078, -111536, 140065, 282100, 130976, 76197, 50454, 25589, 109782, 162543, 311522, 43038, -66756, -5858, -72843, -30555, 38962, 248561, 229453, 345330, 392166, 245811, 180823, 103223, 182367, 87404, 194811, 274928, 67635, -33543, 46523, 362004, 388637, 44677, 8657, 136234, 262637, 251987, 8259, -208681, -179211, -77100, -148370, -210171, -149530, -34092, -20670, -54930, 10728, 48160, -10762, -177277, -176153, -161602, -214005, -208584, -48295, 134159, 122668, 119662, 31818, 110589, 163109, 145076, 162180, 126219, 175192, 103712, -188445, -236867, -235965, -40575, 101728, -52929, -64012]
13185f4012J27705k78670l9352K25665Q3959j08056r632m2688J32706l6957p5042
13174h4374J73843J4717n3814j66427K4529o4072J40109K32734q3762J7378j9907
13163A30954j78633O9443q49N9136j04035J47023J11379P9571l4208K3465N7771
13152C61017j24090l802Q887P9854J09973M9478j73949j62632j20807m9186j17258
13141a42515N2183J57529J3657P8445M1280J60809m1146j30234k5713l0988k6393
13130A06914j31672j41944j06898L9909k3862Q8923L1330j1096J24919Q1088j9162
13119C8449Q4608L3158O468J66052N7251q2481j69872k3090J83691m9436j27179
13108A17619m5139r1247k00990l6403K38842M3049k46632q7390K18045J79058
$$ y = [-64012, 63693, -214977, -254329, -28664, 55295, -52761, -62393, -105081, 27625, -9332, -84374, 89469, 104186, 50372, -116055, -91526, -155598, -15489, 217245, 133483, 150861, 130954, -47679, 21764, 20915, 80051, -23984, 123039, 234418, 313989, 279781, 303246, 361017, 236927, 233125, 242012, 321866, 431839, 481317, 307368, 144736, 23929, -25257, -142515, -90332, 67197, 80854, 159299, 200579, 361388, 320242, 190008, 164295, 133307, 106914, -24758, -166702, -273600, -233691, -257553, -168630, -137300, -148396, -23477, 57611, 38449, 123057, 156215, 162683, 328735, 385986, 303505, 133633, 110543, 294234, 244798, 117619, 72480, -18767, -219757, -256160, -17318, 25731, -220901, -308291, -90246, 88812]
13098H8812p0583j33856l070j38523K33606N3715j18594o148p2671k6308J94319
13087F99l8745j8867r2863k875o8963k9481J04279N1010k3461r6891o2967M2145
13075b36980P3641J86685N5313K5440m7678k30618P7544R1075l4580K46336J1392
13064B17570l04905k7726J66342N1014m4249k51562o4154M6378Q3308j19416P8783
13053a68617P3877J12732J47169j49644j86526l535k2881K20852j11058j7621
13043a05252J36119n0061K2231m4860j04810j1092J5897o48J67822J33558R7001
13032B55905l883K67097j1754j72773j21950p3859r5855P0852J05420L3209n4702
13021A97707r3797J37663l152j56269M154J12017J00535n4866o6956n2944j48346
$$ y = [88812, 18229, -115627, -118697, -257220, -23614, 30101, -88493, -94641, -167312, -193620, 699, -38046, -56913, -149776, -152651, -221614, -251095, -146816, -95806, -119267, -216158, -279125, -236980, -163339, 23346, 78659, 104099, 56421, -174197, -96653, -5578, -40158, 206178, 217570, -87335, -115061, 51281, 102295, 58046, -193516, -257670, -211292, -127984, -247400, -168617, -94740, 17992, 165161, 15517, -171009, -174544, -197425, 23427, -87631, -105252, 30867, -19194, 3037, -41823, -146633, -157725, -141828, -142476, 25346, 158904, 255905, 252022, 519119, 507365, 334592, 212642, 138783, 42928, 113780, 219200, 252409, 197707, 103910, 241573, 238421, 82152, 86306, 198323, 298858, 243992, 177036, 124092, -24254]
13010b4254j53471k24934M4899K94050J58779J44654o7468j588k9463j03637j61955
12999a24388j07574n4855K39623J58054j85231j26848O5212P7813J17507L4145
12989I3458J83058n6249j09660M7091j03210L0416j21601j35370P9201j00692
12979a93558J1097R6666L6868j62096n3221J61993j3253j29706J00076Q9792P5110
12968A9768j64694j2453J38593L7686q3866M566J33578n4281j40323j23791J9641
12957b25576j00679J08192J07670l4017Q078M6937N5955J664N2549Q4524J49021
12946B54318o8346K3431O8755M6200P4786r189k58434j10307p7347j23039l4891
12935b14063K72738J7823j27825r5193J38702J61092j15404p4062K04065o9875
$$ y = [-24254, -177725, -402659, -357760, -63710, 95069, 239723, 172255, 170667, 141204, 37567, -124388, -231962, -286817, -47194, 110860, -74371, -201219, -136007, -58194, 59313, 93458, 276516, 220267, 110607, 157698, 54488, 84904, -36697, -172067, -92866, -193558, -182461, -85795, -48927, -211023, -264244, -102251, -115504, -245210, -145134, -55342, 19768, -144926, -157379, -18786, 18900, -64966, -60400, 73178, 18897, -121426, -245217, -225576, -326255, -218063, -110393, -144410, -136332, -89395, -33440, -31776, 20773, 105297, 254318, 185972, 209403, 278158, 324358, 399144, 389955, 131521, 21214, -56133, -179172, -214063, 58675, 76498, -51327, -146520, -7818, 153274, 37870, -36192, 167873, 97998]
12925I7998l8941R6352J37763J11912j069p2758q370k30326j13835J11086o9111
12914B0701n0951p7623j34067J01607L05773J73769N6538R627k57062q8692m2181
12903A7439j57077q481O5194J73495J91762l9497k37183m6976r7374N0206J90381
12892A01889N4972r9319q1090j01643j9686L05176L1596j82582j85920L9107J46455
12881H955Q4951k0830r4554K7837J65617p7316j11809J15608m989r4589j2496
12870a3615j32904j05908o1968N7566J3704J27781R2543j77618j60669j9799M4690
12859c36197K9204K6774P0119q7305M0571m174J09951J7049j03299L345R2503
12848a41459j04518J59153Q158L0617J79676n4005j70068O1036Q1568R6780j13390
$$ y = [97998, 59057, 155409, 293172, 405084, 404015, 331257, 322887, 92561, -21274, 89812, 20701, -30250, -107873, -241940, -140333, 165440, 339209, 395747, 405374, 148312, 59620, 17439, -139638, -148119, -82925, 90570, 282332, 242835, 5652, -41324, -138698, -88492, 101889, 156861, 57542, -23548, -125191, -144877, 160299, 191895, 9313, -176607, -137500, 8955, 93906, 73076, -21478, 6359, 171976, 94660, -17149, 98459, 93470, -1119, -13615, -146519, -252427, -314395, -256829, -243125, -115344, -22801, -200419, -361088, -380887, -336197, -306993, -280219, -210100, -297405, -256834, -261008, -151057, -134008, -237307, -233962, -141459, -245977, -86824, -78666, -48049, 131627, 77622, -92446, -31410, 50158, 146938, 33548]
12837C3548J90625j22380j1974J51341O4585k63869k05540K45465J61784k7227
12827B16358o4347J56540l1725j98324N6176J40509J69994j08458k30077q9910
12817A6736k35612L993l2820K730J08116J59337K52095l6215l37680k08973K70175
12806c8118J51685j16017k04585L6257q009R856J55850n1596o7139P6372j6601
12795g2045p0771O975n6480l9251K07783J54013o919q3375N2567J91232l2476
12784B51253k24076m1673L9923r2989r1796J30373n4986j06221J73354J35893
12774A19055J9355p8053M0734k45044o8843L01062J49133k3085l3089j48812K35224
12763B67637n7012k07123o4361R7405r7332R2274J9350m5640r9989r2379p0546
$$ y = [33548, 224173, 101793, 89819, 241160, 305745, 41876, -163664, 81801, 243585, 216358, 152011, 308551, 276826, 78502, 134678, 275187, 445181, 336723, 106646, 16736, -218876, -214883, -247703, -244973, -136857, 22480, 274575, 238360, -99320, -308293, -38118, 113567, -2450, -207035, -170778, -178787, -168931, -13081, -64677, -131816, -55444, -72045, -142816, -135841, -192321, -231572, -23789, 130224, 123305, 39930, 92497, 283729, 251253, 27177, -14496, 25427, -67562, -159358, -28985, -83971, -190192, -16838, 119055, 138410, 60357, 101091, -143953, -212796, 88266, 237399, 214314, 181225, 32413, 267637, 210625, 3502, -60859, 36546, -60786, 31488, 50838, 5198, -94791, -187170, -257716]
12752b57716l1021J83929k1468K3314J45058N6455J99077M2456j37629r6726L5616
12741A41345P580J05083P1084K2092j49243O4742K2669j53093m0282J04448q8536
12730A07889j02198o4499m6602J5750K19890J32049j88520k0312M5748Q7211O7774
12719B54180k20348m74616p4041J79602j0876L09537J78382j2747j684J84550
12709C11939n582r4294k10010J6164K757j45337m5979J3881K8156J57434j26541
12698i7412k21238P6271N7730j8568M6412J11913M2618k613J896L5263o6469L687
12686c0510q1247m4072J03009J66154r4284k14532k61865J23933J45944Q3510
12676a03960J31697K24924j5082k9223j44698l03711r3110L50024P9725J00407
$$ y = [-257716, -288737, -104808, -126276, -102962, 42096, 98551, 297628, 340084, 202455, 105729, 141345, 148925, 254008, 325092, 347184, 197941, 262683, 285352, 132259, 91977, 196425, 107889, 5691, -58808, -105410, -89660, 130230, 262279, 73759, 53447, 99195, 186406, 254180, 33832, -440784, -514825, -335223, -346099, -36562, 141820, 129073, 127389, 311939, 306357, 212063, 2053, 18217, 20974, -124363, -170342, -156461, -128305, 29129, -97412, -318650, -242379, -184649, -203217, -156805, -44892, -2274, -4887, -2991, 32272, -34197, -30510, -111757, -155829, -52820, 113334, 19050, -195482, -457347, -333414, -187470, -103960, 27737, 252661, 237579, 208356, 63658, -240053, -333163, 16861, 96586, 196993]
12666A96993K881L0213j78101k14339K53163J25790R9691r6228j37740j9227J2657
12655G5753o5101j0927k3148j28867K1069J06976k96001k17065K13781J91469
12645a32061k6799J03274j8473r146k5685J5917l9319n0521J86340R0474K60312
12634C54313K9245k10714O149K0668j89827J08815J47289O1360P0k31953r7035
12623a620j730J71978J25703m67006j21307R0426Q7211k1295J55960K40584j5716
12612B43188j27308n1347N1337j0766q4320L8290M8865k305n5219k90515J42883
12601i7217J00045p4166J05409J21486L9171j65708m8836O0223L2174L870r9K2886
12589I9238k13032L3640J74187k7503N5231J04706j7238j09025J30730Q409k95074
$$ y = [196993, 199874, 230087, 51986, -162353, 90810, 216600, 316291, 220063, 82323, 63096, 75753, 10652, -275, -23423, -152290, -131221, -24245, -320246, -537311, -323530, -132061, -158860, -55586, -74059, -83205, -108890, -92973, -132292, -182813, 3527, 94001, 354313, 383558, 172844, 178993, 199661, 9834, 118649, 265938, 327298, 327368, 95415, -1620, -3350, 168628, 294331, -172675, -293982, -203556, -116345, -137640, 18320, 258904, 243188, 115880, 64533, 115870, 105104, 20784, 59074, 107939, 105634, 50415, -240100, -97217, 2828, -71338, 34071, 155557, 194728, 29020, -19816, 40407, 72581, 76451, 76352, 99238, -113794, -80154, 94033, 66530, 121761, 226467, 209229, 100204, 230934, 239343, -55731]
12578e5731L3618K38932j6801r8835R5446j20075Q1736N7224j11164j01498j23725
12567a20873J52764j721l2440J10554J92256J7735J2415J6901J50053j1091M249
12556D90802p4688r0994m0816J58300o0209k47037j82403J79009j8730l22289
12546b09055Q855K50306L1476M1195k7602L6556L4285o0229P2936j98429j92902
12535b12608l8392j15331J07355P7611K16889P7410j53582O0549P8307J8990j05643
12524A1555j51343O0144P4213K8350n1159J75546Q5260j90879M5205J49804n5635
12513A81061l9783j97651j9657Q6720J07733j23323q5078o9166J58409q9466k90623
12502c80824J39070o0909L8973L3463O8970N9495O2184j51090j35325J44493Q5674
$$ y = [-55731, -22113, 216819, 200018, 101183, 196629, 76554, 158290, 215514, 104350, 2852, -120873, 31891, 30170, -2270, 108284, 300540, 318275, 330690, 347591, 497644, 486553, 490802, 416114, 325120, 284304, 442604, 382395, 135358, -47045, 131964, 113234, -209055, -200200, 50106, 81582, 122777, 95175, 131731, 166016, 105787, 178723, -19706, -212608, -251000, -366331, -258976, -181365, 35524, 112934, -40648, 19901, 98208, 117198, 11555, -139788, -79644, -5431, 22919, -28240, 147306, 232566, 41687, 86892, 236696, 181061, 141278, -56373, -76030, 10690, 118423, -4900, -89978, -159144, -735, -90201, -380824, -241754, -302663, -263690, -230227, -161257, -101762, -39578, -190668, -325993, -181500, -95826]
12491i5826Q8330J4154p7455k00057J60258J55535M8358Q8349j76520j40214M222
12480a30866O8654j70564j77057J10653l9909J26620J80827N1922J03729p3928
12470E0081j01934R5179J81543j82731j52519J69060J1242L7257j02443R3477
12460I8212j51157o1037O4981K9193j57422q4340J60572m0857p2956o0700L7767
12449b37744K7477r4455k0109m2740r3178K50460L77112o8484j33895j18690j8664
12438a72910J00506k08709n8746J30523l463j15892L04995Q1994P3088j9635N6393
12427A68144L2494j84472q068p2330J27464j02172j27317j16936P3480L9834K0755
12416a49124L1075k9556M227o519L4212Q5812N9673l07703j50541Q4374p8120
$$ y = [-95826, -7496, 6658, -70797, -270854, -110596, 44939, 93297, 181646, 5126, -135088, -130866, -62212, -232776, -409833, -299180, -339089, -212469, -31642, 20280, 124009, 50081, -51853, 43326, 224869, 42138, -110381, 58679, 69921, 107178, 4735, 98212, -52945, -113982, -49001, -19808, -177230, -261570, -100998, -141855, -214811, -275511, -237744, -210267, -304722, -324831, -367571, -460749, -210289, 166823, 98339, -35556, -154246, -172910, -72404, -281113, -339859, -209336, -212799, -328691, -23696, 58298, 131386, 111751, 168144, 200638, 16166, 8098, -64232, 63232, -38940, -166257, -283193, -209713, -169879, -149124, -118049, -147605, -143378, -149897, -115685, -29873, 29800, -277903, -428444, -344070, -422190]
12405d22190M4019J93795R1106M7766R4326p6028P1217N162j32449J92554R8795
12394B08073j76355j78706J51420m3675j89409M3079L9777J31259K52676p3619
12384A64520r8314p6210Q0907J00710j31562k58675J922P799L560K31781J54687
12373A81125O2241j72616j58278n4393L7786j3414k3010J83249Q4022K18531K6173
12362C71416j68987n2387j19336j7262m2604N0236m5189k70168r2345K08790Q7109
12351i0727P3076L7656J12889K6700P8672L3092j68142P061j38126r6571r4775
12340b19195j77423K1444K23553M1486K27694K8930j44130Q3629K0171J40025
12330B46184k95116p5306J19446L6530p9944j61971Q2992J48696P7416j79090
$$ y = [-422190, -378171, -184376, -93270, -45504, 48822, -27206, 44011, 49173, -83276, 109278, 208073, 31718, -146988, 4432, -39243, -228652, -185573, -145796, -14537, 238139, 164520, 66206, -10004, 70903, 171613, 40051, -218624, -216702, -208903, -205343, 26438, 181125, 243366, 70750, -87528, -141921, -104135, -117549, -140559, 42690, 126712, 345243, 371416, 202429, 150042, 30706, 13444, -29160, 21076, -24113, -294281, -386626, -177836, -90727, -17651, 20005, 132894, 159594, 238266, 271358, 103216, 110277, -27849, -124420, -219195, -396618, -375174, -151621, -110135, 117559, 146489, 2359, 85988, 106159, 246184, -48932, -124238, -4792, 31738, -48206, -210177, -127185, 21511, 98927, -80163]
12320h0163L62853K2835r1040k6358P1652j3388k37696j34788P5674j36941j82776
12309c70136L2099K25540L3653j9625k8675k38243j46722J60536K01939J74216
12299B4582J11447J46512m2895k15232j37873J53871R5398n933J8409N5263l069
12288B00480j24714j89356j52565N4408p1949p9567k5360M4456J8180J44898K38946
12277E7857Q1747r6850o5850q785m9231q3664j76877N7091J35038K46782P1098
12266A68356n8237j04899O6093l2669J93160j70963N332N8881l988k46312L4990
12255i0256k8855O489J5221K2609J68571P5848n5357p1175m3619P0228R0148P5994
12243B35846M4743K7665j28j6371j64682j66183P581J37378l7809j37552N9327
$$ y = [-80163, 282690, 305525, 214485, 188127, 259779, 246391, 8695, -126093, -50419, -187360, -370136, -338037, -112497, -78844, -98469, -127144, -365387, -512109, -351573, -149634, 24582, 136029, 282541, 239646, 24414, -113459, 40412, 135810, 129877, 148286, 203549, 200480, 75766, -113590, -266155, -211747, -283696, -363263, -388623, -344167, -325987, -181089, 57857, 139604, 42754, -23096, -31881, -81112, -164776, -341653, -284562, -149524, 97258, 168356, 110119, 5220, 71313, 38644, 231804, 60841, 66173, 125054, 121066, -125246, -90256, -119111, -112622, -97401, -74792, 93779, 169627, 114270, 43095, -524, 69704, 159852, 235846, 280589, 308254, 308126, 291755, 127073, -39110, -31529, 105849, 68040, -69512, -10185]
12232a0185J9912j20765m7555O8311N9618R6833j63623Q0862j39304l01800o1273
12221e18969O9403J44261j8654j7784J32361J65872J78487o7051p8551k91397
12211c02022R0640M0653o1045J48076J77669M2680J63500R6606k13258J16325
12201B99824J30924R129j42386J19895j01929k51988k53090N406R4963M8727Q8729
12190D8204j0371r756j12099J39007K9285r2109P9140r7656k2607P0964k36875
12179b14873p3036K76157K92571q9475j72005j9340K0871o877l7210J11485O6131
12168A54399o6046l13564q4614K47257K24110L9007j6343K0659n0240j09900M6065
12157I0790m3489n3992r7330J50905J5776L452l3513O807O722P881l9343P8204
$$ y = [-10185, 9727, -111038, -158593, -90282, -30664, 66169, -97454, -16592, -155896, -457696, -518969, -449566, -305305, -323959, -341743, -209382, -43510, 134977, 67926, -10625, -302022, -211382, -170729, -231774, -83698, 93971, 136651, 300151, 396757, 183499, 299824, 430748, 439877, 297491, 417386, 315457, 63469, -189621, -184215, -89252, -40525, 48204, 37833, 28077, -84022, 54985, 84270, -7839, 71301, -26355, -48962, 22002, -214873, -287909, -11752, 280819, 191344, 19339, -1, 20870, 13993, -23217, 88268, 154399, 88353, -225211, -309825, -62568, 161542, 200549, 184206, 204865, 154625, 44725, 90790, 47301, -6691, -104021, 46884, 62660, 66112, 32599, 39406, 46128, 54009, 14666, 92870]
12145I2870j27550j67463J87603K31180q6145J41564k8089j61103j04504O6639
12135D5002J22366n850k72251m7654K68388j69307J1244k29293n3548l6178R7256
12124b69825J72272O5310J4978N7537r4820j36268Q746J56225j7811r630J53227
12113I9941K17987k12662n4551J62713j63107m4799J26207o0481r5482k1146k2792
12102f8172J6313J25601o7771Q2420M4783r310K6042N9009l5845k093R2258j58350
12090A04885j8405R7369j55787k20755N7167P7943l9097J69638J00344j77786
12080d484Q4714R7723k34751j69239P3627J1255j43399L76991J8763j73718R2561
12069C0043N8650L1899k93043r1456O8749J95465K4283l08572q8653M0033p202
$$ y = [92870, -34680, -202143, -14540, 216640, 130495, 272059, 243970, 82867, -21637, 45002, 167368, 161518, -110733, -158387, 110001, -59306, -48062, -277355, -330903, -367081, -269825, -97553, -32243, -17265, 40272, -54548, -190816, -182070, -25845, -43656, -53286, 99941, 317928, 105266, 50715, 213428, 50321, 5522, 131729, 71248, -24234, -45380, -68172, -51859, 73742, 5971, 88391, 133174, 123864, 149906, 208915, 173070, 170977, 263235, 104885, 86480, 183849, 28062, -192693, -135526, -57583, -96680, 72958, 173302, -4484, 80230, 177953, -56798, -226037, -152410, -141155, -284554, 92437, 111200, -62518, 30043, 88693, 120592, -172451, -263907, -195158, 307, 24590, -283982, -372635, -332602, -339804]
12058c39804N2100J28551j30282K1677K52078j2277p8823k8086J76940q3572k75075
12047c16573m169O5348R1146q932l7330o6170R3637m0869P3411j8782l572M0406
12035a32449K66p6289O4984J62291K2066m0521j30370J48432L9262n653J10067
12024A62086K2851m912J2615k55064k23958L6105j06951O8066J74193Q3955J16871
12013H5857o064N9404q9650J19601O982j52219O4116m2846j84418M7864N7227
12002c4146O7542j1278o5550k0801J75594J2360m7539J04162r1528L8840N5561
11991A83217j34317o8446J7221J68381Q8440m8371n2607l2265j27046M4312J02760
11980A41279p4942k18394N0320M5803K2236J37910O9945J0051n0655j62184j67012
$$ y = [-339804, -287704, -159153, -289435, -267758, -15680, -27957, -106780, -134866, 42074, -41498, -316573, -320742, -255394, -164248, -173180, -210510, -276680, -183043, -223912, -150501, -169283, -172855, -132449, -132183, -208472, -143488, 18803, 40869, 348, -130022, 18410, 57672, 52019, 162086, 184937, 180025, 192640, -62424, -286382, -250277, -357228, -289162, -114969, -31014, 85857, 79793, 139197, 49547, 169148, 176130, 23911, 88027, 45181, -139237, -91373, -34146, 33396, 22118, -43432, -64233, 111361, 123721, 76182, 180344, 88816, 127656, 183217, 48900, -19546, -2325, 166056, 254496, 206125, 153518, 121253, -5793, 38519, 141279, 66337, -152057, -101737, -55934, -33698, 104212, 174157, 184208, 133553, -28631, -195643]
11969a95643M9405K8957N846l5107j65240M8753J33455K15583J5020J69926j21705
11958A49250k09118j50784M4891K71760J80050j7961J9855j5883k35349m3474
11948f763K4396p5882L7589L3546M2776j7485m8286K5051R0350K2161J30317j68439
11936H9331j44939j6233J75995L7081J17628j0114k0285j11565j58538J08855
11926F7216P877R2256o5381n5317p0889j81469l3908P9557J1564J47934L1542
11915C0982J0998j11162k08123J13316j313r3107J56970q5396L548J61804N8625
11904C7142l22883j39093N2956K92529J13853J34544J30315j71011J27728Q2088
11894C38168q6268j13517o2968K12657j75266j12118j00325m1013P0825K71731
$$ y = [-195643, -146238, -117281, -111435, -146542, -311782, -263029, -129574, 86009, 101029, 270955, 149250, -59868, -210652, -165761, 105999, 286049, 268088, 287943, 272060, 36711, -6763, 17633, -58249, -20660, 12886, 55662, 38177, -10109, 14942, 105292, 127453, 257770, 89331, -55608, -71841, 104154, 141235, 258863, 248749, 228464, 116899, -41639, 67216, 75093, 167349, 101968, 46651, -24238, -205707, -239615, -160058, -148494, -560, 30982, 41980, -69182, -277305, -163989, -165302, -258409, -101439, -186835, -183287, -21483, 37142, -285741, -424834, -371878, -79349, 34504, 169048, 299363, 128352, 256080, 338168, 251900, 138383, 75415, 288072, 112806, 688, -99637, -140650, -69825, 201906]
11884B01906j22933q6617J17428N4772L5769o0163k08882j95647n4215L8742j5512
11873b95352L2508m1239o675J95782M4594j07603K11531L4702j86347j48898j16737
11862c83734Q8968j83602J11582k6707N5452J10330m2397J13958L70831L3304
11852B47985M9678J41695l7365r7943O7622R2583j93072k17886n157P3993N9020
11841A81153J00491Q0399k39512j05408R2178j4713o9847m7977J89251K33522
11831C99537L3151j81950l56928n5591L8890K3807o5281M8118M7495J02392K612
11820C6252R3647p0323J21646J09622j41077k44483N1132n2964J85102n0259j70528
11809a32233N6118N9032K70125J12300j7746n4796j84157j83392M9874M4561l36476
$$ y = [201906, 78973, -7644, 109784, 164556, 200325, 140162, -68720, -264367, -318582, -279840, -295352, -262844, -304083, -310758, -114976, -70382, -177985, 33546, 68248, -118099, -266997, -383734, -294766, -478368, -366786, -393493, -338041, -227711, -270108, -156150, 214681, 247985, 297663, 439358, 401993, 304050, 371672, 464255, 271183, 53297, 48140, 122133, 181153, 281644, 362043, 122531, 17123, 109301, 94588, 24741, -23236, 166015, 399537, 432688, 250738, -106190, -161781, -122891, -99084, -164365, -116247, -68752, 33640, 36252, 129899, 59576, 181222, 290844, 149767, -94716, -43584, -96548, 88554, 38295, -132233, -76115, -17083, 253042, 365342, 347596, 292800, 108643, -74749, -24875, 19686, -316790]
11798c16790p0983O7625R923K14215J24782j04752P2327N2605j13362j64527K4717
11787b04220L21154J13444J42275j21544n3863P6276j22032j19815r4644J89403
11777A26434J53007k8388j88887P118J75693O0258j03902P2692o5898o4981P8724
11766B21870J31603K3747n4949j90920k25012R0097J08105N9654q896K1469J71387
11755C48155k43433r8514L424k63283J4982J00470N8129L612j36815J19199J04067
11744I993J5754p2442j69566k6704J78533K2447K5518j34989r963J33978k5716
11733e3157r6935m9788N9096J18253m2776j89386l2347K9045J8566M413J37082
11722i7934P1771P4794K2476j06629j30624R3432r1781n7037j10716L4752J51548
$$ y = [-316790, -387773, -320148, -310225, -96010, 28772, -75980, -3653, 48952, -64410, -228937, -204220, 116934, 230378, 372653, 251109, 197246, 273522, 151490, 31675, -62969, 126434, 279441, 251053, 62166, 69284, 244977, 305235, 201333, 274025, 208127, 143146, 221870, 353473, 377220, 322271, 131351, -93661, -3564, 104541, 164195, 155299, 176768, 348155, 104722, 6208, 9632, -253651, -238669, -138199, -80070, -76458, -213273, -94074, 9993, 25747, -46695, -216261, -242965, -64432, -41985, -16467, -151456, -161419, -27441, -53157, -150092, -199880, -140784, -22531, -65307, -254693, -287040, -257995, -239429, -235016, -97934, -26163, 48631, 71107, -35522, -166146, -72714, -164495, -221532, -332248, -297496, -145948]
11711a45948N3268O3198j36652p3698j546j06366q5071J30216m1528k4706K30690
11700a38143L38666M1723j40656k926Q9572j63853j38012R742n9783j42479r4500
11689d00649J25305K92597J65091k75799j77374l3988J33841J83687M5262j1628
11679D6345J49058L2588k06770j14804k12286L1603J74211K08070J14067j82322
11669C9760j24728N3735N3882K6262L3491j81740N9290J36869j4728J65189O001
11658B53283k00264l63820Q268J81276K0624q3668P0188J89664j49258P0481J03447
11647A00221j80212L005P7161l4701j24385j08669O4057M4581K4270M0492j37346
11636b31526M1568K86152Q4114m0011m7245j6492J80468K5799k16368M0830R2339
$$ y = [-145948, -92680, -29482, -166134, -239832, -241378, -347744, -432815, -302599, -344127, -368833, -138143, 200523, 242246, 101590, 98664, 188236, 24383, -113629, -103887, -163670, -306149, -400649, -275344, 17253, 182344, -93455, -270829, -304817, -170976, 12711, 57973, 46345, 195403, 227991, 21221, -93583, -305869, -274266, -100055, 108015, 222082, 39760, -84968, -31233, 22649, 48911, 82402, -99338, -40048, 96821, 82093, 247282, 253283, 53019, -310801, -302533, -121257, -100633, -184301, -114113, 75551, -73707, -3226, 100221, -79991, -76986, 175, -34526, -158911, -267580, -203523, -158942, -134672, -94180, -231526, -189958, 96194, 180308, 140297, 93052, 76560, 257028, 282827, 66459, 107289, 199628]
11625A99628j83331k13271n067j974J96886J59942M47k05744j8181k4930J48004
11614E2409j06584q6387R1263J83539k08946k84068N4956O350J50591J32881N4589
11603D0593j07892q7626O5633R5556J57559J1316K523J9503r3640j47925L4763
11592i637k5823L3582j11878j5231L7866J45389K77908O824j14949j03169l6959
11581H3923j28604p6114n2105J24439P5132J0683N0162k9704J19194J9789j82407
11570A4388r947K7770n8152N038K8394O4164j74386l7162K04991J77430J25803
11559C68331p6872L5032n9535k65286j17512P3827o6528Q8925q376j64756J53690
11548c9060K04219n4644j10308N8706J27335J0350j66108J81886J69724k03383
$$ y = [199628, 16297, -196974, -202041, -204015, -7129, 152813, 153260, -52484, -70665, -95595, 52409, -54175, -140562, -49299, 134240, -74706, -358774, -303818, -297468, -146877, -13996, 40593, -67299, -154925, -89292, 6264, 163823, 175139, 177662, 197165, 103525, -44400, -9637, -35460, -1878, -113756, -128987, -91121, 54268, 332176, 339000, 224051, 120882, 83923, -44681, -120795, -172900, -48461, 26671, 37354, 87516, 57812, 177006, 196795, 14388, 4441, 32211, -25941, -20903, 7491, 71655, -102731, -139893, 65098, 242528, 368331, 291459, 326491, 266956, 1670, -115842, -42015, -108543, -19618, -27994, -192750, -39060, 165159, 110515, 207, 58913, 186248, 196598, 30490, 212376, 382100, 178717]
11538A78717l64455r486R5268K99488K48630m3176r0936p2683j25572k01174p5550
11527a60929Q7020J69264L0655j16720j53299O9628L3636L3804M6379J6392n9172
11516c342N1109M3458j22978n1209k31018P6556J25242m3606p2934J19694K77097
11505A68069l0822q1765q9845o5408J1829m505J04479p0515j53743J02080j2524
11494a22670J47699R1215p5473j2722Q003J004q5027N3942K01481M3654o0640
11483A90466j34723j61378K0365Q6554J59030j77063j75347j07186J39832Q6113
11473g3337p6337k12184K0715j29703O7362J89250K58484K82711o8434j82833
11463G5694o9172Q9440M4925m0903R5660J36288l3232k5490j75327k46812j07393
$$ y = [178717, -185738, -195224, -99956, 199532, 448162, 404986, 314050, 241367, 115795, -85379, -160929, -73909, 95355, 126010, 9290, -144009, -74381, -40745, -6941, 39438, 55830, -3342, 47767, 91225, -31753, -82962, -313980, -237424, -112182, -155788, -228722, -109028, 168069, 137247, 55482, -34363, -99771, -87942, -92447, 12032, -58483, -212226, -110146, -122670, 25029, 116244, 40771, 28049, 36052, 37056, -47971, 5971, 207452, 251106, 190466, 55743, -105635, -85270, 1284, 160314, -16749, -192096, -299282, -159450, -73337, -149674, -361858, -341143, -470846, -403484, -214234, 44250, 326961, 258527, 75694, 6522, 95962, 140887, 99984, 195644, 331932, 298700, 273210, 97883, -148929, -256322]
11452b56322J84589M1110n3248J04279r00N604j59559M4868P831O112P201J10260
11440D1825J02683O8557j60299o6266j83864O4603n0603J50264J15565p9518J38140
11429A41087k6391j54862q845q6096K9933P7668m1943J3114j2652K2167j43289
11418a90109r2795J77205J72198J9038j17607j97415j9818m5414o2328m5738r4631
11407d97414j6001J28036M73977J76525l36136l8540K34399K2878R1150j68399
11397G0475l0087p6044k4495J31582N0623J13452j33150l9212J18348j12043j97975
11386a28526j56979k6683j2760K1909J3836R9127J68994L9142M0128j17551M2308
11375a7055k9237j14474j38714k5148L8095o8102p0046Q9833K19550J95022j56082
$$ y = [-256322, -71733, -30623, -83871, 20408, 19508, 25112, -134447, -89579, -81748, -75636, -68435, 41825, 144508, 213065, 52766, -13500, -197364, -132761, -183364, -33100, 82465, 2947, 141087, 114696, -40166, -49011, -135107, -105174, -27506, -69449, -56335, -68987, -46820, -190109, -282904, -105699, 66499, 85537, -32070, -229485, -249303, -294717, -357045, -402783, -497414, -513415, -385379, 88598, 265123, -71013, -109553, 124846, 147724, 238874, 70475, 40388, -35656, -60151, 71431, 122054, 235506, 102356, 63144, 181492, 69449, -128526, -285505, -312188, -324948, -303039, -289203, -190076, -21082, 18060, 58188, -59363, -17055, -46292, -160766, -299480, -324628, -286533, -354635, -424681, -334848, -115298, 79724, -76358]
11364g6358m5626j19322P5030K69647K6687p2020l2805K14493o5419j36065r4529
11353e6287K2189j54449j12376L6515K46841J78300j23251j4515j94943m1487
11343b13463l8069M2161K73579M4394J3896l0764k3334o2109o2860m0321N4673
11332d2217J51446j45318O0291p075o8204K22717L2145k11962k281n1342K7430
11321c4370M9017q7279j04623P7120P2206L5198M9883O5579o5143J6909m9026
11310B5471l2005J16501j40398o6335l5781R3227Q393K9394K69870Q6383l8624
11299C16096j07975Q7335j40830j00245l3140K6261o3965M0904r359q9453j26733
11288b01104o213R716O2982J29546k07778R8546L0535K20831J00169k4992k25501
$$ y = [-76358, -121984, -241306, -166276, 103371, 130058, 58038, 25233, 239726, 174307, 38242, -56287, -34098, -188547, -300923, -264408, -17567, 160733, 37482, 22967, -171976, -213463, -251532, -209371, 64208, 108602, 122498, 91734, 68400, 6291, -56569, -96890, -42217, 109229, -36089, 24202, 17127, -51077, 171640, 203785, -8177, -10458, -61800, -34370, 14647, -72632, -177255, -100135, -27929, 7269, 57152, 122731, 57588, 74497, 25471, -6534, 109967, -30431, -96766, -132547, -39320, -30927, -1533, 268337, 354720, 316096, 208121, 295456, 154626, 54381, 21241, 47502, -16463, 24441, 15082, -74371, -201104, -207317, -197601, -134619, -5073, -212851, -114305, -83770, 137061, 237230, 212238, -13263]
11277a3263k23925K3447q301J47503p2972k44633p2667M5741K6291L7847j03644
11266d58576R0314J2063J71876J74562l8736N7439J35939N8236k13989j85239
11256a96111O9529K09752n2732k06157Q9140L1623M466n1007J3094Q39k18706
11245c06270k77715O5715Q745J03751J63863j13317J1043J06869J8234N7296K0991
11234a40795J36846P0229j5398j33272p1027n170m0261O7124M7342P9828p1305
11223g5859n7242J50821J64953j89720m3831l9609p7955K9326j51163M4852J91453
11212e3974k1451K30432R0741K458k2575n3564m7226j11731o4342Q055L4549j08117
11200a16745k58233Q446L88420J76217o2061P7702M8495o7067n9724r8985M2914
$$ y = [-13263, -237188, -213741, -222042, -74539, -147511, -392144, -464811, -419070, -392779, -354932, -458576, -368262, -356199, -184323, -9761, -48497, 8942, 144881, 203117, -10872, -196111, -126582, 83170, 30438, -175719, -86579, -54956, -50490, -101497, -88403, -87564, -306270, -583985, -518270, -509525, -405774, -241911, -355228, -344185, -237316, -219082, -161786, -140795, -3949, 66280, 50882, -82390, -153417, -158587, -198848, -131724, -84382, -4554, -75859, -133101, 17720, 182673, -7047, -50878, -90487, -168442, -139116, -290279, -245427, -53974, -75425, 155007, 245748, 248206, 225631, 172067, 124841, 13110, -51232, -43177, -8628, -116745, -374978, -366532, 21888, 198105, 136044, 213746, 262241, 195174, 135450, 36465, 79379]
11189G9379Q1880n7532n287J2307r1373k0726Q1854J84813K9706j80962J9240
11178A33299J43976J04690j08170k62319L4982j73161j71784M5025J5641J27460
11168a10361J32134Q067j28045O9780K23300j25288L3784Q3006j15058k33532
11158a62213l5690K4994p737L9866K22143l0911P5327K6404k87110n5043M9323
11147a40647l5636J37138l993L3417J9063j12213j17648p2861K15901N2881p6143
11136a00741m4796l8869P1440n5983j54843J60910J15736R1901j55329q6170r227
11125b05971J962Q2855K58034n6517j67877K32347n7270k16186o0863Q511O3605
11114a17370L4994J27532k0568j9222l6508Q2282n0863k38631R124J10481j35662
$$ y = [79379, 161259, 103727, 98440, 110747, 19374, -1352, 80502, 265315, 295021, 114059, 133299, 277275, 381965, 273795, 11476, 46458, -126703, -298487, -253462, -237821, -110361, 21773, 29840, -98205, -28425, 194875, 69587, 103371, 186377, 71319, -162213, -197903, -172909, -180646, -140780, 81363, 50452, 125779, 152183, -134927, -189970, -140647, -176283, -39145, -43138, -9721, 9342, -102871, -220519, -293380, -77479, -24598, -100741, -145537, -184406, -112966, -168949, -323792, -162882, -47146, 44755, -110574, -196744, -205971, -204009, -121154, 136880, 80363, -87514, 144833, 87563, -128623, -189486, -180975, -117370, -82376, 45156, 24588, 5366, -31142, 51140, 277, -238354, -229230, -118749, -254411]
11103b54411N9587j1297M1876J9571k675Q7055J2483J21903j32142M8263R5529
11092H5742l4917q9435l3167k09098k12721J36475J640K78836j31967r2398j8311
11081c19321K24682m7150r0834j80652o918J72777J84886K25798l8130p8808j48443
11070a02113R8217Q138k47169q5535l823O1766J57633J42332J84743j088q5289
11059A27812q6334j35828q9269q0950J42340J06404M8966M6399J34375N9100o1585
11048B11430j74361j21621J25879J20447j34860J284Q9184P0424k2992M2082j0126
11037A96770o981m6153m9695k15791j53414J89655K13748o9791k22315J7913q202
11026a54256L9767J15854j2413j23599P3719K37399N7192l4954j09667j08238
$$ y = [-254411, -194824, -206121, -164245, -144674, -147349, -60294, -47811, 74092, -58050, -9787, 85742, 50825, -38610, -71777, -280875, -493596, -357121, -355481, -76645, -208612, -301010, -319321, -94639, -141789, -232623, -413275, -420193, -247416, -62530, 163268, 125138, 46330, -102113, -3896, 4242, -242927, -328462, -332285, -270519, -112886, 29446, 214189, 213101, 127812, 41478, -94350, -183619, -264569, -122229, -15825, 33141, 79540, 213915, 273015, 211430, 37069, -84552, 41327, 161774, 26914, 28198, 117382, 187806, 164814, 206896, 196770, 189789, 143636, 93941, -121850, -275264, -85609, 128139, 58348, -163967, -146054, -154256, -114489, 1365, -11048, -134647, -60928, 176471, 233663, 198709, 89042, -19196]
11016a9196j55425k62555K7028K08194K61547Q6068J0660q734j52315l5279J08402
11005F8395q894j40983J07323K8659k77385K5500Q6959k5611J29938Q0785J14106
10994A88792j78724p6321L3418r2104j55096Q4498M7795P119K9641J60479q3473
10983c3976j61497J10919N6868K2544p3331O7431J23566m8303R1603q0455r9968
10972b4599O5466p0407j91241J46630L03889Q115q0280n7800j29862o7791R6089
10961a791K7161p6955J5441j28548j74725J3817J44587m802l7783o6414J15094
10950a74918L2697K2936R9935J03041J41342J6393p756m2346j22896p9344k7277
10939c8193J62042N2499l4692j2060K2777K10020k38157k82627l3273J07723N4323
$$ y = [-19196, -174621, -437176, -410148, -201954, 59593, 145661, 156321, 147587, -4728, -40007, 68395, 59501, -81482, 25841, 54500, -222885, -197385, -110426, -136037, -6099, 74686, 188792, 10068, -66253, -32835, -124939, -280035, -195537, -147742, -140623, -110982, 49497, -33976, -195473, -84554, -27686, -5142, -78473, -11042, 112524, 64221, 155824, 75369, -24599, 40867, -29540, -220781, -74151, 229738, 237853, 157573, 99773, -30089, -97880, -1791, 25370, -51585, -36144, -164692, -339417, -325600, -181013, -185815, -223598, -290012, -174918, -142221, -119285, -19350, 83691, 225033, 241426, 233670, 191324, 68428, -10916, -38193, 123849, 176348, 141656, 129596, 152373, 362393, 124236, -158391, -191664, -83941, -29618]
10928b9618J11663n1875j39093J78843L22627O2897j94775l58623O0166J78406
10918A40618Q3168j54676l69761o7043K77171J74707l4755j79963n9746J02745
10908h7535O2365J5586O4650Q6238l5295j77029k9112O5040J81228n542j49530
10897h936o3270j8737J8792j15200J49418l23942P3359L42306J43606N055p5445
10886A27006n8900J41054m3649j50233K2582J09447q9523j91031m1621n9358R2461
10875a41765Q6694J25056J5456q1635l7958o7871Q4901L3455l5136r2929l1381
10864a43113j0264p147o2103K285Q3165o8233J52906L2276k4276l1984O1857L2959
10852A8328k0703j75798j80626M1274P7831J69113k0582J71403M5698L9962j22316
$$ y = [-29618, 82045, 30170, -108923, 69920, 392547, 455444, 260669, -97954, -37788, 140618, 223786, 69110, -300651, -367694, -90523, 84184, 49429, -130534, -190280, -87535, -25170, -9584, 55066, 141304, 106009, -71020, -100132, -35092, 146136, 140594, -8936, -72206, -90943, -72151, -187351, -37933, -361875, -288516, 53790, 197396, 202451, 127006, 68106, 209160, 165511, 15278, 37860, 147307, 57784, -133247, -174868, -234226, -141765, -55071, 69985, 85441, 3806, -34152, -102023, -17122, 16333, -18803, -111732, -143113, -153377, -160524, -222627, -220342, -137177, -205410, -52504, -20228, -44504, -76488, -14631, 18328, -2375, -178173, -358799, -317525, -239694, -70581, -91163, 80240, 125938, 165900, 43584]
10841D3584j97306p2373j1226O7153K31592N8200J29139k84873k53339N7480N1025
10830a80944j11279n96j04393m755M8596K26899J12547o9454k7908r1648j46956
10819c49891J19250J75185j42189R421L6945k02925l0414L04502L7856j14015
10809a56275k04006J03492J54550J16515o726p870r973m35l3842J04080p1100
10798a1590L3128l390O9957j49531m1888J90036M9833j11544j33434k6172j92638
10787c27233R8134J17847r3361l1704K23773J54916M1114j28141j40413K472q1020
10776a63616k3178K28703P0471r2718m9642J18130K05142J07795K6128k23381
10766B03834j50376j19596r8989p2058N8338J27157R9409m462q3817J8445M129
$$ y = [43584, -153722, -226095, -237321, -170168, 61424, 119624, 248763, -36110, -289449, -231969, -180944, -292223, -292819, -397212, -401967, -353371, -126472, -13925, -83379, -111287, -202935, -349891, -230641, -55456, -197645, -188224, -151279, -354204, -384618, -80116, -42260, -156275, -360281, -256789, -102239, 14276, 7550, -320, -10293, -10728, -44570, 59510, -11590, 21538, 18148, 88105, -61426, -103314, 86722, 136555, 25011, -108423, -134595, -327233, -229099, -111252, -204613, -236317, -12544, 142372, 183486, 55345, -85068, -82596, -163616, -186794, 41909, 112380, 19662, -29980, 88150, 293292, 401087, 427215, 203834, 53458, -66138, -165127, -237185, -178847, -51690, 47719, 43257, -40560, -22115, -17986]
10755a7986j59177j96472j07703R5698P2709j06992k0731J21824L73777J03233
10745A58180k50246k98944M2847N6835K47723K50084l1751J1457q5809J35226
10735B35602k54k3358j58603k5708k5629j30649j71789R4067J70431K2359P1226
10724E7695J52771j43588l76784L5677J87387J19865k71565o614l413l3541N9648
10713b22462M7013J57963K55874j30389k39395n3437K17895J20098J15542n8024
10703B10678j41896q1261j09699k00827j77406J11984K24078P9011K19205K7006
10693A60873k29123k00702k3239N4473J41083J83339l6651r0549J8335J87469
10683A65308J62581O7824k48982o3918j90800K10766J1596N6416M2708R1430O6964
$$ y = [-17986, -177163, -373635, -481338, -385640, -312931, -419923, -440654, -318830, 54947, 158180, -92066, -391010, -348163, -291328, -43605, 206479, 174728, 186185, 100376, 235602, 235348, 211990, 53387, 27679, 2050, -128599, -300388, -206321, -35890, -13531, 57695, 210466, 66878, -309906, -274229, -86842, 33023, -238542, -245156, -248569, -282110, -222462, -175449, -17486, 238388, 107999, -131396, -184833, 33062, 153160, 268702, 210678, 68782, -12479, -122178, -323005, -500411, -388427, -164349, -85338, 133867, 160873, -68250, -268952, -292191, -237718, -96635, 86704, 50053, -40496, -22161, 165308, 327889, 395713, 146731, 82813, -107987, 102779, 114375, 170791, 213499, 304929, 371893]
10672C71893k34763k47452j54368K7871K6331p2844Q138J09498K7347R251r0133
10661b19231l2113q7798O1146Q0093M2975R0615j13324o5640J22141K12443J06837
10650A98144J1574k5570p6886k02952j66975j28263J88838L57711K9191j40142
10640D4670j03386j12929j81427O4603J52830j1550O6967K3907l7552j37226K28518
10629b575K40395j62108r5422m7035j73537O2883m5050j34539J23445K41569K05027
10618B13053j77152j38601q2052J12919K73947J72411j79205j38876J4998o5933
10608E509k0858j70393l5153J21843M1606L1965J0872j12347o7399q4232J71364
10597a07223O2460o8599p3226J31549M1057K7752j50218j05642l4212P6150O3444
$$ y = [371893, 137130, -110322, -264690, -236819, -210488, -283332, -275194, -165696, -138349, -129098, -219231, -251344, -339142, -277996, -197903, -154928, -64313, -177637, -243277, -121136, 91307, 198144, 209718, 184148, 107262, -95690, -262665, -390928, -202090, 155621, 184812, 44670, -58716, -171645, -353072, -288469, -135639, -147189, -80222, -56315, -93867, -231093, -2575, 237820, 75712, -19710, -66745, -240282, -177399, -222449, -356988, -233543, 8026, 213053, 35901, -102700, -184752, -71833, 202114, 374525, 195320, 56444, 71442, 5509, -15349, -185742, -220895, -99052, -57446, -25481, -14609, -126956, -194355, -278587, -107223, -44763, -113362, -186588, -55039, -13982, 13770, -136448, -242090, -276302, -200152, -136708]
10586a36708p352L0549K57653K826j70776M9298l6833j3694j47341K9150j16393
10575b59621P3931J48490M4020P5641N3416J28661k45974q0689n7636K6460o1462
10564a54763M2518j4345o5301P1744L13742k663o5783N0342N8094J87517k83599
10553A37503q6448Q9090j55015k9117J55241n3054m277j3139r928O3598m2775
10542E1679o2527J64146j69203j12877J09651J5084O6569N5893q3577K74673J75861
10531D85372k26832j09684j87136j77542R038m3578j02352n2128J0202J08678
10521b85962J58344j63580k29323q1430L50596K13156m0709j47254L0711k78989
10511d74440j98165K51159N6221J35538N8708k34730N9J09367J95451J14379k57320
$$ y = [-136708, -144060, -113511, 144142, 146968, -23808, 25490, -11343, -25037, -172378, -143228, -259621, -185690, -37200, 6820, 82461, 135877, 264538, 18564, -62125, -119761, -93301, -154763, -112245, -126590, -191891, -120147, 193595, 190932, 125149, 175491, 233585, 421102, 137503, 51055, 140145, -14870, -43987, 111254, 58200, 53923, 40784, 30856, 94454, 51679, -10848, 153298, -15905, -128782, -19131, -4047, 62522, 118415, 34838, 309511, 485372, 258540, 148856, -38280, -215822, -206784, -250362, -352714, -404842, -394640, -285962, -127618, -291198, -520521, -601951, -251355, -38199, -78908, -226162, -195451, -474440, -672605, -421446, -365225, -229687, -170979, -405709, -405650, -296283, -100832, 13547, -243773]
10500b43773j51431O1983J42483j50036l62632m5219K19404J24968J11102K08976
10490h4175N4605O360N2240l9651n9909q7047l87865j0965J19170J42685K33629
10479f0923K3382m3110j19646j37076k36417Q1719L24033M4571j40986j50881
10469d15334r3554J12985J2435j10851J03055L1721o4336k5650L4897R0905J97767
10458a25960M1263n8061J9791R2475J5845J42295M0589K11475o9478j50362j45217
10447A4655L6285P8719p8689j02599k53869K28310P5225p3668j79594m4299K32888
10436f6636J26966M9006j22574J03518o6388n05l1137j72983q4496j13855j15936
10425d95020K06114K12834P6639P438j21271j62529J26583P0418L4299J94874
$$ y = [-243773, -395204, -333221, -190738, -340774, -703406, -748625, -529221, -404253, -293151, -84175, -29570, -23210, 29030, -10621, -70530, -157577, -545442, -556407, -437237, -294552, -60923, -37541, -80651, -200297, -337373, -573790, -492071, -168038, -123467, -264453, -415334, -508888, -395903, -383468, -494319, -391264, -359543, -423879, -449529, -414632, -323727, -125960, -84697, -142758, -122967, -30492, -14647, 127648, 168237, 379712, 310234, 159872, 14655, 50940, 129659, 50970, -51629, -305498, -77188, -1963, -75631, -255225, -299524, -66636, 60330, 109336, -13238, 90280, 23892, 23387, -7750, -180733, -265229, -379084, -495020, -288906, -76072, 567, 8005, -113266, -275795, -149212, -78794, -44495, 150379]
10415A50379n7053j05627l9749m3866m4082o3562p4631K75143o5639k51794M8530
10404b71951l8016O5884J15930J43855L0412J64445K0358k04394r6940R8219J38971
10393A66773j46861P3101J44325Q5879k17153k07140j45668K63508K94260J09134
10383D20158j91611k43319j80221k6015K4978k19M454Q8443M9130p0490j78862
10372c03574j42166N4056K53308J03138k52661m8889K53126J24201J16226R4317
10362B51082P1064n2752k42996m6495l1231K05283L432k00433j01686J185L0621
10351a12926Q7410K6901j63654N3044k8584j11068L7265J885R3480J69480m2209
10340A1024j65037k4367J9q2408J71628R2779K9128J12202j9173q7777j58786
$$ y = [150379, 93326, -12301, -52050, -95916, -139998, -203560, -278191, -3048, -68687, -320481, -271951, -309967, -244083, -128153, 15702, 46114, 210559, 230917, 26523, -70417, 27802, 166773, 19912, 93013, 237338, 323217, 106064, -101076, -246744, 16764, 311024, 420158, 228547, -14772, -194993, -221008, -196030, -196249, -191795, -103352, -54222, -124712, -303574, -445740, -391684, -138376, -35238, -287899, -336788, -83662, 40539, 156765, 251082, 322146, 269394, 26398, -20097, -51328, 153955, 157387, -43046, -144732, -143547, -112926, -25516, 1385, -162269, -109225, -137809, -248877, -211612, -209727, -116247, 53233, 11024, -154013, -178380, -178361, -260769, -89141, 3638, 32766, 144968, 125795, 38018, -120768]
10329a20768P6073j04300m654K72208J1781q604j01455q4636R4928K1291k6309
10318B5555j67255l21623m0291k286P3416J92264L09881J12822j7671j26371J56346
10307A94787j05237k11673r7459L0924k05412l0544J89735K62100J51184Q1519
10297B59924N5336N7563N2021j69001j97782l6249n7611J74692j17844k04680
10287a83631j88746J83535J44601M8010P4186K87294k20253l88762j61847Q1995
10277c23618J16514j04128J043r5995k38643N6773J19380J84437K5811j8861K93783
10266A6496n1671j66293K53365J38976j62751m5346l3984N2401j85466N1034J14502
10255a8737P6053q8703J35819j53956j07386J48950K42816N7041j49483j22221
$$ y = [-120768, -44695, -148995, -153649, 118559, 130340, 121736, 20281, -64355, 30573, 51864, 25555, -141700, -463323, -503614, -505900, -432484, -240220, 69661, 182483, 164812, 38441, 194787, 89550, -122123, -219582, -188658, -394070, -424614, -234879, 27221, 178405, 259924, 315260, 372823, 424844, 255843, 58061, 21812, -35799, 138893, 21049, -183631, -372377, -188842, -44241, 3769, 77955, 365249, 144996, -243766, -405613, -323618, -207104, -311232, -310189, -406184, -644827, -588054, -468674, -284237, -258426, -277287, 16496, -35175, -201468, 51897, 190873, 28122, -17224, -51208, 1193, -184273, -133239, -18737, 57316, -31387, 104432, -49524, -156910, -7960, 234856, 291897, 142414, 20193]
10245B0193J12023j04120j94415j13010J5485q7272J98636O8606J24288J20237
10235A60651O5618j54648j05230J71894R1123j37652j4371j17289o9364K0294
10225h8974k02044p0115j67062j17517P4010M1522Q6272J28347Q319K29981Q7586
10214A0325m4377p6394k1735r0276q5769O9863L15856j2586r643L3164j61038
10203g2610l8770J73958L067M1995J02542q6662r6102k47684p6469N0770Q5386
10192a60579l3831j84219L3351P42O2175M7582J00134J31277k23061P0603K08554
10181E2728J33614Q9080K6607M3439l3355j22977j44932m1144J05734o7820j17405
10170g6431P1098J18923j4320M8147q9829m9375J77406N3655q5940j72656q2006
$$ y = [20193, 132216, 28096, -166319, -279329, -263844, -351116, -152480, -83874, 40414, 160651, 226269, 71621, -33609, 138285, 229408, 91756, 77385, -39904, -109268, -88974, -291018, -361133, -528195, -645712, -571702, -530180, -443908, -315561, -307242, -77261, 10325, -34052, -110446, -132181, -222457, -308226, -238363, 77493, 64907, 55264, 88428, -72610, -111380, 62578, 65645, 107640, 210182, 123520, 27418, -220266, -296735, -245965, -160579, -194410, -378629, -345278, -344536, -282361, -234779, -134645, -3368, -226429, -155826, 52728, 186342, 275422, 302029, 345468, 312113, 189136, 44204, 3060, 108794, 40974, -76431, -5333, 113590, 99270, 147417, 57588, 8213, 185619, 239274, 153334, -19322, -101328]
10159a01328P1147M215O4743L3765M9251J2819M5034o679K76343N603k18704j08592
10147A27617L5557N2869r2250k45241p2942P2046j9821p5915L1183J27587L2248
10136b7062q8565J13666J14526j3903o8542J16714Q3218L5636J49377o591J0728
10125D19202k4737j20380J80584j96688k80441j30232L5416J41473J61247O1566
10115B47010r6967k58699n7274J45617k27326R9703k3709R6045J14374l7866o495
10104e587J58511q3683j04464n6443j71561P8456J17551j51704K2006J87315N640
10093c963N0541K34201Q6494j48094j31660k09958j14700K9405J60938m3288k21617
10082c11701O3329K34910J40521j22834j17185j75458r4854K08227m3716q4354
$$ y = [-101328, -30181, -25966, 38777, 72542, 121793, 134612, 179646, 172967, 449310, 454913, 236209, 127617, 163174, 216043, 123793, -121448, -194390, -122344, -142165, -218080, -186897, -59310, -27062, -115627, -1961, 112565, 98662, 30120, 146834, 230052, 265688, 415065, 408474, 419202, 394465, 274085, 454669, 257981, -22460, -152692, -117276, 24197, 185444, 247010, 150043, -108656, -165930, -20313, -247639, -147936, -171645, -75600, 38774, 908, -5587, 152924, 69241, -35223, -91666, -263227, -184771, -67220, -218924, -196918, -9603, -3963, 46578, 280779, 367273, 219179, 87519, -122439, -237139, -207734, -46796, -90084, -311701, -248372, -13462, 127059, 4225, -112960, -288418, -383272, -175045, -218761, -303115]
10072c03115j80890L0491J21967L10035r6293r1986j48944J10531L9696L9360
10062a69148m8953J71395R3786J1721J70556k131j21569j65772j81349k83036
10052e24500J49555J35762k281J18907n549r4389N9316K56792k9754j06797Q4648
10041D1710J22627p0542j91841k63541j5607J48001q5974O2673K20583N1212j19518
10030a00217k0578j7504p8746N7488K00197j32109j00239M1471K0271M1226P0650
10019a8090P9826j35667M242J24279N2650j33173n336J45504m3852k25198M0716
10008a14099m1319j55794k06924K2560K599J11141J6771P9513J78283Q2895j5701
9997d0075J74192k2521j96861q6322J75395M0354J13634j50327J740O8467k0750
$$ y = [-303115, -484005, -453514, -331547, -21512, -117805, -209791, -358735, -248204, -208508, -169148, -218101, -46706, 47080, 58801, 229357, 227226, 105657, -60115, -241464, -524500, -374945, -239183, -241464, -122557, -128106, -222495, -163179, 93613, 63859, -42938, 41710, 164337, 93795, -98046, -361587, -377194, -229193, -315167, -252494, -31911, 19301, -100217, -120795, -138299, -217045, -159557, 40640, -91469, -191708, -150237, -129966, -88740, -18090, 61736, -73931, -69689, 54590, 107240, -25933, -31269, 114235, 70383, -154815, -114099, -155418, -311212, -518136, -495576, -492977, -381836, -365065, -285552, -107269, -24374, -40075, 134117, 111596, -85265, -171587, 3808, 44162, 157796, 7469, 9209, 77676, 56926]
9986E6926q186q3640k04710Q8746J01236p9896l27344k86918K58400L04258K4839
9975a56289p4978O5577K48281J48400n8500K5500R2219j34820J19431J17258j04725
9964B87354j89167j39013L8676L60479p5254k31649j45564j7190J006Q0881n9221
9953h8662J38900J57082O287j37339j23870j27867k3660j59974l7511K80379J08226
9942h009O7844J22446K17440J55717k6632o0030r919j05860J10938J35282J49246
9931G48463J31653j9854j12310j36641p010k9197j56335k43890k52416N8800J03118
9920H4381k19534l3140q7740L5866L0545J4586J66290Q0324m562q6593J198Q8940
9908G0561q5979J18055j0124j101J85870J60361l6383J75758o1563k41816n0509
$$ y = [56926, 48740, -34900, -239610, -150864, -49628, -129524, -456868, -743786, -485386, -181128, -156289, -231267, -165690, 82591, 230991, 172491, 197991, 290210, 155390, 274821, 392079, 287354, 98187, -40826, -2150, 358329, 283075, 51426, -94138, -111328, -110322, -29441, -88662, 50238, 207320, 213607, 76268, -47602, -175469, -199129, -359103, -396614, -116235, -8009, 59835, 182281, 399721, 555438, 528806, 468776, 458857, 352997, 463935, 599217, 748463, 880116, 860262, 747952, 611311, 604301, 575104, 418769, 174879, -77537, -18737, 84381, -135153, -168293, -256033, -220167, -189622, -175036, -8746, 71578, 67016, -19577, -18379, 70561, -15418, 102637, 92513, 91412, 277282, 437643, 401260, 577018, 515455, 273639, 223130]
9897B23130R298m5882o8943j25941n8336P9184K92854M8901m2046j40000j64898
9886G321k51679K3681J51130J85947J12479j15191J56511J46703K615R8272l3033
9875D84756o5837j08914r7547o6269j00058J29924j1983P8691K83726n984l51340
9864A69165j92973o5350J08402J55919J70608m0071j35708Q4844l8301j45583
9854G0952q3060J2879Q1515P2775J23712J04861j1815l2377j20891j82203O361
9843D2709M8116r0850j04769n2116L1102j38427J50976K5385k20620n124J3304
9832c00314P8353L24587L2227l64864j59609K26748l6026j89394L24993M19116
9822C55817j25169j62703o7569M8341K1098m8693m1883K45316K06048K5867o9870
$$ y = [223130, 232428, 186546, 117603, -8338, -66674, 12510, 305364, 354265, 312219, 172219, 7321, -244358, -220677, -69547, 116400, 228879, 113688, 270199, 416902, 419517, 517789, 484756, 418919, 310005, 212458, 146189, 46131, 176055, 164072, 242763, 526489, 520505, 169165, -23808, -89158, 19244, 175163, 345771, 305700, 169992, 254836, 216535, 70952, -12108, 771, 82286, 155061, 278773, 383634, 371819, 339442, 218551, 36348, 42709, 90825, -25, -104794, -156910, -125808, -264235, -113259, -87874, -308494, -313618, -300314, -221961, 102626, 134853, -230011, -389620, -162872, -198898, -388292, -63299, 355817, 230648, 67945, 376, 48717, 69815, 21122, -20761, 224555, 430603, 456470, 386600]
9811C86600j49201L5720J135l53915q9064Q5606l5110p6566N5530K03513M7020
9800A11268k2434l8350l6514k24488k9982j8538j57700L9098N1836J23703O5258
9789a36843k6954p2456L34687J12215l23169j89824k4028J94053J93209K402r5971
9778c2679p9397o0373P1162J49069K88133K2055r9544k18514j02970K94463K33736
9767D65141k01224k25708J7739j86401p3927N3258J89360m2922j02477K1451J08487
9756B2777J59050j86836j95807n720K11925J55196j95581J57435L22330L7096
9746D81865k10694k00245j91554j10675R2347K60422J81378j08936m259L898j49149
9735D4398Q1395J9159j23778k14334L9675J88280l1085M3170j10339j68j8784
$$ y = [386600, 237399, 273119, 274254, -79661, -168725, -83119, -118229, -194795, -139265, 64248, 111268, 88834, 50484, 13970, -210518, -240500, -259038, -416738, -377640, -325804, -202101, -136843, -163797, -236253, 98434, 210649, -112520, -302344, -326372, -132319, 60890, 63292, -32679, -112076, -172449, -101287, 47782, 335915, 357970, 258426, 39912, -63058, 231405, 465141, 263917, 38209, 55948, -130453, -204380, -151122, 38238, -4684, -107161, -85710, 22777, 181827, -5009, -200816, -206536, 5389, 160585, -34996, 122439, 444769, 481865, 271171, 70926, -120628, -231303, -138956, 121466, 302844, 193908, 189649, 193547, 44398, 125793, 144952, 21174, -193160, -153485, 34795, 3710, 46880, -63459, -63627, -82411]
9724h2411J22048P7850j08412j33627O3992k6263J59896J48315j75592j93020
9714a47224l00075j69410J52850K24707J12550J36563Q3945j69371k33935o2485
9704c71885J37983J66894J31590K60798j35621L6493J85708j59094k07411l7946
9694G509J06447j07036K7911K14457k2222l3170p3012k28376l5525l0809K5629
9683a48197m484L4670J09721J50363J771k9280j37144J6118r22l2932l3977o8246
9671a42539o9324K32846J32032k69919k7388k5995J20627J23205J60661j73956
9661F0250n3704N8075J0565j10l5879J42906K20843n432k87412q6549p4293P0237
9649A9497J95853K3366M1755j00567J58294K33526O3823m0663j52251N3823Q4586
$$ y = [-82411, 39637, 117487, 9075, -124552, -60560, -86823, 73073, 221388, 45796, -147224, -447299, -616709, -463859, -239152, -126602, 9961, 93906, -75465, -309400, -371885, -233902, -67008, 64582, 325380, 189759, 226252, 411960, 252866, 45455, 7509, 113956, 6920, 34831, 249288, 227066, 193896, 120884, -107492, -143017, -173826, -148197, -152681, -118011, -8290, 142073, 143844, 114564, -22580, -6462, -7384, -40316, -74293, -142539, -211863, 20983, 153015, -116904, -144292, -170287, -49660, 73545, 234206, 60250, 6546, 64621, 75186, 75076, 39197, 182103, 402946, 397514, 110102, 23553, -50740, 19497, 215350, 238716, 280471, 179904, 338198, 571724, 635547, 594884, 442633, 496456, 581042]
9638E81042J41709j00938q7266P6657K07059J97546O7481m8604l6070k9231m145
9627I65240L5470K2216M3610P0690J13413j0543P4653J9983q7697L2932k8223
9616A251744J72400J8608J35832j25205p7265L1629K14418R0406M0418M0880L6776
9605A830641j09725j33535K11962J43500Q122R4288K35639M4125r6907j4699n9062
9594B154349P2990M4061J27146L10720L51979J23536J02124K0523J42069J72222
9584C621719K96051j78802K8967K23226M22923L85924J14760M6867J60904M95049
9574E617588L58628L98454L00153J28548M31535K49053L64591L24490N14728L86120
9564I073888O08794N72531N34939O88402Q73506R73750N77865N36166Q64597Q08102
$$ y = [581042, 722751, 621813, 534547, 611204, 818263, 1015809, 1083290, 1034686, 998616, 969385, 965240, 1000710, 1022926, 1066536, 1137226, 1250639, 1240096, 1314749, 1334732, 1247035, 1279967, 1251744, 1424144, 1442752, 1578584, 1453379, 1376114, 1407743, 1622161, 1712567, 1752985, 1793865, 1830641, 1720916, 1587381, 1799343, 1942843, 1950965, 2045253, 2280892, 2325017, 2228110, 2213411, 2154349, 2227339, 2271400, 2398546, 2709266, 3061245, 3184781, 3286905, 3307428, 3449497, 3621719, 3917770, 3738968, 3767935, 3991161, 4414084, 4800008, 4914768, 4961635, 5122539, 5617588, 5976216, 6374670, 6674823, 6803371, 7234906, 7483959, 7848550, 8173040, 8687768, 9073888, 9682682, 10255213, 10790152, 11478554, 12352060, 13325810, 13903675, 14439841, 15304438, 16112540]
9554A6112540P35577Q79792J120388J347485J115810R91397J156317J343955J281561
9545B6084822J221491J457567J488663J630112J888357K161177K011455J857865
9537C9801509K187818K182912K311833K542733K701271K661092K857865L190221
9529F0437254L221289L391429L945960M132164M116472M232759M263651M665505
9521I2406483M836611M795982M881462M848748M673457M694367M494558M037608
9513A29669276L349955K799420K225466J435634Q36662J98724o69355j110204
9505A38735578j897239k523489l012580l238275l665234l838058l904487l822007
9497A12834209m118164m178413m240755l866663l540723l571862l392562l413655
$$ y = [16112540, 16848117, 17727909, 18848297, 20195782, 21311592, 22302989, 23459306, 24803261, 26084822, 27306313, 28763880, 30252543, 31882655, 33771012, 35932189, 37943644, 39801509, 41989327, 44172239, 46484072, 49026805, 51728076, 54389168, 57247033, 60437254, 63658543, 67049972, 70995932, 75128096, 79244568, 83477327, 87740978, 92406483, 97243094, 102039076, 106920538, 111769286, 116442743, 121137110, 125631668, 129669276, 133019231, 135818651, 138044117, 139479751, 140316413, 140515137, 139845782, 138735578, 136838339, 134314850, 131302270, 128063995, 124398761, 120560703, 116656216, 112834209, 108716045, 104537632, 100296877, 96430214, 92889491, 89317629, 85925067, 82511412]
9489H2511412l445173l030655k912340k628988k719348k578211k643383k490086
9481F0063228k271731k273487k072846k231895k068882j617022j746940j692892
9473D4087533j613997j563277j484623j460847j114927j175362j189259j385142
9465C3100099j495979j317875j083006j243824q99206r53592q16729o65692j061200
9456B3562996q81135p57580q18164q59019p42707n70813m09719o67355p33867
9447A7122637p30086p36496n24620k82370l05526o04835o32171k69265r5388m02278
9437A2539602l09418k04648m79840o10103o40682l04778l88348k55223l03978
9428I042584k35126j59537m2206l64553l87726p1277m6959k65127k93802j03538
$$ y = [82511412, 79066239, 76035584, 73123244, 70494256, 67774908, 65196697, 62553314, 60063228, 57791497, 55518010, 53445164, 51213269, 49144387, 47527365, 45780425, 44087533, 42473536, 40910259, 39425636, 37964789, 36849862, 35674500, 34485241, 33100099, 31604120, 30286245, 29203239, 27959415, 27060209, 26106617, 25289888, 24624196, 23562996, 22681861, 21924281, 21106117, 20247098, 19504391, 18933578, 18523859, 17856504, 17122637, 16392551, 15656055, 15131435, 14849065, 14543539, 13938704, 13306533, 13037268, 12941880, 12539602, 12230184, 12025536, 11545696, 10935593, 10294911, 9990133, 9601785, 9346562, 9042584, 8807458, 8647921, 8605715, 8241162, 7853436, 7782159, 7735200, 7470073, 7176271, 7072733]
9418G072733L903m02499l61758r9850m09484k80341j52783K62931j39922l83065
9408E109865j14853j20499n6278J37404j1416j43534k07663k63825k49263j38047
9398C941891R1336j06081j6893j59797j28431j45184j61593o1056n8090k30843
9388B965259k53522L2428K28434J67826J20722m8508j36460j125J11503k14244
9378B972313r5767j62086k28726j71502m2213O2923p4788j30956O7885j78039
9368B019044j55187K4633N1220K9501J19335q0107J74287K40903j42363j39824
9358B141442N0552J04967j6937j71370j42691M2377j93693O5709N2073j51083
9348A781346l22316O4477J08010m7254P9221P8394q8915r7425n0919j22j14511
$$ y = [7072733, 7076636, 6674137, 6312379, 6212529, 5803045, 5522704, 5369921, 5632852, 5492930, 5109865, 4995012, 4874513, 4818235, 4955639, 4944223, 4800689, 4593026, 4329201, 4079938, 3941891, 4033227, 3927146, 3910253, 3750456, 3622025, 3476841, 3315248, 3254192, 3196102, 2965259, 2711737, 2744165, 2972599, 3140425, 3261147, 3212639, 3076179, 3075054, 3186557, 2972313, 2876546, 2714460, 2485734, 2314232, 2272019, 2334942, 2260154, 2129198, 2197083, 2019044, 1863857, 1888490, 1939710, 1969211, 2088546, 2008439, 2182726, 2423629, 2281266, 2141442, 2191994, 2296961, 2280024, 2108654, 1965963, 2008340, 1814647, 1880356, 1932429, 1781346, 1459030, 1523507, 1631517, 1584263, 1663484, 1741878, 1652963, 1555538, 1504619, 1504497, 1389986]
9337A389986r9574R2753J20131N2120J16767N7285K9035j30188j49169j20249
9327A358897K32953L3520m2504P6794l32184k59871K7504O2479j07202r7672J1556
9316I64270J35594m2696o9502J1779j10741p100J3615O1930R7236P2440J33732
9305A260557j81202Q0359J51108R596K15266p842n9449q7914q5016L9579n9090
9294A275952n7589J01831l9460p9980P7461K07989L479n5787j76711j96196k61378
9283G99611K65969J32467J16723k04158p7226M5462J11443K26956Q815Q4850q1041
9272A429871j68569j88595O7564K08790J5629k44360j49853r6997J75597J09365
9262A158442Q0637j77918k32871r0873l1893p2041j31782J37486K88616N2745
$$ y = [1389986, 1290412, 1383165, 1503296, 1555416, 1672183, 1729468, 1758503, 1628315, 1479146, 1358897, 1591850, 1625370, 1582866, 1659660, 1327476, 1067605, 1095109, 1157588, 1050386, 952714, 964270, 1099864, 1057168, 987666, 999445, 888704, 881604, 895219, 957149, 1054385, 1126825, 1260557, 1079355, 1159714, 1310822, 1320418, 1535684, 1527842, 1468393, 1380479, 1295463, 1335042, 1275952, 1218363, 1320194, 1280734, 1200754, 1278215, 1486204, 1489683, 1433896, 1257185, 1060989, 799611, 1065580, 1198047, 1314770, 1110612, 1033386, 1078848, 1190291, 1417247, 1426062, 1510912, 1429871, 1261302, 1072707, 1140271, 1349061, 1364690, 1120330, 970477, 873480, 1049077, 1158442, 1239079, 1061161, 828290, 737417, 705524, 633483, 501701, 639187, 927803, 980548]
9252I80548R4634J42682p8866o4425K2304J32534k9217M2207O5196m9751O5465
9241A323311k35727k45828L8898K05720n55J27251l6449L7395N5151j04633k51589
9230I12945j10169r5328N3517P1255N3376K61131J61873J08812n5273r9090L3254
9219A296303k69606k41134K9536K54099K00734m0020L0003J77084M4939k6834
9209A455104l43962j12500L7133K9123M4581J15444L78226J49577p9612k08092
9199A465022j98683L0908K767J20607n2878Q316K66015J69518J23371m5174j63180
9188A726609K3280j534k0223m6522j28955j3577k3277J89431K44463K46961j5849
9177B180807j39403P4289m1268L9028j00316j24162Q2245J92593K01301j05753
$$ y = [980548, 1075182, 1217864, 1138998, 1074573, 1096877, 1229411, 1200194, 1242401, 1307597, 1257846, 1323311, 1087584, 841756, 880654, 1086374, 1085819, 1213070, 1176621, 1214016, 1269167, 1164534, 912945, 802776, 707448, 760965, 832220, 885596, 1146727, 1308600, 1417412, 1362139, 1263049, 1296303, 1026697, 785563, 815099, 1069198, 1269932, 1229912, 1259915, 1436999, 1481938, 1455104, 1111142, 998642, 1035775, 1064898, 1109479, 1224923, 1603149, 1752726, 1673114, 1465022, 1266339, 1297247, 1300014, 1420621, 1367743, 1376059, 1642074, 1811592, 1934963, 1889789, 1726609, 1749889, 1748355, 1728132, 1681610, 1552655, 1539078, 1515801, 1705232, 1949695, 2196656, 2180807, 2041404, 2115693, 2074425, 2113453, 2013137, 1888975, 1971220, 2163813, 2365114, 2259361]
9167B259361M6320K56712J96908J91998j04670r7242L75307J95774m8970j3767
9157C257731O168J05776K13972K86099P7335J0220Q9257L77268P6075j1451K37934
9146D726384L99891J59272L71154L11137M48135J96320K75807K92850K54134L92067
9136G827151M59878P93996N81515N33974L58925L90024M77076N43908N80714M92896
9126A3040057O55052N02499M77183N22802K40198K82544L16270K23701K05449
9117A6465755j27075l8842m7307k03452l84823o22131m54296j94407m21456m92153
9107A3479813l47006n03829p35523n28365n28118p13494m52586l00481k96036
9098I074375j52040k69931m16547m01960l30368k22759m57657l32034k49939l35233
$$ y = [2259361, 2305681, 2562393, 2759301, 2951299, 2846629, 2749387, 3124694, 3320468, 3271498, 3257731, 3263899, 3369675, 3583647, 3869746, 3947081, 3957301, 4046558, 4423826, 4499901, 4488450, 4726384, 5126275, 5285547, 5656701, 5967838, 6415973, 6612293, 6888100, 7180950, 7435084, 7827151, 8287029, 9081025, 9662540, 10196514, 10555439, 10945463, 11422539, 11966447, 12547161, 13040057, 13695109, 14197608, 14674791, 15197593, 15437791, 15720335, 16036605, 16260306, 16465755, 16338680, 16299838, 16252531, 16049079, 15664256, 15042125, 14587829, 14393422, 13971966, 13479813, 13132807, 12628978, 11893455, 11365090, 10836972, 10123478, 9670892, 9370411, 9074375, 8922335, 8652404, 8235857, 7833897, 7503529, 7280770, 6823113, 6491079, 6241140, 5905907]
$$ [...]
##END NTUPLES=NMR SPECTRUM
##END=
