##TITLE=Analysis number 320310
Compound Code cc 47746
Book Reference 451/163
Project Code adrs
Chemist Name evam
##JCAMPDX= 6.0         $$ Bruker NMR JCAMP-DX V2.0
##DATA TYPE= NMR SPECTRUM
##DATA CLASS= NTUPLES
##ORIGIN= Bruker BioSpin GmbH
##OWNER= nmr
$$ XWIN-NMR		Version 3.5
$$ Wed Jun 21 11:37:50 2006 GMT Daylight Time (UT+1h)  MAYBRIDGE\nmr@NMR_250MHZ
##.OBSERVE FREQUENCY= 250.131544655141
##.OBSERVE NUCLEUS= ^1H
##.ACQUISITION MODE= SIMULTANEOUS (DQD)
##.ACQUISITION SCHEME= undefined
##.AVERAGES= 16
##.DIGITISER RES= 18
##SPECTROMETER/DATA SYSTEM= dpx250
##.PULSE SEQUENCE= zg30
##.SOLVENT NAME= CDCl3
##.SHIFT REFERENCE= (INTERNAL, CDCl3, 0, 16.522)
##AUDIT TRAIL= $$ (NUMBER, WHEN, WHO, WHERE, WHAT)
$$ ##TITLE= Audit trail, XWIN-NMR		Version 3.5
$$ ##JCAMPDX= 5.01
$$ ##ORIGIN= Bruker BioSpin GmbH
$$ ##OWNER= nmr
$$ C:\u/data/dgb/nmr/ADRS/1180/pdata/1/auditp.txt
$$ ##AUDIT TRAIL=  $$ (NUMBER, WHEN, WHO, WHERE, WHAT)
(   1,<2006-06-21 11:37:20.44 +100>,<MAYBRIDGE\nmr>,<NMR_250MHZ>,
      <created by zg, POWCHK disabled, PULCHK disabled
       configuration hash MD5:
       E2 DF 36 D8 04 B2 41 60 5A D7 A3 38 5A 4B D0 FE
       data hash MD5: 64K
       41 A1 EA 4A 99 69 0F 32 1A 37 43 C5 E5 2A 1B 45>)
(   2,<2006-06-21 11:37:39.46 +100>,<MAYBRIDGE\nmr>,<NMR_250MHZ>,
      <Start of raw data processing
       ef LB = 0.3 FT_mod = 6 PKNL = 1 SI = 32K 
       data hash MD5: 32K
       B8 4C 40 80 BB 6B A4 E4 66 B7 23 BE 9F 08 CF 0B>)
(   3,<2006-06-21 11:37:41.00 +100>,<MAYBRIDGE\nmr>,<NMR_250MHZ>,
      <apk 
       data hash MD5: 32K
       96 47 01 F1 42 8F 20 B1 11 E8 ED D7 59 51 29 2E>)
(   4,<2006-06-21 11:37:41.88 +100>,<MAYBRIDGE\nmr>,<NMR_250MHZ>,
      <abs ABSG = 5 
       data hash MD5: 32K
       05 74 97 C6 FC 20 A4 E6 16 29 E0 F5 07 69 85 40>)
$$ ##END=
$$ 
$$ hash MD5
$$ F1 A2 5D B6 97 01 7E A9 29 5E BC E8 83 75 1F F8
##$RELAX= 
##$RELAX= 
##$RELAX= 
##$RELAX= 
##$RELAX= 
##$RELAX= 
##$RELAX= 
$$ Bruker specific parameters
$$ --------------------------
##$DU= <C:\u>
##$EXPNO= 1180
##$NAME= <ADRS>
##$PROCNO= 1
##$TYPE= <nmr>
##$USER= <dgb>
##$AMP= (0..31)
100 100 100 100 100 100 100 100 100 100 100 100 100 100 100 100 100 100 
100 100 100 100 100 100 100 100 100 100 100 100 100 100 
##$AQSEQ= 0
##$AQ_mod= 3
##$AUNM= <au_zg>
##$AUTOPOS= <23 >
##$BF1= 250.13
##$BF2= 250.13
##$BF3= 250.13
##$BF4= 250.13
##$BF5= 500.13
##$BF6= 500.13
##$BF7= 500.13
##$BF8= 500.13
##$BYTORDA= 1
##$CFDGTYP= 0
##$CFRGTYP= 5
##$CHEMSTR= <none>
##$CNST= (0..31)
1 1 145 1 1 1 1 1 1 1 1 1 1 1 1 1 1 1 1 1 1 1 1 1 1 1 1 1 1 1 1 1 
##$CPDPRG= <>
##$CPDPRG1= <>
##$CPDPRG2= <>
##$CPDPRG3= <>
##$CPDPRG4= <mlev>
##$CPDPRG5= <mlev>
##$CPDPRG6= <mlev>
##$CPDPRG7= <mlev>
##$CPDPRG8= <mlev>
##$CPDPRGB= <>
##$CPDPRGT= <>
##$D= (0..31)
0 1 0 0 0 0 0 0 0 0.06 0 0 0 0 0 0 0.0002 0 0 0 0 0 0 0 0 0 0 0 0 0 0 
0 
##$DATE= 1150886236
##$DBL= (0..7)
120 120 120 120 120 120 120 120 
##$DBP= (0..7)
150 150 150 150 150 150 150 150 
##$DBP07= 0
##$DBPNAM0= <>
##$DBPNAM1= <>
$$ [...]
##$SUBNAM7= <"">
##$SUBNAM8= <"">
##$SUBNAM9= <"">
##$SW= 20.6930455092707
##$SWIBOX= (0..15)
0 0 3 0 0 0 0 0 0 0 0 0 0 0 0 0 
##$SW_h= 5175.983436853
##$TD= 65536
##$TD0= 1
##$TE= 294.16
##$TE2= 300
##$TE3= 300
##$TEG= 300
##$TL= (0..7)
0 120 120 120 120 120 120 120 
##$TP= (0..7)
150 150 150 150 150 150 150 150 
##$TP07= 0
##$TPNAME0= <>
##$TPNAME1= <>
##$TPNAME2= <>
##$TPNAME3= <>
##$TPNAME4= <>
##$TPNAME5= <>
##$TPNAME6= <>
##$TPNAME7= <>
##$TPOAL= (0..7)
0.5 0.5 0.5 0.5 0.5 0.5 0.5 0.5 
##$TPOFFS= (0..7)
0 0 0 0 0 0 0 0 
##$TUNHIN= 0
##$TUNHOUT= 0
##$TUNXOUT= 0
##$USERA1= <user>
##$USERA2= <user>
##$USERA3= <user>
##$USERA4= <user>
##$USERA5= <user>
##$V9= 5
##$VALIST= <valist>
##$VCLIST= <CCCCCCCCCCCCCCC>
##$VD= 0
##$VDLIST= <DDDDDDDDDDDDDDD>
##$VPLIST= <PPPPPPPPPPPPPPP>
##$VTLIST= <TTTTTTTTTTTTTTT>
##$WBST= 1024
##$WBSW= 4
##$XGAIN= (0..3)
0 0 0 0 
##$XL= 0
##$YL= 0
##$YMAX_a= 390709
##$YMIN_a= -497963
##$ZGOPTNS= <>
##$ZL1= 120
##$ZL2= 120
##$ZL3= 120
##$ZL4= 120
##$ABSF1= 16.522
##$ABSF2= -4.171173
##$ABSG= 5
##$ABSL= 3
##$ALPHA= 0
##$AQORDER= 0
##$ASSFAC= 0
##$ASSFACI= 0
##$ASSFACX= 0
##$ASSWID= 0
##$AUNMP= <proc_1d>
##$AZFE= 0.1
##$AZFW= 0.1
##$BCFW= 0
##$BC_mod= 0
##$BYTORDP= 0
##$COROFFS= 0
##$CY= 12.5
##$DATMOD= 1
##$DC= 0
##$DFILT= <>
##$DTYPP= 0
##$F1P= 14.0000005364418
##$F2P= -0.99999901652339
##$FCOR= 0.5
##$FTSIZE= 32768
##$FT_mod= 6
##$GAMMA= 0
##$GB= 0
##$INTBC= 1
##$INTSCL= 1
##$ISEN= 128
##$LB= 0.3
##$LEV0= 0
##$LPBIN= 0
##$MAXI= 10000
##$MC2= 0
##$MEAN= 0
##$ME_mod= 0
##$MI= 0
##$NCOEF= 0
##$NC_proc= -3
##$NLEV= 6
##$NOISF1= 0
##$NOISF2= 0
##$NSP= 0
##$NTH_PI= 0
##$NZP= 0
##$OFFSET= 16.522
##$PC= 1
##$PHC0= 172.8958
##$PHC1= 6.765725
##$PH_mod= 1
##$PKNL= yes
##$PPARMOD= 0
##$PSCAL= 4
##$PSIGN= 0
##$REVERSE= no
##$SF= 250.13
##$SI= 32768
##$SIGF1= 0
##$SIGF2= 0
##$SINO= 400
##$SIOLD= 32768
##$SREGLST= <1H.CDCl3>
##$SSB= 0
##$STSI= 32768
##$STSR= 0
##$SW_p= 5175.98343685301
##$SYMM= 0
##$S_DEV= 0
##$TDeff= 65536
##$TDoff= 0
##$TI= <Analysis number 999999
Compound Code 99
Book Reference 9
Project Code 9>
##$TILT= no
##$TM1= 0
##$TM2= 0
##$TOPLEV= 0
##$USERP1= <user>
##$USERP2= <user>
##$USERP3= <user>
##$USERP4= <user>
##$USERP5= <user>
##$WDW= 1
##$XDIM= 32768
##$YMAX_p= 373597970
##$YMIN_p= -52165
$$ End of Bruker specific parameters
$$ ---------------------------------
##NTUPLES= NMR SPECTRUM
##VAR_NAME=  FREQUENCY,     SPECTRUM/REAL,   SPECTRUM/IMAG
##SYMBOL=    X,             R,               I
##VAR_TYPE=  INDEPENDENT,   DEPENDENT,       DEPENDENT
##VAR_FORM=  AFFN,          ASDF,            ASDF
##VAR_DIM=   32768,         32768,           32768
##UNITS=     HZ,            ARBITRARY UNITS, ARBITRARY UNITS
##FACTOR=    0.157963299565203, 1,           1
##FIRST=     4132.6476996994, 0,             0
##LAST=      -1043.33573715361, 0,           0
##MIN=       -1043.33573715361, -52165,      0
##MAX=       4132.6476996994, 373597970,     0
$$ Real data points
##PAGE= N=1
##DATA TABLE= (X++(R..R)), XYDATA
$$ [...]
21156 -26615 -27548 -13837 -17717 -43856 -50624 -39512 -20611 -14440 -21496 -26415 -32760 -26021 -18061 -24133
21142 -24133 -24253 -12532 -10482 -14423 10942 6800 -1396 13772 19554 21637 18561 24410 16963 3931
21128 3931 -10017 -3845 871 -2783 -1677 -300 -6188 -5764 2347 10089 -8552 -4817 -16792 -16829 -17815
21113 -17815 -16726 -23655 -34403 -22572 -9652 -7653 -1336 -2726 302 9823 8934 14022 16694 8236
21099 8236 -12807 -31704 -25007 -19444 -28660 -30725 -21436 -3152 -5475 -7211 -9986 -12432 -19378 -10100
21085 -10100 -577 -9007 -3549 -7456 -5834 4152 4716 9188 2529 10055 12256 9306 7986 394 -5396
21070 -5396 -6569 -11811 -11052 -1560 5493 -13406 -27387 -12813 -4532 -6867 -21504 -20196 -10958 -5099
21056 -5099 -7311 4727 2294 -4539 386 26340 28757 11315 8825 -1463 -6405 -6252 -5090 14879
21042 14879 35066 34650 38508 27983 9760 2743 -3161 5375 -7388 -8165 -839 -7505 -8056 -2180
21028 -2180 -477 -12531 -12779 -8309 -8374 -14884 -12747 -16543 -9953 -12778 -16298 -4391 282 -212 5756
21013 5756 -488 -4542 -17975 -32952 -25564 -21048 -21964 -19054 -13016 -15657 -15028 -15416 -18692 -23513 -10983
20998 -10983 7585 14618 1041 -5169 -1701 -7502 -11625 -5057 1035 -10418 -7336 -2224 -9647 -15940
20984 -15940 -7158 -5726 -23923 -31004 -20709 -6413 -4584 10350 10537 3697 5297 -3196 -11878 -10349
20970 -10349 -7369 7952 11478 6474 15004 16850 8446 3327 -5440 -8892 -10984 -13455 -172 15917
20956 15917 2580 -2388 4165 15880 4324 -8717 -6331 1220 -1399 -5100 -6854 -24857 -21553
20943 -21553 -18418 -22919 -23971 -13207 8236 27092 18014 5891 10757 14799 13245 2500 8315
20930 8315 11212 1450 -757 -10976 -15947 -20084 -32677 -31891 -22544 -7551 -11007 -4261 5885 14474
20916 14474 10576 5471 -7920 -16912 -25539 -22978 -6430 2479 1804 4383 7049 12806 6044 -5976
20902 -5976 -8817 5424 3820 -10815 -18586 -26063 -24596 -20122 -16352 -15110 -31470 -31107 -1746 -2167
20888 -2167 -12151 -9168 6184 5488 -9556 -3505 -13139 -13756 -9660 -10229 -10346 -17269 -8969 6190 3205
20873 3205 8788 12842 14491 -4855 1765 341 -3430 -12195 -7598 -11707 -13190 -13747 -10055 -6244 17075
20858 17075 26041 14900 -651 13561 15349 16227 18821 18597 14050 5493 2016 -2552 -7641 609
20844 609 -9703 -11170 4520 3205 5804 10679 2353 993 -5919 1059 2951 -358 12289 11744
20830 11744 9088 12881 13446 4727 724 13506 14972 14575 9664 -276 -2352 -5486 -5488 -7199 -8826
20815 -8826 -2740 -8040 -20830 -23233 -9728 12812 14872 11807 12900 3910 -3675 594 2697 8532
20801 8532 1194 -8092 -5917 -24569 -34905 -21351 2245 3361 -7000 -6459 -1331 8650 23829
20788 23829 24434 13449 -3443 -12998 -11927 4717 11978 2737 -9033 -26880 -25400 -14949 -5805
20775 -5805 2581 1759 1420 -24735 -30654 -15592 -12245 -21496 -16252 -7872 -4214 -9470 -6526 -6475 -1670
20760 -1670 -6412 -4268 -4471 -20400 -22792 -27515 -26000 -25988 -16345 -12718 -5973 3456 -7341 -12263 -8219
20745 -8219 -15183 -14085 -13439 -18742 -30085 -28968 -17817 -11720 -13683 -22512 -18087 -6239 2957 -2846
20731 -2846 -12169 -15101 -11700 -14955 -202 15995 19085 16079 5872 3993 6944 10917 19678 3124
20717 3124 -10969 -10811 -13927 -18052 -18108 -15565 -12846 -4885 -16046 -10580 3313 2626 4781 -1141 -2321
20702 -2321 2169 14524 11639 -6002 -15814 -7791 6378 13016 17929 20742 16628 3814 -5698 -9862
20688 -9862 -8182 -12365 -777 7055 8836 16829 14031 8807 11691 568 -7945 -8067 -354 8763
20674 8763 26966 26910 24067 13986 4528 13609 26496 17781 21898 19495 3922 -869 5277 2736
20660 2736 -14949 -18884 -8749 -6764 -14276 -5406 10927 1541 7018 17442 12349 4223 4613 11573
20646 11573 15945 20311 16169 17412 23819 28731 21040 13725 14905 3613 -3597 -4447 2024 -13660
20632 -13660 -23622 -22669 -12528 -1064 -8114 -9652 11761 17571 -9840 -26766 -29235 -37309 -36177
20619 -36177 -25870 -25888 -15700 -29205 -39334 -24174 -10107 -156 6437 11883 11703 5711 -8800
20606 -8800 -15022 -24406 -20934 -23165 -30862 -4489 -8049 -22250 -17417 -920 -12187 -34517 -41101
20593 -41101 -34118 -27484 -18178 -15347 -15776 -10025 -3954 742 -1864 -1221 6485 4768 -10484 -5721 10311
20578 10311 17278 16138 17656 17704 11567 9517 6 -1478 -2009 -1901 8096 21017 19572 -331 -7985
20563 -7985 -10586 -8910 -7548 -4084 2795 -5991 -9588 -19075 -24142 -26259 -27408 -14935 -11049 -19732
20549 -19732 -22162 -16880 -8626 -606 3245 8123 22945 17670 10901 -1658 -15851 -14050 -12539 -5875
20535 -5875 1408 4664 4500 -1713 -10231 -15011 -2088 20306 17806 12373 -5778 -17668 -15295 -11952
20521 -11952 -18213 -12639 -6556 -3485 -6009 -2419 -10820 -17013 -17982 -13364 -12436 2879 5820 -7800
20507 -7800 -9849 -11648 -5566 -15279 -26416 -24184 -11129 -6502 -14387 -22139 -27123 -24454 -15321 -14880
20493 -14880 -17539 -18431 -12084 -13202 -6103 -2408 -12184 -13396 -6250 -16280 -6860 -8194 -7499 -4533 4034
20478 4034 7091 5052 -884 4072 8781 11867 11087 9092 5840 -6621 -2713 -274 -1083 -4896 -13238
20463 -13238 -19991 -14661 453 22766 20817 17627 8757 1989 -3737 -7178 -6724 -5977 -7895 -5011
20449 -5011 1260 3867 6837 -1758 -6655 -7424 -9445 -10330 -15554 -16456 -7143 1849 -5036 -3164 10266
20434 10266 -1064 -371 431 531 17735 13026 18113 23195 5064 -8787 -17583 -5939 8376 -2649
20420 -2649 -4250 567 -24909 -44392 -41048 -34603 -25048 -15908 -3861 6646 4214 -6986 -15648
20407 -15648 -428 -5457 -5387 -2798 -7644 -10166 -5101 4217 -2731 -7188 3469 -724 -16430 -21236
20393 -21236 -15374 -4726 7818 18735 1180 -20840 -22162 -5819 -10295 -13202 -13050 -4359 -4149
20380 -4149 -1387 7242 -3046 -6377 -1109 24843 25301 7889 -1069 -2515 -1267 -6616 -14851 -16250
20366 -16250 -11664 -3007 -8819 -7604 -13834 -19269 -12004 -11130 -8413 807 3899 -1211 -5411 98 -1589
20351 -1589 -1618 88 8642 -8154 -26667 -15612 -14538 -27521 -30453 -24386 -18296 -6935 669 -2266
20337 -2266 70 -6537 -14310 -5765 -6372 -12652 -8531 7115 13739 16484 19925 23276 7900 2599
20323 2599 6191 18152 25319 13490 2427 12414 5972 -11399 -5437 -4227 -458 4889 -1122 -505
20309 -505 5976 10646 9807 -2598 -5271 -5648 -2909 -289 -6722 -4867 -2100 -3664 -16853 -16102 -252
20294 -252 264 4797 22256 20543 24271 11033 -8231 -5185 1468 5382 11063 4575 -658 -13440
20280 -13440 -25384 -8160 -4866 -5084 -5335 -5831 -1941 -6136 9597 19168 10538 7200 7100 9694 -4321
20265 -4321 -1632 6394 7859 13245 22527 9795 10523 11395 11879 6593 -1025 12884 17279 1822 -331
20250 -331 -6500 -23177 -31303 -20811 -11806 -17351 -14764 5216 2170 9427 23421 31040 19434 4979
20236 4979 2519 10696 18377 19466 4722 488 -5210 -6507 -8885 -6140 -8578 -13077 -14182 1563
20222 1563 22776 24253 15086 14416 10946 2461 -7922 -4720 14049 17220 16033 9205 2278 -1531
20208 -1531 -1208 -1176 2592 -3319 -11092 -13312 -8735 -3126 -4095 7339 18230 15732 18674 22789 18545
20193 18545 918 -12023 -7780 -7529 1530 3539 -1419 264 638 -7794 3504 5029 7813 -497
20179 -497 -3014 -5664 -11217 -13894 -8023 -12325 -15135 -8449 -14377 -12769 -10306 -9673 6398 22230 14554
20164 14554 -2303 -5775 -5648 -11905 -24427 -24314 -13602 -2146 -2839 3641 17607 7689 -12922 -20094
20150 -20094 -8044 -14981 -12370 -9089 -12918 -14418 -10893 -3023 1100 408 1935 1431 219 13866
20136 13866 18122 22527 14145 17938 19912 9273 -29 7815 696 -17118 -25952 -16728 -13440 -7106
20122 -7106 10914 26357 28167 22502 16881 10794 3317 -10976 -6939 -9371 -23890 -23704 -20133 -10651
20108 -10651 12778 18272 4608 -4508 -1126 -1109 702 -18094 -19791 -10685 -7251 -16643 -22408 -25270
20094 -25270 -25411 -25665 -16667 -23006 -22239 -20106 -13593 -18747 -31579 -31721 -29705 -23187 -14623 -2112 -803
20079 -803 -8100 3054 3532 -15914 -23875 -32298 -35611 -14703 -10262 -17323 -16994 1175 8464 5780
20065 5780 9772 -895 -9769 -15833 -9490 1846 -5918 -7727 -14694 -31429 -22641 -16568 -15681 -20225
20051 -20225 -23018 -20672 -30816 -24843 -1682 8155 12057 6610 7372 3896 -9688 -11112 -9187 -13844
20037 -13844 -11439 -9046 -18543 -26004 -27935 -16684 -7038 -534 -12601 -11592 11586 19943 28711 27179
20023 27179 22558 21619 14417 -2905 -16528 -6675 -15353 -29371 -22273 -9563 1011 2674 -15546
20010 -15546 -26289 -21873 -16654 -14044 -19226 -18627 -19130 -14175 -4175 -19518 -25194 -19842 -9017 -18993
19996 -18993 -22393 -10960 -9301 4348 14598 5000 1570 10141 3875 -14192 -14801 -10640 -20592 -23339
19982 -23339 -16263 -5525 -13174 -23987 -26875 -25248 -23752 -18657 -20142 -18501 -18133 -13924 5769 6555
19968 6555 -1629 4402 19223 25697 21300 16838 19323 17826 17870 3659 -12358 -15365 -25404 -12718
19954 -12718 4913 4483 -4473 -4473 321 -1789 -4615 -743 4934 1932 -247 -10056 1422 5603 -4833
19939 -4833 -6016 -82 5405 3659 -12684 -17449 -23528 -22801 -14237 -4218 -1592 2266 3523 4127 5068
19924 5068 9217 7568 7909 150 -15098 -2584 -260 -5498 -10107 -9735 -10639 -20293 -30931 -18886
19910 -18886 -2582 6824 1902 -10830 -32715 -39199 -30512 -18668 -8419 -17522 -12249 -15834 2149
19897 2149 14065 7618 9825 8698 -3718 3367 22352 13553 5891 -6709 -10944 -10528 -7286 4220
19883 4220 17010 15739 2026 -2200 -14077 -2225 11496 21324 15848 11436 3461 -4173 -9514
19870 -9514 -111 8756 11140 9874 -244 -7836 -1165 13041 7645 -6756 -8864 13347 13399 -1834
19856 -1834 -7188 -2348 -18226 -17727 -6155 -10903 -8105 -6964 -15678 -12810 -8295 2207 6442 6844
19842 6844 5004 3403 893 -4669 -1133 -5318 -5495 9776 16617 14512 12619 16349 20687 13449 13262
19827 13262 525 -8954 -8391 -15971 -20962 -14673 -9868 -8815 -6495 -10219 -15363 -13873 -13078 -11864 -7300
19812 -7300 -3140 -8888 -3119 -6788 -12986 -14027 -9598 -11615 -18571 -23583 -18256 -17288 -16918 11 8 3392
19796 3392 17632 19792 5796 2553 5167 -14213 -6913 3981 3789 4463 -7365 -16086 -3105 2290
19782 2290 4319 -8985 -8179 -87 -8510 -5104 5446 8567 9267 4413 5796 16661 10635 9243
19768 9243 2775 1294 -2298 -5875 -1257 8649 14918 5468 3846 15703 5721 -1178 -17455 -6910
19754 -6910 4791 9640 3719 -7446 -23234 -28162 -16215 -15515 -11384 -10238 -8410 1416 14363 7970
19740 7970 -9898 -4887 3634 -3987 -6036 7242 16167 17741 8914 9961 2738 -3042 -8990 -13672
19726 -13672 -7643 742 -16479 -31716 -14907 2433 -79 -5620 -13369 -15469 -16433 -10768 -5435 -8174
19712 -8174 -5734 -4739 -5476 -7798 -3422 12564 8685 2858 -13814 -27252 -10035 572 2577 893
19698 893 8067 2475 -3350 -9191 -23945 -15515 -13488 -10570 -7384 -10097 4361 -6595 -5182 -3392
19684 -3392 1334 9127 -1133 -9946 -8311 -1306 11279 10326 5426 -6176 -6438 -3691 -1575 -8831
19670 -8831 -12328 -18851 -7835 3884 -5984 -19378 -11549 6277 3581 15423 29702 15924 8470
19657 8470 -683 -254 -4079 -15804 -18562 -13919 -5463 -9686 -14346 -20242 -19748 -14990 -12488 -10209 -14373
19642 -14373 -18198 -13507 11084 3783 -669 -16937 -31505 -28930 -19554 -16958 -8940 334 6324 -3703
19628 -3703 -8517 -8972 -10348 -5247 689 6128 971 -7008 2007 7977 7216 22478 11552 -383
19614 -383 -6163 4936 2843 18512 9015 -10395 -14594 -15905 -12457 -2990 543 4321 -4046 -8766
19600 -8766 -19728 -14921 -7401 -2665 -10262 -15055 -11702 -1353 -9915 -18377 -20708 -25505 -19240 -27202
19586 -27202 -22870 -12909 -13766 -16093 -15146 -12713 -8554 -10076 -1899 16808 11742 5764 16787 12046
19572 12046 19884 8584 -11385 -21127 -11141 -5739 -4174 -8562 -4224 6480 24355 15807 18194
19559 18194 16444 -1291 -5537 -11752 -13534 1731 14613 14006 6208 9908 -1297 -11076 -10879 -28293
19545 -28293 -43837 -35602 -10339 8315 18477 9704 2343 10809 23629 25672 17258 13381 6389
19532 6389 15401 13919 3307 9359 -4352 -19890 -20709 -14943 -6819 -11093 -14603 -14876 -20798 -22731
19518 -22731 -9826 -2448 -16773 -22750 -19563 -27845 -36399 -39117 -39052 -24369 -19689 -26303 -16309 -6064
19504 -6064 -5837 -4586 -954 -4803 -2255 -1600 281 3675 3972 12387 20141 17978 1658 -10911 -9124
19489 -9124 -5946 -4971 -878 14697 31547 23597 16986 16214 19068 6788 4525 11379 20355 25168
19475 25168 13922 3719 23967 28377 13197 4115 -2432 -5565 2461 2633 -7672 -11617 -16778
19462 -16778 -6633 123 -8520 -24398 -13695 -7459 -8639 -10466 -27333 -33633 -28566 -27722 -19587 -14325
19448 -14325 -15988 -10566 -12281 -5772 -6191 -11997 -5400 -3395 3784 5812 6456 -9707 -34535 -47988
19434 -47988 -47130 -22399 -17532 -29300 -26455 -20284 7217 12874 20750 7873 1596 873 -2907 -15222
19420 -15222 -16296 -314 4203 -2582 -10793 -15528 -20293 -45243 -51366 -32743 -27419 -27725 -20405 -24161
19406 -24161 -32311 -20938 -18777 -13681 -5753 -566 -1364 3741 9897 7190 18318 26403 17451 14126
19392 14126 24047 11871 -508 -1878 -637 5061 17637 17041 16769 -3311 -15215 -11554 -20527 -18108
19378 -18108 -6489 -1821 -8940 -12972 -12311 -11665 3161 3646 -290 -3591 3597 2611 -3135 6331 9629
19363 9629 2503 -2583 4782 10813 15180 11777 18342 19686 26488 31429 28344 25877 28566 11888
19349 11888 -3601 -19764 -22515 -21442 -23507 -17214 -7756 -3901 6894 24538 26442 9402 4588
19336 4588 2641 -12642 -15134 -741 9804 34370 33425 25927 10981 22050 34263 26607 22505
19323 22505 16886 7859 2687 8219 1694 1584 1090 4436 -15643 -27462 -19588 -14483 -14986 -11202 -15587
19308 -15587 -18481 -27968 -30679 -26147 -7676 7102 9114 5214 8958 993 888 3930 -2244 -15093
19294 -15093 -18740 -13696 -9770 -7517 -23217 -34491 -33632 -24658 -29691 -17502 2228 876 -4549 -7724
19280 -7724 -259 4382 -2146 -5093 -3666 -6484 -12445 -15714 -6064 -1415 -7089 3207 18660 2402
19266 2402 -3765 928 -454 -19025 -18317 1141 8442 1485 -5814 -6154 5823 10069 3185 -2210
19252 -2210 -17178 -35031 -24135 -21662 -28265 -16695 -10832 -10310 -2429 -3132 -7467 -14171 -26464 -28597
19238 -28597 -25986 -19739 -6600 -8194 -29611 -26219 -21475 -24267 -23968 -23206 -25231 -15994 -9930 -18953
19224 -18953 -31229 -33379 -33150 -21285 -8660 1095 3602 -12308 -12839 -11767 -1549 -3781 -20060
19211 -20060 -20453 -16435 -24361 -18330 -10632 -6191 -7291 -13381 -15438 -14342 -11382 -475 9306 3173
19197 3173 -1472 4107 1873 -10400 -8267 -3088 2921 6282 5220 -210 -7084 -16571 -11184 -9069
19183 -9069 -28098 -25684 -17683 -13088 -8608 -17613 -16625 -7758 -13505 -22277 -27003 -24430 -27720 -9766
19169 -9766 5968 3603 -11531 -15444 -14984 -3297 2153 -5917 -5991 4530 4960 441 -6696 -14121 -12428
19154 -12428 1758 6105 6593 9475 1644 415 7369 17190 27506 16695 5603 -2383 -8592 -3689
19140 -3689 -8860 -12027 -11080 -9573 -12116 -4287 -5545 -12056 -13505 -13582 -5513 -294 -6543 2304 4480
19125 4480 -1529 -10004 -17165 -18260 -8163 -12880 -23588 -19989 -4907 -3698 -10664 -8745 -7058 -27166
19111 -27166 -31224 -15812 -3284 -11722 -13262 -8024 2128 4669 154 13479 22352 14157 3312
19098 3312 -8802 -12311 -20327 -21619 -20246 -10685 -15330 -16634 -23891 -23980 -17358 -26400 -22929 -18687 -5158
19083 -5158 -391 -26299 -33524 -20633 -253 7619 10175 16378 14124 12208 6530 6999 -6136 -15150
19069 -15150 -11638 -4289 11053 16166 18232 10789 5631 -3018 -3674 -4284 -10573 -8434 -1086 3835 7103
19054 7103 -72 -236 18830 25094 22468 20843 6707 4428 4446 -1368 -5837 -902 5948 6889 -1408
19039 -1408 7150 16029 5882 14834 18302 19497 -1060 3332 18045 10280 5371 4723 6858 5412
19025 5412 16119 11799 20276 13767 2080 -3163 5492 14807 15698 15233 8891 14776 17907 22472 5541
19010 5541 -17399 -27968 -26320 -16063 -12516 -19405 -8409 -7972 1560 12250 9061 -7188 557
18997 557 20646 29450 18787 -2142 -12644 -8384 3858 1556 460 5565 7333 7186 -5851 994
18983 994 1371 6600 -1483 -8155 -3291 -2214 -2630 3085 4941 13866 23190 14390 3051 2877 -5261
18968 -5261 -12536 -10663 3428 6720 5731 10463 2192 -6162 1952 5421 2974 -4872 -5667 16456 19587
18953 19587 15816 23879 50141 78772 105630 144399 183935 205741 215515 228810 249921 262572
18941 262572 270169 278711 285253 301865 317455 325646 316463 294548 290637 288386 273661 268188 269668
18928 269668 268881 254806 222665 166282 127497 113918 98699 87984 85049 83805 74582 63358
18916 63358 48681 27005 32347 47522 48931 41728 37873 44149 37694 45511 43990 17193 12404
18903 12404 25575 27451 24993 23868 21689 24156 41874 41846 34997 23476 26675 21961 14503 25524
18889 25524 31957 29076 25845 14123 1500 10972 7503 -6873 917 11745 25409 21122 13180
18876 13180 7883 3164 16475 27412 20737 24639 35011 44440 37592 26228 8567 8428 9537
18863 9537 6580 2723 8881 10567 5299 -1447 2977 1488 4013 15352 6347 -2144 11660 3556
18849 3556 -10312 -4112 20140 13261 5765 -4875 1263 17430 26758 13677 10524 18768 25835
18836 25835 14524 14601 19911 31457 5950 -16560 -7861 3104 2000 4101 7849 12743 14548 7218
18822 7218 1227 5877 19869 22191 22634 21163 12143 12262 9736 3712 -4873 7116 4360 3949 -2150
18807 -2150 2594 11284 10561 7071 -5496 -13284 -11826 -6887 -1654 8441 20701 26516 20650 14793
18793 14793 10622 5013 16136 24303 23753 19078 21787 12261 -3198 -23595 -23224 -10365 3060 -3673
18779 -3673 5598 9358 11493 21641 29997 31979 47282 62142 64981 75788 80771 85827 86102 88029
18765 88029 80614 46488 33492 33965 32944 29608 21707 30678 32801 17523 31027 36251 33201 35153
18751 35153 31073 34000 22989 20335 31455 25764 10414 2003 4952 -1726 12451 8430 -2097
18738 -2097 12351 16815 6124 11548 23077 24899 21292 22435 6951 4954 10718 9572 2028 4061
18724 4061 9948 18226 15501 9323 14284 21488 6158 -6210 -18323 -5171 13187 14182 19716 2115
18710 2115 -6650 9865 9806 -834 1030 12211 16669 14428 18513 26654 15666 5777 11936 31022
18696 31022 32754 35609 53667 55390 48287 35050 58143 75830 76635 69920 46092 42358 45139
18683 45139 61665 66072 49287 32058 34626 22009 3728 -2986 1399 12946 16764 10627 11302
18670 11302 11167 1465 -1554 -4793 -8902 -24167 -17760 -2223 -5682 -16167 -17667 -10266 4409 11674
18656 11674 22053 38668 27162 11385 4299 5601 1743 8577 20868 22086 20601 24165 33474
18643 33474 33462 26024 14322 24638 21824 14163 14756 14955 14338 12558 11324 19071 24244 17407 4569
18628 4569 -5849 -14671 -6624 3885 18255 11581 -3478 -6695 -3926 -2534 3792 18095 11938
18615 11938 6189 16001 19288 23128 23697 23311 20624 31596 38601 29410 29847 30368 18920 4393 -2332
18600 -2332 260 5346 2880 4441 10282 10910 10817 9718 -6 1239 10957 14555 9768 7055 7601 -3135
18584 -3135 7836 29008 31148 21915 23244 17520 26531 40903 26491 30082 36222 34527 25868 21002
18570 21002 10381 8465 4294 4716 26004 31277 15693 27051 44644 50529 54270 48766 51004
18557 51004 54227 52491 43998 37795 48342 59799 49634 63210 72043 81321 65916 56597 47649
18544 47649 51329 56333 58358 50590 42027 41072 37303 35603 39029 46831 42932 47634 37660 46234 50869
18529 50869 39649 33397 38028 38946 44614 41218 34388 31393 16517 17761 22374 19470 27124 30466
18515 30466 39140 37241 31406 25013 17385 22687 34600 41350 18353 -8835 -10 26020 31752
18502 31752 29962 22325 18957 10130 4854 801 -2436 2627 12417 11936 12065 17291 17587 18530 26769
18487 26769 30769 36740 32459 31150 22135 18824 23984 31923 38205 54530 57133 60624 65201 54287
18473 54287 39356 42221 35178 35395 47149 34765 21200 32041 39546 35808 36290 45428 55946
18460 55946 51101 41778 37960 43844 47813 47704 65267 61615 58941 49362 51281 62201 65475 71358
18446 71358 65125 50598 50368 51658 59016 64430 71388 62526 57705 57448 41685 44255 49224 51869
18432 51869 53514 54990 71406 81980 98776 110454 98318 85366 86750 78181 77022 76959 57749
18419 57749 49310 52453 64446 92188 111201 126682 128860 119917 111808 114235 138210 168650 201214
18406 201214 236471 257559 275066 290230 302889 304254 315184 318593 318460 305860 299864 294285 302765
18393 302765 317684 336534 338541 341069 340774 335890 320714 286581 257045 218915 192888 200067 194220
18380 194220 194862 191434 195866 223856 238485 249801 264928 309070 368605 410582 443638 465370
18368 465370 485583 490933 465195 429150 395024 362135 349731 342781 313993 289705 279659 280637
18356 280637 288329 292681 314969 340768 367019 422906 521823 613764 685451 770738 849152 911848
18344 911848 947979 933511 886180 859316 848339 833367 825604 828207 848878 872649 909332 951649
18332 951649 995770 1043937 1109435 1192705 1269255 1332808 1395106 1460854 1536705 1629971 1735227
18321 1735227 1850469 1975093 2137725 2339536 2605153 2999961 3559244 4304083 5361695
18312 5361695 7024039 9799048 14270701 20577808 27410883 33249368 38079188 42822361
18304 42822361 46267090 47218075 46562778 46563446 48004185 49874945 50214657 49044026 48082338
18295 48082338 48574141 50557036 52383392 52052685 49721243 47385098 45603001 43234981
18287 43234981 37762197 29630683 22099560 17297170 14443863 12641413 11392281 10467105
18279 10467105 9726831 9138127 8652321 8239633 7858663 7505556 7163019 6840092 6563153
18270 6563153 6301414 6027616 5761871 5513467 5292633 5103500 4930439 4743717 4560872
18261 4560872 4400019 4266270 4144573 4018659 3900344 3781502 3644326 3505156 3402105
18252 3402105 3305996 3206461 3131352 3045539 2960838 2842043 2729984 2641453 2540696 2427789
18242 2427789 2321086 2229349 2152403 2088310 2038869 1979754 1913167 1854065 1803311 1748650 1694679
18231 1694679 1624032 1569686 1521399 1489541 1439991 1387090 1337948 1316215 1275618 1243554 1207915
18220 1207915 1155649 1118781 1079046 1050544 1032255 1004172 966983 932781 912628 894428 873779
18209 873779 850300 823358 798465 772842 763644 759067 728617 698587 685089 668461 662777 661589
18197 661589 644816 617975 593867 582214 555154 536426 513514 516577 527063 507926 496822 500820
18185 500820 480068 460162 457167 446417 432268 416162 393675 373884 361800 361237 357491 353265
18173 353265 326205 296092 283732 274658 276895 259978 249317 237052 232389 223407 239101 223218
18161 223218 207673 196262 192655 187185 170552 167700 143865 135159 138635 132866 145915 166436 164975
18148 164975 158232 146306 153475 161401 169226 163913 166448 180557 181251 170628 172410 178988 179535 162318
18134 162318 168309 188071 196074 217970 249895 265118 278831 297844 320300 348644 373389 416681
18122 416681 481799 568177 677308 816856 1005542 1278013 1671196 2329044 3503772 5651836
18112 5651836 9115306 12668880 14545210 15485436 16305796 15404066 10312978 6430388 4466460
18103 4466460 3432790 2834377 2462017 2193738 1977898 1790302 1639981 1528085 1429710
18094 1429710 1351397 1283872 1237806 1176049 1122465 1068709 1010282 960708 919270 882876 833325
18083 833325 785490 754848 725422 690123 671153 653303 647689 642765 648601 659988 679704 708214
18071 708214 742845 790364 822058 831398 813992 773180 694218 619883 550778 515586 495262 474045
18059 474045 449365 443240 433092 421286 408375 397943 391721 378230 379184 381819 363335 361596 349520
18046 349520 327378 320496 329062 312109 289379 279490 273659 266030 249147 242657 240935 239243 237611
18033 237611 233966 225772 206561 201407 199910 194288 202954 207518 217733 218334 206012 200990 189242
18020 189242 187228 173379 155005 147957 150298 141328 144850 149038 147528 144253 152418 149866 159425 161340
18006 161340 159519 170232 158947 161787 170348 179877 179172 170769 160113 152905 151361 137428 136433 138298
17992 138298 135827 149796 187797 229574 293248 368270 408983 424872 439806 426952 317178
17981 317178 254845 236152 228231 225577 226175 212880 211037 229471 234954 244072 263201 272556 262082
17968 262082 265666 288148 292793 275610 256933 252746 251916 234577 227558 216723 225715 231912 254217
17955 254217 322104 389635 430727 438432 437184 468829 461261 426570 418863 410699 408052 419722 408450
17942 408450 374420 344124 318960 298873 272562 255384 239841 229042 229825 227330 210565 212250
17930 212250 213688 197752 198085 207199 204578 201692 196352 190965 204148 209760 212439 208948 208259 212633
17916 212633 194981 178511 174543 181208 196929 198662 188556 171392 174970 179416 168135 163265 164661
17903 164661 165734 180570 197996 219688 213807 196729 204659 213847 203172 196655 198733 212274 224230
17890 224230 232959 235171 252371 267501 263548 272792 292890 304049 308662 314798 354612 390761 429193
17877 429193 495252 557250 619859 673556 705540 711290 716864 713886 696054 689137 697306 715439
17865 715439 760893 835441 950486 1082253 1224688 1395296 1576727 1778365 2004813 2259591
17855 2259591 2552625 2906794 3341542 3887087 4633104 5693620 7343945 9995797 14196137
17846 14196137 20366341 28375021 37305533 45705775 51952536 54795397 53298505 47731320
17838 47731320 39368420 30439946 22833831 17485182 14145918 12205000 11099961 10485339
17830 10485339 10213763 10271764 10692921 11629118 13379211 16433683 21383747 28549457 37599265
17821 37599265 47346563 56082125 62119575 64106118 61194063 53844759 43849863 33654286
17813 33654286 25273484 19404551 15664954 13351072 11830304 10730776 9857271 9142024
17805 9142024 8581822 8132780 7773914 7458890 7148347 6843321 6525669 6187014 5858971
17796 5858971 5522664 5210782 4943779 4734553 4556394 4408392 4289141 4177540 4066212
17787 4066212 3940300 3818621 3696203 3543184 3388919 3241617 3119862 3013427 2904545
17778 2904545 2795392 2681762 2571365 2457409 2365458 2284934 2209661 2142879 2078341 2024598
17768 2024598 1972098 1911511 1856657 1786158 1745001 1699302 1643058 1579684 1535637 1502736 1461106
17757 1461106 1404765 1362772 1319017 1282289 1254779 1218935 1175191 1124740 1080350 1021988 984081
17746 984081 966188 940743 923640 908250 886427 864630 852491 840124 824228 806939 781199
17735 781199 766525 753439 731611 700910 668998 638048 600596 579804 578712 556045 533255 520711
17723 520711 508886 499837 501024 474269 451575 444259 434726 432137 432930 444025 450838 434802 411964
17710 411964 388210 371369 354873 352730 343765 319967 304663 305820 296326 287462 273710 269070 262518
17697 262518 253024 257426 254480 251541 266563 262792 255333 249180 245028 229785 209502 192375 182131
17684 182131 172075 172353 165342 162275 159084 156393 160241 171023 176434 176234 172950 178427 195338 199642
17670 199642 194968 190696 174678 159228 161075 165437 160675 166193 198868 236953 275630 309210 331493
17657 331493 358001 394559 397281 378547 379958 388838 384064 367304 364997 380333 392208 430766
17645 430766 445735 451642 437195 408555 392142 382307 359513 314372 251033 213427 204004 196253
17633 196253 182228 160253 164397 165212 162852 150232 140483 151010 169345 182635 181169 178511 168759
17620 168759 156948 133646 143161 151359 148462 133305 136382 159880 156122 158449 150765 151577 153443
17607 153443 146506 123154 120603 120817 131664 133810 141305 129686 108968 122850 138936 140528 152326
17594 152326 159835 171041 178682 189541 204299 199700 187556 180781 182116 189747 181023 176437 177982
17581 177982 188253 186350 182247 179094 171148 153934 134321 131798 135357 159716 160338 147753 150071
17568 150071 155204 152003 151564 143951 127796 129008 138214 125854 119174 126646 126401 121879 119616 114279
17554 114279 103509 90923 96320 120198 131608 127360 125426 119899 124859 123361 122278 113611 104613
17541 104613 105877 106688 123568 125440 134700 132828 135258 141431 140150 125342 128337 144769 151805 154351
17527 154351 149767 138512 137317 140165 152776 149854 151838 157242 151885 159988 152152 151842 161207 177367
17513 177367 176062 158023 161704 173587 172287 174290 186831 209709 210480 197415 197465 196522 193284 192935
17499 192935 183479 194484 196231 201926 217775 234529 250206 255470 259451 277244 305714 342938
17487 342938 382280 424879 436538 463752 495761 523436 565348 600847 637526 668874 717265
17476 717265 723096 722003 758746 825386 884024 938846 1008416 1088076 1174428 1292923 1443411
17465 1443411 1636053 1831225 2061558 2325431 2647241 3056063 3615719 4465621 5810119
17456 5810119 7950150 11225119 15248765 18828992 21929873 25410113 29571900 33202815
17448 33202815 36735243 39339235 41053680 42806192 43459642 38783899 33469901 30244003
17440 30244003 28192269 26721484 24551140 20330630 16525021 14545583 14092045 15021720
17432 15021720 17305043 20284382 22898009 25259686 28106836 31454538 34321310 37140472
17424 37140472 38995034 40242298 41569074 41298895 36246763 31456616 28471492 26485555
17416 26485555 24892945 22304738 17926535 14173002 11818115 10349461 9321990 8569735
17408 8569735 8011295 7577260 7190766 6827532 6478519 6166667 5880046 5616770 5380451
17399 5380451 5155127 4921043 4719499 4519940 4344950 4177433 4034290 3902405 3760766
17390 3760766 3641636 3525975 3417214 3280472 3155535 3043302 2937262 2847592 2756454 2641362
17380 2641362 2544687 2446840 2359718 2291486 2230720 2166488 2126154 2110379 2090100 2067264 2034256
17369 2034256 1979898 1931361 1875749 1820719 1746939 1673167 1599989 1524982 1454238 1401468 1356310
17358 1356310 1315112 1281026 1252254 1231054 1218202 1218670 1220392 1221348 1244068 1255351 1238254 1210244
17346 1210244 1203956 1204343 1203739 1182816 1153912 1121101 1067050 987842 908651 843885 805743 783403
17334 783403 767502 758265 766291 766205 766669 768270 754702 721833 675216 650485 645732 652585 667369
17321 667369 700263 703077 682469 665506 617399 571999 542981 540178 549947 580543 626484 704220
17309 704220 764866 811520 834771 812408 742417 660926 592216 528701 458827 390511 358875
17298 358875 343618 333617 320236 317431 315757 299674 280978 275712 270471 286124 307241 331352
17286 331352 379379 417763 442999 450462 437844 396015 359253 322462 296883 275123 245860 226373
17274 226373 227516 222527 204322 189369 171417 173308 169745 158834 149108 129731 118919 130285
17262 130285 145641 162320 169441 154737 160501 156437 154980 170665 171868 162322 148197 154412 168612
17249 168612 175294 187230 179496 167063 175055 178997 186415 186576 177847 173765 176907 177686 186297 185112
17235 185112 180602 177034 170923 173753 165775 160050 158234 147698 148852 143563 153299 152031 146441 162261
17221 162261 171784 173083 175601 174321 168205 169622 167047 156438 150608 137526 140438 145207 144525 146733
17207 146733 131122 114067 109691 118157 122998 119553 109335 103667 104877 92311 95748 101177 104714
17194 104714 111152 104662 99732 102761 106958 108255 111961 110793 116595 114047 99448 66972 55386
17181 55386 58183 60198 72554 80790 86366 93237 74938 59592 44660 40241 37421 43022 64092
17168 64092 64224 44023 41052 44319 37898 32906 45110 43161 38200 43662 56028 51318 42612 47517
17154 47517 40803 48225 53869 51582 47734 53128 64388 57391 45142 38768 37073 36304 33519 37857
17140 37857 24849 25828 48591 49073 29987 25863 22805 10014 615 15617 28394 37138 47876
17127 47876 54683 52185 29248 17778 9492 16396 33402 47513 33333 14265 25544 29606 21965
17114 21965 15071 2665 11765 29824 36780 25549 26771 36149 48489 51492 45162 47404 34959
17101 34959 53389 59115 43057 31644 23096 34454 34356 23528 15458 19598 31266 25886 22620
17088 22620 31737 46267 51050 38992 32829 45450 47246 50209 48276 60128 68302 71062 81556
17075 81556 88900 73101 66064 67344 70819 81480 79136 63052 70027 84691 102971 108874 111577
17062 111577 112460 107087 115161 118393 125277 129418 134266 133143 131987 120754 127846 139952 125414 102932
17048 102932 106172 122995 122956 138760 144337 133831 135813 146137 161359 168007 171558 178316 165886
17035 165886 171509 180778 163679 145242 136475 136123 121827 117362 125218 118844 103244 105771 120317
17022 120317 123278 122961 96258 73871 75337 81021 70910 66193 74165 81455 78663 68344 67469 73268
17008 73268 78415 83719 80749 80906 71501 56999 64785 84862 78168 62923 52618 46277 52881 67874
16994 67874 72929 66713 60193 67497 50805 57998 63936 83219 84273 71574 66930 57522 50649 50223
16980 50223 52923 54671 59986 65294 67214 61784 64123 56784 50001 43155 42231 38833 43887 45030 50941
16965 50941 67822 65610 73979 72167 72896 71413 76892 66951 64136 81183 102282 112981 110772 113033
16951 113033 96266 80561 73506 64620 72058 71033 60816 70992 88394 88074 83789 96320 111268
16938 111268 109305 114241 115345 106308 91821 79088 79731 113512 150506 169435 187651 204801 202779
16925 202779 212896 235841 268694 298776 307204 316686 319589 344162 340547 313767 277140 276392 289417
16912 289417 285171 277240 265282 246527 232966 215522 198209 202594 228221 253631 294488 335090
16900 335090 356451 364871 371470 381671 381652 391096 396846 381864 377781 368467 353375 342392 341800 318890
16886 318890 275344 261604 257397 244777 239398 260846 272105 268880 271301 276444 259701 254767 253578
16873 253578 268177 280941 289274 305801 332616 353532 384126 410733 424397 434541 453067 462316
16861 462316 456842 462156 470691 493230 507696 536737 577371 620535 663818 710365 750741 777311
16849 777311 788191 827583 877290 920373 958565 998405 1031290 1072820 1108451 1117011 1144008 1210167
16837 1210167 1315509 1486227 1718162 2040851 2430072 2889912 3505774 4400365 5727261
16828 5727261 7711895 10373525 13250653 15922387 18259385 20352710 21802329 22533573
16820 22533573 22453285 22122412 21735423 20533104 18147324 15078652 12154400 10440560 9931864
16811 9931864 10268685 11389446 13518359 17230089 23269317 31841304 41678377 51090397
16803 51090397 59128904 65913850 70388637 71795929 70181007 67366153 65085133 61848229
16795 61848229 55561771 47201429 38674553 33633482 33678645 39023552 48474845 56538480
16787 56538480 60581107 62890507 64266565 56887307 42644594 33873259 30544695 31302492
16779 31302492 36175962 44818458 52999360 57164100 59177614 60304863 54947328 41017048
16771 41017048 30957118 26064442 24547044 25355880 26829865 27378302 27489146 27596159
16763 27596159 26121924 21608563 18175197 16524095 16200343 17253288 19811837 22818840
16755 22818840 24457949 25135188 25515210 24557005 19615593 15109813 12475124 10830574
16747 10830574 9764196 9043337 8490429 8061389 7715150 7410771 7136856 6870032 6601451
16738 6601451 6321903 6031782 5771579 5552621 5334650 5139131 4966034 4799756 4647782
16729 4647782 4487839 4325440 4156717 4008278 3872180 3730794 3603403 3493259 3405691 3340744
16719 3340744 3248610 3154999 3061445 2946812 2832986 2749332 2663611 2577781 2485340 2394994 2325462
16708 2325462 2247911 2179564 2118509 2066403 1993905 1920584 1875199 1846656 1803642 1755468 1690831
16697 1690831 1653425 1597056 1552418 1518240 1483084 1445566 1392543 1340052 1290157 1256531 1218009
16686 1218009 1175687 1127854 1065097 1036922 1025487 991138 979147 969753 951682 933635 896595
16675 896595 859942 834990 811646 787515 763481 743247 731195 715572 685022 656619 617963
16664 617963 591790 563765 541467 519765 503513 510893 502047 472895 462355 449924 446452 428269
16652 428269 420700 420690 410075 387284 356556 350517 327351 313230 313071 303374 291443 281235 277110
16639 277110 280288 275000 263634 257724 242842 229475 229161 222787 208137 222617 229571 226686 233689
16626 233689 232139 220926 213465 197061 194417 210308 213453 204930 201580 193647 197911 204125 193409
16613 193409 193970 196051 187637 178406 172153 166575 177209 191651 201768 194813 190207 205257 208512
16600 208512 205043 203400 192743 189135 186057 187910 188179 173918 168425 160907 163245 153106 139405
16587 139405 136491 148535 154488 158262 151107 154119 165982 173622 176446 165361 162398 159382 151847
16574 151847 145612 150005 149555 140675 142677 145081 155367 151250 137987 151386 149155 133082 134288
16561 134288 142377 134848 127039 124075 112230 109996 104450 108845 106366 114438 114230 125279 121038 102767
16547 102767 90072 95797 97747 102017 99575 109607 102672 90171 82855 83706 83349 91442 91946 74463
16533 74463 61953 59052 55640 70802 78267 79718 70596 63690 56583 59358 57416 65508 61921 47160
16519 47160 63336 91779 88483 84015 71870 69538 77851 66653 35566 29070 38002 50032 55893
16506 55893 53577 37614 15673 19798 37355 50238 68893 65348 56308 55767 60063 40740 27366
16493 27366 16801 2244 11622 26409 33766 32917 29385 38937 45054 48453 36874 32449 24201 12806
16479 12806 22208 31998 24524 24797 20805 10075 22707 37319 40938 45284 40352 21058 21483 24937
16465 24937 22555 22162 25561 22057 19247 19335 22798 17004 -3138 -4774 21122 30879 27956 25214 18536
16450 18536 18881 26641 34764 38454 28112 23879 29762 39095 25963 11149 15015 18357 13469 15273
16436 15273 13357 11897 -2649 -4581 -4231 -8263 14036 35438 40205 26886 18157 35466 50686
16423 50686 37461 26431 9463 791 -54 11939 33087 26412 18486 34439 25089 19632 10929
16410 10929 19320 31064 22450 21574 29917 30096 24891 31548 26422 20341 16426 15114 -1301 4333
16396 4333 15571 5523 11792 22995 31683 23715 21270 22033 16348 5339 5220 11347 13448 8184
16382 8184 16336 9410 -5385 -5587 4074 -3878 -3022 3906 -6274 -13682 -2685 10314 13692 18874
16368 18874 27900 20532 2687 -6435 -6114 -3439 3606 13011 22471 31077 32007 28655 20428 11796 1824
16353 1824 408 8317 5853 5215 -8808 -4429 10584 10282 1524 12382 35524 46286 38602 26850
16339 26850 20151 18307 20770 16617 12540 5271 3508 -7429 -3097 9808 3614 4341 9170 9711
16325 9711 14248 25182 16750 7938 7927 3524 7104 12099 17294 24321 24280 22739 20229 26750 14531
16310 14531 -5209 -4370 2280 10580 12550 90 -13350 -13147 858 141 -5830 -9714 -1177 -4327
16296 -4327 -6539 12369 9411 3813 18463 21633 26560 29013 15063 7574 285 -3673 -2598 7647
16282 7647 16487 21896 27128 30640 46254 51974 36831 20752 6938 18059 37198 51885 60941
16269 60941 67590 77885 112295 146451 189135 227959 258120 279469 285244 271883 238132 220251
16257 220251 217803 187254 147121 117627 101784 88231 82816 77014 74011 83561 100160 105696 131002
16244 131002 181851 213438 246021 283737 312512 315487 287237 262073 262431 277872 285971 273705
16232 273705 256237 256800 260853 232197 171302 137949 128919 136862 130070 156858 194186 224899 241877
16219 241877 250632 242994 215072 191017 187535 188636 187786 202382 219945 217820 216874 205622 161038
16206 161038 120459 110681 122093 147014 163711 176307 177479 190901 218304 218363 183952 123809
16194 123809 85780 63224 48957 43794 42644 58011 66074 49452 45712 56604 63851 55247 48052
16181 48052 49975 49981 52050 52182 53534 60570 52712 35515 34527 38792 52289 48781 41945 43389 44160
16166 44160 39843 46060 45891 40264 30498 15406 9517 2403 -3301 2710 6397 4308 18339 31349
16152 31349 30044 37716 38274 30113 15287 18104 16461 27084 18908 24495 38081 35757 23051 18939
16138 18939 16389 10320 13649 18592 23642 10351 -12014 -17031 -13390 -9280 2856 20970 23044
16125 23044 8133 3927 10730 24275 34594 34536 12256 12204 5150 1018 6195 1795 9097 9627 12742
16110 12742 10441 4228 3567 -1996 -867 11500 12863 28420 30897 25159 9715 -1514 9537
16097 9537 17460 7211 7639 11910 13855 21225 28248 15137 8034 294 917 3479 5595 4405 2159
16082 2159 -1172 6488 -1952 -2027 13187 28352 18680 5882 -1039 -8121 -1793 11554 20742 7045
16068 7045 1107 -328 5087 -1092 2462 9764 38846 36112 28020 33006 36626 44377 35903 27183
16054 27183 10238 -2586 -1431 -1462 -10632 -7684 -8657 -1946 55 8180 2641 421 -13005 -17277
16040 -17277 -9631 -14426 -24618 -12987 -12443 -7412 -2424 78 2323 -2952 -10919 -6890 -2189 5498
16026 5498 10972 16185 -807 -11813 -6248 7659 1100 -5263 -814 -4850 4254 17543 28269
16013 28269 26479 24087 29860 26682 26217 23796 27454 35515 21491 26623 44868 19801 -4851 -1379
15999 -1379 -5596 -12487 -1948 -2125 -9779 -9046 2259 -4138 -17945 -11934 -21821 -15851 -6562 -18857
15985 -18857 -18925 -10191 -3340 -4212 -7677 -1152 -7674 -10551 -10853 -6733 -1343 1297 -3413 -6583 15783
15970 15783 23745 4849 -227 2654 11564 15705 12143 14299 16500 14028 -4910 -7739 4156 19002
15956 19002 15068 10654 14728 17353 12132 4332 15658 23348 2816 -9069 -18721 -8115 -16292
15943 -16292 -22404 -33970 -29828 -19851 1395 2779 3571 4125 9251 7649 -468 -12544 776 17587
15929 17587 9931 7648 14849 3967 3904 -5022 12 8771 16729 14619 21463 22175 17852 18195 15154
15914 15154 9914 -3456 -12338 -17519 -17006 -15044 -11760 -3944 -10074 -15001 -14517 -11097 -8056 -10434 4971
15899 4971 9538 3441 9229 9819 -14850 -17414 -3369 -6407 -7706 -1990 -13224 -24268 -13637 -8308
15885 -8308 -8511 -646 1958 -7141 -10558 -9707 -13978 -12580 -21990 -15901 -15499 -13420 -1653 3809 3120
15870 3120 8587 1702 4189 6199 -11521 -9165 -3717 13318 3962 -3492 -4295 -8001 -4474 2351
15856 2351 7471 264 2541 199 -1401 1389 -6953 -2691 11980 15111 16706 3489 -6638 3446
15842 3446 4315 7217 12813 6983 9550 4279 10071 4869 794 -1083 -8441 -710 5115 4527 -10502
15827 -10502 -23102 -20885 -14626 -12446 -8915 -17355 -6490 -8122 -11567 5654 12788 6494 11227 10166
15813 10166 2799 -5036 593 3738 -162 7042 8910 -4743 -10147 -3869 -1887 4718 3754 3846 -4350
15798 -4350 -15596 -17857 -10797 4654 -1418 404 -8332 -17928 -20113 -20897 -30321 -33169 -40382 -38108
15784 -38108 -24657 -25878 -36232 -27038 -11835 -9678 -20633 -29205 -20265 -23285 -29325 -18654 -10084
15771 -10084 -10377 -7734 4444 7325 10147 6996 3184 -6555 4930 6454 9921 14012 11648 9407
15757 9407 -423 -1241 -1930 -6206 -7604 2820 -895 -7007 -9244 -23452 -23868 -11572 -5529 6866
15743 6866 16517 -4006 -22493 -5254 -2087 5230 18761 12056 6506 13033 11789 4480 -6636
15730 -6636 -11531 -15173 -18634 -16217 -8330 -23574 -14432 -20462 -15415 -914 -3683 -10351 -13839 -13604
15716 -13604 -5080 5378 19159 31338 38788 31697 24322 17706 9871 10434 20362 17586 9457 11250
15702 11250 13080 -5732 -13233 -16627 1962 17451 20341 11669 -5076 -10292 129 136 5516 -4205
15688 -4205 557 13301 2527 5998 -1655 -11696 -8925 -1501 -10137 -2507 13007 18559 2376
15675 2376 898 952 5433 -220 -6945 -6147 -7225 5222 12331 2304 3416 1673 4100 16110 17830
15660 17830 16707 26088 12443 2328 10432 18355 17706 16189 8505 9329 21987 24311 17552 12466
15646 12466 10161 6972 15118 13591 2641 5150 14124 20809 21691 6236 2939 1572 -1413 -21331
15632 -21331 -30131 -28987 -31504 -16287 -6037 3493 5858 4487 -6556 -14901 -11733 -10845 -9065 -6494
15618 -6494 -726 8279 21869 15170 3185 8264 6236 3770 2493 -8822 -8636 -2582 11352 16495
15604 16495 29481 35387 26166 14203 14377 7164 16079 16308 6872 -3710 -16122 -28169 -16320
15591 -16320 -6321 -8920 -17288 -33511 -25462 -16434 -14986 -16966 -9182 -6730 -6322 1583 3625 -10
15577 -10 5355 12510 599 -10877 -9028 -12822 -15776 -11041 -12704 -18007 -23243 -14352 9454 30042
15563 30042 28452 15217 9324 2706 5029 14204 9246 21680 28756 16727 16846 15557 11679 6769
15549 6769 295 -4630 -2949 1745 6700 -3466 -2683 5677 15309 17120 3760 -4499 6444 12432
15535 12432 2414 -15363 -10176 -11135 -6724 1876 5675 3563 4769 3454 -7583 -13244 -5529 9569
15521 9569 -4218 -8807 -3186 -6150 -15530 1747 6943 10982 7754 9135 -4931 5299 6902 8059
15507 8059 7900 -48 -3499 -14594 -29720 -25860 -8536 4424 3049 251 -7360 -2158 10088 23689
15493 23689 23559 2085 -2251 4037 1890 743 5769 13418 18187 3738 -2057 -10766 -19606 -14093
15479 -14093 645 3611 125 5941 5209 4297 14237 36462 42293 19371 5437 11034 9906 17365
15465 17365 21002 28501 26648 6779 -822 5003 10771 21195 23813 23416 15002 -12563 -19866 -5911
15451 -5911 11233 16495 13891 6738 7349 -2598 -10642 11 -7247 -14227 -10315 -3712 -1975 9751
15437 9751 16397 14370 7952 6221 5359 -4148 6324 -3444 -7323 -20712 -22905 -20408 -7655 -2611
15423 -2611 -16263 -19840 -9518 -2519 338 -3043 -19173 -25039 -27944 -17185 -12722 -8781 1414
15410 1414 -8941 -16202 -30707 -22803 -15672 -13449 -21773 -17935 -8352 981 4901 10622 10962 10790 -3076
15395 -3076 8157 24403 19667 8721 30535 22824 16585 12530 10329 9845 3297 -5875 -17899 -15344
15381 -15344 -14882 -8165 -6320 -8329 -4632 2027 -2281 12320 959 -13794 -7781 -11650 11588 8612
15367 8612 2014 -19309 -18683 -5202 -3514 13710 26864 23315 9138 1280 -5128 -2219 2570 5416
15353 5416 5375 528 -4704 -7840 -14420 -9581 2456 4356 -3171 1188 -5358 -479 6890 695 -14530
15338 -14530 -20220 -20886 -17195 -17483 -22009 -12647 -3290 -5580 -1647 8259 11039 1279 1215 -2740 1885
15323 1885 -4641 -2794 -5208 -15485 -9464 -4740 992 -5555 -9614 -12270 -9632 -9620 -18581 -5587 12581
15308 12581 24233 13295 11163 10164 1249 585 9891 -297 -4668 132 3158 -7319 2157 8933
15294 8933 14971 13252 7657 790 2570 4384 1370 -8144 -2058 4958 10686 14317 23950 33019 19642
15279 19642 -893 -9116 -5864 91 -4129 -27979 -43225 -28575 -6455 -9683 -17805 -16677 -15356
15266 -15356 -13224 -3068 -1906 -7816 -18469 -18634 -26316 -36283 -28509 -7594 -3189 -20568 -26188 -25927
15252 -25927 -31980 -32260 -18087 -22186 -29910 -22939 -6829 3160 -3398 -14722 -11270 128 2877 3971
15238 3971 -16842 -20077 -15227 6435 18311 1854 -7214 1974 11712 15100 11588 13880 15836 20140
15224 20140 4873 -9152 -8693 7805 14436 -501 -6556 -8885 -14212 -10463 2747 6213 11034
15211 11034 6289 -8562 -9459 2875 2850 820 2718 -9595 -14200 -7305 -6972 -5584 -12057 -14278 -17777
15196 -17777 -9857 -3659 -7006 -12058 -18014 -17319 -2717 1407 -14471 -20284 -25958 -34049 -36812 -26542
15182 -26542 -18418 -15357 -21857 -29373 -14249 825 -1479 -17696 -21687 -12473 -16192 -14239 -16667 -13351
15168 -13351 -8054 -6077 3041 3427 -6097 -8654 -9097 -5267 11163 12661 17657 10366 9863 2842 -11432
15153 -11432 -21711 -18688 1730 15332 18309 21444 14916 12976 6198 10382 -491 -5375 1975
15140 1975 610 1912 8148 10351 1117 1377 -11464 -15468 -33567 -24366 -6907 -4110 -10150 -17861
15126 -17861 -19296 -16600 3248 11553 13697 12894 9042 -1801 -4633 -2525 -13705 -9746 -9252 -67
15112 -67 3021 10 -8702 6754 18517 5141 10552 -2587 -16145 -13279 -7952 122 10191 5831
15098 5831 13519 13252 17212 9836 -9295 -7161 -4786 7647 7624 -12146 -10570 -11715 -13542 -11921 -10043
15083 -10043 -8628 -8594 -6508 -10862 -16694 -10627 -8108 -8078 2875 10183 11980 6780 2605 14046 17497
15068 17497 6444 -9284 -15736 -7350 -2344 4178 1810 -5034 -5574 3061 13461 6460 -3017 -17590
15054 -17590 -7270 -4841 -17805 -28958 -29512 -25260 -23439 -23949 -10792 9366 14531 4095 3317 7600
15040 7600 15612 12840 3544 -9607 -8875 -12109 -21379 -23278 -19302 -26566 -25000 -14793 3061 6328
15026 6328 1954 4836 -1098 -3794 8259 17886 30935 30271 22813 22787 19392 5641 2640 22473
15012 22473 26191 11699 2013 -15944 -20877 -15020 -8679 4177 11157 10049 2028 111 -1090 -636
14998 -636 3631 -11088 -14560 721 8039 22908 28310 14878 11733 6456 3318 1061 3052 -2178
14984 -2178 6736 7693 8293 2742 -576 6123 12595 4615 -4357 -9394 -10570 -15435 -22665 -18042 -9556
14969 -9556 -1537 -13182 -24220 -17003 -6339 3057 -1908 -565 4857 -2951 -9818 -9783 -12340 -2362
14955 -2362 17134 17264 21626 9103 -4557 -5126 10781 18603 20121 23328 16539 10941 -1787 -7705
14941 -7705 -10141 -20770 -22726 -13684 -8732 -14502 -26110 -24531 -26484 -16409 -3293 5392 487 -15758
14927 -15758 -16805 -7517 4005 3490 -7707 -10927 -8646 1875 8189 14693 -7232 -18662 -12029
14914 -12029 -10195 -5831 -6054 -2515 -414 -7509 -13150 -9736 4726 -3560 -2917 -1393 4905 4109 -3731
14899 -3731 -1632 -6891 -11408 -9182 -3121 -530 -7892 4529 12943 16760 10920 11096 5350 1237 5755
14884 5755 -7469 -18605 -28257 -33524 -33565 -27896 -25232 -10474 -7462 -3451 -11936 -20458 -18194 -28094
14870 -28094 -29209 -25668 -19582 -14924 -7682 -7610 -17524 -22563 -27995 -26391 -28586 -28727 -15044 -15343 -27169
14855 -27169 -24940 -34670 -23493 -13912 -11106 -4438 8919 8629 480 -8377 -6343 -11465 177 12125
14841 12125 4402 3997 -1100 5131 -3995 -126 13235 13809 7277 8735 14127 10760 7120 6473 6283
14826 6283 12677 6523 15295 15072 7746 8935 1556 -3531 -10619 -14347 -14696 -18263 -36421 -42992 -16925
14811 -16925 1673 -6024 475 3661 1229 912 2707 -201 -6396 -3005 -15984 -30876 -33072 -25905
14797 -25905 -13600 -7919 -2168 -1508 -11455 -19622 -15226 -8299 4083 -11253 -17653 -17021 1222 8906
14783 8906 -5175 -12519 -17509 -26707 -24948 -23673 -16859 -21716 -18439 -17716 -16379 -12488 3536 11578
14769 11578 10216 3158 5490 9050 12881 5074 -6236 -16004 -21258 -24523 -15917 -10966 -15163 -14958
14755 -14958 -12744 -7252 -2186 16683 24608 2527 -7671 2944 13109 20001 17534 10838 7552
14742 7552 -5417 -7383 4652 -7656 -15035 -19103 -11597 -3236 5881 5845 15052 -1170 -10329 -13893
14728 -13893 4646 14203 18962 15159 -2652 -11277 -16170 -10369 -3978 -812 7046 2081 -11196 -12164
14714 -12164 -18936 -19869 -12057 -5195 -4105 -14620 -26620 -20610 -7913 -10108 -20815 -19129 -16705 -7023
14700 -7023 -6223 -12643 -6876 -665 4784 1167 2480 3785 6593 125 -13076 -33281 -39485 -33211
14686 -33211 -19374 -13203 -13222 -24921 -31531 -21540 982 20812 15398 2343 -1032 4363 14600
14673 14600 9677 4114 7901 15085 14327 12745 11325 12983 16936 904 -3301 -482 -5262 -8915
14659 -8915 -7212 -3939 -3350 -12079 2859 3132 -4826 3795 20573 11804 6220 7220 6327 -4368 -8639
14644 -8639 -7693 -13032 -24640 -24723 -23185 -18542 8757 7208 -6933 -13525 -7234 -5704 -5150 -2001 -13623
14629 -13623 -21317 -20509 -26261 -20660 -10153 -1045 13986 19749 17654 22565 11995 530 -2810 5030
14615 5030 -1047 4673 -3360 2634 6072 3468 -11618 -6275 -181 -446 -10523 -11768 -658 14310
14601 14310 -1760 -13999 -14943 -24515 -26616 -14757 494 -5828 3741 3866 -8144 -23613 -19188
14588 -19188 -13561 -16570 -11942 -6647 433 10406 5196 -14162 -26552 -43136 -40366 -23687 -18687
14575 -18687 -2348 -1797 -12309 -7164 -6519 2933 4459 3569 -114 -5350 1337 -3658 1041 5871 5319
14560 5319 10145 18417 17744 12034 16249 20955 31621 31922 15467 -2010 -3856 -10448 -3983 2719
14546 2719 -10549 -25461 -25536 -26368 -25208 -17537 -21605 -23354 -19996 -13070 -13672 -18640 -13466 -7657 -7771
14531 -7771 -12681 -13617 -2519 -1072 -25974 -20716 -9618 -2209 7508 4827 -1122 -987 698 10008
14517 10008 631 -3541 6532 4833 8786 -2069 -10023 -11854 -13942 -1445 8459 -3676 -18959
14504 -18959 -25165 -11706 29 6668 -3002 -8913 -10822 -6172 -13312 -12106 2125 2445 1375 -10652
14490 -10652 -4539 4208 9368 -3087 -15856 4082 14188 8006 -11028 1616 14868 6687 17096
14477 17096 9712 -2800 -12923 -4520 6729 8616 -4419 -9305 -8652 -502 3955 -3617 659 11364
14463 11364 -806 -18759 -32002 -20817 -12205 -21059 -15317 -15276 -24979 -19791 -16685 -9538 -7704 -11013
14449 -11013 -9715 -2362 8285 14653 26780 17882 3977 -560 -4668 -9966 -24453 -24654 -15878 -9762
14435 -9762 -13239 -20968 -20643 -12443 -23711 -14927 -11885 -21370 -23164 -17833 -18574 -9279 1280 3174 398
14420 398 12170 10568 8296 6272 8715 6130 6243 -1262 -13868 -18197 -24700 -24064 -19984 -12813 -6424
14405 -6424 -2748 -6382 -23105 -20153 -13665 -13960 -11752 -20854 -12504 2907 18071 35440 25463 -4695
14391 -4695 -17678 -33493 -40569 -32923 -19846 -24693 -43935 -44146 -24365 -16283 -22246 -11095 2567
14378 2567 17274 19821 17326 11891 9082 4239 -163 -4368 11625 9234 457 3379 611 -13452
14364 -13452 -10548 -6625 -11988 -5499 -3509 -780 4322 1743 8464 4407 8606 15074 -3495 -7392
14350 -7392 -5713 -15258 -21425 -12842 -6569 -9019 -4981 -4224 1770 10757 19375 13777 -7033 -16065 -9183
14335 -9183 -29862 -25935 -27423 -25737 -24972 -26802 -31588 -10785 -2313 1435 -4803 707 -5614 -11804
14321 -11804 -18283 -10865 -6051 -23659 -28173 -22222 -5363 1778 -571 -2661 -9286 -16985 -7762 -3271
14307 -3271 4735 12023 4571 -2227 9291 9631 -468 -4288 -3116 -15749 -30718 -30548 -41083 -38217
14293 -38217 -24470 -10996 -6689 -8024 -5087 -13217 -14968 -21785 -27857 -16457 -15594 -12259 -11484 -19227
14279 -19227 -17182 -15333 -3489 -467 2664 6178 11948 4195 -5419 -10231 -6450 -12684 -17314 -21346
14265 -21346 -3333 11115 4480 -3967 -1877 10672 2614 -8684 -20509 -10407 45 -458 -151
14252 -151 10576 5391 -1840 3016 10469 8772 -6184 -20000 -8533 1084 10450 9501 4823 501
14238 501 -4802 -5260 -16663 -20979 -28894 -22531 -25953 -26022 -27926 -24962 -12255 -28232 -27734 -26361 -12321
14223 -12321 5371 9796 11895 292 -4996 7531 16883 5659 -545 -8583 -19397 -11379 -3996
14210 -3996 -9169 -24660 -26281 -20366 -13391 -18809 -27460 -29175 -22263 -9610 84 -1616 3985 -5167
14196 -5167 -6990 4545 1611 -1187 10501 22907 23538 9849 -4939 -5533 3786 -10080 -3182 -4450
14182 -4450 -1626 6099 5102 3389 2887 15775 17305 18133 16962 18912 20173 29717 24828 8348 -3983
14167 -3983 -1114 -5445 -14154 -15079 -19181 -35670 -30284 -10122 -1131 17796 12817 3896 3505 -3273
14153 -3273 -4567 3409 784 -5805 -9600 -16949 -14545 -15157 -5917 -8897 -5660 -1968 -6243 -9846 -2483
14138 -2483 -6553 -3986 -3410 5998 11886 -2067 -1320 5669 6668 -10368 -9444 -7160 -4836 -16595 -30788
14123 -30788 -23950 -14448 -5794 8836 21332 24334 14759 4721 -10968 -24499 -30452 -7397 -3421
14110 -3421 -24727 -12056 2109 -6502 -8173 -3420 2859 3973 -10950 -4484 -6039 -20915 -17950
14097 -17950 -416 -8615 -14847 -3685 3123 -14742 -19198 -15120 -17117 -4758 -1053 -7723 6579
14084 6579 -1124 -1404 6922 1490 -22024 -34796 -31039 -27653 -20345 -4640 -16506 -22243 -10566 -442
14070 -442 2135 -9546 -20893 -16349 -21924 -19086 -15730 -15578 -12168 -2070 8245 -2753 -15359 -15783
14056 -15783 -10461 -3570 -7454 -9078 -6115 -6896 -13448 -13506 -9956 -756 -1006 -744 48 -10542 -23465
14041 -23465 -43255 -42209 -39339 -27764 -31991 -29528 -32945 -27183 -25836 -21479 -17262 -24541 -20290 -13039
14027 -13039 -19187 -23435 -25960 -10377 8169 -34 -8108 -3896 -17917 -12103 -2862 -7401 -6053 -6530
14013 -6530 779 4986 -4802 -7911 -17282 -25574 -9598 -3908 -2631 6571 9820 1926 800 122 -4795
13998 -4795 -1494 -2344 18304 14322 -1674 -11060 -11639 -15143 -22180 -34327 -31946 -22622 -10719 -8225
13984 -8225 -12799 -22192 -5832 2261 -628 10021 8136 -14441 -13901 -12561 -1807 1158 9755 18499
13970 18499 18235 9988 10866 9325 418 -2557 788 8177 7423 5175 6100 18572 12271 10791 18035
13955 18035 19217 4334 -1949 6487 4936 4104 1160 -3826 -2310 -4157 3523 -5824 -19228 -17124
13941 -17124 -18652 -20533 -3878 -516 -3591 -2870 6310 -874 -7865 -16345 -13570 -705 -635 3072 7560
13926 7560 -689 335 9910 26066 16960 25359 24070 15547 22766 10835 10386 10683 -17504 -32576
13912 -32576 -10352 7367 11753 5960 7948 -2021 -4190 -2269 -4557 -15472 -14267 -14865 -11487 2530
13898 2530 10590 5722 477 7626 -1929 -9954 -8577 -18708 -19377 -18641 -9013 4139 -7270 -19645
13884 -19645 -4494 -12210 -19409 -26825 -14715 -10195 -13586 -4608 1233 -3105 -1185 -12577 -18252 -11383
13870 -11383 -15729 -8013 636 3739 -7934 -12830 -9219 -1290 -4178 1620 -12706 -13721 -9399 -9158
13856 -9158 -11713 -3594 10785 22299 27304 25881 19761 18756 19425 16044 -9630 -29704 -37302 -31787
13842 -31787 -6390 2620 -5312 307 323 -8120 -30853 -25664 -8004 -5965 -13776 -20394 -11455 6385
13828 6385 11757 305 -2770 6905 -2295 -11441 -5150 3180 -73 10112 10137 5696 -699 6942 2036
13813 2036 -8482 -3571 7380 4732 21466 15718 8992 5722 -590 -310 -4928 1585 -3254 3756
13799 3756 18261 13519 4173 -7181 -10015 -530 -9470 -18268 -17722 -139 19617 17516 -1722 1786
13785 1786 -2276 298 -229 -6384 -1987 8846 6834 -8108 -3727 5181 7287 -2473 2585 -1871
13771 -1871 -6633 -6465 -3085 -2523 -3612 -11222 -17853 -20810 -19206 -17420 -20636 -22324 -23621 -19959 -16961
13756 -16961 -6787 7612 -1916 2156 -5481 -17799 -3207 11217 13170 -911 -25097 -28085 -19654
13743 -19654 -11653 53 4454 15221 19873 6200 -9885 -16609 -24518 -16423 625 -2782 -12871
13730 -12871 -15877 -12480 -6759 -2453 -13968 -17764 -12451 -11842 -14920 -15481 -25148 -31148 -4157 8144
13716 8144 4604 -1775 -10544 -12961 -21919 -6258 12431 5861 -4420 -5446 -8373 -1869 -5562 -5451
13702 -5451 -10063 -7689 -4844 -12542 -6472 9479 17576 10432 5903 6717 9135 -1290 546 -6325
13688 -6325 -9289 -16545 -24920 -31033 -31467 -30367 -46588 -35475 -16706 -10305 -9550 -2526 5495 -174
13674 -174 -14475 -18270 -11673 2189 1669 -6679 -7882 -4367 -12174 -8383 -5809 -4149 -3352 1568 -536
13659 -536 -2797 3412 3988 -5986 -24452 -20024 -5632 -4694 -12859 -9427 5578 -1054 -7751 3278
13645 3278 7913 447 -3040 -5118 -13971 -8552 -16091 -27066 -21096 -20001 -20936 -15606 -7081 -9523 -7152
13630 -7152 1335 1745 -3858 -4196 6718 -1359 -14359 -5429 -2919 -3875 12324 15540 4313 -200
13616 -200 -2410 -1678 -1370 7417 5506 9237 394 -10491 -15488 -30376 -28180 -26904 -13699 -4985 -8359
13601 -8359 -3975 -3764 -897 17072 5043 7012 9787 13297 3881 -1803 7813 30332 30316 11641
13587 11641 -5446 -8141 -4152 -2010 -8969 -15025 -22060 -18431 -15231 1088 -340 -15558 -2856
13574 -2856 3855 -129 299 7437 20322 16021 4431 -540 11265 15869 15244 12789 2941 12440
13560 12440 -221 -4282 -202 -1439 -7795 -24124 -27462 -10096 4448 1529 -7743 -3912 -2858
13547 -2858 -2400 836 5287 1558 -14237 -24962 -29258 -20060 -4378 -8215 -22331 -19334 -6058 8720
13533 8720 10716 12917 3444 -4429 -9621 -7344 -6360 -2075 8502 7391 4821 -12262 -14327 -3030
13519 -3030 448 -4581 9677 16551 28372 20882 11281 -6513 -32712 -43830 -29498 -19860 -15499
13506 -15499 1933 15647 18370 12000 307 -16820 -11337 -5813 -1524 -6819 -26147 -17565 -10950
13493 -10950 -9219 -10653 -2676 -2105 1674 9604 6368 1239 2260 4219 3311 3705 604 262 -5233
13478 -5233 -5007 -13049 -3910 3860 -2350 -386 -4981 -8322 -13623 -14660 -9407 -9500 -365 3679 10935
13463 10935 7679 -13384 -2634 21085 18760 9865 627 -14645 -18203 -5074 20138 17951 -6899
13450 -6899 -2230 -984 21654 15762 13299 143 -6061 -12658 -3351 -6014 -6525 9218 -3877 -10284
13436 -10284 -15246 -16668 -7924 -16908 -14533 -987 2658 5894 16447 -4503 -19521 -17061 7243
13423 7243 7263 -1861 6504 11167 14792 20140 13871 10569 5730 12913 5553 4149 15224 10930 -5049
13408 -5049 -5956 18445 27400 35914 42251 39119 29737 16494 6435 11960 15581 7725 1314 6308
13394 6308 1018 -8750 -11206 -7358 -8291 1426 18061 18977 -219 -4612 10989 7961 10161 8384
13380 8384 11169 2562 1505 3135 3987 -1444 -697 -8888 -3359 1089 -17605 -19325 -19652 -11366 -19836
13365 -19836 -25048 -28589 -26432 -4257 1035 8229 25326 27768 18279 15940 3668 5955 1425 5041
13351 5041 21043 29242 27504 23892 34449 30225 8987 -938 10165 24258 17463 15353 -474
13338 -474 4808 -533 -3740 3142 -3446 10542 1441 -5740 4879 -4801 -12860 -6746 3561 20344
13324 20344 9233 -16603 -17610 -4379 7803 10852 9510 4779 5255 -3004 8440 4250 358
13311 358 14616 15187 4111 12128 6929 1071 -77 -4709 9945 11544 13336 -4157 -12431 -14649
13297 -14649 -11854 -61 6977 12717 25090 24003 33469 49430 41175 37405 20277 8260 23360
13284 23360 15989 685 -15029 -19578 -4295 -1181 330 16213 23488 13547 11721 7477 6034
13271 6034 -3155 930 10093 21425 30053 29396 39516 47693 57547 61934 52233 51544 54982 101669
13257 101669 152928 203556 275299 366709 473969 584396 676118 750634 805112 845200 858993
13246 858993 843581 811509 776108 724767 634545 533577 420411 328411 273081 240122 210815
13235 210815 202531 186058 172245 165690 145512 119735 115513 107450 108005 90214 91416 80847 74194
13222 74194 66809 68921 74005 84694 80286 63383 60749 62132 56147 57196 49593 61592 53611 64742
13208 64742 62281 57725 59279 45692 42298 33365 34774 39861 27839 31251 46611 53975 60099 54911
13194 54911 37103 25598 34401 36285 34053 44577 55643 54172 52038 35256 26427 32064 33751
13181 33751 25307 12403 22815 21958 25394 39512 41041 30734 29346 26083 28643 29599 21215 7517
13167 7517 5886 8629 17423 33442 31357 28555 37068 33978 22979 25278 23875 13790 13555 20705
13153 20705 22661 24499 24349 32416 43697 43204 40966 39985 42366 45413 47432 43459 48184 52253 42319
13138 42319 47203 78109 114545 178852 273181 380334 527555 697924 833223 919475 949799
13127 949799 905468 779383 599128 433534 301797 224248 179781 161995 145576 139134 110263
13116 110263 107192 103835 96957 96552 96488 96639 89693 77789 80162 76469 68119 60513 60320 69071 67624
13101 67624 77693 71521 71343 73260 70338 54946 54768 54366 54210 41995 43201 49341 51687 53370 55442
13086 55442 63657 66803 77496 89107 113389 119641 111884 106238 127575 135826 124696 120617 131466
13073 131466 139247 129627 121177 119941 113469 114214 124322 116474 114852 123372 111952 88637 77747
13060 77747 83012 83296 98770 115747 112959 96049 79558 72970 68894 70308 67317 61482 77809
13047 77809 63668 53071 68193 83244 76031 60528 75227 80617 68124 68672 73038 65166 55907
13034 55907 51725 47513 41976 46268 39907 29219 40575 28609 22225 21214 18854 5559 -12356
13021 -12356 -18852 -7131 -1071 -10400 -19378 -2841 -17707 -15896 -1183 18310 34623 51177 46598
13008 46598 46660 60901 68939 72642 75682 66560 61256 66668 70323 80631 78504 77313 67706 60649
12994 60649 49364 47451 36164 24847 23535 35223 34417 36284 47405 43748 53433 59259 57115
12981 57115 73619 100216 103019 101820 111542 115341 119259 114142 109732 120544 125235 98762 99029 105324
12967 105324 85844 68130 78220 83360 80793 84445 88272 83833 83253 86425 94454 86606 72761
12954 72761 61785 52167 62686 83784 97022 109871 111441 89056 67805 71179 95350 107664
12942 107664 97890 92115 105802 123324 120331 119214 141920 158838 158510 151581 152916 164110 166345
12929 166345 161260 163797 165842 173721 181870 186599 194264 196450 193638 189899 202692 221392 215805 207304
12915 207304 223519 245766 254950 244846 234811 250933 258548 260376 248306 232889 239355 260627
12903 260627 269181 273660 280974 291588 297750 296785 299802 306053 306418 304908 304137 302524 308192 305153 294379
12888 294379 296861 310013 325676 334536 346021 343365 338568 335752 358167 384768 391292 386138 399717
12875 399717 412843 433036 454085 481916 508001 552374 600629 658350 706945 758136 828251
12864 828251 896648 965786 1032112 1095595 1136917 1181667 1247178 1287986 1295938 1310888 1350874 1417413
12852 1417413 1499209 1589459 1668461 1765739 1889392 2043628 2235304 2485285 2775484 3127610
12842 3127610 3600602 4164088 4819461 5587530 6437654 7373277 8408727 9603000 11084096
12833 11084096 12996829 15636366 19432178 25154173 33988266 47300692 65558093 87182673
12825 87182673 109224737 129117099 145333276 156656112 162487512 163397768 160934717 157052221
12817 157052221 151190785 140339848 122902047 100718621 78253513 60234869 48065784
12810 48065784 40288090 35194096 31666726 29041463 26943458 25186826 23648111 22277533
12802 22277533 20994106 19733457 18482109 17290404 16188398 15191364 14313233 13548653
12794 13548653 12873884 12261745 11702373 11198570 10731138 10299301 9923748 9575604 9249706
12785 9249706 8948839 8668763 8370557 8068686 7789772 7531631 7272104 7015674 6766800
12776 6766800 6525183 6314921 6110726 5901201 5694260 5531707 5369028 5209177 5047385
12767 5047385 4896602 4760730 4623568 4475468 4334626 4196821 4071941 3937333 3812179
12758 3812179 3701037 3593215 3491093 3388656 3282994 3174383 3082633 2990299 2893654 2806612
12748 2806612 2717774 2625323 2534707 2467198 2406306 2332833 2270596 2225308 2173206 2119669 2064230
12737 2064230 2000820 1961746 1941147 1900638 1876440 1867702 1854970 1839621 1809726 1764985 1719706
12726 1719706 1690356 1654372 1617480 1576607 1536799 1495225 1445738 1381065 1341643 1300981 1267351
12715 1267351 1236060 1188565 1153906 1105277 1050768 1017925 974192 934944 890180 863754 830288
12704 830288 805246 782718 754736 702063 669861 668436 672191 678421 680565 652658 626720 610752
12692 610752 579073 544856 531315 512873 469931 430387 405878 381052 356600 343256 334888 331892
12680 331892 314257 306159 287045 284108 285937 269352 247455 236339 239753 237248 241680 222858 214113
12667 214113 201588 171947 155923 166517 172381 171767 177797 175985 179262 190382 200596 203650 231886
12654 231886 267598 284005 277113 279452 276572 280945 270381 246821 235869 240486 242133 227760 227101
12641 227101 218827 199468 204410 187713 161932 157709 161069 173985 179598 181061 175100 176669 182881
12628 182881 203379 222583 212042 207702 208666 204448 198896 187083 184490 181239 177099 196157 210440
12615 210440 213303 205820 178439 169969 173975 171044 168785 160552 153499 146843 137935 128703 128345 152340
12601 152340 167432 157441 160370 157281 161908 161710 154330 141490 141529 140193 137097 133575 123687 127046
12587 127046 139460 128769 117053 111720 110063 105290 106650 127390 129841 109895 103118 102068 105755
12574 105755 106510 109753 115486 103618 92720 106191 92506 77000 80069 89138 88575 89390 78335
12561 78335 66602 59375 47167 38331 44542 55396 69345 76534 66593 42240 45689 42153 50482
12548 50482 54840 50371 44629 38682 37436 44583 47103 46561 41198 35564 48813 65552 74497 64592
12534 64592 44659 16752 22801 24241 25038 39549 44069 38070 41840 45204 36567 39260 51139 48725
12520 48725 48392 48467 48997 50061 52262 61505 69134 72494 68302 70277 76966 66707 69853 66944 54599
12505 54599 49011 50492 42902 48496 66777 68566 75882 74832 69482 62808 39739 24462 14800 15102
12491 15102 22646 40161 50240 37850 38219 66931 84746 90575 106713 106730 93744 88402 79667
12478 79667 68438 75799 65676 71694 60702 50717 55953 56591 63938 61754 48470 36532 30095
12465 30095 46579 61001 69002 61729 54540 46578 56508 55034 63201 60720 61790 59563 40368 39416
12451 39416 52617 66834 70351 47228 31158 28414 28227 35249 30506 29798 38600 35134 42673 56093
12437 56093 42444 29025 17377 16500 17019 25430 37410 28584 19626 21333 36668 51490 48138
12424 48138 32759 29418 29614 44366 49914 48887 23909 21356 24526 15590 8925 6896 3310 10392
12410 10392 22829 31978 46987 53940 51882 49502 59449 55559 65609 81717 90568 112723 129531
12397 129531 147415 189642 247742 328866 414667 511915 611283 705396 780714 830450 851372
12386 851372 854778 827188 793521 763794 674690 561385 437819 344330 272192 215671 183999
12375 183999 171311 170591 162569 151322 141666 135428 131615 115298 105538 110627 107078 102243 102411 97453
12361 97453 104450 107809 95567 83771 67742 42624 23205 28712 42030 40483 39369 47754 60805
12348 60805 71282 69551 66576 59098 62738 71419 76266 85678 94130 112354 136730 167172 190587
12335 190587 214508 241606 250671 255417 258139 252062 231364 211245 198924 167671 138385 116184
12323 116184 94551 92063 100171 88009 68195 49619 53147 59727 59115 61940 56958 60326 72857
12310 72857 66152 60202 60291 68734 63294 38628 44749 45144 44336 47346 41590 38335 39129 36101 42438
12295 42438 31686 38666 26471 15920 28766 27306 12670 22061 23436 25771 23122 26606 22301
12282 22301 25489 19983 20525 33755 45439 45889 32203 42441 51397 54614 53122 51451 36269 27015
12268 27015 24233 21138 7417 2678 1751 19816 28128 14058 5000 12192 2406 2782 12823 18539
12254 18539 7476 2687 -970 -17896 -18693 -7435 -3046 -2954 -15312 -24355 -13475 -6751 -9561 -22415
12240 -22415 -17481 -8007 4669 3362 -14817 -20992 -7087 -1784 -789 7821 -2256 -18432 -38593
12227 -38593 -41774 -39603 -24488 -15245 626 7584 -2557 -6370 4692 -321 -9067 -11403 6349
12214 6349 4233 1332 -1654 -2964 -7934 -13942 -17673 -15996 -13551 -5414 -4826 -10246 -14883 -14114 -19047
12199 -19047 -21866 -12611 -9827 -10010 -14143 -4025 407 -4733 14606 21598 21122 6291 8057 12458
12185 12458 8993 -809 -4110 -7116 -5953 3902 5626 -1686 6304 10693 15930 18325 21054 8356
12171 8356 -1837 8140 14863 5278 14948 9832 3582 3594 -1620 13000 14618 4849 -5949 -24554
12157 -24554 -22489 -16351 -17000 -9364 -3494 -2097 -4649 -11441 -9123 -20637 -8932 -3665 -17046 -17316
12143 -17316 5959 24760 17898 -1214 -12640 -11201 -11806 -18443 -6473 -9937 -11392 -15504 -19549
12130 -19549 -10616 14550 29370 14010 13062 16785 12149 12629 7176 -763 4278 8137 19487 18406
12116 18406 23200 15064 11151 7256 6877 7882 5209 -4369 -10324 -9242 -10892 -12999 -14349 -17783 -16591
12101 -16591 -17142 -15912 -14991 -3395 -832 -3433 -11109 -9515 -4687 -5256 -8410 -15560 -14305 -17426 -7364
12086 -7364 4886 7465 10452 1707 -4142 7360 -1930 -17474 -13075 -11635 -14647 -15438 -6713 -11116
12072 -11116 -23082 -18242 -13871 -20420 -12441 -13578 -10797 -22267 -21720 -30994 -14822 2624 -35 -10636
12058 -10636 -9175 -5287 1453 -2083 -6554 506 14888 1562 -4032 951 12477 16702 19481 3544
12044 3544 -629 -9211 -5942 -7679 -15413 -7497 7542 15640 19441 16550 14127 22461 16441 14479
12030 14479 8050 1788 13256 13624 14811 14619 16676 17377 24177 27700 38575 37852 23797 11796
12016 11796 9039 16436 15729 7727 19139 16119 -2728 -6419 -9571 -2669 18620 21567 20179 18413
12002 18413 8251 -12707 -21434 -3970 10274 799 -12625 -7847 -6904 -5714 -3405 366 1367
11989 1367 7603 3401 6194 -355 1955 2059 8094 9013 12403 7603 -6883 -19420 -20743 -18527 -30494
11974 -30494 -35919 -18806 -515 -1306 -4054 -186 -8490 -13353 -8447 -5137 -6816 -9105 -2536 -12202
11960 -12202 -15347 2296 10602 -2128 3998 13621 19599 12292 6342 1997 -6642 -12829 -6858 -9152
11946 -9152 -1541 5711 17435 3862 -19769 -2746 2436 -8626 3930 -6417 -8938 -10341 -7463
11933 -7463 -6318 383 5559 14649 14691 17593 21629 18413 12476 8186 8473 8591 -2263 -1560 -6513 -25554
11917 -25554 -23841 -7662 -3795 -6325 5264 14881 -696 -7904 -981 15811 6654 -5829 -7744
11904 -7744 -16032 -22625 -26402 -37444 -34868 -17615 -11941 -6686 -6471 -8890 6277 2420 -4410 -697
11890 -697 8744 10512 16452 12315 8362 1965 -2311 -1669 -3314 502 -7473 -6580 -9338 -1112 4623
11875 4623 3675 -1444 -569 15056 17232 9207 3900 5389 7965 7658 13515 3905 -5088 -7758 8326
11860 8326 605 -1496 1118 13861 5582 975 8662 19941 10149 -12365 -3067 -1987 969 -4403
11846 -4403 -24745 -33189 -22588 -22614 -18419 -3687 1052 773 -7792 -23937 -27182 -9751 -2830 -10180
11832 -10180 -16786 -15232 611 15748 24347 13869 9983 130 -6719 -1661 6924 15700 10193 23822
11818 23822 18158 12951 16812 30765 45260 54887 57685 56511 38838 38549 47418 19149 3034
11805 3034 14266 15098 20723 14766 8896 17177 18783 4511 -11247 -8871 -4341 -12172 1504 8066
11791 8066 -3757 -17925 -13291 -4869 -4419 2412 5470 -5064 -16368 -9420 -3951 -9771 -18918 -26428
11777 -26428 -23449 -21087 -21587 -14745 -12991 -15885 -20704 -26619 -24529 -16385 -13688 -16386 -18478 -4974
11763 -4974 -1399 6326 6719 -3130 -5927 -2848 -1297 -6390 -10274 -4968 -10707 -8716 -7071 -4982 -2052
11748 -2052 2483 12479 22525 31174 19854 6938 12300 6747 -14606 -4671 4596 -5153 -6570 -10057
11734 -10057 -6446 -54 9962 -3368 -15638 -16825 -23951 -8988 -8240 -15928 -14636 -639 1111
11721 1111 -12928 -12702 -11184 -8322 -9558 -10756 -2860 -14264 -18909 -14608 -5230 -7267 -80 -249 -21757
11706 -21757 -26454 -14619 -8790 -13548 -16690 -11449 -8119 9859 11510 8418 -14457 -35154 -35338 -20556
11692 -20556 -6848 -14278 -17245 -15925 -20693 -29563 -40023 -33018 -20933 -4467 3629 1535 42
11679 42 1320 -7685 -17284 -18867 1054 -806 -9932 2767 6328 5938 -2614 -10344 -29161 -29144 -18629
11664 -18629 -6263 -7928 -7201 -5123 328 2445 -15690 -29362 -29191 -12083 -2890 -9746 -8192 3437
11650 3437 5829 2916 -5509 -15881 -26399 -18074 -7888 -10076 -17349 -11024 -9081 5120 24697
11637 24697 15458 -1636 -2762 2557 11023 17090 13840 12622 -728 -2316 3413 8053 13078 5900
11623 5900 1060 1010 -11246 -19076 -20518 -17590 -5960 -7967 -14640 -10453 -16886 -14873 -1993 12478
11609 12478 9743 -4075 -7443 -13358 -23973 -27926 -13816 -3691 1392 -3275 -17863 -16166 -15791
11596 -15791 -20526 -20412 2207 10398 7939 6000 5744 -1357 -13466 -18389 -25842 -13364 6543 27264
11582 27264 26666 19637 -2694 5049 10285 -804 -12707 -3932 5122 -5356 -3409 5952 2542 1510
11568 1510 5103 -17136 -26708 -21808 -14453 -5439 -11961 -18147 -14988 -20114 -21211 -14549 -4674 -7102
11554 -7102 3361 10004 16590 15237 -1312 -15709 -2849 5166 -10426 -12223 -14885 -13801 -3988
11541 -3988 -9692 -276 11883 21629 8000 -316 -5443 -6311 -6967 7561 -878 3606 13438 -2761
11527 -2761 -7357 1307 12623 11492 16902 23037 12359 -3583 -551 14150 15591 8074 6610 6891
11513 6891 18941 14948 -940 -6317 -11962 -22959 -24514 -11154 2366 -8560 6165 21600 10061
11500 10061 8673 -3529 3590 8027 6610 11167 15566 8999 -1563 -6056 -7134 -2957 -14892 -18180
11486 -18180 -15371 -11370 -15996 -24935 -25903 -13063 -5868 -3819 339 43 -10737 -14526 -15905 -26281
11472 -26281 -9258 4928 6710 -2394 -11814 -15140 -17047 -9866 -11711 -11217 4543 15940 8666 7850
11458 7850 -5115 -19475 -7202 4166 12185 2757 4971 17963 17382 6812 8772 5141 1188
11445 1188 -3600 -13238 -19025 -26292 -17996 -4995 7743 25590 20523 -15631 -20917 -18085 -16859 -12622
11431 -12622 -8264 4582 -15719 -16550 -21417 -23084 -24095 -27609 -28703 -20207 -3431 2601 -15782 -18680
11417 -18680 -10179 -9910 -10767 -11270 -22482 -21303 -13711 2126 3855 15298 8621 6509 8033 7017
11403 7017 472 -8611 -22798 -29030 -21998 -27906 -32260 -28011 -26449 -24752 -24092 -23627 -26816 -30462 -27391
11388 -27391 -28262 -22807 -7541 -4768 3408 9133 -723 -9716 -7583 -7095 -15912 -6796 10956 10861 5069
11373 5069 -3090 815 12163 15892 24238 6918 2530 2757 -1504 362 -7437 -19997 -7978 7141
11359 7141 7868 9691 19830 19008 19040 8899 8137 16391 19519 9218 -1222 -2665 15593 25336 31556
11344 31556 31182 30485 26687 18927 7455 2602 7912 19094 19296 13779 14308 5690 2379 -847 4067
11329 4067 -5740 -9619 -12782 -18832 -14895 -18184 -14304 1492 -9836 -15716 -10500 -5117 -2393 -12416
11315 -12416 -9264 3354 2784 10361 15901 19022 8766 -1768 9153 16526 13617 13823 9609 -2339
11301 -2339 -4371 10751 19324 13602 1484 2489 5663 -997 10112 11865 3994 -6238 -15305 -15907
11287 -15907 -18822 -11361 -16109 -16774 -621 13793 16722 19966 -1535 -5125 -8053 -1628 -5576 -9969
11273 -9969 -11735 -19097 -18216 -13894 -21948 -15510 -6518 4017 8371 7463 3562 2816 10294 13655 21702
11258 21702 34543 35384 20349 1322 2348 -2765 -3818 1161 6979 10643 6413 15733 27761 21444
11244 21444 5341 -3044 5362 23100 28690 20090 15607 10251 1170 -8000 -3950 -8952 -8796 4287
11230 4287 9557 15248 16704 26444 36786 26718 20783 7011 22884 35297 33639 38918 36590
11217 36590 38229 39204 46022 44948 35699 29739 21285 24467 16832 14188 15803 15157 12450 8150 7460
11202 7460 6653 -1433 -8408 -6025 -3340 24175 29051 30820 43650 42859 37390 27175 23386 31147
11188 31147 41507 28974 31132 40453 41500 49530 47470 28498 18393 21011 11230 1514 3189
11175 3189 6937 10581 18108 17980 19363 22646 23229 22035 28557 31882 33567 24233 18350 14041 4467
11160 4467 7956 10015 7427 1867 -2146 974 6800 1929 12883 16874 7703 7042 5766 7503 15867
11145 15867 10195 17795 31069 43889 50611 56625 59075 50462 32529 33567 35241 42521 42643 37003
11131 37003 28938 23309 20975 15957 18046 30941 28327 25750 24283 15591 16340 13767 11219 12573
11117 12573 10360 15347 14270 3166 1260 14077 11999 3886 1909 -1094 5097 -851 -9306 -8418
11103 -8418 -6073 -7020 -4363 1019 298 -1477 -477 25717 37883 40919 48234 48042 44650 30002 18847
11088 18847 24217 26804 22773 27916 36138 36340 30006 19874 14374 24528 30992 41288 29471 30119
11074 30119 37742 40793 24369 18435 33294 28442 17074 -4029 -19666 -831 24868 20033 15922
11061 15922 19363 16672 13978 12285 -3222 -11239 -6107 8001 20307 19227 25332 36311 45351
11048 45351 55427 69106 75588 80932 75074 83137 72434 81239 76070 78134 71824 56855 55210
11035 55210 71573 71920 55250 47515 35972 37036 41563 43264 54053 53190 41957 41745 39135 38000
11021 38000 46193 49356 54624 63183 64022 57401 55080 52648 47567 45971 52455 53754 59484 57667 53379
11006 53379 40127 21985 16276 32871 50852 56352 53870 62917 80677 86909 100740 101564 104524
10993 104524 100627 104782 100187 97979 104044 108947 114726 126523 134075 134677 127136 120227 109425 106253
10979 106253 102981 99501 98920 99446 110556 121078 126504 122623 133922 174259 224956 291429 382907
10966 382907 541377 781901 1122402 1482020 1773798 1947630 2007693 1909895 1558298 1131355
10956 1131355 804670 605094 475099 401010 351395 336577 317135 294159 275760 259398 251774
10945 251774 256900 252150 224926 199575 199757 196340 194078 184256 169999 158309 146969 142519 121408
10932 121408 119818 133733 116920 120221 120691 107663 103436 97125 99286 85243 82668 87453 86649 80910
10918 80910 75814 72509 60330 46901 64453 70183 70248 75409 71839 69196 70656 58339 55414 49480
10904 49480 48964 47141 34411 23627 31806 32148 41277 38280 45240 55228 48493 30839 26088 29711
10890 29711 32472 31024 35143 34888 42529 32635 7879 9998 27680 19466 5756 6601 -729 -1123
10876 -1123 18364 27748 32003 22475 22496 20975 22893 28884 24649 17438 23611 30078 27024 23027 24208
10861 24208 32872 32764 25692 26657 27967 13614 10729 12099 9900 -6260 -10441 4870 5797 6646 25801
10846 25801 26687 18192 14855 9239 -3718 -12561 -20659 -24026 -9884 -279 3183 5462 11016 13866
10832 13866 10741 12546 -2000 -4609 9478 20486 27501 45841 55934 51811 47054 27883 16115
10819 16115 27800 41614 45107 30139 11027 12596 20493 37752 40608 48347 58983 65065 77579
10806 77579 101984 103615 92240 114333 130648 146026 164026 177829 182223 186516 190458 195656 190413
10793 190413 188126 202519 207128 209563 216064 206325 179854 152902 147059 138887 122246 130946 125890
10780 125890 123013 121778 130016 135396 128048 126498 138843 126698 122113 112454 112964 120920 99182 75860
10766 75860 68739 71722 78020 89702 102767 114603 103129 90589 89757 107558 110109 108630 108184
10753 108184 104908 90298 67887 50333 43776 52220 46767 21971 1907 -5172 -21508 -32432
10741 -32432 -21750 -26183 -29331 -25489 -12284 24037 30412 19526 25686 61356 92958 110123 106642
10728 106642 95332 97131 110436 112025 119528 125759 121439 106679 88248 75490 79577 75340 58677
10715 58677 28133 28681 24521 19791 24608 35427 34923 24754 38103 61987 90762 118227 137266
10702 137266 141609 152194 165202 157435 166401 179062 171295 159385 149491 146130 129781 106743 83606
10689 83606 84262 91212 97890 110513 135651 148638 135356 126398 123674 123037 120886 131314 137504 134122
10675 134122 132263 141697 134077 92417 63167 79459 149345 237742 274883 256456 225004 203705
10663 203705 182164 158430 147274 128875 123777 151730 180632 206300 232546 258769 270258 273015
10651 273015 259012 241954 250173 242248 242333 252571 261691 261965 256512 262370 275199 294308 308066
10638 308066 330451 340201 350708 347966 356092 369229 370518 382071 373811 368810 372895 381033 376122
10625 376122 388271 401128 434116 460046 477547 496661 519825 561101 631446 725286 875054
10614 875054 1149272 1483335 1742905 1907036 1993015 1995817 1747620 1362223 1074013 920910
10604 920910 836125 779652 753149 726177 706004 701848 704946 718149 736013 744551 749309 755691
10592 755691 766914 818771 900094 973993 1047699 1132431 1209780 1282749 1343886 1374533 1390476
10581 1390476 1407356 1457841 1539269 1630144 1741016 1876194 1993233 2088861 2181130 2281958
10571 2281958 2408462 2542396 2704628 2918920 3188512 3541556 3978733 4545720 5274509
10562 5274509 6102361 6913430 7670774 8397406 9056786 9644014 10389233 11587563 13362874
10553 13362874 15868471 19347571 24197566 30943151 40474974 54916945 78257376 116774971
10545 116774971 176188883 249902869 313286134 351878780 372600015 373597970 327597025
10538 327597025 241128736 165908538 118930234 91109750 73807677 62430395 54544888
10531 54544888 48808152 44418874 40975362 38161574 35841871 33968046 32405991 31002376
10523 31002376 29668398 28385124 27026477 25458218 23869732 22421580 21167237 20078523
10515 20078523 19118447 18267846 17495643 16835817 16253923 15712646 15217681 14791349 14406089
10506 14406089 13954791 13478970 13034192 12584972 12105137 11602996 11086909 10609823 10162112
10497 10162112 9764288 9426523 9145019 8894295 8666591 8458377 8227833 7961035 7677007
10488 7677007 7414872 7167538 6942365 6720799 6518278 6331001 6142034 5955903 5775734
10479 5775734 5602462 5446190 5298544 5161972 5014895 4856324 4693717 4533705 4395088
10470 4395088 4265343 4183029 4112084 4029751 3909911 3790496 3663268 3532475 3405991 3287528
10460 3287528 3182756 3087169 3003192 2928093 2839355 2757347 2669615 2570480 2471427 2386777 2323678
10449 2323678 2248116 2179257 2108286 2062362 2011799 1982551 1969565 1936102 1909684 1895201 1869140
10438 1869140 1849558 1846513 1828192 1793891 1756599 1699845 1622286 1520976 1439542 1374369 1305182
10427 1305182 1243996 1198068 1161432 1129652 1106079 1097397 1081811 1056611 1029839 1006299 987255
10416 987255 991098 983949 986306 992972 925769 833397 742154 688237 634679 580414 540907 526600
10404 526600 519840 501541 479170 470294 457968 446060 461710 465101 467781 478994 471549 449656
10392 449656 425417 393514 363369 321879 304311 285150 268822 264973 280994 289047 289957 309767
10380 309767 313287 306200 309639 339182 374119 383609 394353 420457 427635 433793 443326 430411 410156
10367 410156 408993 406938 385858 360500 333647 304116 271581 257861 247879 231771 239837 258890
10355 258890 256221 266486 286912 312497 301141 295561 302716 294585 291815 308751 319007 334671
10343 334671 331481 331408 338271 336699 324902 320081 311596 300653 292184 300672 305318 297825 276285 272906
10329 272906 253844 235335 235472 238218 239343 232090 242199 252031 245993 247670 251795 245612 218950
10316 218950 200498 198003 197836 186121 178695 203075 224498 240427 236020 234202 221874 199228 200595
10303 200595 209834 202941 200422 201011 196473 189918 182149 184185 174620 185489 194164 194008 197274 183971
10289 183971 172692 167253 164261 149837 150988 155099 139074 127290 129858 125766 115298 103971 87036
10276 87036 87148 100411 114288 107532 105371 114884 109789 101614 108345 120950 114812 105634 103735 104331
10262 104331 88958 96089 88539 76536 75869 86193 109489 122320 123245 120762 107623 107053 111222
10249 111222 121994 139439 149418 171699 193085 243652 310400 389740 492763 636715 794571
10238 794571 920130 1000241 1033433 981399 838708 674636 535380 425210 343301 300173
10228 300173 284371 259844 246059 235045 223002 204819 197095 184033 173280 155070 144373 135431
10216 135431 133533 138645 137929 130931 112473 108596 107592 105877 113836 128530 146352 140563 128702
10203 128702 118316 114602 110812 110998 109150 113914 115574 107758 81191 69983 66808 70076 83859
10190 83859 87049 82974 94782 109722 111159 112690 105223 100602 111882 114825 110230 111914 109125 108385
10176 108385 114518 113404 103403 102167 97468 95458 76022 78448 86244 91558 99765 83835 72780
10163 72780 71667 66611 79751 100863 115510 139613 152886 150295 150239 136096 126542 116413 104729
10150 104729 98471 88730 89371 89691 94863 93696 89976 84989 78695 58006 50729 61409 70454 79307
10136 79307 84932 82056 76696 72794 83434 88908 113805 137055 139494 129469 130496 160166 219242
10123 219242 285622 373576 524778 742654 1053810 1422816 1736837 1920272 2006251 1960245
10113 1960245 1659950 1227610 877232 673091 536105 437374 365791 314884 280992 277317
10103 277317 281868 258246 229424 212464 202138 203378 211273 213368 193351 184139 186774 182739 174335
10090 174335 188615 182337 177457 184027 188429 180519 184802 179675 164510 171781 178048 165145 159821
10077 159821 143362 124585 108709 109120 101014 91513 95244 104238 91523 85892 76468 72173 74757
10064 74757 85942 95502 97356 88930 78484 73199 76691 73118 66624 61416 58074 39294 42908 39703
10050 39703 32640 39044 29596 28766 41134 38238 50051 62937 58888 55503 68609 72889 82134 81050
10036 81050 78989 81928 87450 69093 56407 49909 58010 63630 60704 49502 43001 43149 34392 33727
10022 33727 37360 35693 36175 43192 40059 45935 56577 48084 34020 18975 13063 15370 13807 12187
10008 12187 12089 18247 34279 44372 48998 39814 34115 15028 13125 8296 963 490 5789 12614
9994 12614 21961 9748 4787 17309 30140 36480 35343 29357 31822 38500 37536 30857 17700 12384
9980 12384 4237 10837 23781 32861 44627 39399 21718 12452 23261 39643 40080 53876 42499
9967 42499 27396 20274 31727 38551 39882 28066 26176 32533 33031 24280 19210 20913 23960 20911
9953 20911 30512 28727 14746 6165 15700 11872 16722 17662 16053 20961 26911 23471 11990 7134
9939 7134 16007 8311 4549 8408 1021 783 -2890 -4910 1990 -5286 -9984 -12407 3404 10204 12901
9924 12901 20198 16478 18318 13547 14303 12463 20102 31445 31594 26595 25707 25771 29060 37699 26071
9909 26071 19910 25533 25499 21163 21972 33179 23596 10376 27107 42969 31532 17838 14604 11893
9895 11893 15080 25932 18431 7102 5463 11618 28201 39812 39543 25145 22065 29848 32143 21624
9881 21624 14890 7821 6931 3433 11325 26949 28793 27294 29961 19942 4639 -6767 -8606 7017
9867 7017 22819 36929 37000 45266 51103 38115 31725 12966 4412 7285 8794 7092 13316 14433
9853 14433 17363 15096 27459 37502 38072 37669 42948 46467 50128 37322 23631 13655 27800 31929
9839 31929 35849 44974 40711 43017 45929 67759 76896 69408 87173 119461 165312 249757 388351
9826 388351 601110 811337 952026 1032793 1064973 998772 723369 468429 338463 261368
9816 261368 215623 175058 144386 134107 131534 118278 108695 112054 105308 94540 90660 89781 85973
9803 85973 102556 105171 91741 83924 74102 66485 50985 29554 21169 39218 48471 49356 59059 61373
9789 61373 51669 44521 52672 56951 62630 55081 51502 55507 52785 45312 33289 39122 42732 40524
9775 40524 31174 44104 48083 50658 45126 24718 23431 25413 21522 8609 12013 29939 38776 37813
9761 37813 31468 18637 12668 14361 20984 30988 42023 37108 25732 27683 35055 23517 15433
9748 15433 15268 23658 27426 22695 15082 9190 12681 -7004 -9246 -3765 1712 10947 20585 32807
9734 32807 17195 -575 -4706 -9828 -13459 -11413 -10943 -13498 1278 -3718 -7602 -8272 -5902 -13896
9720 -13896 -6467 -619 9404 19032 19304 21210 11743 -8456 -7795 -2267 -2278 -4150 -4395 -10215 -11351
9705 -11351 -4291 1745 6642 13182 12226 13593 7722 2809 372 -6980 -5683 7133 14680 21855 18090
9690 18090 19253 32109 22554 7137 4709 -200 9872 9861 15423 22414 33627 37328 26468 10983
9676 10983 -6434 -3272 -842 7601 11368 26058 24900 12246 20854 10765 -2615 4503 14665
9663 14665 13317 2702 7336 18814 11602 11047 7459 -3160 -10220 4435 16648 13746 14566 18456
9649 18456 13979 23373 36003 30555 13688 13329 25171 27664 16204 6031 9175 18974 10697 13309
9635 13309 31711 41167 31281 31719 20292 23820 17279 12835 27953 39050 26621 11792 -9884
9622 -9884 -7350 -5427 7163 15135 18310 16891 11245 22589 19403 15096 11328 16342 18930 24024
9608 24024 21754 11033 8421 16804 8852 17715 11207 -7899 5679 19561 13850 14863 3768
9595 3768 8991 13577 12503 14934 14131 19346 19596 11137 21686 29850 18205 24095 15620 5845 8582
9580 8582 3347 12154 20727 26398 19158 14040 12413 18033 21464 20655 24752 8697 7583 10430 16949
9565 16949 22538 23886 31367 21319 25805 15699 6320 5561 10235 19539 36822 33505 31183 31323
9551 31323 35856 35332 33309 26905 24258 23663 35915 51070 40341 34434 26964 17321 11136 6700
9537 6700 10414 17816 24617 28883 28956 19860 12375 13572 4030 6499 8234 16929 17003 15194 10986 12152
9521 12152 19153 36691 29700 16368 5744 2793 19653 36478 34316 28495 27121 33673 41744
9508 41744 33933 27910 22457 20001 9585 18020 32066 29555 24608 25295 22538 30542 33734 35129
9494 35129 19800 4228 9644 9327 8672 -5053 -8765 889 12481 11367 19398 16680 28405 25640
9480 25640 22007 18399 24895 30674 34847 25776 27597 22066 21538 19922 16629 19652 21832 19988 5093
9465 5093 7951 10668 10891 18447 15023 2818 -8021 -8699 -661 2239 17103 14012 5822 11090 25720
9450 25720 21638 16605 5488 6220 15589 9996 10160 20627 35481 39388 42788 41692 38206 33200
9436 33200 39008 29221 22169 17739 22778 23179 12065 2588 17025 22369 11549 6976 16429 19100
9422 19100 4605 12991 13540 19556 14600 6610 11712 29212 40628 29403 23577 24693 13498 2351
9408 2351 -4135 7342 22756 30962 33386 28593 32986 18322 5670 11743 16737 26305 45659 40800
9394 40800 34299 30570 20633 7810 -2716 13789 23325 17619 20306 10821 9494 6906 -1559 -2288
9380 -2288 -3764 17140 23067 18420 6181 -4631 -9918 -16787 -11861 -2238 -5329 -13534 3102 9469
9366 9469 12626 464 -21687 -22401 -19538 -21710 -5140 9483 4750 15190 14093 5688 1803 5539
9352 5539 18836 20993 8896 10237 7302 3174 5849 3960 11136 19499 28014 32022 27607 12796
9338 12796 6792 12501 18645 6098 7773 19206 13817 5695 3707 10346 30560 37766 19212 -5819
9324 -5819 -3885 1555 -3171 2276 10220 21895 41591 43491 34134 35479 38678 28921 29485 19862 24979
9309 24979 50310 50785 43002 35164 26169 22162 27018 26429 23403 18322 24074 34003 29962 32346 34405
9294 34405 42527 47949 43301 35230 30093 27503 21661 24491 27698 26923 20708 20962 14782 6560 10467
9279 10467 10675 13788 15751 8277 4763 -5111 -6084 113 9529 20034 23931 23759 17269 19850 20917
9264 20917 29657 36713 34541 35639 53212 39207 23292 16706 11619 32409 49848 57776 57217 77218
9250 77218 70647 67931 64943 62507 54516 49146 46021 52526 49852 43931 40846 56629 61760 56475
9236 56475 38090 35037 29437 29578 25125 28526 33065 31800 44070 52117 38454 21277 21920 24630
9222 24630 37151 42211 32818 21071 9988 20849 32576 43897 49623 49234 48223 46253 39176
9209 39176 33168 26081 33605 49595 69639 68232 59247 73593 84306 86469 71268 65844 79162
9196 79162 80283 73681 68445 74983 61244 42903 49909 54526 62631 56692 52617 55009 60916 67193
9182 67193 61551 51619 40096 37342 32907 38175 41888 27987 20783 26169 25845 24836 28793 37004
9168 37004 28487 20633 42988 60040 66343 71493 72555 74678 80007 87240 87779 79890 60962 54700
9154 54700 62405 72209 76636 76281 61474 56263 54437 46141 41334 42343 41392 48225 55053 52933 58491
9139 58491 61354 58273 51311 50408 44553 36147 34188 39927 32287 23401 22314 32190 25056 29442 23968
9124 23968 24201 20372 9493 -7247 -601 22671 38826 37588 36059 36289 31180 19945 28844 24394
9110 24394 19134 12727 13333 20584 30023 33205 34244 43179 41141 26155 17255 9698 5436 10834 26123
9095 26123 30233 21999 28444 20642 27072 31129 22418 19490 28492 40197 42534 31990 37589 40633
9081 40633 38854 29857 32590 23527 19983 34729 51733 57129 50122 35072 34071 40067 49935 63811
9067 63811 67126 76225 84943 83866 70481 57152 56843 68898 67099 59745 59890 70665 66801 57642
9053 57642 69889 79444 81774 76165 76880 75075 67428 61660 57279 47234 52820 53933 58217 90529
9039 90529 100881 79246 73577 58872 43956 34698 37081 47338 57094 60389 57258 58146 58700 60622
9025 60622 52381 44818 42170 47247 42443 31639 30091 39267 47012 37695 27207 31665 35309 41881
9011 41881 30735 38399 42828 38562 42727 31389 22316 38729 45866 43523 53977 55149 41764
8998 41764 45043 54333 75442 76156 78007 70958 68421 69626 76935 75581 66913 52595 62030 50047
8984 50047 49956 44091 41706 47914 54047 61282 66993 59890 69064 65749 61374 82073 90315 102817 102141
8969 102141 91165 99000 96813 92759 94837 97908 84389 67140 70101 84556 88250 87826 86194 73071
8955 73071 84671 104128 111947 107880 114981 118209 95776 101097 130161 127313 126532 130797 109755 106692
8941 106692 106554 108214 108684 118170 126548 137606 137451 127225 133334 150100 165526 170631 148973 144285
8927 144285 137107 141413 148133 168970 173034 170573 171374 167680 167374 177573 179966 199881 212998 203469
8913 203469 204671 203083 207831 208352 201642 195098 192776 199417 210755 220706 241583 253949 241525 237407
8899 237407 232578 231776 237197 248857 248482 252764 260042 278859 283490 285727 298484 302691 299933 299980 304473
8884 304473 322883 349769 353865 364792 377498 375984 380487 396074 401675 408191 433796 461773 475454
8871 475454 493950 510855 516979 530205 561620 565022 576043 600709 612227 613250 628797 663862
8859 663862 712438 761691 807877 851058 901859 951915 989248 1016295 1063009 1111540 1160536 1224569
8847 1224569 1293381 1348175 1429841 1516828 1599234 1679153 1777064 1876583 2000611 2148413 2316943
8836 2316943 2491155 2691030 2917884 3173456 3483579 3831146 4210454 4655240 5154363 5749330
8826 5749330 6465961 7334758 8405502 9717558 11339154 13406888 16035978 19411247 23811064
8817 23811064 29568501 37078279 46541438 57685132 69342837 79667829 87023194 90303615
8809 90303615 88744914 82070846 71609022 60098130 49742748 41355575 34877217 29925387
8801 29925387 26095209 23098590 20728051 18821261 17216443 15860281 14711961 13717465
8793 13717465 12842865 12057779 11343565 10703854 10135126 9611910 9125050 8673325 8256316
8784 8256316 7870310 7494666 7166890 6875339 6579621 6305715 6063496 5846166 5655866 5476712
8774 5476712 5306745 5133230 4962961 4808717 4642503 4481505 4326382 4172628 4013172 3886050
8764 3886050 3764595 3637794 3526675 3428809 3327282 3223320 3120666 3011655 2920344 2831836
8754 2831836 2742502 2657070 2585383 2513709 2432319 2358426 2290491 2219482 2156456 2084377 2019856
8743 2019856 1964837 1901302 1849974 1792290 1743048 1690774 1628442 1586814 1551512 1507122 1473346
8732 1473346 1430625 1398060 1377426 1355456 1322713 1285849 1250611 1218249 1189666 1143178 1114469
8721 1114469 1083096 1030880 996139 965127 947323 936499 917116 898588 891169 883626 870027 845234
8709 845234 817843 805617 796734 777271 762469 727200 704313 689318 679646 660863 630488 591431
8697 591431 552979 540233 527361 531031 520048 502936 477218 465142 473310 463185 452228 449361
8685 449361 442969 438874 436513 420450 404639 386870 375773 377642 346093 315267 300016 284164
8673 284164 277303 276513 281957 266681 256788 270223 272173 268402 277282 261919 252235 247051 234123 225714
8659 225714 229464 211035 196943 189300 180068 180599 186033 194264 207063 187825 177260 191008 194810
8646 194810 195383 203377 200691 203311 208933 207152 208242 206410 189229 184478 186891 185562 186186 188036 206429
8631 206429 195517 179287 179081 186592 186333 167090 157819 160586 178646 186922 198253 201632 193611 198803
8617 198803 207249 204798 189045 189000 193676 185833 185364 203841 210047 194889 199756 204138 194896 193916 199579
8602 199579 201306 184973 178054 194221 191684 184466 180804 172558 167822 162205 150259 145201 159992
8589 159992 154536 136096 138789 145701 145047 144767 147677 131524 123069 119230 140569 147192 133614 124801
8575 124801 112806 112450 106688 97306 100601 95086 89481 87956 106051 110877 110667 111153 103251 89401
8561 89401 97589 96387 94615 90182 83492 65104 74683 73848 64346 59735 73442 65730 73401 86609
8547 86609 84793 81151 69218 80537 79248 82168 89544 93524 87329 79789 62382 50484 46875 51368
8533 51368 52213 53177 66513 70200 72851 64482 55433 51975 46710 45786 55678 53018 46733 43600 38504
8518 38504 39475 42805 44866 64217 58413 42191 37635 31943 39210 53946 54737 54307 68443 79118
8504 79118 78901 65731 61125 68259 65351 58832 52661 44463 45029 60793 47428 42589 50625 60203
8490 60203 63771 63949 67825 52031 43254 45447 37828 29934 22420 29223 42835 41391 45528 42578
8476 42578 44041 66424 63473 46773 42680 42719 47893 50558 38931 28205 23838 27478 31174 33140
8462 33140 36858 27494 21470 31038 41207 41072 51859 41475 19600 16880 29951 30016 39057 37520
8448 37520 20562 23992 39929 44987 40687 22852 6833 -1281 -14209 -541 12020 20611 32030
8435 32030 42142 48464 41843 36313 42541 46307 43208 38058 34983 34294 29478 13293 16826 31745
8421 31745 47527 48077 48865 49569 41673 39892 36967 33659 31052 41758 50296 37649 31494 31000 28127
8406 28127 24572 12254 18482 28962 38147 56194 45808 29970 33155 26352 22741 20318 16965
8393 16965 18040 15195 22345 18870 5736 4234 10454 17814 13569 10245 4905 9105 15794 17273
8379 17273 18980 25939 25034 11295 7408 11541 3479 6508 18191 20062 9107 189 -10252 -16659
8365 -16659 1441 26463 24955 22490 25417 25297 17848 18743 12644 14049 25299 25624 23353 29441 41598
8350 41598 46299 45171 31288 21989 24812 21921 19123 26968 37457 33352 18556 21861 39177 61340
8336 61340 72342 57849 56565 56606 46416 39359 30887 32402 35704 27827 14393 8408 11253 10700
8322 10700 12115 5166 6602 14102 31200 44444 42358 31801 30627 30652 35705 30366 52033 74049
8308 74049 70772 86571 114695 131729 125288 117755 110072 82771 72190 66100 67210 64029 59172
8295 59172 53865 57595 61053 91319 107080 113099 111973 105005 87239 68787 64324 56449 49671 50457
8281 50457 49978 33485 28241 32573 47393 40287 34264 38075 32963 22634 32128 47236 56026 62062
8267 62062 81303 117990 145481 165746 170577 172115 172661 150989 124735 106075 84739 58616 46139
8254 46139 36391 24319 36771 49614 45382 44149 44589 45247 50765 49904 52802 57098 67759 73785
8240 73785 61518 41406 38448 43826 49025 48091 46959 27251 13575 13600 21423 23188 33147 35825
8226 35825 33639 37357 51046 46199 33019 42206 36261 26151 4031 -6685 -12016 -9562 3851
8213 3851 15433 15984 6265 16200 22557 21886 10971 14748 22675 30438 25141 5471 6563 10630 1019
8198 1019 12397 29898 40347 28953 17396 9372 14166 24861 38960 30822 15067 7584 5584
8185 5584 20448 21936 16040 30499 20349 17635 11441 -13950 -10253 6327 14324 13438 17472 26048
8171 26048 28549 31511 30399 32277 12892 -6977 -6567 -2982 5205 23121 34511 31202 30806 25509
8157 25509 24333 28545 36149 32334 27650 40264 40031 28685 21616 17637 10258 8920 15683 21705
8143 21705 19198 10599 19844 31019 22200 5668 1387 1003 3033 6050 7591 13046 17736 22772
8129 22772 34466 31821 27633 30150 44733 85110 110493 125708 137269 133609 134283 152315 158573
8116 158573 145327 121130 101183 75660 71415 61783 37324 27146 19192 23306 28138 22143 20041
8103 20041 26402 34794 52185 57865 49557 31311 36858 35626 25911 27591 40577 40826 42613 32483
8089 32483 32118 29206 25973 24573 34719 27945 38520 49735 52099 49462 56327 80848 113436 154948
8075 154948 201993 246827 284024 285753 275555 227649 174596 127874 89993 74725 80721 65682
8063 65682 65560 62882 57504 63754 68569 56207 58693 65370 62747 47408 39485 40875 46441 50328
8049 50328 43863 35725 23809 23651 33335 46780 44296 43340 28736 20300 16549 21631 21977 17492 15318
8034 15318 21768 49748 66613 83698 90436 98942 95425 103594 123658 149631 149414 124581 91616
8021 91616 62857 53258 44503 40985 33926 22079 25301 17662 14292 27589 40708 53721 55570
8008 55570 51550 53652 52418 48232 41890 33396 36141 33822 22751 13122 19309 28838 37369 32286
7994 32286 14818 15786 3137 12320 25092 22654 22313 30092 32570 28774 26279 23942 15731 8224
7980 8224 12172 13969 6055 9838 4554 10242 27451 30496 36084 40352 45784 45581 34925 11559
7966 11559 23579 37504 35916 34793 36180 39151 41538 42658 36694 38192 31938 34357 34972 37266
7952 37266 27469 33238 35143 26067 7000 -9304 5631 18089 36298 38016 39782 28402 11497
7939 11497 10295 29586 25244 17878 11527 9497 7726 10127 3091 2248 1074 12570 22540 26357
7925 26357 29574 28251 29628 14784 17173 29621 13209 -3721 4504 10756 4457 7063 13287 17218
7911 17218 20255 21231 25912 23583 7325 -5216 -11167 -7070 -5530 -2290 7519 13076 6428 3898
7897 3898 9556 17941 10583 18623 25987 20715 17347 13854 24846 49179 36087 32407 24486 18498
7883 18498 20508 16721 7564 -6185 -8984 1054 2564 -2336 212 -3772 -3116 397 2819 -7166
7869 -7166 -13332 -10786 -10516 -8759 -1172 -6470 -9868 -22263 -26114 -14987 -13735 -23207 -10478 676
7855 676 4968 -6187 -11805 -13539 -12255 -2831 5252 642 15863 22687 14064 8030 -3870 -3570 -5709
7840 -5709 6190 -96 -8989 -3496 8982 18578 22385 21544 11023 696 87 5642 5994 -181 -3166
7825 -3166 7933 14899 1982 -2889 -3160 -6607 -6539 -24845 -32652 -14633 2184 21532 17706 8365
7811 8365 -432 -429 2206 -3438 9703 12671 4734 8715 3999 -3187 -12996 -1204 4403 -5408 -5231
7796 -5231 -4398 -2906 -4174 -11911 -10665 -10153 -12320 -7297 -873 -567 -14374 -6502 4541 1346 -8303
7781 -8303 457 13795 -4963 -376 12702 18645 3892 -5701 -3369 -9209 -10408 -10050 -3310 -11380
7767 -11380 -10816 -9740 -6414 -3490 -7527 -4764 -1530 -1139 -10275 -1064 -9462 -11412 -7175 -5967 2944
7752 2944 9609 -2841 7979 16382 14935 7001 3030 819 -11658 -3833 2326 -7869 -14505 -7163
7738 -7163 -13569 -6636 -1400 -5192 2933 4255 1589 -1611 -13502 -7927 -7851 -14813 -5850 1424 8402
7723 8402 5485 29917 23740 11117 1201 4649 -1194 3916 7376 7169 -10373 -15395 -9365 -21038
7709 -21038 -25104 -3660 -452 4427 16882 15958 -4910 -16396 -17787 -3930 -2538 -5226 -418 334
7695 334 -6819 -26182 -23047 -16829 -5898 -5485 -12027 -11157 295 -799 6 2985 10472 -499 -1992
7680 -1992 2531 6806 -3812 -3109 5627 7329 9565 1644 -5412 -8643 -8245 -13916 -5168 -2205 7662
7665 7662 6874 -7185 -10479 -16872 -9774 4584 6930 -6238 -9216 -434 685 -5229 17687 32218
7651 32218 35610 36469 22230 15769 12918 22429 14596 -3736 -8436 -15662 -21300 -29212 -14499 -9376
7637 -9376 -7510 -3871 -3124 7758 13309 -2375 -9511 -3704 -942 -10591 -15495 -12651 -12400 4627 12790
7622 12790 13061 16070 9230 -3052 -10664 -4187 -7608 -10721 -281 5491 12190 9094 15598 9039
7608 9039 -8054 -8289 -4577 -4864 -8158 -5506 7345 12210 9939 10850 11989 -443 5152 -3944 -6832
7593 -6832 -52 -1343 -5257 -1034 6393 15851 26147 19178 14473 6710 4827 -9935 202 15864
7579 15864 15578 7570 10534 6101 3214 9764 257 -10546 -12112 -21185 -24310 -21185 -15037 -17933 -15047
7564 -15047 -18803 -19470 -6868 280 4951 8836 1952 5919 6945 2133 11114 7651 -7812 7661
7550 7661 19684 12977 10561 15117 14302 2128 -1409 4877 -2612 -9907 -6614 -9836 -13679 -8961 -9924
7535 -9924 -5342 -4015 -9955 -1137 581 -766 -2048 -5842 -1265 9478 17276 15064 2219 6445
7521 6445 15189 18574 8798 -4377 -16825 -25420 -18016 -240 3489 -2821 9281 8266 -8922 -16705
7507 -16705 -6360 5631 14584 15704 20620 23046 23762 8877 486 -1086 -5717 -5562 -11458 -19161
7493 -19161 -22918 -17531 -10659 -13398 -2917 -14440 -24049 -11041 -5700 -14712 -10405 -16497 -30602 -34366
7479 -34366 -27974 -16138 -18640 -17293 -17520 -17695 -18319 -26771 -16597 1670 6823 3260 -2925 -4451 -8397
7464 -8397 -5803 16070 18714 2542 6906 5480 4087 8561 9710 11454 726 -18506 -24136 -31895
7450 -31895 -36845 -24482 -16580 -18957 -13854 -5677 -14644 -14288 -1995 -2574 -2979 -10030 -11553 -8927 3573
7435 3573 19586 22594 10104 -9219 -4263 -3488 -14844 -7667 -7634 -13751 -15164 -11160 -765 1137
7421 1137 8643 14030 9884 19240 13275 10299 -1103 -9007 885 -5040 2882 12773 8536 -4082
7407 -4082 3575 4252 3757 18001 19349 18827 15306 2505 -1184 -14519 -12209 -13605 -16967 -15893 -7085
7392 -7085 6001 131 -15658 -16723 -14283 -3985 -5763 -10942 -12053 -8516 -14809 6145 12411 -5853
7378 -5853 -8338 11307 18906 15839 12447 10651 9380 7120 -3280 -3163 7796 18230 30632 22709
7364 22709 12038 9548 8730 -13372 -18888 -20629 -17170 -392 6376 1463 -16943 -15835 -1826 -1105
7350 -1105 -5080 3641 16747 20940 31041 27961 20101 4887 4000 7565 131 -5180 -2401 -7727
7336 -7727 -1414 -2409 -4098 -12179 -17711 -25920 -17937 -12975 -14566 -5332 -7253 -6284 -21332 -32272 -29875
7321 -29875 -16000 -15515 -25840 -19997 -22284 -18145 1475 77 -2997 6912 14585 12344 3982 3071
7307 3071 -7500 -5358 -2709 -3766 -4139 -1264 9328 8148 8692 13018 25148 25567 21262 8828 2542
7292 2542 8214 9931 6969 4780 12810 13702 -6386 -10059 -4403 -1749 -8586 4091 127 5369 5142
7277 5142 5018 21015 2836 -11115 -11620 -13599 -12932 -16668 -9776 -2422 -1868 4470 15253 7059 -2359
7262 -2359 -5135 4446 12526 1717 -5394 2154 -1392 60 5212 2874 -22774 -23073 -10204 -165
7248 -165 581 9503 10203 5219 8742 6776 1034 2723 1203 1640 -2110 -1038 8744 12598 12587 13710
7232 13710 16713 19223 22716 24798 15919 -853 -15846 -1 -8892 -18527 -12111 4524 7229 -1110
7218 -1110 -21311 -17927 -14469 -9618 -13269 -15298 -17776 -10628 -19356 -23707 -20259 -11029 -8082 -3485 -3293
7203 -3293 -8593 -10363 -8653 2633 3775 11609 11355 4334 9015 19939 26688 11500 -3516 -16344
7189 -16344 -21068 -18534 -7556 -10725 -14731 -22337 -27266 -32132 -29907 -17331 -10260 -5008 -8680 -7322
7175 -7322 -12351 -10671 -7631 -2077 15245 17897 11330 -1908 -14185 -26455 -19789 -775 10260
7162 10260 7930 11468 15179 10463 13068 13886 6353 7197 12818 -2217 2973 15665 19626 12650 10167
7147 10167 11362 -10056 -26299 -19863 -10483 -5076 12990 15851 -1917 -7080 -4564 1671 -7948 -19802
7133 -19802 -22144 -33088 -24946 -13136 -16135 -18992 -18909 1572 199 -3995 8945 18818 9744 -369
7119 -369 1148 -7409 -7050 6106 6067 -6325 -12769 -9187 -6740 -9648 -8787 -17909 -22234 -17207 -11160 -5677
7103 -5677 -7800 -1979 537 3983 18317 13998 -8390 -14545 8120 13207 -8759 -18111 -11111 -73
7089 -73 583 6884 12077 12039 13918 5265 -7768 -8083 -6678 -10933 -15567 -12240 -1924 7625 739 -6930
7073 -6930 -7528 -11224 -2809 -15301 -18837 -17339 -17271 -15383 -12244 -9548 -14294 -11810 -14751 -18561 -16675
7058 -16675 -4052 3053 6727 5399 1494 3469 2080 2555 13104 3922 -156 -6990 -20622 -12842
7044 -12842 4011 -3075 -6719 -17710 -8343 -9883 -28662 -23783 -13403 -11358 -9213 -2503 -9138 -7428
7030 -7428 -489 1319 -3549 -667 -4984 -7197 -470 -1042 -11693 -7903 -6992 -19706 -22004 -15364 2996
7015 2996 1533 -15012 -7600 8397 12397 22519 33946 21126 15335 13278 19206 21888 29952 22685
7001 22685 15812 23470 26664 21651 16017 8004 -6102 -1767 10479 16320 15689 -4099 -8990 -7000
6987 -7000 6727 4084 3597 12696 22792 22350 12827 9455 13268 16894 8485 -6967 -11501 -20219 -18506
6972 -18506 -2641 -23637 -38395 -18593 -13985 -3750 528 -3780 -2023 7250 9400 15016 21955
6959 21955 15433 15665 15421 1328 -8500 -18732 -32620 -24481 -11390 13466 14908 19553 29017 10044
6945 10044 -9003 -4970 6971 13108 5453 1907 -256 -6135 1918 13123 16168 9242 3008 1131
6931 1131 -8662 -11904 -8144 -17792 -20131 -17480 -10148 -19501 -22653 -14708 -13565 -27434 -33542 -30552 -22748
6916 -22748 -10665 3402 665 -1418 -3049 -5531 -4781 4127 7689 17830 16078 10843 3736 -2178
6902 -2178 8785 12537 -13885 -13127 -8475 -13545 -16687 -31998 -24143 -9388 -13278 -24256 -30207 -38571
6888 -38571 -22461 -13646 -9415 -11619 -28775 -33814 -18850 -9474 -15697 -243 -2068 -18468 -28299
6875 -28299 -16627 -10688 -15784 -8196 17856 11348 -4818 -8066 2867 -8321 -22756 -9932 -9802
6862 -9802 -14421 -10504 -9184 -20372 -12475 8701 17387 22518 10455 14013 24802 10447 3245 6935
6848 6935 29461 22852 3687 3373 2587 806 4473 9218 9889 -5770 -34448 -32374 -25873 -5488
6834 -5488 3091 6484 11288 -10299 -27345 -22363 -15459 -12109 -25431 -17720 -4052 -3042 -4944 -8849
6820 -8849 -10276 -9487 -13097 -12960 -5667 -2656 -6240 -2707 7071 4328 -15248 -28326 -27447 -15912 -23371
6805 -23371 -28148 -25354 -15195 -14452 -12733 -13099 -6863 -11156 -13233 -28828 -29092 -19412 -10812 -4919 330
6790 330 19085 29010 31437 28290 16973 9603 3169 4231 -3982 -12053 -12752 -15966 -23995 -21359 2036
6775 2036 7847 -3493 -17055 -23583 -25962 -17422 -19376 -13468 4996 -2954 -12568 -9342 -15742 -14650
6761 -14650 -4472 -2254 -7588 -20456 -33894 -23127 -14862 -15593 -19658 -19989 -11675 -8995 -15672 -19638
6747 -19638 413 8467 -7497 -26195 -18088 855 7822 7756 12528 7724 6515 8011 3138 -1272
6733 -1272 -3623 -569 -7619 -13391 -28766 -33332 -33135 -27492 -10999 2623 9886 18896 15762 3625
6719 3625 -5470 -19076 -36279 -37031 -41222 -32571 -17618 1641 6573 -3942 3446 12975 3818 -4042
6705 -4042 -305 -4181 8088 -11149 -23994 -24409 -19172 -12229 -12019 -3740 8182 9618 8947 2312 8735
6690 8735 10959 10595 2061 -1229 -10171 -9433 -5548 -2733 1357 8400 11034 13128 10690 2697 -1871
6675 -1871 -12214 -15278 -15225 -16286 -24044 -29205 -10827 8216 5786 -9764 -7738 -14780 -2283 1515
6661 1515 623 1057 -7302 -16343 -19732 -16541 -19226 -15520 -3058 13320 17820 10183 6593 -1871 -12479
6646 -12479 -10438 -16023 -23191 -17243 -5716 -7384 -14295 -11862 -1278 9764 9695 13542 13194 15418 15010
6631 15010 1124 -5205 -3083 -4772 -16981 -10838 -750 6184 9009 8098 1972 8032 16014 26194
6617 26194 28113 9821 3257 8337 -7173 -4351 8044 9339 -4095 -2672 8756 5892 15288
6604 15288 8379 -9410 -6596 -252 6989 24824 24477 13688 15253 17781 13319 19451 23504 16860
6590 16860 20606 17827 3905 14939 22886 21010 22355 12694 427 -5442 -421 2692 4113 -5653
6576 -5653 -10373 -27840 -18839 -11947 -14517 -17046 -23247 -11329 -15593 -23616 -16391 -10833 -11165 6503
6562 6503 8716 8605 14340 8664 2120 -12074 -26097 -22732 -13903 -1520 -4013 -13970 -14306 1004
6548 1004 1624 1502 4587 8511 38702 40466 40284 38187 28362 23648 14156 2514 8573 6038 -3460
6533 -3460 -6393 -229 5247 18563 24859 24006 33752 23982 23244 27312 22369 16308 19652 22087 20658
6518 20658 27420 35967 27962 24048 27701 13744 4211 6161 11385 12569 20126 24421 12117 -3572
6504 -3572 -15948 -9330 3680 2582 -17749 -23466 1855 -12025 -19860 -23734 -26135 -7465 -273
6491 -273 -3146 -5965 -4143 -14495 -15940 -4326 -232 6788 10946 6551 5552 -5207 -12086 -1303
6477 -1303 -4124 -3100 -8233 -10689 -9216 -3639 1420 2277 -9178 -10758 -6504 -3574 2769 -652 5405
6462 5405 -1603 -7985 -12229 -17500 -17690 -21703 -20085 -20664 -25433 -25066 -21351 -12690 550 -1989 2194
6447 2194 4269 -7901 -3584 -4843 -3960 8068 7624 3775 -7161 -6458 -3703 -3077 3489 3818 8791
6432 8791 10801 7132 9581 -7355 -12511 -7028 -10964 -11232 -18647 -16667 153 4419 -8094 -6452
6418 -6452 -238 -4599 986 -9589 -12156 -6191 -12204 -5809 4969 2096 2460 -5073 -13419 -3882 -12503
6403 -12503 -2791 6200 4250 -10514 -22774 -10689 894 4250 13729 15779 6043 6455 10110 15246
6389 15246 13581 1288 -3304 -11521 -14497 -16794 -15930 -9546 -7855 -14116 -15386 -11178 -18275 -19895 -16108
6374 -16108 -14926 -12373 -32100 -31744 -34918 -34059 -19386 -466 -2790 1715 -2534 -5527 2383 7023
6360 7023 -1524 -6511 -17920 -15597 -3766 1070 -11225 3571 14236 -7541 -10643 -4220 -497
6347 -497 -6904 -10912 -6562 993 15482 16745 11301 9864 8648 11302 11520 16997 14464 10311 16843
6332 16843 20061 23304 17685 19379 11171 4772 -1538 -10701 -14124 -3951 -1735 -4945 16449 14959
6318 14959 -5286 -18904 -19196 -21977 -10165 5368 2661 5167 -2301 -16169 -20650 -16528 -22294 -18853
6304 -18853 -18918 -17732 -12403 823 5417 3333 -2169 -6459 4715 15224 6264 -7404 -3615 2768
6290 2768 3147 -4801 3737 12701 1796 -6488 -13959 -23153 -10753 5180 1060 1633 -12366 -13880
6276 -13880 -4387 -8875 -5928 109 3050 -1810 -8741 -14682 -18437 -12769 -9122 -14014 -20896 -9277
6262 -9277 -10584 -12244 -7664 588 22955 37203 29042 20891 23296 11532 -5212 -6467 -14220 -18505
6248 -18505 -21754 -19480 -6865 -6191 -15207 -22687 -22005 -27162 -23648 -15245 -13719 -21682 -26579 -26135 -20964
6233 -20964 -13520 17235 11764 4010 11767 11104 -5646 2236 10472 3185 -8437 -18940 -20866 -19966
6219 -19966 -13925 -15564 -2449 12792 22362 24904 12001 -3028 4753 2110 2775 -1957 -12577 -2079
6205 -2079 -12751 -45656 -52151 -37807 -21927 -22115 -27362 -41026 -29525 -28646 -28009 -17043 -16112 -11659
6191 -11659 -17147 -8704 3446 7760 6019 5142 690 -3744 -14828 -3547 -1062 11594 12492 348
6177 348 10051 10844 11880 -6070 -17135 -31341 -25679 -16596 3310 20203 16063 -768 -1352 16188
6163 16188 16221 7015 -1562 -2616 8679 -4978 2518 -1635 -5790 -6283 -14581 -9642 -17350 -23045 -24275
6148 -24275 -21257 -31854 -31993 -31686 -17464 -19122 -25316 -17596 1966 11135 4707 -7155 -11172 -14889
6134 -14889 -14675 -11343 -7046 4444 19528 9275 -17140 -19204 -11955 -20648 -32510 -21463 -14548
6121 -14548 -12845 -5300 -2444 2131 18024 19087 21151 16841 9254 18631 5211 -2451 4941 -1351
6107 -1351 -7985 -4793 -1347 -11017 -18426 -11805 -9464 -343 25052 14839 -4073 -1851 -1584 -5882
6093 -5882 -10139 -16035 -8621 -4074 -14761 -8108 -10533 -2 6322 13790 11354 12577 4743 -3112
6079 -3112 -1675 -8676 8113 18835 10162 -2170 -1486 -8190 -8737 1133 -2145 -6998 -7587 -12298 -34142
6064 -34142 -37120 -30071 -21428 -1326 4774 1086 2146 -93 9466 2384 -1708 9442 9630 -3707
6050 -3707 -23568 -36678 -38790 -37254 -29141 -20721 -16413 -10258 -9818 -10542 -6031 5525 -3370 -16335
6036 -16335 -33596 -29354 -4647 7774 -3385 -6788 -8323 -14227 -17499 -27819 -35589 -24108 -12624
6023 -12624 5236 18824 12468 6970 9837 14187 26705 31326 26346 15310 -3227 -18019 -7093
6010 -7093 -7878 -26022 -29962 -25616 -24266 -12047 -10540 -2381 -1093 -4166 5428 5252 -8324 -12744 -211
5995 -211 -839 -4436 -26768 -19244 -8516 -3007 -12587 -22752 -29343 -35821 -24571 -4648 -4847 -20722
5981 -20722 -32869 -37726 -35732 -26460 -9991 -6864 539 2953 -8240 3557 7338 248 -14237
5968 -14237 -14259 -19028 -29557 -13053 -6772 -16778 -20039 -15014 -19105 -25181 -13734 -5142 -473 -3108
5954 -3108 -10451 -9663 2350 2689 -7033 -7152 -8888 -18482 -25210 -25222 -10184 1294 1750 -8919 -7983 -8317
5938 -8317 -6391 -13212 -13437 -473 -5096 -17653 -12521 -5783 -13318 -17847 2355 -811 13845 10692
5924 10692 -1846 -5143 -4187 -2880 -7381 -2416 6603 8457 16925 4335 -10480 -10659 -9347 12574
5910 12574 15305 6656 6411 -10827 -7373 -9584 -23523 -26551 -15642 -19182 -18032 -21394 -11747 -11624
5896 -11624 -16744 -20699 -11684 -4594 -16484 -20917 -7516 -1796 -9180 -11368 -12019 -18460 -15164 -9210
5882 -9210 1971 2252 1188 12324 8438 9876 6353 -6916 -16839 1824 2158 2631 8540 7336 4431
5867 4431 6586 4561 6351 16853 9662 -9119 -6896 3852 12884 7026 -8803 -10809 -14410 2313
5853 2313 -6457 -6206 15201 4152 -10659 -13586 -20957 -27399 -21747 -18054 -4326 18454 7894 -2105
5839 -2105 -2969 7174 13689 4803 -17799 -25987 -12261 -2317 -13531 -29314 -28733 -14310 2100 4710
5825 4710 -8122 -8028 -3468 5896 4682 1144 5320 2838 683 3088 -12198 -14373 -5649 -3540 -2867
5810 -2867 -11602 -6798 -561 -1305 -7175 -12493 -18385 -10902 -257 3990 4948 21492 12335 -16461 -30036
5795 -30036 -19643 -766 7574 -2412 -4946 -2486 -5015 -16691 -24966 -24384 -18573 -3540 4592 -5083
5781 -5083 -3893 -4151 -1178 -8397 -12518 -11330 -13059 -13641 -11564 -2866 9532 3693 2644 -2528 -8313
5766 -8313 -10408 767 15951 2599 -7238 -6389 -3272 -1334 -867 -18253 -32045 -31792 -6221 8016
5752 8016 7890 -5317 -26454 -28334 -20716 -18920 -24896 -25454 -30251 -21325 -15368 -8349 -342 8437 -4888
5737 -4888 -5063 4044 9788 12296 2254 -5684 637 -5388 -1986 1629 3172 -2629 -348 1261 4678
5722 4678 8594 7624 -2258 -2880 2681 14016 28979 24384 5983 -4360 -9072 -16228 -17798 -16666
5708 -16666 -18230 -21116 -10758 -5356 -5825 -2476 -7404 -12377 -9378 -809 -9036 -11093 -16110 -10515 -5864
5693 -5864 -4932 3724 10946 10933 -1621 -10559 -16203 -9649 -5671 -7068 -21610 -31530 -25360 -16034 -5791
5678 -5791 -11527 -5717 1340 -2706 -334 7175 11761 24738 10241 -10517 -15574 -4868 4298 12005
5664 12005 22765 26767 10720 1841 -11883 -9039 -8137 -15194 -25669 -10812 7621 18226 15770
5651 15770 9652 860 979 -9227 -8871 12691 22211 11960 7520 12872 12701 21018 10011 -997
5637 -997 -2 5930 5566 7583 -899 -9133 -11247 -22961 -26065 -15796 -8516 -13561 -4254 6698 9666
5622 9666 -9603 -5778 9094 21054 10805 10575 5616 -284 -4261 -1649 6296 6412 12851 8688
5608 8688 6222 7048 -608 5894 2641 12659 6447 -4913 -12900 -20855 3416 24321 19415 -5009
5594 -5009 -11166 -11018 -3171 -876 -14030 -20077 -20272 -15473 7094 5409 -10877 -22514 -16770 2268
5580 2268 8800 -834 -4187 -2269 -2808 -16772 -19982 -16249 -6158 12994 16282 2020 4852 -1885
5566 -1885 -12971 -15231 -16858 -4743 6034 2793 -5096 -12606 -14392 -11758 -8761 -7937 -6489 -113
5552 -113 6849 10789 8281 -7218 -16838 -16211 -15333 -12943 -7517 -8589 -2662 -12026 -19424 -8112 -4372
5537 -4372 3981 2138 -12921 -27704 -26980 -29088 -21786 -14870 -14526 -19519 -3111 11191 15781 15330 20294
5522 20294 23603 22233 2677 -7737 2530 -4836 -13861 -10458 -9969 -5736 -7797 -5470 -125 13641
5508 13641 20538 18552 17116 5811 -9131 -24952 -37223 -29716 -23594 -22796 -22226 -24277 -14338 3519
5494 3519 -12474 -17503 -4500 3795 858 6452 -11550 -26644 -10011 12838 5621 -14176 -23572
5481 -23572 -14069 -13367 -6705 -7641 -9386 -4730 3396 -8997 -9833 -10459 -3829 2203 1280 -989 -221 4237
5465 4237 8284 -1674 -11230 -12210 1458 3586 -2206 -5430 1731 -953 -5966 -13170 -3280 -146 -4538
5450 -4538 -10696 -4494 -1752 -13515 -17577 -19426 -21356 -15502 -8183 2365 10364 2005 -9240 -21562
5436 -21562 -16967 -20414 -26770 -34108 -34173 -21792 -17001 -8078 -12699 -17578 -14149 -5656 -2810 -14981 -20603
5421 -20603 -6897 2580 22820 25592 9012 50 -3607 -1330 -4549 -2314 -12742 -15410 -7001 -4439
5407 -4439 -353 -5950 -14833 -3246 12046 12126 -2189 -8818 -3340 3046 7219 -10723 -19711 -15357
5393 -15357 -5968 -12023 -17596 -18685 -8978 4118 6147 -672 -3128 -1543 9354 14702 8502 16300
5379 16300 10202 -3916 -14099 -11531 7693 19946 12331 6882 -2146 6502 19176 22102 15343
5366 15343 15459 18654 8362 -9363 -15293 -17355 -16317 -13452 -20883 -18806 -17013 -19044 -20618 -27083
5352 -27083 -20771 -8258 -1101 -6643 -9950 -9246 -21220 -15487 -18935 -22727 -13949 -18794 -25377 -21228
5338 -21228 -11353 -8564 -2540 -4435 2804 2381 5708 12285 8715 3120 2612 -1839 -12582 -20564 -29176
5323 -29176 -24551 -16748 -25034 -24699 -14756 3551 5315 7810 23148 28342 17971 7320 7277 -10775
5309 -10775 -24969 -17749 -8004 -249 1502 -6210 -9241 2828 12343 -1401 114 5229 10589 15541
5295 15541 11717 -7486 -3024 122 1834 -12658 -25282 -12665 3149 20486 26910 14534 4442
5282 4442 17694 22826 7160 5671 3129 -11456 -16600 -6736 2691 747 -1908 -5069 -7446 -9410
5268 -9410 -14395 -11264 -12407 -9054 3056 11818 11821 15182 21483 20173 20378 5970 608 -23649 -13332
5253 -13332 -22619 -21106 -6303 -28824 -33225 -18978 -10582 -17980 -18851 -23156 -19551 6030 5790 -6247
5239 -6247 -4198 6863 8321 7178 13558 7644 -1117 -2271 -12451 -14511 -17645 -10812 -1676 -6193
5225 -6193 -14217 -7748 1297 7520 6610 -2826 -24513 -24344 -22945 -17082 -12669 -12986 -4803 -1118 11077
5210 11077 9012 -2238 7994 -4427 -24294 -21646 -12595 -2069 9563 10243 7939 851 -3334
5197 -3334 -12230 -25016 -7460 7760 -14353 -23891 -20676 -9446 -6235 -6689 -13780 -1641 12429
5184 12429 11852 5024 3782 4729 -1743 -3504 -4461 -5387 -1493 5536 12371 2528 -11171 -19818 -13761
5169 -13761 -14579 -23292 -16841 -17024 -21066 -11890 2415 -4814 1063 4211 3223 9786 10803 14741 11223
5154 11223 78 -9090 3125 19085 8384 -4152 -18217 -16071 -20287 -15132 -3846 -6357 -5636
5141 -5636 -6667 -25454 -32711 -33989 -22459 -22325 -26532 -27124 -12721 -2231 4459 4575 5765 6556 19282
5126 19282 1496 -12804 -14024 -18122 -17685 -19970 -11912 -3766 2922 4806 10373 9769 -7976 -30955
5112 -30955 -1734 15013 5533 6549 17105 30216 28076 15170 7841 3861 310 -2162 1183
5099 1183 1647 847 1916 5492 7049 4711 1516 1228 3428 -1503 -10331 -6992 1281 -1609 9590
5084 9590 19583 23163 17197 11423 10366 10195 737 -7638 -10755 -6281 -10126 -13620 -7803 -24147 -22999
5069 -22999 -10390 -2959 10644 9044 13025 23978 18896 8132 2494 -3099 16 -522 6906 9482
5055 9482 10398 12656 32484 33557 8091 2195 3035 -6304 966 2672 3944 9588 891 -842 -2460
5040 -2460 2478 390 6259 -8712 -14788 -3689 -8842 -5930 -4165 -7147 2892 6563 5456 4042
5026 4042 4182 10684 -1072 -8625 -6626 -11676 -17660 -11130 -11650 -9469 6033 14418 18461 10109 2021
5011 2021 5324 -4265 -4877 -1384 -839 -13749 -25914 -17672 -1035 2561 11857 6194 1746 16056
4997 16056 18543 20917 9225 -9798 -16546 -11411 -10598 -8744 -11283 -6872 -12328 -11121 -7192 -6070
4983 -6070 6518 17116 7126 2308 17976 8518 -1929 -2698 -4436 4123 4953 -4079 -3010 -13920
4969 -13920 -17348 -11231 -6443 3341 -9459 -7575 4200 5471 17584 29045 20701 19502 19880 12939
4955 12939 5898 61 4841 2874 176 -13555 -14362 -33872 -44514 -25557 5178 30464 29165
4942 29165 16390 12684 -202 90 9075 15840 1958 -6445 -17423 -13346 -1822 -2259 -5315 5736
4928 5736 -10009 -17802 -8652 4528 7439 6488 -6587 -4290 -4319 -8780 -11502 -8150 -13969 -21257 -20784
4913 -20784 -14184 -11021 -4006 2029 -7775 -6663 -8168 -3336 -5388 -8650 -9728 -11321 -4367 3382 -4138
4898 -4138 -926 10850 3547 39 4901 -2911 -13156 -8860 2747 -9233 -23175 -16000 -11854 -9505
4884 -9505 -7752 -13178 -26229 -25077 -10624 -19695 -25854 -22649 -18960 -6519 8697 17991 9163 -2813
4870 -2813 -1780 -2870 -25295 -37785 -31267 -31952 -18590 -14674 -9571 -12028 -7410 -18410 -14567 -8979
4856 -8979 -4167 -9518 -21404 -15545 -20783 -16475 -5508 -21864 -18141 -6121 -7277 -17972 -8116 -7038
4842 -7038 -21220 -20091 4652 15053 4072 6688 -785 -1131 9626 834 -4399 19323 23559 12581
4828 12581 4771 1940 -1667 -15021 -10555 -5727 -4011 2002 -7780 -17229 -23761 -26684 -29247 -21669
4814 -21669 -9001 -6728 -19455 -26504 -17102 -4580 -6922 -8026 -13764 -16541 -24142 -16697 -5955 -3068
4800 -3068 5267 13231 -3115 -17039 -25228 -37322 -28749 -21278 -22159 -18529 -14082 -14120 -16646 -16232 -5920
4785 -5920 -2171 -1339 -600 16686 10911 -553 -1970 -6233 -7185 -3053 -5554 -6020 -12874 2501 -2739
4770 -2739 -17976 -22879 -14918 -9264 -19905 -6873 3212 5720 10521 -941 -8494 -8763 1159 13613
4756 13613 16900 11846 3866 11144 -1089 -7813 -10082 -9697 -9502 4768 10575 1392 -4984 -162 -10361
4741 -10361 -23263 -26324 -17743 -11705 -7623 5272 12371 12934 22116 31191 24862 24283 12079 -859
4727 -859 8613 11835 5381 2980 6120 14394 1621 -10035 -18593 -4628 9028 13576 1586 2524
4713 2524 -1110 -980 3050 5949 9200 11491 780 -6270 689 5996 11595 16566 20020 22387 8996
4698 8996 9428 12060 11439 5771 -3213 5782 2690 -2329 -3352 -7655 -11721 -7368 1171 1943 -11031
4683 -11031 -25364 -10935 -4 548 -9003 -6695 5758 13126 7385 9543 11828 -402 -2767 -1136
4669 -1136 -8766 -12322 580 12035 647 -13753 -18949 -14625 -8007 -2971 1718 2838 10661 235
4655 235 -12269 -8891 2424 2782 7876 2718 -13429 -23682 -12057 -1749 -10452 -9843 -4661 3918
4641 3918 2508 7002 309 -2655 8039 20432 26329 22324 20578 21028 16116 -4470 -20342 -16813
4627 -16813 -15763 1541 17120 7542 -15711 -33994 -27920 -24922 -11805 1838 -3851 -16871 -23982
4614 -23982 -13115 -2715 4373 8202 12248 5817 -11145 -8454 -13642 -21498 -18900 -13475 -3797 11209
4600 11209 14744 11837 -2493 -11782 -14428 -19602 -27146 -10989 -8099 -11221 424 1236 200 4946
4586 4946 12052 24988 17905 10202 4392 4894 7738 16102 27405 26542 8010 4189 1091 6290 5523
4571 5523 9505 12214 14419 96 -30428 -34755 -20986 -11944 -7544 -7565 -4404 -9120 -7299 -4725 1346
4556 1346 4875 8903 16276 13661 1531 -15008 -1511 7728 2052 13111 3579 -6802 -17834
4543 -17834 -18492 -18819 -27447 -20817 -8477 12415 8474 -6056 -4319 -16961 -12067 -9294 -6572 1263
4529 1263 12015 21286 13169 9463 11531 17733 32439 12737 -16122 -19940 -9789 -7582 -5887 -6872
4515 -6872 -13271 -12966 -5019 -6916 -24081 -10161 2124 1605 498 1785 2057 5951 6082 -5333 -17563
4500 -17563 -6763 1499 965 -4173 5486 13047 21323 28070 26406 13861 3800 16171 19784 14106
4486 14106 -6257 -8442 -15747 -10986 -16515 -6243 -3739 -10114 4904 14090 7834 7328 6614 8006
4472 8006 5704 13188 13369 5650 -7672 -14479 -6665 -6264 -11878 -9859 18854 27611 18799 14466 6078
4457 6078 6585 1288 -4644 -8354 -8293 -23986 -17606 -23497 -13172 -9556 -8521 316 5114 5470 2582
4442 2582 4323 4372 9273 4818 5518 6799 17013 20064 19277 21608 6600 -4355 -2425 -6427 -13001
4427 -13001 -20909 -16074 -22827 -14013 -11937 227 5513 6393 6044 -101 2484 8283 5963 8588 1162
4412 1162 -1461 10734 10600 9495 8129 19987 11167 12872 5258 -5310 -1123 8475 13320 -1333
4398 -1333 -9792 -13045 -9482 -2215 1626 5230 19638 14782 -575 -17311 -16095 -2579 -12100 -9659
4384 -9659 -1672 -67 1158 -14761 -2592 16492 16935 13748 13301 7113 2302 -5785 -8186 -5267 578
4369 578 -321 3410 17898 25350 15562 -1928 -13231 -13543 -6261 -8955 1892 -9762 -13032 -2800
4355 -2800 -5749 -7063 -3601 12321 30545 26166 9501 1605 -3551 -5432 -789 4240 4607 9137
4341 9137 3603 -12365 -12243 -80 -1488 -3509 -7008 -2950 -230 -9775 -12698 -3429 -5117 -14686 -22567
4326 -22567 -11430 1031 -7006 -11736 -12726 -17284 -16780 -13998 -15255 -10482 -7579 -9132 -7342 -16040 -8
4311 -8 8871 13577 24841 40977 41572 23595 18151 9754 -20486 -28126 -14577 3279 11442 27693
4297 27693 41772 29346 -1755 -7998 -5274 -16711 -25792 -21828 -13096 4335 11187 12706 28894
4284 28894 25473 13049 14916 17835 15724 95 -11660 -9435 -7056 -17348 -20146 -14719 -8209 2848
4270 2848 -305 -4238 9537 17547 18198 13017 209 -13895 -20562 -11426 -2644 -5527 -8562 368
4256 368 13365 19545 16497 15679 3268 14617 16064 18048 18315 -10509 218 10494 -2965 -2740
4242 -2740 3437 -5443 -8467 -4271 5561 22445 17233 15252 13996 10314 2631 20923 19098 -297
4228 -297 -12440 5023 15103 6549 2664 5024 8335 -5806 -20491 -16037 -8637 9818 118 -12538
4214 -12538 -24697 -17378 -8092 -6798 -11541 -16129 -8578 -1866 -4714 -8632 -6032 -1210 -146 -1178
4200 -1178 -9320 -15395 -14181 -9171 -1708 -10866 -25958 -22217 -13195 -16608 -17186 -9113 -17312 -16020 -7539
4185 -7539 -14455 -11414 -11078 -13218 -11063 -3983 2658 4536 -1015 2567 -508 -6230 -7590 -5631 10849
4170 10849 14400 15397 2740 -763 12455 -882 -22561 -24883 -33512 -31213 -35713 -30577 -20740 -17497
4156 -17497 -3459 -2267 -8934 -9870 4327 8882 3400 1328 -6092 -11090 -1915 1346 -13849 -22787
4142 -22787 -20852 -18455 -12285 -16703 -21523 -27543 -12210 -7203 -1604 -19587 -18833 -13661 -11071 -5376
4128 -5376 -5482 -17359 -18226 -5203 3673 410 2873 -1525 -186 -613 -7675 -19694 -28452 -22837 -20454
4113 -20454 -12482 -11425 -13545 -12747 -13655 -7232 -9726 -8572 11144 11307 -981 -12435 -20794 -24269 -17573
4098 -17573 -16268 -4346 19307 23367 18250 20266 17118 15036 20722 22036 17445 12621 5807 -12658
4084 -12658 17 25339 31882 19053 14891 -1799 -6892 -11725 -11268 -5551 4377 -1445 -15588 -16556
4070 -16556 -2094 1246 14269 17522 19005 24368 24489 10466 -5483 -3314 1825 3762 2995 -11668
4056 -11668 -10672 -4766 -12093 -25010 -20079 1724 18883 33325 25819 25689 7362 -660 -4876 -17372
4042 -17372 -17011 -22610 -8838 7624 10346 3329 -1110 10316 15345 30272 23484 20643 20684 11477
4028 11477 -4588 -7756 -1382 3538 1779 -8787 -12640 -8029 -8199 -10484 -6976 -11121 -13967 -20344
4014 -20344 -21540 -14672 -13893 -12112 -2904 -5658 9095 5746 8452 8490 1900 -767 6486 5077 -6161
3999 -6161 -13151 -7549 1095 4106 -330 4151 1047 -434 270 -2739 -6421 2608 1054 -11855 -13757
3984 -13757 -1958 126 12013 16657 4049 -1565 11248 14356 9630 1766 9908 17617 13485 -1553
3970 -1553 12248 31618 20022 13699 8038 1544 -13830 -14152 4713 11908 13857 14725 12330 1678
3956 1678 -16522 -16370 -1692 5456 6151 2522 428 4642 -11691 -16667 -1108 9752 16528 5322
3942 5322 -5454 -10881 -17771 -14059 -14813 -9790 -15895 -11730 -14878 -11731 -11370 -6119 -724 -20901 -24248
3927 -24248 -11612 -8772 -11740 -18086 -5606 2136 2180 9963 10904 16931 -848 8523 7791 2217 -6955
3912 -6955 -1579 20332 14318 732 -78 -1547 -8389 3768 72 -2854 -837 -13963 -20568 -13889
3898 -13889 -10313 3437 14167 -3947 -9375 2041 -5032 -2877 11177 14639 4456 273 859
3885 859 -7348 -8064 -16005 -17174 -18463 -5843 -16122 -11911 -3210 -10158 -8107 -4824 11055 8835 17329
3870 17329 17366 13809 14001 2227 6293 5959 22932 14527 2335 750 5468 28694 32938 30788 20997
3855 20997 6739 -6247 -14178 -10852 1868 -7055 -18863 -25239 -37940 -28971 -17824 -16299 -2066
3842 -2066 1673 -1733 -8796 -22189 -31537 -24858 -24323 -13752 -13677 -22131 -15091 1165 9773 18329 22076
3827 22076 13146 19595 16026 11795 -9796 -26893 -25729 -21227 -9726 -11279 -17315 -20756 -25243 -18140
3813 -18140 -12288 -17630 -12904 -11582 -14104 -10686 -12014 -15873 -22661 -22951 -15296 -9006 -14195 -11643 -11287
3798 -11287 -5637 -4968 9939 8458 9120 15923 24142 21636 17038 7176 8845 3901 11299 5761 5591
3783 5591 20152 17524 4976 7710 -7666 -19090 -7960 3626 11799 -2958 -5589 -49 -5905
3770 -5905 789 20328 35617 23468 1694 -16635 -29696 -29406 -20695 -11148 -4639 -2279 -13416
3757 -13416 -10394 2866 -3238 -12777 -1718 5337 -350 -2827 -851 -602 6789 2619 -8638 -4656
3743 -4656 -6697 -4941 11820 14507 13832 9151 -11568 -12251 -2563 -400 -593 -1906 4133 2766 -517
3728 -517 -4380 -9903 -1357 8958 18717 -403 -8903 -10362 -11695 -10345 2389 10939 -396 -14834
3714 -14834 -19471 -18614 -18289 -26348 -25529 -14007 -15942 -20756 -12760 -1355 3528 -7003 -974 -10 -4236
3699 -4236 -13149 -17385 -11230 -3557 7522 14507 4426 8789 15525 7558 9394 2789 10465 10158 16516
3684 16516 22621 12848 -2516 -20040 -15895 -16850 -14454 -7806 -17808 -11624 -686 -9046 -13520 -10534
3670 -10534 -5823 -3378 -2799 -10205 -7084 -21606 -19691 -9520 -12283 -3999 -1735 -8110 -9063 7007
3656 7007 2926 -7465 -19668 -10690 -15215 -19505 -20908 -9670 -16218 -15239 -14976 -3963 14327 10694
3642 10694 15085 7735 -3670 12596 18452 23133 8171 -9370 -8003 3706 -100 -15154 -18179
3629 -18179 -17771 -14056 -13091 -23604 -26352 -2090 10691 15317 16964 16726 2105 -18342 -27842 -28939
3615 -28939 -24551 -9789 -4011 -7813 -3863 1216 -3001 -12419 -12093 -7800 -25051 -13600 -11908 878
3601 878 12458 16175 8118 -2841 4663 12656 5835 -9888 -12081 -3454 -7209 1217 7224 8711
3587 8711 13081 15220 8558 -12236 -13863 -19537 -18002 -934 14810 17390 13680 -8419 -21572 -15618
3573 -15618 -8533 -5740 -3570 9574 8036 3776 -4725 7648 12709 7340 100 12422 191 -10077
3559 -10077 -5998 -11447 -15556 -18419 -16984 -23622 -7770 16102 11531 3700 1189 12 -10491 -9642
3545 -9642 -4353 -9149 6461 13558 8652 -3377 -3684 3321 19431 12811 -3064 -19761 -21287 -7381
3531 -7381 -11089 -19745 -22996 -19051 -17177 2382 17023 21539 22721 19478 12999 2071 -16179 -19685
3517 -19685 1541 -2871 -4459 -415 -6192 -15322 -11379 -10109 -11602 -9471 -5470 2266 -5757 1981
3503 1981 -5220 -12478 -7508 -4637 -10074 -5019 -9108 -15004 -24760 -15976 2854 3689 -6413 -9725 -10777
3488 -10777 -7261 -9299 5912 4301 -4595 2493 9258 11882 2899 -4210 1166 -2167 2437 -3160
3474 -3160 -4990 -8686 -14782 -14429 -18338 -11573 -1892 5324 3694 4588 371 959 3053 6060 835 -5344
3458 -5344 -4891 5414 -715 1163 -4954 6445 6491 1296 14379 27639 28425 21017 12531 -261 -1815
3443 -1815 1995 -4885 -8612 -8790 -8179 -9260 -23654 -22312 -6937 4010 23213 21999 37921 34806
3429 34806 17614 11788 6517 12623 12836 13688 4705 5584 1470 -8553 -1655 -804 -2937 13334 1704
3414 1704 -14428 -18136 -9601 -2605 5028 10802 16749 8057 -14980 -25535 -20101 -4657 -2364 -12378
3400 -12378 -18293 -9579 9679 23666 23150 16596 6841 2160 12170 13953 6856 6183 9448 1156
3386 1156 -7186 -8933 -4747 -15094 -21771 -24865 -15937 -7389 5868 11911 13477 6393 17391 14356
3372 14356 8315 -4251 -6316 -1058 13228 18192 17043 24772 25503 23885 23378 18030 14588 18768 15752
3357 15752 10076 10138 10179 9241 4192 4798 6764 4584 -2846 -12390 -14053 -4712 8839 1745 -1098 9709
3341 9709 9154 5104 -9973 -28976 -19659 -17802 -18020 -2373 10583 15244 14642 5997 4843 355 20782
3326 20782 21316 23073 21340 16463 4830 234 754 3399 6821 12575 10550 1747 -6000 -6484 6837
3311 6837 18996 1502 -311 6759 -7888 -8260 16615 19156 -4922 -14445 -14836 -19013 -19655 -24409
3297 -24409 -12627 2425 -8896 -17617 -8087 -2137 -13909 -15212 -13271 -14375 -9988 -8129 -6974 -15088
3283 -15088 -8654 -2250 -5340 -9632 -6417 -7957 -21437 -15995 -13732 -13284 -16335 -11779 1330 -322
3269 -322 851 4534 6257 11586 19529 26407 26303 31920 25787 13651 608 -23266 -20962 -10452
3255 -10452 -6332 9011 7725 -9873 -8256 -9221 -9120 -990 8466 892 -8798 -1026 11213 21237
3241 21237 14649 10722 26417 22012 13701 12070 15283 10053 -11116 -11302 -6295 2271 3483 5134
3227 5134 -3145 -10194 -11771 -4249 -5418 -14794 2200 8051 -9150 -20358 3940 1722 -21314 -23569
3213 -23569 -14645 -6725 -8756 -12252 -12796 -15301 -1671 7691 7348 8499 16755 8752 15771 13412 9343
3198 9343 6737 4361 14873 19503 4162 14268 16925 -8696 -16260 -14484 -5362 -5272 1432 18372
3184 18372 4785 -6390 -7070 -18605 -31816 -25306 -15338 -12505 -9627 -3269 1502 2685 1430 13161
3170 13161 8015 -4659 184 5309 450 -13320 8424 20618 21842 8638 2329 -1416 -404
3157 -404 -8172 -7892 -7689 -6008 -1811 1829 4882 9089 15239 13629 16525 12566 -911 -11736 -9003
3142 -9003 4695 6809 1419 -12890 -18394 -13617 9968 983 -6117 -3468 6236 4165 -6146 -5571
3128 -5571 13141 13628 2470 2901 -13779 -19406 -15938 -7241 -13083 -20025 -23482 -20262 -22573 -13029 416
3113 416 4083 4446 434 -2530 -2518 -5809 -8432 3622 16029 16316 5931 15097 14140 5875 -1536 -2276
3097 -2276 -9663 -12665 -15060 -11555 -13845 -16491 -23305 -19896 -11041 -10960 -3135 16397 25594 1996 -4211
3082 -4211 2489 2269 -2075 -9551 -19793 -20784 -24591 -12499 2076 -4729 -9981 -25974 -16137 3729
3068 3729 -2491 640 10114 9221 -577 -6085 -10173 2766 -4247 -8256 -4369 -8655 -8684 -2953 -4093
3053 -4093 -1809 -6141 6719 18337 25860 13691 363 -1280 -2771 -4743 1809 4413 4196 -2263
3039 -2263 2687 -1382 -11914 -14898 -21646 -15774 -14382 -18695 -3709 17065 25132 16857 -7912 -10254
3025 -10254 310 5669 15459 1667 -7609 639 -1072 -3925 -1129 3642 -5920 -17286 -11194 -8851
3011 -8851 -7759 -3172 -3498 5971 2427 -3557 -8582 -10409 -16085 -18761 -12974 1460 -5865 -19480 -26182
2996 -26182 -37503 -34633 -36062 -39021 -23506 -8072 3765 -6405 -17980 -11773 -5157 -3371 -16823
2983 -16823 -22414 158 6508 712 -732 -9171 -7971 -3889 -3540 20719 27273 22440 4820 -2941
2969 -2941 3926 14490 3470 -65 9235 9964 -2858 1975 -607 -7739 -12105 -11435 -3518 -1958 -9395
2954 -9395 2878 13271 13478 17683 8115 794 3779 6144 -9008 752 7207 10180 14985 14033 22604
2939 22604 35557 27490 15641 10256 11202 19803 16559 14122 28967 27001 20996 5767 -7981 -140
2925 -140 -18 996 8188 11038 4786 -6067 -19086 -5721 -977 -2099 -8579 -15042 -7010 4897
2911 4897 -12946 -13640 -2332 -2090 -9144 -6399 6510 6757 -842 7478 17785 24128 22419 10557
2897 10557 2040 -1266 27144 24793 10661 -3113 5336 4870 5342 9080 6980 -5973 -15019 -26182
2883 -26182 -34085 -30346 -26932 -16939 969 -619 -735 4761 -5744 -17051 -40563 -37129 -9204 4355
2869 4355 -3197 -10505 -3174 17618 23441 16649 25655 30202 17599 -4021 -9817 -7499 -2441 -660
2855 -660 5092 10289 -5019 -5139 16800 15563 13056 11661 11458 10638 10404 2656 1984 -11714 -18153 -15830
2839 -15830 -3936 -3635 -5954 -2919 -4172 8184 13324 11661 6134 3491 6045 1368 10229 16396
2825 16396 21591 5691 -2192 -1308 -2693 4493 -8685 -18080 -22230 -48779 -48136 -42394 -14317 -7931
2811 -7931 -11410 -16639 -27534 -33027 -30339 -13502 3696 16007 5499 5463 -3731 -102 12711 5974
2797 5974 4133 4706 -2309 8408 14954 7878 6365 -1402 -10296 104 -7532 -1092 -2330 -7894 -8327
2782 -8327 7463 13774 20234 16754 6491 1903 3326 8218 16668 33564 7612 -7698 -9109 -10763
2768 -10763 -9469 -7022 -15377 -25028 -27126 -15574 -13240 -12534 -8419 -5210 2138 1791 -2512 -4713 10300
2753 10300 13347 7840 5211 -2966 1492 2698 4738 -4558 -9647 -7980 -3505 -9186 -9255 -15042 -11354
2738 -11354 -3638 -1002 -4337 11005 8910 6746 20230 31631 24645 10379 13356 3949 -4523 -3865
2724 -3865 -3679 -8676 -3198 4164 8720 7064 6755 3608 -494 13044 12754 2234 -785 3021 16379
2709 16379 22226 3377 -705 10424 12985 8842 4732 8950 9351 5241 -1229 -1784 -27 4288 2250
2694 2250 -6447 -17376 -21541 -9641 531 4756 -11208 -16552 1099 8042 3857 807 11055
2681 11055 17183 19516 6339 -6853 -11900 -2185 -4824 -3000 451 10687 -56 -14189 -16689
2668 -16689 -19810 -7527 10054 1786 -20492 -15768 -5472 -14004 -4030 -2605 -4115 -9280 -4238 2589
2654 2589 5546 442 -464 9312 5567 15630 20544 12362 -1134 -7572 -4816 9355 28922 32051
2640 32051 23871 20225 9359 6935 826 -2381 -6505 -4910 3643 13432 -972 -100 6056 1990
2626 1990 -321 16866 22285 18023 19710 13199 -3207 -14449 -21290 -18514 -21146 -10636 -7677 -3073
2612 -3073 -4135 -18603 -8320 7692 -2658 -7142 -7234 -3347 7511 26137 27298 13959 3711
2599 3711 -6424 -16971 -10772 -15958 -18063 -14518 -15364 -7334 -9986 -10182 418 -15140 -43872 -34576
2585 -34576 -18921 -11775 -6858 -6507 -3825 9063 7815 8862 4660 8428 6623 6494 7830 6915 3225
2570 3225 7758 20840 19447 9314 9099 -2422 -16832 -5702 1280 3192 2354 -5337 15 3946
2556 3946 339 6065 12444 24527 17048 14057 8835 -256 -3613 -16766 -22663 -16856 -571 18161
2542 18161 11838 8646 7041 -6559 -12456 -21782 -29875 -24747 -16094 -16365 -25820 -34751 -34101 -20200 -11653
2527 -11653 -5105 -9520 -8280 2377 -2495 -10456 -18315 -22360 -25239 -18811 -9532 3764 11201 14561
2513 14561 7410 9356 10117 1378 3878 -4242 -11601 -1191 7140 -1006 -16293 -11966 3770 15249
2499 15249 12263 16558 15420 -1383 5300 6009 -931 336 13845 -224 -5899 -14488 1215 16373
2485 16373 788 -6220 -6831 -4267 -10250 13331 19499 14196 4529 11752 18627 19371 12953 1378
2471 1378 -11386 -1031 12305 12951 1433 -13715 -11750 -19585 -29190 -20418 -7015 -14769 -12296 -16567
2457 -16567 -12612 -1592 6583 16062 13412 -2297 -1711 1933 5599 3627 -3701 -1361 4199 790
2443 790 -6817 1590 1650 7008 12713 4458 16986 26556 27390 19652 12669 11551 12783 22149 15446 -6918
2427 -6918 -6946 8047 -2754 -13554 -10266 4066 5652 2146 -7738 -11994 -17807 -7542 2619 10143
2413 10143 14241 4495 5059 -9370 -9208 -8949 13431 29862 20830 15728 16403 17359 20621 5686 -1530
2398 -1530 -2399 100 -4506 -5564 -162 2318 -2825 -18170 -14219 -6457 -8701 -8379 695 2026 3788
2383 3788 14784 23980 20241 20215 19263 12012 9287 404 -5169 -1747 -5470 -14190 -17747 -15722 -10285
2368 -10285 -3471 -5886 -4570 1041 3503 3359 -15287 -21647 -9369 4442 3725 2696 -1107 -7774
2354 -7774 1711 4015 6741 10062 13506 9660 -3285 3833 19426 31075 31710 28223 3342 -15542
2340 -15542 -4254 -8968 -17799 -15798 -10924 -6693 7021 3160 -8095 -12574 -8451 -4562 -14309 -4532
2326 -4532 -7427 -21540 -12709 -9533 -6113 -4100 6514 26567 34256 27695 18399 3766 -11170 -15188
2312 -15188 1393 -7688 -9850 642 4278 2745 13127 11779 -792 -24031 -6986 -910 -11242
2299 -11242 -5129 4952 9732 10848 12698 9266 -1332 -6160 -17372 -29729 -38370 -35302 -22164
2286 -22164 -23959 -22864 -15985 -15696 -10515 -9519 -6506 -4937 10057 20827 31778 23196 1099 -2128
2272 -2128 837 4569 -1671 -6273 -26736 -28359 -11314 56 2500 -3305 -19092 -13654 -168 5574
2258 5574 7878 836 957 -6501 -21049 -22666 -11390 -15959 -27266 -29193 -30334 -17543 -8513 6421
2244 6421 18197 19554 21627 9422 -5952 -10214 13 755 -3766 -1042 -5994 -12832 -12658 -1357
2230 -1357 9328 14235 8124 12569 12834 -962 -17448 -19517 -1290 11066 7786 12273 19713 16926
2216 16926 -1821 -4228 -2514 -5634 -16667 -14924 -7977 12863 21249 14187 1182 -5445 2912 1131
2202 1131 -6752 -5432 12335 -946 -8777 -1416 3812 187 1106 3810 7615 5406 -1383 -16049
2188 -16049 -20009 -6837 19709 25906 1568 -7963 -5998 6977 10161 13477 9649 16627 16097 9485
2174 9485 14454 15089 20008 19013 20849 20826 24221 35458 29109 8899 -6612 2256 9332 3076 8936
2159 8936 13146 8778 3339 -2060 223 10359 13383 5565 21905 39081 48659 37973 22983 22996
2145 22996 15575 12319 25584 10343 -4144 597 7211 -146 -7541 -1729 4668 3091 2640 7896
2131 7896 7683 5353 16441 23940 26350 19827 5906 -4743 -9894 3047 1208 -6770 -5786 5206
2117 5206 13886 1564 -5731 -4619 -15107 -9154 -4558 2134 9768 11011 18163 23373 18546 12627
2103 12627 -1427 -9716 -6538 -328 -17297 -15755 -13537 -12822 2362 -2013 -9645 7360 17633 11920
2089 11920 8294 14158 7511 8588 7230 13631 5087 -14273 -10398 135 -9357 -19964 -28688 -27661
2075 -27661 -23009 -16925 -14739 -6578 -1733 7366 16210 684 -22451 -18486 1144 -1214 -8089 -2827
2061 -2827 -9063 2890 9153 11663 6290 11004 10857 10234 15642 2774 1986 14148 17384 9612 -2407
2046 -2407 6259 10166 -1837 -16154 -3430 12284 10142 -5124 -12462 -14564 -12300 -12920 -9234 -8159
2032 -8159 -8217 -5003 1466 6077 3031 4915 2781 7125 7640 10944 10192 3765 3509 14629 9051 -5629
2016 -5629 -19553 -8826 358 17108 12853 -692 2504 1549 -9783 3743 8301 8142 21644 18369
2002 18369 18062 12799 18191 13268 10693 4160 -2012 2897 -3861 -2227 7774 14051 7419 -4489
1988 -4489 3863 19515 25267 15048 10480 -7515 -9845 -7671 3503 16562 13309 7573 4128 14746
1974 14746 23591 11604 11389 6786 657 11758 17917 19696 13265 -4379 2970 8722 13008 20496
1960 20496 26012 25381 11132 -2940 -25997 -26573 -32425 -20597 -4383 -6393 -2366 -3524 -18897 -31607
1946 -31607 -25982 -25808 -6924 752 -1286 157 -18343 -29863 -22238 -22452 -1965 11503 7697 -1890
1932 -1890 -962 -3788 -18520 -16364 -7915 -4492 -14775 -14988 -20461 -32482 -11987 -18568 -23436 -12605
1918 -12605 10355 11415 -1983 17662 29615 25468 22668 14227 6248 2326 -3804 569 20898
1905 20898 20469 7402 -5727 -5268 14400 2853 1068 11218 811 -16584 -24156 -32354 -40158
1892 -40158 -29721 -22156 -12920 -9036 -11468 -10521 -17578 -19206 -4876 3949 14786 8214 -540 -3335
1878 -3335 913 9262 7897 12394 2415 9061 17829 19725 9004 1743 -1558 4526 11822 15104 8476
1863 8476 2402 5065 8804 -3973 -4352 8647 15668 2482 1946 -6868 2918 15892 12111 18568
1849 18568 15615 22453 20637 3471 -345 -5054 -3175 -14058 -8986 -8359 1528 -766 -4186 533
1835 533 10347 11647 7995 22829 34953 41904 17132 -2340 -12521 -1688 11285 19220 -398
1822 -398 -14133 163 -1918 5502 14437 5727 5780 22116 17576 2787 -3453 10510 24759 27639
1808 27639 24275 14655 21711 25464 17472 3403 -5670 -17873 -20937 -14257 329 3282 -584 -19796
1794 -19796 -16689 -1679 7413 10204 -4241 -5427 51 1098 4870 1905 -6915 -12892 -9440 4618
1780 4618 15882 20292 5003 6583 9298 7835 4794 -12589 -12690 -600 8276 4777 418 -6731
1766 -6731 -4999 -13077 -29093 -27431 -35332 -12069 -630 -2180 -8353 -13854 -3588 -3172 -5198 -12413
1752 -12413 -17361 -5047 1530 6122 2087 -1646 -3727 3212 3249 10135 13287 15490 10249 14894 22107
1737 22107 15853 -351 1431 6556 16297 4124 6761 9193 9210 26630 25387 6010 -11093 -5522
1723 -5522 -3200 -1338 4062 5608 1771 14130 11126 8267 56 -2709 -7696 -8851 1068 18557
1709 18557 21094 -1524 -25369 -14600 -12997 -15682 -3316 -486 -3453 -8382 -12599 -10106 -9470 -3741
1695 -3741 2138 627 4382 1084 -5413 -332 3499 -3790 -10710 -12271 -17484 -24141 -12975 -5523 11217
1680 11217 16168 22385 16898 5923 14549 19477 27812 19221 2198 15631 23803 23334 23488 22227
1666 22227 16543 9381 -9527 -24076 -18275 -14545 -2276 -5780 1403 6477 3116 3451 3035 -131
1652 -131 2516 8087 14587 11604 -3377 -10990 -12815 6448 17287 25102 32250 29286 6631 1983
1638 1983 -3149 9408 14210 20449 23049 19508 16503 17729 21172 19726 10414 1734 7884 15532 23613
1623 23613 25170 21489 9104 11916 16968 12926 2423 668 -4287 -1745 9860 10526 7548 4711
1609 4711 -2473 3522 10833 -3683 -4972 -5151 -4976 -9136 -12586 -3513 -1410 -1680 -6118 -688 1228
1594 1228 -352 -9632 -3844 -7822 -8144 -2776 -2273 3999 13991 8973 -9762 -4413 -4294 -4908 5640
1579 5640 2839 6052 12688 394 -12898 -5742 4680 -8670 8618 18797 5661 -860 11734
1566 11734 8612 1289 -2844 -9801 -13900 -4482 11901 23846 11890 3781 15560 20984 12397 1106
1552 1106 -7829 -20550 -29355 -20491 -6672 7053 7466 12651 3124 -5489 2937 4255 6321 5281
1538 5281 6407 11103 1071 -1761 8222 7093 -7248 -9773 -12980 -9019 -12342 -11064 10603 30729
1524 30729 3414 -8242 -2799 -8281 472 1936 14292 11825 5015 8872 984 38 -17882 -14718
1510 -14718 -8851 1717 5461 -1807 -293 -9435 -10027 1463 -2603 -14979 -14156 -12077 -16881 -210
1496 -210 13920 9199 5018 8498 10797 16463 5957 -4155 -8390 -9528 -13865 -16159 -31442 -30049
1482 -30049 -21428 -16262 -6806 4270 -22247 -26933 -13214 -8466 -12828 -14191 1093 23032 30776
1469 30776 30215 21187 14979 7830 -2152 745 -6031 -17650 -20753 -19065 -17823 -18660 -25190 -22519 -18585
1454 -18585 -23799 -7839 -3225 580 8469 14466 23127 19566 17250 -3582 -2353 -2456 5101 7647
1440 7647 -1722 -5789 -22486 -13063 4973 9244 -10071 -13803 -3639 -1833 4337 -8666 -8156 2914
1426 2914 11426 12249 -2123 498 12364 -472 2930 8259 8889 16324 9404 11081 -6324 715
1412 715 9367 14939 17630 23999 29779 27568 16591 20245 20392 12051 7578 17897 25784 29406 21207
1397 21207 12876 15651 14731 -8735 -20443 -17539 -9670 -1224 10260 11883 5998 12698 19800 9009
1383 9009 5919 -1021 -5501 -3203 1070 3950 21111 23664 15145 2265 2789 6007 1948 -6844 8952
1368 8952 5817 -7668 -8935 -3598 -159 14706 24830 21437 9943 5161 13142 -2535 -20697
1355 -20697 -16375 -7777 -8739 -12757 -3307 -5683 -15494 2455 17286 10724 5670 8384 5694 -12104
1341 -12104 -18646 -12601 -27393 -16869 -2397 -5453 -9157 -10555 5361 9648 -12500 -23665 -20020
1328 -20020 -5479 114 1330 -2976 1193 12732 18172 3700 -3997 -20230 -18113 -6065 -178
1315 -178 -6585 -10422 -5295 3487 7058 8310 19484 22745 12864 18781 22999 12604 2303 -305
1301 -305 4026 -6244 -15456 -5625 -6322 900 5420 -3495 -18857 -13826 -13422 -25868 -28021 -11193 4235
1286 4235 12288 2764 -18130 -19403 -9223 -15976 -18557 -18116 -8073 11813 13656 -3505 -12687 -14299
1272 -14299 -22860 -15424 3421 19402 7670 7880 20794 24809 26825 18573 11886 12398 -1693 -4588
1258 -4588 -1362 6627 -1231 -19915 -5575 20527 22505 22546 10517 3524 -650 -7349 3053 12431
1244 12431 10091 4838 -9 -4405 -9110 -10366 -10593 -1647 10144 18912 27793 22348 17229 11602 3049
1229 3049 5533 5016 -2359 -1860 5297 3095 615 8811 16975 20882 19623 10772 4980 8837 10258
1214 10258 3626 486 -12378 -28317 -22784 -15784 -9688 2998 16829 9223 -2105 1576 -7354
1201 -7354 -19036 -12142 5128 10845 8816 13065 114 -4120 1969 6018 6483 7528 11585 -588
1187 -588 -165 -4326 1828 7221 6262 2229 -9337 -5038 4748 120 -7214 -5221 -385 8194 14779
1172 14779 -1375 -9875 -13861 -17116 -30013 -21937 -8834 -4292 386 -6719 7071 9406 5830 1401
1158 1401 7020 8190 1151 -12547 -18459 -18439 -14247 -3954 1617 -15379 -16907 -6790 -159 5278
1144 5278 4815 -6600 -1034 13602 -8002 -15704 -9273 10306 6514 -3111 1340 1766 -4116 -4907 6672
1129 6672 7389 5344 9138 6465 4762 19000 5324 4438 23173 13582 1089 1024 1613 850 -2345
1114 -2345 -3433 -7955 -10066 -3202 -4621 -6576 -995 1991 -3919 13478 20264 22278 19226 3416
1100 3416 -9688 -14319 -15541 -22400 -17641 18964 36539 37695 25532 13568 11553 14474 3893
1087 3893 -7103 -14431 -12314 -7599 139 10313 10966 12309 4933 2518 -7473 -11459 -9732 -9752 -5246
1072 -5246 -5280 -3231 2442 -9544 -19374 -13647 1202 6703 10652 13951 15807 23822 21347 11279 16273
1057 16273 18375 15833 26160 27222 26918 12890 16312 10550 5083 -61 -8727 -18864 -12347 3047
1043 3047 159 -7986 -15409 -5625 -6677 -9640 -6803 4679 3248 1201 -249 -13464 -4693 359
1029 359 -4455 -1021 10392 10061 12231 10512 20085 24702 18284 13286 7908 7477 9286 8103 9894
1014 9894 -1874 -13393 -21167 -18613 -5243 -15303 -13123 -4731 -8452 -2638 7180 7729 1710 793
1000 793 5152 1272 962 10270 19585 17716 15825 3184 1877 1464 -6454 -8129 4897 17080 17405
985 17405 6221 -3287 4415 800 -4726 443 12108 9315 20572 18484 5958 9350 12545 13168
971 13168 12733 21355 26647 15609 4305 -831 5096 -3197 3899 1605 -4098 -23813 -26910 1588
957 1588 10048 11408 16106 6367 -7324 6606 2974 3914 11199 18918 12431 2332 3158 12904 20465
942 20465 26136 31692 34648 18237 10061 -849 -68 11458 18397 20966 23588 5419 -10495 4103
928 4103 20823 18450 955 -7122 5916 15088 1906 -3064 -8340 -9022 -17850 -3321 13541 30427
914 30427 26253 16435 2724 -12952 684 -2518 -4550 -8150 -19620 -24993 -13187 -6047 4052
901 4052 15326 9288 1519 -14764 -15432 -3720 -658 -5116 -2693 5684 11942 6482 13856 19939 11265
886 11265 6400 -8059 -5925 6047 9578 2123 -1887 -5854 1475 7200 11431 22488 32357 25322
872 25322 21060 16169 7322 19002 10988 17028 23369 14408 24567 25576 22759 27187 25773 16531
858 16531 8810 6239 11191 8717 1562 8005 16895 10042 3514 13796 16335 19853 13566 172
844 172 667 -2634 -1995 -12633 -14779 -25226 -19892 -4185 -2843 -15392 -12620 -297 149 -4586 -3777
829 -3777 -4464 -11525 -13001 1626 -5190 -2461 14946 15000 11850 14136 750 -2967 -1061 -9086 -5460
814 -5460 7898 2662 14405 18199 9963 25802 16399 11438 4924 -10014 -4563 -832 -218 13542
800 13542 25936 24173 28084 29934 20104 2667 -12925 -13522 -9952 8196 19234 16390 4679 -3064
786 -3064 6429 -2700 -13968 281 4142 8481 22460 12166 5375 1481 -10108 -6486 -1263 5574
772 5574 6381 -3991 3269 11293 5575 14246 27045 15456 8654 8928 8255 6577 -631 -334 -9111
757 -9111 -5090 12981 18615 11969 7815 5556 12147 7014 3690 5819 16719 12865 1307 4443
743 4443 -1696 -6921 6533 1348 -3257 614 -10669 -18728 -12924 -8404 -2757 8398 12439 13767
729 13767 724 -11316 -787 5762 -4822 -8559 -3707 -5602 18712 40379 17173 4634 22155
716 22155 23015 17424 9641 1613 -5636 -4374 -732 3380 6137 17247 17490 10519 10235 14670 14663 9698
700 9698 9177 6341 5012 8922 12096 -2625 1580 -3818 -11027 -2473 3394 -446 -16804 -22866 -19029
685 -19029 -5627 3794 -7080 -7358 -4373 -10854 -12716 -10064 -1236 2417 -6304 -13185 -11103 133
671 133 -2980 -3376 8582 2658 -11853 -14652 -8433 2100 147 4558 10802 22680 25662 16147 5303
656 5303 -2679 -1329 1151 13522 18002 7298 14219 23562 30425 31336 17490 27697 18108 6080
642 6080 -7801 1229 4006 2047 18377 24582 19333 24834 19537 13212 15072 19797 14977 15200 15863
627 15863 3385 -1628 -4445 -2150 -3848 1089 8726 6825 10785 11628 6842 10423 2911 -7157 3480
612 3480 9186 1442 -593 -17287 -34613 -19792 -11710 1187 -6742 -10022 -3024 11558 2094 2246
598 2246 -3394 -5436 2066 -7392 -6275 302 2732 3470 2871 9169 26195 37956 37785 35873 38207
583 38207 38155 30962 17289 15913 22636 11055 9984 7757 -4331 -1011 3170 494 8339 20453
569 20453 16341 6918 -957 9754 8532 14301 6817 8117 7897 3338 -6437 -1158 11921 12154 5971
554 5971 3382 -7515 376 9659 10153 4724 -837 -5983 -13846 -9178 8344 15337 9269 19121 21156
539 21156 14338 5828 6413 14967 12474 19431 12442 8933 9311 11754 9331 7741 7189 9968 17608 14343
523 14343 11266 -5696 -2387 9098 3946 9286 9783 5316 -13441 -17378 -17093 -17873 -13329 -3484 12483
508 12483 12938 14960 20891 25625 24897 8503 -10159 -14269 -10848 -13670 -11221 -19293 -28784 -13131 7805
493 7805 20076 17333 17187 9686 2421 8474 6329 6865 8248 15973 -428 -5703 1601 14594 6197
478 6197 7606 905 -6738 -2275 3265 11495 9637 -1059 -3844 -2316 -4019 717 -4302 -3595 2161
463 2161 3810 -13820 -14641 -2200 4730 11122 9060 15489 15130 11128 699 -7113 5312 16576
449 16576 24365 30420 29460 20639 20911 48454 60974 50744 22827 16121 16490 11058 17714 19673 15046
434 15046 12997 24031 21142 10832 7710 9047 8405 3765 3059 10463 17832 20012 16005 3335 12969
419 12969 14478 17148 27982 36378 26200 4501 9555 10953 10721 16525 16627 11874 -2554 -556
405 -556 15170 29906 25970 18037 8344 6597 11170 21235 24337 22691 30809 21898 9332 4698
391 4698 14581 9596 -1501 -5025 1208 -1373 -11182 -17405 -21509 -16476 -7208 4719 6948 3832 -2443
376 -2443 -7793 10387 20396 11676 13259 5608 -8669 -11193 -2959 -8159 -5441 6345 -2233 3699
362 3699 1034 1519 -7651 -12619 -11222 -9708 -9066 -13821 358 18852 31435 29085 21292 15814 8086
347 8086 3915 14820 -3089 -13079 -1154 13711 14864 -3815 1795 7754 3965 3556 965 476
333 476 -4216 2545 12215 2926 -17259 -13644 -1584 1046 78 -8078 -11687 -21336 -22599 -23878 -25442
318 -25442 -9627 4102 10296 -700 -6811 1451 838 4023 11621 9240 6506 14524 19562 23841
304 23841 14698 1789 9687 4499 -3549 -3942 -3396 -1676 -296 1557 -171 4366 7412 8801 7136
289 7136 4625 4168 5771 3217 -7556 -15520 -17407 -8877 2502 4454 11942 15980 26835 24201 11430
274 11430 9126 15711 15824 6234 3033 1500 11043 16222 10111 16980 18218 9891 11680 5455 5285
259 5285 20826 27550 10061 -1115 810 5281 10840 23364 14792 1576 2922 495 12152 5948
245 5948 375 6505 23077 22542 9071 9300 4819 -10264 -17986 -2513 10519 11054 14779 20092 14343
230 14343 7212 13608 14459 -1510 -10776 -2855 5117 13218 10810 18129 19408 17973 10181 6254 10281
215 10281 7541 1526 4560 15824 23572 24591 23869 23860 13487 16261 2535 -7150 -11389 -5466 -1441
200 -1441 7148 3987 -6552 523 16878 11897 4078 3297 -606 3162 54 -5375 3357 7376 -1613
185 -1613 -8562 -7278 -6410 -2328 1191 1787 -2808 -6747 -2482 2221 2568 5283 821 2928 16626 18158
169 18158 19839 21880 19126 17483 26109 22760 14801 13862 12315 15540 19436 1867 4602 15423 5690
154 5690 2644 -4709 -1093 5192 11574 11361 5837 6594 11708 7086 -2645 2527 12195 15501 13791 7472
138 7472 -418 1149 -2492 -2578 -2098 -11010 -15590 -5847 8373 19012 17933 15818 16122 11534 18328 25939
122 25939 24131 24351 18993 4602 -2675 1876 4544 3490 13408 24972 21435 12069 6191 14074 17494
107 17494 14086 14660 11617 829 8262 14507 12581 8479 3000 -6593 4964 25529 20646 11045
93 11045 7924 646 -330 1641 3553 10586 13097 19767 25165 26277 14150 7688 16656 8049 3322
78 3322 6381 2271 1547 9982 9183 166 -8636 -7442 2949 12505 9353 2677 5739 4600 5963 7157
62 7157 2470 4545 2102 4515 6315 3564 21942 28494 27220 27727 22189 14880 6175 -3230 -1381
47 -1381 6735 9789 13384 15730 19631 21942 17978 7843 5801 4012 2817 5413 5372 9594 2700 -13669
31 -13669 -14546 -8302 -793 1597 375 -1812 7357 14279 9348 8803 10659 11714 10796 4667 -7750 -9829
15 -9829 -1444 14155 16055 21110 21105 15868 815 -15463 -17658 -7547 1525 6088 13908 18548 21629
0 21629
$$ Imaginary data points
##PAGE= N=2
##DATA TABLE= (X++(I..I)), XYDATA
32767 78764 85191 85807 76610 66399 72381 79556 86580 82779 93223 95635 90441 94850 81968 75759
32753 75759 82341 88550 80000 80449 81225 91256 97449 92344 90649 94930 107122 108250 102017 104575
32739 104575 119989 126918 120418 120623 128802 122710 117466 112704 111356 119060 119340 121923 111994 100773
32725 100773 104393 108905 120253 128237 121465 118454 120165 118186 108801 108366 110097 121393 118760 116043
32711 116043 114503 118967 120811 122848 122700 116225 111536 109296 116034 125667 123928 119765 130156 127163
32697 127163 118973 123991 131758 142314 141019 133864 132576 141564 151205 151182 145096 157185 153652 142985
32683 142985 141512 149416 139967 135084 139707 140410 149599 154779 156340 162448 169152 167395 159079 156881
32669 156881 150641 152510 160242 171403 173235 168320 165396 161829 165089 157078 150834 150550 152809 157614
32655 157614 155050 157768 172032 165665 159063 173290 190868 191312 195165 195524 187560 172800 175705 184294
32641 184294 178482 170881 181057 186103 175580 175604 172435 177881 189289 186851 181661 192285 206706
32628 206706 205386 196488 191034 176558 172967 173045 178238 176214 178895 181617 196643 211625 208166 194049
32614 194049 184224 188223 209363 214544 204952 190345 187146 183379 190528 200586 199441 213805 213035
32601 213035 215354 226516 225750 213156 206409 219156 213810 211359 203966 193311 184512 191089 198584
32588 198584 202329 199372 197103 202672 213622 223715 224872 217450 209535 212248 219935 225034 227135 230755
32574 230755 225848 222411 208988 198652 209842 222397 239160 241481 240674 234696 231505 236145 233679
32561 233679 231877 230279 212799 214111 218337 224526 234351 240331 241918 235185 243808 246040 250022 247929
32547 247929 240280 240003 250470 247463 238231 240223 246110 241236 233047 239754 244577 240427 242743 241582
32533 241582 229478 224357 236496 238524 229160 225456 217666 214424 217221 219835 213926 209843 203777 218731
32519 218731 225580 221276 235792 250027 248068 253585 245298 245637 248597 251159 253487 255388 258154 251641
32505 251641 251573 252789 263084 264660 261674 264002 274655 274589 270952 264495 260407 257794 254645 255694 256258
32490 256258 254754 250737 258669 265799 260168 253639 258091 267315 268849 270912 261834 251731 250742 252666
32476 252666 257596 261445 274247 276933 271042 273044 278010 280850 283002 282885 284379 284367 288581 284725 278234
32461 278234 264286 266014 281714 286422 294681 299354 292733 291219 288856 288591 284498 283232 276433 279507
32447 279507 279176 267695 273394 273082 275070 280449 285432 277490 260786 247290 258302 265347 275265 279829
32433 279829 278952 277989 259270 260130 278930 283447 271976 258156 261173 276560 277998 279708 294325
32420 294325 296727 302299 298928 284210 280297 288958 294367 302230 298235 286361 277547 288675 294250
32407 294250 292376 294358 302082 291550 290451 299665 297788 304901 307803 312546 316154 300107 279907
32394 279907 276909 280634 287269 296943 301315 306980 302257 294591 289384 282437 284874 288716 281737 282382
32380 282382 289621 282480 284920 284502 301924 320903 328190 312638 313462 308910 298576 297676 290266 293259
32366 293259 301165 319660 322917 321853 322572 324720 315852 318453 320356 316722 318377 308850 304679 311619
32352 311619 323708 314028 310193 310290 314619 316311 310912 298264 299001 299783 304246 320386 313315 299135
32338 299135 292183 299492 303649 315335 320582 313554 300383 306611 311310 306208 305505 306617 308899 309321
32324 309321 315582 319011 319690 312198 314128 322980 318540 300923 306617 318358 321588 322710 329448 336366
32310 336366 331464 341844 346009 331331 315427 309733 308948 309237 298616 314339 318918 317974 314143 310965
32296 310965 309659 305057 297998 305816 302710 312924 336673 342137 337413 325251 313178 308640 320214
32283 320214 316193 299440 308318 316646 317736 323739 313261 306883 331416 335130 318736 305356 302854
32270 302854 301321 314670 318966 304268 307256 326152 331944 339357 351278 354231 349370 336601 329514
32257 329514 336817 342801 331942 329406 321105 325835 328350 328965 326376 325745 327413 332002 326224 327448
32243 327448 331774 326133 332123 324773 318044 334159 332860 329246 328355 326217 332070 344832 336627 318140
32229 318140 319545 328248 325276 332976 341478 325642 316635 323596 320343 328721 325254 320901 326010 338784
32215 338784 355822 356961 352097 357313 354631 356277 361019 360071 352098 333508 333733 331147 338964 347700
32201 347700 336715 332070 336478 331370 326344 336690 339799 328152 315667 317831 322924 331884 339925
32188 339925 334888 339935 349416 336985 336551 341494 338429 338412 334599 326687 320492 307596 303833 314673
32174 314673 327207 331143 331914 324564 323592 312497 305789 307730 320746 323442 322099 330147 333993 325882
32160 325882 316903 321944 334293 329772 310586 309755 310099 321149 331191 328345 336481 351527 360705
$$ [...]
##END NTUPLES=NMR SPECTRUM
##END=
