##TITLE=Analysis number 319519
Compound Code cc 12413
Project Code adrs
Chemist Name ugmt
##JCAMPDX= 6.0         $$ Bruker NMR JCAMP-DX V2.0
##DATA TYPE= NMR SPECTRUM
##DATA CLASS= NTUPLES
##ORIGIN= Bruker BioSpin GmbH
##OWNER= nmr
$$ XWIN-NMR		Version 3.5
$$ Wed May 17 14:50:59 2006 GMT Daylight Time (UT+1h)  MAYBRIDGE\nmr@NMR_250MHZ
##.OBSERVE FREQUENCY= 250.131544655141
##.OBSERVE NUCLEUS= ^1H
##.ACQUISITION MODE= SIMULTANEOUS (DQD)
##.ACQUISITION SCHEME= undefined
##.AVERAGES= 16
##.DIGITISER RES= 18
##SPECTROMETER/DATA SYSTEM= dpx250
##.PULSE SEQUENCE= zg30
##.SOLVENT NAME= CDCl3
##.SHIFT REFERENCE= (INTERNAL, CDCl3, 0, 16.522)
##AUDIT TRAIL= $$ (NUMBER, WHEN, WHO, WHERE, WHAT)
$$ ##TITLE= Audit trail, XWIN-NMR		Version 3.5
$$ ##JCAMPDX= 5.01
$$ ##ORIGIN= Bruker BioSpin GmbH
$$ ##OWNER= nmr
$$ C:\u/data/dgb/nmr/ADRS/4670/pdata/1/auditp.txt
$$ ##AUDIT TRAIL=  $$ (NUMBER, WHEN, WHO, WHERE, WHAT)
(   1,<2006-05-17 14:50:18.48 +100>,<MAYBRIDGE\nmr>,<NMR_250MHZ>,
      <created by zg, POWCHK disabled, PULCHK disabled
       configuration hash MD5:
       84 BC 41 DB A1 6E 1D 46 DA 25 12 A5 C1 ED C5 3A
       data hash MD5: 64K
       83 DE 01 41 A9 98 B2 EE A6 92 DA C8 B4 18 9B 49>)
(   2,<2006-05-17 14:50:36.48 +100>,<MAYBRIDGE\nmr>,<NMR_250MHZ>,
      <Start of raw data processing
       ef LB = 0.3 FT_mod = 6 PKNL = 1 SI = 32K 
       data hash MD5: 32K
       3F 22 7D 76 CC 81 32 25 CE 94 3C 99 DF 89 E4 29>)
(   3,<2006-05-17 14:50:41.60 +100>,<MAYBRIDGE\nmr>,<NMR_250MHZ>,
      <apk 
       data hash MD5: 32K
       69 8A D2 3F EC A4 FE E6 CE F6 AE 36 8B 5A EB 45>)
(   4,<2006-05-17 14:50:43.90 +100>,<MAYBRIDGE\nmr>,<NMR_250MHZ>,
      <abs ABSG = 5 
       data hash MD5: 32K
       20 22 DE B0 96 64 8E 01 A4 96 A8 3A DA 96 0A 63>)
$$ ##END=
$$ 
$$ hash MD5
$$ 6D 0D EE 3A 5C 7C 67 A2 E7 05 6F 6C 3E 04 6F 76
##$RELAX= 
##$RELAX= 
##$RELAX= 
##$RELAX= 
##$RELAX= 
##$RELAX= 
##$RELAX= 
$$ Bruker specific parameters
$$ --------------------------
##$DU= <C:\u>
##$EXPNO= 4670
##$NAME= <ADRS>
##$PROCNO= 1
##$TYPE= <nmr>
##$USER= <dgb>
##$AMP= (0..31)
100 100 100 100 100 100 100 100 100 100 100 100 100 100 100 100 100 100 
100 100 100 100 100 100 100 100 100 100 100 100 100 100 
##$AQSEQ= 0
##$AQ_mod= 3
##$AUNM= <au_zg>
##$AUTOPOS= <45 >
##$BF1= 250.13
##$BF2= 250.13
##$BF3= 250.13
##$BF4= 250.13
##$BF5= 500.13
##$BF6= 500.13
##$BF7= 500.13
##$BF8= 500.13
##$BYTORDA= 1
##$CFDGTYP= 0
##$CFRGTYP= 5
##$CHEMSTR= <none>
##$CNST= (0..31)
1 1 145 1 1 1 1 1 1 1 1 1 1 1 1 1 1 1 1 1 1 1 1 1 1 1 1 1 1 1 1 1 
##$CPDPRG= <>
##$CPDPRG1= <>
##$CPDPRG2= <>
##$CPDPRG3= <>
##$CPDPRG4= <mlev>
##$CPDPRG5= <mlev>
##$CPDPRG6= <mlev>
##$CPDPRG7= <mlev>
##$CPDPRG8= <mlev>
##$CPDPRGB= <>
##$CPDPRGT= <>
##$D= (0..31)
0 1 0 0 0 0 0 0 0 0.06 0 0 0 0 0 0 0.0002 0 0 0 0 0 0 0 0 0 0 0 0 0 0 
0 
##$DATE= 1147873816
##$DBL= (0..7)
120 120 120 120 120 120 120 120 
##$DBP= (0..7)
150 150 150 150 150 150 150 150 
##$DBP07= 0
##$DBPNAM0= <>
##$DBPNAM1= <>
##$DBPNAM2= <>
##$DBPNAM3= <>
$$ [...]
##$SUBNAM7= <"">
##$SUBNAM8= <"">
##$SUBNAM9= <"">
##$SW= 20.6930455092707
##$SWIBOX= (0..15)
0 0 3 0 0 0 0 0 0 0 0 0 0 0 0 0 
##$SW_h= 5175.983436853
##$TD= 65536
##$TD0= 1
##$TE= 295.16
##$TE2= 300
##$TE3= 300
##$TEG= 300
##$TL= (0..7)
0 120 120 120 120 120 120 120 
##$TP= (0..7)
150 150 150 150 150 150 150 150 
##$TP07= 0
##$TPNAME0= <>
##$TPNAME1= <>
##$TPNAME2= <>
##$TPNAME3= <>
##$TPNAME4= <>
##$TPNAME5= <>
##$TPNAME6= <>
##$TPNAME7= <>
##$TPOAL= (0..7)
0.5 0.5 0.5 0.5 0.5 0.5 0.5 0.5 
##$TPOFFS= (0..7)
0 0 0 0 0 0 0 0 
##$TUNHIN= 0
##$TUNHOUT= 0
##$TUNXOUT= 0
##$USERA1= <user>
##$USERA2= <user>
##$USERA3= <user>
##$USERA4= <user>
##$USERA5= <user>
##$V9= 5
##$VALIST= <valist>
##$VCLIST= <CCCCCCCCCCCCCCC>
##$VD= 0
##$VDLIST= <DDDDDDDDDDDDDDD>
##$VPLIST= <PPPPPPPPPPPPPPP>
##$VTLIST= <TTTTTTTTTTTTTTT>
##$WBST= 1024
##$WBSW= 4
##$XGAIN= (0..3)
0 0 0 0 
##$XL= 0
##$YL= 0
##$YMAX_a= 510525
##$YMIN_a= -351362
##$ZGOPTNS= <>
##$ZL1= 120
##$ZL2= 120
##$ZL3= 120
##$ZL4= 120
##$ABSF1= 16.522
##$ABSF2= -4.171173
##$ABSG= 5
##$ABSL= 3
##$ALPHA= 0
##$AQORDER= 0
##$ASSFAC= 0
##$ASSFACI= 0
##$ASSFACX= 0
##$ASSWID= 0
##$AUNMP= <proc_1d>
##$AZFE= 0.1
##$AZFW= 0.1
##$BCFW= 0
##$BC_mod= 0
##$BYTORDP= 0
##$COROFFS= 0
##$CY= 12.5
##$DATMOD= 1
##$DC= 0
##$DFILT= <>
##$DTYPP= 0
##$F1P= 14.0000005364418
##$F2P= -0.99999901652339
##$FCOR= 0.5
##$FTSIZE= 32768
##$FT_mod= 6
##$GAMMA= 0
##$GB= 0
##$INTBC= 1
##$INTSCL= 1
##$ISEN= 128
##$LB= 0.3
##$LEV0= 0
##$LPBIN= 0
##$MAXI= 10000
##$MC2= 0
##$MEAN= 0
##$ME_mod= 0
##$MI= 0
##$NCOEF= 0
##$NC_proc= -4
##$NLEV= 6
##$NOISF1= 0
##$NOISF2= 0
##$NSP= 0
##$NTH_PI= 0
##$NZP= 0
##$OFFSET= 16.522
##$PC= 1
##$PHC0= 14.30246
##$PHC1= 4.389723
##$PH_mod= 1
##$PKNL= yes
##$PPARMOD= 0
##$PSCAL= 4
##$PSIGN= 0
##$REVERSE= no
##$SF= 250.13
##$SI= 32768
##$SIGF1= 0
##$SIGF2= 0
##$SINO= 400
##$SIOLD= 32768
##$SREGLST= <1H.CDCl3>
##$SSB= 0
##$STSI= 32768
##$STSR= 0
##$SW_p= 5175.98343685301
##$SYMM= 0
##$S_DEV= 0
##$TDeff= 65536
##$TDoff= 0
##$TI= <Analysis number 999999
Compound Code 99
Book Reference 9
Project Code 9>
##$TILT= no
##$TM1= 0
##$TM2= 0
##$TOPLEV= 0
##$USERP1= <user>
##$USERP2= <user>
##$USERP3= <user>
##$USERP4= <user>
##$USERP5= <user>
##$WDW= 1
##$XDIM= 32768
##$YMAX_p= 304836601
##$YMIN_p= -280126
$$ End of Bruker specific parameters
$$ ---------------------------------
##NTUPLES= NMR SPECTRUM
##VAR_NAME=  FREQUENCY,     SPECTRUM/REAL,   SPECTRUM/IMAG
##SYMBOL=    X,             R,               I
##VAR_TYPE=  INDEPENDENT,   DEPENDENT,       DEPENDENT
##VAR_FORM=  AFFN,          ASDF,            ASDF
##VAR_DIM=   32768,         32768,           32768
##UNITS=     HZ,            ARBITRARY UNITS, ARBITRARY UNITS
##FACTOR=    0.157963299565203, 1,           1
##FIRST=     4132.6476996994, 0,             0
##LAST=      -1043.33573715361, 0,           0
##MIN=       -1043.33573715361, -280126,     0
##MAX=       4132.6476996994, 304836601,     0
$$ Real data points
##PAGE= N=1
##DATA TABLE= (X++(R..R)), XYDATA
$$ [...]
$$ plain form
24837 7365 10448 4737 7392 5170 9293 13450 13821 10983 13576 11619 6778 7103 2274 693 -3430
24822 -3430 -9673 -8929 7019 9947 3629 -4533 -1362 -6389 -4027 3038 10197 12003 14950 15078 11907
24807 11907 15303 14419 22075 14976 12190 7534 11290 13648 17055 20167 14827 -4111 -7956 -8774 -1699
24792 -1699 -1856 1693 -1453 -226 6884 6544 10885 13437 12319 11333 4487 8248 84 2495 10840
24777 10840 3652 3212 13425 19771 17784 12677 10250 6781 -2569 -983 1488 13849 13402 -1985
24763 -1985 2008 2038 10056 10274 7644 2377 -566 3328 -2333 -10596 2038 11687 2987 -3634 -7454
24748 -7454 -11222 -802 6132 5488 5334 8957 13417 22298 26521 28163 17736 13720 16363 16376 4765
24733 4765 -3666 807 6073 15085 15648 10940 11427 8640 -5841 -11997 -11172 4693 5952 1608 7277
$$ packed form
24837G365L083n711K655k222M123M157L71k838K593j957m841L25m829j581m123
24822c430o243P44J5948K928o318q162L171n027K362P065P159J806K947J28l171
24807A1907L396q84P656p099k786m656L756K358L407L112n340j8938l845q18P075
24792a699j57L549l146J227P110l40M341K552j118r86o846L761q164K411Q345
24777A0840p188m40J0213O346j987n107k427l469r350J586K471J2361m47j5387
24763a985L993L0Q018K18k630n267k943L894n661q263J2634R649q700o621l820
24748g454l768J0420O934o44j54L623M460Q881M223J642j0427m016K643J3j1611
24733D765q431M473N266R012N63m708M87k787j4481o156Q25J5865J259m344N669
$$ plain form
24718 7277 1699 -3130 1567 1005 2781 921 -2333 412 5438 6630 9860 12999 7433 3780 10356
24703 10356 10692 8095 -1980 2295 5197 1328 -7339 3376 9689 12869 12258 10358 4343 6532
24689 6532 3492 -4721 -1869 7047 7379 5893 6437 -1700 -5358 -4135 2361 11439 10821 6810 11131
24674 11131 9949 14885 15433 15026 11277 5917 12538 15405 14570 12694 3414 -196 16890 19955 3405
24659 3405 -2856 -3486 -3357 1524 4035 8911 1799 -2121 -2293 -9853 -12972 -15870 -4486 -2464 -8324
24644 -8324 -7427 -2729 2046 14724 12781 7022 221 -5618 -4439 4580 2837 -4703 3350 7867 11211
24629 11211 11297 1786 -2968 1088 -1265 -7918 -11390 2370 11583 9342 11119 8221 8890 6290 3556
24614 3556 5215 5956 3644 5114 11223 18411 33034 29040 11955 3510 1927 450 -2732 -671
$$ packed form
24718G277n578m829M697n62J776j860l254K745N026J192L230L139n566l653O576
24703A0356L36k597j0075M275K902l869q667J0715O313L180o11j900o015K189
24689F532l040q213K852Q916L32j486N44q137l658J223O496R078o18m011M321
24674A1131j182M936N48m07l749n360O621K867q35j876r280l610J7086L065j6550
24659C405o261o30J29M881K511M876p112l920j72p560l119k898J1384K022n860
24644h324Q97M698M775J2678j943n759o801n839J179R019j743p540Q053M517L344
24629A1211Q6r511m754M056k353o653l472J3760R213k241J777k898O69k600k734
24614C556J659P41k312J470O109P188J4623l994j7085q445j583j477l182K061
$$ plain form
24600 -671 -5729 -11411 -16309 -11960 -489 6144 20358 18487 7480 9583 8064 -996 4952 2646
24586 2646 834 4141 10671 5961 4194 3441 -1401 -2952 -2168 3852 7795 8728 8709 6228 2759 -4835
24570 -4835 2157 11334 11534 7986 7969 -1038 -6170 -18442 -17134 -20607 -20384 -13328 -8080 -7348 -16668 -24477
24554 -24477 -27191 -16725 -7755 -1056 5081 7280 9400 16345 3689 -888 -1205 3641 -5103 -10495
24540 -10495 2965 6223 12550 22268 19479 10362 5061 5219 888 -1156 -7630 -11190 -12958 -14659
24526 -14659 -5600 -2903 -10365 -7139 -1571 -1115 -5937 -16095 -18800 -11277 -12360 -18790 -15688 -4191
24512 -4191 -5754 -4978 -7407 -2151 4297 -984 -1023 -2015 -6131 -9008 -9653 -3196 -994 5124 9799 15028
24496 15028 20640 17453 9724 845 -2037 384 93 -1022 1846 14583 22269 16960 20377 13342
$$ packed form
24600f71n058n682m898M349J1471O633J4214j871j1007K103j519r060N948k306
24586B646j812L307O530m710j767p53m842j551P84O020L943R33j9k481l469p594
24570d835O992R177K00l548j7r007n132j2272J308l473K23P056N248P32r320p809
24554b4477k714J0466Q970O699O137K199K120O945j2656m577l17M846q744n392
24540a0495J3460L258O327R718k789r117n301J58m331k044o474l560j768j701
24526a4659R059K697p462L226N568M56m822j0158k705P523j083o430L102J1497
24512d191j563P76k429N256O448n281l9r92m116k877o45O457K202O118M675N229
24496A5028N612l187p729q879k882K421k91j115K868J2737P686n309L417p035
$$ plain form
24482 13342 4729 -423 365 4430 3925 1611 8789 16934 17374 26117 20808 10710 4637 3470 4744
24467 4744 -358 1061 66 -322 -3977 -3013 -683 716 -3200 -1814 -5927 -3581 -3966 -6832 -4015 3666
24451 3666 11498 15981 20414 13883 15443 17176 4377 -2871 5989 17950 19056 22484 18189 12349
24437 12349 6279 2427 796 -6912 -6910 606 4751 3462 6021 8934 18669 15873 7174 -2087 5164
24422 5164 -187 -3997 7312 11588 13785 12908 10032 8285 10859 11966 7339 -1586 2709 -7523
24408 -7523 -14840 -8313 -9349 -12221 -13338 -14355 -8953 -2049 -762 -113 -495 3582 6171 3881 -3779
24393 -3779 -16681 -11738 -6768 6571 7129 5965 -960 -5762 1971 10900 5198 1270 -2825 -7593
24379 -7593 1103 3037 131 10991 18680 7337 8562 18973 16909 12202 2815 -5147 -1377 10473
$$ packed form
24482A3342q613n152P88M065n05k314P178Q145M40Q743n309j0098o073j167J274
24467D744n102J419r95l88l655R64K330J399l916J386m113K346l85k866K817P681
24451C666P832M483M433o531J560J733j2799p248Q860J1961J106L428m295n840
24437A2349o070l852j631p708KP516M145j289K559K913R735k796q699r261P251
24422E164n351l810J1309M276K197q77k876j747K574J107m627q925M295j0232
24408g523p317O527j036k872j117j017N402O904J287O49l82M077K589k290p660
24393c779j2902M943M970J3339N58j164o925m802P733Q929n702l928m095m768
24379g593Q696J934k906J0860P689j1343J225J0411k064m707r387p962L770J1850
$$ plain form
24365 10473 8594 -2760 -3483 -3483 3651 -207 -1707 -2599 949 8375 16151 7272 -7450 -10561 -4141
24350 -4141 3779 6651 6177 2713 2463 850 10998 12836 9245 -843 -1614 7786 8829 13367 8575
24335 8575 3350 8353 6140 -858 -5984 -5025 909 1488 579 7559 7805 3419 2423 6408 8187 7074
24319 7074 7200 -496 -1796 -3143 6649 7632 8480 11134 18530 19737 17883 22425 22642 16877 10026 10288
24303 10288 8414 7299 3039 6256 19616 19202 19544 12210 -1243 -4126 -16923 -20483 -11980 -6615
24289 -6615 -2105 -3008 501 4427 12913 17212 17259 5903 -115 1690 3066 7729 10914 3015 -8828
24274 -8828 -13552 -18351 -22818 -19311 -15944 -14015 -7270 -3294 4110 9037 5026 5388 3341 1103 -303
24259 -303 -7741 -15791 -14948 -4159 3522 -11060 -23236 -19960 -11757 -16923 -16856 -15228 -9767 -10831 -11950
$$ packed form
24365A0473j879j1354p23%P134l858j500q92L548P426P776q879j4722l111O420
24350d141P920K872m74l464k50j613J0148J838l591j0088p71R400J043M538m792
24335H575n225N003k213o998n126R59N934N79r09O980K46m386r96L985J779j113
24319G074J26p696j300j347R792R83Q48K654P396J207j854M542K17n765o851K62
24303A0288j874j115m260L217J3360m14L42p334j3453k883j2797l560Q503N365
24289f615M510r03L509L926Q486M299M7j1356o018J805J376M663L185p899j1843
24274h828m724m799m467L507L367J929O745L976P404M927m011L62k047k238j406
24259c03p438q050Q43J0789P681j4582j2176L276Q203n166O7J628N461j064j119
$$ plain form
24244 -11950 -15604 -20235 -15902 114 7739 11365 12908 21607 17074 13195 16257 23185 28936 34060
24230 34060 37197 31750 25188 22375 22752 21206 18378 19085 23111 29104 30829 24351 11658 -2864
24216 -2864 -12221 -16314 -16354 -15567 -8382 2848 14854 17381 14098 5285 -1066 -3348 3740 10496 18213
24201 18213 17509 24013 26699 26444 27270 34429 29401 20650 21120 21938 34146 38954 14263 -2995 -9070
24186 -9070 -8750 -8287 -5475 -7218 -10014 -20269 -28240 -22738 -20397 -10723 -8106 -9611 1466 4630 1690
24171 1690 205 9901 10308 6596 300 -7106 -7003 -1259 -4592 -4044 -974 -3825 -4430 -2359 -11642 -4009
24155 -4009 5066 16154 22813 10999 3942 8652 6231 -67 -2802 -9779 66 9949 9726 452
24141 452 2885 12310 18811 28811 22463 19177 16238 22314 22619 11855 10099 13295 16539 24460 18474
$$ packed form
24244a1950l654m631M333J6016P625L626J543Q699m533l879L062O928N751N124
24230C4060L137n447o562k813L77j546k828P07M026N993J725o478j2693j4522
24216b864r357m093m0P87P185J1230J2006K527l283q813o351k282P088O756P717
24201A8213p04O504K686k55Q26P159n028q751M70Q18J2208M808k4691j7258o075
24186i070L20M63K812j743k796j0255p971N502K341R674K617j505J1077L164k940
24171A690j485R696M07l712o296p406J03N744l333N48L070k851o05K071r283P633
24155d009R075J1088O659j1814p057M710k421o298k735o977R845R883k23r274
24141D52K433R425O501J0000o348l286k939O076L05j0764j756L196L244P921n986
$$ plain form
24126 18474 5062 -714 11137 11258 4329 8012 558 -2137 -3877 1062 5722 5906 7803 -559
24112 -559 -3201 5438 7397 14198 19720 18985 15442 4319 -6900 -6687 -4941 -4919 -1012 5263 10222
24097 10222 11630 1018 -1708 1670 1836 -2247 6121 3331 980 6132 7521 6687 3739 4100 12768
24082 12768 4447 -7286 -13885 -9904 -11663 -7119 -2562 -3603 -1056 1732 -2663 10425 12168 -4194
24068 -4194 -19656 -22024 -10057 -4176 -1320 -9550 -10238 -7861 -8682 -6695 -6085 9610 13656 7320 6287
24053 6287 8198 3616 1803 8471 13286 19112 19974 24060 16145 3798 -1843 4075 8057 11674 11246
24038 11246 10563 14488 10220 2877 -5638 2137 3631 7434 6764 -590 -599 -1153 -159 4607 6738 -1996
24022 -1996 -16843 -10451 -3796 4069 2955 -4856 -2163 6764 8487 5523 6930 6164 9494 10188 4785
$$ packed form
24126A8474j3412n776J1851J21o929L683p454k695j740M939M660J84J897q362
24112e59k642Q639J959O801N522p35l543j1123j1219K13J746K2L907O275M959
24097A0222J408j0612k726L378J66m083Q368k790k351N152J389q34k948L61Q668
24082A2768q321j1733o599L981j759M544M557j041K547K788m395J3088J743j6362
24068d194j5462k368J1967N881K856q230o88K377q21J987O10J5695M046o336j033
24053F287J911m582j813O668M815N826Q62M086p915j2347n641N918L982L617m28
24038A1246o83L925m268p343q515P775J494L803o70p354rn54R94M766K131q734
24022a996j4847O392O655P865j114p811K693Q927J723k964J407p66L330O94n403
$$ plain form
24007 4785 5383 7601 6021 8948 19664 19810 11630 10576 13099 12527 14713 13423 9788 6391 1855
23992 1855 907 314 1174 2788 -6337 -6508 4578 2314 3315 11393 6892 -5575 -12573 -9923 -5498
23977 -5498 589 1674 -2653 2663 21867 16570 9575 1833 -6618 -7010 -2185 -5023 -6314 -4 -114
23962 -114 -8967 -8545 -2327 -40 9423 2495 -1497 -847 -12203 -18814 -9365 -647 11039 8655 4577
23947 4577 15087 11379 4443 3774 13548 11920 7434 -2851 -9059 -4921 462 140 -9662 -5927 7620
23932 7620 24709 30804 21218 9007 99 1090 -6115 -4001 -4601 2102 -774 4034 15212 18521
23918 18521 20578 12894 24371 30759 15785 4654 11696 20703 9375 -1218 -4811 -13047 -12338
23905 -12338 -907 4079 6089 4577 965 8552 16560 17206 15330 9841 -1355 -13572 -19636 -14026
$$ packed form
24007D785N98K218j580K927J0716J46q180j054K523n72K186j290l635l397m536
23992A855r48n93Q60J614r125j71J1086k264J001Q078m501j2467o998K650M425
23977e498O087J085m327N316J9204n297o995p742q451l92M825k838j291O310j10
23962a14q853M22O218K287R463o928l992O50j1356o611R449Q718J1686k384m078
23947D577J0510l708o936o69R774j628m486j0285o208M138N383l22r802L735J3547
23932G620J7089O095r586j2211q908R91p205K114o00O703k876M808J1178L309
23918A8521K057p684J1477O388j4974j1131P042R007j1328j0593l593q236P09
23905a2338J1431M986K010j512l612P587Q008O46j876n489j1196j2217o064N610
$$ plain form
23891 -14026 -9870 -15316 -16315 -13373 -9051 -3814 -10522 -1800 3176 -6669 -15095 -10415 -2146 -1833 -5527
23876 -5527 1722 4991 1891 -3026 -4321 -13173 -10449 -8829 -6509 -3307 5331 7923 4411 5816 633
23861 633 224 8529 7324 11056 13866 8648 6482 8882 4839 2715 21629 23296 19501 11193 14217
23846 14217 13954 7118 -647 948 -4502 -6605 -10438 -16339 -16289 -14445 -3025 5780 5024 -3966 -6815
23831 -6815 -2160 6735 17226 14707 13799 14313 8194 11970 13690 9339 5231 2438 7555 14964 12842
23816 12842 4330 -9724 -16923 -16883 -2391 3328 -6859 -950 6143 4704 12021 6405 4279 10991
23802 10991 14103 14629 14662 15339 12027 -3119 -4624 738 2590 -7326 -3930 3440 -2646 -2036 3217
23787 3217 4667 3721 2905 16447 22019 15331 6616 6580 6963 14166 21644 21415 15191 13642 5579 2900
$$ packed form
23891a4026M156n446r99K942M322N237o708Q722M976r845q426M680Q269L13l694
23876e527P249L269l100m917j295q852K724J620K320L202Q638K592l512J405n183
23861F33m09Q305j205L732K810n218k166K400m043k124J8914J667l795q308L024
23846A4217k63o836p765J595n450k103l833n901N0J844J1420Q805p56q990k849
23831f815M655Q895J0491k519r08N14o119L776J720m351m108k793N117P409k122
23816A2842q512j4054p199M0J4492N719j0187N909P093j439P317n616k126O712
23802A0991L112N26L3O77l312j5146j505N362J852r916L396P370o086O10N253
23787C217J450r46q16J3542N572o688q715l6L83P203P478k29o224j549q063k679
$$ plain form
23771 2900 3957 5228 5339 3715 5920 8829 5843 3892 -1369 -3532 -4663 -7918 -5434 -217 -7853
23756 -7853 -13807 -6474 -3402 2966 5428 3373 -4988 -9495 -13431 -20193 -7489 -3061 -6394 -1328
23742 -1328 2558 -1453 7040 17491 15182 8207 -924 -6549 -11450 -7296 -14983 -13190 -11713 -9676
23728 -9676 -6081 -14667 -854 8994 9978 -1806 -3701 2677 -570 -810 1003 111 -5629 -11172 -1272
23713 -1272 13271 14362 -1229 -16148 -25692 -21545 -18301 -9201 6504 12803 11398 -2650 -3499 -3372
23699 -3372 -4563 150 -1252 -7764 -1975 9752 16652 12964 16271 18157 18984 18709 15166 14705 20089
23684 20089 15460 3789 1456 6341 10530 16675 15922 7205 14602 10539 -1924 -4185 -473 -400 3241
23669 3241 -3459 2010 6582 8140 13923 8663 17286 33389 40142 29621 21334 20331 14876 11376
$$ packed form
23771B900J057J271J11j624K205K909k986j951n261k163j131l255K484N217p636
23756g853n954P333L072O368K462k055q361m507l936o762J2704M428l333N066
23742a328L886m011Q493J0451k309o975r131n625m901M154p687J793J477K037
23728i676L595q586J3813R848R84j1784j895O378l247k40J813q92n740n543R900
23713a272J4543J091j5591j4919r544M147L244R100J5705O299j405j4048q49J27
23699c372j191M713j402o512N789J1727O900l688L307J886Q27k75l543m61N384
23684B0089m629j1671k333M885M189O145p53q717P397m063j2463k261L712P3L641
23669C241o700N469M572J558N783n260Q623J6103O753j0521q287j003n455l500
$$ plain form
23655 11376 8166 11858 16758 12631 15797 9746 5799 13745 16846 10202 6270 3096 2153 44 -2421
23640 -2421 2148 7649 15908 5144 357 2808 -839 -2181 -4770 -1129 2866 -6009 -14915 -20434
23626 -20434 -23733 -20060 -15544 -13565 -6845 8239 14505 21609 20192 15043 12035 11498 7897 6282
23612 6282 515 2949 -782 294 1959 7585 13395 3314 1566 808 428 723 -13022 -11202 -1584
23597 -1584 900 865 9395 4257 227 1132 1925 8937 4289 9826 16287 11570 13908 7193 2197 -1241
23581 -1241 1628 480 3920 13919 20380 17567 9309 7347 -1324 -8903 -7305 6317 19823 18358
23567 18358 6668 3602 7334 6162 -8193 -6698 5202 16491 13290 7918 -2176 1294 -3657
23554 -3657 -5443 -3420 2275 2208 2664 8096 1780 -1772 -5822 -1612 6663 854 -8515 -4657 -6361
$$ packed form
23655A1376l210L692M900m127L166o051l947P946L101o644l932l174r43k109k465
23640b421M569N501Q259j0764m787K451l647j342k589L641L995q875q906n519
23626b0434l299L673M516J979O720J5084O266P104j417n149l008n37l601j615
23612F282n767K434l731J076J665N626N810j0081j748p58l80K95j3745J820R618
23597a584K484l5Q530n138m030R05P93P012m648N537O461m717K338o715m996l438
23581a241K869j148L440R999O461k813q258j962q671p579J598J3622J3506j465
23567A8358j1690l066L732j172j4355J495J1900J1289l201n372j0094L470m951
23554c657j786K023N695o7M56N432o316l552m050M210Q275n809r369L858j704
$$ plain form
23539 -6361 2236 11054 10432 -2892 -3147 5349 5570 3848 10299 11180 10005 3504 9093 21704 23539
23524 23539 20315 14518 12363 8023 9581 6017 3152 7151 9302 6010 3262 6797 78 -14674
23510 -14674 -7370 2185 -999 -1415 -3190 -594 2243 -806 -581 6957 566 -8557 -12973 -5892 -11180
23495 -11180 -3534 7181 17359 15104 6609 1358 5036 2438 1311 3772 -4941 -9661 -9384 -12634
23481 -12634 -1666 1141 2478 1136 1644 8384 2346 3776 3755 10477 10556 9263 5301 7197 7550 6804
23465 6804 2667 2400 -882 -3551 -4198 -2811 -147 -5821 501 1522 11133 17074 12775 9734 8572
23450 8572 5661 178 -3596 2743 -6061 -16567 -18295 -15955 -16046 -7592 -7707 -3846 9790 5699 -677
23435 -677 -8847 -11110 -20296 -25595 -18176 -9948 -9279 -3138 994 -2692 -8808 -2993 5131 9474 15302
$$ packed form
23539f361Q597Q818o22j3324k55Q496K21j722O451Q81j175o501N589J2611J835
23524B3539l224n797k155m340J558l564k865L999K151l292k748L535o719j4752
23510a4674P304R555l184m16j775K596K837l049K25P538o391r123m416P081n288
23495a1180P646J0715J0178k255q495n251L678k598j127K461q713m720K77l250
23481a2634J0968K807J337j342N08O740o038J430k1O722P9j293l962J896L53p46
23465F804m137k67l282k669o47J387K664n674O322J021R611N941m299l041j162
23450H572k911n483l774O339q804j0506j728K340r1Q454j15L861J3636m091o376
23435f77q170k263r186n299P419Q228O69O141M132l686o116N815Q124M343N828
$$ plain form
23420 15302 5092 -968 -4431 -1510 -4361 -10800 -12534 -11777 -19127 -19140 -11814 -12938 -4449 246 -4272
23405 -4272 -1614 -7593 -8446 -5508 -1148 3236 -2863 1716 4397 2063 -295 1824 4928 4114 7523
23390 7523 9965 4984 -2206 -7060 196 3704 3282 1317 -11785 -17963 -4986 5039 10441 -4384
23376 -4384 -9845 -12853 -14051 -1037 9175 13871 12549 12566 11977 10060 8643 5446 -4233 -645 8929
23361 8929 6293 1767 7813 3435 -1872 8852 9693 5753 -2922 -9496 -10439 -3687 -3010 -238 1597
23346 1597 2333 2343 3701 -821 -10297 -16806 -10246 -2586 -3433 -4910 2140 13572 12289 11743 8201 1790
23330 1790 -5425 -8385 -6172 -7687 -7187 9416 24623 23080 23249 27420 22402 24547 22603 26536 18729
23315 18729 20901 13206 10876 8666 -461 -4709 -4241 1311 5820 7870 15277 10498 1799 -3651 -5601
$$ packed form
23420A5302j0210o060l463K921k851o439j734P57p350j3P326j124Q489M695m518
23405d272K658n979q53K938M360M384o099M579K681k334k358K119L104q14L409
23390G523K442m981p190m854P256L508m22j965j3102o178J2977J0025N402j4825
23376d384n461l008j198J3014J0212M696j322J7n89j917j417l197r679L588R574
23361H929k636m526O046m378n307J0724Q41l940q675o574r43O752O77K772J835
23346A597P36J0J358m522r476o509O560P660q47j477P050J1432j283n46l542o411
23330A790p215k960K213j515N00J6603J5207j543J69M171n018K145j944L933p807
23315A8729K172p695k330k210r127m248M68N552M509K050P407m779q699n450j950
$$ plain form
23300 -5601 -2631 5059 5097 9585 8166 10981 10019 7039 1415 -3563 -5027 -324 3326 8086 14606
23285 14606 9968 985 -3137 -3851 -1966 -69 7984 6910 10131 16488 21035 7276 7317 9973 -2509
23270 -2509 -2889 2080 547 -1302 -3953 -2842 -1896 -1260 -4922 -5025 -2362 -4937 -10217 -10730 -5811 -5104
23254 -5104 5877 4971 5281 2766 -4071 -4567 -3905 -272 6372 -5716 -7689 -968 2846 -875 3279
23239 3279 13876 21150 19980 14407 9484 1841 -8961 -7505 3813 12129 14548 892 -7111 -7054
23225 -7054 -2971 -4780 -6542 -7733 -5723 -10566 -14616 -2886 9153 12087 13113 13436 1266 2110
23211 2110 10722 10982 10139 12698 9062 10065 14637 12349 7901 9787 14665 17227 18837 20442 7698
23196 7698 -6815 -6522 435 -7243 -21350 -11832 899 -3845 -4411 1765 12535 14562 3999 2274
$$ packed form
23300e601K970P690L8M488j419K815r62k980n624m978j464M703L650M760O520
23285A4606m638q983m122p14J885J897Q053j074L221O357M547j3759M1K656j2482
23270b509l80M969j533j849k651J111R46O36l662j03K663k575n280n13M919P07
23254e104J0981r06L10k515o837m96O62L633O644j2088j973O721L814l721M154
23239C279J0597P274j170n573m923p643j0802J456J1318Q316K419j3656q003N7
23225g054M083j809j762j191K010m843m050J1730J2039K934J026L23j2170Q44
23211B110Q612K60q43K559l636J003M572k288m448J886M878K562J610J605j2744
23196G698j4513K93O957p678j4107R518J2731m744n66O176J0770K027j0563j725
$$ plain form
23182 2274 4100 3999 12513 5304 -949 -10542 -14599 -3991 -13973 -14415 1935 8195 6406 4246 -4014
23167 -4014 -6267 -4574 -4070 -358 3687 -7089 -5893 -8483 -3902 -16054 -10389 -97 10196 11313
23153 11313 6932 4722 3069 1694 -651 6243 6433 2353 2977 2807 -1153 -4451 -3080 3449 3090
23138 3090 -1206 7618 15506 12150 -839 -11176 -2344 3624 7804 18737 14525 9196 -7750 1436
23124 1436 7438 5796 -2085 2854 22321 21163 13810 11588 13523 6720 -5145 -1241 6318 -7207
23110 -7207 -3909 6506 1261 -5622 7768 12733 13652 12164 12474 7435 9972 15452 16826 10487 994
23095 994 -1878 604 -1506 1415 7521 -120 -8629 -5222 7928 16725 22996 25001 15744 15146 17409
23080 17409 7949 5991 6615 10423 7517 10364 14900 13275 14800 6683 12673 17466 11314 -823
$$ packed form
23182B274J826j01Q514p209o253r593m057J0608r982m42J6350O260j789k160q260
23167d014k253J693N04L712M045j0776J196k590M581j2152N665J0292J0293J117
23153A1313m381k210j653j375k345O894J90m080O24j70l960l298J371O529l59
23138C090m296Q824P888l356j2989j0337Q832N968M180J0933m212n329j6946R186
23124A436O002j642p881M939J9467j158p353k222J935o803j1865L904P559j3525
23110g207L298J0415n245o883J3390M965R19j488L10n039K537N480J374o339r493
23095I94k872K482k110K921O106p641q509L407J3150Q797O271K005r257n98K263
23080A7409r460j958O24L808k906K847M536j625J525q117N990M793o152j2137
$$ plain form
23066 -823 -18912 -20503 -12356 -4416 -4179 5896 7273 7651 3477 11152 13128 11934 14626 18698 6449
23051 6449 -5554 4649 14111 10507 5002 -2889 256 -3345 2340 11381 3321 -9135 -12184 -6920
23037 -6920 4620 12795 3103 3599 8065 2441 12334 15113 4023 5051 9310 8996 4080 -3998 -2706
23022 -2706 -2165 2898 9828 -1854 -4360 3167 10697 16807 11451 -1953 -8261 -11223 -6570 -8103
23008 -8103 -11564 -4299 -2826 -10493 -17732 -15268 -8208 -3169 -9471 -15063 -11179 3828 3154 5994 5698
22993 5698 3770 7225 9371 6629 -2213 4473 18561 14915 3338 -7295 -14273 -15391 -3296 1810
22979 1810 -1099 4081 7168 11391 4167 -3516 8231 12682 9622 9386 9195 17996 19198 18023 16294
22964 16294 9849 1802 5692 1686 1996 11384 16297 9898 2945 265 -8130 -6697 123 14952
$$ packed form
23066h23j8089j591Q147P940K37J0075J377L78m174P675J976j194K692M072j2249
23051F449j2003J0203R462l604n505p891L145l601N685R041q060j2456l049N264
23037f920J1540Q175r692M96M466n624R893K779j1090J028M259l14m916q078J292
23022b706N41N063O930j1682k506P527P530O110n356j3404o308k962M653j533
23008h103l461P265J473p667p239K464P060N039o302n592L884J5007o74K840k96
22993E698j928L455K146k742q842O686J4088l646j1577j0633o978j118J2095N106
22979A810k909N180L087M223p224p683J1747M451l060k36j91Q801J202j175j729
22964A6294o445q047L890m006L10R388M913o399o953k680q395J433O820J4829
$$ plain form
22950 14952 13900 6356 -2183 -10430 -10166 -3654 -8822 -6355 6839 11306 13755 5882 -8230 -10121
22936 -10121 -5550 -4589 4369 -257 -6195 488 1792 -206 -818 -5052 -16570 -21027 -8973 99
22922 99 -4906 -2889 3677 7989 9154 6251 199 -5865 2582 11863 -2516 -8964 -6097 -5212 -145
22907 -145 5623 6011 11542 12637 12293 7827 -2950 -1499 3758 5700 14440 18576 21025 18106 30352
22892 30352 36332 32371 24522 27418 12500 -1382 487 4335 3864 6044 6560 8793 5749 7396
22878 7396 8849 18060 15547 9789 12669 13577 14516 -4492 -11271 -17614 -16953 -10869 486 -445 -8857
22863 -8857 -11227 -10085 -5672 -14507 -13893 -11806 -10500 536 -4886 352 5729 4069 -560 -3114 -10000
22848 -10000 -9119 -11305 -8043 -13318 -8030 1276 16009 17167 10575 3280 5837 13976 9526 15041
$$ packed form
22950A4952j052p544q539q247K64O512n168K467J3194M467K449p873j4112j891
22936a0121M571R61Q958m626n938O683J304j998o12m234j1518m457J2054R072
22922I9n005K017O566M312J165k903o052o064Q447R281j4379o448K867Q85N067
22907a45N768L88N531J095l44m466j0777J451N257J942Q740M136K449k919J2246
22892C0352N980l961p849K896j4918j3882J869L848m71K180N16K233l044J647
22878G396J453R211k513n758K880R08R39j9008o779o343O61O084J1355r31q412
22863h857k370J142M413q835O14K087J306J1036n422N238N377j660m629k554o886
22848a0000Q81k186L262n275N288R306J4733J158o592p295K557Q139m450N515
$$ plain form
22834 15041 17799 18572 12296 1058 3060 9009 10217 10798 9486 -6774 -7949 -7324 -18965 -6142
22820 -6142 -5573 -10440 -16820 -16642 -13052 -13748 -9932 -12885 -16592 -10019 -7378 -7429 -11667 -9348 -3326 1159
22804 1159 4395 2191 5379 2569 -3149 -8068 255 3897 4343 10716 17979 2848 -12935 -4619
22790 -4619 -8092 299 -5771 -3589 5832 15983 19819 8112 3100 13173 11904 6232 2514 2619
22776 2619 7879 11330 10280 17215 25380 17942 13874 6022 8268 13899 20447 15146 14302 2987 -7228
22761 -7228 -9065 -1165 -179 -105 11452 14963 16481 12944 14174 12207 8663 4892 5733 4806 -3244 -3429
22745 -3429 11419 15733 10312 5085 4858 1828 -5024 -1658 -1186 4171 5072 1945 7034 9961 10504
22730 10504 11056 11103 13633 20373 9699 2898 733 -5161 -8468 -10524 -14416 -22604 -14517 -3334 -4031
$$ packed form
22834A5041K758P73o276j1238K002N949J208N81j312j6260j175O25j1641J2823
22820f142N69m867o380J78L590o96L816k953l707O573K641n1m238K319O022M485
22804A159L236k204L188k810n718m919Q323L642M46O373P263j5131j5783Q316
22790d619l473Q391o070K182R421J0151L836j1707n012J0073j269n672l718J05
22776B619N260L451j050O935Q165p438m068p852K246N631O548n301q44j1315j0215
22761g228j837P900R86P4J1557L511J518l537J230j967l544l771Q41r27q050j85
22745c429J4848M314n421n227k27l030o852L366M72N357R01l127N089K927N43
22730A0504N52M7K530O740j0674o801k165n894l307k056l892q188Q087J1183o97
$$ plain form
22715 -4031 -8320 -3952 1952 120 -4291 -12326 -6870 3382 5710 -1731 -11248 -12781 -22155 -23002 -7972
22700 -7972 -3854 1303 -4129 -14429 -10072 -1858 1521 6419 4212 9412 6978 10977 15989 10110
22686 10110 -7192 -13005 -12449 -6435 3269 4360 -5635 -11700 2099 2043 -7750 -2243 5167 9789 17490
22671 17490 16584 7220 -1458 -1549 -9324 -4888 -10329 -12784 1506 10570 17914 14890 88 -5417 -7589
22656 -7589 -10345 -2311 4712 -898 521 -1411 -1079 3579 867 -9408 -24076 -24374 -11494 -10618 -3708
22641 -3708 5250 3044 -2911 4094 -9 -1186 6210 3232 -4077 -13751 -4847 3582 -7127 -10849
22627 -10849 -12690 -1503 2075 6555 853 -11013 -16571 -19721 -17881 -2564 -186 -3027 -532 1519
22613 1519 5657 2856 -6201 -8534 -1986 2309 5965 14022 20952 20989 12648 10986 16962 28468 29312
$$ packed form
22715d031m289M368N904j832m411q035N456J0252K328p441r517j533r374q47J5030
22700g972M118N157n432j0300M357Q214L379M898k207N200k434L999N012n879
22686A0110j7302n813N56O014R704J091r995o065J3799n6r793N507P410M622P701
22671A7490r06r364q678r1p775M436n441k455J4290R064P344l024j4802n505k172
22656g589k756Q034P023n610J419j932L32M658k712j0275j4668k98J2880Q76O910
22641c708Q958k206n955P005m103j177P396k978p309r674Q904Q429j0709l722
22627a0849j841J1187L578M480n702j1866n558l150J840J5317K378k841K495K051
22613A519M138k801r057k333O548M295L656Q057O930L7q341j662N976J1506Q44
$$ plain form
22598 29312 27611 27954 19373 13625 12235 4880 -4366 2272 -2188 -8091 -10841 -4707 3217 277 -2740
22583 -2740 -4428 -6269 -8268 -13910 -8254 -9337 -21687 -13771 -8863 -12790 -18679 -14092 -2706 -8919
22569 -8919 -10798 -9243 -15530 -15432 -19092 -14608 -5622 -4113 -2015 3871 11130 9360 283 -3649 4734
22554 4734 963 5940 8000 5742 -8076 -15970 -4365 994 1103 -2017 -5793 -5856 -2185 3335 -1602
22539 -1602 -13477 29 5478 -2543 -1366 4745 8066 9600 13135 7605 2425 -1507 -10884 -14848
22525 -14848 -4101 -3606 -6925 -8151 -3608 -3302 5487 9947 -3407 -13176 -9417 5091 20695 28256
22511 28256 20398 6315 -4853 -9247 -8459 -1682 1179 3658 5432 5444 10577 13154 16993 10778 -8527
22496 -8527 -12481 -11249 -8853 6553 18068 17470 17303 14597 11926 6620 20143 28115 22287 14811
$$ packed form
22598B9312j701L43q581n748j390p355r246O638m460n903k750O134P924k940l017
22583b740j688j841j999n642N656j083j2350P916M908l927n889M587J1386o213
22569h919j879J555o287R8l660M484Q986J509K098N886P259j770r077l932Q383
22554D734l771M977K060k258j3818p894J1605N359J09l120l776o3L671N520m937
22539a602j1875J3506N449q021J177O111L321J534L535n530n180l932r377l964
22525a4848J0747M95l319j226M543L06Q789M460j3354r769L759J4508J5604P561
22511B8256p858j4083j1168m394P88O777K861K479J774J2N133K577L839o215j9305
22496h527l954J232K396J5406J1515n98j67k706k671n306J3523P972n828p476
$$ plain form
22482 14811 8087 3782 4679 4602 6397 1713 -163 852 -13509 -7087 799 -2266 -6172 -1692 4619
22467 4619 10716 18004 14738 785 -1364 10737 12600 10550 14283 6912 7431 24516 19401 12491
22453 12491 8634 1342 1913 10876 7418 2436 6699 3790 9156 15541 9966 1933 754 5103 8948
22438 8948 13274 14155 9551 1458 -5026 -10662 -14660 -13240 1258 -263 -9342 -4145 -6923 -7535 2004
22423 2004 6271 3559 8028 8457 5792 10519 903 -12156 -17481 -14631 -3739 8136 -354 114
22409 114 146 2268 2856 2768 8453 19320 27167 16691 8621 11556 5524 4616 -993 -191 2298 5704
22393 5704 11849 5446 5865 10927 11187 2235 315 -5738 -12774 -7725 9899 7141 2116 10539 15997
22378 15997 11338 2520 -2430 -11352 -20806 -20234 -14304 -13372 -11096 -11876 -12456 -4190 7175 11145 4769
$$ packed form
22482A4811o724m305Q97p7J795m684j876J015j4361O422P886l065l906M480O311
22467D619O097P288l266j3953k149J2101J863k050L733p371N19J7085n115o910
22453A2491l857p292N71Q963l458m982M263k909N366O385n575q033j179M349L845
22438H948M326Q81m604q093o484n636l998J420J4498j521r079N197k778o12R539
22423B004M267k712M469M29k665M727r616j3059n325K850J0892J1875q490M68
22409A14L2K122N88q8N685J0867P847j0476q070K935o032r08n609Q02K489L406
22393E704O145o403M19N062K60q952j920o053p036N049J7624k758n025Q423N458
22378A5997m659q818m950q922r454N72N930R32K276p80n80Q266J1365L970o376
$$ plain form
22363 4769 -6412 -8658 -1841 381 -2324 -5216 2233 7065 16477 16123 17413 18845 7208 10497
22349 10497 6341 2181 652 78 -4468 -9188 -5604 -1738 -10819 -2845 4217 -7583 -6891 2428 1332
22334 1332 1889 -2140 -12495 -8618 -102 6452 6541 -844 2535 -1998 -10335 -19242 -24569 -20363 -14433
22319 -14433 -6880 1106 -1057 -12237 -8430 -542 -1373 1704 -9419 -10093 -9752 -16192 -15405 -1749 9243
22304 9243 10578 -3772 -2433 7348 7635 455 1754 609 -11118 -21398 -21371 -15648 -7136 -5094 -926
22289 -926 7518 -420 -17941 -12149 -475 -164 -4541 -10098 -8700 -3676 13575 19383 13024 12642 12635
22274 12635 12852 3553 3211 5114 3872 368 1731 8667 10762 14105 10655 -2611 -7511 -5952 -543
22259 -543 5227 -5046 -17094 -20543 -15105 3433 7231 2017 -7269 -4903 -6554 -2535 4109 -882
$$ packed form
22363D769j1181k246O817K222k705k892P449M832R412l54J290J432j1637L289
22349A0497m156m160j529n74m546m720L584L866r081P974P062j1800O92R319j096
22334A332N57m029j0355L877Q516O554Q9p385L379m533q337q907n327M206N930
22319a4433P553P986k163j1180L807P888q31L077j1123o74L41o440P87J3656J0992
22304I243J335j4350J339R781K87p180J299j145j1727j0280K7N723Q512K042M168
22289i26Q444p938j7521N792J1674L11m377n557J398N024J7251N808o359l82p
22274A2635K17r299l42J903j242l504J363O936K095L343l450j3266m900J559N409
22259e43N770j0273j2048l449N438J8538L798n214r286K366j651M019O644m991
$$ plain form
22245 -882 -7120 -15954 -13382 -5065 7456 4130 1667 -4166 -9979 -9623 -9302 -2510 2982 6631 4686
22230 4686 -10245 -12210 2577 392 -3463 -6944 -12209 -5846 2870 5282 1608 -6570 -9392 -10704
22216 -10704 -17639 -7426 -3702 -90 -541 7208 11310 6149 11318 11289 7566 1640 -3876 1937 7591
22201 7591 6396 5140 2056 4879 10489 7897 8258 8228 1780 3607 4765 3080 17773 15098 5619
22186 5619 -6094 -4432 -5989 -5208 5928 8714 14770 19612 9374 2920 -5235 -4642 4731 1058
22172 1058 5468 11418 828 -2478 -9399 -2391 6394 3283 -7606 -15955 -12077 -5275 -2341 -3343
22158 -3343 -166 -4731 -17116 -18609 -17285 -11546 208 1001 -21190 -32983 -25191 -13988 -2451
22145 -2451 4413 13066 8450 242 -304 -9363 -12434 -5963 3219 6157 4844 7732 16423 20009 13168
$$ packed form
22245h82o238q834K572Q317J2521l326k463n833n813L56L21O792N492L649j945
22230D686j4931j965J4787k185l855l481n265O363Q716K412l674q178k822j312
22216a0704o935J0213L724L612m51P749M102n161N169k9l723n926n516N813N654
22201G591j195j256l084K823N610k592L61l0o448J827J158j685J4693k675r479
22186E619j1713J662j557P81J1136K786O056M842j0238o454q155N93R373l673
22172A058M410N950j0590l306o921P008Q785l111j0889q349L878O802K934j002
22158c343L177m565j2385j493J324N739J1754P93k2191j1793P792J1203J1537
22145b451O864Q653m616q208n46r059l071O471R182K938j313K888Q691L586o841
$$ plain form
22130 13168 12201 10277 9986 -1673 -7583 -13489 -18259 -17813 -20952 -15156 -11123 -19077 -17886 -8228 431
22115 431 882 -5973 -15347 -20704 -15296 -10486 -3079 6835 1810 -350 -3822 -7632 -5622 -1721 4241
22100 4241 2040 -2674 -7023 -7767 886 14819 15882 2413 2948 -784 -13186 -20551 -22232 -12463
22086 -12463 -7149 -8925 -10301 -7388 -7288 -8683 -10606 -5839 -1668 -8388 -15055 -13471 -4831 3435 -5886
22071 -5886 -7127 -8850 -11888 -16176 -24141 -27174 -20955 -16735 -15906 -15179 -8915 -11323 -4236 8180 6423
22056 6423 2982 -3344 -1994 -8317 -15793 -19180 -9870 -6674 -11992 -10177 -8695 -6554 -5291 -4102 1935
22041 1935 -2852 3907 11034 8704 2634 -2533 3705 11567 17782 4872 -6964 -13442 -21310 -20316
22027 -20316 -17981 -17217 -9056 -5832 -13809 -22835 -21657 -11080 2718 11290 18119 19401 15975 9808
$$ packed form
22130A3168r67j924k91j1659n910n906m770M46l139N796M033p954J191R658Q659
22115D31M51o855r374n357N408M810P407R914n025k160l472l810K010L901N962
22100D241k201m714m349p44Q653J3933J063j3469N35l732j2402p365j681R769
22086a2463N314j776j376K913J00j395j923M767M171o720o667J584Q640Q266r321
22071e886j241j723l038m288p965l033O219M220Q29P27O264k408P087J2416j757
22056F423l441o326J350o323p476l387R310L196n318J815J482K141J263J189O037
22041A935m787O759P127k330o070n167O238P862O215j2910j1836o478p868R94
22027b0316K335P64Q161L224p977r026J178J0577J3798Q572O829J282l426o167
$$ plain form
22013 9808 9924 3087 3975 912 -1063 -5884 -1979 1573 -4090 -14008 -10940 -4426 4025 605 -8368
21998 -8368 -10363 -3138 -5321 -2777 3570 2886 4291 7775 2509 178 2250 -1838 -2006 -1776 -5411
21983 -5411 -14151 -14171 -1107 2586 3433 -3222 -9018 -15627 -14642 -10802 -6073 526 175 -7028 -5611 6695
21967 6695 10970 -361 1747 8331 1268 -16552 -23473 -16256 -11313 -11443 -8672 -3197 4416 9298
21953 9298 7204 7394 14114 11812 780 -2891 -6181 -3787 5404 6611 -2572 -6644 -2596 10912
21939 10912 7941 -10248 -14135 -16655 -10582 -10043 -10266 -4300 -9419 -7805 -1818 3852 12031 9348 4249
21924 4249 -6086 -5144 1197 -690 -3490 1702 10838 11366 12333 14228 -263 -11820 -15486 -13473 -10450
21909 -10450 -733 1507 5987 10227 3083 -1980 1074 8791 11436 7079 786 -2852 -2979 3488 7576
$$ packed form
22013I808J16o837Q88l063j975m821L905L552n663r918L068O514Q451l420q973
21998h368j995P225k183K544O347o84J405L484n266k331K072m088j68K30l635
21983e411q740k0J3064L693Q47o655n796o609R85L840M729O599l51p203J417J2306
21967F695M275j1331K108O584p063j7820o921P217M943j30K771N475P613M882
21953I298k094J90O720k302j1032l671l290K394R191J207r183m072M048J3508
21939A0912k971j8189l887k520O073N39k23N966n119J614N987N670Q179k683n099
21924D249j0335R42O341j887k800N192R136N28R67J895j4491j1557l666K013L023
21909a0450R717K240M480M240p144n063L054P717K645m357o293l638j27O467M088
$$ plain form
21894 7576 17788 18470 6775 -2521 3056 4494 -3463 1817 6638 1301 -1464 -8002 -24921 -37204
21880 -37204 -28122 -12174 -14589 -8069 8925 3464 -1754 -469 4837 3589 -3840 -2250 -7502 1369
21866 1369 -133 -1962 -4383 3742 -1843 -8124 -10156 -9980 -5600 -16444 -21773 -19078 -12806 -8896 -4394
21851 -4394 -2777 -4296 -8120 -14197 -8902 2496 -321 -2907 -1746 -201 11303 14212 8864 9572
21837 9572 9969 6718 5811 13764 19955 17292 11158 9308 -1342 -12604 -13659 -16584 -15384 -16289 -13484
21822 -13484 -2474 -1385 -2781 9866 10027 4656 2031 -4420 -7578 -9098 -7788 -2669 -5155 -752
21808 -752 -6820 -8283 -527 9146 1127 -15591 -15385 -5225 4771 -7383 -18265 -16056 -20159 -21724
21794 -21724 -19797 -18230 -12982 -12803 -11304 -4126 -6800 -13411 -16706 -12421 -17352 -21558 -8352 -1719
$$ packed form
21894G576J0212O82j1695r296N577J438p957N280M821n337k765o538j6919j2283
21880c7204R082J5948k415O520J6994n461n218J285N306j248p429J590n252Q871
21866A369j502j829k421Q125n585o281k032J76M380j0844n329K695O272L910M502
21851d394J617j519l824o077N295J1398k817k586J161J545J1504K909n348P08
21837I572L97l251r07P953O191k663o134j850j0650j1262j055k925J200r05K805
21822a3484J1010J089j396J2647J61n371k625o451l158j520J310N119k486M403
21808g52o068j463P756R673q019j6718K06J0160R996j2154j0882K209m103j565
21794b1724J927J567N248J79J499P178k674o611l295M285m931m206J3206O633
$$ plain form
21780 -1719 -3758 -6242 -8133 -9251 -8942 -11393 -2049 -1856 -12898 -1305 5240 1920 645 -5195 6072
21765 6072 15143 12879 2316 358 2701 808 -3846 -10817 -8299 -1632 -8512 -7960 -9314 -1563 -5573
21750 -5573 -1806 -7414 -13552 -6181 -9420 -8978 -11806 -17977 -19818 -17096 -14903 -16512 -4947 -3497 1502
21735 1502 -3242 -10738 -9134 -6212 -11933 -14920 -17451 -20025 -22988 -22115 -12384 -10182 -3244 1407 12331
21720 12331 18378 12437 16752 17835 2523 -4841 7241 3088 -1684 -15609 -25562 -24682 -20751 -24441
21706 -24441 -24825 -24456 -18950 -21667 -22894 -16899 -4278 4666 5174 -2155 -5190 -1729 -522 -11511 -10934
21691 -10934 -11632 -21614 -26772 -20199 -12795 -4551 -5431 -4865 2225 4876 616 -10899 -17778 -12781 -11624
21676 -11624 -13426 -10997 -14604 -9430 -5511 -5948 -9009 -2693 5384 2340 1492 -2192 -8673 -5769 -6472
$$ packed form
21780a719k039k484j891j118L09k451R344J93j1042J1593O545l320j275n840J1267
21765F072R071k264j0563j958K343j893m654o971K518O667o880N52j354P751m010
21750e573L767n608o138P371l239M42k828o171j841K722K193j609J1565J450M999
21735A502m744p496J604K922n721k987k531k574k963Q73R731K202O938M651J0924
21720A2331O047n941M315J083j5312p364J2082m153m772j3925r953Q80L931l690
21706b4441l84L69N506k717j227N995J2621Q944N08p329l035L461J207j0989N77
21691a0934o98r982n158O573P404Q244q80N66P090K651m260j1515o879M997J157
21676a1624j802K429l607N174L919m37l061O316Q077l044q48l684o481K904p03
$$ plain form
21661 -6472 -6971 -463 6753 8505 6415 5150 756 -2546 6946 -2201 -7789 -16739 -16695 -7842 8147
21646 8147 20447 17988 10616 -247 3560 9799 -1346 -13194 -8468 -8766 -16685 -10081 843 -6288
21632 -6288 -8154 781 51 -5202 -4239 1207 3151 5719 10004 313 -7940 2612 19327 14783 8200
21617 8200 2590 6369 12886 10132 11492 2776 -8696 -18677 -10088 3187 -6616 -5914 3805 6199
21603 6199 11159 16287 1984 -17558 -17716 -5708 7642 3594 -2773 -12836 -16408 -12125 -9582 -11434
21589 -11434 -11116 -11050 -3756 280 -9684 -16018 -19245 -21201 -14628 1185 10108 -5349 -13992 -5113 7535
21574 7535 11498 3030 -2082 661 4708 3629 4330 -1816 -13774 -13827 -10992 -22917 -24331 -22513 -20205
21559 -20205 -16440 -12848 -27440 -28957 -22438 -19786 -14462 -7010 -4974 -12378 -15612 -13049 -15318 -17586
$$ packed form
21661f472m99O508P216J752k090j265m394l302R492r147n588q950M4Q853J5989
21646H147J2300k459p372j0863L807O239j1145j1848M726k98p919O604J0924p131
21632f288j866Q935p30n253R63N446J944K568M285r691q253J0552J6715m544o583
21617H200n610L779O517k754J360q716j1472r981Q589J3275r803P02R719K394
21603F199M960N128j4303j9542j58J2008J3350m048o367j0063l572M283K543j852
21589a1434L18O6P294M036r964o334l227j956O573J5813Q923j5457q643Q879J2648
21574G535L963q468n112K743M047j079P01o146j1958n3K835j1925j414J818K308
21559b0205L765L592j4592j517O519K652N324P452K036p404l234K563k269k268
$$ plain form
21545 -17586 -19554 -13639 -1195 8434 13383 12446 -8106 -16189 -17308 -17752 -19020 -9110 -981 4830
21531 4830 10033 3665 -1820 -7230 -2902 6959 14004 23516 23107 14583 14268 14131 1538 -1226 -11725
21516 -11725 -7460 -7239 -222 6383 2643 5204 5588 2633 -1581 -5197 149 3890 1999 1947 8073
21501 8073 2261 -8607 -11436 -5789 -7240 5034 14266 13713 5523 6522 8110 5886 9695 8086 -1655
21486 -1655 -3617 624 -4007 -6078 -2231 -13432 -9237 -9204 -13647 -17264 -16782 -12490 -20877 -19070 -7041
21471 -7041 -12857 -14222 -13338 -18982 -23966 -14525 1632 8545 12803 8471 5900 10083 9762 19745 19983
21456 19983 10628 5197 6803 2799 9732 12538 772 -8027 8588 14737 6254 -1229 -4354 1790
21442 1790 -798 -1667 -953 75 -7767 -15320 -16014 -10231 -6798 -3289 996 -1927 -5201 -3155 -6973
$$ packed form
21545a7586j968N915J2444R629M949r37k0552q083j119m44j268R910Q129N811
21531D830N203o368n485n410M328R861P045R512m09q524l15j37j2593k764j0499
21516a1725M265K21P017O605l740K561L84k955m214l616N346L741j891n2O126
21501H073n812j0868k829N647j451J2274R232n53q190R99J588k224L809j609r741
21486a655j962M241m631k071L847j1201M195L3m443l617M82M292q387J807J2029
21471g041n816j365Q84n644m984R441J6157O913M258m332k571M183l21R983K38
21456A9983r355n431J606m004O933K806j1766q799J6615O149q483p483l125O144
21442A790k588q69P14J028p842p553o94N783L433L509M285k923l274K046l818
$$ plain form
21427 -6973 -733 -7193 -14214 -11923 -12795 -6539 -4190 -8700 -14852 -13492 -7343 -6834 -4496 -5512 -16259
21412 -16259 -28999 -18418 -12697 -16477 -5849 5801 11738 16443 11253 231 -2471 -5092 -4030
21399 -4030 -1313 5500 4535 -5589 -8433 -8674 -9130 -14386 -11941 -5204 522 4411 4130 3620 -1082 -7515
21383 -7515 -7655 -7547 -15775 -14985 -17590 -13700 -1925 -1403 -7076 -4100 5538 6862 2010 870 7042
21368 7042 9708 -4886 249 13339 13627 17171 9079 9456 2778 -477 -9646 -12393 -6701 -10230 -3229
21353 -3229 2315 3246 6125 9384 18081 23483 26135 21425 14785 -244 -5843 -11142 -14851 -21661 -19244
21338 -19244 -11934 450 18227 20274 22126 19227 9956 12652 11609 4432 971 1844 5799 20449
21324 20449 21567 9543 8261 8071 10367 11363 12418 9455 -4565 -2727 -5337 -7639 -9233 -4496
$$ packed form
21427f973O240o460p021K291q72O256K349m510o152J360O149N09K338j016j0747
21412a6259j2740J0581N721l780J0628J1650N937M705n190j1022k702k621J062
21399d030K717O813r65j0124k844k41m56n256K445O737N726L889k81n10m702o433
21383g515j40J08q228P90k605L890J1775N22n673K976R638J324m852j140O172
21368G042K666j4594N135J3090K88L544q092L77o678l255r169k747N692l529P001
21353c229N544R31K879L259Q697N402K652m710o640j5029n599n299l709o810K417
21338a9244P310J2384J7777K047J852k899r271K696j043p177l461Q73L955J4650
21324B0449J118j2024j282j90K296R96J055k963j4020J838k610k302j594M737
$$ plain form
21310 -4496 3188 11073 6407 1492 8337 15897 10925 10505 16226 20024 18431 12482 7246 -5583 -13317
21295 -13317 -15970 -13115 -10692 -9968 -1545 -2656 -4428 -12443 -15024 -19554 -6128 -6203 866 8483 8651
21280 8651 12497 8601 -3575 -9069 -21895 -12768 -3129 -2798 -6966 -10400 -16594 -6173 873 -6308
21266 -6308 -18052 -19125 -16018 -11493 1225 5624 10062 11391 9277 1558 -1296 -2765 921 -1144
21252 -1144 -4791 -14224 -22616 -10598 -8613 -9465 75 -1167 -12814 -20941 -20933 -9447 -3860 -4816 -5574
21237 -5574 -8921 1932 9998 -5943 -19142 -12964 -11434 -15603 -18165 -18112 -8034 -2202 1214 6235
21223 6235 985 -4906 2225 16308 24507 20042 10121 3030 2335 9902 332 -2888 -1825 -353 -9537
21208 -9537 -12120 -9918 -9348 -7720 -8465 -4730 -4414 1423 10957 10891 4976 817 -3696 1213 7694 2022
$$ packed form
21310d496P684P885m666m915O845P560m972m20N721L798j593n949n236j2829p734
21295a3317k653K855K423P24Q423j111j772q015k581m530J3426p5P069P617J68
21280H651L846l896j2176n494j2826R127R639L31m168l434o194J0421P046p181
21266f308j1744j073L107M525J2718M399M438J329k114p719k854j469L686k065
21252a144l647r433q392J2018J985q52R540j242j1647q127QJ1486N587r56p58
21237e574l347J0853Q066j5941j3199O178J530m169k562N3J0078N832L416N021
21223F235n250n891P131J4083Q199m465r921p091o95P567r570l220J063J472r184
21208i537k583K202N70J628p45L735L16N837R534o6n915m159m513M909O481n672
$$ plain form
21192 2022 -211 -6691 -13210 -10733 -202 2529 -827 -2844 -9336 -15908 -9915 -508 926 -5454
21178 -5454 -9056 -9153 -5642 -1301 -3300 -7712 -761 -1084 1483 6941 12486 10800 3531 4277 -1464 -6638
21162 -6638 -6185 -4031 -11997 -17091 -9772 -2317 -7708 -8306 3414 -1258 1036 13385 19752 16058 5090
21147 5090 -6098 1225 -6249 -7977 -2793 -935 866 -1553 2339 3197 4669 10804 12318 8762 -1768
21132 -1768 -2693 -924 543 -6071 -18817 -20612 -4264 11535 10455 -574 -7227 -9827 -11042 -11535
21118 -11535 -10076 -13476 -15613 -10062 -1720 -547 -142 -3084 -9262 -8632 -5409 302 1082 -4988 -13696
21103 -13696 -11048 1417 10469 -222 -2837 -5177 -638 529 794 -12068 -17732 -24392 -20783 -18195
21089 -18195 -15644 -16146 -4211 6368 6580 439 1980 -1587 -5112 1209 3707 6306 8130 745
$$ packed form
21192B022k233o480o519K477J0531K731l356k017o492o572N993R407J434o380
21178e454l602r7L511M341j999m412O951l23K567N458N545j686p269P46n741n174
21162f638M53K154p966n094P319P455n391n98J1720m672K294J2349O367l694j0968
21147E090j1188P323p474j728N184J858J801k419L892Q58J472O135J514l556j0530
21132a768r25J769J467o614j2746j795J6348J5799j080j1029o653k600j215m93
21118a1535J459l400k137N551Q342J173M05k942o178O30L223N711P80o070q708
21103a3696K648J2465R052j0691k615k340M539J167K65j2862n664o660L609K588
21089a8195K551n02J1935J0579K12o141J541l567l525O321K498K599J824p385
$$ plain form
21075 745 -3346 8405 3750 -11235 -11586 -6346 -2810 -6035 12866 17051 11646 -4420 -8326 -3676
21061 -3676 -806 2011 -7329 -6418 -4100 1357 53 -799 6357 -257 -4582 3968 1951 3324 3551
21046 3551 13712 21516 22227 14437 4437 9912 11621 4224 916 -1394 -1828 7442 23009 21035
21032 21035 13083 2979 7872 12489 -142 4088 855 -11035 -9493 -7766 -1529 1404 -6950 -13517
21018 -13517 -5051 467 6857 2290 2383 14550 21959 15717 8720 13542 9682 5122 4906 1675 -8515
21003 -8515 -10839 -12398 -9939 -5530 -7704 -8035 -4488 -7251 -7377 -9257 -10620 -18864 -20713 -18033 -16098
20988 -16098 -21474 -31839 -21499 -8019 -6375 -8935 -14809 -4134 -1097 1919 5590 5772 761 8366
20974 8366 15708 12174 4771 -7373 642 8629 20312 13025 -1041 -1485 -329 -2687 3890 5082
$$ packed form
21075G45m091J1751m655j4985l51N240L536l225J8901M185n405j6066l906M650
21061c676K870K817r340R11K318N457j304q52P156o614m325Q550k017J373K27
21046C551J0161P804P11p790j0000N475J709p397l308k310m34R270J5567j974
21032B1035p952j0104M893M617j2631M230l233j1890J542J727O237K933q354o567
21018a3517Q466N518O390m567R3J2167P409o242o997M822l860m560k16l231j0190
21003h515k324j559K459M409k174l31L547k763j26j880j363q244j849K680J935
20988a6098n376j0365J0340J3480J644k560n874J0675L037L016L671J82n011P605
20974H366P342l534p403j2144Q015P987J1683p287j4066m44J156k358O577J192
$$ plain form
20960 5082 -2591 -5967 -9759 -10212 -10424 -2180 -9125 -19910 -19493 -10301 -6251 -7173 -13556 -14295 -4522 -4721
20944 -4721 -5549 -3082 -15233 -19665 -25862 -31217 -23452 -6482 2716 -9336 -12257 -3584 1786 1950
20930 1950 5149 7411 5885 4599 10274 8096 -1873 -1078 -1076 -7316 -7042 -6554 -11797 -22801 -22881 -13141
20914 -13141 -10927 -3067 -1313 -5584 -7614 -11933 -8088 633 2174 -3072 -9142 -4540 -867 1733
20900 1733 -3692 -19422 -22498 -19450 -22050 -23999 -26609 -16657 -7681 2509 3620 5244 3838 -3130
20886 -3130 -11324 -10478 -7762 2022 -1061 -8375 -3960 3964 6902 5196 -3362 -10464 -12450 -16273 -11475
20871 -11475 2336 13133 10960 12700 5531 937 -8612 -6946 -6675 -1409 -648 -9289 -6878 -7812 193
20856 193 -5709 -18320 -15648 -9785 -13748 -12049 -7993 1513 8760 12270 12707 10492 5298 -220 9438
$$ packed form
20960E082p673l376l792m53k12Q244o945j0785M17R192M050r22o383p39R773j99
20944d721q28K467j2151m432o197n355P765J6970R198j2052k921Q673N370J64
20930A950L199K262j526j286N675k178r969P95Ko240K74M88n243j1004q0R740
20914a3141K214P860J754m271k030m319L845Q721J541n246o070M602L673K600
20900A733n425j5730l076L048k600j949k610R952Q976J0190J111J624j406o968
20886c130q194Q46K716R784l083p314M415P924K938j706q558p102j986l823M798
20871a1475J3811J0797k173J740p169m594r549J666K71N266P61q641K411r34Q005
20856A93n902j2611K672N863l963J699M056R506P247L510M37k215n194n518R658
$$ plain form
20841 9438 6024 2404 -2177 111 5429 481 3814 -3665 -8336 -9112 -9609 -3879 -7319 -5779 1584
20826 1584 12077 11538 1440 6805 16330 11032 -3097 -1882 9689 7758 10296 11466 9118 1902
20812 1902 3647 2873 2591 -6838 -10774 -3483 -7518 -12707 -18388 -14712 -15016 -14179 -7494 1376 -874 -8376
20796 -8376 -9778 -7639 -6125 -1699 1744 -8446 -12434 -6930 2957 6253 -636 -6287 -8346 -3504
20782 -3504 299 3990 -6549 -10001 -15825 -11548 -621 2045 13418 8120 240 -6496 -10326 -3816
20768 -3816 1681 -3933 -2821 8943 4023 -5439 -12502 -14979 -10052 -3667 4892 649 -8815 -2411
20754 -2411 17703 20504 350 -16247 -21751 -16958 -1589 -106 2227 4652 4145 -3604 -15781 -13984
20740 -13984 -11218 -5579 -3188 -10643 -9511 -13096 -14339 -9831 -18956 -20336 -29344 -19308 -15323 -8315
$$ packed form
20841I438l414l620m581K288N318m948L333p479m671p76m97N730l440J540P363
20826A584J0493n39j0098N365R525n298j4129J215J1571j931K538J170k348p216
20812A902J745p74k82r429l936P291m035n189n681L676l04Q37O685Q870k250p502
20796h376j402K139J514M426L443j0190l988N504R887L296o889n651k059M842
20782c504L803L691j0539l452n824M277J0927K666J1373n298p880o736l830O510
20768c816N497n614J112J1764m920r462p063k477M927O385Q559m243r464O404
20754b411K0114K801k0154j6597n504M793J5369J483K333K425n07p749j2177J797
20740a3984K766N639K391p455J132l585j243M508r125j380r008J0036L985P008
$$ plain form
20726 -8315 -8652 -19017 -18767 -14772 -10606 -5250 6515 1531 3006 -2537 -5833 -1210 -5042 -6066 143
20711 143 5642 3254 2634 -731 2424 2569 -730 -13095 -9968 -15976 -20263 -25039 -26863 -22233 -21585
20696 -21585 -29275 -35551 -32946 -25707 -17812 -15978 -6643 -10030 -11935 -21122 -26233 -29192 -30200 -25666
20682 -25666 -9985 2200 402 1031 4157 7032 12148 11030 -404 -8773 -2923 6169 -3196 -18295
20668 -18295 -15032 -5497 -4166 2136 10571 6379 -8277 -16551 -27628 -27567 -22916 -10643 -10184 -14753
20654 -14753 -1522 5025 -157 -3481 2682 6792 11236 -357 -8014 -8358 -4773 4869 159 403
20640 403 1665 6590 14747 23673 13960 13483 5725 572 -865 -1614 -1929 -3497 145 3556 8402 1279
20624 1279 -4266 -5408 -5965 3918 -3329 -15366 -9152 -3796 -7800 -5531 -8947 -15441 -8635 -2542 -5377
$$ packed form
20726h315l37j0365K50L995M166N356J1765m984J475n543l296M623l832j024O209
20711A43N499k388o20l365L155J45l299j2365L127o008m287m776j824M630O48
20696b1585p690o276K605P239P895J834R335l387j905r187n111k959j008M534
20682b5666J5681J2185j798O29L126K875N116j118j1434q369N850R092r365j5099
20668a8295L263R535J331O302Q435m192j4656q274j1077O1M651J2273M59m569
20654a4753J3231O547n182l324O163M110M444j1593p657l44L585R642m710K44
20640D03J262M925Q157Q926r713m77p758n153j437p49l15j568L642L411M846p123
20624A279n545j142n57R883p247j2037O214N356m004K269l416o494O806O093k835
$$ plain form
20609 -5377 6166 6584 -1495 -3171 -9123 -24567 -18474 -7257 -4164 446 6117 13122 9281 -5961
20595 -5961 -3631 4394 9448 2653 -1838 -4293 -7443 -4791 -8722 -4962 -14798 -14193 -6940 -5265 -1175
20580 -1175 84 8273 4657 -4291 -9959 -11684 -8001 -8124 -9166 -2795 -2177 -1949 2956 1093 -1504
20565 -1504 -2580 -2766 2222 1434 4695 7636 14035 18429 26850 22799 13454 2152 -4883 -12104 -17641
20550 -17641 -15787 -10967 -2281 -657 -2354 3624 6639 3975 -3939 -2612 -2591 -3663 3398 2638 11152
20535 11152 10351 12226 11212 3576 -2239 3178 9620 4223 -10436 -8546 -4733 -656 -338 -4901 -15266
20520 -15266 -12539 -3706 4122 11598 10707 -9682 -12555 -3862 -3965 -3403 -5549 -14504 -14649 -13056 -2531
20505 -2531 10376 4357 2011 -4144 78 -7625 -8471 -901 -352 -6003 -8957 -3949 2454 2963 3073
$$ packed form
20609e377J1543M18q079j676n952j5444O093J1217L093M610N671P005l841j5242
20595e961K330Q025N054o795m491k455l150K652l931L760r836O05P253J675M090
20580a175J259Q189l616q948n668j725L683j23j042O371O18K28M905j863k597
20565a504j076j86M988p88L261K941O399M394Q421m051r345j1302p035p221n537
20550a7641J854M820Q686J624j697N978L015k664p914J327K1j072P061p60Q514
20535A1152q01J875j014p636n815N417O442n397j4659J890L813M077L18m563j0365
20520a5266K727Q833P828P476q91k0389k873Q693j03N62k146q955j45J593J0525
20505b531J2907o019k346o155M222p703q46P570N49n651k954N008O403N09J10
$$ plain form
20490 3073 -4430 -2886 -2814 -1286 936 8767 2568 1660 9873 2468 2943 341 3382 3922 -4690 -7209
20474 -7209 -5570 -5888 -9680 -13324 -16860 -19892 -23126 -22861 -14687 -3259 6877 6721 5819 10382 10546
20459 10546 11569 3428 -2897 -3487 -11775 -10015 -9947 -3408 -444 1480 4037 -2553 -10618 -9135 4136
20444 4136 13424 3660 -9899 -18899 -22177 -20147 -25930 -20887 -10489 -10256 3967 6426 -2805 -14316
20430 -14316 -8638 -399 -5552 -15880 -19060 -20868 -21993 -13992 -7212 -5341 -12807 -17227 -12068 -20306
20416 -20306 -10758 -4111 1212 -3448 -11841 -11420 -15398 -10637 -5125 -8031 -6730 -4642 -3814 -5337 -4677
20401 -4677 -7436 -4212 -3150 -11322 -17456 -11224 -13940 -16753 -10162 6643 9859 1123 -3053 -6653
20387 -6653 -6963 -13126 -13369 -4664 -2424 1443 -2142 -5923 -6448 -11235 -10595 -12057 -11086 -7623 1614 -3253
$$ packed form
20490C073p503J544P2J528K222P831o199r08Q213p405M75k602L041N40q612k519
20474g209J639l18l792l644l536l032l234K65Q174J1428J0136j56r02M563J64
20459A0546J023q141o325n90q288J760O8O539K964J924K557o590q065J483J3271
20444D136R288r764j3559r000l278K030n783N043J0398K33J4223K459r231j1511
20430a4316N678Q239n153j0328l180j808j125Q001O780J871p466m420N159q238
20416b0306R548O647N323m660q393M21l978M761N512k906J301K088Q28j523O60
20401d677k759L224J062q172o134O232k716k813O591J6805L216q736m176l600
20387f653l10o163k43Q705K240L867l585l781n25m787O40j462R71L463R237m867
$$ plain form
20371 -3253 -9997 -12098 -4785 -6678 -6739 -11229 -11116 -8213 -8215 -529 5380 5927 -5401 -19722 -16801 -8914
20355 -8914 -4094 -1994 -7242 -16232 -10825 -14397 -24667 -24478 -12493 -18887 -22529 -19233 -20762 -3577
20341 -3577 1453 719 2458 5451 3550 1242 3065 -8716 -11204 -8067 -6232 -2364 994 6857 4703
20326 4703 313 -8266 -21006 -25397 -16331 -5314 -2830 -4084 -1672 3608 6192 6780 -7565 -10552
20312 -10552 -10898 -14395 -19194 -23954 -33712 -20230 -26899 -28590 -16606 -12299 -17002 -14468 -14169 -15189
20298 -15189 -14466 -15938 -17607 -14893 -14166 -13140 -9150 -6864 -14309 -23989 -30784 -20615 -9753 -4645
20284 -4645 4177 5137 3862 7612 13831 15487 15664 11467 15027 2869 -18630 -16064 -3831 -3498 -12937
20269 -12937 -7763 -1074 2688 -3569 -10192 -10410 -7264 -9822 -16531 -28350 -20439 -11535 -9204 -14658
$$ packed form
20371c253o744k101P313j893o1m490J13K903kP686N909N47j1328j4321K921P887
20355h914M820K100n248q990N407l572j0270J89J1985o394l642L296j529J7185
20341c577N030p34J739K993j901k308J823j1781k488L137J835L868L358N863k154
20326D703m390q579j2740m391R066J1017K484j254K412N280K584N88j4345k987
20312a0552l46l497m799m760r758J3482o669j691J1984M307m703K534K99j020
20298a5189P23j472j669K714P27J026L990K286p445r680o795J0169J0862N108
20284d645Q822R60j275L750O219J656J77m197L560j2158k1499K566J2233L33r439
20269a2937N174O689L762o257o623k18L146k558o709j1819P911Q904K331n454
$$ plain form
20255 -14658 -23706 -11169 -9277 -13252 -9130 -6924 -7428 -6712 -6824 -14036 -9528 -2976 -9533 -11974 -6359
20240 -6359 -4242 -15141 -21329 -21198 -22164 -13056 -6267 -4415 5042 9351 -4176 -14584 -24456 -19461
20226 -19461 -19207 -11027 -10578 -15052 -18342 -13053 -11285 -10191 -11661 -4551 2872 3890 -4421 -304 8093
20211 8093 1940 -7868 -10679 -12823 -12122 -7907 -22989 -32622 -31137 -15286 -10550 -16606 -23822 -15845
20197 -15845 -8085 1656 3656 4548 -3483 -4819 -3476 -4289 3113 4229 2026 -459 -6117 -4986 -1572
20182 -1572 -7961 -7774 -11711 -12276 4523 14463 12822 9830 9455 12198 7139 1815 -3284 -766 -3636
20167 -3636 -7942 -6996 -9171 -21247 -27710 -16942 -4992 -4668 -1393 -1809 -12964 -18873 -10729 -5179
20153 -5179 -3849 -5715 -14987 -17536 -8650 -9051 -7970 -10706 -11566 -9632 -2381 5023 -2602 -258 4647
$$ packed form
20255a4658r048J2537J892l975M122K206n04P16j12p212M508O552o557k441N615
20240f359K117j0899o188J31r66R108O789J852R457M309j3527j0408r872M995
20226a9461K54Q180M49m474l290N289J768J094j470P110P423J018q311M117Q397
20211H093o153r808k811k144P01M215j5082r633J485J5851M736o056p216P977
20197a5845P760R741K000Q92q031j336J343q13P402J116k203k485n658J131L414
20182a572o389J87l937n65J6799R940j641k992l75K743n059n324n099K518k870
20167c636m306R46k175j2076o463J0768J1950L24L275m16j1155n909Q144N550
20153e179J330j866r272k549Q886m01J081k736q60J934P251P404p625K344M905
$$ plain form
20138 4647 559 9023 20361 10258 8477 6951 -8861 4942 9467 6259 2306 -7416 -11033 -8539
20124 -8539 -8186 -10216 -13422 -10692 -10447 -2520 1833 -102 -450 -4757 -4449 -4697 -11081 -9909 -2738 -6762
20108 -6762 -8588 1917 270 -6829 -8838 -16396 -15488 -5123 -34 3642 -1044 -5582 -7182 -247
20094 -247 10998 13115 5641 -354 4739 11296 -204 -9524 -18881 -12295 -3620 -3051 -8370 -19417
20080 -19417 -22585 -19201 -16138 -11093 -61 5235 2502 -1386 -5073 -10087 -2690 8410 14966 13458
20066 13458 7977 -3508 -15257 -20467 -17560 -10290 -6749 4409 7795 11069 -3407 -17064 -10896
20053 -10896 -6251 -13894 -12785 -5155 -10172 -16375 -19944 -12775 -3833 -2181 -9696 -7057 -7034 -18757 -11498
20038 -11498 -2096 -6758 -10360 -10180 -9067 -9137 -11483 -20697 -17624 -15053 -17440 -8912 -13673 -16625 -11706
$$ packed form
20138D647m088Q464J1338j0103j781j526j5812J3803M525l208l953r722l617K494
20124h539L53k030l206K730K45P927M353j935l48m307L08k48o384J172P171m024
20108f762j826J0505j647p099k009p558R08J0365N089L676m686m538j600O935
20094b47J1245K117p474n995N093O557j1500r320r357O586Q675N69n319j1047
20080a9417l168L384L063N045J1032N296k733l888l687n014P397J1100O556j508
20066A3458n481j1485j1749n210K907P270L541J1158L386L274j4476j3657O168
20053a0896M645p643J109P630n017o203l569P169Q942J652p515K639K3j1723P259
20038a1498R402m662l602J80J113p0k346r214L073K571k387Q528m761k952M919
$$ plain form
20023 -11706 -8647 -6486 -911 11950 14334 1286 -7201 -11109 48 780 -4239 1601 -1163 7831
20009 7831 24715 13448 6347 -2168 -718 -6225 -3286 -870 2854 -734 8662 17696 17679 14193 14696
19994 14696 17937 11543 3796 1332 286 -42 -2057 -1985 -2126 -4641 -9668 3611 13174 9013 7691
19979 7691 5539 -1653 -3549 502 -5267 -11226 -20084 -18649 -8916 -986 7028 3674 -1584 -3840 -3416
19964 -3416 -867 -4194 -2572 -1606 4804 -5499 -13430 -7756 -1964 -10724 -14569 -19167 -11714 -9168 -6486
19949 -6486 -8406 -9913 548 18121 24824 17180 8644 -1727 -2578 -32 48 -1854 -167 8143 8766
19934 8766 3010 2630 10209 15635 12436 12094 14989 10084 9545 15582 12082 3589 -6566 -2719 8586
19919 8586 5721 7536 9260 6647 -4713 -4396 -11261 -12291 -1664 -1359 -14328 -22936 -20700 -9910
$$ packed form
20023a1706L059K161N575J2861K384j3048q487l908J1157P32n019N840k764Q994
20009G831J6884j1267p101q515J450n507K939K416L724l588R396R034j7l486N03
19994A4696L241o394p747k464j046l28k015P2j41k515n027J3279R563m161j322
19979G691k152p192j896M051n769n959q858J435R733P930Q014l354n258k256M24
19964c416K549l327J622R66O410j0303p931N674N792q760l845m598P453K546K682
19949f486j920j507J0461J7573O703p644q536j0371q51K546Q0j902J687Q310O23
19934H766n756l80P579N426l199l42K895m905n39O037l500q493j0155L847J1305
19919H586k865J815J724k613j1360L17o865j030J0627L05j2969q608K236J0790
$$ plain form
19905 -9910 -1791 -5793 -11684 -13551 -2371 2763 6763 -4510 -6702 901 14137 10836 773 -5332
19891 -5332 -12306 -7315 6510 14911 19304 17914 3254 -1980 5509 6192 13072 16062 8631 7001
19877 7001 7080 3600 4501 5129 -623 -8271 -14543 -13139 -6861 5671 17395 18358 7680 -751 -9003
19862 -9003 -6782 -4545 -9048 -8229 -11251 -1682 4304 7288 5581 969 2049 757 1218 5247 -8966
19847 -8966 -9404 -13300 -12642 -2445 -167 -3231 -11206 -4518 2599 5110 -1230 -1752 735 2135 -3308
19832 -3308 -3292 -524 -2118 -489 -1298 -6057 -20110 -19957 -8369 -3917 -4538 -21617 -22744 -35467 -30475
19817 -30475 -13974 -1074 7225 8460 7567 6967 3715 -4609 -8646 -13504 -14737 -1150 10386 3505
19803 3505 -8016 -1420 8479 10995 13606 11760 4734 -138 -4853 -12721 -6972 -14451 -12560 -3781
$$ packed form
19905i910Q119m002n891j867J1180N134M000j1273k192P603J3236l301j0063o105
19891e332o974M991J3825Q401M393j390j4660n234P489O83O880K990p431j630
19877G001P9l480R01O28n752p648o272J404O278J2532J1724R63j0678q431q252
19862i003K221K237m503Q19l022R569N986K984j707m612J080j292M61M029j4213
19847h966m38l896O58J0197K278l064p975O688P117K511o340n22K487J400n443
19832c308J6K768j594J629q09m759j4053J53J1588M452o21j7079j127j2723M992
19817c0475J6501J2900Q299J235q93o00l252q324m037m858j233J3587J1536o881
19803C505j1521O596R899K516K611j846p026m872m715p868N749p479J891Q779
$$ plain form
19789 -3781 -5689 -2531 5205 2899 -3975 -1897 2095 5470 2826 -6311 -4614 5739 8866 7950 7965
19774 7965 -1915 -5354 -5743 -759 7562 2621 423 6235 10672 2249 -2807 -8419 1830 6148 6175
19759 6175 519 1792 4331 5661 13055 17996 15509 11241 3731 2861 10534 16811 6101 853 -3105
19744 -3105 -8430 -4642 -8118 -4672 5276 5119 -7436 -13140 -12806 -13696 -13425 -9246 -7729 -8925 -6996
19729 -6996 -6347 2964 3756 -18998 -23161 -17363 -3969 3336 -3589 -5726 -2131 3456 3029 1145 -4776
19714 -4776 -680 6318 8911 5376 -6388 -12852 -14372 -17829 -21017 -2923 -836 -1512 -5701 -8795
19700 -8795 -9427 -1776 6684 6320 4652 -1367 1907 2210 86 -6493 -11241 -7245 3928 22912 24662
19685 24662 21497 12881 9735 8973 6255 -392 -11796 -15463 -5335 -13801 -21414 -23146 -7396 12253
$$ packed form
19789c781j908L158P736k306o874K078L992L375k644r137J697J0353L127r16J5
19774G965r880l439l89M984Q321m941k198N812M437q423n056n612J0249M318K7
19759F175n656J273K539J330P394M941k487m268p510q70P673O277j0710n248l958
19744c105n325L788l476L446R948j57j2555n704L34q90K71M179J517j196J929
19729f996O49R311P92k2754m163N798J3394P305o925k137L595N587m27j884n921
19714d776M096O998K593l535j1764o464j520l457l188J8094K087o76m189l094
19700h795o32P651Q460l64j668o019L274L03k124o579m748L996J1173J8984J750
19685B4662l165q616l146p62k718o647j1404l667J0128q466p613j732J5750J9649
$$ plain form
19671 12253 9887 -1170 2218 -880 -2521 342 -2608 3949 6963 8767 6183 -6555 -15947 -9897
19657 -9897 -12878 -2421 4968 18 -4289 -4563 -6774 -13166 -15321 -5633 -11714 2587 7273 5393
19643 5393 2970 6628 9613 4663 -4155 -1137 -8038 -10173 -3277 -3625 -2488 5565 -4823 -8343 -11464
19628 -11464 -10584 -7693 -10095 3178 1694 -5023 -8608 -16435 -19163 -19480 -13515 -933 -1333 -12194
19614 -12194 -8262 -898 3050 7169 2017 -6312 -15624 -15162 -6851 -7130 -12725 -17523 -10763 -11082 -10767
19599 -10767 -13556 -20122 -17404 -18498 -14092 -16263 -11102 -11317 -7157 -5478 4164 4341 6517 6308 2556
19584 2556 454 -5413 -14553 -15623 -11691 -8103 -687 -9717 -15083 -13613 -8178 -8892 -10775 -14731 -16432
19569 -16432 -5117 4736 1615 -6400 -6212 -11454 -16216 -12412 -10805 -9634 -5566 5902 7816 -3146
$$ packed form
19671A2253k366j1057L388l098j641K863k950O557L014J804k584j2738r392O050
19657i897k981J0457P389m950m307k74k211o392k155R688o081J4301M686j880
19643E393k423L658K985m950q818L018o901k135O896l48J137Q053j0388l520l121
19628a1464Q80K891k402J3273j484o717l585p827k728l17N965J2582m00j0861
19614a2194L932P364L948M119n152q329r312M62Q311k79n595m798O760l19L15
19599a0767k789o566K718j094M406k171N161k15M160J679R642J77K176k09l752
19584B556k102n867r140j070L932L588P416r030n366J470N435p14j883l956j701
19569a6432J1315R853l121q015J88n242m762L804J607J171M068J1468J914j0962
$$ plain form
19555 -3146 -12308 -6927 -6808 -7945 -21020 -26961 -19944 -8209 -6933 -9984 -15145 -10288 -523 -14287
19541 -14287 -18935 -15163 -4338 3839 10134 21756 19315 17974 18304 11628 4922 -6243 -8510 -4257
19527 -4257 -5195 -15581 -18146 -6092 1738 3297 -1539 -6807 -7399 -9279 -414 7214 9647 2300 -8560
19512 -8560 -16150 -13826 -2944 5213 4819 -1829 -7134 -12464 -1927 5363 13281 18893 7710 18163
19498 18163 27678 26630 24846 23153 21001 27495 28348 24441 25585 33385 35934 38870 43211 39896 36959
19483 36959 26500 30806 35201 40382 32588 20291 16915 15635 7195 7274 15146 3237 -10802 -141
19469 -141 14392 12328 8652 16634 17322 22004 32492 41698 34088 27590 28876 27600 28203 16034 12085
19454 12085 16292 29470 30666 32301 34347 35602 37639 39865 43268 37929 30269 33750 41035 40237
$$ packed form
19555c146r162N381J19j137j3075n941P017J1735J276l051n161M857R765j3764
19541a4287m648L772J0825Q177O295J1622k441j341L30o676o706j1165k267M253
19527d257r38j0386k565J2054P830J559m836n268n92j880Q865P628K433p347j0860
19512h560p590K324J0882Q157l94o648n305n330J0537P290P918N612j1183J0453
19498A8163R515j048j784j693k152O494Q53l907J144P800K549K936M341l315k937
19483C6959j0459M306M395N181p794j2297l376j280q440P9P872j1909j4039J0661
19469a41J4533k064l676P982O88M682J0488R206p610o498J286j276O03j2169l949
19454A2085M207J3178J196J635K046J255K037K226L403n339p660L481P285p98
$$ plain form
19440 40237 36163 35027 42174 46093 43533 43863 45295 39019 30145 22884 15405 9790 6080 1574 2227
19425 2227 2077 6102 8686 4324 -6935 -11202 -11188 -8481 -8967 -11183 -13686 -19334 -27673 -34860 -37603
19410 -37603 -25411 -11467 6103 14377 19690 22336 11928 -3213 -12128 -10395 -476 6233 -986
19397 -986 2922 496 2764 13142 23334 33459 39338 29162 21397 6411 6407 8217 6333 -5999
19383 -5999 -21626 -21878 -12745 -1424 -979 -6076 4821 2087 -12184 -15162 -6392 -7104 -14179 -12912
19369 -12912 -12546 -18515 -17594 -13331 146 5980 4145 1438 -1659 -11304 3048 13802 12141 5373
19355 5373 4578 -4136 -1278 7211 8050 8054 1829 6813 1956 -8188 -2831 -1700 -4580 -9317 -6751 -6450
19339 -6450 3886 8083 11938 4659 4893 408 -4546 -8548 -4517 -6434 -11893 -14842 -7680 3657
$$ packed form
19440D0237m074j136P147L919k560L30J432o276q874p261p479n615l710m506O53
19425B227j50M025K584m362j1259m267J4K707m86k216k503n648q339p187k743
19410c7603J2192J3944J7570Q274N313K646j0408j5141q915J733R919O709p219
19397i86L908k426K268J0378J0192J0125N879j0176p765j4986mJ810j884j2332
19383e999j5627k52R133J1321M45n097J0897k734j4271k978Q770p12p075J267
19369a2912L66n969R21M263J3477N834j835k707l097r645J4352J0754j661o768
19355E373p95q714K858Q489Q39Mo225M984m857j0144N357J131k880m737K566L01
19339f450J0336M197L855p279K34m485m954m002M031j917n459k949P162J1337
$$ plain form
19325 3657 9302 7181 -791 3574 7041 1362 2095 -4115 -1073 8551 17461 2272 -2705 3963 10011
19310 10011 5036 9289 13009 13828 12708 11323 4232 -3855 -9212 -2844 1469 4877 6026 8074 -387
19295 -387 4615 9612 9178 6266 3354 -2478 -5463 -358 -1766 -11891 -14200 -11801 -7548 707 7171
19280 7171 13683 16413 14460 11561 8252 10381 4935 -8167 -8484 -5846 4587 7427 -173 -2614
19266 -2614 -1509 1360 3395 6797 15973 14216 2506 386 -9023 -8268 -11153 -6915 2733 8274 1758
19251 1758 -4330 -12324 -4536 10769 11451 9202 -922 2248 3648 -1362 -4932 -9319 -12434 -16608
19237 -16608 -5691 -6262 -9484 -1817 48 -2623 -1733 1486 8109 8907 3960 -11031 -14047 -7246 -6878
19222 -6878 -6328 5403 12128 5355 2532 -4591 -7504 -5514 -9668 910 -2152 -4225 -7121 -1330
$$ packed form
19325C657N645k121p972M365L467n679P33o210L042R624Q910j5189m977O668O048
19310A0011m975M253L720Q19j120j385p091q087n357O368M313L408J149K048q461
19295c87N002M997m34k912k912n832k985N105j408j0125k309K399M253Q255O464
19280G171O512K730j953k899l309K129n446j3102l17K638J0433K840p600k441
19266b614J105K869K035L402R176j757j1710k120r409P55k885M238R648N541o516
19251A758o088p994P788J5305O82k249j0124L170J400n010l570m387l115m174
19237a6608J0917n71l222P667J865k671Q90L219O623P98m947j4991l016O801L68
19222f878N50J1731O725o773k823p123k913J990m154J0578l062k073k896N791
$$ plain form
19208 -1330 4590 1091 1985 -3589 -1342 -1044 620 -5531 -8489 -6349 3377 13592 13165 4282 -8543
19193 -8543 -10148 5312 16705 15696 6824 9235 11610 2240 -5463 -8427 -14377 -19034 -20612 -10755
19179 -10755 7724 14819 6508 1540 2070 -535 2887 9951 12043 4940 3209 -206 -2475 -2376 -1349
19164 -1349 -3902 -1429 -423 461 6841 5736 3408 759 -8186 -9630 -13329 -9154 -2209 392 7135
19149 7135 1824 14438 14582 1253 -10379 -9524 -4740 -6187 -3910 -13638 -11469 -11956 -19527 -8194
19135 -8194 606 8048 10491 10691 3942 3138 4775 9996 11149 7227 -1569 -5504 -3847 -4879 -12426
19120 -12426 -11721 -6854 1877 1561 322 5541 3885 6398 10465 16225 8438 3600 10403 18720 19366
19105 19366 13432 6913 5069 6282 10126 7893 9225 699 6304 18566 19280 24561 12693 -2179
$$ packed form
19208a330N920l499Q94n574K247K98J664o151k958K140R726J0215m27q883j2825
19193h543j605J5460J1393j009q872K411K375r370p703k964n950m657j578R857
19179a0755J8479P095q311m968N30k605L422P064K092p103j731l415k269R9J027
19164a349k553K473J006Q84O380j105k328k649q945j444l699M175O945K601O743
19149G135n311J2614J44j3329j1632Q55M784j447K277r728K169m87p571J1333
19135h194Q800P442K443K00o749q04J637N221J153l922q796l935J657j032p547
19120a2426P05M867Q731l16j239N219j656K513M067N760p787m838O803Q317O46
19105A9366n934o519j844J213L844k233J332q526N605J2262P14N281j1868j4872
$$ plain form
19091 -2179 -1901 1596 -3663 -7207 -8482 -856 4542 8417 5451 -621 -2778 -4792 -5105 -6353 -10484
19076 -10484 -13996 -15194 -18484 -9422 2542 4559 -4111 -8139 -9125 -6176 -4790 -182 2306 624
19062 624 -5597 -5374 615 -5994 -2217 -4454 1514 12435 14894 11554 4721 12478 7119 6812 8405
19047 8405 6989 8047 5261 435 3029 734 -6699 -3220 -4385 -1292 6755 10455 10075 13095 2364
19032 2364 991 -2055 -5392 -1796 5937 8385 3153 4352 7682 1213 -1986 1491 6742 14370 23150
19017 23150 19491 5734 14477 12660 1961 2177 3770 5 -5977 -619 -17 4610 6801 2482
19003 2482 2655 -2947 -12435 -6306 3092 12415 26019 29083 20408 15255 10071 8048 4828 -3541 33
18988 33 5723 1041 1722 10220 17180 24530 27651 28541 31628 24902 24708 34670 30273 24356 24258 32959
$$ packed form
19091b179K78L497n259l544j275P626N398L875k966o072k157k014l13j248m131
19076a0484l512j198l290R062J1964K017q670m028r86K949J386M608K488j682
19062F24o221K23N989o609L777k237N968J0921K459l340o833P757n359l07J593
19047H405j416J058k786m826K594k295p433L479j165L093Q047L700l80L020j0731
19032B364j373l046l337L596P733K448n232J199L330o469l199L477N251P628Q780
19017B3150l659j3757Q743j817j0699K16J593l765n982N358O02M627K191m319
19003B482J73n602r488O129R398R323J3604L064q675n153n184k023l220q369L574
18988C3N690m682O81Q498O960P350L121Q90L087o726j94R962m397n917r8Q701
$$ plain form
18972 32959 33917 29126 22990 13252 12280 6868 -2709 1920 10849 14078 22470 20999 25190 31438 26378
18957 26378 21904 23657 27656 16169 14025 26369 28535 7884 2469 3083 11646 16590 15953 30435
18943 30435 32730 13671 5380 8113 393 -2741 2383 12070 12791 11047 15213 8138 2066 10981
18929 10981 17611 19361 24990 39599 50585 47465 48277 40725 32737 34545 22985 11413 907
18916 907 7206 10917 26735 38541 38060 36048 34855 28408 26087 34722 23049 15412 23215 32342
18902 32342 35011 20589 11331 26292 21682 11953 4308 15005 25641 26539 34286 32092 27517 23868
18888 23868 25478 23144 18223 18643 17542 16535 13492 19386 21148 15990 19239 28254 34021 35817 32758
18873 32758 27988 23779 27421 28437 21670 20795 25203 30016 37608 45385 42211 38682 32020 31185 26570
$$ packed form
18972C2959R58m791o136r738r72n412r577M629Q929L229Q392j471M191O248n060
18957B6378m474J753L999j1487k144J2344K166k0651n415O14Q563M944o37J4482
18943C0435K295j9059q291K733p720l134N124R687P21j744M166p075o072Q915
18929A0981O630J750N629J4609J0986l120Q12p552p988J808j1560j1572j0506
18916I07O299L711J5818J1806m81k012j193o447k321Q635j1673p637P803R127
18902C2342K669j4422r258J4961m610r729p645J0697J0636Q98P747k194m575l649
18888B3868J610k334m921M20j101j007l043N894J762n158L249R015N767J796l059
18873C2758m770m209L642J016o767q75M408M813P592P777l174l529o662q35m615
$$ plain form
18858 26570 20463 14040 7515 9473 11944 19474 27548 30236 23556 15786 18577 20855 23819 19577
18844 19577 22820 30688 21533 15037 16450 17141 25784 31783 42097 37507 25748 31679 42029 44228
18830 44228 45436 50359 60561 52072 43870 41365 40256 58379 79744 82480 81246 91239 87885 80369
18816 80369 70760 65156 62482 57806 53771 56581 59295 62319 56722 53557 39746 36387 42135 47037
18802 47037 50736 48327 54196 71781 72423 63436 64813 72445 87138 86246 74049 62727 69729 71131
18788 71131 74169 68738 68782 64269 66514 69137 75770 77892 76931 73523 58556 52333 47863 46257 53432
18773 53432 59586 66157 71927 77072 98217 112715 116047 107909 82971 60774 59212 47934 37173
18760 37173 43086 46075 49081 39723 38385 45747 49641 52029 57825 65591 70235 78132 78610 77000 84187
$$ packed form
18858B6570o107o423o525J958K471P530Q074K688o680p770K791K278K964m242
18844A9577L243P868r155o496J413O91Q643N999J0314m590j1759N931J0350K199
18830D4228J208M923J0202q489q202k505j109J8123K1365K736j234R993l354p516
18816H0369r609n604k674m676m035K810K714L024n597l165j3811l359N748M902
18802D7037L699k409N869J7585O42q987J377P632J4693q92j2197j1322P002J402
18788G1131L038n431M4m513K245K623O633K122r61l408j4967o223m470j606P175
18773E3432O154O571N770N145K1145J4498L332q138k4938k2197j562j1278j0761
18760C7173N913K989L006r358j338P362L894K388N796P766M644P897M78j610P187
$$ plain form
18745 84187 86418 78068 71468 63804 65475 62340 55503 53766 49223 50188 55776 63426 74519 79583
18731 79583 72819 64306 59257 64717 66860 70937 73788 77002 91161 117517 129442 134670 150354
18718 150354 172484 206137 209909 199303 192931 191866 194551 193431 195599 210576 216707 201267 199712
18705 199712 209833 231059 259334 283118 288103 289594 296575 298613 304020 318847 326487 325956 325826
18692 325826 333416 344954 350468 339207 332343 332729 331328 332872 327447 330895 330349 331883 336561 346309
18678 346309 342061 327300 339159 358785 376259 402832 422121 453963 482645 516819 540990 567822
18666 567822 601108 625299 636750 628497 600288 582872 564089 529501 502790 488604 471064 478169
18654 478169 478883 476285 469298 470211 457462 450962 457902 464133 465629 464504 466677 473205 481499 494086
$$ packed form
18745H4187K231q350o600p664J671l135o837j737m543R65N588P650J1093N064
18731G9583o764q513n049N460K143M077K851L214J4159K6356J1925N228J5684
18718A50354K2130L3653L772j0606o372j065K685j120K168J4977O131j5440j555
18705A99712J0121K1226K8275K3784M985J491O981K038N407J4827P640n31j30
18692C25826P590J1538N514j1261o864L86j401J544n425L448n46J534M678R748
18678C46309m248j4761J1859J9626J7474K6573J9289L1842K8682L4174K4171K6832
18666E67822L3286K4191J1451q253k8209j7416j8783l4588k6711j4186j7540P105
18654D78169P14k598o987R13j2749o500O940O231J496j125K173O528Q294J2587
$$ plain form
18640 494086 499438 503041 503666 507361 499830 497308 489838 470317 429293 413684 410697 407289 404214 410514
18626 410514 406840 397518 391494 392702 399740 408895 417830 438119 444578 452539 455477 457838 462321 443689
18612 443689 428886 427511 410163 403758 396219 376677 343921 315448 288692 260039 235630 220250
18600 220250 222034 231318 219097 206397 215452 218756 224860 233564 225989 227278 232383 249744 253063
18587 253063 244905 230628 222387 208054 198456 181937 180793 190162 198826 201523 202925 202819 201428 209141
18573 209141 218584 230738 234702 239494 236143 219093 207384 203048 194899 196865 185134 170054 181526
18560 181526 197555 203524 208473 213073 228252 238488 234926 228731 213591 208151 206822 199910 186903
18547 186903 191057 189439 188708 197737 196277 183487 179043 175831 185051 203117 211146 208189 207793 211970
$$ packed form
18640D94086N352L603O25L695p531k522p470j9521m1024j5609k987l408l075O300
18626D10514l674r322o024J208P038R155Q935K0289O459P961K938K361M483j8632
18612D43689j4803j375j7348o405p539j9542l2756k8473k6756k8653k4409j5380
18600B20250J784R284j2221j2700R055L304O104Q704p575J289N105J7361L319
18587B53063q158j4277q241j4333r598j6519j144R369Q664K697J402j06j391P713
18573B09141R443J2154L964M792l351j7050j1709m336q149J966j1731j5080J1472
18560A81526J6029N969M949M600J5179J0236l562o195j5140n440j329o912j3007
18547A86903M154j618p31R029j460j2790m444l212R220J8066Q029k957l96M177
$$ plain form
18533 211970 214914 207689 194974 179572 165734 154335 146470 145484 149685 160851 155554 152088 171697
18520 171697 184184 181546 175387 182818 189619 178937 170094 165404 155489 141865 128125 129578 121959
18507 121959 115240 120106 128197 144996 165455 163284 155658 144528 137884 128201 110231 109457 127554
18494 127554 130097 138580 155656 166326 163375 151755 148234 139164 133727 126718 127012 124554 128298 135722
18480 135722 143452 144852 134496 122948 118132 111904 108675 106287 106980 117863 107121 109592 118874
18467 118874 137463 151400 160354 158511 169440 179186 171825 160202 152627 160184 169973 166847 161345
18454 161345 150764 148760 147238 148622 152117 145999 143488 139885 138287 132248 131522 133609 146599 159172
18440 159172 167857 174667 184848 185885 179943 181693 179046 170913 167937 169711 171890 162678 144178 132718
$$ packed form
18533B11970K944p225j2715j5402j3838j1399p865r86M201J1166n297l466J9609
18520A71697J2487k638o159P431O801j0682q843m690r915j3624j3740J453p619
18507A21959o719M866Q091J6799K0459k171p626j1130o644r683j7970p74J8097
18494A27554K543Q483J7076J0670k951j1620l521r070n437p009K94k458L744P424
18480A35722P730J400j0356j1548m816o228l229k388O93J0883j0742K471R282
18467A18874J8589J3937Q954j843J0929R746p361j1623p575P557R789l126n502
18454A61345j0581k004j522J384L495o118k511l603j598o039p26K087J2990J2573
18440A59172Q685O810J0181J037n942J750k647q133k976J774K179r212j8500j1460
$$ plain form
18426 132718 118635 121790 141202 147945 150348 142658 139926 146459 150844 154870 163163 175860 185839
18413 185839 212448 234853 243333 254292 263804 261709 256040 253417 250172 249200 247937 254493 247479 233131
18399 233131 228705 229868 223904 218382 217335 211635 202817 195619 192935 177076 168394 167552 161721 153498
18385 153498 153600 162696 164425 163567 175889 179483 181731 192207 189818 189050 182024 177942 175946 158899
18371 158899 154868 155830 155639 152535 142087 123590 111551 104026 104886 100416 86176 82819 90043 107737
18357 107737 115544 106014 105187 107660 98773 100417 115352 116645 107366 95746 86064 77466 60318 48505
18343 48505 54050 40053 24001 5878 -7727 -20793 -26253 -23705 -19260 -4968 21762 46238
18331 46238 53979 66500 76887 80562 93799 105510 109150 114433 113711 120802 119912 107405 108278 109645
$$ packed form
18426A32718j4083L155J9412O743K403p690k732O533M385M026Q293J2697R979
18413A85839K6609K2405Q480J0959R512k095n669k623l245r72j263O556p014j4348
18399B33131m426J163n964n522j047n700q818p198k684j5859q682q42n831q223
18385A53498J02R096J729q58J2322L594K248J0476k389p68p026m082j996j7047
18371A58899m031R62j91l104j0448j8497j2039p525Q60m470j4240l357P224J7694
18357A07737P807r530q27K473q887J644J4935J293r279j1620r682q598j7148j1813
18343D8505N545j3997j6052j8123j3605j3066n460K548M445J4292K6730K4476
18331D6238P741J2521J0387L675J3237J1711L640N283p22P091q90j2507Q73J367
$$ plain form
18317 109645 103357 94487 92750 86969 80894 84820 97146 122735 146083 174757 209626 239301 271110
18304 271110 311453 341927 364767 378664 403310 409991 405437 390639 382234 372366 364076 359783 357913
18291 357913 343526 340238 346237 354712 358631 369900 382245 394955 422347 463484 505370 529049
18279 529049 536521 533171 520859 494527 465643 447766 442622 444513 455987 473040 477638 492219
18267 492219 514318 518405 514643 526077 550747 561982 575563 598018 627974 654188 674907 712885
18255 712885 748823 785250 825419 849100 867744 899081 919361 933133 940491 942614 941095 938028
18243 938028 960831 1018306 1106295 1228967 1376510 1539393 1709897 1820115 1853094 1918232
18233 1918232 2037880 2157995 2256736 2275294 2190905 2097855 2062269 2057554 2070803 2085051 2127651
$$ packed form
18317A09645o288q870j737n781o075L926J2326K5589K3348K8674L4869K9675L1809
18304B71110M0343L0474K2840J3897K4646O681m554j4798q405r868q290m293j870
18291C57913j4387l288N999Q475L919J1269J2345J2710K7392M1137M1886K3679
18279E29049P472l350j2312k6332k8884j7877n144J891J1474J7053M598J4581
18267D92219K2099M087l762J1434K4670J1235J3581K2455K9956K6214K0719L7978
18255G12885L5938L6427M0169K3681J8644L1337K0280J3772P358K123j519l067
18243I38028K2803N7475Q7989J22672J47543J62883J70504J10218L2979O5138
18233A918232J19648J20115R8741J8558q4389r3050l5586m715J3249J4248M2600
$$ plain form
18222 2127651 2194383 2266633 2352498 2441375 2513837 2595322 2715818 2869809 3078695 3362735
18212 3362735 3709389 4111612 4554096 4975885 5324677 5560655 5729299 5942759 6316973
18203 6316973 6877656 7577989 8376644 9271677 10232870 11380348 12872371 14695578 16821328
18194 16821328 19209162 21672404 24806955 29734222 37175609 47298840 59720736 73611273
18186 73611273 87600023 99663762 108000996 112844464 115244781 112118319 103551604 96625816
18178 96625816 92976318 90353313 89013713 89370405 89878055 85686803 76940296 68883118
18170 68883118 63011608 58531548 55019898 52895141 52621923 54594051 59316413 67568559
18162 67568559 80622459 99941049 126273635 159350750 197577980 237265558 272574820
$$ packed form
18222B127651O6732P2250Q5865Q8877P2462Q1485J20496J53991K08886K84040
18212C362735L46654M02223M42484M21789L48792K35978J68644K13460L74214
18203F316973N60683P00333P98655Q95033R61193J147478J492023J823207K125750
18194A6821328K387834K463242L134551M927267P441387J0123231J2421896J3890537
18186G3611273J3988750J2063739Q337234M843468K400317l126462q566715o925788
18178I6625816l649498k623005j339600L56692N07650m191252q746507q057178
18170F8883118n871510m480060l511650k124757k73218J972128M722362Q252146
18162F7568559J3053900J9318590K6332586L3077115L8227230L9687578L5309262
$$ plain form
18155 272574820 296175380 304836601 298069953 271087192 230896299 195161628 166337341
18148 166337341 139144337 115862756 99145174 87767891 79919778 74400101 70233979
18141 70233979 66836453 64015009 61522564 59491491 58090319 57279128 56925172 56724107
18133 56724107 56564630 56224351 55101175 53163669 50506755 47476331 44867357 42963267
18125 42963267 41564868 40118323 38204940 36221770 34636606 33525634 32794892 32383246
18117 32383246 32350442 32846384 34158180 36657996 40665755 46236090 52696821 58199086
18109 58199086 61615252 61827725 56643119 49318899 44115830 41090860 39524866 38640030
18101 38640030 37559855 36103799 34558474 32835535 31274178 30105171 29393306 29429471
$$ packed form
18155B72574820K3600560Q661221o766648k6982761m0190893l5734671k8824287
18148A66337341k7193004k3281581j6717582j1377283p848113n519677m166122
18141G0233979l397526k821444k492445k031073j401172q11191l53956k01065
18133E6724107j59477l40279j123176j937506k656914l030424k608974j904090
18125D2963267j398399j446545j913383j983170j585164j110972p30742m11646
18117C2383246l2804M95942J311796K499816M007759N570335O460731N502265
18109E8199086L416166K12473n184606p324220n203069l024970j565994q84836
18101C8640030j080175j456056j545325j722939j561357j169007p11865L6165
$$ plain form
18093 29429471 30525051 32770914 35974149 39603511 42834999 44804768 44715881 42725119
18085 42725119 39861042 37073122 34876246 33093997 31376302 29910463 28914406 28093631
18077 28093631 27293531 26914588 26965381 26953699 26531366 25331388 23275165 21185692 19665596
18068 19665596 18744204 18292536 18282637 18749601 19688092 21004341 22570074 24184599 25636278
18059 25636278 26772636 27838902 29063654 29907475 29691236 28375080 26204127 23765835
18051 23765835 21402588 19267898 17682386 16743474 16327983 16224866 16246799 16196994 15840870
18042 15840870 15237290 14698453 14413133 14472599 14819562 15347063 15912504 16381603 16311636 15356635
18032 15356635 14183890 13371368 12954356 12832622 12863403 12961973 13068574 13095011 13057124 12904984
$$ packed form
18093B9429471J095580K245863L203235L629362L231488J969769q8887j990762
18085D2725119k864077k787920k196876j782249j717695j465839r96057q20775
18077B8093631q00100l78943N0793j1682m22333j199978k056223k089473j520096
18068A9665596r21392m51668r899M66964R38491J316249J565733J614525J451679
18059B5636278J136358J066266J224752Q43821k16239j316156k170953k438292
18051B3765835k363247k134690j585512r38912m15491j03117K1933m9805l56124
18042A5840870o03580n38837k85320N9466L46963N27501N65441M69099o9967r55001
18032A5356635j172745q12522m17012j21734L0781R8570J06601K6437l7887j52140
$$ plain form
18022 12904984 12621404 12413646 12258345 12025180 11636566 10895099 9884392 8972700 8310007
18013 8310007 7855932 7535414 7287948 7105023 6966084 6891784 6918978 7081290 7380799 7763466
18003 7763466 8124846 8330841 8313286 8011494 7522378 6974816 6437950 5970127 5572337 5258140
17993 5258140 5016423 4821753 4670066 4565056 4492125 4439354 4401349 4356756 4283654 4196729
17983 4196729 4073481 3920537 3779152 3636978 3499597 3381158 3285385 3195342 3110662 3035873
17973 3035873 2963961 2891356 2822067 2765927 2710124 2630578 2534484 2435830 2353650 2265286 2177796
17962 2177796 2105400 2053691 2006112 1951234 1907956 1869295 1830532 1789302 1750595 1716469 1676863
17951 1676863 1634167 1595602 1569582 1530992 1496804 1465384 1428925 1403335 1375388 1341267 1304614
$$ packed form
18022A2904984k83580k07758j55301k33165l88614p41467j010707r11692o62693
18013H310007m54075l20518k47466j82925j38939p4300K7194J62312K99509L82667
18003G763466L61380K05995j7555l01792m89116n47562n36866m67823l97790l14197
17993E258140k41717j94670j51687j05010p2931n2771l8005m4593p3102q6925
17983D196729j23248j52944j41385j42174j37381j18439r5773r0043q4680p4789
17973C035873p1912p2605o9289n6140n5803p9546r6094r8654q2180q8364q7490
17962B177796p2396n1709m7579n4878m3278l8661l8763m1230l8707l4126l9606
17951A676863m2696l8565k6020l8590l4188l1420l6459k5590k7947l4121l6653
$$ plain form
17940 1304614 1271532 1252448 1220139 1188615 1177603 1165458 1144635 1121558 1105913 1085924 1056839
17929 1056839 1036539 1026158 1018479 1004897 1010133 1004828 983902 957194 926923 908137 907197 904377
17917 904377 882912 854988 818180 796605 790311 778104 765397 755106 739862 738638 729677 706997
17905 706997 678188 665832 664205 658298 654011 649162 647412 634770 610975 592168 573732 561617
17893 561617 558484 552212 534642 522350 510507 513420 509757 502755 494779 488273 481577 480090 473379
17880 473379 462444 455888 454054 445220 426944 412516 401660 393516 386722 376165 369155 366956 363128
17867 363128 364369 373104 369124 357364 358838 360358 347363 338929 334914 319401 301094 283987 281432
17854 281432 272514 260818 240265 235938 231055 228845 223365 216948 205238 201129 202895 205136 208117
$$ packed form
17940A304614l3082j9084l2309l1524j1012j2145k0823k3077j5645j9989k9085
17929A056839k0300j0381p679j3582N236n305k0926k6708l0271j8786r40k820
17917I04377k1465k7924l6808k1575o294j2207j2707j0291j5244j224q961k2680
17905G06997k8809j2356j627n907m287m849j750j2642k3795j8807j8436j2115
17893E61617l133o272j7570j2292j1843K913l663p002p976o506o696j487o711
17880D73379j0935o556j834q834j8276j4428j0856q144o794j0557p010k199l828
17867C63128J241Q735l980j1760J474J520j2995q434m015j5513j8307j7107k555
17854B81432q918j1696k0553m327m883k210n480o417j1710m109J766K241K981
$$ plain form
17841 208117 214653 212580 221431 231576 226799 220702 207144 196673 195385 203125 207672 213506 207714
17828 207714 193484 188834 180877 174186 181262 182172 165602 159323 145836 136569 142033 135477 126528 125728
17814 125728 128293 128333 126219 127986 116502 118162 122232 114745 114649 117678 120364 128522 127494 132225 136866
17799 136866 136037 131352 123813 113272 112298 114944 118062 123000 125931 119563 101738 97660 89571 92069
17785 92069 102329 103339 102774 110224 110964 105337 109045 105715 101806 98145 101720 114182 109673 97027
17771 97027 90817 84479 90206 79875 77796 76806 77147 79767 83802 71815 67032 73189 74858 78398
17757 78398 80562 73021 74096 75843 74397 61231 55523 65964 79248 78095 81275 74964 67222 54427
17743 54427 44199 50526 55398 61184 64176 59043 68303 79918 76485 77532 85157 71262 64042 65173
$$ packed form
17841B08117O536k073Q851J0145m777o097j3558j0471j288P740M547N834n792
17828B07714j4230m650p957o691P076R10j6570o279j3487r267N464o556q949q00
17814A25728K565M0k114J767j1484J660M070p487r6L029K686Q158j028M731M641
17799A36866q29m685p539j0541r74K646L118M938K931o368j7825m078q089K498
17785I2069J0260J010n65P450P40n627L708l330l909l661L575J2462m509j2646
17771I7027o210o338N727j0331k079r90L41K620M035j1987m783O157J669L540
17757G8398K164p541J075J747j446j3166n708J0441J3284j153L180o311p742j2795
17743E4427j0228O327M872N786K992n133R260J1615l433J047P625j3895p220J131
$$ plain form
17729 65173 69255 68640 66194 77064 82620 85774 81518 76153 72700 80432 77390 66270 59559 68109
17715 68109 75544 96419 120302 130190 154385 189953 223504 247967 263575 280868 315351 347350
17703 347350 391282 431096 438178 434473 439474 435125 424133 431609 455893 481726 494765 496840 499984
17690 499984 507424 510707 494786 481361 473693 464559 465827 459442 431667 403858 387676 360269 329103
17677 329103 290109 270270 255556 250438 246252 244952 242498 245509 255636 270075 294692 343278
17665 343278 397235 446137 498447 529128 531757 537476 527261 517130 519231 528394 543246 573433
17653 573433 605914 628549 630540 611949 583558 563799 538726 511803 509767 517041 509495 506062
17641 506062 497434 484235 462837 452757 439381 437249 424418 402795 382674 375494 365746 353951
$$ packed form
17729F5173M082o15k446J0870N556L154m256n365l453P732l042j1120o711Q550
17715F8109P435K0875K3883R888K4195L5568L3551K4463J5608J7293L4483L1999
17703C47350M3932L9814P082l705N001m349j0992P476K4284K5833J3039K075L144
17690D99984P440L283j5921j3425p668r134J268o385k7775k7809j6182k7407l1166
17677C29103l8994j9839j4714n118m186j300k454L011J0127J4439K4617M8586
17665C43278N3957M8902N2310L0681K629N719j0215j0131K101R163J4852L0187
17653E73433L2481K2635J991j8591k8391j9759k5073k6923k036P274p546l433
17641E06062q628j3199k1398j0080j3376k132j2831k1623k0121p180r748j1795
$$ plain form
17629 353951 341068 344632 336423 309885 286165 263023 268077 260557 260899 272540 279672 289437 302785
17616 302785 310337 319470 322250 321344 310080 292558 272112 250411 234169 234714 240274 252111 260237
17603 260237 264289 278477 297115 298478 287468 264820 241659 232320 233002 238380 239663 248845 249606
17590 249606 246546 230760 215741 212768 208353 208694 205171 193606 195509 185905 169818 165770 164442
17577 164442 160287 152703 158370 155699 150086 147234 145672 143239 143737 150087 157243 165474 189652 202313
17563 202313 208100 216501 218066 214694 215670 217107 218925 210530 192398 175369 172533 171069 165022 151374
17549 151374 144201 137804 134387 131139 131743 129877 130691 132093 136798 143570 151838 165953 172089 151750
17535 151750 153773 155302 144437 132861 127113 133479 129988 130243 132803 127440 120208 121752 127192 129808
$$ packed form
17629C53951j2883L564q209k6538k3720k3142N054p520L42J1641P132R765J3348
17616C02785P552R133K780r06j1264j7522k0446k1701j6242N45N560J1837Q126
17603B60237M052J4188J8638J363j1010k2648k3161r339O82N378J283R182P61
17590B49606l060j5786j5019k973m415L41l523j1565J903r604j6087m048j328
17577A64442m155p584N667k671n613k852j562k433M98O350P156Q231K4178J2661
17563B02313N787Q401J565l372R76J437J818q395j8132j7029k836j464o047j3648
17549A51374p173o397l417l248O04j866Q14J402M705O772Q268J4115O136k0339
17535A51750K023J529j0865j1576n748O366l491K55K560n363p232J544N440K616
$$ plain form
17521 129808 119464 111367 97257 82997 76423 61748 59269 53104 51802 55782 63056 59370 58229
17508 58229 66125 75318 72398 72011 83472 87378 88929 84725 78252 70391 73417 72300 78333 82027
17494 82027 81105 73927 71965 64088 53196 44198 32828 33449 35465 42424 41598 54139 60552 59627 59929
17479 59929 48905 40482 36692 40816 37739 38494 41448 36847 41566 34321 36147 43869 44735 41677 47840
17464 47840 46624 34911 19502 30241 47927 49075 42684 32441 25863 22290 16360 20448 27999
17451 27999 33474 37345 31727 28832 24851 27560 37704 52382 63336 68370 78270 79335 62962
17438 62962 51427 34433 26271 22720 22810 26045 24094 20599 22962 34839 40785 36862 37712 34613
17424 34613 26690 20529 19924 27637 29613 32760 28653 28210 25044 9333 3381 13641 16640 25430
$$ packed form
17521A29808j0344q097j4110j4260o574j4675k479o165j302L980P274l686j141
17508E8229P896R193k920l87J1461L906J551m204o473p861L026j117O033L694
17494H2027r22p178j962p877j0892q998j1370O21K016O959q26J2541O413r25L02
17479E9929j1024q423l790M124l077P55K954m601M719p245J826P722Q66l058O163
17464D7840j216j1713j5409J0739J7686J148o391j0243o578l573n930M088P551
17451B7999N475L871n618k895l981K709J0144J4678J0954N034R900J065j6373
17438F2962j1535j6994q162l551R0L235j951l495K363J1877N946l923Q50l099
17424C4613p923o161o05P713J976L147m107m43l166j5711n952J0260K999Q790
$$ plain form
17410 25430 19561 6702 11139 15135 17571 18298 16946 22348 29252 28800 18226 26762 29772 25163
17396 25163 17029 13043 22608 22377 20508 20949 23453 29996 23954 20904 24144 20198 25774 28678 25955
17381 25955 24681 22446 14549 13484 15787 7458 8393 15941 23941 24020 21428 17721 23225 29328 31657
17366 31657 29968 18255 11382 8318 5522 10072 18398 21648 20540 21231 11072 5576 10546 6319
17352 6319 6757 9260 7451 12566 24266 18181 10317 16419 18530 20321 19082 18911 17007 15459 8319
17337 8319 16684 16591 12804 11456 12836 2181 -12214 -11360 -1567 10689 12243 11420 17238 9980 5559
17322 5559 9737 24859 20033 15435 13517 5901 4484 14338 8298 -256 4375 19820 21935 28240
17308 28240 29107 25165 23762 18551 13356 13877 11002 16454 19871 17546 20842 22989 18899 16949 21941
$$ packed form
17410B5430n869j2859M437L996K436P27j352N402O904m52j0574Q536L010m609
17396B5163q134l986R565k31j869M41K504O543o042l050L240l946N576K904k723
17381B5955j274k235p897j065K303q329R35P548Q000P9k592l707N504O103K329
17366C1657j689j1713o873l064k796M550Q326L250j108O91j0159n496M970m227
17352F319M38K503j809N115J1700o085p864O102K111J791j239j71j904j548p140
17337H319Q365r3l787j348J380j0655j4395Q54R793J2256J554q23N818p258m421
17322E559M178J5122m826m598j918p616j417R854o040q554M631J5445K115O305
17308B8240Q67l942j403n211n195N21k875N452L417k325L296K147m090j950M992
$$ plain form
17293 21941 22054 17166 11773 8625 8775 15229 14172 7863 6983 5037 2470 109 -7552 -644 13301
17278 13301 19137 25350 30691 29830 32440 31380 23344 14580 5945 -332 -6190 206 4530 287 -10839
17263 -10839 -6969 -8070 -1142 8431 13049 5737 14449 6577 -6098 -8372 -6827 -7023 -11797 -9576
17249 -9576 -13134 802 16458 25350 18754 24864 26699 17586 2552 1676 3527 -448 12882 13568
17235 13568 14957 17080 24076 24029 17797 6928 4875 7607 7501 160 7701 2835 -1206 -2899 2471
17220 2471 10574 14616 18477 15210 13504 16911 20353 16399 11281 7431 6308 15013 23421 18484 13867
17205 13867 8459 7077 18845 16186 10809 9601 14205 22461 19099 18994 16285 10109 6014 10676
17191 10676 21986 22127 14981 8676 -519 3120 7581 5163 -665 4626 8122 17881 23397 17875
$$ packed form
17293B1941J13m888n393l148J50O454j057o309q80j946k567k361p661O908J3945
17278A3301N836O213N341q61K610j060q036q764q635o277n858O396M324m243j1126
17263a0839L870j101O928R573M618p312Q712p872j2675k274J545j96m774K221
17249i576l558J3936J5656Q892o596O110J835r113j5034q76J851l975J3330O86
17235A3568J389K123O996m7o232j0869k053K732j06p341P541m866m041j693N370
17220B471Q103M042L861l267j706L407L442l954n118l850j123Q705Q408m937m617
17205A3867n408j382J1768k659n377j208M604Q256l362j05k709o176m095M662
17191A0676J1310J41p146o305r195L639M461k418n828N291L496R759N516n522
$$ plain form
17177 17875 18379 11991 1131 -4125 5477 5821 460 8112 9174 6083 -1492 6497 9886 1621 -3407
17162 -3407 3940 11728 12757 14842 16092 24405 29014 23597 12939 15684 12644 15871 25601 30737
17148 30737 29744 24766 17483 12584 13013 4771 6613 5165 289 -1488 3101 679 456 14286 19341
17133 19341 5611 8548 15848 15938 17311 20575 15781 17717 19852 18806 12901 12347 26396 28394 18574
17118 18574 16430 14310 15893 7138 -1601 -1625 453 3533 228 -3180 -2594 712 1442 -1110 -3202
17103 -3202 -439 8921 9483 13175 17868 22422 13374 15280 16090 15288 -2951 -9517 -3619 1639 9377
17088 9377 11053 8521 830 -1309 1892 3526 -3113 4193 10133 14945 23029 23812 14915 18684 17949
17073 17949 7953 -167 -508 3022 4394 9834 15185 19612 10524 5547 7003 7039 6952 11435 10536 2951
$$ packed form
17177A7875N04o388j0860n256R602L44n361P652J062l091p575P989L389q265n028
17162c407P347P788J029K085J250Q313M609n417j0658K745l040L227R730N136
17148C0737r93m978p283m899M29q242J842j448m876j777M589k422k23J3830N055
17133A9341j3730K937P300R0J373L264m794J936K135j046n905n54J4049J998r820
17118A8574k144k120J583q755q739k4K078L080l305l408N86L306P30k552k092
17103c202K763R360N62L692M693M554r048J906Q10q02j8239o566N898N258P738
17088I377J676k532p691k139L201J634o639P306N940M812Q084P83q897L769p35
17073A7949r996q120l41L530J372N440N351M427r088m977J456L6q7M483q99p585
$$ plain form
17057 2951 -6319 -7847 -16771 -24834 -16044 -9038 -13408 -6012 3627 2678 -5063 6 -3729 -7141 -6398
17042 -6398 -966 3578 14848 6939 2419 6354 7758 10724 13088 8274 1559 4 4075 15415
17028 15415 17500 15209 7418 6276 5897 10960 9939 4615 28 2381 5459 6207 2487 7902 6517
17013 6517 4937 554 5069 3078 -3241 -6454 -8722 -17339 -13567 -11144 -339 2927 1661 2475 5154
16998 5154 7093 1225 -712 -8749 1077 13120 17923 19626 20367 17758 9179 4954 3402 6924 777
16983 777 5859 2350 5067 8549 5158 4377 10393 10016 4989 132 3653 10280 14179 4961 4166 5333
16967 5333 3729 -2346 -16931 -22194 -21336 -15316 -4322 6806 511 -4081 -3104 -3791 1410 4114 822
16952 822 6118 14423 13057 9841 11389 22526 24271 20272 12178 8787 6660 9011 9433 4890 8003
$$ packed form
17057B951r270j528q924q063Q790P006m370P396R639r49p741N069l735l412P43
17042f398N432M544J1270p909m520L935J404K966K364m814o715j555M071J1340
17028A5415K085k291p791j142l79N063j021n324m587K353L078P48l720N415j385
17013F517j580m383M515j991o319l213k268q617L772K423J0805L266j266Q14K679
16998E154J939n868j937q037R826J2043M803J703P41k609q579m225j552L522o147
16983G77N082l509K717L482l391p81O016l77n027m857L521O627L899r218p95J167
16967E333j604o075j4585n263Q58O020J0994J1128o295m592R77o87N201K704l292
16952H22N296Q305j366l216J548J1137J745l999q094l391k127K351M22m543L113
$$ plain form
16937 8003 1318 -3908 -2668 -6836 -7974 1588 4891 9213 7947 -8602 -12317 -11162 -6269 -11904
16923 -11904 -12946 -7109 3197 8653 633 -2534 896 5300 5483 8551 12254 10302 4297 -1007
16909 -1007 210 6878 10494 19697 26654 24341 23025 22494 25859 26680 29379 21899 634 -1851 215
16894 215 7628 24424 35895 37267 36023 38475 29394 29986 27566 20501 2135 -10043 -8290 -1956
16880 -1956 -2811 -2699 3904 7816 14143 24075 29066 38273 40418 40217 34370 31274 22219 10253 14812
16865 14812 31359 37776 32194 28855 19783 11397 5229 6141 992 -1524 -936 -10179 -7044 -652 -2906
16850 -2906 -9420 -17083 -21184 -15500 -13519 -13001 -16182 -13832 -12273 -11951 -20576 -17846 -18709 -13991 -18124
16835 -18124 -24039 -30008 -23466 -15644 -7170 2457 10923 11014 9471 9246 8355 10984 14442 23223 23579 11717
$$ packed form
16937H003o685n226J240m168j138R562L303M322j266j6549l715J155M893n635
16923a1904j042N837J0306N456q020l167L430M404J83L068L703j952o005n304
16909a007J217O668L616R203O957k313j316n31L365Q21K699p480k1265k485K066
16894B15P413J6796J1471J372j244K452r081N92k420p065j8366j2178J753O334
16880a956q55J12O603L912O327R932M991R207K145k01n847l096r055j1966M559
16865A4812J6547O417n582l339r072q386o168R12n149k516N88r243L135O392k254
16850b906o514p663m101N684J981N18l181K350J559L22q625K730q63M718m133
16835a8124n915n969O542P822Q474R627Q466R1j543k25q91K629L458Q781L56j1862
$$ plain form
16819 11717 17630 22898 19811 14242 22332 21903 12628 16402 18921 16729 20287 19393 9896 19965 27054
16804 27054 21031 14172 10577 6578 -5571 -14334 -15464 -16469 -20210 -18177 -3716 -3960 -8334 -10152
16790 -10152 -7507 -9490 -3008 4534 7183 4705 -5307 -13660 -14481 -20476 -14682 -9604 -8762 3338
16776 3338 11456 9942 14151 16068 11715 8170 -1715 708 2337 -4408 -6160 3051 -2239 -6537 -4311
16761 -4311 -73 1920 7005 9797 10732 12654 8210 1627 3721 7235 10124 16472 15840 18960 6931
16746 6931 8044 21186 19385 15861 10036 6310 5821 -7374 -11489 -14580 -10692 -10719 -2906 2298 2207
16731 2207 3797 17028 18381 11907 11608 5910 -1090 2557 3348 -6042 -5749 -3463 496 -1874 -2200
16716 -2200 1104 1542 6233 3644 3350 -2374 -658 5339 7420 1520 -7384 -5758 8313 17590 9009
$$ packed form
16819A1717N913N268l087n569Q090m29r275L774K519k192L558q94r497J0069P089
16804B7054o023o859l595l999j2149q763j130j005l741K033J4461k44m374j818
16790a0152K645j983O482P542K649k478j0012q353q21n995N794N078Q42J2100
16776C338Q118j514M209J917m353l545r885K423J629o745j752R211n290m298K226
16761d311M238J993N085K792R35J922m444o583K094L514K889O348o32L120j2029
16746F931J113J3142j801l524n825l726m89j3195m115l091L888k7P813N204r1
16731B207J590J3231J353o474k99n698p000L647P91r390K93K286L959k370l26
16716b200L304M38M691k589k94n724J716N997K081n900q904J626J4071R277q581
$$ plain form
16701 9009 1699 9770 6760 -767 2639 6340 122 -9581 -15584 -13463 -4263 4268 6517 9173 9850
16686 9850 8217 6177 15335 12461 3272 -7563 -6788 2980 9653 13940 11471 3735 62 -7875 -2033
16671 -2033 5870 8663 14482 18782 17354 10958 1105 -3826 -3449 -13217 -17261 -8855 7207 7889 10527
16656 10527 4638 -1725 -6787 -10239 -3231 -3314 1479 -5241 -3978 735 11875 13250 15229 24014 11269
16641 11269 -9227 -17179 -12709 -13131 -16892 -14505 -10727 -12017 -12528 -2127 4393 -4372 -7963 -4380
16627 -4380 526 6074 -751 -2386 -3710 -10507 -6099 3634 -1406 3349 4464 5909 3777 -1813 -5030
16612 -5030 -4721 -5333 -2265 -827 4775 8890 5714 224 -6997 -16293 -25098 -27444 -14970 -1023 7450
16597 7450 -2727 -15378 -17500 -13492 -9504 -1103 1268 6249 -182 -8012 -6026 5114 11855 15869
$$ packed form
16701I009p310Q071l010p527L406L701o218r703o003K121R200Q531K249K656O77
16686I850j633k040R158k874r189j0835P75R768O673M287k469p736l673p937N842
16671b033P903K793N819M300j428o396r853m931L77r768m044Q406J6062O82K638
16656A0527n889o363n062l452P008q3M793o720J263M713J1140J375J979Q785j2745
16641A1269k0496p952M470m22l761K387L778j290n11J0401O520q765l591L583
16627d380M906N548o825j635j324o797M408R733n040M755J115J445k132n590l217
16612e030L09o12L068J438N602M115l176n490p221r296q805k346J2474J3947Q473
16597G450j0177j2651k122M008L988Q401K371M981o431p830J986J1140O741M014
$$ plain form
16583 15869 23364 21912 12728 -1535 -7445 -3038 7215 12089 10046 17928 19244 20627 27112 27902
16569 27902 21647 23505 16593 15450 12249 15394 13926 1905 -12742 -8648 2321 6178 10619 13232
16555 13232 9640 11181 7272 7690 7837 9677 10585 9864 6839 3217 -7192 -15451 -18504 -18744 -13332
16540 -13332 -7516 -735 8189 13747 10990 2811 -6380 -16274 -17519 -20414 -15345 -7589 -8190 -10745 1217
16525 1217 5084 756 -1238 1528 1508 2668 7958 11528 9641 11016 2817 -1658 -390 995 8814
16510 8814 4139 -2884 -5300 -6296 -7639 -1229 7313 13315 14887 -3843 -15332 -17332 -5156 6347
16496 6347 2051 -183 242 12607 3123 -6382 -9171 -3792 -6093 -6693 -8275 -7647 -17181 -33098 -22398
16481 -22398 -16006 447 7660 -1362 -9627 -11483 -4156 -8330 -7595 -1828 2498 -7192 -17960 -12966
$$ packed form
16583A5869P495j452r184j4263n910M407J0253M874k043P882J316J383O485P90
16569B7902o255J858o912j143l201L145j468j2021j4647M094J0969L857M441K613
16555A3232l592J541l909M18J47J840R08p21l025l622j0409q259l053k40N412
16540a3332N816O781Q924N558k757q179r191r894j245k895N069P756o01k555J1962
16525A217L867m328j994K766k0J160N290L570j887J375q199m475J268J385P819
16510H814m675p023k416r96j343O410Q542O002J572j8730j1489k000J2176J1503
16496F347m296k234M25J2365r484r505k789N379k301o00j582O28r534j5917J0700
16481b2398O392J6453P213r022q265j856P327m174P35N767M326r690j0768M994
$$ plain form
16467 -12966 -163 -1031 -6228 -11699 -8005 -5938 -6896 -191 -7569 -9446 -4237 -4159 -9310 -7313 6589
16452 6589 17639 13706 10362 9327 7723 8266 -412 -5271 1130 10343 8808 15474 22237 16897 10757
16437 10757 3879 1595 -1855 -2352 12394 22006 29314 25308 16361 19527 11894 6989 -869 -4144
16423 -4144 -3553 2762 8307 2653 1051 1132 -3974 -9052 -17794 -18083 -11848 -2723 -7377 -12235 -7927 -2419
16407 -2419 6331 15271 6653 -2882 -6800 -3224 3830 5524 209 1102 7382 12638 12699 3848 -3037
16392 -3037 992 5269 7524 19098 15249 7784 258 -8430 -3055 4700 5253 6561 6697 8101 5991
16377 5991 2708 6769 12187 9397 -4734 -5972 -502 -2817 -8223 -6038 -1409 -2425 -2035 -3166 -4408
16362 -4408 -1287 760 -172 920 -780 3420 5241 -7533 -12020 -8756 -1956 -2108 -6236 -9937 -9172
$$ packed form
16467a2966J2803q68n197n471L694K067r58O705p378j877N209P8n151J997J3902
16452F589J1050l933l344j035j604N43q678m859O401R213j535O666O763n340o140
16437A0757o878k284l450m97J4746R612P308m006q947L166p633m905p858l275
16423d144N91O315N545n654j602Q1n106n078q742k89O235R125m654m858M308N508
16407b419Q750Q940q618r535l918L576P054J694n315Q93O280N256O1q851o885
16392c037M029M277K255J1574l849p465p526q688N375P755N53J308J36J404k110
16377E991l283M061N418k790j4131j238N470k315n406K185M629j016L90j131j242
16362d408L121K047r32J092j700M200J821j2774m487L264O800j52m128l701P65
$$ plain form
16347 -9172 -6106 -5433 -5253 266 -2041 -9394 -7868 -14367 -8693 -4206 -5529 -5963 -10946 -12354 -10538
16332 -10538 -10107 1009 2923 -188 2771 5643 6145 4028 5450 6679 6663 1058 900 5565 12669
16317 12669 9974 8739 4525 3068 -794 -4726 -3451 -5684 -9228 -4848 -12548 -19176 -10105 -7915
16303 -7915 -7686 -10527 -19414 -25403 -30455 -28242 -19596 -16819 -16717 -11357 -7124 -3520 5975 6628 -1382
16288 -1382 -9266 -11493 -8554 -8542 -7711 -2784 -9798 -17717 -18247 -20117 -23319 -16706 -17355 -12604 -5 7390
16272 7390 10276 9325 10415 9728 6231 -1175 -10252 -14986 -17883 -14453 -10225 -5959 -2619 1908 -193
16257 -193 -9794 -7473 4324 -4261 -10254 -7774 -7520 -17741 -18424 -15356 -7132 8332 21835 15410
16243 15410 20407 23048 19667 9595 7891 -1524 -14084 -8129 6679 10270 8786 6996 7601 14499
$$ packed form
16347i172L066O73J80N519k307p353J526o499N674M487j323m34m983j408J816
16332a0538M31J1116J914l111K959K872N02k117J422J229j6n605j58M665P104
16317A2669k695j235m214j457l862l932J275k233l544M380p700o628R071K190
16303g915K29k841q887n989n052K213Q646K777J02N360M233L604R495O53q010
16288a382p884k227K939J2Q31M927p014p919n30j870l202O613o49M751J2599P395
16272G390K886r51J090o87l497p406r077m734k897L430M228M266L340M527k101
16257a93r601K321J1797q585n993K480K54j0221o83L068Q224J5464J3503o425
16243A5410M997K641l381j0072j704r415j2560N955J4808L591j484j790O05O898
$$ plain form
16229 14499 13816 5890 2976 3545 1353 9471 10872 12677 11018 5130 6491 9506 8115 4455 9904
16214 9904 17166 22802 18582 17415 18411 1216 -11373 -16954 -10134 -2565 -1070 -1673 -669 2129 -5356
16199 -5356 -11440 -6440 -10672 -6872 2240 3061 -1540 4337 5348 7271 3706 8331 1803 -7577 -3944
16184 -3944 3098 6298 6695 16283 21513 16676 1408 -6140 -9198 -10099 -10588 -8926 -10659 -1824 790
16169 790 1473 2024 -4559 -11789 -13948 -11783 -13845 -16513 -12250 -12383 -13894 -6189 -5383 -12203 -12545 -3616
16153 -3616 -3137 -11882 -15524 -12562 -1283 1562 -5311 -357 2285 -2604 -5582 -4881 -9990 -16142 -2098
16138 -2098 -5921 -11017 -10390 7010 9797 892 -9225 -14250 -626 9995 5579 -4389 -3317 -824
16124 -824 5999 5970 -330 -4523 896 -3712 331 4057 -32 -4303 -1477 3774 12877 19453 17906
$$ packed form
16229A4499o83p926k914N69k192Q118J401J805j659n888J361L015j391l660N449
16214I904P262N636m220j167R96j7195j2589n581O820P569J495o03J004K798p485
16199e356o084N000m232L800R112Q21m601N877J011J923l565M625o528r380L633
16184c944P042L200L97R588N230m837j5268p548l058r01m89J662j733Q835K614
16169G90O83N51o583p230k159K165k062k668M263j33j511P705Q06o820l42Q929
16153c616M79q745l642K962J1279K845o873M954K642m889k978P01n109o152J4044
16138b098l823n096O27J7400K787q905j0117n025J3624J0621m416r968J072K493
16124h24O823k9o300m193N419m608M043L726m089m271K826N251R103O576j547
$$ plain form
16109 17906 16052 14203 5010 5722 12939 13176 14653 10140 -6498 -7964 -4039 -3478 -5877 -5307 -3612
16094 -3612 -8025 -25479 -23648 -15536 -17983 -15204 -11203 -5006 -1006 -1870 3497 10460 8292 -1609 -9857
16079 -9857 -12902 -15603 -10381 -12403 -18028 -11172 -7745 -2095 829 5441 4964 14348 14883 14123 15534
16064 15534 11472 2708 3639 909 808 -2913 139 1968 5043 10433 15248 11168 8337 3139 -2253
16049 -2253 1018 11922 18322 15041 5711 4433 -1007 1426 255 1011 -12701 -6828 -441 -289 6218
16034 6218 -2023 2002 12573 16197 15531 3783 -1891 -651 7374 10931 7989 10094 12639 11614
16020 11614 6736 5076 -877 -3390 -791 2397 -5388 -2584 277 -1883 -10778 -5356 -1541 -7817
16006 -7817 -13155 -16219 -6558 11353 17598 6470 -5789 -7171 -2053 783 10707 1267 -10197 -5258
$$ packed form
16109A7906j854j849r193P12P217K37J477m513j6638j466L925N61k399N70J695
16094c612m413j7454J831Q112k447K779M001O197M000q64N367O963k168r901q248
16079i857l045k701N222k022n625O856L427N650K924M612m77R384N35p60J411
16064A5534m062q764R31k730j01l721L052J829L075N390M815m080k831n198n392
16049b253L271J0904O400l281r330j278n440K433j171P56j3712N873O387J52O507
16034F218q241M025J0571L624o66j1748n674J240Q025L557k942K105K545j025
16020A1614m878j660n953k513K599L188p785K804K861k160q895N422L815o276
16006g817n338l064R661J7911O245j1128j2259j382N118K836R924r440j1464M939
$$ plain form
15992 -5258 -3940 -7800 -8507 -7805 -3839 -1993 -1739 1721 5705 1195 -7647 -7233 -7360 -12256 -2704 -2712 -13706
15975 -13706 -8065 -13331 -17195 -8951 -4219 -15686 -13973 -13595 -17980 -18884 -19966 -16209 -7870 -3693 3746
15960 3746 7702 6774 -3081 -282 -3878 -6377 -8563 -11184 -9841 -9880 -12495 -16707 -19881 -19935 -13459 -6888
15944 -6888 -11484 -1955 7538 5541 -2319 -6988 -6219 -8477 -19073 -23694 -20981 -23251 -10129 -3128
15930 -3128 -2158 -4274 -3775 -1962 5476 11588 9827 6256 3998 2160 9985 11435 2444 623 -448
15915 -448 -2665 -8605 -16031 -12678 -11056 818 12203 -1986 -9676 -3618 -6860 -7408 -4056 -7101
15901 -7101 -15195 -12660 -6242 7824 7209 8914 7997 1487 -1851 3003 596 1926 1552 750 5712
15886 5712 6394 -4560 -18774 -21065 -22794 -25609 -24875 -23485 -7706 -3599 997 142 1791 1825 -1863
$$ packed form
15992e258J318l860p07P02L966J846K54L460L984m510q842M14j27m896R552qj0994
15975a3706N641n266l864Q244M732j1467J713L78m385r04j082L757Q339M177P439
15960C746L956r28r855K799l596k499k186k621J343l9k615m212l174n4O476O571
15944f888m596R529R493j997p860m669P69k258j0596m621K713k270J3122P001
15930c128R70k116M99J813P438O112j761l571k258j838P825J450q991j821j071
15915d48k217n940p426L353J622J1874J1385j4189p690O058l242n48L352l045
15901g101q094K535O418J4066o15J705r17o510l338M854k407J330l74q02M962
15886E712O82j0954j4214k291j729k815P34J390J5779M107M596q55J649L4l688
$$ plain form
15871 -1863 7043 -1205 -9926 -14006 -17479 -20130 -11094 -7336 -3767 -3391 -10233 -12278 573 670 -5222
15856 -5222 -10873 -14718 -12814 -6055 -4837 -2733 109 -6603 1215 8445 14046 7853 -3724 -5122
15842 -5122 -1514 -4901 -7799 -4126 7886 5118 -4391 -2524 -4835 -6607 -13406 -9407 -7270 -5138
15828 -5138 1268 8691 12747 5393 75 3192 -5913 -5858 2102 6028 3231 3118 1885 9396 15795
15813 15795 5972 -4472 -11548 -12037 -13399 -19578 -17128 -12500 -2598 -2346 -10260 -15878 -3893 3708
15799 3708 -980 -5928 -1537 4830 3964 3183 5181 4480 2758 6533 3913 374 240 -2578 6774 12352
15783 12352 16462 10501 -3138 -14976 -17884 -6001 3327 5458 7656 -782 -4794 -1978 161 2370
15769 2370 2230 -1113 -3811 4147 3144 -810 -8820 -12287 -12136 -26414 -19511 -11452 -10666 -9950 -6605
$$ packed form
15871a863Q906q248q721m080l473k651R036L758L569L76o842k045J2851R7n892
15856e222n651l845J904O759J218K104K842o712P818P230N601o193j1577j398
15842e122L608l387k898L673J2012k768r509J867k311j772o799L999K137K132
15828e138O406P423M056p354n318L117r105N5P960L926k797j13j233P511O399
15813A5795r823j0444p076m89j362o179K450M628R902K52p914n618J1985P601
15799C708m688m948M391O367q66p81J998p01j722L775k620l539j34k818R352N578
15783A2352M110n961j3639j1838k908J1883R328K131K198q438m012K816K139K209
15769B370j40l343k698P958j003l954q010l467J51j4278O903Q059P86P16L345
$$ plain form
15754 -6605 -5294 -4738 5516 7504 3351 -1558 -7768 -8002 -12188 -20230 -19389 -4929 -4601 -5468 -3449
15739 -3449 -2463 -6891 -1656 2451 1079 3980 1313 -10548 -9504 -2515 1787 12564 8892 2050
15725 2050 -2619 -8756 -3738 -6853 -15489 -7056 -50 -5688 -12731 -15334 -15394 -13016 -6638 -13764 -26079
15710 -26079 -24507 -11124 3010 6013 -4447 -12404 -15526 -16505 -6690 -7211 -10880 -4437 564 -13802
15696 -13802 -14832 -11069 -13649 -12500 -4103 -3559 2281 5993 706 -987 4865 394 -8575 -6907 4327
15681 4327 8234 11438 12603 5400 -3376 -108 13524 11987 14825 17220 22409 15682 5193 4102
15667 4102 10812 12174 3589 -5608 -1998 585 3908 -7453 -12516 -5690 -584 -5260 -8026 -16325
15653 -16325 -33444 -34850 -27885 -23013 -24910 -7976 1333 -5395 -11604 -10713 -8483 -948 4168 2587
$$ packed form
15754f605J311N56J0254J988m153m909o210k34m186q042Q41J4460L28q67K019
15739c449R86m428N235M107j372K901k667j1861J044O989M302J0777l672o842
15725B050m669o137N018l115q636Q433P006n638p043k603o0K378O378p126j2315
15710b6079J572J3383J4134L003j0460p957l122r79R815n21l669O443N001j4366
15696a3802j030L763k580J149Q397N44N840L712n287j693N852m471q969J668J1234
15681D327L907L204J165p203q776L268J3632j537K838K395N189o727j0489j091
15667D102O710J362q585r197L610K583L323j1361n063O826N106m676k766q299
15653a6325j7119j406O965M872j897J6934R309o728o209Q91K230P535N116j581
$$ plain form
15639 2587 -2478 3470 9949 2072 -351 -79 6646 -4026 -13451 -12449 -12533 -14954 -19336 -26251 -14654
15624 -14654 -10733 -7189 -13875 -24460 -12548 -9205 -13111 -14766 -7942 -9260 -10296 -14938 -16311 -6626
15610 -6626 12472 17495 18729 26460 12930 716 -5747 -6857 -484 -431 -10071 5184 14796 11278
15596 11278 2795 -2941 1224 16263 18690 14289 10208 12785 10445 12969 13524 9589 4176 5522
15582 5522 2809 6646 12372 10798 5778 -1961 -9580 -12582 -10697 -14848 -5429 -2956 -15379 -20472
15568 -20472 -18374 -16232 -14992 -7860 -13214 -14077 -13071 -12375 -9893 -15572 -6800 4878 -4133 -8495 -9398
15553 -9398 -7350 -3336 676 8035 15308 11451 2904 -9048 -9488 -15164 -17892 -20544 -17295 -12714 -11595
15538 -11595 -7830 -4571 -3424 237 -1288 -12910 -12108 -12425 -15722 -11779 -8975 6077 2359 -7237
$$ packed form
15639B587n065N948O479p877k423K72O725j0672r425J002q4k421m382o915J1597
15624a4654L921L544o686j0585J1912L343l906j655O824j318j036m642j373R685
15610f626J9098N023J234P731j3530j2214o463j110O373N3r640J5255R612l518
15596A1278q483n736M165J5039K427m401m081K577k340K524N55l935n413J346
15582E522k713L837N726j574n020p739p619l002J885m151R419K473j2423n093
15568b0472K098K142J240P132n354q63J006O96K482n679Q772J1678r011m362r03
15553i398K048M014M012P359P273l857q547j1952m40n676k728k652L249M581J119
15538a1595L765L259J147L661j525j1622Q02l17l297L943K804J5052l718r596
$$ plain form
15524 -7237 -5279 -4831 -5780 -5099 -4970 -13228 -7040 -12733 -15518 -3150 -3441 -14554 -7071 -5121 -13144
15509 -13144 -14036 220 1667 780 3772 -11786 -25543 -33957 -27127 -10949 -1965 -3989 3533 1057
15495 1057 -3462 -10070 -16609 -12804 -13045 -10214 -6136 -8702 -12391 -16292 -15654 -6126 -6081 -1567 -316 -5732
15479 -5732 275 296 -2854 -442 -5514 -13519 -17637 -10640 136 6378 5737 -1232 -7876 -3957 -10023
15464 -10023 -11949 -8614 -7584 -4054 -3820 3199 526 -1537 1625 154 -1740 5209 7400 4526 -1142
15449 -1142 -11975 -15963 -23476 -26500 -19022 -15069 -6290 -5591 -9972 -12544 -14933 -7484 10106 11287
15435 11287 12044 10292 8781 9519 -3036 -3288 -1953 -11395 -13495 -9781 -1282 5045 -6724 -10218 -916
15420 -916 4255 -72 3568 1498 -3784 -6763 -12534 -9334 -12989 10 2722 -890 -3791 -9943 -3896
$$ packed form
15524g237J958M48r49O81J29q258O188n693k785J2368k91j1113P483J950q023
15509a3144q92J4256J447q87K992j5558j3757q414O830J6178Q984k024P522k476
15495A057m519o608o539L805k41K831M078k566l689l901O38R528M5M514J251n416
15479e732O007K1l150K412n072q005m118O997J0776O242o41o969o644L919o066
15464a0023j926L335J030L530K34P019k673k063L162j471j894O949K191k874n668
15449a142j0833l988p513l024P478L953Q779O99m381k572k389P449J7590J181
15435A1287P57j752j511P38j2555k52J335r442k100L714Q499O327j1769l494R302
15420i16N171m327L640k070n282k979n771L200l655J2999K712l612k901o152O047
$$ plain form
15405 -3896 -2362 -960 -59 -7251 -16891 -19543 -20494 -14086 -6129 -11527 -10431 345 6382 1306 -6634
15390 -6634 -17018 -21492 -22149 -11784 5543 10003 8955 13558 17045 10374 -275 -7083 952 11315
15376 11315 9832 5610 9273 5575 873 3499 4817 147 -2324 -3259 -2116 -77 -3991 -3758 -3716
15361 -3716 598 5863 9915 447 -2135 638 2051 -11756 -9898 -6882 -9502 -18779 -22724 -14046
15347 -14046 -8245 -7917 -11006 -13774 -23362 -23220 -11454 -6502 -3445 -3209 1389 6104 2886 -9973 -7109
15332 -7109 -9022 -5603 5959 3339 -5641 -5238 -5714 -7863 -5615 -2016 2587 473 -3577 -2343 7514
15317 7514 5647 -1813 -3920 7823 1728 -1660 -4049 -11351 -9755 -5222 -7338 -2831 -9631 -10381 -10579
15302 -10579 -4160 2247 -2293 -3964 -4695 -11223 -2326 -8265 -7586 -5283 -2112 1652 -7421 -13617 -13383
$$ packed form
15405c896J534J402R01p192r640k652r51O408P957n398J096J0776O037n076p940
15390f634j0384m474o57J0365J7327M460j048M603L487o671j0649o808Q035J0363
15376A1315j483m222L663l698m702K626J318m670k471r35J143K039l914K33M2
15361c716M314N265M052r468k582K773J413j3807J858L016k620r277l945Q678
15347a4046N801L28l089k768r588J42J1766M952L057K36M598M715l218j2859K864
15332g109j913L419J1562k620q980M03m76k149K248L599M603k114m050J234R857
15317G514j867p460k107J1743o095l388k389p302J596M533k116M507o800p50j98
15302a0579O419O407m540j671p31o528Q897n939O79K303L171L764r073o196K34
$$ plain form
15287 -13383 -20085 -14681 -16592 -20878 -17646 -20376 -20549 -12297 -15698 -15013 -15852 -27905 -36255 -35472 -26526
15272 -26526 -14743 -16726 -23227 -16114 -12054 -8361 -10845 -2986 5803 19279 14902 762 -1084 -4693
15258 -4693 -15183 -19168 -12618 -22310 -26411 -19223 -16676 -5795 -3657 -9506 -10177 -4903 -6421 -14862
15244 -14862 -25592 -29844 -32422 -31528 -22840 -15649 -14376 -13170 -17153 -21035 -23840 -16147 -9979 -5726
15230 -5726 -1856 -7018 -7478 -1615 -1070 5507 8887 6953 9849 13697 9540 232 -7402 -8326 -7942 -8972
15214 -8972 -20032 -16112 -19407 -18106 -12597 -3959 -1438 4296 8233 5331 2682 -1062 -2816 -7852
15200 -7852 -2016 6845 4221 -3755 -10304 -5374 2631 1544 -560 -3558 903 3389 -4468 -5418 -1022
15185 -1022 1164 403 13123 11371 6867 6787 8403 11166 4871 -1120 -3918 -5161 1107 1373 -5047
$$ packed form
15287a3383o702N404j911m286L232k730j73Q252l401O85q39j2053q350P83Q946
15272b6526J1783j983o501P113M060L693k484P859Q789J3476m377j4140j846l609
15258d693j0490l985O550r692m101P188K547J0881K138n849o71N274j518q441
15244a4862j0730m252k578Q94Q688P191J273J206l983l882k805P693O168M253
15230e726L870n162m60N863N45O577L380j934K896L848m157r308p634r24L84j030
15214h972j1060L920l295J301N509Q638K521N734L937k902k649l744j754n036
15200g852N836Q861k624p976o549M930Q005j087k104k998M461K486p857r50M396
15185a022K186p61J2720j752m504q0J616K763o295n991k798j243O268K66o420
$$ plain form
15170 -5047 -6561 -11859 -14546 -12886 -5226 -511 806 -3425 -4726 -13594 -15262 -12413 -12082 -10281 -6165
15155 -6165 377 6233 -871 -1433 -2533 -2822 -5267 -1272 -9680 -13113 -2303 2668 -2222 -8470 -13301
15140 -13301 -17336 -5159 4750 6606 -2406 -9340 -8981 -11258 -9211 -7911 -5054 -4804 4414 6289 4075
15125 4075 199 6414 3388 -4228 -17238 -18340 -5865 -6652 58 7783 15252 17624 10088 11190
15111 11190 10049 -388 -7402 -3505 2869 1694 -2382 1481 7250 7811 11770 18336 20981 10006
15097 10006 9523 9889 8112 13433 13831 9694 10531 4855 -373 -202 -9594 -9556 -3734 5990 15770 15856 3782
15080 3782 -1167 1749 3362 -2484 -5658 -9558 -6491 1525 -9 -4458 -236 3051 4894 1548 -1453
15065 -1453 5481 4871 2300 5149 5161 11103 11307 5693 4706 1400 4179 -3861 -9616 -18772 -33419 -30024
$$ packed form
15170e047j514n298k687J660P660M715J317m231j301q868j668K849L31J801M116
15155f165O542N856p104n62j100k89k445L995q408l433J0810M971m890o248m831
15140a3301m035J2177R909J856r012o934L59k277K047J300K857K50R218J875k214
15125D075l876O215l026p616j3010j102J2475p87O710P725P469K372p536J102
15111A1190j141j0437p014L897O374j175m076L863N769N61L959O566K645j0975
15097A0006m83L66j777N321L98m137Q37n676n228J71r392L8N822R724R780Q6j2074
15080C782m949K916J613n846l174l900L067Q016j534m449M222L287J843l346l001
15065a453O934o10k571K849J2N942K04n614r87l306K779q040n755r156j4647L395
$$ plain form
15049 -30024 -20352 -14111 -7257 -7443 -4750 -10 2707 5396 2770 1948 4063 -6813 -10250 -6307 -18369
15034 -18369 -16294 -8304 -12483 -16112 -17604 -14241 -14400 -9911 -10942 -7434 -4050 -3489 5594 7759 -5542
15019 -5542 2392 10146 9863 6078 -1784 -5597 -925 1941 1207 -3541 -11679 -14360 -18214 -17619 -18349 -18413
15003 -18413 -15402 -15138 -20618 -12951 -15402 -16061 -19434 -21154 -18825 -11132 -8837 -7619 623 7520 13934
14988 13934 18315 18428 7239 2076 1932 3089 -1165 -694 3938 -2248 -3683 -7044 -2288 -3087 1895
14973 1895 10620 -710 -10279 -11166 -8964 -1243 -9867 -20264 -24917 -19104 -11165 -2368 -2799 -49 6283
14958 6283 5259 -1679 1447 15693 11834 -3346 -7921 -9906 -5747 702 -17842 -25323 -13474 -6366
14944 -6366 -12278 -11823 -470 -1230 -7642 -13199 -12141 -6617 -3459 -8225 -13881 -18402 -14859 -3276 10603
$$ packed form
15049c0024R672O241O854j86K693M740K717K689k626q22K115j0876l437L943j2062
15034a8369K075P990m179l629j492L363j59M489j031L508L384N61R083K165j3301
15019e542P934P754k83l785p862l813M672K866p34m748q138k681l854N95p30o4
15003a8413L011K64n480P667k451o59l373j720K329P693K295J218Q242O897O414
14988A3934M381J13j1189n163j44J157m254M71M632o186j435l361M756p99M982
14973A895Q725j1330r569q87K202P721q624j0397m653N813P939Q797m31K750O332
14958F283j024o938L126J4246l859j5180m575j985M159O449j8544p481J1849P108
14944f366n912M55J1353p60o412n557J058N524L158m766n656m521L543J1583J3879
$$ plain form
14929 10603 10439 3665 -2375 -7350 -17437 -13398 -11633 -5115 -486 9911 2220 -1389 -11750 -15900
14915 -15900 -15070 -17592 -16351 -15806 -10145 -10883 -527 692 -555 -1421 -2328 -6620 -2816 -88 1247
14900 1247 -3890 -7330 -3007 -9570 -2157 3577 435 -1857 3669 -2450 285 6750 -3813 -10596
14886 -10596 -9729 -6015 1609 4127 -4141 -312 -2456 -11397 -16826 -19650 -13851 -11062 -6348 -6793 -4129
14871 -4129 4260 2655 -11913 -15829 -16282 -5897 6410 4555 -6286 -14710 -7407 5781 4239 -2169
14857 -2169 -12783 -9786 -6382 -5323 1516 -236 -1592 -6468 -12717 -19706 -16812 -4621 -4081 -23595
14843 -23595 -26662 -28842 -22812 -8840 4269 4817 -5704 -4520 6906 9804 -10 -327 -7573 -10807
14829 -10807 736 12656 8642 890 -1892 -1506 -6298 -4925 -8738 -4195 1825 -4214 -10093 -16656
$$ packed form
14929A0603j64o774o040m975j0087M039J765O518M629J0397p691l609j0361m150
14915a5900Q30k522J241N45N661p38J0356J219j247q66r07m292L804K728J335
14900A247n137l440M323o563P413N734l142k292N526o119K735O465j0563o783
14886a0596Q67L714P624K518q268L829k144q941n429k824N799K789M714m45K664
14871d129Q389j605j4568l916m53J0385J2307j855j0841q424P303J3188j542o408
14857b169j0614K997L404J059O839j752j356m876o249o989K894J2191N40j9514
14843b3595l067k180O030J3972J3109N48j0521J184J1426K898r814l17p246l234
14829a0807J1543J1920m014p752k782L86m792J373l813M543O020o039n879o563
$$ plain form
14815 -16656 -15438 -6250 -4113 -7897 -4191 -13722 -12562 -3450 2438 12954 11262 5858 4644 3721
14801 3721 2930 -8855 -10257 -8251 -5174 8993 11535 2652 10598 10232 -1800 -7952 -9551 -11237
14787 -11237 -12104 -13201 -13619 -13267 -7325 -11203 -4684 -295 6099 7341 -1375 7512 19617 15532 10474
14772 10474 12110 7059 -1694 -13964 -11427 -2903 -9047 -13896 -14872 -3093 9055 4432 -324 3107
14758 3107 13488 12069 7928 -3785 -19745 -18989 -21575 -22115 -14528 -11287 -10073 -11619 2554 7900
14744 7900 1511 -8665 -16539 -14015 2624 878 -7409 -12495 -13821 -5905 -6514 -9254 -6477 -7072 672
14729 672 -2006 -4981 -5279 -6904 -15113 -23780 -20123 -8698 -10596 -24525 -27864 -11312 -8258 -8230 -6296
14714 -6296 -2423 -2743 -15967 -21223 -14569 -15380 -9530 -19490 -17246 -5949 -6840 -2325 6072 5202 8419
$$ packed form
14815a6656J218R188K137l784L706r531J160R112N888J0516j692n404j214r23
14801C721p91j1785j402K006L077J4167K542q883P946l66j2032o152j599j686
14787a1237q67j097m18L52N942l878O519M389O394J242q716Q887J2105m085n058
14772A0474J636n051q753j2270K537Q524o144m849r76J1779J2148m623m756L431
14758C107J0381j419m141j1713j5960P56k586n40P587L241J214j546J4173N346
14744G900o389j0176p874K524J6639j746q287n086j326P916o09k740K777n95P744
14729F72k678k975k98j625q209q667L657J1425j898j3929l339J6552L054K8J934
14714f296L873l20j3224n256O654q11N850r960K244J1297q91M515Q397q70L217
$$ plain form
14699 8419 11468 16259 28291 27978 27565 24440 34502 41982 35657 25393 22635 25120 33658 27264
14685 27264 13529 14416 10856 12358 21990 18709 24665 26270 28666 22072 23694 26898 14558 6993
14671 6993 -1952 -7621 -16870 -3841 14428 22642 22076 17913 10118 6664 959 -210 -1666 -3244
14657 -3244 -6832 -6242 -2649 1275 4753 -1091 -4937 -2867 6272 8448 12195 8880 570 9021 16483
14642 16483 13292 -1597 -15925 -23287 -31024 -24646 -19477 -15519 -24229 -25906 -22635 -16733 -16345 -14453
14628 -14453 -3895 -2925 -11826 -15534 -12726 -11139 -9794 -8645 -8303 -3739 -10574 -6233 -1727 -17606
14614 -17606 -28101 -29014 -21515 -22694 -20349 -15625 -10431 -2183 498 -18791 -21347 -10262 -430 -734
14600 -734 4024 5355 -3206 -11298 -9883 -13940 -21227 -29076 -27807 -16390 -9883 -8830 -6744 -6957 2962
$$ packed form
14699H419L049M791J2032l13m13l125J0062P480o325j0264k758K485Q538o394
14685B7264j3735Q87l560J502R632l281N956J605K396o594J622L204j2340p565
14671F993q945n669r249J3029J8269Q214n66m163p795l454n705j169j456j578
14657c244l588N90L593L924L478n844l846K070R139K176L747l315q310Q451P462
14642A6483l191j4889j4328p362p737O378N169L958q710j677L271N902L88J892
14628a4453J0558R70q901l708K808J587J345J149L42M564o835M341M506j5879
14614a7606j0495r13P499j179K345M724N194Q248K681j9289k556J1085R832l04
14600g34M758J331q561q092J415m057p287p849J269J1417O507J053K086k13R919
$$ plain form
14585 2962 -3048 -14957 -19265 -17362 -16868 -9968 1389 14171 10061 2359 2476 -5284 -22119 -26344
14571 -26344 -13549 -7030 -9528 -14490 -8660 -4044 -2660 -7756 -4901 -4422 -10065 -14344 -14628 -20051 -19132
14556 -19132 -1869 35 3838 9998 19300 16594 13682 5055 9491 8446 10312 12288 5273 5296 4829
14541 4829 258 5780 7638 6127 15113 16869 7544 3696 -161 -4787 -2977 2054 6688 10878 10034
14526 10034 12083 7056 5990 1393 -3129 -965 4011 -2505 -9869 -12445 -14552 -14827 -12820 -5568 -1749
14511 -1749 -3204 -11195 -18944 -11600 -6362 -12831 -21737 -16244 -3835 959 -132 -6794 -17035 -21245
14497 -21245 -20608 -16452 -11380 -11041 -15969 -19706 -10893 1221 6108 12009 11644 7257 -6140 -14925 -11105
14482 -11105 -11684 -4647 1742 -995 -9968 -13982 -13186 -16234 -19834 -6777 333 8974 4145 -5627 -14664
$$ packed form
14585B962o010j1909m308J903M94O900J1357J2782m110p702J17p760j6835m225
14571b6344J2795O519k498m962N830M616J384n096K855M79n643m279k84n423R19
14556a9132J7263J904L803O160R302k706k912q627M436j045J866J976p015K3m67
14541D829m571N522J858j511Q986J756r325l848l857m626J810N031M634M190q44
14526A0034K049n027j066m597m522K164M976o516p364k576k107k75K007P252L819
14511a749j455p991p749P344N238o469q906N493J2409M794j091o662j0241m210
14497b1245O37M156N072L39m928l737Q813J2114M887N901l65m387j3397q785L820
14482a1105n79P037O389k737q973m014P96l048l600J3057P110Q641m829r772r037
$$ plain form
14467 -14664 -16975 -20424 -13498 -1565 4539 -235 -7724 -211 -8052 -14680 -4890 -3459 -14266 -17987
14453 -17987 -9634 -2196 -8044 -8677 -12910 -8902 1368 -1534 -2459 -4026 -8941 -8142 -4638 -432 931
14438 931 452 1734 -886 -530 1881 -5656 -14009 -16426 -20191 -18811 -18293 -14366 -117 5419 6183 5032
14422 5032 6496 624 -4230 -7755 -6874 3748 9271 1048 -6605 -6630 -5216 -8303 -13622 -13584 -5267 6437
14406 6437 -108 -3081 1766 -4241 -14627 -13210 -12592 -9264 -2512 3384 873 -5101 -3798 2602 8236
14391 8236 -2766 -4171 -7651 -15245 -8233 -5638 -7732 -13428 -13315 -17068 -10534 -8287 -7543 2238 11608
14376 11608 12196 5231 -4398 -12569 -5570 -3119 4684 12346 7819 3141 -7078 -12190 -19304 -14959
14362 -14959 -10500 -7495 -14212 -13310 -8008 -4198 -4442 -9867 -7352 7269 10995 11371 6807 4413 1700
$$ packed form
14467a4664k311l449O926J1933O104m774p489P513p841o628R790J431j0807l721
14453a7987Q353P438n848o33m233M008J0270k902r25j567m915P99L504M206J363
14438I31m79J282k620L56K411p537q353k417l765J380N18L927J4249N536P64j151
14422E032J464n872m854l525Q81J0622N523q223p653k5J414l087n319L8Q317J1704
14406F437o545k973M847o007j0386J417O18L328O752N896k511n974J303O400N634
14391H236j1002j405l480p594P012K595k094n696J13l753O534K247P44R781R370
14376A1608N88o965r629q171O999K451P803P662m527m678j0219n112p114M345
14362a4959M459L005o717R02N302L810k44n425K515J4621L726L76m564k394k713
$$ plain form
14347 1700 -3179 -2460 -7284 -3025 -4019 -4543 -3667 5814 2351 -6499 -5596 752 -8820 -7361 -3828 42
14331 42 6597 13098 -4156 -9123 -5341 9727 16690 13112 8030 5786 5341 -3109 -14045 -15957 -6484
14316 -6484 -9241 -4894 185 4395 695 -4284 -13204 -8874 -11698 -8223 -9509 -7178 -4131 -4989 -3485
14301 -3485 341 4636 12204 3429 -12145 -22717 -11696 -7431 -707 4451 1512 -534 7080 12535
14287 12535 11155 6482 16358 18567 4859 9345 19574 15406 6801 1426 -3541 -1978 2749 7880
14273 7880 764 -10530 -24212 -35464 -25052 -12290 -2769 -723 -703 1832 -2233 -10301 -10534 -15345
14259 -15345 -20538 -17054 -7826 -2928 -12718 -11270 -12124 -8739 131 -1520 -3475 -3658 -8491 -12540 -12500
14244 -12500 -10821 -6342 -208 -1049 5120 11273 7775 3295 4448 8476 5186 5628 -577 -6418 -3095
$$ packed form
14347A700m879P19m824M259r94n24Q76R481l463q850R03O348r572J459L533L870
14331D2O555O501j7254m967L782J5068O963l578n082k244m45q450j0936j912R473
14316f484k757M347N079M210l700m979q920M330k824L475j286K331L047q58J504
14301c485L826M295P568q775j5574j0572J1021M265O724N158k939k046P614N455
14287A2535j380m673R876K209j3708M486J0229m168q605n375m967J563M727N131
14273G880p116j1294j3682j1252J0412J2762R521K046K0K535m065q068k33m811
14259a5345n193L484R228M898r790J448q54L385Q870j651j955j83m833m049M0
14244a2500J679M479O134q41O169O153l498m480J153M028l290M42o205n841L323
$$ plain form
14229 -3095 7119 4156 3418 -1448 -17887 -31706 -27399 -9875 177 7166 830 -6254 -6936 -3346
14215 -3346 -1424 -2880 46 -1211 -6664 -2394 -967 -8227 -8860 -1294 5338 6770 7025 770 9275
14200 9275 14861 10223 1475 -4364 -12574 -7519 -6548 -8996 -4760 2666 12284 11862 10369 4072 1681
14185 1681 2460 1528 2201 -319 3184 2389 8451 17412 16176 2039 -11484 -8958 -5314 7223 13919
14170 13919 16970 11357 3599 1018 -2137 -5605 -7824 -3409 6919 616 -8671 -10745 -10702 -9063 -11220
14155 -11220 -11161 -6083 -8038 -12970 -18145 -23150 -24058 -25004 -20777 -17233 -20887 -13724 -11515 -10720 -1685 -3566
14139 -3566 -6129 -8270 1758 4562 -2263 1534 1455 3350 494 -3231 5828 3600 5015 -4554 -13555
14124 -13555 -19667 -4931 2743 -5917 -10316 -20003 -22876 -25595 -25556 -27852 -14082 -8413 -9953 1517
$$ packed form
14229c095J0214k963p38m866j6439j3819M307J7524J0052O989o336p084o82L590
14215c346J922j456K926j257n453M270J427p260o33P566O632J432K55o255Q505
14200I275N586m638q748n839q210N055R71k448M236P426R618m22j493o297k391
14185A681P79r32O73k520L503p95O062Q961j236j4137j3523K526L644J2537O696
14170A3919L051n613p758k581l155l468k219M415J0328o303r287k074M3J639k157
14155a1220N9N078j955m932n175n005r08r46M227L544l654P163K209P95R035j881
14139c566k563k141J0028K804o825L797p9J895k856l725R059k228J415r569r001
14124a3555o112J4736P674q660m399r687k873k719L9k296J3770N669j540J1470
$$ plain form
14110 1517 -2927 -9565 -19546 -19375 -4552 -213 -8314 -8488 -9902 -14100 -23989 -18828 -10458 -10314 -8554
14095 -8554 -1586 -3727 -5925 -9979 -8740 -1010 -13347 -16773 -11700 -3969 -13612 -14707 -5183 -953
14081 -953 2496 6863 2644 -262 -6305 3248 18056 14508 8636 11313 15660 16130 7489 -1139 -7910
14066 -7910 -2710 941 4163 10785 14675 24449 25395 19925 12078 5171 17 6940 14649 10296 8870
14051 8870 9672 9861 -456 4516 14696 11503 7644 -3896 -2165 7145 13551 5772 6523 16772
14037 16772 19467 7470 -874 -1885 -8524 -8900 -6715 -8892 -10778 -11697 -16697 -11137 -3692 -7012 -7227
14022 -7227 -3270 7122 11036 11890 15577 8551 152 -1031 -2283 -9332 -10755 -14208 -24439 -27449
14008 -27449 -20200 -14784 -15383 -5668 -110 -3023 -6087 -5142 4641 4016 2839 9588 14048 -949 -8168
$$ packed form
14110A517m444o638r981J71J4823M339q101j74j414m198r889N161Q370J44J760
14095h554O968k141k198m054J239P730j2337l426N073P731r643j095R524M230
14081i53L449M367m219k906o043R553J4808l548n872K677M347M70q641q628o771
14066g910N200L651L222O622L890R774R46n470p847o907n154O923P709m353j426
14051H870Q02J89j0317M972J0180l193l859j1540J731R310O406p779P51J0249
14037A6772K695j1997q344j011o639l76K185k177j886r19n000N560P445l320k15
14022g227L957J0392L914Q54L687p026q399j183j252p049j423l453j0231l010
14008b7449P249N416n99R715N558k913l064R45R783o25j177O749M460j4997p219
$$ plain form
13993 -8168 -6170 -9219 -12030 -7173 -6552 -3354 1096 -8144 -21647 -20417 -20238 -7271 -369 8155 6153
13978 6153 543 -1497 -8788 -8473 -5695 -10116 -19333 -24234 -20182 -13308 -6228 5341 3451 149 45
13963 45 3756 3003 8948 14596 13507 6296 -7538 -4334 2660 2380 -7469 -13767 -16772 -8351 5192
13948 5192 10941 3801 -9691 -17935 -10347 -5526 -11838 1430 11836 12010 13873 12048 7954 -5788
13934 -5788 -3797 624 1530 -3891 -16676 -9294 -7136 -7147 -12103 -14690 -15726 -16378 -7669 -5347 4423
13919 4423 8557 4132 -3232 -10184 -13038 -20384 -22348 -18868 -10646 -2460 -14073 -21079 -19818 -16339
13905 -16339 -13385 -11428 1793 4229 2243 9628 7608 3232 -3322 -4291 -3649 -8665 2016 3322
13891 3322 -3140 -10603 -9529 -4112 -12645 -12832 -13857 -14008 -10599 -12765 -8879 5861 -8135 -13733 1631
$$ packed form
13993h168J998l049k811M857O21L198M450r240j3503J230J79J2967O902Q524k002
13978F153n610k040p291L15K778m421r217m901M052O874P080J1569j890l302j04
13963D5L711p53N945N648j089p211j3834L204O994k80r849o298l005Q421J3543
13948E192N749p140j3492q244P588M821o312J3268J0406J74J863j825m094j3742
13934e788J991M421R06n421j2785P382K158j1m956k587j036o52Q709K322R770
13919D423M134m425p364o952k854p346j964L480Q222Q186j1613p006J261L479
13905a6339K954J957J3221K436j986P385k020m376o554r69O42n016J0681J306
13891C322o462p463J074N417q533j87j025j51L409k166L886J4740j3996n598J5364
$$ plain form
13876 1631 7371 205 -4655 -2617 -17413 -26011 -15911 -8442 -1969 -520 -9630 -18178 -13932 -12461
13862 -12461 -6588 -6310 -2526 -3546 14099 13112 3728 -146 -8411 -7423 -3921 6294 3262 -8085
13848 -8085 -9647 -4060 6029 5784 13432 14770 10373 -1391 -10199 -2501 1756 4674 6435 7982
13834 7982 7935 8810 16361 15648 3952 -1617 -9455 -7390 -12168 -17784 -18050 -4977 -924 2816 12860
13819 12860 7642 -10 -4123 -10383 -2677 -3694 -4785 555 -1719 -4442 -967 -6904 -17738 -19275
13805 -19275 -18089 -8270 -1892 -80 2488 -4106 -6939 -13064 -7501 -562 -1076 -1456 5441 5514 -12059
13790 -12059 -20697 -8134 -7714 -9736 -11645 -19674 -13635 -2986 -3523 -5406 -10812 -18779 -22536 -16672
13776 -16672 -12345 -14092 -19702 -16869 -16127 -7909 1849 2882 -1772 5539 -885 -13056 -13063 -16900 -11200
$$ packed form
13876A631N740p166m860K038j4796q598J0100P469O473J449r110q548M246J471
13862a2461N873K78L784j020J7645r87r384l874q265R88L502J0215l032j1347
13848h085j562N587J0089k45P648J338m397j1764q808P698M257K918J761J547
13834G982m7Q75P551p13j1696n569p838K065m778n616k66J3073M053L740J0044
13819A2860n218p652m113o260P706j017j091N340k274k723L475n937j0834j537
13805a9275J186R819O378J812K568o594k833o125N563O939n14l80O897P3j7573
13790a2059q638J2563M20k022j909q029O039J0649n37j883n406p967l757N864
13776a6672M327j747n610K833P42Q218R758J033m654P311o424j2171pl837N700
$$ plain form
13761 -11200 -8494 -4869 -6626 -4122 -40 1676 -4352 -12073 -11950 6526 16495 10475 6539 -268
13747 -268 -12252 -7464 -9141 -11359 -3777 5714 10409 -158 -3260 -3886 -13725 -20232 -14672 -7366 -1425
13732 -1425 -4742 -2595 -3435 -9963 -9044 -17060 -9906 -12920 -6665 -6127 -6899 -1417 2989 8166 7699 2568
13716 2568 5313 9463 8621 4914 125 -5708 -7277 -7336 -10884 -7001 2240 -1836 -9417 -11520 -15556
13701 -15556 -17144 -15302 -13300 -15083 -4380 -4558 -15928 -20392 -12348 -4647 590 -7507 -15715 -10076
13687 -10076 -386 2875 994 69 -2428 -3083 -4743 4784 8841 13490 17262 12142 7308 12724 12051
13672 12051 5274 375 9065 7836 8484 11653 6793 -6330 -6020 -1289 6059 11373 4095 1514 -170
13657 -170 -5239 -1443 1587 -530 -2640 -7454 -16195 -19517 -19314 -6786 5692 14746 7492 -19144
$$ packed form
13761a1200K706L625j757K504M082J716o028p721J23J8476R969o020l936o807
13747b68j1984M788j677k218P582R491M695j0567l102o26r839o507N560P306N941
13732a425l317K147q40o528R19q016P154l014O255N38p72N482M406N177m67n131
13716B568K745M150q42l707m789n833j569n9l548L883R241m076p581k103m036
13701a5556j588J842K002j783J0703j78j1370m464Q044P701N237q097q208N639
13687a0076R690L261j881r25k497o55j660R527M057M649L772n120m834N416o73
13672A2051o777m899Q690j229O48L169m860j3123L10M731P348N314p278k581j684
13657a70n069L796L030k117k110m814q741l322K03J2528J2478R054p254k6636
$$ plain form
13643 -19144 -18194 -22197 -21809 -15667 -589 4783 6473 10225 9387 6365 5508 9932 6932 -5524 -11552
13628 -11552 -998 7760 -2502 3962 -2635 -10193 -14127 -5796 -274 1417 3704 14477 15053 16547
13614 16547 19949 24360 20363 9813 5754 6698 1894 -3004 849 14748 22294 16702 6739 2244
13600 2244 -2848 -8710 -8727 -14276 -5907 -1229 -2313 262 -8753 -6426 1750 2136 6621 2823 13
13585 13 3034 3980 2554 -1343 -6729 -2663 1876 8144 9572 8881 9210 11864 6730 6340 7193 3936
13569 3936 174 -3272 -9510 -15628 -8288 1462 8925 13773 17679 10573 -1705 -6772 3228 7212
13555 7212 8924 3354 -2047 9767 9569 -5458 -14714 -4624 8057 16737 22276 20040 17774 16939
13541 16939 5821 -3709 3674 6365 3493 -3002 -7279 -6546 -3595 -2259 1962 3266 1161 7831
$$ packed form
13643a9144R50m003L88O142J5078N372J690L752q38l022q57M424l000j2456o028
13628a1552J0554Q758j0262O464o597p558l934Q331N522J691K287J0773N76J494
13614A6547L402M411l997j0550m059R44m804m898L853J3899P546n592r963m495
13600B244n092n862j7n549Q369M678j084K575r015K327Q176L86M485l798k810
13585A3L021R46j426l897n386M066M539O268J428o91L29K654n134l90Q53l257
13569C936l762l446o238o118P340R750P463M848L906p106j2278n067J0000L984
13555G212J712n570n401J1814j98j5027r256J0090J2681Q680N539k236k266q35
13541A6939j1118r530P383K691k872o495m277P33K951J336M221J304k105O670
$$ plain form
13527 7831 18017 15557 6021 -1131 1301 10276 12119 12903 17390 14272 11406 3548 690 3721 5319
13512 5319 2595 -6602 -7033 -8389 -456 10160 11443 15252 -1769 -4134 5904 12786 11206 8631
13498 8631 -305 2501 9317 12064 15396 7158 7619 15076 8478 2733 5112 2062 2031 404 -3802
13483 -3802 -2367 -5364 -13397 -10993 -13962 -12616 1071 4070 1545 10392 10882 -3423 -7154 -654
13469 -654 -1691 -6977 -438 7365 8553 10587 15248 12288 14272 12243 6200 13392 19978 21513 16634
13454 16634 8500 11535 16117 14641 8691 5722 9885 4820 -131 9579 9864 9188 11573 9167 13311
13439 13311 17148 3769 -2204 -6569 -1795 4667 8717 7539 9464 11159 6196 -9726 -10983 -10987 -5042
13424 -5042 2389 6813 4317 10552 16030 9629 1894 9531 19086 15903 15517 17175 16449 19022 21792
$$ packed form
13527G831J0186k460r536p152K432Q975J843P84M487l118k866p858k858L031J598
13512E319k724r197m31j356P933J0616J283L809j7021k365J0038O882j580k575
13498H631q936K806O816K747L332q238M61P457o598n745K379l050l1j627m206
13483c802J435k997q033K404k969J346J3687K999k525Q847M90j4305l731O500
13469f54j037n286O539P803J188K034M661k960J984k029o043P192O586J535m879
13454A6634q134L035M582j476n950k969M163n065m951R710K85o76K385k406M144
13439A3311L837j3379n973m365M774O462M050j178J925J695m963j5922j257mN945
13424e042P431M424k496O235N478o401p735P637R555l183l86J658p26K573K770
$$ plain form
13409 21792 25387 28088 15390 13916 16155 7887 7406 10604 3861 10317 14490 8026 15254 21466
13395 21466 27637 35468 33196 26923 31652 27652 24253 22948 22736 19265 16576 20573 24879 30147 39477
13380 39477 31361 15995 974 -9675 -4452 12304 21248 16715 24575 29206 21917 13327 10641
13367 10641 10909 11532 13161 24206 16424 15519 16483 18370 16050 10426 -6960 -16850 -8289 1305 -8000
13352 -8000 -8530 -6434 -11145 -14630 -11825 -3034 14794 23669 14309 6095 13828 15677 8087 4247 5484
13337 5484 4267 -1779 12239 24117 27097 19063 7943 -1501 -113 7900 -914 -2108 7193 20562
13323 20562 30266 27834 22981 23284 12368 33 6387 4239 6142 14830 22117 14061 6835 5887
13309 5887 16273 27064 32205 32768 31658 27630 22553 13203 23939 37079 26354 21974 14622 10752
$$ packed form
13409B1792L595K701j2698j474K239q268m81L198o743O456M173o464P228O212
13395B1466O171P831k272o273M729m000l399j305k12l471k689L997M306N268R330
13380C9477q116j5366j5021j0649N223J6756Q944m533P860M631p289q590k686
13367A0641K68O23J629J1045p782r05R64J887k320n624j7386r890Q561R594r305
13352h000n30K096m711l485K805Q791J7828Q875r360q214P733J849p590l840J237
13337E484j217o046J4018J1878K980q034j1120r444J388Q013q814j194R301J3369
13323B0562R704k432m853L03j0916j2335O354k148J903Q688P287q056p226r48
13309E887J0386J0791N141N63j110m028n077r350J0736J3140j0725m380p352l870
$$ plain form
13295 10752 7188 10909 13094 12623 16637 12339 11442 11870 2326 2757 8729 11523 7002 13287 9551
13280 9551 19987 30507 33219 27296 23889 22044 11570 915 2766 -5363 -11362 -2271 4794 8904
13266 8904 6995 1929 5804 1405 -4322 -9377 2862 15516 20456 12909 7633 13045 13943 12790
13252 12790 15868 12493 11544 7222 6528 424 902 16020 27139 25857 21638 23558 24800 22203 22659
13237 22659 22513 4554 9271 23641 24816 27612 17525 13320 10460 16661 23718 17753 22260 25015
13223 25015 32900 31053 28242 32620 35597 39711 38008 43371 47046 53955 66145 74586 87802 86514
13209 86514 82135 93531 99045 90743 87315 79084 76591 90758 97003 98010 95633 100936 102340 101140
13195 101140 98039 97180 86863 80027 91211 105816 114609 121113 125967 120226 113581 101944 95852
$$ packed form
13295A0752l564L721K185m71M014m298q97M28r544M31N972K794m521O285l736
13280I551J0436J0520K712n923l407j845j0474j0655J851q129n999R091P065M110
13266H904j909n066L875m399n727n055J2239J2654M940p547n276N412Q98j153
13252A2790L078l375r49m322o94o104M78J5118J1119j282m219J920J242k597M56
13237B2659j46j7959M717J4370J175K796j0087m205k860O201P057n965M507K755
13223B5015P885j847k811M378K977M114j703N363L675O909J2190Q441J3216j288
13209H6514m379J1396N514q302l428q231k493J4167O245J007k377N303J404j200
13195A01140l101q59j0317o836J1184J4605Q793O504M854n741o645j1637o092
$$ plain form
13182 95852 102119 108849 118212 123712 120542 114727 105649 93776 89609 89568 88634 81479 73221 73771 75612
13167 75612 69567 52135 41815 59829 58250 53602 43815 44745 49671 37747 37098 41292 55143 48540
13153 48540 47094 52835 51623 52963 51340 61199 77035 88111 85921 75799 94750 111587 122227
13140 122227 124892 138133 144595 149935 145520 141793 134981 121224 119097 123829 131381 147771 166321
13127 166321 173329 174806 172641 168997 162750 154460 149596 157127 153878 162224 176438 181353 175831 170202
13113 170202 165635 157013 153876 159654 158023 154749 154142 173381 182008 171337 161540 155641 143450 135386
13099 135386 124443 113025 100126 104763 107716 101413 99284 97806 98597 90574 93366 94356 84530 70841
13085 70841 59873 57473 61338 66042 59099 56009 54077 59974 57142 60133 59827 60114 56571 48356 51285
$$ packed form
13182I5852O267O730R363N500l170n815r078j1873m167m1r34p155q258N50J841
13167G5612o045j7432j0320J8014j579m648r787R30M926j1924o49M194J3851o603
13153D8540j446N741j212J340j623R859J5836J1076k190j0122J8951J6837J0640
13140A22227K665J3241O462N340m415l727o812j3757k127M732P552J6390J8550
13127A66321P008J477k165l644o247q290m864P531l249Q346J4214M915n522n629
13113A70202m567q622l137N778j631l274o07J9239Q627j0671r797n899j2191q064
13099A35386j0943j1418j2899M637K953o303k129j478P91q023K792R90r826j3689
13085G0841j0968k400L865M704o943l090j932N897k832K991l06K87l543q215K929
$$ plain form
13070 51285 53039 55662 46950 48896 51819 54713 60565 56504 64027 62882 52902 58347 62691 62911 54847
13055 54847 64672 76600 73257 71666 69085 74327 73221 60328 52794 52241 55524 60363 60451 54673 57612
13040 57612 64010 56684 48423 49478 52331 54185 52082 44120 49482 52630 57484 55218 54698 52936 49109
13025 49109 42683 41281 46284 53065 56978 64464 67344 56411 65068 70390 71010 73397 71891 62878
13011 62878 64063 64072 66877 70310 81433 87496 85899 91248 80121 71475 70606 84384 84710 68824 65330
12996 65330 76401 74205 78027 78625 83642 84516 89586 89184 83922 79581 79554 87792 98909 100836 104601
12981 104601 106652 112235 112810 110801 104822 103008 102402 100157 100895 91811 93380 88445 77069 80930 96611
12966 96611 96331 87308 81526 75489 78958 87997 96808 100957 100831 92349 82840 88782 97087 112121 120007
$$ packed form
13070E1285J754K623q712J946K923K894N852m061P523j145r980N445M344K20q064
13055E4847R825J1928l343j591k581N242j106j2893p534n53L283M839Q8n778K939
13040E7612O398p326q261J055K853J854k103p962N362L148M854k266n20j762l827
13025D9109o426j402N003O781L913P486K880j0933Q657N322O20K387j506r013
13011F2878J185RK805L433J1123O063j597N349j1127q646q69J3778L26j5886l494
12996F5330J1071k196L822N98N017Q74N070m02n262m341k7Q238J1117J927L765
12981A04601K051N583N75k009n979j814o06k245P38r084J569m935j1376L861J5681
12966I6611k80r023n782o037L469R039Q811M149j26q482r509N942Q305J5034P886
$$ plain form
12951 120007 116167 116271 108339 111164 117909 120992 111423 105923 100804 107605 106972 107334 98504 87811 93165
12936 93165 101284 100801 94165 102020 115738 124852 143590 152537 178321 206894 230097 238864 237484
12923 237484 228412 212590 194541 168154 149150 145665 141081 140284 145371 158193 160679 167217 191047
12910 191047 220157 227007 215731 201838 187993 169653 147317 138688 129591 116979 109167 88896
12898 88896 85646 97747 101166 104125 100515 99112 102632 104518 103693 108195 104990 109101 113625 127217
12884 127217 120056 110979 109994 113087 106331 98674 100590 106478 119117 122719 119508 123263 136007 140957
12870 140957 135731 131750 134499 146739 152037 158979 159594 151684 152199 158992 161605 173568 191253 206967
12856 206967 229131 253179 276085 292219 286497 271972 253243 233360 216843 204791 194081 191985
$$ packed form
12951A20007l840J04p932K825O745L083r569n500n119O801o33L62q830j0693N354
12936I3165Q119m83o636P855J3718R114J8738Q947K5784K8573K3203Q767j380
12923B37484r072j5822j8049k6387j9004l485m584p97N087J2822K486O538K3830
12910A91047K9110O850j1276j3893j3845j8340k2336q629r097j2612p812k0271
12898H8896l250J2101L419K959l610j403L520J886q25M502l205M111M524J3592
12884A27217p161r077r85L093o756p657J916N888J2639L602l211L755J2744M950
12870A40957n226l981K749J2240N298O942O15p910N15O793K613J1963J7685J5714
12856B06967K2164K4048K2906J6134n722j4525j8729j9883j6517j2052j0710k096
$$ plain form
12844 191985 205483 228335 247693 269240 283279 294784 305533 293080 283320 276983 265268 247257
12832 247257 229750 218603 215606 203167 202347 199590 197972 201642 199001 212514 215308 214969 210585 208982
12818 208982 207918 211873 222250 211768 206420 218429 232551 240337 243716 254295 267901 267717 271186
12805 271186 275929 278939 297579 307800 319621 328361 333432 330910 333255 348553 354013 361299 378174
12792 378174 394668 404819 419673 433208 445193 468783 497406 525299 559733 597225 631526
12781 631526 660917 687057 718973 739402 751889 771073 823536 871280 924477 997141 1087414
12770 1087414 1207449 1338987 1491754 1678819 1907464 2203924 2616042 3194794 4021139
12761 4021139 5166579 6647742 8397391 10218778 11796689 12839524 13183991 12839901
$$ packed form
12844A91985J3498K2852J9358K1547J4039J1505J0749j2453r760o337j1715j8011
12832B47257j7507j1147k997j2439q20k757j618L670k641J3513K794l39m384j603
12818B08982j064L955J0377j0482n348J2009J4122P786L379J0579J3606j84L469
12805B71186M743L010J8640J0221J1821Q740N071k522K345J5298N460P286J6875
12792C78174J6494J0151J4854J3535J1985K3590K8623K7893L4434L7492L4301
12781F31526K9391K6140L1916K0429J2487J9184N2463M7744N3197P2664R0273
12770A087414J20035J31538J52767J87065K28645K96460M12118N78752Q26345
12761D021139J145440J481163J749649J821387J577911J042835L44467l44090
$$ plain form
12753 12839901 12093375 11359315 10983698 11208567 12040860 13322545 14691991 15745315 16177208
12744 16177208 15825115 14817429 13539353 12433791 11858690 11995103 12764644 13982614 15319119
12735 15319119 16371409 16888715 16800498 16253053 15600672 15141199 15056315 15329475 15822063
12726 15822063 16328660 16620313 16542936 16026610 15013333 13587079 11958221 10352045 8973695
12717 8973695 7909515 7120792 6523787 6045742 5656912 5358215 5129038 4944134 4790260
12708 4790260 4653681 4546509 4477239 4451548 4468367 4543232 4671055 4826095 4964707 5084719
12698 5084719 5177391 5272224 5396817 5569931 5847109 6308139 7018862 8092685 9669801
12689 9669801 11833176 14536258 17574438 20487786 22709401 23828838 23685183 22563994
$$ packed form
12753A2839901p46526p34060l75617K24869Q32293J281685J369446J053324M31893
12744A6177208l52093j007686j278076j105562n75101J36413P69541J217970J336505
12735A5319119J052290N17306q8217n47445o52381m59473q4884K73160M92588
12726A5822063N06597K91653p7377n16326j013277j426254j628858j606176j378350
12717H973695j064180p88723n97005m78045l88830k98697k29177j84904j53874
12708D790260j36579j07172o9270k5691J6819P4865J27823J55040J38612J20012
12698E084719R2672R4833J24593J73114K77178M61030P10723J073823J577116
12689I669801K163375K703082L038180K913348K221615J119437j43655j121189
$$ plain form
12681 22563994 21111086 19972723 19686305 20464285 22157938 24338570 26337992 27544533
12673 27544533 27574712 26355578 24353359 22272514 20749161 20244005 20848879 22386165 24440588
12664 24440588 26391041 27661273 27945585 27188522 25755809 24323951 23374262 23128380 23613106
12655 23613106 24633784 25753642 26391860 26153961 24919902 22830263 20266964 17610654
12647 17610654 15187160 13194673 11650874 10466784 9570159 8864694 8298940 7828039 7415553
12638 7415553 7050240 6716412 6416895 6136692 5898128 5681534 5491211 5324968 5173355
12629 5173355 5026819 4873565 4723323 4583211 4450638 4319348 4194489 4083053 3977161
12620 3977161 3873931 3786641 3708659 3637710 3585868 3547139 3514260 3479142 3451142 3419118 3379268
$$ packed form
12681B2563994j452908j138363k86418P77980J693653K180632J999422J206541
12673B7544533L0179j219134k002219k080845j523353n05156O04874J537286K054423
12664B4440588J950453J270232K84312p57063j432713j431858r49689k45882M84726
12655B3613106J020678J119858O38218k37899j234059k089639k563299k656310
12647A7610654k423494j992487j543799j184090q96625p05465n65754m70901m12486
12638G415553l65313l33828k99517k80203k38564k16594j90323j66243j51613
12629E173355j46536j53254j50242j40112j32573j31290j24859j11436j05892
12620C977161j03230q7290p7982p0949n1842l8729l2879l5118k8000l2024l9850
$$ plain form
12609 3379268 3301510 3197418 3077470 2960646 2843605 2741243 2653213 2574263 2500297 2436191
12599 2436191 2376930 2335614 2291228 2250767 2197034 2138210 2096977 2075144 2047591 2005767 1975610
12588 1975610 1929432 1877814 1841821 1799866 1767587 1738815 1698924 1661253 1628001 1601160 1567635
12577 1567635 1528432 1495969 1466052 1443751 1426171 1406048 1392332 1371149 1344264 1318222 1297373
12566 1297373 1264832 1227675 1217402 1202518 1190693 1175375 1156220 1151935 1137628 1131581 1132951 1123341
12554 1123341 1118788 1110530 1088574 1065149 1040926 1010716 995599 976575 970024 982441 993278 994630
12542 994630 998889 995493 991543 993446 1012802 1034280 1088013 1174643 1285705 1397179 1483055 1538102
12530 1538102 1548528 1529033 1490358 1441976 1399229 1389337 1414431 1450646 1502795 1549168 1576990
$$ packed form
12609C379268p7758j04092j19948j16824j17041j02362q8030p8950p3966o4106
12599B436191n9261m1316m4386m0461n3733n8824m1233k1833k7553m1824l0157
12588A975610m6178n1618l5993m1955l2279k8772l9891l7671l3252k6841l3525
12577A567635l9203l2463k9917k2301j7580k0123j3716k1183k6885k6042k0849
12566A297373l2541l7157j0273j4884j1825j5318j9155m285j4307o047J370r610
12554A123341m553q258k1956k3425k4223l0210j5117j9024o551J2417J0837J352
12542I94630M259l396l950J903J9356K1478N3733Q6630J11062J11474Q5876N5047
12530A538102J0426j9495l8675m8382m2747r892K5094L6215N2149M6373K7822
$$ plain form
12519 1576990 1575010 1538234 1455709 1343698 1242590 1166923 1121081 1098041 1098160 1108177 1141924
12508 1141924 1178642 1205388 1209164 1201450 1202537 1211157 1228945 1262676 1315817 1391283 1479121 1572564
12496 1572564 1660817 1770949 1925865 2131280 2377069 2666319 3033233 3495877 4131417 5055588
12486 5055588 6402583 8374589 11157470 14621408 18180827 21087654 22486776 21451069
12478 21451069 18413471 15115490 12603859 10969403 10005478 9524291 9469042 9914289 11039941
12469 11039941 13090230 16162080 19846358 23266269 25627170 25681560 22539801 17999900
12461 17999900 14193152 11560776 9777090 8509227 7548683 6796326 6200052 5734656 5352138
12452 5352138 5025036 4743586 4499986 4291882 4121585 3980399 3847892 3737588 3643202 3546400
$$ packed form
12519A576990j980l6776q2525j12011j01108p5667m5842k3040J19J0017L3747
12508A141924L6718K6746L776p714J087Q620J7788L3731N3141P5466Q7838R3443
12496A572564Q8253J10132J54916K05415K45789K89250L66914M62644O35540R24171
12486E055588J346995J972006K782881L463938L559419K906827J399122j035707
12478B1451069l037598l297981k511631j634456r63925m81187n5249M45247J125652
12469A1039941K050289L071850L684278L419911K360901N4390l141759m539901
12461A7999900l806748k632376j783686j267863r60544p52357n96274m65396l82518
12452E352138l27102k81450k43600k08104j70297j41186j32507j10304r4386r6802
$$ plain form
12442 3546400 3475347 3420137 3373697 3333254 3288587 3269214 3233853 3199550 3168572 3145828 3155999
12431 3155999 3180716 3231070 3300558 3375506 3462793 3553488 3658590 3792441 3971555 4235432
12421 4235432 4562629 4976584 5522264 6215933 7129424 8359905 10087338 12558617 16088426
12412 16088426 20823697 26287746 31412030 35094723 35718717 32452303 27399152 23110595
12404 23110595 20332461 18828575 18197116 18163315 18616767 19724447 21864763 25331388 29847805
12395 29847805 34376828 37744678 38577081 35502625 29656055 23967016 19750097 16830616
12387 16830616 14717899 13095336 11775362 10690536 9812478 9088346 8472260 7932662 7464527
12378 7464527 7056464 6709881 6411404 6161043 5948972 5755647 5575663 5415832 5267172
$$ packed form
12442C546400p1053n5210m6440m0443m4667j9373l5361l4303l0978k2744J0171
12431C155999K4717N0354O9488P4948Q7287R0695J05102J33851J79114K63877
12421D235432L27197M13955N45680O93669R13491J230481J727433K471279L529809
12412A6088426M735271N464049N124284L682693O23994l266414n053151m288557
12404B3110595k778134j503886o31459l3801M53452J107680K140316L466625M516417
12395B9847805M529023L367850Q32403l074456n846570n689039m216919k919481
12387A6830616k112717j622563j319974j084826q78058p24132o16086n39598m68135
12378G464527m08063l46583k98477k50361k12071j93325j79984j59831j48660
$$ plain form
12369 5267172 5130043 5000580 4879360 4770319 4661909 4554918 4464693 4384659 4327792 4290630
12359 4290630 4262411 4223041 4175894 4128281 4077696 4031591 4001600 3981672 3991061 4031577 4117928
12348 4117928 4249830 4449494 4733833 5117187 5642416 6389179 7507709 9171560 11383259
12339 11383259 13756401 15812618 17024711 16543021 14538209 12368602 10781174 9735510
12331 9735510 9078518 8737527 8747441 9147681 10008140 11377976 13156798 14977008 16380372
12322 16380372 16952587 16155693 14023131 11592441 9641578 8259297 7292526 6593887 6021057
12313 6021057 5528062 5107228 4752797 4457022 4214545 4010135 3821082 3662682 3509449
12304 3509449 3368700 3228401 3101591 2992301 2881605 2788747 2707808 2621701 2545534 2481809
$$ packed form
12369E267172j37129j29463j21220j09041j08410j06991r0225q0034n6867l7162
12359D290630k8219l9370m7147m7613n0585m6105k9991j9928R389M0516Q6351
12348D117928J31902J99664K84339L83354N25229P46763J118530J663851K211699
12339A1383259K373142K056217J212093m81690k004812k169607j587428j045664
12331I735510o56992l40991R914M00240Q60459J369836J778822J820210J403364
12322A6380372N72215p96894k132562k430690j950863j382281r66771o98639n72830
12313F021057m92995m20834l54431k95775k42477k04410j89053j58400j53233
12304C509449j40749j40299j26810j09290j10696r2858q0939q6107p6167o3725
$$ plain form
12294 2481809 2431804 2378118 2322204 2270358 2216098 2159974 2108564 2062915 2022425 1982789 1945830
12283 1945830 1913992 1865653 1807918 1754141 1717030 1680923 1643436 1610209 1583034 1551516 1528504
12272 1528504 1508285 1476426 1450616 1443428 1436713 1418556 1403834 1386943 1351968 1321055 1293453 1264583
12260 1264583 1238571 1223654 1211984 1207915 1215119 1218767 1219393 1204044 1192132 1183090 1165393 1146325
12248 1146325 1131319 1122974 1111881 1104026 1109453 1115081 1123230 1130563 1135058 1136873 1124311 1108648 1084625
12235 1084625 1071411 1062637 1068980 1090342 1110541 1129574 1148329 1164519 1176471 1184803 1181986 1181400
12223 1181400 1181937 1180845 1179597 1179195 1186868 1200681 1231480 1287300 1370367 1465623 1583449 1714129
12211 1714129 1854287 2017761 2222335 2468382 2730531 2996870 3237186 3442127 3733455
$$ packed form
12294B481809n0005n3686n5914n1846n4260n6124n1410m5649m0490l9636l6959
12283A945830l1838m8339n7735n3777l7111l6107l7487l3227k7175l1518k3012
12272A528504k0219l1859k5810p188o715j8157j4722j6891l4975l0913k7602k8870
12260A264583k6012j4917j1670m069P204L648O26j5349j1912r042j7697j9068
12248A146325j5006q345j1093p855N427N628Q149P333M495J815j2562j5663k4023
12235A084625j3214q774O343K1362K0199J9033J8755J6190J1952Q332k817n86
12223A181400N37j092j248m02P673J3813L0799N5820Q3067R5256J17826J30680
12211A714129J40158J63474K04574K46047K62149K66339K40316K04941K91328
$$ plain form
12202 3733455 4274490 5129460 6248122 7451766 8505002 9177870 9248786 8725733 7809787
12193 7809787 6791149 5908733 5286204 4952665 4883510 5069453 5507982 6199885 7107408
12184 7107408 8101957 8990698 9554057 9623615 9238700 8592422 7930297 7412182 7066241 6900756
12174 6900756 6959382 7279504 7845719 8602754 9427257 10120580 10457562 10289379 9653997 8770387
12164 8770387 7926668 7276960 6831622 6569891 6475795 6538240 6745748 7145138 7795061 8740746
12154 8740746 9913788 11159014 12239586 12881368 13009527 12756413 12447275 12402137 12735552
12145 12735552 13446524 14463957 15702449 17094218 18478578 19659615 20484439 20857048
12137 20857048 20711623 20092863 19204060 18433979 18167706 18545930 19497699 20872005 22488141
$$ packed form
12202C733455N41035Q54970J118662J203644J053236O72868P0916n23053r15946
12193G809787j018638q82416o22529l33539o9155J85943M38529O91903R07523
12184G107408R94549Q88741N63359O9558l84915o46278o62125n18115l45941j65485
12174F900756N8626L20122N66215P57035Q24503O93323L36982j68183o35382q83610
12164H770387q43719o49708m45338k61731r4096O2445K07508L99390O49923R45685
12154H740746J173042J245226J080572O41782J28159k53114l09138m5138L33415
12145A2735552P10972J017433J238492J391769J384360J181037Q24824L72609
12137B0857048j45425o18760q88803p70081k66273L78224R51769J374306J616136
$$ plain form
12128 22488141 24166620 25759788 27234402 28828625 31040496 34590278 40278395 48840940
12120 48840940 60803883 76160877 93975780 112230770 128157362 138868488 142377478
12113 142377478 139071927 131515065 123492125 118307613 117839270 122954142 132710881 144096897
12105 144096897 153338522 156810660 152187335 140033762 123362966 105921080 90411694
12098 90411694 78068643 68840062 61855819 56307176 51787454 48251443 45796649 44350709
12090 44350709 43599477 43092658 42274943 40721711 38483504 35918223 33617179 32031831
12082 32031831 31225460 31095480 31492038 32234813 33101666 33821610 34177701 34082583 33552732
12073 33552732 32481277 30851637 28838801 26842904 25287749 24323389 23894112 23867364 24052762
$$ packed form
12128B2488141J678479J593168J474614J594223K211871L549782N688117Q562545
12120D8840940J1962943J5356994J7814903J8254990J5926592J0711126L508990
12113A42377478l305551p556862q022940n184512m68343N114872R756739J1386016
12105A44096897R241625L472138m623325j2153573j6670796j7441886j5509386
12098I0411694j2343051r228581o984243n548643m519722l536011k454794j445940
12090D4350709p51232n06819q17715j553232k238207k565281k301044j585348
12082C2031831q06371j29980L96558P42775Q66853P19944L56091r5118n29851
12073C3552732j071455j629640k012836j995897j555155r64360m29277k6748J85398
$$ plain form
12064 24052762 24220199 24098510 23496148 22384566 20968922 19550315 18349494 17423628 16746831
12055 16746831 16283583 16024118 15992154 16239386 16797752 17639131 18624629 19545252 20088077
12046 20088077 19939421 19080809 17766747 16396246 15288780 14535271 14105207 13952518 14078928
12037 14078928 14513554 15223119 16131908 17069147 17794261 18000954 17502448 16454861 15241979
12028 15241979 14281566 13835825 13917392 14402901 15058454 15613599 15757894 15308784 14328501
12019 14328501 13044356 11722659 10542991 9552357 8787154 8214562 7763408 7390293 7078821
12010 7078821 6819800 6591070 6380666 6178144 5979687 5783640 5592605 5425321 5270957
12001 5270957 5123901 4975633 4828813 4692265 4556157 4434512 4330433 4233900 4142149 4062160
$$ packed form
12064B4052762J67437j21689o02362j111582j415644j418607j200821r25866o76797
12055A6746831m63248k59465l1964K47232N58366Q41379R85498R20623N42825
12046B0088077j48656q58612j314062j370501j107466p53509m30064j52689J26410
12037A4078928M34626P09565R08789R37239P25114K06693m98506j047587j212882
12028A5241979r60413m45741Q1567M85509O55553N55145J44295m49110r80283
12019A4328501j284145j321697j179668r90634p65203n72592m51154l73115l11472
12010G078821k59021k28730k10404k02522j98457j96047j91035j67284j54364
12001E270957j47056j48268j46820j36548j36108j21645j04079r6533r1751p9989
$$ plain form
11991 4062160 3997197 3939182 3873425 3812211 3734243 3634955 3518247 3409089 3304341 3218544 3154861
$$ packed form
11991D062160o4963n8015o5757o1214p7968r9288j16708j09158j04748q5797o3683
$$ [...]
##END NTUPLES=NMR SPECTRUM
##END=
