##TITLE=Analysis number 319126
Compound Code cc 12504
Project Code adrs
Chemist Name fudan
##JCAMPDX= 6.0         $$ Bruker NMR JCAMP-DX V2.0
##DATA TYPE= NMR SPECTRUM
##DATA CLASS= NTUPLES
##ORIGIN= Bruker BioSpin GmbH
##OWNER= nmr
$$ XWIN-NMR		Version 3.5
$$ Wed May  3 11:00:18 2006 GMT Daylight Time (UT+1h)  MAYBRIDGE\nmr@NMR_250MHZ
##.OBSERVE FREQUENCY= 250.131544655141
##.OBSERVE NUCLEUS= ^1H
##.ACQUISITION MODE= SIMULTANEOUS (DQD)
##.ACQUISITION SCHEME= undefined
##.AVERAGES= 16
##.DIGITISER RES= 18
##SPECTROMETER/DATA SYSTEM= dpx250
##.PULSE SEQUENCE= zg30
##.SOLVENT NAME= CDCl3
##.SHIFT REFERENCE= (INTERNAL, CDCl3, 0, 16.522)
##AUDIT TRAIL= $$ (NUMBER, WHEN, WHO, WHERE, WHAT)
$$ ##TITLE= Audit trail, XWIN-NMR		Version 3.5
$$ ##JCAMPDX= 5.01
$$ ##ORIGIN= Bruker BioSpin GmbH
$$ ##OWNER= nmr
$$ C:\u/data/dgb/nmr/ADRS/3600/pdata/1/auditp.txt
$$ ##AUDIT TRAIL=  $$ (NUMBER, WHEN, WHO, WHERE, WHAT)
(   1,<2006-05-03 10:59:57.17 +100>,<MAYBRIDGE\nmr>,<NMR_250MHZ>,
      <created by zg, POWCHK disabled, PULCHK disabled
       configuration hash MD5:
       84 BC 41 DB A1 6E 1D 46 DA 25 12 A5 C1 ED C5 3A
       data hash MD5: 64K
       01 32 33 85 4B 41 D6 84 7C F2 3B C9 1A 58 84 09>)
(   2,<2006-05-03 11:00:08.74 +100>,<MAYBRIDGE\nmr>,<NMR_250MHZ>,
      <Start of raw data processing
       ef LB = 0.3 FT_mod = 6 PKNL = 1 SI = 32K 
       data hash MD5: 32K
       BB 82 B4 A7 FE AC E4 09 FB B9 39 2B C9 A0 B1 D8>)
(   3,<2006-05-03 11:00:10.32 +100>,<MAYBRIDGE\nmr>,<NMR_250MHZ>,
      <apk 
       data hash MD5: 32K
       F3 95 09 A5 78 37 9C 24 36 EA 0B FD 86 14 1C 5B>)
(   4,<2006-05-03 11:00:11.13 +100>,<MAYBRIDGE\nmr>,<NMR_250MHZ>,
      <abs ABSG = 5 
       data hash MD5: 32K
       E9 B5 F0 D6 EB 84 35 E3 4F 50 BF 33 45 30 64 16>)
$$ ##END=
$$ 
$$ hash MD5
$$ C5 EF 6B 8A 37 6A 32 C3 8C 0B 8B 82 D2 1E 2C 04
##$RELAX= 
##$RELAX= 
##$RELAX= 
##$RELAX= 
##$RELAX= 
##$RELAX= 
##$RELAX= 
$$ Bruker specific parameters
$$ --------------------------
##$DU= <C:\u>
##$EXPNO= 3600
##$NAME= <ADRS>
##$PROCNO= 1
##$TYPE= <nmr>
##$USER= <dgb>
##$AMP= (0..31)
100 100 100 100 100 100 100 100 100 100 100 100 100 100 100 100 100 100 
100 100 100 100 100 100 100 100 100 100 100 100 100 100 
##$AQSEQ= 0
##$AQ_mod= 3
##$AUNM= <au_zg>
##$AUTOPOS= <13 >
##$BF1= 250.13
##$BF2= 250.13
##$BF3= 250.13
##$BF4= 250.13
##$BF5= 500.13
##$BF6= 500.13
##$BF7= 500.13
##$BF8= 500.13
##$BYTORDA= 1
##$CFDGTYP= 0
##$CFRGTYP= 5
##$CHEMSTR= <none>
##$CNST= (0..31)
1 1 145 1 1 1 1 1 1 1 1 1 1 1 1 1 1 1 1 1 1 1 1 1 1 1 1 1 1 1 1 1 
##$CPDPRG= <>
##$CPDPRG1= <>
##$CPDPRG2= <>
##$CPDPRG3= <>
##$CPDPRG4= <mlev>
##$CPDPRG5= <mlev>
##$CPDPRG6= <mlev>
##$CPDPRG7= <mlev>
##$CPDPRG8= <mlev>
##$CPDPRGB= <>
##$CPDPRGT= <>
##$D= (0..31)
0 1 0 0 0 0 0 0 0 0.06 0 0 0 0 0 0 0.0002 0 0 0 0 0 0 0 0 0 0 0 0 0 0 
0 
##$DATE= 1146650395
##$DBL= (0..7)
120 120 120 120 120 120 120 120 
##$DBP= (0..7)
150 150 150 150 150 150 150 150 
##$DBP07= 0
##$DBPNAM0= <>
##$DBPNAM1= <>
##$DBPNAM2= <>
$$ [...]
##$SUBNAM7= <"">
##$SUBNAM8= <"">
##$SUBNAM9= <"">
##$SW= 20.6930455092707
##$SWIBOX= (0..15)
0 0 3 0 0 0 0 0 0 0 0 0 0 0 0 0 
##$SW_h= 5175.983436853
##$TD= 65536
##$TD0= 1
##$TE= 295.16
##$TE2= 300
##$TE3= 300
##$TEG= 300
##$TL= (0..7)
0 120 120 120 120 120 120 120 
##$TP= (0..7)
150 150 150 150 150 150 150 150 
##$TP07= 0
##$TPNAME0= <>
##$TPNAME1= <>
##$TPNAME2= <>
##$TPNAME3= <>
##$TPNAME4= <>
##$TPNAME5= <>
##$TPNAME6= <>
##$TPNAME7= <>
##$TPOAL= (0..7)
0.5 0.5 0.5 0.5 0.5 0.5 0.5 0.5 
##$TPOFFS= (0..7)
0 0 0 0 0 0 0 0 
##$TUNHIN= 0
##$TUNHOUT= 0
##$TUNXOUT= 0
##$USERA1= <user>
##$USERA2= <user>
##$USERA3= <user>
##$USERA4= <user>
##$USERA5= <user>
##$V9= 5
##$VALIST= <valist>
##$VCLIST= <CCCCCCCCCCCCCCC>
##$VD= 0
##$VDLIST= <DDDDDDDDDDDDDDD>
##$VPLIST= <PPPPPPPPPPPPPPP>
##$VTLIST= <TTTTTTTTTTTTTTT>
##$WBST= 1024
##$WBSW= 4
##$XGAIN= (0..3)
0 0 0 0 
##$XL= 0
##$YL= 0
##$YMAX_a= 726542
##$YMIN_a= -778362
##$ZGOPTNS= <>
##$ZL1= 120
##$ZL2= 120
##$ZL3= 120
##$ZL4= 120
##$ABSF1= 16.522
##$ABSF2= -4.171173
##$ABSG= 5
##$ABSL= 3
##$ALPHA= 0
##$AQORDER= 0
##$ASSFAC= 0
##$ASSFACI= 0
##$ASSFACX= 0
##$ASSWID= 0
##$AUNMP= <proc_1d>
##$AZFE= 0.1
##$AZFW= 0.1
##$BCFW= 0
##$BC_mod= 0
##$BYTORDP= 0
##$COROFFS= 0
##$CY= 12.5
##$DATMOD= 1
##$DC= 0
##$DFILT= <>
##$DTYPP= 0
##$F1P= 14.0000005364418
##$F2P= -0.99999901652339
##$FCOR= 0.5
##$FTSIZE= 32768
##$FT_mod= 6
##$GAMMA= 0
##$GB= 0
##$INTBC= 1
##$INTSCL= 1
##$ISEN= 128
##$LB= 0.3
##$LEV0= 0
##$LPBIN= 0
##$MAXI= 10000
##$MC2= 0
##$MEAN= 0
##$ME_mod= 0
##$MI= 0
##$NCOEF= 0
##$NC_proc= -2
##$NLEV= 6
##$NOISF1= 0
##$NOISF2= 0
##$NSP= 0
##$NTH_PI= 0
##$NZP= 0
##$OFFSET= 16.522
##$PC= 1
##$PHC0= 170.5397
##$PHC1= 3.970085
##$PH_mod= 1
##$PKNL= yes
##$PPARMOD= 0
##$PSCAL= 4
##$PSIGN= 0
##$REVERSE= no
##$SF= 250.13
##$SI= 32768
##$SIGF1= 0
##$SIGF2= 0
##$SINO= 400
##$SIOLD= 32768
##$SREGLST= <1H.CDCl3>
##$SSB= 0
##$STSI= 32768
##$STSR= 0
##$SW_p= 5175.98343685301
##$SYMM= 0
##$S_DEV= 0
##$TDeff= 65536
##$TDoff= 0
##$TI= <Analysis number 999999
Compound Code 99
Book Reference 9
Project Code 9>
##$TILT= no
##$TM1= 0
##$TM2= 0
##$TOPLEV= 0
##$USERP1= <user>
##$USERP2= <user>
##$USERP3= <user>
##$USERP4= <user>
##$USERP5= <user>
##$WDW= 1
##$XDIM= 32768
##$YMAX_p= 394742242
##$YMIN_p= -180768
$$ End of Bruker specific parameters
$$ ---------------------------------
##NTUPLES= NMR SPECTRUM
##VAR_NAME=  FREQUENCY,     SPECTRUM/REAL,   SPECTRUM/IMAG
##SYMBOL=    X,             R,               I
##VAR_TYPE=  INDEPENDENT,   DEPENDENT,       DEPENDENT
##VAR_FORM=  AFFN,          ASDF,            ASDF
##VAR_DIM=   32768,         32768,           32768
##UNITS=     HZ,            ARBITRARY UNITS, ARBITRARY UNITS
##FACTOR=    0.157963299565203, 1,           1
##FIRST=     4132.6476996994, 0,             0
##LAST=      -1043.33573715361, 0,           0
##MIN=       -1043.33573715361, -180768,     0
##MAX=       4132.6476996994, 394742242,     0
$$ Real data points
##PAGE= N=1
##DATA TABLE= (X++(R..R)), XYDATA
$$ [...]
$$ plain form
19702 -9299 -4505 57 -1617 -5441 -11468 -15838 -15849 -16640 -13973 -4841 -3572 -6162 -9305 -11123 -1652
19687 -1652 2014 753 -6820 -8331 -2252 -1620 -4640 -8679 -6250 -5605 89 358 5355 -3720 -13555
19672 -13555 -12394 -10617 -4592 2614 2644 3064 6821 5551 7765 2522 -9432 -9874 -6868 -4419 -7771
19657 -7771 -6159 -7833 -1556 -3799 -8520 -11448 -14914 -15061 -15737 -13690 -11321 1501 6053 12478 14210
19642 14210 8355 1206 5685 3276 -3191 -4693 -2244 -4939 -5509 -6281 -9229 -11319 -11481 -8614 -5838
19627 -5838 -3114 4211 5352 845 77 2457 1618 3106 -1543 -8458 -7850 -6373 -9332 -9647 -5088 1135
19611 1135 2520 -2815 -4713 142 1269 -3468 -5888 -3356 1375 2165 4425 -401 -619 -343 -7700
19596 -7700 -6483 -10196 -5106 -743 -4255 -10073 -8668 -4267 -3821 -3776 -7682 -14842 -14602 -10435 -5875 -10283
$$ packed form
19702i299M794M562j674l824o027m370j1p91K667R132J269k590l143j818R471
19687a652L666j261p573j511O079O32l020m039K429O45N694K69M997r075r835
19672a3555J161J777O025P206L0M20L757j270K214n243j1954m42L006K449l352
19657g771J612j674O277k243m721k928l466j47o76K047K369J2822M552O425J732
19642A4210n855p149M479k409o467j502K449k695n70p72k948k090j62K867K776
19627e838K724P325J141m507p68K380q39J488m649o915O08J477k959l15M559O223
19611A135J385n335j898M855J127m737k420K532M731P90K260m826k18K76p357
19596g700J217l713N090M363l512n818J405M401M46M5l906p160K40M167M560m408
$$ plain form
19580 -10283 -6279 1267 -2925 -6660 -4273 -4350 1290 8687 11009 7618 3734 -1152 419 -5238 -10544
19565 -10544 -9167 -3960 2808 6879 8488 3996 1418 2195 856 -3077 -5995 -4062 -6792 -8078 -1764
19550 -1764 -3336 -171 3005 3532 323 -2651 794 6109 952 -5159 -5393 -5973 -7756 -8455 -5088 -1186
19534 -1186 -784 2007 3257 2550 1347 232 229 -3493 -3541 2187 5530 -634 -7828 -14143 -18307 -17661 -12830
19517 -12830 -16214 -14965 -13038 -9624 -2302 -2482 -5141 -3901 -2233 -1240 -963 -7490 -5102 -5724 -11429
19502 -11429 -13410 -5895 2876 4179 738 -14099 -12404 -4104 -6368 -7223 -1832 468 1076 1318 1536
19487 1536 3595 8372 3085 2365 2390 688 -3374 -4607 -6298 -6089 -3518 4563 7223 721 -5616 -6373
19471 -6373 -4645 -585 4280 -5846 -10669 -11449 -5343 3203 1860 -84 -3623 -5325 990 4447 -1700
$$ packed form
19580a0283M004P546m192l735K387p7N640P397K322l391l884m886J571n657n306
19565a0544J377N207O768M071J609m492k578P77j339l933k918J933k730j286O314
19550a764j572L165L176N27l209k974L445N315n157o111k34n80j783o99L367L902
19534a186M02K791J250p07j203j115ll722m8N728L343o164p194o315m164O46M831
19517a2830l384J249J927L414P322j80k659J240J668R93K77o527K388o22n705
19502a1429j981P515Q771J303l441j4837J695Q300k264q55N391K300O08K42K18
19487A536K059M777n287p20K5j702m062j233j691K09K571Q081K660o502o337p57
19471f373J728M060M865j0126m823p80O106Q546j343j944l539j702O315L457o147
$$ plain form
19456 -1700 -4096 -20 -219 -4635 -12893 -6718 -3796 -174 980 -1907 -3978 -449 7524 7379 -4035
19441 -4035 -2910 -4430 -6040 -8785 -13623 -11335 -7902 -5134 2722 3028 -1071 1506 -1520 -2601 -668
19426 -668 1604 -684 894 -1314 -759 -413 -2392 -11762 -8298 1466 2202 -1398 -137 2058 4331 4377
19410 4377 3201 3419 2892 -247 -3536 -5539 -2209 4418 12762 18609 27918 30133 29742 41013 30130
19395 30130 14975 1277 543 4556 4245 4290 7280 5493 2455 4225 1150 -4516 -10419 -6473 -2657
19380 -2657 -2268 -2832 -4213 -8644 -9071 -7384 -5612 -8606 -1369 6150 261 -172 6725 1135 -5462 -3825
19364 -3825 719 4474 998 -5345 -7875 -13715 -9954 -1182 248 -1528 -6392 -8995 -3913 -5263 -7255
19349 -7255 -7387 -7768 -858 -1806 -2793 1883 6268 1992 626 -5919 -5017 -1996 -17 2307 12428 15978
$$ packed form
19456a700k396M076j99m416q258O175K922L622J154k887k071L529P973j45j1414
19441d035J125j520j610k745m838K288L433K768P856L06m099K577l026j081J933
19426f68K272k288J578k208N55L46j979r370L464R764P36l600J261K195K273M6
19410D377j176K18n27l139l289k003L330O627Q344N847R309K215l91J1271j0883
19395C0130j5155j3698p34M013l11M5K990j787l038J770l075n666n903L946L816
19380b657L89n64j381m431m27J687J772k994P237P519n889m33O897n590o597J637
19364c825M544L755l476o343k530n840L761Q772J430j776m864k603N082j350j992
19349g255j32l81O910r48r87M676M385m276j366o545R02L021J979K324J0121L550
$$ plain form
19333 15978 8475 1827 6632 8630 7552 10030 5959 4182 -3886 -8037 -9002 -7298 -8460 -5058 -6964
19318 -6964 -7692 -5787 -1945 -6876 -7738 2653 6856 2506 1965 3354 3154 2718 4553 5422 13458 10023
19302 10023 -2401 -8981 -11916 -16138 -15002 -14820 -10283 -7517 -5701 -5418 -4705 -1429 1054 -5976 -9210
19287 -9210 -7168 -4081 1349 -2933 -2064 2420 528 -2060 -5008 -4524 5546 -2481 -15532 -14077 -13792
19272 -13792 -9533 -7293 -10765 -17108 -15877 -9283 -6286 5374 7091 2108 2688 -384 -3687 -2467
19258 -2467 260 2719 4277 375 -1320 470 -10 -1294 -9416 -12420 -9210 -5197 -8135 -11962 -7296
19243 -7296 -2600 -1139 2102 24 2865 3608 2116 -1828 -617 2591 1264 -4009 -4822 -696 4387
19228 4387 3862 3296 -2367 -5745 -7233 -5016 -373 -770 -3381 -752 3409 -1329 -9291 -12687 -14996
$$ packed form
19333A5978p503o648M805J998j078K478m071j777q068m151r65J704j162L402j906
19318f964p28J905L842m931q62J0391M203m350n41J389k00m36J835Q69Q036l435
19302A0023j2424o580k935m222J136J82M537K766J816K83P13L276K483p030l234
19287i210K042L087N430m282Q69M484j892k588k948M84J0070q027j3051J455K85
19272a3792M259K240l472o343J231O594K997J1660J717m983N80l072l303J220
19258b467K727K459J558l902j695J790m80j284q122l004L210M013k938l827M666
19243g296M696J461L241k078K841P43j492l944J211L208j327n273q13M126N083
19228D387n25n66n663l378j488K217M643l97k611K629M161m738p962l396k309
$$ plain form
19213 -14996 -12676 -9153 -8413 -1385 -761 -4563 -9980 -12345 -8024 580 4868 7263 6533 108 3975
19198 3975 16665 12863 553 -9467 -12163 -7846 5241 7302 10188 10379 5051 2871 3226 7319
19184 7319 3267 -389 -3232 -6008 -7480 -11086 -7373 -4250 2970 3804 -4788 -17385 -13077 -11975 -14369
19169 -14369 -15421 -8666 -6240 -6259 -7718 -10032 -13498 -19224 -19626 -13944 -7223 -6214 -6852 -5224 -424
19154 -424 -4088 -9981 -16537 -18978 -8926 -3293 -12017 -7011 -1349 -6508 -7507 3072 6154 6250 3115
19139 3115 -3065 -11568 -12615 -10527 -9423 -9404 -8083 -7627 -7179 -12943 -8220 -2403 -8539 -11620 -9250 -14759
19123 -14759 -22900 -18217 -6895 -2064 1866 1428 187 -8406 -12612 -10500 -8528 -10918 -9144 -10360
19109 -10360 -4347 -3854 -13148 -9529 -1248 -2396 -3474 -2777 922 -130 -2340 -8601 -12872 -12412 -9240
$$ packed form
19213a4996K320L523P40P028O24l802n417k365M321Q604M288K395p30o425L867
19198C975J2690l802j2310j0020k696M317J3087K061K886J91n328k180L55M093
19184G319m052l656k843k776j472l606L713L123P220Q34q592j2597M308J102k394
19169a4369j052O755K426j9j459k314l466n726m02N682O721J009o38J628M800
19154d24l664n893o556k441J0052N633q724N006N662n159r99J0579L082R6l135
19139C115o180q503j047K088J104J9J321M56M48n764M723N817o136l081K370n509
19123a4759q141M683J1322M831L930m38j241q593m206K112J972k390J774j216
19109a0360O013M93r294L619Q281j148j078O97L699j052k210o261m271M60L172
$$ plain form
19094 -9240 -5275 -454 -3487 -4484 -5346 -1041 -2301 -6800 -8643 -10399 -7461 -6464 -9409 -3242 4025
19079 4025 245 -9207 -9240 -8032 -6561 -4618 834 3388 6038 2818 -10589 -17879 -16320 -12733 -16097
19064 -16097 -19895 -16089 -4713 3548 4938 431 2868 1875 676 2998 7352 3551 563 1323 -2054
19049 -2054 1217 -328 7781 13503 8441 5133 2736 -2036 -5023 -10154 -17747 -14472 -10045 -8136 -11123
19034 -11123 -11751 -3544 467 -947 -3175 -6427 -3533 -2417 -4720 -5922 -7591 -8520 -3255 2884 1469
19019 1469 -793 -7193 -8363 -13982 -8576 -7462 -4647 2839 -1632 -16053 -14825 -14200 -8873 -11012 -8485
19004 -8485 509 -1099 -2071 -4443 -11421 -3199 2686 -1513 -5477 -10749 -12252 -9908 -7646 -5484 -7344
18989 -7344 -4517 -125 5362 7529 974 -7863 -11944 -11003 -7790 -11665 -13946 -18370 -20297 -16108 -10996
$$ packed form
19094i240L965M821l033r97q62M305j260m499j843j756K938R97k945O167P267
19079D025l780r452l3J208J471J943N452K554K650l220j3407p290J559L587l364
19064a6097l798L806J1376Q261J390m507K437r93j199K322M354l801k988P60l377
19049b054L271j545Q109N722n062l308k397m772k987n131p593L275M427J909k987
19034a1123o28Q207M011j414k228l252K894J116k303j202j669r29N265O139j415
19019A469k262o400j170n619N406J114K815P486m471j4421J228O25N327k139K527
19004h485Q994j608r72k372o978Q222N885m199l964n272j503K344K262K162j860
18989g344K827M392N487K167o555q837m081R41L213l875k281m424j927M189N112
$$ plain form
18974 -10996 -6189 -10374 -11493 -13759 -14664 -12402 -11515 -575 3608 1937 3368 3089 -304 -5447 -5385
18959 -5385 -8449 -12710 -17805 -17834 -12613 -6801 -6758 -1567 4946 1522 -625 -2583 -5970 -2084 5070 6458
18943 6458 926 -1815 -6431 -4993 -5242 -3687 -3307 -2041 -7093 -5332 -1968 -398 -2346 -4824 -2325
18928 -2325 1756 -6795 -4164 -3057 -2133 -881 -1094 -3130 -7519 -5812 -3648 -6988 71 -4721 -15914
18913 -15914 -16486 -5906 -4613 -6966 -10140 -6937 -9031 -17686 -14397 -12871 -12425 -6833 -7156 -4298 -6180
18898 -6180 -8948 -6542 2870 4841 1135 943 -1826 -896 3890 2359 -1581 758 -4975 -12762 -14669
18883 -14669 -8520 -5216 -4657 2121 5838 3754 -2037 2696 7936 8298 2494 -4101 1026 -2567 -4441
18868 -4441 -4587 -12424 -13962 -5161 404 -3072 -5743 -7161 -10847 -8479 411 3292 12986 21230 17111
$$ packed form
18974a0996M807m185j119k266r05K262Q87J0940M183j671J431k79l393n143O2
18959e385l064m261n095k9N221N812M3N191O513l424k147j958l387L886P154J388
18943F458n532k741m616J438k49J555L80J266n052J761L364J570j948k478K499
18928b325M081q551K631J107R24J252k13k036m389J707K164l340P059m792j1193
18913a5914n72J0580J293k353l174L203k094q655L289J526M46N592l23K858j882
18898f180k768K406R412J971l706j92k769R30M786j531l940K339n733p787j907
18883a4669O149L304N59O778L717k084n791M733N240L62n804o595N127l593j874
18868d441j46p837j538Q801N565l476k671j418l686K368Q890K881R694Q244m119
$$ plain form
18853 17111 16056 11202 6702 7354 12260 18927 29271 31524 38213 42175 48971 52038 40211 25559
18839 25559 23509 18151 13840 12737 17453 18549 20384 26898 19163 12732 14757 9138 5390 7713
18825 7713 10705 15371 12633 10281 14886 14652 9087 5141 1787 7922 11504 3385 2539 13449 26452
18810 26452 27344 36035 44068 52686 57291 57573 58444 61546 50705 43277 40750 45591 58947 84254
18796 84254 93898 104762 111649 104648 82494 63169 59388 55829 47954 35934 34378 48993 59639
18783 59639 53388 53349 52386 47019 36704 32737 24539 19697 17559 14974 15686 17075 19757 18676 21105
18768 21105 21391 19658 28549 44248 50818 52742 60066 53038 36102 37339 39971 36956 27032 24486
18754 24486 24256 22972 24995 30359 31150 33551 56694 68258 66904 62008 49836 37441 37589 41963
$$ packed form
18853A7111j055m854m500O52M906O667J0344K253O689L962O796L067j1827j4652
18839B5559k050n358m311j103M716J096J835O514p735o431K025n619l748K323
18825G713K992M666k738k352M605k34n565l946l354O135L582q119q46J0910J3003
18810B6452Q92Q691Q033Q618M605K82Q71L102j0841p428k527M841J3356K5307
18796H4254R644J0864O887p001k2154j9325l781l559p875j2020j556J4615J0646
18783E9639o251l9r63n367j0315l967q198m842k138k585P12J389K682j081K429
18768B1105K86j733Q891J5699O570J924P324p028j6936J237K632l015r924k546
18754B4486k30j284K023N364P91K401K3143J1564j354m896j2172j2395J48M374
$$ plain form
18740 41963 41491 32920 36840 44077 45126 50460 53584 45735 34720 28429 18435 12411 9938 14706
18726 14706 19327 18076 23317 30659 31502 23781 13803 4060 13037 18789 16482 9604 4104 4374 9025
18711 9025 9947 11422 6437 6150 7309 7197 4075 1522 10743 10974 5266 2356 5271 4481 2865 -10388
18695 -10388 -17116 -14256 -8742 -7310 -2928 5103 9449 3996 -1893 -4824 -7267 -7669 1238 2701 -440
18680 -440 1259 1751 40 -860 -6401 -10157 -12993 -7408 -3256 -4752 -10632 -12297 -6742 -8141 -12314
18665 -12314 -8152 -4764 -5284 -3567 -5850 -6952 -4524 -7978 -6986 -2600 -3340 -7431 -12391 -12579 -10927
18650 -10927 -8261 -12180 -9027 -1727 2089 4218 1023 -7425 -8786 -11643 -9075 -4518 -4757 -4269 -4370
18635 -4370 -2410 -4103 -5687 -2909 3798 3899 865 -5982 -6536 -8654 -14941 -15571 -13109 -8893 -3400
$$ packed form
18740D1963m72q571L920P237J049N334L124p849j1015o291r994o024k473M768
18726A4706M621j251N241P342Q43p721r978r743Q977N752k307o878n500K70M651
18711I025R22J475m985k87J159j12l122k553R221K31n708k910K915p90j616j3253
18695a0388o728K860N514J432M382Q031M346n453n889k931k443m02Q907J463l141
18680d40J699M92j711r00n541l756k836N585M152j496n880j665N555j399m173
18665a2314M162L388n20J717k283j102K428l454R92M386p40m091m960j88J652
18650a0927K666l919L153P300L816K129l195q448j361k857K568M557k39M88j01
18635d370J960j693j584K778O707J01l034o847n54k118o287o30K462M216N493
$$ plain form
18620 -3400 -4232 -2068 -3085 -7094 -12125 -5497 -352 327 -1332 1850 1829 -571 -7132 -10257 -10392 -11451
18604 -11451 -3331 5382 4736 1388 -4026 -11350 -11885 -13224 -11651 -7321 -13133 -13472 -6220 1653 -483
18589 -483 -1189 3378 2310 1565 309 3031 3346 -1018 -7179 -11394 -12026 -7206 -4640 -5716 -7090 -7431
18573 -7431 -9392 -9786 -9396 -10165 -6938 -4806 -7622 -10477 -7455 -4592 -7561 -8883 -9754 -11121 -7453 -1939
18557 -1939 -8111 -13213 -11755 -17660 -20961 -14248 -8545 -9300 -11317 -8830 -2568 -1740 -4170 -4608 -5098 -3911
18541 -3911 -5190 -9382 -2750 -3347 -2862 -871 3163 9184 6184 -3987 -4525 -6157 -10345 -9040 -4691
18526 -4691 -8370 -6892 -2166 2202 -88 -8612 -21998 -19320 -13694 -10027 -3975 -1135 -4770 -5415 -10396
18511 -10396 -7208 -7795 -16285 -20603 -14226 -8053 -2493 4064 852 -1019 -625 1402 1074 -566 -8883
$$ packed form
18620c400q32K164j017m009n031O628N145O79j659L182k1k400o561l125j35j059
18604a1451Q120Q713o46l348n414p324n35j339J573M330n812l39P252P873k136
18589d83p06M567j068p45j256K722L15m364o161m215o32M820K566j076j374l41
18573g431j961l94L90p69L227K132k816k855L022K863k969j322q71j367L668N514
18557a939o172n102J458n905l301O713N703p55k017K487O262Q28k430m38m90J187
18541c911j279m192O632n97M85J991M034O021l000j0171n38j632m188J305M349
18526d691l679J478M726M368k290q524j3386K678N626L667O052K840l635o45m981
18511a0396L188n87q490m318O377O173N560O557l212j871L94K027l28j640q317
$$ plain form
18496 -8883 -10711 -16239 -14787 -4202 -908 -5413 -5567 -6479 -5080 1166 4352 6222 9761 5526 -737
18481 -737 -5270 -674 1818 -1399 -219 1312 1518 -64 2865 -7564 -11389 -4682 -489 -2289 -3394
18466 -3394 -7027 -5739 -3769 -7837 -7700 -7626 -4916 -2910 -6592 -16197 -11024 -8436 -10003 -6089 -7037 -6981
18450 -6981 -1296 -1418 -9052 -10683 -8110 -10956 -15780 -15185 -15360 -11133 -12087 -12056 -15683 -10982 -6276 3102
18434 3102 4595 3050 -10644 -17684 -15054 -11905 -11193 -10772 -4133 -2472 -5652 -11750 -8508 -3403 -1442
18419 -1442 1822 2625 -3317 -11562 -20336 -20115 -12657 -8558 -4081 -10280 -12308 -11826 -15212 -13258 -12800 -13558
18403 -13558 -9655 -5264 -3661 -4290 -8218 -10437 -14068 -14312 -13560 -10868 -5518 -8805 -9109 -8008 -1740
18388 -1740 -4813 -5352 -10898 -15262 -5341 -3521 -7066 -4210 3335 10765 11425 5443 5571 234 -3214
$$ packed form
18496h883j828n528J452J0585L294m505j54r12J399O246L186J870L539m235o263
18481g37m533M596K492l217J180J531K06j582K929j0429l825O707M193j800j105
18466c394l633J288J970m068J37P4K710K006l682r605N173K588j567L914r48N6
18450f981N685j22p634j631K573k846m824N95j75M227r54L1l627M701M706R378
18434C102J493j545j3694p040K630L149P12M21O639J661l180o098L242N105J961
18419a442L264Q03n942q245q774K21P458M099M477o199k028M82l386J954M58p58
18403a3558L903M391J603o29l928k219l631k44P52K692N350l287l04J101O268
18388a740l073n39n546m364R921J820l545K856P545P430O60n982J28n337l448
$$ plain form
18373 -3214 -8287 -8706 -3467 -4142 -6643 -5426 -1734 1057 2778 -4543 -894 -2954 -3415 -5645 -9442
18358 -9442 -11107 -9571 -9212 -12293 -12978 -6414 -4595 -4283 -3992 -5371 111 177 -3963 -9551 -5777 -2643
18342 -2643 -3528 -10105 -11788 -8798 -12748 -14041 -14391 -12249 -6741 -151 -3912 -5014 -5146 -10123 -1304
18327 -1304 -3289 -10166 -11511 -11485 -12402 -6186 -9156 -2968 -3376 -6770 -1658 -3197 -7897 -9909 -8305 -13324
18311 -13324 -13819 -14162 -5944 -3311 -1298 1910 5707 9150 368 2406 14383 18759 10193 -5253
18297 -5253 -12083 -11143 -13695 -16464 -17677 -12340 -6282 -2632 2247 3232 -4374 -5468 -4687 -4877 -7535 -4965
18281 -4965 75 -5986 -8910 -8593 -6784 -7655 -12532 -11243 -8412 -9204 -10013 -5972 -2182 2508 4715 7002
18265 7002 12516 12752 6032 798 -3712 -4879 -4096 -227 -3183 -4583 -6216 -6294 -5111 2443 13402
$$ packed form
18373c214n073m19N239o75k501J217L692K791J721p321L649k060m61k230l797
18358i442j665J536L59l081o85O564J819L12K91j379N482O6m140n588L774L134
18342b643q85o577j683K990l950j293l50K142N508O590l761j102j32m977Q819
18327a304j985o877j345K6r17O216k970O188m08l394N112j539m700k012J604n019
18311a3324m95l43Q218K633K013L208L797L443q782K038J1977M376q566j5446
18297e253o830R40k552k769j213N337O058L650M879R85p606j094P81j90k658K570
18281d965N040o061k924L17J809q71m877J289K831p92q09M041L790M690K207K287
18265G002N514K36o720n234m510j167P83L869k956j400j633p8J183P554J0959
$$ plain form
18250 13402 12708 2672 1745 2928 6228 7591 3153 -10392 -15159 -11047 2647 8775 14881 17318
18236 17318 10750 9926 9259 1466 -2053 -2087 -2169 1481 1933 466 -3876 -240 1413 4803 4684 2086
18220 2086 4124 9176 8068 6940 4448 6545 12550 17572 27388 39042 53620 79366 102503 107031
18206 107031 110955 118073 114039 98533 89143 91442 89991 86079 90762 92032 91213 90991 78349 78558
18192 78558 75820 65182 55438 48046 47651 57120 56980 55461 51952 51175 60327 64050 67649 78131 91795
18177 91795 102706 100605 98790 101758 109610 119451 128005 134081 145041 153660 156820 148583 132354 117232
18163 117232 105538 97069 99723 114325 120399 136740 141597 141523 143981 139592 130973 120348 116191 119583
18149 119583 116401 107205 108814 109109 100842 83562 74261 73636 76989 78493 82534 81695 74836 72309 70164
$$ packed form
18250A3402o94j0036r27J183L300J363m438j3545m767M112J3694O128O106K437
18236A7318o568q24o67p793l519l4q2L650M52j467m342L636J653L390j19k598
18220B086K038N052j108j128k492K097O005N022R816J1654J4578K5746K3137M528
18206A07031L924P118m034j5506r390K299j451l912M683J270q19k22j2642K09
18192G8558k738j0638r744p392l95R469j40j519l509p77R152L723L599J0482J3664
18177I1795J0911k101j815K968P852R841Q554O076J0960Q619L160q237j6229j5122
18163A17232j1694q469K654J4602O074J6341M857p4K458m389q619j0625m157L392
18149A19583l182r196J609K95q267j7280r301o25L353J504M041q39o859k527k145
$$ plain form
18134 70164 83019 92649 95456 103017 109722 116121 123731 125905 125378 134672 148031 165409 184143 201900
18120 201900 221604 234024 249769 271053 287624 305810 338466 387436 459091 558235 742118
18109 742118 1056980 1633973 2700469 4378509 6145522 7394389 8035930 6563860 3954146
18100 3954146 2448146 1747468 1380118 1148482 980880 858215 765013 681090 615781 570192
18090 570192 536754 512233 492144 479400 474422 467483 464339 455756 446881 438028 430679 429704 432363
18077 432363 441345 445473 441557 428355 413277 393028 374189 356518 334489 313451 302941 291219
18065 291219 276028 262640 261608 253327 242416 234632 222741 216829 205245 191140 183556 175271 176916
18052 176916 178322 178510 173185 168253 171327 162051 158207 150985 149671 150073 146062 144445 142209 142257 135605
$$ packed form
18134G0164J2855R630K807P561O705O399P610K174n27R294J3359J7378J8734J7757
18120B01900J9704J2420J5745K1284J6571J8186L2656M8970P1655R9144J83883
18109G42118L14862N76993J066496J678040J767013J248867O41541j472070k609714
18100C954146j506000p00678l67350k31636j67602j22665r3202q3923o5309m5589
18090E70192l3438k4521k0089j2744m978o939l144q583q875q853p349r75K659
18077D32363Q982M128l916j3202j5078k0249j8839j7671k2029k1038j0510j1722
18065B91219j5191j3388j032q281j0911p784j1891n912j1584j4105p584q285J645
18052A76916J406J88n325m932L074r276l844p222j314M02m011j617k236M8o652
$$ plain form
18037 135605 120230 108753 108679 113433 116388 117734 119840 115869 103815 101457 100532 94765 91659 94483
18023 94483 86129 83137 88183 80836 80306 75774 64378 62909 64395 69772 69284 68337 68594 66573 60824
18008 60824 58911 55923 53568 48855 43856 46831 50511 49564 46244 46421 49694 48780 42205 40418 41788
17993 41788 46618 47543 50757 47494 41048 36110 41859 48208 48159 44224 43187 41214 35958 36472 40011
17978 40011 48884 49387 47403 39016 29028 25870 18138 21934 25417 28932 23614 28116 25867 26298 32895
17963 32895 34858 38636 30332 26869 19748 17687 22159 21925 24309 28901 33136 29711 33389 31477 30701
17948 30701 30694 25221 22410 24647 18964 14402 7395 13161 13458 3640 -6249 -1638 6039 9110 7975
17933 7975 17080 15142 7292 1523 268 1204 5835 5372 5162 12654 11405 11263 5479 6417 8385 4149
$$ packed form
18037A35605j5375j1477p4M754K955J346K106l971j2054k358r25n767l106K824
18023I4483q354k992N046p347n30m532j1396j469J486N377m88r47K57k021n749
18008F0824j913k988k355m713m999K975L680r47l320J77L273r14o575j787J370
17993D1788M830R25L214l263o446m938N749O349m9l935j037j973n256N14L539
17978D0011Q873N03j984q387r988l158p732L796L483L515n318M502k249M31O597
17963C2895J963L778q304l463p121k061M472k34K384M592M235l425L678j912p76
17948C0701pn473k811K237n683m562p007N766K97r818r889M611P677L071j135
17933G975R105j938p850n769j255R36M631m63k10P492j249j42n784R38J968m236
$$ plain form
17917 4149 3534 3818 4181 9865 11182 12952 13038 12900 17687 30040 23319 14614 8925 7902 7572 11642
17901 11642 8160 14188 19162 21876 28366 26255 21796 17560 17482 11613 4069 -604 -1029 4176 8947
17886 8947 7967 6359 5624 9174 14005 10191 11616 10734 1107 -4814 -2453 5498 11670 15692 15482 12734
17870 12734 7327 5666 1190 -957 5377 1779 -8824 -5224 673 1449 2200 132 476 833 -5275
17855 -5275 -3622 4656 5722 328 103 2088 -1056 -2273 4611 2720 2412 7371 4102 6630 4520
17840 4520 3076 5122 5430 4812 4819 5005 3212 4695 15435 21913 20961 20183 8514 -4151 -9763 -6655
17824 -6655 -4031 2896 6948 9878 10791 10660 3123 -2529 -2630 2724 8614 5823 2562 1678 4962 14528
17808 14528 17652 14704 17202 17692 21585 18270 9434 3491 -431 -5619 -909 4382 3896 1664 -3903
$$ packed form
17917D149o15K84L63N684J317J770Q6j38M787J2353o721q705n689j023l30M070
17901A1642l482O028M974K714O490k111m459m236p8n869p544m673m25N205M771
17886H947r80j608p35L550M831l814J425q82r627n921K361P951O172M022k10k748
17870A2734n407j661m476k147O334l598j0603L600N897P76P51k068L44L57o108
17855e275J653Q278J066n394k25J985l144j217O884j891l08M959l269K528k110
17840D520j444K046L08o18PJ86j793J483J0740O478r52p78j1669j2665n612L108
17824f655K624O927M052K930R13j31p537n652j01N354N890k791l261q84L284R566
17808A4528L124k948K498M90L893l315q836n943l922n188M710N291m86k232n567
$$ plain form
17793 -3903 93 3373 67 1511 -657 -1537 -5334 -5664 -6389 -7918 -3879 2345 1665 5045 6435 10803
17777 10803 13682 13903 10421 7300 9033 4588 95 1929 3335 1559 4466 3795 8391 13503 11872
17762 11872 5495 5004 2895 5939 6559 -976 -8050 -11105 -8914 -10060 -11911 -15555 -14195 -5393 -702
17747 -702 2790 4425 -2103 -2214 995 6264 1679 -5334 -9138 -2880 -3334 -6024 -6382 -5807 3479 9241
17731 9241 7511 4320 790 -2170 944 -598 -872 2894 9504 10210 12680 4761 -3802 2610 11875
17716 11875 16860 14402 13198 17325 18270 11117 5909 3917 5027 4224 -5171 -5529 -6181 -11690 -12257 -15473
17700 -15473 -9925 -4828 -8451 -9256 -9557 -7644 -5554 -3884 -7863 -10668 -5678 -2408 -6571 -11288 -6908
17685 -6908 -915 2752 -1898 -5963 -3554 1929 8315 -862 -2264 1349 4370 -1010 2691 6451 -983
$$ packed form
17793c903L996L280l306J444k168q80l797l30p25j529M039O224o80L380J390M368
17777A0803K879K21l482l121J733m445m493J834J406j776K907o71M596N112j631
17762A1872o377m91k109L044O20p535p074l055K191j146j851l644J360Q802M691
17747g02L492J635o528j11L209N269m585p013l804O258m54k690l58N75R286N762
17731I241j730l191l530k960L114j542k74L766O610P06K470p919q563O412R265
17716A1875M985k458j204M127R45p153n208j992J110q03r395l58o52n509n67l216
17700a5473N548N097l623q05l01J913K090J670l979k805M990L270m163m717M380
17685f908N993L667m650m065K409N483O386r177j402L613L021n380L701L760p434
$$ plain form
17670 -983 -12365 -13159 -2855 -2213 -3017 -2543 -4219 -3071 -1869 2958 9200 9522 4313 6048 5771 5949
17654 5949 14081 16707 18214 19491 26131 29036 28009 21812 22548 27286 43643 55641 65604 84223
17640 84223 110427 141841 191275 247763 305372 357259 408899 443283 457885 460073 445935 417591
17628 417591 360009 303147 255838 215938 170504 134702 111961 105172 92479 81914 74586 69235
17616 69235 62118 61343 60384 59740 59718 57900 52442 53132 50881 48449 47600 49364 48996 42876 44307 43870 44321
17599 44321 42519 39233 38101 41744 40428 44075 39273 31917 30211 37574 35020 26104 25006 26109
17585 26109 20708 21789 25289 23712 25699 24568 21788 18750 22040 18281 12802 20638 24096 19525
17571 19525 13660 20739 25636 21462 18000 20264 17600 8065 12544 18620 21169 23623 21194 15823
$$ packed form
17670i83j1382p94J0304O42q04M74j676J148J202M827O242L22n209J735k77J78
17654E949Q132K626J507J277O640K905j027o197P36M738J6357J1998R963J8619
17640H4223K6204L1414M9434N6488N7609N1887N1640L4384J4602K188j4138k8344
17628D17591n7582n6862m7309l9900m5434l5802k2741o789j2693j0565p328n351
17616F9235p117p75r59o44k2j818n458O90k251k432q49J764l68o120J431m37M51
17599D4321j802l286j132L643j316L647m802p356j706P363k554q916j098J103
17585B6109n401J081L500j577J987j131k780l038L290l759n479P836L458m571
17571A9525n865P079M897m174l462K264k664r535M479O076K549K454k429n371
$$ plain form
17557 15823 12364 10711 8812 10828 15058 18534 20477 22871 16359 14763 18711 20771 20263 23378 26222
17542 26222 22199 19408 16276 19524 16270 12402 11203 16141 14255 6065 385 -7236 -3018 -3738 -8605
17527 -8605 -7852 -3609 -2571 -914 -1792 -3400 -3725 212 6403 8841 8762 5368 3947 6297 8352 15838
17511 15838 24559 25426 12846 8930 16523 8075 -618 -467 -570 3064 3418 4735 4363 6083 10245
17496 10245 16614 10333 3812 -1622 -4762 3732 5150 -983 1466 1292 -2804 -5483 -3881 1490 -144
17481 -144 869 -3322 84 5370 8620 8342 4357 -400 -4458 -5362 -7106 2341 11284 7138 3338
17466 3338 3150 2868 4708 9867 5306 1534 1132 271 -713 -595 -977 -714 -2513 -250 -474 1065 3726
17449 3726 3566 3459 -1989 -5980 -1913 413 846 2243 6209 11856 22064 27111 29379 32486 29323
$$ packed form
17557A5823l459j653j899K016M230L476J943K394o512j596L948K060n08L115K844
17542B6222m023k791l132L248l254l868j199M938j886q190n680p621M218p20m867
17527h605P53M243J038J657q78j608l25L937O191K438p9l394j421K350K055P486
17511A5838Q721Q67j2580l916P593q448q693J51j03L634L54J317l72J720M162
17496A0245O369o281o521n434l140Q494J418o133K449j74m096k679J602N371j634
17481a44J013m191L406N286L250k78l985m757m058r04j744R447Q943m146l800
17466C338j88k82J840N159m561l772m02q61r84J18l82K63j799K263k24J539K661
17449C726j60j07n448l991M067K326M33J397L966N647J0208N047K268L107l163
$$ plain form
17434 29323 22090 24282 22343 19687 10653 5609 4255 8889 17885 15326 8828 1726 8715 10846
17420 10846 7100 403 -861 7944 4887 3474 6882 9372 6135 5291 7719 12627 13869 15330 12577
17405 12577 5840 1870 7640 9521 10728 8721 2836 -1897 2897 11037 16229 20501 20212 16031 11748
17390 11748 12007 13549 10601 11921 11386 9362 2070 -2267 2409 -742 1036 -2127 -8598 -9339 -9977
17375 -9977 -981 5994 4802 7664 2026 -3010 -894 2230 2467 7771 15597 17119 15371 12390 10815
17360 10815 10825 5299 7448 10313 6135 7254 10918 5074 5505 12158 8621 4081 4285 8533 7944 11784
17344 11784 16112 24424 26395 27180 27643 28354 29547 36222 38542 45832 53305 61044 57019 53943 46491
17329 46491 49501 51429 47598 41769 41289 44942 47371 45836 44515 47009 43772 30079 26452 23915
$$ packed form
17434B9323p233K192j939k656r034n044j354M634Q996k559o498p102O989K131
17420A0846l746o697j264Q805l057j413L408K490l237q44K428M908J242J461k753
17405A2577o737l970N770J881J207k007n885m733M794Q140N192M272k89m181m283
17390A1748K59J542k948J320n35k024p292m337M676l151J778l163o471p41o38
17375i977Q996O975j192K862n638n036K116L124K37N304P826J522j748k981j575
17360A0815J0n526K149K865m178J119L664n844M31O653l537m540K04M248n89L840
17344A1784M328Q312J971P85M63P11J193O675K320P290P473P739m025l076p452
17329D6491L010J928l831n829m80L653K429j535j321K494l237j3693l627k537
$$ plain form
17315 23915 26790 32620 25872 22953 16638 16407 15562 15540 17459 22821 22429 17871 11555 4349 4659 14422
17299 14422 20031 8767 3789 -2114 -1527 807 -1229 -7249 -13240 -16315 -13777 -7413 -9244 -9636 -8400
17284 -8400 -8705 -10013 -11058 -16705 -21831 -27592 -38992 -46191 -48308 -52740 -47471 -35124 -21484 -11732
17270 -11732 8698 28086 44854 57605 80060 92589 90154 83249 76578 69404 73530 80463 80804
17257 80804 80881 83852 81570 78333 72052 72697 64107 63268 60774 59646 59200 57513 52798 53665 51215 49105
17241 49105 56090 56408 47510 43020 50686 61396 65403 67569 67077 74491 83699 89837 85661 87908 91991
17226 91991 98416 96136 99480 104739 105923 112436 114386 116944 112495 110983 115294 124075 126608 120950
17212 120950 121578 121272 105993 94087 85321 73929 54032 36242 17819 4930 -8423 -9584 -9429
$$ packed form
17315B3915K875N830o748k919o315k31q45k2J919N362l92m558o316p206L10R763
17299A4422N609j1264m978n903N87K334k036o020n991l075K538O364j831l92J236
17284h400l05j308j045n647n126n761j1400p199k117m432N269J2347J3640R752
17270a1732K0430J9388J6768J2751K2455J2529k435o905o671p174M126O933L41
17257H0804P7K971k282l237o281O45q590q39k494j128m46j687m715Q67k450k110
17241D9105O985L18q898m490P666J0710M007K166m92P414R208O138m176K247M083
17226I1991O425k280L344N259J184O513J950K558m449j512M311Q781K533n658
17212A20950O28l06j5279j1906q766j1392j9897j7790j8423j2889j3353j161J55
$$ plain form
17199 -9429 -22050 -21107 -11249 -396 15871 28250 34887 50818 59419 66630 77778 91535 96634
17186 96634 95991 99602 107771 109289 117036 122954 130363 132458 135232 134088 130232 128306 122861 113591 105873
17171 105873 102023 99159 103610 105724 107843 110255 108588 114198 118662 124237 124717 131824 136772 140510
17157 140510 148464 147659 152937 160405 156282 153134 153711 153093 154757 152925 157066 166628 176519 185722 198742
17142 198742 208728 223204 231208 240903 252516 258861 270318 287255 308520 327945 334580 338717 347671
17129 347671 350882 353652 353918 361192 365465 375244 387412 409883 435272 449743 480954 518922 554654
17116 554654 581490 627892 687157 748685 819638 905429 1000942 1095853 1200122 1310922 1408350
17105 1408350 1492013 1592110 1710165 1852084 2016409 2240690 2529778 2887339 3322860 3836816
$$ packed form
17199i429j2621R43R858J0853J6267J2379O637J5931Q601P211J1148J3757N099
17186I6634o43L611Q169J518P747N918P409K095K774j144l856j926n445r270p718
17171A05873l850k864M451K114K119K412j667N610M464N575M80P107M948L738
17157A40510P954q05N278P468m123l148N77o18J664j832M141R562R891R203J3020
17142A98742R986J4476Q004R695J1613O345J1457J6937K1265J9425O635M137Q954
17129C47671L211K770K66P274M273R779J2168K2471K5389J4471L1211L7968L5732
17116E54654K6836M6402N9265O1528P0953Q5791R5513R4911J04269J10800R7428
17105A408350Q3663J00097J18055J41919J64325K24281K89088L57561M35521N13956
$$ plain form
17095 3836816 4477944 5280082 6295284 7629823 9529206 12361700 16530626 22311726
17087 22311726 29743250 38851128 49393890 60188750 70143258 79062749 85091171 85894991
17079 85894991 83613354 80479037 74023245 63258159 52313461 43438034 35584175 28494552
17071 28494552 23024386 19295525 16795622 15045112 13773122 12826556 12088003 11499173
17063 11499173 11037229 10659398 10317228 10030162 9814389 9660426 9540173 9447831 9378056 9298584
17053 9298584 9188102 9041953 8866866 8650396 8369273 8042952 7701759 7365920 7021003
17044 7021003 6691275 6380617 6106232 5858664 5631086 5409759 5207691 5021698 4846198
17035 4846198 4670699 4511512 4359060 4207404 4072980 3949164 3830919 3715950 3612676
$$ packed form
17095C836816O41128Q02138J015202J334539J899383K832494M168926N781100
17087B2311726P431524R107878J0542762J0794860R954508Q919491O028422Q03820
17079H5894991k281637l134317o455792j0765086j0944698q875427p853859p089623
17071B8494552n470166l728861k499903j750510j271990r46566p38553n88830
17063A1499173m61944l77831l42170k87066k15773j53963j20253r2342o9775p9472
17053I298584j10482j46149j75087k16470k81123l26321l41193l35839l44917
17044G021003l29728l10658k74385k47568k27578k21327k02068j85993j75500
17035D846198j75499j59187j52452j51656j34424j23816j18245j14969j03274
$$ plain form
17026 3612676 3514977 3420959 3334998 3265127 3187686 3105384 3037870 2977265 2909240 2847201 2790146
17015 2790146 2732669 2682399 2627832 2572470 2520049 2468391 2413294 2360969 2311300 2261661 2222934
17004 2222934 2175031 2113945 2060634 2027832 1984875 1944193 1907532 1868507 1835439 1800990 1762977
16993 1762977 1731016 1692579 1658731 1631676 1598845 1571984 1544677 1515939 1478029 1444906 1415910
16982 1415910 1384831 1360153 1334458 1308428 1285698 1266729 1240640 1223493 1202499 1183279 1167906
16971 1167906 1154961 1131222 1106944 1090267 1068690 1061933 1059733 1053654 1029037 1003501 979090 958261
16959 958261 938749 918666 901343 877220 842935 813061 785850 766082 746308 718282 701546
16948 701546 686110 662425 639683 623556 609580 598396 601471 599428 592112 581722 562097 549093
$$ packed form
17026C612676r7699r4018q5961o9871p7441q2302o7514o0605o8025o2039n7055
17015B790146n7477n0270n4567n5362n2421n1658n5097n2325m9669m9639l8727
17004B222934m7903o1086n3311l2802m2957m0682l6661l9025l3068l4449l8013
16993A762977l1961l8437l3848k7055l2831k6861k7307k8738l7910l3123k8996
16982A415910l1079k4678k5695k6030k2730j8969k6089j7147k0994j9220j5373
16971A167906j2945k3739k4278j6677k1577o757k200o079k4617k5536k4411k0829
16959I58261j9512k0083j7323k4123l4285k9874k7211j9768j9774k8026j6736
16948G01546j5436k3685k2742j6127j3976j1184L075k043p316j0390j9625j3004
$$ plain form
16936 549093 539057 531841 525645 518539 507339 493520 482042 482488 483748 477602 477998 471550 460906
16923 460906 451820 442176 435936 414596 401448 392870 382283 373094 363550 355028 337563 318105 311867
16910 311867 308670 298737 289543 281538 276332 267860 263382 255461 243130 240433 228321 215275 205683
16897 205683 201240 202526 200639 210447 224965 234433 255869 269937 275358 285549 295757 294765 291136
16884 291136 286592 281298 276848 271127 267424 261187 243654 233288 237152 234344 235292 227518 220849 220661
16870 220661 214048 208799 209742 206821 205154 202870 204936 205284 204650 197569 192309 186866 181131 175320 170470
16855 170470 170185 164134 155603 152980 143784 131466 127648 129917 138143 132342 126927 127582 133255 134847
16841 134847 127952 123319 115825 116389 119009 115213 115243 116632 118748 112954 107689 103099 103802 109060 109245
$$ packed form
16936E49093j0036p216o196p106j1200j3819j1478M46J260o146L96o448j0644
16923D60906r086r644o240k1340j3148q578j0587r189r544q522j7465j9458o238
16910C11867l197r933r194q005n206q472m478p921j2331k697j2112j3046r592
16897B05683m443J286j887R808J4518R468K1436J4068N421J0191J0208r92l629
16884B91136m544n294m450n721l703o237j7533j0366L864k808R48p774o669j88
16870B20661o613n249R43k921j667k284K066L48o34p081n260n443n735n811m850
16855A70470k85o051q531k623r196j2318l818K269Q226n801n415O55N673J592
16841A34847o895m633p494N64K620l796L0J389K116n794n265m590P03N258J85
$$ plain form
16826 109245 105658 108398 109580 105533 100473 99195 94827 95846 91964 80689 70380 75362 83869 85106
16812 85106 83268 83174 80033 79376 81678 78758 79498 75915 69187 61962 67718 72298 74543 69476 68858 67830
16796 67830 58146 52935 59782 68752 61533 54892 55333 55071 54645 57820 59260 59783 54571 51422 57877
16781 57877 60961 61441 60788 59343 54681 49806 45553 44138 43404 35996 34900 29132 32953 36577 30392
16766 30392 25061 28249 32411 29808 30328 33241 41018 43213 41321 36726 34519 36194 35854 28993 25310
16751 25310 23787 23881 30315 35478 38242 33376 34577 33993 26528 21270 23623 28517 28045 33374 33443 34225
16735 34225 31734 28472 30028 27511 20696 21238 19076 15737 13043 15030 15518 16237 20076 21856 23317
16720 23317 22840 19059 18268 17498 17010 18548 19777 20357 15311 13377 15915 16277 18413 19723 19906 18569
$$ packed form
16826A09245l587K740J182m047n060j278m368J019l882j1275j0309M982Q507J237
16812H5106j838r4l141o57K302k920P40l583o728p225N756M580K245n067o18j028
16796F7830r684n211O847Q970p219o641M41k62m26L175J440N23n212l149O455
16781E7877L084M80o53j445m662m875m253j415p34p408j096n768L821L624o185
16766C0392n331L188M162k603N20K913P777K195j892m595k207J675l40o861l683
16751B5310j523R4O434N163K764m866J201n84p465n258K353M894m72N329O9P82
16735C4225k491l262J556k517o815N42k162l339k694J987M88P19L839J780J461
16720B3317m77l781p91p70m88J538J229N80n046j934K538L62K136J310J83j337
$$ plain form
16704 18569 17416 11006 17730 25748 26196 28857 31262 25744 15757 11192 13331 18545 19998 22079 26124
16689 26124 22782 17701 17430 24279 19116 11913 7303 14089 20949 14780 10615 15779 22929 21253 16748
16674 16748 13428 16116 12881 4333 6524 14304 13220 13388 14837 9652 12048 15786 11120 1286 3636
16659 3636 1162 75 2487 4432 4384 5843 12634 11715 8071 6949 7513 5043 4004 6146 11367 12744
16643 12744 3373 -4809 -2703 2192 5026 8456 5103 -1470 4281 1532 -7716 -7161 -4713 -1944 -2052
16628 -2052 2658 440 -10 789 -6346 -9925 -2041 2639 3619 1832 -2349 -5109 664 3754 3445 3023
16612 3023 4706 217 2031 7543 9380 7020 12303 16615 15136 7539 3167 3303 -727 -3176 -5195
16597 -5195 -10042 -15143 -21065 -13098 -11279 -14912 -10353 -873 1354 8176 1753 -2135 81 -299 1758
$$ packed form
16704A8569j153o410O724Q018M48K661K405n518r987m565K139N214J453K081M045
16689B6124l342n081k71O849n163p203m610O786O860o169m165N164P150j676m505
16674A6748l320K688l235q548K191P780j084J68J449n185K396L738m666r834K350
16659C636k474j087K412J945m8J459O791r19l644j122N64k470j039K142N221J377
16643A2744r371q182K106M895K834L430l353o573N751k749r248N55K448K769j08
16628b052M710k218m50P99p135l579P884M680R80j787m181k760N773L090l09m22
16612C023J683m489J814N512J837k360N283M312j479p597m372J36m030k449k019
16597e195m847n101n922P967J819l633M559R480K227O822o423l888K216l80K057
$$ plain form
16582 1758 3454 1657 -3820 -3052 -4919 -8961 -5064 -6208 -10582 -5171 1039 9765 6425 -1260 127
16567 127 4394 4185 2046 -1708 428 1258 -3179 -2376 2195 4238 3839 857 -3701 5569 10541 6124
16551 6124 2636 1715 3698 3374 7497 14194 18749 15879 15967 8287 6365 7532 7793 11322 25876 25897
16535 25897 18873 16014 29181 48566 66368 86358 122691 177339 233228 290634 341873 389177
16523 389177 431954 458645 461169 449055 422717 373166 311719 259270 210666 163138 127906 112709
16511 112709 105445 89739 76720 74354 73734 62429 59667 51543 46536 53297 57661 52647 53342 55290
16497 55290 53249 45361 43335 48264 47423 41245 39778 40865 49463 52211 45458 33043 29738 28673
16483 28673 23136 19724 17535 19380 24312 27379 23871 23595 21529 29087 28244 21920 19581 16553 15336
$$ packed form
16582A758J696j797n477P68j867m042L897j144m374N411O210Q726l340p685J387
16567A27M267k09k139l754K136Q30m437Q03M571K043l99k982m558R270M972m417
16551F124l488r21J983l24M123O697M555k870Q8p680j922J167K61L529J4554K1
16535B5897p024k859J3167J9385J7802J9990L6333N4648N5889N7406N1239M7304
16523C89177M2777K6691K524j2114k6338m9551o1447n2449m8604m7528l5232j5197
16511A12709p264j5706j3019k366o20j1305k762q124n007O761M364n014O95J948
16497E5290k041p888k026M929q41o178j467J087Q598K748o753j2415l305j065
16483B8673n537l412k189J845M932L067l508k76k066P558q43o324k339l028j217
$$ plain form
16468 15336 12366 12181 12089 4318 5968 6933 2022 204 1299 973 7866 10469 7286 9660 16837 15004
16452 15004 8977 3888 3312 4662 9091 6721 6169 8250 10137 4936 -4382 -3221 -1933 1868 5650
16437 5650 4195 695 3196 8454 4956 -259 3209 6571 1643 2008 4192 5191 4268 774 -4866
16422 -4866 -6410 -399 2158 525 -205 -6002 -5232 -5870 -5365 346 4193 1970 1041 1998 396 -2013
16406 -2013 -5000 -8425 -7047 -1566 616 2680 5854 -469 -5765 -1642 6306 9500 6559 1283 -2463
16391 -2463 -6361 -11669 -8877 -3584 -2254 1897 3418 1540 -3023 -4621 -5469 -7038 -7472 -6459 -6834
16376 -6834 -7796 983 245 90 -2193 -1387 217 -2148 -7528 -15303 -11796 -3127 4822 6828 -2538 2331
16360 2331 209 -2719 674 8425 5672 4794 6198 61 -6234 -5327 -6837 -8789 -23816 -28761 -22120
$$ packed form
16468A5336k970j85r2p771J650R65m911j818J095l26O893K603l183K374P177j833
16452A5004o027n089n76J350M429k370n52K081J887n201r318J161J288L801L782
16437E650j455l500K501N258l498n215L468L362m928L65K184R99r23l494n640
16422d866j544O011K557j633p30n797P70o38N05N711L847k223r29R57j602k409
16406b013k987l425J378N481K182K064L174o323n296M123P948L194k941n276l746
16391b463l898n308K792N293J330M151J521j878m563j598q48j569m34J013l75
16376f834r62Q779p38j55k283Q06J604k365n380p775L507Q669P949K006r366M869
16360B331k122k928L393P751k753q78J404o137o295R07j510j952j5027m945O641
$$ plain form
16345 -22120 -18563 -11412 -7905 -8107 -7923 -3326 -2225 -2763 -2933 23 -181 -1210 54 8566 9626 2186
16329 2186 -3079 -8182 -16522 -13294 -2603 1618 -2270 -13852 -13235 -7249 -19 3055 -3310 2825
16315 2825 6874 5872 3701 5299 1718 -5530 -6767 -6878 -3151 -2795 -3693 -3772 867 1317 -6455 -8127
16299 -8127 -12464 -9419 -16384 -18910 -16037 -9303 -5890 488 226 -4825 -6024 -5642 -5530 -5477 -1545 -271
16283 -271 -5382 -9527 -5221 -2688 -6571 -9922 -9754 190 1956 -761 -1854 -4681 -933 483 1039
16268 1039 -2410 -5572 -4235 -9035 -13083 -9265 -5757 -5665 -3399 -7906 -6846 -2743 -5902 -947 -1679
16253 -1679 1674 1545 2938 -6016 -11395 -12978 -13258 -12617 -12186 -14075 -10613 -6489 1145 3018 37 -4305
16237 -4305 -7023 -9622 -6473 -10020 -6264 -26 -9 -4697 -7709 -5081 -940 -1065 -4302 -700 2645
$$ packed form
16345b2120L557P151L507k02J84M597J101n38j70K956k04j029J264Q512J060p440
16329B186n265n103q340L228J0691M221l888j1582O17N986P230L074o365O135
16315B825M049j002k171J598l581p248j237j11L727L56q98p9M639M50p772j672
16299h127m337L045o965k526K873O734L413O378k62n051j199L82J12N3L932J274
16283b71n111m145M306K533l883l351J68R944J766k717j093k827L748J416N56
16268A039l449l162J337m800m048L818L508R2K266m507J060M103l159M955p32
16253a679L353j29J393q954n379j583k80O41M31j889L462M124P634J873k981m342
16237d305k718k599L149l547L756O238J7m688l012K628M141j25l237L602L345
$$ plain form
16222 2645 -2589 -4763 -2207 4845 170 -11901 -21434 -20072 -17081 -11992 -10678 -4765 -2153 753
16208 753 -939 -2748 -3165 -1786 -8518 -10922 -14357 -13246 -11620 -12054 -8742 -7138 -2169 -3819 -2725
16193 -2725 -4236 -2226 -3503 3136 -144 2204 2372 5878 10195 19699 27972 33590 35236 42017 43722
16178 43722 53370 72958 109586 155034 200325 263313 324003 366196 401123 428337 431438 425176
16166 425176 400692 353251 293161 245493 197022 161682 136695 117843 97876 82867 75183 65843
16154 65843 59257 55662 54248 50944 49672 50346 52537 53642 52053 49100 48375 42587 37572 35669 38377
16139 38377 36132 42790 44439 48319 41871 35938 28071 23170 21397 26708 29919 22506 18530 28067
16125 28067 27859 28709 25820 24215 23590 20156 25172 24294 22803 25757 18989 12568 19565 21329 15637
$$ packed form
16222B645n234k174K556P052m675j2071r533J362K991N089J314N913K612K906
16208G53j692j809m17J379o732k404l435J111J626m34L312J604M969j650J094
16193b725j511K010j277O639l280K348J68L506M317R504Q273N618J646O781J705
16178D3722R648J9588L6628M5448M5291O2988O0690M2193L4927K7214L101o262
16166D25176k4484m7441o0090m7668m8471l5340k4987j8852j9967j5009p684r340
16154F5843o586l595j414l304j272O74K191J105j589k953p25n788n015j903K708
16139C8377k245O658J649L880o448n933p867m901j773N311L211p413l976R537
16125B8067k08Q50k889j605o25l434N016q78j491K954o768o421O997J764n692
$$ plain form
16110 15637 12406 8684 -3061 242 10345 11229 10324 6043 7630 4694 3753 3249 -5549 -706 5065
16095 5065 6898 1008 1978 3081 4274 6796 14811 14011 14402 20344 16989 12375 5002 -1676 -7356
16080 -7356 -8668 -6541 -4608 -6740 -6284 -944 -3664 -4938 3516 12816 12453 7694 3091 -1122 -10966
16065 -10966 -12712 -8517 -1168 -4918 -4325 1325 -2857 -1386 -2617 -3519 -6785 -11412 -11467 -18939 -18357 -7641
16049 -7641 -4423 -3552 913 339 -5709 -10405 -9431 -7806 -6006 -3266 -609 -1294 391 4535 8498 2651
16033 2651 -641 -638 -1081 -11246 -9732 -6765 -8561 -7970 -7633 -4283 2173 11228 6172 -2672 4640 4529
16017 4529 3421 3831 -805 -4709 -5265 -9167 -9000 -3170 -4050 -9797 -8266 -1664 -7571 -11024 -4747 3281
16001 3281 4103 -2737 -9562 -9366 -6747 -2490 -4093 -1934 1885 428 -1994 -8355 -12177 -21048 -25735
$$ packed form
16110A5637l231l722j1745L303J0103Q84r05m281J587k936r41n04q798M843N771
16095E065J833n890R70J103J193K522Q015q00L91N942l355m614p373o678n680
16080g356j312K127J933k132M56N340k720j274Q454R300l63m759m603m213r844
16065a0966j746M195P349l750N93N650m182J471j231r02l266m627n5p472N82J0716
16049g641L218Q71M465n74o048m696R74J625J800K740K657o85J685M144L963n847
16033B651l292Lm43j0165J514K967j796N91L37L350O456R055n056q844P312j11
16017D529j108M10m636l904n56l902J67N830q80n747J531O602n907l453O277Q028
16001C281Q22o840o825J96K619M257j603K159L819j457k422o361l822q871m687
$$ plain form
15986 -25735 -24146 -17651 -15616 -15869 -13082 -4117 192 -2890 -3784 -112 -3398 -7135 -10017 -13908 -5400
15971 -5400 -365 -102 -3805 -6588 -4728 2596 -4466 -6376 -1408 2872 6914 -1253 -6920 -9760 -10819
15956 -10819 -3301 155 3718 2667 -1862 -1833 -1299 -1951 -2199 -206 4147 -256 -304 615 -515 -2869
15940 -2869 -1806 -8931 -10332 -9424 -12331 -6062 3174 4578 -5604 -11075 -9115 -9891 -8456 -9452 -11294
15925 -11294 -9164 -2522 160 -12471 -10798 -5294 -2899 -2854 -1491 4830 5905 491 -3076 -3283 -2118
15910 -2118 981 3666 942 -5702 -4572 3477 22352 35034 36630 24060 20952 20731 9381 -4091
15896 -4091 -11104 -6333 -1438 -630 1345 -1409 -2894 -665 -4966 -11120 -2404 5330 3852 -197 3864
15881 3864 3429 1654 -3183 -11763 -15759 -13677 -7923 -3000 601 -3975 -7480 -7955 -6725 95 2616
$$ packed form
15986b5735J589O495K035k53K787Q965M309l082q94L672l286l737k882l891Q508
15971e400N035K63l703k783J860P324p062j910M968M280M042q167n667k840j059
15956a0819P518L456L563j051m529K9N34o52k48J993M353m403m8R19j130k354
15940b869J063p125j401R08k907O269R236J404j0182n471J960p76J435r96j842
15925a1294K130O642K682j2631J673N504K395M5J363O321J075n414l567k07J165
15910b118L099K685k724o644J130Q049J8875J2682J596j2570l108k21j1350j3472
15896d091p013M771M895Q08J975k754j485K229m301o154Q716P734j478m049M061
15881C864m35j775m837q580l996K082N754M923L601m576l505m75J230O820K521
$$ plain form
15866 2616 -930 -144 -2548 -7964 -12055 -15135 -11588 -7480 -10788 -8777 -3908 -9314 -12801 -5453 -7869
15851 -7869 -9645 -11532 -9330 -6626 -6680 -13122 -15250 -8637 -8744 -909 5172 2519 -2529 -7268 -9477
15836 -9477 -8179 -4563 -4135 -32 -149 -6722 -10113 -11472 -14611 -12923 -11891 337 8573 12365 11609
15821 11609 13092 8241 4294 9423 14782 21135 27595 34043 31481 26667 20638 6845 5596 -2289
15807 -2289 -6950 -9882 -13857 -13262 -8422 -9816 -13225 -14511 -7337 -3529 -1441 -3687 -4940 -5805 -9569
15792 -9569 -8738 -7159 -2343 -4072 -9687 -7379 768 3432 -1024 82 3294 2784 6121 2941 615
15777 615 1495 -1503 -3759 -1332 -5172 1514 557 1568 3259 -2584 -6603 -2216 -8371 -673 1903
15762 1903 299 -4987 562 8401 16406 16050 11634 15609 19217 25861 26823 29174 28351 27951 21463 15725
$$ packed form
15866B616l546P86k404n416m091l080L547M108l308K011M869n406l487P348k416
15851g869j776j887K202K704n4o442k128O613j07P835O081k653n048m739k209
15836i477J298L616M28M103j17o573l391j359l139J688J032J2228Q236L792p56
15821A1609J483m851l947N129N359O353O460O448k562m814o029j3793j249p885
15807b289m661k932l975N95M840j394l409j286P174L808K088k246j253q65l764
15792i569Q31J579M816j729n615K308Q147K664m456J106L212n10L337l180k326
15777F15Q80k998k256K427l840O686r57J011J691n843m019M387o155P698K576
15762A903j604n286N549P839Q005l56m416L975L608O644R62K351q23m00o488n738
$$ plain form
15746 15725 6159 2650 2654 -2367 -1178 -281 551 1906 201 -2170 391 4498 2153 -1769 -6703 -4702
15730 -4702 -2676 -601 4457 9728 7065 6145 10431 13496 11951 7440 5102 6627 9826 9455 11218
15715 11218 12648 7610 2829 4294 7571 8743 9768 14824 11048 11179 9106 7336 5026 449 -371
15700 -371 471 -3926 -479 4720 7427 6880 -320 -8154 -7387 99 2704 2591 5173 867 -6516 -13660
15684 -13660 -13261 -14839 -13992 -19767 -17872 -10507 -7634 -1698 -4380 -5624 -4737 -5639 -5052 -8929 -16456 -8380
15668 -8380 2403 4679 1747 153 -8371 -14844 -13892 -9958 -9439 -7228 -7181 -11739 -14082 -9951 -3183
15653 -3183 -8161 -8203 -11451 -13624 -7497 432 -4082 -9372 -7455 1857 -1766 -8434 -8712 -5221 -5055 -2102
15637 -2102 740 -328 -4388 -10016 -10202 -7916 -8482 -10863 -10133 -4686 -851 -5415 -12692 -17847 -7745
$$ packed form
15746A5725r566l509Mn021J189Q97Q32J355j705k371K561M107k345l922m934K001
15730d702K026K075N058N271k663r20M286L065j545m511k338J525L199l71J763
15715A1218J430n038m781J465L277J172J025N056l776J31k073j770k310m577q20
15700c71Q42m397L447N199K707n47p200p834P67P486K605j13K582m306p383p144
15684a3660L99j578Q47n775J895P365K873N936k682j244Q87r02N87l877p527Q076
15668h380J0783K276k932j594q524o473R52L934N19K211M7m558k343M131O768
15653c183m978m2l248k173O127P929m514n290J917R312l623o668k78L491J66K953
15637b102K842j068m060n628j86K286n66k381P30N447L835m564p277n155J0102
$$ plain form
15622 -7745 -8273 -12220 -15152 -17692 -13092 -7436 -7190 -10738 -8975 -15167 -21900 -18126 -16526 -9064 1379
15607 1379 5665 -1812 -6611 -11473 -11939 -3821 3693 -1660 -1336 -1097 -917 -4291 -9420 -8410 -10609 -9835
15591 -9835 -8912 1088 6033 5142 3557 5409 11797 14277 12053 6072 -2371 -4823 -5101 -5104 -7510 -16758
15575 -16758 -18419 -17113 -13402 -14102 -13150 -9499 -8811 -9288 -11097 -9197 -10209 -9237 992 -1244 -11621
15560 -11621 -7089 476 -821 -4749 -2613 4220 9631 5625 -1863 -5844 -5467 -4353 -4082 -5154 225
15545 225 3653 -976 5315 6941 1806 67 -3886 -8720 -13575 -10493 -7457 -11221 -11466 -5863 -9959
15530 -9959 -13597 -15283 -16364 -12013 -13463 -9945 -4331 -6628 -6562 -4457 -10684 -8986 -6455 -11215 -11332
15515 -11332 -7112 -7952 -7532 -10607 -5859 -3782 -2380 -6234 -20220 -25598 -19797 -18539 -13453 -11578 -4990
$$ packed form
15622g745n28l947k932k540M600N656K46l548J763o192o733L774J600P462J0443
15607A379M286p477m799m862m66Q118P514n353L24K39J80l374n129J010k199P74
15591i835R23J0000M945q91j585J852O388K480k224n981q443k452k78lk406r248
15575a6758j661J306L711p00R52L651O88m77j809J900j012R72J0229k236j0377
15560a1621M532P565j297l928K136O833N411m006p488l981L77J114K71j072N379
15545B25L428m629O291J626n135j739l953m834m855L082L036l764k45N603m096
15530i959l638j686j081M351j450L518N614k297O6K105o227J698K531m760j17
15515a1332M220q40M20l075M748K077J402l854j3986n378N801J258N086J875O588
$$ plain form
15500 -4990 3864 5348 3974 -3364 -11959 -20331 -23781 -19165 -13222 -12259 -5860 -7699 -12816 -5711 4421
15485 4421 5882 -3644 -15880 -17344 -11136 -6214 -6361 -3605 -6767 -9081 -10428 -12034 -9377 -1876 3411
15470 3411 -3312 -11507 -13006 -15155 -18530 -15578 -15882 -11509 -2504 -1205 -1518 1951 1094 -612 -1584 -5457
15454 -5457 -2591 -5064 -12675 -14846 -6445 -4857 -13455 -16367 -9907 -10738 -15269 -9521 -10778 -11805 -4334
15439 -4334 1048 -4709 -8005 -6858 -5615 -3277 -6294 -446 -2585 -11382 -14857 -9718 -9429 -8079 -10911
15424 -10911 -6898 -1058 -552 3297 3555 7284 9695 448 -5189 -1997 -4559 -3939 -2718 -1032 780
15409 780 -2866 -6532 -6597 -1394 -4012 -3041 -3283 -3648 -3230 -9183 -11142 -4728 -371 5113 5131 3051 -696
15392 -696 -7109 -3991 -4972 -10746 -13335 -11830 -10814 -9239 -10674 -12404 -15928 -10537 -3299 -7271 -7413
$$ packed form
15500d990Q854J484j374p338q595q372l450M616N943R63O399j839n117P105J0132
15485D421J461r526j2236j464O208M922j47K756l162k314j347j606K657P501N287
15470C411o723q195j499k149l375K952l04M373R005J299l13L469q57j706r72l873
15454e457K866k473p611k171Q401J588q598k912O460q31m531N748j257j027P471
15439d334N382n757l296J147J243K338l017N848k139q797l475N139K89J350k832
15424a0911M013N840N06L849K58L729K411r247n637L192k562O20J221J686J812
15409G80l646l666o5N203k618R71k42l65M18n953j959O414M357N484J8k080l747
15392f96o413L118r81n774k589J505J016J575j435j730l524N391P238l972j42
$$ plain form
15377 -7413 -9319 -11880 -4981 -5552 -7478 -4899 -8327 -13365 -10726 -10410 -10674 -1458 2927 3120 -3123 -9036
15361 -9036 -19013 -19496 -17917 -17584 -10748 -9276 -9861 -9958 -4689 -11973 -10226 -16165 -20422 -15471 -16888 -16346
15345 -16346 -15691 -16936 -16626 -18663 -17972 -18705 -11741 -11376 -12843 -10508 -4336 4706 7367 -2620 -13060
15330 -13060 -13825 -16491 -16540 -6706 -2845 -3714 -5924 -4784 -3913 -2317 -6516 -5443 -3155 -5872 -7065 -5052
15314 -5052 652 -2688 1192 2309 6040 6468 2382 736 3021 2831 -1036 47 -7350 -5633 -5188
15299 -5188 -8104 -11842 -11872 -804 2452 -3430 -4289 668 4816 3173 3880 2144 -14713 -19320 -16906
15284 -16906 -17451 -19719 -18364 -14542 -11675 -15203 -10001 -3203 -4615 -12265 -9239 -5904 -4172 -7085 -11506
15269 -11506 -12867 -9763 -12144 -18130 -17738 -16046 -9234 -8357 -6328 -5668 -8957 -6910 -9004 -9394 -10227 -9831
$$ packed form
15377g413j906k561O899n71j926K579l428n038K639L16k64R216M385J93o243n913
15361i036r977m83J579L33O836J472n85r7N269p284J747n939m257M951j417N42
15345a6346O55j245L10k037O91p33O964L65j467K335O172R042K661r987j0440
15330a3060p65k666m9R834L861q69k210J140Q71J596m199J073K288k717j193K013
15314e052N704l340L880J117L731M28m086j646K285j90l867J083p397J717M45
15299e188k916l738l0J1068L256n882q59M957M148j643P07j736j6857m607K414
15284a6906n45k268J355L822K867l528N202O798j412p650L026L335J732k913m421
15269a1506j361L104k381n986L92J692O812Q77K029O60l289K047k094l90q33L96
$$ plain form
15253 -9831 -13851 -6852 -2602 -6263 -3462 -1117 -4722 -9234 -12995 -12671 -12519 -4321 -3199 -489 2586
15238 2586 -2412 -8217 -9115 -8784 -12278 -8481 -8528 -6053 1505 -799 -4225 -7544 -12021 -12671 -16774 -15134
15222 -15134 -4855 -5758 -7475 -5724 -7107 -8614 -6711 -14189 -12181 -13490 -13628 -10376 -6092 -6783 -6438
15207 -6438 -4830 -10768 -14220 -10751 -12975 -13438 -10769 -2540 1133 -4551 -6107 648 5689 1571 -3528
15192 -3528 -7768 -10089 -9796 -8081 -8948 -6234 2078 1106 2059 1698 -2664 -7732 -11192 -14918 -17466 -12717
15176 -12717 -5644 923 7358 9651 123 -2179 -2503 -3929 -5450 -4846 -3935 -8919 -13385 -10130 -5037
15161 -5037 -11262 -12403 -16193 -12199 -15229 -17379 -15564 -11630 -11263 -10184 -9679 -12579 -12357 -5498 -6149 -5687
15145 -5687 -6750 -4314 -8788 -8055 -4005 -4317 -5779 -5188 -12116 -8826 -5872 -7177 -7260 -7622 -14525 -17989
$$ packed form
15253i831m020O999M250l661K801K345l605m512l761L24J52Q198J122K710L075
15238B586m998n805q98L31l494L797m7K475P558k304l426l319m477o50m103J640
15222a5134J0279r03j717J751j383j507J903p478K008j309j38L252M284o91L45
15207f438J608n938l452L469k224m63K669Q229L673n684j556O755N041m118n099
15192c528m240k321K93J715q67K714Q312r72R53l61m362n068l460l726k548M749
15176a2717P073O567O435K293r528k302l24j426j521O04R11m984m466L255N093
15161e037o225j141l790L994l030k150J815L934L67J079N05k900K22O859o51M62
15145e687j063K436m474P33M050l12j462N91o928L290K954j305q3l62o903l464
$$ plain form
15129 -17989 -15200 -13111 -9979 -9962 -7946 -9926 -13157 -6305 257 -1716 -4661 -8524 -11557 -15968 -14098
15114 -14098 -8231 -2671 -2314 -13281 -7640 -6271 -4894 -3194 -3772 -9218 -4819 -5668 -5986 -1802 3346
15099 3346 -216 -3643 -3747 -4333 -4638 -5277 -10213 -17203 -16914 -12976 -14270 -8861 -10102 -11234 -10325 -9590
15083 -9590 -14021 -18491 -18883 -12384 -4825 402 2643 3216 4627 2245 -7286 -12486 -8087 -143 -82 -2267
15067 -2267 -65 1160 -1995 -6572 -6570 -4515 -8722 -12866 -18253 -10525 1205 7745 1768 -249 157
15052 157 -6024 -5532 -5975 -9542 -4340 -1054 -3822 -5818 -4734 -1305 7906 5518 2200 987 -332
15037 -332 1668 4656 4483 -3047 -10494 -8541 756 5928 607 -635 3874 181 1178 3892 9511
15022 9511 9718 11528 5429 7884 3770 -2163 -3377 -370 4242 4259 2412 3039 -5653 -18922 -18245 -17433
$$ packed form
15129a7989K789K089L132J7K016j980l231O852O562j973k945l863l033m411J870
15114a4098N867N560L57j0967N641J369J377J700n78n446M399q49l18M184N148
15099C346l562l427j04n86l05o39m936o990K89L938j294N409j241j132R09P35
15083i590m431m470l92O499P559N227K241N73J411k382r531n200M399P944O1k185
15067b267K202J225l155m577KK055m207m144n387P728J1730O540n977k017M06
15052A57o181M92m43l567N202L286k768j996J084L429R211k388l318j213j319
15037c32K000K988j73p530p447J953R297N172n321j242M509l693R97K714N619
15022I511K07J810o099K455m114n933j214L007M612J7j847O27q692j3269O77Q12
$$ plain form
15006 -17433 -5397 -5522 -9945 -14134 -13593 -2905 504 -382 -4050 -3578 -1093 344 -3239 -3885 -3463
14991 -3463 -3387 -4145 -9536 -10392 -12427 -14563 -11286 -6887 -5142 -10680 -9714 -6102 -6347 -6340 -7774 -12845 -8661
14974 -8661 1677 -550 -5230 -10546 -10195 -7897 -5613 -5925 -12809 -13922 -8413 -8283 -11372 -9423 -6467
14959 -6467 -1238 -8335 -10307 -10230 -4828 2098 6980 16295 40896 60946 74404 79587 71543 47765
14945 47765 24655 15427 12273 9631 8426 6915 5473 1764 1834 1561 83 1198 1314 3105 -6432
14930 -6432 -13605 -8465 -7118 -2701 -2170 -5710 -5054 -4301 -1049 -7550 -11273 -12044 -9109 -5911 -987 -3391
14914 -3391 -6697 -9455 -6946 -7340 -1200 1876 4463 -160 -487 -3121 -3470 -6360 -7899 -9289 -12948
14899 -12948 -12749 -7270 -3628 5673 4805 -2268 -6458 -6850 -5473 -10159 -11097 -8129 -10348 -6928 -1095
$$ packed form
15006a7433J2036j25m423m189N41J0688L409q86l668M72K485J437l583o46M22
14991c463P6p58n391q56k035k136L277M399J745n538R66L612k45Pj434n071M184
14974h661J0338k227m680n316L51K298K284l12o884j113N509J30l089J949K956
14959f467N229p097j972P7N402O926M882R315K4601K0050J3458N183q044k3778
14945D7765k3110r228l154k642j205j511j442l709P0k73j478J115J16J791r537
14930f432p173N140J347M417N31l540O56P53L252o501l723p71K935L198M924k404
14914c391l306k758K509l94O140L076K587m623l27k634l49k890j539j390l659
14899a2948J99N479L642R301q68p073m190l92J377m686r38K968k219L420N833
$$ plain form
14884 -1095 -10156 -19065 -20529 -18882 -21278 -21743 -17126 -14357 -9226 -7281 -6738 -6258 -12045 -17127 -16497 -15617
14868 -15617 -16700 -13630 -15218 -8990 -9820 -17067 -13528 -15121 -14959 -17345 -11028 -11843 -11890 -3913 -2541 -8970
14852 -8970 -10188 -12870 -7871 -239 -857 -8879 -18230 -24727 -22720 -17148 -7546 -5037 -4634 -3436 -10298
14837 -10298 -13804 -8054 -6002 -11347 -18434 -13463 -5827 -5314 -2333 587 -8090 -8791 -5898 -3721 -5239
14822 -5239 -3527 3066 58 -4134 -5261 -7423 -10442 -4816 2 -2917 -8642 -13701 -11706 -6338 -3263
14807 -3263 -2223 -8741 -11912 -12058 -9433 -13203 -16364 -16719 -19626 -24377 -21407 -13997 -10844 -11123 -5139
14792 -5139 682 22 -704 -4545 -9832 -11118 -5970 -3502 -3067 -1317 -1957 -3136 -7241 -4787 -1729 701
14776 701 551 -7702 -10719 -8609 -8771 -7840 -10162 -9875 -9548 -6502 -7104 -9659 -13212 -17670 -12972 -11407
$$ packed form
14884a095r061q909j464J647k396m65M617K769N131J945N43M80n787n082O30Q80
14868a5617j083L070j588O228q30p247L539j593J62k386O317q15m7P977J372o429
14852h970j218k682M999P632o18q022r351o497K007N572R602K509M03J198o862
14837a0298l506N750K052n345p087M971P636N13K981K920q677p01K893K177j518
14822e239J712O593l008m192j127k162l019N626M818k919n725n059J995N368L075
14807c263J040o518l171j46K625l770l161l55k907m751K970P410L153k79N984
14792e139N821o60p26l841n287j286N148K468M35J750o40j179m105K454L058K430
14776G01j50q253l017K110j62R31k322K87L27L046o02k555l553m458M698J565
$$ plain form
14760 -11407 -8722 -3459 -3397 -4791 -14336 -12043 -4988 -6130 -9935 -3701 779 -5228 -9350 -5313 -4588
14745 -4588 -8128 -3827 -3791 -8908 -7595 -3268 -2290 -5246 -10426 -7043 511 5433 -616 -5026 717
14730 717 -2484 -13750 -12207 -7451 -5365 -2093 -2820 -267 261 -2457 631 2170 3854 2752 292
14715 292 -7410 -2887 -5295 -7673 -5496 461 5061 -463 -7093 -9339 -10785 -7672 -5835 -3792 -2621
14700 -2621 -2238 1072 3616 662 -2659 1685 10125 12305 5585 4430 697 -2891 -3703 -7631 -3210
14685 -3210 1543 -1483 -3842 -10691 -14804 -7689 2462 1443 -3185 -6588 -7682 206 5231 4136
14671 4136 -5424 -14484 -17177 -11801 -8256 -14332 -16892 -9816 -5483 -4985 -7497 -5732 -159 -1519 -2581
14656 -2581 -5130 -12613 -9783 -9584 -10556 -1410 6987 8520 7407 433 -6436 -5715 1446 11450 9459
$$ packed form
14760a1407K685N263O2j394r545K293P055j142l805O234M480o007m122M037P25
14745d588l540M301L6n117J313M327R78k956n180L383P554M922o049m410N743
14730G17l201j1266J543M756K086L272p27K553N28k718L088J539J684j102k460
14715B92p702M523k408k378K177N957M600n524o630k246j446L113J837K043J171
14700b621L83L310K544k954l321M344Q440K180o720j155l733l588q12l928M421
14685c210M753l026k359o849m113P115J0151j019m628l403j094P888N025j095
14671D136r560r060k693N376L545o076k560P076M333M98k512J765N573j360j062
14656b581k549p483K830J99r72R146Q397J533j113o974o869P21P161J0004j991
$$ plain form
14641 9459 8509 5167 2605 2999 -2504 -6848 -2415 -3831 -3747 -9073 -2942 5537 11804 9071 8367 4953
14625 4953 966 -5437 -2498 -3160 -7930 -8250 -5832 -2348 3944 1916 4209 1856 534 5726 11349
14610 11349 15350 11135 4279 1625 502 2167 8549 14322 8423 6899 4721 1326 184 -5861
14596 -5861 -11920 -7713 -5734 -1424 3907 4553 57 -3124 243 -2621 -3223 3785 4017 4115 3558 -2194
14580 -2194 73 -6084 -9293 -1315 2916 9656 8788 15247 22277 21011 26534 38673 47597 55277 68575
14565 68575 77122 90115 107924 130419 163224 224986 329851 487122 686882 898849 1085685
14554 1085685 1193577 1185038 1068339 888877 686367 508344 384304 306541 250449 220978
14544 220978 193473 167952 150802 133811 123782 120036 116972 108095 101662 101465 103590 96503 84914
$$ packed form
14641I459r50l342k562L94n503m344M433j416Q4n326O131Q479O267k733p04l414
14625D953l987o403K939o62m770l20K418L484O292k028K293k353j322N192N623
14610A1349M001m215o856k654j123J665O382N773n899j524k178l395j142o045
14596e861o059M207J979M310N331O46m496l181L367k864o02P008K32R8n57n752
14580b194K267o157l209P978M231O740q68O459P030j266N523J2139Q924P680J3298
14565F8575Q547J2993J7809K2495L2805O1762J04865J57271J99760K11967J86836
14554A085685J07892q539j16699j79462k02510j78023j24040p7763n6092k9471
14544B20978k7505k5521j7150j6991j0029l746l064q877o433j97K125p087j1589
$$ plain form
14531 84914 83859 84023 79840 77711 79700 82997 85010 76673 72270 65965 63639 63557 62378 60842 61066
14516 61066 57139 50989 43136 44378 44829 40806 43486 47440 46156 39974 36107 30868 33089 37694 40689
14501 40689 35833 26324 32274 35535 31639 34076 27149 25897 29151 31370 31008 32265 31344 34298 33614
14486 33614 29337 24878 22176 16830 18185 17646 20315 19612 22400 17778 21930 19153 15294 13482 14242
14471 14242 15940 8959 213 -4567 -2223 -1197 1211 12725 21267 18349 23026 24893 28452 22155
14457 22155 17733 7847 9525 12912 13318 16064 13065 7121 1532 -584 -173 -2351 -477 -2118 3218
14442 3218 8685 5788 4902 6295 7743 2278 -1417 -1222 -304 3552 4462 11997 15579 10408 8142 9850
14426 9850 12237 9588 10156 11456 4314 4730 4926 6688 11352 8091 1622 -3272 -5087 -3473 -2280
$$ packed form
14531H4914j055J64m183k129J989L297K013q337m403o305k326q2j179j536K24
14516F1066l927o150p853J242M51m023K680L954j284o182l867n239K221M605K995
14501D0689m856r509N950L261l896K437o927j252L254K219l62J257r21K954o84
14486C3614m277m459k702n346J355n39K669p03K788m622M152k777l859j812P60
14471A4242J698o981q746m780K344J026K408J1514Q542k918M677J867L559o297
14457B2155m422r886J678L387M06K746k999n944n589k116M11k178J874j641N336
14442C218N467k897q86J393J448n465l695J95R18L856R10P535L582n171k266J708
14426I850K387k649N68J300p142M16J96J762M664l261o469m894j815J614J193
$$ plain form
14411 -2280 -276 9271 7752 9587 2772 1001 8084 16544 15852 10047 3806 2104 629 3524 3992
14396 3992 4194 3242 7743 9005 5831 3585 4626 -1508 -1998 -3244 -6540 -5689 -8315 -4478 -3024 -7459
14380 -7459 -7354 -3425 -2875 -5773 -4288 2523 1312 6546 9965 9138 4493 1380 701 -5888 -3742 -4945
14364 -4945 -7184 -6111 -5184 -2024 469 3644 -1629 -9959 -12269 -11535 -9358 -10918 -9678 -12707 -12378
14349 -12378 -4697 4615 1834 431 2625 1090 -485 -7164 -6046 -8209 -11244 -7087 -4864 -8319
14335 -8319 -7788 -2496 -3444 -670 819 3627 1264 1032 3430 -1400 5885 2575 -1375 -5120 -5835 -3423
14319 -3423 -5179 -7242 -3725 -4083 -2157 -1660 3343 1917 -4383 -9073 -3993 2415 5487 -1324 -11379
14304 -11379 -15147 -16104 -10166 -5503 -8274 -5269 280 7736 5744 5000 967 1510 406 -3049 193
$$ packed form
14411b280K004R547j519J835o815j771P083Q460o92n805o241j702j475K895M68
14396C992K02r52M501J262l174k246J041o134m90j246l296Q51k626L837J454m435
14380g459J05L929N50k898J485O811j211N234L419q27m645l113o79o589K146j203
14364d945k239J073R27L160K493L175n273q330k310P34K177j560J240l029L29
14349a2378P681R312k781j403K194j535j575o679J118k163l035M157K223l455
14335h319N31N292r48K774J489K808k363k32K398m830P285l310l950l745p15K412
14319c423j756k063L517l58J926M97N003j426o300m690N080O408L072o811j0055
14304a1379l768r57N938M663k771L005N549P456j992p44m033N43j104l455L242
$$ plain form
14289 193 -2841 -2694 2157 3475 600 -686 -977 -7474 -13751 -3754 -1552 1831 985 -3757 4463 4504
14273 4504 2049 3092 836 -5239 -5159 -841 -5261 -6898 -6598 -5325 -1504 463 -288 5284 3675 2062
14257 2062 -4255 -8797 -12083 -12393 -10110 -8750 -7580 -3060 677 3872 2347 535 -3709 -8129 -11502
14242 -11502 -4260 -2400 -4031 55 -3439 -15470 -16321 -14324 -5263 -7843 6373 15764 12491 4187
14228 4187 6282 11721 14704 13175 8083 9675 8448 5178 5103 -2106 -8376 -15012 -18881 -13964 -9826
14213 -9826 -8769 -4427 -5772 -6462 -4184 -2170 912 -3699 -7122 -3868 -9051 -8924 -3944 -6438 -11145
14198 -11145 -13196 -5004 2343 2415 3671 3379 2136 4465 5490 2693 -4526 -3530 -4682 -2098 679
14183 679 1893 2181 -527 2573 -698 -3024 -2240 391 1283 6461 6342 7164 6179 -671 -3170 -2232 -3964
$$ packed form
14289A93l034J47M851J318k875j286k91o497o277R997K202L383q46m742Q220M1
14273D504k455J043k256o075Q0M318m420j637L00J273L821J967p51N572j609j613
14257B062o317m542l286l10K283J360J170M520L737L195j525j812m244m420l373
14242a1502P242J860j631M086l494j2031q51J997R061k580J4216R391l273q304
14228D187K095N439K983j529n092J592j227l270p5p209o270o636l869M917M138
14213i826J057M342j345o90K278K014L082m611l423L254n183J27M980k494m707
14198a1145k051Q192P347P2J256k92j243K329J025k797p219R96j152K584K777
14183F79J214K88k708L100l271k326P84K631Q92N178j19Q22r85o850k499R38j732
$$ plain form
14166 -3964 -6905 -12047 -8055 -9614 -6630 -4110 -4389 -7255 -10409 -5773 1991 4774 5018 4731 -1599
14151 -1599 -1711 -1752 2871 -1970 -4416 -1306 3090 -419 -772 5184 5512 -1211 -3661 -6612 -6129 -5159
14135 -5159 -4346 1459 6219 -607 -9854 -6401 -8712 -6606 -9211 -7530 -7891 -8273 -6948 -9215 -5705
14120 -5705 -1567 1606 -1203 -2157 2801 9266 9115 2524 -1027 5054 2434 435 -2702 -2271 -5462
14105 -5462 3460 8599 7254 2775 -708 -4368 -514 2768 -2761 -4595 -11867 -5641 -3667 -3282 -9920
14090 -9920 -8441 146 3948 -913 -7929 -714 6740 5733 6653 3422 2077 7547 10868 13359 7218
14075 7218 -2743 -3202 -6971 -6374 6916 2860 -980 -697 8878 10034 3159 871 -4184 1379 -1683
14060 -1683 -7099 -8403 -11542 -6194 -2346 -3132 -5870 -7836 -6977 -2882 -2045 3200 9141 5211 2460
$$ packed form
14166c964k941n142L992j559K984K520k79k866l154M636P764K783K44k87o330
14151a599j12m1M623m841k446L110M396l509l53N956L28o723k450k951M83R70
14135e159Q13N805M760o826r247L453k311K106k605J681l61l82J325k267L510
14120e705M138L173k809r54M958O465j51o591l551O081k620j999l137M31l191
14105e462Q922N139j345m479l483l660L854L282n529j834p272O226J974L85o638
14090i920J479Q587L802m861p016P215P454j007R20l231j345N470L321K491o141
14075G218r961m59l769N97J3290m056l840K83R575J156o875k288n055N563l062
14060a683n416j304l139N348L848p86k738j966Q59M095Q37N245N941l930k751
$$ plain form
14045 2460 7145 13519 11514 2622 -1605 3751 3082 1709 6032 9705 8877 5992 5881 9579 11443
14030 11443 7802 5138 -1572 -5170 247 5421 10214 8571 -1405 3266 10684 6995 10435 16113
14016 16113 11852 11996 13897 15206 10734 5266 967 5920 754 -7100 -6789 -1023 3564 5453 5683
14001 5683 4994 -3191 -10726 -11794 -15160 -9288 -2135 -248 -6725 -2370 -2034 -9366 -12870 -16643 -20412
13986 -20412 -19825 -7410 -819 907 8417 10452 14641 8482 11228 8346 -3447 -7111 -5673 -2380
13972 -2380 -5588 -5716 -4254 219 5591 -2462 -5704 3703 7924 11243 6802 7031 9730 11360 12575
13957 12575 12898 20763 24967 35227 38206 33708 35611 38017 30191 16698 13876 8098 -4343 -2328
13943 -2328 13228 17132 7489 2356 1625 241 5035 12260 11993 4687 7393 7971 4292 -1029 -103
$$ packed form
14045B460M685O374k005q892m227N356o69j373M323L673q28k885j11L698J864
14030A1443l641k664o710l598N417N174M793j643r976M671P418l689L440N678
14016A6113m261J44J901J309m472n468m299M953n166p854L11N766M587J889K30
14001E683o89q185p535j068l366N872P153J887o477M355L36p332l504l773l769
13986b0412N87J2415O591J726P510K035M189o159K746k882j1793l664J438L293
13972b380l208j28J462M473N372q053l242R407M221L319m441K29K699J630J215
13957A2575L23P865M204J0260K979m498J903K406p826j3493k822n778j2441K015
13943b328J5556L904r643n133p31j384M794P225k67p306K706N78l679n321R26
$$ plain form
13928 -103 1066 3482 8292 5828 4839 7693 12712 22050 16488 14311 8945 6544 6410 7414 5995
13913 5995 7512 4654 5746 -101 -7458 -9192 -8298 -9153 -8010 -1479 3118 8494 6319 6261 6503 8953
13897 8953 7820 7408 2471 -2763 3028 7533 12344 21847 19873 13088 6218 5640 10531 9081 8503
13882 8503 8348 2585 -680 479 4019 1252 9381 19280 20757 19827 8000 4954 9643 7331 523
13867 523 -3642 3275 8809 8052 13865 19121 19648 17660 17585 12149 9857 11014 4956 -3421 812 5912
13851 5912 6470 1382 -2074 892 4131 -2254 -6100 1386 10701 15474 9336 2708 5445 5752 7038
13836 7038 13008 15681 16920 17790 14092 7364 7328 14850 14256 4942 151 7154 8742 5614 5772 4685
13820 4685 11923 12473 11575 11608 11602 5990 -981 -2748 268 582 5659 9883 15093 13780 12143 11864 15209
$$ packed form
13928a03J169K416M810k464r89K854N019R338n562k177n366k401j34J004j419
13913E995J517k858J092n847p357j734Q94q55J143O531M597N376k175n8K42K450
13897H953j133m12m937n234N791M505M811R503j974o785o870n78M891j450n78
13882H503j55n763l265J159L540k767Q129R899J477r30j1827l046M689k312o808
13867E23m165O917N534p57N813N256N27j988p5n436k292J157o058q377M233N100
13851E912N58n088l456K966L239o385l846P486R315M773o138o628K737L07J286
13836G038N970K673J239Q70l698o728l6P522n94r314m791P003J588l128J58j087
13820D685P238N50q98L3on612o971j767L016L14N077M224N210j313j637k79L345
$$ plain form
13803 15209 17734 16570 18468 16383 11371 7319 -1731 -3120 -1751 -554 -2015 -2387 -1349 6019 15161
13788 15161 18442 12645 10744 17966 17760 14760 21017 24083 25761 31945 26352 16234 21712 15946
13774 15946 11904 12149 9968 15209 15200 14118 15885 18981 25361 31027 29571 28099 30083 31926 28619
13759 28619 17542 18017 19519 18619 22547 26784 25295 24542 22244 20336 19933 16284 19207 20740 22737
13744 22737 25726 27288 24706 26495 29215 30623 24750 17096 15833 19293 22489 25192 32680 35852
13730 35852 31889 30627 34399 36094 33267 34638 31532 31432 33386 21615 12366 12453 19335 21402 22391
13715 22391 22400 24026 19835 18701 21018 25383 21953 16892 17486 27606 32427 32982 30845 27704 24364
13700 24364 18584 14749 14486 10863 7003 12660 16240 20348 27820 25869 31776 38726 40183 47119 47093
$$ packed form
13803A5209K525j164J898k085n012m052r050j389J369J197j461l72J038P368R142
13788A5161L281n797j901P222k06l000O257L066J678O184n593j0118N478n766
13774A5946m042K45k181N241rj082J767L096O380N666j456j472J984J843l307
13759B8619j1077M75J502r00L928M237j489p53k298j908m03l649K923J533J997
13744B2737K989J562k582J789K720J408n873p654j263L460L196K703P488L172
13730C5852l963j262L772J695k827J371l106j00J954j1771r249Q7O882K067R89
13715B2391RJ626m191j134K317M365l430n061N94J0120M821N55k137l141l340
13700B4364n780l835k63l623l860N657L580M108P472j951N907O950J457O936k6
$$ plain form
13685 47093 41356 38076 38431 39210 32519 29013 26484 21356 26610 28056 30458 30190 33838 27456 18036
13670 18036 11352 13004 15911 19086 22508 24805 21553 24057 22886 19071 20395 16896 16164 22060 28925
13655 28925 30874 29558 25603 24151 18434 14510 16098 17470 23981 25570 24275 22468 32578 49787
13641 49787 60615 63907 66888 54499 40495 28187 28169 31508 28197 27161 22048 17334 16268 21305
13627 21305 18954 14157 11254 17902 21749 24222 33154 36545 34846 32047 32195 24682 19976 28270 36482
13612 36482 37993 27009 20369 16088 16647 20933 13975 10705 11309 17648 14487 16571 22104 22595 22562
13597 22562 21922 21125 22882 24965 24177 22638 19695 15678 14617 8999 13031 21990 26473 25829 19082
13582 19082 18765 21179 29303 32704 34209 32707 38027 36482 41047 46494 44873 40893 37490 37605 40364
$$ packed form
13685D7093n737l280L55P79o691l506k529n128N254J446K402k68L648o382r420
13670A8036o684J652K907L175L422K297l252K504j171l815J324l499p32N896O865
13655B8925J949j316l955j452n717l924J588J372O511J589j295j807J0110J7209
13641D9787J0828L292K981j2389j4004j2308j8L339l311j036n113m714j066N037
13627B1305k351m797k903O648L847K473Q932L391j699k799J48p513m706Q294Q212
13612C6482J511j0984o640m281N59M286o958l270O04O339l161K084N533M91l3
13597B2562o40p97J757K083p88j539k943m017j061n618M032Q959M483o44o747
13582A9082l17K414Q124L401J505j502N320j545M565N447j621l980l403J15K759
$$ plain form
13567 40364 37494 33317 38930 39636 34293 29276 25134 27140 34037 26934 22934 25285 23546 18585 23338
13552 23338 31655 34834 31543 28317 28804 24064 21741 32681 40179 37773 39816 42737 49408 50276 49382
13537 49382 43055 38252 40090 41709 40425 29926 33539 42011 48151 54056 65701 67320 69755 69680
13523 69680 61390 55950 53454 47991 39591 39316 37363 41753 51298 55814 62542 76873 92352 109749
13509 109749 120911 127613 135838 135925 142257 152535 167861 192164 226473 274870 365536 504234
13497 504234 728125 1057486 1473873 1889234 2199386 2269908 2070002 1739405 1467272 1321042
13487 1321042 1253251 1179416 987152 736857 566492 464917 405183 375565 353316 322091
13477 322091 289316 276208 263786 258452 251825 247494 240774 220191 210587 222837 227898 229973 230943
$$ packed form
13567D0364k870m177N613P06n343n017m142K006O897p103m000K351j739m961M753
13552B3338Q317L179l291l226M87m740k323J0940P498k406K043K921O671Q68q94
13537D9382o327m803J838J619j284j0499L613Q472O140N905J1645J619K435p5
13523F9680q290n440k496n463q400k75j953M390R545M516O728J4331J5479J7397
13509A09749J1162O702Q225Q7O332J0278J5326K4303L4309M8397R0666J38698
13497E04234K23891L29361M16387M15361L10152P0522j99906l30597k72133j46230
13487A321042o7791p3835j92264k50295j70365j01575n9734k9618k2249l1225
13477C22091l2775j3108j2422n334o627m331o720k0583r604J2250N061K075R70
$$ plain form
13464 230943 234616 230891 229361 225301 220454 218253 212859 210585 213611 211434 214948 230773 241530 253796
13450 253796 267857 303932 358234 441320 599113 847528 1130050 1361858 1467397 1329711
13440 1329711 1033822 745290 538525 422061 357142 321458 291123 261092 246688 240933 233329
13429 233329 215161 198682 197691 203006 200296 206678 206396 199977 186667 178083 174582 176049 176105 176409 181583
13414 181583 187932 191024 187855 188029 196941 199577 196424 200440 207609 225498 254065 293356 360221
13401 360221 473952 628965 761809 847581 825082 648445 459036 344765 278479 235587
13391 235587 215208 201344 186115 171821 161894 161681 152888 151281 146138 146733 151215 158668 156253 151188
13377 151188 143089 144303 138584 135766 125705 122467 125729 134050 140734 148455 150688 146097 138808 133561
$$ packed form
13464B30943L673l725j530m060m847k201n394k274L026k177L514J5825J0757J2266
13450B53796J4061L6075N4302Q3086J57793K48415K82522K31808J05539j37686
13440A329711k95889k88532k06765j16464o4919l5684l0335l0031j4404n755p604
13429B33329j8168j6479r91N315k710O382k82o419j3310q584l501J467N6L04N174
13414A81583O349L092l169J74Q912K636l153M016P169J7889K8567L9291O6865
13401C60221J13731J55013J32844Q5772k2499j76637j89409j14271o6286m2892
13391B35587k0379j3864j5229j4294r927k13q793j607n143N95M482P453k415n065
13377A51188q099J214n719k818j0061l238L262Q321O684P721K233m591p289n247
$$ plain form
13363 133561 134002 134493 132133 121712 108116 102008 94566 91666 89345 82246 77355 70850 75103 81968
13349 81968 84875 82910 87943 90148 91207 90623 82334 74330 69802 69920 68713 67072 77149 84408 87049
13334 87049 94836 95008 90289 88818 89806 90541 93339 94632 90647 89209 86439 97320 110759 113111 107500
13319 107500 100448 89913 83497 91832 106236 129320 154129 168952 169543 168660 160986 163517 167551
13306 167551 179022 192807 204666 217000 228150 237167 250329 267272 274732 263343 236594 219598
13294 219598 204690 183825 174182 162035 154886 163819 177716 184678 192633 192469 185780 179917 173553
13281 173553 163347 151498 142928 134513 128793 119624 108765 105522 113526 110024 96083 78652 73974
13268 73974 71586 65749 51402 36664 34189 37059 37195 25557 20610 14636 6852 3600 5813 4424
$$ packed form
13363A33561M41M91k360j0421j3596o108p442k900k321p099m891o505M253O865
13349H1968K907j965N033K205J059n84q289q004m528J18j207j641J0077P259K641
13334H7049P787J72m719j471R88P35K798J293l985j438k770J0881J3439K352n611
13319A07500p052j0535o416Q335J4404K3084K4809J4823N91q83p674K531M034
13306A67551J1471J3785J1859J2334J1150R017J3162J6943P460j1389k6749j6996
13294B19598j4908k0865r643j2147p149Q933J3897O962P955j64o689n863o364
13281A73553j0206j1849q570q415n720r169j0859l243Q004l502j3941j7431m678
13268G3974k388n837j4347j4738k475K870J36j1638m947n974p784l252K213j389
$$ plain form
13254 4424 6307 13140 17567 19548 18689 6655 -6830 -36637 -72610 -101293 -129870 -161840 -180768
13241 -180768 -175559 -118734 -14092 125044 274980 383351 420780 408704 370448 337166 312731
13230 312731 300189 301256 305565 313959 327816 330859 325854 315789 301063 283946 266000 252153
13218 252153 245563 242370 242276 238234 233472 226886 215314 206108 195697 183327 180491 189237 183086 168677
13204 168677 169907 181286 216585 263024 309622 355168 374818 377856 376204 372475 358630 339705
13192 339705 335516 330208 343117 370528 400975 414542 427968 433877 444414 465661 483849 488009
13180 488009 474909 445434 404574 344603 303151 285942 262287 197383 98780 2302 -55288
13169 -55288 -71077 -60564 -39299 -17029 22457 84990 150562 208183 249466 278082 302178 321676
$$ packed form
13254D424J883O833M427J981q59j2034j3485k9807l5973k8683k8577l1970j8928
13241a80768N209N6825J04642J39136J49936J08371L7429j2076l8256l3282k4435
13230C12731j2542J067M309Q394J3857L043n005j0065j4726j7117j7946j3847
13218B52153o590l193r4m042m762o586j1572r206j0411j2370k836Q746o151j4409
13204A68677J230J1379L5299M6439M6598M5546J9650L038j652l729j3845j8925
13192C39705m189n308J2909K7411L0447J3567J3426N909J0537K1247J8188M160
13180D88009j3100k9475m0860n9971m1452j7209k3655o4904r8603r6478n7590
13169e5288j5789J0513K1265K2270L9486O2533O5572N7621M1283K8616K4096J9498
$$ plain form
13157 321676 341119 355646 362832 373946 393758 429083 461770 491967 522579 544368 538165 519418
13145 519418 491438 461135 438781 416519 386946 369898 360234 362050 374119 386318 398690 398859
13133 398859 407097 428505 443732 450416 461408 481728 509354 540321 575804 601182 619468 625847
13121 625847 620183 612012 604629 598963 603980 609300 619302 631351 647635 674800 705232 741009 782855
13108 782855 826935 878565 922875 965319 1017103 1064938 1108700 1141019 1166524 1172533 1168108 1142809
13096 1142809 1124533 1106792 1098359 1126275 1184473 1262222 1351854 1440774 1541858 1651241 1769575
13085 1769575 1883215 2000115 2106307 2177282 2214877 2232612 2236336 2253238 2312229 2427736 2612243
13074 2612243 2852701 3142911 3486120 3873064 4327291 4868068 5529907 6343310 7356856
$$ packed form
13157C21676J9443J4527P186J1114J9812L5325L2687L0197L0612K1789o203j8747
13145E19418k7980l0303k2354k2262k9573j7048r664J816J2069J2199J2372J69
13133C98859Q238K1408J5227O684J0992K0320K7626L0967L5483K5378J8286O379
13121F25847n664q171p383n666N017N320J0002J2049J6284K7165L0432L5777M1846
13108G82855M4080N1630M4310M2444N1784M7835M3762L2319K5505O009m425k5299
13096A142809j8276j7741q433K7916N8198P7749Q9632Q8920J01084J09383J18334
13085A769575J13640J16900J06192P0975L7595J7735L724J6902N8991J15507J84507
13074B612243K40458K90210L43209L86944M54227N40777O61839Q13403J013546
$$ plain form
13065 7356856 8603257 10097016 11855722 13926241 16404016 19458494 23404902 28805961
13057 28805961 36597950 48357299 66824187 96651732 143542347 209273136 285311742
13050 285311742 354088665 394742242 388780507 334319538 252897511 177992429 127594599
13043 127594599 97989424 79814176 67224583 57717193 50336437 44682354 40442454
13036 40442454 37282116 34930805 33175805 31870943 30884626 30118028 29477579 28887230 28308530
13027 28308530 27777463 27337195 27034291 26916010 26985932 27124113 27149510 26893141 26314381 25447524
13017 25447524 24398051 23250785 22103767 21017522 20015907 19108690 18287650 17539251
13009 17539251 16880581 16287926 15738550 15222243 14726459 14236068 13733618 13222943 12709826
$$ packed form
13065G356856J246401J493759J758706K070519K477775L054478L946408N401059
13057B8805961P791989J1759349J8466888K9827545M6890615O5730789P6038606
13050B85311742O8776923M0653577n961735n4460969q1422027p4905082n0397830
13043A27594599k9605175j8175248j2589593r507390p380756n654083m239900
13036D0442454l160338k351311j755000j304862r86317p66598o40449n90349n78700
13027B8308530n31067m40268l02904j18281O9922J38181K5397k56369n78760q66857
13017B5447524j049473j147266j147018j086245j001615r07217q21040p48399
13009A7539251o58670n92655n49376n16307m95784m90391n02450n10675n13117
$$ plain form
13000 12709826 12222822 11790156 11412622 11068432 10758595 10485168 10227089 9976146 9743175
12991 9743175 9535904 9336591 9139451 8942059 8755948 8585101 8410771 8240330 8075877
12982 8075877 7909230 7751886 7599965 7450245 7291436 7116636 6943211 6775401 6614575
12973 6614575 6473928 6345259 6227519 6114063 5996883 5869417 5732326 5605285 5489876
12964 5489876 5374866 5260729 5154911 5058304 4958768 4861018 4758757 4665645 4579782 4496889
12954 4496889 4405322 4314827 4229485 4143035 4050644 3961231 3893715 3836079 3780717 3725527 3657585
12943 3657585 3589816 3522512 3452464 3394869 3350624 3310032 3271575 3243389 3225225 3205907 3185440
12932 3185440 3153996 3096842 3023508 2939803 2860045 2781260 2698348 2621892 2551237 2475621 2389490
$$ packed form
13000A2709826m87004m32666l77534l44190l09837k73427k58079k50943k32971
12991I743175k07271j99313j97140j97392j86111j70847j74330j70441j64453
12982H075877j66647j57344j51921j49720j58809j74800j73425j67810j60826
12973F614575j40647j28669j17740j13456j17180j27466j37091j27041j15409
12964E489876j15010j14137j05818r6607r9536r7750j02261r3112q5863q2893
12954D496889r1567r0495q5342q6450r2391q9413o7516n7636n5362n5190o7942
12943C657585o7769o7304p0048n7595m4245m0592l8457k8186j8164j9318k0467
12932C185440l1444n7154p3334q3705p9758p8785q2912p6456p0655p5616q6131
$$ plain form
12921 2389490 2289360 2190160 2102978 2032868 1982148 1936314 1895958 1864219 1825574 1781482 1750022
12910 1750022 1724496 1706692 1693753 1670147 1637474 1606691 1570711 1530383 1499160 1466018 1436282
12899 1436282 1425493 1425433 1429968 1446204 1450709 1436915 1406819 1363922 1313024 1264737 1221664 1177551
12887 1177551 1136938 1094030 1058705 1029664 1007324 989743 975481 956740 932519 910792 884545
12876 884545 848812 808591 764683 727772 712387 706991 707634 692485 665825 634234 594921 548383
12864 548383 503221 483212 500820 569158 681040 807138 924024 996496 1002144 973679 944470
12853 944470 912517 876054 831445 788092 757485 733257 716888 709361 705923 693342 681332 673425
12841 673425 666787 654703 642751 625230 608554 603897 605118 600580 594832 588346 587403 574265 557700
$$ packed form
12921B389490j00130r9200q7182p0110n0720m5834m0356l1739l8645m4092l1460
12910A750022k5526j7804j2939k3606l2673l0783l5980m0328l1223l3142k9736
12899A436282j0789o0M535J6236M505j3794l0096m2897n0898m8287m3073m4113
12887A177551m0613m2908l5325k9041k2340j7581j4262j8741k4221k1727k6247
12876H84545l5733m0221m3908l6911j5385n396O43j5149k6660l1591l9313m6538
12864E48383m5162k0009J7608O8338J11882J26098J16886P2472N648k8465k9209
12853I44470l1953l6463m4609m3353l0607k4228j6369p527l438j2581j2010p907
12841F73425o638j2084j1952j7521j6676m657J221m538n748o486r43j3138j6565
$$ plain form
12828 557700 541242 526098 512426 503892 498529 489010 472186 457157 444100 436778 428078 410895
12816 410895 408062 404531 400035 388505 380341 382032 378239 377171 377456 357921 333273 319351 311637
12803 311637 303685 305037 301112 302095 309088 311203 323396 319920 307443 301358 305152 310488 305220 293810
12789 293810 281003 265483 257292 256662 249337 237861 233205 235042 232977 223151 214549 218039 220446 215541
12775 215541 214520 217112 219873 224592 219953 217351 220457 225990 220263 205742 192165 187762 187234 184135
12761 184135 181427 179662 187556 192357 189943 187227 176191 168293 165317 162195 165413 170724 173427 185795
12747 185795 187466 186815 175341 166598 159813 158958 159640 157956 153024 133741 114625 103341 100500 107463
12733 107463 107888 105366 102900 103309 104546 105607 115727 123645 125873 116590 105157 99313 93822 86676
$$ packed form
12828E57700j6458j5144j3672q534n363r519j6824j5029j3057p322q700j7183
12816D10895k833l531m496j1530q164J691l793j068K85j9535k4648j3922p714
12803C11637p952J352l925R83O993K115J2193l476j2477o085L794N336n268j1410
12789B93810j2807j5520q191o30p325j1476m656J837k065r826q602L490K407m905
12775B15541j021K592K761M719m639k602L106N533n727j4521j3577m403n28l099
12761A84135k708j765P894M801k414k716j1036p898k976l122L218N311K703J2368
12747A85795J671o51j1474q743o785q55O82j684m932j9283j9116j1284k841O963
12733A07463M25k522k466M09J237J061J0120P918K228r283j1433n844n491p146
$$ plain form
12719 86676 82072 78871 75578 81832 87000 90146 91143 90245 89712 90765 85352 85152 83881 80463 82304
12704 82304 79256 74873 75381 78389 82576 85893 88332 94506 90549 87174 77952 66863 63985 66348
12690 66348 65029 62894 70750 73002 69350 68917 70676 76848 73810 69694 75550 82467 87365 93777 106492
12675 106492 110179 110507 110544 100747 89995 80603 71302 79588 86293 89910 95849 101687 103242 107542 113443
12660 113443 106267 88277 74650 64687 60617 67818 72937 70804 60364 54034 56610 52911 52060 51793
12646 51793 47954 49228 48212 47996 59049 59389 60751 65544 68064 74081 72348 69947 73029 79816 82872
12631 82872 94445 95331 84299 62849 54176 49648 51706 54771 54598 53709 60340 59092 62004 64604
12617 64604 65113 55795 58940 72912 90512 102327 117382 131744 146158 167456 200259 249041
$$ packed form
12719H6676m604l201l293O254N168L146R97q98n33J053n413k00j271l418J841
12704H2304l048m383N08L008M187L317K439O174l957l375r222j1089k878K363
12690F6348j319k135P856K252l652m33J759O172l038m116N856O917M898O412J2715
12675A06492L687L28L7r797j0752r392r301Q286O705L617N939N838J555M300N901
12660A13443p176j7990j3627r963m070P201N119k133j0440o330K576l699q51k67
12646E1793l839J274j016k16J1053L40J362M793K520O017j733k401L082O787L056
12631H2872J1573Q86j1032k1450q673m528K058L065j73q89O631j248K912K600
12617F4604N09r318L145J3972J7600J1815J5055J4362J4414K1298L2803M8782
$$ plain form
12605 249041 312371 414162 588895 858254 1227067 1644037 2017712 2215516 2111589 1747188
12595 1747188 1304130 951261 738171 632727 595118 622137 721345 908819 1200718 1568829
12585 1568829 1935887 2179531 2186850 1947701 1557975 1164363 883591 703949 591762 519477
12575 519477 464410 419122 386940 367361 351717 337448 323654 312332 301016 287246 270090
12564 270090 263565 256656 245956 246626 245369 232631 224469 218717 219178 214579 206371 204458 198273 192042
12550 192042 191421 182337 177109 170172 158971 158162 160149 157866 148247 138880 130043 133883 133823 128370 128719
12535 128719 125572 123231 118962 115249 105260 97129 97131 94037 88474 78136 72015 73258 82019 78382 74333
12520 74333 74597 77909 79652 76744 68475 66338 66481 73161 75706 76890 72202 69696 75010 77099 73548
$$ packed form
12605B49041O3330J01791J74733K69359L68813M16970L73675J97804j03927l64401
12595A747188m43058l52869k13090j05444l7609K7019R9208J87474K91899L68111
12585A568829L67058K43644P319k39149l89726l93612k80772j79642j12187p2285
12575E19477n5067m5288l2182j9579j5644j4269j3794j1322j1316j3770j7156
12564B70090o525o909j0700O70j257j2738q162n752M61m599q208j913o185o231
12550A92042o21r084n228o937j1201q09J987k283r619r367q837L840o0n453L49
12535A28719l147k341m269l713r989q131Kl094n563j0338o121J243Q761l637m049
12520G4333K64L312J743k908q269k137J43O680K545J184m688k506N314K089l551
$$ plain form
12505 73548 71914 67742 62957 49561 50377 53107 52399 57305 58722 52911 58056 65540 63652 54763 44643
12490 44643 38734 41287 46803 55218 59054 45662 42414 40916 35300 35497 40885 38286 36370 33001
12476 33001 29414 28210 26382 25188 24423 28190 27736 31474 35138 35558 37686 37397 34316 27741 26543
12461 26543 29467 34502 35682 29545 17062 2197 6670 16746 16955 21412 23431 24666 22160 23485
12447 23485 23166 28256 31968 36919 24077 14665 13992 20129 22556 21135 26824 32082 30079 27507 27002
12432 27002 28937 35381 39328 44448 52751 58217 63124 72476 83746 87637 94909 110898 122887 123674
12418 123674 104668 85937 76186 67966 56114 49407 45106 37331 27237 28798 29393 28217 21132
12405 21132 21360 22088 19872 15680 11240 13546 13193 13787 18498 21910 16718 15418 13960 15355 16897
$$ packed form
12505G3548j634m172m785j3396Q16K730p08M906J417n811N145P484j888q889j0120
12490D4643n909K553N516Q415L836j3392l248j498n616J97N388k599j916l369
12476C3001l587j204j828j194p65L767m54L738L664M20K128k89l081o575j198
12461B6543K924N035J180o137j2483j4865M473J0076K09M457K019J235k506J325
12447B3485l19N090L712M951j2842r412o73O137K427j421N689N258k003k572n05
12432B7002J935O444L947N120Q303N466M907R352J1270L891P272J5989J1989P87
12418A23674j9006j8731r751q220j1852o707m301p775j0094J561N95j176p085
12405B1132K28P28k216m192m440K306l53N94M711L412n192j300j458J395J542
$$ plain form
12390 16897 21611 21111 18637 10463 13820 10536 5153 808 4158 3057 7571 13699 8052 9135 3458
12375 3458 -2205 2551 12506 17394 10941 8544 13139 10883 8757 10615 6294 7110 9113 7085 10154
12360 10154 13956 13482 9754 1939 -5873 -8926 -7714 6245 17487 13563 13541 11637 13512 8106 5456
12345 5456 6578 8003 1016 -7855 -8101 -5132 2413 -2501 -1348 -2047 -4685 -6074 -2837 -950 -345
12330 -345 5270 8629 15442 8403 -3713 -7009 -4274 -8862 -6323 -7755 -9884 -9662 -8235 -1817 779
12315 779 1001 -87 -5595 2137 4195 2929 5036 12032 9856 6463 -3505 309 3796 7207 7799
12300 7799 1949 -2082 -704 2371 3145 2457 4063 5207 2935 1266 -1166 -5350 -3983 3922 1935
12285 1935 828 2887 7870 8461 3263 4505 6539 1085 133 3743 7281 9621 3876 939 2154
$$ packed form
12390A6897M714n00k474q174L357l284n383m345L350j101M514O128n647J083n677
12375C458n663M756R955M888o453k397M595k256k126J858m321Q16K003k028L069
12360A0154L802m74l728p815p812l053J212J3959J1242l924k2j904J875n406k650
12345E456J122J425o987q871k46K969P545m914J153o99k638j389L237J887O05
12330c45N615L359O813p039j2116l296K735m588K539j432k129K22J427O418K596
12315G79K22j088n508P732K058j266K107O996k176l393r968L814L487L411N92
12300G799n850m031J378L075P74o88J606J144k272j669k432m184J367P905j987
12285A935j107K059M983N91n198J242K034n454r52L610L538K340n745k937J215
$$ plain form
12270 2154 1128 -288 4612 2531 6030 6644 6502 5682 6652 4324 6382 7615 9020 8386 8556 10503
12254 10503 8084 7874 10203 7300 11297 10958 -301 211 13060 25827 30275 32410 40373 37135
12240 37135 28441 19011 16957 12256 5089 162 2725 -2023 -8726 -6856 -6275 -11139 -8729 2318
12226 2318 8891 6451 -334 -3831 35 4602 5704 4539 92 -7831 -7974 1703 1345 -2919 -7115
12211 -7115 -8929 -4267 -10633 -14218 -9227 -375 -1658 -3942 -3169 -354 50 -3719 213 -449 96 3668
12195 3668 7868 11746 13102 17456 12422 7008 3191 -3835 -5421 1135 -3614 -4650 -3066 -376 -2647
12180 -2647 45 3262 -3988 -3785 -5580 -9747 -17985 -15391 -9769 -9924 -10521 -7526 -8014 -9487 -6641 -943
12164 -943 -5462 -9329 -9281 -5431 -5242 -746 6511 13288 8231 6119 1910 -2226 -6318 -7107 -8366 -9310
$$ packed form
12270B154j026j416M900k081L499O14j42q20R70k328K058J233J405o34J70J947
12254A0503k419k10K329k903L997l39j1259N12J2849J2767M448K135P963l238
12240C7135q694r430k054m701p167m927K563m748o703J870N81m864K410J1047
12226B318O573k440o785l497L866M567J102j165m447p923j43R677l58m264m196
12211g115j814M662o366l585M991Q852j283k284P73K815M04l769L932o62N45L572
12195C668M200L878J356M354n034n414l817p026j586O556m749j036J584K690k271
12180b647K692L217p250K03j795m167q238K594N622j55n97K995m88j473K846N698
12164i43m519l867M8L850J89M496P257O777n057k112m209m136m092p89j259r44
$$ plain form
12148 -9310 -6099 3299 5158 3733 11787 10593 12070 10252 10900 10003 2758 -3055 6322 10093 14026
12133 14026 9721 7390 6154 5959 12418 11515 3490 -782 -4935 -8109 -8598 -14112 -12919 -4504 -3707
12118 -3707 -2891 1320 -2384 -2800 -7859 -9320 251 -3757 -15593 -21693 -16684 -11383 -3768 2292 1832
12103 1832 -883 -2448 -785 -1337 281 2592 6269 2119 -1971 -2132 -2523 -4595 -4163 3838 9543 -1734
12087 -1734 -10822 -14217 -9388 -1347 -7985 -18821 -19051 -11503 -12812 -12912 -13707 -9834 -6127 -8697 -3705
12072 -3705 -2924 -2494 -7158 -11807 -9614 -3893 -3513 -3893 6113 11282 6896 6693 524 -6959 -9931 -7467
12056 -7467 -203 683 827 -3264 5531 10241 3152 4376 4435 10968 9510 6306 5260 9499 12564 9449
12040 9449 8670 8569 -1994 -2655 4472 7174 5327 9502 10701 5730 3302 3442 -2540 -1841 -8119 -15004
$$ packed form
12148i310L211R398J859j425Q054j194J477j818O48q97p245n813R377L771L933
12133A4026m305k331j236j95O459r03q025m272m153l174m89n514J193Q415P97
12118c707Q16M211l704m16n059j461R571m008j1836o100N009N301P615O060m60
12103A832k715j565J663n52J618K311L677m150m090j61l91k072M32Q001N705j1277
12087a734r088l395M829Q041o638j0836k30P548j309j00p95L873L707k570M992
12072c705P81M30m664m649K193N721L80l80J0006N169m386k03o169p483k972K464
12056g467P264Q86J44m091Q795M710p089J224N9O533j458l204j046M239L065l115
12040I449p79j01j0563o61P127K702j847M175J199m971k428J40n982O99o278o885
$$ plain form
12024 -15004 -10958 -3798 368 5171 6479 -2084 -8112 -16294 -15393 -13339 -9827 -4117 -316 4342 -2449
12009 -2449 -5249 -4889 -1669 -2757 -3471 -3260 -8348 -11001 -10381 -8742 140 2633 -1791 -508 -2097 -1184
11993 -1184 6348 8936 5178 1218 2765 -3379 -10780 -6076 -1298 -1925 -3489 -7732 -10993 -16080 -20489
11978 -20489 -17349 -11423 -6804 -9488 -7403 -11489 -18281 -11876 -10018 -3835 -1433 -1390 -3608 -4953 -7209
11963 -7209 -10134 -9156 -314 5630 4819 2343 -2225 -4310 7077 5770 8948 6671 -427 -9617 -7777
11948 -7777 -5916 -2114 -1965 2111 1199 4799 6563 -2435 -7289 -4433 -4266 -112 283 -588 -4295 -5597
11932 -5597 -12332 -9399 -5054 4275 1497 293 3116 4684 7571 919 -4337 -5260 -247 -6396 -503
11917 -503 754 -4423 -8958 -12446 -9798 -2696 -1072 -549 -1719 -4485 -7313 -3227 -146 96 -4554
$$ packed form
12024a5004M046P160M166M803J308q563o028q182R01K054L512N710L801M658o791
12009b449k800L60L220j088p14K11n088k653O20J639Q882K493m424J283j589R13
11993a184P532K588l758l960J547o144p401M704M778o27j564m243l261n087m409
11978b0489L140N926M619k684K085m086o792O405J858O183K402M3k218j345k256
11963g209k925R78Q842N944q11k476m568k085J1387j307L178k277p098r190J840
11948g777J861L802J49M076r12L600J764q998m854K856J67M154L95q71l707j302
11932e597o735K933M345R329k778j204K823J568K887o652n256r23N013o149N893
11917e03J257n177m535l488K648P102J624N23j170k766k828M086L081K42m650
$$ plain form
11902 -4554 -9477 -10466 -12267 -8555 1071 -5810 -7178 -5038 -4720 -2429 -1230 -382 2788 8452 9670
11887 9670 8096 4044 1079 -1335 3298 3912 -456 -138 -1188 1973 8067 12401 16631 14566 17287
11872 17287 15007 15500 17377 7582 1461 -984 5716 7600 6753 2848 -2348 8950 13365 11770 5800
11857 5800 3829 6348 1491 -13309 -9230 9283 19134 18523 16275 8795 1379 -1 240 1444 3683
11842 3683 -1160 -7241 -1124 -2398 -8665 -8501 -2599 -3235 -1678 4685 -2548 -2776 1099 3798 -3648
11827 -3648 -8605 -2413 6242 7515 -3582 -9534 542 -66 -4767 -10837 -11247 -7175 -7007 -10058 -12513
11812 -12513 -11244 -8922 -7288 -10583 -5183 -6431 -6421 -7089 -10975 -5067 -5621 466 7382 7524 2636 -1118
11796 -1118 3289 -2098 -5150 2026 4664 -5468 -12525 -12341 -6163 -3790 -8876 -11819 -4140 1421 4463
$$ packed form
11902d554m923r89j801L712R626o881j368K140L18K291J199Q48L170N664J218
11887I670j574m052k965k414M633O14m368L18j050L161O094M334M230k065K721
11872A7287k280M93J877r795o121k445O700J884q47l905n196J1298M415j595n970
11857E800j971K519m857j4800M079J8513R851o11k248p480p416j380K41J204K239
11842C683m843o081O117j274o267J64N902o36J557O363p233k28L875K699p446
11827c648m957O192Q655J273j1097n952J0076o08m701o070m10M072J68l051k455
11812a2513J269K322J634l295N400j248J0o68l886N908n54O087O916J42m888l754
11796a118M407n387l052P176K638j0132p057J84O178K373n086k943P679N561L042
$$ plain form
11781 4463 9614 11486 14347 10449 1298 -3399 -1926 1051 1881 -3348 -945 2293 5745 6721 3233
11766 3233 -2785 -5635 -5910 -7704 -2523 -1584 2758 1858 -5609 -9605 -14559 -16348 -12978 -9419 -8115
11751 -8115 -7750 -13183 -7345 -4242 -10154 -15726 -14777 -15808 -11771 -8632 -3037 4948 4002 4630 1411 1033
11735 1033 -2243 1157 5294 5253 311 5786 11510 7279 6586 4371 7132 3541 -2116 1000 3585
11720 3585 9202 5996 1008 -5833 -8793 -9020 -8878 -7122 -6388 -5021 -6039 -8788 -12231 -10568 -6970
11705 -6970 -4155 -7466 -8693 -3387 -2636 -668 -2510 -5906 -2015 5257 10105 8208 2254 575 0
11690 0 1453 -1921 348 -1088 -5794 -1995 -463 1048 7978 11720 7672 -968 -244 -1531 -2640 -3991
11674 -3991 -3397 -317 -2044 -5072 -1787 952 202 -4075 -5558 -1268 5923 14200 14100 7738 978
$$ packed form
11781D463N151J872K861l898r151m697J473K977Q30n229K403L238L452R76l488
11766C233o018k850k75j794N181R39M342r00p467l996m954j789L370L559J304
11751h115L65n433N838L103n912n572R49j031M037L139N595P985r46O28l219l78
11735A033l276L400M137m1m942N475N724m231o93k215K761l591n657L116K585
11720C585N617l206m988o841k960k27J42J756P34J367j018k749l443J663L598
11705f970K815l311j227N306P51J968j842l396L891P272M848j897n954j679n75
11690@J453l374K269j436m706L799J532J511O930L742m048q640P24j287j109j351
11674c991N94L080j727l028L285K739p50m277j483M290P191Q277j00o362o760
$$ plain form
11659 978 4501 4344 9086 13296 8424 2440 865 -3994 -11554 -5085 3127 5556 8034 5910 6545
11644 6545 8990 8955 4956 -2255 -6007 -2553 466 -5 5207 11520 10385 7143 9009 12053 12406 10823
11628 10823 5048 -181 -7296 -6604 -9160 -14155 -9354 -3499 -924 2922 -38 2907 -945 -2875 -2757
11613 -2757 -1734 5074 3986 -800 -6324 -4693 -4173 -6499 -9337 -14565 -14265 -9768 -3429 4520 8303
11598 8303 10611 2294 -946 -9916 -11517 -6780 -7911 -12191 -15416 -12768 -9115 -6442 -9191 -7730 -5002
11583 -5002 398 -1438 -4162 -5993 -9650 -12098 -10149 -6024 102 -1039 -3419 -12858 -16373 -16963 -12556
11568 -12556 -10511 -8819 -2368 4584 2293 2469 -1745 -184 -1964 107 834 -11988 -16280 -20261 -18082
11553 -18082 -11421 -6644 -6984 -6083 -2034 -342 -2173 2341 4596 -101 420 -8647 -15297 -7217 -6033
$$ packed form
11659I78L523j57M742M210m872n984j575m859p560O469Q212K429K478k124O35
11644F545K445l5l999p211l752L454L019m71N212O313j135l242J866L044L53j583
11628A0823n775n229p115O92k556m995M801N855K575L846k960K945l852j930J18
11613b757J023O808j088m786n524J631N20k326k838n228L00M497O339P949L783
11598H303K308q317l240q970j601M737j131m280l225K648L653K673k749J461K728
11583e002N400j836k724j831l657k448J949M125O126j141k380r439l515n90M407
11568a2556K045J692O451O952k291J76m214J561j780K071P27j2822m292l981K179
11553a8082O661M777l40R01M049J692j831M514K255m697N21r067o650Q080J184
$$ plain form
11538 -6033 -5086 -4228 2655 -523 -4155 -1340 -7479 -7474 -2832 656 781 -1965 67 -2821 -2317 4162
11522 4162 5958 4691 4585 3382 2816 -9651 -8249 -2333 4945 6182 511 -1061 -6653 -4007 -3996
11507 -3996 -3294 -23 -977 -6436 -7246 -6430 -6583 -5364 -7564 -9536 -8068 -7458 -7347 -897 -2236 199
11491 199 3515 1550 -312 3229 8527 10407 10410 7594 -367 -7075 -4372 -5444 -1075 2951 1953 -152
11475 -152 -1622 -3575 -3582 1466 2498 1441 1722 1753 9253 11017 13083 12850 1082 -1069 4866 9311
11459 9311 6088 7916 4578 1871 3861 769 -2724 694 9276 11367 6565 2667 2156 -1665 -933
11444 -933 -1742 -1092 -216 -5329 -2497 -943 -4964 -3911 2200 4747 7673 6391 1187 -2201 -2658 -3648
11428 -3648 -4387 -4014 -8745 -6451 -13199 -13570 -11780 -10729 -5419 2259 276 3748 4960 3124 1285
$$ packed form
11538f033R47Q58O883l178l632K815o139NM642L488J25k746K032k888N04O479
11522D162J796j267j06j203n66j2467J402N916P278J237n671j572n592K646J1
11507c996P02L271r54n459q10Q16j53J219k200j972J468O10J11O450j339K435
11491A99L316j965j862L541N298J880Lk816p961o708K703j072M369M026r98k105
11475a52j470j953pN048J032j057K81L1P500J764K066k33j1768k151N935M445
11459I311l223J828l338k707J990l092l493L418Q582K091m802l898n11l821P32
11444i33q09O50Q76n113K832J554m021J053O111K547K926j282n204l388m57r90
11428c648p39L73m731K294o748l71J790J051N310P678j983L472J212j836j839
$$ plain form
11413 1285 8344 1050 -7482 -5279 -3626 -1646 -2046 1758 1049 -3738 -624 5071 -3475 -15362 -21827
11398 -21827 -15661 -5627 3961 8648 4847 -4504 -4222 691 10154 15926 13171 4018 -9313 -4450
11384 -4450 5100 4885 7439 14763 10101 4725 10458 12144 7929 2020 -779 -3902 -8555 -6178 -3178
11369 -3178 -1924 -3025 -1280 -217 -2121 -5106 -5624 -3258 -2234 -5541 -8855 -13477 -6989 -8578 -10454
11354 -10454 -5724 -433 -7368 -8786 -9445 -4974 664 2604 -641 -6020 -3787 -4509 -3014 2634 1742
11339 1742 -2758 2204 1763 -1547 3292 4735 2206 6642 9571 9708 4093 -359 2764 7491 2731
11324 2731 6236 8406 5370 5475 2820 -3049 2737 2533 -2220 -1523 308 314 2603 8786 6283 4905
11308 4905 -3322 -5349 -2392 -2957 -3240 1996 -4230 -9887 -12203 -4967 3128 9703 11189 19 -130
$$ packed form
11413A285P059p294q532K203J653J980m00L804p09m787L114N695q546j1887o465
11398b1827O166J0034R588M687l801r351K82M913R463N772k755r153j3331M863
11384d450R550k15K554P324m662n376N733J686m215n909k799l123m653K377L000
11369c178J254j101J745J063j904k985n18K366J024l307l314m622O488j589j876
11354a0454M730N291o935j418o59M471N638J940l245n379K233p22J495N648q92
11339A742m500M962m41l310M839J443k529M436K929J37n615m452L123M727m760
11324B731L505K170l036J05k655n869N786k04m753O97J831OK289O183k503j378
11308D905q227k027K957n65k83N236o226n657k316P236Q095O575J486j1170j49
$$ plain form
11293 -130 -1643 0 851 -1563 233 5356 6291 3816 6483 1576 -6191 -4196 1060 2225 -4817
11278 -4817 -6526 -703 3757 -1931 -7626 -5412 799 1546 1450 1911 10373 9148 -3052 -9272 -5263
11263 -5263 -624 6307 8938 -1975 -5316 -2311 1530 2630 -6693 -12214 -10121 -4814 -3238 5782
11249 5782 14100 14405 9529 4973 5258 7442 13490 14800 16095 13444 11841 13450 14126 11152 12647
11234 12647 16730 20087 15614 6808 590 5567 -79 -900 11708 26074 28859 26312 21172 9150
11220 9150 10078 15906 19728 17766 11463 16154 16289 8824 11039 10639 7508 9193 12860 2463 -4769
11205 -4769 -6804 -3310 6542 13411 10489 10743 8473 8382 10810 15201 10698 8742 7436 4758 1847
11190 1847 8169 5719 2658 1904 -1196 6628 13267 18152 14819 6986 2020 -53 10223 19556 13978
$$ packed form
11293a30j513J643Q51k414J796N123R35k475K667m907p767J995N256J165p042
11278d817j709N823M460n688n695K214O211P47r6M61Q462j225j2200o220M009
11263e263M639O931K631j0913l341L005L841J100r323n521K093N307J576R020
11249E782Q318L05m876m556K85K184O048J310J295k651j603J609O76k974J495
11234A2647M083L357m473q806o218M977n646q21J2608J4366K785k547n140j2022
11220I150R28N828L822j962o303M691J35p465K215m00l131J685L667j0397p232
11205d769k035L494R852O869k922K54k270r1K428M391m503j956j306k678k911
11190A847O322k450l061p54l100P824O639M885l333p833m966k073J0276R333n578
$$ plain form
11175 13978 6780 5698 5011 9098 10797 17462 13139 9136 5153 8360 10495 4532 3334 -2507 -4691
11160 -4691 -7411 -6518 -4207 -2848 -125 1615 5750 11175 14776 18802 19583 16283 11880 4553 -2078
11145 -2078 139 5281 -1069 -3607 560 3320 1672 6029 15247 12209 12953 11270 9750 11983 13584
11130 13584 4522 -81 5355 10622 12987 8529 7264 10616 11095 13830 14680 13464 10852 4705 271
11115 271 -2084 -4450 -6338 -1292 4325 4876 11134 10399 12450 10964 10167 9430 9782 11625 12920 9686
11099 9686 8074 10452 14929 11881 6375 8932 11295 4569 6795 4439 1177 1103 3628 9053 9834
11084 9834 5191 6571 13364 4191 2288 10572 10686 11192 10893 11236 9929 8779 9839 12319 14370 10074
11068 10074 6248 11045 10603 11309 14705 15369 7543 14073 22659 21386 22924 23339 16582 11047 7893
$$ packed form
11175A3978p198j082o87M087J699O665m323m003l983L207K135n963j198n841k184
11160d691k720Q93K311J359K723J740M135N425L601M026P81l300m403p327o631
11145b078K217N142o350k538M167K760j648M357R218l038P44j683j520K233J601
11130A3584r062m603N436N267K365m458j265L352M79K735Q50j216k612o147m434
11115B71k355k366j888N046N617N51O258p35K051j486p97p37L52J843J295l234
11099I686j612K378M477l048n506K557K363o726K226k356l262p4K525N425P81
11084I834m643J380O793r173j903Q284J14N06k99L43j307j150J060K480K051m296
11068A0074l826M797m42P06L396O64p826O530Q586j273J538M15o757n535l154
$$ plain form
11053 7893 7834 12986 7725 3504 246 3988 4309 7228 10371 11222 9799 10655 12220 11358 18510 18258
11037 18258 15330 7605 7651 8067 9186 8249 13027 15745 11704 6342 8109 8219 17400 18406 20620 22011
11021 22011 14777 11821 11834 16942 20120 13187 13869 16951 21279 25294 23894 11434 11014 12318 12411 12316
11005 12316 13543 21106 15836 13639 20284 22407 20057 10420 8321 9715 6037 18749 22240 20168
10991 20168 24188 18267 10148 9969 15263 18229 17834 14870 15372 22234 19405 18526 17147 14156 13916 20430
10975 20430 17556 16438 25333 28778 23717 20383 17831 18788 14823 14911 18206 20104 20385 14337 15177 18110
10959 18110 19305 24241 28494 25491 28300 37964 40697 39498 36939 29179 23181 22071 28080 35551
10945 35551 42305 50151 44493 37633 37315 37552 41744 45373 44840 35781 32770 33869 31740 35850 37692
$$ packed form
11053G893n9N152n261m221l258L742L21K919L143Q51j423Q56J565q62P152k52
11037A8258k928p725M6M16J119r37M778K718m041n362J767J10R181J006K214J391
11021B2011p234k956J3N108L178o933O82L082M328M015j400j2460m20J304R3r5
11005A2316J227P563n270k197O645K123k350r637k099J394l678J2712L491k072
10991B0168M020n921q119j79N294K966l95k964N02O862k829q79j379k991k40O514
10975B0430k874j118Q895L445n061l334k552R57l965Q8L295J898K81o048Q40K933
10959A8110J195M936M253l003K809R664K733j199k559p760n998j110O009P471
10945C5551O754P846n658o860l18K37M192L629n33r059l011J099k129M110J842
$$ plain form
10930 37692 37614 39574 36677 34017 37496 39757 42139 38341 35388 38069 41151 44322 48026 46516 40354
10915 40354 36119 34165 37344 39470 35409 35939 36691 33643 30106 34777 38060 46450 55312 53908 50521
10900 50521 48713 44908 40548 38481 38949 40115 44036 46890 45384 38137 31905 30034 34302 33165 37437
10885 37437 36419 35150 33406 39423 41533 43657 39551 33070 26359 29229 28835 39329 48864 52938
10871 52938 58248 52619 52703 52858 47054 41105 42494 41443 46742 41114 41119 46210 45864 43272 41499 49373
10855 49373 52921 49244 47833 48196 47455 45086 41659 43624 42038 42118 46172 51260 45116 38222 34656
10840 34656 34483 31029 33678 34001 34360 26680 23248 21549 23653 22245 24837 25807 27051 40545 42752
10825 42752 42660 43824 51171 50380 38266 32897 35258 32406 34055 32745 33992 33665 36286 35147 38897
$$ packed form
10930C7692p8J960k897k660L479K261K382l798k953K681L082L171L704j510o162
10915D0354m235j954L179K126m061N30P52l048l537M671L283Q390Q862j404l387
10900E0521j808l805m360k067M68J166L921K854j506p247o232j871M268j137M272
10885C7437j018j269j744O017K110K124m106o481o711K870l94J0494R535M074
10871E2938N310n629Q4J55n804n949J389j051N299n628NN091l46k592j773P874
10855D9373L548l677j411L63p41k369l427J965j586Q0M054N088o144o894l566
10840C4656j73l454K649L23L59p680l432j699K104j408K592R70J244J3494K207
10825D2752r2J164P347p91j2114n369K361k852J649j310J247l27K621j139L750
$$ plain form
10810 38897 33724 28159 25874 17537 16173 21907 24913 24708 19550 21569 24969 26879 25298 25455 31554
10795 31554 36404 42056 40958 36315 41228 43214 45355 46544 41830 39005 37339 39609 43886 42449
10781 42449 35983 35026 38264 33630 30055 28167 32102 35830 30314 30445 34136 40016 45993 40760 31169
10766 31169 36235 34892 34522 38695 40945 42085 43653 46531 46343 40246 38939 32257 28465 32542 39089
10751 39089 36249 35487 40137 40062 34089 28996 33262 30300 32487 34392 28847 26345 27647 34836 36870
10736 36870 34836 36859 35602 33499 34110 31201 29332 28236 35518 44416 45535 50884 47036 50533 51398
10721 51398 53131 55350 47932 46867 44919 48997 51965 50739 43677 35883 37866 35985 37600 43414
10707 43414 51363 60147 61499 54615 50334 46071 42943 39880 35688 38904 35471 31696 31410 37741 39540
$$ packed form
10810C8897n173n565k285q337j364N734L006k05n158K019L400J910j581J57O099
10795C1554M850N652j098m643M913J986K141J189m714k825j666K270M277j437
10781D2449o466r57L238m634l575j888L935L728n516J31L691N880N977n233r591
10766C1169N066j343l70M173K250J140J568K878j88o097j307o682l792M077O547
10751C9089k840p62M650p5n973n093M266k962K187J905n545k502J302P189K034
10736C6870k034K023j257k103O11k909j869j096P282Q898J119N349l848L497Q65
10721E1398J733K219p418j065j948M078K968j226p062p794J983j881J615N814
10707D3414P949Q784J352o884m281m263l128l063m192L216l433l775k86O331J799
$$ plain form
10692 39540 36248 36036 39667 48929 55117 52312 45843 44176 45766 46210 43204 43161 39602 44858 49463
10677 49463 44744 44029 40216 40698 44024 42740 41055 40791 38798 41580 41266 35656 34958 40518 46581 51286
10661 51286 55120 64315 74466 86174 90581 89685 94988 90128 90799 82612 77447 76829 78787 76843 78685
10646 78685 89043 92588 92132 94103 92639 87267 89491 83732 79692 88447 97286 99198 103461 106779
10632 106779 98469 90464 89295 83950 75739 80143 80829 76716 75230 80313 88673 95922 98204 103296
10618 103296 109371 110738 111012 111700 108748 109754 120398 133991 147857 162534 179808 211260 262120
10605 262120 331355 435870 598200 836768 1135053 1453617 1721229 1878536 1913446 1847646
10595 1847646 1690380 1440075 1152941 883453 690517 569019 492821 438258 391531 352770
$$ packed form
10692C9540l292k12L631R262O188k805o469j667J590M44l006m3l559N256M605
10677D9463m719p15l813M82L326j284j685k64j993K782l14n610o98N560O063M705
10661E1286L834R195J0151J1708M407q96N303m860O71q187n165o18J958j944J842
10646G8685J0358L545m56J971j464n372K224n759m040Q755Q839J912M263L318
10632A06779q310q005j169n345q211M404O86m113j486N083Q360P249K282N092
10618A03296O075J367K74O88k952J006J0644J3593J3866J4677J7274L1452N0860
10605B62120O9235J04515J62330K38568K98285L18564K67612J57307L4910o5800
10595A847646j57266k50305k87134k69488j92936j21498p6198n4563m6727l8761
$$ plain form
10585 352770 315713 287643 266963 257819 251316 245684 243369 247483 248873 246024 245852 244341 248454 252140
10571 252140 252402 256402 267938 283336 306144 344824 396235 432707 454504 446619 389235 349896
10559 349896 349387 376420 423839 469397 496261 489755 422366 350358 301751 270858 250721 239340
10547 239340 234901 237620 233331 233119 234473 224097 211642 197914 186923 187669 190386 191675 193802 199295
10533 199295 189203 180151 174032 177509 186578 186808 176541 180667 184712 179743 174948 178826 193475 209395
10519 209395 230142 263182 314017 382320 458676 527420 574847 614435 637020 684765 762000
10508 762000 837560 845387 805688 769528 707844 668010 654953 624212 524377 398522 319853
10497 319853 280297 253571 229907 226139 221122 215079 217041 221260 216554 208285 205737 208855 219349
$$ packed form
10585C52770l7057k8070k0680r144o503n632k315M114J390k849j72j511M113L686
10571B52140K62M000J1536J5398K2808L8680N1411L6472K1797p885n7384l9339
10559C49896n09K7033M7419M5558K6864o506o7389p2008m8607l0893k0137j1381
10547B39340m439K719m289k12J354j0376j2455j3728j0991P46K717J289K127N493
10533A99295j0092r052o119L477R069K30j0267M126M045m969m795L878J4649J5920
10519B09395K0747L3040N0835O8303P6356O8744M7427L9588K2585M7745P7235
10508G62000P5560P827l9699l6160o1684l9834j3057l0741r9835j25855p8669
10497C19853l9556k6726k3664l768n017o043J962M219m706q269k548L118J0494
$$ plain form
10484 219349 222768 211488 216836 226829 234669 239906 234549 232423 232548 231694 233780 237432 242259 244016
10470 244016 233962 222590 217838 218999 229754 252439 283812 338840 430185 548779 654827
10459 654827 735166 781745 757577 740382 766384 796871 810404 742841 605441 507043 458981
10448 458981 438684 427108 416902 405111 387571 372425 363313 354207 341214 331021 324914 322207
10436 322207 319025 317456 316350 307223 301352 295271 279901 271662 262343 254819 247269 237302 230194 217072
10422 217072 209860 197264 183921 173493 174924 173714 163956 148334 134580 132554 133671 130720 125586
10409 125586 123075 117394 111986 109564 106701 104913 105406 99593 95168 94845 89942 88304 81531 75083 72805
10394 72805 55857 30469 8382 -11969 -29596 -28313 -12428 32169 92121 159350 231911 302769
$$ packed form
10484B19349L419j1280N348R993P840N237n357k126J25q54K086L652M827J757
10470B44016j0054j1372m752J161J0755K2685L1373N5028R1345J18594J06048
10459F54827Q0339M6579k4168j7195K6002L0487J3533o7563j37400r8398m8062
10448D58981k0297j1576j0206j1791j7540j5146r112r106j2993j0193o107k707
10436C22207l182j569j106r127n871o081j5370q239r319p524p550r967p108j3122
10422B17072p212j2596j3343j0428J431j210r758j5622j3754k026J117k951n134
10409A25586k511n681n408k422k863j788M93n813m425l23m903j638o773o448k278
10394G2805j6948k5388k2087k0351j7627J283J5885M4597N9952O7229P2561P0858
$$ plain form
10382 302769 359577 400009 409671 406971 390106 376439 364700 363721 365371 370993 383584 386583 377392
10369 377392 359330 344263 337319 323723 307301 297963 290720 286281 291331 291923 284747 279077 274881
10356 274881 268180 257620 249420 243986 244970 247358 265538 301173 327018 352955 382924 411663 431639
10343 431639 435357 426472 414374 411296 405056 399027 403252 411872 427009 450022 465249 484072 501447
10330 501447 507223 509991 503974 496172 475002 444943 417037 382839 328550 264575 215062 173835
10318 173835 128210 81334 44906 24300 24076 49111 85554 126373 171533 212237 258129 302328
10306 302328 343513 368738 388979 406200 429312 456350 486514 514047 533274 561486 576938
10295 576938 587372 592193 584272 568987 547691 520145 497715 479259 464108 454888 449285 449319 456668
$$ packed form
10382C02769N6808M0432R662k700j6865j3667j1739r79J650N622J2591K999r191
10369C77392j8062j5067o944j3596j6422r338p243m439N050N92p176n670m196
10356B74881o701j0560q200n434R84K388J8180L5635K5845K5937K9969K8739J9976
10343D31639L718q885j2098l078o240o029M225Q620J5137K3013J5227J8823J7375
10330E01447N776K768o017p802k1170l0059k7906l4198n4289o3975m9513m1227
10318A73835m5625m6876l6428k0606k24K5035L6443M0819M5160M0704M5892M4199
10306C02328M1185K5225K0241J7221K3112K7038L0164K7533J9227K8212J5452
10295E76938J0434M821p921j5285k1296k7546k2430j8456j5151r220n603L4P349
$$ plain form
10282 456668 471886 485265 499633 509478 522615 538016 552451 571300 584897 598978 626554 642025
10270 642025 648515 652137 654982 667057 678066 684994 703980 724007 740408 764474 797168 829928
10258 829928 861933 898451 938260 980993 1022434 1069451 1113371 1153463 1196666 1232479 1258735
10247 1258735 1280849 1290867 1291871 1294647 1296484 1306458 1334940 1388390 1452094 1525718 1609867 1679185
10235 1679185 1756442 1859083 1984315 2106788 2215956 2303467 2357952 2408185 2476836 2563460
10225 2563460 2677974 2840453 3066086 3386707 3842846 4418433 5077838 5773886 6460063
10216 6460063 7133855 7837495 8637785 9582873 10724507 12171899 14030466 16323750 19071845
10207 19071845 22423941 26742547 32767656 41818579 56159717 79173708 113837570 159635105
$$ packed form
10282D56668J5218J3379J4368R845J3137J5401J4435J8849J3597J4081K7576J5471
10270F42025O490L622K845J2075J1009O928J8986K0027J6401K4066L2694L2760
10258H29928L2005L6518L9809M2733M1441M7017M3920M0092M3203L5813K6256
10247A258735K2114J0018J004K776J837R974K8482N3450O3704P3624Q4149O9318
10235A679185P7257J02641J25232J22473J09168Q7511N4485N0233O8651Q6624
10225B563460J14514J62479K25633L20621M56139N75587O59405O96048O86177
10216F460063O73792P03640Q00290R45088J141634J447392J858567K293284K748095
10207A9071845L352096M318606O025109R050923J4341138K3013991L4663862M5797535
$$ plain form
10199 159635105 211241684 260425284 297174468 313943219 311519245 295025819 265473772
10192 265473772 221509341 170082092 125170451 94453300 75656687 63775017 55582527
10185 55582527 49499476 44776889 41047809 38107940 35793857 33999016 32690597 31801243
10177 31801243 31207621 30769085 30365185 29928052 29473743 29054256 28681734 28286901 27840536
10168 27840536 27383773 26899301 26328846 25593664 24689858 23680614 22629976 21581724 20574652
10159 20574652 19636423 18794370 18029193 17326688 16690104 16106308 15556144 15047267 14557312
10150 14557312 14083351 13632432 13200418 12781984 12409591 12076200 11771250 11475923 11164343
10141 11164343 10856869 10572829 10316027 10068296 9827530 9603687 9396832 9200721 9009094
$$ packed form
10199A59635105N1606579M9183600L6749184J6768751k423974j6493426k9552047
10192B65473772m3964431n1427249m4911641l0717151j8796613j1881670q192490
10185E5582527o083051m722587l729080k939869k314083j794841j308419q89354
10177C1801243n93622m38536m03900m37133m54309m19487l72522l94833m46365
10168B7840536m56763m84472n70455p35182r03806j009244j050638j048252j007072
10159B0574652r38229q42053p65177p02505o36584n83796n50164n08877m89955
10150A4557312m73961m50919m32014m18434l72393l33391l04950k95327l11580
10141A1164343l07474k84040k56802k47731k40766k23843k06855j96111j91627
$$ plain form
10132 9009094 8818618 8623981 8429855 8247935 8082607 7912565 7728494 7534655 7359843
10123 7359843 7190263 7029763 6878533 6730985 6580451 6439537 6306966 6172683 6043582
10114 6043582 5920114 5797416 5677365 5561073 5443266 5336104 5233079 5127671 5029183 4949905
10104 4949905 4876876 4798548 4722856 4659199 4598091 4543463 4472122 4410039 4373040 4345253 4321292
10093 4321292 4301532 4278793 4256817 4265622 4337411 4468060 4648269 4861934 5056360 5165039
10083 5165039 5160985 5022736 4765217 4445135 4121976 3846774 3631121 3463705 3318038 3180235
10073 3180235 3061683 2967569 2865278 2770257 2676160 2584986 2503703 2422276 2346794 2282939 2226585
10062 2226585 2183381 2151720 2129591 2101830 2078389 2054071 2034118 2011528 1987789 1961773 1918223
$$ packed form
10132I009094j90476j94637j94126j81920j65328j70042j84071j93839j74812
10123G359843j69580j60500j51230j47548j50534j40914j32571j34283j29101
10114F043582j23468j22698j20051j16292j17807j07162j03025j05408r8488p9278
10104D949905p3029p8328p5692o3657o1108n4628p1341o2083l6999k7787k3961
10093D321292j9760k2739k1976Q805P1789J30649J80209K13665J94426J08679
10083E165039m054j38249k57519l20082l23159k75202k15653j67416j45667j37803
10073C180235j18552r4114j02291r5021r4097r1174q1283q1427p5482o3855n6354
10062B226585m3204l1661k2129k7761k3441k4318j9953k2590k3739k6016m3550
$$ plain form
10051 1918223 1877398 1836472 1800614 1774723 1757289 1751480 1743495 1734695 1732918 1733867 1736771 1724148 1693852
10038 1693852 1638687 1564015 1487264 1414672 1353846 1297478 1249511 1211709 1177709 1154759 1140072
10027 1140072 1119397 1091029 1078810 1061619 1041916 1026889 1002129 969680 935854 890969 862233
10016 862233 843642 822953 796443 762340 730880 707629 706849 725557 769598 835067 905526 971797
10004 971797 1027872 1069800 1085619 1066809 1034804 998585 957119 922890 887506 856766 837234
9993 837234 820786 807366 806567 808870 805839 796649 777873 765972 762235 753818 736155 717660 709145
9980 709145 705601 700203 683486 672731 665613 651341 636196 619999 608342 605265 591478 573200
9968 573200 558679 550532 539171 533396 523886 512178 497591 493404 495970 492419 486923 481845 480077
$$ packed form
10051A918223m0825m0926l5858k5891j7434n809p985q800j777R49K904j2623l0296
10038A693852n5165p4672p6751p2592o0826n6368m7967l7802l4000k2950j4687
10027A140072k0675k8368j2219j7191j9703j5027k4760l2449l3826m4885k8736
10016H62233j8591k0689k6510l4103l1460k3251p80J8708M4041O5469P0459O6271
10004I71797N6075M1928J5819j8810l2005l6219m1466l4229l5384l0740j9532
9993H37234j6448j3420p99K303l031r190j8776j1901l737q417j7663j8495q515
9980G09145l544n398j6717j0755p118j4272j5145j6197j1657l077j3787j8278
9968E73200j4521q147j1361n775r510j1708j4587m187K566l551n496n078j768
$$ plain form
9955 480077 472961 462609 451133 436310 430782 425126 415154 415242 415032 414342 414656 414861 420569 416258 423098
9940 423098 425927 417471 407528 397537 392575 372744 363450 363139 354475 355325 359553 362475 359649 356876 347252
9925 347252 343551 333840 325234 327208 326405 325973 326834 329897 329621 324214 320823 317638 313486 307915 302825
9910 302825 306347 305078 302033 301614 305749 308900 303763 303742 301490 300004 296103 293718 299242 300386 291834
9895 291834 293691 305448 310468 311581 312383 304159 296358 290228 282819 274334 261501 251612 238942 241823
9881 241823 251206 251234 249086 253341 262501 267410 272708 266228 269269 277574 283932 287928 287410 285329 291794
9866 291794 295696 302248 305374 312898 330512 346594 364685 386211 413733 445499 495343 569032
9854 569032 687632 887031 1215125 1699978 2279113 2825366 3119742 2982263 2473539 1801089
$$ packed form
9955D80077p116j0352j1476j4823n528n656r972Q8k10o90L14K05N708m311O840
9940D23098K829q456r943r991m962j9831r294l11q664Q50M228K922k826k773r624
9925C47252l701r711q606J974q03m32Q61L063k76n407l391l185m152n571n090
9910C02825L522j269l045m19M135L151n137k1k252j486l901k385N524J144q552
9895B91834J857J1757N020J113Q02q224p801o130p409q485j2833r889j2670K881
9881B41823R383K8k148M255R160M909N298o480L041Q305O358L996n18k081O465
9866B91794L902O552L126P524J7614J6082J8091K1526K7522L1766M9844P3689
9854E69032J18600J99399L28094M84853N79135N46253K94376j37479n08724o72450
$$ plain form
9844 1801089 1279672 973039 811888 717956 639863 580438 538201 507051 478080 458587 448179
9833 448179 443413 442032 435255 431561 432678 437450 431837 424045 425041 425355 421027 409699 410135 416078 416148
9818 416148 408022 401972 402012 401136 412958 423822 433095 447385 473261 506061 557149 611709 658342
9805 658342 678669 653822 604718 576148 578744 602997 627562 641557 667083 717793 833327 1060963
9793 1060963 1402714 1824914 2245960 2566084 2678071 2559676 2308108 2020369 1700106 1376462
9783 1376462 1104109 913359 793170 711595 655489 613462 583383 551843 521532 499104 479925
9772 479925 476628 471832 476996 481849 479278 472517 459755 446397 442121 433309 433896 435889 425595 409247
9758 409247 397805 387038 377665 365658 359947 357323 350544 343052 331222 325652 310912 299350 290886
$$ packed form
9844A801089n21417l06633j61151r3932p8093n9425m2237l1150k8971j9493j0408
9833D48179m766j381o777l694J117M772n613p792R96L14m328j1328M36N943P0
9818D16148q126o050M0q76J1822J0864R273J4290K5876L2800N1088N4560M6633
9805F58342K0327k4847m9104k8570K596K4253K4565J3995K5526N0710J15534K27636
9793A060963L41751M22200M21046L20124J11987j18395k51568k87739l20263l23644
9783A376462k72353j90750j20189q1575n6106m2027l0079l1540l0311k2428j9179
9772D79925l297m796N164M853k571o761j2762j3358m276q812N87J993j0294j6348
9758D09247j1442j0767r373j2007n711k624o779p492j1830n570j4740j1562q464
$$ plain form
9745 290886 281194 268392 270951 270379 265174 248677 235278 227185 219222 206262 205305 213995 220955 230354
9731 230354 241228 252403 260891 269557 268931 271714 267257 263046 262769 255460 245139 237837 232611 222666
9717 222666 214794 212612 211725 209785 220278 220302 213080 208735 201594 192618 184051 177151 174643 174723 176116
9702 176116 176969 179982 172167 170230 165730 161295 162306 163944 163727 163843 164318 162030 164803 173977 177890
9687 177890 179367 181430 195733 203110 210571 208846 210581 205999 197659 194723 188446 175294 157554 148798
9673 148798 147672 157134 165306 170350 167983 156669 142646 139105 137493 132199 127379 131624 125263 117853
9659 117853 120527 128458 131072 129283 123925 120064 120361 120859 126123 124967 119501 119028 118719 124336 125319 138397
9643 138397 143963 144919 147708 150670 150789 147928 137494 128778 122756 113120 103114 99119 101042 107056
$$ packed form
9745B90886r692j2802K559n72n205j6497j3399q093p963j2960r57Q690O960R399
9731B30354J0874J1175Q488Q666o26K783m457m211k77p309j0321p302n226r945
9717B22666p872k182q87j940J0493K4p222m345p141q976q567o900k508Q0J393
9702A76116Q53L013p815j937m500m435J011J638k17J16M75k288K773R174L913
9687A77890J477K063J4303P377P461j725J735m582q340k936o277j3152j7740q756
9673A48798j126R462Q172N044k367j1314j4023l541j612n294m820M245o361p410
9659A17853K674P931K614j789n358l861K97M98N264j156n466m73l09N617R83J3078
9643A38397N566R56K789K962J19k861j0434q716o022r636j0006l995J923O014
$$ plain form
9629 107056 107553 103729 96370 95111 95462 93702 93122 89894 98307 95808 78847 73607 76011 80667 72680
9614 72680 64216 70005 74387 74925 77550 74846 70389 67885 69323 71041 66682 66564 63467 67964 78756
9599 78756 82917 85382 88171 88446 81740 70461 62401 61169 56299 56748 54258 60044 58916 58244 60320
9584 60320 59764 64250 67074 65833 58750 54789 54729 55131 55901 58026 56898 51368 43284 44244 46738 51312
9568 51312 53135 50905 56814 55368 53370 55615 54916 57511 61875 65417 62446 62922 64435 71656 80024
9553 80024 79993 77021 69254 67170 64907 68001 68433 70505 62423 61235 53735 43694 32518 25986 27029
9538 27029 31003 35743 45279 48989 50290 42408 36075 29639 31169 32846 36087 35393 32206 30811 31614
9523 31614 39667 44258 53915 55358 51374 41937 37074 45484 47784 51166 53885 57220 60243 59533 61990
$$ packed form
9629A07056M97l824p359j259L51j760n80l228Q413k499j6961n240K404M656p987
9614G2680q464N789M382N38K625k704m457k504J438J718m359j18l097M497J0792
9599G8756M161K465K789K75o706j1279q060j232m870M49k490N786j128o72K076
9584F0320n56M486K824j241p083l961o0M02P70K125j128n530q084R60K494M574
9568E1312J823k230N909j446j998K245o99K595M364L542k971M76J513P221Q368
9553H0024l1k972p767k084k263L094M32K072q082j188p500j0041j1176o532J043
9538B7029L974M740R536L710J301p882o333o436J530J677L241o94l187j395Q03
9523C1614Q053M591R657J443l984r437m863Q410K300L382K719L335L023p10K457
$$ plain form
9508 61990 57670 60545 57486 63463 63586 63181 55833 47134 44681 42251 41230 42303 40950 38308 38937
9493 38937 36592 29758 21479 24996 33976 38320 38951 33823 34021 33803 23606 14568 16378 17724 19547
9478 19547 16337 16334 20520 24215 26871 24381 20690 23930 32238 30889 32500 35927 34686 35375 35360 43193
9462 43193 46285 45067 49203 43530 42892 32899 26972 30754 26058 20659 16711 18893 20136 20792 24839
9447 24839 29494 28676 23595 22132 24597 22283 20261 25693 22647 25716 26582 24980 30570 31662 32226
9432 32226 33008 32523 29458 26633 29131 29304 26170 23956 23759 21186 20734 25433 21855 16418 16380 17622
9416 17622 17330 15218 7528 -289 -5485 -6437 -734 4503 1149 -604 7731 12577 7137 11298 12373
9401 12373 14224 17986 20340 19447 25857 21543 19143 30482 33514 26577 14858 10862 13843 14774 14830
$$ packed form
9508F1990m320K875l059N977J23m05p348q699k453k430j021J073j353k642O29
9493C8937k345o834q279L517Q980M344O31n128J98k18j0197r038J810J346J823
9478A9547l210lM186L695K656k490l691L240Q308j349J611L427j241O89j5P833
9462D3193L092j218M136n673o38r993n927L782m696n399l948K182J243O56M047
9447B4839M655q18n081j463K465k314k022N432l046L069Q66j602N590J092N64
9432C2226P82m85l065k825K498J73l134k214j97k573m52M699l578n437l8J242
9416A7622k92k112p690p817n196r52N703N237l354j753Q335M846n440M161J075
9401A2373J851L762K354q93O410m314k400J1339L032o937j1719l996K981R31N6
$$ plain form
9386 14830 18717 21806 18890 18876 11157 1488 3953 12280 11421 11883 9121 7699 7297 5695 13093 13075
9370 13075 10276 5803 1999 8495 16478 20112 9986 10185 8974 13586 20276 17245 6923 3338
9356 3338 11221 7890 2833 7127 7845 7333 11004 12477 14694 13567 9788 11907 18505 11811 6835
9341 6835 9462 2463 -3518 1993 11015 10658 4131 5939 9630 10338 16641 16478 17885 15152 16621 10511
9325 10511 9716 14521 14872 8136 7908 2551 -1973 -3203 6613 8904 6870 7609 7297 6383 7437 8475
9309 8475 11049 11930 9828 6813 2744 1918 9694 16428 17436 20169 13324 6968 6635 11878 15051 8616
9293 8616 -2909 -5496 2008 7110 5354 4526 8458 13712 14405 15193 17594 12954 8798 9975 9245 6150
9277 6150 5397 2415 8777 8092 6227 15212 15683 12991 3377 -2200 -1435 3942 8607 8286 9423 9949
$$ packed form
9386A4830L887L089k916j4p719r669K465Q327q59M62k762j422m02j602P398j8
9370A3075k799m473l804O496P983L634j0126J99j211M612O690l031j0322l585
9356C338P883l331n057M294P18n12L671J473K217j127l779K119O598o694m976
9341F835K627o999n981N511R022l57o527J808L691P08O303j63J407k733J469o110
9325A0511p95M805L51o736k28n357m524j230R816K291k034P39l12r14J054J038
9309H475K574Q81k102l015m069q26P776O734J008K733o845o356l33N243L173o435
9293H616j1525k587P504N102j756q28L932N254O93P88K401m640m156J177p30l095
9277F150p53k982O362o85j865Q985M71k692r614n577P65N377M665l21J137N26
$$ plain form
9261 9949 14239 11880 10778 13110 14804 24151 31148 35692 29420 27134 24146 24796 29415 25489 22622
9246 22622 21351 20008 16973 13700 14060 20341 22880 23165 25041 34730 40825 38563 35737 38432 39051
9231 39051 36657 37176 38741 35999 35406 36469 37801 32652 26629 20040 21966 21092 19759 21385 23341
9216 23341 20333 17620 20974 17994 16731 20486 26242 26402 23880 16924 18054 19699 18224 17052 20444
9201 20444 21824 23888 26419 29854 35186 36135 39903 42971 43746 51114 55276 57572 62022 58686 54545
9186 54545 52000 43420 43899 49419 39762 38818 35925 31782 26329 16908 10118 11711 19866 22698 22783 15670
9170 15670 26021 35346 29404 17751 16528 14411 10190 2993 -2446 -2184 4247 1721 5137 14600
9156 14600 23132 31688 34176 30943 34511 36519 28098 19514 26868 35023 41606 39275 37888 38277 38488
$$ packed form
9261I949M290k359j102K332J694R347O997M544o272k286k988O50M619l926k867
9246B2622j271j343l035l273L60O281K539K85J876R689O095k262k826K695O19
9231C9051k394N19J565k742n93J063J332n149o023o589J926q74j333J626J956
9216B3341l008k713L354k980j263L755N756J60k522o956J130J645j475j172L392
9201B0444J380K064K531L435N332R49L768L068P75P368M162K296M450l336m141
9186E4545k545q580M79N520r657r44k893m143n453r421o790J593Q155K832Q5p113
9170A5670J0351R325n942j1653j223k117m221p197n439K62O431k526L416R463
9156A4600Q532Q556K488l233L568K008q421q584P354Q155O583k331j387L89K11
$$ plain form
9141 38488 38217 37285 30788 21252 10500 3277 4499 8416 9091 14906 14154 5409 6026 10860 13156 7214
9125 7214 4127 1623 -702 -9960 -7110 -1391 -1649 -3507 -6966 -2904 567 2634 4625 11418 15324
9110 15324 14971 9238 11394 14336 15183 11369 763 -3788 584 -3514 -1118 4433 8182 6328 7022
9095 7022 15112 19134 16854 5498 8663 6386 -495 -6053 -3992 2525 6636 5021 -1241 -4830 -4419
9080 -4419 -5762 1469 5116 6087 7939 6602 5625 1335 2345 8763 11196 11696 14280 14613 10452 5220
9064 5220 -2830 -8598 352 5902 8539 4713 4002 6526 10237 12999 6194 1915 4417 7761 12886
9049 12886 11588 7975 14003 14107 4895 461 228 1868 3517 -4651 -817 -355 75 4362 1746 4758
9033 4758 -1454 -2796 3213 7109 3555 6420 4481 6857 6949 9768 11247 13547 11078 4335 2414
$$ packed form
9141C8488k71r32o497r536j0752p223J222L917O75N815p52q745O17M834K296n942
9125G214l087k504k325r258K850N719k58j858l459M062L471K067J991O793L906
9110A5324l53n733K156K942Q47l814j0606m551M372m098K396N551L749j854O94
9095G022Q090M022k280j1356L165k277o881n558K061O517M111j615o262l589M11
9080d419j343P231L647R71J852j337r77m290J010O418K433N00K584L33m161n232
9064E220q050n768Q950N550K637l826p11K524L711K762o805m279K502L344N125
9049A2886j298l613O028J04r212m434k33J640J649q168L834M62M30M287k616L012
9033D758o212j342O009L896l554K865j939K376R2K819J479K300k469o743j921
$$ plain form
9018 2414 3973 6111 7696 12050 12964 12742 10674 12594 14228 13154 6953 -1667 -1262 -4018 -5642 -2390
9002 -2390 7909 11885 12751 9176 3980 -71 -933 -1821 -3469 -8354 -182 5581 4983 -2924 -4626 -1901
8986 -1901 -1190 4412 7675 8675 4416 955 -4582 -1349 -2490 -850 -3930 -3598 2710 4856 4681 8213
8970 8213 17564 15991 20323 29441 27673 17727 6280 -613 4544 6704 4572 7240 6009 5014 -502
8955 -502 -129 2782 -2602 -997 -2211 -5587 -4152 -3554 -2614 696 -1936 -1546 -5575 -6112 -389 -2090
8939 -2090 -3589 -3106 -2476 -3922 -2229 1074 314 1759 7647 9311 4280 4310 8638 14339 12948 9546
8923 9546 5532 5038 6020 11962 8720 5066 10217 14493 13563 14461 12608 8552 3741 5815 -1222 -6338
8907 -6338 -3339 273 -6190 -13162 -12506 -2718 612 -7919 -9332 -3843 660 4955 875 -6426 -15133
$$ packed form
9018B414J559K138J585M354R14k22k068J920J634j074o201q620M05k756j624L252
9002b390J0299L976Q66l575n196m051q62q88j648m885Q172N763n98p907j702K725
8986a901P11N602L263J000m259l461n537L233j141J640l080L32O308K146j75L532
8970H213R351j573M332R118j768r946j1447o893N157K160k132K668j231r95n516
8955e02L73K911n384J605j214l376J435N98R40L310k632L90m029n37N723j701
8939b090j499M83O30j446J693L303p60J445N888J664n031L0M328N701j391l402
8923I546m014m94R82N942l242l654N151M276r30Q98j853m056m811K074p037n116
8907f338K999L612o463o972O56R788L330q531j413N489M503M295m080p301q707
$$ plain form
8892 -15133 -20149 -15692 -6552 -137 5264 7066 11459 13975 11703 5118 6062 10548 9940 11993 10933
8877 10933 11687 9483 6185 2405 -2214 -5455 806 7996 16184 16088 11164 3663 -2506 -585 14639
8862 14639 17981 12951 7502 2139 6370 6591 2868 6336 1650 -1584 -3166 -2613 -1172 -856 -1351 -2346
8846 -2346 -3002 98 268 -3778 -6858 -3337 -7394 -11742 -9949 -5180 52 5627 12841 10686 7342
8831 7342 1714 -1761 -3673 -1618 5017 10602 4748 124 -1923 -645 5755 9743 9031 14780 21823
8816 21823 27313 27439 24026 18680 16721 19382 19993 22736 27587 30016 33168 39216 41696 39694 34623
8801 34623 29971 18618 11617 11028 13200 14180 11413 8518 8330 6555 5577 4340 2167 1734 3057 7941
8785 7941 11701 15289 12625 7353 10743 10119 10706 12272 10413 8687 9722 10122 10080 9806 8867 10006 13149
$$ packed form
8892a5133n016M457R140O415N401J802M393K516k272o585R44M486o08K053j060
8877A0933P54k204l298l780m619l241O261P190Q188r6m924p501o169J921J5224
8862A4639L342n030n449n363M231K21l723L468m686l234j582N53J441L16m95r95
8846b346o56L100J70m046l080L521m057m348J793M769N232N575P214k155l344
8831G342n628l475j912K055O635N585n854m624k047J278O400L988p12N749P043
8816B1823N490J26l413n346j959K661O11K743M851K429L152O048K480k002n071
8801C4623m652j1353p001n89K172R80k767k895j88j775r78j237k173m33J323M884
8785G941L760L588k664n272L390o24N87J566j859j726J035M00m2k74r39J139L143
$$ plain form
8768 13149 15867 12816 7187 6262 12857 32464 51340 70302 82240 90710 79982 52193 33506
8755 33506 20796 13483 15192 19869 22384 18586 16566 13989 5943 7642 10933 12535 12346 9742 11352
8740 11352 12135 13790 15255 16076 12716 13536 13806 9671 8559 5420 5595 5923 2459 4115 6829 11776
8724 11776 10536 15152 18253 16315 16962 10042 12945 19166 32811 43657 42016 36548 31115 26149
8710 26149 20771 13880 13783 3173 -3262 -962 5032 15441 17986 12709 14625 17327 11463 9569 6146
8695 6146 6553 10491 10613 6455 4623 5306 8499 6834 8847 6178 8111 10984 10154 7807 -2773 -1768
8679 -1768 1624 -535 3072 8397 9793 1849 -3162 -3142 -5280 -10724 -6798 -496 3417 6868 8108
8664 8108 5505 6401 9992 13304 10923 5904 -816 -2381 5621 12667 10066 6302 -1048 9426 21462
$$ packed form
8768A3149K718l051n629r25O595J9607J8876J8962J1938Q470j0728k7789j8687
8755C3506j2710p313J709M677K515l798k020k577q046J699L291J602j89k604J610
8740A1352P83J655J465Q21l360Q20K70m135j112l139J75L28l464J656K714M947
8724A1776j240M616L101j938O47o920K903O221J3645J0846j641n468n433m966
8710B6149n378o891r7j0610o435K300N994J0409K545n277J916K702n864j894l423
8695F146M07L938J22m158j832O83L193j665K013k669J933K873q30k347j0580J005
8679a768L392k159L607N325J396p944n011K0k138n444L926O302L913L451J240
8664H108k603Q96L591L312k381n019o720j565Q002P046k601l764p350J0474J2036
$$ plain form
8649 21462 22305 20341 26567 26942 23112 17638 15196 18730 13555 9279 7772 12098 16437 17231 14731
8634 14731 14782 15026 13577 12349 14794 19300 15156 18484 19999 13855 9160 11171 15188 16440 17377 23292
8618 23292 18939 20052 28408 29271 23249 15422 10586 11356 8321 9763 12926 10681 7956 13796 17020
8603 17020 22419 21547 21743 21411 17289 15931 13669 14407 19524 23279 24795 20311 18173 17863 10855 7506
8587 7506 13084 22865 25278 25683 31334 28570 24772 30802 31328 33853 35441 35621 41788 43637 38978 31081
8571 31081 30410 32410 28447 26709 26637 34426 40125 41436 38459 40388 42725 43705 46986 44295 39277 42945
8555 42945 52721 61316 59331 58091 64050 71675 74772 69560 62193 72339 81196 80205 86191 92650 104546
8540 104546 123423 145238 165628 191212 204446 191928 169795 151864 139400 131150 127494 114850
$$ packed form
8649B1462Q43j964O226L75l830n474k442L534n175m276j507M326M339P94k500
8634A4731N1K44j449j228K445M506m144L328J515o144m695K011M017J252R37N915
8618B3292m353J113Q356Q63o022p827m836P70l035J442L163k245k725N840L224
8603A7020N399q72J96l32m122j358k262P38N117L755J516m484k138l10p008l349
8587G506N578R781K413M05N651k764l798O030N26K525J588J80O167J849m659p897
8571C1081o71K000l963j738p2P789N699J311k977J929K337R80L281k691n018L668
8555D2945R776Q595j985j240N959P625L097n212p367J0146Q857r91N986O459J1896
8540A04546J8877K1815K0390K5584J3234j2518k2133j7931j2464q250l656j2644
$$ plain form
8528 114850 104749 95219 82178 75876 69959 65767 69163 71805 72594 71969 66601 55313 44147 43238
8514 43238 42710 41919 39195 40950 46864 51840 50999 56847 58622 63132 55710 47519 43067 36688 33829
8499 33829 40962 38458 31741 27593 24609 31563 37239 36110 34600 39253 35354 32150 28746 25232 29910
8484 29910 30127 29052 28158 24401 21507 21450 15126 16066 23193 27078 20950 18442 21120 21647 21780 24119
8468 24119 24134 19432 19301 22019 20269 18497 22940 23746 15861 17467 15682 10044 7495 10197 8295 8783
8452 8783 16800 17583 8721 4267 8472 17292 14271 10016 15120 14390 9479 11245 16799 21266 20534 24085
8436 24085 18196 7944 10900 14980 14424 10748 4685 6671 9447 8310 6632 3631 986 6777 6399
8421 6399 7037 13294 13555 13631 20681 24956 21975 26204 24152 26456 36705 37646 35939 40383 40467 36051
$$ packed form
8528A14850j0101r530j3041o302n917m192L396K642P89o25n368j1288j1166r09
8514D3238n28p91k724J755N914M976q41N848J775M510p422q191m452o379k859
8499C3829P133k504o717m148k984O954N676j129j510M653l899l204l404l514M678
8484B9910K17j075q94l757k894n7o324R40P127L885o128k508K678N27J33K339
8468B4119J5m702j31K718j750j772M443Q06p885J606j785n638k549K702j902M88
8452H783Q017P83q862m454M205Q820l021m255N104p30m911J766N554M467p32L551
8436B4085n889j0252K956M080n56l676o063J986K776j137j678l001k645N791l78
8421F399O38O257K61P6P050M275k981M229k052K304J0249R41j707M444Q4m416
$$ plain form
8405 36051 37540 47522 60504 82721 116790 170229 251357 371961 493570 572068 581775 480794
8393 480794 329587 218475 153738 118731 99609 95416 85885 73210 72084 79893 82432 77051
8381 77051 67778 59258 54795 53631 52617 51785 52572 49452 47693 44412 41709 43294 49159 52942 55144
8366 55144 49483 38983 41099 34705 27371 29827 29889 28961 33052 38577 38721 30216 23668 19753 21516
8351 21516 22751 23519 23783 30246 31917 34682 35010 25701 22941 18801 17671 20981 21206 22264 21266 23220
8335 23220 17275 9917 7099 11080 14783 17017 19856 22152 20008 10982 6953 7987 7193 5905 5892
8320 5892 7057 17880 16916 12584 12295 10077 12679 18966 20071 20777 25400 30013 30034 20717 17622 21178
8304 21178 23282 18636 15459 11702 14739 16195 14983 19789 31391 28438 30355 33943 33475 36133 37747
$$ packed form
8405C6051J489R982J2982K2217L4069N3439Q1128J20604J21609P8498R707j00981
8393D80794j51207j11112o4737l5007j9122m193r531j2675j126P809K539n381
8381G7051r273q520m463j164j014q32P87l120j759l281k703J585N865L783K202
8366E5144n661j0500K116o394p334K456O2r28M091N525J44q505o548l915J763
8351B1516J235P68K64O463J671K765L28r309k760m140j130L310K25J058r98J954
8335B3220n945p358k818L981L703K234K839K296k144r026m029J034p94j288j3
8320E892J165J0823r64m332k89k218K602O287J105P06M623M613K1r317l095L556
8304B1178K104m646l177l757L037J456j212M806J1602k953J917L588m68K658J614
$$ plain form
8289 37747 47951 61947 75861 106705 169263 252889 320987 372030 358043 255350 165738 116496
8277 116496 97545 81760 65615 60245 54990 52470 49388 44480 43141 36427 32152 29754 28957 28533
8263 28533 25374 19862 23622 24203 24289 29204 27112 18123 12843 17429 24539 31705 35587 37986 38759 31841
8247 31841 31869 29672 28146 22218 16857 19690 20056 18480 15837 18891 23322 23321 17892 18714 14700 14178 17809
8230 17809 18537 19575 14657 11864 10533 6044 9171 16710 14840 16576 19974 17025 16254 10523 3821
8215 3821 10092 16348 19019 17764 8917 10464 13687 18542 16486 11216 7483 14895 20070 27802 29531
8200 29531 16767 8627 13502 21826 27210 32718 28240 28322 23007 15385 10358 12052 13377 15575 15860
8185 15860 12224 11500 9468 8917 7861 15144 16540 16806 12086 10978 7600 -290 -1805 3393 8999
$$ packed form
8289C7747J0204J3996J3914L0844O2558Q3626O8098N1043j3987j02693q9612m9242
8277A16496j8951j5785j6145n370n255k520l082m908j339o714m275k398p97m24
8263B8533l159n512L760N81Q6M915k092q989n280M586P110P166L882K399P73o918
8247C1841K8k197j526n928n361K833L66j576k643L054M431jn429Q22m014n22L631
8230A7809P28J038m918k793j331m489L127P539j870J736L398k949p71n731o702
8215C821O271O256K671j255q847J547L223M855k056n270l733P412N175P732J729
8200B9531j2764q140M875Q324N384N508m478Q2n315p622n027J694J325K198K85
8185A5860l636p24k032n51j056P283J396K66m720j108l378p890j515N198N606
$$ plain form
8170 8999 8838 10722 3467 391 3564 9244 6894 13095 15454 10408 1545 -998 6484 9560 14048
8155 14048 14684 8669 1913 -2912 -4727 -1158 -323 -3251 -2342 1148 11444 11180 10817 7817 2213 3728
8139 3728 974 -1567 5349 13592 10070 3347 -722 -966 685 5222 8215 11182 7199 4867 4642
8124 4642 2593 876 2392 5515 9976 14628 23729 22305 18362 17070 17902 10414 9132 10307 6977
8109 6977 9622 10649 9325 8247 3792 1565 -1066 -7919 -5795 -5358 -4166 -3137 755 13475 15164
8094 15164 14261 12943 11052 5377 11447 15110 10473 5253 7606 11314 11639 9560 9203 12211 15127
8079 15127 14461 9944 884 406 6158 14948 14619 19916 24525 20080 18474 12345 10462 10411 7918 4832
8063 4832 4881 9669 9368 9678 8374 7843 17941 26163 18779 11727 10338 7770 9995 6233 1452 -531
$$ packed form
8170H999j61J884p255l076L173N680k350O201K359n046q863k543P482L076M488
8155A4048O36o015o756m825j815L569Q35k928R09L490J0296k64l63l000n604J515
8139C728k754k541O916Q243l522o723m069k44J651M537K993K967l983k332k25
8124D642k049j717J516L123M461M652R101j424l943j292Q32p488j282J175l330
8109F977K645J027j324j078m455k227k631o853K124M37J192J029L892J2720J689
8094A5164r03j318j891n675O070L663m637n220K353L708L25k079l57L008K916
8079A5127o66m517r060m78N752Q790l29N297M609m445j606o129j883n1k493l086
8063D832M9M788l01L10j304n31J0098Q222p384p052j389k568K225l762m781j983
$$ plain form
8047 -531 -3068 -3921 -1621 4354 14360 19232 18759 16364 17109 12620 13417 13089 16694 20071 16849 15652
8031 15652 11265 10268 13679 16753 10911 6609 6515 13204 11389 13960 18755 13327 10100 13632 12893 15367
8015 15367 12329 4705 7852 9470 11976 15734 12943 12885 8571 6446 11287 18426 25114 22060 18026
8000 18026 22626 22147 16342 17974 17342 18403 23706 25640 25356 23496 26746 32796 31437 27561 22980
7985 22980 21183 20685 15680 22340 24659 21614 13516 12348 17801 21985 19400 17464 15375 12561 14481
7970 14481 16353 16691 24069 25206 28430 31846 26623 21874 17825 23696 27623 29076 26170 22677 21680
7955 21680 23490 14715 11527 20241 26194 35404 42097 33934 26394 24497 25132 31319 34296 37514 33819
7940 33819 37744 41269 38892 43714 50086 50773 42307 41819 43502 44190 42554 40334 37308 34883 31046
$$ packed form
8047e31k537q53K300N975J0006M872m73k395P45m489P97l28L605L377l222j197
8031A5652m387r97L411L074n842m302r4O689j815K571M795n428l227L532p39K474
8015A5367l038p624L147J618K506L758k791n8m314k125M841P139O688l054m034
8000A8026M600m79n805J632o32J061N303J934k84j860L250O050j359l876m581
7985B2980j797m98n005O660K319l045q098j168N453M184k585j936k089k814J920
7970A4481J872L38P378J137L224L416n223m749m049N871L927J453k906l493r97
7955B1680J810q775l188Q714N953R210O693q163p540j897O35O187K977L218l695
7940C3819L925L525k377M822O372O87q466m88J683O88j636k220l026k425l837
$$ plain form
7925 31046 29156 31298 33396 27771 25555 31594 27346 30131 35469 32180 26719 23001 21884 22117 25691
7910 25691 34998 35311 21989 12879 17842 22542 26236 21633 25054 24421 16605 18091 16961 15080 24479
7895 24479 22118 16540 23977 29365 32146 24298 22009 26461 31449 25350 19484 17032 16243 22554 25503
7880 25503 29171 22142 17018 24338 31891 30800 32528 26624 23526 26312 22953 18315 24249 27018 24185
7865 24185 15705 13295 15987 16068 13773 17989 20337 19050 18684 19870 17343 21775 29772 26867 26312 24874
7849 24874 25610 21347 16921 13243 16100 22035 25994 25101 21445 15445 15741 18798 17895 17334 18926 15568
7833 15568 18877 15199 11705 7634 6855 7908 9936 7152 9474 12240 10902 11970 14986 14174 11921
7818 11921 8358 11141 4397 -3234 6983 15370 17944 15277 10757 6446 97 -1858 -487 -926 -3676
$$ packed form
7925C1046j890K142K098n625k216O039m248K785N338l289n461l718j117K33L574
7910B5691R307L13j3322r110M963M700L694m603L421o33p816J486j130j881R399
7895B4479k361n578P437N388K781p848k289M452M988o099n866k452p89O311K949
7880B5503L668p029n124P320P553j091J728n904l098K786l359m638N934K769k833
7865B4185q480k410K692Q1k295M216K348j287l66J186k527M432P997k905n55j438
7849B4874P36m263m426l678K857N935L959q93l656o000K96L057r03n61J592l358
7833A5568L309l678l494m071p79J053K028k784K322K766j338J068L016q12k253
7818A1921l563K783o744p631J0217Q387K574k667m520m311o349j955J371m39k750
$$ plain form
7803 -3676 761 278 8700 6800 7219 4344 1382 1338 -2463 -1877 -1318 -208 -61 4198 5829 7741 9715
7786 9715 8278 5507 5254 5107 5463 1592 -7959 -8513 -199 4497 5036 146 -1827 -634 7416 10287
7770 10287 7628 3420 829 -2166 -3298 -7134 -7542 -5276 -9992 -5898 -6147 -1958 -244 -373 4026
7755 4026 6154 4857 4321 332 -6916 -5050 2259 5208 13590 16004 8441 4845 5467 6881 3629
7740 3629 -754 4514 9504 9650 5395 10079 10858 6939 -137 -10122 -7756 -5199 -1109 -133 3427 6902
7724 6902 5624 6796 5346 3130 -2566 -3427 -8145 -4608 -4278 -9069 -5639 5462 8115 5684 5057
7709 5057 1272 4370 5634 7750 4376 2527 2773 2080 2328 -2771 -6298 -2907 -7619 -11642 -5570 -8175
7693 -8175 -3648 -64 -2395 1950 9923 7025 3454 4169 3039 -4335 -8807 -17846 -10684 3103 5019
$$ packed form
7803c676M437m83Q422j900M19k875k962m4l801N86N59J110J47M259J631J912J974
7786I715j437k771k53j47L56l871r551n54Q314M696N39m890j973J193Q050K871
7770A0287k659m208k591k995j132l836m08K266m716M094k49M189J714j29M399
7755D026K128j297n36l989p248J866P309K949Q382K414p563l596O22J414l252
7740C629m383N268M990J46m255M684P79l919p076r985K366K557M090R76L560L475
7724F902j278J172j450k216n696q61m718L537L30m791L430J1101K653k431o27
7709E057l785L098J264K116l374j849K46o93K48n099l527L391m712m023O072k605
7693h175M527L584k331M345P973k898l571P15j130p374m472r039P162J3787J916
$$ plain form
7678 5019 5003 12 -5053 -9222 -8940 -8508 -10386 -6473 -2412 -4673 -9677 -8878 -8050 -6544 -546 1594
7662 1594 241 2017 5317 3609 2127 476 -2501 1395 1205 -5916 -7445 -5915 -5295 -9944 -9631 1789
7646 1789 3758 5814 4035 141 -2977 -1405 -5550 -10268 -15394 -19500 -11351 -7046 -10442 -14568 -9679
7631 -9679 -16587 -13525 -12015 -14497 -14914 -15212 -12447 -11591 -11210 -7693 -3988 3009 4021 -2427 -2155 2942
7615 2942 5497 6039 10976 6005 1993 1406 -3385 -5361 160 554 2391 -1120 -6210 -8441 -9518 -7837
7599 -7837 -3875 -1899 -9467 -8598 -4072 -3394 -6905 -12535 -11787 -5710 -67 -1925 -4771 -3627 1076 4512
7583 4512 -212 947 -494 -7378 -10701 -4690 -2120 62 121 5586 5274 -212 -7022 -2228 -1323 -1110
7567 -1110 -2939 -4963 -3435 -2542 -1998 -8249 -13734 -6362 -3481 -2630 740 6366 -583 71 -1444 -106
$$ packed form
7678E019j6m991n065m169K82M32j878L913M061k261n004P99Q28J506N998K140
7662A594j353J776L300j708j482j651k977L896j90p121j529J530O20m649L13J1420
7646A789J969K056j779l894l118J572m145m718n126m106Q149M305l396m126M889
7631i679o908L062J510k482m17k98K765Q56L81L517L705O997J012o448K72N097
7615B942K555N42M937m971m012n87m791j976N521L94J837l511n090k231j077J681
7599g837L962J976p568Q69M526O78l511n630P48O077N643j858k846J144M703L436
7583D512m724J159j441o884l323O011K570K182N9N465l12n486o810M794R05K13
7567a110j829k024J528Q93N44o251n485P372K881Q51L370N626o949O54j515J338
$$ plain form
7551 -106 -172 -2019 -9205 -19865 -14947 -21585 -22590 -15788 -13895 -13857 -15342 -16920 -14514 -8028 98 -1875
7535 -1875 -2912 529 2938 -1850 -3843 -9139 -8518 -6515 -5442 4689 963 -6296 -2580 -3403 -9102
7520 -9102 -9514 -4928 2619 8947 4835 6348 2416 -4102 -3515 -9636 -10934 -857 -1929 -5868 -7596
7505 -7596 -8786 -9420 -4566 -1089 -3474 -2248 -493 -2527 -4152 -5500 142 -2852 -6151 -8169 -12869
7490 -12869 -10480 -9229 -5019 -4010 -4846 -4585 -11148 -12344 -2429 836 3110 -1410 -6538 -7364 -4920
7475 -4920 3243 5617 2053 -3056 -5237 -9264 -11669 -13148 -9710 -8116 -3629 1098 1748 -309 -5207
7460 -5207 -11907 -18324 -19708 -16347 -8846 -12020 -12831 -11363 -12322 -2665 5009 -1685 -3027 -8521 -13857
7445 -13857 -12919 -4314 1787 -1217 2931 1219 -835 -5736 -5769 -10132 -10251 -8238 -5744 -3434 7 4299
$$ packed form
7551a06o6j847p186j0660M918o638j005O802J893L8j485j578K406O486Q126j973
7535a875j037L441K409m788j993n296O21K003J073J0131l726p259L716q23n699
7520i102m12M586P547O328m112J513l932o518N87o121j298J0077j072l939j728
7505g596j190o34M854L477k385J226J755k034j625j348N642k994l299k018m700
7490a2869K389J251M210J009q36K61o563j196R915L265K274m520n128q26K444
7475d920Q163K374l564n109k181m027k405j479L438J594M487M727O50k057m898
7460e207o700o417j384L361P501l174q11J468r59R657P674o694j342n494n336
7445a3857R38Q605O101l004M148j712k054m901l3m363j19K013K494K310L441M292
$$ plain form
7429 4299 9930 3897 -2377 119 -1191 -1806 -2373 -131 -5855 -14985 -11241 2670 5962 -1860 -8920
7414 -8920 -6549 -325 -3682 -3575 -1347 -6810 -7189 -2580 -1492 -4156 -3580 2879 484 579 441 -977
7398 -977 -739 -2498 -4504 -7749 -5916 -6466 -6123 -4576 -5525 -8014 -4320 -127 -4405 -13215 -13663 -11141
7382 -11141 -7441 4671 4934 -2480 -625 -1175 -3775 4150 3647 2368 -348 -1658 -7144 -6247 -12075
7367 -12075 -9608 -3292 -2618 -6990 -8162 -3138 -3984 -3570 -4081 -9694 -12867 -10410 -2817 -4835 -8797 -10635
7351 -10635 -18878 -17668 -12836 -12316 -4009 4798 10933 15009 8238 8090 5668 -3605 -3859 -1947 -9167
7336 -9167 -15886 -14894 -8475 -4604 -5986 -5027 -7077 -6366 -4498 -1745 2142 2395 -5265 -12630 -8819 -2897
7320 -2897 -5272 -6531 -4633 -6771 -10240 -6775 -8777 -9754 -3967 -5325 -5472 -4694 -4185 -52 270 -2483
$$ packed form
7429D299N631o033o274K496j310o15n67K242n724r130L744J3911L292p822p060
7414h920K371O224l357J07K228n463l79M609J088k664N76O459k395R5j38j418
7398i77K38j759k006l245J833n50L43J547r49k489L694M193m278q810m48K522
7382a1141L700J2112K63p414J855n50k600P925n03j279k716j310n486Q97n828
7367a2075K467O316O74m372j172N024q46M14n11n613l173K457P593k018l962j838
7351a0635q243J210M832N20Q307Q807O135M076o771j48k422r273k54J912p220
7336i167o719R92O419L871j382R59k050P11J868K753L887K53p660p365L811N922
7320b897k375j259J898k138l469L465k002r77N787j358j47P78N09M133L22k753
$$ plain form
7304 -2483 -5899 -6546 -1587 341 -7165 -13839 -18303 -9525 -4082 -5267 -9922 -14754 -13775 -12365 -6472
7289 -6472 -2251 2852 -2744 -12205 -13438 -10382 -8559 -8690 -17174 -16223 -11576 -4131 551 428 884 8739
7273 8739 8680 615 -2689 -2672 -4438 -5870 -6785 -8210 -12389 -15560 -15248 -12019 -12831 -9015 -5785 -3977 -4985
7256 -4985 -12602 -8310 4963 3609 -1832 -4690 1736 4984 2263 4549 -2093 -6592 -9973 -8986 -8356
7241 -8356 -9538 -10741 -14171 -9441 -3007 -4272 -5106 -5430 -9466 -12500 -13272 -15308 -8852 -6982 -6999 -10200
7225 -10200 -9618 -8656 -5858 -1722 -562 -4718 -5301 -9844 -8247 -7426 -9295 -6591 -1989 -706 -2801 -4368
7209 -4368 -9013 -11982 -9668 -13356 -12773 -13710 -10606 -6196 -12385 -12258 -971 9161 10956 3569 -1923
7194 -1923 -1366 877 1045 2595 3791 -1307 -6444 -7056 -2880 -1612 -1040 -3911 -3042 -143 -1632 -8348
$$ packed form
7304b483l416o47M959J928p506o674m464Q778N443j185m655m832R79J410N893
7289f472M221N103n596r461j233L056J823j31q484R51M647P445M682j23M56P855
7273H739n9q065l304J7j766j432r15j425m179l171L12L229q12L816L230J808j008
7256d985p617M292J3273j354n441k858O426L248k721K286o642m499l381R87O30
7241h356j182j203l430M730O434j265q34l24m036l034p72k036O456J870j7l201
7225a0200N82R62K798M136J160m156n83m543J597Q21j869K704M602J283k095j567
7209d368m645k969K314l688N83r37L104M410o189J27J1287J0132J795p387n492
7194a923N57K243J68J550J196n098n137o12M176J268N72k871Q69K899j489o716
$$ plain form
7178 -8348 -11984 -12717 -4102 -6861 -2370 3434 -1061 -1198 -6254 -8901 -10058 -1388 -1573 -292 -2301 1369
7162 1369 -1111 4171 5685 -1282 2886 8161 1701 -1589 -3003 -3484 -3750 257 1158 -8688 -17244 -14598
7146 -14598 -11028 -6771 -941 3150 -1921 -3630 -5774 -8583 -4963 -7273 -12186 -12995 -16915 -12050 -15810
7131 -15810 -17818 -15494 -13060 -8004 -4162 -8297 -11220 -9698 -3719 -6049 -5466 -1206 -61 -575 -9437
7116 -9437 -15075 -12538 -10814 -5018 -3719 -2745 -3867 -7194 -3071 868 3717 -1132 -3388 -3184 -3238 -115
7100 -115 1654 -5551 -6680 -5180 -10045 -6519 -7306 -6444 -4382 2474 3130 3075 164 -15 751 -2729 -5236
7083 -5236 -4740 -1738 -1456 -548 2719 9186 1773 -8666 -10594 -16561 -13966 -13620 -12401 -1063 2868
7068 2868 -4843 -5797 -5604 3 -197 686 -1467 -2005 -2251 -6874 -10943 -11164 -3547 -5217 -14315 -20635 -19453
$$ packed form
7178h348l636p33Q615k759M491N804m495j37n056k647j157Q670j85J281k009L670
7162A369k480N282J514o967M168N275o460l290j414m81k66M007R01r846q556K646
7146a4598L570M257N830M091n071j709k144k809L620k310m913q09l920M865l760
7131a5810k008K324K434N056L842m135k923J522N979k330N83M260J145n14q862
7116i437n638K537J724N796J299R74j122l327M123L939K849m849k256K04n4L123
7100a15J769p205j129J500m865L526p87Q62K062O856O56n5k911j79P66l480k507
7083e236M96L002K82R08L267O467p413j0439j928n967K595L46J219J1338L931
7068B868p711r54J93N607k00Q83k153n38k46m623m069k21P617j670r098o320J182
$$ plain form
7051 -19453 -13749 -9195 -14029 -14476 -11631 -7645 -9708 -9911 -4670 597 -1162 1545 6589 5753 -6363
7036 -6363 -11913 -4998 4002 4379 2155 2730 705 4008 4166 2660 -2030 -2923 -267 7555 342 -10786
7020 -10786 -12809 -9486 -6018 -6670 -12875 -8306 -9114 -10525 -5505 -2336 -3543 -5047 -11211 -11302 -9193 -2031
7004 -2031 410 785 -63 -8329 -3488 -1549 -2531 -12123 -13208 -12356 -9121 -7007 -13185 -14634 -16065 -12751
6988 -12751 -10788 -9514 5539 11532 5733 -1786 -4612 -3677 -4044 -3851 -3107 3072 7133 4973 -1274
6973 -1274 -2710 -4132 -1528 -957 -6507 -12224 -14967 -3908 7738 9670 5504 2578 778 -1786 3650
6958 3650 2328 -4228 -10788 -8273 -6463 -7670 -11799 -15562 -14846 -9722 -11378 -17650 -11664 -2455 4186
6943 4186 6576 5509 -2736 -7812 -5040 -4875 -9927 -6756 -3686 -788 1484 3553 -2317 -2185 -2539 -9676
$$ packed form
7051a9453N704M554m834m47K845L986k063k03N241N267j759K707N044q36j2116
7036f363n550O915R000L77k224N75k025L303J58j506m690q93K656P822p213j1128
7020a0786k023L323L468o52o205M569q08j411N020L169j207j504o164r1K109P162
7004b031K441L75q48q266M841J939r82r592j085Q52L235K114o178j449j431L314
6988a2751J963J274J5053N993n799p519k826R35l67J93P44O179M061k160o247
6973a274j436j422K604N71n550n717k743J1059J1646J932m166k926j800k564N436
6958C650j322o556o560K515J810j207m129l763P16N124j656o272N986R209O641
6943D186K390j067q245n076K772J65n052L171L070K898K272K069n870J32l54p137
$$ plain form
6927 -9676 -9099 -11674 -21060 -16070 -9263 -1227 -5268 -15557 -10206 -9500 -7886 -5195 -3254 -2746 -1780 -3624
6911 -3624 -1243 -4452 -14849 -20381 -15693 -9797 -191 -381 -4566 -7154 -4930 -4901 -12022 -23531 -26889
6896 -26889 -17435 -11040 -103 8204 12529 8593 1155 -806 -2166 -1893 1639 5510 9668 4031 345
6881 345 -1384 -3313 -4701 -7024 -10597 -4890 -1807 -2340 -2268 -5005 -8480 -6709 -3705 -2304 4098 10670
6865 10670 11156 5922 -1375 -3200 -3191 -5294 743 -2017 -7035 -8135 -7268 -3826 -1685 -547 -8888 -20608
6849 -20608 -12842 -3886 -2552 -12390 -7424 -3886 2002 4623 -2717 -2892 -4027 -11654 -12740 -4698 591
6834 591 -3166 -5623 31 7628 9637 4742 7672 5888 699 -3168 -5981 -2195 -274 -6874 -7455
6819 -7455 -2150 -1725 -546 3320 3221 705 2366 611 -956 1499 3720 1571 2499 6780 4506 2773
$$ packed form
6927i676N77k575r386M990O807Q036m041j0289N351P06J614K691J941N08R66j844
6911c624K381l209j0397n532M688N896R606j90m185k588K224K9p121j1509l358
6896b6889R454O395J0937Q307M325l936p438j961j360K73L532L871M158n637l686
6881C45j729j929j388k323l573N707L083n33P2k737l475J771L004J401O402O572
6865A0670M86n234p297j825Rk103O037k760n018j100Q67L442K141J138q341j1720
6849b0608P766Q956J334r838M966L538N888K621p340j75j135p627j086Q042N289
6834E91l757k457N654P597K009m895K930j784n189l867k813L786J921o600n81
6819g455N305M25J179L866r9k516J661j755j567K455K221k149R28M281k274j733
$$ plain form
6803 2773 -1556 1259 -2564 3995 13246 16294 12022 8573 2927 -2970 -1203 -2865 -7719 -3088 -3117
6788 -3117 -3800 -5341 -2661 -3580 -6729 -6758 -6432 1791 3850 8618 4526 3001 -8271 -6706 -7888 -10713
6772 -10713 -10289 -4553 -3154 -510 4442 5630 2026 -6364 -4843 7374 9105 1702 -1853 -3814 1039
6757 1039 3332 5767 11476 11252 3559 -4776 -3652 8333 7298 4193 1390 -7616 -6530 2240 1266
6742 1266 -6587 -9127 -5328 -5106 -2681 -4666 4665 9875 11104 10738 4836 -1050 -436 -863 -5978 -8211
6726 -8211 -4843 -1026 -1339 -2371 -2228 -233 -2924 -13415 -21500 -20693 -12506 -4821 -1883 -5403 -9696
6711 -9696 -9816 -6691 -4640 5988 -2092 -9160 -5459 -4085 -39 -3982 -8722 -11202 -7735 -4896 -106
6696 -106 3556 8279 8534 1440 -2518 318 -1592 -4197 1697 663 7 2923 1510 -5254 -3300 1847
$$ packed form
6803B773m329K815l823O559R251L048m272l449n646n897J767j662m854M631k9
6788c117o83j541K680r19l149k9L26Q223K059M768m092j525j1272J565j182k825
6772a0713M24N736J399K644M952J188l604q390J521J2217J731p403l555j961M853
6757A039K293K435N709k24p693q335J124J1985j035l105k803r006J086Q770r74
6742A266p853k540L799K22K425j985R331N210J229l66n902n886O14m27n115k233
6726h211L368L817l13j032J43J995k691j0491q085Q07Q187P685K938l520m293
6711i696j20L125K051J0628q080p068L701J374M046l943m740k480L467K839M790
6696a06L662M723K55p094l958K836j910k605N894j034o56K916j413o764J954N147
$$ plain form
6680 1847 2317 -5943 -11140 -11652 -6232 -3660 -1223 -3357 265 2570 3799 4815 850 -545 -4410
6665 -4410 -1546 -699 -5443 1525 7726 6185 7150 4340 1862 1258 806 2740 2386 -3074 -6167 1686
6649 1686 4596 -2520 -4591 -9440 -9380 -5068 1546 246 -7067 -7934 -7479 -12117 -15571 -13307 -13557 -14095
6633 -14095 -13481 -10426 -6137 -2759 -8182 -7342 -4529 -3007 -5815 -12880 -6187 63 -1678 -1398 3031
6618 3031 -3290 -9106 -11514 -4510 -4699 -4271 -6578 -1452 -75 4331 9495 2768 -6841 -7585 -2565 79
6602 79 -2583 -3875 -3190 -5333 -5800 -7967 -11862 -18925 -20780 -17682 -10203 -2953 -4479 -9479 -8266 -8819
6586 -8819 -10786 312 5340 1710 -3034 -3408 1560 564 -3585 -5032 -4430 -5905 -12536 -10631 -4363
6571 -4363 -32 -5514 -10707 -7705 -4740 -6391 -5029 -1677 1565 1142 -2582 2868 5786 -658 -8969
$$ packed form
6680A847M70q260n197n12N420K572K437k134L622K305J229J016l965j395l865
6665d410K864Q47m744O968O201j541R65k810k478o04m52J934l54n460l093P853
6649A686K910p116k071m849O0M312O614j300p313q67M55m638l454K264k50n38
6633a4095O14L055M289L378n423Q40K813J522k808p065O693O250j741K80M429
6618C031o321n816k408P004j89M28k307N126J377M406N164o727r609p44N020K644
6602G9k662j292O85k143m67k167l895p063j855L098P479P250j526n000J213n53
6586h819j967J1098N028l630m744l74M968r96m149j447O02j475o631J905O268
6571d363M331n482n193L002K965j651J362L352L242m23l724N450K918o444q311
$$ plain form
6556 -8969 -7502 -4223 -2855 -1643 718 -3846 -13701 -14053 -12773 -12158 -5425 -1526 -5889 -6266 -5157 -3013
6540 -3013 -6083 -2299 2611 2792 5030 -3349 -7036 -6947 -6793 -10949 -10979 -5689 -2874 -3197 -9741 -16510 -14544
6523 -14544 -9625 -11307 -4532 5166 1850 -5094 -13675 -11003 -8856 -3576 1211 3681 2499 4935 8671
6508 8671 5160 1132 350 3039 5570 4643 -1378 -4464 -1825 -544 -4308 -7568 -7321 -6321 -5391 -5711
6492 -5711 -9816 -9179 -6198 591 -174 3861 10278 6537 -1709 -9602 -11736 -16716 -14938 -15769 -15163 -7546
$$ packed form
6556h969J467L279J368J212K361m564r855l52J280O15O733L899m363l77J109K144
6540c013l070L784M910J81K238q379l687Q9J54m156l0N290K815l23o544o769J966
6523a4544M919j682O775R698l316o944q581K672K147N280M787K470j182K436L736
6508H671l511m028p82K689K531r27o021l086K639J281l764l260K47J000R30l20
6492e711m105O37K981O789p65M035O417l741q246p893k134m980J778q31O06P617
$$ [...]
##END NTUPLES=NMR SPECTRUM
##END=
