##TITLE=Analysis number 314225
Compound Code cc 12513
Book Reference 422/111
Project Code qc-cat
Chemist Name robb
##JCAMPDX= 6.0         $$ Bruker NMR JCAMP-DX V2.0
##DATA TYPE= NMR SPECTRUM
##DATA CLASS= NTUPLES
##ORIGIN= Bruker BioSpin GmbH
##OWNER= NMR
$$ XWIN-NMR		Version 3.5
$$ Tue Oct 11 10:07:44 2005 GMT Daylight Time (UT+1h)  MAYBRIDGE\NMR@NMR_250MHZ
##.OBSERVE FREQUENCY= 250.131544655141
##.OBSERVE NUCLEUS= ^1H
##.ACQUISITION MODE= SIMULTANEOUS (DQD)
##.ACQUISITION SCHEME= undefined
##.AVERAGES= 16
##.DIGITISER RES= 18
##SPECTROMETER/DATA SYSTEM= dpx250
##.PULSE SEQUENCE= zg30
##.SOLVENT NAME= CDCl3
##.SHIFT REFERENCE= (INTERNAL, CDCl3, 0, 16.522)
##AUDIT TRAIL= $$ (NUMBER, WHEN, WHO, WHERE, WHAT)
$$ ##TITLE= Audit trail, XWIN-NMR		Version 3.5
$$ ##JCAMPDX= 5.01
$$ ##ORIGIN= Bruker BioSpin GmbH
$$ ##OWNER= NMR
$$ C:\u/data/dgb/nmr/ADRS/10690/pdata/1/auditp.txt
$$ ##AUDIT TRAIL=  $$ (NUMBER, WHEN, WHO, WHERE, WHAT)
(   1,<2005-10-11 10:07:23.80 +100>,<MAYBRIDGE\NMR>,<NMR_250MHZ>,
      <created by zg, POWCHK disabled, PULCHK disabled
       configuration hash MD5:
       62 19 C7 07 E1 42 D1 B7 37 6C 3D D0 77 39 F9 E6
       data hash MD5: 64K
       41 0D B4 78 0B 8A 15 96 3A A2 B0 70 3F D6 1A 72>)
(   2,<2005-10-11 10:07:35.66 +100>,<MAYBRIDGE\NMR>,<NMR_250MHZ>,
      <Start of raw data processing
       ef LB = 0.3 FT_mod = 6 PKNL = 1 SI = 32K 
       data hash MD5: 32K
       E2 94 B2 F7 56 7C E7 D1 F5 56 55 BB 61 B4 47 F6>)
(   3,<2005-10-11 10:07:37.62 +100>,<MAYBRIDGE\NMR>,<NMR_250MHZ>,
      <apk 
       data hash MD5: 32K
       9A 59 FC 40 D3 FC B2 D7 91 3C B5 BD D1 E9 70 6F>)
(   4,<2005-10-11 10:07:38.43 +100>,<MAYBRIDGE\NMR>,<NMR_250MHZ>,
      <abs ABSG = 5 
       data hash MD5: 32K
       55 4A 41 1E 8F 28 25 A1 F8 62 E7 B5 63 93 33 F7>)
$$ ##END=
$$ 
$$ hash MD5
$$ FD A5 68 91 3D 0B 91 1E 28 9B 0B FC 74 8C C9 72
##$RELAX= 
##$RELAX= 
##$RELAX= 
##$RELAX= 
##$RELAX= 
##$RELAX= 
##$RELAX= 
$$ Bruker specific parameters
$$ --------------------------
##$DU= <C:\u>
##$EXPNO= 10690
##$NAME= <ADRS>
##$PROCNO= 1
##$TYPE= <nmr>
##$USER= <dgb>
##$AMP= (0..31)
100 100 100 100 100 100 100 100 100 100 100 100 100 100 100 100 100 100 
100 100 100 100 100 100 100 100 100 100 100 100 100 100 
##$AQSEQ= 0
##$AQ_mod= 3
##$AUNM= <au_zg>
##$AUTOPOS= <2 >
##$BF1= 250.13
##$BF2= 250.13
##$BF3= 250.13
##$BF4= 250.13
##$BF5= 500.13
##$BF6= 500.13
##$BF7= 500.13
##$BF8= 500.13
##$BYTORDA= 1
##$CFDGTYP= 0
##$CFRGTYP= 5
##$CHEMSTR= <none>
##$CNST= (0..31)
1 1 145 1 1 1 1 1 1 1 1 1 1 1 1 1 1 1 1 1 1 1 1 1 1 1 1 1 1 1 1 1 
##$CPDPRG= <>
##$CPDPRG1= <>
##$CPDPRG2= <>
##$CPDPRG3= <>
##$CPDPRG4= <mlev>
##$CPDPRG5= <mlev>
##$CPDPRG6= <mlev>
##$CPDPRG7= <mlev>
##$CPDPRG8= <mlev>
##$CPDPRGB= <>
##$CPDPRGT= <>
##$D= (0..31)
0 1 0 0 0 0 0 0 0 0.06 0 0 0 0 0 0 0.0002 0 0 0 0 0 0 0 0 0 0 0 0 0 0 
0 
##$DATE= 1129021642
##$DBL= (0..7)
120 120 120 120 120 120 120 120 
##$DBP= (0..7)
150 150 150 150 150 150 150 150 
##$DBP07= 0
##$DBPNAM0= <>
##$DBPNAM1= <>
$$ [...]
##$SUBNAM7= <"">
##$SUBNAM8= <"">
##$SUBNAM9= <"">
##$SW= 20.6930455092707
##$SWIBOX= (0..15)
0 0 3 0 0 0 0 0 0 0 0 0 0 0 0 0 
##$SW_h= 5175.983436853
##$TD= 65536
##$TD0= 1
##$TE= 294.16
##$TE2= 300
##$TE3= 300
##$TEG= 300
##$TL= (0..7)
0 120 120 120 120 120 120 120 
##$TP= (0..7)
150 150 150 150 150 150 150 150 
##$TP07= 0
##$TPNAME0= <>
##$TPNAME1= <>
##$TPNAME2= <>
##$TPNAME3= <>
##$TPNAME4= <>
##$TPNAME5= <>
##$TPNAME6= <>
##$TPNAME7= <>
##$TPOAL= (0..7)
0.5 0.5 0.5 0.5 0.5 0.5 0.5 0.5 
##$TPOFFS= (0..7)
0 0 0 0 0 0 0 0 
##$TUNHIN= 0
##$TUNHOUT= 0
##$TUNXOUT= 0
##$USERA1= <user>
##$USERA2= <user>
##$USERA3= <user>
##$USERA4= <user>
##$USERA5= <user>
##$V9= 5
##$VALIST= <valist>
##$VCLIST= <CCCCCCCCCCCCCCC>
##$VD= 0
##$VDLIST= <DDDDDDDDDDDDDDD>
##$VPLIST= <PPPPPPPPPPPPPPP>
##$VTLIST= <TTTTTTTTTTTTTTT>
##$WBST= 1024
##$WBSW= 4
##$XGAIN= (0..3)
0 0 0 0 
##$XL= 0
##$YL= 0
##$YMAX_a= 518350
##$YMIN_a= -447153
##$ZGOPTNS= <>
##$ZL1= 120
##$ZL2= 120
##$ZL3= 120
##$ZL4= 120
##$ABSF1= 16.522
##$ABSF2= -4.171173
##$ABSG= 5
##$ABSL= 3
##$ALPHA= 0
##$AQORDER= 0
##$ASSFAC= 0
##$ASSFACI= 0
##$ASSFACX= 0
##$ASSWID= 0
##$AUNMP= <proc_1d>
##$AZFE= 0.1
##$AZFW= 0.1
##$BCFW= 0
##$BC_mod= 0
##$BYTORDP= 0
##$COROFFS= 0
##$CY= 12.5
##$DATMOD= 1
##$DC= 0
##$DFILT= <>
##$DTYPP= 0
##$F1P= 14.0000005364418
##$F2P= -0.99999901652339
##$FCOR= 0.5
##$FTSIZE= 32768
##$FT_mod= 6
##$GAMMA= 0
##$GB= 0
##$INTBC= 1
##$INTSCL= 1
##$ISEN= 128
##$LB= 0.3
##$LEV0= 0
##$LPBIN= 0
##$MAXI= 10000
##$MC2= 0
##$MEAN= 0
##$ME_mod= 0
##$MI= 0
##$NCOEF= 0
##$NC_proc= -3
##$NLEV= 6
##$NOISF1= 0
##$NOISF2= 0
##$NSP= 0
##$NTH_PI= 0
##$NZP= 0
##$OFFSET= 16.522
##$PC= 1
##$PHC0= 137.0746
##$PHC1= 7.706901
##$PH_mod= 1
##$PKNL= yes
##$PPARMOD= 0
##$PSCAL= 4
##$PSIGN= 0
##$REVERSE= no
##$SF= 250.13
##$SI= 32768
##$SIGF1= 0
##$SIGF2= 0
##$SINO= 400
##$SIOLD= 32768
##$SREGLST= <1H.CDCl3>
##$SSB= 0
##$STSI= 32768
##$STSR= 0
##$SW_p= 5175.98343685301
##$SYMM= 0
##$S_DEV= 0
##$TDeff= 65536
##$TDoff= 0
##$TI= <Analysis number 999999
Compound Code 99
Book Reference 9
Project Code 9>
##$TILT= no
##$TM1= 0
##$TM2= 0
##$TOPLEV= 0
##$USERP1= <user>
##$USERP2= <user>
##$USERP3= <user>
##$USERP4= <user>
##$USERP5= <user>
##$WDW= 1
##$XDIM= 32768
##$YMAX_p= 363004871
##$YMIN_p= -259978
$$ End of Bruker specific parameters
$$ ---------------------------------
##NTUPLES= NMR SPECTRUM
##VAR_NAME=  FREQUENCY,     SPECTRUM/REAL,   SPECTRUM/IMAG
##SYMBOL=    X,             R,               I
##VAR_TYPE=  INDEPENDENT,   DEPENDENT,       DEPENDENT
##VAR_FORM=  AFFN,          ASDF,            ASDF
##VAR_DIM=   32768,         32768,           32768
##UNITS=     HZ,            ARBITRARY UNITS, ARBITRARY UNITS
##FACTOR=    0.157963299565203, 1,           1
##FIRST=     4132.6476996994, 0,             0
##LAST=      -1043.33573715361, 0,           0
##MIN=       -1043.33573715361, -259978,     0
##MAX=       4132.6476996994, 363004871,     0
$$ Real data points
##PAGE= N=1
##DATA TABLE= (X++(R..R)), XYDATA
$$ [...]
23937 9487 8169 6444 863 -2760 -3800 -2562 5355 10274 1704 1211 937 -111 -11851 -7993 -3787
23922 -3787 -880 -2753 4330 11523 11376 5940 3503 6635 6791 4797 8704 16300 14362 9175 5297
23907 5297 10524 8307 1433 4019 2444 -1748 1741 7729 10291 11683 10118 5678 4538 7401 3621
23892 3621 3315 7088 5146 -7498 -11962 -13295 -4718 5915 -1767 -9666 -7455 -5646 -7175 -9550
23878 -9550 -13521 -11129 -11443 -13992 -12447 -4692 -4761 -11091 -18758 -17616 -16723 -7672 -6195 -6826 -477 -1661
23862 -1661 -8438 -4179 7236 9118 10338 10140 2169 -4251 6076 9531 10852 8544 9270 11054 7483
23847 7483 4431 874 -1154 -535 3731 3934 1997 5580 5890 6978 -27 -7467 -5804 -5579 -3128 -666
23831 -666 -2151 -327 249 -1839 -1234 4146 5600 3850 2881 -2674 -462 -4104 465 5021 -879 -6896
23815 -6896 -5990 -2196 -4476 -11859 -8669 -10262 -6451 -1712 -7879 -11197 -8617 1924 9513 7849 6517
23800 6517 9653 3842 -5495 -9766 -2755 3989 1827 2237 11725 9737 3235 -2357 -8547 -7656 -5606
23785 -5606 -4062 2093 -663 -1411 -9575 -4726 7221 15045 15637 12773 5438 3952 1618 2817 -889
23770 -889 -295 -9 2256 4387 4410 4510 -3452 -1928 2531 2441 2259 2942 638 -442 -2486 -2829 -2552 4262
23752 4262 3431 1263 -7313 -6945 3820 5002 9153 10223 10434 7413 4314 2367 -10319 -17318 -17178
23737 -17178 -15658 -13153 -12531 -7752 -2861 -192 61 -1126 -3005 -3745 -5874 -5878 -1392 -611 -3019 -1037
23721 -1037 -4295 848 -4039 -11850 -13119 -4317 -5194 -2893 7159 9789 10917 2038 964 1392 -8735
23706 -8735 -2445 -1440 -8551 -7751 -3067 -2688 -4369 -5612 1054 7165 5708 3190 5556 2063 -807
23691 -807 -5498 -11435 -9933 -5229 1261 11150 17131 17512 13844 10679 6325 6765 6706 11344 20426 19838
23675 19838 15923 16513 12114 9755 10394 8740 3926 3354 637 1283 2263 -1158 -6479 -5904 -6163 -2730
23659 -2730 -2118 -3907 72 -4229 -4210 2414 7306 2449 -939 -282 -1579 -1434 -1226 1042 5390 5037
23643 5037 7332 9585 1821 146 -914 -9762 -8684 -12979 -11216 -6582 -9859 -10760 -1341 2619 8198
23628 8198 10652 8126 9099 2850 -4666 -6349 -6886 -6280 -4174 -11005 -16001 -15733 -11234 -10074 -10631 -1963
23612 -1963 1737 -1905 -1703 -2529 -4092 -6705 -3659 -3694 -8090 -8949 -4703 3333 12519 9648 -956 -284
23596 -284 -1514 3042 8230 13839 12091 3068 808 1081 -209 -388 4123 6298 5249 3576 5072
23581 5072 7051 10845 9985 -1905 -6462 -451 3382 2948 -3014 -1005 4857 6847 1651 144 4337
23566 4337 -1029 -3697 -2066 -5478 -4906 -6627 -11314 -4013 1631 4395 489 -5884 -1869 2807 5318
23551 5318 3109 4600 960 -1217 3264 8134 5472 -367 5406 8549 405 -4740 -626 2064 1380
23536 1380 1353 -3312 -40 -1458 -2767 -459 3409 6454 12968 12144 8123 3526 -6320 -2369 2499
23521 2499 -307 -4821 -2483 1000 2050 -204 -578 -3197 -4044 267 735 7476 11270 5880 3683
23506 3683 1298 2667 1074 3837 4519 1592 -4088 -5311 -5443 -4089 1623 5864 2764 3456 1959
23491 1959 427 -2990 -2368 2588 4323 -1146 -969 -604 -2876 -1227 -154 6533 4376 -1346 403
23476 403 -1667 -357 2089 -2072 -5815 -9938 -3222 -2141 -3449 -10433 -11235 -4778 828 5179 2384
23461 2384 -5734 -9953 -9901 -9633 -6427 -5131 -5343 -4533 -710 2844 3720 5891 1246 -5998 -10627 -11676
23445 -11676 -4999 3953 -1834 -2241 -746 -1519 4869 6483 4841 5816 9386 9242 6935 986 -9939
23430 -9939 -10664 -10356 -6070 -10959 -16383 -10504 -2856 5739 1730 198 1987 2909 2312 -1756 -9358 -10068
23414 -10068 -9225 -2921 -2449 -11355 -11211 -10048 -12949 -11329 -144 2372 6277 10932 14554 11998 5978
23399 5978 -2036 -652 2907 3030 -3127 -6341 -3627 1916 6807 4285 5631 7506 2960 5387 6131
23384 6131 2001 -1870 -1330 -1960 -6641 -2213 -7687 -11339 -4706 -1267 1522 5958 5148 4334 4855 3014
23368 3014 1705 -3037 -7723 -6508 -7339 -1280 5675 2994 1557 270 -4114 -4796 -552 -1961 -1116
23353 -1116 2148 1137 -2807 -2467 -1387 -1723 -3055 -3892 -7824 -13893 -16754 -10750 -9651 -7481 -11536
23338 -11536 -17639 -22089 -19338 -14110 -3612 7440 4646 1308 6219 12320 13947 4346 -1452 -3692
23324 -3692 -6944 -9195 -5577 -2725 -207 -861 -7143 -11049 -11062 -4632 1125 -1699 -8026 -8859 -3203 3386
23308 3386 1419 -4643 -4243 -4762 -3370 -5969 -8536 -4286 -2910 -593 -907 4800 5461 481 5116 6319
23292 6319 7210 8568 9824 11151 8261 7305 12547 18731 16039 2744 -2597 -2018 2257 1 -6390
23277 -6390 -10204 -16458 -13927 -11567 -8705 -1810 330 -2032 -2195 -352 2176 2704 5524 6891 6646
23262 6646 3917 259 -1804 -2987 -6427 -6326 -7822 -626 1501 908 -1650 -5483 -5162 5152 10130
23247 10130 7533 3601 466 -1825 877 5475 11715 10098 1229 -671 4765 1962 3025 2371 5977
23232 5977 6112 4419 4308 -1653 -6165 -4604 -3946 -611 4825 300 1229 9920 10601 8383 5038 2747
23216 2747 -285 -367 3150 2728 9958 13082 9918 10638 9655 5610 9032 14607 11057 3361 -2967 -953
23200 -953 538 -153 -1372 -1543 -242 4274 10634 14265 16625 11236 6714 7924 7825 957 -1114 4258
23184 4258 7217 7902 13934 17258 9001 378 -685 3206 -1480 -1138 -6763 -4978 3277 7052 8044
23169 8044 5356 370 -940 -59 1994 1684 -988 516 -80 432 -334 3150 -2017 -1491 -4059 -5663
23153 -5663 1089 2378 7619 4931 -1459 -2486 -2552 -7881 -17648 -17164 -11471 -8530 2901 5313 -2876
23138 -2876 -4323 40 -790 -989 -761 -4332 -1819 1682 5647 7357 -415 -1605 -1016 -4083 -9267 -9915
23122 -9915 -6027 -2672 1546 -2068 -5524 -10211 -15290 -9042 -1165 546 -1074 2959 6810 347 -4531
23107 -4531 -3664 7257 7749 -1909 -3053 -1891 -7080 -6386 -8934 -8406 -2078 8209 8845 799 1856
23092 1856 4137 4750 6366 7067 5664 379 -5145 -1889 1807 2439 687 -2593 -4227 -8958 -5858
23077 -5858 -2122 4077 9005 6080 1632 734 -4624 -357 223 -2703 -1838 -318 -537 -2045 -6454 -5898
23061 -5898 3624 6265 5065 3626 4863 7005 4881 5931 8334 6062 549 -5748 -10936 -13479 -11023
23046 -11023 -12949 -15598 -4778 3422 2303 5680 7795 1550 -4755 -7407 -5943 1821 7729 2528
23032 2528 -4020 -7129 -7992 -9168 -2934 5686 4908 902 1258 1473 2938 -2749 -1348 4085 1448 -1216
23016 -1216 -1669 -1712 -654 1447 -3641 -6283 -9007 -5030 -1822 2073 5377 8197 13975 16021 11235
23001 11235 1358 1144 1867 2291 6155 7614 -2257 -6971 -5221 -121 1289 -94 -2339 -707 654
22986 654 -376 -2369 -1867 -1499 -5166 -4151 -3335 -4423 -8351 -8519 -7303 -2792 92 359 -566 -5787
22970 -5787 -9131 -5253 1749 7804 7090 2855 2890 5818 2829 634 -8571 -8916 -6972 -14305 -15918 -15575
22954 -15575 -13318 -9810 -7068 457 -198 -2143 -9220 -7171 -4412 -2890 -378 3877 1832 5177 8840
22939 8840 9806 7327 9522 10196 8616 10465 13280 7679 839 -3303 2442 8513 4882 -3751 -8031
22924 -8031 -9206 -12278 -11012 -9432 -6202 -9457 -3687 2842 6435 2945 1748 6138 5057 4292 3685
22909 3685 -860 -3479 -1377 -11193 -12597 -4969 3546 1279 -1708 -2040 -384 2901 4483 5517 564
22894 564 -5351 -299 1002 4188 5400 -73 -1715 2467 -5203 -13468 -3837 297 -1279 -6465 -4884
22879 -4884 -3518 -3579 -5397 -4774 -407 3240 3340 151 8684 14518 17561 9785 -767 -8236 -8048 -10304
22863 -10304 -7559 -1354 -1092 -4298 -2352 4626 9028 9828 12143 6773 3818 2555 9291 15039 16387
22848 16387 8685 -223 -2838 -2607 -3168 -4446 -2774 -2958 -2159 2147 -101 1914 1726 -3522 -3394 2532
22832 2532 1218 -7337 -6318 -3063 -2024 2524 939 -1498 -5174 -6056 -4214 -10210 -11448 -9516 -1180
22817 -1180 5367 1615 -720 2387 -1293 -3967 -3710 -5154 -7824 -4283 -147 1674 1868 -2061 -4320
22802 -4320 -3545 -156 -414 4113 9050 8420 3561 -2110 -8756 -8250 -5619 5575 -487 -8187 -8006 -5339
22786 -5339 -5198 -7187 -6323 -7789 -11978 -8339 -3586 52 6968 18423 14327 6221 3427 2934 1618
22771 1618 -1526 -2325 1742 8731 5825 3444 9386 9003 3183 -377 -1289 2381 -997 -1898 -2534 -9342
22755 -9342 -9876 -2408 2747 -69 -3912 -4380 -4670 -91 -1401 -2370 -5453 -4941 993 2897 6474 9745
22739 9745 17540 13002 -2734 -5239 531 -1799 -2360 -1471 -3957 3891 5961 6031 3749 4 -4405
22724 -4405 -1561 7910 15081 11794 8557 7430 4807 6702 3038 1822 1645 4028 7863 8931 7296
22709 7296 5578 4614 3645 6952 1027 -5513 -6006 6286 11661 6583 1585 -1101 4866 10588 14523
22694 14523 13501 12554 6840 -1274 3655 3459 -5030 -8167 -5158 -3882 -3505 -3736 -7427 -8789 2190
22679 2190 -205 -10562 -13324 -10104 -9571 -9715 -8534 -3563 4055 6533 11417 7004 4363 7547 9638
22664 9638 16051 16454 15629 10747 3693 -1385 485 1319 3038 -262 -1001 11164 12262 14573 12566
22649 12566 11212 6614 858 9021 9191 4408 6911 1362 141 -1247 3022 6293 10745 7097 6055
22634 6055 5914 5103 12736 6547 2065 4871 5803 6003 506 5004 3553 2362 4464 4450 7976 6112
22618 6112 4196 -3250 43 5930 7476 10813 10514 7225 6853 43 -1088 -5483 -1813 2228 -109
22603 -109 -4098 -5111 -4859 -5816 -1780 -1382 -8267 -9482 -6129 1925 9475 4729 2541 4241 8104 3422
22587 3422 -5550 -8678 -3630 -1092 -209 -2695 -6637 -6590 -10247 -13927 -11555 -4979 -2083 -1328 6324 8572
22571 8572 5583 1834 -373 3903 3905 -62 -1988 -4494 -3629 -8773 -4922 407 -4198 -9829 -8819 -11257
22555 -11257 -7176 -6467 -5159 -5728 -5252 1399 5116 5296 10801 10320 1821 -7663 -8855 -3589 -12345 -14938
22539 -14938 -6812 -3065 -2971 6616 9232 5926 1828 -2552 -8512 -4614 -1420 -951 4361 9866 13216
22524 13216 10618 1897 -4833 -3166 -1618 1664 3734 2727 1606 -4558 -381 58 2380 2336 -5718
22509 -5718 -6532 -824 -5436 -1297 2953 -3384 -3384 92 -1990 -6767 -7344 1721 5952 1165 -597 -2039
22493 -2039 -644 5869 7731 4971 1593 4270 3985 789 -2123 -3601 -297 1729 754 6241 5739
22478 5739 328 -2793 -4973 -3392 8263 7141 1594 1469 2076 -4276 -747 6673 6000 3827 6565
22463 6565 6461 5582 2459 5945 5421 9349 12973 5763 4754 5258 -3841 -13458 -18831 -13467 -9566 -10075
22447 -10075 -7730 -3179 -6922 -1828 451 -875 -2981 -6765 -3714 33 -4122 -3364 8011 9967
22433 9967 2841 3607 6805 4305 3429 6626 8194 3715 3890 4258 4706 7489 7418 7158 5940 -841 1103
22416 1103 525 959 -706 -959 304 -4211 -4492 -1671 599 2270 -7573 -11903 -5035 -3780 -7654 -12469
22400 -12469 -16221 -16134 -11508 -9836 -9644 -5149 -6730 -3663 -661 -6756 -9217 -9666 -5767 -8769 -9844
22385 -9844 -6857 -8904 -1481 5188 1745 2235 5812 8180 9547 6971 -1159 1199 5406 4961 5752
22370 5752 10824 3912 -2074 -6047 -3378 -590 4077 13413 17337 8762 7941 9130 6457 -2011 268
22355 268 -2400 -3792 -3822 2719 14771 16221 2412 -7965 -12984 -8100 -8903 -4202 -3496 1373 -1355
22340 -1355 -1882 -6484 -11586 -9339 -8763 -5316 -2766 -7966 -11363 -8247 -9282 -11629 -11682 -1958 3053 4591
22324 4591 5339 2682 2731 1503 -3377 -6513 -4353 3028 -726 -9030 -12463 -13888 -13527 -11459 -2266 3967
22308 3967 8516 5635 6860 18315 14734 11392 7325 4181 3892 6283 8075 9563 6310 1506 5970
22293 5970 10603 7032 5687 6247 -2289 -1760 -4293 -5386 -8580 -8934 -7089 -10210 -10926 -7538 -6360 -4590
22277 -4590 -4792 3472 8398 -468 -660 -2904 -4932 -9332 -9129 -8030 -8594 -6960 -3816 -3196 3485 1807
22261 1807 660 7131 5052 -5596 -3949 -6388 -5873 -6311 -6954 -12880 -22880 -18421 -3949 4652 1445
22246 1445 3206 3978 5687 -5289 -13711 -12429 -12191 -9218 -7963 -3123 -194 5067 2278 -2339 -806
22231 -806 117 -4169 -356 7080 6962 7476 5921 360 -4061 -8254 -5873 -1713 -3416 2297 6625 2580
22215 2580 -6825 -12266 -6615 -4173 -7678 -3877 -1743 3145 10960 12067 2678 -2510 1831 9237 7212
22200 7212 3496 1467 1209 -3620 -5867 -6019 4437 3245 913 3906 7429 4065 875 -962 -3596
22185 -3596 -5294 -4856 -746 -4150 -8493 -2377 1039 -8846 -9450 1808 6610 2647 2688 8073 9446
22170 9446 8134 13047 11149 8195 5369 5856 4869 -2292 -11202 -12068 -5626 -3645 -4685 3609 4033 2332
22154 2332 7313 7300 1855 -7173 -10776 -5412 3316 8953 8938 4237 1262 5378 5918 6795 7984 8066 -2426
22137 -2426 -7280 -2129 2720 1611 -117 -5964 -8939 1464 7567 2051 -1871 -405 -3723 -116
22123 -116 9150 10624 10607 8522 4942 1302 3935 3288 4941 3362 1504 -2103 -1534 -4305 -4267 -3720 -4099
22106 -4099 -8996 -10164 -10697 -10119 -10509 -7746 -6733 -4830 -1878 -2324 -6176 -11781 -19117 -20365 -13942 -6463
22090 -6463 -5235 -4560 -5252 -7781 -4242 4215 3958 -5794 -1954 6937 4969 133 -4248 5530 10934
22075 10934 6949 6663 4487 2232 10352 11906 5949 6015 679 -4849 -11793 -12372 -8235 -4797 -15025
22060 -15025 -13402 -4039 -2432 -903 1141 2215 4008 12880 13174 6074 5388 3449 -1605 656 -3346
22045 -3346 -5375 428 2422 1136 2526 5667 3681 -5268 1082 8133 6623 2955 2913 1010 -686
22030 -686 -2173 -2696 -3198 5906 10658 8207 3580 -1070 -3034 -1929 -5707 -2132 485 1658 -3345
22015 -3345 -10334 -13811 -11071 -3274 -1260 -763 -3676 -6260 -3024 -605 10108 8652 3903 2279 6175
22000 6175 7862 8319 5529 702 -29 -151 -1054 562 -5142 -13896 -5232 4316 4138 432 29 4009
21984 4009 -76 394 -11 -6268 -6821 -3864 -6528 -12433 -10386 330 9850 9497 2459 -3028 -2247 -7355
21968 -7355 -8797 -9137 -10122 -5396 -3714 -4302 -2055 -6209 -7399 -9220 -12807 -12825 -8022 -3798 7444 17314
21952 17314 11807 1207 -2412 1775 -4350 -8742 -8769 -8577 -10039 -8627 -10253 -16606 -16516 -8960 -9533 -8740
21936 -8740 -12780 -9875 -10347 -11533 -14330 -14819 -9819 -8673 -13578 -6546 -1796 3587 4056 -3622 -6012
21921 -6012 -7755 -5387 144 -299 -5163 -3069 2911 2373 -89 -2122 -960 -2703 243 -2365 819
21906 819 -337 -3512 -2106 3401 8113 -1550 -10586 -5611 2869 6678 7238 7588 5210 5000 6706 586
21890 586 -5201 -7722 -6437 -5656 -4449 -2302 -451 -2259 140 -7858 -11850 -7348 -366 354 -618 -3967
21874 -3967 -4096 -5450 -7859 -8567 -2353 494 -7691 -10624 -6950 -3827 -7152 -4159 751 2274 3137
21859 3137 1620 4946 3372 2481 -1123 -833 -3013 -6979 -2469 -872 -4188 -12358 -6973 -870 -2148
21844 -2148 -1871 -4425 3807 6098 7937 11068 7324 4734 -4496 -11535 -7616 -3834 -7651 -14265 -11562
21829 -11562 -7517 -7475 -5975 -6281 -8629 -7114 -4844 -3422 6833 12639 12128 10640 10143 5244 8102
21814 8102 6886 4461 4895 8234 9801 6945 4838 -765 -4954 -5868 -4133 -636 -1921 1885 7660
21799 7660 4225 88 -6738 -6705 273 -308 5703 5095 139 -2184 925 8438 5303 1937 114 -418
21783 -418 829 -2583 -6065 -7564 -11667 -14732 -10106 -824 2668 2421 10777 14671 7990 946 -1859
21768 -1859 -7910 -1305 8451 8219 7482 7521 4790 283 2829 5880 6872 3420 1566 1690 1851 -7305
21752 -7305 -11891 -7577 3432 -1100 -11100 -13916 -5266 -679 3730 9172 16829 10094 5090 5169 6512
21737 6512 3016 -3826 -2385 -1014 -1993 -4056 -7256 -3132 -3815 -1433 -4908 -7698 -12358 -14917 -9146
21722 -9146 -3455 -4743 -9966 -11678 -9861 -6123 -8621 -4192 -5242 -7328 -3351 -4787 -7188 -3705 -4267
21707 -4267 -5568 -4048 -3824 -2989 -3369 -302 257 -1470 -3575 -3851 -862 1085 6763 2926 -433 -6224
21691 -6224 -10449 -6826 -1513 4091 13424 14859 11999 1876 -712 1245 5312 3697 -303 692 -1163
21676 -1163 -2718 -2672 2561 7225 7842 8951 690 -3300 -4067 -4676 -8428 -4123 -3200 -1225 -1722 3781
21660 3781 3954 -4500 -1873 -4981 -10897 -8186 -1942 1495 2363 5391 12995 15859 13649 11511 10807
21645 10807 11091 7507 -2797 -11713 -5723 -3311 -2348 2082 4668 3313 1036 -2837 -8240 303 10468
21630 10468 11471 11175 16524 17536 10048 9647 9650 2705 980 621 -3131 -3321 3579 9496 11138 6061
21614 6061 6108 7182 7478 4969 2491 5013 6310 8868 5582 -1852 -112 1514 274 -5216 -9940
21599 -9940 -14425 -14180 -9703 -6688 -8213 157 615 -4716 -2539 -129 -3757 3601 7996 5224 1355
21584 1355 5991 6576 3213 -168 3219 5973 1492 -10110 -16230 -16333 -10438 -1211 -3172 -8130 -8221
21569 -8221 -2711 -3633 -1424 -2412 -5031 -9033 -7455 -1720 -2185 5210 6661 1112 -4797 -8317 -2999
21554 -2999 960 -2522 5742 16882 14522 4613 6422 5164 -1212 -169 -317 -6926 -12182 -9178 -9071
21539 -9071 -5201 1882 1586 6006 3490 2250 140 -398 -373 -1501 -5776 -7413 -7106 -6140 -8755 -9637
21523 -9637 -7335 -4465 -3388 -2021 -5950 -12144 -14033 -1649 2911 -9 -6314 -4910 -8794 -11823
21509 -11823 -15492 -20982 -16605 -13433 -9382 -4803 1656 6294 4357 -3066 -9591 -6471 -9346 -8124
21495 -8124 -3924 -9276 -11379 -10713 -13755 -8087 -8413 -15364 -11423 -420 -4280 -14201 -16834 -7645 -1227
21480 -1227 -760 767 1450 -1596 -9303 -10176 -9185 -4118 94 5862 9560 14365 5531 -6473 -5529 -962
21464 -962 612 3969 6081 -355 -1996 1652 9804 5118 -1420 -4803 -5432 -2694 3132 6129 1040
21449 1040 1650 6471 95 -4273 -3940 -742 2999 -1610 -5439 -2873 2700 6813 7993 9858 10163
21434 10163 3444 2163 2667 2293 -542 -3057 -4588 -7056 -11566 -14914 -13005 -11254 -6346 -2433 -3184
21419 -3184 -7793 -9020 -6461 -5205 -7697 -6793 -7849 -9965 -11361 -12350 -8688 -6307 -1793 -3026 6167
21404 6167 4506 -9307 -12224 -2635 -1179 -2087 -5572 -2967 -4079 -3064 -3332 -3684 -6450 -7978 -8167
21389 -8167 -10126 -5060 -1861 5302 6137 302 -4331 -3060 158 2619 -745 -6216 1328 9760 15518
21374 15518 7421 2537 -3605 -8261 -7143 -7268 -5508 -5640 -9930 -7616 -8440 -8798 -6026 -1412 2417
21359 2417 -235 3130 10797 11642 1499 -3186 2385 5183 3338 2318 -3765 -8522 -3473 45 650
21344 650 -285 -28 -2061 -1510 -4040 -1680 -3154 -14974 -16242 -19179 -14673 -3096 1066 -1798 -6423
21329 -6423 -8765 -2022 -3799 -7461 -3780 -5450 -6519 4309 -1673 419 4087 2262 -919 -4823
21315 -4823 7122 4108 2410 4345 4434 -634 -2943 -7019 -1985 -2521 -7092 -7803 -8861 -11392 -9557
21300 -9557 -7294 -391 3469 4962 6905 7932 8395 -4250 -6845 -9760 -3953 4298 4520 -436 -2768
21285 -2768 -4615 558 3052 -3003 -6811 -12309 -11356 -6277 4602 6939 6428 2735 2505 -3639 -3394
21270 -3394 1364 6270 5699 338 -4647 -6239 -3502 -1198 -834 -2289 837 5139 2637 2765 1452
21255 1452 -693 -2097 2337 1568 -3758 -7492 -14027 -7985 -2256 3135 6063 8189 10490 10571 9351
21240 9351 4832 89 710 3611 6036 7495 3636 -148 1406 4716 3326 1981 1898 1597 3028 -8400
21224 -8400 -18015 -17268 -16463 -13405 -10551 -10943 -8784 -8526 -4530 -2479 -2023 -2757 -8653 -14191 -7684 -2476
21208 -2476 -3771 -1504 4533 405 -5340 -4677 -1959 2317 4258 5919 7961 1250 -8138 -4647 -2942
21193 -2942 -7466 -5642 -1423 -3905 1355 -1752 -1592 -1241 -2620 854 6657 7029 10521 5401 -138
21178 -138 -4388 -5494 -1007 -2545 -3411 528 5783 2992 -740 -7984 -8152 -3613 -3424 1239 4765 926
21162 926 -1132 -2791 -7682 -6418 -4982 1398 7768 7733 7797 5773 2336 1727 -2488 -5203 -8006 -9400
21146 -9400 -8350 -8555 -10768 -9842 -10304 -15126 -17146 -12358 -9136 -6398 -2808 -2383 1229 5178 3508 631
21130 631 2168 2735 8484 9054 867 -8466 -12429 -14981 -19163 -15160 -2956 1243 -264 6632 5409
21115 5409 -2171 -1866 -2407 3732 7127 3029 -3338 -6218 -4280 -4418 -7229 -7813 -3857 1242 3806 4982
21099 4982 -225 3819 5486 845 -4703 -6328 -845 2995 6686 3723 5122 4191 -2647 -1479 3236
21084 3236 -1807 -3471 -1411 -2096 -6227 -3583 4416 9088 10862 8658 -212 -1208 3726 4305 -3589
21069 -3589 -10439 -5995 -2364 -6907 -15173 -16618 -6245 -788 -1653 -1894 548 -4762 -11441 -21644 -18322
21054 -18322 -10021 -1886 90 1424 2715 10099 17335 13340 7709 6441 3065 -673 -1117 3474 1338
21039 1338 -4054 -867 1402 -5781 -9412 -6783 -3418 600 1330 -2791 -4844 -3192 -7269 -8750 -6097
21024 -6097 -5638 -3844 -7474 -8912 -4604 -1632 -6324 -9492 -9285 -1480 3047 1360 3942 3333 2588 4139
21008 4139 287 2964 4085 710 -2775 -5344 -793 -4406 -9146 -14602 -12021 -6162 1358 4583 -2562
20993 -2562 -14002 -3447 145 3547 1765 2313 3581 3881 2828 5655 8259 12584 8866 3409 648
20978 648 -3820 -5828 4120 5875 3175 -671 -7096 -9933 -5561 -6073 -3456 4156 273 -4859 -2899
20963 -2899 -7726 -10336 -2098 5 1358 -3717 -10019 -9277 -702 -2966 -7031 -5809 -1823 273 -1500
20948 -1500 853 1725 -3458 -3997 -2398 -1891 5898 6409 3072 1622 -6109 -8949 -10522 -12523 -8490 -2974
20932 -2974 1690 3490 -492 -406 -3003 -2776 673 -1400 -4746 -13444 -12859 -7730 -4001 -3705 -8694 -5443
20916 -5443 -2801 -1942 -2795 1012 2464 1872 -1163 -8522 -8555 -1841 5360 6387 6114 2122 838 -1624
20900 -1624 -6052 -5614 2339 3114 5969 4199 3842 4638 3351 -408 -3710 -5177 -6963 -4087 8562
20885 8562 14430 8144 3827 10369 611 -8972 -12133 -17415 -23329 -15116 -9504 -7044 -5076 -9063 -5701
20870 -5701 -4904 -6666 -6110 -868 -1268 -10794 -13214 -5045 2526 1203 -2640 -8339 -8858 -9772 -11361 -14149
20854 -14149 -7174 -4252 -7893 -6787 -127 8146 11013 12065 3697 -1485 -994 -4630 -10056 -13987 -6643
20839 -6643 -3704 -4304 -1794 -2636 -506 860 -3825 -2297 -2223 749 1136 -1456 -934 -1552 -889 -2077 544
20822 544 -571 -11134 -15975 -13705 -10768 -11842 -3257 -3978 -7188 -4613 -465 1219 384 1799 6727
20807 6727 7896 1290 -678 -2381 -2761 -1192 1179 -2754 -6177 -1737 3190 4300 10944 7885 -2950
20792 -2950 -8826 -4349 -4080 -6812 -4647 5196 8780 10155 6747 1414 -2525 2110 13045 13403 4093
20777 4093 -175 257 2157 -1139 -229 -4144 -5261 -8621 -4937 -9032 -10258 -4116 5918 8859 15724
20762 15724 22195 17801 8248 -1086 -5861 -7566 -4778 -7723 -2158 -1552 224 1606 249 4358 1847
20747 1847 -4244 -2945 2143 2218 6020 10326 5381 4800 6766 7221 -256 -4792 -2338 -1426 -455 -7665
20731 -7665 -10054 -5590 104 2230 -596 1309 200 -4830 -9820 -9043 -8980 -10830 -9997 -9031 -2350 -2408
20715 -2408 -5667 -7017 -4621 -7786 -10533 -13473 -19338 -12705 -4092 5448 7934 1352 5274 2516 -1834
20700 -1834 2139 1971 -623 -7115 -8215 -6468 -4402 344 807 -96 1740 4238 11871 16032 12407
20685 12407 5295 2900 2721 4943 4716 -715 -5636 -7835 -7929 -3151 1643 5366 4110 -1597 866
20670 866 3745 8299 12202 15891 14577 4118 2672 5657 -600 -2603 -5214 -3410 -4678 512 4780
20655 4780 3693 5148 3925 -673 -8318 -153 4361 733 -1644 -2535 474 -2673 -5323 -6288 -6341 -1107
20639 -1107 -4488 -9340 663 14311 13272 7362 -2985 -4940 -1190 299 -3830 -8047 -10131 -16798
20625 -16798 -16761 -9072 -6574 -10594 -7230 -641 546 4663 -1492 3194 4338 -1016 -9805 -11076 436
20610 436 6088 1927 4313 -4009 -10242 -5130 -906 -885 1466 2291 -3271 -5277 -3594 -2051 -952 -5490
20594 -5490 -11924 -13163 -3542 1782 -974 -9455 -10558 -6966 -1369 -2089 8113 12374 18466 23201 16774
20579 16774 9208 225 1534 -237 -3823 1284 4827 4693 2996 -6633 -8247 -3864 -4821 -5533 1520
20564 1520 10357 7317 -1379 1150 2156 10426 9435 665 -6326 -3829 -5681 -3689 -2059 4827 3595
20549 3595 -5118 -5794 845 -349 -780 2977 5038 5681 5391 -1274 -8282 -11234 -9816 -9343 -7593 -3524
20533 -3524 -4465 -2614 -4443 -8296 -5348 -4546 -8508 -9764 -7216 -6857 -7102 -6008 -3192 -8478 -3511 -3241
20517 -3241 -1288 -7025 -8832 -8257 -5384 -417 4542 6003 4895 2292 -1137 -2633 -6093 -5586 -589
20502 -589 -586 -7693 -5565 25 -2469 -3270 -902 -888 -425 810 -2783 -2848 -3736 -3648 -1739 3239 6788 2665
20484 2665 -6633 -4816 -1010 -7392 -9131 -5567 -7629 -11361 -11846 -8824 -2059 3368 5146 5687 5299
20469 5299 3901 3211 4725 5875 3136 -2517 -6523 1800 2390 3113 -1035 -2465 2390 -353 -2387
20454 -2387 937 -4086 -6535 -5288 -7024 -18060 -21683 -18146 -16013 -14102 -6437 -8414 -18942 -14361
20440 -14361 -7443 -123 -5719 -15581 -13008 -14620 -20308 -17488 -12064 -11344 -12505 -2348 3553 3834 2295
20425 2295 -1364 -12641 -17782 -18537 -13401 -14891 -16958 -14622 -15475 -13042 -9299 -4153 -2805 -10676 -6345
20410 -6345 -5507 -7932 -1723 3909 3325 1221 -1120 -3617 -2684 -3719 -1523 -65 -4022 -5742 -3686
20395 -3686 -6578 -9292 -2334 -2250 1450 6503 2040 4551 6919 5650 7072 10457 4136 -897 -4756
20380 -4756 -13511 -7875 -7986 -11074 -6710 -7251 -9757 -9671 -3241 -4813 -5907 -4403 -104 -2927 -5866 -8134
20364 -8134 -7681 -6635 -5528 -10574 -4816 -1599 2533 1834 3679 3656 2505 -3858 -8923 -8880 -4105 -6858
20348 -6858 -10440 -9614 -6387 -3536 -941 -2624 -139 -3712 -5206 -11066 -13314 -11012 -6653 -660 9206
20333 9206 14949 11735 3887 1920 761 3905 6184 13469 15759 11847 371 -4738 -3131 -1321
20319 -1321 -3289 -90 -1596 -4543 -5505 -1323 4138 1054 1766 3412 -3641 -13788 -13280 -9948 -4176
20304 -4176 -2146 1767 594 3445 5866 -773 6430 11848 9619 -1974 -10984 -9112 -7269 -546
20290 -546 3576 -4882 -6787 -5119 -9098 -12971 -16654 -13148 -1411 2947 -1761 -6093 -2538 -2295 -6442
20275 -6442 -5227 -2346 -3697 -673 -2895 -7044 -7019 -3234 -2708 3107 7206 8360 8441 6296 2512 -3160
20259 -3160 -5300 -5312 -6892 -1566 -6413 -7737 -6382 -2307 -5372 -8790 -11052 -12969 -14962 -18953 -18469
20244 -18469 -12603 -9532 -6684 -8607 -2407 778 -5955 -640 2181 487 -3123 -6808 -8222 -7310 -10297
20229 -10297 -9951 -11921 -9076 -12198 -17076 -12587 -16603 -16570 -13206 -8229 -8637 -11381 -9797 -4565 978
20214 978 3701 6136 5510 5925 134 -336 -11162 -15274 -16246 -17927 -15769 -6449 -2315 -3349 -4358 -5899
20198 -5899 -8747 -7492 -2817 984 10 -5305 -5311 3091 2710 2975 933 -1341 -1238 3081 4510 1793
20182 1793 2172 -2773 -706 -1931 -4289 -7607 -8897 -5301 -2295 2139 -142 -6098 -6592 -4100 -3943
20167 -3943 -3993 -1383 -6370 -9332 -9912 -10885 -9589 -11925 -11785 -5277 -4447 -5841 -3377 -237 -3261 -1491
20151 -1491 2210 3213 5385 4401 1570 -857 -469 -7133 -8596 -3357 -6551 -7656 -7557 -6604 -3335 4258
20135 4258 6557 4022 4409 -1944 -4918 -3135 4858 8890 4368 -5180 -5281 285 -2180 -7478 -13178
20120 -13178 -16769 -12767 -5868 -2050 -2644 -7286 -12160 -7623 -6237 -96 1265 910 -369 3431 3221
20105 3221 -4859 -9723 -8627 -6313 -6871 -8134 -8353 -1197 -1368 -2954 -199 -586 -4795 -4350 -2561 2154
20089 2154 6884 8048 10355 12325 8743 3704 1581 -2207 -2828 -8355 -11703 -8492 -1174 3684 -259
20074 -259 -4687 -4097 1702 7066 4167 2941 -5157 -8098 -600 1274 -4102 -4992 -1087 5353 6298 2093
20058 2093 2512 801 -327 -2176 -1710 -2963 -6074 -11205 -13934 -12325 -6092 -1825 -3624 -5303 -2501
20043 -2501 -6979 -11201 -9153 -6232 -8715 -11865 -13472 -11562 -13675 -16106 -16946 -14036 -11442 -11438 -9462 -8652
20027 -8652 -7321 -15029 -12443 -5855 -688 -5436 -10261 -12938 -10991 -7735 -5855 -48 5989 6805 5811
20012 5811 6428 3757 -7996 -16586 -9110 -3055 -3747 116 345 -1240 2881 -447 -5289 -1541 -3950
19997 -3950 -10134 -12768 -11489 -10654 -2587 -2472 3612 4039 -740 -1505 -3322 -5234 -7960 -8565 -5679 187
19981 187 -478 -6091 -2193 5153 9465 6541 4033 1073 -6506 -2319 2165 2999 2755 -4086 -6119 1706
19965 1706 14196 9161 10479 11034 9251 3933 -1616 -12312 -18107 -15546 -8289 -1364 -1564 -2633 -276
19950 -276 -5474 -9687 -18019 -12279 -7563 -13266 -6352 -7755 -10260 -7851 -4126 -4366 -3551 -6381 -7001 -10899
19934 -10899 -7657 -1735 -4911 -13218 -8503 -4954 -1766 2121 8940 12267 2151 -2083 990 2462
19920 2462 -5720 -9017 -6790 -7907 -12384 -13265 -6481 3676 1893 154 -1297 3162 -1787 -4828 -5577
19905 -5577 -4113 -4044 -1721 -4124 -5209 -6747 1564 4997 2832 879 -1830 -4065 -3432 -4189 -6440 -7979
19889 -7979 -9851 -9479 -8082 -4464 140 -2868 -259 18568 27466 23495 15468 7621 12271 10772 12742
19874 12742 11195 2066 1405 4286 -1203 106 5317 4320 6905 8688 5979 474 3497 4838 -1581
19859 -1581 -662 -314 1962 7770 7972 3457 5489 2264 5379 12365 11597 9251 4800 611 -3359 -1793
19843 -1793 3738 3714 2222 -2493 -5290 -12419 -11142 -5109 -3686 2681 5470 8886 5978 3274 -289
19828 -289 2867 6661 4409 -3358 -783 950 3844 2284 -671 183 -1473 -4579 -8689 -14146 -17445
19813 -17445 -12604 -9523 -848 190 -6818 -731 5444 6024 205 5283 -1477 -12817 -10549 -3174
19799 -3174 -7109 -12116 -8218 -6896 -4218 -3328 -5374 -3650 -5108 -2415 -238 1294 724 -3126 -2429
19784 -2429 -5479 -2853 7263 11196 9108 7666 9387 6529 1095 2719 4021 -287 -1740 1504
19770 1504 8660 13972 9467 2191 7424 12259 9013 2781 200 -1610 -9853 -11265 -11610 -16538 -16676
19755 -16676 -13792 -13289 -12775 -8862 -9537 -815 2821 -3711 -10423 -11303 -10213 -11054 -9524 -2820 -5818 -11320
19739 -11320 -10516 -7176 -5444 -10472 -12403 -1974 7565 5871 5383 1525 592 88 -3088 -13422 -12364
19724 -12364 -4612 1852 8527 14160 12434 12174 6533 -1282 -4927 32 -2861 -5708 -11777 -14055 -14027
19709 -14027 -13019 -10159 -10495 -2313 -11987 -14646 -587 1143 -1915 -6541 -3287 -3304 -8935 -9213 23
19694 23 -4452 -8863 -9938 -7053 -3028 -2664 4778 6196 6154 4628 3009 -2272 -5087 -3078 -3117 467
19678 467 -4666 -1458 2584 -906 -3161 -5539 -3719 -2815 5377 9114 10218 9308 9347 2312 -3215 -553
19662 -553 2018 11208 13960 9451 11247 14757 7021 6254 6294 6112 5452 6430 3299 2179 441 -3092
19646 -3092 -208 1349 2621 2190 1945 4043 -1099 -6786 -8426 -6346 -641 3025 -3323 -3117 -3712 -561
19630 -561 6354 6262 1523 -4999 -6612 -10359 -11112 -7035 -5316 -3031 -5185 -6013 -3670 -2127 -967 -7332
19614 -7332 -10227 -5868 -767 -102 -4652 -4765 -4102 2923 15102 12142 6239 -3847 -3173 3876 8191
19599 8191 3474 10820 14657 9948 7278 6508 4722 9694 8997 4458 169 -871 9659 12878 16630
19584 16630 16071 6542 -993 1931 1837 -3414 -8009 -4321 2026 3442 4274 7819 7782 11035 13827 19276
19568 19276 19430 16920 9932 5297 9668 8790 4820 5218 4114 4336 11637 2722 -413 8028 9229
19553 9229 5235 -637 -5550 -2839 4015 7854 14865 17177 20906 21009 19341 24702 23980 20491 22875
19538 22875 26795 32148 27489 27053 27532 28628 37397 42868 40026 39739 53693 70485 92585 131643
19524 131643 172616 223514 281252 334815 380130 405182 410264 413585 430809 472673 560317 663579
19512 663579 747949 794378 798700 776099 716448 652209 590074 554346 547444 545122 539231 518092
19500 518092 478222 431433 382733 326319 277433 232830 198597 175862 153444 139265 123472
19489 123472 108989 94253 84990 80188 71635 62811 61441 53055 46992 42387 33101 20836 21548 19039
19475 19039 20353 23476 18789 9435 10898 14469 15805 17383 22979 20609 21262 18561 12121 9460 16089
19460 16089 21011 18376 9889 9404 10050 10512 13922 12523 3388 -2381 1223 -1461 -6002 -5999 3075 5088
19444 5088 6151 12697 11656 4976 4677 9502 9904 7801 2036 -3849 -3746 -7875 -10625 -2704 -5197
19429 -5197 -7101 3223 4957 -4731 -11522 -9952 -3375 -970 973 -1349 -6679 -3943 -5787 -9861
19415 -9861 -16084 -15550 -7470 -1127 -2134 -3428 -3577 -4581 -7906 -8290 -6389 -8521 -10621 -7141 -2905
19400 -2905 -3032 -12514 -12150 -8259 -1576 2265 -2323 -8186 -6855 -2355 -767 -188 6402 4980 -2011
19385 -2011 4383 8752 6341 2463 -4048 4879 7691 4914 -230 -870 -476 -3340 -1542 -5417 -10075
19370 -10075 -10737 -8340 -1244 -3241 -1238 -548 -3849 -5147 -9275 -9884 -7417 -4263 -3773 -3901 -5533 -9858
19354 -9858 -7439 -11556 -17207 -12648 -7735 -946 -958 -2640 -5907 -189 26 -4572 3434 -503 -8730
19339 -8730 -10334 -14718 -13997 -11098 -14713 -17528 -11237 -8997 -13200 -16788 -16746 -9211 -8497 -10154 -7275 -3000
19323 -3000 -1892 -8503 -12906 -4472 -1423 2177 -2246 -10592 -8303 -2980 2533 11301 7229 4553 3607
19308 3607 -4151 -9966 -2348 1793 -2001 -6263 -7443 -10119 -4310 1387 3934 -2325 -4768 -3283 2281
19293 2281 9206 10249 0 -8650 -11327 -10527 -12966 -17509 -5600 6407 9402 6503 -817 -1503
19279 -1503 -1871 -9599 -14074 -14472 -15361 -15084 -17562 -15044 -11229 -7955 -2246 -642 -4173 -2699 1639 7055
19263 7055 3679 -3398 254 756 882 -3082 -4480 -6805 -6838 -5248 -5902 -3903 -6412 -8542 -5596 -7981
19247 -7981 -5762 -4546 -4060 -3605 -2526 -2868 -3597 -6626 -10009 -12895 -10154 -4754 2976 6867 6779 7277
19231 7277 9375 3167 1330 6358 469 2261 -1826 -10978 -17940 -12909 -6533 -3496 -3618 -2036 4587
19216 4587 -3071 -8983 -6227 -9793 -2407 -957 1969 1328 -4061 -6264 -534 262 -2439 -2320 237
19201 237 1634 -404 -4749 -694 14926 12932 5483 4674 1516 -3395 -5015 2463 5443 8080 2084
19186 2084 -4645 -201 2564 551 -6359 -8143 -12069 -16707 -17009 -14143 -7151 -1561 -6736 -5360 -1001
19171 -1001 -4068 -6725 -2449 -3692 -10684 -10122 -5380 -6463 -1074 -820 -10168 -13428 -9463 -3225 -8594
19156 -8594 -13931 -7393 -5870 -13859 -17137 -14019 -10452 -6746 -6789 -6970 -3958 2850 1399 2084 2473 -2351
19140 -2351 -2819 -203 -4421 -12628 -16925 -12544 -11889 -8167 -11681 -10520 -13051 -16830 -7212 -11656 -15491
19125 -15491 -13106 -4663 -899 1119 8862 13844 10558 9203 7847 5859 -1776 -9809 -5469 566
19111 566 1791 -385 1796 -3155 -2681 -5019 -10687 -5831 -906 1053 3324 4798 7960 9612 11890
19096 11890 12317 8514 9012 7701 10341 8940 6547 4331 3297 -1437 1369 9670 12512 12920 4355
19081 4355 -2540 2635 1040 -2319 -6722 981 2125 -5152 -4409 -989 -10821 -20001 -17383 -9997 -13898
19066 -13898 -11624 -7790 -10379 -18906 -18020 -9650 -8123 -9769 -5292 -4888 -10026 -8913 -6070 -9485 -11981
19051 -11981 -10457 -6582 -5187 -10696 -7786 -3926 -2643 -3440 -6530 -9332 -6163 -3112 -10859 -19861 -9112
19036 -9112 -5800 -5943 3730 11263 -1533 -8200 -9466 -2797 -317 3867 6292 3582 6390 3724 144
19021 144 -5301 -12925 -8849 -4700 -7490 -14080 -12172 -7816 -5528 -5686 -3005 -4469 809 3443 5054
19006 5054 3180 -1665 -3244 -4679 -1685 -1582 -3461 -5916 -6278 -2097 3915 36 -1588 3004 4311
18991 4311 5778 -1561 2648 17158 16790 12033 7161 3587 8424 6988 3476 -2082 -7978 -2016 605
18976 605 306 -1627 4304 -1343 -5445 -4794 1287 2905 4786 3769 2254 -1266 948 2601 2398 -3471
18960 -3471 -12167 -11277 -8575 -5174 -2241 -1886 -1118 -1886 -2527 -4800 -3913 1025 2711 -1764 -3843 -3593
18944 -3593 -4171 -7870 -5220 -1955 -4959 -7058 -2919 -6586 -11334 -12866 -13139 -7116 -9507 -8542 738
18929 738 9134 -570 -9749 -12854 -6621 4166 6146 6355 618 3299 894 1415 622 -5266 -18499
18914 -18499 -20680 -16984 -14770 -5885 -3242 -1380 1996 -5220 -3135 2671 2698 -3558 -9937 -5140 162
18899 162 -1054 -4357 -1293 2277 2709 4910 2388 -5782 -8775 -5026 -10805 -12535 -15251 -14979 -9525
18884 -9525 -5874 -6292 -6093 634 3491 -2540 -11632 -13632 -11164 -6239 -5264 -6980 -8052 -3217 -3795 1479
18868 1479 3547 2550 1090 2292 662 -6805 -3973 -3747 -1530 3140 4173 1088 -6261 -5193 -8459
18853 -8459 -13161 -16225 -14905 -10315 -5645 -7135 -6419 -8332 -9007 -13504 -14638 -16458 -10695 -4778 -2054
18838 -2054 -467 -1133 1862 2989 -6284 -9261 -7610 -2131 2663 10134 11342 5121 -1036 -6754 -9006
18823 -9006 -10584 -2809 5756 9772 2660 -3895 -4342 -8459 -7875 -3713 -2600 2512 -4054 -6215 -1340
18808 -1340 -1656 1045 7555 5544 2038 2092 3233 -2151 -388 -3389 -7815 -10912 -8305 -9920 -10322 -3924
18792 -3924 3215 177 -3332 -3965 -5479 -10007 -6825 -3764 -3221 -4702 1470 -1914 1134 8098 6676
18777 6676 3573 1550 2404 1649 4663 -522 -1710 -8130 -7535 15449 32154 38143 38814 36510 33584
18762 33584 24990 13594 8594 6601 5116 4176 6584 5239 3319 3408 9224 6812 10848 8284 762
18747 762 4781 440 -2194 175 626 8193 16888 15337 17214 18714 18035 19172 15344 12495 9441
18732 9441 11801 13949 11578 7908 10295 10469 13459 18544 17904 17646 20730 18175 15390 12637 16695
18717 16695 18351 15612 13528 8459 2139 -5118 -7338 -2661 -147 1654 3147 2260 -2129 1475 9080
18702 9080 12111 10862 10659 1067 -3202 -293 4093 4789 12800 12587 -181 -1807 3499 3749 3085 1107
18686 1107 7089 3396 1569 -951 1301 -5736 -10436 -16498 -15695 -912 -424 -1458 -112 -1622 -6770
18671 -6770 -8703 -2283 2539 3401 210 -4112 -8385 -10425 -6171 432 2261 972 -3766 -4572 466
18656 466 -205 -671 -4398 -17192 -17649 -13964 -14871 -20449 -21143 -11153 -3219 -9155 -8649 673 1861 -1671
18640 -1671 -4263 -7437 -10290 -6358 -8182 -6437 -5284 -8199 -6157 -3476 -7370 -4235 4486 3442 7254
18625 7254 4948 -2125 -5626 -8140 -1358 -1136 -7155 -9825 -8759 -3480 3156 227 -4118 -5506 -4461
18610 -4461 -5179 -4881 -7398 -11073 -15223 -13527 -8570 -15326 -20153 -17641 -10172 -6144 -4829 -3867 3534
18595 3534 3404 -2838 -4348 -3853 -3019 999 -5123 -9628 -7267 -6995 -12000 -17974 -14554 -9788 -11028 -13259
18579 -13259 -10935 -6127 -1399 121 4823 5465 751 5135 134 -895 180 4321 4688 4631 7722
18564 7722 8944 5755 2548 5439 5945 6769 8279 5377 -1457 -6459 -1734 -7102 -2482 7050 5412
18549 5412 4706 4855 7151 9362 10723 3970 -1295 -5031 -3042 -3523 -2151 322 -7981 -11328 -9791
18534 -9791 -4704 -340 2252 -2442 -7597 -4092 -478 -3286 -2638 -5845 -2544 -5602 -3601 742 2966
18519 2966 4819 3005 1090 2945 450 -3365 -2452 -2274 614 2869 4032 5003 4669 2680 350 -7404
18503 -7404 -8678 -7099 -4595 571 -2451 -5608 -2336 3745 -651 -9100 -7426 -4705 -357 7282 6787
18488 6787 9785 9412 15763 13864 4351 -5611 -10257 -9085 -3437 4796 3740 3026 2769 -2322 2378
18473 2378 9494 11430 7360 692 -1854 -9762 -7404 40 -1039 -2459 -2172 -1604 59 1454 3207
18458 3207 4340 8623 8400 5156 8629 8421 5223 4979 3880 1859 -1043 2766 5892 6340 1803 -2525
18442 -2525 -397 5748 10585 9205 3354 -3390 -6570 -6558 -10771 -10089 392 2048 -3832 -6112 -7508
18427 -7508 -8208 -7379 -4325 -2991 1137 1611 122 2606 5487 4501 4239 9167 9955 947 -3854 -6077
18411 -6077 -5853 -5862 -7378 -4693 -8742 -11284 -3907 -4198 4528 4391 666 -4974 -3605 -3756 -8319 -4976
18395 -4976 -1527 953 7568 7185 310 -3224 791 10021 12220 7619 2500 -3519 -5512 5681 7069
18380 7069 5201 4378 996 5736 8768 1083 -11401 -10731 -5182 -2388 2775 6682 5852 3105 1316
18365 1316 2077 6111 6040 7719 4082 -1591 979 1717 832 4881 -5 -1103 -877 -1523 -2920 1966
18349 1966 4096 -134 -4591 -8610 -9341 -14421 -13563 -1416 604 -2296 2021 4349 10285 14287 20826
18334 20826 12951 11693 12424 9381 7328 8797 10898 8484 5982 -1803 -7831 -8989 -8449 -4660 -8027
18319 -8027 -15144 -12941 -6806 2183 4671 2557 5160 8357 9205 7773 10281 19133 17098 9308 3541
18304 3541 -9763 -12980 -12396 -12378 -5546 2451 1563 2002 2180 8023 13794 12655 7031 5515 7163 8324
18288 8324 1699 2638 8800 11142 2083 -101 2737 5141 13231 4511 5158 10793 14382 13852 3126
18273 3126 4995 10497 9681 6644 6477 7188 13865 8444 3776 6757 6203 8585 2473 1786 2297 2119
18257 2119 -1490 -6939 -4945 -1859 106 473 980 -639 -5927 -11715 -11069 -3922 -825 -5393 -4899 -7025
18241 -7025 -6578 1902 4263 -976 -611 1662 5989 14013 16018 16094 12466 5444 5653 5595 -2535 -2206 2872
18224 2872 2691 -4749 -8774 -5216 1657 4412 3833 489 -4121 -4587 774 3232 1121 2542 2420 3300
18208 3300 2757 8186 2340 1512 15847 22871 21137 12604 -1692 -3598 825 3563 2768 7557 9150
18193 9150 14631 11623 8047 5568 4613 3980 2402 -2617 -1119 -3365 679 3207 7341 10958 7454
18178 7454 10536 15322 16633 14688 19905 18446 14502 9271 11198 15328 14588 6413 591 2744 9176
18163 9176 12665 19986 20722 24830 19833 16336 11484 8655 12450 14654 16881 20113 15322 18895 18437
18148 18437 14309 14085 11137 12587 19086 23563 23236 27722 32858 36119 43365 40815 38993 41881 44381
18133 44381 49741 54727 53706 56227 57340 62573 71848 81327 93444 102924 109226 128450 146706 169252
18119 169252 195924 230772 266421 306586 361339 439434 548710 731492 1032870 1562281 2572529
18108 2572529 4299181 6197690 7108983 7362798 7352709 6872986 5629809 4211062 3167586
18099 3167586 2500142 2066993 1769372 1547348 1376080 1250905 1165599 1107926 1057118 981060
18089 981060 871667 765897 672864 588271 513776 446982 393867 345668 308761 281221 252899
18078 252899 219047 192158 171295 155022 141727 131363 123221 113933 107382 103231 96769 88246 79086
18065 79086 71136 61282 52260 50648 54240 56509 49210 45268 41405 34597 38072 42900 38020 29895
18051 29895 21637 17119 12002 4657 4320 5330 6388 1793 279 3317 6684 12501 13064 8383 6984
18036 6984 7675 14112 13326 10865 8584 11813 6373 10658 15097 14968 15071 10860 8996 9865 11601 6627
18020 6627 8927 7544 2508 3777 5980 6120 2733 -2828 -7407 -86 1704 1917 1764 4920 -1255
18005 -1255 -2768 -5574 -1359 585 9848 14785 12675 7079 253 1303 8175 9088 117 -3001 551
17990 551 -613 -10386 -8036 1134 2888 -3562 -6610 -7554 -4646 25 -2287 -6714 -7321 -2506 4386
17975 4386 4100 2248 4665 10707 12763 9417 6126 11524 14354 19729 22075 20858 20113 17203 15068
17960 15068 15597 16331 10979 7496 11315 9424 2225 -6092 -982 3077 -1105 -2155 -4353 -2593 1781
17945 1781 4841 1840 -1205 -2224 504 6294 -439 -10143 -11430 -7541 -5908 -2127 4589 5120 5833
17930 5833 1549 -45 -4036 -4142 -5009 -10232 -11972 -9825 -11347 -3591 2351 4478 7506 9238 7523
17915 7523 2411 571 6187 7424 4274 -2858 -4560 -4122 -3081 -8038 -2043 7444 14434 17800 16058
17900 16058 10453 14060 12754 7157 8032 8813 6433 -3333 -5427 -2287 2450 -1006 -1182 -3228 -2188
17885 -2188 -1600 -5165 -9141 -7607 -8881 -5906 377 3799 3381 2136 4882 -2385 -1854 -35 -1881
17870 -1881 1742 8033 5687 -517 -1773 -3885 -6072 -15299 -13004 -4785 -8693 -5185 -6374 -5873 -2942
17855 -2942 2658 2168 -1079 -2354 -6531 -2590 -2262 5096 11796 7014 4521 -1182 -5711 -6038 -2158
17840 -2158 -690 1023 -2866 -2259 1339 -2788 -7317 -293 6996 4130 2534 2717 7794 10385 9540
17825 9540 4460 166 -3367 -3562 -1988 -33 -680 2638 4922 9281 12895 7225 2180 120 -1826
17810 -1826 -2432 1028 224 -5578 -1431 2922 2049 -2074 -6391 -6196 -5093 2258 -1166 -3134 -1969 943
17794 943 -6145 -7409 -7963 -7349 -2714 6634 5549 49 2325 7063 6105 3962 -4804 -4692 4866 8493
17778 8493 1570 2755 1971 -2345 -5687 -4217 -1461 -4717 -3960 -1761 1633 1436 -5405 -5690 -5830 -4625
17762 -4625 1754 -652 2059 2923 -4338 -5724 1538 6532 7802 11483 7903 4406 2818 1745 7310
17747 7310 7621 9009 5142 1687 2153 2230 2239 -1795 -3919 -521 -571 -2483 -5459 -2702 183 -949 -2853
17730 -2853 3783 1634 -970 -110 3724 980 -6291 -10090 -8649 -2180 1947 -1099 -4929 -15201 -15218
17715 -15218 -7599 -2538 -3656 -8067 -4002 -755 -2397 2788 -1867 -4111 -5360 5193 279 -6006
17701 -6006 -4424 563 2135 4658 849 -1710 258 3212 3954 679 3900 -550 1616 992 -1064
17686 -1064 -2878 -2075 442 -24 -8037 -10672 -17169 -20827 -17358 -10093 -6371 -4227 -1149 -3003 -3701
17671 -3701 362 -538 1113 -890 -7276 -11692 -2810 860 -832 -2374 -8227 -9776 -8219 -6459 -9741
17656 -9741 -8070 -7441 -2958 144 -4111 731 -581 -4951 -13956 -14411 -11561 -10728 -6399 -3556 -228
17641 -228 -3404 -6401 -2573 -1684 673 -122 -3955 -9567 -11026 -3726 -3446 -1746 -2761 -1392 -611 -1499
17625 -1499 680 -409 -3101 2205 2884 -30 -384 -1159 -696 1106 -348 -1344 2622 4377 4020 7955
17609 7955 7227 10150 10173 6498 9120 7871 7306 10927 15742 18329 22904 18950 11285 15483 24527 32663
17593 32663 32807 38878 42960 42185 44701 54699 59395 68914 100015 141512 191224 236952 289578 364103
17579 364103 438016 490563 534880 584157 631154 641237 623680 597213 561147 517591 451975
17568 451975 390393 341471 301456 260764 222760 201016 179065 155104 141445 126366 117347 113299
17556 113299 105456 87678 76266 67095 58822 52521 47227 41862 35903 30276 24118 15344 14954 13357
17542 13357 12298 5063 6579 6902 6303 7967 15500 21385 15291 13269 6725 6698 3414 927 3106
17527 3106 2882 413 -6744 -7391 -2169 -5073 -8233 -7421 -4701 -1773 -1992 272 391 -8114 -9058 -8023
17511 -8023 -5357 -2771 6268 10482 10174 2954 -5452 -15577 -20175 -14077 -1013 6448 7932 5675
17497 5675 3502 4613 8026 2711 2709 5294 3017 -549 -863 1593 1634 -3115 -5262 -2625 -1540 -2333
17481 -2333 -8163 -8645 -2794 -5456 -9036 -7195 -4150 -5913 -10435 -10910 -4869 853 3437 -3804 -3934
17466 -3934 -3197 -4051 -5531 -11014 -4920 -10615 -15850 -14379 -8948 -5074 936 2467 10175 10367 10671 16705
17450 16705 19318 11635 8478 -660 -8104 -16272 -22790 -22900 -18828 -16447 -5599 6923 10956 22485
17436 22485 27813 24874 22535 17149 14114 10833 7865 3924 -2340 4583 4036 1305 2780 -426 4726
17421 4726 5370 -4215 -2715 2072 1734 -463 727 6205 2067 -377 -5514 -11728 -9688 1963 3626
17406 3626 1586 -2988 -6148 -5397 -7742 -6196 338 2604 8080 3619 873 -1238 2806 682 -4024
17391 -4024 -426 -5232 -9101 -13739 -16122 -12547 -9074 -7369 -9260 -6443 -4883 -1881 991 3084 -4262
17376 -4262 -8914 -4218 -7064 -11270 -5017 -4664 -7855 -5645 -3784 -2516 -10651 -9720 -7785 -14414 -18314
17361 -18314 -15830 -9372 -8446 -3755 -7780 -5740 -7939 -8351 -4511 1330 8403 9153 1220 -1563 -6219
17346 -6219 -16378 -17073 -8667 -4332 -9861 -14137 -5131 6696 10359 13382 10947 4825 -5377 -7259
17332 -7259 -1067 938 5921 -588 -5482 -3636 -4189 -4562 -8303 -2498 7947 14948 10320 3156 1815
17317 1815 -6464 -17059 -16842 -6602 897 3157 -788 -7465 -3883 1036 2308 6138 2910 -252
17303 -252 5694 2097 3927 5773 9532 4879 -1235 -9555 -8290 -3878 170 -1350 1205 -852 -3881
17288 -3881 -3314 -1445 759 -103 797 -1289 -1823 -4402 -5634 -4613 -12120 -15259 -10403 -2954 -1665 -1814
17272 -1814 -592 3175 -471 -6455 -7768 -2770 4096 867 -7753 -13120 -14886 -7423 -1166 2927 2375
17257 2375 -5031 -3474 -3501 -7581 -5282 -8617 -6497 -4763 -8977 -15024 -13518 -1748 -628 -3097 320
17242 320 2534 -1544 -7301 -10291 -13379 -7168 -6967 -10522 -13299 -16873 -9467 -5365 -5816 -2967 1378
17227 1378 3918 4356 6739 7642 -2959 -6822 -83 4078 2809 3154 5011 671 4553 3780 710
17212 710 -4660 -3672 -1138 -9964 -11496 -11068 -14941 -13224 -11543 -9376 -9898 -8458 -9692 -6207 603 -1925
17196 -1925 -5765 -3804 3676 5655 -2734 -6023 -9103 -8144 -6127 -9029 -4930 4172 7048 -706 -18550
17181 -18550 -17184 -11303 -12924 -7224 -3498 -5605 -7616 -13341 -9451 -11493 -11154 -7994 -3628 -4853 -5463
17166 -5463 -8128 -10844 -9772 -8641 -2539 2306 -3138 -8722 -8283 -3227 -4667 -5536 -5484 -10763 -9360 -7166
17150 -7166 -11893 -6045 359 6905 7706 5991 -2959 -8613 -5595 -4195 -8438 -12071 -10518 -1797 -628
17135 -628 707 5845 1096 -1758 -3734 -9449 -15864 -10119 -599 -1730 -7929 -10214 -9006 -5356 1265
17120 1265 2684 3854 2177 7914 13483 8587 -2297 -7564 -9735 -8903 -7928 -5232 -2185 -5704 -3948
17105 -3948 293 -2476 -6446 -5421 -2345 -9190 -13856 -3306 4145 -134 -3056 -7132 -12513 -9895
17091 -9895 1452 5864 9965 4406 -2758 -950 -2743 -3829 -7266 -6139 -3857 -5209 -4671 -2870 -2220
17076 -2220 -1344 -5442 -7057 -7709 -8183 -556 4155 14317 17839 12861 10663 9738 6665 2829 3382 3157
17060 3157 1874 4345 371 -5493 -1804 -4605 -8915 -4253 795 2620 5434 3332 6105 5238 -1974
17045 -1974 -6653 -5384 -4119 -6113 -8586 -7678 -2533 3218 4897 6121 4767 7021 2867 -4724 -4381
17030 -4381 -2600 -2519 -1397 1088 3870 5154 593 -3755 -5256 -507 -2139 -1239 -602 -1162 -541 6151
17014 6151 8634 4541 -2731 -1915 -1449 -2485 -2099 -72 -2238 -2352 3029 4649 -2072 -2794 42 -330
16998 -330 1061 -2964 -475 8964 13624 8304 6071 4070 3525 2862 -844 -1197 4228 6667 5355 2505
16982 2505 1854 5851 9286 1820 277 -1529 -6486 -5074 -6406 -8265 -9877 -770 -477 5762 5749 3108
16966 3108 541 -8971 -10653 -10653 -10825 -10347 -3468 1119 -91 -4485 -1160 818 699 2854 -4800 -1520
16950 -1520 -4359 -6166 -3219 -5197 -5986 -9095 -6871 -6635 -6484 -3925 4205 1284 1884 5480 4003 -1235
16934 -1235 -337 -1376 -160 5346 6827 4510 5228 3643 5461 5950 5672 6853 8193 4334 1820 1285
16918 1285 -5189 -8495 -6279 1988 2611 2589 6271 9595 13442 8789 2485 355 -7285 -8920 -9608 -12638
16902 -12638 -8203 839 -42 -6312 -3580 8079 9592 6240 2845 -1205 -1003 -7720 -13305 -15329 -4066
16887 -4066 1352 -1140 4332 13382 11638 7485 1148 -2919 4130 5248 -471 2703 9907 14220 15149
16872 15149 12987 6592 3895 8376 13093 9071 4575 -3802 -20687 -27742 -23164 -14065 -8910 -9192
16858 -9192 -8874 -5289 -1438 2659 7898 9482 1633 -4299 -4932 -4979 -11267 -8350 -3417 -5316 -2442 3138
16842 3138 3619 3807 3879 6758 3349 -2297 2431 -1477 -4420 32 7775 19484 23009 19217 13051
16827 13051 8656 11860 13095 11248 10213 14328 13251 15165 23010 13219 7471 9717 11649 10456
16813 10456 10874 12717 7829 6728 8687 8651 2223 -1550 2878 2096 3108 10865 13517 11273 4284
16798 4284 332 -6315 -8390 -9640 -5387 -3173 8489 8202 6286 7553 822 -7370 -12462 -7435 1888
16783 1888 2357 3805 6700 4729 634 3864 -425 2834 5586 2525 6750 10532 10866 7611 6606
16768 6606 12952 22016 21898 15738 15740 10885 6548 3190 1215 8153 12014 12156 12021 10954 12882 9438
16752 9438 9278 7562 13923 13188 2186 -2801 -4297 -2916 4030 6962 11468 6534 -527 -135 12697
16737 12697 17514 14918 10582 6920 2319 -1208 370 5083 3017 10245 7855 -1052 -888 3197 2900
16722 2900 4265 3159 2333 -1384 -164 4784 8468 1516 -2838 973 3848 -408 -1100 -611 -313 4433
16706 4433 4900 3939 9311 5072 3208 9591 13357 14174 13287 14487 8366 1967 6588 6173 5506 3137
16690 3137 -1473 -4236 -3014 3879 2483 1449 -183 -691 2909 -1219 -4431 -2996 -4730 -5451 -5490 -986
16674 -986 9840 10484 4935 2929 1228 -4211 -7119 -8264 -7960 -3020 -1188 6558 3871 3805 959 -1001
16658 -1001 6024 8484 5622 3407 7978 3636 -1958 1211 6310 7339 9352 10526 9636 4774 -2106
16643 -2106 -10220 -8252 -3311 4332 8249 12054 9424 9027 9182 10382 5705 7854 9207 -427 -1714
16628 -1714 1935 4792 5364 378 -4355 -3474 -8380 -2533 7196 5646 2595 6005 2237 -1472 -146
16613 -146 -752 6886 8400 6618 6525 7703 11030 13480 12573 14269 10607 4744 4896 2164 2823 6372
16597 6372 6801 6337 7152 6648 11418 11813 10111 7618 412 -1418 -3498 -6696 -1395 1974 2872 5373
16581 5373 12437 14954 12598 7541 2982 185 2436 3848 9005 1103 -4871 -2219 3424 5262 1652
16566 1652 7809 9653 7836 11798 14432 13912 16431 13112 7368 3814 3953 -17 -4901 -3999 -61
16551 -61 1417 1097 1668 1524 5917 11497 12200 13969 15973 15669 11093 17477 27760 20548 20625 25480 31445
16534 31445 28950 21962 19908 24077 30652 39560 41311 38592 34481 34900 40412 51934 57075 68643
16520 68643 86248 110646 144816 188793 248865 324989 417969 537902 675013 805183 913235
16509 913235 1000304 1061539 1077980 1051895 992463 913430 812152 702698 601204 506883 429817
16498 429817 370628 327526 293669 265555 249936 223140 197185 183314 173988 160565 140373 122922
16486 122922 117611 107144 95868 88068 82877 75821 70784 66842 54962 45737 45129 44916 46186 39852
16472 39852 32289 31952 30854 32386 33405 29650 27278 29117 29386 31780 33693 32708 36063 36231 31332
16457 31332 32388 32310 33639 47419 54900 63256 78184 96743 123957 157081 200568 242863 288669
16444 288669 340897 384418 416838 447042 476156 483798 474629 466056 444301 408738 363142 324832
16432 324832 285157 245775 209613 187855 167012 142461 127997 112914 102982 93472 81226 71133
16420 71133 63349 61057 62175 55899 46572 32193 33291 34366 42382 45490 42169 38587 33298 27521
16406 27521 31399 41335 44851 35528 28317 22766 19395 18667 27154 25168 21451 21859 25893 21758 17820
16391 17820 15557 10032 9231 3775 -1019 -497 5399 15157 14934 11931 2925 5901 14011 10967 10739
16376 10739 15856 23212 26496 24234 16346 18009 17421 16689 24438 27700 21347 19692 23160 26195 30622
16361 30622 28234 31785 29038 25079 21565 13665 12565 8061 5271 6187 5281 7348 10716 12190 10362
16346 10362 9690 5373 6421 9734 16936 17138 12203 8761 10813 12405 18878 14196 7726 7535 13654
16331 13654 14830 9240 8334 11020 12990 12192 9490 16882 19387 13920 13212 19589 21806 25137 27557
16316 27557 24195 22187 20681 23678 26167 23183 24501 29565 30336 27975 21472 18140 11633 11271 14296
16301 14296 14619 18441 23378 28683 27643 24432 18723 16246 23191 35003 34064 35696 45656 56997
16287 56997 73108 86496 104946 118582 132955 145522 154262 157677 151325 144437 131350 113014
16275 113014 101366 83940 73197 64816 60590 56920 50709 52930 57933 47773 35666 36625 36207
16262 36207 31884 30599 30619 29973 26284 23910 26905 28188 27347 27887 29536 31470 31499 31707 33523 36202
16246 36202 34731 26549 26523 27831 29835 31091 28089 23378 22354 30882 32289 25929 25932 27927 25071 20117
16230 20117 20215 18553 12155 11714 15449 15662 13249 16649 15800 16970 23351 19778 17908 18370 18825 16835
16214 16835 14748 14449 18974 16595 15414 19116 18700 16683 20566 24834 24860 24153 20507 24675 33663 35793
16198 35793 35802 36767 42267 43433 40001 37930 29757 30171 30287 29617 28789 24530 26375 29518 24696 24450 25089
16181 25089 27675 29906 29390 26328 23159 20810 22325 20737 18261 17279 19111 23995 31180 23382 14852
16166 14852 12666 23292 33996 33397 31057 31931 41723 42953 50167 61203 62241 63897 69149 71977
16152 71977 81047 82820 82614 80233 78529 74424 72026 67714 60813 50282 36848 35765 40297 41207
16138 41207 42013 45554 47458 47233 44311 40656 42106 43540 45703 49130 46255 45947 44720 44078 36366
16123 36366 31122 28432 21985 25706 25953 26761 26145 21263 22730 30514 30046 35778 33663 26835 20361
16108 20361 27802 33923 36224 34754 33267 32614 31127 33180 35227 41233 44238 42876 41291 53455
16094 53455 56601 57297 67933 76653 76566 82879 88076 90065 93054 96903 102188 99494 94432 89705 83176
16079 83176 74966 70963 72242 64972 61495 63281 56711 60834 73554 70432 64418 67148 73818 73725 70640
16064 70640 70902 71293 72415 73476 74408 80834 85761 85623 87008 87572 88636 81101 73104 71319 67430 66637
16048 66637 61583 64698 65341 65327 64659 64504 64601 59762 47071 46125 49975 49908 59732 72336 86765 95033
16032 95033 99106 107104 125621 139432 152638 167690 180376 198831 207838 204310 198018 200751 195271
16019 195271 185876 172953 159188 152918 149861 147511 153195 156905 161650 165394 166392 170252 168038 164047
16005 164047 162986 162438 167777 169407 169155 169619 170436 170253 174394 175815 175512 180000 184900 193538 197881 205609
15989 205609 216972 227470 236559 236558 241625 247509 252132 259318 262674 271416 275004 278689 284800 281221
15975 281221 282434 284003 283751 279515 272875 266586 260854 257668 249873 249500 253788 255691 258204 266762 275824
15960 275824 282543 294286 310588 316682 320907 326788 336512 354934 362861 367558 374639 382213 391763
15947 391763 403352 412932 427142 436891 447006 471990 493664 504683 526904 555280 594832 642011
15935 642011 688332 744775 813877 892609 979851 1078316 1180970 1295252 1421399 1561590 1706082
15924 1706082 1844500 2004442 2195107 2392447 2598840 2842731 3121107 3441241 3828780
15915 3828780 4307564 4889030 5605461 6524911 7734192 9348901 11558783 14543547 18458859
15906 18458859 23623705 30171012 37671842 45954639 55322277 64926963 73035253 79664678
15898 79664678 85435223 88810139 88513532 85890165 82059476 76252658 68610108 60808837
15890 60808837 53500609 46499218 40091942 34754800 30416353 26840425 23903254 21483703
15882 21483703 19444038 17641814 16004183 14482829 13081715 11788192 10597122 9521080
15874 9521080 8560437 7704042 6941385 6288874 5715942 5217338 4793445 4445170 4156989
15865 4156989 3904594 3703229 3539210 3392139 3259957 3144458 3015736 2865591 2697676
15856 2697676 2519477 2321330 2107126 1900899 1713119 1535813 1375826 1239618 1122942
15847 1122942 1025075 941976 867359 806475 754751 706649 661962 620102 577617 536551 495069
15836 495069 461405 437818 420278 399074 374319 353002 342790 329802 322123 316432 304128 293083
15824 293083 277091 257853 243099 231720 223543 209347 193327 193156 189853 182674 178328 167041 162119
15811 162119 154994 142233 129863 128313 125649 119861 118228 113777 109974 105060 96772 101426 107825 107641
15797 107641 118665 124344 119201 112826 100661 95011 102864 100520 99368 102506 101796 91983 89239 88821
15783 88821 92719 99494 102010 104896 107919 109774 111328 115791 121044 125279 141811 148683 144889 138375
15769 138375 131470 130356 128615 125097 115381 104673 94220 87938 83046 84359 87984 91070 86850 85281
15755 85281 81854 89206 89471 88343 93147 88790 86119 90393 89228 86889 85483 84340 85024 79536 71164
15740 71164 61213 57518 48572 44324 42907 46381 53032 53438 58498 54287 47518 47968 48356 42195 33534
15725 33534 28004 24967 23688 23058 25534 31910 23973 17656 12161 -1363 -7538 -13141 -18297 -20534
15711 -20534 -25487 -30957 -38905 -39905 -36001 -26027 -19061 -18155 -18995 -12809 -10457 263 2018 8352 4833
15696 4833 3559 3012 1774 8527 6147 5578 7567 9073 15889 20506 21636 24672 19992 15943 14378
15681 14378 19949 21406 18510 21304 23842 27665 23386 19696 23430 25961 22315 24858 19615 12780
15667 12780 12952 8909 10372 8335 3664 4862 556 -2046 -2187 6700 13933 23764 29685 23482 23310
15652 23310 18181 16039 6985 368 259 4078 2896 5680 7342 9541 14617 8251 3945 3659 11229
15637 11229 9415 4804 8221 9074 14312 17401 16515 11379 10252 11018 12822 14368 16743 11217 9122
15622 9122 11619 10907 10351 9109 3926 5314 9987 16586 8768 4825 11265 12374 10906 6054 1100
15607 1100 3766 7055 8098 13487 15204 12489 1284 -5310 -7457 -2423 1371 -2981 -5552 -4906 -9807
15592 -9807 -10486 -9510 -11835 -15338 -17298 -13359 -10834 -9586 -7337 -13096 -12482 -8877 -5619 -8586 -11211
15577 -11211 -13026 -6731 -4696 -2632 -3511 -8947 -12782 -8744 -8259 -7166 -8700 -7092 -5707 -1990 6684
15562 6684 8799 4902 2722 1035 -90 -3592 -2083 -5120 -99 -263 -2084 148 -4546 -1993 -787
15547 -787 -7100 -12453 -12554 -14219 -17948 -15732 -10671 -11125 -9390 -9850 -10339 -13978 -18381 -20410 -17512 -17338
15531 -17338 -14779 -12316 -11462 -14914 -12018 -11122 -6687 -2816 -90 -8192 -10576 -3694 -1705 -9476 -11659
15516 -11659 -7483 -1944 -6526 -12230 -11948 -13769 -11387 -9999 -7462 -4734 -10714 -18451 -15047 -8298 -8708
15501 -8708 -3810 -4185 -4351 -8448 -10359 -12645 -9868 -5781 -8281 -9371 -12135 -4999 -6104 -10075 -10649
15486 -10649 -10903 -9907 -7802 -14097 -23484 -21918 -13771 -10367 -14077 -15025 -11456 -10104 -15860 -21145 -19693
15471 -19693 -7284 -7469 -9127 -8030 -12970 -19003 -10517 -14008 -15379 -13710 -10325 -11202 -11813 -13961 -16391
15456 -16391 -19011 -10320 -14139 -19789 -14369 -8853 -12622 -14432 -18570 -19378 -18330 -19001 -19279 -16397 -12376
15441 -12376 -10374 -11983 -13014 -7226 -11210 -16091 -18601 -19654 -17509 -15643 -15203 -19233 -13145 -16700 -22376
15426 -22376 -20338 -16839 -10345 -13733 -24798 -23575 -14857 -9882 -6903 -14464 -20890 -23337 -24286 -30721
15412 -30721 -28662 -25443 -24207 -16267 -16320 -10894 -5589 -11086 -18687 -17213 -18262 -13292 -8477 -7344 -5494
15397 -5494 -5035 -8410 -8425 -6422 3220 4127 -391 -6975 -6820 -1539 -7583 -11287 -6714 -691 272 -6804
15381 -6804 -11849 -12846 -5768 -8364 -9083 -511 8665 7129 -222 -1299 7204 12245 10446 18250 20740
15366 20740 17551 19753 22219 26355 34857 43080 48696 62231 83752 107241 140536 181022 229983
15353 229983 284752 330220 369127 406414 442690 464108 468615 456522 435787 410187 374959 331986
15341 331986 288870 254616 218490 177967 158221 143634 120071 102869 92969 85234 78945 74514
15329 74514 68758 65429 59481 45026 38270 35198 29625 20883 15116 14007 10775 10695 4682 1052 5675
15314 5675 8517 6489 1321 5385 7427 3007 3424 7987 939 800 -4062 -6499 -7985 -12719 -9722
15299 -9722 -11536 -13243 -10471 -9510 -8031 -9614 -8190 -9047 -7834 -4889 -9083 -12589 -10039 -7602 -7797
15284 -7797 -10659 -8215 -6870 -3713 -6440 -16754 -21790 -14471 -17989 -25566 -24597 -23128 -16726 -10667 -13057
15269 -13057 -10600 -9094 -7646 -3519 3835 4460 -2439 -2787 -9094 -15783 -8609 -7519 -8519 -2496 4981
15254 4981 3926 -1582 -2593 -3423 -6722 -2599 -7271 -14825 -13027 -6526 -7224 -6648 -1196 1578 -1332
15239 -1332 -4384 -488 -2128 -3584 -4497 -5247 -4535 3146 1349 -10690 -15800 -14824 -11254 -5229 -5969 -5962
15223 -5962 -1678 1508 -6549 -13443 -15164 -19719 -15753 -6802 -4674 -1248 -4559 -14486 -14305 -16913 -19769
15208 -19769 -12995 -5373 -1133 -4639 -12199 -13081 -8558 -9596 -17858 -20683 -16441 -14503 -20812 -22917 -19485
15193 -19485 -15814 -14175 -14145 -9264 -12241 -21663 -29352 -27350 -20614 -14579 -7497 -4183 -6337 -4678 -7466
15178 -7466 -8140 -9484 -9843 -7938 -6815 -10783 -9966 -12781 -11522 -9478 -16401 -16772 -16086 -15783 -9170 -10847
15162 -10847 -16565 -6886 -5321 -6229 -8560 -9467 -12650 -13130 -7757 -7485 -9733 -9557 -10141 -3974 -4735 -12991
15146 -12991 -16336 -17063 -21044 -15312 -10345 -6241 -709 -10520 -17687 -14987 -11317 -7885 -12751 -14161 -10525
15131 -10525 -8699 -13700 -11297 -2636 -6404 -13372 -10268 -2507 -2487 -4143 -8653 -5109 -10251 -8866 -13597
15116 -13597 -11923 -13964 -17094 -12694 -14359 -18452 -14477 -15416 -18524 -21919 -18460 -16465 -10957 -14703 -17186
15101 -17186 -21130 -17954 -20023 -17863 -13447 -6740 -7261 -12032 -13777 -14655 -11373 -9574 -4560 -1421 -1823
15086 -1823 -1458 -4361 -9301 -11153 -3923 -173 -2590 -14144 -16481 -6952 -5025 -11526 -13288 -10405 -11496
15071 -11496 -16969 -12934 -9288 -7203 -8273 -13004 -13725 -13599 -14958 -14457 -12133 -15180 -25308 -20302 -12450
15056 -12450 -11966 -7994 -4656 -7434 -5962 -9930 -9701 -40 -374 -4644 -7921 -7213 -7816 -5605 -5591 -7612
15040 -7612 -5454 -4849 -10840 -14368 -14230 -12146 -14602 -8077 -3596 -9116 -16635 -13702 -12733 -12947 -7665 -7143
15024 -7143 -5186 -353 -6415 -8931 -10730 -6590 -9071 -8578 -15822 -26259 -25723 -24337 -20376 -17783 -14028
15009 -14028 -1436 6179 15505 22860 33108 41693 40974 31953 24827 13131 -3022 -13336 -15331
14996 -15331 -15861 -9704 -7792 -8745 -6783 -4352 -1255 1821 3858 -7600 -8770 -6259 -4285 2826 5585
14981 5585 -231 -8521 -11557 -13210 -14892 -20052 -21666 -23686 -20903 -18521 -11560 -6020 -6097 -8433 -9794
14966 -9794 -4902 -5766 -6563 -5406 -2310 -6000 -10202 -14762 -18573 -19960 -17278 -14495 -14452 -10604 -7159 -13048
14950 -13048 -16163 -11734 -17103 -18831 -11929 -3624 1517 1031 -550 -3017 -12874 -20750 -21482 -13696 -3191
14935 -3191 957 -427 -2521 -6203 -9931 -14316 -21446 -19727 -19500 -17616 -3466 11950 16407 26196
14921 26196 39456 46750 51934 35854 19274 4034 -4202 -8381 -11988 -17448 -18540 -4194 6357
14908 6357 11278 8335 -1232 -2523 -1001 -3859 -7923 -13836 -13191 -15256 -13304 -7022 -4427 -11774 -12664
14893 -12664 -6856 -8157 -14034 -19294 -10697 -6839 -10466 -13178 -11392 -10280 -14759 -13524 -9877 -5622
14879 -5622 631 4605 10100 5371 893 277 315 -512 -1526 -4390 -13943 -18623 -16740 -16660 -10957 -7033
14863 -7033 -8405 -1537 -794 -9818 -9137 -5005 -8519 -15463 -11270 -770 4767 3640 -688 -5957 -5020
14848 -5020 -5290 -1496 2826 5771 9340 4938 -2769 -11111 -12103 -10035 -19848 -20726 -17302 -21321 -15685
14833 -15685 -13932 -12528 -2975 4749 15192 15148 14171 10840 5195 -4464 -15578 -15639 -7027 -4484 -1093
14818 -1093 -1757 -1217 -3668 -5907 -7450 -7517 -3157 -367 -3282 -907 2946 -1347 -1504 -2801 -819 5858
14802 5858 8231 7104 2362 2333 4758 8598 -1502 -325 -542 -4994 -3317 2342 6992 4715 -874
14787 -874 -3364 -13041 -14175 -19172 -16377 -9538 -2951 -7596 -5198 -1357 -7464 -10677 -10772 -7234 -3231
14772 -3231 -1275 3186 5295 3963 -2043 -6677 -12660 -9696 -6380 -10060 -1047 777 5433 9240 3925
14757 3925 4819 14334 12692 11366 9599 -1696 -2800 3664 10325 9803 5283 7075 5710 748 -2372
14742 -2372 -6766 -8771 -8257 1462 12634 16457 12020 10983 7080 5455 1315 -6304 -4555 -578 6513
14727 6513 6517 7086 7019 315 -2097 -4304 -7858 -2804 -3446 -1192 -7598 -11949 -8325 -8086 -4716 -249 5399
14710 5399 3166 1593 4159 3591 -1373 908 1814 6669 6290 -2484 4285 1650 6520 6915 2756 4942
14694 4942 2725 1182 3175 251 -1894 -4674 -947 -1745 -4611 -1954 -1752 5638 10943 8282 10911
14679 10911 13336 9248 1122 -1957 -2926 -4252 -3047 818 3832 11104 9341 2958 -2577 5666 11307
14664 11307 11818 6299 824 -3475 -1158 4070 6295 1356 -173 -590 2125 -998 760 6510 13065
14649 13065 12507 9845 10677 7458 -92 -1156 -2343 -1858 319 4187 1122 -4520 -7838 -2131 4715
14634 4715 9608 5712 -1253 -1100 -2976 -569 6485 13719 15822 10186 8416 11489 11445 4102 -2028
14619 -2028 6069 3239 2880 5243 1383 4522 5941 4763 5862 10181 7507 7028 8181 6026 5197
14604 5197 5393 7673 7184 896 -3646 -3429 -256 -1994 -3142 -3458 863 -2353 182 2455 4235 1242
14588 1242 2130 -2044 -5012 -2927 2176 2341 2946 2376 7719 387 -1533 5539 3145 -1742 -2717 2855
14572 2855 7166 15388 16705 18328 13603 6793 4236 -2391 -2978 2875 7853 12029 7336 5352 3613
14557 3613 -451 1180 4642 7125 8066 1830 598 -5098 -7050 -2129 -3439 -2802 3643 -414 -3244
14542 -3244 -574 2643 3030 5917 8118 7555 7432 6451 8051 2514 -3748 -4688 -2601 1520 5862 7894
14526 7894 8610 11543 12555 8984 6377 2312 3774 4202 670 394 2277 -1996 1284 9779 8863 7090
14510 7090 7072 9208 5058 1551 4767 8821 7047 3485 649 2793 2682 8099 12193 13957 12374
14495 12374 6379 2871 -1369 -4193 -3673 353 5620 -150 -4627 -36 2726 3253 -242 2157 4853
14480 4853 -2313 -11741 -2531 -1941 233 -937 -1110 4950 12106 8677 6162 3722 439 -25 -354 -3861
14464 -3861 -3040 5129 1662 -2712 1854 4907 -2410 -1271 3412 -4262 -307 2829 6265 5663 7190
14449 7190 5822 9561 13634 7924 3305 8587 15194 11945 2854 -3129 286 3902 464 -1235 5785
14434 5785 10985 7548 2086 -5445 -10038 -6846 -6958 -10684 -8433 -10333 -15145 -12366 -7421 -4697 -3063
14419 -3063 -2770 -2550 -6468 -1789 5063 2603 3360 -3293 -3256 -5095 -7295 -1899 5771 11033 13137 8689
14403 8689 3586 1945 -2113 327 1136 5702 10281 6144 7874 17307 8658 7265 7278 7576 2935 1205
14387 1205 3238 2660 694 -2644 -2047 1296 -2285 -11032 -1214 5476 6040 -373 -5727 2499 4502
14372 4502 4403 1706 871 2333 40 4164 3279 2485 5678 6997 6789 -449 83 -2282 -1757 -5861 -9069
14355 -9069 -1602 -2678 -5861 -7285 -7410 -5706 -8093 -4693 3496 9799 5385 4967 9078 10006 6537
14340 6537 59 -2850 -10754 -10575 -8743 -11022 -11608 -8262 -6376 -3910 690 1228 2752 -3151 -8464
14325 -8464 -4969 -1383 -1860 -540 -84 7324 16753 14667 7348 -3068 -13428 -8105 -1229 -1295 2308
14310 2308 -83 -3921 -3653 -7390 -8998 -4968 -6770 -8822 -5928 -8929 -8953 -9394 -9373 -2131 2911 6570
14294 6570 9514 5151 -306 2313 12986 15743 10583 8115 8406 4532 -648 1340 -1398 -7560 -11371
14279 -11371 -13263 -9754 -1765 7875 9702 5384 -2244 -2108 -4708 -6278 -1516 -1795 -830 -80 1870
14264 1870 86 -8363 -7842 8163 14385 10140 9142 2660 -2099 -3339 -548 903 2394 6846 5773
14249 5773 568 -706 3679 5807 -1081 -5910 -13758 -15234 -13559 -8233 -1879 801 -4380 -8040 -3732
14234 -3732 4861 14148 10581 5019 572 2579 3536 5066 9349 10044 8986 1555 -5470 -3871 -2676
14219 -2676 -61 -7111 -4563 958 1405 -2423 -3874 -2564 -5301 -2799 -136 4153 2866 1694 4055
14204 4055 3168 -3072 -8108 -4761 -280 23 -3276 -5552 122 -2570 -5788 -428 4022 3521 -1326
14189 -1326 -133 3613 3549 -453 3019 2737 5982 6129 893 -452 -1897 -3621 -1732 6608 4437 11186
14173 11186 11195 5282 3319 2883 4166 6308 4338 -786 -706 -833 -3105 -3071 -889 5377 10594 10225 10081
14156 10081 2693 1238 -2505 -9020 -7678 -2915 -4612 -1829 6557 984 -4943 -7522 -389 2869
14142 2869 -665 -4199 1164 6589 4303 -460 4910 7899 5776 5006 961 -2985 -6191 -1612 -614
14127 -614 6181 9229 -2504 -4712 -1344 -2219 -1423 -6318 -7680 -7400 -852 1946 2594 -3923 -8059 -6935
14111 -6935 -7347 3813 11803 3863 -3264 2128 -172 -529 4119 -475 -9618 -11440 -3413 -9195 -10784
14096 -10784 -6638 1878 -4438 -8744 -5629 -4366 -3884 5059 13986 11823 5679 4563 12325 16337 15187
14081 15187 7313 7160 8232 8989 8676 5495 4286 10659 13687 7717 9722 10284 8757 2089 -2728
14066 -2728 -5747 -1823 7307 8165 6108 468 3352 7106 -3388 -4032 -3321 -3865 3435 3682 -1319 -5219
14050 -5219 -9103 833 14103 11335 8593 11488 13622 11175 5126 4157 13520 16243 15068 9662 7677
14035 7677 11139 12407 10403 10185 10004 12409 23101 24150 29575 32568 34149 37168 38597 38291 44123
14020 44123 51175 47261 45066 47672 50731 50308 47650 53392 52193 47085 48024 50073 47008 49079 56290
14005 56290 58207 63410 67436 68706 68765 81071 95246 107787 122200 133808 151646 169139 188194
13992 188194 212112 247990 314490 396345 505344 654926 810878 967472 1113559 1243135
13982 1243135 1331101 1371781 1382394 1388724 1399149 1423496 1454307 1485778 1518519 1525615 1492732 1414401
13970 1414401 1301155 1163516 1010800 870001 749750 650816 562941 493601 437423 401491
13960 401491 367297 331607 302337 277302 257559 234117 216037 193957 175688 163521 146984
13949 146984 134034 121696 108974 101816 89485 86688 85371 78185 74450 69366 62518 54686 47431
13936 47431 44588 38390 36981 36092 35968 35696 36378 35601 24581 16944 19461 21173 20117 16840 15427
13921 15427 14160 15744 20047 19497 18642 20882 23894 21849 17758 6250 4810 12497 18506 16719 21570
13906 21570 14929 8154 2679 -239 -903 1195 4235 14794 18083 12257 9720 2096 5803 8395
13892 8395 10391 10772 11602 13268 8748 4846 283 235 -236 1349 5310 11450 12307 6838 10982 11894
13876 11894 14565 16027 16874 17619 15394 13599 15116 17294 16822 14319 4131 1054 9092 9073 8019
13861 8019 4812 6871 5587 5824 8839 10853 15668 16149 21429 17354 5746 5655 8248 8950 12730 10755
13845 10755 10655 6178 -52 -3960 3411 7186 3404 10198 11557 9789 12471 4912 5286 16165 8309
13830 8309 7771 13909 12761 11123 19184 30573 30967 26994 23771 21495 21487 24354 25513 20555 17330 23305
13814 23305 23821 18166 19310 16024 14703 12880 9299 1684 4970 7523 7786 7650 9184 14405 17048
13799 17048 18824 15892 16790 18403 14329 17145 15694 14291 15425 14166 14999 9627 4373 2281 4404
13784 4404 11053 13099 10847 12022 14543 12025 -1885 -2200 -869 2278 7381 4920 3568 10157 11265
13769 11265 9420 18485 17254 16626 20247 24923 36465 42905 53990 70781 91787 111695 129738
13756 129738 137828 133164 117948 100899 88438 78792 63975 54707 46959 41704 41195 42521 34846
13743 34846 32470 28240 30299 31695 31813 27260 24050 22609 19730 10274 12171 16359 18763 20132 18411
13728 18411 14666 15841 16238 16362 15060 15006 21916 19668 16579 15563 15685 14574 24313 26111 22727 18372
13712 18372 13938 1864 -217 7113 9123 7875 12956 18585 11109 4006 2555 6779 1646 -1028
13698 -1028 5736 7293 -1312 2435 5899 11704 17042 19983 16452 16011 19355 22725 21075 18339 18859
13683 18859 25957 29041 34838 35299 25550 22542 18839 17237 9236 6246 10231 15346 17174 16795 11577
13668 11577 11246 13726 16589 14658 11530 12618 15999 21533 19804 17024 17451 16064 10358 13034 10739
13653 10739 8617 13385 11896 11471 17592 17647 10942 7974 9331 12660 11869 16802 22260 33008 41962
13638 41962 44242 40269 46784 50247 68287 84319 87477 84590 80041 83128 82037 66825 52468
13625 52468 43376 35015 32279 36416 36703 36243 31368 25943 22475 16845 18713 18813 20219 15695 14378
13610 14378 16284 17198 19130 20388 17137 13586 14355 15841 20875 27176 27677 24699 24359 20629 20048 20426
13594 20426 16617 20713 23372 24940 22698 20655 26543 26470 24552 25006 25467 20402 12078 9726 15621
13579 15621 17394 14850 12816 11900 10841 8121 10107 16039 23658 26418 19069 17751 13590 19016 20757
13564 20757 20058 15604 17796 18005 18010 21258 23686 22726 27311 26978 25414 26547 22967 17641 19416 18801
13548 18801 16172 14368 17179 26967 25367 18099 21058 24309 26315 24907 29987 33586 31194 23650
13534 23650 19822 13291 11448 22538 24976 17831 23895 26793 23856 23806 23639 22256 28956 32594 27216
13519 27216 24165 29281 35032 30353 33203 38727 40250 47618 46110 36009 35219 32578 34477 41146
13505 41146 41764 36423 34334 38920 34251 33302 33241 33796 35192 29067 29710 29436 26246 29073 33301 35574
13489 35574 32506 32529 37748 44967 47237 50644 47300 45385 51114 55566 58079 55208 57699 62422 65624
13474 65624 68288 72237 77917 84148 93435 103615 115239 128240 144969 172951 203314 224999 247143
13461 247143 261744 276587 277422 274344 271859 271225 263791 247918 225391 204284 189223 171042 156313
13448 156313 150169 143478 133903 130258 129433 121526 116283 116953 112647 105627 103549 101906 96854 94128 104745
13433 104745 106468 106863 116102 127190 140640 151814 160950 180976 215132 247243 282948 323115
13421 323115 366048 410401 462975 521133 586552 661163 738716 808635 879049 951582 1016613
13410 1016613 1079055 1129614 1185664 1234251 1266493 1283362 1303527 1310364 1298959 1281923 1256050
13399 1256050 1233790 1194591 1146213 1096572 1042992 982915 920599 859571 794933 735924 676511
13388 676511 618941 564488 510087 463844 413981 369949 336255 301016 270573 243942 224281
13377 224281 211128 192498 179885 170327 158010 139376 129560 122050 120429 120947 115984 108315 103610
13364 103610 95948 91438 95565 86986 75193 65881 59558 57663 58486 60981 62655 60263 55068 57870
13350 57870 61696 63589 65190 66543 57556 51270 48784 49790 50274 48697 48214 42829 37902 46092 51783
13335 51783 44553 44446 40259 42065 42795 42591 44641 45378 41901 35748 37335 44562 51288 48604 43787
13320 43787 31849 30847 32875 31591 24109 29902 36447 37275 37560 33809 36412 43343 46229 46027 41532
13305 41532 36593 32118 35483 26745 16505 18457 20455 27395 24001 26850 30510 24769 20014 15706
13291 15706 12739 19845 27802 28839 28900 32859 33312 33243 25903 27239 29646 38440 44266 39522 38542 43922
13275 43922 42249 35537 33881 34559 37362 41317 45237 42486 36338 38184 46515 42506 36352 37999 34712
13260 34712 35360 33350 33093 37049 42326 36742 29343 28245 33127 36385 36743 29024 22034 26045 29757
13245 29757 23766 26286 30009 29791 34438 43983 45058 33236 24142 24303 34617 41395 38159 37181 30453
13230 30453 29445 30277 35510 39455 34457 42869 42243 36113 38087 43924 40238 36530 35175 39973 44109
13215 44109 44120 49212 54160 55280 48762 43252 40027 42772 43718 46842 51360 50377 49189 59740 64927
13200 64927 72657 77614 84270 91464 99141 116616 139927 148292 141760 138385 134336 123793 109275
13187 109275 98661 95160 89070 82562 77170 74017 68942 64620 58284 55310 53223 49936 57150 61955
13173 61955 65711 58946 52593 53770 40856 33297 36053 32513 38198 45853 47112 39545 35660 37039
13159 37039 33318 39532 43380 46750 47369 47904 56924 58449 55271 53887 54730 52503 49754 48856 48938 47677
13143 47677 47084 45396 52545 55330 52507 51895 52148 48320 49924 51045 49675 46753 47306 48672 49597 53496
13127 53496 56219 50567 54195 59764 55273 54258 58807 61353 66107 59430 56856 56854 60064 61497 66298
13112 66298 65549 60762 57595 50237 44243 44700 47077 53283 50972 41338 41837 47612 46245 34530 31922
13097 31922 36432 43261 45908 47553 43445 38222 37962 41011 42328 46252 54036 62641 63093 60233 54801
13082 54801 56104 60823 61828 57502 54139 56725 60598 65927 62066 53771 46224 45668 43958 40283 41978
13067 41978 51292 55339 57975 55103 60424 62954 74039 87035 105004 112607 116498 129957 141091
13054 141091 149909 144009 138624 135641 129592 122159 115209 109815 101715 96404 96933 95400 100583 101598
13040 101598 103957 100124 105176 111335 117341 117293 117315 114923 111120 103892 101284 101613 99135 104017 107200
13025 107200 106347 104557 105651 101882 108885 108663 106440 108000 110437 114882 124122 131205 131042 126723 118177
13010 118177 118314 122089 127562 132379 143957 157306 169413 189657 234829 289243 368838 492061
12998 492061 651486 824568 980402 1126544 1254244 1334531 1326322 1252826 1159141 1039342
12988 1039342 895551 750131 628942 540215 474738 436105 407171 381091 359372 337373 322359
12977 322359 306504 287929 275383 264892 255607 244860 235032 231668 227532 229742 236065 243411 257460
12964 257460 276615 297247 318168 351307 399779 463324 558485 711025 945493 1329616 1905896
12953 1905896 2632640 3369035 3941075 4264203 4325878 4119548 3664443 3067445 2468253 1991048
12943 1991048 1651189 1413808 1240963 1111030 1018182 943355 892893 853551 804839 742403
12933 742403 687313 636892 600823 584845 577775 590911 645311 751735 926185 1182135 1496229
12922 1496229 1800397 2043749 2181969 2184546 2066455 1847821 1574142 1295829 1062237 890406
12912 890406 779654 694963 630926 584666 547189 517731 481297 444906 407955 370656 334684
12901 334684 302074 272533 248029 227737 209574 195032 184461 170484 166958 163910 162768 161245
12889 161245 158691 156577 155129 157766 157943 155038 153373 156929 164823 172615 180306 187892 202225 206505
12875 206505 210548 212268 214938 214349 200855 187871 178160 171320 163475 159250 162103 167521 164385 150651
12861 150651 145441 141782 141033 137872 132215 125921 120788 120011 121806 118818 111723 108446 116572 124790 123025
12846 123025 119136 119469 118229 114508 120293 113903 109542 115402 124878 124080 125263 128133 124550 126597 143279
12831 143279 161978 181900 207340 232183 259424 289956 326994 373412 423014 457165 483993
12820 483993 510643 532575 540539 523777 493705 465461 436232 405395 375823 350839 332077 310525
12808 310525 294731 289330 279411 274274 263579 250853 235926 234126 231561 223271 206986 182497 166007
12795 166007 155500 158151 167892 168373 163435 163852 164000 163871 157816 152399 150018 143473 142412 150270 158969
12780 158969 162255 159003 162853 157762 145585 140996 142971 145737 152652 157771 161062 168796 181057 185232
12766 185232 179157 173663 167174 173599 191660 209244 228381 246171 270143 295280 308003 314394
12754 314394 310334 291037 265770 242908 222168 206860 199848 200262 209259 227637 246935 270980
12742 270980 293945 315776 346416 382425 423168 448634 459942 453479 435189 410176 388449 370230
12730 370230 348279 327303 313127 305981 300957 292609 298061 298332 303213 304291 300527 301103 299807 295850
12716 295850 288226 281396 266066 252340 240012 224426 214492 207573 199503 196726 196490 190979 187461
12703 187461 191210 203273 230712 262274 282039 295153 304873 310591 314791 306515 292751 276015
12691 276015 261005 246291 237017 239216 251634 270324 292659 309186 331025 345472 360633 362908
12679 362908 365681 378721 404477 455849 522866 585637 630563 657055 667573 659588 639389 613503
12667 613503 585198 563599 542708 535986 536550 546609 551656 565981 576009 587142 596218 598704 606112
12654 606112 618728 630008 636511 639569 641511 645321 647717 645380 640663 633013 626484 627676 633697 632403
12640 632403 621357 611477 601867 586415 586804 594263 602562 611271 632483 663185 701527 735493 760509
12627 760509 787247 820779 845972 866640 879837 890248 916557 940387 966493 1007103 1050001
12616 1050001 1103702 1164579 1227985 1292431 1337067 1380800 1428504 1472502 1515172 1551121 1597657
12605 1597657 1668991 1768625 1894018 2039307 2187642 2337277 2491015 2655794 2817446 2981410
12595 2981410 3164281 3372932 3612273 3892142 4225227 4639293 5168861 5806045 6545955
12586 6545955 7414113 8481766 9834816 11496831 13450631 15662602 18116476 20886165
12578 20886165 24145948 28307640 34177903 43338627 58176361 80788036 109820218 139416682
12570 139416682 165509777 189816719 211689935 223026603 218668239 204295551 186768537
12563 186768537 165869317 140593672 115110061 94331457 79280544 68681754 61069598
12556 61069598 55302615 50563152 46373195 42579229 39121958 35813303 32467254 29110266
12548 29110266 25915407 23037483 20495869 18254555 16277831 14557219 13065167 11767872
12540 11767872 10641407 9672403 8834806 8114214 7509177 7007099 6603634 6270063 5988047
12531 5988047 5735898 5504881 5283238 5060511 4825914 4595916 4388799 4218153 4097623
12522 4097623 4013447 3960996 3940793 3949747 3995021 4062839 4157083 4290686 4441094 4601324 4768310
12511 4768310 4947702 5131746 5338869 5596663 5915300 6310407 6834324 7501162 8339084
12502 8339084 9389226 10698445 12322971 14260807 16407891 18722318 21217219 24046691
12494 24046691 27530551 32211856 38946214 49168849 65363718 91408510 131290892
12487 131290892 185249794 246233110 301875909 342721542 363004871 361988760 340565311
12480 340565311 302539873 254945920 207412694 167996637 138738748 117840496 102590452
12473 102590452 91103291 82323122 75549563 70017517 64910222 59630795 53981214 48195531
12465 48195531 42669275 37676421 33299558 29506224 26218563 23363856 20876138 18702234
12457 18702234 16802761 15141706 13691988 12427269 11347074 10436934 9691555 9062408
12449 9062408 8522229 8057703 7639043 7227481 6797529 6361403 5938354 5528586 5108332
12440 5108332 4684989 4275547 3906589 3574568 3278297 3009218 2770547 2553742 2363561
12431 2363561 2194833 2049640 1935538 1836954 1753761 1676186 1601745 1533288 1480510 1448312 1439034
12420 1439034 1434939 1457312 1516405 1617558 1759120 1906707 2030466 2112097 2125206 2059209 1933738
12409 1933738 1762774 1581281 1418201 1284207 1188447 1115936 1056894 1010271 977132 952806
12399 952806 924813 883386 838647 796798 760326 722965 695865 668341 649155 627945 609930
12388 609930 605513 599438 586469 570695 550193 525846 490366 456554 426260 399179 383643 377291
12376 377291 386711 394697 407318 421713 435399 439636 451618 459083 470229 485665 502293 518079
12364 518079 537727 563445 611382 675286 733703 773067 785109 778065 762653 778865 822385 878686
12352 878686 910537 915113 904035 879010 840342 787609 724184 667257 623626 595982 570371 550418
12340 550418 540514 544463 549587 550106 550713 552150 547827 535884 521666 510592 497225 493505 492516 507009
12326 507009 535402 564384 587760 597448 585498 541038 492347 445209 401040 375676 357389 347214
12314 347214 344969 350398 350858 345711 345880 345843 340533 327560 308692 292996 278447 278362 277729 274320 256455
12299 256455 226249 194007 152685 115933 90211 72034 67710 88321 124139 152977 171690 187026
12287 187026 185266 175279 163988 162793 164053 168444 171209 179558 188894 193892 197616 207645 220556
12274 220556 225058 219039 216887 206554 198547 191127 181634 175852 190295 197657 206221 213791 221041 220801
12260 220801 223765 225909 230849 226812 224183 217199 202626 187672 169771 155658 144917 132955 118772
12247 118772 106936 103892 106645 111728 120284 131219 132723 132374 130578 124360 115685 115971 120316 127786
12233 127786 135597 135585 133150 132751 128358 126706 114872 99940 94501 93578 88844 94610 107556 114684
12219 114684 128760 132404 134140 131792 120102 110424 102777 97335 96900 102899 101648 98632 101578 105448
12205 105448 108148 105132 99768 100434 105464 100165 97186 97900 95012 91444 81788 69976 72085 70352
12191 70352 69293 73079 75985 75491 77128 75174 69087 61362 55126 55251 51100 41357 32259 36652 44286
12176 44286 47386 48051 59106 61164 65991 66572 62057 68712 67608 57633 52354 56783 53105 50866 52560
12161 52560 60854 65979 73658 75120 73914 75668 77555 83406 99343 106220 113753 120848 128082 138944
12147 138944 139257 145144 153607 177426 220488 289685 398238 547958 717164 873709 1024796
12136 1024796 1175795 1278741 1292889 1227717 1137977 1032527 898180 745200 614620 515237
12126 515237 439304 386472 359183 340169 318342 294238 273423 256948 243935 218715 197936
12115 197936 188806 179454 160049 144126 136006 127318 121414 106220 99731 97128 101628 107873 113055
12102 113055 117468 123876 143779 177146 215301 264181 318602 352947 372293 378636 367246 327031
12090 327031 275403 235581 201657 179305 158163 138597 121260 115810 111434 104376 93013 94508
12078 94508 95811 96451 87257 90068 87694 85764 85549 85345 84147 84758 82048 89903 94925 90072 82965
12063 82965 71625 57945 49856 51080 51222 57405 62183 69095 78692 99376 117176 132589 152427
12050 152427 173337 183543 219761 276909 369965 523905 750053 1055721 1393903 1699911
12040 1699911 1915699 2008632 1983393 1832537 1590703 1314978 1065665 867254 725894 620451
12030 620451 541421 486991 440986 399373 372061 340448 301575 269787 235277 200629 170933
12019 170933 139190 114315 96172 80974 68747 57924 52086 48644 49419 48794 43052 30933 27831
12006 27831 35825 35912 32137 24160 23784 23363 20659 21167 21036 12955 13704 20497 26253 27113 26726 20851 19096
11989 19096 17711 11330 17890 21235 31101 36266 38358 50122 53243 56406 55080 52305 48047 40714
11975 40714 35119 27990 20320 9221 6172 737 2496 5753 9395 10344 17768 25301 25780 23382 21786
11960 21786 22451 17991 13323 12103 13048 17780 9471 8656 9465 16107 18275 17348 9319 4026 2640 8033
11944 8033 14458 13657 7891 9910 15349 13143 7224 5679 4308 2213 701 -657 3632 10530 9520
11929 9520 9247 13857 20858 24804 30388 32494 39184 48805 52226 44029 45286 48549 45124 34497 27620
11914 27620 24875 21292 22285 18089 18760 18765 17357 20306 14513 8381 10073 7978 6597 5956 2501 5575
11898 5575 7548 198 1540 7566 3109 -3776 -1777 9530 12982 16604 9776 5092 7359 8543
11884 8543 7212 -1348 -3586 2122 -7499 -10810 -5865 -3464 -366 361 4154 -4791 -12240 -9381 -8725
11869 -8725 -7653 -4513 -6025 -6311 -5224 -3540 -7437 -16402 -21428 -16143 -10059 -6565 -4178 -6458 -5190
11854 -5190 43 -5763 -5431 -3555 2429 2659 7135 4519 3114 14516 11099 4265 9502 9016 2154
11839 2154 -1539 -1327 6687 6679 5353 -1048 -744 1366 735 4323 7610 5100 918 2222 2591 -220
11823 -220 5072 7851 3419 6798 6610 9981 10684 7873 10160 4016 -6619 -6129 -1056 10039 16948
11808 16948 15232 14888 9336 9073 6020 11838 8599 6350 8905 7964 10667 6079 -6665 -8752 -5319
11793 -5319 -7806 -1536 -4118 -11901 -16663 -14082 -7978 -3371 2442 -355 -1589 -4194 -759 -1289 -7310
11778 -7310 -9808 -11789 -9867 -7510 -9725 -10969 -11536 -8910 -10906 -8809 -7195 -5951 -7423 -6973 -2248
11763 -2248 -7970 -10323 -5894 -7652 -9446 -6573 5604 3768 -3578 -3388 2206 4792 4616 6411 3750
11748 3750 508 4266 2745 -626 -1772 -4147 -4775 -7078 -9052 -13345 -10575 -10321 -9954 -6134 -535
11733 -535 1175 -14 -950 419 276 -3629 -6257 -6483 89 5424 -3076 -10361 -1880 1578 -154 -25
11717 -25 -972 241 4468 7118 3849 -3762 -7700 -6003 -2603 -4466 -5226 -2220 419 -3207 -10135 -13646
11701 -13646 -3258 1558 -1065 -4399 -3603 -2144 -11351 -18571 -17380 -10128 -9741 -8108 -6731 -8304 -5197
11686 -5197 -7137 -5665 -1838 -5463 -16279 -17302 -12203 -6628 -11900 -16199 -14665 -14121 -13387 -12078 -14801
11671 -14801 -11683 -13179 -11162 -5569 -2475 -4429 -10340 -12106 -10060 -1962 -3775 -1956 4075 10767
11657 10767 4591 348 -2064 742 6872 2410 -585 -9670 -17958 -11126 -10244 -10095 -9355 -12324 -5499
11642 -5499 25 -6106 -10167 -19425 -16448 -12309 -5782 -5157 -9441 -9461 -8577 -8145 -4565 -3519 -9310 -16094
11626 -16094 -22042 -22963 -16689 -18377 -13943 -8948 -12302 -12492 -14981 -8646 -6798 -1071 -306 -352 2287 -2995
11610 -2995 -9684 -8496 -8587 -7840 -4194 3140 -673 -6453 -6808 -8186 -8701 -8796 -13277 -17571 -15738 -16664 -24067
11593 -24067 -22371 -19757 -17002 -12217 -6104 -646 70 -2855 -1776 3066 2264 458 -904 -4222 -5508
11578 -5508 -8823 -10120 -9053 -6290 -7122 -3369 -2302 -637 2886 -7618 -19313 -19270 -13953 -16111 -20496
11563 -20496 -20311 -14160 -14706 -12655 -8496 -6986 -6647 -9120 -7357 -800 -2301 -7107 -10429 -6015 -2538
11548 -2538 -6400 -10745 -10159 -8149 -8684 -10718 -12862 -14812 -14983 -14569 -16099 -19499 -16723 -11477 -3774 -3135
11532 -3135 -6201 -3662 -3576 -5047 -3700 -1986 2190 -649 -5087 -2808 -4445 -6703 -13240 -12889 -11616
11517 -11616 -1186 5982 5081 -6681 -16571 -18407 -12183 -6862 -6873 -10166 -14211 -18192 -17048 -22175 -27069
11502 -27069 -28166 -25436 -16368 -10653 -8186 -7812 -7888 -6671 -13174 -13140 -10441 -15290 -16539 -17743 -16218 -7048
11486 -7048 661 3891 1842 -7556 -5824 -2086 -574 -9683 -15934 -16959 -13185 -3427 178 -8186 -8310
11471 -8310 -4637 -1137 -1202 -4019 -2559 2042 2826 -2774 -8095 -7625 -8957 -4790 -6786 -6012 -5146 -6303
11455 -6303 -3105 -6077 -5381 -6994 -9970 -8639 -3608 -8517 -16314 -20579 -17160 -11575 -10267 -8177 -16019
11440 -16019 -16593 -14186 -10333 -5924 -6533 -6215 -6435 -2480 494 1193 -190 -902 -3068 -2417 -3802 702
11424 702 -1313 -83 -2388 5116 9409 10576 6357 4631 3062 -3110 -8094 -10251 -9586 -10051 -6245
11409 -6245 942 1676 -5336 -1660 -2961 -2748 -2707 -5797 -482 -2157 37 3322 9419 11665 13380 2381
11393 2381 5652 12559 5403 1629 549 16 6440 3901 2182 9387 12176 4498 3144 5701 7057
11378 7057 9519 2038 -2399 268 -3648 -4961 -862 -1957 -3884 -7032 -6206 -2565 -2332 -8648 -14282
11363 -14282 -13141 -3239 2369 634 1792 -1158 2181 1098 -1583 -4373 -4849 -11244 -17257 -18194 -15775
11348 -15775 -10262 -7180 -4363 1085 1718 -5775 -906 11475 11140 -2788 -6063 270 -2264 1525
11334 1525 7971 6032 -1784 -4676 1682 4689 2282 -5481 -11240 -14087 -7464 -599 -3806 -11254 -14522
11319 -14522 -19209 -17588 -11358 -4678 -4222 -282 4238 7888 5442 4535 1958 1903 -4089 370 4473
11304 4473 7592 8644 9283 7884 4409 6408 6528 3341 5700 14463 17919 15924 11976 6501 8966
11289 8966 11616 10869 13420 14914 16572 14789 11644 13960 16936 20268 20985 17260 17927 11546 15117
11274 15117 13827 10802 13149 12105 20232 22296 12459 5467 3286 1026 -3308 -1998 8757 16486
11260 16486 22668 15559 8222 2832 9361 15068 19020 21561 13802 8570 6080 1125 1078 9691 18620
11245 18620 21948 25991 19485 14588 20782 22854 18315 15700 17851 18775 19785 18475 15161 15269 24388
11230 24388 24862 26034 29201 34802 37964 42234 43138 41293 40896 43036 44758 44031 34734 27814 28891
11215 28891 26384 22466 25570 25008 27996 29527 27488 20412 21660 22582 17873 13134 14600 17392 19254
11200 19254 18328 11318 4607 6794 9561 13330 21541 26328 20996 20317 21366 15978 9481 3656 2637
11185 2637 7998 16511 17876 6567 520 -2043 -4231 1277 7032 11884 13386 16927 18244 19070 16224
11170 16224 18318 27487 26723 28741 31960 30648 25202 28090 33297 34333 34597 37607 42774 52726 61733
11155 61733 69585 83655 89852 94676 89015 85515 80187 73406 63513 52331 55375 50112 44970 41427
11141 41427 38020 45060 47737 45867 44674 41564 40186 38140 41238 45478 43320 40965 48103 51427
11127 51427 53950 57947 63231 73902 82347 87735 84650 82723 81898 70650 56647 48914 51191 57166
11113 57166 51618 55764 54314 51152 52596 55923 57453 60153 61988 62164 51648 49665 46236 45994 43744
11098 43744 42650 38662 38299 32463 31187 33697 40339 41432 41904 48634 51438 57978 63154 61530 58664
11083 58664 55109 56904 58301 53141 50767 45896 42002 38307 41796 40835 31192 24754 23882 28624 35773
11068 35773 38316 35842 37324 33286 28811 29583 34742 43613 55262 83721 119775 140087 152677
11055 152677 161870 164656 145821 123740 103158 76515 69035 64516 54719 44531 42813 43122 42563
11042 42563 38779 38048 34554 27976 22424 20263 23491 24876 24028 30299 31607 17440 11084 11332 21057
11027 21057 24720 26376 28149 21443 25260 22925 22845 25090 27531 25263 20613 10782 14017 18809 19458
11012 19458 17657 13553 12545 10335 9473 10747 12563 10676 17207 20056 20018 21104 15047 10677 9279
10997 9279 3725 8028 12540 10458 6414 1584 2520 6300 8689 13508 19139 15791 13474 13685 11944
10982 11944 10032 7842 17579 24628 24547 24627 22975 21705 16184 13378 3254 -2580 2477 10761 5572
10967 5572 -7746 -9947 1817 12753 16949 19014 17984 15865 17405 20291 17588 14331 12411 14542
10953 14542 14588 17172 15055 6605 6953 4020 2033 7750 10885 6002 -1460 -3582 -5029 -2271 -4166
10938 -4166 -5411 225 10028 20065 17884 11572 9659 11385 11903 15533 15787 19204 27008 33924 35636
10923 35636 34495 28958 35870 32050 29036 37224 41854 40428 42599 40050 35629 34647 31732 28562 31853
10908 31853 32960 29802 17709 17458 19463 16316 14585 14298 12953 19541 20461 24005 28909 25933 15415
10893 15415 15784 13771 15600 21845 26900 31620 30907 27975 26952 31217 33507 36344 31226 32065 38530
10878 38530 47482 51154 56035 57999 67433 75676 68265 58386 54347 54704 51938 55800 61930 61008 70065
10863 70065 73518 80056 95734 116422 145510 183950 238149 311039 384487 452423 500027 520497
10851 520497 512176 471947 418786 365110 306741 264820 231594 210877 186726 165463 150702 140965
10839 140965 137302 135502 129170 122903 113081 106701 103830 98297 91793 77989 65436 62648 60888 62873
10825 62873 63359 60294 59011 58399 51487 49635 51265 47466 42532 46847 46580 49852 51896 51875 49981 51206
10809 51206 50959 46173 51011 49156 35871 35035 29141 29311 33451 29473 20279 20644 17738 16517 18556
10794 18556 19748 21422 19435 22640 27050 27577 28728 30723 30663 34287 30523 28701 28403 23119 21026
10779 21026 16415 17972 15330 11656 8938 12239 15773 15717 16603 12439 13548 15381 8319 9025 21448
10764 21448 24495 22847 20087 19453 22909 25524 25993 26210 19305 21374 32463 30977 30004 25153 24910
10749 24910 30155 27480 27808 28155 28607 36505 39604 40254 42057 42151 46400 45218 40194 42202 46036 46451
10733 46451 44388 48404 50041 47139 51657 56944 58199 67902 72101 73306 73160 78858 78976 76797 79598
10718 79598 85774 89507 86773 83016 80416 83025 82859 77360 76591 79219 80515 77726 72045 74573 70956
10703 70956 64898 60036 56542 60976 61161 56285 53986 54730 47598 44456 45507 42325 37819 33382 27560
10688 27560 25674 30210 31216 31717 31536 37223 36444 37504 47519 46294 36665 43582 45519 44389 50020
10673 50020 52002 55115 56353 54164 60057 69071 70631 70618 71765 67549 59962 61185 56855 58610 68205
10658 68205 71296 56704 51650 54286 51438 44787 42121 39963 36888 40402 37759 36794 37949 38052 34740
10643 34740 34511 37444 43094 45318 42265 35099 47717 51783 48892 49219 46913 46434 53691 59921 57147
10628 57147 56713 61317 57824 53053 47633 42071 48798 50221 54189 55140 61687 57424 49734 41017 30652
10613 30652 27577 30140 30380 28326 22821 23466 35301 43604 39219 39862 36076 32176 29972 27873 26152
10598 26152 33450 39149 39462 33425 30757 28494 28156 26146 24885 25771 31042 37381 31589 26514 25054
10583 25054 28226 24556 22981 20851 24938 23261 20195 19396 22046 21367 24105 24641 24770 19394 17578
10568 17578 17560 11059 10802 12746 27381 30735 23412 26329 35791 39215 41274 34404 32146 31033 26381
10553 26381 27944 30646 31904 33380 30704 17544 13775 13102 13640 10241 7416 15361 22284 28473 27083
10538 27083 32070 35073 32721 31338 29142 24569 35530 38785 43284 44467 37349 34755 37529 43607
10524 43607 38173 33025 34023 40906 43329 48076 57230 62225 62961 64521 76757 86721 92485 89447 85882
10509 85882 82657 75774 75425 76639 68361 57416 60218 67558 66547 64044 62581 61255 70616 75752
10495 75752 79406 76468 75251 71987 71517 67982 70865 70112 65528 58882 57113 51434 49263 51281 51763
10480 51763 57048 65702 69130 78809 77659 79067 84750 89754 94172 102249 108736 106678 104656 110264
10466 110264 113018 111455 123408 133857 139517 151760 156794 157984 166798 188784 214355 247420 301397
10453 301397 375346 486980 647239 860989 1107929 1362896 1604260 1790370 1891236 1890631
10443 1890631 1802433 1635706 1426661 1211607 1011257 852961 727689 629268 561422 514557
10433 514557 470165 437080 406492 381212 354461 334160 303437 274751 252197 227795 208128
10422 208128 191785 183946 167981 149336 130395 117962 105448 98649 100687 105224 99140 100647 107203
10409 107203 107797 108304 120302 130337 146888 170617 186409 192932 185369 175811 159531 139877 122889
10396 122889 106135 96415 86916 82079 82677 82333 80829 82247 79193 76507 73664 66746 60563 59215
10382 59215 54892 49794 47156 46667 44994 40580 34436 35417 31452 32772 31871 42398 53465 64487
10368 64487 67791 69471 70899 69763 59692 57190 63202 66286 66127 64774 74120 73798 73763 74313 83372
10353 83372 90862 93028 90481 88152 86969 80193 75778 73536 78643 77468 69293 66570 72905 85739
10339 85739 87791 77545 74424 73041 66835 62110 67176 72163 70628 67479 60881 56467 49690 45836
10325 45836 55688 58353 55425 56555 54642 52309 54484 51776 58047 59369 59064 58130 53507 50874 49969
10310 49969 57432 75128 96372 119681 146377 174555 202202 228051 249670 272918 283013 286322
10298 286322 282279 262167 240592 217443 201139 187417 171785 156614 145395 138444 135229 138674
10286 138674 141844 149542 149746 148999 148297 143378 143419 143900 141533 130096 114293 105752 96818 86324 82947
10271 82947 75563 62027 61812 62093 61053 63056 66931 67854 73888 85771 92273 88185 84197 74988 68806
10256 68806 62840 56274 57679 59310 59052 69141 81907 91049 97932 106993 114891 122302 119981 124445
10242 124445 125909 139087 162468 201637 233210 256417 292677 321751 328929 329921 314039 291222
10230 291222 266056 238926 208465 192921 181416 165342 158268 163717 163465 156568 150076 146004 150502
10217 150502 158363 160963 171217 177354 190218 201749 204387 213333 222459 233172 235216 240594 240979
10204 240979 239124 231365 219114 208898 194280 182424 173879 165629 148041 136949 119504 114499
10192 114499 115402 121344 122057 129991 139072 145976 150564 150183 149881 149440 159180 175065 196676 220172 243439
10177 243439 275749 298618 312600 320145 320445 313632 302236 284698 270862 255197 246859 251962 258942
10164 258942 263980 269138 276992 292374 299884 309614 324116 342152 363534 385878 399633 400134 403914
10151 403914 412608 420496 421434 427210 436287 454533 470166 483030 500967 526735 547405 564242 589265
10138 589265 614631 646133 670186 691280 715213 730163 731708 729108 733809 749468 775534 828252
10126 828252 910743 1006605 1111055 1228272 1370550 1497707 1558244 1591826 1620483 1629068 1585067
10115 1585067 1505828 1440076 1399674 1363934 1329048 1326334 1343328 1371074 1410605 1460073 1530154
10104 1530154 1635243 1798917 2046635 2407803 2857228 3358952 3856716 4313836 4668678
10095 4668678 4849226 4825556 4639483 4343958 3982440 3615017 3291750 3038997 2880073 2810112
10085 2810112 2807163 2857738 2941945 3062386 3199547 3358234 3533662 3724995 3934741 4163198
10075 4163198 4430174 4775937 5219197 5779052 6461499 7267512 8206373 9280658 10453729
10066 10453729 11694152 12999270 14385170 15875734 17502120 19312554 21377730 23814805
10058 23814805 26855937 30865759 36496978 44890771 57929921 78071370 107273206 145492173
10050 145492173 189921786 235959913 278115829 310473311 328434155 329705903 315115325
10043 315115325 288094561 253455958 216195489 180559407 150056834 126311074 108921923
10036 108921923 96414235 87223064 80126926 74271961 69052987 64073332 59115685 54093610
10028 54093610 49068776 44201357 39624806 35428893 31632100 28228227 25189168 22489919
10020 22489919 20098597 17989559 16142393 14545624 13164394 11968022 10938646 10047743
10012 10047743 9270146 8597708 8013508 7499203 7035959 6613936 6215895 5831343 5453016
10003 5453016 5077292 4701575 4325558 3969271 3623733 3305549 3018393 2761140 2541906
9994 2541906 2354654 2187803 2037840 1906444 1791765 1692145 1602575 1518361 1454822 1397806
9984 1397806 1347089 1308264 1284411 1259789 1238949 1223720 1206858 1181788 1146399 1109914 1079304
9973 1079304 1044305 995460 949719 913951 878475 852128 837151 826105 823882 812657 795529 773477
9961 773477 744309 706832 671631 639175 621260 624373 652530 731167 871599 1005828 1058900
9950 1058900 1079875 1094276 1066093 961531 847514 766149 713162 666391 636863 614525 596923
9939 596923 582685 568733 557131 551639 540567 528028 515792 504676 500238 495836 492725 483501 484004
9926 484004 503585 528289 563435 593868 619473 630632 628039 620544 601165 576064 552293 526242
9914 526242 504619 482155 453452 424713 399774 391479 386097 382961 385055 386452 387195 397786 411384
9901 411384 424572 427350 426118 423289 422363 416958 406044 398347 380921 363838 342668 330295 318868
9888 318868 302732 283351 270478 263953 256716 247705 239284 228173 223864 222670 220595 213227 209167
9875 209167 209090 209140 207373 207118 207155 200766 187009 180258 176349 167680 152894 137725 107173 72467 42411
9860 42411 10174 -15747 -36716 -50822 -50957 -37751 -10512 14563 39962 55823 66365 80465
9848 80465 91898 98240 102601 104960 105404 118009 130404 142753 151965 158373 161017 167879 168550 159009
9834 159009 148643 147253 152972 154946 154971 160770 170162 182933 186540 188772 197023 201380 199485 197909
9820 197909 196235 192395 189393 183056 175043 168824 163934 164490 165703 170747 170057 164828 164800 177658 198711
9805 198711 213208 227238 250781 276511 306980 344649 389237 453104 543183 671119 832455
9794 832455 1008724 1169544 1304214 1407706 1490245 1567361 1671532 1836135 2061921 2280036
9784 2280036 2428996 2500936 2506681 2428267 2279966 2135844 2044541 1989121 1931349 1857578 1767756
9773 1767756 1644430 1494254 1331011 1180213 1051417 950068 856084 778817 712190 657528
9763 657528 603823 549306 503521 473214 441286 414622 389970 357299 327142 305637 281761 267697
9751 267697 254489 234990 230777 222789 207834 194242 192188 181185 162893 159769 149454 139692 138373
9738 138373 134199 132250 132789 137030 144479 142089 133692 127876 131081 124805 121269 119904 122536 125237 125447
9723 125447 120257 122592 130008 133692 135800 129105 132888 143641 145319 139404 137397 140930 137465 126374
9709 126374 122244 120243 124690 123439 119414 114456 113048 109031 110335 115516 121877 122082 119571 113379 119086
9694 119086 124574 130468 140925 146281 154476 160618 160899 162504 164957 167211 172109 173314 171821 167740
9680 167740 162486 161412 162672 162813 145649 140460 145438 139014 130026 136863 144117 145213 142643 140266
9666 140266 133552 136456 140145 146286 151451 151946 159274 172518 174506 176132 187282 203323 216814 234483
9652 234483 257059 289569 337690 417992 536909 708774 934041 1195000 1460309 1699808
9642 1699808 1878841 1970331 1963578 1861661 1686278 1473647 1265846 1079857 925381 815707
9632 815707 737995 678885 630071 587562 553142 523014 488497 456732 424418 392820 359841 333364
9620 333364 314381 298041 284847 280718 273615 269855 263795 262741 266900 268818 269898 274183 285453
9607 285453 297378 316338 350123 394761 429790 475001 526661 582506 647041 725030 813909 918294
9595 918294 1059254 1237757 1464246 1720542 1984559 2269829 2596990 2924503 3166410 3290474
9585 3290474 3339297 3335727 3232746 3004358 2719405 2435279 2172092 1920519 1672054 1455411
9575 1455411 1283258 1146915 1033342 945341 864903 795228 735721 683384 625195 571434 521497
9564 521497 468828 427095 397142 368045 338022 317503 294810 271952 259594 241730 231613 225129
9552 225129 218477 208805 197963 187392 186187 186353 189628 186560 178710 177695 172012 162930 160137 155276
9538 155276 151695 149587 137404 132463 135915 134590 128006 121777 122654 123613 118821 125185 126396 128762 131438
9523 131438 130022 140767 146428 151479 156190 158066 154227 154986 148810 146525 148339 146834 157169 165967
9509 165967 161880 159436 154719 147823 148878 144735 139574 138645 130524 125205 127626 130080 127715 132157 129316
9494 129316 124749 121906 116292 111531 117108 116997 118663 117896 121242 122661 116461 124471 132554 138172 144562
9479 144562 152238 163286 179566 190673 200916 214918 215139 217151 221531 217116 206201 200015 198001
9466 198001 183237 164021 157231 160091 156659 145604 141292 135032 131864 130441 124743 122725 122721 118936
9452 118936 117936 118446 120915 123833 123911 119569 117234 117871 117270 117345 117405 110225 104779 106763 108184 108243 109698
9435 109698 109766 103747 107296 107945 105358 108938 113757 115944 114759 111752 104781 100588 103262 110777 118164
9420 118164 117427 113783 114962 112245 117118 126215 125903 119702 122109 120047 113959 110286 108763 107010 103584
9405 103584 102984 108463 103634 102771 109197 110612 115504 118566 121673 129585 134965 136031 131841 128218 132322
9390 132322 138729 144230 145568 140088 133865 133177 138106 137171 137895 130416 128912 131097 124272 123138 118846
9375 118846 121483 124512 125066 132486 131705 126749 135334 137606 139034 145240 142977 143667 144219 140424 137697
9360 137697 135440 136456 138193 137694 141427 142962 138159 138799 134240 132302 127194 121769 120051 124933 127552
9345 127552 128687 136972 140514 137165 134052 128046 129363 131584 129896 132398 140072 146619 150143 151442
9331 151442 146925 150218 143903 148348 152354 150360 149273 145385 149538 155209 160290 167544 167253 167924 166576
9316 166576 163013 161261 159230 159541 160533 161230 155929 152421 160338 167676 164096 159146 162088 163854 167377
9301 167377 170133 172500 173012 172014 171512 172518 177831 177714 181707 179080 169574 170833 173714 176500 175059
9286 175059 178475 176997 182013 191543 193022 183117 176825 174825 175825 175706 169666 174228 177383 173785 172479
9271 172479 177986 180810 178234 186683 192005 191481 190150 183969 181147 184358 192256 197116 193438 190203 193385
9256 193385 198796 198121 198190 194260 196253 204613 211052 209058 210771 212924 205715 210283 214285 213484 212643 214059
9240 214059 216340 224316 227183 229574 229908 224711 223289 220836 223400 229075 230325 231308 236133 235597 225733
9225 225733 220061 226332 230699 229415 227767 235695 235149 235379 234098 232343 234014 236901 241135 250785 249967
9210 249967 245290 245024 250510 258025 255572 260922 267176 269190 267789 272448 279455 286996 304051 314075
9196 314075 312459 311127 304485 307094 301858 300196 299662 301112 307077 316110 333672 351644 362057 364352
9182 364352 369852 376102 383132 388943 389032 382450 376349 371593 365133 360875 361529 361541 360724 354043 353758 360740
9166 360740 366208 370114 380136 401134 419529 435524 447740 448137 447008 441912 428391 414513 409727
9153 409727 407813 408966 409843 412679 406344 402392 406203 410418 416597 417135 414513 419089 427501 436271 433556
9138 433556 430313 422541 407714 404225 402633 406434 413327 411672 411050 416288 418736 422511 429971 437106
9124 437106 446695 451624 455430 460872 463376 457168 455362 452339 452898 454457 452885 450468 454646 463954 464654
9109 464654 459167 458196 464763 467683 466519 465577 465010 476243 483878 485371 488773 490933 494894 497595 500571
9094 500571 512904 521831 521532 527164 530326 531593 533851 544348 551759 553169 557770 557588 561598 565766
9080 565766 573902 577996 576340 585447 592499 587137 588310 597045 609207 608038 608617 610694 619114 626794
9066 626794 632106 637379 645060 644060 642149 650029 652889 656133 663731 667129 669541 674860 681446 686207
9052 686207 687798 688569 699538 708815 718647 724172 729062 738032 738155 738028 746860 762190 776928 793872
9038 793872 809677 819278 821828 820099 821423 832596 846083 848520 852737 863167 874073 882827 891402
9025 891402 903034 913806 922532 927651 932420 940552 948122 956812 969553 976721 984985 993553 1004885
9012 1004885 1018511 1029953 1042635 1051836 1063499 1079743 1088622 1099061 1108614 1119446 1132934 1150235
9000 1150235 1158366 1168670 1182309 1192579 1204698 1216392 1227111 1242858 1265697 1282666 1293114 1305578
8988 1305578 1325784 1340355 1353573 1371796 1393982 1418024 1436307 1452895 1467186 1488892 1508885
8977 1508885 1523204 1537407 1564180 1590242 1608476 1627710 1650957 1677563 1697603 1728803 1753049
8966 1753049 1771617 1793816 1819361 1846639 1871077 1896761 1933433 1965691 1985337 2004741 2035002
8955 2035002 2070678 2106351 2133939 2166042 2201637 2241857 2284098 2322049 2363874 2403046 2438438
8944 2438438 2476464 2513531 2558561 2606665 2654452 2699176 2744388 2795133 2846201 2886420 2933582
8933 2933582 2986918 3041061 3096883 3151715 3212104 3278815 3339282 3407503 3480033 3548108 3614271
8922 3614271 3691806 3769675 3841812 3915911 3996712 4081290 4168735 4259101 4358352 4458677 4553644
8911 4553644 4654349 4761948 4868960 4978543 5092319 5213970 5336527 5467120 5601439 5736220
8901 5736220 5875479 6026035 6186581 6345561 6504404 6678091 6866060 7060190 7247817 7440881
8891 7440881 7654490 7876096 8104823 8339241 8588347 8850328 9105376 9378733 9673532 9983618
8881 9983618 10300821 10625273 10965636 11323782 11700291 12096142 12510702 12943913 13388335 13845795
8871 13845795 14334523 14842249 15371638 15922996 16499302 17100408 17730299 18389416 19072407
8862 19072407 19782896 20517003 21277342 22063636 22883057 23733775 24602827 25506362 26433890
8853 26433890 27385898 28354278 29338851 30332827 31337444 32346768 33355927 34353513 35333230
8844 35333230 36287489 37207179 38083676 38906847 39672969 40384838 41021604 41574704 42038709
8835 42038709 42412847 42691660 42868347 42940513 42907345 42770916 42551275 42236430 41829889 41348187
8825 41348187 40785705 40155765 39468509 38737566 37960808 37156164 36317394 35470008 34610425
8816 34610425 33730286 32839338 31943792 31026535 30104471 29188912 28271896 27366707 26483847
8807 26483847 25633878 24805530 24003787 23236715 22498276 21784939 21098785 20457178 19837503
8798 19837503 19244422 18681290 18141847 17641740 17208895 16862059 16637443 16607430 16893488 17618633
8788 17618633 18684553 19574323 19883762 19757018 19312946 18361407 16885853 15351315 14100814
8779 14100814 13134448 12373258 11749874 11230920 10788477 10397973 10048517 9730009 9409652
8770 9409652 9071359 8730966 8394101 8072150 7771448 7488962 7232001 6992034 6766599 6556657
8760 6556657 6362731 6183736 6019462 5864528 5713061 5561015 5406125 5264983 5132827 5012576
8750 5012576 4896552 4779536 4679098 4578222 4470125 4368444 4263431 4165843 4078543 3994301
8740 3994301 3906010 3831042 3756957 3678444 3603113 3534701 3469099 3398352 3330392 3265610 3206661
8729 3206661 3149359 3094446 3039134 2993090 2947443 2893771 2840525 2785656 2734558 2688865 2649724
8718 2649724 2613531 2567923 2524498 2491667 2458157 2422796 2390089 2345109 2299650 2272666 2243444
8707 2243444 2213298 2188250 2152459 2121130 2092933 2065634 2033549 2000237 1970777 1942727 1916783
8696 1916783 1892276 1860871 1844191 1821867 1795609 1773680 1754186 1726329 1693006 1665187 1648137
8685 1648137 1626621 1602899 1581623 1562261 1538884 1522268 1506324 1486615 1467605 1446641 1424531
8674 1424531 1406495 1389550 1367966 1342197 1327258 1307632 1295618 1282191 1270318 1258013 1245778
8663 1245778 1235502 1227876 1218856 1196497 1176926 1169502 1158484 1140740 1122008 1108115 1100259 1089431
8651 1089431 1075578 1058375 1037395 1021357 1011182 1000230 993756 991607 983147 966537 954477 952237
8639 952237 944628 934554 932276 922299 911271 896885 889520 890374 885149 872850 860753 857448 854753
8626 854753 853627 841256 829154 821175 810515 801657 795004 784452 779414 775637 773509 764988 757140
8613 757140 755787 748866 746248 748487 749732 741899 735831 728767 713888 711914 712464 706263 694351 683800
8599 683800 676392 668356 660689 661936 669323 665610 663282 657798 653817 646995 639031 633677 632313 629338
8585 629338 623918 621169 614777 617719 616360 611583 614354 613702 608560 603242 607441 606042 596532 593970 594825
8570 594825 596144 596217 589259 587120 589916 584728 584580 582247 578351 569409 570717 571248 564478 559784 560769 561296
8554 561296 561399 554561 546786 539306 543336 541791 539718 534875 525566 514674 515451 520525 519178 520357 518386
8539 518386 516219 510839 509288 513303 517539 518098 519290 518454 516507 517062 519340 523844 535288 550155 556030
8524 556030 564799 570391 575547 587867 607260 624990 646169 665716 693336 730233 762295 792694
8512 792694 827574 858661 868547 863596 845591 813167 787983 743844 701801 665183 631825 605223
8500 605223 580813 558528 537099 521495 506556 496689 486831 471204 461578 450232 439254 435868
8488 435868 437059 424905 418920 421341 429621 429563 418503 406985 389816 370733 363511 354406 346892 338689
8474 338689 332729 326053 326810 324239 325864 331197 324334 320067 320621 319923 314313 309499 306448 294925 289727
8459 289727 285556 287794 282575 278537 288160 288842 283451 280695 281434 278819 273488 271099 264504 256284 250732
8444 250732 252924 254593 257377 257408 253747 251732 246621 240937 240447 239803 242525 239886 232760 233999 236701
8429 236701 238675 233774 235031 243718 245480 239133 237018 237592 235258 233795 229287 224439 225247 225880 222176
8414 222176 215615 216550 221298 220731 217143 220845 218119 213460 208176 212853 214988 214518 204170 199895 206560
8399 206560 206737 199005 194512 193088 190361 192381 191632 188289 188807 192857 194624 198591 206813 214930 215224
8384 215224 211631 206101 203503 200719 199407 196874 192685 197064 189358 179782 178986 175278 167104 171027 170685
8369 170685 169863 167730 168839 167177 168248 168031 162981 167217 161140 156842 159355 163584 163188 161634 166544
8354 166544 168718 165857 161241 158975 157956 165849 166361 159254 156641 155002 158944 160679 166234 163864 155786
8339 155786 149291 143494 151342 152515 145357 143066 148851 146107 141965 140761 144607 150242 145999 138976
8325 138976 138443 140411 141941 136752 132282 136548 147579 150054 150657 150170 146339 147258 145136 132589 123150
8310 123150 122868 126160 125005 122795 128538 133869 132254 130915 129849 131098 139857 140641 139743 141587 137381
8295 137381 133985 132155 131214 131984 130843 131236 131181 121294 117211 117170 114687 110780 108487 105919 105384 108270
8279 108270 107113 107463 110687 110018 110050 107550 104891 107047 112434 120991 123154 123777 114638 111438 111465 112559
8263 112559 113083 113607 115229 106453 104333 107142 115362 117870 118673 121239 122011 124880 129888 132533 130465
8248 130465 129343 118924 112833 109648 114834 117434 106236 98475 91973 89270 87672 88791 93801 88420
8234 88420 87664 95415 99691 97528 99086 96729 92319 86610 84406 88593 91614 95588 100371 99844 96353
8219 96353 88334 86830 90565 92337 94205 95171 93306 94894 100136 92210 85800 78424 79716 84276 81695
8204 81695 81655 83995 81307 78742 76258 75052 74465 74007 87498 97545 97143 91568 87031 81777 79787
8189 79787 73670 73190 67999 66265 72453 81950 83779 87348 84888 82907 82410 80423 80326 85759 86443 83136
8173 83136 74316 80049 81416 79493 78503 80873 79770 75790 78349 83145 81183 75648 75485 74484 76239
8158 76239 72523 79666 83995 85321 83096 78808 74029 74665 80785 82643 81806 85682 82988 76216 70758
8143 70758 69953 71087 64072 67357 63928 63222 67979 73469 70947 66794 71347 80736 82269 79593 78899
8128 78899 79775 81720 75805 73160 75426 74192 72507 71524 71688 67583 66642 65909 68178 71347 76263 80248
8112 80248 80833 78860 75278 70137 77807 81371 74050 70090 70043 66980 65289 71634 72977 73444 69302 60135
8096 60135 60601 56632 60696 62679 62304 60668 62284 64575 61006 57345 58530 62313 60625 60958 65054
8081 65054 71836 66765 67496 63600 59133 60956 60159 52362 52825 56798 62051 68550 65701 62744 62430 53594
8065 53594 55423 59589 58419 55485 52828 47571 46246 53966 58213 61042 59418 61817 65232 64617 58482
8050 58482 54142 51644 54246 60819 61123 59780 59256 57898 63590 61153 60943 63526 59331 64126 66509
8035 66509 66276 58317 45433 54977 67585 71701 68921 70133 65643 63287 65159 72862 71768 73972
8021 73972 77089 71769 66544 66163 66894 65168 60040 60065 58480 60920 59614 53340 53378 56400 58911 63147
8005 63147 68725 66225 66026 67772 65098 61800 60962 66162 70503 76687 76324 64882 57820 62509 70021
7990 70021 64559 68708 71803 77559 75300 80673 94937 101355 98816 97749 100551 105648 104409 100377
7976 100377 91336 87458 85237 85388 81090 78180 77431 75659 79281 79236 81777 85947 76913 77374 75125 80750
7960 80750 85126 81310 79524 88732 92546 96206 93371 85486 82398 78229 78905 88715 94244 94605 94064
7945 94064 94523 102259 109175 106837 103814 103674 108786 104579 108033 117010 121084 122074 118979 120901 125450
7930 125450 121762 113798 115310 111566 108742 111091 104997 101035 101382 105950 109468 113584 123278 126905 128194
7915 128194 129609 131582 133935 133293 131038 126138 118543 112573 111690 108930 96680 89505 86213 87701 90155
7900 90155 92080 97439 99180 94888 87548 88380 89389 90022 92114 92568 94286 92595 86396 84158 89097
7885 89097 94819 95049 91486 99471 104495 98178 94004 94034 97891 101595 103896 99045 97003 99544 104606
7870 104606 103125 101987 91895 89643 90147 89431 88278 91699 89507 84860 76054 71513 75053 75113 76702
7855 76702 65945 53729 51837 55781 58346 56463 48946 41986 48973 54128 57435 52007 43105 53381
7841 53381 60383 63690 67657 66767 64004 65441 64590 69117 69047 57693 51906 56892 61475 63738 53475
7826 53475 51576 52967 58927 60892 55014 51293 57026 56863 54656 57282 58623 56962 53128 64228 66557
7811 66557 55879 42921 41766 42600 35101 33319 31731 30742 34963 40180 37012 35959 37628 36859 41711
7796 41711 37850 39672 39094 38821 33692 30431 31826 32430 30654 27126 22011 23109 20100 25132 28439
7781 28439 20923 29900 38128 42123 49297 49138 47799 48910 43277 30008 28257 27972 29301 28215 30433
7766 30433 31340 36095 46462 50445 56006 46557 45022 39310 26223 20356 16229 20182 21443 23138
7752 23138 27505 20992 19751 21701 26530 30446 30551 27683 25977 26456 26952 26067 24206 29518 26793 22982
7736 22982 23437 20887 26184 29645 29085 29498 26333 13976 6729 5328 11077 17872 23501 26155 23342
7721 23342 23200 19588 24766 28217 22053 23093 20420 19441 25226 29520 33889 30225 23622 17022 20810
7706 20810 22322 27287 29957 30448 36861 30284 22762 19746 10515 5245 -1140 -1242 -6399 -4139 -5070
7691 -5070 176 12559 18481 15600 16346 26778 33173 34526 36821 40548 33286 25210 29399 20925 22447
7676 22447 22177 17525 13759 15445 14301 9341 10552 12299 18088 16445 15873 12071 8756 14227 15041
7661 15041 16032 25809 21882 17732 20903 18192 13194 15161 19788 21245 27282 29225 33073 28198 22737
7646 22737 26270 28647 23814 17994 15317 12375 16018 19661 14770 13887 18179 22221 16617 13606 23163
7631 23163 30241 29315 29583 23492 18754 15230 16990 21868 18562 14105 13813 8373 78 25 5157 4442
7615 4442 4735 12360 17218 33398 47394 59496 60553 50254 37194 30509 21071 14132 17337 13105
7601 13105 11770 10359 10127 10168 14637 15247 10872 13679 16420 17777 16863 17692 19995 21238 15246 15270 13721
7584 13721 6903 5036 8106 12891 19721 22749 18949 8176 8172 10998 9619 5913 3832 7962 8642
7569 8642 7043 5182 9484 12349 14965 10943 6863 12550 13548 10380 8469 2316 3892 6826 9293
7554 9293 10599 7420 8404 12935 11321 13555 17341 21534 19830 19105 16142 14740 4261 3123 2932
7539 2932 5173 6924 9782 10955 10871 11189 15838 11045 173 -4473 -803 3683 9914 8319 7620 8298
7523 8298 6247 -789 -1754 857 -2405 -761 895 3335 5167 5769 993 437 10063 15065 16537 15104
7507 15104 9984 9357 2868 -242 -136 3197 6037 4347 8818 10013 11917 15882 9822 10679 16258
7492 16258 16113 19412 17793 7885 1601 4047 8537 2324 992 8892 17116 12370 15175 14321 10078
7477 10078 10582 4031 9266 10397 2387 -1535 6552 13517 11349 3008 5666 11239 6561 1252 361
7462 361 -70 5841 12882 8630 6678 7718 5068 5774 4520 5505 9082 17223 17218 5928 4029 10544
7446 10544 10903 4964 1131 2408 12090 11726 8421 11756 7417 -2611 562 5471 4464 2983 6077
7431 6077 12400 13374 12939 13676 10941 9397 11087 14313 14706 6651 -2211 -1696 2819 8107 9367 8036
7415 8036 990 1036 2620 1345 906 -1739 -1175 -1190 -6486 -7549 -4962 -2771 3613 9530 8075 6948
7399 6948 2799 2085 8699 15060 10462 5492 5943 1913 4743 6501 7164 4139 8368 11965 3621 927
7383 927 4558 7806 4973 5892 5194 7035 5179 5310 9160 13327 10875 9683 8486 9759 10727 6647
7367 6647 13335 15509 11575 10230 12083 14406 14831 17565 29425 31020 26046 21106 23797 19058 16298
7352 16298 10190 5973 11677 10748 7758 8253 6217 2639 6073 6409 7464 10494 12462 10278 4127
7337 4127 5508 10383 10223 5957 6729 6304 9766 4907 -1503 0 4385 4684 6189 10817 12371 12501
7321 12501 15937 13359 13474 6601 -489 2355 -925 1099 3858 1853 283 -4136 -2356 44 4606
7306 4606 4460 1988 5579 9164 10965 4704 7 -4922 445 2487 6047 10355 12216 11143 6345
7291 6345 5187 4865 9662 15304 8109 4341 8080 10318 12434 20091 29200 22979 20917 17125 12329
7276 12329 6383 6904 6097 3600 7816 5888 6433 6122 -2247 -6514 -3500 4480 8283 6731 6057 1619
7260 1619 -4609 -3342 1212 1476 4804 522 -1014 1075 3470 7524 2240 5024 12577 12841 10411
7245 10411 8776 14714 18788 14290 3339 809 4251 1951 10875 14049 12938 10837 620 1322
7231 1322 5144 4712 5533 1768 3899 -1609 -7110 -5255 -928 -100 -688 -1057 6934 8830 1771 -5402
7215 -5402 -2293 -1938 -3578 -5766 -8663 -7561 -3825 -7220 -857 7785 8410 4318 3176 5092 732
7200 732 -2036 4820 6587 2974 651 7876 10192 7489 7596 3882 4632 2413 5211 12562 6475 -94
7184 -94 6047 12055 1544 -1182 -2985 2438 4875 5733 6486 1837 2903 2998 4953 9851 15561 14698
7168 14698 10618 7303 6564 7407 10546 6881 -811 -5733 -1262 -49 -732 4756 6881 6550 2797 182
7152 182 -2584 -2473 -7273 -7055 725 8392 7332 12839 8939 4256 5074 9265 10998 9804 2790 -1052
7136 -1052 8325 4200 -2419 -4511 -934 4140 4261 4264 17 -872 2447 4024 -272 1125 3317 3786
7120 3786 1085 135 -758 6288 9862 2702 14 -1608 -3057 -1918 1295 -3148 -7552 -9236 -4761
7105 -4761 128 6843 12008 12060 10570 12409 12248 5914 2437 989 -4010 288 3065 2463 -1568 -3750
7089 -3750 -4127 -2227 -5375 -1230 -949 -5495 -5391 -1124 2149 3133 -1846 -7474 -2999 2370 2840 6585
7073 6585 9144 3307 -2377 -2104 4388 9302 8256 1850 -9428 -11123 -7141 -5351 1432 5925 4943
7058 4943 128 -1612 1968 4298 1448 31 -1324 -1262 -9718 -4351 -553 3398 4910 3749 7959
7043 7959 6658 8167 8555 5022 -3209 -1573 2400 -4221 -6534 3937 10910 7786 7515 5509 -224
7028 -224 -559 4639 8950 12943 14252 9833 8320 10477 4530 2329 -1570 -4109 -7743 -654 4869
7013 4869 2746 -3629 -2067 2282 9110 11223 9275 1588 -854 331 1123 7572 6779 1910 4165
6998 4165 7233 9534 2644 -6814 -9386 -6767 -5071 -2459 115 2477 2835 1824 -1473 -6507 -8280
6983 -8280 -1974 3122 1864 -1318 2858 8152 7241 2156 -683 3269 8787 6794 6140 3665 -3855
6968 -3855 -10254 -10476 -4515 -4061 25 -70 -6056 -8581 -12336 -10779 -8934 162 5024 8738 3933 1124
6952 1124 4857 7868 6340 5912 -2855 -8953 -2057 -2311 -2092 1321 1577 -1211 -1024 -7397 -12011 -9353
6936 -9353 -10280 -4840 761 1351 -618 -2472 -927 -1044 -3800 -6871 -4191 -2035 -5016 -5048 -4995 -1306 1466
6919 1466 6853 8829 7193 647 -4811 -2806 -702 -1128 -79 2227 1846 3703 3893 2400 7707 5152
6903 5152 3267 7553 8711 10823 9553 5447 -1540 -6861 -14519 -12575 646 6320 3692 -507 1286
6888 1286 -718 -90 -3741 -3125 -716 -2421 -3774 -2339 -831 3216 4165 4237 5383 6560 8034 4049
6872 4049 -2521 -4364 -6412 -2281 -6594 -4021 1098 -1219 2397 2835 262 -4848 -7263 -7782 -8566 -7117
6856 -7117 -703 3750 -6025 -10584 -9696 -5139 257 738 4440 2146 -364 -2457 -1654 916 -22 -2372
6840 -2372 -1977 1638 -5544 -9945 -9015 -6481 -7541 -8241 -4808 -4185 -1238 2337 40 -2271 898 6261
6824 6261 3396 591 1297 2985 1137 3785 3725 2601 1644 -4729 -9325 -8672 -7095 -8991 -8772 2779
6808 2779 6052 7584 6349 -347 -6758 1275 2371 -5955 -8050 -11695 -13049 -6431 550 -1307 2344
6793 2344 5738 8155 4789 4195 6983 6937 2290 -3826 340 2047 1705 -3718 -4059 -5913 -4867 -5812
6777 -5812 -12443 -14078 -14706 -12204 -7962 -4049 -3483 3881 2684 4834 7674 5921 5576 12210 7016 1452
6761 1452 457 -1612 1462 20 5264 2839 166 -1029 1908 5138 1766 4425 -197 8456 13698
6746 13698 12216 3679 3932 13737 25852 32953 47038 61311 75469 82243 80545 78903 74315 64757
6732 64757 51016 34367 23972 24059 25648 18653 16324 21900 27308 17103 7023 12228 15300 16834
6718 16834 11770 11258 14040 19049 19679 22535 22830 22524 13306 5074 5496 8061 9238 6126 4199 909
6702 909 -1258 1526 4320 4763 2101 1913 -464 -3079 307 4442 7311 9629 2216 1397 -437 3713
6686 3713 7159 3223 2356 6748 9126 4986 2622 15284 12718 6683 -687 -9421 -5243 -706 1690
6671 1690 3697 2300 984 8173 8965 4912 1381 -299 3607 3958 -3440 -7218 -4351 1831 2023 1386
6655 1386 8208 16570 16348 15257 13190 8627 10798 10107 2757 3747 3250 3745 3818 512 -1248 -1684 -2180
6638 -2180 -2043 -7140 -156 -1955 -5184 4224 14671 17687 13547 11832 6107 -3008 -1558 -3561 -2370
6623 -2370 -477 -255 621 3549 1429 -1913 -9551 -6515 -1095 -1675 -4837 -5389 -9927 -3895 -1429 -2740
6607 -2740 -5676 -4421 -4970 -9706 -7368 -7446 -10176 -10488 -2045 11 -3696 -8462 -9591 -1530 514 181
6591 181 -5432 -8747 -3300 -2283 -10132 -11714 -10514 -12907 -13606 -10846 -9327 -2361 937 4425 7759
6576 7759 6554 -779 -11102 -11140 -6161 676 1357 2533 5862 3358 308 7883 3916 434 1300 1777
6560 1777 -3699 901 5558 5237 5763 2314 -3269 -3487 -3279 -15811 -18312 -10849 -12840 -15344 -16442 -16548
6544 -16548 -20178 -17480 -15095 -15188 -9425 -3961 -1637 306 4916 3364 815 -2039 443 5300 7543
6529 7543 6813 1898 -2582 460 1259 8819 6437 5251 -954 1842 3925 -1531 -661 5049 5754 730
6513 730 1555 -1581 -1649 -1481 1723 3171 3197 8025 4492 7018 9956 11427 7547 11513 9413 -549 -4857
6496 -4857 -4405 -7018 -4997 2029 2201 -1087 3425 6036 164 -6459 -6464 -4107 61 6945 435 5842
6480 5842 14031 12696 7213 8721 10243 5044 -2083 -2713 -5069 -3971 -482 1555 958 -1715 -5120
6465 -5120 -2469 -1862 -5866 -6387 -4011 -2175 -7383 -8684 -6539 -6784 -4918 -7042 -2416 5882 8517 3273
6449 3273 544 -6356 -9469 -8780 -3962 1200 1959 -2828 -2207 -4204 -2271 -51 3184 -1737 -1614 6
6433 6 -1830 -3491 -8991 629 11311 4209 -1574 -4491 1080 -1031 1151 -1 -5841 -11313 -5283
6418 -5283 223 -2263 -9826 -13908 -9754 -10149 -7821 -7233 -8241 -3068 155 2487 2785 6661 6747 -3243
6402 -3243 -9488 -3345 -3849 -3827 -346 -1238 -2659 -4137 -2148 14 3398 -2145 -656 999 -1579 -7978
6386 -7978 -14233 -15924 -7569 5304 8060 4546 6834 14348 16082 10118 3578 -2629 -8437 -1374 5646
6371 5646 7898 11546 6688 3041 -4793 -9650 -5790 2263 7053 3576 4321 2343 7564 835 -3669
6356 -3669 -1747 -2585 3976 9844 5155 -134 1226 1038 2459 8660 9005 3972 6403 -451 -2115 -2065
6340 -2065 -288 -648 1859 2276 3027 1914 -4615 -2556 208 6998 8259 3976 2842 560 973 2260
6324 2260 3043 2681 6686 4737 -2663 -6437 -3758 3657 7169 6555 4637 825 -3015 -2436 1379 529
6308 529 249 429 6148 6847 8298 9240 10022 12412 7798 2559 91 -5682 -11391 -13127 -8379 -9290 -9535
6291 -9535 -8992 -8916 -11430 -19922 -18838 -12861 -9101 -6798 -6557 -7729 -11749 -6931 -6174 -7524 -7259 -3121
6275 -3121 -7916 -7593 -8933 -9733 -6735 -5658 -8423 -8017 -4861 -2687 617 4955 5180 4506 -3251 -8336
6259 -8336 -13820 -20635 -18747 -11415 -3745 503 4346 4095 4145 3352 -49 -4849 -13005 -19772 -11911 -3632
6243 -3632 -5080 -6013 -4682 -4426 -3347 -1567 -3359 -592 -422 -6116 -5974 -10381 -15885 -12532 2722 3284
6227 3284 -210 -7805 -9418 -11072 -14292 -14504 -13406 -10047 -5761 -7851 -12499 -14497 -10323 -4827 -2324
6212 -2324 -925 629 3503 1986 -2284 3934 9806 7655 6689 3255 -5589 -7796 -2687 -1489 -3672
6197 -3672 -6478 -1650 -5286 -1016 -2202 -6679 -9939 -15064 -13645 -12067 -7212 -1300 1405 3734 -4151
6182 -4151 -11587 -4944 6267 12950 16259 13720 2165 -5493 -6120 -1695 2460 4187 6046 9958 12531
6167 12531 11612 8831 4763 -717 -4386 -8635 -9722 -11422 -5567 -2412 -3013 -9489 -12399 -7201 2928
6152 2928 11338 9752 7506 4828 758 -3499 -392 -4214 -11408 -7119 -4989 1093 8600 5735 2409
6137 2409 1939 -4550 -9358 -8920 -11473 -10738 -4677 -5724 -4199 -3308 -6169 -1393 -1471 -2992 -1321 -363 -2722
6120 -2722 -2382 2641 2520 -1326 -9181 -11640 -11953 -15682 -11629 -9627 -10079 -3490 892 6822 9532 10024
6104 10024 7086 3488 3649 3242 -2931 -9238 -2795 1370 -4576 -1389 1549 381 243 2740 4477
6089 4477 8769 6360 6470 7581 9012 11178 9039 -1435 3368 -1179 -3225 -3840 -10369 -15903 -11722
6074 -11722 -12369 -9816 -8808 -7061 -6025 -4994 -6964 -14179 -15591 -15406 -14188 -7771 963 -1950 -4033
6059 -4033 3441 6701 5774 2428 4351 -3656 289 -3213 -9853 -8896 -9107 -12045 -1481 1616 -252
6044 -252 -8176 -7799 -4490 -9158 -13335 -13668 -11048 -3502 -587 -3340 -5457 -6131 -7150 -4289 -2583 -7736
6028 -7736 -9345 -12144 -10606 -8374 -6993 -7687 -4796 -5161 -3244 -3549 -776 1239 -1518 -7886 -7763 1655
6012 1655 6758 6389 -640 -6866 -7468 -5804 -1596 -3804 -12674 -12872 -12917 -14501 -13910 -8344 422 580 -3011
5995 -3011 -12893 -11972 -6710 -4556 -6360 -1277 10308 14167 6826 2056 1047 513 -153 -1438 -9342
5980 -9342 -11927 -4836 847 -2814 -2518 -2966 -1163 -598 -7055 -9027 -12919 -12972 -8566 -11127 -14016 -10188
5964 -10188 -9151 -14060 -13982 -10530 -9303 -10851 -6779 -2918 3589 4665 3915 -1292 -6513 -9074 -8906 -2544
5948 -2544 -4610 -1727 5488 -2177 -6901 -7181 -2877 10382 15185 10939 655 922 377 2454 5283
5933 5283 6255 14075 14453 12846 10018 3120 5560 7324 747 -2908 5235 4003 -2720 -7960 -4553
5918 -4553 1028 1966 2439 -1086 -5717 -4231 -4419 -6534 -6855 -6586 -1214 2883 -6053 -11286 -7594 715
5902 715 2384 2835 2312 4651 4235 1227 -1224 -2412 -980 -3656 -1344 1902 -2014 -6977 -8976 -6552
5886 -6552 -6207 -6559 -13826 -16498 -5906 4670 6434 -432 -2802 -7942 -9311 -8063 -8098 -9612 -11490
5871 -11490 -5934 -3388 -5157 -9422 -9809 -898 -3756 -8644 -12366 -1242 87 1525 7726 6460 230
5856 230 4082 3368 -1555 439 -1120 -3340 -1996 1575 -838 -5120 -2246 -1630 -3373 2108 198 -2332
5840 -2332 -5391 -9562 -8428 -4841 -2158 -4822 1411 -6335 -13091 -3647 -21 1680 969 -1374 2414
5825 2414 -319 -556 4059 6684 5800 -905 -3119 -9932 -12788 -6726 -9497 -11307 -7910 -7490 -2305 -631
5809 -631 966 -1414 3424 -748 -268 -2018 -2648 -5110 -3016 12 593 -4436 -2294 -2463 -3901 -1075
5793 -1075 2262 -396 3636 1411 296 -4105 -4656 -7405 -10705 -7311 -5323 455 3943 -5084 -13591
5778 -13591 -7210 -984 -6297 -5814 -494 -1773 -8588 -9041 -8177 -5975 -7102 -7472 -2975 142 5802 12700
5762 12700 8545 2713 2470 -556 2094 -2782 -8483 -15776 -10727 -3967 -3597 -4458 -515 1354 1555 570
5746 570 795 8124 5663 4831 5357 1209 -7992 -6729 -6369 -7639 -2098 6966 9367 9744 10070 10893 7987
5729 7987 7499 -607 -9653 -13802 -8588 3488 2872 -1263 -6 2619 5610 4989 2132 -863 3731
5714 3731 258 -2649 -6856 -9697 -9297 -6825 -5476 -12664 -10330 -3723 -418 989 -3833 -4143 -3046
5699 -3046 -11719 -15466 -14668 -12323 -10489 -1960 155 -2632 -7247 -7345 -6845 -2160 -3413 -3523 -3000 -1270
5683 -1270 -1219 -2729 -1606 -6476 -7665 -7723 -7200 -8221 -13590 -14999 -13944 -14090 -12556 -13034 -7840 -2964 -855
5666 -855 -5671 -6559 -4675 973 352 1073 6 -5472 -2635 974 2797 4731 3151 -8722 -11943 -4132
5650 -4132 5295 7154 5473 1558 -1573 -5681 -5049 -2753 1742 -513 -758 -2442 -9225 -6162 -5518 -3256
5634 -3256 -3373 -8491 -7279 -9723 -12622 -11916 -8935 -13526 -17338 -17292 -11232 -16254 -11405 -4052 -7066 889
5618 889 3164 5231 5623 7396 9281 15934 14317 6879 1376 -934 -3044 -5013 -4935 -2453 -5388 -8460
5602 -8460 -2140 -5490 -10572 -12784 -10466 -14266 -8698 -4330 -339 5624 3012 -5057 -8774 -10732 -4037
5587 -4037 -4058 -4980 -4392 -7953 -9093 -9167 -8362 97 -663 -4181 2149 420 -1624 602 -1963 -6077 -8708
5570 -8708 -5631 1164 9817 6286 3990 5647 3206 2137 3936 5250 -6651 -9140 601 10614
5556 10614 8165 1157 4813 6094 -4680 -10982 -14632 -8457 -4424 -3798 -3579 -1556 -3445 -4875 -8626
5541 -8626 -14644 -11716 -11183 -10660 -5998 -8653 -9831 -11448 -7548 -1856 1096 -1494 -2968 3837 3235 2510
5525 2510 -868 -6294 -3016 -2838 -7827 -11226 -12739 -10100 -7822 -11482 -11781 -10957 -8613 -4113 1745 557
5509 557 -10597 -14559 -6971 344 4132 -4385 -8398 -9329 -11653 -10544 -9493 -9054 -13353 -11771 -6046
5494 -6046 -5918 -16794 -19751 -11012 -2746 -1747 -1522 1250 2071 2206 6551 3334 -9892 -10001 -3196 2792
5478 2792 3071 -5501 -10354 -6304 -2200 -1437 -678 -1325 -941 -2881 -2080 -2320 -4558 -5350 -7075 -4551 -562
5461 -562 -333 -1586 -3082 -1479 1748 7820 3337 -7345 -6887 909 306 -186 118 -51 -2495 -5107
5445 -5107 -10406 -7000 -4543 -3031 -1064 -3307 -13809 -13431 -8648 -8311 -11188 -9726 -3550 -373 3790
5430 3790 7254 5519 913 -400 -5813 -9808 -15030 -11308 -4528 -6382 -11195 -15536 -19577 -19077 -8132
5415 -8132 1472 2916 -730 1659 3911 3937 2569 -2073 -7692 -1551 2556 -506 -8813 -10703 -11532 -11302
5399 -11302 -6827 -8281 -8630 -5849 -2332 -1088 2976 -4686 -11954 -10694 -6739 -988 410 -1999 -936
5384 -936 -48 2795 3199 1966 -5233 -7410 -7807 -6182 -8483 -12407 -10464 -4833 -2336 2574 797 1123
5368 1123 -1246 3812 3094 8004 10793 4223 877 -68 3752 3933 -1967 -7154 -10101 -3763 676 2348
5352 2348 2609 -3402 -5463 -3629 3092 7515 4501 -1558 -7864 -11089 -8781 -4757 -7911 -9667 -5490
5337 -5490 -2286 -2851 -4258 -1670 2055 -3445 -7872 -2744 -1455 -1946 2139 3706 6965 4553 -2963
5322 -2963 -9192 -12226 -9320 -5019 -4326 3226 1856 1617 3243 1649 -6558 -9412 -5323 -5197 -10273 -10963
5306 -10963 -8538 -5029 -875 -50 4051 2930 2246 2663 -1772 -7446 -4850 -3901 -3092 -4837 -3838 1687
5290 1687 -3484 -9226 -4254 3001 6049 2885 -1077 -5411 -6028 -7719 -3521 4657 2934 -2079 -11241
5275 -11241 -15464 -10087 -4947 -73 4922 7263 2758 -3287 -4915 -7878 -2674 -3730 -1045 4824 7164
5260 7164 10884 10870 11416 4780 -845 -4639 1374 7377 -2635 -4888 -8173 -12471 -13771 -16276 -17883
5245 -17883 -19328 -20372 -13812 -14875 -14907 -11561 -15921 -16152 -17946 -11659 -9468 -14209 -14881 -15173 -12947 -10536
5229 -10536 -9700 -8925 -3757 2756 10473 6636 7796 3700 1261 4788 -7569 -12547 -18240 -15477 -10385
5214 -10385 -4123 -2380 2819 3572 -2431 135 4083 5868 6808 5125 -727 -6251 -5542 -4257 -4390 -5959
5198 -5959 -10682 -14822 -10997 -11119 -11065 -5741 -5520 -1593 670 -8312 -10724 -7716 -7556 -10529 -13334 -9364
5182 -9364 122 2758 741 -7575 -4352 -3614 -9840 -10674 -15993 -11142 -13753 -16142 -10485 -460 3841
5167 3841 -132 -3031 4162 6711 5900 -2400 -4278 -7351 -11931 -13604 -13898 -12973 -10222 -6102 -6299 -900
5151 -900 -926 -7641 -9511 -11493 -5472 -825 1214 1689 -409 3099 9077 10273 7291 1293 1076 -74
5135 -74 -1869 -4811 -4918 -4056 -4417 -3591 -3344 -4697 -3500 1059 6869 2510 -4962 -11521 -7980 -443 2599
5118 2599 6281 5890 4357 7981 7642 1030 -9096 -16554 -13455 -6954 -470 -227 3648 8978 10039
5103 10039 3058 7822 6612 4398 4909 4048 1077 1847 -2335 357 -1130 -2665 -4267 -10517 -14158
5088 -14158 -10816 -6640 -7387 -10056 -11946 -13197 -14689 -5976 340 5731 5999 6019 -245 -969 -2852 463
5072 463 6125 7448 6124 12866 14443 14532 9605 3635 -2829 -9644 -16417 -13856 -7145 3003 -5406
5057 -5406 -7323 -10068 -10743 -9219 -13873 -9203 -8565 -2943 -13 -6481 -10939 -7179 778 -2543 -8774
5042 -8774 -15008 -21733 -21729 -23677 -24696 -22458 -19838 -17319 -9636 -6995 -5738 -8504 -2461 2514 4618 3393
5026 3393 4321 -1937 -4526 -6261 -4007 -1870 2639 9225 5757 -2861 -1763 5422 9662 2913 -3800
5011 -3800 -3875 -713 5386 9944 13217 12776 17131 7884 7385 11501 6313 3692 12071 9909 2945 651
4995 651 -294 -3614 -4297 -2294 -8778 -10592 -6318 -7445 -11975 -18894 -12954 -5541 -2205 -1055 -1491 -2185
4979 -2185 -3367 -6151 -10737 -5173 1645 3338 1928 1588 -2992 -6753 -6811 -1467 -456 -3637 -3618 -2536
4963 -2536 -7602 -19487 -18085 -12696 -5949 -2758 -2295 -6221 -4174 -821 -415 -192 -739 982 514 -1421
4947 -1421 207 -2362 -11865 -11256 -3049 -5106 -7789 -3250 -2270 -4517 -7169 -4026 -1734 2890 4307
4932 4307 3002 3251 -929 -2854 -4466 -3110 -3251 -5442 -17854 -16601 -7869 -4717 97 3024 2888
4917 2888 3595 1101 2326 7148 6883 -1646 -13044 -9314 -5059 -10064 -1914 4006 2172 315 3520
4902 3520 4383 -4394 -104 -1614 2619 7102 10361 4041 -4606 -5835 1057 1938 1531 1821 -313 2787
4886 2787 -2951 -7808 -11483 -17138 -17382 -5558 3408 4076 3792 6008 10261 7319 8856 6712 5849 5611
4870 5611 3841 5073 -1797 791 4392 2521 -863 -9371 -7214 -3111 2960 1632 -1374 -4034 -2463
4855 -2463 -5501 -7529 -10931 -10113 -7766 -12408 -8586 -5088 -10526 -9798 -5048 -2479 2550 6986 5584
4840 5584 -1671 -2776 -4189 2068 671 1267 3623 5987 1582 73 1335 -332 63 1991 327
4825 327 -5489 -9388 -3679 2267 3632 5748 11557 8737 4731 10 -1304 8336 11926 7685 -3470
4810 -3470 -8034 -1799 -4391 -7615 -1780 3946 -2979 -12295 -17175 -12650 -9896 -11168 -11716 -11825 -11516 -10782
4794 -10782 -11891 -6072 -7510 -3728 -1781 243 1164 3282 5582 6589 -798 -2811 4597 6914 2229
4779 2229 -3106 -6697 -7517 -8554 -7938 -7159 -14186 -21660 -19140 -15816 -13413 -6181 -6260 -11032 -10600 -9158
4763 -9158 -9322 -3095 8256 10204 5370 -2919 -3308 -6092 -1202 -4026 -8782 -5873 894 -96 -6740
4748 -6740 -9749 -16685 -16132 -12741 -11251 -14741 -9156 -4206 3581 7197 2321 -6712 -4665 -7317 -9882
4733 -9882 -10602 -11617 -9960 -9577 -12738 -18079 -19447 -12883 -2130 -4387 -6711 -5718 -4721 -4648 -1358 6109
4717 6109 6596 5190 8703 13643 8604 4951 -1746 -5449 -6458 -1311 560 -3452 -6699 -3345 4275
4702 4275 -393 624 3419 -1588 -6687 -12319 -17132 -16094 -18620 -19332 -13996 -10162 -6317 -3093 -3168 -346
4686 -346 -535 1668 -484 -2858 -5457 -4905 -74 2100 120 -4180 -3792 6436 8970 5053 4343 6201
4670 6201 4997 -581 -3110 -5424 -7796 -10045 -2472 5988 6569 4016 -4279 -11693 -11655 -2861 1196 -1828
4654 -1828 -2012 511 -977 -2023 -1521 -6741 -7155 -589 1651 2086 4190 3581 -1721 -1794 3536 3504 1449
4637 1449 8237 6007 1969 4885 325 968 -3806 -3668 2436 1804 388 556 5472 6770 5456 -695
4621 -695 -4469 -7288 -10204 -8532 -1350 -1540 -7571 2747 11700 11224 -252 745 1082 -6380 -5536 -7814
4605 -7814 -4031 1408 1229 -3334 904 -3715 -9598 -6368 -3828 3614 6617 -445 -38 728 -5202 -12268
4589 -12268 -12427 -6019 -395 -470 -29 -6949 -9602 -10489 -4921 -6738 -5987 -4486 -8516 -10318 -7797 -14691
4573 -14691 -16461 -18394 -15908 -7120 -5961 -3864 -452 -3407 -7897 -9743 -9775 -3686 -720 -3127 -9593
4558 -9593 -8155 -5315 -6126 -8403 -17313 -19991 -20832 -17563 -11446 -8166 -6674 -5159 4003 15911 12437
4543 12437 4690 -993 -4798 -3243 4706 3110 -1287 -6898 -8507 -5147 -5975 -2894 2674 6958 6496
4528 6496 -1267 -9373 -2534 -820 -3467 -6416 -993 -1074 -801 791 2412 5644 6480 2023 -985 -4099
4512 -4099 -15526 -20006 -14674 -14752 -9426 -5548 -2376 -4641 -10660 -12767 -13863 -12185 -4927 -6072 -4969
4497 -4969 -4278 -989 -2738 -7451 -6624 -4107 -3416 -10952 -17497 -15560 -6031 -110 5937 6251 8589 10472
4481 10472 8766 9276 4707 232 -3613 -1971 -6 -1978 645 2778 3821 -1901 -5395 -6270 -5247
4466 -5247 -5107 -2752 -1620 4489 4907 917 1283 -1407 -502 -7315 -7053 -8383 -11716 -14939 -24243 -33011
4450 -33011 -24183 -17237 -4130 -714 -1783 -4166 3242 1105 11 99 -3644 -4598 382 5775 8025
4435 8025 7361 2276 2404 -1363 -3164 -4023 -1290 1031 -5965 -4742 -400 2522 4139 689 -3862 -3622
4419 -3622 1030 5239 7108 5472 9041 4518 7 3875 10004 4769 -9096 -10614 -5527 -2843 -618
4404 -618 3481 -2056 -7889 -5597 -1751 1655 -1409 1372 -1148 -1221 -5354 -11794 -14635 -12060 -11061 -12917
4388 -12917 -10888 -5709 -5731 -5626 -4160 -1461 -2817 -6862 -2043 -952 -3726 -11624 -4330 -6737 -5685
4373 -5685 -6591 -8294 -4703 167 126 -2670 -1636 756 -546 1185 1811 8296 12714 8110 3748 -2181
4357 -2181 -844 3038 3938 1028 -3742 549 5466 6805 8075 8941 5748 10876 3121 -9090 -9596
4342 -9596 -10160 -17764 -16069 -19845 -13716 -6656 -3132 -6989 -8846 -1192 681 -267 -2002 889 4123
4327 4123 403 -6148 -3892 716 -1308 -9579 -14286 -20052 -17272 -10976 -9841 -15462 -14800 -8559 -3582
4312 -3582 475 2077 -5395 -2501 8511 7279 1630 -9633 -6441 -920 -4316 -5827 -12347 -6212
4298 -6212 1050 -6292 -9535 -5249 -1822 -1349 3313 3271 6194 6128 5063 874 339 1814 1815 166 -6672
4281 -6672 -8556 -3412 -485 -1816 -7648 -6047 -3959 -5172 -2652 -127 -2397 -6182 -6615 5294 7528
4266 7528 945 -4273 -1677 -851 -1375 -8027 -11129 -3837 1507 -393 -7860 -15160 -13321 -4470 6230
4251 6230 8246 8510 6098 3429 -4084 -7646 -3938 158 5432 7492 7548 1510 -4230 -6663 -8567 -9560
4235 -9560 -11572 -5246 -508 350 -4697 -8901 -2853 -333 -4275 -8637 -2645 7668 6116 2789 2130
4220 2130 6669 10365 2132 -3776 -785 4445 7314 6745 838 -1537 -73 -237 -5040 -1637 5229
4205 5229 5219 5846 10360 6498 -982 -3994 832 5745 7272 9364 9923 7509 10655 11292 12934 9823
4189 9823 2966 -506 5659 6204 3192 -1959 -5752 134 3917 2659 5315 4866 -2182 -4297 -8485
4174 -8485 -6823 -3638 -2983 5114 2332 -1428 926 -884 4804 7617 8342 8931 10004 7143 10973 7192
4158 7192 -636 -69 -1071 3300 5529 -1925 933 -2026 -6393 -3413 -5841 -12297 -12067 -4478 674
4143 674 -5447 -3487 365 -3181 -3784 -687 1026 4005 1998 1079 4474 -707 -7070 -13145 -10978 1556
4127 1556 9703 6871 717 3012 3218 -2898 -13317 -20479 -20744 -14945 -5629 -976 -4164 -8325 -7196
4112 -7196 -8882 -10801 -14713 -12038 -14396 -12851 -9673 -5401 3264 15582 17379 13629 4874 -1676 -3029
4097 -3029 -5129 -2596 -3157 -2232 2273 -4849 -7279 -3811 -5476 -6223 -6875 -4760 -7640 -12992 -17092 -11047
4081 -11047 -10441 -4501 -1912 -924 -3329 -2115 5076 2479 2838 3199 -6560 -10007 -9482 -12235 -11225 -5412
4065 -5412 665 -127 3185 6739 1772 6191 9349 7579 3838 5373 4977 3727 5007 3819 4327 4608
4049 4608 -4035 -9912 -7430 -4412 -498 -2108 -4349 1326 -325 1297 -6242 -8673 -3942 -1959 -335
4034 -335 -4901 -7742 -9030 -3009 3244 2715 4328 10126 6866 6354 1433 -288 -2162 5606 9272 5157
4018 5157 2970 -2477 -9269 -8963 -8049 -5585 -3877 -7830 -10180 -13915 -11063 -4038 725 -714 2206
4003 2206 2840 -931 -10129 -10214 -6483 -4661 -4590 -11191 -11575 -9814 -12321 -10126 -3128 4379 8542 169
3987 169 -1564 2079 10885 8564 2835 -6655 -17878 -15443 -4951 -367 -1151 3388 -374 -837 -3883
3972 -3883 1765 3679 947 155 2679 4955 -1955 1210 1777 -5130 -4385 -6644 -5224 -4917 -4120 -3445
3956 -3445 542 8 2428 2075 -369 -2650 -3800 -4867 -1652 1533 -5271 -849 1381 -5390 -6121 -6926
3940 -6926 -4515 -5602 -5507 -5534 -8582 -6250 -3045 -4873 -5461 -1110 911 4128 5798 8433 1830 1968
3924 1968 1738 -4280 -3941 -3879 -3112 -3507 -3168 -7 4109 -2476 -9001 -7551 3718 5054 -5808 -3228
3908 -3228 -930 -1368 3304 1226 -6470 -6620 -798 7363 6608 7343 3670 5321 4552 7088 7944 5230
3892 5230 885 -9246 -14852 -12533 -13079 -9577 -12271 -12538 -10835 -7139 -6034 -4982 -6301 -6258 -9298 -11731
3876 -11731 -6208 -4982 -1494 2257 2873 -3584 -9615 -5692 856 7103 1832 2746 -273 -8477 -9519
3861 -9519 -2941 -1616 1824 8686 3891 2699 4821 161 -3742 -228 -2000 3508 7973 9062 1935
3846 1935 -6950 -5756 -2199 -5919 -7140 -3419 196 2712 5388 -23 -2473 -2611 -6448 -7094 -1373
3831 -1373 -1477 -1644 2349 5483 9320 12781 7296 -1729 -4100 -165 2346 10171 10450 8877 3013 -6296
3815 -6296 -4500 -401 580 1713 -871 1179 2963 7115 6478 2353 -742 -2969 -3377 -9440 -13880 -12428
3799 -12428 -10439 -8487 -8730 -9341 -8545 -6026 -4226 -8457 -12130 -9530 -9377 -81 9098 9596 9985 8323
3783 8323 1337 -2020 -4338 -1630 634 1614 4353 -254 -1841 2632 2319 1990 6906 5528 4740 9763
3767 9763 8865 1545 1361 3104 2796 -1307 -5798 -7321 -4095 -2488 -4558 -5572 1930 8647 6344 3044
3751 3044 6006 6160 2426 -1650 4611 6396 6669 651 -10103 -14542 -9394 -4658 -4198 -5805 -11479
3736 -11479 -11873 -6659 -1872 -3311 -3947 -3063 -3735 -4159 -2220 2635 1378 -784 1240 -140 -4537 -6148
3720 -6148 -9865 -4246 -1460 -896 319 -2767 -1129 -4096 -3238 2425 7027 10843 4756 6676 13225
3705 13225 10611 6642 7604 987 -7378 -3775 -6306 -11110 -5781 -6784 -11161 -5366 1245 5306 2467
3690 2467 671 -2355 -6977 -12745 -7988 -6635 -3086 -1461 849 3061 2337 1385 2924 4641 3008
3675 3008 -2618 -4625 -3810 -5324 -4257 -7270 -1539 5430 8750 3379 -1061 -4000 -11260 -4355 1914
3660 1914 3339 1714 776 -1598 -7144 -6266 -4593 -4943 -10623 -12584 -7362 -3815 4758 6832 5607 6671
3644 6671 6241 11031 7163 -2124 -1925 -2624 -6369 -3079 -3063 -8220 -12069 -8032 -5093 -2073 -9346 -11261
3628 -11261 -4504 -2600 -4173 -5959 -4793 -2259 -5905 -4969 -476 42 -10521 -11690 -5339 -6487 -6367
3613 -6367 -3862 -8577 -12759 -9616 -10227 -7727 -10138 -9331 -4270 -3996 -2285 670 3430 769 1910 2364
3597 2364 3150 5274 767 623 2700 3793 422 518 3587 2536 -1730 -1333 3705 4886 4462 1603
3581 1603 1545 3132 3770 -1278 2612 2905 679 798 851 736 -992 -2229 -2324 -1039 -1455 -2961 -3884 -1991
3563 -1991 -4864 -3981 383 -5492 -13837 -11846 -7093 -2036 922 1024 463 6541 10723 7084 -1748 2057
3547 2057 2336 924 3254 630 -4722 -5927 -2429 2914 -887 -1039 -1753 -7023 -1271 -659 -5349 -4228
3531 -4228 -3479 462 -2144 -1248 -6791 -4798 -6506 -6838 -4128 1837 -147 -3099 -7683 -12347 -8739 -4830
3515 -4830 -3459 -3428 -11289 -13429 -1813 4827 -944 -6215 -2275 -4815 -808 -529 1696 3323 -2133
3500 -2133 3562 9516 4917 -2095 3450 6449 5370 3216 -240 -3437 -4166 -559 6497 398 -3082
3485 -3082 -3620 -2589 2731 7280 2986 1375 -319 -4563 -10471 -8620 -4035 -1358 2579 4768 1219
3470 1219 3021 -4744 -5735 -931 1101 -2965 -6152 -6684 -7753 -11143 -13441 -4541 6132 10684 -5248
3455 -5248 -15376 -16434 -9454 -4186 32 -8975 -7195 -6644 -6817 -296 87 -158 -1332 -139 -1076 -1149
3439 -1149 -2744 2143 -7246 -12243 -14714 -13319 -9936 -11966 -12232 -13211 -13029 -12296 -11140 -4255 1232 7770
3423 7770 12841 6514 -1727 -2813 -5621 491 5499 4745 -347 -416 -798 -1027 -4998 -6953 -1581 8210
3407 8210 8959 9612 103 -1386 4662 4947 5961 7371 995 -2388 2592 2568 -1950 -6758 -7136 -10234
3391 -10234 -12196 -6108 712 -3257 -3173 1176 -1119 -7938 -4311 -1333 -3003 -4261 -956 2702 1032
3376 1032 -6492 -9495 -3582 6102 10725 7216 90 1442 5525 7331 3610 3202 1536 3083 3298
3361 3298 541 -2887 -6058 -5686 -7439 -6881 -4953 -6272 -2716 -292 2723 3042 -1357 -2484 -875 -3720
3345 -3720 -4702 -4919 -3989 -395 1578 -3010 -7251 -3268 189 -8653 -6620 -5544 -14329 -17736 -11953 -9921
3329 -9921 -6705 -4741 -2367 54 -8226 -7256 -2214 1119 1870 -246 4215 3464 -150 -3703 -6149 -2475
3313 -2475 283 -2181 -8314 -4160 545 6611 8440 1322 3243 -2074 -2585 640 4493 237 -6773
3298 -6773 -8257 -6407 5118 8194 5680 5826 2621 1307 2764 4918 3595 4028 -3626 -6441 -8388
3283 -8388 -2933 -7949 -9743 -5343 -7122 -10959 -12554 -10989 -9514 -9933 -15380 -15221 -10921 949 11022
3268 11022 14051 15447 11516 9660 3764 -6789 -10472 -2859 997 1491 3126 1833 -8315 -7844 -2443
3253 -2443 -6240 -12487 -9300 -5972 -10908 -6701 1691 3676 2696 3221 1382 -2655 1434 1289 2251 -4751
3237 -4751 -2411 -15 -4730 -8099 -4472 2253 3348 5198 3136 3462 2453 1294 -211 -1460 229
3222 229 2097 6955 204 -3622 941 7493 4183 3199 2203 -5074 -8072 -4438 -4806 -4578 892 -7295
3206 -7295 -1837 10520 18386 15749 10765 5029 5913 2004 -11447 -13748 -6431 -1979 -1353 697 13307
3191 13307 18423 18343 10208 8998 6342 6198 8585 9150 -6151 -7652 -8152 -7046 -1039 6477 4227 790
3175 790 2004 -840 -1103 4013 5149 1324 2038 5537 5589 8924 11891 5297 2018 -3980 608 3231
3159 3231 -3778 3007 3593 2801 1529 -2656 -11021 -12609 -5361 -5579 -7083 -7032 -4013 -1800 5437 2816
3143 2816 4099 3121 4510 -79 -3495 -1961 -7 -2442 -2505 -4993 -8275 -9967 -7467 -3863 -1756 -4140
3127 -4140 -7932 -4670 -670 1649 5008 3122 503 5883 8953 9061 5570 2212 6349 7742 7488
3112 7488 6593 2119 2377 -500 -1915 -867 3151 -2685 -3669 -3194 -4225 8560 10151 3618 -1735 692
3096 692 -4666 -6219 -3247 -2240 1865 6673 4027 4112 3044 -1076 -6788 -5494 -1638 -237 -2662 -3087
3080 -3087 -3265 -12045 -8001 -113 4204 3947 1651 -1719 4364 3355 2201 -862 961 -1765 -7424
3065 -7424 -15889 -9940 -9642 -12860 -12386 -7742 -3231 -2798 -6009 -2352 -127 -322 -1899 -5754 -8892 -5627
3049 -5627 -412 -456 2718 5432 2789 433 2275 6643 4735 -4244 -10826 -9270 -3825 47 3547
3034 3547 5281 869 -1649 -4986 -8496 -5988 -574 4649 2491 -3764 -9173 -12730 -8342 -9675 -2482
3019 -2482 4185 5478 4399 5721 8235 8502 9641 6616 4084 5754 6475 3379 4900 -4217 -1909
3004 -1909 3300 4903 -1588 -8096 -9505 1408 2020 -3261 -6832 -5044 277 4575 2395 -6256 -11188
2989 -11188 -10471 -4030 -2846 2811 -2653 -7567 -1208 2541 6345 5828 -156 -3539 4463 2494 -699
2974 -699 2632 -4830 -10898 -10535 -5560 1576 -30 -9015 -10088 -2534 3711 8001 6254 5531 4116 1505
2958 1505 -1153 -3808 -867 -1702 -3851 -4278 -2842 -2552 -1848 -3121 2211 7383 3852 3866 2772 129
2942 129 1174 3971 9478 2872 2551 11090 11422 6351 3236 3025 1740 -919 -7681 -12014 -6091 -4814
2926 -4814 -4067 2841 6092 4645 -1892 -4974 -1594 -1319 -2736 -2082 33 2439 -611 327 4670 -100
2910 -100 -2290 -2396 -747 -7659 -2459 3714 13120 8933 5182 5380 5237 2989 3059 2115 -7283 -9217 -4635
2893 -4635 -3226 -3490 -2025 -2800 -7305 -5769 -607 7471 14097 7824 817 -8286 -4943 -1853 -6425
2878 -6425 -3844 -12118 -18239 -12240 -5679 2774 3905 2771 1914 -3021 -2456 -1123 -1286 -3890 -1597 -2899
2862 -2899 -4215 745 -2707 1502 6008 388 -4544 1402 9866 7782 6060 10156 6051 4967 2523
2847 2523 2316 1269 5646 5524 8002 8681 978 -2229 1730 7841 11862 6295 1062 -1555 70 10454
2831 10454 9229 5932 3760 1635 4353 -33 -1554 -3786 -4254 -7831 -6929 -10088 -7383 -4902 408
2816 408 5903 5679 2947 4710 4629 6218 5400 1435 1254 2142 6409 6765 10068 6148 -5738 -8718 -5953
2799 -5953 -5375 -11944 -8260 -6210 -3818 -9817 -6933 -4716 2542 1631 4502 5201 2107 954 3519 5562
2783 5562 7617 11085 3224 -1658 -2210 -4903 3128 7688 4849 7130 6632 7741 16202 11489 2635
2768 2635 1262 -753 -1440 2248 -7368 -6727 634 918 -2323 -726 -998 -734 4263 3842 5160 3411
2752 3411 -443 2940 1258 -741 4500 1422 -7351 -4581 3211 1337 5344 210 1280 2918 -1360
2737 -1360 2584 993 -1303 3439 5328 1680 1179 9600 13788 7448 1514 -3892 -2264 4641 4548 9927
2721 9927 12988 9029 1788 -513 -1201 -2768 -3232 1746 5691 6207 4569 2574 1934 3589 7377 5586
2705 5586 4822 7556 9331 9005 8757 4460 1276 -155 -3633 2013 2927 733 -4550 -10178 -11941 -11618
2689 -11618 -8133 -3401 -1734 -3999 -509 -2085 -5418 -8497 -3220 707 3882 -1207 -6631 -5638 -1772
2674 -1772 -50 -999 64 -870 2153 3977 10247 12076 12489 10618 8571 9169 4520 2037 1429 4950
2658 4950 8891 6855 2104 883 2424 -2678 3189 12676 7481 1780 1134 -1090 4286 -1381 -1236
2643 -1236 -4050 -5333 -9675 -13747 -8432 -22 1633 3361 4526 2465 5158 5589 3816 -1296 -3541
2628 -3541 -3712 -3728 778 -916 5389 2097 1645 -6102 668 3642 411 57 193 677 -1078 -752 -3882
2611 -3882 -9664 -7300 -2307 3334 -3017 -3897 -3233 -3801 -5619 -460 4271 3341 12709 13128 3357 -3515
2595 -3515 1054 6149 9809 14611 11477 12461 16310 6989 -2357 4501 4789 2567 3888 2307 2140 636
2579 636 -3079 1203 3719 5040 4060 3851 1085 5291 4624 1198 1996 -4900 -8524 -7603 -5594 -9872
2563 -9872 -8527 -2750 4192 978 388 1644 -4187 -4549 -5870 653 2878 1573 -46 -3731 -2403
2548 -2403 4279 6368 1730 2142 7657 15733 15860 13878 4999 -2380 3176 1677 1265 4247 7822 3630
2532 3630 -1282 -2781 780 577 800 -503 3365 -988 -2844 -3494 1024 4126 2494 8857 7689 8244
2516 8244 4311 1150 -336 5818 5701 -926 3151 7947 9401 8730 5114 8923 6700 7175 1628 -3783
2500 -3783 -2239 582 803 3629 5361 7600 4604 -3482 -6953 -13648 -6504 -108 -3537 656 2608
2485 2608 887 -1575 -95 -1686 -3540 -1401 -4067 -4501 -6432 -6801 -8101 -7502 -8749 -9619 -9892 -3838
2469 -3838 -2785 -5607 -4888 -12138 -4653 2695 2232 -550 -3257 -7104 -10887 -8123 -3959 4844 5895
2454 5895 2207 1814 -53 -3838 -6319 -4615 -1501 2520 9283 4485 895 7981 12278 8972 9992
2439 9992 6690 2745 67 2264 5732 833 7299 5479 2480 7140 8166 1675 -940 -5701 -7143
2424 -7143 -7606 -9809 -6550 -10896 -12284 -13537 -14379 -10205 -5057 4891 5220 -1487 -9237 -3669 4319 1885
2408 1885 -905 -8897 -4980 -2238 -385 1449 -3685 -5344 -7027 -4182 -7993 -3366 1014 743 8227
2393 8227 8457 11039 9872 6639 3206 -6090 -5218 -202 312 -4182 -5417 -1079 4842 1828 1470 -585
2377 -585 986 -1868 -6614 -10821 -11407 -7231 -6562 -6132 2471 11195 5586 -6428 -3384 2660 5775 7748
2361 7748 7568 6108 -2368 -1788 1967 2656 7987 5566 -1089 -2115 -1067 -3350 -3379 -1174 -705 1303
2345 1303 870 -3125 6556 15355 12982 9138 12388 11486 7724 6696 -1120 -623 6061 8370 -1837
2330 -1837 -10989 -767 -590 -3022 2196 1942 -1290 -2631 -1790 -2172 -837 -1678 -1989 -2600 -5554 -8385
2314 -8385 -4965 3296 5881 10248 13917 3301 -1383 -3715 -7211 -4541 675 -1898 -3361 -5074 -5047
2299 -5047 -7459 -4690 1548 1712 -2287 -5429 -5387 -2105 3057 253 -572 11164 14205 11800 7384 6367
2283 6367 4292 1203 -2133 -4347 -3068 2856 7721 3493 -521 -147 1033 -2773 -439 460 279 -1776
2267 -1776 -5813 2408 13178 11435 17695 22682 14586 12865 14008 14852 2026 -76 2103 -1739 -2875
2252 -2875 2154 5772 9036 7687 818 1048 17 -882 -416 -6148 -6365 510 6717 13158 4765 -5627
2236 -5627 1007 1110 1117 2980 1866 1881 -929 -3133 -2064 -640 -2217 -5105 -1250 5339 6806 10494
2220 10494 14021 8588 3232 -4316 -4625 -5971 -10192 -4019 -2940 -3609 -3331 5371 14613 10086 3878
2205 3878 7044 1811 -109 1557 4983 5055 -897 -2701 215 2046 -867 -7246 -5741 5692 5418
2190 5418 4928 331 -8687 -5822 2325 -1319 -10332 -11691 -9299 -9794 -5131 1239 1100 -2672 -4379 -104
2174 -104 4455 -172 -7088 -7974 -4151 -2016 4949 7389 4832 -624 -6299 -13404 -14939 -10661 1091
2159 1091 8900 12188 12650 6457 3539 -1446 1834 2283 1640 165 9339 18040 14447 4518 1377 1788
2143 1788 4553 6759 7305 14504 10985 5741 1568 5512 1957 5238 1185 -5166 -7570 626 1361
2128 1361 1716 7117 7329 1145 -2702 -85 -856 -3653 178 3000 4965 3542 1354 -3132 -5832 -8858
2112 -8858 -10699 -12029 -8417 -14061 -7077 -101 3483 7449 8385 -738 -32 4656 5893 6008 5179 4253
2096 4253 13367 13204 9599 7861 8613 13701 12045 9976 7982 6974 9054 6110 3985 5107 8694
2081 8694 9673 7199 5931 4008 2984 754 4007 1827 6562 8808 7448 8262 230 1358 6089
2066 6089 2136 2627 4641 4167 2696 -4088 -5105 -1481 2203 -2143 -9106 -6386 -242 -676 -4985 -4305
2050 -4305 114 3787 -6524 -9041 -2325 1839 -823 -61 -3822 870 4319 1497 -3703 -6926 -8983
2035 -8983 -2968 1733 2640 2667 1517 -5127 -4705 -1422 4839 9015 5933 -4917 -4560 -2569 -2717 -4125
2019 -4125 -6550 -3742 1195 9718 9233 6318 9196 9270 9071 9132 11795 10732 11061 4036 -1513 375 3769
2002 3769 7566 9324 4748 6878 7119 6037 5368 2551 595 -570 4522 -1315 -6981 -5557 -3434
1987 -3434 1344 3714 1693 -3492 -5783 -3067 -4368 -5070 -5801 -5027 -4062 -7488 -5003 -3283 1221 2033
1971 2033 39 5444 9633 117 -5501 300 -2703 -5491 -7566 -10445 -16312 -7696 -2549 -6661 -6466
1956 -6466 -317 -301 -4543 -3015 -4177 2981 4429 1330 -3695 -12219 -13244 -8177 -62 4896 5814 3296
1940 3296 7725 3846 -3275 1121 -310 -1054 1328 3934 2379 201 2271 -357 -3846 -6305 -5210
1925 -5210 -9472 -7566 -2189 -640 -2075 -69 1529 7870 7239 5652 -1002 510 5663 5680 7242 10241
1909 10241 10479 11699 10420 11820 12324 11919 13932 12502 12350 8427 2772 -2122 -1032 -3393 -2128 661
1893 661 1454 -3236 -799 1089 -526 -5522 -4498 -2863 1033 1070 -1321 -140 2856 1784 636 9777
1877 9777 7434 -586 -2815 141 2557 6837 10286 8082 3719 585 1979 -1054 1724 2883 582
1862 582 -2386 -8229 -1455 -2124 -615 2970 4393 821 -5255 -8680 -7957 -9120 -5682 -8702 -10208 -5196
1846 -5196 4788 8679 13543 15661 14258 16300 12034 4182 -5963 -2050 6202 3453 1223 -1297 255
1831 255 -1098 -3503 -4536 -8918 -6896 1712 -3898 -4181 -7327 -5886 -974 -761 6151 2880 -1344 -3547
1815 -3547 -2800 -1910 948 -339 1639 1722 -655 4269 3065 -2235 -1571 4388 542 -1124 6036 15329
1799 15329 17017 2359 -1814 902 259 -1659 822 1325 61 -4630 -2405 6432 7334 -1975 -5939
1784 -5939 -3299 17 -3308 -4747 -1841 -2390 -1773 2684 1486 5860 4727 1722 1408 1791 4650 8683
1768 8683 3690 -1753 3534 7148 2563 -429 4260 15259 9848 4715 10911 10674 5110 -113 549
1753 549 -3140 -8987 -7965 -100 1847 -6741 -5851 186 -3599 -8362 -4259 5803 4851 746 1721 -1912
1737 -1912 -820 945 -4397 -15920 -16193 -7843 -1998 9015 13635 14031 12478 13354 10037 1482 81
1722 81 5128 5422 1698 -4425 -5260 -6170 -5894 679 1517 7572 9427 5669 7901 9409 7720 9009 4917
1705 4917 488 -1956 1951 1369 4254 11148 8932 -2044 -2641 7853 10345 12070 3344 -4373 -8673
1690 -8673 -5699 2757 -1020 -2902 4260 2450 2007 4886 1149 557 -3067 441 3276 7773 12051
1675 12051 16965 12988 5134 -1785 -4281 6334 13629 11032 3334 752 -223 5989 10035 4623 1418
1660 1418 -3796 -3716 -3485 -2300 -678 6133 4238 -2363 -5892 -4195 -720 3121 8007 4340 -356 4353
1644 4353 9105 7212 4106 1407 8366 8249 8920 658 -4911 -2899 -2617 -2040 -3568 -6708 -6032 -445
1628 -445 374 -2221 -2064 -3418 -8152 -10608 -8874 -6273 -4710 -618 8581 12286 7938 1893 1898 844
1612 844 -1736 1780 4090 2406 1070 5642 8362 6188 5636 2680 3939 8849 9766 9040 11580 11630
1596 11630 6389 2066 2511 2017 3088 2564 3300 2006 7053 6068 2836 2619 2184 4118 7087 1740
1580 1740 347 7133 10546 8205 2287 4053 223 -1398 -3906 -759 -4248 -8908 -4272 8380 11321
1565 11321 11709 7989 1388 4982 2170 406 7972 4316 9295 11407 10236 1305 168 6314 2126
1550 2126 2085 5140 1761 -103 -1632 -7180 -4179 16 2501 1724 -6701 -9906 -8163 -12276 -8815 -2944
1534 -2944 3836 2590 5069 7398 6894 5385 3896 3451 7319 8577 9235 2909 -3974 -4616 -455 4699
1518 4699 3004 2095 -981 -2734 -1229 216 -4243 -8413 -8059 349 -3037 -5752 -6847 -10937 -5001
1503 -5001 1058 -3268 -6208 -3136 -1576 -53 1318 266 63 3440 9012 9347 1690 4523 7697
1488 7697 8495 4018 -2785 -7682 -2654 -2490 -4666 -6985 -6622 1774 4132 3085 2754 -2170 3748 4680
1472 4680 12444 7597 3567 4953 -712 602 5901 4101 502 -59 1584 3740 2239 3026 -2053
1457 -2053 685 -1665 -2095 -1552 -2474 -2400 -4606 -5475 282 913 899 -1397 -1663 -6415 -10074 -8701 -3107
1440 -3107 1200 -3219 822 5837 -1794 4704 5393 4094 2625 4011 6832 6595 4627 458 -1246
1425 -1246 711 1615 3701 10309 16178 10576 2710 7557 6401 4466 928 2666 3697 6863 16617
1410 16617 19484 22082 18006 11223 12464 10368 11339 11676 12911 10168 6996 7153 1815 2130 3584 10141
1394 10141 6197 3535 1851 -4222 -2950 3138 -3708 -8148 -642 -4665 -3474 22 2267 11058 7229
1379 7229 -830 -2206 -11476 -11304 -3935 424 3271 5653 2216 3794 -221 975 5303 -1123 2664
1364 2664 7735 3147 -6641 -7557 -4376 1016 83 -4202 -5953 -4247 3024 3533 5306 15002 18492 22716
1348 22716 21171 18545 13341 2815 -3867 -3785 -5528 -11052 -9771 -3042 -127 -7040 -7907 -8087 -147
1333 -147 8040 7699 8748 16932 16103 11750 6196 8328 5137 1718 -6534 -5444 -5858 -11211 -9381 -5236
1317 -5236 -930 -4198 -5154 -447 4970 4369 2233 8769 6368 1090 -4334 -2394 -545 -2105 -247
1302 -247 4814 12322 8505 -724 -5042 -641 6269 5313 3576 2466 -5349 -12849 -8727 -3078 -4688
1287 -4688 391 6957 4802 2883 3373 2533 668 2255 359 6102 13671 9952 8893 5027 2142
1272 2142 7957 13218 4524 322 -57 -411 1643 7983 10749 6363 7644 8992 10126 12594 7488
1257 7488 -1119 -6753 -10436 -11267 -6677 -404 -1832 -991 2340 9843 7540 -4130 -8441 -10147 -10146 -6712
1241 -6712 -5143 -4024 -7399 -11245 -14967 -8684 -1842 891 -4746 -13282 -11414 -2597 4400 5264 5318 4306
1225 4306 4007 4334 115 2589 1898 -3747 -6320 -94 9568 9869 10268 7806 5057 2146 6981 12418
1209 12418 13391 10297 4053 465 484 5219 6369 9468 5400 2409 4740 4391 5532 3527 -2028 -5155
1193 -5155 4688 2514 1849 10392 10854 5833 5197 4721 6365 5502 -2525 -2971 -949 2607 3271 -334 -4344
1176 -4344 -3314 -696 -2144 -4233 -2254 -3307 -2004 -7912 -6879 -7470 -7801 -4959 -2025 -2565 303 6367
1160 6367 8906 9548 6972 2867 1545 -1131 698 1400 -6306 -7398 -9927 -7206 253 4618 3499
1145 3499 4604 2946 6693 10139 7060 2118 864 3266 9537 4654 5345 12207 16685 13095 15428
1130 15428 9532 4357 992 -3284 -1027 1397 3376 6332 8323 4309 3749 3537 4291 -1878 -321
1115 -321 2880 -2521 1190 -190 -8866 -13452 -16237 -16666 -9975 -6736 -5963 -1358 -1559 -7192 -8051 -5331
1099 -5331 721 2315 -2173 -29 2496 -1142 2367 2037 -3133 -997 -5250 3561 9948 6359 510
1084 510 4201 9273 4590 689 3569 2559 2111 5165 13055 11792 10475 17267 21723 14532 2293
$$ [...]
##END NTUPLES=NMR SPECTRUM
##END=
