##TITLE=Analysis number 319887
Compound Code cc 48909
Book Reference 468/77
Project Code adrs
Chemist Name colinb
##JCAMPDX= 6.0         $$ Bruker NMR JCAMP-DX V2.0
##DATA TYPE= NMR SPECTRUM
##DATA CLASS= NTUPLES
##ORIGIN= Bruker BioSpin GmbH
##OWNER= nmr
$$ XWIN-NMR		Version 3.5
$$ Thu Jun  1 14:11:44 2006 GMT Daylight Time (UT+1h)  MAYBRIDGE\nmr@NMR_250MHZ
##.OBSERVE FREQUENCY= 250.131544655141
##.OBSERVE NUCLEUS= ^1H
##.ACQUISITION MODE= SIMULTANEOUS (DQD)
##.ACQUISITION SCHEME= undefined
##.AVERAGES= 16
##.DIGITISER RES= 18
##SPECTROMETER/DATA SYSTEM= dpx250
##.PULSE SEQUENCE= zg30
##.SOLVENT NAME= CDCl3
##.SHIFT REFERENCE= (INTERNAL, CDCl3, 0, 16.522)
##AUDIT TRAIL= $$ (NUMBER, WHEN, WHO, WHERE, WHAT)
$$ ##TITLE= Audit trail, XWIN-NMR		Version 3.5
$$ ##JCAMPDX= 5.01
$$ ##ORIGIN= Bruker BioSpin GmbH
$$ ##OWNER= nmr
$$ C:\u/data/dgb/nmr/ADRS/150/pdata/1/auditp.txt
$$ ##AUDIT TRAIL=  $$ (NUMBER, WHEN, WHO, WHERE, WHAT)
(   1,<2006-06-01 14:11:20.36 +100>,<MAYBRIDGE\nmr>,<NMR_250MHZ>,
      <created by zg, POWCHK disabled, PULCHK disabled
       configuration hash MD5:
       E2 DF 36 D8 04 B2 41 60 5A D7 A3 38 5A 4B D0 FE
       data hash MD5: 64K
       32 C0 30 42 38 E2 62 4B 8C BF C5 08 44 A5 A5 5B>)
(   2,<2006-06-01 14:11:33.58 +100>,<MAYBRIDGE\nmr>,<NMR_250MHZ>,
      <Start of raw data processing
       ef LB = 0.3 FT_mod = 6 PKNL = 1 SI = 32K 
       data hash MD5: 32K
       53 16 FE B3 40 EF AB 3A 60 75 4B 8A 8F A3 EE 27>)
(   3,<2006-06-01 14:11:35.22 +100>,<MAYBRIDGE\nmr>,<NMR_250MHZ>,
      <apk 
       data hash MD5: 32K
       C6 D1 19 8B 62 BF 38 41 FD 7E 54 9D B4 09 CE 8B>)
(   4,<2006-06-01 14:11:36.21 +100>,<MAYBRIDGE\nmr>,<NMR_250MHZ>,
      <abs ABSG = 5 
       data hash MD5: 32K
       B2 FA 56 06 9A 25 1E E7 A7 93 17 A5 26 A0 49 C6>)
$$ ##END=
$$ 
$$ hash MD5
$$ A9 C5 76 3A 7B 0F 11 C4 01 D3 38 A0 64 B4 8D C3
##$RELAX= 
##$RELAX= 
##$RELAX= 
##$RELAX= 
##$RELAX= 
##$RELAX= 
##$RELAX= 
$$ Bruker specific parameters
$$ --------------------------
##$DU= <C:\u>
##$EXPNO= 150
##$NAME= <ADRS>
##$PROCNO= 1
##$TYPE= <nmr>
##$USER= <dgb>
##$AMP= (0..31)
100 100 100 100 100 100 100 100 100 100 100 100 100 100 100 100 100 100 
100 100 100 100 100 100 100 100 100 100 100 100 100 100 
##$AQSEQ= 0
##$AQ_mod= 3
##$AUNM= <au_zg>
##$AUTOPOS= <33 >
##$BF1= 250.13
##$BF2= 250.13
##$BF3= 250.13
##$BF4= 250.13
##$BF5= 500.13
##$BF6= 500.13
##$BF7= 500.13
##$BF8= 500.13
##$BYTORDA= 1
##$CFDGTYP= 0
##$CFRGTYP= 5
##$CHEMSTR= <none>
##$CNST= (0..31)
1 1 145 1 1 1 1 1 1 1 1 1 1 1 1 1 1 1 1 1 1 1 1 1 1 1 1 1 1 1 1 1 
##$CPDPRG= <>
##$CPDPRG1= <>
##$CPDPRG2= <>
##$CPDPRG3= <>
##$CPDPRG4= <mlev>
##$CPDPRG5= <mlev>
##$CPDPRG6= <mlev>
##$CPDPRG7= <mlev>
##$CPDPRG8= <mlev>
##$CPDPRGB= <>
##$CPDPRGT= <>
##$D= (0..31)
0 1 0 0 0 0 0 0 0 0.06 0 0 0 0 0 0 0.0002 0 0 0 0 0 0 0 0 0 0 0 0 0 0 
0 
##$DATE= 1149167478
##$DBL= (0..7)
120 120 120 120 120 120 120 120 
##$DBP= (0..7)
150 150 150 150 150 150 150 150 
##$DBP07= 0
##$DBPNAM0= <>
##$DBPNAM1= <>
$$ [...]
##$SUBNAM7= <"">
##$SUBNAM8= <"">
##$SUBNAM9= <"">
##$SW= 20.6930455092707
##$SWIBOX= (0..15)
0 0 3 0 0 0 0 0 0 0 0 0 0 0 0 0 
##$SW_h= 5175.983436853
##$TD= 65536
##$TD0= 1
##$TE= 295.16
##$TE2= 300
##$TE3= 300
##$TEG= 300
##$TL= (0..7)
0 120 120 120 120 120 120 120 
##$TP= (0..7)
150 150 150 150 150 150 150 150 
##$TP07= 0
##$TPNAME0= <>
##$TPNAME1= <>
##$TPNAME2= <>
##$TPNAME3= <>
##$TPNAME4= <>
##$TPNAME5= <>
##$TPNAME6= <>
##$TPNAME7= <>
##$TPOAL= (0..7)
0.5 0.5 0.5 0.5 0.5 0.5 0.5 0.5 
##$TPOFFS= (0..7)
0 0 0 0 0 0 0 0 
##$TUNHIN= 0
##$TUNHOUT= 0
##$TUNXOUT= 0
##$USERA1= <user>
##$USERA2= <user>
##$USERA3= <user>
##$USERA4= <user>
##$USERA5= <user>
##$V9= 5
##$VALIST= <valist>
##$VCLIST= <CCCCCCCCCCCCCCC>
##$VD= 0
##$VDLIST= <DDDDDDDDDDDDDDD>
##$VPLIST= <PPPPPPPPPPPPPPP>
##$VTLIST= <TTTTTTTTTTTTTTT>
##$WBST= 1024
##$WBSW= 4
##$XGAIN= (0..3)
0 0 0 0 
##$XL= 0
##$YL= 0
##$YMAX_a= 463120
##$YMIN_a= -557879
##$ZGOPTNS= <>
##$ZL1= 120
##$ZL2= 120
##$ZL3= 120
##$ZL4= 120
##$ABSF1= 16.522
##$ABSF2= -4.171173
##$ABSG= 5
##$ABSL= 3
##$ALPHA= 0
##$AQORDER= 0
##$ASSFAC= 0
##$ASSFACI= 0
##$ASSFACX= 0
##$ASSWID= 0
##$AUNMP= <proc_1d>
##$AZFE= 0.1
##$AZFW= 0.1
##$BCFW= 0
##$BC_mod= 0
##$BYTORDP= 0
##$COROFFS= 0
##$CY= 12.5
##$DATMOD= 1
##$DC= 0
##$DFILT= <>
##$DTYPP= 0
##$F1P= 14.0000005364418
##$F2P= -0.99999901652339
##$FCOR= 0.5
##$FTSIZE= 32768
##$FT_mod= 6
##$GAMMA= 0
##$GB= 0
##$INTBC= 1
##$INTSCL= 1
##$ISEN= 128
##$LB= 0.3
##$LEV0= 0
##$LPBIN= 0
##$MAXI= 10000
##$MC2= 0
##$MEAN= 0
##$ME_mod= 0
##$MI= 0
##$NCOEF= 0
##$NC_proc= -5
##$NLEV= 6
##$NOISF1= 0
##$NOISF2= 0
##$NSP= 0
##$NTH_PI= 0
##$NZP= 0
##$OFFSET= 16.522
##$PC= 1
##$PHC0= 168.0992
##$PHC1= 9.210179
##$PH_mod= 1
##$PKNL= yes
##$PPARMOD= 0
##$PSCAL= 4
##$PSIGN= 0
##$REVERSE= no
##$SF= 250.13
##$SI= 32768
##$SIGF1= 0
##$SIGF2= 0
##$SINO= 400
##$SIOLD= 32768
##$SREGLST= <1H.CDCl3>
##$SSB= 0
##$STSI= 32768
##$STSR= 0
##$SW_p= 5175.98343685301
##$SYMM= 0
##$S_DEV= 0
##$TDeff= 65536
##$TDoff= 0
##$TI= <Analysis number 999999
Compound Code 99
Book Reference 9
Project Code 9>
##$TILT= no
##$TM1= 0
##$TM2= 0
##$TOPLEV= 0
##$USERP1= <user>
##$USERP2= <user>
##$USERP3= <user>
##$USERP4= <user>
##$USERP5= <user>
##$WDW= 1
##$XDIM= 32768
##$YMAX_p= 396202929
##$YMIN_p= -890537
$$ End of Bruker specific parameters
$$ ---------------------------------
##NTUPLES= NMR SPECTRUM
##VAR_NAME=  FREQUENCY,     SPECTRUM/REAL,   SPECTRUM/IMAG
##SYMBOL=    X,             R,               I
##VAR_TYPE=  INDEPENDENT,   DEPENDENT,       DEPENDENT
##VAR_FORM=  AFFN,          ASDF,            ASDF
##VAR_DIM=   32768,         32768,           32768
##UNITS=     HZ,            ARBITRARY UNITS, ARBITRARY UNITS
##FACTOR=    0.157963299565203, 1,           1
##FIRST=     4132.6476996994, 0,             0
##LAST=      -1043.33573715361, 0,           0
##MIN=       -1043.33573715361, -890537,     0
##MAX=       4132.6476996994, 396202929,     0
$$ Real data points
##PAGE= N=1
##DATA TABLE= (X++(R..R)), XYDATA
$$ [...]
23075d5346J04248l2079l1771J9958n198j37982r206K1541J29215J11577j29139
23064d182q3228q7707N0053O6314n7376K7609Q2761J03718J9373n0376K2090p0637
23052A8412r2585R0181P3421L227K417j05401L2360L0394L5910L7070q7172p9649
23040d1415K6711k0823K2822m7511J68658J54574j01821L1659m3381j87711m6033
23029h4271j7206j5490j4293M7566J28741Q0120L5937Q5504j993j21671r8840
23018B4104r216m4625j49697J04593L3972m1627R917L5844j21088j2078J19900
23007e0001J40773j27409n3008R6876L2233J6930O034R4394n809M893j09795m2148
22995C963O5971p1094Q7239P4217o1752k14292j93215K8254K16846k819M9581
$$ y = [-45346, 58902, 26823, -4948, 15010, 9812, -128170, -137376, -115835, 13380, 124957, -4182, -87410, -175117, -125064, -58750, -116126, -88517, -5756, 97962, 117335, 66959, 89049, 18412, -74173, 16008, 89429, 92656, 95073, -10328, 22032, 52426, 88336, 125406, 38234, -41415, -14704, -35527, -12705, -60216, 108442, 263016, 161195, 192854, 149473, -38238, -84271, -101477, -116967, -131260, -83694, 45047, 125167, 161104, 246608, 244615, 122944, 24104, 14888, -29737, -179434, -74841, -40869, -82496, -72579, -36735, -157823, -169901, -50001, 90772, -36637, -89645, 7231, 39464, 56394, 62428, 156822, 151013, 155906, 46111, 3963, 69934, -1160, 86079, 160296, 98544, -115748, -308963, -280709, -63863, -66682, -17101]
22984a7101j740p2316L7077J02760n9990j5832m5600j514Q5141K0569R3286j879
22972A22861j3046n9897N4880o0155m0749p7968o2896J1881k3432R7210p2577
22961a23888p8803J40294J17680j9039j1883k8344n2937n7781q2271j2616P0566
22950a39022O8270J21240J967j34354M4466P6218R0971k0895j53230m3839L9902
22939d8306O7490R186l1898j12057m946K2108M6651J66454R9480J57817n888o8475
22927B97616k04927q9562r9988N4810M7963O9298N438L9472j3723j02338m475
22916d16M1837j31378r2466q320J07136J38706l2034J12776j4022r649P791n5336
22904F4625q4035l247M104o1393J6869l9761P0091J41656j36071o5540m6182o4178
$$ y = [-17101, -18841, -91157, -54080, 48680, -11310, -27142, -72742, -74256, 10885, 31454, 124740, 122861, 109815, 49918, 104798, 44643, 3894, -74074, -136970, -125089, -148521, -51311, -123888, -202691, -62397, 55283, 36244, 24361, -3983, -56920, -114701, -196972, -209588, -139022, -70752, 50488, 52455, -81899, -37433, 38785, 129756, 108861, -44369, -88208, -48306, 19184, 28370, -3528, -115585, -120531, -98423, -51772, 114682, 214162, 371979, 366091, 297616, 92689, 3127, -96861, -42051, 5912, 75210, 80648, 120120, 106397, 4059, -416, 41421, -89957, -182423, -190743, -83607, 55099, 23065, 135841, 121819, 112170, 119961, 64625, -19410, -22657, -18553, -79946, -63077, -102838, -32747, 108909, -27162, -92702, -138884, -203062]
22892b03062K8846q907m3273l3951J03770K12386M816j40476k6854n8047J32114
22881c2638P0602j9971K7333K9392p8839Q625k1605p8828M6168J09603K8357L9792
22869A27991N2133j06084j03616k7771J3119p241n4381l5887q023L8594O5005
22858d6161J0414J6086k2856J1733K2756P6911R8183m320o3321L7365j00339n9052
22846b2601l008Q7281R8443j33036j37635N5889Q2348m0834j06969o6015j5992
22835b02129J21857O9758R0640N1774j21715l0023J26476m9283l5509n6188p5686
22824a10028r2068O2559O5308j18372R568J58128J09580j0655K0999j7898j16684
22813c9563l2107j04372O3807o327k3478N1320R8951O8139N0558n83n7792K6555
$$ y = [-203062, -174216, -183123, -226396, -260347, -156577, 55809, 60625, -79851, -106705, -164752, -32638, 37964, 17993, 45326, 74718, -4121, 4504, -17101, -95929, -49761, 59842, 88199, 127991, 180124, 74040, -29576, -57347, -44228, -51469, -105850, -141737, -149760, -111166, -46161, -35747, -19661, -42517, -30784, -8028, 68883, 167066, 162746, 99425, 136790, 36451, -22601, -25609, 61672, 160115, 27079, -110556, -54667, 27681, -13153, -120122, -186137, -202129, -80272, -10514, 80126, 131900, 10185, -19838, 106638, 57355, 21846, -34342, -110028, -202096, -139537, -74229, -192601, -183033, -24905, 84675, 74020, 95019, 77121, -39563, -71670, -176042, -112235, -118562, -142040, -90720, 8231, 76370, 126928, 126345, 68553, 95108]
22801I5108l0135q0910k003K0047R0431j44024p4448N0069Q1064k2557P4854j973
22789E5523r530n4488m6548L1289R1312o2775p2683j23795O2899O0612m2075o0561
22777a70820N4103P2038J3455m5350N6707p8111l6757m4535M1018P7618J47004
22766H6370m8465L3796n8930r8908r0129J58152J07376o2464K3108j3132r5432
22755e8658k9195n2845J24600L2299j29204l9869O8002J00254L3343Q0528R1881
22744B21136J01132j11265n4117n8127K5015k540p9437j22495j21095n5784N9363
22733a98214J20425o9949O5987N8327M8573l1678J1632j6556K8474N4618R3970
22722A65609r9900j46740r2088r2851R1425Q9454Q0566m7286P9510R9864m1792
$$ y = [95108, 64973, -15937, -17940, 2107, 92538, -51486, -125934, -75865, 5199, -17358, 57496, 55523, 45993, -8495, -55043, -23754, 67558, 4783, -67900, -191695, -128796, -68184, -110259, -170820, -116717, -44679, -31224, -76574, -19867, -97978, -134735, -179270, -138252, -60634, 86370, 37905, 71701, 12771, -86137, -176266, -18114, 89262, 26798, 49906, 36774, -58658, -87853, -140698, -16098, 16201, -113003, -152872, -84870, 15384, 48727, 129255, 221136, 322268, 211003, 156886, 98759, 123774, 121234, 41797, -80698, -201793, -257577, -198214, -77789, -147738, -81751, -23424, 25149, -6529, 5103, -11453, 17021, 71639, 165609, 65709, -81031, -173119, -265970, -174545, -85091, -4525, -51811, 27699, 127563, 85771]
22711H5771j16618m8815J01766K1883J29062P463o4342j00496p6829j38972P3064
22700a27063k1773K2710N6201J02584J1635K5194j26690j42314L3636J87263j71762
22689a50379m5973Q0350R1091O6231j9472q4362o6881M7834l4724o649n70R5372
22677b8132J54883o3364K2477j32784J9241L2378l915M003Q4230k5217j36120
22666g2320j9122N7986l5392j8694L7961r564O859l8361n6119J87933Q3125j52468
22654b8176j26038J45745J27247L6993O3274R137j13300m8347J2421p3019k8660
22643b2723q4519j19618J08578M1550L3604J2947q626k1710J17938J10025M3334
22632B10780l6021p1675j17251j6516l070R1542J47904p3341n4009p7727j19296
$$ y = [85771, -30847, -79662, 22104, 43987, 173049, 180512, 116170, 15674, -61155, -200127, -127063, -148836, -126126, -69925, 32659, 44294, 69488, -57202, -199516, -165880, 21383, -150379, -196352, -116002, -24911, 41320, 21848, -62514, -129395, -81561, -116285, -122934, -123504, -28132, 126751, 63387, 85864, -46920, -27679, 4699, 784, 4787, 89017, 63800, -72320, -91442, -33456, -68848, -87542, -49581, -59145, -52286, -90647, -146766, 41167, 124292, -28176, -154214, -8469, 118778, 155771, 219045, 228182, 114882, 66535, 78956, 5937, -22723, -107242, -226860, -118282, -76732, -43128, -30181, -38807, -60517, 57421, 167446, 210780, 174759, 103084, -14167, -30683, -33753, 57789, 205693, 132352, 78343, 616, -118680]
22621a18680p6665J57597q951j41593P134M8825M0660J69574J63964j3015o3147
22610A65703j58151k9530K8579n2673q9672L633K0693J92111J69486r295m9931
22599A90953r4778m7828r478L6639n396Q6432Q920j19539p4533Q988M1901K7934
22587E0215J44948N0940m0360o0298p1256r9131q2546J03341J40744r3741n9518
22576a6662m0144j51065l9757L0948J67916J68960K4938j2438j29669o4064K9156
22565c1881O8608M7473j35881j23028n769Q2577J20215O9753k9903M7469L2870
22554A42503r3910q2625R4069m4535l0778M282J7775l239m6954Q0226k8440j09364
22542a00990n0503j02834j4136O2457l0908o6306J17790O4555O7462L9268L2815
$$ y = [-118680, -195345, -37748, -46699, -188292, -181158, -132333, -91673, 77901, 241865, 228850, 165703, 7552, -21978, 6601, -46072, -135744, -132111, -111418, 80693, 250179, 240884, 190953, 96175, 48347, 38869, 75508, 70112, 156544, 165464, 45925, -28608, -19620, 22281, 50215, 195163, 246103, 205743, 145445, 74189, -24942, -107488, -4147, 136597, 42856, -16662, -56806, -207871, -247628, -216680, -48764, 120196, 145134, 132696, 3027, -61037, -31881, 36727, 84200, -51681, -174709, -180478, -97901, 22314, 92067, 62164, 109633, 142503, 48593, -34032, 60037, 15502, -15276, -10994, 6781, 3542, -43412, 36814, 8374, -100990, -151493, -254327, -268463, -206006, -236914, -303220, -185430, -120875, -53413, -14145, 18670]
22531A8670Q554o9946j12090K4267L2289j4084Q0075L8099m1883K37o2387L955
22519i4244M113J40860r2065k1625k6460P0975j9597p2635m8422J43323J22286
22508A06509R3498k9681Q32p8387k4233n500J2697r683j80948n5326N7230O7918
22496d5074J31891L3810k4380L5210j03879j62672J6789k59L8304j09942L3624
22485a56578J76843J39580K0748o8782L62r3088L6895J77824j41926j63501m4311
22474a15934j5626K8898Q0205J39610p368j9501o5310q3084l9079j7742P9793
22463c5138k3629M2543J6684n0846P6540K9568n2996l7140k7131M280L3466m7508
22451g1307L7907n9130K7841J31707j2500K6325M9993n1167o9804n6461j35400
$$ y = [18670, 27224, -42722, -154812, -130545, -98256, -112340, -32265, 5834, -36049, -35812, -98199, -94244, -90131, 50729, -41336, -62961, -89421, -18446, -38043, -110678, -159100, -15777, 106509, 200007, 170326, 171158, 92771, 68538, 63038, 75735, 66052, -114896, -170222, -112992, -45074, 86817, 120627, 96247, 131457, 27578, -135094, -118305, -118564, -80260, -190202, -156578, 20265, 159845, 180593, 111811, 112173, 19085, 55980, 233804, 91878, -71623, -115934, -131560, -102662, -22457, 117153, 109785, 90284, 24974, -58110, -97189, -114931, -35138, -58767, -16224, 460, -50386, 26154, 55722, 2726, -34414, -61545, -57265, -23799, -71307, -33400, -92530, -64689, 67018, 54518, 80843, 130836, 79669, 9865, -46596, -181996]
22440a81996Q0860Q1723M8261J21253N4273j9322l5610J6990j55159j9128l4495
22429d2350r5576j18636J241J12060O5171j3226L1184K5856n4356M4463k4755
22418f8924j19202M7742r2859l3364P8092J42590K6380q9735r3042R120M0107
22407a53095O6274L7505r4637k3785P713p2896L2388K7501L9235M7990J57297
22396G1490j2011K2815K76292j35811j89365n3173j4638o4203Q0165J01357N336
22385H8254n7751j10005P9207m7015j33510j32940K2582J57322L6757q4527j07431
22374b89057O3136O0839q5455O9974J66189o003M939L5508j25597m559j4525J00836
22362b3775O7916r793p2970j38824n6127R8193M9763n6952p8479J42582R2877
$$ y = [-181996, -101136, -19413, 28848, 150101, 204374, 185052, 149442, 166432, 11273, -7855, -42350, -137926, -256562, -255321, -143261, -78090, -91316, -60132, -34276, -88632, -44169, -68924, -188126, -140384, -233243, -266607, -188515, -45925, -19545, -109280, -202322, -193202, -153095, -86821, -49316, -143953, -167738, -160025, -232921, -200533, -173032, -133797, -85807, 71490, 59479, 82294, 358586, 222775, 33410, -19763, -34401, -98604, -18439, 82918, 88254, 30503, -79502, -295, -47310, -180820, -313760, -291178, -133856, -97099, -181626, -289057, -225921, -165082, -250537, -180563, -14374, -20377, -15438, 20070, -105527, -110086, -124611, -23775, 44141, 34348, -38622, -177446, -233573, -135380, -85617, -142569, -221048, -78466, 14411]
22351A4411L109k7486J9887o4929r8220P4164Q3305N6175m6483K7713J05183R7454
22339B44283M0500j44020n0703k7946J437Q222j8359n0007p6764j6984J33084
22328D2743J14316J6099q0988R2676J13655p3001o2721m2684M9705J5155J750
22317A86705j04132l8509Q1556J13924P284n3131o9641q6628q53m2280J8523L8154
22305E0972K9634K2394m1484k8862k3288K6155q2894L1620K8071q478o5494Q5045
22293B3391J24831J14937k5633j34569j65630R35J68428o0877r5348j3912p8497
22282a41944M7454l3884R557J69252n6401r1458K6836j26755m1524M5108L0728
22271a63031J04275P9701L5736n3280N4015j12564l0907R3763J1326R8566J24884
$$ y = [14411, 17520, -9966, 9921, -55008, -153228, -79064, 4241, 60416, 13933, 41646, 146829, 244283, 284783, 140763, 90060, 62114, 63551, 71773, 53414, 3407, -73357, -90341, 42743, 157059, 173158, 92170, 184846, 298501, 225500, 162779, 120095, 169800, 184955, 186705, 82573, 44064, 125620, 239544, 246828, 193697, 124056, 37428, 36575, -5705, 12818, 50972, 80606, 103000, 61516, 32654, 9366, 35521, -47373, -15753, 12318, 3840, -61654, 23391, 148222, 263159, 237526, 102957, -62673, -61738, 106690, 45813, -49535, -63447, -141944, -94490, -128374, -118817, 50435, -5966, -97424, -70588, -197343, -238867, -193759, -163031, -58756, 20945, 56681, 3401, 57416, -55148, -86055, 7708, 19034, 117600, 242484]
22260B42484j05106j2354j67770n5433O3538q819j00448m0804R9796J29592O5322
22249A09998J38567j05145j53602Q8897L2577k0626P0612j6711J043m1557k1142
22238H2911j01415j31375k663J54984M976L2508J76960M8454p1651o1385p0485
22227F1819j53365J50938L8634j15211j33554Q2928q3286j32745K1149Q3929R6691
22216h2073m2450N6990L669K1913n8812n4401R4240q777J5905J81981l1060j01004
22204c879L495N8790k5839O8824M471j17332j10338k9054L0220N5263Q2507m1624
22192b4496J9351L0120o0355l7850k8854o0881N452n0429j2829O5330Q2950J32447
22180E9956k872P6524O019k4945j7002j23681n3796J40356P4114j01844n8716
$$ y = [242484, 137378, 125024, -42746, -98179, -34641, -43460, -143908, -184712, -84916, 44676, 109998, 248565, 143420, -10182, 78715, 111292, 90666, 161278, 144567, 145610, 104053, 82911, -18504, -149879, -152542, 2442, 7418, 39926, 216886, 265340, 193689, 132304, 61819, -91546, 59392, 98026, -17185, -150739, -67811, -151097, -283842, -262693, -178764, -82073, -124523, -67533, -63864, -41951, -100763, -155164, -60924, -69701, -53796, 128185, 97125, -3879, -384, 58406, 32567, 101391, 105862, -11470, -121808, -150862, -120642, -65379, 17128, -24496, -5145, 24975, -35380, -73230, -102084, -162965, -157513, -207942, -220771, -155441, -72491, 59956, 57084, 133608, 139627, 114682, 97680, -26001, -79797, 60559, 134673, 32829, -25887]
22169b5887o4392j5819K911j85552l6729q082O2586J24268K01522O3484K3654
22158A41964L8896j04003m974N0974o5163N1469J98752r0926j30845n086J6205
22147I7263j73990j45427j113J62749m8750K4477J69175Q0605j08786L351j40767
22136h1213k9202n8988O9537p8075k9543O4552k5833P3796J20286j1324j4568
22125e75J2607m5247q6981n7495J17492l6990n7010O2240M6332j66522L5899K734
22113a73516L577P0752J11387l5754j22711R959J44488j32N0282J7660m4986j9653
22101A1353r023m3707q191J47978J7968q4402q9394O538m9381j3719L7578L8212
22089c8190J06838J9932N4137r2179j29383L1171m352r3526j6267j8519J00696
$$ y = [-25887, -90279, -106098, -103187, -288739, -325468, -333550, -270964, -146696, 54826, 118310, 141964, 180860, 76857, 71883, 122857, 57694, 109163, 307915, 216989, 86144, 81058, 97263, -76727, -222154, -223267, -60518, -109268, -84791, 84384, 164989, 56203, 59554, -81213, -110415, -169403, -99866, -177941, -207484, -142932, -168765, -94969, 25317, 13993, -575, 12032, -33215, -120196, -177691, -60199, -97189, -154199, -91959, -45627, -212149, -176250, -173516, -169939, -99187, 12200, -23554, -146265, -136306, 8182, 8050, 58332, 75992, 31006, 11353, 2330, -41377, -49568, 98410, 116378, 31976, -57418, -50880, -100261, -113980, -76402, -38190, 68648, 88580, 142717, 50538, -78845, -47674, -52026, -145552, -161819, -180338, -79642]
22078g9642K5028p3287k3244L2847n1258n1048K8689K5779J88850m27L5099l1959
22066B5427q3182k8464k5369J16081O6980j28506j13718r1754l280Q3146J1619
22055a71020J06619J79447k5159j06408j4249m6203n4582P0571J10634P4797j51168
22044b6721n7732J34782O7796J2337k24605j29746l4424O8457R2758K8669k3990
22033i2419j18815n322J27335k2616j36586P066P1475J5288N1960L1494O0871
22022a0269O2109L1956n7919M8810M434j4388j44834r8603L6066J82008N8690
22011I8060q0246J20903n4472m9502l042J0132q4025q1578R671J18392l1415p0882
21999i8004P972K1544j25465j16807m413P9653J01767K0815L1665M9461R4347
$$ y = [-79642, -54614, -127901, -151145, -118298, -169556, -220604, -191915, -166136, 22714, 22287, 57386, 25427, -57755, -86219, -111588, 4493, 71473, -57033, -170751, -262505, -265785, -182639, -171020, -64401, 115046, 89887, -16521, -30770, -76973, -131555, -60984, 49650, 124447, -26721, -84453, 50329, 118125, 130462, -94143, -223889, -258313, -189856, -97098, -68429, -92419, -211234, -216556, -89221, -111837, -248423, -241357, -169882, -154594, -102634, -71140, -10269, 51840, 83796, 25877, 74687, 79121, 64733, -80101, -178704, -142638, 39370, 98060, 17814, 138717, 84245, 34743, 31701, 41833, -42192, -123770, -114099, 4293, -27122, -98004, -90032, -68488, -193953, -310760, -315173, -235520, -133753, -112938, -81273, -31812, 62535]
21988F2535N4770j3411o4294j82249N3158J18688k6560l2938m7175K12090k1090
21977A13524j52087j23679M3902L5310J00201Q436J20947O7249j99384l9083J9708
21966d956m1420p0307K9442k0720O291J76182J16682l7581j51211n0458J1441
21955c6615j01227o7334o7481K8294Q8021J38400l0823m5232k4577J2881K5839
21944g9854n344n0632j7353L7031Q6441m8636m0035q1528J35Q8083j913O486M5990
21931f1129Q0947K5249n5557m9755K29775m4433j83872N7300J06293M1795j34656
21920A1957j59312j6102R2654K6838K3014P9439o8679j32784j58897j986J62201
21909a41657m1930q3139K962R9985N4469J42378r585n0182k08133J9069P7891
$$ y = [62535, 117305, 103894, 39600, -142649, -89491, 29197, 2637, -30301, -77476, 134614, 113524, -38563, -162242, -118340, -83030, 17171, 25607, 146554, 213803, 14419, -24664, -4956, -46376, -116683, -87241, -107961, -101670, 74512, 191194, 153613, 2402, -48056, -36615, -137842, -205176, -272657, -244363, -156342, -17942, -48765, -93997, -118574, -105693, -79854, -85198, -135830, -153183, -116152, -29711, -78347, -118382, -199910, -199775, -111692, -113605, -107119, -61129, 19818, 45067, -10490, -60245, 169530, 125097, -58775, -1475, 104818, 146613, 11957, -147355, -163457, -70803, -43965, -20951, 58488, -10191, -142975, -301872, -303858, -141657, -183587, -266726, -263764, -163779, -109310, 33068, 23483, -26699, -234832, -215763, -137872]
21898a37872m642M8033N3916M2106J76132J31352L6262k2568j57629j12787m512
21887D7791J07307j6646j03426j21459J8423M0853M2611p4565j01588j7959Q8391
21876i0267J04481L1522R3509J1994j1500R3159m1723q2439k05225m1865R6889
21865d1465P1711j4095q377P8720r725k4556o8675j0689j01000j30400R0532J9658
21853a48361L6094p3275N3243N0834J77225j03387q6779K7364K8303L7846J03845
21842A02952O4358j39064j1218l6632o5457R5335m0152P7340p55j72173p797k6317
21830a59580m323N5199j1913K7274L3226P813r6008N1674J29942J61960O7620
21819B62884o889j74844j90132j5349L0784N0844O0722L6425N458J6950L5266
$$ y = [-137872, -142514, -94481, -40565, 1541, 177673, 309025, 345287, 322719, 165090, 52303, 47791, 155098, 138452, 35026, -86433, -68010, -27157, 15454, -59111, -160699, -178658, -90267, 14214, 45736, 139245, 151239, 139739, 232898, 191175, 108736, -96489, -138354, -41465, 30246, 16151, 7774, 86494, 76769, 52213, -16462, -27151, -128151, -258551, -168019, -148361, -112267, -185542, -132299, -81465, 95760, -7627, -94406, -67042, -38739, -893, 102952, 167310, 28246, 17028, -19604, -85061, 10274, -29878, 47462, 46707, -125466, -133263, -159580, -163903, -108704, -120617, -93343, -60117, -52304, -148312, -96638, 33304, 195264, 262884, 255995, 81151, -108981, -124330, -93546, -42702, 18020, 54445, 59903, 76853, 112119]
21808A12119m7776N4028n6827j1542j2112M6488j1412q7088p9247M0183L6722
21797a6464k7584o2349p0664J77764K01589o3985o9265M297P7660j5337r7450
21786C8212j12970m8034j6931k0565O0008Q7127N1560J25226m8244J07850M243
21775B27482k0332r7745M7502R8292m6650j91877j87575J30379R8561K2285L3258
21764A13580j8979k8542q52j2175J5402j625L39K1166N8132r2553K2143Q1684
21752A57720k9668l1689l2768k2200j42619m1234M3747J7093K6737q935p3720
21741a37536L4874n1377p5845o9605K0702J82225J17188M1729R2337n1868j13321
21730a0497J4686O876Q4188l6062j11284k8775K0226N6l8238j06517O0300Q7325
$$ y = [112119, 64343, 118371, 61544, 50002, 37890, 84378, 72966, -14122, -93369, -53186, -16464, -44048, -106397, -177061, 703, 202292, 138307, 69042, 73339, 150999, 135662, 38212, -74758, -122792, -139723, -160288, -100280, -13153, 38407, 163633, 115389, 223239, 227482, 207150, 109405, 156907, 255199, 208549, 16672, -170903, -40524, 58037, 80322, 113580, 94601, 66059, 65207, 53032, 68434, 66809, 67148, 88314, 146446, 53893, 76036, 157720, 128052, 96363, 63595, 41395, -101224, -142458, -98711, -81618, -54881, -63816, -137536, -102662, -154039, -229884, -299489, -278787, -96562, 20626, 62355, 154692, 102824, -10497, 4189, 11065, 95253, 59191, -52093, -80868, -60642, -60586, -98824, -205341, -145041, -57716]
21718e7716k3974J63763Q5117J313l5906m9124N2717l0270l2857l7471k1474o0849
21706d6731n1337p734O7664m84n8091P3964L704J5236Q159n6847M6447o709q614
21693b1373k0J00908j9192j76852j91757K1718P7798O3921J64931n4209m2536
21682g6663L8013K0550M1517p5768L0299n9716n0468l1932k8620K8216R0040J4975
21670e9557P2887m8881J2857P8876m9061j81882l5139P9231J16415K0011K6305
21659C2062Q1326j21865n9420J14686l2315j00220K8179J0835O8327p2848n5070
21648a06323L8508R5278l1520N7073Q803p2435j20523l9563Q1675J25275L0141
21637F6389j07782p8383l1484P4426R2531j18912p7580O9773P536N7081k8287
$$ y = [-57716, -81690, 82073, 167190, 168503, 132597, 83473, 136190, 105920, 73063, 35592, 14118, -46731, -98068, -105802, -38138, -38622, -96713, -22749, -19045, -3809, 4350, -52497, -6050, -12759, -21373, -21393, 79515, 60323, -116529, -308286, -286568, -208770, -144849, 20082, -34127, -76663, -38650, -18100, 23417, -52351, -22052, -81768, -132236, -164168, -192788, -164572, -74532, -59557, 13330, -35551, -22694, 56182, 7121, -174761, -209900, -130669, -14254, 5757, 32062, 113388, -8477, -67897, 46789, 14474, -85746, -57567, -46732, 21595, -51253, -106323, -67815, 27463, -4057, 53016, 61819, -10616, -131139, -170702, -89027, 36248, 66389, -41393, -119776, -151260, -76834, 15697, -103215, -180795, -111022, -103486, -46405, -74692]
21626g4692R4593K9446j6974j7775q2208o014P7589l5488j3340l1699J5629J7315
21614d3618p3581M5843O7248j1829l5366J07680K9709j07405N4902O0929l0975
21603F3537N7505k1073j82297j03279j8545J8523L3736j1505J74389Q5547p3304
21592B3234p5658K822k4222M8592L6260j5836p6122O2643L9002J7764l8415l8445
21580c8381M5816L0161r5710p4608M3635M0785L3888q791J0064J5731O6442o1700
21568G332j7206r5875q0909N3814J07149J528n5326N5188J9147K3745K692J49803
21556A71082N1685p3671k380M182J2690m6267M0393M259o5213m0415R677o4519
21544A503p0810K7662r5140q5727R2572q2021j19570K7510R1059M6781N7200L3816
$$ y = [-74692, 19901, 49347, 32373, 14598, -67610, -73624, 3965, -31523, -44863, -76562, -60933, -43618, -117199, -71356, -4108, -15937, -51303, 56377, 86086, -21319, 33583, 94512, 63537, 121042, 99969, -82328, -185607, -204152, -185629, -151893, -163398, 10991, 96538, 23234, -52424, -49602, -73824, -25232, 11028, -4808, -80930, -18287, 20715, 38479, 64, -38381, 7435, 37596, -58114, -132722, -89087, -48302, -14414, -23205, -13141, 2590, 69032, 7332, -9874, -105749, -186658, -132844, -25695, -24167, -79493, -24305, -5158, 18587, 21279, 171082, 222767, 149096, 146716, 150898, 163588, 117321, 157714, 161973, 96760, 56345, 66022, 1503, -69307, -41645, -136785, -222512, -129940, -211961, -331531, -304021, -212962, -166181, -108981, -75165]
21532g5165J05715J69547n3366k22657m3801L2600M213J303n8214p4117M3934
21521a70008R2327Q7024R6955j863p2156j83651k4859O9233Q0493N7850k4431
21510F914J2441r672m3089J06870P3332L5159n4424j23865j77115n9776P9084
21499a54141k9605Q4614o4373L1978J57435K6117q1244j7862o8253k0522j1597
21488a47453K1263j6275J2499k9238O2242M2069k2782J03008l5667J27586O4051
21477A81303r8779p1582m5227M3751j0790O7729N2930J7212L629j6438J29057
21466B52795m6340k14292l3037J09102L3017O0266J25588j8125j65540j25416
21456b1982l9966K5528K36932l9058J0527M7630l0547o1934Q322k6232q5395o2895
$$ y = [-75165, 30550, 200097, 146731, -75926, -119727, -87127, -82914, -81611, -139825, -213942, -170008, -77681, 9343, 106298, 104435, 32279, -151372, -176231, -106998, -26505, 31345, 6914, 19355, 9683, -33406, 73464, 146796, 181955, 127531, 3666, -173449, -233225, -154141, -183746, -99132, -163505, -131527, 25908, 52025, -29219, -47081, -115334, -135856, -147453, -126190, -142465, -129966, -159204, -96962, -54893, -77675, 25333, -10334, 117252, 181303, 82524, 10942, -34285, 9466, -1324, 66405, 119335, 136547, 140176, 123738, 252795, 206455, -7837, -40874, 68228, 101245, 161511, 287099, 268974, 103434, -21982, -61948, -36420, 200512, 161454, 171981, 219611, 189064, 127130, 135452, 109220, 23825, -39070]
21444c9070J584Q9472O501j01082r561o490J9847N3887q5678r0173Q9982O9821
21432i60Q1851L9462j68887m2000J3555L2696L6211K7633r0310q7778M1978J53499
21420C6950L3337r6529j00908j0118J84010P2591j2002q9387r9998j29889N8754
21409a53189R0368J14904J8849r0250k8971j1296J6515L9949l7013j0313J38590
21398H8143N9673m5891k5484M4478L9952l8904k331l6629m4238P4580l2536r9923
21386a9110O6372m2487r7720m6425N8496O9315L4714L4150k2190L1497n3055j99640
21374a86083o50J64569R9852j11844j44170Q078l065M1177L1799K2174J39385
21363F1222Q2028k2219J1252p6789l6054M7868M345j5104J19696K3446j16796
$$ y = [-39070, -37486, 51986, 58487, -42595, -52156, -58646, -38799, 15088, -70590, -160763, -70781, -960, 80891, 120353, -48534, -90534, -76979, -44283, -8072, 19561, -70749, -158527, -116549, 36950, 70287, -26242, -127150, -137268, 46742, 119333, 107331, 17944, -82054, -211943, -153189, -62821, 52083, 70932, -19318, -48289, -59585, -43070, -3121, -40134, -50447, 88143, 147816, 101925, 76441, 120919, 160871, 121967, 119636, 83007, 38769, 113349, 80813, -19110, 47262, 4775, -92945, -139370, -80874, -11559, 23155, 57305, 35115, 66612, 13557, -186083, -186733, -22164, 77688, -34156, -178326, -170248, -173313, -132136, -100337, -78163, 61222, 143250, 121031, 132283, 55494, 19440, 67308, 71653, 56549, 176245, 199691, 82895]
21352H2895o2651P1414L3776K5468M4634L1247r093m6453m9709o2995j56960o6384
21340a64811J5443N4817k9498j0902Q1002P053n7459j18848k3105Q5745R9610
21329f0953l994q0504J08666P3777K3963R087j11014j56508J14772P4882l7992
21318d5818N3332o507k1772O665L496j2512K543l5339K6944j7113l7501j13356
21306a96938O9667J14153q5567N3463L427P5973J04017n9874p2496n9049l3531
21295h6755n4289j9273J4037J25663K7111L8238j7768L9769n289M9708M1117O9514
21283B21783j15642j39922j06983M517O6792m1343M8714R5149o35k6102j2802
21272f474N7931M7183r270j74854n4235J55141K7678j29242o7899l394j4312P7132
$$ y = [82895, 20244, 91658, 125434, 150902, 195536, 226783, 217690, 171237, 121528, 58533, -98427, -164811, -149368, -94551, -124049, -134951, -53949, -46896, -104355, -223203, -246308, -160563, -60953, -64947, -145451, -36785, 36992, 60955, 70042, -40972, -197480, -82708, -7826, -45818, 7514, 1007, -20765, -14100, -10604, -23116, -20573, -55912, -28968, -46081, -83582, -196938, -127271, -13118, -98685, -45222, -41795, 34178, 138195, 78321, 5825, -53224, -86755, -141044, -160317, -146280, -20617, 6494, 44732, 26964, 66733, 61444, 111152, 152269, 221783, 106141, -33781, -140764, -136247, -69455, -110798, -62084, 33065, 32430, 6328, -6474, 51457, 98640, 89370, -85484, -139719, 15422, 43100, -86142, -154041, -157435, -171747, -94615]
21260i4615J08869L5726n541k2548j11173j05704k5986J88532O0677l5788l9681
21249d7232j07246M9282J8790m4925M129M3072L1895R6379O6749k6598J31368
21238B15663j01745p0648q6789r1656j5286Q8114N2340m0285k9212n1843o33k4689
21226a56669P7056J4257k1969l9927q4708k5511M7102J21326K7473j810m1170
21215h4550m2209Q3283M7778O0552L1376j24566k3268l1631j19629m9552J25307
21204a27109M6252k3504L484R4522N6417n7758Q98K5354Q6315L1979J2091m0540
21192A08401N4481K6532r9689N7003n0620o6360p257q157l9042O8756J11720K1703
21180A77471J0115r7839o8586n0092r8688n1994Q6779Q0711L3175O4008j3041
$$ y = [-94615, 14254, 49980, 44439, 21891, -89282, -194986, -220972, -32440, 28237, -7551, -47232, -154478, -105196, -86406, -131331, -127202, -84130, -52235, 44144, 110893, 84295, 215663, 113918, 43270, -43519, -135175, -150461, -62347, -10007, -50292, -79504, -131347, -131980, -156669, -79613, -65356, -87325, -127252, -211960, -237471, -190369, -69043, -41570, -43380, -84550, -126759, -43476, 4302, 64854, 96230, -28336, -51604, -83235, -202864, -252416, -127109, -80857, -104361, -100877, -6355, 50062, -7696, -6798, 18556, 104871, 136850, 148941, 108401, 162882, 189414, 89725, 146728, 96108, 29748, 22491, 14334, -24708, 44048, 155768, 177471, 187586, 89747, 21161, -28931, -127619, -179613, -92834, -12123, 21052, 85060, 72019]
21169G2019m6354k2946j8079r0701M4168P8173l1141m4821l255L1969k6849m2961
21157a00778K0509j25921j12869J29191Q7509k0101J05005R7228m6346j05363
21147g1936O8168K3214j03843l7008j1522J00126J45909J0604o9721r6004o3569
21136a05582j0683j2296P5890o5579M1645M5026L1243j34135l7095n1919O6677
21125a56808J28806o5917k2542n5701Q2497J29298K3871J2488j20075j14281M1817
21114a16547O7960N0246j2948q4735m7270J9675O8901m3256j04546J1898J05314
21103h5308o6673M3679J04766N4034Q7921j24700M0104M9372m6898R9500p4966
21092H0831l7122N2363l7776r8260K7190l286o9419o9426M9755l196m1854J3352
$$ y = [72019, 25665, 2719, -15360, -106061, -61893, 16280, -14861, -59682, -62937, -30968, -57817, -100778, -80269, -206190, -319059, -189868, -102359, -122460, -17455, 79773, 33427, -71936, -3768, 19446, -84397, -121405, -132927, -32801, 113108, 123712, 53991, -42013, -105582, -116265, -128561, -52671, -118250, -76605, -31579, -336, -134471, -171566, -223485, -156808, -28002, -93919, -116461, -172162, -89665, 39633, 63504, 75992, -44083, -158364, -116547, -48587, 1659, -11289, -96024, -143294, -123619, -54718, -97974, -202520, -190622, -85308, -151981, -108302, -3536, 50498, 138419, 13719, 53823, 103195, 56297, 155797, 80831, 43709, 96072, 58296, -39964, -12774, -16060, -85479, -154905, -105150, -108346, -150200, -136848]
21080a36848J7840J36881J27000p5170k00009J6916N8520l9918O5807n2826j8189
21069i9996j296J8050j10290j60822Q2410J73497J07538K6374J643k8229O0520
21058F9399r2013K0996o3015l0741L8897j17480m3841M8712J49925R5641j3008
21047F3472j07774L916j7868J6647O513q3406J21619L4179r1757J4975n8495l2455
21035a30434m3611l0102J560K4348l3533l9762J07311J50614N5374m7657m2727
21024b8619k9386j3035J31661l7094k372M5317K6471O5802m8704j07788L5614
21013C7867J2317J854j0632J133q9311k2454l8500j72630J42471J10386O5840
21002C8341J32335j16859m1257p869J6366M1840p090J27984J94o6874j00129r8747
$$ y = [-136848, -119008, 17873, 144873, 69703, -130306, -113390, -54870, -94788, -28981, -81807, -99996, -101292, -83242, -193532, -354354, -271944, -98447, 9091, 35465, 37108, 8879, 69399, -22614, -1618, -64633, -95374, -56477, -173957, -217798, -169086, -19161, 76480, 63472, -44302, -40386, -58254, -41607, -35094, -118500, 3119, 37298, -54459, -39484, -97979, -130434, -174045, -204147, -202587, -178239, -211772, -251534, -144223, 6391, 61765, 14108, -28619, -58005, -71040, 60621, 23527, 21155, 66472, 92943, 158745, 110041, 2253, 37867, 50184, 52038, 41406, 42539, -46772, -69226, -107726, -280356, -137885, -27499, 38341, 170676, 53817, 12560, 4691, 21057, 62897, 55807, 183791, 183985, 117111, 16982, -81765]
20990h1765k5217Q8386M1621K7351J1397o5584o5500J20583Q8317k7229j11765
20979E95n1059j0546j3611N5349j11497p3322J79184J56766k3275q0834J00370
20968A28120m0991k4386j48039j20379j3324m331Q6613M3768L2320m9977N5333
20957e5273L57m4054o9719l8050R0915K3207o7677o3706o2127m5367L6903R9139
20945a95452L7516P4163J01196J27670m8901n8421n3232l1377m1091p238j74352
20934b69519j23523J58918J55443M48J06363J33347J1476o3329k21243j12686
20924b24305L4521J60023K8008j02447J1594J00234L2821J6315K0622o1245o3208
20913d7067L2341M630o1842r731r4564R4513J60079J08684p3555p7499j21256
$$ y = [-81765, -106982, -18596, 23025, 50376, 61773, -3811, -69311, 51272, 139589, 112360, 595, -50464, -61010, -74621, -19272, -130769, -204091, -24907, 131859, 108584, 27750, 128120, 87129, 62743, -85296, -205675, -218999, -223330, -136717, -92949, -60629, -110606, -55273, -54916, -98970, -168689, -206739, -115824, -92617, -160294, -224000, -286127, -331494, -294591, -195452, -157936, -83773, 17423, 145093, 96192, 37771, -15461, -46838, -87929, -95167, -269519, -393042, -234124, -78681, -78233, 28130, 161477, 172953, 109624, -111619, -224305, -189784, -29761, -1753, -104200, -92606, 7628, 40449, 56764, 77386, 16141, -47067, -14726, -10096, -71938, -81669, -176233, -81720, 78359, 187043, 113488, 35989, -85267]
20902h5267q4028L0822j4653j18662j4945R4065J90948J97361k6988j31110j40780
20891a03237m3879J00059L1572p1611J1689L1873N708O5591j6160q4163n0081
20880a22639o8191J08461J7296j00713K4703j0281p0325J64436m315j00727l0432
20869a92727m5782k7547l9720J38929P7710l8832J2748P754K8469k0149J2918
20858h6229J310N9120N9181r0501j2586Q6437r5258j2877K1498O1275R8549j4371
20846G5548k21232j00015J30264R7246J2966L8082M0375p532J8763P819M2692
20835A34976o992j4568j45377q6218l6290m1595N149R1712M2606k5177L8342l6940
20823h0372l2160L8873P5899J23004l168j14081J1900j03963N5278N801j3243
$$ y = [-85267, -169295, -138473, -153126, -271788, -286733, -192668, -1720, 195641, 168653, 37543, -103237, -147116, -47057, -15485, -87096, -75407, -43534, -37826, 27765, 11605, -72558, -122639, -190830, -82369, -65073, -165786, -141083, -151364, -221689, -57253, -61568, -162295, -192727, -238509, -266056, -305776, -166847, -89137, -127969, -115221, -107467, -78998, -99147, -86229, -84919, -25799, 33382, -57119, -69705, 16732, -78526, -91403, -69905, -8630, 89919, 75548, -145684, -245699, -115435, -18189, -5223, 32859, 73234, 65702, 84465, 92284, 134976, 127984, 113416, -31961, -118179, -154469, -196064, -190915, -99203, -56597, -81774, -43432, -80372, -112532, -73659, 2240, 125244, 122076, 7995, 19895, -84068, -28790, -22989, -36232]
20812c6232L2511P529n2057o6042j0600L8106K0786N639L5824n206p6121n1097
20800a56960L3578R4823K7593q7513L0469o6346K5329Q2510J05132k3557j91632
20789a26574l05M1933L7093j02081N4720R6386J32321q1690j23405l8691K1167
20778h9126P6876J61316N4151k1682o3313j8962j7748j37185%m9372Q02k2142
20766a26385J913M5070k7886j6984p00Q4043q3343q3688Q1661M2825L8943P4760
20754C0229n0324J0466m6918m3976l5292L0136j4491p449l2624L4461K9559m8213
20742a44436Q6238j6597p1094Q0790K1294j38554m4978p5146P1210K68693L9708
20731G7128J6038M7977Q573j0890j34029j4403J18238p9783p7871R0014J17151
$$ y = [-36232, -3721, 3808, -48249, -114291, -124891, -86785, -65999, -60360, -24536, -29742, -105863, -156960, -123382, -28559, -966, -88479, -58010, -124356, -99027, -16517, 88615, 65058, -126574, -126879, -84946, -47853, -149934, -95214, 1172, 133493, 51803, -71602, -110293, -89126, -12250, 149066, 203217, 181535, 118222, 99260, 81512, -55673, -55673, -105045, -104243, -126385, -124472, -79402, -107288, -124272, -124972, -40929, -124272, -207960, -126299, -83474, -44531, 30229, -20095, -9629, -56547, -100523, -135815, -105679, -120170, -127619, -160243, -125782, -96223, -144436, -58198, -74795, -145889, -65099, -43805, -182359, -227337, -302483, -231273, 37420, 77128, 93166, 141143, 149716, 138826, 4797, -9606, 108632, 28849, -49022, 40992, 158143]
20720A58143N0246r8998l5504Q7531j0796l835J25033M0452j53279P4446l7623
20709A95816j24602o4768j5354K3903J01196J37434j09152j45092O4026O568J171
20698G1146j13841j6333M0299o0741j3386R5490J84184M0238m4992j97520q5704
20687a01160o519J35772J8591N241N7833J21968L1586j29348p9004N460q9187
20676b8767n9m0101M7466j0485l9059N8741N8926l7243r4017L4053n3873j4108
20664a18526P480K1063m4700l3755M5316R3836j0113o1103j9545j0498L0697O2342
20652c7506j8892L386Q9982M3261m3964Q392q4848m3213L3481Q8082l8952j273
20640b064J9565l3606N1812M533n7567m9642j291J2294p266l1035J15888J270
$$ y = [158143, 208389, 109391, 73887, 161418, 150622, 146787, 271820, 312272, 158993, 233439, 195816, 71214, 6446, -8908, 14995, 116191, 253625, 144473, -619, 63407, 69975, 71146, -42695, -59028, -18729, -79470, -92856, 2634, 186818, 227056, 182064, -15456, -101160, -107679, 28093, 46684, 51925, 109758, 231726, 263312, 133964, 54960, 60420, -28767, -28826, -68927, -21461, -31946, -71005, -12264, 46662, 9419, -84598, -50545, -104418, -118526, -111046, -89983, -134683, -168438, -123122, -29286, -39399, -100502, -120047, -130545, -99848, -37506, -56398, -53012, 36970, 80231, 36267, 44659, -40189, -83402, -49921, 38161, -791, -2064, 17501, -16105, 35707, 40240, -17327, -66969, -68260, -55966, -63232, -94267, 21621, 22891]
20628B2891r9289R9779K2095J8545P2231Q7399p2246q5480j62297o550M5837Q6481
20616B9396M0980j35059N1067j4169Q0080J22794J4596O2310k8868j10373N3272
20605A66026J5658k13263r8622Q8975j5975M3598J69744L0069q9380M1176N7825
20594A95831j48555q3287N7155Q4908l9156q8317J9164P0373o9769j2545L2192
20583A7994N8406n8725p6711L3808M9589J49675J2740k6722J2588L0435n3213
20572A49864r4612j1992M8713M8898N6776k8838J8847l675j84128j14084k8448
20561a42679q5128M9633K13320R1082q4116q9228P2107J4278K8068p0132j13322
20550a16117o266K4417o6701j6376n7237L7810J797J20212M6150n2572p5730K833
$$ y = [22891, -76398, 23381, 45476, 64021, 136252, 223651, 151405, 65925, -96372, -102922, -57085, 29396, 70376, -64683, -13616, -27785, 52295, 175089, 189685, 251995, 223127, 112754, 166026, 181684, -31579, -130201, -41226, -57201, -13603, 156141, 186210, 96830, 138006, 195831, 47276, -36011, 21144, 106052, 66896, -21421, -2257, 68116, -1653, -14198, 17994, 76400, 17675, -59036, -25228, 24361, 174036, 186776, 160054, 172642, 203077, 149864, 55252, 43260, 91973, 140871, 197647, 168809, 187656, 183981, -147, -114231, -142679, -227807, -178174, 35146, 126228, 42112, -47116, 24991, 39269, 67337, -2795, -116117, -122383, -97966, -164667, -181043, -238280, -200470, -198673, -78461, -32311, -84883, -160613, -157780]
20538a57780J20317O9859p5885n7653K1268L8828K447P7138Q6048L8212K8919
20527A91718l7766L6151j2540k7379n1172L7826n0835k4846j09079j2577P3330
20516A2831N276n3819J3412M2194m3826N864M8865K8328n9931K9729J167o2267
20504c2177M2088p5485n5639O0635L1147q88N0208l8293j39408L6918k1615j9965
20492a62474M373N9565m0093K6907M9015J03709M9613n471m6537j60238J0121
20481a11510k2252L7497J06535K8623K8659p7625o8871K4467M0507j16127J4763
20470a15334J1187J6012L7876q485J56275n1773o3808J4490R4329Q4609P3666
20459B49044N0305j6938J02124j61237j15611Q2887k9029q9228r0490m2037j9470
$$ y = [-157780, -37463, 32396, -43489, -101142, -79874, -41046, -38599, 38539, 124587, 162799, 191718, 153952, 190103, 177563, 150184, 99012, 136838, 86003, 61157, -47922, -60499, 12831, 18107, -35712, -22300, 19894, -23932, -18068, 30797, 59125, -806, 28923, 30090, -32177, 9911, -65574, -121213, -60578, -29431, -30319, 19889, -18404, -157812, -120894, -142509, -162474, -158101, -98536, -138629, -111722, -62707, 41002, 90615, 85144, 38607, -121631, -111510, -133762, -96265, 10270, 38893, 67552, -10073, -78944, -54477, -13970, -130097, -115334, -104147, -88135, -50259, -58744, 97531, 45758, -18050, -3560, 90769, 175378, 249044, 299349, 282411, 384535, 223298, 107687, 190574, 161545, 72317, -18173, -60210, -79680]
20448g9680O1159J8760J8027j27209q3260O2650R6088m9888l7552R2764k9221
20437e7362k2207j5735k0532l8416R0447N4511J2451k9753j05228N4372M7498
20426b9954R664J3280j11884r395J66148P5393l9217j33966o5355r0347m7391
20415b63024O0378R8171J7626m9762j65684j19411J09281M7705L3148N7692J34941
20404c8939M7637m4273k2720m6105l2711l7922j37155m3740N2272J51743K46167
20393I4254n204k6727q9208o7159Q2815J3577L5886k4977m3474l754N3914L4597
20381E4540l7335n4623j15772r927J09040P7904m5980k540Q6900p0595j3216P7265
20369E5661q6670P9157M8364J030m6721J0518m2711q5187q1772n3047J18336J61541
$$ y = [-79680, -18521, 239, 18266, -108943, -192203, -129553, -33465, -83353, -120905, -28141, -57362, -79569, -95304, -115836, -154252, -63805, -9294, 3157, -26596, -131824, -77452, -29954, -20290, -7010, -118894, -128289, 37859, 113252, 74035, -59931, -125286, -215633, -263024, -202646, -104475, -86849, -136611, -302295, -421706, -312425, -264720, -231572, -173880, -38939, 8698, -35575, -58295, -104400, -137111, -175033, -312188, -355928, -303656, -151913, 94254, 89050, 62323, -26885, -94044, -11229, 2348, 38234, 13257, -30217, -33971, 19943, 54540, 17205, -37418, -153190, -163117, -54077, 23827, -22153, -24693, 62207, -8388, -21604, 55661, -31009, 48148, 96512, 97542, 50821, 61339, 18628, -66559, -148331, -201378, -83042, 78499]
20357G8499J27642Q23o250j80414r0549n9796L4758J62086J23325N895N1315m105
20345B43229J2649j10984j75111j2792l3464P760Q915j4896O6706R4048K178M1118
20333A29356j9287j75142K9114J11688r9961j17102n0633Q5916k2942P1967J19128
20322F2102K765N1182k9513o4898k2495O9990p721n3488M0998K11191K0380j33282
20310A47211j62107j01374K26868J49915j4742m071q726o019j07904r5140m1164
20299a7253R8697J46338J8152l1475j71589K4780K4853P1917o8080j12891r5651
20288a12202J06294K07163p7677j30849J07664r3147m9670R3238N5218Q2548m6601
20277A41979p7327n5695j5059K1814O0154M8585k7407k2470R5797O7381j42236
$$ y = [78499, 206141, 206964, 200714, 20300, -70249, -130045, -95287, 66799, 190124, 196019, 247334, 243229, 255878, 144894, -30217, -43009, -76473, -68713, -59798, -74694, -7988, 86060, 88238, 129356, 110069, -65073, -35959, 75729, -24232, -141334, -191967, -106051, -128993, -57026, 62102, 64867, 116049, 86536, 21638, -857, 69133, 61412, 7924, 48922, 260113, 280493, 147211, -14896, -116270, 110598, 260513, 245771, 241700, 232974, 226955, 119051, 23911, -17253, 81444, 227782, 245934, 214459, 42870, 67650, 92503, 164420, 96340, -16551, -112202, -5908, 201255, 123578, -7271, 100393, 7246, -42424, 50814, 106032, 188580, 141979, 64652, 8957, -6102, 15712, 75866, 124451, 97044, 74574, 170371, 237752, 95516]
20266I5516k5507P3941J8629l8826J2795Q31j0059N2172O7033n6676j49866n882
20254C4101L7890n5694j45046J08666P4953j01888j6798J42165J28845k6109J7876
20243A98961p3003j16673N4494l37N5855j12036k8618J5290n317o283M6901j09642
20231h0408K7263J32483Q9532M4289k4168r3749J2331p5838m5779l2520J23018
20220G6454m8979M1264J27691P6597j07177L2111J09862r1518j41654l5826P9554
20209A18379n3672j42333j3717J9629L9217L9545L9934J1697J67823J6352q7413
20198A55441L6879P9855N3497P1980q216q6799k0743j4146N4814p2944j88770
20187F0848m9139P7750q1737m2078J45359J10893k6332n954m8383J05317Q1565
$$ y = [95516, 70009, 143950, 162579, 123753, 136548, 137379, 127320, 179492, 246525, 189849, 39983, 34101, 71991, 16297, -128749, -20083, 54870, -47018, -63816, 78349, 207194, 181085, 198961, 125958, 9285, 63779, 63442, 119297, 7261, -21357, -6067, -11384, -17667, 29234, -80408, -53145, 79338, 168870, 213159, 188991, 95242, 107573, 31735, -14044, -46564, 76454, 27475, 68739, 196430, 273027, 165850, 197961, 307823, 216305, 74651, 38825, 118379, 64707, -77626, -91343, -71714, -32497, 7048, 46982, 58679, 226502, 242854, 155441, 192320, 272175, 325672, 397652, 389436, 302637, 281894, 267748, 322562, 249618, 60848, 11709, 89459, 7722, -34356, 111003, 221896, 195564, 189610, 141227, 246544, 328109]
20176C28109r6364O7234m7939m1834m0207k8816m4036O3815n9940o2804j42861
20165a05643J1238J11984Q6041n3709J8816L7794L6130k9579n8987J91397P1233
20154C16715O230K3442J06337J17380J90257K6596j38205j7738q4137r6299j7590
20143D32988Q5932J36658J10897L8285j9353q3471o7962J19455O1987n3300p8128
20132F83988J7405q771j37285p4804P4896j02079n7632j837J1485P8513N0308
20121E34187N7706l2098L8678M8557q6367j41489P2912O7212J4952p3187m3476
20110D57587M3972Q1116K31244n739k210K0955N1095r6246n4925j2532l6232L689
20098F81774k9805j56330q2290p3998K0298J4618m3616n8128m7538m2747Q263
$$ y = [328109, 231745, 298979, 251040, 209206, 168999, 140183, 96147, 159962, 100022, 37218, -105643, -94405, 17579, 103620, 49911, 68727, 106521, 142651, 113072, 54085, 245482, 316715, 322945, 346387, 452724, 570104, 760361, 786957, 648752, 631014, 546877, 450578, 432988, 518920, 655578, 766475, 804760, 785407, 701936, 633974, 753429, 815416, 762116, 683988, 701393, 692622, 555337, 480533, 555429, 453350, 395718, 393881, 405366, 483879, 534187, 591893, 559795, 598473, 647030, 560663, 419174, 492086, 559298, 574250, 501063, 457587, 501559, 582675, 813919, 808180, 805970, 826925, 878020, 781774, 726849, 714317, 678085, 681774, 651969, 495639, 413349, 339351, 359649, 374267, 330651, 272523, 224985, 182238, 190501]
20087A90501L418K2417L9230j6934n4855o1031p8426m6011J92987L4986j20647
20076A05635L6923N4098M8151N5756r36P76q9646o6505Q884j3945o0762P1829
20064A50258P4519L7091J4939K9250K005j00479q4564J0494J1657K8167N8421
20053B31758j0110o448K2605j07202R3701J05447n8654j48344m8605P7976J11496
20042B63620p5274p1400O2622L3751J0789j679n8594j08225k1725j00976j2134
20031g9225J52274k1112J18346N3957j17850N0374J5421J4554K0564q585J1480
20020B10198N2959p063r8908o59l1279l5052j3442L8496K4856k7222n0888Q3340
20008A45336N3947j39503j43338j10883J37617J03343o8621R6384J24957N3790
$$ y = [190501, 193919, 216336, 255566, 238632, 183777, 122746, 44320, -1691, 191296, 226282, 105635, 142558, 196656, 244807, 300563, 299627, 300403, 210757, 144252, 153136, 139191, 78429, 150258, 224777, 261868, 276807, 306057, 308062, 207583, 123019, 133513, 145170, 173337, 231758, 221648, 215200, 237805, 130603, 224304, 329751, 271097, 122753, 74148, 152124, 263620, 188346, 116946, 179568, 213319, 224108, 222429, 163835, 55610, 33885, -67091, -79225, 73049, 51937, 170283, 224240, 106390, 156764, 172185, 186739, 207303, 198718, 210198, 263157, 256094, 157186, 156527, 125248, 90196, 76754, 115250, 140106, 112884, 61996, 145336, 199283, 59780, -83558, -194441, -56824, 46519, -22102, 74282, 199239, 253029]
19998B53029j80325k4583J7888p0318m5400p8543r1543M1222J15494O0632J04224
19987A01777Q1164j08775o3231n4469j035J22151k9093j6330K8186j19570k39
19976e9464M7986O6961K7674j3069L8346j6840m7291L6621L6536J3074k1898l7767
19964G0869j50857J23906J63281j5710j11241j60516L3729N0459o9914o156K2702
19953d9448L0214n64R5766j60501R6440Q4583n5824o7196p4031K1929K880R6812
19941B1060M211L9434J12869j8431j63126j12631N5640q5533P5263j3471P2225
19930a2490J27240l4959n9104j4600P2873R2200k1488j06456l1915n4329O767
19919c6261k3842J13118K2404j02287j2124N3292n8079j0986J00221j1218j531
$$ y = [253029, 72704, 48121, 66009, -4309, -49709, -128252, -219795, -178573, -63079, -2447, 101777, 182941, 74166, 10935, -43534, -44569, 77582, 48489, 32159, 60345, -59225, -59464, -11478, 55483, 83157, 70088, 108434, 91594, 44303, 80924, 117460, 130534, 108636, 70869, -79988, 43918, 207199, 191489, 80248, -80268, -46539, 3920, -65994, -72150, -49448, -19234, -19798, 75968, -84533, 11907, 96490, 40666, -26530, -100561, -78632, -75752, 21060, 25271, 64705, 177574, 159143, -3983, -116614, -60974, -146507, -71244, -84715, -12490, 114750, 79791, 20687, 6087, 78960, 171160, 149672, 43216, 11301, -43028, -36261, -60103, 53015, 75419, -26868, -38992, 14300, -43779, -54765, 45456, 34238, 32707]
19908C2707M4208J30024k4145p7740J23557q5360L4483J02885m186j11152K108
19897A67389M6097L2132K7348q4111M1352O8455p1341m9373o0418L4962j5138
19886A37354P7963K1926R7527j12939k45971j43437j2963M7188J50809M3853n2715
19875H595K5123M4255m9123q4796L6025N8355k4589M6041N8775Q326j3447q074
19863A05466m128n244O8845L4409j51942j38307J0065j6236k5720R0146M0812
19852H166p2873O6402J9298J7595p5992j8515L325j0949J175N7371k3027J0797
19840a7227J2758O449J09944J92712K9134P4817M4831o9211n5543p3324j54956
19829A00384r072J35747N0567j22035j29076P305M40J14472P5209M4318N6505
$$ y = [32707, 76915, 206939, 182794, 105054, 228611, 143251, 177734, 280619, 276433, 165281, 167389, 213486, 245618, 272966, 188855, 230207, 298662, 227321, 177948, 117530, 152492, 137354, 215317, 237243, 334770, 221831, -24140, -167577, -180540, -133352, 17457, 61310, 8595, 33718, 77973, 28850, -55946, -19921, 38434, 13845, 59886, 118661, 126987, 113540, 105466, 101338, 96094, 164939, 199348, 47406, -90901, -80836, -97072, -122792, -32646, 8166, -64707, 1695, 20993, 38588, -37404, -55919, -52594, -63543, -62368, -4997, -28024, -17227, -4469, 1980, 111924, 304636, 333770, 408587, 453418, 384207, 328664, 255340, 100384, 91312, 227059, 277626, 155591, 26515, 33820, 34260, 148732, 223941, 268259, 324764]
19818C24764r1442j16842M9943J1617k1342j16143N1306J47487J5167O5431O732
19807C26678j50767j5873J09398r2673k5051K5235K2018j489p0542k2233O9958
19796A74659O4695m1302p5972J8879k3341L0067M0613p1093j52021J1524J43446
19785A20154J17225o4971j6034n1553j49736o4498O0692O0701q7925J15805J61671
19774B01531N7393j6357j00781K2173Q6570K8714o499j5758j71632m4737J7689
19763E8306q157O8051R6033Q6181j07560j08096Q0572m9889l5149J15323K8729
19752B24344n9369P5885j1695L8390J48289J55541R6675q0289j4366N6079p3536
19741E55948p3493o5724l9447M8039J13178Q0223j49682M2464R0002q969O000
$$ y = [324764, 233322, 116480, 166423, 178040, 156698, 40555, 91861, 239348, 254515, 319946, 326678, 175911, 160038, 269436, 176763, 151712, 176947, 198965, 197476, 126934, 104701, 174659, 239354, 198052, 122080, 140959, 117618, 147685, 188298, 117205, -34816, -23292, 120154, 237379, 172408, 156374, 104821, -44915, -109413, -48721, 11980, -75945, 39860, 201531, 258924, 242567, 141786, 163959, 250529, 279243, 272744, 256986, 85354, 40617, 58306, 50149, 118200, 214233, 300414, 192854, 84758, 165330, 115441, 80292, 195615, 224344, 164975, 240860, 229165, 267555, 415844, 571385, 668060, 587771, 573405, 629484, 555948, 482455, 416731, 377284, 425323, 538501, 618724, 469042, 511506, 601508, 592539, 598539]
19730E98539J1836l7666m5381p7597j13946j08488R1364J30145l6511r483N3805
19719D56617R4614Q4035J1141j14193J34978O2930q329O589J2271L5279l1905
19708G44027L0151n9718n8678L5962N6372J35820N2852o2031O301q0972K0927
19697H21013Q6344L1963k19028j85775m2436P936J0412l359o0526L4005P2628
19686E53177L0120l4334J5044q0207O1068J11622Q723j9774K0553J4805N6686
19675G37483L9942j24451L7748L7476q5341J67127K24587o8103k92013p3311N9633
19664F60777R1653K0073m4843O2039L2216M8327r400J470M5893o025P5626P5231
19652A053037K6842o1956k3947m1562j06804j1832J04166O1585p724j042k1107
$$ y = [598539, 610375, 572709, 527328, 449731, 335785, 227297, 318661, 448806, 412295, 402812, 456617, 551231, 635266, 646407, 532214, 667192, 730122, 721793, 728382, 740653, 775932, 744027, 774178, 714460, 655782, 691744, 748116, 883936, 936788, 874757, 881058, 800086, 821013, 907357, 939320, 720292, 534517, 492081, 500017, 510429, 507070, 446544, 480549, 553177, 583297, 548963, 564007, 483800, 544868, 656490, 665213, 645439, 665992, 680797, 737483, 777425, 652974, 690722, 728198, 642857, 809984, 1034571, 966468, 674455, 601144, 660777, 752430, 772503, 727660, 789699, 821915, 870242, 860842, 862312, 908205, 902180, 977806, 1053037, 1079879, 1017923, 993976, 952414, 845610, 833778, 937944, 999529, 991805, 990763, 969656]
19641I69656J48328L3741L0731M6843l0862L1109J03666R4503M3043l8773J09530
19630A541515K2847j9080K01876J32654J09516J74556R0777j17826O1080J61541
19620B359456J16209O0227J22001r354J03435K35341K70597K72148J78737J89145
19610C897942L29022L38551K86216K98289L05653M01896K44511J24750J64007
19601F390837L03826M73169O56311Q04567J081247J241636J673680K330183K949821
19592A7905277L934035N510311P708815J0151659J0815894J0273878J0787372
19585G7087241J1312666Q323438L259707j530610j466094O04892m81094k952605
19577I4157541l740518o89383K726210M486859P069880Q132865M857740r35101
$$ y = [969656, 1117984, 1151725, 1182456, 1229299, 1198437, 1229546, 1333212, 1427715, 1470758, 1431985, 1541515, 1564362, 1545282, 1747158, 1879812, 1989328, 2163884, 2254661, 2136835, 2197915, 2359456, 2475665, 2535892, 2657893, 2648539, 2751974, 2987315, 3257912, 3530060, 3708797, 3897942, 4226964, 4565515, 4851731, 5150020, 5455673, 5857569, 6102080, 6226830, 6390837, 6694663, 7167832, 7824143, 8628710, 9709957, 10951593, 12625273, 14955456, 17905277, 21839312, 27349623, 35058438, 45210097, 56025991, 66299869, 77087241, 88399907, 96723345, 99983052, 98452442, 96986348, 97591240, 97110146, 94157541, 90417023, 89727640, 92453850, 96940709, 104010589, 112143454, 117001194, 116066093]
19569A16066093n503551n011671l376297n724984r809985j2154499j0245469o395905
19561E7843732k804272K66152L477271O562526Q772880R048153Q811257J0094732
19553A02072431R526274N608475m2436l213593j487830k56610k494253m682854
19545A05029604m062786l09884K768485M766191P182445O645944K499981l685317
19537A20834663o941173n150001n106377q756719j2899836j4164955j1553185
19530E6262417q161769n640275m086043l158473k572162k310912k112580j852627
19522B6367576j548801j415835j233212j034643q77627p26486p76639q92299o46233
19513A7215801o31716n35397n41880o36720p34163o37883m10900n13105l31254
$$ y = [116066093, 110562542, 105550871, 102174574, 96449590, 86639605, 74485106, 64239637, 57843732, 55039460, 55305612, 58782883, 65345409, 74118289, 83166442, 91977699, 102072431, 111598705, 117207180, 117164744, 113951151, 112463321, 112206711, 109712458, 105029604, 100966818, 100656934, 103425419, 108191610, 115374055, 122019999, 124519980, 120834663, 113893490, 108743489, 103637112, 94880393, 81980557, 67815602, 56262417, 48100648, 42460373, 38374330, 35215857, 32643695, 30332783, 28220203, 26367576, 24818775, 23402940, 22169728, 21135085, 20257458, 19530972, 18754333, 17862034, 17215801, 16584085, 16048688, 15506808, 14870088, 14135925, 13498042, 13087142, 12574037, 12242783]
19504A2242783l02899l30072l87182k95184l96626m77316k84284j68805k82086
19495I318329m56347m03465k49041l25061l00444k49700l50657k42162k33834
19486F507618j55464j03516j87211j11496p5245j42171j00053k40800k94435k42122
19476D855105k34487L1503m3000q9057k42286q8089l266o8079k55947j64302p3794
19465C624301j20770j56500n1665m3406Q7069j56802j66759n6278q7005j33478
19455B738707j21322m6690m6716l9172j43442r2762k0144j37381r4548m7606j7398
19444A931526r8609k5343J28570q377m9015j20890N1864J8556l2872o8110K1172
19433A748472j15828j52606L8784L6472p0613p1198p2853l1275J28811q0503r4963
$$ y = [12242783, 11939884, 11609812, 11222630, 10927446, 10530820, 10053504, 9769220, 9600415, 9318329, 8861982, 8458517, 8209476, 7884415, 7583971, 7334271, 6983614, 6741452, 6507618, 6352154, 6248638, 6061427, 5949931, 5874686, 5732515, 5632462, 5391662, 5097227, 4855105, 4620618, 4652121, 4609121, 4520064, 4277778, 4189689, 4186423, 4118344, 3862397, 3698095, 3624301, 3503531, 3347031, 3295366, 3251960, 3339029, 3182227, 3015468, 2959190, 2872185, 2738707, 2617385, 2570695, 2523979, 2484807, 2341365, 2248603, 2228459, 2091078, 1996530, 1948924, 1931526, 1832917, 1807574, 1936144, 1927767, 1878752, 1757862, 1809726, 1828282, 1795410, 1727300, 1748472, 1632644, 1480038, 1518822, 1555294, 1484681, 1413483, 1340630, 1309355, 1438166, 1357663, 1262700]
19422A262700r9860N8338J7035M7668q1650l1121m9026J8379P3710n8134j78548
19411I79491m908J00897k7387r4286J6397J35548j7769N279j37251n9333o1888
19400H34790j07410k6928L0756K1916n0059M0689O190j60701j44081l4860J3066
19389D23368J263J15266J0710J57657m048p5422n6119J27876k4134k5075j9068
19378F32274j3360L5665j70711N2057J53091L6952k7326o6577r543n6838N83l7091
19366E29176o9899J61769J16829q5293p7004J14630l7365k02737j15483Q8432
19356D23055J84910m8335p6857n6803n0102L4711L9877L7257J09449j32921j92617
19345B71624o6409k8918j63000J58702J24098O4352M1723J14951M8699R8232M1899
$$ y = [1262700, 1162840, 1221178, 1238213, 1285881, 1204231, 1173110, 1124084, 1142463, 1216173, 1158039, 979491, 974583, 1075480, 1048093, 953807, 970204, 1105752, 1087983, 1093262, 956011, 896678, 834790, 727380, 700452, 731208, 753124, 703065, 743754, 749944, 589243, 445162, 410302, 423368, 424631, 539897, 550607, 708264, 704216, 628794, 572675, 700551, 676417, 651342, 632274, 618914, 654579, 483868, 535925, 689016, 725968, 698642, 632065, 622522, 565684, 566267, 529176, 459277, 621046, 737875, 652582, 575578, 690208, 652843, 450106, 334623, 423055, 607965, 559630, 482773, 425970, 375868, 410579, 450456, 487713, 597162, 464241, 271624, 205215, 176297, 13297, 171999, 296097, 360449, 402172, 517123, 565822, 664054, 705953]
19334G05953J6240r0019K6951j2056j19902j67571P9280O4440m1519M1950J90526
19323F94273J20016O21j52109j16000m8866k4884J55589N0074j11209n6921l9317
19312D71267k7486K2464O8883q7265M1685P996j66157K2048p8778n4249Q7350
19301C07758o8813j07794m6937N7133J23590n280J5658N9655K76726L20830P9737
19290A012263j67996m3347j8365m968m9908Q0919O1392q2119N3567j09978k7771
19279G03689J50347J81561j21383j46827M6546r2429P750m1006j31772o7882j71617
19268C16977m2405J01001q386j09067J262j2923P1349n6774m9904O691k0202q8094
19256A09525N8383R9014M5541j104j36624m5467M8959O1102P4072N6779J9177
$$ y = [705953, 722193, 632174, 659125, 647069, 527167, 359596, 438876, 503316, 461797, 503747, 694273, 814289, 814910, 662801, 546801, 497935, 473051, 628640, 678714, 567505, 510584, 471267, 443781, 466245, 535128, 447863, 489548, 497544, 331387, 353435, 274657, 220408, 307758, 238945, 131151, 84214, 141347, 264937, 259657, 275315, 334970, 611696, 932526, 1012263, 844267, 800920, 782555, 777587, 727679, 808598, 869990, 787871, 841438, 731460, 703689, 854036, 1035597, 914214, 767387, 813933, 721504, 729254, 688248, 556476, 488594, 316977, 274572, 375573, 367187, 258120, 259382, 246459, 317808, 261034, 211130, 217821, 197619, 109525, 167908, 266922, 312463, 311359, 174735, 129268, 178227, 239329, 313401, 370180, 389357]
19245C89357O6351K14703K4549O375l8720P0318M9642R940o0982j26031K4857
19234F30359m4245j0840n9955M143r899j30070L7711J06212P3191j6682M0340
19223F20265k7772j27750j5171M4538p2465r1865j24469j46453q3894J12800J80479
19212B68243J5006N0292J02202O4868r8678j60374j16605o8935k6654K20102K18174
19201D67641n9240o4510k6234P5409L7120j15099j03281j3737n6723J03234O2263
19190C06843K3182j12672l3431j8401O0501p7508O1504N3744j23223j87904J19157
19179G1792L6143J5845J9871Q8590N915l2579j63831j65769m740L0651P7675J43858
19167A23421J3802m5938n68M1680n3013R908P0087L5365j05601j17964r4878R5792
$$ y = [389357, 455708, 670411, 694960, 701335, 662615, 732933, 782575, 792515, 731533, 605502, 630359, 586114, 575274, 515319, 519462, 509563, 379493, 417204, 523416, 596607, 579925, 620265, 592493, 464743, 449572, 494110, 421645, 329780, 205311, 58858, -25036, 87764, 268243, 283249, 333541, 435743, 500611, 401933, 241559, 124954, 56019, 29365, 249467, 467641, 408401, 343891, 317657, 393066, 430186, 315087, 211806, 198069, 141346, 244580, 306843, 330025, 217353, 183922, 165521, 226022, 148514, 210018, 263762, 140539, -47365, 71792, 107935, 123780, 143651, 232241, 238156, 205577, 41746, -124023, -128763, -98112, -20437, 123421, 137223, 91285, 90717, 132397, 79384, 89292, 159379, 194744, 89143, -28821, -123699, -27907]
19155b7907O5211r8523L8748o9767M9118l4695j6962J21568L4765J43216L1881
19144B36653R622R1797R03J9975K8243O3168o659q4360q8298J5164k07r1802k9306
19131A64893Q5581k28m6113l2489j66724O2M3603Q4189j0007n6615k7197j393
19119C7562J9883m3886q2802n9318J40404J82573P5363n7372k0819p1153m8601
19108G1834R8234J32906N5103j49347q1926J4217L3426N5458j2426j2413l4595
19097A70471o2784p665J0574P8173Q4340J48195L6620p2153m4563m147K1332P0937
19085D29330N3591l9151j12851k6374Q7704j8417l4683k267J06040n1045n5967
19074C35910l6115n655J0143N1401q3334k6192o1831q0797J23713N1230n9256
$$ y = [-27907, 37304, -61219, -22471, -92238, -43120, -77815, -94777, 26791, 61556, 204772, 236653, 246275, 338072, 338975, 358950, 387193, 450361, 443702, 359342, 271044, 286208, 286001, 194199, 164893, 250474, 250246, 204133, 171644, 4920, 4982, 48585, 132774, 122767, 66152, 38955, 37562, 57445, 13559, -69243, -128561, 11843, 194416, 269779, 212407, 191588, 120435, 71834, 170068, 302974, 358077, 208730, 126804, 141021, 174447, 229905, 217479, 205066, 170471, 107687, 100022, 110596, 188769, 273109, 421304, 457924, 385771, 341208, 337061, 358393, 429330, 482921, 443770, 330919, 304545, 392249, 373832, 339149, 336882, 442922, 391877, 335910, 299795, 294140, 304283, 355684, 272350, 246158, 184327, 103530, 227243, 278473, 219217]
19063B19217J27756J08852o7119K2639N7769j59593k3716n7700j21896l2781J51045
19052B24473Q9648l4799l921n6105k3700P0999K8435m1475k8272J6466M5304R0815
19040C77868N7058M3023j23738J134L8752K911N4110K5742k0992O782r3964J7834
19028C86520m9043Q3478O0925l1488k7849k4500N9135J9597J4870J5473j88470
19017C18648L7839J50241M0167O3606O0095K23628J13464n7076m9348j80733N3093
19006G73624J83674l1172m6259M793J3175j8842P9168L995j5481j34p5521j15394
18994G55626J5865P7535j41421k90924n2169J05498J28958r5097O2534q418L1573
18983E89560M9949Q8842J23682n2009j0233l2171j3396J01767J7539O5829J42646
$$ y = [219217, 346973, 455825, 388706, 411345, 469114, 309521, 285805, 228105, 106209, 73428, 224473, 314121, 279322, 275401, 219296, 195596, 266595, 295030, 253555, 225283, 241749, 287053, 377868, 434926, 477949, 354211, 355345, 394097, 397008, 451118, 476860, 455868, 462650, 368686, 386520, 337477, 420955, 481880, 450392, 422543, 398043, 457178, 476775, 491645, 507118, 318648, 356487, 506728, 546895, 610501, 670596, 894224, 1007688, 950612, 901264, 720531, 773624, 957298, 926126, 879867, 884660, 897835, 878993, 958161, 962156, 946675, 946541, 871020, 755626, 771491, 849026, 707605, 416681, 364512, 470010, 598968, 503871, 566405, 557987, 589560, 639509, 728351, 852033, 800024, 789791, 757620, 744224, 845991, 863530, 929359, 1072005]
18972A072005R324k3635j5421m4228n5492N9199P8567j2819r8039j84048p8939
18961G06474J25979o7511N2918K1090m1145J0943j9231O5660J3005L8699k1491
18950H85390j26185j41056r354Q4595Q7500m184Q5657N1951p6838m0116j13210
18939F84150j23496K686l6204L2859R2306r104j6918j00288n7221L572l6983Q0971
18927E16330N5765o7215j48540k9073K0854P3707M0452Q698J29303O6644L995
18916F70920m0204l253J55685j3173J4533M5934K4883N9459j3282j4744J32996
18905A019754K00824J30499R7938k67524j77336J14843Q9322P533j12254m6771
18895A056828j397R7827J22786j35327l7374Q7432o9522j20327Q8372r676o6474
$$ y = [1072005, 1081329, 1057694, 1042273, 998045, 942553, 1001752, 1080319, 1067500, 969461, 785413, 706474, 832453, 764942, 817860, 838950, 797805, 808748, 789517, 855177, 868182, 906881, 885390, 759205, 618149, 608795, 693390, 780890, 776706, 862363, 914314, 837476, 797360, 684150, 560654, 563340, 527136, 559995, 652301, 643197, 626279, 525991, 468770, 472342, 435359, 516330, 572095, 504880, 356340, 327267, 348121, 421828, 462280, 470978, 600281, 666925, 670920, 630716, 627463, 783148, 769975, 784508, 830442, 855325, 914784, 901502, 886758, 1019754, 1220578, 1351077, 1449015, 1181491, 1004155, 1118998, 1208320, 1215853, 1103599, 1056828, 1055431, 1153258, 1276044, 1140717, 1103343, 1190775, 1121253, 1000926, 1089298, 1079622, 1013148]
18884A013148j32334k5071j0564l6371j57199M4798K35753J84724j18729p8910
18874I19245j2036R6022M6087J53507M2097j52819n6453J55330K39316N6103M5209
18863A531608l2291M5741J60084L33176K58223O5963L05425L39086l1378r5630
18853B880007J24117J14313N0938R3122J99684K92619K02778J08504J43986L43714
18843D553782L10869L86597M07342M34482O86007P75842J087906J624491K303805
18834A2571123L298993N239404P882401J0178835R166873O780125P270657M399771
18826F6788182k528732r534093j1828946q199899l849981k35083L180395O514669
18818D0306512Q820500P528237N317393N893411K398337m560879j1436484j3025143
$$ y = [1013148, 880814, 855743, 845179, 808808, 651609, 696407, 932160, 1116884, 998155, 919245, 907209, 1003231, 1049318, 1202825, 1244922, 1092103, 1035650, 1190980, 1430296, 1486399, 1531608, 1499317, 1545058, 1705142, 2038318, 2296541, 2362504, 2667929, 3007015, 2975637, 2880007, 3004124, 3118437, 3169375, 3262497, 3462181, 3754800, 3957578, 4066082, 4210068, 4553782, 4864651, 5251248, 5658590, 6093072, 6779079, 7554921, 8642827, 10267318, 12571123, 15870116, 21109520, 28991921, 39170756, 48337629, 55117754, 62388411, 66788182, 64259450, 54725357, 42896411, 34696512, 30846531, 30611448, 33791843, 40306512, 49127012, 56655249, 61972642, 67866053, 70264390, 65703511, 54267027, 41241884]
18810D1241884r349511n764157l472228k210429j376208q69314q38108p34936
18802A6626993o16844n58195m13720m21862j93152J20443J06192K74834N48730
18793A5473419O42920Q80389J410312K117823L176885M837188P467867J0582782
18785D6589585J1820501R843341R083110J0581973O320717Q81882k521887j093550
18777I1505672J248683M742819Q295672N730270J456915l359166m742502r74142
18769A03904221L303473J035854k859710n369184l639492k117860M41613J984721
18761I6683636l360094j0430680j5561152j3971478r245667n991715m025544k812558
18753C1284748k146408j608245j435113j548578j367465j017536r39057o64239
$$ y = [41241884, 31892373, 26128216, 22655988, 20445559, 19069351, 18200037, 17361929, 16626993, 16010149, 15451954, 15038234, 14616372, 14423220, 14543663, 14649855, 14924689, 15473419, 16116339, 16996728, 18407040, 20524863, 23701748, 28538936, 36006803, 46589585, 58410086, 68253427, 77336537, 87918510, 94239227, 95121109, 92599222, 91505672, 92754355, 97497174, 105792846, 111523116, 112980031, 109620865, 104878363, 103904221, 107207694, 108243548, 105383838, 100014654, 96375162, 94257302, 94698915, 96683636, 93323542, 82892862, 67331710, 53360232, 44114565, 38122850, 34097306, 31284748, 29138340, 27530095, 26094982, 24546404, 23178939, 22161403, 21222346, 20558107]
18745B0558107n87824l61021r7093p3594J8309M52541P93250J199823K188712
18736B4091210L614636N742848Q820061J1573766J0541296P675232Q135519N621638
18728H5816206k572601j0814838j4557801j0704167n260591r85246K983640P030548
18720E0935150R826768Q859968N930565O302383L109470m977342j2781072j5753226
18712E1452664j2063898p577948m637374k925007j910312j467242j328271j251524
18704A8291088j296658j086163r88753p74126q76866p90689o34487n07050o08160
18695A0728136n65869l52444k82807j24296k90675l99173l03385k48362k35830
18686G925295k25255k75124l15599l16271l11594l38859k63218j80588k12018
$$ y = [20558107, 19970283, 19609262, 19512169, 19438575, 19456884, 19909425, 20702675, 21902498, 24091210, 27705846, 33448694, 42268755, 53842521, 64383817, 72059049, 80194568, 85816206, 83243605, 72428767, 57870966, 47166799, 41906208, 40920962, 43904602, 50935150, 60761918, 69621886, 75552451, 81854834, 84964304, 79986962, 67205890, 51452664, 39388766, 31810818, 27173444, 24248437, 22338125, 20870883, 19542612, 18291088, 16994430, 15908267, 14919514, 14145388, 13268522, 12477833, 11843346, 11336296, 10728136, 10162267, 9809823, 9527016, 9402720, 9112045, 8712872, 8409487, 8161125, 7925295, 7700040, 7424916, 7109317, 6793046, 6481452, 6142593, 5879375, 5698787, 5486769]
18677E486769k35368j37344q6247j80275k8426j04893j42498j89593k37920R741
18667D153946L9050o9349r4591q3021k52018r7100j95091k19894j73634J3226
18657C021524J304o4836j27429M685p0145k3349k1606q8136p0461j61265j30710
18646B269576j33843J3158J21145j44530j24155M6618J48539k8241j98733j38821
18636A830713j6732N7122l70q1165j77676l0136P8160P350M8828p2101j24588
18625A519405q0833l2618Q4615J8563q5635j21662K6810P5769R672L1571q2375
18614A363282o8928o5610q2032j1381Q6823j05545p2126k2222J25963J85536o7323
18603A266437j94898j5037N1643m4250n2694N8848N8207J0625j41783r0777R531
$$ y = [5486769, 5251401, 5114057, 5027810, 4847535, 4819109, 4714216, 4571718, 4382125, 4144205, 4153946, 4192996, 4123647, 4029056, 3946035, 3694017, 3596917, 3401826, 3181932, 3008298, 3021524, 3022828, 2957992, 2830563, 2835248, 2765103, 2741754, 2720148, 2632012, 2561551, 2400286, 2269576, 2135733, 2148891, 2270036, 2125506, 2001351, 2047969, 2196508, 2168267, 1969534, 1830713, 1813981, 1871103, 1870733, 1789568, 1611892, 1581756, 1659916, 1667266, 1716094, 1643993, 1519405, 1438572, 1405954, 1490569, 1509132, 1423497, 1301835, 1328645, 1404414, 1414086, 1445657, 1363282, 1294354, 1228744, 1146712, 1135331, 1222154, 1116609, 1044483, 1022261, 1148224, 1333760, 1266437, 1071539, 1056502, 1108145, 1063895, 1011201, 1070049, 1128256, 1138881, 997098, 906321, 915852]
18592I15852Q828J9866O5381j7910n8278j2660L6398K9291m491L0445q3402J38708
18580A068028m1950J4422J48583o2489j28795j28117l9270M5651L7215q0583L9865
18569H72560J58279n6980l7962m7546r859l5756r3509J26806k689j42932p9652
18558F50760J15963n7693J6289J51019r9691J4262O463j18956j09214P4408l6846
18547F06764J16728Q4223R4465J11766p3243j9601K8478p6405o9130n6290L7340
18536G85095j453k926J9842j04457K6817Q3147L8833j6507j13475Q8707N1326
18525H54949K6037N2205k0356o983j4278j8711j5043l0440o0156r6077j0029M9856
18513G10974L3102l5063N057p6808q1865J21393J18223q5497j3252o8719j40280
$$ y = [915852, 924680, 944546, 1009927, 992017, 933739, 921079, 957477, 986768, 982277, 1012722, 929320, 1068028, 1026078, 1040500, 1189083, 1126594, 997799, 869682, 830412, 876063, 913278, 832695, 872560, 1030839, 973859, 935897, 888351, 878492, 842736, 749227, 876033, 873344, 730412, 650760, 766723, 709030, 725319, 876338, 776647, 790909, 797372, 678416, 569202, 643610, 606764, 723492, 807715, 902180, 1013946, 940703, 921102, 949580, 873175, 804045, 747755, 785095, 783642, 780716, 800558, 696101, 722918, 806065, 844898, 828391, 714916, 803623, 854949, 880986, 933191, 912835, 905852, 891574, 872863, 857820, 827380, 767224, 671147, 661118, 710974, 744076, 709013, 714070, 637262, 555397, 676790, 795013, 709516, 696264, 627545, 487265]
18502D87265Q5469J0082l4416j33318N4569Q1083l481k3612L370j02446M7503
18491D72068o7300O8508N4022J49500Q9733n6251j44308r7321m3798N6340L9463
18480E20656r13K7886J51469J37016J1417M5858p4398Q0612P6347k6148N6397
18469A006199J69304O8381m5673n9136k0143q3136k5181o7422n696l2366P1276
18458I76407M6617P6716P0326j21525k0419n4035l4823J04219L6178J1443n3475
18447A037629j52915J38415R4105K3103m2381k3181J35882J16592k4909j2100
18437A290240J08791j4762n4930P2695L7802N5294J05619Q7658R7847o9240r7216
18426A619798L6751L8787J4290m2007L9848J32594L2534J85755Q1974O4820M9613
$$ y = [487265, 572734, 582816, 548400, 415082, 469651, 550734, 547253, 523641, 527011, 424565, 472068, 404768, 473276, 527298, 676798, 766531, 710280, 565972, 468651, 424853, 481193, 520656, 519743, 547629, 699098, 836114, 847531, 893389, 818991, 899603, 975950, 949802, 1006199, 1175503, 1243884, 1198211, 1139075, 1118932, 1035796, 1010615, 943193, 937497, 905131, 976407, 1023024, 1099740, 1170066, 1048541, 1028122, 974087, 939264, 1043483, 1079661, 1091104, 1037629, 884714, 1023129, 1117234, 1140337, 1097956, 1074775, 1210657, 1327249, 1302340, 1290240, 1399031, 1384269, 1329339, 1402034, 1439836, 1495130, 1600749, 1688407, 1786254, 1717014, 1619798, 1656549, 1695336, 1709626, 1667619, 1707467, 1840061, 1872595, 2058350, 2140324, 2205144, 2254757]
18415B254757l2558r2460j10260r8828j7833J5896l1061j9780j0877L8665Q1992
18404A977653o9403K16107J40779n6199m596J75561K07559Q3013J43813K91451
18394C105738J57903K6712M8659K69232L50384J51692R6164K11489K50952K06305
18384D875230J60080J79932J73813K69114L03246L01749K39847M35033M55143
18375G393187L69850M80929N55555P22448P70731Q17392J184523J479063J686614
18366A5460292J929935K431429K989060K936845K406530J971393J916955J588403
18358C3630842Q57267K75501O75095J919055L421944N725993R322890J3818698
18350F9647285J7726685K1011468K6791003L2133438K9958052K2562168J9796248
$$ y = [2254757, 2222199, 2129739, 2019479, 1920651, 1902818, 1918714, 1887653, 1867873, 1856996, 1895661, 1977653, 1908250, 2124357, 2265136, 2208937, 2204341, 2379902, 2587461, 2670474, 2814287, 3105738, 3263641, 3290353, 3339012, 3608244, 3958628, 4110320, 4206484, 4417973, 4668925, 4875230, 5035310, 5215242, 5389055, 5658169, 5961415, 6263164, 6503011, 6938044, 7393187, 7763037, 8243966, 8799521, 9521969, 10292700, 11110092, 12294615, 13773678, 15460292, 17390227, 19821656, 22810716, 25747561, 28154091, 30125484, 32042439, 33630842, 34488109, 34763610, 35438705, 37357760, 40779704, 46505697, 55828587, 69647285, 87373970, 108385438, 135176441, 167309879, 197267931, 219830099, 239626347]
18343B39626347J8545048P627445o700590j5965381j6577264j8084199k0369700
18336A88101706k0611203j5799291r524717n817758m911230m699882l242918l072254
18328A20422453n896373r335113j0245360r167727q473740q303837p411495n786426
18320E5802382m155877k838261k048203j617065j125324o73042j21533N53987
18312D3777064J393226K393651M054416N703549O839193Q281571J0284570J0917573
18304I3644813R056197P007521P326606P089695N102268L768243O100287J1288043
18296A50383673J7706634K3359166K6406509K9045148L3845711L3003895K1192757
18289C34943493P275826J760061o275943k1461347l5217068l7653383l2898998
$$ y = [239626347, 258171395, 265798840, 259098250, 243132869, 226555605, 208471406, 188101706, 167490503, 151691212, 142166495, 136348737, 131437507, 126737625, 123494707, 120422453, 114526080, 105190967, 94945607, 85777880, 77304140, 69000303, 61588808, 55802382, 51646505, 48808244, 46760041, 45142976, 44017652, 43344610, 43223077, 43777064, 45170290, 47563941, 51618357, 57321906, 64161099, 72442670, 82727240, 93644813, 102701010, 109708531, 117035137, 124124832, 129227100, 132995343, 139095630, 150383673, 168090307, 191449473, 217855982, 246901130, 280746841, 313750736, 334943493, 342219319, 343979380, 337703437, 316242090, 281025022, 243371639, 210472641]
18282B10472641k9890423k8095143k3704429j6314540r954535o325447l697272
18275I2490852k190847k175931k938856k817429k794561l865050n443038o037058
18267F4228082n561271n009084m630780m286512l545307k651945j917986j390764
18259C5234433j308444j322078j298700j360685j283162j216223j267015j088327
18251B5089799j245858j243911r23544p14442p00475n65302o13276o19429o55662
18242A7807900q03530o55797m49025l84796l53476k40370l35574l84024l60220
18233A3841088l96322l97572l36104m65073n47117l42338k43717k48232l29158
18224A0535455l66109k56029k48574k91630k08954l99842l17014j99035j39893
$$ y = [210472641, 180582218, 152487075, 128782646, 112468106, 102513571, 96188124, 92490852, 90300005, 88124074, 85185218, 82367789, 79573228, 75708178, 70265140, 64228082, 58666811, 53657727, 49026947, 44740435, 41195128, 38543183, 36625197, 35234433, 33925989, 32603911, 31305211, 29944526, 28661364, 27445141, 26178126, 25089799, 23843941, 22600030, 21676486, 20962044, 20261569, 19696267, 19082991, 18463562, 17807900, 17004370, 16348573, 15899548, 15514752, 15161276, 14920906, 14585332, 14201308, 13841088, 13444766, 13047194, 12711090, 12246017, 11698900, 11356562, 11112845, 10864613, 10535455, 10169346, 9913317, 9664743, 9373113, 9164159, 8764317, 8447303, 8248268, 8108375]
18215H108375r8464j88663j77677k24279j76269k22290j65708j47528j20090j63074
18205F424333j11728L9620j15353j32371l6319N3799j7576j44727k79042k07502
18195E473134j99503j76653j15564k35482j00430l1105q1211n6488r0734j07517
18185D278447k03963j95022r720q4103k1542o0472l9529j60323k00185l9369j32450
18174C131769o4166J8175n3314n887N6433J5136o0752k14982n4031J4081m5991
18163B736471K0350j9359P2565N955P3J32049L0984k7975j8958m9585p6689j10330
18151B695551j56188l0332j4739O3098r1754j32729n9161j56486j83859j052M13
18140A932762O5653O4288j19520J8212Q3167K1521K039L699J38769J04787Q775
$$ y = [8108375, 8009911, 7821248, 7643571, 7419292, 7243023, 7020733, 6855025, 6707497, 6587407, 6424333, 6312605, 6352225, 6236872, 6104501, 6068182, 6121981, 6104405, 5959678, 5680636, 5473134, 5273631, 5096978, 4981414, 4745932, 4645502, 4614397, 4533186, 4476698, 4385964, 4278447, 4074484, 3879462, 3869742, 3785639, 3764097, 3703625, 3664096, 3503773, 3303588, 3264219, 3131769, 3067603, 3085778, 3032464, 3026577, 3083010, 3098146, 3037394, 2822412, 2768381, 2782462, 2736471, 2756821, 2737462, 2810027, 2815982, 2816055, 2948104, 2979088, 2951113, 2932155, 2882570, 2805881, 2695551, 2539363, 2509031, 2494292, 2557390, 2465636, 2332907, 2273746, 2117260, 1933401, 1932349, 1932762, 1998415, 2062703, 1943183, 1961395, 2044562, 2066083, 2068122, 2071821, 2210590, 2315377, 2324152]
18129B324152Q254P4859O3473k9075J63631J13430J09179K18942J85474L16361
18119C548680M63467M31979O19718P76646Q51249J165406J861883K473250L742111
18110A5934389N964935R727941J5227429J8880045J4819528J0353088J4011837
18103A04919192O132684q036396k2536986k5220066j6537851r071702n250629
18096B4398246l227398j967705j461599j484017j474092j294263j037037j047018
18088A1405117p77244p05272q45414p21458m72882l32899l61953l29360k97528
18079F561107l74375m03659l08292l36808k56140j65682j41411j03205q5821j28573
18069D257141q0657J4084j65874j89372M751N2803l9973n0346j25681n7794q5184
$$ y = [2324152, 2332406, 2407265, 2470738, 2441663, 2605294, 2718724, 2827903, 3046845, 3232319, 3548680, 4012147, 4444126, 5063844, 5840490, 6691739, 7857145, 9719028, 12192278, 15934389, 21899324, 31627265, 46854694, 65734739, 80554267, 90907355, 104919192, 111051876, 103015480, 80478494, 55258428, 38720577, 29648875, 24398246, 21170848, 19203143, 17741544, 16257527, 14783435, 13489172, 12452135, 11405117, 10627873, 9922601, 9077187, 8355729, 7882847, 7549948, 7187995, 6858635, 6561107, 6186732, 5783073, 5474781, 5137973, 4881833, 4716151, 4574740, 4471535, 4385714, 4257141, 4176484, 4190568, 4024694, 3835322, 3840073, 3892876, 3852903, 3802557, 3676876, 3619082, 3533898]
18058C533898m6826j46851j52674o8146P4770M2151j14035J6232J34159M5535
18048C318213M9367J29922J53340M1343N8001N7456r1384m4546j20962j74198
18038C376552l2179j29346q8957o4850q7115k6843p1629J2721L7122J3476l9435
18027B899517j9036j18570j43916O1773J6075j91983j33896o2896L5515P9338
18017B421921J2503Q6520j5592j03202q6755r1740r4059j11202j3099J22722L7751
18006B165768p6482m8677J11311J15303J24333K7562m8804O2908N2114J28517
17996B613853K5164q7118n4906R6757R8266J6043L0404J28273J18870J34308J26480
17985C246394j9428J58149m4393j47786k56284j75332P4265N8849J27457K4675
$$ y = [3533898, 3487072, 3340221, 3187547, 3119401, 3194171, 3236322, 3122287, 3138519, 3272678, 3318213, 3367580, 3497502, 3650842, 3692185, 3750186, 3807642, 3716258, 3671712, 3550750, 3376552, 3344373, 3215027, 3126070, 3061220, 2974105, 2947262, 2875633, 2888354, 2925476, 2938952, 2899517, 2880481, 2761911, 2617995, 2679768, 2695843, 2503860, 2369964, 2307068, 2342583, 2421921, 2434424, 2520944, 2505352, 2402150, 2315395, 2223655, 2129596, 2018394, 2005295, 2128017, 2165768, 2089286, 2040609, 2151920, 2267223, 2391556, 2419118, 2370314, 2433222, 2485336, 2613853, 2639017, 2551899, 2496993, 2593750, 2692016, 2708059, 2738463, 2866736, 2985606, 3119914, 3246394, 3226966, 3385115, 3340722, 3192936, 2936652, 2761320, 2835585, 2894434, 3021891, 3046566]
17975C046566Q5516J55088M9419J35816J80949k9607j12536o3891o3480j60906
17965C222934N1393k6804j8226l5959J19666J50314M5603K6922O2340J81190K28495
17954D007868K33902P0557P233K08152L56870K28039K82086K42455L71490M58283
17944F466935O21445Q25753J035627J133383J385252J833055K101986K645889
17936A8049325L561337M523731N094599N444039N341625M620149L439676J276173
17928E1350654p93276k006297j375622M94960L180537O553555J0580529J6415596
17920H4400636K4793841L4937286M4646696N1623756N3078956M8423112L7968419
17913C79872702J6330227q727377l3962974m8047315n0775760m4387222l3210826
$$ y = [3046566, 3132082, 3287170, 3336589, 3472405, 3653354, 3623747, 3511211, 3447320, 3383840, 3222934, 3274327, 3247523, 3229297, 3193338, 3313004, 3463318, 3508921, 3535843, 3598183, 3779373, 4007868, 4241770, 4312327, 4319560, 4527712, 4884582, 5112621, 5394707, 5637162, 6008652, 6466935, 7088380, 7914133, 8949760, 10083143, 11468395, 13301450, 15403436, 18049325, 21610662, 26134393, 31228992, 36673031, 42014656, 46634805, 50074481, 51350654, 50557378, 48551081, 47175459, 47670419, 50850956, 57404511, 67985040, 84400636, 109194477, 144131763, 188778459, 240402215, 293481171, 341904283, 379872702, 396202929, 387475552, 353512578, 305465263, 254689503, 210302281, 177091455]
17906A77091455k0785199r805464j524011K966799L926342K457867m89198o273390
17898A47565201j2296114j6711560j7319033j4952277j1195575p789880n246668
17891F2054094l650498k816182k389951k197373j774385j262710r88766p25327
17883D6248902j98369M57349J083053K142017L830868O080871Q615537J0972841
17875G9233069J2166346J1807736J0220075P606328L185004q17135l037355r71825
17867A19392243M956810J3154884K2278895L0307033L5732366L6345401L1239433
17860B93407065J9941785O503183r651063k7405762l9871641m5554694m0846952
17853A56521921l1285986k0929056j3037233q176442n480808l558938k224108
$$ y = [177091455, 156306256, 146500792, 144976781, 147943580, 151869922, 154327789, 153838591, 147565201, 135269087, 118557527, 101238494, 86286217, 75090642, 67300762, 62054094, 58403596, 55587414, 53197463, 51000090, 49225705, 47962995, 46974229, 46248902, 46050533, 46507882, 47590935, 49732952, 53563820, 59644691, 68260228, 79233069, 91399415, 103207151, 113427226, 121033554, 124218558, 123401423, 120364068, 119392243, 124349053, 137503937, 159782832, 190089865, 225822231, 262167632, 293407065, 313348850, 319852033, 310200970, 282795208, 242923567, 197368873, 156521921, 125235935, 104306879, 91269646, 83093204, 77612396, 74053458, 71829350]
17846G1829350j257783p26189n90830p13626j079667k394606l790504m904598
17838E6371547n129971m527785l790152l027622k494512k100166k018572j933123
17830C1349644j818260j421733j240004j145327j108368j008918q52343q01981
17822B1952710p55597p29158n11358n98012o53207n33249n74597o64672n88699
17813A6344161m77799n26373m72751m93012n57834m72884l07751l55689l33048
17804A2347020m91859m11866l12779k53366j79676m37033l13747j26117r1968
17795I728609j35339j76267q2282p5146j54906l4589j58962l21666l29918j65685
17785H093849j41259l07314k78966k85930j02770j15075j11336j9364r0328j56654
$$ y = [71829350, 70571567, 69845378, 69254548, 68540922, 67461255, 65066649, 61276145, 56371547, 51241576, 46713791, 42923639, 39896017, 37401505, 35301339, 33282767, 31349644, 29531384, 28109651, 26869647, 25724320, 24615952, 23607034, 22754691, 21952710, 21197113, 20467955, 19956597, 19358585, 18705378, 18172129, 17597532, 16932860, 16344161, 15866362, 15339989, 14867238, 14374226, 13816392, 13343508, 13035757, 12680068, 12347020, 11855161, 11443295, 11130516, 10877150, 10697474, 10260441, 9946694, 9820577, 9728609, 9593270, 9417003, 9334721, 9259575, 9104669, 9070080, 8911118, 8589452, 8259534, 8093849, 7952590, 7645276, 7366310, 7080380, 6977610, 6862535, 6751199, 6731835, 6641507, 6484853]
17775F484853j88837n1157p5297q6417j47287k68010j66069n9570j75612r9639
17765E166958L8198l2387j95510k48361o7148j9541r7121j88581q9499o031Q5127
17754D346104q2243k37526j25286o7014J1322O2540J28615K2924O7244P2517J76633
17743D375830K1570J01794L20912K06680J84183J92114J00732O1656L4738Q9871
17733E690080J27092N0333N5575M66369M38205L90456N67220P13829J048246J501117
17723A1048522J922036K383391L675523N497674Q311591J1351680J2065532J0049951
17715F6305900J0641075J1659504P741300K808580k186630l533872L2105J954317
17707I5422279l921407j1558823j6526449j4132803r040581n557115l756507k406441
$$ y = [6484853, 6296016, 6244859, 6169562, 6083145, 5935858, 5667848, 5501779, 5442209, 5266597, 5166958, 5205156, 5172769, 4977259, 4728898, 4661750, 4642209, 4545088, 4356507, 4267008, 4260977, 4346104, 4263861, 4026335, 3901049, 3834035, 3845357, 3907897, 4036512, 4059436, 4126680, 4199197, 4375830, 4397400, 4499194, 4820106, 5026786, 5210969, 5403083, 5503815, 5565471, 5600209, 5690080, 5817172, 5867505, 5923080, 6389449, 6827654, 7218110, 7785330, 8499159, 9547405, 11048522, 12970558, 15353949, 19029472, 24527146, 32838737, 44190417, 56255949, 66305900, 76946975, 88606479, 96347779, 99156359, 96969729, 93435857, 93467962, 95422279, 91500872, 79942049, 63415600, 49282797, 40242216, 34685101, 30928594, 28522153]
17699B8522153j620072j194138q71389p57650n96296j38669L58807Q16507J373126
17690B5892379K290357L957538O088551Q784685J1275432J0436595R053075J0966686
17682H8745298J0081904O077973J226438k261819j484675L174689K703072k793933
17674A05468947q102303p329796q85608K688728L882581P466632P115368L059808
17666A13364357k014411n435614m393333j90305j094432p200545j3557083j5419899
17658F4058735j1570856p492753n030867l386486k210716j743003j676555j404474
17650B9543025j056912q00563m07447J6029N96921J102321K181807L813343O302262
17641D1290786R438442J0531305Q480680Q476876J0153823P063438K682780k339226
$$ y = [28522153, 26902081, 25707943, 24836554, 24078904, 23482608, 23343939, 23702746, 24519253, 25892379, 28182736, 32140274, 38228825, 47013510, 58288942, 68725537, 77778612, 88745298, 98827202, 104905175, 106131613, 103869794, 102385119, 105559808, 108262880, 105468947, 97366644, 90036848, 89151240, 91839968, 95722549, 103189181, 110304549, 113364357, 111349946, 105914332, 101520999, 101330694, 100236262, 93035717, 79478634, 64058735, 52487879, 44995126, 39964259, 36577773, 34367057, 32624054, 30947499, 29543025, 28486113, 27685550, 27278103, 27294132, 27891053, 28993374, 31175181, 34988524, 41290786, 50729228, 61260533, 69741213, 78218089, 88371912, 95435350, 98118130, 95778904]
17633I5778904m428637j817423J477236k461404r181561j4809395j3957318r573580
17625D1026822n884266l984011k809282k014850j652378j521706j494354j327901
17617B0338074j081778r37907p55727o54010p26603o96203n25764m92686m41487
17608A4025909l84196l57238n11924l31959j66444k77744j2339l4849P0601J05258
17598A2125075P6807R5391J63043K31851N00018M45146N17402P89829J086621
17589A6031183J482132K132437K946568M450511O715131J0025717J3885851J5365246
17581G3034776J4497812J7044032K0715372J9140282J4411738O490987M886077
17574A70221076J0129762Q023909k874275j5647252k2242518j6821254q997849
$$ y = [95778904, 91350267, 89532844, 91010080, 88548676, 79367115, 64557720, 50600402, 41026822, 35142556, 31158545, 28349263, 26334413, 24682035, 23160329, 21665975, 20338074, 19256296, 18318389, 17562662, 16908652, 16182049, 15485846, 14960082, 14467396, 14025909, 13641713, 13284475, 12772551, 12440592, 12274148, 11996404, 11984065, 11949216, 12019817, 12125075, 12201882, 12297273, 12460316, 12692167, 13192185, 13637331, 14154733, 14944562, 16031183, 17513315, 19645752, 22592320, 27042831, 33757962, 43783679, 57669530, 73034776, 87532588, 104576620, 125291992, 144432274, 158844012, 165334999, 170221076, 180350838, 188374747, 185500472, 169853220, 147610702, 130789448, 121791599]
17567A21791599r395952j3656282j7638103j5714618j0983687p265439n165931
17560D1971587l893543k974228k528111k172140j887958j693057j499255j269041
17552B4054254j009224r88048q07600q50948o22753m30248m47699l22159k33589
17543A8341986k39607m1764J98693K39975L06132N35685Q96178J395946K125314
17534B3758538L145904M753124P314986J0877760J3756390J3682181J3584107
17527I0872990J7547546J8559775J5857591R230124L767638O812093R672177K980125
17519A75300059q789395j8981247j9100035j1094485p510459j0533583j5172493
17512H4118362j6429425j2487088q358843n659288m141620l187963k501231k136459
$$ y = [121791599, 112395647, 98739365, 81101262, 65386644, 54402957, 47137518, 41971587, 38078044, 35103816, 32575705, 30403565, 28515607, 26822550, 25323295, 24054254, 23045030, 22056982, 21249382, 20398434, 19775681, 19345433, 18897734, 18575575, 18341986, 18102379, 18060615, 18259308, 18499283, 18805415, 19341100, 20237278, 21633224, 23758538, 26904442, 31657566, 38972552, 49850312, 63606702, 77288883, 90872990, 108420536, 126980311, 142837902, 152068026, 155835664, 162647757, 172319934, 175300059, 166510664, 147529417, 128429382, 117334897, 109824438, 99290855, 84118362, 67688937, 55201849, 46843006, 41183718, 37042098, 33854135, 31352904, 29216445]
17504B9216445j932665j845454j624042j319007j078461j174597j196289j033868
17496A8012062r37414q42575q00882o00202n95157n96165n91692n59985n10864
17487A1977126m24985l99822l34817k34570l20333k75600k43423k82646l13828
17478I147102l57573l25808j85133k11257k38227k65257j65385p1820k35264l42619
17468F748759k39049k61738k49015n2330k09858k46012k20410j00260j3804j15221
17458E041062k19968k11273j28994q6275o1593n7291l6743j43243j05692o4332
17448C925658q5057o5539o0790j13685P9797L2292m7519k1037k5464m2615J33575
17437C709616l384k37530j72255k23371r1552k5075P379j05202j39752j91558
$$ y = [29216445, 27283780, 25438326, 23814284, 22495277, 21416816, 20242219, 19045930, 18012062, 17074648, 16232073, 15431191, 14830989, 14235832, 13639667, 13047975, 12487990, 11977126, 11552141, 11152319, 10817502, 10582932, 10262599, 9986999, 9743576, 9460930, 9147102, 8789529, 8463721, 8278588, 8067331, 7829104, 7563847, 7398462, 7326642, 7091378, 6748759, 6509710, 6247972, 5998957, 5946627, 5736769, 5490757, 5270347, 5170087, 5156283, 5041062, 4821094, 4609821, 4480827, 4394552, 4332959, 4275668, 4238925, 4095682, 3989990, 3925658, 3840601, 3775062, 3714272, 3600587, 3680384, 3712676, 3665157, 3644120, 3618656, 3576041, 3709616, 3706232, 3468702, 3296447, 3073076, 2981524, 2956449, 2963828, 2858626, 2718874, 2527316]
17427B527316j63058j28774K2881m6848p3641k7928q1318j38969m3202j02913
17417A743546J9784R0447N9361L8116P8730R3827O0573O1013R6892R3475k4743
17406B411021l3194n9931m3121O9558J2301Q3944l225j14265R8170q345p872J8536
17394B423577p6179Q718N894l7230j52345j29849r4102k6381p8963j43152j58532
17383A541456q6126J896J1657L4863l3532j32590J24015l0622l4011k28893j88322
17372I79791M3512l193l4330J6168M1916J4490j7147J5704p9278k253L2051J02396
17360A109827R2455K5634J24758J99966J17790j06711J1655J05343j05266j22992
17350A452459O6706j24644k73733j98279j07943p6426O0956J49156J86329J02361
$$ y = [2527316, 2364258, 2235484, 2258365, 2211517, 2137876, 2109948, 2028630, 1889661, 1846459, 1743546, 1763330, 1853777, 1913138, 1951254, 2029984, 2123811, 2184384, 2245397, 2342289, 2435764, 2411021, 2377827, 2317896, 2274775, 2344333, 2356634, 2440578, 2437353, 2323088, 2421258, 2412913, 2405041, 2423577, 2347398, 2356116, 2362010, 2324780, 2172435, 2042586, 1948484, 1922103, 1843140, 1699988, 1541456, 1455330, 1457226, 1468883, 1503746, 1470214, 1337624, 1461639, 1431017, 1397006, 1168113, 979791, 1023303, 1020110, 985780, 1001948, 1043864, 1058354, 1041207, 1056911, 977633, 975380, 1007431, 1109827, 1202282, 1227916, 1352674, 1552640, 1670430, 1563719, 1575374, 1680717, 1575451, 1452459, 1519165, 1394521, 1120788, 922509, 814566, 738140, 799096, 948252, 1134581, 1236942]
17340A236942p9301l8281J36614K49692P8009j312j00211r4394P5499j3686k10234
17329A239337j74463m8917J3039l5979j01410J2198m6537j56305r020k2102l40
17318F69501N5347j7014j39435J9207r297j27116K5210L748n4231J18637j097
17307E43460o4407L4176L5737J8136j40349O042L4151L967m6041q836m8357p2238
17295B95441j05439q975N9092K2729P5997R0668J15258l2724j1348o810m0690
17284D53199l223K10o1439l5036J0390j27256J2934j12596j9760M3090N075N0369
17272B15957N2150J19359J13404r0246r7427o1610K7142L4539l167j0463r9299
17261B00339J18906O6921L6807K0950N735k9035j89714p3397J08537N1184j13612
$$ y = [1236942, 1157641, 1119360, 1255974, 1505666, 1583675, 1582363, 1482152, 1387758, 1463257, 1449571, 1239337, 1064874, 1015957, 1028996, 993017, 891607, 903805, 857268, 700963, 691943, 669841, 669501, 724848, 707834, 568399, 587606, 578309, 451193, 476403, 480151, 425920, 544557, 543460, 479053, 513229, 548966, 567102, 426753, 432795, 466946, 470913, 424872, 416036, 367679, 295441, 190002, 181027, 240119, 262848, 338845, 429513, 544771, 512047, 500699, 493889, 453199, 449976, 450186, 388747, 353711, 364101, 236845, 249779, 137183, 117423, 160513, 165588, 215957, 268107, 387466, 500870, 410624, 313197, 251587, 278729, 313268, 310101, 299638, 200339, 319245, 386166, 422973, 443923, 449658, 420623, 230909, 157512, 266049, 317233, 203621]
17250B03621j16855L6677J57372P8058n6245J13064o6361j57516o7061R6543J707
17239B23004L0172n0420k5652j08048k11776M2923O3575K19524Q0113K7374l5955
17228B54834q3211j33490j9732n3917O1894P8208j00650j005m147P145J14614
17217A20543M3669j7082M3292m5462n3382J7045R6594J3987L4064M9838M167O8892
17205C76165q7837o1664m3906Q6599N1809P5583L782q1393M9500l6920k1382O784
17193C17120K7790M7067O3184O1630R8048N922M2562k6334r6050n0831J5742J16492
17181F22342j3016r731r6971j1787j30149j26173m8334K9890O4993l8505R460
17170B52019J3739q33n8627m0492M1148n3860o7646k9639J35336J55073n6508
$$ y = [203621, 86766, 123443, 280815, 358873, 302628, 415692, 349331, 191815, 124754, 221297, 223004, 253176, 202756, 177104, 69056, -142720, -99797, -36222, 183302, 263415, 290789, 254834, 171623, 38133, 18401, -35516, 26378, 104586, 3936, 2931, -1216, 5929, 120543, 164212, 147130, 190422, 144960, 91578, 108623, 205217, 219204, 253268, 303106, 307273, 376165, 288328, 226664, 182758, 269357, 321166, 396749, 400531, 319138, 368638, 331718, 310336, 317120, 344910, 391977, 455161, 516791, 614839, 620761, 663323, 636989, 540939, 490108, 505850, 622342, 609326, 599595, 502624, 490837, 360688, 234515, 186181, 216071, 281064, 242559, 252019, 265758, 264925, 206298, 165806, 206954, 153094, 85448, 55809, 191145, 346218, 289710]
17159B89710l6459J02692K02054J15020Q577K6100Q9773Q2012j414Q2636P4474
17148A035175m5497q4545m064q2556j436l8343n368o0447j9623n6573K0756K1763
17136F79242r0202k33478J862Q8786q3076j01247q3926r465L7838j5080j03757
17125H7497K6584J02685Q6059M7120J288j87463r1136J01779J08537n0310J0292
17114B42932O6423L5206N0400J29488p8951j06942J39727Q3475r706P578n3215
17103E06415k5186l8573n8616m2772n6556j6260N1128q126k6110J28602j42262
17092B71684j18191P1501L9774j20211M532R7933J2803L452L0424L3002m9236
17081B77467O4163M4365m2890k19073j33577J12770K4674Q3678k4265r2075l6125
$$ y = [289710, 253251, 355943, 557997, 673017, 681594, 707694, 797467, 879479, 878065, 960701, 1035175, 989678, 905133, 901069, 818513, 817077, 778734, 773366, 712919, 693296, 636723, 657479, 679242, 589040, 355562, 357424, 446210, 363134, 261887, 177961, 168496, 206334, 191254, 87497, 114081, 216766, 302825, 349945, 351233, 163770, 72634, 174413, 282950, 232640, 242932, 309355, 344561, 394961, 524449, 445498, 338556, 478283, 561758, 552052, 559630, 506415, 481229, 442656, 384040, 341268, 284712, 268452, 319580, 311454, 285344, 413946, 271684, 153493, 224994, 264768, 144557, 149089, 247022, 259825, 263277, 293701, 326703, 277467, 341630, 385995, 343105, 124032, -9545, 103225, 127899, 211577, 187312, 95237, 59112]
17070E9112K192n4876j32710O1387J73040N4623o6649Q4R3966P1335o8621L4814
17058B27697J5076j80443p4926J15664J74415J01414J06212J91986J29607K7727
17048H34429J2638n921n0597O5461K64796J02121p1979k54955j68193k4564N0169
17037G53405o3999j54300j24732p0278q5362P4695J28539k16961n8898J7528q619
17026A91018P4691o0691o6879j07540p8717P7262K35845l3049p0491M9213l5349
17015A75313K0521M7323p537J0783p1668K9059n9834r659j2984R9815L6885k4208
17003B33809J21447J5159J17531J40703L3098O2717P8496J1078J06664P2832k5140
16992I68394R964L362k5622R018j11407j10187M5012K6585q2030j66930q8986
$$ y = [59112, 61304, 6428, -126282, -64895, 108145, 162768, 96119, 96203, 190169, 261504, 192883, 227697, 242773, 62330, -12596, 103068, 277483, 378897, 485109, 677095, 806702, 834429, 847067, 841146, 790549, 856010, 1120806, 1222927, 1150948, 895993, 727800, 703236, 753405, 689406, 535106, 410374, 340096, 254734, 329429, 457968, 241007, 182109, 199637, 191018, 265709, 205018, 138139, 30599, -48118, 29144, 264989, 231940, 161449, 210662, 175313, 195834, 243157, 235620, 246403, 174735, 203794, 143960, 134301, 121317, 221132, 258017, 233809, 355256, 370415, 487946, 628649, 661747, 724464, 802960, 814038, 920702, 993534, 968394, 978358, 981720, 956098, 965116, 853709, 743522, 788534, 815119, 733089, 566159, 477173]
16981D77173j48967l505j28188j30617k8582L7241L3252o6918M323K9573J72731
16970B47516M0402n8162M037j2762r4569p5285r4752m6069K1537P407n7501o1056
16958a79257J2590J24940N8196P3361j14308R567m1437o1089J1973N4376R4917
16947D3829N6543J7152j0966o9842J07952N1537n7017L6634l6497j38588l6387
16936c5650L6918N5769J2576n7376j68781m8217R7493O3454k838m8383P2921J54038
16924A31924R6304k5563l7312p9256j7489O9954M82M9513L875j47496r6603l4403
16912h6070l2537L8541R7118l676J05981j6666j22315K6621Q9643k6625M473M2885
16900A17373M6231J15874o4555j34454j35207k6413P2209o0862j60133P2082R1172
$$ y = [477173, 328206, 324701, 196513, 65896, 37314, 74555, 107807, 40889, 45212, 74785, 247516, 287918, 229756, 233793, 221031, 126462, 51177, -43575, -89644, -68107, -60700, -118201, -179257, -166667, -41727, 16469, 89830, -24478, -14911, -56348, -117437, -105464, -51088, 43829, 100372, 117524, 106558, 36716, 144668, 196205, 139188, 175822, 139325, 737, -35650, 1268, 57037, 69613, 12237, -156544, -204761, -107268, -43814, -46652, -95035, -22114, 131924, 228228, 202665, 165353, 86097, 68608, 138562, 139044, 188557, 192432, 44936, -51667, -86070, -118607, -80066, 17052, 13376, 119357, 102691, -19624, 6997, 96640, 70015, 74488, 117373, 163604, 279478, 214923, 80469, -54738, -81151, -8942, -69804, -229937, -157855, -66683]
16889f6683k0793q007M0868J09119J10772r0031j6805k5712r2859O2900O6378
16878F9147K3645r2896j31709Q0279M6979r3434l0655n2213m7842K4385J25308
16867g9006J32030Q1430m5828J0108j14354k9121k4747j51996J8886J83763N8119
16856C9284Q3005q5989J2131N502N7424Q578j04228N411L7949J7196k3519o711
16844D6033P3332n5717k5200j08146O143j1162L8706l1736n0491J09379J67205
16833A58346M5425q9355q1451j4334m5368l456M1392Q1747L0365p6427J45328
16822A92212M8635k47282o7840L9266l6112J19881K9396n096j8356L2694j9258
16811F8140n6930N330P1423p6513r4821J24567L4230k1111k8171j02743n6355
$$ y = [-66683, -87476, -95483, -54615, 54504, 165276, 75245, 58440, 32728, -60131, 2769, 69147, 92792, -104, -131813, -51534, -4555, -97989, -128644, -180857, -228699, -204314, -79006, 53024, 134454, 88626, 98734, -15620, -44741, -69488, -221484, -202598, -18835, 39284, 122289, 36300, 48431, 53933, 111357, 119935, 15707, 21118, 59067, 76263, 52744, 46033, 119365, 63648, 38448, -69698, -63555, -74717, -36011, -67747, -118238, -8859, 158346, 203771, 114416, 32965, 18631, -26737, -30193, 11199, 92946, 123311, 46884, 192212, 240847, -6435, -74275, -35009, -71121, 48760, 78156, 73060, 54704, 87398, 68140, 11210, 16540, 87963, 11450, -83371, 41196, 75426, 54315, 26144, -76599, -132954]
16800a32954j7683q82M7027j1884L709n4490o2364m1509k6421k6886J09869J07832
16788a06636j5689J22925J9012j0077J65646J11578N7091m1323L4860J3847j28300
16777B22934j39165j26559o0071M1498K8130l3341j2216M5314N4336l731j50428
16766a33299j7302m0535J0043R7200n277r5283l4049J27734O6762j2818l4230
16755g1054K1903J5692j16779J03023O2631O5273l7180p6190n8513j6088k3121
16744a30403J4512J05728j23285o8476l5583J14628R0900J12293j1031L8771P7148
16733A85202M777N6423L3754j2827j16418r7533r5277J0944r6075L4269O0014
16722c2747P3019M1308p1333o7328K9893n1537k250L9691l803q090j27711k7065
$$ y = [-132954, -150637, -151519, -104492, -116376, -112667, -167157, -229521, -271030, -297451, -324337, -214468, -106636, -122325, 600, 19612, 9535, 175181, 286759, 343850, 302527, 337387, 351234, 222934, 83769, -42790, -102861, -61363, -33233, -66574, -78790, -33476, 20860, 17129, -133299, -150601, -191136, -181093, -83893, -89170, -184453, -218502, -90768, -24006, -36824, -71054, -49151, -33459, -150238, -47215, 15416, 80689, 43509, -32681, -91194, -107282, -130403, -115891, -10163, -133448, -201924, -237507, -122879, -31979, 80314, 69283, 108054, 185202, 189979, 246402, 280156, 267329, 150911, 53378, -41899, -30955, -127030, -92761, -32747, 40272, 81580, 10247, -57081, -27188, -78725, -80975, -41284, -45087, -53177, -180888, -207953]
16710b07953P883j4972o1660J69211J55057l1922j75689q1249J5089K06098Q2010
16699F1903j06458j9954j4639J45862M4710p0539j04918j21906J6217O812J05272
16688e7638J299q6194l3981J05661N7245l2184p2435K2930J07384j7080l3939
16677c8932N1988r1856m1104j8139K2872L9457N5427l7172r1752m2787Q1401R8710
16665a1887j50510k021J19133M2347l5673n8549m2904N7741J34911N9000J4064
16654A25652L9251n9536j23142Q2671o4404l9949k5231j4102o5388Q9662J17395
16643F2879N2605k44j19036p0541R665Q6141L5848r4862m3723l310M3167k892
16631d4303P0435n2891k9467J5804j1048J82046Q4709j22043n9491m6416M0394
$$ y = [-207953, -200070, -215042, -276702, -107491, 47566, 15644, -160045, -241294, -226205, -20107, 61903, -44555, -64509, -79148, 66714, 111424, 40885, -64033, -185939, -169722, -162910, -57638, -56339, -142533, -176514, -70853, -13608, -45792, -118227, -95297, 12087, -4993, -38932, 13056, -78800, -119904, -138043, -115171, -75714, -20287, -57459, -149211, -191998, -110597, -11887, -162397, -164418, -45285, -2938, -38611, -97160, -140064, -82323, 52588, 111588, 125652, 164903, 105367, -17775, 64896, 492, -39457, -64688, -78790, -144178, -54516, 62879, 115484, 115240, -3796, -74337, -64672, 21469, 57317, -37545, -81268, -84578, -41411, -44303, 26132, -26759, -56226, -40422, -51470, 130576, 215285, 93242, 33751, -12665, 27729]
16620B7729J67140o894j53154o4399J1711n2382J0392N8094K773o0819L7229N413
16608a7167L3243J56945n7145m4445N9439k2827p9350p0448P1496J08048O3232
16597B01021j76222j52515L4186N9507J7908M8038M1122O1523J4205j70829O2984
16586D0928J08830L9440J0776r2846m4625J0289l54k4093K9271l3099k8624P4551
16574I0444j30023j06912P7190P8959j1250K9089Q4703J9814N5459N909k407J4399
16562B05374p9273m557O054j6691L5308n1814k46490O6951P5882k0464L3014j185
16550B109N385k509Q0733o2085j37526Q3036Q5512N6516J3260p3476K6588J2235
16538H9778l830N9382M3477k3730r3893n9065j28479k520Q2306m3706l4946K8598
$$ y = [27729, 194869, 187975, 34821, -29578, -17867, -70249, -59857, -1763, 1010, -59809, -22580, -17167, 16076, 173021, 115876, 71431, 130870, 108043, 28693, -41755, 29741, 137789, 201021, 24799, -127716, -93530, -34023, -16115, 31923, 73045, 134568, 148773, -22056, 40928, 149758, 189198, 199974, 107128, 62503, 72792, 72438, 48345, 77616, 44517, 15893, 90444, -39579, -146491, -69301, 9658, -1592, 27497, 112200, 132014, 187473, 193382, 190975, 205374, 126101, 121544, 127598, 110907, 146215, 94401, -152089, -85138, -9256, -29720, 3294, 2109, 7494, 4985, 85718, 23633, -113893, -30857, 54655, 111171, 124431, 50955, 77543, 89778, 85948, 145330, 188807, 165077, 71184, 12119, -116360, -118880, -36574, -80280, -115226, -86628]
16526h6628q131J581Q6831J4996n2389P5849M5243j09952Q9210R6665M239j72936
16514a5422l4958L5051K9560Q1221K1934j10673O4337l2563p5183K2734J00590
16503H6628o0124j50184O798L3671L9224O1232q377j05536m0950j7237K2285m0314
16491a72884L5922Q2643m7981j0836J06517J38846p2752o3020r0851K8195R0414
16480B4213N063n5283N4296M2679m6691P455J03052p2269r8967l2112j4272J7229
16468f5607N8169N7386K1076k7460p2487j0503m9458J3263N1910l9671L4220J62328
16456A33166l0290l8814q9791j9540k503J23929J01051k2074N3927p9633j18029
16445A1399K7701J1052K9882n9309j68211k7088Q7012j5440j7637o7392p2972
$$ y = [-86628, -94759, -93178, -6347, 8649, -43740, 32109, 77352, -32600, 56610, 153275, 157514, -15422, -50380, -15329, 14231, 95452, 117386, 6713, 71050, 38487, -36696, -13962, 86628, 26504, -123680, -116882, -83211, -43987, 17245, 8868, -96668, -137618, -154855, -132570, -172884, -136962, -54319, -102300, -113136, -6619, 132227, 59475, -3545, -94396, -66201, 24213, 29276, -26007, 28289, 70968, 24277, 31732, 134784, 62515, -36452, -68564, -82836, -65607, -7438, 49948, 71024, 43564, -28923, -39426, -88884, -75621, -23711, -63382, -29162, 133166, 102876, 64062, -25729, -45269, -47772, 76157, 177208, 155134, 209061, 129428, 11399, 39100, 50152, 80034, 20725, -147486, -174574, -87562, -103002, -120639, -188031, -261003]
16434b61003P6245Q4949j6992n391O918j7299K0149R8707k5381K1798R632M3699
16422C6031L1377n7386n5154R7534O8090p7655n6265K6718R3568L2370m5832j27282
16410c3886j43926l1832J48332M1012P9627Q5529k8275j29303q6296Q8088M9409
16399C8479J5249J02355K5932k5811n2251l7967j4147n3198m5833R3803p068j26812
16387h7269j7976L8923L7278q5384k5292M6116m8008k5570N9035M226p6431k2116
16375b02468N5639J15271P7638Q9304J15188o3584M8692n5463m5168O2856P5548
16364B73453j24314j09205L1285L9986k1096q6629o5289N0558k6592O2726N9743
16353H4626K5352m0717l899p9948j51884J15230R1998N0267m6414o3501n8793
$$ y = [-261003, -184758, -99809, -116801, -122192, -115274, -132573, -112424, -13717, -39098, -17300, -7668, 36031, 67408, 10022, -45132, 52402, 120492, 42837, -13428, 13290, 106858, 139228, 93396, -33886, -177812, -209644, -61312, -20300, 59327, 144856, 116581, -12722, -99018, -10930, 38479, 53728, 156083, 182015, 156204, 103953, 65986, 51839, -1359, -47192, 46611, 39543, -87269, -105245, -66322, -29044, -114428, -139720, -93604, -141612, -167182, -108147, -103921, -180352, -202468, -146829, -31558, 46080, 135384, 250572, 186988, 235680, 180217, 135049, 197905, 273453, 149139, 39934, 71219, 111205, 90109, 3480, -61809, -11251, -37843, 24883, 84626, 109978, 69261, 65362, -14586, -166470, -51240, 40758, 91025, 44611, -18890, -77683]
16342g7683P9353o3755j87883p7285J42572P5718J7359k3766J1216N6712J071
16331d6371j9727j39064k7275P1859J28942L5769L5407O3645K5676j3005n2621
16320F3235M2390J7705o1886j3958l0694l4956J08079Q5031Q0714m7898j11727
16309I6035k19246M5124J63654J5382L9740J2898M1357K8277j6908j28319k5114
16298E2880p9018q2871j68446k4545N8417J84524j1670K3354N8176K9403L5266
16287G5470m6437L0403J14181L564j9963l7952J3572r1041n3819o3367o0245m2113
16275a77747J8943Q9798p2049m0551J30870J07862J15559j52437j45808L6753
16265h8807j2067L0908M2152P4603O4346m870P1524l9750j35598j52643r3212
$$ y = [-77683, 1670, -62085, -249968, -327253, -184681, -108963, -91604, -115370, -104154, -47442, -46371, -66098, -205162, -232437, -160578, -31636, 4133, 39540, 103185, 128861, 115856, 63235, 105625, 123330, 61444, 47486, 16792, -18164, 89915, 174946, 255660, 207762, 96035, -123211, -78087, 85567, 100949, 140689, 153587, 194944, 223221, 206313, 77994, 52880, -26138, -109009, -277455, -302000, -243583, -59059, -70729, -47375, 10801, 40204, 75470, 29033, 59436, 173617, 177181, 157218, 119266, 132838, 41797, -12022, -75389, -135634, -177747, -158804, -69006, -141055, -181606, -50736, 57126, 172685, 20248, -125560, -88807, -100874, -69966, -27814, 46789, 111135, 106265, 177789, 138039, 2441, -150202, -243414]
16254b43414l3343k9560K42395J02480j15450M236q6476n0291P5993J39973J5395
16243B1938M197K6247N8817J23794M2606P776k875j03698j22602j53586k4982
16232a22368o1767m6720J18356j7779l9417O147J0921m0669J65914K31391J768
16221B05777p5518J8450j47929o8063Q2806J40203J554k9858O3996r2360l7930
16210F1128k2302J6515q6480q7752N9515J05280k8229J6929J29730R0399r675
16199B45058j07318j22445M3467J6207o7159j13782J18407J1123k0226L4951m6121
16188g838O7207l3723l2416L7789k2516o79J24232o1951J3802m2695j15528o2276
16176a36592P2927N094j07213L0572N2134l599L7437l3977p1261l9819Q0473R1167
$$ y = [-243414, -276757, -306317, -63922, 38558, -76892, -72656, -159132, -209423, -133430, 6543, 21938, 26135, 52382, 111199, 234993, 277599, 285375, 282500, 178802, 56200, -97386, -122368, -184135, -230855, -112499, -130278, -169695, -163548, -152627, -193296, -27382, 204009, 205777, 130259, 148709, 780, -67283, 15523, 155726, 157280, 127422, 191418, 99058, 61128, 38826, 55341, -31139, -118891, -59376, 45904, 17675, 34604, 164334, 254733, 245058, 137740, 15295, 58762, 74969, 7810, -105972, 12435, 23558, 3332, 38283, -7838, 59369, 25646, -6770, 31019, 8503, 7824, 132056, 70105, 83907, 41212, -74316, -136592, -63665, -58571, -165784, -135212, -83078, -86677, -49240, -83217, -154478, -194297, -113824, -22657]
16164b2657K03q9198M8902R5136j016j58669o8597j1411P0029K2638O5391N5827
16152F578j1957Q8209l8605J6013K9974k163j05848n2479L7079n4913k4795J6484
16140i6423L6370J25637P0199j03320m0264J1882j17457K348m1579P9219M8101
16129b5287j03981k6402L7342p2828p5227O2196Q5826P638J537p2545l4188o5460
16117b81379J70268k4809L6819J33217j9818J2504j9395j09529q2893m0730M0992
16106a84753O5761L6796m7728l5490p8486J8815K1182k0543j9949J98502M4769
16095a124k58L0640R1425j43182m6595M4302J03028N6410k8207M5491j2555M0654
16083A80029L187p5448o8791M1393J3557o4447q6871k7911l7408L9832O0985o1158
$$ y = [-22657, -22454, -111652, -62750, 32386, 31370, -127299, -195896, -207307, -137278, -114640, -49249, 6578, -5379, 82830, 44225, 60238, 90212, 88049, -17799, -70278, -33199, -88112, -112907, -96423, -60053, 65584, 135783, 32463, -7801, 4081, -113376, -111028, -152607, -73388, -25287, -129268, -155670, -118328, -191156, -266383, -204187, -118361, -110723, -109186, -181731, -215919, -281379, -111111, -135920, -99101, 34116, 14298, 26802, 7407, -102122, -185015, -225745, -184753, -118992, -82196, -129924, -165414, -243900, -225085, -203903, -224446, -244395, -45893, -1124, -1382, 29258, 120683, -22499, -69094, -24792, 78236, 134646, 106439, 151930, 139375, 180029, 183216, 107768, 38977, 80370, 93927, 29480, -57391, -85302, -122710, -82878, -21893, -83051]
16071h3051j10791p8436O8590J70978O3049%n3596k3018J5777l3440N587m1828
16059a00179R3483J317L9038N7443l4302j7670q558r6661o2262L3305N9573L011
16047c2462R0228k2313j70237K3527J04330K9873J1027J4592k4091j4405j37577
16036a27508K3565P784p5464j1857J29365K07987J26615m7085m8321j01359j26891
16025d3169q3211q7650p8950J20364R8714P4888q26L6507M8071O9056j4661l4581
16013A04552j63292j4458J092l6713j04510M3980J12602J7244K6737n0800N3817
16002i749J20635p2100p927j08506k8997J5102l4110j12840n2773J99856P7916
15991a3493J4122N5016Q2686m210J354m2335J4540k8224j38375l8799o028J8582
$$ y = [-83051, -193842, -272278, -203688, -32710, 30339, 30339, -23257, -46275, -30498, -63938, -58351, -100179, -6696, -5379, 33659, 91102, 56800, 39130, 30572, -66089, -128351, -95046, -35473, -32462, 57766, 35453, -134784, -111257, -6927, 22946, 33973, 48565, 24474, 10069, -127508, -103943, -96159, -171623, -183480, -54115, 153872, 280487, 233402, 185081, 83722, -43169, -126380, -214030, -292980, -172616, -73902, 986, 160, 36667, 84738, 153794, 139133, 104552, -58740, -73198, -72106, -108819, -213329, -169349, -56747, -39503, -12766, -63566, -9749, 110886, 38786, 30859, -77647, -106644, -91542, -125652, -238492, -291265, -91409, -13493, 629, 55645, 138331, 134121, 135475, 93140, 107680, 79456, -58919, -97718, -103746, -85164]
15979h5164n8263j0190m5973P0170O4573l0644P0256J98592L916j20800M831n8698
15967B606p4412J35408N4174J21133M8283q1400r6148L8327j01555n4623J21142
15956A12935j2973Q8758j31096r1702n8296q7315J11389J58225J8234m662j50489
15945d6992n4978J43036K7276k4886N0669J0638j0983j13192l1874Q2334l5604
15934d556J4278Q3468n8668r4635Q8741j4151J026J16205K4900r5690j37541o5380
15922a42003M6022N7332N2730Q627N899n3619j08830k5165M7097k3507k5445J6559
15910a44303P474K4112J2611l5132N1172Q4586K7420n4147p9848m241J30113L8121
15898E7938o0640O343l9827m9018L1711J31964N3634q902J19822l3873L9172r5137
$$ y = [-85164, -143427, -153617, -199590, -129420, -64847, -95491, -25235, 173357, 177273, 56473, 61304, 2606, -71806, 63602, 117776, 238909, 287192, 205792, 109644, 147971, 46416, -8207, 112935, 99962, 188720, 57624, -34078, -92374, -179689, -68300, 89925, 108159, 103497, -46992, -101970, 41066, 68342, 43456, 94125, 104763, 93780, -19412, -51286, 31048, -4556, 9722, 93190, 34522, -60113, 28628, 14477, 15503, 131708, 156608, 60918, -76623, -142003, -95981, -38649, 14081, 22708, 28607, -25012, -133842, -159007, -111910, -135417, -160862, -144303, -136829, -112717, -100106, -135238, -84066, 520, 27940, -26207, -106055, -110296, 19817, 57938, -2702, 3641, -36186, -85204, -53493, 78471, 132105, 123203, 243025, 209152, 248324, 153187]
15886A53187k0967o4911J2138J945L2734j09349j13396k5132l5261N8675J05376
15875d961J15458M7302q9406J0851n8004j19914j3051J60783J68909j456q8281
15864A28230J2273j6447k4162j86351J8350o3250o8846Q2052L9438N4604l6634
15853f0743K3618P0461N537p5901J7127m646L728K2232N970O731j15276j06634
15841b07796O3635N1284M0476j8710N5050k6286J9520l4578m844k8038j50766
15830b41053J0878p8504N650J19660J19541k2434r5203M4185q7300o0461L8142
15819b46899O485J05351Q1802Q0323J37817j09436l1997n0692n7527n8228R5480
15808d7521Q5707r0891j57925M7418K04166O2193J629L1896k105j9564O9711k0016
$$ y = [153187, 132220, 67309, 79447, 81392, 114126, 4777, -108619, -133751, -169012, -110337, -4961, 110497, 157799, 68393, 79244, 21240, -98674, -111725, 49058, 217967, 216511, 128230, 140503, 124056, 99894, -86457, -68107, -131357, -200203, -118151, -78713, -24109, -60743, -37125, 33336, 38873, -37028, -19901, -24547, -20819, 1413, 7383, 14114, -101162, -207796, -144161, -92877, -52401, -71111, -16061, -42347, -22827, -57405, -62249, -90287, -241053, -230175, -308679, -303029, -183369, -63828, -86262, -181465, -137280, -224580, -285041, -246899, -240414, -135063, -53261, 27062, 164879, 55443, 23446, -27246, -84773, -143001, -47521, 38186, -52705, -210630, -163212, 40954, 103147, 104776, 136672, 134567, 115003, 184714, 164698]
15796A64698L044n5668j26255r5802J52062M5082j8223J5696j67923p8840L8689
15785a23440N0079J6235K2982J7942J20259N6917j23854l0026L0401r8975r8874
15774a60354j4356P9247M3937m6679J3158k0710n706M70n0322O4737Q0675J23824
15762A07921l5315M9265J05807J452p3399m3138o8517k8658J27930r1944k7553
15751B3851N8352Q6837N498j14978p6265j358k7398j8215j9337K5103J07338M1838
15739I1266o5443J9675m7360j77072P0296M8693O5522J01363N0309J7472O465
15728A81186n2630p5856j38101J06672P0727o7348L6998j05092r7220M7861J88182
15717I5379l4673n6371k8800p2727j30875J07454j3102R8787J0264M5887j32510
$$ y = [164698, 167742, 112074, -14181, -109983, 42079, 87161, 68938, 84634, -83289, -162129, -123440, -73361, -57126, -34144, -16202, 104057, 160974, 37120, 7094, 37495, -61480, -160354, -174710, -95463, -51526, -98205, -85047, -105757, -111463, -110993, -161315, -96578, -15903, 107921, 72606, 121871, 227678, 229130, 155731, 112593, 44076, 15418, 143348, 51404, 23851, 82203, 169040, 174538, 59560, -16705, -18063, -45461, -63676, -83013, -57910, 49428, 91266, 25823, 45498, -1862, -178934, -108638, -59945, 5577, 106940, 157249, 174721, 181186, 128556, 52700, -85401, 21271, 91998, 24650, 61648, -43444, -140664, -92803, 95379, 60706, 4335, -24465, -97192, -228067, -120613, -133715, -34928, -24664, 21223, -111287]
15706a11287j99408j1123P4263K5807q6651m5183K29444k043k8022m9405j07958
15695c11566K6328J49739O399o2910L865Q1287J16338O2511O8206n7618j4329
15684F8250J7103q948l3110J2499L9350n4550j63936L2687M9515j7701q851P1266
15672C574m2264M5508L6375N3599l6562q6597m5223L9498Q9816N24m8399J6954
15660B6803J0212J04611K2789j73813J7642J17744r0408r5909n0845M0546K1370
15649d9258m0465j05963N8240R8846J26919L7226m6345m1774r413L2576p2272
15638a1683j03559p2848k3191R1166n4739n4536k8821Q9013L3774P7819J44143
15627H6538J31266J1037j39934q9224k89L729q8180j19978r7130O4948M8134m7632
$$ y = [-111287, -310695, -321818, -247555, -221748, -308399, -353582, -124138, -126181, -154203, -203608, -311566, -285238, -135499, -129100, -192010, -188145, -106858, 9480, 71991, 140197, 82579, 68250, 85353, 76405, 43295, 55794, 95144, 40594, -123342, -90655, -41140, -58841, -67692, 3574, -38690, 6818, 43193, 96792, 60230, -26367, -71590, -32092, 57724, 58248, 9849, 26803, 37015, 141626, 164415, -9398, 8244, 125988, 35580, -60329, -111174, -70628, -49258, -89723, -195686, -137446, -38600, 88319, 125545, 79200, 37426, 28013, 60589, -11683, -115242, -188090, -211281, -120115, -174854, -229390, -258211, -169198, -135424, -57605, 86538, 217804, 228841, 88907, -317, -606, 3123, -85057, -205035, -302165, -237217, -189083, -236715]
15615b36715J17175K7172J2006n8403O4507J284j37172j10055O9012J65699Q8969
15604C479Q1124P7696o3954j6580p4446j03165o8856R0505K8132j9590m281L5917
15592c4019P926p894o0016J31283J10482q2987n0589Q021p3393J21473M8523m8249
15580G0561j11966O8882k0555j7701o8960R8305K1843r4489o5362k8401q2996
15569b30839j12933J03360P4140M5599K9679J2184Q5534J65564j02522o0100o3258
15558e3592n4315o6473J0880j2931k7528L6759P2367M3561j6778N8143M3060J4127
15546D7280J0836j18494j9138p6499p8937J10355n887r3572K2272M9390J01088
15535e1306N9394p9714R2578J02713n649j10656p7245o4264Q9846L9090N500m7683
$$ y = [-236715, -119540, -92368, -80362, -138765, -74258, -72974, -210146, -320201, -251189, -85490, 3479, 84603, 162299, 98345, 81765, 7319, -95846, -164702, -74197, -46065, -65655, -69936, -34019, -26093, -33987, -94003, 37280, 147762, 64775, 14186, 22207, -51186, 70287, 118810, 70561, -41405, 27477, 6922, -10779, -79739, 18566, 40409, -54080, -119442, -147843, -230839, -343772, -240412, -166272, -120673, -90994, -78810, 6724, 172288, 69766, 9666, -53592, -107907, -174380, -163500, -176431, -203959, -167200, -94833, -51272, -68050, -9907, 33153, 47280, 58116, -60378, -79516, -156015, -234952, -124597, -130484, -224056, -201784, -152394, -51306, 8088, -71626, 20952, 123665, 118016, 7360, -69885, -134149, -44303, -5213, 287, -47396]
15523d7396K5312Q758K693k8991m0641R533r3900Q0026P6859q7975j6997P8946
15511c3773N6798Q9381o4503r1271o6997p2694J0748p285r4119Q696L4270M3423
15499a87326l0759q4197J7757J25234J40134M2845m3568j3329N5875m5427J8285
15488d476J272O4009m3064j6683l786j14458q4020J7670J07464p4882K9001P4980
15476d6973n4794O5037P9849j4749j039j08858n8269J60654J2328q7855j07252
15465a61921R8517K0620N1039J01651j5769k9895k8918P0476m322p9018q2995
15454f0535o8382m3974N1826Q9838L3134q9339j9012J24726k1344K9811L0431
15443E7180K0599K9324o2204J7923n2549j5641L1206k0524m9310l2436r4432j0431
$$ y = [-47396, -22084, -13326, -10633, -39624, -80265, -70732, -164632, -84606, -7747, -95722, -112719, -33773, 23025, 112406, 47903, -43368, -110365, -183059, -172311, -179596, -273715, -265019, -230749, -187326, -218085, -302282, -284525, -159291, -19157, 23688, -19880, -33209, 22666, -22761, -4476, -3204, 60805, 17741, 1058, -2728, -117186, -201206, -183536, -76072, -150954, -121953, -46973, -101767, -36730, 43119, 28370, 27331, -81527, -139796, 20858, 33186, -54669, -161921, -63404, -42784, 8255, 109906, 94137, 64242, 35324, 105800, 101478, 22460, -60535, -128917, -172891, -121065, -31227, 1907, -87432, -106444, 18282, -3062, 26749, 57180, 77779, 107103, 44899, 62822, 10273, -5368, 25838, 5314, -43996, -76432, -170864, -181295]
15431a81295P9979l0960L4919j18657M3176M7407J43380k1575q702p9518l1037
15420a22883P5515J5678o0681J9276L1062N1023M3940J16666k414l0561j72903
15409c6282l3838Q0143P6607M4285j2149o7687j96532l4641L6936j4959L9495
15398a18622J3642j839m7953J10850J6883m2750j7624L6039j33853r4146K7574
15387b51799P0266R2738R6448K6093L4594K4217l7316j7157m6207k6172K0907
15376a3388m5406m7478q453O573J4060J9601M0408L6559K9934k2779n7064L8551
15364h882P6680N1047p1425K724J6634k1962M4714o1462M4517j6050j0632K8769
15352G4672j51085j68751n752l749N7101J30571Q1565p5055n2013M2137M0802
$$ y = [-181295, -101316, -132276, -97357, -216014, -172838, -125431, 17949, -3626, -12328, -91846, -122883, -47368, -31690, -92371, -73095, -42033, 8990, 52930, 169596, 167182, 136621, -36282, -70120, 10023, 86630, 130915, 118766, 51079, -145453, -180094, -143158, -158117, -118622, -104980, -106819, -154772, -43922, -27039, -69789, -87413, -51374, -185227, -279373, -251799, -181533, -88795, 7653, 33746, 68340, 92557, 55241, 38084, -8123, -34295, -13388, -58794, -106272, -114725, -108152, -94092, -74491, -34083, 2476, 32410, 9631, -47433, -8882, 67798, 118845, 47420, 50144, 66778, 44816, 89530, 28068, 72585, 56535, 45903, 74672, -76413, -245164, -250916, -254665, -197564, -66993, 14572, -60483, -112496, -70359, -29557]
15341b9557o1846Q11r694J7596Q5901K7020n5007q4869P573N8279J13017m2598
15329B6626p0696q2073M9570L2537j7610j40839m7066R1699N1258j01829P4833
15318a33590j6869q2406p3310J43184N5922q571r705O3977P6849q94J7625L4430
15306F6642j94154M0656J57237J3450j41343j23841Q5335Q0643l7510k3828n4937
15295a31650l1493M5303J08952R5263p18K232Q550o6064L1411O9086m2698o8760
15283A9414j22253k1098J03905J15895j3954j65636r0851N6945k8172p0169l8011
15272b53985R8748j0906N3270R4431k3241r6986L2082m0756L2787j44469l5787
15261b94812j2866J20358J61243O2272m8489m4364j6399L98O5682N4041k0087
$$ y = [-29557, -91403, -90592, -100286, -82690, 3211, 30231, -24776, -109645, -102072, -43793, 69224, 26626, -44070, -126143, -76573, -44036, -61646, -202485, -249551, -157852, -106594, -208423, -133590, -150459, -232865, -306175, -162991, -107069, -115640, -125345, -61368, 15481, 14587, 32212, 66642, -127512, -86856, 70381, 83831, -57512, -181353, -96018, -15375, -52885, -76713, -131650, -163143, -117840, -8888, 86375, 85657, 87889, 96439, 30375, 61786, 130872, 88174, 19414, -102839, -123937, -20032, 95863, 81909, -83727, -174578, -117633, -145805, -215974, -253985, -155237, -166143, -112873, -18442, -41683, -138669, -106587, -147343, -114556, -259025, -294812, -307678, -187320, -26077, 36195, -12294, -56658, -73057, -72659, -6977, 47064, 26977]
15250B6977k3133J4550o1641r2527j1616n1518j5213n1896L0502J01690P2896
15239f0929J44302J8809o3519k9271Q8984l5899k5623n3088j14292J13953P4610
15228E8037k767m2706J890j48875Q5552R2140j07393p7133O8406M9914j5841L4026
15216d750p1632M5054K4333O437O7769p3886q9816n9796J46477M2453j2520J76526
15204A96649J23254N076m7796k7372q4847j90379l7060j7713l7077m2669r1705
15193b51639P0194J4864r8696J30155K52262Q102j02356K3063r200j06216K0685
15182d8782j84023N257J15502N059J30415J20735p5508p8389j7125k5208j18675
15171a70742K50M7710J14245R5605R9584K5054n6160J01190j7739j7027M1353
$$ y = [26977, 3844, 18394, -43247, -135774, -147390, -198908, -214121, -266017, -235515, -133825, -60929, 83373, 102182, 38663, 9392, 98376, 62477, 36854, -16234, -130526, -16573, 58037, 55270, 12564, 14454, -134421, -48869, 43271, -64122, -141255, -72849, -22935, -38776, -4750, -76382, -31328, -6995, -558, 67211, -6675, -96491, -156287, -9810, 32643, 20123, 196649, 319903, 324979, 277183, 249811, 164964, -25415, -62475, -80188, -117265, -159934, -251639, -181445, -166581, -265277, -135122, 117140, 125242, 22886, 45949, 36749, -69467, -48782, -232805, -227548, -112046, -106987, 23428, 144163, 68655, -9734, -26859, -52067, -170742, -170492, -122782, -8537, 87068, 186652, 211706, 155546, 256736, 238997, 221970, 263323]
15160B63323J6387R196l4866n8431q0831q9587K0659j21377j46056j9203J13914
15149a26872k2139j5521R200K0565O7716k0552M9126Q0447M0982L4559K6154L6636
15137A80301O9999o4055o38K395n5842j41404j93828n2164J91905O6610r7339
15126i4060J4854M7903r0548m0473K3201L8861L707N5012K9029Q0248N4850M38
15114A23022j16870o3870k1461O9760L6930p2524j21209k9633P1116N7763o1145
15103a28121J0183P905O5849J98474Q2892j43130J02852O4458n5904k44130J817
15092c6855N7240P481K2952r3987n1039M2961N2156k0724J24821k4589N5450J5537
15080A51404o6957j31528r3700m942J11203J02415Q6496o8532p2241j196J1862
$$ y = [263323, 279710, 288906, 254040, 195609, 114778, 25191, 45850, -75527, -221583, -240786, -126872, -149011, -164532, -155332, -134767, -67051, -87603, -38477, 41970, 82952, 117511, 143665, 180301, 250300, 186245, 185607, 188002, 132160, -9244, -203072, -255236, -63331, 3279, -94060, -79206, -31303, -121851, -162324, -139123, -100262, -96555, -41543, -12514, 67734, 122584, 123022, 6152, -57718, -79179, -9419, 27511, -45013, -166222, -195855, -124739, -66976, -128121, -117938, -110033, -44184, 154290, 237182, 94052, 196904, 261362, 205458, -38672, -36855, 20385, 27866, 50818, -43169, -94208, -51247, 909, -19815, 105006, 80417, 135867, 151404, 84447, -47081, -140781, -145723, -34520, 67895, 154391, 85859, 13618, 12422, 24284]
15069B4284M8417m8242o53N6858o0446M1832K3029j07766l1892Q8113N0350j0596
15057G3288Q4493n6657Q871j48920o6758M543j8547J35532O0173m084l3837j44872
15045a06775l7771L4596Q5393P0871K0198j14990j798Q7706L5565l6107j5445
15034B1443k1513R331J12219O9221l1858j84368j02894j4344l2629K6979l2245
15023a80658O9814J11088J20951J08487m7536j70029L4137r1490n1872P4215L9442
15012A6549K3270r3860j4791M0902j09986m6437Q8612J09756P3618n3458q9342
15001e5167o0223J2664O8608J06984J16637N3564J26542J88260O9406M7699P2346
14990G47320J90318J47033l2484j87669j92500k89834k01975j10665K6801M384
$$ y = [24284, 72701, 24459, 23806, 80664, 20218, 62050, 85079, -22687, -54579, 33534, 83884, 73288, 157781, 101124, 109995, -38925, -105683, -101140, -119687, 15845, 76018, 71934, 38097, -106775, -144546, -109950, -24557, 46314, 66512, -48478, -50276, 37430, 72995, 36888, 21443, -70, 9261, 121480, 190701, 158843, -25525, -128419, -142763, -175392, -148413, -180658, -110844, 244, 121195, 229682, 182146, 12117, 46254, -45236, -97108, -22893, 16549, 39819, -54041, -68832, -27930, -137916, -184353, -95741, 14015, 87633, 34175, -55167, -115390, -102726, -34118, 72866, 189503, 243067, 369609, 557869, 627275, 674974, 747320, 937638, 1084671, 1052187, 864518, 672018, 382184, 180209, 69544, 96345, 100729]
14980A00729M5909q6213j04297O2497M5042j6293j35861k4396o9491J37559J54903
14969A10088n1036j35687m4000O6034N1388n66K6847l9184n996Q3108k8720q6791
14957e4515j06026j0130Q0820O8859N1278r7311o2956l0972m6774j3372m056R3772
14945a31383J40806J39430N56M00N6256J4123q3849j2002l7173k6761p7182j5564
14933c2343k8281L027l3246o7039J14734n64m7240P8642N5795p3896J4307M2045
14921B5941K8260J74731N6407J0401j80506j13943k2048K4882l9239L6763O1345
14910F2994P2914o263j04776j10261j1975L4804M3749J523J18244J6036K8857
14899A45846J8153j03965k6136m4124k6803n5719j05977m0102M5759R5239J53811
$$ y = [100729, 146638, 60425, -43872, 18625, 63667, 47374, -88487, -112883, -182374, -44815, 110088, 59052, -76635, -120635, -54601, -3213, -3779, 23068, -16116, -22112, 60996, 32276, -54515, -160541, -170671, -89851, -20992, 30286, -67025, -129981, -160953, -207727, -221099, -225155, -131383, 9423, 148853, 149409, 149809, 206065, 220188, 136339, 124337, 87164, 60403, -16779, -32343, -60624, -57597, -90843, -157882, -43148, -43712, -90952, -12310, 43485, -30411, -16104, 25941, 54201, 228932, 285339, 295740, 115234, 1291, -20757, 4125, -35114, 1649, 62994, 135908, 129645, 24869, -85392, -97367, -62563, -18814, -17291, 100953, 116989, 145846, 163999, 60034, 33898, -10226, -37029, -92748, -198725, -238827, -193068, -97829, 55982]
14888E5982O7747l0889J2198K0581J12020J18251O5682m3195o8491J32718K77818
14877G20422p4484j47363q4226k4042n7346J1652R8115m081j70560l7546o530
14866B24011m1342M6489N5371k6978k38148j64722O0229R0213K01234k5797j06647
14855G3913j48545l2659K03310J7360o4401Q1352m4993q9157r214K6918q3596
14844f9712j3667J30381J12763j01723m8526J690m9050K0920k05727k2555J11127
14833a34079J48898P110P3343k3330l066M6021k2391j08155k3689J00333N5114
14822A16109j2998r6614n1583M151k1068Q6304L2026l0101M9824J68134P8657
14811C22841L2777j70437j72343j50415l0449J23019J59564P1258q3859m5949
$$ y = [55982, 123729, 92840, 105038, 125619, 237639, 355890, 421572, 378377, 309886, 442604, 720422, 645938, 498575, 414349, 390307, 332961, 344613, 442728, 438647, 268087, 230541, 224011, 182669, 229158, 284529, 257551, 19403, -145319, -85090, 5123, 206357, 180560, 73913, -74632, -107291, 96019, 113379, 48978, 130330, 85337, -3820, -13034, 13884, -69712, -83379, 47002, 159765, 58042, 9516, 11206, -37844, -16924, -222651, -245206, -134079, 14819, 21929, 95272, 71942, 68876, 114897, 92506, -15649, -39338, 60995, 116109, 103111, 6497, -45086, -40935, -62003, 24301, 56327, 26226, 76050, 244184, 322841, 355618, 185181, 12838, -137577, -168026, -45007, 114557, 185815, 101956, 56007]
14801E6007L357r6387m0355L564j4123K6544R5803R0158k4507m781j10813P6459
14789F0926L7452J47429L9378j07459o6905p0155J4408Q6642j08719q5655K7724
14778b4934j3298N3336J1615K4868O053J4999q279O2186L7394M6015M8597k36599
14766B1953j07453J6569K59260N5574l2382j42667p3237p7790O4305M0675Q5274
14755A10081q830O3497l9722j68288J6318M2562K2324K2886J9588l1446m8231
14744G39k4468K1125k6298L7214n3404J9087j4491m9838N3814l3654P3353L6823
14732D0002n9573M3161L4866n5587L8571P1483n4160o6060K6221O0412k2290l354
14720E3692N8652m1620j12947R2764N880R2841M2461n4970j54868N5608j8509
$$ y = [56007, 59364, -37023, -77378, -73814, -87937, -61393, 34410, 124568, 100061, 95280, -15533, 60926, 98378, 245807, 285185, 177726, 110821, 40666, 55074, 141716, 32997, -52658, -24934, -38232, 15104, 26719, 51587, 57640, 72639, 64360, 126546, 163940, 209955, 258552, 21953, -85500, -68931, 190329, 245903, 213521, 70854, -2383, -80173, -15868, 24807, 110081, 101251, 164748, 125026, -43262, -26944, 15618, 37942, 60828, 80416, 48970, 739, -23729, -2604, -28902, 8312, -45092, -26005, -40496, -90334, -36520, -70174, 3179, 40002, -19571, 23590, 58456, 2869, 41440, 112923, 58763, -7297, 18924, 79336, 57046, 53692, 112344, 70724, -42223, 50541, 56421, 149262, 191723, 136753, -18115, 37493, 18984]
14709A8984J7825k6072j51851o5138J85149J38677Q5262j4498j53939q6403J13116
14698F1112N3271J14894K0842n2148K4063Q6412j5164m0485m9540J12508R9416
14687D15181J9184R9193k2599r5081j32375l6048k2456j0763J460l0116P228M9817
14675B42625j1098k2220j20803J9791N0172n5663J8991Q9247m3446q7617q9760
14664i781J18172m5540k7925P3614l3784L6556N7916o6157j50975j61N5325m174
14652C086j16537n3700J200L8181J02200K245k6574J1881K3465J470k2487j03639
14640a39209q3749J5284J45101J05424O9064K7416j3244o1263N2727L2391l1823
14629A18119j8110j50443j59675L7346J06283j3503L5399L8694j30936O1182M8347
$$ y = [18984, 36809, 10737, -141114, -206252, -21103, 117574, 202836, 188338, 34399, -52004, 61112, 114383, 229277, 250119, 197971, 222034, 308446, 293282, 252797, 203257, 315765, 415181, 434365, 533558, 510959, 415878, 283503, 247455, 224999, 214236, 215696, 185580, 192808, 242625, 231527, 209307, 88504, 108295, 158467, 102804, 121795, 211042, 167596, 79979, -9781, 108391, 62851, 34926, 108540, 74756, 111312, 169228, 103071, -47904, -48065, 7260, 3086, -113451, -167151, -165951, -127770, -25570, -23325, -49899, -38018, -14553, -13083, -35570, -139209, -222958, -207674, -62573, 42851, 111915, 139331, 126087, 64824, 117551, 149942, 118119, 100009, -50434, -210109, -172763, -66480, -79983, -44584, -5890, -136826, -75644, -27297]
14618b7297m2365k851j7371J02742K2064n155o0081j68388l8051O0130J67473
14607i150K42794L7662q7688j1295r2192j00668p4036l5236O7000M7852J21839
14596A06882k222j1688j46927m1739j7711m5034R3026O084M5559K4554j58486
14585a47702J9126L2578P9651O8173l5394j65652N6422N6248M2874j9040k6755
14574c9471m1272J40595O5345m0008j12279J5885r4908k2473k3330J8899J07238
14563b5779M5935J8084m4229j29745J32967K8510L0775J41385P355j41478r3229
14552b9449R8778J16691L3793k0601n4372r9233k8659J134k9312M2652N5484O8052
14540A54958r2945p1505Q5217j20192P1140J11376j36210J0425N8451j4052R265
$$ y = [-27297, -69662, -72513, -89884, 12858, 34922, 29767, -30314, -198702, -236753, -176623, -9150, 233644, 271306, 183618, 172323, 80131, -20537, -94573, -129809, -62809, -14957, 106882, 104660, 92972, -53955, -95694, -113405, -158439, -65413, -59329, -13770, 10784, -147702, -128576, -95998, -16347, 51826, 16432, -149220, -92798, -36550, 6324, -12716, -39471, -80743, 59852, 125197, 85189, -27090, -11205, -106113, -128586, -151916, -133017, -25779, 20156, 38240, -5989, -135734, -2767, 25743, 56518, 197903, 205258, 63780, -29449, 69329, 186020, 219813, 199212, 144840, 45607, 16948, 18082, -11230, 31422, 86906, 154958, 62013, -9492, 75725, -44467, 26673, 138049, 1839, 12264, 70715, 56663, 65928]
14529F5928L2924j6441K0334m3897m8826O77j51757L6417L0322J5331O8149Q3024
14517I2185k967L2833j4936m2412p9469r6801O3665M6043K2197k6127K0134J944
14505A6289m7879m736M3478O6472J31878M5917j33001J7285N4015L329P9885O3879
14493C36811J16010J12882O1015O0710J44133p8660l624J54467J17552m7605j0608
14482I63083J09487P0559p1345R9150J37200J13831m4329j04862n1341L2983j19423
14471A134993K9338K8993l1586o539r686l5227p0143L1864M4106j27992j73954
14460H14167l2969L7178M0735P4784M7471r4264O7538J28803n6854p7594R0304
14449A039299K06169l7012j6533L4319J4666P0887M1841q8304n2706p9068q8958
$$ y = [65928, 98852, 82411, 102745, 58848, 10022, 10699, -141058, -104641, -74319, -58988, 9161, 92185, 89218, 122051, 107115, 64703, -14766, -111567, -47902, -1859, 20338, -5789, 14345, 16289, -31590, -36326, 7152, 73624, 205502, 251419, 118418, 135703, 189718, 193047, 272932, 336811, 452821, 565703, 626718, 687428, 831561, 752901, 749277, 903744, 1021296, 973691, 963083, 1072570, 1143129, 1071784, 1170934, 1308134, 1421965, 1377636, 1272774, 1221433, 1254416, 1134993, 1164331, 1193324, 1161738, 1155199, 1145513, 1110286, 1040143, 1072007, 1116113, 988121, 814167, 781198, 818376, 859111, 933895, 981366, 887102, 954640, 1083443, 1026589, 948995, 1039299, 1245468, 1208456, 1191923, 1226242, 1240908, 1311795, 1353636, 1265332, 1212626, 1133558, 1044600]
14438A044600r1168p970p1739j13507j03545o4765L5775p1843K3310J6048p3112
14427E22084j7027L2004j24349j73334P402O7564r0545n9802o2682J12787j6216
14416A97886n7146n4974J36417N8952k2724l6778m644k5745o0250K1165j8296
14405A33863j4845L2262q2191j8233k6622J18383M2494P6154N6034n930q7967
14394B23402n7708m4146j55192o6742q256R8527k190q262J07381O7650m10l5032
14382A19022p9518K5946o1855n260O2379O4399j31255n9898N46L3355M2823J26192
14370A36876O1837n247o2255K6261P0129r3480N3391K3598j23870m3512l3339
14359A0389N568m8733k8257L5379K7488O5676K0806l3176J9758J14283k3134o7050
$$ y = [1044600, 953432, 945462, 873723, 760216, 656671, 591906, 627681, 555838, 579148, 595196, 522084, 505057, 537061, 412712, 239378, 246780, 314344, 223799, 163997, 101315, 214102, 197886, 140740, 85766, 222183, 281135, 258411, 221633, 216989, 191244, 130994, 152159, 133863, 119018, 151280, 69089, 50856, 24234, 142617, 185111, 261265, 317299, 311369, 223402, 165694, 121548, -33644, -100386, -108642, -10115, -12305, -20567, 86814, 154464, 154054, 119022, 39504, 65450, 3595, -1665, 60714, 125113, -6142, -66040, -65494, -32139, 10684, 136876, 198713, 193466, 131211, 157472, 227601, 134121, 187512, 211110, 87240, 43728, 10389, 15957, -32776, -61033, -25654, 1834, 67510, 88316, 55140, 74898, 189181, 166047, 98997]
14347I8997q4268R5326L1116m7927N5281N5775m3717j10838k5294j6538q8971
14336h1058k2157L5809k6432L3953Q1561M8203j800J20428o769p664p2992j4431
14324H6651j33173q3777N5409N9687J41242m0614j27732o1427j3614J3903K182
14313a01263j8688J6536N4987N2586k7834n3466j3236J03561j2288N9459Q4562
14302A44916K6339P487p957j19299j82338o6524m9705Q3822L0933k1801J40482
14291a3645L1436j19915K7971R2557J05068K8178J01670Q792q2198P1752J8279
14280B69945J1654o7735j02058K1705O0433j8084j14974o7603J33569R6881j9168
14269B04565j6885K1657l1508N554J23802P0483p4361j26611r7295L5024k5114
$$ y = [98997, 14729, 110055, 141171, 93244, 148525, 204300, 160583, 49745, 24451, 7913, -81058, -103215, -67406, -93838, -59885, 21676, 69879, 68079, 188507, 181738, 174074, 101082, 86651, -46522, -130299, -74890, -15203, 126039, 85425, -42307, -103734, -117348, -103445, -101263, -119951, -103415, -48428, 4158, -23676, -77142, -90378, 13183, 895, 60354, 144916, 171255, 178742, 170785, 51486, -130852, -197376, -247081, -163259, -132326, -154127, -13645, 17791, -102124, -74153, 18404, 123472, 151650, 253320, 262112, 179914, 251666, 269945, 281599, 213864, 111806, 133511, 193944, 175860, 60886, -6717, 126852, 223733, 204565, 187680, 209337, 177829, 183383, 307185, 377668, 303307, 176696, 79401, 114425, 89311]
14258H9311m0435N2504J13329l3282n2053R7229J09836j00796m8369J15074O4231
14247C66579l5967j00267m3513r57N94J1852J45558k632m0367j10243o0964l5221
14235I4452N0780P553j6554R3785K8808k3342j69438L7766K8944J49081Q694o3162
14223B27367j14590j473P0787J09790J8513q768j6473J4073l9296L6131r3753
14212B02308m1692K0374n6604Q8867M5225j02395j33320j08362Q093P3394p2098
14201g6210j1851O1180J32735o3367q3375N5212R3111Q0504K3298n3506r0753
14190F6978n5900k1960R9242o8137j03778Q0093o4657l3566Q352N9394o5667K9596
14178g0010J2686n1438p8981q2361J44589J54064n1804J07079J64771k430n0390
$$ y = [89311, 48876, 101380, 214709, 181427, 129374, 226603, 336439, 235643, 187274, 302348, 366579, 330612, 230345, 186832, 185875, 186469, 198321, 343879, 341247, 300880, 190637, 129673, 94452, 145232, 152785, 136231, 230016, 258824, 235482, 66044, 103810, 132754, 281835, 290529, 227367, 112777, 111304, 182091, 291881, 310394, 301626, 285153, 299226, 259930, 296061, 202308, 160616, 180990, 124386, 213253, 258478, 156083, 22763, -85599, -77506, -4112, -76210, -88061, -26881, 105854, 42487, -40888, 14324, 107435, 187939, 211237, 157731, 66978, 11078, -10882, 88360, 20223, -83555, -3462, -68119, -101685, -93333, -33939, -99606, -70010, -57324, -108762, -187743, -270104, -125515, 28549, -23255, 83824, 248595, 246165, 195775]
14167A95775R234J42245J10367j20927n7878J3441J21949P9840m9427l5992K3091
14156D31718j99O497M1791Q6216K6071j3208L1907l3965N0721J1266J10115o048
14144G42882j45786j8414M2503q1123L2755o3115J05331J81720M7595N8438J11678
14133A014464m9495j38397k8500N2856K0391J15347J28159Q7286Q525n4364O2026
14122A218298Q9122L4539M2509j4294o6217Q041r073q3752j27411M1659N1161
14111A184582L4153J38227m1099k9118n3847J0810l3598j9833L1715J52944J96687
14100A571623P2259o3637K9136j6742o390J96245J85490N7368M5037O1695n4066
14089B078018O3540J74934J28982J86197O8518J07546J07370k3132J85805J99851
$$ y = [195775, 205009, 347254, 457621, 336694, 278816, 292257, 414206, 494046, 444619, 408627, 431718, 431519, 438016, 479807, 566023, 592094, 578886, 610793, 576828, 627549, 638815, 748930, 742882, 597096, 578682, 621185, 540062, 572817, 509702, 615033, 796753, 844348, 902786, 1014464, 964969, 826572, 798072, 850928, 871319, 986666, 1114825, 1202111, 1210636, 1156272, 1218298, 1307420, 1341959, 1384468, 1370174, 1303957, 1311998, 1302925, 1219173, 1091762, 1133421, 1184582, 1218735, 1356962, 1315863, 1286745, 1232898, 1243708, 1210110, 1190277, 1221992, 1374936, 1571623, 1643882, 1580245, 1609381, 1592639, 1586249, 1782494, 1967984, 2025352, 2070389, 2132084, 2078018, 2141558, 2316492, 2445474, 2631671, 2700189, 2807735, 2915105, 2891973, 3077778, 3277629]
14079C277629J37793J00763J90095J14733Q9065J02220J72850K72097K93017L56339
14069E106601M02817L69254M09765L54438L92481L91143N03250O95409P49703
14060I374861Q01317R20697J007224J106140J314919J486505J703647J922473
14052A9637783K248406K473983K964131L454131M022458M680948N402705O345684
14044E1230229P424429Q559711R814195J0997295J2511179J3743000J4802221
14037A29082259J5549221J5748674J5342035J4528854J2900141J0677123Q127376
14030B21955683N287422K497551j20167k448047m426404n899941o752604p014050
14022B03079443p019957o732164o067507n147790m422107l438734k611475j678006
$$ y = [3277629, 3415422, 3516185, 3706280, 3821013, 3910078, 4012298, 4185148, 4457245, 4750262, 5106601, 5509418, 5878672, 6288437, 6642875, 7035356, 7426499, 7929749, 8625158, 9374861, 10176178, 11096875, 12104099, 13210239, 14525158, 16011663, 17715310, 19637783, 21886189, 24360172, 27324303, 30778434, 34800892, 39481840, 44884545, 51230229, 58654658, 67214369, 77028564, 88025859, 100537038, 114280038, 129082259, 144631480, 160380154, 175722189, 190251043, 203151184, 213828307, 221955683, 227243105, 229740656, 229620489, 227172442, 222746038, 216846097, 210093493, 203079443, 196059486, 189327322, 183259815, 178112025, 173689918, 170251184, 167639709, 165961703]
14014A65961703p89674k904J034680K073375K989049M232476N261982O248198
14006A87008885P368625Q261849Q948754R021734Q815695Q327491P186870N467814
13998B50407717L139486M82129k546488n365300p966758j0428457j2419571j3769421
13990B01533337j4428886j4427163j4024721j3368081j2393648j1227835j0298311
13983A11364692r170094q154192p210376o385402n746658n247984m515065m111880
13975F0823041l814993l446828l191514k875263k662113k365170k071137k063569
13967C8332454j800832j643363j479418j475408j516016j236512r39317j104791
13959B7136797j046709r41618r21648q49241q64181p69818p06399o49905o53477
$$ y = [165961703, 165172029, 165169125, 166203805, 168277180, 171266229, 175498705, 180760687, 187008885, 194377510, 202639359, 211588113, 220609847, 229425542, 237753033, 244939903, 250407717, 253547203, 254029332, 251482844, 246117544, 238150786, 227722329, 215302758, 201533337, 187104451, 172677288, 158652567, 145284486, 132890838, 121663003, 111364692, 102194598, 94040406, 86830030, 80444628, 74697970, 69449986, 64934921, 60823041, 57008048, 53561220, 50369706, 47494443, 44832330, 42467160, 40396023, 38332454, 36531622, 34888259, 33408841, 31933433, 30417417, 29180905, 28241588, 27136797, 26090088, 25148470, 24226822, 23377581, 22513400, 21743582, 21037183, 20387278, 19733801]
13950A9733801p13677o25111n25253o40295o18482m99274m89526m95419n61878
13941A4564886n01221n02403m46542l97512l29396l48376l43063l72955l15616
13932A1007802k46424k94509l00306k24327k48670l10101j29335k25207l09079
13923H719844l23068k66401k44806k10909j47070k24785k09826j64409j96778
13914F731792l03608j71842q9171j84285j00068j02656q1367k58260j38671o7180
13904E234684q4341m1577m5820j97777k87736k8861j18969j95450j55313j21465
13894C957375q7643J6103l6730r0267j95673j92877j42621l368k0236N7952o5376
13883C196639j48454r7983j23948j42952m8374K5971j0747j33825n3195o8778
$$ y = [19733801, 19020124, 18395013, 17869760, 17229465, 16610983, 16111709, 15622183, 15126764, 14564886, 14063665, 13561262, 13114720, 12717208, 12387812, 12039436, 11696373, 11323418, 11007802, 10761378, 10466869, 10166563, 9942236, 9693566, 9383465, 9254130, 9028923, 8719844, 8396776, 8130375, 7885569, 7674660, 7527590, 7302805, 7092979, 6928570, 6731792, 6428184, 6256342, 6167171, 5982886, 5882818, 5780162, 5698795, 5440535, 5301864, 5234684, 5150343, 5108766, 5062946, 4865169, 4577433, 4548572, 4429603, 4234153, 4078840, 3957375, 3869732, 3885835, 3849105, 3758838, 3563165, 3370288, 3227667, 3224299, 3204063, 3262015, 3196639, 3048185, 2950202, 2826254, 2683302, 2634928, 2660899, 2650152, 2516327, 2463132, 2394354]
13873B394354p6348Q4123J6941o2384q6001p0772j6611K7381k55137n7181K2939
13862A921304K2366R8416r6274q318r292j44346n4075O953j6186m9761n6706j6943
13850A597138p0813k9204O0203J1182n7142m9836M8209O6998o8981P2714o1809
13839A518659j50970N5357R5909J21492P8571N6460K06003J69415m0730K3419
13829B133585l0309j01225J4082k7470N2950J46161J3801l8264r4296K2855n5598
13818B036272j29351r7269j74221j14916J440K4916p7343l4162R6620J24679J9912
13807A676577p8260R3055n996P8968J49520K0832p1064N0808j6153j4190J1478
13796A895575P5590j79172q4890Q467M0885N21N882k2786j19184j40515q4549
$$ y = [2394354, 2318006, 2402129, 2419070, 2356686, 2270685, 2199913, 2183302, 2210683, 1955546, 1898365, 1921304, 1943670, 2042086, 1945812, 1937494, 1928202, 1783856, 1729781, 1736734, 1720548, 1670787, 1614081, 1597138, 1526325, 1497121, 1557324, 1568506, 1511364, 1461528, 1509737, 1576735, 1507754, 1580468, 1518659, 1367689, 1423046, 1518955, 1640447, 1719018, 1775478, 1981481, 2150896, 2110166, 2133585, 2103276, 2002051, 2016133, 1988663, 2041613, 2187774, 2201575, 2163311, 2069015, 2091870, 2036272, 1906921, 1809652, 1635431, 1520515, 1521955, 1546871, 1469528, 1435366, 1531986, 1656665, 1676577, 1598317, 1691372, 1685376, 1764344, 1913864, 1934696, 1863632, 1914440, 1898287, 1884097, 1895575, 1971165, 1791993, 1707103, 1715570, 1756455, 1756976, 1762858, 1740072, 1620888, 1480373, 1395824]
13785A395824l7051q5544j85965m3243O1052J86196n2909j45390j32731p1174
13775H89065Q6841j65076k2664Q5284P0673m4404p7616J2840R595j06112K7210
13764G65636P0224p1852j05876k9275R5017M9269m2619q6490q8049j3423J28105
13753F70667Q26j66708o5502M7581l3781J07072J52987J2054O776j13656O787
13742F25103l9364k5286p1771r1445J23778J03175j02608l3712P7929L6042K7797
13731F29638Q712j851j29817j59203N1859J22732n9663l448J6071j02731j20705
13720B51594R2650L4170j1507Q290J11517j61729q6452O3986Q6986R4992j9644
13709D64853L1760q2913o0253o345m3399r5077p3734J02557J44864P4530p5135
$$ y = [1395824, 1358773, 1273229, 1087264, 1044021, 1105073, 1291269, 1238360, 1092970, 960239, 889065, 975906, 810830, 788166, 873450, 944123, 899719, 822103, 834943, 844538, 738426, 765636, 835860, 764008, 658132, 628857, 723874, 773143, 730524, 644034, 555985, 542562, 670667, 671493, 504785, 439283, 486864, 453083, 560155, 713142, 725196, 731972, 618316, 625103, 585739, 560453, 488682, 397237, 521015, 624190, 521582, 487870, 565799, 601841, 629638, 638350, 636499, 506682, 347479, 399338, 522070, 462407, 458959, 475030, 372299, 251594, 344244, 378414, 366907, 375197, 486714, 324985, 238533, 302519, 389505, 484497, 464853, 496613, 413700, 353447, 347102, 303703, 208626, 134892, 237449, 382313, 456843, 381708]
13698C81708o427m4945j5637O801q8335n4821M0473R9936p6417r9621m1833O3295
13686A64177O8869J197j8438N664j03431r848N6636l9343M6173q894N3842N9549
13674B76153M1051K9444l87p8092m1189p8226n209J91344q851k7188J0410O6996
13662C76256L4597m9194k1280J4383M6750j2071o9141k4602M674k3686r1126m7501
13650A38059k5331J129M9598J0652n0166P038N8138K8535r3256O0307j9796j6461
13638A48446k6491k587N5336k7838R142k6649O7196L3474l8648L9440p3778J0058
13626A67101J01184J22085k9418r3344M3255L1348k4071k09381j12267k55J09348
13615A05585J02445j3830Q143L1043j982n3613q404p183R1500k0957N0343J28492
$$ y = [381708, 375281, 330336, 314699, 321500, 233165, 178344, 218817, 318753, 242336, 142715, 100882, 164177, 233046, 234243, 215805, 221469, 118038, 108190, 164826, 125483, 171656, 162762, 216604, 276153, 317204, 346648, 346261, 268169, 226980, 148754, 143545, 334889, 326038, 298850, 309260, 376256, 410853, 361659, 340379, 354762, 401512, 389441, 320300, 295698, 300372, 276686, 185560, 138059, 112728, 113857, 163455, 174107, 123941, 130979, 189117, 217652, 124396, 184703, 164907, 148446, 121955, 119368, 174704, 146866, 156008, 129359, 196555, 230029, 191381, 230821, 157043, 167101, 268285, 390370, 360952, 267608, 310863, 342211, 318140, 108759, -3508, -3763, 105585, 208030, 194200, 202343, 233386, 231404, 177791, 169387, 162204, 253704, 232747, 283090, 411582]
13603D11582q3883M032N2022R2212l7808K6826j1804m3733k2109J5907n3527R9078
13591D48795O5175N5701J2052N9192P5229J1871o0909O2382J62397J16564R6297
13580A104746J55336k6581M4777J53406J07529J1390R294m7113o8541j9595o3092
13569A361556L6376m9949j07027l3801o6334j5898P8548q1447l1882J13665j12615
13558A091192j35333k2298k4486M5038J36189Q7074k5419O6569N1569J17060M9298
13547A436453k4203M5394O429K1829n1589k3631k4507N5040j9292j31394n1976
13536A238553j56674o5750l945q3857j34064j32128j93397r7111J16959J74553
13526F63139P6894m9478j2857j16071r0780j24927q2225m1980L3984R9072O3374
$$ y = [411582, 327699, 331731, 383753, 475965, 438157, 464983, 453179, 409446, 387337, 403244, 349717, 448795, 513970, 569671, 581723, 640915, 716144, 728015, 667106, 729488, 891885, 1008449, 1104746, 1260082, 1233501, 1278278, 1431684, 1539213, 1550603, 1559897, 1512784, 1444243, 1424648, 1361556, 1397932, 1347983, 1240956, 1207155, 1140821, 1124923, 1203471, 1122024, 1090142, 1203807, 1091192, 955859, 933561, 909075, 954113, 1090302, 1177376, 1151957, 1218526, 1270095, 1387155, 1436453, 1412250, 1457644, 1464073, 1485902, 1434313, 1410682, 1386175, 1441215, 1421923, 1290529, 1238553, 1081879, 1016129, 1012184, 928327, 794263, 662135, 468738, 371627, 488586, 663139, 740033, 690555, 677698, 561627, 470847, 345920, 263695, 221715, 255699, 354771, 418145]
13515D18145J09533j75766r9697r1794M0945J3725R1966m4k4627J12791l6401
13504C58776K3684K4986o0028n0412j5284p6520j21556k1954M9263P8450o1753
13493A27652M3559m9653j37126O6647J16140O8219q892J50611P9198j08759j89413
13482A58183j2679r8061j35896l800M2357P4893n3341m9889Q3873J09436j8047
13471I7029O1218r7071r6256l676Q5652M1676J6033k409j05760N2806M424j63396
13459a09730n3227O5091N9120O8121L7162J1087q0992K8403J4592l9172m3995
13448d3540R7206R1844P5602q1867j00273r2j10156P2260J67281m2731j6318j4418
13436I4798l9572N8359r649j05978o4352J26504N6573L828p539r1588l5080L4254
$$ y = [418145, 527678, 351912, 252215, 160421, 201366, 215091, 307057, 307013, 282386, 395177, 358776, 382460, 407446, 347418, 297006, 281722, 205202, 83646, 61692, 110955, 189405, 127652, 171211, 121558, -15568, 51079, 167219, 235438, 226546, 377157, 456355, 347596, 158183, 145504, 47443, -88453, -92253, -49896, 24997, -28344, -78233, 5640, 115076, 97029, 158247, 61176, -35080, -38756, 46896, 88572, 104605, 102196, -3564, 49242, 53666, -109730, -162957, -97866, -38746, 29375, 66537, 77624, -3368, 25035, 39627, 455, -43540, 53666, 145510, 221112, 139245, 38972, 38880, -71276, 984, 168265, 125534, 109216, 94798, 55226, 113585, 103936, -2042, -66394, 60110, 116683, 120511, 112972, 21384, -13696, 20558]
13424B0558o520k4845N5721Q040N1514L7160P0366j30335o0517Q7315J4656K2751
13412A45864l3669l4033M2506l9188N1561r267j3258N052l2604K3505P0202j32101
13400D4570p2459j4280o187J28047K0809j00148j76231J4674N0927L8669M7293
13389b4316N1870O7306n9793j06672L864o764k06529r433o1986l2593L3613J43250
13377b08183J66434K11520J16709q1523q9870L5681J12800k9047j08725m8269
13367G7527n2163J7009N3186J4085l7890n9650l8330K0955K367J36405L2998j89184
13355b2685l1666Q4466J8677K908k5964K8814J22206P892K0058j26376K3774P2777
13343A74881K5269q7631l4871L1616J39268m9086R0264j3516q0017p1504j70220
$$ y = [20558, 14038, -10807, 44914, 52954, 104468, 141628, 211994, 81659, 21142, 108457, 123113, 145864, 112195, 78162, 120668, 81480, 133041, 123774, 110516, 115568, 82964, 106469, 176671, 44570, -27889, -42169, -48356, 79691, 100500, 352, -175879, -161205, -110278, -71609, -24316, 27554, 94860, 35067, -71605, -67741, -74505, -281034, -290467, -352453, -385046, -351433, -208183, -41749, 169771, 286480, 204957, 115087, 150768, 263568, 234521, 125796, 77527, 25364, 42373, 95559, 109644, 71754, 12104, -26226, -5271, -2904, 133501, 166499, -22685, -54351, 30115, 48792, 51700, 25736, 54550, 176756, 184648, 204706, 78330, 102104, 174881, 200150, 112519, 77648, 109264, 248532, 199446, 289710, 276194, 196177, 124673, -45547]
13332d5547p2023J42193n1918j03726L1326j3959l0483Q1375R9178K5130J719
13321F3265J19236l7021q8463J8511O0659Q9477r0592j7749Q941k3259p607R8721
13309A94119L7822q267q8942o5202n7740m141P0993k4596r183o0389n3619L5575
13297c3570O9420R6522N884o1731m2278J2035P4325K8379J49830K6524o7099o5160
13285A93081k4679k2043m4704m5047K5821j7733R676J5067O3918O0199q3880j08948
13273B0728P3472J26931K9011n1098j00156M8931J20053r8064j71905l7681Q8361
13262D8583j8869L287L6453k4586n4421J1461P771P0201J8915r6307j23121J44603
13250B3970Q0713L7415J3602n6511M8301N0044N4061P3847j42044j0466q1174
$$ y = [-45547, -117570, 24623, -27295, -131021, -99695, -113654, -144137, -62762, 36416, 61546, 63265, 182501, 145480, 57017, 75528, 136187, 225664, 135072, 117323, 126264, 103005, 95398, 194119, 231941, 223674, 134732, 69530, 11790, 7649, 78642, 54046, 44863, -15526, -69145, -33570, 35850, 132372, 138256, 76525, 34247, 46282, 120607, 148986, 298816, 325340, 258241, 193081, 168402, 146359, 101655, 56608, 82429, 64696, 74372, 89439, 153357, 213556, 129676, 20728, 94200, 221131, 250142, 199044, 98888, 147819, 267872, 169808, -2097, -39778, 48583, 29714, 33001, 69454, 44868, -9553, 1908, 9679, 79880, 98795, 2488, -120633, 23970, 104683, 142098, 155700, 99189, 147490, 197534, 251595, 325442, 183398, 172932, 91758]
13239I1758j13040R6848M6357M448n0548q411M5893m0608M5880j4948Q2613N7467
13227B43709n7088L276o9739p8809J385n5975J11459L1177j91739K2608Q9542
13216D9806K7685j3451P0036Q938j07286p7923R2238Q4493J3998j13161k9705
13205E668n5557q0681R0522J73991j1155p2178p193o8467L2380O0014N4626p6848
13193D5122p3580l4505m4944N2316R1221K6794M7700j9686n14r1797M8934o5702
13181a8641j15564M1794J14711J20030l6208p187m4339o4467j5114L3623m6417
13170c7779r2590k4107J09803N8825L8295K3009M8720j86838o657J13251P3037
13159A16969l1822J9078o6221j4396j83537j7501N4522O4679r9522J53009o54
$$ y = [91758, -21282, 75566, 121923, 126371, 75823, 67412, 113305, 72697, 118577, 103629, 186242, 243709, 186621, 189897, 120158, 41349, 42734, -13241, 98218, 129395, -62344, -39736, 49806, 77491, 64040, 134076, 143014, 35728, -42195, 50043, 134536, 148534, 35373, 5668, -49889, -130570, -40048, 133943, 122788, 50610, 43417, -25050, 7330, 67344, 121970, 45122, -28458, -62963, -107907, -55591, 35630, 62424, 110124, 90438, 89924, -1873, 47061, -18641, -134205, -92411, 22300, 142330, 106122, 98935, 54596, -9871, -24985, 8638, -37779, -130369, -154476, -44673, 14152, 52447, 75456, 124176, -62662, -69319, 43932, 116969, 85147, 104225, 38004, 23608, -159929, -177430, -122908, -58229, -157751, -4742, -5396]
13148e396m7573J12744K70184N1311o8815l6272r2481R791k5356o9008j00042
13137i13o15K7377p0185n9244J13701K15120L1177n8082n081N3767j6348q371
13125B22303j13425m1101l0149J367K9755M0647O384m1006K2671k6249O7734Q8054
13113B26985j18474k2883L8222l339j22758k0911K9871Q6944l916J00675Q7181
13102B77597o7331l3335o9228k3639N4356l0525j40481k8126J3271n9466M4047
13091f2860J41115q508K1569N0193k1415o2481j1327N3794L376l3759K232L0363
13079A02292R870n9666l6602K0003O5999L4850q8347l9166N798o3463J8477n4847
13067h4802N788l0554r8298Q147R5909L667P0133M1084j4088N7354O3443q2383
$$ y = [-5396, -52969, 59775, 329959, 381270, 312455, 276183, 183702, 193493, 168137, 99129, -913, -1528, 25849, -44336, -103580, 10121, 225241, 256418, 198336, 193255, 247022, 230674, 222303, 108878, 67777, 37628, 38995, 68750, 109397, 115781, 74775, 97446, 71197, 138931, 226985, 108511, 85628, 123850, 120511, -2247, -23158, 6713, 93657, 89741, 190416, 277597, 210266, 176931, 107703, 84064, 138420, 107895, -32586, -60712, -47441, -106907, -62860, 78255, 69747, 91316, 141509, 120094, 57613, 46286, 100080, 103456, 69697, 71929, 102292, 112162, 52496, 15894, 35897, 101896, 136746, 48399, 9233, 15031, -48432, -29955, -84802, -79014, -109568, -207866, -199719, -103810, -100143, -30010, 11074, -3014, 54340, 117783, 35400]
13055C5400J3150N2724n0432r7677K1584p57l6524O9037L1312o1790k8189J29390
13043G7228n1210n8692P4526m5680R765o5892k4363R7988R1481P656m8534o9656
13031e383m8763J56991M5122k8724J6403j59389o3479K0068K3184L7124Q7233
13020H0387r516m7113N7149L5889J4866O0205j4363n3610j36359k1967o4987o4850
13008a64269J27109N6377L95L8532J66091M5639j16578j58646p5240o9301R5322
12997e4569P4055k4815l361n404O2175J40599m5939m8597j16211K9541L2433K0671
12985F0578P8841N961R502m7070r7920k8530O2573Q9461j00081o8203M0157N3569
12973E8838K6408l8840J0993j28211m7881K2456n131j3512L3458n7350K8919Q5209
$$ y = [35400, 48550, 101274, 50842, -46835, -25251, -26008, -62532, 6505, 37817, -23973, -52162, 77228, 26018, -32674, 41852, -3828, 5937, -59955, -84318, 13670, 105151, 112807, 64273, -5383, -54146, 102845, 147967, 119243, 135646, -23743, -87222, -67154, -43970, -6846, 80387, 70871, 23758, 80907, 116796, 131662, 191867, 177504, 123894, -12465, -34432, -99419, -164269, -37160, 19217, 19612, 58144, 224235, 269874, 153296, -5350, -80590, -149891, -54569, 19486, -5329, -8690, -14094, 48081, 188680, 142741, 94144, -22067, 7474, 39907, 60578, 139419, 145380, 154882, 107812, 9892, -18638, 43935, 133396, 33315, -34888, 5269, 58838, 85246, 46406, 57399, -70812, -118693, -96237, -101368, -114880, -81422, -138772, -109853, -24644]
12961b4644K0401L496L7194k4158K7496K4929j82869j24773O2940K30253J10982
12950A61247N8600k7049K3221l7772m5346K533j12519p9026Q3672J5210j6639
12939B6132Q9964P1208J08610j40872j85103j42443m70J29924J30029J94637j13963
12928A67653o8595Q710l5122j16050k0189P0674L2978j9927K1012N3781p6740
12917A8185n8068O7210J39801P6516k78034o2531N7698J61028Q7612j25819j61503
12906g7905p7245J30414R3061R9431l1895j03054l92n1432n8310K266O2964J1544
12894e53n0761J39674j5329J0201Q8506o4334P6236j1797j62932j12428M852Q3831
12882a4834j096R3994N9300R647l7283L161q2104K3533l37k5665j7918l7284M4447
$$ y = [-24644, -4243, -747, 36447, 12289, 39785, 64714, -118155, -242928, -179988, 50265, 161247, 219847, 192798, 216019, 178247, 132901, 135434, 22915, -56111, 27561, 42771, 26132, 116096, 187304, 295914, 155042, -30061, -172504, -172974, -43050, 86979, 281616, 167653, 99058, 107768, 72646, -43404, -63593, 7081, 40059, 20132, 41144, 94925, 18185, -39883, 27327, 167128, 243644, -34390, -96921, -39223, 121805, 209417, 83598, -77905, -155150, -24736, 68325, 167756, 135861, 32807, 32415, -19017, -77327, -75061, -12097, -553, -51314, 88360, 73031, 83232, 171738, 107404, 183640, 171843, 8911, -103517, -98665, -14834, -15930, 78064, 137364, 147011, 109728, 112889, 30785, 54318, 53981, 28316, 10398, -26886, 17561]
12869A7561N110J1959k8586L1866m1355l1434m1314l4381M1169J05145J08262
12858A44002M14m6226Q069P0945N9146q1294j33349m1660L1803R7990r0623J9475
12846C8692Q0778P9337k0148j65773J855R5268j8952j10559P8879p5578j07576
12835a23777l9886O6874k0020J03253J22702L8973n4469j24436L7423L633p3377
12824f3107j8820M0355N4244P0727k9275k1590j7359j288n8529K4239J24962K561
12812A07120o2163K8557Q5229J9902p5048p2625K5376n563o1627P4777J19900
12801A83835j1182j5192J97696K67365J26165L47J87120Q4454j88134j85077r4183
12790E53214j46759j01493O4278O0350L1129n0603k3904J5456n4400j03688p5760
$$ y = [17561, 22671, 34630, 6044, 37910, -3445, -34879, -76193, -110574, -69405, 35740, 144002, 144416, 98190, 106259, 177204, 236350, 155056, 21707, -19953, 11850, 109840, 19217, 38692, 119470, 198807, 178659, 12886, 14741, 110009, 91057, -19502, 59377, -16201, -123777, -163663, -96789, -116809, -13556, 109146, 148119, 93650, -30786, 6637, 10270, -63107, -81927, -41572, 12672, 83399, 54124, 32534, 15175, 13887, -44642, -20403, 104559, 107120, 44957, 73514, 158743, 178645, 103597, 30972, 56348, 50785, -10842, 63935, 183835, 172653, 157461, 355157, 622522, 748687, 749034, 936154, 1020608, 832474, 647397, 553214, 406455, 304962, 369240, 429590, 460719, 410116, 386212, 401668, 347268, 243580, 167820]
12779A67820m1792p2155o3817p0046j4166Q1316K28572N3832j1231r3083k1921
12768A43329K6474n4364l5585l3622J0446L9064j05241Q5057R5742n3359j05218
12757A2723p9549r429J6998J2962N1657n925j720K2029Q6351L7574l8362j71978
12745f6669n9122K1981j5763K4677J01557N2006l1473N5992M060o1681N2117k843
12733G4839K9075K7853n5850k7077K0389O5189o8431r3837O530J17418l528k4612
12721F7958O998m783j33117k3564J2276J16220J9901K1856q6111k3143l8681R4983
12709C0793k3913j37974m1962J4465j2804r0761K1370J62937J01672P4356L482
12698A01661j79748j2234J25577J18752k6131j49615L3332J1733q3826N5831J2153
$$ y = [167820, 126028, 53873, -9944, -79990, -94156, -12840, 215732, 269564, 258333, 165250, 143329, 169803, 115439, 79854, 46232, 56678, 95742, -9499, 75558, 171300, 117941, 12723, -66826, -76255, -59257, -46295, 5362, -563, -2283, 19746, 106097, 143671, 105309, -66669, -125791, -103810, -119573, -94896, 6661, 58667, 27194, 83186, 87246, 25565, 77682, 74839, 103914, 131767, 75917, 48840, 69229, 134418, 65987, -27850, -21320, 96098, 92570, 67958, 74956, 70173, -62944, -86508, -74232, 41988, 61889, 83745, -2366, -25509, -64190, 30793, 6880, -131094, -173056, -158591, -171395, -262156, -240786, -77849, 23823, 98179, 101661, -78087, -90321, 35256, 154008, 127877, -21738, 11594, 23327, -60499, -4668, 7485]
$$ [...]
##END NTUPLES=NMR SPECTRUM
##END=
