##TITLE=Analysis number 320054
Compound Code cc 48916
Book Reference 468/87
Project Code adrs
Chemist Name colinb
##JCAMPDX= 6.0         $$ Bruker NMR JCAMP-DX V2.0
##DATA TYPE= NMR SPECTRUM
##DATA CLASS= NTUPLES
##ORIGIN= Bruker BioSpin GmbH
##OWNER= nmr
$$ XWIN-NMR		Version 3.5
$$ Mon Jun 12 10:57:38 2006 GMT Daylight Time (UT+1h)  MAYBRIDGE\nmr@NMR_250MHZ
##.OBSERVE FREQUENCY= 250.131544655141
##.OBSERVE NUCLEUS= ^1H
##.ACQUISITION MODE= SIMULTANEOUS (DQD)
##.ACQUISITION SCHEME= undefined
##.AVERAGES= 16
##.DIGITISER RES= 18
##SPECTROMETER/DATA SYSTEM= dpx250
##.PULSE SEQUENCE= zg30
##.SOLVENT NAME= CDCl3
##.SHIFT REFERENCE= (INTERNAL, CDCl3, 0, 16.522)
##AUDIT TRAIL= $$ (NUMBER, WHEN, WHO, WHERE, WHAT)
$$ ##TITLE= Audit trail, XWIN-NMR		Version 3.5
$$ ##JCAMPDX= 5.01
$$ ##ORIGIN= Bruker BioSpin GmbH
$$ ##OWNER= nmr
$$ C:\u/data/dgb/nmr/ADRS/520/pdata/1/auditp.txt
$$ ##AUDIT TRAIL=  $$ (NUMBER, WHEN, WHO, WHERE, WHAT)
(   1,<2006-06-12 10:56:57.12 +100>,<MAYBRIDGE\nmr>,<NMR_250MHZ>,
      <created by zg, POWCHK disabled, PULCHK disabled
       configuration hash MD5:
       E2 DF 36 D8 04 B2 41 60 5A D7 A3 38 5A 4B D0 FE
       data hash MD5: 64K
       9E 63 18 9E E2 CF 18 23 27 04 13 D5 C0 57 DA 01>)
(   2,<2006-06-12 10:57:16.00 +100>,<MAYBRIDGE\nmr>,<NMR_250MHZ>,
      <Start of raw data processing
       ef LB = 0.3 FT_mod = 6 PKNL = 1 SI = 32K 
       data hash MD5: 32K
       B1 2D 00 2D 22 C6 AA BC 72 5A D3 0A 44 F5 FB 5E>)
(   3,<2006-06-12 10:57:19.51 +100>,<MAYBRIDGE\nmr>,<NMR_250MHZ>,
      <apk 
       data hash MD5: 32K
       9D 4C 2C 4A 33 BF 6F 8C 2E 29 C5 65 1D D4 CC 5C>)
(   4,<2006-06-12 10:57:20.93 +100>,<MAYBRIDGE\nmr>,<NMR_250MHZ>,
      <abs ABSG = 5 
       data hash MD5: 32K
       EE F1 5B 8D 25 CD 91 AE 2F 5C 3B 98 6D 92 56 EC>)
$$ ##END=
$$ 
$$ hash MD5
$$ 10 87 82 BB 2C 1F 9E 9B B7 8D EF A3 0E F0 C7 EA
##$RELAX= 
##$RELAX= 
##$RELAX= 
##$RELAX= 
##$RELAX= 
##$RELAX= 
##$RELAX= 
$$ Bruker specific parameters
$$ --------------------------
##$DU= <C:\u>
##$EXPNO= 520
##$NAME= <ADRS>
##$PROCNO= 1
##$TYPE= <nmr>
##$USER= <dgb>
##$AMP= (0..31)
100 100 100 100 100 100 100 100 100 100 100 100 100 100 100 100 100 100 
100 100 100 100 100 100 100 100 100 100 100 100 100 100 
##$AQSEQ= 0
##$AQ_mod= 3
##$AUNM= <au_zg>
##$AUTOPOS= <15 >
##$BF1= 250.13
##$BF2= 250.13
##$BF3= 250.13
##$BF4= 250.13
##$BF5= 500.13
##$BF6= 500.13
##$BF7= 500.13
##$BF8= 500.13
##$BYTORDA= 1
##$CFDGTYP= 0
##$CFRGTYP= 5
##$CHEMSTR= <none>
##$CNST= (0..31)
1 1 145 1 1 1 1 1 1 1 1 1 1 1 1 1 1 1 1 1 1 1 1 1 1 1 1 1 1 1 1 1 
##$CPDPRG= <>
##$CPDPRG1= <>
##$CPDPRG2= <>
##$CPDPRG3= <>
##$CPDPRG4= <mlev>
##$CPDPRG5= <mlev>
##$CPDPRG6= <mlev>
##$CPDPRG7= <mlev>
##$CPDPRG8= <mlev>
##$CPDPRGB= <>
##$CPDPRGT= <>
##$D= (0..31)
0 1 0 0 0 0 0 0 0 0.06 0 0 0 0 0 0 0.0002 0 0 0 0 0 0 0 0 0 0 0 0 0 0 
0 
##$DATE= 1150106215
##$DBL= (0..7)
120 120 120 120 120 120 120 120 
##$DBP= (0..7)
150 150 150 150 150 150 150 150 
##$DBP07= 0
##$DBPNAM0= <>
##$DBPNAM1= <>
$$ [...]
##$SUBNAM6= <"">
##$SUBNAM7= <"">
##$SUBNAM8= <"">
##$SUBNAM9= <"">
##$SW= 20.6930455092707
##$SWIBOX= (0..15)
0 0 3 0 0 0 0 0 0 0 0 0 0 0 0 0 
##$SW_h= 5175.983436853
##$TD= 65536
##$TD0= 1
##$TE= 296.16
##$TE2= 300
##$TE3= 300
##$TEG= 300
##$TL= (0..7)
0 120 120 120 120 120 120 120 
##$TP= (0..7)
150 150 150 150 150 150 150 150 
##$TP07= 0
##$TPNAME0= <>
##$TPNAME1= <>
##$TPNAME2= <>
##$TPNAME3= <>
##$TPNAME4= <>
##$TPNAME5= <>
##$TPNAME6= <>
##$TPNAME7= <>
##$TPOAL= (0..7)
0.5 0.5 0.5 0.5 0.5 0.5 0.5 0.5 
##$TPOFFS= (0..7)
0 0 0 0 0 0 0 0 
##$TUNHIN= 0
##$TUNHOUT= 0
##$TUNXOUT= 0
##$USERA1= <user>
##$USERA2= <user>
##$USERA3= <user>
##$USERA4= <user>
##$USERA5= <user>
##$V9= 5
##$VALIST= <valist>
##$VCLIST= <CCCCCCCCCCCCCCC>
##$VD= 0
##$VDLIST= <DDDDDDDDDDDDDDD>
##$VPLIST= <PPPPPPPPPPPPPPP>
##$VTLIST= <TTTTTTTTTTTTTTT>
##$WBST= 1024
##$WBSW= 4
##$XGAIN= (0..3)
0 0 0 0 
##$XL= 0
##$YL= 0
##$YMAX_a= 290121
##$YMIN_a= -379962
##$ZGOPTNS= <>
##$ZL1= 120
##$ZL2= 120
##$ZL3= 120
##$ZL4= 120
##$ABSF1= 16.522
##$ABSF2= -4.171173
##$ABSG= 5
##$ABSL= 3
##$ALPHA= 0
##$AQORDER= 0
##$ASSFAC= 0
##$ASSFACI= 0
##$ASSFACX= 0
##$ASSWID= 0
##$AUNMP= <proc_1d>
##$AZFE= 0.1
##$AZFW= 0.1
##$BCFW= 0
##$BC_mod= 0
##$BYTORDP= 0
##$COROFFS= 0
##$CY= 12.5
##$DATMOD= 1
##$DC= 0
##$DFILT= <>
##$DTYPP= 0
##$F1P= 14.0000005364418
##$F2P= -0.99999901652339
##$FCOR= 0.5
##$FTSIZE= 32768
##$FT_mod= 6
##$GAMMA= 0
##$GB= 0
##$INTBC= 1
##$INTSCL= 1
##$ISEN= 128
##$LB= 0.3
##$LEV0= 0
##$LPBIN= 0
##$MAXI= 10000
##$MC2= 0
##$MEAN= 0
##$ME_mod= 0
##$MI= 0
##$NCOEF= 0
##$NC_proc= -5
##$NLEV= 6
##$NOISF1= 0
##$NOISF2= 0
##$NSP= 0
##$NTH_PI= 0
##$NZP= 0
##$OFFSET= 16.522
##$PC= 1
##$PHC0= 173.48
##$PHC1= 6.627131
##$PH_mod= 1
##$PKNL= yes
##$PPARMOD= 0
##$PSCAL= 4
##$PSIGN= 0
##$REVERSE= no
##$SF= 250.13
##$SI= 32768
##$SIGF1= 0
##$SIGF2= 0
##$SINO= 400
##$SIOLD= 32768
##$SREGLST= <1H.CDCl3>
##$SSB= 0
##$STSI= 32768
##$STSR= 0
##$SW_p= 5175.98343685301
##$SYMM= 0
##$S_DEV= 0
##$TDeff= 65536
##$TDoff= 0
##$TI= <Analysis number 999999
Compound Code 99
Book Reference 9
Project Code 9>
##$TILT= no
##$TM1= 0
##$TM2= 0
##$TOPLEV= 0
##$USERP1= <user>
##$USERP2= <user>
##$USERP3= <user>
##$USERP4= <user>
##$USERP5= <user>
##$WDW= 1
##$XDIM= 32768
##$YMAX_p= 328322346
##$YMIN_p= -913199
$$ End of Bruker specific parameters
$$ ---------------------------------
##NTUPLES= NMR SPECTRUM
##VAR_NAME=  FREQUENCY,     SPECTRUM/REAL,   SPECTRUM/IMAG
##SYMBOL=    X,             R,               I
##VAR_TYPE=  INDEPENDENT,   DEPENDENT,       DEPENDENT
##VAR_FORM=  AFFN,          ASDF,            ASDF
##VAR_DIM=   32768,         32768,           32768
##UNITS=     HZ,            ARBITRARY UNITS, ARBITRARY UNITS
##FACTOR=    0.157963299565203, 1,           1
##FIRST=     4132.6476996994, 0,             0
##LAST=      -1043.33573715361, 0,           0
##MIN=       -1043.33573715361, -913199,     0
##MAX=       4132.6476996994, 328322346,     0
$$ Real data points
##PAGE= N=1
##DATA TABLE= (X++(R..R)), XYDATA
$$ [...]
27057 5988 -177076 -79355 -48725 -26539 -182504 -207936 -169147 -52401 212571 282751 64778
27046 64778 63899 65087 -197691 -142081 51220 71447 -69199 -156707 -19893 14469 19527 -66022
27034 -66022 -674 276623 180976 139507 377138 486396 274504 301728 365315 278424 303558
27023 303558 25788 25961 235532 305817 5503 -61021 59205 18230 22835 -35527 -200936
27012 -200936 -330005 -507608 -495368 -493177 -637992 -556043 -251561 -7817 312268 316520 361167
27001 361167 327691 302129 247782 213459 220786 383334 298811 127886 18524 -113113 -16952
26990 -16952 -85789 -321546 -445431 -309232 -231535 -233512 -287924 -426793 -334784 -239611 -155037
26979 -155037 -141893 -205480 -310669 -192424 -148835 -297511 -261498 -32940 -144726 -202672
26969 -202672 -263395 -112529 -276468 -324937 -345845 -390946 -309717 -256405 -282597 -205305 -46605
26958 -46605 194176 276887 -55078 -102491 -14752 -123736 -124183 -171571 -305077 -263736 -467928
26947 -467928 -623650 -265705 18145 112257 59338 86794 -28731 -121053 -32696 -68029 -54177
26936 -54177 -126337 -236394 -165318 21993 -193669 -108254 -81591 -240283 -220786 -215954 94344
26925 94344 117118 181768 252259 21815 -3970 -74158 -101597 -67787 -171160 -341975 -272021
26914 -272021 -62749 -95643 -357879 -341769 -100392 -4478 27922 170085 112451 -12570
26904 -12570 44079 175252 -56104 -25204 116039 18434 -396331 -379874 -167444 46036
26894 46036 177006 97416 -108525 116016 414624 258689 232504 -21188 -78321 -115773
26884 -115773 -227320 -114259 -29531 123031 19137 -164454 -298850 -346863 -562514 -545164
26874 -545164 -299438 -92764 -112348 -153432 -180346 13209 65961 57699 -44557 138455 271461
26863 271461 273976 167503 44630 -113941 -238381 -235524 -67341 -213971 -501449 -454168
26853 -454168 -529141 -406597 -156445 -76130 -111317 -170757 -151041 -175423 -217091 -226896 -285698
26842 -285698 -356123 -219028 -203011 -163390 -47133 70143 106981 13935 -120263 -114219 51706
26831 51706 -6537 68342 104234 19919 103495 -30810 -508364 -483107 -292598 -86813 118891
26820 118891 24154 136844 150357 234198 653120 645349 402194 249348 202075 241915 176364
26809 176364 -12659 -77284 -338366 -276091 -205516 -209567 -50861 84540 299972 264288 291663
26798 291663 368663 411445 89510 -57165 149716 246810 246931 155943 17188 148994 222394
26787 222394 227905 151592 137898 165617 420590 383509 238059 241959 286444 362708 162413
26776 162413 66519 191608 297878 272512 168453 -86820 -210613 -105783 33187 228038
26766 228038 59364 -230618 -187997 96390 227326 -25794 -219780 -226985 -109612 59852
26756 59852 158966 173358 201622 158884 319899 485185 613237 628623 323816 213245 156231
26745 156231 -23839 -92816 -35715 97754 255133 17695 -103548 -178546 -432019 -449316
26735 -449316 -337522 -81894 220073 277771 48578 -138746 -273907 -106226 204951 352731
26725 352731 427054 493262 168417 87230 29794 -35588 -62640 82004 126888 247674 270784
26714 270784 241218 242306 56235 -93452 -182840 -121231 -27826 45340 320230 324379 7776
26703 7776 -99634 -87040 158580 173545 154138 353805 387526 347429 469684 374070 98120
26692 98120 54125 354733 419277 286573 189343 254785 51228 -161125 -331476 -501882
26682 -501882 -297733 -218142 -302677 -366295 -269214 -327445 -522268 -326534 -159409 -8508
26672 -8508 48238 148037 -95042 71409 255656 54487 -1881 -115957 12242 249535
26662 249535 125630 106126 116038 224861 132860 92855 -75465 -151422 -358708 -485638 -148942
26651 -148942 -221155 -290826 -215943 -56668 -98997 72516 46766 63417 -38214 -161727 -273404
26640 -273404 -305936 -287177 -292036 -339317 -161578 -155288 -28169 17533 39551 128671 367109
26629 367109 69283 -268132 -435473 -294031 -9063 224698 285466 245973 377806 680425
26619 680425 314428 350892 463157 293784 183913 140410 275475 238509 193137 236593
26609 236593 251648 363433 392972 275788 132030 64946 -55446 32361 125982 223311 325841
26598 325841 411974 325285 -172550 -439811 -473231 -346963 -331254 -48875 379240 466180
26588 466180 385182 137068 -72082 -368436 -358194 -111323 21386 68867 274666 471853
26578 471853 312984 110116 -101165 -153695 -49785 127909 253737 75349 231412 376193
26568 376193 188194 245300 163991 -270894 -500699 -247394 -76615 -225445 -192595 -273246
26558 -273246 -208968 -270718 -285743 -151469 -168529 -367294 -191713 3334 23205 -82922
26548 -82922 -426558 -405377 10526 186592 482079 433670 384166 525921 248021 375219
26538 375219 312112 19948 -191979 -93846 -146823 155916 178275 197388 148413 103065 -168326
26527 -168326 -157490 -109635 -170989 9573 351384 227202 169117 14830 -119628 -115720 -185356
26516 -185356 -420778 -247443 38407 202878 84214 21615 111511 174231 -177815 -45292
26506 -45292 163088 -101249 -41817 56189 12556 -82077 -278374 -487162 -401927 -235612 -264197
26495 -264197 -193494 32169 -21525 83514 256800 312697 272927 151884 238046 607211
26485 607211 725610 583451 224576 288491 167546 26383 -321782 -259645 97162 403119
26475 403119 505555 525960 543015 124884 -126921 -108214 -115419 -345093 -122417 -75447 -135792
26464 -135792 -88792 -93330 -374055 -334743 -285405 34737 258314 407808 114003 -92759
26454 -92759 -242194 -206764 31381 -85241 -150026 50327 99304 137894 190959 201459 68648
26443 68648 -178608 -211047 -264292 -70985 229123 248724 60788 253558 317304 84652
26433 84652 -76658 -240641 -120298 -89386 34718 53287 -50999 27487 91144 13715 42281
26422 42281 253105 289265 -1705 -176177 -199897 -259720 -222593 -179849 -401422 -358495 -236157
26411 -236157 -96599 -2260 124377 133846 162971 320973 293411 169158 50102 9130 -40229
26400 -40229 -15070 -169836 -200088 -124465 -103560 45725 120939 178628 56133 -145185 -77328
26389 -77328 86924 99181 161341 342002 395554 301241 381399 477289 483652 350325 423492
26378 423492 486852 439038 331622 373485 236536 89267 -18245 -218965 -456405 -350471
26368 -350471 -309616 -252513 -91616 -200102 -23352 -139827 -303706 -208180 -54950 -30667
26358 -30667 -104513 -87324 2224 38850 -12559 728 32939 8537 -381447 -392209 -308132
26347 -308132 -301376 -344761 -260622 -64286 -27417 -195300 -68955 186761 112403 17591 39277
26336 39277 62284 17403 94283 42201 136377 249258 173790 37377 108253 24124 -95801
26325 -95801 -253347 -480384 -362618 -214953 -98171 -79327 -43898 -5227 -32240 -22206 95263
26314 95263 201619 314781 283290 326345 203729 -44997 -69993 -61246 -16910 76752 62550
26303 62550 -144618 -111382 -173682 -21008 31840 46435 75477 -168078 -271367 25166 76803
26292 76803 101615 238355 145213 -148538 -121130 41125 254082 363454 341651 311515 192749
26281 192749 160858 195617 372290 242820 176057 75713 -15009 -111474 -179100 -258474 -347102
26270 -347102 -171434 60655 215322 226852 148972 -88678 -255252 -166211 -23849 66251
26260 66251 198112 92408 -75760 -54118 -1734 -63023 -184430 -149454 57429 86008 -49780
26249 -49780 -7001 132047 391797 324235 314087 388430 127714 40245 18147 10810 174442
26238 174442 112810 64993 97654 116048 140014 82405 -159469 -301936 -339797 -252454 -111385
26227 -111385 8447 -44126 -238577 -60522 145084 121595 227691 72802 -221301 -110482
26217 -110482 388015 549144 409564 455176 501401 473393 429882 286174 285922 166597 237717
26206 237717 546205 662029 480264 430488 451886 191125 82398 -63838 -109686 -87205
26196 -87205 -74452 -219302 -205820 -151682 -255905 -213222 5766 -60603 -252685 -215256 112962
26185 112962 57591 105758 129415 -78800 -171050 -391247 -455502 -290232 -248772 -312836 -585158
26174 -585158 -584546 -482603 -410316 -294273 -368078 -527447 -547807 -405634 -84225 27832 140506
26163 140506 160012 122278 71950 19616 236530 320022 274289 224443 43186 -126397 -251488
26152 -251488 -211083 -159726 -380937 -291280 -202887 6821 -9243 -278845 -433020 -262036
26142 -262036 -21373 25598 -671 -66132 -117252 -317750 -390244 -142681 114038 1774
26132 1774 -17714 -101643 -116314 -366015 -421341 -177250 -24964 -10882 -51796 -194029 -362288
26121 -362288 -396659 -303818 22832 -63133 -89038 -110007 -152489 -12032 -232982 -154506 81110
26110 81110 100089 -70045 -211215 111600 169179 -121488 -199879 -60978 -160964 -259833 -61590
26099 -61590 158707 303757 251535 120961 110872 86653 -68871 15430 352677 279712 77288
26088 77288 -12600 13866 11478 27976 -5951 -129700 -75166 -119009 -1754 -47963 184206
26077 184206 93953 105130 79218 136594 206848 248464 33526 88830 89085 222309 195644
26066 195644 28519 -75466 17411 111647 25166 -156 -103535 -25305 1515 -47183 -233859
26055 -233859 -358417 -434642 -529441 -428244 -278089 -319461 -110670 -80572 -380897 -495269
26045 -495269 -337904 -264465 -295624 -217749 -28171 112519 297513 252200 225174 -109868
26035 -109868 -409852 -183940 27728 27669 135134 140396 26482 -81994 -143554 -93649 -44212
26024 -44212 118895 317821 339937 288747 132800 85144 264842 189369 28077 -64442 -164670
26013 -164670 -133466 -141166 -264674 -272146 -167818 -46810 -22536 -12130 143396 457898 433418
26002 433418 340984 226312 -84614 -158861 -251598 -286159 -238683 -338982 -249654 -83970 -35403
25991 -35403 171994 186565 103375 121160 112465 32852 135 -334230 -80807 311570 -27663
25980 -27663 -90637 -5479 -110136 -105178 21597 189354 455516 531459 338972 92643 43087
25969 43087 264271 249678 110306 124526 -137780 -224823 -134055 60173 104192 -55973 -124440
25958 -124440 91796 -95055 -254089 -140647 118948 272423 195847 -59908 -77144 25189
25948 25189 269107 233609 -27808 -69960 92076 278210 60681 131271 284127 363017
25938 363017 243745 -70867 -162123 -101828 -31118 126577 281626 90383 139174 103206
25928 103206 54687 189320 409376 403167 474622 530004 487011 329891 66642 -170286 -193987
25917 -193987 -139222 -177658 -239571 22061 188000 249599 179490 114248 288318 266643 94469
25906 94469 28320 -136279 -206217 140369 309874 170210 145619 198838 -42265 -225416
25896 -225416 -25072 89302 60990 175917 126085 23487 259347 335674 246635 16891
25886 16891 -201202 -61972 162608 107929 -10231 180177 80228 -145290 -113571 -82530
25876 -82530 87478 235968 123030 -40250 -158262 -246653 -71128 81132 173461 205677
25866 205677 68877 -2994 -168916 -101568 242708 611031 586263 245431 10211 3211
25856 3211 13657 -61044 112210 -27787 -35494 97061 188081 189046 91218 -205162 -439935
25845 -439935 -243763 -63704 -38937 97061 460073 405505 148574 -170551 -260043 -400926
25835 -400926 -421901 -303990 -524569 -331408 -106380 -5687 -5892 225532 245471 41575
25825 41575 204319 303583 113554 -108888 -297488 -232653 -226361 -41253 -90727 -109381 -192990
25814 -192990 -203780 -77453 120899 152469 302097 277651 152143 193362 33109 87975
25804 87975 143948 214361 101818 82771 44102 69030 -44137 -96042 57961 222406 283654
25793 283654 140407 -192805 -509049 -349261 6226 117184 -288536 -411378 -543794 -585293
25783 -585293 -196139 202013 91095 101499 106971 163656 155905 -96939 -358817 -227285 105729
25772 105729 173522 203386 146541 -4471 215778 285688 331767 306223 226152 125816 -60844
25761 -60844 200072 336873 465786 239092 70367 52958 5900 150693 249167 234503
25751 234503 41601 -193311 -301588 -213014 -138552 -159823 -86303 60465 53412 242887 255539
25740 255539 62515 -103106 -459715 -317673 -132727 -71760 138707 475376 149253 -464244
25730 -464244 -618434 -438802 -407777 -370912 -391257 -287096 -345781 -171798 -1217 -97944
25720 -97944 -146009 -165829 -89679 146959 145787 92034 303006 309145 400606 178935 290718
25709 290718 155446 -94269 -275635 -312673 -122090 289188 468758 266398 212672 29431
25699 29431 91833 28556 -109526 -373925 -458773 -302452 -259292 -210945 -174581 16339 172541
25688 172541 312296 518350 287812 -132372 -163204 -296439 -417945 -448541 -183039 -205555
25678 -205555 -223164 24520 174115 286651 -148377 -240242 -181733 -161194 205540 449922
25668 449922 304902 28802 -18525 -82180 -86251 156677 104742 218372 97770 -62811
25658 -62811 -92224 -61969 -31554 52344 97175 181548 105152 -24070 -17355 -47711 73024
25647 73024 248578 246265 224426 311431 350814 50708 -16095 -80868 -105984 13598 2457
25636 2457 10369 128958 101267 84130 77895 42026 194052 400173 297435 43770 129666
25625 129666 205825 153991 9385 -121766 -81820 97689 52172 -200093 -49096 150989
25615 150989 153714 284056 231672 47161 31288 -16003 -85001 -434872 -321879 -203799 -71817
25604 -71817 195568 121880 114045 60110 72257 315717 57921 -239791 -157191 55833 61120
25593 61120 -113303 -227061 -76083 -8524 17405 -68168 -55412 45007 96372 -32042 -115062
25582 -115062 55154 185237 105728 36225 13696 -15950 -85710 211103 155577 315367 429394
25571 429394 319164 106575 -182521 170880 375505 264131 88909 17403 -92282 -61205
25561 -61205 69147 179198 96531 -202255 -251030 -205972 -63622 -87165 -154551 -203467 21586
25550 21586 171303 171644 290881 158024 -99322 -174260 -215041 -162152 89830 160306 119604
25539 119604 57357 134504 210880 23400 -195114 -79329 -142427 -275452 -70229 -205140
25529 -205140 -426016 -181142 -54151 119476 220800 120586 53634 9714 -127961 -249804
25519 -249804 -208401 -42657 198306 288986 159507 76861 153476 31723 -33431 104078
25509 104078 262907 251698 77732 -95577 176988 139147 -307602 -331303 -183313 -170982
25499 -170982 -215248 -224538 -162442 -83348 -81727 -71662 -140417 -284594 -79215 121481 349260
25488 349260 73042 -202047 -114709 -43076 -158153 6090 341225 513471 228330 -335054
25478 -335054 -477195 -375713 -516065 -414897 -314931 -119752 119160 76897 -93855 -43716
25468 -43716 132590 21509 -98018 -257065 -421318 -451638 -420518 -469171 -355268 -234945
25458 -234945 -246235 -70829 64367 74349 -63050 -107972 -138966 50498 100485 104284 179965
25447 179965 62777 201625 -40198 -182016 -249424 224223 391223 254820 225351 383481
25437 383481 210881 -128737 -125270 -249176 -381656 -131464 -57312 -155933 -237456 -247627 -338929
25426 -338929 -357150 -63556 -142822 -171445 -28532 -219172 -115616 321405 282364 -93446
25416 -93446 -251221 -182932 -204076 -38775 254392 369151 147789 305681 389989 105766
25406 105766 14027 130152 341260 -85710 -286691 -428011 -328779 -257708 -273725 -269087 -294216
25395 -294216 -299630 -566565 -703703 -516163 -3435 212542 233200 524668 479395 324754
25385 324754 249961 307168 311221 323635 163155 134016 -22812 -9482 117855 -106047 -292374
25374 -292374 -222494 -174734 -159317 -188009 -53921 9870 67493 140503 14006 -237527 -291572
25363 -291572 -273228 -264551 -296339 -182069 -119985 -28206 168324 159090 -42514 -188804 -11613
25352 -11613 295862 347227 131372 156604 275189 364570 465656 322998 146034 97398
25342 97398 14001 -43603 -58954 -104258 -121989 10522 17073 -136965 137727 321608 225961
25331 225961 104716 -148038 36161 228840 22537 -139041 -198177 -40622 242778 332807
25321 332807 321436 290261 345765 324326 292588 189038 -55007 -365844 -343024 -7490 -29020
25310 -29020 -218534 -149160 -190970 -466687 -495597 -610698 -721255 -729429 -532504 -177116 -59635
25299 -59635 -138027 -403599 -578125 -450777 168379 155189 -86932 -2488 -121972 -13211
25289 -13211 -338479 -493901 -347496 -93015 -326113 -391166 -276379 -266885 -174760 -107396 22814
25278 22814 56627 129057 25792 100367 117256 -45232 -272553 -301479 -194070 -174056 -133692
25267 -133692 991 -14139 -115040 -157886 9761 131622 75742 -33882 49057 -58936
25257 -58936 114825 172627 259022 148940 201801 335915 69643 -263982 -190808 -144531 -18988
25246 -18988 -178668 -164619 -217023 -217264 -59948 99381 14191 -192191 -175231 46336 90594
25235 90594 -40179 36174 148594 141484 109370 310363 378890 291153 97223 82288 46571
25224 46571 -100950 -74596 -60956 -207069 -436251 -332342 -394633 -87897 124624 -131623
25214 -131623 -178029 -152231 -78101 -4402 150020 260664 443653 501828 241591 4858
25204 4858 -112841 8871 105445 -311464 -316135 -162661 -288906 -404792 -475281 -605084 -550635
25193 -550635 -385100 -334059 -142974 -171191 -299084 -394521 -99914 294060 220821 107382
25183 107382 293718 282672 55865 -136238 -53676 79788 58554 159906 163139 149641 13392
25172 13392 -114762 17518 195816 -7451 -108831 123081 202762 184961 513909 379934
25162 379934 156390 95498 54605 358946 453181 262988 -124569 -191769 -245588 -275317 -111109
25151 -111109 -597 -53893 -11872 61960 44862 -131196 -123634 -235852 -169698 30011 96602
25140 96602 -70904 -231232 -172223 -236030 -369673 -537975 -731460 -567753 -356256 -294639
25130 -294639 -203336 -196336 -19690 -91810 -432072 -520779 -413729 -227784 -125426 -202580 -368205
25119 -368205 -275377 -245443 -146365 30312 131850 -187472 -423330 -181195 29291 190605
25109 190605 222855 90278 71097 137499 188391 46719 -141076 -205370 -37578 60234 -92130
25098 -92130 46496 45983 -194587 -256819 -81235 -80436 -76297 -55337 -69588 -154159 -160548 -31087
25086 -31087 -205793 -399023 -419782 -221557 -256380 -94129 108012 -3076 -378868 -763315
25076 -763315 -594175 -453219 -372617 -328910 -329994 -278666 -354244 -61771 153103 -120425 -250057
25065 -250057 -87398 -138662 -321583 -156028 -80399 -179376 -26584 -122242 -74841 160654
25055 160654 335325 321881 161169 55385 66582 244310 235363 -124535 -65560 -189750
25045 -189750 -37976 133433 54097 98072 226334 65880 77533 135835 -189026 -141433
25035 -141433 170705 -119199 -156441 -35329 -121292 -80496 77309 133895 -33948 -10168
25025 -10168 -133677 -116609 -91541 -335134 -356591 -146909 -100294 -69038 59140 -9321 -50263
25014 -50263 21875 -66209 30319 162394 225594 236559 256674 34084 -64768 9800 55439
25003 55439 223818 275995 265738 200253 -40973 -156297 -57164 13726 -75712 -191715 121497
24992 121497 350867 167911 133052 147232 223555 184922 270994 280546 103336 190503 175003
24981 175003 167658 300624 470226 183050 257309 271597 177055 3040 -242653 -302263 -427068
24970 -427068 -487998 -468028 -264408 27178 144550 105430 156199 131952 184064 356684 389555
24959 389555 340446 319040 367713 207869 -51898 108779 369681 508034 417620 245301
24949 245301 76987 -145412 -167770 -384720 -536903 -697654 -496333 -429622 -13355 89001
24939 89001 134361 195039 104983 129000 230909 245398 35607 111813 120973 215185 149429
24928 149429 133170 124267 155468 -93423 -46925 65538 8047 61359 64790 -85723 129499
24917 129499 -40767 -253596 -88745 -79216 -22954 93144 57545 287286 370348 327889 243464
24906 243464 160831 179167 149329 199627 77728 -19516 -384502 -368001 -68452 31404 -128646
24895 -128646 -175845 -25094 89918 199585 194917 71254 -52323 11410 -126809 -359864
24885 -359864 -335174 -216350 -107634 20321 -161974 -182999 -162014 -333068 -305985 -273417
24875 -273417 -165453 -112599 -184694 -261187 -315454 -63633 54065 24373 -10001 -41370 147381
24864 147381 327260 264494 172947 187777 151680 136096 31984 -3605 152542 324214 198609
24853 198609 74587 180533 181236 170941 191271 195609 185680 168580 209456 283585 191020 68216
24841 68216 610 139678 96446 225845 446380 686954 551573 26282 -324845 -546340
24831 -546340 -448139 -315054 -696518 -659437 -204344 3212 6050 97353 255238 387547
24821 387547 387389 190146 -6523 61421 216356 157678 -113260 -236601 -65783 26430 155137
24810 155137 183119 257759 117397 -27570 -178691 31647 57302 -218744 -33201 66052
24800 66052 161988 214231 130853 111353 33803 16109 143256 182676 34771 -38440 92147
24789 92147 -51545 -136760 142179 268627 384480 327533 59565 -48019 -174553 -257502
24779 -257502 -271597 -422788 -483755 -382166 -188431 -201377 16951 181615 80128 21573
24769 21573 -194453 -282057 -157084 -15313 10959 25744 -10502 17516 96999 193414 112015
24758 112015 -70794 -434670 -446401 -204864 -1166 -179552 -195036 -122930 -217681 -18980
24748 -18980 69458 162177 -9506 -85310 -230709 -188849 -103523 57823 136931 114346 49372
24737 49372 -117314 -162973 -284437 -48089 -64380 -195251 -226754 -43165 233515 93180
24727 93180 103346 130244 209550 312178 249841 202707 172304 136071 102784 1242 47762
24716 47762 -25818 -8619 95982 115330 -166015 -73759 -30027 24270 -181268 -119855 -120772
24705 -120772 -256625 -463420 -333832 -296029 -301657 -448176 -490350 -357079 -174137 162701
24695 162701 125020 140502 20755 -164542 -136788 262693 369082 416324 365160 110617
24685 110617 139528 298693 209621 177108 -203561 -448844 -138071 313423 486934 439582
24675 439582 423464 138378 -43910 -136559 -130986 -132928 -86597 6005 235102 -46500 -138745
24664 -138745 67188 203414 88194 -23339 -36742 -77338 -161926 -4603 800 113437
24654 113437 169455 220507 102038 12491 131011 -32477 -74186 89256 -53699 -36153
24644 -36153 176108 88470 258964 376901 537732 414823 98756 -257777 -170501 -233709
24634 -233709 -96999 121316 101460 210633 362278 510623 506183 467194 392047 275296
24624 275296 79533 79857 -33171 -211583 -358487 -430485 -462727 -120238 7233 48845 39721
24613 39721 -100009 64439 244604 161793 130575 210706 84166 -194688 -202277 -155596 -33193
24602 -33193 -123426 -171383 -200953 -272248 -255214 -397283 -536012 -319776 -45167 33758 101765
24591 101765 101281 10886 -66597 146609 469313 454758 414606 648259 598558 -7095 -96264
24580 -96264 -100868 -75330 -24600 -184452 -260861 -90108 84560 106315 72780 -93222 -156164
24569 -156164 -320966 -296103 -208261 -129685 -404330 -353277 -240233 -330675 -483258 -291626
24559 -291626 -430931 -331555 -212858 -169506 -140353 -15906 -274334 -270155 -282032 -423228 -363331
24548 -363331 -476909 -482388 -349225 -266490 113374 160292 219722 402183 331718 153603 356839
24537 356839 544192 451867 355385 117927 143776 24292 -211386 -305272 -129195 173566
24527 173566 267934 278629 114100 -36618 -85535 -153291 -300689 -284070 -247647 -272537 -466942
24516 -466942 -376950 -345491 41100 160835 212860 160864 90972 95051 145728 82407 -1086
24505 -1086 -33349 -56450 113441 151574 70878 86112 -137585 -155088 -216741 47916 72781
24494 72781 166735 323294 191669 58670 -376506 -604104 -621070 -437008 -317266 -385900
24484 -385900 -83989 249718 427883 260537 7725 225507 345260 256793 81961 17460
24474 17460 -16419 243291 210361 139086 -20337 -105111 -57601 -328155 -298255 -244923 -125552
24463 -125552 -197592 -261106 -159479 -40824 -75067 11021 -152331 -307752 -151629 -83315
24453 -83315 136466 -34500 -318567 -500638 -519421 -317931 -153819 -80643 -4790 55207
24443 55207 -139818 -300236 -156148 97926 78658 -68750 -77499 -119449 -129046 -195575 -38812
24432 -38812 184644 298084 203141 -28684 -16779 -132817 -119699 111245 292277 228835
24422 228835 133216 254991 269232 376255 433252 519113 228091 200045 138062 -64933 -251347
24411 -251347 -230799 -249197 -220930 -34437 221587 426295 134725 92071 257072 -4036
24401 -4036 -316747 -306563 -127616 -22944 153571 106987 269468 170853 18440 -743 -5589
24390 -5589 38244 -56506 83525 52949 -68585 -82120 41086 -203632 -159127 -53484 -4829
24379 -4829 -174719 -237335 -33893 116819 121218 6571 -241051 -386787 -462928 -154481 121459
24368 121459 66352 267466 352083 64150 -11872 -124895 -140330 -138701 -78937 68648 10881
24357 10881 -3115 168698 300271 354741 402137 258429 185028 15604 -46439 186343 240418
24346 240418 -207829 -280974 -161286 6845 54649 92664 115473 314283 348701 412634 223242
24335 223242 148727 -23752 -102473 71651 1817 -30076 87742 259858 114222 62459
24325 62459 134726 201656 120826 -26438 46441 102996 -982 28460 -191579 -251246 34431
24314 34431 116681 59867 -63320 -170900 -20314 219514 214524 114840 112962 40652 -104819
24303 -104819 -134072 71578 265520 178288 127215 106806 1476 -105929 75032 134925
24293 134925 197046 257514 263757 180953 298158 51165 40836 110030 -106556 -194693 20897
24282 20897 490998 522368 406280 240329 223725 237813 157727 -92335 -147319 -345146 -675163
24271 -675163 -488331 -299177 -163682 -250418 -369150 -592769 -833573 -810654 -683120 -747975
24261 -747975 -561314 -376257 -152604 -174385 -231680 -146165 -68982 -112593 -46881 27082 -354058
24250 -354058 -518033 -203334 195439 320028 365084 379367 267218 164673 -20831 -129358
24240 -129358 28704 113102 204309 17548 -259799 -300683 -226582 -172387 -148856 -159269 27684
24229 27684 -39539 -248111 -285593 -8670 42078 -175714 -271210 -133702 -120146 3342 197894
24218 197894 87186 242245 273455 231580 158574 60604 178069 324874 243237 256323 54170
24207 54170 -126316 -117224 -66930 -123198 -80919 13839 115240 141699 166416 -50601 -102104
24196 -102104 -178944 -262777 -27939 78545 110518 53613 -53625 -10280 -320454 -386653 -233964
24185 -233964 -105274 -155588 111767 248537 264914 105099 189375 181347 -2630 -10322 -520
24174 -520 -307926 -275756 -38779 -58372 -152582 -157004 -213814 -192405 -167941 -287704 -356879 -412832
24162 -412832 -216365 112467 260389 151903 61989 182471 108423 33408 9979 -409664
24152 -409664 -737567 -606477 -245538 -95535 -151082 -241147 -288004 -100006 -133786 -315754
24142 -315754 -231368 28758 35423 79819 350662 490584 492443 508299 523016 371144 138631
24131 138631 -18057 -190057 -82516 176990 -16563 -313435 -402775 -505121 -256890 -269912
24121 -269912 -158053 -101534 202903 305269 287636 121671 -85536 -221469 -353636 -576071
24111 -576071 -515160 -265590 -162809 -843 43332 -333757 -380947 -303482 -239751 -163805 -302491
24100 -302491 -662032 -711632 -730919 -569812 -367732 -173965 -230606 -319632 -338206 -259024 -101417
24089 -101417 96237 239059 102992 80715 151186 288901 240542 178487 253135 245547 74579
24078 74579 -462 -243887 -468049 -542632 -493114 -327305 -189878 -202601 -234024 -300396 -326319
24067 -326319 -314049 -23017 86974 113642 184181 -30978 -258619 -327507 -341201 -487623
24057 -487623 -305291 193847 105430 77696 -34087 -88736 21441 197523 118401 133461
24047 133461 199998 372586 57305 -141404 -145461 -229130 -183053 -171815 -125411 95985 141132
24036 141132 140494 159849 -49939 -248102 -177011 -112436 -87650 -89447 -330684 -365102 -337514
24025 -337514 -39170 -40462 -293134 -280135 -275571 -121708 -302698 -342491 -228048 -73219 -153318
24014 -153318 -284516 -347256 -310735 -239165 166926 464518 527478 437771 354166 255122 108905
24003 108905 8683 101408 287803 256389 240484 72499 89694 313381 162883 124200
23993 124200 112028 207461 238541 73601 125074 6728 134602 98797 -64082 -204428
23983 -204428 -173410 82083 244602 -19386 -73567 29131 -33400 27324 -14446 -196649
23973 -196649 -355187 -308275 -394234 -279818 -204385 -128205 138035 160563 177343 117336 77413
23962 77413 32574 125399 97009 -181624 -355659 -297747 -349530 -89327 -132093 -41995 -86712
23951 -86712 106602 348063 332319 258975 276170 238503 171287 195675 196444 -19618 356819
23940 356819 602015 301401 7386 -14153 238002 148852 169818 272065 77539 11247
23930 11247 162450 267363 165357 -31592 -142218 -227261 -335653 -240907 -254341 -127036
23920 -127036 49629 348684 295217 255519 305797 121867 8362 -17354 -8641 -45280 -27906
23909 -27906 -45353 165592 215257 214541 -238435 -392292 -193261 5103 104625 -8649 73262
23898 73262 148381 113030 150899 49707 213055 236088 241232 250077 206570 70958 134908
23887 134908 101061 24709 1299 28244 127193 39207 -321000 -462727 -282830 -335639 -366707
23876 -366707 -225923 121547 149770 -153238 -370609 -194053 111251 75577 4959 54029
23866 54029 163016 51258 26717 -18672 -144972 -321574 -354414 35181 264091 305876
23856 305876 329228 384907 408769 192458 130998 -39706 -39630 -87944 20929 282476 268171
23845 268171 196484 370234 312484 107203 166883 220555 87941 190069 237124 110793
23835 110793 170095 280175 238084 376896 368841 86403 -111285 29515 127244 -96329
23825 -96329 -260795 -92633 14962 123215 105417 7418 68769 -148450 -308248 -210595
23815 -210595 133688 176167 187688 259757 177999 9314 -169092 -193197 -162716 -70978 -167562
23804 -167562 -96741 -34518 -164938 -294365 -315222 -285119 -248241 -223749 -111828 107106 67441
23793 67441 160007 295706 251921 306393 394548 442541 177312 118931 328860 179996 133790
23782 133790 228013 369218 239442 136620 254259 299108 244996 190995 191419 335986 170299
23771 170299 205208 160761 353999 451433 431576 527913 460928 347827 300022 365337 659083
23760 659083 639852 455289 173841 -74644 106890 108128 58227 198668 306448 251530
23750 251530 -75566 -105828 22037 -100196 -30931 51098 82501 98776 39727 -277190 -291166
23739 -291166 -255946 -195643 -2250 26238 10076 55886 198030 257713 305331 432013 359271
23728 359271 114231 131741 179829 178119 -119265 -206542 -221203 -376428 -252298 -209845 -288300
23717 -288300 -333241 -177334 43014 190064 9652 -338905 -434706 -199078 2725 -106587
23707 -106587 -11036 189073 80780 -165709 -301476 -430947 -402831 3950 176425 -129274
23697 -129274 -348659 -299215 -499965 -643758 -289362 48059 26377 -146206 -437165 -390627
23687 -390627 -103599 -151894 -240353 -342907 -360880 -152318 88442 133018 -10855 93710
23677 93710 71242 -6396 -37844 32496 98626 162178 116328 -39449 -123947 -179801 -147314
23666 -147314 -157894 148064 185490 10293 178244 115807 -7144 -176575 -378094 -330213
23656 -330213 -405380 -407042 -428567 -364204 -333490 -192671 -136872 -191105 -89281 -51747 -95508
23645 -95508 121863 387920 227249 99913 176919 165846 216460 56735 -120898 -304807
23635 -304807 -463858 -184064 128777 157392 154942 117932 -20840 -228181 -253981 -159239 -51693
23624 -51693 -19455 -27669 -29706 -77308 -103 181659 271651 462093 348654 154044 333219
23613 333219 416418 313060 126699 -44277 62190 -21987 252636 423824 201971 204651
23603 204651 332243 54291 -227239 -267564 -88774 243785 336012 249985 139553 216383
23593 216383 211038 96240 -74578 293517 404392 457443 361826 219281 934 -20797
23583 -20797 43921 103263 200657 220786 37521 -107538 -28659 -158430 -105588 29870 -91979
23572 -91979 -52141 190111 184301 -118902 -376062 -311618 -140085 -131075 -134045 -409283 -396116
23561 -396116 -473987 -346225 -338464 -370112 -242073 -190374 -119146 -178586 -221259 22854 42264
23550 42264 -57156 -44874 -78951 9321 88857 -55520 -106671 39312 82747 71512 213859
23539 213859 102234 -191929 -68952 274523 341981 175214 290221 355059 405374 135146
23529 135146 -241736 -44252 -55564 7205 -48109 -2272 214285 389843 440297 212264
23519 212264 59287 181476 63808 58591 114754 77218 105558 217453 173639 164681 134810
23508 134810 212931 274266 335449 266394 209800 335630 411865 289752 14034 -204858 -161867
23497 -161867 -75879 -80998 -85148 -149089 -356092 -388633 -173911 -161820 22456 149048 397829
23486 397829 501585 366181 100018 15828 -80836 -43142 218535 494502 536654 558853
23476 558853 257121 -80315 -115577 -123875 176101 457534 437843 389561 260733 203517 -50274
23465 -50274 -155129 -186948 -145060 -159988 -190568 -243115 -332490 -198605 -312611 -293669 -335115
23454 -335115 -154286 -7594 -110960 -211003 -165998 -16450 231895 297149 417773 436575
23444 436575 574930 612051 680105 591391 525108 378876 210164 265267 76812 -117065
23434 -117065 -225753 -377005 -257531 -222851 -274468 -175837 -35534 103789 71914 -166934
23424 -166934 -175860 -128549 -111071 -14049 49450 -79947 -220184 -261717 -204936 -82390 116575
23413 116575 196183 338115 365839 310424 204691 132899 -2602 -256973 -242776 109456
23403 109456 339787 527364 518580 382323 286770 144968 160868 305611 135449 73668
23393 73668 317763 465815 379591 242931 198587 369863 255087 105684 145774 54398
23383 54398 -194599 67886 208047 46193 102634 424047 656381 210023 -232810 -217769
23373 -217769 -24109 -24689 -70410 -164336 -29994 187857 121131 263269 397290 282735 125590
23362 125590 44414 20273 -121525 -257219 -422064 -63162 127154 -60706 -173007 -249367
23352 -249367 -349536 -260463 -195868 -269373 -121886 -172103 14476 142654 -101967 -40060
23342 -40060 125110 137945 29223 -156932 155283 118825 151622 76064 -79407 -270067
23332 -270067 -292014 -146088 -85413 -200550 -228111 -376023 -468852 -521052 -467921 -330744 -200257
23321 -200257 -55206 148716 166318 -41016 -226335 -253777 46443 127078 303050 297993
23311 297993 119883 -22746 -18887 55259 -62292 30717 49717 50438 323420 445803 297173
23300 297173 328389 47737 -120273 84078 82154 -73969 -219937 -398832 -273806 -59635
23290 -59635 96269 256603 165882 -179592 -225653 -265549 -295805 -135387 79058 -89198
23280 -89198 -94875 -25610 -105876 -70073 26197 7983 -246134 -244802 38846 118496 -102921
23269 -102921 -390030 -410226 -43878 236088 251620 154673 9248 -197636 -234189 -11038
23259 -11038 17446 -73080 329189 280565 -278812 -322852 -144209 30867 15536 129436 91032
23248 91032 227337 506242 170031 -19187 118469 257032 36773 -121580 -285365 -336750
23238 -336750 -159940 -278887 -437515 -439216 -130328 16319 -144233 -397167 -405809 -231581
23228 -231581 -42355 -18752 -27442 -14744 20217 16883 -84924 -117405 42898 -84347 -115711
23217 -115711 -263649 -241811 11852 172940 -17416 -282936 -124574 254627 203446 362375
23207 362375 536142 316321 96688 -220398 -55852 -112241 -291718 -206889 -84186 -5126
23197 -5126 -60682 96690 87619 68940 162241 58723 49438 100358 110424 92208 68082 -21807
23185 -21807 -67001 -123176 -116737 103016 95314 74300 -37506 -249467 -299357 -16611 65183
23174 65183 -153636 -345038 -236007 -97445 -128845 -165128 -339867 -203883 -59658 110739
23164 110739 165740 78728 -87992 -144282 -292754 -593007 -589985 -669022 -759669 -589242 -360831
23153 -360831 -274594 3201 89486 72418 177495 214089 238206 18743 -74973 -61972 -38159
23142 -38159 -108415 -41348 -137467 -197748 -231971 -138322 -366896 -506511 -353046 -155640 -255363
23131 -255363 -73112 -58040 -69839 -194496 -148375 -196981 -364389 -479606 -446609 -260549
23121 -260549 -115471 -292734 -381070 -328594 -112269 83007 169108 229389 175786 172919 -132757
23110 -132757 -215330 -297095 -307516 -127415 -39549 -14832 -107736 -239321 -168810 94381 163536
23099 163536 -103729 -53859 57745 181613 72940 47870 -58165 -115173 -87046 47413
23089 47413 143127 135349 -103365 -272244 -105363 -108210 34464 -241713 -310820 -184697 -16290
23078 -16290 136271 227467 248640 385826 475915 343390 63439 -358674 -356389 -147723 -196791
23067 -196791 -178435 -146168 8836 215014 399695 269767 79476 -172842 -238060 -91716
23057 -91716 -143324 -155945 -63400 -51892 -156923 -187316 -36281 -86524 -124475 -149664 -297575
23046 -297575 -140187 47867 154078 99775 -103343 120076 131742 21295 -79718 -147157
23036 -147157 -228812 -167674 -29796 661 -245272 -226269 -118497 85897 230141 103233
23026 103233 53568 367105 373780 372278 173320 -49987 -41434 -277699 -436644 -420823 -312686
23015 -312686 -174340 -287474 -418910 -191781 -4258 164936 97800 -12150 -933 266637
23005 266637 595747 444621 7196 -109027 111522 278059 12732 -3732 126882 286171
22995 286171 324264 119624 -31460 204790 102409 244143 190358 -152176 -255473 -54022
22985 -54022 -272576 -391177 -456013 -507878 -199885 -50929 -131413 -154816 -180276 -181028 -152086
22974 -152086 1188 134338 136628 277758 161001 39092 -288086 -238995 -57522 85888
22964 85888 99546 263022 349681 -21111 -353711 -216682 -271096 -129567 -201477 -684827
22954 -684827 -739403 -398037 -348731 -266298 -158814 -112596 -112904 -258629 -296663 -152684 -173313
22943 -173313 -217551 -294595 -149910 -258356 -349066 -425765 41772 66562 44545 61814 -24071
22932 -24071 -41444 -172931 -446990 -366892 -200153 71579 180596 284046 374875 253669
22922 253669 175920 402949 324774 96472 -91239 -402798 -320282 -11241 -6436 75331 89801
22911 89801 218749 105360 46312 6642 -196314 -14395 152572 235202 269352 255616 134727
22900 134727 115927 180465 -110405 -411977 -305530 -103461 -2189 -15746 28685 79849
22890 79849 -211003 -367926 -181815 -90647 -163781 -130787 -245459 -258047 -666339 -410371
22880 -410371 -208172 -269779 -251097 -317352 -236065 -203762 -50826 -61717 -66675 -146331 -67901
22869 -67901 73721 167811 48746 301948 473344 334706 -78795 -436241 -253948 -208222
22859 -208222 -272599 -332363 -245707 -102861 83628 -31399 -286680 -339306 -297855 -240383 -4372
22848 -4372 -187834 -655520 -871419 -702210 -505789 -158986 150658 281930 100742 1613
22838 1613 137641 286933 90035 -66679 107761 225485 -120814 -381672 -333272 -204736
22828 -204736 -346222 -433371 -443759 -390216 -129436 113888 -57487 -392710 -392205 -74176 78829
22817 78829 6637 -323799 -517642 -244660 -125935 -329159 -432302 -299324 -75068 -24396
22807 -24396 45969 49595 4143 -27524 -76492 -20621 -16962 193405 260072 -12621 -124409
22796 -124409 -386491 -421331 -314067 -396201 -430317 -447044 -394398 1661 149051 218241 212618
22785 212618 215398 135002 236219 246568 -144257 -222715 -210040 -206451 -34115 310420 363367
22774 363367 -31299 -355103 -344475 -120516 -157148 -167362 -430660 -428745 -318351 -250415 -155585
22763 -155585 105606 233063 509648 726532 737152 647899 378611 123589 -45193 -3540
22753 -3540 -53700 -118869 -37184 -43978 -62409 164987 416409 466345 53289 -141167 -207031
22742 -207031 -143263 -192992 -133982 246322 405866 379297 198155 52890 -20455 -41603 118067
22731 118067 267047 195808 354346 462449 447640 211178 181783 243752 47339 -183951
22721 -183951 -236718 -219559 -119170 -252875 -400443 -390488 -439822 -222815 -251127 -356651 -298002
22710 -298002 -71580 -38601 -38077 43274 112031 110718 172915 2637 -43126 41066 53532 -124962
22698 -124962 -416298 -231564 -51283 110525 87019 73805 -63642 -255286 -142805 52026
22688 52026 -13909 5912 97014 154188 165743 -17736 -42369 11165 -35900 -114312 216714
22677 216714 248565 195724 146391 15712 -153292 -353190 -52987 83069 162602 224435
22667 224435 263406 144782 1951 29986 86175 220088 129901 47993 304979 227852 186398
22656 186398 62494 -79590 -296165 -181893 -118688 -91514 10223 40092 -75223 -153418
22646 -153418 -316209 -146473 105804 152160 -55774 -215515 -120632 7226 -58417 -85234
22636 -85234 81750 -7469 -25876 -19768 19530 106248 77251 29945 120781 74486 108901 63075
22624 63075 16017 -135283 -186269 95713 247300 222430 73012 -15943 -104294 -24559 192012
22613 192012 86108 144120 141853 145576 55724 166231 49179 -340228 -238908 -244455 -148776
22602 -148776 -14375 -46320 -230283 -68401 138425 83869 93383 65796 107804 165965 11037
22591 11037 -173993 -282190 -348055 -539807 -555269 -189085 -60346 -194047 -149772 -70754
22581 -70754 -339686 -496174 -508536 -262156 26197 -94285 -200736 -21687 297506 390674
22571 390674 399576 169926 -181860 -258806 -376504 -527530 -622046 -387591 -341410 -417152 -218376
22560 -218376 88089 28603 -109829 -50519 80275 12625 71499 57333 193274 385226
22550 385226 241499 -62227 -160685 -212984 -220100 -301828 -288910 -231661 -458784 -586817 -308389
22539 -308389 21851 -16410 -162701 -221636 -237604 -441849 -314153 -474522 -413955 -288562
22529 -288562 -100906 -13879 62085 -128964 -344679 -303541 41080 262284 158995 185691
22519 185691 90014 56383 210830 55461 -130445 -277010 -158585 248838 253844 106169
22509 106169 -24218 102899 -38194 -152179 -87984 85262 139125 305075 166847 -147410
22499 -147410 -258652 -36541 255019 199750 -71712 -64250 70475 195416 472401 474239
22489 474239 291478 215722 -216967 -421902 -310165 -128480 229813 397553 261636 -68092
22479 -68092 -204063 -285222 -128215 98152 93826 -11627 -21922 -34996 -81283 -79535 7226
22468 7226 33016 -71181 -117620 -227338 -22907 102319 -56826 -121198 17932 1785 141734
22457 141734 327261 314177 266550 287937 178833 217161 246488 206477 107084 118276 -142843
22446 -142843 -78067 295734 484687 494264 564858 377921 399890 216307 355884 45918
22436 45918 -123975 -288665 -185475 -419519 -507500 -411554 -471043 -622778 -600009 -173599
22426 -173599 -141069 -33880 91753 97 -68293 -346891 -282111 -216090 120859 126458 57172
22415 57172 -19841 -239322 -317088 -235636 -246123 -266379 -124862 -103744 -135476 -273493 -281259
22404 -281259 -123898 211908 302398 -112794 -464199 -466767 -491871 -586256 -425515 -120902
22394 -120902 48452 -148749 -260040 -81280 -8854 -161008 -154700 -94927 160481 161920 -119485
22383 -119485 -315641 -223378 -229218 -335369 -361008 -192330 -46079 130011 -27848 -251315
22373 -251315 -237359 -279863 -221616 -204256 -72640 86502 77966 -116038 -342489 -510054 -503550
22362 -503550 -517263 -514488 -460072 -330171 -168720 -172765 -172822 -330045 -315328 -367795 -419092 -431930
22350 -431930 20521 307469 297449 292032 27713 -105711 38320 -157590 -143621 -6472
22340 -6472 118200 182067 205767 163232 39547 265522 385532 169610 -32448 -96894 8685
22329 8685 -400 64489 -104594 -191526 -119211 77944 106997 151151 11926 23492 -19529
22318 -19529 -183162 -318406 -419227 -516265 -465086 -410822 -473595 -586695 -694876 -688396 -795232
22307 -795232 -388844 -120157 -124580 84970 130841 13919 -67918 -361004 -291338 -256763 -381969
22296 -381969 -339628 -273610 -316232 -195684 -285354 -268379 -498805 -226886 -34477 -38368 133780
22285 133780 323805 251680 138738 -79889 -6378 11042 -221974 -183015 28355 -159256
22275 -159256 -348213 -371562 -112882 28276 29477 49807 -282816 -385127 38484 203406
22265 203406 130197 205720 244830 381671 362992 151546 -16693 -309897 -337251 -387356 -171189
22254 -171189 -69456 72139 152422 151045 221243 161211 278016 282659 133631 -63462 -134396
22243 -134396 -280765 -417259 -281547 -70191 39578 153489 104040 310191 362074 287101
22233 287101 34101 -89919 -197035 -320054 -195482 -34790 32286 -51505 -268412 -153191
22223 -153191 170894 39554 44542 138048 115955 334253 564904 485034 220961 114589
22213 114589 298594 293130 109270 -272833 -124648 -128156 -61910 187236 256377 148642 230702
22202 230702 412500 388344 308596 146922 328677 178153 120710 178328 96040 2933 84056
22191 84056 10732 -111530 -181606 -88687 36244 -44067 -65391 -173602 -370760 -366611 -157188
22180 -157188 4812 -61661 -5078 182008 147246 48035 20298 102464 81433 -147996 -264873
22169 -264873 -44432 -52854 -122815 -79948 -46161 -119979 -97421 -230190 -235282 -139339 -309820
22158 -309820 -415605 -389394 -193790 -52231 -66758 135851 71517 -114675 -224181 -339748
22148 -339748 -234454 107417 -41239 -134800 -134806 -80090 44775 178160 240236 68392 -14705
22137 -14705 -54818 119742 366349 198843 110473 -13671 71006 139371 -54136 -158978
22127 -158978 -80073 -71 -32241 -138648 -141624 53896 -110416 -77712 -27535 -44403 138135
22116 138135 189025 468220 321244 174185 243484 395436 347758 317378 32009 -277129
22106 -277129 -164962 16660 172592 64052 -291473 -247426 4762 196283 -75647 -111278
22096 -111278 20633 -114467 -182522 -93472 63013 74770 121101 -27287 -164860 -115935
22086 -115935 -1855 84433 -71086 -190112 -153684 -349465 -455531 -262731 -306485 -13668
22076 -13668 80495 221432 123530 149538 182335 330719 562378 287418 -88289 -189872
22066 -189872 89316 197361 30492 -263705 -260825 -243403 -10430 182319 97254 74267
22056 74267 184680 87506 116394 184092 352411 277262 354617 210271 71769 -15094 -187711
22045 -187711 -216838 -365182 -299492 -247845 -193355 -239184 -263277 -89294 138795 91212 32439
22034 32439 -163062 -141270 -87673 -216292 -600621 -591041 -342760 -148724 3616 82047 161246
22023 161246 -27769 -199186 -305814 -165137 39582 -47873 -107384 -228970 5430 266441
22013 266441 -32738 -343282 -256223 -293800 -339063 -93862 -150326 -336725 -522695 -458014
22003 -458014 -301555 -70394 4225 149456 168445 129442 -76077 -150728 -151235 -80434 123715
21992 123715 215753 387112 321084 66055 129165 389201 359686 -60874 -219868 -211259 -149143
21981 -149143 -54086 -388483 -526803 -298554 -102035 -28194 -180327 -110838 -109094 -238755
21971 -238755 -280621 -74974 -314964 -180258 -164907 -224020 -125754 69341 260158 371230
21961 371230 339732 395979 234607 70292 69363 -164548 -212755 -114051 20316 -47250 -164485
21950 -164485 -165485 -111572 226081 229064 58283 228775 -47636 -421431 -413123 -263214 -270821
21939 -270821 -234880 -213872 112386 362036 229252 -144396 -39023 104810 388327 445720
21929 445720 112915 135732 151725 -222402 -441117 -501088 -242591 144277 450734 355058
21919 355058 150681 319386 470375 240381 176748 238946 109970 -188017 -41038 -136486
21909 -136486 -265089 -137308 138986 55824 -116197 -109789 85749 255889 295608 125397
21899 125397 37517 143206 288873 198752 15244 -180271 97373 310150 263734 279185
21889 279185 118238 -18277 6014 224710 448332 333106 97148 133921 159625 149547
21879 149547 30215 6034 -202123 -317897 -95977 -73944 -234170 -205308 -288199 -228570
21869 -228570 -142670 -129007 -112822 -106277 133836 263793 153964 172282 195119 213623 160853
21858 160853 102225 -156561 -206930 -94808 -149732 5355 147910 -101782 -141010 -40747
21848 -40747 -147389 90733 447855 211832 25736 -37280 -62181 -26374 -105883 60358
21838 60358 214623 100135 -74921 -66390 -116185 -78923 69022 259864 32098 -160926
21828 -160926 -129599 -162043 -34224 76994 -315734 -545156 -564654 -609348 -298104 -82463
21818 -82463 -161944 -259536 -237583 -37493 110329 176361 113142 51341 -44170 -237295 -256895
21807 -256895 -80505 174122 183713 108744 31557 98006 135403 67345 -69087 13453 -220865
21796 -220865 -285667 -170075 -173669 -373427 -582129 -316741 -332041 -406490 -488296 -260603 -121041
21785 -121041 -103530 -179302 -289454 -22017 -45876 10150 -204683 -246431 36506 92118 61440
21774 61440 396380 478966 361786 249094 296441 223634 -14640 -136867 -165747 -261808 -252554
21763 -252554 -10701 103535 45849 -156553 -95387 73614 201049 142988 -157694 -407273
21753 -407273 -168124 128771 143641 310710 261149 46764 77189 148232 256167 408584
21743 408584 192315 -123913 -126023 94683 276493 409486 355462 238087 234570 178375 -116671
21732 -116671 -307889 -159538 -251012 -412115 -136945 197582 182474 178519 279753 94989
21722 94989 14090 -29914 -21682 211318 186348 -70555 71459 158416 -27297 74352 143299
21711 143299 135856 150682 206825 150067 177872 215565 514556 518652 319915 73399 -168278
21700 -168278 -154668 78417 201395 206955 322219 204078 125953 438561 499889 462753 244517
21689 244517 242031 390337 373894 315372 161078 82108 -71568 -97514 -194438 -189503 117246
21678 117246 164469 217824 228815 285526 396758 299244 242331 340647 27251 -3015 84708
21667 84708 -195169 -136164 12458 47689 -323678 -420813 -271272 -64036 53641 132304
21657 132304 -155676 -120729 -113508 -86600 -88740 -22914 -64643 -123357 47210 100838 -25146
21646 -25146 -123760 40996 147003 -40188 150975 324680 416904 371448 202816 92740
21636 92740 -83924 -156490 -127516 30949 140346 86945 -212376 -318137 86210 335888
21626 335888 287783 255644 394789 207976 97332 -107705 -263831 -314364 -87094 29469
21616 29469 359140 493551 269466 154072 -63558 -141498 -588 -6279 -137997 -131142 -332141
21605 -332141 -207382 -108918 20177 127946 -38723 -304082 -268368 -221583 -138195 -100490
21595 -100490 -132655 -268990 -272556 -335899 -394407 -316116 -100233 -16988 -114406 -107711 134397
21584 134397 76572 -179342 -237987 -244489 -288424 -324842 -319035 -257699 -285417 -137686 -225421
21573 -225421 -540782 -609947 -252339 17319 -155074 94283 209325 45615 -210464 -120565
21563 -120565 -52723 -132909 39227 68655 -152781 -183039 -191126 -163596 -381161 -407643 6476
21552 6476 40378 113402 49844 44508 152276 -174663 -329818 -390789 -298346 -357491 -314213
21541 -314213 -163404 -281610 -436275 -238495 -83210 61176 110953 -106124 -209774 -128375
21531 -128375 -82047 -128263 -291120 -437202 -258387 -241306 -497219 -557212 -386903 -60064
21521 -60064 -66259 -58340 159959 163629 341696 278973 287433 253217 268257 209139 158563 84849
21509 84849 -20006 -77659 14141 230141 359952 121396 136107 300903 218848 -125255
21499 -125255 -206875 -169122 -133086 135482 65493 -229745 -367229 -330747 -399099 -467093 -170418
21488 -170418 98644 99223 292153 252313 159522 126501 206201 384047 217659 218689 238241
21477 238241 83513 -158253 -104052 -72306 -94694 -205458 -176980 -250341 -298305 -254332 -174569
21466 -174569 -106972 22886 -74403 -205384 -172218 -131558 -71582 88633 142403 -10957 -40665
21455 -40665 -125657 -58692 3309 -21655 30309 -13297 -208098 -327773 -263958 -248072 -142736
21444 -142736 -153865 -303885 -152172 -105245 -39505 -11561 -130918 -40607 -97871 -469002 -588271
21433 -588271 -547718 -502223 -364834 -416854 -428326 -252926 -206433 -247926 -339507 -276020 -221151
21422 -221151 -324958 -359704 -281873 -339433 -323213 -298230 -339007 -209166 270228 523352 541083
21411 541083 366833 196661 143826 79551 37237 -9365 -33467 186642 243670 142713 159447
21400 159447 92306 68625 -15190 53 44662 -85155 -209590 -121680 12525 75232 79515
21389 79515 44713 347855 452627 326246 -39838 -54121 -110282 -255437 -186139 -208090 -434448
21378 -434448 -431244 -414546 -484825 -584107 -659984 -488148 -301103 -283161 -324202 1007 317227
21367 317227 260633 150737 126501 164264 62167 214631 133804 -117740 -287833 -194446
21357 -194446 -111428 -31672 -35150 -196298 -53479 100862 -270041 -328343 -206779 146579
21347 146579 242388 139239 -73455 -161776 -280623 -279875 -447519 -301213 -467635 -495734 -428743
21336 -428743 -366154 -411798 -498480 -332713 -98118 -130590 -60228 9707 -9045 268636 299193
21325 299193 126409 -18573 93506 -151887 -432064 -446509 -132097 -41745 142485 2763
21315 2763 -213323 -362998 -199777 -102877 -93709 -146193 -366709 -397415 -401185 -40064 -22089
21304 -22089 -321238 -206833 44033 108141 100040 20768 122657 102259 124910 -17517 -261719
21293 -261719 -304931 -170781 -31100 110274 -117114 -258252 -207030 -222863 -253327 -113063
21283 -113063 -226819 -242286 -152491 -245245 -426350 -453411 -596920 -512230 -404467 -357134 -310599
21272 -310599 -308599 -137055 -171032 -268497 -399309 -358980 -38895 -94037 -277443 -235011 -87925
21261 -87925 48675 15548 20184 -139158 -298120 -323066 -279687 -13888 398669 539644 318550
21250 318550 -14380 -76483 -5011 -187181 -201340 -258278 -92103 167850 420993 154321
21240 154321 56737 75840 1580 93361 187164 192640 63169 -279447 -435971 -320866 -92904
21229 -92904 -128031 -91403 -160490 -282947 -497836 -572750 -310483 -41409 201498 88936
21219 88936 5640 205666 235635 100416 65531 -12757 42682 167775 126343 204868 -90860
21208 -90860 -33638 -194865 -118317 -67973 -17431 84463 57930 -203243 -167729 -103640 -148315
21197 -148315 -4875 258148 221555 32981 73197 21402 -175480 -35672 -142282 -46013
21187 -46013 290726 367978 28747 -179015 -172996 -6020 -25839 -210338 -198076 -280281 -285539
21176 -285539 -64602 68091 72827 136608 137336 240371 32986 -353348 -390355 -321471 -426383
21165 -426383 -357766 -246990 -238577 13019 365009 459425 560613 424895 525244 641798
21155 641798 519152 638749 559500 414518 286263 340393 251246 94934 80497 117968
21145 117968 201822 233996 274159 -52869 -105475 -79691 -131177 -102397 75977 -2381 -147176
21134 -147176 -361118 -315728 -317574 -359950 -102414 -218714 -301722 -66477 -65366 -147064 38998
21123 38998 176283 288591 40860 9412 30275 35419 50160 -48117 -45041 -139344 -89382
21112 -89382 -26281 290686 431118 315196 111361 226821 349456 313726 -27763 -133899
21102 -133899 94898 119895 -81722 -102259 87534 285111 298914 72175 -161098 -239503
21092 -239503 -260348 -105039 -44024 -104875 -184820 -136131 -148381 -125104 -148436 -49324 122283
21081 122283 307094 277903 240041 13059 25935 87867 -17028 -88446 -88034 -111866 -145935
21070 -145935 -123403 -193003 -135491 -204520 -390489 -464527 -302509 -218604 -49742 -117831 -177523
21059 -177523 145656 147969 -223978 -334079 -186777 -147238 -462341 -407094 -263401 -261055 -89224
21048 -89224 -111194 -301361 -298501 -90379 -108563 -217977 14554 363416 221125 229854 282933
21037 282933 304071 140439 -34683 -18999 -16052 94228 230415 -35377 -93317 -65195 -6735
21026 -6735 -60742 -144256 -45433 -56031 18177 -31028 -11830 73853 197547 68049 30588
21015 30588 2692 3457 139419 243642 262256 210835 58347 14615 134424 83538 26082
21004 26082 -23098 -76036 -234311 -227052 -99468 42180 126768 82280 64188 76501 -82658
20993 -82658 -298965 -285360 59985 118375 108578 -137020 -93800 111759 40280 -115915 -218916
20982 -218916 -34867 201815 249493 294390 199413 21103 -136962 -222975 -141302 41657
20972 41657 171943 456153 412310 80832 80301 -130621 -62012 68853 121001 415949 359814
20961 359814 102000 -84069 -291399 -89391 -20813 -121518 -250468 -59229 62808 -50971
20951 -50971 -37124 -20532 -95690 -135626 153936 244316 15871 -236122 -222527 -207273 -365867
20940 -365867 -125853 -56434 -93178 -122458 -61468 -453754 -724983 -682537 -395998 61019
20930 61019 -82544 -334568 -414744 -204279 -15128 150773 88709 -93359 -163289 -158971 -305422
20919 -305422 -329931 -285043 -204986 11621 45954 102102 268344 75476 -33356 4 166334
20908 166334 27601 -66280 -203320 -234029 -347411 -281026 -360846 -361144 -314387 -133672 -119590
20897 -119590 -291161 -307625 -113890 73530 -85542 -57406 89298 13506 34024 -104889
20887 -104889 54054 19929 89687 -54167 65408 70020 179749 143963 -60003 -145476 -30422
20876 -30422 -118243 -321094 -264452 167692 149511 -48144 -91400 -39298 -183077 -187173 -460278
20865 -460278 -417563 -234930 -140168 -112194 -33458 235313 361056 338061 77655 -21372 -67436
20854 -67436 -156876 -216470 -260216 -387132 -229298 12507 -27995 144436 314196 193537
20844 193537 142868 130792 16064 -95895 -148754 -202563 -296723 -178454 -150731 77016 110311
20833 110311 60586 149961 243854 285640 466801 158311 17434 42035 148928 -20489
20823 -20489 -94742 -246245 -317897 -117856 9797 -37301 90369 39545 -157908 -103222 -158621
20812 -158621 -216567 -174827 211519 392000 230776 142078 173886 186309 -32987 -95999 -24687
20801 -24687 -169757 -124783 -178444 -145616 -87511 -66581 -175037 -108914 -13669 242192 395849
20790 395849 578314 538770 424968 352015 257469 -30408 -63383 63160 8369 42593 95303
20779 95303 -5055 186351 219731 61989 7359 213032 107591 -78562 -57088 50774
20769 50774 10322 -104493 -251230 -263700 -296608 -322033 -110928 -119816 -206077 -94321 8455
20758 8455 156149 117935 71405 37567 269612 442551 138085 81894 207782 196434 105491
20747 105491 -148414 -393249 -389268 -289026 -204575 -147082 -407654 -498265 -564831 -582539 -262775
20736 -262775 -164206 -103250 -28876 6979 20552 187920 355809 103086 5993 181455 10444
20725 10444 -142169 -284228 -207537 -81586 -164799 107693 241843 133262 -55624 -57293
20715 -57293 -88492 -59555 171410 500044 582739 473060 420023 231834 126209 -118128
20705 -118128 -234277 -191287 -280846 -368120 -253181 13058 564 -295165 -290920 -33095 222418
20694 222418 434884 544389 203916 60427 -187676 -53193 -50872 2387 125680 47173
20684 47173 35131 -5127 -132997 -108497 25334 223898 276823 -22408 -49913 -127094 -149342
20673 -149342 -257808 -260557 -255647 -92189 384428 134505 -73781 -215080 -250676 -295903 -157218
20662 -157218 -254813 -24504 172707 155620 163001 171760 109973 70478 238040 312965 345236
20651 345236 228297 397337 93872 151199 236775 -25311 -37149 -27442 -135144 -125564 -479
20640 -479 215966 218390 394001 295470 105350 142499 232608 225661 236401 71802 39603 151992
20628 151992 -23591 -189016 -14019 100889 172366 337630 280678 365932 405355 471864
20618 471864 267225 130923 -73305 -408133 -227623 -192745 -77374 62178 52728 153903
20608 153903 324136 293669 353084 272406 316581 156470 94056 -79308 -53289 61481 159287
20597 159287 135389 -44916 -84937 -21834 76542 89908 153357 223499 144875 36817 229585
20586 229585 159185 -223848 -258203 -113844 119977 270522 249967 116503 212261 215656 118205
20575 118205 71635 155645 101456 -75228 -133020 -198372 -88250 -94792 -15864 160202 229001
20564 229001 202859 123897 34492 55430 -162925 -68278 246994 22489 -406402 -502760 -310555
20553 -310555 -82451 -208086 -178703 -118310 -406208 -426234 -240348 72559 164585 72942
20543 72942 -33179 -191454 -244989 11679 92231 -138878 -348552 -451474 -337738 -45321
20533 -45321 -72737 -67536 151731 74378 -195945 -165199 211712 198723 208201 209544 330099
20522 330099 304894 361968 426384 182935 -107425 -192040 -124624 91521 92506 95871 238095
20511 238095 109603 -157993 -167135 -184839 12061 166560 147786 83477 -34204 -159543
20501 -159543 -202728 -46286 -17007 33621 -69587 -9852 79517 18383 -185593 -513862 -372680
20490 -372680 -344822 -147760 -98562 -162487 -232381 -161925 -273269 -134090 -27058 -1259 -153627
20479 -153627 -325352 -226204 274596 395192 341082 216712 110501 213711 78154 65952
20469 65952 116125 63511 114854 382275 303259 324889 200711 28229 174707 160810 -44006
20458 -44006 -243813 -92524 115376 27515 150041 292105 220380 267391 561689 601532
20448 601532 581721 594853 645596 400281 340850 410784 294966 10201 -273700 -233472 -40240
20437 -40240 12337 102600 136800 2799 108795 155940 264317 280399 221002 254199 113943
20426 113943 286431 341355 220633 141567 80183 160123 83833 25272 6126 -75602 -293608
20415 -293608 -409903 -147423 230229 47128 -214868 -433973 -163736 154701 136876 76712
20405 76712 -196197 -207055 -264243 -187632 -252700 54506 369456 297444 147861 161986 235406
20394 235406 274076 52093 5718 212203 259173 158278 220733 179042 131360 161820 285592
20383 285592 448495 14303 -187106 -73213 -226656 -195722 -207780 -272083 -235044 40162
20373 40162 331570 267389 15106 90148 167202 178763 338680 293123 187072 213257 154338
20362 154338 -102544 -261031 -95407 120750 46624 -115613 -117512 -10317 49563 74873
20352 74873 -124301 -235092 -200268 -243078 -222659 -421870 -334337 -150956 -195034 -238698 -202518
20341 -202518 60275 333206 410982 185151 -11067 -189948 -558870 -648680 -442607 -165595
20331 -165595 -5674 137574 313773 372323 383256 276936 68641 4879 237540 305516
20321 305516 123198 -100342 -47391 -78210 -153343 -117939 -216670 -20508 157735 298928
20311 298928 349721 143457 221323 303798 479167 701226 426367 221115 21334 -290665
20301 -290665 -339163 -95526 75727 -39808 -129828 -66337 -81251 -65451 -221014 -322809
20291 -322809 -321044 -95744 -8171 124790 253883 339869 35165 -125134 -431629 -336447
20281 -336447 -56017 61901 70986 -32044 -7323 245339 307736 327933 149373 -106192
20271 -106192 -459 -48288 26551 193500 271819 193996 292024 20622 -65967 -232003 -121765
20260 -121765 -166833 -243373 -379325 -372970 -122572 36147 -266013 -546388 -437553 -117997
20250 -117997 -99404 3279 -37325 -49066 100471 -11732 -116962 -2522 91397 167648
20240 167648 13914 11833 162117 21098 -70567 -126607 -77268 56034 -60591 -96588 195219
20229 195219 432315 355655 407095 223893 202667 359406 294169 262536 95528 263615
20219 263615 173787 94829 370943 716251 746755 384282 287207 322700 361654 388343 279992
20208 279992 295365 473988 558367 491191 642721 735068 865387 819943 757639 586201 576892
20197 576892 667711 711766 563092 495666 396801 315344 383134 253578 142197 213582 98789
20186 98789 263475 279831 283952 678526 789141 801240 866361 643772 313405 329850 283292
20175 283292 108952 -116533 -107610 235593 511498 316508 286740 391286 508361 372034
20165 372034 266773 227923 136068 304665 400059 278919 207511 297986 487911 513893 467758
20154 467758 352256 435383 313352 84188 133168 213570 443346 491321 528554 388768
20144 388768 291705 385048 342751 109726 130687 390586 333111 320154 371087 322316 485604
20133 485604 509872 262666 -67393 -43900 75363 96262 139812 149121 304059 176265 156029
20122 156029 384874 590657 412361 147535 141732 235620 321984 245130 -44899 10892 -67064
20111 -67064 -263958 -32025 -17752 -80447 -174891 -65719 83948 367442 408290 261637
20101 261637 119176 240890 443331 386522 434638 461638 187004 179166 305678 32228
20091 32228 -132367 -50890 167280 206718 270449 395828 299307 329647 300766 364399 67860
20080 67860 216338 412974 406771 356251 306006 20486 -539244 -701344 -533572 -409882
20070 -409882 -219401 -87718 119237 270499 31535 -110919 85510 285125 184168 183111
20060 183111 -62443 -123197 -138078 15503 29730 187660 122040 199240 -8868 -369632
20050 -369632 -459320 -268584 119393 418713 351202 -10205 44315 206044 -29850 68592
20040 68592 -23336 247089 430327 410830 371638 324444 316582 426579 415608 176450 1511
20029 1511 -79789 116082 320732 362667 375605 303247 -121993 -382958 -294056 -189544 -349476
20018 -349476 -278336 27829 70924 1871 -121843 -183962 -248016 -280113 -236181 -1729 202453
20007 202453 -52310 -92572 86155 89076 37916 -14759 -18173 -175298 -144711 -217488 -425351
19996 -425351 -422140 -289823 -10807 3131 172 195214 210986 174449 86454 86967 149631 256483
19984 256483 451665 257063 159541 292073 164186 -85063 -23007 267563 403379 165110
19974 165110 76517 172234 239825 158660 102477 181041 193536 6833 97094 204403 128742
19963 128742 -95227 27071 286532 312115 275349 184440 268036 102146 -91896 -280337
19953 -280337 -204457 -3704 -36095 -43982 96254 225352 -63921 -124981 64750 234732
19943 234732 331891 546351 443515 345672 130259 -75712 62686 378178 512702 364714
19933 364714 197123 118921 22771 -253699 -132451 44067 183895 164807 126935 129212 38000
19922 38000 108512 302747 146040 -94642 166133 361183 557525 597439 475030 507437
19912 507437 202516 106686 55934 173239 462379 734251 869292 611074 436529 477513
19902 477513 610317 627338 441509 449968 358071 248397 214877 259939 482309 635176 486126
19891 486126 370796 666974 608657 356273 149081 137718 314392 372993 359033 519770
19881 519770 846781 761972 562928 268250 223474 256234 228912 5614 348729 401592
19871 401592 421049 748846 758019 421232 424405 687171 712785 663651 522839 714004 850983
19860 850983 474073 532002 571335 468801 450479 642319 564119 582638 821355 979037
19850 979037 714902 653488 537401 675400 730174 562237 597761 780307 1089649 995118
19840 995118 1047116 1150781 1039658 960023 728527 623065 497454 689450 553647 556343
19830 556343 755627 639918 510174 609866 880543 840569 857067 800777 731153 721797 840790
19819 840790 835391 914645 952433 998575 979732 930329 796594 654153 609902 788210 1015481
19808 1015481 850425 542798 593945 575132 758485 971825 1220478 1165316 1004884 883289
19798 883289 1129588 1231963 1289767 1345221 1238283 731781 589895 788480 1010070 1322866
19788 1322866 1284032 1012351 1143388 1067329 997393 1236753 1214101 1224518 1334915 1310411
19778 1310411 1074032 1224774 1284550 1344525 1457928 1538297 1598955 1532890 1311167 1057770
19768 1057770 941037 715291 797806 1167076 1341969 1306840 1310982 1473728 1425403 1428774 1269994
19757 1269994 1447809 1381645 1385802 1335159 1202665 1474633 1768014 1764908 1878947 2001403
19747 2001403 1898567 1910859 2165068 2067389 1725018 1648273 1621497 1911855 2131391 2226724
19737 2226724 2240120 2015378 1967104 2000085 2038820 2357076 2438591 2445631 2544471 2593190 2429343
19726 2429343 2411924 2431360 2427948 2367266 2586139 2797737 2747802 2629110 2787742 2948598
19716 2948598 3020165 3035556 2871269 2878078 3065470 3191125 3398076 3506773 3829011 3825306
19706 3825306 3766783 3778101 3745240 3929621 4154570 4490487 4510194 4302132 4218071 4371530
19696 4371530 4606008 4883387 4902455 5215487 5528222 5697045 5853602 6149753 6477047 6556599
19686 6556599 6772563 7336071 7592244 7977462 8358001 8556779 8797322 9129698 9606228
19677 9606228 10111794 10562666 11026106 11740869 12196736 12464059 12801598 13535651 14394745
19668 14394745 15087220 15580123 16410234 17537545 18672184 20183717 21333887 22316396 23683327
19659 23683327 25156471 26658763 28438504 30304216 32234680 34231602 36500349 38612511
19651 38612511 40753973 42964880 45344943 47553482 49700110 51506826 53197859 54899371
19643 54899371 56522167 57935964 59046540 60335381 61335997 62042431 62648990 63327645
19635 63327645 63986418 64487341 64632316 64604679 64555490 64606048 64296342 63892152 63848727 63584705
19625 63584705 63397565 63058851 63101958 63637405 64312689 64691009 65151068 65810835 66245160
19616 66245160 66853425 67381511 67851570 67848040 67960323 68141635 67941926 67895486 67870295 67860972
19606 67860972 67645800 67241810 66413855 65207996 63955671 62658642 61272753 59550867
19598 59550867 57629576 55606218 53845882 51756384 49760483 47478413 45159817 42926302
19590 42926302 40844209 38854572 36540391 34763859 33210360 31783275 30281146 28761825
19582 28761825 27281305 25780430 24609410 23788004 22872725 21943654 20931455 19997680 19133115
19573 19133115 18650570 18154193 17582408 16971840 16343099 15402193 14856061 14555092 14258833
19564 14258833 13767302 13297462 12969835 12725502 12375385 11694399 11104967 11038369 10790718
19555 10790718 10508281 10133722 10053080 9867804 9628977 9358722 8677931 8432290 8609403
19546 8609403 8341040 7916867 7512368 7451791 7255305 7000386 7048555 6831497 6446018 6285908
19536 6285908 6296936 6305762 6140798 5615716 5456828 5237158 5040242 4906347 4882824 4719172
19526 4719172 4742535 4829259 4836819 4773575 4574409 4285459 4186604 3950020 3819462 3693726
19516 3693726 3631015 3641821 3636462 3591127 3523938 3162241 2918498 3000390 3283234 3365370 3529923
19505 3529923 3512319 3307126 3068051 2948907 3018677 2777768 2765369 2827000 2751706 2460927
19495 2460927 2291936 2295703 2198023 2225313 2323421 2402463 2590353 2589769 2502316 2364550 2260052
19484 2260052 2114946 2052247 1930560 1764807 1910629 1973904 1799968 1789501 1873045 1899533
19474 1899533 2015966 1978795 1899766 1994424 1777832 1693571 1689416 1537831 1443230 1382658 1499844
19463 1499844 1710706 1640638 1601287 1705461 1775238 1572338 1474390 1410675 1165475 1202829
19453 1202829 1098701 1082560 1033972 1166622 1214703 1272287 1258459 1255237 1542818 1623714 1620024
19442 1620024 1688578 1679671 1564492 1367670 1423791 1571768 1540950 1454821 1543731 1611201 1644988
19431 1644988 1568196 1482814 1331855 1498581 1782273 1883150 1548295 1449509 1418877 1511594
19421 1511594 1372870 1283021 1017674 1064659 1249179 1266945 1091971 1064586 798442 677153
19411 677153 788018 839400 720248 471897 619194 655498 756714 736665 717323 714127 783470
19400 783470 942944 1051894 925922 718223 791606 781211 864188 763546 587875 876441
19390 876441 1026729 845428 775218 807357 884276 763433 712697 876200 1023652 704211
19380 704211 441014 644829 868664 1053005 1327942 1455459 1286342 887562 675161 779491
19370 779491 732260 750869 877186 714180 756819 794271 951386 862841 511169 663617
19360 663617 727647 744168 609133 599958 433733 680198 682239 708839 937524 957226 731650
19349 731650 644954 723669 915171 1393120 1474311 1289434 1217348 1061289 1231837 1208718
19339 1208718 1126422 1155538 1408160 1477954 1369443 1354904 1394040 1384830 1379052 1403079 1518105
19328 1518105 1402082 1378077 1409013 1519301 1441103 1416607 1280221 1051284 780788 613017
19318 613017 800777 900159 975891 1173322 1156725 907130 615521 625494 776658 981939
19308 981939 792578 494063 521671 702742 700235 838562 973415 1026886 811581 798511
19298 798511 754159 590927 641610 698270 599131 721711 864843 888227 669665 761848 973828
19287 973828 1140465 1039060 855324 1031049 1255834 1307309 1161437 1081536 1054433 1241655
19277 1241655 1477263 1512863 1159245 1119674 1302334 1277573 1281322 1157014 1085277 1170497 1199766
19266 1199766 1097223 1021523 768936 620342 971745 970177 669666 532993 571718 734590
19256 734590 651081 620483 733944 568658 475652 500871 395898 441826 607577 489309
19246 489309 462673 406248 438927 476975 610819 483549 449684 488437 615636 493924 261674
19235 261674 134541 55858 185185 43874 181662 342619 461615 343717 283720 374644
19225 374644 381421 369038 365786 558562 1024060 1013784 616111 462890 491972 142324 19245
19214 19245 305935 554233 513588 659625 339813 62323 94071 306751 286701 77321
19204 77321 112171 472784 406739 375813 319045 407821 548942 631370 697628 829043 769726
19193 769726 613403 715572 613402 623028 856722 745486 811031 699780 645004 914670
19183 914670 918626 680292 745085 664166 837442 963603 793078 732865 721198 582529 670297
19172 670297 930156 844412 571905 529935 636181 725401 664207 470237 383192 226735
19162 226735 240953 393152 317088 363263 648212 524491 310944 257242 306090 588013
19152 588013 691248 532970 530991 638999 643648 679553 517128 429811 282260 164352 188393
19141 188393 283624 345386 172558 126828 396641 258957 156288 489463 763891 585587
19131 585587 410745 463108 426281 -1759 188336 213206 336171 720314 580447 353313
19121 353313 565226 342011 220333 254819 326773 441068 254129 319670 520964 730824
19111 730824 686559 681989 866954 990189 868158 786690 993756 1003089 762564 655324 770590
19100 770590 1020150 1131975 1181634 1258243 1360357 1342234 1333565 1122477 1012791 1372825
19090 1372825 1560771 1410776 1266536 1070783 1116803 1086155 765792 669571 962937 1110071
19080 1110071 1207982 1174379 1234287 1437791 1570336 1570732 1619411 1691888 1574631 1750976 1695851
19069 1695851 1544669 1675432 1643938 1524965 1379985 1432740 1381603 1340966 1399583 1455753
19059 1455753 1386170 1326268 1357709 1366671 1587471 1571419 1393040 1466102 1863694 1934308 1736081
19048 1736081 1604515 1738813 1758845 1538509 1730351 1734077 1639402 1508177 1548199 1774455
19038 1774455 1998947 2039289 2014591 2180580 2306342 2117696 1974750 1897588 1977965 2105668
19028 2105668 2054131 1794516 1873223 1822889 1923884 1890262 1808401 2151080 2254347 2081429
19018 2081429 2080445 2067748 2037444 2209475 2309124 2346387 2259915 2072111 2436053 2840463 2798030
19007 2798030 2622164 2478376 2687522 2817738 2859035 2860120 3062024 3216183 3034137 3090627
18997 3090627 3277891 3408201 3619483 3903445 4137939 4296083 4635280 4964742 5521302
18988 5521302 5995492 6372557 7214986 8376416 9880827 11919592 14858919 19269284 26153648
18979 26153648 35215925 42726196 45984752 46452635 46631609 47598456 46784239 40927109 34408358
18970 34408358 30900340 30671058 33017324 37556630 44316143 49632639 50470368 49096895
18962 49096895 48276639 48154550 44662642 36225834 28464217 23449161 20018610 17821440
18954 17821440 16425690 15565416 15002541 14507316 14063526 13622293 13456510 13332125 13169240
18945 13169240 13240452 13379381 13861814 14730066 15542688 16367297 17581569 19221281 21901353
18936 21901353 25665317 31282169 39544366 49960427 59295881 64757489 68017002 72891067
18928 72891067 80655624 88017132 89564770 86822891 84111991 83823286 87055574 92113769
18920 92113769 93486126 90956257 87055789 84243473 84722864 88619920 91602048 88957353
18912 88957353 82285252 75319447 70412395 67300221 62759210 52997499 42721098 35760492
18904 35760492 31250247 28162771 25730324 24069906 22746295 21403387 20497482 19973268
18896 19973268 19437364 18802971 18543910 18499334 18348220 18529556 18684630 19117405 19454403
18887 19454403 20291761 21624201 23608129 26794612 31675103 38823988 48371861 57626601
18879 57626601 61987357 62367856 62049987 63060182 62358139 55221662 46936197 42249088
18871 42249088 40999194 42934561 48354892 55977896 62276271 63618664 61875147 60338369
18863 60338369 59623322 56054230 46542935 36885364 30339410 26336748 23615496 21332333
18855 21332333 19713739 18604619 17898943 17167198 16558775 16109694 16119986 16373963 16482765
18846 16482765 16487550 16354450 16222300 16485748 16632571 16871202 16941965 17375047 18042822 18996726
18836 18996726 20350499 22480766 25359125 29494899 34618659 38385208 40006255 41175265
18828 41175265 42783463 44907814 44726952 42761965 42236038 44055918 48642166 55887339
18820 55887339 67152048 85243943 113725999 155637713 200451247 228545407 241337737
18813 241337737 250799302 262644950 265103179 236084988 196646782 165981542 144301922
18806 144301922 125627606 112940501 109562713 112195239 114112375 111367185 106705419 103075588
18798 103075588 99963441 91698036 77603989 64948959 56455359 50893124 47025660 44300748
18790 44300748 41930483 40251766 39059953 38451555 37934006 37818427 37555451 37464085 37616388
18781 37616388 38492939 39842341 41575178 44296908 49053688 55820701 65756007 79087902
18773 79087902 93257931 102455364 106116258 108609396 112561400 116127348 114281221 110949446
18765 110949446 115506378 131168689 156284555 187101994 225098282 270158590 308191347
18758 308191347 318571846 305461293 288477940 275437555 252655058 201149138 149964870
18751 149964870 116847303 96727292 84196720 76272799 71356160 68711322 68439495 69753184
18743 69753184 69547519 67328470 64331127 61965274 59964021 55053656 47879186 41774685
18735 41774685 37514680 34533065 32157775 30481914 29141297 28115754 26995698 25867958
18727 25867958 24654754 23627027 22817612 21860179 20802130 19747079 18952857 18114956 17538201
18718 17538201 16682653 15739042 14935142 14364445 14067739 13537841 12914639 12547599 12059629
18709 12059629 11634969 11098012 10720699 10274530 9913029 9750360 9455858 9164965 9070482
18700 9070482 8662791 8183469 7894393 7641398 7557319 7620898 7579366 7211449 7013833 6920437
18690 6920437 6952132 6625547 6498198 6228141 6448846 6331761 6038707 5766689 5524550 5483306
18680 5483306 5343304 5380028 5288294 5156247 4939445 4660019 4443099 4553069 4576331 4524210
18670 4524210 4178279 3959574 3977948 3850709 3735731 3564412 3350323 3206562 3018582 3148482
18660 3148482 3039237 2804457 2583984 2517204 2236233 2203753 2105536 1779720 1733092 1878000
18650 1878000 2151377 2328264 2042498 2057148 2026181 2066328 1975465 1882396 1796239 1774427 2026023
18639 2026023 2154279 2021441 1966287 2015390 2032062 2046142 2290888 2531343 2623549 2562676
18629 2562676 2470399 2425487 2699565 2726810 2327404 2046356 1945582 1823288 1818019 1641190
18619 1641190 1595206 1664256 1816236 1996410 2057007 2203084 2367085 2441321 2218056 1847757
18609 1847757 1800807 2038730 1742459 1608405 1544538 1513357 1697708 1770180 1566752 1461373
18599 1461373 1485201 1513015 1517294 1380963 1246867 1181060 1041596 844284 1037229 1034060 1042211
18588 1042211 1158314 1296848 1300234 1227123 1303909 1234174 1020409 961610 1150681 1253885
18578 1253885 1292710 1375718 1385405 1154197 940295 914851 1023906 1110151 1101196 1170865 1033083
18567 1033083 1061173 1343269 1475985 1326527 1199465 1373796 1441968 1375362 1153535 1079959
18557 1079959 960644 1085875 1374677 1506603 1384173 1278938 1152598 944910 1005494 848863
18547 848863 440048 762360 782188 838007 824127 759821 599519 381060 403518 452927 458318
18536 458318 460924 325490 288031 294100 319942 264494 531835 553141 478451 380393 397065
18525 397065 431742 428451 554804 796459 649939 670251 636122 505203 503762 326699 177899
18514 177899 280395 361078 439644 391687 38515 29156 336479 388906 425145 339387 32221
18503 32221 61293 218438 219289 338509 578672 423900 331422 384202 425616 353584 543605
18492 543605 514369 505845 546453 419844 342621 171456 62266 151264 286027 122892 170162
18481 170162 200508 182221 357311 396216 497933 493252 368732 368231 307435 335245 157945
18470 157945 336871 539275 521316 479444 623756 798360 727474 611188 445224 513606
18460 513606 676295 865704 853456 845876 883398 579517 535156 706930 796664 696757 516034
18449 516034 333504 418836 455943 439896 354494 434485 464604 329374 192972 302642 405305
18438 405305 556343 648556 335132 209459 351368 309623 324695 438859 586263 702730
18428 702730 629180 621367 672920 684896 389118 507967 549813 715739 891502 863453 1164366
18417 1164366 1134029 977707 917152 727721 799005 870072 1178497 1421639 1364746 1265070
18407 1265070 1122933 1031958 986056 1144491 1062751 917990 1153259 1252677 1122463 1073781
18397 1073781 1168827 1041492 953760 805513 906049 1158555 1108264 1101202 953798 1204818
18387 1204818 1367207 1194618 1103963 1002038 954481 1012792 916162 999698 1103074 1064209
18377 1064209 951610 893638 770474 809135 682604 841769 1001646 914655 928217 724750
18367 724750 627526 734120 990050 1130517 1338902 1192997 1070740 1235712 1377368 1538155
18357 1538155 1602522 1196342 710831 638775 767937 753674 775276 495795 621235 1112780
18347 1112780 1372658 1436267 1268616 1014137 845182 666564 990580 1359795 1453099 1244095
18337 1244095 1286163 1445528 1432953 1330605 1016538 1045874 1015264 985639 975337 866433
18327 866433 735690 671438 639406 651555 564723 417045 463578 570238 729475 833609
18317 833609 916438 1052034 651710 499525 391333 489359 727476 940970 1119600 1018822
18307 1018822 1134805 1263302 1133156 943175 767754 913726 1095249 1236781 1272587 1674565
18297 1674565 1753286 1672576 1712896 1598206 1492001 1623695 1748465 1617114 1715522 1739060
18287 1739060 1589294 1712298 2010509 2025595 2145407 2049125 2011174 2042455 2041423 2048373 1944569
18276 1944569 1786915 1592981 1484027 1606003 1801149 1641106 1504791 1372094 1532238
18267 1532238 1559541 1506106 1515944 1681607 1748553 1634853 1662309 1824880 1945797 1801820
18257 1801820 1819374 1881833 1974254 1760225 1523340 1598474 1504789 1607894 1790848 1863851
18247 1863851 1967629 1970424 2182097 2232654 2230288 2202835 2302341 2714385 2908972 3020377 2848025
18236 2848025 2631307 2733560 2621609 2627854 2602626 2240299 2139392 2519743 2500375 2639901
18226 2639901 2905954 2985927 2926436 3088329 3374827 3420513 3182430 2799786 2570939 2480755
18216 2480755 2303460 2135320 2133407 2009943 1810567 1829474 1958584 1890379 1697442 1825410
18206 1825410 1744714 1503295 1751482 2023982 1881944 2016219 2071068 2231400 2022128 1690913
18196 1690913 1588977 1573295 1791973 1900577 1833420 2121541 2121661 2063243 1825344 1787407 1739902
18185 1739902 1627231 1755694 1804670 2086747 2304267 2341804 2542700 2743236 3007485 3129423
18175 3129423 3044486 2958871 2799214 3024467 3303333 3132142 2952373 2678007 2731962 2958152
18165 2958152 3178231 3403029 3332046 3313865 3591055 3698067 3697668 3903138 4127249 4358917
18155 4358917 4370380 4115243 4130257 4381419 4980749 4996306 4837676 5013613 5264190 5565173
18145 5565173 5687695 5780562 6120960 6748509 7242938 7198709 7378373 8109575 8932419 9275152
18135 9275152 9679772 10354382 11348108 12649836 13914896 15417250 16922033 18515044 20243603
18126 20243603 22374399 24642765 27356453 30536918 35030367 41468930 50257332 62502716
18118 62502716 78568685 98331649 125434337 167311309 216288761 240291008 236178401
18111 236178401 227636370 230720545 239944312 214547277 173960570 157148213 164218674
18104 164218674 192380334 237797766 280939916 303369335 312486856 319786537 328322346
18097 328322346 317241911 274530758 229053914 194174098 167568042 146329794 134696255
18090 134696255 132526183 135375091 136084871 131673344 125340026 120385440 116044524 105584656
18082 105584656 89684883 75969894 66695308 60371296 56003964 53014446 50405236 48457905
18074 48457905 47158817 45759294 44897273 44225126 43988377 43514463 43003228 43039420 43489932
18065 43489932 44753978 47516507 51390442 57217793 66331018 79142205 92110634 100156607
18057 100156607 103269463 105742840 109752488 113184921 111711007 110160205 116511970 131862289
18049 131862289 153744280 180683765 213930015 250749313 275562188 274827316 260426753
18042 260426753 246264166 233439574 206775900 160421268 122020728 98390104 83672717
18035 83672717 74238937 68021698 63820269 61612673 61249368 61468924 60348066 58199838
18027 58199838 55835724 53807054 51577826 47029097 41404470 37232798 34167637 31944663
18019 31944663 29999823 28721298 27452223 26082421 24770634 23807245 22898594 22030353
18011 22030353 21062692 20136907 19372534 18621164 17839466 17265311 16997706 16362228 15463551
18002 15463551 14820968 14348835 13831024 13330929 13057995 12801187 12227711 11782896 11388653
17993 11388653 11051023 10589210 10150337 10027523 9669307 9237966 8983775 8696253 8516096
17984 8516096 8344154 8092787 7832016 7819778 7837280 7723104 7409825 7172702 7401236 7248722
17974 7248722 6911890 6869259 6745195 6623158 6451966 6345887 6212465 5937352 5824498 6017534
17964 6017534 6069482 5969253 5896762 5864230 5858301 5748160 5643658 5664323 5642017 5420709 5325055
17953 5325055 5334223 5262019 5166259 4817845 4686234 4684750 4579095 4384348 4385208 4346517 4521277
17942 4521277 4583355 4632438 4624849 4826312 4764035 4713326 4556233 4417728 4672501 4662857 4692099
17931 4692099 4737933 4808088 4759240 4876363 5039514 5240072 5263704 5231255 5504802 5748339
17921 5748339 5952847 6247677 6422617 6584575 6916825 7258112 7707405 8354179 8826963
17912 8826963 9036673 9730693 10448836 11546118 12720966 13940634 15634940 17872752 20477878
17903 20477878 24117677 28844023 34794826 41276130 47589446 53080233 57724340 62495744
17895 62495744 67247806 71221575 72897218 71540667 68488357 65322056 62003298 57681392
17887 57681392 51773579 45233576 39513534 35083949 31986432 29540127 27794723 26871267
17879 26871267 26193481 25929229 25834799 26260070 27267753 28505134 30511581 33213577 36891759
17870 36891759 41574085 47139648 53403502 59375386 64255667 68860702 73708830 78429373
17862 78429373 81420393 81966251 80814099 79324505 78264820 77848484 76796791 75469469
17854 75469469 75249168 75746822 76360104 77381592 78610963 80187639 81746857 81690881 79034486
17845 79034486 75170039 70842351 66764932 62328885 56615627 50426104 44562104 39645114
17837 39645114 36442405 33853455 31951891 30753130 29850479 29356712 28913976 28606163 28692516
17828 28692516 29397885 30779995 33062535 36186482 40191011 45538977 51156941 55860989
17820 55860989 59733493 63334968 66676717 69569675 71073638 70403708 67488458 63553197
17812 63553197 60018184 56064887 51230192 45144706 38991093 33901603 30239140 27468916
17804 27468916 25239953 23580327 22097288 20579115 19452225 18432035 17810443 17272505
17796 17272505 16766806 16090297 15575240 15297945 15035372 14772230 14557240 14416701 14175543
17787 14175543 13860119 13714595 13826544 13989703 13873804 14182251 14562550 14813383 15036984
17778 15036984 15354945 15705733 16166574 16960614 17574467 18239324 19103370 19955442 20949730
17769 20949730 22505039 23912261 25511683 27573085 30168382 32887215 36162234 40272394
17761 40272394 45001226 50220682 55608110 61309771 67573976 73812397 79649570 85117677
17753 85117677 89843645 93519876 96130471 97471927 97602435 96436055 93824643 90426797
17745 90426797 86122258 81254603 76037793 70545813 65076854 59608840 54552935 49760937
17737 49760937 45494154 42257143 39577025 37095307 35003864 33146789 31783100 30409301
17729 30409301 29031723 27861070 27011279 26595945 26110270 25862024 25681992 25605445 25890546
17720 25890546 26011587 26286029 26895714 27579047 28352245 29704000 31020793 32861984 35270584
17711 35270584 37954090 41195352 45116094 49427272 54144599 59275562 64586549 70062894
17703 70062894 75297530 80216387 84432084 87838147 90241976 91244362 91256150 90410426
17695 90410426 88272821 84725800 80495697 75927175 70918727 65763129 60517498 55362953
17687 55362953 50627003 46124558 41986132 38105984 34698625 32192740 30187469 28275019
17679 28275019 26404586 25037084 23612086 22227351 20957050 19588546 18458832 17808846
17671 17808846 17173955 16553005 16006935 15323260 14890051 14345524 13770755 13048424 12577970
17662 12577970 12035708 11643861 11260579 10686671 10251043 9827447 9801720 9531805 9078505
17653 9078505 8741358 8680549 8320595 7989640 7638513 7486539 7145657 7171016 7160633 6736220
17643 6736220 6252001 6185522 6068645 5941815 5848122 5451530 5198899 4996963 4821840 4965183
17633 4965183 4915004 4821528 4862037 4804000 4894086 5023349 4607060 4283375 4160638 3663821
17623 3663821 3390418 3517942 3569374 3517594 3280564 3009145 2645666 2578412 2720736 2910538
17613 2910538 2945969 2743474 2757224 2733302 2496244 2753530 2836423 2905503 2946011 2760266
17603 2760266 2735421 2727535 2736399 2592500 2499741 2309866 2072141 2167478 1951650 1871647 2025887
17592 2025887 1894389 1815500 1811861 1926977 1998180 2024488 2085016 2105078 2276261 2536052 2565949
17581 2565949 2576696 2600470 2770969 2533253 2300562 2356380 2204776 2171616 2030462 1936077
17571 1936077 1836520 1642408 1833219 2081882 2201934 2031153 1933516 2020310 2109052 1918811
17561 1918811 1747359 1606872 1693886 1683836 1644827 1503348 1387394 1442676 1661456 1679533
17551 1679533 1505581 1493724 1217616 972625 1077459 1108453 1080328 935455 936576 1084204
17541 1084204 1290328 1313396 1377245 1367941 1359055 1422231 1571491 1714741 1545004 1494685 1610275
17530 1610275 1414127 1228964 1430052 1634125 1614491 1494806 1579075 1440594 1476861 1572505
17520 1572505 1466482 1409341 1235651 1053568 1025984 1066455 914508 814931 884169 1126089
17510 1126089 1329049 1495430 1471122 1539234 1419279 1296374 1337325 1445806 1390269 1394169
17500 1394169 1094352 826707 846914 827003 670846 737705 636040 346395 379847 521178
17490 521178 612261 804682 703371 553999 441383 487412 506543 531439 442721 406445 547852
17479 547852 690727 412458 209699 546751 838596 757445 646443 400791 456124 622345
17469 622345 748270 697319 857488 873878 399362 239317 354305 443451 523670 345950
17459 345950 160398 283338 179486 193006 212612 -43991 16956 255152 437110 546424
17449 546424 785111 1268211 1073776 732920 957201 1196775 1198689 1104608 1065969 939269
17439 939269 788468 593282 122220 131729 421824 610729 577564 312579 246593 357675
17429 357675 282250 329348 490801 607382 520372 321680 383399 395425 329794 393120 584888
17418 584888 494196 432546 118532 -112946 117563 288170 374545 524763 520963 639417
17408 639417 555148 427225 526768 444306 140601 128626 150710 114456 127214 -73329 70835
17397 70835 96428 -22656 8531 130438 237389 143912 214859 356113 369029 366231 383486
17386 383486 229807 195355 319223 385511 268444 323598 402045 497026 571917 363400 151578
17375 151578 304583 495038 607572 550148 617190 475787 715281 920492 737065 661351
17365 661351 759912 516571 479743 605691 717156 645292 458528 576345 654555 534799
17355 534799 407020 375631 364302 557557 514976 574183 583220 359175 291654 341964 546292
17344 546292 609656 572381 401556 356246 176505 236263 369354 471750 479055 394144 443415
17333 443415 608501 529726 492266 601780 364240 444655 664781 828512 988017 804480
17323 804480 717919 603884 534367 467919 245427 381947 566641 614344 496538 620341
17313 620341 749417 635247 423648 309176 313207 162743 -12651 64870 262872 468430
17303 468430 447326 369718 626759 721512 645166 556010 455896 442706 425923 555168 627945
17292 627945 593269 688202 722356 583686 285021 257148 362004 373528 209174 119544 68991
17281 68991 -31779 -11543 334959 522222 587891 509353 250425 -156045 -299643 -271170
17271 -271170 -258384 -256246 -59545 200023 76187 -139950 -388710 -316006 -236295 -97076
17261 -97076 40769 -76978 -218500 -233325 -187534 -359611 -340533 -67118 14666 -19932 -66267
17250 -66267 -97516 -164165 -71910 180607 510675 386029 35492 42520 248476 471359 536790
17239 536790 367013 370937 447068 438917 561971 405296 188656 213456 235229 413392 303758
17228 303758 353227 469079 438537 587858 671076 594918 741940 793921 723241 631621 685081
17217 685081 750871 488111 439059 248368 239582 413117 705967 851092 754640 667962 408818
17206 408818 246748 395898 427366 510383 587972 554991 635588 480476 478580 518126 461406
17195 461406 762493 769140 547471 614893 627543 379012 130815 76163 -45021 -127403 198736
17184 198736 314487 285674 292452 377797 477972 571134 417690 357383 467692 384775 227841
17173 227841 341384 342874 284321 655840 917429 832203 758524 599806 466622 390754 537087
17162 537087 354138 130262 118874 275923 541036 706058 410675 534202 306948 201873
17152 201873 395406 336516 205521 270936 -98000 -170814 11163 152732 198897 -60192
17142 -60192 -347754 -196865 -208519 -215341 -117496 -70127 -195750 84672 332238 363474 398189
17131 398189 369466 219579 22615 -109510 -397439 -465040 -476213 -314506 -164943 -64641
17121 -64641 95474 90894 70453 197912 131606 91339 541066 484778 224956 275268 273550
17110 273550 127584 -15496 42008 82423 -219185 -461517 -446713 -58823 36224 203574
17100 203574 386291 385583 528902 461565 345238 330538 423332 564341 481654 336650 457720
17089 457720 445906 517841 477781 433173 412808 271816 5128 -87578 15499 168612 208987
17078 208987 56336 -169325 -212499 -57834 92312 -39354 -298481 -528353 -472910 -420395
17068 -420395 -149143 -40884 65492 123514 125392 113071 102500 303170 347472 49981 -173661
17057 -173661 -235514 133476 258853 537380 576606 335255 339639 357758 508125 373521
17047 373521 107459 1561 165475 269754 35304 68560 98721 168822 41855 -128177
17037 -128177 -125844 -131427 -60140 39938 26290 7432 26381 159609 245544 233609 388715
17026 388715 310024 269757 274269 106223 90321 23042 13648 -24690 117248 256087 292210
17015 292210 85741 185456 397387 224687 -16496 135012 315492 91219 -113692 -53967
17005 -53967 -132438 32754 38728 146297 113236 -43508 38023 85858 -139592 -6819 -2034
16994 -2034 -52592 102886 115219 -234831 -293351 -109874 81582 137945 -142863 -424867 -217449
16983 -217449 29954 44990 183863 99835 3034 126378 182940 79818 316463 656824
16973 656824 473949 479138 332475 239122 232324 305920 70551 -101501 -43477 10832 -109618
16962 -109618 162396 451759 257282 17862 -28920 122707 18091 6523 -135525 -110131
16952 -110131 -2640 -30204 -93473 -68660 -110344 -59858 53462 285243 587889 613006 289529
16941 289529 39908 -105453 -239985 -94232 81692 -60457 190167 264223 441522 371547
16931 371547 123714 192596 385478 514881 283190 149215 104835 50090 -51550 264381
16921 264381 227021 144471 3829 -160030 26495 18902 -312401 -230236 -64470 -95580 -201652
16910 -201652 -164821 -55764 -118298 -345994 -360294 202763 214080 -52603 -74331 113295
16900 113295 276287 400056 298158 247475 71468 23786 176486 500964 422236 71756
16890 71756 -75384 -133074 -250799 -278464 -282050 -117703 -49587 -145932 -92868 74807 153167
16879 153167 533669 645651 596466 373278 106164 315789 400248 381702 369236 246540
16869 246540 359341 345374 -31176 24438 344126 236078 156717 128849 -99149 -110805
16859 -110805 -179426 -296249 -432548 -224057 -94016 34585 192643 216416 20183 -191485
16849 -191485 -178591 68145 198669 166463 -194623 -638046 -564465 -402674 -378832 -251545
16839 -251545 -79723 77833 80270 49524 28221 39370 282368 284483 23139 -82500 -155810
16828 -155810 -297796 -248582 -351875 -352516 -123580 85551 201131 -237018 -366357 -290300
16818 -290300 -253884 -423670 -507059 -473177 -218904 -8423 -119359 -461196 -408357 -336056
16808 -336056 -348504 -364026 -355192 -425312 -570024 -865499 -913199 -557054 -143542 126779 -39556
16797 -39556 -192490 -309062 -143548 333421 161397 -8072 -23448 11776 -174284 -203278
16787 -203278 -463481 -681815 -459388 -249996 -72233 1070 155909 99310 -49002 -149815
16777 -149815 -277657 -205904 -127203 -196238 -183354 -221477 -317792 -256144 -71717 246280 461272
16766 461272 421410 136410 102880 -173872 -407030 -379922 -344920 -145707 103922 214732
16756 214732 -74358 -200047 -52345 -95419 -113593 -221334 -56729 -51455 -186739 -356119
16746 -356119 -347438 -242874 -274940 -439902 -598302 -487111 -188341 -150441 -153017 -208150 -298676
16735 -298676 -217552 -41182 -117984 -163502 -187582 -174121 -115594 -58102 -109163 168258 246995
16724 246995 20467 -17132 189896 254962 124996 190038 144085 212262 310218 147862 26224
16713 26224 -14715 58137 17763 53837 21135 45728 -744 12003 210811 252715 160983
16702 160983 30859 1875 -26126 65579 86355 -46704 -310868 -343969 -126736 3016
16692 3016 90089 90775 79665 220415 255955 409070 476514 502432 522943 391461 422701 226086
16680 226086 77990 82258 -239086 -396726 -330676 -303879 -6551 32636 -8508 -110708 -3390
16669 -3390 -46158 -159996 -120349 -30315 -89510 15867 105453 268465 262294 57240 55887
16658 55887 165855 50808 -101123 -160863 -214702 -12156 40416 -187257 -301210 -240833
16648 -240833 -260918 -60323 138026 140952 90273 25495 158678 220171 100479 -34488 -173406
16637 -173406 -237673 120689 266731 164627 73865 -51879 -113379 -163770 12672 205943
16627 205943 192543 170122 171688 -16457 -49224 -158641 -251091 -111220 -89172 -150628 -213446
16616 -213446 -195941 78089 21904 -86790 -99120 123174 50110 50876 101010 -116509 11689
16605 11689 183155 -62120 -212672 -349210 -290510 -193664 -199918 44040 124119 48677 205963
16594 205963 135138 -74938 -77 136859 92659 46041 16581 -11661 234750 475446 386466
16583 386466 119169 158784 351934 369163 368466 232784 -57119 -229467 -531291 -625939 -177547
16572 -177547 -129067 -235624 -462914 -388095 -207294 -113079 -202041 -201658 -284136 128324 172968
16561 172968 141977 243287 326375 489697 486314 349643 125739 190935 141946 33518 201358
16550 201358 -28273 -99997 38536 155257 122133 27206 -127671 -45669 66281 46224
16540 46224 -122933 -232183 -154872 -263821 -476975 -254565 -193213 -24163 161147 91370
16530 91370 61939 46859 43869 -88520 -163854 -160733 -96555 32245 52052 -187320 -82519
16519 -82519 168159 121099 53095 -55793 -112425 -29855 -31702 -47649 40309 -25693 -10419
16508 -10419 60049 -60207 -104801 -372275 -358822 -267858 -281708 -302476 -140519 -188901 -121898
16497 -121898 103995 187835 213528 18300 -302075 -506276 -334014 -123574 160139 272412
16487 272412 261217 293203 118617 -67502 -249228 -147667 -16928 -263928 -222102 -134570
16477 -134570 -283573 -210837 -144959 -103266 -131303 -327846 -192216 39643 105723 161023 91716
16466 91716 80621 -84807 -320657 -112495 201855 72547 -148542 -233751 -63630 85991
16456 85991 -111082 -140892 -362637 -343778 -359964 -286262 -36381 -12895 -144269 6285 217719
16445 217719 156631 -58964 -128062 194285 -78011 -227550 -122407 -23467 25185 -93910
16435 -93910 -219829 -36911 48716 -171449 -199353 -272840 -256051 -519647 -511145 -301882 -82501
16424 -82501 -125137 -210796 -199798 -37310 -245994 -206135 14355 -68218 -80339 65906 160536
16413 160536 164102 212138 235151 182411 -211679 -83902 21207 -231162 -242825 -117651 -203662
16402 -203662 -224985 -10264 71645 125311 243392 361296 379386 186568 -5180 217246
16392 217246 280092 305710 73877 15640 224805 132603 277000 126161 -176242 -202279
16382 -202279 -152278 -63939 77899 188019 -39660 -28113 -67714 -159007 28854 244252
16372 244252 79327 -327230 -383722 -455802 -576189 -426717 -501410 -561368 -297508 165805
16362 165805 206087 391716 385555 166179 177762 105246 -81944 -54330 -208325 -248388 -229622
16351 -229622 -164993 -92767 -67811 54791 153766 266363 407027 296525 177977 -74974
16341 -74974 -184399 -177752 -215996 -133208 52016 -76104 -50160 -3786 -61490 -151157 -990
16330 -990 105688 9240 -5692 131300 59201 81210 110125 225732 -3321 -185656 -131105
16319 -131105 -79045 -84324 -90264 -419342 -510759 -241594 -185357 -335100 -482430 -579366 -303741
16308 -303741 11161 51849 -238408 -169482 38402 206812 192196 377384 365541 325149
16298 325149 252287 198604 387400 304809 400474 432562 281554 17596 -232489 -194330 -104757
16287 -104757 -28066 -169028 -288111 -186641 15300 283703 67990 -292381 -355695 24535
16277 24535 86239 193616 367315 436869 257471 42807 96525 17194 215195 143955 43371
16266 43371 -12460 -19902 -16774 55822 322191 337734 109465 -18350 -3331 54579 85034
16255 85034 132333 57336 75731 304675 274361 164675 -41131 -44047 1758 -262152 -306975
16244 -306975 -84239 46094 172562 191446 252749 255606 280186 58374 -107207 8722
16234 8722 98541 87122 -153243 -456324 -220532 -157310 -395809 -220691 -15060 -48848 -136214
16223 -136214 29077 -26677 -308322 -407944 -368971 -439766 -357905 -345492 -402734 -371249 -358493
16212 -358493 -144073 -2981 -26067 -145358 -9872 -94475 -71373 53195 -38347 -220459
16202 -220459 -196666 -28257 41283 146863 315497 346561 233573 202241 47090 -154687
16192 -154687 -193568 -25772 84116 90343 98039 -24624 -57707 85905 -136978 -165106 -300137
16181 -300137 -105327 154619 186424 211916 135999 133424 201180 211894 -14864 -82021 -130912
16170 -130912 103624 91002 160453 151136 181987 113629 77647 67617 -60287 10142 -140056
16159 -140056 -41837 127333 314514 366470 407887 158613 -203422 -132218 106175 152174
16149 152174 242853 79604 -147053 -156847 39190 137546 -166132 -414042 -355774 -140038
16139 -140038 -41688 -192302 -221927 -455062 -435951 -198009 105806 84176 175788 -61778
16129 -61778 -211121 -291515 -200352 -375493 -368258 -33935 100250 -109556 -194570 -241253 -124511
16118 -124511 6046 -57441 -219357 -217997 -262455 -441348 -513531 -290569 42735 115157 253129
16107 253129 85490 173291 207364 113151 282462 199628 -19435 333926 188323 52848
16097 52848 105513 77454 45321 -103957 -44622 47557 4556 212552 422198 116300 -17437
16086 -17437 -52720 -6705 122182 16983 -137084 -269770 -411422 -431421 -260812 -230029
16076 -230029 -82184 157025 136288 260215 194521 307649 397519 369426 172248 302554
16066 302554 76984 62293 193024 274541 53376 107192 -17119 -418121 -379013 -31779
16056 -31779 -1369 88345 195719 198987 338085 273480 156522 95371 -38097 -64880 4444
16045 4444 -41617 -282808 -263296 257797 310497 255255 83751 23892 -28101 -34294 200607
16034 200607 362872 180571 149216 21554 189305 279637 384203 594676 533126 125919
16024 125919 79002 -56744 -145629 127485 106347 131750 310150 280134 218916 114173 262591
16013 262591 204425 34678 -5784 -140287 -187490 -85962 -127229 -70438 93569 162247 319038
16002 319038 206646 4602 -60457 237769 196130 -3727 -243917 -400745 -410766 -260237
15992 -260237 -19396 129902 -9178 -92934 -49233 -147938 -119843 -19105 -101342 -66230 -64751
15981 -64751 -55284 13754 -34641 98983 16672 32292 157731 300064 99671 -174846 25321
15970 25321 93910 -113171 -188709 -163796 -148772 21986 87944 -100299 -156045 -358377 -284300
15959 -284300 -274373 -187326 23552 32561 109631 92118 -48738 122811 282137 241219 60924
15948 60924 -206918 -133303 -54701 -47408 -155355 -179624 -82334 -75289 55964 270377 377928
15937 377928 455642 212249 199782 106991 -157283 90588 -4831 5583 -135607 -179764 -107204
15926 -107204 124899 185080 337572 397244 362748 177376 99061 15748 186622 205756 156211
15915 156211 148509 152309 32177 120220 131757 92186 279218 331248 231343 250456 77605
15904 77605 -127579 -215712 -59957 -279432 -542408 -435182 -135860 -202177 -419658 -442394
15894 -442394 -258729 3069 116875 -44640 -75143 -215353 -52046 55225 61298 151705
15884 151705 233934 288696 86770 -142090 -162889 -39355 -48296 -162224 -62591 95804 325972
15873 325972 367488 266438 48616 -57662 -157759 -170745 -60174 36145 16349 109959
15863 109959 -184899 -188928 -140566 -251661 -319841 -296050 -180453 -90570 -23679 -14404 -122161
15852 -122161 -139304 8948 151391 187384 232196 166764 210790 270691 251217 232330 258453
15841 258453 396056 458620 347184 294046 63674 9435 94749 205929 404639 317403
15831 317403 139331 -4387 -235076 -259834 -80668 -51438 -50352 25455 -58805 -234702 -18254
15820 -18254 45861 20984 -148555 -124407 -6348 -189611 -278423 -292367 -209901 -225587 -251534
15809 -251534 -195966 6646 13107 81393 95701 25667 44685 115961 -64232 -137430 22629
15798 22629 68595 -11013 -113077 -25000 -81411 -129177 -115705 -94427 -339802 -73481 56595
15787 56595 16443 -159003 -256297 -183716 -178131 22189 56071 -168694 -129483 26518 172207
15776 172207 254839 180240 -2312 -238631 -139016 -39874 -53017 19452 120269 97538 219333
15765 219333 332110 324114 470010 418795 349987 341232 357152 500472 397144 193786 117841
15754 117841 233914 277246 188260 -149842 -303351 -63878 65993 198452 68356 196302
15744 196302 119878 -51483 -180549 -338424 -334746 -192116 -227855 -90792 42860 180942
15734 180942 64384 -98672 -74292 -134850 122612 49603 19416 234289 2330 -76500
15724 -76500 93493 210068 81093 -156895 -151883 -130334 -147983 -242787 -401537 -488805 -142300
15713 -142300 -53844 -8533 88750 169978 -78333 81882 194106 114163 46257 144664 152900
15702 152900 48624 18778 68238 -59785 -57626 -27362 35260 -75314 -261869 -251489 -472878
15691 -472878 -467955 -529152 -453650 -364863 -276177 -226938 -259812 -51537 -34955 3407 44201
15680 44201 60712 -30618 -29259 82991 196662 17598 -91356 -160192 76752 -66889 -69469
15669 -69469 33859 88882 332526 500441 659440 531745 339013 170554 -78623 -9570
15659 -9570 122583 124076 150167 285498 365121 270787 91185 -145349 -202837 -285354 -356570
15648 -356570 -315398 -499381 -332118 -29462 -8379 149395 213437 164994 43842 8404
15638 8404 -23967 -147460 -132703 -15467 -108520 -269913 30866 68244 -58669 -152998 -158453
15627 -158453 -268335 -177444 7487 135077 94451 51320 -90982 46238 35224 72435
15617 72435 276779 468153 385906 371476 7510 -20654 -61305 105123 92506 255481 291843
15606 291843 242396 378509 298078 209360 88839 34477 66203 -13095 168613 245053 361285
15595 361285 250100 250771 186375 155574 15727 354 -44940 27899 29698 56599 -161479
15584 -161479 -55040 -10331 -29801 -197489 -196377 -45381 32760 -50328 -330319 -137334 -176480
15573 -176480 -124303 -240052 -263392 -22673 183908 265223 268821 408126 534230 526161 248181
15562 248181 108084 -228432 -317101 -139309 -52845 82479 95203 52686 46780 -51338 74432
15551 74432 119752 90775 198827 -16131 -263072 -232560 -74005 -80955 -88461 191335 193566
15540 193566 -2064 6267 -44939 -20770 -146499 -45761 -25773 -122020 -219134 -231234 9219
15529 9219 17021 67581 182325 48304 84064 123286 -49948 22273 209655 54178 -27534
15518 -27534 106943 258898 331561 310896 288254 411851 635771 441223 66605 -270459
15508 -270459 -273438 -53909 226916 152124 33258 -131994 -39536 152914 159958 103566 -37459
15497 -37459 73021 69891 -50605 -249958 -233595 86401 -85513 -130980 -4521 55316 192603
15486 192603 259158 173624 209155 224760 -66456 -67267 18890 271649 38885 -245396 -195700
15475 -195700 -226237 -227927 -253759 -211857 -179411 -95343 -106914 44698 95355 232571 327453
15464 327453 333890 297576 54626 -56872 -92972 -128580 -222622 -241468 82984 254931 -9430
15453 -9430 -189214 -282677 -449048 -527429 -83633 274221 312486 241729 -61585 -123919 -104812
15442 -104812 -178796 -392642 -251806 -279303 -394633 -178606 73294 21633 153032 -36658
15432 -36658 15603 41928 -89732 -74631 18929 -112116 -357693 -322973 -185661 8103 -30843
15421 -30843 73939 -103622 -57296 -37601 1444 129860 131906 -10628 -114139 -175397 -317305
15410 -317305 -149832 -256409 -166597 89133 280030 188919 84605 -94243 -79275 -33448
15400 -33448 45166 -7425 94101 141604 -65953 -201325 -220707 -27881 14351 39809 201329
15389 201329 184306 31173 80097 -97377 -387785 -353479 -360139 -346573 -281122 -137800 -48256
15378 -48256 87103 170187 209350 151774 281769 317091 384975 125908 85642 196603 277413
15367 277413 572205 632924 594927 457824 256171 -24328 51554 85740 -70792 -56831
15357 -56831 173881 235037 236336 221341 148923 138195 50904 72868 33127 50072 6596 129260
15345 129260 26475 -103748 -101808 -59833 115626 206774 293471 203296 74894 4390 -77969
15334 -77969 -176950 -25177 142757 5199 -186056 -110048 126470 287841 541652 308444
15324 308444 52544 -114197 -64662 -127297 -235573 -383074 -597092 -490906 -171134 50026
15314 50026 202850 179559 111323 36021 137078 293340 398297 307954 9722 -51847 -133563
15303 -133563 -42415 117364 32956 -127928 -21203 226228 267816 335903 286778 179737
15293 179737 -67300 -249881 -241767 -188911 -96587 -161609 -209620 -246492 46280 -98575 -401985
15282 -401985 -360454 -32229 121349 157984 368989 174509 143503 365138 492235 307366
15272 307366 226896 267161 360687 500964 392710 192521 64709 -37603 -21025 -76816
15262 -76816 -135005 -143133 -207617 -217108 -417166 -434691 -464833 -300362 -98832 -72011 -12449
15251 -12449 -201158 -224757 -388081 -327661 -111598 -94239 137809 44008 -109755 -20140 2736
15240 2736 21820 -76775 12871 -89075 -51326 94331 -40962 44931 -2790 -68171 -177126
15229 -177126 -192204 -157198 22948 166446 66338 -82413 -83796 61437 67425 368669 481204
15218 481204 476253 332775 176996 123254 2410 -142723 -261497 -111158 124598 -79174
15208 -79174 -356957 -175547 -204134 -214482 -56361 48274 127350 -15368 126770 128575 142767
15197 142767 156669 -157704 -296069 -271225 -109815 -118827 -10170 -29084 -3095 -90557 -37044
15186 -37044 -300300 -444684 -395788 48950 221235 332153 445125 344015 327974 254660
15176 254660 371728 248007 -88484 -39722 109144 10433 97355 178769 65201 4328
15166 4328 79933 93887 -58685 -211138 -130619 -64828 18780 -128624 -101546 -121409 88542
15155 88542 205251 431770 348618 466078 419236 311193 264191 325884 249529 133450 77359
15144 77359 -80065 16708 220079 127901 95784 -89527 -299436 -23425 58439 263437
15134 263437 268932 26656 17599 -7916 -27507 -119784 -55595 -116870 -65088 -31139 639 124860
15122 124860 116205 104809 -20131 -240589 -143389 81219 91340 68446 -210556 -276127 -25115
15111 -25115 139242 -17863 -320646 -191050 36252 380225 148722 -292947 -398419 -376225
15101 -376225 -324873 -424594 -183796 -1600 261455 308849 242932 -134634 -325588 -242880
15091 -242880 -374544 -584889 -394537 -233270 -35665 -60087 -282846 -351299 -245652 -283393
15081 -283393 -409712 -493926 -315365 -103552 148843 186061 107445 179660 208719 -50493
15071 -50493 -222633 -94348 153573 269592 197541 251542 165075 234064 432803 263242
15061 263242 320526 282350 114300 355062 632155 725184 572684 432502 336699 220146
15051 220146 272214 175527 232194 118263 157525 -19344 -105738 -56925 179693 11916 -138844
15040 -138844 -110927 -155173 -35950 355942 354705 270660 -63568 -126652 276942 319106 333095
15029 333095 341051 -15438 -194697 -45945 -206237 -316548 -274978 -109138 -15317 -269280
15019 -269280 -303736 -349359 -311252 -159397 97758 198563 135607 61776 280166 326013 384784
15008 384784 246357 107360 175399 299650 121650 -5426 -10378 -167749 19370 92405
14998 92405 284948 -7225 -193465 -163535 59501 221008 94053 -200701 -330922 -234433
14988 -234433 59654 336040 193734 37589 163749 293180 212002 180778 14105 -21392
14978 -21392 261778 229914 -23701 -135075 -144238 -269545 -240290 -108110 -75482 -159207 -126083
14967 -126083 -78712 -105358 -128656 -282469 -250676 -53512 4407 -70445 -27838 -86902 -52149
14956 -52149 144403 266075 243755 420098 192951 276623 617564 278054 63418 40458
14946 40458 124765 216133 -50962 72835 279463 237665 227404 122644 188385 21921 -304040
14935 -304040 -72294 90576 127653 -70644 -183995 -313603 -296647 -289130 -248359 -181655 -176463
14924 -176463 -4727 -45345 -243896 -32650 195067 140523 -30215 25110 55354 -28663
14914 -28663 1951 -137643 -244675 -515585 -623689 -404875 -221820 -259203 -173186 -209546
14904 -209546 -65039 86859 -97987 -216877 -290770 -327840 -97919 74119 119184 179251
14894 179251 90420 214927 309226 201258 182159 143101 164201 -54597 -193199 13563
14884 13563 139356 61006 -8625 126931 38696 -122030 -153202 -190351 -312072 -163732 -218620
14873 -218620 -164145 -8990 52863 271926 388828 360391 202444 -169095 -353512 -411943
14863 -411943 -435535 -220198 53003 267994 175495 209752 199416 81167 18092 149671
14853 149671 40482 -20695 204220 208545 5481 -96630 -104888 -156656 -126201 -23211 162752
14842 162752 385865 454516 390284 530516 419258 147131 204000 239171 35737 -93693
14832 -93693 -116069 -121024 -73748 -91176 -393854 -235913 91833 176435 310363 247843 15564
14821 15564 -251675 -339790 -253919 -228723 -58514 -75746 -14058 -119416 -212142 -360724 -596642
14810 -596642 -372339 -135321 -20736 72666 156042 274251 289385 124325 -36891 -23211
14800 -23211 105743 257106 160809 77718 193989 365786 196937 -66074 56660 281748
14790 281748 152176 135241 25779 -197645 -149771 40067 -125120 -298658 -142968 13975
14780 13975 345192 279354 387457 258924 112133 263119 51668 155019 191363 115954
14770 115954 80328 45742 21706 -200669 -144968 28205 -59216 -62421 -91162 -165447 -236377
14759 -236377 -103115 -26353 5316 164070 368371 248347 -147529 -220619 -7899 148335
14749 148335 205981 -72307 -313023 -260686 -187842 -58348 163309 108174 207194 120120 50886
14738 50886 -203883 -182490 80427 41006 14831 9751 21100 194204 -4748 -122715 -355012
14727 -355012 -436709 -446440 -274152 -100834 95689 212160 167931 209548 254333 152637 174557
14716 174557 85651 -17231 144452 190923 247648 207385 -171252 -305205 46752 98151
14706 98151 -216623 -337770 -216198 45451 67594 87858 15148 -125790 -72331 -75534 77374
14695 77374 177417 154423 165174 213582 265328 102028 69142 -30794 -21688 -31973 -93077
14684 -93077 -29100 4599 3753 26505 -28634 146089 251390 252061 371311 206588 -165591
14673 -165591 -203622 -313470 -376168 -327611 -142114 -81751 -124566 -283209 -467502 -401542 -272799
14662 -272799 -68420 206005 403729 256846 -30861 -207564 -250382 -183568 -147147 -60681
14652 -60681 24593 286361 374979 52975 -260384 -249096 -223426 -84487 -209583 -206463 -131488
14641 -131488 -39700 8478 -70935 -149673 5543 131184 15802 -20523 -95723 16622 101796
14630 101796 79547 -181989 -354588 -425927 -411074 -275835 75213 154404 -55238 -108572
14620 -108572 101576 218572 224174 170256 100422 -147859 -36206 14613 -9962 -69287 -231771
14609 -231771 -204026 -204921 -215894 -118176 -92482 61464 -227650 -379818 -279567 -155365 -66053
14598 -66053 83594 328537 497612 520868 335769 52180 124108 179376 212936 7803
14588 7803 -91722 118978 449813 330433 240540 43235 83278 239055 44727 87153 108231
14577 108231 15665 -83088 -133589 -189811 -197186 -117367 -8939 73779 85042 28631 -18147
14566 -18147 42894 -62341 55816 -149499 -321396 -190082 178361 280102 162321 111923
14556 111923 134851 236517 185224 239528 126089 134336 -67320 -247570 -104043 -51457 -317124
14545 -317124 -97145 211401 236412 176262 -90120 -104776 -89152 -346700 -413312 -329365 -162247
14534 -162247 53519 308916 302360 200396 132189 37437 -98801 72118 -93054 -104299
14524 -104299 172259 91328 -89106 -166766 -179220 24858 167240 406881 261127 184049
14514 184049 70166 -49218 59744 121735 90545 120902 374045 343099 208985 184219
14504 184219 157387 107911 42494 -42948 86567 160657 104502 -13137 92205 98165 -156120
14493 -156120 -171897 -61196 73432 24872 181166 -30695 -227818 -143498 29626 -127898
14483 -127898 -166704 52677 196900 802 22811 17566 3892 -159211 -218382 -122192 -70497
14472 -70497 -171188 17648 75760 11069 58946 106111 270459 202223 -48102 33287 10953
14461 10953 -62576 105150 103808 237772 301186 135306 427047 499520 248190 107346 83006
14450 83006 59670 95270 248780 25571 -63688 -6440 173915 208615 331782 397276 247566
14439 247566 25471 -161182 -216244 30037 -73353 42948 281846 302189 360605 301573
14429 301573 205647 282152 500468 535241 455794 360949 177125 227823 168599 -257995 -285611
14418 -285611 -108442 -86827 100163 -8774 8364 -52478 -94271 -164423 -130709 172162 202235
14407 202235 21943 190759 295275 334173 134280 129987 284473 109570 16214 -188731
14397 -188731 -178447 -191439 -77082 -12336 -106433 -31312 -65087 113284 -34338 -44329 -347038
14386 -347038 -477303 -333390 -2795 206647 324010 465188 538270 185099 -186146 35055
14376 35055 312374 103563 -50552 -13256 -79258 -94356 -174836 -243037 -200915 -269470 -185772
14365 -185772 -149676 39806 287549 199468 -181493 -145218 -395997 -351916 -43529 86326
14355 86326 82236 251810 419708 199749 -115708 -245023 -100544 12757 134979 -26895
14345 -26895 -214130 -192109 -211391 -214946 -375984 -303134 -169653 -21986 -17401 -82822 -111618
14334 -111618 -106719 -52448 -64635 -59899 21390 -91520 -29510 166158 182577 170167 252753
14323 252753 260832 186193 7135 -93902 -101398 -141584 -20353 -99206 -81503 74044 48996
14312 48996 -74345 -59895 34025 20568 17860 67861 -32586 -152477 -72764 123679 242327
14301 242327 101094 -252097 -358130 -249663 -169616 -305999 39343 90583 234078 211078
14291 211078 109724 73543 -49854 -14678 62553 4870 134952 72744 -209106 -125307 88236
14280 88236 -48079 -264793 -224823 -159591 -283981 -145431 13111 78321 282820 155288
14270 155288 -78898 -49052 81973 138652 -267957 -364517 -317357 -347308 -372997 -174941 -132549
14259 -132549 -353092 -565323 -769522 -648336 -164092 96369 -3631 -136850 -345980 -355659
14249 -355659 -177451 -127184 -85031 -268761 -204751 -71918 -200442 -351395 -406863 -403224 -400715
14238 -400715 -131139 101410 97500 -2139 -174678 -8075 42945 -122579 -166487 -151113 181130
14227 181130 229106 130869 97559 -169834 22509 276465 168021 83802 -9503 32340 101446
14216 101446 36590 -316129 -432387 33245 267760 50601 -303945 -254555 -11234 135151
14206 135151 106667 125424 -7859 -34495 -62296 -144982 -232873 -163227 -64274 -71611 42648
14195 42648 -100571 -167527 -205324 38344 106505 -126572 -299035 -284138 -249436 -188096 -321752
14184 -321752 -305834 -310083 -363782 -240330 -41935 98153 -2818 -40114 169465 56092
14174 56092 -210851 -45955 86957 245822 84536 32149 176820 14415 -177103 -249005
14164 -249005 -164348 -37799 -84754 11093 -253901 -246074 -95055 4956 -14251 -147326 -250369
14153 -250369 -110712 97165 196786 -71331 -348966 -264418 -122290 -4988 34862 60058
14143 60058 -100880 -193772 -78645 168026 288118 150000 -121709 -329024 -102957 92351
14133 92351 -36001 206628 472206 472797 478270 455434 552210 383894 153974 124086 -77453
14122 -77453 -15004 386798 447193 311968 181171 -93775 -175792 -140019 -83814 -66023 175047
14111 175047 349502 471237 408172 482524 422980 327556 205823 7110 -40990 191754
14101 191754 392435 439781 303419 56904 77857 108464 8408 61403 131070 280952
14091 280952 414302 350945 15135 -212470 -213809 -283313 -339507 -218924 -139238 -207350 -250186
14080 -250186 -405648 -255312 -132193 23994 120948 -67629 -63071 55966 128538 220676
14070 220676 200480 131981 -112980 -155594 -213496 -352091 -300597 -312357 -273702 -115756 193523
14059 193523 250839 87279 -6122 -41348 -21550 204075 225903 117852 46253 106694 58728
14048 58728 -131544 -234753 -254372 -329059 -200111 92789 261055 77918 -393258 -421846
14038 -421846 -187328 -271967 -264508 -226395 -181173 3919 261602 234494 124729 82641 118037
14027 118037 -46710 -290402 -285024 -208073 -258690 -237506 -375585 -309813 -186017 -106150 -68281
14016 -68281 -182019 -96370 -3292 -146810 -73112 36476 -208647 -160356 -27742 -147631
14006 -147631 10347 62513 60705 42359 -101842 -246711 -221845 -131172 -39436 -170360 -81001
13995 -81001 -99771 50444 109328 104014 -56681 1618 71160 20665 35002 -66273 -56446
13984 -56446 -102523 -140200 -41550 222837 406948 498343 230623 -8532 -9919 -109303 -331579
13973 -331579 -322272 -170902 -183445 -156892 -235219 -171054 -222486 -19303 -65787 -105326 -269518
13962 -269518 -249209 -87357 40996 -4135 -196213 -155012 -130865 -107833 -132443 -226917 -338782
13951 -338782 -376976 -476090 -183031 45558 201242 146820 263694 272784 70384 -142625
13941 -142625 -87713 71194 308330 437400 346988 232921 20448 18525 183453 274613
13931 274613 114215 29246 -215538 -412760 -164139 -243257 -187678 101768 161627 72836
13921 72836 -73374 -313573 -246210 -2830 -99612 -336951 -378255 -382197 -303507 -306295 -330852
13910 -330852 -242073 -140953 -130520 -211020 -375424 -601044 -465059 -233585 -265086 -448956
13900 -448956 -482314 -275072 -116460 -337671 -180724 92111 49032 161298 45480 -86723
13890 -86723 -125347 -80991 -65974 -281620 -320620 -246426 -264759 -293071 -231960 -336503 -444527
13879 -444527 -281761 -117795 -92798 -88287 -106658 -172683 -28536 80142 275967 199879 229436
13868 229436 199030 -40325 22589 101877 214425 236089 302247 162954 117090 19849 23930
13857 23930 -100844 -63376 17818 -18539 -84815 -140042 -143296 -86282 -48699 123531 286012
13846 286012 515453 524068 213150 22060 -471035 -581755 -498858 -467463 -282569 -240315
13836 -240315 -87993 -122836 -60006 8141 -10732 18564 123433 283904 53638 -113834
13826 -113834 125717 95087 -146747 -187811 -291647 -216728 -258811 -339899 -394157 -200289 -351854
13815 -351854 -327004 -339742 -370298 -264288 -126472 -219926 -58212 153933 153308 53023 -82122
13804 -82122 -204086 -184681 -222566 -222323 -171351 -169231 -96238 -5628 -14478 -33286 -83399 -279003
13792 -279003 -235188 -159086 -232922 -204695 -89025 -82643 -76260 -142772 -118982 -139641 -27587
13781 -27587 158522 313720 90739 -195701 -92622 -127238 -130222 -114500 3510 -127362
13771 -127362 -75061 -220706 -263185 -245455 -416192 -272974 -201560 -235835 -235389 -93949 189619
13760 189619 171603 87033 281582 402039 190849 66809 -137524 -234901 -348218 -211329
13750 -211329 -76346 -122374 -208113 -46032 200362 423134 554944 571735 457879 194435
13740 194435 1666 24394 131869 111362 141390 76332 -264130 -388179 -113338 41687
13730 41687 72417 182472 296385 131522 -116147 2299 124702 211704 239462 155163
13720 155163 -21329 83400 38551 -92729 -32592 82544 211759 279981 77826 -107556
13710 -107556 -297196 -268579 93286 -59073 -130726 -56249 229538 -5933 -11975 65914 -109426
13699 -109426 -223913 -176026 -30803 4232 -197878 -399006 -313024 -245908 -52130 -53490 20886
13688 20886 81932 50516 90994 301280 249651 166824 113519 123820 248486 220274 108706
13677 108706 209258 57919 -457017 -637711 -804726 -600913 -545002 -233112 -127568 -189020
13667 -189020 -336621 -217248 -154736 -183615 -184886 -18458 13313 -304090 -555472 -527049 -400985
13656 -400985 -560725 -419902 -412655 -84034 162179 67241 -155635 -142632 133922 276899
13646 276899 240727 230270 192801 323752 351465 219951 317012 325113 200819 150984 6970
13635 6970 188840 183288 -4634 -101461 -102359 -11448 209076 198487 191247 130749 111095 48056
13623 48056 67170 144294 255056 59358 62673 -8950 -157760 -297929 -406014 -49154 -60085
13612 -60085 -157766 -9294 94927 -156461 -189499 -193510 -191467 -111061 -257251 -219136 -235321
13601 -235321 -342314 -500017 -570326 -474929 -314976 -317708 -334284 -278290 -70330 26166 79751
13590 79751 125060 64003 30100 65953 213030 68191 178176 213247 347871 524426 532838
13579 532838 341526 71988 178309 46518 7605 38324 137986 362446 340463 33536
13569 33536 -186126 25338 -78229 -171153 -117688 167316 236887 178092 53925 98813 43370
13558 43370 -105911 -206735 -55172 24408 -94375 -292649 -292901 -185014 -378661 -364235 -392801
13547 -392801 -206040 -92238 78685 367107 37398 -243177 -511571 -371878 -268584 -274642
13537 -274642 41993 109462 224200 96884 -69096 -217528 -288104 -144621 -7194 181264
13527 181264 365625 449183 429264 380063 242922 98622 437592 231608 142048 129182
13517 129182 -164252 -341758 -254305 -228793 -174861 -330928 -109094 183907 147504 41098
13507 41098 18259 -19689 112187 208113 40905 -70698 223977 18887 -61928 -183729
13497 -183729 -219174 -428386 -190906 108166 103009 -57510 -228953 -211554 -249771 -163378 -212564
13486 -212564 -49291 104479 33203 -82376 -423900 -604703 -501648 -176159 45830 385870
13476 385870 462201 336318 137533 58211 137105 45367 -2182 14499 -311259 -280718 25542
13465 25542 109107 110168 102207 181545 48239 -298706 -402648 -212253 -163320 55323 -3144
13454 -3144 -24455 49571 71233 151763 429572 280291 89898 155099 56156 -121834 -199340
13443 -199340 -42354 -114546 32884 184543 263232 332340 78274 19022 24054 -125133 -105437
13432 -105437 85332 176323 100149 -32172 -99717 -38475 38270 7967 -66743 -82835 -147872
13421 -147872 -403768 -206938 70348 130090 266518 277534 81614 -261348 -336972 -294456
13411 -294456 -139612 -62768 -85914 -34120 79311 39934 139029 160265 -46560 -181788 74960
13400 74960 126977 147112 150685 142521 -69623 121198 281653 328100 507945 683887 487518
13389 487518 369040 410999 512803 450784 190701 44246 38141 376584 507964 371334
13379 371334 -2837 -26210 97964 67480 95998 -92008 -308642 -269520 -29182 274817
13369 274817 308965 304230 350677 243110 326794 352026 179682 64184 63972 188300 27203
13358 27203 49948 154534 24952 31482 9465 95911 177900 67316 105413 -4067 -45182
13347 -45182 -126465 -295270 -243325 -80815 32276 52172 -82834 -95153 -108739 -87088 272007
13336 272007 290279 283313 319031 240418 101695 -84760 -98729 118373 84376 -123586 -214049
13325 -214049 -47155 10275 189440 222941 98949 143105 -20644 76890 266630 174444
13315 174444 -222261 -68788 58000 285212 246400 -151274 -268639 48328 246339 126415
13305 126415 -147367 -90213 -76672 -13886 121092 119033 49580 7951 64582 169826 8572
13294 8572 -228138 -304957 -418458 -519749 -451597 -482804 -224551 -269278 -251238 -238378 8688
13283 8688 56986 24575 -51806 -303693 -269205 -285015 -246779 15879 55802 -19754 42493
13272 42493 202803 335840 209454 173676 308138 139951 75790 -26738 37425 -63988
13262 -63988 22733 -85322 -306702 -294144 -34810 163027 219659 289464 172773 -13471
13252 -13471 196105 244074 100780 -103552 12428 151228 159035 221627 372952 259207
13242 259207 -46989 -27538 185838 111163 -90169 -255034 -191389 -336165 -525164 -587308
13232 -587308 -317091 -132185 -38650 -260116 -290795 -272042 -299814 -278971 -139904 -44954 -175539
13221 -175539 -211373 -139760 -165623 -36641 -9472 88899 226488 329715 323567 510806 540611
13210 540611 427090 106853 -211290 -367593 -462800 -312500 -291238 -258915 -116652 -164085
13200 -164085 -7729 -53831 -33753 -270477 -470049 -291543 -229794 -239356 -357163 -237744
13190 -237744 -263371 -225047 -270497 -311760 -104966 41512 23473 -84660 -180713 -360756 -637228
13179 -637228 -715454 -654168 -459628 -441423 -459642 -368894 -294683 -131445 -228899 -163339 -395936
13168 -395936 -507389 -442081 -370862 -192138 -80274 32779 6860 97537 51488 -131208
13158 -131208 -223955 -206915 -127659 47132 212592 -44182 -198532 -30846 296168 432804
13148 432804 512170 418110 317540 68861 156333 332990 501608 350742 146397 -12506
13138 -12506 -194602 -387517 -303911 -39858 108205 157965 -34735 -231797 -25985 162002
13128 162002 60313 173292 190858 169981 161302 340421 177255 56290 62287 4995 92338
13117 92338 -129520 -267279 -156636 -342013 -430427 -60632 128444 164118 293694 405448
13107 405448 394444 288752 376752 248668 126446 55194 50007 10352 85443 228078 337308
13096 337308 279990 186124 283931 188934 98509 207422 333332 90658 -40958 153171
13086 153171 306497 361007 137894 -19318 -146580 -321787 -171994 -99750 -346078 -417995
13076 -417995 -267322 -148392 -110603 63714 -172434 -127647 -146333 -494133 -101599 196875
13066 196875 142445 345617 406601 181397 140614 414485 358208 307315 218561 256217 514176
13055 514176 482094 289833 70440 109204 346791 436400 599643 421968 145769 124123
13045 124123 224819 413718 262266 -43109 -86591 -148633 -94414 -339373 -523622 -472760
13035 -472760 -440799 -367135 -468708 -445367 -645228 -412589 -353266 -90883 66733 64023 107742
13024 107742 200177 256854 -24 -38975 -136939 -128104 -313069 -396168 -499961 -221697 -248202
13013 -248202 -278339 -123798 -257167 -131956 108982 239395 20797 -438969 -534390 -156374
13003 -156374 120536 -85733 -329694 -288738 -265188 -186720 -69252 -137320 203719 306121
12993 306121 165557 -166007 -271531 -194301 100830 266900 104709 -204804 -67521 -174795
12983 -174795 -366589 -294520 -81357 -64432 -23728 234020 311882 292910 237257 171712 61202
12972 61202 -3274 61255 79795 4028 31164 -1428 -112875 2180 148465 252585 -7712
12961 -7712 -213614 -147688 528 125070 82879 72594 -47378 -182020 -301610 -276929 -168228
12950 -168228 -207296 -321152 -197144 -84574 -64011 -158933 -166618 26175 -114958 -227082
12940 -227082 -1222 -18427 -140684 -50516 -300298 -291387 -292257 -411611 -312542 -304483 -380190
12929 -380190 -103251 -111918 -168668 -347804 -401995 -344657 -51435 104104 318237 296353 141480
12918 141480 -25323 -73393 40919 -149954 -169609 -81265 114374 93707 -6122 -171804
12908 -171804 -142432 3876 -81992 -283683 -226264 24452 58059 56145 66233 122915 153828
12897 153828 348269 227778 239296 424411 146721 -67428 -211762 -95136 -72372 -170110
12887 -170110 -5542 -73078 -158695 -142034 -61201 -67734 100515 21527 -71565 129399 266312
12876 266312 296197 8196 1281 -50281 -47554 16020 18823 55353 202888 26692 70433
12865 70433 154994 185877 47449 76529 16511 -82860 159481 -30617 -234018 -416489 -435059
12854 -435059 -119569 -8392 -78732 -49494 56225 139304 56088 -159430 42200 10617
12844 10617 -27731 -80917 114102 69357 90919 -39760 -247889 -367398 -224658 31387
12834 31387 113043 -58919 -214079 -388136 -222996 33756 99920 -816 -34381 17429
12824 17429 272991 279953 314446 263590 -36863 -267264 -342548 -5098 352241 376186 365461
12813 365461 317735 210363 56326 89574 202561 113764 -94806 -12470 70452 125387 316428
12802 316428 447665 353603 347646 298772 147368 -49222 -21625 183521 476872 94047
12792 94047 -113896 -50413 63690 -244481 -338475 -245696 -370737 -334969 -97742 -125405 -121330
12781 -121330 -176801 -307126 -203677 -289734 -522249 -374193 -265541 -243359 -15147 -39933
12771 -39933 -160052 -106931 -146517 -342519 -373750 -211499 -270905 -59044 412450 418866 -2165
12760 -2165 -402294 -562976 -339993 5231 -123528 15017 152410 300882 423042 393269
12750 393269 190279 183952 265551 262370 200770 -90562 148498 390264 237118 59347 59366
12739 59366 253804 331461 163468 -123131 -329756 -538881 -253192 -125364 -204470 -290661
12729 -290661 -130027 2787 94249 197847 266382 330764 218649 -19936 -54946 6717
12719 6717 166601 436920 595474 642535 655479 322008 1750 -103598 -59719 -158981 36824
12708 36824 190073 226573 -181394 -277724 -6121 122213 -170220 -139641 476 -328895
12698 -328895 -375786 -291315 -321792 -373851 -209888 61212 146756 -28624 -23083 96217 88599
12687 88599 -33624 -82495 45759 -69627 -507818 -591826 -616082 -390287 -144750 -99389
12677 -99389 -142835 -47068 42556 -130533 -210656 -187244 -81083 -81205 -228442 -333739 -1120
12666 -1120 -182737 -219038 92523 85520 -382222 -421570 -224917 -230231 -173569 -479261 -460886
12655 -460886 -526953 -579485 -469276 -476054 -203496 -208125 -240362 -368130 -634019 -664461 -326637
12644 -326637 22946 -44554 -131544 -5312 78024 113608 -49222 -303922 -334982 24319
12634 24319 144407 107986 48273 105005 12503 154669 169720 4321 -752 19492 -6597
12623 -6597 -122893 -73440 -107210 -89766 -139752 -68870 -155010 -233198 -246906 -174181 270147
12612 270147 417528 348513 537425 586352 340450 91978 -92221 -216070 -253516 -66556
12602 -66556 63175 -171558 -313430 -290604 -160963 -311643 -321934 -221257 -77317 -261505
12592 -261505 -194625 -182931 -79374 208067 138237 93004 33671 -165313 -94346 78357 178357
12581 178357 -5600 -189092 -244579 -130793 36631 108988 25816 -413219 -668665 -539953
12571 -539953 -313227 -226027 -364294 -389404 -485391 -191317 -297511 -218896 -171132 -324476
12561 -324476 -618179 -526883 -501649 -389922 -505574 -501378 -579443 -202949 17169 -31413 -19577
12550 -19577 -102874 -118066 7355 239999 154640 -11608 63247 -216510 -23502 136334
12540 136334 23803 54032 81624 -19559 -73254 -69458 149117 321321 233677 134038 53938
12529 53938 86566 95524 -114520 -58339 -9791 111203 36826 -95640 -114691 -238595 -51962
12518 -51962 133243 -149619 -302754 -221166 -110646 -138366 -61639 -161704 -328306 -308048
12508 -308048 -368008 -430960 -88306 -120247 -123427 -229033 27354 399549 524973 166854
12498 166854 -29515 31671 -109428 -284929 -514436 -572229 -354562 -301306 -440752 -465428
12488 -465428 -231946 -52288 -107296 -152725 -51339 195373 243175 248080 105667 -16631
12478 -16631 -80057 -292477 -230135 -66083 -80162 -218202 16836 434006 559503 511712
12468 511712 419232 220556 -46060 -300763 -293026 -160075 -153789 -322568 -380914 -251202 18237
12457 18237 149146 66845 111534 -42140 -167722 -230344 -393616 -437940 -265766 -246714 -148179
12446 -148179 9272 27973 -196394 -549280 -599311 -640767 -573796 -401436 -274228 -278735 -501985
12435 -501985 -453904 -385391 -451883 -241953 -165810 20688 168894 132453 104580 -13475 -122969
12424 -122969 13484 366044 244251 176591 64885 -280062 -530317 -299180 1620 181061
12414 181061 278977 267824 310156 312009 326768 171794 -102041 -63982 53808 59337 14832
12403 14832 76111 162841 266159 116900 -6102 -158071 -124321 -103157 -153397 84406 -3585
12392 -3585 -162975 -238834 -9351 -11625 -145011 56063 -83064 -306219 -240362 -29120 94712
12381 94712 27120 -103774 -10488 124190 212599 -145144 -347824 -231380 16766 7125 25801
12370 25801 65441 12148 66398 252273 413410 512910 410805 276414 407684 504299 105478
12359 105478 -294909 -297139 -55050 85943 300527 506288 392895 81587 108228 142053
12349 142053 -61091 76309 433173 301230 87388 -4252 -164849 -9085 -38379 -33990
12339 -33990 118865 266125 150471 9429 55031 51273 6456 192361 309966 213722 92399
12328 92399 1301 85025 261396 146928 -154187 -211928 -87373 78723 155538 6734
12318 6734 -195947 -237135 -198671 -224031 -164470 -184077 -83551 143884 45343 45920 -1294 166251
12306 166251 296930 214048 208271 216053 -130056 -262781 -63657 -126679 -259724 -223102 111183
12295 111183 197536 36965 113660 248073 399372 394113 368808 112783 173779 259574 146982
12284 146982 195244 122751 -68546 93590 147357 45854 228226 207229 199622 240623 324306
12273 324306 236061 346843 481087 548657 440542 427319 452551 300070 -8208 -193884
12263 -193884 -427842 -529446 -359111 -162059 -118470 -340975 -343023 -49668 -75937 57141
12253 57141 177628 358780 276061 122599 55018 8029 -81834 -169458 92641 330047 332908
12242 332908 283693 441455 72257 -96248 -42691 -119061 62823 35035 -305323 -379547
12232 -379547 -425258 -226192 -78602 117555 38668 -115230 17620 -184979 -202979 -124821
12222 -124821 -183496 -32905 9038 65441 75166 68417 192896 299144 173972 239583 194219
12211 194219 22807 -54086 182459 210846 178976 249545 286804 218021 7158 -77782 -68848
12200 -68848 -67726 -124568 -114220 -299760 -182046 -96104 -213265 -157145 143291 154012 271105
12189 271105 308107 231558 154619 117187 115991 -32638 -97260 -98336 -98507 -161147 -285879 -226163
12177 -226163 -220205 -153344 -136745 -111303 -23168 -74028 140373 170740 139008 140720 165637 -26993
12165 -26993 -208131 -358989 -295405 -250455 -248784 -215611 -299746 -380265 -336825 -221161 -88184
12154 -88184 118696 327121 349541 274297 -72922 -298650 -206577 68067 219436 35120
12144 35120 202964 262691 259752 -59612 -153106 -27347 -187235 -170631 -155637 -228269 -169734
12133 -169734 -99914 146918 292429 191906 2474 -92368 -256248 -19532 140106 246876
12123 246876 103934 -145611 -161681 -152762 -252283 -80522 162740 231546 327162 318464 410184
12112 410184 287778 174849 231509 330199 251212 69253 -78422 -32846 179413 107050
12102 107050 104101 81649 92445 -48477 -179519 -255054 -232295 6295 300242 497053 172771
12091 172771 116462 -76926 -197749 -125526 6554 -10778 72288 190791 35284 -372779
12081 -372779 -551866 -633008 -542264 -397040 -272963 -182941 -136287 44126 47874 -82210 -26718
12070 -26718 47261 -213778 -349535 -189829 -82958 -5717 -107135 -67103 28988 84451 8467
12059 8467 116155 227458 79645 35395 -137243 -243097 -93232 -55510 -65904 -13578 38388
12048 38388 -70114 -105471 7805 246030 466528 391853 303815 212715 92469 80603 -189362
12037 -189362 -306011 -236349 -20013 61705 30561 -33312 60294 139453 141102 -119720 -135665
12026 -135665 -65177 -3423 73954 15034 118977 250421 132349 59388 44297 -115243 -182949
12015 -182949 -159834 -75202 242892 251637 217594 42483 154518 77383 -29839 -116874 -163855
12004 -163855 -15948 -24290 -36878 126686 113474 -62126 -178401 -182083 -136334 -128535 -128525 -4003
11992 -4003 -223237 -332266 -100132 152398 226273 150680 137780 -142576 -127646 -19855 -222089
11981 -222089 -332167 -349834 -352577 -195317 -164871 -416966 -676797 -839082 -604509 -435949
11971 -435949 -569494 -513760 -543064 -548342 -583195 -553715 -504703 -539046 -370931 -296558 -176239
11960 -176239 -278053 -360318 -181578 -68174 -108146 -128191 -325421 -465867 -434592 -420672
11950 -420672 -148100 103970 262202 83252 95210 45097 -116894 -176158 -47251 151120
11940 151120 48444 -78863 286 120778 87133 74702 -100322 -79963 -190194 -110790
11930 -110790 19544 40388 9042 -81703 -63955 9858 -67293 -194027 -498641 -174471 159489
11919 159489 143989 57122 -44172 -216128 -440076 -421671 -348124 -253395 -31536 81305
11909 81305 111215 -59331 -132464 -257172 -109676 -48933 1088 -194849 -364419 -124240
11899 -124240 -70228 50536 251965 282725 345890 171557 -205445 -329643 -459016 -490170
11889 -490170 -308941 -252650 -362276 -163967 -29213 204098 382777 338730 35478 -202392
11879 -202392 -96146 -22899 30904 -142777 -222120 -159577 -56631 -39336 -155313 -267345
11869 -267345 -193979 -219062 -139266 -178768 -245743 -29409 -114873 -324877 -322186 -56967 244084
11858 244084 271278 17280 -15415 -129614 -25630 220552 164715 397959 460878 457743 366949
11847 366949 152992 117022 98134 -27148 -63737 71806 28881 127550 131971 43470 9899
11836 9899 -27174 279114 347430 322574 139586 -21426 -135624 -105372 -138116 -42895 -121677
11825 -121677 -231015 -45501 -52059 -226277 -347414 -218975 -165383 -229579 -237784 -250808 -316334
11814 -316334 -324398 -222661 -95190 -58553 -46938 -183587 -251320 -269434 -303911 -957 -6971
11803 -6971 -135205 -292651 -405600 -55100 1675 -429355 -525222 -359314 -87894 39214
11793 39214 -311402 -427653 -431517 -495218 -391144 -324065 -191957 -156930 36911 123189 35782
11782 35782 36643 -51435 -143486 -280746 -398875 -182611 -276952 -336970 -141640 102213 -343
11771 -343 424175 289889 -58722 -106758 -245383 -118685 75131 57036 38490 37451 -9038
11760 -9038 -35366 -153675 -57795 -89521 69161 169154 107216 128682 238116 271695 213699
11749 213699 218679 297548 73677 -81953 -26900 -84636 -65500 157488 394733 400740 341737
11738 341737 189228 -77868 -145084 -126583 -265207 -356710 -328056 -214500 -25762 -46698
11728 -46698 -187655 -183675 -92952 -301455 -433643 -308608 -82899 -89639 -27131 42347 88372
11717 88372 185157 -18004 -245595 -125472 -48985 96065 131951 -1964 -42407 -164710
11707 -164710 -28649 -19012 30800 163752 166933 152994 228176 329112 271790 235211 192217
11696 192217 113059 168440 347572 478651 461111 42192 -183589 -77111 -6653 57954
11686 57954 143814 75582 -193869 -208486 127537 117314 -17671 -50208 -47649 24280 54941
11675 54941 66256 87828 137549 95806 -275066 -146247 -28467 93605 12021 -60960 74248
11664 74248 56192 2283 -28181 147974 -151983 -241149 -52499 -59369 -178573 -227179 -138046
11653 -138046 -233287 -503891 -425913 -414235 -328220 -506033 -515105 -537619 -322420 -214268 -36470
11642 -36470 -31483 -77808 35424 122236 -222181 -235402 -174548 218753 362602 221682 -100649
11631 -100649 -367119 -410010 -205472 43486 217625 349598 444876 245767 33283 30647
11621 30647 75538 130102 -7532 -187833 -55011 176710 182775 249498 144505 229424 329767
11610 329767 105726 -241871 -520807 -483266 -268502 -38751 52100 -1713 -258310 -71046
11600 -71046 228106 436043 299343 201518 47332 -118562 -186715 -36449 -118567 -307114
11590 -307114 -136938 53037 193240 71461 -5138 -179075 -319919 -134715 -101539 -304451
11580 -304451 -400215 -167609 185425 266028 211171 60685 -146331 -198516 -185211 -161056 107458
11569 107458 34287 -265924 -272501 -125698 -165900 -305911 -325074 -441302 -530984 -414633 -259157
11558 -259157 -309323 -217264 -53236 252441 -187955 -416145 -328181 -143776 -61907 -201877
11548 -201877 32315 184517 115359 50728 143139 165199 34922 19319 83940 195272 164399
11537 164399 -171913 -361633 -337139 -194551 -312092 -90079 57767 98397 70424 -60966
11527 -60966 -173323 -221852 -197305 -300576 -430293 -275523 -133944 20018 76750 109894
11517 109894 -41612 41633 147593 39982 100208 101969 -113886 -45509 169103 237285 231944
11506 231944 81889 33905 89949 142398 -70365 -195417 -263244 -367380 -236887 82122
11496 82122 -46528 -207021 -233193 -145664 -181534 -219177 -65543 -139399 -172743 -188847 15189
11485 15189 16141 120817 -30456 -161874 -239045 -243158 -147765 -217394 -200074 -152130 -23823
11474 -23823 43060 130181 62706 216276 481872 271829 -192101 -229823 17100 191072
11464 191072 100999 122883 -169878 -268910 -313272 -440537 -352931 -225726 -403019 -484930 -404902
11453 -404902 -297270 -258975 -236804 -178138 -54083 254128 287908 -149206 -253148 -297819
11443 -297819 -399480 -341822 -150313 -206913 -215761 -119833 -4071 -66973 -81676 -44644 31986
11432 31986 48400 -248531 -272397 -334016 -469362 -474208 -452004 -254986 -486225 -306699 20414
11421 20414 141960 -22395 47530 -26517 -10083 368819 537029 438400 124412 5421
11411 5421 -210664 -310555 -338549 -102889 -118247 -136868 -8809 -76493 -113571 -310451 -305985
11400 -305985 -300028 -162073 -125516 -117173 -113346 -139595 -352376 -425833 -258666 -232509 -244991
11389 -244991 -30374 76629 52990 26219 -207506 -150600 -220784 -268084 -181186 1147 103364
11378 103364 153123 98594 27025 220604 -28222 27848 205996 216714 120213 28935 -92713
11367 -92713 -136502 28841 261802 331465 18816 -196867 -217504 -162146 113989 21697 27820
11356 27820 123898 -14871 82419 107014 20535 90850 130640 117220 77723 -206686 -258097
11345 -258097 -273847 -180724 -27436 46682 242033 271408 34170 34570 -137068 -304392 -59449
11334 -59449 88775 -13330 -187411 -373435 -262461 -152292 -210849 -206246 -194943 -125763 80115
11323 80115 81458 103562 -92104 -319747 -439841 -342524 -71181 -115964 -375063 -322494 -142115
11312 -142115 -111187 -125196 -285333 -462163 -324697 -117570 -60704 -185295 11417 172380
11302 172380 284116 315633 433275 273882 222191 197966 45738 -181882 -94803 -33877
11292 -33877 134388 134362 16310 -219465 -287687 -361633 -164029 -286272 -513959 -436247 -264578
11281 -264578 -25594 186707 154485 222259 408208 365702 57923 -39645 -128282 -121320 -230633
11270 -230633 -165779 -210573 -389028 -404776 -438607 -326905 -185996 -114414 -135539 -129095 -386591
11259 -386591 -541318 -519182 -422385 -653750 -521140 -103779 -197662 -411925 -530753 -228851
11249 -228851 -94051 -54034 -65690 -124751 -213622 -178457 -224169 -309555 -253215 -310895 -311008 -174087
11237 -174087 60587 71246 -228935 -301310 -372450 -431283 -167057 -164286 -634199 -598171 -124670
11226 -124670 -148974 -418024 -385678 -215225 -73374 -340127 -612841 -734749 -567566 -546834
11216 -546834 -628823 -372998 -267648 -369777 -258185 -49795 98632 -81190 -225004 -114693
11206 -114693 42348 -54471 -120244 20876 78188 167993 171717 91360 -135152 -59555 -165915
11195 -165915 -445901 -490873 -289022 -176549 -340072 -372565 -308676 -287003 -274065 -473117
11185 -473117 -453921 -231787 -116329 -307114 -385125 -309918 -226094 -43981 -82669 -161498 -63762
11174 -63762 113478 -71495 -45772 -153751 -58532 -223626 -620217 -555245 -570594 -249759
11164 -249759 -39573 -265166 -532848 -417893 -258776 130120 268654 380414 565822 419966
11154 419966 193492 80485 -168376 -257555 -203814 -231066 -275425 -130541 -147120 -252194
11144 -252194 -28317 -8973 -37391 21045 79305 -75905 -148835 12206 -69848 162410 646348
11133 646348 860106 702535 545001 553250 326990 272371 -12684 -159013 -324970 -433949
11123 -433949 -369708 -293344 -222694 -153260 -108070 -80132 126602 10569 8467 234890 254759
11112 254759 30714 -176956 -165140 -21055 167482 172964 40995 -187356 -330584 -528586
11102 -528586 -398192 -87568 72447 -64075 -381085 -529960 -455872 -250098 -264173 31413
11092 31413 -22866 -276019 -257253 -344073 -337306 -168600 -178025 -324953 -429923 -376754 -190540
11081 -190540 -49937 -173252 -324567 -229244 -525526 -771587 -580308 -224679 -130410 -96129
11071 -96129 -74691 85497 220821 217646 169269 162143 60081 -272795 -5596 40897 -105355
11060 -105355 -163079 82560 -8023 -166746 -264294 -244887 -23533 158269 65770 29686 -193692
11049 -193692 -359849 -267192 -391826 -483870 -372081 -358213 -136265 -118821 -109304 -135057 -19952
11038 -19952 333385 621715 464518 388434 324875 362370 329270 391050 249360 252622 164605
11027 164605 216595 130662 51730 70853 -301966 -378371 -386783 -21274 118363 185216 38057
11016 38057 -201759 -159529 -27244 114920 156925 94080 17575 -100471 -188489 -242256 -168388
11005 -168388 -42926 -128571 -282669 -520784 -543127 -478735 -265350 -384497 -468245 -385464
10995 -385464 -290426 -181987 -87980 -57707 -220264 -450776 -393095 -147224 -70373 -54677 -90058
10984 -90058 28271 24818 -2494 24803 -25885 -105404 -121362 -150193 -14169 254742 238181
10973 238181 18928 -138577 -66327 -125473 -59720 58454 -110509 -175247 -210462 -130659 65049
10962 65049 280097 409610 463795 468551 364977 121853 94102 177746 220478 143284 224539
10951 224539 264491 -48243 18940 -16558 -45499 113811 65669 -19675 -24647 61562 7028
10940 7028 47362 761 -91597 228297 581322 259738 148419 149940 154451 -80199 67971
10929 67971 275362 328670 234713 152103 135769 13996 54078 175746 -10630 -23710 -106290
10918 -106290 -435594 -457055 -323101 -421066 -305926 -115660 -54448 -56385 -93451 -74399 109000
10907 109000 307171 136749 102970 -36767 -165474 96705 140414 119865 115894 25417 -207165
10896 -207165 -227376 -50692 -50240 -81696 -193153 -212680 -332818 -102779 -69211 7879 10807
10885 10807 289056 215237 -6447 -111207 -144871 41385 97393 26800 40922 188218 229428
10874 229428 98756 -281500 -219678 -31691 -6407 -86890 -201722 -104319 -32627 -219901
10864 -219901 -390504 -246364 -191081 44308 232748 170653 -121467 -233117 -202108 93611
10854 93611 -22518 -175059 -1131 67772 -31169 -171141 -47809 -110061 -183643 45244
10844 45244 230204 180335 -36780 -230733 -144320 -13621 235947 243728 133665 204205 207036
10833 207036 65884 -236456 -126487 -195269 -406335 -203448 -140567 -264368 -110994 162889
10823 162889 247690 200474 48922 6861 52235 68359 -74791 -354058 -110788 109946
10813 109946 102102 160791 254659 317040 168952 267615 85996 -132376 -212373 -122861 14933
10802 14933 202747 470934 328200 255090 52118 -129259 -110215 -152419 -114356 -65041 -31659
10791 -31659 30377 -191221 -397056 -343269 -401704 -334362 -156838 109085 249516 257093 42386
10780 42386 127738 -38385 -410739 -281256 82451 309298 65292 -160907 136637 230434
10770 230434 -74031 -138503 -132611 -138665 -183521 71358 119320 -219825 -155360 -32027 279932
10759 279932 191348 64770 407818 48420 -174903 252364 410107 564915 533324 260723
10749 260723 8291 8077 -256640 -213603 166139 5736 -53003 49182 -57353 14815 67160
10738 67160 178608 184700 -29071 -220114 -201959 -186194 -105279 -126606 -67776 67007 156373
10727 156373 -47386 -214779 39872 4959 137526 86081 -29929 -49870 115911 29879
10717 29879 -72909 -177778 -223131 -202441 -220448 -249863 -226078 -436034 -484753 -322527 -292118
10706 -292118 -189162 -164016 -54675 192997 394894 316858 -57084 -305344 -3986 106141
10696 106141 246901 239030 -38616 -222417 -38999 55770 -138374 -260958 -258152 -455887
10686 -455887 -350675 -266540 -434878 -407406 -538285 -635668 -594955 -310444 -307733 -282563 -176116
10675 -176116 -280026 -344954 -228870 -157050 -238145 -286311 -179841 -62139 -154432 -38777
10665 -38777 17395 107749 -97726 -190399 -121009 -35185 -38415 14298 55059 -17095 -26245 46731
10653 46731 153479 53207 -187130 -285040 -210936 -375010 -310210 -331633 -292613 -225058 -362867
10642 -362867 -422894 -177933 39203 205098 45676 36375 67649 178482 215099 238445 67371
10631 67371 13962 -9981 -248628 -319200 -136585 32656 -34393 -58589 41644 8388 -60774
10620 -60774 83417 36248 235114 157255 149507 311911 191187 179276 307142 254768 431790
10609 431790 310482 231517 473672 300439 53680 -258823 -376266 -145906 112047 -23069
10599 -23069 -22346 51211 20969 219610 389607 556397 518752 457682 280129 341256 259750
10588 259750 -57666 -167375 -220668 -289645 -221828 -188070 -120783 44592 120911 154838 77044
10577 77044 -115664 -204029 -375777 -350738 -327358 -588776 -786436 -592126 -374909 -331097
10567 -331097 -382842 -303492 -57944 106477 102948 173284 276680 66987 -113154 103405
10557 103405 277491 305205 174417 141985 61757 973 -175453 -178342 -179791 -478629 -503301
10546 -503301 -555448 -412086 -54638 -18797 76632 163980 334665 224461 -8784 -117358
10536 -117358 79363 102820 -110850 -176729 183456 363734 617933 296788 98324 23965
10526 23965 -97034 -158421 -150919 -237640 -130128 -51451 -141136 -127005 -43463 -23975 -138740
10515 -138740 -199497 -265189 -382651 -418717 -260829 -143149 -130759 -287018 -290830 -260068 -148783
10504 -148783 -90503 3281 104414 132894 174181 128097 21990 -57135 -19838 -42606 145698
10493 145698 -40725 -160985 -13758 -240603 -371995 -124507 3398 -40974 -173119 -196716
10483 -196716 -373691 -285588 -140710 -46087 21613 19068 57187 -2932 53209 -157904 -302780
10472 -302780 -61112 76092 181858 175905 40526 -68776 72074 100040 -63724 -237956
10462 -237956 -200799 127367 341263 86889 -107041 33710 2473 3879 155006 58234
10452 58234 55212 9828 -66326 -36933 128245 280755 359445 320455 151874 219545 185457
10441 185457 130380 159096 110386 123395 2244 44226 -17013 80025 432843 341117 249889
10430 249889 295101 255380 -9634 -208273 -362220 -470862 -515553 -369298 22904 173867
10420 173867 100423 314592 211106 94015 189385 158263 301603 360367 391103 430999 230640
10409 230640 28017 18252 256628 157180 -142113 -390598 -278175 38302 145652 51012
10399 51012 -63055 -263924 -367893 -191564 -38221 17294 -107303 -349213 -289665 -163490
10389 -163490 -152248 -238547 -143184 52969 171833 270931 66362 -79096 -176622 -245358 -189463
10378 -189463 -50514 -248510 -417722 -284529 -7869 161960 142382 253093 243957 121787
10368 121787 85681 -37039 40691 184386 270744 403691 625937 548713 128835 71031
10358 71031 137249 58210 -50117 -339527 -464232 -315296 -68450 167597 -519 -51554
10348 -51554 68816 76702 124729 22506 -196903 -202683 -31791 294615 85696 44612 -105814
10337 -105814 -99700 -221896 -199609 -79542 -75986 -308465 -169832 133313 40933 -176205 -414271
10326 -414271 -435663 -287570 -289224 -186200 2163 -150715 -373944 -228188 -117040 -20303
10316 -20303 -171056 -164666 21366 146149 26631 -19885 13909 -73303 114189 4622 -111556
10305 -111556 -22031 -31715 -107463 -265983 -130952 429053 495401 306100 107527 -73184
10295 -73184 25800 63197 26725 -136498 -203774 -30941 21246 -97734 -278454 -156113 19047
10284 19047 124298 106782 33307 124070 189496 158263 238959 171568 266912 191196 -4545
10273 -4545 -95696 -213487 -336427 -156455 -147944 -351336 -222133 -126393 113409 202861 22618
10262 22618 -52534 -128296 -249845 -355108 -442036 -375641 -171175 11056 74915 167605 205863
10251 205863 167005 113123 -67430 -27580 -17976 -83842 -155770 -175502 -224505 -31454 74175
10240 74175 259783 54848 -207576 -298530 -165760 -61847 -72575 -36076 102804 -17892
10230 -17892 -318527 -266240 -41244 7577 146761 51585 31633 33530 -178888 -173588 -64583
10219 -64583 54716 166673 292498 83726 -29621 67088 123214 -144378 -119198 -91612
10209 -91612 -144732 -107462 71980 127652 232288 104580 13363 106695 445160 675028 582735
10198 582735 253033 73690 194542 182343 200942 266407 238891 250134 -1002 28078 -67265
10187 -67265 -161947 -144378 -23580 159825 47386 -108940 -319008 -156927 -262628 -299959
10177 -299959 -103117 63976 45441 82906 66080 -85655 -213374 -44660 -118758 -112268 -54138
10166 -54138 124140 54157 157454 125842 -48123 16257 223008 1839 17763 101828 -154422
10155 -154422 -125506 -22354 51683 58740 264235 454539 344355 -16076 -329968 -599848
10145 -599848 -655480 -667886 -407975 -302166 -97863 232570 380532 252830 220475 -91134
10135 -91134 -376712 -377794 -324087 -232098 -354191 -605375 -561251 -372479 -315210 -92546 133757
10124 133757 126588 15050 -174678 -37450 -293642 -463893 -307615 -128622 179195 134936
10114 134936 -109998 -86720 -55792 -78009 -236360 -271640 -395031 -458803 -391841 -154905 4191
10103 4191 49664 -127090 -179827 -201504 -75175 264955 333553 43438 -112386 -159971 -399815
10092 -399815 -438451 -359611 -155315 -145160 -183566 -81920 -279562 -457810 -475515 -380126 -145227
10081 -145227 -61848 -10138 -121767 -327617 -457440 -276689 -165639 -38306 -219428 -199643
10071 -199643 -307589 -250855 -110778 -51894 131678 167439 189813 241976 379123 445628 410663
10060 410663 176128 11577 -81978 -13073 88891 40744 13195 14365 -81078 66137 44792
10049 44792 -144168 -271407 93526 -63337 -135614 23828 -263841 -371602 -577136 -484518
10039 -484518 -146898 9108 -101414 -113483 -36240 -239814 -208359 -104487 -93780 -153591
10029 -153591 -28470 267682 90743 -158314 -262242 -149077 200947 469431 547309 497561
10019 497561 474030 470950 585218 435386 173314 -119931 -195639 -126486 -4744 281325
10009 281325 279271 168375 63777 7594 29977 -143163 -184675 6961 364961 475429
9999 475429 444287 253319 99381 -39572 -50576 -128041 -150579 -15812 40007 -91602 23645
9988 23645 400677 114722 89868 44649 -259184 -365287 -330018 -312478 -157270 -12654 65420
9977 65420 57824 -265453 -198182 41939 174160 116036 314892 213424 71865 236914 395850
9966 395850 375353 298630 203661 62809 2042 -170554 -36669 54411 35451 83900 -8384
9955 -8384 230635 311001 228536 18391 22871 76614 -33536 96020 90185 191791 441944
9944 441944 300295 269193 499208 483840 343701 219046 224864 144625 227084 297395 279123
9933 279123 73934 55041 132294 189816 54533 -16049 74927 73849 40144 -254907 -342466
9922 -342466 -173840 -121216 -1549 232723 79633 245551 246777 316434 446681 401081 186251
9911 186251 208254 191416 -32197 -66465 69574 48711 -206927 -332446 -21013 256224
9901 256224 544370 645620 608024 454326 340424 365466 446482 403194 51819 -151600
9891 -151600 63573 96393 -65030 -42238 -153731 -28462 -62070 -168731 -212172 -181979 -124611
9880 -124611 -108576 93594 97478 -40638 -130209 -74731 -6129 -166769 -90122 -12116 26455
9869 26455 140937 110038 236900 137580 -32182 89248 235826 546599 637355 521896
9859 521896 574542 485563 138967 -266109 -226244 -209537 -213739 -104722 -119353 10879 -54508
9848 -54508 -271538 -235994 -56078 -104811 -37047 -27505 -43285 -45436 -83272 -51362 -30747 -45300
9836 -45300 -191147 -377908 -502670 -341350 19833 118704 17576 -127630 -255178 -256189
9826 -256189 -95822 -64808 -134666 -94638 38153 101832 64850 146429 33174 73778 228333
9815 228333 138589 104525 214534 423569 439379 485658 423056 270574 151808 115243 51408
9804 51408 133208 182119 -37484 -191574 -2084 4494 -18755 -50630 -117505 -96405 10407
9793 10407 -83167 -140738 -161730 -168951 -71155 100288 187310 -52990 107981 122076 128640 -85832
9781 -85832 -213293 -127396 136907 218048 181229 158365 179879 157715 121977 224933 43464
9770 43464 -393011 -540379 -93839 75705 64901 -180821 -223963 -160453 -42601 -193095
9760 -193095 -68501 -206513 -126054 -119456 -153359 -1975 -63748 11522 138973 -56832 -315075
9749 -315075 -411378 -307020 -231503 -88169 -65135 -145103 -122654 179400 43175 -43744 157843
9738 157843 240632 -56616 -164124 -96242 -24774 35711 145384 180185 159019 -119556 17808
9727 17808 24815 -81619 -200159 4212 -37965 -136933 -96939 -84010 -179638 -8960 68132
9716 68132 281689 368893 433043 267942 26068 152689 387150 155514 -102556 -305743
9706 -305743 -380289 -419813 -425421 -429444 -379113 -63475 123649 191331 177610 -81178 -107872
9695 -107872 -48212 -47604 -156305 -312949 -373439 -487027 -346093 -279488 -231305 -333850 -360146
9684 -360146 -344051 -366723 -225674 -65516 89950 200488 230210 22815 -12238 96261
9674 96261 122032 -53274 -81316 -30185 19162 95208 -14617 97907 191367 366858 195024
9663 195024 -220093 -391361 -161591 -94748 -105868 41153 118038 113971 -58213 -163776 -82299
9652 -82299 -5466 247003 169910 -2997 -122659 -44084 59173 235657 133896 -3282
9642 -3282 35700 47242 129979 334672 188416 -113838 -134905 162388 284979 78712 -68736
9631 -68736 149717 133340 9256 238355 38032 -180278 132404 331520 117202 -319999
9621 -319999 -225189 71074 45500 -355199 -265102 -76528 -26413 12287 -150274 54004 129152
9610 129152 74539 195360 185846 5051 -18386 -179379 -47195 28360 -43113 97696 270900
9599 270900 358171 231861 110394 117748 116154 75098 213977 305753 316546 214379 192234
9588 192234 161257 -29134 -113851 84269 247874 404735 271866 101031 -14254 -30930
9578 -30930 87660 136151 -53882 -107788 -205467 4755 64279 -6731 -39005 -36460 63141
9567 63141 4107 -67158 -160018 -11111 50775 104110 137977 -29911 -384272 -261553 -68887
9556 -68887 73755 91554 -11542 -156325 -10746 178461 -101643 -273005 -55328 -95196
9546 -95196 -102459 99870 73697 -107700 -353379 -588379 -344967 -40003 -71263 146039 150266
9535 150266 172283 454939 666114 536905 340611 239153 -138229 -226781 -18242 325961
9525 325961 119154 131449 316599 289584 66342 -154174 -110526 -8642 15243 -57106 368926
9514 368926 486996 315971 153256 261063 243246 206555 129923 210596 55016 -206521
9504 -206521 -525219 -439781 -109769 149278 364468 389623 215578 280387 284993 89031 -109644
9493 -109644 -286610 -264335 -170935 -74729 -73979 21556 324167 399276 252527 -131764 -235864
9482 -235864 -238187 -250209 -240284 -257669 -446472 -316996 -24301 130473 20531 -51020 197079
9471 197079 339266 265395 226875 23028 22616 21333 192219 289487 216747 237810 389624
9460 389624 371279 226465 70409 155241 -152282 -81621 -5410 58879 38905 76377 -14797
9449 -14797 -167237 -357690 -370987 -224413 -110967 -269404 -244827 -225918 -175580 -174292 32820
9438 32820 -78387 -253108 -214744 -335584 -383066 -242329 951 -4114 122954 128353 285197
9427 285197 286992 114328 -80789 -141175 -68750 144951 225455 149275 205425 130299 -21748
9416 -21748 -14600 -33170 -133249 -233789 -135 -50349 10977 87595 254294 339787 345015
9405 345015 110502 52033 -53304 -31823 -17722 -17678 43216 192314 229493 280192 427592
9394 427592 340460 339911 186235 331614 276637 241424 203203 61184 -25017 -132103 -281474
9383 -281474 -343421 -430324 -398931 -56611 -51619 -1543 90480 285910 229601 -60308 -67266
9372 -67266 -184604 -165508 112257 110209 257946 367417 366894 190417 193047 140335 154524 175983
9360 175983 39474 123288 262008 470217 451124 196754 472605 392137 114051 115844 126182
9349 126182 204909 319730 339235 318444 66710 -29842 -12969 179436 279552 187048 211081
9338 211081 74743 -70514 -40220 -16536 63678 223195 224970 235676 47222 -23669 93303
9327 93303 -9353 59643 71597 -175472 -240259 -55409 -48289 6394 -133827 13979 147892
9316 147892 112405 197910 135739 264533 29639 -134154 24343 -240094 -550250 -466989
9306 -466989 -402799 -298266 -131372 -205064 -137044 -219570 -257035 -85233 -185373 -358792 -304134
9295 -304134 -155594 -164367 -25855 110334 -29009 54301 -31300 -52305 251832 305733 516955
9284 516955 745483 353931 178707 114654 25015 59302 -98987 -33417 140657 330031
9274 330031 231737 197856 87459 -22452 -42765 -31018 63952 209564 439185 608439 606978
9263 606978 402666 500724 527095 332318 222503 -2919 -162075 -53739 142866 280439
9253 280439 338673 379845 357680 102984 -9851 -155049 -215376 -153940 -184626 36695 32627
9242 32627 -15214 -61306 60924 197699 83971 39152 107582 101837 -144322 -120577 141228
9231 141228 313830 335969 365643 259015 361681 519295 500685 489523 350838 98105
9221 98105 -176273 -54580 -168802 -195179 -47126 137618 185411 211254 127976 -76200 -144329
9210 -144329 -61680 69078 91682 191166 22627 6512 11063 201414 405878 441132 297196
9199 297196 352334 305599 350913 378236 258494 326064 541750 538628 460067 424425 367574
9188 367574 10371 -63778 -13695 97840 142458 360196 470327 397203 531878 759845
9178 759845 839505 827168 707546 481385 374426 357887 318073 369725 478435 403695 254901
9167 254901 342179 377105 45713 -30603 217934 403137 464057 381106 432342 592617 636889
9156 636889 567094 559842 746831 659105 513393 437070 352714 491705 592417 697164 553802
9145 553802 668019 583262 652407 841636 836651 741044 804605 664152 529603 852337 1086896
9134 1086896 1111588 1253641 1347862 1370871 1275579 1380420 1426034 1483963 1435458 1558386 1850371
9123 1850371 2230239 2474850 2644051 2674819 2959671 3161313 3534101 3877346 3997103 4377402
9113 4377402 4858689 5491216 6111100 6982345 8134555 9597485 11270679 13507842 16463692
9104 16463692 20459990 26266816 34569096 46661205 62112621 76544397 84412761 86135620
9096 86135620 85636142 84996713 81892813 70749195 55134141 42287389 33080192 27108817
9088 27108817 23032028 19946882 17423532 15383902 13788562 12534653 11450055 10652115
9080 10652115 9685957 9103665 8512605 7812847 7229029 6830048 6394125 5998997 5742484
9071 5742484 5559980 5228597 5046611 4956204 4911224 4616790 4449456 4227832 3981409 3846295
9061 3846295 3789352 3690249 3261269 3060849 3001234 2958531 3126274 3309095 3126569 3162377
$$ [...]
##END NTUPLES=NMR SPECTRUM
##END=
