##TITLE=Analysis number 320107
Compound Code cc 51304
Book Reference 494/4
Project Code adrs
Chemist Name craigr
##JCAMPDX= 6.0         $$ Bruker NMR JCAMP-DX V2.0
##DATA TYPE= NMR SPECTRUM
##DATA CLASS= NTUPLES
##ORIGIN= Bruker BioSpin GmbH
##OWNER= nmr
$$ XWIN-NMR		Version 3.5
$$ Tue Jun 13 13:55:27 2006 GMT Daylight Time (UT+1h)  MAYBRIDGE\nmr@NMR_250MHZ
##.OBSERVE FREQUENCY= 250.131544655141
##.OBSERVE NUCLEUS= ^1H
##.ACQUISITION MODE= SIMULTANEOUS (DQD)
##.ACQUISITION SCHEME= undefined
##.AVERAGES= 16
##.DIGITISER RES= 18
##SPECTROMETER/DATA SYSTEM= dpx250
##.PULSE SEQUENCE= zg30
##.SOLVENT NAME= CDCl3
##.SHIFT REFERENCE= (INTERNAL, CDCl3, 0, 16.522)
##AUDIT TRAIL= $$ (NUMBER, WHEN, WHO, WHERE, WHAT)
$$ ##TITLE= Audit trail, XWIN-NMR		Version 3.5
$$ ##JCAMPDX= 5.01
$$ ##ORIGIN= Bruker BioSpin GmbH
$$ ##OWNER= nmr
$$ C:\u/data/dgb/nmr/ADRS/670/pdata/1/auditp.txt
$$ ##AUDIT TRAIL=  $$ (NUMBER, WHEN, WHO, WHERE, WHAT)
(   1,<2006-06-13 13:54:58.71 +100>,<MAYBRIDGE\nmr>,<NMR_250MHZ>,
      <created by zg, POWCHK disabled, PULCHK disabled
       configuration hash MD5:
       E2 DF 36 D8 04 B2 41 60 5A D7 A3 38 5A 4B D0 FE
       data hash MD5: 64K
       1E DE 1B 85 C2 B6 48 F9 D3 8C 2B 9F 70 8C 89 6A>)
(   2,<2006-06-13 13:55:15.19 +100>,<MAYBRIDGE\nmr>,<NMR_250MHZ>,
      <Start of raw data processing
       ef LB = 0.3 FT_mod = 6 PKNL = 1 SI = 32K 
       data hash MD5: 32K
       6B 0C BD 9B 03 FD 85 A0 DF F1 82 B9 7C B8 A4 E7>)
(   3,<2006-06-13 13:55:16.77 +100>,<MAYBRIDGE\nmr>,<NMR_250MHZ>,
      <apk 
       data hash MD5: 32K
       AE BD 60 01 6A 15 0F 2B A1 B4 17 62 73 DE B2 3A>)
(   4,<2006-06-13 13:55:17.57 +100>,<MAYBRIDGE\nmr>,<NMR_250MHZ>,
      <abs ABSG = 5 
       data hash MD5: 32K
       D4 8C 84 F7 6F 09 44 9E 5E 6E AF AF DA 77 87 38>)
$$ ##END=
$$ 
$$ hash MD5
$$ 96 47 14 DF D7 9E 24 3B ED 43 7B 73 57 D7 7F EE
##$RELAX= 
##$RELAX= 
##$RELAX= 
##$RELAX= 
##$RELAX= 
##$RELAX= 
##$RELAX= 
$$ Bruker specific parameters
$$ --------------------------
##$DU= <C:\u>
##$EXPNO= 670
##$NAME= <ADRS>
##$PROCNO= 1
##$TYPE= <nmr>
##$USER= <dgb>
##$AMP= (0..31)
100 100 100 100 100 100 100 100 100 100 100 100 100 100 100 100 100 100 
100 100 100 100 100 100 100 100 100 100 100 100 100 100 
##$AQSEQ= 0
##$AQ_mod= 3
##$AUNM= <au_zg>
##$AUTOPOS= <41 >
##$BF1= 250.13
##$BF2= 250.13
##$BF3= 250.13
##$BF4= 250.13
##$BF5= 500.13
##$BF6= 500.13
##$BF7= 500.13
##$BF8= 500.13
##$BYTORDA= 1
##$CFDGTYP= 0
##$CFRGTYP= 5
##$CHEMSTR= <none>
##$CNST= (0..31)
1 1 145 1 1 1 1 1 1 1 1 1 1 1 1 1 1 1 1 1 1 1 1 1 1 1 1 1 1 1 1 1 
##$CPDPRG= <>
##$CPDPRG1= <>
##$CPDPRG2= <>
##$CPDPRG3= <>
##$CPDPRG4= <mlev>
##$CPDPRG5= <mlev>
##$CPDPRG6= <mlev>
##$CPDPRG7= <mlev>
##$CPDPRG8= <mlev>
##$CPDPRGB= <>
##$CPDPRGT= <>
##$D= (0..31)
0 1 0 0 0 0 0 0 0 0.06 0 0 0 0 0 0 0.0002 0 0 0 0 0 0 0 0 0 0 0 0 0 0 
0 
##$DATE= 1150203296
##$DBL= (0..7)
120 120 120 120 120 120 120 120 
##$DBP= (0..7)
150 150 150 150 150 150 150 150 
##$DBP07= 0
##$DBPNAM0= <>
##$DBPNAM1= <>
$$ [...]
##$SUBNAM7= <"">
##$SUBNAM8= <"">
##$SUBNAM9= <"">
##$SW= 20.6930455092707
##$SWIBOX= (0..15)
0 0 3 0 0 0 0 0 0 0 0 0 0 0 0 0 
##$SW_h= 5175.983436853
##$TD= 65536
##$TD0= 1
##$TE= 295.16
##$TE2= 300
##$TE3= 300
##$TEG= 300
##$TL= (0..7)
0 120 120 120 120 120 120 120 
##$TP= (0..7)
150 150 150 150 150 150 150 150 
##$TP07= 0
##$TPNAME0= <>
##$TPNAME1= <>
##$TPNAME2= <>
##$TPNAME3= <>
##$TPNAME4= <>
##$TPNAME5= <>
##$TPNAME6= <>
##$TPNAME7= <>
##$TPOAL= (0..7)
0.5 0.5 0.5 0.5 0.5 0.5 0.5 0.5 
##$TPOFFS= (0..7)
0 0 0 0 0 0 0 0 
##$TUNHIN= 0
##$TUNHOUT= 0
##$TUNXOUT= 0
##$USERA1= <user>
##$USERA2= <user>
##$USERA3= <user>
##$USERA4= <user>
##$USERA5= <user>
##$V9= 5
##$VALIST= <valist>
##$VCLIST= <CCCCCCCCCCCCCCC>
##$VD= 0
##$VDLIST= <DDDDDDDDDDDDDDD>
##$VPLIST= <PPPPPPPPPPPPPPP>
##$VTLIST= <TTTTTTTTTTTTTTT>
##$WBST= 1024
##$WBSW= 4
##$XGAIN= (0..3)
0 0 0 0 
##$XL= 0
##$YL= 0
##$YMAX_a= 381023
##$YMIN_a= -463457
##$ZGOPTNS= <>
##$ZL1= 120
##$ZL2= 120
##$ZL3= 120
##$ZL4= 120
##$ABSF1= 16.522
##$ABSF2= -4.171173
##$ABSG= 5
##$ABSL= 3
##$ALPHA= 0
##$AQORDER= 0
##$ASSFAC= 0
##$ASSFACI= 0
##$ASSFACX= 0
##$ASSWID= 0
##$AUNMP= <proc_1d>
##$AZFE= 0.1
##$AZFW= 0.1
##$BCFW= 0
##$BC_mod= 0
##$BYTORDP= 0
##$COROFFS= 0
##$CY= 12.5
##$DATMOD= 1
##$DC= 0
##$DFILT= <>
##$DTYPP= 0
##$F1P= 14.0000005364418
##$F2P= -0.99999901652339
##$FCOR= 0.5
##$FTSIZE= 32768
##$FT_mod= 6
##$GAMMA= 0
##$GB= 0
##$INTBC= 1
##$INTSCL= 1
##$ISEN= 128
##$LB= 0.3
##$LEV0= 0
##$LPBIN= 0
##$MAXI= 10000
##$MC2= 0
##$MEAN= 0
##$ME_mod= 0
##$MI= 0
##$NCOEF= 0
##$NC_proc= -3
##$NLEV= 6
##$NOISF1= 0
##$NOISF2= 0
##$NSP= 0
##$NTH_PI= 0
##$NZP= 0
##$OFFSET= 16.522
##$PC= 1
##$PHC0= 170.1918
##$PHC1= 5.581131
##$PH_mod= 1
##$PKNL= yes
##$PPARMOD= 0
##$PSCAL= 4
##$PSIGN= 0
##$REVERSE= no
##$SF= 250.13
##$SI= 32768
##$SIGF1= 0
##$SIGF2= 0
##$SINO= 400
##$SIOLD= 32768
##$SREGLST= <1H.CDCl3>
##$SSB= 0
##$STSI= 32768
##$STSR= 0
##$SW_p= 5175.98343685301
##$SYMM= 0
##$S_DEV= 0
##$TDeff= 65536
##$TDoff= 0
##$TI= <Analysis number 999999
Compound Code 99
Book Reference 9
Project Code 9>
##$TILT= no
##$TM1= 0
##$TM2= 0
##$TOPLEV= 0
##$USERP1= <user>
##$USERP2= <user>
##$USERP3= <user>
##$USERP4= <user>
##$USERP5= <user>
##$WDW= 1
##$XDIM= 32768
##$YMAX_p= 497380009
##$YMIN_p= -371055
$$ End of Bruker specific parameters
$$ ---------------------------------
##NTUPLES= NMR SPECTRUM
##VAR_NAME=  FREQUENCY,     SPECTRUM/REAL,   SPECTRUM/IMAG
##SYMBOL=    X,             R,               I
##VAR_TYPE=  INDEPENDENT,   DEPENDENT,       DEPENDENT
##VAR_FORM=  AFFN,          ASDF,            ASDF
##VAR_DIM=   32768,         32768,           32768
##UNITS=     HZ,            ARBITRARY UNITS, ARBITRARY UNITS
##FACTOR=    0.157963299565203, 1,           1
##FIRST=     4132.6476996994, 0,             0
##LAST=      -1043.33573715361, 0,           0
##MIN=       -1043.33573715361, -371055,     0
##MAX=       4132.6476996994, 497380009,     0
$$ Real data points
##PAGE= N=1
##DATA TABLE= (X++(R..R)), XYDATA
$$ [...]
16515f901R9N844L278P405R615q191j224K027K933K236J689o102n828N9n593J446
16499B792O463J2560l340j3390j0208M262j1920p933Q524Q243M110p929r491K1060
16485C803j493L129J9976m627j1610j5450R71O120j318j4261m413r516j325M900
16471b5114N548J838Q381J3080m866P259l371l465J115J6234R269q729k4819j1446
16457a9086J1719L041q201O4n50J0220R987k42N237P680L538n696r392l824o679
16442b184J026n959j3919k587R717Q578R502L146j796M687j416N48j4750M273
16428a134J4652J696k148n922r908q435l45Q528L753r176m658l559j2637o285
16414c5578J3306J695N385J3999J4064n090k8853o029J5005O226J3271K687j7132
$$ y = [-6901, -6802, -958, 2320, 9725, 19340, 11149, 9925, 11952, 14885, 17121, 18810, 12708, 6880, 6939, 1346, 2792, 9255, 21815, 18475, 5085, -5123, -861, -12781, -20714, -12190, -3947, 163, -7766, -17257, 3803, 2310, 5439, 25415, 20788, 9178, -6272, -5301, 819, -499, -14760, -19173, -28689, -30014, -25114, -19566, -17728, -9347, 3733, -1133, 6126, 2755, -710, 405, 16639, 25908, 17179, -7640, -19086, -7367, -4326, -12527, -12463, -13013, -2793, 7194, 6952, 12189, 19869, 23407, 17711, 8319, 4495, -2184, -1158, -7117, -21036, -23623, -13906, -5328, 4174, 7320, 5524, 10211, 8795, 9343, -5407, -1134, 13518, 15214, 13066, 7144, -2764, -11199, -11544, -3016, 737, -8439, -13097, -16656, -29293, -35578, -22272, -20577, -15192, -1193, 12871, 7781, -21072, -27101, -12096, -5870, 7401, 10088, -7044]
16401g044O116R056k642l427Q828k342J0217R010j4136l073m491j0853m641r90
16387a0412J2943J4101J086j1158r734K967O685m487Q904o812n81K001j0142m375
16373i014N572R565J3513j3341p174m691L931k974k67R75N988k644l340O48O890
16358C637K006J003O17L878j1036q314P199j1196n122K041J4000L290J0128K4
16344A2155J975J001k620K733k354j611R96q642J863j0661J441P240J4857n27
16330A7846j3866q814N914N022k146J602N107P765o383j0965j3824k260J4074
16317i28J776M954n467l405L973M885J272O768k946j4248m269o929k602J3617
16303c549M836r202j338P190j08j2870j2305J3064K444j903j588O594k808n490
$$ y = [-7044, -928, 8128, 5486, 2059, 10887, 8545, 18762, 27772, 13636, 10563, 6072, -4781, -9422, -10412, 2531, 16632, 17718, 6560, -3174, -207, 6478, 1991, 10895, 4083, 3502, 5503, -4639, -9014, -3442, 6123, 19636, 6295, -879, -5570, -1639, -4613, -4880, -3905, 2083, -561, -3901, -3253, 3637, 5643, 6646, 7263, 11141, 105, -8209, -1010, -12206, -17328, -15287, -1287, 2003, 12131, 12155, 14130, 15131, 12511, 15244, 12890, 11279, 12275, 3633, 5496, -5165, -3724, 3516, 18373, 17846, 3980, -4834, 1080, 6102, 3956, 5558, 10665, 18430, 12047, 1082, -12742, -15002, -928, 848, 5802, 335, -3070, 903, 5788, 7060, 13828, 10882, -3366, -7635, -14564, -17166, -3549, 1287, -7915, -9253, -2063, -2171, -15041, -27346, -14282, -11838, -13741, -15329, -8735, -11543, -17033]
16289a7033N467J1034J0795N692J4095J94q79p453k700L8j2784k1899q400K716
16275b1117K2602J9912M52j0791L897L694q072j2244J855J1716M234L028l008
16262A6158K594j1472J7003j5790k3628r528l907J1323Q831L55J0817P665k36
16249A0185O58N000j83j1575j6896P928Q866J2120l403q612r600p685P271R994
16235D068l608r561q543o279J3567r83L241q961J1966n86O187P500J6497J2912
16221C7417j559j6644p928Q767r692k026n442P839j8316j9367K85K640Q729K713
16207a2584K470K250q082j3342M59K292J0671j2o986K316m37j2809L113Q301l691
16192b6071l058J3879J2287O724P42j2724j1007J006L55j5193K6284J4797r025
$$ y = [-17033, -11566, -532, 10263, 15955, 30050, 30244, 29365, 21912, 19212, 19250, 6466, -15433, -23833, -21117, 1485, 21397, 21849, 11058, 14955, 18649, 10577, -1667, 188, 11904, 16138, 19166, 16158, 18752, 7280, 24283, 8493, -15135, -24663, -28570, -17247, -8416, -8061, 2756, 10421, 10185, 10843, 15843, 15660, 4085, -12811, -4883, 3983, 16103, 12700, 4088, -5512, -13197, -5926, 4068, 460, -9101, -17644, -23923, -10356, -11339, -8098, -17059, -5093, -5679, 508, 8008, 24505, 37417, 35858, 19214, 11286, 20053, 10361, 8335, 2893, 10732, -7584, -26951, -26666, -24026, -15297, -12584, -10114, -7864, -15946, -29288, -28829, -26537, -15866, -15878, -22864, -20548, -20985, -33794, -30681, -22380, -26071, -29129, -15250, -2963, 3761, 4503, -8221, -19228, -18222, -17867, -33060, -6776, 8021, -1004]
16179a004j9015J8462N021k2649j881K1355J0271k0482M73q354o833n416J219
16166b8833J0057K2658O279k3039K28J1133J5567q251M254J032p288J1058L358
16153A8213m638j9566j0001K795J1704m760q04n595o357O765Q331o406j1411j772
16139b3502J4914J3305N873j507n821k36n379J262M801k189J2486m593n813R768
16125A3369K702j1967j0371J923J81j536J3227M188o114l120j0120N348n930K501
16111e719J159P050Q01L304n932J0502J0326j1283j2339L448J421j1319l758q02
16097a3141m821k213J9514K1684j5097k3966j1758J1577K628j1114K0634J7908
16085A1835J960j82l034k1426j680o553j0625J5559J9449m145p33K596l657j903
$$ y = [-1004, -20019, -1557, 3464, -19185, -21066, 289, 10560, -9922, -9449, -17803, -24636, -30052, -28833, -18776, 3882, 10161, -12878, -12650, -1517, 14050, 5799, 10053, 11085, 3797, 14855, 18213, 13575, -5991, -15992, -13197, -1493, -6253, -7057, -12652, -19009, -12244, -3913, -10319, -21730, -23502, -8588, 4717, 10590, 9083, 3262, 3026, -2353, -1091, 3710, 1521, 14007, 9414, 3601, 13369, 16071, 4104, -6267, -4344, -4163, -5699, 7528, 11716, 5602, 2482, -7638, -2290, -8220, -5719, -4560, 2490, 3291, 6595, 663, 11165, 21491, 10208, -2131, 1317, 2738, -8581, -12339, -13141, -17962, -20175, -661, 21023, 5926, -18040, -29798, -18221, -15593, -26707, -6073, 11835, 13795, 13613, 10579, -10847, -12527, -19080, -29705, -14146, 5303, 1158, 425, 3021, -636, -2539]
16071b539j1679J0959M771L642J182n707K664r04L929p500j966q814j8111k669
16057c2742P159J2354L83Q416L546j154L9Q701L598n406J282k639j0429r597q430
16042b4919J3382J107l762K0818K1055j5797l517L195o016O71O446n054j3030
16029e421l252J2477o48j6192l120Q306o852j0724P277R926J0585m372l386j2834
16015a8230j3421l802P626M831N277J5189m468l839j672q957P092M707M100N448
16001a19R404N594n468N758P099O39m882q320j8069r874J2285Q430k111p133N697
15986a070q80l474k482L323J242l233n916M663k148L576L942J107r674p120r15
15971a9059l036l327O206J5001P010M061J819j3641r157L150O38J1442J0500j4362
$$ y = [-2539, -14218, -3259, 1512, 5154, 6336, 629, 3293, 2389, 6318, -1182, -3148, -11962, -30073, -32742, -25583, -13229, -12846, -4430, -884, -2038, -1999, 6702, 10300, 4894, 6176, 3537, -6892, -16489, -24919, -11537, -10430, -14192, 6626, 27681, 11884, 8367, 11562, 5546, 6217, 12663, 7609, -5421, -8673, 3804, 3156, -13036, -16156, -7850, -14702, -25426, -18149, -8223, 2362, -2010, -5396, -18230, -31651, -35453, -27827, -22996, -17719, -2530, -6998, -10837, -12509, -21466, -14374, -9667, -5567, -119, 9285, 14879, 9411, 15169, 22268, 22907, 18025, 9705, -8364, -18238, -5953, 2477, 366, -6767, -1070, -1950, -5424, -7906, -4583, -3341, -6574, -12490, -7827, -9975, -6399, -2457, -1350, -11024, -18144, -19059, -22095, -25422, -19216, -4215, 2795, 6856, 8675, -4966, -14123, -10973, -10335, 1107, 11607, -2755]
15957b755j2024o762P99m030l880K600p145l126J2329P324M584m803N738K253
15943h898r048j581J4061M942l419r894j4464O348P945Q792O022m191j6996o366
15929b6747l625J0585J4912Q413J615q510K637M16N667j0827j294M65l994N288
15915d999J166l293N687N516k426j4763l18o685Q871K583J82j3751r771k100Q935
15900b5166P597O630l538l666J5357p308o038j1323l343P208o67k2991J970K2106
15886b3172K6954p699j9080M368R115Q037N468j859L584Q585m216j0673p243q495
15872a6326j6011Q079J2959J2900q888j526N709K190J2739J2344j6015k0280M173
15859g953k122q18r22l88j2759n675J3614K0055M547j2930j5211j1583l987R539
$$ y = [-2755, -14779, -21541, -20742, -24772, -28652, -26052, -33197, -36323, -23994, -16670, -12086, -16889, -11151, -8898, -17946, -19527, -5466, -524, -3943, -13837, -28301, -21953, -14008, -5216, 806, -3385, -20381, -26747, -30372, -19787, -4875, 3538, 5153, -3357, -720, -304, 5363, -5464, -6758, -6293, -10287, -4999, -3833, -7126, -1439, 4077, 1651, -13112, -13430, -20115, -11244, -8661, -8479, -22230, -32001, -34101, -25166, -17569, -10939, -14477, -18143, -2786, -10094, -16132, -27455, -30798, -23590, -24257, -47248, -45278, -23172, 3782, -3917, -22997, -18629, -9514, -1477, 3991, 2132, 5716, 14301, 10085, -588, -7831, -16326, -32337, -24258, -11299, 1601, -7287, -8813, -3104, -914, 11825, 24169, 8154, -12126, -7953, -10075, -10893, -11815, -12203, -24962, -30637, -17023, 3032, 7579, -5351, -20562, -32145, -36132, -26593]
15845b6593J0603J0016n786R553O88j0244j245j322O570K104j941O076r757j3817
15831b5095J4183M557l381m02M32j0768M19l669M335J9431J775m94r47p917j4954
15816b2495K5k406L10K0971P950M860J0527J3361j538j943r91j4195j3345j6615
15802a5524l13J255j137n490p47J0068m714R354l65k391J0443n457j6114q400
15788b9532n172L696K211j794K6758Q912k0035j3276Q270P594J2160M899m299
15775C92j1089M665J882l835j496J738l826p74p28J2670R404o311p707n463r453
15760a9931P317k571p17M688L527K382j2524l454J1849R565j3653j0808O530M096
15746a3704q207K525j706j063M317P049j5032O223J1237r416j3124o765J1028
$$ y = [-26593, -15990, -5974, -11760, -2207, -1519, -11763, -13008, -14330, -7760, -5656, -7597, -1521, -11278, -25095, -10912, -6355, -9736, -10138, -9706, -20474, -20055, -23724, -19389, 42, 1817, 1323, 376, -7541, -22495, -22470, -24876, -24566, -3595, 4355, 9215, 19742, 33103, 31565, 29622, 28631, 14436, 1091, -15524, -15837, -14582, -15719, -21209, -21956, -11888, -16602, -7248, -7613, -10004, 439, -5018, -21132, -29532, -34704, -31008, -28797, -30591, -3833, 5079, -14956, -28232, -19962, -12368, -208, 4691, 392, -10697, -6032, -4150, -7985, -9481, -7743, -11569, -12343, -13071, -401, 9003, 2692, -5015, -10478, -19931, -12614, -15185, -15902, -11214, -7687, -5305, -17829, -21283, -9434, 131, -13522, -24330, -17800, -13704, -21911, -19386, -21092, -22155, -17838, -10789, -25821, -19598, -8361, -17777, -30901, -37666, -26638]
15733b6638J5231J0020J4659k42p548j0899n551m215k378J0172M699k321n435
15720a0446O001o12n184n814q857K576Q725Q435J8504J1211o570j281n930j2762
15706b004j0954n165O208J3077r725K12O128J2657k261k9300R61L669l206M920
15692a4783M466J437o06J3085o601j0867j188K1985J1033n420r970m69J984k034
15678B052j8606j2454K499m042O286J6841J1084K59J2778k305k3184q184J517
15665a5459l217l600J0196P999Q94j2721j8034J2850J375j4034K724J6750J6505
15652B228Q337o723K543q168j1980M049O486O320J588K381R729J876j5629k347
15638F90p843Q97N118r18j176J640J583K017o915p019o08P71M636j2116J567J7420
$$ y = [-26638, -11407, -1387, 13272, 13030, 5482, -5417, -10968, -15183, -17561, -7389, -2690, -5011, -10446, -4445, -5057, -10241, -16055, -24912, -22336, -13611, -5176, 13328, 24539, 17969, 16688, 10758, -2004, -12958, -18123, -11915, 1162, -8563, -8351, -2223, 10434, 8173, -21127, -20166, -16497, -19703, -14783, -10317, -8880, -9486, 3599, -3002, -13869, -15057, 6928, 17961, 12541, 2571, 2102, 4086, 2052, -16554, -29008, -26509, -30551, -24265, -7424, 3660, 3919, 16697, 14392, -8792, -16976, -15459, -18676, -22276, -12080, -4081, -3187, -15908, -33942, -21092, -19717, -33751, -31027, -14277, 2228, 10565, 3842, 6385, -1783, -13763, -9714, -3228, 3092, 4680, 7061, 16790, 18666, 3037, 690, -7153, -6256, -1138, -2056, -3232, -1592, -9, 2008, -4907, -11926, -12534, -11763, -7127, -19243, -17676, -256]
15622b56q871q581R640J9167r283j8163q409m070m657J1798N197q09N572J5224
15608C499J1127j9512K434j677r397j866j2129P525J6571O828M709J3404l753
15595A7763J086J2560j815j7499k0008P666J4454k486j0807m814j815l880o032
15582a5627p303Q116J0140O901j2301l149r066n287o146J2105L798N265P078O512
15568A036L113p535l296J341p494j887j641Q63R780l145J262j032K931J869M041
15553B06J5666J4649J935j2405r178J318m204k34k649n554Q484l240J678n38n146
15538G88o462n667J4162J4300j4605j2874Q510k826Q165M424j0960O316J307o988
15524b410j59j496n107J1528k617j3757m269n872M919N564N971L087L134n165
$$ y = [-256, -9127, -17708, -8068, 11099, 1816, -16347, -24756, -28826, -33483, -21685, -16488, -17297, -11725, 3499, 14626, -4886, -2452, -4129, -13526, -15392, -27521, -19996, -3425, 3403, 8112, 21516, 17763, 18849, 31409, 29594, 12095, -7913, -247, 14207, 11721, 914, -3900, -5715, -9595, -15627, -22930, -14814, -4674, 2227, -10074, -13223, -22289, -27576, -33722, -21617, -17819, -12554, -5476, 1036, 4149, -3386, -6682, -5341, -12835, -14722, -16363, -15500, -5720, -8865, -7603, -8635, -5704, -3835, 206, 15872, 30521, 32456, 20051, 10873, 12191, 7987, 7753, 5104, -450, 8034, 4794, 6472, 5934, 788, -5674, -11341, 2821, 17121, 2516, -10358, -1848, -4674, 3491, 7915, -3045, 3271, 4578, -2410, -2569, -4065, -9172, 2356, -261, -14018, -18287, -24159, -19240, -13676, -7705, -4618, -1484, -6649]
15510f649j269J8845L478l071r005n346K861K373n097l324J0616p080p476O390
15496c754j6135r70o68O638k62j351J3828M307M58p462r891q084K118P285J315
15481a2628q427n606K1340J9090l268M111K693p059M499n325j2863k408r282l109
15467a8242P688n720j5025K721J5296O212M652P888j460j5565r863O14m057l548
15453b8409J5234Q648M351M330k903J580P412k66r220k2135o954J816k997O856
15439b2657J0666M444L930K879K366Q247o730o393k160O798J3355J5391Q405l557
15425C4984j2310l052j2547j1391J466j1554j5163l121M644K601R734o108M45
15412b1372N875O802O118K543p974j1990j761P349Q905p922J221P499J0611j4139
$$ y = [-6649, -7918, 10927, 14405, 11334, 2329, -3017, -156, 2217, -2880, -6204, 4412, -2668, -10144, -3754, -19889, -20859, -21527, -14889, -15151, -16502, -2674, 1633, 2091, -5371, -15262, -23346, -21228, -13943, -12628, -21055, -26661, -5321, 13769, 10501, 14612, 17305, 10246, 14745, 9420, -3443, -5851, -15133, -18242, -10554, -16274, -31299, -28578, -13282, -7070, -2418, 5470, 4010, -11555, -21418, -20804, -24861, -28409, -13175, -4527, -176, 4154, 1251, 2831, 10243, 9977, 757, -21378, -28332, -26516, -29513, -22657, -11991, -7547, -3617, -738, 1628, 9875, 3145, -3248, -5408, 1390, 14745, 30136, 38541, 34984, 22674, 19622, 7075, -4316, -2850, -14404, -29567, -32688, -28044, -25443, -15709, -21817, -21372, -15497, -8695, -2577, -34, -8008, -19998, -21759, -14410, -5505, -13427, -12206, -4707, 5904, -8235]
15398h235P47j696Q191M646l491M950j4146J0353M175m278j207o781j958J749
15384f981J0827J0869J408K063j1822j1948K219q878j0369N608J2862L255J1836
15371A0949m810j195J773K579n197r707O838Q793m449J710N666p213q182j1918
15357a4363N8J2151N016j097L131j259J329R72M03j6817j2096R298k213R810J1085
15342E408q87l305l711J484Q169l72o744j0276o282R469R073l172m673J035k756
15327g540m400J05j4539M877J4561o2l62M659p174J0279j999q666l06R4j3549
15312b4022J5941J3302P289j923j725j3574m049p011M780M595Q88j212j0220L7
15298a6904l081R608J4649L343p165j9733P647L239r035p302p90N563J0302n57
$$ y = [-8235, -7488, -9184, -993, 3653, 162, 5112, -9034, 1319, 5494, 1216, 9, -6772, -8730, -6981, 3846, 14715, 16123, 18186, 6364, -5584, -3365, -12243, -22612, -17004, -4142, -887, 10949, 6139, 4944, 6717, 9296, 4099, -5608, 1230, 10023, 5574, 7284, 12950, 5737, -2445, -14363, -14305, -2154, 2862, 1765, 4896, 3637, 4966, 5938, 6341, -10476, -22572, -13274, -15487, -5677, 5408, 4521, 1216, -2495, -1011, 7158, 6786, 42, -10234, -16516, -7047, 2026, -1146, -5819, -4784, -7540, -11940, -11835, -26374, -21497, -6936, -6998, -7360, -2701, -9875, 404, -1595, -10261, -10567, -10473, -24022, -8081, 5221, 12510, 10587, 8862, -4712, -8761, -15772, -10992, -6397, -5509, -6721, -16941, -16904, -19985, -10377, 4272, 7615, 450, -19283, -11636, -8397, -17432, -24734, -25524, -19961, -9659, -10216]
15284a0216K442J255n148Q367L027J3406r961n131q39k91N20J0727n387j7802
15270a5031l340P259J4944R83k316j4124k041L266k769j2189j9052J3083J2624
15257a8703O589m112j5936j8793J4868K6933P839j3559n199M29J1510J027j799
15244h906j640j539K567K913J573J1238j0658j0639K598K975O907l926j4391k0673
15230d1601M512J7039p43L151J218O657n490J018J1319P449j3976O719J2340j5842
15216f230J678j788p461n402M715J0327R400O99K746j3403p771M698Q849l147
15202b090j5072j2867p761O014J3843O879r8j32R810j390L18J7629p88O874N531
15187B6700j5405q011m485l776p533M142k061j2679j882J0513n211o380J3085
$$ y = [-10216, -7774, -6519, -11667, -3300, -273, 13133, 3172, -1959, -2798, -3089, -2569, 8158, 2771, -15031, -18371, -11112, 3832, 4815, 2499, -11625, -13666, -10400, -13169, -25358, -44410, -31327, -18703, -12114, -16226, -32162, -50955, -36087, -9154, -1315, -14874, -20073, -19644, -8134, -7107, -8906, -10546, -12085, -9518, -6605, -5032, 6206, -4452, -15091, -12493, -9518, -2611, -6537, -20928, -41601, -37089, -20050, -20793, -17642, -16424, -9767, -15257, -14239, -2920, 4529, -9447, -2728, 9612, -6230, -4552, -6340, -13801, -19203, -14488, -4161, 5239, 5938, 8684, -4719, -12490, -7792, 1057, -2090, -17162, -30029, -37790, -31776, -17933, -11054, -11152, -11284, -1474, -2864, -2546, 15083, 14295, 21169, 26700, 11295, 3284, -1201, -4977, -12510, -8368, -10429, -23108, -24990, -14477, -19688, -26068, -12983]
15174a2983N64k485j745j526j212n040J7695O906O875m627j0312M677J0321R662
15160A6770j509q514r238M283M982Q099q3j0390o837l096p387j008J0861m29k0317
15145b3813K31P220K001q330n294J1802J7947P505j104j2481k615P207k888k6388
15131b9000N000K109R018K73o19M449J1240M618m571j036P277J0052j3040o731
15117i61J0104l072j1161j3660j0813J0408R302l558j538M565J5831k979k953
15104d85N403J765M543Q510m301L940m395j1528K056m277R870M636n116m81p692
15089B448K573Q101M431o712K689O102j0481N12O729K923k625P270K166K274j3360
15074A5040j6481L81O164o598o09L499J1687K3176J2690j270j8211n132j3354
$$ y = [-12983, -12419, -14904, -16649, -18175, -19387, -24427, -6732, 174, 7049, 2422, -7890, -3213, 7108, 16770, 15261, 6747, -2491, 1792, 6774, 14873, 14790, 4400, -2437, -5533, -12920, -13928, -3067, -3496, -23813, -23582, -16362, -14361, -22691, -27985, -16183, 1764, 9269, 8165, -4316, -6931, 276, -2612, -29000, -24000, -21891, -12873, -12600, -13219, -8770, 2470, 7088, 2517, 1481, 8758, 18810, 5770, -961, 9143, 6071, -5090, -18750, -29563, -19155, -9853, -13411, -14949, -10384, 5447, 2468, -485, 4918, 6683, 11226, 19736, 15435, 19375, 14980, 3452, 5508, 1231, 11101, 15737, 10621, 10140, 2448, 5021, 13122, 17553, 10841, 13530, 19632, 9151, 9663, 16392, 19315, 16690, 23960, 26126, 28400, 15040, -1441, -1060, 5104, -1494, -2103, 1396, 13083, 36259, 48949, 47679, 29468, 24336, 10982]
15061A0982j0917m355r669R534O412n619N477M984j6187k796P244P495m367q490
15047a0272N826m637L47M639k253l001n943K220N648O3N889p798j8792j3846N709
15032c6201K4340J5637k950j897r872j1389J5371J3598k897k207k486J6197K45
15019A5489p390p6L594j151N142M552P435j3273j7421m152j6747P613j872p134
15005b5391o043R142N397L0P781q692K254Q679N284O347r95O468R366K514N859
14990B8000o382J6029L6498M6438O4737L7409k878K963r617o8867o2572j8272
14978F3486j8296k8007j2185j2482J3039J2851r832l788R718k393R377m338j2839
14965D311n809M857j6462l169J5423N904J495q059M604k024m540l874J1431R872
$$ y = [10982, 65, -4290, -13959, -4425, 1987, -3632, 1845, 6829, -9358, -12154, -4910, 2585, -1782, -10272, -4446, -9083, -8736, -4097, -6350, -9351, -15294, -13074, -7426, -7363, -1474, -9272, -28064, -41910, -36201, -11861, 3776, 826, -1071, -10943, -22332, -6961, 6637, 3740, 1533, -953, 15244, 15489, 8099, 8023, 11617, 10466, 15608, 20160, 27595, 14322, -3099, -7251, -23998, -16385, -18257, -25391, -31434, -22292, -16895, -16865, -9084, -17776, -15522, -6843, -1559, 4788, 3793, 10261, 19627, 22141, 28000, 21618, 37647, 74145, 120583, 185320, 222729, 219851, 222814, 213197, 144330, 81758, 63486, 45190, 17183, 4998, -7484, 5555, 18406, 8574, 4786, 14504, 12111, 21488, 17150, 4311, -1498, 3359, -13103, -16272, -849, 5055, 6550, -1509, 3095, 1071, -3469, -7343, 4088, 13960]
14951A3960j5087l381n734j0116k10J6193K2574J852j7170o280J469n82j3811
14938a6323j5524r286Q043J6560J2638M743q094k4083j0491Q694J0924J1300N404
14925e495K713j1771q814M989P285M714j1433m947J1721J7004O166l089K634K98
14911A1975j0228k3672j042M648p079q699J8428R741j5336O059N697l016j3229
14898b5753k618J3831J2481Q019J0247j8104q367k501j4366L96M44P370J2522
14885f399l326j2372p219K0578J0262j6288k369J2656J396J660O892j2686p732
14872a4947q149Lm204J6842N054m877j179j0615M056R714R426j2827n312Q104
14858h911J2714k199L139j2905L78J0847O245j3647o127J4843Q668L908j4097
$$ y = [13960, -1127, -4508, -10242, -20358, -20568, -4375, 18199, 20051, 2881, -3399, -1930, -2512, -16323, -31847, -41133, -33090, -16530, -3892, 851, -7243, -31326, -41817, -33123, -22199, -10899, -5495, -2782, -14553, -23367, -18378, -11093, -6379, -17812, -22759, -11038, 5966, 12132, 9043, 11677, 11975, 1747, -21925, -22967, -18319, -25398, -34097, -15669, -5928, -21264, -15205, -9508, -12524, -25753, -28371, -14540, -2059, 5960, 16207, -1897, -10264, -12765, -27131, -26735, -26291, -18921, -6399, -9725, -22097, -29316, -8738, 1524, -14764, -17133, -4477, -3081, -1421, 5471, -7215, -14947, -23096, -23093, -27297, -10455, -5401, -10278, -11457, -22072, -18016, -8302, 1124, -11703, -17015, -8911, 3803, 1604, 4743, -8162, -7784, 3063, 9308, -4339, -10466, 4377, 13045, 16953, 2856]
14845B856j3654K502k686j1969j3361l91N603K880o327P19J1744O448j080J0041
14831f675K145R187J305q291j110J2006k878n93q462O549J3827n137l833L897
14817A1937R015r749j8772q260J3567J2367K6805Q680j9743o949r646k939J827
14804H140j1857o492J6563K927q866P129L918K539K179k800j4055q413k587n418
14790a7093j679K1534J960j0275p420m798J64J5090K010J733j2908o516R187L937
14776e074J999J077k991R87K051n746n540M446L996j1095P121k845r501O826l673
14761a7962o841l059p234n850J8736j668j2184Q485K3804j386J0274O743j8171
14748f313L029J0973n968k1349q018J2502J2927J2541N35j0917k161J0641O11
$$ y = [2856, -10798, -8296, -10982, -22951, -36312, -36703, -31100, -28220, -34547, -33828, -22084, -15636, -16716, -6675, -4530, 4657, 5962, -2329, -3439, 8567, 5689, 5096, -3366, 3183, 17010, 11873, 8040, 11937, 20952, 11203, -7569, -15829, -2262, 10105, 36910, 45590, 25847, 18898, 9252, 6313, 8140, -3717, -10209, 6354, 9281, 415, 7544, 11462, 14001, 16180, 13380, -675, -9088, -11675, -17093, -18772, 2762, 4722, -5553, -12973, -17771, -17607, -2517, -507, 1226, -11682, -18198, -9011, -5074, -3075, -1998, -4989, -4002, -1951, -7697, -13237, -8791, -4795, -15890, -8769, -11614, -21115, -14289, -17962, -24803, -27862, -35096, -40946, -22210, -23878, -36062, -27577, -3773, -5159, 5115, 11858, -6313, -3284, 7689, 1721, -19628, -27646, -15144, -2217, 10324, 10859, -58, -2219, 8422, 9033]
14735I033l797j7410n265k609P107J1244j1718n051k536R147Q150J4791j378l323
14721F385j2694j1079Q128P695l147j0271l107N029k361K772j0085r027m046N560
14707c0248J5564N251n659N451J27l047K508Q739J3007O045k5979k3406K764J6885
14693a1998P554m257p411P958N244l530J0961J705r523n525p99p260J5491N23
14679h67j3351j004m540o270m249J226L426J42K705J2161J3260p18q220p393j1956
14664b5648M811J9276J4564J1284j2428j3657K902m767n923M884O872j0930j888
14651a0648M545O008o91J1813O330K81j3975j3529p263m519l361K17N528n623
14637b4887M784J5421R761J883o864L054j1227j4037n172N793O705m809j834P995
$$ y = [9033, 5236, -12174, -17439, -20048, -12941, -1697, -13415, -18466, -21002, -11855, -3705, 11086, 9708, 6385, -6309, -17388, -9260, -1565, -4712, -14983, -18090, -13061, -15422, -12650, -22735, -31762, -35808, -30248, -14684, -9433, -15092, -9641, -9514, -12561, -10053, -1314, 11693, 17738, -8241, -31647, -28883, -11998, -4444, -8701, -16112, -8154, -2910, -6440, 4521, 6226, -3297, -8822, -9621, -16881, -1390, -867, -14218, -15222, -19762, -26032, -30281, -29055, -25629, -25487, -22782, -10621, 2639, 1921, -6299, -13692, -25648, -20837, -1561, 13003, 24287, 11859, -1798, 1104, -3663, -9586, -4702, 2170, -8760, -10648, -6103, -95, -786, 11027, 17357, 17638, 3663, -9866, -17129, -21648, -25009, -24792, -19264, -24887, -20103, -4682, 5079, 6962, 98, 3152, -8075, -22112, -27284, -21491, -14786, -19595, -21429, -13434]
14623a3434J0606j5961j0733K2376M504j4242j0523N358J0949J836p325j259O335
14610a1513p072k118R919J2267O765O9o228j5693j873J0034m585k1021L049J9858
14596h142N736m909m013J1431R144n441J4136R115j1456j4565n507L425Q584j3288
14582e750n958J6865l630j0140N39j437r648J5934J0214O536j3327o748q85M427
14568c008M738k6184P593R069p114R94K429j297N571n860L71O688J1731R01q281
14553a659L211j361q648M310k184j217J9042J567k893j1668R238k297M326q851
14539I16j2647q622J0912P977j5120q670P131j028J5996R300J1162j6047j1707
14526a0447K299p448m945J447q997J5214O650n098o470J0167J001j5582o439K1560
$$ y = [-13434, -2828, -18789, -29522, -7146, -2642, -16884, -27407, -22049, -11100, -9264, -16589, -17848, -11513, -18585, -20703, -10784, 1483, 8248, 8317, 2089, -13604, -15477, -5443, -10028, -31049, -28000, -8142, -2406, -7315, -11328, 103, 9247, 3806, 17942, 27057, 15601, 1036, -4471, -1046, 7538, -5750, -11708, 5157, 1527, -8613, -8074, -9511, -19159, -3225, 6989, 13525, 198, -6550, -7435, -3008, 1730, -24454, -16861, -7792, -14906, -13912, -11483, -12780, -7209, -13069, -12698, -6010, 5721, 6622, -1659, 1552, 191, -8457, -4147, -6331, -7548, 11494, 13061, 10168, -1500, 7738, 5441, 9767, 916, -11731, -20353, -9441, -1464, -16584, -25254, -18123, -19151, -3155, 6145, 17307, 1260, -10447, -8148, -15596, -20541, -19094, -28091, -12877, -6227, -11325, -17795, -7628, -6627, -22209, -28648, -7088]
14512g088J6683m840m154k349J8993j395q321K218l446k1702k610J4522l135n876
14498a2500J0438N48o155l509r526J1071P178o398k945k178K955L375O220j233
14484b659l910L784N363j4936j3916m855J1032k305j840J501R712J0339J8424
14471A5734K511o140j2211q47Q428j5587m231l694P429m534l081K56O109j506
14457a1364j1004o079P495O632M212M689m042L420o1p407k785p40O623J7429n510
14442A508p044n495j229k9K0093P090j9743K409N909r797J585J341j464M048n597
14427f415n132O038L388M98J1975k027m725P988m258j9446N663P284r645k319
14413a1133O383R267M127K183p57j9749j8178J1957J2991J4840J847M407j0276
$$ y = [-7088, 9595, 4755, 601, -1748, 17245, 15850, 7529, 9747, 6301, -15401, -18011, -3489, -6624, -12500, -2062, -1514, -7669, -11178, -20704, -9633, -2455, -8853, -11798, -13976, -11021, -7646, -1426, -2659, -6569, -2785, 2578, -12358, -26274, -31129, -20097, -22402, -24242, -22741, -13029, -2690, 15734, 18245, 12105, -106, -953, 7475, -8112, -12343, -16037, -8608, -13142, -16223, -15967, -9858, -11364, -22368, -28447, -20952, -14320, -10108, -5419, -9461, -6041, -6102, -13509, -16294, -17034, -10411, 7018, 1508, -5536, -11031, -12260, -12289, 7804, 14894, -4849, -2440, 3469, -6328, -4743, -3402, -4866, -818, -6415, -11547, -5509, -2121, -1623, 10352, 8325, 3600, 11588, 7330, -12116, -6453, 831, -8814, -11133, -4750, 4517, 8644, 10827, 10070, -9679, -27857, -15900, -2909, 11931, 13778, 18185, 7909]
14400G909p155K594q156m797J8786N814p472J1109k41j0374q950L054j3793j6724
14386b8396R007P641k868O626K674j2939R587L05j3920o20J2664n528r914J580
14372b4101M425J2911J2032L597J717o668o67l395m915m576K918M612n135J5521
14358H276J2749j2710j8773j3694R123R708j3917j4154O768Q349M899n782J2541
14345f617N664j3036p759Q514O915r142K549J0140j42N87P820J201p623j716R67
14330a678J4564o34j4556m602r458L087j0374L332M592P874N876m762q391j954
14316a7084R775l647j265J9705j616r970J913P153P81j2337p141M406L982K386
14302b959j5075O886N650K12j121M797l867m066m839J0392J3027J1352n677j5776
$$ y = [7909, 754, 3348, -4808, -9605, 9181, 14995, 7523, 18632, 18391, 8017, -933, 2121, -11672, -28396, -19389, -11748, -14616, -7990, -5316, -18255, -8668, -8363, -22283, -22903, -10239, -15767, -25681, -24101, -19676, -6765, 5267, 8864, 10581, 3913, 3246, -149, -5064, -9640, -6722, -2110, -7245, 8276, 21025, 8315, -10458, -24152, -15029, -5321, -19238, -33392, -26624, -18275, -13376, -19158, -6617, -953, -13989, -21748, -13234, -6319, -15461, -12912, -2772, -2914, -2327, 5493, 6694, -929, -2645, -1678, 12886, 12252, -2304, -6906, -16364, -13277, -23651, -20319, -15727, -7853, -1977, -6739, -15130, -17084, -7309, -10956, -12221, 7484, 5868, -4102, -2189, 4964, 5745, -6592, -13733, -9327, -5345, -2959, -18034, -11148, -5498, -5286, -6407, -1610, -5477, -9543, -14382, -3990, 9037, 20389, 14712, -1064]
14288a064n035Q601N496P93q959j9738k265R830k805o082Q003J1379K035j6507
14274a6318L121J5098O49O722p196j484J0156r093J617N852L215l130q652q391
14260g834J7318P468r899j3316J016M973K039r544o463m525O091k343r93J3332
14246b680j3165j0308O41N0J4783J7860M724K672J026K502j4571j3779n211R027
14232f429j491J957l646j4448j063R583J2085M340J3760q03k0220k018M509j915
14218e799j462N527m718j720K382J941j142L246M359j0742r839m551j0592M44
14204c2666J0846R137J0269j984j2800o53J1516M919l093q817K560J009n50p848
14190a8155R658P268n06M708j2248J312R865j8731j841R730q067J236R16Q089
$$ y = [-1064, -6099, 2502, 7998, 8791, -168, -19906, -22171, -12341, -15146, -21228, -13225, -1846, 189, -16318, -13197, 1901, 2550, 9272, 2076, 592, 10748, 1655, 3272, 9124, 12339, 9209, 557, -7834, 9484, 16952, 7053, -6263, -5247, -274, 1765, -7779, -14242, -18767, -12676, -15019, -16012, -2680, -15845, -26153, -25512, -25462, -10679, 7181, 11905, 14577, 15603, 18105, 3534, -10245, -15456, -6429, -7920, -5963, -9609, -24057, -25120, -15537, -3452, 888, 14648, 13845, -6375, -8393, -3884, -5799, -7261, -1734, -6452, -8172, -5790, -3849, -4991, -1745, 2614, -8128, -17967, -22518, -33110, -32666, -21820, -12683, -2414, -4398, -17198, -17851, -6335, -1416, -4509, -13326, -10766, -9757, -10307, -18155, -8497, -1229, -1735, 2973, -9275, -7963, 1902, -16829, -18670, -8940, -17007, -15771, -14855, -6766]
14176f766p02j51p690K816n29m862L760J5276K919j1391q791j141R926m937m974
14161a7237r721q127J5304M428O585J198p49K64K887N646o6L21j077r900J852
14146h392O268j670j3040q174Q598J1297r87J5495O338N169l903K248o54k850
14132A5743J0160j3348j2149j1890p8l972J3999L750k597k563j5570r03n708L285
14118b1841P494N650P691n492l310j739J6313J2372m716j3961J986J531m93n995
14104d510M535O260j762r437k2722p76J8823J3915o817n40Q021Q436p854L14k768
14089C118l883j596P608j4631L441Q822l016k5908j4525R76j562Q591J4462J6686
14075a417O067k893j22l804O715j002r807k774O222R48N007J147o60l682j6661
$$ y = [-6766, -7468, -7619, -15309, -12493, -13022, -17884, -14124, 1152, 4071, -7320, -16111, -17252, -7326, -12263, -17237, -26958, -35085, -19781, -15353, -8768, -7570, -8319, -8055, -5168, 478, 412, 733, -344, -10244, -8392, -2124, -3794, -16834, -25008, -16410, -5113, -6100, 9395, 15733, 20902, 16999, 19247, 18593, 15743, 25903, 12555, 406, -11484, -11562, -15534, -1535, 2215, -382, -2945, -18515, -19418, -25126, -21841, -14347, -8697, -1006, -6498, -9808, -11547, 4766, 17138, 12422, -1539, 447, 1978, 1485, -4510, 25, 6285, 4523, -4914, -27636, -28412, -9589, 4326, -2491, -3031, 4990, 13426, 5572, 5886, 3118, -765, -2361, 5247, -9384, -5943, 2879, -137, -26045, -40570, -39594, -41156, -32565, -18103, -1417, 4650, 1757, 1635, -2169, 4546, 3544, -6263, -9037, -2815, -1867, 3140, 4287, 3627, -55, -16716]
14060a6716M406Q138j317r468O609J0955J185k934j7223P069N217p516l314K122
14046a2787p077j188L471P062L042n833N139P789o714l403J4755k242l266J4968
14032A3716M494r521j931j0684j7550n591J2713M890N891p39m592J4342J1207
14019A6645o848j0966j0646p410Q558J351L314N411M45Q785J3538J368j258J4800
14005C7087o866j3908k0477p385k577O505P964k646L257L283R905m016K684n880
13991F930k171j113l325l300K03Q67J033K612R141M921N492M865j5006p38q212
13976B199N778n864r288J332R385L332k815J828j4120j9206m647K6907J9231Q613
13962B2665o814q03R032L323p852o008R15j1278j5113J2141L824o124J370K0653
$$ y = [-16716, -12310, -4172, -5489, -14957, -8348, 2607, 3792, 858, -16365, -9296, -4079, -11595, -14909, -12787, -19864, -21052, -17581, -10519, -7477, -13310, -8171, -382, -7096, -10499, 4256, 2014, -1252, 13716, 18210, 8689, 6758, -3926, -21476, -27067, -14354, -9464, -3573, -4312, -8904, 5438, 16645, 9797, -1169, -11815, -19225, -10667, -9316, -6002, -591, -146, 8639, 22177, 23545, 22287, 37087, 30221, 16313, -4164, -11549, -14126, -7621, 343, -2303, 954, 4237, 14142, 10126, 12810, 6930, 4759, 3646, 321, -2979, -2776, -1909, -876, 1736, 10877, 15798, 21290, 26155, 11149, 10411, 2199, 7977, 2113, -7175, -5843, 3542, 6874, 4059, 5887, -8233, -27439, -32086, -5179, 14052, 22665, 15851, 15048, 24080, 27403, 19551, 13543, 14458, 3180, -11933, 208, 4032, -2092, -722, 19931]
13948A9931L875j6893k4515j0727J5572K0928m549P5J575l889r15p515j4154O640
13934a4561J0311Q827n171o872k802l211m429J5917J647q995q52n60j5611J0389
13920a5973J4032J1249p13q209L538K566o227j143K736J922j0827q417J7350P341
13906I225M376j2951r857P979J103k007K94M077M825J0506r213N88O444m078J5367
13891B6678J1285n097j8885j855o529j0061o287n400L171m37r5J3163J8372K711
13877B0734l413K980j615r340p78J0467j6932j1189J657p962o45J3695M445m594
13863b490J112j187m905O316N730L909J5513l193m230m034k058M035m019K996
13849A3495j6549j385J9190k937p937j811L305M12q089n102J414l625K964l957
$$ y = [19931, 23806, 6913, -17602, -28329, -12757, 8171, 3622, 3697, 5272, 1383, 468, -7047, -21201, -14561, -4250, 4577, -594, -7466, -10268, -13479, -17908, -1991, -344, -9339, -10191, -10751, -26362, -15973, -1941, 9308, 8595, 386, 3924, 6490, 263, -880, 1856, 3778, -7049, -15466, 1884, 9225, 13601, 650, -9207, -1228, -125, -2132, -1838, 2239, 7064, 17570, 8357, 8945, 15389, 11311, 26678, 37963, 32866, 13981, 12126, 5597, -4464, -10751, -16151, -12980, -13417, -13512, -349, 18023, 20734, 17321, 20301, 18686, 9346, 8568, 19035, 2103, -9086, -7429, -15391, -16036, -2341, 2104, -2490, -1378, -2565, -7470, -1154, 4576, 8485, 23998, 20805, 16575, 12541, 10483, 14518, 10499, 13495, -3054, -4439, 14751, 11814, 3877, 2066, 5371, 5783, -2306, -7408, -5994, -9619, -6655, -10612]
13835a0612J909m001N407P430K482M128K952J784k117j5125j5132j661J0150N458
13821f948j045O963J5110o348j6877L088P088N40L5L248o696p772O184L123r006
13806i313k761j6729K302J7779J6501J4292K262o658j1342l964m931R366j413
13793E391p235j942r947J0506k3100m867J0430P844p628J198K100m781P985L67
13779a3679O227q573Q330K4332N574k110r016j5010P72Q491j052K085o039L200
13765C532p368J383j792K04p070J1721P153J338P499o289m014q068p699R268P798
13750G596o632r674O573J0794j0038q760k295Q210m470J0875J74K01n192R863
13736G225O429J1776J8278l776r674K647J5473J9176J0050J8142L5482K7799K2177
$$ y = [-10612, -8703, -12704, -7297, 133, 2615, 6743, 9695, 11479, 9362, -5763, -20895, -22556, -12406, -6948, -7993, -1030, 14080, 7732, -9145, -6057, 1031, 1571, 1606, 4854, -1842, -9614, -3430, -307, -9313, -12074, -28803, -26501, -8722, 7779, 22071, 24333, 17675, 6333, 2369, -2562, 6804, 5391, -1844, -3786, -13733, -3227, -26327, -31194, -20764, -12920, -20548, -19350, -17250, -22031, -14046, -13679, -7452, -16025, -7695, 16637, 22211, 20101, 11085, -3925, -3153, 5338, 4286, 6371, 332, 3532, -3836, -2453, -4245, -4041, -11111, 610, 7763, 9101, 16600, 10311, 6297, -1771, -9470, -202, 7596, 964, -8710, -2137, 8657, -1381, -10141, -12436, -4226, -8696, 2179, 2353, 2554, -2638, 7225, 13654, 25430, 43708, 39932, 30258, 32905, 48378, 67554, 77604, 95746, 131228, 159027, 181204]
13723A81204L990k6655j3479j8279k8462k7328q554M293l478j3883Q722L248j5009
13710D6330j1584l261k232K782p3j889P900L634J4918l202l430J6588l50m01k241
13695F3489P071K4093K8332K5842N0707O8144N9347M6849K7710j5888m0081k8994
13683C16621m4081m9687m0334l6054k7191m481j4274j0566r93n425m281l569j8393
13670E7292r536L108l573M55J787J952j6209j5625L59J7301K8370K3705K2619
13657A12005P389Q949K1238L4366K7962K2218R11j0291j0033l8272l1065l0898
13645A14479q127j4792j2301j2415p857j5826l252R45k45Q003j1066p456L717
13632C3807J0490j1455j4229n916o215r621M723m64r671K999L061J1091J961o881
$$ y = [181204, 185194, 158539, 145060, 126781, 98319, 70991, 62437, 66730, 63252, 49369, 58091, 61339, 46330, 34746, 31485, 29253, 32035, 31962, 30073, 37973, 41607, 56525, 53323, 49893, 66481, 66131, 65730, 63489, 70560, 94653, 122985, 148827, 199534, 267678, 327025, 373874, 401584, 385696, 345615, 316621, 272540, 222853, 182519, 146465, 119274, 114793, 100519, 89953, 88960, 83535, 79254, 75685, 57292, 47756, 50864, 47291, 47746, 49533, 51485, 35276, 19651, 20010, 37311, 65681, 89386, 112005, 119394, 128343, 149581, 183947, 211909, 234127, 235038, 224747, 214714, 176442, 145377, 114479, 106352, 91560, 79259, 66844, 58987, 43161, 39909, 40854, 40609, 48612, 37546, 30090, 33807, 44297, 32842, 18613, 12697, 6482, -3139, 1584, 1120, -8551, -5552, -2491, 8600, 10561, 3680]
13618C680J9091L477j8381q591L718J601R09m936J0440K589j8151j5581J1712
13605h423L220P129n631j2893j3632N011J0666L43J2581k14k772m106o728n249
13591b0698O167R071k640M809L286J111P374o068p028k0331l686R795J2354P533
13577A049J3889R53j6231j2759L340J4558n140P839j238m233p37L466o041k722
13563d007q199M934K0377O694j909r449k51m750j5085R306L623J494L965k890
13549C853p404j0673l131l098k55M772M379J103j159J91j035J0553J2252N060
13535A5408j2203o165k374N374Q742M394k119J4265J0520l249j9351l849l764
13522E629k470P276M883n158l113Q265J4226O212k5139j1170J5182Q938R365k485
$$ y = [3680, 22771, 26248, 7867, -724, 2994, 4595, 5504, 568, 11008, 13597, -4554, -20135, -8423, -5203, 1926, -3705, -16598, -30230, -25219, -14553, -14210, -1629, -1843, -4615, -8721, -15449, -20698, -14531, -5460, -8100, -3291, -5, 1106, 8480, 2412, -4616, -24947, -28633, -18838, -6484, 1049, 14938, 15891, -340, -13099, -9759, 4799, -341, 7498, 6260, 2027, 1290, 4756, -1285, -4007, -12206, -7272, 13105, 19799, 17890, 8441, 8190, 3440, -11645, -2339, 1284, 2778, 6743, 3853, -3551, -14224, -17355, -20453, -20708, -15936, -11557, -10454, -11613, -11422, -12457, -1904, 10348, 15408, 3205, -2960, -5334, 40, 8782, 13176, 11057, 25322, 35842, 32593, 13242, 9393, 5629, 3159, 10435, 15318, 10160, 7047, 15312, 29538, 35750, 10611, -559, 14623, 23561, 32926, 30441]
13508C0441J962q743O26J0650P138l621R850j907j9266o763M511l674q476J316
13494A4044J905J2613K7937J1072j2198k587N69j865R133o751j7083j5317o633
13481A4839K013L457M804R805O839k73K83n055N052O045j0774k3381n524N181
13467A3311J3574k995L560K3933L1652P034L016m321O165J844R966p828k4155
13454G4756j3673O200M57n436J83j1234o659K144k856j414j0584j0180m10M525
13440B5819q15J0900r583j2568R30M048J7697K1323m053Q350K0374J9245R474
13427A11141K8164K3214K7309K2630r997k1197k6849j8644j1451P246o340k1122
13415A04104r971K744O433j3729n332m418J682J0455n569o302n865o740J0464
$$ y = [30441, 32403, 23660, 24286, 34936, 42074, 38453, 48303, 46396, 27130, 20367, 24878, 21204, 12728, 14044, 15949, 28562, 56499, 67571, 55373, 52786, 53355, 51490, 60623, 53872, 36789, 21472, 14839, 16852, 20309, 25113, 34918, 41757, 41484, 41767, 36712, 41764, 47809, 37035, 13654, 8130, 13311, 26885, 23890, 27450, 51383, 83035, 90069, 93085, 88764, 94929, 96773, 106739, 98911, 74756, 61083, 67283, 67740, 62304, 62487, 51253, 44594, 46738, 43882, 42468, 31884, 21704, 21294, 25819, 25004, 35904, 26321, 13753, 14683, 18731, 36428, 57751, 53698, 62048, 82422, 101667, 111141, 139305, 162519, 189828, 212458, 202461, 181264, 154415, 135771, 124320, 131566, 125226, 104104, 94133, 96877, 103310, 89581, 84249, 79831, 81513, 91968, 86399, 80097, 74232, 67492, 77956]
13402G7956J9867o869J979Q942l245j0281p794n390J6173J0530m222m625K0788
13389A13809L2327J0977m298M897r227k2513J313R112n22q370j2662j039J8381
13376A32185Q653j1996k735P223r60J625O004N005J04m31J1130J4684K4904J1420
13362B06815L436j0424m50p148k2457n041n893R017J673j5340o071J9724J5975
13349A83816m296Q17P067n219q024J4081K2389q612q515K288k868j762p098N216
13335A89280J0759J0548M480J850j043J0910K6121K4823J9228l298j1946P41l787
13322B78666o541Q71P568K2302O893K972M818J2313Q481R474k317K5998K3866
13309C95364J5982K319j4902P426L9072L5699K3475J1800J5037L9369K6065L3440
$$ y = [77956, 97823, 90954, 92933, 101875, 98630, 88349, 80555, 75165, 91338, 101868, 97646, 93021, 113809, 146136, 157113, 152815, 157712, 148485, 125972, 127285, 136397, 135875, 127505, 114843, 113804, 132185, 140838, 128842, 126107, 133330, 132370, 133995, 139999, 145004, 145108, 144677, 155807, 170491, 195395, 206815, 210251, 199827, 199377, 192229, 169772, 164731, 158838, 167855, 169528, 154188, 148117, 167841, 183816, 179520, 180337, 187404, 182185, 174161, 188242, 210631, 202019, 193504, 195792, 192924, 191162, 184064, 189280, 200039, 210587, 215067, 216917, 215874, 226784, 252905, 277728, 296956, 293658, 281712, 282453, 278666, 272125, 272996, 280564, 302866, 309759, 312731, 317549, 329862, 338343, 347817, 345500, 371498, 395364, 411346, 413665, 398763, 406189, 445261, 480960, 504435, 516235, 531272, 570641, 596706, 630146]
13297F30146K5893K6748N5575N2620M5019P3036J01314R9332J10592J39930J88002
13286A548207K21533K62895L48473M41958N38718O80655Q76273J217119J714721
13277G850552K571836L848624N346469O313069N951724M472871K155009q83776
13269C7626378l677753n394868o060883n318172l764879k410317j526504r67605
13261H505397n91121l54283j98830j12505j19188j57337k01032k13773j70245
13252F387083p0394M4868J91307L17534M80081O69753Q93975J204266J630166
13243A1748639K252165L263412M917065P449539J0570742J2825071J2509010R732081
13235G5267724N081121j174739p239126j1166156j2876764j1811200q621604n525997
$$ y = [630146, 656039, 682787, 738362, 790982, 836001, 909037, 1010351, 1109683, 1220275, 1360205, 1548207, 1769740, 2032635, 2381108, 2823066, 3361784, 4042439, 4918712, 6135831, 7850552, 10422388, 14271012, 19617481, 25930550, 31882274, 36355145, 38510154, 37626378, 33948625, 28553757, 22492874, 17174702, 13409823, 10999506, 9473002, 8505397, 7914276, 7559993, 7361163, 7248658, 7129470, 6972133, 6771101, 6557328, 6387083, 6316689, 6361557, 6552864, 6870398, 7350479, 8020232, 8914207, 10118473, 11748639, 14000804, 17264216, 22181281, 29630820, 40201562, 53026633, 65535643, 75267724, 80348845, 79174106, 71934980, 60768824, 47892060, 36080860, 27459256, 21933259]
13227B1933259l485748k275959j532433j046433p09523n18538m51712m49175m71793
13218A0991945m65213m37772l55139k57091j65214n4864K0687Q7929J57227L18514
13208I841009N55315Q80978J434706K284676L519758N099398O358487O330183
13200C6304510N022852K761656m06071l577205n601514o661578o280611m652718
13192A6909321l074208k052209j404088r86966p17182n40089m09893l42556l33248
13183G048882l66539l77199l78063l58275l27326k90508k52969k45729k12393
13174D239881j79052j75113j72108j57206j46605j33463j30303j12363j00563
13165B933105q6438q3916p4289p4688n2675k4530m1323n2397n7803p0099n4931
$$ y = [21933259, 18447511, 16171552, 14639119, 13592686, 12883163, 12364625, 11912913, 11463738, 10991945, 10526732, 10088960, 9733821, 9476730, 9311516, 9256652, 9277339, 9365268, 9522495, 9841009, 10396324, 11277302, 12712008, 14996684, 18516442, 23615840, 29974327, 36304510, 41327362, 44089018, 43682947, 40105742, 34504228, 27842650, 21562039, 16909321, 13835113, 11782904, 10378816, 9391850, 8674668, 8134579, 7724686, 7382130, 7048882, 6682343, 6305144, 5927081, 5568806, 5241480, 4950972, 4698003, 4452274, 4239881, 4060829, 3885716, 3713608, 3556402, 3409797, 3276334, 3146031, 3033668, 2933105, 2846667, 2762751, 2688462, 2613774, 2561099, 2536569, 2495246, 2442849, 2385046, 2314947, 2260016]
13154B260016r7870j25425j08315p9112q2343p6925o8195m9811m9055m9737m6177
13143A427051m3122k7033l4435l3578l6924j3140l1190m1634n1270k9354l4119
13132A051252m1545l9588j9492j2214j9333k6954k2250k1918l1184k1836k2560
13121G72378k5467j6537j9591k8414k4555j2746j8451k5902j9643j5591K572j1679
13109E56374j9070j3240j7798p575k5612k2466j0188k1350r413l813k2681j8495
13097C64673j436N549j9398j9762j1974l660p305p955k1646j4127m568l443k0550
13084B34398k4352j5827q555r814m313K1249K0294J6123O757J1023K1277j453
13072B66807n484j829M623J2216J0985j4986q329j4992j7602k2484j8525n551
$$ y = [2260016, 2162146, 2036721, 1928406, 1849294, 1766951, 1690026, 1621831, 1572020, 1522965, 1473228, 1427051, 1383929, 1356896, 1322461, 1288883, 1251959, 1238819, 1207629, 1165995, 1114725, 1085371, 1051252, 1009707, 970119, 950627, 938413, 919080, 892126, 869876, 847958, 816774, 794938, 772378, 746911, 730374, 710783, 682369, 657814, 645068, 626617, 600715, 581072, 565481, 568053, 556374, 537304, 524064, 506266, 498691, 473079, 450613, 440425, 419075, 409662, 405849, 383168, 364673, 363237, 368786, 349388, 329626, 317652, 313992, 306687, 298732, 277086, 262959, 258391, 254948, 234398, 210046, 194219, 185664, 175850, 171537, 192786, 213080, 229203, 235960, 246983, 268260, 266807, 261323, 259494, 264117, 276333, 287318, 272332, 264003, 249011, 231409, 208925, 190400, 184849]
13060A84849q33m551q437j8487j2236j9427J41R316j0335k1596j7610n310j2933
13047F2551j9027j7271J325L6177O261J2759L1852L3751J8186Q011J1680J3669
13035A99924K6121J8718J9289K0812J3889r593j8977j9512k3315l1334l7026k0248
13023A38748o832K044j735r098n949M698k013o544o174l666k2177k1779j2959
13010D6564M461j0295J05J6964K3202L0923L064K507M538N312J290J4970J8086
12997A61691J5926K5411J0154j0612k4145p761q816l2413m830m472j9724r093
12985I1316L311N885J4134j1701q029M375K772j4321j8392J594J3602q410k6616
12972D9520j5533R423L43R505J2827J5262J3488m662j5438o876P784L848j4255
$$ y = [184849, 184016, 179465, 171028, 152541, 140305, 120878, 121019, 130335, 120000, 98404, 80794, 75484, 62551, 43524, 26253, 27578, 63755, 70016, 82775, 114627, 148378, 166564, 174575, 186255, 199924, 226045, 244763, 264052, 284864, 298753, 289160, 270183, 250671, 227356, 196022, 158996, 138748, 131916, 133960, 132225, 123127, 117178, 121876, 119863, 113319, 107145, 103479, 81302, 59523, 46564, 51025, 40730, 40835, 57799, 81001, 111924, 114988, 117495, 122033, 127345, 128635, 143605, 161691, 177617, 203028, 213182, 202570, 178425, 170664, 161848, 129435, 124605, 120133, 100409, 91316, 94627, 100512, 114646, 102945, 94916, 99291, 102063, 87742, 69350, 70944, 84546, 76136, 49520, 33987, 43410, 43753, 53258, 66085, 81347, 94835, 90173, 74735, 67859, 75643, 79491, 65236]
12959F5236r517J53Q128J238n74l448j796M477k627j3001j4614l39R646n582O742
12944D4122J4092P083k097R705p857r882J568K439N746n775j7058j1174O524J0399
12930D7835K824l21r170k0511r322J7358R011n362m885L399P605J0502R639j0841
12916D7761j2668j4379L978O520m531j2090J3245Q805O232o574j4136K446n365
12903A9244M949K154p554r83K891l04j6822R267L322r090K971k274j408p869O807
12888E301Q387J42Q062o124l263p081R407P37M397q565L83n987q664p011l399
12873a3278P013J2249P926L560J0452K169j2936j1838j22L6L714l226o601q058
12859h940J5813K2983J814l894k0512q150M110p98j047Q998J2856J0106M383O841
$$ y = [65236, 55719, 55872, 64000, 65238, 64664, 61216, 59420, 63897, 61270, 48269, 33655, 33316, 42962, 37380, 44122, 58214, 65297, 63200, 72905, 65048, 55166, 56734, 59173, 64919, 59144, 42086, 30912, 37436, 47835, 50659, 50338, 41168, 20657, 11335, 28693, 37704, 32342, 27457, 30856, 38461, 48963, 58602, 47761, 35093, 20714, 24692, 31212, 26681, 14591, 27836, 36641, 42873, 36299, 22163, 24609, 19244, 24193, 26347, 18793, 17810, 20701, 20397, 3575, 12842, 16164, 7074, 10045, 7771, 6363, -1506, 5301, 13688, 13830, 21892, 15768, 12505, 5424, 14831, 15568, 19965, 11400, 11783, 5796, -2868, -9879, -13278, -6265, 5984, 13910, 17470, 27922, 30091, 17155, 5317, 5195, 5231, 8945, 5719, -882, -8940, 6873, 29856, 31670, 27776, 7264, -886, 3224, 2426, 1379, 10377, 23233, 33339, 37722, 44563]
12845D4563Q867o452j3373j571K608j6167M00J357k520Q413j3693m852M537J1980
12831B4097J5842J2066J468n637l110K686j6330j0551r260m36J3632K6133J3075
12818F3675J462N056J7674K6279K8731K3890J3488J1437J2655j7886l2271j8984
12806A35206j1511j2359l4367j8889Q29k248j47J916l714r295K125K043l758j6073
12792B9758K711N025m454N835J9197P424M980n855L572J2447J4801K7476M2086
12779A65003M3838L9320O9010N6210J4717r22k5938m4458o1624m9498m7782l3160
12767A24716j2557j2780o251l0851j3543j0838K510J1193J3839P367r156m216
12755E9433L868K078R379O486R563q438k0589n291J0588j745J9177J2819K1402
$$ y = [44563, 53430, 46978, 33605, 32034, 34642, 18475, 18875, 20232, 17712, 26125, 12432, 7580, 12117, 24097, 39939, 52005, 53473, 47836, 44726, 47412, 31082, 20531, 11271, 10835, 24467, 50600, 63675, 65137, 70193, 87867, 114146, 142877, 166767, 180255, 191692, 204347, 186461, 154190, 135206, 123695, 111336, 76969, 58080, 58909, 56661, 56514, 58430, 54716, 45421, 47546, 49589, 45831, 29758, 32469, 37494, 33040, 38875, 58072, 65496, 70476, 64621, 68193, 80640, 95441, 122917, 165003, 208841, 248161, 317171, 373381, 388098, 387176, 361238, 316780, 255156, 205658, 157876, 124716, 112159, 99379, 93128, 62277, 48734, 37896, 40406, 51599, 65438, 72805, 63649, 59433, 63301, 65379, 74758, 81244, 90807, 82369, 61780, 56489, 67077, 65332, 84509, 97328, 118730]
12742A18730L8226M4339J8899R134k112j0843j9503m1709l8363k2676j0361j0453
12730G3308j408r454p942m6j4025L50k90n772o457N547N529k131l597m407Q2j5251
12714A4036J815L303m900J7913J6036M855j4124l789p914J0188L923J505r507
12701C3340n402J014n958J883J3012k591m362j6048j6118p566J3720J1267N822
12688B2013N728j1058j4155j42K293j1593L067P177K4963p072j7562J793J519
12675F971K866J0071P922K376J543J9188p252Q576P07k8669m593N449n863R23
12661B0215n021j793L047K0789N538j0752p273J580j1004j3825j2579n375n219
12648b1672R368J0934R874l898j0021j5015o697J2823J5486j951n142N910P082
$$ y = [118730, 156956, 201295, 220194, 229328, 227216, 216373, 196870, 155161, 116798, 94122, 83761, 73308, 71900, 62446, 54504, 54458, 40433, 40783, 40493, 34721, 28264, 33811, 39340, 37209, 33612, 29205, 29287, 14036, 15851, 19154, 14254, 32167, 48203, 53058, 38934, 35145, 27231, 37419, 41342, 42847, 33340, 27938, 28952, 22994, 24877, 37889, 35298, 30936, 14888, -1230, -8796, 4924, 16191, 22013, 27741, 16683, 2528, 2386, 4679, -6914, -3847, 3330, 28293, 21221, 3659, 5452, 6971, 9837, 19908, 27830, 30206, 31749, 50937, 43685, 52261, 52968, 24299, 19706, 25155, 19292, 20215, 15194, 13401, 16448, 37237, 42775, 32023, 24750, 26330, 15326, 1501, -11078, -16453, -21672, -12304, -1370, 8504, 4606, -5415, -20430, -27127, -14304, 1182, -769, -5911, -1, 7081]
12635G081N369j0596P80m43k434M78n0r63p987j2852j3549Q673J7427J2116l117
12620f7l835Q09R748J306j3444P76J1444J2632K779j5511j191o065P135L456p429
12605B543q111m177P56N751O526k795k561l187J365J1059j442m85N666r979j6239
12590a5310P140J5074k759P382j0971K859N708J2868M692j7358o964j0179K243
12577e575K879J1427Q207q131n152R129O07l2308j2705K1967J6060M166p088O075
12563I558j2730j1597J666J0338p804L82q414O101o1J41J9392j310p368n712J4280
12548F862J8306Q515p440r811p906L785o454K874j2784r94J0233o780L989N543
12534G938j0459j25K257j446j2831J278K6893J7450m167k5552j9696J0134K765
$$ y = [7081, 12450, 1854, 2634, 2191, -243, 235, 185, -778, -8765, -21617, -35166, -26493, -9066, 3050, -67, -3902, -3093, 6655, 7961, -5483, -4707, 6737, 19369, 22148, 6637, 5446, -619, 6516, 9972, 2543, -5568, -9745, -8989, -3238, 3288, 493, -2068, -5255, -3890, 7169, 5727, 5242, 10908, 929, -15310, -8170, 6904, 4145, 11527, 556, 3415, 9123, 21991, 26683, 9325, 2361, -7818, -5575, -2696, 8731, 16938, 8807, 3655, 12784, 13391, -18917, -31622, -9655, 6405, 10571, 3483, 9558, -3172, -14769, -13103, -2765, -10569, -10187, -18601, -12500, -12561, -12420, 6972, 5662, -1706, -7418, 6862, 25168, 33683, 26243, 16432, 8526, 12311, 5857, 8731, -4053, -5047, 5186, -1594, 2395, 7938, -2521, -2646, -389, -1835, -14666, -13388, 13505, 30955, 26788, 1236, -18460, -8326, -5561]
12521e561R508q26K603J1712R567j3693j4868o015r842j994J7179L939J5738O382
12507B3829j1550J071M541L689m196q46K617j1027j1177P544p159J293k769n376
12493i516n39k204J393J2260J9347k39j1337n246J4488m407J2546J4436p655j327
12479C2000r494j9398r144m204k889P458M958J5359R134k763j1586r511o782O35
12465f227J2348r405J901R703l324J141Q25k392O494L093m048p664j791j264J322
12450G12j406L548J4545J5523j5546k2539o225N524J0873L639K376N612Q089Q982
12436C3707n057j3115k747J269M381l08j368k884L264J1654p953j0303L152J639
12422A5331J3932O255o349r243L210j0077J4308O345l524J547j2218k542q60L900
$$ y = [-5561, 3947, 3121, 5724, 17436, 27003, 13310, -1558, -7573, -17415, -19409, -2230, 1709, 17447, 23829, 12279, 13350, 17891, 21580, 17384, 16538, 19155, 8128, -3049, 4495, -2664, -1371, -4140, -9516, -10055, -12259, -10866, 1394, 20741, 20502, 9165, 3919, 18407, 14000, 26546, 40982, 33327, 32000, 22506, 3108, -6036, -10240, -13129, -5671, -713, 14646, 23780, 21017, 9431, -80, -6862, -6227, 6121, -3284, -1383, 8320, 4996, 6137, 6962, 4570, 11064, 14157, 10109, 2445, 654, -610, 712, -694, 2854, 17399, 32922, 17376, -5163, -11388, -5864, 5009, 8648, 11024, 16636, 24725, 33707, 28650, 15535, 12788, 14057, 18438, 18130, 16762, 13878, 17142, 28796, 20843, 10540, 13692, 15331, 29263, 35518, 29169, 19926, 23136, 13059, 27367, 33712, 30188, 31735, 19517, 16975, 16115, 20015]
12408B0015j1504j314J0802k791j0262j8534L904J1197N712p537q290j756L149
12395g209Q948K401r807m741k715N503q06j233L154N465K619P941J695j827K405
12380A1793k725k80m441N130r482m977R614P425j2075q65J4729n116m085j2750
12366h105m244l062J2263k866P778J541O361k997P858k94j4200j95O293J0492
12352A6623J372j1342j514p998J532J9449r416r257K020P508m744N773Q722j5656
12338C072l073K31M335L373m383j9749K289N416j720m615n548M54J1485J8814
12324A0381L477j6053p259Q155K439q353n223n815J38k736P41L129k950J8966
12310i63J1117R100m181o019M088r693q938L71r537O16J368K632O8p023j5163
$$ y = [20015, 8511, 7197, 17999, 15208, 4946, -13588, -9684, 1513, 7225, -312, -8602, -10358, -7209, 1739, 4140, -5667, -10408, -13123, -7620, -8426, -9659, -6505, -1040, 1579, 9520, 11215, 9388, 11793, 9068, 8788, 4347, 9477, -5, -4982, 4632, 12057, -18, -883, 13846, 8730, 4645, -8105, -12349, -15411, -3148, -6014, 1764, 3305, 9666, 6669, 14527, 14233, 33, -162, 6131, 16623, 17995, 6653, 5139, -2859, -1327, 18122, 8706, -551, 1469, 8977, 4233, 10006, 18728, 3072, -1, 230, 4565, 7938, 3555, -16194, -13905, -8489, -10209, -14824, -20372, -19918, -8433, 10381, 13858, -2195, -9454, -1299, 1140, -7213, -12436, -18251, -18113, -20849, -20108, -16979, -19929, -963, 10154, 19254, 15073, 9054, 13142, 3449, -5489, -5118, -14655, -14039, -12671, -10039, -9971, -16994, -32157]
12295c2157M002R708O565L84O897N834J400K2537K5229K0195m425o925r36r061
12281D9247k877Q517J3444j4549j3552n58J4219J3538j7274o034k902j0869K69
12268C0619L215l936p295j1851O603j2077m876p274J7078J6543l771j7970J657
12255F665J1983l84m275k0834m733Q859p069J175P846J0840J6129K0728K749k346
12241D7333r208n043L813O613J0486m51n657j2743R773q666N15M994n446j5136
12227B1177r194J3056p536o651J1347O21j8939j8353R551p54j913r934N641l370
12213a5251j0440J218J7359P204j06J355o520p781L451R32J1408l936n300l175
12199i582q8q391K461M343L033k807j407M132O876J0538k597m124j90J2609J4342
$$ y = [-32157, -28155, -18447, -11882, -11498, -4601, 1233, 2633, 25170, 50399, 70594, 66169, 59244, 58308, 49247, 46370, 54887, 68331, 53782, 40230, 39672, 53891, 67429, 50155, 44121, 41219, 30350, 30619, 33834, 29898, 22603, 10752, 17355, 5278, 402, -6872, 10206, 26749, 22978, 5008, 6665, 18648, 18264, 13989, -6845, -11578, -2719, -9788, -8613, -767, 10073, 26202, 46930, 49679, 47333, 38125, 33082, 36895, 43508, 53994, 53543, 47886, 35143, 44916, 36250, 36765, 41759, 36313, 21177, 11983, 25039, 17503, 10852, 22199, 22820, 3881, -14472, -4921, -5675, -7588, -17522, -11881, -15251, -25691, -24473, -7114, 90, -16, 1339, -5181, -12962, -9511, -8579, 2829, -1107, -6407, -9582, -9670, -18061, -15600, -11257, -8224, -11031, -12438, -8306, -1430, 9108, 6511, 2387, 2197, 14806, 29148]
12184B9148j028J100o556k152o992L64N232j3829l454Q72o636K685J3290k897
12170I147J608J3903K110j0207J287O782p323O823J283K235N559j0950m803J466
12156A8920j3775J0781R518J2427J6676O698k0505j3753j1649n911Q649J6036
12144C4112J4544n086j8186j3934k830m539n242j0081J2045J3411j4483N849N41
12131F121j5772m384R909P907O211r574r985n222K209q453N498k744O071n544
12117a7752p779L785J2706P967L533J3288j0820k226q300J4J0316n549j8320j067
12103b0204j53O467O538K365k165N309N51K54l176J2399m028o701j0664o396O81
12088a8923J656M072P654J2506N48n072p185m498m799r63P503J144j5127l622
$$ y = [29148, 28120, 29220, 22664, 20512, 13520, 13884, 19116, 5287, 1833, 2705, -3931, -1246, 12044, 9147, 10755, 24658, 26768, 16561, 17848, 24630, 17307, 24130, 25413, 27648, 33207, 22257, 17454, 18920, 5145, 15926, 25444, 37871, 54547, 61245, 40740, 26987, 15338, 9427, 18076, 34112, 48656, 43570, 25384, 11450, 8620, 4081, -1161, -11242, 803, 14214, -269, 5580, 6121, -9651, -14035, -4126, 3781, 9992, 418, -9567, -14789, -12580, -21033, -15535, -18279, -12208, -17752, -25531, -21746, -9040, -1073, 2460, 15748, 4928, 2702, -5598, -5584, 4732, -817, -19137, -20204, -20357, -13890, -7352, -4987, -7152, -1843, -1292, -1038, -4214, 8185, 4157, -2544, -13208, -19604, -18923, -17267, -13195, -5541, 6965, 7513, 2441, -4744, -9242, -14041, -15004, -7501, -6357, -21484, -25106]
12074b5106K0687J6496Q327j7455K822L410k244j6446j3800K3960K352O977M327
12061A4307n325l100K855K14j7412K055J5750N135p595r413l548k263l910J8976
12047F726N316j2079j1153L641j011N653O070j097k62K526p325l352m893r433
12033b0673Q466j573L705R161J800p964j331J287l41J2764Q119M10j9816O450
12019D64O823L062J131O514j3062q659P56Q276L026j2885j802n97n209j763j40
12004a4065O90N566J1345R758o85k9611m673o218P73q059m20J681m798J4909J549
11989b2258L235m427r855J8629J1367J4273O518K651O014m676j2722j2456j825
11976e532J1720j981j5784L647K702L337K999L124j1278J226J6057M447N888o472
$$ y = [-25106, -4419, 12077, 20404, 2949, 5771, 9181, 6937, -9509, -23309, 651, 3003, 9980, 14307, 8982, 5882, 8737, 8951, -8461, -6406, 9344, 14479, 6884, -2529, -6077, -8340, -12250, 6726, 12042, -37, -11190, -7549, -8560, -2907, 3163, 2066, 1804, 4330, -2995, -6347, -11240, -20673, -12207, -13780, -10075, -914, 886, -7078, -8409, -7122, -7463, 5301, 13420, 13830, -5986, 464, 7287, 10349, 11480, 17994, 4932, -3727, -2971, 5305, 8331, -4554, -6356, -6953, -12162, -13925, -14065, -13375, -7809, 3536, 13294, 12609, -17002, -21675, -27893, -27120, -35179, -35599, -33918, -38716, -23807, -22258, -19023, -23450, -33305, -14676, -3309, 10964, 17482, 20133, 26147, 21471, 8749, -3707, -5532, 6188, 4207, -11577, -7930, -5228, -1891, 1108, 4232, -7046, -5820, 10237, 14684, 20572, 14100]
11962A4100J015j0820p166M995N176j0890N324P687M979l282R626m346j9282j0150
11948a3034j6675j6636R589L917K312N144o509J2831L879J1816R366N38N011p98
11934A0751j1434o754m454J2717O154k705r069n645J0238K853R735L283K465j3874
11920D261r906o174N321Q656k261j0342j315j1494R232L490p166k1546R312J5437
11906a4495Q621j1345M998R643N109L381r587k980P362l724k162O49o712l529
11892a4771M144J7634j79j3429l187r418r260Q033Q203N095l671J1433P671J493
11878I791j928q65j0344l979M485N219J689m680K101n973l892N751L580J333j0633
11863h345q544Q223N965n534K264R844J8737J042j8916j7542J672l259K125M004
$$ y = [14100, 15115, 4295, -2871, 2124, 7300, -3590, 1734, 9421, 14400, 11118, 20744, 16398, -2884, -13034, -29709, -46345, -36756, -32839, -30527, -25383, -31892, -19061, -15182, -3366, 6000, 6538, 11549, 10751, -683, -7437, -11891, 826, 6980, 4275, -4794, -10439, -201, 2652, 12387, 15670, 18135, 4261, -5645, -11819, -6498, 2158, -103, -10445, -11760, -23254, -14022, -10532, -17698, -39244, -29932, -14495, -5874, -17219, -12221, -2578, 2531, 5912, -3675, -6655, 707, -3017, -5179, -4530, -11242, -14771, -10627, 7007, 6828, -6601, -9788, -19206, -28466, -20433, -12230, -7135, -10806, 627, 8298, 9791, 7863, 6998, -3346, -7325, -2840, 2379, 4068, -612, 1489, -4484, -8376, -2625, 955, 2288, -8345, -16889, -8666, -2701, -8235, -5971, 3873, 22610, 23652, 4736, -12806, -11134, -14393, -12268, -8264]
11849h264j37n619j1692K716l735R064j1049N657J5558K74o551M865l791j646
11835a4350K083L642p893M239r109P214M914j531m846O441J082J0094o725n931
11821a0676k964Q94j0555M100J9573R825K25j9149j4633L058r563M285J7922K861
11807d797Q500M214j6925j5155l798O107j869J5613K3438q218o923J11J8064r310
11793I052k4657r287J5591J3662O461J20J200o105j3981J1067L012m032m281l289
11779e467R206M908o993p718K642N102N916R57j2774j8738R393K0916j855o513
11765a018k960P45l851L331l12q67O591j1889j00K736J2420l20K511L970N673
11750A6660J960L815L724j393m763J1082k951o640j4180j3753O096K013k081r352
$$ y = [-8264, -8401, -14020, -25712, -22996, -26731, -17667, -28716, -23059, -7501, -7227, -13778, -8913, -12704, -14350, -12267, -8625, -16518, -12279, -21388, -14174, -9260, -10791, -15637, -9196, -8114, 1980, -4745, -10676, -13640, -12746, -23301, -19201, 372, 10197, 10422, -8727, -23360, -20302, -29865, -25580, -7658, -4797, 3703, 7917, -9008, -24163, -27961, -21854, -23723, -8110, 15328, 7110, 187, 298, 18362, 9052, -15605, -24892, -9301, 4361, 10822, 10942, 12142, 6037, -7944, 3123, 6135, 2103, -2178, -5467, 3739, 8647, 1654, -6064, -3422, 1680, 7596, 8553, -4221, -22959, -13566, 7350, 5495, -1018, -3978, -3233, -7084, -3753, -4065, -4932, 1659, -10230, -10330, -7594, 4826, 4506, 7017, 10987, 16660, 18620, 22435, 26159, 24766, 20003, 31085, 28134, 21494, 7314, -6439, -343, 1670, -411, -9763]
11736i763k828P304L370M237N837L053K975r734J776M388J0202K287p127j3523
11722B454n200J2887J0857o152k732R247r748q130K414l654o373K344M039k723
11708d70r698J9898J4569j7575p178J8551n990p355J0066k959j9948p973Q411
11695g651R569J1797j721O916N513j2250q587K337J446q723m162m537L781K0355
11681A4083N662p239j0433K439k213r883N402R30n780R766Q467J847Q150Q049
11667B9247j6235j5428k436M637Q169M652J5341P853j0480l258K15j0031o273
11654E973m589o455n197j8n085K038J2489M404j5865p600J0310K387Q214K70M597
11639E873j363J2667J7916n305p700j3530K447n117j467o098j838p711j499j2240
$$ y = [-9763, -12591, -5287, -1917, 2320, 8157, 11210, 14185, 4451, 6227, 10615, 20817, 23104, 15977, 2454, -2746, 10141, 20998, 14846, 12114, 21361, 11613, 3483, 5897, 2243, -4130, -1786, 2253, -470, -10168, 9730, 24299, 6724, -454, 18097, 12107, 4752, 14818, 11859, -8089, -16062, -7651, 1918, 13715, 11994, 18910, 24423, 12173, 3586, 5923, 7369, -1354, -5516, -10053, -6272, 14083, 19745, 12506, 2073, 4512, 2299, -7584, -2182, -1252, -7032, 2734, 11201, 13048, 21198, 29247, 13012, -2416, -4852, -215, 7954, 12606, 27947, 35800, 25320, 22062, 22277, 12246, 5973, 1384, -5071, -10268, -10286, -15371, -13333, -844, 3560, -12305, -19905, -9595, -7208, 1006, 1276, 5873, 4510, 17177, 35093, 29788, 22088, 8558, 11005, 5888, 4421, -1677, -3515, -11226, -12725, -24965]
11625b4965q52J5441k146j766M334J4403j3712k027J0360O242j8640j1792J9570
11612e550O434R319j981q986k459j802n144M572L752r202j2653O089J6733R790
11598H912p774o667J4000J1797j5251j3847J9499O675j8872O470o849q856r782
11585b0545m462l043J0338J744J8038R436p534N796L666l962J0228N677j4106
11572A1271k487O828N357p225n717j2080k762J424L499N414O481r504q36L674
11558C337j2545q559R079Q931j676q037j767M464O234o443M223k290J3745Q765
11544A7461N563l820q240J1650l026o779l374K601j1066q36P459j0345j427O824
11530B645Q596L279N586p107n761n82ol101j877j1017J9K3295j460o614q83o244
$$ y = [-24965, -25817, -10376, -12522, -14288, -9954, 4449, -9263, -11290, -930, 5312, -13328, -25120, -5550, 884, 10203, 8222, -764, -3223, -5025, -10169, -5597, -1845, -11047, -23700, -17611, -878, 8912, 1138, -5529, 8471, 20268, 5017, -8830, 10669, 17344, -1528, 4942, -1907, -10763, -20545, -25007, -28050, -17712, -15968, 2070, 11506, 3972, 9768, 13434, 9472, 19700, 25377, 11271, 8784, 15612, 20969, 13744, 8027, -4053, -6815, -5391, -1892, 3522, 10003, 499, -337, 3337, -9208, -17767, -8688, 243, -1433, -9470, -11237, -6773, -539, -6982, -2759, -5049, 8696, 17461, 23024, 19204, 10964, 22614, 19588, 12809, 9435, 12036, 970, 134, 7593, -2752, -4179, 2645, 11241, 14520, 20106, 12999, 7238, 6656, 6650, 3549, 1672, -9345, -9326, 13969, 12509, 5895, 5012, -1232]
11514a232J299j3826q809Q395J780K2262J488j1257J417R821N147q27M058K3666
11500D3382K4838Q835R753L5197K7572J2289O716K5678O568P13k4493l2157l0667
11487A14224k4109j0729o529j5651j3493p320R418J6869j0171o326O020P909J2740
11474G2852L154j4929q279K64j603o700J447J8002J4890n28R801J6934M1325N9052
11460B05682N9017N2273M6178L9233K0707n283m0268n7171n0560n6031m1737l2006
11448A40034j9278j7214k017p358r362j950J68j1822O744j0212l445j1449J069
11435E3908P477m658k88m460J424n038L725J5428J0841J4306K3533L8149M3299
11422A97646K8949O445P507j5862l4433l9825l5652k5199j8024p139r668p424
$$ y = [-1232, 67, -13759, -22568, -14173, -12393, 9869, 11357, 100, 1517, 11338, 16485, 15658, 19716, 43382, 68220, 77055, 86808, 122005, 149577, 161866, 168582, 194260, 200828, 201541, 177048, 144891, 114224, 90115, 79386, 72857, 57206, 43713, 36393, 45811, 62680, 52509, 46183, 52203, 60112, 72852, 76006, 61077, 52798, 53062, 51459, 44759, 46206, 64208, 79098, 78570, 88371, 105305, 146630, 205682, 264699, 316972, 363150, 402383, 423090, 417807, 377539, 320368, 269808, 213777, 172040, 140034, 120756, 103542, 101525, 94167, 84805, 82855, 83023, 71201, 77945, 67733, 64288, 52839, 53908, 61385, 56727, 56439, 51979, 53403, 48365, 52090, 67518, 78359, 92665, 116198, 154347, 197646, 226595, 233040, 240547, 224685, 190252, 150427, 114775, 89576, 71552, 64413, 54745, 47321]
11410D7321N774K303R278q167o368j2942k1760j1006k6l396P601Q133J4207N562
11396C6514j759k323Q596j2185p199J011j2073M944J0907l6o239k1736n488N808
11382a258m078j1554Q769N122j3282q840K0663J7888l654p263L162R44q417p822
11368i620p502J1359M980p43P603J2837N773q099m499m882J87r914N177M653j297
11353F013J223L798k437j806M755J0537n948j766J7459K086P640J3852j2935j0170
11339C2301K619R332O202k795m449Q328r046L195M982n431q809r122j4476j260
11325A1571J1533k610p79q192K531P108r814r435R353L252r71j42O481J4736n630
11310B8992K884J0375j679j377L651q105j3003m242K139k162L492m029k450Q096
$$ y = [47321, 53095, 55398, 64676, 56509, 50141, 37199, 15439, 4433, 4407, 1011, 8612, 16745, 30952, 36514, 34755, 32432, 41028, 28843, 21644, 22655, 10582, 15526, 26433, 26397, 20158, -1578, -7066, -1258, -5336, -16890, -8121, -2999, -16281, -25121, -4458, 13430, 9776, 2513, 5675, 6619, -1798, -9620, -17122, -5763, -783, -1526, 6077, 18914, 24687, 16588, 12089, 7207, 7394, -2520, 2657, 7310, 6013, 7236, 11034, 8597, 6791, 11546, 22083, 16135, 14369, 31828, 33914, 41554, 55406, 42471, 32301, 34920, 44252, 50454, 47659, 43210, 51538, 42492, 45687, 50669, 45238, 36429, 27307, 12831, 11571, 23104, 20494, 19715, 11523, 14054, 21162, 11348, 1913, 11266, 14518, 13547, 13405, 19886, 34622, 28992, 31876, 42251, 40572, 39195, 42846, 34741, 21738, 17496, 19635, 17473, 20965, 16936, 14486, 22582]
11296B2582J2009J1301K105k187K788m466j4337m260M472P97J0608k430q783K929
11282C3128L686o644j457j036M347L332M207O032Q64l626j3620J19P569J2429
11268D9330J3181K5768J0080J2101p533q228J0399k890l251j8256j3545O400J1901
11255H5457o800q600k638j7347Q28q677j7553j918J01J1240K0060o650m397q633
11241C4473j1791q675O291P955J1096n991O946K8401K3439K8640J9415J0873P495
11228A58567m631n81j7575j2158M606q409o074o1j1226j2268L923J0459o52j9024
11214H4896j9654K765J4213J811K726j97n9L398J4970J0220K456m612l997R468
11200A18404j3783j2496N466J7160J2331J2791M606p256R507J7632l12N503p00
$$ y = [22582, 34591, 45892, 47997, 45810, 48598, 44132, 29795, 25535, 30007, 30804, 41412, 38982, 30199, 33128, 36814, 30170, 28713, 27677, 32024, 35356, 39563, 45595, 46459, 42833, 29213, 29332, 36901, 49330, 62511, 88279, 98359, 110460, 102927, 94699, 105098, 102208, 98957, 80701, 67156, 73556, 85457, 78657, 70057, 67419, 50072, 50900, 42223, 24670, 22752, 22853, 34093, 54153, 47503, 43106, 34473, 22682, 14007, 20298, 28253, 39349, 33358, 40304, 68705, 92144, 120784, 140199, 151072, 158567, 153936, 153355, 135780, 123622, 128228, 119819, 113745, 113684, 102458, 90190, 94113, 104572, 103920, 84896, 65242, 68007, 82220, 84031, 86757, 86560, 86501, 89899, 104869, 115089, 117545, 112933, 108936, 118404, 104621, 92125, 97591, 114751, 127082, 139873, 144479, 137223, 146730, 164362, 164050, 169553, 168853]
11187A68853l630K211J0841j057J962M3275N2147L5594J821n996j4902m2879m3431
11174B04809j1289P46l324R082P215J0868J1593R163j3382j2423l147o344o285
11161A97282O96j627n492p334O345J05P68J7127j1382m383Q659L506M783J926
11147B10979m362r359j442J3827K1723N270m443o20m32j536j357P083J5216J7990
11133B68537J7725j87Q756K1676o297j584j8p49o889J008J0069K4719J2292k082
11119C46976J1814J0008J2852J8403K4807p378p296J2976L0350K5590K6458L8540
11107E44100K2778K7246L2104L1303L6822L7074O4815Q6701J02825J04633J44652
11096A235053J65399J72580J84582J82005J98603K45260K84791L07992L89789
$$ y = [168853, 165223, 167434, 178275, 177218, 179180, 222455, 274602, 310196, 312017, 306021, 291119, 248240, 204809, 193520, 194266, 190942, 200024, 207239, 218107, 229700, 238863, 225481, 213058, 209911, 203567, 197282, 197978, 196351, 190859, 183525, 189870, 189975, 190743, 207870, 196488, 192105, 200764, 204270, 209053, 210979, 206617, 197258, 195816, 209643, 231366, 236636, 232193, 231573, 231141, 229605, 228248, 235331, 250547, 268537, 286262, 286075, 294831, 316507, 310210, 308626, 308608, 307859, 300970, 301978, 312047, 336766, 349058, 346976, 358790, 368798, 381650, 400053, 424860, 417482, 410186, 423162, 453512, 479102, 505560, 544100, 566878, 594124, 626228, 657531, 694353, 731427, 796242, 882943, 985768, 1090401, 1235053, 1400452, 1573032, 1757614, 1939619, 2138222, 2383482, 2668273, 2976265, 3366054]
11087C366054M90706O60131R23388J345021J961176K859780L985757N119441N801294
11078B6512748N555640M239727K069459m80258k932255m754285n506432n165031
11070A9539313m108259k922292j920170j192545o88603l62747j83635q4242l5969
11061H040851l5675o1625o9276l4237o214O4767J35840J94840L19501M66793O94998
11050I710563J020010J530771K312756L518933N262353P458235R716101J1143803
11042E1673525J0823486Q394001M235592p60100n621641r320602j0990240j0444651
11034C7989370q449824o104607m093839k638969j659674j029140o45017m18642
11026A2949658l35988l41220m00007m25487m22982l96580l07852k44107j82824
$$ y = [3366054, 3856760, 4516891, 5440279, 6785300, 8746476, 11606256, 15592013, 20711454, 26512748, 32068388, 36308115, 38377574, 37897316, 34965061, 30210776, 24704344, 19539313, 15431054, 12508762, 10588592, 9396047, 8707444, 8344697, 8161062, 8076820, 8040851, 8005176, 7943551, 7874275, 7840038, 7833824, 7898591, 8034431, 8229271, 8548772, 9015565, 9710563, 10730573, 12261344, 14574100, 18093033, 23355386, 30813621, 40529722, 51673525, 62497011, 70891012, 75126604, 74366504, 68744863, 59424261, 48434021, 37989370, 29539546, 23434939, 19341100, 16702131, 15042457, 14013317, 13368300, 12949658, 12613670, 12272450, 11872443, 11446956, 11023974, 10627394, 10319542, 10075435, 9892611]
11017I892611j36008p8777K7927K04940M66693Q54170J417830K230026L247390
11008A8126802M317870N054982N050501M028679K157215k02505k549026m410167
11000C1574351n347783n214654m318540l204311k182996j441361r78606o44233
10992H241867m34379l20455k70651k72687l07766l63938l89303l70088l53668
10983E158932l20015k82839k54273k08282j87770j67099j74588j59742j50298
10974C254026j19933j18139j00272r9681j01114p7698q7078r2968j06530p9871
10964B270742p5553q9507q1176o6672o5348o8550o0418m3475k3611k9087l9422
10953A627923l3230l4027l7498m4505n4676n0985n4132o3259m2592l5750m3157
$$ y = [9892611, 9756603, 9677826, 9705753, 9910693, 10377386, 11231556, 12649386, 14879412, 18126802, 22444672, 27499654, 32550155, 36578834, 38736049, 38533544, 35984518, 31574351, 26226568, 21011914, 16693374, 13489063, 11306067, 9864706, 8886100, 8241867, 7807488, 7487033, 7216382, 6943695, 6635929, 6271991, 5882688, 5512600, 5158932, 4838917, 4556078, 4301805, 4093523, 3905753, 3738654, 3564066, 3404324, 3254026, 3134093, 3015954, 2915682, 2816001, 2714887, 2637189, 2550111, 2457143, 2350613, 2270742, 2195189, 2105682, 2024506, 1957834, 1892486, 1823936, 1763518, 1720043, 1696432, 1667345, 1627923, 1594693, 1560666, 1523168, 1478663, 1423987, 1373002, 1318870, 1255611, 1213019, 1177269, 1134112]
10942A134112l9911l1694r341j3950l0243k3324l2999k9344k5321k7507m5084
10931H25394k3583j9334l3444j6636n657j6210l0019j7398o406q515m204j3820
10919F30168O212M1475L1548J4764p637k7603m9004n3975l5960l6793m2649k6747
10907D43799l488j0936m361j0526k3047j6148o25L525j6319j9514k354M991j3758
10894C31239k8752o253k5248j9852k0848k0911k0729j5153O855K5000K0018K9695
10882B55061L1023J5182J8337J3978q163k5920j6054j8008j6970j5505m546M666
10870B33081Q32j4477k942q108k4820M247l26k3247j3987Q59o002o01r801j463
10856A33245j0145m527j5498j9498K042q294K482P840Q699Q469K1352K6157J4008
$$ y = [1134112, 1094201, 1062507, 1053166, 1039216, 1008973, 985649, 952650, 923306, 897985, 870478, 825394, 801811, 782477, 749033, 732397, 726740, 710530, 680511, 663113, 656707, 648192, 643988, 630168, 636380, 677855, 709403, 724167, 716530, 688927, 639923, 585948, 549988, 513195, 470546, 443799, 440311, 429375, 425014, 414488, 391441, 375293, 374668, 378193, 361874, 342360, 340006, 344997, 331239, 302487, 296234, 270986, 251134, 230286, 209375, 188646, 173493, 180348, 205348, 225366, 255061, 286084, 301266, 319603, 333581, 325418, 299498, 283444, 265436, 248466, 232961, 228415, 233081, 233913, 219436, 216494, 208386, 183566, 187813, 187487, 164240, 150253, 151112, 145110, 144509, 134708, 133245, 123100, 118573, 103075, 83577, 85619, 77325, 79807, 87647, 96346, 104815, 126167, 152324, 166332]
10843A66332j166k964Q915j3932r03M486p355l202n109Q898M392k256M306n939
10829A54503j195P274J821j8440j9881n628m802j6853j1293j8856l867j3580n177
10816D4026J524j160n86R295M613Q704J1187L597J3809J4793j347r827j9415J3668
10802I2881J4174m941j155J8065K0517J2426m08j1299o994j0188j1267J3322K0030
10789A45163J7787L451j2605N483P926j725P725k291J933j1230l308j5324j337
10776A41648J3891R260k278N433o504K194R950K8869K0552J1322K279P606K6041
10763B70263O2530N1206N6251J01113J77304K41242K52636K84629L10029K74661
10753B081864J80071N9778p7839j78107k57847k95331k68551k54577j93394j41317
$$ y = [166332, 165166, 162202, 171117, 157185, 156282, 160768, 153413, 150211, 145102, 154000, 158392, 156136, 160442, 154503, 153308, 160582, 162403, 143963, 124082, 118454, 113652, 96799, 85506, 66650, 62783, 49203, 44026, 45550, 44390, 43804, 53099, 57712, 66416, 77603, 81200, 95009, 109802, 108455, 98628, 79213, 92881, 107055, 102114, 100959, 119024, 139541, 151967, 151559, 140260, 133266, 123078, 111811, 125133, 145163, 162950, 166401, 153796, 159279, 167205, 165480, 173205, 170914, 172847, 161617, 158309, 142985, 141648, 155539, 164799, 162521, 167954, 161450, 163644, 173594, 202463, 223015, 234337, 236616, 244222, 270263, 332793, 383999, 440250, 541363, 718667, 959909, 1212545, 1497174, 1807203, 2081864, 2261935, 2321713, 2243874, 2065767, 1807920, 1512589, 1244038, 989461, 796067, 654750]
10743F54750r1148n3089l7463k2142j7225k8668k0612j7485k1625j8152j7617
10732C09524j2561j8702l0866p331j0608m071j089k823r402n338o888j6238n885
10719A77722M826R205o804j0127K216j0008o995j6042m672K581k439J914j8978
10706A22399k0567Q094j297j1932j0930o855l82N308O309l943J0486K2218n26
10693A18382o617K213j866R87j6621j0250n32O37j0764J6918R627k2925j8833
10680F0356O368j766j7363n912m212P449K449j0867J8740J5803M294R49J9756
10667I6044Q860j4168p139J764J6591Q125J776K5104L1725K5709K4111K434J5018
10654B35954J8631J2505j9123k8916l4043k8125k1971j5047j3634j4861M466N696
$$ y = [654750, 563602, 510513, 473050, 450908, 433683, 405015, 384403, 366918, 345293, 327141, 309524, 296963, 278261, 247395, 240064, 229456, 225385, 224296, 221473, 212071, 206733, 199845, 183607, 177722, 182548, 191753, 184949, 174822, 177038, 167030, 160035, 143993, 139321, 141902, 139463, 141377, 122399, 101832, 109926, 108629, 96697, 85767, 78912, 78530, 83838, 90147, 86204, 96690, 118908, 118382, 111765, 113978, 112112, 113099, 96478, 86228, 85696, 86333, 75569, 92487, 102114, 79189, 60356, 66724, 64958, 47595, 41683, 37471, 44920, 47369, 36502, 55242, 71045, 75339, 76288, 96044, 104904, 90736, 83597, 85361, 101952, 110077, 111853, 136957, 168682, 194391, 218502, 220936, 235954, 254585, 267090, 247967, 219051, 185008, 156883, 134912, 119865, 106231, 91370, 95836, 101532]
10642A01532N626K843O531J3970m663N710Q700j9729j0636r6j0344J921L623O431
10628A11419J6755M115j1275L628L5696L9175L6352O4362O8800O6640K9411L2528
10616D97606n57l4175m3390n4218o6118m2610k8109k1915j3163m998k061Q305
10604A94597m761k5923j4225j2451J1449Q369J8060K3754J3012J9526K5813K3356
10592B80576L4496M0012M1249K4047m472m846J7739n88j7055j6922j1205N017
10580C88048n750l0866m1369k3879j9153j8977k7189k2246k2102M718J5163J0825
10568B07223L685M970l705j4468m791k1036r972p182k0704k0126j1061K0270J1974
10555A35077J4402o597k8792L1M993l471q779j2309j8266k7859L553L765j3659
$$ y = [101532, 107158, 110001, 116532, 130502, 125839, 131549, 140249, 120520, 109884, 109788, 99444, 101365, 104988, 111419, 128174, 132289, 121014, 124642, 160338, 199513, 235865, 300227, 369027, 435667, 465078, 497606, 497049, 462874, 419484, 365266, 299148, 256538, 228429, 206514, 193351, 188353, 186292, 194597, 189836, 163913, 149688, 137237, 148686, 157055, 175115, 198869, 211881, 231407, 257220, 280576, 315072, 355084, 396333, 420380, 415908, 411062, 428801, 428213, 411158, 394236, 383031, 388048, 382298, 351432, 310063, 286184, 267031, 248054, 220865, 198619, 176517, 181235, 196398, 207223, 210908, 215878, 212173, 197705, 192914, 171878, 161906, 154724, 134020, 113894, 102833, 123103, 135077, 149479, 142882, 114090, 114121, 119114, 115643, 106864, 94555, 76289, 48430, 51983, 55748, 42089]
10542D2089j0506L809M380J72J4580J9109o480k4615p904P071J6129K5899O1738
10529A45471Q0604J08024J36295J88499J75331J00681M1776j4067q2766j20038
10519G59810j01981p1897m5119l1863l3728l3660l3450k9555j1359j1566r311
10508C46321k8372j4732j0639j9042L80J6923j021N358m246j0063j8906j6913
10496B45048j0269j3823n685q887l502J2069J2713r669o408J0551J8759K249Q941
10483B52087p305M912M422J5830K9141J5002K0175M510k518k011Q865l276m658
10470C35176l22m002J1573L1259P7376J25890J45600J22616P9352R717l4875n8675
10458H40685o0949j04418r4196q7534m9578r69K922J2145K0250M2740O5294N5901
$$ y = [42089, 31583, 35392, 39772, 39944, 54524, 73633, 67153, 42538, 34634, 41705, 57834, 83733, 145471, 226075, 334099, 470394, 658893, 834224, 934905, 976681, 962614, 879848, 759810, 657829, 585932, 540813, 508950, 475222, 441562, 408112, 378557, 367198, 355632, 346321, 317949, 303217, 292578, 273536, 273916, 290839, 289818, 295176, 290930, 280867, 261961, 245048, 234779, 220956, 215271, 206384, 202882, 214951, 227664, 217995, 211587, 222138, 240897, 243146, 252087, 244782, 249694, 254116, 269946, 299087, 314089, 334264, 338774, 336256, 334245, 343110, 339834, 335176, 334854, 330852, 342425, 373684, 451060, 576950, 722550, 845166, 924518, 934235, 899360, 840685, 779736, 675318, 581122, 493588, 444010, 443041, 445963, 458108, 478358, 521098, 586392, 642293]
10446F42293L8845J2822J4374P120J1961R062j054Q786J2954m167j0909k0799
10434G21288j601N240R835R68j2412m964n635K4719K0018J063Q293J7939J3593
10421G98344K7778J2014O444N247o924J0227K1865J6775K0587J9835J9980p405
10409I44767r679k7632k6798j3235q43q56P491J5492L3195M1207L7587L7015J6000
10396A053711R859K975K8240N5602N5422N5848N4803M4748L8373M5485M0804O7294
10384A553164Q3424R6777R5812R4624O9057K6717M2097N5736O2567P7590Q4936
10373B342501Q7513J14990J56939J94789K29328K64704K73402K72046K55247K81443
10363D472902L36673L66850M21191M60972N63427O86929Q12326R91941J234762
$$ y = [642293, 681138, 693960, 708334, 715454, 727415, 736477, 735423, 744209, 757163, 752996, 742087, 721288, 719687, 724927, 734762, 735730, 723318, 718354, 712719, 737438, 757456, 758519, 766812, 784751, 798344, 826122, 838136, 844580, 849827, 842903, 853130, 874995, 891770, 912357, 932192, 952172, 944767, 935088, 907456, 880658, 867423, 866580, 865724, 873215, 888707, 921902, 963109, 1000696, 1037711, 1053711, 1063570, 1066545, 1094785, 1150387, 1205809, 1261657, 1316460, 1361208, 1399581, 1445066, 1485870, 1553164, 1636588, 1733365, 1829177, 1923801, 1992858, 2019575, 2061672, 2117408, 2179975, 2257565, 2342501, 2430014, 2545004, 2701943, 2896732, 3126060, 3390764, 3664166, 3936212, 4191459, 4472902, 4809575, 5176425, 5597616, 6058588, 6622015, 7308944, 8121270, 9113211, 10347973]
10354A0347973J491841J782582K022112K149627K215861K315125K562497L066038
10346B7953656L987249N321147O989583R290747J3031708J9327372K9874044M7109732
10338A62885238P0758713R0859590Q9547685O0380544K2948239r222865m5885689
10331D42271455q4753315r4785770p5242268m8667057k9816170j8587249j1806831
10324G8612795p488528m513622k431030j242285r74521j554211k524622l341795
10316E4542181l754372l899294l786501l419679k981496k564585k226701j960661
10308B9948892j732634j526940j352296j203035j085578r79304q91839q05510
10300B0371756o99709o19822n37742m86899m84429n73811o73928p17228p85787
$$ y = [10347973, 11839814, 13622396, 15644508, 17794135, 20009996, 22325121, 24887618, 27953656, 31940905, 37262052, 44251635, 53542382, 66574090, 85901462, 115775506, 162885238, 233643951, 324503541, 414051226, 474431770, 497380009, 488157144, 442271455, 357518140, 262732370, 187490102, 138823045, 109006875, 90419626, 78612795, 71124267, 66610645, 64179615, 62937330, 61962809, 60408598, 57883976, 54542181, 50787809, 46888515, 43102014, 39682335, 36700839, 34136254, 31909553, 29948892, 28216258, 26689318, 25337022, 24133987, 23048409, 22069105, 21177266, 20371756, 19672047, 19052225, 18514483, 18027584, 17543155, 16969344, 16295416, 15578188, 14792401]
10291A4792401q12126p50373o66554n65442m87607m14048l47109l04857k91049
10282A0153236k85620k76757k90915k89343k81780k52688k55732k40069k28241
10273G752091k29337k29037k36383k15148j78846j51661j46295j51220j58945
10264F055219j59003j65202j74621j68660j43151j56700j68683j29050j20160
10255D669989j15965j19101j11707j04794j02829j29501j40611j26175j23361
10246C595945r3073r7819j03949r8095r8201q3037n1570m6236m8343m8127n2322
10235B775173o4263o8123o9224q5992p2586o1123o4814p0541q0190q9040r9953
10224A949324q6133q0252q2296q3913q7670p2211n9072m7856l3258j8749k550
$$ y = [14792401, 13980275, 13229902, 12563348, 11997906, 11510299, 11096251, 10749142, 10444285, 10153236, 9867616, 9590859, 9299944, 9010601, 8728821, 8476133, 8220401, 7980332, 7752091, 7522754, 7293717, 7057334, 6842186, 6663340, 6511679, 6365384, 6214164, 6055219, 5896216, 5731014, 5556393, 5387733, 5244582, 5087882, 4919199, 4790149, 4669989, 4554024, 4434923, 4323216, 4218422, 4115593, 3986092, 3845481, 3719306, 3595945, 3502872, 3405053, 3301104, 3203009, 3104808, 3021771, 2970201, 2923965, 2875622, 2827495, 2775173, 2710910, 2642787, 2573563, 2487571, 2414985, 2353862, 2289048, 2218507, 2138317, 2049277, 1949324, 1863191, 1782939, 1700643, 1616730, 1529060, 1456849, 1397777, 1349921, 1316663, 1297914, 1295364]
10213A295364K1364M4356M9430K8940j4021m3706o3227q7134r0179o6973o4443
10202A009771p2300n0085m6138n9926n6553k9921k7337k1481o703Q032K762M26
10190F50547M00Q0N551M640p45n04o445n62K491j3067q756O591j1125N740m104
10175F30732n115J2268j4329l0775j8223j4732j9591j8790k0334j6990Q614O956
10163D99691o993p366l791l0363l4096l9139l2658j8263j4498m4017l7087n3567
10151A77853n3924o2543p9469j05556j27710q8848l0858K5943P7734J38907J78760
10140E0289J60213J10531Q3044M3431J5743J2321J0056m620k1745p182j4047J1836
10128D49870J7768l806P71J321j050M627J940M767p525q492j4166j4994k2710
$$ y = [1295364, 1316728, 1361084, 1410514, 1439454, 1425433, 1381727, 1318500, 1231366, 1141187, 1074214, 1009771, 937471, 887386, 841248, 781322, 724769, 694848, 667511, 646030, 639327, 647359, 650121, 650547, 650947, 651027, 656578, 661218, 660473, 659969, 653524, 652962, 655453, 642386, 633630, 640221, 629096, 634836, 630732, 625617, 637885, 623556, 592781, 574558, 559826, 540235, 521445, 501111, 484121, 492735, 499691, 492698, 485332, 481541, 451178, 417082, 377943, 345285, 327022, 312524, 268507, 231420, 177853, 123929, 61386, -18083, -123639, -251349, -340197, -371055, -345112, -267378, -128471, 50289, 210502, 321033, 404077, 447508, 463251, 475572, 485628, 481008, 459263, 452081, 438034, 449870, 467638, 463832, 464603, 465924, 464874, 469501, 471441, 476208, 468683, 460191, 446025, 431031, 408321]
10115D08321j4109p437L954N767m086O166k425K19M139j2002q351j2891J482K3350
10101C92097R406M279K885J3307J2540n18k1160j3727j5440j4762O104J0685m140
10088C81556m810r100j0614j0479k361k255j9500j144r748j2763k0416k114J395
10075B77647j0079M539J2501J919j5169j0681j9281k6666o029L26k3897j7131
10063A67999Q723J2339J3031m598j776J683o714q314j486p120l598R278R091m722
10049A83816q58o7q820O145J1460J3606J4181n18n188n498M565L391O810j0073
10035B12952j9463J61O797j7298j2463q85J1951J2339J3888P873O07K372r10J0829
10021B28750Q312J2617L722P487p362r230J015k955r67M628M897r634l578J2611
$$ y = [408321, 394212, 386775, 390729, 396496, 392410, 398576, 396151, 396370, 400509, 388507, 380156, 367265, 368747, 392097, 401503, 405782, 408667, 421974, 434514, 433996, 412836, 399109, 383669, 368907, 375011, 385696, 381556, 376746, 367646, 357032, 346553, 344192, 341937, 322437, 321293, 311545, 298782, 278366, 276252, 277647, 267568, 272107, 284608, 286527, 271358, 260677, 241396, 214730, 208701, 209027, 185130, 167999, 176722, 189061, 202092, 197494, 195718, 197401, 190687, 182373, 180887, 173767, 170169, 179447, 188538, 183816, 182958, 182891, 174071, 180216, 191676, 205282, 219463, 218945, 213757, 208259, 212824, 216215, 223025, 212952, 193489, 193650, 200447, 183149, 170686, 169801, 181752, 194091, 207979, 215852, 216459, 218831, 217921, 228750, 237062, 249679, 253401, 260888, 253526, 244296, 245311, 242356, 241389, 246017, 250914, 241280, 237702, 250313]
10007B50313J6544k046j5914o494J639j4132M686K0856J2506L0281J2324k62J72
9994C10473m070k322R219J3090j607J206o80j730J1103Q909J5516k899K188J7353
9980C75749n72o972J3901J8570K6N47N203J8678J3451Q278J5602M40L29R264J7441
9965D89935N384l27m899j716L437N083P833K0650J8194m111j682l320J8466K2000
9951E74927N449P720J2668L378M344J8517K8828J1464J462M10J8609N623J0777
9938G04176J9558K1118J1657J1678L674O275J0690J2041O966o460J1829J2465
9926H25667J7258K5759K1157J2966K4888K9191L3321M6914P7323J20652J57074
9915A392170K09351K68651K91053K99576K45060J49113N7962o8944j81789k65084
$$ y = [250313, 266857, 264811, 248897, 242403, 244042, 229910, 234596, 255452, 267958, 298239, 310563, 310301, 310473, 306403, 304081, 313300, 326390, 324783, 325989, 325309, 323579, 334682, 343591, 359107, 356208, 358396, 375749, 375177, 368205, 382106, 400676, 400702, 401249, 406452, 425130, 438581, 446859, 462461, 462901, 463230, 472494, 489935, 495319, 494992, 490093, 488377, 491814, 496897, 504730, 525380, 543574, 539463, 537781, 534461, 552927, 574927, 580376, 588096, 600764, 604142, 608486, 627003, 655831, 667295, 668757, 669167, 687776, 693399, 704176, 723734, 744852, 756509, 768187, 771861, 778136, 788826, 800867, 807833, 801373, 813202, 825667, 842925, 868684, 889841, 902807, 927695, 956886, 990207, 1037121, 1114444, 1235096, 1392170, 1601521, 1870172, 2161225, 2460801, 2705861, 2854974, 2912936, 2843992, 2662203, 2397119]
9905B397119k84952k81859k49827j88372j51499j14372o7933l6506k7563l5356
9895I58880k5789l4513l0761k4789l7816j1247j8697l7813l2218j9753l4914k7347
9883F23223j8714j3227r700o088k3882k4317q436k321L63N09Q28j4800j0332j1129
9869D81977P186o357j6802j4268j1665o713j2537j0830j7844k3728j0388J0952
9857C68983J755j867O559L706q215k8432j1534K450l747j1800m575j0228m663
9844B98392J245k1544j2223o916m126j9028k961M056N231o674O165J643j3844
9831B29416o642j625K864R188M009N73P509K84P04n385j3895j1355j5217r516
9817A90912O219j3943J0902q210k1602P813J2517n17j809K787m015l240J673R332
$$ y = [2397119, 2112167, 1830308, 1580481, 1392109, 1240610, 1126238, 1058305, 1021799, 994236, 958880, 933091, 898578, 867817, 843028, 805212, 793965, 775268, 737455, 705237, 685484, 650570, 623223, 604509, 591282, 581582, 575494, 551612, 527295, 518859, 516538, 516901, 517410, 518238, 503438, 493106, 481977, 489163, 482806, 466004, 451736, 440071, 433358, 420821, 409991, 392147, 368419, 358031, 368983, 370738, 368871, 375430, 379136, 370921, 342489, 330955, 333405, 329658, 317858, 313283, 303055, 298392, 299637, 278093, 265870, 258954, 254828, 235800, 232839, 236895, 242126, 235452, 241617, 243260, 229416, 222774, 221149, 224013, 233201, 237210, 237783, 245292, 245576, 246280, 240895, 227000, 215645, 200428, 190912, 197131, 183188, 194090, 185880, 164278, 172091, 184608, 184091, 182282, 185069, 181054, 177814, 179487, 188819]
9803A88819p52j3770j2123j3276J46L874K679n855j561j893p613k066N179j3486
9789A28302N85K654N251p912j2675m186J477R005j48J516K41J78j1624q598J741
9774A05807Q026J491m869l874p818p929k340j706j333K0098J7273j5297q936J3823
9760A12416J187k1146l272L168N502m196j686j1003P105J0887L479j7932L640
9747H8149l790r64O79j6513j3023P845J633J6228R603j2203n752k285N953J5255
9733I0815k685n748q025k703M836J2043P693K605l755o877N202P774R57j5113
9719H7019k0314m509P545N199n984j5367N239K0324M740m294J5295Q19n720o840
9705H3152J737L076q79j5720j2008K443O78P539J6143K322p954m892j162Q591
$$ y = [188819, 188067, 174297, 162174, 148898, 149044, 152918, 155597, 149742, 148181, 146288, 138675, 136609, 141788, 128302, 128887, 131541, 136792, 128880, 116205, 112019, 113496, 122501, 122353, 123869, 124110, 124288, 112664, 104066, 105807, 113833, 115324, 110455, 106581, 98763, 90834, 88494, 86788, 85455, 105553, 122826, 107529, 98593, 112416, 113603, 92457, 89185, 92353, 97855, 93659, 91973, 80970, 88075, 98962, 102441, 84509, 88149, 84359, 83395, 84074, 67561, 54538, 62383, 64016, 80244, 89847, 77644, 71892, 69607, 75560, 90815, 88130, 82382, 74357, 71654, 76490, 88533, 96226, 98831, 95076, 88199, 93401, 101175, 102132, 87019, 66705, 62196, 69741, 74940, 68956, 53589, 58828, 79152, 83892, 79598, 94893, 95712, 89992, 83152, 84889, 87965, 87086, 71366, 59358, 61801, 62479, 70018, 86161, 88483, 80529, 75637, 74475, 83066]
9691H3066j2034o526j4051R83k887O197K0228l3J283j2558n532r983j735q246
9677C8172L420O033J93q326o495p878m963Q684J0769J0218L06O627N559j7837
9663D4482O000J0705q003m436N078J365o350J279j4978j9681p13J6974J5460j3433
9649C3749J616l344M897k70J593r05L976j229M948R325Q220j9132j2232J857K43
9634C3312L555O651K746P848P501l849J2136j2110q17p224j0016k3754J147J200
9620A8326O321J3518J6999p333j1076n874l514k057Q030Q359j615n642j0572J8534
9606D2404k336R699K958n251m126q808n580K574J0837j2562P647J0667K979L723
9592E4825q094p055k611m930J330L940J027L507l740L304n789j3731M033r57O1
$$ y = [83066, 71032, 64506, 50455, 51438, 48551, 54748, 74976, 74943, 76226, 63668, 58136, 48153, 46418, 38172, 41592, 47625, 47818, 39492, 32997, 25119, 20156, 28840, 39609, 49827, 50133, 56760, 62319, 44482, 50482, 61187, 53184, 48748, 53826, 55191, 48841, 50120, 35142, 15461, 14748, 31722, 47182, 33749, 35365, 32021, 36918, 36648, 38241, 37336, 41312, 40083, 45031, 54356, 62576, 43444, 31212, 33069, 33312, 36867, 43518, 46264, 54112, 61613, 57764, 69900, 57790, 56973, 49749, 39733, 15979, 17126, 18326, 24647, 38165, 55164, 47831, 36755, 30881, 27367, 25310, 33340, 41699, 40084, 34442, 23870, 42404, 40068, 49767, 52725, 47474, 43348, 34540, 28960, 31534, 42371, 29809, 37456, 48123, 51102, 54825, 46731, 39676, 37065, 32135, 33465, 37405, 38432, 41939, 38199, 41503, 35714, 21983, 26016, 25059, 25120]
9577B5120R372q447n68j309K026M062O336j345N206l551j296O977k592j2112k362
9562B5517j710o470J1404k534n646J4150Q7k56m411l178l563j3756Q49R790M095
9547B4368J543M802l247l997q614N598R738L636k2100p18M074L514n83J320r937
9532I397m929j493N30J0060J0387k388J570p588o327N804P311l056j8486J2386
9518A3178J9763N9N752j742q191m811o97N147J3826l573m597m360j861l222j0147
9503A4524J065J2281K0171J8924j2220j6443P566q976j5463N621J933L053N59
9490C2595J517j0632l022N456M632o88n417k369K449l00j0433M439N780p11O946
9475C0242J50J288q126j0525k438L380J3322Q694M77j405m820j5679q866L711
$$ y = [25120, 34492, 26045, 25477, 24168, 26194, 30256, 36592, 35247, 40453, 36902, 35606, 42583, 39991, 27879, 25517, 23807, 17337, 28741, 26207, 20561, 34711, 34798, 34542, 30131, 26953, 23390, 9634, 10483, 20273, 24368, 25911, 30713, 27466, 23469, 14855, 20453, 30191, 33827, 11727, 11009, 15083, 18597, 18014, 19334, 9397, 4468, 2975, 3505, 13565, 23952, 21564, 23134, 15546, 9219, 15023, 22334, 19278, 792, 13178, 32941, 33000, 38752, 37010, 28819, 24008, 23311, 28458, 42284, 38711, 34114, 29754, 27893, 24671, 14524, 15589, 27870, 48041, 66965, 54745, 38302, 45868, 36892, 21429, 27050, 28983, 32036, 32595, 34112, 23480, 20458, 25914, 30546, 29858, 24441, 22072, 24521, 24221, 13788, 18227, 24007, 23296, 30242, 30392, 31680, 23554, 13029, 10591, 13971, 27293, 35987, 36464, 35059, 30239, 14560, 5694, 9405]
9461I405j541P40O627J0234P654k0162j0478l126J0733J9670M370j2178n58O042
9447B7432k473k1341j1163j624m938J2052j710l999Q785R812N920O2o185J0063
9433B0693j305k1591p449K632L950P500P461K095M383J1803K569j2140n685o915
9419H001J134J0445l666q218j2548O247R388P938O013J6354l452R064r819n389
9405C1492J210l308m362M768M379j2793m468p738J463l647l343k526P45l283n66
9390a977L822l004k916J501R902K95J327J81J680m460J883J4827N516N724m812
9375B9489m175n724j5175J2187P595m664m830l407J0875m668q666J809J0749l95
9361B1000K738r851j3554J1770R367j023k314Q427J817j448r843p178m423n775
$$ y = [9405, 7864, 8604, 15231, 25465, 33119, 12957, 2479, -647, 10086, 29756, 34126, 21948, 21390, 27432, 24959, 3618, -7545, -9169, -14107, -2055, -3765, -7764, 1021, 10833, 16753, 16815, 10630, 20693, 19388, -2203, -9652, -7020, -3070, 4430, 11891, 13986, 18369, 30172, 32741, 20601, 14916, 8001, 9135, 19580, 15914, 7696, -4852, 1395, 10783, 18721, 24734, 41088, 37636, 46700, 36881, 31492, 32702, 29394, 25032, 29800, 34179, 21386, 16918, 9180, 10643, 6996, 3653, 1127, 1872, -1411, -1977, 1845, -1159, -4075, -2574, 7328, 7623, 8950, 9131, 10811, 6351, 8234, 23061, 28577, 34301, 29489, 25314, 19590, 4415, 16602, 24197, 19533, 14703, 11296, 22171, 17503, 8837, 10646, 21395, 21000, 23738, 13887, 333, 12103, 21470, 20447, 18133, 26560, 28377, 26929, 17086, 9908, 5485, -290]
9347b90J7115R592q990n089j140N060P668l608j2469q618o965j5058L985J766
9333a7041O462q196N134q18J4358J3283K986N492M287l897j316r751r045n060
9319c122L594n2o519L650K4684J4764j5025l817J0908k557o627m699O953R39j2010
9304A1064k108k257O235O068L466M702n539k1458N526J4715r273L826J3395K962
9290C1324q638m604J1443o0J4726K0423j1350M733k22k705p321L076j7191j2695
9276B0939P740l043o384M885N016M489M145O297k301r574o821j6940o829L885
9262E504q265J374K620j5595r87L360K0086L848j3363j3117J8046J4462K028j8926
9248A075p53Q260R766l037J1844j2921J55J6423k967j4239l665l648K87l64M902
$$ y = [-290, 16825, 26417, 17427, 12338, 11198, 16258, 23926, 20318, 7849, -769, -7734, -22792, -18807, -17041, -10579, -18775, -13641, -14459, -101, 13182, 16168, 21660, 25947, 22050, 20734, 10983, 1938, -3122, 472, 420, -6099, -2449, 22235, 36999, 21974, 18157, 29065, 26508, 19881, 15182, 22135, 23074, 11064, 8956, 6699, 12934, 19002, 22468, 27170, 21631, 173, 5699, 20414, 11141, 14967, 28362, 31324, 22686, 18082, 29525, 29465, 44191, 64614, 53264, 57997, 57775, 55070, 47749, 50825, 33634, 20939, 28679, 25636, 19252, 24137, 29153, 33642, 37787, 44084, 41783, 32209, 25388, 8448, 1619, 5504, -2761, -1387, 1233, -14362, -15349, -11989, 8097, 11945, -1418, -14535, 3511, 17973, 20001, 1075, 322, 8582, 18348, 15311, 27155, 14234, 14389, 30812, 27845, 13606, 9941, 6293, 6580, 6216, 11118]
9233A1118N391R733k374K936n627M494Q847m038o138J450j0373o966m928m597
9219a072P30J755J526N837q64r941p411m285J029n02J0874R700R412P929k029
9204B2688j1515N598N323O229J0936r810m915L630J0024O296J103j7095k6879
9191A613M364K0676O080l016n77K360m310O287m128L501j206r080j0635m088j2328
9176d487p479m805p268P891J4993M813L834J5342j385n052j5747r862J381l558
9162a1389J6349J2286o187K727M015R11R063j0971k3798m016J0793J138M669l96
9148E194p92R191K337j8339k0914m885P059Q701O576J5047r333j847J0878L116
9134A1989m51p626j278K668J018K853J0816Q436n945j543J1020l555o244J2328
$$ y = [11118, 16509, 26242, 23868, 26804, 21177, 25671, 34518, 30480, 24342, 25792, 15419, 8453, 3525, -1072, -342, 1413, 2939, 8776, 7912, -2029, -9440, -13725, -12696, -13198, -2324, 7376, 16788, 24717, 22688, 11173, 16771, 22094, 28323, 39259, 29449, 24534, 28164, 38188, 44484, 45587, 28492, 1613, 5977, 26653, 32733, 29717, 29140, 31500, 27190, 33477, 29349, 32850, 31644, 22564, 11929, 7841, -4487, -11966, -16771, -24039, -16148, -1155, 3658, 7492, 22834, 21449, 16397, 650, -9212, -7831, -11389, 4960, 17246, 11059, 13786, 17801, 18712, 27775, 16804, -6994, -11010, -217, 921, 5590, 5194, 4402, 13593, 15930, -2409, -23323, -28208, -21149, -12448, -5872, 9175, -158, -2005, 8873, 11989, 11538, 3912, 2634, 5302, 6320, 9173, 19989, 28425, 22480, 20937, 31957, 28402, 22158, 34486]
9120C4486J54J39l619j2009j4390P756J502j700n537O516Q957l590r152Q24n163
9105E174r476l637L770K734P040K372p612R092J3757l242o105l427J979J053M575
9090A8047o326L731J014L182J1482R654l449j8999O533R679r310J202J0853Q56
9076C8149l906j0948O348P043P57k4632j2948J2566K7248L719m406J0483M84n580
9062D4377j5082j2920n159j380N10q27k705R212J0433j2208n370m525L375m80
9048G251m695o16O438J1300l485n36J969j0954r738J2058k953R800N796n337o04
9033A5694n067o755J7654J6700j399n994k3713m519O063K139P444o930j6351J11
9019d923L28j395J962L8K2214L98n980J0399L772j4262j078J4250M6j300J933
$$ y = [34486, 34640, 34779, 31160, 19151, 4761, 12517, 14019, 12319, 6782, 13298, 22255, 18665, 9513, 10337, 5174, -4302, -7939, -4169, -1435, 5605, 7977, 365, 9457, 23214, 19972, 13867, 10440, 12419, 13472, 18047, 11721, 15452, 16466, 19648, 31130, 40784, 37335, 18336, 24869, 34548, 25238, 26440, 37293, 38149, 34243, 23295, 29643, 36686, 37443, 12811, -137, 12429, 39677, 43396, 38990, 49473, 49957, 44377, 29295, 16375, 11216, 9836, 10346, 9519, 6814, 16026, 26459, 14251, 8881, 4356, 7731, 7251, 2556, 1940, 8378, 19678, 16193, 15657, 17626, 6672, -3066, 8992, 6039, 15839, 21635, 16298, 15694, 10627, 3872, 21526, 38226, 36827, 30833, 7120, 2601, 8664, 10803, 18247, 11317, -5034, -4923, -4595, -5990, -4028, -3990, 18224, 18622, 12642, 23041, 26813, 12551, 11473, 25723, 25769, 24469, 26402]
9004B6402k367N057p505o217m530J912N698m121k072P389m586j4641L746K211
8990F376m211L148P062J235n678j0795j640R940O069r470l414J0341Q912m976
8976A2899n137M758q432r501j368O725R392O977J0012Q08j2071o912j3450K710
8962b590K0257n625j1333o054n729J0447Q978q392n028M846M013M956J2894J0596
8948C2236l388q362j6581l619J5059J0052o535m031n459O787o106q682j1222R25
8934h926K765P637n349j1746O296L096Q973n179o71l123j1670j456J5465J5752
8920A1864J2238q211j5881P9m125P92N983o990N167J2485P692O270k000j4156
8906A1207j2690K089R258J3385p269L692L10j2527q559n18J717P109p80j933M545
$$ y = [26402, 24035, 29092, 21587, 15370, 10840, 12752, 18450, 14329, 12257, 19646, 15060, 419, 4165, 6376, 2165, 5313, 12375, 13610, 7932, -2863, -4503, 5437, 11506, 2036, -1378, 8963, 17875, 12899, 7762, 12520, 4088, -5413, -6781, -56, 9336, 16313, 26325, 27133, 15062, 8150, -5300, -2590, 17667, 12042, 709, -5345, -11074, -627, 8351, -41, -5069, -223, 3790, 8746, 21640, 32236, 28848, 20486, 3905, 286, 15345, 25397, 18862, 14831, 9372, 16159, 10053, 1371, -9851, -8926, -6161, 1476, -3873, -15619, -9323, -6227, 2746, -2433, -3104, -6227, -17897, -19353, -3888, 11864, 24102, 15891, 10, 89, -4036, -3244, 2739, -4251, 916, 13401, 21093, 27363, 25363, 11207, -1483, 606, 9864, 23249, 15980, 19672, 19982, 7455, -1104, -1622, 95, 7204, 6424, 4491, 9036]
8891I036m463j380P245J247k902j03r5k744N93R191J084L759N352j2811j0134
8876B875n389K112n491L908O319Q973O285j0143j0959k548J060K181J0278K920
8862A2381m693N490j727r202m449K051J620L922r414K530J0794j701K089K326
8848A2017N272k17o86K646j014M711m123j0176q952O580J870N19J8761K530L541
8833C3279r782j2987j173L614k566J438Q807j1166o281J644j935m127j584q04
8819c623Q655N989K917N573n15k678r733m716J531L649q943N316n21J926N561
8804A0388o9J734j3470o843Q240N245K2913J0795q356j736p729r795l164p334
8790H19l762P691j6203N811L370j33o826J885K741J1972J9311P282j8733k501
$$ y = [9036, 4573, 3193, 10438, 11685, 8783, 8680, 8585, 5841, 6434, 15625, 16709, 20468, 25820, 13009, 2875, -2514, -402, -5893, -1985, 4334, 13307, 19592, 9449, -1510, -4058, -2998, -817, 9461, 12381, 7688, 13178, 11451, 2249, -2200, -149, 1471, 5393, -4021, -1491, 9303, 7602, 9691, 12017, 17289, 17072, 16386, 19032, 18018, 22729, 18606, 8430, -522, 6058, 7928, 8447, 27208, 29738, 33279, 23497, 10510, 9337, 12951, 10385, 11823, 20630, 9464, 3183, 4827, 2892, -1235, -2819, -3623, 5032, 11021, 13938, 19511, 18996, 16318, 6585, 1869, 3400, 7049, -1894, 3422, 2901, 4827, 10388, 10319, 12053, -1417, -8260, -20, 5225, 28138, 38933, 30577, 28841, 21112, 11317, 8153, 819, -2943, 4748, -11455, -5644, -2274, -2407, -9233, -7348, -4607, 7365, 26676, 33958, 15225, 12724]
8776A2724p041K030M132q074p608k000k72J990j090Q737J671Q42M336j212J837
8761A1002r503k909K864P598O231Q984M941o97o014j8124j1205r005K417J3248
8747a72J8778j3295j4541R818O292M675R647P158j5451m088q34N187L654j0787
8733F041p782J829J2231M210l999r010K681J215o13N497J0915R688q733r113J599
8718A6656M707j1441k287O610J2587K038J1531J104j7350n186q914L742j1359
8705B438j2736n847K4202K223o119m576J231P364O246N474J3974K257l504q687
8691B3940m394N269j453j1615K486j21p72k297J5569Q332r829r426L305M168L613
8676B6775k361j321n428o615m990N302O746P745j0179N48R201o313j8507j264
$$ y = [12724, 5683, 7713, 11845, 3771, -3837, -5837, -6109, -4119, -5209, 3528, 5199, 6041, 10377, 9165, 11002, 1499, -1410, 1454, 9052, 15283, 24267, 29208, 28511, 22497, 4373, -6832, -15837, -13420, -172, 18606, 5311, -9230, 588, 6880, 11555, 21202, 28360, 12909, 8821, 7987, 13174, 16828, 6041, -1741, 88, 12319, 16529, 12530, 3520, 6201, 7416, 6803, 12300, 23215, 32903, 24170, 15057, 16656, 21363, 9922, 7635, 14245, 26832, 28870, 40401, 41505, 24155, 18969, 10055, 13797, 2438, -10298, -16145, 8057, 10280, 4161, -415, 816, 8180, 14426, 19900, 33874, 36131, 32627, 23940, 19546, 24815, 23362, 11747, 14233, 14112, 13340, 11043, 26612, 34944, 25115, 15689, 18994, 23162, 26775, 24414, 23093, 17665, 11050, 6060, 11362, 18108, 25853, 15674, 16222, 25423, 19110, 603, -661]
8662f61L496r839P571P101j938m188J5113Q277J727Q29Q182j2811k0808J1794
8648A3845o226o170J3218J8996J6432l569j3925m756N395K976j0084n896N042
8635B5278j528O552n31M757j3183r558J0929J3960J237n1Q582m037r76R34M260
8620D6625R257n870q220o123j1021P010j667k6K493J447N095j1213n466R668J7717
8605D9706L232r394Q84R069o089j2353n252j556N673J836m48R044J9512n060o754
8590E2050M413J6656l110O102J6676n420J316K880j828L61O021Q386O434J19j0830
8575A00226j9542l234m967q409q538J884P88q076j6471o646J4567M042m247j7342
8561B4035k392J908J5151N308m028l922q151q742j48p048j233l63K0083J3919
$$ y = [-661, 2835, -7004, 567, 7668, 5730, 1542, 16655, 24932, 26659, 27488, 35670, 22859, 2051, 13845, 7619, 1449, 14667, 33663, 50095, 46526, 32601, 27845, 33240, 36216, 26132, 20236, 25278, 23750, 30302, 29771, 34528, 21345, 11787, 22716, 36676, 37913, 37862, 46444, 42407, 41431, 42365, 46625, 55882, 50012, 41792, 35669, 24648, 31658, 29991, 29965, 32458, 33905, 39000, 27787, 22321, 31989, 49706, 52938, 43544, 44428, 53497, 47408, 35055, 29803, 28247, 33920, 35756, 35308, 44352, 63864, 58804, 52050, 56463, 73119, 70009, 76111, 92787, 87367, 88683, 91563, 89735, 90096, 96117, 104503, 110937, 111056, 100226, 80684, 77450, 72483, 64074, 55536, 57420, 58208, 50132, 33661, 27015, 41582, 45624, 41377, 24035, 21643, 23551, 38702, 44010, 39982, 36060, 27909, 19167, 19019, 11971, 10738, 10375, 30458, 44377]
8547D4377p383J81k2550j3559J2659k899M190O358L990N391J4695j1163o331n395
8533B2561k678r65l970p817L63J3594R353O920q430n033n827M620J150l768m086
8518A5987k6245P56J8130j849Q595L255J4722j9561k1280Q046L444o048J098O743
8504E793J0560L930j1785r044O047O904O169K135J9479M060j6940j5081l215J2316
8490B1328N203p021m376k12o923L219R73J492j413m30K562p209k315m236j0406
8475i764l838M251M986J4642J2207p411j0229O330R770l955M785R960o030p929
8461A7775j95l353j3982Q16m422m124p587M545J6089K5422J0834q732j4227k1148
8447b289k974L693R307L474n979j0989M483J3831j911k617J004L332N44q002k035
$$ y = [44377, 36994, 37175, 14625, 1066, 13725, 10826, 15016, 21374, 25364, 30755, 45450, 34287, 27956, 22561, 19883, 18918, 14948, 7131, 7494, 21088, 30441, 37361, 28931, 23898, 18071, 22691, 23841, 20073, 15987, -10258, -9502, 8628, 6779, 15374, 18629, 33351, 13790, -7490, 556, 4000, -2048, -950, 5793, 16353, 20283, 8498, -546, 5501, 12405, 18574, 20709, 40188, 44248, 27308, 12227, 9012, 21328, 26531, 19510, 15134, 14922, 7999, 11218, 12191, 13683, 12270, 11840, 14402, 7193, 4878, 642, -9764, -13602, -9351, -4365, 10277, 22484, 15073, 4844, 11174, 20944, 16989, 21774, 31734, 25704, 17775, 17580, 14227, 245, 1061, -3361, -7485, -15072, -10527, 5562, 30984, 41818, 33086, 18859, -2289, -5263, -1570, 7737, 11211, 5232, -5757, -1274, 12557, 10646, 8029, 9033, 12365, 12909, 4907, 2872]
8432B872k079R330N813o466k489r314j0241K202j269O65m045K62R230j189J2111
8417E393J9790m091o436j0237R440J253k412o028N411n478k481J943j0378r691
8403a4002J292J1776n130o513k131k460J147J7971J597Q545n272j5426M386J1203
8389F983M556l027k823M938L9j085j0468j328j0517K119J5772K940K310J035o284
8374E160n560M244o570K755O826o919n149O540J1851o914j0294J2936J046j675
8360H277n314M994j2294j5405K7950J5669k321l475k00j3848j3828k100L31P123
8346d441K0679K797j3347j590P333N234K255N74j0531M505O47k936J9574P443
8332C8196j7309q082q217k371Q020j3739j2629m088K4904J7810j6631j2526J0051
$$ y = [2872, 793, 10123, 15936, 9470, 6981, -2333, -12574, -10372, -11641, -10976, -15021, -14759, -5529, -6718, 5393, 25183, 21092, 14656, 4419, 13859, 15112, 12700, 6672, 12083, 6605, 4124, 6067, -4311, -14002, -12710, -934, -6064, -12577, -14708, -17168, -16021, 1950, 3547, 12092, 6820, -8606, -4220, 6983, 11539, 8512, 5689, 10627, 10666, 9581, -887, -2215, -12732, -10613, 5159, 8099, 10409, 11444, 5160, -400, 3844, -2726, 29, 6855, -64, -5213, 1327, 13178, 6264, -4030, 8906, 9952, 8277, 2963, 7957, -4337, -19742, 8208, 23877, 21556, 18081, 17881, 4033, -9795, -11895, -11564, -4441, 16238, 19035, 5688, 4098, 11431, 16665, 18920, 19494, 8963, 13468, 14115, 11179, 30753, 38196, 20887, 12805, 4588, 2217, 10237, -3502, -16131, -20219, 4685, 22495, 5864, -6662, 3389]
8319C389J0467k715j941p959p89J2353K002j401o721j1406o960j735J3231K0672
8305B0487p999k412m338q636q103L076J485J7330m212r310O824O112M211q519
8291E996J557Q356O81j1439l029L543O490j479n63J024j5514N28J2139N654P652
8276B1596R549n151J0208O890j5196j8073l515Q196r87K827k592k288L614L226
8262A8304o347j104J0373J1991r146j3225q89J094J2825o245m468j7066m866J6489
8248G720Q037L850j0565k8307n642j097l362O201J5440l255k337M869r83J860
8234g571J555k968k813p148M40O950l23o194J2037O068M114L75M049J2765J520
8219B2856p306p861l812n582J1801J084n763m91J1636j2767l595Q333K345j01
$$ y = [3389, 13856, 11141, 9200, 1241, 452, 12805, 14807, 13406, 6685, -4721, -11681, -13416, -185, 20487, 12488, 10076, 5738, -2898, -11001, -7925, -6440, 10890, 6678, -2632, 4192, 10304, 14515, 5996, 7553, 15909, 16590, 5151, 2122, 5665, 12155, 10676, 10113, 11137, -4377, -3849, 8290, 13944, 21596, 31145, 25994, 36202, 43092, 27896, 9823, 6308, 14504, 13517, 16344, 13752, 11464, 15078, 18304, 11957, 10853, 21226, 33217, 24071, 10846, 9957, 11051, 23876, 17631, 13163, -3903, -8769, 7720, 15757, 19607, 9042, -19265, -24907, -26004, -29366, -23165, -7725, -10980, -13317, -8448, -9431, -7571, -6016, -8984, -11797, -18945, -18505, -11555, -11878, -18072, -6035, 33, 4147, 4522, 8571, 21336, 22856, 15550, 7689, 3877, -1705, 10096, 11180, 5417, 4926, 16562, 3795, 200, 8533, 10878, 10777]
8205A0777J7524k677n266q527L462N316j195j9053p810m98J2161J1567j868j0251
8191C662j5050o48J5770L856Q715Q327j6638n478l879M321n034J0800n05j2152
8177c933O375r151J7537J192m959j132J057q355j2786N517M340j2773m484J3595
8163g960P992k929L485L648j640J3142K100p720m460n697J134J2471l373r101
8149A092j297K986j2591j0438l608K016K145J8928K0246m419m516k38J1997P838
8135C0141O606j1905o263o081J457L534j168n99j0944N383M889J7901j1878j8237
8121B836J2725J2524p224q021J0339r184j6848o4m931L275K0209k743J695m552
8107A0036n127p074N237J5082J994M135J04N761P06j3663r528p59J1712K18n598
$$ y = [10777, 28301, 25624, 20358, 11831, 15293, 20609, 19414, 361, -7449, -7947, 4214, 15781, 13913, 3662, -11388, -12036, 3734, 7590, 16305, 24632, 7994, 2516, -1363, 2958, -2076, 8724, 8219, -3933, 2442, -6709, 10828, 12020, 7061, 5929, 6986, -1369, -14155, -8638, -4298, -17071, -21555, -7960, 32, -2897, 588, 4236, 2596, 15738, 17838, 10118, 5658, -39, 1095, 13566, 10193, 1092, -205, 2781, -9810, -20248, -23856, -21840, -19695, -767, 19479, 15060, 10544, 10306, 22303, 30141, 36747, 24842, 18579, 12498, 13955, 17489, 16321, 15722, 4778, 10161, 15050, 32951, 21073, 2836, 15561, 28085, 20861, 12840, 23179, 13995, -2853, -2917, -7848, -4573, 15636, 12893, 14588, 10036, 4909, -2165, 3072, 18154, 20148, 24283, 24387, 30148, 30854, 17191, 7663, 6904, 18616, 18834, 13236]
8092A3236K358m953P501P204L19j5679j4872o029k802p51Q995J4807R949m131
8078A5152q118p881K731N729L647K029k374p521j7983O889R911J0568K02j0416
8064B565q815m329O607J417Q171J4215n976n785M739l638k059M792j1688j4522
8050a4306L042J4647j142Q513M142J102K929o776k199O738r22k700J291p308j2957
8035e906O426M082j2185p974J206m58Q332J0270j686J092M559K727o900j4510
8021a0925j1969R931J5627J5609k180J4781M613j908j214j3061j6207L188P397
8008A3682q220o207L335L503Q853m31j0853o642R932l9M332M691r61n636J1686
7993B1025o481k081Q22M947L289K892j1074R332O781q19l592l888R267r998j0599
$$ y = [13236, 15594, 10641, 18142, 25346, 25665, 9986, -4886, -10915, -13717, -14468, -5473, 9334, 19283, 15152, 7034, -847, 1884, 7613, 11260, 13289, 10915, 3394, -14589, -7700, 2211, 12779, 12981, 2565, -6250, -10579, -3972, -2555, 5616, 19831, 13855, 8070, 12809, 9171, 7112, 11904, 216, -14306, -11264, 3383, 2241, 10754, 14896, 15998, 18927, 12151, 9952, 16690, 15768, 13068, 14359, 7051, -5906, 520, 4602, -7583, -15557, -14351, -14809, -6477, 3793, 2107, 3199, 7758, 10485, 3585, -10925, -22894, -12963, 2664, 18273, 16093, 30874, 35487, 33579, 32365, 19304, 3097, 6285, 13682, 5462, -745, 2590, 6093, 14946, 14515, 3662, -2980, 6952, 6913, 11245, 15936, 14975, 9339, 21025, 14544, 12463, 13285, 18232, 21521, 24413, 13339, 22671, 29452, 28633, 25041, 21153, 30420, 20422, 9823]
7978I823J2620N944o407O707L668n690n649P949o287o484n461P892M893M199j572
7963B6145l553r9O657L154j5260J0483l341j6608P35K2157P381j122J1104P427
7949E5260j5760j3469N188K53k723m689J0479R784R343m834j3217j1561N26k410
7935B2170L642J2666J112O143r851o383J2575j2954P88J0227Q704j626q409k3658
7921A5146l277j1900p920J4604K7564j2076j1535J1315M907o552R98J764j59J252
7907B4131N240Q526j0261q044J480p62M952N824K21Q152k240q830r005j3960o959
7892a535o77J1421Q576j0206J990R908p694Q0J1515J2971n451j4452j0582J704
7878G568J692Q219p350M4J4441Q859o921L436k88J201j480k267o834o897K000
$$ y = [9823, 22443, 28387, 21980, 28687, 32355, 26665, 21016, 28965, 22678, 16194, 10733, 18625, 23518, 27717, 26145, 22592, 22493, 29150, 32304, 17044, 27527, 24186, 7578, 8313, 30470, 37851, 36729, 47833, 55260, 39500, 26031, 31219, 31472, 28749, 24060, 34539, 44323, 53666, 48832, 35615, 24054, 24580, 22170, 25812, 38478, 39590, 45733, 35882, 29499, 42074, 29120, 29908, 40135, 48839, 47213, 38804, 15146, 11869, -31, -7951, 6653, 34217, 22141, 10606, 21921, 26828, 20276, 21274, 23038, 22879, 24131, 29371, 37897, 27636, 19592, 21072, 20310, 25262, 31086, 31307, 39459, 37219, 28389, 19384, 5424, -1535, -2212, 9209, 17785, 7579, 9569, 19477, 11783, 11863, 23378, 36349, 30898, 16446, 5864, 7568, 9260, 17479, 10129, 10173, 24614, 33473, 26552, 29988, 29700, 30901, 29421, 27154, 20320, 13423, 15423]
7863A5423J3710j3970n21J8146l837j4542j0473M747L159n221P570r059n955M359
7849C536J5478M166j3951j481j7104J2965M511J6334J1862J1457j4073j6347j2394
7836D959J3961l906l021L833J3677K477n843j3933r793l018p03o266J0104M820
7822G348n073j1705j912J1672k396M750J650j8000r593n302Q984J3617l172j3143
7808b2275j0040K1844K3376j1625k410j466j7162n614L939J7042J7733p239L555
7795I658K398l385j3461j5676J9500J0051L550j3062j3777j1067J3091J5666J341
7782D827P621J1316k618j744o853M247k852o926o05J4376o442k3799j0290L514
7768a6228K198k31n31m780J352N073R762M770m720m838O754J0677Q187M088p213
$$ y = [15423, 29133, 15163, 14642, 32788, 28951, 14409, 3936, 8683, 11842, 6621, 14191, 5132, -823, 3536, 19014, 23180, 9229, 7748, -9356, 3609, 8120, 24454, 36316, 47773, 33700, 17353, 4959, 18920, 15014, 11993, 15826, 29503, 31980, 26137, 12204, 2411, -607, -1310, -7576, 2528, 7348, 2275, -9430, -11342, 330, -2066, 2684, 4334, -13666, -23259, -28561, -19577, -5960, -9132, -22275, -32315, -10471, 12905, 1280, -1130, -2596, -19758, -25372, -21433, -4391, 13342, 6103, 9658, 12056, 8671, -4790, -20466, -966, 9085, 12635, -427, -14204, -25271, -12180, 3486, 4827, 12448, 23764, 21146, 19402, 12549, 16796, 13944, 7018, 6413, 20789, 14347, -9452, -19742, -16228, -14030, -14261, -14792, -19572, -18220, -13147, -3385, 1385, -3335, -8173, -1419, 9258, 17445, 21533, 14320]
7753A4320r650p513P59P661j738M984J1110k791o381n911K2J207n355j4124p361
7738b0761n672k708n718n095J7896R541M407l448P469J003O256R320k426j5461
7724e397n71j3412O171P707Q285J6766R265j1689q535o466o411K824N022j6226
7710a2667J096m788p235l831J5711J6910J3982q089k928n074n768l261j1465o870
7696b4277J1123N721L809m047p64j11J2441j684J709L404j7596m288J8733K224
7682F397n179P548o126p411m304O399J7738R270m028r689J0704j053q042j4619
7668b395n239J350P452J9349N922j1425K024j2310k681J0600m041n993Q990r769
7654A834r449K381j994q541m948Q139j505J5624n014p78L769J6428J7073N24j2597
$$ y = [14320, 4670, -2843, -2084, 5577, 3839, 8823, 19933, 17142, 10761, 4850, 4872, 6079, 724, -13400, -20761, -26433, -29141, -34859, -39954, -22058, -12517, -8110, -11558, -4089, -3086, 3170, 12490, 10064, -5397, -5968, -19380, -13209, -5502, 2783, 19549, 28814, 17125, 8590, 2124, -4287, -1463, 3559, -12667, -11571, -16359, -23594, -27425, -11714, 5196, 19178, 11089, 8161, 3087, -2681, -5942, -17407, -24277, -13154, -7433, -3624, -7671, -8435, -8546, 3895, 2211, 3920, 7324, -10272, -14560, 4173, 6397, 1218, 8766, 2640, -4771, -9075, -2676, 15062, 24332, 20304, 10615, 21319, 20266, 12224, -2395, -7634, -6284, 1168, 20517, 26439, 15014, 17038, 4728, 2047, 12647, 8606, 2613, 11603, 1834, -7615, -5234, -7228, -15769, -20717, -12578, -14083, 1541, -3473, -4251, -482, 15946, 33019, 33543, 20946]
7639B0946p800j1360j3813K923N25RL003k231m067J2821n129j7122r210m3J2843
7624a7705J894j0177M217N327K332M466j10O980P038n306m743K880O721N261N340
7609A4415J0730K546k303j5477j2954j159L132R480L863j2499m139Q946m838k318
7595b575o630j627k031Q021j4900J0226M344O31r571m909l502J0145J4674q874
7581f578j0600P348L172l561k379n073l178o79Q034L717L340j4495O539M005M699
7566e689J0476R303M10r055o199q83o141n866N160J7346q813j2565R954o193j2764
7551b1519k11q202o51L4689L91K278L874j3143j0809M582O415r526J508N729Q528
7536C933K986k524n46j861n668J0721M600j6707J4346m690r737q701N8J4883M880
$$ y = [20946, 13146, 1786, -12027, -9104, -8579, -8570, -5567, -7798, -11865, 956, -4173, -21295, -30505, -30548, -17705, -15811, -25988, -21771, -16444, -14112, -9646, -9756, -2776, 4262, -1044, -5787, -2907, 3814, 9075, 14415, 25145, 27691, 25388, 9911, -3043, -4202, -1070, 8410, 12273, -226, -4365, 4581, -257, -2575, -9205, -10832, -12863, -4842, -19742, -9516, -5172, -4541, -14112, -19021, -22523, -12378, 2296, -6578, -17178, -9830, -6658, -10219, -12598, -17671, -20849, -21528, -13494, -9777, -6437, -20932, -14393, -10388, -5689, 4787, 14090, 14500, 5445, -754, -1637, -7778, -13644, -8484, 8862, 49, -12516, -2562, -8755, -21519, -21730, -29932, -30583, 4106, 4497, 6775, 10649, -2494, -13303, -8721, -2306, -11832, -10324, -4595, 3933, 6919, 4395, 3849, 1988, -3680, 7041, 11641, -5066, 9280, 4590, -5147, -13848, -13790, 1093, 5973]
7521E973N267K370p095J468J0665j5357j447N533L190n98j2975N703p071p94J696
7506c472j008J1019j3827P910K0343J196j8034q641q410p293M963R744J4977L937
7492A3404l402P412p083r396L85R780J6432J859j7241k1101K688K946n007J3259
7478D935L77j0841J018k836L697J292J172k315l854p196K527J6136K0833J3j2664
7463A2294n112p446j3724P875J4869M58l390M810m82O02K634l532L490J744Q268
7448B3358O124p372j2093j657M948j3692j4522n7r045J1928J1327J2353J8479
7435C0079J0598j2950j6575k54P804k724q86n69o270r149m679j244r49j0776M121
7420a4423q634Q520j328J8419J0316O424K551O312j2505J4746k650m515j0763
$$ y = [5973, 11240, 13610, 6515, 7983, 18648, 3291, 1844, 7377, 10567, 9969, -3006, 2697, -4374, -5168, -3472, -4480, 6539, -7288, 622, 20965, 22161, 4127, -4514, -12924, -20217, -15254, -5510, 9467, 13404, 10002, 17414, 10331, 935, 1320, 11100, 27532, 29391, 12150, -8951, -6263, -3317, -8324, 4935, 5312, -5529, -4511, -7347, -3650, -2358, -1186, -3501, -7355, -14551, -12024, 4112, 24945, 24958, 12294, 7182, -264, -13988, -6113, 8756, 9214, 5824, 10634, 10152, 10754, 13388, 9856, 13346, 15090, 23358, 29482, 22110, 10017, 8360, 13308, -384, -14906, -14963, -24008, -12080, -753, 11600, 30079, 40677, 27727, 11152, 10898, 18702, 15978, 15092, 14523, 8253, -896, -5575, -6819, -7768, -18544, -14423, -23057, -14537, -15865, 2554, 12870, 19294, 21845, 28157, 15652, 30398, 27748, 23233, 12470]
7407A2470j0536m48q639l969K621q25L311j355k733J1666p57M318q148m799M164
7392c659j3284j7877R703P816N125L175j0152o59Q261Q76K698R698O877O720j6500
7377a182r665n955O114l584K76J1150m214l235m16j0661p870K114O124o788j99
7362b7991Q44j169M335k546j1959K0941L1539J7403n12o000j4891j6310j4842
7349b1158j850K734P688N153J390o67n70q150k982m192J1824n764J106L170O802
7334e466k271p658M897n862n526J226k512J2004N148O433M596j1256q901p024
7320b2172N126r98J3085k433l133J2275Q411q247j3033j0240J888P937J1182M536
7306D184o907M460R126j5414q911m023n55J4376P727M616r929j1448P15n412q22
$$ y = [12470, 1934, 1486, -7153, -11122, -8501, -9326, -6015, -7370, -10103, 1563, 806, 5124, -3024, -7823, -3659, -16943, -34820, -25117, -17301, -12176, -9001, -19153, -19812, -11551, -10675, -7977, 1721, 8598, 15318, -1182, -10847, -16802, -10688, -14272, -13996, -2846, -7060, -10295, -10711, -21372, -29242, -27128, -21004, -27792, -27991, -27147, -28316, -23981, -26527, -38486, -17545, 13994, 31397, 30885, 24885, 9994, -6316, -21158, -23008, -20274, -12586, -7433, -6043, -6710, -7280, -15430, -18412, -22604, -10780, -16544, -15438, -12268, -5466, -7737, -15395, -10498, -16360, -21886, -20660, -23172, -11168, -6020, 413, 5009, -6247, -15148, -22172, -17046, -18044, -4959, -7392, -10525, 1750, 10161, 1914, -11119, -21359, -19471, -11534, -352, 4184, -2723, 1737, 10863, -4551, -13462, -17485, -18040, -3664, 4063, 8679, -1250, -12698, -11983, -17395, -18217]
7291a8217N103J1026O665j8404q204Q200L719K534j60O36O061Q807Q678j9072
7277b628k2402J1888Q708O526o067j941m026J4261J7j3300m435N447J1974l434
7263E88k2367p678J6986J5904r739j366J0076O108j378J0249j2205k951n622K350
7249a045J2232N315J248N456j0441k7535O47N312Q967r669l252o062k268J6073
7235e022P881m665r340m559N673J0256M459N528o142L073N53j086k236L06j4520
7220i841k87J3917J473j899P176m089Q197O380K521J42k1165k0584l641M387Q060
7205i253K1001O318k22j462j2981j1673q055Q964O312k229j3469N327R052j1662
7191a4032q851Q665N726L961R656r032j097P7j823J181M272r384N088l466j4131
$$ y = [-18217, -13114, -2088, 4577, -13827, -22031, -13831, -10112, -7578, -7738, -7102, -1041, 7766, 16444, -2628, -25030, -13142, -4434, 2092, -3975, -5916, -9942, 4319, 4336, -8964, -13399, -7952, 4022, 588, -21779, -29457, -12471, 3433, -6306, -7672, 2404, 8512, 7134, 17383, 5178, 2227, -3395, -1045, 11187, 16502, 17750, 23206, 12765, -14770, -14123, -8811, 156, -9513, -12765, -18827, -21095, -5022, 2859, -1806, -11146, -15705, -10032, 224, 4683, 10211, 4069, 7142, 7695, 6609, 4373, 4679, -9841, -10128, 3789, 5262, 3363, 10539, 6450, 14647, 21027, 23548, 23690, 2525, -18059, -21700, -17313, -9253, 11748, 18066, 17844, 16382, 3401, -8272, -16327, -7363, -1051, -3280, -16749, -11422, -2370, -14032, -22883, -14218, -8492, -4531, 5125, -3907, -5004, -4927, -6750, -5569, -1297, -10681, -5593, -9059, -23190]
7176b3190O185J951O917K839L362J1947K637j4436j54q165K739O931p097L9P916
7161D21p501r554Q75O047m368L625O213J668K319n762L656r90L381k697n097k341
7145a0105o08k115r24J6881J1559q533K78j1894o157m273L114K800L115j714M558
7130d018M615J1368j2738r473J1030J3387M461K059R86o737O664j4786o157J084
7116A745r554Q81J874J6j3592m111m253J250R266j0032j1218k054j0334J5676
7102c4440K5800J2797L016J0079r6j1003O28N158P596j5469q763J619j3419J205
7088a5292O938j2310j168J0319L636r48q93N497J0656J163j0455j7175l294J0335
7074a2991m496j6274L93Q597Q597L052L873j718K645J05J0728M972K522k182R75
$$ y = [-23190, -17005, -15054, -8137, -5298, -1936, 10011, 12648, -1788, -1942, -10107, -7368, -437, -7534, -7495, 421, -7080, -16634, -15759, -9712, -14080, -10455, -4242, -2574, -255, -6017, -2361, -3351, 30, -2667, -7764, -10105, -10713, -12828, -13752, 3129, 14688, 6155, 6433, -5461, -11618, -15891, -12777, -9977, -6862, -8576, -4018, 597, 11965, -773, -10246, 784, 14171, 18632, 20691, 21677, 14940, 21604, 6818, 661, 1745, -7809, -6928, -5054, -5038, -18630, -22741, -26994, -25744, -16478, -26510, -37728, -39782, -50116, -34440, -8640, 4157, 7173, 17252, 17156, 6153, 6781, 11939, 19535, 4066, -4697, -3078, -16497, -15292, -8354, -20664, -21832, -11513, -7877, -8825, -9718, -4221, 6435, 7598, -2857, -20032, -23326, -12991, -17487, -33761, -33368, -24771, -16174, -13122, -9249, -10967, -8322, -8217, 2511, 7483, 10005, 7823, 8798]
7059H798m107n643r486p300K768Q6m415p620N713K453m160j95j1248m626N409
7044c3573J1782J0273R466J432K281j079J24j4399j1575q929N875M658k597J10
7030b6151J5902J8761P616m937q794q5k602k318Q341N327m615l048q079q666R311
7015d037L340o850j145J1933J982J8753k886n072K704q972j4992l810m724R337
7001d439k373J677J285P410M057K022m550j2411j288l97L635P295P234J466m382
6986F241O456J212L521l616j6726n013L017k668M423R979n569q366j0799K481
6972a5427O943Q815Q302p370j1902N19N263L436r450k570L55K92P741r203K822
6957a1434K0609K344o388j532j21k87m751j723K831M174J418j1934M585L270M720
$$ y = [8798, 4691, -952, -10438, -17738, -14970, -14884, -19299, -26919, -21206, -18753, -22913, -23108, -34356, -38982, -33573, -21791, -11518, -2052, -620, 1661, 582, 706, -13693, -25268, -34197, -28322, -23664, -26261, -26151, -10249, 8512, 16128, 11191, 2397, 2312, -290, -2608, 5733, 11060, 6445, 3397, -4682, -13348, -4037, -697, -7547, -8692, 3241, 5223, 23976, 21090, 16018, 18722, 9750, -5242, -9052, -13776, -4439, -6812, -5135, -3850, 3560, 7617, 9639, 5089, -7322, -8610, -9007, -5372, 1923, 9157, 10623, 6241, 12697, 13909, 17430, 13814, -2912, -7925, -4908, -7576, -3153, 6826, 1257, -7109, -17908, -15427, -8484, 331, 8633, 1263, -10639, -10120, -4857, -1421, -10871, -13441, -13086, -12794, -5053, -14256, -11434, 9175, 11519, 5131, 3599, 3478, 3191, -1560, -3283, -452, 3722, 5140, -6794, -2209, 1061, 5781]
6942E781K987p490r882j645J2173J3017l306o388j5345m858M342o093k259J86
6928a8780L073J2847k327J0978N247j7050o205N40M363K282j9330j3387L911J3573
6914b0265P165N19K941J225o181n447q60P067J3997M903N344p428L045P284m283
6899I026j0497J2725J1163j8967L951L264k707n487k913j9513m900R263R868P517
6885A793O022r869j3387J179q80O491R741L023M990j1144k2049n970J6474J2699
6871h87k204n621Q74r661J0397K0651J789j2142O160m712p313o643m326R953R781
6856F096Jj7642J0228r478m118J418K70k399p568l026J1855M976J1931p586j6932
6841b1974P886L477M136m871o389j107p039r325N533K778M909J5434Q169K459
$$ y = [5781, 8768, 1278, -8604, -10249, 1924, 14941, 11635, 5247, -10098, -14956, -10614, -16707, -18966, -18780, -15707, -2860, -5187, 5791, 11038, -6012, -12217, -11677, -7314, -5032, -24362, -37749, -33838, -20265, -13100, -12581, -9640, -8415, -14596, -20043, -20903, -13836, 161, 5064, 10408, 2980, 6025, 13309, 9026, -1471, 11254, 22417, 3450, 7401, 10665, 7958, 2471, -442, -19955, -24855, -15592, -5724, 1793, 7815, -2054, -15441, -14262, -15142, -8651, 1090, 4113, 9103, -2041, -24090, -30060, -13586, -887, -3091, -8712, -7838, -17499, -7102, 13549, 15338, 3196, 9356, 4644, -2669, -9312, -13638, -3685, 6096, 6097, -11545, -1317, -10795, -14913, -13495, -13225, -15624, -23192, -26218, -14363, -9387, 2544, -5042, -21974, -14088, -10611, -6475, -11346, -17735, -18842, -25881, -35206, -29673, -26895, -21986, -6552, 1617, 4076]
6827D076o080k693k063O670J168o056M665q549j0316J2380J0226K377r144q407
6813a1746n744J4019N790K799N536j068j1759n482o960j1067J0447m077J589M68
6799a7255L052J919J7685Q329j4286J106J947J433j0532J0755k564j1674K226
6786g859M880J2425R254j1172j9923K402J5209o93p845n043j83M804J8373J1766
6772B6395j1851o7j2238j5232j124J9250m891j4440Q426j735j6944R35J3574N946
6758c996M643N295J0256J4018p00j1734l92j903j0157j4606O518P983Q438J540
6744A5203j1952m62k279P462J1300J0848p565j4545j3990P913O599M979j14r995
6730C402L413J404j186M751L467J0895K986j0675p716l592M985J0753J1777j4508
$$ y = [4076, -2004, -4697, -6760, -90, 1078, -4978, -313, -8862, -19178, -6798, 3428, 5805, -3339, -11746, -17490, -3471, 2319, 5118, 10654, 9586, -2173, -7655, -14615, -25682, -15235, -19312, -17723, -17255, -14203, -12284, 5401, 13730, -556, 550, 2497, 3930, -6602, 4153, 1589, -10085, -7859, -2979, 9446, 18700, 7528, -12395, -9993, 5216, 4523, -3322, -8365, -8548, -3744, 14629, 26395, 14544, 14477, 2239, -12993, -14117, 5133, 242, -14198, -5772, -7507, -24451, -23516, -9942, -3996, 647, 5942, 16198, 30216, 29516, 17782, 17390, 15487, 5330, -9276, -2758, 5225, 13663, 15203, 3251, 2789, 510, 7972, 19272, 30120, 22555, 8010, -5980, 1933, 8532, 13511, 13397, 3402, 6815, 8219, 7033, 11784, 15251, 26146, 29132, 18457, 10741, 7149, 12134, 22887, 34664, 20156]
6716B0156m690J6161O489K326K2928K5620N115L951N813k758j2417k4440j4709
6703D9545o882j2315o38J315K120N421K724j0932j6573p256j2618q587M437P537
6689b702K0961K641j2709Q936p069p30Q813J0816k338k647J956O880n391j934
6675B5483j039j2134o302j1336j2316M496j394l796J1394J588n4k027k558K246
6661g749J932J1218J5109j0617k4022j8092L40O343j0177l348K643R682J6087
6648a0651Q840J4180j1869j9942q107J0047R876J1036q301j8330j2112O251J0869
6635a8213J3562J638j24J1373J748L227n044j0049j795N728J6297N233k981q031
6621A2569p172j854M077j7282j0318M595K6520J4287j7667j8341L90P695L892
$$ y = [20156, 15466, 31627, 38116, 40442, 63370, 88990, 94105, 98056, 103869, 101111, 88694, 64254, 49545, 42663, 30348, 29710, 31025, 33145, 38566, 41290, 30358, 13785, 6529, -6089, -14676, -10239, -2702, 18259, 20900, 8191, 17127, 10058, 9328, 18141, 28957, 26619, 23972, 25928, 32808, 27417, 25483, 24444, 12310, 6008, -5328, -17644, -13148, -14542, -18338, -6944, -5356, -5410, -7437, -9995, -7749, -5817, 5401, 20510, 9893, -14129, -32221, -31881, -25538, -35715, -39063, -36420, -26738, -10651, -1811, 12369, 500, -19442, -27549, -17502, -7626, 3410, -4891, -23221, -35333, -29082, -18213, -4651, -3013, -3137, 8236, 9984, 13211, 8167, -1882, -3677, 2051, 18348, 23581, 20600, 12569, 5397, 3543, 7620, -9662, -19980, -15385, 11135, 25422, 7755, -10586, -10196, -2501, 1391]
6608A391n775l849m622r99m492J3958O410j4872p017O493j900j6204n574R060
6594b7992J3738Q974J1451n982j6244p587J308k246k296J2064Q242J3125J4278
6581B0833K247j3490j5723o400J926J022M670J1281j3920j5439M327R874q240
6568a7032L718l312K225r113O003J9081R059l152N825j2604q995l478j11j490
6554a3376M523l325l294o405l981M065L355k879R718M518j738j1516j366P000
6540a4701n055J885O89j2914P208K3255K1677j6864j0874l680L968J2916k570
6527D940j2375K620N504O882r215j583n926L593j529j410N466n206q33p752j2166
6512b8990o346J873M034J7614Q003m976K240J2314Q507J90K150o337L647n649
$$ y = [1391, -4384, -8233, -12855, -13854, -18346, -4388, 2022, -12850, -19867, -13374, -15274, -31478, -37052, -27992, -14254, -5280, 6171, 189, -16055, -23642, -22334, -24580, -26876, -14812, -6570, 6555, 20833, 23080, 9590, -6133, -12533, -10607, -9585, -4915, 6366, -7554, -22993, -18666, -8792, -17032, -13314, -16626, -14401, -23514, -17511, 1570, 10629, 7477, 13302, 698, -8297, -11775, -11886, -13376, -8853, -12178, -15472, -21877, -25858, -21793, -18438, -21317, -11599, -7081, -8819, -20335, -21701, -14701, -19756, -17871, -17182, -30096, -22888, 367, 22044, 5180, -5694, -9374, -5406, 7510, 4940, -7435, -4815, 689, 7571, -1644, -3227, -9153, -5560, -7089, -8499, -3033, -8239, -9072, -16824, -28990, -35336, -33463, -29429, -11815, -3812, -8788, -6548, 5766, 14273, 14463, 16613, 10276, 13923, 8274]
6498H274j4481J0295N451Q790L045r063k1777j4712n830J711m34M675K818P978
6484a3260J0952J9082n54n60j9192k961p732M125K400M838J010P88j4040n234
6470b0338M212n214j0900j9396j799K714K0674K1800J103J1462o539r92K56j1217
6456a4174q93p349j464J2066R646K328r01k1713m745J072N049K762m301j1964
6442c4581L632J1722P505L217K215k220j1091K518K038J3150l19j008J2260n574
6428C464j105L096J2606N690m792j625r875j0400n30R041p052q262q360M510q910
6413b2504N749j2050J4268J5258J2377O513L094j7938n071K200j1356q187K14
6400a7433R145R829J16m341l508M642m416R514J4608j7730j4031Q783O047j297
$$ y = [8274, -6207, 4088, 9539, 18329, 21374, 12311, -9466, -24178, -30008, -28297, -28731, -24056, -21238, -13260, -2308, 16774, 16220, 15660, -3532, -6493, -14225, -10100, -7700, -2862, -1852, -1064, -15104, -20338, -16126, -21340, -32240, -51636, -53435, -50721, -30047, -8247, -7144, 4318, -2221, -3213, -2957, -14174, -15067, -22416, -23880, -11814, -2168, 160, -741, -22454, -27199, -26127, -21078, -18316, -22617, -34581, -30949, -19227, -11722, -8505, -6290, -8510, -19601, -17083, -15045, -1895, -2214, -3222, 9038, 3464, 2359, 5455, 18061, 23751, 18959, 17334, 7459, -2941, -3471, 5570, -1482, -9744, -18104, -13594, -22504, -16755, -28805, -14537, 721, 13098, 19611, 22705, 4767, -304, 1896, -9460, -17647, -17433, -8288, 1541, 1657, -2684, -6192, -1550, -5966, 3548, 18156, 426, -13605, -4822, 1225, -72]
6386g2m351o429P973N009J1850K872k545k2505o840J1404J4982n696l49N803J651
6371A2757k041l736o353o78n600L936J4272K772R321Q04p772j9061m550J680P309
6356C060j0673k618K143k363m90N273J0570j702q505N442j1681l604R300M018
6342a830l422n12m69L253q467R987L671k558N675J5733r453j0339J496n946l647
6327f828J3917J3183q188l614r8J7840r67l434o856p634q746l016L947J3730l632
6312I604k713q661k937P110n934j0221P142K1512P944k930M688r707q426o363
6298A08q895k61P980L124m959j1190q397J0464R599N853K657m130p988q554j87
6283a4776N328j898J646o916M3p998q260J0911K2440p677M156J2029j0310j2604
$$ y = [-72, -4423, -10852, -2879, 2130, 13980, 16852, 14307, -8198, -15038, -3634, 11348, 5652, 5303, 11106, 12757, 10716, 6980, 627, -51, -5651, -1715, 12557, 15329, 24650, 25454, 17682, -1379, -5929, -4249, 3060, -7613, -10231, -8088, -10451, -10941, -5668, 4902, 3200, -5305, 137, -11544, -15148, -5848, -1830, -5252, -5764, -6233, -2980, -11447, -1460, 2211, -347, 5328, 21061, 11608, 1269, 2765, -3181, -6828, 7089, 20272, 12084, 8470, 8372, 26212, 25245, 21811, 14955, 7321, -1425, -4441, -494, 13236, 9604, 6891, -1770, -4707, 2403, -3531, -13752, -6610, 14902, 22846, 19916, 24604, 14897, 6471, 108, -8787, -9048, -1068, 2056, -2903, -14093, -22490, -12026, -2427, 3426, 6083, 1953, -6035, -14589, -14776, -9448, -11346, -9700, -16616, -16573, -24571, -32831, -21920, 520, -7157, -3001, 9028, -1282, -13886]
6269a3886j3079K581P211L316o432P750N302N168J6613n211k0751o627J3908K6455
6255B2318J128p840j4587l559m281j248j1177O37m22j2385Q781J7224R281J0630
6241A4500p406j782J6736j2424n41J1989k827n834p930j0011n738J625N348R436
6227E141j0415J966o016O092P777R838J4849N810p286J816l484k49m559j5140
6213F140p975r956M560J7948l85r564N760N298j1971K38n11N683k686p974j9520
6198b4915p497M778J1338J3418n855p830p279o495p457l003R530J5201J1986J6504
6184A2424N078j7462R285n227k079N016n631Q642j0169J462k649K918J532O192
6170I332j417q984q847o865J1827J501L140p515k761P03J1855Q610o834r725M928
$$ y = [-13886, -26965, -24384, -17173, -13857, -20289, -12539, -7237, -2069, 14544, 9333, -11418, -18045, -4137, 22318, 23446, 15606, 1019, -2540, -6821, -8069, -19246, -18609, -19031, -31416, -22635, -5411, 3870, 14500, 7094, 5312, 22048, 9624, 9083, 21072, 18245, 12411, 4481, -5530, -11268, -9643, -4295, 5141, -5274, -3308, -9324, -3232, 4545, 14383, 29232, 35042, 27756, 29572, 26088, 25839, 21280, 6140, -1835, -11791, -7231, 10717, 10332, 768, 6528, 11826, -145, 93, -418, 5265, 2579, -5395, -24915, -32412, -27634, -16296, -2878, -8733, -16563, -23842, -30337, -37794, -40797, -31267, -16066, -4080, 12424, 17502, 40, 9325, 4098, 2019, 7035, 1404, 10046, -123, 1339, -1310, 1608, 3140, 9332, 7915, -1069, -9916, -16781, -4954, -3453, -313, -7828, -10589, -9886, 1969, 10579, 3745, -5980, -1052]
6155a052J3940j0149j0605o179K090K824P057j0707o144M701L480M397j1448J0390
6141g405J5654J5967j122j2243j0832j0809j962J7385K265K744K374j19J2427
6128B4324j2631j6826K328P292m75j1646j1151J408Q030K337P130j1536j3385
6115b4801J0099J0930L610J6902J2167O974q999j7245r974l139J023J525K1723
6102B0795N278Q52j2964j834J5401O748j3051O863j3476o939o2n671l810L809
6088A939m602J575o203M434J373k254J7255J0980r364o261J2869J44j0207r503
6074B175r642j6235R366p11O471L967m42l956l474J3331J0825j1197k5629Q947
6060a6204P223J400J1700N023l253k399n549O796J0207J194k858j0288o778o034
$$ y = [-1052, 12888, 2739, -7866, -14045, -11955, -9131, -2074, -12781, -18925, -14224, -10744, -6347, -17795, -7405, 8249, 24216, 23094, 10851, 19, -10790, -12752, 4633, 6898, 9642, 12016, 11897, 24324, 11693, -5133, -2805, 4487, 4012, -7634, -18785, -17377, -9347, -7010, 120, -11416, -24801, -14702, -3772, -162, 16740, 28907, 35881, 26882, 9637, -337, -3476, -2453, -928, 20795, 26073, 26925, 13961, 12127, 27528, 34276, 21225, 28088, 14612, 7673, 7611, 1940, -1870, 1939, -2663, -1088, -7291, -2857, -1484, -3738, 13517, 24497, 15133, 8872, 21741, 21885, 11678, 2175, -7467, -23702, -14336, -15047, -8576, -4609, -5051, -9007, -12481, 850, 11675, 478, -25151, -16204, -8981, -7581, 4119, 9142, 5889, 3490, -2059, 4737, 14944, 16138, 13280, 2992, -3786, -9820]
6046i820j691j638m328j640o120R995k267j0363r437L248J4530M42m053O414l109
6031a9837L837Q094N655j4240o867K0144K0857K329j9988j2790j987m62J4348
6018i07R272o958n729J1404L186j3359k43P796K626j3949p183J334K622o994Q6
6003a6996J0279M014j0800J9198R901j553j2876L948O132j71j4156K734L673m514
5989a187m942P323q725j3168K468M132N475m5J968n241Q874m126l427J963o248
5974a4906k114J065j280k813o826J7306K4853q038j2178Q325J2693O490m870L382
5960B1089M364j5643n480M567K958N672j8134j1643K071K315M116L032r227m330
5946a4273P048m956M453l544K470J9279K288m782p096j0767p468n639L283m512
$$ y = [-9820, -11511, -13149, -17477, -19117, -25237, -15242, -17509, -27872, -37309, -34061, -19531, -19089, -23142, -16728, -19837, -16000, -7906, -2251, -16491, -23358, -3214, 17643, 19972, -16, -12806, -14793, -15255, -907, 8365, 1407, -4322, 7082, 10268, -3091, -3334, 4462, 7088, -6861, -14044, -12710, -10088, -17082, -16996, -6717, -2703, -13503, 5695, 15596, 14043, 1167, 5115, 11247, 11076, -3080, -346, 3327, -1187, -6129, 1194, -7531, -20699, -18231, -14099, -8624, -8669, -6701, -11942, -3068, -7194, -10621, -8658, -14906, -17020, -15955, -17235, -20048, -26874, -9568, 15285, 7247, -4931, 3394, 16087, 22577, 17707, 21089, 25453, 9810, 4330, 8897, 11855, 17527, -607, -12250, -10179, -7864, -3748, -716, -9943, -14273, -7225, -12181, -7728, -11272, -8802, 10477, 12765, 7983, 887, -9880, -17348, -22987, -19704, -24216]
5932b4216K270j932R489R191J678k402O624L662p561K537J246L788K439P977R74
5917A5764n265n210P829R738k0368j5411O070Q733J0390j0972j7240o657M240
5904a8359J0531O073L13j2732O341j309M464J1399m806r957m968j2061J1068J2239
5890a764L916P554K968m810p76p632R59j7604p275J6003K938O579P746k703n407
5875F92R03p340J3062L26j39q041l3475j2991K4553K2715L469m703K991M117r392
5860c253p959o311m927J529N299K3998o074r296k181R993n161l911J565P54O226
5845B91J0750o617j4080r327J2185O678j0741j763M073l990K57Q677M012k194
5831a789j4114m739R402L36N619K183M467p295j1714k028M133J1540j2363L562
$$ y = [-24216, -21946, -23878, -14389, -5198, -3520, -5922, 702, 4364, -3197, -660, 586, 4374, 6813, 14790, 15764, 10499, 5289, 13118, 22856, 2488, -12923, -6853, 1880, 12270, 1298, -15942, -22599, -18359, -7828, -1755, -1442, -14174, -7833, -9142, -4678, 6721, 1915, -8042, -13010, -25071, -14003, -1764, 2152, 9706, 12674, 7864, 7088, -544, 415, -17189, -24464, -8461, -5523, 1056, 8802, 6099, 692, 1595, -5745, 7317, 7643, 7504, -537, -34012, -47003, -22450, 265, 3734, -969, 2022, 6139, -3253, -11212, -17523, -22450, -20921, -15622, 8376, 2302, -6994, -9175, 818, -4343, -8254, -6689, -5935, 291, 11041, 4424, -9656, -18983, -6798, -120, -10861, -12624, -8551, -12541, -12284, -3607, 405, -1789, -15903, -20642, -11240, -10904, -5285, -3102, 1365, -5930, -17644, -19672, -15539, -3999, -16362, -12800]
5817a2800J0044J498j9188o916J2633j162L089J5582j962L694J1456m697j3058
5804a787M408j801n542m102j048l042l660j0711j3707l124J7137J0737J2850J7047
5790A3655J3182K331j2787j773p431j1630m646o571j1635J2456M973q06L534L827
5776c321J3741o029K69N032J1010m429j6389j805K630l909n848M543j451m246
5762a0202M30L897M584O827j690o248O505m497k634J1608J3621K123M915k64N124
5747C4099n340j2579p333j1348K069k850j449L104j7m746l204J0141j740j7531
5733a8724K301l612J552J1550O583k795j3285p676M366L219o171j844P079L325
5719a4132J069R859l889k978O838m665j909K503J053O955l536o929J0778o637
$$ y = [-12800, -2756, -1258, -20446, -27362, -14729, -15891, -12802, 2780, 818, 4512, 15968, 11271, -1787, 2621, 820, -4722, -8824, -9872, -12914, -16574, -27285, -40992, -44116, -26979, -16242, -3392, 13655, 26837, 29168, 16381, 14608, 7177, -4453, -9099, -15670, -27305, -14849, -9876, -10682, -7148, -3321, 10420, 4391, 4660, 9692, 20702, 16273, -116, -1921, 709, -3200, -9048, -4505, -5956, -10202, -9772, -5875, -1291, 5536, 3846, -2402, 4103, -394, -3028, 8580, 22201, 24324, 29239, 28975, 34099, 28759, 16180, 8847, -2501, -432, -3282, -4731, -1627, -1644, -6390, -9594, 547, -1193, -18724, -16423, -20035, -18483, -6933, -350, -3145, -16430, -24106, -19740, -16521, -22692, -24536, -17457, -14132, -13063, -3204, -7093, -10071, -3233, -7898, -9807, -7304, -6251, 704, -2832, -9761, 1017, -5620]
5705e620j1927j1291j1233J3983J7281n682j697R28Q852M849j1949O415J2000
5692D909Q84M465n296j7210J0673p300m988J2969L631l095j0440k715k734J1628
5678d619m045k268q099P908P865m606q682r523K011J9976N82o897p536r153J0749
5663a6337J479m750R89K1001N590k6945j3810J4030J2122O794L369O114o405m047
5649h06L991j1928j134k934j0377M568J0652j683J4342J284j6333j065M727P90
5635e906k788k7698P513K1389N438Q763P928K331m247q037J1379j0356l093N337
5621G953N101L184J255j2087m040l320N437O046J0145o833j2650L19K475r445
5607f460o744l879N833K823N165K524K183o171Q145j0033k1921J3616P434M048
$$ y = [-5620, -17547, -28838, -40071, -26088, -8807, -14489, -16186, -15258, -6406, -1557, -13506, -7091, 4909, 5793, 10258, 4962, -12248, -1575, -8875, -13863, -894, 2737, -358, -10798, -13513, -16247, -4619, -8664, -10932, -19031, -11123, -3258, -7864, -16546, -26069, -24058, -4082, -3500, -10397, -17933, -27086, -16337, -14858, -19608, -18619, 2382, 7972, -18973, -32783, -18753, -6631, 163, 3532, 9646, 3241, -806, 3185, -8743, -9877, -12811, -23188, -18620, -7968, -9651, 4691, 5975, -10358, -11423, -6696, -5906, -8694, -36392, -28879, -7490, -2052, 6711, 14639, 16970, 12723, 4686, 16065, 5709, 2616, 7953, 13054, 16238, 17493, 5406, 1366, -1954, 3483, 9529, 19674, 12841, 191, 510, 2985, -6460, -13204, -17083, -11250, -8427, -3262, -738, 1445, -4726, 3419, -6614, -28535, -14919, -7485, -3437]
5593c437l172n55r98N396J284M230k3235j978O280m144M735Q790P26L041M955
5578A918j207j610O683Q274M167q311j3521o307J4060O911o833m484L482R324
5564A2546J2700O892p280j0957p978O908p950k175N625O250J99l789j6257j3175
5550a8441l164M995o923N549l47J6578J2948l716o153k567k290j636M815j143
5536a495j6591J6407J581j5464k757J1754K089M132j5059o025J3097n829Q187
5523e973j0029j1960Q709J1895Q963n051J606J682l473J877P286P97N132N741
5509A7202l527k087j1029N081L533l658n784j0354O389J3784k866j0250k129O416
5495G21n130M482J5051o074p221o211o797q961K115P117J988O962J0536L289J3339
$$ y = [-3437, -6609, -7164, -8162, -2766, -1482, 2748, -20487, -22465, -16185, -20329, -15594, -6804, -6078, -3037, 1918, 711, -899, 5784, 14058, 18225, 9914, -3607, -9914, 4146, 11057, 4224, -260, 3222, 12546, 25246, 32138, 24858, 13901, 5923, 12831, 4881, 2706, 8331, 14581, 14780, 10991, -5266, -18441, -21605, -16610, -23533, -17984, -18331, -1753, 11195, 7479, 1326, -1241, -3531, -5167, -352, -1495, -18086, -1679, -98, -15562, -18319, -6565, -4476, -344, -15403, -21428, -8331, -14160, -5973, -16002, -27962, -19253, -7358, 1605, -3446, -1840, -158, -3631, -1754, 5532, 6329, 11461, 17202, 13675, 11588, 559, 5640, 9173, 5515, -269, -10623, -4234, 9550, 6684, -3566, -5695, 721, -4409, 73, 15124, 9050, 1829, -4382, -11179, -20140, -18025, -10908, -8920, -1958, 8578, 11867, 25206]
5480B5206P167J819r945k2425j2424J3616k337l398m364j4577O379Q796p683q526
5466b2696l718N377J0355K263M683L093Q443R05L186J074r002l489J0904M125
5452A5503j0827k606o460Q625K1806n183o728j0305j5702P914M480l280m209p544
5438a4516Q837n712r633K1480n378J952J37r935K645q325n724J1956J3073R401
5424A0258k114j2626p732L873J8151Q341l592j0727j4560n413P702L128P585k148
5410A26q255L611L146j7545k111Q181l944O395l549O825j0405j0548J5484J3864
5396A275K161J9811Q622m285j4247j210r822j7524j402J1638o752r141K413j4136
5382c2599J1243K5257N128j2194j2242o914N334l718r788N988K2424J1732n428
$$ y = [25206, 32373, 34192, 24247, 1822, -10602, 3014, 677, -2721, -7085, -21662, -15283, -6487, -14170, -22696, -26414, -21037, -10682, -8419, -3736, -643, 7800, 8705, 11891, 12965, 3963, 474, 11378, 15503, 4676, 2070, -4390, 4235, 26041, 20858, 14130, 3825, -11877, -3963, 517, -2763, -6972, -14516, -5679, -11391, -21024, 456, -4922, -2970, -2833, -12768, -10123, -18448, -24172, -12216, 857, 10258, 8144, -4482, -12214, -8341, 9810, 18151, 14559, 3832, -10728, -16141, -8439, -5311, 2274, 126, -8129, -4518, -1372, -18917, -21028, -12847, -16791, -10396, -13945, -7120, -17525, -28073, -12589, 1275, 3436, 23247, 31869, 27584, 13337, 12127, 2305, -15219, -16621, -4983, -11735, -20876, -18463, -32599, -21356, 3901, 9029, -3165, -15407, -22321, -16987, -20705, -30493, -24505, -2081, 9651, 4223]
5369D223n939m046Q572M332J169j6400j9376M24J3158Q833J995j115J605l122
5355e687J393o791M284m924R362J985j618J572J2528J3710j106o759l798o552
5341G599k4377j408L163L834O238J0072m258q438k821J140J0664L582K910l946
5327C954K256l464j746q996K739J1445J2472j0954P758R249j4453j1227m657n371
5313a0995L840l855J1841J521j3473J3305J4410o826m039j1532j5422O604L370
5300a1251O61M709m030K006Q594j2932k099j1541L617J2355p121O27O217L368
5286f820M661l774o557Q91l821j1932O824J8517Q386R962M188o62N501l195j0112
5271A2057j3171j6018j1952r946m1M232P942r950n827J233K3897L840k226J764
$$ y = [4223, -1716, -5762, 2810, 7142, 8311, -8089, -27465, -27041, -13883, -5050, -3055, -4170, -2565, -5687, -4294, -11085, -6801, -11725, -2363, -378, -1996, -424, 12104, 25814, 24708, 17949, 14151, 7599, -16778, -18186, -15023, -11189, -4951, 5121, 863, -7575, -10396, -9256, 1408, 4990, 7900, 3954, 6210, 2746, 1000, -7996, -5257, 6188, 18660, 7706, 15464, 24713, 10260, -967, -5624, -10995, -7155, -11010, 831, 2352, -11121, 2184, 16594, 9768, 5729, -5803, -21225, -14621, -11251, -10590, -5881, -9911, -7905, 689, -12243, -14342, -25883, -22266, -9911, -17032, -16405, -10188, -6820, -2159, -5933, -12490, -11599, -15420, -27352, -20528, -2011, 6375, 16337, 20525, 19863, 25364, 22169, 12057, -1114, -17132, -29084, -39030, -39071, -34839, -26897, -36847, -42674, -41441, -17544, -13704, -15930, -14166]
5257a4166O788j0186J1879R054j6463n437J0614P390K0716R438Q257o825m959
5244B6100l423q736j2533j305J868P846m428r775j0079n49Q758M690k083p516
5230a1165j837m610J0165J5449J1717j1758o411M27Q177n359k060J4407j2034
5217E108j1653n922l733N752J2043n248o766n103n388m371M334M146n961P070
5203a5692K0365J1777j1448r928N041q495k738k056L984o718p007m904R939R651
5189h229L39J3018L830q745j2496M917O830j0439j4340r032k435J6962Q351L486
5175g983P6j724J2340J5913p598K727n802l063l284j0661M990N761K560L320n864
5160A708p261P095J1868J762o305M031n322j378P561J322j2267o227p255j3038
$$ y = [-14166, -7378, -17564, -5685, 3369, -13094, -18531, -7917, -527, 20189, 29627, 37884, 31059, 26100, 22677, 13941, 1408, 103, 1971, 9817, 5389, -4386, -14465, -15014, -6256, -1566, -3649, -11165, -13002, -17612, -7447, 8002, 19719, 7961, 1550, 1977, 10154, 4795, 2735, 17142, 5108, -6545, -12467, -16200, -10448, 1595, -3653, -10419, -15522, -20910, -25281, -20947, -16801, -22762, -15692, 4673, 16450, 5002, -4926, 115, -8380, -11118, -13174, -9190, -15908, -22915, -27819, -17880, -8229, -7890, 5128, 8958, 213, -12283, -7366, -536, -10975, -25315, -34347, -36782, -19820, -11469, -7983, -7907, -9631, 2709, 18622, 11024, 13751, 7949, 4886, 1602, -9059, -4069, 1692, 4252, 7572, 1708, -5553, 1542, 13410, 15172, 8867, 12898, 7576, 6198, 13759, 15081, 2814, -3413, -10668, -23706]
5146b3706MJ6256J2669l293O053J32j0464k2301q871R532N342J3181p812J1463
5132a815P806q266l371N225J748q22j733q948O947j1427k5798O376J0600l6J6350
5117g164J0216J223p868P872L511j0135j2496q886J3169N483M13N944Q901j1178
5103i95j778L734p396o235K0574L074r000j1969o156K0582n529L460L172j1725
5089f187j5483p731n728Q886J4253J1425k126j0992n090o223L873Q122J3846J3249
5075A4094p916q362j7741m256J232O816P8J666L784P532n22J3275K667N273N83
5060A8203q888j3576j6572J979J1329p202p581J992M222P172M138j831N583R045
5046H013k940N17r682k7524K088J6220Q370r150r909Q224m697P550n697q46L634
$$ y = [-23706, -23702, -7446, 5223, 1930, 7983, 8115, -2349, -24650, -33521, -23989, -18647, -5466, -13278, -1815, 5991, -2275, -5646, -421, 1327, 505, -1228, -10176, -3229, -14656, -40454, -34078, -23478, -23514, -7164, 3052, 4275, -3593, 4279, 7790, -2345, -14841, -23727, -10558, -5075, -4662, 1282, 10183, -995, -2773, 961, -6435, -12670, 7904, 10978, 1978, -9991, -16147, 4435, -1094, 2366, 5538, -6187, -21670, -29401, -35129, -26243, -11990, -565, -2691, -13683, -18773, -24996, -21123, -13001, 845, 14094, 6178, -2184, -19925, -24181, -22949, -16133, -16055, -14389, -10605, -3073, -3595, 9680, 12347, 17620, 18203, 9315, -4261, -20833, -18854, -7525, -14727, -22308, -20316, -16094, -8922, -4784, -6615, -1032, 8013, 5073, 5590, -4092, -31616, -29528, -13308, -4938, -14088, -23997, -15773, -20470, -12920, -18617, -19463, -15829]
5031a5829J763K440l629l074K505K0125N263j390N916J7411j0974j1829p454k73
5017I71K449R256J907k603j7588j2019N400k030J2532j413j6391m985P888J7582
5003I56J3199n235m898K085q172j1595L244J7645J114n573j1692n896j6774M682
4989b6910J4896K5693J1499n775j2521N788q996j3060p497m402k279M287P581
4976a1696m876J5227L390n477n606o583K379n878R600J0001r404j5968k524L763
4962b3652M678J0560j974R202j2402n809J2663J2064Q8j6483k1628J0870J1875
4949i948O611l234r293N569Q681q63q214L906P386M233O687J1497j9108j0331
4935f421r4j9340l209J5898r58N360p46R105P693P812o158j0179o247M850L209
$$ y = [-15829, -14066, -11626, -15255, -18329, -15824, 4301, 9564, 8174, 14090, 31501, 20527, 8698, 1244, 971, 3420, 12676, 14583, 11980, -5608, -17627, -12227, -14257, -1725, -3138, -19529, -24514, -16626, 956, 14155, 8920, 4022, 6107, -2065, -13660, -10416, 7229, 8343, 2770, -8922, -14818, -31592, -26910, -12014, 13679, 25178, 19403, 6882, 12670, 3674, -9386, -16883, -21285, -23564, -19277, -11696, -16572, -1345, 2045, -3432, -9038, -15621, -13242, -19120, -9520, 481, -8923, -24891, -27415, -23652, -18974, -8414, -10388, -1186, -13588, -19397, -6734, 5330, 5418, -11065, -32693, -21823, -9948, -3337, -6571, -15864, -10295, -1614, -2477, -10691, -6785, 601, 4834, 11521, 23018, 3910, -6421, -6515, -25855, -29064, -13166, -14124, -8764, -9510, -405, 7288, 15100, 8942, -1237, -7484, -2634, 575]
4920E75j372m780j631N53L367l725k275k960P297J5073o856j9571r428j668N022
4905b2379J0099J3408K778o744M176p617o298M020N036L01j343k146p565J4881
4891F07n445L368J0273r659P917r831q629L163K547n479j1109k0000N432J0814
4877b6031K0732N383O478j904O490p369l562p728L124N584J0681n294j0267p357
4863a1040m905l246P929j560J96J806J340m659K231M524M586N34P35j1408n908
4848a8845R093J4002m632m571r281p830M531M593j806j3636M673O660M256m694
4834a7487j7449J4047O758M604J865p546J2689J8045N086j0417j1553j7506O492
4821a2372j311q165N757L616k787J2215K252n400j1095L653L755j999K34K3189
$$ y = [575, -797, -5577, -7208, -6655, -3288, -7013, -9288, -12248, -4951, 10122, 3266, -16305, -25733, -27401, -22379, -12280, 1128, 3906, -2838, 1338, -6279, -12577, -8557, -3521, -3220, -4563, -6709, -14274, 607, -4838, -1470, 8803, -856, 7061, -2770, -11399, -8236, -5689, -11168, -22277, -42277, -36845, -26031, -5299, 84, 6562, 4658, 11148, 3779, 217, -7511, -4387, 1197, 11878, 6584, -3683, -11040, -15945, -19191, -11262, -12822, -12626, -10820, -9480, -14139, -11908, -7384, -2798, -2264, -1529, -12937, -18845, -9752, 4250, -382, -4953, -14234, -22064, -17533, -12940, -14746, -28382, -23709, -17049, -12793, -17487, -34936, -20889, -14131, -9527, -7662, -15208, -2519, 15526, 20612, 10195, -1358, -18864, -12372, -13683, -21848, -16091, -12475, -15262, -3047, -795, -6195, -17290, -13637, -9882, -11881, -11647, 11542]
4807A1542r102q018J614N038q224m883J0483l649n664o982m494K070N812K2177
4793G720L315j9290o322R420P046k666k16l586j498J7490J1526j3574j3897m55
4779d987K679m199O773k397N303M323J717n430p754J454l207J7022J451j0876
4765A872j3792n110J8000J2104j4365J442M53r871N050M467O130m979m342J0643
4751G702J4544j7183q383R624N835L462O29q23O713j586q365j367p949p665K637
4736b175K738k1148o754j334r009J2405J4386m411J1944J7307q63r49j844o152
4722D141l048j300p416P95K472M515j784M044j635L365J061j6342j6273J3012
4708a4393M58n69L507P130P831N621r916q282k280J2291K340j525p336j8851p384
$$ y = [11542, 2440, -5578, -3964, 1074, -7150, -12033, -1550, -5199, -10863, -17845, -22339, -20269, -14457, 7720, 11035, -8255, -14577, -5157, 1889, -777, -993, -4579, -6077, 11413, 22939, 9365, -4532, -4987, -2308, -6507, 266, -2131, 3172, 7495, 9212, 3782, -3972, -2518, -5725, 11297, 12748, 1872, -11920, -17030, 970, 13074, -1291, 151, 604, -9267, -4217, 250, 6380, 1401, -2941, 7702, 22246, 5063, -3320, 6304, 12139, 15601, 16230, 15407, 22120, 20534, 12169, 10802, 2853, -4812, -2175, 563, -20585, -27339, -28673, -37682, -25277, -10891, -15302, -3358, 13949, 13086, 12137, 10293, 4141, 1093, -207, -7623, -6828, -4356, 159, -1625, 2419, 784, 4149, 5210, -11132, -27405, -14393, -13935, -14504, -10997, -3867, 3964, 9585, -331, -8613, -10893, 1398, 3738, 2213, -5123, -23974, -31358]
4693c1358L967j404K519m61n327K1J1657J6268J0158k0337o941J1596P417R454
4679G229j0647m080J1780k519j1449J6551K175j1017o048q969l604j388q966P357
4665b3595J7998N102K693J396j949m224l374o273k920M567r965J426J1746J1588
4651D216M13j2160L213K252R3N543K490l085o799J2398P109M583j0448j2704J17
4636b769J098j6547r395l681K625O388J1391O930K835Q815m706N968q067n682
4622d797l836j267O066n6K618j3592n694P896q05m941m553l710P575l431K426
4607b0101J713N043J5493p827o270R647K943q485L267o329K688O589L922j0457
4593h164o459Q510l605k998R907n550P219m434J454O170P081J1639l662m247k739
$$ y = [-31358, -27391, -28795, -26276, -26737, -32064, -32043, -20386, -4118, 6040, -14297, -21238, -9642, -2225, 7229, -3418, -7498, 4282, 1763, -9686, 6865, 9040, -1977, -8025, -16994, -20598, -21986, -30952, -23595, -5597, -495, 2198, 3594, 1645, -2579, -5953, -12226, -15146, -10579, -20544, -19118, -7372, 4216, 4629, -7531, -4318, -2066, -1973, 3570, 6060, 2975, -3824, 8574, 15683, 20266, 9818, -2886, -2769, -1671, -18218, -27613, -31294, -28669, -22281, -10890, -3960, -1125, 7690, 2984, 8952, 885, -4797, -8633, -9900, -3834, -3890, -1272, -14864, -20558, -12662, -13467, -18408, -22961, -26671, -19096, -22527, -20101, -18388, -13345, 2148, -5679, -11949, -2302, 641, -7844, -4577, -10906, -8218, -1629, 2293, -8164, -14623, -6113, -9718, -12716, -2809, -8359, -1140, -5574, -4120, 2050, 9131, 20770, 17108, 12861, 10122]
4578A0122P433l49O30m313j0941k48P08R00n661p847l327N489k314M947L222Q37
4562g12k744J2103J0002j53j0124o140J7098J1999o299o122j4432M663J3043K084
4548B4266l234j5800j0108l414J24o399l042L018N20J2904R970p405k1328o25
4534b0553J5108k27K231O90o087o684n314J8284J6489k122j2933n398p940P017
4520g439K562r0J42q862K586L453l91J8067N942J86M482j6575n483j017j3507
4505a5944J288R020J223r330j3810N952J8691k416l272R81o296o250O362O361
4491g440l894j430J8661M661P586m253j1863j8996R251J2865m058n685M084l953
4477d464m277O125k403N864m601o445p980J866J0166M07r805j0009J0614J9409
$$ y = [10122, 17555, 17206, 17836, 13523, 2582, 2334, 3042, 3942, -1719, -9566, -12893, -7404, -9718, -4771, -1549, -712, -3456, 8647, 18649, 18496, 8372, 2232, 19330, 31329, 25030, 18908, 4476, 9139, 22182, 24266, 21032, 5232, -4876, -8290, -8166, -14565, -17607, -14589, -14069, -1165, 8805, 1400, -19928, -20553, -5445, -5672, -3441, -2751, -8838, -15522, -20836, -2552, 13937, 11815, -1118, -6516, -14456, -7439, -4877, -4967, -4825, -13687, -11101, -7648, -8039, 10028, 15970, 16156, 20638, 4063, -1420, -2437, -15944, -14656, -5636, -4413, -13743, -27553, -21601, -2910, -5326, -8598, -7617, -13913, -20163, -13801, -7440, -11334, -12764, 5897, 10558, 18144, 13891, 2028, -16968, -7717, 5148, 1090, -4595, -511, -4464, -8741, -2616, -5019, 845, -3756, -10201, -18181, -16315, -6149, -5742, -15547, -25556, -14942, 4467]
4463D467M279j2573K392L146K501J5402K86n559L728O335j9631j8951j3417R144
4449a8451J0952J2396m004j4695p795o528J2625K2822j2240j6834q347O203O814
4436a7082K94j0037L123N485P787O357J2673j0755j5272k976J2833J2606K627
4423G663r588p571P110o302r818j863j432J1451l154R930J3442K067n359q220
4409a644L619L92j160K853K39K99k32q968R88J2184M24k1003m91R205l76K585
4393a086j5105j0351P786J2616j2787j3107J333N339k518L497J7241N177K603
4380F38n586N187J524L223P126N466q396j2122o95P504L003j0472j5046J252J6984
4365d10k572P953J8216j293n440m774j3560O53n470J0028J609j7262l522j1123
$$ y = [4467, 8746, -3827, -1435, 1711, 4212, 19614, 19900, 14341, 18069, 24404, 4773, -14178, -27595, -18451, -7499, 4897, 893, -13802, -21597, -28125, -15500, 7322, -4918, -21752, -30099, -23896, -17082, -16788, -26825, -23702, -18217, -10430, -4073, 8600, -2155, -17427, -20403, -7570, 5036, 7663, -1925, -9496, -2386, -8688, -18506, -20369, -21801, -10350, -13504, -3574, 9868, 11935, 6576, -1644, 1975, 2367, 1207, 4060, 4299, 4598, 4366, -4602, -3614, 8570, 8994, -12009, -12500, -3295, -3671, -1086, -16191, -26542, -18756, -6140, -18927, -32034, -30701, -25362, -27880, -24383, -7142, -1965, 638, -4948, 239, 1763, 4986, 12112, 17578, 9182, -2940, -3635, 3869, 6872, -3600, -18646, -17394, -410, -2982, 4971, 23187, 21894, 16454, 11680, -1880, -1227, -6697, 3331, 4940, -12322, -15844, -26967]
4351b6967K897K7796O690k1274k666L656n584J9072Q771l386j5658P55j833l707
4337a1438L903p262o900L734J6759j240r043R513N319r800O014k982k0571K548
4323b1446P324Q627l454n454k828R528K5271N913p044j5757k002N164j5013J266
4309i905J6856m467p194K133J6469j933R16p979M957P425J114L344L106j2711
4295A2131J43M17j0607r617O3o175k844K04j0137j4363J3853O592P543R426k31
4280c602j4087n30J1765J4157R237j1388k01K2175k672Q004J15j0028j3729n552
4266C664j828o001O540L256N087j8859K1J1638M700q804r909M328K063j6344N743
4251a4705J8529K140j5826K200P430n919L744Q982n727m779P21m69m485j4312
$$ y = [-26967, -24070, 3726, 10416, -10858, -13524, -9868, -15452, 3620, 12391, 9005, -6653, -5898, -7731, -11438, -7535, -14797, -21697, -17963, -1204, -2444, -11487, -1974, 3345, -6455, -441, -3423, -23994, -21446, -14122, -5495, -8949, -14403, -17231, -7703, 17568, 23481, 16437, 680, -1322, 3842, -11171, -9905, 6951, 2484, -4710, -2577, 13892, 11959, 12875, 4896, 9853, 17278, 18392, 21736, 24842, 12131, 12274, 12691, 2084, -7533, -7470, -13645, -16489, -16285, -26422, -40785, -26932, -20340, -12797, -3371, -3602, -17689, -18219, -6454, 7703, 16940, 5552, 5351, 27526, 24854, 32858, 32973, 22945, 9216, 3664, 1836, -4165, 2375, 5631, 10718, -8141, -8120, 3518, 8218, -586, -10495, -6167, -4104, -20448, -14705, 3824, 5964, -9862, -7662, -232, -6151, -2407, 6575, 848, -3931, -3210, -3679, -8164, -22476]
4237b2476q437J2574J4368L887j8997K304J3897L817J845L751j911J682l061o719
4223c476m750L405r262Q676j4133M865K8347J931n456l735n856j152q467l297
4209a2360J5243O507j1412J0451J2264n282r313K238m977n946j7401L155J428
4196a5405n262j1743K477J1361o401o459p623K843J8533J7900l46p603j1855J838
4182a7745J2274K007K458j415R87Q932j149j2055n534K896m484o020k679n640
4168b7167J4339K5653q450r851J4052p007n592p40m505N853j508L452J3177j0715
4154I91R642J74q394L713r064l874J959L839J1959j1626m80l620l910n49J2483
4139C243j1105K60m199n547n96P254J4625k937L069q96n941L001k528j0944J0241
$$ y = [-22476, -30913, -18339, -3971, -84, -19081, -16777, -2880, 937, 2782, 6533, 4622, 6304, 3243, -3476, -8226, -4821, -14083, -5407, -19540, -14675, 13672, 15603, 10147, 6412, 556, -596, -9063, -12360, 2883, 9390, -2022, 8429, 20693, 15411, 6098, 8336, 3359, -2587, -19988, -16833, -15405, -20667, -32410, -29933, -18572, -24973, -31432, -39055, -36212, -17679, 221, -125, -7728, -19583, -17745, -5471, -3464, -1006, -2421, -1434, 7498, 6349, -5706, -11240, -8344, -12828, -18848, -21527, -27167, -12828, 12825, 4375, -5476, 8576, 1569, -4023, -4763, -9268, -3415, -4923, -1471, 11706, 991, 10633, 10807, 2413, 6126, -2938, -6812, -4853, -1014, 10945, -681, -1161, -4781, -8691, -9240, 3243, -7862, -7602, -11801, -17348, -17944, -10690, 3935, 998, 4067, 3171, -2770, 231, -2297, -13241, -3000]
4124c000M167l046o682p861J3126Q810J3243K142q926o208k828J788k156M636
4110G205o405N95r147k193O847O139n871m698P240j2316r948q35r639O528R958
4095a6540j0221L42P738P623K739K176M471o488k2159q175J1848J8189K836J941
4081c680j1372o238M665M239o688l708K3670L744j6444q26n840K263o98M90L015
4066a3408P602j655R692K2027J4086j0567j3545j648p089j2851N022J1015k619
4053F062j3860P284P578k971K300l872j6837M728J0196r986J289J2229O563J0709
4039B1412n408j0161j0922l819o628Q09p954N183L089P874m65K579J4705n154
4025E140j2893p594O667N812p271r91J1847P082j6088j663K001N306L711k889
$$ y = [-3000, 1167, -1879, -8561, -16422, -3296, 5514, 18757, 20899, 11973, 5765, 2937, 4725, 2569, 7205, 800, 1395, -7752, -9945, -3098, 3041, -2830, -7528, -288, -12604, -22552, -23387, -33026, -26498, -16540, -26761, -26419, -18681, -11058, -8319, -6143, -1672, -8160, -30319, -38494, -26646, -8457, -5621, -3680, -15052, -21290, -16625, -12386, -19074, -22782, 888, 4632, -11812, -12638, -18478, -16215, -16913, -16423, -13408, -5806, -7461, 2231, 24258, 38344, 27777, 14232, 12584, 5495, -7356, -2334, 8681, 6062, -7798, -514, 7064, 4093, 6393, 2521, -14316, -9588, 608, -9378, -8089, 4140, 10703, 21412, 16004, 5843, -5079, -8898, -15526, -14717, -22671, -17488, -14399, -6525, -6990, -4411, 10294, 5140, -7753, -15347, -8680, -2868, -10139, -11130, 717, 7799, -8289, -9952, -7951, -2645, 1066, -1823]
4011a823L331O504J0623P669k267k0230j8697j749L760m418L921L195K879O205
3997a097L937r848j4472J058J9840J367J4287j0626j0651j1850Q053m738n850
3984b0590R624n515o446K0j736K0451J0777n698P872L266J056P671q03j8357R118
3969A0710j0204M286J3770L692R51J1817j1118l3117O05k612K635K724M705R487
3955H331N010q270k486m588R33j2717K743q097j3204R670J3422O289k688n360
3941a1012r502l243J7251n777j4829K441P689O335N575O249J914k886j192N204
3927D217K861q116j5098q422j3852Q577R334J5169K0204m282j9134M37j0237l230
3913b1572J252L718k88K540M931r071N263J3192n233l84P707L961P357Q935m915
$$ y = [-1823, 1508, 8012, 18635, 26304, 24037, 3807, -14890, -16639, -12879, -17297, -13376, -10181, -7302, -1097, 2840, -7008, -21480, -20422, -582, 785, 15072, 4446, -6205, -18055, -10002, -14740, -20590, -10966, -16481, -22927, -22907, -24643, -4192, 6585, 887, 8759, 12025, 13081, 20752, 19949, 1592, 10710, 506, 4792, 18562, 22254, 23205, 35022, 23904, -9213, -8608, -11220, -8585, -5861, -1156, 8331, 13341, 5071, 2585, -2003, -1070, -13787, -11044, -19141, -32345, -22675, -9253, -2964, -5652, -11012, -20514, -23757, -6506, -12283, -27112, -24671, -16982, -10647, -5072, 1177, 3091, 205, -987, 4217, 7078, -1038, -16136, -24558, -38410, -29833, -20499, -5330, 14874, 10592, -8542, -8105, -18342, -21572, -20320, -16602, -16890, -14350, -9419, -18490, -13227, -35, -5268, -5652, 2055, 6016, 13373, 22308, 17393]
3898A7393r086o238P870J1625k896r044q456M842P59O67J191l908m714L997Q62
3883D864l286M331r905q722N675R306l948K105J1073j2618j0938p34n06j093j828
3868a6224l23L38J1180L664k084O869l769L250j572l131J415l563j6694J748j512
3853b0408K998J0652M356N184o631j477P148P101l85Q519L382K935j352j0373
3839A1649M2r191N242L905j1982O903J5026N053j5859k980k32N945j4347r253
3825a0079K080J3280N465q936O489p142j0148l04O986J3933J203j0652p795n307
3811a0927k713j2665r894m064J592J0876N812K882L891J5481N684m924j1526r873
$$ y = [17393, 8307, 2069, 9939, 21564, 18668, 9624, 1168, 6010, 6769, 7436, 8627, 4719, 5, 4002, 4864, 1578, 5909, -3996, -12718, -7043, 2263, -1685, 420, 11493, -1125, -12063, -12797, -13303, -14396, -16224, -16547, -16209, -5029, -1365, -3449, 3420, -349, 2901, 1329, -1802, -387, -3950, -20644, -18896, -20408, -17410, -6758, -2402, 2782, -3849, -5326, 1822, 8923, 8538, 17057, 20439, 23374, 22022, 11649, 11691, 2500, 7742, 11647, -335, 6568, 21594, 26647, 10788, 7808, 7576, 13521, -826, -10079, -7999, 5281, 10746, 1810, 8299, 1157, -8991, -9295, -2309, 11624, 12827, 2175, -5620, -10927, -13640, -26305, -36199, -40263, -38671, -27795, -21983, -19101, -15210, 271, 5955, 1031, -10495, -20368]
$$ [...]
##END NTUPLES=NMR SPECTRUM
##END=
