##TITLE=Analysis number 314979
Compound Code cc 13004
Project Code adrs
Chemist Name stores
##JCAMPDX= 6.0         $$ Bruker NMR JCAMP-DX V2.0
##DATA TYPE= NMR SPECTRUM
##DATA CLASS= NTUPLES
##ORIGIN= Bruker BioSpin GmbH
##OWNER= NMR
$$ XWIN-NMR		Version 3.5
$$ Tue Nov  1 13:48:25 2005 GMT Standard Time (UT+0h)  MAYBRIDGE\NMR@NMR_250MHZ
##.OBSERVE FREQUENCY= 250.131544655141
##.OBSERVE NUCLEUS= ^1H
##.ACQUISITION MODE= SIMULTANEOUS (DQD)
##.ACQUISITION SCHEME= undefined
##.AVERAGES= 16
##.DIGITISER RES= 18
##SPECTROMETER/DATA SYSTEM= dpx250
##.PULSE SEQUENCE= zg30
##.SOLVENT NAME= CDCl3
##.SHIFT REFERENCE= (INTERNAL, CDCl3, 0, 16.522)
##AUDIT TRAIL= $$ (NUMBER, WHEN, WHO, WHERE, WHAT)
$$ ##TITLE= Audit trail, XWIN-NMR		Version 3.5
$$ ##JCAMPDX= 5.01
$$ ##ORIGIN= Bruker BioSpin GmbH
$$ ##OWNER= NMR
$$ C:\u/data/dgb/nmr/ADRS/11730/pdata/1/auditp.txt
$$ ##AUDIT TRAIL=  $$ (NUMBER, WHEN, WHO, WHERE, WHAT)
(   1,<2005-11-01 13:47:29.55 +000>,<MAYBRIDGE\NMR>,<NMR_250MHZ>,
      <created by zg, POWCHK disabled, PULCHK disabled
       configuration hash MD5:
       62 19 C7 07 E1 42 D1 B7 37 6C 3D D0 77 39 F9 E6
       data hash MD5: 64K
       0C 99 91 F4 02 DC 9B F3 14 25 A4 B5 9F 55 03 EE>)
(   2,<2005-11-01 13:47:46.57 +000>,<MAYBRIDGE\NMR>,<NMR_250MHZ>,
      <Start of raw data processing
       ef LB = 0.3 FT_mod = 6 PKNL = 1 SI = 32K 
       data hash MD5: 32K
       93 0B 5B 3B 80 27 46 3D A8 34 45 29 D2 AB EA EE>)
(   3,<2005-11-01 13:47:52.72 +000>,<MAYBRIDGE\NMR>,<NMR_250MHZ>,
      <apk 
       data hash MD5: 32K
       9C EA B7 50 17 73 9F AC CE 67 96 EA AC 5E A0 7B>)
(   4,<2005-11-01 13:47:54.33 +000>,<MAYBRIDGE\NMR>,<NMR_250MHZ>,
      <abs ABSG = 5 
       data hash MD5: 32K
       21 64 23 C9 ED CF E2 CD A6 D9 33 C5 A2 1A 16 7C>)
$$ ##END=
$$ 
$$ hash MD5
$$ 26 61 ED 15 BE D8 57 A9 B5 D8 90 80 70 54 45 8D
##$RELAX= 
##$RELAX= 
##$RELAX= 
##$RELAX= 
##$RELAX= 
##$RELAX= 
##$RELAX= 
$$ Bruker specific parameters
$$ --------------------------
##$DU= <C:\u>
##$EXPNO= 11730
##$NAME= <ADRS>
##$PROCNO= 1
##$TYPE= <nmr>
##$USER= <dgb>
##$AMP= (0..31)
100 100 100 100 100 100 100 100 100 100 100 100 100 100 100 100 100 100 
100 100 100 100 100 100 100 100 100 100 100 100 100 100 
##$AQSEQ= 0
##$AQ_mod= 3
##$AUNM= <au_zg>
##$AUTOPOS= <15 >
##$BF1= 250.13
##$BF2= 250.13
##$BF3= 250.13
##$BF4= 250.13
##$BF5= 500.13
##$BF6= 500.13
##$BF7= 500.13
##$BF8= 500.13
##$BYTORDA= 1
##$CFDGTYP= 0
##$CFRGTYP= 5
##$CHEMSTR= <none>
##$CNST= (0..31)
1 1 145 1 1 1 1 1 1 1 1 1 1 1 1 1 1 1 1 1 1 1 1 1 1 1 1 1 1 1 1 1 
##$CPDPRG= <>
##$CPDPRG1= <>
##$CPDPRG2= <>
##$CPDPRG3= <>
##$CPDPRG4= <mlev>
##$CPDPRG5= <mlev>
##$CPDPRG6= <mlev>
##$CPDPRG7= <mlev>
##$CPDPRG8= <mlev>
##$CPDPRGB= <>
##$CPDPRGT= <>
##$D= (0..31)
0 1 0 0 0 0 0 0 0 0.06 0 0 0 0 0 0 0.0002 0 0 0 0 0 0 0 0 0 0 0 0 0 0 
0 
##$DATE= 1130852847
##$DBL= (0..7)
120 120 120 120 120 120 120 120 
##$DBP= (0..7)
150 150 150 150 150 150 150 150 
##$DBP07= 0
##$DBPNAM0= <>
##$DBPNAM1= <>
##$DBPNAM2= <>
$$ [...]
##$SUBNAM7= <"">
##$SUBNAM8= <"">
##$SUBNAM9= <"">
##$SW= 20.6930455092707
##$SWIBOX= (0..15)
0 0 3 0 0 0 0 0 0 0 0 0 0 0 0 0 
##$SW_h= 5175.983436853
##$TD= 65536
##$TD0= 1
##$TE= 296.16
##$TE2= 300
##$TE3= 300
##$TEG= 300
##$TL= (0..7)
0 120 120 120 120 120 120 120 
##$TP= (0..7)
150 150 150 150 150 150 150 150 
##$TP07= 0
##$TPNAME0= <>
##$TPNAME1= <>
##$TPNAME2= <>
##$TPNAME3= <>
##$TPNAME4= <>
##$TPNAME5= <>
##$TPNAME6= <>
##$TPNAME7= <>
##$TPOAL= (0..7)
0.5 0.5 0.5 0.5 0.5 0.5 0.5 0.5 
##$TPOFFS= (0..7)
0 0 0 0 0 0 0 0 
##$TUNHIN= 0
##$TUNHOUT= 0
##$TUNXOUT= 0
##$USERA1= <user>
##$USERA2= <user>
##$USERA3= <user>
##$USERA4= <user>
##$USERA5= <user>
##$V9= 5
##$VALIST= <valist>
##$VCLIST= <CCCCCCCCCCCCCCC>
##$VD= 0
##$VDLIST= <DDDDDDDDDDDDDDD>
##$VPLIST= <PPPPPPPPPPPPPPP>
##$VTLIST= <TTTTTTTTTTTTTTT>
##$WBST= 1024
##$WBSW= 4
##$XGAIN= (0..3)
0 0 0 0 
##$XL= 0
##$YL= 0
##$YMAX_a= 549978
##$YMIN_a= -534217
##$ZGOPTNS= <>
##$ZL1= 120
##$ZL2= 120
##$ZL3= 120
##$ZL4= 120
##$ABSF1= 16.522
##$ABSF2= -4.171173
##$ABSG= 5
##$ABSL= 3
##$ALPHA= 0
##$AQORDER= 0
##$ASSFAC= 0
##$ASSFACI= 0
##$ASSFACX= 0
##$ASSWID= 0
##$AUNMP= <proc_1d>
##$AZFE= 0.1
##$AZFW= 0.1
##$BCFW= 0
##$BC_mod= 0
##$BYTORDP= 0
##$COROFFS= 0
##$CY= 12.5
##$DATMOD= 1
##$DC= 0
##$DFILT= <>
##$DTYPP= 0
##$F1P= 14.0000005364418
##$F2P= -0.99999901652339
##$FCOR= 0.5
##$FTSIZE= 32768
##$FT_mod= 6
##$GAMMA= 0
##$GB= 0
##$INTBC= 1
##$INTSCL= 1
##$ISEN= 128
##$LB= 0.3
##$LEV0= 0
##$LPBIN= 0
##$MAXI= 10000
##$MC2= 0
##$MEAN= 0
##$ME_mod= 0
##$MI= 0
##$NCOEF= 0
##$NC_proc= -3
##$NLEV= 6
##$NOISF1= 0
##$NOISF2= 0
##$NSP= 0
##$NTH_PI= 0
##$NZP= 0
##$OFFSET= 16.522
##$PC= 1
##$PHC0= -80.36162
##$PHC1= 4.433629
##$PH_mod= 1
##$PKNL= yes
##$PPARMOD= 0
##$PSCAL= 4
##$PSIGN= 0
##$REVERSE= no
##$SF= 250.13
##$SI= 32768
##$SIGF1= 0
##$SIGF2= 0
##$SINO= 400
##$SIOLD= 32768
##$SREGLST= <1H.CDCl3>
##$SSB= 0
##$STSI= 32768
##$STSR= 0
##$SW_p= 5175.98343685301
##$SYMM= 0
##$S_DEV= 0
##$TDeff= 65536
##$TDoff= 0
##$TI= <Analysis number 999999
Compound Code 99
Book Reference 9
Project Code 9>
##$TILT= no
##$TM1= 0
##$TM2= 0
##$TOPLEV= 0
##$USERP1= <user>
##$USERP2= <user>
##$USERP3= <user>
##$USERP4= <user>
##$USERP5= <user>
##$WDW= 1
##$XDIM= 32768
##$YMAX_p= 333581596
##$YMIN_p= -225882
$$ End of Bruker specific parameters
$$ ---------------------------------
##NTUPLES= NMR SPECTRUM
##VAR_NAME=  FREQUENCY,     SPECTRUM/REAL,   SPECTRUM/IMAG
##SYMBOL=    X,             R,               I
##VAR_TYPE=  INDEPENDENT,   DEPENDENT,       DEPENDENT
##VAR_FORM=  AFFN,          ASDF,            ASDF
##VAR_DIM=   32768,         32768,           32768
##UNITS=     HZ,            ARBITRARY UNITS, ARBITRARY UNITS
##FACTOR=    0.157963299565203, 1,           1
##FIRST=     4132.6476996994, 0,             0
##LAST=      -1043.33573715361, 0,           0
##MIN=       -1043.33573715361, -225882,     0
##MAX=       4132.6476996994, 333581596,     0
$$ Real data points
##PAGE= N=1
##DATA TABLE= (X++(R..R)), XYDATA
$$ [...]
$$ plain form
25474 11832 12100 3828 6274 6246 7378 5776 7447 1994 -1484 -1778 -2095 464 4051 4735 1147 2211
25458 2211 5811 4722 3399 -2062 -6994 -5271 -5955 -2238 -3426 -5533 -7408 -3234 -610 1860 -4773
25443 -4773 -12102 -9216 -666 4956 -226 -5628 -11195 -7493 -5274 -4765 -5923 -10102 -11342 -6367 -3884
25428 -3884 -5444 -7635 -7933 -4396 -8245 -5513 -8088 -9159 -8924 -7989 -5975 -7394 -9165 -1380 1678
25413 1678 -2438 -5289 -6601 -2855 -3703 -6454 -9596 -5850 -3579 -7140 -8378 -10595 -9405 -5690 -5945
25398 -5945 -2464 -1812 -1318 3719 4957 137 -3015 -7208 -6154 5491 11154 2809 -3914 -2607 -1318
25383 -1318 -3589 259 7420 9864 13890 7900 4288 8632 6733 4320 2643 492 -182 -1572 -10416
25368 -10416 -15394 -12379 -11444 -8834 -3894 -2442 -5619 -6158 -7845 -13822 -10364 -7261 -6220 -3672 -3004
$$ packed form
25474A1832K68q272K446k8J132j602J671n453l478k94l17K559L587O84l588J064
25458B211L600j089j323n461m932J723o84L717j188k107j875M174K624K470o633
25443d773p329K886Q550N622n182n402n567L702K219N09j158m179j240M975K483
25428c884j560k191k98L537l849K732k575j071K35R35K014j419j771P785L058
25413A678m116k851j312L746q48k751l142L746K271l561j238k217J190L715k55
25398e945L481O52M94N037J238m820l152m193J054J1645N663q345o723J307J289
25383a318k271L848P161K444M026n990l612M344j899k413j677k151o74j390q844
25368a0416m978L015R35K610M940J452l177n39j687n977L458L103J041K548O68
$$ plain form
25353 -3004 1425 5508 7394 7761 1619 -7717 -9028 -9244 1241 5519 1515 1045 -7240 -6845 -912
25338 -912 2862 3640 756 3911 7676 4804 6892 3008 4156 7751 2479 3643 5971 6278 4981
25323 4981 2836 2308 -2210 -4477 -5086 -3464 -5974 -6220 -8528 -11360 -10058 -5447 -6526 -9051 -5235
25308 -5235 -745 1705 -1807 -5045 -5896 -148 -3112 -1033 -10798 -13893 -13158 -9642 -881 -1672 -3500
25293 -3500 -2594 -1464 -2305 2000 5608 6185 8020 1084 -3424 -4255 -3595 1276 4312 1457 -8478 -12994
25277 -12994 -13604 -12677 -8388 -4461 -5112 -10827 -11061 -5871 -5131 -4600 -2289 -1088 9871 10342 8041 1182
25261 1182 -335 -1711 2593 4811 4046 -1813 -8764 -6161 -4119 -2581 746 2202 -2050 -4116 -4877
25246 -4877 -2899 -966 -1728 -3517 -8294 -9667 -12102 -13715 -10032 -7284 -2754 -4856 -4113 -7252 -9578
$$ packed form
25353c004M429M083J886L67o142r336j311k16J0485M278m004m70q285L95N933
25338i12L774P78k884L155L765k872K088l884J148L595n272J164K328L07j297
25323D981k145n28m518k267o09J622k510k46k308k832J302M611j079k525L816
25308e235M490K450l512l238q51N748k964K079r765l095P35L516Q761p91j828
25293c500R06J130q41M305L608N77J835o936m508q31O60M871L036k855r935m516
25277a2994o10R27M289L927o51n715k34N190P40N31K311J201J0959M71k301o859
25261A182j517j376M304K218p65n859o951K603K042J538L327J456m252k066p61
25246d877J978J933p62j789m777j373k435j613L683K748M530k102P43l139k326
$$ plain form
25231 -9578 -7093 -5163 -8164 -5675 -518 -1201 -6134 -10562 -9753 -7164 -3335 -1944 -4700 -3073 -1585
25216 -1585 -2300 -3819 -2205 -660 1669 -5321 -4318 2165 3737 4326 4941 111 2094 -3108 -1220
25201 -1220 -1085 -5417 -6845 -651 -4569 -3668 705 1959 1945 360 -4730 -6189 -6879 -4088 844 1955
25185 1955 -2851 -6336 -6866 -11590 -9170 -8525 -8387 -2627 -1665 -2400 -3184 -3189 -1055 -4758 -5298 -4219 -239
25168 -239 4781 2512 1689 -2847 -556 1252 -1561 -6640 -11033 -10891 -7064 -1368 -1592 -614 -6597 -8862
25152 -8862 -5666 -3256 -1276 -4136 -9404 -6836 -7527 -6926 -5104 -8661 -6835 -3045 656 -1322 -6606
25137 -6606 -7020 -2505 -4421 -2824 3679 4088 5402 1693 -1356 -2108 -7368 -4981 -6453 -8832 -10885
25122 -10885 -9161 -6223 -2302 -166 6662 11201 5370 -2576 -3932 -3132 4006 9525 7541 3386 60
$$ packed form
25231i578K485J930l001K489N157o83m933m428Q09K589L829J391k756J627J488
25216a585p15j519J614J545K329o990J003O483J572N89O15m830J983n202J888
25201a220J35m332j428O194l918R01M373J254j4j585n090j459o90K791M932J111
25185A955m806l485n30m724K420O45J38N760R62p35p84nK134l703n40J079L980
25168b39N020k269q23m536K291J808k813n079m393J42L827N696k24R78n983k265
25152h862L196K410J980k860n268K568o91O01J822l557J826L790L701j978n284
25137f606m14M515j916J597O503M09J314l709l049p52n260K387j472k379k053
25122a0885J724K938L921K136O828M539n831p946j356Q00P138N519j984m155l326
$$ plain form
25107 60 -2347 -62 961 -1002 -7220 -9098 -5647 -9410 -5742 -657 6272 11709 12569 9884 4664
25092 4664 5341 2936 4910 10613 7950 8754 10052 7396 3824 -1917 -7140 -4377 1432 1720 -877
25077 -877 -3021 -4251 -2340 -7098 -10157 -9058 -2577 3559 -1133 -6510 -9618 -8003 -1685 -4287 -11113
25062 -11113 -13657 -12560 -10938 -7649 -578 88 1512 -3812 -8349 -3652 -4496 -7641 -9596 -9177 -11707
25047 -11707 -18560 -13016 -6474 -4805 -258 5258 7612 7840 2504 -6801 -9051 -11829 -14760 -14026 -20040
25032 -20040 -23020 -24897 -21871 -19176 -15337 -9621 -1858 158 1606 -6874 -11189 -12182 -15035 -13735 -13408
25017 -13408 -12290 -12391 -11797 -12086 -12231 -6519 1792 900 -6831 -13013 -13977 -7074 -1631 -172 -565 -2312
25001 -2312 -1299 -3311 -7816 -14870 -16248 -15954 -13549 -10095 -9134 -6623 -2567 2550 -4211 -15660 -17016
$$ packed form
25107F0k407K285J023j963o218j878L451l763L668N085O929N437Q60k685n220
25092D664O77k405J974N703k663Q04J298k656l572n741n223K763N809K88k597
25077h77k144j230J911m758l059J099O481O136m692n377l108J615O318k602o826
25062a1113k544J097J622L289P071O66J424n324m537M697q44l145j955M19k530
25047a1707o853N544O542J669M547N516K354K28n336r305k250k778k931P34o014
25032b0040k980j877L026K695L839N716P763K016J448q480m315r93k853J300L27
25017a3408J118j01N94k89j45N712Q311q92p731o182r64O903N443J459l93j747
25001b312J013k012m505p054j378K94K405L454R61K511M056N117o761j1449j356
$$ plain form
24986 -17016 -8814 -818 4232 1814 -4512 -8042 -15505 -15707 -5711 -5075 -3689 -3439 -7827 -10375 -11959
24971 -11959 -10313 -1267 3860 2132 -4585 -6288 -3550 -567 2030 3202 519 -3497 -6867 -4323
24957 -4323 -2267 4101 9082 9371 5062 -1931 -3395 -3226 -3720 -7176 -5967 -8729 -17503 -17444 -13540 -12500
24941 -12500 -14443 -13596 -14372 -15778 -20879 -17665 -11779 -10152 -7851 -2728 361 -7897 -6438 -4718 -3517
24926 -3517 -2966 -5187 -7996 -3900 1149 -158 -3159 3634 6711 3146 -3098 -6338 -9468 -12970 -11701
24911 -11701 -5671 1334 1051 -2972 -12189 -14562 -16496 -18469 -14207 -2670 -1395 -8130 -7745 -8434 -7672
24896 -7672 -2783 2507 8572 7843 9177 9627 3637 -1175 -3509 -4278 -8579 -3896 -3631 -2716 -2803 -2054 4859
24879 4859 2669 338 -4522 -6625 -9084 -5803 -1705 -5397 -5133 -4825 -1734 2285 -1203 -1629 -1908 -7581
$$ packed form
24986a7016Q202P996N050k418o326l530p463k02R996O36J386K50m388k548j584
24971a1959J646R046N127j728o717j703K738K983K597J172k683m016l370K544
24957d323K056O368M981K89m309o993j464J69m94l456J209k762q774N9L904J040
24941a2500j943Q47p76j406n101L214N886J627K301N123L089q258J459J720J201
24926c517N51k221k809M096N049j307l001O793L077l565o244l240l130l502J269
24911a1701O030P005k83m023r217k373j934j973M262J1537J275o735L85o89P62
24896g672M889N290O065p29J334M50n990m812k334p69m301M683K65R15q7P49O913
24879D859k190k331m860k103k459L281M098l692K64L08L091M019l488m26k79n673
$$ plain form
24863 -7581 -4897 -2846 -5234 2488 3088 5294 729 3549 5512 13 -9311 -11193 -8044 -10670 -8389
24848 -8389 -5314 -5327 -9729 -5480 -5263 -1704 -1074 -10347 -12044 -6089 -4536 -6629 -2720 -3707 -364 6730
24832 6730 5057 1508 -4047 -8400 -12854 -12707 -9331 -9588 -12995 -5995 490 5263 8285 10108 8406
24817 8406 11367 8681 -422 170 -1387 -3343 -6774 -13794 -13647 -14431 -8427 646 1269 -6923 -9661 -3089
24801 -3089 -7327 -11707 -10627 -1094 3309 4126 2554 4997 3727 3139 -1695 -6617 -9254 -9524 -13014
24786 -13014 -11900 -6874 -3095 2165 2476 -2010 -11276 -17673 -18127 -18284 -13501 -7873 -3980 -5774 -5333
24771 -5333 -10501 -19425 -15758 -16869 -15566 -13803 -16370 -19703 -23091 -23388 -15046 -6284 -8711 -11399 -5254
24756 -5254 1488 359 2674 2231 -5248 -5156 -899 -4535 -6597 -10604 -11693 -12054 -11949 -6933 -4139 -9787
$$ packed form
24863g581K684K051k388P722O00K206m565K820J963n499r324j882L149k626K281
24848h389L075j3m402M249K17L559O30r273j697N955J553k093L909r87L343P094
24832F730j673l549n555m353m454J47L376k57l407P000O485M773L022J823j702
24817H406K961k686r103N92j557j956l431p020J47p84O004R073O23q192k738O572
24801c089m238m380J080R533M403Q17j572K443j270n88m834m922k637k70l490
24786a3014J114N026L779N260L11m486r266o397m54j57M783N628L893j794M41
24771e333n168q924L667j111J303J763k567l333l388k97Q342Q762k427k688O145
24756e254O742j129K315m43p479R2M257l636k062m007j089l61J05N016K794n648
$$ plain form
24740 -9787 -11008 -7572 -5609 -6576 -16632 -15788 -14720 -15526 -12874 -4819 -2161 -994 -6787 -766 1645
24725 1645 -1691 -8626 -12628 -8667 -3717 -2287 -5217 -9256 -9906 -4252 100 3525 10705 9471 2996
24710 2996 -4959 -16721 -19406 -15358 -13332 -2828 10186 11588 8086 6658 -1304 -7518 -11356 -4645
24696 -4645 -2002 -184 -158 -2173 -5460 -7341 -2073 1940 8700 6796 10860 11393 11631 3827 -3051 -7475
24680 -7475 -10651 -9105 -12585 -12703 -9198 -10331 -6520 -7727 -4125 -1734 -5963 -6366 -3083 565 -451
24665 -451 -3502 -10345 -8212 -623 3500 -782 -3743 -3986 -1280 -1851 -3052 -682 6648 5045 -48
24650 -48 -2575 -6611 -5701 -10292 -11969 594 13479 11196 8239 4956 3573 5536 6126 3700 2370
24635 2370 -2450 -226 1208 316 795 4573 4577 -6852 -7302 -3390 1654 2584 1977 -4907 -7247 -3578
$$ packed form
24740i787j221L436J963r67j0056Q44J068q06K652Q055K658J167n793O021K411
24725A645l336o935m002L961M950J430k930m039o50N654M352L425P180j234o475
24710B996p955j1762k685M048K026J0504J3014J402l502j428p962o214l838O711
24696d645K643J818K6k015l287j881N268M013O760j904M064N33K38p804o878m424
24680g475l176J546l480j18L505j133L811j207L602K391m229m03L283L648j016
24665d51l051o843K133P589M123m282k961k43K706n71j201K370P330j603n093
24650d8k527m036R10m591j677J2563J2885k283k957l283j383J963N90k426j330
24635B370m820K224J434q92M79L778Mj1429m50L912N044R30o07o884k340L669
$$ plain form
24619 -3578 -4220 -4987 -6600 -5933 -4824 2 931 -2785 27 3646 -2051 -9096 -5960 -3849 -3045 -3894
24603 -3894 -6021 -2975 4531 5494 2190 -2844 -4195 839 3020 1501 2697 -361 -227 -1853 -2131
24588 -2131 2381 5339 2440 -19 33 998 4081 2461 4894 4867 -3792 -9036 2520 4645 -356 -8302
24572 -8302 -11174 -9045 -7190 -5979 -4554 -2079 -5461 -3696 -487 2448 -744 -5376 51 -2770 -7336
24557 -7336 -7730 -9082 -7516 -180 2792 -963 -3357 -1441 -5454 -4135 -2379 -3117 -2938 -933 -3356
24542 -3356 -4284 -7090 -6278 -7799 -11941 -15237 -11412 -10953 -5546 -7259 -4543 -4902 -2891 2881 -3081 -9495
24526 -9495 -7661 -7023 -9930 -4566 -1092 -7848 -9156 -8386 -4436 -2971 -5855 -5642 -8086 -12737 -11746 -11768
24510 -11768 -9161 -478 -148 -1948 -2247 -4477 -12839 -16140 -13812 -10819 -9602 -9463 -9679 -6541 -6151 -9055
$$ packed form
24619c578o42p67j613O67J109M826R29l716K812L619n697p045L136K111Q04q49
24603c894k127L046P506R63l304n034j351N034K181j519J196l058J34j626k78
24588b131M512K958k899k459N2R65L083j620K433k7q659n244J1556K125n001p946
24572h302k872K129J855J211J425K475l382J765L209K935l192m632N427k821m566
24557g336l94j352J566P336K972l755k394J916m013J319J756p38J79K005k423
24542c356r28k806Q12j521m142l296L825M59N407j713K716l59K011N772n962o414
24526i495J834O38k907N364L474o756j308P70L950J465k884K13k444m651R91k2
24510a1768K607Q683L30j800k99k230q362l301K328K993J217J39k16L138L90k904
$$ plain form
24494 -9055 -10056 -11473 -6738 315 2855 3652 3591 2954 938 -646 -3451 -2126 -7175 -6363 -4585 -1309
24478 -1309 5660 3046 -6376 -3693 -1053 -2733 -2808 -1020 3842 -2113 -4133 86 1300 -3585 -1911
24463 -1911 4187 438 -5552 -722 -1366 -8619 -5636 -524 -15 -3064 95 -112 225 -1189 -3171 4012
24447 4012 3468 -3135 -6862 -6156 -6609 -866 2621 -1988 -8340 -9298 -9360 -5573 -3007 -4201 -281 -8283
24431 -8283 -16227 -13465 -910 1179 2456 -2889 -9492 -9984 -7639 -5244 -7641 -5779 -1127 -4688 -9534
24416 -9534 -8579 -6095 -7123 -5696 -15086 -16750 -8898 449 -5299 -8369 -10620 -9415 -8953 -11652 -9061
24401 -9061 -2401 -7518 -9124 -10550 -3438 413 -143 -4779 -6842 -6991 -6798 -6936 -3929 -504 -1513 -3437
24385 -3437 -3838 -7677 -3952 3867 1104 -2170 -4702 -7872 -9204 -3607 1768 -3218 -5405 -9405 -9159
$$ packed form
24494i055j001j417M735P053K540P97o1o37k016j584k805J325n049Q12J778L276
24478a309O969k614r422K683K640j680p5J788M862n955k020M219J214m885J674
24463a911O098l749n990M830o44p253K983N112N09l049L159k07L37j414j982P183
24447D012n44o603l727P06m53N743L487m609o352r58o2L787K566j194L920q002
24431h283p944K762J2555K089J277n345o603m92K345K395k397J862M652l561m846
24416i534R55K484j028J427r390j664P852R347n748l070k251J205M62k699K591
24401i061O660n117j606j426P112L851n56m636k063j49J93j38L007L425j009j924
24385c437m01l839L725P819k763l274k532l170j332N597N375m986k187m000K46
$$ plain form
24370 -9159 -6672 -3142 -2078 -3558 -1336 -3261 -5307 -5554 -11350 -10721 -13019 -12511 -9043 -10448 -14021
24355 -14021 -8888 -7835 -6387 -5668 -3720 -3955 -2903 -4906 -10163 -10543 -9879 -8439 -9454 -5148 -4226 -8950
24339 -8950 -7295 -5634 -4609 -4872 -4609 -5654 -1626 927 -6526 -4056 -917 -2778 -7635 -12786 -10777
24324 -10777 -6770 -463 4202 2689 -8179 -7462 -7641 -10471 -6773 -6211 -6615 144 8959 7456 8243
24309 8243 11165 9196 3609 466 -1544 -8302 -5695 -4182 -4932 -6579 -103 6206 8511 3281 250
24294 250 -223 2979 -271 -2873 -2329 -3719 -8745 -8938 -10812 -10070 -7486 -487 6621 4800 2495 -1030
24278 -1030 -6432 -500 -590 -833 -13880 -21331 -14443 -6189 -324 1984 3395 -291 -6256 -7442 -8841
24263 -8841 -3764 1683 1361 384 -754 -2067 -3140 -8613 -6736 -8764 -2411 196 -62 -2985 -6731
$$ packed form
24370i159K487L530J064j480K222j925k046k47n796O29k298N08L468j405l573
24355a4021N133J053J448P19J948k35J052k003n257l80O64J440j015M306R22m724
24339h950J655J661J025k63K63j045M028K553p453K470L139j861m857n151K009
24324a0777M007O307M665j513j0868P17j79k830L698N62m04O759Q815j503P87
24309H243K922j969n587l143k010o758K607J513p50j647O476O309K305n230l031
24294B50m73L202l250k602N44j390n026j93j874P42K584O999P108j821k305l525
24278a030n402N932r0k43j3047p451O888Q254N865K308J411l686n965j186j399
24263h841N077N447l22r77j138j313j073n473J877k028O353K607k58k923l746
$$ plain form
24248 -6731 -12000 -9540 -8990 -7695 325 1638 -6070 -12884 -8188 -6876 -6297 -2991 -2755 -3866 -2467
24233 -2467 -4552 -1959 1827 4377 3657 -7762 -5438 77 -2443 -4464 -3956 608 2266 7646 13449
24218 13449 10056 7651 6966 32 -3839 -5322 -5897 -10990 -15944 -14364 -12282 -10601 -13148 -9279 -6248
24203 -6248 -8145 -10805 -7525 -2553 -3518 -1162 845 2791 2603 1133 -2751 -11965 -15509 -13735 -8036
24188 -8036 -5853 -11382 -10772 -11392 -12615 -10539 -13408 -13534 -13457 -10641 -8774 -13830 -14679 -4643 -2287 3390
24172 3390 11035 6037 3550 4529 1050 -4040 -3179 -867 185 -4466 -11014 -5581 -2958 -5349 -17522
24157 -17522 -16835 -7126 -6916 -6178 2010 4040 -2198 -4674 -38 9281 13730 10141 5539 1872 1169
24142 1169 2110 -3939 -5958 -910 7522 3430 -4221 743 1121 -4267 -5853 -8449 -10509 -4704 1575
$$ packed form
24248f731n269K460N50J295Q020J313p708o814M696J312N79L306K36j111J399
24233b467k085K593L786K550p20j1419K324N515k520k021N08M564J658N380N803
24218A3449l393k405o85o934l871j483n75n093m954J580K082J681k547L869L031
24203f248j897k660L280M972r65K356K007J946j88j470l884r214l544J774N699
24188h036K183n529O10o20j223K076k869j26P7K816J867n056q49J0036K356N677
24172C390P645m998k487R79l479n090Q61K312J052m651o548N433K623k391j2173
24157a7522O87R709K10P38Q188K030o238k476M636R319M449l589m602l667p03
24142A169R41o049k019N048Q432m092p651M964L78n388j586k596k060N805O279
$$ plain form
24127 1575 7060 6791 -2680 -3334 278 2355 2734 2170 3172 4741 5515 2094 -1441 -2314 -5575 -4866
24111 -4866 -4258 -5782 -9368 -9860 -4507 -1583 6123 5504 4487 5834 5742 -1394 -3986 -2935 -3661 2517
24095 2517 4553 -1139 -3328 888 1566 -4390 -12972 -21273 -20483 -13466 -8711 -4863 -7679 -12224 -12622
24080 -12622 -14374 -11540 -7612 -1217 -5191 -10927 -12881 -13936 -13625 -4883 933 -896 -6990 -7039 -1148
24065 -1148 -3124 -15434 -10448 -2784 -5148 -5689 -6943 -15228 -15931 -11872 -12042 -10043 -7321 -11843 -13809
24050 -13809 -7895 -5275 -3054 712 3517 -2084 -7865 -9512 -11315 -11263 -11441 -7484 -2601 -14299 -12389
24035 -12389 -3695 -3858 -9782 -13028 -11111 -8973 -12120 -15604 -9357 -6473 -6018 -3317 -4461 -2573 -2846
24020 -2846 -3952 -2668 240 5329 9399 4636 -5420 -7354 -1992 3096 2297 868 -2155 -3054 -3884
$$ packed form
24127A575N485k69r471o54L612K077L79n64J002J569P74l421l535q73l261P09
24111d866O08j524l586m92N353K924P706o19j017J347r2p136k592J051p26O178
24095B517K036n692k189M216O78n956q582q301P90P017M755L848k816m545l98
24080a2622j752K834L928O395l974n736j954j055L11Q742N816j829o094m9N891
24065a148j976j2310M986P664k364n41j254q285p03M059j70J999K722m522j966
24050a3809N914K620K221L766K805n601n781j647j803N2j78L957M883j1698J910
24035a2389Q694j63n924l246J917K138l147l484O247K884M55K701j144J888k73
24020b846j106J284K908N089M070m763j0056j934N362N088p99j429l023q99q30
$$ plain form
24005 -3884 -5059 -1273 1310 -793 -10406 -13223 -8233 -7191 -11837 -13818 -14175 -13208 -12258 -13022 -10137 -5607
23989 -5607 -2559 -794 -6452 -14097 -11304 -5692 121 2380 2116 2152 4673 10636 12495 10204 1271
23974 1271 -1103 4414 -3297 -8279 -1934 5859 4840 4212 6586 6451 6427 7626 3309 15 -4607 -2615
23958 -2615 3106 4197 2107 -820 21 -4687 -6300 -5955 2577 6009 1418 319 -6628 -6836 -4778
23943 -4778 -2832 -1807 -10735 -10511 -4932 -3065 -1477 -3247 174 2775 4773 3574 1752 -1859 -68
23928 -68 220 -1217 -1275 -3499 -1469 -2897 -7939 -5296 -2793 -2825 -4625 -3816 -4673 -1974 -570 2621 4121
23911 4121 -315 4639 12413 8765 8635 8586 3606 -4649 -6494 -2040 137 1279 -2371 -4412 -1002
23896 -1002 -1745 -4150 -4923 -7142 -7715 -16034 -18603 -16250 -8546 -1008 1005 -1413 -1617 -642 1113 3749
$$ packed form
24005c884j175L786K583k103r613k817M990J042m646j981l57R67R50p64K885M530
23989e607L048J765n658p645K793N612N813K259k64L6K521N963J859k291q933
23974A271k374N517p711m982O345P793j019o28K374j35k4J199m317l294m622J992
23958b615N721J091k090k927Q41m708j613L45Q532L432m591j099o947k08K058
23943d778J946J025q928K24N579J867J588j770L421K601J998j199j822l611J791
23928f8K88j437n8k224K030j428n042K643K503l2j800Q09q57K699J404L191J500
23911D121m436M954P774l648j30m9m980q255j845M454K177J142l650k041L410
23896a002p43k405p73k219n73q319k569K353P704P538K013k418k04R75J755K636
$$ plain form
23880 3749 11483 13753 8625 2764 964 3104 9963 3216 -2595 -4672 -10078 -9553 -4218 -4008 -5131
23865 -5131 -10542 -8716 -5039 4904 7503 4384 4363 3676 -1822 -12873 -14494 -3776 2499 2741 5809
23850 5809 8578 5470 4194 -201 -4202 175 9303 4807 1968 -539 -2718 6701 10322 8847 5154
23835 5154 4685 -1480 -6833 -10409 -12119 -11685 -9286 -4491 -4289 -4912 -3724 -5742 -8415 -1951 942 2127
23819 2127 1854 1577 -1455 -1763 -3985 -1105 6767 11916 5682 1416 -5679 -5594 -9228 -10041 -9151 -10623
23803 -10623 -11933 -7770 -6789 -2901 -2419 -1332 1522 376 -11445 -7072 -3355 -777 6853 4205 418
23788 418 -5623 -11634 -15136 -8694 -6214 -6082 -5169 -5588 -13825 -17252 -14470 -13501 -6437 97 1772 537
23772 537 1093 987 4268 3054 700 -244 4218 5902 1518 -1054 574 -2576 -4082 208 -2833 -2671
$$ packed form
23880C749P734K270n128n861j800K140O859o747n811k077n406N25N335K10j123
23865e131n411J826L677R943K599l119k1o87n498j1051j621J0718O275K42L068
23850E809K769l108j276m395m001M377R128m496k839k507k179R419L621j475l693
23835E154m69o165n353l576j710M34K399M795K02o23J188k018k673O464K893J185
23819B127k73k77l032l08k222K880P872N149o234m266p095Q5l634q13Q90j472
23803a0623j310M163R81L888M82J087K854j146j1821M373L717K578P630k648l787
23788D18o041o011l502O442K480J32R13m19q237l427K782R69P064O534J675j235
23772E37N56j06L281j214k354r44M462J684m384k572J628l150j506M290l041J62
$$ plain form
23756 -2671 -1125 -324 662 -249 -4482 450 -3470 -4465 -1393 1170 -3472 -14588 -18842 -14160 -8251
23741 -8251 -7024 -11585 -9370 -8308 -10099 -6442 -8093 -4524 -7249 -9505 -5788 -2952 -6688 -5717 -4486
23726 -4486 -3163 2138 4423 5679 8290 4916 -441 -494 -2143 -2829 -793 2781 -3639 -11040 -9056
23711 -9056 -6137 -5829 -927 -4149 -6335 -4885 -2654 -7971 -11478 -7306 -9043 -11506 -7083 -3114 -1425
23696 -1425 5963 12774 2533 -2456 -12182 -10472 -10755 -10446 -12464 -6561 -4555 -1734 4440 7978 7051
23681 7051 3214 -3440 1123 1522 -3666 -5922 827 5289 9088 5152 -48 -5425 -12217 -10028 -5854
23666 -5854 367 -1019 1669 260 4988 -2432 -5722 -8306 -12219 -7716 -8025 -3972 717 -643 592
23651 592 -1095 1126 5451 7723 -882 -1032 -6984 -3403 -6025 -4130 -3573 -7792 -10939 -15079 -10727
$$ packed form
23756b671J546Q01R86r11m233M932l920r95L072K563m642j1116m254M682N909
23741h251J227m561K215J062j791L657j651L569k725k256L717K836l736R71J231
23726d486J323N301K285J256K611l374n357n3j649o86K036L574o420p401J984
23711i056K919L08M902l222k186J450K231n317l507M172j737k463M423L969J689
23696a425P388O811j0241m989r726J710k83L09k018N903K006K821O174L538r27
23681G051l837o654M563L99n188k256O749M462L799l936n200n377o792K189M174
23666e854O221j386K688j409M728p420l290k584l913M503l09M053M689j360J235
23651E92j687K221M325K272q605j50n952L581k622J895N57m219l147m140M352
$$ plain form
23636 -10727 -7848 -8064 -8628 -5686 -9991 -11409 -8485 -6043 -5060 -2793 -5161 -9918 -5125 -122 -3442
23621 -3442 533 -294 708 4341 3360 3186 885 -4302 -8621 -3711 -3590 -6161 -3981 -2203 -627 3422
23605 3422 4630 -781 -3709 -2661 -6375 -3650 -2063 -3881 -3698 -13215 -11537 -6241 -5370 946 3931
23590 3931 5649 1785 326 2509 -2269 -9135 -13485 -11152 -12218 -13265 -7966 -1684 2452 6406 4567
23575 4567 -161 -455 -506 5366 2285 -4787 -1985 1267 -935 -3307 -2132 -739 4841 4921 4650 2390
23559 2390 2372 522 -1905 -2054 -4619 -1988 -4092 -7478 -8240 -7706 -5739 -4079 1508 2347 -6019 -8159
23543 -8159 -4527 -7979 -10027 -7548 -1951 6946 8897 10718 6930 1244 3318 5224 4584 4901 4375
23528 4375 3136 1784 -1606 -2706 -1309 2361 8185 7606 4852 2530 90 -3343 -1110 -445 -712
$$ packed form
23636a0727K879k16n64K942m305j418K924K442R83K267k368m757M793N003l320
23621c442L975q27J002L633r81j74k301n187m319M910J21k571K180J778J576M049
23605C422J208n411k928J048l714K725J587j818J83r517J678N296Q71O316K985
23590C931J718l864j459K183m778o866m350K333j066j047N299O282M136L954j839
23575D567m728k94n1N872l081p072K802L252k202k372J175J393N580Q0k71k260
23559B390j8j850k427j49k565K631k104l386p62N34J967J660N587Q39q366k140
23543h159L632l452k048K479N597Q897J951J821l788n686K074J906o40L17n26
23528D375j239j352l390j100J397L670N824n79k754k322k440l433K233O65k67
$$ plain form
23513 -712 2619 -1189 -1405 1653 4329 4237 2861 257 -469 1917 409 957 6749 7305 3718 -1771
23497 -1771 -5911 -4716 -3978 864 3932 -949 -1752 -10116 -9489 -6128 -3215 1219 6564 938 -7512
23482 -7512 -11025 -8844 -8245 -9017 -8003 -3279 263 4082 5771 3411 1794 4139 4964 6989 9589
23467 9589 4222 -1467 555 -1511 -5162 -8320 -8525 -4684 -2820 -6358 -4731 -3393 442 899 4914
23452 4914 8075 8027 -1469 -3270 414 891 3616 4400 7646 2137 -8057 -11736 -6144 -6303 -7517 -4286
23436 -4286 667 1394 885 3673 4154 1795 -2341 -240 4872 6726 5077 2682 -1641 8590 13376
23421 13376 10365 4009 -1407 -6143 -8154 -4217 -444 -1814 -3329 -1409 6546 5403 7214 12351
23407 12351 9887 6861 4065 -2510 -3051 -2258 -129 4268 2038 -2142 -2156 -2394 -2011 -5541 -8287 -12132
$$ packed form
23513g12L331l808k16L058K676r2j376k604p26K386j508N48N792N56l587n489
23497a771m140J195P38M842L068m881q03q364O27L361K913M434N345n626q450
23482g512l513K181N99p72J014M724L542L819J689k360j617K345Q25K025K600
23467I589n367n689K022k066l651l158k05L841J864l538J627J338L835M57M015
23452D914L161m8r496j801L684M77K725P84L246n509j0194l679N592j59j214L231
23436d286M953P27n09K788M81k359m136K101N112J854j649k395m323J0231M786
23421A3376l011o356n416m736k011L937L773j370j515J920P955j143J811N137
23407A2351k464l026k796o575n41P93K129M397k230m180j4k38L83l530k746l845
$$ plain form
23391 -12132 -6442 2794 -20 -4454 -7032 -5014 -5337 -2696 -2863 -6727 -6845 -7176 -4993 1038 1699 2457
23375 2457 5655 2394 -1538 -3381 -611 4667 5664 -712 -4808 -7901 -9910 -7904 -4121 -3416 -3601
23360 -3601 -2274 -4284 781 -748 -3127 -10552 -9371 -10184 -8419 -4280 1461 4409 777 -4491 -2476
23345 -2476 1483 3440 -1565 -1184 -486 -2113 -5882 -9843 -12552 -9048 -5706 -9942 -8155 -9199 -4396
23330 -4396 -1028 -1705 321 1005 932 86 2095 698 2293 -520 -5353 -4768 -3356 -2390 -2413 -7469 -6146
23313 -6146 -5505 -1811 4479 9383 65 -4446 -4175 -3358 -298 1523 3230 2793 2589 6247 7913 1684
23297 1684 115 4829 3088 234 2130 4940 6204 11934 6074 5661 4432 -70 -8767 -8460 -4044
23282 -4044 3458 5410 1573 -5796 -1243 3984 12424 10869 1455 -635 7522 9127 10957 3063 -266
$$ packed form
23391a2132N690R236k814m434k578K018l23K641j67l864j18l31K183O031O61P58
23375B457L198l261l932j843K770N278R97o376m096l093k009K006L783P05j85
23360c601J327k010N065j529k379p425J181q13J765M139N741K948l632n268K015
23345b476L959J957n005L81O98j627l769l961k709L504L342m236J787j044M803
23330d396L368o77K026O84p3q46K009j397J595k813m833N85J412R66k3n056J323
23313f146O41L694O290M904r318m511K71Q17L060J821J707m37k04L658J666o229
23297A684j569M714j741k854J896K810J264N730n860m13j229m502q697L07M416
23282d044P502J952l837p369M553N227Q440j555r414k090Q157J605J830p894l329
$$ plain form
23267 -266 9661 12172 3771 1339 -669 -3220 4885 15205 12571 3677 707 340 347 -189 -2720 -1712
23251 -1712 -1094 -4026 -3899 -5826 -10210 -15344 -11505 -2290 -2804 -1006 -5769 -4783 720 -2552 -1538 -2308
23235 -2308 380 7040 15388 13438 17266 14544 5859 4236 5339 4600 -1089 -5982 -8385 -13867 -16074
23220 -16074 -11633 -4016 2050 8717 13008 10811 10883 8947 4136 -1585 -2201 -5626 -4679 -1030 -6737
23205 -6737 -9391 -8576 270 -1352 -7442 -9825 -8538 -13728 -15492 -12442 -10294 -9707 -2060 8950 11664
23190 11664 13196 8914 -4015 -9692 -9025 -217 8222 16615 17916 6966 78 -4576 -6011 -4838
23176 -4838 -4577 -13665 -9235 799 6321 984 -9474 -10048 -10082 -3411 6405 3104 -6905 -4458 5138
23161 5138 16419 27938 33357 19543 7392 456 5720 8210 11866 2750 -1576 -3391 -8087 -5224
$$ packed form
23267b66R927K511q401k432k008k551Q105J0320k634q894k970l67Pn36k531J008
23251a712O18k932J27j927m384n134L839R215n14J798m763R86N503l272J014p70
23235b308K688O660Q348j950L828k722q685j623J103p39n689m893k403n482k207
23220a6074M441P617O066O667M291k197P2j936m811n721o16l425R47L649n707
23205f737k654Q15Q846j622o090k383J287n190j764L050K148N87P647J1010K714
23190A1664J532m282j2929n677O67Q808Q439Q393J301j0950o888m654j435J173
23176d838K61r088M430J0034N522n337j0458n74l4O671R816l301j0009K447R596
23161E138J1281J1519N419j3814j2151o936N264K490L656r116m326j815m696K863
$$ plain form
23147 -5224 -5291 -8198 -10706 -14947 -17519 -13299 -11577 -7307 -1301 4619 13417 13121 6378 2935 556
23132 556 -3822 -6346 -1199 302 -2810 -6760 -12936 -7304 1921 11875 15666 14988 12737 14060 4164
23117 4164 -1567 -3498 -6371 -1271 166 1724 5342 7536 7115 -3164 -13422 -17211 -13987 -6080
23103 -6080 -3953 897 869 -2873 -3070 4201 8431 11089 4085 -5649 -7194 -516 394 1644 4434 4334
23087 4334 -2544 -11657 -15994 -14188 -10533 -4431 -432 1323 -2503 6173 10220 7187 6689 2613 6122
23072 6122 12989 14265 4069 2104 4922 288 -1758 6344 11379 13893 11901 9927 10006 13726 19574
23057 19574 22233 17949 8721 5710 7163 3170 12152 13602 13882 7344 4683 4207 4465 43 2795
23042 2795 10332 10954 4174 -247 3537 9800 6233 5986 3555 -1275 5657 9707 12508 13099 6088
$$ packed form
23147e224o7k907k508m241k572M220J722M270O006N920Q798k96o743l443k379
23132E56m378k524N147J501l112l950o176N632R225R954L791o78k251J323r896
23117D164n731j931k873N100J437J558L618K194m21j0279j0258l789L224P907
23103f080K127M850k8l742j97P271M230K658p004r734j545O678R10J250K790j00
23087D334o878r113m337J806L655O102L999J755l826Q676M047l033m98m076L509
23072F122O867J276j0196j965K818m634k046Q102N035K514j992j974P9L720N848
23057A9574K659m284r228l011J453l993Q982J450K80o538k661m76K58m422K752
23042B795P537O22o780m421L784O263l567k47k431m830O932M050K801N91p011
$$ plain form
23027 6088 4323 2133 1551 -2920 -3338 -4200 -1718 671 6772 7854 11284 20437 13263 9131 8233 11539
23011 11539 15964 12346 2564 2115 3939 2753 2383 2229 595 -642 169 -1984 -3295 1639 1366 3421
22995 3421 6973 11662 7450 5233 168 -2498 60 1635 3428 9592 11712 5760 -560 -778 6863
22980 6863 12589 10184 4988 -2369 -7462 -984 1911 4050 11296 13711 8493 6631 58 -1132 -1705
22965 -1705 -1263 709 5450 11323 15590 15902 15567 18400 17954 12792 10150 6061 1074 1944 -1974 6355
22949 6355 9775 10589 16024 14745 13447 10114 1137 -37 2465 2232 4577 7956 15093 17950 16090
22934 16090 11884 14033 10397 7734 8640 206 1969 4705 6681 8133 9577 1999 -7346 -4829 7595
22919 7595 8769 7161 13917 14485 17620 17992 13197 8325 8067 5417 -380 932 2513 5974 2900
$$ packed form
23027F088j765k190n82m471m18q62K482K389O101J082L430R153p174m132q98L306
23011A1539M425l618r782m49J824j186l70j54j634j237Q11k153j311M934k73K055
22995C421L552M689m212k217n065k666K558J575J793O164K120n952o320k18P641
22980F863N726k405n196p357n093O478K895K139P246K415n218j862o573j190n73
22965a705M42J972M741N873M267L12l35K833m46n162k642m089m987Q70l918Q329
22949F355L420Q14N435j279j298l333q977j174K502k33K345L379P137K857j860
22934A6090m206K149l636k663R06q434J763K736J976J452J444p578r345K517J2424
22919G595J174j608O756N68L135L72m795m872k58k650n797J312J581L461l074
$$ plain form
22904 2900 7768 12255 14686 13707 15319 12727 12324 13151 10334 10397 13159 14878 21844 12777 7048 7177
22888 7177 8976 14790 19229 20793 18126 9128 6974 7807 7901 8494 6175 10278 17945 22310 19482 16343
22872 16343 14953 13189 11761 9910 8639 12248 12717 12662 10669 8669 9151 14981 14436 16919 12919 11480
22856 11480 13247 14414 14766 14420 20182 20141 16971 13299 12683 14637 14197 15661 22166 29029 26804 31452
22840 31452 36263 37016 35098 41638 53492 57467 57471 56465 68903 84700 104336 137447 191396 276130
22826 276130 423754 690684 1111059 1576294 1845403 1771291 1413637 1044401 867312 924084
22816 924084 1214217 1619191 1883364 1803292 1403899 923664 571058 367984 255826 191352
22806 191352 144706 114716 99871 80040 67078 61247 53304 47881 42555 42645 45833 39866 35666
$$ packed form
22904B900M868M487K431r79J612k592m03Q27k817O3K762J719O966r067n729J29
22888G177J799N814M439J564k667q998k154Q33R4N93k319M103P667M365k828l139
22872A6343j390j764j428j851j271L609M69n5j993k000M82N830n45K483m000j439
22856A1480J767J167L52l46N762m1l170l672o16J954m40J464O505O863k225M648
22840C1452M811P53j918O540J1854L975Mj006J2438J5797J9636L3111N3949Q4734
22826B76130J47624K66930M20375M65235K69109p4112l57654l69236j77089N6772
22816I24084K90133M04974K64173q0072l99393m80235l52606k03074j12158o4474
22806A91352m6646k9990j4845j9831j2962n831p943n423n326R0L188n967m200
$$ plain form
22793 35666 34397 35807 32833 32335 30256 31969 36158 38203 36629 37657 26991 19637 22593 26048
22779 26048 22920 21982 19801 18230 19059 23880 24740 17495 20524 24192 22584 18504 18262 18571 15307 4094
22763 4094 2141 4115 8013 12051 12494 15170 18222 14452 7364 8369 12466 10897 9958 12520 14030
22748 14030 11733 11728 9885 9 -10 10266 11605 16585 20371 13000 14010 11571 9610 10530 10855 10629
22732 10629 6259 7336 11622 15933 20756 22698 21517 20207 16328 9669 9877 9721 13051 18228 24450
22717 24450 20582 14652 9268 9393 13301 15129 18909 21378 19732 19225 23436 28595 29883 26360 25413
22702 25413 26144 23878 17996 11046 6521 9356 10414 13135 15633 16923 11609 14622 9767 8682 8637
22687 8637 7925 14400 23002 29479 31702 27570 18065 13466 18884 20805 19331 12825 11945 16832 20802
$$ packed form
22793C5666j269J410k974m98k079J713M189K045j574J028j0666p354K956L455
22779B6048l128r38k181j571Q29M821Q60p245L029L668j608m080k42L09l264j1213
22763D094j953J974L898M038M43K676L052l770p088J005M097j569r39K562J510
22748A4030k297nj843r876j9J0276J339M980L786p371J010k439j961R20L25k26
22732A0629m370J077M286M311M823J942j181j310l879o659K08j56L330N177O222
22717B4450l868n930n384J25L908J828L780K469j646n07M211N159J288l523r47
22702B5413P31k266n882o950m525K835J058K721K498J290n314L013m855j085m5
22687H637p12O475Q602O477K223m132r505m599N418J921j474o506q80M887L970
$$ plain form
22672 20802 18276 18610 15776 15922 16151 18121 23953 25677 23252 25758 28018 25570 24051 17656 19069
22657 19069 22447 22242 21830 23923 22460 20675 18221 10028 8987 12014 21878 22149 25015 22299 21872
22642 21872 23865 17778 10822 13081 18726 15277 14354 22713 27536 22015 18259 17708 15777 16761 14832
22627 14832 11757 7872 7764 13351 7618 7419 8482 7404 7071 9956 11049 7115 12963 18137 17296
22612 17296 20336 17809 17749 15402 15018 11833 12719 11857 10449 14352 11586 11723 16687 15599 15879 15042
22596 15042 10018 11911 10310 526 5112 13748 11946 8792 1010 -10813 -18907 -22002 -20197 -19617
22582 -19617 -24540 -28409 -30366 -33522 -28905 -17430 -4700 -485 -2524 -5148 1669 29082 81480
22569 81480 131808 154265 143141 122698 108867 109060 123279 158314 191648 204197 186233 171051
$$ packed form
22672B0802k526L34k834J46K29J970N832J724k425K506K260k448j519o395J413
22657A9069L378k05m12K093j463j785k454q193j041L027R864K71K866k716m27
22642B1872J993o087o956K259N645l449r23Q359M823n521l756n51j931R84j929
22627A4832l075l885j08N587n733j99J063j078l33K885J093l934N848N174q41
22612A7296L040k527o0k347l84l185Q86q62j408L903k766J37M964j088K80q37
22596A5042n024J893j601r784M586Q636j802l154p782j1823q094l095J805N80
22582a9617m923l869j957l156M617J1475J2730M215k039k624O817K7413N2398
22569H1480N0328K2457j1124k0443j3831J93J4219L5035L3334J2549j7964j5182
$$ plain form
22557 171051 165676 176639 209590 244374 248545 218300 174023 153697 155285 179256 211597 224290
22545 224290 205930 160557 107531 76585 65209 63326 70273 73138 68921 65498 66988 65033 61372
22532 61372 61166 58689 57295 62548 72821 83541 91018 97004 97518 99662 106894 108909 119466 149076
22518 149076 194653 237619 263058 267682 233375 200161 195256 206497 228801 258332 289374 295758
22506 295758 260420 218936 197696 180472 149662 125386 115616 116570 119589 123977 134565 139683 141384
22493 141384 128238 100483 90848 85994 83919 84950 90868 94349 97547 99707 86895 78666 70438
22480 70438 64488 63349 65654 70335 74609 83303 91496 98503 108383 119433 121331 121663 124825 124480 132060
22465 132060 149242 165564 176851 182937 186168 185554 180780 185802 210935 253217 311845 355159 335116
$$ packed form
22557A71051n375J0963L2951L4784M171l0245m4277k0326J588K3971L2341J2693
22545B24290j8360m5373n3026l0946j1376j883O947K865m217l423J490j955l661
22532F1372k06k477j394N253J0273J0720P477N986N14K144P232K015J0557K9610
22518A49076M5577M2966K5439M624l4307l3214m905J1241K2304K9531L1042O384
22506B95758l5338m1484k1240j7224l0810k4276r770R54L019M388J0588N118J701
22493A41384j3146k7755r635m854k075J031N918L481L198K160j2812q229q228
22480G0438n950j139K305M681M274Q694Q193P007R880J1050J898L32L162l45P580
22465A32060J7182J6322J1287O086L231o14m774N022K5133M2282N8628M3314k0043
$$ plain form
22452 335116 261811 168408 103774 94562 129895 189488 242639 232176 171006 86458 13050 -29798
22440 -29798 -49446 -53000 -41903 -27327 -14846 -9569 -14497 -21032 -22453 -21022 -8508 6216 10698
22427 10698 120 -10098 -12447 -7665 -2270 4450 2857 -8293 -15563 -9704 9683 23403 37981
22414 37981 45720 56212 56864 59469 73076 89912 95838 100481 105010 95865 87768 83128 82328 80008
22400 80008 76291 65033 48056 41819 37815 32826 41789 94426 222362 463776 794369 1100609
22388 1100609 1221006 1074653 797709 567092 415902 333804 302567 328831 403628 463170
22378 463170 495858 514995 507187 496763 484816 485137 506787 564726 677836 871840 1201336
22367 1201336 1665606 2081409 2206066 1965091 1536640 1219730 1138457 1309380 1704193 2094169
$$ packed form
22452C35116p3305r3403o4634r212L5333N9593N3151j0463o1170q4548p3408m2848
22440b9798j9648l554J1097J4576J2481N277m928o535j421J431J2514J4724M482
22427A0698j0578j0218k349M782N395O720j593j1150p270N859J9387J3720J4578
22414C7981P739J0492O52K605J3607J6836N926M643M529r145q097m640q00k320
22400H0008l717j1258j6977o237m004m989Q963N2637J27936K41414L30593L06240
22388A100609J20397j46353k76944k30617j51190q2098l1237K6264P4797N9542
22378D63170L2688J9137p808j0424j1947L21K1650N7939J13110J94004L29496
22367A201336M64270M15803J24657k40975m28451l16910q1273J70923L94813L89976
$$ plain form
22357 2094169 2213294 1955498 1457990 1000341 706872 537860 448683 413174 391211 378855
22347 378855 377680 377978 361813 340939 323792 311683 310198 322875 350350 381751 406294 429394
22335 429394 446974 452742 462445 475031 486033 504919 546885 604008 650300 669522 672412 674580
22323 674580 690038 709250 725324 738247 747807 754601 764961 781728 801635 824563 847788 873186
22311 873186 902088 931538 958907 992157 1021250 1032310 1035620 1059706 1111787 1198859 1315596
22300 1315596 1424933 1504496 1546356 1557996 1566011 1616726 1740840 1908967 2080557 2218956
22290 2218956 2330753 2459101 2627748 2832814 3080564 3375872 3706247 4043759 4413861
22281 4413861 4884805 5486737 6174912 6889765 7671515 8588940 9707964 11192329 13267544
$$ packed form
22357B094169J19125k57796m97508m57649k93469j69012q9177l5509k1963j2356
22347C78855j175K98j6165k0874j7147j2109j485J2677K7475L1401K4543K3100
22335D29394J7580N768R703J2586J1002J8886M1966N7123M6292J9222K890K168
22323F74580J5458J9212J6074J2923R560O794J0360J6767J9907K2928K3225K5398
22311H73186K8902K9450K7369L3250K9093J1060L310K4086N2081Q7072J16737
22300A315596J09337P9563M1860J1640Q015N0715J24114J68127J71590J38399
22290B218956J11797J28348J68647K05066K47750K95308L30375L37512L70102
22281D413861M70944O01932O88175P14853P81750R17425J119024J484365K075215
$$ plain form
22272 13267544 16180304 20210429 25887045 34462521 48363180 72082229 113872815 183133755
22264 183133755 268272262 328127876 332157526 279444118 206615098 160260089 157390002
22257 157390002 198404364 269075254 326582756 333581596 281064001 196601350 124396483
22250 124396483 79684920 54286805 39318175 29928911 23626782 19178374 15937598
22243 15937598 13481147 11521480 9899438 8582230 7528810 6708564 6065026 5541693
22235 5541693 5090524 4669315 4287253 3969462 3685055 3406457 3128067 2874415 2693118
22226 2693118 2568295 2472657 2370773 2252361 2119997 1960173 1792328 1658907 1565986 1495354
22216 1495354 1439206 1398436 1357122 1310607 1253072 1171451 1089072 1015866 963405 913878 871979
$$ packed form
22272A3267544K912760M030125N676616Q575476J3900659K3719049M1790586O9260940
22264A83133755Q5138507N9855614M029650n2713408p2829020m6355009k870087
22257A57390002M1014362P0670890N7507502O998840n2517595q4462651p2204867
22250A24396483m4711563k5398115j4968630r389264o302129m448408l240776
22243A5937598k456451j959667j622042j317208j053420q20246o43538n23333
22235E541693m51169m21209l82062l17791k84407k78598k78390k53652j81297
22226B693118j24823r5638j01884j18412j32364j59824j67845j33421r2921p0632
22216A495354n6148m0770m1314m6515n7535q1621q2379p3206n2461m9527m1899
$$ plain form
22205 871979 829438 789597 760977 736353 701537 662468 625539 598027 577062 557934 535209
22194 535209 505303 470113 440073 408186 390124 394507 410692 432642 460798 469293 456712 442304
22182 442304 428085 419050 420495 434255 449077 454284 457634 456250 446418 421805 393433 376644 374290
22169 374290 386978 409061 426837 445156 463556 490597 555259 701511 993924 1449975 1908175
22158 1908175 2099540 1908232 1480891 1136861 1030405 1171830 1534122 1918433 2055060
22149 2055060 1817245 1323141 856488 557711 394279 295981 222396 167110 129602 94208
22139 94208 67306 66786 95603 164877 221123 243729 251067 237755 207093 199361 225446 293705
22127 293705 365453 391114 397083 385716 356133 326089 301394 275446 253159 235698 224980 213628
$$ packed form
22205H71979m2541l9841k8620k4624l4816l9069l6929k7512k0965j9128k2725
22194E35209k9906l5190l0040l1887j8062M383J6185K1950K8156Q495j2581j4408
22182D42304j4219r035J445J3760J4822N207L350j384r832k4613k8372j6789k354
22169C74290J2688K2083J7776J8319J8400K7041O4662J46252K92413M56051M58200
22158A908175J91365j91308m27341l44030j06456J41425L62292L84311J36627
22149B055060k37815m94104m66653k98777j63432r8298p3585n5286l7508l5394
22139I4208k6902n20K8817O9274N6246K2606P338j3312l0662p732K6085O8259
22127B93705P1748K5661N969j1367k9583l0044k4695k5948k2287j7461j0718j1352
$$ plain form
22115 213628 205337 195527 181386 173682 167422 163521 177735 191595 195321 185459 179694 181399 185524
22102 185524 190559 209054 222885 216097 204583 196459 192361 190789 185584 184405 187275 187555 183186 180255
22088 180255 185677 201050 210125 206412 203620 199227 198896 202657 215867 233090 239479 233513 211487
22075 211487 168050 99513 -1730 -80154 -83720 -34859 8315 37722 39720 -7392 -101450 -196558
22063 -196558 -225882 -186803 -134191 -94371 -67228 -61003 -63357 -63182 -59055 -48169 -33307 -22598
22051 -22598 -12540 -1503 5253 2293 -1740 -905 4622 12950 20539 27452 28778 23151 28642 42634
22037 42634 46131 39659 37962 28071 21944 22949 47505 77948 93743 92797 74697 43629 15925
22024 15925 -3798 -10004 -15825 -18854 -10354 -5593 -2115 -1080 1360 -6171 -9009 2638 11429 22052
$$ packed form
22115B13628q291r810j4141p704o260l901J4214J3860L726r862n765J705M125
22102A85524N035J8495J3831o788j1514q124m098j572n205j179K870K80m369k931
22088A80255N422J5373R075l713k792m393l31L761J3210J7223O389n966k2026
22075B11487m3437o8537j01243p8424l566M8861M3174K9407J998m7112r4058r5108
22063a96558k9324L9079N2612L9820K7143O225k354J75M127J0886J4862J0709
22051b2598J0058J1037O756k960m033Q35N527Q328P589O913J326n627N491J3992
22037D2634L497o472j697r891o127J005K4556L0443J5795r46j8100l1068k7704
22024A5925j9723o206n821l029Q500M761L478J035K440p531k838J1647Q791J0623
$$ plain form
22010 22052 46807 58274 44914 18398 12293 15633 23852 41739 65416 72289 59064 36863
21998 36863 19831 14282 14957 20991 30978 36350 43464 48741 40303 30276 26952 26204 23693 18637
21984 18637 17515 14270 10743 19072 21817 22684 16920 13411 13860 7620 12018 13848 12592 5528 -250
21969 -250 -4766 -8875 -7037 -10013 -16092 -30171 -44564 -43464 -47307 -64673 -95007 -119922 -135763
21956 -135763 -132728 -109855 -77351 -46318 -35135 -55313 -77801 -82927 -70578 -37461 12019 50097
21944 50097 70222 64256 52263 54923 64237 78448 90920 90318 84038 78137 73253 73685 67589 63362
21930 63362 56505 45731 33707 30053 35620 33909 26905 28864 27864 25948 19792 15938 16421 21105
21916 21105 21310 12958 11122 18319 20288 23585 26123 28943 30665 31340 26970 25363 27733 26066 19900
$$ packed form
22010B2052K4755J1467j3360k6516o105L340Q219J7887K3677O873j3225k2201
21998C6863j7032n549O75O034R987N372P114N277q438j0027l324p48k511n056
21984A8637j122l245l527Q329K745Q67n764l509M49o240M398J830j256p064n778
21969b50m516m109J838k976o079j4079j4393J100l843j7366l0334k4915j5841
21956a35763L035K2873L2504L1033J1183k0178k2488n126J2349L3117M9480L8078
21944E0097K0125n966j1993K660R314J4211J2472o02o280n901m884M32o096m227
21930F3362o857j0774j2024l654N567j711p004J959j000j916o156l854M83M684
21916B1105K05q352j836P197J969L297K538K820J722O75m370j607K370j667o166
$$ plain form
21901 19900 16499 10038 9429 13085 21715 22509 17950 20517 23021 29251 39587 40334 33460 24428 24245
21886 24245 25975 23127 17973 15155 15717 12369 9584 10629 17065 20968 24896 28433 27482 19422 13650
21871 13650 19153 21502 22157 25310 25085 23101 16341 13392 13847 17209 19055 14601 8971 9036 16249 13346
21855 13346 8006 10908 15206 14814 13202 13022 10290 6340 4721 3666 874 2547 8844 15430 23024
21840 23024 28667 32750 32138 28234 20570 16524 23447 26533 28927 29951 35507 34096 30132 30877 27863
21825 27863 19794 10292 8550 5738 6945 9993 6891 3833 4090 8361 5029 400 2313 6620 8715
21810 8715 8452 12378 11406 10023 10988 10861 11826 13654 15801 20983 20590 32116 33715 32099 33959 27448
21794 27448 18814 15045 18193 17581 11552 16273 18506 14436 6367 1105 -2173 -6506 -2445 2603 1865
$$ packed form
21901A9900l401o461o09L656Q630P94m559K567K504O230J0336P47o874r032j83
21886B4245J730k848n154k818N62l348k785J045O436L903L928L537r51q060n772
21871A3650N503K349O55L153k25j984o760k949M55L362J846m454n630O5P213k903
21855A3346n340K902M298l92j612j80k732l950j619j055k792J673O297O586P594
21840B3024N643M083o12l904p664m046O923L086K394J024N556j411l964P45l014
21825B7863q069r502j742k812J207L048l102l058K57M271l332m629J913M307K095
21810H715k63L926r72j383R65j27R65J828K147N182l93J1526J599j616J860o511
21794B7448q634l769L148o12o029M721K233m070q069n262l278m333M061N048p38
$$ plain form
21779 1865 4390 4772 1335 -2851 -2943 -3504 -744 2526 -1113 -13581 -8335 -6741 -3049 7824 22945
21764 22945 27836 25968 21618 15727 14190 21584 23279 23857 24152 22798 16550 10499 11110 14908 11605
21749 11605 4523 5778 12051 13949 7217 1535 2955 516 2747 9917 6668 4544 4070 -3944 3424
21734 3424 7069 5522 9712 5800 3719 1323 -1665 -5923 -1169 6271 4816 3536 6498 3619 2900
21719 2900 2277 5172 10829 14504 18284 14406 18733 32243 33844 34692 38885 39368 44515 51264 64308
21704 64308 80474 92494 110818 148341 210354 301230 454856 739721 1171687 1631215 1871073
21693 1871073 1748581 1364339 1013809 879039 985872 1318206 1707040 1897040 1734923
21684 1734923 1277271 811757 505439 326028 227488 174096 138357 117452 99315 83734
$$ packed form
21779A865K525L82l437m186r2n61K760L270l639j2468N246J594L692J0873J5121
21764B2945M891j868m350n891j537P394J695N78K95j354o248o051O11L798l303
21749A1605p082J255O273J898o732n682J420k439K231P170l249k124m74q014P368
21734C424L645j547M190l912k081k396k988m258M754P440j455j280K962k879p19
21719B900o23K895N657L675L780l878M327J3510J601Q48M193M83N147O749J3044
21704F4308J6166J2020J8324L7523O2013R0876J53626K84865M31966M59528K39858
21693A871073j22492l84242l50530j34770J06833L32334L88834J90000j62117
21684A734923m57652m65514l06318j79411r8540n3392l5739k0905j8137j5581
$$ plain form
21674 83734 67117 59661 53953 48290 43201 44626 42048 33098 30390 31620 22983 17085 14661 19427
21660 19427 18733 9459 11224 13993 9644 10287 11468 14759 12173 11927 10908 7562 6977 2266 -3026
21645 -3026 -2369 6924 11882 11124 10172 11281 9865 13077 7173 8180 13114 15142 17345 19103 12318
21630 12318 5936 9744 9787 8308 11709 4674 6283 11361 8961 5946 -292 -7625 -506 -678 -3063
21615 -3063 2649 6639 8697 5594 3870 3463 -2326 -4793 -3898 1223 2197 2283 3474 -2818 2366 7809
21599 7809 11477 10335 5612 7760 9541 9658 10569 8369 13353 20032 22438 11433 8663 13786 13905
21584 13905 10026 11446 13671 9461 1845 -4474 -4975 -3333 2856 6549 8073 410 -6528 -9225 -7100
21569 -7100 -4454 -3335 -55 -2734 -2589 -3827 3316 373 1774 6922 10297 11333 11382 6073 1749
$$ packed form
21674H3734j6617p456n708n663n089J425k578q950k708J230q637n898k424M766
21660A9427o94r274J765K769m349O43J181L291k586k46j019l346n85m711n292
21645c026O57R293M958p58r52J109j416L212n904J007M934K028K203J758o785
21630A2318o382L808M3j479L401p035J609N078k400l015o238p333P119j72k385
21615c063N712L990K058l103j724m07n789k467Q95N121R74Q6J191o292N184N443
21599G809L668j142m723K148J781J17R11k200M984O679K406j1005k770N123J19
21584A3905l879J420K225m210p616o319n01J642O189L693J524p663o938k697K125
21569g100K646J119L280k679J45j238P143k943J401N148L375J036M9n309m324
$$ plain form
21554 1749 3314 10074 6653 1210 -2481 -3274 2319 5140 -853 -4690 -2652 -5454 -5272 -8975 -6254
21539 -6254 -7126 -2080 6315 13587 14471 10589 3042 1086 -2842 -691 4800 8282 6823 10598 7463
21524 7463 5063 2557 1294 3762 7783 4973 -490 3231 11111 10374 5389 -703 626 -2029 -7743
21509 -7743 -1640 862 684 601 -5103 -11983 -9713 832 4277 3263 2369 8994 8206 648 -2005 -4078
21493 -4078 1002 1797 -1030 -2666 -706 664 -3867 -5525 -3782 -4356 -2743 1845 5283 6704 6492
21478 6492 4575 -1178 -3304 -1456 1859 4885 276 -5074 -669 2960 -2944 -7653 -8992 -5776 -8084
21463 -8084 -7193 -992 260 10372 9547 3011 -3902 -6202 -4494 -4932 -8670 -7800 -3710 -5174 -5242 -3679
21447 -3679 -807 795 3711 906 -5659 -5053 -4458 -1004 762 1242 -875 -10240 -11089 -8844 -9230 -2516
$$ packed form
21554A749J565O760l421n443l691p93N593K821n993l837K038k802J82l703K721
21539f254q72N046Q395P272Q84l882p547j956l928K151N491L482j459L775l135
21524G463k400k506j263K468M021k810n463L721P880p37m985o092J329k655n714
21509g743O103K502j78q3n704o880K270J0545L445j014q94O625p88p558k653k073
21493d078N080P95k827j636J960J370m531j658J743n74J613M588L438J421k12
21478F492j917n753k126J848L315L026m609n350M405L629n904m709j339L216k308
21463h084Q91O201J252J0112q25o536o913k300J708m38l738Q70M090j464o8J563
21447c679K872J602K916k805o565O06N95L454J766M80k117r365q49K245l86O714
$$ plain form
21431 -2516 -7347 -1056 8742 8073 6689 3099 -3485 -3764 3294 6928 4702 871 2740 7153 288
21416 288 -9240 -16021 -16545 -18142 -21878 -21514 -16384 -13365 -10148 -809 5229 5286 2105 -714 2223 2244
21400 2244 424 3409 18921 25017 25270 16638 8032 -2832 -7357 -5794 -2059 -2188 -1546 1136 -1451
21385 -1451 873 6839 14972 19046 10416 2378 -2177 -5074 -4176 -9234 -14090 -16962 -17024 -14275 -9760
21370 -9760 -5352 -6639 -7684 1792 1862 946 3897 -5056 -10746 -9040 -1027 15984 25518 29976 16911
21355 16911 5638 -3065 -2938 9058 9486 52 -8714 -14360 -10147 -966 5708 59 -9307 -13768
21341 -13768 -15411 -11450 -5758 -4367 -3646 -897 5323 16201 6833 -4394 -9833 -4125 -591 7328
21327 7328 19300 15459 7877 5895 -375 -2982 -6675 -16107 -20915 -17251 -12621 -6691 -4352 -1582
$$ packed form
21431b516m831O291R798o69j384l590o584k79P058L634k226l831J869M413o865
21416B88r528o781n24j597l736L64N130L019L217R339O038N7l181k819K937K1
21400B244j820K985J5512O096K53q632q606j0864m525J563L735j29O42K682k587
21385a451K324N966Q133M074q630q038m555k897Q98n058m856k872o2K749M515
21370i760M408j287j045R476P0r16K951q953n690J706Q013J7011R534M458j3065
21355A6911j1273q703J27J1996M28r434q766n646M213R181O674n649r366m461
21341a3768j643L961N692J391P21K749O220J0878r368j1227n439N708L534P919
21327G328J1972l841p582j982o270k607l693r432m808L664M630N930K339K770
$$ plain form
21313 -1582 -7017 -11417 -17403 -20706 -16624 -9551 -6993 -1247 -1605 1164 10753 6646 345 -6894 -16126
21298 -16126 -20398 -18522 -16985 -13952 -8447 -9341 -2628 3909 132 2150 1557 6817 7207 -1531 -7784
21283 -7784 -12380 -11803 -7647 -3401 -400 -887 -5193 -8662 -9439 -3923 -2548 -1420 -3284 1446 10148
21268 10148 8294 3783 3226 -430 -3356 2284 2796 2402 -1001 -989 -1486 -8038 -10636 -7759 -9776 -12093
21252 -12093 -14313 -11354 -10353 -7970 -4956 -5949 -5478 -6310 -6416 -6648 -7245 -6449 -7249 -1880 2400 4148
21236 4148 2882 -391 -2758 -127 -5448 -9035 -4582 -1119 1584 -1275 -6389 -4830 943 857 17
21221 17 -4200 -10150 -10523 -12026 -10778 -7779 -11276 -9868 -4910 -5757 -5668 -3393 -3274 -8952 -10652 -3145
21205 -3145 1052 5648 4082 -1286 -3579 3163 3779 1659 277 -107 668 -8760 -11035 -9427 -11835
$$ packed form
21313a582n435m400n986l303M082P073K558N746l58K769R589m107o301p239r232
21298a6126m272J876J537L033N505q94O713O537l777K018n93N260L90q738o253
21283g784m596N77M156M246L001m87m306l469p77N516J375J128j864M730Q702
21268A0148j854m511n57l656k926N640N12l94l403J2m97o552k598K877k017k317
21252a2093k220K959J001K383L014r93M71q32j06k32n97P96q00N369M280J748
21236D148j266l273k367K631n321l587M453L463K703k859n114J559N773q6q40
21221A7m217n950l73j503J248K999l497J408M958q47Q9K275J19n678j700P507
21205c145M197M596j566n368k293O742O16k120j382l84P75r428k275J608k408
$$ plain form
21190 -11835 -16575 -12308 -7570 -4162 2144 4641 2119 -2799 809 3576 3581 3813 8405 3414 -1654
21175 -1654 1170 -730 -5969 -3556 -9143 -9509 -1557 4021 4565 5305 4315 -1991 -4725 -7278 -10749 -10311
21159 -10311 -7498 -4217 -6453 -7827 -6161 -8497 -6425 -2873 -3516 -4106 -3281 -1725 -7751 -5293 692
21144 692 585 -1286 311 2623 -2620 -3600 -2554 -4737 -4555 -1957 -944 2125 8073 7187 -890 -7665
21128 -7665 -2462 2710 4744 841 -5943 -3939 899 3809 1263 -6499 -10389 -10526 -9051 -6930 -5875
21113 -5875 -8639 -10697 -14372 -13033 -16707 -18018 -18283 -16252 -12149 -13763 -13672 -11196 -4824 -3076 -2088 12
21097 12 -2431 -2517 -932 455 -2542 -9910 -13935 -14762 -14620 -17178 -12949 -6913 -3332 594 723 1039 2213
21080 2213 -1014 -1085 6427 2338 -4012 -5459 -5895 -7909 -8913 -11829 -12344 -10757 -10560 -10020 -4441 2974
$$ packed form
21190a1835m740M267M738L408O306K497k522m918L608K767NK32M592m991n068
21175a654K824j900n239K413n587l66P952N578N44P40r90o306k734k553l471M38
21159a0311K813L281k236j374J666k336K072L552o43n90Q25J556o026K458N985
21144F92j07j871J597K312n243r80J046k183J82K598J013L069N948q86q077o775
21128g665N203N172K034l903o784K004M838K910k546p762l890j37J475K121J055
21113e875k764k058l675J339l674j311k65K031M103j614R1K476O372J748R88K100
21097A2k443q6J585J387k997p368m025q27J42k558M229O036L581L926J29L16J174
21080B213l227p1P512m089o350j447m36k014j004k916n15J587J97N40N579P415
$$ plain form
21064 2974 4694 3587 2428 107 -2431 -1095 1675 -1722 -2397 -4315 -8927 -8729 -4567 53 1654
21049 1654 3641 7172 14692 12588 3612 1269 1471 -2969 -6448 -6731 -4032 -850 1224 759 -580
21034 -580 1076 7666 8540 5869 4954 -1084 -6652 -2870 -3415 342 2031 4547 7159 7744 5707 5041
21018 5041 5605 9208 587 -1177 1445 3965 3403 -1005 -2988 -2933 -1531 -9460 -11534 -6580 -989 1415
21002 1415 618 1037 2323 -6804 -6313 -4278 -3956 -3225 -9960 -10149 -8741 -3408 1390 -2444 -8836 -9558
20986 -9558 -7375 1191 1529 2148 5464 5741 3793 3979 -2014 1478 1622 -6914 -8559 -1337 3632 9543
20970 9543 9415 9834 10165 7085 4719 7077 6495 1343 -2414 -5461 -5626 -9838 -8947 -8280 -11705 -9498
20954 -9498 -8058 -5732 -11153 -7112 -6795 -7679 -1530 3496 1258 -2609 -3411 -1632 -6651 -5883 -3176 -1986
$$ packed form
21064B974J720j107j159k321k538J336K770l397o75j918m612J98M162M620J601
21049A654J987L531P520k104q976k343K02m440l479k83K699L182K074m65j339
21034e80J656O590Q74k671r15o038n568L782n45L757J689K516K612N85k037o66
21018E041N64L603q621j764K622K520n62m408j983N5J402p929k074M954N591K404
21002A415p97M19J286r127M91K035L22P31o735j89J408N333M798l834o392p22
20986i558K183Q566L38O19L316K77j948J86n993L492J44q536j645P222M969N911
20970I543j28M19L31l080k366K358n82n152l757l047j65m212Q91O67l425K207
20954i498J440K326n421M041L17q84O149N026k238l867q02J779n019P68K707J190
$$ plain form
20938 -1986 -3338 -5389 -3708 -5199 -9756 -3676 416 1103 3385 -5483 -1862 3828 2075 709 1242
20923 1242 5593 1122 4361 5676 651 -3018 -3703 -6900 -7439 -10707 -14202 -10492 -3442 -376 7281
20908 7281 7389 4778 7981 -2008 -10706 -7690 -9971 -10439 -11515 -4739 -890 -170 537 2591 9577 5475
20892 5475 -2767 -6785 -5879 -11782 -10133 941 4295 7559 7632 8018 9345 7566 11698 16092 9249
20877 9249 4960 1856 2679 468 -4436 797 2673 -2303 -4808 -328 -2267 -5518 -11292 -14116 -9460
20862 -9460 -12205 -16177 -16252 -7634 -4730 -5531 -4740 -12489 -9291 -2896 3 -3133 -7632 -943 2297 1315
20846 1315 -1915 -13 -1495 -2866 -4551 -5414 -2230 2164 261 -558 -3820 -970 1450 -1691 -1350
20831 -1350 -1604 -612 -2951 -2111 -514 -4279 -8950 -14101 -10155 -149 2780 -644 -3461 1982 6425
$$ packed form
20938a986j352k051J681j491m557O080M092O87K282q868L621N690j753j366N33
20923A242M351m471L239J315n025l669o85l197n39l268l495L710P050L066P657
20908G281J08k611L203r989q698L016k281m68j076O776L849P20P07K054O986m102
20892E475q242m018R06n903J649J1074L354L264P3L86J327j779M132M394o843
20877I249m289l104Q23k211m904N233J876m976k505M480j939l251n774k824M656
20862i460k745l972p5Q618K904q01P91p749L198O395K899l136m499O689L240r82
20846A315l230J902j482j371j685q63L184M394j903q19l262K850K420l141L41
20831a350k54R92k339Q40J597l765m671n151L946J0006K929l424k817N443M443
$$ plain form
20816 6425 10151 5237 -756 1286 4373 6411 7269 5402 -220 -10952 -11390 -7290 -8017 -7714 -11363
20801 -11363 -10592 -8170 -2848 -4630 -893 6364 13101 12167 10070 -1844 -6377 -1446 885 5908 2557
20786 2557 2442 1975 4204 3150 -2224 1795 10346 15106 8454 1717 -2988 -3870 2643 5727 12980
20771 12980 17290 8578 9843 6225 2124 6002 3642 4011 383 -2191 -6170 -8077 -15029 -11949 -13967
20756 -13967 -10355 -6924 -8182 -5886 -3809 -698 3122 1278 -2196 -3861 -3496 -2964 -3319 1824 3246
20741 3246 1845 3266 7514 1902 -3255 -275 -5078 -13892 -11218 -5815 -7832 -5250 -7880 -10778 -5884
20726 -5884 -1845 1586 286 -3553 -7551 -4342 -1369 -4026 -4476 -2391 -6175 -7658 -4135 3082 4538
20711 4538 3219 1568 2416 7324 3449 -10 1850 2675 580 5324 5467 -5229 -8762 -6567 -275
$$ packed form
20816F425L726m914n993K042L087K038Q58j867n622j0732m38M100p27L03l649
20801a1363P71K422N322j782L737P257O737r34k097j1914m533M931K331N023l351
20786B557j15m67K229j054n374M019Q551M760o652o737m705q82O513L084P253
20771A2980M310q712J265l618m101L878k360L69l628k574l979j907o952L080k018
20756a3967L612L431j258K296K077L111L820j844l474j665L65N32l55N143J422
20741C246j401J421M248n612n157K980m803q814K674N403k017K582k630k898M894
20726e884M039L431j300l839l998L209K973k657m50K085l784j483L523P217J456
20711D538j319j651Q48M908l875l459J860Q25k095M744J43j0696l533K195O292
$$ plain form
20696 -275 4738 2518 1844 -345 -416 4942 5141 3474 -2603 992 731 -5902 -8013 -2274 3413 2108
20680 2108 -269 -154 2504 4740 -3059 -11030 -16011 -12063 -3901 -4528 -11142 -17703 -10652 -2805 -6260
20665 -6260 -2464 -781 -2387 -2933 -6226 -4848 -5190 338 -1725 559 3285 2355 538 -7209 -6931 -7492
20649 -7492 -8331 -11493 -13230 -10890 -9483 -6325 -2327 -2060 5149 763 -787 -2312 12 602 1525 1574
20633 1574 103 -1107 -3687 -728 -3399 -8723 -8995 -9110 -3699 -2369 -1389 554 -3548 -10635 -12238
20618 -12238 -7474 -8571 -9028 -9610 -6926 -4702 3827 4706 9863 13021 10508 5890 2924 541 27
20603 27 -652 -1223 3080 3850 3306 4624 2087 2044 2564 -2284 -4734 -2768 3709 4785 546 -2503 747
20586 747 4009 -131 -8641 -5285 -997 -782 6118 5923 7868 3776 -1774 -2662 -11 -1684 -1573 -535
$$ packed form
20696b75N013k220o74k189p1N358J99j667o077L595k61o633k111N739N687j305
20680B108k377J15K658K236p799p971m981L948Q162o27o614o561P051P847l455
20665f260L796J683j606n46l293J378l42N528k063K284K726r30j817p747K78n61
20649g492q39l162j737K340J407L158L998K67P209m386j550j525K324N90R23M9
20633A574j471j210k580K959k671n324k72j15N411J330R80J943m102p087j603
20618a2238M764j097m57n82K684K224Q529Q79N157L158k513m618k966k383n14
20603B7o79n71M303P70n44J318k537m3N20m848k450J966O477J076m239l049L250
20586G47L262m140q510L356M288K15O900j95J945m092n550q88K651j673J11J038
$$ plain form
20570 -535 -3883 -7650 -3233 -2686 -427 1075 540 -3647 -12471 -20129 -18851 -9695 -5488 -5068 -4346 1215
20554 1215 4940 8196 1804 -3148 1024 4418 2346 -447 -640 -371 2830 4158 -1798 -6598 -3191
20539 -3191 -6243 -8121 -6212 -2464 1912 2231 3906 7064 289 -6224 -7349 -7266 -6003 -7631 -8412 -5203
20523 -5203 -4430 -8061 -10616 -10695 -5420 144 -668 -340 331 2607 2375 -5231 -3849 5578 7944 1075
20507 1075 -3710 405 5455 1705 2326 -3905 -10524 -12820 -16379 -17564 -15767 -7703 4517 7863 7658
20492 7658 5773 -4411 -10224 -4766 1989 5814 681 -2314 696 2416 7202 13028 15521 10997
20478 10997 13201 12534 13042 9058 10157 5906 11983 13133 13421 8804 3119 -1731 -5776 -4169 -136
20463 -136 6731 5215 -2352 -1299 605 3459 6345 6002 -795 -8369 -5441 -385 203 -2746 -1887 -639
$$ packed form
20570e35l348l767M417N47K259J502n35m187q824p658J278R156M207M20P22N561
20554A215L725L256o392m952M172L394k072k793j93K69L201J328n956m800L407
20539c191l052j878J909L748M376L19J675L158o775o513j125Q3J263j628p81L209
20523e203P73l631k555p9N275N564q12L28O71K276k32p606J382R427K366o869
20507A075m785M115N050l750O21o231o619k296l559j185J797Q064J2220L346k05
20492G658j885j0184n813N458O755L825n133k995L010J720M786N826K493m524
20478A0997K204o67N08l984J099m251O077J150K88m617n685m850m045J607M033
20463a36O867j516p567J053J904K854K886l43o797p574K928N056N88k949Q59J248
$$ plain form
20447 -639 422 -4836 -7707 -4817 736 7875 9022 9375 12095 5709 -2723 -7030 -13216 -14851 -10871
20432 -10871 -15070 -17450 -16501 -16852 -8511 2566 9973 10905 5819 5372 4744 7603 8080 4815 1331 7207
20416 7207 7119 10469 9443 2005 813 6055 8281 9839 13415 9515 3446 2629 2978 -1897 4346 6680
20400 6680 5491 -3057 -7342 -8211 -1520 665 6770 8520 572 828 6364 7138 5279 1444 -20
20385 -20 4785 6506 5488 3828 3539 -273 -1824 3659 811 -1501 -1258 1477 8488 9034 10751 19571
20369 19571 20343 14682 11916 7007 3946 3088 11181 14607 7964 2898 -1597 -436 717 4474 8096
20354 8096 10478 2641 2040 5112 60 1306 3465 3412 -983 3662 6065 4422 2003 451 2573
20339 2573 -1444 -6732 -9970 -3204 -3 2217 759 -6560 -8546 -5029 452 9009 8779 5007 4202
$$ packed form
20447f39J061n258k871K890N553P139J147L53K720o386q432m307o186j635L980
20432a0871m199k380R49l51Q341J1077P407R32n086m47o28K859M77l265l484N876
20416G207q8L350j026p438j192N242K226J558L576l900o069q17L49m875O243K334
20400F680j189q548m285q69O691K185O105J750p948K56N536P74j859l835j464
20385b0M805J721j018j660k89l812j551N483k848k312K43K735P011N46J717Q820
20369A9571P72n661k766m909l061q58Q093L426o643n066m495J161J153L757L622
20354H096K382p837o01L072n052J246K159n3m395M645K403j643k419j552K122
20339B573m017n288l238O766L201K220j458p319j986L517N481Q557k30l772q05
$$ plain form
20324 4202 6360 5404 2964 5029 1847 5033 3744 -860 293 3983 6444 3292 351 2519 -964
20309 -964 -7016 -10352 -12477 -5898 -1426 -2269 -3939 -2109 -5795 -332 6279 1930 721 6014 5752
20294 5752 2436 4810 5720 4912 6110 4321 4146 -2161 -7762 -4627 -4393 -2578 1690 4593 -1167 -6424
20278 -6424 -4887 -1021 6834 11212 12429 14846 6415 -4213 -7165 -2616 7597 6381 3424 4321
20264 4321 9124 7113 6982 9542 8225 4907 75 -2371 6413 13610 11239 6030 6663 3364 11206
20249 11206 15870 15437 11460 8141 7478 3961 1388 583 2411 4299 1598 -459 -6856 -7768 -3468
20234 -3468 -1332 -522 10944 12343 7658 2231 3476 5425 6460 2792 3154 5676 5869 2036 560
20219 560 3115 1525 1377 758 -3818 1447 1738 -8357 -5388 -1654 1506 8387 10128 4043 7004
$$ packed form
20324D202K158r56k440K065l182L186j289m604J153L690K461l152k941K168l483
20309i64o052l336k125O579M472q43j670J830l686N463O611m349j209N293k62
20294E752l316K374R10q08J198j789j75o307n601L135K34J815M268K903n760n257
20278f424J537L866P855M378J217K417q431j0628k952M549J0213j216k957Q97
20264D321M803k011j31K560j317l318m832k446Q784P197k371n209O33l299P842
20249A1206M664m33l977l319o63l517k573q05J828J888k701k057o397r12M300
20234c468K136Q10J1466J399m685n427J245J949J035l668L62K522J93l833j476
20219E60K555j590j48o19m576N265K91j0095K969L734L160O881J741o085K961
$$ plain form
20204 7004 12834 12416 7304 6343 5908 5379 -1647 -5232 -1695 611 690 5890 8277 7249 5834 4444
20188 4444 1562 -1078 5299 4941 2089 3358 6204 1394 -100 -108 -3296 -3879 -495 3084 6183 2864
20172 2864 2610 181 5090 20131 28499 24904 21491 23346 20896 15477 19352 17014 11752 4995 5527
20157 5527 9242 10776 7032 7128 12394 14273 7812 2956 3580 6081 1635 -1309 4467 7664 3146
20142 3146 1240 6743 8371 13029 13180 11237 10326 7083 4822 562 -1332 -357 5211 2962 5533
20127 5533 9857 8601 10762 13769 12563 10803 13090 12666 15425 15897 16494 17419 15251 11824 8701 12695
20111 12695 7463 3764 3794 8138 10585 14908 15884 12201 10743 9692 10704 17162 19821 10405 8175
20096 8175 8807 12329 10570 11141 8496 6076 2002 -1395 -2087 -515 2211 7090 8703 10447 10346 13438
$$ packed form
20204G004N830m18n112r61m35n29p026l585L537K306P9N200K387j028j415j390
20188D444k882k640O377l58k852J269K846m810j494ql188n83L384L579L099l319
20172B864k54k429M909J5041Q368l595l413J855k450n419L875k338n262o757N32
20157E527L715J534l744R6N266J879o461m856O24K501m446k944N776L197m518
20142C146j906N503J628M658J51j943r11l243k261m260j894R75N568k249K571
20127E533M324j256K161L007j206j760K287m24K759M72N97R25k168l427l123L994
20111A2695n232l699L0M344K447M323R76l683j458j051J012O458K659r416k230
20096H175O32L522j759N71k645k420m074l397o92J572K726M879J613J744j01L092
$$ plain form
20080 13438 11530 9284 6920 6897 7890 8787 10858 8423 9239 11508 13055 8894 9161 14136 14444 13483
20064 13483 17406 15497 4408 6810 12976 12856 11283 11792 14613 13622 12517 8791 1876 986 10440
20049 10440 9386 14673 14093 10118 9077 19242 20109 16744 16805 19264 22310 24667 23886 18205 10808
20034 10808 994 172 -295 8407 16951 17646 11475 12271 18159 12856 6080 5081 6735 7754 8113 12703
20018 12703 14956 17032 19651 19069 11742 12531 14601 16303 15368 10952 13335 10383 9942 13763 14390 12321
20002 12321 9722 6309 6833 3361 9756 13638 18626 20974 18656 17024 16111 14229 14554 22096 19528
19987 19528 11658 11089 11127 12906 13754 12221 9066 7508 3957 -1824 -3283 318 7631 6664 6304 8750
19971 8750 6771 1396 7734 5354 6822 12215 19550 29284 24130 18648 14965 10768 9246 8062 5969
$$ packed form
20080A3438j908k246k364k3R93Q97K071k435Q16K269J547m161K67M975L08r61
20064A3483L923j909j1089K402O166j20j573N09K821r91j105l726o915q90R454
20049A0440j054N287n80l975j041J0165Q67l365O1K459L046K357p81n681p397
20034A0808r814q22m67Q702Q544O95o171P96N888n303o776r99J654J019L59M590
20018A2703K253K076K619n82p327P89K070J702r35m416K383k952m41L821O27k069
20002A2321k599l413N24l472O395L882M988K348k318j632r13j882L25P542k568
19987A9528p870n69L8J779Q48j533l155j558l551n781j459L601P313r67l60K446
19971H750j979n375O338k380J468N393P335R734n154n482l683m197j522j184k093
$$ plain form
19956 5969 47 -418 -943 -2560 891 9343 9250 8481 6872 6258 11313 10659 9256 11521 15209 17496
19940 17496 22366 23304 22754 21083 21929 17071 20276 20390 17282 13490 8824 9654 8224 12273 15202 12983
19924 12983 5132 2043 4540 9612 10649 6838 11996 16257 17653 22290 20024 13812 9599 6427
19910 6427 8967 11399 7948 8451 5196 5045 17382 19460 15080 12765 12852 18702 19043 15001 18987 23819
19894 23819 24805 21809 19310 16904 15058 19896 28232 31635 33934 32493 26771 20688 20058 19458 18700
19879 18700 19130 18928 18921 15032 17616 14608 17538 23367 23034 13524 12127 20028 24757 20575 21495 22271
19863 22271 22143 21372 23680 18646 16852 15723 13996 17504 24474 20920 21050 20052 22398 24368 17838
19848 17838 16172 11286 9442 15484 22218 21361 16959 20273 17137 14389 13516 10175 6290 6448 9973
$$ packed form
19956E969n922m65n25j617L451Q452r3p69j609o14N055o54j403K265L688K287
19940A7496M870R38n50j671Q46m858L205J14l108l792m666Q30j430M049K929k219
19924A2983p851l089K497N072J037l811N158M261J396M637k266o212m213l172
19910F427K540K432l451N03l255j51J2337K078m380k315Q7N850L41m042L986M832
19894B3819R86k996k499k406j846M838Q336L403K299j441n722o083o30o00p58
19879A8700M30k02pl889K584l008K930N829l33r510j397P901M729m182R20P76
19863B2271j28p71K308n034j794j129j727L508O970l554J30r98K346J970o530
19848A7838j666m886j844O042O734q57m402L314l136k748q73l341l885J58L525
$$ plain form
19833 9973 14893 17851 17875 20054 27370 23303 19163 17055 16806 14083 12263 13172 17508 22606 24038 20380
19817 20380 16769 14091 19587 20590 13968 13429 13764 13535 11110 14798 14924 16394 20415 22882 27513
19802 27513 26787 25372 29420 21867 10644 9395 22870 32737 31753 25149 17627 14105 17196 22941
19788 22941 19033 15639 20675 24889 26309 23781 18914 19192 16447 14765 20448 26439 24182 15173 15319
19773 15319 21674 26866 31752 32606 28850 20063 20116 29495 26415 20696 19865 16218 22656 24722 25907
19758 25907 22308 24292 30829 35441 28319 25543 22368 24754 31993 33859 34002 33476 31926 25771 20115
19743 20115 12563 17193 25717 32594 27068 21529 18786 19632 23011 35123 40244 35803 34281 35532
19729 35532 32433 20790 14369 12673 11710 11733 13478 16390 17530 15781 12940 22977 32058 35746 32589
$$ packed form
19833I973M920K958K4K179P316m067m140k108k49k723j820R09M336N098J432l658
19817B0380l611k678N496J003o622n39L35k29k425L688J26J470M021K467M631
19802B7513p26j415M048p553j1223j249J3475R867r84o604p522l522L091N745
19788B2941l908l394N036M214J420k528m867K78k745j682N683N991k257r009J46
19773A5319O355N192M886Q54l756q787N3R379l080n719q31l647O438K066J185
19758B5907l599J984O537M612p122k776l175K386P239J866J43n26j550o155n656
19743B0115p552M630Q524O877n526n539k743Q46L379J2112N121m441j522J251
19729C5532l099j1643o421j696r63K3J745K912J140j749k841J0037R081L688l157
$$ plain form
19714 32589 27951 19587 18376 17755 21455 30387 34548 37876 26821 15521 11529 15581 20870 18078
19700 18078 18528 15223 18956 22973 26089 24904 27316 22454 20223 21352 24648 29398 28386 29141 26153
19685 26153 26755 29561 26851 24754 25295 29324 32483 32604 27199 25926 23441 21662 28671 32739 32487
19670 32487 28861 26440 23851 24006 32455 29749 26282 26089 32948 32426 29347 33396 33475 35460 36893 34537
19654 34537 36084 38920 33179 31011 29822 31816 31856 30346 29342 22121 23510 24649 28639 30133 33294
19639 33294 33036 28409 30115 30680 24133 20474 17658 24093 26546 20556 18850 21768 23257 27101 30470
19624 30470 30476 26626 22791 28379 31609 33277 33593 33641 35195 32325 29773 27911 31457 27857 25550 21445
19608 21445 21069 24225 29274 34027 37514 40138 37092 35438 36208 32094 33426 30354 29104 35130 35792
$$ packed form
19714C2589m638q364j211o21L700Q932M161L328j1055j1300l992M052N289k792
19700A8078M50l305L733M017L116j185K412m862k231J129L296M750j012P55k988
19685B6153O02K806k710k097N41M029L159J21n405j273k485j779P009M068k52
19670C2487l626k421k589J55Q449k706l467j93O859n22l079M049P9J985J433k356
19654C4537J547K836n741k168j189J994M0j510j004p221J389J139L990J494L161
19639C3294k58m627J706N65o547l659k816O435K453n990j706K918J489L844L369
19624C0470Ol850l835N588L230J668L16M8J554k870k552j862L546l600k307m105
19608B1445l76L156N049M753L487K624l046j654P70m114J332l072j250O026O62
$$ plain form
19593 35792 35103 35306 26993 24416 28746 33011 36258 37392 39959 37506 35364 32161 31419 34585 36205
19578 36205 38410 40210 39866 41520 44519 44880 40584 42561 45034 41502 36466 32328 31199 32983 34666
19563 34666 33369 32812 32979 36582 42372 41528 43174 42666 40668 37987 37455 34079 29784 28072 30574 35665
19547 35665 33837 35059 34193 32025 38150 38390 38148 45179 46963 40513 41639 37828 43486 53164 48917
19532 48917 35541 32531 34043 34513 28873 37352 41673 32597 32926 32016 28709 34610 38945 42998 45134
19517 45134 41367 36426 33798 38089 37119 32976 35973 44607 46132 44522 38836 40227 43865 42824 38498
19502 38498 36939 39270 44633 44499 38654 37584 38354 48204 52058 46765 49214 49668 49080 50556 50028 53955
19486 53955 57311 55684 49964 48094 47043 44119 43796 47304 51199 57089 51859 42694 37455 47651
$$ packed form
19593C5792o89K03q313k577M330M265L247J134K567k453k142l203p42L166J620
19578C6205K205J800l44J654K999L61m296J977K473l532n036m138j129J784J683
19563C4666j297n57J67L603N790q44J646n08j998k681n32l376m295j712K502N091
19547C5665j828J222q66k168O125K40k42P031J784o450J126l811N658R678m247
19532D8917j3376l010J512M70n640Q479M321r076L29r10l307N901M335M053K136
19517D5134l767m941k628M291r70m143K997Q634J525j610n686J391L638j041m326
19502C8498j559K331N363j34n845j070P70R850L854n293K449M54n88J476n28L927
19486E3955L356j627n720j870j051k924l23L508L895N890n230r165n239J0196
$$ plain form
19472 47651 57815 65833 65555 62682 58722 53023 55971 60852 64984 67129 74627 73485 72742 71730 68700
19457 68700 68178 70403 73453 73625 74112 70945 70340 71881 80157 88962 86897 85842 89347 102686 115899
19442 115899 129298 148633 184863 230049 305651 433746 564328 643536 654114 606275 562124
19431 562124 565593 659620 861750 1056626 1140396 1054477 849627 668025 560177 545106 611201
19420 611201 676198 684836 620685 526522 480956 480546 498966 533073 624038 813020 1038351 1201922
19408 1201922 1241334 1177071 1136045 1160003 1236086 1338075 1398722 1380521 1280566 1176185 1190435
19397 1190435 1258167 1231644 1049305 805268 634821 575017 609446 728434 876936 1022764
19387 1022764 1144866 1215875 1199099 1059146 839849 680281 635598 726153 905975 1053603
$$ packed form
19472D7651J0164Q018k78k873l960n699K948M881M132K145P498j142p43j012l030
19457F8700n22K225L050J72M87l167o05J541Q276Q805k065j055L505J3339J3213
19442A15899J3399J9335L6230M5186P5602J28095J30582P9208J0578m7839m4151
19431E62124L469R4027K02130J94876Q3770q5919k04850j81602j07848j5071O6095
19420F11201O4997Q638o4151r4163m5566m10J8420L4107R0965J88982K25331J63571
19408A201922L9412o4263m1026K3958P6083J01989O0647j8201r9955j04381J4250
19397A190435O7732k6523j82339k44037j70447n9804L4429J18988J48502J45828
19387A022764J22102P1009j6776j39953k19297j59568m4683R0555J79822J47628
$$ plain form
19377 1053603 1050307 873743 634094 440198 312553 237700 197748 168031 155962 152036 150473
19366 150473 145433 144137 139458 127699 122964 127915 138874 149294 162155 183405 208301 247612
19354 247612 299376 397393 569654 845868 1113793 1204130 1064907 768670 512101 355090
19344 355090 254922 200513 163293 138173 124787 117953 116059 114232 106302 101443 97651 91954 88116
19331 88116 79802 71956 65387 63574 64304 69019 76042 83382 86943 87604 80382 77917 79840 79035 76801
19316 76801 75358 74465 71837 62842 64884 69868 68464 69627 69917 67527 64315 63055 68245 65644 61782
19301 61782 69354 75917 76598 71556 77892 83744 77140 77407 74658 76549 73135 76322 83873 84770 84399
19286 84399 85810 81776 77964 83067 83815 80559 80946 79432 79764 76631 79243 76888 76450 74280 75472
$$ packed form
19377A053603l296j76564k39649j93896j27645p4853l9952k9717j2069l926j563
19366A50473n040j296m679j1759m735M951J0959J0420J2861K1250K4896L9311
19354B47612N1764R8017J72261K76214K67925R0337j39223k96237k56569j57011
19344C55090j00168n4409l7220k5120j3386o834j894j827p930m859l792n697l838
19331H8116q314p846o569j813P30M715P023P340L561O61p222k465J923q05k234
19316G6801j443q93k628q995K042M984j404J163K90k390l212j260N190k601l862
19301F1782P572O563O81n042O336N852o604K67k749J891l414L187P551Q97l71
19286H4399J411m034l812N103P48l256L87j514L32l133K612k355m38k170J192
$$ plain form
19271 75472 82564 80137 75375 69860 73128 79655 88494 98765 103815 105804 106149 106538 100119 102143 108818
19256 108818 112680 111195 110422 118392 118726 112487 107137 109716 117471 117399 125058 129361 131068 131416 135328
19241 135328 143427 154382 165049 171679 176174 187822 206321 221841 245096 275554 306306 343875
19229 343875 378127 420684 470494 526301 586793 644954 703056 752469 783231 809923 837044
19218 837044 851215 850754 835878 800662 760496 711185 656489 603209 553779 498047 442698 391384
19206 391384 344638 308423 275828 250562 231645 214476 192364 168222 151815 133832 125471 132886
19194 132886 142836 147208 138789 129817 123237 121618 132399 156347 173698 169900 156475 145579 142692
19181 142692 150429 170177 191689 190994 175815 150512 132583 125653 124916 123116 122776 120153 108281
$$ packed form
19271G5472P092k427m762n515L268O527Q839J0271N050J989L45L89o419K024O675
19256A08818L862j485p73P970L34o239n350K579P755p2P659M303J707L48L912
19241A35328Q099J0955J0667O630M495J1648J8499J5520K3255L0458L0752L7569
19229C43875L4252M2557M9810N5807O0492N8161N8102M9413L0762K6692K7121
19218H37044J4171m61j4876l5216m0166m9311n4696n3280m9430n5732n5349n1314
19206C91384m6746l6215l2595k5266j8917j7169k2112k4142j6407j7983q361P415
19194A32886R950M372q419q972o580j619J0781K3948J7351l798j3425j0896k887
19181A42692P737J9748K1512o95j5179k5303j7929o930p37j800l40k623j1872
$$ plain form
19168 108281 99595 96113 98920 108445 130906 152473 165172 166105 155726 152111 166157 197875 230293
19155 230293 242225 237048 216854 200652 204207 222841 242102 244668 231485 218161 210187 205035
19143 205035 203411 204688 212272 210883 204557 201605 202399 207738 222467 241161 256319 250776 221311
19130 221311 201890 211159 237854 274867 308168 329263 305588 277755 266026 260225 261298 278338
19118 278338 302640 312757 308112 305422 305498 308502 321150 345554 359300 363801 356202 342707 356279
19105 356279 388046 422751 448081 439463 426368 402492 385900 403709 451130 508863 582373 612467
19093 612467 597170 545139 501905 494697 526699 585797 622945 614617 556075 478241 427121 396403
19081 396403 385074 387897 391307 407427 434113 492587 608000 768115 919837 1008080 992749
$$ packed form
19168A08281q686l482K807R525K2461K1567J2699R33j0379l615J4046L1718L2418
19155B30293J1932n177k0194j6202L555J8634J9261K566j3183j3324p974n152
19143B05035j624J277P584j389o326k952P94N339J4729J8694J5158n543k9465
19130B21311j9421R269K6695L7013L3301K1095k3675k7833j1729n801J073J7040
19118B78338K4302J0117m645k690P6L004J2648K4404J3746M501p599j3495J3572
19105C56279L1767L4705K5330q618j3095k3876j6592J7809M7421N7733P3510L0094
19093F12467j5297n2031m3234p208L2002N9098L7148q328n8542p7834n1120l0718
19081C96403j1329K823L410J6120K6686N8474J15413J60115J51722Q8243j5331
$$ plain form
19070 992749 911223 806162 695136 616230 598635 652752 739030 769098 741653 647515 523989
19059 523989 428089 387407 374546 371783 376775 391739 414250 450795 513704 636155 827883
19048 827883 1001727 1053118 934875 731671 561939 474550 459782 456394 440054 391317 327622
19037 327622 267865 235326 244064 266582 272734 251976 208125 176921 164355 165563 180220 205391
19025 205391 218746 224370 209951 201775 204085 205210 208785 211787 217170 219452 216182 207750 203426 202799
19011 202799 208796 205288 195136 174409 160321 191778 243150 290893 332036 337053 314650 281834
18999 281834 270352 314751 375076 421658 450844 452786 433881 390893 344256 313163 293580 282034
18987 282034 275447 271851 268812 269244 284025 313262 334749 337987 338612 342627 353420 394568 453929
$$ packed form
19070I92749q1526j05061j11026p8906j7595N4117Q6278L0068k7445r4138j23526
19059E23989r5900m0682j2861k763M992J4964K2511L6545O2909J22451J91728
19048H27883J73844N1391j18243k03204j69732q7389j4768l388j6340m8737o3695
19037C27622n9757l2539Q738K2518O152k0758m3851l1204j2566J208J4657K5171
19025B05391J3355N624j4419q176K310J125L575L002N383K282l270q432m324o27
19011B02799N997l508j0152k0727j4088L1457N1372M7743M1143N017k2403l2816
18999B81834j1482M4399O0325M6582K9186J942j8905m2988m6637l1093j9583j1546
18987B82034o587l596l039M32J4781K9237K1487L238O25M015J0793M1148N9361
$$ plain form
18974 453929 526651 573113 589938 593095 588966 604718 643235 678878 717258 760647 800873 832965
18962 832965 860177 933676 1097762 1376799 1744675 2009727 2033232 1806854 1534419 1417986
18952 1417986 1489729 1774487 2253244 2664066 2758309 2442617 1933257 1552008 1334436 1225773
18942 1225773 1178622 1158221 1161235 1188491 1269453 1421776 1640452 1977267 2359078 2562464
18932 2562464 2492850 2207561 1980313 1939356 2069967 2380987 2794698 3092976 3147086 2913470
18922 2913470 2588053 2326772 2163805 2117053 2184105 2345780 2584665 2802155 2921213 2895193
18912 2895193 2782534 2724492 2791361 2973296 3227229 3474295 3605060 3603761 3551736 3602184
18902 3602184 3828653 4168633 4504371 4777394 5019254 5357066 5924602 6734139 7738121
$$ packed form
18974D53929P2722M6462J6825L157m129J5752L8517L5643L8380M3389M0226L2092
18962H32965K7212P3499J64086K79037L67876K65052K3505k26378k72435j16433
18952A417986P1743K84758M78757M10822R4243l15692n09360l81249k17572j08663
18942A225773m7151k0401L014K7256Q0962J52323K18676L36815L81811K03386
18932B562464o9614k85289k27248m0957J30611L11020M13711K98278N4110k33616
18922B913470l25417k61281j62967m6752O7052J61675K38885K17490J19058k6020
18912B895193j12659n8042O6869J81935K53933K47066J30765j299n2025N0448
18902C602184K26469L39980L35738K73023K41860L37812N67536Q09537J003982
$$ plain form
18893 7738121 8810213 9760793 10554261 11320732 12403545 14185071 17008420 21395607 28288453
18884 28288453 39719155 59560726 90565874 122929439 139488302 132067109 107659333
18877 107659333 88219553 88560861 112399287 155525515 194088882 203074048 174454300
18870 174454300 123959857 81179114 55816793 42148643 34819258 31360306 30618368
18863 30618368 32035178 35832105 43047648 56129018 79503195 114916745 149603284
18856 149603284 166405869 159680228 142341053 141941844 171736194 219967878 267864147
18849 267864147 287958319 270424961 225791680 178100021 158057775 169574939 184805403
18842 184805403 181037093 150481441 109211470 80575508 68664286 70122431 80105854
$$ packed form
18893G738121J072092R50580P93468P66471J082813J781526K823349M387187O892846
18884B8288453J1430702J9841571L1005148L2363565J6558863p421193k4407776
18877A07659333j9439780L41308K3838426M3126228L8563367Q985166k8619748
18870A74454300n0494443m2780743k5362321j3668150p329385l458952p41938
18863C0618368J416810L796927P215543J3081370K3374177L5413550L4686539
18856A49603284J6802585o725641j7339175l99209K9794350M8231684M7896269
18849B67864147K0094172j7533358m4633281m7691659k0042246J1517164J5230464
18842A84805403l768310l0555652m1269971k8635962j1911222J458145R983423
$$ plain form
18835 80105854 86937895 83377914 67487737 48419751 35217160 27911026 24227500 22701398
18827 22701398 22529584 23577950 26405126 32095677 42876303 62422635 90459281 112362472
18819 112362472 117009616 101526106 79923801 70083672 76802534 101701667 140351109
18812 140351109 168946406 170256782 140277202 99050922 71209246 60566617 63745993
18805 63745993 75507053 83271172 79445374 62302042 42146656 28259931 20293398
18798 20293398 15646695 12765209 10867579 9464422 8332985 7391452 6570174 5913161
18790 5913161 5397043 4953239 4565603 4226109 3946169 3744991 3622691 3534032 3372395 3095202
18780 3095202 2765902 2484200 2273152 2165884 2152107 2148412 2092277 1966444 1806180 1649791
$$ packed form
18835H0105854O832041l559981j5890177j9067986j3202591p306134l683526j526102
18827B2701398j71814J048366K827176N690551J0780626J9546332K8036646K1903191
18819A12362472M647144j5483510k1602305r840129O718862K4899133L8649442
18812A40351109K8595297J310376k9979580m1226280k7841676j0642629L179376
18805F3745993J1761060P764119l825798j7143332k0155386j3886725p966533
18798B0293398m646703k881486j897630j403157j131437r41533q21278o57013
18790E913161n16118m43804l87636l39494k79940k01178j22300q8659j61637k77193
18780C095202l29300k81702k11048j07268j3777l695n6135j25833j60264j56389
$$ plain form
18770 1649791 1523440 1422661 1339906 1277691 1236284 1202669 1179372 1163368 1136789 1078971 1006691
18759 1006691 935529 874038 821845 780595 755578 749128 751972 737962 715751 682859 643464 608356
18747 608356 600127 637834 676014 676156 663262 643298 608045 578261 560965 545447 535518 520547
18735 520547 497185 476532 454377 440385 424493 421435 426182 421617 417409 422039 426572 442445 470916
18722 470916 509236 545230 550476 542353 538338 534096 556212 568352 558633 544908 528098 515716
18710 515716 502829 491864 481236 460985 440051 421666 411735 409630 402515 394720 376223 353538
18698 353538 348038 348315 347742 360669 370112 384388 369380 326651 293779 280502 298237 315981 329604
18685 329604 364151 374006 330504 286579 286049 323258 367235 393245 424235 431027 424049 431591 447571
$$ packed form
18770A649791j26351j00779q2755o2215m1407l3615k3297j6004k6579n7818p2280
18759A006691p1162o1491n2193m1250k5017o450K844j4010k2211l2892l9395l5108
18747F08356q229L7707L8180J42j2894j9964l5253k9784j7296j5518r929j4971
18735E20547k3362k0653k2155j3992j5892l058M747m565m208M630M533J5873K8471
18722D70916L8320L5994N246q123m015m242K2116J2140r719j3725j6810j2382
18710E15716j2887j0965j0628k0251k0934j8385r931k105p115p795j8497k2685
18698C53538n500K77n73J2927R443J4276j5008m2729l2872j3277J7735J7744J3623
18685C29604L4547R855m3502m3925n30L7209M3977K6010L0990O792o978P542J5980
$$ plain form
18672 447571 461564 462829 442308 398972 352746 308585 256320 235174 240693 250025 249460 218501
18660 218501 159888 108334 81005 102110 157530 194990 204951 173564 119927 92326 107420 139466
18648 139466 173401 194542 190480 164967 127552 104700 105978 100436 101545 114770 126972 134470
18636 134470 147756 158848 162195 161417 161711 151386 120951 89477 96558 124801 135367 126831 110772
18623 110772 87147 42679 -7150 -11154 19074 31278 35808 40933 33585 12682 -10961 -19200
18611 -19200 -16777 -6496 4848 13296 23528 27984 32411 46687 54268 49125 44756 47125 60961
18598 60961 82022 101860 113276 114735 104249 97015 92770 93559 103565 109773 104775 91408 77365
18585 77365 75605 78292 80418 83292 72698 60862 47016 37800 39385 43975 44286 42644 51951 69420
$$ packed form
18672D47571J3993J265k0521m3336m6226m4161n2265k1146N519R332n65l0959
18660B18501n8613n1554k7329K1105N5420L7460R961l1387n3637k7601J5094L2046
18648A39466L3935K1141m062k5513l7415k2852J278n542J109J3225J2202P498
18636A34470J3286J1092L347p78K94j0325l0435l1474P081K8243J0566q536j6059
18623A10772k3625m4468m9829m004L0228J2204M530N125p348k0903k3643q239
18611a9200K423J0281J1344Q448J0232M456M427J4276P581n143m369K369J3836
18598F0961K1061J9838J1416J459j0486p234m245P89J0006O208m998j3367j4043
18585G7365j760K687K126K874j0594j1836j3846r216J585M590L11j642R307J7469
$$ plain form
18571 69420 92449 131016 162419 195266 259469 382179 596493 936261 1273903 1423234 1300236
18560 1300236 997309 768432 697657 774300 1007337 1280550 1389424 1240765 890161 569453
18550 569453 382072 279661 224572 193343 168066 140786 118913 118509 148225 182528 207046
18539 207046 220002 232592 259096 315328 417709 598423 897172 1279068 1541700 1547558 1282020
18528 1282020 965032 795296 802719 974627 1276798 1501002 1499074 1235780 877091 635902
18518 635902 529077 517186 589640 762410 1000471 1149747 1112820 894058 631032 439780
18508 439780 318678 236424 187868 168442 171616 186911 188510 187537 182992 165576 163046 184564
18496 184564 219888 262443 310872 390446 526151 746370 975595 1089499 1027583 835105
$$ packed form
18571F9420K3029L8567L1403L2847O4203J22710K14314L39768L37642J49331j22998
18560A300236l02927k28877p0775P6643K33037K73213J08874j48659l50604l20708
18550E69453j87381j02411n5089l1229k5277k7280k1873m04K9716L4303K4518
18539B07046J2956J2590K6504N6232J02381J80714K98749L81896K62632N858k65538
18528A282020l16988j69736P423J71908L02171K24204j928k63294l58689k41189
18518F35902j06825j1891P2454J72770K38061J49276l6927k18762k63026j91252
18508D39780j21102q2254m8556j9426L174J5295J599r73m545j7416k530K1518
18496A84564L5324M2555M8429P9574J35705K20219K29225J13904o1916j92478
$$ plain form
18486 835105 677772 646334 739144 906308 1019271 988807 805414 581624 424807 344413
18476 344413 315539 307285 307386 304627 284745 259542 235168 224490 238600 257973 280161 290472
18464 290472 300560 319499 350579 437936 603499 783084 859624 786392 596209 412704 289973
18453 289973 212060 167181 150860 143478 146324 148490 143884 144439 150917 175851 212324 243203 261860
18440 261860 254160 233428 212977 207074 223276 248246 271270 289041 294092 308622 303486 272721
18428 272721 223610 179974 149696 131349 120988 109388 93247 81645 81679 84384 85934 85578 89378
18415 89378 92917 89773 86499 78018 66193 61346 66285 72504 76906 81916 79482 76153 72837 72042
18401 72042 92886 131095 179232 210509 213485 182095 145143 125471 115594 102968 94187 84515
$$ packed form
18486H35105j57333l1438R2810J67164J12963l0464j83393k23790j56817q0394
18476C44413k8874q254J01k759j9882k5203k4374j0678J4110J9373K2188J0311
18464B90472J0088J8939L1080Q7357J65563J79585P6540p3232j90183j83505j22731
18453B89973p7913m4879j6321p382K846K166m606N55O478K4934L6473L0879J8657
18440B61860p700k0732k0451n903J6202K4970K3024J7771N051J4530n136l0765
18428B72721m9111m3636l0278j8347j0361j1600j6141j1602L4K705J550l56L800
18415H9378L539l144l274q481j1825m847M939O219M402N010k434l329l316p95
18401G2042K0844L8209M8137L1277K976l1390l6952j9672r877j2626q781r672
$$ plain form
18389 84515 83000 78108 80189 84569 84534 77550 75274 77059 75305 71387 67966 68728 68053 73020 76741
18374 76741 78100 76408 70447 67336 67577 67127 64284 65582 64672 68207 78555 84167 89143 92040 92753
18359 92753 97469 101388 106832 113663 121856 125609 124152 126754 143664 160154 190023 241456 334660
18346 334660 494767 711472 887307 937505 824751 640578 522493 522814 642942 817401
18336 817401 938743 910007 734463 527294 385996 306234 260392 236227 218319 211738 222559
18325 222559 256197 313255 412020 589515 835827 1027333 1050356 897019 691101 577471
18315 577471 597130 743259 936349 1035315 957940 737855 503396 341971 250325 195426
18305 195426 163731 148626 139078 130393 125704 112265 100716 98721 100269 92732 84524 82079 81761
$$ packed form
18389H4515j515m892K081M380l5o984k276J785j754l918l421P62o75M967L721
18374G6741J359j692n961l111K41m50k843J298r10L535J0348N612M976K897P13
18359I2753M716L919N444O831Q193L753j457K602J6910J6490K9869N1433R3204
18346C34660J60107K16705J75835N0198j12754j84173j18085L21J20128J74459
18336H17401J21342k8736j75544k07169j41298p9762m5842k4165j7908o581J0821
18325B22559L3638N7058R8765J77495K46312J91506K3023j53337k05918j13630
18315E77471J9659J46129J93090R8966p7375k20085k34459j61425r1646n4899
18305A95426l1695j5105r548q685m689j3439j1549j995J548p537q208k445l18
$$ plain form
18292 81761 74463 67734 78617 95605 101670 103071 103403 104038 117793 145471 170243 177062 169871 153913
18278 153913 145795 132404 124156 118487 110240 102437 95114 90818 89063 96852 97999 104010 110176 125659
18264 125659 149195 175298 235916 347864 485576 590960 619976 551046 467494 449415 516714
18253 516714 683857 896910 1026984 992214 802856 603130 483839 451187 495472 575159
18243 575159 614700 569246 452625 342539 264498 226001 222362 240242 268876 303560 332162
18232 332162 375539 461096 607158 788882 910945 900614 784599 665995 629691 689942
18222 689942 854051 1082505 1221494 1173548 961872 746932 637509 619013 669057 743514
18212 743514 781942 753731 641166 516708 434107 394623 362170 344481 323734 289384 283607
$$ packed form
18292H1761p298o729J0883J6988O065J401L32O35J3755K7678K4772O819p191j5958
18278A53913q118j3391q248n669q247p803p323m296j755P789J147O011O166J5483
18264A25659K3536K6103O0618J11948J37712J05384K9016o8930q3552j8079O7299
18253E16714J67143K13053J30074l4770j89358j99726j19291l2652M4285P9687
18243E75159L9541m5454j16621j10086p8041l8497l639J7880K8634L4684K8602
18232C32162M3377Q5557J46062J81724J22063j0331j16015j18604l6304O0251
18222F89942J64109K28454J38989m7946k11676k14940j09423j8496N0044P4457
18212G43514L8428k8211j12565j24458q2601l9484l2453j7689k0747l4350n777
$$ plain form
18201 283607 291388 308346 306214 307446 316586 300153 282857 261080 240033 215282 195879 186873
18189 186873 183175 184181 188687 199331 216919 239306 253050 254212 242761 217823 218144 236240 258373
18176 258373 281588 288023 278269 258004 222654 202042 208719 229118 254622 266798 251133 207739
18164 207739 156419 125193 122756 123014 118910 125599 131818 131267 135673 144013 151934 158556 161145 159443
18150 159443 159183 155754 152057 150350 170377 203804 246091 270348 254379 217570 174997 149999
18138 149999 161759 186392 196793 188530 160775 116707 77563 74505 86036 100720 127339 151409
18126 151409 168055 171468 175875 187157 201824 221767 240277 254997 266704 274390 286666 305204
18114 305204 348379 417496 484647 546243 613851 717923 931157 1338647 2083872 3474717
$$ packed form
18201B83607P781J6958k132J232R140j6433j7296k1777k1047k4751j9403r006
18189A86873l698J006M506J0644J7588K2387J3744J162j1451k4938L21J8096K2133
18176B58373K3215O435r754k0265l5350k0612O677K0399K5504J2176j5665m3394
18164B07739n1320l1226k437K58m104O689O219n51M406Q340P921O622K589j702
18150A59443k60l429l697j707K0027L3427M2287K4257j5969l6809m2573k4998
18138A49999J1760K4633J0401q263k7755m4068l9144l058J1531J4684K6619K4070
18126A51409J6646L413M407J1282J4667J9943J8510J4720J1707P686J2276J8538
18114C05204M3175O9117O7151O1596O7608J04072K13234M07490P45225J390845
$$ plain form
18104 3474717 5992544 9346880 11445844 11187540 8352426 5136603 3123048 2056082
18096 2056082 1476224 1132064 903199 735340 611474 518132 445637 382822 331432 284753
18086 284753 246426 226813 213679 191730 165521 151893 151812 159312 178985 210690 223521 230230
18074 230230 224767 226441 248442 291159 353191 392464 416038 425170 403946 374232 352324 329155
18062 329155 308366 300021 289853 278602 269152 270439 269002 264798 265526 270541 285823 296160 303714
18049 303714 315242 340488 396917 457354 481507 489571 486389 484801 489000 492895 491851 491828 498116
18036 498116 507746 512732 505773 500196 503568 503943 508038 530152 553740 579347 605199 633055 656007
18023 656007 672501 691034 711297 739359 770014 795571 811003 832447 876700 931727 988695
$$ packed form
18104C474717K517827L354336K098964k58304k835114l215823k013555j066966
18096B056082n79858l44160k28865j67859j23866r3342p2495o2815n1390m6679
18086B84753l8327j9613j3134k1949k6209j3628q1P500J9673L1705J2831O709
18074B30230n463J674K2001M2717O2032L9273K3574R132k1224k9714k1908k3169
18062C29155k0789q345j0168j1251r450J287j437m204P28N015J5282J0337P554
18049C03714J1528K5246N6429O0437K4153Q064l182j588M199L895j044k3O288
18036D98116R630M986o959n577L372L75M095K2114K3588K5607K5852K7856K2952
18023F56007J6494J8533K0263K8062L0655K5557J5432K1444M4253N5027N6968
$$ plain form
18012 988695 1037136 1068228 1092441 1132038 1205192 1335087 1554262 1880509 2209038 2413574
18002 2413574 2458142 2423071 2506527 2757257 3024330 3174108 3186703 3211253 3422832 3809163
17992 3809163 4188363 4431811 4558375 4741720 5115356 5743907 6728785 8121619 10039575
17983 10039575 12783010 17046261 24050845 35837887 56433568 91625881 137732428
17976 137732428 170043857 170882725 137199594 90818503 56776487 37453094 26922320
17969 26922320 21107151 17732529 15464625 13736439 12465525 11752777 11709006 12334646 13532147
17960 13532147 15307093 17999995 22351370 29571529 41961800 63999669 101221907 146580951
17952 146580951 175050998 173015746 141901991 108807537 98046354 114098355 147238560
$$ packed form
18012I88695M8441L1092K4213L9597P3154J29895K19175L26247L28529K04536
18002B413574M4568l5071Q3456K50730K67073J49778J2595K4550K11579L86331
17992C809163L79200K43448J26564J83345L73636O28551R84878J392834J917956
17983A0039575K743435M263251P004584J1787042K0595681L5192313M6106547
17976A37732428L2311429Q38868l3683131m6381091l4042016j9323393j0530774
17969B6922320n815169l374622k267904j728186j270914p12748m3771O25640J197501
17960A3532147J774946K692902M351375P220159J2390271K2037869L7222238M5359044
17952A46580951K8470047k035252l1113755l3094454j0761183J6052001L3140205
$$ plain form
17945 147238560 171216650 167962443 134018781 89657902 57223315 38520218 28045019
17938 28045019 21915253 18048283 15384942 13517447 12304137 11520087 11016633 10892329
17930 10892329 11425641 12844157 15414717 19574514 26204196 37291910 56980729 90436504
17922 90436504 130548570 154026568 147879810 112824460 72438797 45030667 29546948
17915 29546948 20692773 15346099 11917357 9527526 7775770 6492357 5514091 4733230
17907 4733230 4108995 3648660 3374198 3272441 3237000 3124430 2874845 2559812 2350517 2319544
17897 2319544 2454401 2671786 2864953 2890558 2675715 2305185 1906881 1604794 1404616 1239781
17887 1239781 1094927 987826 920182 867303 827421 793215 764698 738446 703634 671812 638936
$$ packed form
17945A47238560K3978090l254207l3943662m4360879l2434587j8703097j0475199
17938B8045019o129766l866970k663341j867495j213310p84050n03454j24304
17930A0892329N33312J418516K570560M159797O629682J1087714J9688819L3455775
17922I0436504M0112066K3477998o146758l5055350m0385663k7408130j5483719
17915B9546948q854175n346674l428742k389831j751756j283413r78266p80861
17907D733230o24235m60335k74462j01757l5441j12570k49585l15033k09295l0973
17897B319544J34857K17385J93167K5605k14843l70530l98304l02087k00178j64835
17887A239781j44854j07101o7644n2879l9882l4206k8517k6252l4812l1822l2876
$$ plain form
17876 638936 604759 580101 552531 522953 502892 498399 498030 511785 525745 520716 516045 499374
17864 499374 475236 439711 405861 380236 356006 338230 324385 307677 288285 279291 274495 265613
17852 265613 255843 254207 260802 305779 343263 348018 348879 352640 354291 346024 333377 318945 305409
17839 305409 298625 292046 281348 278095 275572 271097 250484 222151 199762 184385 173782 174761 184044
17826 184044 210070 272958 322827 354519 378543 408847 454592 558514 789439 1141818 1517252
17815 1517252 1712118 1610304 1247502 885715 660019 526569 446199 393139 362491 334773
17805 334773 317898 306792 296431 289945 283247 288670 307414 334874 388782 470780 617134 887059
17793 887059 1266195 1605525 1736893 1579909 1251012 994252 911373 981822 1206635 1434802
$$ packed form
17876F38936l4177k4658k7570k9578k0061m493l69J3755J3960n029m671j6671
17864D99374k4138l5525l3850k5625k4230j7776j3845j6708j9392q994m796q882
17852B65613r770j636O595M4977L7484M755Q61L761J651q267j2647j4432j3536
17839C05409o784o579j0698l253k523m475k0613k8333k2389j5377j0603R79R283
17826A84044K6026O2888M9869L1692K4024L0304M5745J03922K30925L52379L75434
17815A517252J94866j01814l62802l61787k25696j33450q0370n3060l0648k7718
17805C34773j6875j1106j0361o486o698N423J8744K7460N3908Q1998J46354K69925
17793H87059L79136L39330J31368j56984l28897k56760q2879P0449K24813K28167
$$ plain form
17783 1434802 1482933 1262215 908755 639788 479846 386041 329481 302820 280367 264623
17773 264623 257794 259731 263360 269821 278540 297233 325130 359178 397020 459479 574638 778920
17761 778920 1062524 1267441 1257773 992856 663820 424697 254967 142306 99448 101075
17751 101075 108541 117391 118057 105701 91216 79637 73655 72624 73247 72905 79287 86461 87156 96348
17737 96348 110369 107717 103047 101075 89731 52895 2282 -34710 -32303 -9489 10572 30329
17725 30329 40326 33861 40805 46430 38058 28751 23496 25092 35764 42204 32177 18826 14764 13528
17711 13528 12076 17872 24513 28212 33374 37144 36363 32454 35955 39458 47284 57757 67588 66235
17697 66235 61359 52454 54910 64117 61521 59799 55822 42465 29549 25835 25274 25402 34005 35047
$$ packed form
17783A434802M8131k20718l53460k68967j59942r3805n6560k6661k2453j5744
17773B64623o829J937L629O461Q719J8693K7897L4048L7842O2459J15159K04282
17761G78920K83604K04917r668k64917l29036k39123j69730j12661m2858J627
17751A01075P466Q850O66j2356j4485j1579n982j031O23l42O382P174O95R192
17737I6348J4021k652m670j972j1344l6836n0613l6992K407K2814K0061J9757
17725C0329R997o465O944N625q372r307n255J596J0672O440j0027j3351m062j236
17711A3528j452N796O641L699N162L770p81l909L501L503P826J0473R831j353
17697F6235m876q905K456R207k596j722l977j3357j2916l714n61J28Q603J042
$$ plain form
17683 35047 32922 30215 29131 20584 17697 17929 13788 10808 11351 8605 3722 -3787 -1474 3646 15893
17668 15893 36009 52198 51455 42400 28762 26327 31001 35041 36703 41842 39345 42342 42413 33653
17654 33653 17616 12923 21414 20666 12290 8385 610 -15638 -19505 -14433 -5447 3894 5666 2537
17640 2537 -10470 -17426 -6205 13203 39116 62979 72328 64559 67930 72215 75030 80058 80876 77959
17626 77959 76773 73554 60352 55932 53416 42111 38968 37434 24785 11246 -3183 -7777 363
17613 363 21871 39720 50013 57932 54906 54116 60168 72023 81002 83575 81974 70577 58757 56952
17599 56952 60672 57503 57644 51691 47453 45209 52762 57938 58580 51387 45882 41229 31869 27593 23781
17584 23781 24355 29653 41913 45835 39706 41302 45439 47780 47453 46886 43496 37064 38776 40549 38939
$$ packed form
17683C5047k125k707j084q547k887K32m141k980N43k746m883p509K313N120J2247
17668A5893K0116J6189p43r055j3638k435M674M040J662N139k497K997P1q760
17654C3653j6037m693Q491p48q376l905p775j6248l867N072Q986R341J772l129
17640B537j3007o956J1221J9408K5913K3863R349p769L371M285K815N028Q18k917
17626G7959j186l219j3202m420k516j1305l143j534j2649j3539j4429m594Q140
17613C63K1508J7849J0293P919l026p90O052J1855Q979K573j601j1397j1820j805
17599E6952L720l169J41n953m238k244P553N176O42p193n505m653r360m276l812
17584B3781N74N298J2260L922o129J596M137K341l27n67l390o432J712J773j610
$$ plain form
17569 38939 40049 39491 40538 36255 32595 35886 34769 32386 32688 33766 34566 35615 37688 39295 47727
17554 47727 53082 46142 41723 40637 36084 40028 42758 42988 42027 39092 40445 41177 36115 27345 20231
17539 20231 15987 20821 22777 23948 24074 26609 28365 34338 32504 33588 29978 29650 25502 20364 17378
17524 17378 20704 28212 31406 34609 34405 38755 36202 33689 28256 18709 15530 17063 20658 22080 24701
17509 24701 27628 29573 31976 30905 23800 15391 19819 24801 29604 36807 40083 34721 36036 41861
17495 41861 39704 34769 30300 22670 17602 19490 23789 28388 24589 24764 25727 20819 17779 16691 13150
17480 13150 15123 19617 25329 27877 27411 23224 20450 24141 23712 19110 20233 22284 26395 32654 28800
17465 28800 22007 23059 25313 28127 29888 34829 34327 23910 21722 23135 22549 19198 19876 24438 30363
$$ packed form
17569C8939J110n58J047m283l660L291j117k383L02J078Q00J049K073J607Q432
17554D7727N355o940m419j086m553L944K730K30r61k935J353P32n062q770p114
17539B0231m244M834J956J171J26K535J756N973j834J084l610l28m148n138k986
17524A7378L326P508L194L203k04M350k553k513n433r547l179J533L595J422K621
17509B4701K927J945K403j071p105q409M428M982M803P203L276n362J315N825
17495D1861k157m935m469p630n068J888M299M599l799J75R63m908l040j088l541
17480A3150J973M494N712K548m66m187k774L691m29m602J123K051M111O259l854
17465B8800o793J052K254K814J761M941n02j0417k188J413n86l351O78M562N925
$$ plain form
17450 30363 28090 28808 31562 34753 42233 47475 47435 48063 60341 67563 76875 94707 115730 149716
17436 149716 211475 321684 494648 720171 919213 972571 837391 587866 378839 248541
17426 248541 181559 141852 113586 98885 85576 81071 85063 87766 89740 91522 101400 119832 133284
17413 133284 164642 215762 316160 485417 723809 927355 993998 889436 700016 595055
17403 595055 631412 779816 933322 957147 814100 574859 377392 252180 178633 141438
17393 141438 116884 100140 83896 78587 72983 62913 61669 64729 75823 85337 106611 144175
17381 144175 198968 293555 444795 658899 839317 867146 716996 488292 306989 198070
17371 198070 138258 99017 72437 60691 47438 38052 32520 34642 27860 15427 10503 15843 23602
$$ packed form
17450C0363k273P18K754L191P480N242m0O28J2278P222R312J7832K1023L3986
17436A49716O1759J10209J72964K25523J99042N3358j35180k49525k09027j30298
17426B48541o6982l9707k8266j4701j3309m505L992K703J974J782R878J8432J3452
17413A33284L1358N1120J00398J69257K38392K03546O6643j04562j89420j04961
17403E95055L6357J48404J53506K3825j43047k39241j97467j25212p3547l7195
17393A41438k4554j6744j6244n309n604j0070j244L060J1094R514K1274L7564
17381A44175N4793R4587J51240K14104J80418K7829j50150k28704j81303j08919
17371A98070n9812l9241k6580j1746j3253r386n532K122o782j2433m924N340P759
$$ plain form
17358 23602 28017 27191 25262 20216 20658 14608 13611 21199 23092 21960 17160 15747 13965 12998 11481
17343 11481 15005 19728 15604 12580 13360 12369 12690 7749 -3472 761 4276 1053 -115 103 186 1266
17327 1266 5556 9870 7996 10431 10179 9116 9636 10816 9714 8809 10697 7034 8460 5180 887
17312 887 -1346 4527 10396 6492 1964 -7579 -12126 -10075 -8013 -5640 496 757 -1486 -3735 -1884
17297 -1884 -985 2017 -1104 -3598 -7521 -6814 -10078 -10714 -6103 -2693 -2983 3016 4259 5468 2842 2239
17281 2239 1934 1470 11674 13922 10905 7874 4444 5594 2244 1314 -3635 -7710 -9828 -8153 -1805
17266 -1805 536 3421 4448 1867 -1608 202 -5786 -7742 -10342 -7497 -673 8351 8074 2642 -1279
17251 -1279 -54 5262 7360 5111 4045 3192 -3647 -880 3100 6462 5679 4632 6993 5463 1590
$$ packed form
17358B3602M415q26j929n046M42o050r97P588J893j132m800j413j782r67j517
17343A1481L524M723m124l024P80r91L21m941j1221M233L515l223j168K18Q3J080
17327A266M290M314j874K435k52j063N20J180j102r05J888l663J426l280m293
17312H87k233N873N869l904m528r543m547K051K062K373O136K61k243k249J851
17297a884Q99L002l121k494l923P07l264o36M611L410k90N999J243J209k626o03
17281B239l05m64J0204K248l017l031l430J150l350r30m949m075k118J675O348
17266a805K341K885J027k581l475J810n988j956k600K845O824R024k77n432l921
17251a279J225N316K098k249j066q53o839K767L980L362p83j047K361j530l873
$$ plain form
17236 1590 -1435 2001 5573 5937 3209 4346 8166 6352 2085 -1993 -1615 1923 -3180 -11806 -10671
17221 -10671 -5475 -988 -2316 -736 2514 3824 -809 -3157 -1666 1020 8447 7418 3487 5972
17207 5972 3515 -2059 -10326 -9148 -3332 -3691 -4207 -6168 -10950 -5006 114 -909 -2621 -6848 -6750 -6998
17191 -6998 -9275 -9642 -10037 -5157 7441 12395 10796 5530 3276 -2608 -7667 -3941 -5665 -10332 -6370
17176 -6370 -4090 -1090 -4514 -6895 -9411 -6232 -3315 -1335 3061 4547 5103 3376 3730 425 -3030
17161 -3030 -6618 -5188 -1333 823 -4554 -3702 -7369 -12025 -16254 -14781 -9436 -13737 -6590 340 -3312
17146 -3312 -10934 -14273 -20405 -18419 -12838 -14066 -16031 -12515 -5379 -4814 -5825 -5998 482 130 8431
17131 8431 9422 3991 -2691 -2571 -858 474 -195 -5512 -7067 -3761 -900 -281 -6434 -6652 -4474 -4518
$$ packed form
17236A590l025L436L572L64k728J137L820j814m267m078L78L538n103q626J135
17221a0671N196M487j328J580L250J310m633k348J491K686P427j029l931K485
17207E972k457n574q267J178N816l59n16j961m782N944N120j023j712m227R8k48
17191f998k277l67l95M880J2598M954j599n266k254n884n059L726j724m667L962
17176f370K280L000l424k381k516L179K917J980M396J486N56j727L54l305l455
17161c030l588J430L855K156n377Q52l667m656m229J473N345m301P147O930l652
17146c312p622l339o132J986N581j228j965L516P136N65j011j73O480l52Q301
17131H431R91n431o682J20J713J332o69n317j555L306K861O19o153k18K178m4
$$ plain form
17115 -4518 -2835 4339 1444 -6242 -11518 -12327 -7364 -7130 -10115 -14151 -8845 -2142 -2680 -3827 -1773
17100 -1773 -369 504 1361 134 1742 3035 1350 5254 3516 409 1942 -890 -5513 -9183 -6402
17085 -6402 418 2406 1706 2377 3511 6335 3310 -1368 658 -1824 1582 4346 4210 5382 -43
17070 -43 -7622 -8547 -10574 -7762 -2519 587 3007 4662 5589 8604 8941 6331 1852 -3471 -1910 8926
17054 8926 11608 7735 -4603 -6188 -1065 4652 9227 5823 -5076 -4445 4773 9847 12665 1508
17040 1508 -7653 -14741 -21821 -21223 -23241 -23382 -23065 -20841 -12069 -6917 -6515 -8276 -5492 -3452 -3109 4999
17024 4999 6960 1266 -3032 -11981 -15723 -15719 -13440 -13905 -14769 -15576 -20012 -21228 -10655 -4302 -6099 -12364
17008 -12364 -15531 -14319 -9862 -1618 -8547 -18299 -19706 -16727 -14345 -7866 -14965 -12815 -1371 4225
$$ packed form
17115d518J683P174k895p686n276q09M963K34k985m036N306O703n38j147K054
17100a773J404Q73Q57j227J608J293j685L904j738l107J533k832m623l670K781
17085f402O820J988p00O71J134K824l025m678K026k482L406K764j36J172n425
17070d3p579r25k027K812N243L106K420J655R27L015L37k610m479n323J561J0836
17054H926K682l873j2338j585N123N717M575l404j0899O31R218N074K818j1157
17040A508r161p088p080N98k018j41L17K224Q772N152M02j761K784K040L43Q108
17024D999J961n694m298q949l742MK279m65q64q07m436j216J0573O353j797o265
17008a2364l167J212M457Q244o929r752j407K979K382O479p099K150J1444N596
$$ plain form
16994 4225 1372 -2808 -2578 -7175 -7411 1077 1630 -3850 -11777 -17704 -26306 -24085 -18451 -15612 -14088
16979 -14088 -10910 -6628 -3429 -5050 -17508 -18512 -21731 -19853 -21805 -19150 -15060 -13860 -10583 -9096
16965 -9096 -13379 -15185 -15544 -18145 -22249 -25385 -20567 -8921 -4264 -3650 -6150 -10475 -10981 -10021 -8764
16950 -8764 -8694 -4170 -3208 -2824 -502 -4098 -4462 -5402 -2573 1955 -2133 1287 679 -1964 5639 3139
16934 3139 2557 -2640 -3079 2702 5517 5541 2184 363 -1806 22 2863 1325 -2585 -1995 420 664
16918 664 -1794 -820 -7958 -17257 -16187 -14443 -11884 -13813 -13368 -11281 -4297 -2817 -11544 -14170 -11627
16903 -11627 -7555 564 -2800 -7464 -8119 -5266 -702 -1493 -2141 841 4888 981 -6635 -2074 632
16888 632 -977 2353 -4593 -7945 -11002 -12116 -9194 -8388 -8585 -10784 -10160 -7609 -10308 -5985 -2426 -1179
$$ packed form
16994D225k853m180K30m597k36Q488N53n480p927n927q602K221N634K839J524
16979a4088L178M282L199j621j2458j004l219J878j952K655M090J200L277J487
16965i096m283j806l59k601m104l136M818J1646M657O14k500m325n06R60J257
16950h764P0M524R62L84K322l596l64r40K829M528m088L420o08k643P603k500
16934C139n82n197m39N781K815K4l357j821k169J828K841j538l910N90K415K44
16918F64k458R74p138r299J070J744K559j929M45K087O984J480q727k626K543
16903a1627M072Q119l364m664o55K853M564p91o48K982M047l907p616M561K706
16888F32j609L330o946l352l057j114K922Q06j97k199O24K551k699M323L559J247
$$ plain form
16872 -1179 -279 2371 3100 1040 -2515 -6291 -9655 -4287 4335 4426 -331 -8531 -11316 -15358 -8429 -7425
16856 -7425 -3688 -1197 -5655 -9237 -10443 -9853 -7462 -5813 -2102 -803 -217 94 -3865 -11570 -18800
16841 -18800 -17069 -6541 458 -3904 -6740 -5298 -905 -2475 -1966 -2369 1125 179 -2073 281 2533
16826 2533 -2315 -3145 1848 3539 2754 5773 4718 4329 2620 -1410 1595 -598 -2067 -258 -5883
16811 -5883 -7004 -4490 -5143 -10915 -10698 -10728 -9588 -13120 -13073 -10177 -14332 -13586 -4628 -2497 -5907 -152
16795 -152 -6071 -3941 1327 4342 9282 6666 1886 9 4890 16625 19050 16063 11253 8044 463
16780 463 -4373 -2145 3863 -496 -9005 -13700 -11720 -9809 -8427 -14333 -16147 -14094 -16357 -12922 -4398
16765 -4398 -799 -3607 -1947 -2407 -2791 -3226 -2133 -6887 -4176 -4892 -6541 -3379 3059 5097 4510 6125
$$ packed form
16872a179R00K650P29k060l555l776l364N368Q622R1m757q200k785m042O929J004
16856g425L737K491m458l582j206N90K391J649L711J299N86L11l959p705p230
16841a8800J731J0528O999m362k836J442M393j570N09m03L494r46k252K354K252
16826B533m848q30M993J691p85L019j055l89j709m030L005k193j469J809n625
16811e883j121K514o53n772K17l0J140l532M7K896m155P46Q958K131l410N755
16795a52n919K130N268L015M940k616m780j877M881J1735K425k987m810l209p581
16780D63m836K228O008m359q509m695J980J911J382n906j814K053k263L435Q524
16765d398L599k808J660m60l84m35J093m754K711p16j649L162O438K038n87J615
$$ plain form
16749 6125 833 -4751 -5612 -45 -5864 -5641 -3440 -2690 -1433 -1384 -7685 -10825 -12840 -15602 -17343 -17895
16733 -17895 -19472 -19836 -18226 -14895 -12414 -15080 -16079 -12197 -12835 -11581 -12298 -12466 -16651 -18124 -9069 4302
16717 4302 5305 5176 1538 3056 8105 6831 -2588 -4524 -4496 110 2442 6825 -2238 -9112 -2638
16702 -2638 -3929 -5384 -5909 -6941 -2473 -1013 -6543 -11602 -14889 -15278 -26315 -28779 -25391 -21718 -16344
16687 -16344 -11565 -9558 -9403 -2636 4304 -2167 -6201 -4045 -1748 -2788 -4487 -9764 -12495 -11104 -5339
16672 -5339 -1940 2526 -2404 -5654 -10865 -7987 -9761 -18393 -17627 -8966 -9457 -11229 -7970 -3359 -3608
16657 -3608 -914 -3215 -6054 -4712 -143 3608 4936 2227 -2751 -4979 -9891 -5948 -4012 -6256 -2290
16642 -2290 -2151 -3977 -4369 -4553 2309 -182 -5405 -5752 -1045 902 -3374 -818 -98 -4414 1654 9440
$$ packed form
16749F125n292n584q61N567n819K23K201P50J257M9o301l140k015k762j741n52
16733a7895j577l64J610L331K481k666r99L882o38J254p17j68m185j473R055J3371
16717D302J003j29l638J518N049j274r419j936K8M606K332M383r063o874O474
16702b638j291j455n25j032M468J460n530n059l287l89j1037k464L388L673N374
16687a6344M779K007J55O767O940o471m034K156K297j040j699n277k731J391N765
16672e339L399M466m930l250n211K878j774q632P66Q661m91j772L259M611k49
16657c608K694k301k839J342M569L751J328k709m978k228m912L943J936k244L966
16642b290J39j826l92j84O862k491n223l47M707J947m276K556P20m316O068P786
$$ plain form
16626 9440 5867 -4885 -9886 -14940 -14709 -8043 -6599 -10695 -6740 -4511 -6761 -5902 -7216 -5630 -5963
16611 -5963 -9506 -4308 -1099 588 164 -529 -4281 -844 5571 7170 4609 -995 -7347 -7449 -7431 -8362
16595 -8362 -10070 -10803 -3219 1438 11066 14543 23375 33732 33538 38835 41047 35651 36239 30373 18400
16580 18400 10714 8754 1887 -1779 1638 3247 6368 -2499 -13573 -13822 -9345 -5104 3938 5972
16566 5972 597 -6179 -11171 -6667 -6726 -4290 135 1813 -2043 -4116 4172 8674 13607 24506 27840
16551 27840 30588 31809 31808 36749 36712 30531 22418 15472 6242 -393 -1474 -5091 -5017 -3718 -4387 -8059
16535 -8059 -7842 -11570 -10613 -11963 -12351 -8078 -6744 -11131 -12739 -14282 -8861 -8031 -6641 -9267 -2296 4169
16519 4169 1205 -6987 -16066 -14058 -11397 -13504 -11332 -12285 -15816 -5478 -4374 -4886 -1491 -1631 -13152
$$ packed form
16626I440l573j0752n001n054K31O666J444m096L955K229k250Q59j314J586l33
16611e963l543N198L209J687m24o93l752L437O415J599k561n604o352j02J8r31
16595h362j708p33P584M657R628L477Q832J0357j94N297K212n396N88n866j1973
16580A8400p686j960o867l666L417J609L121q867j1074k49M477M241R042K034
16566E972n375o776m992M504n9K436M425J678l856k073Q288M502M933J0899L334
16551B7840K748J221jM941l7o181q113o946r230o635j081l617P4J299o69l672
16535h059K17l728R57j350l88M273J334m387j608j543N421Q30J390k626O971O465
16519D169k964q192r079K008K661k107K172r53l531J0338J104n12L395j40j1521
$$ plain form
16504 -13152 -13457 -7776 -9851 -12785 -16440 -17952 -14282 -9133 -7226 -6817 -11829 -20269 -16319 -11253 -7722
16489 -7722 -6168 -11456 -12845 -7364 413 1205 319 -7803 -10142 -8056 -6668 -5891 -4124 -1191 -4830
16474 -4830 -12029 -15253 -8185 -2577 -4364 -2373 -6037 -4896 -5608 -7008 -5535 441 1574 2020 -2917
16459 -2917 -12391 -9618 -1216 -2179 320 1626 63 -6488 -7956 -7450 -4175 -1805 -3163 -2306 -3668
16444 -3668 -4524 -12342 -18644 -12201 -12089 -14082 -14196 -11701 -15307 -14476 -5505 -3504 2949 -260 -5886 -13055
16428 -13055 -9033 -7070 -10029 -12941 -13110 -11186 -13142 -9048 -7531 -9441 -11139 -11206 -7374 -7288 -8929 -8449
16412 -8449 -75 3179 8259 6492 -141 -7831 -9077 -8846 -9356 -2441 1215 506 4330 4747 -1561 -6525
16396 -6525 -10875 -14456 -12898 -9830 -10124 -10272 -8027 -5858 -7783 -6035 -2312 518 1602 -6883 -8204
$$ packed form
16504a3152l05N681k075k934l655j512L670N149J907M09n012q440L950N066L531
16489g722J554n288j389N481P777P92q86q122k339K086J388P77J767K933l639
16474d830p199l224P068N608j787J991l664J141p12j400J473N976J133M46m937
16459b917r474K773Q402r63K499J306j563o551j468N06L275K370j358Q57j362
16444c668q56p818o302O443J12j993j14K495l606Q31Q971K001O453l209n626p169
16428a3055M022J963k959k912j69J924j956M094J517j910j698o7L832Q6j641M80
16412h449Q374L254N080j767o633p690j246K31n10O915L656p09L824M17o308m964
16396f525m350l581J558L068k94j48K245K169j925J748L723K830J084q485j321
$$ plain form
16381 -8204 -6635 -5921 -1800 1133 1790 -695 -5306 -3358 -9692 -15405 -11670 -3247 -2895 -6397 -7513
16366 -7513 -6486 -14077 -16338 -18786 -14324 -6363 -7049 -3176 -7276 -11972 -12938 -12420 -11890 -8193 -4562 -3340
16350 -3340 -4475 -4171 -3152 -4667 -4997 -8670 -6216 -10921 -15885 -14490 -12715 -6961 -6041 -12426 -15662
16335 -15662 -15814 -17111 -18248 -17995 -9455 -1971 -2126 -8805 -13194 -12911 -9172 -7439 -4204 -9000 -8469 -567
16319 -567 2134 121 3511 6846 5000 -2192 -8738 -12026 -9502 -2775 3948 8738 3172 -1576 -6238
16304 -6238 -12191 -13147 -6511 -542 623 -4981 -1975 -3238 -3434 -4024 2307 9181 5899 7042 7640 1270
16288 1270 -14353 -14417 -12039 -9726 -7689 -12166 -17578 -18605 -9373 -4823 4619 8784 1803 -622 -2041
16273 -2041 -7250 -9380 -11270 -8243 -2817 -6094 -10794 -11512 -8129 1396 10933 5422 -3694 -7868 -10113
$$ packed form
16381h204J569P14M121K933O57k485m611J948o334n713L735Q423L52l502j116
16366g513J027p591k261k448M462P961o86L873m100m696r66N18N30L697L631J222
16350c340j135L04J019j515l30l673K454m705m964J395J775N754R20o385l236
16335a5662j52j297j137K53Q540P484j55o679m389K83L739J733L235m796N31P902
16319e67K701k013L390L335j846p192o546l288K524O727O723M790n566m748m662
16304f238n953r56O636N969J165n604L006j263j96n90O331O874l282J143N98o370
16288A270j5623o4K378K313K037m477n412j027R232M550R442M165o981k425j419
16273b041n209k130j890L027N426l277m700p18L383R525R537n511r116m174k245
$$ plain form
16258 -10113 -7331 -5971 -6093 -10324 -14459 -5343 -2882 -2539 -7526 -9002 -15205 -16547 -19687 -16548 -13225
16243 -13225 -8914 -3314 -6095 -9052 -11023 -14253 -12421 -12492 -9642 -6169 -4618 -4070 -10020 -8943 -3341
16228 -3341 -3077 -2533 -3872 -7400 -12048 -5742 -2960 183 688 1533 -870 -5205 -6354 -2944 -5985 -3514
16212 -3514 -7071 -6906 -3930 -6285 -13248 -17844 -17746 -19557 -23532 -19291 -15470 -15863 -13325 -10563 -12822 -17331
16196 -17331 -10530 -13154 -16504 -12083 -11549 -12828 -9682 -8309 -8674 -6269 -12952 -15354 -16803 -16155 -16805
16181 -16805 -13532 -11726 -16045 -20133 -17661 -13407 -10358 -15088 -12994 -4613 -6032 -9381 -12161 -9763
16167 -9763 -243 -5117 -10831 -10474 -12171 -17805 -10082 -2352 -865 -4539 -2676 -17 5554 4654 2197
16152 2197 -3565 -3268 -2463 -1361 3889 1281 4591 -2062 -9593 -5924 52 3320 3452 -5538 -13658
$$ packed form
16258a0113K782J360j22m231m135R116K461L43m987j476o203j342l140L139L323
16243a3225M311N600k781k957j971l230J832p1K850L473J551N48n950J077N602
16228c341K64N44j339l528m648O306K782L143N05Q45k403m335j149L410l041K471
16212c514l557J65K976k355o963m596R8j811l975M241L821l93K538K762k259m509
16196a7331O801k624l350M421N34j279L146J373l65K405o683k402j449O48o50
16181a6805L273J806m319m088K472M254L049m730K094Q381j419l349k780K398
16167i763R520m874n714L57j697n634P723P730J487l674J863K659N571r00k457
16152B197n762K97Q05J102N250k608L310o653p531L669N976L268J32q990q120
$$ plain form
16137 -13658 -17547 -16716 -16196 -18595 -18776 -17403 -16947 -16006 -8304 -11624 -13554 -14940 -12743 -5547 -1402 -6713
16121 -6713 -12921 -14536 -12919 -9707 -4610 -8864 -14396 -10027 -5354 -1519 -6938 -9327 -7297 -11822 -12765
16106 -12765 -5658 -5579 -8464 -13020 -11580 -6195 -3183 -3809 -4905 -9832 -18664 -20960 -15250 -12786 -9742
16091 -9742 -7539 -5078 -4285 -9477 -11079 -7685 -3068 -5205 -14264 -9275 -13825 -14227 -9677 -5052 -3344
16076 -3344 -3088 -4018 -3075 964 4451 601 -8521 -9699 -7913 -4268 -5322 -8747 -12462 -9412 -8786 -5280
16060 -5280 -3698 -3463 -3067 -8416 -13217 -8956 -7633 -5933 -4375 -5872 -3719 -4653 -3914 -3607 -3933 -2453
16044 -2453 -5648 -6223 -13126 -13626 -9717 -8566 -3449 -5969 -6990 -8674 508 3636 29 -1618 -3906
16029 -3906 -3761 -8605 -3713 4698 11705 12187 5630 4367 6986 1274 -4216 -8022 -7250 -5958 -4427
$$ packed form
16137a3658l889Q31N20k399j81J373M56R41P702l320j930j386K197P196M145n311
16121f713o208j615J617L212N097m254n532M369M673L835n419k389K030m525r43
16106a2765P107P9k885m556J440N385L012o26j096m927q832k296N710K464L044
16091i742K203K461P93n192j602L394M617k137r059M989m550m02M550M625J708
16076c344K56r30R43M039L487l850r122j178J786L645j054l425l715L050O26L506
16060e280J582K35L96n349m801M261J323J700J558j497K153r34P39L07l26J480
16044b453l195n75o903n00L909J151N117k520j021j684R182L128l607j647k288
16029c906J45m844M892Q411P007M82o557j263K619n712n490l806P72J292J531
$$ plain form
16014 -4427 -9791 -11866 -12110 -10318 -7060 -8674 -8347 -6266 -3816 2009 4123 2717 -891 -6263 -7696
15999 -7696 -8455 -7571 -7844 -4700 -2212 -715 1611 4892 3346 -3032 -11356 -12469 -9584 -2337 3289
15984 3289 4445 -4781 -10397 -11770 -12386 -7904 -5865 -11404 -17229 -14067 -9532 -5396 -4227 -9925 -12579
15969 -12579 -6740 -5757 -3440 -2484 -9883 -11737 -5371 -3019 -2081 -2524 -8178 -9022 -6325 -10778 -16796 -15773
15953 -15773 -14613 -12609 -7755 -1806 3119 2463 -8147 -16120 -15294 -5609 -5560 -1016 4936 9390 7550
15938 7550 3030 5439 4791 -725 -2569 -2847 -2805 -13081 -9479 -7167 -8796 -8069 -6425 -1604 2542 931
15922 931 -318 2504 -330 -3739 -3137 -8012 -9843 -2235 -4185 -7307 -3755 -1367 -3746 -5427 -4303
15907 -4303 -2222 2899 1459 -1706 -818 1920 -340 -5779 -9167 -4538 -2920 -5856 -5304 -11618 -10079
$$ packed form
16014d427n364k075k44J792L258j614L27K081K450N825K114j406l608n372j433
15999g696p59Q84k73L144K488J497K326L281j546o378q324j113K885P247N626
15984C289J156r226n616j373o16M482K039n539n825L162M535M136J169n698k654
15969a2579N839R83K317R56p399j854O366K352R38m43n654q44K697m453o018J023
15953a5773J160K004M854N949M925o56j0610p973Q26R685M9M544N952M454j840
15938G550m520K409o48n516j844k78M2j0276L602K312j629P27J644M821M146j611
15922I31j249K822k834l409O02m875j831P608j950l122L552K388k379j681J124
15907d303K081N121j440l165Q88K738k260n439l388M629J618k936N52o314J539
$$ plain form
15892 -10079 -5908 -5419 -1940 -1404 -507 -5323 -7886 -1267 -2891 -6426 -10286 -10562 -1000 2279 598
15877 598 1463 543 5588 9522 9311 3400 3153 4568 -123 3523 3390 -667 -2683 -1583 -4527 -9173
15861 -9173 -8793 -8388 -5042 -2401 2225 4213 2545 -2896 -2796 -7003 -10506 -10187 -10148 -16726 -15778 -10477
15845 -10477 -3534 2903 6093 596 -3399 -6320 -8749 -8451 -6092 -2603 -689 -583 -3031 -330 983
15830 983 -1721 -23 3981 6285 1798 -3638 -5309 4421 2256 217 792 149 -1555 -310 -536 3828
15814 3828 1099 3358 5250 4669 5428 10117 5892 -1666 -3799 -6752 -3948 -4056 -5509 -3330 3853
15799 3853 10219 8371 2729 4768 3284 -3120 -920 4073 1812 8595 13188 10952 8771 5581 34
15784 34 -5643 -8484 -2864 5147 6712 9520 7934 7661 6523 -607 -1534 -1027 -929 4712 467 -863
$$ packed form
15892a0079M171M89L479N36Q97m816k563O619j624l535l860k76R562L279j681
15877E98Q65r20N045L934k11n911k47J415m691L646j33m057k016J100k944m646
15861i173L80M05L346K641M626J988j668n441J00m207l503L19L9o578R48N301
15845a0477O943O437L190n497l995k921k429K98K359L489J914J06k448K701J313
15830I83k704J698M004K304m487n436j671R730k165k039N75o43j704J245k26M364
15814C828k729K259J892n81P59M689m225p558k133k953K804j08j453K179P183
15799C853O366j848n642K039j484o404K200M993k261O783M593k236k181l190n547
15784C4n677k841N620Q011J565K808j586k73j138p130r27N07R8N641m245j330
$$ plain form
15768 -863 -1365 -4030 -5652 -3321 -863 -1176 -3980 -5960 -8223 -7792 -6614 -2323 -3417 -5374 -4768 -10667
15752 -10667 -12826 -9175 -13252 -10540 -8289 -5037 -4383 -4736 -4687 -3460 -5611 -8057 -8285 -9676 -7942 -6996
15736 -6996 -10129 -9061 -15258 -16408 -20165 -17072 -11429 -9045 -5413 -6366 -8255 -10923 -10365 -6728 -7803
15721 -7803 -11163 -7108 -7529 -8628 -5332 2337 3776 4086 1126 -5647 -6388 -4462 -3500 2229 2381 7583
15705 7583 7236 -2396 2700 2602 3072 -2898 -7087 -8338 -3884 150 -254 -1870 -25 1672 -1116 -823
15689 -823 3651 7482 2738 -5217 -8406 -9150 -12504 -5664 2490 529 -2100 -5175 -12498 -13946 -11687
15674 -11687 -11868 -7991 -4784 -4382 -3593 -997 -2466 1409 -329 -8042 -9696 -6252 -150 -1398 -379
15659 -379 -186 -2712 -5439 -8805 -5760 1342 -28 -5002 -10226 -8853 -6190 -6788 -11453 -10905 -7984 -5478
$$ packed form
15768h63n02k665j622K331K458l13k804j980k263M31J178M291j094j957O06n899
15752a0667k159L651m077K712K251L252O54l53M9J227k151k446k28j391J734R46
15736f996l133J068o197j150l757L093N643K384L632r53j889k668N58L637j075
15721g803l360M055m21j099L296P669J439L10k960o773p41J926R62N729J52N202
15705G583l47r632N096r8M70n970m189j251M454M034m04j616J845J697k788K93
15689h23M474L831m744p955l189p44l354O840Q154j961k629l075p323j448K259
15674a1687j81L877L207M02P89K596j469L875j738p713j654L444O102j248J019
15659c79J93k526k727l366L045P102j370m974n224J373K663n98m665N48K921K506
$$ plain form
15643 -5478 -7097 -7073 -7661 -10468 -10201 -5301 -5919 -6025 -7035 -6113 -13705 -15415 -10791 -5466 -3388 -3438 -4721
15626 -4721 -985 -5373 -6970 -6912 -9808 -14703 -18421 -16177 -11255 -5605 530 -4509 -2822 -3769 -4733 -4329
15610 -4329 -2657 -8023 -15550 -9485 -12232 -16222 -15706 -14291 -18081 -20524 -19820 -13066 -15758 -17791 -15435
15595 -15435 -13969 -11950 -15603 -9895 -3769 -3834 -7924 -11032 -8229 -7272 -2043 1816 4450 4602 3824 5296
15579 5296 1145 484 -5048 -1667 2898 4150 -319 2800 1426 -3316 -7761 -10243 -8284 -6476 -2073
15564 -2073 619 -7832 -10375 -10015 -4329 -1494 -4956 -7602 -9854 -7249 -10739 -10380 -9650 -4611 140
15549 140 6608 9010 -4084 -13781 -12460 -16954 -14707 -11473 -12204 -18050 -17646 -10197 -8086 -6206 -5387
15534 -5387 4331 5880 -387 -1174 203 -2778 -2986 -5808 -28 3170 -5009 -9985 -11325 -10458 -7626
$$ packed form
15643e478j619K4n88k807K67M900o18j06j010R22p592j710M624N325K078n0j283
15626d721L736m388j597N8k896m895l718K244M922N650O135n039J687r47r64M04
15610d329J672n366p527O065k747l990N16J415l790k443P04O754k692k033K356
15595a5435J466K019l653N708O126o5m090l108K803R57N229L859K634J52p78J472
15579E296m151o61n532L381M565J252m469L119j374m742m445k482J959J808M403
15564b073K692q451k543L60N686K835l462k646k252K605l490L59P30N039M751
15549A40O468K402j3094r697J321m494K247L234p31n846M04P449K111J880Q19
15534e387R718J549o267p87J377k981k08k822N780L198q179m976j340Q67K832
$$ plain form
15519 -7626 -8307 -10420 -13128 -17226 -14087 -13370 -9777 -14570 -9421 -732 -2152 -430 1903 2108 831
15504 831 -6866 -9262 -5205 -2088 -7116 -11583 -12563 -17044 -17097 -15828 -15801 -12607 -6841 1726 4880 3089
15488 3089 2826 3070 -225 -4885 -16577 -9273 -8666 -7829 -4341 -3947 -5923 -6452 -5252 -4447 5068 3733
15472 3733 -374 -5074 -4403 215 3465 7299 4935 -825 -192 -2072 -10281 -9892 -6961 1766 2589 -1045
15456 -1045 -10255 -13945 -11491 -7643 -7203 -9561 -8323 -12368 -18688 -18692 -11406 -7146 -8076 -8141 -9930 -10353 -11821
15439 -11821 -12541 -10159 -4366 -2496 -4124 -6269 -8155 -4885 -1422 5804 6625 -3317 -11314 -15165 -15515
15424 -15515 -10454 -8258 -3866 -1405 2674 -7502 -16539 -17962 -16219 -7936 -6377 -9984 -15334 -15074
15410 -15074 -13401 -12758 -5868 1877 8005 9902 5853 5690 980 -642 -2535 -2982 -1543 540 -7883
$$ packed form
15519g626o81k113k708m098L139P17L593m793N149Q689j420J722K333K05j277
15504H31p697k396M057L117n028m467r80m481n3J269K7L194N766Q567L154j791
15488C089k63K44l295m660j1692P304O07Q37L488L94j976n29J200Q05R515j335
15472C733m107m700O71M618L250L834k364n760O33j880q209L89K931Q727Q23l634
15456a045r210l690K454L848M40k358J238m045o320mP286M260r30o5j789m23j468
15439a1821p20K382N793J870j628k145j886L270L463P226Q21r942p997l851l50
15424a5515N061K196M392K461M079j0176r037j423J743Q283J559l607n350K60
15410a5074J673O43O890P745O128J897m049j63m710j622j893m47J439K083q423
$$ plain form
15395 -7883 -12193 -10102 -13083 -15218 -10251 -11235 -16012 -13710 -7781 -1739 2102 2042 -2059 -7017 -13994
15380 -13994 -11617 -9501 -11137 -15535 -23886 -21136 -15033 -11047 -5229 2084 -1975 -3009 -782 -418 1858
15365 1858 4663 7905 8394 3119 9679 13411 9630 2067 -2991 -5148 -2108 -1451 -1845 -906 -5675 -6467
15349 -6467 -717 -2854 -6153 -3692 -3645 -194 1429 1099 -2456 -12791 -17766 -15970 -14733 -11109 -12499
15334 -12499 -10282 -8542 -7497 -3407 -13 1248 10830 9712 3315 2544 4245 2619 2660 -131 -1780
15319 -1780 -970 -5355 -8043 -4203 -7034 2139 6019 1108 -9782 -9457 -8935 -8905 -7180 -7951 -6059 -3790
15303 -3790 -6701 -5257 2093 1220 -3686 -608 106 -3835 -6449 -6153 -6414 -3225 -6105 -6934 -3688 1277
15287 1277 3572 -3628 -6521 -4992 -7395 -968 326 -957 659 5665 139 -4766 114 -2432 -8927
$$ packed form
15395g883m310K091k981k135M967r84m777K302N929O042L841o0m101m958o977
15380a3994K377K116j636m398q351K750O103L986N818P313m059j034K227L64K276
15365A858K805L242M89n275O560L732l781p563n058k157L040O57l94R39m769p92
15349f467N750k137l299K461M7L451J623l30l555j0335m975J796J237L624j390
15334a2499K217J740J045M090L394J261R582j118o397p71J701j626M1k791j649
15319a780Q10m385k688L840k831R173L880m911j0890L25N22L0J725p71J892K269
15303c790k911J444P350q73m906L078P14l941k614K96k61L189k880q29L246M965
15287A277K295p200k893J529k403O427J294j283J616N006n526m905M880k546o495
$$ plain form
15272 -8927 -7611 -5545 -6351 -3280 -8446 -9553 -10602 -7973 -1015 -1730 -4583 -10528 -7293 -6366 -8211
15257 -8211 -11785 -10984 -1707 2067 2999 26 -5117 -4809 -3581 -5510 -8128 -8345 -11630 -11185 -7008 -6311
15241 -6311 -5538 -4643 2287 -2690 -2869 179 -3837 -4227 -1953 -10519 -4238 -7842 -14333 -11422 -11790 -13950
15225 -13950 -13481 -4896 -832 -5503 -8582 -10577 -4803 -3140 -207 4222 3624 -4099 -4311 125 -1541
15210 -1541 -2730 700 6610 7001 8878 5643 7052 9309 5473 -3236 -4344 -3384 -337 4358 9743
15195 9743 8686 4104 4336 495 -3011 -5564 -6567 -6055 729 6287 5305 -4414 238 2720 5868
15180 5868 12352 10515 6441 4029 2055 6790 8739 -458 -4939 -4654 590 7108 5304 2789 2764
15165 2764 1887 -24 -1191 -2566 -1351 1184 335 211 -5937 -10901 -13863 -7687 -5642 -6092 -3809 -3252
$$ packed form
15272h927J316K066q06L071n166j107j049K629O958p15k853n945L235R27j845
15257h211l574Q01R277L774R32k973n143L08J228j929k618k17l285M45M177O97
15241f311P73Q95O930m977j79L048m016l90K274q566O281l604o491K911l68k160
15225a3950M69Q585M064m671l079j995N774J663K933M429n98p723k12M436j666
15210a541j189L430N910L91J877l235J409K257l836q709j108R60L047M695N385
15195I743j057m582K32l841l506k553j003N12O784N558r82r719M652K482L148
15180E868O484j837m074k412j974M735J949r197m481K85N244O518j804k515k5
15165B764q77j911j167j375J215K535q49j24o148m964k962O176K045m50K283N57
$$ plain form
15149 -3252 -5233 -8145 -7391 -7024 -10068 -12060 -10495 -11386 -11492 -9578 -9211 -10125 -7807 -9546 -7786 -2222
15133 -2222 40 6863 11359 14126 10723 10527 7988 2841 -5126 -10970 -6637 -7 -4466 -5414 -1572
15118 -1572 -6022 -10028 -6025 -4131 -3751 -4695 -1256 -2309 999 -2213 -3248 -8662 -9104 -7882 -11635
15103 -11635 -14086 -10148 -6800 -2621 -3587 -12034 -14399 -11644 -10637 -13190 -5284 -1247 -8470 -12286 -11903
15088 -11903 -8551 -5549 356 4737 4397 2681 -5599 -12042 -12702 -12500 -8708 -7848 -10300 -15104 -10773
15073 -10773 -10732 -5220 -2188 479 -349 4787 6832 5810 3917 -539 -3940 -6192 -5265 -2627 -3785
15058 -3785 -8374 -9826 -10099 -6758 -5523 -8488 -13994 -15028 -12153 -9797 -11264 -6763 -7082 -4744 1126
15043 1126 -2893 -5597 -9412 -6605 -2892 -3713 -582 -2185 -5724 -9699 -5601 -5396 -6934 -624 4063
$$ packed form
15149c252j981k912P54L67l044j992J565q91j06J914L67r14K318j739J760N564
15133b222K262O823M496K767l403j96k539n147p967n844M333O630m459r48L842
15118a572m450m006M003J894L80r44L439j053L308l212j035n414m42J222l753
15103a1635k451L938L348M179r66q447k365K755J007k553P906M037p223l816L83
15088a1903L352L002N905M381l40j716q280o443o60K02L792Q60k452m804M331
15073a0773M1N512L032K667q28N136K045j022j893m456l401k252R27K638j158
15058c785m589j452k73L341J235k965n506j034K875K356j467M501l19K338N870
15043A126m019k704l815K807L713q21L131j603l539l975M098K05j538O310M687
$$ plain form
15028 4063 6985 9093 5253 5910 1427 -1199 -5125 -4608 -1274 -5824 -813 968 2783 3867 1821
15013 1821 2168 7998 8644 3730 -2460 -513 687 -3564 -1887 1636 5873 -1690 -8763 -12528 -14912
14998 -14912 -9996 -8258 -6124 -3184 1565 2538 -2429 -6621 -13097 -18099 -14527 -13868 -13711 -5429 -337
14983 -337 5135 6891 -2240 -6143 -2677 -1357 -959 -7835 -8852 -4173 210 -882 -2079 1741 1656 2838
14967 2838 3881 -754 -5213 -10176 -7354 -2180 2368 1433 6915 5451 -3203 -6982 -7733 -5058 -2757
14952 -2757 -4175 -6678 -13227 -19909 -14457 -6998 -3267 -3663 -856 -390 -1876 -4987 -7425 -4185 -1782
14937 -1782 -1007 403 134 -4321 -13218 -7754 513 -7891 -20441 -20141 -13755 -15805 -12794 -5193 -3346
14922 -3346 -11547 -12127 -6137 -729 298 -453 -4116 -8347 -5350 -3758 -2872 1304 778 -1570 -1279 -2188
$$ packed form
15028D063K922K108l840O57m483k626l926N17L334m550N011J781J815J084k046
15013A821L47N830O46m914o190J947J200m251J677L523M237p563p073l765k384
14998a4912M916J738K134K940M749R73m967m192o476n002L572O59J57Q282N092
14983c37N472J756r131l903L466J320L98o876j017M679M383j092j197L820q5J182
14967B838J043m635m459m963K822N174M548r35N482j464q654l779p51K675K301
14952b757j418k503o549o682N452P459L731l96K807M66j486l111k438L240K403
14937a782P75J410k69m455q897N464Q267q404j2550L00O386k050L011P601J847
14922c346q201n80N990N408J027p51l663m231K997J592Q86M176n26k348K91r09
$$ plain form
14906 -2188 -2264 -452 -7249 -12684 -8991 -8057 -13255 -13329 -5543 3095 1733 3106 5497 1811 -3186 996
14890 996 -3921 -8624 -8913 -11274 -7203 -7876 -7910 -4309 -544 -530 2933 4544 5471 3029 -5379 -3318 651
14873 651 2110 2211 1312 4823 2449 -1097 -5854 -13776 -13570 -5072 -2842 -5833 -2561 -2813 -3312 -4340
14857 -4340 -3230 1427 -1612 746 5970 4400 3989 4010 1004 -3318 -10394 -5913 -4705 -3925 -1362 -5195
14841 -5195 -11611 -6825 -2799 -2241 -1316 -5335 -5453 -5411 -6575 -9488 -8 3867 2350 -5281 -3602 -2981
14825 -2981 -954 5652 9042 3159 -2621 -1331 2086 -673 -5694 -6399 -10508 -9119 -8834 -670 3468
14810 3468 1946 7692 7446 -1856 -4634 -8785 -8762 -5893 -7874 -5004 -2148 -3050 -3391 -5056 -7239 -4634
14794 -4634 -2426 -3749 -1644 -784 -739 -2708 -2006 -7805 -6693 -7475 -4509 -4126 -1291 603 -4194 -2065
$$ packed form
14906b188p6J812o797n435L693R34n198p4P786Q638j362J373K391l686m997M182
14890I96m917m703k89k361M071o73l4L601L765J4L463J611R27k442q408K061L969
14873F51J459J01q99L511k374l546m757p922K06Q498K230k991L272k52m99j028
14857d340J110M657l039K358N224j570m11K1l006m322p076M481J208P80K563l833
14841e195o416M786M026N58R25m019j18M2j164k913R480L875j517p631J679O21
14825b981K027O606L390n883n780J290L417k759n021p05m109J389K85Q164M138
14810C468j522N746k46r302k778m151K3K869j981K870K856r02l41j665k183K605
14794d634K208j323K105Q60M5j969P02n799J112p82K966L83K835J894m797K129
$$ plain form
14778 -2065 1285 6147 13818 8407 4338 10961 14532 17979 10367 6489 1379 3094 -552 -3476 -8273
14763 -8273 -1077 1225 -724 1174 4302 1337 -3489 911 5974 5373 2766 2979 -1220 -5187 -5084
14748 -5084 -2683 -743 -2048 -5327 -4284 -11491 -11207 -12823 -8557 -2566 -8610 -11915 -4589 1353 5718
14733 5718 5123 2848 -2737 -12033 -15116 -10963 -8025 -10011 -14759 -11246 -8340 -4194 -3955 -2693 -6596
14718 -6596 -4016 -3804 -2188 -11634 -11734 -10694 -10375 -9005 -1337 4886 3557 -4177 -888 -625 -5961 -8317
14702 -8317 -7370 -5535 -8435 -14693 -15216 -9848 -5783 -4509 2139 3506 -638 2355 -4031 -9333 -10588
14687 -10588 -2743 1387 2207 1089 -586 -1106 -3029 189 4382 1203 -2815 -5360 -5308 -6342 -4860
14672 -4860 -3308 192 2459 6599 8016 -2671 -9553 -16733 -20351 -13604 -6983 -2572 2232 3330
$$ packed form
14778b065L350M862P671n411m069O623L571L447p612l878n110J715l646k924m797
14763h273P196K302j949J898L128k965m826M400N063o01k607K13m199l967J03
14748e084K401J940j305l279J043p207K84j616M266N991o044l305P326N942M365
14733E718n95k275n585r296l083M153K938j986m748L513K906M146K39J262l903
14718f596K580K12J616r446j00J040L19J370P668O223j329p734L289K63n336k356
14702h317R47J835k900o258n23N368M065J274O648J367m144K993o386n302j255
14687a0588P845M130Q20j118j675n20j923L218M193l179m018k545N2j034J482
14672d860J552L500K267M140J417j0687o882p180l618O747O621M411M804J098
$$ plain form
14658 3330 1471 2541 9063 9021 2711 3189 4849 6065 2849 -4335 -6938 -5534 -6857 -5800 -5420 -6586
14642 -6586 202 3342 2413 1506 4496 9779 10525 11423 8122 8618 4308 -199 1063 1114 -4280 -7979
14626 -7979 -6678 -4796 -3722 -2791 -5940 -10929 -11664 -13209 -15287 -12884 -8897 -2214 4135 1850 1797 7251
14610 7251 7372 5323 2467 1240 2935 1216 -2539 -2991 -9595 -14132 -13724 -4861 3995 16188 19018
14595 19018 8803 3153 1315 3258 6564 9721 7698 8858 5789 5680 5883 11153 3461 1199 -9757
14580 -9757 -16133 -14517 -12930 -17643 -13879 -7270 2705 7210 10303 20861 26574 21348 10155 1246
14566 1246 -4694 -149 5333 12429 17271 17966 8906 1711 -1665 -4810 -7601 -10118 -9766 -6718 -7690
14551 -7690 -4737 -6138 -8371 -5043 -7622 -7944 -5648 -11053 -13319 -4219 15388 27213 32307 23648
$$ packed form
14658C330j859J070O522m2o310M78J660J216l216p184k603J404j323J057L80j166
14642f586O788L140r29r07K990N283P46Q98l301M96m310m507J262N1n394l699
14626g979J301J882J074R31l149m989p35j545k078K403L987O683O349k285n3N454
14610G251J21k049k856j227J695j719l755m52o604m537M08Q863Q856J2193K830
14595A9018j0215n650j838J943L306L157k023J160l069j09K03N270p692k262j0956
14580i757o376J616J587m713L764O609R975M505L093J0558N713n226j1193q909
14566A246n940M545N482P096M842O95r060p195l376l145k791k517L52L048r72
14551g690K953j401k233L328k579l22K296n405k266R100J9607J1825N094q659
$$ plain form
14537 23648 10062 270 -2231 10305 18749 16373 12581 11834 5292 -591 4045 1224 -5542 -9959
14523 -9959 -8373 -5855 -3464 -7654 -12397 -12300 -4527 9001 13669 6258 2507 -1457 466 3476 2251
14508 2251 -224 -11742 -13247 -7479 -6265 -8590 -4398 6090 2639 -3392 -8520 -6595 -4843 -1182
14494 -1182 2976 8402 5269 -234 1197 -1051 -6317 -10707 -17984 -18198 -17502 -14515 -6896 -3622 -6720
14479 -6720 -2846 -4000 -7242 -5252 -342 -1156 -7406 -7187 -5894 -7442 -5379 -10093 -11526 -11449 -14207 -9523
14463 -9523 -10549 -7304 -3484 -4223 4305 7410 9668 9923 7120 4735 8329 3448 -5310 -17831 -18473
14448 -18473 -9585 -5227 -3543 829 4431 1225 -3810 -4276 -6960 -7377 -1744 571 -2131 -4555 -4298
14433 -4298 -5294 -6191 -6083 1928 8543 8726 8863 10707 9952 4013 4135 4617 398 -2031 -1672 -3661 -5961
$$ packed form
14537B3648j3586r792k501J2536Q444k376l792p47o542n883M636k821o766m417
14523i959J586K518K391m190m743R7P773J3528M668p411l751l964J923L010j225
14508B251k475j1518j505N768J214k325M192J0488l451o031n128J925J752L661
14494a182M158N426l133n503J431k248n266m390p277k14O96K987P619L274l098
14479f720L874j154l242J990M910q14o250K19J293j548K063m714j433P7k758M684
14463i523j026L245L820p39Q528L105K258K55k803k385L594m881q758j2521o42
14448a8473Q888M358J684M372L602l206n035m66k684m17N633K315k702k424K57
14433d298r96q97J08Q011O615J83J37J844p55n939J22M82m219k429L59j989k300
$$ plain form
14416 -5961 -4970 3113 5404 4914 1384 4729 9402 22 -779 2596 5860 60 -5161 -2513 -2426 -3090
14400 -3090 -5690 -2137 1622 -2137 -7760 -6071 -4519 -96 774 -1990 -4764 -7682 -6250 -1673 2615
14385 2615 2447 1045 -93 -2167 -3188 2543 3102 -5550 -8626 -3772 -1051 -3363 -392 -285 3575
14370 3575 -402 -712 -2953 -9052 -9717 -6923 1311 7837 8905 7606 2306 2126 1888 -2022 -1209 7641
14354 7641 4207 1168 4026 1894 -3316 -4609 -2313 2107 -3319 -4889 -11807 -9043 -6593 -5488 -4088
14339 -4088 -3995 -4778 -1624 -2124 2394 3744 8952 14745 10010 4039 -6665 -12959 -11913 -9732 -6085
14324 -6085 -3935 2030 3041 -316 1281 1508 -3913 -6865 -8160 -2097 563 -1117 -1021 858 893 -2617
14308 -2617 -7057 -8990 -9780 -3126 -2569 4778 8078 4658 8055 11987 9612 11636 13823 13475 8636
$$ packed form
14416e961R91Q083K291m90l530L345M673r380q01L375L264n800n221K648Q7o64
14400c090k600L553L759l759n623J689J552M423Q70k764k774k918J432M577M288
14385B615j68j402j138k074j021N731N59q652l076M854K721k312K971J07L860
14370C575l977l10k241o099o65K794Q234O526J068j299n300j80k38l910Q13Q850
14354G641l434l039K858k132n210j293K296M420n426j570o918K764K450J105J400
14339d088R3p83L154n00M518J350N208N793m735n971j0704o294J046K181L647
14324f085K150N965J011l357J597K27n421k952j295O063K660j680R6J879L5l510
14308b617m440j933p90O654N57P347L300l420L397L932k375K024K187l48m839
$$ plain form
14293 8636 9321 11472 11238 8290 2121 -1419 -3816 -5540 -4655 -12091 -11621 -8055 -6161 -16 2247 -810
14277 -810 -952 -5202 289 1860 -3823 -716 1861 2859 2744 -2762 -3430 -1635 -356 -4026 355 4511
14261 4511 1076 -4391 -8097 -6518 -2926 -3514 290 -2355 -808 -3129 -5406 -4628 -7039 -8744 -2976
14246 -2976 -2426 -3323 -2476 -2286 -2636 -998 -3157 -2107 -5085 -3230 -649 3887 -1764 -5405 -7849 -4873
14230 -4873 -1263 5708 4586 5058 -209 524 -3094 -4172 -596 2352 4602 4694 6193 3244 790 2270
14214 2270 3319 -977 213 4799 1106 1242 2857 5623 9443 16104 18556 22669 22356 24356 22427
14199 22427 19424 12886 7346 143 509 1022 2350 -643 -2762 -2846 5409 6198 512 3211 2677 -308
14183 -308 -228 263 712 -3390 -5315 -7105 -7861 -6645 -3974 3431 1789 -4218 -2742 -913 -659 1552
$$ packed form
14293H636O85K151k34k948o169l540k397j724Q85p436M70L566J894O145K263l057
14277h10j42m250N491J571n683L107K577R98j15n506o68J795J279l670M381M156
14261D511l435n467l706J579L592n88L804k645J547k321k277P78k411j705N768
14246b976N50q97Q47J90l50J638k159J050k978J855K581M536n651l641k444K976
14230d873L610O971j122M72n267P33l618j078L576K948K250R2J499k949k454J480
14214B270J049m296J190M586l693J36J615K766L820O661K452M113l13K000j929
14199B2427l003o538n540p203L66N13J328k993k119q4Q255P89n686K699n34k985
14183c08Q0M91M49m102j925j790p56J216K671P405j642o007J476J829K54K211
$$ plain form
14167 1552 4054 -1391 -3470 1060 -5553 -9425 -8222 -5503 -7394 -4866 161 -569 -2678 486 4410
14152 4410 2569 -1363 2510 6177 1190 1743 -2496 -1836 -3214 -3459 -4670 -12212 -6974 -3933 -2286
14137 -2286 -4440 2374 5649 1571 -8714 -9516 -5820 -3190 712 -3704 -5490 -4857 -6779 -3184 4041
14122 4041 6832 2653 -2922 -987 -3734 -6074 -11026 -11232 -5365 -10203 -10738 -5863 -5279 -5620 -5471 83
14106 83 2703 6173 5512 -1536 -4008 -7191 1307 5703 -95 -4615 -9819 -7827 -7373 -7191 -12230 -12021
14090 -12021 -6643 -7652 -5127 2255 4806 6386 4818 -4837 -1325 3218 1618 -1042 -2338 376
14076 376 2098 1040 3649 6564 1993 1713 -330 -457 -4615 -4931 -6212 -7779 -5715 -5060 -7545 -8038
14060 -8038 -8210 -6422 -7879 -4258 -2992 -3245 -208 -6422 -10320 -7401 -6960 -10202 -4647 -5253 -7463 -2224
$$ packed form
14167A552K502n445k079M530o613l872J203K719j891K528N027p30k109L164L924
14152D410j841l932L873L667m987N53m239O60j378k45j211p542N238L041J647
14137b286k154O814L275m078j0285q02L696K630L902m416j786O33j922L595P225
14122D041K791m179n575J935k747k340m952k06N867m838n35M875N84l41J49N554
14106H3K620L470o61p048k472l183Q498M396n798m520n204J992M54J82n039K09
14090a2021N378j009K525P382K551J580j568r655L512M543j600k660j296K714
14076C76J722j058K609K915m571k80k043j27m158l16j281j567K064O55k485m93
14060h038j72J788j457L621J266k53L037o214l898K919M41l242N555o06k210N239
$$ plain form
14044 -2224 4642 7997 2953 4085 4406 8832 8942 8428 6243 6651 12244 10625 5932 3845 3387 7376
14028 7376 8901 4357 -4283 541 -885 -5958 -7172 -6736 -11967 -9534 -2702 -57 381 2151 215
14013 215 -2688 -20 1396 4599 -2966 -6983 -2781 638 1125 2875 1589 77 -2988 -5743 -274
13998 -274 1949 -842 -1483 818 5404 2860 3392 -19 5115 7815 3365 2632 6108 1944 2997 9688
13982 9688 15333 13083 6542 -79 782 -1175 -2964 -4109 -2966 4754 7758 2199 -1909 2325 1543
13967 1543 929 4456 -2951 -9269 -6266 -2896 -3080 -7065 -11316 -6663 4590 1355 1426 -1781 -1116 -1516
13951 -1516 994 7208 10547 12106 7770 4803 2305 5225 8908 7539 -483 -9535 -9477 -10717 -8850
13936 -8850 -4888 -2648 6959 13381 9243 10394 6406 7850 4103 -544 -660 -3580 23 7334 4779
$$ packed form
14044b224O866L355n044J132L21M426J10n14k185M08N593j619m693k087m58L989
14028G376J525m544q640M824j426n073j214M36n231K433O832K645M38J770j936
14013B15k903K668J416L203p565m017M202L419M87J750j286j512l065k755N469
13998b74K223k791o41K301M586k544N32l411N134K700m450p33L476m164J053O691
13982I688N645k250o541o621Q61j957j789j145J143P720L004n559m108M234p82
13967A543o14L527p407o318L003L370j84l985m251M653J1253l235P1l207O65m00
13951a516K510O214L339J559m336k967k498K920L683j369q022r052N8j240J867
13936h850L962K240R607O422m138J151l988J444l747m647j16k920L603P311k555
$$ plain form
13921 4779 5527 3078 5793 1765 -5478 -3756 -539 2204 13989 11408 3716 -4407 -2341 -986 -2765
13906 -2765 -691 -1210 3231 2205 -3461 -3076 1626 -84 -3236 -8010 -13898 -13054 -3576 2746 -3602
13891 -3602 -9667 -7023 -7636 -8201 -8122 -10703 -11522 -9641 -3717 -2252 -1172 1187 83 3 -289 -4306 -2766
13874 -2766 -522 -9237 -6034 -4337 -1759 -616 2145 2669 3972 -777 -6027 -6910 -1787 -5178 -5845
13859 -5845 -2032 -7507 -12506 -12013 -12201 -8502 -6845 -9406 -11116 -12453 -6661 -3673 283 -226 8312
13844 8312 9349 -1962 -3763 -3398 -989 -2825 1356 3637 2121 2752 3035 -3423 -9978 -5461 -4461
13829 -4461 -8533 -11143 -10166 -6576 -2332 -6814 -2690 -3869 -1818 -2088 -5638 -3249 -5762 -7051 -3676
13814 -3676 -3204 -2767 732 -1584 -1725 -1668 -3044 -4394 -1998 -1291 -3470 -3651 -1854 -1253 5430 7401 8654
$$ packed form
13921D779P48k449K715m028p243J722L217K743J1785k581p692q123K066J355j779
13906b765K074n19M441j026n666L85M702j710l152m774n888Q44R478O322o348
13891c602o065K644o13n65P9k581q19J881N924J465J080K359j104q0k92m017J540
13874b766K244q715L203J697K578J143K761N24J303m749n250q83N123l391o67
13859e845L813n475m999M93j88L699J657k561j710j337N792K988L956n09Q538
13844H312J037j1311j801L65K409j836M181K281j516O31K83o458o555M517J000
13829d461m072k610R77L590M244m482M124j179K051k70l550K389k513j289L375
13814c676M72M37L499k316j41N7j376j350K396P07k179j81J797O01O683J971J253
$$ plain form
13797 8654 6853 891 597 510 -2614 -9176 -5580 -134 -6112 -7268 -5200 -3376 -5692 -8374 -8926 -9205
13781 -9205 -1030 76 2444 7063 -172 -5794 -10135 -11840 -10164 -7046 -8497 -4780 -5527 -6573 -3498
13766 -3498 373 7301 6273 1658 3252 1455 1991 629 -2220 2698 1027 -1471 1686 5206 2013
13751 2013 255 957 3633 5175 7701 -649 -4065 1211 7028 4891 3822 835 1139 4269 -2561
13736 -2561 -4666 -4750 2267 10921 17661 21747 12514 5786 5533 -1401 -8485 -5922 -5455 -716 4637 6481
13720 6481 4647 8117 7189 -266 2534 7976 13827 16323 13608 12654 8336 5536 2535 -313 -1506
13705 -1506 -3940 -1882 -4064 -4425 -6936 -5075 -2068 -2918 -3803 -11178 -16240 -13200 -10294 -2605 4115
13690 4115 5467 6181 6184 2444 3702 4752 1145 -894 -8522 -16167 -16983 -14548 -6743 7806 16051 12110
$$ packed form
13797H654j801n962k94q7l124o562L596N446n978j156K068J824k316k682n52k79
13781i205Q175J106K368M619p235n622m341j705J676L118j451L717p47j046L075
13766c498L871O928j028m615J594j797N36j362k849M918j671k498L157L520l193
13751B013j758P02K676J542K526q350l416N276N817k137j069k987L04L130o830
13736b561k105q4P017Q654O740M086r233o728k53o934p084K563M67M739N353J844
13720F481j834L470r28p455K800N442N851K496k715r54m318k800l001k848j193
13705a506k434K058k182l61k511J861L007q50q85p375n062L040K906P689O720
13690D115J352P14Ll740J258J050l607k039p628p645q16K435P805J4549Q245l941
$$ plain form
13674 12110 12067 8453 -2108 -2533 -8346 -8215 -10348 -11147 -3512 1396 -1000 527 7685 7900 2941 1108
13658 1108 8774 11615 4872 -911 -7448 -5155 -6678 -7619 -11809 -8903 -7024 -5148 2639 11250 16356
13643 16356 14589 10555 6530 3076 -4437 -8321 -5634 -1177 8774 18924 25965 26138 22371 16977
13629 16977 1663 -9418 -5431 -4539 -8668 -11973 -11393 -1861 7252 9407 19442 13437 3119 4753
13615 4753 5824 460 -773 2785 3359 1488 -2711 -10028 -8255 -6282 3889 16025 17572 17666 10895
13600 10895 1524 -958 -8542 -14453 -18187 -16187 -9801 -9759 -10943 -10999 -5764 -4544 -1322 -4140 3522
13585 3522 3248 -668 -3366 -6653 -7798 -2960 6535 10360 10498 10698 7897 1854 1872 -94 1040 7266
13569 7266 5138 4306 11395 7319 5010 3412 716 -2833 533 5965 9108 8362 6119 3555 1440
$$ packed form
13674A2110m3l614j0561m25n813J31k133p99P635M908k396J527P158K15m959j833
13658A108P666K841o743n783o537K293j523r41m190K906J879J876P787Q611N106
13643A6356j767m034m025l454p513l884K687M457R951J0150P041J73l767n394
13629A6977j5314j1081L987Q92m129l305N80R532R113K155J0035o005j0318J634
13615D753J071n364j233L558N74j871m199p317J773J973J0171J2136J547R4o771
13600A0895r371k482p584n911l734K000O386M2j184n6N235J220L222k818P662
13585C522k74l916k698l287j145M838R495L825J38K00k801o043J8j966J134O226
13569G266k128q32P089m076k309j598k696l549L366N432L143p46k243k564k115
$$ plain form
13554 1440 2445 6847 6055 1946 -4575 -5166 1092 5446 1537 2000 7197 7963 9440 6162 5374 5113
13538 5113 1137 -3895 -5955 -1133 3367 3294 9531 17384 14975 14945 20330 14090 8582 8792 8183 4646
13522 4646 -4233 -2811 -3849 101 3168 2182 2001 470 2463 6961 9095 7904 6847 7447 1991
13507 1991 -1392 2594 4963 5669 6887 4831 -644 -4421 2510 8257 11262 10922 9700 8076 8074 6928
13491 6928 6174 4422 -6414 -7477 -7317 -7889 -5964 -3082 1643 6959 7915 5532 2712 -3299 -7856
13476 -7856 -8195 -379 998 5235 7347 9308 9913 10371 4643 334 3147 8155 8574 8303 5167 5913
13460 5913 8766 10151 12111 8019 6464 9135 1097 -3128 3412 4907 10126 8475 7853 6272 5551
13445 5551 2078 6159 13640 9858 6720 9777 5855 1612 -726 7214 9330 13721 11452 6084 6502
$$ packed form
13554A440J005M402p92m109o521n91O258M354l909M63N197P66J477l278p88k61
13538E113l976n032k060M822M500p3O237P853k409l0N385o240n508K10o09l537
13522D646q879J422j038L950L067r86j81j531J993M498K134j191j057O00n456
13507A991l383L986K369P06J218k056n475l777O931N747L005l40j222j624kj146
13491F928p54j752j0836j063J60n72J925K882M725N316R56k383k820o011m557
13476g856l39P816J377M237K112J961O05M58n728m309K813N008M19k71l136P46
13460E913K853J385J960m092j555K671q038m225O540J495N219j651o22j581p21
13445E551l473M081P481l782l138L057l922m243k338P940K116M391k269n368M18
$$ plain form
13430 6502 9033 12387 4106 2094 3845 896 -2568 960 1303 346 3455 8352 8261 3839 -1518 -2883
13414 -2883 -701 1934 8157 13948 13731 10978 9408 6306 6596 4907 5320 7278 11457 16029 12836
13399 12836 10134 3906 2775 9380 8680 6395 9843 11287 7975 4508 -2780 -1101 3500 7112 7552
13384 7552 9164 3708 3681 4027 1368 3250 3987 8961 8008 4257 2573 3261 4156 3416 2133 3863 -1138
13367 -1138 -4603 -1673 185 -3786 -1361 2317 7388 9859 5635 3226 4689 9340 10989 9796 7646
13352 7646 12258 9302 5862 3928 -727 2151 1450 -559 1580 5833 4885 2740 6088 13966 12935
13337 12935 9530 10640 10736 8080 4331 10290 11771 7419 8415 6469 2823 -2359 -464 203 4928
13322 4928 6434 2241 8099 4560 2280 6573 3446 2731 3034 10210 12200 12208 14074 17628 20309 18316
$$ packed form
13430F502K531L354q281k012J751k949l464L528L43r57L109M897r1m422n357j365
13414b883K182K635O223N791k17k753j570l102K90j689M13J958M179M572l193
13399A2836k702o228j131O605p00k285L448J444l312l467p288J679M601L612M40
13384G552J612n456k7L46k659J882P37M974r53l751j684O88Q95p40j283J730n001
13367a138l465K930J858l971K425L678N071K471m224k409J463M651J649j193k150
13352G646M612k956l440j934m655K878p01k009K139M253r48k145L348P878j031
13337A2935l405J110R6k656l749N959J481m352R96j946l646n182J895O67M725
13322D928J506m193N858l539k280M293l127p15L03P176J990QJ866L554K681j993
$$ plain form
13306 18316 12679 10074 11552 11223 16368 11298 5508 3167 -3171 -1450 4009 1362 -2067 -1857 2682
13291 2682 5775 7973 5966 1968 4807 4603 6665 7392 7602 6345 6503 -1520 -3194 -2301 -4251 -4070
13275 -4070 -2042 -777 2606 3253 13755 18541 10240 11502 14198 14812 11990 7189 4902 3566 3011
13260 3011 7301 8592 13325 15379 6357 6373 4983 5158 8427 10762 11965 14348 14591 19039 20394 12952
13244 12952 9019 13542 15402 15768 17446 17826 11977 14633 14089 6640 8574 13467 10969 11682 6181
13229 6181 -77 -3677 2899 13219 13238 6236 7918 9479 11664 12753 12008 12672 10302 12945 15015
13214 15015 11592 4730 -220 4501 12845 13235 13484 12066 10302 9488 8485 7340 3626 2885 9046
13199 9046 14265 12141 14972 20759 20478 24294 14687 5908 8615 10872 9729 12622 9498 8057 12198
$$ packed form
13306A8316n637k605J478l29N145n070n790k341o338J721N459k647l429K10M539
13291B682L093K198k007l998K839k04K062P27K10j257J58q023j674Q93j950J81
13275d070K028J265L383O47J0502M786q301J262K696O14k822m801k287j336n55
13260C011M290J291M733K054r022J6j390J75L269K335J203K383K43M448J355p442
13244A2952l933M523J860L66J678L80n849K656n44p449J934M893k498P13n501
13229F181o258l600O576J0320J9p002J682J561K185J089p45O64k370K643K070
13214A5015l423o862m950M721Q344L90K49j418j764q14j003j145l714p41O161
13199I046N219k124K831N787k81L816r607q779K707K257j143K893l124j441M141
$$ plain form
13184 12198 9885 8803 5212 1779 7881 18964 21745 20743 12171 11497 17168 11904 9104 8241 5819
13169 5819 4984 9817 10027 8356 5773 10065 11775 10919 15024 10542 6453 5165 9692 12116 16005
13154 16005 21145 21249 11135 1154 720 7495 13876 18561 15480 10330 5376 10861 17958 17726 17507
13139 17507 18989 17725 11503 3521 2794 3947 15282 10332 5836 4359 2975 4084 2752 3384 2087
13124 2087 4387 9860 10435 14408 17574 18332 15252 11912 13057 11799 7336 3152 6626 12343 7147
13109 7147 5912 4600 4367 1653 8751 10163 11059 11052 13705 14041 11755 5090 5373 5778 6713 11216 9739
13092 9739 8522 10685 9358 4654 2923 5135 7214 7641 8017 10638 13698 17409 24129 25867 23117
13077 23117 18368 19235 20842 21868 22895 25481 25431 22029 20221 18729 21705 21973 17446 15432 15600 19268
$$ packed form
13184A2198k313j082l591l433O102J1083K781j002q572o74N671n264k800q63k422
13169E819q35M833K10j671k583M292J710q56M105m482m089j288M527K424L889
13154A6005N140J04j0114r981m34O775O381M685l081n150m954N485P097k32k19
13139A7507J482j264o222p982p27J153J1335m950m496j477j384J109j332O32j297
13124B087K300N473N75L973L166P58l080l340J145j258m463m184L474N717n196
13109G147j235j312k33k714P098J412Q96pK653L36k286o665K83M05R35M503j477
13092I739j217K163j327m704j731K212K079M27L76K621L060L711O720J738k750
13077B3117m749Q67J607J026J027K586n0l402j808j492K976K68m527k014J68L668
$$ plain form
13061 19268 21259 20963 23999 21674 17923 18291 16339 14582 15491 16534 21337 22623 21935 18349 12708
13046 12708 17500 9850 8365 14742 18127 23625 19235 16003 16363 13805 8125 14399 16779 14285 23306
13031 23306 23535 16890 24633 24194 15514 11429 15504 11090 9123 14554 16975 19352 21112 19026 17555
13016 17555 15886 13810 10366 12026 13964 19330 20429 13040 8772 11446 10833 9757 3710 134 9015
13001 9015 8083 14176 20119 19837 19788 13832 13520 17315 23973 26554 24202 21847 22532 23960 23691 15985
12985 15985 17056 19579 20922 19248 21041 9503 10191 14723 14748 15197 17965 20852 25842 22787 14870
12970 14870 12141 7722 15109 17633 13427 17306 19818 22618 21287 19666 23711 22442 22726 21196 19631
12955 19631 19081 18541 22136 19358 17430 14013 13277 11273 13072 18980 22165 25416 23764 20287 22135
$$ packed form
13061A9268J991k96L036k325l751L68j952j757R09J043M803J286o88l586n641
13046A2708M792p650j485O377L385N498m390l232L60k558n680O274K380k494R021
13031B3306K29o645P743m39q680m085M075m414j967N431K421K377J760k086j471
13016A7555j669k076l444J660J938N366J099p389m268K674o13j076o047l576Q881
13001I015r32O093N943k82m9n956l12L795O658K581k352k355O85J428k69p706
12985A5985J071K523J343j674J793j1538O88M532K5M49K768K887M990l055p917
12970A4870k729m419P387K524m206L879K512K800j331j621M045j269K84j530j565
12955A9631n50n40L595k778j928l417p36k004J799N908L185L251j652l477J848
$$ plain form
12940 22135 22833 26473 27837 26996 20642 23739 20443 13476 11042 18076 24747 26668 24557 17085 8241
12925 8241 9483 19709 21320 22362 24672 22920 19133 21782 23116 25972 19603 20519 19866 19168 17079
12910 17079 19491 19198 24653 25617 24783 29269 24682 22224 21022 22392 25141 24795 26852 29648 27602
12895 27602 17517 14852 20750 21584 17652 22046 21679 21936 23840 25421 28626 29505 24619 19402 22461
12880 22461 24692 21673 28695 28725 20662 25272 27732 19885 16562 22876 28176 28946 21108 16816 14684
12865 14684 15266 15221 15389 16047 24248 27113 21356 20379 15514 17578 25381 25372 17073 11762 13322 12252 13603
12848 13603 9421 8734 17207 26402 29167 26201 26748 35237 36250 38687 32691 28751 35121 39022 40954
12833 40954 39086 43146 46585 53078 53665 52676 55747 50843 47536 43662 44153 43810 42322 43029 41806 32796
$$ packed form
12940B2135O98L640J364q41o354L097l296o967k434P034O671J921k111p472q844
12925H241J242J0226J611J042K310j752l787K649J334K856o369R16o53o98k089
12910A7079K412k93N455R64q34M486m587k458j202J370K749l46K057K796k046
12895B7602j0085k665N898Q34l932M394l67K57J904J581L205Q79m886n217L059
12880B2461K231l019P022L0q063M610K460p847l323O314N300P70p838m292k132
12865A4684N82m5J68O58Q201K865n757r77m865K064P803rq299n311J560j070J351
12848A3603m182o87Q473R195K765k966N47Q489J013K437n996l940O370L901J932
12833D0954j868M060L439O493N87r89L071m904l307l874M91l43j488P07j223r010
$$ plain form
12817 32796 24265 27058 31899 33051 30846 33008 32321 26002 24892 21898 22108 24707 30037 31301 30799
12802 30799 25301 24521 25504 24729 27719 27226 24527 31976 39873 35930 27307 22700 19237 25561 27134
12787 27134 21363 18495 12671 14958 21331 23501 22418 23466 25688 24673 23444 25067 26198 27477
12773 27477 24221 23858 25879 27969 27244 23130 17815 13372 15766 16065 12719 13863 15108 13225 19228
12758 19228 29049 35456 35109 33206 32712 37656 41156 40261 35042 28191 32443 33574 34322 33232 29548
12743 29548 26370 23769 27291 26597 19508 14817 15409 13986 15979 22497 28371 25062 24507 22138 28538
12728 28538 28875 25394 20785 21541 23857 28644 26958 17359 13983 18445 22901 24210 24694 27743 29567
12713 29567 32548 34593 34080 26448 28474 28786 28326 30751 29721 28506 26557 36318 34166 28827 28128
$$ packed form
12817C2796q531K793M841J152k205K162o87o319j110k994K10K599N330J264n02
12802C0799n498p80R83p75K990m93k699P449P897l943q623m607l463O324J573
12787B7134n771k868n824K287O373K170j083J048K222j015j229J623J131J279
12773B7477l256l63K021K090p25m114n315m443K394K99l346J144J245j883O003
12758A9228R821O407l47j903m94M944L500q95n219o851M252J131P48j090l684
12743B9548l178k601L522o94p089m691N92j423J993O518N874l309n55k369O400
12728B8538L37l481m609P56K316M787j686r599l376M462M456J309M84L049J824
12713B9567K981K045n13p632K026L12m60K425j030j215j949R761k152n339o99
$$ plain form
12698 28128 24394 25615 22022 21442 20130 21647 21158 26087 27671 32439 32853 25456 28475 32088 34802
12683 34802 33759 36163 34835 33648 36781 36746 36109 38593 35718 33713 34397 39507 39149 34829 27163 26868
12667 26868 26305 28696 31036 32880 35262 29661 30959 35824 34358 35450 30082 29634 29672 29450 28261 33405
12651 33405 33073 24487 24225 26673 27234 30067 32695 29545 24832 27847 28801 34814 38062 35505 29440
12636 29440 34180 35015 33293 31872 34900 39240 48351 51417 53057 49190 44812 40965 42871 41032 40991
12621 40991 41074 41928 41409 42638 44326 41227 34099 36530 40256 44612 47513 49961 52597 55822 48635
12606 48635 45806 45986 47484 46766 45037 45937 50313 51898 52850 48422 42802 39470 36823 45373 48996
12591 48996 50027 49877 49362 43810 45191 47663 48108 47676 42826 49492 52214 52525 51035 50986 49097 42529
$$ packed form
12698B8128l734J221l593n80j312J517m89M929J584M768M14p397L019L613K714
12683C4802j043K404j328j187L133l5o37K484k875k005O84N110l58m320p666k95
12667B6868n63K391K340J844K382n601J298M865j466J092n368m48L8k22j189N144
12651C3405l32q586k62K448N61K833K628l150m713L015R54O013L248k557o065
12636B9440M740Q35j722j421L028M340R111L066J640l867m378l847J906j839m1
12621D0991Q3Q54n19J229J688l099p128K431L726M356K901K448K636L225p187
12606D8635k829J80J498p18j729R00M376J585R52m428n620l332k647Q550L623
12591D8996J031j50n15n552J381K472M45m32m850O666K722L11j490m9j889o568
$$ plain form
12575 42529 40476 53526 54838 44844 41479 42976 45857 47912 45712 45857 47540 42717 37112 39199
12561 39199 40901 44247 50842 50824 44360 46198 48401 56906 56091 56818 57984 56341 57999 59661 56614
12546 56614 58431 63130 67046 69515 73679 78045 81282 89136 88419 85551 85470 83995 88398 88621 82215
12531 82215 79250 80867 74738 64697 65117 67922 66945 70482 69941 67105 61677 58816 65327 65016 58520
12516 58520 54819 51011 52659 51507 49005 53483 53097 49835 50051 51182 50604 49436 52584 65588 62638
12501 62638 55234 50075 51087 51582 53253 54105 48654 53492 54005 49972 53369 55698 59105 60062 57605
12486 57605 58206 51196 48878 47186 53461 54991 46565 48462 52991 57700 60226 64001 60296 58288 54831
12471 54831 54466 56597 53269 54413 56151 56723 59790 58686 61739 63725 60136 57149 63947 61161 54143
$$ packed form
12575D2529k053J3050J312r994l365J497K881K055k200J45J683m823n605K087
12561C9199J702L346O595j8o464J838K203Q505q15P27J166j643J658J662l047
12546E6614J817M699L916K469M164M366L237P854p17k868q1j475M403K23o406
12531H2215k965J617o129j0041M20K805r77L537n41k836n428k861O511l11o496
12516E8520l701l808J648j152k502M478l86l262K16J131n78j168L148J3004k950
12501F2638p404n159J012M95J671Q52n451M838N13m033L397K329L407R57k457
12486E7605O01p010k318j692O275J530q426J897M529M709K526L775l705k008l457
12471E4831l65K131l328J144J738N72L067j104L053J986l589k987O798k786p018
$$ plain form
12456 54143 51340 52020 50412 48585 52021 49390 48727 48873 48372 50944 54062 54699 56047 61928 65603 66656
12440 66656 62262 60459 62945 64090 63393 64182 56998 52733 54434 55776 60951 66148 66750 62013 64082
12425 64082 67647 66005 63493 65305 62026 57268 55365 57734 59710 61230 56404 65103 71615 75947
12411 75947 79529 76795 70366 62754 62621 68364 74664 79435 80646 74140 72019 70490 65684 67839 70948
12396 70948 70782 69007 65653 71665 74566 80083 85459 80967 76814 72185 69019 73644 78982 77685 74343
12381 74343 69189 65933 66483 69788 73849 72084 75017 76232 70631 66675 64893 75619 84258 80369
12367 80369 79845 83112 79457 82780 92553 93586 88356 79226 83894 85000 85385 83206 84340 81742 78873
12352 78873 76748 80503 80706 77837 77084 77384 79858 78470 87332 91597 94285 91690 81693 83288 92232
$$ packed form
12456E4143k803O80j608j827L436k631o63J46n01K572L118O37J348N881L675J053
12440F6656m394j803K486J145o97P89p184m265J701J342N175N197O02m737K069
12425F4082L565j642k512J812l279m758j903K369J976J520m826Q699O512M332
12411G5947L582k734o429p612j33N743O300M771J211o506k121j529m806K155L109
12396G0948j66j775l354O012K901N517N376m492m153m629l166M625N338j297l342
12381G4343n154l256N50L305M061j765K933J215n601l956j782J0726Q639l889
12367H0369n24L267l655L323R773J033n230r130M668J106L85k179J134k598k869
12352G8873k125L755K03k869p53L00K474j388Q862M265K688k595r997J595Q944
$$ plain form
12337 92232 88242 77860 71278 64679 67556 78639 86934 82618 79429 80637 80859 79203 80247 81997
12323 81997 89706 94495 92179 91118 93730 90118 86534 83764 80011 83267 88544 94873 96368 93542
12309 93542 92552 95804 97652 97427 96379 96648 91270 85929 87383 93778 93313 95431 97106 98087 100016 98243
12293 98243 106866 106741 103964 102585 100217 101311 105295 101121 98151 100285 102652 108294 108806 111930 113909
12278 113909 110471 110472 109698 106950 101652 107496 112584 105574 103271 105178 108051 114551 113204 107732 105633
12263 105633 109490 111955 107370 106956 111487 113048 117469 122999 122291 122677 127548 127518 126630 127869 129542 125285
$$ packed form
12337I2232l990j0382o582o599K877J1083Q295m316l189J208K22j656J044J750
12323H1997P709M789k316j061K612l612l584k770l753L256N277O329J495k826
12309I3542r90L252J848k25j048K69n378n341J454O395m65K118J675R81J929j773
12293I8243Q623j25k777j379k368J094L984m174k970K134K367N642N12L124J979
12278A13909l438Jp74k748n298N844N088p010k303J907K873O500j347n472k099
12263A05633L857K465m585m14M531J561M421N530p08L86M871l0q88J239J673m257
$$ [...]
##END NTUPLES=NMR SPECTRUM
##END=
