##TITLE=Analysis number 320501
Compound Code cc 51314
Book Reference 494/22
Project Code adrs
Chemist Name craigr
##JCAMPDX= 6.0         $$ Bruker NMR JCAMP-DX V2.0
##DATA TYPE= NMR SPECTRUM
##DATA CLASS= NTUPLES
##ORIGIN= Bruker BioSpin GmbH
##OWNER= nmr
$$ XWIN-NMR		Version 3.5
$$ Wed Jun 28 09:25:01 2006 GMT Daylight Time (UT+1h)  MAYBRIDGE\nmr@NMR_250MHZ
##.OBSERVE FREQUENCY= 250.131544655141
##.OBSERVE NUCLEUS= ^1H
##.ACQUISITION MODE= SIMULTANEOUS (DQD)
##.ACQUISITION SCHEME= undefined
##.AVERAGES= 16
##.DIGITISER RES= 18
##SPECTROMETER/DATA SYSTEM= dpx250
##.PULSE SEQUENCE= zg30
##.SOLVENT NAME= CDCl3
##.SHIFT REFERENCE= (INTERNAL, CDCl3, 0, 16.522)
##AUDIT TRAIL= $$ (NUMBER, WHEN, WHO, WHERE, WHAT)
$$ ##TITLE= Audit trail, XWIN-NMR		Version 3.5
$$ ##JCAMPDX= 5.01
$$ ##ORIGIN= Bruker BioSpin GmbH
$$ ##OWNER= nmr
$$ C:\u/data/dgb/nmr/ADRS/1630/pdata/1/auditp.txt
$$ ##AUDIT TRAIL=  $$ (NUMBER, WHEN, WHO, WHERE, WHAT)
(   1,<2006-06-28 09:24:26.66 +100>,<MAYBRIDGE\nmr>,<NMR_250MHZ>,
      <created by zg, POWCHK disabled, PULCHK disabled
       configuration hash MD5:
       E2 DF 36 D8 04 B2 41 60 5A D7 A3 38 5A 4B D0 FE
       data hash MD5: 64K
       88 2C 45 D5 68 45 34 F8 46 BC 4B 64 8F F1 AA B2>)
(   2,<2006-06-28 09:24:48.00 +100>,<MAYBRIDGE\nmr>,<NMR_250MHZ>,
      <Start of raw data processing
       ef LB = 0.3 FT_mod = 6 PKNL = 1 SI = 32K 
       data hash MD5: 32K
       3F E5 72 0D 5F E6 91 AD A2 87 58 3A 14 B4 F2 D2>)
(   3,<2006-06-28 09:24:50.05 +100>,<MAYBRIDGE\nmr>,<NMR_250MHZ>,
      <apk 
       data hash MD5: 32K
       7C 87 60 66 18 2F A3 41 A8 33 8C BD DD 59 A0 D2>)
(   4,<2006-06-28 09:24:51.02 +100>,<MAYBRIDGE\nmr>,<NMR_250MHZ>,
      <abs ABSG = 5 
       data hash MD5: 32K
       83 D3 FF 01 87 8F CA 2A D8 A7 35 6B A6 35 37 5D>)
$$ ##END=
$$ 
$$ hash MD5
$$ 59 CC 2B 1D 5A 10 21 C9 21 78 9B 17 87 7E 10 C1
##$RELAX= 
##$RELAX= 
##$RELAX= 
##$RELAX= 
##$RELAX= 
##$RELAX= 
##$RELAX= 
$$ Bruker specific parameters
$$ --------------------------
##$DU= <C:\u>
##$EXPNO= 1630
##$NAME= <ADRS>
##$PROCNO= 1
##$TYPE= <nmr>
##$USER= <dgb>
##$AMP= (0..31)
100 100 100 100 100 100 100 100 100 100 100 100 100 100 100 100 100 100 
100 100 100 100 100 100 100 100 100 100 100 100 100 100 
##$AQSEQ= 0
##$AQ_mod= 3
##$AUNM= <au_zg>
##$AUTOPOS= <5 >
##$BF1= 250.13
##$BF2= 250.13
##$BF3= 250.13
##$BF4= 250.13
##$BF5= 500.13
##$BF6= 500.13
##$BF7= 500.13
##$BF8= 500.13
##$BYTORDA= 1
##$CFDGTYP= 0
##$CFRGTYP= 5
##$CHEMSTR= <none>
##$CNST= (0..31)
1 1 145 1 1 1 1 1 1 1 1 1 1 1 1 1 1 1 1 1 1 1 1 1 1 1 1 1 1 1 1 1 
##$CPDPRG= <>
##$CPDPRG1= <>
##$CPDPRG2= <>
##$CPDPRG3= <>
##$CPDPRG4= <mlev>
##$CPDPRG5= <mlev>
##$CPDPRG6= <mlev>
##$CPDPRG7= <mlev>
##$CPDPRG8= <mlev>
##$CPDPRGB= <>
##$CPDPRGT= <>
##$D= (0..31)
0 1 0 0 0 0 0 0 0 0.06 0 0 0 0 0 0 0.0002 0 0 0 0 0 0 0 0 0 0 0 0 0 0 
0 
##$DATE= 1151483065
##$DBL= (0..7)
120 120 120 120 120 120 120 120 
##$DBP= (0..7)
150 150 150 150 150 150 150 150 
##$DBP07= 0
##$DBPNAM0= <>
##$DBPNAM1= <>
$$ [...]
##$SUBNAM7= <"">
##$SUBNAM8= <"">
##$SUBNAM9= <"">
##$SW= 20.6930455092707
##$SWIBOX= (0..15)
0 0 3 0 0 0 0 0 0 0 0 0 0 0 0 0 
##$SW_h= 5175.983436853
##$TD= 65536
##$TD0= 1
##$TE= 296.16
##$TE2= 300
##$TE3= 300
##$TEG= 300
##$TL= (0..7)
0 120 120 120 120 120 120 120 
##$TP= (0..7)
150 150 150 150 150 150 150 150 
##$TP07= 0
##$TPNAME0= <>
##$TPNAME1= <>
##$TPNAME2= <>
##$TPNAME3= <>
##$TPNAME4= <>
##$TPNAME5= <>
##$TPNAME6= <>
##$TPNAME7= <>
##$TPOAL= (0..7)
0.5 0.5 0.5 0.5 0.5 0.5 0.5 0.5 
##$TPOFFS= (0..7)
0 0 0 0 0 0 0 0 
##$TUNHIN= 0
##$TUNHOUT= 0
##$TUNXOUT= 0
##$USERA1= <user>
##$USERA2= <user>
##$USERA3= <user>
##$USERA4= <user>
##$USERA5= <user>
##$V9= 5
##$VALIST= <valist>
##$VCLIST= <CCCCCCCCCCCCCCC>
##$VD= 0
##$VDLIST= <DDDDDDDDDDDDDDD>
##$VPLIST= <PPPPPPPPPPPPPPP>
##$VTLIST= <TTTTTTTTTTTTTTT>
##$WBST= 1024
##$WBSW= 4
##$XGAIN= (0..3)
0 0 0 0 
##$XL= 0
##$YL= 0
##$YMAX_a= 369807
##$YMIN_a= -492521
##$ZGOPTNS= <>
##$ZL1= 120
##$ZL2= 120
##$ZL3= 120
##$ZL4= 120
##$ABSF1= 16.522
##$ABSF2= -4.171173
##$ABSG= 5
##$ABSL= 3
##$ALPHA= 0
##$AQORDER= 0
##$ASSFAC= 0
##$ASSFACI= 0
##$ASSFACX= 0
##$ASSWID= 0
##$AUNMP= <proc_1d>
##$AZFE= 0.1
##$AZFW= 0.1
##$BCFW= 0
##$BC_mod= 0
##$BYTORDP= 0
##$COROFFS= 0
##$CY= 12.5
##$DATMOD= 1
##$DC= 0
##$DFILT= <>
##$DTYPP= 0
##$F1P= 14.0000005364418
##$F2P= -0.99999901652339
##$FCOR= 0.5
##$FTSIZE= 32768
##$FT_mod= 6
##$GAMMA= 0
##$GB= 0
##$INTBC= 1
##$INTSCL= 1
##$ISEN= 128
##$LB= 0.3
##$LEV0= 0
##$LPBIN= 0
##$MAXI= 10000
##$MC2= 0
##$MEAN= 0
##$ME_mod= 0
##$MI= 0
##$NCOEF= 0
##$NC_proc= -3
##$NLEV= 6
##$NOISF1= 0
##$NOISF2= 0
##$NSP= 0
##$NTH_PI= 0
##$NZP= 0
##$OFFSET= 16.522
##$PC= 1
##$PHC0= 173.5587
##$PHC1= 5.938145
##$PH_mod= 1
##$PKNL= yes
##$PPARMOD= 0
##$PSCAL= 4
##$PSIGN= 0
##$REVERSE= no
##$SF= 250.13
##$SI= 32768
##$SIGF1= 0
##$SIGF2= 0
##$SINO= 400
##$SIOLD= 32768
##$SREGLST= <1H.CDCl3>
##$SSB= 0
##$STSI= 32768
##$STSR= 0
##$SW_p= 5175.98343685301
##$SYMM= 0
##$S_DEV= 0
##$TDeff= 65536
##$TDoff= 0
##$TI= <Analysis number 999999
Compound Code 99
Book Reference 9
Project Code 9>
##$TILT= no
##$TM1= 0
##$TM2= 0
##$TOPLEV= 0
##$USERP1= <user>
##$USERP2= <user>
##$USERP3= <user>
##$USERP4= <user>
##$USERP5= <user>
##$WDW= 1
##$XDIM= 32768
##$YMAX_p= 417639830
##$YMIN_p= -115455
$$ End of Bruker specific parameters
$$ ---------------------------------
##NTUPLES= NMR SPECTRUM
##VAR_NAME=  FREQUENCY,     SPECTRUM/REAL,   SPECTRUM/IMAG
##SYMBOL=    X,             R,               I
##VAR_TYPE=  INDEPENDENT,   DEPENDENT,       DEPENDENT
##VAR_FORM=  AFFN,          ASDF,            ASDF
##VAR_DIM=   32768,         32768,           32768
##UNITS=     HZ,            ARBITRARY UNITS, ARBITRARY UNITS
##FACTOR=    0.157963299565203, 1,           1
##FIRST=     4132.6476996994, 0,             0
##LAST=      -1043.33573715361, 0,           0
##MIN=       -1043.33573715361, -115455,     0
##MAX=       4132.6476996994, 417639830,     0
$$ Real data points
##PAGE= N=1
##DATA TABLE= (X++(R..R)), XYDATA
$$ [...]
16334B3366m286R350n329j7408n643J1965J352p15J2769J503Q98q237o188j4490
16320a093j824P116p372p304J102J3353L197j504K069J1113M644O691P049j1368
16306B5869j777K19O389R926k021K753q648j7445k881k952R086P47K969N601O426
16291C4261Q676n608j4280r266j2182r022J5304R582L621j60P114j7295j5077
16278d332o871m785r47q090N284J0709J6611l941n507j0788K050k208l981L681
16264a3115J418P795K2191j970j0310j1289o056j4039M454J0076J0548R093J7437
16251B6233k477j3458N176K955l179j4770J2375J2128j096k1695j3572j306O658
16238f028O267j410L351J214O146J2313N865m227j1058q989K021R411n150L144
$$ y = [23366, 19080, 28430, 23101, 5693, 50, 12015, 13367, 12652, 25421, 26924, 27822, 19585, 13397, -1093, -2917, 4199, -3173, -10477, -9375, 3978, 7175, 5671, 7740, 18853, 23497, 30188, 37237, 25869, 24092, 24311, 30700, 40626, 38605, 41358, 32710, 15265, 12384, 9432, 18518, 19265, 22234, 27835, 34261, 42937, 37329, 23049, 13783, 1601, -7421, 7883, 17465, 21086, 20926, 28040, 10745, -4332, -11203, -15988, -16935, -25025, -19741, -9032, 7579, 3638, -1869, -12657, -10607, -12815, -16796, -13115, -11697, -3902, 18289, 16319, 6009, -5280, -11336, -25375, -20921, -10845, -297, 8796, 26233, 23756, 10298, 15474, 18429, 15250, 480, 12855, 24983, 23887, 2192, -11380, -12686, -6028, 239, -1171, 2180, 3394, 9540, 21853, 27718, 23491, 12433, 3444, 5465, 14876, 9726, 12870]
16224A2870l586J312L482L222R874J2647j1237m493n795J410Q850m821l581J6585
16210C6739j0811N146k178j8131j944J1982Q5L374j728j393J0046j0667j9697
16197H23R22J1665N729Q449J383j3719j3269l194q75J4091J2947k142k148P022
16183B7684O395k40o409P503J455m333j9386l1840j6283Q640J4323L415m780J3493
16169c63k795r626m833n492P987m091l096J6159J2335p104p726Q592Q169Q0J1768
16154A9964n442k0420j0562N688P835J658k659J4075M228n635r623R953N900n232
16140I728J0911Q369O61l417j0172p309K135M175q097p248j9992N129J3685L971
16126B529K533J333L155k606j0565o629J8496J289l258l578N516P903K924q381
$$ y = [12870, 9284, 10596, 14078, 17300, 27174, 39821, 28584, 24091, 18296, 19706, 28556, 23735, 20154, 36739, 25928, 31074, 28896, 10765, 8821, 20803, 20888, 24262, 22534, 21141, 31187, 20520, 823, 1745, 13410, 19139, 27588, 28971, 15252, 1983, -1211, -2086, 12005, 24952, 22810, 20662, 27684, 34079, 33839, 27430, 34933, 36388, 32055, 12669, -19171, -35454, -26814, -12491, -9076, -13856, -363, -3158, -12784, -17617, -23109, -15122, -19213, -22309, -6150, 6185, -919, -8645, -53, 8116, 8196, 19964, 14522, -5898, -16460, -10772, -2937, -1279, -3938, 10137, 14365, 8730, -893, 9060, 14960, 9728, 20639, 29008, 29669, 26252, 16080, 8771, 10906, 15081, 6984, -264, -20256, -15127, -1442, 2529, 5062, 6395, 9550, 6944, -3621, -10250, 8246, 9535, 6277, 2699, 8215, 16118, 19042, 10661]
16112A0661K719j699j145p664q200n963K173L858K502N984M4N35k77j359k766
16097e97l548O272Q054p704k183J3243O38p624j1147R031J382m320j268j423n928
16082g122p22Q917l481j1976K4614R805k731K117J2741M510M728r193q233K99
16068B4273j4622l749L795P752j970J107r686j4324l990l559Q741o997n815L324
16054a5720J2641N128p913Q2o64j774j9079l54J7838R092J3071N277J5239J775
16040C4639j7118K781r50K773O260r094j4830p228j324K752q695o578Q278J026
16026g308L223m007m32M182O596K103L007O851K563j5987Q56J3758j3490j7972
16012a6057M138L828r46N524J1525Q027r790K21N200k307j7140o663N062J2670
$$ y = [10661, 13380, 11681, 10536, 2872, -5328, -11291, -9118, -5260, -2758, 3226, 3270, 3805, 3528, 2169, -597, -4145, 2127, 10181, 2477, 294, 13537, 14175, 6551, -4596, 4435, 5817, 1497, 229, -1194, -7122, -7844, 1073, -2408, -14384, 10230, 20035, 17304, 19421, 32162, 36672, 41400, 32207, 23974, 24273, 9651, 5902, 9697, 17449, 15479, 16586, 6900, -7424, -11414, -14973, -6232, -13229, -19044, -15720, -3079, 2049, -5864, -5782, -6446, -8220, -27299, -27653, -9815, -723, 12348, 17625, 32864, 34639, 17521, 20302, 19352, 22125, 28385, 19291, 4461, -2767, -4091, -1339, -10034, -16612, -8334, -7308, -4085, -8092, -8524, -4342, 2254, 4357, 7364, 14215, 16778, 791, 1647, 15405, 1915, -16057, -11919, -8091, -9037, -3513, 8012, 16039, 6249, 6470, 11670, 9363, -7777, -14440, -9378, 3292]
15998C292j09m326j591R648J3575O367j0997j9415o473Q62J719j0981L284J9855
15984D710k999L931p995j435P594p8n969Q445j965r294q822K348J5147o093p107
15969i582J7924R31j24N171R848k490j7765P772J163L613n722o517j1853q984
15955a6615N282P305N024M851J0709m465l005j840k823q098R1J3206k090m378
15941C154o826J652o213O018J2781Q009J1389Q37n316q975j716k650N140P746
15927B5030r415n653j92j7288l41J2860l143L785J602p58R439J1426M164n98L22
15912C1240j1650l286N808J0531j5230j1518l240n861J322L577N66r4O10M37n368
15897b156M519K0542O197o35j8531j4104m439m800m560P092O727j002n560O697
$$ y = [3292, 3183, -1143, -2734, 6914, 20489, 26856, 15859, -3556, -10029, -9167, -7448, -18429, -15145, 4710, 1711, 5642, -2353, -3788, 3806, 3728, -2241, 6204, 4239, -5055, -13877, -11529, 3618, -2475, -9582, 8342, 9273, 9149, 14320, 24168, 21678, 3913, 11685, 12848, 16461, 10739, 4222, -7631, -16615, -11333, -4028, 996, 5847, 16556, 12091, 9086, 7246, 4423, -3675, -3584, 9622, 7532, 3154, -3672, -2020, -8233, -2215, 10566, 18575, 29964, 30801, 25485, 16510, 14794, 12144, 17284, 25030, 15615, 9962, 9770, -7518, -7859, 5001, 1858, 5643, 7245, 6487, 15926, 27352, 31516, 30918, 31240, 19590, 16304, 22112, 32643, 17413, 5895, 2655, -3206, -1884, 1693, 2259, 2165, 2775, 3212, -2156, 2363, 22905, 29102, 28467, 9936, -4168, -8607, -13407, -17967, -10875, -4148, -5150, -10710, -4013]
15883d013M50J0274m65j95p234J378J513p743j1046M021K1054P066r65r116J391
15868F370P575j334m001m698l421O843o888P667L590J982k886K334n590K614M969
15853A5126m311j5777Q594J5441j3771j7319K660J6442k149J812J2917l528J4991
15840C1128n105j4335r388j1594J0188K691j4892n870P652j0815O406J2850k222
15827c306q134Q226P793Q70O093J523N02k365j5403Q015M12p040k645Q348N307
15812H196l537M17j4871M168L880j2559L083J2420l257o662J0953j23j0324o875
15798a5091P688J1743M770j1769o145L012k147k805R835Q669p990r97j271m804
15784g302m868n62O45j183O178M185k914m576k125n279l814Q556P470N839l379
$$ y = [-4013, -3563, 6711, 6246, 6051, -1183, 195, 1708, -6035, -17081, -13060, 7994, 15060, 14095, 4979, 6370, 13945, 12611, 8610, 3912, 491, 7334, 446, 8113, 11703, 13685, 10799, 13133, 7543, 10157, 15126, 10815, -4962, 3632, 19073, 5302, -12017, -9357, 7085, 4936, 6748, 19665, 16137, 31128, 26023, 11688, 2300, -9294, 894, 3585, -11307, -17177, -9525, -20340, -13934, -1084, -3306, -11440, -3214, 4579, 5449, 11542, 13065, 13567, 11202, -4201, 3814, 4226, -2814, -5459, 2889, 8196, 4659, 5076, -9795, -5627, -1747, -14306, -11223, 1197, -2060, -8722, 2231, 2108, -8216, -15091, -7403, 4340, 9110, -2659, -8804, -5792, -7939, -10744, -909, 7760, -230, -1227, -2498, -7302, -12170, -12732, -12087, -13270, -7092, -2907, -5821, -10397, -12522, -17801, -21615, -13059, -5589, 250, -3129]
15769c129m585J870n984J201M129J5796j694r409j2925K808Q485J764r612r463
15755b0748L290L581K372m99r089M740P525M653N678q958p283j640M451M583P658
15740C14J424p748o2J2490J3794Q364p841j618K577j2071p535L372J0795J1627
15726B7882K770O139l916r101r950r384j3118Q387Q874l712J3649k021j2572j6034
15712a2107J253Q493K561r139R062k286J2375N972n438K507N038k936j4459N503
15698F399Q164r338j018O80L092p547m245M709O757J3783P803m348j0776M013
15684A8128m515L796J8140J478N653N733O624p193q03M257J1459J5653K3345K569
15670A04324R704J3647K9553K7542J8134J6432L8078N6141P4000P2889R0099J13902
$$ y = [-3129, -7714, -5844, -11828, -10627, -6498, 9298, 7604, -1805, -14730, -11922, -3437, -1673, -11285, -20748, -17458, -13877, -11505, -12004, -21093, -16353, -8828, -4175, 1503, -7455, -14738, -16378, -11927, -7344, 314, 1738, -6010, -6072, 6418, 20212, 28576, 20735, 19117, 21694, 9623, 2088, 5460, 16255, 27882, 30652, 36791, 32875, 23774, 13824, 4440, -8678, -291, 8583, 4871, 18520, 16499, 3927, -12107, -10854, -2361, 200, -8939, 123, -2163, 10212, 16184, 10746, 13253, 18291, 15355, 896, 6399, 14563, 5225, 4207, 4887, 7979, 432, -3813, 896, 7653, 21436, 29239, 24891, 14115, 18128, 13613, 17409, 35549, 37027, 42680, 48413, 55037, 47844, 47041, 51298, 62757, 78410, 101755, 104324, 114028, 127675, 157228, 184770, 202904, 219336, 257414, 313555, 387555, 460444, 550543, 664445]
15658F64445J18162R4540O3892L2447p997l4950q0921j30026j12081r4315p9199
15647D33997o3062m3773l3828k7621l8886k7989j6085j4033o733r286j0317j7911
15635A24473L055j134j0498j36j0838k324j0522j2395j8508k4009n607J9840J8231
15622F9628q993J199l071j5806j034L35P526M779j0247q629k857N297J5794J1335
15608F5256j3940j1917n901j2220P50J3326K551n0j7082j0080q954N481J1941
15595A9161M952J1537r865r644p910R039L054j1915o795l829l857L664J049L836
15581B477J6712j558l568m93j3441k3737J0049J1364R271m715J3003O63J0600
15568B6627Q612o300L266L694J2175j6425j9081o231l571n41n113J0131K685m183
$$ y = [664445, 782607, 877147, 941039, 973486, 965489, 930539, 849618, 719592, 607511, 513196, 433997, 370935, 327162, 293334, 265713, 226827, 198838, 182753, 168720, 161987, 152701, 142384, 124473, 127528, 126394, 115896, 115760, 104922, 102598, 92076, 79681, 61173, 37164, 31557, 51397, 69628, 60635, 61834, 58763, 42957, 41923, 42258, 49784, 54563, 44316, 35687, 32830, 38127, 53921, 65256, 51316, 39399, 33498, 21278, 22028, 35354, 37905, 37855, 20773, 10693, 1739, 7220, 19161, 24113, 35650, 25785, 16141, 8231, 17270, 20324, 8409, 1614, -2215, -6072, -2408, -1359, 2477, 19189, 17631, 14063, 13570, 129, -23608, -13559, -2195, 7076, 2361, 15364, 16027, 26627, 35239, 28939, 32205, 35899, 48074, 31649, 12568, 6337, 2766, 2225, -2888, 7243, 9928, 5745]
15554E745J594J626O18J1392o320J440R415j0718M260M254k009K322m596o179
15540A2844K428J2774Q10l955j1789M679r565r361R816J1346j04J933j2334j5320
15526e798j2250k451O861J3257m40k515J5796j7750K014J2557J659k826J2004
15513B0118J3555j2423j7112j1242J287K811k951O645q243j4201J3902J1596o833
15500c091K966J0232r724k866M928j371q038o510N185l594j344m22J7753P528
15486A1632j4193R513j217j2473K824P155o511q605J766J0281m411j4256j5538
15473c4033J3741K0102P76L073k058l015k207J3112J6383P174k6891o9n875k901
15459b688P074l990J0854J5374n79N704j6353j8733l762P324O500n444j0142J866
$$ y = [5745, 7339, 8965, 9583, 20975, 14655, 16095, 25510, 14792, 19052, 23306, 21297, 23619, 19023, 12844, 15272, 28046, 28856, 24901, 13112, 17791, 8226, -1135, 8681, 20027, 19923, 21856, 9522, -5798, -18048, -20499, -13638, -381, -821, -3336, 12460, -5290, -3276, 9281, 10940, 8114, 20118, 33673, 21250, 4138, -7104, -5817, -3006, -5957, 688, -7555, -21756, -7854, 3742, -3091, -125, 10107, 383, -2483, 2445, 1074, -6964, -13474, -8289, -11883, -13227, -13649, 4104, 11632, -2561, 6952, 5735, -6738, -3914, 3241, -3270, -11875, -10109, 172, -4239, -18495, -34033, -20292, -190, 586, 3659, 1601, -1414, -3621, 9491, 25874, 33048, 6157, 6088, 213, -2688, 4386, 396, 11250, 26624, 26045, 31749, 15396, -3337, -7099, 225, 6725, 1281, -8861, -6995]
15445f995K238J1058P723j052L178q86l161l002J0570P731j4581j9119m587N385
15431e500o719k224O676K853K032N270O813J169k179m623J4479J3660k156j4439
15417A5112j4754K634L319L719N415o959J626M271r517n649p143J0243k045m403
15403d131O381o523q332m644Q6j689P241K201j795J0846J0987m84J7910p536j1690
15388H828M742J0635p31j8839j238J3404o608P571n711j5183m193k198o937J314
15374a5144M667O31n073P98m18J0027O039j046m671j286k049k408N189Q824J9094
15359B3174p07j2269o192j5797N965P700l656j4036p631N760J3001Q911P902l691
15345H434p822M997J974K474L423k424o952r231j0078J093P458j483j2151J0532
$$ y = [-6995, -4757, 6301, 14024, 12972, 16150, 15264, 12103, 9101, 19671, 27402, 12821, -6298, -10885, -5500, -12219, -14443, -7767, -4914, -2882, 2388, 9201, 10370, 8191, 3568, 18047, 31707, 29551, 15112, 358, 2992, 6311, 10030, 15445, 8486, 10112, 14383, 4866, -783, -7926, 2317, 272, -4131, 2250, -4273, -12605, -17249, -17163, -18852, -11611, -9410, -11205, -359, 10628, 10144, 28054, 20518, 8828, 13570, 24205, 23474, 4635, 3397, 16801, 10193, 17764, 12053, -3130, -7323, -9521, -16458, -15144, -10477, -9846, -14919, -14121, -14539, -4512, 1527, 481, -4190, -5476, -7525, -9933, -4744, 4080, 23174, 22467, 10198, 4006, -11791, -5826, 1874, -1782, -15818, -23449, -17689, -4688, 4223, 12125, 8434, 612, 5609, 7583, 10057, 13480, 11056, 4104, -5127, -15205, -14112, -6654, -8137, -20288, -9756]
15331i756J0937L600L435j1233k0243O738M769o474q66Q283O882J658K802O34
15317A166n46P769n516j7523n046K4014L219q631N88M409o196m370J15j0138j940
15302a8626o894l25K3681K199M522R986k050J745R21j0239j2864j1261N241N728
15288h236o651p993J012J5258J4274J4947m463r612j690r48l75k5843r447J6639
15274a3128J0404j355k223J4945J0643q05k980m393r461q457o441j838P510N574
15260b005J4838j0188l67J2654l167l959j0789l455m118O954J1759j7699k1077
15247c0619j804J3854J4998J3629r072l990R447k771j4090Q524n74k431m010o714
15233a5623m705Q021M655p417M194J4916k032J5759J7580R713j0383q675j8492
$$ y = [-9756, 1181, 4781, 8216, -3017, -23260, -16522, -11753, -18227, -19093, -10810, -3928, -2270, 532, 1166, 620, 8389, 2873, -14650, -19696, 4318, 7537, -1094, -506, 3903, -2293, -6663, -6548, -16686, -18626, -25520, -25845, -2164, 35, 4557, 14543, 12493, 14238, 15159, 4920, -7944, -19205, -13964, -8236, -14887, -22880, -21868, -6610, 7664, 22611, 18148, 8536, 6846, 5898, 5523, -20320, -29767, -13128, -2724, -4079, -6302, 8643, 19286, 18481, 15501, 11108, 1647, -6810, -13251, -15089, -7579, -2005, 12833, 2645, 2278, 14932, 11765, 7806, -2983, -6438, -10556, -3602, 8157, -9542, -30619, -32423, -18569, -3571, 10058, 986, -3004, 6443, 3672, -10418, -1894, -2468, -4899, -8909, -15623, -20328, -12307, -7652, -15069, -10875, 4041, 2009, 17768, 35348, 45061, 34678, 26003, 7511]
15220G511j2607p889n550J2543J5917O430n980j1981m211L848o65j1526j923m272
15206b0355J074J8005J0033m224j1654m788P174K720K970N894n98R264k797N240
15192A7958j1981p974J7048L995L202m40l195j1169l47j219l25L76n617M17J460
15177B189j79O028l424k1899K298J888m588N539R863m340j1872P168J1532o137
15163e934L039j962r412p098j0195K121J0199J5436K383n562Q45N028N136n101
15149a077N519J3296j135L154m23j6791n325j0760j2194p219Q503J2328J1804
15136c20Q171o253n479J884J831K706j014l6J1959J3767j0199k133L548j0524
15122G908k0238l786K452l954m99j0368Q849M868J0387O485j420k807j0952L094
$$ y = [7511, -5096, -12985, -18535, -5992, 9925, 16355, 10375, -1606, -5817, -1969, -2634, -14160, -16083, -20355, -19281, -1276, 8757, 4533, -7121, -11909, -4735, -2015, 955, 6849, 6251, 15515, 12718, 17958, 5977, -1997, 15051, 19046, 22248, 21808, 18613, 7444, 7097, 5878, 5553, 5929, 312, 729, 2189, 2010, 8038, 4614, -17285, -14987, -13099, -17687, -12148, -2285, -6625, -18497, -11329, 203, -5934, -2895, -4857, -14269, -21367, -31562, -29441, -19242, -3806, -1423, -6985, -6140, -1112, 4024, -1077, 4442, 17738, 16603, 19757, 19334, 2543, -2782, -13542, -25736, -32955, -24452, -12124, -320, 7851, 1598, -3881, -1997, -166, 2540, 1526, 1490, 13449, 27216, 17017, 14884, 18432, 7908, -12330, -16116, -13664, -17618, -18117, -28485, -19636, -14768, -4381, 2104, 684, -2123, -13075, -9981]
15108i981N574J224P200J2891O977q389MM67j0347P55P838L056K361K230j3547
15093H313q233j2667P000J3730k436j1232K291L033P973k007j096K356r54L576
15079I647n463j0980r994O815K643J101J566K46J2135R250j2297n492L280k446
15065A1m384R640J726j6485j7516p651M01J0207N668j613J3690o794j2361K565
15051b2896M243N421Q553m454j283p467q763J8124J5525m688j7113p634n889K168
15037b6153J9155J4258r008p400M935P608K977L337K342l714N677J0932L225k552
15023B5619k3040k5342k94N390j129j3595J1076J4068M55N659m899J230L55o18
15009e065n790r27K406J8365Q301p66k787n061K2843J8912j335J9540L4361Q4531
$$ y = [-9981, -4407, -3183, 4017, 16908, 23885, 15496, 15500, 15967, 5620, 6375, 14213, 17269, 19630, 21860, 8313, 80, -12587, -5587, 8143, 5707, -5525, -3234, -201, 7772, 5765, 4669, 7025, 6071, 9647, 4184, -6796, -16790, -9975, -7332, -6231, -4665, -4419, 7716, 16966, 4669, -823, 2457, 11, -4373, 5267, 6993, -9492, -27008, -34659, -34258, -24051, -18383, -19996, -6306, -13100, -25461, -22896, -18653, -13232, -4679, -9133, -10416, -17883, -26646, -8522, 7003, 2315, -14798, -22432, -28321, -26153, -6998, 7260, -1748, -9148, -4213, 3395, 6372, 9709, 12051, 8337, 14014, 24946, 28171, 25619, 2579, -22763, -23057, -17667, -18796, -32391, -21315, -7247, -6792, -1133, -6032, -4802, -4447, -5065, -10855, -11782, -9376, 8989, 17290, 16524, 13737, 8676, 31519, 50431, 49096, 68636, 102997, 187528]
14995A87528J21597P6656L3375R016j182m9957j27307r6369l9720k3499j6809
14984G3329j0501j5085k3528p061N107K0152Q710P646j5570j2195j4273k331M815
14971A9215P513j6056l51J4104l400m127K054J317J939m562m968R076J748l410
14957B0092m445m827j4343J4900R019p355P084j2481k2820j0151L531J1110k2
14944a0708L336J1173J206k5585J518n387j441K2942O212p228j909J9448m909
14931H668j6719L62J817L408N226l776l521M622K704p119L841j123R307L37k7549
14916a9515L050R585N582q772j1085O489O003r586O741J4698K959O262n374L202
14902A0239K762j0005m344J5687P235n302r114j316j0483n50J262M131j2623j0988
$$ y = [187528, 309125, 385781, 419156, 428172, 426990, 377033, 249726, 153357, 113637, 90138, 73329, 62828, 47743, 24215, 17154, 22261, 42413, 51123, 58769, 43199, 31004, 16731, 14400, 19215, 26728, 10672, 10321, 24425, 21025, 16898, 18952, 20269, 22208, 17646, 12678, 21754, 23502, 20092, 15647, 10820, -3523, 11377, 20396, 13041, 20125, 7644, -15176, -25327, -21796, -10686, -10708, -7372, 3801, 5007, -20578, -19060, -24447, -25888, -2946, 3266, -3962, -5871, 13577, 8668, -8051, -7689, -5872, -2464, 2762, -1014, -4535, 87, 2791, -4328, -487, -1610, 7697, 8034, -19515, -16465, -6880, -1298, -10070, -21155, -14666, -8663, -18249, -11508, 3190, 6149, 12411, 7037, 10239, 13001, 2996, -1348, 14339, 21574, 16272, 7158, 5842, -4641, -5191, -3929, 202, -12421, -23409]
14888b3409j0491j6132j088R362J1374l435q766J5392J5767l328m288M69J0169
14875h404J4353j549j2157p61N543O417j7073o383J740K966L373K572o748j0604
14861b6715J0005J2446J2149O54o233M28J916q941j3972o151J0664L043n525N67
14847a5665q786P524K711Q639l934Q550N305k053J644j1642j0221O081K357L501
14833e989n622L165J0248p118j1299J5123O858J2396l264j8879j972m332o13J2276
14819I78j754j4620l459J9011J0070n561N875Q235l646q758p353q014o46J111
14805h531K752L585J8129L083n452L599j6528m081J696N810j0593j216K756k381
14791g372p057j821K32J2270M729m81J039J25O913j255J206K490M665m368j1783
$$ y = [-23409, -33900, -50032, -51120, -41758, -30384, -33819, -42585, -27193, -11426, -14754, -19042, -18573, -8404, 5949, 4400, -7757, -8518, -2975, 3442, -13631, -20014, -18274, -15308, -11935, -9363, -16111, -26715, -16710, -4264, 7885, 8539, 2306, 2734, 4650, -4291, -18263, -24414, -13750, -10707, -16232, -15665, -24451, -16927, -14216, -5577, -9511, -961, 4344, 2291, 3935, -7707, -17928, -11847, -9490, -5989, -11611, -8446, 1802, -5316, -16615, -1492, 5366, 17762, 14498, -4381, -6353, -10685, -11298, 978, -776, -15396, -18855, 156, 10226, 4665, 10540, 18775, 15129, 6371, -982, -8996, -9642, -8531, -5779, -2194, 15935, 19018, 13566, 17165, 637, -3444, -1748, 4062, -6531, -7747, -4991, -7372, -14429, -16250, -16018, -3748, 981, 500, 1539, 1664, 8577, 7322, 8528, 11018, 15683, 11315, -468]
14776d68q254j125q108n084M492J5748k884J838J992j5400l455O486Q977M203
14762a042j805J0035m356j2518O124n797k817J2129Q272r754l503P705P31o916
14748c512l983o521r208p980J3042J3872o906q181P218M297o730k453M074Q642
14734d329q099r354J0577j438p13o461q904j680n31r56J1399J555P76q180J862
14719b4476O551M693L040Q688o60K776n187J684R083J0818R9Q23j0271j635o903
14704h77j0259O152J6263O288L679N043l079K340m145k1101p045J8890J130j885
14690A1394J0685k62r396P278O916j5070j6819j5001J2729J0055O69o700J1384
14677G862q439K297J8570J0948K173N852j3661j1588k293n12N858N300J251n256
$$ y = [-468, -8722, -9847, -17955, -23039, -18547, -2799, -5683, -3845, -1853, -17253, -20708, -14222, -5245, -1042, -2847, 7188, 2832, -9686, -3562, -9359, -12176, -47, 8225, -1529, -5032, 2673, 3404, -3512, -7495, -14016, -23224, -31204, -18162, -4290, -11196, -19377, -12159, -7862, -14592, -17045, -12971, -4329, -12428, -21782, -11205, -12643, -13356, -19817, -28721, -30401, -30932, -31888, -20489, -18934, -18158, -26338, -24476, -17925, -13232, -10192, -1504, -2164, 612, -4575, -2891, 6192, 17010, 17109, 17932, 7661, 6026, -877, -11136, -4984, 11279, 17567, 21246, 26289, 23210, 25550, 21405, 304, -6741, 12149, 13279, 11394, 22079, 21817, 12421, 19699, 26615, 11545, -5274, -20275, -7546, 2509, 3178, -3522, 7862, -577, 1720, 20290, 31238, 33411, 39263, 25602, 14014, 11721, 11209, 17067, 22367, 23618, 18362]
14663A8362p195J8156j841n081j1671j1093l991M360L076Q476O398n870J673m676
14649I083k478M850j5972n513J8309Q506l224J0749j8j8228j6176o303L834r67
14635a3548P132J0295j002p903P858o324j5464K921J1916j2576j8901q961K5781
14622a8776K7411j2442n745l672Q709J1141M28M624J1276j4665k7046j0003L131
14609b5629P379M049J2814L927j619r699j2172q418R356K0610J211R78o56M374
14595F505K471j6568j5513J869l768J0832N869k027j967J382l499p856l816o34
14581b6720J2018K381R229K2347p447p623j2923o108o119N966o564l703N562m964
14567b4668N896J2166O735J2956l263o880j227p831K181k187o17m176o290n522
$$ y = [18362, 11167, 29323, 27482, 22401, 10730, -363, -4354, 6, 3082, 11558, 17956, 12086, 13759, 9083, 6605, 11455, -4517, -10030, 8279, 16785, 13561, 24310, 24292, 6064, -10112, -16415, -12581, -13548, -6416, 3879, 2877, -5026, 2832, -3492, -18956, -16035, -4119, -16695, -35596, -44557, -18776, 8635, -3807, -9552, -13224, -4515, 6626, 7054, 11678, 22954, 8289, -18757, -28760, -25629, -18250, -14201, -1387, 2540, 921, -8778, -20950, -29368, -20012, 598, 1809, 2787, 2131, 6505, 8976, -7592, -23105, -21236, -25004, -14172, -8303, -10330, -12297, -10915, -14414, -22270, -26086, -26720, -14702, -12321, -3092, 19255, 11808, 4185, -8738, -14846, -20965, -14999, -21563, -25266, -19704, -24668, -18772, -6606, 129, 13085, 9822, 2942, 1715, -6116, -3935, -6122, -6739, -10915, -17205, -22727]
14553b2727M112R353K076P085P741j913p438q784Q896J2602j0216j6299P146J0778
14539B412j2401L217P905M12M047j432j0354k071p275L177O617O883J3754j563
14525A3328k91j1796j4797l531r76M748L496l411R522p00j1253r987P728J4274
14511c646J8499k472o79J0624M349l673j5496r73M925m246o238j0675J254L577
14497d870J7804j319j6510j9982j312J4098r678k212K463l0O978L60j158o212
14483b1580K212N083j2029k450J1374o98j3617p848P73K3215J1079P673o61j6271
14469a3745R354l005O266J0002j1164o281J5274Q173j3385r237L648K547k0105
14456b1658p470K684k068k56J2035J6806R477p661p944P177O592M22j7569r000
$$ y = [-22727, -18615, -9262, -7186, -101, 7640, 5727, -1711, -10495, -1599, 11003, 787, -15512, -8366, 2412, -9989, -6772, 1133, 1545, 5592, 4160, -6194, -8265, -15540, -12363, -5746, 1137, 14891, 13328, 13037, 1241, -13556, -17087, -18063, -13315, -9819, -13230, -3708, -4408, -15661, -25648, -17920, -3646, 14853, 12381, 11702, 22326, 26675, 23002, 7506, 6533, 11458, 7212, 974, -9701, -8447, -4870, 12934, 11615, -4895, -24877, -26189, -12091, -21769, -23981, -21518, -21548, -14570, -14210, -15368, -21580, -19368, -14285, -26314, -28764, -17390, -18088, -31705, -39553, -38780, -15565, -4486, 3187, 2526, -13745, -4391, -7396, -1130, 8872, -2292, -8573, 6701, 14874, 1489, -7748, -4100, -1553, -21658, -29128, -26444, -28512, -28768, -16733, 73, 9550, 1889, -6055, 1122, 7714, 8136, -9433, -18433]
14442a8433O929j632L372J464R264j0459r060J3860R255M514R883j4601l447j1570
14428a0661o801j757n18l047R829O640j800q239N991K233P088M627P509N559J144
14413A7797j7573q459J118o778J2360O224q927j1340K374l599j5626J2738M986
14400a4705j4L054L822j5233n684J5083L129j282p267N784L432k206P61J3867
14386B541N554K497N383k870k8953o922K2188K724r540L762r727q059j75L159
14372a8438n7J5629J1177O452n255j9458p104j2602N335J1177n123K997o778L753
14358a8295J0935l084j1058M955Q892n725Q670J937N75q383m288m160J1998K140
14344d891j2939k993J185p442J0289J0256J019m198j7068n747J0883J8769J3328
$$ y = [-18433, -11504, -13136, -9764, -8300, 964, -9495, -18555, -4695, 4560, 9074, 18957, 4356, 909, -10661, -17462, -19219, -19737, -22784, -12955, -6315, -8115, -16354, -10363, -8130, -1042, 3585, 11094, 16653, 17797, 224, -8235, -7117, -13895, -1535, 4689, -4238, -15578, -13204, -16803, -32429, -19691, -14705, -14719, -11665, -7843, -23076, -28760, -13677, -10548, -11830, -19097, -13313, -9881, -12087, -11326, 2541, 8095, 10592, 15975, 13105, -15848, -22770, -582, 2142, -7398, -3636, -13363, -21422, -21597, -18438, -18495, -2866, 8311, 14763, 9508, -9950, -17054, -29656, -24321, -13144, -18267, -15270, -22048, -18295, -7360, -10444, -21502, -16547, -7655, -13380, -4710, -2773, -2198, -10581, -14869, -19029, -7031, -4891, -17830, -20823, -19638, -27080, -16791, -6535, -5516, -9714, -26782, -32529, -21646, -2877, 10451]
14331A0451j0971o459l825J8867Q142q023o629P247r929q520K220N47n817K870
14317i829K129J1209o912M707k247J400N005o963j3341K41J8304p047k7356P597
14303b3103J2271N814j2499Q556L585j1690j919J1011M197q442r6p951M952j818
14289a7132O409K4055J1465j1538j1242j844j02q087j0192p207j924N301J2822
14276i216J2082J8010p236p669p428q287j148k986k494O416J286q646j2751O751
14262b3316Q14J0914j632l041O944J3861N650k113j9654j058P832l663J0061Q4
14248A683m970o423O813M361l967p670j5253j485J8127R521k685l548P778j205
14234A077j2901l554P229p743j2296L670Q4j215P173q32n300J0172J4900J696
$$ y = [10451, -520, -6979, -10804, 8063, 16205, 8182, 1553, 8800, -1129, -9649, -7429, -6882, -12699, -9829, -7700, 3509, -3403, 1304, -943, 457, 5462, -1501, -14842, -14601, 3703, -3344, -30700, -23103, -10832, -5018, -17517, -8961, -5376, -17066, -18985, -7974, -3777, -12219, -12315, -20266, -15314, -17132, -10723, 13332, 24797, 13259, 2017, 173, 71, -8016, -18208, -25415, -27339, -22038, -9216, 2866, 20876, 13640, 5971, -1457, -9744, -10892, -13878, -16372, -9956, -8670, -17316, -30067, -23316, -22502, -11588, -13220, -16261, -9317, 4544, 10194, 8081, -11573, -12631, -4799, -8462, 1599, 1683, -3287, -9710, -2897, 1464, -2503, -10173, -25426, -26911, -8784, 737, -1948, -5496, 2282, 1077, -11824, -15378, -8149, -15892, -28188, -24518, -24434, -25649, -18476, -19308, -24608, -14436, 464, 2160]
14220B160J650k583j269M254r1o799o917r265k020l668j155M114L315J1337J7800
14205A0863l719m018l018j5208M295M343Q799P425j4785j4949J4033J7083J2074
14192B3218R256r055q546R628n679j4556j5918O959j3600j0287O750K0582j124
14179b372J260P917N138k0762l722J2288Q09n137k678q530R362J618r887j17Q849
14164e964J1949k915K029J2922j611j1365k1152l541K2664J6384l916m293q668
14151B523n205j317J5780p712j5198p794K764J2476l101n556j1497P677J7610
14138A450L402m325m45j150K826L888L241L269m55j3917k917Q218n199k912r28
14123e954j614J0760R181j3806k764J957M140M46m127J719n519o372q668q27q94
$$ y = [2160, 3810, 1227, -42, 4212, 4121, -2678, -9595, -18860, -20880, -24548, -25703, -21589, -18274, -6937, 10863, 7144, 3126, 108, -15100, -10805, -6462, 2337, 9762, -5023, -19972, -5939, 11144, 23218, 32474, 23419, 14873, 24501, 18822, 4266, -11652, -4693, -18293, -28580, -21830, -1248, -2372, -1112, 6805, 11943, -8819, -12541, -253, 556, -4581, -7259, -15789, -6427, -4809, -14696, -14813, -5964, 5985, 3070, 5099, 18021, 16410, 5045, -16107, -19648, 3016, 19400, 15484, 11191, 2523, -2682, -3999, 11781, 4069, -11129, -18923, -16159, -3683, -6784, -12340, -23837, -16160, 1450, 4852, 527, 82, -1068, 1758, 5646, 8887, 12156, 11701, -2216, -5133, 3085, -2114, -5026, -5954, -7568, 3192, 12373, -1433, -4197, -2240, 1900, 2346, -1781, -62, -5581, -11953, -20621, -21448, -22342]
14108b2342J4721q608M584J5399J0200j941j2725K872L701k0420l270K297Q817
14095f715k098M074J9456M025J010j3490q55N59N27k86K1991J2230o991j2754
14081B0683J228J9003k783l635m058R265J0083n320j8238j5562j1093Q187J5026
14068B2786j477j4265R938p238j3596R946N143L973N675N612O330m859L619L719
14054C5306M126K305P886o81j3311m240J8737J8276q697j3290m804j1417j2897
14041A7299R492R54j4203j2752o796R701J1956J0987n5l923j0122O332r255J239
14027A0854J3528J116j2408M533j89j0032j0083k15q690r54P489O071R298q655
14013A663j4875p901N879N466m756k021J184O300M395J1590N212j2594P59K5826
$$ y = [-22342, -7621, -16229, -11645, 3754, 13954, 12013, -712, 2160, 5861, -14559, -17829, -15532, -6715, -8813, -4739, 14717, 18742, 19752, 6262, 5407, 5966, 6493, 6207, 28198, 40428, 33437, 20683, 21911, 40914, 38131, 34496, 30438, 39703, 49786, 44466, 26228, 10666, -427, 7760, 22786, 21309, 7044, 16982, 9744, -3852, 6094, 11237, 15210, 20885, 26497, 32827, 27968, 31587, 35306, 39432, 41737, 49623, 48942, 35631, 31391, 50128, 68404, 59707, 46417, 41613, 30196, 17299, 26791, 27745, 13542, 790, -6006, 3695, 15651, 26638, 26583, 22660, 12538, 18870, 9615, 10854, 24382, 25498, 13090, 17623, 17434, 7402, -2681, -2896, -11586, -12540, -5051, 1020, 10318, 1663, -13212, -21113, -15234, -9768, -14524, -16545, -15361, -9061, -4666, 6924, 12136, -458, 301, 26127]
13999B6127K724j4224m20N078J382K677k667K074n925l403j1909R61o82J1255
13985A3048j5874q28J3738j178p082o239K577J2488k2358j6949J2067J3405q22
13972d007k201j991j0506p62m57o627J1600J098L420J1081l591r407J2373Q604
13958H627m037o058l376N918O707j0189j0749l374J4904k088r519j595J5847O972
13944G990o737K668l958o741R674m317m138J770J1921P625p315p833o483L291
13930b583J0564j0415k815J0469p085J812m511k448k236r395o305n887K259J1932
13916a6644K843M708M984J043j941M769p859r782j364J1316R636j0598n663P852
13902f700J050n014m358K2173J525L583J6384P072j7730j1146l232J31L457P763
$$ y = [26127, 28851, 14627, 14207, 19285, 20667, 23344, 20677, 22751, 16826, 13423, 1514, 2475, 1793, 13048, -2826, -3654, 10084, 8906, 1824, -4415, -1838, 10650, -11708, -28657, -16590, -3185, -4007, -6208, -8199, -18705, -19467, -19924, -26551, -14951, -13853, -10433, 648, -2943, -12350, 23, 8627, 4590, -1468, -4844, 1074, 7781, -2408, -13157, -16531, -1627, -3715, -13234, -14829, 1018, 7990, 1253, 3921, -37, -6778, 2896, -1421, -5559, -3789, 8132, 15757, 8442, 609, -5874, -2583, 7981, -2434, -5249, 5220, -1865, -53, -4564, -7012, -9248, -18643, -24948, -30835, -28576, -16644, -13801, -9093, -4109, -3066, -5007, -238, -8097, -17879, -19243, -7927, 1709, -8889, -14552, -6700, -5650, -10664, -15022, 7151, 8676, 12259, 28643, 35715, 17985, 6839, 3607, 3738, 7195, 14958]
13888A4958p152k3669k0K637o570J9160J7930K961j626J304j0119m007m057O176
13874G906n026k02l067l027L979m423p002K937K519k283j532M127J1162J6628
13860B2696O275p938n441K294J4996L972K608r214m462l310q216j0356j2362n782
13846a4240J1M507l720o484J7533Q425M2j2157K811L125k583O671J991k497l178
13831B57n168j928j3340P858J8598r417j1565J347R1M522j690l182N501J5488
13817G372n46j1980p04Q084J9224P508j4320j7524N890j0518m584N304J1428j2248
13803g614k202J018k377P833N876N305K984r378l160O906q085m212k05k389N883
13788c817Q435n461K637K248m824J1464P282J928K088p539j1632r681J0099L618
$$ y = [14958, 7806, -15863, -15883, -13246, -19816, -656, 17274, 20235, 18609, 19913, 9794, 5787, 1730, 7906, 2880, 2678, -389, -3416, 563, -3860, -10862, -7925, -5406, -7689, -9221, -5094, 6068, 22696, 28971, 21033, 15592, 17886, 32882, 36854, 39462, 30248, 25786, 22476, 14260, 3904, -8458, -14240, -14229, -9722, -13442, -19926, -2393, 6032, 6074, -6083, -3272, -147, -2730, 3941, 5932, 3435, 257, -4911, -6839, -20179, -12321, 6277, -3140, -14705, -13358, -13267, -8745, -10435, -13617, -8116, 7372, 6826, -5154, -5858, 2226, 21450, 28958, 14638, -2886, 3004, -7514, -12098, -6794, 4634, -7614, -9816, -8798, -11175, -3342, 2534, 7839, 10823, 1445, -1715, 5191, -2894, -7106, -7311, -9700, -3817, 4618, -843, 1794, 4042, -782, 10682, 17964, 19892, 21980, 14441, 2809, -6872, 3227, 6845]
13774F845K413o654m103k713j0884Q503J2643j0723j1502L188J4991M167k603
13761C568j068o107M508O54l695q102J569J3480K567r638n358k123j1670J6302
13747e113K0882J0656M500N752p635K559m602l045k726K895o089l874J0975p073
13733A8062p786r834j789J4019J6480J9661q012k6071m330M60j6793J0280K934
13720G281l626p41M299M406J3714l604o068q211J1054P586j1960J648n646N459
13706A5591p235m78M744J2943J2333p96k935J127m688n912q228N657J7742J226
13692D1091O752N026M792N500P49k2726o495J9507L777Q912m087r670Q461J2382
13678G3971j286J8827J1032K754r341j3649Q771K0471o658m079J3147J5752J8069
$$ y = [6845, 9258, 2604, -1499, -4212, -15096, -6593, 6050, -4673, -16175, -12987, 2004, 6171, 3568, 2500, -3607, 901, 1555, -2140, -10242, -8673, 4807, 7374, -2264, -7622, -9745, -21415, -5113, 15769, 26425, 30925, 36677, 29042, 31601, 26999, 23954, 21228, 24123, 18034, 14160, 25135, 18062, 10276, 442, -1347, 12672, 29152, 48813, 40801, 14730, 10400, 10860, -5933, 4347, 7281, 3655, 2914, 7213, 11619, 25333, 21729, 15661, 7450, 18504, 26090, 14130, 15778, 10132, 15591, 8356, 7878, 12622, 25565, 37898, 37102, 34167, 35294, 30606, 24694, 16466, 22123, 39865, 41091, 47843, 52869, 57661, 63161, 63910, 41184, 34689, 54196, 57973, 66885, 62798, 53128, 61589, 73971, 72685, 91512, 102544, 105298, 95957, 82308, 91079, 111550, 104892, 100813, 113960, 129712, 147781]
13665A47781K1657K8768J7032J0977J5104K6892K6933L9746K5619K3807O6726
13654D51042Q7901R5597R7026J20522J27687J50273J49424J25279R7477N0994
13644A553222O186m3711q3635q6363j03673j30324j34208j23392j07678p3131
13634F73293p4530o7927l6340m5095m8783k7390j6930j2676j8700j7556k6310
13623B81056k5296j2058j4263j3072r687K754J821l870J433m520k9023j5719J737
13610A61293J7563j0228l587L983J714L44J781o452o678m993J014M9j4178j760
13596A39865Q905M698J745K2321L5057L0067Q265J6340Q467j2892j8476j5021
13584B29341j7102j3176r834k3870l4893r96J8036m800p029j2982r827n875k0736
$$ y = [147781, 169438, 198206, 215238, 226215, 241319, 268211, 295144, 334890, 360509, 384316, 451042, 538943, 634540, 731566, 852088, 979775, 1130048, 1279472, 1404751, 1502228, 1553222, 1559408, 1515697, 1432062, 1345699, 1242026, 1111702, 977494, 854102, 746424, 673293, 598763, 530836, 494496, 449401, 400618, 373228, 356298, 343622, 324922, 307366, 281056, 255760, 243702, 229439, 216367, 206680, 209434, 211255, 207385, 208818, 204298, 175275, 159556, 161293, 178856, 168628, 165041, 169024, 170738, 171082, 172863, 166411, 159733, 154740, 155754, 155803, 141625, 139865, 148770, 153468, 155213, 177534, 212591, 242658, 250923, 267263, 275730, 262838, 244362, 229341, 212239, 199063, 189229, 165359, 130466, 129470, 147506, 142706, 135677, 122695, 112868, 106993, 86257]
13571H6257l019N183Q797n699k0545J1090p461L77O342Q740N714R897J6576K0901
13557A43150L2368L8443M5713N7786L2043K0139J4443p803l6114n0286m6509l4962
13545B08411m0412j8283j5356k5088n955k690r125m212m8N601k075o698m102K878
13531H2846q061L937L336P67M858q480k200P388J6505n78J473N43J8687K4219
13517A45240J3954J2182P383Q823p584k1126j6819k5433j9989o543o097j0266
13505G3725j7347m239N19l524j1465J5980J5963j079k284N415l765m177N936R285
13491G8943r186n004J0507O043j1863O035J3471l014j6023p473J4525J28o235
13478G0854j1019q473J637K0256P55N119j718j1319j371l644M699K489L118J026
$$ y = [86257, 83238, 88421, 97218, 91519, 70974, 82064, 74603, 74980, 81322, 90062, 95776, 105673, 122249, 143150, 175518, 213961, 259674, 317460, 349503, 369642, 384085, 376282, 340168, 289882, 243373, 208411, 167999, 149716, 134360, 109272, 103317, 100627, 91502, 87290, 87242, 92843, 90768, 84070, 79968, 82846, 74785, 78722, 82058, 82825, 87683, 79203, 77003, 84391, 100896, 100318, 101791, 102334, 121021, 145240, 159194, 171376, 178759, 187582, 179998, 158872, 142053, 116620, 96631, 90088, 83991, 73725, 56378, 52139, 52658, 49134, 37669, 53649, 69612, 68533, 66249, 71664, 67899, 63722, 69658, 78943, 69757, 64753, 75260, 81303, 69440, 75475, 88946, 85932, 69909, 62436, 76961, 77089, 70854, 59835, 51362, 52999, 73255, 74010, 79129, 77411, 66092, 64721, 61077, 65776, 68265, 71383, 72409]
13464G2409K989j469k629J64k68p955q176K145K140R77K922n182j304J3276j1783
13449E8256m472j2516n376J3615O651j595R283K708K465L723j0364o927J173K581
13435E9205J8670N605p732n305j42K538j2994j5043k072L642O387J5757n493j0504
13421E2519O617n000n939M444k7j1512o525j7213K762Q254j753P661l558O37J1696
13406D3063q169j0464K860N025J0828Q269j0399j4803R161J0811K234J295K397
13393E2108N250j1417R305P405J1477j3141l093l351p508J3759j1635j0583K704
13380D1280o057q17J21M051J1224k234p036p68l456Q049Q666K783j059o932k0698
13365B7117m360K440j4221J1804K2372J4406J8258N535l518n457O370K0304J985
$$ y = [72409, 75398, 73929, 71300, 71464, 71196, 63241, 55065, 57210, 59350, 60327, 63249, 58067, 56763, 70039, 58256, 53784, 41268, 35892, 49507, 56158, 54563, 63846, 66554, 69019, 72742, 62378, 55451, 56624, 59205, 77875, 83480, 75748, 70443, 70301, 72839, 59845, 44802, 42730, 46372, 52759, 68516, 63023, 52519, 59136, 54136, 48197, 52641, 52614, 41102, 34577, 17364, 20126, 28380, 26627, 34288, 30730, 31367, 43063, 34894, 24430, 27290, 32315, 43143, 51412, 41013, 26210, 35371, 46182, 48416, 49711, 52108, 57358, 45941, 55246, 62651, 74128, 60987, 57894, 54543, 47035, 60794, 49159, 38576, 41280, 35223, 34406, 34527, 38578, 49802, 47568, 40532, 39764, 36308, 44357, 53023, 55806, 54747, 47815, 27117, 22757, 25197, 10976, 22780, 45152, 59558, 77816, 83351, 79833, 74376, 80746, 101050, 103035]
13352A03035j9940k7368l661O366q947k2645r218J1038l854Q711K1601K172K592
13339E9882j6343L594L357k029k905J84q957j4786q99J1859J2096R905o377J882
13325E0463J0272M560N87R389P811m854j1979q997K999j0011n417l469m986l122
13311C3246R858L357p053j2287n955r655J6909P933J2652m766j0733l367J086
13298C1225J936M303J0726J7267q027j3690j0502P450O372P462j010J0643J0472
13285G4627L838R15J0400j1832m476J3167q057P22J0769l250q429K132M479N490
13271I0495m392o268n343l219J6464R757k5009l658J6795N778P106Q920m837n140
13257I7449j6205j7119J2934J1042n227L504K4659J8251M646q25J0205j0303j368
$$ y = [103035, 83095, 55727, 52066, 58432, 49485, 26840, 17622, 28660, 24806, 33517, 55118, 57290, 59882, 43539, 47133, 50490, 48461, 45556, 45740, 36783, 21997, 21098, 32957, 45053, 54958, 48581, 50463, 60735, 65295, 65882, 75271, 83082, 78228, 66249, 57252, 60251, 50240, 44823, 41354, 36368, 33246, 43104, 46461, 39408, 27121, 21166, 11511, 28420, 36353, 49005, 44239, 33506, 30139, 31225, 33161, 37464, 48190, 65457, 57430, 43740, 33238, 40688, 47060, 54522, 53512, 64155, 74627, 78465, 79380, 89780, 77948, 73472, 86639, 78582, 79304, 90073, 86823, 78394, 80526, 85005, 90495, 86103, 79835, 74492, 71273, 87737, 97494, 72485, 68827, 85622, 91400, 98506, 107426, 102589, 97449, 81244, 64125, 77059, 88101, 82874, 86378, 111037, 129288, 133934, 133109, 143314, 133011, 131643]
13244A31643K3080Q139N890J5215J9015P319j4548k0341m47N808j556l573P302
13231A82946K9315J8413o162j49j635o25J8485K86j7061j7059q045j6460p554
13218A74695J1205J5900R990P791J7422J5085K2652K1109J3374J3199J6135K0095
13206C58652j0899j3046J03j0978j6123k3941j4802P180R890r407J014j1516n472
13193B60655J4205K3889O023k263K928j0399N945L819J192J7126J4373q307l677
13180C25509K8115M0049J7662J1104M1192M4598K1316R007J9889K8657J3212R202
13168F09512K9499M7377L4591M6974N2965N4712N9900O5558Q9225R0913R9013
13157A280239J01881J03514J32815J45835J64328K04265K73984L45746M52871
$$ y = [131643, 154723, 162862, 168752, 183967, 202982, 210301, 195753, 175412, 174965, 180773, 179217, 175644, 182946, 212261, 230674, 224512, 224363, 222728, 222103, 240588, 240874, 223813, 206754, 198709, 182249, 174695, 185900, 201800, 211790, 219581, 237003, 252088, 274740, 295849, 309223, 322422, 338557, 358652, 347753, 334707, 334810, 323832, 307709, 283768, 268966, 276146, 286036, 276629, 277643, 266127, 260655, 274860, 298749, 304772, 302509, 305437, 295038, 300983, 304802, 305994, 323120, 337493, 329186, 325509, 353624, 393673, 411335, 422439, 463631, 508229, 529545, 538552, 558441, 587098, 600310, 609512, 639011, 686388, 720979, 767953, 820918, 875630, 935530, 1001088, 1090313, 1181226, 1280239, 1382120, 1485634, 1618449, 1764284, 1928612, 2132877, 2406861, 2752607, 3205478]
13148C205478N97458P88639J105116J634594K497509L736310N012139N497056
13140B4074299M804483L201078J314189p42109k972103m669346n208157m381584
13132A5420750l047622k004766j362900r55453o97200m81679l47272k42438j29403
13123F152017n0885j8221k5050r97J7177L4868O2803J58394K79774M29487O27215
13112G666582Q39352J146887J599650K346478L585611N549716Q244650J0705613
13104D1684539J1268895R362487N748299J685470k740105p279051j0479632j1076565
13096C8174337q920247o056479l955547k673068j918552j449369j122496q76226
13088A1202353o91110n72417m60893l48411k89191k45563k46337k31123j90410
$$ y = [3205478, 3802936, 4591575, 5696691, 7331285, 9828794, 13565104, 18577243, 24074299, 28878782, 32079860, 33394049, 32651940, 29679837, 25010491, 19802334, 15420750, 12373128, 10368362, 9005462, 8050009, 7352809, 6871130, 6523858, 6281420, 6152017, 6101132, 6082911, 6057861, 6056864, 6074041, 6108909, 6171712, 6330106, 6609880, 7039367, 7666582, 8505934, 9652821, 11252471, 13598949, 17184560, 22734276, 30978926, 41684539, 52953434, 62315921, 68064220, 69749690, 67009585, 59730534, 49250902, 38174337, 29254090, 23197611, 19242064, 16568996, 14650444, 13201075, 12078579, 11202353, 10511243, 9938826, 9477933, 9129522, 8840331, 8594768, 8348431, 8117308, 7926898]
13079G926898j57948q8580J3733J27109L05484N25186Q15873J247703J981201
13070A2696659L103875M503798N526406N506433M243002K251361J79977k148699
13062C5862812m346413n669573n574675m259231k857994j942667j364831j007622
13054H839806p70639n93480m73618m00915l54026l27411l18276l18600l07603
13045D975238k91891k60447k34278k02530j68588j45726j33291j19549j02301
13036C316637r7379r6935r9030j01521q5304q5700q3448p6949q4759p8289q1417
13025B345906n5021n9468n8164m3037m7618l7393j9351k2508j5964p863k70j1223
13013A968026j7268l6879n7785o6208o4809m2969n7315m9655l0889j2443q980
$$ y = [7926898, 7768950, 7680370, 7694103, 7821212, 8126696, 8651882, 9467755, 10715458, 12696659, 15800534, 20304332, 25830738, 31337171, 35580173, 37831534, 38011511, 35862812, 31516399, 25846826, 20272151, 16012920, 13154926, 11212259, 9847428, 8839806, 8069167, 7475687, 7002069, 6601154, 6247128, 5919717, 5601441, 5282841, 4975238, 4683347, 4422900, 4188622, 3986092, 3817504, 3671778, 3538487, 3418938, 3316637, 3219258, 3122323, 3023293, 2921772, 2836468, 2750768, 2667320, 2590371, 2505612, 2427323, 2345906, 2290885, 2231417, 2173253, 2130216, 2082598, 2045205, 2025854, 2003346, 1987382, 1979519, 1979249, 1968026, 1950758, 1913879, 1856094, 1789886, 1725077, 1682108, 1624793, 1575138, 1544249, 1531806, 1522826]
13002A522826O933O710j3590q641k4438k9874l9642n1971m5198l6451l3304k8338
12990A225022j5112j7139j4301j1796k9866j7422j154j4260j1373k1166j7545
12979A053888q256l104o0j324j375j07j1553j9462j159pQ532Q396Q189j888j520
12964A029190M843j784p306k5501p202j8887j1977l999j1651j5981L099p64j7171
12951I14909j6443R16p858j2912N874O624o360J549n709R952K1477k915l617p872
12937H97615R077J3146J1355R459J3777Q628j2303n350q601k3183p709k661o395
12924H96855j5180K102o093j0088p030N638J1882J9969J7690K084k108R883Q581
12911I34185J3209J2948O419J500N412N143k468J2453J8126J0986N487o21J1061
$$ y = [1522826, 1529759, 1536469, 1522879, 1514238, 1489800, 1459926, 1420284, 1368313, 1323115, 1286664, 1253360, 1225022, 1209910, 1192771, 1178470, 1166674, 1136808, 1119386, 1118232, 1103972, 1092599, 1071433, 1053888, 1045632, 1042528, 1042468, 1041144, 1039769, 1039662, 1028109, 1008647, 1007488, 1007481, 1016013, 1024409, 1032598, 1030710, 1029190, 1034033, 1032249, 1024943, 999442, 992240, 973353, 961376, 957377, 945726, 929745, 932844, 932080, 914909, 898466, 899382, 891524, 878612, 884486, 891110, 884750, 886299, 880590, 890542, 912019, 909104, 905487, 897615, 906692, 919838, 931193, 940652, 954429, 963057, 950754, 945404, 936803, 913620, 905911, 903250, 896855, 881675, 883777, 877684, 867596, 860566, 866204, 878086, 898055, 915745, 917829, 915721, 925604, 934185, 947394, 960342, 966761, 968261, 973673, 978816, 976348, 988801, 1006927, 1017913, 1023400, 1022779, 1033840]
12898A033840R650L674J2948J4736R016P564J9305l667n306L957L4035k282n672
12885A131798q22J3452L58N794J6204Q492K606J7647J8206Q848J5880K3984J9145
12872A281592J9209J1358r3Q252R558Q574J2959K735R027K6383J8736J7994J6925
12859A443209K5673L0050J7839J9980J6792P022K1757K5267L0748J4818M684K4616
12847A682455K2621K6044K5281K2949K1125L7889K8979J6759J33K9845L7488L2903
12835A984471J7665K3854K8371L2250M1465M7183K7749L2847L0251L7475M3202
12824B346783L4437L1625K9995M8520N5549N0724L4240L7627L3424N4230L8732
12813B795886M2089M5263N3481N4491N2955N7907N6281P8548Q0527O1302O0015
$$ y = [1033840, 1043490, 1047164, 1060112, 1074848, 1083864, 1091428, 1110733, 1107066, 1101760, 1105717, 1139752, 1137470, 1131798, 1130976, 1144428, 1144786, 1150580, 1166784, 1175276, 1177882, 1195529, 1213735, 1222583, 1238463, 1262447, 1281592, 1300801, 1312159, 1312066, 1320318, 1329876, 1338450, 1351409, 1354144, 1363171, 1389554, 1408290, 1426284, 1443209, 1468882, 1498932, 1516771, 1536751, 1553543, 1560565, 1582322, 1607589, 1638337, 1653155, 1657839, 1682455, 1705076, 1731120, 1756401, 1779350, 1800475, 1838364, 1867343, 1884102, 1884235, 1914080, 1951568, 1984471, 2002136, 2025990, 2054361, 2086611, 2128076, 2175259, 2203008, 2235855, 2266106, 2303581, 2346783, 2381220, 2412845, 2442840, 2491360, 2546909, 2597633, 2631873, 2669500, 2702924, 2757154, 2795886, 2837975, 2883238, 2936719, 2991210, 3044165, 3102072, 3158353, 3236901, 3317428, 3378730, 3438745]
12802C438745O1517O5382Q3815O5148O1923Q2348Q4303P5498Q0208P6262P5658
12791D250807R1192R5451Q3398J05120J01629P5682R2348R7422J12401J26706
12781E232156J19700J13663J26348J30484J43495J28807J22630J36566J29467
12772F383316J29742J50208J57354J53072J74690J66909J73305J69593J65311
12763G823500J79735J70497J77235K09928J84260J72078J87710K08891J99818
12754I513652K10842K21696K08432K11722K14996K11498J86609K01115K04516
12745A1385078K15713K08513K06077K03974K15007K00020J93287J95158J84311
12736A3207138J58982J54560J74814J46980J29757J30313J15691J07768R2634
$$ y = [3438745, 3500262, 3565644, 3649459, 3714607, 3776530, 3858878, 3943181, 4018679, 4098887, 4175149, 4250807, 4341999, 4437450, 4520848, 4625968, 4727597, 4803279, 4895627, 4993049, 5105450, 5232156, 5351856, 5465519, 5591867, 5722351, 5865846, 5994653, 6117283, 6253849, 6383316, 6513058, 6663266, 6820620, 6973692, 7148382, 7315291, 7488596, 7658189, 7823500, 8003235, 8173732, 8350967, 8560895, 8745155, 8917233, 9104943, 9313834, 9513652, 9724494, 9946190, 10154622, 10366344, 10581340, 10792838, 10979447, 11180562, 11385078, 11600791, 11809304, 12015381, 12219355, 12434362, 12634382, 12827669, 13022827, 13207138, 13366120, 13520680, 13695494, 13842474, 13972231, 14102544, 14218235, 14326003, 14418637]
12727A4418637P5410O4356M8125M4920K4164J0203R876J1159j2795m8084q0989
12716A4564982o5483p7699q5830p7438j06416j24092j25151j39011j39405j40826
12706A3483631j45292j59441j61836j69111j71622j77338j80797j89339k00036
12697A1928819j92919j93576k00629j84677j77244j89056j80701j67880j69133
12688A0273004j69230j85541j70179j61817j60146j41724j40874j50530j64469
12679H828494j63107j70917j71848j90857j85520j52310j57628j52565j49634
12670G334108j46186j55523j37428j17768j27539j19572j18783j25692j26343
12661F159274r7547r8696j14275r9455r6660r5587j04906r5736r0091q6103p0188
$$ y = [14418637, 14494047, 14558403, 14606528, 14651448, 14675612, 14685815, 14695691, 14706850, 14694055, 14645971, 14564982, 14499499, 14421800, 14335970, 14258532, 14152116, 14028024, 13902873, 13763862, 13624457, 13483631, 13338339, 13178898, 13017062, 12847951, 12676329, 12498991, 12318194, 12128855, 11928819, 11735900, 11542324, 11341695, 11157018, 10979774, 10790718, 10610017, 10442137, 10273004, 10103774, 9918233, 9748054, 9586237, 9426091, 9284367, 9143493, 8992963, 8828494, 8665387, 8494470, 8322622, 8131765, 7946245, 7793935, 7636307, 7483742, 7334108, 7187922, 7032399, 6894971, 6777203, 6649664, 6530092, 6411309, 6285617, 6159274, 6061727, 5963031, 5848756, 5749301, 5652641, 5557054, 5452148, 5356412, 5266321, 5180218, 5110030]
12650E110030p9470n6824m7675k2131j0046n0704n5142o8886j02723j29126j19251
12639D368052j19086j10550r1495p0392q6386q6117n4181n7214o6671o8777p2837
12628C484346m5655m3758n0868o2027m4992n0926n1139m9145l5672m8515m7690
12617B953959m3798m3891n2318m1706l1164j8064k1135q026r185k8996j1050l0494
12605B614132l5591n7043p6787o1439n4574m4517m1794l1951l0838l2990l5349
12594B111259j9072k2085k0460j7388l5616k8061l4715l2879k9983k4790k1676
12583A824534k7177l0477k8445q623l941j2561m0576k3705j5802j4572k3420l0897
12571A564338l5138j3492P468j4340j7845j8578k7040k0237j0974j6339j8404
$$ y = [5110030, 5030560, 4973736, 4926061, 4903930, 4893884, 4843180, 4788038, 4719152, 4616429, 4487303, 4368052, 4248966, 4138416, 4046921, 3976529, 3890143, 3804026, 3749845, 3692631, 3625960, 3557183, 3484346, 3438691, 3394933, 3344065, 3282038, 3237046, 3186120, 3134981, 3085836, 3050164, 3001649, 2953959, 2910161, 2866270, 2813952, 2772246, 2741082, 2723018, 2701883, 2693857, 2684672, 2655676, 2644626, 2614132, 2578541, 2521498, 2444711, 2383272, 2328698, 2284181, 2242387, 2210436, 2179598, 2146608, 2111259, 2092187, 2070102, 2049642, 2032254, 1996638, 1968577, 1933862, 1900983, 1871000, 1846210, 1824534, 1797357, 1766880, 1738435, 1729812, 1725871, 1713310, 1672734, 1649029, 1633227, 1618655, 1595235, 1564338, 1529200, 1515708, 1523176, 1508836, 1490991, 1472413, 1445373, 1425136, 1414162, 1397823, 1379419]
12560A379419q342k2624n784j0352j8834j9061j1424K632j8096l4966j6734K498
12548A218332j3140j7303o881j2331j8090k115l259j7334k6490k0797r224k277
12536A069091n319j9414k5700j4560Q109K04j0782k0017k1473j6021l309J3690
12524I54499m322j9142j4834o199P440j4828j9899j1614k0944m500n962j3013
12512H26682p330j647l864j1493j0765o772j3540r598j1234l032m902R9k1078
12499G21526j3359K639R723Q597j5427k4781j3621Q69J4650l153r249j4199r070
12486F55145r405J959O063r197j9825j1024l538o892J0657J2164L245m119m817
12473F20416k533k3482M456l238k3302k5296p244k989P920Q03k679q822N84N190
$$ y = [1379419, 1371077, 1348453, 1342669, 1332317, 1313483, 1294422, 1282998, 1285630, 1267534, 1232568, 1215834, 1218332, 1205192, 1187889, 1181008, 1168677, 1150587, 1148472, 1145213, 1127879, 1101389, 1080592, 1071368, 1069091, 1063772, 1044358, 1018658, 1004098, 1012207, 1012411, 1001629, 981612, 960139, 944118, 940809, 954499, 950177, 931035, 916201, 910002, 917442, 902614, 882715, 871101, 850157, 845657, 839695, 826682, 819352, 817705, 813841, 802348, 791583, 784811, 771271, 761673, 750439, 747407, 742505, 742604, 721526, 708167, 710806, 720529, 729126, 713699, 688918, 675297, 676166, 690816, 687663, 678414, 664215, 655145, 645740, 647699, 653762, 644565, 624740, 613716, 610178, 603286, 613943, 626107, 629352, 625233, 620416, 617883, 594401, 598857, 595619, 572317, 547021, 539777, 536788, 544708, 545511, 542832, 534010, 534594, 539784]
12459E39784M340P97n327L908j5965j1417p45j7336j0137N352M658o375j3640
12446D77897R09M654n160j0812k125M665o906N011r573n705K553n95P28o006j0569
12431D38966l443P15l723J45p580r669o600j3537k990j2309M754R303O309r937
12417C90404j588N575N823n567j1839q237Q393k544M592J1346J639m689j7488
12404C75820q133k723n480P903o182K255k1300n236J3626O78k0754j6412J4107
12391C28169K440R680J1169k556j0033o199l697N884R025R671K89j1261o135j6201
12377C20245n636k060K3291k885n621j0832q009J352R10j578l897l708k981r394
12363B89197j3925o808K282J6672M000m091J736j177r261m209M109J203J017j2795
$$ y = [539784, 544124, 544921, 539594, 543502, 527537, 516120, 515375, 498039, 487902, 493254, 497912, 491537, 477897, 478806, 483460, 478300, 467488, 465363, 470028, 463122, 468133, 458560, 452855, 455408, 454813, 455541, 449535, 438966, 435523, 436238, 432515, 432660, 425080, 415411, 408811, 395274, 392284, 379975, 384729, 394032, 400341, 390404, 388816, 394391, 400214, 394647, 382808, 374571, 382964, 380420, 385012, 396358, 397997, 393308, 375820, 367687, 364964, 359484, 367387, 361205, 363460, 342160, 336924, 350550, 351228, 330474, 314062, 328169, 330609, 340289, 351458, 348902, 338869, 332670, 328973, 334857, 343882, 353553, 353842, 342581, 336446, 320245, 314609, 312549, 335840, 332955, 327334, 316502, 308493, 309845, 310755, 309177, 305280, 301572, 298591, 289197, 275272, 268464, 270746, 287418, 291418, 287327, 289063, 287886, 278625, 274416, 278525, 279728, 280745, 267950]
12349B67950m099j891J7600R597j4053k5295J589q741l893P173J393J1395R783
12336B68508L281l506j2071LN246o025l740Q62j0738o310l592k6O900n644k847
12321B30301L588l529Q194J31q221N163k59j2317j690n981p420J6320m243j0642
12307B09395M218L30J4151Q05M999k7382q128Q092K0852J0332r65J621j1922j9756
12293B06642j8070j2964R497O805l462k048L858n47L319J3450J0279k770L592
12280B17581r4j370R74r440q773q7N949J4942L826J1566j0703r008q179k374L154
12265B07964N254M910J3065j0685J8752K3179P062r261J867l498o888R989J4126
12252B75836L430J315P115K2480J4332K5382L1569K0424J5416L8832L0966K7299
$$ y = [267950, 263851, 261960, 279560, 289157, 275104, 249809, 251398, 242657, 238764, 245937, 247330, 258725, 268508, 271789, 268283, 256212, 256215, 261461, 255436, 251696, 252558, 241820, 235510, 231918, 231892, 238792, 233148, 230301, 233889, 230360, 238554, 238685, 230464, 235627, 235368, 223051, 221361, 215380, 207960, 224280, 220037, 209395, 213613, 213943, 228094, 228899, 233898, 206516, 198388, 206480, 227332, 237664, 236699, 238320, 226398, 206642, 188572, 175608, 185105, 191910, 188448, 186400, 190258, 189711, 193030, 206480, 216759, 213989, 217581, 217487, 216117, 217091, 207651, 198878, 198791, 204740, 219682, 223508, 235074, 224371, 215363, 207184, 204810, 207964, 213218, 218128, 231193, 220508, 239260, 262439, 269501, 260240, 262107, 258609, 251721, 261710, 275836, 279266, 280581, 287696, 310176, 324508, 349890, 381459, 401883, 417299, 456131, 487097, 514396]
12240E14396L1520M5905P1344O9140R7538J06799J41672K00953K18959K84602
12230A782828L17228L07061K75562J78453O6579n0226j55926k37977k85157k89385
12220A909040k70021k12364j53881j25225j17632r1160p9620n6155m4347n0620
12210G08015n5261l8119j9906m0330l8206j8748l1082k8664j0856p140p475j0929
12198D01299k2778j8916J0398k1858j8071O458p481N916J0394j2762k0114j0674
12186C01811j3600K31L053J1636o734j1833Q18k022l527N602k0444k7743o089
12173B31159p77L010O922o748j4922o910p610n421m101M984j7730M456O949r31
12159A92330K67j1022Q070J0430j6903j745R01J1868j509j8398n510j3510j3205
$$ y = [514396, 545916, 591821, 663165, 732305, 829843, 936642, 1078314, 1279267, 1498226, 1782828, 2100056, 2407117, 2682679, 2861132, 2927711, 2877485, 2721559, 2483582, 2198425, 1909040, 1639019, 1426655, 1272774, 1147549, 1029917, 938757, 859137, 802982, 758635, 708015, 652754, 614635, 594729, 554399, 516193, 497445, 466363, 437699, 426843, 419703, 412228, 401299, 378521, 359605, 370003, 348145, 330074, 336532, 329051, 334967, 345361, 332599, 312485, 301811, 288211, 288442, 291495, 303131, 296397, 284564, 285382, 283360, 279833, 285435, 264991, 237248, 231159, 230382, 233392, 240314, 233566, 218644, 211734, 204124, 198703, 194602, 199586, 181856, 186312, 193261, 192330, 192597, 181575, 189645, 200075, 183172, 181427, 182328, 194196, 192687, 174289, 168779, 155269, 142064]
12146A42064L014J985J4660J0678n293j634K253q587j1320m261J57j863K143L536
12132A47532M77k744q40M763Q964m152j1510l756M878o103k711J0282m600q517
12118A31963N35J0136p00N207M57j0388j8918Q029J4555p459m843n47R01p022
12104A21906K346L849Q59l959m512L69R282k634P890K1696J3233K10o36K675Q59
12089A73433J7853K4218K4318Q616q571J533J9722M2109M2454N7350O8016P9443
12077E50494O9327O5748L8547Ml9589n1286m6209o1221o8842n3422l5850k4122
12065C43579k8941m1586k0388k6290j2580p633k2044j1325p085o519r019j3233
12053A36936K927L430O64m949j2949J6243L871j1953r361L9K060l434P93P354
$$ y = [142064, 145078, 147063, 161723, 172401, 167108, 165474, 167727, 159140, 147820, 143559, 143716, 141853, 143996, 147532, 148009, 145265, 144425, 149188, 158152, 154000, 142490, 138734, 143612, 137509, 134798, 145080, 140480, 131963, 132498, 142634, 141934, 147141, 147598, 137210, 118292, 126321, 140876, 133417, 128574, 128027, 128928, 121906, 124252, 128101, 128960, 125001, 120489, 120858, 130140, 127506, 135396, 157092, 170325, 170535, 169899, 172574, 173433, 191286, 215504, 239822, 248438, 239867, 241400, 261122, 303231, 345685, 403035, 471051, 550494, 619821, 685569, 724116, 724120, 684531, 633245, 587036, 525815, 456973, 403551, 367701, 343579, 314638, 273052, 252664, 226374, 213794, 206161, 184117, 172792, 165707, 159188, 150169, 136936, 139863, 143293, 143957, 139008, 126059, 142302, 146173, 134220, 124859, 124898, 126958, 123524, 124317, 131671]
12039A31671o722Q02J278o035k75J0120P596o244j36j9759j1100m524J144K535
12025A00351J421P928o076j1600k192j101J3936K933m951r444M221N401K898o879
12011I6846j4492J009M799O485l389n25j137J0647J1009j032L76L339r590N33
11997A04878r525m49N364K09k417R758j4140j0137m971Q070o937j2365J3756R071
11983I0165l613j349Q49k461k3783k26J6262P644k879l701M446m444p793L199
11969G2316L701J1636L711j880o783n74M90j2805j6493m482j057J0497M581k80
11955F2578M136k23o899j848J0899J0348O654r314j0K55m291Q169o487k381r880
11940F1706J794j4616J323J5590O169L207j4980j3065P690M152j273j2368k63
$$ y = [131671, 124949, 125751, 127029, 120994, 120719, 130839, 138435, 132191, 132055, 112296, 101196, 96672, 97816, 100351, 101772, 109700, 103624, 92024, 89832, 88731, 102667, 105600, 100649, 91205, 95426, 100827, 103725, 96846, 82354, 83363, 88162, 94647, 91258, 90733, 89596, 100243, 111252, 110220, 110596, 113935, 104345, 104878, 95353, 94904, 100268, 100477, 98060, 107818, 93678, 83541, 78570, 86640, 79703, 67338, 81094, 90165, 86552, 85203, 86052, 83591, 59808, 59582, 75844, 83488, 80609, 76908, 81354, 76910, 69117, 72316, 76017, 87653, 91364, 89484, 82701, 82127, 82617, 69812, 53319, 48837, 47780, 58277, 62858, 62578, 66714, 66491, 59592, 57744, 68643, 78991, 85645, 76331, 76321, 76576, 72285, 80454, 73967, 71586, 61706, 63500, 48884, 50207, 65797, 71966, 75173, 60193, 47128, 54818, 58970, 57697, 45329, 45066]
11927D5066j0876R471N405k519P381L543k968M084K840j4075p407j1051K253J3846
11913D4993J7040j229l430r765k155j048m605M792M412j765r751L477P70j1067
11899C0669J0405K840r635j0043J5151q656n404O390L628K6517j4223j1541n539
11886C0559k704J0957J9325n884n807l863N957o264q399O29j0201P081J4506O18
11872D6510P539J3034J1058J639K628p849j1519j893p556M62p918r609n048J45
11858C1623R36J0297K299M894J757l302o593j0538P052K028j4582n494o761k340
11844A1276Q243K705n177O907J2015k560p462j4802o861O161M989P072o66n588
11830A6252K0997J582o326J5892j6746n021j417R922J011r359j8340n394R851
$$ y = [45066, 34190, 43661, 49066, 46547, 53928, 57471, 54503, 58587, 61427, 47352, 39945, 28894, 31147, 44993, 62033, 60804, 57374, 47609, 45454, 44406, 39801, 44593, 49005, 47240, 37489, 40966, 41736, 30669, 41074, 43914, 34279, 24236, 39387, 30731, 25327, 31717, 35345, 61862, 47639, 36098, 30559, 27855, 38812, 58137, 52253, 46446, 42583, 48540, 42276, 33877, 34506, 24305, 31386, 45892, 46510, 54049, 67083, 78141, 79780, 82408, 74559, 63040, 61147, 53591, 54053, 46135, 36526, 31478, 31623, 32559, 42856, 45155, 50049, 51806, 48504, 41911, 31373, 38425, 40453, 25871, 20377, 13616, 11276, 19519, 22224, 17047, 23954, 35969, 33409, 25947, 11145, 4284, 10445, 15434, 22506, 21840, 16252, 37249, 38831, 32505, 48397, 31651, 26630, 25213, 35135, 36146, 26787, 8447, 3053, 12904]
11817A2904J3538L034M926L28J219j2495L008K329P128p907l956O050R416J584
11803D1106L715qp79j0672j121p11j4803o034k845N509P444L093j324O983N85
11788C0138Q483p375j1791m383J3558R069N518j0114o242q345L743j518M591n545
11774A9787n057k96J0575J0487K219j2953Q02l175o946Q385J0014O444q396j0812
11760B1078O470J1044K26L159m233l641Q245J472K634j6186m713N665P289l67
11746C8142l288o951M186q271r048k594R923P37k0688K1922K1184j256q050j3422
11732B2526q348o81r008j1153r67J1135Q080Q837N680j2003l621O562N778O812
11718B9629J4496J9930p291j1070q233r507o745j6308k062P033m196k21K355Q995
$$ y = [12904, 26442, 29476, 34402, 34730, 35949, 23454, 26462, 28791, 35919, 28012, 24056, 30106, 39522, 41106, 44821, 44813, 44034, 33362, 32241, 31530, 16727, 10693, 7848, 13357, 20801, 23894, 22570, 29553, 30138, 38621, 31246, 19455, 15072, 28630, 37699, 43217, 33103, 26861, 18516, 22259, 20741, 25332, 19787, 14730, 14434, 25009, 35496, 37715, 24762, 25564, 22389, 15443, 23828, 33842, 40286, 31890, 21078, 27548, 38592, 38818, 41977, 37744, 34103, 42348, 43820, 46454, 30268, 25555, 31220, 38509, 38142, 34854, 27903, 32089, 23818, 14770, 12176, 22099, 22836, 2148, 24070, 45254, 43998, 35948, 22526, 14178, 13497, 4489, -6664, -7631, 3504, 11584, 20421, 26101, 14098, 10477, 17039, 22817, 29629, 44125, 64055, 56764, 45694, 37461, 27954, 21209, 4901, 2839, 9872, 5676, 5455, 7810, 16805]
11704A6805q798j1256J2200j154K007K4714L275m779Q020J5273j1552o629j4634
11691B3492j2032p695K194Q337J4658P735p734k905j123j787P3j5304o656M846
11677F099j730j523L544K0067J7214l572k6694k1526l810O956J5015J115P8P15
11663A1948j062p356j2430P860O347j8601j3367L572J4877J1158K0389r950m718
11650H667k391K557J4259M251n870K22L84n824j0793q388j743j2718q001P838
11636a7550n650J0946J1070n461K316J2898m77n910n969K850J1237J199l449P448
11622A5498O792j018m715K426j2037n906N609k483l559K996r19M049j0539k691
11608f497Q336m827p684M722M924o428k526N241O600j3684L423P197J7684l882
$$ y = [16805, 8007, -3249, 8951, 7797, 9804, 34518, 37793, 33014, 41034, 56307, 44755, 38126, 23492, 11460, 3765, 5959, 14296, 28954, 36689, 28955, 26050, 24927, 23140, 23213, 7909, 1253, 6099, 4369, 2846, 6390, 26457, 43671, 40099, 13405, -8121, -11931, -4975, 10040, 11155, 11233, 11948, 10886, 3530, -8900, -1040, 5307, -13294, -26661, -23089, -8212, 2946, 23335, 13385, 8667, 6276, 8833, 23092, 27343, 21473, 21695, 22079, 16255, 5462, -2926, -4669, -17387, -25388, -17550, -23200, -12254, -1184, -6645, -4329, 8569, 8092, 2182, -3787, -937, 10300, 11499, 8050, 15498, 22290, 21272, 16557, 18983, 6946, 1040, 6649, 4166, 607, 3603, 2684, 6733, -3806, -6497, 1839, -2988, -10672, -5950, -1026, -7454, -9980, -4739, 1861, -11823, -8400, -1203, 16481, 12599]
11594A2599L380O911l744j5156J118P130M167o851R282L992n527p789O013q56
11580A4669J494p489J448n501r492j0055Q033n81q468O766N503M174l893P115
11566C723M343Q304m63j3985k3960j986O152J9711K1693L387r173o255J1123J1699
11552C4313J0986L880k4095j5064J6793J769M306k2082q954Q955R880o769j6883
11539b965j2153l58J4358O5q287p25K489R748p856p542j1027M445M570J0058n549
11524a0729k557J4370J154j876K958r757o888m012N143m151Q409J1431R913L832
11510A7240J1219o442p886K328j158j3602o496M698K4647O889P083K371o022k330
11496C2539p217k192O216M047J0729J2547J3534M782l512n789R639R749O023q217
$$ y = [12599, 15979, 22890, 19146, 3990, 5108, 12238, 16405, 9554, 18836, 22828, 17301, 9512, 15525, 14669, 16163, 8674, 10122, 4621, -4871, -14926, -6893, -7474, -15942, -9176, -3673, 501, -3392, 3723, 8066, 16370, 15907, 1922, -22038, -24024, -17872, 1839, 23532, 26919, 17746, 11491, 22614, 34313, 45299, 49179, 25084, 10020, 26813, 28582, 32888, 10806, 1852, 10807, 20687, 13918, -2965, -15118, -15476, -1118, -1053, -9340, -10065, -7576, 2172, -5684, -13226, -24253, -19808, -15238, -5180, -10729, -13286, 1084, 2238, 362, 3320, -6437, -13325, -17337, -12194, -16345, -7936, 3495, 13408, 17240, 28459, 22017, 14131, 16459, 15301, 1699, -4797, -99, 24548, 31437, 38520, 40891, 34869, 32539, 25322, 23130, 29346, 33393, 44122, 56669, 70203, 74985, 71473, 65684, 75323, 85072, 91095, 82878]
11482H2878K099J8034J758k3359j8837j1622M637r564m722L278m345q61J2264
11469E1638j341P719p481j4222J545J0362N074N545P659P742J2840K81P492R449
11455A04302J3824J8164N671N582p724J7283N574j7893j9970k4773p661L567p292
11442H8654k3260K031J935r765l014N868j566K78j1109j4174L023J9018j165n369
11428E1385J6983P994o09m42o531N360L1569J0284J3832J5029m498P320l449j5030
11414A29197k2826J1065J6648J5227J8872J0790J8776J2733l457J029j8508l2548
11402A56998l3297k1223q113n546j4025j310N846k785j0956j1j7536K171n096
11389D5117N396q75o875J2054J145n50L425j730N571L349J8952J9330K5096K4910
$$ y = [82878, 84977, 103011, 104769, 81410, 62573, 50951, 55588, 46024, 41302, 44580, 40235, 39374, 51638, 50297, 58016, 50535, 36313, 37858, 48220, 53294, 58839, 66498, 74240, 87080, 87361, 94853, 104302, 118126, 136290, 141961, 147543, 139819, 157102, 162676, 144783, 124813, 100040, 92379, 95946, 88654, 65394, 67425, 69360, 59595, 56581, 62449, 60883, 61161, 50052, 35878, 38901, 57919, 56754, 51385, 68368, 76362, 75753, 75311, 68780, 74140, 105709, 115993, 129825, 144854, 140356, 147676, 144227, 129197, 106371, 117436, 134084, 149311, 168183, 178973, 197749, 210482, 207025, 208054, 189546, 156998, 123701, 102478, 94365, 88819, 74794, 73484, 79330, 76545, 65589, 65578, 48042, 50213, 45117, 50513, 49638, 42763, 54817, 55962, 55412, 58837, 57107, 62678, 66027, 84979, 104309, 129405, 154315]
11375A54315L0183L1365M0121N0309L4127J1142K520j6995m0457m9979n0066k6682
11363A69903l4271k3221j7305k0547j2777o089J2649l533m707k557l431j0858
11351D3256q086j0155p491n705J1038J1431P555m709k694R328Q261J1243P038
11338G0310J9392K5054R626O764J1668K0949n627j7419n514l3292k5779j8197
11326E7935j2261n763m618l904j8454N892J7105j0434j0748O665R095J453L074
11313C5037N40o678j8513o300L531m31p789K635m277p738J1888J0294M431n942
11299A0688j1238j6064j2237J2104P802j872j1031j1598O585J2840P775J3107
11287F861J520j1114N911l390J1413M640J1941N637j5818q406j2388o28J2490
$$ y = [154315, 184498, 215863, 255984, 306293, 340420, 351562, 354082, 337087, 296630, 246651, 196585, 169903, 135632, 112411, 95106, 74559, 61782, 55693, 68342, 64809, 60102, 57545, 54114, 43256, 35170, 25015, 17524, 11819, 22857, 34288, 41843, 37134, 34440, 43768, 52029, 63272, 70310, 89702, 114756, 124382, 131146, 142814, 163763, 158136, 140717, 135203, 101911, 76132, 57935, 45674, 39911, 35293, 31389, 12935, 18827, 35932, 25498, 14750, 21415, 30510, 31963, 35037, 35577, 28899, 10386, 4086, 7617, 7186, -603, 2032, -2245, -9983, 1905, 12199, 16630, 10688, -550, -16614, -28851, -16747, -8945, -10817, -21848, -33446, -26861, -14021, -6246, 6861, 8381, -2733, 3178, -212, 11201, 15841, 27782, 33419, 17601, 9195, -3193, -3821, 8669]
11274H669j272o533r366o731J747N224m348k3515R17r95J1364k258l64P366q975
11259b9070N274J3102J3688Q045j0995r71j14J866N77Q562J1453L036o628J187
11245A9012q759k057O63N254j014o767l562R031m301R09n502m732n99k345n365
11230a0134n118J3114l139o264l142O897J08J112J0823M974r066m843j4485O036
11216a3127J5073l906k406r883K60K0267J1187R196L293J1641J2429l606k3949
11203B6469m239j913j6493j2501L475O227N663q399L691j056J386k879K249R674
11189A1354m110Q049j3396n178k7709j2567L406R24Q380j1274M464J5030p375
11176c0002K368J3305Q725k326p585Q948p65J516L867K13r406l237m396r399r041
$$ y = [8669, 7397, 864, -8502, -15233, -13486, -8262, -12610, -36125, -35208, -36203, -24839, -27097, -27461, -20095, -29070, -23796, -10694, 2994, 11039, 44, -927, -1041, 825, 1402, 9964, 21417, 24453, 17825, 19012, 10253, 8196, 8859, 14113, 13099, 6332, 2770, 11801, 7500, 8409, 2907, -1825, -2424, -4769, -10134, -15252, -2138, -5277, -11541, -14683, -7786, -7678, -6566, 4257, 9231, 165, -4678, -19163, -13127, 1946, -1960, -4366, -14249, -13989, 6278, 17465, 26661, 29954, 41595, 54024, 50418, 26469, 22230, 20317, 3824, -8677, -5202, 1025, 6688, -1711, 1980, 924, 2310, -569, 1680, 11354, 7244, 15293, 1897, -3281, -30990, -43557, -40151, -39227, -30847, -42121, -37657, -22627, -30002, -27634, -14329, -5604, -7930, -15515, -6567, -7332, -5816, -1949, -1736, -11142, -14379, -18775, -28174, -37215]
11161c7215k924o384j1535m199J1240Q084L427N98K850N800n995j5763M921j322
11147d8417q649O172M824L457k226n216J4333J5292J1122k712J0023M967j2753
11134i783j2322l654q603K200J0308R602J1304J243j5738j1323J810K087O381
11121a6488J6918l441o34m542r997J5786J4401k406j1531N65j974P943j1996k424
11107i820Q517J6955K405J951J1966Q657j8008j2350M8P987O112q684j0988l474
11093A274P518j207n249k550O421k566k847P283J1580K7090J8006N471k462M733
11079G2495N843k197j968J8637N914j6780k4603p565J2396Q902m333q621k98J027
11065E8849J7699J10r110J3002L965n086K787P477J798K795J050N238j33j578
$$ y = [-37215, -40139, -46523, -58058, -62257, -51017, -42933, -39506, -38908, -36058, -30258, -36253, -52016, -47095, -48417, -57066, -50894, -46070, -42613, -44839, -50055, -35722, -20430, -9308, -12020, -1997, 2970, -9783, -22105, -25759, -34362, -32162, -21854, -12252, -948, 295, -15443, -26766, -24956, -22869, -16488, 430, -3011, -3645, -8187, -18184, -2398, 12003, 9597, -1934, -1369, -3343, 4600, -7396, -9820, -1303, 15652, 18057, 20008, 31974, 40631, 22623, 10273, 10321, 18308, 24420, 15736, 4748, 1274, 8792, 7585, 2336, -214, 6207, 3641, 794, 8077, 19657, 46747, 64753, 70224, 67762, 72495, 78338, 76141, 74173, 92810, 98724, 81944, 57341, 49776, 62172, 71074, 66741, 58120, 57822, 58849, 76548, 76658, 67548, 80550, 84515, 79429, 82216, 89693, 91491, 94286, 95336, 100574, 100441, 98863]
11051I8863j0412l861J966p832J0273M218O933J8198J0723M541M649Q589L493
11038A50341R042J2486m963m763K4363K8695L552L632J5335J4227K5312K2333
11026B99592J5424K7010L7326K6132L5735N0937M5552M4926M5043O1481N4137
11015G43295Q2586Q0554Q4025J05214J03761J33793J49184J78771J93608K05656
11005B060447K35621K61510K96888L75042M94307O69026R81300J459902K144811
10996H978854L108094M160991M881649M903511M079321K551996O67666j333662
10988C1998420l155091m337963m565546m001789l053713k140728j437007r48156
10980H358427o13850m05684k57689j46692p2214o3184n0049m2113j1086K0196
$$ y = [98863, 88451, 84590, 86556, 78724, 88997, 93215, 100148, 118346, 129069, 133610, 138259, 146848, 150341, 159383, 171869, 166906, 162143, 186506, 215201, 218753, 222385, 237720, 251947, 277259, 299592, 315016, 342026, 379352, 405484, 441219, 492156, 537708, 582634, 627677, 689158, 743295, 825881, 906435, 990460, 1095674, 1199435, 1333228, 1482412, 1661183, 1854791, 2060447, 2296068, 2557578, 2854466, 3229508, 3723815, 4392841, 5374141, 6834043, 8978854, 12086948, 16247939, 21129588, 26033099, 30112420, 32664416, 33332082, 31998420, 28843329, 24505366, 19939820, 15938031, 12884318, 10743590, 9306583, 8358427, 7744577, 7338893, 7081204, 6934512, 6862298, 6799114, 6749065, 6706952, 6695866, 6716062]
10970F716062O2478J25855K14748L00026M19732N69649Q31658J248163J917953
10961A2406324K986252M564439O540404Q489327R627286R216093P150720L906720
10953F4887565P5828l840299p157697r022003q993873p542925n618706l909227
10945A8878663k648207j794861j247441r11611p04475n60704m99196m65491m46507
10936I600170m13048l73878l13039k64613k30470j72996q8317k386J26057K94493
10926H161973N39330R39843J501159K253048L195966M051149M436787M093347
10918B9172602K977951J357765m78909k301951l757406m470712m296732l526620
10910A4675988k607224j826513j260108q94543o48363n07044m13967l86078l57351
$$ y = [6716062, 6778540, 6904395, 7119143, 7419169, 7838901, 8408550, 9240208, 10488371, 12406324, 15392576, 19957015, 26497419, 34986746, 44614032, 53830125, 60980845, 64887565, 64963393, 61123094, 53965397, 44943394, 35949521, 28406596, 22787890, 18878663, 16230456, 14435595, 13188154, 12276543, 11572068, 11011364, 10512168, 10046677, 9600170, 9187122, 8813244, 8500205, 8235592, 8005122, 7832126, 7743809, 7741423, 7867480, 8161973, 8701303, 9641146, 11142305, 13395353, 16591319, 20642468, 25079255, 29172602, 32150553, 33508318, 33029409, 30727458, 26970052, 22499340, 18202608, 14675988, 12068764, 10242251, 8982143, 8087600, 7439237, 6932193, 6518226, 6132148, 5774797]
10901E774797l45129l43486l32364l01368k68154k37701k17943j90204j78517
10892C359931j66555j34741j22145j17820j02191p2677p3285q2983p9157o3988
10882B344389p3212q6174n6344o0205o7707o9302m7819m3761l3995l8344m5030
10871A722496l9613k8724l1263l7926m2105m0799n5818m7014n2323n5544m5583
10860A245784k7792k7137k8750l2081l1363l9734n4104k8453j8032j1581k3218
10849I23539o704q325j8592j5984k0193k1345k7725p539m742r597J0784r133N619
10836G90063K0501J6595K4419O334o774j0512k6171n3492m9110l3678k3204j1551
10824F43420k1916j6626j4563j7345k2409j4950j2994r394q269j3166j7757j7400
$$ y = [5774797, 5429668, 5086182, 4753818, 4452450, 4184296, 3946595, 3728652, 3538448, 3359931, 3193376, 3058635, 2936490, 2818670, 2716479, 2643802, 2570517, 2487534, 2408377, 2344389, 2271177, 2185003, 2128659, 2068454, 2000747, 1931445, 1883626, 1839865, 1805870, 1767526, 1722496, 1682883, 1654159, 1622896, 1584970, 1542865, 1502066, 1446248, 1399234, 1346911, 1291367, 1245784, 1217992, 1190855, 1162105, 1130024, 1098661, 1058927, 1004823, 976370, 958338, 946757, 923539, 916835, 908510, 889918, 873934, 853741, 832396, 804671, 797132, 792390, 782793, 793577, 784444, 790063, 810564, 827159, 851578, 857912, 851138, 840626, 814455, 760963, 711853, 678175, 654971, 643420, 621504, 604878, 590315, 572970, 550561, 535611, 522617, 513223, 504954, 491788, 474031, 456631]
10812D56631J885m975j0788O746Q61j812j192j4175o591l238J6034J4695N610
10799D59691L292J143j0021p048J601j0367j2155k0197k1372M421P34J4668r084
10786C95306j7732j7114j7640k990q697j4686m643L249j8472j2354M675k844j2152
10773B73906O98j3464M570R992O153K5239R869J0502K588k519N284j7415j7660
10760B97743n629q510o414J1160J2883K3715K4899L4586M3422N7584Q3780J19948
10748F89167J42195K09203K45176K38481K26461J77331Q3496P28r8675j94788
10738A718775k26524k41397k17502j79756j47577j06728p1121n5487l5202m1058
10728C96423k8977j5532k1425j9530j4976r193r750j0792k670o379k484j4931
$$ y = [456631, 458516, 453541, 442753, 449499, 450360, 448548, 447356, 433181, 426590, 423352, 439386, 454081, 459691, 462983, 464126, 454105, 447057, 448658, 438291, 426136, 405939, 384567, 388988, 389722, 404390, 395306, 377574, 360460, 342820, 339830, 331133, 316447, 311804, 315053, 296581, 284227, 288902, 286058, 273906, 274604, 261140, 265710, 275702, 281855, 307094, 316963, 327465, 330053, 327534, 332818, 315403, 297743, 292114, 283604, 277190, 288350, 301233, 324948, 349847, 384433, 427855, 485439, 569219, 689167, 831362, 1040565, 1285741, 1524222, 1750683, 1928014, 2011510, 2012238, 1913563, 1718775, 1492251, 1250854, 1033352, 853596, 706019, 599291, 528170, 472683, 437481, 396423, 367446, 351914, 330489, 310959, 295983, 286790, 277040, 266248, 263578, 257199, 254715, 239784]
10716B39784j4021k960m864j2684k974J0819K055k3831k1932J2536l862k280q90
10703A74896k4020j5156j590m205j661l431l449l665M355q600l181qj4681K846
10689I8450J4011k893O387r057L041J6315M896K68N400j709J326j1946n633l370
10675A15486J530m18L742R4J4056n090m175N238J5543J2146K5088L0088M6558
10662B59886P6900J24528J31415J07458O9081K1057l6125p3680j25089j36000
10652D19431r4650o0034l5609p197K028j7550j4767q340k4785r633j4456j9698
10640A14740j4339j9581k1372k2279l5551l4235j4798j3401n982L711O321J2324
10628d4442J4065K2881K3426R440Q865J8377J3212m405Q392J4542L703n070m673
$$ y = [239784, 225763, 222803, 217939, 205255, 202281, 213100, 215155, 191324, 169392, 181928, 178066, 175786, 174896, 150876, 135720, 134130, 129925, 128264, 124833, 121384, 117719, 122074, 113474, 110293, 110285, 95604, 98450, 112461, 109568, 115955, 106898, 109939, 126254, 131150, 131418, 136818, 135109, 136435, 124489, 118856, 115486, 117016, 116598, 120340, 120434, 134490, 129400, 125225, 130463, 146006, 158152, 183240, 213328, 259886, 336786, 461314, 592729, 700187, 769268, 790325, 754200, 680520, 555431, 419431, 324781, 264747, 229138, 221941, 223969, 206419, 191652, 183312, 158527, 148894, 134438, 114740, 100401, 80820, 59448, 37169, 1618, -32617, -47415, -60816, -66798, -63087, -56766, -44442, -30377, -7496, 15930, 25370, 34235, 52612, 65824, 61419, 69811, 84353, 88056, 82986, 78313]
10615G8313J419o144r930p952q359P103j1661j7352q493N64J8551n38J4451K7670
10601G7642J3659K448o424m065L945m805o67p165q220M272L381m119q373k5638
10587C5871j750n255J6655K7124J9496J3221M1506N9880O0378L6106J9432J5779
10575C38443K1312K0500m57k3776k1161k5056m2255l8604j1857j3584j2570p109
10563A83826k3115l284P116l012L860P912j2594k3816j0121j7732l00p064k2144
10550G9532k718K0138j2238k5573j4496j5612P654J4516J3357m830r363J5589
10538F5956K9301L8831L3837M2674M9483L7978J6927j289j4815m5811m2348m5978
10526A64746n0668l4886m2300m2506j7329j0944j7421l3147k5698L718M781j3801
$$ y = [78313, 79732, 73588, 63658, 55706, 47347, 54450, 42789, 25437, 16944, 17508, 36059, 35521, 49972, 77642, 91301, 93749, 87325, 83260, 87205, 82400, 81733, 74568, 66348, 70620, 74001, 69882, 61509, 35871, 34121, 28866, 45521, 72645, 92141, 105362, 146868, 206748, 267126, 303232, 322664, 338443, 359755, 380255, 379798, 356022, 334861, 309805, 267550, 228946, 217089, 203505, 190935, 183826, 160711, 157427, 164543, 161531, 165391, 173303, 160709, 136893, 126772, 109040, 108740, 101676, 79532, 76814, 96952, 84714, 59141, 44645, 29033, 36687, 51203, 64560, 59730, 50367, 65956, 95257, 134088, 167925, 210599, 260082, 298060, 314987, 313698, 298883, 253072, 210724, 164746, 114078, 79192, 36892, -5614, -22943, -33887, -51308, -84455, -110153, -106435, -101654, -115455]
10514a15455J542J2722K3145L9817L8715L0633K9630J6888J5733K496K462j1174
10502H7154k1702p687l046J4727K2192J3817J5239p057k731j3758k9716k9769
10490C7663k4693j0667n293M554o85K070r741J9162O795o091k5192k2139k692
10477c6949L999M534P974K0476k498l87J8612N784K041p05K341J1748L3125K2655
10463I2750m726m187k691J550j0755n26k477L3527O5721Q4643P5708N8235N6523
10450D43295M2969K1117j3371j1599r943k6504l723j2252j7643k2241j2616K581
10438C80070L496R392m807j5558j4080o784j1859k1928l1137l0887k7354p364
10426B21200N775J3805R211J0699Q014R932J016q197R469J323q181j3491j7868
$$ y = [-115455, -113913, -101191, -78046, -38229, 486, 31119, 60749, 77637, 93370, 95866, 98328, 87154, 65452, 57765, 54719, 69446, 91638, 105455, 120694, 113637, 110906, 97148, 67432, 37663, 12970, 2303, -2990, 1564, 879, 2949, -6792, 12370, 19165, 13074, -12118, -34257, -36949, -32950, -28416, -20442, 34, -2464, -2851, 15761, 21545, 23586, 22881, 25222, 36970, 70095, 92750, 88024, 83837, 81146, 82696, 71941, 71415, 68938, 102465, 168186, 252829, 328537, 386772, 443295, 486264, 507381, 494010, 482411, 472468, 445964, 442241, 429989, 412346, 390105, 377489, 380070, 383566, 392958, 388151, 372593, 358513, 351729, 339870, 317942, 286805, 255918, 228564, 221200, 226975, 240780, 249991, 260690, 268704, 278636, 279652, 271455, 280924, 282247, 274066, 260575, 242707]
10413B42707K656N248R839n124J267J9308R770R768K4361J9145J6418K7030J5965
10400C98358K8882J9892N898m352K6703M1575j68P523J3501J9705J6592J3843
10388E87952K2499J7632O479J4677Q328J1022J3937J1405K482K1724N9184O8118
10376H45439M8508M1250P0305P2109O2700N5115O0705R5637J21322R8701R9479
10365A671270R6392R8157J31738J57953J61542J77514K22039K70694L20532L95849
10355C703680M34680M82049N53974O08039O34126O90378P81574Q86657J044690
10346I819847J259867J453879J636232J759323J775380J706955J640326J643125
10338B2694934J761768J985861K442652L296322M648699O763057J0136501J5681377
$$ y = [242707, 245363, 250611, 260450, 255326, 256593, 275901, 285671, 295439, 319800, 338945, 355363, 382393, 398358, 427240, 447132, 453030, 448678, 475381, 516956, 516788, 524311, 537812, 557517, 574109, 587952, 610451, 628083, 634562, 649239, 657567, 668589, 682526, 693931, 696413, 718137, 777321, 845439, 893947, 935197, 1005502, 1077611, 1140311, 1195426, 1256131, 1351768, 1473090, 1571791, 1671270, 1767662, 1865819, 1997557, 2155510, 2317052, 2494566, 2716605, 2987299, 3307831, 3703680, 4138360, 4620409, 5174383, 5782422, 6416548, 7106926, 7888500, 8775157, 9819847, 11079714, 12533593, 14169825, 15929148, 17704528, 19411483, 21051809, 22694934, 24456702, 26442563, 28885215, 32181537, 36830236, 43593293, 53729794, 69411171]
10330F9411171K5001900L9922768N9571274P4744871P1856685M9943156K4598219
10323D15050044K589786k3282684n5710001p4971749o8046069m8346900l1311778
10316A15970649k0506545j3861126r596760o878764n141660m036531l397068l153279
10308D9398916l138952l074893k909053k755649k629563k473370k254587k002925
10300B8159924j786496j581247j385677j179566j019090q82105p99664p56303
10292A8769776p23418o80879o52303o29764o22609o11604n96209n64162n24921
10283A3163907m95127m83027m48470m17240l90950l53828l43391l14760k91318
10274I625796k76678k80633k80155k92843k70510k54317k45173k52762k34123
$$ y = [69411171, 94413071, 134335839, 193907113, 268651984, 340508669, 390451825, 415050044, 417639830, 394357146, 338647145, 263675396, 195629327, 147282427, 115970649, 95464104, 81602978, 72006218, 65127454, 59985794, 55949263, 52552195, 49398916, 46259964, 43185071, 40276018, 37520369, 34890806, 32417436, 30162849, 28159924, 26373428, 24792181, 23406504, 22226938, 21207848, 20325743, 19526079, 18769776, 18046358, 17365479, 16713176, 16083412, 15460803, 14849199, 14252990, 13688828, 13163907, 12668780, 12185753, 11737283, 11320043, 10929093, 10575265, 10231874, 9917114, 9625796, 9349118, 9068485, 8788330, 8495487, 8224977, 7970660, 7725487, 7472725, 7238602]
10265G238602k36798k19907k11169k17970j92083j58341j56434j42245j42383
10256E561272j32805j33548j35836j11499j12442r5933r6780q5750r5739q0075
10246D480865p5104q8220q5316r4296q5010q9965r0047o9786m6739m2273p510
10235C706599o287k549J7284M7393P9546J04090R4865M4812k5079j02113j80062
10224C778499k41683k63409k18956j59050j36171j17675j15639r3441q0287p8617
10214B273571q2415n3811m0374m9332l7111k8071j6381k1325m5022m4259j5858
10203A839612k747k4231p744k0042l0190l8130l9573k8658k5288k1837n046k6008
10191A570118l2775k2114j8950k9158l7233l5181l3476j9448k3594l2313j5417
$$ y = [7238602, 7001804, 6781897, 6570728, 6352758, 6160675, 6002334, 5845900, 5703655, 5561272, 5428467, 5294919, 5159083, 5047584, 4935142, 4839209, 4742429, 4656679, 4560940, 4480865, 4405761, 4317541, 4232225, 4137929, 4052919, 3962954, 3872907, 3803121, 3756382, 3714109, 3706599, 3700312, 3697763, 3715047, 3762440, 3841986, 3946076, 4040941, 4085753, 4060674, 3958561, 3778499, 3536816, 3273407, 3054451, 2895401, 2759230, 2641555, 2525916, 2432475, 2352188, 2273571, 2191156, 2137345, 2096971, 2047639, 2010528, 1982457, 1966076, 1944751, 1899729, 1855470, 1839612, 1836865, 1812634, 1804890, 1784848, 1754658, 1716528, 1676955, 1648297, 1623009, 1601172, 1596126, 1570118, 1537343, 1515229, 1496279, 1467121, 1429888, 1394707, 1361231, 1341783, 1318189, 1285876, 1270459]
10180A270459k3925k3916j1871r169j0998l560r281K747O883J8261p419k6306
10168A171905j2772j3567j2206k7233j5430j4482k3394k6590p863R567l64j3906
10156A013665j6323k2647k4182k1508j2657j6458j8308k8965l9450l5320k8517
10145G49330j8143k5705l2818m1193k4585j4364o272K1635N0327M3013M5544J9948
10133G66717J5664o226k4661k3849l8291l6510j6449l024m141N332j7549j9960
10121E97053j147J2956l289j2834j8737q494k12j6624j0250n167k9462j6951j923
10108D84919N488o304o461l673J381m429p152k732k2105j4536j4411j4537r035
10095C86413j3185j6182q453n456n031l05J2010L596O121l099j0188r512O256
$$ y = [1270459, 1246534, 1222618, 1210747, 1201578, 1190580, 1187020, 1177739, 1180486, 1187369, 1205630, 1198211, 1171905, 1159133, 1145566, 1133360, 1106127, 1090697, 1076215, 1052821, 1026231, 1018368, 1027935, 1027571, 1013665, 997342, 974695, 950513, 929005, 916348, 899890, 881582, 852617, 813167, 777847, 749330, 731187, 705482, 672664, 631471, 606886, 592522, 586250, 607885, 658212, 701225, 746769, 766717, 782381, 776155, 751494, 727645, 689354, 652844, 636395, 633371, 629230, 634562, 617013, 597053, 595906, 608862, 605573, 592739, 574002, 565508, 565296, 548672, 538422, 533255, 503793, 486842, 484919, 490407, 484103, 477642, 473969, 475350, 470921, 463769, 461037, 438932, 424396, 409985, 395448, 386413, 373228, 357046, 348593, 343137, 338106, 337801, 349811, 353407, 359528, 356429, 346241, 336729, 342985]
10082C42985J3300J0278P343L851m11L458j1855j121K971J4298m600j106k654
10069C76737J3120q991J076P17J0159p364k989O795r419M579p024k126m74L099
10055C77895Q618L1328L2480M9691R1973J76296L16969L44799J64698N4539K4778
10044A674064K08k63237l97923k33565j29032q6995o4912l1618j8528l3889k5723
10033C88850k6699j9998r357r570P146J4466j8789o547J3321Q040k531j97Q449
10020C46584J5853J8313J1110J0934M559M550k7717M468n646p852j7397l6122
10008C21637l4014k6401j6183l387r298l794J5483Q451j3409M982K2332r062n579
9995B51758J5498r152k4494j2142K1743J3411q378k3330k1643P59J5830j1599
$$ y = [342985, 356285, 366563, 373906, 377757, 377346, 380804, 368949, 367828, 370799, 385097, 380497, 379391, 376737, 389857, 380866, 381942, 382659, 392818, 385454, 382465, 389260, 379841, 384420, 377396, 375270, 374796, 377895, 386513, 417841, 450321, 500012, 591985, 768281, 1085250, 1430049, 1594747, 1649286, 1674064, 1674272, 1411035, 1013112, 779547, 650515, 563520, 498608, 466990, 448462, 414573, 388850, 362151, 342153, 332796, 323226, 330372, 344838, 326049, 319502, 332823, 340863, 338332, 338135, 346584, 362437, 380750, 391860, 402794, 407353, 411903, 384186, 388654, 383008, 375156, 357759, 321637, 287623, 261222, 245039, 241652, 232354, 228560, 244043, 252494, 239085, 244067, 266399, 257337, 251758, 267256, 258104, 233610, 221468, 243211, 256622, 248244, 224914, 203271, 204030, 219860, 208261]
9983B08261j9499J712O996J2319J744l3854j6031k84P048J8362L822n001j1492
9970A74103j5043R68O417M045L828Q297O883j166o411J899M48j3500r3K490j0074
9955A63091j1602J2571P750Q257K446m318L632M338J0845j0444k1951r212K009
9942A57412O137j2797j4874K1716M956k0470n042J5780J4541j84L657J4081J0887
9929A95800J2744m556n558N827J5252R19K0071K3191o4Q91n964l543J6749J0583
9915B82342J519L3J7544J9065K1203K2618K9790M8760J00277J46788J92930K29690
9903A112559K52341K33264K23007J58749P0279k4976j24258k01209k29783k28426
9893A241547k08525j61744j18176r4288q0378m9800m8853n1154l1083l2700m3556
$$ y = [208261, 188762, 190474, 197470, 209789, 211533, 177679, 161648, 161364, 168412, 186774, 190596, 185595, 174103, 159060, 160028, 166445, 170490, 174318, 182615, 189498, 188332, 181921, 183820, 184268, 170768, 170675, 173165, 163091, 151489, 164060, 171810, 180067, 182513, 178195, 181827, 186165, 197010, 186566, 164615, 155403, 157412, 163549, 150752, 135878, 157594, 162550, 142080, 137038, 152818, 167359, 167175, 170832, 184913, 195800, 208544, 203988, 198430, 204257, 219509, 220428, 240499, 263690, 263626, 264517, 258553, 255010, 271759, 282342, 283861, 283894, 301438, 320503, 341706, 364324, 394114, 442874, 543151, 689939, 882869, 1112559, 1364900, 1598164, 1821171, 1979920, 2050199, 2025223, 1900965, 1699756, 1469973, 1241547, 1033022, 871278, 753102, 658814, 578436, 528636, 479783, 428629, 397546, 364846, 321290]
9882C21290j6575o272j801p335q621j4062k0427J29q562k132M67k872n426p110
9868B20691j3920j3149j8524o123k365k797K0886j2503r936j204J3776m108k6315
9855A44409K663P744m603M741P994Q967j1557k3936j690l813r608J04Q78n190
9841A17103L96J3289M238l828L84J275J1215o789j7727k911j1527P33Q740k264
9827A12327p510O710M207l604k619Q511K37r846o145j2721K79J0713O503O961
9813A14003o542j0732N96k816N079m150o452j151j847Q751K427R266j890k310
9799A02232j0757m052j0169j2555l248J0188N106J6313J5909L606N130m131k348
9786A11224P92o650R32m572j5566O863J1076j060j0016p48j2301n984N19M94K643
$$ y = [321290, 304715, 298443, 296642, 289307, 280686, 266624, 246197, 246326, 237764, 235632, 236099, 233227, 227801, 220691, 206771, 193622, 175098, 168975, 166610, 163813, 184699, 172196, 162260, 161056, 174832, 170724, 144409, 147072, 154816, 150213, 154954, 162948, 171915, 160358, 136422, 134732, 130919, 121311, 121415, 122293, 117103, 117499, 130788, 135026, 131198, 131582, 132857, 144072, 137283, 119556, 116645, 105118, 105851, 114591, 112327, 104817, 111527, 115734, 112130, 109511, 118022, 118259, 108413, 102268, 89547, 89826, 100539, 107042, 114003, 107461, 96729, 97325, 94509, 99588, 95438, 88986, 87835, 85988, 94739, 97166, 106432, 104542, 102232, 91475, 87423, 77254, 64699, 61451, 71639, 76745, 93058, 108967, 112573, 117703, 113572, 111224, 112016, 105366, 106298, 101726, 86160, 93023, 104099, 103039, 93023, 92275, 79974, 73990, 74509, 75003, 77646]
9771G7646N551m128L711J2359O661L740p9l331J0008Q717J8375l678j6095r798
9757A09659k216N090j75j4802k657N217J2463K05j4203p911N771j135q420K843
9743H9729Q468J6987o89k0132j2469L221M361k433N696J58j3779J9842P248R53
9729A07161R7j1692K856k999l703P60m287r998N648R456n64n806o152N357j2890
9714G3244q348P418M876o192p126J2749R072j552R018O832n219j5637k512N488
9700H2111l574K00R881J1904R89K801K180m727n779j77k6964j5211j189J0396
9686F2841Q112p894L214m992m238O871M656O21M309J3459M608J4680k951q545
9672I4751j2044L726l032j4149L342j1215j3751J281K1938R850j0444O476J9906
$$ y = [77646, 83197, 79069, 82780, 95139, 101800, 105540, 105461, 102130, 112138, 120855, 139230, 135552, 119457, 109659, 107443, 112533, 112358, 97556, 94899, 100116, 112579, 112784, 98581, 90670, 96441, 95306, 86886, 89729, 98197, 115184, 114495, 94363, 81894, 85115, 89476, 87043, 92739, 92897, 79118, 98960, 106208, 107161, 107258, 95566, 98422, 95423, 91720, 92480, 88193, 78195, 83843, 93299, 92735, 86929, 80777, 86134, 73244, 64896, 72314, 77190, 70998, 63872, 76621, 85693, 84141, 93159, 99991, 94772, 79135, 76623, 82111, 78537, 78737, 88618, 100522, 101511, 104312, 106492, 101765, 95986, 95809, 68845, 53634, 52445, 62841, 70953, 63059, 66273, 61281, 57043, 63914, 68570, 69191, 73500, 86959, 91567, 106247, 103296, 94751, 82707, 86433, 83401, 69252, 72594, 61379, 47628, 48909, 70847, 80697, 70253, 76729, 96635]
9659I6635N44k0763L755n277K43N549J447n191k949L891K039j1824k309J2581
9645G8371J1847N32k2404k79J2723j0021O931J408o882Q24P777p228m786o03o261
9630F1949n72K305p113K432J4250J3468p925j3778j462N922P03P498J2325q016
9616H1986o926n622k254M741J4414j3760o652K336P343K260j2007K839k244o904
9602E9550Q878n393J011J9611O172o891o998k760L210l414K962j7367m624P713
9588F1660J4251J3914r64n152j9506j5905j326q92J5581J3280J1966M260j6517
9575G4650j1449q601j1932j4287L153l551j796J4966J0856j4423K525M175J1356
9562E5642J7065J0926n486k693L151j0527k805k164j1579j0176P928L705j1063
$$ y = [96635, 97179, 76416, 80171, 74894, 75137, 80686, 82133, 76942, 73993, 77884, 79923, 68099, 65790, 78371, 90218, 90750, 68346, 68067, 80790, 70769, 77700, 79108, 72226, 73050, 80827, 73599, 68813, 68210, 61949, 61377, 63682, 56569, 59001, 73251, 86719, 78794, 65016, 63554, 69476, 70179, 77677, 90002, 81986, 75060, 69438, 67184, 71925, 86339, 72579, 65927, 68263, 75606, 77866, 65859, 68698, 66454, 59550, 68428, 63035, 64046, 83657, 89829, 82938, 75940, 73180, 76390, 72976, 75938, 58571, 53947, 61660, 75911, 89825, 88861, 83709, 64203, 48298, 46972, 46080, 61661, 74941, 86907, 91167, 74650, 63201, 54600, 42668, 28381, 31534, 27983, 26187, 41153, 52009, 37586, 40111, 44286, 55642, 72707, 83633, 78147, 75454, 78605, 68078, 65273, 63109, 51530, 41354, 49282, 52987, 41924]
9549D1924o093J0224J1739j4282k0101M065J1271J9874l99O136q543n51J4741
9536G0005k137O67j212m954o945P48n5j010j331P6k432N813n638K434M205j4655
9520D3579r755J0842N251n121J649M066M54l70K502r747j2491p133j223J8870
9506D1373O054m733O702K268k237j1780N572o981n550N409J4588L834j9796j6264
9492A8459K874J1856M077k047M382L073N024R045m978K695j401l639O153m855
9478E0718R891J2476R148Q073J0928j2523j8405L376m470p615R696K068m156j0467
9464E8738j3169J673k768k782O222O022p055o933O06K57K2562o217k909r59o934
9449D6354k953Q702j0286O127j75j0279P654J0065j6358m189M680J4920m670r606
$$ y = [41924, 35831, 46055, 57794, 43512, 23411, 27476, 38747, 58621, 58222, 64358, 55815, 55264, 70005, 67868, 68535, 67323, 62369, 55424, 56172, 56117, 55107, 53776, 53852, 51420, 57233, 51595, 54029, 58234, 43579, 33824, 44666, 49917, 44796, 46445, 50511, 50965, 50595, 53097, 43350, 30859, 23726, 22503, 41373, 47427, 42694, 49396, 51664, 49427, 37647, 43219, 36238, 30688, 36097, 50685, 54519, 34723, 18459, 21333, 33189, 37266, 35219, 39601, 42674, 47698, 56743, 51765, 54460, 53059, 49420, 55573, 50718, 60609, 73085, 82233, 90306, 101234, 88711, 70306, 73682, 69212, 61597, 71293, 73361, 69205, 58738, 45569, 47242, 44474, 41692, 47914, 53936, 46881, 39948, 40554, 40811, 63373, 57156, 54247, 53288, 46354, 43401, 52103, 41817, 47944, 47769, 37490, 45144, 55209, 38851, 34662, 39342, 54262, 49592, 39986]
9435C9986k39O486L252Q520Q145r34l174p150k1526j2258n440J3728J3136j350
9421D1182j2951l122n393J3844J930o547J4156J501m152P261k361o013n954J0265
9407D3646J0408j469n559j872l016n122j554O555O803k27r085n519P82m983m146
9392B5642p024r684p170M816J5663J0729J3749j2288p035q413n16K061N833J1387
9378C7750R867j243n630P651j1912J1511J2911J6735q632j3061n901O174k145
9365E4075N828r075p046J5609r769Q007J4448j976L119j3431k0711J653M592n789
9351C9534j284M27k83J848M180Q810m324J0750J0782r183j9010m826j996m856
9337C0569k57J7603J1073o695J041j3233k2330J1036J5267J4757k485j0663k568
$$ y = [39986, 39747, 46233, 49485, 58005, 66150, 65216, 62042, 54892, 33366, 21108, 15668, 29396, 42532, 41182, 28231, 25109, 19716, 33560, 35490, 28943, 43099, 44600, 40448, 47709, 45348, 39335, 33381, 43646, 54054, 52585, 47026, 45154, 42138, 37016, 35462, 42017, 48820, 48593, 39508, 33989, 34771, 29788, 25642, 18618, 8934, 1764, 6580, 22243, 32972, 46721, 34433, 27398, 18985, 18469, 20530, 26363, 37750, 47617, 46374, 40744, 48395, 36483, 47994, 60905, 77640, 69008, 55947, 50046, 56220, 54075, 59903, 50828, 43782, 59391, 49622, 57629, 72077, 70101, 73220, 59789, 39078, 40731, 45323, 39534, 38250, 38677, 38394, 40242, 44422, 53232, 48908, 59658, 70440, 61257, 42247, 37421, 35425, 30569, 30312, 47915, 58988, 52293, 53334, 40101, 17771, 28807, 44074, 58831, 56346, 45683, 43115]
9324D3115j513l075l58j9396m347J9980J2143J0163j367R18j4151R42P911j5545
9310C5420k615j0918J5052j155l656M7J766j0927n365L782J0814J4427M269l300
9296D7641k186o239N136O098L607r39m866r891k839Q452J050j0482j0249L005
9282B7298J9327M458M179P363m806K409q145r515n86J0941J3202j7500j9908j689
9268B7028J3297J791p232J2276n075J270R975p926k045O58l777o06K616j0168
9254C2082p7M707n044J5301J2940j4197k511O087j256O953p270o646N527k120
9240D4476o391j163j123J3353M591j4330k841j9189l334J3523K628l687L468J2437
9226D2418O290p388J133n038j3747j0714O512k851O860m948Q247R891q714M259
$$ y = [43115, 41602, 38527, 38169, 18773, 14426, 34406, 46549, 56712, 55345, 56263, 42112, 43054, 50965, 35420, 32805, 21887, 36939, 35784, 32128, 32175, 33941, 23014, 17649, 21431, 32245, 46672, 50941, 47641, 45455, 39216, 44352, 50450, 54057, 53118, 48252, 38361, 35522, 43974, 45024, 34542, 24293, 27298, 46625, 51083, 55262, 62625, 57819, 60228, 52083, 42568, 41982, 52923, 66125, 48625, 28717, 27028, 40325, 42116, 34884, 47160, 42085, 43355, 53330, 45404, 43359, 44017, 40240, 39634, 42250, 32082, 32005, 36712, 31668, 46969, 59909, 45712, 43201, 49288, 48032, 54985, 47715, 41069, 46596, 44476, 38085, 36922, 35799, 49152, 53743, 39413, 36572, 17383, 14049, 27572, 30200, 26513, 29981, 42418, 48708, 41320, 42453, 37415, 23668, 12954, 19466, 16615, 23475, 18527, 26774, 36665, 27951, 32210]
9212C2210j233m681M159N763M427q14L659r225p605J179P904K837N611m370j0897
9197B8924Q101k291j0657o925J473Q61P29M300M545m397j1046p023J0332j006
9183A5920K015J2315J7483O468k738p685O424J0123o926j1608j924j427K333N965
9169D6738L648r330k369J830N693L531N03M872R806m740m493j6353k176J9981
9155E7141k107j5312j1936N915Q608m621Jo456Q78o062M461K917k928p94k480
9140B7225L840L652m585Q978M900M082O085j913k86j1225k3183o170J238J7634
9126C0272R60k358o556l85N979J3576n299r642m924L836L193L345M841p262l583
9111B5993K441J9546J04m029K529m102K141j1607l228o117L640L695N173p443
$$ y = [32210, 30977, 26296, 30455, 36218, 40645, 39831, 43490, 34265, 26660, 27839, 35743, 38580, 44191, 39821, 28924, 37025, 34734, 24077, 17152, 18625, 19486, 20215, 24515, 29060, 24663, 13617, 6594, 16926, 15920, 17935, 30250, 47733, 54201, 51463, 43778, 50202, 60325, 53399, 41791, 39867, 38440, 40773, 46738, 50386, 41056, 38687, 40517, 46210, 49741, 50244, 55116, 64922, 60182, 55689, 39336, 37160, 57141, 55034, 39722, 27786, 33701, 42309, 37688, 37689, 31233, 32111, 26049, 30510, 33427, 30499, 29705, 27225, 31065, 34717, 30132, 39110, 44010, 48092, 54177, 52264, 51978, 40753, 17570, 11400, 12638, 30272, 31232, 28874, 22318, 21933, 27912, 41488, 36189, 26547, 21623, 25459, 28652, 31997, 36838, 29576, 25993, 28434, 47980, 48084, 44055, 46584, 42482, 44623, 33016, 29788, 23671, 27311, 31006, 36179, 28736]
9097B8736l038J794q734K774J5170l461m088r228n736j540J997R909O357Q050
9083C8962J651m983J3818q734q607q407K762j414K245m300m217j304k133n323
9069A0016J7229J1397N012J554R464k254o82o133j4686m261K974l086J3209J0437
9055E0190j1296j2439J038j52J2682M160p721j3738K776L48n367j5q825L369j815
9040A3195o107O890J1902p715P927L395M057m778j552p567O352J7077k13o89r418
9025C2756n950r382m692J4280L674Q989L653L593j8165q269P975R104K361o078
9011C3849q274L564k903j9645k773J9632M617n796n217P701O57k651J2547J6287
8997E1595k273p829r675m275j2148p083J616l767J6247J2163n487j8309m887J525
$$ y = [28736, 25698, 27492, 18758, 21532, 36702, 33241, 29153, 19925, 14189, 12649, 14646, 24555, 30912, 38962, 40613, 35630, 49448, 40714, 32107, 23700, 26462, 25048, 27293, 22993, 18776, 17472, 15339, 10016, 27245, 38642, 43654, 45208, 54672, 52418, 51736, 45603, 30917, 26656, 29630, 26544, 39753, 50190, 38894, 26455, 27493, 27341, 40023, 44183, 36462, 22724, 25500, 25848, 20481, 20466, 11641, 15010, 13195, 7088, 13978, 25880, 18165, 26092, 29487, 33544, 28766, 27214, 19647, 25999, 43076, 42863, 42174, 32756, 26806, 17424, 12732, 27012, 30686, 39675, 43328, 46921, 28756, 20487, 28462, 37566, 39927, 33849, 25575, 29139, 26236, 6591, 3818, 23450, 28067, 22271, 17054, 24755, 25412, 22761, 35308, 51595, 49322, 41493, 31818, 27543, 15395, 8312, 9928, 6161, 22408, 34571, 29084, 10775, 5888, 7413]
8983G413j19j826J0663l043N123J2063P255N669P027M215p249p820p225J34j6034
8968A6246j1015J2991J8867J0656L267j2364k6249j6675N486K2938J9998o767
8956C7379p620j790m404n639l924L753L699O860j556m197R544M591N298k650K053
8941D1397j28m148q200j310l236j3885J1677L493k233L644J0641r901p294j476
8927A9041j514P655J4390j1171j0703n083q2M115R864J6301n514R563R892K005
8913E8759j5851r464k521q82j2294L310J0700r037m079K149p319m011J8378n104
8899B2734o485N936r8j7757q894P358N917m105l132n941J0215K4443J2179j859
8885D0511K179M481p90n357j1461m042R868R220O808l541J3316N676j2559p106
$$ y = [7413, 7294, 5468, 16131, 13088, 18211, 30274, 37529, 43198, 50225, 54440, 47191, 39371, 32146, 32280, 16246, 5231, 18222, 37089, 47745, 51012, 38648, 12399, -4276, 1210, 24148, 44146, 37379, 29759, 27969, 23565, 17926, 14002, 17755, 21454, 28314, 26758, 22561, 32105, 36696, 41994, 39344, 41397, 41269, 37121, 28921, 27611, 24375, 10490, 22167, 25660, 23427, 27071, 37712, 27811, 20517, 19041, 17527, 25182, 39572, 28401, 17698, 12615, 12533, 16648, 26512, 42813, 37299, 46862, 56754, 58759, 42908, 33444, 30923, 30041, 17747, 21057, 31757, 22720, 18641, 20790, 13471, 9460, 27838, 22734, 16249, 22185, 22087, 4330, -4564, 2794, 8711, 4606, 1474, -4467, 5748, 30191, 42370, 40511, 42690, 47171, 46381, 41024, 29563, 25521, 35389, 44609, 51417, 47876, 61192, 66868, 54309, 47203]
8871D7203J50p772k957M432k741q308l761k433p430O344L375j488j750K058m870
8856B0052J0004J3293J2849p929r355j6569P438L498j1707P525N654o452K324
8843C0625Q117J9680J568l337j3530j2741J662O473R551q727L468M723O37L770
8829E1939k643l3659j2773k927P726J0478K0934m00o355n20j2032j2122l153P36
8815E229J1639J6801N534J310J271p669O582j394j5218p733J3722Q993r062l492
8801B6513k425n636O091j874r069j0593R002J259l76P288N58j7295R799r18N87
8786A2911Q572N881r632P809m278O528Q531r565n573J9749K711m334o771j848
8772C0691l643j2357j1106N872J1758R321k15M964m166K678N226j7047J834R141
$$ y = [47203, 47353, 39581, 36624, 41056, 38315, 30007, 26246, 23813, 16383, 22727, 26102, 24614, 22864, 24922, 20052, 30056, 43349, 56198, 48269, 38914, 22345, 29783, 33281, 21574, 29099, 34753, 28301, 30625, 38742, 58422, 59990, 56653, 43123, 30382, 32044, 38517, 48068, 39341, 42809, 47532, 48169, 51939, 49296, 15637, 2864, -63, 7663, 18141, 39075, 38675, 32320, 31800, 19768, 7646, 4493, 5229, 16868, 33669, 39203, 40513, 41784, 34115, 40697, 39303, 24085, 16352, 30074, 39067, 30005, 26513, 24088, 18452, 24543, 22669, 13600, 3007, 12009, 13268, 12892, 20180, 20738, 3443, 13242, 12324, 12911, 21483, 27364, 17732, 25541, 21263, 27791, 36322, 26757, 21184, 40933, 43644, 39310, 32539, 30691, 27048, 14691, 3585, 9457, 21215, 30536, 30321, 35285, 31119, 33797, 39023, 21976, 23810, 32951]
8758C2951K991m662j4148J5357K6872r840k2230m644M944p870p369J164P767P559
8744B8842L062J687L208j5721l160K0036J7794p15n151j5308l958K289m839n765
8730B2301K572J0905k057j5859R426J2408M328l339o620L811j3832k70J2227L535
8716C9536N91K250J993P06o487O24N629J6285o879j7711j2195j3677J0314J7292
8702C8271J4586j564j1684j6220l355J3544J1692K105J10J2734l826N552o179
8689E5766j2287J622R288J897R801n180r427j0420n285J8175R481j2110j0916
8676D0405K0342m979l629k64L195P667j9436j5947J873Q023K48o094R163P652
8662D8219K0804K0678j1516j4082M195K3004K5941J2808R945o163j1816q597j1456
$$ y = [32951, 35942, 31280, 17132, 32489, 59361, 49521, 27291, 22647, 27591, 19721, 12352, 13516, 21283, 28842, 31904, 33591, 36799, 21078, 17918, 37954, 55748, 55033, 49882, 34574, 30616, 32905, 28066, 22301, 24873, 35778, 33721, 17862, 27288, 39696, 44024, 40685, 34065, 37876, 24044, 23774, 36001, 39536, 40127, 42377, 44370, 45076, 38589, 39213, 44842, 61127, 54248, 36537, 24342, 10665, 20979, 38271, 52857, 51293, 39609, 23389, 20034, 33578, 45270, 47375, 47485, 60219, 56393, 61945, 55766, 43479, 45101, 54389, 56286, 66087, 60907, 51480, 41060, 35775, 53950, 63431, 51321, 40405, 60747, 55768, 52139, 51875, 55070, 62737, 43301, 27354, 29227, 37250, 37498, 31404, 40567, 48219, 69023, 89701, 78185, 64103, 68298, 91302, 117243, 130051, 139996, 133833, 122017, 113420, 101964]
8649A01964j1173j0890j898J6391p161j9199K384M687p453k224j5387M468j07
8636E4402M015Q764L76J472N834Q803j422N920K28J89Q151j3219k802M368r08
8621H4171O628m202K397l760J281Q464J9848k406p088K983m805j2794j8775K693
8607G4635r102J6785J4801O422Q296j5439r90N344K318m720k4o357j5402p663
8593F8904j7934j7368M326J6170N937R60m083p070j3640n347J5503Q295j3771
8580D0882N610O142M071Q391L360j867j0204p780L564N421n900j9378j8447r743
8566D122J2889j802j584j2929J0528J7340R202r766k259J2680K1488q398j7021
8553C4490j0J2074M627j904k074j7417L58J4539m735j3439J5924R76k500J0172
$$ y = [101964, 90791, 79901, 78003, 94394, 87233, 68034, 70418, 75105, 67652, 65428, 50041, 54509, 54402, 58417, 67181, 67557, 69029, 74863, 83666, 82244, 88164, 88392, 88581, 96732, 83513, 80711, 85079, 84171, 90799, 86597, 88994, 85234, 86515, 94979, 114827, 112421, 105333, 108316, 103511, 90717, 71942, 74635, 65533, 82318, 97119, 103541, 111837, 96398, 95408, 100752, 103070, 98350, 98326, 91969, 76567, 68904, 50970, 33602, 37928, 54098, 60035, 60995, 56912, 49842, 36202, 30855, 46358, 54653, 40882, 46492, 52634, 56705, 65096, 68456, 66589, 56385, 48605, 52169, 57590, 51690, 32312, 13865, 4122, 17011, 15209, 13625, 696, 11224, 28564, 37766, 28000, 25741, 38421, 59909, 51511, 34490, 34480, 46554, 51181, 49277, 47203, 29786, 30144, 44683, 39948, 26509, 42433, 43409, 40909, 51081]
8539E1081k029J698R412j6l822j7599j1576m881J7213M24n718q411p931j903J6139
8524C2081k073J3545P703J648j1678j5349p657o007r649R170J4117L440R444J0087
8510D8822q331p489p650K1057j3836n598R017j453l364n068k060j236j912J3819
8496C4718P68J115L128j175j6905j157l217P796K686J3969Q968k1559o85J0067
8482C8517J620J263j5478j5670Q028K0555M69J3785m113j782k241o440p803K037
8468C2747R86r511m790N191N292j2773R668n522r509j178J0169j055k450k959
8454A4306J374Q555R758k649O118j794k783p555l096K095O784P129j7165l423
8440A7654l69O794J1429N921j910M146p424p578k770L482N420J2019r909j4543
$$ y = [51081, 49052, 50750, 60162, 60146, 56324, 38725, 27149, 22268, 39481, 39905, 34187, 25776, 17845, 15942, 32081, 30008, 43553, 51256, 52904, 41226, 25877, 18220, 12213, 2564, 11734, 25851, 29291, 38735, 48822, 40491, 33002, 25352, 46409, 32573, 26975, 35992, 34539, 31175, 26107, 24047, 22811, 20899, 34718, 35486, 36601, 39729, 38554, 21649, 20492, 17275, 25071, 27757, 41726, 50694, 29135, 28450, 38517, 40137, 41400, 25922, 10252, 18280, 38835, 39304, 53089, 48976, 47194, 44953, 38513, 30710, 32747, 33733, 24222, 19432, 24623, 29915, 17142, 26810, 21288, 11779, 10601, 20770, 19715, 17265, 14306, 15680, 24235, 33993, 31344, 37462, 35668, 32885, 25330, 22234, 24329, 31113, 38242, 21077, 17654, 17285, 24079, 35508, 41429, 39519, 43665, 36241, 28663, 25893, 29375, 34795, 46814, 36905, 22362]
8426B2362m153j5101J350R384J3611P330n219o47j3068m663j1695q19J0329J0564
8412A9565l114l790j561J9423R363n934j5708j1084J2638K2463n839m967O753
8399C8208m43k018Q055l597o45l280j2144n275P394Q763j562K20L971n417n098
8384B7132M605o182r682R917J7212J731j1945j3746q156O92J0478m54Q07J0674
8370C3083K106r104m964q555k197K005o752O140J4042J4860N591r342j1074k65
8356B5574k142j4153J3250O226j4002J336o000j76P219J1915k484m139J8637M002
8342D5063m350L052K439q713K133K736j0217l149Q263j909j2214k175o682j7534
8328c257R342K4191J0241j1904J0349k677k1439j2688J544J2558O376m773J656
$$ y = [22362, 18209, 3108, 4458, 13842, 27453, 34783, 29564, 28917, 15849, 11186, -509, -1328, 9001, 19565, 16451, 12661, 11100, 30523, 39886, 33952, 18244, 7160, 19798, 42261, 36422, 31455, 38208, 37765, 35747, 43802, 40205, 39560, 36280, 24136, 18861, 26255, 35018, 33456, 33676, 37647, 32230, 27132, 31737, 25555, 15873, 25790, 43002, 44733, 32788, 19042, 10886, 11578, 22056, 21602, 22409, 33083, 35189, 26085, 21121, 12566, 10369, 12374, 5622, 11762, 25804, 40664, 46255, 36913, 25839, 25574, 23432, 9279, 22529, 28755, 14753, 16089, 10089, 9913, 17132, 29047, 26563, 22424, 41061, 45063, 40713, 43765, 46204, 37491, 39624, 42360, 32143, 28994, 37257, 35348, 23134, 20959, 14277, -3257, 6085, 30276, 40517, 28613, 38962, 36285, 14846, 2158, 3702, 16260, 22636, 17863, 19519]
8315A9519k052n566M964k482j84R891k10o830P74J269R479J564p985J2188j297
8300C3042J496L684l469p233J1276J1357r885j3370j940Q18M389M878o144j7840
8286A1059j6765J1908J542k288J3140o267o55R491L790j5165K387M455j3927J633
8272D338l435q779K5988J5925k034M918Q183k3815j1836O147M083J773L37M597
8258B6390L976k067j211j0290j2854Q63J3118O690p273m257q36k014p183n970
8244b918P621M451r321j565L904J3873l467j0444o267J3645J5098K966J791k863
8230B6504J0194L76K966J0326j2779q453k087n044k722L673J982p610m570K173
8216A4929P60k617j8969o954J2868R169J6448q782j0297n341J2243J759P48l656
$$ y = [19519, 17467, 11901, 16865, 14383, 14199, 24090, 23880, 17050, 17824, 19093, 28572, 30136, 22151, 34339, 33042, 34538, 38222, 34753, 27520, 38796, 50153, 40268, 26898, 24958, 25776, 30165, 35043, 28899, 11059, -5706, 6202, 7744, 5456, 18596, 12329, 11674, 21165, 24955, 9790, 12177, 16632, 2705, 4338, 903, -7876, 18112, 34037, 32003, 36921, 45104, 21289, 9453, 15600, 19683, 21456, 21793, 26390, 30366, 28299, 27088, 16798, 3944, 4807, 17925, 24615, 17342, 13085, 12249, 10235, 3052, -2918, 4703, 9154, -167, -1732, 2172, 16045, 12578, 2134, -4133, 9512, 24610, 27576, 29367, 26504, 36698, 37074, 40040, 50366, 37587, 29134, 27047, 22003, 19281, 22954, 24936, 17326, 12756, 14929, 15689, 13072, -5897, -12851, 17, 9186, 25634, 16852, 6555, 1214, 13457, 15216, 15964, 12308]
8202A2308j1748m614k084O870M139N835J5340m685k0486j2790J1702J7044M251
8189B1082L680Q404o020n271K608N303n38J2004j9797j1525L745n168n50J4216
8175B2173k285l675k0529j0614L894m90J9258M745q17J4113L295P074R916m844
8161D1214r544n738o846K803J2356L32j9900l727j107r62J4494R849j0821J2983
8147C5386q080k508j1670n609O608j1718j9861K1295K5260J847o278K480r981
8134A7171j5873p634o43L845J5369K0764j1601o284o042j2364l046j42J2003k569
8120B954M359K595J3835r067k292J9866j766J212J0006J2545j7799k1796k6193
8107a1541N927L997N421k373r252L119O337k824p26N472K360J8128m847j9448
$$ y = [12308, 560, -4054, -6138, 732, 4871, 10706, 26046, 21361, 875, -11915, -213, 16831, 21082, 24762, 33166, 27146, 21875, 24483, 29786, 29248, 41252, 21455, 9930, 13675, 8507, 7957, 22173, 19888, 16213, -4316, -14930, -11036, -11526, 7732, 12477, 11660, 25773, 29068, 36142, 46058, 41214, 31670, 25932, 19086, 21889, 34245, 34577, 14677, 10950, 9843, 8881, 23375, 33224, 22403, 35386, 27306, 24798, 13128, 7519, 14127, 2409, -17452, 3843, 29103, 30950, 24672, 27152, 17171, 1298, -6336, -6979, -3134, 12235, 32999, 21398, 15114, 9072, -3292, -6338, -6480, 5523, 2954, 7313, 9908, 23743, 14676, 12384, 32250, 30484, 31696, 41702, 54247, 36448, 14652, -11541, -5614, -1617, 3804, 1431, -7821, -4702, 1635, -1189, -1915, 3557, 5917, 24045, 19198, -250]
8093b50j9441K451J4885Q819m400j624Q829Q733K020j4344j5714O92O304J0894
8079G854n789m729k748m984m626m422K2846J8050j164M558m356r046j3617n044
8065g217J4868k291j2754O221J6668Q907k170R35n611N545R695j472m52m739J1810
8050C7943q767k1225R243K4071Q340o443j006q768j190J4058O529o703k4415k0135
8036A532Q205O028P520l693Q457M473o052k093J388J6654k643N035M857j0060
8022C9608m792l592m791j90K6249J4542m895M496J1917Q093q999n094m820n210
8008F2522Q20L459r61j294l072J4676J5065J4296r629q813j6971r084O42j8615
7994D3041k0612K782j719p902l16R148k846L313k694J0274J5503P257J226r313
$$ y = [-250, -19691, -17240, -2355, 6464, 2064, 440, 9269, 18002, 20022, 5678, -10036, -9344, -3040, 7854, 2065, -2664, -5412, -10396, -15022, -19444, 3402, 21452, 20288, 24846, 20490, 11444, -2173, -7217, 7651, 5360, -7394, -1173, 15495, 24402, 22232, 23167, 17556, 23101, 32796, 31324, 30872, 26133, 37943, 29176, 7951, 17194, 41265, 49605, 43162, 42156, 33388, 32198, 46256, 52785, 46082, 21667, 1532, 9737, 15765, 23285, 19592, 28049, 32522, 26470, 24377, 25765, 42419, 39776, 44811, 49668, 39608, 34816, 31224, 26433, 26243, 52492, 67034, 62139, 66635, 78552, 86645, 77646, 72552, 67732, 62522, 63342, 66801, 65840, 64546, 61474, 76150, 91215, 105511, 95882, 87069, 70098, 61014, 61656, 43041, 22429, 25211, 23492, 15590, 15274, 24422, 21576, 24889, 22195, 32469, 47972, 55229, 56455, 47142]
7980D7142m432o132k0278L983J5049K492Q103k088J3359M268j305m046j2467j3187
7966C0461k621K479L79N825l799P237Q559p161L20R969l980r566M782j6500j4158
7951A2226R03m544k15M813l109R660N020M902J5427o717o610Q91k586j5165j158
7936A3738N177J817q118J1823P721j830P951R390o823j7570q237l619Q657K0972
7922D1049Q325l465j0655O093j906j0143l270l026J7868K960r700O874j528o395
7908C3081q686k9591r314L459J7957J0638J2533m193j0550K018L629j457M155
7895B3679J3170j0264l281M820o444n608Q73L609q157p99l895j1785N856M444
7881F218m298O62Q587J59K3J4039P860K384j6617j1962l27J4493K841q246m894
$$ y = [47142, 42710, 36578, 16300, 20283, 35332, 37824, 45927, 43839, 57198, 61466, 60161, 56115, 43648, 30461, 27840, 30319, 30698, 36523, 32724, 39961, 48520, 41359, 41679, 51648, 47668, 38102, 42884, 26384, 12226, 13129, 8585, 8370, 13183, 10074, 19734, 24754, 29656, 45083, 38366, 31756, 32647, 30061, 14896, 13738, 18915, 20732, 12614, 24437, 32158, 30328, 38279, 47669, 40846, 23276, 15039, 11420, 20077, 41049, 49374, 45909, 35254, 41347, 39441, 29298, 26028, 23002, 40870, 43830, 34130, 41004, 39476, 33081, 24395, -5196, -14510, -11051, 6906, 17544, 30077, 25884, 15334, 17352, 20981, 19524, 23679, 36849, 26585, 23304, 28124, 21680, 16072, 16945, 20554, 12397, 11598, 7703, -4082, 1774, 6218, 1920, 2582, 11169, 11328, 11351, 25390, 33250, 35634, 19017, 7055, 6728, 21221, 24062, 15816, 10922]
7866A0922q11o257J026K1057K433j1062o455K774P418j289k734M078K874r666
7852A4308j627o344l897P28m500N16q652q486O898M561j363J654M669N046q67
7837B644m76j569J5166K2326l707j5728j3862r464K787j2989J631M665O742k420
7823d254j205k804L764n914O199J7338J4253J153N04j611q919p822q302l450M704
7808C634L160N004j646q330J1843j76j0974O51l670j0142J672j1015J8672K4462
7794B3145K934j2540P631O524M925q734n668q04q965j3190j385J7083M791j3932
7780A815o358J2817j988M171N287p752j5961j1926P756m97k795k873M336J9304
7766E336Q239j1125O955p256P431Q079j6N653O143k6686j0313Q538K896L210L632
$$ y = [10922, 10111, 3854, 4880, 25937, 28370, 17308, 10853, 13627, 21045, 19756, 17022, 21100, 23974, 14308, 12681, 6337, 2440, 3168, -1332, -816, -9468, -17954, -11056, -6495, -7858, -6204, -1535, 3511, 2644, 2168, 599, 15765, 38091, 34384, 18656, 4794, -4670, -1883, -14872, -13241, -8576, -1834, -4254, -5459, -8263, -4499, -10413, -4214, 13124, 27377, 28530, 29034, 27423, 18504, 10682, 2380, -1070, 3634, 6794, 11798, 10152, 1822, 13665, 13489, 2515, 3166, -504, -10646, -8974, -19989, -1317, 23145, 26079, 13539, 21170, 27694, 32619, 23885, 18217, 17413, 8448, -4742, -6127, 10956, 15747, 1815, -4543, 8274, 6286, 10457, 15744, 7992, -7969, -19895, -12139, -12636, -15431, -18304, -13968, 5336, 13575, 2450, 9405, 2149, 9580, 17659, 17643, 23296, 29439, 2753, -7560, 978, 3874, 7084, 10716]
7751A0716R031k72k275l095m31R42l875K312l505M89O536O703l483J635j0089
7736A1339M095M90q130j342Q319N392r901n914J4477j095J707j0284L435m494
7722H094M648j0858j2161M886L900j141j6400m3j997J0022R319P622J4463M320
7708B4674J0261r297j9124j0735P039Q878O818k798j5622J1475J2193j6494k117
7695E151P534J842j027n283p984O753P691J1561K638N788j4062n634j5499n558
7681f089N308l12k105n55k589j206j0510R01J828N59Q794j039p627M502j929j0119
7665b2188K752J8703O595j3808q16J0295p120k138R497Q518l932j3945m10J991
7651f006p611P566J1270m45J0371n379j5356o774K865P594J0742N12O244j5952
$$ y = [10716, 19747, 19475, 17200, 14105, 13674, 14616, 10741, 13053, 9548, 10037, 16573, 23276, 19793, 21428, 11339, 15434, 15924, 7794, 6452, 14771, 20163, 10262, 4348, 18825, 17730, 19437, 9153, 12588, 8094, 12742, 1884, -10277, -5391, -1491, -2632, -19032, -19075, -21072, -11050, -1731, 5891, 20354, 24674, 34935, 25638, 6514, -4221, 2818, 11696, 18514, 15716, 94, 11569, 23762, 7268, 5151, 12685, 14527, 13500, 8217, 233, 6986, 14677, 26238, 28876, 34664, 20602, 14968, -531, -6089, -781, -1093, -3198, -3753, -6342, -7548, -18058, -17157, -15329, -14770, -5976, -7015, -14642, -10140, -12069, -22188, -19436, -733, 5862, -7946, -8762, 1533, -5587, -7725, 1772, 10290, 6358, -7587, -7997, -6006, -13617, -6051, 5219, 4774, 15145, 9766, -5590, -12364, -9499, -1905, 8837, 9349, 15593, -359]
7637c59j2138K039N363j2414j230J7155k023n060K261j312M634O520q19j484N99
7622A732l702N577o808k59J0372l63l898k121P550k10p532n219R121r371n547
7607a0678J0168K2143j3859o857q055p067o284R179N939n545r105J3146Q031n035
7593c879k548N112n489o388j0685R723J2597n37M483O324J1381M040P741k474
7579B9401m273j3329o891n069J357p917j1293M529J6192K594r806l017l451L403
7565g570O400o946l971n395l900N704O212J2528J057j0144n462j522J4625J5292
7551A6908J0289p358k271L82o44j737q306n173R120P855k2507j4046l238J1316
7537i410J884J0366N712j340N736P828O375k884P89L269j0940k3189j1002Q849
$$ y = [-359, -12497, -10458, -5095, -17509, -18739, -1584, -3607, -8667, -6406, -7718, -3084, 3436, 2617, 1133, 1732, -1970, 3607, -3201, -3460, 6912, 6549, 2651, 530, 8080, 7870, 338, -4881, 4240, -5131, -10678, -510, 21633, 7774, 917, -7138, -14205, -20489, -11310, -5371, -10916, -20021, -6875, 1156, -3879, -6427, -1315, -6804, -13192, -23877, -14154, -1557, -2094, 2389, 8713, 20094, 24134, 31875, 29401, 25128, 11799, 4908, -161, 1196, -6721, -18014, -13485, 2707, 5301, -4505, -7522, -10973, -7570, -1170, -8116, -12087, -17482, -21382, -15678, -9466, 3062, 4119, -6025, -11487, -13009, 1616, 16908, 27197, 19839, 17568, 17950, 17306, 15569, 7263, 2090, 11210, 19065, -3442, -17488, -20726, -9410, -7526, 2840, 8552, 7212, 12948, 20776, 27151, 24267, 25056, 28325, 17385, -5804, -16806, -7957]
7523g957j126J824Q302l400R86N532J3794j195n542p771Q542O994M679K502j1065
7508A5099j8969R22N149J1193J606j9094l653l952n392J516L804o496m853j2003
7494c5123l549K1658J0863O877M088J0462J6207K89j0533k27k698o066j0458J923
7480C713R193J624l150J870k770N054o538o464k932l913R658l59J257R164k269
7465A3138j2631K900q72m605L56K981j144J2340N176l187k4757q319j0689O140
7451b3173J1516N184J2176k660p239J128q535m274J1726J1313J4433k016j7071
7438B508k3891q266J6058M039N156J3258n438j1964L162n957j570K542J096L157
7424f110o623N381J0368l341k370N276j303L400j034K249L083j939r270n722l92
$$ y = [-7957, -9083, -7259, 1043, -2357, -1371, 4161, 17955, 16760, 11218, 3447, 11989, 18983, 23662, 26164, 15099, -3870, -2948, 2201, 13394, 15000, -4094, -7747, -11699, -17091, -15575, -11771, -18267, -23120, -35123, -38672, -17014, -6151, 726, 4814, 15276, 31483, 31772, 21239, 21012, 18314, 12248, 1790, 3713, 12906, 14530, 11380, 13250, 10480, 15534, 8996, 2532, -400, -4313, 5345, 4986, 6243, 15407, 13138, 507, 3407, 2535, -2070, -1714, 1267, 123, 12463, 17639, 14452, -10305, -18624, -29313, -23173, -11657, -6473, 5703, 3043, -4196, -3068, -11603, -15877, -4151, 7162, 21595, 19579, 2508, -21383, -29649, -13591, -9552, -4396, 8862, 3424, -8540, -5378, -11335, -12905, -10363, -9267, -6110, -12733, -7352, 3016, -325, -2695, 2581, 1278, 4678, 3644, 5893, 8976, 7037, -2233, -7955, -8347]
7409h347m120k460K2804J3523P793j2965j5145J96J1941r077k891J1175j0206
7396B221l259M585r199o751R974K057j92K764j120n061o570L954j788J3073J0282
7381A4970J2650O15j3403k1386l544J171n853m258J6084P420N449L158L222o753
7367I542r993k061n279q437l625l900J1078N735K151O766N622Q194M294Q525M455
7352C3067N82j7309j7953Q281j377j967r734n231M687M337Q03j911p790m662J3920
7337b257J5708N454p752L293j539k741k108j17n2N86l013J1605M008k6200o617
7322a1742K048J2738k461N199n939p39J8118p580j0929r01J0656p192M346M923
7308A0545N551N783K601P240Q355q045p9k107Q011R194j5432q158j4227j0156
$$ y = [-8347, -12467, -14927, 7877, 21400, 29193, 16228, 1083, 1279, 13220, 4143, 1252, 12427, 2221, -1038, 3547, -5652, -12403, -2429, -372, -564, 2200, 1080, -3981, -10551, -6597, -8385, 4688, 14970, 27620, 28235, 14832, -6554, -10098, -8927, -14780, -19038, -2954, 4466, 9915, 13073, 16295, 9542, -451, -2512, -7791, -16228, -19853, -23753, -12675, -6940, -4789, 1977, 7599, 15793, 20087, 28612, 33067, 33649, 16340, -1613, 6668, 5291, 3324, -6410, -11641, -6954, -2617, -1814, -3725, -11515, -16177, -2257, 13451, 18905, 11153, 14446, 12907, 10166, 8058, 7941, 7889, 8475, 5462, 17067, 21075, -5125, -11742, -9694, 3044, 583, 5782, -157, -896, 17222, 9642, -1287, -2188, 8468, 1276, 5622, 10545, 16096, 21879, 24480, 31720, 40075, 32030, 31951, 29844, 37855, 47049, 31617, 23459, 9232, -924]
7294i24l216Q681J3902l626j2611J094R69q23Q082Q448P696N824r001j5009j1134
7279a648j0361P245j225j0307M747R473m008k835n436M636o92J2966K1674o386
7265A7843o858J3285O712j9645j0206r863M304j973M500J3323M525r771r671o959
7251a0454J3766N715j7711j0988O468P284r61K868m819l100N68J2856K820o213
7237a901M465R242J278q259j5704m330J4577K878j0359l265O574J8210o804j1023
7223d421K290j949k586J0573r095Q3Q916j4189o170m20M283q3J9968J0876q065
7208A0011j7045j1696J896j3091o276R279N580k052J8842R250m191p603j4485
7195b1581L605Q554j495J312J1971K441r292l129J1740N267l477P592K5835K866
$$ y = [-924, -4140, 4541, 18443, 14817, 2206, 3300, 4269, 3446, 11528, 19976, 27672, 33496, 24495, 9486, -1648, -12009, -4764, -5989, -16296, -11549, -2076, -6084, -8919, -14355, -9719, -10411, 2555, 24229, 17843, 10985, 24270, 30982, 11337, 1131, -8732, -4428, -6401, -1901, 11422, 15947, 6176, -3495, -10454, 3312, 9027, -8684, -19672, -13204, -5920, -6881, -4013, -8832, -11932, -11364, 1492, 4312, -1901, 2564, 11806, 13084, 4825, -10879, -15209, -632, 2246, -8113, -11378, -4804, 13406, 6602, -4421, -2131, -4080, -6666, 3907, -5188, -5105, 3811, -10378, -16548, -16968, -12685, -12768, 7200, 18076, 10011, -7034, -18730, -16834, -29925, -36201, -26922, -21342, -23394, -4552, 4698, 507, -7096, -21581, -17976, -9422, -10917, -9605, 2366, 4807, -4485, -7614, 4126, 9393, 5916, 13508, 39343, 42209]
7181D2209k2656j9718J75N536n310l857p8r888j8341N038J2337K7678N489l121
7167A5493m32j15N38J1510l194q455j2092j1193j1688n050L832j38j301N551n109
7152b1843q295J5251P203J0433j370j8257m657J2713K558M711l945n927K153R785
7138E13Q073p971p724K737P264J518n020P31Q222N459j4861R41j829N707j0475
7123f715P320N319m777l857r463J5666j0439r41J1134P208J5318q306j3141P180
7109A1506q515q452o057N952M542P362R542o447j7564q288q18Q03R926O332n497
7094e673p034r852o683J3696J4155O980O430K21k5820J148J0314O980n877j906
7080b921j1907N122J5863j0599j9328n722M627J0063p39j73J025K58K444K518
$$ y = [42209, 19553, -165, 10, 5546, 236, -3621, -3699, -13587, -31928, -26890, -14553, 13125, 18614, 15493, 15061, 14946, 15484, 26994, 23800, 15345, 3253, -7940, -19628, -24678, -20846, -20984, -22285, -16734, -21843, -30138, -14887, -7684, 2749, 1379, -16878, -21535, -8822, -6264, -1553, -5498, -11425, -9272, 513, 8586, 615, -7109, -4372, 2892, 4410, -610, 121, 8343, 13802, -1059, -118, -1947, 3760, -6715, 605, 5924, 1147, -2710, -12173, 3493, -6946, -7887, 3247, 10455, 25773, 17467, 4326, 11506, 2991, -5461, -11518, -5566, -1024, 6338, 15880, 9433, -8131, -16419, -17237, -16434, -6508, -176, -5673, -12707, -22559, -29242, -15546, -1391, 5589, 12019, 12240, -13580, -12432, -2118, 4862, -1015, -2921, -14828, -9706, 6157, -4442, -23770, -29492, -24865, -14802, -15541, -15714, -14689, -14431, -11987, -9469]
7066i469n22L375Q492O522K32k711L539j8852p168k897P275M676J1328N968k738
7051G050J0536o323l310o33n850m52n984J702M126L947J657J0071q095p114k89
7036A039k2952q105J7989J5308L395M9j5388L307J0305j0257q389q181Q494Q168
7022e218J240J3224n483r142m616J03q195j686M532L35M698J262J856M573n424
7007g941p976M907M433J8473K626j659M199n130m328o202m003n889P55K254j340
6992f821M197q637N233J4113M117n972j1796j0945j385O982l735k415l767m268
6978b5099O817r838P33J1730J6808j4832p741K5462J1197M743j4481j1345K5382
6965A9536J830k3919j611J587L521O206j0839j6746N503J7737J1302q05k564p266
$$ y = [-9469, -9991, -6616, 1876, 8398, 8630, 5919, 9458, -9394, -16562, -19459, -12184, -7508, 3820, 9788, 7050, 17586, 11263, 7953, 7320, 1470, 1018, -4966, -3264, 862, 4809, 6466, 16537, 8442, 1328, 1039, -21913, -30018, -12029, 3279, 6674, 6723, -8665, -5358, 4947, -5310, -13699, -21880, -13386, -5218, -3978, 9246, 3763, -5379, -9995, -9892, -18087, -19773, -15241, -14906, -10208, -8946, -7090, -2517, -7941, -15917, -11010, -6577, 11896, 14522, 12863, 17062, 11932, 7604, 1402, -2601, -8490, -7735, -5481, -6821, -2624, -11261, -6028, 8085, 12202, 6230, -5566, -16511, -17896, -10914, -14649, -17064, -20831, -25099, -18282, -28120, -27387, -15657, 1151, -13681, -21422, 4040, 15237, 19980, 5499, -5846, 19536, 21366, -2553, -4164, -2577, 944, 7150, -3689, -20435, -14932, 2805, 14107, 13302, 10738, 3472]
6951C472o094R774o56n481j789o389o385K420P829M393p762l023N496K785r221
6936a0631N759j0653P538L785o387m126P850j4380J0836Q917j0524j0456p28R549
6922a3651J3418O703p346n227N233O229J552j0129n610N948l398n469M801j696
6908h642K230o364n88J468O707l600n976j13k164O861J571P022N305J128j0454
6893e609j3743m503J3015J2085N392j208m781p232O995r76l791j0737q687L113
6879b0667J3123K860o908n62M686J5319p090p004N496K180P892Q44q003J280l900
6864d54l366N993K760J694R799N150l166j1535r229L71J2173N094j3258O246j582
6849F690r78M77O254P268m711r774j097m000r135m185J2635M437K460j745j4165
$$ y = [3472, -2622, 7152, 6496, 1015, -774, -7163, -13548, -11128, -3299, 1094, -6668, -9691, -4195, -1410, -10631, -4872, -15525, -7987, -4202, -10589, -14715, -6865, -21245, -10409, -1492, -12016, -22472, -23200, -13651, -233, 6470, -876, -6103, -870, 5359, 6911, -3218, -8828, -2880, -6278, -11747, -6946, -8642, -6412, -12776, -13364, -11896, -5189, -8789, -14765, -14878, -17042, -10181, -8610, -1588, 3717, 4845, -5609, -19352, -23855, -10840, 1245, 6637, 5429, 648, -6584, 411, -565, -4356, -15093, -23780, -20667, -7544, -4684, -11592, -12154, -7468, 7851, 761, -6243, -747, 1433, 9325, 10169, 2166, 3446, -454, -3820, 2173, 4933, 6627, 16426, 21576, 18410, 6875, -2354, -1983, 10190, 15284, 2026, 8272, 6690, 5712, 6189, 12443, 19711, 15000, 5226, 4129, 129, -9006, -13191, -556, 3881, 6341, 4596, -9569]
6834i569M604L231n64N833J008J6239m8j2414p655l101k789j54R424n576k7758
6819b9289m680K5561j857q32J2025j0713j0436m853R671Q33k851o272O386J2682
6805d625J470k572j6699j479n610J4402J5445P424k522j1157m88J3139n069j0889
6791i230k0895K018J2428O814M410M970n544o527J2466J2768k826j2120L12j5333
6777a6289M370J2631J49R935m121o252j927R358o790O982j0082q648r026q452
6763b8162N106K6147O490O10j626l698M522j1907q363J5871J2242O284k761j0528
6749A0227j7261k389k58P059K5556P247j4529n951q442k338m677p612K656M914
6735e798j8660j3977J0717J1852L397J7114J7946O917R711J7870L638j6122j4821
$$ y = [-9569, -4965, -1734, -2298, 3535, 4543, 20782, 20734, 8320, 665, -2436, -5225, -5379, 4045, -1531, -29289, -33969, -8408, -10265, -11097, 928, -9785, -20221, -25074, -15403, -14570, -17421, -23693, -17307, -4625, -3155, -5727, -22426, -23905, -29515, -15113, 332, 7756, 5234, -5923, -6411, 6728, 1659, -9230, -30125, -28107, -15679, -8865, -4455, 515, -5029, -11556, 910, 13678, 10852, -1268, -956, -16289, -11919, 712, 861, 10796, 6675, 423, -1504, 7854, 1064, 8046, -2036, -10684, -19710, -28162, -23056, 3091, 9581, 10191, 8565, 4867, 9389, -2518, -10881, 4990, 17232, 23516, 20755, 10227, -7034, -9423, -9681, -2622, 22934, 30181, 15652, 9701, 1259, -1079, -5756, -13368, -10712, -5798, -24458, -38435, -27718, -15866, -12469, 4645, 22591, 29508, 39219, 57089, 60727, 44605, 29784]
6722B9784O663p258j2324k855r213P397p144k734j5120q714P644M292N938k247
6708e891K740m01J4107P627j6596J331J5763l498J3847R213j4588j5173q941m730
6694e190j1182N068l356j1816P761L014K31P483P844k947n197m55N127m155Q765
6679I95k52l462k95q72j274k133K2236J972j4982j2588J74J5284k827r611K072
6664e563R160J2058Q23J5955o226j3260j173j5330l59J3025p39j993o80q878m586
6649g766q609L052l726M959R493J3782J3436l148j4156r357r515o815J471k623
6635a9522L514K729q438J197o78j309R245r69M767j261O682J8506N776j102O94
6620A9831q779k1192l924J0973n902o95K933n432m228o69O053J0054R327N65j3256
$$ y = [29784, 36447, 29189, 16865, 14010, 4797, 12194, 5050, 2316, -12804, -21518, -13874, -9582, -3644, -5891, -3151, -3552, 10555, 18182, 1586, 2917, 18680, 15182, 29029, 38242, 23654, 8481, -460, -5190, -16372, -11304, -14660, -26476, -18715, -15701, -15470, -7987, -143, -3090, -8287, -8742, -3615, -7770, 995, 743, -2719, -3014, -3886, -5160, -7293, 14943, 16915, 1933, -10655, -10481, 4803, 1976, -7635, -5563, 3597, 15655, 16478, 32433, 26207, 12947, 11774, -3556, -3915, 9110, 8371, 6378, 5698, -3180, -7766, -16375, -13323, -17049, -12090, -2597, 11185, 24621, 21473, 7317, -2040, -11555, -18370, -16899, -19522, -16008, -13279, -21717, -20520, -21198, -22507, -13262, -14231, -9464, -10725, -4043, 14463, 20239, 19137, 19831, 11052, -10140, -14064, -3091, -8993, -9688, -6755, -12187, -16415, -17084, -11031, -977, 8350, 8915, -4341]
6605d341J3419k657n715r0J2407k011m245k272k492o925m283L055L874l167j116
6590f559l248N223P440p84o491J563M273l684j1093L570k519M837K01m996l676
6575a5943J7070Q502q357p652j288q272l020J0090J1949J1265j3582L130p610
6562c718P945O53j1266R51n799Q448j74l370J569J4363o454L375J2305K210M791
6547B5829j3473j4681o081n499o85L957J987Q028p860O696J5681J182R855Q036
6533C2972j2903o422j1957j3679K3J201J2383K4123J5753n221k1170k5772j3187
6520b3856J2721M646K550l193J043R851K797p489Q214J0797J4q060o277N938m027
6505E669q504p037r072n436J1339J0667K425r305j3212p465Q697M411l757J346
$$ y = [-4341, 9078, 6421, 706, 616, 13023, 11012, 6767, 4495, 2003, -4922, -9205, -6150, -2276, -5443, -6559, -9807, -4584, 2856, 2072, -4419, -2856, 1417, -2267, -13360, -9790, -12309, -7472, -7271, -12267, -15943, 1127, 9629, 1272, -6380, -7668, -15940, -18960, -8870, 3079, 14344, 762, 3892, -3718, 4227, 4880, -6386, -5435, -11234, -2786, -2960, -6330, -4761, 9602, 3148, 6523, 18828, 21038, 25829, 12356, -2325, -8406, -13905, -14590, -10633, -8646, -618, -8478, -1782, 13899, 15081, 24936, 32972, 20069, 13647, 1690, -11989, -11966, -10765, 1618, 25741, 41494, 36273, 15103, -10669, -23856, -11135, -6489, -3939, -7132, -6089, 3762, 6559, -930, 7284, 18081, 18095, 10035, 3758, 9696, 5669, -2835, -9872, -18944, -24380, -13041, -2374, 51, -9254, -22466, -29931, -21234, -16823, -20580, -19234]
6491a9234j469o764k40l239o528K951J2293L930J377L72M530k1222P552P138M446
6476a4107J0445M014J1765O971L1p225j6679n433k700L220q07p655N17R327j731
6461a0047L282J041R781K459j238M529J870q955P773J7181k212j4569m787o99
6447E409q128K865L430J1527m336p184j3394r72Q79p078J451J3425j822j2831
6433a6759M222J8402J1577q182k8697l223J9386J6229r619j0315K818M580L067
6420C486q884j496o031q411P692K835K42k907q498m813L004N530M877q743J26
6405b1991J2286J490N5j1187o794Q090L830k803l916k357J762m007O513Q804R893
6390c32O357P08J4781o81r064j121n005n491j2787M769N58P548R693k936Q228
$$ y = [-19234, -20703, -27467, -27707, -30946, -37474, -34523, -22230, -18300, -16923, -16551, -12021, -33243, -25691, -18553, -14107, -3662, 352, 12117, 19088, 19119, 11894, -4785, -10218, -12918, -9698, -10505, -18160, -17643, -8316, -10047, -6765, -5724, 4057, 6516, 5278, 9807, 11677, 2722, 10495, 27676, 25464, 10895, 6108, 5409, -2719, 146, 3576, 15103, 10767, 3583, -9811, -10783, -9904, -16982, -15531, -2106, -3928, -16759, -12537, 5865, 17442, 9260, -19437, -22660, -3274, 12955, 3336, -6979, -4161, 419, 3486, -5398, -6894, -12925, -21336, -13644, -10809, -10567, -13474, -21972, -26785, -23781, -18251, -13374, -22117, -21991, -9705, -8215, -8160, -19347, -26141, -18051, -14221, -17024, -20940, -23297, -21535, -25542, -19029, -10225, -332, 6025, 6733, 21514, 20833, 11769, 10648, 5643, 152, -12635, -7866, -7308, 240, 9933, 6997, 15225]
6375A5225l9j9667j2992M235j0946j1719J2676J0785j4420M777J0527M712l962
6362a0808J0156q93j8586O464J5890q963q274j1234L069J1483O772J2396M680
6349A2152j389q61m9r760q189N688R797M299k28q320j205P05n520p800J776P783
6333a121o487r837K039L082M007j621P365p76o290n658L180j520L862P519Q580
6318F324j338j2038j2300l275J3689P179p698J3890J453r490j1084l38Q634r889
6304a6281k2829P294K0491J2799k2033M788J8612J000r754j0861l829q337n41
6291b9481J4300N032j4666Q471P030J5685o57j3151M947J032j7150O969R957n466
6277g148j6220K524k537L07r050r44l858J9620K204j225Q660p200j3091M132p362
$$ y = [15225, 15186, -4481, -17473, -13238, -24184, -35903, -23227, -12442, -26862, -22085, -11558, -6846, -10808, -652, -1545, -20131, -13667, 2223, -6740, -15014, -26248, -23179, -11696, -4924, 7472, 12152, 10763, 9902, 9853, 93, -8096, -2408, 7389, 11688, 11460, 3140, 1935, 2640, -2880, -10680, -8904, -1121, -7608, -17445, -15406, -12324, -8317, -9938, -2573, -3349, -9639, -15297, -12117, -13637, -9775, -2256, 6324, 4986, -7052, -19352, -22627, -8938, -1759, -9457, 4433, 5886, -3604, -14688, -15026, -6392, -16281, -39110, -31816, -11325, 1474, -20559, -15771, 2841, 3841, -5913, -16774, -20603, -28940, -29481, -15181, -10149, -24815, -16344, -9314, 6371, 5714, -7437, -2490, -1458, -18608, -11639, -1682, -7148, -23368, -20844, -23381, -23074, -32124, -33068, -36926, -17306, -15102, -16327, -7667, -14867, -27958, -23826, -31188]
6262c1188P171J0483j198n80m431M794J1022M961p785K1948J0432j1644j6945
6249b960J780o75o490l070j793l714l036J350K221k219k276q683Q76M190K556
6234b1943J057P531K024k204q844K69J6915K305K408R09p976M991j524N832j1115
6219i365l800J4035O672j5452N6m415Q228m080p527q520k25j123j496J2452J313
6204a3247K381N428k104q339r839m638Q853K761O134J997j409R035J0902l036
6190D879K672J2580m833j0134j1303n955l153J304J1425j2430O095O60o685j2316
6176b7194M489J0071N660r307O61M915M704J131K855q575J613P813j2205J760
6162a1609L803l313J3514m985r764J42R50O365R70k124o100q55j1591J702N220
$$ y = [-31188, -24017, -13534, -14732, -15312, -19743, -14949, -3927, 1034, -6751, 15197, 25629, 13985, -2960, -1180, -1855, -8345, -11415, -13208, -16922, -19958, -18608, -16387, -18606, -20882, -29565, -28689, -24499, -21943, -20886, -13355, -11331, -13535, -22379, -22110, -5195, -2890, -482, 427, -7549, -2558, -4082, 1750, -9365, -13165, 870, 7542, -7910, -7854, -12269, -4041, -8121, -15648, -24168, -24393, -25516, -27012, -14560, -13247, -10866, -5438, -7542, -15881, -25720, -30358, -21505, -18744, -12610, -10613, -12022, -2987, 7915, 4879, 7551, 20131, 15298, 5164, -6139, -12094, -15247, -13943, -2518, -14948, -8853, -8193, -14878, -27194, -22705, -12634, -6974, -16281, -15620, -10705, -6001, -4870, -2015, -10590, -8977, -1164, -13369, -11609, -7806, -11119, 2395, -2590, -12354, -12212, -11262, -4897, -3927, -6051, -12151, -13006, -24597, -22895, -17675]
6147a7675R099R767J363L501K221L858j5217q584J1126N24k853o873j001J5064
6133D320L668K54j3829l982J066O139J974M441O14l247m997l686Q32J4962Q732
6118A7261l358j0469q869n86k380M458l953r185k664J8052N444k707K5704q959
6104A7789j2157P794P692N158j5781j5532j0725L543k964n980N0n531o711L767
6090b9588J3060Q497k194L664K990J113M637L964j659j0029K902K012r982m845
6076a5458n694M950m786k393J6014J5450r800j5813J0392P816J1540n914j1871
6063e567n244j2704O35K363P267N721P080m273j830J0315L731o466n024N732N944
6048G680K017k584j5602M525N501q087L699p145o195j714N292K0492p935j5798
$$ y = [-17675, -8576, 1191, 2554, 6055, 8276, 12134, -3083, -11667, -541, -17, -2870, -9743, -10744, 4320, 7988, 8242, -5587, -9569, -8503, -2364, -390, 4051, 4665, 1418, -3579, -7265, -6433, 8529, 17261, 13903, 3434, -5435, -6021, -8401, -3943, -7896, -17081, -19745, -1693, 3751, 1044, 26748, 17789, 5632, 13426, 21118, 26276, 10495, -5037, -15762, -12219, -15183, -21163, -21113, -26644, -33355, -29588, -16528, -8031, -10225, -6561, -3571, -2458, 2179, 6143, 4484, -5545, -2643, -631, -10613, -15458, -21152, -16202, -20988, -23381, -7367, 8083, -1717, -17530, -7138, 678, 12218, 6304, -5567, -10811, -23515, -22880, -20517, -13250, -7529, -449, -4722, -6552, 3763, 7494, 1028, -3996, 1736, 7680, 9697, 7113, -8489, -3964, 1537, -6550, -2851, -9996, -16191, -17905, -12613, 7879, -56, -15854]
6034a5854q309k098K629L611J893m683J1010L643r305j0565Q308n12p197p463
6020c4892o637k264J3731J2626P943P551K940j6561k7225n772J4625L052J031
6007b9852k859M559J0950O45j667M11J9467J5179M027j516k638j717j1048n046
5993a105Q5o983K123J2975J375R38j4840r651k731J873j816J816n971K405J634
5978a7873q9M444n719j0561o019J4363P480q873r024J2440K1148K087N573k716
5964F661k871p231j1319j11J0056p728m403P300Q185J0906j5462j9801n594K764
5950b8648J8231K5442o004p75l060M692Q915p281j260q526j813J3886j060P845
5936B0584j5152l322N775J0183j7956p843P16K915q15j4877o03N227L216Q614
$$ y = [-15854, -24163, -26261, -23632, -20021, -18128, -22811, -11801, -8158, -17463, -28028, -19720, -20232, -27429, -34892, -41529, -43793, -30062, -17436, -9493, -1942, 998, -15563, -42788, -48560, -33935, -30883, -29852, -32711, -28152, -17202, -16557, -18224, -17813, 1654, 16833, 20860, 19344, 16706, 14989, 3941, -1105, -1020, -8003, -5880, 7095, 8470, 9408, -5432, -15083, -17814, -15941, -17757, -15941, -21912, -19507, -17873, -17962, -13518, -19237, -29798, -35817, -21454, -13974, -22847, -31871, -19431, 1717, 3804, 9377, 6661, 3790, -3441, -14760, -14871, -4815, -12543, -16946, -9646, -1461, 9445, -6017, -25818, -31412, -28648, -10417, 15025, 9021, 8246, 5186, 9878, 18793, 11512, 10252, 1726, -87, 13799, 12739, 20584, 5432, 2110, 7885, 18068, 112, -7731, -7015, -4100, -4915, -19792, -20395, -15168, -11952, -3338]
5922c338J3124n760k940N746l718j1038k115J0826K1868L832j6969j0081j0617
5909a1180p511N668M009O974L855r119n652J841N485Q738j672o953n948n30K065
5894i930J317Q166l468r90N07m545M234K1823K639k3386j4155J2343o033n911
5880a7389n664Q790Q155j7144j2467J3127J8599o18N899R14Q278n660j0247J1150
5866E723K270l610Q01j3413j2429R13k228p506l11K054J5504J7199K846o801J856
5851B868n932j0837o047J6135M436L704P357j683J050K49O936j0995j9610J307
5837a1062q56j528J0929J0160J0616O545q581j6318k390p53j2641J853K898O077
5823e051L987j852O730R615p43j1875o783K364k728p205P725j6714L71J182n634
$$ y = [-3338, 9786, 4026, 1086, 6832, 3114, -7924, -10039, 787, 22655, 26487, 9518, -563, -11180, -18691, -13023, -9014, -2040, 1815, -7304, -12956, -11115, -5630, 3108, 1436, -5517, -11465, -11995, -9930, -8613, -447, -3915, -4905, -4398, -8943, -4709, 17114, 19753, -3633, -17788, -5445, -11478, -17389, -23053, -14263, -6108, -23252, -35719, -22592, -3993, -4611, 1288, 2202, 10480, 4820, -5427, 5723, 7993, 4383, 5184, -8229, -20658, -19745, -21973, -29479, -29790, -27736, -12232, 4967, 7813, 1012, 2868, -3064, -13901, -19948, -3813, 623, 4327, 11684, 10001, 11051, 11300, 18236, 7241, -12369, -11062, -11918, -13446, -2517, 7643, 18259, 24804, 16223, -95, -2485, -3238, -15879, -14026, -11128, -5051, -1064, -2916, 3814, 13429, 12686, 811, -5972, -3608, -6336, -13541, -5816, -22530, -22159, -20977, -26611]
5808b6611K012k488R444N21n2q385M508m20k961R759Q567m151P446Q492q140M975
5792B516N294J594N015j3087j2109K275J8736j77o437J3682J877J917k0785k0559
5778b0248M366J2740K827p366M987K2973M984j4824j0544N222j1991p974Q815
5765f033J974K1938J2487j6670Q51m405j2402j7775L869N168m219O847P952n751
5751f169j1960J808J0348J5042Q39q204j4864N406K667o148r825o92K758n509
5737b4503J0355q174P477J6094O900o45p994l011j5178m761J0606R302N718m374
5723b188K408K231l56l683J52k311k54L519M007P776r632j3956m721o433P506
5708a5935J8576K88j4906m154K915j0028k705Q125n327N116N719J752O195Q761
$$ y = [-26611, -24599, -27087, -17643, -17122, -17174, -25559, -21051, -21471, -24432, -14673, -6106, -10257, -2811, 5681, -2459, 2516, 7810, 9404, 14419, 1332, -10777, -8502, 10234, 10057, 3620, 17302, 19179, 21096, 311, -20248, -15882, -3142, -315, -7681, -2694, 20279, 25263, 10439, -105, 5117, -6874, -14848, -6033, -4059, 17879, 30366, 13696, 14547, 10142, -2260, -20035, -16166, -10998, -15217, -8370, -418, -6169, -18129, -16321, -5973, 9069, 9908, 1704, -13160, -7754, -5087, -11235, -21060, -21752, -18994, -24503, -14148, -22322, -14845, 1249, 8149, 7504, -490, -3501, -18679, -23440, -12834, -3532, 2186, -2188, 220, 2451, 2095, -1588, -1436, -3747, -4001, -482, 3525, 11301, 1669, -12287, -17008, -23441, -15935, 2641, 2929, -11977, -16131, -13216, -23244, -25949, -17824, -23151, -18035, -12316, -10564, -4369, 4392]
5694D392l711n452o686l014P233j7104K93J4945O491Q568o698j0719J343J1602
5680A483R798j2829j3920n520N192J1236J1536j016K449p241j750j060j22J089
5666f75k879o341r39l6q094r791j434J6968Q912O45j2423m358m365p951J723q191
5650c9229J729R405m767N032J649P07K3721J0645L902M080l221j6558j7127p156
5636b7188o394P368m512M044N451N55M358K135k89K520P64M451j97n758K654o297
5620a6335q102j6043R882Q390J526J0487m176o332o9P146N816n168K366J1361
5606G49k983m916M664n159M395O931M14n186j664m760m85j27k406L485r53l023
5590a1024m053J7474J5864l49M912l046q713p424j755j0697j1025j337J2986J947
$$ y = [4392, 681, -4771, -11457, -14471, -7238, -24342, -24049, -9104, -2613, 5955, -743, -11462, -10119, 1483, 11281, -1548, -15468, -20988, -15796, -4560, 6976, 5960, 8409, 1168, -582, -1642, -1764, -675, -3554, -9895, -10834, -10870, -18964, -28755, -30189, -13221, -4309, -3664, -16087, -20445, -24810, -32761, -31038, -39229, -37500, -28095, -32862, -27830, -26181, -25474, -1753, 8892, 12794, 16874, 13653, -2905, -20032, -27188, -33582, -26214, -30726, -26682, -21231, -20676, -16318, -14183, -14472, -11952, -11188, -6737, -6934, -12692, -10038, -16335, -24437, -40480, -30598, -22208, -20682, -10195, -14371, -20703, -20772, -13626, -7810, -12978, -10612, 749, -2234, -7150, -2486, -7645, -3250, 3681, 4095, -1091, -2755, -7515, -8000, -8127, -10533, -7048, -8001, -11024, -15077, 2397, 18261, 17912, 22824, 19778, 11065, 3641, 1886, -8811, -19836, -21173, -8187, -6240]
5576f240j0758j0897l672N693N483j0483n466p30N837J4581j7K704Q893L896k804
5561c980j917j9387N246Q356P547J2100J418Q376M097j7605R81L979M749j3890
5547G0q477q005p091J1136J0144o094m758n893M999q292q462q67m033Q859K262
5532b4502k217J135m057n81K4006K4106M528q665j5655k97p851O349j561J20j3244
5517a8386l648p861Q36P262J0360J2949J0539j4719q686K042j6191M849K0571
5504h3J086j853q462q648K822L867M908L84P227j0933q685L380j619n661k825
5489b5095j277J4933N960M966m952O372O251p483j5433M560J6657N68q73m381
5475G73M178J077j2533l638J3653P196j1694j1408kL521l6L80K0723J2580j2088
$$ y = [-6240, -16998, -27895, -31567, -25874, -20391, -30874, -36340, -37070, -31233, -16652, -16669, -13965, -5072, -1176, -3980, -5897, -25284, -20038, -11682, -4135, 7965, 9383, 17759, 21856, 4251, 5232, 9211, 13960, 70, -8407, -16412, -23503, -12367, -2223, -8317, -13075, -18968, -13969, -22261, -30723, -31590, -35623, -26764, -24502, -26719, -25584, -29641, -30222, -6216, 17890, 22418, 13753, -1902, -2199, -10050, -3701, -5262, -5142, -18386, -22034, -29895, -29059, -21797, -11437, 1512, 12051, -2668, -11354, -9312, -25503, -20654, -83, 1003, -850, -9312, -17960, -15138, -11271, -6363, -5979, 1248, -9685, -18370, -14990, -16609, -22270, -25095, -26372, -11439, -5479, -513, -5465, 907, 7158, -325, -15758, -11198, 5459, 6027, 5154, 773, 4951, 6028, -6505, -10143, 3510, 10706, -988, -12396, -12398, -8877, -8913, -8533, 12190, 24770, 12682]
5460A2682j0257q309K26O529O934j0917q624L626j7J4757M886j0861j1111n597
5446a6053m047J934j1409N904J9181j207j8309m082J9258J5096P417j3459m890
5433d666o06o53J0582j553l227P233J982O46P985q980N084Q697r561q959N2j009
5417C047P594M523j0846l960Q48J705l699J522L291M624j1649r52j662K70J2349
5402G005L580j8681M057J1098j0370n723p035m504M802l604J6318q87n806k742
5388a2492R095L753k894P93L320n65k830j6487l053O933P391K443J630L296J0813
5373A1146n678p782k2495n563J6944J9235O518J247n61m092n997M239L785n134
5359E812r581r651p068k180R749J8889o42o597K574q1N964J834O385p888p809
$$ y = [12682, 2425, -5884, -5658, 871, 7805, -3112, -11736, -8110, -8127, 6630, 11516, 655, -10456, -16053, -20100, -18166, -29575, -23671, -4490, -5697, -24006, -28088, -8830, 6266, 13683, 224, -4666, -5272, -5925, 4657, 3104, -123, 7110, 9092, 9738, 17723, 8743, 13827, 22524, 12963, 4004, 4056, 3047, 10641, 15164, 4318, 358, 1206, 2911, -788, 734, 4025, 8649, -3000, -3952, -5614, -5344, 7005, 10585, -8096, -4039, 7059, -3311, -9034, -16069, -20573, -15771, -19375, -3057, -3944, -9750, -12492, -3397, 356, -2538, -1745, 1575, 1010, -1820, -18307, -21360, -14427, -7036, -4593, -2963, 333, 11146, 5468, -2314, -24809, -30372, -13428, 5807, 12325, 13572, 13011, 8919, 2922, 7161, 10946, 5812, -3769, -13420, -20488, -22668, -12919, 5970, 5328, -1269, 1305, 1224, 7188, 9022, 15407, 7519, -290]
5344b90j6086n200m194J769M525P290J8057J0027n472k0512p430J3266j6062p366
5330b7678J3989Q088M708J4760Q66o964r984j1361J2730M484K053N553j2310J098
5316C2j8028m763J6668Q531R237M655P270j0107r324N117p729j4839N23K031m258
5301a4984p010K793L642k18Q73M435k923Q49k978J790m138l083O80K100p56J081
5285a7847K813p24K202J8135M716n298o22M733P34j114n942J0569L56j0648j064
5270I99p547J777o391j541l426L882Q746O450j2781j0564j817p086N752O301o645
5255b3891j240M887Q660M614j0259j2156L749j167j994R232P904m435K04Q69l240
5240a8263O425N492J355K287J920J772J392O09O49q823P05M814L417o563p622
$$ y = [-290, -16376, -21576, -25770, -24001, -19476, -12186, 5871, 15898, 10426, -10086, -17516, -4250, -20312, -27678, -13689, -5601, -893, 13867, 14733, 7769, -2215, -13576, -846, 3638, 5691, 11244, -1066, 32, -17996, -22759, -6091, 2440, 11677, 16332, 23602, 13495, 4171, 9288, 1559, -13280, -12757, -10726, -14984, -21994, -19201, -15559, -15777, -14904, -10469, -13392, -12543, -15521, -13731, -17869, -20952, -20272, -18172, -18928, -17847, -15034, -15758, -13556, 4579, 9295, 3997, 3375, 8108, 8842, 7728, 1786, 12355, 12711, 2063, 999, -6548, -4771, -11162, -12703, -16129, -12247, -3501, 2949, -9832, -20396, -22213, -29299, -23547, -17246, -23891, -25131, -20244, -11584, -6970, -17229, -29385, -25636, -26803, -28797, -19565, -11661, -16096, -15892, -15023, -18263, -11838, -6346, -4991, -2704, -784, 988, 2380, 2989, 3638, -5185, -4480, 334, 3751, -2812, -10434]
5225a0434j0667N74Q631M460K135j125l257J4073O376O240l249q342O360k002
5211I773J2969K420j2366k0488j30J2002Q221l265m728n420K748p405N809J1307
5197A1447P401j7012j6202J303L077l165l288o193M083p755N800J5540K0124p137
5183H023j4082l083p81J9518R923o274q527j1039o012J803k290J452j057L662
5169h764q35j833R441j054L848j6423m523Q500P868P2n689j1171j1150K472J5234
5154a4007J5169P035j4446n826J852l484R336o951p688O584k424o203n815l91
5140b7259P424J9476P298q400o745j2824R909L388M837p341o169m620L886J7289
5126A49P675j6477q184J609J477L777r983k205P590R915l007k196J143Q916q538
$$ y = [-10434, -21101, -20527, -11896, -7436, -5301, -6426, -9683, 4390, 10766, 17006, 13757, 5415, 11775, 9773, 22742, 25162, 12796, -7692, -7822, 4180, 12401, 9136, 4408, -1012, 1736, -5669, 140, 11447, 18848, 1836, -14366, -13063, -9986, -13151, -16439, -22632, -18549, -26304, -20504, -4964, 15160, 8023, -6059, -9142, -9923, 9595, 19518, 13244, 4717, -6322, -12334, -10531, -12821, -11369, -12426, -8764, -9599, -11432, -1991, -3045, 803, -15620, -20143, -11643, -3775, -3703, -9392, -20563, -31713, -29241, -14007, 1162, 8197, -6249, -12075, -10223, -13707, -4371, -11322, -19010, -12426, -14850, -21053, -26868, -27259, -19835, -359, 6939, -1461, -8206, -21030, -11121, -7733, -2896, -10237, -16406, -21026, -17140, 149, 7824, -8653, -16837, -15228, -13751, -9974, -19957, -22162, -14572, -4657, -7664, -9860, -8717, 199, -8339]
5111h339j0258J6286J530l512R703k940j4515j5095J96p004P600J3369q834j1191
5097c3004J6549J3220l633M433m638O155n629j1705j490L067J0738p96j872K0954
5083A2349j601p705m400j9125l842J1092J3222o03j8533l070P546p510r639Q013
5069b3806M719J0428Q967N71l454K172J2733m117n837M395j510j2439O03J5381
5055H806N96m670Q508J2547j0720j6006j1511K131q15r186J5961n928j7719R002
5041a9004J3515P227j7116j8521P08J0644O335M440J1800j649l137p323k440k034
5027a6555o69j2994k096J043L183j401K720J0958J4101j579J84n451K422L358
5013b776R65J0632j2711m668P579O888L235J705Q791m079o038j223M601O119k1277
$$ y = [-8339, -18597, -2311, -781, -4293, 5410, 2470, -12045, -27140, -26944, -33948, -26348, -12979, -21813, -33004, -16455, -3235, -6868, -2435, -7073, -918, -6547, -18252, -19742, -16675, -5937, -6733, -8605, 12349, 10748, 3043, -1357, -20482, -24324, -13232, -10, -613, -19146, -22216, -14670, -22180, -31819, -23806, -19087, -8659, 308, 879, -2575, -403, 12330, 8213, 2376, 6771, 5261, -7178, -6575, 8806, 9402, 4732, 13240, 25787, 15067, -939, -12450, -10319, -11134, -20320, -4359, -10287, -28006, -19004, -5489, 1738, -15378, -33899, -33191, -22547, -16212, -11772, 28, -1621, -4758, -12081, -14521, -16555, -17224, -30218, -32314, -31271, -28088, -29489, -26769, -15811, -1710, -3289, -3105, -8556, -6134, -2776, -1811, 8821, -3890, -8558, -979, 5909, 9144, 10849, 19640, 15561, 9523, 8300, 12901, 19020, -2257]
4998b257m470p108j03J5338L784p192q88R329l39n378m530p701K167j5691L829
4983b1210K065P415M33q704N237R5J1198M909j1952l090L835K663J5841p298r213
4968g776r751m557O092J9789J1505r164r025J1950r432j3330q005k658L549J5675
4954e138j627l564P043J453P096J0188j6327j807O76k700n850l672j618j906J1455
4939f298K4575K096j9071j6383L49P281J0747k557P17K0195J007l603j0039j5662
4925f646j581j026J635K620L5P704j4330j5520L834K0418J0027q956R769q03n642
4910A538m59j443o221L75M072N821L382M985M622J3506R317p995p497k4915j6655
4895a7567J2740k115j5943k139N375M269p68o918J0704R154K612N2J35K00Q148
$$ y = [-2257, -6727, -13835, -13938, 1400, 5184, -2008, -2896, 6433, 6094, 716, -3814, -11515, -9348, -25039, -21210, -19145, -11730, -11297, -20001, -14764, -14669, -3471, 1438, -10514, -13604, -9769, -7106, 8735, 1437, -7776, -17527, -22084, -15992, 3797, 15302, 6138, -2887, 9063, -369, -13699, -21704, -24362, -20813, -5138, -6765, -10329, -3286, -1833, 5263, 15451, -876, -2683, -2007, -4707, -10557, -14229, -15847, -17753, -6298, 18277, 20373, 1302, -15081, -14732, -7451, 3296, 739, 1456, 21651, 22658, 19055, 9016, -6646, -8227, -9253, -7618, -4998, -4963, 2741, -11589, -27109, -23275, -2857, 7170, -1786, 7983, 7180, 1538, 1079, -364, -6585, -6210, -2138, 3683, 7065, 12050, 16672, 30178, 39495, 31500, 24003, -912, -17567, -4827, -6942, -22885, -25024, -19649, -15380, -16148, -23066, -12362, -3208, -596, -544, -409, -209, 7939]
4880G939j4851P98P617j3560n932k956j6407J3517J0758n339p345m796J6131J1540
4866b886K803N862k851j0231K298K234j7077j1613K678J3418K536P476J1614N714
4852A1975Q2m09J6631R027k0645k1297J117k830j3213j1939K209J0771J5613O852
4838C944r020Q19N772q032k162L43o804o072n660l535L639N022J3647J4480k024
4823D357J428j3682j3489o492o095R033o680J2253R418J0249m657J00J7129j947
4809A0925q447p484j3175r041R051J0686J9797K343K245n909r350J094q773l035
4795i073n901k9463P616J8242M972J459J2544j536k494j0776j5201L561R820m056
4781b0286P264O514L052n929O867Q174p521k510P440K34p245K106j2667n270O807
$$ y = [7939, -6912, -6114, 1503, -12057, -17989, -20945, -37352, -23835, -13077, -18416, -25761, -30557, -14426, -2886, -83, 5779, 2928, -7303, -5005, -2771, -19848, -31461, -28783, -15365, -12829, -5353, 6261, 11975, 12057, 11648, 28279, 37306, 16661, -4636, -3519, -6349, -19562, -31501, -29292, -18521, -2908, 3944, -5076, -4257, 1515, -6517, -8679, -8336, -15140, -21212, -26872, -30407, -26768, -21746, -8099, 6381, 4357, 5785, -7897, -21386, -27878, -33973, -24940, -31620, -19367, -9949, 300, -4357, -4257, 12872, 10925, 2478, -5006, -18181, -27222, -18171, -7485, 12312, 14655, 16900, 10991, 1641, 2735, -6038, -9073, -14974, -44437, -36821, -18579, -13607, -12148, 396, -1140, -3634, -14410, -29611, -26050, -16230, -20286, -13022, -6508, -3456, -9385, -2518, 5656, -1865, -4375, 3065, 3299, -3946, -1840, -14507, -19777, -12970]
4766a2970P385j6849o215K2086Q782K538q995J626J9256n3j2822p943k932J2071
4752D965J8851j4099r153o858n880O033o322n85K406m307l236l902L39K096J0689
4737h963L878n46p509o433P281k987K272J626P387N731r59k216N211J2000P544
4722B3317j5479m971J0318j34j1016L86O64j1152K72Q110J0402k753j9371Q057
4708c350P743O697J3758m833q382j1511r920O209L185j197j857J410J569r02Q875
4693G494n640q190O438m163j4546Q590P480j0325p571K411L493J5075K632P97
4679C975o016N52L301n66M283N717R49q937J429R992J1770k537k1312m26k715
4664e41N112j738o421M665q163j0336n48K427r452m974Q466O173J87O77P129j431
$$ y = [-12970, -5585, -22434, -28649, -6563, 2219, 4757, -4238, -2612, 16644, 16591, 3769, -4174, -7106, 4965, 23816, 9717, 564, -6294, -12174, -6141, -12463, -13048, -10642, -14949, -18185, -22087, -21748, -19652, -8963, -5085, -5631, -13140, -19573, -12292, -15279, -13007, -11381, -3994, 1737, 778, -1438, 3773, 15773, 23317, 7838, 2867, 13185, 13051, 2035, 2421, 3085, -8067, -7795, 315, 10717, 7964, -11407, -3350, 4393, 11090, 24848, 20015, 11633, 122, -9798, -3589, -404, -1601, -3458, -2048, -479, -1381, 7494, 1854, -6336, 102, -4061, -18607, -10017, -2537, -12862, -20433, -18022, -14529, 546, 3178, 3975, -2041, -1489, 1812, 1246, 5529, 11246, 12195, 3258, 4687, 14679, 26449, 23912, 2600, 2174, -541, 4571, 2833, -3588, 1077, -7086, -17422, -17970, -15543, -24995, -29969, -21503, -15330, -15143, -14466, -7337, -8768]
4648h768j056m14j925n093k93J2006M142m79N58M557K674k88l563O347j4252q451
4632a4298M532q524J681J323l862k440N405P066q30P041j1101m808K374Q119O96
4617g626J3629J6432o794j7091J563J2172L498n686j1327m680J6682Q709j0470
4604I011M690L06j0744K636m020k372j3125j4174J787j0019N311J1404R202M678
4590e429J47j542J051L395j1850l748J9500M785j538l082l685J3058n318j3018
4576g274k588Q73R774R273j6808n331Q376R821J3378o518j1948n088j222N186
4562i6l831r904k299O158n435K190L152o078j2021N107J9500J6584N044k443l134
4547A2494n338j1075K309K959M624N769Q966j2243j9946j060O023j4524O502Q122
$$ y = [-8768, -9824, -10238, -12163, -17256, -17549, -5543, -1401, -1880, -1322, 3235, 5909, 5621, 2058, 8405, -5847, -14298, -9766, -18290, -16609, -15286, -19148, -21588, -16183, -9117, -9947, -2906, -14007, -18815, -16441, -8322, -7626, 6003, 22435, 15641, -1450, 113, 12285, 15783, 10097, -1230, -5910, 10772, 19481, 9011, 13701, 14007, 3263, 5899, 1879, -493, -13618, -27792, -26005, -36024, -30713, -19309, -10107, -5429, -5282, -6824, -5773, -2378, -14228, -17976, 1524, 6309, 4771, 1689, -1996, 11062, 5744, -7274, -9862, -8989, 785, 10058, -6750, -12081, -3705, 6116, 19494, 12976, 1028, -4060, -5282, -96, -3927, -13831, -16130, -9972, -15407, -13217, -10065, -16143, -28164, -23057, -3557, 13027, 18071, 15628, 12494, 7156, -3919, -1610, 1349, 5973, 11742, 20708, 8465, -11481, -12541, -6518, -21042, -14540, -6418]
4533f418k599m663M771O404O616k6887k0529O61J2434P771K846M465O470J6433
4519G775l81m126P09p511K991P950k937k180o73m216J398j07j2213K166N803N331
4503b21O072p694q512j974k496N284q157m055P633N544O826k026j4771R476J8040
4488H969O225l153o427j3195j0455q233p655Q105J0714l528l428Q075J5097n022
4474c911j4914L801k830n406p36J361O121O131P466l80p64o622p952L742J2203
4459b690N295K065J1232L238j6826j3871j490M617R468j3399j351k514O026O343
4445c857j3445m757M159J255J573l887Q404J0514n573p157K752R799m605m980
4431i805K404L862K923P110L124k598j980j5546p26k237O357N147J421Q205p751
$$ y = [-6418, -9017, -13680, -8909, -2505, 4111, -22776, -43305, -42644, -30210, -22439, -19593, -15128, -8658, 7775, 7394, 3268, 3977, -3534, -543, 7407, 4470, 2290, 1617, -2599, -1201, -1308, -13521, -11355, -5552, -221, 5851, -1843, -10355, -12329, -14825, -9541, -17698, -21753, -14120, -8576, -1750, -3776, -18547, -9071, 8969, 15194, 12041, 5614, -7581, -18036, -26269, -33924, -25819, -15105, -18633, -22061, -13986, 1111, -3911, -18825, -15024, -17854, -23260, -23996, -22635, -16514, -10383, -2917, -3297, -4061, -10683, -18635, -14893, -2690, 2605, 4670, 15902, 19140, 2314, -11557, -13047, -8430, 1038, -12361, -13712, -16226, -10200, -3857, -17302, -22059, -17900, -16645, -15072, -18959, -10555, -41, -5614, -12771, -10019, -220, -4825, -9805, -7401, -3539, -616, 6494, 9618, 7020, 5040, -10506, -11232, -13469, -7112, -1965, -544, 7661, -90]
4416i0J630n121m470M661J0926K892n554j7072j4722n332l932Q453K196J0327
4402a5208M559P113N256N6p936J1521r095j3357l30J1336m730k92q970j4649Q424
4387b6302L065P478O101J5903j792n613n828J237O550P299r572O936Q127L501
4373A7090Q297r322j1009j220l111r119K226J1306M354k0139k2909N661J6968
4360a0927K756L973r122q562k769j932P449j049j0138j014J2331N463M572M549
4346d420M930j396l854N446R260m233N099q256l414J3282M783p688o772n167j557
4331c957j399l966j4904N865Q533J3336p708k554n576k284p92L452K457k178m88
4316a2163J903j0661p454l109j195l066R494J8862J9833m922j6878j4546p898
$$ y = [-90, 1540, -3581, -8051, -3390, 7536, 10428, 4874, -12198, -26920, -32252, -36184, -27731, -25535, -15208, -10649, -3536, 1720, 1776, -6160, 5361, -3734, -17091, -17421, -6085, -10815, -11107, -20077, -34726, -26302, -23237, -15759, -9658, 6245, 4453, -1160, -6988, -5751, 799, 8098, -1474, 5462, 13589, 17090, 25387, 16065, 5056, 3836, 725, -8394, -6168, 5138, 9492, -10647, -33556, -27895, -10927, -8171, -4198, -13320, -21882, -24651, -26583, -19134, -20183, -30321, -31335, -19004, -13541, -8969, -4420, 510, -886, -4740, 706, 9966, 5733, 10832, 2576, -838, 12444, 17227, 9539, 2767, -2400, -3957, -5356, -9322, -24226, -18361, -9828, 3508, -4200, -6754, -12330, -14614, -15406, -11954, -9497, -11675, -12163, -10260, -20921, -28375, -31484, -32679, -35745, -26251, -7389, 12444, 7522, -9356, -23902, -31800]
4303c1800M991Q807R825R47P912K395N052j692r033J683o513r196j4751O762J2708
4288a1903j55N747J0562j1165r695L804M190r195K589M855N869q222j1811k508
4274b7038K03Q479J0671L913R704o412j948J2930J4499J1491J898m493J896j3688
4260B2105k0973j8837M784Q289P644N376J980j0494p641J0932j1216k974M023
4247g002j356Q376L383j1846r232K093R54N84k410R04O247n77j4169J589J2168
4232a0294j2356p491O146q113K2514O743p093j3351q233R346N567J0060N35N7
4218e963k183J079m3J923N92R046j447J1748N276j354p052j0830J6848R469j0231
4203A6878j7199M039M706N20P550L268j5977q035K329J614p853p563N019J1131
$$ y = [-31800, -26809, -18002, -8177, -7230, 682, 3077, 8129, 6437, -2596, -913, -7426, -16622, -31373, -24611, -11903, -12058, -6311, 4251, -6914, -16609, -12805, -8615, -17810, -15221, -10366, -4497, -12719, -24530, -27038, -26835, -18356, -7685, -3772, 5932, -480, -2428, 10502, 25001, 36492, 38390, 33897, 35793, 22105, 1132, -17705, -12921, -4632, 3012, 8388, 10368, -126, -7767, 3165, -8051, -11025, -7002, -8358, 18, 3401, -8445, -17677, -15584, -14630, -14046, -16456, -15552, -9305, -9882, -24051, -22462, -10294, -22650, -30141, -23995, -32108, -9594, -2851, -9944, -23295, -31528, -22182, -16615, -6555, -6020, -5963, -8146, -7067, -7110, -5187, -4595, 4451, 3004, 14752, 20028, 18674, 11622, 792, 17640, 27109, 16878, -321, 3718, 8424, 8944, 16494, 19762, 3785, -4250, -1921, -307, -8160, -15723, -10704, 427]
4189D27K863r279q996J0474P509P794N353o9j4944n4k648j0672j0768j933O615
4174a8328P708R075l44r255K237m643m412J788P41R855M414q412o133L733k914
4159a4890J453Q812k272q100J2025J7148J1783L052j2533j4203m374K531K73K109
4145B814K449m447o120k619K057R906N750j1183Q358P007q422j0038r483J562
4131a2409j43K484O450l465p052o658q750j379J6706K1181N321j3967p036J4474
4117E757Q982j4188M621K79M743K27o513n768J888j1116l755Q510J554j517M799
4102a497K632j0411j0950N672J0014j8755r16R181J0504j24k096R708M849M384
4088A2195P688r10m081m130j7401j7310L571J0844K425P964O096j940J134o69
$$ y = [427, 3290, -5989, -14985, -4511, 2998, 10792, 16145, 16076, 1132, 1078, -1570, -12242, -23010, -24943, -18328, -10620, -1545, -1889, -11144, -8907, -13550, -17962, -16174, -15433, -5578, -1164, -9576, -15709, -11976, -14890, -13437, -4625, -6897, -14997, -2972, 14176, 25959, 29011, 16478, 2275, -2099, 432, 705, 2814, 5263, 816, -5304, -7923, -5866, 4040, 9790, -1393, 6965, 13972, 5550, -4488, -13971, -12409, -12552, -10068, -3618, -7083, -14135, -20793, -29543, -30922, -14216, 6965, 12286, -1681, -8717, 5757, 14739, 551, 5172, 5451, 10194, 10421, 3908, -1860, 28, -11088, -14843, -6333, -4779, -6296, -1497, 1135, -9276, -20226, -14554, -4540, -23295, -24211, -15030, -4526, -4650, -6746, 2962, 7811, 12195, 19883, 18973, 14892, 10762, -6639, -23949, -20378, -9534, -7109, 855, 6951, 5011, 6145, 5476]
4074E476o429q008L439K532k062j3899k049J020J2163J1914l355M337J2628J0181
4060B7888o874j6490L970k845n536j545O285j673N83m133M616n05L778m601m894
4045a976J512O668K357o435o025j1239M543J2531P924n696K579L632q387j5493
4031a3505K188J1801j0229n0k691n077J1282J5586J5066l404n818j7008m203P898
4017A836n861Q741n56r907P755J0554K372p356r867n789O144n543Q449J6039O016
4002B3027k692r541M866J193m74j4545j1002j721Q267J1127R719k998O811J386
3988B3423l32K96j6335k3299q544R717O482n465j806l809m762M338m455J1314
3974a3237P354j1827j1556K362O992K409J5003k458p414K741M207j815Q949M44
$$ y = [5476, -953, -8961, -5522, -2990, -5052, -18951, -21000, -19980, -7817, 4097, 742, 5079, 17707, 27888, 21014, 4524, 8494, 5649, 113, -1432, 4853, 3180, 3763, -370, 4246, 3741, 7519, 2918, -1976, -464, 6204, 8561, 2126, -3899, -15138, -10595, 1936, 9860, 4164, 6743, 10375, 1988, -13505, -11317, 484, -9745, -9795, -12486, -17563, -6281, 9305, 24371, 20967, 15149, -1859, -6062, 1836, -4025, 4716, 4160, -5747, 2008, 12562, 14934, 7578, -2289, -8078, -1934, -7477, 972, 17011, 23027, 20335, 10794, 15660, 16853, 16379, 1834, -9168, -10889, -2622, 8505, 18224, 15226, 22037, 23423, 23091, 23387, 7052, -16247, -24791, -15074, -8592, -14057, -15863, -19672, -24434, -20096, -24551, -13237, -5883, -17710, -29266, -26904, -19912, -17503, -2500, -4958, -12372, -9631, -5424, -7239, 1710, 2154]
3960B154p277j4919j3481l339K1496J3754R835l898j3103o329p394j39P191J3404
3946b045j0275J100K695L198l071j6449N222R312r72n078l463K560l64J1175P544
3931A089m57J0185M022j119n637r084J279K39k519P951L633O510J1766j4011j687
3916A2160r571j1593l406q332j2883p875K986J7830N235O225R174l560m571r406
3902a7587M40O479P34P144P397l742j29l996q021J831k18m52p926m665J80P815
3886a4716J4048J519n065N831j31q663k716p137J1145K661p277J64m207l007m376
3871b1927j3816M966p1J5572J6864n521n124K511J0905P510L448j4966O736k135
3857D952J0959l961k38J677R094K11j6253o739J755N428j0121j7655K145r39j104
$$ y = [2154, -5123, -20042, -33523, -36862, -15366, -1612, 8223, 4325, -8778, -15107, -22501, -22640, -15449, -2045, -12320, -11220, -8525, -5327, -8398, -24847, -19625, -10313, -11285, -16363, -19826, -17266, -17630, -6455, 1089, 632, 10817, 14839, 13720, 8083, -1001, 278, 517, -2002, 5949, 9582, 16092, 27858, 13847, 12160, 2589, -9004, -12410, -20742, -33625, -41500, -38514, -20684, -15449, -9224, -50, -3610, -8181, -17587, -17147, -10668, -9934, -2790, 4607, 865, 736, -3260, -11281, -9450, -9668, -10120, -18046, -22711, -22531, -14716, -668, 851, -4214, 1617, 1486, -7177, -9893, -17030, -5885, -3224, -10501, -10337, -14544, -17551, -21927, -35743, -30777, -30848, -15276, 1588, -3933, -9057, -6546, 4359, 11869, 15317, 351, 7087, 4952, 15911, 11950, 11712, 13389, 22483, 22694, 6441, -298, 1457, 6885, -3236, -20891, -18746, -19685, -20789]
3842b0789k669j252N719J3594P56r758n213Q544Q857l763m18l281j4731r494l458
3827c7356J2794O310M886O612N049j0731N886l542p464J0794J755P85J909N244
3813B931k58J964j936j5447k877j527J171J3825l188J952o941J2p787j3878J546
$$ y = [-20789, -23458, -24710, -18991, -5397, -4641, -14399, -19612, -11068, -2211, -5974, -6392, -9673, -24404, -33898, -37356, -24562, -18252, -13366, -6754, -1705, -12436, -6550, -10092, -17556, -6762, -5007, -4222, -2313, 2931, 2673, 4637, 2701, -12746, -15623, -17150, -15979, -2154, -5342, -3390, -10331, -10319, -18106, -31984, -30438]
$$ [...]
##END NTUPLES=NMR SPECTRUM
##END=
