##TITLE=Analysis number 320170
Compound Code cc 51316
Book Reference 494/8
Project Code adrs
Chemist Name craigr
##JCAMPDX= 6.0         $$ Bruker NMR JCAMP-DX V2.0
##DATA TYPE= NMR SPECTRUM
##DATA CLASS= NTUPLES
##ORIGIN= Bruker BioSpin GmbH
##OWNER= nmr
$$ XWIN-NMR		Version 3.5
$$ Thu Jun 15 11:49:42 2006 GMT Daylight Time (UT+1h)  MAYBRIDGE\nmr@NMR_250MHZ
##.OBSERVE FREQUENCY= 250.131544655141
##.OBSERVE NUCLEUS= ^1H
##.ACQUISITION MODE= SIMULTANEOUS (DQD)
##.ACQUISITION SCHEME= undefined
##.AVERAGES= 16
##.DIGITISER RES= 18
##SPECTROMETER/DATA SYSTEM= dpx250
##.PULSE SEQUENCE= zg30
##.SOLVENT NAME= CDCl3
##.SHIFT REFERENCE= (INTERNAL, CDCl3, 0, 16.522)
##AUDIT TRAIL= $$ (NUMBER, WHEN, WHO, WHERE, WHAT)
$$ ##TITLE= Audit trail, XWIN-NMR		Version 3.5
$$ ##JCAMPDX= 5.01
$$ ##ORIGIN= Bruker BioSpin GmbH
$$ ##OWNER= nmr
$$ C:\u/data/dgb/nmr/ADRS/850/pdata/1/auditp.txt
$$ ##AUDIT TRAIL=  $$ (NUMBER, WHEN, WHO, WHERE, WHAT)
(   1,<2006-06-15 11:48:51.56 +100>,<MAYBRIDGE\nmr>,<NMR_250MHZ>,
      <created by zg, POWCHK disabled, PULCHK disabled
       configuration hash MD5:
       E2 DF 36 D8 04 B2 41 60 5A D7 A3 38 5A 4B D0 FE
       data hash MD5: 64K
       3A 65 92 12 CB D7 57 D0 17 76 C9 A0 FC 74 95 62>)
(   2,<2006-06-15 11:49:12.73 +100>,<MAYBRIDGE\nmr>,<NMR_250MHZ>,
      <Start of raw data processing
       ef LB = 0.3 FT_mod = 6 PKNL = 1 SI = 32K 
       data hash MD5: 32K
       32 80 F5 59 AE B6 92 F0 F2 8A 95 BF 19 3D 08 CC>)
(   3,<2006-06-15 11:49:14.45 +100>,<MAYBRIDGE\nmr>,<NMR_250MHZ>,
      <apk 
       data hash MD5: 32K
       95 97 17 40 03 D9 1D 3D 01 84 63 B7 34 89 94 F5>)
(   4,<2006-06-15 11:49:15.48 +100>,<MAYBRIDGE\nmr>,<NMR_250MHZ>,
      <abs ABSG = 5 
       data hash MD5: 32K
       65 1D C4 1F 19 F2 37 86 A5 9D 4F AF 4E 63 1C E1>)
$$ ##END=
$$ 
$$ hash MD5
$$ B4 DF 0C 3F 13 38 D8 F8 EA 90 F8 AA 20 9F 36 6A
##$RELAX= 
##$RELAX= 
##$RELAX= 
##$RELAX= 
##$RELAX= 
##$RELAX= 
##$RELAX= 
$$ Bruker specific parameters
$$ --------------------------
##$DU= <C:\u>
##$EXPNO= 850
##$NAME= <ADRS>
##$PROCNO= 1
##$TYPE= <nmr>
##$USER= <dgb>
##$AMP= (0..31)
100 100 100 100 100 100 100 100 100 100 100 100 100 100 100 100 100 100 
100 100 100 100 100 100 100 100 100 100 100 100 100 100 
##$AQSEQ= 0
##$AQ_mod= 3
##$AUNM= <au_zg>
##$AUTOPOS= <37 >
##$BF1= 250.13
##$BF2= 250.13
##$BF3= 250.13
##$BF4= 250.13
##$BF5= 500.13
##$BF6= 500.13
##$BF7= 500.13
##$BF8= 500.13
##$BYTORDA= 1
##$CFDGTYP= 0
##$CFRGTYP= 5
##$CHEMSTR= <none>
##$CNST= (0..31)
1 1 145 1 1 1 1 1 1 1 1 1 1 1 1 1 1 1 1 1 1 1 1 1 1 1 1 1 1 1 1 1 
##$CPDPRG= <>
##$CPDPRG1= <>
##$CPDPRG2= <>
##$CPDPRG3= <>
##$CPDPRG4= <mlev>
##$CPDPRG5= <mlev>
##$CPDPRG6= <mlev>
##$CPDPRG7= <mlev>
##$CPDPRG8= <mlev>
##$CPDPRGB= <>
##$CPDPRGT= <>
##$D= (0..31)
0 1 0 0 0 0 0 0 0 0.06 0 0 0 0 0 0 0.0002 0 0 0 0 0 0 0 0 0 0 0 0 0 0 
0 
##$DATE= 1150368529
##$DBL= (0..7)
120 120 120 120 120 120 120 120 
##$DBP= (0..7)
150 150 150 150 150 150 150 150 
##$DBP07= 0
##$DBPNAM0= <>
##$DBPNAM1= <>
$$ [...]
##$SUBNAM7= <"">
##$SUBNAM8= <"">
##$SUBNAM9= <"">
##$SW= 20.6930455092707
##$SWIBOX= (0..15)
0 0 3 0 0 0 0 0 0 0 0 0 0 0 0 0 
##$SW_h= 5175.983436853
##$TD= 65536
##$TD0= 1
##$TE= 295.16
##$TE2= 300
##$TE3= 300
##$TEG= 300
##$TL= (0..7)
0 120 120 120 120 120 120 120 
##$TP= (0..7)
150 150 150 150 150 150 150 150 
##$TP07= 0
##$TPNAME0= <>
##$TPNAME1= <>
##$TPNAME2= <>
##$TPNAME3= <>
##$TPNAME4= <>
##$TPNAME5= <>
##$TPNAME6= <>
##$TPNAME7= <>
##$TPOAL= (0..7)
0.5 0.5 0.5 0.5 0.5 0.5 0.5 0.5 
##$TPOFFS= (0..7)
0 0 0 0 0 0 0 0 
##$TUNHIN= 0
##$TUNHOUT= 0
##$TUNXOUT= 0
##$USERA1= <user>
##$USERA2= <user>
##$USERA3= <user>
##$USERA4= <user>
##$USERA5= <user>
##$V9= 5
##$VALIST= <valist>
##$VCLIST= <CCCCCCCCCCCCCCC>
##$VD= 0
##$VDLIST= <DDDDDDDDDDDDDDD>
##$VPLIST= <PPPPPPPPPPPPPPP>
##$VTLIST= <TTTTTTTTTTTTTTT>
##$WBST= 1024
##$WBSW= 4
##$XGAIN= (0..3)
0 0 0 0 
##$XL= 0
##$YL= 0
##$YMAX_a= 578849
##$YMIN_a= -696564
##$ZGOPTNS= <>
##$ZL1= 120
##$ZL2= 120
##$ZL3= 120
##$ZL4= 120
##$ABSF1= 16.522
##$ABSF2= -4.171173
##$ABSG= 5
##$ABSL= 3
##$ALPHA= 0
##$AQORDER= 0
##$ASSFAC= 0
##$ASSFACI= 0
##$ASSFACX= 0
##$ASSWID= 0
##$AUNMP= <proc_1d>
##$AZFE= 0.1
##$AZFW= 0.1
##$BCFW= 0
##$BC_mod= 0
##$BYTORDP= 0
##$COROFFS= 0
##$CY= 12.5
##$DATMOD= 1
##$DC= 0
##$DFILT= <>
##$DTYPP= 0
##$F1P= 14.0000005364418
##$F2P= -0.99999901652339
##$FCOR= 0.5
##$FTSIZE= 32768
##$FT_mod= 6
##$GAMMA= 0
##$GB= 0
##$INTBC= 1
##$INTSCL= 1
##$ISEN= 128
##$LB= 0.3
##$LEV0= 0
##$LPBIN= 0
##$MAXI= 10000
##$MC2= 0
##$MEAN= 0
##$ME_mod= 0
##$MI= 0
##$NCOEF= 0
##$NC_proc= -2
##$NLEV= 6
##$NOISF1= 0
##$NOISF2= 0
##$NSP= 0
##$NTH_PI= 0
##$NZP= 0
##$OFFSET= 16.522
##$PC= 1
##$PHC0= 171.5264
##$PHC1= 4.686844
##$PH_mod= 1
##$PKNL= yes
##$PPARMOD= 0
##$PSCAL= 4
##$PSIGN= 0
##$REVERSE= no
##$SF= 250.13
##$SI= 32768
##$SIGF1= 0
##$SIGF2= 0
##$SINO= 400
##$SIOLD= 32768
##$SREGLST= <1H.CDCl3>
##$SSB= 0
##$STSI= 32768
##$STSR= 0
##$SW_p= 5175.98343685301
##$SYMM= 0
##$S_DEV= 0
##$TDeff= 65536
##$TDoff= 0
##$TI= <Analysis number 999999
Compound Code 99
Book Reference 9
Project Code 9>
##$TILT= no
##$TM1= 0
##$TM2= 0
##$TOPLEV= 0
##$USERP1= <user>
##$USERP2= <user>
##$USERP3= <user>
##$USERP4= <user>
##$USERP5= <user>
##$WDW= 1
##$XDIM= 32768
##$YMAX_p= 358533722
##$YMIN_p= -28716
$$ End of Bruker specific parameters
$$ ---------------------------------
##NTUPLES= NMR SPECTRUM
##VAR_NAME=  FREQUENCY,     SPECTRUM/REAL,   SPECTRUM/IMAG
##SYMBOL=    X,             R,               I
##VAR_TYPE=  INDEPENDENT,   DEPENDENT,       DEPENDENT
##VAR_FORM=  AFFN,          ASDF,            ASDF
##VAR_DIM=   32768,         32768,           32768
##UNITS=     HZ,            ARBITRARY UNITS, ARBITRARY UNITS
##FACTOR=    0.157963299565203, 1,           1
##FIRST=     4132.6476996994, 0,             0
##LAST=      -1043.33573715361, 0,           0
##MIN=       -1043.33573715361, -28716,      0
##MAX=       4132.6476996994, 358533722,     0
$$ Real data points
##PAGE= N=1
##DATA TABLE= (X++(R..R)), XYDATA
$$ [...]
16917G287M915J930n201o770J247j196p504n02O608R86l204k61J329J499K25K6
16901A414j816J748O873m658j249M478j598K271O263N45m157o708n015K63K388
16886A042j717J651k53J045L633j035l13L053J807K150o354k417j41k949N935
16871E137O498n784L51M595l82M5k77k026n06k265J647j018n882Q540K287l383
16855G577N138M698L401o449n141q679J16J118N449j712o792K802O909P24K177
16840A1336J239j0588L799Q211m14L761J143o564m729n426r42k181k10J432mn0
16824a87K255N214J538l676k960P78o483q133N483N708O46l370l149K744R64m885
16808g513j41J295j195L699L494J82j086J518M245k280k366l47L32k345k919L6
$$ plain form
16917 7287 12202 14132 8931 2161 3408 2212 -5292 -5794 814 1800 -1404 -1665 -336 1163 1388 1414
16901 1414 -402 1346 8219 3561 2312 6790 5192 7463 13726 14271 10114 3406 -1609 -1346 1042
16886 1042 -675 976 723 1768 5401 4366 4053 7106 8913 11063 4709 2292 2151 -798 5137
16871 5137 11635 5851 6202 10797 10415 10460 10183 8157 7651 5386 7033 6015 133 8673 10960 7577
16855 7577 12715 17413 20814 14365 9224 545 661 1779 7228 5516 -1276 1526 8435 9159 11336
16840 11336 12575 1987 5786 13997 13583 17344 18487 11923 7194 1768 826 -1355 -1565 -133 -137 -187
16824 -187 2068 7282 8820 5144 2184 2962 -3521 -11654 -6171 -463 183 -3187 -6336 -3592 -2628 -7513
16808 -7513 -7654 -6359 -7554 -3855 -361 -179 -1265 253 4498 2218 -148 -495 -163 -2508 -5427 -5391
16792e391j625K145O811j058J967K720j574K152M162K318m120o322K72o112L66
16777c289Q300R089L691k681O181m70q311m213j609K642j811L070j226J567l007
16762G923j240M290M898p886K715k366o956m793K485M340P321M970l000n751L055
16747A0005r78p46P1o287J150Q64j928o073Q69m90j594K745M112n090j178Q766
16731D218L650n330k329L044k319m659J8K937m113j196J249o82Q588K824m164
16716A736o389K816K417l057N11P919K33m076L409N040k706j792J31l251J719
16701D660O110J108P09o138r314N216L360M230Q47JK687l780j888N59j90M536
16685A2713j22O54q873O24N315N941m384k183J114l772k514l61N146K123p0l029
$$ plain form
16792 -5391 -7016 -4871 1940 882 2849 5569 3995 6147 10309 12627 8507 2185 2457 -3655 -3289
16777 -3289 5011 14100 17791 15110 21291 20821 12510 8297 6688 9330 7519 10589 9363 10930 7923
16762 7923 6683 10973 15871 7985 10700 8334 1378 -3415 -930 3410 10731 15701 12701 6950 10005
16747 10005 9027 8281 8352 2065 3215 4079 2151 -3922 -3053 -3543 -5137 -2392 1720 -3370 -4548 4218
16731 4218 7868 2538 209 3253 934 -3725 -3707 -770 -4883 -6079 -4830 -5512 3076 5900 1736
16716 1736 -4653 -1837 580 -2477 -1966 5953 6186 2110 5519 10559 7853 6061 6192 2941 4660
16701 4660 10770 11878 12587 6449 -2865 2351 5711 9941 10788 10789 13476 9696 7808 8367 8177 12713
16685 12713 12591 13245 4372 4996 10311 16252 11868 9685 10799 7027 4513 4152 9298 11421 11351 8322
16669H322m991k280N91l946N256M951n266K561L063k828n65r84P24l743k951j641
16653c727k772O780L873N221Q452n938n447N098n808j088P492L561j694n381j0421
16638a799j674O030k852j350M60l520m009l545J34L551L602M706N494N330k132
16623H426j951m322P14Q956k736o982o77R69l695m913j139l324m94P905L115J711
16607A563L290K525k740p5k313Q53l142p624O399O319p85o322j863m440O26P492
16591b37M943M340l102j503M960k950k210j233M02j399k922O18R16N098N282k863
16575H140L831k408j1568j78L320K657L805r89J13j022o070m156K327M606l10
16560B098j940r61k424N198J0033k166j871N242J313q894m544k858r24N325N174
$$ plain form
16669 8322 3331 1051 1642 -2304 2952 7903 2637 5198 8261 5433 4868 3884 4608 865 -2086 -3727
16653 -3727 -6499 281 4154 9375 17827 11889 6442 11540 5732 4644 12136 15697 14003 8622 -1799
16638 -1799 -3473 2557 -295 -1645 -1185 -4705 -8714 -12259 -12125 -8574 -4972 -266 5228 10558 8426
16623 8426 6475 2153 2867 11823 9087 2105 1428 2397 -1298 -6211 -7350 -10674 -11168 -3263 -148 1563
16607 1563 4853 7378 4638 4563 2250 3103 -39 -7663 -1264 5055 4270 -2052 -3915 -8355 -7729 -237
16591 -237 4706 9046 5944 4441 9401 6451 4241 3008 3410 2011 -911 -293 623 5721 11003 8140
16575 8140 11971 9563 -2005 -2183 1137 3794 7599 6610 6723 5701 -369 -4525 -2198 2408 2098
16560 2098 158 -803 -3227 1971 12004 9838 7967 13209 14522 5628 1084 -1774 -2698 2627 7801
16545G801j0090r020n521o86N794K008M650l123M358L674k307l89m18K607M164
16530C502p89K253J064k022j051N231N856m551r096K920O89n55K277J265n616
16515A377m143m230J083J602J753k485j219M071R20M995l706m595n735K278M10
16500g624L892l322j81P53n346n346J1621M406L816O050j798M930O035o066n406
16485F414j094j2978N31Q337l081k791R14m40N834J575p003M701l276m917o00
16470g874M143Q031N546L660p18m028J28l01O573K176K178j022j1827o405j174
16455i14k402K941j663n384L310K328J987p45l301r718P912J0713R260q034m635
16440A655J921K994p752p49p02M964j413K480M283J70K170p01J13j589o960Q44
$$ plain form
16545 7801 -2289 -11309 -16830 -17516 -11722 -9714 -5064 -8187 -3829 -155 -2462 -2851 -3269 -662 3502
16530 3502 2713 4966 6030 4008 2957 8188 14044 9493 397 3317 4006 3451 5728 6993 1377
16515 1377 -2766 -6996 -5913 -4311 -2558 -5043 -6262 -2191 -1271 3724 18 -4577 -10312 -8034 -7624
16500 -7624 -3732 -7054 -7235 -6482 -11828 -17174 -5553 -1147 2669 8719 6921 11851 17886 11820 6414
16485 6414 5320 -7658 -7127 1210 -1871 -4662 -3748 -4188 1646 3221 -3782 919 -2357 -7274 -7874
16470 -7874 -3731 4300 9846 13506 12788 8760 8888 8587 15160 17336 19514 18492 6665 260 -914
16455 -914 -3316 -375 -2038 -7422 -4112 -1784 203 -542 -3843 -13561 -5649 5064 14324 6290 1655
16440 1655 3576 6570 -1182 -1931 -2633 2331 918 3398 7681 7851 10021 9320 9433 7844 884 1728
16424A728K442J744L317K437n564n718j438K038n9j814m32m845K56l893M55Q797
16408e49j561p12Q383J692l656N554j301k995p0R11K096R13L524n598p84K223
16392H070n83j797o691j113P204O208J063j4579m254K654p008k069J1134L324
16378A563m749O01k528o71k794k491J021N764L200m914M795K061L154j838n694
16363c520j45J23N787K882m410j12M900j066k725j800L288K336L392Rm641o349
16347b051L7n8M389J985m078n826k931O28o38m747n40P622M426j722L604L58J0584
16330A1042L05m087k944l754j123l531J088O1n415O438O655r70p69N311M891m10
16314A2788o679k530K39Q03N029l971p522j270R68p503k665p54m21J768J0380
$$ plain form
16424 1728 4170 5914 9231 11668 6104 386 -1052 986 927 -887 -1319 -6164 -5908 -9801 -9346 -549
16408 -549 -2110 -2822 5561 7253 3597 9151 7850 4855 4785 5696 7792 8705 12229 6631 5847 8070
16392 8070 7487 5690 -1001 -2114 5090 11298 12361 -2218 -6472 -3818 -10826 -12895 -1761 1563
16378 1563 -3186 -2585 -5113 -5784 -8578 -11069 -10048 -4284 -1084 -5998 -1203 858 4012 2174 -3520
16363 -3520 -3665 -3542 2245 5127 717 605 5505 4439 1714 -86 3202 5538 8930 8939 4298 -2051
16347 -2051 -2014 -2072 2317 4302 224 -5602 -8533 -7905 -8543 -13290 -13830 -6208 -1782 -3504 100 458 11042
16330 11042 11347 7260 4316 562 -561 -4092 -3004 -2943 -8358 -1920 4735 3765 2996 8307 13198 12788
16314 12788 6109 3579 3818 4621 9650 5679 -1843 -3113 -2145 -9648 -12313 -13067 -13488 -11720 -1340
16299a340J1376L19J909k529n761j18l306N458m135k078Q07m769o33K553n566
16284g813m918K051K526J647m819P38J625L448N98j907O255Q18l063J809o76N788
16268D107k086j700J903o781p750j23L268O163N123o503J818Q765m543P24J159
16253C544J803k357L010l518O7K753l414p533K788M675n242O49n130p62o41K291
16237g017M45N863N854L553j0055P05J2448M241q807j087j409o108l101j023L40
16222e158n69O04n392N47O196J930M754j1k444m48M087K983k686m440l634L766
16206H5M311m079m941j455N328L964R00K37P88p72k265k893l347o27M665L232
16190C131K957j34l257K801k738k351J761K087K48RJ512l762P28Q58k007j358
$$ plain form
16299 -1340 10036 10355 12264 9735 3974 3856 550 6008 1873 -205 602 -4167 -4800 -2247 -7813
16284 -7813 -12731 -10680 -8154 -6507 -11326 -10588 -8963 -5515 -4917 -6824 -569 249 -2814 -1005 -1681 4107
16268 4107 2021 321 2224 -4557 -12307 -12430 -9162 -2999 2124 -4379 -2561 6204 1661 2385 3544
16253 3544 5347 2990 6000 2482 2549 5302 1888 -5645 -2857 1818 -3424 -2775 -7905 -8667 -9308 -7017
16237 -7017 -6572 -709 5145 8698 -1357 -652 11796 16037 7230 6143 4734 -1374 -4475 -5498 -5158
16222 -5158 -5727 -5123 -10515 -9968 -3772 -1842 2912 2901 457 9 4096 7079 4393 -47 -3681 85
16206 85 4396 317 -4624 -6079 -751 3213 4113 4350 5138 4366 2101 -792 -4139 -4766 -101 3131
16190 3131 6088 5954 2697 5498 2760 409 2170 4257 4505 4514 6026 2264 2992 3850 1843 485
16174D85K68k821l556r07J085O827J1J830m23n710N69q32o554n379O521N843K25
16157b518r1j207j382M82K625j123L148P20p318j432q40N150O490K063k893j092
16141G82M287M579O05q43l162K424k143r92n125M609N049m892l673m346o135K367
16125f609j171J0928L106r406j199j478k814o70n30J447O018J95K494l469J467
16110a691o961K309Q724O20n635l579j232O790N667l943J55m832m494L606p50
16095e246M464L519j859L109J564j44K24n170n884J927l186k479O267P235O63
16080E004L551J669o676n512J641j393M387J989j767o259n294l2N581m725l017
16065a0853j140l175j340N995k77k628q73K975R532L373P15m345n902J553M422
$$ plain form
16174 485 753 -2068 -5624 -6531 -5446 1381 1392 3222 2799 -2911 -2342 -3174 -9728 -15107 -8586 -2743 -2518
16157 -2518 -2609 -3816 -5198 -4716 -2091 -3214 -66 654 -6664 -8096 -8936 -3786 2704 4767 1874 782
16141 782 5069 9648 10253 9410 6248 8672 6529 5537 412 5021 10070 5178 1505 -2841 -8976 -6609
16125 -6609 -7780 3148 6254 -3152 -4351 -5829 -8643 -9313 -9843 -8396 -2378 -2183 311 -3158 -1691
16110 -1691 -8652 -6343 2381 3001 -2634 -6213 -7445 -655 5012 1069 1224 -3608 -8102 -4496 -5246
16095 -5246 -782 2737 878 3987 5551 5407 5631 461 -5423 -3496 -6682 -9161 -2894 4341 5004
16080 5004 8555 10224 3548 -1964 -323 -1716 2671 4660 2893 -3366 -8660 -8692 -3111 -7836 -10853
16065 -10853 -11993 -15168 -16508 -10513 -10790 -13418 -14291 -11316 -1784 1589 2304 -2041 -7943 -6390 -1968
16050a968Q044K075L315q200L761l359J996m86O541K369o022p248j1413m737J706
16035a3626N537M422M515K469l673K138K938N70n893n477M629J535j957P105J1112
16020A6344n123r018Q55J238j545Q156O392n270q061K080K733k991j439l352m089
16005c090o565n403M714k422J432P988R21m008K729P580L774l649O122n267l409
15990A447R77K59m820J582Q668p02k301p436n452M910j948l305J844K558M018
15975B99j467L36M110K093q187K141j842n835N255l555j732N94J297l426J1025
15960A106K399q022k647M303J477k660q119k983L006M186k709j741R472N508L504
15945F080N273m426p040o492l119K320j036O507M291R0O505J3196l367j0957k719
$$ plain form
16050 -1968 6076 8151 11466 3266 7027 3668 5664 5178 11719 14088 8066 818 -10595 -15332 -13626
16035 -13626 -8089 -3667 848 3317 -356 1782 4720 5290 -603 -6080 -1451 84 -1873 5232 16344
16020 16344 11221 2203 3058 4296 2751 10907 17299 12029 3968 6048 8781 5790 4351 999 -3090
16005 -3090 -9655 -15058 -10344 -12766 -11334 -3346 -2425 -6433 -3704 3876 7650 4001 10123 4856 1447
15990 1447 2424 2683 -2137 -555 8113 7411 5110 -2326 -7778 -2868 -4816 -8121 -6277 -3719 299
15975 299 -1168 -832 3278 5371 -2816 -675 -2517 -8352 -3097 -6652 -8384 -7790 -6493 -9919 1106
15960 1106 3505 -4517 -7164 -2861 -1384 -4044 -12163 -15146 -12140 -7954 -10663 -12404 -2932 2576 6080
15945 6080 11353 6927 -113 -6605 -9724 -7404 -8440 -1933 2358 2448 8953 22149 18782 7825 5106
15930E106k714j3012j581N894K367K165J478l361K81k706o544K749P028L203O445
15915F798K966m889l975l281k479K048K097l960r035K577l793K96M605m65J458
15900i032J727L010O525J812K200l859k929L050K158j457q34K094M816r49n290
15885C042o62l365p99k347L663j969k674k571M224M030m461o706j477m7K675P341
15869b103k109k211N597k821j606o37Q024M181K917q050k558K632J642m072J397
15854B23j973m668k243M800N922m604l298M323o5n665K999L022J147n308n86K656
15838c318k318p41P056J256k604R33N84K80N924o42q684m221Q12K785k838L499
15822b237P311r16o697o119j838L109j353Q16m099M45P503P022L835m484r114
$$ plain form
15930 5106 2392 -10620 -12201 -6307 -3940 -1775 -297 -3658 -3377 -6083 -12627 -9878 -2850 353 6798
15915 6798 9764 4875 900 -2381 -4860 -2812 -715 -4675 -13710 -11133 -14926 -14630 -10025 -10490 -9032
15900 -9032 -7305 -4295 2230 4042 6242 2383 -546 2504 4662 3205 2371 4465 9281 8332 3042
15885 3042 2380 -985 -1784 -4131 -468 -2437 -5111 -7682 -3458 572 -3889 -10595 -12072 -12119 -9444 -2103
15869 -2103 -4212 -6423 -826 -3647 -5253 -5890 2134 6315 9232 1182 -1376 1256 2898 -1174 223
15854 223 -1750 -6418 -8661 -3861 2061 -2543 -5841 -1518 -1583 -7248 -4249 -1227 -80 -5388 -5974 -3318
15838 -3318 -5636 -6377 679 1935 -669 264 848 1128 7052 6410 -2274 -6495 -5683 -2898 -5736 -2237
15822 -2237 5074 4158 -2539 -8658 -10496 -7387 -8740 -7924 -12023 -11578 -4075 2947 6782 2298 -6816
15807f816m304L934N096M856k269j380r187l482K114J0659J768l600j873j243
15793e727L48N853O308k182q745k256K007O872j1k667J1011o207p156L222N042
15778E712k284R69J220J712M453K565l801m752n829j710K996m428o10J295l125
15763e617R716Q96j250j754P23M559l481m077l057n83p516m011l919L575L38l920
15747a9378M277J465j639Q75L218N057m244K191j409n509m38j873k702q16O817
15732a4108O193M411K631K431k822K24n677K81M869M000m866k725K292J0005L781
15717A0920k195K680J497j1160k439k875j560M293L549k416n871M709r53K646
15703H25R75n403o025J60O430M804J349L834K329n406l771j803J310J779K608
$$ plain form
15807 -6816 -11120 -7186 -2090 2766 497 -883 -10070 -13552 -11438 -779 989 -2611 -4484 -5727
15793 -5727 -5379 474 6782 4600 -4145 -6401 -4394 2478 2467 -200 10811 4604 -2552 670 5712
15778 5712 3428 4397 5617 7329 11782 14347 10546 5794 -35 -1745 1251 -3177 -3787 -2492 -5617
15763 -5617 4099 4995 3745 1991 2714 7273 3792 -285 -3342 -3925 -11441 -15452 -19371 -15796 -15458 -19378
15747 -19378 -15101 -13636 -15275 -14400 -11182 -6125 -10369 -8178 -9587 -15096 -15534 -17407 -20109 -20925 -14108
15732 -14108 -7915 -3504 -873 1558 -1264 -1040 -6717 -6436 -1567 2433 -2433 -5158 -2866 7139 10920
15717 10920 8725 11405 12902 1742 -697 -3572 -5132 -839 2710 294 -5577 -868 -1821 825
15703 825 1800 -3603 -9628 -9468 -3038 1766 3115 6949 9278 3872 101 -1702 -392 1387 3995
15688C995l634M073L83L07L953M556n561q154k514q26l16l821K190P150l4p5L022
15671D694m80j575j347L97K119J862l99j337L796m038j096O22J893M415M161l745
15655I942m64M660J317K674L821R724J0494J635l41M866N489O441n29k953K33
15640E7009p180j2436j099q388r248p323k645L97P936j608j040P79K431l150l733
15625A0702R3P96P815j458r247k858m71m195j344J475k955K271j272q77J41P132
15609E748M518k805n248j31j650L525L871l80K751l203m314J540m26N039q298
15594E37l777L263j263j43J229J176j117N086L981n691L6L955J99m023R41k642
15578A747l1o264m468j172l103K533O954L302M144j107k643Q81j78L01j280p023
$$ plain form
15688 3995 361 4434 4817 5124 9077 13633 8072 -82 -2596 -3422 -3738 -7559 -5369 1781 1747 1672 4694
15671 4694 4214 2639 1292 1689 3808 5670 5271 3934 7730 3692 2596 3218 5111 9526 13687 9942
15655 9942 9478 14138 15455 18129 21950 31674 42168 43803 43462 48328 53817 60258 59729 56776 57009
15640 57009 49829 37393 36294 27906 18658 11335 8690 9087 17023 15415 14375 15154 17585 14435 10702
15625 10702 10795 11591 19406 17948 8701 5843 5372 1177 -167 1308 -1647 624 -648 -1525 -1384 5748
15609 5748 10266 7461 2213 2082 432 3957 7828 7448 10199 6996 2682 4222 3796 8835 537
15594 537 -3240 23 -1240 -1383 -154 1022 -95 4991 8972 3281 3317 7272 7471 3448 4389 1747
15578 1747 1716 -4548 -9016 -10188 -13291 -10758 -3804 -502 3642 2535 -108 773 595 896 -384 -7407
15562g407k374O555K944j028k477L545n322L140N029P65j567k152K096K148k798
15547A097R3j0512m230P391J0940N96Q46K965l44Kk125J947K716N28Q68n622n614
15530A542p646l106o787K367M784j649m890M702Q627M595k692O93j888J206L160
15515C018m094k578L625l670M71k2P237N651q849m76J42n836k464O983K361J398
15499B897R136k274j708M628M61j0772j0133o70K010l635m581P71L974L902J801
15484d193K218Q495J369l479l381p480J841l240j066R552J050o82o42p808K901
15469d545n68K136j14L41L459M787j11Q786j727q120n246o255l986k221L835M091
15453e458k649l974K639Q534k600n913O858R17o184o65M600N715l57l36l973r723
$$ plain form
15562 -7407 -9781 -3226 -282 -1310 -3787 -242 -5564 -2424 2605 3370 1803 -349 1747 3895 1097
15547 1097 1190 -9322 -13552 -6161 4779 5375 6221 9186 8842 8844 6719 8666 11382 11910 12778 7156 1542
15530 1542 -6104 -9210 -15997 -13630 -8846 -10495 -15385 -10683 -2056 2539 -153 540 -1348 -142 3018
15515 3018 -1076 -3654 -29 -3699 -3228 -3250 3987 9638 789 313 455 -5381 -7845 -862 1499 2897
15499 2897 12033 9759 8051 12679 13140 2368 -7765 -8435 -6425 -10060 -14641 -13870 -9896 -5994 -4193
15484 -4193 -1975 6520 7889 4410 1029 -6451 -4610 -7850 -8916 636 1686 1004 362 -7446 -4545
15469 -4545 -5113 -2977 -3091 -2750 709 5496 5385 14171 12444 4324 -922 -7177 -11163 -13384 -9549 -5458
15453 -5458 -8107 -12081 -9442 -908 -3508 -9421 -2563 -1646 -7830 -8495 -3895 1820 1463 1127 -2846 -12569
15437a2569o256l851M318N096N598q53k799l391j250P804m404q342J056P774Q153
15422c916K678l505m25r79M805k672o57L002K178q00n692j544K368N958j324L815
15406C290l30l785k899J637j785p67N976J670j196q46q423k720j106Mp66l057
15390a5103Q031R216k405o170l447P30Q997j029O44l746K991J324L035j442p825
15375f199K409N529n81m244l73L496o78j901J615M487p632k481M540k255k572
15360f840q100p287J0637M800o91O23O907k872k997p89j23M879J860p74r67l447
15344e181N164J718P829N970r529m128o194k107L679J483j174r328J069m676p79
15329a6184k49n64M314J993k494J778l93R555m126j571m128k27Q282N014l670
$$ plain form
15437 -12569 -18825 -22676 -18358 -13262 -7664 -8517 -11316 -14707 -15957 -8153 -12557 -20899 -19843 -12069 -3916
15422 -3916 -1238 -4743 -5168 -6147 -1342 -4014 -4671 -1669 509 -291 -5983 -7527 -5159 799 -525 3290
15406 3290 2960 -825 -3724 -2087 -3872 -4639 1337 3007 1811 965 -7458 -10178 -11284 -11280 -12046 -15103
15390 -15103 -7072 2144 -261 -6431 -9878 -9148 -151 -1180 -536 -4282 -1291 33 3068 1626 -6199
15375 -6199 -3790 1739 1158 -3086 -3459 37 -641 -2542 -927 3560 -4072 -6553 -2013 -4268 -6840
15360 -6840 -14940 -22227 -11590 -6790 -7481 -6858 49 -2823 -5820 -6609 -6732 -1853 7 -767 -1734 -5181
15344 -5181 -17 1701 9530 15500 5971 1843 -4351 -6458 -2779 -1296 -2470 -11798 -10729 -15405 -16184
15329 -16184 -16433 -16997 -12683 -10690 -13184 -11406 -11799 -2244 -6370 -7941 -12069 -12296 -4014 1000 -2670
15314b670L026j14j661q083o14K383j438j481O181K161K409j311M955Q762M878
15299A7383o625k580R38N51l776n799o850o391N29L372N50J724J391N451J892
15284A760L695r95k601m222n947j751J191L802L820M360N35j046o563k551o97
15269g210j865k590J454k497j671J872K636O03k027Q323O374n875l473L504n732
15254h174k03N452K186q30j33M648L024j998m4O883k42j214k645n453J741l24
15238B674N65J871m757p464l255n56M497J886J127M296K159o009O92m639J26K616
15222d171K563K869l209j526J568J720L111j529N31N391K260l407r005l549M215
15207b168p6k01j358M562n362k215M576N629k220K976O42r036J132m501l632O601
$$ plain form
15314 -2670 356 242 -1419 -9502 -10116 -7733 -9171 -10652 -4471 -2310 99 -1212 3743 12505 17383
15299 17383 10758 8178 9116 9667 5891 92 -6758 -13149 -12620 -9248 -8698 -6974 -5583 -132 1760
15284 1760 5455 4460 1859 -2363 -8310 -10061 -8870 -5068 -1248 3112 3647 2601 -3962 -6513 -7210
15269 -7210 -9075 -11665 -10211 -12708 -14379 -12507 -9871 -9268 -11295 -2972 3402 -2473 -5946 -2442 -8174
15254 -8174 -8377 -2925 -739 -1569 -1702 2946 5970 3972 3928 10811 10569 9355 6710 1257 2998 2674
15238 2674 3239 5110 353 -7111 -10366 -10922 -6425 -4539 -3412 884 3043 -2966 -2274 -6913 -6787 -4171
15222 -4171 -1608 1261 -1948 -3474 -1906 -186 2925 1396 1927 7318 9578 6171 -2834 -6383 -2168
15207 -2168 -2244 -2445 -3803 759 -4603 -6818 -2242 3387 1167 4143 4785 -4251 -3119 -7620 -11252 -4651
15191d651Q9j996o124j1544k782M527M440P392j569j033L09M019L150l657k101
15176a1531k57P13l654m570j329o44J0783M860M552l709r74m029j0813K47O894
15161a3461O231n60L458m17K215L355J114k872M900K47n175l924l672N0q21k105
15145a1437J788O964R03n81j237o788R8J268r38P027J748k008m299n919K590N453
15129e368O388j14p563M285m93p668j805O521P012O865Q66o042n23k054n329k323
15113g345M865K530k96q50l126J347L803q074j618k262P27M885Q988n80q71k892
15097g69n886K241k726o566M405R013P175L029k176m805j1358m473P346L348k897
15082e099n66l915N570O538j461n731q675L495L061o06l027K504J382K946k572
$$ plain form
15191 -4651 -4562 -6558 -12682 -24226 -27008 -22481 -18041 -10649 -12218 -13251 -12942 -8923 -5773 -9430 -11531
15176 -11531 -11788 -11075 -14729 -19299 -20628 -21272 -10489 -5629 -1077 -4786 -5760 -9789 -20602 -20355 -13461
15161 -13461 -7230 -7790 -4332 -4749 -2534 821 1935 -937 3963 4210 -965 -4889 -8561 -8511 -9332 -11437
15145 -11437 -9649 -2685 -1782 -2363 -3600 -10388 -10290 -9022 -9960 -2933 -1185 -3193 -7492 -13411 -10821 -5368
15129 -5368 1020 906 -6657 -2372 -2865 -10533 -12338 -5817 1195 8060 8926 2884 2361 307 -5022 -7345
15113 -7345 -2480 50 -246 -1096 -4222 -2875 928 -7146 -8764 -11026 -10299 -5414 3574 2994 2123 -769
15097 -769 -6655 -4414 -7140 -13706 -9301 -288 6887 9916 7740 2935 -8423 -12896 -5550 -2202 -5099
15082 -5099 -5665 -9580 -4010 2528 1067 -4664 -13339 -9844 -6783 -7389 -10416 -7912 -6530 -3584 -6156
15067f156M762O87K060Q093k704n550q795L635N196r16l475l039j568M74J973
15052e323R20l997j742J225L752L290K153K911M727j618n727m291K353K247n393
15037d513l156j0451k874O538P110N411o25L399K672m940q103o9J237n30O294
15022b600K636l454k274m205J119M094L356K754k027m58N944N795l946q724N368
15007C378K540j435J272J4Q783L388K588n99J696J090M004k462M508N541P759
14992D2065O453J0391Q427R525K9505M3532O1829R2226J57480K75668M43626M35570
14980A616297J02087j00555N465J2536m14417m74938k49934j28334o9027m7201
14970B51979l8671j9668j1568k2483j2813j0888j2661j3813q613q257o904j125
$$ plain form
15067 -6156 -1394 -707 1353 9446 6742 1192 -7603 -3968 1228 312 -3163 -6202 -7770 -7296 -5323
15052 -5323 -4403 -8400 -10142 -8917 -5165 -1875 278 3189 7916 6298 571 -3720 -1367 880 -4513
15037 -4513 -7669 -18120 -20994 -14456 -7346 -1935 -2560 839 3511 -1429 -9532 -9601 -8364 -8894 -2600
15022 -2600 36 -3418 -5692 -9897 -8778 -4684 -1328 1426 -601 -1059 4885 10680 6734 -1990 3378
15007 3378 5918 4483 5755 5769 14552 17940 20528 19929 21625 22715 26719 24257 28765 34306 42065
14992 42065 48518 58909 67336 76861 106366 149898 211727 303953 461433 737101 1180727 1616297
14980 1616297 1718384 1617829 1623294 1635830 1221413 746475 496541 368207 299180 251979
14970 251979 213308 193640 182072 159589 146776 135888 123227 109414 100801 92544 85640 84515
14958H4515o048J859J919m881p094m884K892P700r881o448K140k367p021J136
14944E3537l131n41j103j705K467J219o572l10q380n721N55M11P02L091L244o37
14928C7126n699l962R91p901k388q18l705K189P023J084m185j561p51K743J656
14913B1842k01k315j901p83J068j645l299r70n525M633n296m701K361L306n17
14898F057L660r93j456l848J505L003M474N90r091o725k774K412k596n59L881
14883b460K756K915M765Q43o11k542n352J841J932K150l296n450j024j706l908
14868i147m584N213J386r245l101o923k315N364o31r44Q489R354k292L569n06
14853f313O138n794q184K142J278o98O039O535O370r35o558n288j0773m628O404
$$ plain form
14958 84515 78467 80326 82245 77364 70270 65386 68278 75978 66097 59649 61789 59422 52401 53537
14944 53537 50406 49865 48762 47057 49524 50743 44171 43861 35481 29760 30315 30726 31428 34519 37763 37126
14928 37126 31427 27465 28456 20555 18167 17349 13644 15833 22856 23940 19755 18194 17443 20186 21842
14913 21842 21641 19326 17425 16642 17710 16065 12766 11796 6271 10904 5608 907 3268 6574 6057
14898 6057 9717 8724 7268 3420 4925 7928 12402 12992 3901 -2824 -5598 -3186 -5782 -6341 -2460
14883 -2460 296 3211 7976 8819 8208 5666 314 2155 4087 6237 2941 -2509 -3533 -5239 -9147
14868 -9147 -13731 -8518 -7132 -16377 -19478 -26401 -28716 -23352 -23983 -24927 -16438 -7084 -9376 -5807 -6313
14853 -6313 -175 -5969 -14153 -12011 -10733 -11431 -5392 1143 7513 6578 20 -5268 -16041 -20669 -14265
14838a4265J0076m923o624J970L960Q535M06p251N66Q973P082k383j846o511n315
14823g550M02k404k603N002J914k145j379R718m4j309q613m472O916K356l677
14808g888N956J772j525J458P41n878k248k46q25j294K02j20R010N087k269o455
14792d522r9l961l3n30J592r20j576J667M943l58K781l88K979M639m504n440L575
14775a55J95j081k937L077J976L059k284p118j827P628L139n251l022l365M762
14760c204M630O136n575l207J230n514p94M641M411n396l092j506K826j230J162
14745d482l383o3J572K807mj833m01j794K735l276l218j491j902r16k139K63j792
14728a9317O840N948N863K998o478l620k864R48K670K840j381l839j643M648J833
$$ plain form
14838 -14265 -4189 -9112 -15736 -13766 -9806 -1271 -865 -8116 -7550 1423 8505 6122 4276 -2235 -7550
14823 -7550 -7148 -9552 -12155 -7153 -5239 -7384 -8763 955 911 -398 -9011 -13483 -6567 -4211 -7888
14808 -7888 -1932 -160 -1685 -227 514 -5364 -7612 -7858 -8683 -9977 -9775 -9895 -885 4202 1933 -4522
14792 -4522 -4621 -8582 -8615 -9145 -7553 -8473 -10049 -8382 -3439 -3797 -1016 -1404 1575 6214 1710 -3730 -155
14775 -155 40 -1041 -3978 -901 1075 4134 1850 -5268 -7095 533 3672 -1579 -4601 -7966 -3204
14760 -3204 1426 7562 1987 -1220 10 -5504 -6298 -1657 2754 -2642 -5734 -7240 -4414 -5644 -4482
14745 -4482 -7865 -7928 -6356 -3549 -3553 -5386 -5787 -7581 -4846 -8122 -11340 -12831 -14733 -15649 -17788 -17525 -19317
14728 -19317 -12477 -6529 -666 2332 -4146 -7766 -10630 -9682 -7012 -4172 -5553 -9392 -11035 -6387 -4554
14713d554K481J670k285O10K41K25k200K425l285n197j43K266j107l662k056J779
14697a2792M849j975N211O389k969n376O71l539J272O982L1k754j447j842K118
14682e171p366L589N611L726o6q777K394k415j526O761N857J405k369l686n414
14667g447K530L308o00L095O67J359n709p884o921o38l833k10O964K963M818k934
14651a0472n908n904R713r65J589K452L482o919o047j960K928R304J1199k895
14637d03m001o544n539l609N462N329M135L300j032R72l784k473K846K25J522
14622c594k331J320p277m783n831M51M069O66J680Q56k56J436q811K335N52j811
14606b1329K670M642M555O685k328K92p778N494L150P60o902k078M390k896j812
$$ plain form
14713 -4554 -2073 -403 -2688 -2078 -1837 -1612 -3812 -1387 -4672 -9869 -10012 -7746 -8853 -12515 -14571 -12792
14697 -12792 -7943 -9918 -4707 1682 -1287 -6663 -5992 -9531 -8259 -1277 -1246 -4000 -5447 -7289 -5171
14682 -5171 -12537 -8948 -3337 389 323 -8454 -6060 -8475 -10001 -3240 2617 4022 1653 -2033 -7447
14667 -7447 -4917 -1609 -2209 886 1553 2912 -2797 -10681 -17602 -18240 -22073 -22283 -15319 -12356 -7538 -10472
14651 -10472 -16380 -22284 -12571 -13536 -11947 -9495 -6013 -12932 -18979 -20939 -18011 -8707 2492 -403
14637 -403 -4404 -10948 -16487 -20096 -14634 -9305 -5170 -1870 -2902 -1930 -5714 -8187 -5341 -5116 -3594
14622 -3594 -5925 -4605 -11882 -16665 -22496 -22045 -17976 -17310 -15630 -14774 -15030 -13594 -22405 -20070 -19518 -21329
14606 -21329 -18659 -14017 -9462 -2777 -5105 -4813 -12591 -7097 -3947 -3187 -10089 -12167 -7777 -10673 -12485
14591a2485P80J914j076Q022j090O80L35l542J293j143q35r64j223m07j69O576
14575c334n445p360L30N948P678Q425M20k617j3396l445M330l662l94O929J3733
14560H140m51m159n891k999M901P471k487J152m892J624m879j624M023k374r742
14545a2187L679l996m147M949N958J562M071L249j629j774q161k796R00L508l79
14530g193J099k631k758N396R03p731m635M173j689q15J413L176o51n446O6L292
14514a4031k785j117N706J714j9l937K62m262L133L850L626l047j607N159N503
14499a852j684l125o543m53J893m40m539N888N924P68J405k987o737l65k847k966
14483a8660K570K953N457l68O816L34k470k54J93k056N930j451M813R418o557
$$ plain form
14591 -12485 -11705 -9791 -10867 -2845 -3935 -3255 -2920 -6462 -5169 -6312 -7147 -8111 -9334 -9741 -9910 -3334
14575 -3334 -8779 -16139 -15809 -9861 -2183 6242 6662 4045 -9351 -12796 -8466 -12128 -12522 -5593 8140
14560 8140 7689 3530 -2361 -5360 -459 7012 4525 5677 785 2409 -2470 -4094 -71 -2445 -12187
14545 -12187 -8508 -12504 -16651 -11702 -5744 -4182 -111 3138 1509 -265 -8426 -11222 -10322 -6814 -7193
14530 -7193 -6094 -8725 -11483 -6087 -5184 -12915 -17550 -13377 -15066 -15881 -14468 -11292 -11943 -17389 -17323 -14031
14514 -14031 -16816 -17933 -12227 -10513 -10532 -14469 -14207 -18469 -15336 -11486 -7860 -10907 -12514 -7355 -1852
14499 -1852 -3536 -6661 -13204 -13657 -11764 -12204 -16743 -10855 -4931 -4163 -2758 -5745 -12482 -12847 -15694 -18660
14483 -18660 -16090 -13137 -7680 -8048 -1232 -898 -3368 -3622 -3429 -5485 445 -1006 3807 13225 6668
14468F668p817k123J504j690q00q75O37l022K694J238M455o981o490J97K355O153
14452c897K661m055m835K033k161l272j692N95O180M361O239L007K34j013j0060
14437e675k881J727p591m971k417J988j698l100l764N508P225N081R318p57j333
14422c340J806K650P10J031L352l491K795K049m004k951K694J55K869o205m192
14407d072K691l334p355l671m864L708K895L199P27m42M006K756m930l139m913
14392a6738M26k865O262K711O77k414l102K324M471K660L02p50J611K617k540
14377d348k078j005K145j802k394M51J452K750P46j698J429O741j0625m797M053
14362h980m185L62N917P159k507n85K754O101K01n624n560k190L876O549P01k003
$$ plain form
14468 6668 -1149 -3272 -1768 -3458 -4258 -5133 -4496 -7518 -4824 -3586 869 -6112 -12602 -12405 -10050 -3897
14452 -3897 -1236 -5291 -10126 -8093 -10254 -13526 -15218 -14623 -8443 -4082 2157 5164 5398 4385 -5675
14437 -5675 -8556 -6829 -14420 -19391 -21808 -19820 -21518 -24618 -28382 -22874 -15649 -10568 -1250 -2007 -3340
14422 -3340 -1534 1116 1826 2857 6209 2718 5513 7562 3558 607 3301 3456 6325 120 -4072
14407 -4072 -1381 -4715 -12070 -15741 -20605 -16897 -14002 -10803 -10076 -10518 -6512 -3756 -8686 -11825 -16738
14392 -16738 -16312 -19177 -12915 -10204 -9527 -11941 -15043 -12719 -8248 -5588 -5286 -6036 -4425 -1808 -4348
14377 -4348 -6426 -7431 -5286 -7088 -9482 -9031 -7579 -4829 -4083 -5781 -4352 2389 -8236 -13033 -8980
14362 -8980 -13165 -12803 -6886 273 -2234 -2819 -65 6036 6237 613 -4947 -7137 -3261 3288 3989 1986
14346A986M68K44o53j540q47o267j290K530J77K828j927l317l245n32M611N126
14330a648K086p405N12K39l591L113L553K496J927J836k895j510j0138m087P694
14315g818k254m259q25K391o8o365N305m555K241N670k465L200m920q35M391o26
14299a1792P34K38M073n00q150k58J3341K703l248J185N70L37M352M260o625n672
14283d452l247K839K32J433L105P74k398r175j497m599J429n11j367R91n538K401
14267a9580M339P806P439n320n099j331M651l354k183m141L825J1472O728p033
14253a781M868L993o149k183m976k188l062l169K400j661K449J299m546n956J224
14238a9438L900K384J302J289l337l488J319J575M001N419O619J355k245l409
$$ plain form
14346 1986 2454 2698 2045 505 -342 -6609 -7899 -5369 -5192 -2364 -4291 -7608 -10853 -11385 -6774 -1648
14330 -1648 438 -6967 -6455 -6216 -9807 -6694 -3141 -645 1282 3118 223 -1287 -11425 -15512 -7818
14315 -7818 -10072 -14331 -15156 -12765 -12833 -19198 -13893 -18448 -16207 -10537 -13002 -9802 -14722 -15557 -11166 -11792
14299 -11792 -11058 -10820 -6747 -7247 -15397 -15655 -2314 389 -2859 -1674 -1104 -767 3585 7845 1220 -4452
14283 -4452 -7699 -4860 -4628 -3195 -90 684 -1714 -10889 -12386 -16985 -15556 -16067 -17434 -16443 -21981 -19580
14267 -19580 -15241 -7435 4 -5316 -10415 -11746 -7095 -10449 -12632 -16773 -12948 -1476 5252 -1781
14253 -1781 3087 7080 931 -1252 -6228 -8416 -11478 -14647 -12247 -13908 -11459 -10160 -14706 -20662 -19438
14238 -19438 -15538 -13154 -11852 -10563 -13900 -17388 -16069 -14494 -10493 -5074 1545 2900 655 -2754
14224b754j0531k801l03L557J608j944q337L179L556M243j650K913L269L967M533
14209B505o462p712M925Q769o91n077K619K809L52M413j080J961j214p135k847
14194c865m188j307L84r42j983N115l708n677L391O719M552K563N615n88j2101
14179f020p684O33J211P321M11l272l737p031R04R348M586O760j313n311M776
14164A582k923K813k050l536j627k956k934J59O486O47K988O671q728m655R719
14149A656P45q282o467L850J754O185l120k191J53k246j353J622N665m59p133
14134i621q671L98j311K75M909N244k595m752J627N622J752M990L133R1j369m788
14118e066p978q17L665m058k18K935J0711K372j216j785j452l430l535K602L496
$$ plain form
14224 -2754 -13285 -16086 -16389 -12832 -11224 -13168 -21505 -18326 -14770 -10527 -12177 -9264 -5995 -2028 2505
14209 2505 -3957 -11669 -6744 2025 1334 -3743 -1124 1685 2037 6450 5370 7331 6117 -1018 -3865
14194 -3865 -8053 -9360 -8976 -9918 -11901 -6786 -10494 -16171 -12780 -6061 -1509 1054 6669 6081 -6020
14179 -6020 -13704 -13071 -11860 -4539 -4128 -7400 -11137 -18168 -17264 -7916 -3330 3430 2117 -3194 1582
14164 1582 -1341 1472 -578 -4114 -5741 -8697 -11631 -11472 -4986 -4339 -1351 5320 -3408 -8063 1656
14149 1656 2401 -5881 -12348 -8498 -6744 -559 -3679 -5870 -5717 -7963 -9316 -7694 -2029 -2488 -9621
14134 -9621 -18292 -17894 -19205 -18930 -14021 -8777 -11372 -16124 -14497 -8875 -7123 -2133 1000 1091 -278 -5066
14118 -5066 -13044 -13861 -10196 -14254 -14472 -11537 -826 1546 330 -1455 -2907 -6337 -9872 -7270 -3774
14103c774J997m556P85k173j280j191M575N252L235J083J747P86l031M560k322
14088E693m969N746L964j0915j0345o738K458Q691J2953R046L437l337j16P96
14074A6364O470M152k154R396J0661R175L46K717P140P915j80L133L554O787R832
14059I5308n537j0905r37m98j402p468N859l201j1507m677q619o958o570p309
14045B5579m249j695K403N731n50l115K617J428n556o230n831L645k50K406q419
14030G914Q26L779p944m217K711M604j569o78K266P154k160p780j32k144L008
14015E638k260o301k774L616j304K625j152K346K157j358j671K003l851M521N456
14000G691m10k297k794k785N739L493J761o69O62l143j0731m267L069m96j072
$$ plain form
14103 -3774 -1777 -6333 -5548 -7721 -9001 -10192 -5617 -365 2870 3953 5700 6486 3455 8015 5693
14088 5693 724 6470 10434 -481 -10826 -17564 -15106 -6415 6538 15584 19021 15684 15568 16364
14074 16364 22834 26986 24832 34228 44889 54064 54410 57127 64267 72182 72002 75135 78689 85476 95308
14059 95308 89771 78866 77929 77431 76029 68561 74420 71219 59712 55035 46416 39458 32888 25579
14045 25579 21330 19635 22038 27769 27219 24104 26721 28149 22593 16363 10532 14177 13927 16333 7914
14030 7914 8740 12519 4575 358 3069 7673 6104 5426 7692 14846 12686 4906 4774 2630 5638
14015 5638 3378 -2923 -5697 -2081 -3385 -760 -1912 434 2591 1233 -438 1565 -2286 2235 7691
14000 7691 7281 4984 2190 -595 5144 8637 10398 9729 10391 7248 -3483 -7750 -4681 -5177 -6249
13985f249J142m199j009l29m041m38Q560K566o365N159o23J627K688M444L712
13970F645k303m786n47J97K303j072m071J977m461l094O98j160M953O113j599
13955b07L795n740m461o68k15M385M988K671J746j498j0346q336M966M321L236
13940a363N334r28p453K433J501j521q64J147O151O416j555m172j1964n00K417
13925d921K825K667j641K15J222k693K559K131k174L6J650l106k645k976J867
13910d984j131k523M552J386L057j947L222n453l983j136j358l731P405J1153
13896D529J424N341L53o433J312o60m476p125o66K651J750R81k240p511j573K273
13880a0070j056L987Q020M619M236O14q369o544P749K867p775J132L900o740j386
$$ plain form
13985 -6249 -5107 -9306 -10315 -10644 -14685 -15123 -6563 -3997 -10362 -5203 -5826 -4199 -1511 2933 6645
13970 6645 4342 -444 -991 -794 1509 437 -3634 -1657 -6118 -9212 -8514 -9674 -4721 1392 -207
13955 -207 3588 -2152 -6613 -7281 -7496 -3111 1877 4548 6294 4796 -5550 -13886 -8920 -4599 -1363
13940 -1363 3971 3043 -4410 -1977 -476 -1997 -2861 -1714 4437 10853 9298 5126 -6838 -7338 -4921
13925 -4921 -2096 571 -1070 -855 367 -2326 233 2364 190 226 1876 -1230 -3875 -6851 -4984
13910 -4984 -6115 -8638 -4086 -2700 357 -1590 1632 -3821 -7804 -8940 -10298 -14029 -6624 4529
13896 4529 5953 11294 11647 5214 6526 5866 1390 -5735 -6401 -3750 -2000 -1019 -3259 -10770 -12343 -10070
13880 -10070 -11126 -7139 881 5500 9736 10350 1981 -4563 3186 6053 -1722 -590 3310 -3430 -4816
13865d816K057M255k841L354O152O901q943n101K091P57K235l870j927p31j795
13850b222K656N47Q961K076q205n889o32K302m66M620j242o243M841J474J419
13835C997j293q38k504M748l504q51j498J395N065m60K288j975q158M14N99m391
13819f966m550M888N494o460K986J1279j284k982O9J282O36p055J075L727P290
13804I429j408o802p515J684r26j125k583j201J532L800M46p16n36j95P46J338
13788d032M281j610o524N321Q153J429o98n647q026L19m375o002J678L144K921
13773i668j634O4M344N630M270m649m097j534J556L913n282j550J315N790m406
13758e938k499n68l785k319N424J3190L04K61M85o412k614j617j764P30N695k358
$$ plain form
13865 -4816 -2759 1496 -1345 2009 8161 15062 6119 1018 3109 3866 6101 2231 304 -427 -2222
13850 -2222 434 981 9942 12018 3813 -2076 -2708 -406 -872 3748 2506 -3737 1104 2578 3997
13835 3997 2704 1866 -638 4110 606 -245 -1743 -348 4717 4257 6545 4570 -3588 -3174 -2575 -6966
13819 -6966 -11516 -6628 -1134 -7594 -4608 6671 5387 2405 2474 3756 4392 -2663 -1588 2139 9429
13804 9429 8021 1219 -6296 -4612 -5538 -6663 -9246 -10447 -8915 -5115 -4669 -5385 -5921 -6116 -5370 -4032
13788 -4032 249 -1361 -7885 -2564 5589 7018 6320 673 -7353 -7034 -11409 -17411 -15733 -12589 -9668
13773 -9668 -11302 -11238 -6894 -1264 3006 -1643 -5740 -7274 -5718 -1805 -7087 -8637 -7322 -1532 -5938
13758 -5938 -8437 -9005 -12790 -15109 -9685 3505 3809 4070 4555 -1857 -4471 -6088 -7852 -7122 -1427 -3785
13742c785o005j285N405M305M055J104j1288r400J920J314J945M999N878J1316
13728A0478M059r363p849K251J590M982J793j925n452m317O073O621j427o305
13714A209J989K107rP068O073J0382N967M920O840N826J0790J4231K8631K0246
13700A26270M397J216l401q053j4058k6732j7055j5993n720k014M032o882m788
13687C1219J373l748k109j393l798J81m359Q5N25K785K865P52J515R56O343J1419
13671D4611J2432R620J3142K8935M3196M1284M3717M4437K4596n14r946k9216
13659B66294m8471n4803l5474k0500j2985r221j3192j1355j2128r784j452j0118
13647B6811n94L113k164q708K02k452O459N839m53j351M808K982L11M742O942
$$ plain form
13742 -3785 -9790 -11075 -5670 -1365 2690 3794 -7494 -16894 -14974 -13660 -11715 -6716 -838 10478
13728 10478 14537 5174 -2675 -424 1166 6148 7941 6016 564 -3753 2320 8941 7514 1209
13714 1209 3198 5305 5296 12364 18437 28819 34786 39706 46546 52372 63162 77393 106024 126270
13700 126270 130667 131883 128482 120429 106371 79639 62584 46591 40871 38857 42889 36007 31219
13687 31219 32592 28844 26735 25342 21544 21725 17366 17451 17976 20761 23626 24378 25893 26849 33192 44611
13671 44611 57043 66663 79805 108740 151936 193220 236937 281374 305970 305456 295510 266294
13659 266294 217823 163020 127546 107046 94061 84840 71648 60293 48165 38381 36929 26811
13647 26811 26217 29330 27166 18458 18660 16208 22667 28506 28053 26702 31510 34492 34803 39545 46487
13632D6487J5432J4254J6140K5073K7376K2467P041O558l375k7372l7678k3967
13620H8436j5240j4072j0079j5612o807n81l018J900j512L734k508r196m377j202
13606I866k309N712l333p190o015m501K079M96j910J962q05M393J717m500L419
13591i19L184N091J240L819m369K598K078O266l957k357j441j595L177p844M316
13576I287k46o55K023Q941k667m787m476k162m123k634R139L599m526l455q67
13561B391m220p878k757P925M017j828n31r26l54Q21j213M540K507J995j734l002
13545b47j1946K58Q332M884N254m823J134M76o814M678J3038K605n462o930n819
13530a382j780m280M996J480j443n553K675K4p28P62m00l329j057M940O134O064
$$ plain form
13632 46487 61919 76173 92313 117386 144762 167229 174270 180828 177453 150081 112403 88436
13620 88436 73196 59124 49045 33433 26626 26045 23027 24927 23415 27149 24641 15445 11068 9866
13606 9866 7557 13269 9936 2746 -3269 -7770 -5691 -5195 -7105 -5143 -5948 -1555 162 -4338 -919
13591 -919 2265 7356 8596 12415 8046 10644 12722 18988 15031 12674 11233 9638 12815 4971 9287
13576 9287 9041 8386 10409 19350 16683 11896 7420 5258 1135 -1499 7640 11239 6713 3258 2391
13561 2391 -1829 -9707 -12464 -4539 -522 -2350 -2881 -3807 -4161 -3340 -4553 -13 2494 4489 2755 -247
13545 -247 -12193 -11935 -3603 1281 6535 1712 2846 3322 -3492 1186 14224 16829 11367 4437 -1382
13530 -1382 -3162 -7442 -2446 -966 -2409 -7962 -5287 -5263 -5991 -5229 -5629 -8958 -10015 -5075 1059 7123
13514G123l546M119N173l642K391J544p708l424L926O270m63L184k155L644J468
13499A7904r504k188J180k651m505L573L981O115P416l879M430K059k364l582
13485A7985m928n748o261m516j668J2594J4473m423k173J288j470k597l309J231
13471A0478Q132N143j073o310J948M17k596l690j584N725P654j010j822N291k204
13456B4499o142q78n61Q22n470k960k638j294K098J649K135K925j198n217M154
13441A1924j098p401L208M182O76M513K344o961j311L582J154M517K588L199J388
13426B6504j247K891L717l609o026k169j593k776l854L034O541O46j245l530k256
13411A5028l256O51L548q9J07J115L998L18o771j759K390J239o498p905K465P754
$$ plain form
13514 7123 3577 7696 12869 9227 11618 13162 5454 2030 5956 12226 11763 14947 12792 16436 17904
13499 17904 8400 6212 7392 4741 236 3809 7790 13905 21321 17442 21872 23931 21567 17985
13485 17985 13057 7309 1048 -3468 -5136 7458 21931 17508 15335 16623 15153 12556 9247 10478
13471 10478 18610 23753 22680 16370 18318 18735 16139 12449 10865 16590 24244 23234 21412 26703 24499
13456 24499 18357 17479 16918 17740 12270 9310 6672 5378 7476 9125 11260 14185 12987 7770 11924
13441 11924 10826 3425 6633 10815 11491 16004 18348 11387 10076 13658 14812 19329 21917 25116 26504
13426 26504 25257 28148 31865 28256 22230 20061 18468 15692 11838 14872 21413 22059 20814 17284 15028
13411 15028 11772 12423 15971 15882 15989 17104 21102 21420 14649 12890 15280 16519 10021 2116 4581 12335
13395A2335L875p510q62j933k638K17N856l616n359O888P894O08j868K052J0298
13380B6237L237M066R797M622l332K945k641n692R554M311j1538j126m937J535
13366C7038R685j617o896n027K62P85N289J29M768N930K003l133l701N735j313
13351D9937o852K745K836L33P170J0052n84J132m36Q531J7705J3821Q232P63j489
13336A13896P674N881K3L164L420p309k764N76j462K01L100M132J682O300j832
13321A36682n226J558R046R12j622r63r74k72L608O852L4J944N203m486K598P950
13305A62844J0359K639J1687J3528R013o4j575O552R088R533M930R168J0887J2646
13291B71235P401J570M190M675Q058K826n98J0926J0748P612O962J0460J2238
$$ plain form
13395 12335 16210 8700 7838 5905 3267 3484 9340 5724 365 7253 15147 15755 13887 15939 26237
13380 26237 29474 33540 43337 47959 44627 47572 44931 39239 48793 53104 41566 40440 35503 37038
13366 37038 46723 45106 38210 33183 33445 34230 39519 39648 44416 50346 52349 49216 45515 51250 49937
13351 49937 43085 45830 48666 48999 56169 66221 65637 66769 66333 74864 92569 106390 114622 115385 113896
13336 113896 121570 127451 127474 130638 134058 126749 123985 124561 123099 123300 126400 130532 132214 138514 136682
13321 136682 131456 133014 142060 142972 141350 140387 139413 139141 142749 149601 149635 151579 156782 152296 154894 162844
13305 162844 173203 175842 187529 201057 210070 210006 208431 214983 224071 233604 238534 247702 258589 271235
13291 271235 278636 280206 284396 289071 297129 299955 299357 310283 321031 328643 335605 346065 358303
13278C58303J5572J5796K8088L4004K1186K3455L3119M2924M8594M5879N7204
13267G24124O9789P4246Q7111J00813J17272J38200J69952K24866K89139L68074
13257B363586M73199O20853Q41188J165462J691173K502902L571745M514135M639118
13248B2383361L699217K181830N58273j087051k682909l856790m323644l791093
13240A3081194k700393j776122j186071q18161n86355m49096l52884k65728k13819
13231D732565j61287j09308p0441j6548K1876P4517J49607K35538L48555M93095
13221E698169O69266Q92969J200262J655621K351282L464400N182757P478965
13213B8593691R525230R801493P687150M370445Q44738k680051o031443q388581
$$ plain form
13278 358303 373875 389671 417759 451763 472949 496404 529523 572447 621041 666920 724124
13267 724124 793913 868159 955270 1056083 1173355 1311555 1481507 1706373 1995512 2363586
13257 2363586 2836785 3457638 4298826 5464288 7155461 9658363 13230108 17744243 22383361
13248 22383361 26082578 28264408 28822681 27735630 25052721 21195931 16872287 13081194
13240 13081194 10380801 8604679 7418608 6600447 6014092 5564996 5212112 4946384 4732565
13231 4732565 4571278 4461970 4391529 4374981 4396857 4471374 4620981 4856519 5205074 5698169
13221 5698169 6367435 7260404 8460666 10116287 12467569 15931969 21114726 28593691
13213 28593691 38118921 47920414 55607564 59978009 60822747 58142696 52111253 43722672
13205D3722672r483231q311740n725582l646495k412245j711688j295952j026346
13197A0109393q28814o84810n87708m95344m04502l23481k48887j79578j23801
13188F232468o8622j2543N1724J39404K32460L47608N09721P53895J142638J746623
13178A1075376K657637L799294M725141M713789L608888J956637J49391j655004
13170C1031149l259825m390456m818193m106284k871346j899425j298339r48946
13162G438335p38789o01494m94247m22111l74109l19099k81708k47163k23094
13153C736521j98265j68242j55581j50165j44936j30499j15307j05793j07394
13144B460339j10535j06142q3754q4780p9971o8516o4732o2778n6377o5072o0026
$$ plain form
13205 43722672 34239441 25927701 20202119 16555624 14143379 12431691 11135739 10109393
13197 10109393 9280579 8595769 8008061 7512717 7108215 6784734 6535847 6356269 6232468
13188 6232468 6163846 6151303 6203027 6342431 6574891 6922499 7432220 8186115 9328753 11075376
13178 11075376 13733013 17532307 22257448 26971237 30580125 32536762 32686153 31031149
13170 31031149 27771324 23380868 18562675 14456391 11585045 9685620 8387281 7438335
13162 7438335 6699546 6098052 5603805 5181694 4807585 4488486 4206778 3959615 3736521
13153 3736521 3538256 3370014 3214433 3064268 2919332 2788833 2673526 2567733 2460339
13144 2460339 2349804 2243662 2159908 2075128 1995157 1926641 1861909 1799131 1742754 1677682 1617656
13133A617656n9287n4319m7980n6212n4701l7043m4267l9189l9784m0083l7857
13122A106934m0717m7482m0906l8683l5521l2843l0409k8804l0644l8650l2823
13111G09452k4719k2482j9199k8694k4024k4423k0978j7097k3879j6933j0831
13100D76193j5640j5947p383p760r549l735l869k0523k2022j2257l907k637r364
13087C41600j8848j0727q500j1027j3130j3010r193r513q082j396K101o667k341
13074B31267J87m994k701r248j8798q052k348l14j350j159n198k62n870l053o507
13059A61600r77m608J162m672m354J46m090l302o937m249j991o600m258J43M157
13044A21170M077J094j63o909L347K559L448P46M56M88n533k873k107m14J401
$$ plain form
13133 1617656 1558369 1504050 1456070 1399858 1345157 1308114 1263847 1224658 1184874 1144791 1106934
13122 1106934 1066217 1018735 977829 939146 903625 870782 840373 811569 780925 742275 709452
13111 709452 684733 662251 643052 614358 590334 565911 544933 527836 503957 487024 476193
13100 476193 460553 444606 437223 429463 419914 416179 412310 391787 369765 357508 353601 350964 341600
13087 341600 322752 312025 303525 292498 279368 266358 257165 247652 239570 238174 240275 233608 231267
13074 231267 231454 226460 223759 214511 195713 187661 185313 184999 183649 182490 177292 177030 171160 168107 161600
13059 161600 160623 156015 157177 152505 148151 148297 144207 140905 133968 129719 127728 121128 116870 117013 121170
13044 121170 125247 126341 126178 119269 122616 125175 128623 129369 129825 130313 124780 121907 119800 119386 120787
13029A20787K836K997j369M839M203k810q7N528n34j544m89l708j3310q555k993
13014A05791O473L973k099m396p204k208J44R84K6l834L039K095r219K424O786
12999A02775l208l426m372j705l811L4q26j684j169j713k510Q535J319m982K779
12984H6036J79n460J138m42j766p627p276N451M413L302m463q685k070j414Q69
12969F2185K971j234p789n306o706R65K990P435l3j572J432n903m937l286m331
12954C6881k589q227j204O492J4321P311j927p308m297L199J924p473j127J539
12940C7515l215Rl481j0647M028O560K806J059L982P99p398r460k197l237M41
12925A7564j98M972L402k045j0360l395J973J833q8O37N686Q161n581j0211J522
$$ plain form
13029 120787 123623 126620 125251 130090 134293 131483 131396 136924 136390 134846 134357 130649 117339 108784 105791
13014 105791 112264 116237 114138 109742 102538 100330 100474 101458 101484 97650 100689 102784 93565 95989 102775
12999 102775 99567 96141 91769 90064 86253 86287 85461 83777 82608 80895 78385 86920 88239 83257 86036
12984 86036 86215 80755 81893 81451 79685 72058 64782 70233 74646 77948 73485 64800 62730 61316 62185
12969 62185 65156 63922 56133 50827 44121 45086 48076 55511 55478 53906 55338 49435 44498 41212 36881
12954 36881 34292 26065 24861 31353 45674 52985 51058 43750 39453 42652 44576 37103 35976 37515
12940 37515 34300 34309 30828 20181 24209 30769 33575 34634 38616 39415 32017 22557 20360 17123 17564
12925 17564 17366 22338 25740 23695 13335 9940 11913 13746 13658 14295 19981 28142 22561 12350 13872
12910A3872O31L892N248O20n156j074P4m056l208K252L071N07o478k490R175M54
12894A7334O32k418k746j58L769L0N469Mm189l426o480N468M683J101M152m432
12878A8793n318j934K09Q42K436j729J815J924l372q89l611k32N156R25M69J224
12862A6708l400k436m23M668L446O87J323l288Q162r60o255K99k005L518O724
12847B6768Q564k489o363j3965r176P111J629j838N397m091l573K151J453j694
12833I884j64M385R78l093l142J205L78K706O3K663O345o005j994p60J869L601
12817A8919j254O225K193p594o544q35j348j351J468L24j046l209M2o58N158R243
12801A9733j17j104O191J328l383N718P118J21M79J2329J4000R297J8598K5610
$$ plain form
12910 13872 14503 18395 23643 24263 19107 18033 18107 14051 10843 13095 16166 16673 10195 7705 16880 17334
12894 17334 17966 15548 12802 12644 16413 16443 21912 21916 17727 14301 7821 13289 17972 19073 23225 18793
12878 18793 13475 11541 11750 12592 15028 13299 15114 17038 13666 12777 9166 8934 14090 15015 15484 16708
12862 16708 13308 10872 10449 15117 18563 19250 20573 17285 25447 24487 18232 18531 16526 20044 26768
12847 26768 35332 32843 26480 12515 3339 10450 12079 10241 15638 11547 7974 10125 11578 9884
12833 9884 9720 14105 15083 11990 8848 10053 10431 13137 13200 15863 22208 16203 14209 13449 15318 18919
12817 18919 17665 23890 26083 18489 11945 11110 9762 8411 9879 10203 9157 5948 5990 5332 10490 19733
12801 19733 19616 18512 24703 26031 22648 28366 35484 35605 36084 48413 62413 71710 90308 115918
12787A15918J4604Q954n834k568j2058k0531j3516j1086k142j2321r087p542l396
12774C9395r120K74L129L30k883n718J891P383k945O23j874j33P923L274R485
12759E1034J867Q298J3628J4898J0987J0965K8529M4937M4683L5529K4315J0390
12747C00060j0063k7225l9866m4742l5801l1576k1270m253j1844n260j932q255
12735E7973o107j3307l05N13o98K196n060p394m338l274M562K718R727M865M676
12720D6747O421Q152J3720J4786J1106K5834K4581J6344Q900L553j1895j7839
12708A50410j3106k6667k2970k1225j6533m398o182j239L780m695j2084l582L779
12695B5288N03N817n454m324J355l621k642K732N671O79o693n786M10M476N760
$$ plain form
12787 115918 130522 139476 133642 131074 119016 98485 84969 73883 71741 59420 50333 42791 39395
12774 39395 30275 30549 33678 34008 31125 25407 27298 34681 31736 32359 30485 30352 38275 41549 51034
12759 51034 52901 61199 74827 89725 100712 111677 140206 185143 229826 265355 289670 300060
12747 300060 289997 262772 222906 178164 142363 110787 89517 85264 73420 68160 66228 57973
12735 57973 51866 38559 38254 38767 38069 40265 35205 27811 23473 20199 24761 27479 37206 42071 46747
12720 46747 53168 61320 75040 89826 100932 126766 151347 167691 176591 180144 168249 150410
12708 150410 137304 110637 87667 66442 49909 45511 39329 38090 41870 37175 25091 21509 25288
12695 25288 25791 31608 26154 21830 23185 19564 16922 19654 25325 26004 19311 13525 13935 18411 24171
12680B4171k703o262p02P31K858k278k624J567M154m839m098p19j479P51k80K834
12664A1082o06n334o171J665k216k006R988j962N847l071r135J768O227j371K400
12649G105k463Q6J380o989m875K424j386Q094M754n704o04k377l694m354Q529
12634g4O614N10k643k050l512J293K004n722K608R167m794q329q20j398M252O579
12618C685K784M880m36p864m928l55K93m840j029R94N798k70k776l316M082L338
12602D0M618J952m755j356j090M966L61J365j893J7J028N303J840k511m04m741
12586D740k843O36M096m90q179l526M438J0207O31o700q83r56n273K143O972k938
12570B075k391P75l149j368M955N038k246M918m14m807L177M872M864n610k819
$$ plain form
12680 24171 21468 15206 14504 15235 18093 15815 13191 14758 18912 14073 9975 9256 7777 8528 8248 11082
12664 11082 10476 5142 -1029 636 -1580 -3586 6402 4440 10287 7216 -1919 -151 6076 4705 7105
12649 7105 4642 4728 6108 -881 -5756 -3332 -4718 3376 8130 2426 1822 -555 -4249 -8603 -74
12634 -74 6540 7050 4407 2357 -1155 138 2142 -3580 -972 8195 3401 -4928 -5748 -7146 -2894 3685
12618 3685 6469 11349 10913 3049 -1879 -2234 -1941 -6781 -7810 -6816 -1018 -1288 -4064 -7380 -3298 40
12602 40 4658 6610 1855 499 -591 4375 4736 6101 4208 4225 5253 10556 12396 9885 9481 4740
12586 4740 1897 2533 6629 6139 -2040 -5566 -1128 9079 9710 3010 2127 1171 -4102 -1959 5013 2075
12570 2075 -316 459 -2690 -4058 897 5935 3689 8607 8193 3386 6563 11435 16299 10689 7870
12555G870j833l818L755j901J736L994q245r972K862M369q81P600P159n479M64
12540G680M631o509k989O621K966k587N367m868k330N788j462o867k719k347N159
12525E534o020j832n039r34k009K546l277P326j44l630j908j888K666M111L359
12510a139L186m728m739m0J467L422k93k433K474m499o180j690N664L217K488
12495c823J497N297K388m283j532K424l510j089o471l612r21k601L017P122P291
12480A194J337n016n02L772L202k724P29J073N085L501n222l327j233L598L11
12465E778M376K446N084j1099o469m766k35K610M51k242l541l296k644L965J799
12450g783j62M584P138q81o463J690N109n56L689P463n015k650P875l398m25P423
$$ plain form
12555 7870 6037 2219 5974 4073 5809 9803 1558 -8414 -5552 -1183 -2064 5536 12695 7216 7680
12540 7680 12311 5802 2813 9434 12400 9813 15180 10312 7982 13770 12308 5441 2722 375 5534
12525 5534 -486 -2318 -7357 -8291 -10300 -7754 -11031 -3705 -3849 -7479 -9387 -11275 -8609 -4498 -1139
12510 -1139 2047 -2681 -7420 -7460 -5993 -2571 -2864 -5297 -2823 -7322 -13502 -15192 -9528 -6311 -3823
12495 -3823 -2326 2971 5359 1076 -456 1968 -1542 -2631 -9102 -12714 -13635 -16236 -13219 -6097 1194
12480 1194 2531 -2485 -2987 785 3987 1263 1992 3065 8150 11651 6429 3102 1869 5467 5778
12465 5778 10154 12600 17684 6585 116 -4650 -4885 -2275 -1824 -4066 -7607 -10903 -13547 -9582 -7783
12450 -7783 -7945 -3361 3777 2896 -3567 -1877 3232 2676 6365 13828 8813 6163 14038 10640 10215 17638
12434A7638R52k425n32o761L24r67n711o335L470J0583M993m702n196q40J298
12419E789J322p09m234n66m76j433M262K94j306J489Q26N483N708l225q833J073
12403E464M74k316J164J326k731R581K341r55l301N62O260N183K114Q869R332
12388D3367L969O642J1362J1186Q477J5057J7465J4373J9239J4985J0788M991
12376A81901J215p709o399j7395k2154j1031n943r699r792j3173j3088j5556j0000
12363D1177J075M660j87n117L398J597n825o312m355q355K063R61q812j541J0441
12348B4868O184j943j1158j4128l210O266L148L345q110r722O112L140K466Q76
12334H134O312L56l567l564R27L265J376k896P44m799j0300q28J123N145J1045
$$ plain form
12434 17638 18590 16165 15633 8872 9196 8229 2518 -3817 -347 10236 15229 10527 5331 4491 5789
12419 5789 7111 6402 2168 1602 1126 -307 3955 4249 2943 4432 5258 10741 16449 13224 4391 5464
12403 5464 5938 3622 4786 6112 3381 12962 15303 14348 11047 11609 17869 23052 25166 34035 43367
12388 43367 47336 53978 65340 76526 85003 100060 117525 131898 151137 166122 176910 181901
12376 181901 183116 175407 169008 151613 129459 118428 112485 102786 92994 79821 66733 51177 41177
12363 41177 42252 46912 46725 41608 45006 46603 40778 34466 30111 21756 23819 24780 15968 14427 24868
12348 24868 31052 29109 17951 3823 613 6879 10027 13372 5262 -4460 1652 4792 7258 8134
12334 8134 14446 14802 11235 7671 8598 11863 13239 10343 11087 6288 -4012 -4840 -3717 1428 12473
12319A2473j003n227j82j613o519m020K505N700J117P28j312K33j0188N47N596
12304a165l057m353L870M247o62L208m204m704N160L050m997p357Q90O126Q34
12289c114l689M373M764m479n738R582J06l501P96J230l528J47j408o446k113
12274a3018N995Q36P47n263J1424J076q388o05J743L525P826L498k601l539J805
12259E061j805K84R319K800m066L675K99k008K047R180J2409O448K695P849J6418
12244G0605J5864L195j346Q96o921j5370j0251q830r620o073j105L588J774J862
12230C8268r125M323l455n813K328j273o462l439O420l970l485Q37K370k765j425
12215A3334M299N144k103q915P39M50n931j207J330k084r184P490K469K202k722
$$ plain form
12319 12473 11470 6243 6061 4448 -2071 -6091 -3586 2114 3231 3959 2647 2880 -7308 -6761 -1165
12304 -1165 -4222 -8575 -4705 -458 -1120 2088 -2116 -6820 -1660 1390 -3607 -10964 -10074 -3948 -3114
12289 -3114 -6803 -2430 2334 -2145 -7883 1699 1805 -1696 -900 330 -3198 -3051 -4459 -10905 -13018
12274 -13018 -7023 -6187 -5440 -10703 721 1797 -6591 -7196 -5453 -1928 5898 9396 6795 3256 5061
12259 5061 3256 3540 12859 15659 11593 15268 15567 13559 15606 24786 37195 43643 46338 54187 70605
12244 70605 86469 89664 88318 89214 82293 66923 56672 47842 38222 32149 31044 34632 36406 38268
12230 38268 29143 33466 30011 24198 26526 25253 18791 15352 21772 17802 14317 15154 17524 14759 13334
12215 13334 17633 22777 20674 11759 12498 12948 7017 5810 7140 5056 -4128 3362 5831 8033 5311
12200E311L853N298P438M143J091m303l028o97l554o655o702N405P64j793k209
12185D362J077N194K269m479n48R17M398J379n637j603j000m18l735n413M20j181
12169c998M61l674K299l422P17Q881M172N226M153r17p079l325O738P443k512
12154A5163m371K250l862p927n971L125O58P06K636K226L673q89o855l898M949
12139A613j631J89N137L729K379n300j66n955m766J510k794o328J131O975K454
12124a823L218O669k401j516o947k625L945K699o009m418K296M259O248M434O826
12109A4855l867m641j913M016M805q040o316k154N386m1M791m500l655p75m584
12094f633j21J693l834J360L239M134k739J861L761j831j075K31J10K622k095
$$ plain form
12200 5311 9164 14462 21900 26043 27134 22831 19803 19106 15552 8897 2195 7600 8364 6571 4362
12185 4362 5439 10633 12902 8423 7875 8792 13190 14569 8932 7329 6329 5911 2176 -3237 -2817 -3998
12169 -3998 -3537 -7211 -4912 -8334 -7617 1264 5436 10662 14815 13898 6819 3494 10232 17675 15163
12154 15163 10792 13042 9180 1253 -4718 -1593 -935 -229 2407 4633 8306 7417 562 -3336 1613
12139 1613 -18 171 5308 9037 11416 6116 5950 -5 -4771 -3261 -6055 -12383 -11252 -4277 -1823
12124 -1823 1395 8064 5663 4147 -2800 -5425 -1480 1219 -4790 -9208 -6912 -2653 3595 8029 14855
12109 14855 10988 6347 4434 8450 13255 5215 -1101 -3255 2131 2090 6881 2381 -1274 -2049 -6633
12094 -6633 -6754 -5061 -8895 -7535 -4296 -162 -2901 -1040 2721 890 -185 46 156 2778 683
12079F83k842O059M02J573N31J1196k42l739j338m503k53j326J125j178m068j035
12063A045K003m438q888j258N146O20l585J995J967M299k388m93k48K528p22k215
12047d632n549M259K068J271k270l27J774l41O360N227n355j651M478M415L224
12032A2951k473j1509r793L308L328J254L072M24m830j884P572P815o225m389
12018a379K838K509l470l113L988K404q480Q09O06p463m277K573N417R13Q65N062
12002a98Q187P9J421m058o376L292M045m635k721l348K680j79j347p100O25J391
11986h242j509K061K35J33p442n868O151M162N966L564o371k295j573o60O085
11971e603J317j552j31J724J076L828L927o075l928Q450N609L806M506l390p384
$$ plain form
12079 683 -2159 3900 4302 5875 6406 17602 17360 13621 12283 7780 7527 6201 7326 6148 2080 1045
12063 1045 3048 -1390 -10278 -11536 -6390 -5770 -9355 -7360 -5393 -1094 -3482 -3975 -4223 -1695 -2417 -4632
12047 -4632 -10181 -5922 -3854 -2583 -4853 -5180 -3406 -3747 2613 7840 2485 834 5312 9727 12951
12032 12951 10478 -1031 -10824 -7516 -4188 -2934 138 562 -4268 -6152 1420 9235 3010 -1379
12018 -1379 1459 3968 498 -2615 1373 3777 -4703 -3894 -3288 -10751 -15028 -12455 -7038 -6125 -5260 -198
12002 -198 7989 8068 9489 5431 -945 2347 6392 1757 -964 -4312 -1632 -1811 -3158 -10258 -9633 -8242
11986 -8242 -9751 -7690 -7455 -7322 -14764 -20632 -14481 -10319 -4353 -789 -7160 -9455 -11028 -11688 -5603
11971 -5603 -4286 -5838 -5969 -4245 -3169 659 4586 -1489 -5417 3033 8642 12448 16954 13564 6180
11956F180n293Q69K283L938J754k992p152r259j037L910J870N55P531n130r85
11941b958P012N988J773o283r324Q71K664l117j259K630O634K905k318j446q214
11926d442N09L158k896R094R644j125m118o587q242J888J0113l974n051L403O198
11911G572K195o352l310j356q13Q231Q728J173o259m186r78k133l297J132N36
11896H83j456O149k114m705L155k300m969J570R600K552J323K346j935j112Q38
11881I825k007Q455o399j1257k7q072k159j824L039L840K635L650m700k328M625
11866b704L109m822j907j708r04J797O430L442K103J830j822p479p56j850P18
11851d523M297K974j287q474j212J552K074K558J33n441L488L984k522o082j000
$$ plain form
11956 6180 887 1756 4039 7977 9731 6739 -413 -9672 -10709 -6799 -4929 -4374 3157 -1973 -2958
11941 -2958 4054 10042 11815 5532 -3792 -2921 -257 -3374 -4633 -2003 4631 7536 5218 3772 -4442
11926 -4442 -3933 -775 -3671 5423 15067 13942 9824 3237 -5005 -3117 6996 3022 -2029 1374 7572
11911 7572 9767 3415 105 -1251 -2064 6167 14895 16068 9809 5623 4645 2512 -785 347 883
11896 883 -573 5576 3462 -1243 1912 -388 -5357 -3787 5813 8365 9688 12034 10099 8987 9825
11881 9825 7818 16273 9874 -1383 -1410 -9482 -11641 -13465 -10426 -6586 -3951 -301 -5001 -7329 -2704
11866 -2704 405 -4417 -6324 -8032 -8936 -7139 -709 2733 4836 6666 4844 -2635 -3391 -5241 -4523
11851 -4523 -226 2748 1461 -7013 -8225 -6673 -4599 -2041 -1908 -7349 -3861 123 -2399 -8481 -9481
11836i481k031K202K752m88q16K813O998j109l854q78N701K508J730J954k029
11821E972o99P83l893J951m634r813M2m02k458L938N082K025n62j127K997k620
11805c418k56J939J086J39l766j408j093K118k421m239N026L780m476m033M892
11790f130N226R9N014K608p72M187q211r246K09j362J392Q461k021K780M225L850
11774A0309n902j4414k889j0491k399J2561J0475k778m278m817P977P699P82J2399
11760A4234k747j0140r52K291O465J09p782n370N88L682P535m519k269n387l680
11745g942O258M403n257M588J822J35m76l426r94M985o26q586m81M664Q630m099
11729C598n498m404n030O196o6N317K783J827K721J274l383O45m707K324M827
$$ plain form
11836 -9481 -11512 -9310 -6558 -7046 -7862 -5049 1949 840 -3014 -3892 1809 4317 6047 8001 5972
11821 5972 5273 6056 2163 4114 -520 -10333 -10291 -10693 -13151 -9213 -4131 -2106 -2668 -3795 -798 -3418
11805 -3418 -3674 -1735 -649 -510 -4276 -5684 -6777 -4659 -7080 -11319 -6293 -2513 -6989 -11022 -6130
11790 -6130 -904 -805 4209 6817 6045 10232 2021 -7225 -7016 -8378 -6986 1475 -546 2234 6459 10309
11774 10309 4407 -10007 -12896 -23387 -25786 -13225 -2750 -5528 -9806 -14623 -6646 1053 1835 14234
11760 14234 11487 1347 395 2686 9151 9260 1478 -3892 -3304 378 7913 3394 1125 -4262 -7942
11745 -7942 -1684 2719 -2538 2050 3872 4007 3531 105 -889 4096 3470 -5116 -5597 -933 7697 3598
11729 3598 -1900 -6304 -11334 -5138 -5204 113 2896 4723 7444 8718 5335 5980 1273 3597 8424
11714H424M38n352K807k353k258O952N855q205p195N374m30k965j698M421K088
11699E903r849j0357k837J680q52m398K416J1205J1M436P340q81M397J596n956
11684C854m773K522r05l539m25R261l72o492J082k728k156M552k069j817N607
11669A602j953R45m417j548M227O606J330M715K055j116l321r820J059N188n102
11654D50l197p163j225K39K815Q729J484L099J502j179k220n59l833m79L568J660
11638C691j653j259M483P39R02K194N49M098m255J661k588n024k712o613p457
11623a3244J85L409l572O339P227n161p537l573K440P745O787j522l90N520K850
11608G503L920l731n955K182O514r55m851m65M077N765K893l40J303J657J330
$$ plain form
11714 8424 8862 3510 6317 3964 1706 8658 14513 6308 -887 4487 4057 1092 -606 3815 5903
11699 5903 -3946 -14303 -17140 -15460 -16312 -20710 -18294 -7089 -7078 -2642 4698 3817 8214 9810 3854
11684 3854 -919 1603 698 -2841 -3266 5995 5623 -869 213 -2515 -4671 -119 -2188 -4005 1602
11669 1602 -351 594 -3823 -5371 -1144 5462 6792 11507 13562 12446 9125 -695 364 5552 450
11654 450 -2747 -9910 -11135 -10896 -8081 648 2132 5231 6733 5554 3334 2775 -1058 -1537 2031 3691
11638 3691 2038 779 5262 6001 6903 9097 9646 13744 9489 11150 8562 3538 826 -5787 -13244
11623 -13244 -13059 -9650 -13222 -6883 344 -4817 -12354 -15927 -13487 -5742 1045 -477 -867 4653 7503
11608 7503 11423 7692 1737 3919 10433 9478 4627 4162 8239 14004 16897 16557 17860 19517 20847
11593B0847p862o597Q784O764Q938n815j817l148k169O550P562j410m459q346
11579A7822o839j54J150n977k692r65J303L293N440M815J853m399n197N774L897
11564A9124o96N63n606n748K382J986M572l439k095L618N314k511l887o169l780
11549C628n903J687Q71L364J851j356j388O915R887N091M018j860m971p676J884
11534A6042N928O83l841j2721j676J1054R996k299m400m157L610L326n21N587
11520B6611O331K526K030l666N536J1725J0586J0401R311J9830K1420J3918R552
11507A46111K684m026o574j1682k0180j4826j5157j3802n591n325m501m908q18
11494D1405p975q93k431m677J700J563O246l220j0058N433K413K831r11O818J3100
$$ plain form
11593 20847 12985 6388 15172 21936 30874 25059 23242 20094 17925 24475 32037 30627 26168 17822
11579 17822 10983 10829 11979 6002 3310 2345 3648 6941 12381 17196 19049 14650 9453 15227 19124
11564 19124 18428 18991 13385 7637 10019 12005 16577 13138 11043 14661 19975 17464 13577 7408 3628
11549 3628 -2275 -588 283 3647 5498 4142 2754 9669 19556 24647 28665 26805 21834 14158 16042
11534 16042 21970 22653 18812 6091 4415 15469 25465 23166 18766 14609 18219 21545 21024 26611
11520 26611 32942 35468 37498 33832 39368 51093 61679 72080 81391 101221 122641 136559 146111
11507 146111 148795 144769 138195 126513 106333 91507 76350 62548 56957 51632 47131 42223 41405
11494 41405 33430 32537 30106 25429 27129 28692 34938 31718 21660 27093 29506 32337 31426 38244 51344
11479E1344J0780J5376J4650K9103L4853M6503M2468K9262K4878J4894k361k2522
11467B89228l5343l9459l8601l5821k5424k1745j1519j2642k215L878l983p940
11455E8414r463l484n145j742P689N318r976o546K780P044N86l451J118N760P992
11440E6894Q39Q017J4561K1680K3307K1667J7863P570m145j5809j4506k1604j5357
11427A00977j4002j0394m983n494j0371l004m96j766n374k106M74n3m371o193
11413C2844l181r01j931n66K624l747l919k123n940N59J0443P77p503r174J572
11398I834L255N246J648M205L081j01M15L480J450N032L19m83m45j929K474R20
11382C8401m362k814o551j031m047l761j23l41m931J053L200Q190m107l092L304
$$ plain form
11479 51344 62124 77500 92150 121253 156106 202609 245077 274339 299217 314111 311750 289228
11467 289228 253885 214426 175825 140004 114580 92835 81316 68674 66459 70337 66354 58414
11455 58414 48951 45467 40322 38580 46269 51587 41611 35065 37845 44889 45475 42024 43142 48902 56894
11440 56894 57733 65750 80311 101991 125298 146965 164828 172398 168253 152444 137938 116334 100977
11427 100977 86975 76581 71598 66104 55733 52729 52233 50467 45093 42987 43461 43408 39037 32844
11413 32844 29663 28762 26831 26265 28889 25142 21223 19100 13160 13719 24162 24939 17436 8262 9834
11398 9834 13089 18335 19983 24188 27269 27168 27583 31063 32513 37545 37864 37381 36936 35007 37481 38401
11382 38401 34039 31225 24674 23643 19596 15835 15712 15371 10440 11493 14693 22883 18776 15684 18988
11367A8988m328j6L694J251o421K058O395M947K14O977P654J602R690L842P706
11352F4253L353n403j1261o846J445J133M782q654r351k420R12j680j1650j41
11338A8472M140P39O5L921o50r522M595J581l870N854q19n324k904j193L353K311
11322B0749J596J846R454J411L761J1039J411J173Q647K500p486l277O591j714
11308E7701k459N71L65l152k816M657j65r710J401M178L414M82n350n351l221
11293D0545n686j388o368j567Q29K102P65O600Q619K967j232m848n801k787j761
11278C0989L65O380j648q96p67J407P180O182K59p072l331m648l246j060M816
11263C4910k182L307K60l191M164n95M3J812J101r558J569K184J082R76j623M479
$$ plain form
11367 18988 14660 14644 18338 19589 13168 15226 21621 26568 26782 33759 41413 43015 52705 56547 64253
11352 64253 67606 62203 50942 44096 45541 46674 51456 42802 33451 31031 31943 30263 18613 18472
11338 18472 22612 23351 23416 27337 26687 17165 21760 23341 19471 25325 24506 19182 16278 15085 18438 20749
11322 20749 22345 24191 33645 35056 38817 49856 51267 52440 61087 63587 56101 52824 59415 57701
11308 57701 55242 55813 56178 53026 50210 54867 54702 44992 46393 50571 53985 54467 49117 43766 40545
11293 40545 34859 33471 27103 25536 26365 28467 29232 35832 44451 47418 46186 41338 35537 32750 30989
11278 30989 31354 37734 36086 35190 34423 35830 43010 49192 49451 42379 39048 34400 31154 30094 34910
11263 34910 32728 36035 36295 33104 37268 36673 36716 38528 39629 30071 31640 33824 34906 35882 34259 38738
11247C8738L625J638l545q771l541K18j333k369j18L010o62L044N693K083q620
11232B9090l420O086Q928l086K308K911M081q9L76p49L056M008O055M505L619
11217F7679P107P87k40J216J88M793l216o033n12j378n116q460m057n560O93K664
11201E0555K094P075l115R282J2560O265L434N598P04J603k041o064l49Q815O850
11186A03266J987L621R165P700P146N161j10L244O978J822M975j442J139Q849
11172A63501N885k630K00o655j418m24J191k206o59o227N637P649K231K862k885
11157A66052K320Q78j75K085J293N842R398Q94j12J0511P716P479M813J640J669
11142B22303M406M499M990J1873J3470P240M721M345Q359R057L658k042m943Q634
$$ plain form
11247 38738 42363 44001 40456 31685 28144 28362 27029 24660 24542 27552 26890 29934 35627 37710 29090
11232 29090 25670 31756 40684 37598 39906 42817 46898 46809 47185 46436 49492 53500 59555 64060 67679
11217 67679 74786 75573 75333 76549 76737 81530 78314 72281 71769 70391 65275 56815 52758 47198 47891 50555
11201 50555 52649 59724 56609 65891 78451 84716 88150 93748 94452 96055 94014 87950 87601 96416 103266
11186 103266 105253 108874 118039 125739 132885 138046 137936 141180 148158 149980 154955 153513 154652 163501
11172 163501 169386 166756 166956 160301 158883 158459 159650 157444 156785 150558 156195 163844 166075 168937 166052
11157 166052 168372 169250 169075 171160 172453 178295 187693 188587 188475 198986 206702 214181 218994 220634 222303
11142 222303 226709 231208 236198 248071 261541 268781 273502 277847 286206 295263 298921 296879 291936 300570
11128C00570J6542J8903K1382J6208R307J4184J6815J7296J0284K4464K4817K9959
11116E20731K9990K7652M4045N3147N9043Q3591R5612J04795J31102J46973J60664
11105A457345J80962K06863K37906K89723L62537M77254O41200R02053J297553
11096F053396J872010K637360L464503M097964M183684L546807K302743P60467
11088B8918934q12203k268518l376209l871628l660124k982721k173890j496900
11080H276741j006728o94903m82135l41203k35726j85539j44664j00440m9651
11071E035752k657N7783J15186J65596K36874L15902M25935N68398P85645J123945
11061H828359J667569K475020L676040N260287O954094Q178875Q234085O760323
$$ plain form
11128 300570 317112 336015 357397 373605 382912 397096 413911 431207 441491 465955 490772 520731
11116 520731 550721 578373 622418 675565 734608 818199 913811 1018606 1149708 1296681 1457345
11105 1457345 1638307 1845170 2083076 2372799 2735336 3212590 3853790 4755843 6053396
11096 6053396 7925406 10562766 14027269 18125233 22308917 25855724 28158467 28918934
11088 28918934 28106731 25838213 22462004 18590376 14930252 11947531 9773641 8276741
11080 8276741 7270013 6575110 6092975 5751772 5516046 5330507 5185843 5085403 5035752
11071 5035752 5033095 5090878 5206064 5371660 5608534 5924436 6350371 6918769 7704414 8828359
11061 8828359 10495928 12970948 16646988 21907275 28861369 37040244 45274329 52034652
11053E2034652M118331J025496k090906m961782p103369p917067p317190n838792
11045B1949373m220776k899007j978786j376836r93590p48093o02670n07765m47888
11036H173962l99354l51090k95748k41517j83632j22789o2423k882O5854J48007
11026F728388K62296M38539P06790J114792J677158K396591L148739L679922L678475
11017B3831690K988266J772385L20980j143483k451169l414093l786074l500911
11009A4617591k826477k074245j446227j009024p26281n46621m40872l59954l13636
11000D874254k95236k81861k61417k38693k27010k11393j83878j69571j48343
10991B856852j33073j16708j09770j10003r3810r0211r1342q8397q4235p5592
$$ plain form
11053 52034652 56152983 57178479 55087573 50125791 43022422 35105355 27788165 21949373
11045 21949373 17728597 14829590 12850804 11473968 10480378 9732285 9129615 8621850 8173962
11036 8173962 7774608 7423518 7127770 6886253 6702621 6579832 6517409 6514527 6580381 6728388
11026 6728388 6990684 7429223 8136013 9250805 10927963 13324554 16473293 20153215 23831690
11017 23831690 26819956 28592341 28913321 27769838 25318669 21904576 18118502 14617591
11009 14617591 11791114 9716869 8270642 7261618 6535337 5988716 5547844 5187890 4874254
11000 4874254 4579018 4297157 4035740 3797047 3570037 3358644 3174766 3005195 2856852
10991 2856852 2723779 2607071 2497301 2387298 2293488 2203277 2111935 2023538 1939303 1863711
10981A863711p0059n9325n2877m9757n1046n0223n1416o0047n1988m7180m5299
10970A274494m1703m3115l5388l7084l2792l9008m8561l8617l7912l1012k5440
10959H63862k9729k8820k9466k9543k6922k7966k3096k0546k6695k8968j9979
10948E72132k0702j6171j1708r842j4500j8870j0297r190r828m632j5444j5410
10936D15538r713j2815j3246J48l154k215j0561j8731j4533j5430l220m542m319
10923C03207n329q981j2172j678J801m576j706j779n388Q522q205j4187j5313
10910B34216l109J1125r43k123J560l603k443j204j718j83k892n642k476l810
10896B16755p517J269M769j45j1344L84J797m420l909K796K861j615K894O413
$$ plain form
10981 1863711 1793652 1734327 1681450 1631693 1580647 1530424 1479008 1418961 1366973 1319793 1274494
10970 1274494 1232791 1189676 1154288 1117204 1084412 1045404 996843 958226 920314 889302 863862
10959 863862 834133 805313 775847 746304 719382 691416 668320 647774 621079 592111 572132
10948 572132 551430 535259 523551 513709 499209 480339 470042 460852 451024 446392 430948 415538
10936 415538 405825 393010 379764 379912 376758 374543 363982 345251 330718 315288 312068 307526 303207
10923 303207 297878 288897 276725 275047 276848 272272 270566 268787 263399 271921 263716 249529 234216
10910 234216 231107 242232 241289 239166 240726 237123 234680 233476 231758 231575 228683 223041 220565 216755
10896 216755 209238 210507 215276 215131 203787 204171 205968 201548 197639 200435 203296 201681 204575 210988
10882B10988k284m111M606j007O081K057j070J693n359K447N006P006J304M434
10868B31791P56K943N840K162M249L12n909n963r963l064P31J840o79j808K021
10853B25259P718O12p710m31L024P492J410O329M932l621O946m681n127P269J3048
10838B62469o921j464J339P990R540M332Q894O79J634P641P747M675P216Q7q148
10823C07710l793j48L593R949L254L316J2899J1407Q454L400J685P16M065M704
10809C71211m614o998l048q8o342m587q687m489M442P377O048N855M782J4844
10795C75706P181P206L03k036J0444Q064k542p400R89O830J5975J3430J9636K2313
10781D76099K7354L7077N0813O2006Q7865J33513J68819K03688K21368K06580
$$ plain form
10882 210988 208704 204593 209199 208192 214273 216330 215260 216953 211594 214041 219047 226053 227357 231791
10868 231791 232547 235490 241330 243492 247741 248053 242144 236181 226218 223154 223885 225725 225046 223238 225259
10853 225259 232977 233589 225879 225448 228472 235964 237374 243703 248635 245014 251960 247279 242152 249421 262469
10838 262469 255548 254084 255423 263413 272953 277285 286179 286858 288492 296133 303880 308555 315771 315858 307710
10823 307710 303917 303769 307362 317311 320565 323881 336780 348187 356641 360041 361726 362442 366507 371211
10809 371211 366597 359599 356551 356463 350121 345534 336847 332358 336800 344177 350225 356080 360862 375706
10795 375706 382887 390093 390396 388360 398804 406868 404326 396926 397915 404745 420720 434150 453786 476099
10781 476099 503453 540530 591343 653349 741214 874727 1043546 1247234 1468602 1675182
10771A675182J61763J05821L8551n1644j29248j77408k01085k03452j90407j59895
10761H68178j16921q6487n7442m0108l0785j9251j6686j5448j3542j9688j2404
10750D39416o826j2503k2249j7173j5989o959j2154j8656j3517p652n897r016
10738B90825j0521j3661r053J936k175L027L751o027n469K80n589n340n079j075
10724B35830k35r777j3940m914K843l600O96j282q816m166j899l381p406p345
10710A72608o678l252L130m477n978m694k632k937p439N39N601J806J893K719
10696A50209j862J613M343L126k97K454Q398L631k307j1636p505o539p645o287
10682A29696k13N191m580k037K825K77j587M82Q012R877J2140J0462K3708J9351
$$ plain form
10771 1675182 1836945 1942766 1981317 1929673 1800425 1623017 1421932 1218480 1028073 868178
10761 868178 751257 664770 607328 567220 536435 517184 500498 485050 471508 451820 439416
10750 439416 432590 420087 397838 380665 364676 357717 345563 326907 313390 305738 299841 290825
10738 290825 280304 266643 257590 259526 257351 260378 264129 258102 252633 252913 247324 241984 236905 235830
10724 235830 235595 225818 211878 206964 209807 206207 206903 205621 196805 192639 190740 187359 179953 172608
10710 172608 165930 162678 165808 161331 155353 150659 148027 145090 137651 138190 143791 145597 147490 150209
10696 150209 148347 149960 154303 157429 157132 159586 167984 171615 169308 157672 150167 143628 135983 129696
10682 129696 129483 134674 130094 128057 130882 131159 129572 130054 138066 147943 160083 170545 194253 213604
10668B13604K5808K1117J6523P869r354j6860j5549j8343k1663j9709j1054p439
10656A64950L689L793j353r181n197K681J604K076l003J102O892P051J904o490
10642A70518j1719n884K078L584P849Q291R991J8653L2553M5368M3147L7169K5415
10629C87013K4199L505k1783k5677l9778l5244m5144l6057j3720J463l554j263
10617A93960n875k992N419O102J0167J0206n44k764k840o787O820K652N83M553
10603B18660J0605J2420Q367K863R776K0654J7656K4192L0092K9436K3681P006
10591D15408p296j4937k1098l4920m4786m2326l7570j4433j1664o923j0157o050
10579A63248q333q670o348m25Q68O430k869J712m883k848L273J0161P061m943
$$ plain form
10668 213604 239412 260529 277052 284921 275567 258707 243158 224815 203152 183443 172389 164950
10656 164950 168639 172432 171079 161898 156701 159382 160986 163062 160059 161161 168053 175104 177008 170518
10642 170518 158799 152915 154993 158577 166426 174717 184708 203361 235914 281282 324429 361598 387013
10629 387013 411212 414717 392934 367257 327479 292235 247091 211034 197314 198777 195223 193960
10617 193960 188085 185093 190512 196614 206781 216987 216443 213679 210839 204052 210872 213524 214107 218660
10603 218660 229265 241685 250052 252915 262691 283345 301001 325193 355285 384721 408402 415408
10591 415408 408112 393175 372077 337157 292371 250045 212475 198042 186378 179455 169298 163248
10579 163248 154915 146245 139897 139472 140340 146770 143901 145613 140730 137882 141155 151316 158377 153434
10565A53434j2561q156j4229j1656j5175r828p638p020N127J678j0038l509Q451
10552F8880J6810J0810L154M343J0436P739R810R116j5066l6915l4556k2180j1432
10539B0949N633J1495J1857L392j972K530N526J7154K2499J5155O068J3203J1025
10526A44514J0246J2656J923l370k977N840Q215R74j978m196j712n480j4680j0365
10512A39610o206o916j0274m605n151j0134j1119j5506k2813j5051q838q746j951
10499A2300P708J4047K3917K8189J0723j463R37j4196r991R800K3835K2602J9018
10486A47426J1857K3702M3137N5877P0656P8268N5724K1790J205J2637J3406Q403
10474E44088J6049N778m966p920k4106j9973r677p010m419n718Q343K4851J1636
$$ plain form
10565 153434 140873 132717 118488 106832 91657 81829 74191 67171 72298 73976 63938 60429 68880
10552 68880 85690 96500 99654 103997 114433 122172 131982 141098 126032 89117 54561 32381 20949
10539 20949 26582 38077 49934 53326 51354 53884 59410 76564 99063 114218 120286 133489 144514
10526 144514 154760 167416 169339 165969 162992 168832 177047 178021 176043 171847 170135 164655 149975 139610
10512 139610 133404 126488 116214 111609 106458 96324 85205 69699 46886 31835 22997 14251 12300
10499 12300 20008 34055 57972 86161 96884 95421 96358 82162 72171 81971 105806 128408 147426
10486 147426 159283 182985 226122 281999 352655 430923 486647 508437 509642 522279 535685 544088
10474 544088 560137 565915 560949 553029 528923 508950 499273 492263 487844 482126 490469 515320 526956
10461E26956J1631Q250n54N770O937p263J34P977J1144J1930J6569J3864M117
10448F17462k783J188j1245j2713o762L436M757O012J7790J6816J0078R816R445
10435F63297J3631J0250J3907J0304j15j140R603J1138K0423K6772M0513L6148
10423H54731K0652J7035K9973K6492K177J599J025o942k0418j6598J083P297Q741
10410I26847J4887L2977M4748L5956K0737J1050K7363M0193N3965P1418Q5614
10399A365755R1924R4314R3845P4400M4703K5541K7525L9980M7163N7871P6492
10388B039513J17003J51275J43357J50096J55567J62195J78248J96131K35059
10379C528444K84206L40811M04407M88757O18051P64330R29258J081657J244988
$$ plain form
10461 526956 538587 546837 546283 552053 558990 551727 551861 559838 570982 582912 599481 613345 617462
10448 617462 614679 615867 604622 591909 585147 588583 593340 599352 617142 633958 644036 653852 663297
10435 663297 676928 687178 701085 711389 711274 710134 719737 730875 751298 778070 818583 854731
10423 854731 875383 892418 922391 948883 951060 952659 953684 946742 926324 909726 910809 918106 926847
10410 926847 941734 974711 1019459 1055415 1076152 1087202 1114565 1154758 1208723 1280141 1365755
10399 1365755 1457679 1551993 1645838 1720238 1764941 1790482 1818007 1857987 1905150 1963021 2039513
10388 2039513 2156516 2307791 2451148 2601244 2756811 2919006 3097254 3293385 3528444
10379 3528444 3812650 4153461 4557868 5046625 5664676 6429006 7358264 8439921 9684909
10370I684909J389743J469002J463993J430058J491630J699311K048157K625506
10362B3302309L609448N107692P299919J0573150J5712681K3982798L6690733
10355A26278730N2927608O5396286O1885492L9316298J2729308l262688j7139859
10348C38131175m0694266o1944471o1173570m5248012k8847286j8356989j2363260
10341F9503321q770234o435909m849248l742049k992371k539791k309772k140172
10333C5723775k010104j999495k030862j974328j809532j579938j356087j189195
10325B1774234j076327j008930r70355r33233q84044q31037p65795o86424o13348
10316A4004741n55283n02021m67660m54872m52833m53122m57670m42845m30735
$$ plain form
10370 9684909 11074652 12543654 14007647 15437705 16929335 18628646 20676803 23302309
10362 23302309 26911757 32019449 39319368 49892518 65605199 89587997 126278730
10355 126278730 179206338 244602624 306488116 345804414 358533722 355271034 338131175
10348 338131175 297436909 235492438 174318868 129070856 100223570 81866581 69503321
10341 69503321 60733087 54297178 49447930 45705881 42713510 40173719 37863947 35723775
10333 35723775 33713671 31714176 29683314 27708986 25899454 24319516 22963429 21774234
10325 21774234 20697907 19688977 18718622 17785389 16901345 16070308 15304513 14618089 14004741
10316 14004741 13449458 12947437 12479777 12024905 11572072 11118950 10661280 10218435 9787700
10307I787700m23814l99528l60876l19319k77165k45563k34390k25903k24392
10298G076750k26881k24718k16560k12850j99596j86579j81105j76588j69077
10289E282796j64935j54292j65959j69284j46322j29027j14336r7027r5892r3613
10279C952109r7456r3073r6022r3806q7919q8077q6350q3619p9880p4516p3898
10268B997493p1759o6915p2782r3964j07442j18922j23443j24152j21917j21328
10258A974869j25277j24439j16256j07486j05134j01284q1188o8138o6648n7232
10248A021787n1328n1750n8917n7823n7944m3148m2217l7682l7965k0003j0257
10237E52753q641l858j8542j8239j7462o297l110K509l934j1493j9037k4365k0293
$$ plain form
10307 9787700 9363886 8964358 8603482 8284163 8006998 7761435 7527045 7301142 7076750
10298 7076750 6849869 6625151 6408591 6195741 5996145 5809566 5628461 5451873 5282796
10289 5282796 5117861 4963569 4797610 4628326 4482004 4352977 4238641 4141614 4045722 3952109
10279 3952109 3854653 3761580 3665558 3571752 3483833 3395756 3309406 3225787 3145907 3071391 2997493
10268 2997493 2925734 2858819 2786037 2692073 2584631 2465709 2342266 2218114 2096197 1974869
10258 1974869 1849592 1725153 1608897 1501411 1396277 1294993 1213805 1145667 1079019 1021787
10248 1021787 970459 918709 859792 801969 744025 700877 658660 620978 583013 563010 552753
10237 552753 544112 540254 521712 503473 486011 479714 476604 479113 475179 463686 444649 420284 399991
10224C99991l093L553J1129K9260L9945M2268M0420K9696J0766J204J571P485
10212F14195J1720J168r696j3773Q20O032Q427J5847K4778L5286L2218J8908k252
10199G43678j1402k9381l7943m2525m0030k6117k3861j3653j4398k0559q521j4784
10187D60504j2835j6546j2409r532j495O753K412j731J909Q311J0179M647Q022
10174D48189M127l210o789p393k971M445P055M371L157p44n824l151l213o106
10160D31943o050j7852k8411k6878j2748M28N570K4493J8560J1229k181J311j211
10147C98203k173L808m47l779r86k031n575o163k0101j4815p748j6442r214l737
10133C08800o096j700Q120K357o59p23o036k151l76j779n654r459j2105k302j0285
$$ plain form
10224 399991 396898 400451 411580 440840 480785 523053 563473 593169 603935 605139 606710 614195
10212 614195 625915 627083 617387 603614 604434 610466 618893 634740 659518 694804 727022 745930 743678
10199 743678 732276 702895 664952 622427 582397 556280 532419 518766 504368 483809 475288 460504
10187 460504 447669 431123 418714 409182 407687 414440 416852 415121 417030 425341 435520 440167 448189
10174 448189 452316 449106 442317 434924 431953 436398 443453 447824 450981 450237 444413 441262 438049 431943
10160 431943 425893 408041 379630 352752 340004 340432 346002 370495 389055 400284 398103 399414 398203
10147 398203 396030 399838 399391 395612 394626 392595 387020 380857 360756 345941 338193 321751 312537 308800
10133 308800 302704 301004 309124 311481 310822 310099 304063 301912 301536 299757 294103 284644 272539 270237 259952
10118B59952j2714j2107M90o249O29m739l167r738j0780j4133p535n875n431k509
10104A66094K465K842J89k679n163p016m297l217n679m545m031J576J250J370
10090A39159O612N602k085J0244M931k08M058l790m005k503l89O031L775r849
10076A57583n237k199p284j1073m102n283o734k826k299l67k325K341k349j2572
10062I5274j1662L80k545o228q082q80K767L682J3270J0456L064K700k458l327
10048I6411l974k813n933j1804k410J651q14j70O37M606j596Q747k310Q753N277
10033I4258M749L027O198Q003j441j1732j0975m064O796K359m149J887M199J922
10019A01037l570k124K241o538p241J656L253O144j351q151m571n202K070J258
$$ plain form
10118 259952 247238 235131 235621 229372 230001 225262 222095 212357 201577 187444 179909 174034 168603 166094
10104 166094 168559 171401 171590 168911 163748 156732 152435 149218 143539 138994 134963 136539 137789 139159
10090 139159 145771 151373 149288 159532 164463 164255 168313 164523 160518 158015 157626 163657 167432 157583
10076 157583 152346 150147 142863 131790 127688 122405 115671 112845 110546 110179 107854 110195 107846 95274
10062 95274 83612 83992 81447 75219 67137 66257 69024 72706 85976 96432 99496 102196 99738 96411
10048 96411 92437 89624 83691 71887 69477 71128 70314 70144 70781 75387 73791 82538 80228 88981 94258
10033 94258 99007 102034 108232 116235 114794 103062 92087 88023 94819 97178 93029 94916 99115 101037
10019 101037 97467 95343 97584 91046 83805 85461 88714 94858 93507 85356 80785 75583 77653 78911
10005G8911j529J278J432Q517l174n663K755K94O355L718o129p976l288J90q295
9990F7396l559L563l122K771R381J540L09p985J091K338p428o419k097k608q76
9975E4295K654O719Q060K10L883P11J7J1356J447Q46l953M121m169N59l46J922
9959H8332r563n438m208p318j204N585O289K756J785j702P65N963Q043J4805Q635
9944A13525P217N219J1094J1209P807J2571J0933K6012M4629N4199P4805J12153
9932D91373J47545J76275K15059K30652K02770J51968R0055O513p9516j52150
9922A480544j93301k02837j91860j63790j26372q6419p0950n4226l5054l8569
9912C17166k4247j9390j8815j6829j5984j2415r843o299p776r622M060l374l053
$$ plain form
10005 78911 77382 78660 80092 88609 85435 79772 82527 82821 89176 92894 86765 78789 75501 75691 67396
9990 67396 63837 67400 64278 67049 76430 77970 78279 70294 71385 73723 66295 59876 57779 55171 54295
9975 54295 56949 63668 71728 71938 75821 76532 76549 87905 89352 90198 86245 90366 86197 86756 86410 88332
9959 88332 78769 73331 69123 61805 60601 66186 72475 75231 77016 75314 76079 82042 90085 104890 113525
9944 113525 120742 125961 137055 148264 156071 168642 179575 205587 250216 304415 379220 491373
9932 491373 638918 815193 1030252 1260904 1463674 1615642 1705697 1712210 1632694 1480544
9922 1480544 1287243 1084406 892546 728756 602384 515965 445015 390789 355735 317166
9912 317166 292919 273529 254714 237885 221901 209486 199643 193344 185568 175946 180006 176632 173579
9899A73579j0080j8362o406p246r821r884j7705j5261p754n927m309k480J211
9886E9555l382K019N361K862J2222J3846q44j2510r374n210J69m667o939m517
9872D8591L968M026M414L283K87p141o854J0376L193o76k296j563J431l702r522
9857D7815n435M171K902O909J607p774o70J102K867j977l626l050q49M3k34l919
9841C9882j07M332M364J605r45j508N63m875m579q43P5k928M746j987j33Q168
9825D5830J771k229k871O141N647l596r591k581l1p816o229m338n37m592k848
9810A2130P667P279K919l070O627M040l365m530J66M498Q28l483j403k098J533
9795B9738K864N207K997l746q185j921Q93k695M033P70m918k921N687L054J177
$$ plain form
9899 173579 163499 145137 138731 131485 121664 111780 94075 78814 71060 65133 60824 58344 59555
9886 59555 56173 58192 63553 66415 78637 92483 91639 79129 69755 64545 64714 60047 53108 48591
9872 48591 52559 56585 60999 64282 64569 57428 50574 60950 64143 63467 61171 59608 61039 57337 47815
9857 47815 42380 46551 49453 56362 57969 50195 49525 50627 53494 51517 47891 44841 43992 44035 43801 39882
9841 39882 39775 44107 48471 50076 49131 47623 48186 43311 38732 37889 37964 35036 39782 37795 37662 45830
9825 45830 47601 45372 42501 48642 54289 50693 41102 38521 38490 30674 24445 20107 19570 14978 12130
9810 12130 19797 27076 29995 26925 33552 37592 34227 29697 29863 34361 35189 31706 30303 28205 29738
9795 29738 32602 37809 40806 37060 28875 26954 27847 25152 29185 29955 25037 22116 27803 30857 32034
9780C2034k272K405P215n01p635p735L223J283o203n513K05N811m011l19N468
9765B3455J2021P133q47r079o970j553M13j388O256l556q417j129l498K975J0947
9750B6763k862p020r200N965N057J514o520K830J924O602m89O075L302J699j933
9735C3707l804n76n590k752N973j48m439m743q261J511M422M895O342L582K287
9720C2406m340o95L56k557o18l294o002P657L578J539m939k399M150K910j542
9705B6210j793M199k261p634n927N289J877j999j833k717j482K721O67r54M25
9690A4788N450O179M263n930k569k01K879K484j715k067L598j619p841J94K288
9675B0181M072P26j14L19K696m66L775k422L221k966J101J942n217l333n110K498
$$ plain form
9780 32034 29762 32167 39382 38881 31246 23511 26734 28017 21814 16301 16506 22317 18306 17987 23455
9765 23455 35476 42609 41762 32683 25713 24160 24573 23185 29441 25885 17468 16339 12841 15816 26763
9750 26763 23901 16881 7681 13646 18703 20217 13697 16527 18451 25053 24564 30639 33941 35640 33707
9735 33707 29903 29327 23737 20985 26958 26810 22371 17628 9367 10878 15300 20195 26537 30119 32406
9720 32406 28066 27371 27727 25170 24552 21258 15256 22913 26491 28030 23091 20692 24842 27752 26210
9705 26210 24417 28616 26355 18721 12794 18083 19960 17961 16128 13411 11929 14650 15317 14363 14788
9690 14788 20238 26417 30680 24750 22181 21980 24859 27343 25628 23561 27159 25540 17699 17893 20181
9675 20181 24253 24979 24865 25184 27880 27414 31189 28767 31988 29022 30123 32065 26848 23515 18405 20903
9659B0903P77M39N41k658k202n670N001J2310M830o810L534J0970P07r575o857
9644B6240K547q44J577J345k955J057l216o093n182m139L742M844K558J198M825
9629B7504k554L384J739k520q385k324j696J831K441J724J697k799r538k293Q146
9614A6357P991K215M811Q53k406r456m864J84m063L195n876l898K46J0584N626
9599B1499L089m168o968L321P008J868j884j126k168R2n48K137k765r552l114
9584F721r12K707j075K964Q2N73q00k530j66o753m73R736J879l252J614k420K98
9567H193P799L80l055P995M170L47K382P3j911q035n21J0078O187n361j466r111
9551A8144m276n370l354J383R557J179m112n033m864O019l200L711J4763K65q556
$$ plain form
9659 20903 21680 22119 22660 20002 17800 12130 17131 29441 34271 27461 30995 41965 42672 33097 26240
9644 26240 28787 27943 29520 30865 27910 28967 25751 19658 14476 10337 14079 18923 21481 22679 27504
9629 27504 24950 28334 30073 27553 19168 16844 15148 16979 19420 21144 22841 20042 10504 8211 16357
9614 16357 24348 26563 31374 32227 29821 20365 15501 15685 11622 14817 8941 5043 5289 15873 21499
9599 21499 24588 20420 13452 16773 23781 25649 23765 22639 20471 20563 20015 22152 19387 9835 6721
9584 6721 5809 8516 7441 10405 10487 11060 10260 7730 7564 811 338 10074 11953 8701 10315 7895 8193
9567 8193 15992 16372 13317 21312 25482 25829 28211 28284 26373 18338 17817 27895 34082 28721 27255 18144
9551 18144 13868 8498 5144 6527 16084 17263 13151 8118 3254 9273 6073 9784 24547 24812 16256
9536A6256l545k080N585O036N45M175l529K513R033O54l828L559q762q322m158
9521A4132j751j885N151K706J836k179n221L679M203o421j299M858K449K59M142
9506B4659l85n335n031j81K372J466j363M39N607L68M639K23j829p371m499J888
9490A5667M839l962l270n845j413j423L23O129L600k938m624k587M121l98K931
9475A1150L119N076k447q983l333O12L531L172n004k266K773J483L004j694m085
9460F108k157k889m342r3L447K310J548N963Q709O28Q84l119L02N17l066k813
9444A1937M305k013n938m97j172l295M73o31L316N775l713n398n145m412J2715
9429F307L104l272m799p974J376O511P478j500L95J128Q086K368J99k809n771
$$ plain form
9536 16256 12711 10631 16216 22252 22797 26972 23443 25956 34989 35643 31815 35374 26612 18290 14132
9521 14132 12381 10496 15647 18353 20189 18010 12789 16468 20671 14250 12951 17809 20258 20517 24659
9506 24659 24274 18939 13908 13727 16099 17565 16202 16641 22248 22616 27255 27478 25649 18278 13779 15667
9490 15667 20506 16544 13274 7429 6016 4593 4916 11045 14645 11707 7083 4496 8617 8219 11150
9475 11150 14269 19345 16898 7915 4582 5194 8725 11897 6893 4627 7400 8883 11887 10193 6108
9460 6108 3951 1062 -3280 -3373 74 2384 3932 9895 18604 19232 20116 16997 17299 17816 14750 11937
9444 11937 16242 14229 8291 7794 6622 3327 3800 3169 6485 12260 8547 3149 -1996 -6408 6307
9429 6307 9411 6139 1340 -6634 -5258 1253 8731 7231 7626 8754 16840 19208 19407 16598 10827
9414A0827L194M216j859p882q016K48M657j900j062O87o87K619m577q52j084J283
9398a88M927K089l161J727M913J972N6K28O97l40R71r88L616L565L599K11j871
9381B2023o889l034n688m574k060j586N457K131N40K711o37l360N050M556k565
9366A2075n204n970K784O4N015j761O588N93J696P59M063J164l117m77p643M859
9350A5488K56q473m31P200l358K428L841l096m290j405L79r13M393P043n791m211
9334I060K694J300N43L158m126K366M048M114r46k553o163m540J011J326r48o18
9318I726P40L668m05L947L720k718J886q639p800k396l58l227n120O342L179L461
9302F006J555J49k004J285m12K933k411L662j496o489R27j187k739l401O272o30
$$ plain form
9414 10827 14021 18237 16378 8496 480 728 5385 3485 2423 3110 2423 5042 465 -387 -1471 -188
9398 -188 4739 6828 3667 5394 10307 12279 12335 12563 13260 12920 13891 12903 16519 20084 23683 23894 22023
9381 22023 15134 12100 6412 1838 -222 -1808 3649 5780 6320 9031 8394 5034 10084 14640 12075
9366 12075 6871 901 3685 3749 8764 7003 13591 14184 15880 16639 20702 21866 18749 18272 10629 15488
9350 15488 15744 7271 6840 14040 10682 13110 16951 13855 9565 8160 8539 7626 12019 19062 13271 9060
9334 9060 11754 13054 13597 16755 12629 14995 19043 23157 22211 19658 13495 8955 9966 11292 10344 9726
9318 9726 10466 14134 13729 17676 21396 18678 20564 11925 4125 1729 1371 -1856 -6976 -634 2545 6006
9302 6006 7561 7710 5706 6991 6579 9512 7101 10763 9267 2778 3705 2518 -221 -3622 2650 2020
9286B020M596O561M765j565J587J972n481m676k037M666K608k381j041J213J272
9271A4079q613n948L077N240O925j178n19n639k254P296l436J071Q685p53m317
9256A3716k598o341j185J206m836L013J2010O548o75l237J515j39o228n591j026
9241F152K482k827n21M719J119L351K061K30m291j63O102k656l813J39m901L389
9225A0572J119P645Q117m415l537o931r503l233l22N038N82J51K27L57P14m899
9209A682m432M897l91K086P410K172J310k557o293m365K936Q500K484J410j196
9194A5653j169J115m548r145M480J0196k684n196o199l319K465M720P116L779
9180A7264j844o701P23L442K60q22o773n171l033J544N278P66N380m105N920l194
$$ plain form
9286 2020 6616 13177 17942 16377 17964 19936 14455 9779 7742 12408 15016 12635 11594 12807 14079
9271 14079 5466 -482 2595 7835 14760 13582 13063 7424 5170 12466 9030 10101 18786 18033 13716
9256 13716 11118 4777 3592 4798 -38 2975 14985 21533 20858 17621 19136 18997 12769 7178 6152
9241 6152 8634 5807 5286 10005 11124 14475 16536 16766 12475 12312 18414 15758 11945 12084 7183 10572
9225 10572 11691 19336 27453 23038 19501 12570 3067 -166 -488 4550 5132 5283 5510 5867 6581 1682
9209 1682 -2750 2147 1756 3842 11252 13424 14734 12177 5884 1519 4455 12955 15439 16849 15653
9194 15653 14484 15599 11051 1906 6386 16582 13898 8702 2503 -816 1649 6369 13485 17264
9180 17264 15420 8719 9442 12884 13144 12322 5549 378 -2655 -1111 4167 4933 10313 6208 12128 8934
9164H934M235L210K755M290N419M160n127j293l097l565o478m367k49J504K453
9149A2784L437j240m900o041J955K361O778l545m711L817Q152L88j662o59J175
9134A8089m474j237r448R58O335j628K938k218J799Q104J945J900k275l572j1570
9119E646k019P307l251l944J763L032L393K078m737l056M607Q032J616K751j949
9104B1269q705N601P58n028l843k853K161r79m472J62m442o46M178j289k630Q439
9088G681N089j940k368p46l61k345o56K679k076m290J243Q99L362M623L053q653
9072E194j8j473k13q12l813k664J958J829M522k90n84O273j15R64o59J598O676
9055A8373K358p810j2002P208j982k90o7r572L186J3275n82l175n337r38J308
$$ plain form
9164 8934 13169 16379 19134 23424 28843 33003 27876 26583 23486 19921 13443 9076 8827 10331 12784
9149 12784 16221 14981 10081 4040 5995 8356 15134 11589 6878 10695 18847 19235 17573 16914 18089
9134 18089 13615 12378 2930 3888 10223 8595 11533 9315 11114 19218 21163 23063 20788 17216 5646
9119 5646 3627 10934 7683 3739 5502 8534 11927 14005 9268 6212 10819 18851 20467 23218 21269
9104 21269 12564 18165 18923 13895 10052 7199 9360 8381 3909 4071 -371 -1017 3161 1872 -758 7681
9088 7681 12770 10830 8462 7716 7355 5010 4354 7033 4957 667 1910 2809 6171 10794 13847 5194
9072 5194 5176 3703 3490 2678 -1135 -3799 -1841 -12 4510 4220 3636 9909 9794 10758 10099 11697 18373
9055 18373 20731 12921 919 8127 6145 5855 5788 -3784 -598 12677 12095 8920 3583 2645 3953
9040C953K821n705j138M027m8L269j407k955K35L36R55r69j224l85M163J40R91
9023G059r43K250P989o26k927j632m432o89M139M50K90j585J774P91l813O944
9007A5039L378j263m08P016J676j076p64q571p174m204j204K721k607p005k827
8992g273Q637O958K552k929q4m07n478N242Q060M008m366J148M319r146j765n57
8976H919K595m170p082K65L302M667R221k623l704m620q263K618K930J092L408
8961H555L814J190j508p153l451l897K780J078L220M474J430L152r330j5038M98
8946a0186K712R273O403l32k96p66K219J800n9k039r73L028K292J771O074p467
8930A3454p054M123m080l021M78J384n83j642l147k177l080JO575O176o362p164
$$ plain form
9040 3953 6774 1069 -69 3958 3910 7179 5772 2817 3052 3388 4343 3374 2150 1765 5928 6068 7059
9023 7059 6116 8366 16355 15729 12802 11170 6738 6049 10188 10638 10928 9343 11117 11908 8095 15039
9007 15039 18417 17154 16746 23762 25438 24362 23598 15027 7853 3649 2445 5166 2559 -4446 -7273
8992 -7273 1364 8322 10874 7945 7861 7454 1976 7218 15278 19286 14920 16068 20387 11241 9476 8919
8976 8919 11514 7344 262 527 3829 8496 17717 15094 11390 6770 -1493 1125 4055 5147 8555
8961 8555 12369 13559 12051 4898 1447 -2450 330 1408 4628 9102 10532 13684 4354 -10684 -10186
8946 -10186 -7474 1799 8202 7870 7574 6808 9027 10827 10768 8729 7756 10784 13076 14847 20921 13454
8930 13454 6400 10523 6443 3422 3900 5284 4701 3059 -88 -2265 -5345 -5344 1231 7407 1045 -6119
8914f119m533M987N115j187l922K754L908L369J436j075j212K78m026k576R79
8899a824l703q0K826K273K240n95l3K405J837N94K467M398n12k382j0127n049
8883e265P409Q06k20j506J348J631K209J769L143N466m647Q02P344L361m336o422
8867A2892j332K16K72k631l04l993m833m732o86N720P29k134j447j77O897L125
8851G582O56N456R221q170p071j639k079o551m44L908P479L849l245k487k787
8836C678N073L844O776m575l371k645r06K899j244o510j695o219J748N963K613
8821E429R21O212o014N36Q43K413J248k353k034m216n199j885l51L420N750m86
8805D234L168k856M09K325P202K60p089M215k92k069k610P978j588K520k731l79
$$ plain form
8914 -6119 -10652 -5665 -550 -1737 -5659 -2905 1003 4372 5808 4733 3521 3799 -227 -2803 -1824
8899 -1824 -5527 -5607 -2781 -508 1732 1137 1104 3509 5346 5940 8407 12805 12293 9911 -216 -5265
8883 -5265 2144 2950 2730 1224 2572 4203 6412 8181 11324 16790 12143 12945 20289 23650 19314 12892
8867 12892 11560 11776 12048 9417 9113 5120 287 -4445 -5131 589 1318 -816 -2263 -2440 4457 7582
8851 7582 8238 13694 22915 14745 7674 6035 3956 -2595 -3039 869 8348 12197 8952 6465 3678
8836 3678 8751 12595 19371 14796 11425 8780 7874 10773 9529 3019 1324 -4895 -3147 2816 5429
8821 5429 6350 12562 6548 7084 7927 10340 11588 9235 7201 2985 -2214 -4099 -4450 -1030 4720 4234
8805 4234 7402 4546 4955 7280 14482 14742 7653 11868 11576 9507 6897 14875 13287 15807 13076 12697
8789A2697O788l461J240k172o58J751q69L96o404J040J1002Q461l053n45k65j0764
8773A5184p770o60n290l142N232J1438l883j755m568q300j691M042K725K072n865
8758b231k56K442K052K73J660k68O207K038k32j85l76k939j496O47M570j80N80
8741A2306J008M292p958j39K650j398R032L291j545m97n287l502j649J587M524
8726A6715K465q841p81O79p06l07K550l674K170N785J096k802j860P433J998n576
8710A6344j115L54J867L875J840o936j0517j103j232J923K178n8p47M395J806
8695A2874M743N001O492N949l343m205J673k965o362M723J0965M677q051l493
8681B8678n298n83K183J356j633r79m977j702J325L324L470j124L036o896p872
$$ plain form
8789 12697 19485 16024 17264 15092 14434 16185 15316 15712 9308 10348 21350 29811 26758 26213 25948 15184
8773 15184 7414 6754 1464 -1678 3554 14992 11109 9354 4786 -3514 -5205 -1163 1562 3634 -2231
8758 -2231 -2487 -45 2007 2280 3940 3672 9879 11917 11685 11500 11124 8185 6689 7336 11906 11726 12306
8741 12306 13314 17606 9648 9509 12159 10761 19793 23084 21539 21042 15755 12253 10604 12191 16715
8726 16715 19180 10339 9558 10237 9531 9224 11774 8100 10270 16055 17151 14349 12489 19922 21920 16344
8710 16344 15229 15583 17450 21325 23165 16229 5712 4609 3377 5300 7478 7420 6673 11068 12874
8695 12874 17617 22618 29110 35059 31716 27511 29184 26219 19857 24580 35545 40222 32171 28678
8681 28678 23380 22797 24980 26336 24703 23724 18747 17045 18370 21694 25164 24040 27076 20180 12308
8666A2308O891q136k126K218L787N410M271l503o542j035k617N292j282l76L526
8651A8086R412M078M21J3175K0103Q206k599m667R78n049j1798r342o855o702
8637B7447o614q99r028O44J4606J436p266L287m82O31N383P80l806o02K510J608
8621B9635J44l862N913J863m127r68O361K688o380j3796j978M468K895r47j728
8606B0181q183l388O003M972N050K790k3J717N595O063o246m455J706q747m543
8591A8492M018Q433K760J30O918J800N82M324l742m413K419K889l223K059N71
8576D4017J574k859k975J774Q246J0767N961k831m519m228J210J69m631l769l313
8561D4593j281n558J709r74L68O172Q84p494m184r808m530r0P038L610m772m53
$$ plain form
8666 12308 19199 11063 8937 11155 14942 20352 24623 21120 14578 13543 10926 16218 14936 14560 18086
8651 18086 27498 31576 31997 45172 65275 73481 70882 66215 67193 62144 50346 41004 34149 27447
8637 27447 20833 19934 10906 11550 26156 27592 20326 23613 23131 23762 29145 29925 26119 25517 28027 29635
8621 29635 29779 25917 31830 33693 29566 28598 34959 37647 31267 17471 15493 19961 22856 21909 20181
8606 20181 11998 8610 14613 19585 24635 27425 27402 29119 34714 40777 34531 30076 31782 23035 18492
8591 18492 22510 30943 33703 33833 40751 42551 43133 47457 43715 39302 41721 44610 41387 43446 44017
8576 44017 45591 42732 39757 41531 49777 60544 66505 63674 59155 54927 56137 56306 51675 47906 44593
8561 44593 43312 37754 39463 38489 38857 45029 45913 38419 34235 24427 19897 19807 26845 30455 25683 25230
8545B5230p093M79J3342L791P68k613q092k519j015k443j389O263l709l646M60
8530A7814M129M674L588l696k055L422Q958r033l750j297L993O331j823J450k132
8515C0573n408M29K372J218o92m671j672L709K75K822P224l280K559j419q899
8500B5140o98L390j452N389J954n009K944P411K1k25J145o505l967L268N374P933
8484D6113k775m270o327m90J0198P86J358O42K036r053N92M417K805J856m488
8469D3400j663M658m913j277j061l55j044p136j135o41P6j601R79p329k212Q65
8453A9611O3K545P156L989l611m209k778P618J1725j542q65j638m443L484K088
8438C9193k081J08P595j102o803J947k830o612L187P507j941j934J892M119k272
$$ plain form
8545 25230 18137 18616 31958 35749 36517 33904 25812 23293 22278 19835 18446 24709 21000 17354 17814
8530 17814 21943 26617 30205 26509 24454 27876 36834 27801 24051 22754 26747 33078 31255 32705 30573
8515 30573 25165 25594 27966 29184 28492 23821 22149 25858 26133 28955 36179 32899 35458 34039 25140
8500 25140 24442 27832 26380 31769 33723 28714 31658 39069 39090 38865 40010 33505 29538 32806 38180 46113
8484 46113 43338 39068 32741 32251 42449 43235 44593 45235 47271 38218 38810 43227 46032 47888 43400
8469 43400 41737 46395 41482 40205 39144 38789 37745 30609 29474 28833 28909 27308 28287 20958 18746 19611
8453 19611 19674 22219 29375 33364 29753 25544 22766 30384 42109 40567 39702 38064 33621 37105 39193
8438 39193 37112 37220 44815 43713 36910 38857 36027 29415 32602 40109 38168 36234 38126 42245 39973
8423C9973j2419L276n672o274k626k6L751j152K158n72J0183j54j1184p628q28
8408A0806l879j938j5P204r67K143N270Q179J589o312n38L454L100l34j143k563
8392B4056P51L43m450K232j383K046K693o612p22q24L258O41k504l822m44m564
8376A0695n698J847j992o414O659j411L349k892J0L106n132QL422M512o40O304
8360A5733Q500L632K92N9o517j3398q338P16M257N518K898j896j459K011R678
8345B1686O007k006q18n671N638O754K610J138l289m854m946j128l652Q35N2j19
8329A8237N787R080m215j4040r542j47K318O094j819l529O602R602K075n184o746
8314A4573O95l906m315L535M333O243K689K69p195n895O734N623l684l38k606
$$ plain form
8423 39973 27554 30830 25158 18884 16258 16232 19983 18831 20989 20417 30600 30446 19262 11634 10806
8408 10806 6927 4989 4974 12178 11211 13354 18624 26803 28392 22080 21542 24996 28096 27762 26619 24056
8392 24056 24807 25150 20700 22932 21549 23595 26288 19676 18954 18130 21388 22029 19525 15703 15259 10695
8376 10695 4997 6844 4852 -1562 5097 3686 7035 4143 4153 7259 2127 2135 5557 10069 9429 15733
8360 15733 24233 27865 28157 28216 21699 8301 -37 679 4936 10454 13352 11456 9997 12008 21686
8345 21686 27693 25687 24869 19198 24836 31590 34200 35338 32049 27195 22249 21121 17469 18304 18356 18237
8329 18237 24024 33104 28889 14849 5307 5160 7478 13572 11753 8224 14826 24428 26503 21319 14573
8314 14573 15268 11362 7047 10582 14915 21158 23847 24116 16921 11026 17760 23383 19699 19361 16755
8299A6755o944p199K810J620M954K115Q99n150L977P595K108q136o971N318N079
8284A8830K010n289k962L668L492J266n513o054O84N556J160l975k119n390J321
8269F685K03L04j64k438O99J141J394M881k018k333K005m593M669P882M236K3
8253B2576L150j370m580l330p675l358J161N90K750J695M295N24K858K29j053
8238A8462P76n16j312k267m882j506k146L334K769N70Ol545q140p031k392J0253
8222B433L401m506l824Q256N019j189N97j330m061n654m53K005p65J127N813J679
8206H548k111P8m30l46k74P76J261n368j510J833l340N10O022L858j95k192j20
8189G000O69K253k093k541P146K122q15j065j28k455p756J247k525J534k777o90
$$ plain form
8299 16755 9811 2612 5422 7042 11996 14111 15010 9860 13837 21432 23540 15404 8433 13751 18830
8284 18830 20840 15551 12589 16257 19749 21015 15502 9448 10132 15688 16848 12873 10754 5364 6685
8269 6685 6888 7192 7028 4590 5289 6430 7824 12705 10687 8354 10359 5766 10435 18317 22553 22576
8253 22576 25726 24356 19776 16446 8771 5413 6574 7164 9914 11609 15904 16428 19286 19515 18462
8238 18462 19238 18722 17410 15143 10261 8755 6609 9943 12712 13282 13288 9743 1603 -5428 -7820 2433
8222 2433 5834 1328 -2496 5760 10779 9590 10187 8857 4796 -858 -1311 694 -71 1056 6869 8548
8206 8548 6437 6515 6085 5739 5465 6241 7502 2134 624 2457 -883 -373 5649 9507 9312 7120 7000
8189 7000 7669 9922 7829 5288 12434 14556 13741 12676 12548 10093 2337 3584 1059 2593 -184 -874
8173h74P269Q386M56j589m771l250k389q94o175j224M773R669j88M346J841j976
8157A3410j2l756m49Q39l031K901O576m292R91J157k471p73j129j686N458l721
8141A0012J295L51K546Q001j476o104k615J640Q20L125m729p391n737k373J195
8126a440J679j178l70J318M431O103J905N720l352l92j00m78k872N463K7k988
8110A3476L489l506l043Q05m822K742L944l076J509J0995j406k438m050o477K495
8095A0637J19p73o33k952l689K436O558J4783L814P31O33j496j0872o379q221
8080D696j0805K896N074R712N484O24j983o028K661M545M590j180m294p102k156
8065F734K347K031J944n513M173K750J614P114m123m46l303Q70j114P219L696
$$ plain form
8173 -874 6395 14781 15237 13648 8877 5627 3238 2344 -3831 -5055 -282 9387 9199 13545 15386 13410
8157 13410 13398 9642 9193 10032 7001 9902 16478 12186 13177 14334 11863 11090 9961 8275 13733 10012
8141 10012 11307 11658 14204 22205 20729 14625 12010 13650 14470 17595 12866 5475 -262 -2635 -1440
8126 -1440 239 -939 -1309 9 4440 10543 12448 18168 14816 14424 14324 13846 10974 16437 16464 13476
8110 13476 16965 13459 10416 11221 6399 9141 13085 10009 11518 22513 21107 18669 14619 8142 10637
8095 10637 10756 9983 9350 6398 2709 5145 11703 26486 30300 31031 31664 30168 19296 12917 4696
8080 4696 -6109 -3213 1861 11573 17057 17681 15698 9670 12331 16876 21466 20286 15992 8890 6734
8065 6734 9081 11112 13056 7543 11716 14466 16080 23194 19071 18625 15322 16192 15078 22297 25993
8050B5993n909o164L447K212K996K862j702J959R790k566j1474o675M690M382
8036B3841l338j28j540P281J050p715q18r294o02N047l681j300j919k092J879
8021F671K12N740O86j430r498k641O506K4j367m570L909K735k689M264p03Q40
8005H689j361M837L371l782L577O959K147N843J81m204M393J42o43j946o743p141
7989A4319j437J680l526R96j533K063m032j360l187R427P052k714p934l698Q026
7974A4142R085m578o915P227P35K86j201l436l598M188N772k423l940l619N111
7959A6836N180l089r054r601j235N5k375N317P284L427m536o723R721R522j028
7944A9701k566n421j02K217O585L201o473L670l227k76k368p384K02k385J552
$$ plain form
8050 25993 20084 13920 17367 19579 22575 25437 23735 25694 35484 32918 21444 14769 19459 23841
8036 23841 20503 20375 18835 26116 27166 19451 18633 9339 8737 13784 10103 8803 6884 4792 6671
8021 6671 6883 12623 13309 11879 2381 -260 6246 6270 4903 333 4242 6977 4288 8552 7849 8689
8005 8689 7328 12165 15536 11754 15331 22290 24437 30280 30461 26257 30650 30792 30149 28203 21460 14319
7989 14319 12882 14562 11036 12032 10499 12562 8530 7170 3983 13410 20462 17748 9814 6116 14142
7974 14142 23227 18649 11734 18961 19696 19982 18781 15345 11747 15935 21707 19284 15344 11725 16836
7959 16836 22016 18927 9873 272 -963 -908 -3283 2034 9318 12745 8209 1486 11207 20729 19701
7944 19701 17135 11714 11612 13829 20414 23615 17142 20812 17585 17309 14941 7557 7759 5374 6926
7929F926J443K889kQ75k385M426M842r7k255l845N5L634j000N071N57k925m212
7912A3997o272j571k437n916n313R723Q223R39L503j121p478o966N70O683L174
7897I738k09J954N057j994n029n009l925M847O667R72k255J151l08o294O0P515
7881A2938l636p059j773m14M200K731R38k467J626R89j205L960J525k473K045
7866A1925K223L49J810l666m073j841k399k246n945J387O635k410L655R747O389
7851B1540r491q939k292J00J874j555j26M218k797n538j255M671L241P150M708
7836A5509n500r39J13l118j66Q70l545K790O278L154j76r71k026o035q10j824
7820C604J688K383k83K850K239k254m151r740n73N031M658k656l879J825m838
$$ plain form
7929 6926 8369 11258 11256 12131 9746 14172 19014 18917 16662 12817 12872 16506 15506 20577 21134 18209 13997
7912 13997 7725 6154 3717 -2199 -7512 2211 10434 11373 14876 13755 6277 -689 -119 6564 9738
7897 9738 9529 11483 16540 14546 9517 4508 583 5430 12097 13069 10814 11965 11657 5363 5423 12938
7881 12938 9302 2243 470 56 4256 6987 7925 5458 7084 8073 6868 10828 12353 9880 11925
7866 11925 14148 14497 16307 12641 8568 6727 4328 2082 -3863 -2476 4159 1749 5404 15151 21540
7851 21540 12049 3110 818 918 2792 1237 1111 5329 2532 -3006 -4261 410 3651 10801 15509
7836 15509 10009 9070 9183 6065 5899 6769 3224 6014 12292 15446 15270 14299 12273 6238 5428 3604
7820 3604 5292 7675 7392 10242 12481 10227 6076 -3664 -4237 794 5452 2796 -1083 742 -4096
7805d096p847Q930O828J247n189K7l756k802M703M118l704l274K667K665j17L13
7789G13k438n234m342P017M743P729M663l062J573m89k127L992J30m767p817j253
7773i69m06P372P9r61p423o798M9O975l619k900j251M457N008N51K384n13J200
7756C235o801M87N621j681M54j047n85P770M415k363p963M097L414J064K925J490
7740A4532q490p131n121o88M76L725P71K846k603o954l153L020k195O093M324
7725e48l421J71k589k212n65K249K568M361L163K120k098k544M901j185p298L397
7709D70K084p619l672j222J820K230J123j533l851j456Q366M935j618J49N71N909
7693F686l613j466J772J34r283l35L467J85J321q5j7m028N946P106j670J799J742
$$ plain form
7805 -4096 -11943 -3013 3815 5062 -127 -100 -3856 -6658 -1955 2163 -1541 -4815 -2148 517 400 713
7789 713 -1725 -6959 -11301 -4284 459 8188 12851 9789 11362 10873 8746 12738 12868 8101 284 -969
7773 -969 -1375 5997 6076 5115 -2308 -9106 -9057 -2082 -5701 -8601 -9852 -5395 -387 164 2548 2035 3235
7756 3235 -3566 -3079 2542 861 1315 268 -317 7453 11868 9505 1542 5639 9053 10117 13042 14532
7740 14532 6042 -1089 -6210 -6898 -6422 -2697 -1926 920 -1683 -8637 -11790 -8770 -10965 -4872 -548
7725 -548 -3969 -3798 -6387 -8599 -9164 -6915 -4347 14 3177 5297 3199 655 5556 4371 -2927 470
7709 470 2554 -5065 -8737 -9959 -8139 -5909 -4786 -6319 -10170 -11626 -3260 1675 57 206 777 6686
7693 6686 3073 1607 3379 3513 -5770 -6105 -2638 -2453 -1132 -1217 -1234 -5262 684 7790 6120 7919 9661
7676I661K30o152L52M573l231q622p97j190N68R5L595N61j071J483o39l966J930
7659b620R438j505j557k187m453n236n325m94l598m751j48J657J944K501K182
7644a4152R14M450O085L148P531k969m000k740m046L436Q187m558P488J0502k294
7629A6982m989q131j0452J832N766M234J062n369J529M790k426p676o222J088
7615g982L964l133k830K107l291R54P753o42j1223L154Q830J0192l722l316j576
7600g61o450n019m807K98N345N109P918m070k782K692j591r42L51k212O25M970
7584a326K114J628J030J131M64j0123J790P672L34n21k804k0K113K36j032p764
7568e078j437k769k199j531L522J0375k495R78k85L462K898l092p842K189K419
$$ plain form
7676 9661 9891 3739 4091 8664 5433 -3189 -3986 -5176 -4608 -4513 -918 -357 -1428 55 -584 -4550 -2620
7659 -2620 6818 5313 3756 1569 -2884 -8120 -13445 -13939 -17537 -22288 -22436 -20779 -18835 -16334 -14152
7644 -14152 -13238 -8788 -2703 445 7976 5007 1007 -1733 -5779 -2343 5844 1286 8774 19276 16982
7629 16982 11993 3862 -6590 -4758 1008 5242 6304 935 2464 7254 4828 -2848 -9070 -7982
7615 -7982 -4018 -7151 -9981 -7874 -11165 -10211 -2458 -3100 -14323 -11169 -2339 7853 4131 815 -761
7600 -761 -7211 -12230 -17037 -16739 -11394 -6285 1633 -2437 -5219 -2527 -4118 -5060 -4709 -6921 -6296 -1326
7584 -1326 788 2416 3446 4577 5041 -5082 -3292 4380 4714 4193 1389 1369 3482 3718 2686 -5078
7568 -5078 -6515 -9284 -11483 -13014 -9492 883 -1612 -634 -919 2543 5441 2349 -5493 -3304 -885
7553h85l145K144n098j05m262J905M916l245k984P74l5l768L427M282Q424j041
7537A304p469K817J020P995L803o774o396k173J7K283R319N713K386l939o213
7522C693J424L351j386j0194p446N670J990R40J2091J517m110m842n92l585J50
7507a329q681m301M635K946Q699J801k075k152l452o642J372N594N403M602Q242
7492A4662K809j390l624j1129K081n310k151k831J862J018N717j225o828K419
7478c920n34L534L404J247m605R54P372l210m929n863m22J390J857L08k110K392
7462c135N240J465K747l040P630k394o432m155M421K373m486j682J352L067K103
7447E074J559Q83m970k964n136j369L716L519q07K70m140R14J647j654k29K21
$$ plain form
7553 -885 -4030 -1886 -6984 -7089 -11351 -9446 -4530 -7775 -10759 -9985 -10020 -13788 -10361 -6079 2345 1304
7537 1304 -6165 -3348 -2328 5667 9470 2696 -3700 -5873 -5856 -3573 5746 11459 13845 9906 3693
7522 3693 5117 8468 7082 -3112 -10558 -4888 -2898 -1958 10133 11650 7540 2698 2106 -1479 -1329
7507 -1329 -10010 -14311 -9676 -6730 1969 3770 1695 -457 -3909 -10551 -9179 -3585 1818 6420 14662
7492 14662 17471 16081 12457 1328 3409 -1901 -4052 -6883 -5021 -4003 1714 489 -6339 -3920
7478 -3920 -4454 -920 2484 3731 -874 80 7452 4242 -687 -6550 -6972 -5582 -3725 -3417 -5527 -3135
7462 -3135 2105 3570 6317 3277 10907 8513 2081 -2074 2347 4720 234 -1448 -96 2971 5074
7447 5074 6633 7516 2546 -418 -5554 -6923 -3207 312 -495 -225 -4365 -3451 -1804 -3458 -3687 -3466
7431c466l733p975L449J769M91M776l465j0384L138M7L151L826k202j589M273
7416g894j195R77L196K358K05O26j090J891p29J728n888k057L820L248M734o255
7400b325L95l37L388J602m876k347n12K4J001M443j048K391k742n237K358N491
7384A669O282q76q478m255P68K493k512J849L872j443j291m284J455m535J876
7369g410J239R56K758O306m38M22P898J201j2547j1391j316J144L62L209J120
7354f487l604K840k150J757Q038N759k08r974J524j132j485m658j485R54r29L401
7338g839m034Q9J763M738J412M258n6k182m465j220l538L079N330j326l515m9
7322g555j550R47K79j363K257J29J236l454P58L508j087L094q72r759k532O10
$$ plain form
7431 -3466 -7199 -15174 -11725 -9956 -9465 -4689 -8154 -18538 -15400 -15353 -12202 -8376 -10578 -12167 -7894
7416 -7894 -9089 -8112 -4916 -2558 -2353 -1727 -2817 -926 -1655 73 -5815 -7872 -4052 -804 3930 -2325
7400 -2325 -1930 -2267 1121 2723 -2153 -4500 -5012 -4988 -3987 456 -592 1799 -943 -6180 -3822 1669
7384 1669 7951 7075 -1403 -5658 -4890 -2397 -4909 -3060 812 -631 -1922 -6206 -4751 -9286 -7410
7369 -7410 -6171 -5215 -2457 3849 3411 3833 11731 12932 385 -11006 -12322 -11178 -10816 -7607 -6487
7354 -6487 -10091 -7251 -9401 -7644 394 6153 5945 -4029 -2505 -3637 -5122 -9780 -11265 -10311 -11240 -7839
7338 -7839 -11873 -11784 -10021 -5283 -3871 387 331 -1851 -6316 -7536 -11074 -7995 -2665 -3991 -7506 -7555
7322 -7555 -9105 -8158 -7879 -9242 -6985 -6856 -5620 -9074 -8316 -4808 -5895 -2801 -3673 -13432 -15964 -15354
7306a5354J300K588J192J055k684P297L550l772j081K826M131N631K99n114l017
7291a153j238m486r507J580N206O451J0238j694l376o50l126k771J031r57o405
7276a0857l545M669O82J828O44k514K960L21L273Q2m327K303J873P718q893o333
7260a0116K111Q26L463l015M78N437L357j419r24m82q529j105N495M412Q616R28
7244I533q117j2753k229j122j207j189P652L844o551M974P116j848k0j447J377
7229a987O74l496N01m561K597k288k455l42M568P148q35j846N56J114k089l146
7213e887j865o676N788L846N68J464O106m540L076l29l011k240j647k041j740
7198i128J971m531k350o117N27M540K019K645O048N397K513l660j1169j047N992
$$ plain form
7306 -15354 -14054 -11466 -10274 -9219 -11903 -4606 -1056 -4828 -5909 -3083 1048 6679 6978 1864 -1153
7291 -1153 -2391 -6877 -16384 -14804 -9598 -3147 7091 5397 2021 1371 -1755 -4526 -3495 -4452 -10857
7276 -10857 -14402 -9733 -9051 -7223 -6579 -9093 -6133 -5812 -2539 -2457 -6784 -4481 -2608 5110 -3783 -10116
7260 -10116 -8005 -7179 -3716 -6731 -6253 -816 2541 1122 198 -284 -8813 -9918 -4423 -11 8605 9533
7244 9533 1416 -11337 -13566 -14688 -15895 -17084 -9432 -5588 -12139 -7165 -49 -1897 -1917 -3364 -1987
7229 -1987 -1313 -4809 -4308 -8869 -6272 -8560 -11015 -11357 -6789 359 -476 -2322 -1766 -652 -2741 -5887
7213 -5887 -7752 -14428 -8640 -4794 -4226 -2762 3344 -1196 1880 1551 -1460 -3700 -5347 -7388 -9128
7198 -9128 -7157 -11688 -14038 -20155 -19628 -15088 -13069 -10424 -4376 1021 3534 -126 -11295 -12342 -6350
7183f350M820m45k910n01L854k03P09j806J402p046R38K573k203M78K252K47K353
7166a838M646J057k055o423J391J067n592K75M505k821m739l218K964J483L424
7151e874L103j159l729K215P75j956J07J28j395m295n700o63P48Q281M96j419
7135a0337n11j121l192O115P39J174n522O551N456l206k910o495P174M891N520
7120D326M191o85n567k979o832j760j407m293Q429K712K069J78n906m194r78M753
7104g943N565l006j935K685n997k657l86L63K561J218j356L001M371k052J387
7089d181N678l579o213l118O661N733l392L687J041o725J077P768l101j039J672
7074A969K811K99n917m925K91l53N895M647O824l707j3362r176l8J788k331o19
$$ plain form
7183 -6350 -1530 -1975 -4885 -5386 -1532 -1735 -1026 -2832 -1430 -8476 -7538 -4965 -7168 -6690 -4438 -4191 -1838
7166 -1838 2808 3865 1810 -4613 -3222 -2155 -7747 -7472 -2967 -5788 -10527 -13745 -10781 -9298 -5874
7151 -5874 -2771 -3930 -7659 -5444 -4669 -6625 -6518 -6390 -7785 -12080 -17780 -18443 -17695 -9414 -8918 -10337
7135 -10337 -10848 -11969 -15161 -9046 -8307 -7133 -12655 -6104 -648 -3854 -6764 -13259 -6085 -1194 4326
7120 4326 8517 7832 2265 -714 -7546 -9306 -10713 -15006 -6577 -3865 -1796 -1618 -7524 -11718 -12696 -7943
7104 -7943 -2378 -5384 -7319 -4634 -10631 -13288 -13674 -13311 -10750 -9532 -10888 -7887 -3516 -5568 -4181
7089 -4181 1497 -2082 -8295 -11413 -4752 981 -2411 1276 2317 -4408 -3331 4437 1336 297 1969
7074 1969 4780 5079 -838 -5763 -5472 -5825 70 4717 11541 7834 -5528 -14704 -14742 -12954 -15285 -15904
7058a5904j237Q263L79j515L757m799m609M55Q345N309N794m919k770J178L85
7043a888l636k650j5P6R32k892o106j349P322Q555J4662p75O32M128p141m011
7027E844p78k34M956l758j408l112l552O716p263o049k012O624K661M983K780
7012F398L483r197k742r79m102J987L352p330J888J042J993j589M170M075O50
6997C099L130m33o818J589M986J195j893j1412k238j269N55j83r21O285n307p12
6981a0347L517R46k735L194M851O609j662o104j852J037M38J860m094p601L56
6966a1587K06k895r092q43N16N450R12O108M733n347J872R296M99M116p279l645
6950f980l564P79L04m207P328M323O55n809M26J208j426N177N336L164n04j821
$$ plain form
7058 -15904 -17141 -8878 -8499 -10014 -6257 -11056 -15665 -15210 -6865 -1556 4238 -681 -3451 -2273 -1888
7043 -1888 -5524 -8174 -8189 -8113 -7181 -10073 -16179 -17528 -10206 -1651 13011 12236 12868 16996 9855 5844
7027 5844 5066 4832 9788 6030 4622 1510 -2042 4674 -2589 -8638 -10650 -4026 -1365 3618 6398
7012 6398 9881 684 -2058 -3037 -7139 -5152 -1800 -9130 -7242 -6200 -4207 -5796 -1626 2449 3099
6997 3099 6229 5796 -1022 567 5553 6748 4855 -6557 -8795 -10064 -9509 -9692 -10613 -4328 -9635 -10347
6981 -10347 -6830 -5884 -8619 -5425 -574 6035 4373 -1731 -3583 -2546 -2108 -248 -4342 -11943 -11587
6966 -11587 -11381 -14276 -23368 -24211 -23695 -18245 -17333 -11225 -6492 -11839 -9967 -671 -172 3944 -3335 -6980
6950 -6980 -10544 -9765 -9461 -13668 -6340 -2017 -1362 -7171 -6745 -5537 -6963 -1786 3550 6714 6210 4389
6934D389j1724r136M447J061m222N926L18q83l698Q63L574k096M56L79K005Q882
6918E41N986p645m769K597k988m434j115K778K607l531k555O377M041N604L91
6903C885n441j932p378m269N757Q748o714o005o089L40R953N995j797j734n51
6888g232K326j290j304M389N704L500Ro104Q61K648q616o085J77L068R167r41
6872B77n563Q71j132k865r405O995L459o249K86N576L872j32O74k254K585N219
6856B214M875j940l753k132n95n577R85K618O729N157m295Q33l747j614L441o86
6840B513n379m658j160Q688J2546l538m555r904k593m260q74K015M586k226l434
6825a2233N893L761k55N841j304p186n2M432o244j080J529k021p258j227j36N73
$$ plain form
6934 4389 -7335 -16471 -12024 -10963 -15185 -9259 -8941 -9824 -13522 -12659 -9085 -11181 -10725 -10346 -8341 541
6918 541 6527 -1118 -5887 -3290 -6278 -10712 -11827 -9049 -6442 -9973 -12528 -6151 -2110 3494 3885
6903 3885 -1556 -3488 -10866 -15135 -9378 -630 -7344 -13349 -19438 -19098 -9145 -3150 -4947 -6681 -7232
6888 -7232 -4906 -6196 -7500 -3111 2593 6093 6102 -2 859 3507 -5109 -11194 -11017 -7949 1218 277
6872 277 -5286 -4415 -5547 -8412 -17817 -10822 -7363 -13612 -13326 -7750 -3878 -4010 -3336 -5590 -3005 2214
6856 2214 7089 5149 1396 -736 -1331 -6908 -5923 -3305 3424 8581 4286 5119 1372 -242 3199 2513
6840 2513 -2866 -7524 -8684 4 12550 9012 4457 -5447 -8040 -12300 -13174 -11159 -6573 -8799 -12233
6825 -12233 -6340 -2579 -2834 3007 1703 -5483 -5535 -1103 -7347 -8427 -6898 -8919 -16177 -17404 -17540 -16967
6809a6967j171L309Q099N270l296J718L441l747L253L502j334n168n949o554Q62
6794a4732L840q405j875j670M519L760M179P702o20j0696k106Q276J518L170N943
6779B803J571R38j432o480J314p34k763J634J273L70K567l274K333l0l628L165
6763c73n940M22J037O779L48K02l111j1444l499K390p04J232P973k777N665k636
6747d436k277n842L233J333J614p13q968M158N199l887O763P731q36q731p712
6732a3371k573N858K273K788N406J855K910k553J1L48l068p60k699L364P901m202
6716C488n395M034M571p34M506j43l029m144j503l433l774P064J185m305M9O691
6700E128l24p791m508m193N601J0625j656o798l90P292K913l656J0639K828r540
$$ plain form
6809 -16967 -18138 -14829 -6730 -1460 -4756 -3038 403 -3344 -91 3411 2077 -3091 -9040 -15594 -14732
6794 -14732 -10892 -19297 -21172 -22842 -18323 -14563 -10384 -2682 -3302 -13998 -16104 -7828 -6310 -3140 2803
6779 2803 4374 5312 3880 -2600 -1286 -2020 -4783 -3149 -1876 -1506 1061 -2213 120 90 -3538 -373
6763 -373 -6313 -5891 -4854 1925 2273 2475 -636 -12080 -15579 -13189 -13893 -12661 -4688 -7465 -1800 -4436
6747 -4436 -6713 -12555 -9322 -7989 -6375 -7088 -16056 -11898 -6699 -10586 -3823 3908 3072 -5659 -13371
6732 -13371 -15944 -10086 -7813 -5025 381 2236 5146 2593 2604 2952 -116 -876 -3575 -211 7690 3488
6716 3488 -1907 2127 6698 5964 10470 10327 7298 3154 1651 -1782 -5556 1508 2693 -1612 -1563 5128
6700 5128 4804 -2987 -7495 -11688 -6087 4538 2882 -3916 -4306 2986 5899 2243 12882 15710 6170
6685F170n414j654m946j774J030J975J093M092L630P3p105m49j860k104O24M713
6669a906L69Q179J806n683l691l966m674J148J4909k255p020j477M76L254p714
6654h245m351M129k279L149J149K398k417j774k043L350Q383m61o168o029j411
6639a2620j359L37m48Q635N177J089K10l691m069j1134n965O401P454k183O079
6624f087J0469M856m614l877L994j33m599p642R5M538O514m359m266K577N26j624
6608c632k042p842l743N654K176J54j01k24j323l798K095M294L61M928P5o375
6592i343j391k995n210O106Q432Q21J33O065r85M905N993k116p185l258o774n656
6576a2458P053O185l946j395L36r269l356N252P860J2317j884q586l163l868m985
$$ plain form
6685 6170 756 -898 -5844 -7618 -6588 -4613 -3520 572 4202 4275 -2830 -3279 -5139 -7243 -6619 -1906
6669 -1906 -1537 6642 8448 2765 -926 -4892 -9566 -8418 6491 4236 -2784 -4261 -3785 -531 -8245
6654 -8245 -12596 -8467 -10746 -7597 -6448 -4050 -6467 -8241 -10284 -6934 1449 988 -5180 -11209 -12620
6639 -12620 -13979 -13642 -14090 -5455 -278 811 1021 -2670 -6739 -17873 -23838 -17437 -9983 -12166 -6087
6624 -6087 4382 9238 4624 747 4741 4608 9 -7633 -7538 -3000 3514 -845 -5111 -2534 -2008 -3632
6608 -3632 -5674 -13516 -17259 -11605 -9429 -9275 -9376 -9600 -10923 -14721 -12626 -8332 -7971 -3043 -2968 -9343
6592 -9343 -10734 -13729 -18939 -12833 -4401 -3580 -3447 2618 1633 6538 12531 10415 3230 -28 -6802 -12458
6576 -12458 -5405 780 -3166 -4561 -4225 -13494 -16850 -11598 -3738 8579 6695 -1891 -5054 -8922 -13907
6561a3907l644N055L091N419P58p050K13k038NP015n731p111Q219M434K022k248
6545e498l396M581N355j414J918j574j0152n363K005L579N49L483m439j633N753
6530f246J867P6n45J725L17l148K168Q806N095k558q95n927l405m699O596O692
6514E919J874n513p972n46M109o42m763L214K197o827J958J1376K20P081j982
6499I703q771j2259N875L742O645K841j189j127j337l698p445m783M040J679K946
6484c138L62j150Q740K475j176o119m349l873Q74K066J598M958J223k919J413
6469I85j044K566p699N04J882M571k319k544j543R51L606L160J097l310o673K48
6453e562J353K905M318R237L006m666p471j876p271K2M434l448l025M790n523
$$ plain form
6561 -13907 -17551 -12496 -9405 -3986 -3228 -10278 -10065 -12103 -12098 -5083 -10814 -17925 -9706 -5272 -3250 -5498
6545 -5498 -8894 -4313 1042 -372 1546 -28 -10180 -15543 -13538 -9959 -9410 -5927 -10366 -11999 -6246
6530 -6246 -4379 -4303 -4848 -3123 -2806 -5954 -3786 5020 10115 7557 6662 735 -2670 -7369 -773 5919
6514 5919 7793 2280 -5692 -6238 -2129 -2771 -7534 -4320 -2123 -8950 -6992 4384 4604 11685 9703
6499 9703 932 -11327 -5452 -1710 4935 7776 6587 5460 4123 425 -7020 -11803 -7763 -6084 -3138
6484 -3138 -2776 -3926 4814 7289 6113 -6 -4355 -8228 -7354 -5288 -3690 1268 2491 -428 985
6469 985 -59 2507 -5192 -4688 -2806 1765 -554 -3098 -4641 -3690 -84 3076 4173 863 -5810 -5562
6453 -5562 -4209 -1304 3014 12251 15257 10591 3120 1244 -6027 -6005 -1571 -5019 -8044 -3254 -8777
6438h777Q94l415M393P993L213K481L826m500o919P727o82J189p035j141M310
6423C557M64n200l15J222j043j02M193j102L783K160M599m319m459N96n153m748
6407e867m772M128J32o403p71L633J783Q017K34j696J107k044J91N93j166K806
6391i5J0270l254q008n2l573k646L419l909p744l762R104O964j454O337K488n597
6375a512L172j874l987J091K450J474J41j979q427n28L293M497m403m942j910
6360a3444M970N075K030q00m604K3K455j109L369j005j874m745p555K528N479
6345i207M504N972j816m449o098K267K678L156M719p094K948K501j385j938l319
6330f561j372P384j249r985Q56Q069P17L183q176n909N422K753k370N22N559m967
$$ plain form
6438 -8777 -7883 -11298 -6905 1088 4301 6782 10608 6108 -811 6916 6234 7423 388 -753 3557
6423 3557 4021 -1179 -1494 -272 -1315 -1417 2776 1674 5457 7617 12216 7897 3438 4034 -1119 -5867
6407 -5867 -10639 -6511 -6379 -12782 -13553 -9920 -8137 -120 114 -1582 -475 -2519 -2328 -1735 -2901 -95
6391 -95 10175 6921 -1087 -1139 -4712 -7358 -3939 -7848 -15592 -19354 -10250 -3286 -4740 1597 4085 -1512
6375 -1512 1660 -214 -4201 -3110 -660 814 955 -1024 -9451 -9979 -6686 -2189 -6592 -11534 -13444
6360 -13444 -8474 -3399 -1369 -2169 -6773 -6750 -4295 -5404 -2035 -3040 -4914 -9659 -17214 -14686 -9207
6345 -9207 -4703 1269 -547 -4996 -11094 -8827 -6149 -2993 1726 -5368 -2420 81 -1304 -3242 -6561
6330 -6561 -7933 -549 -1798 -11783 -10927 -2858 -2141 1042 -7134 -13043 -7621 -4868 -7238 -6716 -1157 -6124
6314f124m144K215N237j245k053m836j591J701n19R10P78J223J0765n610m543
6299g836M199m975n627K079O28o302J2894N12j0905k895P932K468O263j211K27
6284b549l20k824k989o860R93J758L774Q18l746j749L3Q601k153j1121k9j567
6268a9930J602R338J0753M29M08k927l227o035q76N02j731j06O444n6K817M24
6252b171j060L753M969o954m129K066L182R9k27K49j295m723K516O820K504l700
6236A899n777K051P604M127n712m358l920k040M056Q18m080J634q82j723J130
6221e173l957l097R3J671K1L683O746M520j040J34o08j828r004L644P76m136K68
6204g287M645M350k315k1K377k084r53l218M49O87j084N199L041j60l402j742
$$ plain form
6314 -6124 -10268 -8053 -2816 -4061 -6114 -10950 -12541 -10840 -11359 -10449 -9671 -8448 2317 -3293 -7836
6299 -7836 -3637 -8612 -14239 -12160 -11532 -17834 -4940 -4428 -15333 -18228 -10296 -7828 -1565 -2776 -2549
6284 -2549 -2869 -5693 -8682 -15542 -14549 -12791 -9017 -8199 -11945 -13694 -13661 -5060 -7213 -18334 -18363 -19930
6268 -19930 -18328 -8990 1763 2192 2600 -327 -3554 -9589 -10465 -9963 -11694 -11800 -5356 -5412 -2595 -2171
6252 -2171 -3231 522 5491 -1463 -5592 -3526 -344 -245 -472 -223 -1518 -6241 -3725 3095 5599 1899
6236 1899 -3878 -1827 5777 9904 4192 -166 -4086 -6126 -2070 -1252 -5332 -3698 -4580 -6303 -5173
6221 -5173 -9130 -12227 -12134 -10463 -10442 -6759 -13 4507 3467 3601 2993 1165 -7839 -4195 -3419 -7555 -7287
6204 -7287 -2642 1708 -607 -628 1749 -335 -1288 -4506 -4057 -3370 -4454 745 3786 3626 224 -1518
6188a518k3n909k76l23p23J229n914m833M854Q609o97q16M76j86K997K908N36
6171C91O077m174n109J541K888k580J072K95n168J65J300J476N6l558n318L733
6155f913L663m008n329j848O525O042N057j305K316J611k332r76l590J111j417
6140a393p912J077o072o51P878M186L838K996j298l344K80j157K11p478L31K25
6124h283R233m561j62Q862J473n940l35m091q606K885l097k192L811j566J413
6109a1156O752M451o72l12j372M874k127r652N597j886o723l394J867J788j675
6094a3640l382o37O756N005K459L786K437J386l452k225L80N87j271j408n003
6079h222J977K946j919K611M262K565J912p230l894M249J4382q47r535l715j847
$$ plain form
6188 -1518 -1541 -7450 -7726 -8049 -8772 -7543 -13457 -18290 -13436 -4827 -5524 -6340 -5864 -6050 -3053 -145 391
6171 391 6468 2294 -2815 -1274 1614 -966 106 401 -4767 -4602 -3302 -1826 -1770 -5328 -10646 -6913
6155 -6913 -3250 -7258 -12587 -14435 -7910 -1868 3189 1884 4200 5811 3479 2503 -1087 24 -1393
6140 -1393 -9305 -8228 -14300 -14951 -7073 -2887 951 3947 2649 -695 -415 -1572 -1361 -8839 -8508 -8283
6124 -8283 950 -3611 -3773 5089 6562 622 287 -3804 -12410 -9525 -12622 -14814 -11003 -12569 -11156
6109 -11156 -4404 47 -625 -937 -2309 2565 438 -9214 -3617 -5503 -12226 -15620 -13753 -11965 -13640
6094 -13640 -17022 -17659 -10903 -5898 -3439 347 2784 4170 718 -1507 -1127 -540 -1811 -3219 -8222
6079 -8222 -6245 -3299 -5218 -2607 1655 4220 6132 -1098 -4992 -743 13639 12792 3257 -458 -2305
6064b305K269l004l796J356J305m70M621R61j075K240J70p717O551M059R997k91
6048A4871k742k83p014l788l606k808j063m566m627J884M614O651J1145o23m352
6033C693J753q50j794r67j240l095j204P246J13K79l016k397M19j17L941K349
6017E113p962K864k604j714N109q58j854K386m218q071M796L889m777k071M147
6002e825j924l550J0532L720p415m69o349N800Q216j61l117k0N636l117j340j724
5986a107L33J251N249j309k556n021j480p756k159M399O647K608l923j716n466
5971a2006R34O085K614L584O52m296l212M05Q865J887r532k371j073Q549l21J711
5955B475q98L005q39k429m624k088p70M956l417m630L61L292M407k371j340J989
$$ plain form
6064 -2305 -36 -3040 -6836 -5480 -4175 -4645 -24 937 -138 2102 2272 -5445 1106 5165 15162 14871
6048 14871 12129 11846 4832 1044 -2562 -5370 -6433 -10999 -15626 -13742 -9128 -2477 8668 8045 3693
6033 3693 5446 4596 2802 1835 595 -2500 -3704 3542 3655 3934 918 -1479 -1060 -1177 2764 5113
6017 5113 -2849 15 -2589 -4303 806 -52 -1906 480 -3738 -11809 -7013 -3124 -7901 -9972 -5825
6002 -5825 -7749 -11299 -767 2953 -4462 -4931 -11280 -5480 2736 2575 -542 -562 5074 1957 617 -1107
5986 -1107 -774 477 5726 4417 1861 -3160 -4640 -12396 -14555 -10156 -3509 -901 -4824 -6540 -12006
5971 -12006 -11072 -4987 -2373 1211 1863 -2433 -5645 -5240 3625 5512 -4020 -6391 -7464 1085 764 2475
5955 2475 1577 4582 3743 1314 -3310 -5398 -6168 -1212 -4629 -9259 -8898 -5606 -1199 -3570 -4910 -2921
5939b921N147n549m361L292L777m267k853K977K066k96K36L28j181K436M8J69
5923i52p635J745P1m751O62M119L935j416K755O06L395N55k668n112p603j542
5907a3836L616M197R517n478j0039K716P999K075n416m681J0253j884n960M23
5893f498N519J438o53p305k690L300m611J038P023Q630j531q32Q50l515o889k788
5877i514N768N467J485Q45n185k053J785J958l696Q26L202n26l366N108j660p787
5861g343l489L338O355j956m942N803K253j076m164n263M924P736K418p309j329
5846d044J60O428p05n202n649N914n622j048k779J289m88o28N443K875rl875n56
5829h496K673k123J069l813k91M682R9J739L30j609j053J279K596k592o80k476
$$ plain form
5939 -2921 2226 -3323 -7684 -4392 -615 -4882 -7735 -4758 -2692 -2988 -2752 -2424 -3605 -1169 -1121 -952
5923 -952 -8587 -6842 -6771 -11522 -10860 -6741 -2806 -4222 -1467 -861 2534 3089 421 -4691 -12294 -13836
5907 -13836 -10220 -6023 3494 -1984 -12023 -9307 -1308 767 -4649 -9330 923 -961 -6921 -6498
5893 -6498 -979 459 -194 -7499 -10189 -6889 -11500 -10462 -3439 5191 3660 2828 3678 163 -6726 -9514
5877 -9514 -3746 1721 3206 4051 -1134 -3187 -1402 556 -3140 -2314 888 362 -3004 2104 444 -7343
5861 -7343 -10832 -7494 -1139 -3095 -8037 -2234 19 -1057 -5221 -10484 -5560 2176 4594 -2715 -4044
5846 -4044 -3884 2544 1839 -3363 -9012 -3098 -8720 -9768 -12547 -11258 -11746 -12374 -6931 -4056 -4065 -7940 -8496
5829 -8496 -5823 -7946 -6877 -10690 -10981 -6299 -6200 -4461 -4131 -5740 -6793 -5514 -2918 -5510 -6190 -8666
5813h666m683M000R61o31k850Q885N060M321M160j472o132L853j27Kr232j419
5797c970l179l178K92k677K066O466M05K760K375P424p088n896p75J560n291k007
5781a0713N295q27O875L752K286K97n591n571l215K68Q861K027j970k074J799
5766A499l33l492M931L811m654p390k796l990m368J0771Q498j466m184K122M050
5751C009k040l860N133j94k765q93L035O79r2k864l149l230k62P06L880o036k553
5734a1496P029k430J836l607j018L337R59J595l991l016J352k615p202L175L240
5719a2852K057k649j0065K60O201P638L689L488j746M794j306J954K462n959n323
5704g357j756N644R36r444j781P049J220j707R3k405J114M658m409P000J1045
$$ plain form
5813 -8666 -13349 -9349 -8388 -9019 -11869 -2984 2076 6397 10557 9085 2953 6806 6679 6681 -2551 -3970
5797 -3970 -7149 -10327 -10035 -12712 -10646 -4180 -3775 -1015 1360 8784 1696 -4200 -4975 -3415 -8706 -10713
5781 -10713 -5418 -6245 630 4382 6668 6965 1374 -4197 -7412 -7144 1717 3744 1774 -300 1499
5766 1499 1166 -2326 2605 6416 1762 -5628 -8424 -12414 -16782 -6011 2487 1021 -3163 -1041 3009
5751 3009 969 -2891 2242 2048 -717 -1610 1425 2104 2012 -852 -4001 -7231 -7493 -6787 -2907 -8943 -11496
5734 -11496 -4467 -6897 -5061 -8668 -9686 -6349 -5390 -3795 -7786 -10802 -9450 -12065 -19267 -16092 -12852
5719 -12852 -10795 -13444 -23509 -23249 -17048 -9410 -5721 -2233 -3979 815 -491 1463 3925 -2034 -7357
5704 -7357 -9113 -3469 -2533 -11977 -13758 -6709 -5489 -7196 -7103 -9508 -8394 -3736 -8145 -1145 9900
5689I900L332n386l797n040lo554kN891R4l346j000k56K673k035l108L604L052
5672a981M456L43k609M634O009J145k058l350J348l547n59K638n24K301n978l132
5656h64j459M572L568p5K463k769l361j369p803o40P017j463n090k487L209J922
5640d629L225L242l946j516K793L10K488j303k482m556l564M191j206Q5O368J657
5624A157J443k462k451j776p46M638J568Q134L898j933r685j516P200k625o776
5609a932M94j634m663L310p30L868J849j765J894o492j475M402K303K70N87k224
5593a938q70M935j118P82k258k793P31L192J105p170P8K689P60N037l984o94m94
5576b010n479m551j122P18J294M693L422j996k012J698P977J496o167l735M192
$$ plain form
5689 9900 13232 7846 4049 -991 -994 -7548 -7550 -1659 -1565 -4911 -5911 -6167 -3494 -5529 -8637 -5033 -1981
5672 -1981 2475 2818 209 4843 10852 11997 9939 6589 7937 4390 3831 6469 5945 8246 2268 -864
5656 -864 -2323 2249 5817 5742 8205 5436 2075 706 -7097 -7737 -720 -2183 -7273 -9760 -6551 -4629
5640 -4629 -1404 1838 -2108 -3624 -831 -521 1967 664 -1818 -6374 -9938 -5747 -6953 -6868 -500 1157
5624 1157 2600 138 -2313 -4089 -4835 -197 1371 9505 13403 11470 1785 269 7469 4844 -1932
5609 -1932 -1438 -3072 -7735 -4425 -5155 -1287 562 -1203 691 -5801 -7276 -2874 -571 -301 286 -1938
5593 -1938 -2808 2127 1009 1791 -467 -3260 -2529 663 1768 -5402 -5324 -2635 -1875 3162 -822 -1516 -2010
5576 -2010 -7489 -12040 -13162 -12444 -11150 -6457 -3035 -5031 -7043 -5345 2632 4128 -2039 -5774 -1582
5561a582M013k764K524M294q045j618Q135K594L57j18k418m0k223R0m78k632j698
5544a609N399j114r024l972R391K880Q49k184m712n65K823O682K943j34L549k872
5528H330j1214m582J749L578m190m870o207P235N378M800K49l660p195j467J650
5513a0416n233m02K705m79K659K57J563N056K432J558m994o21M585K002O30l138
5497a836j730L035P551N564O81k126o393p434o799N557n713l007Q887k362j660
5482g785J432L777K847k223K194P83j341j372N671j619o56R676k00j172r26m868
5466D218k187q134l51K971m667q55r36N598L434q80O298J240n013p11m705n782
5450a0462J429J0838j44k316n433n803p90R534O494L790k764Q38m826m275M449
$$ plain form
5561 -1582 2431 -333 2191 6485 -1560 -3178 4957 7551 7908 7790 5372 5332 3109 3199 2721 89 -1609
5544 -1609 3790 2676 -6348 -10320 -929 1951 2800 616 -4096 -4661 -1838 4844 7787 7653 11202 8330
5528 8330 -2884 -7466 -5717 -2139 -6329 -11199 -17406 -10171 -4793 7 256 -3404 -10599 -12066 -10416
5513 -10416 -15649 -16051 -13346 -13825 -11166 -10909 -9346 -4290 -1858 -300 -5294 -5915 -1330 672 1302 -1836
5497 -1836 -3566 -531 7020 12584 13265 11139 4746 -2688 -9487 -3930 -9643 -12650 -3763 -6125 -7785
5482 -7785 -6353 -2576 271 -1952 242 1025 -316 -1688 3983 2364 1708 11384 11184 10012 9086 4218
5466 4218 2031 -6103 -6454 -3483 -8150 -9005 -9941 -4343 -909 -1789 4509 5749 736 25 -4680 -10462
5450 -10462 -9033 1805 1661 -655 -6088 -11891 -12681 -3147 3347 7137 4373 5211 385 -3890 559
5435E59Q078l607q993L485J008O01K321m295n606r72O661J100k674m600Q0M017
5419b837O098j028m115j848j174J989K728j4n87m93p44k771O16k299P220N101
5403E842Q29P47j664N393n654o541o619k217O182L802n079L598K420k006N62J976
5387A571L019J096L631q333k232r75J214p058l985M467Q727O09k133J171K69K784
5371C842J637l340L56K797k267K345j295l780m008J012J332K058l494m38N620
5356B377N149r401m557l67J753q11j98n307m187P352N889O186n631p567L926M099
5340a295l699n932L506K287L483R66k68j482m975J465N711K145n126k397p35j109
5324g455k390k248N805N187k391l564p32n82l198N152K264m160j362j358k406
$$ plain form
5435 559 8637 5030 -3963 -478 530 1131 3452 -843 -6449 -7421 -760 340 -2334 -6934 -6854 -2837
5419 -2837 3261 2233 -1882 -3730 -4904 -2915 -187 -201 -788 -1281 -2025 -4796 -4180 -6479 741 5842
5403 5842 6671 7418 5754 11147 5493 -1048 -7667 -9884 -3702 100 -4979 -1381 1039 -967 -405 1571
5387 1571 4590 5686 9317 984 -1248 -2223 -1009 -8067 -12052 -7585 1142 1751 -382 789 1058 3842
5371 3842 5479 2139 2495 5292 3025 5370 4075 295 -3713 -2701 -1369 689 -2805 -3243 2377
5356 2377 7526 -1875 -6432 -6799 -5046 -5857 -6055 -11362 -15549 -8197 -2308 3878 -1753 -9320 -5394 -1295
5340 -1295 -4994 -10926 -7420 -5133 -1650 -684 -952 -2434 -7409 -5944 -233 1912 -3214 -5611 -6346 -7455
5324 -7455 -9845 -12093 -6288 -1101 -3492 -7056 -7788 -8370 -11568 -6416 -4152 -8312 -9674 -11032 -13438
5309a3438P029O910l047J380l43r739m100j31j624R673J620J437L44N926J991
5294C888q208p10O082J169l930k648n171l969l612P888R673K657k574k509l702
5279e676k470l69k62M299R610O368r68o0q270j0970k176l743J297L141N935N984
5263A670K426n54j244l585K947Q241j807o448o50n88O16O542L845N80k365o112
5247C514K485m304m602N804N216K1n910k234J97l524J036l66k333l458J154K272
5231e032j989O1M187r8j438j017q68n180L4o102M620M918P407o92J741J389K487
5214D428q026O32J884k237L443K655m290r014P38M206j139j459L579n011m324
5199a3935K206N604M28M634L131q322k095O396K061J297l739p469k952j215L790
$$ plain form
5309 -13438 -6409 501 -2546 -1166 -1509 -11248 -15348 -15479 -17103 -7430 -5810 -4373 -4029 1897 3888
5294 3888 -4320 -5030 1052 2221 -1709 -4357 -9528 -13497 -17109 -9221 452 3109 535 -1974 -5676
5279 -5676 -8146 -8515 -8777 -4478 5132 11500 10532 10472 2202 -8768 -10944 -14687 -13390 -10249 -4314 1670
5263 1670 4096 3542 2298 -1287 1660 9901 8094 1646 996 408 1024 7566 11411 11991 9626 3514
5247 3514 5999 1695 -2907 2897 8113 8134 2224 -10 187 -3337 -2301 -2667 -5000 -8458 -7304 -5032
5231 -5032 -7021 -6960 -2773 -2871 -4309 -5326 -6194 -11374 -11340 -17442 -12822 -7904 -497 -1189 552 1941 4428
5214 4428 -3598 -2966 -1082 -3319 124 2779 -1511 -10525 -9787 -5581 -6720 -8179 -4600 -9611 -13935
5199 -13935 -11729 -6125 -5697 -1063 2068 -6254 -8349 -1953 108 1405 -2334 -9803 -12755 -13970 -10180
5184a0180L240P74J365K41k432L360J22l090n534J435l158l654J991M234M029
5169g257k553N552K137j427q365k574Q934J5472M016q340n678p531m816M774K957
5154d699N033l659o665m5M145K379J488l741O434N328m150m192l229j260k373
5139i206K731O32L924k17l850M025M188J574l130n279o91m929r89j91J128N346
5123d934N402R48q191j547K152N45o226l444N748J497J996r75J350l822M149O737
5107A385J516m785p354m03K58K19L631k066k950o35j642P826J234q60k201Q359
5091A532N604j825j18R58r20n510o167N0l055M535Q51n141K991L411n488m15O53
5074h054o265R11P949N038K192L42J598j140q069m183K579k509k237L57N064m884
$$ plain form
5184 -10180 -6940 -6166 -4801 -4560 -6992 -3632 -3510 -6600 -12134 -10699 -13857 -17511 -15520 -11286 -7257
5169 -7257 -9810 -4258 -2121 -3548 -11913 -14487 -5553 9919 13935 5595 -83 -7614 -12430 -7656 -4699
5154 -4699 334 -3325 -9990 -10035 -5890 -3511 -2023 -5764 670 5998 1848 -2344 -5573 -6833 -9206
5139 -9206 -6475 -5843 -1919 -2136 -5986 -1961 2227 3801 671 -4608 -5299 -10228 -11217 -11408 -10280 -4934
5123 -4934 468 1416 -6775 -8322 -6170 -5625 -11851 -15295 -9547 -8050 -6054 -7029 -5679 -9501 -5352 1385
5107 1385 2901 -1884 -9238 -9641 -9383 -9164 -5533 -7599 -10549 -11184 -12826 -5000 -3766 -4626 -6827 1532
5091 1532 7136 5311 5193 6151 5231 -279 -6446 -6396 -9451 -4916 -4065 -9206 -6215 -2804 -8292 -8707 -8054
5074 -8054 -14319 -13408 -5459 -421 1771 2113 3711 2571 -5498 -9681 -7102 -9611 -11848 -11491 -6427 -11311
5058a1311o342P52N114R547l92m715p854q70J5076L398l745o883O799J165q957
5043i218j954q46L368N981k50k346j216k82j121L465M075k504j503m40J025j330
5027e096J277q351k90J0753N841j799l196m689J944P747M713j492n946K59n144
5012c469k930n047K437M330K130k8n56R984P063j1419j0233o50M416j346K807
4997b511J129r799j333L809N202M46k097m309j046O121P282N416k710m272j570
4982b42l68o844o027n914M112O37l593N746N523P558l948l557n838O683K296q205
4966a1981o33R41L456Q284N409n148L158k389J72j108m95J016p88j494k567K02
4950c965K481J486L14l595j879J953Jo149J078K56L53m635N337J0654l24Q18L309
$$ plain form
5058 -11311 -17653 -16901 -11787 -2240 -2632 -7347 -15201 -16071 -995 2403 -1342 -8225 -1426 -261 -9218
5043 -9218 -11172 -12018 -8650 -2669 -2919 -5265 -6481 -6763 -7884 -4419 -344 -2848 -4351 -4791 -3766 -5096
5027 -5096 -3819 -12170 -12460 -1707 4134 2335 -861 -5550 -3606 4141 8854 7362 1416 1675 -3469
5012 -3469 -6399 -11446 -9009 -4679 -2549 -2577 -3133 6851 13914 2495 -7738 -8388 -3972 -5318 -2511
4997 -2511 -1382 -11181 -12514 -8705 -3503 -3057 -5154 -9463 -10509 -4388 2894 8310 5600 1328 -242
4982 -242 -610 -7454 -13481 -19395 -15283 -14646 -18239 -12493 -6970 588 -3360 -6917 -12755 -6072 -3776 -11981
4966 -11981 -12614 -11673 -8217 67 5476 328 3486 1097 1269 161 -334 682 -106 -1600 -4167 -3965
4950 -3965 -1484 2 316 -3279 -5158 -3205 -3204 -9353 -8275 -8019 -7666 -12301 -6964 3690 3366 4184 7493
4933G493n180K871n580n294J963q101m632N817k233j0377L741R249R920N368j070
4918C955o800j756K573j336o909m78M391J277k580K892R518J016j869J542M852
4903A0288K331n595K48o120p200n507K061L754l535M945N459j791k363M439o718
4888e304J095K267K774Q50k716k684j322N237P730j499q663j200L081j955R54
4873a355N81L04P48K497k1j15o16K13o256L19O01k350L26J778O54j021k037q790
4855a4540M47M489J667N154M766k28l731k475N10O580o489k159K936l602m85K783
4839d377J1r66L884N872n782m618j492K003n299o721n46L392O037K487R209N90
4823C684J367j935o442q09J646L553p93n015K364k50l479K161M17n118O14Q86
$$ plain form
4933 7493 2313 5184 -396 -5690 -3727 -11828 -16460 -10643 -12876 -23253 -19512 -10263 -343 5025 3955
4918 3955 -2845 -4601 -2028 -3364 -10273 -10751 -6360 -5083 -7663 -4771 4747 5763 3894 5436 10288
4903 10288 12619 7024 7272 1152 -6048 -11555 -9494 -5740 -9275 -4330 1129 -662 -3025 1414 -5304
4888 -5304 -4209 -1942 832 1682 -1034 -3718 -5040 197 7927 6428 -2235 -3435 -354 -2309 -1355
4873 -1355 -774 -470 278 2775 2754 2639 2023 2236 -4020 -3701 -3100 -5450 -5124 -3346 -2692 -3713 -5750 -14540
4855 -14540 -14093 -9604 -7937 -2783 1983 1755 -1976 -4451 -3941 2639 -3850 -6009 -3073 -6675 -7160 -4377
4839 -4377 -4366 -5332 -1448 4424 -1358 -5976 -7468 -5465 -10764 -17485 -18031 -14639 -8602 -6115 3094 3684
4823 3684 5051 3116 -3326 -4135 -2489 1064 271 -4744 -2380 -2630 -6109 -3948 -3531 -8649 -8035 -7149
4807g149M022j743k928P061M80j800j570J1346M296l567j0790j0596j038m4L812
4792a0208l194M746J823k866l244K604M842l967l91L95L47L577L059P93J0509
4777H825M591k800l94k813l863J493j248j575l226K34P41L853m525j976J213o872
4761h342k589j89k123m77m284J843P466M862O251L656l021L203Q00p415l896j389
4745e644j152m484j741K273M376J793j322K914j024O594k968k375L048O499j954
4730D833p559p0j879J892J61j267o43L392O407j375l904q22m918j494O795k810
4714c261j684O7O351q398l338N201J897M299q17j201M387k763K678l123n006o23
4698e334P26j279N502K044o366N78K980K64q234m212j510P89N436l814p300R868
$$ plain form
4807 -7149 -3127 -4870 -7798 -737 -257 -2057 -3627 7719 12015 8448 -2342 -12938 -13976 -14020 -10208
4792 -10208 -13402 -8656 -6833 -9699 -12943 -10339 -5497 -9464 -9855 -9460 -9113 -5536 -2477 -1684 8825
4777 8825 13416 10616 10222 7409 3546 5039 3791 2216 -1010 -776 -35 3818 -707 -2683 -1470 -8342
4761 -8342 -10931 -11120 -13243 -13720 -18004 -16161 -8695 -3833 2418 6074 3053 6256 7056 -359 -4255 -5644
4745 -5644 -6796 -11280 -13021 -10748 -6372 -4579 -5901 -2987 -4011 2583 -385 -2760 288 6787 4833
4730 4833 -2726 -2796 -4675 -2783 -2622 -3889 -4532 -1140 5267 3892 -12 -834 -5752 -7246 -451 -3261
4714 -3261 -4945 -4878 1473 -6925 -10263 -5062 -3165 1134 317 -884 3503 740 3418 295 -4711 -5334
4698 -5334 -4608 -5887 -385 1659 -4707 -4129 -1149 -885 -9119 -13331 -14841 -14052 -8616 -12430 -19730 -9862
4682i862n59O182O683K155j197o995k526M491N786M08l727l185L52L33j619q619
4666a1899K096m56l626R8J539J020P907j036m557K777L858M900K577j411p210
4651c423j61N517L234o723o030o13J300K453M226N001j875o572k819m77k03j949
4635i114q37j166M826L128L375n876m975M808k270j882K892j36n66j1806O11N289
4619a3699Q80L990k709N331N753K895k781k250q143o075O994J423j98L315K15
4604e059j984l854N066Q775K13M431K367q933p034k525J495L641j58j647J52N511
4588D57L013j245l976N090M512J388J711k041m118j237K514l685k794n13m944
4573e868o336R08Q570P31N90j868Q14K240j2135n710j687P674P667L548L182k598
$$ plain form
4682 -9862 -10421 -4239 2444 4599 3402 -3593 -6119 -1628 4158 4566 839 -2346 -1994 -1661 -3280 -11899
4666 -11899 -9803 -10259 -13885 -13787 -12248 -11228 -3321 -4357 -8914 -6137 -2279 2621 5198 3787 -3423
4651 -3423 -3584 1933 5167 -1556 -7586 -8199 -6899 -4446 -220 4781 2906 -3666 -6485 -6962 -7165 -9114
4635 -9114 -9951 -11117 -6291 -3163 212 -5664 -10639 -5831 -8101 -9983 -7091 -7227 -7793 -19599 -18988 -13699
4619 -13699 -12819 -8829 -11538 -6207 -454 2441 -340 -2590 -10733 -16808 -9814 -8391 -8589 -5274 -5059
4604 -5059 -7043 -10897 -5831 2944 3157 7588 9955 1022 -6012 -8537 -7042 -3401 -3559 -5206 -5054 457
4588 457 3470 2225 -1751 3339 7851 9239 10950 8909 4791 3554 6068 2383 -411 -924 -5868
4573 -5868 -12204 -11296 -2726 -1995 -1405 -3273 -2459 -219 -12354 -18064 -19751 -12077 -4410 -862 2320 -278
4557b78m00M9k926J958L704r68L563j712m383q14k3N036l97j731q937j547k346
4540a2152n792L305L928j930J349l698j873J423Q76K424K073j940Q56M99J101
4525i551J596O064o23q783J323P0K973J926L79K401k661q42k998o843l63J157
4509a4775L558M985K206q310J991O293M240o019j226J2K64N75n416k205O559N914
4493a354P22o752J699P6j197O674N315K63k307o711q56j214N92m323j39O16L32
4476h564j632l27L742O368L455L7M025N523q448l128J79p162k676J738M913j78
4460b135l829k84J1546R150j449q911J699K970k909o936l010Q99L387N68Nj867
4444a106m890p69L595K451K823L919j658r140m399r03N628P121N905k217n016
$$ plain form
4557 -278 -678 -629 -3555 -1597 2107 1139 4702 2990 -1393 -2207 -2230 2806 2409 678 -8259 -9806 -12152
4540 -12152 -17944 -14639 -10711 -12641 -11292 -14990 -16863 -15440 -14564 -12140 -10067 -12007 -11151 -10652 -9551
4525 -9551 -7955 -1891 -2514 -11297 -9974 -9904 -6931 -5005 -4626 -2225 -4886 -5728 -8726 -15569 -15932 -14775
4509 -14775 -11217 -6232 -4026 -12336 -10345 -4052 188 -5831 -7057 -7045 -6781 -6206 -11622 -13827 -7268 -1354
4493 -1354 -632 -7384 -5685 -5609 -6806 -132 5183 5446 3139 -3572 -4428 -5642 -5050 -9373 -9512 -8896 -8564
4476 -8564 -10196 -10523 -6781 -413 3042 3079 7104 12627 4179 1051 1230 -5932 -8608 -6870 -1957 -2135
4460 -2135 -5964 -6248 5298 14448 12999 4088 5787 8757 5848 -1088 -4098 -3199 188 756 761 -1106
4444 -1106 -5996 -6765 -3170 -719 2104 6023 4365 -4775 -9174 -10077 -4449 2672 8577 6360 1344
4429A344k18K44M544m872L461L891P745q174q182l275K672N720J441j880p105
4414b644n243O329N068k452k781l872m469J085n61P733J1424j438M400J833k715
4399A1697j696J897p994j3248N180P242p91m140j537r87k435L987K99r753j786
4384a4065l10O217j889n980J0864N553l802p6P931l5n964l625M756l30N034M619
4368H898m947o324k212K753Q95j134l367J566M477j971j312N043J273l047k474
4353a883L046K888J986j147n630l209k493J615L779O972k863m920l007j689P837
4338A282K751J440J445p033p477Q42R397L372n621n64n049m538M585K916l141
4323e393m31R35L135J682O600J143n651j0680p768P001L486j300q9m150N977n30
$$ plain form
4429 1344 1126 1370 5914 1042 4503 8394 16139 7965 -217 -3492 -820 4900 6341 4461 -2644
4414 -2644 -7887 -1558 3510 1058 -1723 -5595 -10064 -8979 -9540 -1807 9617 8179 12579 14412 11697
4399 11697 10001 11898 3904 -9344 -4164 3078 2287 -1853 -3390 -4377 -6812 -2825 -2526 -12279 -14065
4384 -14065 -14375 -8158 -10047 -16027 -5163 390 -3412 -3488 4443 4408 -1556 -5181 -425 -755 4279 8898
4368 8898 3951 -2373 -4585 -1832 -937 -2071 -5438 -3872 605 -1366 -2678 2365 3638 591 -1883
4353 -1883 1163 4051 6037 4890 -740 -3949 -6442 -4827 -1048 5924 3061 -1859 -4866 -6555 1282
4338 1282 4033 5473 6918 -115 -7592 -6750 2647 6019 398 -166 -5215 -9753 -5168 -2252 -5393
4323 -5393 -5824 -4889 -1754 -72 6528 7671 2020 -8660 -16428 -9427 -5941 -7241 -7330 -11480 -5503 -6033
4307f033j111N756K024O947r64n906q949l673L505O532q779k76j441J263N090
4292f015L314k631R42J797J190L713q15M529J837k014k721j496O034K463o36n8
4276I433q362j530P85k424J848K115M924k83N62m16l784k638N34K31m016R93N741
4259C713K046k51k678m216k957l590l495j230L309M919P513k495k738l144m26
4244e720M252O73k76l801L975K066O56n158J866m393o191k428O891R401M992p963
4228a158n744l180R44R280m024l168M002l137q290P299N647n030L46J2106K466
4213H359l665M412J854J215k543j1191m195N171k505j282j032O856L405k402j724
4198G33K600N263j087k851j455k743K83O813q14k161M619o899k484n361M691N502
$$ plain form
4307 -6033 -7144 -1388 636 7583 6619 713 -8236 -11909 -8404 -1872 -10651 -10927 -12368 -11105 -6015
4292 -6015 -2701 -5332 -4390 -2593 -1403 2310 1495 6024 7861 5847 3126 1630 7664 10127 9491 9433
4276 9433 1071 -459 326 -2098 -250 1865 6789 6506 7068 6652 2868 230 764 995 -3021 -2028 3713
4259 3713 5759 5508 2830 -1386 -4343 -7933 -11428 -12658 -9349 -4430 3083 588 -2150 -5294 -5720
4244 -5720 -1468 -795 -1071 -4872 -897 1169 1825 -3333 -1467 -5860 -12051 -14479 -7588 1813 6805 -1158
4228 -1158 -6902 -10082 -9138 142 -3882 -7050 -3048 -6185 -14475 -7176 -1529 -6559 -6213 5893 8359
4213 8359 4694 9106 10960 12175 9632 -1559 -5754 -583 -3088 -4370 -5402 1454 4859 2457 733
4198 733 3333 8596 7509 4658 3203 460 743 7556 6742 4581 9200 2301 -183 -5544 -853 4649
4182D649J913J495p432l383M933K503N216J682n033p683q75K542m88m520n380
4167i861j333R711q82M19m184m043K976N885K030l004l914L473P585n43j875j548
4151H92k997m98M692M782l878j2985l836K84J053J673O829j266j930q114o842
4136b2141K373R230K645L35N943p18R6j303L336M595J059o448O93m541k364k079
4120i289J30R33m379J750N469L289j406J372j905p733m580r77P653J595n087K458
4104a0707n46J690M988J404p703J219k97O36K086N984k019k249l291N74O025K108
4088i8l414m738K89k311R72M322L547k941j821L177J337Q38q13O381K168k805
4072D090R98Q857K95m596l538r969P1K778O413m691n968q366P4P245k609k315
$$ plain form
4182 4649 6562 8057 625 -2758 2175 4678 9894 11576 6543 -1140 -2015 527 39 -4481 -9861
4167 -9861 -11194 -1483 -2365 -1946 -6130 -10173 -7197 -1312 718 -2286 -6200 -2727 4858 4315 2440 892
4151 892 -2105 -2603 2089 6871 2993 -9992 -13828 -13544 -12491 -10818 -3989 -5255 -7185 -15299 -22141
4136 -22141 -19768 -10538 -7893 -7558 -1615 -2333 -2237 -3540 -204 4391 5450 -998 -305 -4846 -7210 -9289
4120 -9289 -9159 -8226 -12605 -10855 -5386 -2097 -3503 -2131 -4036 -11769 -16349 -17326 -9673 -8078 -13165 -10707
4104 -10707 -11253 -9563 -4575 -3171 -10874 -9655 -9952 -9316 -7230 -1246 -3265 -5514 -8805 -8231 -2206 -98
4088 -98 -3512 -8250 -7961 -10272 -9300 -4978 -1431 -4372 -6193 -3016 -1679 -841 -1654 4727 6895 4090
4072 4090 5088 13945 14240 9644 6106 -3863 -3792 -1014 5399 708 -5260 -13626 -13552 -6307 -8916 -11231
4056a1231R58J632J072K919K674K620M75k808k029q040j201O903J0234J193k59
4041E112O396l765l737k289J828N34M48J30k048j152n781l437J448M29q71N391
4025a364P465J977m758l008k056p611m600O626J471L906K819k809p502Q627R164
4010H347q16k608P4m142l757q97K717J803q1O334k206p24j976k05k124M863J58
3993D760j158j414N64N261o008Q89Q051n463n861J590K080j119j942r069k944
3978a1783J0946O653j680m065l095k706J314P963l195p207k819M064k238j719
3964i567k425J0571P041p0l417j277l173q22k83l227q614K217L802M855k580n700
3948a2669O722O528j456K408K042l19K933j035K003k763o07n18j966n68n315L04
$$ plain form
4056 -11231 -10273 -8641 -7569 -4650 -1976 644 1119 -1689 -3718 -11758 -12959 -6056 4178 5371 5112
4041 5112 11508 7743 4006 1717 3545 4079 4527 4657 2609 1457 -4324 -7761 -6313 -5884 -6755 -1364
4025 -1364 6101 8078 3320 312 -1744 -9355 -13955 -7329 -5858 -1952 867 -1942 -9444 -817 8347
4010 8347 7531 4923 4997 855 -2902 -3799 -1082 721 640 6974 4768 4044 2068 1863 -261 4602 4760
3993 4760 3602 2188 2752 8013 2005 2894 10945 5482 -379 1211 3291 2172 230 -8839 -11783
3978 -11783 -837 5816 4136 71 -3024 -5730 -4416 3547 352 -6855 -9674 -5610 -7848 -9567
3964 -9567 -11992 -1421 5620 5550 2133 856 -2317 -3139 -3422 -6649 -15263 -13046 -9244 -4389 -6969 -12669
3948 -12669 -5947 581 -875 1533 3575 3256 6189 5154 7157 4394 3787 3269 1303 735 -4580 -4276
3932d276o70J389Q391K829j623k365n074o453O261M482r89p453n954K998l422
3917a1929N075Q186J2212N011n729j836P69j422M862J594m583l463o77p4l940
3902D056n323j154k453j044L56P715J31J149J564K824p556m942k016j533l091
3887a1317L89N041L400q11M5R543j798m013m740j94O569pj210M724m815j573L191
3870B424M211k84k918n631L78N709j756p500q315K105R018n040q74K699N142O230
3854E598M079n921k876o245j811J210l271J061K769K002J605N375r64P27j074
3839B264L311k36R66n479o988k400k364N609Q817M199k207r222j0517K258L742
3824h247J113K177K543m100O331M080l230P825k827l406q131n518l692J0465O285
$$ plain form
3932 -4276 -4946 -3557 4834 7663 6040 3675 -1399 -7852 -1591 2891 1902 -5551 -11505 -8507 -11929
3917 -11929 -6854 1332 13544 18555 12826 10990 11759 10337 15199 16793 12210 8747 8070 7996 4056
3902 4056 -1267 -2421 -4874 -5918 -5562 2153 2284 3433 4997 7821 265 -4677 -6693 -8226 -11317
3887 -11317 -10928 -5887 -2487 -3298 -3253 6290 4492 479 -4261 -4455 2114 2107 897 5621 806 -767 2424
3870 2424 6635 6351 3433 -2198 -1820 3889 2133 -5367 -13682 -11577 -2559 -7599 -8473 -5774 -632 5598
3854 5598 9677 3756 880 -5365 -7176 -5966 -9237 -8176 -5407 -3405 -1800 3575 2611 3338 2264
3839 2264 5575 5339 6305 826 -6162 -8562 -10926 -5317 3500 7699 5492 -3730 -14247 -11989 -8247
3824 -8247 -7134 -4957 -2414 -6514 -183 3897 667 8492 5665 2259 -5872 -11390 -15082 -4617 1668
3809A668K172Q3j231l792N92N143r694l362M657N742m198l181r44J487J285l004
3793f577N480K867n511j015l04k219M714M340O285O302l383n317o155n136l902
3778i531L92N838J409M834J263j544r103k310R107N938j331p591k385O410o85
3763G11m648p368J32k352P233N457q131l255l72q24o62J832N038R697J0013N95
3747A3096q733j0632J49m01J210K268N113Q923n486k371N939o41o238o44K532
3732D084o891K261R37k59j913k548l795j046N267M294K293L692l08K85j477j979
3716B897J894M407J736k59o492j106m410P64K778N258O255j384r154k974m473
3701d263L510P521m150j347j16l133j062P114L335m289R6l954p86j648k340J552
$$ plain form
3809 1668 3840 3923 2692 -1100 -508 4635 -5059 -8421 -3764 1978 -2220 -5401 -6345 -4858 -3573 -6577
3793 -6577 -1097 1770 -3741 -4756 -5060 -7279 -2565 1775 8060 14362 10979 5662 -493 -5629 -9531
3778 -9531 -9139 -3301 -1892 2942 4205 2661 -6442 -8752 355 6293 4962 -2629 -5014 1396 711
3763 711 -3937 -11305 -11173 -13525 -6292 -835 -8966 -12221 -12593 -13417 -14079 -12247 -7209 2488 12501 13096
3747 13096 4363 -6269 -6120 -6521 -5311 -3043 2070 10993 5507 3136 9075 8434 2196 1552 4084
3732 4084 -2807 -546 391 132 -1781 -4329 -8124 -9170 -3903 391 2684 6376 6068 6353 4876 2897
3716 2897 4791 9198 10934 10675 4183 3077 -1333 -569 2209 7467 13722 12338 3184 210 -4263
3701 -4263 -753 6768 2618 1271 1155 -1978 -3040 4074 7409 3120 3216 -738 -1524 -3172 -5512 -3960
3685c960k36M09m025N179N659J340m901N806N099m801m013m567J052M216j868
3670C89L483o65k869l800m194K599O133o845n758L871P338N855J511n963O93J0251
3654A2029J696R62l521k716o902p490m791J849M681j081l487k242l537J481o25
3639a3694k985N696R289J469l616m441K620O393j897j254p596Q82K524n366N397
3624f579J0157k196j517M168k514j214K252p398q402J939r00N195O832l230m729
3609h136P050P371J381O69j746o363l129l93N88j100M162p55n166n21Q135j247
3593H00J814J06n422J313L327n655j464j232J078k816L519Q663m576o566J221
3578e890J070j746M825M24n726K613k294M654L42Q33Q335l267n840k502j765L740
$$ plain form
3685 -3960 -4196 -3787 -7812 -2633 3026 4366 -535 5271 10370 5569 1556 -3011 -1959 2257 389
3670 389 3872 3207 338 -3462 -7656 -5057 1076 -5769 -11527 -7656 -318 5537 7048 1085 1778 12029
3654 12029 13725 14687 11166 8450 1548 -5942 -10733 -8884 -4203 -5284 -8771 -11013 -14550 -13069 -13694
3639 -13694 -16679 -10983 -1694 -225 -3841 -8282 -5662 731 -1166 -2420 -10016 -9134 -6610 -11976 -6579
3624 -6579 3578 1382 -135 4033 1519 305 2557 -4841 -13243 -11304 -12204 -7009 -177 -3407 -8136
3609 -8136 -1086 6285 7666 8335 6589 226 -2903 -3296 -2708 -3808 354 -401 -5567 -6088 2047 800
3593 800 2614 2720 -2702 -1389 1938 -3717 -5181 -6413 -5335 -8151 -4632 4031 -545 -7111 -5890
3578 -5890 -4820 -6566 -1741 -1317 -7043 -4430 -6724 -2070 -1728 -895 7440 4173 -1667 -4169 -5934 -2194
3562b194o49O73j80J074m300j015N478O794K684O39J774o748j858J174k653k871
3546b178l294n523m049Q86L312M768N201l893p126L987L332l799K528R34j522
3531f436m0J722N600n05m443l807j49N241j719L080L920L18k851L641J329n192
3515b91N292Q595j733q156P776L526q790k994l428j5K777L472q76m336o953j383
3499g517j617P4J1129M643m909n874L737L221N707j735o237m039L079M58k481
3484b361j345L197N5l337l04P335L47q64M879M796n86m667r29j752o972n263l083
3467a0854j049N053J2147L505L654j200l324o72L69r076r922m026J409O557K939
3452d490j183k22k90M49p951k966J0933O175M879r33m845J629l538J647l845r12
$$ plain form
3562 -2194 -2843 -2170 -2350 -1276 -5576 -6591 -1113 5681 8365 9004 10778 4030 2172 3346 693 -2178
3546 -2178 -5472 -10995 -15044 -14158 -10846 -6078 -877 -4770 -11896 -7909 -4577 -8376 -5848 -4914 -6436
3531 -6436 -6476 -4754 846 341 -4102 -7909 -8058 -2817 -4536 -1456 2464 2782 -69 3572 4901 -291
3515 -291 5001 13596 11863 3707 11483 15009 6219 3225 -203 -218 2559 6031 5155 819 -6134 -7517
3499 -7517 -9134 -9060 2069 6712 1803 -4071 -334 2887 8594 6859 622 -3417 -338 120 -2361
3484 -2361 -3706 -509 -454 -3791 -4095 3240 3587 2723 7602 12398 11812 7145 6216 4464 -2508 -7771 -10854
3467 -10854 -11903 -6850 5297 8802 12456 11256 7932 7260 7629 -1447 -11369 -15395 -13986 -7429 -4490
3452 -4490 -5673 -5895 -6185 -5736 -13687 -16653 -5720 455 5334 4401 -444 1185 -2353 -706 -4551 -5463
3436e463J1532l391l761P247m92l268K236L08m477K090N967j743J85j325k434
3421C211k753M912R398L071M397p983O8j149p978p301l390P065M21l470k183k300
3405e964k600M26m30N764L54j15J361j961P21k58L273k189J969p262J753N978
3389H20L20l819R40O28J234Q42m069N133q96p06l596l48j120L718K019o023l068
3372g991p593l127N863L745n4M009O688L529N665j908o856l451P49j160O223J859
3356F190n195n927O577j759m177M034Q886J669m188r83K254j981k966L98J573
3341D405N522k925r125o835J995J838L20J634q87P651j095m02m545o388J401P62
3325f674j259Q50L12O354R04r485l057J109M408L167M227N105o108j830K186N20
$$ plain form
3436 -5463 6069 2678 -1083 6164 5672 2404 4640 4948 471 2561 8528 6785 6970 5645 3211
3421 3211 458 5370 14768 17839 22236 14253 14321 13172 5194 -2107 -5497 1568 1989 -1481 -3664 -5964
3405 -5964 -8564 -8138 -8568 -2804 -2450 -2565 -1204 -3165 -2444 -2702 571 -1618 351 -6911 -5158 820
3389 820 1140 -2679 -1739 -1111 123 965 -3104 2029 1133 427 -3169 -3517 -4637 -919 1100 -4923 -7991
3372 -7991 -15584 -18711 -12848 -9103 -9157 -5148 1540 5069 10734 8826 1970 -1481 -732 -1892 4331 6190
3356 6190 995 -4932 1645 -114 -4291 -257 8629 10298 6110 5127 7381 5400 2434 2832 4405
3341 4405 9927 7002 -2123 -8958 -6963 -5125 -4805 -3171 -4058 3593 2498 2096 -2449 -8837 -7436 -6674
3325 -6674 -7933 -7083 -6771 -417 487 -8998 -12055 -10946 -6538 -3371 856 5961 -147 -1977 209 729
$$ [...]
##END NTUPLES=NMR SPECTRUM
##END=
