##TITLE=Analysis number 320396
Compound Code cc 51346
Book Reference 494/12
Project Code adrs
Chemist Name craigr
##JCAMPDX= 6.0         $$ Bruker NMR JCAMP-DX V2.0
##DATA TYPE= NMR SPECTRUM
##DATA CLASS= NTUPLES
##ORIGIN= Bruker BioSpin GmbH
##OWNER= nmr
$$ XWIN-NMR		Version 3.5
$$ Fri Jun 23 08:32:30 2006 GMT Daylight Time (UT+1h)  MAYBRIDGE\nmr@NMR_250MHZ
##.OBSERVE FREQUENCY= 250.131544655141
##.OBSERVE NUCLEUS= ^1H
##.ACQUISITION MODE= SIMULTANEOUS (DQD)
##.ACQUISITION SCHEME= undefined
##.AVERAGES= 16
##.DIGITISER RES= 18
##SPECTROMETER/DATA SYSTEM= dpx250
##.PULSE SEQUENCE= zg30
##.SOLVENT NAME= CDCl3
##.SHIFT REFERENCE= (INTERNAL, CDCl3, 0, 16.522)
##AUDIT TRAIL= $$ (NUMBER, WHEN, WHO, WHERE, WHAT)
$$ ##TITLE= Audit trail, XWIN-NMR		Version 3.5
$$ ##JCAMPDX= 5.01
$$ ##ORIGIN= Bruker BioSpin GmbH
$$ ##OWNER= nmr
$$ C:\u/data/dgb/nmr/ADRS/1250/pdata/1/auditp.txt
$$ ##AUDIT TRAIL=  $$ (NUMBER, WHEN, WHO, WHERE, WHAT)
(   1,<2006-06-23 08:32:05.44 +100>,<MAYBRIDGE\nmr>,<NMR_250MHZ>,
      <created by zg, POWCHK disabled, PULCHK disabled
       configuration hash MD5:
       E2 DF 36 D8 04 B2 41 60 5A D7 A3 38 5A 4B D0 FE
       data hash MD5: 64K
       EE 0E F6 69 2E D2 AA 42 BF 24 4B AC 44 B5 CD 22>)
(   2,<2006-06-23 08:32:18.00 +100>,<MAYBRIDGE\nmr>,<NMR_250MHZ>,
      <Start of raw data processing
       ef LB = 0.3 FT_mod = 6 PKNL = 1 SI = 32K 
       data hash MD5: 32K
       35 09 9E 34 48 40 4B 0A BD 30 E3 54 2F EC 30 00>)
(   3,<2006-06-23 08:32:19.55 +100>,<MAYBRIDGE\nmr>,<NMR_250MHZ>,
      <apk 
       data hash MD5: 32K
       27 DE EE 4B 8C 96 B8 B9 3B A6 D0 07 27 8C 5C CC>)
(   4,<2006-06-23 08:32:20.28 +100>,<MAYBRIDGE\nmr>,<NMR_250MHZ>,
      <abs ABSG = 5 
       data hash MD5: 32K
       68 FE 18 01 6D F2 1A 77 B0 C8 F5 3E C1 2B F8 C5>)
$$ ##END=
$$ 
$$ hash MD5
$$ DA 9D 10 84 1D 10 45 1E 97 09 72 BD 4C 02 1A 28
##$RELAX= 
##$RELAX= 
##$RELAX= 
##$RELAX= 
##$RELAX= 
##$RELAX= 
##$RELAX= 
$$ Bruker specific parameters
$$ --------------------------
##$DU= <C:\u>
##$EXPNO= 1250
##$NAME= <ADRS>
##$PROCNO= 1
##$TYPE= <nmr>
##$USER= <dgb>
##$AMP= (0..31)
100 100 100 100 100 100 100 100 100 100 100 100 100 100 100 100 100 100 
100 100 100 100 100 100 100 100 100 100 100 100 100 100 
##$AQSEQ= 0
##$AQ_mod= 3
##$AUNM= <au_zg>
##$AUTOPOS= <1 >
##$BF1= 250.13
##$BF2= 250.13
##$BF3= 250.13
##$BF4= 250.13
##$BF5= 500.13
##$BF6= 500.13
##$BF7= 500.13
##$BF8= 500.13
##$BYTORDA= 1
##$CFDGTYP= 0
##$CFRGTYP= 5
##$CHEMSTR= <none>
##$CNST= (0..31)
1 1 145 1 1 1 1 1 1 1 1 1 1 1 1 1 1 1 1 1 1 1 1 1 1 1 1 1 1 1 1 1 
##$CPDPRG= <>
##$CPDPRG1= <>
##$CPDPRG2= <>
##$CPDPRG3= <>
##$CPDPRG4= <mlev>
##$CPDPRG5= <mlev>
##$CPDPRG6= <mlev>
##$CPDPRG7= <mlev>
##$CPDPRG8= <mlev>
##$CPDPRGB= <>
##$CPDPRGT= <>
##$D= (0..31)
0 1 0 0 0 0 0 0 0 0.06 0 0 0 0 0 0 0.0002 0 0 0 0 0 0 0 0 0 0 0 0 0 0 
0 
##$DATE= 1151047924
##$DBL= (0..7)
120 120 120 120 120 120 120 120 
##$DBP= (0..7)
150 150 150 150 150 150 150 150 
##$DBP07= 0
##$DBPNAM0= <>
##$DBPNAM1= <>
$$ [...]
##$SUBNAM6= <"">
##$SUBNAM7= <"">
##$SUBNAM8= <"">
##$SUBNAM9= <"">
##$SW= 20.6930455092707
##$SWIBOX= (0..15)
0 0 3 0 0 0 0 0 0 0 0 0 0 0 0 0 
##$SW_h= 5175.983436853
##$TD= 65536
##$TD0= 1
##$TE= 295.16
##$TE2= 300
##$TE3= 300
##$TEG= 300
##$TL= (0..7)
0 120 120 120 120 120 120 120 
##$TP= (0..7)
150 150 150 150 150 150 150 150 
##$TP07= 0
##$TPNAME0= <>
##$TPNAME1= <>
##$TPNAME2= <>
##$TPNAME3= <>
##$TPNAME4= <>
##$TPNAME5= <>
##$TPNAME6= <>
##$TPNAME7= <>
##$TPOAL= (0..7)
0.5 0.5 0.5 0.5 0.5 0.5 0.5 0.5 
##$TPOFFS= (0..7)
0 0 0 0 0 0 0 0 
##$TUNHIN= 0
##$TUNHOUT= 0
##$TUNXOUT= 0
##$USERA1= <user>
##$USERA2= <user>
##$USERA3= <user>
##$USERA4= <user>
##$USERA5= <user>
##$V9= 5
##$VALIST= <valist>
##$VCLIST= <CCCCCCCCCCCCCCC>
##$VD= 0
##$VDLIST= <DDDDDDDDDDDDDDD>
##$VPLIST= <PPPPPPPPPPPPPPP>
##$VTLIST= <TTTTTTTTTTTTTTT>
##$WBST= 1024
##$WBSW= 4
##$XGAIN= (0..3)
0 0 0 0 
##$XL= 0
##$YL= 0
##$YMAX_a= 508506
##$YMIN_a= -692214
##$ZGOPTNS= <>
##$ZL1= 120
##$ZL2= 120
##$ZL3= 120
##$ZL4= 120
##$ABSF1= 16.522
##$ABSF2= -4.171173
##$ABSG= 5
##$ABSL= 3
##$ALPHA= 0
##$AQORDER= 0
##$ASSFAC= 0
##$ASSFACI= 0
##$ASSFACX= 0
##$ASSWID= 0
##$AUNMP= <proc_1d>
##$AZFE= 0.1
##$AZFW= 0.1
##$BCFW= 0
##$BC_mod= 0
##$BYTORDP= 0
##$COROFFS= 0
##$CY= 12.5
##$DATMOD= 1
##$DC= 0
##$DFILT= <>
##$DTYPP= 0
##$F1P= 14.0000005364418
##$F2P= -0.99999901652339
##$FCOR= 0.5
##$FTSIZE= 32768
##$FT_mod= 6
##$GAMMA= 0
##$GB= 0
##$INTBC= 1
##$INTSCL= 1
##$ISEN= 128
##$LB= 0.3
##$LEV0= 0
##$LPBIN= 0
##$MAXI= 10000
##$MC2= 0
##$MEAN= 0
##$ME_mod= 0
##$MI= 0
##$NCOEF= 0
##$NC_proc= -3
##$NLEV= 6
##$NOISF1= 0
##$NOISF2= 0
##$NSP= 0
##$NTH_PI= 0
##$NZP= 0
##$OFFSET= 16.522
##$PC= 1
##$PHC0= 169.9323
##$PHC1= 5.37675
##$PH_mod= 1
##$PKNL= yes
##$PPARMOD= 0
##$PSCAL= 4
##$PSIGN= 0
##$REVERSE= no
##$SF= 250.13
##$SI= 32768
##$SIGF1= 0
##$SIGF2= 0
##$SINO= 400
##$SIOLD= 32768
##$SREGLST= <1H.CDCl3>
##$SSB= 0
##$STSI= 32768
##$STSR= 0
##$SW_p= 5175.98343685301
##$SYMM= 0
##$S_DEV= 0
##$TDeff= 65536
##$TDoff= 0
##$TI= <Analysis number 999999
Compound Code 99
Book Reference 9
Project Code 9>
##$TILT= no
##$TM1= 0
##$TM2= 0
##$TOPLEV= 0
##$USERP1= <user>
##$USERP2= <user>
##$USERP3= <user>
##$USERP4= <user>
##$USERP5= <user>
##$WDW= 1
##$XDIM= 32768
##$YMAX_p= 486318586
##$YMIN_p= -58028
$$ End of Bruker specific parameters
$$ ---------------------------------
##NTUPLES= NMR SPECTRUM
##VAR_NAME=  FREQUENCY,     SPECTRUM/REAL,   SPECTRUM/IMAG
##SYMBOL=    X,             R,               I
##VAR_TYPE=  INDEPENDENT,   DEPENDENT,       DEPENDENT
##VAR_FORM=  AFFN,          ASDF,            ASDF
##VAR_DIM=   32768,         32768,           32768
##UNITS=     HZ,            ARBITRARY UNITS, ARBITRARY UNITS
##FACTOR=    0.157963299565203, 1,           1
##FIRST=     4132.6476996994, 0,             0
##LAST=      -1043.33573715361, 0,           0
##MIN=       -1043.33573715361, -58028,      0
##MAX=       4132.6476996994, 486318586,     0
$$ Real data points
##PAGE= N=1
##DATA TABLE= (X++(R..R)), XYDATA
$$ [...]
16222i753j5006m634m818L363O756J0408J0753K868m655J8652J2428j0810j6215
16209f63j5538L768p421p323r50J4793O329q598r799j2601o411L989J1624N748
16195b3053J5913L893k0938j0223Q132Q956p742k602P715J463M327k023K244P28
16181a3210j510j3147l88J2181P272J953r222p891J4418J1690J0166K241N517
16168B0070q181L996n473j2923r557J141n951P658R821M750M539O857l78m919
16154A1450k0319L196K356q751p406l228j7869p235J0591P637P440K159J1404
16141h575P225k72r793n653L829J1923J2689j41j2126k3282j3283k744P663K986
16127b9554N995N197l219Q235J700J0840q207j2295J248Q463Q64r695l451Q076
$$ y = [-9753, -24759, -29393, -34211, -30848, -24092, -13684, -2931, -63, -4718, 13934, 26362, 15552, -663, -16201, -12433, -19854, -27177, -28127, -13334, -7005, -15603, -25402, -38003, -44414, -40425, -28801, -23053, -7140, -3247, -24185, -34408, -26276, -17320, -25062, -27664, -19949, -18486, -14159, -16182, -13938, -13210, -14720, -27867, -28255, -16074, -8802, -6849, -16071, -23962, -9544, 2146, 12312, 14553, 20070, 11889, 15885, 10412, -2511, -12068, -10927, -16878, -9220, 601, 5351, 9890, 16747, 16369, 11450, -8869, -5673, -3317, -12068, -19474, -22702, -40571, -47806, -37215, -29578, -22138, -19979, -8575, -1350, -1622, -11415, -17068, -13239, -1316, 11373, 11232, -894, -24176, -37459, -40203, -32540, -29554, -23559, -18362, -21581, -13346, -11646, -806, -9013, -21308, -20060, -11597, -10733, -20428, -23879, -15803]
16113a5803l270L139Q964L635q14k6726N954J6351j1588P224M880p937j5435M427
16099b6999J8783J6926p244k834l292j3030M589O838K169M49k211J394J2099Q449
16085A6086j2347L33R64p714j3537j1547J2397J4164k932j9648j2671K024M691
16072b9737Q401J3726Q446j3162M736P481L205j7333k992M05n552P252J2099p718
16058a0743m676L281M37k678l026q722Q510J5632M816J460j2959l093l520J2534
16044b747r70O759k179j0685n164J0666Q516o212q69K6598m575o161q58J1247
16030B3366J8554j6720j7015r311l572J2346q308r911L98J4299J0749o509l904
16017D462k259J819r824J412o085M425N10j328l173J0749J846l323j3325q833
$$ y = [-15803, -19073, -15934, -6970, -3335, -4149, -30875, -24921, -8570, -20158, -12934, -8054, -15991, -31426, -26999, -8216, 8710, 1466, -1368, -4660, -17690, -13101, -6263, -4094, -3645, -5856, -4462, 7637, 16086, 3739, 4072, 5036, -2678, -16215, -27762, -15365, -1201, -4133, -23781, -36452, -34428, -29737, -21336, -7610, 836, -12326, -7590, -109, 3096, -14237, -17229, -16824, -22376, -15124, -3025, -10743, -15419, -12138, -11701, -14379, -17405, -26127, -17617, -1985, 2831, 4291, -8668, -11761, -15281, -2747, -3717, 3042, 863, -9822, -14986, -4320, 4196, -2016, -2885, 23713, 19138, 12977, 12119, 23366, 41920, 25200, 8185, -1126, -4698, 7648, -660, -10571, -10173, 4126, 14875, 8366, 4462, 2203, 4022, -5802, -4390, -10475, -6050, -5540, -6868, -10041, 708, 2554, -769, -14094, -22927]
16003b2927J203J2641J749R711L061K412R016j975K526L36m556l444K253J609
15989A3615M883O566o388q715j6972l889k040R472J4533M561M36j0763j2409r523
15975a6633q41k201q768J2254L44j2487j4788J9751K2051L553j258j4426J265
15962a2184O026p351j081m076J0032O001J769L585N216O134N976p221j5248r710
15948a2132m278o55j0791n672L607R983J3848K727j3618J2460K2131k0742j1651
15935a4783R626J3274J3555k491r091p183j8978j77J2460o298l627O280R3J8214
15921A0874O043r713O935l918j1020k2j021J0314O618j0142j490p78p215j1793
15907a6328J7227L175k66p299m642Rk870J2116J1302j0373j505L461K882o757
$$ y = [-22927, -21724, -9083, -7334, 2377, 5438, 7850, 16866, 14891, 17417, 17753, 13197, 9753, 12006, 13615, 18498, 25064, 18676, 9961, -7011, -10900, -12940, -3468, 11065, 15626, 16062, 5299, -7110, -16633, -17474, -19675, -28443, -16189, -15845, -28332, -43120, -23369, -1318, 2235, 977, -13449, -12184, -6158, -13509, -14590, -18666, -8634, -2633, -864, 2721, 7937, 14071, 20047, 12826, -2422, -12132, -16410, -17065, -27856, -33528, -29921, -19938, -6090, -3363, -16981, -4521, 17610, -3132, -14783, -5157, 8117, 21672, 19181, 10090, 2907, -16071, -16248, -3788, -10086, -13713, -7433, -7340, 10874, 16917, 7204, 14139, 10221, -799, -821, -1842, 8472, 15090, 4948, 3458, 2680, -4535, -16328, 899, 4074, 3808, -3491, -8133, -8124, -10994, 1122, 12424, 2051, 546, 4007, 6889, 132]
15893A32o914j850o887l011J8634J366p696n865p877p720p019K524J2026l11O061
15878a4407J4138m385j3070O61n047m540j047L959l688l91J1266J0861j970j1191
15864a8851m393r120o294J3066K0364q480J2183R070q63r364Q865L589N312m291
15850A0793j6535J2399N427m089r500j5559j2364k958Q555M681N221Q817L372
15837a740n402K474k122q97J6004j2254j6953O785O366l25J237l86r606R433j628
15822i014j604l230n573Q611J3476m433o036j831j7094L729J9064M293l106j1910
15808a4658k080J957j0937r198M814N676J1669J313l768j512M223k681N196K731
15794g255r58J107N19M018P223k065k4222j212m528j0476L693P404J0304K3828
$$ y = [132, -6782, -8632, -15519, -18530, 104, 1470, -6226, -12091, -19968, -27688, -34707, -32183, -20157, -20468, -14407, -269, -4654, -17724, -17063, -22110, -26650, -27697, -23738, -27426, -27817, -16551, -5690, -7660, -18851, -23244, -32364, -38658, -25592, -5228, -13708, -1525, 7545, 6682, -2682, 6183, 9772, 15084, 10793, -5742, 6657, 12084, 7995, -1505, -17064, -29428, -32386, -23831, -19150, -13929, -5112, -1740, -7142, -4668, -6790, -7687, 8317, -3937, -20890, -14105, -7739, -8064, -6827, -7213, -16819, -7386, -9014, -10618, -13848, -19421, -10810, 2666, -1767, -7803, -9634, -26728, -22999, -3935, 358, -2748, -14658, -16738, -14781, -25718, -34916, -30102, -24426, -12757, -11444, -15212, -16724, -12501, -15182, -9986, -7255, -8213, -7106, -6587, -2569, 4654, 2589, -21633, -22845, -27373, -37849, -34156, -26752, -16448, 7380]
15780G380J836q518K835j553k871O013M733n591j8772N722P693j56o533R751R916
15765A1885K878p33L879N728j6377k2192q130k000J7635J3449k027j2714j7860
15752b6579p216J0504J2946Q340j1215j8860J059J5785K64n234P837M871Q195
15739F97J289m968n163k114R130K979P750R980J0774o78j4053r931m620J884p706
15724d750Q44l377l762j206J96O234p461r746P429m188M36o558l039O415Q905
15709a3628J518J3741n7k91j375p614j984M950j2479p496l886j0696J0090J3512
15695a5695j373J301K485J211n242R99N413J4471j5676l485L876m37J2282j3175
15681a3045l17J2156j5553r209P422Q946j557J7393r514k059L948l813j240p604
$$ y = [7380, 9216, 698, 3533, 1980, -891, 5122, 9855, 4264, -14508, -8786, -1093, -1249, -7782, 1969, 11885, 14763, 14030, 17909, 23637, 7260, -14932, -23062, -25062, -7427, 6022, 3995, -8719, -26579, -33795, -23291, -10345, -2005, -13220, -32080, -31021, -15236, -14972, -20206, -12369, -7498, 697, 1986, -2982, -8145, -10259, -1129, 1850, 9600, 19580, 30354, 29676, 15623, 5692, 1072, 2956, -4750, -3906, -7283, -11045, -12251, -12055, -5821, -13282, -23028, -15599, -19787, -19351, -25909, -28948, -22533, -13628, -12110, 1631, 1574, 1283, -92, -7706, -9690, -4740, -17219, -24715, -28601, -39297, -29207, -15695, -17068, -15767, -13282, -12071, -17313, -16314, -10901, 3570, -12106, -15591, -11715, -12152, 130, -13045, -13362, -1206, -16759, -25968, -18546, -9600, -11157, 6236, -3278, -5337, -1389, -5202, -6442, -14046]
15667a4046Q518r032k89J3234J305j3789l71P237P235n369P42n892J0123L276
15653B882J759O643k545j5905N6O038P330l881O49J6637k52l1045q408K944j311
15638a8409N714P755p69K748L619J0489j0371j0166j537N152J309n905J790L660
15624d921N400j0907J768J8565n018r714P83n407p216o484Q495j169k430p604
15610b5859J1253J0771J4318j867r110j4222p875L376N366L539J1842M987L582
15597A0101J0711j1416j8630o323L416J1964o623J4221J1220q777j0318j1966
15585a2420J3394n888k0119R574L470J830P334l889o013R723J521J3875O473K919
15571B1784M844q84j8201j3484j4845o164J4308m130j1939M243K887J2425P622
$$ y = [-14046, -5528, -14560, -14849, -1615, -310, -14099, -14470, -7233, 2, -5367, -4625, -10517, -394, 2882, 4641, 11284, 8739, -7166, -7110, -1072, 6258, 2377, 3026, 19663, 19411, -11634, -20042, -17098, -18409, -12695, -4940, -5709, -2961, 658, 11147, 776, -9390, -10927, -5775, -4466, -10371, -8581, -4921, 479, -10428, -8660, 9905, 4887, -4827, -4044, -9451, -16667, -23151, -14656, -15825, -18255, -25859, -14606, -3835, 10483, 8616, -494, -14716, -22591, -19215, -13849, -10310, 1532, 6519, 10101, 20812, 9396, -9234, -15557, -12141, -177, -6800, 7421, 18641, 9864, -454, -12420, 974, -4914, -25033, -15459, -11989, -10159, -2825, -6714, -12727, -3004, -1483, 12392, 18865, 21784, 26628, 25744, 7543, -5941, -20786, -26950, -12642, -16772, -28711, -24468, -21581, -9156, -1534]
15558a534P439M137o636n900K24m367p638J323R360Q53K893j6255Q341Q597k711
15543a874j1205R588P092K073n526n25o788o628m880O466O703m036l785j0701
15529b4026o977J9366Q021q2P937j0397j0454j4637J0966K0512L446k119r570
15516h014M119J0663J610n17M306R48j1068j3819J285R245J6072n847j4497J7187
15502A1673k589j0300l914J1528M900o129N09J2422l973r277j2037J1819J3042
15489A7674k112j2759K021J6629O003j4831r430j5230j448J5433L620o592K622
15476A600j3886q961k511m236m763p443J1664R243J0492L963k918R428r826k2899
15462c1053Q199K6275K440j1994L79P920j1116j55O256k616l659o530J548K293
$$ y = [-1534, 5905, 10042, 3406, -2494, -2270, -6637, -14275, -12952, -3592, -2739, 154, -16101, -7760, 837, -1874, -13079, -3491, 3601, 5674, 148, -377, -7165, -13793, -18673, -12207, -5504, -9540, -13325, -24026, -31003, -11637, -3616, -3698, 4239, -6158, -16612, -31249, -20283, 229, 3675, 1556, -8014, -3895, 6768, 8378, 7861, 12167, 13115, 2047, -11772, -10487, -1242, 14830, 8983, -5514, 11673, 9084, -1216, -5130, 6398, 11298, 5169, 5678, 18100, 14127, 4850, -7187, 4632, 17674, 15562, 2803, 4824, 21453, 27456, 12625, 3195, -12035, -13483, 1950, 5570, -1022, 1600, -12286, -21247, -23758, -27994, -32757, -40200, -28536, -19293, -8801, -4838, -7756, 1672, -8154, -31053, -22854, 3421, 5861, -6133, -5754, 2166, -8950, -9105, -2849, -5465, -9124, -15654, -14106, -11813]
15448a1813Q40J4507j176p095j801L399r138M904j768J494J136O650j1739m751
15434a6351J52L801J1655J456O690J108j123o843j4857J458j1799r797L88R055
15420b5007R185o287q207P729P20P111J1671N060O988l155j1298l972P230n53
15406b785o537j615m728Q115L080j5848r583J802O476R765R9J931j1102J74R810
15391a0946m962q735p830R410J3550j0924j811K4054J2173p869j3599j2119l380
15378b2988n571m512O161J9523K47Q595K263q595q147l427O671n349J1137J1588
15364G596O824q860j1484n421k131L611n144p27L455k897p184j9376r150J6073
15350c4815K2768K4618J0360k384j0430j0840k676m066j2214Q89j306M200J1425
$$ y = [-11813, -10973, 3534, 2358, -4737, -6538, -3139, -12277, -7373, -9141, -7647, -6511, 139, -11600, -16351, -16199, -12398, -743, 713, 7403, 8511, 7388, 545, -14312, -12854, -24653, -34450, -34062, -25007, -15822, -22109, -30316, -22587, -21867, -14756, -3085, 1975, 8963, 5808, -5490, -9462, -2232, -2785, -9322, -10937, -15665, -7550, -4470, -20318, -29901, -28099, -21623, -11858, -11759, -9828, -20930, -20756, -10946, -15908, -24643, -32473, -23063, -9513, -20437, -22248, 1806, 13979, 6110, -7489, -19608, -22988, -28559, -33071, -26910, -7387, -7140, 1455, 3718, -4877, -13024, -16451, -9780, -15129, -3992, 7596, 14420, 5560, -5924, -11345, -13476, -9865, -15009, -15736, -12281, -15178, -22362, -41738, -50888, -34815, -12047, 12571, 22931, 20547, 10117, -723, -3399, -7465, -19679, -18790, -20096, -15896, -4471]
15337d471k213J0930J7416k757k2121r197J3159J0782j3368k1456m455J0243m546
15324b2054Q290J8807J8124j807q334l855q933j1725l583j2933j3149Q482l5K000
15310c0705J3643L848L039j6533j8605M214R276J0351o445l66q471L061J0928
15297b2765J0274L102J0040L600J632o49j1881L317L876K295N989P938j8745o922
15283h899J6874k246j5987J1013J672j0635j0353N903J618K816n981J1958k27
15270b474o439o292r142J5317n850n995M03K505Q932j164L600r526j0395L754
15256b2766k151n055J3221J1793O228j930o01N560R73j6664r352p802l6o147J223
15241c3506J6268M592r203K803J3116K0444o78q307q83O350m156L73Qj3562n651
$$ y = [-4471, -6684, 4246, 21662, 18905, -3216, -12413, 746, 11528, -1840, -23296, -27751, -17508, -22054, -13764, 5043, 23167, 21360, 13026, 9171, 238, -11487, -15070, -28003, -41152, -32670, -32705, -30705, -17062, -13214, -10175, -26708, -45313, -41099, -31823, -21472, -27917, -28283, -36754, -33693, -22765, -12491, -9389, 651, 4251, 5883, 5234, -6647, -3330, 546, 2841, 8830, 16768, -1977, -8899, 7975, 5729, -10258, 755, 2427, -8208, -18561, -12658, -11040, -8224, -14205, -2247, -2474, -8913, -15205, -24347, -9030, -14880, -20875, -20472, -17967, -9035, -10199, -6599, -16125, -26520, -22766, -24917, -29972, -16751, -4958, 1270, -660, -1261, 4299, 5272, -11392, -20744, -28546, -28582, -34729, -33506, -17238, -12646, -21849, -19046, -5930, 14514, 13836, 5529, 4646, 10996, 6840, 7213, 7221, -6341, -11992]
15226a1992O739R550k220n819j0233J316R508R580M705n937r163j3149M970J117
15212a1028O62l799J974r190o731M880R713l160J3636J5891n542p528j7827p114
15198b5163J066O946J3491R162q712K502j589j531o427r663J692J0753j118p59
15184i350L357j2826j925J9285J2812o869j0344P46J84j1063p719p92R488n706
15170b0722M173j1063j700N522Q221O99N284n118j4225o226m283O090J4256N056
15156a4036M327o900J3365J0446j1958j2581r860J664k928n451N130O283J272
15143b1227L2084o638k1136J0067p138j4079k33J2047K758m093l411Q080j1766
15130b4685N953M504p33J067p810N854K737j426j877J8040J7901j908m925p362
$$ y = [-11992, -5253, 4297, 2077, -3742, -13975, -12659, -3151, 6429, 11134, 5197, -3966, -17115, -12145, -11028, -10366, -14165, -12191, -21381, -28112, -23232, -13519, -16679, -3043, 12848, 7306, -222, -18049, -25163, -24097, -17151, -3660, 5502, -3210, -708, -2297, -3828, -10255, -19918, -18226, -7473, -8591, -9350, -5993, -18819, -20744, -1459, 11353, 4484, -5860, -5114, -4930, -15993, -23712, -24504, -15016, -20722, -16549, -27612, -29312, -23790, -15569, -14870, -9586, -14704, -28929, -35155, -39438, -33348, -19092, -14036, -9709, -16609, -3244, 7202, -4756, -17337, -27197, -25533, -28461, -33912, -28782, -22499, -21227, 10857, 4219, -16917, -6850, -13988, -28067, -28300, -16253, -13495, -17588, -20999, -12919, -24685, -18732, -14228, -14961, -13894, -21704, -15850, -13113, -14539, -16416, 1624, 19525, 17617, 12692, 5330]
15116E330K066M864p744K653P129L070r563j1522n410l135q669N478Q885O376
15102a92N4O272o444n587m446m369J5527J3145j0103p609J0129r377k952N64m473
15087i861k3009M574M956M106R904n07J100P634o990M44J5157m743j5457o881
15073a9573J3429K821j583m246R84k079l963l13J6460J4596n857j8648Q818J4543
15059A5389O860j6864j7803N824J3957o333q469J225n74q031k011p955P348r157
15045b6594o031j847m058J3022M896M247p162J3438M535k908l87K129l839o886
15031a7445R770J9796P032n093j8820J525M770L281M896l672n582n842q294k371
15017a6049K009J0955L61j7741J0200J8179J8780p368m910K473p127j4619j02
$$ y = [5330, 7396, 12260, 4516, 7169, 14298, 17368, 7805, -3717, -9127, -12262, -20931, -15453, -6568, -192, -138, 6134, -310, -5897, -10343, -14712, 815, 13960, 3857, -3752, 6377, -3000, -5952, -5388, -9861, -32870, -28296, -23340, -19234, -9330, -9837, -8737, -1103, -8093, -7649, 7508, 2765, -12692, -19573, -6144, -3323, -4906, -9152, -8168, -10247, -14210, -14523, 1937, 16533, 10676, -7972, 846, 15389, 22249, 5385, -12418, -6594, 7363, 1030, -7439, -6214, -6788, -14819, -16830, -24785, -17437, -26594, -32625, -34472, -38530, -25508, -20612, -16365, -23527, -10089, -5554, -8462, -8849, -6720, -10559, -17445, -7675, 12121, 19153, 14060, -4760, -3235, 1535, 4816, 9712, 6040, 458, -5384, -13678, -16049, -14040, -3085, -2724, -20465, -10265, 7914, 26694, 19326, 14416, 16889, 9762, -4857, -4959]
15004d959p770M40O682R063j4874r576O228J0740k604M007J2680K270o152j7249
14990a1074l166P012j29P598L874k809j1424q443m519J5324J1518K981O22n637
14976A728J1150j079j7564p550r194o22L453j6195p237R351K81J8721J2237j946
14962d466q171J933j5093q840J0245J6081R535j4405j3907o280J5168J4554j601
14949e247j942J0581O072P716p044j0972p353J0414P612r162j5400k249N294o039
14935a7719p955Q023J8356M208l30k021q935o685p763J3790J613j1861Q135J2142
14921B998P860R965R99j9737Q524J5348j9923j7700j669J033J2276o465n610N583
14907f518Q070j917j819R649j98J848k370o83J3404J0825R464p528j8605j7905
$$ y = [-4959, -12729, -12289, -5607, 3456, -11418, -20994, -14766, -4026, -6630, -2623, 10057, 12327, 6175, -11074, -14240, -7228, -7357, 241, 4115, 1306, -10118, -18561, -23080, -7756, 3762, 6743, 7365, 1728, 12878, 11799, -5765, -13315, -22509, -23131, -19678, -35873, -43110, -33759, -33478, -14757, -2520, -4466, -12637, -10704, -25797, -34637, -24392, -8311, 1224, -13181, -27088, -33368, -18200, -3646, -5247, -7189, 3392, 9464, 17180, 10136, -836, -8189, 2225, 9837, 675, -14725, -16974, -11680, -17719, -25674, -17651, 705, 4913, 4583, 2562, -6373, -13058, -20821, -7031, -5418, -17279, -9144, 2998, 10858, 20823, 21822, 2085, 10609, 25957, 6034, -11666, -13335, -12302, -26, -6491, -12101, -6518, 1552, -365, -2184, 7465, 7267, 9115, 6745, 6062, 19466, 30291, 39755, 32227, 13622, -4283]
14893d283q400R793q030j1441j325j1608R319J4925k968J779R264N367o945L797
14879g56J4925N335R186j1217j7581r740q865L162J970K871o413O632J3062j2345
14865i774n104j0818m133L775O764J388N126m559j154n322P305J3068Q106J57
14851D825q163p700M567q793m15K642L606J2735M761J591j634o817J129n53L672
14836E453n263k487J343j3785q525n206K214P739L112n430J3202O703O29m982
14822e283p617l205k381J3130K3409n070p74j4150o298J6184O290k261N48o042
14808F480o276K358N859J3380o462l210J399n631j0507K947p363j5838l630k128
14794b8622J8733K4683M721j6574l254k573r951j0886o290L461J8284n633L38
$$ y = [-4283, -12683, -2890, -10920, -22361, -23686, -35294, -25975, -11050, -14018, -12239, -2975, 2392, -4553, -756, 14169, 19504, 28690, 17473, -108, -9848, -18713, -15551, -13581, -10710, -17123, -10491, 2571, -9774, -14878, -25696, -29829, -26054, -19290, -17902, -12776, -17335, -18489, -23811, -16506, -3438, 4668, 4825, -3338, -11038, -6471, -15264, -15679, -13037, -9431, 3304, 8065, 9656, 8022, 1205, 2334, 1781, 5453, 190, -2297, -954, -14739, -23264, -28470, -26256, -18517, -15405, -20835, -7633, -930, -301, -5283, -12900, -16105, -18486, -5356, 18053, 12983, 12209, -1941, -8239, 7945, 14235, 11974, 12522, 6480, 204, 2562, 8421, 21801, 15339, 12129, 13528, 7897, -2610, 337, -7026, -22864, -26494, -28622, -9889, 14794, 19515, 2941, -313, -2886, -12837, -23723, -30013, -26552, -8268, -13901, -13563]
14781a3563o186r446M642J3108J7876J1656k578L352r941k762K561k628q489K85
14767b113N25r659q693P415k1765l541K809N627j840J5140M92n7N860J1228R071
14752A0499J2333n753m899m152P23j205m018O645K319j6182j8553J4210N510o787
14738i310k730k202j0284R223J8445J2047o464J469M857j1844q718j6256R523
14725a2244J702k338q160m10J0244J2668N025r750k1205q795m81J1274J2577Q3
14711i810j3642j0421o335O868Q400Q508O39k752p933m644q89J1092O227n834
14697b0526J0488R310q926j1037j6086J124J6250J4065j0872J0950J1456m290
14685A906m296N900o435m428k713R94J493N126J0822j431j9579K86K3323J6940
$$ y = [-13563, -19749, -29195, -24553, -11445, 6431, 18087, 15509, 18861, 8920, 6158, 8719, 6091, -2398, -2113, -1588, -11247, -19940, -12525, -34290, -37831, -35022, -29395, -31235, -16095, -15603, -15660, -9800, 1428, 10499, 22832, 17079, 12180, 8028, 8751, 7546, 3528, 10173, 12492, -3690, -22243, -8033, -2523, -9310, -12040, -14242, -24526, -15303, 3142, 15189, 8725, 10194, 15051, 3207, -5511, -21767, -12244, -10542, -12880, -21040, -21450, -11206, 1462, 6487, -3263, -24468, -33263, -33744, -22470, -9893, -9810, -23452, -33873, -40208, -33340, -24940, -16432, -15793, -18545, -26478, -31122, -32011, -20919, -14692, -20526, -10038, -728, -9654, -20691, -36777, -35653, -19403, -5338, -16210, -5260, 6196, 1906, -2390, 3510, -2925, -7353, -10066, -9072, -7579, -2453, 8369, 6938, -12641, -12355, 10968, 27908]
14671B7908o697j3464J2213j449j2060r719p789J653N013L512r897o691k0J1778
14657e709N933l689J926m341j0619j3203J5438J6569j1202j0628J4104J196q25
14644e050P719J0016K171j0473p9n446L109K683N024K293n829m636K436j1206
14630g268j8234J1568J7765Q205n120l733n728j2116O148J4637R022M43k659J897
14616A4827r353Q224j25p777P592o790k850M674n839j0185j3660j637l338N420
14602b0817K693k093o205J0474k738p524P584K492q121j639o70J5331O548J128
14588c557R304j521K141m347n040n867p940m060j64l069n657J7401J1801O773
14574F198k824k544r857q140M639J2219R421j3934j3409J4337L594j2128P506
$$ y = [27908, 21211, 7747, 19960, 18511, 6451, -3268, -11057, -9404, -4391, -879, -10776, -17467, -17487, -5709, 224, -3465, -1539, -5880, -16499, -29702, -14264, 2305, -8897, -19525, -5421, -4225, -5050, 2669, 12685, 14856, 4383, 4304, -1142, 1967, 4650, 9674, 11967, 6138, 1502, 3938, -7268, -25502, -13934, 3831, 12036, 6916, 3183, -2545, -14661, -8513, 6124, 15146, 15589, 12930, 14827, 5474, 13698, 13573, 5796, 13388, 6598, 3748, 8422, 2583, -7602, -21262, -22899, -26237, -20817, -18124, -20217, -26422, -15948, -18686, -26210, -18626, -16134, -24255, -25894, -26564, -11233, -4685, -3557, 5747, 4226, 6367, 2020, -3020, -8887, -16827, -20887, -21051, -24120, -29777, -12376, -575, 6198, 3374, 830, -9027, -17167, -12528, -309, 9112, -4822, -18231, -3894, -300, -12428, -4922]
14561d922J5990l37k697r622j7074o896q32k114J3565J2751L347j028n89l533
14547c991m428j3196j5552P895L977L876P753R802o77m014J3695j0640j5056L250
14533a7306k090J0287j912J677n000k031P054J1453J3226k631j2592k308L857
14520A684m137J6458J064j4071q873j054o572J4146Q514m200m274p146j1682j71
14506b0314R804o507k233p51o84J0182r784K828J2316j049K0265K001r361j702
14492E011l216r284j19J1177o37o657N15O713m747o01o402q059J6345J0016q941
14477A114J0523Q710k617m30j4371j2170k33O742k953j0107k520J2624K618j2216
14463a5286n05Q50J1483N84j4431m55M034j581j616j926j0144k620J0860J5250
$$ y = [-4922, 11068, 10731, 8034, -1588, -18662, -25558, -26390, -28504, -14939, -2188, 1159, 131, -458, -3991, -8419, -21615, -37167, -29272, -25295, -21419, -13666, -3864, -4541, -8555, 5140, -5500, -20556, -17306, -19396, -9109, -11021, -9344, -14344, -16375, -9321, 2132, 15358, 12727, 135, -2173, 1684, -2453, 14005, 15069, 998, -7875, -8929, -15501, -1355, 7159, 2959, -1315, -8461, -20143, -20314, -10510, -17017, -19250, -20001, -20685, -10503, -20287, -17459, -5143, -6192, 14073, 16074, 6713, 5011, 1795, -7489, -7608, 3569, 2932, -3725, -3210, 3503, -1244, -1845, -8247, -16306, 39, 10055, 1114, 11637, 20347, 17730, 17300, 2929, -9241, -9474, -2732, -5685, -15792, -18312, -5688, -3070, -15286, -15791, -14941, -3458, -2874, -17305, -17760, -13726, -15307, -16923, -18849, -28993, -31613, -20753, -5503]
14449e503J8697k968j1786q3M027n35r310M319j223p865O533J8039L446q254j293
14434F241J8998q954j7813j8915J8313J9031k748n630J929j177j702r828q962
14421a1217j5439r442L833Q776k081P509R651n584j5147K975J4382o232j875J8058
14407a833J5090k723j114q660L700J4926l655J479o993p289k107p719K350K1790
14393A7242J6217p487l961k358j818p935j2269M091m649R551M406j515L090j98
14379A2407j0344J33j7306j0159J8114K865k757K599o870Q98M714K26r397r120
14365b3997J2864L862j4726m08O488R300j429M768J082J0596J602j6160q808n377
14351b0343j948N079j1908j567J2895J0678n541P902L668o99j492J193l327j4089
$$ y = [-5503, 13194, 10226, -1560, -1643, 2384, 1849, -7461, -3142, -4365, -12230, -5697, 12342, 15788, 7534, 6241, 25239, 16285, -1528, -20443, -2130, 16901, 14153, 8523, 10452, 9275, 7573, -2255, -11217, -26656, -36098, -32265, -23489, -25570, -18061, -8410, -13994, -29141, -26166, -11784, -18016, -19891, -1833, 13257, 10534, 9420, 760, 4460, 19386, 15731, 17210, 10217, 2928, 821, -6898, -4548, 17242, 33459, 25972, 22011, 19653, 17835, 9900, -2369, 1722, -2927, 6624, 11030, 9515, 12605, 12407, 2063, 2196, -15110, -25269, -7155, -4290, -7047, -4448, -11318, -10420, -5706, -5480, -14877, -23997, -11133, -7271, -21997, -22405, -15917, -6617, -8046, -3278, -2196, 8400, 10002, -6158, -14966, -20343, -22291, -17212, -29120, -30687, -17792, -7114, -12655, -4753, -1085, -1784, -3276, -2083, -5410, -19499]
14337a9499k43j846J222M47N864J3092r041j0997J6340L031r45O054k277k422
14323a220p683o446J1468J5806o48p976j1214j2526J0416J2343m261j4090J424
14310a4607q63l385O459J7472P924n457J99j2183k3247J0814O509k118o013j4631
14296c3127M443J1112Q559J4789k547p295m645Q534O453q639m978m509N07j454
14282a2797K288M406p362j4321N790J9102R002O663p566j5210p245o293n034M629
14268b3948O131J5486n79m459M988O254j0088J028Nj1429P914j418o660J1143
14254e632m647j0350n342o334Q125M271J2078M916n044O882M517l269q220o110
14240a4159K220N205Q543Q32j144p089J245J5038K377K997j9715j6274n430J1886
$$ y = [-19499, -19742, -21588, -20366, -19919, -14055, -963, -10004, -21001, -4661, -1630, -2575, 3479, 1202, -1220, -8903, -15349, -3881, 11925, 11277, 3301, -7913, -20439, -10023, 2320, -1941, -16031, -14607, -15470, -18855, -12396, 5076, 13000, 7543, 7742, -4441, -27688, -16874, -10365, -12483, -18496, -33127, -28684, -17572, -9013, 5776, 3229, -4066, -8711, -177, 6276, -2363, -7341, -11850, -11343, -12797, -10509, -6103, -13465, -27786, -21996, -2894, 6108, 12771, 5205, -10005, -17250, -23543, -28577, -23948, -17817, -2331, -2910, -7369, -2381, 3873, -6215, -5187, -5182, -16611, -8697, -10115, -16775, -5632, -10279, -20629, -25971, -32305, -24180, -19909, -7831, -2915, -7959, -1077, 3440, 171, -8049, -14159, -11939, -6734, 1809, 2641, 1497, -5592, -4347, 10691, 13068, 16065, -3650, -19924, -25354, -13468]
14226a3468j404j1409m383k815N72J3805R72R101K610k2402l582J4817N901l080
14212a4765O133o3N476L188K603r679o857m554l979J2422J1345P817m951n695
14198a559n590o16J1188N29p323j9866K089K0804J925j7210K282J515j653j0586
14184b4071M005o67J0746J8446l870n833P13q96K413J0338m495q562Q515j393
14170E389k123l89L079p701j0194J2937M546K315R196K302j8911j800j786q338
14156a1478j3212J4819K687Q289L96M829J0404m917L318l573r822j955J303r795
14142h707m374o40N182O863P6o878j5203j0000l363J587Q445J9574L105p693q087
14127b0113P264J552m089j1140n299J3003R664l416m779m33k0437N498R987n437
$$ y = [-13468, -14872, -26281, -30664, -33479, -32907, -19102, -18130, -9029, -6419, -28821, -32403, -17586, -11685, -14765, -8632, -8695, -3219, -31, 2572, -7107, -13964, -18518, -22497, -10075, 1270, 9087, 4136, -1559, -7149, -7765, 3423, 3952, -3371, -23237, -21148, -344, 1581, -15629, -13347, -11832, -13485, -24071, -20066, -20733, -9987, 8459, 4589, -1244, -531, -1427, 986, 11324, 6829, -1733, 6782, 5389, 3266, 2877, 5956, -1745, -11939, 998, 5544, 7859, 17055, 19357, 446, -1354, -3140, -11478, -24690, -9871, -7184, 1105, 1501, 6330, 16734, 11817, 15135, 11562, 1740, -215, 1088, -8707, -13081, -13721, -8539, -1676, -1600, -8478, -23681, -33681, -37044, -35457, -27012, -7438, -4333, -12026, -20113, -12849, -11297, -15386, -26526, -31825, -18822, -9158, -12574, -17353, -17786, -38223, -32725, -22738, -28175]
14113b8175k3681o172Q890K5474K229K717J3767J891K647o662r100j011m83L870
14099a3799m876o424L731m211J263L264q965M293Q542N166m459M739Q314Q216
14085D794l878j5789l513N020J6546Q975k725r764K1541L555r731O108j7171j478
14071B490P218r682m481M036L759M462m100p173q981L58l120p951J1452J2092
14057C79j087r995J1128K1732p761k0612j2262k302O868O157l529j654P520J747
14043c671J450J026j970l838L205J3924J3697r01r174j3073p544j0804Q611J6177
14029G115N95j4043q132l226l318N327K753n805J116J4186L879p086n085o885
14015a8609q725n363K653P157R159L775j2207J4618K176N596l632q409M054k242
$$ y = [-28175, -51856, -58028, -49138, -23664, -21435, -18718, -4951, -3060, -413, -7075, -16175, -17186, -17669, -13799, -18675, -25099, -21368, -25579, -24316, -21052, -30017, -25724, -17182, -12016, -16475, -11736, -3422, 4794, 916, -14873, -18386, -13366, 3180, 12155, 9430, -334, 21207, 24762, 15031, 21139, 3968, 2490, 9708, 26, -4455, -419, 3340, 7802, 3702, -3471, -12452, -12094, -15214, -23165, -11713, 379, -708, -10703, 425, 22157, 14396, -6216, -18478, -20780, -13912, -7755, -11284, -12938, -5418, -3671, -2221, -1195, -3165, -7003, -3798, 10126, 23823, 22922, 13748, 675, -6869, -17673, -9062, 7115, 7710, -6333, -14465, -17691, -21009, -15682, -12929, -18734, -17618, -3432, 447, -6639, -11724, -18609, -27334, -32697, -30044, -22887, -13728, -9953, -22160, -7542, -5366, 230, -3402, -11811, -7757, -9999]
14001i999m006R759j0955j9087L423J2680J1389O847N377o293r377J3133R659
13988A2550j914p960n710k568M32R387J6935l84j4459L23J1613q998k842R168
13974A5573N41j1874j5275J817J0404L38K872R048P551n46q428j0730l971N050
13960B370N917R623p473Q11R422p372j2451N8J724N449p565j3559L569J3924M506
13945H953j7371k052M16j3365L201O15m094J3461J5484M72j0666j937p255k544
13931a6682J728k727k276M62J5621J1101J007q944k824j0138p084J2260K1404
13918A2908m385j6650L33J6855K702j7777k4412k137R209Q658K4901J6381n039
13905B1547j0928j6039l624K2973M150o480N051L68K212L786O139m81l419j10
$$ y = [-9999, -14005, -4246, -15201, -34288, -30865, -18185, -6796, 51, 5428, -865, -10242, 2891, 12550, 10636, 2676, -3034, -5602, -5170, 4217, 21152, 20768, 6309, 6632, 18245, 9247, 6405, 15573, 16114, 4240, -11035, -9218, 1186, 1524, 4396, 13444, 20995, 20449, 12021, 1291, -2680, 2370, 8287, 17910, 10437, 11248, 20670, 13298, 847, 905, 2629, 8078, 513, -13046, -9477, 4447, 8953, -8418, -10470, -10054, -23419, -20218, -19603, -23697, -10236, 5248, 5720, -4946, -6883, -14138, -16682, -14954, -17681, -19957, -19495, -3874, 7227, 8234, -710, -3534, -13672, -20756, -8496, 12908, 8523, -8127, -7794, 9061, 11763, -6014, -30426, -32563, -23354, -14696, 10205, 26586, 21547, 10619, -5420, -9044, 13929, 18079, 11599, 16650, 17018, 19230, 23016, 29155, 28674, 25255, 25145]
13891B5145k636m349o543j322j432m957R465j0180j911R124J59j0000L984K725
13877G272q72r243r390L806p995J8413K63l134j139l7R725R583k574m243k661
13862G774j2455r524k095J5121M07o97J856O427J7583j108j5225l465J2359k127
13848A4831l199J0293j803o921k124N771P094j2104p446q37N401o413p264O774
13834B053J392p856J1465m900N531J6568q514j4533k184k801J04o709j245p078
13820a8707J2198J8119Q628m844m597l370m006o336K23k081O586Q654j2681m002
13806f216J1534Q042J834N329p19n295n681R83O758n877j4398L638j2418J001
13792a1485J4730L283k645r53L438N751k191J1778J8139M245p834o398k1669r910
$$ y = [25145, 22509, 18160, 11617, 10295, 8863, 3906, 13371, 3191, 1280, 10404, 10563, 563, 4547, 7272, 6400, -2843, -12233, -8427, -16422, 1991, 2254, -880, -2019, -2056, 7669, 17252, 14678, 10435, 7774, -4681, -14205, -16300, -1179, -772, -1469, 387, 6814, 24397, 23289, 8064, 4599, 16958, 14831, 11632, 21925, 20122, 13201, 11077, 16848, 23942, 11838, 4392, 3555, 8956, 2543, -4721, 2053, 3445, -4411, 7054, 2154, 7685, 24253, 15739, 1206, -978, -3779, -3675, -10384, -11629, -18707, -6509, 11610, 20238, 15394, 10797, 7427, 3421, -2915, -2692, -4773, 1813, 10467, -2214, -6216, 5318, 13360, 15194, 20523, 19804, 14509, 8828, 9811, 16569, 10692, -3706, -68, -12486, -11485, 3245, 6528, 3883, 2930, 6368, 12119, 9928, 21706, 39845, 44090, 36256, 29858, 8189, -1721]
13778a721j581k831K779O716J5260j2428q665K789R941J2521p715k238R737k80
13764B2284l923Q556j0967p550Q077r90n267m610J065j6743O656N635o74L678
13750E227j843K359k069k386J1384J897Q748J320j0218k5861P96P994j582n241
13736i475k13J1043J1720r31o349n711l317r699R040R715N588k672N671P544N748
13721B7702p725Q185j2190p348J1573J1589l114j0794P84O803k713O094R758j859
13707C6745j868k371p047L427K804L049l812j4521k485O331k391J632k75j0287
13693H931k1279m872J1809L372P209J6465P338M274M264J3540k2827k0061j159
13680G004J708j0569L083L426J53N155R723K771j6970r887J915Q328l038K420
$$ y = [-1721, -3302, -6133, -3354, 3362, 18622, 6194, -2471, 318, 10259, 22780, 15065, 12827, 22564, 22284, 18361, 26917, 15950, 8400, 16477, 15487, 10220, 5610, 6675, -10068, -3412, 2223, 1549, 5227, 3384, 5743, 3674, 1288, 12672, 14569, 23317, 24637, 14419, -11442, -10646, -2652, -4234, -9475, -9688, 1355, 13075, 12144, 5795, 84, -3233, -12932, -3892, 5823, 11411, 8739, 14410, 21954, 27702, 19977, 28162, 15972, 8624, 20197, 31786, 28672, 17878, 18662, 25465, 22752, 28846, 38604, 36745, 34877, 32506, 25459, 28886, 31690, 34739, 30927, 16406, 13921, 20252, 17861, 19493, 19218, 8931, -12348, -17220, -5411, -2039, 5170, 21635, 28973, 33247, 37511, 51051, 28224, 8163, 7004, 8712, -1857, 1226, 4652, 4805, 9960, 19683, 22454, 5484, -4403, -2488, 5840, 2802, 5222]
13666E222K317M814P881M338J547M759N586l320q670J615n497k497r183N963M252
13651A9127j8546k0482N002R715Q420M892P596M597K018n279R344q541q556j240
13637H067N33O647M816P947L863K349r087j0668M148P985O914m872j0495n71p8
13622A7498p385k820M728j8731R480J106j0655Q713O109R581L680j3924j5646
13609h266J9327J2680K70k764Q481J3198j277r928L459R778m932r608j4705R910
13595B5623o360o796J0564J6754r361j200J018L078J388P523r74L606K2945K2163
13581H9971K2035K2048K0477L4130J6124j0720j3212k3770k5645k2442j5441o674
13569H6881n321k755p571J55j523r155n575N27j3373M252j151j301m454J2854
$$ y = [5222, 7539, 12353, 20234, 24572, 26119, 30878, 36464, 33144, 24474, 26089, 20592, 18095, 8912, 14875, 19127, 581, -19901, -14899, -5184, 3236, 8128, 15724, 20321, 22339, 17060, 26404, 17863, 9307, 8067, 8600, 15247, 20063, 28010, 31873, 34222, 25135, 14467, 18615, 26600, 33514, 28642, 18147, 17576, 17498, 10113, 7293, 12021, -6710, 2770, 3876, -6779, 1934, 8043, 17624, 21304, 7380, -8266, 11061, 23741, 24011, 21247, 29728, 42926, 41649, 31721, 35180, 44958, 40026, 30418, 15713, 25623, 19263, 12467, 23031, 39785, 30424, 29224, 30242, 33320, 34708, 42231, 41257, 44863, 67808, 89971, 112006, 134054, 154531, 188661, 204785, 194065, 180853, 157083, 131438, 108996, 93555, 86881, 81560, 78805, 71234, 71389, 69866, 60711, 55136, 55663, 42290, 46542, 45391, 44090, 39636, 52490]
13555E2490R538R44M840R660J5373R707l932J0867K4035L4337M3525M8697N0541
13542C10622M0018K2345R334q615l2030m7985p0532m4326j9142j1558j4676m730
13530A28725j368j7064j2643l103L151k740l629K0084R474m608j8696M380M448
13517A06411j6741j5679n864J3548J3979K799J6309N968J8408L0178L2446J7133
13505B18895J1827J1224r468m075j3634l5755k2341j8152j0055r884r286j4393
13493I4903j0097L559O850R717o923k5317r586L79p561k766P983Q64m264n311
13479E2430K979L752J643q89j3143R671J4398p933j0028N97L293L774j1187j3095
13465C6262j997J0226m702l00N150m973Q482M518q930j0265l282O772j0471Q223
$$ y = [52490, 62028, 62972, 67812, 77472, 92845, 102552, 98620, 109487, 133522, 167859, 211384, 260081, 310622, 350640, 372985, 382319, 373704, 341674, 293689, 223157, 178831, 159689, 148131, 133455, 128725, 127357, 110293, 97650, 94547, 97698, 94958, 91329, 111413, 120887, 116279, 97583, 101963, 106411, 89670, 73991, 68127, 81675, 95654, 98453, 114762, 120730, 139138, 169316, 201762, 218895, 230722, 241946, 232478, 228403, 214769, 179014, 156673, 138521, 128466, 118582, 109296, 94903, 84806, 88365, 95215, 104932, 98009, 72692, 63106, 63485, 55924, 53158, 61141, 62005, 57741, 52430, 55409, 59161, 60804, 59915, 46772, 56443, 70841, 62908, 52880, 53477, 56770, 60544, 49357, 36262, 34265, 44491, 39789, 39489, 44639, 39666, 48148, 52666, 43736, 33471, 30189, 36961, 26490, 34713]
13451C4713J651J224j2754l996k278n484K697m190N928J4598J4179j2371k353
13438C1564P42K804m956J0335k49o73n756j7548j538J7240J5756Q972o527Q27
13424E0993p347J5008L417q454j5724L037J3580L131M490n369q462j4922k6302
13411G076O93M258J296K3123L0909p787m125J1806J473j2206l240q110m138o966
13397C4062j0726j473j752J57P598j1047p445R312J2133J0493R85j871o03K840
13383D2663J4821P615O13o232j0016J1668Q767j0227n965j0940j2541L260o052
13370B7434j3223J2357K4235l023l586o926R214J3442k585j794q894P94q107l968
13356C5370j807k695N582J4496N131M269m820n42N032J3026j928J7946O162p89
$$ y = [34713, 36364, 37588, 24834, 20838, 18560, 13076, 15773, 11583, 17511, 32109, 46288, 33917, 31564, 32306, 35110, 30154, 40489, 40240, 39567, 33811, 16263, 14725, 31965, 47721, 56693, 50166, 50993, 43646, 58654, 62071, 53617, 37893, 40930, 54510, 57641, 62131, 56762, 48300, 33378, 7076, 7769, 12027, 13323, 36446, 67355, 59568, 55443, 67249, 68722, 56516, 53276, 45166, 41028, 34062, 23336, 21863, 20111, 20268, 27866, 16819, 9374, 18686, 30819, 41312, 42297, 40426, 39823, 42663, 57484, 65099, 65712, 59480, 49464, 61132, 69899, 59672, 53707, 42767, 30226, 33486, 27434, 14211, 26568, 50803, 47780, 44194, 37268, 46482, 59924, 57339, 55545, 46651, 47445, 39338, 35370, 33563, 30868, 36450, 50946, 56077, 60346, 55526, 54984, 60016, 73042, 71114, 89060, 95222, 94433]
13342I4433o074r150j552j1961j0615j6420r56K924L438r256N728m718J47j835
13328C4133J5027R744K96M21o915m979N007J0943J4866m895j1529j4571J3917
13315F1465L517J197j431m778j1606L656J0819J0270Q28k727J48j0558p569K175
13301E5406O861k324J876K068l757J1019N859J2713j459q493q013O421q830j5980
13287E3367n721M672J1490J321j5582k721k259j801j981k225J0357J5768P067
13274G1752J948P130L132l890m003j8417r419L309p790J079l777r735o171J1064
13260C6212Q162l137K2070L1811K0105J1587L989Q221J1932j9604j0136p952n203
13247A08057r761j3196J747N068L934m711M102n600J8144k550J973J4237o083
$$ y = [94433, 88359, 79209, 77657, 65696, 55081, 38661, 37705, 40629, 44067, 34811, 40539, 35821, 35968, 34133, 49160, 58904, 59200, 59621, 52706, 47727, 52734, 63677, 78543, 73648, 62119, 47548, 61465, 64982, 66179, 64748, 59970, 48364, 52020, 62839, 73109, 73937, 71210, 71358, 60800, 53231, 55406, 62267, 59943, 61819, 63887, 60130, 71149, 77008, 89721, 88262, 79769, 71756, 78177, 69347, 53367, 47646, 52318, 63808, 65129, 49547, 46826, 44567, 42766, 40785, 38560, 48917, 64685, 71752, 73700, 80830, 83962, 80072, 76069, 57652, 48233, 51542, 43752, 44831, 41054, 31319, 25148, 36212, 44374, 41237, 63307, 95118, 115223, 126810, 130799, 139020, 150952, 131348, 121212, 113260, 108057, 98296, 85100, 86847, 91915, 95849, 91138, 95240, 89640, 107784, 105234, 107207, 121444, 115361]
13234A15361J0766J5286K210l762j0308p893j647m536k800j0357r341L66J4587
13221A07932K8397K0489N0438M7692J5592P715J249M457j065l995J856l011j4622
13208B63124J11o860l785q714n209J7762P210o503k142R890J0506Q945J1237K9624
13194C25196K1694p369r1J539J3782M704j3265l801K0009J3296O111K2930J8872
13181D23607Q258L884J5062K5594N238o781J1517L676l763N165J479r66J254R588
13167E02812K2382J9164L3173J0619J5584K4871J6665L5422M3489L3918L9225
13156G97324K7856K9000L7186M3551N4879O3373P8272R8876J01402J22964J44982
13145A599665J54507J65057K07185K48254L02363L88878N05629O71334Q91701
$$ y = [115361, 126127, 141413, 143623, 139861, 129553, 121660, 120013, 115477, 112677, 102320, 92979, 93345, 107932, 136329, 156818, 207256, 254948, 270540, 278255, 279504, 283961, 282896, 278901, 280757, 277746, 263124, 263235, 256375, 252590, 243876, 238667, 256429, 263639, 257136, 254994, 264884, 275390, 284335, 295572, 325196, 346890, 339521, 339430, 340969, 354751, 359455, 346190, 342389, 362398, 375694, 381805, 404735, 423607, 431865, 435749, 450811, 476405, 481643, 474862, 486379, 490055, 486292, 491457, 492936, 491970, 493224, 502812, 525194, 544358, 577531, 588150, 603734, 628605, 645270, 680692, 724181, 758099, 797324, 825180, 854180, 891366, 934917, 989796, 1053169, 1131441, 1230317, 1331719, 1454683, 1599665, 1754172, 1919229, 2126414, 2374668, 2677031, 3065909, 3571538, 4242872, 5134573]
13136E134573J260874J812615K625005L678482M709008N227832N031526M135908
13128C3615823K669042N19482k112453m246717n445319n273824m042660k732840
13120A2950534j811405j238327q26724n36283l45386j96291q3817m1337j4275
13111G856689o1498j08516j40166j28801l6674J19019K88523M84610P09667R87543
13101I970396J365186J885569K712810L990849N891611Q236285J0210216J0875492
13093E5138414J0029506P814479M350738o65263o222535j0210464j2148294j1051396
13085C7035185p940247n189593l433688k407329j771689j291835r35419o26583
13077A3438802m03002k45149j54839j52708k17703l26677m44415m78680m12810
$$ y = [5134573, 6395447, 8208062, 10833067, 14511549, 19220557, 24448389, 29479915, 33615823, 36284865, 36804347, 34691894, 30445177, 24999858, 19726034, 15683374, 12950534, 11139129, 9900802, 9074078, 8537795, 8192409, 7996118, 7912301, 7870964, 7856689, 7795191, 7686675, 7546509, 7417708, 7381034, 7500053, 7788576, 8273186, 8982853, 9970396, 11335582, 13221151, 15933961, 19924810, 25816421, 34052706, 44262922, 55138414, 65167920, 72982399, 77333137, 76667874, 70445339, 60234875, 48086581, 37035185, 29094938, 23905345, 20471657, 18064328, 16292639, 15000804, 14065385, 13438802, 13035800, 12790651, 12635812, 12483104, 12265401, 11938724, 11494309, 11015629, 10602819]
13068A0602819k68096r2801R2978L10338N60511R03036J419258K177785L244576
13059A8950404M399528N177634N220834M539332L182880J163650j552535m064036
13051C7017691n750426o236780n155076l615072k439916j700143j263359j002550
13043I854369p87047o10938m61969l30331k15179j47105j14512j37759j96532
13034F852997k81338l55417l91615l96342l56494k90156k27951j88683j77684
13025D187317j67815j62855j58736j37949j32419j46074j51166j28718j03640
13016B897945r8039j11430j07559r0162o7323q0287q6004p2355p0021p8605p8386
13005A957774n7402n9176m1548k5423j2399k8760l5112k5090k8365m6742o2022
$$ y = [10602819, 10334723, 10241922, 10334900, 10645238, 11205749, 12108785, 13528043, 15705828, 18950404, 23349932, 28527566, 33748400, 38287732, 41470612, 42634262, 41081727, 37017691, 31267265, 25030485, 19875409, 16260337, 13820421, 12120278, 10856919, 9854369, 9067322, 8456384, 7994415, 7664084, 7448905, 7301800, 7187288, 7049529, 6852997, 6571659, 6216242, 5824627, 5428285, 5071791, 4781635, 4553684, 4365001, 4187317, 4019502, 3856647, 3697911, 3559962, 3427543, 3281469, 3130303, 3001585, 2897945, 2799906, 2688476, 2580917, 2490755, 2423432, 2343145, 2257141, 2184786, 2114765, 2036160, 1957774, 1900372, 1841196, 1799648, 1774225, 1761826, 1733066, 1697954, 1672864, 1644499, 1597757, 1535735]
12994A535735o9275n8521n7600n5478o6336m3497k2999j6744k2837m0351k1025
12983A061072j9466k9021l3711k9604k8772l2271l6804k9704k2350j9663j7320
12972G62386j3755N382Q278P877K862J6587K2059M3339O8298N5832L8963K2793
12960A040901K292K532j0844k8503n9111o9545q2939p1109m3372n0301l9798m4770
12948E45433k0259j0390o454j3488j9770j5367k3944k1347q637j5885k1409m096
12936C64387k0685k9214j3703r930j0052M302j864j0176L303J7024Q226j4226
12924B87392J784q024k0177k856j2415r291n032k3737j1643M442k841o540q32
12911A90230J8458p975k561J612l710N973k992k780K110L477J3497M593r202r659
$$ y = [1535735, 1466460, 1407939, 1350339, 1294861, 1228525, 1185028, 1162029, 1145285, 1122448, 1082097, 1061072, 1041606, 1012585, 978874, 949270, 920498, 888227, 851423, 821719, 799369, 779706, 762386, 748631, 754013, 762291, 770168, 773030, 789617, 811676, 855015, 923313, 979145, 1018108, 1040901, 1043193, 1045725, 1034881, 1006378, 947267, 877722, 794783, 723674, 680302, 630001, 590203, 545433, 525174, 514784, 508330, 494842, 475072, 459705, 435761, 414414, 405777, 389892, 368483, 364387, 343702, 314488, 300785, 290855, 280803, 285105, 283241, 273065, 276368, 293392, 301618, 287392, 289176, 281152, 260975, 258119, 245704, 236413, 231381, 207644, 196001, 200443, 197602, 191062, 190230, 208688, 200713, 198152, 199764, 196054, 202027, 199035, 196255, 198365, 201842, 215339, 219932, 210730, 201071]
12897B01071p843J292N156j0385j788J0326L119j2142j4905r209J0932O589l542
12884A78671k618n246n045O916R647n856j4092q798l322J5760P365r433o826R381
12870A66504Q112J5101o70J67j5532j9264j710J8547j1165j0618n96o024J5238
12857A58090j521j1225j5092m664J0012J6712K501M732K120N875J725o386r42
12844A61937L384N20j390j287j125j5770p501L845n14N59o561j1219l464O72j0194
12829A11892J195k947p033o639M794K631k291O608m234l609O064n639K561O173
12815A09526N277j0943j2034N585M838K764N513M202J2860o524O038K050j0576
12802A18576m911j9092L509o14j4536O5J9851J1920J9453K542N065j4135p058
$$ y = [201071, 193228, 194520, 199676, 189291, 187503, 197829, 200948, 188806, 173901, 164692, 175624, 182213, 178671, 176053, 170807, 165762, 172678, 182325, 176469, 162377, 153579, 150257, 166017, 173382, 163949, 157123, 166504, 174616, 189717, 189047, 189214, 173682, 154418, 152708, 171255, 160090, 149472, 148876, 142852, 158090, 156569, 145344, 130252, 125588, 135600, 152312, 154813, 159545, 161665, 167540, 169265, 162879, 161937, 165321, 165841, 164451, 163164, 162039, 146269, 138768, 142613, 142099, 142658, 136097, 124878, 121414, 122086, 111892, 113087, 110140, 103107, 96468, 101262, 103893, 101602, 108210, 103976, 100367, 106431, 100792, 103353, 109526, 114803, 103860, 91826, 97411, 102249, 105013, 110526, 114728, 127588, 121064, 127102, 129152, 118576, 113665, 94573, 98082, 97468, 82932, 82997, 102848, 114768, 134221, 136763, 141828, 127693, 120635]
12789A20635k287Q849J7872k081K973p637q496j3129j4794j207J7469m959j0135
12776A03073j7919j7241M265P179J965P88j1477k481M900o714k0948j2145J4790
12763D8035O784J1867J1778J132j2914O921P054O011J7875L749p775p681Q243
12750A01079j4840o251O457o843Q009M166J1030J722p655n371N050P34J1066r430
12736I8923q179R42M584l221N02j152j0395j2095n427n759N695J0988p394n054
12722F2958J3977J2220J4516J9725K0478n492j0180N95N115M434O074o315j763
12709A36342j2196r479j3041o869J0846K378p027o029J5097J7108l297j1170L588
12696A16251J1382j1100j3253j3283j8988j812K5351k530j859M367j030J5449
$$ y = [120635, 118348, 127197, 145069, 142988, 145961, 138324, 129828, 116699, 101905, 100698, 118167, 113208, 103073, 85154, 67913, 72178, 79357, 81322, 82110, 70633, 68152, 73052, 66338, 45390, 33245, 48035, 54819, 66686, 78464, 79596, 66682, 73603, 80657, 86668, 104543, 108292, 100517, 92836, 101079, 86239, 79988, 86445, 79602, 87611, 91777, 102807, 104529, 96874, 91503, 96553, 97287, 108353, 98923, 90744, 91686, 96270, 93049, 93551, 92399, 82004, 69909, 64482, 58723, 64418, 75406, 68012, 62958, 76935, 89155, 103671, 123396, 143874, 138382, 128202, 128797, 133912, 138346, 144420, 138105, 136342, 124146, 114667, 101626, 94757, 105603, 107981, 100954, 94925, 110022, 127130, 123833, 112663, 116251, 127633, 116533, 103280, 89997, 71009, 69197, 94548, 92018, 90159, 94526, 93496, 108945]
12684A08945N904p694m703n611J3854K1463J8811K0853Q760J7900K5777L2627
12672B56886L1380K1678J75j5574j4605J422j5187j4354L063K7158L5959K4120
12660C42121J9017J1679J773J6785k06o651j2726o157J5102K692m238k073O808
12647C83926K272J0070K0645K0292K1343K9881K4865L9869L6199L9125N3321P1802
12635G53610M1395J5905p19j7284l6321o0707n7840l6196j7431j5187j4386j6330
12623E38509r849L087J7921K3235N693k194r001J4084J4350p585M904P8J4961
12610F08193R205N649K56J2846K6561K8212N0998L2690K5539M4547N9227K0403
12598I24326K8460K2897Q345O326P046Q251Q742J0331K0503K7194J3631K1136
$$ y = [108945, 114849, 107155, 102452, 96841, 110695, 132158, 150969, 171822, 180582, 198482, 224259, 256886, 288266, 309944, 310119, 294545, 279940, 281362, 266175, 251821, 254884, 282042, 318001, 342121, 361138, 372817, 374590, 391375, 391169, 384518, 371792, 365635, 380737, 383429, 379191, 377118, 383926, 386198, 396268, 416913, 437205, 458548, 488429, 513294, 553163, 589362, 628487, 681808, 753610, 795005, 810910, 810191, 792907, 756586, 695879, 638039, 601843, 584412, 569225, 554839, 538509, 528660, 531747, 549668, 572903, 578596, 576402, 567401, 581485, 595835, 588250, 593154, 593232, 608193, 617398, 623047, 623303, 636149, 662710, 690922, 741920, 774610, 800149, 844696, 903923, 924326, 952786, 975683, 984028, 990354, 997400, 1005651, 1014393, 1024724, 1045227, 1072421, 1086052, 1107188]
12586A107188K2571L1188N3464M0583L4937L2809N0448O0198N3730N7671O2413
12575A607200P5982P3561P2879Q6519R5168R2087J13269J10032J20936J49298
12565B596931J73666J96260K13457K51259K85976L14495L59982M47457N14368
12556E353851O01616O96568P90443Q97566J016437J164640J339174J533268J840614
12547A5234177K244627K779656L531022M553296N796028P186725Q575438R732416
12539E9633385J0364391J0237765R169194P132809M267608R26676k523902n600581
12531I3607345p923807r293771r705116r260540q224464o899987n560537m376300
12523C2362823l435960k746516k233090j882425j654584j453909j290960j167898
$$ y = [1107188, 1129759, 1160947, 1214411, 1254994, 1289931, 1322740, 1373188, 1433386, 1487116, 1544787, 1607200, 1683182, 1756743, 1829622, 1916141, 2011309, 2103396, 2216665, 2326697, 2447633, 2596931, 2770597, 2966857, 3180314, 3431573, 3717549, 4032044, 4392026, 4839483, 5353851, 5955467, 6652035, 7442478, 8340044, 9356481, 10521121, 11860295, 13393563, 15234177, 17478804, 20258460, 23789482, 28342778, 34138806, 41325531, 49900969, 59633385, 69997776, 80235541, 89404735, 96537544, 100805152, 101731828, 99207926, 93607345, 85683538, 76389767, 66684651, 57424111, 49199647, 42299660, 36739123, 32362823, 28926863, 26180347, 23947257, 22064832, 20410248, 18956339, 17665379, 16497481]
12515A6497481j046699r45806q54988p46321o45918n63188n25887m80711m35621
12506A0252342m02375l76179l54292l65076l54651l36659l38386l34700l23286
12497G066738k90919k74734k61126k60388k54404k32912k14428k07792j88748
12488D881287j64274j73438j67330j54257j45955j35537j25957j27930j15698
12479C570911j16205j18863j22307r8974r6907q9691q0603o3216p4423q0500q7345
12468B541877q8752o5327n3023n5649o4576n9528p8798o8305m7278n9187n6687
12457A844767p2765n3133l9104k7948k8470m8851m5810k4852l4450m7808m4016
12446A377560l7565l0957m1534l8201l0003l7002k9318k3835k9959j0428k4007
$$ y = [16497481, 15450782, 14504976, 13649988, 12903667, 12257749, 11694561, 11168674, 10687963, 10252342, 9849967, 9473788, 9119496, 8754420, 8399769, 8063110, 7724724, 7390024, 7066738, 6775819, 6501085, 6239959, 5979571, 5725167, 5492255, 5277827, 5070035, 4881287, 4717013, 4543575, 4376245, 4221988, 4076033, 3940496, 3814539, 3686609, 3570911, 3454706, 3335843, 3213536, 3114562, 3017655, 2927964, 2847361, 2784145, 2709722, 2629222, 2541877, 2453125, 2387798, 2334775, 2279126, 2214550, 2155022, 2076224, 2007919, 1960641, 1901454, 1844767, 1772002, 1718869, 1679765, 1651817, 1623347, 1574496, 1528686, 1503834, 1469384, 1421576, 1377560, 1339995, 1309038, 1267504, 1229303, 1199300, 1162298, 1132980, 1109145, 1079186, 1068758, 1044751]
12435A044751k4095k2931l9471l6862k4259k3313j9101j4973j2841j5140j3040
12424G98725j5723k7451k8082k1835k7913j9713j0592k4001l8160l2518o860j9987
12412E25890l2817k1323j3564M846j046m304n555O260L98r386p445j6958l954
12399D21042k478j0912j1614j2184m385k3079j5148j5165j2769P42j892r567Q891
12386C11482o85P777l3j2076j6334k104k076N219l202j8501j1967m418P082k795
12372B57369j334O685j7580k1963j4508K532j8254p857k805R798J0039q949j96
12359A92977q253j332l304K65n702j0817l097n096J9184J1799j7531J0766K234
12346A82093r422J077K119P532l829j0350J3175J4340j8466k0752k233l814J048
$$ y = [1044751, 1020656, 997725, 958254, 921392, 897133, 873820, 854719, 839746, 826905, 811765, 798725, 783002, 755551, 727469, 705634, 677721, 658008, 647416, 623415, 585255, 552737, 545877, 525890, 493073, 471750, 458186, 463032, 461986, 457682, 452127, 458387, 458785, 449399, 441954, 424996, 421042, 418564, 407652, 396038, 383854, 379469, 356390, 341242, 326077, 313308, 314050, 312158, 302591, 311482, 310797, 318574, 318541, 306465, 290131, 288027, 285951, 291170, 287968, 269467, 257500, 253082, 260164, 257369, 256035, 262720, 245140, 223177, 208669, 211201, 192947, 185090, 182285, 192083, 202122, 193173, 192977, 184724, 183392, 180088, 180353, 174651, 163834, 160737, 155641, 174825, 186624, 169093, 179859, 182093, 172671, 173748, 175867, 183399, 179570, 169220, 182395, 196735, 178269, 157517, 155284, 151470, 152518]
12333A52518J8755L899j8571j6039J7215K6887m265j0378j9549p537K54J60P327
12320A50676N61l297L823O516O37k0962m873R299n69m40J722J0033Q719J175q272
12305A54748L84N031j2613o796R062k348j2195j4179n643p19J9179P652K134O40
12291A44337k782q00K503P324Q51k958m941q884j3239j8164j248J0464M019P17
12277A17199j744j3860k189p255j1127l443l365l859K964K304j3490P165p201
12264F2099o261Q450q434k235l64J1876J132N64j1417j7930j2999J225j957J1972
12250C5721L025p468J8967R36m089j994p380q563m894o616N502J4914J0342M250
12236E2653K42q109o632p65J2077N802p439k2594j5753k671J5955k247k629Q398
$$ y = [152518, 171273, 175172, 156601, 140562, 157777, 184664, 180399, 170021, 150472, 142935, 143189, 143349, 150676, 151237, 147940, 151763, 158279, 158916, 137954, 133081, 142380, 141811, 141371, 143093, 153126, 161845, 163020, 154748, 155132, 160163, 147550, 140754, 149816, 147468, 135273, 121094, 115451, 114732, 133911, 141563, 143697, 144337, 141555, 140755, 143258, 150582, 151433, 148475, 143534, 134650, 121411, 103247, 101999, 112463, 116482, 117199, 115455, 101595, 99406, 92151, 81024, 77581, 74216, 70357, 73321, 75625, 62135, 69300, 62099, 55838, 64288, 55854, 53619, 53255, 65131, 66263, 66827, 55410, 37480, 24481, 25706, 23749, 35721, 38746, 31278, 50245, 51181, 47092, 45098, 37718, 29155, 24261, 17645, 23147, 38061, 48403, 52653, 52895, 44786, 38154, 37389, 49466, 55268, 47829, 25235, 9482, 6811, 22766, 20519, 17890, 26288]
12222B6288J2355K1062k549j451k124j5945m604N114o104Q521P002L722L93j6743
12208C4937l909j917n161l570k251O004J3596Q278N665j0685K488M723r055r247
12194B9896J1578j6777j1670J1546J1675K3725J1082o041l640j0100J1374J0580
12182G3228k200O652m026J781K062n529o2Q674K2491N386j0014n131Q45m466l784
12167H5907n653j5972l64k515l83o954P541l124k680J7826J4683m540k207j237
12153H0328J0586j1283k4422j5209m810r030J932R010J0898Q804r332p2J2972
12140F0372J0885N161j296Q181m332j031M805n956r976L274l833N755O132r172
12126F8969J4137R936o87J1208J0716k662k985k917M582K1309K0660J4894K0382
$$ y = [26288, 38643, 59705, 57156, 55705, 53581, 37636, 33032, 38146, 32042, 40563, 47565, 51287, 51680, 34937, 31028, 29111, 23950, 20380, 18129, 24133, 37729, 46007, 51672, 40987, 43475, 48198, 39143, 29896, 41474, 24697, 13027, 24573, 36248, 59973, 71055, 65014, 61374, 51274, 62648, 73228, 71028, 77680, 73654, 75435, 77497, 71968, 71906, 80580, 103071, 108457, 98443, 93312, 94157, 89691, 85907, 80254, 64282, 63918, 61403, 61020, 54066, 61607, 58483, 55803, 73629, 88312, 83772, 81565, 80328, 90914, 79631, 55209, 40000, 35190, 26160, 28092, 37102, 48000, 56804, 47472, 47400, 60372, 71257, 76418, 75122, 83303, 78971, 77940, 82745, 76789, 66813, 70087, 66254, 72009, 78141, 68969, 83106, 93042, 92355, 103563, 114279, 111617, 108632, 105715, 110297, 131606, 152266, 167160, 187542]
12113A87542L6806L7550M6005O2307N5440M9564N5384N3556M3603O896J08k653
12101F32108P468K051q076j6616n784J758J8123M5842N9098R2103J44697K02575
12089A175347K75830L52649M36105M97203N22260M86592L99842K74480J13775
12080D534083n2700k28799l71729m63262m97107m79037m32823l49169k63643j84146
12070A211668j36001j03041q2595p9708n6396k9026l8674m7816k8835l5576l1804
12059E42196k5050k7887l0350q510l527j2611j2724p751M263J4186J5499o438
12047D41296j2107J856Q586j6657k7064k4253k5773k5553l2095j4797k0463j6330
12035B36646q181m811q349j5252l176M94r721j4986j3352j0706K131J354k1170
$$ y = [187542, 224348, 261898, 307903, 370210, 425650, 475214, 530598, 584154, 627757, 634653, 634761, 632108, 639576, 641627, 633551, 616935, 611151, 612909, 631032, 676874, 735972, 828075, 972772, 1175347, 1451177, 1803826, 2239931, 2737134, 3259394, 3745986, 4145828, 4420308, 4534083, 4481383, 4252584, 3880855, 3417593, 2920486, 2441449, 2008626, 1659457, 1395814, 1211668, 1075667, 972626, 890031, 810323, 753927, 724901, 686227, 638411, 609576, 574000, 542196, 517146, 489259, 458909, 450399, 446872, 434261, 421537, 413786, 418049, 432235, 447734, 441296, 429189, 431045, 439631, 422974, 395910, 371657, 345884, 320331, 288236, 273439, 252976, 236646, 228465, 223654, 215305, 200053, 196877, 197371, 187650, 172664, 159312, 148606, 150737, 152091, 130921]
12022A30921L955J1534K857J0706j1055k1855j4634L496K256k0594m269J3481
12010A06799k953M455n764O433q024q93j04N450q358j2699k3577M642P67n684
11996F0490J2036K241J2996J2579q981k3331j6349J1419P730J1093q757l707l663
11983F5796j3310M212P458Q224k922k591J1264J0925O571q731j1847j0334j1730
11970E2985m555Q978K443M303r395p011L623O485P682j0872k119k513n307m376
11956D0351j3464j6280J1010L891o729P198R615J0657J1532j086j0875l008j732
11943D1080j102O343J3157M496n246j2231N615R569n004j0480J0579J6247K090
11930G5113k3810j1373J4137R580n290j7254k1090J1039Q996O921O436m186j6467
$$ y = [130921, 134876, 146410, 149267, 159973, 148918, 127063, 112429, 115925, 118181, 97587, 93318, 106799, 103846, 108301, 102537, 108970, 100946, 100053, 99949, 105399, 97041, 84342, 60765, 65407, 66174, 60490, 72526, 74767, 87763, 100342, 91361, 68030, 51681, 63100, 70830, 81923, 73166, 69459, 65796, 52486, 56698, 64156, 72380, 69458, 66867, 78131, 89056, 95627, 86896, 75049, 64715, 52985, 48430, 57408, 59851, 64154, 54759, 47748, 51371, 57856, 65538, 54666, 52547, 50034, 44727, 40351, 26887, 10607, 21617, 25508, 18779, 25977, 35592, 46249, 57781, 56695, 45820, 42812, 41080, 39978, 46321, 59478, 63974, 58728, 46497, 52112, 61681, 56677, 46197, 56776, 73023, 75113, 51303, 39930, 54067, 63647, 58357, 41103, 20013, 31052, 40048, 46969, 53405, 49219, 32752]
11917C2752j0148l8R033N350J0065q277r390j026o256j1674k126O690O337J392
11903B2684J4531m097q248p198P261M265o548J295j819J0102J413j7972m159P287
11889A8797J049j3512m521q40J2909K612j1774r20j3918L550J4649K7839R600
11876D5520l911k970j8782j7170j1948K285J1327J3522N294j118q422k137Q993
11863B0483k680n099O887M085K310k926J872P05M59J261m426P356O08J117l140
11848B8872r77J3877m830j714l016O85L791M426j3524j1866J3257K642l060j7190
11834A1373j3958J3207R424N796o313j2219Q752J7319k438m855J516J445n12p802
11820B0735j0409J2043N285M693p110n576k031M248O213k043j2127p39l008l649
$$ y = [32752, 22604, 22566, 31599, 36949, 47014, 38737, 29347, 28321, 22065, 10391, 8265, 14955, 21292, 22684, 37215, 33118, 24870, 17672, 24933, 29198, 22650, 23945, 22126, 32228, 33641, 15669, 11510, 18797, 19846, 6334, 1813, 973, 13882, 16494, 4720, 3800, -10118, -6568, 8081, 35920, 45520, 41609, 38639, 19857, 2687, -9261, -6976, 4351, 17873, 23167, 22049, 13627, 11490, 20483, 17803, 12704, 19591, 23676, 25986, 23060, 24932, 25637, 26096, 27357, 22931, 30287, 30895, 32012, 28872, 27895, 41772, 36942, 35228, 32212, 32897, 36688, 41114, 27590, 15724, 28981, 31623, 28563, 11373, -2585, 10622, 20046, 25842, 19529, 7310, 16062, 33381, 30943, 26088, 27604, 29049, 28537, 20735, 10326, 22369, 27654, 32347, 25237, 19661, 17630, 21878, 28091, 26048, 13921, 13182, 10174, 6525]
11806F525n691n121o364O484r664O482J4232J520j5510P885J4168Q404R480j3057
11792A9773L642l551L259N967k542m216r910n724J6981M045m146k493J663K820
11778B5568L386L289k3095q239Q9J4642Q097q872j144J008K062J0771n769j7130
11764D663p331R734J2033P089J1413O032r010r538o279j4585N291K1630j3322
11751A7820k729j3454j9954J5216M478K655M749O05O825J233q547l88j162M245
11737A1592J989m207M555k025J4759O537j0857N729P105m194Q047L668p027j79
11723C5492m265j0100l566n949k111J2088J2043L765p675lj643r670j0240j516
11709F650K060J767j646o846j5544l951J8123O807J0397L338n359l146l866n094
$$ y = [6525, 834, -4287, -10651, -4167, -13831, -7349, 6883, 8403, -7107, 778, 14946, 23350, 32830, 19773, 23415, 19864, 23123, 29090, 26548, 22332, 12422, 6698, 23679, 27724, 23578, 21085, 22748, 25568, 28954, 32243, 9148, 909, 998, 15640, 23737, 14865, 13721, 14729, 16791, 27562, 21793, 4663, -2668, 7066, 19099, 26188, 37601, 43633, 34623, 25085, 18806, 4221, 9512, 31142, 17820, 15091, 1637, -18317, -3101, 1377, 4032, 8781, 9386, 16211, 17444, 8897, 8509, 7347, 11592, 13581, 9374, 13929, 11904, 26663, 33200, 22343, 28072, 35177, 30983, 39030, 42698, 35671, 35492, 31227, 21127, 17561, 11612, 9501, 21589, 33632, 37397, 29722, 29719, 28076, 18406, 8166, 6650, 8710, 10477, 8831, 1985, -13559, -17510, 613, 7420, 17817, 21155, 15796, 12650, 8784, 3690]
11695C690o814O816J9372n816j7655k887K764m263J3157R620L970p423o129J576
11681I978N272m333K075P912m174k765k114r064K863K399J2542N902k36l732l026
11666A9499j3169k543J1801P977p616k808N525J1134P000m737R684J2718P049
11653F1514j3452m241o34m968n542o067j5218N843P605L807R698K006r488L51
11639C1214p534k2269q437N024p203O569K079P09k763N194J5217Q598p341j655
11625A7402J2655N675j6555j185M65P362N276m165O38Q860k913K142p401m17J09
11610B7948o278m488M818j1575j1125Q858K023K034L340R56m153R677N792k42
11596B7585L611j5037n431o75n33J4661k820p527j2464J497R986N142M853J2024
$$ y = [3690, -3124, 3692, 23064, 17248, -407, -3294, -530, -4793, 8364, 17984, 21954, 14531, 8402, 9978, 15250, 10917, 12992, 20904, 16730, 13965, 11851, 2787, 5650, 8049, 20591, 26493, 26257, 22525, 19499, 6330, 3787, 15588, 23565, 15949, 13141, 18666, 29800, 36800, 32063, 41747, 54465, 61514, 48062, 43821, 43187, 38219, 32677, 26610, 11392, 17235, 24840, 28647, 38345, 40351, 30863, 31214, 23680, 1411, -7026, -2002, -9205, -2636, -557, 152, -2611, 2583, 17800, 26398, 19057, 17402, 30057, 35732, 19177, 17992, 18457, 25819, 31095, 26930, 27568, 36428, 33515, 35657, 28256, 27839, 27948, 21670, 17182, 22000, 10425, -700, 8158, 10181, 12215, 15555, 16511, 12358, 22035, 27827, 27585, 31196, 16159, 10728, 10053, 9520, 24181, 21361, 13834, 1370, 2867, 12853, 17995, 22848, 34872]
11582C4872L009q910r131J7619N88m246o859K935O983j202o421q544k436n30l223
11567A4504R478P831J0914P952k3367j4402l65J6341O36j6134K588J609r84K3610
11553D0211J9963j8603m205j108R282L336j2246q074M375Q930o291n324n133o478
11539A8635O766n128J1123J2469O044J791l385j210n159j0515p781N541R282o66
11525C7807l684J1068J1330J0012J6357K0505j917j5731j9345Q876J4157P32M290
11512I4457j9035q440R040K143r777j8055M586q23K216J2372m701j2662j4151
11499C7170k647Q187J2739L847k3281N60J3071K75k1905k0391N08J948J7937K5682
11485E3700J0590j3856q161m736L048Q331j3191Q576k675p890p564K956j293j0405
$$ y = [34872, 37881, 28971, 19840, 37459, 38047, 33801, 26942, 29877, 36860, 35658, 29237, 20693, 18257, 17727, 14504, 23982, 31813, 42727, 50679, 27312, 12910, 12545, 28886, 29522, 13388, 15976, 17585, 16601, 40211, 60174, 41571, 37366, 36258, 45540, 48876, 36630, 28556, 32931, 41861, 35570, 30246, 25113, 18635, 25401, 20273, 31396, 43865, 49909, 51700, 48315, 47105, 41946, 31431, 23650, 29191, 38473, 37807, 34123, 45191, 56521, 66533, 82890, 103395, 101478, 85747, 66402, 75278, 89435, 90167, 94457, 75422, 66982, 76022, 78165, 68388, 50333, 54919, 54096, 56312, 68684, 63983, 51321, 37170, 34523, 42710, 55449, 59296, 36015, 36575, 49646, 49921, 28016, 7625, 8133, 10081, 28018, 53700, 64290, 50434, 42273, 37537, 40585, 48916, 35725, 44301, 41626, 33736, 26172, 29128, 27835, 17430]
11471A7430n366J3117M383L10Q000m535o627J447M6J7733l355j6668O741r160
11457B3496k150m924J4678L222N154l349j0975j2906N037J5618K037M833o672
11444C3099q333N715O618N4M253M888k871L012M592M793p627r130M957R07j6679
11429B8248N78J5571K923N118r23j083L815R94k446m147J7503J4013P485K657
11415I0306q563k2036j6960L372m785J066L326J2612J1111L846k287m159J0637
11402G7486o852J5247L2761M0662L6842J7490P773O560L718N933J8960j0543m2379
11389B03658l9227j4436k487j877j5292k7978j2753l664K607J125L754J4817N484
11376A13731l52P699K4153K28j488Q604J700M265J3512O220J3278Q060J4950M4008
$$ y = [17430, 12064, 25181, 29564, 29874, 37874, 33339, 26712, 28159, 28205, 45938, 42583, 25915, 32656, 23496, 21346, 16422, 31100, 34322, 39476, 36127, 25152, 12246, 17283, 32901, 34938, 39771, 33099, 24766, 30481, 37099, 37153, 41406, 46294, 43423, 46435, 51027, 55820, 48193, 39063, 44020, 44927, 28248, 28826, 44397, 47320, 52438, 51515, 50432, 54247, 55241, 52795, 48648, 66151, 80164, 87649, 90306, 81743, 59707, 42747, 46119, 41334, 42400, 45726, 58338, 69449, 73295, 71008, 66849, 77486, 70634, 85881, 118642, 159304, 196146, 213636, 221409, 227969, 231687, 237620, 256580, 246037, 203658, 164431, 149995, 147508, 145631, 130339, 102361, 89608, 85944, 88551, 89676, 93430, 108247, 113731, 113379, 121078, 145231, 145459, 143971, 152575, 154275, 158540, 172052, 178272, 191550, 199610, 214560, 258568]
11362B58568M8845N8780M8478K7310J4166Q156k4154l6529m3708m6476l8401k1132
11350B53903l0323k9217l9567o741j62M064J1618N930N316J8513J6527j819P870
11337B15912l04J093O781p155j0505n496q261N473m877o071J687J8054K1787J7814
11323B45932J0720K0424O048K872p851k2280k3890j9361k0089j5987P25J8384
11311A95647J0946o61M144k212M133Q617p098j3436p747m89M843j5862k2330k887
11297A55608m699j0387k1125j5766j1125R739K1565O678j0670l811J6025J681
11285A33713n453j3462m274P356J3844o174j5404P041L182l363N051J36R234N973
11271A37400m218J619l342k3483j3146k6k735O861O331o939j1177l345o692K635
$$ y = [258568, 307413, 366193, 414671, 441981, 456147, 464303, 440149, 403620, 359912, 313436, 275035, 253903, 223580, 194363, 154796, 148055, 147893, 151957, 163575, 169505, 174821, 193334, 209861, 208042, 215912, 215608, 216701, 223482, 216327, 205822, 200326, 192065, 197538, 192661, 186590, 188277, 206331, 228118, 245932, 256652, 277076, 283124, 285996, 278145, 255865, 231975, 212614, 192525, 176538, 177263, 195647, 206593, 205932, 210076, 207864, 211997, 220614, 213516, 200080, 192333, 191844, 196687, 180825, 158495, 155608, 150909, 140522, 119397, 103631, 92506, 102245, 123810, 130488, 119818, 116007, 132032, 133713, 128260, 114798, 110524, 117880, 131724, 125550, 110146, 117187, 120369, 117006, 122057, 122193, 131427, 137400, 133182, 134801, 131459, 107976, 94830, 94804, 92069, 98930, 105261, 98322, 87145, 83800, 77108, 79743]
11257G9743m127j5425Q330q943J925J1887J3482O465p489J0914J6689M05K493
11244A16349k1345j4796j2983j082M556Q005P759j5330j32K0853j593n819o243
11231G8199M239L84L179M67j5023q721j853O86O616j135J1091O439M684r51j6265
11216G2036l603J3203j211k0227R787J4805J237J3434o678l087M113N760M240
11203A03809o964O236Q012O39M346K2702q779j0870p55O547P659J0708j8927k4018
11189A00345j1417j1744q719j0783n633J3150J1055J452K1942J8755R30q963j3457
11176I6913j192p409R11m737p032j3899Q608j248m91Q821K733J1343J0808K478
11162A06607j04O936P790R482q024J1030m898j3802n362j5069p397m539K258J3229
$$ y = [79743, 75616, 60191, 68521, 59578, 61503, 73390, 86872, 93337, 85848, 96762, 113451, 113856, 116349, 95004, 80208, 67225, 66143, 70699, 78704, 86463, 71133, 71001, 91854, 90261, 84442, 78199, 82438, 82822, 86001, 86468, 71445, 62724, 60871, 61557, 68173, 67038, 78129, 84568, 89252, 88301, 72036, 68433, 81636, 80425, 60198, 69985, 84790, 86027, 99461, 92783, 89696, 93809, 99569, 103809, 96845, 103081, 111093, 111732, 116078, 138780, 130001, 119131, 118376, 124923, 132582, 143290, 124363, 100345, 88928, 77184, 68465, 57682, 52049, 65199, 76254, 77706, 99648, 118403, 119333, 110370, 96913, 95721, 88312, 89223, 84486, 77454, 63555, 72163, 70915, 70424, 79245, 81978, 93321, 104129, 106607, 106503, 113439, 121229, 130711, 122687, 133717, 128819, 115017, 109655, 94586, 87189, 82650, 84908, 98137]
11148I8137J3777k483q472k745m31R525J285j8720r86n53M457q447j5267q367
11134F0710Q820J4153J099n742N663q5P432N904L399Q68J3049K715J607N738n671
11119A19659j1035L288J0207J697P34l514j8635m922L230R977N404k309J2804
11106A26585K3668J2082M076R347J1474j0045j4720R338j132p352q51m039q842
11093A49589L874L834R096J1581P165N758Q078L907L874L406j732n222m488k755
11079A95965j3379j2737r751J238n17P257K2507K5242J7214L2477L1270J8565
11067C15351K348R933J2898j661j4610o037k133l796R388J1823r359k1219J1253
11054C14179L317M704L868M240J2081J4894K3630K3036J4104J4346J3802j2293
$$ y = [98137, 111914, 109431, 100959, 98214, 97783, 107308, 108593, 89873, 88887, 88334, 92791, 84344, 69077, 60710, 69530, 83683, 84782, 79040, 84703, 84618, 92050, 97954, 101353, 102221, 115270, 117985, 119592, 125330, 119659, 108624, 111912, 122119, 123816, 124550, 121036, 102401, 97479, 100709, 110686, 116090, 113781, 126585, 150253, 162335, 166411, 175758, 187232, 177187, 162467, 171805, 170673, 163321, 162470, 158431, 149589, 153463, 157297, 166393, 177974, 185139, 190897, 198975, 202882, 206756, 210162, 208430, 203208, 198720, 195965, 182586, 169849, 160098, 161336, 160819, 168076, 190583, 215825, 233039, 265516, 296786, 315351, 317699, 327632, 340530, 338869, 324259, 318222, 316089, 312293, 321681, 333504, 324145, 302926, 314179, 317496, 322200, 326068, 330308, 342389, 357283, 380913, 403949, 418053, 432399, 446201, 433908]
11042D33908j833R597J1121N990O373P968J7519K3170K7716K6989L1315M3061
11030F42894K1088N2932Q6233J00214J41023J71514J91915J86850J60604J20916
11020A876183O4294j3433j07246j60144j78255j68643r6414n9478l7334j3940
11010A105590R968K2223K4744L0230M6380N8510M0721N4353O1901Q1929R7913
10999A634462J18699J37476J74132K04223K39794K66119L11021L72675M57568
10990C916169N90959Q07716J124402J599495K213926K999502L888136M737213
10982B1877518N180668M954135M016708K501614N57833j676590l755771n081420
10974B8574695n270740m513772l440712k434461j679542j167415q17683n56193
$$ y = [433908, 432075, 441672, 452793, 458783, 465156, 473124, 490643, 513813, 541529, 568518, 599833, 642894, 663982, 716914, 803147, 903361, 1044384, 1215898, 1407813, 1594663, 1755267, 1876183, 1940477, 1927044, 1819798, 1659654, 1481399, 1312756, 1216342, 1156864, 1119530, 1105590, 1115558, 1137781, 1162525, 1192755, 1239135, 1297645, 1338366, 1392719, 1454620, 1536549, 1634462, 1753161, 1890637, 2064769, 2268992, 2508786, 2774905, 3085926, 3458601, 3916169, 4507128, 5314844, 6439246, 8038741, 10252667, 13252169, 17140305, 21877518, 27058186, 32012321, 36029029, 38530643, 39088476, 37411886, 33656115, 28574695, 23303955, 18790183, 15349471, 12915010, 11235468, 10068053, 9250370, 8694177]
10966H694177l87596k84016j99263j40830q0890l3478K0165Q1123J61665K76118
10956H107175L76756M90015O40950Q49584J220874J807716K726142M040152N793828
10947B6053192P772229R466743J0209147R530818P423677M153699r1180m778568
10939F9739757q731383j0635934j0202928q294683o079899m241424k948065k071795
10931A6533646j529143j170775r25902p46166o06781n00324m29201l16965k56037
10922A0052352j82580j02443n1263k1185M9437J40721K73023M94333Q10635J274822
10912A2737852J936058K788953L651156M313602M466523L962711K866725J219882
10904C7943462p90512k885040m490029n072916m676160l732192k737756j930337
$$ y = [8694177, 8306581, 8022565, 7823302, 7682472, 7601582, 7568104, 7588269, 7669392, 7831057, 8107175, 8483931, 8973946, 9614896, 10464480, 11685354, 13493070, 16219212, 20259364, 26053192, 33825421, 43292164, 53501311, 63032129, 70455806, 74609505, 74518325, 69739757, 61008374, 50372440, 40169512, 31874829, 25794930, 21553506, 18605441, 16533646, 15004503, 13833728, 12907826, 12161660, 11554879, 11054555, 10625354, 10308389, 10052352, 9869772, 9767329, 9716066, 9694881, 9744318, 9885039, 10158062, 10652395, 11463030, 12737852, 14673910, 17462863, 21114019, 25427621, 29894144, 33856855, 36723580, 37943462, 37152950, 34267910, 29777881, 24704965, 20028805, 16296613, 13558857, 11628520]
10896A1628520j379611j001017p81232o42447n35364m50273l78890l50453l32453
10887E776780k95560k75411k27642j91691j73988j59048j36957j34723j38865
10878D042895j43997j70673j45400j37738j13129j01137j15230j20400j26462
10869B868729j20373j17142j09736r4816r2725p6946p9383q0118o4870n6470p2649
10858A903501o3936m3605o5611n5061l6671l6006m8654l5599l5042l4943l0521
10847A417852k5375l0337k7136l1092m3537m5148m9808m1837k6547j7151k1714
10836A058170k4944j1462k0125l9066l0468l0313j8417j4770l1428k2247j0039
10825H04891k1609j8175j9608j2439J2096J5059J7663L4693O7271R4870J30576
$$ y = [11628520, 10248909, 9247892, 8466660, 7824213, 7288849, 6838576, 6459686, 6109233, 5776780, 5481220, 5205809, 4978167, 4786476, 4612488, 4453440, 4316483, 4181760, 4042895, 3898898, 3728225, 3582825, 3445087, 3331958, 3230821, 3115591, 2995191, 2868729, 2748356, 2631214, 2521478, 2426662, 2333937, 2256991, 2177608, 2097490, 2032620, 1976150, 1903501, 1839565, 1795960, 1730349, 1675288, 1638617, 1602611, 1553957, 1518358, 1483316, 1448373, 1417852, 1392477, 1362140, 1335004, 1303912, 1260375, 1215227, 1165419, 1123582, 1097035, 1079884, 1058170, 1033226, 1021764, 1001639, 962573, 932105, 901792, 883375, 868605, 837177, 814930, 804891, 783282, 765107, 745499, 733060, 745156, 760215, 777878, 812571, 879842, 974712, 1105288]
10814A105288J49503J56716J30519Q5524K9696m1846j26830j69887j63807j42513
10804A012363j12637q5331n9906n9242n1328k1189j8484k2761l0846k6871k3068
10793E00700j1441j0402o632m710k3629j2374o896m966o032m20j9505j5333m214
10780C74146r737l846j4896J2717K746j5762K29o351j8662j5965j8319p080l208
10767B76012p416J0531K2390N552Q544Q526j2637j2458P763o524r327J1338P121
10754C09415P1J0128J1575Q776J6090K7441K4639J3355Q092R286r240j2161j7205
10741D00262N786N987m36k014j029J1204J5656J3487O059l809l322K2011K2975
10728D92817M0428N4369P7959J38873J73824K38706K69500K86596K61299K12248
$$ y = [1105288, 1254791, 1411507, 1542026, 1627550, 1657246, 1615400, 1488570, 1318683, 1154876, 1012363, 899726, 814395, 754489, 695247, 643919, 622730, 604246, 581485, 550639, 523768, 500700, 489259, 478857, 472225, 467515, 443886, 431512, 424616, 419650, 413618, 413198, 393693, 378360, 374146, 364409, 360563, 345667, 358384, 361130, 345368, 345597, 339246, 320584, 304619, 286300, 279220, 276012, 268596, 279127, 301517, 307069, 315613, 324139, 311502, 299044, 306807, 300283, 290956, 302294, 309415, 309486, 319614, 331189, 339965, 356055, 383496, 408135, 421490, 429582, 438868, 429628, 417467, 400262, 406048, 412035, 411599, 409585, 408556, 419760, 435416, 448903, 454962, 451153, 447831, 469842, 492817, 533245, 587614, 665573, 804446, 978270, 1216976, 1486476, 1773072, 2034371, 2246619]
10718B246619J30966K3525q3243j79883k33421k67543k56023j98856j77273j29310
10708H75558j01933p0418o4133m1943l6166l7717j6148j0027l493l031k0369j7385
10696D52795j1137l042k419p420q685k9195m892K051k0156j6752j8048j411p131
10683C24558m577r569m149l27J1177Q339N576q582k4514M923R162o808q537o408
10669B90264L945M565n741K519j650K175k069n762M657q264j1263N574L881l769
10655B79062p787K02J5156J5368O331K001Q042O414J2716P908j919j0689k915
10642C29890K212m887n696o349j2222j9830r542j2947N399J1540N217K783n614
10629B79954m99P767r008j9869J1073o052l1401j0091Q177J7071m874j70N397
$$ y = [2246619, 2377585, 2401110, 2317867, 2137984, 1904563, 1637020, 1380997, 1182141, 1004868, 875558, 773625, 703207, 639074, 597131, 560965, 523248, 507100, 497073, 493580, 490549, 470180, 452795, 441658, 438616, 436197, 428777, 420092, 390897, 386005, 388056, 367900, 351148, 333100, 331689, 324558, 319981, 310412, 306263, 305936, 317113, 325452, 331028, 322446, 297932, 302855, 312017, 305209, 296672, 290264, 294209, 298774, 293033, 295552, 293902, 296077, 294008, 288246, 292903, 284639, 273376, 278950, 282831, 279062, 271275, 271477, 286633, 302001, 308332, 310333, 318375, 324789, 337505, 345413, 343494, 332805, 329890, 332102, 327215, 321519, 315170, 302948, 283118, 273576, 260629, 266028, 277568, 282785, 285568, 279954, 279455, 287222, 278214, 258345, 269418, 263366, 231965, 221874, 230051, 247122, 242248, 242078, 247475]
10616B47475n360P985J5288j650o871J0805K0521J9584K6629J4607j2316p735
10604C28962j2220j2556p986j2500r921j581j4963j946K8390J8254l622N614K364
10591C06289J0208J6700J5288L732J4554K2312M8290M1220L2128L7727K1116J6574
10579E86138j0736k8254l0587m1950l4823k7131j007P019o747L522N52K481M729
10566D23206J1982J4332M1236N7869O4572P3218O4392N5439M2070M263j252j8212
10554H33115m2183l5975m6023l5315m4392n3990m1525k6404m7591l8889j9663
10543D01165J3808R374j7803j0727q363O804k07k4990o406k214j7241m741m217
10530C34242o85L057K0579K5789Q829M2160P3149J24932J78758J72100J33106
$$ y = [247475, 242115, 250100, 265388, 263738, 256867, 267672, 288193, 307777, 334406, 349013, 336697, 328962, 316742, 304186, 296200, 283700, 273779, 272198, 257235, 255289, 283679, 301933, 298311, 303925, 306289, 316497, 333197, 348485, 352217, 366771, 389083, 437373, 478593, 510721, 548448, 569564, 586138, 575402, 547148, 516561, 474611, 439788, 412657, 411650, 418669, 411922, 415444, 415996, 418477, 423206, 435188, 449520, 490756, 548625, 613197, 686415, 750807, 806246, 848316, 852579, 851327, 833115, 790932, 754957, 708934, 673619, 629227, 575237, 533712, 507308, 459717, 420828, 401165, 414973, 424347, 406544, 395817, 387454, 394258, 394051, 369061, 362655, 360441, 343200, 338459, 334242, 333557, 336614, 357193, 382982, 391811, 433971, 507120, 632052, 810810, 982910, 1116016]
10519A116016R4564N9570q781k9861q0316j04887q7392o1095m5027m2574j4454
10508G95763j4200k2602J519k272j1523J5983K2458L4160K7463J8400N43K027
10496H67719K0545q513j6831q917r008R316J9641K7646L2701L6315M1784L9724
10484A052122L0866R882Q971q810j1871p870j880q311j4640k5336j9776j8402
10472I84945j9353l03Q317N599L707L1343J7454L908J2866N509L443O533K1901
10459A085869L3634J3802J8070J7982J8912M2403K7552L4312N4181O9867N4256
10448A470840L6638M7913N3209L6138K2141L8198L6962J9566L5534L1573M1359
10437A870071O8191P3008P9530O8850Q0311J22862J89265K79485L93185L97882
$$ y = [1116016, 1210580, 1270150, 1261369, 1231508, 1151192, 1046305, 958913, 897818, 852791, 810217, 795763, 781563, 758961, 760480, 758208, 746685, 762668, 785126, 819286, 846749, 865149, 865692, 867719, 888264, 879751, 862920, 854003, 844995, 854311, 873952, 901598, 934299, 970614, 1012398, 1052122, 1082988, 1092870, 1101841, 1093031, 1081160, 1073290, 1071410, 1063099, 1048459, 1023123, 1003347, 984945, 965592, 965289, 973606, 979205, 982912, 1014255, 1031709, 1035617, 1048483, 1053992, 1057435, 1063968, 1085869, 1119503, 1133305, 1151375, 1169357, 1188269, 1230672, 1258224, 1292536, 1346717, 1416584, 1470840, 1507478, 1555391, 1608600, 1644738, 1666879, 1705077, 1742039, 1761605, 1797139, 1828712, 1870071, 1938262, 2011270, 2090800, 2159650, 2239961, 2362823, 2552088, 2831573, 3224758, 3622640]
10427C622640L41657L03778K62086J92025R7294O3888J20193K29283L00107L56346
10417E889297M20713N11858O05098O97424Q01590Q60151R29949J036120J156477
10408A2908677J298582J525286J907187K462093L219548M245559N686580P761300
10400D1014812J0804468J5134036K0770530K6633380K9701302K7262665K0603720
10393A91924913J2679712L111680j0889544k6442983l3073653k9116586k1751401
10386H6442138j5539345j1208255q281590o278948m915367l943353l221526k628582
10378C0425172k149322j779155j503186j314862j163332j041047r86828r15095
10370A9572345q02624o80565n92715n46989n10535n03570m90431m75300m56653
$$ y = [3622640, 3964297, 4268075, 4530161, 4722186, 4819480, 4883368, 5003561, 5232844, 5532951, 5889297, 6310010, 6821868, 7426966, 8124390, 8925980, 9786131, 10716080, 11752200, 12908677, 14207259, 15732545, 17639732, 20101825, 23321373, 27566932, 33253512, 41014812, 51819280, 66953316, 87723846, 114357226, 144058528, 171321193, 191924913, 204604625, 207716305, 196826761, 170383778, 137310125, 108193539, 86442138, 70902793, 59694538, 51412948, 45134000, 40218633, 36275280, 33053754, 30425172, 28275850, 26496695, 24993509, 23678647, 22515315, 21474268, 20487440, 19572345, 18769721, 18089156, 17496441, 16949452, 16438917, 15935347, 15444916, 14969616, 14512963]
10361A4512963m29244l99022m28430m32799m20105m03154l62395l19957l01305
10352A1016552l06187k72769k45321k32138k16174j89554j49284j06316n1752
10343I247057J7153P0341J15046J32924J51072J53183J71479K01374K25802L09634
10333A0795065M99375Q76293J432310K147653K889937L221323K871807K220666
10325B6954429J608714O94972q44275k312779k285609j174443r483P35936J167229
10316B4534691J440195J605792J748756J972947K597726L867769N792743Q569935
10308E2130554J2773391J9491873L0350236M6642694O5799154P8004364P3206520
10301C78398786N5403884L6830856J5685060k0110046o8209420r2875107q1064786
$$ y = [14512963, 14083719, 13684697, 13256267, 12823468, 12403363, 12000209, 11637814, 11317857, 11016552, 10710365, 10437596, 10192275, 9960137, 9743963, 9554409, 9405125, 9298809, 9247057, 9264210, 9334551, 9449597, 9582521, 9733593, 9886776, 10058255, 10259629, 10485431, 10795065, 11294440, 12170733, 13603043, 15750696, 18640633, 21861956, 24733763, 26954429, 28563143, 29258115, 28413840, 26101061, 23815452, 22641009, 22631526, 23367462, 24534691, 25974886, 27580678, 29329434, 31302381, 33900107, 37767876, 43560619, 52130554, 64903945, 84395818, 114746054, 161388748, 227187902, 305192266, 378398786, 433802670, 470633526, 486318586, 466208540, 397999120, 305124013, 224059227]
10294B24059227n5401090l5178974k3092970j6014224j1613537q740595o799756
10287F7218081n402263m315233l506181k925266k579850k446243k435542k418139
10279D1189364k242865j959891j698736j452196j264167j168725j130533j117182
10271B9155069j096190j035396r64289r23493r21807r48267r73283r68338r43905
10262B0380101r13283q68298q01129p25020o51673o24704o04511n86077n50996
10253A4054410n20776n01492m98965m69942m30782l93446l36496l14452k87844
10244A0300215k75750k74484k88540k59877k62644k49396k44916k38977k45215
10235G960416k43695k23702j96503j75819j72043j81699j91458j62417j58460
$$ y = [224059227, 168658137, 133479163, 110386193, 94371969, 82758432, 74017837, 67218081, 61815818, 57500585, 53994404, 51069138, 48489288, 46043045, 43607503, 41189364, 38946499, 36986608, 35287872, 33835676, 32571509, 31402784, 30272251, 29155069, 28058879, 27023483, 26059194, 25135701, 24213894, 23265627, 22292344, 21324006, 20380101, 19466818, 18598520, 17797391, 17072371, 16420698, 15795994, 15191483, 14605406, 14054410, 13533634, 13032142, 12533177, 12063235, 11632453, 11239007, 10902511, 10588059, 10300215, 10024465, 9749981, 9461441, 9201564, 8938920, 8689524, 8444608, 8205631, 7960416, 7716721, 7493019, 7296516, 7120697, 6948654, 6766955, 6575497, 6413080, 6254620]
10226F254620j75867j62993j62593j51672j53560j55249j38692j41432j41880
10217D870682j27373j18483j11891q7747p1365n9216m8159m2396l1856j6613l9781
10206D115802l1188l1860j9672M342j069P226K9385J02624J87174L00958M42014
10195E105736O80129J026051J529409K138177K559812K460251J938695J258652
10187A8696912L95954q41314k328926l119660k827044k080576j406557r54734
10179E534055o75852n11099l75432k50835j17607K532Q4860Q2103N4385j4266
10169C812844p0633j33525j98081k24410k01861j66832j49427j39076j33551j22323
10159B273125j03391p5043o0107n4260o1211n1159m2013k7298m1664m9312l3701
$$ y = [6254620, 6078753, 5915760, 5753167, 5601495, 5447935, 5292686, 5153994, 5012562, 4870682, 4743309, 4624826, 4512935, 4425188, 4353823, 4294607, 4246448, 4204052, 4172196, 4155583, 4115802, 4084614, 4052754, 4033082, 4037424, 4036355, 4043581, 4072966, 4175590, 4362764, 4663722, 5105736, 5785865, 6811916, 8341325, 10479502, 13039314, 15499565, 17438260, 18696912, 19092866, 18251552, 15922626, 12802966, 9975922, 7895346, 6488789, 5534055, 4858203, 4347104, 3971672, 3720837, 3603230, 3605762, 3690622, 3772725, 3827110, 3812844, 3742211, 3608686, 3410605, 3186195, 2984334, 2817502, 2668075, 2528999, 2395448, 2273125, 2169734, 2094691, 2034584, 1980324, 1919113, 1867954, 1825941, 1798643, 1756979, 1707667, 1673966]
10148A673966m5901m3332l1789j1975k1980k9456k3334l9509j6222l0852n1347
10137A328269o6249n5342l7147l1988l0780k7162K00j4035k2944j7743l0216m2325
10125I52538m5962k3901j6506k1809j6096j3588j4314k1423k4927j9625j708j915
10113G30764L561J8865J6326J4314M889L027r56k6330k6963k5837j6470l2305
10101F62885j9157j0546r583O307q16l6J8981N822m81J262j6056j7551p345k9533
10087E84153k3079j7353m290o419q3J6694K2007L745J446j1330j5766j2126m785
10074E32814R336J5551Q288r352j0372q909P493J7325o906N644J0283J3479J0256
10061E94930n90j2175k1398j3345m387l30j0164k0202l869L912p167j6461q505
$$ y = [1673966, 1628065, 1584733, 1552944, 1540969, 1518989, 1489533, 1466199, 1426690, 1410468, 1379616, 1328269, 1262020, 1206678, 1169531, 1137543, 1106763, 1079601, 1079801, 1065766, 1042822, 1025079, 994863, 952538, 906576, 882675, 866169, 844360, 828264, 814676, 800362, 778939, 754012, 734387, 732679, 730764, 734325, 753190, 769516, 783830, 788719, 791746, 790790, 764460, 737497, 711660, 695190, 662885, 643728, 633182, 623599, 629906, 629090, 629054, 648035, 653857, 653376, 654638, 638582, 621031, 613686, 584153, 561074, 543721, 539431, 533012, 532929, 549623, 571630, 575375, 576821, 565491, 549725, 537599, 532814, 542150, 557701, 565989, 556637, 546265, 537356, 544849, 562174, 555268, 560912, 571195, 584674, 594930, 594340, 582165, 560767, 547422, 543035, 542705, 532541, 512339, 508470, 512382, 505215, 488754, 480249]
10048D80249q486j5528k5877k4783q809j1556K493j074j2677r118p958k081j3533
10035C41262j7012k3717j6317o882n473k5172k4390j2186J120P275Q788J4047
10023B41343P14r977r279n90O51n230o036L289J5479J5690M769r470M824j60m945
10008B41072k246o620m946r958O33J283L5607L558j0482Q792R34k6432l6187j7095
9994A77913m36o546n5P488J8732N336K173n599J6517J7773J3987O363K4649K5736
9980C04031J6424J9937K6845L4805O0349P9531J00975J23211J40204J44119R5088
9969A145519L2890J0993n6852j23245j56663j36612j06122p7052n1457l4212n8999
9958C88188m6560o131l042k014j264p657p353r177j1321j1439N928N897k720k8515
$$ y = [480249, 471763, 456235, 430358, 405575, 396766, 385210, 387703, 386629, 373952, 364834, 356876, 354795, 341262, 324250, 300533, 284216, 277334, 271861, 246689, 222299, 210113, 211233, 218508, 227296, 241343, 242057, 232080, 222801, 222211, 222862, 217632, 211596, 214885, 230364, 246054, 250823, 241353, 246177, 246017, 241072, 238826, 232206, 227260, 217302, 217935, 219218, 254825, 258383, 247901, 256693, 257627, 231195, 195008, 177913, 177477, 170931, 170876, 178364, 197096, 202432, 204605, 199006, 215523, 233296, 247283, 253646, 278295, 304031, 320455, 340392, 367237, 402042, 462391, 541922, 642897, 766108, 906312, 1050431, 1145519, 1178409, 1189402, 1132550, 1009305, 852642, 716030, 609908, 532856, 481399, 447187, 388188, 341628, 335497, 332455, 330441, 329177, 321520, 314167, 304990, 293669, 282230, 288158, 294055, 291335, 262820]
9944B62820r636M150P700l994j2395j1930q982k3470m940m805P223L033q435j0295
9930A86044J1145J3043K998j771R187M271J6175J3127J8014J1733k2095q170j3259
9917B40442k2805j3556K319J1289k169q48N453j1039L057P279K706J7342J6147
9904B55617J7840J5194L1395K975q788Q654P349n244k2425j0923J1025J4057K847
9891C19573k614O462O083J9591L8262N0118O9685R1282J18681J78953K19012K49823
9879A364911K77653K58606K19363J41290O3060n4216j65765k41580k73910k60853
9869A328559k23593j78867j51623r6491p7484n8878m4121l1455j8854j5099j8172
9858D13922j4984j7510k819L510n082K49q454j9349j5636q251j2886l557r2m596
$$ y = [262820, 253184, 257334, 265034, 261040, 248645, 236715, 227733, 204263, 199323, 194518, 201741, 204774, 196339, 186044, 197189, 210232, 213230, 211459, 220646, 224917, 241092, 254219, 272233, 283966, 261871, 253701, 240442, 217637, 204081, 206400, 217689, 215520, 214672, 220125, 209086, 212143, 219422, 222128, 239470, 255617, 273457, 288651, 320046, 323021, 314233, 322887, 330236, 324992, 302567, 291644, 302669, 316726, 319573, 316959, 323421, 329504, 349095, 387357, 437475, 507160, 598442, 717123, 896076, 1115088, 1364911, 1642564, 1901170, 2120533, 2261823, 2324883, 2270667, 2104902, 1863322, 1589412, 1328559, 1104966, 926099, 774476, 677985, 600501, 541623, 497502, 466047, 447193, 432094, 413922, 398938, 381428, 378609, 382119, 377037, 377286, 368832, 349483, 333847, 325596, 312710, 309153, 309061, 304465]
9844C04465n7R87M978q252j0382j8370n141J2842k745n810J2114J2694J8390j048
9830C14665k4132J6358K3917j2290r21k09j3670k3482k6055l282O432j283L676
9817B59724N252J0363J5496j151k0810n063M975M734q114j6327J029N589K893
9804B58590J827J184R363m124r549L974K384J363Q268M585p905Q930K993K860
9790B84743o323r600K11J865P365K243r23N228M067J952P784k3539j0646P8j0899
9775B53606j0463J6913J8317J5143J2149R356j353R146M982J2878J4030m479m361
9762C45864O176P019l768k6751j8982J389N19M320L224L386J7281K607K546J7536
9748C62366K7867K9841L364R501L0257K8248P383j2307k0584k9865j5196j2444
$$ y = [304465, 304408, 305395, 310373, 302121, 291739, 273369, 268228, 281070, 278325, 272515, 284629, 297323, 315713, 314665, 290533, 306891, 330808, 318518, 317597, 317388, 303718, 280236, 254181, 250899, 257331, 256048, 259724, 264976, 275339, 290835, 289684, 268874, 263811, 268786, 273520, 265406, 249079, 250108, 255697, 258590, 260417, 261601, 270964, 266840, 257291, 261265, 263649, 265012, 273280, 277865, 269960, 278890, 281883, 284743, 278420, 268820, 269031, 270896, 278261, 280504, 279581, 284809, 288876, 290828, 298612, 275073, 264427, 264505, 253606, 243143, 260056, 278373, 293516, 305665, 315021, 313668, 322814, 327796, 340674, 354704, 350225, 345864, 352040, 359059, 355291, 328540, 309558, 310947, 311466, 315786, 319010, 322396, 339677, 342284, 344830, 362366, 390233, 420074, 423438, 432939, 463196, 491444, 498827, 486520, 465936, 436071, 420875, 408431]
9736D08431r57k0642j899J2296k942Q25j1889K870r594j2155M518O496Q752j0230
9722C73880q025j4307K1980o26l056O108n477j0549J1303M389k667J0354J0038
9709C93345Q235r46m25L701l64Q659N340n918l057J0252J560Q615o748L720K897
9694D28866L531o24k443K02j1627m758M556O6N680Q287J2331q43r143p555l657
9679D22869J4428J2422o063J0005O554n550R556N728l540R61J1844j358j5194
9666D62662k86J2300o92J87P242J0843J0874Q597o096M082M554j2001L110R318
9652E14694J6399O867k170Q276k342R921J2467O320M543M341J0799N759n827J3605
9638F03652J0672j670J4780K6185O003n895j249J9765M560j2636r697L141J2705
$$ y = [408431, 407474, 386832, 384933, 397229, 394287, 395112, 383223, 386093, 376499, 364344, 368862, 375358, 384110, 373880, 365855, 351548, 373528, 372902, 369846, 375954, 370477, 359928, 371231, 375620, 372953, 383307, 393345, 401580, 400634, 400209, 403910, 403546, 412205, 417545, 411627, 408570, 418822, 420382, 428997, 422249, 425969, 428866, 432397, 431773, 429330, 429532, 417905, 413147, 417703, 417769, 423449, 431736, 444067, 443224, 434081, 426526, 422869, 437297, 449719, 443656, 453661, 460215, 454665, 464221, 469949, 466409, 467370, 479214, 477856, 462662, 462376, 474676, 473984, 474171, 481413, 492256, 503130, 511727, 505631, 509713, 514267, 502266, 505376, 514694, 531093, 537960, 535790, 544066, 541724, 551645, 564112, 570432, 574975, 579316, 590115, 595874, 590047, 603652, 614324, 612654, 627434, 653619, 659622, 653727, 652478, 672243, 676803, 664167, 654470, 657611, 670316]
9625F70316J1970J3568M237J3687R890P599Q941l172N205K0311R112L032K411
9612G77107O146J4887Q720J0220J1500k619J2983J4673M989Q23L914m874J1629
9599H70098J4041J2392N723L972l65J3869K2224J9406J0599J1398J2866J185J0562
9586A007970K1762J6354n422P013J0948K0503K1845J8294J3500J5911M133K0352
9574A173163K1226J7978J3991J2294J9412J3555R874q373J9320K4680J9535K3203
9562A359858K4233K4678J0177L601J4543K1685K2135K8090L1345L3446K6667N183
9550A605641O004J3036L6692M0667K3606L2413J4871K0369J0161K4600K5476L1496
9538A885032K9455J2885J2790K8587L5998L0757K0199L2078K3058L9002M0520
$$ y = [670316, 682286, 695854, 700091, 713778, 723668, 731267, 740208, 737036, 742241, 762552, 771664, 774696, 777107, 783253, 798140, 806860, 817080, 828580, 825961, 838944, 853617, 858606, 859429, 863343, 858469, 870098, 884139, 896531, 902254, 906226, 905861, 919730, 941954, 961360, 971959, 983357, 996223, 997408, 1007970, 1029732, 1046086, 1040664, 1047677, 1058625, 1079128, 1100973, 1119267, 1132767, 1148678, 1152811, 1173163, 1194389, 1212367, 1226358, 1238652, 1258064, 1271619, 1281493, 1273120, 1292440, 1317120, 1336655, 1359858, 1384091, 1408769, 1418946, 1422547, 1437090, 1458775, 1480910, 1509000, 1540345, 1573791, 1600458, 1605641, 1611645, 1624681, 1661373, 1702040, 1725646, 1758059, 1772930, 1793299, 1803460, 1828060, 1853536, 1885032, 1914487, 1927372, 1940162, 1968749, 2004747, 2035504, 2055703, 2087781, 2110839, 2149841, 2190361]
9527B190361J7675L1553M0522M4104K0861J3810L9344M7230M6963L1251L0016
9516B553690M0463L1269M5623L4552M4272N7760M7519L7888M6796L5605L0328
9505C005765M1801O0036N8694M8869M6987M0484M1605M8404N4156M5724M5632
9494C538157N4337M3757N2319M5685M8104N5291O1939O9512O1990N9263M7662
9483D138016N2894N9300O1551N6175N3143N3738N1568N8759O4710O5871N4846
9472D770571N0572M5976N6297M1792N5186M5767M4107N3692M4799M5551M6255
9461E300565N0769N5573M5465L3637L1724L5299L5320L1319J8648L4714K7097
9450E700130J3760K5648L8091K0311k664o052J8315J5044J106J361M866N20p227
$$ y = [2190361, 2208036, 2239589, 2280111, 2324215, 2345076, 2358886, 2398230, 2445460, 2492423, 2523674, 2553690, 2594153, 2625422, 2671045, 2705597, 2749869, 2807629, 2855148, 2893036, 2939832, 2975437, 3005765, 3047566, 3107602, 3166296, 3215165, 3262152, 3302636, 3344241, 3392645, 3446801, 3492525, 3538157, 3592494, 3636251, 3688570, 3734255, 3782359, 3837650, 3899589, 3969101, 4031091, 4090354, 4138016, 4190910, 4250210, 4311761, 4367936, 4421079, 4474817, 4526385, 4585144, 4649854, 4715725, 4770571, 4821143, 4867119, 4923416, 4965208, 5020394, 5066161, 5110268, 5163960, 5208759, 5254310, 5300565, 5351334, 5406907, 5452372, 5486009, 5517733, 5553032, 5588352, 5619671, 5638319, 5673033, 5700130, 5713890, 5739538, 5777629, 5797940, 5795276, 5789224, 5807539, 5822583, 5823689, 5825050, 5829916, 5830436, 5823209]
9437E823209q598j5734p957j2473j6441j9356k2271j6334k8762j8085l1648l5038
9425E590512m1619k9656l3333l3027k2907m6785n3276l5125l7884n2813m6475
9414E157612m3005m2219o0553n7344m5774l0978l3040m1096o0735n2226m6659
9403D643983n8239n5297m6532m7331n0298n9197n7902n5769m9595n1639n8043
9392D054141n5769m1079l9332o5507m5896m2568n8601n5621m8792k9091m5990
9381C525895n8363n1466l8617n1666n0435n5500l6101m3388l5538l6991l3031
9370C034799m8478o9358l5914k4747m4457l2367l1793l0139m0617l4238l0007
9359B612684k7988n3330m6726k0689k7812m5713m8981l4166l9614m0957m0486
$$ y = [5823209, 5814611, 5798877, 5790920, 5778447, 5762006, 5742650, 5720379, 5704045, 5675283, 5657198, 5625550, 5590512, 5548893, 5519237, 5485904, 5452877, 5429970, 5383185, 5329909, 5294784, 5256900, 5204087, 5157612, 5114607, 5072388, 5011835, 4954491, 4908717, 4877739, 4844699, 4803603, 4742868, 4690642, 4643983, 4585744, 4530447, 4483915, 4436584, 4386286, 4327089, 4269187, 4213418, 4163823, 4112184, 4054141, 3998372, 3957293, 3917961, 3852454, 3806558, 3763990, 3705389, 3649768, 3600976, 3571885, 3525895, 3467532, 3416066, 3377449, 3325783, 3275348, 3219848, 3183747, 3140359, 3104821, 3067830, 3034799, 2986321, 2916963, 2881049, 2856302, 2811845, 2779478, 2747685, 2717546, 2676929, 2642691, 2612684, 2584696, 2531366, 2484640, 2463951, 2436139, 2390426, 2341445, 2307279, 2267665, 2226708, 2186222]
9348B186222l1083k2895j8139l5301k3103j2580j9254k9361j6920k4415k3145
9337A930026l3646k8533j1284j9313j7778l7939l4751k6545j6620j9994k1692
9326A661931j9486k0444k2582l2351j5551k4287j7232k4342j0630j9335k5877
9315A429814j1362j6820j4588j0375q578j3019j6846j4097j0309j0182j3516l5401
9303A254721j8026j6338k4627k6103j0505N79n555j7916j0149k2406j0500r22
9291A092253j2956j2854j0004l06k7279j7493p035m661j9450j0827r204j5568
9279I44616q097j37n999r752j2191j3147r006m557m853j1108j0141j9207j6909
9266H19512n291j8214j6912K144Q075j154l626l535j1855j1718q871j6175l028
$$ y = [2186222, 2155139, 2132244, 2114105, 2078804, 2055701, 2043121, 2023867, 1994506, 1977586, 1953171, 1930026, 1896380, 1867847, 1856563, 1837250, 1819472, 1781533, 1746782, 1720237, 1703617, 1683623, 1661931, 1642445, 1622001, 1599419, 1567068, 1551517, 1527230, 1509998, 1485656, 1475026, 1455691, 1429814, 1418452, 1401632, 1387044, 1376669, 1368091, 1355072, 1338226, 1324129, 1313820, 1303638, 1290122, 1254721, 1236695, 1220357, 1195730, 1169627, 1159122, 1159701, 1154146, 1136230, 1126081, 1103675, 1093175, 1092253, 1079297, 1066443, 1056439, 1056133, 1028854, 1011361, 1004326, 999665, 980215, 969388, 960184, 944616, 936519, 936382, 930383, 920631, 908440, 895293, 886287, 881730, 876877, 865769, 855628, 836421, 819512, 814221, 796007, 779095, 781239, 789314, 788160, 784534, 780999, 769144, 757426, 748555, 732380, 729352]
9253G29352j2677o096l664o908j7447l889K89m527k1490k8537L244N914j450r366
9239F22748j6579n667j4013Q739K301k219l891o08R64J869r029j3685j4185q459
9225E48286O105j2345R92j3541l095J7227K175p309k6139M573K145n761p549j2103
9211D93661J176j2708q197j612r485J725n247j1565j100p71j1759J3394N178p359
9197D45331r861m02Q578Q28p312m560k767o139j6327j3197k984o078J1281J1843
9183D08234k718q163j1515j6866j1591j921L685K833r363o311n933O649K0035
9170C67055R750m321j9115j2507j0726N923j727j9718j6020N218q279M498K856
9157C02887l556R694P196O0o964j3783j387Q83k407o221L791R155n753q184o017
$$ y = [729352, 716675, 710579, 706915, 700007, 682560, 678671, 678960, 674433, 652943, 624406, 627650, 633564, 632114, 622748, 606169, 600502, 586489, 595228, 597529, 595310, 591419, 590811, 591775, 593644, 584615, 570930, 556745, 548286, 554391, 542046, 543038, 529497, 526402, 543629, 545804, 538495, 512356, 516929, 519074, 513313, 505764, 493661, 494837, 482129, 473932, 472320, 462835, 464560, 459313, 447748, 446648, 445877, 434118, 447512, 452690, 445331, 435470, 435068, 443646, 444474, 437162, 432602, 429835, 423696, 407369, 394172, 391188, 385110, 396391, 408234, 405516, 397353, 385838, 368972, 357381, 355460, 359145, 361978, 352615, 346304, 340371, 347020, 367055, 376805, 372484, 353369, 340862, 330136, 336059, 334332, 314614, 298594, 303812, 295533, 300031, 302887, 299331, 309025, 316221, 316281, 309317, 295534, 294147, 295030, 292623, 286402, 290193, 299348, 293595, 285411, 279394]
9142B79394l492L774J455j645k646l271k744j1075m646o246N578l820q147K0529
9128B62998J3403l626j1793j4664j1772R583K183k977q958n451j116R155O743
9115B43708R739k611j1093P144l0m952j2685p564n442o157m315l996J625q867
9101A94504o917r131P246J1612L066J4482J2731l650j1817o646Q996m741m092
9088B05643m326K542J5327r817l534J5493j0208p336l535k347o074L713J3946
9075B09487j0375k0254j7516J053J0000K578L75Q307J830L738j6077k256k053
9062A68837k640N582P12j2767j1800l362K516O908K866J044O486j1176j1883j459
9048A39864J4475M020o303p289p95Q982j7590L541K1449j0389p349q295J3474
$$ y = [279394, 275902, 279676, 281131, 279486, 276840, 273569, 270825, 259750, 255104, 248858, 254436, 250616, 242469, 262998, 276401, 272775, 260982, 246318, 234546, 244129, 246312, 243335, 234377, 228926, 227810, 236965, 243708, 253447, 250836, 239743, 246887, 246857, 241905, 229220, 221656, 216214, 210057, 205742, 201746, 203371, 194504, 187587, 178456, 185702, 197314, 200380, 214862, 227593, 223943, 212126, 205480, 214476, 209735, 205643, 201317, 203859, 219186, 209369, 205835, 221328, 211120, 203784, 200249, 197902, 191828, 195541, 209487, 199112, 178858, 161342, 162395, 172395, 174973, 175348, 183655, 185485, 189223, 173146, 170890, 168837, 166197, 171779, 172491, 159724, 147924, 144562, 147078, 153986, 156852, 157896, 164382, 153206, 141323, 139864, 154339, 158359, 152056, 144767, 143972, 152954, 135364, 138905, 160354, 149965, 142616, 134321, 147795]
9035A47795L554j620k638J5091J4161m144k3307j2473j602M563j6466l810N631
9022A24735J7955L361j0110j1761M110Nq363l583J7911l512j3127j3811L396J122
9008A08328J4321J4866J0765J1210o905k0084j9633o286J0076J0214k846r92n862
8995A17172k700j0009n337M173j018P02j958k72N970l701m870o545P759p53O488
8980A05101j2477R202J3191K091n253k326j1865m739Q935M70k439K933Q608Q603
8966A20035m38q275l930j1242J0116r648j1575P199J1183p125m103p07O86o510
8952H5666o252J8094J6748r510j9013M082J0246r417n936O451L747m446O405Q143
8938A05008j1565O459J1856N015o262j7297j7097K182O66J5215M701j4312r929
$$ y = [147795, 151349, 149729, 147091, 162182, 176343, 172199, 148892, 136419, 134817, 139380, 122914, 119104, 124735, 142690, 146051, 135941, 124180, 128290, 128295, 119932, 116349, 134260, 130748, 117621, 103810, 107206, 108328, 122649, 137515, 148280, 159490, 152585, 132501, 112868, 106582, 116658, 126872, 124026, 123034, 117172, 114472, 104463, 99126, 103299, 102281, 102983, 101025, 100753, 106723, 103022, 98152, 91607, 99366, 98613, 105101, 92624, 101826, 115017, 117108, 111855, 109529, 97664, 92925, 101860, 102330, 99891, 102824, 111432, 120035, 119597, 111322, 107392, 96150, 106266, 96618, 85043, 92242, 103425, 96300, 92197, 91490, 92176, 85666, 79414, 97508, 114256, 104746, 85733, 89815, 100061, 90644, 84708, 91159, 94906, 90460, 96865, 105008, 93443, 99902, 111758, 116773, 110511, 93214, 76117, 78299, 78965, 94180, 98881, 84569, 74640]
8925G4640N176Q136L96r987j0437J1897N995n280p521O802l911m077r79J0146
8911H0996J994M367J045j0464n325l870M593k192r167r438K566J0857j357J5269
8897G9874P384n548j2775j1937O644N950L240M441m335M068P759k667p471p992
8883F6635q115J053K281J2267j473q856N615J8811r280j4674j1484k087J971n700
8869D6964J1634Q619j1350k215M818J0479J3070q562j1695N713P235j4890n934
8856E3886M131J399r167L708J551r137j2534K799J7722N450n981O08M146M886
8842F3467p057n329J0510J0942k069K046K047l801o463j1142j345J9591R275j6790
8828F3882j1989j0343m099Q900J5884j561q206m344m859J0591J0003K6683J1254
$$ y = [74640, 79816, 87952, 88348, 78361, 67924, 79821, 85816, 80536, 73015, 79817, 75906, 71829, 70850, 80996, 82990, 87357, 88402, 77938, 72613, 68743, 73336, 71144, 61977, 52539, 55105, 65962, 64605, 79874, 87258, 81710, 68935, 56998, 63642, 69592, 72832, 77273, 72938, 77006, 84765, 82098, 74627, 66635, 58520, 59573, 61854, 74121, 72648, 63792, 69407, 88218, 78938, 64264, 52780, 50693, 52664, 46964, 58598, 67217, 55867, 53652, 58470, 68949, 82019, 73457, 61762, 67475, 74710, 59820, 53886, 58017, 59416, 50249, 53957, 55508, 46371, 33837, 36636, 54358, 59808, 53827, 54435, 58581, 63467, 56410, 51081, 61591, 72533, 70464, 72510, 74557, 70756, 64293, 53151, 51806, 71397, 80672, 63882, 51893, 41550, 37451, 46351, 62235, 60674, 52468, 48124, 43265, 53856, 63859, 90542, 101796]
8815A01796j6704k8233N6k298k367o29l627L389k597N31R244L863K539k0025n92
8800D4346o769R659J2874J440l675o599l241J0324j5328K337L28J058P486k749
8786E1491K28j129l633N946Qr574J3085k276p694j4979J0916L0642k199m958q095
8771E7779j5205j2459L930J7065J0613j035P287l490r471m634J575L630q856M220
8757E0949N347j7457p062N639N601M79J1361j2496k2247P406J2626Q245J4914
8744F3305j9026k0790n347l165R549J1579q678q573j017K715J7778J4506N488
8731E8324p456j273n629q103j5296k534O622L911M186M459j0850q44J5959J657
8717D3133o638N809o381O986R33p752p419N094j2310r623R638L867j751j2545
$$ y = [101796, 85092, 56859, 56915, 54617, 52250, 51621, 47994, 51383, 48786, 49317, 58561, 62424, 64963, 44938, 44346, 37577, 47236, 60110, 61550, 57875, 51276, 48035, 58359, 43031, 45368, 45696, 46754, 54240, 51491, 51719, 50590, 46957, 52903, 52911, 43337, 56422, 54146, 46452, 31473, 42389, 73031, 70832, 65874, 57779, 42574, 30115, 34045, 51110, 61723, 60688, 67975, 64485, 55014, 50380, 51955, 55585, 46729, 50949, 56296, 38839, 31777, 37416, 43017, 43496, 54857, 42361, 20114, 27520, 40146, 48391, 63305, 44279, 23489, 18142, 14977, 24526, 36105, 27427, 18854, 17837, 20552, 38330, 52836, 58324, 50868, 49595, 43966, 35863, 20567, 18033, 24655, 28566, 32752, 37211, 26361, 25517, 41476, 43133, 36495, 42304, 35923, 42909, 43842, 36090, 28671, 33765, 21455, 11832, 21470, 25337, 23586, 11041]
8703A1041R444J3044k622j4312J254J0583J9739M482j490r847m420j1680k599
8690B2617q228j054J2397R618N420j529n022K59J1035N38J222N179O566j0648
8676D8370j0041Q051J367j14L692J2169j2633j5226J70o177o837J6534k508j0706
8662B6111J2130K66j7635K405L702K003k707J1881J4701O23j3419p205Q410k225
8648C9041j5577N62K755k358n828J1567O986n391j009J1990J0201j468j4134j3187
8634B4150K26j230Q795J347L401j2314n106K1434P724j6240j2170l343Q894Q8
8620B5656o422K116N724j4154p57n592l092J4963R98M85j060O325O027o109m003
8605B1105J0614M106p831j2809j437N312J2505Q916O333R948J656o515j2887q066
$$ y = [11041, 20485, 33529, 30907, 16595, 17849, 28432, 48171, 52653, 51163, 41316, 36896, 25216, 22617, 14389, 13335, 25732, 35350, 40770, 39241, 34219, 34478, 45513, 46051, 47273, 52452, 59018, 48370, 38329, 46380, 47747, 47633, 51325, 63494, 50861, 35635, 35805, 29628, 22791, 39325, 36817, 26111, 38241, 38507, 20872, 23277, 26979, 28982, 26275, 38156, 52857, 53480, 40061, 32856, 41266, 39041, 23464, 24026, 26781, 24423, 18595, 30162, 37148, 31757, 30748, 42738, 52939, 51471, 37337, 24150, 24376, 23146, 31941, 33288, 36689, 24375, 19269, 40703, 48427, 32187, 20017, 16674, 25568, 25656, 19234, 21350, 27074, 12920, 12163, 6571, 3479, 18442, 19440, 19925, 18865, 25190, 31217, 25108, 21105, 31719, 35825, 27994, 15185, 13748, 19060, 31565, 40481, 46814, 56762, 58418, 51903, 39016, 30950]
8591C0950N828J1758Q622J1765j773M982N210j2578j3209p9p970r50N861N455
8577E3872P168L958o298j5363m461M504n744J738P503L933j6053q965L822K234
8563C1848J691q382o440k257j628q397J1019L216q13K577N874m50K2736j980j6987
8548C1627r347p601J3433N219J6708J0459j3376k1236j6573P505Q448J2088p290
8535C0064l449k450K807N188J179j3293j2012J5015M943j0356n717K529m136p744
8521B568N448m828P082Q688R035P796K53q63L692m864j645K788j0050q707N559
8506B1952M76M142J2370j478j37j0390k112o976J627P638j5580l002N044M492
8492A8066j1008k2902Q006J2557P049Q453J138q93j1342M106O312n862j2113k674
$$ y = [30950, 36778, 48536, 57158, 68923, 67150, 72132, 77342, 64764, 51555, 51476, 43506, 42556, 48417, 53872, 61040, 64998, 58700, 43337, 38876, 43380, 37636, 39374, 46877, 50810, 34757, 25792, 29614, 31848, 33539, 25157, 18717, 16460, 14832, 6435, 17454, 20670, 19857, 22434, 28308, 27858, 50594, 48614, 31627, 22280, 14679, 28112, 33331, 50039, 60498, 47122, 25886, 9313, 16818, 25266, 37354, 30064, 26615, 24165, 26972, 32160, 33339, 20046, 8034, 23049, 27992, 17636, 11919, 14448, 10312, 2568, 8016, 3188, 10270, 18958, 27993, 35789, 36042, 35179, 38871, 34007, 32362, 35150, 25100, 16393, 21952, 22428, 26570, 38940, 37462, 37325, 26935, 24823, 17847, 19474, 27112, 11532, 8530, 13574, 18066, 7058, -15844, -7838, 4719, 11768, 20221, 21359, 20466, 9124, 13230, 19542, 13680, 1567, -1107]
8478a107J4199P418M879Q970R298j5689j3916k164L435J0178q024j2694p594K220
8464e91N719j314o843R609J0024Q324k51m364m547N342k000l4L639l808j1406
8449G499o765j1151P379J6666M770L1j0263O675M665n806L44O76J3857m231j0129
8434A4217L023K0682j502j7063j0257J014R817N585k751j4890l823J122N99K291
8420H064N038K621Q149N705J2507l78j046K662J1136o192j0565p737j6673j1597
8406A694N345O613J950p689J80j873O556R491N694q032J119M635K639j219o088
8391B1015L19N192J483n804m18l701m384r42j9106K829K858n15L884J0208J1658
8376B4576M883O580R575O757K281o379j1333l303n646L327L057q343J338n302
$$ y = [-1107, 13092, 20510, 25389, 34359, 43657, 27968, 14052, 11888, 15323, 25501, 17477, 4783, -2811, -591, 5128, 3814, -3029, 6580, 16604, 24928, 24677, 20313, 15766, 21108, 19108, 19074, 22713, 18905, 7499, 734, -10417, -3038, 13628, 18398, 18429, 8166, 14841, 19506, 13700, 14044, 14720, 28577, 24346, 14217, 17240, 37922, 36420, 19357, 9100, 10114, 19931, 25516, 22765, 7875, 4052, 5174, 5773, 8064, 13102, 15723, 23872, 29577, 42084, 41706, 40660, 43322, 54458, 48266, 37701, 29964, 13291, 1694, 7039, 13652, 15602, 7913, 8093, 6220, 12776, 22267, 27961, 19929, 21048, 25683, 28322, 27103, 21015, 21334, 26526, 28009, 22205, 21787, 18086, 13702, 12760, -6346, -3517, -659, -1174, 2710, 12918, 24576, 29459, 36039, 45614, 52371, 54652, 48273, 36940, 33637, 27991, 31318, 34375, 26032, 27370, 22068]
8362B2068L24j925p941N514k804M681M481p239k773L009M84M976j586k823m871
8347A3575r62k743O931J405P633J9368L1336K0331J0695O121J4426J0022p387
8334A30751q884l248j5086k8877j2183p167q472j5993j129O395N684K319m042
8321D0068j0124J151L071p813j825Q209L980j0195q347k427j764l221J5444m524
8307B1683j5447n378J6216k490P530J7589K137N774J3263J9388P039K6558J8009
8294A31871J3385j6197k4892k2895j3085o993j7078J133p994p930N813j549r124
8281B4465j790j832j753J2991O620n355l311l048m463P707j0012J951N412j1965
8267A5617j6425R444J1428J0657L507q351r886m040m382m428n903q971J887J0034
$$ y = [22068, 22392, 20467, 12526, 18040, 15236, 19917, 24398, 17159, 14386, 17395, 17879, 22855, 21269, 18446, 13575, 12613, 9870, 16801, 18206, 25839, 45207, 76543, 96874, 107569, 113690, 128116, 138138, 130751, 121867, 118619, 103533, 74656, 62473, 55306, 46834, 30841, 29712, 36107, 41791, 44110, 40068, 29944, 31095, 34166, 26353, 24528, 32737, 36717, 26522, 18175, 15748, 13984, 10763, 26207, 21683, 6236, 858, 17074, 14584, 22114, 39703, 41840, 47614, 60877, 80265, 87304, 113862, 131871, 145256, 129059, 104167, 81272, 68187, 61194, 44116, 45249, 37255, 29325, 35138, 33589, 24465, 22675, 20843, 19090, 32081, 38701, 33346, 30035, 26987, 22524, 30231, 20219, 22170, 27582, 15617, -808, 8636, 20064, 30721, 34228, 25877, 15991, 11951, 7569, 3141, -2762, -11733, -9846, 188]
8253A88M921j920q06q951n418n210n970J0795J1425P027Qk295j1586j0330j2151
8238c0273J0272K2137J0419k70j214K409l205O478l035P83j2105j0501K671J1784
8224F350N688P777j255n992L154j0081j1742N110J506l432K476K78n665k63R917
8209C826K4027l701q329Q133J6343j534k7195q699r42P407P198L155o411O085
8195A9363J000O769J534K60l999j3782j14K856O493p464l596m665N33n724K457
8180A921L100n932p647l007J415k458J1551J0406N626O420n61j8974j0003J503
8166f640k998K16J3158J8856o42O515J7069n466j9137r867J4559J8326J138m098
8152D0989j0626J782j0829K29n276m496J1406J0249q293j8715q66k62q090n374
$$ y = [188, 5109, 3189, 2383, -6568, -11986, -17196, -23166, -12371, -946, 6081, 6089, 3794, -7792, -18122, -30273, -20001, 2136, 12555, 12285, 11071, 13480, 10275, 16753, 13718, 14501, 2396, -8105, -5434, 6350, 12038, 19815, 18560, 12568, 15722, 5641, -6101, -991, 515, -2917, -441, -163, -5828, -6091, 3826, 27853, 24152, 15823, 23956, 40299, 38765, 11570, 2871, 1929, 9336, 16534, 19689, 13278, 19363, 20363, 27132, 28666, 28926, 24927, 11145, 11031, 13887, 20380, 12916, 9320, 4655, 5188, -536, 1921, 5021, -911, -8558, -11565, -10150, -12608, -1057, 9349, 14975, 21395, 20834, 1860, -8143, -6640, -9638, -9422, 3736, 22592, 21950, 28465, 45534, 40068, 20931, 11064, 25623, 43949, 45087, 40989, 30363, 32145, 21316, 21545, 16269, 11773, 23179, 33428, 25135, 6420, 5554, 5292, -2798, -8172]
8138h172M479J4994Q587n446N249N842m354j1370k2334o887R424J3502N336j17
8124H733k694q596l281l024k269K596o313j439P744J0172Q084O721K157N007j739
8109B1859j4988m668m054m641n997n577L771Q283J3516M280j2022j462J272Q646
8095H218P308q009N748J4265j5718q582k422J1590N859L77K383j586p754q637
8081C040j0500K099p680J4839O532j1697k407J4411N768r707K135P816J5758q008
8067B2399J0651M533j2188j58j2836j8162j5371m945J6478J2871m605m204M961
8054e76j119Q371L819q377N258N110k1958n383O173J1498r486l864J1375P399
8040H240l828M999J3318N607j1449j7261J20R585M196p473J90Q746J066K107R299
$$ y = [-8172, -3693, 11301, 19888, 14442, 19691, 25533, 21179, 9809, -12525, -19412, -9988, 3514, 8850, 8733, 6039, -2557, -5838, -8862, -11131, -8535, -14848, -16287, -8543, 1629, 9713, 16434, 18591, 23598, 21859, 6871, 2203, -1851, -6492, -12489, -18066, -14295, -6012, 7504, 11784, -238, -1700, -428, 8218, 15526, 7517, 13265, 27530, 11812, 3230, 808, 12398, 18257, 18634, 21017, 19431, 11677, 3040, -7460, -5361, -13041, 1798, 8330, -3367, -5774, 8637, 14405, 4698, 6833, 14649, 30407, 22399, 33050, 37583, 25395, 25237, 12401, -5761, -21132, -26077, -9599, 3272, -1333, -5537, -576, -1695, 6676, 10495, 2118, 7376, 12486, -9472, -14855, -8682, 2816, -6670, -10534, 841, 8240, 4412, 9411, 22729, 28336, 16887, -374, -254, 9331, 13527, 6054, 6244, 14990, 16056, 18163, 27462]
8025B7462L146o781q418p623q387j2237M183m90M173Q80J3012Q657j6187n720
8011d330J9588p897r085N993L533k196o363k956O529J3975j045n505n508p65J888
7996E856K3434R252j4050l719N574l045N455n46j551p849l505l507M858L859p805
7981A2711J1450J1046Q873l581q850q848p923r745K032P006p90j0611k287M785
7967E268m567M55K692m181Q600J2013n72j2833k045R452K16Q939R44P053r95p795
7951B2644O46l200l318N625M745K776L944n785J524j5080j3488q766L12K2694
7937A5273J0664J405Q75r60j0307o832J6409k10M483N638j0011p274Q021P072
7923C4246j4809j5392N10j607J324J2859m87o892N749M589j4509j5342N681J2711
$$ y = [27462, 30608, 23827, 15409, 7786, -601, -12838, -8655, -9145, -4972, -4092, 8920, 17577, 1390, -4330, 15258, 7361, -1724, 4269, 7802, 5606, -757, -3713, 2816, 16791, 15746, 10241, 4733, 3968, 5856, 29290, 38542, 24492, 20773, 26347, 23302, 28757, 28211, 26660, 18811, 15306, 11799, 16657, 20516, 12711, 24161, 35207, 44080, 40499, 31649, 22801, 14878, 5133, 7165, 14171, 13381, 2770, 483, 5268, 701, 1156, 3848, -333, 8267, 20280, 19708, 6875, 4830, 14282, 14498, 23437, 24381, 31434, 30439, 22644, 23290, 20090, 16772, 22397, 27142, 29918, 33862, 28077, 29601, 14521, 1033, -7733, -7421, 15273, 25937, 27342, 28217, 27257, 16950, 10118, 26527, 26317, 30800, 36438, 26427, 19153, 27174, 34246, 19437, 4045, 4555, 2948, 4272, 17131, 16644, 9752, 15501, 20090, 5581, -9761, -4080, 8631]
7909H631P685l55n345J5926j0649n021M259J453l723j4566P185J2513J052L436
7895B2481N326r741j2581j0929o14P38J0425J4594K797j0598O063M880q094n873
7881H874m396J5077J056m608J820N22K920N892j0117k902m865K707m491o929n249
7866d689J0889J6727N572P649J152j8241r677Q519J2133L729O064j1643j3828
7853A4356j5004n642L323J0155L410o608j3735q079R713J681l532o38j412J1584
7839d28J3255n267n544n556k126K800o634j0381L763N868Q386J5158J677m506
7825A0465q211L41p692o49j1476J72j636J924l290J8492J1463q2p198p878r436
7810a4691n630M796L217L824P912m379q241L261J2560Q187P002J080j5120k6479
$$ y = [8631, 16316, 15961, 10616, 26542, 15893, 10872, 15131, 16584, 12861, -1705, 5480, 17993, 19045, 22481, 27807, 18066, 5485, -5444, -6058, -5320, 5105, 19699, 22496, 11898, 17961, 22841, 14747, 8874, 4478, 19555, 20611, 16003, 17823, 18345, 21265, 27157, 17040, 14138, 9273, 11980, 7489, 560, -4689, 6200, 22927, 28499, 36148, 37300, 19059, 9382, 17901, 30034, 33763, 39827, 28184, 14356, -648, -6290, -2967, 7188, 10598, 3990, -9745, -17824, -8111, -6430, -9962, -10600, -12012, -428, 12827, 7560, 2016, -3540, -5666, -2866, -9500, -19881, -16118, -10250, -1864, 13294, 14971, 10465, 2254, 2595, -5097, -5746, -17222, -17050, -18686, -16762, -20052, -1560, 9903, 9821, 2623, -5255, -14691, -20321, -15525, -12308, -8484, -572, -4951, -13192, -9931, 2629, 10816, 17818, 18898, 3778, -22701]
7796b2701Q342K439K2292J2448j2250n81M043R924J1764j1415j9273n750j592
7783b310q280m725N62J7722l23k1680j6329J0178J7602P521o117q126n788m655
7769b4748M007M134J8610K362m979R20J6293R824J168j1768j665j0291k3092m226
7755b3451K1074M992j1513j7899m832J6205J5397J3627L628j6059n718J739k949
7742e759k979m986J2383j384Q681P071l667L587P15o523k951o398M773J2543l987
7727A1119m855j373m791J157M698l51j2898q830p635J636J5037Q385r00j814n661
7712g076m186J1199j900k992K972P408K843l639j0334r359J900J1121J2332L780
7698A4069l921m67j7859q413m011o295L165M444J1625J7283K770q215o016m818
$$ y = [-22701, -14359, -11920, 10372, 22820, 10570, 9989, 14032, 23956, 35720, 24305, 5032, -718, -2310, -10590, -15315, -14753, 2969, 2646, -19034, -35363, -25185, -7583, -62, -6179, -14305, -20093, -24748, -20741, -16607, 2003, 4365, -614, 306, 16599, 26423, 27591, 15823, 14158, 3867, -19225, -23451, -2377, 2615, -8898, -26797, -31629, -15424, -27, 13600, 17228, 1169, -4549, -2810, -5759, -8738, -13724, -1341, -2725, 5956, 13027, 9360, 12947, 13662, 7139, 4188, -2210, 2563, 15106, 11119, 6264, 4891, 100, 1257, 5955, 5604, -7294, -16124, -23759, -22123, -7086, 1299, 399, -1415, -7076, -11262, -63, -1963, -4955, -1983, 5425, 8268, 4629, -5705, -15064, -13164, -2043, 10289, 14069, 10148, 9681, -8178, -16591, -20602, -26897, -23732, -19288, -7663, 9620, 12390, 4175, -1841, -6659]
7684f659m808k735J0383L282n396j942N44p144N569J3297P84o487k57q056n992
7669a5617K255R457J0885q912q613J108J4634R956O622p843j2859p079J957J416
7655b633j147J236J4985O886J042k258j7077m464L835P494L499n42o943j7069
7641a3156m294J889R344M920j5449j3567P381Q927M099M250k678m636L001l984
7627a3953n110M080j521J0213o2P203n65j4346L787M002q081L646J6708m229l546
7612a774r094j628J0627J2083j057j0908k667p181j2998Q885J5480N590M15r867
7598d094j607J961j0471K341O168Q433k31j5917j1368j336R721N077r733N051
7584a6005J086N721J4452Q233n851j3207J8775J3287q004j0230R45L632J882M229
$$ y = [-6659, -11467, -14202, -3819, -537, -5933, -7875, -7331, -14475, -8906, 4391, 5175, -1312, -1569, -9625, -15617, -13362, -3905, 6980, -1932, -10545, -9437, 5197, 15153, 21775, 13932, 1073, -6006, -4049, -2633, -3780, -2544, 12441, 19327, 20369, 18111, 1034, -3430, 405, 7899, 11398, 10856, 3913, -13156, -17450, -15561, -6217, -1297, -16746, -30313, -22932, -14005, -9906, -5656, -8334, -12970, -9969, -13953, -19063, -14983, -16504, -6291, -6353, 850, 285, -14061, -10274, -6272, -14353, -10707, 6001, 1772, -1774, -10868, -12496, -1869, 10214, 9157, -1751, -4418, -11599, -24597, -15712, -232, 5358, 5773, -4094, -5701, -3740, -14211, -11870, -5702, 2731, 2500, -13417, -24785, -26121, -16400, -11323, -21056, -16005, -14919, -9198, 5254, 13487, 7636, -5571, 13204, 26491, 18487, 8257, 9202, 12834, 14716, 18945]
7570A8945K61K104K644L043k430k2522j9154r3P723J625j161M312J9304J5396
7556B9997j1519k1224r411q58l515n941N032N558j1710K383J4340J430L704K111
7542C77l425J3079k743o100J898K322l211M920o067j4342n929M929J2528j055
7528b819P772k842M162l170j0380r900M107J871J219l773j7672O709N605M490
7514a4621J2229n779N386O842J3467M91J1218L675m904r598j5075j2843o47J6913
7500F754M41j1113L587R431n236j9032M866J7359O6r287o213m714K7516J6680
7486C1105j1756j8969j8048R304P319o047k624m701K1351J5168r57j3690J374
7473H829r02k3859J417J1944n287j4264K154L379J3656J0997m394L253q18n170
$$ y = [18945, 19206, 21310, 23954, 26997, 24567, 2045, -17109, -17202, -9479, -7854, -9015, -4703, 14601, 29997, 18478, -2746, -12157, -13015, -16530, -22471, -17439, -11881, -23591, -21208, -6868, -5438, -1734, 377, -3048, 10031, 7288, 1188, 3086, 5408, 2197, 7117, 1050, -13292, -19221, -14292, -1764, -2819, 4953, 2111, 6273, 3103, -7277, -17177, -13070, -11199, -9980, -13753, -31425, -24716, -19111, -14621, -2392, -8171, -2785, 4057, 17524, 18015, 29233, 32908, 28004, 18406, 3331, -9512, -10159, 6754, 7195, -3918, -331, 9100, 3864, -15168, -10302, 7057, 7123, -2164, -8377, -13091, 14425, 31105, 19349, 380, -17668, -8364, -1045, -7092, -9716, -14417, 6934, 22102, 21145, 7455, 8829, 7927, -15932, -14515, -2571, -7858, -22122, -19968, -16589, -2933, 8064, 3670, 6923, 6105, 935]
7459I35r341J3680o38J361m80q405j7689j330J0046K619o10J941n657M576J0511
7444A519L532j826N723j2232j0910R951Q898q331j7153r850R381L30n348J0261
7430a6055P406J6487Q783r910m769J1117M471J1459q925k5537p143n427o998K57
7416b4784l870Q390M638O294J908J3554K2861q141o617o180m740P340P242k222
7402A5673p999O058J2385j5242j8182K468O597L952q391j0181k168P373q392q268
7388b4317J105J8092J1917l089j3380q341K390R514m923j5501K483K2073J8256
7375A6279r28k368j404k397k068M368j1294P742J8244j7191p555j412r1J5952
7361A5877m300o268q720n308Q721R35j0511J1403m564l2332n194P257Q129N388
$$ y = [935, -8406, 5274, 4636, 5997, 5517, -2888, -20577, -21907, -11861, -9242, -9852, -7911, -13568, -8992, 1519, 5051, 3225, 8948, -3284, -14194, -4243, 4655, -3676, -20829, -30679, -21298, -20968, -26316, -16055, -8649, 7838, 16621, 6711, 1942, 13059, 17530, 28989, 20064, -5473, -12616, -18043, -25041, -24784, -28654, -20264, -15626, -9332, -7424, 6130, 28991, 20850, 14233, 8053, 3313, 10653, 17895, 15673, 7674, 13732, 26117, 10875, -7307, -4839, 1758, 5710, -2681, -12862, -15030, -7657, -16049, -24317, -23212, -5120, 6797, 3708, -9672, -18013, -15623, -6109, -11032, -26533, -24050, -1977, 16279, 15351, 12983, 11579, 9182, 7114, 11482, 188, 7930, 26174, 8983, 1428, 16, -75, 15877, 11577, 5309, -3411, -8719, 2, 937, -9574, 1829, -2735, -35067, -40261, -33004, -24875, -19487]
7347a9487M277P814k095L183J84k728r61J1198K462j0332m515j4348r904O698
7333b8554J6197j93o469K969K664Q13Q264n484j733O817l507J861n776k861L780
7318a1212J9828k025j4992l510l79R543K080m755m57j2538r480j3431J891o81
7304d0118j0978L992Q953R753j065M150M612K5j606J7559n543o897L221l385p593
7289b4920M890J6546L55L1j751n37M21O950m408r088k486P589l860M372P668J3916
7273A5688o876j0192j2561j0122K943J7092J206j291j048j3504O481O707P918
7260B441Q147j1156j2183q256O521J4583n945m485n570J2330J2058q848k702j214
7246d279r801J2734j2782o781K126J1257L292j5990M333R118o059j125O043q15
$$ y = [-19487, -15210, -7396, -9491, -6308, -6124, -8852, -9813, 1385, 3847, -6485, -11000, -25348, -35252, -28554, -12357, -12550, -19019, -16050, -13386, -12573, -4309, -9793, -11526, -4709, -8216, -6355, -12131, -14992, -11212, 8616, 6591, -8401, -11911, -12290, -2747, -667, -5422, -5879, -18417, -27897, -41328, -39437, -40118, -51096, -47104, -38151, -28398, -29463, -25313, -20701, -20676, -22282, -4723, -10266, -17163, -13942, -17327, -24920, -20030, -3484, -3129, -3098, -4849, -5386, -4965, 1985, -2423, -11511, -13997, -6408, -10268, -5896, 1772, 15688, 8812, -1380, -13941, -24063, -21120, -4028, -2822, -4113, -5161, -18665, -12184, -5477, 2441, 10588, -568, -12751, -21007, -14486, 97, -5848, -10333, -15903, -3573, 8485, -363, -3065, -4279, -14080, -1346, -14128, -20909, -18783, -7526, -4234, -20224, -15891, -6773, -12832, -13957, -7914, -8729]
7232h729J2502j3739j2023J423Q204L806N467R240o355j034m420m980L625M884
7218b129j0260L905j0456k630N688J4503M328M576L94k2506j1862K2765k532J1831
7204E615Q906j0729j8463r172p513J2211N152m084l393Q641J287j1770N845O163
7190a1304m26J1134J3231n479j0725J635J4002M875r276n651l581m389P795O639
7176H480j7408k151J6445O212O777p813r342j0599j0368O449J374j07K019J75
7162i857J1007j499p086N257j0594p90J7826K772l178p996K541J6078N161l409
7148A6233j0404j614J7211j908r137j1296r663p457N196o205o643J665J2023M716
7134g283j2296l957J1735J7015q230P65M171k15P130p182M043M895l344o169l814
$$ y = [-8729, 3773, -9966, -21989, -20566, -12362, -8556, -3089, 6151, -204, -1238, -5658, -10638, -7013, -2129, -12389, -8484, -18940, -21570, -15882, -1379, 2949, 7525, 7919, -14587, -26449, -3684, -6216, 5615, 14521, 3792, -14671, -23843, -31356, -19145, -13993, -18077, -21470, -12829, -11542, -23312, -17467, -11304, -11730, -596, 12635, 7156, -3569, -1934, 12068, 16943, 7667, 2016, -1565, -5954, 1841, 8480, -8928, -11079, 5366, 11578, 18355, 10542, 1200, -9399, -19767, -13318, -11944, -12051, -10032, -9857, 1150, -349, -7435, -2178, -12772, -13562, 4264, 7036, 3858, -4138, -1597, 14481, 19642, 16233, 5829, 4215, 21426, 19518, 10381, -915, -10578, -18035, -12839, -19044, -25687, -24022, -11999, -7283, -19579, -23536, -11801, 5214, -3016, -2251, 1920, 1705, 8835, 1653, 5696, 10591, 7247, 1078, -2736]
7119b736q53j2667q255O289N557m300l003P868p253q115J3189J3348P336j180
7105E225j2189K472K721j0331r372J1034m9j960j931N394J2798l4o515O049R585
7090A2897N59m113j6480l518j0923o669k89J5577J3555j0618j0780O036Q930P225
7076A389L190R676L451j41J0306n83k0916m451p793o182K088Q357N809o904J4650
7061A1946J0385m067j2399j453p654j2535m439J3036m748p519J0215n202J849
7048a2585P836O53P723R375J1329j816q509r151r366k570M692Q027J3787j4486
7034D939p552P193n183j1851L402J28n160P825R07o370j7349p623J0167J4182
7020a2345L657p03K289m130K339N770j945R953J4196j380j6067K230m162j3785
$$ y = [-2736, -3589, -16256, -24511, -18222, -12665, -16965, -19968, -12100, -19353, -27468, -14279, -931, 6405, 5225, -6964, -4492, -1771, -12102, -21474, -10440, -10489, -12449, -14380, -8986, 3812, 3778, -2737, 3312, 12897, 13456, 9343, -7137, -10655, -21578, -28247, -28536, -12959, 596, -10022, -20802, -14766, -5836, 1389, 4579, 14255, 17706, 17565, 27871, 27288, 6372, 1921, -5872, -12054, -9966, -1609, 4200, -2704, 11946, 22331, 18264, 5865, 4412, -3242, -15777, -20216, -7180, -11928, -19447, -9232, -14434, -12585, -4749, -4096, 3627, 13002, 24331, 22515, 14006, 4855, -4511, -7081, -2389, 5638, 19425, 4939, -2613, 4580, -603, -12454, -9052, -8924, -14084, -6259, -5352, -11722, -29071, -36694, -26527, -12345, -8688, -9391, -7102, -11232, -8893, -3123, -5068, 4885, 19081, 17701, 1634, 3864, -298, -14083]
7006a4083R106j89m885J1381J0069m01m595o973j029o472p15N468o377j743n353
6991a6791P005N765m408j6522r944J8576R953L655M020P590j3802o037p044J630
6977a6354o895j1681L866J0523o505L443K336J4866m77M79R087J8302R680m101
6963B6569j288j6995k690j1589K903J4378Q908o964j0075J2933L437L03n306k927
6949A1597o118o630N373J4250r684j5398o689R706O147n10Q11R39j558P55N962
6934H953q951j4580o107M975P360k876j518n94N688l477o827J1059R629k638l595
6919c499J5511j501p681r59N3L545m604M483N843L333L840l381q443o108m500
6904d068J0197k628j1501j93P059N591R927j5644j8659m190l711J0315R950O114
$$ y = [-14083, -4977, -5166, -10051, 1330, 11399, 10998, 6403, -570, -1599, -8071, -8786, -3318, -9695, -11438, -16791, -9786, -4021, -8429, -24951, -34895, -16319, -6366, -2711, 1309, 8899, -4903, -10940, -17984, -16354, -23249, -34930, -31064, -20541, -27046, -23603, -21267, -6401, -6878, -6399, 2688, 20990, 30670, 26569, 25281, 8286, 5596, -5993, -3090, 11288, 20196, 13232, 3157, 16090, 19527, 19830, 14524, 11597, 5479, -1151, 4222, 18472, 8788, -6610, -13299, -3593, 2554, 2044, 2855, 3794, 2236, 2991, 8953, 2, -14578, -20685, -15710, -8350, -11226, -12744, -13338, -7650, -11127, -17954, -6895, 2734, 96, -3499, 12012, 10511, 2830, 1871, 1924, 5469, 865, 5348, 11191, 14524, 18364, 14983, 6540, 432, -4068, 6129, 3501, -8000, -8193, -1134, 4457, 14384, -1260, -19919, -24109, -27820, -17505, -7555, -1441]
6890a441o190q593L817l560J3238M754O27j631l896l790P175m57O275m761p298
6875e731R148o878J27N710l544k2700o730P661n150k715n027p189O082l871j231
6860d2038N127K876L194P325Q063J757J966j1178q095J334J0753J1215J446P154
6846H99J1026j1100j0099m82J882o157j0792P043N06K436P02l076M217J7953O87
6831E645l986k172J398l345M12M923Q617j0045l95K736o483k889K960M232M741
6816F349r088j3577l868Q431p171j8247K1423J2573J0919M957k754k36M570j1245
6802C036j3519q020O835j482O410o596O638q83k348J4420k35r797j0538M680J0480
6787i19O292n130k944k68R165R59J378j2875k822k365l302J1034q853j903P533
$$ y = [-1441, -7631, -16224, -12407, -15967, -2729, 2025, 2652, 1021, -2875, -6665, 510, 53, 6328, 1567, -5731, 3417, -3461, -3334, 2376, -1168, -23868, -30598, -22937, -28087, -30802, -35829, -43018, -36936, -40807, -42038, -36911, -34035, -30841, -23516, -15453, -13696, -11730, -22908, -31003, -29669, -18916, -7701, -6255, 899, 11925, 825, -9274, -9756, -7874, -14031, -24823, -17780, -17274, -14838, -14136, -17212, -12995, 4958, 5645, 1659, -513, 885, -2460, -2048, 2875, 11492, 1447, 1052, 3788, -2695, -5584, -2624, 1608, 6349, -2739, -16316, -20184, -11753, -18924, -37171, -15748, -3175, 7744, 12701, 9947, 9711, 14281, 3036, -10483, -18503, -11668, -13150, -6740, -13336, -6698, -7581, -9929, 4491, 4256, -5541, -16079, -11399, -919, 5373, 243, -2701, -2969, 6196, 7155, 8533, -4342, -7164, -9529, -12831, -1797, -10650, -12553, -5020]
6772e020K80N033N758r484j0825N397o365j3310o282J9407J9618k287j1002J311
6758g771n887j0326p036N145L589J7775K508j605q392R147J2120m500l004N771
6744G534j2035K007K958J350l197m990K267J2487P094n302K774n079m772q65J897
6729D128O188j372r79j664q085o361k944M609k010l831O896J100j6172m243J0982
6714a3758J409k0j022J2461J2376N300O831r496j2263j0524r092j3894M627J3428
6700a3637K22Q082j815m004q129l920N70O797l347r468P074n279M444N620J5585
6685a205R278j2927p441m614k321P642j134J7941J4775j1856j685r059J735l065
6671c936j826M188j1047j5340L956M146M768P534o103r276J5929P103N664O055
$$ y = [-5020, -4740, 293, 6051, -3433, -14258, -8861, -15226, -28536, -34818, -15411, 4207, 1920, -9082, -7771, -13658, -23984, -31020, -25875, -22286, -4511, -2003, -3608, -12000, -2853, 9267, 4767, 1763, 7534, -4501, -2494, 464, 1814, -1383, -6373, -4106, 8381, 15475, 10173, 12947, 7868, 3096, 2231, 4128, 10316, 8944, 7965, 6301, -1784, -8145, -11089, -6480, -8490, -12321, -5425, -4325, -20497, -24740, -13758, -12349, -12369, -13391, -930, 11446, 16746, 23577, 14081, 1818, -8706, -17798, -31692, -27065, -13637, -13415, -5333, -7148, -11152, -19281, -23201, -22631, -15834, -19181, -28649, -21575, -26854, -22410, -16790, -1205, 8073, -4854, -12295, -16909, -19230, -11588, -12722, 5219, 19994, 8138, 6453, -2606, -871, -3936, -5762, -1574, -12621, -27961, -24005, -19859, -15091, -7557, -13660, -22936, -7007, 96, 5760, 11815]
6657A1815J1203p15k0300k488J8047Q584j9731k0041J5167N21j0574O694O136
6644D318j6118n566j494K752J0301N92q530r656P946J2330J0190M533o051p024
6630a477l706k403k36j5412K2736K977j0296M152n069k4431J0055K5562N29j5699
6616a2718M450J1794O89o722j2561M59N211J1144q426o12N630R93j438p69j058
6601c934J5468J942L084j341j7361l426J1219L776L96K251m396k405j1355o025
6587a2107Q590m143j0913m182o732L984L376J1414J5012J3678L847r422o860L658
6573I200Q401q409j7803l432J235K815J2260M500p355j0694k173J859q784L196
6559a5184M112l569R531k601K354M543J2975Q004j4791j0518o468L675j704Q990
$$ y = [11815, 23018, 22303, 2003, -485, 17562, 26146, 6415, -13626, 1541, 2062, -8512, -1818, 4318, -11800, -17366, -18860, -16108, -5807, -5215, -13745, -23401, -15455, -3125, 7065, 11598, 5547, -1477, -5183, -7586, -7822, -23234, -498, 2479, -7817, -3665, -8734, -33165, -23110, 2452, 2981, -12718, -8268, 3526, 4215, -2507, -15068, -14609, -9398, 1746, -6680, -7292, -1662, -669, -2107, -2876, -3934, 11534, 13476, 16560, 15219, -2142, -5568, 5651, 9427, 9823, 12074, 7678, 5273, -6082, -12107, -3517, -7660, -18573, -22755, -29487, -25503, -22127, -10713, 4299, 17977, 21824, 12402, 5542, 9200, 17601, 9192, -8611, -12043, -10808, -7993, 4267, 8767, 1412, -9282, -11455, -9596, -18380, -15184, -11072, -14641, -5110, -7711, -5357, -814, 12161, 20165, 5374, -5144, -11612, -7937, -9641, -651]
6545f51J1715j5166j4933n22k550J3576n62J4935n235j1116o807r290R498J1118
6531e990J5535K688p04P564o301j3066n65M985m414j85N062j183M409m956j8205
6516a5326k573M86o61M598J0644N65q009p959K310o182J4015p87r414K663o39
6501a6269r987J0302J705k78P353L520p374J396J708o847K925K817J3458R406
6487A3835j6323j5149j614M877R757J335L639j1919j1653L169L944M306J2000
6474B04O166p185m000N570P88k0246n614L116J1733L024J490M541L243j0147N83
6459f734M441j0616q057Q899N975n879j0829M931J1064n40j3647o739Q51L428
6445b3452P617K07j422M868J0973Q966j1773k8790m450N751J3243J3415M99J1680
$$ y = [-651, 11064, -4102, -19035, -19557, -22107, -8531, -9093, 5842, 607, -10509, -17316, -26606, -17108, -5990, 9545, 12233, 11529, 19093, 12792, -274, -839, 4146, -268, -453, 4609, 3426, 7835, 2879, -15326, -17899, -17413, -18074, -13476, -2832, -2267, -10276, -18235, -15925, -22107, -8092, -8879, -18293, -15630, -16269, -26256, -15954, -14249, -14527, -7174, -3654, -11028, -9632, -7924, -14771, -11846, -9029, 4429, 13835, -2488, -17637, -19251, -14374, -4617, -3282, 357, -11562, -23215, -20046, -16102, -11796, 204, 6370, -815, -4815, 755, 1543, -18703, -24317, -21201, -9468, -6444, -4954, -413, 2830, -7317, -6734, -2293, -12909, -20966, -12067, -6092, -11971, -22800, -17869, -6805, -7345, -20992, -27731, -26880, -23452, -15835, -15628, -17050, -12182, -1209, 7757, -4016, -32806, -37256, -31505, -18262, -4847, -4348, 7332]
6431G332L950j567n725j750J391q7j2k405N32j6860K207R431P806J641j964L896
6415G816o296j4161J012k352k168m861O060J6147K453M803R59j942o70p906j89
6400a295J3925M9j1117j5687J1429m901p515J2276P467K921K282k643j2178l646
6386h633l498k040m712N831m646j3653o463K7232O575n330m889O420q41O379M673
6371B405j5592m368P637N756k315j4574m255L25N461M458J977j558o228J288M391
6356a5192J434J9241m139J5919K270J394n278n970Q464K184N560j8625j5162o87
6342h587Q831K158o286J316J0837k502P3M183m081p003j0067n948J0187M990K579
6327F80n310j792m069P640K962n786o797j390j0017P670K6503J2503j9552j3938
$$ y = [7332, 11282, 9715, 3990, 2240, 3631, 3544, 3532, 1127, 1659, -15201, -12994, -3563, 4243, 5884, 3920, 7816, 1520, -12641, -11629, -13981, -16149, -21010, -14950, 1197, 3650, 8453, 9412, 7470, 6800, -1106, -1295, 12630, 12679, 1562, -14125, -2696, -7597, -15112, -2836, 4631, 7552, 9834, 7191, -4987, -8633, -12131, -14171, -18883, -13052, -17698, -31351, -37814, -10582, -4007, -9337, -14226, -7806, -8647, -2268, 2405, -13187, -17555, -9918, -4162, -6477, -21051, -25306, -24981, -19520, -15062, -13085, -14643, -20871, -19583, -15192, -13758, 5483, 1344, 17263, 19533, 20927, 15649, 9679, 18143, 20327, 25887, 7262, -7900, -8587, 244, 2402, -3884, -2568, 8269, 5767, 5840, 10023, 5942, -1061, -11128, -17076, -6889, -1899, 680, -4630, -6422, -10491, -2851, 111, -5675, -12472, -13862, -23879, -16209, 10294, 22797, 3245, -10693]
6313a0693j4063j0919P230J4561J2283J2741n834j0166M457J0252J28j9134n012
6300a4169R84m902M025m365q908Q732n289j327P724J7123L910o292L920k74L942
6285D834j2635L668q074j0478J2658q454k599J4106j513j6996J814L699L569p907
6271b4308L005L636M658j1679O891q430j512l388K59k965J830Q087N640Q171P878
6256b227L815K552J0101K713K209M775j803k1580o026R1r694o978k846k996R526
6241a8368J0695l77j0579j0289J755M796l79j142L811m45l142Q274J8383R628
6227A2621j2617j3559P689P389q476m166J770Q678M872p832P294M330J11m771
6213C333M412K850k50l900k2896p88J95L773P93L220J1181L389j6821n831O399
$$ y = [-10693, -24756, -35675, -28445, -13884, -1601, 11140, 5306, -4860, -403, 9849, 9977, -9157, -14169, -13185, -18087, -14062, -18427, -27335, -18603, -23892, -25219, -17495, -372, 3538, -2754, 1166, 892, 4834, -7801, -4133, -12207, -22685, -10027, -18481, -21080, -6974, -8487, -25483, -23669, -19970, -16401, -24308, -21303, -17667, -13009, -24688, -17797, -26227, -27739, -31127, -30868, -33833, -32003, -23916, -18276, -10105, -2227, 1588, 4140, 14241, 16954, 19163, 23938, 22135, 555, -5471, -5380, -15074, -22052, -24898, -27894, -18368, -7673, -8050, -18629, -28918, -27163, -22367, -22746, -23888, -20077, -20522, -23664, -15390, 2993, 12621, 4, -13555, -5866, 1523, -6953, -11119, -9349, -671, 4201, -3631, 3663, 7993, 8104, 3333, 7745, 10595, 10345, 6445, -16451, -17239, -17044, -13271, -12478, -9258, 1923, 5312, -11509, -17340, -10941]
6198a0941L915J0077M69r210j1897P509M632O43Q79J3717j2270q51L650m206j0961
6183a4845j3591Q53Q325O865k606q541R461J2329j095q08P35m299O070q310j040
6168a0497j96o117J862L801K000j5648m344n671N224M236L04J2637J6686R372
6154A3649j7555j2607l35J0650K851k425o384J0429J8583N503j9005l670O602
6141F286P547j3993j5977J0911J3641j768P683j96K481p811j6422j8815Q597P068
6127a0768J2299J549n152k431O529J1954j2840m522J1854j995q675M07R177j6663
6113i277j0548J4916P963j0532m792O233O979n250p34P131p739p036P761N417
6099D92k784j1506l567j208j223L358M930K844k179q116p73l17j889j7360J333
$$ y = [-10941, -7026, 3051, 3520, -5690, -17587, -10078, -5446, -4803, -3924, 9793, -2477, -3328, 322, -3884, -14845, -28436, -27583, -19258, -12393, -14999, -23540, -14079, -1750, -2845, -3653, -2918, -7217, -1147, -9457, -10497, -10693, -16810, -14948, -11147, -9147, -24795, -29139, -34810, -29586, -25350, -25046, -12409, 4277, 13649, -3906, -16513, -16848, -6198, -3347, -5772, -12156, -1727, 16856, 22359, 3354, -316, 6286, 13833, -160, -16137, -5226, 8415, 6647, 14330, 14134, 16615, 8804, -7618, -26433, -17836, -10768, 1531, 3080, -2072, -4503, 2026, 13980, 1140, -3382, 8472, 6477, -2198, -1791, 7386, -9277, -19825, -4909, 3054, -7478, -12270, -6037, 942, -4308, -5042, 2089, -5650, -12686, -4925, 492, -2292, -13798, -17365, -18573, -19796, -16438, -11508, -8664, -10843, -18959, -19732, -20049, -21938, -39298, -37965]
6084c7965K0728K2392J346K488r865J425O998j0343N500L236J7123l086j5768
6071D209j0596O629J379j3470m138k586p12j7624p403K1145J6339J1475N085o611
6057C121J553p624J209l839J246j3543j4733O423J3135J4939J821o883K624J46
6043d05J6J4144Q070q986j5080p967r415k902O442P633n718N88O358k430L365
6028f287j0986j4088J1063K800n750n711N167P26m98j894O218l758L614P2j0257
6013b9569K920Q372R184P696j0434k414J7714K0427J0907J369K50o416j6609r396
5999D001K953r347L356k651k3063j0833K145R659P747j7429O067J628Q41O01p94
5984b5119L998N203J8138J1425q880j5265R766l727n361k359J627M511Q894M692
$$ y = [-37965, -17237, 5155, 6501, 8989, -876, 549, 7547, -2796, 2704, 5940, 23063, 19977, 4209, -6387, 242, 1621, -11849, -15987, -18573, -19285, -36909, -44312, -23167, -6828, 4647, 9732, 3121, 4674, -2950, -1741, -5580, -4334, -17877, -32610, -26187, -13052, 1887, 3708, -3175, -551, -405, -389, 13755, 21825, 12839, -2241, -10208, -19623, -22525, -16083, -8450, -14168, -13580, -7222, -9652, -6287, -17273, -31361, -20298, -17498, -23248, -28959, -23792, -23066, -23564, -25458, -19240, -22998, -19384, -19312, -29569, -26649, -18277, -9093, -1397, -11831, -14245, 3469, 23896, 34803, 36172, 36422, 30006, 13397, 4001, 6954, -2393, 963, -1688, -24751, -35584, -33439, -23780, -16033, -33462, -27395, -25767, -24926, -24325, -25119, -21121, -15918, 2220, 13645, 4765, -10500, -734, -4461, -9822, -12181, -10554, -6043, 2851, 7543]
5970G543j7026m945O415K991j1209j2669l538J573M449J7854J2903M481j0294
5957a472j2348k461j053L551J9867n021j7039k214K3915P70l118j2001l985R239
5943c370N117o546k496K709J0578M671j0294j1506J051m073j2657M91J346l321
5929b8300j1622J635N991M763M738Q417R715R198k259j2999m477j340r28O186
5915a1282K748J5255L929l385M30j545K104j1531j3294P957O596L2j553J6746
5901A3207o14j7815r205q107k111Q828P78j1382J948J91k311m83L173O888J2826
5886d189k087J060M628J2912N629p138p788Q40J3026p323j344L387n213o261l742
5871c603M129R084l550N872l442L311O384j4545o787l300P721K299k807O820L284
$$ y = [7543, -9483, -14428, -8013, -5022, -16231, -28900, -32438, -30865, -26416, -8562, 4341, 8822, -1472, -13820, -16281, -17334, -13783, 6084, 1063, -15976, -18190, 5725, 6495, 3377, -8624, -12609, -3370, 1747, -4799, -7295, -4586, 5992, 10663, 369, -11137, -10086, -14159, -26816, -26325, -24979, -28300, -39922, -38287, -32296, -27533, -22795, -14378, -4663, 4535, 2276, -10723, -15200, -16540, -17468, -11282, -8534, 6721, 10650, 7265, 7695, 6150, 8254, -3277, -16571, -8614, -2018, -1986, -3539, 13207, 12593, -5222, -14427, -22534, -24645, -15817, -15039, -26421, -24473, -24282, -26593, -27076, -23903, -17015, -4189, -6276, -5216, -588, 12324, 17953, 10815, 3027, 3867, 16893, 9570, 8226, 11613, 6400, 139, -3603, 526, 9610, 6060, 11932, 8490, 11801, 18185, 3640, -3147, -6447, 1274, 3573, 766, 7586, 10870]
5856A0870N490j4834l866L67p939j0281q727R179N959j86O513k657m634J1226
5842c520J2312J089l427K696r86o649o905o877M204M246l207j6788k1J482J344
5827b1007L840n789k094N012O311J666m885j2632J604J6658k939l567J945m00
5813a6277n175J4259p26M164j0144j0940l07J1252m568j4348Q353O067o183j043
5799b5616P179L013l712j681l36K873N274n630r275K0394J7983p703q318P380
5785A825J3904p335r206K803j486j7019J95m815l068j4815l214J4428J9363J2481
5771D041j0506M483P942N440n333n682p827J9142j892j6193m95J3258J4126L977
5757B4481J240j3747j5165N086q343p822K295N221R58l552J3858j0766L488J8745
$$ y = [10870, 16360, 1526, -2340, -1973, -9912, -20193, -28920, -19741, -13782, -13968, -7455, -10112, -14746, -3520, 8792, 9881, 6454, 9150, 8164, 1515, -5390, -12267, -8063, -3817, -7024, -23812, -23833, -22351, -21007, -17167, -22956, -25050, -20038, -13727, -12061, -16946, -29578, -27974, -11316, -14255, -17822, -15877, -16277, -21452, -7193, -7919, -3755, -13899, -24839, -25146, -13894, -18462, -32810, -24457, -18390, -24573, -25616, -18437, -15424, -19136, -20817, -21153, -18280, -13006, -18636, -27911, -7517, 10466, 2763, -5555, 1825, 15729, 8394, -812, 1991, 505, -16514, -16319, -21134, -24202, -39017, -42231, -27803, -8440, 4041, -6465, -1982, 5960, 11400, 6067, 385, -7442, 11700, 9808, -6385, -6880, 6378, 20504, 24481, 25721, 11974, -3191, 1895, -6448, -14270, -11975, -6754, -5796, -9348, 4510, -6256, -2768, 15977]
5743A5977P21o8J1939j6793m424j0701r059J1016k817m874J1173L183j091o740
5729b558j3215k743P434L700j646l121n269p68K549P466P267M251q251k585P187
5714c02M661o613m148j5799P861R945j248j74R516J3494L211j5856J974j070Q942
5699A4394N543j1085j4816n90O858n220p019P588Q542L059N322r055j4832K334
5685h977j1203J7348P934j204J0081N600j1054M316J1006r081j0787N337P483
5672A6799l263k776q222J4246L250J526j0664r245r033q998n235J0262K1783O282
5658A6712j2501o151n902p243o445J372O121J6333j563q10J052R16N620O508j26
5643A3893n83m205r985j3296j1335M749m488K124n699P147K502J3044N526j0430
$$ y = [15977, 16698, 16630, 28569, 11776, 7352, -3349, -12408, -1392, -4209, -9083, 2090, 5273, 4182, -2558, -15773, -18516, -11082, -7382, -9028, -12149, -17418, -18186, -15637, -8171, -904, 3347, -4904, -7489, -302, 4359, -2254, -6402, -22201, -14340, -4395, -5643, -5817, 3699, 17193, 20404, 4548, 6522, 5452, 14394, 19937, 8852, -5964, -6554, 304, -4916, -11935, -4347, 4195, 7254, 12576, 3521, -11311, -8977, -20180, -2832, 5102, 3898, 13979, 19579, 8525, 12841, 23847, 14766, 3979, 9316, 16799, 13536, 10760, 2538, 16784, 20034, 21560, 10896, 1651, -7382, -16380, -21615, -11353, 10430, 16712, 4211, -1940, -7842, -15085, -21530, -20158, -14037, 2296, 733, -77, 975, 1891, 7511, 14019, 13893, 13310, 9105, -880, -14176, -25511, -20762, -25250, -23126, -28825, -21678, -19176, -6132, -606, -11036]
5629a1036k1182J112J2747J0092p485J872J107M72J605O525M921P423m748p825
5615d400N079O558q978L407r00K775p77j5525j0887m927j513R773l821n387j203
5600c0726n850J6809J4663K312n056n283N162J1104j0188o409j724P964j0621
5587a7843r197O173j674J0534J2446R702O461J604j2908R017j6676l698K576l647
5573g130L904R808q244j9733l881J0613k114P05O907O078l301J626J3000R473
5559A7711P207N072q645k0244j9495O094J1844R138m925p94J719j2681M046P694
5545C741J2088j0039q981j5520n504K730N799M779j4005n75K93j1525M076K30
5531c2413P34Q539q154N163J8940N979M188K475k2464o517r776M245R417J7216
$$ y = [-11036, -32218, -31106, -18359, -8267, -15752, -13880, -12773, -12301, -10696, -4171, 750, 8173, 3425, -4400, 679, 7237, -1741, 1666, 766, 3541, 2764, -12761, -23648, -28575, -30088, -20315, -24136, -29523, -30726, -36576, -19767, -5104, -2792, -7848, -13131, -7969, 3135, -7053, -13462, -15186, -7222, -17843, -27040, -20867, -22541, -12007, 439, 10141, 16602, 18206, 5298, 14315, -2361, -6059, -3483, -7130, -3226, 6582, -1662, -21395, -25276, -14663, -16777, -16072, -9165, -3087, -6388, -4762, 8238, 17711, 24918, 29990, 21345, 1101, -18394, -12300, -456, 8682, 3757, 2963, 4682, -7999, -3953, 3741, 15829, 5790, -3191, -18711, -24215, -21485, -15686, -10907, -24912, -25487, -25194, -36719, -32643, -32413, -31679, -23140, -31294, -26131, -7191, -1212, 2976, 5451, -17013, -23530, -33306, -29061, -19644, -2428]
5517b428J2106j0079J1249N968P601J2152j9323k15J0074J804j0511k5682o344
5504a3628O178J6866j864k1332n42N922m331j2359O64J3366N921p700M265J6405
5490G831k682m548J6076M269Q757j2018j1546p950m375J4320j887l892j0052J344
5476f353L168K0205R13l392n428r881j7583M403L836m158L118n903J2394J0006
5462E345m491K238J0144N62l925J53k92l902j354J767N23j6037j9026L895N778
5447a8622P446j2549m028J0505K549J634on518j928k358m298q163J2722K1273
5433a341N86r367j61J34M563o810k0517r132J4881N666R069J8332j3065p401j3355
5418b7918N828O370J8J0660N734m069J002O801o040r398l414Q34j0584p652M722
$$ y = [-2428, 9678, -401, 10848, 16816, 24417, 36569, 17246, 17031, 27105, 28909, 18398, -7284, -13628, -7450, 9416, 7552, -13780, -14322, -8400, -12731, -25090, -24426, -11060, -5139, -12839, -8574, 7831, 5149, 601, 16677, 20946, 29703, 17685, 6139, -1811, -6186, 8134, 6247, 2355, -7697, -6353, -3185, 17020, 17933, 14541, 9113, -768, -18351, -13948, -10112, -14270, -11152, -17055, -4661, 5345, 854, 3092, 13236, 13798, 9873, 10026, 9734, 5832, 4478, 6245, 6768, -9269, -28295, -24400, -18622, -11176, -23725, -27753, -17248, -14699, -13065, -13071, -18589, -20517, -22875, -27173, -35336, -22614, -1341, -755, -10122, -10283, -10149, -5586, -12396, -32913, -42045, -27164, -21498, -12429, 5903, -7162, -14563, -27918, -22090, -15720, -15702, -5042, 692, -3377, -2375, 4426, -1614, -11012, -14426, -13592, -24176, -31828, -27106]
5403b7106K0833J3338n031P194l506j8283j5269m401l680P697j893K656j1147
5390c8598L129J2658J8576N865m795j0630N562J446n538j1666P171n720j045Q312
5376a5273O112L232m106P561j562R646j901j3302N114M993J4101j780L013J3489
5362B9337k2230j9991O907L496l03r205r198l206M5K34j2423m375J4655K0875
5348e382N106M753j2947l413P354n157N148O210j9703q36k094M18J1538j0745
5334a9750J500K0256l71R038o262j1803r908m03L361l168k288R906j45q631J015
5319a7653J513M00J1484R066j0592j7886M03k50J1081O722j7641j4223j3433J0681
5305d0328J2766J2099J0850J9756k848m38J4832J812k2253j3099O931n065o072
$$ y = [-27106, -6273, 7065, 2034, 9228, 5722, -12561, -27830, -32231, -35911, -28214, -30107, -27451, -38598, -35469, -22811, -4235, 1630, -3165, -13795, -8233, -6787, -12325, -23991, -16820, -22540, -23585, -15273, -9161, -5929, -10035, -2474, -4036, 5610, 3709, -9593, -4479, 514, 14615, 12835, 15848, 29337, 7107, -12884, -5977, -2481, -2784, -11989, -21187, -24393, -24348, -24114, -36537, -40912, -26257, -5382, -276, 4477, -8470, -11883, -4529, -9686, -4538, 1672, -18031, -18867, -20961, -20543, -9005, -19750, -18250, 2006, 1635, 10673, 4411, -7392, -17300, -17703, -14342, -17510, -19798, -9892, -10037, -18668, -17653, -16140, -15740, -4256, 4810, -5782, -23668, -23265, -23515, -12434, -5712, -23353, -37576, -51009, -40328, -27562, -15463, -4613, 15143, 12295, 11857, 26689, 28501, 6248, -6851, 80, -4985, -11057]
5292a1057o110K5241K3712K70m320O4r381p970m429q628k78l439j411k969L058
5277g647J1913K2975J412q960m619o215j7794L276J6217J0393q912k1241j2123
5264b1325m618j465M225J6721J4071N476m917K609R502k442j8904n423m45J063
5250e872j106n608O786j1059j6888J2106P556J546m066m631n042j184J2722J0214
5236d526j1801L515M858M515j0228K08Q439J2282P176N12j3123l191J7684M153
5222B0473j6573K979m03m894q191L293K455M705l586j2031j2057o944M144K0129
5208f501O062n806o135L810Q716p063m995o591k133J3485J0498m504j2538k753
5194a6448O304N618N424j2705l533P86J059J0731J0475j2720j7513K063K471K172
$$ y = [-11057, -17167, 8074, 31786, 32056, 27736, 27800, 18419, 10449, 6020, -2608, -2886, -6325, -7736, -10705, -7647, 4266, 27241, 28653, 19693, 15074, 8859, -8935, -5659, 10558, 20951, 12039, -9202, -21325, -25943, -27408, -23183, -6462, 7609, 13085, 8168, 10777, 20279, 17837, -1067, -6490, -6935, -5872, -6978, -12586, -5800, -16859, -33747, -21641, -14085, -12539, -16605, -21236, -26278, -27462, -14740, -4526, -16327, -12812, -7954, -3439, -13667, -13459, -5020, 7262, 14438, 14950, 1827, -1364, 16320, 20473, 3900, 6879, 6476, 1582, -6609, -3316, -861, 3844, 258, -11773, -23830, -30774, -26630, -6501, -439, -6245, -12380, -8570, 146, -6917, -11912, -18503, -20636, -7151, 3347, -1157, -13695, -16448, -10144, -4526, 898, -11807, -15340, -14554, -13495, -2764, 7711, -5009, -22522, -20459, -17988, -15816]
5180a5816Q715M676k79P657m06k6703r426L962J2701R643l046q533P938k721j0769
5165b2407r974O852K747M290K0646M535r70j7104k4957L875J7589J7675o116N706
5151B387M299J436k272J447j7988J044O141j0795o98m479n031Q951R752J5978
5137A0172L998n914R35l31j0112J710J577m653j012p321O291n592j0565j832P248
5122a5401o192k770J0123P979N716j0510N791k335L571M837o650j304k240m224
5108a3609r249N978N170R256r781j1485k923J0427l643l967N761N114k629n34
5094a6114M430L445J4482Q76K519m484r546l331j1162L670J0412m981q158L500
5080a4442J6013J369j963n63q881j1365j226o51J8993j336o304o495P793M496
$$ y = [-15816, -7101, -2425, -2704, 4953, 4547, -22156, -31582, -27620, -14919, -5276, -8322, -16855, -8917, -11638, -22407, -32381, -25529, -22782, -18492, 2154, 6689, 5719, -11385, -36342, -32467, -14878, 2797, -3319, 2387, 6686, 8122, 5850, 7297, -10691, -9647, -3506, -14301, -14999, -19478, -24509, -15558, -5806, 10172, 14170, 8256, 9191, 8860, -1252, 458, 2035, -2618, -3630, -10951, -4660, -10252, -20817, -22649, -15401, -21593, -24363, -14240, -6261, -545, -11055, -5264, -7599, -4028, 809, -5841, -7145, -9385, -13609, -22858, -16880, -11710, -2454, -12235, -23720, -26643, -16216, -19859, -23826, -18065, -12951, -15580, -16114, -11684, -8239, 6243, 7119, 9638, 5154, -4392, -7723, -18885, -15215, -4803, -9784, -17942, -14442, 1571, 2940, 977, 414, -8467, -19832, -21058, -21709, -2716, -4052, -10356, -16851, -9058, -4562]
5066d562J0240P271O004j560m955m808M59R8k13k124L51o685p495m859J412Q489
5050b937P840j6561p463J3584J3216j0632j4629o606J2585l602M457r707N212
5037a5243J7279J8422m357j2615q833q0Q601L17j4200o236l984J325J0023O365
5023c216N421Q847j568j4803r672J2080Q585J870j5988j5946r303o764R995L004
5009b7458k766O925J3912J9077q02j3246k0565p731J126P493J0162k073K95J6540
4995H89k348p862O372P129m934r415l840M692L26J531k08j6516J597l299J5241
4980a0645O186p832k051J1771N246l812K615j942r868J63J979N059q723j4060
4966b5914J0433J5280J3881O453o114j2695K517J6987j0141q484j1538k041J3636
$$ y = [-4562, 5678, 12949, 18953, 17393, 12438, 7630, 8089, 8187, 7974, 5850, 6201, -484, -7979, -12838, -11426, -2937, 4903, -11658, -19121, -5537, 7679, -2953, -17582, -24188, -11603, -15205, -10748, -20455, -15243, 2036, 20458, 16101, 3486, -5347, -5427, 3174, 3491, -10709, -16945, -20929, -19604, -9581, -3216, 2205, 11052, 9484, -5319, -14991, -2911, 5674, 7544, -8444, -24390, -33693, -40457, -30462, -27458, -30224, -23299, -9387, 9690, 8888, -4358, -24923, -32654, -31528, -24035, -13873, -15946, -15651, 889, -1459, -9321, -2949, 4180, -754, -10169, -14009, -9317, -8991, -7460, -7668, -24184, -22587, -25886, -10645, -4459, -12291, -14342, -2571, 2675, -1137, 1478, -464, -10332, -10169, -8190, -3131, -11854, -25914, -15481, -201, 13680, 20133, 14019, 1324, 3841, 20828, 10687, 2203, -9335, -11376, 2260]
4953B260L047j0050j8421R371J4674r028j1095J877m134q111M355N871J3153Q122
4939A891j0090q866O118N35j52Q820P664n840o593j769m396n59n961k2038Q992
4924c2244N911J8827p12j8244j992J3420k515P089J5945M534j0352j0776O680
4911d429Q425l710l716M960K551r758l183M762Q368l439K996m0n177m124J6796
4896A1282r748k772J3270L997o173L726m299o285j6654o436R107m304q773J1987
4882a2075l071p897J0156Q468P484L349p61o981R136p206j3902J159N965j606
4868g782n207n438K0678k71n874o219O346M123Q053k109r88O241l220n343n737
4853b747r955k2905K54Q472O233O404K420J0054M371N046j1048p925r278P928
$$ y = [2260, 5307, -4743, -23164, -13793, 881, -8147, -19242, -17365, -21499, -29610, -25255, -19384, -6231, 1891, -8199, -17065, -10947, -10412, -10564, -1744, 5920, 80, -6513, -8282, -12678, -13237, -19198, -41236, -32244, -26333, -7506, -8218, -26462, -28454, -15034, -17549, -10460, 5485, 10019, -333, -11109, -4429, 3996, 286, -3430, 1530, 4081, -5677, -8860, -4098, 4270, 831, 3827, 3787, -1390, -5514, 11282, 1534, -1238, 12032, 16029, 9856, 13582, 9283, 2998, -13656, -20092, -10985, -15289, -24062, -12075, -15146, -23043, -12887, -4419, 3065, 6414, 5653, -1328, 7808, 602, -13300, -12141, -6176, -7782, -12989, -18427, 2251, 1980, -3894, -10113, -3767, 356, 8409, 6300, 5312, 11553, 8333, 2990, -2747, -12702, -35607, -35353, -26881, -20648, -14244, -11824, -1770, 2601, 7647, -3401, -11326, -20604, -12676]
4839a2676K975l226k155N126J4939M693j2317k1781m84J2476k625j1755K043R89
4825b3778O502O042N495J269l212N088j669o895p418P63o080P791j5094M887J8065
4810h244J7278q567r424p206j1894P85J0325J1564o444N857N183l828j0824j730
4796a7169L915j673P954o052O294M12r988J2699N344k914l82o356N774l5n262
4781g439j813P380n328j1032j1253n294J736j395N566J8395Q681J313l705j7977
4767b2165m632J5401K775J613j67m956r546Q184Q066L788J0345K295K455l000
4753A0456Q771l724P294o842k670n361r737k005k49j967J7859J3210Q7k0604j7949
4738a3431p495R64p85J7672N661M72J1242k590n071m61J2880n324k1814j3844
$$ y = [-12676, -9701, -12927, -15082, -9956, 4983, 9676, -2641, -24422, -24906, -12430, -15055, -26810, -24767, -23778, -17276, -11234, -5739, -4470, -7682, -2594, -4263, -11158, -18576, -17813, -23893, -16102, -31196, -26309, -8244, 9034, 467, -8957, -16163, -28057, -27272, -16947, -5383, -11827, -5970, -787, -4615, -15439, -17169, -13254, -14927, -6973, -13025, -6731, -6319, -16307, -3608, 1736, -1178, -1560, -7916, -2142, -2177, -7439, -9252, -1872, -7200, -18232, -29485, -34779, -33043, -34438, -28872, -10477, -1796, -483, -4188, -22165, -26797, -11396, -8621, -7008, -7175, -12131, -21677, -13493, -5427, -1639, 8706, 11001, 13456, 10456, 19227, 15503, 22797, 15955, 13285, 7924, -1813, -3818, -4067, -6034, 11825, 25035, 25122, 4518, -13431, -20926, -19962, -20747, -3075, 2586, 3058, 14300, 11710, 6639, 6178, 19058, 13734, -8080, -21924]
4724b1924q803j3666n463K6139Q828j496k969M568p072n364m675n379J999R623
4710b5654R719J6813J0308k395L82O728J1130l333p991r235j0824m935J0762J1873
4696A3348K304j0246l149J1408J0428q712N206l928p105o794j3370J336J4623
4683E349q224r411J0204N89P406P85P643R88o046p322j5906l004J039J5221j770
4668b459l713k073M323j8149j5399M598K5190R701j5381P904Q302l699o086J6507
4654I566j1331j7554J2209p21L585j7676j0642J4560O040J850K4319J2798p095
4641A9908p536j619j0605O055J669L315N088m761m075j3501j6880L159j089P270
4627a3602j656m93L903R223J711m124O80o641J434N313R36k839L325Q439N628
$$ y = [-21924, -30727, -44393, -49856, -23717, -14889, -16385, -19354, -14786, -21858, -27222, -31897, -37276, -35277, -25654, -15935, 878, 11186, 8791, 9173, 15901, 27031, 23698, 15707, 6472, -4352, -9287, 1475, 13348, 15652, 5406, 2257, 13665, 24093, 15381, 20587, 16659, 9554, 2760, -10610, -9274, 5349, -2875, -12286, -2082, -1493, 5913, 6698, 14341, 15329, 9283, 1961, -13945, -16949, -15910, -689, -2459, -6172, -8245, -3922, -22071, -37470, -32872, -7682, 2019, -13362, -5458, 2844, -855, -6941, 9566, -1765, -19319, -7110, -7831, -4246, -21922, -32564, -18004, -11964, -10114, 14205, 27003, 19908, 12372, 10753, 148, 6203, 7872, 11187, 16275, 11514, 7439, -6062, -22942, -19783, -20872, -13602, -15258, -15751, -11848, -2625, -914, -5038, -4358, -10999, -9565, -4252, -3316, -6155, -2830, 5609, 11237]
4612A1237R477l043n841K391p234N354m079m477q420j3555J7645O35j1073k140
4598a3123o25k098q44o084J9518J3868J673O65m774L554q324j447P2J1757P80
4583A4568p639K044m242J854J2818M001l263q091k458k961L427J8416R782o159
4569C2097o299p566n588m874l105K499O109n455p253p495n210R377q56q167n650
4554a7436J4674P762M174J0154n880j8701p032J2649n656r864m249Q657J2537
4541A789j352j4834P153L974j08o187j5059R435M892o017L52J839k376J5258J925
4526F84j2502j304K826j2007j2040P239M348j0304J574L714J2892K0496r724j4382
4512a8490j5474P001P709N925K815P125l437l41K919r834l823K411j287j277R267
$$ y = [11237, 20714, 17671, 11830, 14221, 6987, 12341, 8262, 3785, -4635, -18190, -545, 90, -10983, -13123, -13748, -15846, -16690, -22774, -3256, 10612, 12285, 12950, 8176, 11730, 3406, 1959, 2031, 13788, 14568, 6929, 8973, 4731, 6585, 19403, 23404, 20141, 12050, 9592, 6631, 10058, 28474, 38256, 32097, 25798, 18232, 12644, 7770, 4665, 7164, 13273, 7818, 565, -6930, -12140, -2763, -3619, -11786, -17436, -2762, 5000, 9174, 19328, 13448, -5253, -12285, 364, -5292, -15156, -19405, -10748, 1789, 437, -14397, -7244, -3270, -3378, -9565, -24624, -15189, -10297, -16314, -15962, -14123, -16499, -1241, 684, -11818, -13122, -10296, -22303, -34343, -27104, -22756, -33060, -31486, -27772, -14880, 5616, -4108, -18490, -33964, -26963, -19254, -13329, -10514, -3389, -6826, -7167, -4248, -14082, -17905, -15494, -16781, -18058, -8791]
4497h791n953n35M073M256J401m387P84P119J3540o296L359N335k644l970N984
4482A3275m637m172R056J3339O552n389k3875j7013M389M990n716M917p4L08R69
4467c081j5584p141k442J0039O484o834N257J702J39N322J5576o785j000M545
4453F197K801r332K432m773J392M120L87O349J0056j5557J918K982K952j1243
4439F81j7344P340N686Q321J1276R903j1034k642O16j0028r757L743j707l142
4425h088J0146j99l223j3393j0584J4662k513N220m368J272Q143j2878m247l634
4411b3684m235Q43M303J4534J0484R409M481J777O198k122j3828j2354j016q266
4397a3476n956j6471R199K1983J1293l524P696p718n233J744K086j3365p464q506
$$ y = [-8791, -14744, -15279, -11206, -6950, -5549, -9936, -9152, -2033, 11507, 5211, 8570, 13905, 11261, 7291, 13275, 8638, 4466, 13522, 26861, 33413, 28024, 4149, -12864, -8475, -3485, -9201, -4284, -4358, -4050, -3081, -18665, -25806, -28248, -18209, -11725, -18559, -13302, -11600, -11461, -6139, 9437, 2652, 1652, 6197, 8998, -334, 2098, -2675, -1283, 2837, 3224, 9573, 19629, 4072, 5990, 8972, 11924, 681, -16663, -9323, -3637, 4684, 15960, 25863, 14829, 12187, 12803, 2775, -6982, -3239, -4946, -8088, 2058, 1859, -1364, -14757, -25341, -10679, -13192, -7972, -12340, -11068, -2925, -15803, -20050, -23684, -27919, -27076, -22773, -8239, 2245, 11654, 16135, 17912, 24110, 21988, 8160, -4194, -5210, -13476, -19432, -35903, -26704, -4721, 6572, 3048, 10744, 3026, -2207, -463, 1623, -11742, -19206, -27712]
4383b7712M102N933J2870J0442r75M527m648q426N356M491K760n983j4862K279
4369i846M264J408J0181j359J103P361j0012J669J4791N242q313j7515q680J2582
4355B876J3215p125n774q938L915P012k413K747o437k275m941n995K881l553j0799
4340b5604j422P473J4631J0745p315L810L12n446r686O336k636L633L645L898
4326B374j016l066K814j871r44R67M551N450P188m774j4351R471J4159N475m213
4311B2214N310M056j6906j2708o087p950J1359O712l791j4536L046J9030P572
4298A7321j0477q290p414l486J218m628n877J2563Q983j6231j3715R968J4961
4285e104J3989m883k0494m00J4339J0076q85j5433j0873J4360J0378L765Q05n41
$$ y = [-27712, -23610, -17677, -4807, 5635, 4660, 9187, 4539, -3887, 1469, 5960, 8720, 2737, -12125, -9846, -5582, -4174, 6007, 4648, 5751, 13112, 3100, 4769, 19560, 24802, 16489, -1026, -9706, 2876, 16091, 8966, 3192, -5746, -1831, 5181, 2768, 5515, -922, -3197, -8138, -14133, -11252, -14805, -25604, -27026, -19553, -4922, 5823, -1492, 2318, 2630, -2816, -12502, -6166, -8802, -5169, -1524, 2374, 1358, -1708, 1106, -765, -1709, -742, 3809, 9259, 16447, 11673, -2678, 6793, 20952, 26427, 22214, 27524, 31580, 14674, 1966, -4121, -12071, -712, 6000, 2209, -12327, -9281, 9749, 17321, 6844, -1446, -8860, -12346, -11128, -15756, -21633, -9070, -87, -16318, -30033, -20065, -5104, 8885, 4002, -16492, -16892, -2553, 7523, 6638, -8795, -19668, -5308, 5070, 8835, 9640, 9099]
4271I099K265J366q027o19j2452N658J4419J355N520p800j1963o058J0670J7714
4257B1147k682k3203p250N059J2340l532j2088q636L873L970J7279O495J1572
4244B4344P095l098p95j912k468j77o849K923j0030j4214j7216K728N809r959
4230b3819J061K164q58J3040J1825k2446j910J0383N243k590P80M484m228R198
4216B327P44k985N477j930R08k666o689K369n864j017M665M581J3499P464n766
4201A5117k2792n670p509J359O187n79O974P808J507P892j449K913n996r32m493
4186C37M346R12n495O717j2191k5576L396P611J022Q125K633j0621K468J8411
4172B095J5073K350j0413k0154j4140O463K2117J8396Q854j7176k7811k42P373
$$ y = [9099, 11364, 12730, 4703, 4084, -8368, -2710, 11709, 13064, 18584, 10784, -1179, -7237, 3433, 21147, 18465, -4738, -11988, -6929, 5411, 1879, -10209, -18845, -14972, -11002, 6277, 12772, 24344, 31439, 28341, 27546, 25634, 23166, 22989, 16140, 19063, 9033, -5181, -22397, -19669, -13860, -23819, -22758, -20594, -21452, -8412, 3413, -19033, -20943, -10560, -5317, -7907, -7127, -2643, -6871, 2327, 3071, 86, 5563, 3633, 4541, 1875, -4814, -2445, -8309, -9326, -4661, -80, 13419, 20883, 15117, -7675, -13345, -20854, -19495, -13308, -13887, -6913, 895, 2402, 10294, 8845, 11758, 5762, 4830, 337, 4683, 5595, 100, 6817, -5374, -30950, -27554, -19943, -18921, -10796, -8163, -18784, -16316, 2095, 17168, 19518, 9105, -11049, -25189, -18726, 3391, 21787, 30641, 13465, -14346, -14588, -7215]
4159g215N007J0784n113O136l666n929j546M079j3782p317J0877J6840J152r254
4145A053J0008m219m291k723o275j4553l935P181K747m383M744N624k206p068
4131a8296J1143J841m356K936m797r619N579J126Q779K015j1916N819P250k38
4117b734q987P15L596J861P877Q916J0968j3098j3147k0359l433l184L873M24
4103b6712K474J0102J4620J0691N526L486k28j332m228Q124n635J771r225r684
4089b50q876J387K457p155O195M209k993k000p281J631O549Q05K572J2854N370
4074A5474k3481j376O973O194J1629P323l21p088j5759k2698k29J6949J8004J7905
4060B9499k931j9761N04l041r730J4814l249k7874r519k975l675J5396J2203J3271
$$ y = [-7215, -2208, 8576, 3463, 9599, 5933, 4, -1542, 2537, -11245, -18562, -7685, 9155, 10307, 1053, 11061, 6842, 2551, -172, -6447, -21000, -24935, -17754, -15007, -19390, -14646, -9022, -11228, -18296, -7153, -5312, -9668, -6732, -11529, -21148, -15569, -14443, -5664, -3649, -15565, -9746, -2496, -2734, -11721, -11006, -7410, -5549, 2328, 11244, 22212, 9114, -4033, -24392, -27825, -31009, -27136, -26712, -24238, -14136, 484, 11175, 16701, 20187, 19959, 18627, 14399, 22523, 16888, 18659, 9434, -250, -9126, -7739, -5282, -12437, -6242, -2033, -5026, -7026, -14307, -12676, -6127, -5322, -2750, 10104, 15474, -8007, -9383, -2410, 3784, 15413, 22736, 22415, 15327, -432, -23130, -23359, -6410, 11594, 29499, 26568, 6807, 7311, 4270, -5460, 9354, 6105, -21769, -31288, -34263, -37938, -22542, -10339, 2932]
4046B932J1061k857r025k328k051k722q52q40J344j171L844q139N552P477M108
4031F333o819j9191p376Q556J0065j563N703N58n492M675m247r696O365J1037
4017a092j996j2414K398J7304Q865k3670k0618o026R590N856R742N215l090N574
4003d362Q91p778m746J3722n13n462L090Q492R999j2527j676j03r384n387n002
3988b0746k584K0416J0286p483n851J526J387k138r231O527R173P608N00l400
3974E990j3148j930L124J130O52J989P54M34o298k210l684P089j3753q778J0726
3959a7913R802J0332m423L476K578j2709L979M940K436K350M526q454K35N737
$$ y = [2932, 13993, 11136, 2111, -217, -2268, -4990, -5842, -6682, -5338, -6509, -2665, -10804, -5252, 2225, 6333, -486, -19677, -27053, -18497, -8432, -9995, -4292, -3734, -9226, -4551, -8798, -18494, -12129, -1092, -3088, -15502, -13104, 4200, 13065, -10605, -31223, -37249, -27659, -21803, -12061, -6846, -9936, -4362, -3471, -11249, -15995, -2273, -2786, -8248, -5158, 3334, 13333, 806, -870, -973, -10357, -15744, -20746, -23330, -2914, 7372, -111, -5962, -4436, -3049, -5187, -14418, -7891, 1282, 8890, 9390, 5990, -7158, -9088, -5964, -4834, -4182, -2193, -1439, -1005, -7303, -9513, -13197, -6108, -19861, -28639, -17913, -8111, 2221, -2202, 1274, 3852, -8857, -4878, 62, 2498, 4848, 9374, 920, 1155, 6892]
$$ [...]
##END NTUPLES=NMR SPECTRUM
##END=
