##TITLE=Analysis number 319981
Compound Code cc 53763
Book Reference 458/136/2
Project Code adrs
Chemist Name stevem
##JCAMPDX= 6.0         $$ Bruker NMR JCAMP-DX V2.0
##DATA TYPE= NMR SPECTRUM
##DATA CLASS= NTUPLES
##ORIGIN= Bruker BioSpin GmbH
##OWNER= nmr
$$ XWIN-NMR		Version 3.5
$$ Fri Jun  9 08:37:57 2006 GMT Daylight Time (UT+1h)  MAYBRIDGE\nmr@NMR_250MHZ
##.OBSERVE FREQUENCY= 250.131544655141
##.OBSERVE NUCLEUS= ^1H
##.ACQUISITION MODE= SIMULTANEOUS (DQD)
##.ACQUISITION SCHEME= undefined
##.AVERAGES= 16
##.DIGITISER RES= 18
##SPECTROMETER/DATA SYSTEM= dpx250
##.PULSE SEQUENCE= zg30
##.SOLVENT NAME= DMSO
##.SHIFT REFERENCE= (INTERNAL, DMSO, 0, 16.522)
##AUDIT TRAIL= $$ (NUMBER, WHEN, WHO, WHERE, WHAT)
$$ ##TITLE= Audit trail, XWIN-NMR		Version 3.5
$$ ##JCAMPDX= 5.01
$$ ##ORIGIN= Bruker BioSpin GmbH
$$ ##OWNER= nmr
$$ C:\u/data/dgb/nmr/ADRS/470/pdata/1/auditp.txt
$$ ##AUDIT TRAIL=  $$ (NUMBER, WHEN, WHO, WHERE, WHAT)
(   1,<2006-06-09 08:37:31.18 +100>,<MAYBRIDGE\nmr>,<NMR_250MHZ>,
      <created by zg, POWCHK disabled, PULCHK disabled
       configuration hash MD5:
       E2 DF 36 D8 04 B2 41 60 5A D7 A3 38 5A 4B D0 FE
       data hash MD5: 64K
       A1 79 5C 65 90 CF 05 1B 01 99 BF BF 8F EF 6E A6>)
(   2,<2006-06-09 08:37:45.73 +100>,<MAYBRIDGE\nmr>,<NMR_250MHZ>,
      <Start of raw data processing
       ef LB = 0.3 FT_mod = 6 PKNL = 1 SI = 32K 
       data hash MD5: 32K
       E9 B3 DB 36 90 D3 65 6E 68 9B C6 D9 6F FC 3C D8>)
(   3,<2006-06-09 08:37:47.39 +100>,<MAYBRIDGE\nmr>,<NMR_250MHZ>,
      <apk 
       data hash MD5: 32K
       73 8D BD 12 69 D9 99 48 D1 96 EB 95 04 0B 9F 80>)
(   4,<2006-06-09 08:37:48.34 +100>,<MAYBRIDGE\nmr>,<NMR_250MHZ>,
      <abs ABSG = 5 
       data hash MD5: 32K
       AB 36 7D EF 9D 57 76 9C D5 44 E2 44 13 A6 6E 54>)
$$ ##END=
$$ 
$$ hash MD5
$$ A5 EA C9 0B DA 5C 2C 03 BC D1 09 65 43 E9 8A F7
##$RELAX= 
##$RELAX= 
##$RELAX= 
##$RELAX= 
##$RELAX= 
##$RELAX= 
##$RELAX= 
$$ Bruker specific parameters
$$ --------------------------
##$DU= <C:\u>
##$EXPNO= 470
##$NAME= <ADRS>
##$PROCNO= 1
##$TYPE= <nmr>
##$USER= <dgb>
##$AMP= (0..31)
100 100 100 100 100 100 100 100 100 100 100 100 100 100 100 100 100 100 
100 100 100 100 100 100 100 100 100 100 100 100 100 100 
##$AQSEQ= 0
##$AQ_mod= 3
##$AUNM= <au_zg>
##$AUTOPOS= <15 >
##$BF1= 250.13
##$BF2= 250.13
##$BF3= 250.13
##$BF4= 250.13
##$BF5= 500.13
##$BF6= 500.13
##$BF7= 500.13
##$BF8= 500.13
##$BYTORDA= 1
##$CFDGTYP= 0
##$CFRGTYP= 5
##$CHEMSTR= <none>
##$CNST= (0..31)
1 1 145 1 1 1 1 1 1 1 1 1 1 1 1 1 1 1 1 1 1 1 1 1 1 1 1 1 1 1 1 1 
##$CPDPRG= <>
##$CPDPRG1= <>
##$CPDPRG2= <>
##$CPDPRG3= <>
##$CPDPRG4= <mlev>
##$CPDPRG5= <mlev>
##$CPDPRG6= <mlev>
##$CPDPRG7= <mlev>
##$CPDPRG8= <mlev>
##$CPDPRGB= <>
##$CPDPRGT= <>
##$D= (0..31)
0 1 0 0 0 0 0 0 0 0.06 0 0 0 0 0 0 0.0002 0 0 0 0 0 0 0 0 0 0 0 0 0 0 
0 
##$DATE= 1149838649
##$DBL= (0..7)
120 120 120 120 120 120 120 120 
##$DBP= (0..7)
150 150 150 150 150 150 150 150 
##$DBP07= 0
##$DBPNAM0= <>
##$DBPNAM1= <>
$$ [...]
##$SUBNAM7= <"">
##$SUBNAM8= <"">
##$SUBNAM9= <"">
##$SW= 20.6930455092707
##$SWIBOX= (0..15)
0 0 3 0 0 0 0 0 0 0 0 0 0 0 0 0 
##$SW_h= 5175.983436853
##$TD= 65536
##$TD0= 1
##$TE= 296.16
##$TE2= 300
##$TE3= 300
##$TEG= 300
##$TL= (0..7)
0 120 120 120 120 120 120 120 
##$TP= (0..7)
150 150 150 150 150 150 150 150 
##$TP07= 0
##$TPNAME0= <>
##$TPNAME1= <>
##$TPNAME2= <>
##$TPNAME3= <>
##$TPNAME4= <>
##$TPNAME5= <>
##$TPNAME6= <>
##$TPNAME7= <>
##$TPOAL= (0..7)
0.5 0.5 0.5 0.5 0.5 0.5 0.5 0.5 
##$TPOFFS= (0..7)
0 0 0 0 0 0 0 0 
##$TUNHIN= 0
##$TUNHOUT= 0
##$TUNXOUT= 0
##$USERA1= <user>
##$USERA2= <user>
##$USERA3= <user>
##$USERA4= <user>
##$USERA5= <user>
##$V9= 5
##$VALIST= <valist>
##$VCLIST= <CCCCCCCCCCCCCCC>
##$VD= 0
##$VDLIST= <DDDDDDDDDDDDDDD>
##$VPLIST= <PPPPPPPPPPPPPPP>
##$VTLIST= <TTTTTTTTTTTTTTT>
##$WBST= 1024
##$WBSW= 4
##$XGAIN= (0..3)
0 0 0 0 
##$XL= 0
##$YL= 0
##$YMAX_a= 323542
##$YMIN_a= -534040
##$ZGOPTNS= <>
##$ZL1= 120
##$ZL2= 120
##$ZL3= 120
##$ZL4= 120
##$ABSF1= 16.522
##$ABSF2= -4.171173
##$ABSG= 5
##$ABSL= 3
##$ALPHA= 0
##$AQORDER= 0
##$ASSFAC= 0
##$ASSFACI= 0
##$ASSFACX= 0
##$ASSWID= 0
##$AUNMP= <proc_1d>
##$AZFE= 0.1
##$AZFW= 0.1
##$BCFW= 0
##$BC_mod= 0
##$BYTORDP= 0
##$COROFFS= 0
##$CY= 12.5
##$DATMOD= 1
##$DC= 0
##$DFILT= <>
##$DTYPP= 0
##$F1P= 14.0000005364418
##$F2P= -0.99999901652339
##$FCOR= 0.5
##$FTSIZE= 32768
##$FT_mod= 6
##$GAMMA= 0
##$GB= 0
##$INTBC= 1
##$INTSCL= 1
##$ISEN= 128
##$LB= 0.3
##$LEV0= 0
##$LPBIN= 0
##$MAXI= 10000
##$MC2= 0
##$MEAN= 0
##$ME_mod= 0
##$MI= 0
##$NCOEF= 0
##$NC_proc= -5
##$NLEV= 6
##$NOISF1= 0
##$NOISF2= 0
##$NSP= 0
##$NTH_PI= 0
##$NZP= 0
##$OFFSET= 16.522
##$PC= 1
##$PHC0= 158.2943
##$PHC1= 18.83859
##$PH_mod= 1
##$PKNL= yes
##$PPARMOD= 0
##$PSCAL= 4
##$PSIGN= 0
##$REVERSE= no
##$SF= 250.13
##$SI= 32768
##$SIGF1= 0
##$SIGF2= 0
##$SINO= 400
##$SIOLD= 32768
##$SREGLST= <1H.DMSO>
##$SSB= 0
##$STSI= 32768
##$STSR= 0
##$SW_p= 5175.98343685301
##$SYMM= 0
##$S_DEV= 0
##$TDeff= 65536
##$TDoff= 0
##$TI= <Analysis number 999999
Compound Code 99
Book Reference 9
Project Code 9>
##$TILT= no
##$TM1= 0
##$TM2= 0
##$TOPLEV= 0
##$USERP1= <user>
##$USERP2= <user>
##$USERP3= <user>
##$USERP4= <user>
##$USERP5= <user>
##$WDW= 1
##$XDIM= 32768
##$YMAX_p= 326301435
##$YMIN_p= -928663
$$ End of Bruker specific parameters
$$ ---------------------------------
##NTUPLES= NMR SPECTRUM
##VAR_NAME=  FREQUENCY,     SPECTRUM/REAL,   SPECTRUM/IMAG
##SYMBOL=    X,             R,               I
##VAR_TYPE=  INDEPENDENT,   DEPENDENT,       DEPENDENT
##VAR_FORM=  AFFN,          ASDF,            ASDF
##VAR_DIM=   32768,         32768,           32768
##UNITS=     HZ,            ARBITRARY UNITS, ARBITRARY UNITS
##FACTOR=    0.157963299565203, 1,           1
##FIRST=     4132.6476996994, 0,             0
##LAST=      -1043.33573715361, 0,           0
##MIN=       -1043.33573715361, -928663,     0
##MAX=       4132.6476996994, 326301435,     0
$$ Real data points
##PAGE= N=1
##DATA TABLE= (X++(R..R)), XYDATA
$$ [...]
$$ plain form
22629 -207387 -146975 78244 335391 234538 170252 258002 244304 365519 348936 209374
22619 209374 130141 106787 207245 292263 215789 21658 26566 -113917 112854 314384 335623
22608 335623 183829 212138 -229817 -304722 -163151 -30722 100522 -22847 190964 260966
22598 260966 386558 535830 486350 516421 377811 335008 226153 -29994 -129360 -133765 -476764
22587 -476764 -536474 -318825 -278080 -52008 -59204 -239408 -422154 -200700 100884 29760
22577 29760 51636 129988 -259884 -230712 -17935 65648 38674 -61867 -226720 -124684 -131231
22566 -131231 -133545 -182143 -243996 -269979 -258558 -378200 -451569 -398515 -309771 -105938 -43680
22555 -43680 -10396 100727 307026 352943 404315 329412 134236 -92981 -64371 -385673 -331180
$$ packed form
22629b07387O0412K25219K57147j00853o4286Q7750j3698J21215j6583j39562
22619B09374p9233k3354J00458Q5018p6474j94131M908j40483K26771K01530K1239
22608C35623j51794K8309m41955p4905J41571J32429J31244j23369K13811P0002
22598B60966J25592J49272m9480L0071j38610m2803j08855k56147r9366m405l42999
22587d76764n9710K17649M0745K26072p196j80204j82746K21454L01584p1124
22577B9760K1876P8352l89872K9172K12777Q3583k6974j00541j64853J02036o547
22566a31231k314m8598o1853k5983J1421j19642p3369N3054Q8744K03833O2258
22555d3680L3284J11123K06299M5917N1372p4903j95176k27217K8610l21302N4493
$$ plain form
22544 -331180 -337949 -106603 174094 -59495 -88947 194246 264112 230334 178008 107857 250032
22533 250032 455499 348203 225244 364134 367570 339848 230044 207098 163066 -35812
22523 -35812 -98839 36291 59912 -182796 -301061 -135427 -8523 -77210 58219 109666
22513 109666 -103541 77983 286763 407834 313493 386723 428822 393103 276625 270555 90396
22502 90396 4798 85001 153892 60212 -14475 -29110 63853 219695 -29912 -83691 -145175
22491 -145175 -41040 22928 82660 -167724 -259942 -208727 -131093 -362191 -266002 -43955 -50047
22480 -50047 30944 -83496 114478 431304 515170 372418 88535 -120179 -317903 -302682
22470 -302682 -283485 -359685 24117 474819 548509 406420 201534 24450 31226 -61 -288841
$$ packed form
22544c31180o769K31346K80697k33589k9452K83193O9866l3778n2326p0151J42175
22533B50032K05467j07296j22959J38890L436k7722j09804k2946m4032j98878
22523c5812o3027J35130K3621k42708j18265J65634J26904o8687J35429N1447
22513A09666k13207J81524K08780J21071r4341P3230M2099l5719j16478o070j80159
22502I0396q5598Q0203O8891r3680p4687j4635R2963J55842k49607n3779o1484
22491a45175J04135O3968N9732k50384r2218N1215P7634k31098R6189K22047o092
22480e0047Q0991j14440J97974L16826Q3866j42752k83883k08714j97724J5221
22470c02682J9197p6200L83802M50702P3690j42089k04886j77084O776l1287k88780
$$ plain form
22459 -288841 -171373 -2776 25967 5699 9425 -138979 -200608 -178251 -136725 -40182 -346276
22448 -346276 -500637 -257209 -185848 -125728 -585 -145025 -138908 125505 10469 -214488
22438 -214488 -110782 -117880 -167465 166055 140496 -88357 -31575 -162883 -427400 -423374 -278389
22427 -278389 -95502 205048 287524 347104 173959 146843 40543 -279452 -54014 145723
22417 145723 149851 129244 -58521 115239 221526 161275 29928 -55465 -126738 -128733 -1095
22406 -1095 60002 -65642 -190954 -346665 -216091 -53557 55410 149431 324078 114638
22396 114638 -65912 126176 -26010 -8952 239784 376784 298840 139468 -55715 -249254
22386 -249254 -345124 -440855 -371768 30844 320712 149470 96828 9743 -81062 -365572 -183347
$$ packed form
22459b88841J17468J68597K8743k0268L726j48404o1629K2357M1526R6543l06094
22448c46276j54361K43428P1361O0120J25143j44440O117K64413j15036k24957
22438b14488J03706p098m9585L33520k5559k28853N6782j31308k64517M026J44985
22427b78389J82887L00550Q2476N9580j73145k7116j06300l19995K25438J99737
22417A45723M128k0607j87765J73760J06287o0251j31347q5393p1273j995J27638
22406a095O1097j25644j25312j55711J30574J62534J08967R4021J74647k09440
22396A14638j80550J92088j52186J7058K48736J37000p7944j59372j95183j93539
22386b49254r5870r5731O9087M02612K89868j71242n2642q7085r0805k84510J82225
$$ plain form
22375 -183347 181627 188224 116853 117854 -95065 -195369 -179429 -354718 -320908 -126220 -7619
22364 -7619 301686 359508 83544 19463 18339 125296 115711 -38275 -10632 -78668 -59288
22353 -59288 -32080 90152 138930 209941 328300 153758 6117 6336 51706 361000 473923
22342 473923 204715 -125640 -28887 -25373 -75993 -397308 -442486 -195284 -83553 -18297 20013
22331 20013 39314 14821 75146 -165091 -263481 -44633 -75441 -56699 280973 220424 229407
22320 229407 251140 109061 208610 327200 349865 480970 432132 143899 -155104 -298971
22310 -298971 -233196 73331 348179 294762 214134 161701 180316 168325 122897 72769 -70749
22299 -70749 -344628 -127743 -256506 -161888 75502 -173466 -389253 -260639 -92871 -155532
$$ packed form
22375a83347L64974O597p1371J001k12919j00304J5940j75289L3810J94688J18601
22364g619L09305N7822k75964o4081j124J06957r585j53986K7643o8036J9380
22353e9288K7208J22232M8778P1011J18359j74542j47641K19M5370L09294J12923
22342D73923k69208l30355R6753L514n0620l21315m5178K47202J11731O5256L8310
22331B0013J9301k4493O0325k40237r8390K18848l0808J8742L37672o0549Q983
22320B29407K1733j42079R9549J18590K2665J31105m8838k88233k99003j43867
22310b98971O5775L06527K74848n3417q0628n2433J8615j1991m5428n0128j43518
22299g0749k73879K16885j28763R4618K37390k48968k15787J28614J67768o2661
$$ plain form
22289 -155532 -354507 -344615 -306741 -356010 -376091 -340262 -276161 -218060 -490717 -385241 -58093
22278 -58093 -114951 -263062 -148236 -190375 62308 55413 43345 56480 -21372 85767 145751
22267 145751 87104 156948 177721 -20303 -86245 -125080 -360710 -249771 62980 238654
22257 238654 269842 348656 450680 286767 -93779 -283639 -210568 56181 221448 248499
22247 248499 247788 204054 143994 193995 47836 -114232 -16354 113337 150030 152557 -35375
22236 -35375 -78844 -72107 -152671 -283707 -79142 227847 163324 146949 152070 73845 -7580
22225 -7580 -235213 -383418 -430740 -169103 31066 147899 142721 155436 30345 66830 165715
22214 165715 221593 106243 23418 181493 279793 487996 581114 561084 404378 353898 271618
$$ packed form
22289a55532j98975R892L7874m9269k0081L5829O4101N8101k72657J05476L27148
22278e8093n6858j48111J14826m2139K52683o895j2068J3135p7852J07139N9984
22267A45751n8647O9844K0773j98024o5942l8835k35630J10939L12751J75674
22257B38654L1188P8814J02024j63913l80546j89860P3071K66749J65267K7051
22247B48499p11m3734o0060N0001j46159j62068R7878J29691L6693K527j87932
22236c5375m3469O737q0564j31036K04565L06989o4523j6375N121p8225q1425
22225g580k27633j48205m7322K61637K00169J16833n178J2715j25091L6485R8885
22214A65715N5878j15350q2825J58075R8300K08203R3118k0030j56706n0480q2280
$$ plain form
22203 271618 389415 648852 964153 779702 561426 542438 357775 455429 363039 343282
22193 343282 114244 92497 146711 150193 254751 185823 -237252 -307265 -70675 66353 73439
22182 73439 -7672 -62409 172840 328334 402734 279881 189377 102877 160351 -4931 -130796
22171 -130796 -30611 36237 28973 7999 -317418 -390998 -332167 -41946 302980 192186 20484
22160 20484 76313 105859 171425 199709 226850 217996 356664 82236 29072 -19017 -202966
22149 -202966 19572 337328 480236 335356 143963 183849 198195 140532 90472 49129
22139 49129 68674 99577 200529 165229 102542 91402 102988 82605 -97325 101050 84110
22128 84110 99595 16843 -239583 -197670 72315 227322 329769 409374 467503 426460 232743
$$ packed form
22203B71618J17797K59437L15301j84451k18276j8988j84663R7654r2390j9757
22193C43282k29038k1747N4214L482J04558o8928m23075p0013K36590J37028P086
22182G3439q1111n4737K35249J55494P4400j22853r0504q6500N7474j65282j25865
22171a30796J00185O6848p264k0974l25417p3580N8831K90221L44926j10794j71702
22160B0484N5829K9546O5566K8284K7141q854J38668k74428n3164m8089j83949
22149b02966K22538L17756J42908j44880j91393L9886J4346n7663n0060m1343
22139D9129J9545L0903J00952l5300o2687j1140J1586k0383j79930J98375j6940
22128H4110J5485q2752k56426M1913K69985J55007J02447P9605N8129m1043j93717
$$ plain form
22117 232743 -23855 -94472 55734 119978 159292 95788 -74550 -81845 115030 58495 114573
22106 114573 200673 73071 -94891 -251739 -293703 -181495 175739 197680 -22900 -104009
22096 -104009 -58487 34823 53744 27435 24747 -21014 -14325 43395 -62480 -109811 -144503 -125597
22084 -125597 -127329 -145164 17937 -94047 -60709 -25523 15317 101553 16526 87679 44504
22073 44504 130020 82650 -187425 -352047 -271628 -8328 142787 45490 63769 226666 403842
22062 403842 440586 424102 136865 -63194 -55731 -52235 261070 456246 747732 671572 368059
22051 368059 63349 -66665 -64279 -102475 -47424 39513 216937 220434 -6109 -46322 -144700
22040 -144700 -270051 -422581 -412624 -256148 -147481 -144562 81085 289531 419230 131755
$$ packed form
22117B32743k56598p0617J50206O4244L9314o3504j70338p295J96875n6535N6078
22106A14573Q6100j27602j67962j56848m1964J12208L57234K1941k20580q1109
22096a04009M5522R3310J8921k6309k688m5761O689N7720j05875m7331l4692J8906
22084a25597j732j7835J63101j11984L3338L5186M0840Q6236q5027P1153m3175
22073D4504Q5516m7370k70075j64622Q0419K63300J51115r7297J8279J62897J77176
22062D03842L6744j6484k87237k00059P463L496L13305J95176K91486p6160l03513
22051C68059l04710j30014K386l8196N5051Q6937J77424L497k26543m0213r8378
22040a44700j25351j52530R957J56476J08667K919K25647K08446J29699k87475
$$ plain form
22030 131755 -59785 -124422 -138654 58292 410516 438392 301121 289924 115011 -289822
22020 -289822 -305714 148803 4113 -277662 -339292 -273282 -257124 -117866 95952 165239
22010 165239 -4194 78782 83982 -186914 -191919 38209 320169 239306 42036 60906 117717
21999 117717 112990 61823 53434 -62806 36062 21525 116073 175768 237308 105653 60584
21988 60584 -36100 51533 104704 161667 124647 -105140 -83873 -56984 -112524 -236218 -358350
21977 -358350 -372969 -460189 -248372 -1985 -76319 42145 39576 -74028 51200 -49838
21967 -49838 23582 89641 214016 199853 21415 98776 62367 -219863 -530397 -295662 -322236
21956 -322236 -362016 -169142 -101254 64821 -5440 -207116 -334770 56700 82774 -90471
$$ packed form
22030A31755j91540o4637j4232J96946L52224K7876j37271j1197j74913m04833
22020b89822j5892M54517j44690k81775o1630O6010J6158J39258K13818O9287
22010A65239j69433Q2976N200k70896n005K30128K81960q0863j97270J8870N6811
21999A17717m727n1167q389j16240R8868j4537R4548N9695O1540j31655m5069
21988F0584r6684Q7633N3171N6963l7020k29787K1267K6889n5540j23694j22132
21977c58350j4619q7220K11817K46387p4334J18464k569j13604J25228j01038
21967d9838P3420O6059J24375j4163j78438P7361l6409k82230l10534K34735k6574
21956c22236l9780J92874O7888J66075p0261k01676j27654L91470K6074j73245
$$ plain form
21946 -90471 -32021 23010 -268480 -607937 -321073 -149553 -72514 -81652 -16574 62426 207083
21935 207083 241227 -135574 -480120 -535039 -374264 -133353 295720 273405 180338 81419
21925 81419 6865 -73377 -170858 -526328 -650925 -519676 -346508 -201544 -6219 88559
21915 88559 -68325 -191545 -230789 -354890 -399288 -210842 306 112795 148041 245338
21905 245338 214156 176054 217136 143953 254389 191685 115215 177925 205075 82604 113898
21894 113898 86873 72926 245241 213177 312867 314275 473523 370611 96553 94486 63964
21883 63964 -411262 -528158 -208708 -95949 -55924 -326013 -330534 -273762 -257965 -184833 -171647
21872 -171647 -169925 -313368 -522420 -491003 -247002 -151720 -5255 233489 217502 -38194
$$ packed form
21946i0471N8450N5031k91490l39457K86864J71520P7039r138O5078P9000J44657
21935B07083L4144l76801l44546n4919J60775K40911M29073k2315r3067r8919
21925H1419p4554q0242r7481l55470j24597J31249J73168J44964J95325R4778
21915H8559j56884j23220l9244j24101m4398J88446K11148J12489L5246R7297
21905B45338l1182l8102M1082p3183J10436o2704p6470O2710K7150j22471L1294
21894A13898k7025j3947J72315l2064R9690J408J59248j02912k74058k067l0522
21883F3964m75226j16896L19450J12759M0025k70089m521N6772J5797P3132J3186
21872a71647J722j43443k09052L1417K44001R5282J46465K38744j5987k55696
$$ plain form
21862 -38194 -341759 -460132 -345599 -401244 -337016 -86296 -273021 -159866 -2106 32047
21852 32047 26962 109267 133787 -23612 62364 110835 241349 58013 -37057 46703 14550
21841 14550 -134854 -557942 -566519 -233583 94761 -47316 106412 253178 -129530 -294648
21831 -294648 -126221 9951 29903 32374 107546 21253 -103130 -135925 -151251 -39357 -122452
21820 -122452 -211689 -138205 -58519 -252696 -428246 -126913 140587 328485 167447 155074
21810 155074 -33378 -19711 87154 71520 81198 -49354 -179935 -64750 -121104 -86682 -55302
21799 -55302 101224 395853 570108 420110 265304 122136 105517 48903 25406 -60807
21789 -60807 -52777 -105561 -49894 -113239 -160437 40642 288051 369844 96303 50322 -80219
$$ packed form
21862c8194l03565j18373J14533n5645O4228K50720j86725J13155J57760L4153
21852C2047n085Q2305K4520j57399Q5976M8471J30514j83336r5070Q3760l2153
21841A4550j49404m23088q577L32936L28344j42077J53728J46766l82708j65118
21831b94648J68427J36172J9952K471P5172q6293j24383l2795j5326J11894q3095
21820a22452q9237P3484P9686j94177j75550L01333K67500J87898j61038j2373
21810A55074j88452J3667J06865j5634R678j30552j30581J15185n6354L4422L1380
21799e5302J56526K94629J74255j49998j54806j43168j6619n6614k3497q6213
21789f0807Q030n2784N5667o3345m7198K01079K47409Q1793k73541m5981j30541
$$ plain form
21778 -80219 -22567 31338 47075 -7895 83894 -15617 -108464 96484 21846 152741 93437
21767 93437 -87014 -65214 22370 -33697 174523 221368 199658 219192 540703 464393 331399
21756 331399 247785 360455 78552 -142496 -195276 51445 145165 280399 151727 -172117
21746 -172117 -250302 -187646 -267481 -229126 -1513 311471 373899 199116 184495 97453 -60911
21735 -60911 -140442 -71619 -168259 -63046 36997 364539 280458 327716 171785 -21635 13804
21724 13804 59652 27568 89804 53121 -82375 -76326 44030 70648 96660 326479 431941
21713 431941 340005 332431 284437 192505 80071 -153822 -390021 -412524 -224315 -38288 165459
21702 165459 434402 340717 180038 110260 312841 422067 302185 140330 -17616 -57284
$$ packed form
21778h0219N7652N3905J5737n4970R1789r9511r2847K04948p4638J30895n9304
21767I3437j80451K1800Q7584n6067K08220M6845k1710J9534L21511p6310j32994
21756C31399q3614J12670k81903k21048n2780K46721R3720J35234j28672l23844
21746a72117p8185O2656p9835L8355K27613L12984O2428j74783j4621q7042j58364
21735f0911p9531O8823r6640J05213J00043L27542q4081M7258j55931j93420L5439
21724A3804M5848l2084O2236l6683j35496O049J20356K6618K6012K29819J05462
21713D31941r1936p574m7994r1932j12434k33893k36199k2503J88209J86027K03747
21702A65459K68943r3685j60679o9778K02581J09226j19882j61855j57946l9668
$$ plain form
21692 -57284 -111358 -96855 124774 4115 -20936 -165471 -254750 -396780 -234006 -233975 -328156
21681 -328156 -335896 -158529 -36500 216024 202187 -75436 -108716 41871 -76021 181555
21671 181555 361018 326933 439601 300939 176794 276881 394091 277286 171129 165831
21661 165831 318204 476138 385414 331468 199226 -64638 -260071 -63809 98418 -133491
21651 -133491 -107735 161691 81891 9239 -152967 -196436 -8861 77738 148906 246985 95160
21640 95160 -205643 -257220 -279211 -179095 -331659 -449215 -342927 -152229 79401 51174
21630 51174 29477 -10974 -88652 -32459 -139888 -32916 -159033 -394702 -265991 -48181
21620 -48181 -23316 -62589 -36227 84523 -2755 -281919 -61940 158853 251699 353828 357551
$$ packed form
21692e7284n4074J4503K21629j20659k5051j44535q9279j42030J62774L1r4181
21681c28156p740J77367J22029K52524j3837k77623l3280J50587j17892K57576
21671A81555J79463l4085J12668j38662j24145J00087J17210j16805j06157n298
21661A65831J52373J57934r0724n3946j32242k63864j95433J96262J62227k31909
21651a33491K5756K69426p9800p2652j62206m3469J87575Q6599P1168R8079j51825
21640I5160l00803n1577k1991J00116j52564j17556J06288J90698K31630k8227
21630E1174k1697m0451p7678N6193j07429J06972j26117k35669J28711K17810
21620d8181K4865l9273K6362J20750q7278k79164K19979K20793R2846J02129L723
$$ plain form
21609 357551 396645 503518 516496 337791 271026 496140 439706 192428 94290 268192
21599 268192 425650 454329 411683 230647 190360 133458 -47093 349 -141733 8841
21589 8841 215130 327616 511827 361566 156520 200924 243337 98371 141034 76320 133764
21578 133764 113667 208039 290522 26421 -5306 -37755 305823 505092 503967 113628 194587
21567 194587 454921 482265 399261 476216 472077 345068 284690 134287 49052 -86710 65130
21556 65130 379240 383236 194353 217769 339805 440148 398025 630138 574825 376492 358620
21545 358620 89851 -73409 -53845 -11646 -57413 -240105 -284517 -180612 -183693 -50933 66702
21534 66702 34538 84716 -52147 -110743 42544 32317 -175038 -248472 -207361 -55989 -116734
$$ packed form
21609C57551L9094J06873J2978j78705o6765K25114n6434k47278r8138J73902
21599B68192J57458K8679m2646j81036m0287n6902j80551M7442j42082J50574
21589H841K06289J12486J84211j50261k05046M4404M2413j44966M2663o4714N7444
21578A33764k0097R4372Q2483k64101l1727l2449L43578J99269j125l90339Q0959
21567A94587K60334K7344q3004P6955m139j27009o0378j50403q5235j35762J51840
21556F5130L14110L996j88883K3416J22036J00343m2123K32113n5313j98333j7872
21545C58620k68769j63260J9564M2199m5767j82692m4412J03905l081J32760J17635
21534F6702l2164N0178j36863n8596J53287j0227k07355p3434M1111J51372o0745
$$ plain form
21523 -116734 -57161 -11836 -112678 197083 375901 296669 162018 177536 287737 195141
21513 195141 -194240 -424947 -286585 -197316 -390301 -563049 -518559 -469180 -423423 -309364
21503 -309364 -88342 105451 97510 146925 8116 -132357 -245060 -338259 -378293 -271085
21493 -271085 89562 267974 384823 472172 321764 171884 154899 159655 186358 311038
21483 311038 402194 330354 443323 291459 42180 -338592 -187062 66898 172235 174766
21473 174766 92626 -325415 -482822 -249319 -189998 -7875 37126 -230912 -351677 -301076
21463 -301076 -15166 -27073 -8289 112555 180746 130908 486960 760357 660936 584000 117162
21452 117162 95121 133917 157775 44894 -160280 -279451 -310956 -3225 100806 -117775
$$ packed form
21523a16734N9573M5325j00842L09761J78818p9232j34651J5518J10201r2596
21513A95141l89381k30707J38362Q9269j92985j72748M4490M9379M5757J14059
21503c09364K21022J93793p941M9415j38809j40473j12703r3199m0034J07208
21493b71085L60647J78412J16849Q7349j50408j49880j6985M756K6703J24680
21483C11038R1156p1840J12969j51864k49279l80772J51530K53960J05337K531
21473A74766q2140m18041j57407K33503N9321J82123M5001k68038j20765N0601
21463c01076K85910j1907J8784J20844O8191m9838L56052K73397r9421p6936m66838
21452A17162k2041L8796K3858j12881k05174j19171l1505L07731J04031k18581
$$ plain form
21442 -117775 -202757 138526 272868 204052 97296 -37750 205079 312988 155385 688
21432 688 142878 85028 180570 63336 93090 126488 127020 81924 74349 -596 24944 8225
21420 8225 -20306 -30636 74787 304791 133211 -233200 -222838 -146874 -142461 -171887 -46636
21409 -46636 203292 197300 54451 59585 -18918 43052 122751 146393 326576 339237 269315
21398 269315 400735 133771 -151819 -232019 -125212 -122134 -198799 -244950 -294762 -27288 158036
21387 158036 454743 426937 184412 124731 -14551 -85871 170500 222655 13502 -128036
21377 -128036 -280884 -188004 -132251 -10736 32016 323211 535022 427850 188219 139532
21367 139532 201719 421421 261786 -47767 -127702 -351819 -185603 257212 181776 207600
$$ packed form
21442a17775q4982L41283J34342o8816j06756j35046K42829J07909j57603j54697
21432F88J42190n7850R5542j17234K9754L3398N32m5096p575p4945K5540j6719
21420H225k8531j0330J05423K30004j71580l66411J0362P5964M413k9426J25251
21409d6636K49928n992j42849N134p8503O1970P9699K3642J80183J2661o9922
21398B69315J31420k66964k85590q0200J06807L078p6665m6151m9812K67474J85324
21387A58036K96707k7806k42525n9681j39282p1320K56371N2155k09153j41538
21377a28036j52848R2880N5753J21515M2752K91195K11811j07172k39631m8687
21367A39532O2187K19702j59635l09553p9935k24117J66216M42815p5436K5824
$$ plain form
21357 207600 355294 395744 428089 160992 43171 35057 143003 275889 144049 131477
21347 131477 32249 161333 25291 5621 -22206 105064 286853 313658 387213 343854 316579
21336 316579 278056 65134 95610 221588 209906 399554 412922 320522 290302 8339 40130
21325 40130 48280 129614 248658 478071 357828 73711 -105795 74736 129960 32725 -157931
21314 -157931 -337237 -246739 -63913 95867 95645 -68001 -113439 184594 388848 265228
21304 265228 345101 259312 59619 -25616 -301730 -351001 -151247 -73672 -373469 -354341 -50890
21293 -50890 255533 185003 43832 62989 167765 188196 76437 215715 251933 163969 106626
21282 106626 66863 240830 89710 -169223 -309486 -96434 68354 217010 213306 -90817
$$ packed form
21357B07600J47694M0450L2345k67097j17821q114J07946J32886j31840j2572
21347A31477r9228J29084j36042j9670k7827J27270J81789K6805P3555m3359k7275
21336C16579l8523k12922L0476J25978j1682J89648J3368r2400l0220k81963L1791
21325D0130Q150Q1334J19044K29413j20243k84117j79506J80531N5224r7235j90656
21314a57931j79306R0498J82826J59780k22j63646m5438K98033K04254j23620
21304B65228P9873q5789j99693q5235k76114m9271J99754P7575k99797J9128L03451
21293e0890L06423p0530j41171J9157J04776K0431j11759J39278L6218q7964n7343
21282A06626l9763J73967j51120k58933j40263K13052J64788J48656l704l04123
$$ plain form
21272 -90817 -227990 -23591 246164 -87362 -99705 111203 198095 127674 94845 14867 -227013
21261 -227013 -205764 -168473 -126588 -238623 -459308 -325087 -45507 87898 -32141 -111607
21251 -111607 158028 214788 -9789 -40586 -116007 -175501 -86940 -11686 -6471 104221 83041
21240 83041 -52144 -148824 -92662 91636 143329 181831 214332 56680 8605 -234840 -73445
21229 -73445 -76875 230624 382964 237415 307486 226852 33317 -33873 17061 300529 309883
21218 309883 98729 315855 517101 357652 261786 198715 147385 441795 389938 310861
21208 310861 129718 49328 -6863 -3809 209579 401544 437180 357549 379390 258491 104935
21197 104935 -99914 -134817 -29069 17385 245064 358956 262933 253061 444883 462405 454794
$$ packed form
21272i0817j37173K04399K69755l33526j2343K10908Q6892p0421l2829p9978k41880
21261b27013K1249L7291M1885j12035k20685J34221K79580J33405j20039p9466
21251a11607K69635N6760k24577l0797p5421n9494Q8561P5254N215J10692k1180
21240H3041j35185r6680N6162J84298N1693L8502L2501j57652m8075k43445J61395
21229g3445l430L07499J52340j45549P0071q0634j93535o7190N0934K83468R354
21218C09883k11154K17126K01246j59449r5866o3071n1330K94410n1857p9077
21208C10861j81143q0390n6191L054K13388J91965L5636p9631K1841j20899j53556
21197A04935k04849l4903J05748M6454K27679J13892r6023r872J91822J7522p611
$$ plain form
21186 454794 526505 425309 222730 279370 356780 303090 951 74617 261609 142089
21176 142089 10989 -70357 -302648 -29123 -345 16707 185435 310201 172696 53499
21166 53499 -183889 -65606 227617 18934 24289 268646 168144 53741 48814 52296 144178
21155 144178 41234 54230 -14926 -74203 63332 -7606 203562 93079 210655 591211
21145 591211 421890 180982 121635 154654 190597 427957 543114 443402 280215 212438
21135 212438 172805 200089 261209 197467 -8599 -156126 -139465 -152864 -260509 -368637 -234319
21124 -234319 22528 27498 -235161 -245031 -188198 -153663 -308268 -552058 -397217 107800 207662
21113 207662 244397 275386 275326 1571 65234 309130 343247 265480 19311 -139979 31377
$$ packed form
21186D54794P1711j01196k02579N6640P7410n3690l02139P3666J86992j19520
21176A42089j31100q1346k32291K73525K8778J7052J68728J24766j37505j19197
21166E3499k37388J18283K93223k08683N355K44357j00502j14403m927L482R1882
21155A44178j02944J2996o9156n9277J37535p0938K11168j10483J17576L80556
21145E91211j69321k40908n9347L3019L5943K37360J15157r9712j63187o7777
21135B12438l9633K7284O1120o3742k06066j47527J6661j3399j07645j08128J34318
21124b34319K56847M970k62659r870N6833L4535j54605k43790J54841N05017R9862
21113B07662L6735L0989o0k73755O3663K43896L4117p7767k46169j59290J71356
$$ plain form
21102 31377 146191 22787 -65102 -62700 -68764 107609 250323 71284 120185 204851 249136
21091 249136 101445 -123427 -253226 -100161 -53566 17231 76279 220777 162114 15070
21081 15070 -352181 -336399 -223468 -331772 -328664 -98179 65896 132079 175664 279190 467211
21070 467211 291954 279764 309646 455947 190453 -321264 -359076 -61182 -124942 -218531
21060 -218531 -288527 -154324 -67509 205702 350015 207870 232431 133863 -98530 -216424
21050 -216424 81196 446978 311714 173835 214973 93338 105827 40139 119087 288247
21040 288247 242531 168113 24912 68360 169290 260900 143707 8714 -68877 -41250 50071
21029 50071 4312 -43468 -67537 77939 121152 116645 245332 493344 538260 269301 165996
$$ packed form
21102C1377J14814j23404q7889K402o064J76373J42714j79039M8901Q4666M4285
21091B49136j47691k24872j29799J53065M6595P0797N9048J44498n8663j47044
21081A5070l67251J5782J12931j08304L108K30485J64075O6183M3585J03526J88021
21070D67211j75257j2190K9882J46301k65494n11717l7812K97894o3760r3589
21060b18531o9996J34203Q6815K73211J44313j42145K4561r8568k32393j17894
21050b16424K97620L65782j35264j37879M1138j21635J2489o5688P8948J69160
21040B88247m5716p4418j43201M3448J00930R1610j17193j34993p7591K7627R1321
21029E0071m5759m7780k4069J45476M3213m507J28687K48012M4916k68959j03305
$$ plain form
21018 165996 -16486 127963 167800 200931 203610 51215 80354 228157 218585 129888 444149
21007 444149 594946 509002 503231 672925 820196 542010 315726 365047 267466 105535
20997 105535 -37319 -64472 -70048 -67660 -103645 28851 258667 52471 44537 155006 434607
20986 434607 666700 438506 308702 212335 23836 -180255 42137 217786 277201 240501
20976 240501 118314 -119554 -255432 -360903 -24985 242400 185536 -44335 99333 88161
20966 88161 140709 257278 429309 354329 -5636 -104068 139849 342798 87256 -158115
20956 -158115 254889 167496 -93339 -102334 97546 239538 316039 93926 9479 214379
20946 214379 439534 437787 326807 439167 605329 383707 194904 286665 451686 458692
$$ packed form
21018A65996j82482J44449L9837L3131K679j52395K9139J47803r572q8697L14261
21007D44149J50797q5944n771J69694J47271k78186k26284M9321r7581j61931
20997A05535j42854k7153n576K388l5985J32496K29816k06196p934J10469K79601
20986D34607K32093k28194j29804r6367j88499k04091K22392J75649N9415l6700
20976B40501j22187k37868j35878j05471L35918K67385n6864k29871J43668j1172
20966H8161N2548J16569J72031p4980l59965r8432K43917K02949k55542k45371
20956a58115M13004q7393k60835q995J99880J41992P6501k22113q4447K04900
20946B14379K25155j747j10980J12360J66162k21622j88803R1761J65021P006
$$ plain form
20936 458692 486232 624004 474532 249333 75010 40407 -16415 65992 -51259 -269538
20926 -269538 -211654 -59390 -45448 -100289 -168483 -228508 -273423 -510349 -286570 -40499 16079
20915 16079 185010 229482 242255 174779 201719 72491 206672 185550 172074 126319 185418
20904 185418 294696 250723 266080 367757 449536 432383 219144 85146 96898 103632 201875
20893 201875 95341 -82132 -105424 -56393 -93555 36114 -81695 -48370 2269 85947 296474
20882 296474 305317 127719 -129256 -97850 -30536 -59648 125243 102282 -145389 -399277 -553350
20871 -553350 -324663 -302220 -151018 -89915 -161106 -9277 118974 225866 -39383 -210650
20861 -210650 -237476 -116662 57275 -29371 -121612 62308 62970 -151533 -40217 -25684 110713
$$ packed form
20936D58692K7540J37772j49472k25199j74323l4603n6822Q2407j17251k18279
20926b69538N7884J52264J3942n4841o8194o0025m4915k36926K23779K46071N6578
20915A6079J68931M4472J2773o7476K6940j29228J34181k1122j3476m5755N9099
20904A85418J09278m3973J5357J01677Q1779j7153k13239j33998J1752O734R8243
20893B01875j06534j77473k3292M9031l7162J29669j17809L3325N0639Q3678K10527
20882B96474Q843j77598k56975L1406O7314k9112J84891k2961k47671k53888j54073
20871e53350K28687K2443J51202O1103p1191J51829J28251J06892k65249j71267
20861b10650k6826J20814J73937q6646r2241J83920O62k14503J11316J4533J36397
$$ plain form
20850 110713 96586 71263 50429 232785 290715 11656 -33159 165453 304576 497385
20840 497385 428630 438872 610978 680479 575262 386870 408109 427825 671198 678940 498972
20829 498972 402009 587877 587085 474078 574081 452625 339021 116068 151803 26475
20819 26475 53685 -18645 -93 141136 184513 196800 40644 3799 46567 167631 251062
20808 251062 311166 344937 305711 367984 564260 390825 372968 358475 139907 45764 112561
20797 112561 -14505 329623 483705 323611 344869 391230 265842 253403 479028 667847
20787 667847 361782 42304 49003 130951 186091 231916 85332 59314 29426 174535 283457
20776 283457 243048 301399 123502 -114657 -21734 59416 -2170 -166523 -75973 96383 418665
$$ packed form
20850A10713j4127k5323k0834J82356N7930k79059m4815J98612J39123J92809
20840D97385o8755J0242J72106O9501j05217j88392K1239J9716K43373P742j79968
20829D98972r6963J85868p92j13007J00003j21456j13604k22953L5735j25328
20819B6475K7210p2330J8552J41229M3377J2287j56156l6845M2768J21064Q3431
20808B51062O0104L3771l9226O2273J96276j73435j7857j4493k18568r4143O6797
20797A12561j27066L44128J54082j60094K1258M6361j25388j2439K25625J88819
20787F67847l06065l19478O699Q1948N5140M5825j46584k6018k9888J45109J08922
20776B83457m0409N8351j77897k38159R2923Q1150o1586j64353R0550J72356L22282
$$ plain form
20765 418665 565102 443139 392652 293350 138241 105046 93639 268192 307461 360297 208533
20754 208533 223342 -93619 -369858 -100209 13265 -1165 137074 124986 7747 -792
20744 -792 90250 164645 447367 670564 660503 509763 584615 549985 520392 602881 648955
20733 648955 598501 589456 340373 143217 30376 285723 423368 204557 166947 360489
20723 360489 496061 751161 569230 278044 25595 57439 127306 181393 407151 434934
20713 434934 387317 445438 266496 135452 41857 -87473 -488604 -386817 58081 98049
20703 98049 121365 -52489 -16742 174966 158925 -11171 -188988 -246302 -159403 38180 -175615
20692 -175615 -258393 -124228 62828 212183 269804 282229 165875 105168 -19386 -26247 67549
$$ packed form
20765D18665J46437j21963n0487r9302j55109l3195j1407J74553L9269N2836j51764
20754B08533J4809l16961k76239K69649J13474j4430J38239j2088j17239q539
20744g92R1042P4395K82722K23197j0061j50740P4852l4630k9593Q2489M6074
20733F48955n0454r045k49083j97156j12841K55347J37645k18811l7610J93542
20723C60489J35572K55100j81931k91186k52449L1844O9867N4087K25758K7783
20713D34934m7617N8121j78942j31044r3595j29330m01131J01787M44898L9968
20703I8049K3316j73854L5747J91708j6041j70096j77817n7314Q6899J97583k13795
20692a75615q2778J34165J87056J49355N7621J2425j16354o0707j24554o861R3796
$$ plain form
20681 67549 298570 191419 48681 248408 218189 210018 369983 363980 472895 518698 542265
20670 542265 559501 559760 284661 133912 366980 288282 135735 249079 230199 257761 343026
20659 343026 245057 412318 525154 521787 487818 642482 417167 273621 357679 550605
20649 550605 526995 445970 241396 330831 323340 266687 147538 209429 -7331 441 164097
20638 164097 412287 409754 429260 402724 517354 738540 976767 690394 604258 736649
20628 736649 547543 351589 242836 390182 488668 322780 327316 178330 212000 217178 216568
20617 216568 141660 -41443 -123260 16882 -6581 64717 145297 271311 208922 258951 140430
20606 140430 251423 424410 356736 114646 -76951 -237738 -280325 -207998 -11652 131349
$$ packed form
20681F7549K31021j07151j42738J99727l0219q171J59965o003J08915M5803K3567
20670E42265J7236K59k75099j50749K33068p8698j52547J13344j8880K7562Q5265
20659C43026r7969J67261J12836l367l3969J54664k25315j43546Q4058J92926
20649E50605k3610q1025k04574Q9435p491n6653j19149O1891k16760P772J63656
20638A64097K48190k533J9506k6536J14630K21186K38227k86373q6136J32391
20628G36649j89106j95954j08753J47346R8486j65888M536j48986L3670N178o10
20617B16568p4908j83103q1817J40142k3463P1298Q0580J26014o2389N0029j18521
20606A40430J10993J72987o7674k42090j91597j60787m2587P2327J96346J43001
$$ plain form
20596 131349 197501 222675 222127 219918 163558 164752 439409 685658 422869 369639 383717 116710
20584 116710 176948 403440 212595 143554 272189 141288 10559 -75301 -144646 -249115
20574 -249115 -173963 -239604 -128671 103096 343291 474200 541400 270511 -80171 -199382
20564 -199382 7273 855 50210 30881 -31742 -14548 119237 471496 534664 478238 445401
20553 445401 431428 501261 805799 955862 861322 541100 409383 310072 98712 262768
20543 262768 387564 379155 112106 180262 213728 302436 449026 742883 560832 485884 404026
20532 404026 516660 589502 516286 420760 133920 153371 318256 353578 170755 133033 348583
20521 348583 370269 342945 318949 312044 306709 240444 188738 305035 583453 625484 456604
$$ packed form
20596A31349O6152K5174n48k209n6360J194K74657K46249k62789n3230J4078k67007
20584A16710O0238K26492j90845o9041J28635j30901j30729q5860o9345j04469
20574b49115P5152o5641J10933K31767K40195J30909O7200k70889l50682j19211
20564a99382K06655o418M9355j9329o2623J7194J33785L52259O3168n6426l2837
20553D45401j3973O9833L04538J50063r4540l20222j31717r9311k11360J64056
20543B62768J24796q409k67049O8156L3466Q8708J46590K93857j82051p4948q1858
20532D04026J12634P2842p3216r5526k86840J9451J64885L5322j82823l7722K15550
20521C48583K1686k7324k3996o905n335o6265n1706J16297K78418M2031j68880
$$ plain form
20510 456604 367035 399955 260874 50978 -6137 404947 609372 413206 377075 393035
20500 393035 287806 379096 414149 356757 449387 427487 301251 315077 221461 254908 452661
20489 452661 553632 558751 410732 308697 191613 340160 425971 61932 -135376 75151
20479 75151 461031 727356 689241 629562 672748 485985 324477 376965 249312 234604 163154
20468 163154 -30522 -214373 48544 402885 480684 429580 441864 422658 302376 352969
20458 352969 343440 469811 781035 866518 735589 523261 396964 258580 250990 143056
20448 143056 114343 110827 112060 300959 352000 114212 213503 469101 426210 467993 45255
20437 45255 125724 239381 153290 1770 106424 239440 223761 239737 89357 -48328
$$ packed form
20510D56604q9569L2920j39081k09896n7115M11084K04425j96166l6131J5960
20500C93035j05229R1290L5053n7392R2630k1900j26236J3826r3616L3447J97753
20489D52661J00971N119j48019j02035j17084J48547Q5811l64039j97308K10527
20479G5151L85880K66325l8115n9679M3186j86763j61508N2488j27653j4708p1450
20468A63154j93676j83851K62917L54341P7799n1104J2284j9206j20282N0593
20458C52969r529J26371L11224Q5483j30929k12328j26297j38384p590j07934
20448A43056k8713l516J233J88899N1041k37788R9291K55598m2891M1783m22738
20437D5255Q0469J13657q6091j51520J04654J33016j5679J5976j50380j37685
$$ plain form
20427 -48328 350295 633697 562659 265871 -10399 218256 585099 675560 853676 709580
20417 709580 516080 509125 507421 547846 356055 339555 288605 483321 657747 685729 415509
20406 415509 448170 661262 775686 755931 877285 783237 682236 351517 319600 476734
20396 476734 435438 301582 38295 219941 508400 719124 498963 393768 257519 245562
20386 245562 215327 242836 522883 593216 647989 742083 615260 524764 480273 394093 475797
20375 475797 555854 628489 564771 546228 414060 245082 170046 335895 388088 327208 518531
20364 518531 405664 187641 176955 288558 132177 -73247 -102533 48478 -6514 143969
20354 143969 378268 467686 471479 455089 471549 458425 522685 591663 608273 695802 830666
$$ packed form
20427d8328L98623K83402p1038k96788k76270K28655L66843R0461J78116j44096
20417G09580j93500o955j704M0425j91791j6500n0950J94716J74426K7982k70220
20406D15509L2661K13092J14424j9755J21354r4048j01001l30719l1917J57134
20396D76734m1296j33856k63287J81646K88459K10724k20161j05195j36249j1957
20386B45562l0235K7509K80047P0333N4773R4094j26823r0496m4491q6180Q1704
20375D75797Q0057P2635o3718j8543j32168j68978p5036J65849N2193o0880J91323
20364E18531j12867k18023j0686J11603j56381k05424k9286J51011n4992J50483
20354A43969K34299Q9418L793j6390J6460j3124O4260O8978J6610Q7529J34864
$$ plain form
20343 830666 979558 909048 695081 407835 249425 184895 319072 400770 402171 424515 488544
20332 488544 633172 687272 622712 537952 652736 748578 524806 345786 414299 650592
20322 650592 674386 661125 573015 190968 155087 322060 455776 311361 139333 258938
20312 258938 290341 415341 280765 213737 409433 460370 571786 500555 619463 563808
20302 563808 537040 556834 537472 582209 565503 681249 873886 889850 883166 887422 851510
20291 851510 572173 641381 658722 516845 535796 566483 810969 521480 435324 499498 619476
20280 619476 797185 779367 758738 395678 543557 462998 442497 563942 642291 711862 583629
20269 583629 407374 245182 346166 517897 473283 313729 167178 -14415 172082 265766
$$ packed form
20343H30666J48892p0510k13967k87246j58410o4530J34177Q1698J401K2344O4029
20332D88544J44628N4100o4560q4760J14784R5842k23772j79020O8513K36293
20322F50592K3794j3261q8110l82047l5881J66973J33716j44415j72028J19605
20312B58938L1403J25000j34576o7028J95696N0937J11416p1231J18908n5655
20302E63808k6768J9794j9362M4737j6706J15746J92637J5964o684M256l5912
20291H51510k79337O9208J7341j41877J8951L0687K44486k89489q6156O4174J19978
20280F19476J77709j7818k0629l63060J47879q0559k0501J21445P8349O9571j28233
20269E83629j76255j62192J00984J71731m4614j59554j46551j81593J86497R3684
$$ plain form
20259 265766 325708 277663 270982 338209 397379 484197 597369 465948 514456 604914 711533
20248 711533 738588 607590 520233 814128 921251 1000503 925231 800882 640605 380483
20238 380483 406607 299752 190156 156737 96819 -50025 183022 430963 379615 260238
20228 260238 446811 834195 1031975 913310 935999 751981 684391 581153 466467 495310
20218 495310 558441 527375 370038 288797 509820 576309 512509 462064 548023 507446 435410
20207 435410 452775 251539 349441 610216 957020 994352 786984 733398 589957 548361
20197 548361 491151 296490 170073 129640 227001 7826 91289 423003 338502 31337
20187 31337 158384 326462 427207 377872 344685 325161 513446 520520 456003 454754 328103
$$ packed form
20259B65766N9942m8045o681O7227N9170Q6818J13172j31421M8508R0458J06619
20248G11533K7055j30998q7357K93895J07123P9252p5272j24349j60277k60122
20238C80483K6124j06855j09596l3419n9918j46844K33047K47941n1348j19377
20228B60238J86573L87384J97780j18665K2689j84018o7590j03238j14686K8843
20218D95310O3131l1066j57337q1241K21023O6489o3800n0445Q5959m0577p2036
20207D35410J7365k01236R7902K60775L46804L7332k07368n3586j43441m1596
20197E48361n7210j94661j26417m0433R7361k19175Q3463L31714q4501l07165
20187C1337J27047J68078J00745m9335l3187j9524J88285P074o4517j249j26651
$$ plain form
20176 328103 661599 636864 597288 549229 531377 615224 513450 440685 537292 779709 943496
20165 943496 939751 1017826 967249 824762 1124450 1044646 667773 412545 247029 352933
20155 352933 544147 621882 759954 846641 998950 827418 608213 777611 731791 452184
20145 452184 583330 629708 877435 1088671 919551 496223 509215 663864 483429 403299
20135 403299 397837 512277 605244 582991 698189 732806 707655 706715 857742 824014 863623
20124 863623 799834 674267 770927 829402 416655 247157 486472 766149 647329 631701
20114 631701 691698 665711 788161 922872 1036443 854845 614628 470558 472468 627057
20104 627057 599222 596223 667813 496272 632736 633574 649545 811234 809009 889018 760927
$$ packed form
20176C28103L33496k4735l9576m8059j7852Q3847j01774p2765R6607K42417J63787
20165I43496l745P8075n0577j42487K99688p9804l76873k55228j65516J05904
20155C52933J91214P7735J38072Q6687J52309j71532k19205J69398m5820k79607
20145D52184J31146M6378K47727K11236j69120m23328J2992J54649j80435q0130
20135D03299n462J14440R2967k2253J15198L4617k5151r40J51027l3728L9609
20124H63623o3789j25567R6660N8475m12747j69498K39315K79677j18820j5628
20114F31701N9997k5987J22450J34711J13571j81598k40217j44070J910J54589
20104F27057k7835k999P1590j71541J36464Q38J5971J61689k225Q0009j28091
$$ plain form
20093 760927 553832 527941 559357 634342 710956 918589 1180110 1119070 1156979 1245940 962726
20082 962726 768031 851393 1002283 1098779 1065392 797377 871313 874911 762709 814724 774877
20071 774877 573672 483459 673619 726631 863019 1059214 1475517 1431562 1105511 1143494
20061 1143494 1292128 1457526 1547119 1316435 1184781 1191299 1406859 1419383 1457372 1357359
20051 1357359 1441914 1414934 1277800 1196658 1262436 1047720 934170 1105623 971317 1009633
20041 1009633 1251192 1235992 1057423 1163592 1296334 1028105 872997 804061 776985 655625
20031 655625 653686 597345 648817 562092 508761 893283 1046742 1038601 930334 879715 893059
20020 893059 1053080 848281 862694 1116511 1209154 1075008 812056 877733 829693 838592 876774
$$ packed form
20093G60927k07095k5891L1416P4985P6614K07633K61521o1040L7909Q8961k83214
20082I62726j94695Q3362J50890R6496l3387k68015P3936L598j12202N2015l9847
20071G74877k01205r0213J90160N3012J36388J96195M16303m3955l26051L7983
20061A143494J48634J65398Q9593k30684j31654O518K15560J2524L7989j00013
20051A357359Q4555k6980j37134q1142O5778k14716j13550J71453j34306L8316
20041A009633K41559j5200j78569J06169J32742k68229j55108o8936k7076j21360
20031F55625j939n6341N1472q6725n3331L84522J53459q141j08267n0619J3344
20020H93059J60021k04799J4413K53817R2643j34146k62952O5677m8040Q899L8182
$$ plain form
20009 876774 1021109 1108554 1349468 1502670 1599170 1527411 1346660 1359266 1355139 1151159 1089163
19998 1089163 1126530 1273543 1107048 1175126 1174694 741071 671408 718539 904951 966543 1006952
19987 1006952 1224653 1334395 1262193 1294643 1464108 1423875 1267481 1282813 1163371 1192773
19977 1192773 1242024 1356270 1458321 1365163 1172997 1175893 1133783 1070290 1131875 1159275 1276775
19966 1276775 1395172 1330120 1185089 1179806 1204081 1161297 1259093 1293596 1148274 1115934 1176131
19955 1176131 1289484 1237801 1372180 1427013 1253274 1159760 1263379 1177709 1133303 995418
19945 995418 1093199 1271255 1264152 1335836 1501526 1561226 1403855 1392909 1200241 1068423 1079949
19934 1079949 1267100 1398700 1294150 1433497 1244097 980216 1043545 1130271 1031193 1045518
$$ packed form
20009H76774J44335Q7445K40914J53202R6500p1759j80751J2606m127k03980o1996
19998A089163L7367J47013j66495O8078m32m33623o9663M7131J86412O1592M0409
19987A006952K17701J09742p2202L2450J69465m0233j56394J5332j19442K9402
19977A192773M9251J14246J02051r3158j92166K896m2110o3493O1585K7400J17500
19966A276775J18397o5052j45031n283K4275m2784R7796L4503j45322l2340O0197
19955A176131J13353n1683J34379N4833j73739r3514J03619q5670m4406j37885
19945I95418R7781J78056p103P1684J65690N9700j57371j0946j92668j31818J1526
19934A079949J87151J31600j04550J39347j89400k63881O3329Q6726r9078J4325
$$ plain form
19924 1045518 1226832 1447126 1419904 1392057 1151530 1213511 1248637 1168386 1361733 1404503
19914 1404503 1575987 1412817 1351278 1452073 1524132 1580328 1464516 1192009 1095193 1205719
19904 1205719 1193338 1341694 1417788 1323504 1160173 1028080 1012434 1050758 1198748 1260036
19894 1260036 1473431 1533591 1460170 1347811 1341450 1611203 1628127 1370171 1038261 1158868
19884 1158868 1413146 1582970 1582871 1655319 1763932 1629520 1726151 1965133 1987116 1853780 1876542
19873 1876542 1730112 1660451 1425886 1364797 1159029 1222431 1297899 1582031 1830003 1882165
19863 1882165 1947629 1881505 1923903 1813618 1859275 1755971 1829339 1914059 1789561 1765173 1640171
19852 1640171 1599500 1667440 1548684 1373071 1724643 1971872 1852169 1948243 1974840 1874682
$$ packed form
19924A045518J81314K20294k7222k7847k40527O1981L5126q0251J93347M2770
19914A404503J71484j63170o1539J00795P2059N6196j15812k72507r6816J10526
19904A205719j2381J48356P6094r4284j63331j32093j5646L8324J47990O1288
19894A260036K13395O0160p3421j12359o361K69753J6924k57956l31910J20607
19884A158868K54278J69824r9P2448J08613j34412R6631K38982K1983j33336K2762
19873A876542j46430o9661k34565o1089k05768O3402P5468K84132K47972N2162
19863A882165O5464o6124M2398j10285M5657j03304P3368Q4720j24498k4388j25002
19852A640171m0671O7940j18756j75613L51572K47229j19703R6074K6597j00158
$$ plain form
19842 1874682 1713356 1789077 1786914 1801932 1807132 1751199 2139054 2468484 2254556 2119106 1991165
19831 1991165 1956213 1939435 2024356 2218147 2053631 1805722 1836959 1879927 1986121 1951084
19821 1951084 2113653 2287137 2293629 2104431 1973177 2180387 2301870 2303161 2025918 1883104
19811 1883104 1867628 2105712 2133120 1847464 1799723 1917298 1877368 1964436 2096957 2268136
19801 2268136 2357492 2409202 2485202 2503719 2565408 2626442 2574592 2351192 2190392 2292395 2513330
19790 2513330 2586092 2531726 2482289 2604348 2583954 2487219 2451139 2429751 2384963 2257710 2442811
19779 2442811 2536603 2468147 2665333 2701320 2513900 2625141 2522832 2489222 2400797 2493504
19769 2493504 2688488 2776209 2770182 2636803 2453584 2693566 2910290 2998928 2910389 2699621
$$ packed form
19842A874682j61326P5721k163J5018N200n5933L87855L29430k13928j35450j27941
19831A991165l4952j6778Q4921J93791j64516k47909L1237M2968J06194l5037
19821A951084J62569J73484O492j89198j31254K07210J21483J291k77243j42814
19811A883104j5476K38084K7408k85656m7741J17575l9930Q7068J32521J71179
19801B268136Q9356N1710P6000J8517O1689O1034n1850k23400j60800J02003K20935
19790B513330P2762n4366m9437J22059k0394r6735l6080k1388m4788j27253J85101
19779B442811R3792o8456J97186L5987j87420J11241j02309l3610q8425R2707
19769B493504J94984Q7721o027j33379j83219K39982K16724Q8638q8539k10768
$$ plain form
19759 2699621 2500590 2434305 2647141 2788184 2662855 2590100 2662557 2709147 2596134 2631597
19749 2631597 2605695 2630428 2570716 2753307 2876220 2955831 3087335 3146585 2985373 2800033
19739 2800033 2849430 2858210 2782695 2631100 2637412 2825414 3139285 3236767 3159121 3026465 3071726
19728 3071726 3119280 3171472 3245289 3605288 3707025 3595860 3514300 3546391 3537875 3580233 3652864
19717 3652864 3822292 3693552 3488691 3335931 3199513 3169552 3411644 3557190 3668256 3579502
19707 3579502 3513849 3845489 4145849 4147742 4143636 4033268 3731389 3506233 3418751 3611589
19697 3611589 3739604 3874978 3998828 4120757 4215280 4318599 4548042 4219807 4035350 4069380
19687 4069380 4119951 4125959 4317717 4647594 4797561 4565655 4215664 4439570 4469119 4532035
$$ packed form
19759B699621j99031o6285K12836J41043j25329p2755P2457M6590j13013L5463
19749B631597k5902K4733n9712J82591J22913P9611J31504N9250j61212j85340
19739B800033M9397Q780p5515j51595O312J88002L13871R7482p7646j32656M5261
19728C071726M7554N2192P3817L59999J01737j11165q1560L2091q516M2358P2631
19717C652864J69428j28740k04861j52760j36418k9961K42092J45546J11066q8754
19707C579502o5653L31640L00360J893m106j10368l01879k25156q7482J92838
19697C611589J28015J35374J23850J21929R4523J03319K29443l28235j84457L4030
19687D069380N0571O008J91758L29877J49967k31906l49991K23906K9549O2916
$$ plain form
19677 4532035 4797195 4822027 4587334 4521026 4563580 4606618 4745720 4978195 5196509 5240681
19667 5240681 5113974 5013111 5039511 4913766 4718775 4533320 4768118 5059809 4995969 5123915
19657 5123915 5402591 5788873 5971484 6020124 6213764 5850863 5726901 5788218 5429607 5537364
19647 5537364 5599512 5625609 5773381 5817327 5988702 6040058 6092898 6007729 6126814 6443619
19637 6443619 6420975 6386708 6300070 6130493 6309644 6635396 6756947 6674512 6733338 6950327
19627 6950327 7003116 7181337 7206079 7353307 7372609 7374836 7330033 7371210 7516669 7455793 7298155
19616 7298155 7450388 7802723 8049574 8241619 8226756 7980825 8197860 8426500 8521776 8350301
19606 8350301 8240050 8217495 8332480 8400627 8478089 8590616 8839285 9043850 9187668 9423530
$$ packed form
19677D532035K65160K4832k34693o6308M2554M3038J39102K32475K18314M4172
19667E240681j26707j00863K6400j25745j94991j85455K34798K91691o3840J27946
19657E123915K78676L86282J82611M8640J93640l62901j23962O1317l58611J07757
19647E537364O2148K6097J47772M3946J71375N1356N2840q5169J19085L16805
19637F443619k2644l4267q6638j69577J79151L25752J21551q2435N8826K16989
19627F950327N2789J78221K4742J47228J9302K227m4803M1177J45459o0876j57638
19616G298155J52233L52335K46851J92045j4863k45931K17035K28640R5276j71475
19606H350301j10251k2555J14985O8147P7462J12527K48669K04565J43818K35862
$$ plain form
19596 9423530 9530958 9470674 9811203 9987557 10064651 10076599 9829252 9715874 9892521 10158959
19586 10158959 10196668 10512156 10635739 10635143 10461576 10657677 10956416 11070591 11169763 11280791
19576 11280791 11399332 11510910 11655969 11774738 11811843 11890973 11735710 11797661 12352121 12879184
19566 12879184 13237760 13237556 13388269 13430906 13476930 13605401 13851346 14074363 13832833 14016695
19556 14016695 14351036 14579873 14585324 14729723 15062339 15165238 15454472 15789078 16122052 16236445
19546 16236445 16293847 16244197 16533700 16875990 17084637 17270060 17457952 18117749 18394049 18526803
19536 18526803 18462561 18600357 19095153 19144040 19122134 19530012 19972686 20281534 20515615 20683399
19526 20683399 21123475 21497254 21760604 22018960 22260881 22413599 22742580 23082182 23408454
$$ packed form
19596I423530J07428o0284L40529J76354P7094J1948k47347j13378J76647K66438
19586A0158959L7709L15488J23583n96j73567J96101K98739J14175R9172J11028
19576A1280791J18541J11578J45059J18769L7105P9130j55263O1951N54460N27063
19566A2879184L58576k04J50713M2637M6024J28471K45945K23017k41530J83862
19556A4016695L34341K28837N451J44399L32616J02899K89234L34606L32974J14393
19546A6236445N7402m9650K89503L42290K08647J85423J87892O59797K76300J32754
19536A8526803o4242J37796M94796M8887k1906M07878M42674L08848K34081J67784
19526B0683399M40076L73779K63350K58356K41921J52718L28981L39602L26272
$$ plain form
19517 23408454 23775947 24153773 24752212 25199766 25547081 25642550 25803676 26005714 26344055
19508 26344055 26822615 27348675 27814615 28146015 28356980 28680869 28869335 29194626 29619191
19499 29619191 29997934 30412956 30761432 31247915 31654484 32078799 32512705 32739406 33190485
19490 33190485 33814290 34221620 34553790 35183876 35687442 35803378 36031480 36467850 36814603
19481 36814603 37378141 37862632 38419381 38797946 39007395 39269183 39438065 39603189 40000685
19472 40000685 40366515 40582887 40924908 41140103 41444608 41990071 42641464 43260545 43432904
19463 43432904 43605311 43854258 44252871 44495075 44774854 45146564 45352485 45388135 45674023
19454 45674023 45880558 46127331 46213040 46207863 46400483 46466071 46415407 46620868 46935277 47080739
$$ packed form
19517B3408454L67493L77826N98439M47554L47315R5469J61126K02038L38341
19508B6344055M78560N26060M65940L31400K10965L23889J88466L25291M24565
19499B9619191L78743M15022L48476M86483M06569M24315M33906K26701M51079
19490C3190485O23805M07330L32170O30086N03566J15936K28102M36370L46753
19481C6814603N63538M84491N56749L78565K09449K61788J68882J65124L97496
19472D0000685L65830K16372L42021K15195L04505N45463O51393O19081J72359
19463D3432904J72407K48947L98613K42204K79779L71710K05921L5650K85888
19454D5674023K06535K46773Q5709n177J92620O5588n0664K05461L14409J45462
$$ plain form
19444 47080739 46859054 46494307 46523671 46575193 46562518 46630185 46386822 46333378 46211157 46082982
19434 46082982 45995833 45878066 45448177 45037737 44984974 44968750 44713743 44287586 44287769 44425669
19424 44425669 44258744 43769543 43447197 43426457 43125375 42722790 42373123 41832079 41190443
19415 41190443 40884184 40461862 40234337 40009600 39568933 39285937 39160008 38795569 38332641
19406 38332641 37745325 37426961 36816643 36322321 35821187 35429261 34905124 34604366 34404211
19397 34404211 34016961 33685261 33194695 32686200 32498425 32348855 31882539 31447186 30985939
19388 30985939 30633938 30318803 30048867 29600736 29106640 28694109 28423599 27984470 27564034
19379 27564034 27208615 26915389 26380838 26341684 26028976 25635395 25391811 25150505 24910330
$$ packed form
19444D7080739k21685l64747K9364N1522j2675O7667k43363n3444j22221j28175
19434D6082982q7149j17767m29889m10440n2763j6224k55007m26157J83J37900
19424D4425669j66925m89201l22346k0740l01082m02585l49667n41044o41636
19415D1190443l06259m22322k27525k24737m40667k82996j25929l64439m62928
19406C8332641n87316l18364o10318m94322n01134l91926n24137l00758k00155
19397C4404211l87250l31700m90566n08495j87775j49570m66316m35353m61247
19388C0985939l52001l15135k69936m48131m94096m12531k70510m39129m20436
19379B7564034l55419k93226n34551l9154l12708l93581k43584k41306k40175
$$ plain form
19370 24910330 24431114 23962400 23662419 23423844 23253855 23071568 22537975 22131088 21939797
19361 21939797 21691002 21604176 21330758 20786546 20461750 20340772 20148574 20080891 19793926 19626891
19351 19626891 19315930 18818498 18483016 18236291 18042014 17996325 17996377 17642495 17344648 17010467
19341 17010467 16612630 16483919 16308530 16190037 16018360 15729351 15463126 15121215 14827267
19332 14827267 14790898 14610730 14322873 14227845 14302254 14316248 14140765 14044562 13929145 13689578
19322 13689578 13271054 13032837 13024590 13028271 12902790 12839929 12571229 12392631 12293858 12198163
19312 12198163 12150943 12268878 12139660 11927530 11762163 11343711 11134204 10773123 10577170
19303 10577170 10688624 10606955 10715854 10769555 10513967 10401741 10147879 9948506 9618115 9790579
$$ packed form
19370B4910330m79216m68714k99981k38575j69989j82287n33593m06887j91291
19361B1939797k48795q6826k73418n44212l24796j20978j92198o7683k86965j67035
19351A9626891l10961m97432l35482k46725j94277m5689N2l53882k97847l34181
19341A7010467l97837j28711j75389j18493j71677k89009k66225l41911k93948
19332A4827267l6369j80168k87857r5028P4409J3994j75483r6203j15417k39567
19322A3689578m18524k38217q247L681j25481o2861k68700j78598r8773r5695
19312A2198163m7220J17935j29218k12130j65367m18452k09507l61081j95953
19303A0577170J11454q1669J08899N3701k55588j12226k53862j99373l30391J72464
$$ plain form
19293 9790579 10008703 9724385 9441864 9129328 9056918 9096231 8972123 8901975 8697619 8792303
19283 8792303 8934507 8929648 8847885 8870408 8564130 8383072 8268471 8082633 7974054 7916053
19273 7916053 7757933 7817442 7557711 7753367 7876225 7874148 7533100 7222173 7389747 7347250
19263 7347250 7295392 7171243 6932475 6799591 6860135 6973576 6842718 6813635 6678929 6533855
19253 6533855 6275520 6384633 6531498 6365244 6358760 6324476 6319399 6524116 6487553 6246846
19243 6246846 6185445 6120660 5878444 5631265 5697658 5824536 5630514 5594881 5726866 5788869
19233 5788869 5856062 5898173 5689369 5414620 5248179 5224729 5165326 5164478 5151977 4753954 4615710
19222 4615710 4802727 4967469 5057840 5003415 4801666 4600078 4674090 4654138 4813982 4704662
$$ packed form
19293I790579K18124k84318k82521l12536p2410L9313j24108p0148k04356R4684
19283H792303J42204m859q1763K2523l06278j81058j14601j85838j08579n8001
19273G916053j58120N9509k59731J95656J22858k077l41048l10927J67574m2497
19263G347250n1858j24149k38768j32884O0544J13441j30858k9083j34706j45074
19253F533855k58335J09113J46865j66254o484l4284n077K04717l6563k40707
19243F246846o1401o4785k42216k47179O6393J26878j94022l5633J31985O2003
19233E788869O7193M2111k08804k74749j66441k3450n9403q48j2501l98023j38244
19222D615710J87017J64742R0371n4425k01749k01588P4012j9952J59844j09320
$$ plain form
19212 4704662 4657932 4775693 4942931 5023668 4870357 4731776 4502170 4506026 4494527 4494807 4272638
19201 4272638 4062784 3959880 4038142 3997713 4023785 3949931 3820313 3909835 3825884 3728484 3706842
19190 3706842 3772714 3937773 3917720 3863349 3869136 3777056 3814816 3811743 3743374 3540817 3348012
19179 3348012 3444517 3640264 3596854 3357564 3137154 3277160 3693365 3768074 3780892 3707825
19169 3707825 3602961 3354899 3251303 3283164 3508120 3451105 3377303 3392658 3445373 3680623
19159 3680623 3520906 3329120 3450083 3699565 3607982 3421823 3412161 3356214 3227683 3141911
19149 3141911 3129535 3042674 2977055 3110274 3099162 3023806 2921081 2958646 3165737 3383301
19139 3383301 3100931 2888235 3065091 3019544 3084222 3210831 3025019 2749020 2886956 2778686
$$ packed form
19212D704662m6730J17761J67238Q0737j53311j38581k29606L856j1499K80k22169
19201D272638k09854j02904P8262m0429K6072p3854j29618Q9522q3951r7400k1642
19190C706842O5872J65059k0053n4371N787r2080L7760l073o8369k02557j92805
19179C348012R6505J95747m3410k39290k20410J40006M16205P4709J2818p3067
19169C707825j04864k48062j03596L1861K24956n7015p3802J5355N2715K35250
19159C680623j59717j91786J20963K49482r1583j86159r662n5947j28531q5772
19149C141911j2376q6861o5619J33219j1112p5356j02725L7565K07091K17564
19139C383301k82370k12696J76856m5547O4678J26609j85812k75999J37936j08270
$$ plain form
19129 2778686 2862085 2730658 2210607 2311836 2246166 2396708 2629155 2753191 2982174 2791881
19119 2791881 2424976 2107376 2128380 2261911 2315450 2518992 2612285 2600078 2308165 2238645
19109 2238645 2291711 2437259 2441037 2550768 2520372 2420236 2299694 2208234 2340058 2465943
19099 2465943 2670509 2603507 2374786 2186168 2141046 2295821 2246951 2269517 2607435 2665439
19089 2665439 2341068 2283807 2467379 2426766 2087362 1920026 1898317 1834208 1896364 1996053
19079 1996053 2106001 2010552 1946232 1941589 1933035 2020432 2134678 2211936 2224600 2085424 2302683
19068 2302683 2343490 1998952 1974515 2026485 1882282 1753175 1678822 1665403 2014346 2098606
19058 2098606 2143216 2370521 2530147 2578182 2482148 2539248 2370437 2418921 2474950 2445833 2331135
$$ packed form
19129B778686Q3399j31427n20051J01229o5670J50542K32447J24036K28983j90293
19119B791881l66905l17600K1004J33531N3539K03542R3293j2207k91913o9520
19109B238645N3066J45548L778J09731l0396j00136j20542r1460J31824J25885
19099B465943K04566o7002k28721j88618m5122J54775m8870K2566L37918N8004
19089B665439l24371n7261J83572m0613l39404j67336k1709o4109O2156R9689
19079A996053J09948r5449o4320m643q554Q7397J14246P7258J2664j39176K17259
19068B302683M0807l44538k4437N1970j44203j29107p4353j3419L48943Q4260
19058B098606M4610K27305J59626M8035r6034N7100j68811M8484N6029k9117j14698
$$ plain form
19047 2331135 2260942 2273073 2314504 2314079 2261895 2209396 2133990 2035797 2067168 2178385 2209733
19036 2209733 2380326 2534355 2466373 2651641 2682534 2443510 2263411 1985607 1980337 2004342
19026 2004342 1919853 1933348 1917716 1949625 2030635 2131590 2310520 2409886 2300728 2158809
19016 2158809 2169787 2108811 2160478 2412859 2346792 2308550 2397372 2264200 2151492 2152750 2285493
19005 2285493 2318560 2126172 2093162 2270332 2282049 2504555 2350884 2129166 2176559 2206454
18995 2206454 2309414 2468113 2473968 2240055 2347075 2590384 2516105 2226492 1971954 2133729
18985 2133729 2384772 2294803 2137189 1864566 1891748 2005935 1948859 2236340 2226744 1936850
18975 1936850 1754645 1712944 1824019 1953217 1985496 2049068 2076081 2024761 1897332 1869466
$$ packed form
19047B331135p0193J2131M1431m25n2184n2499p5406r8193L1371J11217L1348
19036B209733J70593J54029o7982J85268L0893k39024j80099k77804n270K4005
19026B004342q4489J3495j5632L1909Q1010J00955J78930R9366j09158j41919
19016B158809J0978o0976N1667K52381o6067l8242Q8822j33172j12708J258J32743
19005B285493L3067j92388l3010J77170J1717K22506j53671k21718M7393K9895
18995B206454J02960J58699N855k33913J07020K43309p4279k89613k54538J61775
18985B133729K51043q9969j57614k72623K7182J14187n7076K87481r596k89894
18975A936850j82205m1701J11075J29198L2279O3572K7013n1320j27429k7866
$$ plain form
18965 1869466 1843115 1774450 1758419 1754485 1828931 1783500 1809735 2039815 2372727 2607564 2476352
18954 2476352 2383260 2357967 2203028 1987085 1951810 1943804 1911733 1800320 1876367 1864196 1731016
18943 1731016 1575021 1527141 1339397 1188667 1283690 1354280 1306298 1462712 1580570 1567235
18933 1567235 1670189 1675211 1596518 1524427 1466378 1439687 1351171 1269618 1724502 2055622 1927182
18922 1927182 1880996 2085999 2054162 2083520 1942160 1722479 1578594 1666115 1625368 1455625
18912 1455625 1571285 1708636 1586060 1580352 1658945 1280178 1060976 1153001 1441566 1446019
18902 1446019 1295984 1034006 1013225 1265784 1487695 1332820 1326390 1596988 1624200 1544437
18892 1544437 1578962 1539462 1454045 1552122 1620436 1712502 1963286 1917131 1979343 1834515 1783654
$$ packed form
18965A869466k6351o8665j6031l934P4446m5431K6235K30080L32912K34837j31212
18954B476352r3092k5293j54939k15943l5275q006l2071j11413P6047j2171j33180
18943A731016j55995m7880j87744j50730R5023P0590m7982J56414J17858j3335
18933A567235J02954N022p8693p2091n8049k6691q8516q1553M54884L31120j28440
18922A927182m6186K05003l1837K9358j41360k19681j43885Q7521m0747j69743
18912A455625J15660J37351j22576n708P8593l78767k19202R2025K88565M453
18902A446019j50035k61978k0781K52559K21911j54875o430K70598K7212p9763
18892A544437L4525l9500q5417R8077O8314R2066K50784m6155O2212j44828n0861
$$ plain form
18881 1783654 1654982 1528626 1672931 1716172 1810713 1964235 1745920 1608222 1600767 1775766
18871 1775766 1865340 1877847 1861749 1747576 1706334 1722145 1811081 1911205 1819965 1809631 1673335
18860 1673335 1501766 1469906 1317357 1297619 1270070 1200506 1225051 1533644 1610603 1429172
18850 1429172 1326935 1267925 1079552 1114812 1059755 1161920 1266374 1388698 1374084 1423831
18840 1423831 1390555 1233957 1184294 1338368 1601600 1577144 1390064 1093609 1059079 1263346
18830 1263346 1210852 1329723 1557537 1385703 1308942 1371746 1503441 1740200 1731545 1769009
18820 1769009 1742620 1623894 1451379 1289921 1372875 1357513 1415500 1496690 1490382 1327870 1154043
18809 1154043 1193529 1077442 1135828 1125922 1003040 1209579 1661987 1759457 1305797 1194675
$$ packed form
18881A783654j28672j26356J44305M3241R4541J53522k18315j37698p455J74999
18871A775766Q9574J2507j6098j14173m1242J5811Q8936J00124r1240j0334j36296
18860A673335j71569l1860j52549j9738k7549o9564K4545L08593P6959j81431
18850A429172j02237n9010j88373L5260n5057J02165J04454J22324j4614M9747
18840A423831l3276j56598m9663J54074K63232k4456j87080k96455l4530K04267
18830A263346n2494J18871K27814j71834p6761O2804J31695K36759q655L7464
18820A769009k6389j18726j72515j61458Q2954j5362N7987Q1190o308j62512j73827
18809A154043L9486j16087N8386r906j22882K06539M52408R7470m53660j11122
$$ plain form
18799 1194675 1260523 1359820 1350895 1128289 1132389 1153706 1138622 957465 1018211 1274574 1492864
18788 1492864 1531551 1446617 1326725 1199187 1349104 1499650 1296818 1292358 1355552 1383314
18778 1383314 1308478 1329822 1436171 1270853 1051600 817710 759300 1042786 1440016 1443213
18768 1443213 1230463 991043 959164 933931 898560 1090521 812177 565342 567822 800206
18758 800206 901105 1305470 1526298 1384452 1397468 1250335 1117956 882238 787044 974993
18748 974993 939219 1147899 1452010 1385566 1262191 1276664 1200539 1212692 1109901 1057475 907942
18737 907942 885117 1045499 1212793 1201429 1271086 1241705 1245401 1373183 1126982 1115399 1286761
18726 1286761 1126268 1045534 1227405 1267739 1165979 1080295 1028243 1268110 1321497 1257508
$$ packed form
18799A194675O5848R9297q925k22606M100K1317j5084j81157O0746K56363K18290
18788A492864L8687q4934j19892j27538J49917J50546k02832m460O3194K7762
18778A383314p4836K1344J06349j65318k19253k33890n8410K83486L97230L197
18768A443213k12750k39420l1879k5233l5371J91961k78344k46835K480K32384
18758H00206J00899M04365K20828j41846J3016j47133j32379k35718r5194J87949
18748I74993l5774K08680L04111o6444j23375J4473p6125J2153j02791n2426j49533
18737I07942k2825J60382J67294j1364O9657k9381L696J27782k46201j1583J71362
18726A286761j60493q0734J81871M0334j01760q5684n2052K39867N3387o3989
$$ plain form
18716 1257508 1226153 1249520 1156825 1150905 916229 1149495 1266628 1106083 988136 951616
18706 951616 1073659 900935 949938 1085326 959243 1018117 986423 942884 1071741 1064705 1306530
18695 1306530 1581475 1474507 1454599 1289924 1108472 851413 771014 933862 1136229 1206593
18685 1206593 1138165 1195930 1566612 1608680 1390431 1369011 1311803 1558029 1863673 1573812
18675 1573812 1794488 1829082 1578102 1581660 1766507 1924934 1861355 1894171 1929498 1851296 1598511
18664 1598511 1527443 1800474 2059702 1940543 1943610 1960841 1821918 1738865 1631011 1622312 1593429
18653 1593429 1559750 1952006 1968949 1868940 1942307 2019385 2112459 1997575 1955420 1869187 1880670
18642 1880670 1901220 1908747 1928840 1934924 1714281 1766780 1997236 1927227 1799516 1964602 2078581
$$ packed form
18716A257508l1355K3367r2695n920k34676K33266J17133j60545j17947l6520
18706I51616J22043j72724M9003J35388j26083N8874l1694m3539J28857p036K41825
18695A306530K74945j06968j9908j64675j81452k57059q0399J62848K02367P0364
18685A206593o8428N7765L70682M2068k18249k1420n7208K46226L05644k89861
18675A573812K20676L4594k50980L558J84847J58427o3579L2816L5327p8202k52785
18664A598511p1068K73031K59228j19159L067J7231j38923q3053j07854q699k8883
18653A593429l3679L92256J6943j00009P3367P7078R3074j14884m2155q6233J1483
18642A880670K0550P527K0093O084k20643N2499K30456p0009j27711J65086J13979
$$ plain form
18631 2078581 2221917 2357089 2538944 2377393 2139892 1786080 1678303 1809415 1861818 2038027
18621 2038027 1951546 1855497 2204621 2440196 2493944 2319137 2138229 2236316 2204650 2464809
18611 2464809 2489139 2308280 2352215 2422577 2371190 2416105 2506569 2447622 2325742 2320048 2181546
18600 2181546 2108581 2033524 2042608 2180130 2331469 2319911 2343184 2573863 2852139 2894621 3093625
18589 3093625 3207119 3247883 3070819 3168628 3230010 2951500 2698394 2912765 3221838 3254988
18579 3254988 3595675 3981016 4228845 4278721 4589599 4804313 4822624 5019921 5388296 5667423
18569 5667423 5882827 6250955 6888555 7995910 9025317 10012424 11226578 12384006 13503561
18560 13503561 14488064 15230127 16201986 17322698 18391591 19298798 20364415 21646159 23324246
$$ packed form
18631B078581J43336J35172J81855j61551k37501l53812j07777J31112N2403J76209
18621B038027q6481r6049L49124K35575N3748j74807j80908R8087l1666K60159
18611B464809K4330j80859M3935P0362n1387M4915R0464n8947j21880n694j38502
18600B181546p2965p5057R084J37522J51339j1558K3273K30679K78276M2482J99004
18589C093625J13494M0764j77064R7809O1382k78510k53106K14371L09073L3150
18579C254988L40687L85341K47829M9876L10878K14714J8311J97297L68375K79127
18569E667423K15404L68128O37600J107355J029407R87107J214154J157428J119555
18560A3503561R84503P42063R71859J120712J068893R07207J065617J281744J678087
$$ plain form
18551 23324246 25341763 28193051 32557683 38747575 47004332 57278311 68945529 81129968
18543 81129968 92752942 102935802 110963843 116990721 122272327 126368272 129018324 130389401
18535 130389401 130503802 128207037 121993890 113226715 103999378 94713826 85548101 77264758
18527 77264758 70476735 65314097 61170741 57891050 55328715 52731077 49820999 46809550
18519 46809550 43166679 39276940 35378097 31808203 28910192 26967252 25685963 24656445
18511 24656445 23946762 23979361 24571645 25465622 27085524 29385640 31975017 35133381 38746575
18502 38746575 42375422 45711870 48937431 52092902 55392185 59152668 63750737 69282668
18494 69282668 75876097 83914757 92955523 102495919 112823379 123170536 132854403 140992846
$$ packed form
18551B3324246K017517K851288M364632O189892Q256757J0273979J1667218J2184439
18543H1129968J1622974J0182860Q028041O026878N281606M095945K650052J371077
18535A30389401J14401k296765o213147q767175r227337r285552r165725q283343
18527G7264758o788023n162638m143356l279691k562335k597638k910078l011449
18519D6809550l642871l889739l898843l569894k898011j942940j281289j029518
18511B4656445p09683L2599N92284Q93977J619902K300116K589377L158364L613194
18502C8746575L628847L336448L225561L155471L299283L760483M598069N531931
18494F9282668O593429Q038660R040766R540396J0327460J0347157R683867Q138443
$$ plain form
18486 140992846 146637833 150131133 151515743 151556462 150736004 148008604 142737775 135448798
18478 135448798 125018385 110300982 93666668 78907249 66580090 56587518 49358901
18471 49358901 44678457 41507824 39349939 37296841 35455409 33840773 32858545 31965325
18463 31965325 30744860 29251283 28006207 26947144 25330246 23498828 21863042 20425602
18455 20425602 18839793 17556384 16599161 15902303 15433872 14843300 14550423 14064187 13619944
18446 13619944 13102878 12767212 12787975 12654033 12965482 13549496 14457041 15358468 15991019
18437 15991019 16231254 16357724 16221413 16342654 17029038 18130331 19204686 20013494 21779980
18428 21779980 25462077 31007380 38019196 45385792 52417645 58009325 61877374 64605010
$$ packed form
18486A40992846N644987L493300J384610M0719q20458k727400n270829p288977
18478A35448798j0430413j4717403j6634314j4759419j2327159r992572p228617
18471D9358901m680444l170633k157885k053098j841432j614636r82228q93220
18463C1965325j220465j493577j245076j059063j616898j831418j635786j437440
18455B0425602j585809j283409r57223o96858m68431n90572k92877m86236m44243
18446A3619944n17066l35666K0763j33942L11449N84014R07545R01427O32551
18437A5991019K40235J26470j36311J21241O86384J101293J074355Q08808J766486
18428B1779980L682097N545303P011816P366596P031853N591680L868049K727636
$$ plain form
18420 64605010 67294122 70316422 71335261 68436441 63709108 58250737 50783298 45050690
18412 45050690 43253412 42493347 40021764 37225818 34916532 32934667 31433691 30586862
18404 30586862 30619044 30566422 27946879 23643821 20232166 18294581 17374758 17083911 17431872
18395 17431872 18194573 19122200 20125383 20573146 20881690 21170190 21969254 23515222 25996368
18386 25996368 29055412 32464118 35766438 39239432 43602476 49774638 58431225 70044238
18378 70044238 83755925 97298058 107551570 113165296 117310544 123366290 133156708 143640354
18370 143640354 149455438 148934008 142812197 135759969 129905796 125668070 120890277 112105269
18362 112105269 101380796 92013288 82341473 71520450 63009611 56097334 48989894 43078367
$$ packed form
18420F4605010K689112L022300J018839k898820m727333n458371p467439n732608
18412D5050690j797278p60065k471583k795946k309286j981865j500976q46829
18404C0586862L2182n2622k619543m303058l411655j937585r19823k90847L47961
18395A7431872P62701R27627J003183M47763L08544K88500P99064J545968K481146
18386B5996368L059044L408706L302320L472994M363044O172162Q656587J1613013
18378G0044238J3711687J3542133J0253512N613726M145248O055746R790418J0483646
18370A43640354N815084n21430o121811p052228n854173m237726m777793q785008
18362A12105269j0724473r367508r671815j0821023q510839o912277p107440n911527
$$ plain form
18354 43078367 38674420 35520563 33159499 31100683 29556543 28646087 28040543 26516052
18346 26516052 24052222 22103264 20937849 20501455 20410808 20632959 21583638 23552393 26221978
18337 26221978 29862268 33903793 37353803 39638555 41195495 42487172 44802933 49013572
18329 49013572 55186507 61404589 65052528 68284625 74443644 83672009 93824417 102616788
18321 102616788 107645630 106783263 101838481 97673416 95998161 92624161 84339532 72898064
18313 72898064 58421029 44801250 36264898 31514161 29167901 28004883 27263979 26721300
18305 26721300 25764478 24325757 23237762 22509052 22097340 21459401 19710886 17363812 15604193
18296 15604193 14626492 13797629 12915911 12358035 11931141 11729284 11500779 10840029 10054349
$$ packed form
18354D3078367m403947l153857k361064k058816j544140r10456o05544j524491
18346B6516052k463830j948958j165415m36394r0647K22151R50679J968755K669585
18337B6221978L640290M041525L450010K284752J556940J291677K315761M210639
18329D9013572O172935O218082L647939L232097O159019R228365J0152408Q792371
18321A02616788N028842q62367m944782m165065j675255l374000q284629j1441468
18313G2898064j4477035j3619779q536352m750737k346260j163018p40904n42679
18305B6721300r56822j438721j087995p28710m11712o37939j748515k347074j759619
18296A5604193r77701q28863q81718n57876m26894k01857k28505o60750p85680
$$ plain form
18287 10054349 9590802 9327997 9220533 8979072 8523307 8039737 7881193 7572087 7180870
18278 7180870 6848661 6893328 7051449 6970467 7093086 6976219 6819216 6905880 6877064 6695265
18268 6695265 6807762 6942189 6838152 6712167 6360321 6098700 6161641 6126102 5962311 5627923
18258 5627923 5670292 5557069 5520952 5556439 5284418 5096849 4815061 4995163 4978728 4767463
18248 4767463 4747183 4634205 4536043 4436713 4144921 3973044 3798462 3717617 3757126 3579453
18238 3579453 3556357 3511917 3199973 3027842 2988370 2967928 2869832 2833625 2733503 2698645 2600153
18227 2600153 2450644 2493136 2690780 2698744 2398839 2031160 1921390 1908046 1972705 2018621
18217 2018621 2004180 1763202 1964785 2296884 2258215 2014173 1900064 2180207 2579793 2374864
$$ packed form
18287A0054349m63547k62805j07464k41461m55765m83570j58544l09106l91217
18278G180870l32209M4667J58121q0982J22619j16867j57003Q6664k8816j81799
18268F695265J12497J34427j04037j25985l51846k61621O2941l5539j63791l34388
18258E627923M2369j13223l6117L5487k72021j87569k81788J80102j6435k11265
18248D767463k0280j12978r8162r9330k91792j71877j74582q0845L9509j77673
18238C579453k3096m4440l11944j72131l9472k0442r8096l6207j00122l4858r8492
18227B600153j49509M2492J97644P964k99905l67679j09770j3344O4659M5916
18217B018621j4441k40978K01583L32099l8669k44042j14109K80143L99586k04929
$$ plain form
18207 2374864 1955647 1867020 1749509 1701973 1989351 2191069 2118522 2082547 2012885 2077796
18197 2077796 1981517 1888215 1822069 1634312 1612051 1854054 1990509 2052015 1876804 1810550
18187 1810550 2044200 2210939 2191287 2375115 2592358 2396844 2332303 2609153 2962835 3129610
18177 3129610 2953965 2781192 2913850 3254593 3318012 3185760 3194030 3188952 3012193 2537861
18167 2537861 2293842 2225050 2264914 2156022 1942646 1822449 2007401 2164703 2280442 2044734
18157 2044734 1693132 1571002 1396217 1152549 1162714 1200416 1091167 1511019 1634515 1587624
18147 1587624 1559030 1534273 1445712 1651602 1879912 1977267 1961816 1821295 1877330 2097812
18137 2097812 2237961 2019616 1877609 1833865 1855241 2193245 2538370 2788655 3044899 3068927
$$ packed form
18207B374864m19217q8627j17511m7536K87378K01718p2547l5975o9662O4911
18197B077796r6279r3302o6146j87757k2261K42003J36455O1506j75211o6254
18187A810550K33650J66739j9652J83828K17243j95514o4541K76850L53682J66775
18177C129610j75645j72773J32658L40743O3419j32252Q270n078j76759m74332
18167B537861k44019o8792L9864j08892k13376j20197J84952J57302J15739k35708
18157B044734l51602j22130j74785k43668J0165L7702j09249M19852J23496m6891
18147A587624k8594k4757q8561K05890K28310R7355j5451j40521N6035K20482
18137B097812J40149k18345j42007m3744K1376L38004L45125K50285K56244K4028
$$ plain form
18127 3068927 2982594 3100266 3212376 3160215 2884407 2952281 3215441 3232150 3187224 3137060
18117 3137060 3305695 3247919 2961403 2731862 2650314 2475887 2247647 2193145 2013309 1909382
18107 1909382 1798000 1884801 1908898 1768654 1694522 1770464 1738337 1823087 1640610 1383518
18097 1383518 1450887 1615537 1798357 1526849 1477213 1537902 1589883 1745352 1692292 1602149
18087 1602149 1542922 1769016 1696446 1703104 1810837 1591865 1695336 1816659 1790116 1816660
18077 1816660 1778288 1744223 1593789 1449387 1388799 1496132 1431101 1492168 1601544 1709134
18067 1709134 1710265 2207983 2169014 2043455 1980291 1791814 1934219 2033109 1889164 2194711
18057 2194711 2597526 2580900 2554564 2625433 2522194 2443672 2667622 2879789 2781322 2892316
$$ packed form
18127C068927q6333J17672J12110n2161k75808O7874K63160J6709m4926n0164
18117C137060J68635n7776k86516k29541q1548j74427k28240n4502j79836j03927
18107A909382j11382Q6801K4097j40244p4132P5942l2127Q4750j82477k57092
18097A383518O7369J64650J82820k71508m9636O0689N1981J55469n3060r0143
18087A602149n9227K26094p2570O658J07733k18972J03471J21323k6543K6544
18077A816660l8372l4065j50434j44402o0588J07333o5031O1067J09376J07590
18067A709134J131M97718l8969j25559o3164j88477J42405R8890j43945L05547
18057B194711M02815j6626k6336P0869j03239p8522K23950K12167r8467J10994
$$ plain form
18047 2892316 3264225 3454263 3559134 3663926 4045339 4420385 5189953 6418899 7599591
18038 7599591 9555461 12610777 15985026 19022686 21585146 23732555 26153132 29924859
18030 29924859 35716195 43041460 48736702 49326416 46914968 44757388 44620173 46990942
18022 46990942 51384664 54204268 50100215 41996782 35479669 31332302 29191569 28279686
18014 28279686 27496347 24021986 18838883 15024642 12813122 11403927 10427671 9982208
18006 9982208 9801802 9542506 9255260 8979898 8859182 8813460 8879916 9091840 9288491 9742444
17996 9742444 10595214 11397578 13013256 15598634 19123081 22206668 24757086 27276635
17988 27276635 30208076 34647033 40284222 46991879 54187468 60129635 65919476 71900654
$$ packed form
18047B892316L71909J90038J04871J04792L81413L75046P69568J228946J180692
18038G599591J955870L055316L374249L037660K562460K147409K420577L771727
18030B9924859N791336P325265N695242N89714k411448k157580j37215K370769
18022D6990942M393722K819604m104053q103433o517113m147367k140733r11883
18014B8279686p83339l474361n183103l814241k211520j409195r76256m45463
18006I982208j80406k59296k87246k75362j20716m5722O6456K11924J96651M53953
17996I742444Q52770Q02364J615678K585378L524447L083587K550418K519549
17988B7276635K931441M438957N637189O707657P195589N942167N789841N981178
$$ plain form
17980 71900654 76657166 79595893 79685189 78543270 78572523 77793789 73627350 66241041 58516923
17971 58516923 52671638 47696013 41453463 35247025 31139848 29186775 28293751 26789527
17963 26789527 23442321 19623600 16855986 14990777 13999796 13237931 12504685 11974755 11710693
17954 11710693 11378783 11061157 10791594 10680234 10519986 10311405 10312901 10402109 10807526 11971170
17944 11971170 13520446 15529419 17661579 19364879 20532320 21397565 22899504 25859655
17936 25859655 30148076 34595481 35994777 34464910 32627793 31550938 31962131 33865541
17928 33865541 36337168 35645908 30391484 25307894 22047287 20246600 19219603 18907019
17920 18907019 17960921 15180308 12470700 10813054 9688332 8918027 8479787 8026034 7816057
$$ packed form
17980G1900654M756512K938727Q9296j141919K9253p78734m166439p386309p724118
17971E8516923n845285m975625o242550o206438m107177j953073q93024j504224
17963B6789527l347206l818721k767614j865209r90981p61865p33246n29930k64062
17954A1710693l31910l17626k69563j11360j60248k08581J496Q9208M05417J163644
17944A1971170J549276K008973K132160J703300J167441Q65245J501939K960151
17936B5859655M288421M447405J399296j529867j837117j076855M11193J903410
17928C3865541K471627o91260n254424n083590l260607j800687j026997l12584
17920A8907019r46098k780613k709608j657646j124722p70305m38240m53753k09977
$$ plain form
17911 7816057 7673431 7312551 7096889 7238464 7129444 6925131 6853740 6844389 6667728 6203629
17901 6203629 5798147 5711207 5612348 5378126 5168382 5075004 5071406 4591941 4376405 4327184
17891 4327184 4210968 4205925 4161615 4272462 4326728 4293715 4298488 4403852 4562952 4779972 4577018
17880 4577018 4277921 4304259 4452447 4573405 4518790 4501160 4486808 4431509 4574660 4598952
17870 4598952 4422343 4329956 4460226 4250034 4064352 4036025 4231674 4320622 4611689 4694453
17860 4694453 4828464 4853406 4739045 4573717 4692688 4969917 5022552 4879827 4637800 4322888
17850 4322888 4206147 4183327 4447250 4674062 4680921 4670689 4690250 4805778 5086931 5373922
17840 5373922 5421334 5498500 5764465 6195988 6623657 7220545 7824312 8752582 10005650 11450243
$$ packed form
17911G816057j42626l60880k15662J41575j09020k04313p1391r351j76661m64099
17901F203629m05482q6940r8859k34222k09744r3378l598m79465k15536m9221
17891D327184j16216n043m4310J10847N4266l3013M773J05364J59100K17020k02954
17880D577018k99097K6338J48188J20958n4615j7630j4352n5299J43151K4292
17870D598952j76609r2387J30270k10192j85682k8327J95649Q8948K91067Q2764
17860D694453J34011K4942j14361j65328J18971K77229N2635j42725k42027l14912
17850D322888j16741k2820K63923K26812O859j0232J9561J15528K81153K86991
17840E373922M7412P7166K65965M31523M27669N96888O03767R28270J253068J444593
$$ plain form
17830 11450243 13063507 15099909 17235536 19238333 20810076 22019242 23110675 24070465
17822 24070465 24983259 26021229 26770676 26909607 27617530 29314215 32316722 37168756 44925927
17813 44925927 56603616 72580631 92646871 114979402 135904226 152152006 162388044
17806 162388044 168592824 172798742 175180230 173437791 163303433 145363095 125570818
17799 125570818 108511132 95751364 87033236 81368375 77646630 74662116 71789278 68903200
17791 68903200 66292475 63667059 60271831 55400126 49255634 43347290 38720339 35306702
17783 35306702 33099516 31651185 30862515 30656054 30840160 31260873 32223309 33944239 36512447
17774 36512447 39540212 43031358 47350466 52394654 58051442 64594117 72065955 80163093
$$ packed form
17830A1450243J613264K036402K135627K002797J571743J209166J091433R59790
17822B4070465R12794J037970P49447J38931P07923J696685L002507M852034P757171
17813D4925927J1677689J5977015K0066240K2332531K0924824J6247780J0236038
17806A62388044O204780M205918K381488j742439j0134358j7940338j9792277
17799A25570818j7059686j2759768q718128n664861l721745k984514k872838k886078
17791F8903200k610725k625416l395228m871705o144492n908344m626951l413637
17783C5306702k207186j448331p88670k06461J84106M20713R62436J720930K568208
17774C6512447L027765L491146M319108N044188N656788O542675P471838Q097138
$$ plain form
17766 80163093 88308924 97245724 108818442 122725323 137605434 150604946 160773768
17759 160773768 169735070 181739704 201726066 230659967 264683302 292855935 303860030
17752 303860030 300295597 292049214 284943003 280574448 277024372 266985080 238731896 197488953
17744 197488953 162094390 139016823 123979324 111345047 100202569 91480798 85096514
17737 85096514 80230072 77130829 74794102 72905159 70509283 66271070 60731592 55737383
17729 55737383 51760651 48173451 44727074 41978237 40056277 39140027 38916692 39580902
17721 39580902 41160581 43885066 47094040 50234649 53376148 57108519 62074588 68299928
17713 68299928 74668284 79733000 82456673 83570907 87161419 95828364 108219364 119582017
$$ packed form
17766H0163093Q145831Q936800J1572718J3906881J4880111J2999512J0168822
17759A60773768Q961302J2004634J9986362K8933901L4023335K8172633J1004095
17752C03860030l564433q246383p106211m368555l550076j0039292k8253184m1242943
17744A97488953l5394563k3077567j5037499j2634277j1142478q721771o384284
17737H5096514m866442l099243k336727j888943k395876m238213n539478m994209
17729E5737383l976732l587200l446377k748837j921960r16250k23335O64210
17721C9580902J579679K724485L208974L140609L141499L732371M966069O225340
17713F8299928O368356N064716K723673J114234L590512Q666945J2391000J1362653
$$ plain form
17705 119582017 124393289 123054068 121695579 124537148 132084460 142466695 148895754 142617039
17697 142617039 128903106 115656574 105522290 99893108 96508476 90571058 78015167
17690 78015167 63042907 52026957 45437226 41493769 38185871 35135881 32809628 31396047
17682 31396047 30555428 29453102 28025026 26653535 25485759 24652004 24217497 23411014 21688349
17673 21688349 19223773 17603592 16502688 15551159 14710060 13977383 13316508 12977341 12451676
17664 12451676 11958859 11661720 11374220 10911983 10789976 10632945 10480107 10184601 10052550
17655 10052550 9840641 9591933 9523433 9168557 8602290 8388003 8252433 8141077 8026194
17646 8026194 7730989 7717395 7558155 7580861 7810649 7691941 7386189 7177274 6892420 6852813
$$ packed form
17705A19582017M811272j339221j358489K841569P547312J0382235O429059o278715
17697A42617039j3713933j3246532j0134284n629182l384632n937418j2555891
17690G8015167j4972260j1015950o589731l943457l307898l049990k326253j413581
17682C1396047q40619j102326j428076j371491j167776q33755m34507q06483j722665
17673B1688349k464576j620181j100904r51529q41099p32677o60875l39167n25665
17664A2451676m92817k97139k87500m62237j22007j57031j52838k95506j32051
17655A0052550k11909k48708o8500l54876n66267k14287j35570j11356j14883
17646H026194k95205j3594j59240K2706K29788j18708l05752k08915k84854l9607
$$ plain form
17636 6852813 6592525 6380411 6345377 5932916 5490938 5135836 5209105 4953628 4717157 4441868
17626 4441868 4116835 4206239 4098067 3781976 3655101 3524952 3174038 3038775 2851753 2791025
17616 2791025 2818447 2916950 2979665 3033222 2745165 2549209 2435179 2185693 2115953 2228524
17606 2228524 2217595 2077760 1766555 1444185 1387981 1677394 1621181 1651388 1861018 2010862
17596 2010862 1924352 1829869 1907512 1795028 1700856 1648634 1770938 1888809 1886393 1631451 1462477
17585 1462477 1313608 1125027 1293246 1246857 1210669 1428279 1560171 1485323 1431471 1001289
17575 1001289 734100 673887 640550 761806 889255 862018 980805 973120 797394 792641 845777
17564 845777 835217 1088427 1051155 984423 937690 1048096 939622 925946 1058499 989644 710566
$$ packed form
17636F852813k60288k12114l5034m12461m41978l55102P3269k55477k36471k75289
17626D441868l25033Q9404j08172l16091j26875j30149l50914j35263j87022o0728
17616B791025K7422R8503O2715N3557k88057j95956j14030k49486o9740J12571
17606B228524j0929j39835l11205l22370n6204K89413n6213L0207K09630J49844
17596B010862q6510r4483P7643j12484r4172n2222J22304J17871k416k54942j68974
17585A462477j48869j88581J68219m6389l6188K17610J31892p4848n3852m30182
17575A001289k67189o0213l3337J21256J27449k7237J18787p685j75726m753N3136
17564H45777j0560K53210l7272o6732m6733J10406j08474j3676J32553o8855k79078
$$ plain form
17553 710566 474413 259720 397430 587116 685523 689907 614822 630184 570437 236704 41248
17542 41248 124386 257806 184161 -114538 -50362 191142 334843 199283 198952 225383 191721
17531 191721 299864 225392 217779 322345 304440 274544 505109 612314 748703 717821 752207
17520 752207 747953 800043 849353 949920 1197857 1121895 1089344 781613 943948 1078665 895608
17509 895608 784367 738838 721951 786708 767675 764553 710403 683199 387401 200005 325497
17498 325497 500123 598347 414346 292154 382991 377014 380546 199003 163294 235214 405211
17487 405211 442076 252895 -40279 -72942 -9637 205635 401263 251171 28792 -60766
17477 -60766 -8355 1522 86158 201165 174977 209181 367400 551484 784739 734809 423747
$$ packed form
17553G10566k36153k14693J37710J89686R8407M384p5085J5362n9747l33733j95456
17542D1248Q3138J33420p3645k98699O4176K41504J43701j35560l31K6431l3662
17531A91721J08143p4472p613J04566j7905k9896K30565J07205J36389l0882L4386
17520G52207m254N2090M9310J00567K47937p5962l2551l07731J62335J34717j83057
17509H95608j11241m5529j6887O4757j9033l122n4150k7204k95798j87396J25492
17498C25497J74626R8224j84001j22192R0837n977L532j81543l5709P1920J69997
17487D05211L6865j89181k93174l2663O3305K15272J95628j50092k22379q9558
17477f0766N2411R877Q4636J15007k6188L4204J58219J84084K33255m9930l11062
$$ plain form
17466 423747 209925 263637 196774 285246 523304 528887 327198 122842 -12110 73449 119357
17455 119357 127135 47 -34837 186773 388107 384161 62581 31654 -162097 -394857 -297790
17444 -297790 -209523 -56195 -185442 -102319 -53029 -157819 -117328 18303 78447 275660
17434 275660 226707 202961 248545 42570 15708 -112197 -147918 -119979 4447 13702 44598
17423 44598 -96561 76440 280195 261549 218320 293891 363751 223151 80214 -117467
17413 -117467 -327569 -420850 -327180 -359452 -267080 -216765 -315301 -308084 -84490 85758 -47110
17402 -47110 -57543 -103975 -301210 -28787 1861 -44774 -343551 -607933 -471300 -323879
17392 -323879 -262949 -50079 -21927 -37505 28841 69687 110467 620 -90162 -137726 -22004
$$ packed form
17466D23747k13822N3712o6863Q8472K38058N583k01689k04356j34952Q5559M5908
17455A19357P778j27088l4884K21610K01334l946l21580l0927j93751k32760R7067
17444b97790Q8267J53328j29247Q3123M9290j04790M0491J35631O0144J97213
17434B75660m8953k3746M5584k05975k6862j27905l5721K7939J24426R255L0896
17423D4598j41159J73001K03755j8646m3229P5571O9860j40600j42937j97681
17413a17467k10102r3281R3670l2272R2372N0315r8536P217K23594J70248j32868
17402d7110j0433m6432j97235K72423L0648m6635k98777k64382J36633J47421
17392c23879O0930K12870K8152j5578O6346M0846M0780j09847r0782m7564J15722
$$ plain form
17381 -22004 -87114 118841 268889 115644 92883 102813 19024 -199740 -555944 -505201 -364374
17370 -364374 -75707 93615 -49488 -127815 -228062 -158402 -25343 -42379 -134471 -25392
17360 -25392 53146 148244 230364 374910 418265 316552 274783 181796 51405 210336 104448
17349 104448 42022 281971 433957 187492 191030 538914 498477 131667 -262573 -357862
17339 -357862 -312369 -182600 90570 215080 205232 235534 202431 -28359 -32140 168340 212026
17328 212026 185578 218293 425855 592118 449034 263104 148155 91859 334167 266253
17318 266253 249586 328366 500637 781785 806771 702483 691993 901939 1165972 1245254
17308 1245254 1332405 1438644 1825777 1984012 1872285 1960187 1799402 1548861 1619386 1406521
$$ packed form
17381b2004o5110K05955J50048j53245k2761R930q3789k18764l56204N0743J40827
17370c64374K88667J69322j43103p8327j00247O9660J33059j7036r2092J09079
17360b5392P8538R5098Q2120J44546M3355j01713m1769r2987j30391J58931j05888
17349A04448o2426K39949J51986k46465L538L47884m0437l66810l94240r5289
17339c57862M5493J29769K73170J24510r848L0302l3103k30790l781K00480M3686
17328B12026k6448L2715K07562J66263j43084j85930j14949n6296K42308o7914
17318B66253j6667P8780J72271K81148K4986j04288j0490K09946K64033P9282
17308A245254Q7151J06239L87133J58235j11727Q7902j60785k50541P0525k12865
$$ plain form
17298 1406521 1351331 1368151 1199620 1085326 985245 909139 885508 1259695 1226838 1178324
17288 1178324 1008665 766469 506453 412314 389881 639788 850468 931672 956020 1004120
17278 1004120 1034960 901837 627208 648752 548424 462474 366125 427638 333348 274127 422619
17267 422619 414163 321468 441262 672366 827333 667838 550438 895826 1070529 1207942
17257 1207942 1364224 1550293 1680623 2017561 2287735 2095655 1903566 1930527 2062072 2101140
17247 2101140 2082789 1980002 1630428 1365299 943932 1176130 1517920 1588162 1622511 1461146
17237 1461146 1192044 1228364 1353926 1278438 1225946 1193503 1028940 850772 637535 677224
17227 677224 514897 687506 675239 543308 558155 422573 103121 -40552 241145 270210
$$ packed form
17298A406521n5190J6820j68531j14294j00081p6106k3631L74187l2857m8514
17288A178324j69659k42196k60016r4139k2433K49907K10680Q1204K4348M8100
17278A004120L0840j33123k74629K1544j00328q5950r6349O1513r4290n9221J48492
17267D22619q456r2695J19794K31104J54967j59495j17400L45388J74703J37413
17257A207942J56282J86069J30330L36938K70174j92080j92089K6961J31545L9068
17247B101140j8351j02787l49574k65129m21367K32198L41790P0242L4349j61365
17237A461146k69102L6320J25562p5488n2492l2443j64563j78168k13237L9689
17227F77224j62327J72609j2267j31931J4847j35582l19452j43673K81697K9065
$$ plain form
17217 270210 196058 376612 598904 485692 156100 295150 457321 285552 286896 232804
17207 232804 124879 124014 436566 703789 975367 814551 679456 730579 633250 384168
17197 384168 172066 263933 356108 331571 501954 644101 541206 308492 65416 178480
17187 178480 474948 337963 356082 371832 377457 633051 635406 557192 383447 208079 186588
17176 186588 260819 419019 509062 606648 623711 734167 688575 362421 171824 54798
17166 54798 -147945 -215979 -71871 -155443 -90370 -209386 -314741 -244889 -150187 50609 117104
17155 117104 198519 -16732 -53581 -72482 -239738 -391996 -377248 -358364 -513542 -556105 -518315
17144 -518315 -399450 -325165 -260409 10932 186198 160871 154461 238022 161888 78711 30939
$$ packed form
17217B70210p4152J80554K22292j13212l29592J39050J62171j71769J344n4092
17207B32804j07925q65L12552K67223K71578j60816j35095N1123r7329k49082
17197C84168k12102R1867R2175k4537J70383J42147j02895k32714k43076J13064
17187A78480K96468j36985J8119J5750N625K55594K355p8214j73745j75368k1491
17176A86588P4231J58200R0043R7586J7063J10456m5592l26154j90597j17026
17166E4798k02743o8034J44108q3572O5073j19016j05355O9852R4702K00796O6495
17155A17104Q1415k15251l6849j8901j67256j52258J4748J8884j55178m2563L7790
17144e18315J18865P4285O4756K71341J75266k5327o410Q3561p6134q3177m7772
$$ plain form
17133 30939 76282 55254 -160897 -156898 -52967 -24995 -187068 -220903 -192968 -268438 -162068
17122 -162068 -92072 -268818 -335566 -267637 -207793 -342554 -468363 -209089 -200121 -72530 292784
17111 292784 234688 -79542 -136941 -340839 -241157 67801 128681 -7174 -186796 -67922
17101 -67922 -244245 -447288 -441770 -318838 -97848 -148440 -327546 -387434 -661421 -670208 -612319
17090 -612319 -417226 -13274 146372 7642 -280890 -397335 -146782 187281 -8635 -94214
17080 -94214 46259 -61961 -188712 -316007 -498840 -476139 -286885 -300767 -525984 -470416
17070 -470416 -464959 -339280 -339196 -217416 -242824 -353710 -506890 -519222 -395167 -570292 -495863
17059 -495863 -295654 -52451 -174943 -365246 -422440 -189939 71884 128349 100735 246815
$$ packed form
17133C0939M5343k1028k16151L999J03931K7972j62073l3835K7935p5470J06370
17122a62068O9996j76746o6748O7929N9844j34761j25809K59274Q968J27591L65314
17111B92784n8096l14230n7399k03898R9682L08958O0880j35855j79622J18874
17101f7922j76323k03043N518J22932K20990n0592j79106n9888k73987q787N7889
17090f12319J95093M03952J59646j38730k88532j16445K50553L34063j95916q5579
17080i4214J40473j08220j26751j27295j82833K2701J89254j3882k25217N5568
17070d70416N457J25679Q4J21780k5408j10886j53180j2332J24055j75125P4429
17059d95863K00209K43203j22492j90303n7194K32501K61823N6465k7614J46080
$$ plain form
17049 246815 302327 192161 74165 117447 298176 272689 84934 -97971 -393025 -443954
17039 -443954 -323691 -125593 -121050 -181964 -53114 219783 219191 23828 -414140 -394609 -406772
17028 -406772 -289818 -153895 -108593 -88031 -375318 -341219 -299050 -159621 -174502 -115412 -160346
17017 -160346 -150895 -235722 -517804 -440163 -414974 -524998 -491749 -260659 -8874 70936 207092
17006 207092 197970 319057 312791 59508 66429 136965 22463 60938 -52756 2381 -4332
16995 -4332 86303 78136 104131 155921 40564 -99176 -84379 -106027 -177744 -116277 20741
16984 20741 79048 172610 -51896 -117193 27148 -134371 -208163 1757 105940 107580 19443
16973 19443 -169642 -89932 38870 -98417 -53206 10213 -107995 -93742 219516 130813 -46365
$$ packed form
17049B46815N5512j10166j17996M3282J80729k5487j87755j82905k95054n0929
17039d43954J20263J98098M543o0914J28850K72897n92j95363m37968J9531j2163
17028d06772J16954J35923M5302K0562k87287L4099M2169J39429j4881N9090m4934
17017a60346R451q4827k82082P7641K5189j10024L3249K31090K51785P9810J36156
17006B07092r122J21087o266k53283O921P0536j14502L8475j13694N5137o713
16995d332R0635q167K5995N1790j15357j39740J4797k1648p1717O1467J37018
16984B0741N8307R3562k24506o5297J44341j61519p3792K09920J04183J640q8137
16973A9443j89085P9710J28802j37287M5211O3419j18208J4253L13258q8703j77178
$$ plain form
16962 -46365 30575 47901 158930 28699 19016 -230265 -383403 -243993 -213039 -255515 -309089
16951 -309089 -274724 -187867 -116 268459 381248 335360 147645 119904 44770 -55593
16941 -55593 -283022 -506306 -402580 16749 383193 94034 -359865 -322363 -356227 -472053
16931 -472053 -625310 -515830 -243119 -107061 -186525 -463876 -664901 -605423 -395434 -154414
16921 -154414 -42164 14252 -13399 190052 166402 -47968 -187680 7253 39788 -22165
16911 -22165 -196126 94232 335925 157592 181326 354143 162795 117522 184876 180479 -219182
16900 -219182 -369601 -396960 -211695 -58194 -12250 48766 204586 117840 -141941 -149674 -223073
16889 -223073 -355331 -248272 -141004 -108111 -154701 -226003 -609207 -751152 -714752 -404927
$$ packed form
16962d6365P6940J7326J11029j30231r683k49281j53138J39410L0954m2476n3574
16951c09089L4365Q6857J87751K68575J12789m5888j87715k7741p5134j00363
16941e5593k27429k23284J03726M19329L66444k89159m53899L7502l3864j15826
16931d72053j53257J09480K72711J36058p9464k77351k01025N9478K09989K41020
16921a54414J12250N6416k7651K03451k3650k14370j39712J94933L2535o1953
16911b2165j73961K90358K41693j78333K3734J72817j91348m5273O7354m397l99661
16900b19182j50419k7359J85265J53501M5944O1016J55820q6746k59781p733p3399
16889b23073j32258J07059J07268L2893m6590p1302l83204j41945L6400L09825
$$ plain form
16879 -404927 -186238 -25571 3218 34222 -261527 -246328 -50754 9993 -162864 -283112
16869 -283112 -210340 -181394 -303836 -137113 -200425 -305395 -580634 -463374 -469649 -305783
16859 -305783 -243401 -184321 -68765 -188423 -290168 -29807 -48140 -192089 -531436 -681868
16849 -681868 -374357 -386007 -445554 -283382 -274424 -286381 -303665 -313897 -410160 -631696 -705154
16838 -705154 -608118 -375330 -419366 -487750 -584894 -540663 -381436 -584699 -730056 -633210 -617004
16827 -617004 -544593 -481226 -228270 -295235 -278659 -181143 -20332 87478 127104 169516 100422
16816 100422 101032 323914 351539 226059 118000 -212504 -506744 -364881 -29818 77763
16806 77763 34406 -81724 -60378 -57883 23600 -56218 -96822 -59446 -73206 25646 218936
$$ packed form
16879d04927K18689J60667K8789L1004k95749J5199J95574O0747j72857j20248
16869b83112P2772K8946j22442J66723o3312j04970k75239J17260o275J63866
16859c05783O2382N9080J15556j19658j01745K60361j8333j43949l39347j50432
16849f81868L07511j1650n9547J62172Q958j1957j7284j0232r6263k21536p3458
16838g05154R7036K32788m4036o8384r7144M4231J59227k03263j45357R6846J6206
16827f17004P2411O3367K52956o6965J6576R7516J60811J07810L9626M2412o9094
16816A00422O10K22882K7625j25480j08059l30504k94240J41863L35063J07581
16806G7763m3357j16130K1346K495Q1483p9818m0604L7376j3760R8852J93290
$$ plain form
16795 218936 160956 30741 103851 35119 57137 288955 351127 288875 195101 -25141 -11665
16784 -11665 -179128 -177391 -125941 324 256238 159526 -70453 -289279 -362761 -325668 -210293
16773 -210293 -406331 -380937 -150853 -21925 -91764 -99737 -88276 -103331 18524 -170501 -193216
16762 -193216 6240 95382 -51767 -137616 -268439 -349834 -252670 -145108 -65886 -275247
16752 -275247 -472744 -428918 -224087 -192833 -342550 -259608 -93658 60948 -25240 -216804
16742 -216804 -242929 -187659 -197254 -131720 -142547 -270361 19821 -13980 -417907 -515781 -273212
16731 -273212 -73365 72732 -82991 -228032 -40723 16021 -136715 -10291 -102034 -182153
16721 -182153 -168572 -237613 -209012 -187214 -172823 -210318 -258266 -245330 -232181 -151537 119204
$$ packed form
16795B18936n7980j30215P3110o8732K2018K31818O2172o2252r3774k20242J3476
16784a1665j67463J737N1450J26265K55914r6712k29979k18826p3482L7093J15375
16773b10293j96038K5394K30084J28928o9839p973J1461j5055J21855j89025k2715
16762a93216J99456Q9142j47149q5849j30823q1395R7164J07562P9222k09361
16752b75247j97497M3826K04831L1254j49717Q2942J65950J54606q6188j91564
16742b16804k6125N5270r595O5534j0827j27814K90182l3801m03927r7874K42569
16731b73212J99847J46097j55723j45041J87309N6744j52736J26424r1743q0119
16721a82153J3581o9041K8601K1798J4391l7495m7948J2936J3149Q0644K70741
$$ plain form
16710 119204 330052 62089 -80931 -338170 -89469 -13293 45828 68208 209077 208875 236583
16699 236583 -94800 -186300 -103406 -206096 -258062 -68030 32914 70437 9961 -75569 -322611
16688 -322611 -514813 -523708 -584212 -458005 -284968 -20798 131779 112143 -92960 -256695
16678 -256695 -44596 -4700 180005 73004 -59137 -206361 -35279 67717 -155775 -136181
16668 -136181 -174332 -77647 21777 61939 198363 280327 90620 218619 129185 101392 239352
16657 239352 133740 66783 -24823 121043 185133 95781 -75786 -187347 -177465 -280249 -384217
16646 -384217 -514299 -422526 -390103 -686325 -738706 -490345 -320340 -147418 -43619 -171648
16636 -171648 -486148 -479715 -448901 -480886 -274699 -48407 -67402 -186098 -313518 -547199
$$ packed form
16710A19204K10848k67963j43020k57239K48701P6176N9121K2380J40869k02K7708
16699B36583l31383r1500Q2894j02690n1966J90032J00944L7523o0476q5530k47042
16688c22611j92202q895o0504J26207J73037K64170J52577j9636k05103j63735
16678b56695K12099L9896J84705j07001j32141j47224J71082J02996k23492J9594
16668a36181l8151R6685R9424M0162J36424Q1964j89707J27999q9434k7793J37960
16657B39352j05612o6957r1606J45866O4090q9352j71567j11561R882j02784j03968
16646c84217j30082R1773L2423k96222n2381K48361J70005J72922J03799j28029
16636a71648l14500O433L0814l1985K06187K26292j8995j18696j27420k33681
$$ plain form
16626 -547199 -677697 -479452 -148259 54266 -20537 -73833 -896 -64664 -198328 -146080
16616 -146080 -176110 -23624 -483 121640 -132348 -232993 -149167 -73772 -9778 -134417
16606 -134417 -172504 22633 126814 -99005 69697 178172 192632 336218 73249 -49957
16596 -49957 -70956 9628 33662 268867 347183 288294 203333 -125196 -375952 -397995 -401473
16585 -401473 -285623 -61390 26485 -68758 -196864 -208496 48334 167507 216727 47691
16575 47691 7480 168409 121953 -18112 -141777 -353699 -391674 -253052 -259246 -179111 -114453
16564 -114453 -19152 -119244 -383771 -548825 -304806 -315859 -270982 -264102 -271503 -255595 -167791
16553 -167791 33461 141256 197362 148530 -14415 -159084 -218299 -312041 -418082 -453258
$$ packed form
16626e47199j30498J98245L31193K02525p4803n3296P2937o3768j33664N2248
16616a46080l0030J52486K3141J22123k53988j00645Q3826P5395O3994j24639
16606a34417l8087J95137J04181k25819J68702J08475J4460J43586k62969j23206
16596d9957k0999Q0584K4034K35205P8316n8889q4961l28529k50756k2043l478
16585d01473J15850K24233Q7875r5243j28106j1632K56830J19173M9220j69036
16575D7691m0211J60929m6456j40065j23665k11922l7975J38622o194Q0135O4658
16564a14453R5301j00092k64527j65054K44019j1053M4877O880p401J5908Q7804
16553a67791K01252J07795N6106m8832j62945j44669n9215r3742j06041l5176
$$ plain form
16543 -453258 -271959 -259531 -386623 -217375 -9478 -174802 -131459 -69391 -20082 62561
16533 62561 156193 326851 215269 255704 34713 -58123 -25846 -264418 -341643 -157986 -286512
16522 -286512 -585767 -495655 -227359 15994 83605 117567 185676 76583 10708 135590
16512 135590 161035 76723 -7234 53126 -128850 -355018 -217698 31548 64992 -162840
16502 -162840 -125621 89976 48150 -187154 -154175 -211045 -156049 -118940 -64553 97467 129575
16491 129575 217650 373328 656631 655033 530145 277712 80921 -192109 -393461 -177375
16481 -177375 -169954 64396 200538 241814 59981 -186246 -206953 -318846 -432831 -518310
16471 -518310 -438928 -282591 -33836 123572 190714 -226020 -730823 -762883 -850930 -609151
$$ packed form
16543d53258J81299J2428j27092J69248K07897j65324M3343O2068M9309Q2643
16533F2561R3632J70658j11582M0435k20991r2836L2277k38572p7225J83657j28526
16522b86512k99255R0112K68296K43353O7611L3962O8109j09093o5875J24882
16512A35590K5445q4312q3957O0360j81976k26168J37320K49246L3444k27832
16502a62840L7219K15597m1826k35304L2979n6870N4996L7109N4387J62020L2108
16491A29575Q8075J55678K83303j598j24888k52433j96791k73030k01352K16086
16481a77375P421K34350J36142M1276j81833k46227k0707j11893j13985q5479
16471e18310P9382J56337K48755J57408O7142m16734n04803l2060q8047K41779
$$ plain form
16461 -609151 -222313 -428769 -263468 -69327 -227396 -215104 -84392 44505 -127971 -314405
16451 -314405 -540145 -365185 -109140 -172566 -83529 -101694 -153965 -359083 -609875 -855791
16441 -855791 -918565 -762723 -716506 -528091 -292863 -70747 56025 243961 219786 71696
16431 71696 -67810 30658 -200147 -280799 -287932 -413471 -335531 -394147 -197602 -10440 126839
16420 126839 256569 151499 187576 23922 41751 -46345 -186681 -78353 -20577 12361
16410 12361 172134 235296 -32997 -151788 -74731 -215718 -343517 -255266 13486 29111
16400 29111 -10217 -175356 -110128 52118 38374 115768 59055 70569 67570 139502 204960
16389 204960 -36154 -256350 -279514 -329370 -427853 -323433 -23441 46725 -144855 -263574
$$ packed form
16461f09151L86838k06456J65301J94141j58069J2292J30712J28897j72476j86434
16451c14405k25740J74960K56045o3426Q9037j8165n2271k05118k50792k45916
16441h55791o2774J55842M6217J88415K35228K22116J26772J87936k4175j48090
16431G1696j39506R8468k30805q0652p133j25539P7940n8616J96545J87162J37279
16420A26839J29730j05070L6077j63654J7829q8096j40336J08328N7776L2938
16410A2361J59773O3162k68293j18791P7057j40987j27799Q8251K68752J5625
16400B9111l9328j65139O5228J62246j3744P7394n6713J1514k999P1932O5458
16389B04960k41114k20196k3164m9856r8483J04420K99992P0166j91580j18719
$$ plain form
16379 -263574 -145326 -101019 -112582 -222323 -359221 -244475 -92943 90290 -112218 -381945
16369 -381945 -651505 -591882 -380428 -318708 -216053 -354449 -631000 -545917 -442086 -472823
16359 -472823 -360705 -463093 -581053 -704129 -534562 -461513 -90174 129459 -23031 -232028
16349 -232028 -329126 -324801 -35357 71659 28131 133655 -183363 -217922 -217664 -314065 -293493
16338 -293493 -355423 -195740 -228355 -301867 -341557 -411529 -374088 -115569 139624 239783 191116
16327 191116 171170 30284 -122011 -140984 -275417 -500476 -488144 -620873 -268149 -195174
16317 -195174 -123871 18434 -12169 -104483 -106012 -157523 -45559 -57629 -355995 -498257 -217716
16306 -217716 74647 75611 125265 4131 -161905 -219999 -367801 -344282 -320477 -269419 -283161
$$ packed form
16379b63574J18248M4307j1563j09741j36898J14746J51532J83233k02508k69727
16369c81945k69560N9623K11454O1720J02655j38396k76551Q5083J03831l0737
16359d72823J12118j02388j17960j23076J69567P3049L71339K19633j52490k08997
16349b32028r7098M325K89444J07016m3528J05524l17018l4559K58r6401K0572
16338b93493o1930J59683l2615p3512l9690o9972L7441K58519K55193J00159m8667
16327A91116j9946j40886j52295j8973j34433k25059J2332j32729L52724P2975
16317a95174P1303J42305l0603r2314j529n1511J11964j2070k98366j42262K80541
16306b17716K92363R64M9654j21134j66036n8094j47802K3519K3805N1058j3742
$$ plain form
16295 -283161 -286015 -339089 -286034 -113842 69856 260451 109465 170720 167101 -154647 -269277
16284 -269277 -173298 -210249 -291885 -29948 130657 195646 170127 115276 198307 52574 -183273
16273 -183273 -215781 -70463 15930 -52611 -188731 -398870 -425928 -228541 -72087 -72161 -33603
16262 -33603 -28679 -77936 -26735 -240077 -257165 -45374 -43359 -159711 -233456 -396498 -333169
16251 -333169 -353290 -351752 -110770 -57269 -19095 -47798 -49620 22716 332294 444949 324070
16240 324070 296055 170332 46186 182600 353530 287204 365367 480744 371486 94414
16230 94414 24555 109122 98362 232576 193289 -726 -145464 -160631 -183946 -255789 -355338
16219 -355338 -305049 102911 120006 15330 23820 37229 -115827 -204848 -163551 -209910 -174590
$$ packed form
16295b83161k854n3074N3055J72192J83698J90595j50986O1255l619l21748j14630
16284b69277R5979l6951q1636K61937J60605O4989k5519n4851Q3031j45733k35847
16273a83273l2508J45318Q6393o8541j36120k10139k7058J97387J56454p4L8558
16262c3603M924m9257N1201k13342j7088K11791K015j16352p3745j63042O3329
16251c33169k0121J538K40982N3501L8174k8703j822P2336L09578J12655j20879
16240C24070k8015j25723j24146J36414J70930o6326P8163J15377j09258k77072
16230I4414o9859Q4567j0760J34214l9287j94015j44738j5167k3315p1843r9549
16219c55338N0289M07960J7095j04676Q490J3409j53056q9021M1297m6359L5320
$$ plain form
16208 -174590 -163271 -165071 -115442 -47049 -23246 193359 365279 161653 -34042 -183639 -367512
16197 -367512 -297033 -77884 128455 15987 -122860 -275361 -120377 -219913 -292666 -293178 -124453
16186 -124453 59730 -39160 -129124 -288512 -138988 42447 -48281 -62083 -76123 108400
16176 108400 127613 154660 -8154 -231238 -174326 5671 -14559 -101517 -365452 -404678 132628
16165 132628 259167 53543 171241 128088 185516 57865 -57669 -79631 55959 86112
16155 86112 135523 107891 -157192 -375021 -131963 85056 39121 151037 228068 85692
16145 85692 -165794 -104532 34104 -153506 -372534 -577550 -697078 -559650 -378828 -280868
16135 -280868 -263002 -202967 -200122 -194552 -269466 -300639 -70593 73790 11535 -115357 -174612
$$ packed form
16208a74590J1319j800M9629O8393K3803K16605J71920k03626j95695j49597j83873
16197c67512P0479K19149K06339j12468j38847j52501J54984r9536p2753n12J68725
16186a24453J84183r8890q9964j59388J49524J81435r0728j3802j4040J84523
16176A08400J9213K7047j62814k23084N6912J79997k0230q6958k63935l9226N37306
16165A32628J26539k05624J17698m3153N7428j27651j15534k1962J35590L0153
16155H6112M9411k7632k65083k17829K43058K17019m5935J11916P7031j42376
16145H5692k51486O1262J38636j87610k19028k05016j19528J37428J80822R7960
16135b80868J7866O0035K845N570p4914l1173K30046J44383o2255j26892n9255
$$ plain form
16124 -174612 -156847 -179552 -140424 -157642 -244001 -287487 -332916 -203108 -158097 -296123 -470676
16113 -470676 -560371 -367479 -282445 -438106 -274030 105099 227609 120610 115355 -115980
16103 -115980 -3977 34501 -104627 -162794 -161112 104643 164163 -55003 -212992 -238344 -118286
16092 -118286 128797 135639 -175647 -290136 -404518 -140522 -18991 -319021 -500811 -424050
16082 -424050 -197465 -214428 -410752 -391742 -266011 -107420 -75879 -47453 -66418 -159087 -231030
16071 -231030 -156635 -245015 -419489 -206751 -22812 -106610 -233558 -58954 -33903 -229467
16061 -229467 -318264 -331756 -108446 41632 119330 113787 182599 -103181 -275432 -253910 -376697
16050 -376697 -699628 -737070 -563464 -499544 -321623 65255 47033 -2821 -104918 -227594
$$ packed form
16124a74612J7765k2705L9128j7218q6359m3486m5429J29808M5011j38026j74553
16113d70676q9695J92892Q5034j55661J64076L79129J22510j06999n255k31335
16103a15980J12003L8478j39128n8167J682K65755N9520k19166j57989k5352J20058
16092a18286K47083O842l11286j14489j14382K63996J21531l00030j81790P6761
16082d24050K26585j6963j96324J9010J25731J58591L1541K8426j8965r2669p1943
16071b31030P4395q8380j74474K12738J83939q3798j26948J74604K5051j95564
16061b29467q8797j3492K23310J50078P7698n543O8812k85780j72251K1522j22787
16050c76697l22931l7442J73606O3920J77921L86878j8222m9854j02097j22676
$$ plain form
16040 -227594 -36624 172620 24159 -313636 -261614 -155830 -139251 -336265 -339103 -406490
16030 -406490 -534512 -478836 -458500 -422674 -370194 -343848 -421614 -459155 -374471 -312607 -248106
16019 -248106 -424412 -276927 -66841 -84047 -294530 136890 305806 213697 158398 90550
16009 90550 92478 94322 79762 117295 219283 10732 -282067 -377433 -467144 -558981 -691433
15998 -691433 -765728 -502878 -410612 -316336 -657588 -572130 -577582 -351062 -527030 -545094 -343712
15987 -343712 -272369 -98281 -40001 384845 446136 180963 193151 88440 55398 -81555
15977 -81555 -66824 64187 -53166 -187491 -110124 -94416 -311687 -343911 -250298 -169723 -386245
15966 -386245 -445412 -169076 -120546 -162217 -260422 -396720 -479796 -367746 -77897 -70752 -71951
$$ packed form
16040b27594J90970K09244j48461l37795N2022J05784J6579j97014k838o7387
16030d06490j28022N5676K0336L5826N2480K6346p7766l7541Q4684O1864O4501
16019b48106j76306J47485K10086j7206k10483M31420J68916r2109n5299o7848
16009I0550J928J844j4560L7533J01988k08551k92799r5366q9711r1837j32452
15998f91433p4295K62850R2266R4276l41252Q5458n452K26520j75968j8064K01382
15987c43712P1343J74088N8280M24846O1291k65173J2188j04711l3042j36953
15977h1555J4731J31011j17353j34325P7367J5708k17271l2224R3613Q0575k16522
15966c86245n9167K76336M8530m1671r8205j36298q3076J12050K89849P145j199
$$ plain form
15955 -71951 -157961 -85313 -196879 -317733 -407663 -362574 -150461 -370573 -353557 -303582 -158095
15944 -158095 -49269 -24195 16634 -46769 132806 27699 -47433 114212 -79504 -150273
15934 -150273 -130650 -130945 15999 143897 116052 -107949 -80900 -31003 -68102 -27200 -38287
15923 -38287 -24778 -219929 -484593 -594750 -503555 -517202 -439990 -553645 -450786 -245430
15913 -245430 -167133 -121321 -36626 -77300 -116386 19723 136802 -43273 10844 147493 154732
15902 154732 -106728 -244030 -319300 -374325 -164392 -188952 -184328 37754 237027 248603 -1837
15891 -1837 -16767 93589 48196 -2527 53643 170118 20413 -48556 -23211 -176725 -213039
15880 -213039 -149295 -50683 -332501 -333591 -67046 -22709 -221239 -399828 -489790 -267735 -340144
$$ packed form
15955g1951q6010P2648j11566j20854q9930M5089K12113k20112J7016M9975J45487
15944a58095J08826K5074M0829o3403J79575j05107p5132J61645j93716p0769
15934a50273J9623k95J46944J27898k7845k24001K7049M9897l7099M0902j1087
15923c8287J3509j95151k64664j10157R1195j3647P7212j13655J02859K05356
15913b45430P8297M5812Q4695m0674l9086J36109J17079j80075N4117J36649P239
15902A54732k61460j37302p5270n5025K09933k4560M624K22082J99273J1576k50440
15891a837j4930J10356m5393n0723N6170J16475j49705o8969K5345j53514l6314
15880b13039O3744R8612k81818j090K66545M4337j98530j78589q9962K22055p2409
$$ plain form
15869 -340144 -184198 -39581 54505 -33243 -10557 -22712 -14304 4512 -88855 75223 -3468
15858 -3468 -322550 -106324 -82368 -227186 -174879 71642 78918 -182584 -232987 -196568 -72046
15847 -72046 -100304 -70389 -101827 -151058 -373575 -384156 -23524 43092 -162519 -85854 -284507
15836 -284507 -451794 -495528 -358276 -251009 -105624 -149568 -223299 -168667 -136996 -69015 -285215
15825 -285215 -328664 -295907 -345031 -301156 -230563 -70522 -74659 -182413 -302118 -238207 -108107
15814 -108107 112121 -176938 -321454 -263740 -131038 -98065 -199745 -277824 -281268 -482010
15804 -482010 -391066 -373170 -284491 -45947 50621 60167 7235 6245 48117 34371 -251109 -424192
15792 -424192 -237538 -353017 -305211 -18467 -151629 -314003 -269352 -251384 65987 62299
$$ packed form
15869c40144J55946J44617R4086q7748K2686j2155Q408J8816r3367J64078p8691
15858c468l19082K16226K3956j44818N2307K46521P276k61502n0403L6419J24522
15847g2046k8258K9915l1438m9231k22517j0581L60632O6616k05611P6665j98653
15836b84507j67287m3734J37252J07267J45385m3944p3731N4632L1671O7981k16200
15825b85215m3449L2757m9124M3875P0593J60041m137j07754j19705O3911J30100
15814a08107K20228k89059j44516N7714J32702L2973j01680p8079l444k00742
15804d82010R0944J7896Q8679K38544R6568R546n2932r90M1872j3746k85480j73083
15792d24192J86654j15479M7806K86744j33162j62374M4651J7968L17371l688
$$ plain form
15782 62299 -22772 -57675 62585 151094 32593 -123782 -135875 -55797 -274626 -435097 -422123
15771 -422123 -302716 -269356 -218377 -85166 -313089 -332732 -365153 -387402 -219353 87216
15761 87216 266651 -129522 -57273 -55930 -277908 -492205 -582480 -501933 -267434 32616 106440
15750 106440 187716 207413 291769 249724 178680 25832 -190962 -117902 -7151 30722 208043
15739 208043 57543 -212754 -128300 35199 -40801 -77844 -32637 26265 233674 433542
15729 433542 183575 82881 32823 196251 123214 -282323 -258573 18201 89480 156416
15719 156416 331972 304980 163328 83327 167794 344963 290316 172844 109561 -10752
15709 -10752 57534 52128 141756 152658 259853 473444 425940 188326 118986 301424 237628
$$ packed form
15782F2299q5071l4903J20260Q8509j18501j56375j2093Q0078k18829j60471J2974
15771d22123J19407L3360N0979J33211k27923j9643l2421k2249J68049L06569
15761H7216J79435l96173P2249J343k21978k14297r0275Q0547K34499L00050P3824
15750A06440Q1276J9697Q4356m2045p1044j52848k16794P3060J10751L7873J77321
15739B08043j50500k70297Q4454J63499p6000l7043M5207N8902K07409J99868
15729D33542k49967j00694n0058J63428p3037m05537K3750K76774P1279O6936
15719A56416J75556k6992j41652q0001Q4467J77169n4647j17472o3283j20313
15709a0752O8286n406Q9628J0902J07195K13591m7504k37614o9340J82438o3796
$$ plain form
15698 237628 304987 177162 89346 188740 340072 436397 291709 86095 120101 228369
15688 228369 286788 -105984 -195992 -252442 -255407 -325759 -387895 -234667 -172083 -199374 -41846
15677 -41846 198519 311631 264376 386129 253541 -96503 -33547 29553 47742 202511
15667 202511 47066 -44049 -207062 -50512 -8171 -163532 -231518 -457516 -474563 -148894
15657 -148894 -246186 -191880 15097 11944 -87955 -292546 -162398 -31394 -62820 -192235 -66244
15646 -66244 -57000 45601 -76631 -190689 -413579 -363643 -129268 -123201 -135306 -51539 -199595
15635 -199595 -94073 -232644 -288793 -25722 196637 343328 317304 494351 610829 272341
15625 272341 -155964 -56109 -163945 -242566 -307300 -96254 -234644 -467107 -447583 -398249
$$ packed form
15698B37628O7359j27825q7816R9394J51332R6325j44688k05614L4006J08268
15688B28369N8419l92772r0008n6450k965p0352o2136J53228O2584k7291J57528
15677d1846K40365J13112m7255J21753j32588l50044O2956O3100J8189J54769
15667B02511j55445r1115j63013J56550M2341j55361o7986k25998j7047L25669
15657a48894r7292N4306K06977l153r9899k04591J30148J31004l1426j29415J25991
15646f6244R244J02601j22232j14058k22890M9936K34375O067j2105Q3767j48056
15635a99595J05522j38571n6149K63071K22359J46691k6024J77047J16478l38488
15625B72341m28305R9855j07836p8621o4734K11046j38390k32463J9524M9334
$$ plain form
15615 -398249 -340953 -395412 -144811 -163737 -302920 -201078 -31687 -83045 -202610 -434349
15605 -434349 -563082 -433321 -406916 -340501 -149756 -145232 -230437 -410701 -617234 -680210 -454881
15594 -454881 -406870 -234876 -41963 50028 -123246 -94074 45798 -75830 -374309 -475534
15584 -475534 -519905 -283956 -205351 -233582 -148577 -58687 -159027 -291807 -1509 37982 -158404
15573 -158404 -275614 -329088 -222724 -72618 -132573 -89138 -95448 67162 72720 87318 -76385
15562 -76385 -119511 -125993 -6418 -65818 -65270 -98121 -68567 49753 81052 63332 18358 -136103
15550 -136103 -369580 -358007 -104527 -47852 -117370 -55522 -117542 -329818 -206682 191293
15540 191293 60154 -53928 -38663 -44278 -30668 94358 59587 97752 131864 35158 -59922
$$ packed form
15615c98249N7296n4459K50601j8926j39183J01842J69391n1358j19565k31739
15605d34349j28733J29761K6405O6415J90745M524q5205j80264k06533o2976K25329
15594d54881M8011J71994J92913R1991j73274K9172J39872j21628k98479j01225
15584d75534m4371K35949P8605k8231Q5005Q9890j00340j32780K90298L9491j96386
15573a58404j17210n3474J06364J50106n9955M3435o310J62610N558J4598j63703
15562g6385m3126o482J19575n9400N48l2851K9554J18320L1299j7720m4974j54461
15550a36103k33477J1573K53480N6675o9518O1848o2020k12276J23136L97975
15540A91293j31139j14082J5265n615J3610J25026l4771L8165L4112r6706r5080
$$ plain form
15529 -59922 -15105 191611 -10916 -254554 -67795 -4160 -49566 -54441 -48528 -113573 -192516
15518 -192516 -251487 -143243 -72820 118977 134107 -21250 -40459 -199982 -287198 -134127
15508 -134127 -46088 44180 82214 13023 -229731 -123362 -67592 -196632 -464282 -233960
15498 -233960 -110709 23805 66495 -171921 -203991 -137195 -6644 -22690 123958 122918 -91289
15487 -91289 122390 156879 24645 -225052 -461931 -495308 -491114 -417346 -199523 -135791 -243933
15476 -243933 -40893 -104913 -363638 -340908 -180886 43848 -21059 -104794 56100 34445
15466 34445 -16873 7585 182078 464200 578737 193594 -10569 43818 -55994 -233745
15456 -233745 -323983 -438012 -464379 -209019 -143449 -180540 -184529 -123233 -190773 -273472 -264929
$$ packed form
15529e9922M4817K06716k02527k43638J86759O3635m5406m875N913o5045p8943
15518a92516n8971J08244P0423J91797J5130j55357j9209j59523q7216J53071
15508a34127Q8039R0268L8034o9191k42754J06369N5770j29040k67650K30322
15498b33960J23251J34514M2690k38416l2070O6796J30551j6046J46648j040k14207
15487i1289K13679L4489j32234k49697k36879l3377M194P3768K17823O3732j08142
15476b43933K03040o4020k58725K2730J60022K24734o4907q3735J60894k1655
15466C4445n1318K4458J74493K82122J14537l85143k04163N4387r9812j77751
15456b33745r0238j14029k6367K55360O5570l7091l989O1296o7540q2699Q543
$$ plain form
15445 -264929 -221362 -264378 -245020 -348613 -424544 -296534 -349251 -279552 -119331 -200994 -189466
15434 -189466 -160928 -194793 -367317 -274145 -234052 -328890 -349426 -199665 137622 -16655 -59156
15423 -59156 190431 267280 -60060 -182820 -31816 -179630 -578812 -594902 -248826 -9291
15413 -9291 1651 -35914 -195494 -12158 126369 316003 246718 239556 185394 76467 4562
15402 4562 -152675 -85295 86767 -299223 -661294 -359398 -275943 -342479 -354537 -280890 21572
15391 21572 133935 28059 136697 277407 500945 397532 98917 8944 -192781 -337439
15381 -337439 -285473 -297470 -287940 -329673 -439633 -477645 -367796 -372751 -372008 -346648 -129589 32053
15369 32053 -55429 -33155 -65709 -213146 -150665 155746 89831 -44404 -36862 -48650 -55391
$$ packed form
15445b64929M3567m3016J9358j03593p5931J28010n2717O9699J60221q1663J1528
15434a89466K8538l3865j72524R3172M0093r4838k0536J49761L37287j54277m2501
15423e9156K49587P6849l27340j22760J51004j47814l99182j6090L46076K39535
15413i291J0942l7565j59580J83336J38527J89634o9285p162n4162j08927p1905
15402D562j57237O7380J72062l85990l62071L01896Q3455o6536j2058P3647L02462
15391B1572J12363j05876J08638J40710K23538j03413k98615q9973k01725j44658
15381c37439N1966j1997R530m1733j09960l8012J09849m955P43K5360K17059J61642
15369C2053q7482K2274l2554j47437O2481L06411o5915j34235P542j1788o741
$$ plain form
15358 -55391 -91095 -9330 133924 134399 78539 38747 7671 9678 -434803 -610001 -351225
15347 -351225 -52583 157650 -59576 -128427 -85324 47941 -81990 -273237 -148187 70403
15337 70403 194444 70250 49371 70294 -64498 -112071 -116347 -151422 -242879 -85508 89090
15326 89090 212202 62126 226774 116069 -127398 72410 160371 195756 -85491 -383968
15316 -383968 -482888 -462681 -116803 139568 -29670 -81510 264733 438007 234054 172855
15306 172855 151236 106745 -215109 -339191 -256788 -70365 257121 607570 517196 295735
15296 295735 -126165 -283098 -282822 -347136 -327705 -242603 -398716 -774391 -763637 -821981 -727737
15285 -727737 -630679 -519770 -459659 -218621 35486 -47588 -242380 -372523 -489670 -299006
$$ packed form
15358e5391l5704Q1765J43254M75n5860l9792l1076K007m44481j75198K58776
15347c51225K98642K10233k17226o8851M3103J33265j29931j91247J25050K18590
15337G0403J24041j24194k0879K0923j34792m7573m276l5075r1457J57371J74598
15326H9090J23112j50076J64648j10705k43467J99808Q7961L5385k81247k98477
15316c83968r8920K0207L45878K56371j69238n1840L46243J73274k03953o1199
15306A72855k1619m4491l21854j24082Q2403J86423L27486L50449r0374k21461
15296B95735m21900j56933K76o4314J9431Q5102j56113l75675J0754n8344R4244
15285g27737R7058J10909O0111K41038K54107q3074j94792j30143j17147J90664
$$ plain form
15275 -299006 -197950 -236362 -324152 -172357 -171213 -145427 -210264 -392628 -410778 -260474 -257686
15264 -257686 -422920 -466760 -241953 -178531 -80938 -39904 -257700 -397552 -396059 -405924 -166561
15253 -166561 31978 165355 58708 126896 39454 18775 13365 -60040 -15110 -197137 -104274
15242 -104274 -128343 -81644 -445111 -481256 -335164 -269358 -193511 -384341 -399045 -258732 -131988
15231 -131988 -80294 -129876 -77269 -54620 -275291 -216389 -41617 9711 25232 -12058 -86873
15220 -86873 -159936 -104198 -161071 -338361 -110353 25085 132370 85583 -29375 82430
15210 82430 70082 -204798 25796 327133 209899 152491 177573 147712 71892 -162642 -313668
15199 -313668 -381389 -220828 -106295 -111714 -341005 -269919 -381928 -234564 41416 148868
$$ packed form
15275b99006J01056l8412q7790J51795J144K5786o4837j82364j8150J50304K788
15264b57686j65234m3840K24807O3422R7593M1034k17796j39852J493r865K39363
15253a66561J98539J33377j06647O8188q7442k0679n410p3405M4930j82027R2863
15242a04274k4069M6699l63467l6145J46092O5806P5847j90830j4704J40313J26744
15231a31988N1694m9582N2607K2649k20671N8902J74772N1328J5521l7290p4815
15220h6873p3063N5738n6873j77290K28008J35438J07285m6787j14958J11805
15210H2430j2348k74880K30594L01337j17234n7408K5082k9861p5820k34534j51026
15199c13668o7721J60561J14533n419k29291P1086j12009J47364K75980J07452
$$ plain form
15189 148868 218770 277923 137563 17291 -46067 -81092 -96701 -76803 -6178 -53024 5960
15178 5960 -86745 -187547 -182493 -419280 -594490 -306461 44130 -6175 -305322 -293460 -369322
15167 -369322 -480403 -476160 -374091 -379374 -432190 -452190 -478456 -230494 -148192 -282039 -284484
15156 -284484 -276875 -105840 134618 40245 -15394 -278812 -339933 -298285 -172328 -70948 -18432
15145 -18432 -23017 -311897 -575859 -474898 -407564 -301343 -245668 -365942 -230376 151035
15135 151035 108167 106915 167271 -34761 -31088 225125 160672 -73216 -101916 -12083 -44376
15124 -44376 -229964 -244037 -114185 -86314 -68876 -114812 -302747 -305105 -101115 -166125 -370996
15113 -370996 86465 357123 336631 154321 350559 754759 462215 44446 32558 245226
$$ packed form
15189A48868O9902N9153j40360j20272o3358l5025j5609J9898P0625m6846N8984
15178E960r2705j00802N054k36787j75210K88029L50591n0305k99147J1862p5862
15167c69322j11081M243J02069n283n2816k0000k6266K47962Q2302j33847k445
15156b84484P609J71035K40458r4373n5639k63418o1121M1648J25957J01380N2516
15145a8432m585k88880k63962J00961O7334J06221N5675j20274J35566L81411
15135A51035m2868j252O0356k02032L673K56213o4453k33888k8700Q9833l2293
15124d4376j85588j4073J29852K7871J7438m5936j87935k358K03990o5010k04871
15113c70996M57461K70658k0492j82310J96238M04200k92544m17769j1888K12668
$$ plain form
15103 245226 321 -336712 -415233 -156421 102182 -48534 -194526 -370331 -393007 -318617
15093 -318617 -243544 -87466 -198840 -159481 -31207 -191868 -394572 -489211 -307477 -89466
15083 -89466 65652 11995 -1263 -181793 -295860 -407439 -441799 -376280 -81309 -130128 -99867
15072 -99867 47062 16220 -5848 -146933 -175224 -84995 -344107 -504470 -307643 -234754 -256470
15061 -256470 -88465 7778 -15929 -4154 8413 202115 377708 366110 463555 386537 191125
15050 191125 56318 -22709 -73909 -136757 -99892 71904 4505 -5686 -40400 -163591 -101907
15039 -101907 -188701 -170407 -34654 -139512 -340029 -59286 -26539 68316 63586 -47249 11147
15028 11147 -151818 -376264 -440743 -537596 -448088 -251881 -293006 -388588 -183532 6769 -207319
$$ packed form
15103B45226k44905l37033p8521K58812K58603j50716j45992j75805k2676P4390
15093c18617P5073J56078j11374L9359J28274j60661k02704r4639J81734K18011
15083h9466J55118n3657j3258j80530j14067j11579l4360O5519K94971m8819L0261
15072i9867J46929l0842k2068j41085k8291R0229k59112j60363J96827P2889k1716
15061b56470J68005R6243k3707J1775J2567J93702J75593j1598R7445p7018j95412
15050A91125j34807p9027n1200o2848L6865J71796o7399j0191l4714j23191O1684
15039a01907q6794J8294J35753j04858k00517K80743L2747R4855m730j10835N8396
15028A1147j62965k24446o4479r6853Q9508J96207m1125r5582K05056J90301k14088
$$ plain form
15017 -207319 -318031 -280466 -106181 154641 303069 239163 94042 45891 -234218 -341498
15007 -341498 -312775 -182652 66711 374935 362978 252425 25427 -85141 57521 301703
14997 301703 107210 33633 -122871 -338034 -439129 -256135 -259567 -226599 -304683 -483032
14987 -483032 -750132 -924289 -763286 -483072 -425190 -507493 -500473 -496251 -329904 16604 81766
14976 81766 88185 -29882 28277 104258 50659 -103575 -88843 -60991 -39736 -79424 -91907
14965 -91907 -193608 -394114 -220294 -23361 65497 -56589 -209166 -375043 -445102 -566204
14955 -566204 -343736 -136345 -79128 -175467 -135946 -151596 50779 75437 -32789 -43003 -146475
14944 -146475 -49823 39375 -165766 -72844 93917 -12837 70813 85590 -23793 37156 -92416
$$ packed form
15017b07319j10712L7565J74285K60822J48428o3906j45121m8151k80109j07280
15007c41498K8723J30123K49363L08224j1957j10553k26998j10568J42662K44182
14997C01703j94493p3577j56504k15163j01095J82994l432L2968p8084j78349
14987d83032k67100j74157J61003K80214N7882q2303P020M222J66347L46508O5162
14976H1766O419j18067N8159P5981n3599j54234J4732K7852K1255l9688j2483
14965i1907j01701k00506J73820J96933Q8858j22086j52577j65877p0059j21102
14955e66204K22468K07391N7217r6339L9521j5650K02375K4658j08226j0214j03472
14944a46475R6652Q9198k05141R2922J66761j06754Q3650J4777j09383O0949j29572
$$ plain form
14933 -92416 -44385 59876 201869 274443 266045 343581 258274 -143032 -211286 -253975 -149419
14922 -149419 -117039 -206116 -200650 -240511 -214560 -224001 -214415 -544842 -534134 -253646 -255296 -143949
14910 -143949 -100099 -398336 -457282 -270579 -273745 -379360 -363191 -223112 -114615 -102051 -337157
14899 -337157 -375421 -158695 -58461 -73765 -149730 -70844 -127336 -71550 165250 215577 261170
14888 261170 163504 14819 110996 268761 198884 240550 262951 378459 318861 117871 80924
14877 80924 -110368 -132747 -156670 -198535 -44062 55777 122590 38621 -164143 -284724 -76547
14866 -76547 210812 225240 213800 189241 123457 -54372 -244334 -327218 -106803 -145290 -134659
14855 -134659 -72226 -78074 27954 5740 -118400 -278239 -347848 -466933 -397979 -341544 -272820
$$ packed form
14933i2416M8031J04261J41993P2574q398P7536q5307m01306o8254m2689J04556
14922a49419L2380q9077N466l9861K5951r441R586l30427J0708K80488j650J11347
14910a43949M3850k98237n8946J86703l166j05615J6169J40079J08497J2564k35106
14899c37157l8264K16726J00234j5304p5965P8886n6492N5786K36800N0327M5593
14888B61170r7666j48685R6177J57765o9877M1666K2401J15508n9598k00990l6947
14877H0924j91292k2379k3923m1865J54473R9839O6813q3969k02764j20581K08177
14866g6547K87359J4428j1440k4559o5784j77829j89962q2884K20415l8487J0631
14855a34659O2433n848J06028k2214j24140j59839o9609j19085O8954N6435O8724
$$ plain form
14844 -272820 -117056 102582 179150 255796 130657 99261 -41895 -47095 34386 -87905 -253132
14833 -253132 -286678 -204562 -90586 -175680 -396343 -484209 -403227 -209650 13368 94497 166133
14822 166133 -2375 -137761 -134726 -242057 142731 135226 78747 -92770 -7463 -105297 -170117
14811 -170117 -130484 28252 103264 14270 -89501 -220164 -240736 28891 10871 -6034 -12686
14800 -12686 -208374 12448 46337 -182949 -252804 -338894 -455940 -382862 -183282 -276241 -411402
14789 -411402 -380593 -495141 -515979 -484686 -332547 -157987 -177406 -49102 11754 -48630 34926
14778 34926 82110 213144 23973 -30308 142903 -71354 102090 561654 523857 269781
14768 269781 -32731 -103949 1158 59858 -177578 -127419 -331203 -492871 -318775 -146290
$$ packed form
14844b72820J55764K19638P6568P6646j25139l1396j41156n200Q1481j22291j65227
14833b53132l3546Q2116J13976q5094k20663q7866Q0982J93577K23018Q1129P1636
14822A66133j68508j35386L035j07331L84788p505n6479j71517Q5307r7834o4820
14811a70117L9633J58736P5012q8994j03771j30663k0572K69627j8020j6905o652
14800a2686j95688K20822L3889k29286o9855q6090j17046P3078J99580r2959j35161
14789d11402L0809j14548k0838L1293J52139J74560j9419J28304O0856o0384Q3556
14778C4926M7184J31034j89171n4281J73211k14257J73444M59564l7797k54076
14768B69781l02512p1218J05107N8700k37436N0159k03784j61668J74096J72485
$$ plain form
14758 -146290 -105431 -80082 -126696 -50379 291313 310716 39995 31201 301061 317825 63219
14747 63219 182830 333120 152741 -113770 -4393 294471 305918 39098 106352 180402
14737 180402 228790 60061 -73753 -118465 -86852 -25489 -103444 -392499 -442336 -377779 -313508
14726 -313508 -437553 -547689 -205713 158988 263129 72366 -105459 20155 -214221 -385639
14716 -385639 -361660 -235333 -40000 133690 210784 278485 -20973 -284332 -207487 -38796
14706 -38796 -6864 -16194 -81572 -140476 106781 97328 7644 27438 87069 -103763 -45177 53800
14694 53800 -5264 240972 252887 233328 139506 193483 228873 266450 129702 -275368 -359544
14683 -359544 -184354 -292460 -642645 -616580 -360689 -325958 -473477 -512561 -363709 -317980
$$ packed form
14758a46290M0859K5349m6614P6317L41692J9403k70721q794K69860J6764k54606
14747F3219J19611J50290j80379k66511J09377K98864J1447k66820O7254P4050
14737A80402M8388j68729j33814m4712L1613O1363p7955k89055m9837O4557O4271
14726c13508j24045j10136L41976L64701J04141j90763j77825J25614k34376j71418
14716c85639K3979J26327J95333J73690P7094O7701k99458k63359P6845J68691
14706c8796L1932r330o5378n8904K47257r453q9684J9794N9631j90832N8586R8977
14694E3800n9064K46236J1915j9559r3822N3977L5390L7577j36748m05070q4176
14683c59544J75190j08106l50185K6065K55891L4731j47519l9084J48852M5729
$$ plain form
14673 -317980 -248545 -313972 -199132 -58142 -29409 -96511 -69117 -222818 -237492 -140558 -20560
14662 -20560 169586 85564 195934 303947 297414 395145 236606 87776 23031 -77393 42969
14651 42969 76244 -177521 -331714 -225957 65951 -5121 -91222 -277904 -40078 118701
14641 118701 68170 101912 155329 288689 76893 78895 257119 198300 -271908 -238172 97187
14630 97187 350738 389230 221047 317594 398431 214373 216733 250665 199042 -4676 -117950
14619 -117950 -228539 -278429 -213805 -49348 45682 136658 32999 69136 -113110 -324587
14609 -324587 -399877 -87601 15278 -138421 -326318 -457461 -413857 -81188 137783 117053
14599 117053 -658 -167705 127352 186057 -36204 -336610 -305517 -192806 -65828 -23694
$$ packed form
14673c17980O9435o5427J14840J40990K8733o7102K7394j53701j4674R6934J19998
14662b0560J90146q4022J10370J08013o533R7731j58539j48830o4745j00424J20362
14651D2969L3275k53765j54193J05757K91908p1072q6101j86682K37826J58779
14641A18701n0531L3742N3417J33360k11796K002J78224n8819m70208L3736L35359
14630I7187K53551L8492j68183R6547Q0837j84058K360L3932n1623k03718j13274
14619a17950j10589m9890O4624J64457R5030R0976j03659L6137j82246k11477
14609c24587p5290L12276J02879j53699j87897j31143M3604L32669K18971k0730
14599A17053j17711j67047K95057N8705k22261l00406L1093J12711J26978M2134
$$ plain form
14589 -23694 72401 -3187 -150321 -57717 279847 289189 157324 101809 175895 80846 143744
14578 143744 399939 532482 519271 344997 236232 459398 472924 228562 -152207 -140996
14568 -140996 23336 -140298 -293830 -242154 -347498 -179318 30780 -181667 -341734 -427226
14558 -427226 -299620 74562 -26194 -114477 -52608 160478 124135 75443 36529 -32668 -116340
14547 -116340 -230711 -440355 -509191 -345363 -70102 242291 278332 137305 545033 386016
14537 386016 82341 -5561 -179466 -69279 117596 175218 129719 -189631 -218902 -242479
14527 -242479 -105261 211413 -18792 -202970 -155289 -17028 -124261 -365591 -374691 -305082
14517 -305082 -137334 11938 -16243 78666 38877 -70338 -25662 24968 -104544 -153328 89883
$$ packed form
14589b3694R6095p5588j47134R2604L37564R342j31865n5515P4086r5049O2898
14578A43744K56195J32543j3211j74274j08765K23166J3526k44362l80769J1211
14568a40996J64332j63634j53532N1676j05344J68180K10098k12447j60067q5492
14558d27226J27606L74182j00756q8283O1869K13086l6343m8692l8914o9197q3672
14547a16340j14371k09644o8836J63828K75261L12393L6041j41027M07728j59017
14537C86016l03675q7902j73905J10187J86875N7622m5499l19350k9271k3577
14527b42479J37218L16674k30205j84178M7681J38261j07233k41330r100O9609
14517c05082J67748J49272k8181R4909l9789j09215M4676N0630j29512m8784K43211
$$ plain form
14506 89883 96334 -11353 -150467 -94444 -325677 -162895 19499 304711 334284 56386
14496 56386 -2083 -49108 -176152 -104366 375938 502643 319474 249438 125486 -201310
14486 -201310 -347709 -370917 -198645 -236040 -192117 45420 182504 -88297 -157869 -292268
14476 -292268 -296481 -175456 51752 2930 45040 253900 163920 -122198 -144061 -148332 -216032
14465 -216032 -34522 -133925 -103996 -94557 -193112 -35061 111514 -123131 -254222 -352732 -531580
14454 -531580 -358440 -189274 -199342 -347243 -88323 101534 222564 432965 364481 140092
14444 140092 -52436 -124573 -333782 -363745 -421509 -332797 -212296 -133770 55536 -7627 -126586
14433 -126586 -155843 -179263 -46546 -93572 -166844 -175566 -13484 38935 126888 270088 330864
$$ packed form
14506H9883O451j07687j39114N6023k31233J62782J82394K85212K9573k77898
14496E6386n8469m7025j27044P1786M80304J26705j83169p0036j23952l26796
14486b01310j46399k3208J72272l7395M3923K37537J37084k70801o9572j34399
14476b92268m213J21025K27208m8822M2110K08860q9980k86118k1863m271o7700
14465b16032J81510r9403K9929R439r8555J58051J46575k34645j31091r8510j78848
14454e31580J73140J69166j0068j47901K58920J89857J21030K10401o8484k24389
14444A40092j92528p2137k09209k9963n7764Q8712J20501P8526J89306o3163j18959
14433a26586k9257k3420J32717m7026p3272q722J62082N2419Q7953J43200O0776
$$ plain form
14422 330864 638559 357073 -29200 10188 172270 328594 558141 467389 624750 588550
14412 588550 272993 77385 92348 -138904 -137665 -66937 -7838 83613 -108491 -405507 -383121
14401 -383121 -307930 -205849 -309365 -182270 -20453 91879 68537 -196112 -364890 -37279
14391 -37279 306578 290516 12527 -321726 -408373 -169765 6699 -9608 -67861 -124988 -222682
14380 -222682 -152883 -40797 85980 48030 -25245 -375662 -448268 -266816 -75237 -59134
14370 -59134 -44185 4070 -54840 10752 -112176 -58964 -65765 -21973 93518 158009 79458
14359 79458 -67866 -395393 -321826 -19581 179011 180012 -44182 -66228 -139298 -183750 -210161
14348 -210161 -17123 85338 136813 5046 -55291 57062 132793 -121731 -268772 -248703
$$ packed form
14422C30864L07695k81486l86273L9388J62082J56324K29547r0752J57361l6200
14412E88550l15557j95608J4963k31252J239P0728N9099R1451j92104k97016K2386
14401c83121P5191J02081j03516J27095J61817J12332k3342k64649j68778L27611
14391c7279L43857j6062k77989l34253q6647K38608J76464j6307n8253n7127r7694
14380b22682O9799J12086J26777l7950p3275l50417p2606J81452J91579J6103
14370e9134J4949M8255n8910O5592j22928N3212o801M3792J15491O4491p8551
14359G9458j47324l27527P3567L02245J98592J001k24194k2046p3070m4452k6411
14348b10161J93038J02461N1475j31767o0337J12353P5731k54524j47041K0069
$$ plain form
14338 -248703 55466 100783 -108127 -219577 -202947 -225868 33180 449597 329088 209170
14328 209170 19343 61838 124024 190247 314276 239227 70892 276257 512307 274225
14318 274225 100856 68696 -9070 7881 143776 166042 10028 -175886 -250085 -114363
14308 -114363 -24044 -210097 -244302 -171942 -241801 -265008 -320852 -468278 -618172 -359802 -349310
14297 -349310 -172124 50094 126634 114870 178140 128662 -33650 -67316 132681 223682 140997
14286 140997 245786 190399 79473 -20850 -182526 6213 144783 117305 -416424 -531373
14276 -531373 -362803 -207308 -249260 -255330 -124783 -128806 -11548 -93021 -236390 -102038 128385
14265 128385 192656 -68069 -126439 -100611 -10661 179670 263389 27033 34891 47859 169761
$$ packed form
14338b48703L04169M5317k08910j11450J6630k2921K59048M16417j20509j19918
14328B09170j89827M2495O2186O6223J24029p5049j68335K05365K36050k38082
14318B74225j73369l2160p7766J6951J35895K2266j56014j85914p4199J35722
14308a14363R0319j86053l4205P2360o9859k3207n5844j47426j49894K58370J0492
14297c49310J77186K22218P6540j1764O3270m9478j62312l3666J99997R1001q2685
14286A40997J04789n5387j10926j00323j61676J88739J38570k7478n33729j14949
14276e31373J68570J55495m1952o070J30547m023J17258q1473j43369J34352K30423
14265A28385O4271k60725n8370K5828Q9950J90331Q3719k36356P858J2968J21902
$$ plain form
14254 169761 396733 616437 571606 380878 313239 223837 -32185 -65386 17482 189430
14244 189430 185362 177628 165596 108178 15327 8188 231063 47411 -29853 86755 160492
14233 160492 62359 152351 220977 -201701 -405476 -328168 -138022 -163665 5766 228351
14223 228351 310060 188689 208885 295328 301512 170714 -34911 -270033 -280122 -56977 10211
14212 10211 -249000 -261698 -101315 17209 8763 189472 55051 -11590 87965 123350 197139
14201 197139 315656 276685 88359 143129 410541 459790 210343 -25265 4513 -118312
14191 -118312 -309894 -155779 -164662 -290273 -323956 -161618 -53740 -198451 -262255 -115688
14181 -115688 -225011 -234878 -83486 12343 -47115 -57123 -125046 -53864 -130730 -31940 -57231
$$ packed form
14254A69761K26972K19704m4831j90728o7639q9402k56022l3201Q2868J71948
14244A89430m068p734j2032n7418r2851p139K22875j83652p7264J16608P3737
14233A60492r8133Q9992O8626m22678k03775P7308J90146k5643J69431K22585
14223B28351Q1709j21371K0196Q6443O184j30798k05625k35122j0089K23145O7188
14212A0211k59211j2698J60383J18524q446J80709j34421o6641R9555L5385P3789
14201A97139J18517l8971j88326N4770K67412M9249k49447k35608K9778j22825
14191a18312j91582J54115q883j25611l3683J62338J07878j44711o3804J46567
14181a15688j09323r867J51392R5829n9458j0008o7923P1182p6866R8790k5291
$$ plain form
14170 -57231 -140780 -135601 100406 253465 202579 368273 559979 250663 188349 91921 -28514
14159 -28514 -200002 -144633 -77254 -237549 -94234 -67578 25376 106317 204879 305176 605971
14148 605971 526196 521320 431912 568915 569992 609617 552903 327314 484554 699603 804183
14137 804183 678348 458379 583500 655695 589982 495702 613005 873645 858661 566011
14127 566011 468286 277942 215942 255967 70720 -75742 -70663 339958 493913 306512
14117 306512 219133 136305 278159 163362 -12941 -46701 22738 240236 188112 140575 229
14106 229 265765 431950 207309 88611 2380 -52508 33451 45045 111371 -26103 -162542
14095 -162542 -324075 -198643 -35099 107139 156117 304741 264932 246955 466880 178142
$$ packed form
14170e7231q3549N179K36007J53059n0886J65694J91706l09316o2314r6428j20435
14159b8514j71488N5369O7379j60295J43315K6656R2954Q0941R8562J00297L00795
14148F05971p9775m876q9408J37003J077L9625n6714k25589J57240K15049J04580
14137H04183j25835k19969J25121P2195o5713r4280J17303K60640j4984k92650
14127E66011r7725j90344o2000M0025j85247j46462N079M10621J53955j87401
14117C06512q7379q2828J41854j14797j76303l3760O9439K17498n2124m7537j40346
14106B29K65536J66185k24641j18698q6231n4888Q5959J1594O6326j37474j36439
14095a62542j61533J25432J63544J42238M8978J48624l9809j7977K19925k88738
$$ plain form
14085 178142 120485 263680 364743 322899 123830 147010 146933 203520 355458 233254 130588
14074 130588 -87970 -403231 -301318 -153706 19284 130836 224546 278609 336802 383889
14064 383889 324672 170810 41683 114823 281501 -52690 -357852 -343316 -229435 -202229
14054 -202229 -129782 30718 245123 162611 -50299 -281249 -328745 -194604 91811 -370678
14044 -370678 -385692 -276885 -263191 -55407 141606 321693 320406 116407 -176951 -177242 -118190
14033 -118190 157714 75964 90957 145190 99689 -6386 -61410 -362094 -225942 62647
14023 62647 101469 -3565 59832 92465 258451 241841 143514 4648 92828 -36577 -67781
14012 -67781 -17161 285478 536740 349055 -125002 -126123 -75086 -73861 -153985 -310191 -88077
$$ packed form
14085A78142n7657J43195J01063m1844j99069K3180p7N6587J51938j22204j02666
14074A30588k18558l15261J01913J47612J72990J11552R3710N4063N8193M7087
14064C83889n9217j53862j29127P3140J66678l34191l05162J4536J13881K7206
14054b02229P2447J60500K14405q2512k12910k30950m7496J34141K86415m62489
14044c70678j5014J08807J3694K07784J97013J80087j287k03999k93358k91N9052
14033a18190K75904q1750J4993N4233m5501j06075n5024l00684J36152K88589
14023F2647L8822j05034O3397L2633J65986j6610r8327j38866Q8180j29405l1204
14012f7781N0620L02639K51262j87685m74057j121N1037J225q0124j56206K22114
$$ plain form
14001 -88077 205393 390215 446167 282743 -93529 -258982 -3122 149815 266909 501797
13991 501797 298666 194542 383814 401002 159567 280736 392568 359147 180168 -94391
13981 -94391 -244902 -381335 -356195 -590667 -559894 -162774 238834 250434 212383 108539
13971 108539 42740 60 -113043 -180570 -26687 54658 72953 -81444 82518 241955
13961 241955 112055 65641 205181 165299 80856 54285 41488 199786 219127 34085 -98904
13950 -98904 232 206776 101371 -131971 -326916 7144 135985 -76040 -211730 -85029
13940 -85029 169020 -771 169955 332176 232601 79768 111114 6730 58952 1108
13930 1108 -148233 -83951 -228920 -198229 -43116 5577 197346 286609 252072 204444 120762
$$ packed form
14001h8077K93470J84822N5952j63424l76272j65453K55860J52937J17094K34888
13991E01797k03131j04124J89272J7188k41435J21169J11832l3421j78979k74559
13981i4391j50511j36433K5140k34472L0773L97120M01608J1600l8051j03844
13971A08539o5799m2680j13103o7527J53883Q1345J8295j54397J63962J59437
13961B41955j29900m6414J39540l9882q4443k6571j2797J58298J9341j85042j32989
13950i8904R9136K06544j05405k33342j94945L34060J28841k12025j35690J26701
13940h5029K54049j69791J70726J62221r9575j52833L1346j04384N2222n7844
13930A108j49341O4282j44969L0691J55113M8693J91769Q9263l4537m7628q3682
$$ plain form
13919 120762 -13116 -65817 120221 438328 527364 294503 -37950 -64154 3330 -71814
13909 -71814 -87877 -52845 86137 -118845 -288302 -371591 -370695 -116251 -142075 -496389 -403560
13898 -403560 -195849 -172244 -16664 91467 106165 279372 190898 265475 229697 99808
13888 99808 175596 283712 306800 202563 92126 -213293 -372679 -571073 -418069 -209517
13878 -209517 -411950 -754839 -757957 -375801 -50913 -41410 -139295 26677 27646 67604 123092
13867 123092 -19602 -126293 -193251 -274701 -354575 -178134 30900 111197 245139 344852
13857 344852 367140 531133 156770 163654 145270 -80095 -325956 -237733 -205254 -293955 -202361
13846 -202361 -88306 -43364 39332 162586 -44489 -183033 -230022 -154512 -217017 -323532
$$ packed form
13919A20762j33878n2701J86038L18107Q9036k32861l32453k6204O7484p5144
13909g1814j6063L5032J38982k04982j69457q3289Q96K54444k5824l54314R2829
13898d03560K07711K3605J55580J08131J4698J73207q8474P4577l5778j29889
13888I9808P5788J08116K3088j04237j10437l05419j59386j98394J53004K08552
13878b09517k02433l42889l118L82156L24888R503r7885J65972R69L9958N5488
13867A23092j42694j06691o6958q1450p9874J76441K09034Q0297J33942R9713
13857C44852K2288J63993l74363O884j8384k25365k45861Q8223L2479q8701R1594
13846b02361J14055M4942Q2696J23254k07075j38544m6989P5510o2505j06515
$$ plain form
13836 -323532 -284557 -221498 -282033 -539572 -713507 -572011 -247073 -247106 -320754 -118802 17070
13825 17070 165989 321898 323960 386575 347745 557145 446375 -2722 -295955 -159820
13815 -159820 -69250 -306516 -310362 -231666 -93758 -227927 -297507 -188663 -89914 -193578 -262035
13804 -262035 -333557 -198772 184086 403261 391488 173893 129158 428122 281269 97497
13794 97497 272802 399683 318611 97400 -118110 -90815 -126679 -39879 -119841 -161306 -101091
13783 -101091 -218717 -153907 -23443 54164 -83491 -95038 -80254 59827 125904 269377
13773 269377 96735 -24853 -19908 15513 15559 -145491 -120942 -133626 -197493 -39680 88088
13762 88088 244515 47451 -78410 -71163 62371 23172 123232 168071 131698 -25326 -148960
$$ packed form
13836c23532L8975O3059o0535k57539j73935J41496L24938l3p3648K01952J35872
13825A7070J48919J55909K062O2615l8830K09400j10770m49097k93233J36135
13815a59820R0570k37266l846P8696J37908j34169o9580J08844R8749j03664o8457
13804b62035p1522J34785L82858K19175j1773k17595m4735K98964j46853j83772
13794I7497J75305J26881q1072k21211k15510K7295l5864Q6800p9962m1465O0215
13783a01091j17626O4810J30464P7607j37655j1547J4784J40081O6077J43473
13773B69377j72642j21588M945L5421M6j61050K4549j2684o3867J57813J27768
13762H8088J56427j97064j25861P247J33534l9199J00060M4839l6373j57024j23634
$$ plain form
13751 -148960 -110486 -229390 -150480 102498 294203 347551 597290 662453 630379 434129
13741 434129 223981 216171 221901 173390 186796 65624 -68367 -432 76791 -17755 -144890
13730 -144890 -217531 -283025 -127678 -149182 -142132 -73941 57823 205974 202392 119388 -35707
13719 -35707 64780 244124 394653 428856 146662 -7232 -59728 -80608 -24192 174904
13709 174904 41595 -73826 -318379 -411490 -235941 -267678 -216037 -126486 153796 348054
13699 348054 148822 41642 332800 510944 476859 317597 291876 340399 269895 230190
13689 230190 54454 279793 448709 314386 121998 246789 224735 145344 159400 59245
13679 59245 -53188 -191729 -82608 135299 171278 -290603 -442246 -450600 -349156 -71225
$$ packed form
13751a48960L8474j18904P8910K52978J91705N3348K49739O5163l2074j96250
13741D34129k10148p810N730m8511J3406j21172j33991O7935P7223r4546j27135
13730a44890p2641o5494J55347k1504P050O8191J31764J48151l582q3004j55095
13719c5707J00487J79344J50529L4203k82194j53894n2496k0880N6416J99096
13709A74904j33309j15421k44553r3111J75549l1737N1641Q9551K80282J94258
13699C48054j99232j07180K91158J78144l4085j59262k5721M8523p0504l9705
13689B30190j75736K25339J68916j34323j92388J24791k2054p9391J4056j00155
13679E9245j12433j38541J09121K17907L5979m61881j51643q354J01444K77931
$$ plain form
13669 -71225 -43764 -87250 -165716 -156610 -121305 -60984 -108763 -29998 -6541 77423 193367 135704
13657 135704 138029 -564 -145523 -243673 -285370 -127354 3689 181673 314216 246871
13647 246871 113979 60489 -84735 140298 156890 27507 -34426 -780 -84979 -299834
13637 -299834 -128508 -180302 -238721 -389739 -353268 -3326 106406 -54391 -309665 -497645
13627 -497645 -325345 -99941 105610 252794 364149 392538 438433 321189 392429 163526
13617 163526 -29416 -291699 -251098 38808 205602 186429 -36625 -253104 -75236 145312
13607 145312 92129 17374 57282 350851 417634 497129 589828 459776 252145 125756 233791
13596 233791 134639 123269 198231 165295 363379 542310 539451 241019 44869 298218 234259
$$ packed form
13669g1225K7461m3486p8466R106L5305O0321m7779P8765K3457Q3964J15944n7663
13657A35704K325j38593j44959r8150m1697J58016J31043J77984J32543o7345
13647B46871j32892n3490j45224K25033J6592j29383o1933L3646q4199k14855
13637b99834J71326n1794n8419j51018L6471L49942J09732j60797k55274j87980
13627d97645J72300K25404K05551J47184J11355K8389M5895j17244P1240k28903
13617A63526j92942k62283M0601K89906J66794j9173k23054k16479J77868K20548
13607A45312n3183p4755L9908K93569O6783P9495R2699j30052k07631j26389J08035
13596B33791r9152j1370P4962l2936J98084J78931k859k98432j96150K53349o3959
$$ plain form
13585 234259 217941 -32694 -88914 25417 77736 -5573 174486 174975 190494 153570 43824
13574 43824 -100960 -52754 -85241 -8441 242195 8928 187897 438799 479762 248820
13564 248820 53613 81756 -158963 -154981 78213 160439 108456 255039 641681 838205
13554 838205 624843 400223 348117 190791 82609 296046 507931 577679 510608 276057
13544 276057 167202 392577 509252 363940 376940 162263 152842 -41432 -214 128510
13534 128510 71703 121357 89841 125030 -92037 4016 170318 269810 -151089 -448432 -384709
13523 -384709 -225125 -390331 -343667 -372507 -196008 -94828 -297294 -141263 -69394 -235853
13513 -235853 -245794 -92313 13925 7769 -44442 122089 37983 118197 106489 277670 247732
$$ packed form
13585B34259j6318k50635n6220J14331N2319q3309J80059M89J5519l6924j09746
13574D3824j44784M8206l2487P6800K50636k33267J78969K50902M0963k30942
13564B48820j95207K8143k40719L982K33194Q2226n1983J46583L86642J96524
13554H38205k13362k24620n2106j57326j08182K13437K11885O9748o7071k34551
13544B76057j08855K25375J16675j45312J3000k14677r421j94274M1218J28724
13534A28510n6807M9654l1516L5189k17067R6053J66302R9492m20899k97343O3723
13523c84709J59584j65206M6664k8840J76499J01180k02466J56031P1869j66459
13513b35853r941J53481J06238o156n2211J66531q4106Q0214j1708J71181k9938
$$ plain form
13502 247732 -18949 -802 202285 35775 252695 384678 260279 50430 149039 351174
13492 351174 233930 127831 63473 87874 433316 430719 363645 136063 -68674 17726 87669
13481 87669 -34685 185093 423915 461647 281109 114741 101595 210064 185665 -7837
13471 -7837 -1324 -56206 51550 260696 102547 43534 76899 68278 142086 398798 321002
13460 321002 280933 147493 195432 248851 238537 434348 439758 451535 500048 250214 20787
13449 20787 -39781 -211780 -321402 -280974 182787 470702 450889 358390 51304 -147210
13439 -147210 23970 11592 94875 242666 499751 471411 424983 259502 224626 69550
13429 69550 60488 234885 89905 -5800 -19492 -128200 -111319 -68644 110136 284300 323871
$$ packed form
13502B47732k66681J8147K03087j66510K16920J31983j24399k09849R8609K02135
13492C51174j17244j06099o4358K4401L45442k597o7074k27582k04737Q6400O9943
13481H7669j22354K19778K38822L7732j80538j66368j3146J08469k4399j93502
13471g837O513n4882J07756K09146j58149n9013L3365q621P3808K56712p7796
13460C21002m0069j33440M7939N3419j0314J95811N410J1777M8513k49834k29427
13449B0787o0568j71999j09622M0428M63761K87915j9813r2499l07086j98514
13439a47210J71180j2378Q3283J47791K57085k8340m6428j65481l4876j55076
13429F9550r062J74397j44980r5705j3692j08708J6881M2675J78780J74164L9571
$$ plain form
13418 323871 316655 319201 237048 245433 249629 378878 692869 770507 673139 468669 386262 175201
13406 175201 125263 147972 496642 630135 727289 644595 493986 328954 187425 181386 117846
13395 117846 220636 549840 675368 628413 612879 414445 376093 499145 452772 567776
13385 567776 474815 321167 230523 426516 609038 700225 794856 923640 991440 1112286
13375 1112286 1308676 1449944 1508412 1450547 1315198 1151796 818477 560849 534621 723496
13365 723496 927731 993990 821156 730207 620079 555229 406825 264950 229638 91436
13355 91436 160381 317321 220517 310686 247494 480483 832232 731056 629174 679434 669156
13344 669156 927215 982810 661190 266067 151787 195278 493356 612937 790959 820870
$$ packed form
13418C23871p216K546q2153Q385M196J29249L13991P7638r7368k04470q2407k11061
13406A75201m9938K2709L48670J33493R7154q2694j50609j65032j41529o039o3540
13395A17846J02790L29204J25528m6955j5534j98434l8352J23052m6373J15004
13385E67776r2961j53648r0644J95993J82522R1187R4631J28784O7800J20846
13375A112286J96390J41268N8468n7865j35349j63402l33319k57628k6228J88875
13365G23496K04235O6259j72834r0949j10128o4850j48404j41875l5312j38202
13355I1436O8945J56940r6804R0169o3192K32989L51749j01176j01882N0260j0278
13344F69156K58059N5595l21620l95123j14280M3491K98078J19581J78022K9911
$$ plain form
13334 820870 829011 601569 221160 -27895 -198633 -150375 -276864 -239820 88567 132449
13324 132449 -31437 -111497 -341921 -45268 277067 50915 -182874 -45007 303504 461106
13314 461106 292475 416193 494780 517458 430491 489580 532376 537587 566237 636585 718718
13303 718718 522332 382496 403598 462542 597149 769974 738732 759572 641541 481201
13293 481201 674747 614782 635885 534628 306569 224780 77141 -186066 -189875 -131212 -44277
13282 -44277 67935 105072 90959 244077 453893 408953 350537 374652 270299 410727 428823
13271 428823 116380 94412 338018 220427 388691 264818 107313 138700 31025 -114856
13261 -114856 -116397 -121292 -306678 -306411 -333089 -483895 -583283 -504255 -450771 -311430 -146570
$$ packed form
13334H20870Q141k27442l80409k49055j70738M8258j26489L7044L28387M3882
13324A32449j63886q0060k30424K96653L22335k26152k33789J37867L48511J57602
13314D61106j68631J23718P8587K2678q6967N9089M2796N211K8650P0348Q2133
13303G18718j96386j39836K1102N8944J34607J72825l1242K0840j18031j60340
13293D81201J93546n9965K1103j01257k28059q1789j47639k63207l809N8663Q6935
13282d4277J12212L7137j4113J53118K09816m4940n8416K4115j04353J40428J8096
13271D28823l12443k1968K43606j17591J68264j23873j57505L1387j07675j45881
13261a14856j541m895j85386K67k6678j50806r9388P9028N3484J39341J64860
$$ plain form
13250 -146570 58539 163534 319101 246009 491659 500375 333865 150310 7935 -135613
13240 -135613 -103852 -218137 -343771 -208715 -318180 -371698 -347022 -231946 627 243733
13230 243733 266154 212605 -56425 10121 342970 300392 -153073 -16211 273631 209953
13220 209953 223961 292205 456960 326486 31657 -7809 2093 145954 272068 252086 184940
13209 184940 22693 -203805 -415454 -183055 108111 215693 611371 777227 714394 664785
13199 664785 611252 520894 367818 425930 614417 572195 654063 752141 721840 564297 328094
13188 328094 419555 628450 559772 484357 224698 91135 280020 507988 512058 672555
13178 672555 947536 1058046 966121 770583 668508 527593 717067 749868 605100 395962
$$ packed form
13250a46570K05109J04995J55567p3092K45650Q716j66510j83555j42375j43548
13240a35613L1761j14285j25634J35056j09465n3518K4676J15076K32573K43106
13230B43733K2421n3549k69030O6546L32849m2578m53465J36862K89842o3678
13220B09953J4008O8244J64755j30474k94829l9466R902J43861J26114j9982o7146
13209A84940j62247k26498k11649K32399K91166J07582L95678J65856o2833m9609
13199F64785n3533r0358j53076N8112J88487m2222Q1868R8078l0301j57543k36203
13188C28094R1461K08895o8678p5415k59659j33563J88885K27968M070J60497
13178F72555K74981J10510r1925j95538j02075j40915J89474L2801j44768k09138
$$ plain form
13168 395962 165089 87391 -241709 -90339 194244 110358 30789 215260 285743 425572
13158 425572 325178 -56125 -220689 -208906 -296887 -237050 -249054 -122850 154256 128378
13148 128378 126295 381149 436749 361868 606472 652095 494906 459814 447921 492545 540448
13137 540448 536782 605797 711158 832461 808319 652270 402655 402546 357667 467248 698190
13126 698190 628481 492106 501740 658057 693403 409874 171345 13591 -249309 -207019
13116 -207019 31426 138669 271777 282775 259106 184255 292899 219436 265528 82675
13106 82675 98243 248018 274028 314478 370852 457941 465024 320397 404015 351142 216865
13095 216865 60876 226678 459430 298541 151478 209966 389076 104688 -16942 -54846
$$ packed form
13168C95962k30873p7698l29100J51370K84583q3886p9569J84471P0483J39829
13158D25572j00394l81303j64564J1783q7981N9837j2004J26204K77106k5878
13148A28378k083K54854N5600p4881K44604M5623j57189l5092j1893M4624M7903
13137E40448l666O9015J05361J21303k4142j56049k49615j09m4879J09581K30942
13126F98190o9709j36375R634J56317L5346k83529k38529j57754k62900M2290
13116b07019K38445J07243J33108J0998k3669p4851J08644p3463M6092j82853
13106H2675J5568J49775K6010M0450N6374Q7089P083j44627Q3618n2873j34277
13095B16865j55989J65802K32752j60889j47063N8488J79110k84388j21630l7904
$$ plain form
13085 -54846 -57049 73939 497124 481425 237765 282945 331639 250700 357418 620877 721381
13074 721381 716638 737775 821922 750781 530176 424337 549889 516639 683651 876338 968176
13063 968176 1118773 905194 860585 825676 780370 928352 1042699 1044375 1305368 1222065 1078780
13052 1078780 968742 891665 778388 561274 447192 607612 753754 735501 832739 730151
13042 730151 814204 922350 999024 971393 840460 775241 863429 878283 674548 654298 624537
13031 624537 765830 838222 762484 806513 993354 1225985 1179344 965991 925225 808272
13021 808272 701871 462337 542359 416712 458754 555201 519185 676499 964906 1091393
13011 1091393 1080790 986624 1127720 1275139 1113148 1057245 1298391 1117149 985131 898608
$$ packed form
13085e4846k203J30988M23185j5699k43660M5180M8694q0939J06718K63459J00504
13074G21381m743K1137Q4147p1141k20605j05839J25552l3250J67012J92687R1838
13063I68176J50597k13579m4609l4909m5306J47982J14347J676K60993q3303j43285
13052A078780j10038p7077j13277k17114j14082J60420J46142j8253R7238j02588
13042G30151Q4053J08146P6674k7631j30933o5219Q8188J4854k03735k0250k9761
13031F24537J41293P2392p5738M4029J86841K32631m6641k13353m0766j16953
13021H08272j06401k39534Q0022j25647M2042R6447l6016J57314K88407J26487
13011A091393j0603r4166J41096J47419j61991n5903K41146j81242j32018q6523
$$ plain form
13001 898608 1122148 1205901 1151179 1271148 1544402 1595617 1384857 1259575 1337071 1455634
12991 1455634 1578713 1602433 1648093 1706528 1951232 1814474 1752755 1861033 2016252 2073900
12981 2073900 2017737 2139512 2227634 2386795 2643570 2837638 2814441 2935771 3147695 3021089
12971 3021089 2990481 3105567 3168247 3497712 4055913 4507528 4918731 5293728 5653230 6095209
12961 6095209 6218476 6309717 6745746 7620527 8512251 9264059 10370704 11589908 12850708
12952 12850708 13937327 15408926 17057551 18876563 21226496 23797188 26937325 30458173
12944 30458173 34573390 39704840 45736705 53339157 62898637 75249032 90821647 110436019
12936 110436019 133953432 161024471 190385181 220961225 251227223 278975402 301825345
$$ packed form
13001H98608K23540Q3753n4722J19969K73254N1215k10760j25282P7496J18563
12991A455634J23079K3720M5660N8435K44704j36758o1719J08278J55219N7648
12981B073900n6163J21775Q8122J59161K56775J94068k3197J21330K11924j26606
12971C021089l0608J15086O2680L29465N58201M51615M11203L74997L59502M41979
12961F095209J23267R1241M36029Q74781Q91724P51808J106645J219204J260800
12952A2850708J086619J471599J648625J819012K349933K570692L140137L520848
12944C0458173M115217N131450O031865P602452R559480J2350395J5572615J9614372
12936A10436019K3517413K7071039K9360710L0576044L0265998K7748179K2849943
$$ plain form
12929 301825345 318048621 326301435 326024291 317114789 300392526 277173949 249491509
12922 249491509 220215501 191324257 164370970 140911253 121265669 105385938 92916146
12915 92916146 83027555 75135002 68760488 63393750 58758513 54678417 51038773 47633341
12907 47633341 44702115 41978057 39503040 37263689 35018622 33044557 31218710 29692520
12899 29692520 28262272 26946710 25583862 24646157 23887223 22956284 21987926 21036175 20047157
12890 20047157 19211245 18497533 17853844 17143159 16764873 16195710 15629327 15107021 14552449
12881 14552449 14108464 13829303 13430438 12971283 12529983 12263231 11960894 11382959 11015488
12872 11015488 10797829 10473971 10451183 10147073 9906735 9909180 9862027 9420118 9137117 8936065
$$ packed form
12929C01825345J6223276Q252814k77144q909502j6722263k3218577k7682440
12922B49491509k9276008k8891244k6953287k3459717j9645584j5879731j2469792
12915I2916146r888591p892553o374514n366738m635237m080096l639644l405432
12907D7633341k931226k724058k475017k239351k245067j974065j825847j526190
12899B9692520j430248j315562j362848r37705p58934r30939r68358r51751r89018
12890B0047157q35912p13712o43689p10685l78286n69163n66383n22306n54572
12881A4552449m43985k79161l98865m59155m41300k66752l02337n77935l67471
12872A1015488k17659l23858k2788l04110k40338K445m7153m41909k83001k01052
$$ plain form
12862 8936065 8822699 8603166 8597543 8286514 7777507 7377459 7306271 7173713 6922605 6894879
12852 6894879 7022391 6787283 6566194 6311214 6021193 5738840 5674342 5672005 5689785 5581808
12842 5581808 5514763 5348212 5027484 4754378 4751392 4789972 4461180 4415229 4390939 4370202 4345482
12831 4345482 4284333 4268220 4024227 4010693 4044689 4072784 3896241 3940412 3767361 3364440
12821 3364440 3407625 3383232 3324748 3334362 3336964 3270493 3226141 3153058 3147574 3251083 3279245 3364559
12809 3364559 3395484 3301600 3240064 3206049 3108511 3095732 3123998 2965184 2886073 2949816 2834150
12798 2834150 2817437 2625993 2201970 1939241 1814516 1763809 1992923 2140066 2004601 1744259
12788 1744259 1553817 1217065 1408174 1796793 1774080 1571364 1435021 1472056 1426341 1121782
$$ packed form
12862H936065j13366k19533n623l11029n09007m00048p1188j32558k51108k7726
12852F894879J27512k35108k21089k54980k90021k82353o4498k337J7780j07977
12842E581808o7045j66551l20728k73106k986L8580l28792m5951k4290k0737k4720
12831D345482o1149j6113k43993j3534L3996K8095j76543M4171j73051m02921
12821C364440M3185k4393n8484R614K602o6471m4352p3083n484J03509K8162Q5314
12809C364559L0925r3884o1536l4015r7538j2779K8266j58814p9111O3743j15666
12798B834150j6713j91444m24023k62729j24725n0707K29114J47143j35465k60342
12788A744259j90442l36752J91109L88619k2713k02716j36343L7035m5715l04559
$$ plain form
12778 1121782 1063307 1194384 1120200 1141724 1175857 1020230 1069188 1101965 1220428 1198777 1023759
12767 1023759 1203821 1401211 1358839 1214796 1287632 1106341 1027475 1326837 1446241 1523562
12757 1523562 1559803 1812472 2064173 2069726 2161875 2130035 2311414 2553154 2854555 3163855
12747 3163855 3407978 3769246 4044836 4152268 4253874 4412651 4105521 3993451 3679379
12738 3679379 3202487 3163485 2716440 2095083 1918219 1889025 1725583 1689425 1677627 1801911
$$ packed form
12778A121782n8475J31077p4184K1524L4133j55627M8958L2777J18463k1651j75018
12767A023759J80062J97390m2372j44043P2836j81291p8866K99362J19404P7321
12757A523562L6241K52669K51701N553R2149l1840J81379K41740L01401L09300
12747C163855K44123L61268K75590J07432J01606J58777l07130j12070l14072
12738C679379m76892l9002m47045o21357j76864k9194j63442l6158j1798J24284
$$ [...]
##END NTUPLES=NMR SPECTRUM
##END=
