##TITLE=Analysis number 320517
Compound Code cc 55609
Book Reference 423/74
Project Code adrs
Chemist Name bruced
##JCAMPDX= 6.0         $$ Bruker NMR JCAMP-DX V2.0
##DATA TYPE= NMR SPECTRUM
##DATA CLASS= NTUPLES
##ORIGIN= Bruker BioSpin GmbH
##OWNER= nmr
$$ XWIN-NMR		Version 3.5
$$ Wed Jun 28 11:30:10 2006 GMT Daylight Time (UT+1h)  MAYBRIDGE\nmr@NMR_250MHZ
##.OBSERVE FREQUENCY= 250.131544655141
##.OBSERVE NUCLEUS= ^1H
##.ACQUISITION MODE= SIMULTANEOUS (DQD)
##.ACQUISITION SCHEME= undefined
##.AVERAGES= 16
##.DIGITISER RES= 18
##SPECTROMETER/DATA SYSTEM= dpx250
##.PULSE SEQUENCE= zg30
##.SOLVENT NAME= CDCl3
##.SHIFT REFERENCE= (INTERNAL, CDCl3, 0, 16.522)
##AUDIT TRAIL= $$ (NUMBER, WHEN, WHO, WHERE, WHAT)
$$ ##TITLE= Audit trail, XWIN-NMR		Version 3.5
$$ ##JCAMPDX= 5.01
$$ ##ORIGIN= Bruker BioSpin GmbH
$$ ##OWNER= nmr
$$ C:\u/data/dgb/nmr/ADRS/1700/pdata/1/auditp.txt
$$ ##AUDIT TRAIL=  $$ (NUMBER, WHEN, WHO, WHERE, WHAT)
(   1,<2006-06-28 11:29:45.91 +100>,<MAYBRIDGE\nmr>,<NMR_250MHZ>,
      <created by zg, POWCHK disabled, PULCHK disabled
       configuration hash MD5:
       E2 DF 36 D8 04 B2 41 60 5A D7 A3 38 5A 4B D0 FE
       data hash MD5: 64K
       DE 71 EB 74 D8 6D D7 0D D8 2A FA A5 35 E2 E4 90>)
(   2,<2006-06-28 11:30:01.72 +100>,<MAYBRIDGE\nmr>,<NMR_250MHZ>,
      <Start of raw data processing
       ef LB = 0.3 FT_mod = 6 PKNL = 1 SI = 32K 
       data hash MD5: 32K
       B0 D7 2A D9 74 34 FE 3C 7B C7 84 BA 2C A9 E0 2F>)
(   3,<2006-06-28 11:30:03.39 +100>,<MAYBRIDGE\nmr>,<NMR_250MHZ>,
      <apk 
       data hash MD5: 32K
       DF A5 8B 69 A5 05 E7 7E 52 1F AF 7D 2D D5 64 93>)
(   4,<2006-06-28 11:30:04.11 +100>,<MAYBRIDGE\nmr>,<NMR_250MHZ>,
      <abs ABSG = 5 
       data hash MD5: 32K
       E9 1C 79 AF B1 F8 B9 21 A0 2E 0F 66 10 4E 04 DF>)
$$ ##END=
$$ 
$$ hash MD5
$$ A6 A0 38 A2 35 1F D1 91 32 43 50 5A 2D 4A C5 12
##$RELAX= 
##$RELAX= 
##$RELAX= 
##$RELAX= 
##$RELAX= 
##$RELAX= 
##$RELAX= 
$$ Bruker specific parameters
$$ --------------------------
##$DU= <C:\u>
##$EXPNO= 1700
##$NAME= <ADRS>
##$PROCNO= 1
##$TYPE= <nmr>
##$USER= <dgb>
##$AMP= (0..31)
100 100 100 100 100 100 100 100 100 100 100 100 100 100 100 100 100 100 
100 100 100 100 100 100 100 100 100 100 100 100 100 100 
##$AQSEQ= 0
##$AQ_mod= 3
##$AUNM= <au_zg>
##$AUTOPOS= <21 >
##$BF1= 250.13
##$BF2= 250.13
##$BF3= 250.13
##$BF4= 250.13
##$BF5= 500.13
##$BF6= 500.13
##$BF7= 500.13
##$BF8= 500.13
##$BYTORDA= 1
##$CFDGTYP= 0
##$CFRGTYP= 5
##$CHEMSTR= <none>
##$CNST= (0..31)
1 1 145 1 1 1 1 1 1 1 1 1 1 1 1 1 1 1 1 1 1 1 1 1 1 1 1 1 1 1 1 1 
##$CPDPRG= <>
##$CPDPRG1= <>
##$CPDPRG2= <>
##$CPDPRG3= <>
##$CPDPRG4= <mlev>
##$CPDPRG5= <mlev>
##$CPDPRG6= <mlev>
##$CPDPRG7= <mlev>
##$CPDPRG8= <mlev>
##$CPDPRGB= <>
##$CPDPRGT= <>
##$D= (0..31)
0 1 0 0 0 0 0 0 0 0.06 0 0 0 0 0 0 0.0002 0 0 0 0 0 0 0 0 0 0 0 0 0 0 
0 
##$DATE= 1151490584
##$DBL= (0..7)
120 120 120 120 120 120 120 120 
##$DBP= (0..7)
150 150 150 150 150 150 150 150 
##$DBP07= 0
##$DBPNAM0= <>
##$DBPNAM1= <>
$$ [...]
##$SUBNAM7= <"">
##$SUBNAM8= <"">
##$SUBNAM9= <"">
##$SW= 20.6930455092707
##$SWIBOX= (0..15)
0 0 3 0 0 0 0 0 0 0 0 0 0 0 0 0 
##$SW_h= 5175.983436853
##$TD= 65536
##$TD0= 1
##$TE= 295.16
##$TE2= 300
##$TE3= 300
##$TEG= 300
##$TL= (0..7)
0 120 120 120 120 120 120 120 
##$TP= (0..7)
150 150 150 150 150 150 150 150 
##$TP07= 0
##$TPNAME0= <>
##$TPNAME1= <>
##$TPNAME2= <>
##$TPNAME3= <>
##$TPNAME4= <>
##$TPNAME5= <>
##$TPNAME6= <>
##$TPNAME7= <>
##$TPOAL= (0..7)
0.5 0.5 0.5 0.5 0.5 0.5 0.5 0.5 
##$TPOFFS= (0..7)
0 0 0 0 0 0 0 0 
##$TUNHIN= 0
##$TUNHOUT= 0
##$TUNXOUT= 0
##$USERA1= <user>
##$USERA2= <user>
##$USERA3= <user>
##$USERA4= <user>
##$USERA5= <user>
##$V9= 5
##$VALIST= <valist>
##$VCLIST= <CCCCCCCCCCCCCCC>
##$VD= 0
##$VDLIST= <DDDDDDDDDDDDDDD>
##$VPLIST= <PPPPPPPPPPPPPPP>
##$VTLIST= <TTTTTTTTTTTTTTT>
##$WBST= 1024
##$WBSW= 4
##$XGAIN= (0..3)
0 0 0 0 
##$XL= 0
##$YL= 0
##$YMAX_a= 403455
##$YMIN_a= -659876
##$ZGOPTNS= <>
##$ZL1= 120
##$ZL2= 120
##$ZL3= 120
##$ZL4= 120
##$ABSF1= 16.522
##$ABSF2= -4.171173
##$ABSG= 5
##$ABSL= 3
##$ALPHA= 0
##$AQORDER= 0
##$ASSFAC= 0
##$ASSFACI= 0
##$ASSFACX= 0
##$ASSWID= 0
##$AUNMP= <proc_1d>
##$AZFE= 0.1
##$AZFW= 0.1
##$BCFW= 0
##$BC_mod= 0
##$BYTORDP= 0
##$COROFFS= 0
##$CY= 12.5
##$DATMOD= 1
##$DC= 0
##$DFILT= <>
##$DTYPP= 0
##$F1P= 14.0000005364418
##$F2P= -0.99999901652339
##$FCOR= 0.5
##$FTSIZE= 32768
##$FT_mod= 6
##$GAMMA= 0
##$GB= 0
##$INTBC= 1
##$INTSCL= 1
##$ISEN= 128
##$LB= 0.3
##$LEV0= 0
##$LPBIN= 0
##$MAXI= 10000
##$MC2= 0
##$MEAN= 0
##$ME_mod= 0
##$MI= 0
##$NCOEF= 0
##$NC_proc= -3
##$NLEV= 6
##$NOISF1= 0
##$NOISF2= 0
##$NSP= 0
##$NTH_PI= 0
##$NZP= 0
##$OFFSET= 16.522
##$PC= 1
##$PHC0= 171.4266
##$PHC1= 6.302647
##$PH_mod= 1
##$PKNL= yes
##$PPARMOD= 0
##$PSCAL= 4
##$PSIGN= 0
##$REVERSE= no
##$SF= 250.13
##$SI= 32768
##$SIGF1= 0
##$SIGF2= 0
##$SINO= 400
##$SIOLD= 32768
##$SREGLST= <1H.CDCl3>
##$SSB= 0
##$STSI= 32768
##$STSR= 0
##$SW_p= 5175.98343685301
##$SYMM= 0
##$S_DEV= 0
##$TDeff= 65536
##$TDoff= 0
##$TI= <Analysis number 999999
Compound Code 99
Book Reference 9
Project Code 9>
##$TILT= no
##$TM1= 0
##$TM2= 0
##$TOPLEV= 0
##$USERP1= <user>
##$USERP2= <user>
##$USERP3= <user>
##$USERP4= <user>
##$USERP5= <user>
##$WDW= 1
##$XDIM= 32768
##$YMAX_p= 336180786
##$YMIN_p= -201751
$$ End of Bruker specific parameters
$$ ---------------------------------
##NTUPLES= NMR SPECTRUM
##VAR_NAME=  FREQUENCY,     SPECTRUM/REAL,   SPECTRUM/IMAG
##SYMBOL=    X,             R,               I
##VAR_TYPE=  INDEPENDENT,   DEPENDENT,       DEPENDENT
##VAR_FORM=  AFFN,          ASDF,            ASDF
##VAR_DIM=   32768,         32768,           32768
##UNITS=     HZ,            ARBITRARY UNITS, ARBITRARY UNITS
##FACTOR=    0.157963299565203, 1,           1
##FIRST=     4132.6476996994, 0,             0
##LAST=      -1043.33573715361, 0,           0
##MIN=       -1043.33573715361, -201751,     0
##MAX=       4132.6476996994, 336180786,     0
$$ Real data points
##PAGE= N=1
##DATA TABLE= (X++(R..R)), XYDATA
$$ [...]
24592H74M275P059r778j5894p922O407J755K473J0767L535k040n739P698R164
24578A2634j1494j4844J871L487O040J6372k955l215P975L362n25j049j0987m67
24564F205K1179q59k246n376o809n329m809j0340m225M435P176k375r47k20J4593
24549A0053N324j0754r747j2227m439N133r259q506J330O549K0240j951J693q5
24535f646P35P333Q07l190j4766n698R065K173M576J0368L99o753J0877O999K22
24520A6501r677r93J648Q623J057j52p73p419o318J985p446k058p064r399P288
24505a4197J9732M582j7007j0720J0567m807J451N696o406q688n270n883J078
24492b9872R896M693J2803J9960j6901k6887k110O010R911K1513k548n451n142
$$ plain form
24592 874 5149 12208 2430 -13464 -21386 -14979 -13224 -10751 16 3551 1511 -4228 3470 12634
24578 12634 1140 -13704 -11833 -8346 -2306 14066 11111 7896 15871 19233 18708 17659 6672 6205
24564 6205 27384 26525 24279 18903 12094 6765 1956 -8384 -12609 -8174 -998 -3373 -4320 -4540 10053
24549 10053 15377 4623 -5124 -17351 -21790 -16657 -25916 -34422 -33092 -26543 -6303 -8254 -6561 -6646
24535 -6646 -5911 1422 2229 -961 -15727 -21425 -12360 -10187 -5611 4757 5156 -1597 9280 16279 16501
24520 16501 6824 5831 7479 16102 17159 17007 16234 8815 2497 4482 -2964 -5022 -12086 -21485 -14197
24505 -14197 5535 10117 -6890 -17610 -7043 -11850 -10399 -4703 -11109 -19797 -25067 -30950 -29872
24492 -29872 -19976 -15283 -2480 17480 579 -26308 -28418 -22408 -12497 9016 6468 1017 -4125
24479d125P073q974j7454r34j174K755o46P526j2905q809L917J2680N332p080
24465b2818l823J1372J0780Q735K163r346l518k848l922J886O072j241l173P892
24451a789R877n785p050L67J2841O947n265l112L053M54r516j070Q135j659p972
24436a544K355r254P933N310q176l119L435q732l24J3434P44m589O200R529M041
24421A7243L941j744q951j6529l586N818K231K377m65n250m825j284R134J5507
24407A3617N001k440O884j718m024k722J809N262j768j3671p692J463K501O662
24393I164j492J311O339K408j4173j574P165N057m929O83l861q453n073m51j116
24378h995j1775Q523N505p652O035L799j676J8441p60P101L114n103j1263r479
$$ plain form
24479 -4125 2948 -6026 -23480 -24414 -25588 -22833 -23479 -15953 -28858 -37667 -33750 -21070 -15738 -22818
24465 -22818 -26641 -15269 -4489 4246 6409 -2937 -6455 -9303 -13225 -11339 -5267 -6508 -9681 -1789
24451 -1789 8088 2303 -4747 -4380 8461 15408 10143 7031 10084 10538 1022 -48 8087 6428 -1544
24436 -1544 811 -8443 -510 4800 -3376 -6495 -3060 -11792 -12116 1318 2062 -2527 3673 13202 17243
24421 17243 21184 19440 10489 -6040 -9626 -3808 -1577 800 335 -4915 -9740 -11024 -1890 13617
24407 13617 18618 16178 23062 21344 17320 14598 16407 21669 19901 6230 -1462 1 2502 9164
24393 9164 7672 8983 15322 17730 3557 1983 9148 14205 9276 9959 6098 -2355 -7428 -7879 -8995
24378 -8995 -20770 -12247 -6742 -14394 -8359 -4560 -6236 12205 11445 18546 21660 16557 5294 -4185
24364d185J1466j440J126j560j14m672r647J6501q94j5794Q194J0179L141J157
24350A3458L350j7420j1692l566K311J7128R386N810Q580j4147l0362q574N942
24337a9796J708Q113O972j837L159J570r312l892K587J0175r73k1861M534P577
24323a1276m688M388K6201Q295q295m585R419k488n008q772n916L844J0867L37
24309A2323o316p134k083r373m517K551R74J1405n9p15J7682n629o315n944o863
24294a0013R515L640J905J351M738p771j2525K363o999R866P665J5526J8335n751
24280C1845j0441j4272m959O757n290o048j113R294n658K736O852M285j539q597
24266C852j1852j718o067M42N304l845L989n672q669J0055J3804j337l858O528
$$ plain form
24364 -4185 7281 5841 6967 5407 5293 621 -9026 7475 6581 -9213 -1019 9160 12301 13458
24350 13458 16808 -612 -12304 -15870 -13559 3569 12955 18765 27345 13198 -17164 -25738 -19796
24337 -19796 -18088 -9975 -3003 -4840 -1681 -111 -9423 -13315 -10728 -553 -1526 -23387 -18853 -11276
24323 -11276 -15964 -11576 14625 22920 14625 10040 19459 16971 11963 3191 -2725 1119 11986 12323
24309 12323 6007 -1127 -3210 -12583 -17100 -14549 -13575 -2170 -2229 -2944 14738 9109 2794 -3150 -10013
24294 -10013 -498 3142 5047 6398 11136 3365 -9160 -6797 -13796 -3930 3735 19261 37596 31845
24280 31845 21404 7132 2173 8930 3640 -2408 -3521 5773 115 2851 9703 13988 12449 3852
24266 3852 -8000 -9718 -15785 -15343 -10039 -13884 -9895 -15567 -24236 -14181 -377 -1714 -5572 956
24252I56R906j2702k808J5729P480p21p009n991k985J367j95l227M740J1425m943
24237A1022r873j0999R728J0555n087n469q038n193Q947J7938P379j301J194r690
24223A1113p129m378M241k0399r572J2247J0584k730l442J0986k736R994N466
24210A4245J0808O861o325j6704p731L494l983n446m979R02l261J5773J0036m105
24196I585q455N715J0881j1310l012k939K125l704J2217Q944j2795j8171N076
24183e843N813j253J7140R270r135n071m663L669m910M136Q465k939M411j1605
24169G485j7360L303J8536q892j0096P697Q543o57o433J369Q664O543K415q463
24155A2654N295J134L196r405j583Q867j2829j0985P906J1006O969p057j7973
$$ plain form
24252 956 10862 -1840 -4648 11081 18561 17840 10831 4840 1855 3222 3027 -200 4540 15965 11022
24237 11022 1149 -9850 -122 10433 5346 -123 -8161 -13354 -4407 13531 20910 19609 20803 11113
24223 11113 3984 -394 3847 -16552 -26124 -13877 -3293 -6023 -9465 1521 -1215 8779 14245
24210 14245 25053 31914 25589 8885 1154 4648 665 -4781 -9760 -8858 -12119 3654 13690 9585
24196 9585 1130 6845 17726 6416 3404 465 2590 -1114 11103 20047 7252 -10919 -5843
24183 -5843 -30 -1283 15857 25127 15992 10921 6258 9927 5017 9153 17618 14679 19090 7485
24169 7485 -9875 -6572 11964 3072 -7024 673 9216 8559 2126 3495 12159 18702 21117 12654
24155 12654 17949 19083 22279 12874 11291 20158 7329 -3656 4250 15256 22225 15168 -2805
24142b805k714L186L825N93j0292k465l110J0109P763J1349l474j999p581k282
24128A03L518L34J0282P332j4190j4489l899K943Q828o056N316r531j1406L262
24114a7653J3936Q032m237R965Q529L414O126k113m352q991l421n65J164M895
24100A4729n392o971K617l28K367j0628J326K384k627m052L287r234N170l190
24086a0542J6836J8200P220q42k2382p519K732K061l6Q785M201m234Q113q7m966
24071A7540j9665o413l668R012k430k488L751M245L565p488q674n599L595N972
24057h745k808k592M451J8683J1178N897P705m189j0547k2823r512l050N858Q103
24043b391J3792K2960N022n052k1349k607m158k134K127m207J1576J5049j4121
$$ plain form
24142 -2805 -5519 -2333 1492 2085 -8207 -10672 -13782 -3673 4090 15439 11965 9966 2385 103
24128 103 3621 3955 14237 21569 7379 -7110 -11009 -8066 762 -5294 22 -9509 -20915 -17653
24114 -17653 -3717 4315 78 10043 18572 21986 28112 25999 21647 12656 9235 8670 9834 14729
24100 14729 9337 2366 4983 4655 7022 -3606 -2280 104 -2523 -6575 -3288 -12522 -7352 -10542
24086 -10542 6294 24494 31714 30872 8490 971 3703 5764 5728 14513 18714 14480 22593 22506 17540
24071 17540 -2125 -8538 -12206 -3194 -5624 -8112 -4361 -116 3449 -4039 -12713 -18312 -14717 -8745
24057 -8745 -11553 -14145 -9694 8989 20167 26064 33769 29580 19033 -3790 -13302 -16352 -10494 -2391
24043 -2391 11401 34361 39383 34331 12982 10375 6217 4083 6210 2003 13579 28628 14507
24030A4507j4802L783P381Q76N843N748j692j7143j227O468k357J2823L479O393
24016C0080j29j3744j8970k3964q804Q29J5647J8657N161J6276L0659J6079O206
24003G3983n734k3741n011j8921j7170k459J4185J6623P303r984j3499o127j3357
23990c909p260k6J4562J0556J402q606q482K427j0129p229R955O138k764q677
23976a2042K393L718M448Q679M521J521o63J0113J161j4147J0746J3341m334j3721
23962A5734k185m588M723J0333o976j5108n792L878J0134Q957k147J235r881l650
23948D667J2190J1710p812k557r109m131q557J1575j8579M092K3245o63k4926
23935h855r314J567J6270P847J37j02j834M541o785n543r537J490J9270K098j0479
$$ plain form
24030 14507 -295 3488 10869 11745 17588 23336 21644 4501 3274 9742 7385 20208 23687 30080
24016 30080 29951 16207 -2763 -26727 -35531 -34702 -19055 -398 4763 21039 51698 67777 73983
24003 73983 68249 44508 39497 20576 3406 947 15132 31755 39058 29074 15575 9448 -3909
23990 -3909 -11169 -11195 3367 13923 15325 6719 -1763 664 -9465 -16694 -6739 -601 -3365 -12042
23976 -12042 -9649 -5931 -1483 7196 11717 13238 12575 22688 23849 9702 20448 33789 29455 15734
23962 15734 13549 8961 13684 24017 17041 1933 -3859 19 10153 19110 16963 18198 8317 4667
23948 4667 16857 28567 20755 18198 9089 4958 -3599 7976 -10603 -6511 16734 16071 -8855
23935 -8855 -18169 -16602 -332 7515 7652 7550 5716 10257 3472 -2071 -11608 -10118 9152 11250 771
23920G71k0888n449J1030R094K205P606O258q19k746J36L236l004r837j472O381
23905B502P859n651J2462L78j2213j2858M344L223K741P63P396q14q442P87J3279
23890A5756m307q750j1703j1103j3569J0185J7985K9027Q525q144j4433j1304
23878a835o690j642O17K292j3525O499J0949R415j985m30J0877j1015k435M902
23864E994m197p549Q580N033l244k948q854J554j3541m376l050M866J313l405
23850b3824k228m442J5118K0518J280o269m467J600K955k464o126n776J3330r689
23836a0484l685j736R338J0967j725m830l699l113m766J088L845n598O415J3247
23822E264n304r459o925R646K920K922O946l546j2671P696L400K593p460O21n615
$$ plain form
23920 771 -20117 -25566 -14536 -5442 -3237 4369 10627 9808 7062 7198 10434 7430 -2407 -3879 2502
23905 2502 10361 4710 17172 17550 5337 -7521 -3177 46 2787 3550 10946 10132 1690 2477 15756
23890 15756 11449 2699 -9004 -20107 -33676 -23491 -5506 23521 32046 23902 9469 -1835
23878 -1835 -8525 -10167 -9550 -7258 -20783 -14284 -3335 6080 4095 3665 14542 3527 1092 5994
23864 5994 1797 -5752 2828 7861 4617 1669 -7185 -5631 -19172 -23548 -26598 -21732 -20419 -23824
23850 -23824 -26052 -30494 -15376 5142 6422 153 -4314 -2714 241 -2223 -8349 -14125 -795 -10484
23836 -10484 -14169 -15905 -6567 4400 2675 -2155 -5854 -8967 -13733 -12645 -8800 -14398 -7983 5264
23822 5264 -40 -9499 -16424 -6778 -3858 -936 6010 2464 -10207 -2511 889 3482 -3978 -3357 -8972
23807h972r869o617p47K0149J7167m255o097n676j1967P559R440J1689K35r148
23793B891J332l116j1891P107j0441j8028o259J2926P636o73L331o78K077J725
23779a2061r134O195J0208q325m309K4941R780O58r971O949N16j2045p138J4973
23765A1237N252j1810k355j6829n618K456Q535K757P117m625j2264J133J1435
23752c579j486k786q258R976J2403r631K628M697R335l066r219o093n777K549
23738h307k543j29J336Q796j3230j0733p6l170n000J076P437J8055P564P280O293
23723A4649r656J114J0720R842j072j2898K345N222k588k622o048p066J6157J1911
23709C0010j0524q259R15R956K194r095p699q3j8913r760L135q325n520J8602
$$ plain form
23807 -8972 -18841 -25458 -26205 -6056 11111 6856 759 -4917 -16884 -9325 115 11804 12039 2891
23793 2891 4223 1107 -10784 -3677 -14118 -32146 -38405 -25479 -17843 -18516 -15185 -15863 -13786 -12061
23779 -12061 -21195 -15000 -4792 -13117 -17426 7515 17295 17953 7982 14931 15447 3402 -3736 11237
23765 11237 16489 4679 2324 -14505 -20123 -17667 -9132 -6375 742 -3883 -16147 -15014 -3579
23752 -3579 -5065 -7851 -16109 -6133 6270 -3361 -733 3964 13299 10233 1014 -5079 -10856 -8307
23738 -8307 -10850 -10979 -9643 -847 -14077 -24810 -24886 -28056 -33056 -31980 -24543 -6488 1076 8356 14649
23723 14649 4993 6107 16827 26669 25597 12699 15044 20266 17678 15056 9008 1942 18099 30010
23709 30010 19486 11227 12142 22098 24292 15197 7498 7415 -11498 -21258 -18123 -26448 -31968 -13366
23695a3366J2971J8478J1292j6436k2688o661P592N743Q192j754k4976j1656J2390
23682b0879O891J0532N687o046m124q74J887N949P974P511j940j2328j615J3322
23668A1947m109j0556J499j240K786Q651R503l567r178M711j2410M448M708q592
23654a399L151M592k951P17l27j1645o734J262K670L381J373n903n819J3391q905
23639a3146k854J4596p961m965m211J3224J6540m106l647k120J0427N203n471
23626A1509j5585K630N457j2938n670L985Q907R24J3030o710j0472N239m245J5492
23612A1553J7154j1133k799r509K908l546q991j7949J9738Q123r409R9l501m909
23598a2171j0969N570J3762M420m206L111Q615J1519m334j0707j9667M986P254
$$ plain form
23695 -13366 -395 18083 29375 12939 -9749 -16410 -8818 -3075 5117 3363 -21613 -33269 -20879
23682 -20879 -13988 -3456 2231 -3815 -7939 -8813 -6926 -977 6997 14508 12568 240 -1375 11947
23668 11947 7838 -2718 -1219 -2459 327 8978 18481 14914 5736 10447 -1963 2485 7193 -1399
23654 -1399 1752 6344 3393 4110 3783 -7862 -14596 -13334 -10664 -7283 -5910 -11813 -17632 -4241 -13146
23639 -13146 -16000 -1404 -9365 -14330 -18541 -5317 11223 7117 3470 1350 11777 16980 11509
23626 11509 -4076 -1446 4011 -8927 -14597 -10612 -1705 -781 12249 5539 -4933 306 -3939 11553
23612 11553 28707 17574 14775 5266 8174 4628 -4363 -22312 -2574 5549 -3860 -3761 -7262 -12171
23598 -12171 -23140 -17570 -3808 612 -3594 -483 8132 19651 15317 4610 -15057 -10071 -2817
23585b817M09l013j1840l691o356P507K5448n502m249R016M947O215L986o853
23571A3207m834j3597l394j870J2223J1658j0600l587J1037J0980j798j5513r382
23558e470J2108Q191j2797j158pm078p191J2216k73O020J3604k377o879q574j1989
23543h654O981L114K280P700k704n28J954J0310J2663p174k2328l714J75J924
23529A999jj716k835O60N933P0L822L134j527L614j3953j2967R173R639j1288
23514f243j2386J0200L233o11J274K670K192m91J4118L410j4050o643N519j5422
23500a3230j637n14J3981K1180k1181r260L897R518m185n432O887P19j5751q920
23486b3928J39O987L495J1482L834o20L59o271m127N215K156o663N424m084n459
$$ plain form
23585 -2817 -2408 -5421 -17261 -20952 -27308 -19801 5647 145 -4104 4912 9859 16074 20060 13207
23571 13207 8373 -5224 -8618 -10488 1735 13393 2793 -794 10243 21223 19425 3912 -5470
23558 -5470 6638 14829 2032 874 867 -3211 -10402 1814 1541 7561 21165 18788 11909 3335 -8654
23543 -8654 -1673 1441 3721 11421 8717 8189 10143 20453 33116 25942 3614 -100 75 1999
23529 1999 1998 282 -2553 -1893 4040 4110 7932 11066 9539 13153 -800 -13767 -4594 5045 -6243
23514 -6243 -18629 -8429 -5196 -5807 -4533 -1863 329 -162 13956 17366 3316 -3327 2192 -13230
23500 -13230 -14867 -15381 -1400 19780 -1401 -10661 -6764 2754 -1431 -6863 24 743 -15008 -23928
23486 -23928 -23789 -16802 -13307 -1825 2009 1389 1748 -4523 -8650 -3435 -1279 -7942 -2518 -6602 -12061
23471a2061O821m823K416J193q51N118M196Q426n744j0631l70J447m63K058m40
23456c708L946M545j3212K286J7050k954k229j530j3659J377L092o736J929j0420
23442b0223q186O294l283o557J1617P316L736K2555R384n832L05N768m977j244
23428A6673q680l840k1870k090O724J231M834J3361M912K450o140p998j1959M592
23414g800l231J556p295J2707J3012J0774j1945p990R591k5j1512o458l878j258
23400a3752P178J1398o879k222J5407J173r981J292R403J4268p285j612K1683
23387D0071P361n386k0283n438M361m931n626j1526k774L785j479l57j3300L176
23373a2346J6214O33r659k893j1388r927j1811l068J3288J3530J191N136M126
$$ plain form
23471 -12061 -5240 -10063 -7647 -6454 -7305 -2187 2009 10435 4691 -5940 -6310 -4863 -5326 -3268 -3708
23456 -3708 238 4783 -8429 -6143 10907 7953 5724 4194 -9465 -8088 -4996 -11732 -9803 -20223
23442 -20223 -28409 -22115 -25398 -31955 -20338 -13022 -9286 13269 22653 16821 17126 22894 17917 16673
23428 16673 7993 4153 -17717 -19807 -13083 -11852 -7018 6343 11255 13705 7565 -433 -12392 -7800
23414 -7800 -11031 -9475 -16770 -4063 8949 19723 7778 -212 9379 9354 -2158 -8616 -12494 -13752
23400 -13752 -6574 4824 -2055 -4277 11130 12303 2322 3614 13017 27285 20000 18388 40071
23387 40071 47432 42046 21763 16325 20686 15755 10129 -1397 -4171 -386 -1865 -2222 -15522 -12346
23373 -12346 3868 4501 -5158 -8051 -19439 -29366 -41177 -44245 -30957 -17427 -16236 -11100 -6974
23360f974j2989j4651L924K2930K1499j435l166m102q237j624j483M343K864J7753
23346A8652j610j102J1232R595k2223j4835O664n129m689K320K273J0429J2285
23333B3862k008l072m120M801j0241j2920n416K546O66N345J1222J260o935P896
23319A2886J0243j1902j0968R249J5606j0938j6744o774J1996l382L683N080q835
23306h00n990o236J682J9957l942l341J641N216m411N556j880K127m939j8098
23292a3458R256J3601J3127q735m401k001J284J672j09R275L607P435j14o71o395
23277B3373R32j131R96j9497n075J5484r10m860N248k192j2724p18n516k633J4800
23262E577M158l300J0830N870j499j1452j5572K154K697J7164P558k818Q697J3192
$$ plain form
23360 -6974 -19963 -34614 -30690 -7760 13739 12304 9138 5036 -3201 -4825 -6308 -1965 899 18652
23346 18652 17042 15940 27172 36767 14544 -291 6373 1244 -3445 -1125 1148 11577 23862
23333 23862 21854 18782 14662 19463 9222 -3698 -9114 -6568 -5902 -557 10665 11925 4990 12886
23319 12886 23129 11227 259 9508 25114 14176 -2568 -9342 2654 -728 2955 8035 -800
23306 -800 -6790 -13026 -11344 8613 4671 1330 2971 8187 3776 9332 7452 9579 4640 -13458
23292 -13458 -4202 9399 22526 13791 9390 7389 8673 10345 10236 19511 23118 30553 30439 29768 23373
23277 23373 24305 23174 24170 4673 -402 15082 14172 9312 14560 12368 -356 -1074 -6590 -9223 5577
23262 5577 9735 6435 17265 23135 21636 10184 -5388 -3234 -537 16627 24185 21367 30064 43256
23248D3256j1128o406k795L885j1553k461J776q030j508l93j549j5997p250P857
23234a2296m546k37J5281K52J4930L274q613r01r746O600N992j273j1098m286
23220f667Q41J439q946p125k532K4901J1492K817p071m355O228P71K101n632M643
23205A2905R779k972O302N12j3647j958j777p196J2029P237p416p185j349l94
23191D870k045k089P296j762q860j7282M305M613n498o41L174J1132N181N432
23177G826K897j1736L388N732q861N906J0423r30Q91l955r629n368j5777n886
23163b5079O742J0851J6529j094q929k576k099q359q734N818r45J1342J0969j0141
23149e705p43N142O118l137q056l115j2140L250J1305K745J1785P539O963M836
$$ plain form
23248 43256 32128 25722 22927 26812 15259 12798 14574 6544 5036 4643 3094 -12903 -20153 -12296
23234 -12296 -16842 -17079 -1798 -1546 13384 16658 8045 7144 -2602 3998 9990 8717 -2381 -6667
23220 -6667 -5826 -4387 -13333 -20458 -22990 1911 13403 16220 9149 4794 11022 11793 13894 8262 12905
23205 12905 22684 19712 26014 26526 12879 10921 9144 1948 13977 21214 13798 6613 5264 4870
23191 4870 2825 736 8032 6270 -2590 -19872 -15567 -10954 -16452 -17093 -13919 -2787 2394 7826
23177 7826 10723 -1013 2375 8107 -754 5152 15575 14645 15536 11581 1952 -3416 -19193 -25079
23163 -25079 -18337 -7486 9043 7949 -980 -3556 -5655 -14014 -22748 -16930 -17875 -6533 4436 -5705
23149 -5705 -6448 -1306 4812 1675 -6381 -9496 -21636 -18386 -7081 -4336 7449 14988 21951 26787
23135B6787j2895k5214n662Q819O910P335o140r038l074J0569k069l228R333p084
23121d651j7547N192P886k827J0190k461n961J0956m227p447j9511q588j48L792
23107c5352J2464P836M772J649N603j1740O349P601O569o792k661j3823R01J3242
23093c382k590j1219R174M019q981J5164K0783P980j6686l397Q169K072j2732
23080H374o279n835j3630J576J066L660J295K837J7876P40Q742N447j5948j3048
23066c127j307n761J4089L743k535P648R058l761j4338m642K935j300R5Q523M653
23051A3973j2706J1485M853R328n716r638L778N071o850q670j2022k282Q553N829
23037D986N290L706r806j7734o434l623m330J2603K8977k957n453L983l804M969
$$ plain form
23135 26787 13892 -11322 -16984 -8165 -1255 6080 -60 -9098 -12172 -1603 -3672 -6900 2433 -4651
23121 -4651 -22198 -17006 -9120 -11947 -1757 -4218 -10179 777 -3450 -10897 -30408 -38996 -39144 -35352
23107 -35352 -22888 -15052 -10280 -8631 -3028 -14768 -8419 -818 5751 -1041 -3702 -17525 -16624 -3382
23093 -3382 -5972 -17191 -8017 -3998 -12979 2185 22968 30948 14262 10865 19034 21106 8374
23080 8374 2095 -3740 -17370 -15794 -14728 -11068 -9773 -6936 10940 11680 20422 25869 9921 -3127
23066 -3127 -4434 -10195 3894 7637 5102 12750 21808 18047 3709 -933 2002 702 797 9320 13973
23051 13973 1267 12752 17605 26933 21217 11579 15357 20428 13578 4908 -7114 -9396 -843 4986
23037 4986 10276 13982 4176 -13558 -19992 -23615 -27945 -15342 13635 10678 5225 9208 5404 10373
23023A0373l846n372q11O41p898j258l819n43n534M328J3594P164M205j737M580
23008A4067l774N892j769q525k2793r51M430O259o363m024j504l555R072J4193
22994F55n639J545M53l120q017Q989l831m964K298R862l959r042j2031J1682K3155
22979H036K510n292J981J46l063j4628j1315N881K7084P403o646J4316j856o053
22965A8504n072l174N499K179N28k195K210q134r851N272n254m731N78J0298o46
22950F011o39l453j8124l57P042O871R453Q645J294K959r23O543j7768j6991p553
22935a6990k19o923K771K849M254O207j0139n973J4125O326L936m503m895K610
22921f564R154N264M99j0829j63P587l530P333J2122n482K831O335p424j1870
$$ plain form
23023 10373 6527 1155 344 985 -6913 -8171 -11990 -12533 -18067 -13739 -145 7019 11224 9487 14067
23008 14067 10293 16185 14416 5891 -16902 -17853 -13423 -7164 -13527 -17551 -19055 -22610 -13538 655
22994 655 -4984 -3439 -2986 -6106 -14123 -5134 -8965 -13929 -11631 -1769 -5728 -14770 -26801 -15119 8036
22979 8036 10546 5254 7235 7381 4318 -10310 -21625 -15744 11340 18743 12097 26413 24557 18504
22965 18504 13432 10258 15757 17936 18464 16269 18479 10345 494 5766 512 -4219 -3641 6657 6011
22950 6011 5372 1919 -16205 -16562 -9520 -2649 6804 15449 16743 19702 18779 25322 7554 -9437 -16990
22935 -16990 -17209 -24132 -21361 -18512 -14258 -8051 -18190 -24163 -10038 -3712 224 -4279 -9174 -6564
22921 -6564 2590 7854 8353 -2476 -2639 4948 1418 8751 20873 15391 18222 24557 17133 5263
22907E263n411j5261R928J8155K795j881j5247q268k044L158j167k058L5Q897
22893c106K690K78L626l988j865J3951J1604j0896j6446j1162N94J296l025J9363
22879B914o408o569r696j0853J7401K3840P158l876q767p53j0938Q3m232l453
22865a4149N043L825R072j2207J019J2172J0217K811n995j1314K160O291j579
22852G366r63j6821j1562q138n939M189O366J7165J8231Q845J0536j0543j3214
22839E518J759j3829n425J1390K204o867p06L606l932L829q306m05J1747J032
22825A615n262q108R964m776M756J1213m994m949L505L255J0318l52r52K414O43
22810A8290j210j0742j006m409m237M597j6407Q16r6J677J7734m404j8677J1779
$$ plain form
22907 5263 -148 -15409 -5481 12674 15469 13588 -1659 -9927 -11971 -8813 -9980 -12038 -12003 -3106
22893 -3106 -416 -138 3488 -500 -2365 11586 23190 12294 -4152 -15314 -14720 -13424 -16449 2914
22879 2914 -3494 -10063 -19759 -30612 -13211 10629 17787 13911 5144 4391 -6547 -6464 -10696 -14149
22865 -14149 -9106 -5281 3791 -8416 -7397 4775 14992 17803 11808 494 2654 8945 7366
22852 7366 6403 -10418 -21980 -30118 -36057 -31868 -25502 -8337 9894 18739 29275 18732 5518
22839 5518 7277 -6552 -11977 -587 1617 -5250 -5956 -2350 -6282 -2453 -10759 -11164 583 1615
22825 1615 -3647 -11755 -1791 -6567 -1811 9402 4408 -541 2964 6219 16537 16185 15233 17647 18290
22810 18290 17080 6338 5332 923 -3314 1283 -15124 -14308 -14404 -12727 5007 603 -18074 -6295
22796f295J5844j96o062o415q663k820o638p964j449J0572J462J7323O370n188
22782a19j1045q949J4744j410p107k962Q636k468o503j157J7780R48p098k716
22768i426M153r620k4373k755K0623K95Q384o865L799j2303m802J4374J5507L389
22754C80p675Q451K261j9505l92J3778J348R434O297O326l669n827k170j3835
22740d798j5740L682J2578j2615j0338L764R515L889N47r551K152J0716p140p224
22726b0563o05J0880J0359l259j4761N191P756K662J1546P556j5595j0376M043
22713e166J4853P493k4722j2130Q706L260J1902O706Q167p96j2669j5810N523
22700d683P870K785m679o265n620J953q615P664J9440J2666m473p193p748O04
$$ plain form
22796 -6295 9549 9353 3291 -3124 -11787 -14607 -21245 -29209 -30658 -20086 -18624 -1301 5069 -119
22782 -119 -11164 -20113 -5369 -6779 -13886 -16848 -8212 -10680 -17183 -18340 -560 388 -6710 -9426
22768 -9426 -5273 -14893 -39266 -42021 -21398 -21103 -12719 -19584 -15785 -28088 -32890 -18516 -3009 380
22754 380 -7295 1156 3417 -16088 -16480 -2702 -1354 8080 14377 20703 17034 11207 9037 -4798
22740 -4798 -20538 -16856 -4278 -16893 -27231 -23467 -13952 -10063 -9516 -19067 -16915 -6199 -13339 -20563
22726 -20563 -21168 -10288 71 -3188 -17949 -12758 -5002 -2340 9206 16762 1167 -9209 -5166
22713 -5166 9687 17180 -7542 -19672 -10966 -7706 4196 10902 19069 18273 5604 -10206 -4683
22700 -4683 3187 5972 1293 -4972 -10592 -8639 -17254 -9590 9850 22516 18043 10850 3102 3706
22686C706m440J1943Q349J885k147j0819P15Q784J0528n770j7010k0922L764J1259
22672a75L604K687j740j781M240L906J1552J2663l0272j3138k388k613j583P53
22658a4285O01J0619j531p926J7220J4031M743j1271n828j88n189O273O255r134
22644D390j2330Q300j045l907P954m40o141q319L735l416M996J183O020L893M374
22629I247r076R770O988j403O135R330l215j3914L26o409o515j259j65j5385l881
22614a9426L859J8765O520J870L671M894j291K580R62L830j2360j0939k494R812
22600A0253m612j8559j7766K818K2799J1926n99r751M945J5616j484N243J6473
22587C7302j0879j348j0087l812P996m161o924p133j775J1465J6055j1264j2838
$$ plain form
22686 3706 -734 11209 19558 21443 19296 8477 9192 17976 28504 22734 5724 -15198 -11434 -175
22672 -175 3429 6116 4376 2595 6835 10741 22293 34956 4684 -8454 -10842 -13455 -15038 -14285
22658 -14285 -13684 -3065 -4596 -12522 4698 18729 23472 12201 6373 6185 996 7269 13524 4390
22644 4390 -7940 360 -685 -4592 3362 2922 -3219 -11538 -7803 -11219 -6223 -5040 980 4873 9247
22629 9247 171 9941 16929 15526 21661 30991 27776 13862 14188 7779 1264 5 -160 -15545 -19426
22614 -19426 -15567 3198 9718 11588 15259 20153 18862 21442 22404 26234 13874 2935 441 10253
22600 10253 5641 -12918 -30684 -27866 -5067 6859 6260 -3491 1454 17070 15586 20829 37302
22587 37302 26423 25075 14988 11176 19172 15011 8087 954 -821 10644 26699 15435 2597
22574B597M225L135n993o220l957L68K4534m299j1885ON81Q786K789j5977j3860
22559a5170j2353j136O209J94N919m851L955P876J0899J1678N020p464q754L411
22545E433p00o938m964K480k341M679k787Q99q608n89N479J0139k245p47l819
22530d629j3246N662m226O387J1719l857p92j1381O676j149n191R07J5334o4j0745
22515h595j5688J16n045m712N547M083Q826K1675N630o622q518o664J664P461
22501h42pj0435J0290J3312j576j0726M473J1127L432r167j744J15J840K340q342
22486D090q664j0176R594Q623k294n706M072L997P871J0502M419n642p415m295
22472H976j440J3408j271q3N785J788j3924j8070j5954L748k353N671J7804K5174
$$ plain form
22574 2597 6822 9957 3964 -2256 -6213 -5845 18689 14390 2505 2511 3092 11878 14667 -1310 -15170
22559 -15170 -27523 -28659 -22450 -22256 -16337 -21188 -17233 -9357 1542 13220 18240 10776 2022 5433
22545 5433 4733 -2205 -7169 -4689 -7030 -2351 -5138 -4239 -12847 -13436 -7957 2182 -63 -810 -4629
22530 -4629 -17875 -12213 -16439 -10052 1667 -2190 -2982 -14363 -7687 -8836 -14027 -13120 2214 2150 -8595
22515 -8595 -24283 -24167 -29212 -33924 -28377 -24294 -15468 6207 11837 5215 -3303 -9967 -8303 -842
22501 -842 -849 -11284 -994 12318 10742 16 4489 15616 19048 9881 8137 8252 10092 12432 4090
22486 4090 -4574 -14750 -5156 3467 1173 -4533 -461 3536 11407 21909 26328 20686 13271 8976
22472 8976 7536 20944 19673 19590 25375 27163 13239 -4831 -20785 -17037 -19390 -13719 4085 29259
22458B9259o200j9845j0391N542Q08L160p391j2714R799J2754m910O965M600m675
22444F761r559K615Q006N618P372j7490Q147K29j1367j3411o724n779L403J0314
22430a1865K5852J3604j1958q066m116n690M506O935n159J868P867K593R80j346
22416A6005l502R285j357j1355p077M069J704q387j0033K85R377R036k28N985
22402A3807R26l821j0586M97J4413J113m343k112M16j1381N567J4011r307l627
22388E573l424k660K88j944r168K863M801p491j0168j1649J2672K0250J7599p65
22374A6777n385m138M557j608q748j5206M28m696O103J0357J5699J707o695J738
22360A0890q003j0857r404r314J266J3528M725j165Q549J5777J3652J2161R924
$$ plain form
22458 29259 23059 3214 -7177 -1635 -827 2333 -5058 -17772 -7973 4781 -129 6836 11436 6761
22444 6761 -2798 -183 7823 13441 20813 3323 11470 11699 332 -13079 -19803 -25582 -22179 -11865
22430 -11865 13987 27591 15633 7567 3451 -2239 2267 9202 4043 5911 13778 16371 17351 16005
22416 16005 12503 21788 20431 9076 1999 6068 7772 -615 -10648 -10363 -986 8050 7822 13807
22402 13807 14733 10912 326 823 15236 16349 12006 9894 10310 -1071 4496 18507 9200 5573
22388 5573 2149 -511 -223 -2167 -11335 -8472 -3671 -11162 -21330 -32979 -20307 -57 17542 16777
22374 16777 11392 7254 11811 10203 1455 -13751 -13323 -18019 -11916 -1559 14140 15847 9152 10890
22360 10890 2887 -7970 -17374 -26688 -25422 -11894 -7169 -8334 215 15992 29644 41805 51729
22347E1729j9029k7202p911K284N795q660p318J7663J50p002J518L19m277n703
22333g644k352N279M617O832J2654K202L261j9584K38k230l286J4076r82o065
22319G016k778r849m826L831r179L252J2143l727J1241o294j0225J3867K308j8768
22305a1988J7256O457j603j188O88J3655j2380P15p854j0503R719j0583j0821
22292a8430J2248M777R49J0219K7322K185j5361j626J065j5217m330p855q643
22279a2697k191N101N122N993P027J5228j0885j4470M475R320j2272j2107P19
22266a1637K600o173j4150L946J0686J1408P404j6045l696R139j292M333L120
22253c57K859M58j415O682p295m459o27J0738P857Q220n459o242j0932j542J821
$$ plain form
22347 51729 32700 5498 -2413 -129 5666 -2994 -10312 7351 7501 499 2017 2336 -1941 -7644
22333 -7644 -9996 -4717 -100 6732 19386 21588 24849 5265 5503 3273 -13 14063 13081 7016
22319 7016 4238 -5611 -10437 -6606 -15785 -12533 -390 -4117 7124 830 -9395 4472 6780 -11988
22305 -11988 5268 11725 10122 8934 9622 23277 10897 11612 3758 -6745 2974 -7609 -18430
22292 -18430 -6182 -1405 -456 9763 37085 39270 23909 22283 23348 8131 3801 -4054 -12697
22279 -12697 -14888 -9787 -4665 1328 8355 23583 12698 -1772 2703 12023 -249 -12356 -11637
22266 -11637 -9037 -15210 -29360 -25414 -14728 -3320 4084 -11961 -15657 -6518 -7810 -3477 -357
22253 -357 2502 2960 1545 8227 932 -3527 -4154 6584 14441 22661 17202 10960 28 -1514 307
22238C07N705j220p447O599l389j8192J2879J0870k51j787k329j2764j2294p210
22224c0523M501J8476o69q432l904l18o185J1157M432n458Q955L160M087k523
22210c244n657O673M917m374J0835K188oK928o000j412p113l935j4612L732J2872
22195b208J2412M266n961p667k702L750Q153l799j1205P668K5123L85O563n93
22181C4185k9021j0735P515N823N901p485j5818p887P287J7343O949q734j5886
22168a0563M458O805q501j4762p887J8577K6290P222K545m303j985q88k4137R92
22154f137j0763l458j300P109K0347l46q68r100M19j4139j6233j623M106P546
22140b4440p377J0893L944q099p065L231O156J6292R162j4389j7004m675P373
$$ plain form
22238 307 6012 4792 -2655 3944 555 -17637 -4758 6112 5861 4074 1745 -11019 -23313 -30523
22224 -30523 -26022 -7546 -8215 -16647 -20551 -20869 -27054 -15897 -11465 -16923 -7968 -4808 -721 -3244
22210 -3244 -8901 -2228 2689 -1685 9150 11338 11332 14260 8260 6848 -265 -4200 -18812 -15080 -2208
22195 -2208 10204 14470 8509 842 -1860 1890 10043 6244 -4961 2707 27830 28215 34778 34185
22181 34185 5164 -5571 1944 7767 13668 6183 -9635 -17522 -10235 7108 14057 5323 -10563
22168 -10563 -6105 700 -7801 -22563 -30450 -11873 14417 21639 24184 19881 17896 17008 -7129 -6137
22154 -6137 -16900 -20358 -21658 -14549 5798 5452 4584 -4516 -4097 -18236 -34469 -36092 -31986 -24440
22140 -24440 -31817 -20924 -16980 -25079 -32144 -28913 -22757 -6465 2697 -11692 -28696 -33371 -25998
22127b5998J4630J7508J1899M236j0813j4682n542m753n886j586J245J6889N889
22114C036P213L167L126j796j0082j29l615M402R156n629j9089l762L028l097
22100a4071R980R461l303l122L772l491j1175J1140J4150O650j657m958o543j086
22086E747K735o743o881r655M249O599N153l60j670R979N658j729p581Q022M317
22071A7840m881M347o71K840N050j1342p940O349K579j0434o022n733L433Q340
22057C755L016j332q180j025M640R427q532l992L643J175l264j511l371o587p979
22042b0117n335m40O722P1o98P155m81J163n271J6712J7369j111j7636j6511p704
22027b6112N301K0378J1029p07M823P561p192L979N301R446J112N817P454m158
$$ plain form
22127 -25998 -11368 6140 18039 22275 11462 -3220 -8762 -13515 -19401 -20987 -19742 -2853 3036
22114 3036 10249 13416 16542 14746 4664 4535 920 5322 14478 8849 -10240 -14002 -10974 -14071
22100 -14071 -4091 5370 2067 -1055 2717 -774 -11949 -809 13341 19991 18334 13376 6833 5747
22086 5747 8482 1739 -5142 -14797 -10548 -3949 1204 844 -826 9153 14811 13082 5501 13523 17840
22071 17840 12959 17306 16635 19475 24525 13183 5243 11592 14171 3737 -2285 -8018 -4585 3755
22057 3755 6771 5439 -2741 -3766 874 10301 1769 -2223 1420 2595 -669 -2180 -5551 -12138 -20117
22042 -20117 -25452 -25892 -19170 -19099 -19797 -12642 -13123 -11960 -17231 -519 16850 15739 -1897 -18408 -26112
22027 -26112 -20811 -433 10596 9889 14712 22273 15081 19060 24361 33807 34919 40736 48190 44032
22013D4032j4830k2832O71j2758l892p455j0213J0158Q840j1310N644N985L632
22000d328O570n322k5069k419K4593Q108J1421q574j0420k550j951L1l140M00
21986a2650p145L435r313J6782J7611j618j3246Q026j815N284J0479j1489n448
21973a107K609j833j5232J9795L934n474l514l685p464N659o064o026J736M514
21959a2152J8990L014j707j4260n756L519N43k11q245j0499P910J7722L881m703
21945a954j0983m156J1026Q476L833p025j7281k352p367J2656K2421M251Q443
21932A9988k179r826r352j6527j5345K479K3792M823j1479R901M124o462j4932
21919b0995M919N708J3699Q86o641q61N503q59p161J215J060M268M962o550o45
$$ plain form
22013 44032 29202 6370 7041 -5717 -9609 -17064 -27277 -17119 -8279 -19589 -13945 -7960 -4328
22000 -4328 2242 -3080 -28149 -30568 -5975 2133 13554 4980 -5440 -7990 -9941 -9910 -13050 -12650
21986 -12650 -19795 -16360 -25673 -8891 8720 7102 -6144 1882 67 5351 15830 4341 -1107
21973 -1107 1502 -331 -15563 4232 8166 2692 -822 -4507 -11971 -6312 -12376 -18402 -16666 -12152
21959 -12152 6838 9852 8145 -6115 -11871 -8352 -7809 -8020 -16265 -26764 -18854 -1132 2749 -1954
21945 -1954 -12937 -17093 -6067 2409 6242 -783 -18064 -20416 -27783 -15127 7294 11545 19988
21932 19988 17809 7983 -1369 -17896 -33241 -30762 -6970 -2147 -13626 -3725 399 -6063 -20995
21919 -20995 -16076 -10368 3331 4217 -2424 -3285 2218 1359 -5802 -4587 -3527 741 5703 -847 -1492
21904a492L910o047R368K21o68k332P335j488M54Q250Q920m10p430n190m084q593
21888G24n0o02J0775m729n757l823L597o215l575l22J5J76n009n850O050N318
21872i277r456R236O062J1432k166o316p538j5973k719J7941P217o550r03L142
21858e868m462k397P289n163J5426J50j7176M609J564K885q80n524k6j475m958
21843a6006L675K366J3687O85J124o185p312J46j0379R523n515q21j749J5613
21829a148m145n006j865O774R484K709k0045j0949P384Q278J6728K608M351j8747
21815c589j4849N953M465Q211J3510p944j6938m749P83J0283m806M672K7352J0062
21801C2416l050m016j6346k17J395n370J0104k668j2928L492J4977L078k338l739
$$ plain form
21904 -1492 2418 -3629 5739 5960 5292 2960 10295 8807 9261 17511 26431 26021 18591 13401 9317 724
21888 724 674 72 10847 6118 361 -3462 135 -6080 -9655 -9977 -9962 -9786 -14795 -20645 -14595 -9277
21872 -9277 -18733 -9497 -3435 7997 5831 -485 -8023 -23996 -26715 -8774 -1557 -8107 -9010 -5868
21858 -5868 -10330 -12727 -5438 -10601 4825 4975 -12201 -7592 -6028 -3143 -4023 -9547 -9573 -11048 -16006
21843 -16006 -12331 -9965 3722 4407 5531 -654 -7966 -7820 -18199 -8676 -14191 -15012 -16761 -1148
21829 -1148 -5293 -10299 -12164 -5390 4094 6803 -13242 -24191 -16807 -8529 8199 10807 15158 -3589
21815 -3589 -18438 -12485 -8020 191 13701 5757 -11181 -15930 -15147 -4864 -9670 -4998 22354 32416
21801 32416 29366 25350 9004 8787 10182 4812 14916 12248 -680 2812 17789 20867 18529 14790
21787A4790P977j1350q025j977Q814k634l883N180k304p951k178K727N60Q272
21773H018q118o411J638J275P410j1237o26n150l397N134m39P48j046O785k977
21758h393J582j04K448l130j0008N862J1954O968j2506j3381l405Q367m285Q18
21744a7213r264K382N743R693Q125q756j1391J966j372j1750j629J3385K0699
21731F18N178K722r596q227J0452M019R911j333P628N801j972j520l396n866O70
21716A5089j640M129j235j1896k095k637r931k408N384o418J978P768L349n765
21702f328j2856N431n240m427l795R161k084j9171N457J9992Q942n255J0233J776
21688A836l459J0596Q4J655O960K399l922l784j4137l840Q246J4056L254l643
$$ plain form
21787 14790 22767 11417 3392 1415 10229 7595 3712 8892 6588 -1363 -3541 -814 -254 8018
21773 8018 -100 -6511 -4873 -3598 3812 -7425 -8051 -13201 -16598 -11464 -11903 -11155 -12201 -5416 -8393
21758 -8393 -6811 -6915 -4467 -7597 -17605 -11743 211 7179 -5327 -18708 -22113 -13746 -18031 -17213
21744 -17213 -26477 -24095 -18352 -8659 -534 -9290 -20681 -18715 -20087 -31837 -33466 -20081 618
21731 618 5796 8518 -1078 -9305 1147 5166 15077 13744 21372 27173 25201 23681 20285 14419 15089
21716 15089 13449 17578 16343 4447 2352 -285 -10216 -12624 -7240 -13658 -11680 -3912 -563 -6328
21702 -6328 -19184 -13753 -18993 -23420 -27215 -18054 -20138 -39309 -33852 -13860 -4918 -10173 60 1836
21688 1836 -1623 8973 9057 10712 17672 20071 16149 12365 -1772 -5612 2634 16690 19944 16301
21674A6301j979j3048N391N413o673k989J4316m297j3093j2053J0758O603Q230
21661A2880P277j0778j5051N260N737q731q760J2508m193k809P118L916j4931
21648a0557j0868j0928Q682J7432J4257N990r346j7069r649p287Q531K1258j1729
21635a1283n578J1614L681o69r974P1L855J5867J2562l945j3578j610k504j0043
21621a1534j0409P127J6380j971K753m09Q124k224l888j785j2830L739J8939J0464
21607B2476j2226m054j1291j7293Q41r354M58Q476Q95Q759J7242q15J3162p881
21593I395q251m844q745L188k988k107j5j1503N81k143O947J768Q136r839m00
21578b0820K1913Q526m428n214n858R319J5068j544j9838k18N545R268O490M40
$$ plain form
21674 16301 14322 1274 6665 12078 5405 2416 16732 12435 -658 -12711 -1953 4650 12880
21661 12880 20157 9379 -5672 -412 5325 -3406 -12166 342 -3851 -6660 458 4374 -10557
21648 -10557 -21425 -32353 -23671 -6239 8018 14008 4662 -12407 -22056 -29343 -20812 446 -11283
21635 -11283 -16861 -5247 -1566 -2235 -12209 -12138 -8283 7584 20146 16201 2623 1013 -1491 -11534
21621 -11534 -21943 -14816 1564 -407 2346 1937 10061 7837 3949 2164 -10666 -6927 12012 22476
21607 22476 10250 6196 -5095 -22388 -21547 -30901 -30443 -21967 -21072 -12313 4929 4114 17276 9395
21593 9395 1144 -3700 -12445 -9257 -12245 -14352 -14367 -25870 -25289 -27432 -20485 -18717 -10581 -20420 -20820
21578 -20820 1093 9619 5191 -23 -5881 3438 18506 16962 -2876 -3094 2451 11719 18209 18649
21564A8649r044p591r488N258Q690Q431L701q31j1536Q21j1521n963N612R657
21550D845k625j1069O60m761P686J1024n185o036J2283L930n874R377o068p828
21536C59o274n252j2179n563K352n478o564J0350N984J2443K493m008O046R966
21522D675n158n914J1069n290m950Q236J870m21L330k517P03q456o359K3237J7274
21507C1329j8659k7301j4984m26O098N063J1575J0035J2967j3880k205J8779M533
21494B2924k4516j2334M986L891n442O91N766K303M49O74q821q543Q081J973j9686
21479b7604q729P621K1800J4085p181n07N885J4180O941k726j437j6427p179L436
21465B158j443j0889j2239l876Q042J6958J3788J486j1543p546k28j98n862J4516
$$ plain form
21564 18649 9605 2014 -7474 -2216 6474 14905 18606 17775 6239 7060 -4461 -10424 -4812 4845
21550 4845 2220 -8849 -8189 -12950 -5264 5760 575 -5461 6822 10752 4878 14255 8187 359
21536 359 -5915 -11167 -23346 -28909 -26557 -32035 -38599 -28249 -22265 -9822 -7329 -11337 -5291 4675
21522 4675 -483 -6397 4672 -618 -5568 2668 4538 4117 7447 4930 5633 -2823 -9182 14055 31329
21507 31329 12670 -14631 -29615 -30041 -23943 -18880 -7305 2730 15697 1817 -388 18391 22924
21494 22924 -1592 -13926 -8940 -5049 -10491 -9800 -4034 -1731 -1282 -608 -9429 -17972 -9891 -7918 -27604
21479 -27604 -36333 -28712 -6912 7173 -8 -515 5370 19550 26491 23765 22328 5901 -1278 2158
21465 2158 715 -10174 -22413 -26289 -18247 -1289 12499 13985 2442 -5104 -5332 -5530 -11392 3124
21451C124J7466k502m79j3789j7038L736J5762K272o2o493k797p097J709J7104
21437A0916K893j124P02o135O380r031j9877j191N936O394N100K392j1307M911
21423c041m213q15o712p208J6230j901j1030p3M288M121q128p903j718M772Q129
21408a5202P914L326N76N290J834J03K203M720J203l065k479j7869j7639J790
21394b7295J0389K299P941p207l531o457k437P228J7375K836k735O157j172M582
21380G973J1134K894j8139n616Q249Q134k314j1176l612J478l927l583j33R367
21366G29j0343Q012L43m353k037J0154J207j1515p870L670J3311p267m671P6n454
21351a6008N637J8508J0064P792L076J2023p392j4532j3376K609p515l678J4573
$$ plain form
21451 3124 20590 18088 17609 3820 -13218 -9482 6280 8552 8490 1997 -800 -7897 -6188 10916
21437 10916 13809 12685 13387 7252 13632 4601 -15276 -16467 -10531 -4137 963 3355 -7952 -3041
21423 -3041 -7254 -8069 -14781 -21989 -5759 -7660 -18690 -18763 -14475 -10354 -18482 -26385 -28103 -23331 -15202
21408 -15202 -7288 -3962 -3386 1904 3738 3841 6044 10764 11967 8902 6423 -11446 -29085 -27295
21394 -27295 -16906 -14607 -6666 -13873 -17404 -23861 -26298 -19070 -1695 1141 -1594 4563 3391 7973
21380 7973 19107 22001 3862 -1754 6495 14629 12315 1139 -2473 -995 -4922 -8505 -8638 729
21366 729 -9614 -1602 -1259 -5612 -7649 2505 3712 -7803 -15673 -12003 1308 -5959 -10630 -10554 -16008
21351 -16008 -10371 8137 18201 25993 29069 41092 33700 19168 5792 8401 886 -2792 11781
21338A1781j0307n008n261j5273q205Q505K250J0813l854k957P135M316R102J686
21324D723r627j501R748Q773J5341q767j6674j7436J3450J9962J928p87K324K124
21310B3581p802m049n109n152j3402o422N757J0112r682m11J800r925Q078R896
21296b730M284P163k82j0670l687k873q004R627P128N249k433J267O247J1390
21282B1676l841j0036j475j1848j2760j227k674l557J0325J2210j252M713O508
21269F762j0741J640Q736M371j919r427L882m538j0074N352J3808J2048j6471
21256C429k2593N671J1755k479n268P545N923m424j0355r145p40J014L894R764
21242f009K264M926J152o057M458j0800L380m11k151K400j1970M257L411k401
$$ plain form
21338 11781 1474 -3534 -8795 -24068 -32273 -23768 -21518 -10705 -14559 -17516 -10381 -6065 3037 4723
21324 4723 -4904 -6405 3343 12116 27457 18690 2016 -15420 -1970 17992 19920 19133 21457 23581
21310 23581 15779 11730 6621 1469 -11933 -18355 -12598 -2486 -12168 -12579 -10779 -20704 -12626 -2730
21296 -2730 1554 8717 8435 -2235 -5922 -8795 -16799 -7172 -44 5205 2772 4039 10286 21676
21282 21676 17835 7799 6324 -5524 -18284 -19511 -22185 -25742 -15417 -3207 -4459 254 6762
21269 6762 -3979 -2339 6397 10768 8849 -578 3304 -1234 -11308 -5956 7852 19900 3429
21256 3429 -19164 -13493 -1738 -4217 -9485 -1940 3983 -441 -10796 -19941 -20681 -19667 -15773 -6009
21242 -6009 -3745 1181 2333 -3724 734 -10066 -6686 -7097 -9248 -6848 -18818 -14561 -11150 -13551
21228a3551j20j6033j625J1812J3152q559n144J4191J4882P264k847j2672j6036
21215a5286q952j653P065N832m95J2033J728P79m266M494m241n928J367r968l108
21200b0599o495Q471J0496J7061l460j0754M878R487J5250j0094j3719R734n036
21187E220M285K747m913o583L996j006q957j1928J5534K0861J2782j5636j6334
21174F8K921j2814m823M654M033R603J8068N641l220m845m05K808j1305J318j940
21159I762M819m58m795j3591j0670J0761p835n783O415M225M417L296J2024Q403
21145B0990L628l93j2012k4662p666J6414K394L257P532j0366p444O281J2470
21132A0423J4578M388j0200j3796r657p176M526P843K22o263J1757P238n797p728
$$ plain form
21228 -13551 -13671 -29704 -31329 -19517 -6365 -14924 -20068 -5877 9005 16269 13422 750 -15286
21215 -15286 -24238 -25891 -18826 -12994 -13489 -1456 272 1051 -3215 1279 -2962 -8890 -7523 -17491 -20599
21200 -20599 -27094 -18623 -8127 8934 5474 -5280 -402 9085 24335 14241 522 10256 5220
21187 5220 9505 12252 7339 756 4752 3746 -5211 -17139 -1605 19256 32038 16402 68
21174 68 2989 -9825 -14648 -9994 -5961 3642 21710 27351 24131 19286 18881 21689 10384 11702 9762
21159 9762 14581 14123 9328 -4263 -14933 -4172 -12007 -17790 -11375 -7150 -2733 563 12587 20990
21145 20990 24618 24225 12213 -12449 -20115 -3701 -1307 1950 9482 -884 -8328 -2047 10423
21132 10423 25001 29389 19189 5393 -4264 -11440 -6914 929 1151 -5112 6645 13883 8086 358
21118C58j0444K403m459R47J0336L997R514j062j4182k462J1484m41j7430m795
21104a6236K1145J0668j4480j1938m975R174L7p747k083n381J540l94O905J1704
21090b061n500K438R34L416O473j1730J2090O451N709o030J351j1673j5406l140
21076a6678J5556o394p043j0096m958R208Q368J2044N991K547j8587j1266j196
21063b2504J0940J6618R263j895j1397j5883l380o30K115N969M275j642n016p99
21049a3966r402N414K492M859K936L562L361Q273K989r198j6077r690J631J1208
21035a1608J4221j518j1734n705J098k504J467j405K0335O910k277o089j3325
21022a2134k0562M82J2361J1072P470n646j618j9387k294J1117M900M574J0207
$$ plain form
21118 358 -10086 -7683 -12142 -11195 -859 3138 12652 11590 -2592 -5054 6430 5989 -11441 -16236
21104 -16236 4909 15577 1097 -10841 -15816 -6642 -6605 -14352 -16435 -21816 -20276 -20670 -13765 -2061
21090 -2061 -7561 -5123 -4189 -773 5700 -6030 6060 12511 18220 12190 13541 1868 -13538 -16678
21076 -16678 -1122 -7516 -14559 -24655 -29613 -20405 -12037 7 5998 8545 -10042 -21308 -22504
21063 -22504 -11564 5054 14317 12422 1025 -14858 -18238 -18868 -16753 -10784 -6509 -8151 -13167 -13966
21049 -13966 -23368 -17954 -15462 -10603 -7667 -4105 -744 7529 10518 1320 -14757 -24447 -22816 -11608
21035 -11608 2613 1095 -10639 -16344 -15246 -17750 -16283 -17688 2647 9557 7280 1191 -12134
21022 -12134 -32696 -32214 -19853 -8781 -1311 -6957 -8575 -27962 -30256 -19139 -14239 -9665 542
21009E42K08p849j249j148M86r737Q143R220N048J2971o91j4575r377L00J0701
20994B993k639m671K757n866l423K386l154L218l348J4442K288j4282q026N97
20980a6728K047r800J0693J3029J485o641J953p156J632j1837m234J1197P611
20967f749m802j6101k080J1964O275J881j906n689p657j1159J950K4146J3727
20954C800l610q897j2246k115L993Q159K1899Q74j2053r308l088Q843m604j226
20940i579K640O344K123j0324n577J5670J8143L365j0011j5793q969M471R399
20927A902L131j1319N092O176l188j2236j9433L656o31K54J2279R132k48J1912
20913F479J3534k202j4976p330l406j0986J6285K122L252j1880p886n651K283
$$ plain form
21009 542 750 -7099 -8348 -9496 -9010 -18747 -10604 -1384 3664 16635 15944 1369 -8008 -7708 2993
20994 2993 354 -4317 -1560 -7426 -10849 -8463 -11617 -8399 -11747 2695 4983 -9299 -17325 -16728
20980 -16728 -14681 -24481 -13788 -759 726 -5915 -3962 -11118 -9486 -21323 -25557 -14360 -6749
20967 -6749 -11551 -27652 -29732 -17768 -11493 -9612 -11518 -17207 -24864 -36023 -34073 -9927 3800
20954 3800 190 -8707 -20953 -23068 -19075 -10916 10983 11857 -196 -9504 -12592 -3749 -8353 -9579
20940 -9579 -6939 -595 1528 -8796 -14373 1297 19440 22805 12794 -2999 -11968 -7497 1902
20927 1902 5033 -6286 -1194 4982 1794 -10442 -29875 -26219 -26850 -26596 -14317 -5185 -5433 6479
20913 6479 20013 17811 2835 -4495 -7901 -18887 -2602 -480 2772 -9108 -16994 -22645 -20362
20900b0362P82J9064J2432m058n644r645p278j388n147J175J236R082J4908k335
20886B822m814P629N634J110q591j3361j513R442L822n423o627K487o686P901
20872f168M587n835l972j044M689r345p137K046r79r692j832K919J1586Q657o730
20857a8250J3914J6815q050j4206j1760M633J4743P117k260o548J089O52J5529
20844A3418N049j577r246j003Q996J960j4151j6234J595M071O168k0860j770Q258
20830a5326j0199L422J3612N649k930J566p381n945J991J6422n755j8883J741
20817b2016K1401Q41r134q675k750J0984N602J3833J1350j4042j0848o318n391
20804a5163J2368K2910J800n020M341Q382p06r443p769M030o542q887j4066l16
$$ plain form
20900 -20362 -19580 -516 11916 7858 2214 -7431 -14709 -16097 -21244 -20069 -18833 -9751 5157 2822
20886 2822 -1992 5637 11271 12381 3790 -9571 -11084 -1642 2180 -3243 -9870 -7383 -14069 -6168
20872 -6168 -1581 -7416 -11388 -12432 -7743 -17088 -24225 -22179 -23158 -32850 -34682 -31763 -20177 -11520 -18250
20857 -18250 -4336 12479 4429 -9777 -21537 -16904 -2161 4956 2696 -3852 -2763 -2111 13418
20844 13418 18467 16890 7644 6641 15637 17597 3446 -12788 -11193 -7122 -954 -21814 -23584 -15326
20830 -15326 -25525 -22103 -8491 -2842 -5772 -4206 -11587 -17532 -15541 881 -4874 -23757 -22016
20817 -22016 -615 226 -8908 -17583 -20333 -9349 -3747 10086 21436 7394 -3454 -9772 -15163
20804 -15163 -2795 20115 21915 16895 21236 29618 28912 19469 11700 15730 9188 301 -13765 -14081
20790a4081M474k727k800O376J2298L220l09p944m808L492L203l837n039l428
20776a1910Q969j33l274k881K418m10M028j3464j2248l571P509J3533k199j804
20762a5437p8J012j33j5991m402J5143p38j652J671j032o432L351M091L01K214
20747a8112R026m216n994k321o465R250J6131N954Q975j0025p910K097j0677j0236
20733b4523J9687Q903J021q326m88j0734P844J9857J4600l982q464j9804l499
20720g908J5585R015p244j1982l062J1951l465K058J6741K160J0065l975r186
20707B0753K913l946n411r124n56M481j134r34j1808j4707N309J2877P127r155
20693c315m509J3980r346o825J1466o673Q751J4066j4888m419N236j4210l61K247
$$ plain form
20790 -14081 -9607 -12334 -15134 -8758 3540 6760 6451 -1493 -6301 -2809 394 -3443 -8482 -11910
20776 -11910 -2941 -3074 -6348 -9229 -6811 -7221 -3193 -16657 -28905 -32476 -24967 -11434 -13633 -15437
20762 -15437 -15515 -14503 -14636 -30627 -35029 -19886 -20624 -22276 -20605 -21637 -28069 -24718 -20627 -20326 -18112
20747 -18112 -9086 -13302 -19296 -21617 -28082 -18832 -2701 3253 12228 2203 -5707 -3610 -14287 -24523
20733 -24523 -4836 4067 5088 -3238 -3726 -14460 -6616 13241 27841 23859 15395 -4409 -7908
20720 -7908 7677 16692 9448 -2534 -5596 6355 2890 4948 21689 23849 33914 29939 20753
20707 20753 23666 19720 14309 5185 4629 9110 7976 7042 -4766 -19473 -14164 -1287 5840 -3315
20693 -3315 -7824 6156 -3190 -10015 1451 -5222 3529 17595 2707 -1712 3524 -10686 -11047 -8800
20679h800j1185j0742O72P336N244Q693J275l820j2R273P059O603K308q322o496
20664i14j0382Q653J3088j4009M125K605m549J4908L570j2973j9244L600M7p72
20650a2247n758j1924j830q53L399K1563R045k401Q855k456p345o774j524O516
20636c734J306m086J058O791r69R97K650j3846m933J0154K30j0658m488O146J6070
20621B688J975J798j4008j468J3028L557j09l263L330j002p065R364l336K639
20607H128m905m278j3758l839Q285J2050j398k809J1795O897L504l268j0993j4072
20593h661o74O037M16R779L074j2128j1664p874O389M76r021r541M64N620J3181
20578a4127J400R695J8266k632j6825j219k0379M291K044R374N380n831M26M204
$$ plain form
20679 -8800 -19985 -30727 -30055 -22719 -17475 -8782 -7507 -11327 -11339 -2066 4993 11596 13904 5582 -914
20664 -914 -11296 -2643 10445 -3564 561 3166 -1383 13525 17095 4122 -15122 -11522 -11475 -12247
20650 -12247 -18005 -29929 -31759 -32612 -29213 -7650 1395 -1006 7849 5393 -1952 -8726 -10250 -3734
20636 -3734 -2428 -6514 -5456 1335 366 1363 4013 -9833 -14766 -4612 -4382 -15040 -19528 -13382 2688
20621 2688 4663 6461 -7547 -9015 4013 7570 7461 4198 7528 6526 -539 8825 5489 8128
20607 8128 3223 -1055 -14813 -18652 -10367 1683 285 -2524 9271 16168 19672 16404 5411 -8661
20593 -8661 -9335 -3298 -2882 6897 9971 -2157 -13821 -21695 -15306 -14830 -23851 -33392 -32928 -27308 -14127
20578 -14127 -12727 -3032 15234 12602 -4223 -5442 -25821 -21530 -19486 -10112 -4732 -10563 -10137 -5933
20564e933J0129O201q256k49r011P516K602J0465q780j5279m117J5115m29M504
20550D478M171j4801m602J0772Q125q265J933N50J3390Q593j522j5560q367m049
20536e154L852K630k385j155l789O819n306M415n93L347Q49M174n557j10q130
20521f093j801l390P84J916O895J4257J2403j4502m356k01J947o635j0343K648
20507f471M701M657l492Q815L831L17j2482r216o251J507M716k995J9341O331
20493A3309r118J7557q591r063P894K122m498R514Q711j5607j9804o39O812q969
20479a0370m682j906Q233m576O44m406K02K068m476L190R685Q016j2025j1132
20465b1535R42J4380j288j3331K771J2590L253j0293M342r423pm638j1677O627
$$ plain form
20564 -5933 4196 10397 2141 1892 -7119 397 2999 13464 4684 -10595 -14712 403 -26 4478
20550 4478 8649 -6152 -10754 18 8143 -122 1811 2361 15751 24344 22822 7262 -1105 -5154
20536 -5154 -1302 1328 -1057 -2212 -6001 818 -4488 -73 -666 2681 3530 7704 2147 2037 -6093
20521 -6093 -7894 -11284 -10500 -8584 -1689 12568 24971 10469 6113 5912 7859 1224 -9119 -6471
20507 -6471 -1770 2887 -605 8210 12041 12358 -124 -9340 -15591 -14084 -9368 -12363 6978 13309
20493 13309 4191 21748 13157 4094 11988 14110 9612 19126 27837 12230 -7574 -8213 -1401 -10370
20479 -10370 -15052 -16958 -8725 -13301 -12657 -17063 -16861 -14793 -19269 -16079 -6394 1622 -10403 -21535
20465 -21535 -20593 -6213 -7501 -20832 -18061 -5471 -2218 -12511 -8169 -17592 -17599 -22237 -33914 -27287
20451b7287K985M472r672j1788M408J8506o09j3668J3306J423J0756J5793o164
20438B461j7178j7131J5582R073o872k39q056K83j983K282P170Q484Q124J3239
20424A5239j1310K082L005N868l935j8432n777J2172p62J505L566p358k743J3364
20410F484Q717o444o866j2849M818O157n875J289p741K250o809M148Q605J2124
20396H008k871q488n634O348j1897l59K0888q062n448L739K4611P143q44j56m024
20381B2954J941j4469j2783j476j9682r534K4638R304n51q707K0407P966p249
20368A2759m773K0435N654n841k0732j7843k0192J0976L575o078j0469K092K744
20355b7693j0230p997R855K2007L24j5828q266K927q96J6539N396O734K5343N153
$$ plain form
20451 -27287 -24302 -19830 -29502 -41290 -36882 -18376 -18985 -32653 -19347 -17924 -7168 8625 2461
20438 2461 -14717 -31848 -16266 -7193 -14065 -14304 -22360 -22077 -24060 -21778 -14608 -6124 2000 15239
20424 15239 3929 6011 9016 14884 10949 -7483 -13260 -1088 -1850 -345 3221 -4137 -6880 6484
20410 6484 15201 8757 1891 -10958 -6140 17 -5858 -4569 -12310 -10060 -16869 -12721 -4116 8008
20396 8008 5137 -3351 -8985 -2637 -14534 -14893 5995 -2067 -7515 -3776 20835 27978 27134 26978 22954
20381 22954 24895 10426 -2357 -3833 -23515 -33049 -8411 893 342 -8365 12042 20008 12759
20368 12759 7986 28421 34075 28234 7502 -10341 -30533 -19557 -15982 -22060 -32529 -30437 -27693
20355 -27693 -37923 -45920 -36065 -14058 -13734 -29562 -37828 -34901 -35797 -19258 -13862 -7128 18215 23368
20341B3368j7487j0121l510R592l17q891j709k113j2336O440J2369m557q415L120
20327a4567j508n217j0107O123J4701K517m412K920n842L294j573J083P26J0764
20313a098J659n556j163P154J1629k238k065P398O870N114p624j2309M933n394
20299G310j220k086p256J1377Q526l355r807j9388J479O028M358k254m24O991
20285B79j347r553l794J232j486L290j838R342K359K063N811K290J961l058p431
20270A20n378r829o603o968p346J0728J0696L104n988p85M690N510P190q290P126
20255b023L731o147r159R696k568o541N241P001j0725m891J0453J8176Q916j5703
20241E457j4151L753K436m688n632q43R57Q165k239q177P533J2861n541r717P14
$$ plain form
20341 23368 5881 -4240 -7750 1842 1525 -7366 -9075 -11188 -23524 -17084 -4715 -9272 -17687 -14567
20327 -14567 -16075 -21292 -31399 -25276 -10575 -8058 -12470 -9550 -15392 -12098 -13671 -12588 -11862 -1098
20313 -1098 561 -4995 -6158 996 12625 10387 8322 15720 22590 27704 20080 7771 12704 7310
20299 7310 6090 4004 -3252 8125 16651 13296 3489 -15899 -14420 -8392 -4034 -6288 -6712 279
20285 279 -1068 -10621 -14415 -13183 -14669 -11379 -13217 -3875 -1516 547 6358 8648 10609 7551 120
20270 120 -5258 -15087 -21690 -28658 -36004 -25276 -14580 -11476 -17464 -18249 -13559 -8049 -859 -9149 -2023
20255 -2023 1708 -4439 -13598 -3902 -6470 -13011 -7770 -769 -11494 -16385 -5932 12244 21160 5457
20241 5457 -8694 -4941 -2505 -7193 -12825 -13668 -12711 -4546 -6785 -14962 -7429 5432 -109 -9826 -9112
20226i112m071l084J3243J4479Q02k81K776M18l209K714R840j3092o811n121n447
20211e956L292J0465n910n51j045M958P392j810r816m538K11r709l220O603J180
20196h454l197M154K921O603L950Q902J878p801J0539j244j9809j3794N93m369
20182a9128K4089J2130m6k991n973m805J0799q9p598j0494K297j123N382N601
20168H051j6678O73m759J260p6P69J699p878o70P305l57O962L335P308J641L359
20152A1944R871K246j1504j5094q379R014R00j447M443K624j451p295N863J3165
20138A4900j492r146l542J1658P557k1809j9446Q57J9203O232L058m627M421O190
20124A4014J2120j3344k0630j599R385n763k09q279P552J6053J736j3483q812
$$ plain form
20226 -9112 -13183 -16267 -3024 11455 12257 11976 14752 15170 11961 14675 24515 11423 4612 -509 -5956
20211 -5956 -2664 7801 1891 1340 295 5253 12645 10835 1019 -3519 -3308 -13017 -16237 -9634 -8454
20196 -8454 -11651 -7497 -4576 2027 5977 14879 16757 8956 19495 18251 -1558 -15352 -14759 -19128
20182 -19128 4961 17091 17045 14054 8081 3276 14075 13986 6388 -4106 -1809 -2932 2450 8051
20168 8051 -8627 -7954 -12713 -11453 -11529 -10760 -9061 -16939 -17609 -10304 -10661 -3699 -364 6944 8585 11944
20152 11944 21815 24061 12557 -2537 -10916 -1902 -1002 -2449 1994 4618 3167 -4128 1735 14900
20138 14900 13408 4262 720 12378 19935 -1874 -21320 -20463 -1260 4972 8030 3403 7824 14014
20124 14014 26134 12790 -7840 -9439 -54 -5817 -6026 -14305 -6753 9300 11036 -2447 -11259
20111a1259p07J3237K742p349j249J2598k639j0796k039Q274M946O747o378j710
20097D418q97L571o144j2048m079l183k127J6964J3798k342r270j3179K702L54
20083a1462J0511P227P338n696j5491Q926m18K85P650o846j1747K085J3666j0236
20069d208j6937R130J5133l342q369P513J332j0291k225L698j4236q967L637J613
20055b6519N111P070J5998M483j982R345p321j1836j4999J1011j816M535p620
20042a4540j5307K198j8198o956J5644J0506J8041K958N334p709R295J1483O02
20029A3351M196J792k0355J233j537L100l802o754L647M93P009O31q551j8510
20015b4057N1P163R279j451L919Q956M080J0608p129k3195j845m59j3637P805
$$ plain form
20111 -11259 -11966 1271 4013 -3336 -4585 8013 5374 -5422 -7461 813 5759 12506 6128 4418
20097 4418 3521 7092 948 -11100 -15179 -18362 -20489 -3525 10273 7931 -1339 -14518 -11816 -11462
20083 -11462 -951 6276 13614 7918 -7573 1353 935 1220 8870 2024 -9723 -7638 6028 -4208
20069 -4208 -21145 -12015 3118 -224 -8593 -1080 252 -10039 -12264 -8566 -22802 -31769 -28132 -26519
20055 -26519 -21408 -14338 1660 6143 4161 13506 6185 -5651 -20650 -9639 -11455 -6920 -14540
20042 -14540 -29847 -27649 -45847 -52803 -37159 -26653 -8612 -5654 -320 -8029 1266 12749 13351
20029 13351 17547 19339 -1016 217 -1320 1780 -2022 -8776 -5129 -4636 2373 3004 -5547 -24057
20015 -24057 -24006 -16843 -7564 -9015 -5096 3860 7940 18548 11419 -11776 -13621 -14080 -27717 -19912
20001a9912L003m325K739J3365J6048k941j1662k630R960O580k413L006n969m040
19987H09n555j4333J1542M885j4460q259J1161J5509M17l658k245j2518n631K081
19973b0255J8224M373r172o012N016N708J767m129l998O323J2553n553j4260r999
19959a9414N729J8375j268o188N312n140r124J1791J2988K74k34j7554K107J3447
19945A1101J073j2726n366R788J7984O977j1715j0074p417j903r025m856P218
19932h941j009m829J2195J1560Q899J963l767q528q855M415m329q37K315L693
19918C945J5484r707j6923k428m704R939J906j9896q873J927J4704l010m09J5238
19904b807Q539k312o865m095P181k640p453q857K843J5700J395j0230N467L26
$$ plain form
20001 -19912 -16909 -21234 -18495 -5130 10918 7977 -3685 -6315 3645 10225 7812 10818 4849 809
19987 809 -4746 -19079 -7537 -2652 -17112 -25371 -14210 1299 1716 -1942 -4187 -16705 -22336 -20255
19973 -20255 -2031 2342 -6830 -12842 -7826 -2118 -351 -4480 -8478 -2155 10398 4845 -9415 -19414
19959 -19414 -13685 4690 3422 -2766 2546 -2594 -11718 73 13061 13335 13101 -4453 -2346 11101
19945 11101 12174 -552 -5918 3870 21854 28831 17116 7042 -375 -2278 -11303 -16159 -8941
19932 -8941 -9950 -14779 -2584 8976 17875 19838 16071 7543 -1312 3103 -1226 -2063 252 3945
19918 3945 19429 9722 -7201 -9629 -14333 -4394 -2488 -22384 -31257 -29330 -14626 -17636 -18045 -2807
19904 -2807 5732 3420 -3445 -7540 -359 -2999 -10452 -19309 -16466 -766 629 -9601 -4134 -3808
19890c808j3305j2013r246J3446O282J991O813q722j253K132k705J614P123N782
19876e869O475j3710M527n459J1180r8p944N36j5107j1947J3613K4389q555j6161
19862b4130j6044J0178J7230o749O396J3165n146q858J1585J3369O272n752j0964
19849E52r14j735K175k720j382j063k686L404r332r609J1706k780o760k895o259
19834c0298P724J6780J8224l453m128K932l057j4053j1062J0755L12j0592J81
19821a9735L860Q30N333L57j4762l929j081J3059R956J559M170M550q537q045
19807a2415N461K0105J1640K22J3268m921j6154l83m041m912l7j0539Q642O336
19793A2272J081l803n384J335o760K0081O304k268j756o774j24q018j3152j1640
$$ plain form
19890 -3808 -17113 -29126 -38372 -24926 -18644 -16653 -9840 -18562 -19815 -17683 -20388 -18774 -11651 -5869
19876 -5869 606 -13104 -8577 -14036 -2856 -2954 -10898 -10362 -25469 -37416 -23803 586 -7969 -24130
19862 -24130 -40174 -29996 -12766 -19515 -13119 46 -5100 -13958 -2373 10996 17268 11516 552
19849 552 -362 -2097 78 -2642 -4024 -5087 -7773 -4369 -13701 -23310 -11604 -14384 -21144 -24039 -30298
19834 -30298 -22574 -5794 12430 8977 4849 7781 4724 -9329 -20391 -9636 -9324 -19916 -19735
19821 -19735 -15875 -15045 -9712 -9355 -24117 -28046 -29127 -16068 -6112 -4553 -383 4167 -4370 -12415
19807 -12415 -6954 13151 24791 25013 38281 33360 17206 16823 12782 7870 7833 -2706 5936 12272
19793 12272 13353 9550 4166 5501 -1259 18822 25126 22858 21102 14328 14204 6186 -6966 -18606
19779a8606R64P110Q475O716J5105J110J1249k212r647K679j3468p73j5858j0341
19765a7497p334L820J1300J4840J282m056l702K336O833P907q366o851j092j593
19751b173j1412R588j44j878j950r389n3P773J3433J1973J1253j8651J511J216
19737A1097m944k186o63J464Q97N702J30j5765n243N330Q911O708J369M67j708
19722A1566J6362K727j7976j4264p416j5274k983N872l597J0783J6502j235k033
19709i66K603m576j8702M020Q76l109J233N228j2926J523J0125k476K650J6330
19695A833m0j2270p473P116N795m391l463J4472L701K503q178r052k077K576J2136
19680C188k435n067K691J0356K606l055q64j5529j868j795o92n505P637J5048
$$ plain form
19779 -18606 -17642 -10532 -2057 4659 19764 20874 32123 29911 20264 22943 9475 8702 -7156 -17497
19765 -17497 -24831 -21011 -9711 5129 6411 2355 -1347 989 7822 15729 7363 512 -580 -2173
19751 -2173 -13585 -3997 -4141 -6019 -7969 -17358 -17411 -9638 3795 15768 27021 8370 9881 11097
19737 11097 6153 3967 3304 4768 5665 11367 11497 -4268 -9511 -4181 4730 11438 12807 13274 11566
19722 11566 27928 30655 12679 -1585 -9001 -24275 -27258 -21386 -24983 -14200 2302 1067 -966
19709 -966 1637 -2939 -21641 -17621 -16745 -19854 -18621 -13393 -26319 -24796 -14671 -17147 -14497 1833
19695 1833 1793 -10477 -17950 -10834 -5039 -9430 -12893 1579 5280 7783 -395 -9447 -11524 -8948 3188
19680 3188 753 -4314 -1623 8733 11339 8284 7420 -8109 -9977 -11772 -12464 -17969 -10332 4716
19666D716J0423o87r824L368J649K184J3656r28q529j9790Q880R965m24k182R637
19651B2114j2821K485N432j1028q44l10J0611O966K775j5087o717N123Q760r888
19637G571j5561O433J0495K948m730r065q840O25J6806K258k2284j1187J3548
19624a0983Q442J3987j2681j1360o572Q133Q464o650O5J1953N364m527k181n705
19610d251o063q835N362k569M105J7265J2180J5617m128r262o414J465j499K803
19596A5776R343j0854j0777L891l519k06L895j5733j2307l246m37Q420q57K992
19582a3619K418J3024J7760L469r331O37n758j2545j045j0245Q861P220o500j887
19568g541J2920J0822l45k334M154j6424j8153K468J223M711N543N291j9282p486
$$ plain form
19666 4716 15139 14452 4628 7996 9645 11829 25485 24557 16028 -3762 5118 15083 14659 12477 22114
19651 22114 9293 11778 17210 6182 5338 5028 15639 22605 25380 10293 3576 8699 17459 7571
19637 7571 -7990 -1557 8938 11886 7156 -1909 -10749 -10124 6682 8940 -13344 -24531 -10983
19624 -10983 -2541 11446 -1235 -12595 -19167 -11034 -2570 -9220 -9155 2798 8162 3635 1454 -4251
19610 -4251 -10314 -19149 -13787 -16356 -12251 5014 17194 32811 28683 19421 13007 14472 12973 15776
19596 15776 25119 14265 3488 7379 3860 3654 7549 -8184 -20491 -23737 -24174 -15754 -16611 -13619
19582 -13619 -11201 1823 19583 23052 13721 14358 8600 -3945 -4990 -15235 -6374 846 -5654 -7541
19568 -7541 5379 16201 15856 13522 17676 1252 -16901 -14433 -13210 -8499 -2956 2335 -16947 -24433
19554b4433O856N11J7177J175q860m248p8O609p884m656J2906Q426r6M564l669
19539D300o938K69M940Q941k027k593p695l817M9J473k661l088j4383P474L497
19524a2259K933n97N944J1929P950r453K700K330l270K951L36m296Q848M736j1367
19509I415j6814j2732J706P98L914J2628J173O352R00o221m373j832o582k227
19495a3895M686J2909j099j059J1418r559n823p020k574J4424L389m625k340J6521
19481A5353N451r836q852m60k173n171l478j285j249m641M312J6430j380o948
19467c927j6847q79k567j0873N299M277R362J2195p149p327r571p294R613J438
19453b4250J4661o212m084n556j534O467J4665R129P602N30p39K730p229j3107
$$ plain form
19554 -24433 -17577 -17066 111 1286 -7574 -11822 -11900 -5291 -13175 -17831 -4925 3501 3405 7969 4300
19539 4300 -2638 -2369 2571 11512 9485 6892 -803 -4620 -4571 -3098 -5759 -8847 -23230 -15756 -12259
19524 -12259 -9326 -9923 -3979 7950 15900 6447 9147 11477 8207 11158 11494 7198 16046 20782 9415
19509 9415 -7399 -20131 -18425 -17627 -13713 -1085 88 6440 7340 1119 -3254 -5086 -11668 -13895
19495 -13895 -9209 3700 2601 1542 12960 3401 -2422 -9442 -12016 2408 5797 1172 -1168 15353
19481 15353 20804 10968 2116 1656 -517 -5688 -9166 -10451 -11700 -16341 -12029 4401 3021 -3927
19467 -3927 -20774 -21653 -24220 -35093 -29794 -25517 -16155 -3960 -11109 -18436 -28007 -35301 -25688 -24250
19453 -24250 -9589 -15801 -19885 -25441 -26975 -20508 -5843 3286 10888 11418 10679 13409 6180 -6927
19439f927j2234j459q36O648J3968P578J6179L786j5820j9300Q020J2758m639
19426G722o756N40r408j5549Q264L803P711P993m906n531r667J8189M406j169
19412E642p512P862K500m42p47n054L186J9918j1761j1731q155r6o70J0638P66
19397D344m838m143J8479O272j2332J1701K1759j4570p276p317o508J611J0986
19384A8168L245q685q894K153K9900K790j4565q676j0335q25o98m111j841R652
19370G278J382J834p05k988K243j7181m026O44J0487L256n672r842q873N563O545
19355a0055q280K057O451l202m996k451p21K321J3731J9355L591o947j1835l108
19341d089K5070L475o234k3828k1572M03R192J6174N172J322J682L842O329j2401
$$ plain form
19439 -6927 -19161 -20620 -21456 -14808 -840 6738 22917 26703 10883 -8417 -397 12361 7722
19426 7722 966 1506 -7902 -23451 -15187 -11384 -3673 4320 -586 -6117 -15784 2405 6811 5642
19412 5642 -1870 5992 8492 8050 7303 2249 5435 25353 13592 1861 -6294 -6390 -7060 3578 4344
19397 4344 -494 -4637 13842 20114 7782 19483 41242 26672 19396 12079 5571 7182 18168
19384 18168 21413 12728 3834 5987 35887 38677 24112 15436 5101 4276 3578 -533 -2374 7278
19370 7278 8660 10494 9789 6801 9044 -8137 -12163 -11519 -1032 2224 -3448 -13290 -22163 -16600 -10055
19355 -10055 -18335 -16278 -9827 -13029 -18025 -20476 -21197 -18876 -5145 14210 17801 10854 -981 -4089
19341 -4089 20981 24456 18222 -5606 -27178 -26775 -17583 -1409 3763 5085 6767 10609 16938 4537
19327D537n600O887r179L06J799l836p574o775N119o363J0570R061j276m99k47
19312c070O434J1163K893P662o277r935k899J1202J139l338j9232l271J066L931
19298b532K704M32n76k174k170J1481N336r859m282J479L473J1071M57r626p756
19283b542L616J3718l709j1916J989p119n661l459n35L635J434J0778j497K235
19269I67O538j1802n773N793j1855j0241N051J3563O730l372j0396l003J8600
19256H00L875p000Q32O627K330p594k969M698J0585L120k994o373j02N50P673
19241A4058j0133p170M633m962N84M934L839o091N501o444J2775R841j2960j0772
19227b367l719J1091r975j4287J5064J6949J0192j2217r572K718L121p289o260
$$ plain form
19327 4537 -1063 5824 -3355 -3049 -1250 -5086 -12660 -19435 -14316 -20679 -10109 -1048 -2324 -2823 -3070
19312 -3070 3364 14527 17420 25082 18805 8870 5971 17173 18312 14974 -4258 -7529 -6463 -2532
19298 -2532 172 604 28 -2146 -4316 7165 12501 2642 -1640 -161 3312 14383 14840 5214 -2542
19283 -2542 1074 14792 11083 -833 1156 -5963 -11624 -15083 -15618 -11983 -10549 229 -1268 967
19269 967 7505 -4297 -10070 -4277 -16132 -26373 -21322 -7759 -1029 -4401 -14797 -17800 800
19256 800 4675 -2325 -1493 5134 7464 -130 -3099 1599 12184 15304 12310 5937 5835 6385 14058
19241 14058 3925 -3245 1388 -3574 -2990 1944 5783 -308 5193 -1251 11524 21365 8405 -2367
19227 -2367 -6086 5005 -4970 -19257 -4193 12756 22948 10731 1159 3877 6998 -291 -6551
19214f551J1281j0445p104Q43n254L456n3j3313L721R696m834K082N177N032Q194
19199A928Q086j3041r500K581J0308M62r321j1376Q717J1696K481q608m656J7889
19185G646m537l307O952J2670J8036j5708k1622q071k651p610m383J0641J4904
19172B960J6789J3424o277j1011j1375R56K681k446r42m339k84N283m543j71J5863
19157A6568j976j0700m367L811J4527O048j421K58j0961N323M777K291o830m490
19143A2858o925j3768j5275J217O445J1494O360J401K485m631q491k262J0530
19130A438q99m569k467j583L439J2141M316p021P749J8307j0119j6600J4679N119
19116B3930k20Q852n415j5913j1878j1959R291l898J2388k108l949q35P95K006
$$ plain form
19214 -6551 4730 -5715 -12819 -11976 -17230 -13774 -13827 -27140 -23419 -13723 -18557 -16475 -11298 -6266 1928
19199 1928 10014 -3027 -12527 -9946 362 824 -8497 -19873 -11156 540 3021 -5587 -10243 7646
19185 7646 3109 -198 6754 19424 37460 21752 130 -7941 -10592 -18202 -22585 -11944 2960
19172 2960 19749 33173 26896 15885 4510 5466 8147 5701 4759 420 136 5419 876 705 16568
19157 16568 14592 3892 -475 3336 17863 23911 22490 22748 11787 17110 21887 24178 17348 12858
19143 12858 5933 -7835 -23110 -21893 -15448 -3954 2406 3807 6292 1661 -6830 -9092 1438
19130 1438 539 -4030 -6497 -8080 -4641 7500 11816 4795 12544 30851 20732 4132 18811 23930
19116 23930 23710 32562 27147 11234 -644 -12603 -3312 -7210 5178 3070 -879 -1714 -919 1087
19102A087p767J9910P159l585K921q353o839q956N996l917k927r168j4799M822
19088b4416K3830O385j1396j1094K820L859q832l243K395J7074J2300M261j2179
19075A764j6587J1189J9157m122P788j5641j1922M422J3773j127m291P419N329
19062A7151K853j0893J041J0065j8464j622J6662j6198j1111k912o137K107j2173
19049b9631p250L683J8736Q348O98R487k590r423q26m115P630J3034O45K3K955
19034A1404l707m525M104m21p764N639J3159o459J1396J692L502K668j6461j869
19020A2358P165Q99m698r375j0391O172R150k776j2901l836m702j045N261J322
19006g397N353R219j7540K261P276k253j0050k314l039o134J5908N576M040J504
$$ plain form
19102 1087 -6680 13230 20389 16804 19725 11372 4533 -4423 1573 -2344 -5271 -14439 -29238 -24416
19088 -24416 -586 5799 -5597 -16691 -13871 -10012 -18844 -22087 -19692 -2618 9682 13943 1764
19075 1764 -14823 -3634 15523 11401 19189 3548 -8374 -3952 9821 8694 4403 11822 17151
19062 17151 20004 9111 10152 20217 1753 131 16793 595 -10516 -13428 -19565 -17458 -29631
19049 -29631 -36881 -33198 -14462 -6114 -5416 4071 1481 -7942 -8768 -12883 -5253 7781 8426 8449 11404
19034 11404 7697 3172 7276 6855 -909 4730 17889 11430 22826 24518 28020 30688 14227 12358
19020 12358 19523 20422 15724 6349 -4042 2130 11280 8504 -4397 -8233 -12935 -13980 -8719 -7397
19006 -7397 -2044 7175 -10365 -8104 -828 -3081 -13131 -15445 -18484 -24618 -8710 -3134 906 2410
18992B410r121q03J8718J7896L497r523j0214j7484r90P53M234J2687L690j0862
18978D888j6769j696j6457P207K3134J4294J013j204J3795K448j4261k2824J57
18965f275J2679P556j781J0899p181j6873L552j246J0180Q632j1390k874l943
18952A935o796L997p95j217P138K969p326J3691K562p100K988J1335K018q3k33
18937B5083k5443j645J4179O769O960l746j016K919k1849J478K190l348j0651
18924h120p320O188R476L796J8063P250j0817q612j2212J5252J8020N123j7813
18911A8274k3802m38J9029J1665k813p22K381r856n128p761l854J1452J2828l94
18897B0861J4833P01j0557q646j3082k104J2900J143P899m853j932J2497J2821
$$ plain form
18992 2410 -6711 -7514 11204 29100 32597 23074 12860 -4624 -5614 -4861 -627 12060 15750 4888
18978 4888 -11881 -13577 -30034 -22827 307 14601 15614 14410 28205 30653 16392 -6432 -6275
18965 -6275 6404 13960 12179 23078 15897 -976 2576 1330 11510 20142 8752 5878 1935
18952 1935 -4861 -864 -1659 -2876 4262 7231 -95 13596 16158 9058 12046 23381 25399 25316 25083
18937 25083 -360 -2005 12174 18943 25903 22157 21141 24060 2211 3689 5879 2531 -8120
18924 -8120 -15440 -9252 224 4020 22083 29333 18516 9904 -2308 12944 30964 36087 18274
18911 18274 -5528 -5966 13063 24728 21915 21193 23574 13718 8590 829 -3025 8427 21255 20861
18897 20861 35694 36395 25838 17192 4110 2006 14906 16049 23948 19095 17163 29660 42481
18884D2481o8p901q618r150k502M339R269N892M690k047j5492j1679q755m186
18870c727N525k553J5556j364O621O847N32P425o94o796J7087k513o097o11M378
18855C9616q56M655m421K255K890j6162j0135J2841o350p304j0665j6259J5337
18842E442K4788N119L182j0226j096L563q452O540o116M018j306k773o97j102
18828B0884O265J9644K974n826j808K5180J7821j5999k6092j5642j6224l03P688
18815A8562M199l1p153K701K243K668o596R106P300m057N785J1826j1033j7133
18801A8387l405k616K259m144N774K797Q284l466k1763J926k541p292p366L450
18787i716l252M571J6457n623j4165P414J3834R512J3694M069j3420q044J7396
$$ plain form
18884 42481 42413 34512 25894 16744 14242 18581 27850 33742 38432 36385 20893 9214 459 -3727
18870 -3727 1798 -755 14801 13437 20058 26905 27437 34862 34168 27372 44459 41946 35849 35238 39616
18855 39616 38760 43415 38994 41249 44139 27977 17842 30683 24333 17029 6364 -9895 5442
18842 5442 30230 35349 38531 28305 27209 30772 22320 28860 22744 26762 25456 22683 21986 20884
18828 20884 27149 46793 49767 43941 42133 67313 85134 69135 43043 27401 11177 10874 18562
18815 18562 22761 22730 15577 18278 20521 23189 16593 25699 32999 28942 34727 46553 35520 18387
18801 18387 14982 12366 14625 10481 16255 19052 27336 23870 2107 4033 1492 -5800 -13166 -9716
18787 -9716 -12968 -8397 8060 2437 -11728 -4314 9520 19032 32726 36795 23375 15331 32727
18774C2727j974r594J781K3465K8890K7131J9135J0006P89l0142l1029j0180l745
18761E7260j7133j5473N049L884O662m394p688Q641l158o00J1135M313j6814j5778
18747A5906J1128P425m807m754m106P760r157K212R07R641J514K138P937M536
18733D8280N316r528j6179p344Q382J7594J5954j7354N083J2242r303q407l994
18720D0742n008M684q480m964J477J157L364j807M47K136K081k482k783K788j6093
18705A7259P36J4967J0064J060q406J2303P63N466K441J0780m35m823K882J7454
18691H2511J9108J9488L5671K5479J9840R351J497l742L361k675j2316j2381K374
18678A87566J9006O519M352J6637N534J3705R106J8759k423K680l153N528O987
$$ plain form
18774 32727 30753 21159 22940 46405 75295 102426 121561 131567 132356 102214 71185 61005 57260
18761 57260 40127 24654 29703 33587 40249 35855 28167 36808 33650 33050 44185 48498 31684 15906
18747 15906 27034 34459 29652 24898 20792 28552 19395 21607 22514 32155 33669 35807 43744 48280
18733 48280 53596 44068 27889 20545 28927 46521 62475 45121 50204 62446 53143 44736 40742
18720 40742 35734 40418 31938 26974 28451 29608 32972 31165 31612 33748 35829 33347 30564 33352 17259
18705 17259 17995 32962 43026 44086 35680 47983 48746 54212 56653 67433 66998 62175 65057 82511
18691 82511 101619 121107 156778 182257 202097 211448 212945 209203 212564 209889 197573 185192 187566
18678 187566 206572 213091 217443 234080 239614 253319 262425 281184 278761 281441 278288 283816 290803
18665B90803L02q595L558R566j0182J0172J6415J1991j63J163p962j437J402L548
18651C20581j5176k3783m405j7564k8529j5827j3269n10J6419O122o289l45J4379
18638B31804K3593K7657L1231K2593K0970K3266O045M216m026Q194J6593l13n776
18625D06047j2197j5740m953j8002j8456j6737q756j005J9863o478j8712j108
18613C03766M182Q143J6889J6638M262L764J2689K593L729j2417j7884j89J848
18600C48013j9757k2988j8994j1188k7274l4110k021j4993j8413j7969j5049k0223
18588A25034q202j640M95L827j3733p960m627l894k24n799l649m568r149j9348
18574D6563l736N354o517J1840P372M234k578j3188j4456p94J4221J1043O04j677
$$ plain form
18665 290803 291105 282510 286068 295634 285452 295624 312039 324030 323867 325030 317068 315631 317033 320581
18651 320581 305405 281622 277217 259653 231124 215297 202028 201518 217937 224059 217770 217425 231804
18638 231804 255397 283054 314285 336878 357848 381114 387159 391375 387349 395543 412136 411823 406047
18625 406047 393850 378110 373157 355155 336699 319962 311206 310201 330064 323586 304874 303766
18613 303766 307948 316091 332980 349618 353880 357644 370333 372926 376655 364238 346354 346165 348013
18600 348013 328256 305268 286274 275086 247812 213702 211681 196688 178275 160306 145257 125034
18588 125034 116832 115192 115687 119514 105781 97821 93194 89300 89076 83277 79628 75060 65911 46563
18574 46563 42827 48181 41664 53504 60876 65110 62532 49344 34888 34094 48315 59358 59962 58285
18560E8285O358j266L091l525j2337p28m387M052R334K458j640n960m762P142
18546E6115N013K0091p901j3169L612J5453J6524J8811J3551P042M82j6868n65
18533A18191r93L407O495j3160j9932p531l249o646N574O891k562K135p550N440
18519H6510n811l256M592m052q530p074k932o697l265J6744k105o969J59L165
18505F0479J6225j60q482j3716J0452J0765J1557p476m650Q253M056O909O464
18492A00676M561J6231J3440J7044K604J4559P865L339K0147J4000J984j3215
18480B03235k0451j1996j0527j4402m898j0318J657M630J0984J0469n006r520
18468A43857Q886n823q398j3051m285o73r669l949O080j0611q840j3121j0350
$$ plain form
18560 58285 64643 63377 66468 62943 50606 49878 45491 49543 58877 61335 59695 53735 48973 56115
18546 56115 61128 81219 73318 60149 63761 79214 95738 114549 128100 135142 135624 118756 118191
18533 118191 117198 120605 127100 113940 94008 86477 83228 76582 82156 89047 86485 88620 81070 86510
18519 86510 80699 77443 82035 77983 69453 62379 59447 52750 49485 66229 64124 57155 57314 60479
18505 60479 76704 76544 68062 54346 64798 75563 87120 79644 74994 83247 87303 94212 100676
18492 100676 105237 121468 134908 151952 154556 169115 176980 180319 200466 214466 216450 203235
18480 203235 182784 170788 160261 145859 140961 130643 132300 136930 147914 158383 153377 143857
18468 143857 152743 146920 138522 125471 121186 120513 110844 106895 112975 102364 93524 80403 70053
18455G0053k7665j0350k1000j0544J3749J2242m189N296l238o874K393o417R13
18442A4369L3153K3536j0247N088P108K195q281j4453n850r261J2435J786j3333
18429C8245n188K3326P442m730j6918J025K3584J8280P536J873J836k551L792
18416I7552J251m061j1054q404J0419L939R201J0908K0223J198n12J2750K5648
18403A69058K1994J3225K5213O927R423J8428O078j5950k3529k1252j8700j9257
18391A71658r435j3104j5486O40n010k926P905l099j3588j9539p499N017m949
18378I0585j1247m331J663J090j829j041J1851R164p129o847K2776M837k457J3760
18364A20845J6284J1447L480J1803J2092K0312M940q885p656l867j4828j4727
$$ plain form
18455 70053 42388 32038 11038 494 14243 26485 22296 27592 24354 17480 19873 13456 14369
18442 14369 47522 71058 60811 65899 73007 75202 66921 52468 46618 37357 49792 51578 38245
18429 38245 33057 56383 63825 59095 42177 43202 66786 85066 92602 94475 96311 93760 97552
18416 97552 98803 94742 83688 75284 85703 89642 98843 109751 129974 131172 130660 143410 169058
18403 169058 191052 204277 229490 236417 245840 264268 270346 254396 230867 209615 190915 171658
18391 171658 162223 149119 133633 134273 129263 126337 134242 131143 117555 98016 90517 95534 90585
18378 90585 79338 75007 76670 77760 75931 74890 86741 95905 88776 81929 104705 109542 107085 120845
18364 120845 137129 148576 152056 163859 175951 196263 201203 192318 184662 180795 165967 151240
18352A51240j4082j2802p166p312l968j3668p006q01q58k2009l3618k9122k0109
18339b1281m7299n7139m7406k4116m510K2132N1371O0738N6735L8590J3895J6171
18327E7881K4793K8204K1571K2928L3597K7054K7229O748m57l297j3517j09p087
18314B25538o930R846n584J2553R467l261J69j4160j5360j8179k6828l042r167
18301A55062j0925q092j1579n115J827M95o675q567k257p035k067j0290j6025
18288F8757J4636J5811p585j146Q294O350r395j4150p406K2891K4147N1158O6191
18275B38553O9300P5370N3446K6546J3470J8164k105J4919M2540N5956K9523J1532
18263F47214L845K5738J6679M686J956q709j8260j7219k186r911n899n043k872
$$ plain form
18352 151240 137158 124356 117190 109878 105910 92242 85236 84435 83577 61568 27950 -1172 -21281
18339 -21281 -68580 -125719 -173125 -197241 -201751 -179619 -128248 -67510 -10775 27815 41710 57881
18327 57881 82674 110878 132449 155377 188974 216028 243257 250005 249548 246251 232734 232625 225538
18314 225538 218608 228454 222870 235423 244890 241629 241798 227638 212278 194099 167271 164229 155062
18301 155062 144137 136045 124466 119351 121178 121673 114998 106431 104174 97139 95072 84782 68757
18288 68757 83393 99204 91619 90473 98767 105117 95722 81572 74166 97057 121204 172362 238553
18275 238553 307853 383223 436669 463215 476685 494849 492744 507663 550203 606159 635682 647214
18263 647214 651059 676797 693476 698162 700118 691409 673149 655930 653744 643833 637934 632891 630019
18250F30019k4826j8296n77m676K3544J1176K5310Q853j722l726K0423J4243J1869
18237F91614J3224j2403n196P907K0007J3578N651M219L4252K5490K1502J6457
18225H36302L1491L0242M3452L3136L6596K4258L4872L0304N7375P1712O5384
18214A295124R3803Q9046R6532J26828J81126K44074L46867M96276O96192Q56037
18204D521905Q58131O65518L03364p4900l77092m18924k08672N467Q4917k368
18194E357346j70969l35908m42353l56010k08502n0665R3341J87545K70770L27900
18184D672495L28584K90852K12545R7866R654l7772k5523M9805J60895K82639
18174F042040M00966N29718O78252Q25846R52015R70677R61653R24047R36378
$$ plain form
18250 630019 605193 586897 586320 581644 605188 616364 641674 650527 648805 645079 665502 679745 691614
18237 691614 704838 692435 687239 695146 715153 728731 734382 738601 772853 798343 819845 836302
18225 836302 867793 898035 941487 974623 1011219 1035477 1070349 1100653 1158028 1229740 1295124
18214 1295124 1388927 1477973 1574505 1701333 1882459 2126533 2473400 2969676 3665868 4521905
18204 4521905 5380036 6045554 6348918 6274018 5896926 5478002 5269330 5274797 5359714 5357346
18194 5357346 5186377 4850469 4408116 4052106 3843604 3792939 3886280 4073825 4344595 4672495
18184 4672495 5001079 5291931 5504476 5602342 5611996 5574224 5548701 5598506 5759401 6042040
18174 6042040 6443006 6972724 7650976 8476822 9428837 10399514 11361167 12285214 13221592
18165A3221592J046511J275046J549940J889178K267081K686821L080070L553726
18157C0569965M282657N416763P441018J1135091J7037402K5523473L6359596
18150A37765965M6980004N2621078M9351417L5715516J3746806j0855256l2301915
18143B93023615m3969037m6034436m1626893l2962378k4667040j7745016j2348754
18136G3670061q687334o296767m837951m003729l592155l387047l136495k778709
18128C6949874k396897k059524j744864j534899j454097j431352j405349j356082
18120B3566810j220378j019843p64392m83694k20291K1193L70761R95565K238815
18111B3484546L820120L544424J360030k35837k959565n820731m174489k392179
$$ plain form
18165 13221592 14268103 15543149 17093089 18982267 21249348 23936169 27016239 30569965
18157 30569965 34852622 40269385 47710403 58845494 75882896 101406369 137765965
18150 137765965 184745969 237367047 286718464 322433980 336180786 325325530 293023615
18143 293023615 249054578 203020142 161393249 128430871 103763831 86018815 73670061
18136 73670061 64982727 58685960 53848009 49844280 46252125 42865078 39728583 36949874
18128 36949874 34552977 32493453 30748589 29213690 27759593 26328241 24922892 23566810
18120 23566810 22346432 21326589 20562197 20078503 19858212 19879405 20250166 21245731 23484546
18111 23484546 27304666 30849090 32209120 31973283 29013718 23192987 19018498 16626319
18103A6626319j491474r70899o07439l25826j78781j60905j84811k92830l59866
18094A2053488k27743l5127J33598J61685k131l23163p14057r21292r49204q55498
18084H320556o63078n23538m26427l62843l08662k73542k49072k24416k13503
18075E075475j88662j67412j63246j59383j58213j37633j36198j46491j22624
18066C695613j23440j37319j59212j64945j63251j56892j74065j45721j36578
18057B334190j36189j25561j32971j11889r8776j04451p7619p0443o0460o8400
18047A347431p2228n8346n3813n0758m3415l9861k5335l6489m5409l5667n5866
18036H30244n0275l7756m1859m6883m4800k1272r406r365j5982N773J6978P00
$$ plain form
18103 16626319 15134845 14163946 13556507 13230681 13051900 12890995 12706184 12413354 12053488
18094 12053488 11825745 11790618 11924216 12085901 12083770 11760607 11046550 10125258 9176054 8320556
18084 8320556 7657478 7133940 6707513 6344670 6036008 5762466 5513394 5288978 5075475
18075 5075475 4886813 4719401 4556155 4396772 4238559 4100926 3964728 3818237 3695613
18066 3695613 3572173 3434854 3275642 3110697 2947446 2790554 2616489 2470768 2334190
18057 2334190 2198001 2072440 1939469 1827580 1728804 1624353 1546734 1476291 1415831 1347431
18047 1347431 1275203 1216857 1163044 1112286 1068871 1029010 1003675 967186 921777 886110 830244
18036 830244 779969 742213 700354 653471 608671 587399 577993 568628 552646 558419 575397 576097
18024E76097Q758K1567J8622L057M822K0189K6101K4811L2051K3888m501j9191
18012G36271j0400q965j8841O550M811K324l479j255j5111r144j1030j2450m929
17999F54352n347p525k4602o647j0091j765j55j545j4320o988k0850j2272k6581
17986E15664l4767j0411j5236j8228q817j468l228p643j5414k7831n100k0373
17974C47148k1260m780M909j734J4416J3546J2734Q611O151K5541J4346K2319
17962D41947K8695M7811N1261O9181M4122L8512Q253l0036l9378n2271m4510m9811
17950E13776l2805j7135j1008q714m263Q724M358k340j5804k7450L015N989m734
17937D11609k4930j3800j3262J18j5595k2347q900J100k552k0700m694J3681J3153
$$ plain form
18024 576097 584855 606422 625044 628101 632923 653112 679213 704024 736075 759963 755462 736271
18012 736271 725871 716906 698065 704615 709426 711750 708271 707016 691905 682761 671731 659281 654352
17999 654352 649005 641480 616878 610231 600140 598375 598220 596675 582355 575367 554517 542245 515664
17986 515664 480897 470486 455250 437022 428205 426737 423509 415866 400452 372621 367521 347148
17974 347148 325888 321108 326017 324283 338699 352245 364979 373590 379741 405282 419628 441947
17962 441947 470642 518453 569714 638895 683017 721529 729782 699746 660368 608097 563587 513776
17950 513776 480971 463836 452828 444114 439851 448575 452933 450593 434789 407339 410354 416343 411609
17937 411609 386679 372879 359617 359735 344140 321793 312893 313993 311441 290741 286047 299728 312881
17924C12881R970J6791K667j6p221j8732q618l946j6155k8757k3844o310r813
17911B18897k2805j4729o235m136m744j9736j3318K605Q290j059j4728J0513K8614
17898A67429L446J52q420J0196P919J2893J52l177q547q533j0816J1745m896j2399
17884A57144n099O921L913m794m52L540P665q001r798L648J89R70r761j1542p061
17869A27482o36K107K100j223l009o21j2878j3029L295K567j4186j4316k057P547
17855H3143O121O410o305k966O633J1645M971l214J9252R77k3370k756J2279p51
17841A12069N756n374r370k53N816j0579j2482J3189k529m295j0010j617j0107
17828G0214N447M155N160n45q778j4849j0376K90J7J027k909j759l3j6653m265
$$ plain form
17924 312881 322851 339642 342309 342293 335072 316340 307722 303776 287621 258864 235020 228710 218897
17911 218897 196092 181363 175128 170992 166248 146512 133194 135799 144089 143030 128302 138815 167429
17898 167429 170875 171027 162607 172803 180722 193615 193767 190590 182043 173510 162694 174439 169543 157144
17884 157144 152045 158966 162879 158085 157633 161173 168838 160837 151039 154687 154876 155846 146085 134543 127482
17869 127482 126846 128953 131053 129830 126821 126200 113322 100293 103588 106155 91969 77653 75596 83143
17855 83143 89264 95674 89369 86403 93036 104681 109652 106438 125690 126667 103297 100541 112820 112069
17841 112069 117825 112451 103081 102828 108644 98065 85583 98772 96243 91948 81938 80321 70214
17828 70214 75661 79816 84976 84431 75653 60804 50428 50718 50735 51762 48853 47094 47061 30408 26143
17813B6143K3100Q014M010M79j6906P692J4747l406J487j043l101P104K615m991
17799F5944j1633p055p6j1436j974l567J381j723N659k402J048k457n633J3582
17785C9658j73k3641N550J9102m61P845P965k823R85O346j3710r389j0944m45
17771B5865N479Q068P252M330p538P804J854M019j1290j5325J937L945o232n529
17757B4639J4646K460N53j0944r741P74N219J4277J1857p801k1165K268j0520
17744A6522o801j120P693J9028M610r457N001qk4380j2444k102L59J1195J6831
17730B4927J6068J736j566K722J0389m192j0821q76l751n874N277m087J5816O555
17716E2323j1751N150P431O753M704j457q565j9000l855p834j2258J55K9409J5820
$$ plain form
17813 26143 49243 57257 61267 61746 44840 52532 67279 63873 65360 64317 61216 68320 70935 65944
17799 65944 54311 47256 47180 35744 33770 30203 31584 29861 35520 33118 34166 31709 26076 39658
17785 39658 39485 15844 21394 40496 40035 47880 55845 53022 54007 60353 46643 37254 26310 25865
17771 25865 31344 39412 46664 50994 43456 51260 53114 57133 45843 30518 32455 36400 30168 24639
17757 24639 39285 41745 42298 31354 21613 22387 27606 41883 53740 45939 24774 27042 16522
17744 16522 9721 8601 16294 35322 39932 30475 35476 35468 11088 -1356 -3458 -3099 8096 24927
17730 24927 40995 42731 41165 43887 54276 50084 39263 38387 34636 28762 34039 29952 45768 52323
17716 52323 40572 45722 53153 59906 64610 63153 54588 35588 31733 23899 11641 11796 41205 57025
17702E7025K678j2100q384J3516P953k330O483Q981J3243K0161J1966K3953O284
17689A49429O237K3430K1430M2258J2197R424K6640K3320J7358J2150J7685L298
17677C64856r509k4802n659P755L278O642K7766L4542K4262M4356O2164Q4001
17665F19652Q6480P2739N7122N1598M3798J8609J1315o296k5861o8626q3754p1663
17653G05113p5681n8875n6953n1945m9616n3987l7147k3638k7719j8299j930J4687
17641B64010M382j7689o045J0282R971J1441Q705K774N951J6602J3263P913J4288
17628C45848Q80L493K916j1779j771j4172j1871n596M088l422j1287j5000j0204
17615B72123J461j0770k051j1296n511j1167k107J41l594J3116J1595m358L3O378
$$ plain form
17702 57025 59703 47603 39219 52735 60688 58358 64841 73822 87065 107226 119192 143145 149429
17689 149429 155666 179096 200526 242784 254981 264405 291045 314365 331723 343873 361558 364856
17677 364856 355347 330545 324886 332641 335919 342561 370327 404869 429131 473487 535651 619652
17665 619652 706132 778871 835993 887591 931389 949998 961313 955017 929156 860530 776776 705113
17653 705113 629432 570557 513604 461659 412043 358056 320909 297271 269552 251253 249323 264010
17641 264010 268392 250703 244658 254940 264911 276352 285057 287831 293782 310384 323647 331560 345848
17628 345848 346728 350221 353137 341358 339587 325415 313544 307948 312036 308614 297327 282327 272123
17615 272123 273584 262814 260763 249467 243956 232789 230682 230823 227229 240345 251940 247582 247615 253993
17601B53993m287j0095j3618k8316k5227n635j0201k1265j5095n041p225J70P992
17588A16150j6703j1109l543l766o33o727q300j7839l010k958q13L939l688l900
17574C7100m544m325j8603K102J4587R365n505j0742m8m18q516J1052Q653R568
17560C9726o966R030J8383r951j2919p449o316p425j9733O030j175O529p241M179
17546D702R046q688O979K3075l319j2181p4j2818r147l921K328O137J652n965
17532b194N358Q920m615j1255O493M533O055L991o714J0199j0597j3652O205Q993
17518A1720m624j4803j0197L249N856K678J0624k151r386m129L894J976J0028
17505D735M409o443M034R514O686j0577j1967n417K13J3522Q18M305M12n884n825
$$ plain form
17601 253993 249706 239611 225993 197677 172450 166815 156614 135349 120254 115213 107988 108158 116150
17588 116150 99447 88338 84795 81029 80396 73669 65369 47530 44520 41562 40749 44688 41000 37100
17574 37100 32556 28231 9628 11730 26317 35682 30177 19435 19387 18969 10453 21505 30158 39726
17560 39726 32760 41790 60173 50222 37303 29854 23538 16113 -3620 2410 1235 7764 523 4702
17546 4702 13748 5060 12039 35114 31795 19614 19540 6722 -2425 -6346 -4018 2119 3771 -2194
17532 -2194 3164 12084 7469 -3786 2707 7240 13295 17286 10572 20771 10174 -3478 2727 11720
17518 11720 7096 -7707 -17904 -14655 -8799 -6121 4503 2352 -7034 -11163 -7269 -5293 4735
17505 4735 9144 2701 6735 16249 22935 12358 391 -5026 -4813 8709 9527 13832 14244 8360 2535
17490B535K954K49l627O001J725j1449O637n211j3980P586K985O478J1649j533
17476A2999k923J4582M819q076k984n576p83K409j7299m122lo038j2990J4292
17462a1693J177J115J619Q755K1486J3192m583k580j1396K675P607q327o099k821
17448A0127K838J352R027L2543K7482K1258L765m393k9261k9196j0694K963q836
17435B8975j6033k678O967k586m137O366K991r002j3255n842Q598J3031l078j9414
17421i097r942Q813M515N931J3095J2556J0297r140j0064r111L130O108k61o772
17407A0058p595N752p186j738O863p951m417M279p919r717P626J3121R034r992
17393B18j4377j78R891N100j1305J4481O421r824q403J187L863l80L386N786o399
$$ plain form
17490 2535 5489 5738 2111 8112 9837 -1612 5025 -186 -14166 -6580 -3595 2883 14532 12999
17476 12999 10076 24658 29477 21401 18417 12841 12058 14467 -2832 -6954 -6957 -12995 -25985 -11693
17462 -11693 -10516 -9401 -7782 973 22459 35651 31068 28488 17092 19767 27374 19047 12948 10127
17448 10127 12965 14317 23344 55887 83369 104627 108392 103999 74738 45542 34848 37811 28975
17435 28975 12942 10264 17231 14645 10508 16874 19865 10863 -2392 -8234 364 13395 10317 -9097
17421 -9097 -19039 -10226 -5711 220 13315 25871 36168 27028 16964 7853 10983 17091 16830 10058
17407 10058 2463 8215 1029 -709 6154 -1797 -6214 -1935 -9854 -19571 -11945 1176 10210 218
17393 218 -14159 -14337 -4446 654 -10651 3830 10251 427 -7976 -6789 -2926 -3306 80 5866 -533
17378e33q125L823P127p987o50j0120P142J058k533m892O774O910j0444O925L568
17363a957L020p718j2769k656N472J3072K291R408q475r6K567L180k286j6296
17349a3243M320N92j6506L344O712M656K0864k906l645k392k082O109J6562N147
17335B7532k3215m964J55L129P947m283j707K461j8766L088J0490N092n873M54
17321A540J4407K174N738n648N965j8251n990m52Q977O266l554l161j2482j137
17307e608n822O958M448R887l089K612R072Q416l61j3463L292L511m639j2222
17293B992o460q752M422K688j527j428J3631J2145j358k0494K865R530l748M33
17279D939L155L464n150j0432m373N902n370Q875R796r59j1543j1067N977R888
$$ plain form
17378 -533 -8658 -4835 2292 -5695 -6345 -16465 -9323 -8265 -10798 -15690 -8916 -2006 -12450 -5525 -1957
17363 -1957 1063 -6655 -19424 -22080 -16608 -3536 -1245 8163 -312 -408 2159 5339 3053 -13243
17349 -13243 -8923 -8331 -24837 -21493 -14781 -10125 10739 7833 4188 1796 -286 5823 22385 27532
17335 27532 4317 -647 -492 2637 10584 6301 4594 7055 -11711 -8623 1867 6959 1086 1540
17321 1540 15947 18121 23859 18211 24176 5925 -65 -517 8460 14726 11172 8011 -4471 -5608
17307 -5608 -11430 -4472 -24 9863 6774 9386 18458 26874 26513 13050 16342 19853 15214 2992
17293 2992 -3468 -12220 -7798 -5110 -6637 -8065 5566 17711 16353 -4141 -1276 8254 4506 4939
17279 4939 8094 11558 6408 -4024 -8397 -2495 -7865 1010 10806 9847 -1696 -12763 -6786 3102
17265C102P276J551L517o744K909J52r443J37J5414J31j500N63j3467j0081j288
17250g771L415r136j9761n947J7914J2746l212j0498K859O227Q020J662R675l887
17236B306J765L102N150k916j0227j7362J024J247O554N801m790J1151l037l848
17222d080j872r699K196Q619P250L275j167j0517k61o160j3203L538P987R04J697
17207a1493j6129l257Q69O138O785l928J6751J3557k877o433pQ904J091p682o569
17192d280L586j1881j108J3172R163p412k857j640J812O267m950n745O126O72
17178I25n769n412P888R621M75k461j749l647j4794J0245R848K353m525m251n142
17163f395R56n53M296L462L912j294r709l930K989K315O263j405P786J3572Rn42
$$ plain form
17265 3102 10378 11929 15446 8702 11611 11763 2320 2457 17871 18002 16502 17065 3598 -6483 -7771
17250 -7771 -4356 -13492 -33253 -39200 -21286 -8540 -11752 -22250 -19391 -13164 -5144 -3482 6193 2306
17236 2306 4071 7173 12323 9407 -820 -18182 -17158 -15911 -9357 -3556 -8346 2805 -232 -4080
17222 -4080 -5952 -15651 -13455 -4836 2414 5689 4522 -5995 -6256 -12416 -25619 -22081 -14094 -13190 -11493
17207 -11493 -27622 -30879 -30010 -23872 -17087 -21015 -4264 9293 6416 -17 -24 8880 9971 2289 -4280
17192 -4280 -694 -12575 -13683 -511 8652 1240 -1617 -3257 -1445 4822 -128 -5873 253 925
17178 925 -4844 -10256 -2368 7253 7728 5267 3518 -129 -14923 -4678 5170 7523 2998 -1253 -6395
17163 -6395 -5439 -5992 -1696 1766 5678 4384 -5325 -9255 -6266 -3951 2312 907 8693 22265 22274 21732
17147B1732n546J151k558j1855j0411N396K005j4042j036P587Q584J5409k826
17134A3590p026p385j658Q751m045o583j903L886p938p071O408N129j4394l10
17120b0549j489K947J556Q314K340p379l683K271j629N023L185l521M53p410O192
17105a3379Q307K19k137r705l655N325J326P699J737M017J3111j2284j0916j3693
17091b4028j5489N949M960m151J7979J3548L725j3482m073n128j5074J4986L591
17078a6687m008L133J0614L094n904J561N173j5214k377N670J6K981J899m003
17064a4052j1555O726O183M352O008L994j101L441Q192j4517q876r382J383K270
17050a6934J7507Q450j207j0697m681o591j603J0277J5512K369P34n990R931n276
$$ plain form
17147 21732 16186 17337 14779 2924 -7487 -2091 -86 -14128 -15164 -7577 1007 16416 13590
17134 13590 6564 -821 -2479 6272 2227 -4356 -6259 -2373 -10311 -17382 -10974 -5845 -20239 -20549
17120 -20549 -22038 -19091 -17535 -9221 -6881 -14260 -17943 -15672 -17301 -12278 -9093 -12614 -12161 -19571 -13379
17105 -13379 -5072 -4853 -6990 -16695 -20350 -15025 -13699 -6000 -4263 -246 12865 581 -10335 -24028
17091 -24028 -39517 -33568 -28608 -32759 -14780 -1232 2493 -10989 -15062 -20190 -35264 -20278 -16687
17078 -16687 -20695 -17562 -6948 -3854 -9758 -8197 -3024 -18238 -20615 -14945 -14929 -11948 -10049 -14052
17064 -14052 -25607 -18881 -12698 -8346 -2338 1656 555 3996 12188 -2329 -11205 -20587 -19204 -16934
17050 -16934 573 9023 7816 -2881 -7562 -14153 -15756 -5479 10033 12402 13136 7146 17077 11801
17036A1801j831M954Q279n025j1191r16P457j0102j1580j311J0148L423o474j7484
17022a9852k533K5502K1597O47j6465j3979N016J2616k854r413R677j3117j0376
17009a3534m608p592j1978J5285O24J628O439m16P36N765j142n76n775j3051R276
16994a8919M478o953J4104L576p804J318j653m113K204N411k449r330R425R438
16980a267N26q25l921P844R745n836j4999r926j6224L038K1618R618j0168q018
16966a8795J5286J5580K125n009K818j0055k2354L105M511J3659J3436Q878r107
16953A4078j4194p952P344Q749j1273m252j2429j2837Q153Q363N79O531j2524
16940b1664P642O941p453j1803N788K0219M707n761L510o701j0860K956j250p365
$$ plain form
17036 11801 9970 14924 23203 18178 6987 6071 13528 3426 -8154 -9465 683 4106 -2368 -19852
17022 -19852 -22385 3117 24714 25361 8896 -5083 -67 12549 9695 282 9959 -3158 -13534
17009 -13534 -18142 -25734 -37712 -22427 -21803 -20175 -13736 -14152 -13416 -7651 -8793 -9369 -15144 -28195 -18919
16994 -18919 -14441 -21394 -7290 -3714 -11518 -10200 -11853 -15966 -13762 -8351 -10800 -20130 -10705 -1267
16980 -1267 -741 -1566 -5487 2357 12102 6266 -8733 -18659 -34883 -31845 -10227 -609 -10777 -18795
16966 -18795 -3509 12071 14196 9187 12005 1950 -20404 -17299 -12788 871 14307 23185 14078
16953 14078 -116 -8068 -724 8025 -3248 -7500 -19929 -32766 -24613 -16250 -15671 -9140 -21664
16940 -21664 -14022 -7081 -14534 -26337 -20549 -330 4377 -1384 2126 -4575 -15435 -12479 -13729 -21094
16926b1094N68P205J0866j1995l48Q489L302N702j9714j1345q637R265J8573o81
16912i844j636J95n562J397J3603J2528n062j0643n01J3273j414m590J925Q123
16898A1792K071o336p321j4955k671L080m020J0155N599J0800j841Q642O757l198
16884A8554j050j0706J773r63L53Q479j4199q706j4442K099M203n932m17j500
16870b2454q243K882P508J883Q254M151L812J058L022J884l854q28R29o13k030
16855b639j0419K478j502P769L708J025J2562j51j0794j9012o572p645N422L888
16841b1882J1888R861J65P65l403o870M994J1401m125p608j7242j0934l175r66
16827c7131P476J3901J5465j0043j0118RP841K521P853J491j2069N022K0188O570
$$ plain form
16926 -21094 -20526 -13321 -2455 -14450 -14798 -6309 -3007 2695 -17019 -28364 -37001 -27736 -9163 -9844
16912 -9844 -11480 -11285 -16847 -15450 -1847 10681 5619 -5024 -5525 7748 6334 1744 3669 11792
16898 11792 13863 7527 206 -14749 -17420 -14340 -18360 -8205 -2606 8194 6353 14995 21752 18554
16884 18554 17504 6798 8571 7608 7961 16440 2241 -6465 -20907 -18808 -14605 -20537 -20954 -22454
16870 -22454 -30697 -27815 -20307 -18424 -10170 -6019 -2207 -1149 1873 3757 -97 -925 4 -609 -2639
16855 -2639 -13058 -10580 -12082 -4313 -605 420 12982 12831 2037 -16975 -23547 -31192 -25770 -21882
16841 -21882 -9994 -133 32 797 -2606 -9476 -4482 6919 2794 -4814 -22056 -32990 -36165 -37131
16827 -37131 -29655 -15754 -289 -10332 -20450 -20441 -12600 -10079 -2226 -735 -12804 -7782 12406 18976
16813A8976j4327j3183p842M85r65J0256J2613j499p683j7854j7580N415J3091
16800b0097K07N432N558R160m046m199j441o027j5811p783J6136L640j128L874
16786a6525J054R62n718L917P488L003k698j0767R102m039k849O264K91N322l850
16771i043O411o639n404N300J262m064o096r988N867P102P22k46K778R824o618
16756h832m785L54Q082R021J039J561J4250o805j1075q651q341K256J0377M70
16742a079K137j0969p289L719J09j440J2651R106k246K838L010J4244j218j5302
16728H271j4383M356K844J0252M764n25j2416j7052M816J2928r624q264J1273
16715b760l117k005o211M889p267L429p933J637Q948O818N360p059O175o008j223
$$ plain form
16813 18976 4649 -8534 -16376 -15891 -16856 -6600 6013 4514 -3169 -21023 -38603 -33188 -20097
16800 -20097 -19890 -14458 -8900 260 -3786 -7985 -9426 -15453 -31264 -39047 -22911 -19271 -20399 -16525
16786 -16525 -15471 -14509 -20227 -16310 -8822 -5819 -8517 -19284 -10182 -14221 -17070 -10806 -10515 -5193 -9043
16771 -9043 -2632 -9271 -14675 -9375 -8113 -12177 -18273 -28261 -22394 -15292 -14570 -14816 -12038 -2214 -8832
16756 -8832 -13617 -13263 -5181 3840 4879 6440 20690 13885 2810 -5841 -14182 -11926 -1549 -1079
16742 -1079 1058 -9911 -17200 -13481 -13372 -14812 -2161 6945 4699 7537 10547 24791 23573 8271
16728 8271 -6112 -1756 1088 11340 16104 15579 3163 -13889 -9073 3855 -5769 -14033 -2760
16715 -2760 -5877 -7882 -14093 -9204 -16471 -13042 -20975 -19338 -10390 -3572 1788 -5271 904 -5104 -6327
16700f327P151m04o935r04j101j2992j0083J61M497R657J1769M206L520J55n725
16685c355o778J1612O547o12J3J722m196l675M109j7069j4715J3550J8926q247
16671b168P002J6252o225j3248P546J793K232M191j7916j7046N017R504J1286
16658H220n487j2887r793R901L225O100N365M818J383j5633j6945N677J0608j212
16644f660J341N096j798K1579O343n838j5418m46M256n000m688k521j000r717
16630a4471JL819L292M113k68j5292r181L583o048J0268J6769O313K459m014K177
16615C520k574j457K5170Q118n490r862j1639n608l406j1516N80J098P598P004
16601A536J507M440M526J3810j888n798r974p147k534k643L814N676k054j355
$$ plain form
16700 -6327 824 420 -6515 -7419 -8520 -21512 -31595 -31434 -26937 -17280 -5511 -1305 2215 2370 -3355
16685 -3355 -10133 1479 8026 7414 7427 9149 4953 1278 5387 -11682 -26397 -12847 6079 -2168
16671 -2168 4834 21086 14861 1613 9159 10952 13184 17375 -541 -17587 -12570 -3066 8220
16658 8220 2733 -10154 -19947 -10046 -6821 -721 4644 9462 10845 -4788 -21733 -16056 -5448 -6660
16644 -6660 -5319 -223 -2021 19558 25901 20063 4645 4199 8455 3455 -1233 -3754 -4754 -14471
16630 -14471 -14470 -10651 -7359 -3246 -3514 -18806 -27987 -24404 -30452 -20184 -3415 2898 5357 1343 3520
16615 3520 946 -511 24659 32777 27287 17425 5786 178 -3228 -14744 -14164 -13066 -5468 1536
16601 1536 3043 7483 12009 25819 23931 18133 8159 1012 -1522 -4165 -351 5325 3271 1916
16587A916j3394o702q573R500Q690P583R984o176J126l238p538m638j2055K543
16573b0972k766N263k029J304M738j432k607j0657J295n809O3L605K494L369O698
16558a7443n13o835J339J2207J2927J988j2637L543m116j180K97O254p644j0795
16544b2608J465K1479J0833j017m360j3038k815M566J161m414Q64L10N359j587
16530c802j2439j1771j1210j717J2289J2602O057J0051R919N342p527p776m426
16517d408Q823q39j3485N395R597J694j841l103j4981j1336P367R283R892p150
16503e092k344l424q25q831n247l787l435J0751J2397O970O351K040K941j592
16489F873Q08m395k685l460N135q371j4797j0232J332J7203P373R768L137r41
$$ plain form
16587 1916 -11478 -18180 -26753 -17253 -8563 -980 9004 2828 3954 716 -6822 -11460 -23515 -20972
16573 -20972 -23738 -18475 -20504 -19200 -14462 -15894 -18501 -29158 -27863 -33672 -33609 -30004 -27510 -24141 -17443
16558 -17443 -17956 -24791 -23452 -11245 1682 3670 -8967 -5424 -9540 -10720 -10423 -4169 -11813 -22608
16544 -22608 -21143 336 11169 10152 5792 -7246 -10061 -5495 -4334 -8748 -7884 -7574 -2215 -3802
16530 -3802 -16241 -28012 -39222 -40939 -28650 -16048 -9991 60 9979 15321 7794 18 -4408
16517 -4408 4415 3576 -9909 -4514 5083 6777 4936 1833 -13148 -24484 -17117 -7834 2058 -5092
16503 -5092 -7436 -10860 -11685 -20516 -25763 -29550 -32985 -22234 -9837 -2867 3484 5524 8465 6873
16489 6873 7681 3286 601 -2859 2276 -6095 -20892 -31124 -29792 -12589 -5216 4552 7689 6748
16475F748k163r249m586K255j694j1330N371J5792Q885O54j1441M498r069j9710
16461b5039O324m03N097J6405l468j1803J137J1901J116q045o051m794n933J1191
16447a2365J7247j776k419K563q267N689N518m484j087P131j2037j5085L674J2037
16433c661n024m727K146n800R511J675N31K238n266r201n427N639O194q585j7279
16418c7036M061J1833J7527m182j5800P011J4498J399j9k344k976L972J652r767
16404a0171O034M102N850O49J219p096k988N790j931M533n062l986N268j8365
16390a6154j9289M689P092k712R72Q927P414J0450O675m484P62N433Q39j6433
16376e819j1380M036q715j5341j29J6465M936K371J3320q61j2257l728l096J791
$$ plain form
16475 6748 4585 -4664 -9250 -6995 -8689 -20019 -14648 1144 10029 10683 -758 3740 -5329 -25039
16461 -25039 -18715 -19118 -14021 2384 -1084 -12887 -11750 151 1267 -6778 -12829 -17623 -23556 -12365
16447 -12365 4882 3106 687 3250 -5017 672 6190 1706 619 7750 -4287 -19372 -15698 -3661
16433 -3661 -8685 -13412 -11266 -17066 -7555 -5880 -5349 -3111 -8377 -17578 -23005 -17366 -11172 -19757 -37036
16418 -37036 -32975 -21142 -3615 -7797 -23597 -16586 -2088 -689 -708 -3052 -6028 -2056 -404 -10171
16404 -10171 -4137 -35 5815 6464 7683 587 -2401 3389 1458 5991 929 -3057 2211 -16154
16390 -16154 -35443 -30754 -23662 -26374 -25402 -16475 -9061 1389 8064 3580 4342 9775 10614 -5819
16376 -5819 -17199 -13163 -21878 -37219 -37348 -20883 -15947 -13576 -256 -1117 -13374 -17102 -20198 -18407
16362a8407J0411l48l785l290N557J482Q748P274l84n861k531j2878j5944n985
16348c5941Q000M837R442M325J932k009k97L367p357J1273O31j0410k0529J555
16334c1181o222J7717R76m152J3163J4229j324p982n004K462q76N438J0946m747
16320C443o86r433n188m392M33K032J3195K951n265l82k467j288L668L777j2337
16305a1939r387K770o948n25r132M712J4875o862p675J3283J5023p42l416j2914
16291a8877j0479Q089M58K808R135j0391j1797J1459l465J1917P534L51j1668
16278a4926j4524R929L666p796L331R726n715P822j204j854K426J1300j4339n60
16264a2718J4773J741j6164j7304l29L365o045L502M999j4272Q62K4684j989o295
$$ plain form
16362 -18407 -7996 -8344 -12129 -15419 -9862 -8380 368 7642 7258 1397 -1134 -14012 -29956 -35941
16348 -35941 -27941 -23104 -13662 -9337 -7405 -9414 -9711 -6344 -13701 -2428 -1797 -12207 -32736 -31181
16334 -31181 -37403 -19686 -18710 -22862 -9699 4530 3206 -4776 -9780 -7318 -8194 -2756 8190 3443
16320 3443 2757 -6676 -11864 -16256 -15823 -13791 -596 2355 -2910 -3292 -5759 -7047 -3379 398 -11939
16305 -11939 -21326 -18556 -25504 -26029 -35161 -30449 -15574 -22436 -30111 -16828 -1805 -2547 -5963 -18877
16291 -18877 -29356 -21267 -20809 -18001 -8866 -19257 -31054 -19595 -23060 -11143 -3609 -3258 -14926
16278 -14926 -29450 -19521 -15855 -23651 -20320 -10594 -16309 -8487 -9691 -11545 -9119 2181 -12158 -12718
16264 -12718 2055 3796 -12368 -29672 -30001 -26636 -32681 -29179 -24180 -38452 -37590 -12906 -14895 -21190
16250b1190M511m06J4598L373P607r40j621j094J741l817L535N344r620j909o636
16235f524k0363p430J127J2395J0095L785j6077j0969O456Q425J3265J160J2215
16222G560J1087m660j1583n160j1957o213R005Q361J8716N224j5776L16O608k2
16208A1506r69K981j0464j0246j666j6172N502L343p271l716N685j004K489r006
16194b9008j2728M9J0343K1407K7034M648j8300k8014o815J0952K878r628P66
16181b6416m294j8454J5638J4874O262L659o607O17L121p763k719K611N269J1211
16167b991p183K238P544J5331j2570J245r33l807n85j38r703m653N366o684m980
16152b2503l276K389l737O873O346N075j295K583P370l925R084j011l772L906
$$ plain form
16250 -21190 -16679 -17085 -2487 886 8493 7553 5932 4838 6579 2762 6297 11641 2021 112 -6524
16235 -6524 -26887 -34317 -33190 -20795 -10700 -6915 -22992 -33961 -27505 -19080 -5815 -4655 7560
16222 7560 18647 13987 2404 -2756 -14713 -20926 -11921 -3560 15156 20380 4604 4920 11528 11506
16208 11506 10537 13518 3054 -7192 -8858 -25030 -19528 -16185 -23456 -27172 -21487 -22491 -20002 -29008
16194 -29008 -41736 -41687 -31344 -9937 17097 21745 3445 -24569 -31384 -20432 -17554 -27182 -26416
16181 -26416 -30710 -49164 -33526 -18652 -12390 -8731 -15338 -14721 -11600 -19363 -22082 -19471 -14202 -2991
16167 -2991 -10174 -7936 -392 14939 2369 3614 2681 -1126 -1711 -1849 -11552 -16205 -10839 -17523 -22503
16152 -22503 -25779 -23390 -27127 -20254 -13908 -8833 -10128 -7545 -175 -4100 4984 3973 201 4107
16138D107J4339j0194k5327m305j0683n759J2656J4531L176j0643M482M459q208
16125a7369O525Q53q307p801j935q060Q619M951Q193o752j591J3561j444N078
16111e479J4073O814n174l180j0028r596n62r977J70J5334l119k851O376j6868
16097b4067q493l4N517K2325O622j4549j1179J2870J5274O742r222j3195r445
16084b0834J4235J3144j3536j1442Q340M977M389j0546j1488Q969R927K604k462
16071c723j789p229n566j6971o508J0184K4943J6012r930j4197j0884j0072J24
16058c5606J9488J0609L622M256M103j208r668q114K397P164K007j2260o851R700
16044a0361N700j9375l715M640o91J1687J6457J4436k942j6306k67N180m610p884
$$ plain form
16138 4107 18446 8252 -17075 -21380 -32063 -37822 -25166 -10635 -7459 -18102 -13620 -9161 -17369
16125 -17369 -10844 -9991 -18298 -26099 -28034 -36094 -27475 -22524 -14331 -21083 -22674 -9113 -10557 -5479
16111 -5479 8594 15408 10234 7054 -2974 -12570 -13132 -23109 -22939 -7605 -10724 -13575 -7199 -24067
16097 -24067 -32560 -32594 -27077 -4752 1870 -12679 -23858 -10988 4286 11028 1806 -11389 -20834
16084 -20834 -6599 6545 -6991 -18433 -10093 -5116 -727 -11273 -22761 -13792 -3865 -1261 -3723
16071 -3723 -5512 -12741 -18307 -35278 -41786 -31602 -6659 9353 -577 -14774 -25658 -35730 -35606
16058 -35606 -16118 -5509 -1887 2369 6472 5264 -4404 -12518 -10121 -2957 -950 -13210 -20061 -10361
16044 -10361 -4661 -24036 -27751 -23111 -23802 -12115 4342 18778 15836 -470 -737 4443 -167 -8051
16030h051o391m795L88j2615j7505Q874J5151o75J4113K830P112j264k878J0454
16016D748P453j6357k5433l203J5959O735q909K348O399j984j710P160k025n24
16002i343r712j180n249J929j113K971R496k753r136o841O112N191N485N399J759
15987f985n461j3393m177J0386K715j363Q788J0727O472k042n907q951j521O19
15973a0093p802P918J1797l944K035r94k749N177n399r351L410l773O459l362
15959a0671n257j634N106m58J756L023m273j903J065j1160o07J7382j886k017
15945a1534q209p665n86j143N558O255k223n199J0173J1302N472J048n020j0545
15931a2316l144R669J0601m625n691m066K999o031m776N06p220J678R826R21K224
$$ plain form
16030 -8051 -14442 -19237 -18849 -31464 -48969 -40095 -24944 -25619 -11506 -8676 -1564 -2828 -5706 4748
16016 4748 12201 -4156 -29589 -32792 -16833 -10098 -19007 -16659 -10260 -12244 -13954 -6794 -8819 -9343
16002 -9343 -19055 -20235 -25484 -23555 -24668 -21697 -12201 -14954 -24090 -30931 -24819 -19628 -14143 -8744 -6985
15987 -6985 -12446 -25839 -30016 -19630 -16915 -18278 -9490 1237 7709 5667 -240 -9191 -10712 -10093
15973 -10093 -17895 -9977 1820 -2124 -89 -1083 -3832 1345 -4054 -13405 -9995 -13768 -7309 -10671
15959 -10671 -15928 -17562 -12456 -12914 -11158 -8135 -12408 -14311 -13246 -24406 -25013 -7631 -9517 -11534
15945 -11534 -19743 -27408 -27994 -29137 -23579 -17324 -19547 -24746 -14573 -3271 2201 3249 -1771 -12316
15931 -12316 -15460 -5791 4810 185 -5506 -9572 -6573 -12604 -17380 -16874 -24094 -22416 -12590 -11669 -9445
15916i445N252j4564j1603n797P645J4383J65J0781K5678j2246m863m694q703
15903h011p833p474M59M243l327N409J3419j147r933P585k514j4645R82L284k327
15888b1830K63j2248O572Q835l601R728R375m003O147J2771R617Q15j775j7528
15874C138j0253j8281l089J8564Q401m227j1267j0247J4200J4505j3025r843M17
15861b1007J3343L572m478N961Q250J0512o761o600J61Q61L229M887N1p503p903
15846c425o230p198j4168R056J7762L558L030n230N968j4397r846K0393o088l623
15832a0438P537k439n26j81O010J1787o119l376l600j730k549K46m418P874p264
15817i186L481Q994q140n081j0806J1429j090j3803P977O114P767J4154o949l650
$$ plain form
15916 -9445 -4193 -18757 -30360 -36157 -28512 -14129 -13964 -3183 22495 10249 5386 692 -8011
15903 -8011 -15844 -23318 -22859 -18616 -21943 -16534 -3115 -4262 -14195 -6610 -9124 -23769 -22787 -19503 -21830
15888 -21830 -21567 -33815 -27243 -18408 -22009 -12281 -2906 -6909 -762 12009 21626 22441 20666 3138
15874 3138 -7115 -25396 -28485 -9921 -1520 -5747 -17014 -27261 -13061 1444 -11581 -21424 -21007
15861 -21007 -7664 -4092 -8570 -2609 5641 16153 9392 2792 2953 3814 7043 11930 11981 4478 -3425
15846 -3425 -9655 -16853 -31021 -21965 -4203 -645 2385 -2845 3123 -11274 -21120 -727 -6815 -10438
15832 -10438 -2901 -5340 -5866 -6047 -37 11750 5631 2255 -1345 -3075 -5624 -5378 -9796 -1922 -9186
15817 -9186 -5705 3289 -4851 -9932 -20738 -9309 -10399 -24202 -16225 -10111 -2344 11810 4861 1211
15803A211q336O896p398k273J177R929j0677l297m151p445K511J4188j679k956
15789a2300k512K699L343Q933m498L995L140j1641P628K3446q334k5497j4892
15776b6490L970M879m217N296o409p823J3177N88O008k935j2313j809M137L446
15762b0495j7J0946m410j4991o434M854N531J2127J3047r110j6196j0583O069
15749b9662O409J8240P348j0314k3717j5397Q293N857q720J3054O090J0159R182
15736c178K977j1771J0688q890j1478J80J9301k533L537O309n229l362j3074j1667
15722b8190M131J4264o726n676L22P807p112L428J725J2768J594j0335m876p27
15708a7603o583O615j2570q260j573j842M399Q965J537N069n55P108J972j5937
$$ plain form
15803 1211 -7125 -229 -7627 -9900 -8723 1206 -9471 -12768 -16919 -24364 -21853 -7665 -9344 -12300
15789 -12300 -14812 -12113 -8770 163 -4335 -340 2800 -8841 -1213 22233 13899 -11598 -26490
15776 -26490 -22520 -17641 -21858 -16562 -22971 -30794 -17617 -17029 -11021 -13956 -26269 -28078 -23941 -20495
15762 -20495 -20512 -9566 -13976 -28967 -35401 -30547 -25016 -12889 158 -8952 -25148 -35731 -29662
15749 -29662 -23253 -5013 2335 -7979 -31696 -47093 -38800 -32943 -41663 -28609 -22519 -12360 -3178
15736 -3178 -201 -11972 -1284 -10174 -21652 -21472 -2171 -4704 -1167 5142 -87 -3449 -16523 -28190
15722 -28190 -24059 -9795 -16521 -22197 -21875 -14068 -21180 -17752 -16027 -3259 -1665 -12000 -16876 -17603
15708 -17603 -24186 -17571 -30141 -38401 -39974 -41816 -37417 -28452 -26915 -21846 -22401 -15293 -13321 -29258
15694b9258M085O440P202r089j567q395Q705J3409Q434J134j3106j057J1661J3299
15680A1897r25N390o283n453m151j5291r270k271l33R636L395p880N545j222p902
15665b5118k663L951J3704l01k907m183o174n023J4034J5689L09j3536j2654j180
15651b6052J2621k26j1156Q763R244p956Q222M01m924q805j0581J870Q500K664
15637a7415Q267J8369k175j3933N999o676q464n574K633K276L312K871m303K614
15623a2199J092P281l497j1307m129K651m654J2405N650j5148J7616R360k448
15610B673p713J1221q524j4636l329l602l30k841Q294J8323k138l267L206L229
15596E66j403r956K945m582k721j1665J171J7107J0627J981J884R456j4231j4252
$$ plain form
15694 -29258 -25173 -18733 -11531 -20620 -22187 -30582 -21877 -8468 -34 1100 -12006 -13063 -1402 11897
15680 11897 10972 16362 10079 4626 475 -14816 -24086 -26357 -26690 -17054 -13659 -21539 -15994 -17216 -25118
15665 -25118 -27781 -23830 -10126 -10427 -13334 -17517 -23691 -28714 -14680 1009 1318 -12218 -24872 -26052
15651 -26052 -13431 -13657 -24813 -16050 -6806 -14762 -6540 -6139 -11063 -19868 -30449 -28579 -20079 -17415
15637 -17415 -9148 9221 7046 -6887 -888 -7564 -16028 -21602 -18969 -16693 -13381 -10510 -14813 -12199
15623 -12199 -11107 -3826 -7323 -18630 -22759 -20108 -24762 -12357 -6707 -21855 -4239 5121 2673
15610 2673 -5040 6181 -2343 -16979 -20308 -23910 -24240 -27081 -18787 -464 -2602 -5869 -2663 566
15596 566 -837 -10793 -7848 -12430 -15151 -26816 -25645 -8538 2089 4070 5954 15410 1179 -13073
15582a3073p254k414R329Q71r022o385j158J776J4703N772j0286K048J1407L597
15568h9L75q372M943q97K59o695q728l449M028K651j0180O531M737q961L411J856
15552a8580J4831j0688o097J6905M869p596J2083J271j9821j365J1214l835k934
15539i743M102j0933Q784j81o458L81O262K356j3414n401O876j471l62Q292J0462
15524d48J327j2925k890m372m697K251L095O009J0042J3201K603j3782j2798p243
15510b0627n046j541J2883o27L965J2919J5389m65q079j8230l621n933J0681J1268
15496B936R012K418L946J9n579o86m938j5062o025P654j986m219q59M813r913
15481a8469K451R992Q435j1557j176J504q08k965q919p689k365M180O655J444
$$ plain form
15582 -13073 -20327 -22741 -13412 -12541 -21563 -27948 -29106 -27330 -12627 -6855 -17141 -15093 -3686 -89
15568 -89 286 -8086 -3143 -4040 -3781 -10476 -19204 -22653 -18625 -15974 -26154 -19623 -14886 -23847 -20436 -18580
15552 -18580 -3749 -14437 -20534 -3629 1240 -6356 5727 6998 -12823 -14188 -2974 -6809 -9743
15539 -9743 -5641 -16574 -7790 -7971 -14429 -14048 -7786 -5430 -18844 -24245 -17369 -18840 -19202 -10910 -448
15524 -448 879 -12046 -14936 -19308 -24005 -21754 -18659 -12650 -2608 10593 13196 -586 -13384 -20627
15510 -20627 -25673 -27214 -14331 -14958 -10993 1926 17315 16850 8771 -9459 -13080 -19013 -8332 2936
15496 2936 11948 14366 18312 18331 12752 12066 7128 -7934 -13959 -6305 -8291 -12510 -13369 -8556 -18469
15481 -18469 -16018 -6026 2409 -9148 -10324 -8820 -9628 -12593 -21512 -29201 -31566 -27386 -20731 -19287
15467a9287j1670m37J1543j031o408J969J1832J1599J9146k68p108O100j152j4832
15453dM733P703n229n759R211J697o465M04N163J475m719j572M08p191l874q936
15437a2955P989k420j0072j8286L989J6337L021n216j1012R086J8330j29L891
15424B553L065j1664j0551N33k908L60Q732L51J245l001p9J0182J5625n038r939
15409e34p882j5529Q636R403L208K646K453K56p394j0372j1719l213J5444P425
15395g172O464L923p790n936p466M577J4152L818J130O641j0776J581j6162n330
15381a8346l151J3299O873j4943l075J6644o30J733j3004n488N117Q238k977j3573
15367b3283j5917J2940J4918j789K066j2616R117J6485j096l912j2405j454P638
$$ plain form
15467 -19287 -30957 -31394 -19851 -20882 -27290 -25321 -13489 -1890 17256 16988 9880 15980 14828 -4
15453 -4 4729 12432 7203 1444 10655 12352 5887 6291 11454 12929 8210 6638 7046 -145 -4019 -12955
15437 -12955 -4966 -7386 -17458 -35744 -31755 -15418 -12397 -17613 -28625 -19539 -1209 -1338 2553
15424 2553 5618 -6046 -16597 -16064 -18972 -18612 -9880 -9529 -8284 -11285 -11364 -1182 14443 9405 -534
15409 -534 -8416 -23945 -15309 -5906 -2698 -52 2401 2657 -4737 -15109 -26828 -30041 -14597 -7172
15395 -7172 -708 3215 -4575 -10511 -17977 -13400 752 4570 5700 12341 1565 3146 -13016 -18346
15381 -18346 -21497 -8198 -1325 -16268 -19343 -2699 -3329 -1596 -14600 -20088 -14971 -6733 -9710 -23283
15367 -23283 -39200 -26260 -11342 -13131 -11065 -23681 -14564 1921 825 -3087 -15492 -16946 -9308
15354i308J1372m775j6093q356j4816J2239J3566N500j668J0046k179o310P779
15341c003p587L251m989L375L094k223k145L797M571n120o374M482J1114j4174
15327a1931j5307J212J1158M369l226J189Q668j2178q366m630j1075L640J6689
15314a9788Q834j3381m394j71l294l359r141N725J0776M786M351R547J8551M689
15300A3731q931P90R191m206l455L198M527M599n495Q998j2105j4356K140K108
15286G34m818o458p013j3568m675J5920K20o644R739J2654L701p986M062m16o80
15271e228k291k0216r486O709J8989J292n447K240J2578O750M224j0293p055l274
15257a0508N001l30l906L197J9178J517j7451j3081O841l277K385N92P022J0937
$$ plain form
15354 -9308 2064 -2711 -18804 -27160 -41976 -29737 -16171 -10671 -12339 -2293 -4472 -10782 -3003
15341 -3003 -10590 -7339 -12328 -8953 -5859 -8082 -10227 -6430 -1859 -6979 -13353 -8871 2243 -11931
15327 -11931 -27238 -26026 -14868 -10499 -13725 -12536 -3868 -16046 -24412 -29042 -40117 -36477 -19788
15314 -19788 -10954 -24335 -28729 -28900 -32194 -35553 -44694 -38969 -28193 -23407 -19056 -9509 9042 13731
15300 13731 4800 5590 14781 10575 7120 10318 14845 19444 13949 22947 10842 -3514 -1374 734
15286 734 -4084 -10542 -17555 -31123 -35798 -19878 -19658 -26302 -16563 -3909 -208 -8194 -4132 -4548 -5228
15271 -5228 -7519 -27735 -37221 -30512 -11523 -10231 -15678 -13438 -860 5890 10114 -179 -7234 -10508
15257 -10508 -5507 -5837 -9743 -6546 12632 14149 -3302 -16383 -9542 -12819 -10434 -9842 -2820 8117
15243H117j1974j6149J528J6174N622j2937j6999k05J4683J2244j200l865K378
15230b583l033l493L76Q808N93j3778o41J1249O939j710p109p256P277m192j4210
15215b2763M677J3301j529q516j544q404m346J3306p657o592K667J0789J6859
15202B48N026j4737j3251M916K291J249J5691J2731j189j1789j0592j398o588
15189a7392k0319L784J167P43p48R227J5337l409j1081j315l180j1038L747J3524
15175b0953J7303k021Q085q696n525J0301K0950p614o091r714j5205o953R451
15162a6682J2053j220r867l908l892J0062M606l53K210k831k093J2169J2236j879
15148A0611q593P499K878j1701j2211K807J7750J966j4709J469K351j691k3210
$$ plain form
15243 8117 -3857 -20006 -18478 -2304 3318 -9619 -26618 -26823 -12140 104 -1096 -4961 -2583
15230 -2583 -5616 -9109 -8733 75 668 -13110 -13751 -2502 4437 2727 -4382 -11638 -4361 -8553 -22763
15215 -22763 -18086 -4785 -6314 -14830 -16374 -24778 -29124 -15818 -23475 -30067 -27400 -16611 248
15202 248 5274 -9463 -22714 -17798 -15507 -14258 1433 14164 12975 1186 -9406 -10804 -17392
15189 -17392 -37711 -33927 -32760 -32017 -32765 -23538 -8201 -11610 -22691 -24006 -27186 -38224 -34477 -20953
15175 -20953 -3650 -5671 2414 -6282 -11807 -1506 19444 11830 5739 -3975 -19180 -26133 -16682
15162 -16682 -4629 -5849 -15716 -19624 -23516 -13454 -8848 -9201 -6991 -9822 -11915 254 12490 10611
15148 10611 2018 9517 12395 694 -11517 -8710 9040 11006 -3703 -2234 117 -1574 -24784
15135b4784j012J6712J2324J507j1355Q039L836N552O480k217j1893n168j9345
15122b1324q712O73O607K132M576J3159N470l710n980R952L010J3479Q79P535
15108B7746j8316m124P451j5503j0948N160r859J1793J2198r059j1236l216P903
15095a0010N692O912O61m304o685o445l878L412J167m910j1342K455J4638J2028
15081f09j5577j5119N776J1439k684p66K88J0002n477q2N162k188l531J3565P662
15066G861j4187p11P965O060j050m326j5106j1504j127M885M98P684J208J0002
15052a848M298j3176n901j0314J643l711L74K3970o602j2671J4723m754m307j060
15038a9336J5333N682j0810j4902l453Q090J5179K527j0209r078K686o002P105
$$ plain form
15135 -24784 -25796 -9084 3240 4747 -6608 1431 5267 10819 17299 15082 3189 -1979 -21324
15122 -21324 -30036 -29363 -22756 -20624 -16048 -2889 2581 -1129 -7109 2843 5853 19332 20211 27746
15108 27746 9430 5306 12757 -2746 -13694 -8534 -18393 -6600 5598 -3461 -14697 -17913 -10010
15095 -10010 -4318 2594 3255 -1049 -7734 -14179 -18057 -14645 -13478 -18388 -29730 -27275 -12637 -609
15081 -609 -16186 -31305 -25529 -14090 -16774 -17540 -17252 -7250 -12727 -12809 -7647 -9835 -13366 199 7861
15066 7861 -6326 -7037 928 6988 5938 1612 -13494 -24998 -26125 -21240 -20742 -13058 -11850 -1848
15052 -1848 2450 -10726 -16627 -26941 -25298 -29009 -28635 -4665 -11267 -23938 -9215 -13969 -18276 -19336
15038 -19336 -4003 1679 -9131 -24033 -27486 -19396 -4217 -1690 -11899 -20977 -18291 -24293 -17188
15025a7188J0207J0767l487J086l350j7875N114l654K551j152P783k846J9646
15012G602K421k2944J3867J3342j0240k324P201M345Q646N119n575j065P186j939
14998B5642M668J8206L5868K0402J8155L9950Q1957J59790K41555J73560O2756
14987H82509m057j80543k54131j57250r6251m4016j4167k667j1034p975j1277
14976I9141j213j9047o902L637q988j5005m239j057J187j1840j5806P419Q79R857
14962C8023n854p762n746m869R002q361j7959j559J9999L601n834o125m452r379
14948g275j5577r538J6022Q946J0933O808q226l579P775j672M965R397r243k707
14934G029P8K043k029Q034M245R239j6600p762J711k705m047K339k329M657n738
$$ plain form
15025 -17188 -6981 3786 299 1385 -1965 -19840 -14726 -18380 -15829 -16981 -9198 -12044 7602
15012 7602 10023 -12921 946 14288 4048 1724 8925 13270 21916 27035 21460 20395 27581 25642
14998 25642 30310 48516 84384 104786 122941 162891 244848 404638 646193 819753 882509
14987 882509 878452 697909 443778 286528 190277 146261 132094 129427 118393 110418 99141
14976 99141 97928 78881 71979 75616 66628 51623 47384 46327 47514 35674 19868 27287 28166 38023
14962 38023 32169 24407 18661 13792 22794 14433 -3526 -5085 14914 18515 12681 6556 2104 -7275
14948 -7275 -22852 -32390 -16368 -7422 3511 10319 2093 -1486 6289 4617 9582 18979 9736 7029
14934 7029 7107 9150 7121 15155 19400 28639 12039 4277 5988 3283 -764 1575 -754 3903 -1835
14919a835j0168J853O242l282o297J6511J9342R071j8728j0023j4911K743P941
14906a541J524j2940j9848n303K1836J7699p446k3020L86N955k230j879Q982J109
14892a6716N619K625k73K53O538j2293p964j4171J2389Q030p435P481J5822Q070
14878G975n048o29L288l657J968P752K897j111l081R179M6p064j1273L358l890
14863G10m401l250j449q102L808J4494P202N328m737K13L456q213n200j616J3283
14848A1526O857n006j1711j2510m1j407Q796J312K2885N810J0978Q460N288K549
14834E3786K495O108J1472O1K969J0856R899J5322K5165K2659K7372K9098K9881
14821B47143K2433N101j2355k3786k8751k4555k9947j2090k5831j6158j7712n53
$$ plain form
14919 -1835 -12003 -10150 -3908 -7190 -13487 3024 22366 31437 12709 2686 -12225 -9482 -1541
14906 -1541 -17 -12957 -32805 -38108 -16272 1427 -6019 -29039 -28653 -22698 -24928 -26807 -17825 -16716
14892 -16716 -11097 -8472 -8745 -8492 -1954 -14247 -22211 -36382 -23993 -15963 -23398 -15917 -95 7975
14878 7975 2927 2298 5586 1929 3897 11649 14546 13435 10354 19533 19579 12515 1242 4600 710
14863 710 -3691 -6941 -8390 -16492 -12684 1810 9012 14340 9603 9816 13272 5059 -141 -1757 11526
14848 11526 18383 13377 1666 -10844 -10885 -12292 -3496 -2184 20701 26511 37489 45949 51237 53786
14834 53786 56281 62389 73861 73922 76891 87747 97646 112968 138133 160792 188164 217262 247143
14821 247143 269576 274677 262322 238536 209785 185230 155283 143193 117362 101204 83492 82939
14809H2939k1295k7510o751Q911M43p879J4241J1552j5544k0135K219J4304p793
14796B7702L866q734Q97n045Q019P513j0517j1083n601r219j0208Q465o67Q070
14782C458J338l321N716j357p884m208M757j1119j2535N028m018N586R336p716
14768a6939O522O843L579q724l774J3226J4665K586j0520Q20o01P943J780n596
14754A1810O800k022k1758q994O176L194J662o711k312o40K432O955M266j6218
14740a5360L17o68L080l021L801J9792j099p619k976k141Q65m714o085j28q52
14725a6808r686R215l641K678k863K611n12k553r115J4439K158P047M267j600
14711d363j7918j3130R654O183O029m195Q649J637J0375j0339m246J332K423J3685
$$ plain form
14809 82939 61644 34134 27383 36294 36737 28858 43099 54651 39107 18972 21191 35495 27702
14796 27702 31568 22834 23731 18686 26705 34218 23701 12618 7017 -2202 -12410 -3945 -4612 3458
14782 3458 4796 1475 7191 5834 -2050 -6258 -1501 -12620 -25155 -20127 -24145 -18559 -9223 -16939
14768 -16939 -10417 -3574 5 -8719 -12493 733 15398 17984 7464 8284 7683 15626 17406 11810
14754 11810 18610 16588 -5170 -14164 -7988 -4794 -3132 -9843 -12155 -12795 -10363 -3408 858 -15360
14740 -15360 -15043 -15711 -12631 -15652 -11851 7941 6842 -777 -3753 -5894 -5029 -9743 -15828 -15956 -16808
14725 -16808 -26494 -17279 -20920 -18242 -21105 -18494 -19006 -21559 -30674 -16235 -14077 -7030 -2763 -4363
14711 -4363 -22281 -35411 -25757 -19574 -13545 -17740 -9091 -7454 2921 -7418 -11664 -10332 -7909 5776
14697E776j818m242K452L138j9183j0150l173N839N327o81M680L89j86M102K067
14682e663j302L27L224J899l461L750J186m148p965Q870J0020n042L640J5935
14668B1270K58j0017J0169m329j6315o54j1689K453K069R065j973K300L585R1
14654F283l339k633J815P62L09J5731m659j3193n350j7282J0426J4773P921J1744
14640B3308M725j5450j0302o344o235n405Q685R156N983L098j691j1276L497K62
14626B011j155j0723j367P011L142N962J1687m737k8519l066n973J843J3022P274
14612c588P94Q480p65J563k809j0280K075n277O888K437n211l331J0820O595n463
14597B928j878J4438J9378p328j8040R106J6694j6317j7042l748j460J058J787
$$ plain form
14697 5776 3958 -284 2168 5306 -13877 -24027 -27200 -21361 -16034 -16715 -12035 -11646 -11832 -7730 -5663
14682 -5663 -6965 -6638 -3414 -1515 -4976 -1226 -40 -4188 -12153 -3283 6737 1695 5335 21270
14668 21270 21528 11511 21680 17351 1036 382 -11307 -8854 -6785 2280 307 2607 6192 6283
14654 6283 2944 311 2126 2888 3197 18928 14269 1076 -4274 -21556 -11130 3643 11564 23308
14640 23308 28033 12583 2281 -4063 -10298 -15703 -7018 2138 8121 11219 9528 -1748 1749 2011
14626 2011 856 -9867 -11234 -4223 -1081 4881 16568 11831 -16688 -19754 -25727 -23884 -10862 -3588
14612 -3588 -2794 5686 4921 6484 3675 -6605 -4530 -9807 -2919 -482 -5693 -9024 1796 8391 2928
14597 2928 1050 15488 34866 27538 9498 18604 35298 18981 1939 -1809 -3269 -2211 -424
14584d24p848J535N580K9710J3775j5613l611o126j2632R261k802k221K904M242
14570A5730J4456R144K712r415J3255K0034L3697M4772M8023O4557P8809L3454
14558C69228J5696r719m1258o0668m9655n2330m9079l7372k5423k705J0885j5929
14546E1671M344Q749j0805l2000P825o127j6639q512l346J046j454J2958M623
14533A2333J3813n825j4113o872R064J1355l624p936j4803q827J4071Q039J361
14520H036j4961j7477J361J0306J9668K1213N339o414k336R364K242J416q010
14507B9747l59r967j2649K064m999J0052J6737N88j2215o752O243P038n172q747
14493A1609j621L210L225p201O661L452m736J321o36J81l045p645L043J8005M777
$$ plain form
14584 -424 -8272 -6737 -1157 28553 42328 26715 23104 16978 4346 13607 10805 8584 11488 15730
14570 15730 30186 39330 42042 32627 45882 65916 99613 144385 192408 256965 335774 369228
14558 369228 384924 375205 333947 273279 223624 171294 122215 84843 59420 56715 67600 51671
14546 51671 56015 64764 53959 21959 29784 23657 7018 -1494 -4840 -3794 -5248 7710 12333
14533 12333 26146 20321 6208 -664 8400 19755 16131 8195 -6608 -15435 -1364 6675 8036
14520 8036 -6925 -24402 -23041 -12735 6933 28146 33485 27071 24735 34099 36341 37757 29747
14507 29747 29388 19421 6772 8836 3837 13889 30626 31214 18999 12247 18490 25528 20356 11609
14493 11609 9988 13198 16423 9222 15883 19335 14599 15920 15284 15465 12420 4775 7818 25823 30600
14478C0600J403r634m612r124l303M260k750J813N522L673L928j1299o054R483
14464A3906Q246J0774k723l655P253K34j2252r039o344J36R67N841l49r78J1488
14449B3505o2o661n950l803K153J3787j1341q835l54J5088R087l040J714k192
14435B3096n161o036N152Q09L613O395J2903l344o833j0730j7547J0706K0369
14422C3392M562L022o637N299L997J1954K0287p632j7255k5989j4344J5163K6450
14409E2269Q578l756O859M734O005m419K4131J8536J0394K1013K2267L3362L6306
14396B36279N0570O9297Q4486J12176J09431Q8503N7123K723o2028q1972q3945
14385E82643r7186q2270n7600m9140n3218k2756l920q605j8819k5689j3271j1238
$$ plain form
14478 30600 32003 22369 17757 8633 5330 9590 6840 8653 14175 17848 21776 10477 4423 13906
14464 13906 22152 32926 30203 26548 33801 34035 21783 12744 6400 6536 7503 13344 12995 12017 23505
14449 23505 23443 16782 10832 7029 9182 22969 11628 2793 2439 17527 26614 23574 25288 23096
14435 23096 17935 11899 17051 17860 21473 27868 40771 37427 30594 19864 2317 13023 33392
14422 33392 37954 40976 34339 39638 43635 55589 75876 68244 50989 25000 10656 25819 52269
14409 52269 60847 57091 63950 68684 74689 70270 94401 112937 123331 144344 166611 199973 236279
14396 236279 286849 356146 440632 552808 662239 750742 807865 810588 748560 666588 582643
14385 582643 485457 403187 345587 296447 243229 220473 216553 207948 189129 163440 150169 138931
14373A38931q652l946p232j9657j4355O070k0320j8890N035k402J1166P267n647
14360F7368r539M837j3581k723O808P075K07m240j5137k683M826N163K136m085
14346D6432j0545n07K1266j0821p732O286k895k546M738l797j0668P124n037N190
14332C6488o211Q153J2219l63k966j7285N46K09l266j684R928P57O641J3908q057
14317D9017P09Q211l866o563J3369J4600K0332J1581m223j800m995j390m074k708
14303H8200Q597o151n15r578j1095j0742o274K678N945p685j2961k358o147Q394
14289D0308O466m27j2700j3238N940J7724n593j2087O666J1032m948m08r045k988
14275B6702L297M902k822L689m484o671j1984k716K2715K6054p878j3510j0991
$$ plain form
14373 138931 130279 126333 119101 99444 85089 91159 70839 51949 56984 54582 65748 73015 67368
14360 67368 57829 62666 49085 46362 53170 60245 60452 56212 41075 38392 43218 48381 50517 46432
14346 46432 35887 35380 56646 45825 38093 44379 41484 38938 43676 39879 29211 36335 31298 36488
14332 36488 30277 38430 50649 50286 47320 30035 30581 30790 27524 25840 35768 36525 43166 57074 49017
14317 49017 49726 57937 54071 47508 60877 75477 95809 107390 103167 101367 96372 94982 90908 88200
14303 88200 96797 90646 90131 80553 69458 58716 52442 55120 61065 53380 40419 38061 31914 40308
14289 40308 46774 46347 33647 20409 26349 44073 38480 26393 33059 44091 39143 38735 29690 26702
14275 26702 29999 34901 32079 35768 31284 24613 12629 9913 32628 58682 50804 37294 26303
14262B6303l867J8627N033j6263p260m144n804j4107j699j022j4528N162J1689
14249a880J9416j0098j0818L474j0829R979J7177J962j2145n011Q991P176O305
14236B3699K776l482P844J3349J2969p543R421J6115J6542k024O457P567K8264
14223A31954K5239L8210L6008L0695K1083N342l295j3242j8407k8833l0520q248
14211A85986l795l4127j7050n394j8444m36j527K570J1881K416K2645N976q152
14198A42549n057J3289Q686q521k2229O455q794j0315k505n570r315j1547k165
14185H4961L789j033Q60p254J804j990j3768k1005R36K17j597o553n915Q734R905
14170E2091k955j70L720p92j1863K372J400R780M489P068k092q340j3284p378
$$ plain form
14262 26303 22436 41063 46096 29833 22573 18429 12625 -1482 -3181 -4203 -18731 -13569 -1880
14249 -1880 17536 7438 -3380 94 -10735 -756 16421 18383 6238 1227 10218 17394 23699
14236 23699 26475 22993 30837 44186 57155 49612 59033 75148 91690 89666 96123 103690 131954
14223 131954 157193 195403 231411 262106 283189 288531 285236 271994 253587 224754 194234 185986
14211 185986 182191 148064 131014 125620 107176 106740 105213 107783 119664 122080 144725 150701 142549
14198 142549 137492 150781 159467 150946 128717 135172 126378 116063 113558 107988 98673 87126 84961
14185 84961 88750 87717 88577 81323 83127 81137 67369 46364 47300 47517 45920 39367 33452 42186 52091
14170 52091 49136 48966 52686 51894 40031 42403 43803 53583 58072 65140 63048 54708 41424 34046
14156C4046n389j8357p567J1781J173Q682J201j3285o951k671R63j925k742j26
14142a167p56m509j7118j0369j1947l1891k0845M83r191K01N200K0949L8000M8437
14128E477K0000Q469O213J0880J865J0806J5991K2540P061K307J4244J15m49r182
14114A16337n303r627j984M756N597m61j3727j3211K227J7271p790j3199m203
14101G6683p241k778k48r015j3136J098N249P729R549j4624n356J3992O604o372
14087F2134j1444j4239k974K228K029J389j394J0242Q817K5670N090R229K6498
14074A23275K3005K0288K4693L8171J5625n82n571J0484J2602K0515L1192J1103
14062C24800j2935k436R052O192M254p42m505j8198O983P501N31Q157N971r025
$$ plain form
14156 34046 28657 10300 2733 14514 15687 24369 25570 12285 5334 2663 3626 1701 -1041 -1167
14142 -1167 -1923 -6432 -23550 -33919 -45866 -77757 -98602 -98119 -107310 -107109 -101909 -80960 -42960 5477
14128 5477 25477 33946 40159 51039 52904 63710 79701 102241 109302 111609 125853 125968 125519 116337
14114 116337 111034 101407 99423 104179 109776 109315 95588 82377 84604 101875 94085 80886 76683
14101 76683 69442 66664 66416 57401 44265 45363 50612 58341 67890 53266 47910 61902 68506 62134
14087 62134 50690 36451 33477 35705 37734 39123 37729 47971 56788 82458 87548 96777 123275
14074 123275 146280 166568 191261 229432 245057 244475 238904 249388 261990 282505 313697 324800
14062 324800 311865 309429 318481 324673 328927 328185 323680 305482 312465 319966 320497 328654 334625 325600
14048C25600l950N133J359J1492M099r849L92J0965J2115Q961o43J7285J5239
14035C98198k323M885n691n356N572J1064O230k937O076K4168J6728L80q656J0093
14021D58431J8253M924j782J3797Q477p100L595R644J5158L0703K4890K6074Q153
14008F13217J7258J8798K0574N2501N5527M5165L3031J9751L9149M1814K8767
13997I85552L8020M1656K3543K2944J7505J9734J4161K5266K0220M6007O6326
13986A320934P9188P4259Q7445Q0374Q8892J15754J14061J45176J50064J43774
13976B399921J65902J89323K13674K25810K59102K93787L23680L61444M00966
13967D833609M57534N27568O24995P25191Q32764R79797J117059J265728J441677
$$ plain form
14048 325600 321650 326783 328142 339634 343733 333884 334276 345241 357356 366317 365674 382959 398198
14035 398198 395875 400760 395069 389713 395285 406349 412579 409642 415718 439886 456614 456994 448338 458431
14021 458431 476684 481608 479826 493623 502100 495000 498595 508239 523397 554100 578990 605064 613217
14008 613217 630475 649273 669847 722348 777875 823040 856071 875822 914971 956785 985552
13997 985552 1023572 1065228 1088771 1111715 1129220 1148954 1163115 1188381 1208601 1254608 1320934
13986 1320934 1400122 1474381 1561826 1642200 1731092 1846846 1960907 2106083 2256147 2399921
13976 2399921 2565823 2755146 2968820 3194630 3453732 3747519 4071199 4432643 4833609
13967 4833609 5291143 5818711 6443706 7168897 8001661 8981458 10098517 11364245 12805922
13958A2805922J645662J857251K139515K539625L212036M219823N791917Q113429
13950D2325180J1229915J4881348J8267864K0131436J9311875J5252689Q252525
13943A49652832k75896q346658j4282713j7274662j7517854j5707042j2917343
13936F3330664j0065711p583002n676045m318356l398351k778833k375632k084907
13928B5049827j888961j710876j579701j442645j297251j157391j030811r19720
13920A4022471q28642p54258o90966o19705n77120n17887m82400m47221m11224
13911H693048l85087l63549l41111l23755l15551k85243k60996k59606k47081
13902E911069k38922k30428k37701k13451j92230j76875j67201j79015j59873
$$ plain form
13958 12805922 14451584 16308835 18448350 20987975 24200011 28419834 34211751 42325180
13950 42325180 53555095 68436443 86704307 106835743 126147618 141400307 149652832
13943 149652832 149376936 141030278 126747565 109472903 91955049 76248007 63330664
13936 63330664 53264953 45681951 40005906 35687550 32289199 29510366 27134734 25049827
13928 25049827 23160866 21449990 19870289 18427644 17130393 15973002 14942191 14022471
13920 14022471 13193829 12439571 11748605 11128900 10551780 10033893 9551493 9104272 8693048
13911 8693048 8307961 7944412 7603301 7279546 6963995 6678752 6417756 6158150 5911069
13902 5911069 5672147 5441719 5204018 4990567 4798337 4621462 4454261 4275246 4115373
13893D115373j53080j58753j12325r2780j21189j07145r5702j04816r1537r2108
13883B985938j00928r5221r3517j09964q5763q0828p5844o6979p0835o2466n8376
13872B085217n9130n2542o1383o6117o1471m3220n5142o1075m8495n1080m7659
13861A477903n4860p6406p9085o2803m7165o7769p3417p0402n3557n0257m6908
13850G95274m2153l1515l2113m4760m7525l1667k2636j7983k6410k0826j6146
13839D61540j1271k7488l6278k4593j8969j5830J1352J0956l5257l0612j3694
13828B69856j3357J996m800j540Q257J2569J4274J2804O750Q718M162J0517J9613
13815C49819J7846l591j4137r977J868J9103J7126J375P01o161q325J005j137
$$ plain form
13893 4115373 3962293 3803540 3691215 3598435 3477246 3370101 3274399 3169583 3078046 2985938
13883 2985938 2885010 2789789 2696272 2586308 2500545 2419717 2343873 2276894 2206059 2143593 2085217
13872 2085217 2026087 1973545 1912162 1846045 1784574 1741354 1686212 1625137 1576642 1525562 1477903
13861 1477903 1423043 1346637 1267552 1204749 1157584 1089815 1016398 945996 892439 842182 795274
13850 795274 753121 721606 689493 644733 597208 565541 542905 524922 498512 477686 461540
13839 461540 450269 422781 386503 361910 342941 327111 338463 349419 314162 283550 269856
13828 269856 256499 258495 253695 252155 260412 272981 287255 300059 306809 315527 319689 330206 349819
13815 349819 367665 364074 349937 339960 341828 360931 378057 379432 380133 373972 365647 366652 365515
13802C65515l811k030j0430j5257M78j271n504q586j3112j0910j0363n761m824
13789B74134J791K756j1711L644j3645q432j2067r762r941Q232R436K405l229
13776B33611M094k085J455R352j4112r314P27n419l659r40j4739k180P225j009
13762B03007r84O268J6651K8622K0875K9147K4208N550P597J5330r419k1491j7139
13749C08222j3071j5784l8035k1907o481n675J853j402j490M693P54N45M627j236
13735B15613j4598n87J4215n419k7121Q656j175r389k204o376j0443K704j0397
13722A53479k389K464o131K174j3728j7751q738M758J727O834p539O94J0505j1061
13708A15298j4903j1494J086R268j416L71p995N2j898m87P997P831q714j0581
$$ plain form
13802 365515 361704 359674 349244 333987 334465 333194 327690 319104 305992 295082 284719 278958 274134
13789 274134 275925 278681 266970 270614 256969 248537 236470 226708 216767 224999 234435 236840 233611
13776 233611 237705 235620 237075 246427 232315 223001 223728 218309 214650 213710 198971 196791 204016 203007
13762 203007 202023 208291 224942 253564 274439 303586 327794 333344 340941 356271 346852 325361 308222
13749 308222 295151 279367 241332 219425 212944 207269 209122 207720 206230 210923 211677 212222 216849 215613
13735 215613 201015 200428 214643 209224 182103 190759 189584 180195 177991 171615 161172 163876 153479
13722 153479 151090 153554 147423 149597 135869 118118 109380 114138 115865 122699 115160 115854 126359 115298
13708 115298 100395 88901 89987 99255 97839 98210 90215 90267 88369 87882 95879 103710 94996 84415
13694H4415O737P775J6913M359r057j6116o68l871j2340L670j203j2756O318R663
13680H3839j880m55L543j7671o739J1477k834j3616L231J241R585J1062q865j2940
13666E8978n709l123k026j3041l003J4441K050M969L049J0385r53k1706j4012
13653C0299N192J1120l607o824l866O219m761O463Q479L414M928K831P382M31
13639F7700r598n991O150J2500J9373p961r369j1976o518o029j1750m118M038
13626C6451m423J51o195Q737J3409J310n444k729l897q63m544j0492J3777J4651
13612D9899p305J6323l136j6517k1923n336K761O37J0479J7742n20m223N650j1164
13598C3367j118M737q722n440N233J4634o957r753n930o782n204J4514L857m589
$$ plain form
13694 84415 91152 98927 115840 120199 111142 95026 94358 90487 78147 81817 80614 67858 74176 83839
13680 83839 81959 81504 85047 67376 60637 72114 69280 55664 58895 60136 69721 80783 71918 58978
13666 58978 53269 50146 48120 35079 32076 46517 48567 53536 56585 66970 66017 44311 30299
13653 30299 35491 46611 43004 36180 32314 38533 33772 40235 48714 52128 57056 59887 67269 67700
13639 67700 58102 52111 58261 70761 90134 82173 72804 60828 54310 48281 36531 32413 36451
13626 36451 32028 32179 25984 34721 48130 49440 43996 41267 37370 36507 31963 21471 35248 49899
13612 49899 42594 58917 55781 39264 17341 12005 14766 15403 25882 43624 43104 38881 44531 33367
13598 33367 32249 36986 28264 22824 28057 42691 35734 25981 20051 13269 8065 22579 26436 21847
13584B1847j3200n61J1564J5699j88j721n111M040j2700j1595J566J0933L638
13571B4211L274Q109K438j2746o122k475J785J7264J4462j766r708j8076m203
13558A6447J435O113j1381j0295j1694P867P770q739r15K814R865N912N015j0244
13544I970r452K002Q499p601q126M905O770J588J899k356M884l728n841O501P912
13529A7826K068j093n726L243J3638R035q470O820J4258k436r709J304p061n447
13515B8250R11J5166N058p030j3224J0508J1707L521O725J953J1168L160R720
13502H7593K3494J4766K1075M4709M5387O2125P2719R8955R6031P5222N2250K2545
13490G16871n956k5389m7143p4506p4229p4415p7048n6759m0018k7352k6287k2165
$$ plain form
13584 21847 8647 8086 19650 35349 35161 33440 28329 32369 19669 8074 9640 20573 24211
13571 24211 27485 35594 38032 25286 19164 16689 18474 35738 50200 48434 38726 20650 16447
13558 16447 17882 23995 12614 2319 -9375 -1508 6262 -2477 -3392 -578 9287 15199 20214 9970
13544 9970 518 2520 11019 3418 -4708 197 6967 8555 10454 8098 12982 9254 3413 9914 17826
13529 17826 19894 18801 13075 16318 29956 38991 30521 37341 51599 49163 39454 40758 33697 28250
13515 28250 29161 44327 49385 42355 29131 39639 51346 54867 61592 63545 74713 77873 87593
13502 87593 111087 125853 146928 191637 237024 299149 371868 470823 566854 642076 694326 716871
13490 716871 710915 685526 638383 563877 489648 415233 338185 281426 241408 214056 187769 165604
13478A65604j3254o680j1175n405j879q079p966j0184k582j4638l150o496M917
13465G9033j3188j8832j4526j5858r52J4020J6400k440O947j2305q582K34L20
13452C0271R13p329q845n201J577q666n982O441N522L943m594j0472J1270M826
13438A3674L092J4612n576k985m760o077Q026J3481m439o493j606j1927j8996
13425i974p290Q201l868p884K164K291J181N108K801j259M732k705Q058K853o519
13410b110N815P09J834L489r959K268l817O642k723m679o154L191J2687k167p652
13395b626J738n629r04K796N935j493J1878R861m146j5854m157J0217R686J957
13381A9259k2880k8n669j096J647Q632Q43n260l980N547q8q577p633L539J40P812
$$ plain form
13478 165604 152350 145670 134495 129090 127211 119132 111166 100982 98400 83762 80612 74116 79033
13465 79033 65845 47013 32487 16629 15677 29697 46097 43657 50604 38299 29717 29951 30271
13452 30271 31184 23855 15010 9809 11386 2720 -3262 3179 8701 12644 8050 -2422 8848 13674
13438 13674 16766 31378 25802 22817 18057 11980 20006 33487 29048 22555 20949 9022 -9974
13425 -9974 -17264 -9063 -12931 -20815 -18651 -16360 -15179 -10071 -7270 -8529 -3797 -6502 1556 4409 -2110
13410 -2110 3705 4414 6248 9737 -222 2046 -1771 4871 2148 -2531 -8685 -5494 7193 5026 -2626
13395 -2626 -888 -6517 -7421 -4625 1310 -183 11695 21556 17410 1556 -2601 7616 17302 19259
13381 19259 -3621 -3649 -9318 -10414 -8767 -135 708 -4552 -8532 -2985 -3073 -11650 -19283 -15744 -15604 -7792
13365g792M962J5054Q474l808r986k477J6190Q189l380p374p951n635L407R177
13351A7050J2922K5348J2038k339J3940R839m960k2030j5948n112q409j4781n687
13338A1871M278n118K920j584l402Q042l442m719k717j2334N925P652j6337p365
13324a6330O34J3059J0716j0847j560o47N484M856n460N206k863K162j0657J0044
13310C797N470p564m700o566P416n030K099p008L324l547P905Q091p71j0472n767
13295a3323l110M219J937K928M354J9811Q593j3516r279R257R402o362k116j0822
13281A973o625L908J909j1896j0082J4409Q647j372j9174J616N564O171N346O187
13267F581J7669n803k2451j853O568N89n908J3197R244j6489j1877O484J6936
$$ plain form
13365 -7792 -2830 12224 20698 16890 6904 4427 20617 28806 25426 18052 10101 4466 7873 17050
13351 17050 29972 55320 67358 65019 78959 88798 83838 61808 45860 40748 32339 17558 11871
13338 11871 16149 11031 13951 12367 8965 17007 13565 8846 6129 -6205 -280 7372 -8965 -16330
13324 -16330 -15696 -2637 8079 -2768 -4328 -4975 509 5365 -95 5111 2248 4410 -6247 3797
13310 3797 9267 1703 -2997 -9563 -2147 -7177 -5078 -12086 -8762 -12309 -4404 3687 2916 -7556 -13323
13295 -13323 -16433 -12214 -10277 -7349 -2995 16816 25409 11893 2614 11871 21273 14911 12795 1973
13281 1973 -4652 -744 1165 -10731 -20813 -6404 2243 871 -18303 -16687 -11123 -4952 394 6581
13267 6581 24250 18447 -4004 -5857 711 1300 -4608 8589 17833 1344 -10533 -4049 12887
13254A2887J19k986n91K177n21q547m786M678j2252o465m766O119M156r332q082
13239b8192o526R688P908p16q761j810J6505J788q105K852j1615l327J5144J6380
13225A213P424j820L431J3457m933j1125L954J2327J473N386J2587l028j0815
13212B9531r54m063q366p440p03n463Q761p634k069o507J474M124O276O064q028
13197E003r759J1170K0772j704j4538r819p424m240M267O416K959j1530r221J0394
13183g254r948m15J0360n207o792M952P701R364k894o039k38J1678P41R147j301
13168A3855k0609k8083j1046O878R982P532K2322M070R144l775q234q497r448
13155a5909n971Q125Q133L359p882M164Q251J4357l865k6411j6616k917J2005
$$ plain form
13254 12887 13006 10020 9429 11606 11085 2538 -2248 2430 -9822 -16287 -21053 -14934 -10778 -20110 -28192
13239 -28192 -34718 -25030 -17122 -17838 -26599 -28409 -11904 -10116 -18221 -15369 -26984 -30311 -15167 1213
13225 1213 8637 6817 10248 23705 18772 7647 11601 23928 25401 30787 43374 40346 29531
13212 29531 28577 24514 16148 8708 8005 2542 11303 3669 1600 -4907 -3433 691 6967 13031 5003
13197 5003 -4756 6414 27186 25482 10944 1125 -6299 -10539 -6272 144 3103 -8427 -17648 -7254
13183 -7254 -17202 -17617 -7257 -12464 -19256 -14304 -6603 2761 -133 -6172 -6410 5268 6009 15156 13855
13168 13855 -6754 -34837 -45883 -39005 -29023 -21491 831 4901 14045 10270 2036 -6461 -15909
13155 -15909 -21880 -13755 -5622 -2263 -10145 -5981 2270 16627 12762 -13649 -30265 -33182 -21177
13142b1177N748p727o015O772O273K0821j0239m748P856K807m432O072L559P4
13128E644j3636q81N471Q643J004M257r106J664k055p054m214m959k737J2633
13114e326J4536L498o019j1039O430P280k406j2001M36M936R025L346P813j5256
13100E253l620N108j90n239r23j2241J2870J4519q271j9598P50Q723J417K118
13086F76P312L878o154k3787j4151n707J3665M261n730j162M224L07R71P154K3820
13071I577O989o273j5040K834R0R991o593j3955l855R295N49O118j306J708m74
13056c45j044m001J0740n704L462R856J368r819J1417j978q230P115L283k488
13042A3632L432r845j4784O856K430j847m409n069R164J2222o911m686Q325M63
$$ plain form
13142 -21177 -15429 -23156 -29171 -22399 -16126 4695 -5544 -10292 -2436 371 -4061 2011 5570 5644
13128 5644 -7992 -8873 -3402 5241 6245 10502 1396 3060 1005 -6049 -10263 -15222 -17959 -5326
13114 -5326 9210 12708 6689 -4350 2080 9360 6954 -5047 -4611 325 9350 12696 20509 5253
13100 5253 1633 6741 6551 1312 389 -11852 1018 15537 7266 -12332 -11582 -2859 -1442 676
13086 676 7988 11866 5712 -18075 -32226 -37933 -24268 -20007 -25737 -26899 -22675 -22368 -21397 -14243 9577
13071 9577 16566 10293 -4747 -1913 -1823 8168 1575 -12380 -16235 -6940 -6391 -273 -1579 129 -345
13056 -345 -1389 -5390 5350 -354 3108 12964 14332 4513 15930 13952 5722 12837 16120 13632
13042 13632 17064 7219 -7565 -709 1721 -126 -4535 -9604 -440 11782 4871 185 8510 8973
13028H973m393O990Q010J949j3731q365k368k012k383R890R700m894j0234r109
13014a1977N681J597L720P647o467k379O351k072R24n974r57J9677J335j0687
13000F419n728K055P926J6241K0391n192k4021j4859j1137l646Q340J4069J000
12987A1858p838m545O455p705j0776P930L39K08l505J0616M291o807Q696j994
12973G223j9361k821J5729L285Q737J3066p707M363K334J0055l434k1795L98J9
12959A0091j1077N424R637L236K50k780O09J130m34N636j1207j6180j171R604
12945B768p846j1429M994J06R69M882J156o426J948N852O464J5585j135n607k113
12930A0168L223j192J2452k00k275P679O338J285o775j0473k023P784L45m458
$$ plain form
13028 8973 4580 11570 19580 21529 7798 -567 -2935 -4947 -7330 2560 12260 7366 -2868 -11977
13014 -11977 -6296 -4699 -979 6668 201 -2178 4173 2101 3025 -2949 -3906 15771 17106 6419
13000 6419 691 2746 10672 26913 47304 42112 18091 3232 -7905 -11551 -3211 10858 11858
12987 11858 4020 -525 5930 -1775 -12551 -4621 -4282 -4074 -7579 3037 7328 521 9217 7223
12973 7223 -12138 -14959 770 4055 12792 25858 18151 22514 24848 34903 31469 9674 10072 10091
12959 10091 -986 4438 14075 17311 17561 14781 15390 16520 16086 21722 10515 -5665 -6836 2768
12945 2768 -5078 -16507 -11513 -11407 -10438 -5556 -4400 -10826 -8878 -3026 3438 19023 17888 12281 10168
12930 10168 13391 12199 24651 24451 22176 29855 36193 37478 30703 20230 18207 25991 26336 21878
12916B1878J705M410K574J1990J5653M586j090K765m266m966m986l624P552J7916
12902G2097P67k097o554Q234N269k528o804L871j453q288q065j051j4135p423
12888C1840J6320K0845K0131n727K688J1065K1496O043p115r467Q439Q789n631
12875A19716q147M797L645J1659J567j29L137N734P591J2944L4p791O77J520N60
12860A57514L041J716l031p586N559L502j4817j9800j3467K984J3024J0102j0683
12847A28058j0728J8795o616o971m747k0433j2928R024K325Q854L260q354J673
12834A01212P984p582o182M600j65j2681l78j168j3395K671l559m63O913P189
12820H4996r849l233J8353j689o202m812M578J1427L684j0137o998n648r306M119
$$ plain form
12916 21878 23583 27993 30567 42557 58210 62796 61706 64471 60205 55239 50253 46629 54181 72097
12902 72097 72864 70767 64213 72447 77716 75188 68384 72255 70802 62514 54449 53398 39263 31840
12888 31840 48160 69005 89136 83409 86097 97162 118658 124701 117586 108119 116558 125347 119716
12875 119716 111569 116366 120011 131670 133237 133108 136245 141979 149570 162514 162548 154757 155434 156954 157514
12860 157514 160555 162271 159240 151654 157213 160715 145898 126098 112631 115615 128639 138741 128058
12847 128058 117330 136125 129509 122538 117791 97358 84430 93454 95779 104633 107893 99539 101212
12834 101212 109196 101614 95432 100032 99867 87186 86808 85640 72245 74916 71357 70894 77807 84996
12820 84996 75147 71914 90267 88578 82376 77564 82142 93569 97253 87116 80118 74470 65164 69283
12806F9283m648o450J922k598J147J2654N123r498j0309o996J2185p043r750p14
12792D4308p066J001q584R776N207n599j5468k073O891l666J2858P414l689K309
12778D3619j1711l513K8494Q673j5373j4406N932j4643o098K004N779n587P051
12765C0221K079q823p645K551J2268m740L1R62J522P066j643J0102J8341r54j6898
12750D4440r301M375j0785M704J6673l654m983K748Q903j1187k7195R21P079j2282
12736A0456j1718o618R617K3301J0563J5427J0135Q32Q373O669r743j0235p269
12723D9790j9J1816N196O369N199J838K5876K6116Q162K092J8487L9933N5466
12710B56321O0343Q3660J00124J02804J04123O6823K9414l873l8523p3424r2172
$$ plain form
12806 69283 64635 58185 60107 57509 58656 71310 76433 66935 56626 49630 61815 54772 45022 44308
12792 44308 37242 38243 29659 39435 44642 39043 23575 21502 28393 24727 37585 44999 41310 43619
12778 43619 31908 28395 56889 65562 50189 35783 41715 27072 20974 22978 28757 23170 30221
12765 30221 32300 23477 15832 18383 30651 25911 25942 26904 28426 35492 33849 43951 62292 61338 44440
12750 44440 35139 39514 28729 33433 50106 46452 41469 44217 53120 41933 14738 15659 22738 10456
12736 10456 -1262 -7880 1737 25038 35601 51028 61163 61995 70368 77037 67294 57059 49790
12723 49790 49771 61587 66783 73152 78351 80189 106065 132181 140343 142435 160922 200855 256321
12710 256321 316664 400324 500448 603252 707375 774198 803612 799739 761216 687792 595620
12699E95620j02433r7166o4820m4912l4459k8754l1119j945j2474j3167j332j4101
12687A48938j7383o214j4991j0448o276o845J794M369m143j2080K430j463J932
12674G9620J2425n703j1481k1831j7628j5756N087K1629J154n307m702n529j494
12661C0484k880l004P773N937j299j13r066J937N706N901j450J602j4074j2402
12647A5052J7759J5713m939l250l999m961M963j0686K237J1862Q698N513j615
12634E2347j3639m749J0726l579m427K303p736j4332q516L039J0201N4L975l927
12620B1740p225o766j1607ML505J5686J5796r2Q131l27o749N266K878o863j1950
12605B1427n012q832K776k870m428M942j580k0385n986R825k856J910R965N090
$$ plain form
12699 595620 493187 396021 331201 286289 251830 223076 191957 190012 177538 164371 163039 148938
12687 148938 131555 125341 110350 99902 93626 86781 88575 92944 88801 76721 79151 77688 79620
12674 79620 92045 86342 74861 53030 35402 19646 24733 46362 47516 42209 37507 31978 30484
12661 30484 27604 24600 32373 38310 37011 36898 27832 29769 35475 41376 39926 41528 27454 15052
12647 15052 32811 48524 43585 40335 36336 31375 36338 25652 27889 39751 48449 53962 52347
12634 52347 38708 33959 44685 41106 36679 38982 31246 16914 8398 11437 21638 21692 25667 21740
12620 21740 14515 7749 -3858 -3854 -349 15337 31133 31041 39172 38845 32096 37362 40240 33377 21427
12605 21427 16415 7583 10359 7489 3061 8003 6423 -13962 -19948 -10123 -12979 -11069 -1104 3986
12591C986M933q943j23o267Q744o63K646m140n305J0594P435Q331R69m605j6463
12576A129K583J3036k83p095m087J234n132K105J0838K4563k24L81J2288p764
12562D3572J355q640n878N35J0193J4268N599q635J229K79p161j1139M819N313
12548D5709J1251K0970J8796J6325l47n778o1k356L767M764J118q022K661m986
12534A03811p37j7710q874n475j641J812j863j1227M035N529O705J3328J993o316
12520H3370o545l010o891r163n273Q045j0610j0782P68o897k902J2999M511o580
12506D1040L145J5779J814j2822j6384n40k876n506O367j0156K129m730o812j4747
12492d299j1794j3261m245J0180P437K473L081o57j8106j5908k0166k3109j4558
$$ plain form
12591 3986 8919 -24 -147 -6414 2330 1667 4313 173 -5132 5462 12897 21228 22197 17592 1129
12576 1129 3712 16748 16465 9370 5283 6517 1385 3490 14328 38891 38667 39048 51336 43572
12562 43572 44927 36287 30409 30944 41137 55405 61004 52369 53598 53877 46716 35577 40396 45709
12548 45709 56960 77930 96726 113051 112704 106926 106865 104509 108276 113040 114158 106136 108797 103811
12534 103811 103074 85364 76490 71015 69374 71186 69323 58096 62131 67660 74365 87693 89686 83370
12520 83370 76825 73815 66924 57761 52488 60533 49923 39141 39909 33012 30110 43109 47620 41040
12506 41040 44185 59964 61778 48956 32572 32032 29156 23650 30017 19861 21990 17260 10448 -4299
12492 -4299 -16093 -29354 -33599 -23419 -15982 -13509 -10428 -11085 -29191 -45099 -65265 -88374 -102932
12479a02932j0643O613P731P033L1568K2827K2152J2489L269J3053N291J8640
12467C7091K7105O780P892M408J6509J4093K661L572J172j7157j3729j1102j4376
12454F4919O168J3822J746j6929p201J7450j1994m621q450j1228l537M306j8341
12441B6110l624q060j2823L495J6185J9389k787n701p18K745k50J0066R237P080
12427F0344m590K036k283J200J2932o58m67J169L3062M9826M2589K8799K0715
12414B44674J0025J1285j1077r889J5868J8605J0085K194Q354J6444J4517n338
12402C25747p283M643Q729R004r909k4069m161j0217R268J3238L418m254j515
12389C12639j3204Q600K0412P186O388k979l005o107o964K7630J7994m9K134k2199
$$ plain form
12479 -102932 -113575 -106962 -99231 -92198 -60630 -37803 -15651 -3162 107 13160 18451 37091
12467 37091 64196 70976 78868 83276 99785 113878 116539 120111 121283 104126 90397 79295 64919
12454 64919 71087 84909 86655 69726 62525 79975 67981 63360 54910 43682 40145 44451 26110
12441 26110 22486 14426 1603 5098 21283 40672 37885 32184 31466 34211 33961 44027 53264 60344
12427 60344 55754 57790 55507 56707 69639 68981 68514 69683 102745 152571 195160 223959 244674
12414 244674 254699 265984 254907 245018 260886 279491 289576 291770 300124 316568 331085 325747
12402 325747 318464 323107 331836 340840 330931 306862 302701 292484 301752 314990 318408 314154 312639
12389 312639 299435 308035 328447 335633 342021 339042 336037 329930 322966 350596 368590 368541 370675 348476
12375C48476J4066J6417J2730J5961p278R927Q296o005m387o728q310p771J2272
12362C97666J2134n038M046K300J1318J6118J2163K1045K5568J2972J3202J8849
12350E42343K0717K8807L2958L3061L7744M3301L1974K1983K4374K4526J6741
12339H58529J2284J4845J1754J0074J8422J9088R319L0686M3161M0135M8313O3364
12327A179974O6280O6187R7585J06973J07885J24709J47169J57646J90556K22251
12317B467215K23280K54042L05930L58738M11347M70027N53838O57077P89544
12308F491038R30043J074208J211445J316198J394861J421570J433390J514048
12300A6786801J694391K140057K993691M437337O719121R996673J4237640J8927155
$$ plain form
12375 348476 362542 378959 391689 407650 400372 410299 418595 412590 408203 401475 393165 385394 397666
12362 397666 409800 404762 408808 411108 422426 438544 450707 471752 497320 510292 523494 542343
12350 542343 563060 591867 624825 657886 695630 738931 770905 792888 817262 841788 858529
12339 858529 870813 885658 897412 907486 925908 944996 954315 985001 1028162 1068297 1116610 1179974
12327 1179974 1246254 1312441 1410026 1516999 1624884 1749593 1896762 2054408 2244964 2467215
12317 2467215 2690495 2944537 3250467 3609205 4020552 4490579 5044417 5701494 6491038
12308 6491038 7421081 8495289 9706734 11022932 12417793 13839363 15272753 16786801
12300 16786801 18481192 20621249 23614940 28052277 34771398 44768071 59005711 77932866
12292G7932866K2921552K4558707K2414482J5810014N427411o237820j6325861
12285A46501351k2463688k3743995k0986523j6275689j1642213q045563n538049
12278C7805631l863311k739277k053474j677376j542831j555300j627798j706101
12270B1040163j690493j585682j429186j250775j071373r33092p95134o89698
12262A1594730o17306n66217n21573m73103m32749m13512l91914l48507l07751
12253G522098l19816l15637k99250k92361k70901k51845k45794k43400k10598
12244E072496k15416j94038j85010j68856j50986j40693j45040j37130j25748
12235C609579j09575j13054j02309j03187r5121r5286r6812r0053q9454j06214
$$ plain form
12292 77932866 100854418 125413125 147827607 163637621 169065032 162827212 146501351
12285 146501351 124037663 100293668 79307145 63031456 51389243 43343680 37805631
12278 37805631 33942320 31203043 29149569 27472193 25929362 24374062 22746264 21040163
12270 21040163 19349670 17763988 16334802 15084027 14012654 13079562 12284428 11594730
12262 11594730 10977424 10411207 9889634 9416531 8983782 8570270 8178356 7829849 7522098
12253 7522098 7202282 6886645 6587395 6295034 6024133 5772288 5526494 5283094 5072496
12244 5072496 4857080 4663042 4478032 4309176 4158190 4017497 3872457 3735327 3609579
12235 3609579 3500004 3386950 3284641 3181454 3086333 2991047 2894235 2804182 2714728 2608514
12225B608514p8711p2169p8292p7485p5696o1327n9437p6679o6160n6556o4721
12214A841281n3206m7478m3093m8390m2389l3944m7715n9047o8539p4185p4731
12203A248564p3073o1057p8333n9402m4217o4848p6284n7119l7381k8597l6910
12192F31343l7556k4258l6214l6563l5381k0955J357k3897j5517j3307l142r678
12180C76232k0863l3118j1052j8559j6136j0982k0028k4180j9741N590K1823K1873
12168B50859M925P637J9004L271p661J5644K5761J7602M539J7343K265Q26J866
12155C63881M655K584j8969j7677n925L625NN263O64O011n318l087P282j3974
12141C29020j7596m510L995k907m916j484q798K459j730P790k027k2495n605k4121
$$ plain form
12225 2608514 2529803 2457634 2379342 2301857 2226161 2164834 2105397 2028718 1962558 1906002 1841281
12214 1841281 1788075 1740597 1697504 1649114 1606725 1572781 1525066 1466019 1397480 1323295 1248564
12203 1248564 1175491 1114434 1036101 976699 932482 867634 791350 734231 696850 668253 631343
12192 631343 593787 569529 533315 496752 461371 440416 441773 417876 402359 389052 385910 376232
12180 376232 355369 322251 311199 292640 276504 265522 245494 221314 201573 207163 228986 250859
12168 250859 255784 263421 282425 285696 278035 293679 319440 337042 341581 358924 361189 362015 363881
12155 363881 368536 371120 352151 334474 328549 332174 332179 337442 338106 344117 338799 335712 342994 329020
12141 329020 311424 306914 310909 308002 303086 301602 292804 295263 293533 301323 299296 276801 271196 247075
12127B47075j5364j2485m690L562P016p174q492m13j925j2153j3431j9733j6657
12114A45136P496N579M093R44M978K3789O768K21L575P592K6670L7247L4182K8775
12100C37045J1895k116P985m981k0133k5062k5347j7363j9450k3076o066O238
12088B19569p94o248j2764P410Q430N362J876p104k643P8N54q55p631J061M609
12073B10910j8592m389k6966o137k217R428m248o698P020N600O751l152j6424
12060A50886j848j4146q220M301n614j6253j2066L074j0897k662p197o446m403
12047F8509q377J4616j1756J489L2831q462j4002p801J4027n107l554J770M153
12034G8336N065l75K456k377k461r018n926j2601o112J3780J4951J657o378J2026
$$ plain form
12127 247075 231711 219226 214536 218098 225114 217940 209448 209035 207110 194957 181526 161793 145136
12114 145136 152632 158211 162304 163248 168226 192015 198783 199004 202579 210171 236841 274088 308270 337045
12100 337045 348940 346824 354809 349828 329695 304633 279286 261923 242473 219397 213331 219569
12088 219569 218775 212527 199763 207173 215603 220965 222841 215737 213094 213172 213726 212871 205240 206301 210910
12073 210910 192318 187929 160963 154826 152609 162037 157789 151091 158111 163711 170462 167310 150886
12060 150886 149038 134892 126672 130973 125359 109106 97040 100114 89217 86555 79358 72912 68509
12047 68509 60132 74748 62992 64481 97312 88850 74848 67047 81074 75967 72413 74183 78336
12034 78336 83401 83026 85482 83105 80644 71626 65700 53099 46987 60767 75718 77375 70997 83023
12020H3023O885M706L782o129k362j3064n284J8493Q858j1801r720M329Q477j201
12006H8992j2123j7339N162k113J227J1974p407k3585j2969M265J4901J0638l699
11993E7924j1660J5764Q58k670l146n646M548K808J326Q052J6078J8795r180k3257
11979G0594j0960L71j4473o510j764O360j3261l527J5827j221m386o056J0593
11966D1587J1340n247k247l112M288k081N913J3793o091j0649j5056r437J6965
11953C9966N838r371j1573j3865J0366J5580J3685N552l093j1409k380j1202L025
11940C1119J060j1349J4959O061J971K274o129p652R116j5054j8729k936J3519
11927A8230P440J3758n613k26R464Q930R673M193j0618r900l885j1624J1888J2497
$$ plain form
12020 83023 89908 94614 98396 92267 89905 76841 71557 90050 98908 87107 77387 81716 90193 88992
12006 88992 76869 59530 64692 62579 63806 75780 68373 44788 31819 36084 50985 61623 57924
11993 57924 46264 62028 62886 60216 57070 51424 55972 58780 60106 68158 84236 103031 93851 70594
11979 70594 59634 60005 45532 39022 37258 43618 30357 26830 42657 41436 37050 30994 41587
11966 41587 52927 47680 45433 42321 46609 44528 50441 64234 58143 47494 32438 23001 39966
11953 39966 45804 36433 24860 10995 21361 36941 50626 56178 53085 41676 39296 28094 31119
11940 31119 32179 20830 35789 41850 43821 46095 39966 32314 41430 26376 7647 4711 18230
11927 18230 25670 39428 33815 33589 43053 51983 61656 65849 55231 45331 41446 29822 41710 54207
$$ [...]
##END NTUPLES=NMR SPECTRUM
##END=
