##TITLE=Analysis number 318281
Compound Code cc 13012
Book Reference 473/111
Project Code adrs
Chemist Name janea
##JCAMPDX= 6.0         $$ Bruker NMR JCAMP-DX V2.0
##DATA TYPE= NMR SPECTRUM
##DATA CLASS= NTUPLES
##ORIGIN= Bruker BioSpin GmbH
##OWNER= nmr
$$ XWIN-NMR		Version 3.5
$$ Wed Mar 22 12:46:03 2006 GMT Standard Time (UT+0h)  MAYBRIDGE\nmr@NMR_250MHZ
##.OBSERVE FREQUENCY= 250.131544655141
##.OBSERVE NUCLEUS= ^1H
##.ACQUISITION MODE= SIMULTANEOUS (DQD)
##.ACQUISITION SCHEME= undefined
##.AVERAGES= 16
##.DIGITISER RES= 18
##SPECTROMETER/DATA SYSTEM= dpx250
##.PULSE SEQUENCE= zg30
##.SOLVENT NAME= DMSO
##.SHIFT REFERENCE= (INTERNAL, DMSO, 0, 16.522)
##AUDIT TRAIL= $$ (NUMBER, WHEN, WHO, WHERE, WHAT)
$$ ##TITLE= Audit trail, XWIN-NMR		Version 3.5
$$ ##JCAMPDX= 5.01
$$ ##ORIGIN= Bruker BioSpin GmbH
$$ ##OWNER= nmr
$$ C:\u/data/dgb/nmr/ADRS/1140/pdata/1/auditp.txt
$$ ##AUDIT TRAIL=  $$ (NUMBER, WHEN, WHO, WHERE, WHAT)
(   1,<2006-03-22 12:44:57.71 +000>,<MAYBRIDGE\nmr>,<NMR_250MHZ>,
      <created by zg, POWCHK disabled, PULCHK disabled
       configuration hash MD5:
       84 BC 41 DB A1 6E 1D 46 DA 25 12 A5 C1 ED C5 3A
       data hash MD5: 64K
       97 38 F7 A1 57 33 28 BE 83 42 61 E5 73 97 4A C3>)
(   2,<2006-03-22 12:45:26.48 +000>,<MAYBRIDGE\nmr>,<NMR_250MHZ>,
      <Start of raw data processing
       ef LB = 0.3 FT_mod = 6 PKNL = 1 SI = 32K 
       data hash MD5: 32K
       97 97 D9 8A 57 FE 7A D6 38 89 48 2E F4 79 AA 1C>)
(   3,<2006-03-22 12:45:38.82 +000>,<MAYBRIDGE\nmr>,<NMR_250MHZ>,
      <apk 
       data hash MD5: 32K
       19 A6 D5 25 3C 14 F0 EE 9B B5 2F 32 04 8B 57 B0>)
(   4,<2006-03-22 12:45:41.90 +000>,<MAYBRIDGE\nmr>,<NMR_250MHZ>,
      <abs ABSG = 5 
       data hash MD5: 32K
       09 AA 58 BF D9 D8 48 DD 14 11 D9 50 62 B2 4C 88>)
$$ ##END=
$$ 
$$ hash MD5
$$ 8F 3F D3 CB 25 DA D5 DB 65 47 23 18 F8 25 DB 1F
##$RELAX= 
##$RELAX= 
##$RELAX= 
##$RELAX= 
##$RELAX= 
##$RELAX= 
##$RELAX= 
$$ Bruker specific parameters
$$ --------------------------
##$DU= <C:\u>
##$EXPNO= 1140
##$NAME= <ADRS>
##$PROCNO= 1
##$TYPE= <nmr>
##$USER= <dgb>
##$AMP= (0..31)
100 100 100 100 100 100 100 100 100 100 100 100 100 100 100 100 100 100 
100 100 100 100 100 100 100 100 100 100 100 100 100 100 
##$AQSEQ= 0
##$AQ_mod= 3
##$AUNM= <au_zg>
##$AUTOPOS= <27 >
##$BF1= 250.13
##$BF2= 250.13
##$BF3= 250.13
##$BF4= 250.13
##$BF5= 500.13
##$BF6= 500.13
##$BF7= 500.13
##$BF8= 500.13
##$BYTORDA= 1
##$CFDGTYP= 0
##$CFRGTYP= 5
##$CHEMSTR= <none>
##$CNST= (0..31)
1 1 145 1 1 1 1 1 1 1 1 1 1 1 1 1 1 1 1 1 1 1 1 1 1 1 1 1 1 1 1 1 
##$CPDPRG= <>
##$CPDPRG1= <>
##$CPDPRG2= <>
##$CPDPRG3= <>
##$CPDPRG4= <mlev>
##$CPDPRG5= <mlev>
##$CPDPRG6= <mlev>
##$CPDPRG7= <mlev>
##$CPDPRG8= <mlev>
##$CPDPRGB= <>
##$CPDPRGT= <>
##$D= (0..31)
0 1 0 0 0 0 0 0 0 0.06 0 0 0 0 0 0 0.0002 0 0 0 0 0 0 0 0 0 0 0 0 0 0 
0 
##$DATE= 1143031492
##$DBL= (0..7)
120 120 120 120 120 120 120 120 
##$DBP= (0..7)
150 150 150 150 150 150 150 150 
##$DBP07= 0
##$DBPNAM0= <>
##$DBPNAM1= <>
$$ [...]
##$SUBNAM7= <"">
##$SUBNAM8= <"">
##$SUBNAM9= <"">
##$SW= 20.6930455092707
##$SWIBOX= (0..15)
0 0 3 0 0 0 0 0 0 0 0 0 0 0 0 0 
##$SW_h= 5175.983436853
##$TD= 65536
##$TD0= 1
##$TE= 294.16
##$TE2= 300
##$TE3= 300
##$TEG= 300
##$TL= (0..7)
0 120 120 120 120 120 120 120 
##$TP= (0..7)
150 150 150 150 150 150 150 150 
##$TP07= 0
##$TPNAME0= <>
##$TPNAME1= <>
##$TPNAME2= <>
##$TPNAME3= <>
##$TPNAME4= <>
##$TPNAME5= <>
##$TPNAME6= <>
##$TPNAME7= <>
##$TPOAL= (0..7)
0.5 0.5 0.5 0.5 0.5 0.5 0.5 0.5 
##$TPOFFS= (0..7)
0 0 0 0 0 0 0 0 
##$TUNHIN= 0
##$TUNHOUT= 0
##$TUNXOUT= 0
##$USERA1= <user>
##$USERA2= <user>
##$USERA3= <user>
##$USERA4= <user>
##$USERA5= <user>
##$V9= 5
##$VALIST= <valist>
##$VCLIST= <CCCCCCCCCCCCCCC>
##$VD= 0
##$VDLIST= <DDDDDDDDDDDDDDD>
##$VPLIST= <PPPPPPPPPPPPPPP>
##$VTLIST= <TTTTTTTTTTTTTTT>
##$WBST= 1024
##$WBSW= 4
##$XGAIN= (0..3)
0 0 0 0 
##$XL= 0
##$YL= 0
##$YMAX_a= 310606
##$YMIN_a= -480416
##$ZGOPTNS= <>
##$ZL1= 120
##$ZL2= 120
##$ZL3= 120
##$ZL4= 120
##$ABSF1= 16.522
##$ABSF2= -4.171173
##$ABSG= 5
##$ABSL= 3
##$ALPHA= 0
##$AQORDER= 0
##$ASSFAC= 0
##$ASSFACI= 0
##$ASSFACX= 0
##$ASSWID= 0
##$AUNMP= <proc_1d>
##$AZFE= 0.1
##$AZFW= 0.1
##$BCFW= 0
##$BC_mod= 0
##$BYTORDP= 0
##$COROFFS= 0
##$CY= 12.5
##$DATMOD= 1
##$DC= 0
##$DFILT= <>
##$DTYPP= 0
##$F1P= 14.0000005364418
##$F2P= -0.99999901652339
##$FCOR= 0.5
##$FTSIZE= 32768
##$FT_mod= 6
##$GAMMA= 0
##$GB= 0
##$INTBC= 1
##$INTSCL= 1
##$ISEN= 128
##$LB= 0.3
##$LEV0= 0
##$LPBIN= 0
##$MAXI= 10000
##$MC2= 0
##$MEAN= 0
##$ME_mod= 0
##$MI= 0
##$NCOEF= 0
##$NC_proc= -5
##$NLEV= 6
##$NOISF1= 0
##$NOISF2= 0
##$NSP= 0
##$NTH_PI= 0
##$NZP= 0
##$OFFSET= 16.522
##$PC= 1
##$PHC0= 161.2817
##$PHC1= 13.34252
##$PH_mod= 1
##$PKNL= yes
##$PPARMOD= 0
##$PSCAL= 4
##$PSIGN= 0
##$REVERSE= no
##$SF= 250.13
##$SI= 32768
##$SIGF1= 0
##$SIGF2= 0
##$SINO= 400
##$SIOLD= 32768
##$SREGLST= <1H.DMSO>
##$SSB= 0
##$STSI= 32768
##$STSR= 0
##$SW_p= 5175.98343685301
##$SYMM= 0
##$S_DEV= 0
##$TDeff= 65536
##$TDoff= 0
##$TI= <Analysis number 999999
Compound Code 99
Book Reference 9
Project Code 9>
##$TILT= no
##$TM1= 0
##$TM2= 0
##$TOPLEV= 0
##$USERP1= <user>
##$USERP2= <user>
##$USERP3= <user>
##$USERP4= <user>
##$USERP5= <user>
##$WDW= 1
##$XDIM= 32768
##$YMAX_p= 291250991
##$YMIN_p= -547957
$$ End of Bruker specific parameters
$$ ---------------------------------
##NTUPLES= NMR SPECTRUM
##VAR_NAME=  FREQUENCY,     SPECTRUM/REAL,   SPECTRUM/IMAG
##SYMBOL=    X,             R,               I
##VAR_TYPE=  INDEPENDENT,   DEPENDENT,       DEPENDENT
##VAR_FORM=  AFFN,          ASDF,            ASDF
##VAR_DIM=   32768,         32768,           32768
##UNITS=     HZ,            ARBITRARY UNITS, ARBITRARY UNITS
##FACTOR=    0.157963299565203, 1,           1
##FIRST=     4132.6476996994, 0,             0
##LAST=      -1043.33573715361, 0,           0
##MIN=       -1043.33573715361, -547957,     0
##MAX=       4132.6476996994, 291250991,     0
$$ Real data points
##PAGE= N=1
##DATA TABLE= (X++(R..R)), XYDATA
$$ [...]
23907C45562o4767j6869j84074j28859J5785P8363J30028q0122k0249J6160n6097
23896C4861m7803K5457p353j73958m9949M8595j0281o1564M7751J83183M9290
23885C8229P2880q8316N3048K3562j60079j9404J47143k0717j31731k4818M1089
23874f9114p1463K239J17586O3637R3492L6111R1679K0781Q92q4125k25621j15654
23862a39560P614Q2344J030j1936n1307O4450J44205l3153J08408j25695j17786
23851g1386N8479l2979M2937L2349j5625P1256j79344j22880Q2493J14402j280
23840b1578m6080j43848k9321r7313J68473R9250p0265k280J5763J39168J07553
23829A19522J8399q8972o9627O0964N0945q593n9736J45301K9214O290M8127k3596
$$ plain form
23907 345562 280795 263926 79852 -49007 -33222 45141 175169 95047 74798 90958 34861
23896 34861 -12942 12515 5162 -168796 -218745 -170150 -180431 -241995 -194244 -11061 38229
23885 38229 111109 22793 75841 99403 -60676 -80080 67063 46346 -85385 -110203 -69114
23874 -69114 -140577 -138338 -20752 42885 136377 172488 264167 284948 285840 201715 -23906 -139560
23862 -139560 -131946 -49602 -48572 -60508 -111815 -47365 96840 63687 172095 46400 -71386
23851 -71386 -12907 -45886 -2949 29400 13775 85031 -94313 -217193 -134700 -20298 -21578
23840 -21578 -67658 -211506 -240827 -338140 -169667 -70417 -140682 -142962 -127199 11969 119522
23829 119522 137921 48949 -20678 40286 91231 82638 22902 168203 197417 203707 251834 228238
23817B28238r280j6693k9077p1259q8871j4844K45n7239j14363n7879K6506n2628
23805b57144n8321J12424J36294J5746j3035k5498n0863p297J00172L618j38335
23794a82239K6857N3283N2442Q4805o674m6491M237P784j61207L2316J11532J29962
23782A06607l9181J0794k5326k7025p8860o2604l312J347j05787K7513J17754
23771g8080L0601N269j36133Q2022p4753n8167L9237k986n2295m3268l7634J28480
23759a97707J63175R4004n6235j30653l1452J5898m8947J4562P0635J12963N6641
23748F2884j14817n5570j2528M7027K3575p0159K1249M9980j9424L3571j7720
23737e1932j24991j53470l5373L8895n5977p0370K4747J08214J51022R3031L6320
$$ plain form
23817 228238 218958 202265 173188 101929 13058 -1786 -1541 -58780 -173143 -231022 -204516 -257144
23805 -257144 -315465 -203041 -66747 -51001 -64036 -89534 -140397 -147694 -47522 -43904 -182239
23794 -182239 -155382 -102099 -49657 35148 28474 -18017 -13780 -5996 -167203 -134887 -23355 106607
23782 106607 67426 78220 52894 25869 -52991 -115595 -118907 -117560 -223347 -195834 -78080
23771 -78080 -47479 -42210 -178343 -96321 -171074 -229241 -190004 -192990 -245285 -288553 -326187 -197707
23759 -197707 -34532 59472 3237 -127416 -158868 -142970 -191917 -177355 -106720 6243 62884
23748 62884 -51933 -107503 -120031 -73004 -49429 -119588 -98339 -48359 -67783 -34212 -51932
23737 -51932 -176923 -330393 -365766 -326871 -382848 -453218 -428471 -320257 -169235 -76204 -39884
23726c9884M6209j82600K2036j2691j9002j9906Q4053j7207m4993k4123M2830
23715a65278J2686o2230O337m6090M2838q155L5258J38147J13041P5711j05382
23704C6883J0139J46905m3262r453K2445q963J760m1841P7005P3774q3766q7535
23692I4091k48815l2746r226O3616N7685n2407n542n1846O2578O7104m692L9540
23680b0660P0754M2767j0077Q3466o6216j45351j00902J12962Q6240Q977n7430
23669D530K6516p9831n908K4844J34987J10320r2124m3378j6036L5919q1215j03908
23657h5284N6859J7724K6722J6881p0687p5935k4157J2188l6533J75590J40817
23646A54185R4459n8956j28330j99380n7040K9766J03395J65405J0822n8342L1283
$$ plain form
23726 -39884 6325 -176275 -154239 -166930 -185932 -205838 -121785 -138992 -183985 -208108 -165278
23715 -165278 -152592 -214822 -208485 -254575 -211737 -219892 -184634 -46487 66554 142265 36883
23704 36883 47022 193927 150665 141212 163657 154694 156454 114613 191618 265392 181626 94091
23692 94091 -154724 -187470 -196696 -133080 -75395 -127802 -133344 -185190 -122612 -55508 -60200 -20660
23680 -20660 50094 92861 82784 166250 100034 -45317 -146219 -33257 52983 61960 4530
23669 4530 31046 -48785 -54693 -29849 105138 215458 123334 79956 63920 99839 18624 -85284
23657 -85284 -28425 -10701 16021 32902 -37785 -113720 -137877 -125689 -162222 13368 154185
23646 154185 248644 189688 61358 -138022 -195062 -165296 -61901 103504 114326 55984 87267
23635H7267q7407m3568K7129Q0723P1260q1983q1850M7400N0497j66151o370k5897
23623a28950K03675J10066k8818r6321j02668m5457j8422J21932k3010O4834K9129
23612H5990k5688Q89m4136p6222j22422k0973K9387N4764j9573m4875J85091J13018
23600A15250k5273m5889n6255r8666L4466p0069j25171J30182Q7572N703j7110
23589f5260O0199N2321m4597p5675q9812q6680q9504J24058P9839O2888J1432
23578f0791k785q0156r6078l457J594n6289J59421J71776L324j10554J5309R6318
23566C7632p799n5563j42123j65804l0980J45863J08178J56031j3938o6051Q1031
23555D6477Q0775j9378k1328j5164q6005M9648J8814m6733N8131M3276n8749q2501
$$ plain form
23635 87267 -140 -43708 -16579 64144 135404 53421 -28429 18971 69468 -96683 -103053 -128950
23623 -128950 74725 184791 155973 59652 -43016 -88473 -106895 15037 -7973 56861 85990
23612 85990 60302 61191 17055 -59167 -181589 -202562 -173175 -118411 -137984 -182859 2232 115250
23600 115250 89977 44088 -12167 -110833 -76367 -146436 -271607 -141425 -53853 -48150 -65260
23589 -65260 -5061 47260 2663 -73012 -162824 -249504 -339008 -214950 -135111 -72223 -60791
23578 -60791 -63576 -143732 -239810 -243267 -241673 -297962 -138541 33235 36559 -73995 -58686 37632
23566 37632 29833 -25730 -167853 -333657 -364637 -218774 -110596 45435 31497 -34554 46477
23555 46477 127252 107874 86546 71382 -14623 35025 53839 7106 65237 108513 49764 -32737
23543c2737o761n217j03758L210J8058O2700P6761R0174j5328L8319m0618o1625
23531B3178N7456j28815Q1062m8404q8419P0218O0559j1946j40705j09551J30135
23520a05232J16957l8357o6974j06686r3157P7812K4468j8408J49063J08520J09046
23509A57052J15022n1128j06146j58859j31173j08774N8744o5771L5659J58613
23499i6761J29371R3107m9594o3142O7589J02107p561p5157N3810q5699j21764
23488e3694q2988O6715J97690J9652l9782o2652j742j30657k15967K34530J26681
23477E7786j6696o2829r6683K9090N1271N9045N597K3300R768L5198n62L0714
23465A24999l7756j63208p020o3875j6969J69006K10064j6561Q9985j9055k03843
$$ plain form
23543 -32737 -39498 -44715 -148473 -145263 -127205 -64505 12256 102430 87102 125421 84803 23178
23531 23178 80634 -48181 32881 -15523 -103942 -33724 26835 14889 -125816 -235367 -105232
23520 -105232 11725 -26632 -93606 -200292 -293449 -215637 -191169 -209577 -60514 48006 157052
23509 157052 272074 220946 114800 -44059 -175232 -284006 -225262 -291033 -255374 -96761
23499 -96761 32610 125717 76123 12981 80570 182677 175116 99959 153769 68070 -53694
23488 -53694 -136682 -69967 127723 147375 107593 44941 43199 -87458 -303425 -68895 57786
23477 57786 41090 -21739 -118422 -89332 -38061 20984 26581 49881 59649 94847 94285 124999
23465 124999 87243 -75965 -82985 -146860 -163829 5177 215241 198680 288665 269610 65767
23454F5767j29590O6656N6025o7115M934L6705j28372J10934J01801j07388j46533
23443a36176r5686K2511L6712J89689n3605J78830P2034p2527k1120j5108J4948
23432A20502O4357p2815k13209P9278L5652R6437L5171q1054J6349K7341j51035
23421d3026K1312J06801m0247m1099N1374n3650k9522J41949K2607q4009j08678
23410e6188O871N3902j03565o7904O853J01266K10173p7303o644k2740R0187j00087
23398C4821j58952j54170N2741J32809o857N1363P5331k02840j02363M9803O8445
23387a59869m1401N0860J27571r3539j9751R1214m259m9267j6056o3082R9325
23376g8254O9813m7991P7912k4703j00554j14334K2210N9643J57104k5108K9413
$$ plain form
23454 65767 -63823 2833 58858 -8257 -3323 33382 -94990 15944 117745 10357 -136176
23443 -136176 -231862 -209351 -172639 17050 -36555 142275 214309 141782 120662 105554 120502
23432 120502 184859 112044 -101165 -21887 13765 110202 145373 64319 80668 108009 -43026
23421 -43026 -21714 85087 44840 3741 55115 1465 -28057 113892 136499 52490 -56188
23410 -56188 -49317 4585 -98980 -166884 -160031 -58765 151408 74105 67461 44721 134908 34821
23398 34821 -124131 -278301 -225560 -92751 -99608 -48245 27086 -175754 -278117 -228314 -159869
23387 -159869 -201270 -150410 -22839 -116378 -136129 -44915 -49174 -98441 -114497 -177579 -78254
23376 -78254 -8441 -56432 21480 -3223 -103777 -218111 -195901 -136258 20846 -4262 25151
23365B5151Q5402P7009p0067k5782m321j4255o0745L9460j22016p5118J17893
23354b7389l3311J53518k399m1112o1255p0900N0333J58549J58533r2709p6589
23343A15269L2354q0939p9403r4866M2721O854j57208j64607j1077M4775J2233
23332c33894Q2579J22953Q6943n8692N936m2344k7937J37604J01054j8914k8616
23321B6672r7614J14312k3203j97950n2283N5161N5490r768j35786N2809J25675
23310h6485N1209j3785k6039j5235L2076M4271J1988L3677J68184j91385q6489
23299g8013O8618j04922k7449K15875O9220j12862l47n129M955l048J14870Q6636
23287B28404r4059j33986r7805q6850n37o8491o4833J5526O0967J18459J27349
$$ plain form
23365 25151 110553 187562 117495 91713 87392 73137 12392 51852 -70164 -145282 -27389
23354 -27389 -60700 92818 90419 49307 -11948 -82848 -32515 126034 284567 191858 115269
23343 115269 147623 66684 -12719 -107585 -64864 -58010 -215218 -379825 -390902 -346127 -333894
23332 -333894 -251315 -128362 -41419 -100111 -94175 -136519 -164456 -26852 74202 55288 26672
23321 26672 -70942 43370 20167 -177783 -230066 -174905 -119415 -129183 -264969 -212160 -86485
23310 -86485 -35276 -49061 -75100 -90335 -58259 -13988 -2000 31677 199861 8476 -78013
23299 -78013 -9395 -114317 -141766 74109 143329 30467 30120 24991 29946 26898 141768 228404
23287 228404 134345 359 -97446 -184296 -184833 -253324 -318157 -302631 -241664 -123205 4144
23276D144R0920m2071j02344j13047Q0851J13126m6567q8639j01247m6224Q2704
23265a68394J37551J05747j1835q2387j08838k0931J6636N5211n3802O0090J687
23254f9265j6631p506l4413L0687L6217J4688J40346N449p2403m5670P1114r1924
23242c9311q0647o1685R2932J12772q7825N6232O2734M198J06721J4431k510k10861
23230c2819k8730k9553J7150m2618j3184r5293J64762J93446n6693j73057q7356
23219a83945Q6302J54045J01191M333m1429l1477l4553j47025P2874J34288l2286
23208H2318r7164P8437L9397p8095j21262j932J06311J21807r0633m254m0947
23197f017N9058p647j36103m7192P1823J10394J36872l3316j41622p2637K8811
$$ plain form
23276 4144 95064 52993 -49351 -162398 -81547 31579 -14988 -103627 -204874 -251098 -168394
23265 -168394 -30843 74904 63069 -19318 -128156 -149087 -132451 -77240 -131042 -70952 -69265
23254 -69265 -85896 -93402 -127815 -97128 -60911 -46223 94123 99572 27169 -18501 52613 -39311
23242 -39311 -119958 -181643 -88711 24061 -63764 -7532 55202 59400 166121 180552 178042 -32819
23230 -32819 -61549 -91102 -73952 -116570 -129754 -225047 -60285 133161 76468 -96589 -183945
23219 -183945 -97643 56402 157593 161926 120497 89020 54467 -92558 -19684 114604 82318
23208 82318 -14846 63591 102988 24893 -96369 -98301 8010 129817 39184 34930 -6017
23197 -6017 53041 45394 -90709 -137901 -66078 44316 181188 147872 6250 -66387 -37576
23186c7576m5918L6827l8j01060n5591m0260O4433K10525L9035Q4458P1564l4209
23174A92190k05131L63q239O2854J02911J3041m6723p2411j6287N8346J7784M263
23162A02961l6679k26882p2136K9595Q3705P9740l7319q8484P0872R7866m8922
23151d5683q4331Q4385J09311m1407p9190R6888N7853q99o1757m8551n2492P8721
23139A2848K1649j01669M8029O317p0324k7472J7404O728m2133J64452P7016n1355
23127F1490O2988k8488o0750K5463l4654l5237l2623N0600j70309j36726J16090
23116a82156k6892J53050Q5436j7408o7750r2166j3873k3354k2567K3666j17602
23105c01616P5442J61067L4542N1299M6759K3781k8268o5248J2278Q9487k5867
$$ plain form
23186 -37576 -83494 -46667 -46705 -147765 -203356 -243616 -179183 31342 70377 154835 226399 192190
23174 192190 -12941 -12578 -20817 42037 144948 157989 111266 38855 22568 80914 98698 102961
23162 102961 66282 -160600 -232736 -203141 -119436 -39696 -77015 -165499 -94627 3239 -45683
23151 -45683 -130014 -45629 63682 22275 -56915 39973 97826 96927 35170 -13381 -65873 12848
23139 12848 34497 -67172 -19143 -12826 -83150 -110622 -93218 -86490 -128623 35829 112845 61490
23127 61490 124478 95990 35240 60703 26049 -9188 -41811 8789 -161520 -298246 -182156
23116 -182156 -209048 -55998 29438 12030 -55720 -147886 -161759 -185113 -207680 -184014 -301616
23105 -301616 -226174 -65107 -30565 20734 67493 91274 63006 -2242 10036 99523 73656
23094G3656K2098p4156n0552L0142L8913q3273o9253K5502J64151L2037O8318
23083A77583M8087p7926K275L5030p8243j83541K7678j4993j13516q8615L5997
23072b30184J00923m7440k6768N9353m3378R370R7618R6007R0850J4629j22497
23061a517p8866J02067Q4184J2019j68481l8409j0845l1613N8172j076j16271
23050a90636O4404j0761k8523J63643K79834o0829j37242o6404p1248p1345L2642
23039i6465Q0473r2723k0240J47380j06699k3451O8276O3427m9772j43302J5243
23028a57853k4284J00883l9951P3971M2872l7606n5257l0159J07378l8945M5333
23017a3618J1990r739j40707N3141m4439m8411l9525L5432l3327j51029r47P8898
$$ plain form
23094 73656 95754 21598 -28954 1188 40101 -43172 -112425 -86923 77228 109265 177583
23083 177583 225670 147744 150019 185049 106806 -76735 -49057 -64050 -177566 -266181 -230184
23072 -230184 -129261 -176701 -203469 -144116 -187494 -178124 -80506 15501 106351 120980 -1517
23061 -1517 -80383 21684 105868 117887 -50594 -89003 -99848 -131461 -73289 -74365 -190636
23050 -190636 -126232 -136993 -165516 -1873 277961 217132 79890 13486 -57762 -129107 -96465
23039 -96465 -15992 -108715 -128955 18425 -88274 -111725 -43449 19978 -29794 -173096 -157853
23028 -157853 -182137 -81254 -121205 -47234 -4362 -41968 -97225 -127384 -20006 -58951 -13618
23017 -13618 -1628 -11367 -152074 -98933 -143372 -191783 -231308 -195876 -229203 -380232 -381179 -302281
23005c02281J49176K05129l9044L4799Q086j4639K0243Q1595O616j11997j5272
22994B2411q8190j7872Q894j5991K0848J0763m3261m8828J11326j8091n37K9273
22982b9255P0358j9341O4262n381J9937q4048j55988L5212J60641R9991l0120
22971A26268J1336r7063m0867N0022P3767j00504j06054M0514k2453r3353O442
22960a51945O1612K2854q006j2961L4524O6663L9773N0483p9550k48L3918o5057
22948g940j92936o1871M2905m0893L900p9381m9869R1449J51637R2983N771j3587
22936e7832l2916p6476k1602L5758J13283L2525l292J9624M073m7513r0142O0514
22924f3996K7284P966j403M3101J06108j0085r3893j00279K3207Q5072M7613l6195
$$ plain form
23005 -302281 -153105 52024 12980 47779 55865 41226 61469 143064 149680 37683 22411
22994 22411 -65779 -83651 -74757 -90748 -69900 -59137 -102398 -151226 -39900 -57991 -58528 -29255
22982 -29255 41103 21762 86024 80643 100580 16532 -139456 -104244 56397 156388 126268
22971 126268 137604 40541 -326 49696 123463 22959 -83095 -42581 -65034 -158387 -151945
22960 -151945 -90333 -67479 -75485 -88446 -53922 12741 52514 102997 23447 23199 57117 -7940
22948 -7940 -200876 -262747 -219842 -260735 -256835 -336216 -386085 -294636 -142999 -50016 -44245 -57832
22936 -57832 -90748 -167224 -188826 -153068 -39785 -7260 -10552 9072 13145 -34368 -124510 -63996
22924 -63996 -36712 -28746 -30149 12952 119060 108975 15082 -85197 -61990 23082 70695 34500
22912C4500o7546L3971p0753l267r5526n5944j09724m5765J6683J8732l4004J59097
22900b19546K01572J0476n7024n9903O3158J04724O698j16471J7124K3347m5419
22889g1264l6495P1875K5170k3782r8751p7113N0503K2860O3244N1439m3623L6705
22877b9232p3404j0967Q8206Q8130o8744j32740J20740L6632L6466j40062p5502
22866a60477J33570K27774j7413j61796r9611R9383l3634r6102J11783Q9001o57
22855I1821n653k3876k3746j04983o4890O1732n3765J6041O6781q294j1325o1810
22843a21967l1564L3490l7453J3960k3236K10123J40914k0662j37063m4049j30663
22832a48170J0518Q7204M2521Q0081p142m6871L947l5699K4116k0951P9495j1148
$$ plain form
22912 34500 -33046 925 -69828 -73095 -168621 -224565 -334289 -380054 -363371 -344639 -378643 -219546
22900 -219546 -17974 -7498 -64522 -124425 -61267 43457 50155 -66316 -49192 -25845 -71264
22889 -71264 -107759 -35884 -10714 -34496 -133247 -210360 -159857 -136997 -73753 -22314 -65937 -29232
22877 -29232 -102636 -113603 -25397 62733 -6011 -138751 -18011 18621 55087 -84975 -160477
22866 -160477 -26907 200867 183454 21658 -77953 21430 -12204 -108306 3477 92478 91821
22855 91821 86168 62292 38546 -66437 -131327 -69595 -123360 -107319 -40538 -48832 -60157 -121967
22843 -121967 -153531 -120041 -157494 -143534 -166770 43353 184267 163605 26542 -17507 -148170
22832 -148170 -137652 -50448 -7927 72154 65012 18141 22088 -13611 10505 -10446 69049 57901
22820E7901r6880k63342j46477J04443J32420J69259l8296Q7070k2634j61345
22810a77881o2182M1970R3077L3559J57770J98929k4394q4943n8092m8494j1669
22799E7650m6781j75290j37950k2889P2061L8867J73051O6448L4312r8013j11868
22788a50402m5624P046R8049q5809m2225R2352J65472o7203j25096k9747O568
22777a76619l1033R7064J26905J04198L8999k08141k7918k323j5882R551N3975
22766c1224O2783m237P3481n163j52502r1738J01438J42988L1811j09179N1247
22755F9705j04088o6290L8785k8011J9828J00603N7402N5710j35730j82030R066
22744a65050Q2463O5708j9696m4964J70762L8535P7677o7406o3864P7983m983
$$ plain form
22820 57901 -38979 -302321 -448798 -344355 -211935 -42676 -80972 6098 -16536 -177881
22810 -177881 -240063 -198093 -105016 -71457 86313 285242 260848 175905 117813 69319 57650
22799 57650 10869 -164421 -302371 -325260 -253199 -214332 -41281 25167 59479 -38534 -150402
22788 -150402 -196026 -188980 -90931 -176740 -218965 -126613 38859 -28344 -153440 -183187 -176619
22777 -176619 -207652 -110588 16317 120515 159514 -48627 -76545 -78868 -94750 -85199 -31224
22766 -31224 31559 27322 100803 95640 -56862 -148600 -47162 95826 127637 18458 69705
22755 69705 -34383 -100673 -61888 -89899 -70071 30532 87934 143644 7914 -174116 -165050
22744 -165050 -82587 -16879 -36575 -81539 89223 127758 205435 138029 74165 152148 147165
22733A47165n2374j9167k747Q2329K2785L0555j77873k04932n5483J42836K565
22722h4341l1763p7472j1986o46J29028J04538q523p0785o0017M4398m0434o5210
22710a73213J3430M9455K3699j3491p1033p0121p6387K0327P1680n1120K277J10751
22698a63746J4958J4753J13977Q1390k04297p4500J49745J18227l1219p8821p2250
22687a31783j7320M0611J64595p3613j99889o6728N6650N8617J05790N5127R3692
22676H5749n6890j77118k9521J7745k9670m0443M637M6393m3518J28035L353n5461
22664a46709J847Q1692l4987m7124J41997K3418m1249j21763k5062J02536M5402
22653b0002J19209k244j12290n3734p2439R4450P7982o4891j90810j52200J05278
$$ plain form
22733 147165 94791 75624 72877 155206 177991 208546 30673 -174259 -229742 -86906 -84341
22722 -84341 -116104 -193576 -205562 -206208 -77180 27358 18835 -51950 -111967 -67569 -108003 -173213
22710 -173213 -159783 -110328 -86629 -100120 -171153 -241274 -317661 -297334 -225654 -276774 -274497 -163746
22698 -163746 -148788 -134035 -20058 61332 -142965 -217465 -67720 50507 19288 -59533 -131783
22687 -131783 -149103 -108492 56103 -17510 -217399 -284127 -227477 -168860 -63070 -7943 85749
22676 85749 28859 -148259 -177780 -160035 -189705 -230148 -225511 -179118 -222636 -94601 -91248 -146709
22664 -146709 -144862 -63170 -98157 -145281 -3284 20134 -21115 -142878 -167940 -65404 -20002
22653 -20002 99207 96963 -15327 -69061 -141500 -47050 30932 -33959 -224769 -376969 -271691
22642b71691J26209J58256J11161l5469j60848n2196J32261l4377l7287j41646
22632b05627j8829n8391J37560J15293n8018O016M5774J2587j1616R0252q9116
22621c4115j29674Q661K2237o768Q5264K534L0969J11050R1854Q6745j01264o1943
22609A05550j0025j42099M2931r954Q7080p727j35821q8501m9816P2670R0102
22598d5610J03834Q9444K5202J7491m2807j23906J12169n2062k1453n4536R509
22587A7275J03393n6818p3258k7356j32046K1013P8600L1164l6982l1984P773
22576i9226j7553P1620Q2784l4584j05231P9912k2440J28915N1302r5077j2371
22565B8051M1712l6094p5495o345N606n669q4980j8502K2609Q7521m7758j9616
$$ plain form
22642 -271691 -145482 12774 123935 88466 -72382 -124578 7683 -26694 -63981 -205627
22632 -205627 -224456 -282847 -145287 -29994 -88012 -81996 -36222 -23635 -35251 55001 -34115
22621 -34115 -163789 -155128 -132891 -139659 -54395 -51861 -20892 90158 182012 268757 167493 105550
22609 105550 95525 -46574 -3643 -13597 73483 65756 -70065 -158566 -208382 -135712 -45610
22598 -45610 58224 147668 172870 190361 147554 23648 135817 83755 62302 7766 17275
22587 17275 120668 63850 -9408 -36764 -168810 -147797 -69197 -38033 -75015 -106999 -99226
22576 -99226 -116779 -45159 37625 3041 -102190 -22278 -44718 84197 135499 40422 28051
22565 28051 69763 33669 -41826 -48171 -42565 -48234 -133214 -151716 -129107 -41586 -89344 -108960
22553a08960m7522M2588J84503M3811M0654k0828j51082n2345k0913N0429M4748
22542E083J31165o4739l7256p832k7386j35716j05004Q1010R6802J07424j6849
22531B6702p0877m0054P9139O9426K8275m0626O0804M9984n1004r5769j32921
22520a16921J8539N7609P3398r2349J5091L6555N8796K4217p4313j4145o2574
22509g6097p7955l3493L5408k8571R5125m6508P6400J5632j58388k8115j0742
22498b37304K1012L036J18446O3930J9115j33978K2705J45116J071M1934M8366
22487A13449j07570m1049j7865K68L1458P6829r188j99191j1538j7461j9306k2916
22475b24080j3307j6714O1974N0068P5932k6605L8058j1596l4984Q3420j50228
$$ plain form
22553 -108960 -156482 -113894 70609 114420 155074 134246 -16836 -69181 -90094 -39665 5083
22542 5083 136248 71509 34253 26421 -965 -136681 -241685 -160675 -63873 43551 26702
22531 26702 -44175 -84229 -5090 64336 92611 51985 112789 162773 111769 16000 -116921
22520 -116921 -98382 -40773 32625 -59724 -44633 -8078 50718 74935 622 -13523 -76097
22509 -76097 -154052 -187545 -152137 -180708 -85583 -132091 -55691 -40059 -198447 -226562 -237304
22498 -237304 -216292 -213256 -94810 -30880 -11765 -145743 -123038 22078 23149 65083 113449
22487 113449 5879 -35170 -53035 -52767 -21309 55520 46332 -152859 -164397 -181858 -201164 -224080
22475 -224080 -237387 -254101 -192127 -142059 -66127 -92732 -54674 -66270 -101254 -17834 -168062
22464a68062j99218K4024j5362Q1121J18918O0364l2047p620N2535P4597l9517
22453e0267p8246r0731J28098Q3353O2468Q884m4759j66833j68668r2131O7087
22442c41745N2990J27128J01403j8269N6020k9968o1186r2991J16528P6381j22051
22431a35760L5668L0576m8458M4783R3203K9376q262o8630l7572n4685O4025o0610
22419a16346K6805L0319P1956K3871l7498l6342L7894r500j07059n7595m2179
22408b15674l8017n3982J3635Q0262L4267L3925J65312N3238k2423p8992M5873
22397A7424j11324q3171Q6031J00334Q4260k0525k2572j0313l9404K1832Q1436
22386A04008k11132O49N5582P02n0674K3040K04579k7049q3086k0584L0880l3698
$$ plain form
22464 -168062 -367280 -343256 -358618 -277497 -158579 -98215 -130262 -137882 -85347 -10750 -50267
22453 -50267 -128513 -219244 -91146 -7793 54675 63559 18800 -148033 -316701 -408832 -341745
22442 -341745 -288755 -161627 -60224 -78493 -22473 -52441 -113627 -206618 -90090 -13709 -135760
22431 -135760 -100092 -69516 -117974 -73191 20012 49388 41126 -27504 -65076 -119761 -55736 -116346
22419 -116346 -89541 -59222 12734 36605 -893 -37235 659 -8841 -115900 -173495 -215674
22408 -215674 -253691 -307673 -294038 -213776 -179509 -145584 19728 72966 50543 -28449 17424
22397 17424 -93900 -177071 -91040 9294 93554 73029 50457 40144 740 22572 104008
22386 104008 -107124 -106475 -50893 -50191 -100865 -77825 126754 99705 16619 -3965 26915 -6783
22374f783j86348m2017J32441Q2743R5976K3466k1248M9030P4074j3273m5104
22363A42957Q2976K0341j40990r0773n7470p7708J19853p8235P0474p1451L8707
22352d1319l8270r0832K3916K7596k2958R2049m9721k8864J70925P2192j05087
22341I627J1866j03498N5186Q1486P4170l0623q3086l0179j6031k7170J18411
22330F0159j9267j20396J10282M2865j41890n612K6300Q6032N0548j21501n4082
22319h6562N4522k8403m1010q2637K7593R1627k2018r516k4445j3468R0936M2837
22307e44j26519m7430J1385J10882Q6006M9852K8454J17917j28974o6982o4275
22296c0228r2873j08741M35K8999M029J62796J13884j32892l6674j29816j9613
$$ plain form
22374 -6783 -193131 -235148 -102707 -19964 76012 99478 78230 127260 201334 188061 142957
22363 142957 225933 246274 105284 14511 -42959 -120667 -814 -79049 -8575 -80026 -41319
22352 -41319 -79589 -170421 -146505 -118909 -141867 -49818 -99539 -128403 42522 114714 9627
22341 9627 21493 -82005 -26819 54667 128837 98214 15128 -15051 -31082 -58252 60159
22330 60159 40892 -79504 30778 73643 -68247 -73859 -47559 38473 89021 -32480 -86562
22319 -86562 -32040 -60443 -101453 -184090 -156497 -64870 -86888 -96404 -120849 -134317 -43381 -544
22307 -544 -127063 -174493 -163108 -52226 33780 83632 112086 230003 101029 34047 -30228
22296 -30228 -123101 -231842 -231407 -202408 -198379 -35583 78301 -54591 -91265 -221081 -240694
22285b40694J21122L4562j02521O5490K9826K3304J0348n2322j88007J76802Q5843
22274c6247L4458q2507q5362K4820Q3974n7006q7334j7043k1851P2161L581J6436
22262a51920N090o3300J25007R3097O8779l2684k200m2298k4411J10037O4378
22251A49575k00862O9468Q3630L5113K7601j04711j58396O9532l4799n675O6445
22240c079K0754J8353q9358k0023M9509r633K7529O5977P9297n0331J1118q3241
22228A6872O9034P2371k4191j95571R8190O5583j5655j25926n8660j12348J18951
22217i1350q739r7811M7538J60119J19212j38205k6647Q0749o885N7513M5983
22206A41477j04252r9234R3161l7456j63648K8997R3599K6203j97907p6619Q452
$$ plain form
22285 -240694 -119572 -85010 -187531 -122041 -92215 -68911 -58563 -110885 -298892 -122090 -36247
22274 -36247 -1789 -84296 -169658 -144838 -60864 -117870 -205204 -222247 -244098 -171937 -168356 -151920
22262 -151920 -146830 -210130 -85123 7974 76753 44069 41869 -429 -24840 85197 149575
22251 149575 -51287 18181 101811 136924 164525 59814 -98582 -29050 -63849 -69524 -3079
22240 -3079 17675 36028 -53330 -73353 -23844 -33477 -5948 60029 139326 88995 100113 16872
22228 16872 85906 158277 134086 -61485 36705 102288 86633 -39293 -97953 -210301 -91350
22217 -91350 -100089 -197900 -150362 9757 128969 -9236 -35883 44866 37981 95494 141477
22206 141477 37225 -62009 31152 -6304 -169952 -140955 -47356 -21153 -219060 -295679 -287227
22195b87227K1778R1736J12324o3549L5293J530n5386l4352J62115J77867p7450
22184H4679j34024Q6135J01133N2321l2199m4218P5731J4142k1749o3277O8005
22173A86679P0186n6773j40666j68780p328L5776J11489l0390M1894m0043j02462
22162a00418r1998J32505J41980j48021Q345r356k1244L1585J73303J34691m7040
22151B04332k70958j23340J6943q6287j3766m9379J27406K17939J77651m1819
22141A58722k621l0581p6075j30784m3379j2623M731J3239k6071M4103J1994m5335
22129a34680K9660J40889R529q6027q0498l138K21237J49764j31013j34697n9808
22118g8782r769p1192K2105L5410J59225Q835o027M3368j40363O0279R7073r2969
$$ plain form
22195 -287227 -265449 -173713 -61389 -124938 -89645 -88115 -143501 -177853 -15738 162129 84679
22184 84679 -49345 36790 137923 190244 158045 113827 189558 203700 181951 118674 186679
22173 186679 256865 200092 59426 -109354 -116682 -80906 30583 193 42087 2044 -100418
22162 -100418 -192416 -59911 82069 -65952 -57607 -66963 -88207 -56622 116681 251372 204332
22151 204332 -66626 -189966 -173023 -259310 -273076 -322455 -195049 22890 200541 158722
22141 158722 156101 125520 49445 -81339 -124718 -137341 -132610 -119371 -145442 -101339 -89345 -134680
22129 -134680 -105020 35869 45398 -40629 -121127 -124265 96972 246736 115723 -18974 -78782
22118 -78782 -88551 -159743 -137638 -102228 56997 65832 59805 103173 -37190 23089 120162 27193
22106B7193n2793O2535M5395j39423n988J10772j10858q2359N3525L0938N7624
22095c439p8899j73434J05725K158n9306n2388N3046P0371j553K2135P4921j9134
22083e9797o6803L2016J03363m8729L1K4977J4932R4169m4710j10798n9837l9807
22071a60993J7756J48398J57029R66j42289j11703P9092M7409L1831l3434K0994
22060E5056p8647p1394j5494n9143M0264M4531J12612J7108j65044l1053R2528
22049e8676J5830j30702J64345l4043j32984j3688m7529n2097n774J05415J5521
22038a74382L0159M1790Q6140j21928J06583K1033j00169K1018J6041k484r2565
22027a68764R2975J25950J81558n0075l7543p5659p9571J1778Q7035j1386n8511
$$ plain form
22106 27193 -25600 36935 82330 -57093 -63081 47691 -63167 -145526 -92001 -61063 -3439
22095 -3439 -82338 -255772 -150047 -147889 -207195 -259583 -206537 -136166 -137719 -115584 -40663 -59797
22083 -59797 -126600 -94584 8779 -39950 -39919 -14942 -10 94159 49449 -61349 -121186 -160993
22071 -160993 -143237 5161 162190 163156 20867 -90836 -11744 35665 67496 34062 55056
22060 55056 -23591 -94985 -110479 -169622 -129358 -84827 27785 44893 -120151 -151204 -58676
22049 -58676 -42846 -173548 -9203 -43246 -176230 -189918 -237447 -289544 -295318 -189903 -174382
22038 -174382 -144223 -102433 -16293 -138221 -31638 -10605 -110774 -89756 -73715 -76199 -168764
22027 -168764 -75789 50161 231719 181644 144101 68442 -11129 649 87684 76298 17787
22016A7787j097m2133k8654Q612o8216k7807M8888O4404r3096o5021J00308O8341
22004a7684R1521l9071j38175j4225k1060r691P9324J90176j00283k78279k2227
21993b79674R6842k0898J49656p9505N449Q5048r077K0624L6539L3614J61567
21982B00185j387j18564P0363q674l2383K8819K2266j22239j47975o299l2905
21971a48793l6879j2533J03608M8521L0051J8881K8956o6579o9279j56647L5854
21960b24839J9615r0986R9783J5530J8096L1046Q2740L8770L8041m6699j9608
21949c8511J1865M9116J06870r3407k8069j17901o3280j1373l2922L3610q1077
21938b65079n7618J46591K6015L5993p9094R7129P7467R8005k7227j79303M1953
$$ plain form
22016 17787 16690 -25443 -54097 -45485 -113701 -141508 -92620 -28216 -121312 -186333 -86025 -17684
22004 -17684 73837 34766 -103409 -117634 -138694 -148385 -69061 121115 20832 -257447 -279674
21993 -279674 -182832 -203730 -54074 -133579 -128130 -43082 -52159 -31535 5004 38618 200185
21982 200185 198798 80234 150597 141923 109540 138359 160625 38386 -109589 -115888 -148793
21971 -148793 -185672 -198205 -94597 -46076 -16025 2856 31812 -34767 -104046 -260693 -224839
21960 -224839 -205224 -296210 -196427 -180897 -162801 -131755 -49015 -10245 27796 -18903 -38511
21949 -38511 -26646 22470 129340 35933 7864 -110037 -173317 -184690 -217612 -184002 -265079
21938 -265079 -322697 -176106 -150091 -114098 -193192 -96063 -18596 79409 52182 -127121 -85168
21927h5168J32835Q8641J13910R866q8230n3112q8187P0825J3375J1020O1148
21916A86923M7449j71153k10857L7949J96606J25496j68691k559J01637k9993
21906A12807m7767L7665J32159l7233j29204o0578o3011L6064k2510j55246R0691
21895a06163M0037j06320n3134K1959J25942j0647O5793Q5183k7064j4298j46705
21884a25417k00258M6932J17352N0288M0914J0017J11115k7058l5385J0828k4311
21873b4983j32652R2875J49971m9053J6089O694J0950N9716l5277j81151m5712
21862a32533j8502k7144k4784P5445O8842o2691k0462K9365M5770M0667r0328
21851a16355l9758N5307r416P2110J45338N8661J3954p7410j07030L7321N4655
$$ plain form
21927 -85168 47667 136308 250218 260084 171854 118742 30555 101380 114755 125775 186923
21916 186923 234372 63219 -147638 -109689 86917 212413 43722 41163 142800 112807
21906 112807 65040 102705 234864 197631 68427 7849 -55162 -19098 -41608 -196854 -106163
21895 -106163 -66126 -172446 -225580 -203621 -77679 -88326 -22533 62650 35586 21288 -125417
21884 -125417 -325675 -278743 -161391 -111103 -70189 -60172 50943 23885 -11500 -672 -24983
21873 -24983 -157635 -64760 85211 36158 52247 58941 69891 129607 94330 -86821 -132533
21862 -132533 -151035 -178179 -202963 -127518 -58676 -121367 -141829 -112464 -66694 -26027 -116355
21851 -116355 -156113 -100806 -110222 -38112 107226 165887 179841 102431 -4599 32722 87377
21840H7377K9650J2595q2061j04930K0340j8825m8695j22431J21920J2333q4484
21829a77211O0356K38982R5462j32099P02N0752k21817j23837m9740m3759L4702
21818b67507J30734J8559o02j12320Q9112J58846j33068N9231J31053m5944j52380
21807a24286j91843R4061M8473p5975M3962J1224L7165L5560K77860R0272p2649
21796A73824j2430P1743m5607q1556K8604l5715L3060j09783l2873J3226k7218
21785b4725o9319n3754M1057K78856J16791j87134m6878O0026j5853K3995l2661
21774I0401j8405K6273j05581K1814J91685p668J2597n7318l8335n9938J5613
21763G1138K4755m8387m7221Q8135j40667j45688R8267L2742Q0817J67032j6187
$$ plain form
21840 87377 117027 129622 47561 -57369 -37029 -55854 -104549 -226980 -105060 -92727 -177211
21829 -177211 -116855 122127 217589 85490 86192 136944 -84873 -208710 -258450 -302209 -267507
21818 -267507 -136773 -118214 -118816 -231136 -142024 16822 -116246 -57015 74038 28094 -124286
21807 -124286 -316129 -222068 -173595 -249570 -205608 -194384 -157219 -121659 156201 246473 173824
21796 173824 161394 233137 187530 105974 134578 98863 131923 22140 -10733 2493 -24725
21785 -24725 -94044 -147798 -106741 172115 288906 101772 54894 114920 99067 123062 90401
21774 90401 71996 98269 -7312 14502 206187 198519 211116 153798 115463 55525 71138
21763 71138 95893 47506 285 88420 -52247 -197935 -99668 -66926 13891 180923 164736
21752A64736R320r9430j28425l914L1667K9381l3368K2610J21086j84516m9223
21741a20076J52377O7280M9924n380j30639r9687L1798K7624J67061L2658m7329
21730A25611o9087J4587J02539O4550P5300j65549j30851P2541m1630j15162K3404
21719d3747j18918p8204q588K44539O6600R6543q7433k20021j04356k0746l2677
21708c07008J01614J32515k8179J01035K0438q0452o1621O6891J15376m6912o346
21697G351l3669M2576J09199l7674K3670o2006j37341R0557J8346j40023j85877
21686c04891L0458J11757J43498L0007n5038m8130M9318L105j1720M6248K1808
21675A6420j09049n9644Q4749J10147k6220l9049L5737n8162o6208j12978l1194
$$ plain form
21752 164736 174056 74626 -53799 -57713 -26046 3335 -30033 -7423 113663 -70853 -120076
21741 -120076 32301 99581 149505 144125 13486 -86201 -54403 -26779 140282 172940 125611
21730 125611 56524 71111 173650 238200 313500 147951 17100 89641 48011 -67151 -43747
21719 -43747 -162665 -240869 -249457 -4918 61682 158225 70792 -149229 -253585 -274331 -307008
21708 -307008 -205394 -72879 -101058 -23 20415 -60037 -121658 -54767 60609 13697 7351
21697 7351 -26318 16258 125457 87783 111453 49447 -87894 2663 21009 -119014 -304891
21686 -304891 -274433 -162676 -19178 10829 -44209 -92339 -43021 -39916 -51636 -5388 16420
21675 16420 -92629 -152273 -67524 42623 16403 -22646 13091 -45071 -111279 -224257 -255451
21664b55451M3610R8951J9380j13953k6048Q2807M9202J46550J16463J12010o4879
21653B08642n2546J0864K7353o8012k3413J08386j6125j95566o8549m2554J42867
21642C1347J16254l8188j28466j52983l709o2903J13572N7559l1941K1509L3069
21631d4880k6948k8343O5386P6044l883m2762N2993k7755M1576l7495j82548Q4494
21619g4121N3655r5307K8168m1618L6299Q2288m1162j7012p9624J4126n9734k013
21607a96055M7382J7326O5151r627J24056R9918R3894N830j77333o0739j5091
21596e288Q0771P9705m2708j92876j56064M5150J90870J72494R5169q3590j66907
21585A6726R6205N3093M480K4268q7796r5208P2651K8573r0313O6197p295p817
$$ plain form
21664 -255451 -211841 -112890 -93510 -207463 -233511 -150704 -101502 45048 161511 273521 208642
21653 208642 156096 166960 194313 126301 102888 211274 195149 -417 -68966 -111520 31347
21642 31347 147601 109413 -19053 -172036 -175745 -238648 -125076 -67517 -99458 -77949 -44880
21631 -44880 -71828 -100171 -34785 41259 37376 -5386 47607 19852 61428 23933 -158615 -74121
21619 -74121 -20466 -115773 -87605 -129223 -92924 -10636 -51798 -68810 -148434 -134308 -194042 -196055
21607 -196055 -148673 -131347 -66196 -75823 48233 148151 242045 247875 70542 9803 -5288
21596 -5288 75483 155188 112480 -80396 -236460 -191310 -440 172054 267223 183633 16726
21585 16726 112931 166024 170504 194772 106976 11768 84419 112992 22679 88876 81581 73764
21573G3764k46349M9146n4349j40407J56653K20737j919q1859q0756N7861K14082
21562A66604J61224k3553k28015k401r907j2325m5764j6497J008m359N9197R2249
21550A37461M8495K5052r0722j05642J2400o962N6559j6590P745L3106O0293k0002
21538A41193p1652J2109j16915o0486O8048M4130j4141K8198L6330r2200j46961
21527a72347k8141Q962L3427j51118l7952J11266J05090J9113P9863p3026j08354
21516b13217l6791j7562j5450R4454K00933L8674j10943q6754O3196J14020J11000
21505A41560P4681J8411j09126p2853o8949j14395j2778L1947m0086M4883J12170
21494E465l634j90344m0139Q8389M1779k4490o8030j63217r249J36707J77796
$$ plain form
21573 73764 -172585 -123439 -177788 -318195 -161542 59195 57276 -24583 -105339 -47478 166604
21562 166604 327828 304275 76260 73859 63952 51627 5863 -10634 -9626 -13985 45212 137461
21550 137461 185956 211008 120286 14644 27044 20082 76641 60051 67796 100902 161195 141193
21538 141193 69541 81650 -35265 -95751 -27703 16427 2286 30484 66814 -25386 -172347
21527 -172347 -200488 -191526 -158099 -309217 -347169 -235903 -130813 -111700 -31837 -104863 -213217
21516 -213217 -250008 -267570 -283020 -188566 12367 51041 -59902 -146656 -83460 30560 141560
21505 141560 216241 234652 125526 52673 -16276 -130671 -143449 -111502 -151588 -106705 5465
21494 5465 1831 -188513 -228652 -140263 -98484 -122974 -191004 -354221 -363470 -226763 -48967
21483d8967L9228P4877k2304o6029o7647N7489K7461k7038k7843J12820J31588
21472A83635l9871l9133q6668N7264k5565q0759q37k3029J20580k00105j90540
21461c25028k8554N1017K01144J50886J30520j14425k8983j8474l4410j3115J0009
21450a9413Q1857J19397n3268j33615K2101j8646j47333K9653L462m3373j8621
21439a77799M0684m510P1706L091m0679J6526p9002p6094P7142J73067J83462
21428A87594K2064o7838N357m8047j47217m7358l8526k2379R7716K135Q0701n4471
21416c0269R7755L724p0425R557l2813N4423j22535j61660J19029J40966p2063
21405f4311m2464R2886R6323r9170P8730K7450L4886M556n0754J9720n4901J0441
$$ plain form
21483 -48967 -9739 65138 42834 -23195 -90842 -33353 -5892 -32930 -60773 52047 183635
21472 183635 143764 104631 17963 75227 49662 -31097 -31934 -54963 65617 -134488 -325028
21461 -325028 -353582 -302565 -101421 49465 179985 65560 36577 18103 -16307 -29422 -19413
21450 -19413 62444 181841 128573 -5042 17059 -1587 -148920 -119267 -115805 -159178 -177799
21439 -177799 -137115 -141625 -69919 -66828 -107507 -90981 -169983 -246077 -168935 4132 187594
21428 187594 209658 141820 147177 99130 -48087 -95445 -133971 -156350 -58634 -56499 24202 -30269
21416 -30269 67486 71210 785 10342 -22471 31952 -90583 -252243 -133214 7752 -64311
21405 -64311 -106775 -13889 82434 -16736 61994 89444 124330 128886 78132 97852 42951 53392
21393E3392j60699r7102k2828O2245L4844l2184J48618J69684J6325R97p4218
21382I9074j5005K1696N483N6969j25645n5631Q9875j00428n7708K9038J75933
21371A23651K7613L865q2866p1746j48190j3682m3398j4793J25439m7357R849
21360a31615M5525R0706J7301J9294o4921j42980l1111j9216P8660K7527o233
21349a17063N6483K8194r6513K4436Q313J787p141J49138J7825o8359r7901j11079
21337b11880l760q3632Q6166N2199N4890R1667J34174Q5515l5128j5648L8029
21326A92592n156q5398m9207q1454J95029J27045j7854q0432j02296K1258J07219
21315B21346K7772r7213j37656N5794O7721q6209o8516K491P589J045P5609k303
$$ plain form
21393 53392 -107307 -204409 -227237 -164992 -130148 -162332 -13714 155970 172295 173292 99074
21382 99074 84069 105765 111248 168217 42572 -13059 76816 -23612 -81320 -52282 123651
21371 123651 151264 155129 72263 517 -147673 -161355 -204753 -219546 -94107 -141464 -131615
21360 -131615 -86090 4616 21917 41211 -23710 -166690 -197801 -217017 -138357 -110830 -117063
21349 -117063 -60580 -32386 -128899 -104463 -96150 -94363 -101504 47634 65459 -2900 -100801 -211880
21337 -211880 -215640 -299272 -213106 -160907 -106017 -14350 119824 205339 170211 154563 192592
21326 192592 187436 102038 52831 -28623 166406 293451 275597 195165 92869 114127 221346
21315 221346 249118 151905 14249 70043 137764 51555 -16961 -14470 -6881 -5836 69773 67470
21303F7470n5653P057K15286O4848j71959j3926n2029L9596M6149j3542j59969
21292b6672j07597N3733L290l8046K797j3384p9570P4452R9655K2309M8635k6873
21280A2729k8170j287k5377q2711n0092J75560Q0285j0090K8526O2553j11216
21269E0710m2484j771j2577j30066j26556j6155J20302K35300j0970R2704P8053
21258B36490l9306K4731J6388k06161p3167J05693R3970r0866J23419L2249k9337
21247A94103M9314k19129m639R8096q7290j96819p169J444J03246O9242P6822
21236G7221k7470n8762O6859N5814m0077O7038n6343j12021L592J32795J41912
21225B50558P0364j18068m6300K1221j1288o0396p9755j25308n8518q3554l2092
$$ plain form
21303 67470 11817 18874 234160 299008 127049 113123 61094 100690 146839 133297 -26672
21292 -26672 -134269 -80536 -77246 -115292 -112495 -125879 -205449 -130997 -31342 -9033 39602 12729
21280 12729 -15441 -16728 -42105 -124816 -174908 652 80937 70847 99373 161926 50710
21269 50710 8226 6455 -6122 -136188 -262744 -278899 -158597 76703 65733 158437 236490
21258 236490 197184 221915 238303 32142 -41025 64668 158638 67772 191191 223440 194103
21247 194103 243417 24288 19649 117745 30455 -166364 -173533 -172089 -68843 399 77221
21236 77221 49751 -9011 57848 113662 73585 140623 84280 -27741 -24149 108646 250558
21225 250558 320922 202854 156554 177775 166487 106091 26336 -98972 -157490 -241044 -273136
21214b73136J78221Q1861J55823O282J79634o4088q4524j6420k0529j33494M4280
21203E3910Q2727o5543r4897k531J88072j95528o7018J74098J41853J03944k9159
21192B89928r5809j09917j24312N0639r5257l0491O1014P7299J21557L7525O9975
21181B52151M2501j25586m8382q4714Q6496R8087k6865M5057Q1415j17671j08148
21170I4341q0304J3551P3311P8593Q1244q6895P4498J81006J66116n6819L0655
21159E69297o6324r5468p971L4537p0722q3921J20626p3469n0170j8059M3339
21148C01695L0466o1327Q3164P8843n1178o3068Q0258M2768q5833J0868J28499
21137D95155k6639l5848M9370J2642p4784p3422M5808O2067j1465J5379J7629
$$ plain form
21214 -273136 -94915 -13054 142769 149051 328685 264597 180073 163653 143124 9630 53910
21203 53910 136637 71094 -23803 -26334 161738 -33790 -100808 73290 215143 319087 289928
21192 289928 194119 84202 -40110 10529 -84728 -115219 -54205 23094 144651 182176 252151
21181 252151 294652 169066 120684 35970 122466 220553 193688 238745 320160 202489 94341
21170 94341 14037 27588 100899 179492 260736 173841 248339 429345 595461 538642 569297
21159 569297 502973 407505 399534 434071 363349 279428 400054 326585 276415 258356 301695
21148 301695 332161 270834 353998 432841 381663 318595 398853 441621 355788 366656 495155
21137 495155 468516 432668 482038 494680 419896 346474 392282 454349 442884 458263 475892
21126D75892O1223K3954o0429j96122M5051R6807M770J5471j78223j19788k3729
21115A44877Q9036J57855j48554J5929R0732j5614o4919k10760j59641R2075K38709
21104B29725P0094O915p1893M4779q125P332L6704j4543j09494j77849J3864L8870
21092F6379R344r3903j1760P9488k437r9396j53397l6405J28164J303k737J92013
21080G6656P0297m4808q2546k8945Q1654K4445p5345J06485N8155K4615O5563
21069B76226J1108L4482j79224r9160j9999P0054J743J12837k1803j69467M689
21058B1486j6121N424N5330N0658M8431n1647r9431j13079O1009J7780P5640N7128
21046A12608j38925j25963j9227m04O4093J69240M7890R0296M2285j05N0152k500
$$ plain form
21126 475892 537115 561069 500640 304518 349569 446376 451146 466617 288394 168606 144877
21115 144877 233913 391768 243214 259143 349875 334261 269342 58582 -101059 -8984 229725
21104 229725 299819 306734 234841 279620 271495 278827 315531 300988 191494 13645 27509 66379
21092 66379 75723 -18180 -29940 49548 47111 -52285 -205682 -242087 -113923 -112620 -115357 76656
21080 76656 146953 102145 19599 -9346 72308 96753 21408 127893 186048 210663 276226
21069 276226 287334 321816 142592 43432 23433 93487 95230 208067 186264 16797 21486
21058 21486 5365 10789 66119 116777 165208 113561 14130 -98949 -37940 -20160 55480 112608
21046 112608 -26317 -152280 -171507 -171911 -107818 61422 109312 199608 241893 241788 291940 289440
21034B89440j10658q9021N1066J12426q5587k36590r1862J46821L3681n3422l6723
21023g0429j4786Q6545J59469R2400O4360q9191j68151j08170L9538j6621Q8962
21012F3926J42960L6285K5545n0496L5877J7291j09215r0107J76418J3304j17671
21001A44117o0650k0566l9631m5656J572M5454L8278L8389K15158P1652j75951
20990B12166j54610M2372m3270j6156q415n8005O7527M1404n4767o7279j7303
20979e6336J53853K42182P6576j59967J6739r706J19880r8149k10834j01072p2917
20968i9751R1926J67934J68990l7864j36754j32699p4988K6641L7038m4335o281
20957d0143p9342L2397j29803K6002J39440P6215K152k9619r5788j2406Q9894
$$ plain form
21034 289440 178782 89761 140827 253253 167666 -68924 -160786 -13965 19716 -33706 -70429
21023 -70429 -85215 1330 160799 253199 317559 228368 60217 -47953 -8415 -25036 63926
21012 63926 206886 243171 268716 218220 254097 271388 162173 72066 248484 261788 144117
21001 144117 83467 62901 23270 -22386 -20814 24640 62918 101307 316465 388117 212166
20990 212166 57556 99928 56658 40502 32087 -25918 41609 83013 28246 -39033 -56336
20979 -56336 97517 339699 416275 256308 273047 263341 383221 285072 74238 -26834 -99751
20968 -99751 -7825 160109 329099 291235 154481 21782 -53206 -26565 10473 -33862 -40143
20957 -40143 -119485 -87088 -216891 -190889 -51449 24766 26918 -2701 -98489 -110895 -21001
20946b1001J44379R2112O679L3587Q3583o8993j83383l5155J17974K2294j89442
20935B634J1203J2897P3710K0605O1191J46137J3337n908j94054j26589K7298
20924D2461M5936q9266j87742J9063N9962K0368l3643O0776O2456r7536j26168
20913b23333m7176K09789J03593j1205q7380J6518J84929Q4503J14333p2983j44641
20902A26947M7644m0913j12309l8071m1846J35773J4010m2041J22838P9364k36854
20891A4542P509O6531J56146J29797l9792j64195r5617J82311J77638o3176q9560
20880B82134m6954j4665O1129q4403j75478j00417r345M0715O950l1568J29796
20869E7894l4974L2239J21643l053j07509m8139J39721M9047N990n826J2233L9006
$$ plain form
20946 -21001 123378 215490 222169 255756 339339 270346 86963 51808 169782 192076 2634
20935 2634 13837 26734 100444 121049 182240 328377 341714 335806 141752 15163 42461
20924 42461 88397 -869 -188611 -169548 -109586 -89218 -122861 -62085 371 -97165 -223333
20913 -223333 -270509 -60720 42873 31668 -55712 -39194 145735 230238 344571 271588 126947
20902 126947 174591 133678 21369 -16702 -58548 77225 91235 49194 172032 251396 14542
20891 14542 22051 88582 244728 374525 334733 170538 74921 257232 434870 371694 282134
20880 282134 235180 220515 281644 197241 21763 -78654 -87999 -47284 -40334 -71902 57894
20869 57894 22920 55159 176802 173749 66240 18101 157822 206869 212859 207033 219266 258272
20857B58272j07293j55522R4512O4877L0859P6815l9901q1077J05757J18424L6461
20846D02184p8951j06628P0304n8839j69440L8094p1732r0758k146R9353J08435
20835A39876J954R4969N7907L83j30171J6374M8601M667N3965j06804k18581o6265
20823a03125K09093O3175N1989M8038j6915m3715j13518m7152M5924j29900J24585
20812H8479o5751j5386J66844O1351l4429m6989J20548J78300n8981j7140p5694
20801C01152k12883j6212N4686J01659Q8376n2193K4106J19206R9238R42q3931
20790D24146k3963j43557j15797J4061J8580p8450j64490J9195N3200J78152l2514
20779A48563l7313l9851O0885K26278L4093k6909O8052M457K4625q5302j27996
$$ plain form
20857 258272 150979 -4543 89969 154846 185705 262520 222619 141542 247299 365723 402184
20846 402184 323233 216605 286909 228070 58630 96724 24992 -65766 -67912 31441 139876
20835 139876 141830 236799 294706 295089 164918 181292 229893 234560 288525 181721 -36860 -103125
20823 -103125 105968 169143 221132 269170 252255 208540 95022 47870 93794 -36106 88479
20812 88479 22728 7342 174186 235537 201108 154119 274667 452967 393986 376846 301152
20801 301152 88269 72057 126743 228402 316778 264585 288691 407897 507135 508077 424146
20790 424146 400183 256626 140829 154890 173470 95020 -69470 -50275 2925 181077 148563
20779 148563 111250 71399 132284 358562 392655 365746 433798 438255 462880 377578 249582
20768B49582j09422j57798o5368r978Q2750J54244J59776n2717q8746j11166m8452
20757B705P910o8174n547J58129J04408J941l859N5305j33422P0383J20768K6400
20745C36947K5299k6071j92407J0052k9870J7384k6459o9069k9158M2641M4047
20734A03336M8087Q9468p3578l5922l9179r9056k497M7546K6123J53175M5372
20723B62875m9789m1221O6302J15411l0718j48669r0633q7436J44069J72968k7654
20712B85505k19884r0966N2328r5853M653L99J5747J21943j8932r7267N7502J55839
20700A71014M927M0423O2177j88921J7478O3461m3519n6567N8276J6159m508O3985
20688B04385l7771J379N2421j3571R8261J23401l9267J7792p6316r9090l0601
$$ plain form
20768 249582 140160 -17638 -83006 -92984 -10234 144010 303786 251069 162323 51157 2705
20757 2705 10615 -57559 -63106 95023 199431 201372 197513 252818 119396 189779 310547 336947
20745 336947 362246 336175 143768 153820 123950 141334 114875 45806 16648 59289 103336
20734 103336 151423 240891 167313 131391 92212 -6844 -9341 38205 64328 217503 262875
20723 262875 213086 171865 238167 353578 322860 174191 83558 -3878 140191 313159 285505
20712 285505 65621 -25345 26983 -68870 -64217 -63818 -48071 73872 54940 -42327 15175 171014
20700 171014 175941 216364 278541 89620 107098 170559 127040 70473 128749 144908 140400 204385
20688 204385 166614 167993 220414 206843 305104 428505 389238 407030 330714 231624 201023
20677B01023k2731m7443L5248R6194m4923p1797O225r5773j5126R76J852m5046
20665a321J45962J29019o5091n4369o6201o6968Q6657j9060r056J52245L6605
20654B68422q6277L302o440M016n9309k3852J9562P2271n8368m5966M8295J17501
20642B53157j88172r8417J23834Q4130m4742J8072o7176Q0680M988l8712K2834
20631A50476Q8974L5777R687p535L4751m6401k6702L5874k1252n4585q2729M4629
20619A60964N3043j7949K3638P3051j39284o8715k7406K201J52452Q3740k3170
20608B72565J9717M8594K4283K8772O2231N9152n3642r7461m7190J11173j08172
20597C20022j31137J4986p153J04218K2852j33580n2178K1066O9335J35847j3726
$$ plain form
20677 201023 178292 130849 166097 262291 217368 145571 151796 56023 40897 41873 43725 -1321
20665 -1321 144641 273660 208569 154200 87999 21031 107688 88628 79572 231817 268422
20654 268422 182145 185447 179007 183023 123714 99862 119424 191695 133327 87361 135656 253157
20642 253157 64985 -33432 90402 174532 129790 147862 80686 161366 166354 127642 150476
20631 150476 239450 275227 284914 277379 312130 265729 239027 274901 253649 199064 116335 160964
20619 160964 214007 196058 219696 292747 153463 84748 57342 59543 211995 295735 272565
20608 272565 292282 340876 365159 393931 456162 515314 461672 364211 317021 428194 320022
20597 320022 188885 203871 196718 300936 323788 190208 138030 159096 228431 364278 350552
20586C50552j236N0048L7318j02693K5833M5585p3434N1620l2591q8783J10187
20575C72406P3477j31687r8880J21415o5955J536M2860Q4185j8940n9425j67067
20564A53925j64641O0022J11387Q4826r9534K5239N8009M0843n619M9581J29965
20553D44003k9643j00696P217K2706N7163J68350j1522j36966l4468k860K4817
20542D08101k7426O1503p561L1272l3781q2774P914l1540J65M0088o5684M4685
20530C44962n0168o1522L1955K0179L1507P8Q782l7932J3825p288n6491K7906
20518B65793P7460p283r089m0317P0489q6528j35083k8660J52238L1574p4250
20507B16344J6005J10341J34658L342n0337m3189M9320K0332J15678J35355j2307
$$ plain form
20586 350552 349316 399364 436682 333989 359822 405407 331973 383593 351002 262219 372406
20575 372406 445883 314196 215316 336731 270776 272312 315172 399357 380417 320992 153925
20564 153925 -10716 49306 160693 245519 145985 171224 229233 270076 264457 314038 444003
20553 444003 414360 313664 320881 343587 400750 569100 557578 420612 386144 383284 408101
20542 408101 380675 442178 434617 465889 432108 349334 357248 325708 325873 365961 300277 344962
20530 344962 294794 233272 265227 285406 316913 316991 325773 287841 301666 294378 237887 265793
20518 265793 343253 335970 326881 286564 357053 270525 135442 106782 259020 290594 216344
20507 216344 232349 342690 477348 480690 430353 387164 436484 456816 572494 707849 695542
20496F95542q772n5262J03222m5744j26306r2293j66673j69553k05611P7383J57924
20485A63857J63296P0478O3452J07056j6255j12165j58357K4936N8775J9691k4978
20474C59786L7467J01198N2434n6493N3518r9015R960J3809O8581q8031j1586
20463D41628N6003J82451k0136k18268j21957J15969K26750J5832M0511J7756
20453G36539r1908q0593k30586o2160J06395K9700N2989L1541m575o2802q5459
20442C39081Q4090O4156q3799q8689m1988J35045J05045Q6284j2969j8452K6886
20431E94690j18911l1739k3441J1802j2049K7830K34799j8335j64605n1606O3649
20420E12084J06647O1685j11209j89373p8329l5932j81068J54890J63099M7024
$$ plain form
20496 695542 686770 631508 734730 688986 562680 470387 303714 134161 -71450 5933 163857
20485 163857 327153 397631 461083 568139 551884 439719 281362 306298 365073 384764 359786
20474 359786 397253 498451 550885 494392 547910 448895 458855 472664 541245 453214 441628
20463 441628 497631 680082 659946 441678 319721 435690 662440 678272 718783 736539
20453 736539 644631 564038 333452 271292 377687 407387 460376 491917 487342 424540 339081
20442 339081 423171 487327 403528 314839 272851 407896 512941 599225 586256 567804 594690
20431 594690 475779 444040 420599 432401 420352 448182 682981 664646 500041 448435 512084
20420 512084 618731 680416 569207 379834 301505 265573 84505 239395 402494 449518
20410D49518L6436N6301J00956P2463k3053l7460L3965j7923m455o6272k0579
20399E79897r3318j07608K35895K62043N3274q8916j30904j25091J03095K4649
20389G13016n490p0918o7483j05197l2078J27145P7028L8693P8150q55p7432j87218
20377D87361o2086p4246n9453J31637J50887J26125n8623j16765L4844M7419N7672
20366F64772K0141j8799J4398j18912P3304M9310Q2084p9046j22563j9172J25568
20355F71085j2326p9064n9002M1429o90J3699j7110p076J7272Q7896p4539l3644
20343E47930n584j65203J20389J1183J71324K10428j96590j77156J07351O5024
20333F89096n2236q9812j3373o3632L5226J33513J4804K4300k106L4072M2778
$$ plain form
20410 449518 485954 542255 643211 715674 692621 655161 689126 671203 666748 600476 579897
20399 579897 486579 378971 614866 876909 930183 841267 710363 585272 688367 713016
20389 713016 707526 636608 569125 463928 431850 558995 636023 674716 752866 752011 674579 487361
20377 487361 425275 351029 291576 423213 574100 700225 641602 524837 559681 607100 664772
20366 664772 684913 666114 680512 561600 634904 684214 766298 687252 564689 545517 671085
20355 671085 658759 579695 520693 562122 561432 575131 558021 550945 568217 656113 581574 547930
20343 547930 542346 377143 497532 508715 680039 890467 693877 516721 624072 689096
20333 689096 636860 547048 533675 470043 505269 638782 653586 677886 675780 709852 752630
20322G52630j25891m8655J96394l6299L5732R0347j12561K9314l1498n351q9896
20311F54266L6158O7607j59445j44431Q2937J25651O020M9139n1119M2700M0805
20300G50288M2210n170o5982O1947R7396m6340j29769r5479k0212Q1291R351q0145
20288E99386J16451K4319J2402M9432J2078j9357m9625q289K5933j26938n7365
20277E78427k2033J21528Q1572o3596j5888J23730r9031J46966Q3080n8123k43416
20266F33216P366J8046r1586M5377P7185l409J09542K5342j32664O2798Q8696
20255H39909J40094O200j60971k14071L1419Q9261r9296q9006J01206J33986O8353
20244H47084j7838J7577N2360m1242L732j24832j10497L0918K4911N3383J00374
$$ plain form
20322 752630 626739 578084 774478 738179 773911 864258 751697 781011 749513 744162 654266
20311 654266 690424 758031 598586 454155 537092 662743 668763 717902 666783 709483 750288
20300 750288 792498 787328 721346 783293 880689 834349 704580 609101 588889 670180 679531 599386
20288 599386 715837 740156 752558 801990 814068 794711 745086 736797 762730 635792 578427
20277 578427 556394 677922 759494 695898 680010 803740 704709 851675 934755 876632 633216
20266 633216 640582 658628 567042 612419 689604 686195 795737 821079 688415 751213 839909
20255 839909 980003 986203 825232 611161 642580 731841 632545 543539 644745 778731 847084
20244 847084 829246 846823 899183 857941 861673 736841 626344 657262 682173 735556 835930
20233H35930J54146Q5885q5249j20456m7762r5533j6894J04342k411l566R8509
20222I06941J28757p2929j16763l2248q5544o9802l1654l4425P0259K4687N2613
20211G39892N0955K93746J8714k900k8729j27809K5840O8720P8918j04765J7621
20200A030203J22083j66079p0857K0683M629p6598o9381P9734P4975l6733l3150
20189H79509J0748J60721P7449j54435j28056K14727J12315P254k5784k8057N7696
20178A184087L6209p114r0076j05220j8458k1280L1648L5703O7735O1781J82917
20167A357932j3449p0141k1901K1682O2663j03845j41171K960j71191n5296K01991
20156A070234O1100K9077J67830P2057o155Q7006n8434k4198k8522j4958M9147
$$ plain form
20233 835930 990076 1075961 990712 870256 822494 726961 710067 814409 811998 808432 906941
20222 906941 1035698 962769 846006 813758 728214 658412 626758 592333 662592 687279 739892
20211 739892 790847 1084593 1103307 1100407 1071678 943869 969709 1038429 1117347 1012582 1030203
20200 1030203 1152286 986207 915350 936033 940662 864064 794683 874417 949392 912659 879509
20189 879509 890257 1050978 1128427 973992 845936 1060663 1172978 1180232 1154448 1126391 1184087
20178 1184087 1220296 1213182 1123106 1017886 999428 978148 1009796 1045499 1113234 1175015 1357932
20167 1357932 1344483 1274342 1252441 1274123 1336786 1232941 1091770 1094730 923539 868243 1070234
20156 1070234 1131334 1160411 1328241 1400298 1394143 1481149 1422715 1398517 1369995 1355037 1404184
20145A404184k4679n0047p5147k2872r1351O4765J92434J59752j01811m0822j39929
20134A274477o3118J3777k5522P8244R6476k6562j07196K9250J06628J23083q2982
20123A416555K229N7085j2918O3304l2647J3031J1674j64148K3110N610j7735
20112A365150J82502O8226M430L8850j84900j01713p869j23500N0375K2663P2659
20101A386873p0997n70J09577O6804N0791k4979P533L0515n3788q5912J88312
20090A604159Q5657k3271p2376J5986j6598k5443M1703J34779j45288j12712L0425
20079A517021j10276J17237J50024l3333o199j3452j6090l971q0332L2172K8467
20068A581268k8307M0045Q8101J18354j537J5716L0608o4659l1605L589N4459
$$ plain form
20145 1404184 1379505 1329458 1254311 1231439 1140088 1204853 1397287 1557039 1455228 1414406 1274477
20134 1274477 1211359 1225136 1199614 1277858 1374334 1347772 1240576 1269826 1376454 1499537 1416555
20123 1416555 1418784 1475869 1462951 1526255 1493608 1506639 1518313 1354165 1377275 1382885 1365150
20112 1365150 1547652 1615878 1620308 1659158 1474258 1372545 1364676 1241176 1291551 1314214 1386873
20101 1386873 1315876 1315306 1424883 1491687 1542478 1517499 1525032 1555547 1501759 1415847 1604159
20090 1604159 1689816 1666545 1594169 1610155 1593557 1568114 1609817 1744596 1599308 1486596 1517021
20079 1517021 1406745 1523982 1674006 1640673 1634474 1621022 1604932 1600961 1520629 1552801 1581268
20068 1581268 1552961 1593006 1681107 1799461 1797924 1813640 1844248 1779589 1747984 1751573 1806032
20057A806032j1620L1410j4236O7722n3631j29568l0837J53814O5240J43450n4172
20046A973604j64944o3938L391L6290M8564M6282K3443Q4180M7162j7665m5048
20035A971321m6633M499l8659O7047O9184j10567n6387k6893N8099M5454M316
20024A940781P2360J09290k1283J2298J08141j9982q8788J66774j15260k1705
20014B142626J77264O4819l2448L3386q2981O3293k9790n4012j60622j56540j4821
20003A950174O2846J62989J95448J76154j2826j2964J09028j06602q7305k8508
19993B408434p3664J46597J4996L768n0341n294N5682Q2815k8596o7200R8392
19982B585589q1676p7475l4691J02604j3114k785J9983N3203P768M9002J49294
$$ plain form
20057 1806032 1794412 1825822 1811586 1879308 1825677 1696109 1665272 1819086 1884326 2027776 1973604
20046 1973604 1808660 1744722 1748113 1784403 1832967 1879249 1902692 1986872 2034034 2016369 1971321
20035 1971321 1924688 1929187 1890528 1957575 2026759 1916192 1859805 1832912 1891011 1936465 1940781
20024 1940781 2013141 2122431 2101148 2113446 2221587 2201605 2112817 2279591 2164331 2142626
20014 2142626 2319890 2384709 2352261 2385647 2302666 2365959 2336169 2282157 2121535 1964995 1950174
20003 1950174 2013020 2176009 2371457 2547611 2534785 2521821 2630849 2524247 2436942 2408434
19993 2408434 2334770 2481367 2496363 2500131 2449790 2444496 2500178 2582993 2554397 2487197 2585589
19982 2585589 2503913 2426438 2391747 2494351 2481237 2478452 2498435 2551638 2559406 2608408 2757702
19971B757702J21834K0978k7517N9147L7404K3132j23805J8034M0450R9781R4755
19960C121895o6594j47777O93J01509J94622L6944j03716K2173k4236P3189J03634
19949C312336p8953j7351J04665n2442k82635q6625J03535J13980J10497J76441
19939C403448q548n4962P3475R1771L2734Q7981J18345J03718j09638j26472j8258
19928C593594L8336J6222j2337o405J3830J53999q6078m6034K7572J50624n7919
19917C785404J3439K4530o5369k09273k5474J75037Q7224r868R9537O5245M6425
19906C986857M8948N1365j10373O950J06354N4570p4536r5455O4562Q6846K02810
19895D328898J09259j04533L9595K0307P0720N5612J09899Q5867L3560M2562J147
$$ plain form
19971 2757702 2879536 2900514 2872997 2932144 2969548 2992680 2868875 2886909 2927359 3027140 3121895
19960 3121895 3055301 2907524 2908217 3009726 3204348 3241292 3137576 3159749 3135513 3208702 3312336
19949 3312336 3233383 3216032 3320697 3268255 2985620 2898995 3002530 3116510 3227007 3403448
19939 3403448 3394900 3339938 3413413 3505184 3537918 3625899 3744244 3847962 3738324 3611852 3593594
19928 3593594 3631930 3648152 3635815 3629410 3643240 3797239 3711161 3665127 3692699 3843323 3785404
19917 3785404 3798843 3823373 3758004 3548731 3523257 3698294 3785518 3775650 3875187 3940432 3986857
19906 3986857 4035805 4087170 3976797 3983747 4090101 4144671 4070135 3974680 4039242 4126088 4328898
19895 4328898 4438157 4333624 4373219 4393526 4464246 4519858 4629757 4715624 4749184 4791746 4792893
19884D792893r4118Q2329K4090m7195P9450J15223l4614L3414J6235j7559n8054
19873D892094P2392K20696J98725J05944j87398j20209k3553l0224J67697J47579
19863E443743R5568J20136K6462n3306J71919j17054m0774K1295l7628R4317J84967
19852E909645J33828m0678j95925m3006J43497J35951K8001Q4825J26534P9203
19842F361875J73810n5000j15465p66R3186J36854o0706J1187J30277K8801K3099
19831F727152N9226Q7291J01535M3625J6818O8973J02609J38710M6481K8185m6466
19820G374139o3484M3090K12144L06497J62364O2256j405m7176K00128J25803
19810H374356Q2885N3743m5153N9563J37489j7171o0727Q4867J42651P864K9564
$$ plain form
19884 4792893 4698775 4781104 4805194 4757999 4837449 4952672 4918058 4951472 4967707 4950148 4892094
19873 4892094 4964486 5185182 5383907 5489851 5302453 5182244 5158691 5128467 5296164 5443743
19863 5443743 5539311 5659447 5685909 5632603 5804522 5687468 5646694 5667989 5630361 5724678 5909645
19852 5909645 6043473 6002795 5806870 5763864 5907361 6043312 6071313 6156138 6282672 6361875
19842 6361875 6535685 6480685 6365220 6364454 6457640 6594494 6533788 6544975 6675252 6704053 6727152
19831 6727152 6786378 6873669 6975204 7018829 7035647 7104620 7207229 7345939 7392420 7420605 7374139
19820 7374139 7310655 7353745 7565889 7872386 8034750 8097006 8095601 8048425 8248553 8374356
19810 8374356 8457241 8510984 8465831 8525394 8662883 8645712 8584985 8669852 8812503 8820367 8849931
19799H849931J16334O3898J44310J29585N2523M9028j60655K15026L793j1273
19789I452500J57254J56717K39359K16201K0366J53997L07355J47833J21452l0382
19779A0942652k23200P3165K74814J54852J86458L05824P6563J68562o2010R383
19769A1907063P8395J57710K35448K30173K2663l7165J07010J07973J68218K16847
19759A3194335J09420L04146K40981K44701K55409Q6131Q7000J40201L55570J27351
19749A5145245P8746J05969J88798O3343J12196J98413J95664J10142K25354K43592
19739A6667462K22104K73386K24691M3818P9624P6143J65367K38879L15755K56743
19729A8563972K21283L26460K53101K49911K25661K67397K01514K37328K28012
$$ plain form
19799 8849931 8966265 9030163 9174473 9304058 9356581 9405609 9244954 9459980 9463773 9452500
19789 9452500 9609754 9766471 10005830 10222031 10242397 10396394 10703749 10851582 10973034 10942652
19779 10942652 10719452 10792617 11067431 11222283 11408741 11714565 11791128 11959690 11897680 11907063
19769 11907063 11985458 12143168 12378616 12608789 12631452 12594287 12701297 12809270 12977488 13194335
19759 13194335 13303755 13607901 13848882 14093583 14348992 14435123 14522123 14662324 15017894 15145245
19749 15145245 15223991 15329960 15518758 15582101 15694297 15892710 16088374 16198516 16423870 16667462
19739 16667462 16889566 17162952 17387643 17431461 17511085 17587228 17752595 17991474 18307229 18563972
19729 18563972 18785255 19111715 19364816 19614727 19840388 20107785 20309299 20546627 20774639
19720B0774639L19686K98575L08548J09766L32246L42356J58923K85384L19511
19711B3249634N22247L02797K92766L61560K81997K41764L02645L83016N22966
19702B6461392L14644L58774L86327N11539K62992L50971M60747L72887L11712
19693B9791985M30728O06076M52249L98048L69436N39888N28286N49135N26205
19684C4192036M51605N22986M93241M05379M17410N47250O86918O22411N83298
19675C8922534N44128M28394N97389N84503M81633N93268P02304P22218O95609
19666D4271980O31492N39242N92586Q42704P45530P23786Q32893P54071P02757
19657E0637041P72106P55709P50746Q97627Q14967P13748P88018P48379R28444
$$ plain form
19720 20774639 21094325 21392900 21701448 21811214 22143460 22485816 22644739 22930123 23249634
19711 23249634 23771881 24074678 24367444 24729004 25011001 25252765 25555410 25938426 26461392
19702 26461392 26776036 27134810 27521137 28032676 28295668 28646639 29107386 29480273 29791985
19693 29791985 30222713 30828789 31281038 31679086 32048522 32588410 33116696 33665831 34192036
19684 34192036 34643641 35166627 35659868 36065247 36482657 37029907 37716825 38339236 38922534
19675 38922534 39466662 39895056 40492445 41076948 41558581 42151849 42854153 43576371 44271980
19666 44271980 44903472 45442714 46035300 46878004 47623534 48347320 49180213 49934284 50637041
19657 50637041 51409147 52164856 52915602 53813229 54628196 55341944 56129962 56878341 57806785
19648E7806785Q65361Q99934P51824Q65615Q48936R04738R77035Q06474Q68539
19639F5595241O84405Q51243R64788P75279Q73087Q63513P11819R15598Q94777
19630G3129750P42262N14875Q66780J027452Q79897Q98642R77478P33470P04768
19621H0475374P61237O72808O58399O80753O71607N89429P64707P54468M80717
19612H6509499L86029N07272M79462M25935L07887L39386N05460L76942J95128
19603I0033000J44173K72273K38533P9140R3703R2801m6740o7797j45718j63384
19593I0529984j2002n8664j10690k30119m27606l56871l44858m21760m13191m79502
19583H7674721o32706n92690m31749o11653n49350m66228n34757n81566n41038
$$ plain form
19648 57806785 58672146 59572080 60323904 61189519 62038455 62943193 63920228 64726702 65595241
19639 65595241 66279646 67130889 68095677 68870956 69744043 70607556 71319375 72234973 73129750
19630 73129750 73872012 74386887 75253667 76281119 77161016 78059658 79037136 79770606 80475374
19621 80475374 81236611 81909419 82567818 83248571 83920178 84509607 85274314 86028782 86509499
19612 86509499 86895528 87402800 87882262 88308197 88616084 88955470 89460930 89837872 90033000
19603 90033000 90177173 90449446 90687979 90767119 90860822 90953623 90906883 90839086 90693368 90529984
19593 90529984 90517982 90459318 90348628 90118509 89690903 89334032 88989174 88567414 88154223 87674721
19583 87674721 87042015 86449325 86017576 85405923 84856573 84390345 83855588 83274022 82732984
19574H2732984o08565p93401p68977q66697q53248r03596q75131o76467p37445
19565G5649457p40061q32285r35114p67005o63329q29826q49400r72024r62863
19556F8097550p74496o45585o91267q20463r15994p82033p45129p82100q24939
19547F1115544q66278q49894p92785p26918p74394p64312r54203r23725p98461
19538E3664574o65764n88782o32116p62762o17120o27679q21259p30768p05806
19529D7512518n82630o60471p01718p33527n24426o56327p77572p57736o53014
19520D1465097l40256m65051n51745n52531n26826o19797n11384n55254n19320
19511C6822933m40925m61035m39086n46169o01123n53950l34026l06660l93426
$$ plain form
19574 82732984 82124419 81331018 80562041 79695344 78842096 77938500 77063369 76386902 75649457
19565 75649457 74909396 74077111 73141997 72374992 71711663 70881837 70032437 69060413 68097550
19556 68097550 67323054 66677469 65986202 65165739 64249745 63467712 62722583 61940483 61115544
19547 61115544 60249266 59399372 58606587 57879669 57105275 56340963 55386760 54463035 53664574
19538 53664574 52998810 52410028 51777912 51015150 50398030 49770351 48949092 48218324 47512518
19529 47512518 46929888 46269417 45567699 44834172 44309746 43653419 42875847 42118111 41465097
19520 41465097 41124841 40659790 40108045 39555514 39028688 38408891 37897507 37342253 36822933
19511 36822933 36382008 35920973 35481887 34935718 34334595 33780645 33446619 33139959 32746533
19502C2746533n59649n63075n23842m26902m52023m52625k86885l18527k97181
19493B8865824l57170m05322m00271k08401k92412l57798k65543k91882l11707
19484B5975318n27657m30687k62330j45247k92215k06510j79052j96556k09581
19475B3525483j42284k42788j79062j30309j66453l07236l09376j74678n5571
19466B1817726j57163k91001k97544k84900l73443l14690m20787l23459j78758
19457A9175981k76725l47302k34690j72549k44968k15410k55930j82905j36243
19448A7109259j74128j55812O9053o649j61379j26879m2842j36776m4481L4897
19438A6364263l45j32480k40776k52994k26923l04325k08876k49448j98845l10093
$$ plain form
19502 32746533 32186884 31623809 31099967 30673065 30221042 29768417 29481532 29163005 28865824
19493 28865824 28508654 28103332 27703061 27494660 27202248 26844450 26578907 26287025 25975318
19484 25975318 25447661 25016974 24754644 24609397 24317182 24110672 23931620 23735064 23525483
19475 23525483 23383199 23140411 22961349 22831040 22664587 22357351 22047975 21873297 21817726
19466 21817726 21660563 21369562 21072018 20787118 20413675 20098985 19678198 19354739 19175981
19457 19175981 18899256 18551954 18317264 18144715 17899747 17684337 17428407 17245502 17109259
19448 17109259 16935131 16779319 16848372 16841723 16680344 16553465 16510623 16373847 16329366 16364263
19438 16364263 16363918 16231438 15990662 15737668 15510745 15206420 14997544 14748096 14549251 14239158
19428A4239158l21500j15909j02536p2793k31510j95235j08528j06721j54207
19419A2830219j39624j21227n5696k19177j8536m0618k14601k04871k45533j75543
19409A1394793j72857m1822O1061l0597k15388r0725j08760k65416o8918J3065
19399A0474436p2162l2541Q9382l0864k12055j55428j97808n2144p0262j494n2218
19388I686842j62138j87453j59572k4773k1893j32967j52506l4137j2334k29543
19378H569526q8448L8831K8459k1598q6819k23441O887K9960M3899j14131j00569
19367H082556O9529j28416k56322j99160K4502O4284n9409m5353p8375j54627
19357G319209L9295J9082l9235j59044k35711r4906J29888l5647n4188j12066
$$ plain form
19428 14239158 13917658 13801749 13699213 13626420 13394910 13199675 13091147 12984426 12830219
19419 12830219 12690595 12569368 12513672 12294495 12275959 12235341 12020740 11815869 11570336 11394793
19409 11394793 11221936 11180114 11241175 11210578 10995190 10904465 10795705 10530289 10461371 10474436
19399 10474436 10402274 10369733 10459115 10428251 10216196 10060768 9862960 9810816 9740554 9739060 9686842
19388 9686842 9524704 9337251 9177679 9152906 9131013 8998046 8845540 8811403 8799069 8569526
19378 8569526 8481078 8519909 8548368 8526770 8439951 8216510 8223397 8253357 8297256 8183125 8082556
19367 8082556 8152085 8023669 7767347 7568187 7592689 7656973 7597564 7552211 7473836 7319209
19357 7319209 7358504 7377586 7338351 7179307 6943596 6848690 6978578 6942931 6888743 6776677
19347F776677j22388J8238Q0700L3493l0172L0055j19154o7345Q919j9662j02143
19336F487218j27848j335j3340P805j60824j10154p5417O2813M2515Q9576o4613
19325F136396M5445n4170j19064j55260k6518n0342K0142J29439K5645J28543
19315F080256J20064J58168K9648j10315j15464L8509R2625k913M7882j379o0047
19304F277034j97577k13225k81412j83040R1182K3326l7714K14255Q846J05480
19294E807155P2930N1732J69126P2586n398k14206r8317l8132L82n8631m516o4534
19282E690177j36334j54519k11499l4423j9915j81578k38718j18741K0152J3772
19272D628374q3459J61147L944q5850n5484o1577j9105M9555j0618k02357j35855
$$ plain form
19347 6776677 6654289 6672527 6753227 6786720 6756548 6786603 6667449 6600104 6609023 6589361 6487218
19336 6487218 6359370 6358035 6344695 6352500 6191676 6081522 6006105 6068918 6111433 6201009 6136396
19325 6136396 6181841 6127671 6008607 5853347 5826829 5776487 5796629 5926068 5951713 6080256
19315 6080256 6200320 6358488 6388136 6277821 6162357 6200866 6293491 6290578 6338460 6337081 6277034
19304 6277034 6079457 5866232 5584820 5401780 5492962 5516288 5478574 5692829 5701675 5807155
19294 5807155 5880085 5931817 6100943 6173529 6168131 5953925 5855608 5817476 5817858 5759227 5754711 5690177
19282 5690177 5553843 5399324 5187825 5153402 5133487 4951909 4713191 4594450 4614602 4628374
19272 4628374 4544915 4706062 4710006 4624156 4568672 4507095 4487990 4537545 4526927 4324570 4188715
19261D188715l238O257k42478p8729Q1553m938r3654M3615l1676q431P7472Q441
19249C942909J3161r8004k22498k1709J8219k6095r8366K9821K06782J61321L134
19238C908675q5662j16996j27950j2125n8729K0350K6414j17434o7196j9748m8494
19227C301105l4431Q7393J40437J71087o5551r8257n3164j13584r0715L7654P7597
19216C359571q9075j97606O5800M3514J8706J11526M0180p4839l9928p867Q5066
19205C315048l2984m9057m4057k9819J218J2631k8413j6345p6664j09968K2725
19194B964315r4518j14156r8729L9447Q1911K5034N094n266Q4170m8414O0758
19183B899646p4779j00319o781m6714R3532L4789p2011o1313m9001q0953Q3559
$$ plain form
19261 4188715 4185477 4191734 3949256 3870527 3952080 3947142 3853488 3897103 3865427 3856996 3934468 3942909
19249 3942909 3956070 3858066 3635568 3613859 3632078 3605983 3507617 3537438 3744220 3905541 3908675
19238 3908675 3823013 3706017 3578067 3565942 3507213 3527563 3553977 3436543 3369347 3349599 3301105
19227 3301105 3266674 3354067 3494504 3665591 3600040 3501783 3448619 3335035 3244320 3281974 3359571
19216 3359571 3270496 3072890 3138690 3182204 3200910 3312436 3352616 3277777 3237849 3229982 3315048
19205 3315048 3282064 3233007 3188950 3159131 3160349 3172980 3144567 3128222 3051558 2941590 2964315
19194 2964315 2869797 2755641 2656912 2696359 2778270 2803304 2808398 2803132 2887302 2838888 2899646
19183 2899646 2824867 2724548 2717767 2671053 2764585 2799374 2727363 2666050 2617049 2536096 2619655
19172B619655J40691k926j12102j793o9153R5468p7389j25782O8658R2202L804
19161B631333j07799j26523n034N9237K6290O382J00925P6980J30576p4931M1120
19150B758556j0585l6970k008l0596J2733J8344O6256L4383J4514j14821p8795
19139B631011q1438q355n6853J17235J38665N027k00211o1523Q182J56546J9786
19128B668072k22897q5992p3234j14393l5341J06874L6740m745K05123k2685J2474
19117B469996N9585L977j14554N6180J34661Q6072r5182n4112o1964J5419L6290
19106B536368k0400k2221R1298j35512q3840M8678j9699j25800j87756k8268n395
19095B047453J3843p5452q6294M9640J618j8144O5063n0889k2258k5627m1450
$$ plain form
19172 2619655 2760346 2757420 2645318 2643525 2574372 2669840 2592451 2466669 2535327 2627529 2631333
19161 2631333 2523534 2397011 2391977 2451214 2477504 2483886 2584811 2661791 2792367 2717436 2758556
19150 2758556 2747971 2711001 2708993 2678397 2691130 2709474 2775730 2810113 2824627 2709806 2631011
19139 2631011 2549573 2541218 2484365 2601600 2740265 2745292 2545081 2483558 2491740 2648286 2668072
19128 2668072 2445175 2359183 2285949 2171556 2136215 2243089 2279829 2275084 2480207 2457522 2469996
19117 2469996 2529581 2533558 2419004 2475184 2609845 2695917 2600735 2546623 2484659 2500078 2536368
19106 2536368 2515968 2493747 2585045 2449533 2365693 2414371 2394672 2268872 2081116 2052848 2047453
19095 2047453 2061296 1985844 1899550 1949190 1950808 1932664 1997727 1946838 1924580 1898953 1857503
19084A857503M4274j08036n8535J15137K0957N1784R5480R0931n7340J25820l0359
19073B147616k6962k6114l5068P600K1579K0325J60687n8846j41807l8695P7031
19062B107346P6678o6505k16982j63324J70638J31983M3948J29816j6303n1510
19052B145785m081k7288j8574M7286P2358M3845o8640J10403M342r642J7181k3737
19040B289238p3260J04694p3409m4137l0787J37614J45776L0688J78253K61064
19030B925734Q5176L9388l335K02221J35855j9158o9713o9799N5626J16134j46392
19019C251737j0463k2193o9552j71545j50393j39121j10608k2610L8915j76105
19009B418062m3665J34825k0215p7367R681J12935O4309J91708K57681R6541Q9460
$$ plain form
19084 1857503 1901777 1793741 1735206 1850343 1871300 1923084 2018564 2109495 2052155 2177975 2147616
19073 2147616 2120654 2094540 2059472 2067072 2088651 2108976 2269663 2210817 2069010 2030315 2107346
19062 2107346 2184024 2117519 1900537 1737213 1907851 2039834 2083782 2213598 2197295 2145785
19052 2145785 2141704 2114416 2095842 2143128 2215486 2259331 2190691 2301094 2305436 2295794 2312975 2289238
19040 2289238 2215978 2320672 2247263 2203126 2172339 2309953 2455729 2486417 2664670 2925734
19030 2925734 3010910 3050298 3046963 3249184 3385039 3365881 3296168 3226369 3281995 3398129 3251737
19019 3251737 3241274 3219081 3149529 2977984 2827591 2688470 2577862 2555252 2594167 2418062
19009 2418062 2374397 2509222 2489007 2411640 2421321 2534256 2598565 2790273 3047954 3144495 3233955
18998C233955J95049K92524J68773J31254K52037J68262k2997O8498q8125o7486
18988D331744n7435p7397k86682k33500j79923j54530k5030L4637j22311j08987
18978C120586j34961o0489l2756k58704N2946J29303P6558J65786K14361N1434
18968C324064N9949J05888L57406J59294O8366P5443j7029R7839J06568O6519
18958D404307R5565k7759j29105j20817r8777k17773j15417J4552o5757j34817
18948C604202M8612O1937j00873O0721N1165k8041O6316L7682p2434k8781O9903
18937C770409J01730J00473j0637m5314J43041J98624J95679J67376J60418J04754
18927D886553K17678L06562J92452L26547L65313M05583M25896K14059k7607J75008
$$ plain form
18998 3233955 3429004 3721528 3890301 4021555 4273592 4441854 4418857 4487355 4399230 4331744
18988 4331744 4274309 4196912 3910230 3676730 3496807 3342277 3317247 3351884 3229573 3120586
18978 3120586 2985625 2925136 2892380 2633676 2686622 2815925 2892483 3058269 3272630 3324064
18968 3324064 3384013 3489901 3847307 4006601 4074967 4150410 4133381 4231220 4337788 4404307
18958 4404307 4499872 4472113 4343008 4222191 4123414 3905641 3790224 3804776 3739019 3604202
18948 3604202 3652814 3714751 3613878 3674599 3725764 3697723 3764039 3801721 3729287 3700506 3770409
18937 3770409 3872139 3972612 3961975 3916661 4059702 4258326 4454005 4621381 4781799 4886553
18927 4886553 5104231 5410793 5603245 5929792 6295105 6700688 7126584 7340643 7313036 7488044
18917G488044L57986L22443J81212J77008K36066J89231L61096N76898O46999
18908A0536983O68142J003805J288312J571337J952916K328426K985122L479352
18900B5814395M060341N158072O884253Q911305J1885133J5717776K0583861K7175078
18892A26190214L2833507L4580979L0937294J8426899k076567p897098K961958
18885B35957186J1858423J0414968l072992l0740769m5305811l7095567k3870296
18878A18145142j5329263j0581049p565324n446029l568367k244348p99502L89091
18870G3000351J834739L537649N555247P995611J1346318J5949827K2168061K9503880
18862A70891683L4696267L5071704K9229598J1688918r544363r463440M181700
$$ plain form
18917 7488044 7846030 8168473 8349685 8526693 8762759 8951990 9313086 9889984 10536983
18908 10536983 11205125 12208930 13497242 15068579 17021495 19349921 22335043 25814395
18900 25814395 29874736 35032808 41917061 50828366 62713499 78431275 99015136 126190214
18892 126190214 159023721 193604700 224541994 242968893 240892326 232995228 235957186
18885 235957186 247815609 258230577 255157585 224416816 179111005 142015438 118145142
18878 118145142 102815879 92234830 84669506 79223477 75655110 73410762 72611260 73000351
18870 73000351 74835090 78372739 83927986 91923597 103269915 119219742 141387803 170891683
18862 170891683 205587950 240659654 269889252 281578170 272033807 262570367 266752067
18855B66752067J1126881O559873j2344317l9680944m7774770l6801375k4460435
18848A23376980j6786168j2533291r753832p904845o352746n214070m442531l630386
18840E6759111l050792k923028k831828k441627k260953k078747j557018j405633
18832C8209485j729599j807180j673040j573261j258851j190358j110618q84220
18824B6982358o86825o92884p85720r36434r02815m84177m22743m82893m78602
18815B1109265n06968l95086j61647M2867J32147M79928N19202Q12375J374715
18806B3406798J800729K272659K825970L509258M406683N792730P092013R061533
18798F0168373J2125930J5790018K0593332K6479592L2194211L4248563L0033195
$$ plain form
18855 266752067 277878948 284438821 272094504 232413560 184638790 147837415 123376980
18848 123376980 106590812 94057521 84303689 76398844 70046098 64832028 60389497 56759111
18840 56759111 53708319 50785291 47953463 45511836 43250883 41172136 39615118 38209485
18832 38209485 36479886 34672706 32999666 31426405 30167554 28977196 27866578 26982358
18824 26982358 26295533 25602649 24816929 23880495 22977680 22493503 22070760 21587867 21109265
18815 21109265 20602297 20207211 20045564 20088431 20220578 20700506 21219708 22032083 23406798
18806 23406798 25207527 27480186 30306156 33815414 38222097 44014827 51106840 60168373
18798 60168373 72294303 88084321 108677653 135157245 167351456 201600019 231633214
18791B31633214J8115650k304498j3903216p381078L180279O328443n02128j9135099
18783B16031567l4584302l2381633k1638563j2295859n851559q57716L984894
18776A12406829R176111J4595946K1181587K8607634L4270218L4408676K7242935
18769B81889936R361055j3662412j8926768p643367J896087J429778j0095682
18762B44248627l0094088l9593679l3827008k4058898j6705165j2312502r509743
18755G8147544p463348n906717m725598l660779l044768k646469k620868k476734
18747D5602263k478755k207108j887551j670419j451941j520386j526553j447219
18739C1412331j260056j386123j447302j332327j315509j345295j109479r80987
$$ plain form
18791 231633214 249748864 247444366 233541150 226160072 229340351 235668794 235166666 216031567
18783 216031567 181447265 149065632 127427069 115131210 109279651 108421935 112406829
18776 112406829 121582940 136178886 157360473 185968107 220238325 254647001 281889936
18769 281889936 291250991 277588579 258661811 251018444 252914531 254344309 244248627
18762 244248627 214154539 174560860 140733852 116674954 99969789 87657287 78147544
18755 78147544 70684196 64777479 60051881 56391102 53346334 50699865 48078997 45602263
18747 45602263 43123508 40916400 39028849 37358430 35906489 34386103 32859550 31412331
18739 31412331 30152275 28766152 27318850 25986523 24671014 23325719 22216240 21235253
18731B1235253q73770j093756j187907j105633j173358r51106p85274p95844o98779
18722A2569826o31637p60841o92447n93494m87419m86316n19982l48213k02711
18713G846766l20286l49141k00124j70466k51110k57259j89962k56945j70585
18704E680888j23553o6553p326n2559j3649n9959j31857k9450R5957M1637J12132
18693E445708J4023l5077m203J67019L39366K05530J09557J94884P6079o1502
18683F451384j69252j07810Q4816j02080k38734m00866j96174k47269k94702l2150
18673D747163q6209k66033o2513Q8950R7679K5701R9680O8107R0912J09560K41518
18662E154515K32781K45766K23775K22127K13612R0120J11279J03270k91700k49867
$$ plain form
18731 21235253 20361483 19267727 18079820 16974187 15800829 14849723 14064449 13268605 12569826
18722 12569826 11938189 11177348 10484901 9891407 9403988 8917672 8397690 8049477 7846766
18713 7846766 7526480 7177339 6977215 6806749 6555639 6298380 6108418 5851473 5680888
18704 5680888 5557335 5490782 5483456 5430897 5417248 5357289 5225432 5195982 5291939 5333576 5445708
18693 5445708 5459731 5424654 5420451 5587470 5926836 6132366 6241923 6436807 6512886 6451384
18683 6451384 6282132 6174322 6259138 6157058 5918324 5517458 5321284 5074015 4779313 4747163
18673 4747163 4660954 4394921 4332408 4421358 4519037 4544738 4644418 4712525 4803437 4912997 5154515
18662 5154515 5387296 5633062 5856837 6078964 6292576 6382696 6493975 6597245 6305545 6055678
18652F055678j31979o8795n1223j38914k95498j28072O9436q3426l25998j93485
18642D707724j5313m4534j73132j78970k31234k19727j76016n1513L469j36677
18632C484077r9104j45006j19363k45095j9933J63911K51207L30395K42860L48415
18622D192364O52214Q20155N67541R1792o51514o74599l63682o7513n5790j65985
18612D344983J0676j9231n754j74914q6550P5555K09417R9553Q1237k08730l45323
18601C980919j35198P1101J87395L87840K43107j63735m14571j42747J74146J71135
18591D359392J83038K93287K07618L7640J30602K33038L91355L88297L26206M20718
18581F971191k46841r64437q74917n43394n11377k84934m4922L5306J7283Q0225
$$ plain form
18652 6055678 5923699 5854904 5803681 5664767 5369269 5241197 5310633 5227207 4901209 4707724
18642 4707724 4692411 4647877 4474745 4295775 4064541 3844814 3668798 3617285 3620754 3484077
18632 3484077 3384973 3239967 3120604 2875509 2855576 3019487 3270694 3601089 3843949 4192364
18622 4192364 4844578 5664733 6232274 6324066 5672552 4997953 4634271 4566758 4510968 4344983
18612 4344983 4355659 4336428 4330674 4155760 4069210 4144765 4354182 4453735 4534972 4326242 3980919
18601 3980919 3845721 3916822 4104217 4492057 4735164 4571429 4156858 4014111 4188257 4359392
18591 4359392 4542430 4835717 5043335 5080975 5211577 5444615 5835970 6224267 6550473 6971191
18581 6971191 6724350 5759913 4884996 4341602 3830225 3545291 3500369 3535675 3552958 3633183
18571C633183R6939K1358l9871O9193J49044K08438K97908M49073K59605M19760
18561E564630N91294O18870P23755Q77955P62036P30448Q48884R98372R54813
18552A2671057R30200P61552L95749K08425L25866J74293k860j46648n46118o63516
18542A4108000n31106k70233k71029k05906j30409K44977M16976N64513O66066
18533A4591849N16396O48348O95096M77506L13093J56812j37168k39120k16555
18524A6806257n97337r21484r31748j041949r98818r45363p19828q28016o36522
18515I185192m97862o24565n91198n51792n50972l23990l10018k72336k26828
18506E235631m53386k52717n4209j28049k71105k05186j53784p8441k9010q2387
$$ plain form
18571 3633183 3730122 3751480 3711609 3780802 3929846 4138284 4436192 4885265 5144870 5564630
18561 5564630 6155924 6774794 7498549 8376504 9138540 9868988 10717872 11716244 12671057
18552 12671057 13601257 14362809 14758558 14966983 15292849 15467142 15464282 15317634 14771516 14108000
18542 14108000 13576894 13306661 13035632 12829726 12699317 12944294 13361270 13925783 14591849
18533 14591849 15108245 15756593 16451689 16929195 17242288 17399100 17261932 17022812 16806257
18524 16806257 16208920 15287436 14355688 13313739 12314921 11369558 10649730 9821714 9185192
18515 9185192 8687330 8062765 7471567 6919775 6368803 6044813 5734795 5462459 5235631
18506 5235631 4782245 4529528 4475319 4347270 4076165 3870979 3717195 3638754 3609744 3527357
18496C527357O6448J91409N7659q3138j64918j17110j45396j2732j11924j39943
18486C067712J6350m0515q2132q7335j04658J005k05841k40517P971q8279k37131
18475B006630j76211j0464J1872n2920J6282J03160k1177j41766j9398j763J44873
18464A859118n2640N0444L957M3890j13706k42688k20834j66333j62113L001j6989
18453I85107m3307n1536L2934k589k6224j51646n0926j2078M2174R2564k4779
18442G89694Q1576J61696J42305j04425k12719q4700M9928J0481j82939k985K474
18431F50386j7929p5234J8362O4745Q2348m456n1198l1544O2147O055O9496Q7186
18419H60364j06230N3925L5050o1274j18334k76010M4630J03489J29803k9979
$$ plain form
18496 3527357 3593805 3785214 3842873 3759735 3594817 3477707 3332311 3319579 3207655 3067712
18486 3067712 3084062 3043547 2961415 2874080 2769422 2770427 2564586 2324069 2332040 2243761 2006630
18475 2006630 1830419 1819955 1831827 1778907 1795189 1898349 1877172 1735406 1716008 1714245 1859118
18464 1859118 1806478 1856922 1860879 1904769 1791063 1548375 1327541 1161208 999095 1002096 985107
18453 985107 941800 890264 923198 920609 894385 742739 691813 679735 721909 814473 789694
18442 789694 871270 1032966 1175271 1070846 858127 773427 823355 833836 650897 647912 650386
18431 650386 632457 557223 575585 640330 722678 718222 667024 635480 697627 703682 773178 860364
18419 860364 754134 808059 843109 781835 663501 387491 432121 535610 665413 635434
18409F35434j23849R6008Q9957P1638J8722l9556q5291j04925L3911J10931n1961
18398F51019o2472n3990O4684R0145J5221j11595P6212N1351n1714l3070j4m1693
18386E94084k0095k77n3516R3479l899o8213k9876O216J74215J51777q0445p6780
18374F86670p9588l6260N2312K289O0824j3477j40412P6570L5456j28252k1553
18363D94579J6391p720k0601r2230M125L6725N0238n5219n5431p1742j12999J01904
18351B88020J44273J37145m1389j1667M0077Q3096n4088R2234r5239p6664J42906
18340F48704q4252m5656M2665O3767p7223m0026k575J7777J81155o6210j6983
18329F21143J39576m9173j40436k552k0879o2215k5427J36175J02090P2957j0190
$$ plain form
18409 635434 511585 607593 697550 769188 787910 748354 663063 558138 592049 702980 651019
18398 651019 588547 534557 599241 689386 704607 593012 669224 720575 668861 635791 635777 594084
18386 594084 573989 573712 520196 613675 609776 541563 511687 517903 692118 843895 763450 686670
18374 686670 607082 570822 623134 625423 686247 672770 532358 608928 644384 516132 494579
18363 494579 510970 503250 482649 390419 394544 431269 481507 426288 370857 299115 186116 288020
18351 288020 432293 569438 528049 516382 556459 639555 585467 677701 582462 505798 648704
18340 648704 564452 518796 561461 625228 548005 507979 505404 523181 704336 638126 621143
18329 621143 760719 711546 571110 568558 547679 485464 460037 596212 698302 771259 761069
18318G61069j47079j07318Q6216J18457R9244n115q3567N0003O5564J02310L2326
18307I72110J39455N9292J03999J86385J47495J50935L8067N3142R6781O638j42996
18296A811303j72763L4513J34412j26620l40170j26302j3611l7700j47745n5856
18286I59461m7154O8284J13229Q9610L3545M9924j4950o5378N2246J31885J82416
18275A553118K18359K92046K22501J46503J14919J28753Q1546J02307P1914R5620
18265C027586M6801n7239q1709j51850k38624j22686j30211J220l6262j31675
18255B125351m691J32648j12469J8722N9J06045Q7485K84064L12778K77093K60363
18244C487448M26608K77923J97566K22237J08278L15997L36790K33486r5056j33020
$$ plain form
18318 761069 613990 506672 592888 711345 810589 805474 721907 771910 837474 939784 972110
18307 972110 1111565 1170857 1274856 1461241 1608736 1759671 1797738 1850880 1947661 1954299 1811303
18296 1811303 1638540 1673053 1807465 1680845 1340675 1214373 1200762 1163062 1015317 959461
18286 959461 912307 980591 1093820 1183430 1216975 1266899 1251949 1186571 1238817 1370702 1553118
18275 1553118 1771477 2063523 2286024 2432527 2547446 2676199 2757745 2860052 2931966 3027586
18265 3027586 3074387 3017148 2935439 2783589 2544965 2422279 2292068 2293288 2257026 2125351
18255 2125351 2120660 2253308 2140839 2159561 2159620 2265665 2353150 2637214 2949992 3227085 3487448
18244 3487448 3914056 4191979 4389545 4611782 4720060 5036057 5372847 5606333 5511277 5378257
18234E378257j65595l16486k96821j19699k19836j30280j02651q1605n7845Q3583
18224C971022p5633J7503J48452J87936Q9520R5809L28391K75261q4621q4741
18214D868899l991k15304j17226k90077j81865k28822k91979l07291m09154k57172
18204B566018N2460j97898j66775o7523m4368k4520q5804j90462k41014j10J0168
18193A610172k7959l1529j80209j16303J02129N1991j26808j07153j44017j34972
18183H95342K2736N7213J15978P1984l4522j74514r8458J04065p216r6323j12859
18172G43426J87905j4627j27690l1613M885l3251P2984L2275p851M1432K9185
18161H97060j24496M7117J76766L5786k34037K0418K1267l7258q0544o8259Q1638
$$ plain form
18234 5378257 5212662 4896176 4599355 4479656 4259820 4129540 4026889 3945284 3887439 3971022
18224 3971022 3895389 3912892 4061344 4249280 4338800 4434609 4763000 5038261 4953640 4868899
18214 4868899 4864908 4649604 4532378 4242301 4060436 3831614 3539635 3232344 2823190 2566018
18204 2566018 2618478 2420580 2253805 2186282 2141914 2117394 2031590 1841128 1600114 1600004 1610172
18193 1610172 1582213 1550684 1370475 1254172 1356301 1408292 1281484 1174331 1030314 895342
18183 895342 918078 975291 1091269 1163253 1128731 954217 855759 959824 952608 856285 743426
18172 743426 931331 916704 789014 757401 762286 729035 802019 834294 826443 867875 897060
18161 897060 772564 819681 996447 1032233 798196 818614 839881 802623 722079 653820 735458
18150G35458k0414j92931N3181N6639j05037P7525Q0033l489l0010L8714Q3077
18139G72746j35881j13756P1556K29671N060j6259R320k0877q4105p6260j11684
18128E29531j6336O7792K00576m838K4577J0106M8084k8459J22032J6924o0153
18117I09836j218R2397J16952o369o0521j30855n6082m5054l496N4450J40180
18106A010220p0905q6825K64852J50604L1564j1712j09874j41633O7593R0616
18096A194500J348k9750J05046L1240k224L3917l5797q347j6514p9356J63327
18085A357390K74055j1364r5414L6051J73740K41166L39946J04150O4769o3911
18075B420578k50904j42006j66233l3806j11965j8610J38933J60922J2023R2962
$$ plain form
18150 735458 715044 522113 575294 631933 526896 604421 684454 680965 650955 689669 772746
18139 772746 636865 523109 594665 824336 829396 813137 822457 801580 717475 641215 529531
18128 529531 513195 580987 781563 776725 801302 811408 859492 831033 953065 969989 909836
18117 909836 908618 1001015 1117967 1111598 1051077 920222 864140 819086 815590 870040 1010220
18106 1010220 939315 852490 1117342 1267946 1299510 1287798 1177924 1036291 1103884 1194500
18096 1194500 1195848 1166098 1271144 1302384 1300160 1334077 1298280 1289933 1273419 1194063 1357390
18085 1357390 1631445 1620081 1524667 1560718 1734458 1975624 2315570 2419720 2484489 2420578
18075 2420578 2169674 2027668 1861435 1827629 1715664 1697054 1835987 1996909 2008932 2101894
18065B101894R2695K433o5384J32036J31014K41692K34361K21541J94940J62163
18055C449385Q1566R1360O0875j2155J65368K66978K46064K28009n1119k15389
18045D310942k16332q2849l6096N9051K5184L59087M38166K91104K93155L71354
18035E812766N79089P34058R23853J237109J289112J415926J607216J329372Q85604
18026A5814105L89280k06978o98184r49360q80785n47600m27898j34742K54803
18017A2612641N75929L47885L40766L03842L89878Q53723J323259J608667J861123
18008B0217713J999235K192827K236718K350699K337950K654901L199828M445402
18000D1635273O031180P895230J0123139J3199578J7079959K2282089K8387683
$$ plain form
18065 2101894 2194589 2197022 2131638 2263674 2394688 2636380 2870741 3092282 3287222 3449385
18055 3449385 3530951 3622311 3683186 3671031 3836399 4103377 4349441 4577450 4526331 4310942
18045 4310942 4094610 4011761 3975665 4034716 4059900 4418987 4857153 5148257 5441412 5812766
18035 5812766 6391855 7125913 8049766 9286875 10575987 11991913 13599129 14928501 15814105
18026 15814105 16203385 15996407 15298223 14348863 13468078 12920478 12492580 12357838 12612641
18017 12612641 13188570 13536455 13877221 14181063 14570941 15424664 16747923 18356590 20217713
18008 20217713 22216948 24409775 26646493 28997192 31335142 33990043 37189871 41635273
18000 41635273 47666453 55561683 65684822 78884400 95964359 118246448 146634131
17993A46634131L1483614K7515995J5867801j0938759l8614009m0393806k7779521
17986A03775446j6838189j0845444p297480m429842j985890q2536J768792L642422
17978F7707279N714362P949308J0720502J4182447J8835914K4833125L0350888
17971A80293825L1852368K6535604J2373046j2992287k6702986j7204794o9433
17964A94085343J3070282J8429737J5426527K487635k3881646m1946662l7379243
17957A40291973k5254709j6367260j1136830p685078n209384l150759j364630
17950G0123323L39287K107801L747376N484972Q255269J1692788J6462045K2523355
17942A40736216K7021840K5829626J7509475j753353l0928117m1281003l1584557
$$ plain form
17993 146634131 178117745 205633740 221501541 210562782 171948773 131554967 103775446
17986 103775446 86937257 76091813 68794333 64364491 62378601 62296065 64064857 67707279
17978 67707279 73421641 81370949 92091451 106273898 125109812 149942937 180293825
17971 180293825 212146193 238681797 251054843 238062556 211359570 194154776 194085343
17964 194085343 207155625 225585362 241011889 243499524 219617878 177671216 140291973
17957 140291973 115037264 98670004 87533174 79848096 74638712 71487953 70123323
17950 70123323 70462610 72570411 76317787 81802759 90058028 101750816 118212861 140736216
17942 140736216 167758056 193587682 211097157 209343804 178415687 137134684 105550127
17935A05550127k0203874j3481529r664923p531685n814555m567336l472897k724779
17927C8088549k215154j617878j169140j057244j540293j753423j482671j083556
17919B6169190r46710r99618j285303j264928j008117p91930q07073r01526j027635
17910A7136350r17427p04825o02218r01985q15017p92638q30871q53762o15569
17901A0102038m25296m91062m89796m68766m41512k02918j66898j34562k5593
17892G255635j68848J8496R4044M0769r3838p2170K807k69918k58002o2679L4741
17881F521037o3552j41588j67171l08576k15854l25371m36486k95129l01965k07821
17871D057524p3441p5007q1380j84245j75060n3051j2307L0882L9946O2825M4776
$$ plain form
17935 105550127 85346253 71864724 62199801 54668116 48853561 44286225 40813328 38088549
17927 38088549 35873395 34255517 33086377 32029133 30488840 28735417 27252746 26169190
17919 26169190 25222480 24222862 22937559 21672631 20664514 19872584 19065511 18163985 17136350
17910 17136350 16218923 15514098 14911880 14009895 13194878 12402240 11571369 10717607 10102038
17901 10102038 9676742 9185680 8695884 8227118 7785606 7582688 7415790 7281228 7255635
17892 7255635 7086787 7105283 7199327 7240096 7146258 7074088 7076895 6806977 6548975 6486296 6521037
17881 6521037 6457485 6315897 6148726 5840150 5624296 5298925 4862439 4567310 4265345 4057524
17871 4057524 3984083 3909076 3827696 3643451 3468391 3415340 3403033 3433915 3473861 3536686 3581462
17860C581462P0871N3014k1392q4693k86421k55359k70245k36288j00492J8905
17850B469362j77072j32337J18204N6397k54220k17019P811k3936P8220l4712
17840A890698j54592j63207k46885k8759J53083r9574k6485j14065o6976M7591
17830A190829J7411M8072q8132k5527n3261J31375K4550p0435Q106n0416N046
17819A137618o4504l973n8096k5823o6864M7246M047N1501j17856J7042J09822
17808A030160J34507p523k53282k75626l3763J57595m5926m1676K01436J47039
17798A012941j19930j68193l4442m4019L6663j0958m2499J04780L6190n2382r6438
17787F21713M0219j3216J71056J25128j3003k9218j4058m1784j873M3575j16383
$$ plain form
17860 3581462 3652333 3705347 3683955 3599262 3312841 3057482 2787237 2550949 2450457 2469362
17850 2469362 2292290 2159953 2278157 2334554 2080334 1863315 1871126 1847190 1925410 1890698
17840 1890698 1736106 1572899 1326014 1297255 1450338 1350764 1324279 1210214 1143238 1190829
17830 1190829 1208240 1256312 1168180 1142653 1089392 1220767 1245317 1174882 1182988 1132572 1137618
17819 1137618 1073114 1069141 1011045 985222 918358 965604 969651 1021152 903296 920338 1030160
17808 1030160 1164667 1157144 903862 628236 594473 752068 706142 664466 865902 1012941
17798 1012941 893011 724818 690376 646357 683020 672062 629563 734343 770533 718151 621713
17787 621713 661932 648716 819772 944900 931897 902679 888621 846837 844964 888539 772156
17776G72156p3807o125Q5110n4308j02513k7291J1512J67477J80540r5312q4111
17765G73328j07996r761j25566m7633R3501n0498q1569O3318m259k8882P790Q8411
17753E70184N2124m0532k2998j31950K446M4057J5074r1646m0633K1630L9950
17742D17706m3196k5279O5506J07333J34069Q6955o0471l4926O0509q1705m8433
17731E78068j00074j09484k8099j10276l4928J47633M6857n3792J66054P4820
17721E76779O1318j05053p4088j31501J3465O6275j18540j8502J36025K545j21362
17710B87361L5911M5205p8227P7783r8434L7104J00280j1732n5032r324N5436
17699C86331l5566l3608R061J55677J7732q4479r0569L5163j85633M5328J67k1615
$$ plain form
17776 772156 698349 692224 777334 723026 620513 593222 604734 772211 952751 857439 773328
17765 773328 665332 655571 530005 482372 575873 525375 443806 507124 502865 473983 481773 570184
17753 570184 622308 581776 558778 426828 429274 473331 488405 396759 356126 377756 417706
17742 417706 374510 349231 414737 522070 656139 743094 682623 647697 708206 626501 578068
17731 578068 477994 368510 340411 230135 195207 342840 389697 335905 501959 576779
17721 576779 638097 533044 458956 327455 340920 407195 288655 270153 406178 408723 287361
17710 287361 323272 368477 290250 368033 269599 306703 406983 395251 340219 330895 386331
17699 386331 350765 317157 326218 481895 499627 415148 324579 359742 174109 219437 219604 197989
17687A97989n6717J25752J40810o1362j33224J09070L3646J1l7178Q0151N2825
17676D51773m2073j4043p2153J0240J23019o5372O405k56j47522R5769l9943L2840
17664C38684k6857K9019l2892j46323J2154k4560m5946J90184J9412j34482j28391
17653E0002Q9353O1948N377Q4838m4190j26289o2652Q8467N8545L5644O8911q8180
17641B21774N9516m7993j6629N4651j7391j38547q0671J07241M8425J38509O1720
17630C90605q7104j38311o7931K1203m1303j3846N4967N7500J07530j51196m417
17619A27697Q5903m4805n4242o1688p3022P4643J74991N6356N2177p1603J1378
17608B77785j009j07325M6353J4817l9107j11827m5915J19848m0541N9447p6855
$$ plain form
17687 197989 141272 267024 407834 346472 213248 322318 355964 355975 318797 398948 451773
17676 451773 409700 395657 323504 333744 456763 391391 397796 397540 250018 345787 305844 338684
17664 338684 311827 340846 307954 161631 173785 149225 103279 293463 312875 178393 50002
17653 50002 139355 201303 206680 291518 247328 121039 58387 146854 205399 241043 309954 221774
17641 221774 281290 233297 216668 271319 253928 115381 34710 141951 190376 328885 390605
17630 390605 303501 165190 97259 118462 77159 63313 118280 175780 283310 132114 127697
17619 127697 213600 168795 114553 52865 -20157 54486 229477 285833 338010 266407 277785
17608 277785 276776 169451 215804 230621 191514 79687 33772 153620 113079 172526 95671
17597I5671K6759J4598o282k5088m7314Q4571P1743J35642J10569p8267J6090
17586C98692J251q6520j59760P1925P7598p4540r0928n9106K4838J28084P7193
17575C08727m6514j91449q7007r7680j18900J61449J91604j15788q1094j89905
17565b66557J9650J71161J54612O435J6643j2624k8611O0785J3485j6778o4885
17554E3316P3261o2166K3767O2962l2900p6108J29896P0492k6761k0326n4730
17543A40703p3873m615R6102l3347J6979m1048M0409j77809M7157K94347J48521
17532D53526j07532o0371l1575o1492L209R001j7492R734K3035p0966j4526R9867
17520B34418j22059o7681O555j9244Q5270Q2134M1078J3014k8179M4863P9692
$$ plain form
17597 95671 122430 137028 130746 105658 58344 142915 214658 350300 460869 382602 398692
17586 398692 399943 313423 153663 225588 303186 228646 137718 78612 103450 231534 308727
17575 308727 262213 70764 -16243 -113923 -232823 -71374 120230 4442 -76652 -266557
17565 -266557 -246907 -75746 78866 85301 101944 89320 60709 121494 134979 118201 53316
17554 53316 126577 64411 88178 151140 118240 42132 172028 242520 215759 195433 140703
17543 140703 66830 62215 158317 124970 141949 100901 141310 -36499 10658 305005 453526
17532 453526 345994 285623 254048 192556 195765 204766 187274 197008 220043 149077 134551 234418
17520 234418 112359 44678 51233 31989 117259 199393 240471 253485 225306 270169 349861
17509C49861K1536q7628q9556J08296N6298o0824J9541N2667P5537L8178j32137
17498C51769n100J6404J9145O7474q6506j81747L5922J5572J17790m3945J9767
17487C26545l7582m0095l4765P1849P6353n2018O3211P1885r934J27346K4592
17476E87387j54896k17494j78104J29672J52786J63304K46523O3596k75726l8707
17466D78341K5286j1872J51566P0351J37514K10640p3065j59450j43771q5504
17456F00036j00541p7043M3000Q4726N8811m2054N9996P2659k6738j17571o3256
17445D92025k7569J14719J28420K20735K32788J06697n360J5805j05068r5247
17435A077945J16906M9922p4130j97529p2740j1008J2876o1043l3684j07498r4057
$$ plain form
17509 349861 371397 283769 194213 302509 358807 297983 317524 370191 445728 483906 351769
17498 351769 346669 363073 382218 449692 363186 181439 217361 232933 350723 306778 326545
17487 326545 288963 248868 214103 285952 362305 310287 373498 445383 435449 562795 587387
17476 587387 432491 214997 36893 166565 319351 482655 729178 792774 517048 478341
17466 478341 503627 491755 643321 713672 851186 1061826 988761 829311 685540 600036
17456 600036 499495 422452 465452 550178 608989 566935 626931 699590 672852 555281 492025
17445 492025 464456 579175 707595 928330 1161118 1267815 1262455 1278260 1173192 1077945
17435 1077945 1194851 1244773 1170643 973114 900374 889366 902242 841199 807515 700017 605960
17424F05960j43863J0070n3941j0248J818K6869l9224O8928k222M2142J57227
17413F63516K15828J17626K07714R3215l38052j33837j02636q9678k13142M3272
17403D63826l199j06318J20362J0811l4117j24534j05758M5004l170K9805J9532
17392C12244j4875Q5345J30269o9616j82530K9856m5179k3095r7254L0005Q5694
17381B40864n7530O304L2425M9882j16794j10199p9896J03850J10577r3755L686
17370H9414M9945Q537L8122L6883k0925m6048j36153J56278K4273o9669O0125
17359A90782R2459J5201q3847j63332l73Q3138J02504k5683j6403m6276r749M1931
17347A80352J35157L372M4844K0729N1799r5984o5265o3206J6315P7204j00944
$$ plain form
17424 605960 462097 472167 418226 407978 409796 436665 397441 466369 464147 506289 663516
17413 663516 879344 996970 1204684 1297899 959847 826010 723374 633696 420554 463826
17403 463826 460627 354309 474671 485482 451365 326831 221073 266077 262907 292712 312244
17392 312244 297369 382714 512983 443367 260837 290693 245514 222419 125165 155170 240864
17381 240864 183334 189638 222063 271945 155151 44952 -34944 68906 179483 85728 89414
17370 89414 139359 147896 186018 222901 201976 155928 19775 176053 200326 130657 190782
17359 190782 283241 298442 214595 51263 50890 134028 236532 210849 194446 148170 138421 180352
17347 180352 315509 318881 363725 384454 436253 340269 275004 211798 228113 305317 204373
17336B04373J862j16836J00019J27039j21191p7948l120p8909N9416l9355o9586
17325a4236j28937N9994P3380O6074J21462n3882j60519j5213J52913P7214l4331
17314A43919O752p4567r9693R0480N9334R9048J7390M4711L518n1882l7886J05665
17302C06789l0213j10425k8572n365J3477K6800Q9771q2470P4959K0651r4275
17291A81127o1048L6302j4428j43016j09064K30052O8309j65155j28873P3442
17281c2352J01272O906L2906j7642p4920L194O3427j02308L5116R5948J2997J35248
17269B59792Q0489q1542q380K8281j5279O7425O3760j23730k38174j42624P1864
17258c8118J27352K1657n1302o8727K3745L9477K4534J33883R3652M5486L911
$$ plain form
17336 204373 206235 89399 189418 316457 195266 117318 114198 35289 94705 55350 -14236
17325 -14236 -143173 -83179 -9799 56275 177737 123855 -36664 -51877 101036 178250 143919
17314 143919 150671 76104 -23589 66891 126225 225273 242663 287374 290892 239010 201124 306789
17302 306789 276576 166151 137579 132214 145691 172491 262262 179792 254751 275402 181127
17291 181127 120079 156381 141953 -1063 -110127 119925 188234 23079 -105794 -32352
17281 -32352 68920 75826 108732 91090 16170 19364 82791 -19517 15599 111547 124544 259792
17269 259792 340281 258739 250359 278640 263361 330786 394546 270816 32642 -109982 -38118
17258 -38118 89234 110891 59589 -9138 14607 54084 78618 212501 306153 351639 355550
17247C55550r6520j4253q51n443q6401R53M0944k4816q1097L3293l4947P3810
17235A60222j90278O1665M9973o8512M0795P4234K00616k2297k19626m9624N3483
17224I0651M4025r418O3501n0996p0246j5859m0092O2881K6110p5406o3007K01986
17212A64130L5007j5559M9588K723n5608n8300j5842N2221o1160o9829k0536Q1157
17200H7992Q8859J60312n2420o3383r5930q3070M3069M7154N146J4080M4671j9839
17188A76641j7083L2156r0722q1589K4760J5692Q2588N3669J12362N2684o769
17177C54389n0851j00852p7577J902K9385N0798k8768j76538n1801O623K7070
17166a6220K24409O5915M4225P9198j10702l9760K5461K1108J4234M7040k4842
$$ plain form
17247 355550 259030 244777 243926 238483 152082 153035 193979 169163 88066 121359 86412 160222
17235 160222 -30056 31609 81582 13070 53865 128099 328715 306418 86792 37168 90651
17224 90651 134676 125258 188759 137763 67517 51658 11566 74447 100557 25151 -37856 164130
17212 164130 199137 183578 233166 235889 180281 121981 106139 158360 97200 27371 6835 87992
17200 87992 176851 337163 284743 221360 125430 42360 85429 132583 137729 151809 196480 176641
17188 176641 159558 191714 100992 19403 44163 59855 142443 196112 308474 361158 354389
17177 354389 303538 202686 125109 127011 156396 207194 178426 1888 -49913 -43290 -16220
17166 -16220 208189 274104 318329 397527 286825 247065 272526 293634 307868 354908 330066
17155C30066j19312J4989M7392J17202J76531J3568l0052k9266j05935j0953n7775
17144C46455l7374J12587j3079p1276P2243r2723j41191R5796J12901j66446j03947
17133A13946J9271Q1020L8793J45582n5995j19227M7046k2929o175m1726p5398
17122A24208k3191J4916o4661J7185O8152N4619j10093j06303P7075k3100M2054
17111G0861O1731O434O6661L995o3596K8959J22946k8993N4686N2599K5009m3391
17099C57901l6057m446J33696K2432n2333J6587r1574O3676n5479j10419J1518
17088B55502J27413L1656p1657j9414j3180J03683K5456j32943l6594l9025L6399
17077B67296M5770M069r2663R1454Q4628M0588L3070R5391m0238L3119P475p4960
$$ plain form
17155 330066 210754 225743 273135 390337 566868 580436 550384 521118 415183 404230 346455
17144 346455 309081 421668 408589 337313 409556 316833 175642 271438 384339 217893 113946
17133 113946 133217 214237 253030 398612 342617 223390 270436 247507 241332 199606 124208
17122 124208 101017 115933 51272 68457 136609 191228 81135 -25168 51907 28807 70861
17111 70861 132592 139026 205687 209682 146086 175045 297991 268998 323684 376283 401292 357901
17099 357901 321844 317398 451094 473526 421193 437780 346206 409882 354403 243984 255502
17088 255502 382915 414571 342914 323500 310320 414003 439459 306516 269922 230897 267296
17077 267296 313066 317135 224472 315926 400554 441142 474212 569603 529365 562484 569959 494999
17065D94999Q9612m5440p1463l3149p6195m5695j20227N6083K6924o1319o6129
17054A48001M3650L8615Q6406O7098J6820l2640R174m4711l8671l6267J110O5176
17042C23761M9841M2594p056n6876P3775m2381r6490r1296R572k853J41312j40159
17030B03744o7790J10430l7865l6800n7295M1606J19251j3033o1127p1770M2411
17019A71762J11441J22026L9653l4228l7878m6195n257k3850M4388j5430j75225
17008A51207o7841K3701J01619P9712J44487P4848k4668O9801o9958n9223j49381
16997B74304j17548J36053J87314J00648o0607k05903K2625j5321o1303P1837
16987C32099P4466Q1078K5619j76232m4403O1291N3892m0245j7794j016k5533
$$ plain form
17065 494999 584611 539171 467708 434559 358364 312669 192442 248525 275449 214130 148001
17054 148001 191651 230266 316672 383770 400590 367950 377124 332413 293742 257475 258585 323761
17042 323761 373602 416196 409140 352264 426039 383658 287168 195872 205444 202591 343903 203744
17030 203744 135954 246384 208519 171719 114424 156030 275281 262248 201121 129351 171762
17019 171762 283203 405229 444882 410654 372776 326581 321324 297474 341862 326432 151207
17008 151207 83366 107067 208686 288398 432885 507733 483065 552866 482908 423685 274304
16997 274304 156756 292809 480123 580771 520164 314261 336886 321565 260262 332099
16987 332099 406565 487643 513262 337030 292627 353918 407810 367565 349771 348755 323222
16976C23222O4593j46084k79166j8014J19245J24168K9566Q9674p2179J7414J40149
16965C92588J31262K6230J9162L3625j40979j37810j39988L046R7852P6699k4325
16954C37362R6114Q7711J12763r0192j28022j9155j1246l0551j2966k697R388
16943C48509J9300K564m1637r690L5010J5302j4855K9968K9644n2612M8278L0769
16931D40550k7327j8683J45429Q037n0556j41941r5178O715J06747j1750J9291
16920C81334j16976o3799j8383N958J67460K8191Q8644P7990m76j90375k00808
16909A58760J00165J04073j8616K5416k0514o8243q5404P8032J41075O9686n5326
16898D29104j59531o7882J0885K9062R3102K0266r1800O0251P7357J2658j28967
$$ plain form
16976 323222 387815 241731 -37435 -55449 63796 187964 217530 307204 235025 252439 392588
16965 392588 523850 550080 569242 602867 461888 324078 184090 187136 284988 361687 337362
16954 337362 433476 521187 633950 543758 415736 396581 385335 354784 341818 339121 348509
16943 348509 367809 370373 328736 319046 354056 369358 354503 384471 414115 361503 409781 440550
16931 440550 413223 394540 539969 548006 497450 355509 260331 267046 373793 362043 381334
16920 381334 264358 200559 182176 188134 355594 383785 472429 550419 549943 359568 158760
16909 158760 258925 362998 344382 369798 349284 281041 195637 273669 414744 484430 429104
16898 429104 269573 201691 212576 241638 334740 355006 263206 323457 400814 413472 284505
16887B84505n7424Q6080k3412j42455p3795J15120J07656j01780j09605M275L1798
16876A20963L7832j3455J59696J14193Q5846j71965j6196K4228p24P8284j29649
16865B89053m8576p5014J13658p4506q522L7378j70674j48509j7759K19399J90899
16854C06827m27q9249J46465L7044j38922J03497M1493p7354j9544L5634k6564
16843C18900q3491o5210p9765q0416J58270J8706K4806K7354J65530N3435j97245
16832B60874j7333l1271k3538J17283p118k2549m2130n9239K457r4888L3224O549
16820A22321K465O9414M4713p0063k06520K3215L41036J49697r1682j38275N7315
16809C03636j44822O0852N6534M643R0718L3198P2037P271J1003j51832k09631
$$ plain form
16887 284505 227081 313161 289749 147294 73499 188619 296275 194495 84890 89165 120963
16876 120963 158795 145340 305036 419229 505075 333110 316914 341142 340418 418702 289053
16865 289053 240477 165463 279121 204615 196093 233471 62797 -85712 -103471 115928 306827
16854 306827 306400 217151 363616 400660 261738 365235 406728 329374 309830 345464 318900
16843 318900 235409 170199 90434 10018 168288 186994 211800 239154 404684 458119 260874
16832 260874 243541 212270 188732 306015 298897 276348 234218 174979 177436 82548 115772 122321
16820 122321 124786 194200 238913 168850 -37670 -14455 326581 476278 384596 246321 303636
16809 303636 158814 219666 276200 280843 371561 404759 476796 484067 495070 343238 133607
16798A33607Q0636r808P505o7736j80765M4339K05334J66893p4420k6618l6278
16787B42689k8297J30861N9046k510J03500J61523r4486k82767j57994m424p7887
16776D9254k1518O3520J80356J57674O4838j09939k40003j26816J20423m9480
16766H8309J0006O4922Q5648n9295o9746P212n1107q4770Q8064k1257r088J20179
16754A69077l7081M9852J05967l5604j39844l8126N5938q6448k3350l3004Q9113
16743G6490O8325o1635j44662J8511J49717J5585p4328K03035L4608p4903n2411
16732A58332p4149o0748J6376L1951o8584n9104J812r115m651J38152J64173M2909
16720B77354m8117M7240J03683q3355r6962p1684o5702j37951K5201P8275J97811
$$ plain form
16798 133607 214243 204435 211940 144204 -36561 7778 213112 380005 305585 278967 242689
16787 242689 214392 345253 404299 401789 505289 666812 572326 289559 131565 127141 49254
16776 49254 27736 91256 271612 429286 494124 384185 144182 17366 137789 88309
16766 88309 98315 163237 248885 189590 119844 127056 75949 -8821 79243 57986 48898 169077
16754 169077 131996 181848 287815 252211 112367 74241 130179 43731 20381 -12623 76490
16743 76490 144815 83180 -61482 -42971 106746 122331 48003 251038 285646 210743 158332
16732 158332 84183 23435 39811 71762 3178 -55926 -54114 -63229 -67880 70272 234445 277354
16720 277354 229237 276477 380160 296805 199843 128159 62457 -75494 -50293 27982 225793
16709B25793N3892n124M7004r4659o9296p700O8717k015o7521J12712N3815k01978
16697A13640j87615N0095j0744j6498p0574L6251J03071l1989P8407n7803k7645
16686b1404p3460J32922J1683o5143P2436O3586O8302J53234r1617j08003l4598
16675A07938K4061J48234l4104j92624R6672Q0283j2249m2381j52161j32115n4119
16664a62565J28252O5474N1888R2156R0361N7213k9265n8468j46977R5141R891
16653A93101k5640j18494q0900J72099M7374k42953j20778o491K20389J43144
16643A80851l2688n5069M7846P1265m5560j57693n8458Q6962J70800M4221j05518
16632A46959j23474n2602l169j37986j02205J72654L7834o2045J53898M1331j53123
$$ plain form
16709 225793 279685 274561 321565 226906 157610 149910 218627 216612 149091 261803 315618 113640
16697 113640 -73975 -23880 -34624 -51122 -121696 -85445 17626 -14363 64044 6241 -21404
16686 -21404 -94864 38058 49741 -15402 57034 120620 188922 342156 250539 142536 107938
16675 107938 131999 280233 246129 53505 150177 230460 218211 175830 23669 -108446 -162565
16664 -162565 -34313 31161 83049 175205 265566 322779 293514 235046 88069 183210 193101
16653 193101 167461 48967 -31933 140166 187540 -55413 -176191 -182682 37707 180851
16643 180851 148163 93094 140940 212205 166645 8952 -49506 37456 208256 252477 146959
16632 146959 23485 -29117 -32286 -170272 -272477 -99823 -61989 -124034 29864 71195 -81928
16621h1928M364M7008J70652O3394N3001L1725l625j07957j00273J04904J4756
16610A96021k10857O1617J10916Q30j09624o0355J0421R2571L9809J08647N4992
16599B94988p6590K46q4761k9362j40025j54990M9850Q3275P2443N8146k3863
16588D9357k4856l8353K5558j1813j7799q7052O2536O1966M3267q418j583j4316
16576C8494Q0584L0963k9042r783j3655l5965R7052P5625k2672n7105r0507n4620
16564I369M7159J22184l386j29853L0689J94236j0930n7035P7636m962j43868
16553A31239j08831k9582o2990l4373K5272k9630K8619J7037j2876M9695j3569
16542c9989J5033p5161o5383l2712J5756R6663J11169P4498r9805j6281k7096
$$ plain form
16621 -81928 -77564 -30556 140096 203490 256491 288216 284591 176634 76361 181265 196021
16610 196021 -14836 46781 157697 158527 48903 -11452 -1031 91540 131349 239996 294988
16599 294988 218398 218644 133883 104521 -35504 -190494 -140644 -57369 15074 73220 49357
16588 49357 24501 -13852 11706 -107 -17906 -104958 -42422 19544 62811 54393 52810 38494
16576 38494 119078 150041 120999 111216 97561 61596 158648 234273 211601 154496 63989 9369
16564 9369 56528 178712 175326 45473 76162 270398 259468 202433 280069 275107 131239
16553 131239 22408 -7174 -70164 -104537 -79265 -108895 -80276 -63239 -76115 -26420 -39989
16542 -39989 -24956 -100117 -165500 -198212 -182456 -85793 25376 99874 69 -16212 -43308
16531d3308k7676J8695r9671J5091L1206K3767L497J03000j3632j02427j37066
16520b28524K9098M4338M7455O8658J4541N751j14106p025L365P1102J06274p3200
16508c2273J24848J1924j16284L5568j23595p4654m68R775O9881l0867J1081J45600
16496C0536J08221p0270q4917J4654J57823J9941o6943J03500O8575o5153j010
16485B14957l7943n785J8600q2231o149m52k5447O029M7137p2136j5108K2423
16473F3895n9282J1223N1601o9084k01803q8435N9315K10335J50742j07859j21352
16462a00704j9932P7852J59803j2959l8579k5928m4881M3762r3640k4615J9909
16451e9912p3974k2078L9763K16645k8833j99092q2511M9168m5973M9926K02556
$$ plain form
16531 -43308 -70984 -52289 -151960 -136869 -105663 -81896 -78399 24601 10969 -91458 -228524
16520 -228524 -199426 -155088 -107633 -38975 -24434 -18683 -132789 -139814 -136449 -65347 40927 -32273
16508 -32273 92575 104499 -11785 23783 -99812 -174466 -174934 -165159 -95278 -126145 -115064 30536
16496 30536 138757 68487 -16430 -1776 156047 175988 109045 212545 281120 215967 214957
16485 214957 177014 171229 189829 107598 101449 100997 75550 81579 128716 56580 41472 63895
16473 63895 4613 15836 67437 -1647 -203450 -291885 -232570 -22235 128507 20648 -100704
16462 -100704 -120636 -42784 117019 104060 65481 39553 -5328 38434 -55206 -79821 -59912
16451 -59912 -133886 -155964 -116201 100444 71611 -127481 -209992 -160824 -206797 -156871 45685
16440D5685L3343M6263k6637j24014l605N5016j3911j7251n4182M7128J62485
16429A50320k6745m1440p440k6573r0286r6908p3684p7736r0851R7880J17454
16418a66009j297K2272M033K8131M8238j70661q7962P2079N2840P3330l2703J54040
16406c669O6321P6208p4866k8690J9407o7210J7153n3943O5437j1444k0366p2199
16394h7861N0998j3010M8192P6793J13178M688n6336K3215m1867m4112j64028
16383i0150N1235J31598J09525J52097q7950o1848q3870j82687j18626O8660R6284
16372a5732O6477L1020m2960Q1281o5174n9017N2011j41706j937l7965q0876j08962
16360c23540Q9860R0417n8161J7671k9184P7444L2125j3209r0450q0049m9581
$$ plain form
16440 45685 79028 125291 98654 -25360 -28965 26051 12140 -5111 -59293 -12165 150320
16429 150320 123575 82135 74695 48122 -42164 -139072 -212756 -290492 -381343 -283463 -166009
16418 -166009 -167306 -145034 -141001 -112870 -64632 -235293 -323255 -251176 -198336 -125006 -157709 -3669
16406 -3669 62652 138860 63994 35304 54711 -12499 4654 -49289 16148 4704 -15662 -87861
16394 -87861 -36863 -49873 -1681 75112 188290 192978 136642 159857 117990 73878 -90150
16383 -90150 -38915 92683 202208 354305 266355 204507 120637 -62050 -180676 -112016 -15732
16372 -15732 50745 81765 38805 120086 54912 -4105 47906 -93800 -95737 -133702 -214578 -323540
16360 -323540 -233680 -143263 -201424 -183753 -212937 -135493 -103368 -116577 -207027 -287076 -336657
16349c36657K5346M5358N3162J16661J91454R5491p4742j16911J52437j69571
16339a7972k02068j25784O757J85215Q7958Q9137l7515r5457N4952J15991J66017
16328B27231k7224l0892J26320P9271p1318l5870n9618k85171k09919J72564O3880
16317e0746j3355M3476k3757n64n1647m0032L3731Q9230j32757o0901P0603K4856
16305a11863J2980J32179M1297j61181j65171J0188M7998J54384J3498q9674n590
16294a20955K5186J84657J18676k9842n5701N9349N279k1436j5320k2531N5607
16283A82969r5328j09814j96788l7748P1223L4918o3068J24385P2438j58110j74507
16272c49430k4878P0815J80443p6847O8414r125J02200O8412J59189p0293j62983
$$ plain form
16349 -336657 -311311 -265953 -212791 -96130 95324 190815 116073 -838 151599 -17972
16339 -17972 -220040 -345824 -339067 -153852 -65894 23243 -14272 -109729 -54777 61214 227231
16328 227231 200007 169115 295435 374706 303388 267518 207900 -77271 -287190 -114626 -50746
16317 -50746 -64101 -20625 -44382 -44946 -96593 -136625 -102894 -13664 -146421 -207322 -136719 -111863
16305 -111863 -98883 33296 74593 -86588 -251759 -241571 -193573 -39189 -25691 -115365 -120955
16294 -120955 -95769 88888 207564 177722 122021 181370 186649 165213 149893 127362 182969
16283 182969 87641 -22173 -218961 -256709 -185486 -150568 -213636 -89251 -16813 -174923 -349430
16272 -349430 -374308 -303493 -123050 -199897 -131483 -140608 -38408 30004 189193 118900 -44083
16261d4083j1523K575J58273O2285j32921j38199r5215O1414R8326m3292Q1749
16250f11J28785R6327J1592o1548m8110m4995L5660j27548j49215r1207o9028
16239c19898J02585J26528O2385J5569M4885M2709m009J483P3740j07108p7133
16228c8264O0848j52367j43217J37540M8241j1912N8952K3654J06633M894M6510
16217A41512K5170O8281j18716j89716K5398N624n7396l3263L5217j07775J6774
16206a88890O1774j1977O9570R0939L1122M51M9492J5314P6323l1576m4091k1047
16194I7404K8941O4919M565n0158j09269m0369j08060n1727J08801J05445m2641
16183G851O9013k8016L1664n0493l4672L5061l1178j54012Q6218J04572L5403
$$ plain form
16261 -44083 -55606 -53031 105242 167527 34606 -103593 -198808 -137394 -39068 -82360 -611
16250 -611 128174 224501 236093 174545 126435 81440 117100 -10448 -159663 -250870 -319898
16239 -319898 -217313 -90785 -28400 -12831 32054 74763 70754 72237 145977 38869 -38264
16228 -38264 22584 -129783 -273000 -135460 -87219 -99131 -40179 -16525 90108 95002 141512
16217 141512 166682 234963 116247 -73469 -48071 -42447 -99843 -133106 -97889 -205664 -188890
16206 -188890 -127116 -139093 -69523 21416 52538 52989 102481 117795 194118 162542 118451 97404
16194 97404 126345 191264 195829 145671 36402 -3967 -112027 -163754 -54953 50492 7851
16183 7851 76864 48848 80512 30019 -4653 30408 -770 -154782 -68564 36008 71411
16172G1411J0730l9112j0036j02254j27679K0825J36911K30674j14639l19666
16162b42835P4662J903j83754j27878O0832J36665J27415k4896j1417J11073P1787
16151f443m286P853k289J24768k2763m6744R8888O112j53546m7062j6106j9q5479
16138a47116j5026o989l5309q7903N4632o4932Q954j02310N6027J63540K8334
16127a48098P4130P4246q2243K0464J42767j11907j32197q1486Q1694J69298j22525
16116a15857k1719K9069M9017m4964L3050J17182N6698j3326o683J24421j3813
16105A93075k7670r8016j08824J38296J63149K6344p1819O2772j65437q1607j5505
16094A4758j64257j19373J59681N3319o8629k2313j6117L058P3110L0113j6770
$$ plain form
16172 71411 82141 43029 32993 -69261 -196940 -176115 -39204 191470 76831 -242835
16162 -242835 -168173 -166270 -350024 -477902 -417070 -280405 -152990 -177886 -189303 -78230 -6443
16151 -6443 -10729 -2876 -5165 119603 96840 50096 148984 155096 1550 -45512 -61618 -61637 -147116
16138 -147116 -162142 -169131 -204440 -292343 -237711 -302643 -293689 -395999 -339972 -176432 -148098
16127 -148098 -73968 278 -81965 -61501 81266 -30641 -162838 -244324 -162630 6668 -115857
16116 -115857 -137576 -108507 -59490 -104454 -71404 45778 102476 89150 82467 206888 193075
16105 193075 165405 67389 -41435 96861 260010 286354 214535 277307 111870 30263 14758
16094 14758 -149499 -268872 -109191 -55872 -124501 -146814 -162931 -159873 -86763 -56650 -73420
16083g3420j22205R25l8580m1112k0797R8437l467O8609O8216m4117m4038R3901
16071e7648n3423j4556q922q6129m8223P4205Q5892Q4251j05506j18788k9749
16060b78596K9910P6799J80234O302N6483Q6091j71899o6814n4049N3408J04888
16049B2757J08250l0211j38957k1665p642K2586m0623l1696l8162O3087J5647
16038g6629R8524J53750p4340j35299k2037L6260r8792N8203O893j57251n7937
16027b68655J7675m4161J6044J14534j7411J6114P0445J51918N0575j23450l465
16016a9837Q7413j4152j42749q4250p024n1128L5328J04970L7712j20232j79967
16005c53916L7507J20551j33572J73003J16087n7356o4437L4318o3238J3680J63247
$$ plain form
16083 -73420 -195625 -194700 -233280 -274392 -295189 -196752 -200219 -131610 -63394 -107511 -151549 -57648
16071 -57648 -111071 -125627 -134549 -220678 -268901 -194696 -108804 -24553 -130059 -248847 -278596
16060 -278596 -248686 -171887 8347 14649 71132 157223 -14676 -81490 -135539 -82131 22757
16049 22757 131007 100796 -38161 -59826 -67468 -44882 -85505 -117201 -155363 -92276 -76629
16038 -76629 21895 175645 101305 -33994 -56031 -19771 -118563 -60360 -53467 -210718 -268655
16027 -268655 -250980 -295141 -279097 -164563 -181974 -165860 -95415 56503 107078 -16372 -19837
16016 -19837 67576 53424 -89325 -173575 -180599 -231727 -196399 -91429 -53717 -173949 -353916
16005 -353916 -316409 -195858 -329430 -156427 -40340 -97696 -162133 -127815 -191053 -177373 -14126
15994a4126O6249K8222o7444m7508l4911N705N010Q551m8034j70622J49099J01553
15982a8256r109m0696J10993J05835p2480j12361p3444j79841q7290P5543p6192
15971c77298j2196M9454J04053J41188M0474m9695j03630l4197R1925N2665n0356
15960a47613o2879N5535k8124n854n5461N6448O1169M9751K6471m0438k6132L4255
15948h2872J2186J7622J97731L0565k30620j80525L4154k1938K0931P1831J56259
15937B5324O0534l7045o2805o4264n4722n6525J12356M7858m9112L2784P4441
15926B8824J9499r7413p3453N0918L7547k0747p6646k1371O3203l1889R8064J7839
15914e625m014n4537o2936P9235M7970K9828r6903o8774j96527j13554J49658
$$ plain form
15994 -14126 52123 80345 12901 -34607 -69518 -63813 -58803 -50252 -98286 -268908 -119809 -18256
15982 -18256 -27365 -68061 42932 148767 76287 -36074 -109518 -289359 -376649 -301106 -377298
15971 -377298 -389494 -340040 -235987 -94799 -54325 -104020 -207650 -241847 -149922 -97257 -147613
15960 -147613 -210492 -154957 -183081 -188935 -244396 -187948 -126779 -77028 -50557 -90995 -117127 -82872
15948 -82872 -70686 -53064 144667 175232 -55388 -235913 -201759 -223697 -202766 -130935 25324
15937 25324 85858 48813 -13992 -78256 -132978 -189503 -77147 -29289 -78401 -45617 28824
15926 28824 48323 -49090 -122543 -71625 -34078 -54825 -131471 -152842 -89639 -121528 -23464 -5625
15914 -5625 -9639 -64176 -127112 -47877 93 29921 -66982 -135756 -332283 -445837 -296179
15903b96179R3893J24411O4857M4393j01209j33966j62739N8399k4722J60025
15893a72837J20918n4040m279L5308p648m8278K5465j15685J3717m9512m017M7503
15881b13385J74531k5117j64395J6337Q2696J00663j35019j5430J75641R8312
15871I4834r6806p2682j03918N1275O2826j5694M5533M8307k6203j7834j11765
15860a42127q4757J69682J47485J02947j7949n2861R38j27817r7089j0386P8240
15849c3694Q7305j59133r2977p1048p3382j6418J3419N1099N6417M5126j47442
15838c40728j4566J06348J31584M3320j45269m0244N1030L7311J34984L9484O7837
15827G1091j9045k1132q2713j2883N226q4836O3199O1595j2965n7083n1126O2110
$$ plain form
15903 -296179 -202286 -77875 -13018 31375 -69834 -203800 -366539 -308140 -332862 -172837
15893 -172837 -51919 -105959 -110238 -74930 -82578 -130856 -105391 -221076 -207359 -256871 -260888 -213385
15881 -213385 -38854 -63971 -228366 -212029 -129333 -28670 -163689 -179119 -3478 94834
15871 94834 -1972 -74654 -178572 -127297 -64471 -80165 -34632 13675 -12528 -30362 -142127
15860 -142127 -226884 -57202 90283 193230 175281 122420 123358 -4459 -101548 -111934 -33694
15849 -33694 53611 -105522 -198499 -269547 -342929 -359347 -345928 -294829 -238412 -193286 -340728
15838 -340728 -355294 -248946 -117362 -74042 -219311 -259555 -208525 -171214 -36230 3254 71091
15827 71091 52046 30914 -51799 -64682 -59456 -144292 -81093 -19498 -32463 -89546 -140672 -78562
15815g8562j07234m7883J78707l861q5622M9219J31795l5981l6655l9301l3062
15804a08440L8666j2101j3578J10827J38583J12050l2295j74831q0162M1310j4009
15793F020k2984k5622R442j06746o0743K441J39837J56530n5576j30196o7127
15782a54724P0014j5730R254m3085O1500J47819n0366k46059Q1132O9213R2343
15771B1311N5451p792l3329j4723j09046j9821j2585j30188J39122J52214J09970
15760A50584k6682j10593r8493n399o9930o2033o2361N0191J85103R0573k8054
15749A2906k691j39710o1219J27797P8959o4938o5945l043O7580o4603j00197
15738b15104J72772K10851M1175n4823j52429j42038J704k6760n2186j2721L3403
$$ plain form
15815 -78562 -185796 -233679 -54972 -58833 -144455 -95236 36559 578 -36077 -75378 -108440
15804 -108440 -69774 -81875 -95453 15374 153957 266007 233712 58881 -21281 20029 6020
15793 6020 -16964 -42586 -33144 -139890 -200633 -198192 -58355 98175 42599 -87597 -154724
15782 -154724 -84710 -100440 -91186 -134271 -72771 75048 24682 -221377 -140245 -71032 21311
15771 21311 76762 68970 35641 20918 -88128 -107949 -120534 -250722 -111600 40614 150584
15760 150584 123902 13309 -85184 -90583 -160513 -222546 -284907 -234716 -49613 40960 12906
15749 12906 10215 -129495 -190714 -62917 16042 -48896 -114841 -117884 -50304 -114907 -215104
15738 -215104 -42332 168519 209694 154871 2442 -139596 -137892 -164652 -216838 -229559 -196156
15727a96156p6570j71676O0543J06788J00394o3796n8808j4068N1367L6080M0729
15716a85173J4826J19693j3822l9399J6254M1044M7495j57183o0521R5860r7660
15705b18586r6593R4496J54156M8462M8498k0680k8221q2992k9370J03228o1906
15694h9508o9773j23695q712R2385Q5610N2854J30079J13520l7297k27249m0237
15683a22023J4229J97849j1615j34096N825j6090j6679q2875p5942J04416M3600
15672i3401p6752k0324P43k8060N3161J00285J50875r2215q0084J3449J9684j3492
15660f6131P1526O8901k1736r9113p3226N2329j00393J40871N9505J9388n5606
15649c685r9371n0098j035J92436O9067l207j48075j89464M2702J71990J10164
$$ plain form
15727 -196156 -272726 -444402 -383859 -277071 -176677 -240473 -299281 -313349 -261982 -225902 -185173
15716 -185173 -170347 -50654 -64476 -103875 -87621 -46577 918 -156265 -216786 -120926 -218586
15705 -218586 -315179 -220683 -66527 -18065 30433 9753 -18468 -101460 -130830 -27602 -89508
15694 -89508 -159281 -282976 -291688 -199303 -113693 -60839 69240 182760 145463 -81786 -122023
15683 -122023 -107794 90055 78440 -55656 -49831 -65921 -82600 -165475 -241417 -137001 -93401
15672 -93401 -170153 -190477 -189734 -217794 -164633 -64348 86527 -5688 -85772 -72323 -52639 -66131
15660 -66131 5395 74296 52560 -46553 -119779 -67450 -167843 -26972 32533 51921 -3685
15649 -3685 -103056 -153154 -154189 38247 107314 104107 -43968 -233432 -190730 -18740 91424
15638I1424q6614q9126R9371l3647q0349L4265J43679p4894j58751j04805k0827
15627b80274Q272N7968O3517O8646M2528J16962j00732j96923j36300L2131K05649
15616a18556L9766n152m3963J5449M4616R0951p2370r0213j8804P5048J08484
15605B5256j00620j70629r6153Q284O09p7257J4843J40813N4229K02258M9201
15594E0834j4146p9977j9308k4232J6952R0731J2307p7420l1405o9780o4193p1322
15582b80959j2851J02596k189O4758J50062j1423o2238L71J18453J84486M71j89483
15570F2054k03606l73q3994K9443m2267j11354m140J2155R3332J08253l9938j2957
15558a93392P4225N2119r7474o1671k9864o2799O3540O779o4072j1599P3575Q9743
$$ plain form
15638 91424 4810 -84316 15055 -18592 -98941 -64676 79003 4109 -154642 -259447 -280274
15627 -280274 -272002 -214034 -150517 -81871 -39343 77619 -23113 -220036 -356336 -324205 -118556
15616 -118556 -78790 -83942 -127905 -112456 -67840 23111 -49259 -139472 -158276 -83228 25256
15605 25256 -75364 -245993 -342146 -333862 -333253 -410510 -395667 -254854 -200625 1633 50834
15594 50834 36688 -43289 -62597 -86829 -69877 20854 33161 -44259 -75664 -145444 -209637 -280959
15582 -280959 -293810 -191214 -193403 -128645 21417 9994 -52244 -51873 66580 251066 251537 62054
15570 62054 -141552 -141925 -225919 -196476 -238743 -350097 -354237 -342082 -248750 -140497 -180435 -193392
15558 -193392 -119167 -67048 -164522 -226193 -256057 -318856 -255316 -248537 -312609 -324208 -250633 -160890
15546a60890O9900O7471K8467J02836j6795q5985p6380N7134N627j94576j54691
15535c57882r8233k9936N380m4643O7822J11081N7979N5574k618P0768P114k8658
15523a86252q747K14518P8136j4391j01344l9364j26156l8846R8032l9676N3414
15512a10676K5276j27678J11050J5477O3388j18644m4505J350M3713m5258L1455
15501a55052J06868K2137j17013P6716q4688j00961p8930j3103M8368p0151O8512
15490b97297J13403R5603Q9122J1093j98202l9297K9333J09616N6422M7251j30934
15479a13887l3232J28269p300k7538o688l6234Q7194N3351P3079j53108j04622
15468a40716L0221o9780O0717K1097j18595J03906P4140Q0932P2012q6008j32311
$$ plain form
15546 -160890 -90990 -23519 4948 107784 90989 5004 -71376 -14242 -8615 -203191 -357882
15535 -357882 -456115 -486051 -480671 -525314 -457492 -346411 -288432 -232858 -235476 -164708 -157594 -186252
15523 -186252 -194999 19519 97655 83264 -18080 -57444 -183600 -222446 -124414 -164090 -110676
15512 -110676 -85400 -213078 -102028 -86551 -23163 -141807 -186312 -184962 -141249 -186507 -155052
15501 -155052 -48184 -26047 -143060 -66344 -151032 -251993 -330923 -344026 -295658 -365809 -297297
15490 -297297 -183894 -88291 831 11924 -186278 -225575 -196242 -86626 -30204 17047 -113887
15479 -113887 -147119 -18850 -26150 -53688 -60376 -96610 -9416 43935 117014 -36094 -140716
15468 -140716 -110495 -180275 -119558 -98461 -217056 -113150 -39010 41922 113934 27926 -104385
15457a04385m5223J15181O8604L3884j1748K3545k45301j80779J07275O6866O6780
15446a05301K9186j47005R5545j797N1993O2130M9896k3958K298n9569j54301
15435b00883n5103L9963L8922J10317J91999L0497J27954N5301j67438k69967
15425i8438q7081L0199J6721N5039p6076j20344k5405J72055N9210q3213j68958
15414c26291J9207K04205R5507o4875k51004j64003Q4766J4064J14051O435j21964
15403c89902J5682M5165J73296J09913q5583O9708N4029j14694j22096n214L4802
15392b14894l1190N049L2676J40237j8146j73231o4591J41715O4138P3088n1534
15381i6683p752R8392M4754n269l0279o2797p0351m4413J26390J43214j26411
$$ plain form
15457 -104385 -149608 -34427 34177 68061 56313 79858 -165443 -346222 -238947 -172081 -105301
15446 -105301 -76115 -223120 -127575 -129372 -77379 -15249 34647 10689 12987 -46582 -200883
15435 -200883 -255986 -216023 -177101 -66784 125215 155712 283666 338967 171529 -98438
15425 -98438 -185519 -155320 -138599 -83560 -159636 -279980 -305385 -133330 -74120 -157333 -326291
15414 -326291 -307084 -102879 -7372 -72247 -323251 -487254 -402488 -388424 -274373 -267938 -389902
15403 -389902 -374220 -329055 -155759 -45846 -131429 -61721 -7692 -122386 -244482 -249696 -214894
15392 -214894 -246084 -241035 -208359 -68122 -86268 -259499 -324090 -182375 -118237 -45149 -96683
15381 -96683 -104435 -6043 38711 33442 3163 -59634 -129985 -174398 -48008 95206 -31205
15370c1205l6327l9559J7211N235l8250K0008j2205J2887J47533n7303j69531
15359a81506L567N3320r8923n4201M0726R8009j6317q8378j11781p6701J74329
15348b57856K22433Q9177r0440q9031J42298O5880j01769l7811R7497L8728n3614
15337B5492j1197q4649m0713l5985M336o793K242Q1394l8325m3104j16525N3832
15325b09995J90414m864j61297j890p585m6455J6238K79086J15979j59746j70184
15314a60299k4382N6331J06310M243Q2435k5979l4006L379N404j24916j43226
15303b54706p1456M6833Q5854P5789N1056q6711j01355m0055j20727L4395R2367
15292b88716N6046N1419J08302O8240j48111q243j67978o7022L3098M9227K56733
$$ plain form
15370 -31205 -67532 -107091 -89880 -84645 -122895 -102887 -115092 -102205 45328 -11975 -181506
15359 -181506 -177939 -124619 -223542 -277743 -237017 -139008 -155325 -243703 -355484 -432185 -257856
15348 -257856 -35423 53754 -36686 -125717 16581 82461 -19308 -57119 40378 79106 25492
15337 25492 14295 -70354 -111067 -147052 -142716 -149509 -147267 -65873 -104198 -147302 -263827 -209995
15325 -209995 -19581 -24445 -185742 -187632 -195217 -241672 -225434 53652 169631 9885 -160299
15314 -160299 -184681 -128350 -22040 -17797 64638 38659 4653 8032 13436 -111480 -254706
15303 -254706 -326162 -279329 -193475 -117686 -66630 -153341 -254696 -294751 -415478 -381083 -288716
15292 -288716 -232670 -181251 -72949 -4709 -152820 -161063 -329041 -396063 -362965 -313738 -57005
15281e7005P1201M6856j77953n6109q6488J01526J74214k8155K8429q0236j27005
15270a90725J63160k3582j6810k9711r6755Q8751m2944l7793J6847l3517O2297
15259a40782J8958J9125O5680M9836l0294r2315m2530j6462m0426o0407n3466
15248c23083J8046Q2851Q9168O9374Q0002N6810L1825r4994k6310j05855j6417
15237a38583O5914p0472J5630r2134j32773m7546n9524N5926J01629k4704J8894
15226c07743J3953K8671l9526j44069Q7153P9030Q3809M2321O9884k2174J1723
15215i6968l1654j2580J8921j747l259j380R0528L0539p1819L7259J4112J248
15203b6800p0649Q2664L2243P123R475j36515n8091J17762J6187k3810q3408m3477
$$ plain form
15281 -57005 14196 61052 -116901 -173010 -259498 -157972 16242 -11913 16516 -63720 -190725
15270 -190725 -27565 -51147 -67957 -97668 -194423 -105672 -148616 -186409 -169562 -203079 -140782
15259 -140782 -121824 -102699 -37019 12817 -17477 -109792 -152322 -168784 -209210 -269617 -323083
15248 -323083 -305037 -222186 -133018 -63644 16358 73168 104993 9999 -16311 -122166 -138583
15237 -138583 -72669 -143141 -127511 -219645 -352418 -399964 -459488 -403562 -301933 -326637 -307743
15226 -307743 -293790 -265119 -304645 -448714 -361561 -282531 -198722 -156401 -86517 -108691 -96968
15215 -96968 -128622 -141202 -122281 -124028 -127287 -128667 -38139 -7600 -79419 -42160 -28048 -26800
15203 -26800 -97449 -14785 17458 24581 34056 -102459 -160550 -42788 -26601 -50411 -133819 -177296
15191a77296n7926L8371O6877n0602J86050L2257q5960O1209j2962k6787k8659
15180e5428m3025j24162p5045P8206O8271M2202K3118r3260j45276r3580J07698
15169c10281J77450L2786l0675J6714P5944j44750o5985Q0525L6232P7407l0330
15158h4963Q739K5939M4032p1760q4283P9188r3709r7736N7509J79626N9246j06019
15146h4191q8473q4877n9169l7038Q4194O8909l5926N2057J03995L2060m002L518
15134d8943J00876o733m2027j58876q4255j15261L6798J06926o1130Q6465J41651
15123d4509k2349m0809q5535P7834J36163J5337Q222k7295k0613L5405M1097k3355
15111D9593p2735J4406r7347O419J740J6292k01920L3079K20736q8911k7254n7354
$$ plain form
15191 -177296 -235222 -196851 -129974 -180576 5474 37731 -48229 12980 18 -26769 -55428
15180 -55428 -98453 -222615 -297660 -219454 -151183 -108981 -85863 -179123 -324399 -417979 -310281
15169 -310281 -132831 -100045 -130720 -114006 -38062 -182812 -248797 -168272 -132040 -54633 -84963
15158 -84963 -76224 -50285 -6253 -78013 -162296 -83108 -176817 -274553 -217044 -37418 21828 -84191
15146 -84191 -172664 -257541 -316710 -353748 -269554 -200645 -236571 -184514 -80519 -48459 -52461 -48943
15134 -48943 51933 45200 3173 -155703 -239958 -355219 -318421 -211495 -272625 -186160 -44509
15123 -44509 -66858 -107667 -193202 -115368 20795 36132 44354 17059 -3554 31851 72948 49593
15111 49593 -23142 -8736 -106083 -99664 -97924 -81632 -283552 -250473 -29737 -118648 -145902 -203256
15099b03256P32j7302q9782q5609Q2382q5855R37K37438J38719M8206O3795p3255
15087A7150j55768j78145P481L630J22634j3898j4625N7790j29414Q9192q7579
15076b81552J6011J11553m1637O0283p955p7729J1792R1191P232J2102k0418R8036
15064b1091J54544J19135p9231l8318k1890j07676Q1861P503j30386j25368M0329
15053a20588N1211M2210p4649k7771k1014j1987J7692J14065k1652j7673l0086
15042a00242L8264j19400l2652J30602J47062n286r9487J9778p618O7928J15645
15031A54594J9362q5769j40190j38491O4824L5671K0231N5827o4096l3397M225
15020a07209L7628q4122J7758Q9173J66607P9623r5269j09079o8920n484K2801
$$ plain form
15099 -203256 -202524 -219826 -309608 -395217 -312835 -398690 -397753 -160315 -21596 26610 90405 17150
15087 17150 -138618 -316763 -309282 -305652 -183018 -196916 -211541 -153751 -283165 -193973 -281552
15076 -281552 -265541 -153988 -195625 -135342 -143297 -221026 -209234 -118043 -110811 -98709 -119127 -21091
15064 -21091 133453 252588 173357 135039 113149 5473 87334 94837 -35549 -160917 -120588
15053 -120588 -69377 -27167 -101816 -129587 -150601 -162588 -144896 -30831 -52483 -70156 -100242
15042 -100242 -61978 -181378 -214030 -83428 63634 58348 -41139 -21361 -28979 38949 154594
15031 154594 173956 88187 -52003 -190494 -125670 -89999 -69768 -13941 -78037 -111434 -107209
15020 -107209 -69581 -153703 -135945 -46772 119835 199458 104189 -4890 -73810 -79294 -56493
15009e6493q9003m5746O6364K9195K3131P2052J2435J18765J32400n2091j6844
14998A94165m6293j01720K2880j35761j38926Q1127N4613O8951O0305j52580M683
14987h8556L425o3638j11342j01633n8008J811J45855O3178J143p7663O6315P922
14975b11191R0458r0457q2795L4591N7599k8098J27162J77840Q8576M3876l7738
14964A69823j42458q7422j8767K5156J77811m5109q0881j11616o9008l2486P1839
14953a43118J7586j64973N8762R283o998q19j1375N3075M8049O7671O2371J51537
14941A41051j19442q9023j28736o1733J17801N9800m7449L6864O765n6403K1857
14930a18648q9422J08957J77715n7290n9124j46072k1080K1053P6324P3286L2323
$$ plain form
15009 -56493 -145496 -191242 -124878 -95683 -72552 -500 11935 130700 263100 211009 194165
14998 194165 147872 46152 69032 -66729 -205655 -124528 -69915 -964 59341 -93239 -88556
14987 -88556 -85131 -148769 -260111 -361744 -419752 -417941 -272086 -208908 -207765 -285428 -219113 -211191
14975 -211191 -120733 -211190 -293985 -259394 -201795 -229893 -102731 75109 163685 207561 169823
14964 169823 27365 -60057 -78824 -53668 124143 79034 -1847 -113463 -182471 -214957 -143118
14953 -143118 -125532 -290505 -231743 -222460 -229458 -230277 -241652 -188577 -140528 -72857 -10486 141051
14941 141051 21609 -67414 -196150 -257883 -140082 -80282 -127731 -90867 -84102 -140505 -118648
14930 -118648 -208070 -99113 78602 21312 -37812 -183884 -204964 -183911 -107587 -34301 -1978
14919a978M3125j12370m581P2925Q3613K7543k33288M9858K18204O498m6943R9719
14907B02325K02084O959o7805j16044j8674k01670j05602J2835L2104l2977j52284
14896b38749o8111n4245J4446J64747J10268Q363k9208k6494L278J0541Q9131
14885a6033O8497j38720j57082k0324J17131O2295K1955J94318K05764q222p8315
14874B51264k1057j71309n8020Q5479J1771n7984m0315j28479K6880o7753j15913
14863b85436N583L5022K43616Q924p9145O554o1056M0452L5248L7889J2920M9658
14851E0229Q0100r7416o6820J02685j55401j4462m946J1194q9471Q266J6557l3963
14839a93448J16574R300n8798k8438P5828o0229o889J65515Q5235l6032j35464
$$ plain form
14919 -1978 41147 -71223 -75804 -2879 80734 108277 -125011 -75153 143051 149549 102606 202325
14907 202325 404409 411368 343563 227519 208845 7175 -98427 -85592 -53488 -86465 -238749
14896 -238749 -306860 -361105 -346659 -181912 -71644 -63281 -92489 -118983 -115705 -105164 -16033
14885 -16033 52464 -86256 -243338 -263662 -146531 -84236 -62281 132037 337801 329579 251264
14874 251264 230207 58898 878 86357 98128 40144 -171 -128650 -101770 -169523 -285436
14863 -285436 -279853 -244831 -1215 7709 -71436 -64882 -125938 -85486 -50238 -12349 571 50229
14851 50229 130329 32913 -33907 68778 -86623 -101085 -106031 -94837 -184308 -176042 -159485 -193448
14839 -193448 -76874 -67574 -126372 -154810 -78982 -139211 -146100 19415 104650 68618 -66846
14828f6846j08971Q7992k9948l022N7904M4718j875n6967r8425r1923J87727M8163
14816c1473J05943l3262l9141Q5790Q6213j10711j19804j33319K3050N2309M7778
14805f6627P5234J70264P0733n1941j70528j16086q4947L5987l0211J44358N3153
14794B9389P3389j27005q5793N0522n4557J57254R5666J2914l6620p3697j0421
14783C1041M591L764r2393j68315O1451Q0295j42097p9081M7761L3652k3788j994
14771b45113Q4405J74066J68442J04623q6819j92945j68144n6596J30470K8902
14761e8709j20885n2082k6573O0342P1939R95Q874j3485P2658J41269L8754m6969
14749G6128k7150k769j00300N379o0952J0430l7281j27318P3731J58905R103l3294
$$ plain form
14828 -66846 -175817 -87825 -117773 -120795 -62891 -18173 -20048 -77015 -175440 -267363 -79636 -31473
14816 -31473 74470 41208 2067 87857 174070 63359 -56445 -189764 -166714 -114405 -66627
14805 -66627 8607 178871 249604 197663 27135 -88951 -173898 -137911 -168122 -23764 29389
14794 29389 102778 -24227 -110020 -59498 -114055 43199 138865 151779 115159 41462 31041
14783 31041 35632 39396 -52997 -221312 -159861 -79566 -221663 -300744 -252983 -219331 -243119 -245113
14771 -245113 -160708 13358 181800 286423 199604 6659 -161485 -218081 -87611 -58709
14761 -58709 -179594 -231676 -258249 -197907 -125968 -124973 -116099 -129584 -56926 84343 123097 76128
14749 76128 48978 46209 -54091 -48712 -109664 -99234 -136515 -263833 -190102 -31197 -22094 -55388
14737e5388k8183P8o7491J7085J22595k6501L0867P567J144l7536J06655K4688
14725I5580j50348R110M9896l946j00805K604R6522K6748R9632L3954P946j02476
14713F4417j7932J1284N4326m7125J3630l9004l6046K3727n950N8444J232m8437
14701C2566L5544m6293p7371k8158l1245j5547J7203p0461K6439K03277m2712
14690C242n4119j23212J5328P1612L895J3756m4355p600k0039L1926Q5901K8258
14678D593Q2885j10308p5293o123K33075M8363q1695j4738L2801j44583k7246
14667e8269Q1093J4550j16283m1121M0766K1394o583p3122L061k7525J63215K03524
14655B04700r5133M1338J16262j80201j97666K9903N6619Q4082m0441j42752R2024
$$ plain form
14737 -55388 -83571 -83493 -150984 -133899 -11304 -37805 -6938 629 1773 -35763 70892 95580
14725 95580 -54768 -45658 4238 292 -100513 -97909 -1387 25361 124993 158947 166893 64417
14713 64417 46485 57769 112095 64970 78600 39596 3550 27277 21327 79771 81003 32566
14701 32566 68110 21817 -55554 -83712 -114957 -130504 -113301 -183762 -157323 45954 3242
14690 3242 -50877 -174089 -158761 -87149 -83254 -69498 -113853 -121453 -141492 -109566 -23665 4593
14678 4593 87478 -22830 -98123 -104246 128829 177192 95497 80759 113560 -31023 -58269
14667 -58269 22824 37374 -78909 -120030 -79264 -57870 -64453 -137575 -134514 -162039 1176 204700
14655 204700 109567 150905 267167 86966 -110700 -80797 -24178 59904 19463 -123289 -31265
14644c1265l2334p8243l2892J22896k2257j02404M6213O5820L4416j4549q6133
14633a30732K0207l9329j11358J67187P3943M745r1863j9929o0100P536N6150
14622a23543j19000P6016Q0479r4160J00770K6413k1483K2886R5386n5235j51498
14611a62969n1609L6464r7049N2147R2787J57768Q9870j39389j16763j10944k2766
14600b72453N8328J01186J16723j30891j64321k8013R7319Q8050k7075Q203q997
14589a61941m6331P2565M7069J9642Q2133j6234n8781j19457j29532R5601K17790
14578B524j25873L1476O0257n1447r3611k5302J18158N4157k4411K5441q0388
14567a09019l027K5770N9123J30844P592m6403n1875o925O0881m4519j53805L9058
$$ plain form
14644 -31265 -63599 -141842 -174734 -51838 -74095 -176499 -130286 -64466 -30050 -44599 -130732
14633 -130732 -110525 -149854 -261212 -94025 -20082 -15337 -107200 -127129 -187229 -179693 -123543
14622 -123543 -242543 -166527 -86048 -180208 -79438 -53025 -74508 -51622 43764 -11471 -162969
14611 -162969 -214578 -178114 -275163 -223016 -130229 27539 117409 -21980 -138743 -249687 -272453
14600 -272453 -214125 -112939 3784 -127107 -291428 -319441 -222122 -134072 -161147 -152944 -161941
14589 -161941 -208272 -135707 -88638 -68996 13137 -3097 -61878 -181335 -310867 -215266 2524
14578 2524 -123349 -91873 -31616 -83063 -176674 -201976 -83818 -29661 -54072 -28631 -109019
14567 -109019 -112046 -86276 -27153 103691 111283 64880 13005 6080 66961 22442 -131363 -92305
14555i2305r336k6224P7684O8270L1824n3203m6923k3920o69l150l9363O8304
14543d9011N5331P5490P8743r3011j20842j96281O4381P2048J09277P452j11594
14532a08017q1649q7305r2916J32503J96813J42046q5769q3894M15R3239P2268
14521I7734p8438j9521j0436p5654o3570J05374M3308K9123O6133k21o4915M3379
14509G2296k8082R4740Q3644r6982J15535J8095o4868j18353j24231m1968O6086
14498b4088j06j31386q2382L8040K5787J55472K8846m8345m972m6756n9275l5351
14486a84516N2707k9413J11449P2131n325j03428M7696L8749Q0187j01860m9452
14475g1075L7381J18514l1248k4170j08756j44687p4376J10466J85452J4328j67106
$$ plain form
14555 -92305 -101641 -127865 -50181 18089 49913 -3290 -50213 -74133 -74802 -77952 -117315 -49011
14543 -49011 6320 81810 160553 67542 -53300 -249581 -185200 -113152 -3875 3577 -108017
14532 -108017 -189666 -276971 -369887 -237384 -40571 101475 15706 -68188 -67773 25466 97734
14521 97734 19296 -225 -10661 -86315 -149885 -44511 -1203 27920 94053 93832 28917 72296
14509 72296 44214 138954 222598 125616 241151 259246 194378 76025 -48206 -90174 -24088
14498 -24088 -24194 -155580 -237962 -199922 -174135 -18663 10183 -38162 -43134 -89890 -149165 -184516
14486 -184516 -131809 -161222 -49773 22358 17033 -86395 -38699 50 80237 -21623 -71075
14475 -71075 -33694 84820 53572 29402 -79354 -224041 -298417 -187951 -2499 11829 -155277
14464a55277k3057P5483o2003J06902R1645k5588p9951j62926r8839n5817O6952
14453c22476J46954N6772l602k7665j13104J24667J7127l5293J5444k8452o0355
14442b29983N5014p4939m3820J6531M3140J42673n1256j14728M9237O5109R7533
14431d5489j08039p5375J32615J9751L07n0762m495J45082L9301q3971L1971N3986
14419E4882l2260q6673p2079J9573O2352l197j53778m8487R0368K29628N1892
14408A12221m4766j71362o4091J9071j5820k722k8397j5067o829J48455J05960
14397C6653J8425m8553j74637j16731J34980j08717O5827J5853J38077j4766r840
14386f3429r2766j3272L7393m6324o7109N2848j19979K1879n3785l4959p4663
$$ plain form
14464 -155277 -178334 -102851 -164854 -57952 33693 8105 -71846 -234772 -333611 -389428 -322476
14453 -322476 -175522 -118750 -122352 -150017 -263121 -138454 -121327 -156620 -141176 -169628 -229983
14442 -229983 -174969 -249908 -293728 -277197 -234057 -91384 -142640 -257368 -208131 -143022 -45489
14431 -45489 -153528 -228903 -96288 -76537 -76230 -126992 -131487 13595 52896 -31075 896 54882
14419 54882 22622 -64051 -136130 -116557 -54205 -57402 -211180 -259667 -169299 60329 112221
14408 112221 67455 -103907 -167998 -148927 -164747 -167469 -195866 -210933 -217762 -69307 36653
14397 36653 55078 6525 -168112 -284843 -149863 -258580 -192753 -176900 -38823 -53589 -63429
14386 -63429 -156195 -169467 -132074 -178398 -245507 -192659 -312638 -290759 -344544 -379503 -454166
14375d54166K16986J65023O8671r1695j70514O8001n4606K6370O5673L9405J9234
14364a01618M0104m2182J42015q484o2200k7174j01709K8377O5172k5582L1915
14353f1366J60028O0671r8111n2915N3850N3669j05145r2304k5523O0467L1008
14342a5671J4641J2986n8859J21623K0268p5878j22535l66J03967q4829n595J78385
14330H8137P4322n1585J6001q8809j25232K239k0722p3171L2194n8739j02529
14319c07894O5808J41003m2669J74195j15333p5313P8520K9209m7507M3401m3920
14308a00500j44237n9212J1629q3692O8732l3452n5674O2674P0945K32740K44418
14297B14371j51512j02702J18301J58665J09436j72373r1684j55387J0797J29043
$$ plain form
14375 -454166 -237180 -72157 -3486 -95181 -265695 -197694 -252300 -225930 -160257 -120852 -101618
14364 -101618 -61514 -103696 38319 29835 -32365 -59539 -161248 -132871 -67699 -93281 -61366
14353 -61366 98662 159333 61222 8307 62157 115826 10681 -81623 -107146 -46679 -15671
14342 -15671 -1030 11956 -46903 74720 94988 19110 -103425 -103791 176 -84653 -90248 88137
14330 88137 162459 110874 126875 38066 -87166 -84927 -105649 -178820 -146626 -205365 -307894
14319 -307894 -242086 -101083 -143752 30443 -84890 -160203 -81683 -52474 -99981 -56580 -100500
14308 -100500 -244737 -303949 -292320 -376012 -307280 -340732 -396406 -333732 -262787 -30047 214371
14297 214371 62859 -39843 78458 237123 346559 174186 82502 -72885 -62088 66955
14287F6955r6433n8664q3303l3363J26075Q7639q0367O557O5922J11100P1039
14276A83157p0622O336O3444Q8122n7454o6348n5598p6103r0386j55036J4786
14265b15702n3106R0760J00180J1979k5608k4360R759l3573l9937k4774O3017
14254a41365k6265Q5740L4920k3460j46649M5780P7010r6230J24533K4249K7822
14243a3915r3932K5539J67k6645P1918N6996P2563n9246M4563j1822L1869l634
14231I4421r9626j65966O2522n3817l2150o4508P8701l5327n6810j1393J14737
14220a69216J68238L6367k6272m2090L5803o490m1163n7146n76l6903J24708K317
14208a2423k88198j87400l4236J95656J40657J26145q9744m0505M4040l0656m131
$$ plain form
14287 66955 -29478 -88142 -171445 -204808 -78733 8906 -71461 -64904 1018 112118 183157
14276 183157 112535 118871 182315 270437 212983 146635 91037 14934 -75452 -230488 -215702
14265 -215702 -268808 -178048 -77868 -65889 -91497 -115857 -106098 -139671 -179608 -204382 -141365
14254 -141365 -167630 -81890 -46970 -70430 -217079 -171299 -94289 -190519 -65986 -41737 -13915
14243 -13915 -107847 -82308 -82141 -108786 -36868 20128 92691 33445 78008 66186 98055 94421
14231 94421 -5205 -171171 -108649 -162466 -194616 -259124 -180423 -215750 -272560 -283953 -169216
14220 -169216 -978 35389 9117 -32973 2830 -3660 -44823 -101969 -102545 -139448 -14740 -12423
14208 -12423 -300621 -488021 -522257 -326601 -185944 -59799 -149543 -190048 -146008 -176664 -180795
14197a80795P9881K25532m0538N3581q9577m0610M3508L275l816p244l3278J23664
14185A33583j9520n1558j46965K8600O3025k6471j26312M5478M1887M7988J09811
14174I9546L6495n7939j11358K4539R0424j04010o6348L9377J7649l1557j77415
14163b40597K8761J74524m7405j07893O1701P4795p9646Q825k839N3685J6735
14152e9354j9814k5686L4768O6032p6017O637P2016J4384J43935Q7488j2505j05442
14140A26442R312r9913R058j90794j60947P6414K41408J24253M1790j81351k9621
14129c3949J03092O232O8863k9500m9080k2364j4996r0128n0844l1352K5834j44663
14117b62855l4925O3787N5004l4637l0399O3556K5485k6591j44596m3282J51102
$$ plain form
14197 -180795 -100914 124618 84080 137661 48084 7474 50982 54257 50441 43197 9919 133583
14185 133583 114063 62505 -84460 -55860 7165 -19306 -145618 -100140 -58253 -10265 99546
14174 99546 136041 78102 -33256 -8717 81707 -22303 -88651 -49274 -31625 -63182 -240597
14163 -240597 -211836 -37312 -84717 -192610 -130909 -56114 -135760 -126935 -129774 -76089 -59354
14152 -59354 -79168 -104854 -70086 -4054 -80071 -73434 -1418 12966 156901 244389 231884 126442
14140 126442 135754 35841 44899 -145895 -306842 -230428 10980 135233 177023 -4328 -33949
14129 -33949 69143 75375 144238 114738 65658 43294 28298 -61830 -112674 -144026 -118192 -262855
14117 -262855 -297780 -233993 -178989 -213626 -244025 -180469 -154984 -181575 -326171 -369453 -218351
14106b18351J09159R4902l5966N164L1181m2139N1519j759K584r3059r0673m6591
14094b34029Q8499N0308k9032m5879K2163o7315Q2473J50892K1267Q1577m8784
14083G2140M716L0924j20852o6180m1149j31233J28032J46017j64606K7360L2362
14072h2469O4970N6143J0486L5414L6517n4693J07876N4268N3728J17461o9869
14061C29832j63184m7401n1017r1473j0637k0908J8979R8315R3291l2595k8574
14050I4628p9622j9927M4453o9154K459L0223j59662j17185R4928Q9087o5574
14039a55346n4390J074n9540k902K9620p7855Q765J41241J11099J51157N1284
14028A44207j34162q9602o5023l4543O4338m5561l1168Q1664N2903J2092j9837
$$ plain form
14106 -218351 -109192 -14290 -50256 -45092 -13911 -56050 -4531 -6290 -3706 -96765 -187438 -234029
14094 -234029 -145530 -95222 -124254 -170133 -147970 -215285 -132812 18080 39347 120924 72140
14083 72140 76856 107780 -13072 -79252 -120401 -251634 -123602 22415 -142191 -114831 -82469
14072 -82469 -17499 38644 49130 84544 121061 66368 174244 228512 282240 399701 329832
14061 329832 166648 119247 68230 -23243 -33880 -54788 -35809 62506 155797 123202 94628
14050 94628 15006 -4921 39532 -29622 -27163 3060 -156602 -273787 -178859 -89772 -155346
14039 -155346 -209736 -208662 -268202 -271104 -241484 -319339 -310574 -169333 -58234 92923 144207
14028 144207 10045 -79557 -144580 -179123 -114785 -160346 -191514 -109850 -56947 -44855 -64692
14017f4692j81814K8016J34263K24554j0505o5898j41718q0574j9941L3796j6789
14006a61302Q3185n9663q4382K7487N8573M7031p3232r1791P4080P7764n1524
13995a53774q2160j53594J11122K19194Q852j28184j57067J6309O7711Q2126j17447
13984b86912L2511J88892J3667j41084Q3668L9781J3762J00819p1805j7117J08433
13973F4615P6512O5603q0813p3289m1655l1816m2265l2007r7349N5671J78590
13962D1797Q0053j05634j15983Q0600J13494p2992r1128L8036m6897K18353M3620
13951A83319J6277L7157o7955q283p9107n0845n7047m8586M9070J7956o8121L3494
13939d2671J55641Q243j01237j0364l7940J9601K2062J24184J8583j63606n9844
$$ plain form
14017 -64692 -246506 -218490 -84227 140327 129822 63924 -77794 -158368 -178309 -144513 -161302
14006 -161302 -78117 -137780 -222162 -194675 -136102 -89071 -162303 -254094 -180014 -102250 -153774
13995 -153774 -235934 -389528 -278406 -59212 -50360 -178544 -335611 -319302 -251591 -169465 -286912
13984 -286912 -254401 -65509 -51842 -192926 -109258 -69477 -55715 45104 -26701 -43818 64615
13973 64615 141127 206730 125917 52628 10973 -20843 -63108 -95115 -192464 -136793 41797
13962 41797 121850 16216 -99767 -19167 94327 21335 -69793 -31757 -78654 139699 183319
13951 183319 199596 236753 168798 160515 81408 30563 -26484 -75070 -26000 -8044 -76165 -42671
13939 -42671 112970 121213 19976 9612 -28328 -8727 13335 137519 156102 -7504 -67348
13928f7348R3444P9245R2920L2130L3763Q3599k93109r4976K1805P8984M6134
13917A06591j6126p498P9021M55p6206M418J0166j20452l1004O1910J17723m4218
13905H4780k58417J8511M6169O1021r401m4183q6962o4565n1012J46779j3025
13894a70305R8666J4723j65925n555K2719P4174J51169J70645o175p4945m622
13883A04569p4913K9920k7860P5614k361j3843j25614k3667j3691j16912O7224
13872a21534P2118p388K19358J41946Q023n0486q2475K6255N6668j40147j37366
13861a5028K7808p490P204o290P8849J65551J5367q3260j15657k37973K7361N2085
13849i1473j13540O3704R9508j8161O3873p9724q267P9564k6152j61772p9397
$$ plain form
13928 -67348 26096 105341 198261 230391 264154 347753 54644 -40332 -18527 60457 106591
13917 106591 90465 82967 161988 162443 86237 90655 100821 -19631 -50635 11275 128998 84780
13905 84780 -173637 -155126 -108957 -47936 -57337 -101520 -188482 -253047 -304059 -157280 -170305
13894 -170305 -71639 -56916 -222841 -228396 -205677 -131503 19666 190311 184136 109191 104569
13883 104569 29656 59576 31716 107330 104969 91126 -34488 -58155 -71846 -188758 -121534
13872 -121534 -49416 -56804 162554 304500 312523 262037 179562 205817 262485 122338 -15028
13861 -15028 12780 5290 12494 6204 85053 250604 265971 182711 67054 -170919 -143558 -91473
13849 -91473 -205013 -141309 -41801 -59962 3911 -75813 -84080 -4516 -30668 -192440 -271837
13838b71837N6462J17710L8649L3147J45677J45286j05917j28659K761o2837J38129
13827A08571R6337r3805j52732P861J09835K7498L6917k8866k31078k2746L0559
13816a11649n108L9887l697o8069j52112J01971N5808L5278J564o2786J0624K594
13804a55695Q2062j442l6885Q3766j4836o9844j0349q6208m5632R576Q8596J389
13792a55502k8579M9569J47574J21068J27432q6917j31284N3197K6086J6747m1744
13781I7647r8749n2411j7798J4393J7193P4062p0776j282N7989r3837j00695k9093
13769b03357K9489l4134P4556J92431J16235p9989o4010j0232J23341M8103o8923
13758A23510m9752N1806j07660p83J4346l0277J15059k6864r384P4833N3464n0677
$$ plain form
13838 -271837 -215375 -97665 -59016 -25869 119808 265094 159177 30518 33279 -29558 108571
13827 108571 204908 111103 -41629 -33768 76067 103565 140482 111616 -119462 -142208 -111649
13816 -111649 -116757 -76870 -80567 -148636 -300748 -198777 -142969 -107691 -106127 -168913 -158289 -155695
13804 -155695 -73633 -75075 -111960 -28194 -43030 -112874 -123223 -209431 -255063 -245487 -156891 -155502
13792 -155502 -184081 -134512 13062 134130 261562 174645 43361 96558 122644 139391 97647
13781 97647 -1102 -53513 -71311 -56918 -39725 34337 -36439 -37721 20268 -73569 -174264 -203357
13769 -203357 -173868 -208002 -133446 58985 175220 95231 31221 20989 144330 192433 123510
13758 123510 73758 125564 17904 17121 31467 1190 116249 89385 80001 154834 208298 157621
13746A57621l7802l5986m8181M1209J90717M9376j52855o9358m5488M5839K8290
13735A23382j06871l7098k81m2235j10456K5685P5433M1327N9864M2269j04907
13724c3888n6930R5016O5934O341r9236R6284J35429J9102j50191j69095l293
13713i4527N8514n3582j73782P2715J57670k7677n7881J01938J18106n5900o7200
13702b1606O0652M5054m2937r3191L5497M714J6620l3360O7938k6381q3393O6598
13690c795J5901M6211M7460j26392n9372p4453P4844R864O1723P9987r86m1253
13678B9739k0196K3633N2244j0183Q6592R5768j62607N2719J37563q1066j08716
13667I5490r7659j05469n4418j01414N812K50370K11087P2148o1728m8539N8020
$$ plain form
13746 157621 119819 83833 35652 76861 267578 316954 164099 94741 49253 95092 123382
13735 123382 16511 -20587 -20868 -63103 -173559 -147874 -72441 -31114 28750 71019 -33888
13724 -33888 -90818 4198 70132 76473 -22763 73521 208950 228052 77861 -91234 -94527
13713 -94527 -36013 -89595 -263377 -190662 -32992 -60669 -118550 -16612 101494 45594 -21606
13702 -21606 39046 84100 41163 -52028 -16531 -11817 4803 -28557 39381 13000 -70393 -3795
13690 -3795 12106 58317 105777 -20615 -79987 -154440 -79596 -69732 -8009 71978 70992 29739
13678 29739 9543 33176 85420 75237 161829 257597 94990 147709 285272 204206 95490
13667 95490 -2169 -107638 -162056 -263470 -257658 -7288 203799 275947 214219 165680 223700
13656B23700K6262j96603p1022k2004R1780k6266r1154K5952k2213K3819L4132
13645c617o8542l5037n6930N8911P1812l2457Q5229K3891o558P5757j1399K1560
13633A22620k2362j33022K0413n3517J09785K51031K2745o7404k52886k10459
13623b13056L8619J28831K8778j69862j53422M2553R2174K351K2603M0060N0844
13612h9527P500J5790L7500J13007J37707R8061R774k08897K080j15337j4516
13601f858J18676J2740l1652r8812J9509J52656K5445r0410j55043O8294L5679
13590E0224J08430R2599m2611j52120m7960Q5250P6023M670n0877n6348r1311
13579b4031l3881k0095m0227o3168N7661K80J0896J06816R551o6432q5531j86
$$ plain form
13656 223700 249962 53359 -17663 -39667 52113 25847 -65307 -39355 -61568 -37749 -3617
13645 -3617 -72159 -107196 -164126 -105215 -33403 -65860 19369 43260 36702 112459 101060 122620
13633 122620 100258 -32764 -12351 -65868 43917 294948 317693 250289 -2597 -213056
13623 -213056 -174437 -45606 -16828 -186690 -340112 -297559 -205385 -203034 -180431 -140371 -89527
13612 -89527 -82027 -66237 -28737 84270 221977 320038 329812 120915 122995 7658 -6858
13601 -6858 111818 124558 92906 -5906 13603 166259 191704 101294 -53749 14545 50224
13590 50224 158654 251253 208642 56522 8562 93812 169835 174505 123628 67280 -24031
13579 -24031 -57912 -78007 -118234 -181402 -123741 -123461 -112565 -5749 3802 -62630 -148161 -148347
$$ [...]
##END NTUPLES=NMR SPECTRUM
##END=
