##TITLE=Analysis number 319990
Compound Code cc 55622
Book Reference 481/42
Project Code adrs
Chemist Name bruced
##JCAMPDX= 6.0         $$ Bruker NMR JCAMP-DX V2.0
##DATA TYPE= NMR SPECTRUM
##DATA CLASS= NTUPLES
##ORIGIN= Bruker BioSpin GmbH
##OWNER= nmr
$$ XWIN-NMR		Version 3.5
$$ Wed Jun  7 09:09:38 2006 GMT Daylight Time (UT+1h)  MAYBRIDGE\nmr@NMR_250MHZ
##.OBSERVE FREQUENCY= 250.131544655141
##.OBSERVE NUCLEUS= ^1H
##.ACQUISITION MODE= SIMULTANEOUS (DQD)
##.ACQUISITION SCHEME= undefined
##.AVERAGES= 16
##.DIGITISER RES= 18
##SPECTROMETER/DATA SYSTEM= dpx250
##.PULSE SEQUENCE= zg30
##.SOLVENT NAME= CDCl3
##.SHIFT REFERENCE= (INTERNAL, CDCl3, 0, 16.522)
##AUDIT TRAIL= $$ (NUMBER, WHEN, WHO, WHERE, WHAT)
$$ ##TITLE= Audit trail, XWIN-NMR		Version 3.5
$$ ##JCAMPDX= 5.01
$$ ##ORIGIN= Bruker BioSpin GmbH
$$ ##OWNER= nmr
$$ C:\u/data/dgb/nmr/ADRS/350/pdata/1/auditp.txt
$$ ##AUDIT TRAIL=  $$ (NUMBER, WHEN, WHO, WHERE, WHAT)
(   1,<2006-06-07 09:09:14.28 +100>,<MAYBRIDGE\nmr>,<NMR_250MHZ>,
      <created by zg, POWCHK disabled, PULCHK disabled
       configuration hash MD5:
       E2 DF 36 D8 04 B2 41 60 5A D7 A3 38 5A 4B D0 FE
       data hash MD5: 64K
       D9 34 41 BA 09 A8 4D 86 EB 89 5F 93 A5 46 A5 0C>)
(   2,<2006-06-07 09:09:27.42 +100>,<MAYBRIDGE\nmr>,<NMR_250MHZ>,
      <Start of raw data processing
       ef LB = 0.3 FT_mod = 6 PKNL = 1 SI = 32K 
       data hash MD5: 32K
       3A 56 CC 85 A1 6D 72 7D 95 82 93 D9 66 8F 1E 43>)
(   3,<2006-06-07 09:09:29.31 +100>,<MAYBRIDGE\nmr>,<NMR_250MHZ>,
      <apk 
       data hash MD5: 32K
       D9 E9 70 3B 6A 78 C5 3E 84 B4 FF E8 B9 22 8D 3C>)
(   4,<2006-06-07 09:09:30.26 +100>,<MAYBRIDGE\nmr>,<NMR_250MHZ>,
      <abs ABSG = 5 
       data hash MD5: 32K
       83 FF E8 B3 8C ED 8C 29 F6 10 0F CC 63 28 23 63>)
$$ ##END=
$$ 
$$ hash MD5
$$ 7A 07 4A F9 93 EC 8E 82 60 EC E9 31 4A BF F5 F3
##$RELAX= 
##$RELAX= 
##$RELAX= 
##$RELAX= 
##$RELAX= 
##$RELAX= 
##$RELAX= 
$$ Bruker specific parameters
$$ --------------------------
##$DU= <C:\u>
##$EXPNO= 350
##$NAME= <ADRS>
##$PROCNO= 1
##$TYPE= <nmr>
##$USER= <dgb>
##$AMP= (0..31)
100 100 100 100 100 100 100 100 100 100 100 100 100 100 100 100 100 100 
100 100 100 100 100 100 100 100 100 100 100 100 100 100 
##$AQSEQ= 0
##$AQ_mod= 3
##$AUNM= <au_zg>
##$AUTOPOS= <3 >
##$BF1= 250.13
##$BF2= 250.13
##$BF3= 250.13
##$BF4= 250.13
##$BF5= 500.13
##$BF6= 500.13
##$BF7= 500.13
##$BF8= 500.13
##$BYTORDA= 1
##$CFDGTYP= 0
##$CFRGTYP= 5
##$CHEMSTR= <none>
##$CNST= (0..31)
1 1 145 1 1 1 1 1 1 1 1 1 1 1 1 1 1 1 1 1 1 1 1 1 1 1 1 1 1 1 1 1 
##$CPDPRG= <>
##$CPDPRG1= <>
##$CPDPRG2= <>
##$CPDPRG3= <>
##$CPDPRG4= <mlev>
##$CPDPRG5= <mlev>
##$CPDPRG6= <mlev>
##$CPDPRG7= <mlev>
##$CPDPRG8= <mlev>
##$CPDPRGB= <>
##$CPDPRGT= <>
##$D= (0..31)
0 1 0 0 0 0 0 0 0 0.06 0 0 0 0 0 0 0.0002 0 0 0 0 0 0 0 0 0 0 0 0 0 0 
0 
##$DATE= 1149667753
##$DBL= (0..7)
120 120 120 120 120 120 120 120 
##$DBP= (0..7)
150 150 150 150 150 150 150 150 
##$DBP07= 0
##$DBPNAM0= <>
##$DBPNAM1= <>
$$ [...]
##$SUBNAM7= <"">
##$SUBNAM8= <"">
##$SUBNAM9= <"">
##$SW= 20.6930455092707
##$SWIBOX= (0..15)
0 0 3 0 0 0 0 0 0 0 0 0 0 0 0 0 
##$SW_h= 5175.983436853
##$TD= 65536
##$TD0= 1
##$TE= 296.16
##$TE2= 300
##$TE3= 300
##$TEG= 300
##$TL= (0..7)
0 120 120 120 120 120 120 120 
##$TP= (0..7)
150 150 150 150 150 150 150 150 
##$TP07= 0
##$TPNAME0= <>
##$TPNAME1= <>
##$TPNAME2= <>
##$TPNAME3= <>
##$TPNAME4= <>
##$TPNAME5= <>
##$TPNAME6= <>
##$TPNAME7= <>
##$TPOAL= (0..7)
0.5 0.5 0.5 0.5 0.5 0.5 0.5 0.5 
##$TPOFFS= (0..7)
0 0 0 0 0 0 0 0 
##$TUNHIN= 0
##$TUNHOUT= 0
##$TUNXOUT= 0
##$USERA1= <user>
##$USERA2= <user>
##$USERA3= <user>
##$USERA4= <user>
##$USERA5= <user>
##$V9= 5
##$VALIST= <valist>
##$VCLIST= <CCCCCCCCCCCCCCC>
##$VD= 0
##$VDLIST= <DDDDDDDDDDDDDDD>
##$VPLIST= <PPPPPPPPPPPPPPP>
##$VTLIST= <TTTTTTTTTTTTTTT>
##$WBST= 1024
##$WBSW= 4
##$XGAIN= (0..3)
0 0 0 0 
##$XL= 0
##$YL= 0
##$YMAX_a= 458478
##$YMIN_a= -376924
##$ZGOPTNS= <>
##$ZL1= 120
##$ZL2= 120
##$ZL3= 120
##$ZL4= 120
##$ABSF1= 16.522
##$ABSF2= -4.171173
##$ABSG= 5
##$ABSL= 3
##$ALPHA= 0
##$AQORDER= 0
##$ASSFAC= 0
##$ASSFACI= 0
##$ASSFACX= 0
##$ASSWID= 0
##$AUNMP= <proc_1d>
##$AZFE= 0.1
##$AZFW= 0.1
##$BCFW= 0
##$BC_mod= 0
##$BYTORDP= 0
##$COROFFS= 0
##$CY= 12.5
##$DATMOD= 1
##$DC= 0
##$DFILT= <>
##$DTYPP= 0
##$F1P= 14.0000005364418
##$F2P= -0.99999901652339
##$FCOR= 0.5
##$FTSIZE= 32768
##$FT_mod= 6
##$GAMMA= 0
##$GB= 0
##$INTBC= 1
##$INTSCL= 1
##$ISEN= 128
##$LB= 0.3
##$LEV0= 0
##$LPBIN= 0
##$MAXI= 10000
##$MC2= 0
##$MEAN= 0
##$ME_mod= 0
##$MI= 0
##$NCOEF= 0
##$NC_proc= -4
##$NLEV= 6
##$NOISF1= 0
##$NOISF2= 0
##$NSP= 0
##$NTH_PI= 0
##$NZP= 0
##$OFFSET= 16.522
##$PC= 1
##$PHC0= 17.65411
##$PHC1= 4.774506
##$PH_mod= 1
##$PKNL= yes
##$PPARMOD= 0
##$PSCAL= 4
##$PSIGN= 0
##$REVERSE= no
##$SF= 250.13
##$SI= 32768
##$SIGF1= 0
##$SIGF2= 0
##$SINO= 400
##$SIOLD= 32768
##$SREGLST= <1H.CDCl3>
##$SSB= 0
##$STSI= 32768
##$STSR= 0
##$SW_p= 5175.98343685301
##$SYMM= 0
##$S_DEV= 0
##$TDeff= 65536
##$TDoff= 0
##$TI= <Analysis number 999999
Compound Code 99
Book Reference 9
Project Code 9>
##$TILT= no
##$TM1= 0
##$TM2= 0
##$TOPLEV= 0
##$USERP1= <user>
##$USERP2= <user>
##$USERP3= <user>
##$USERP4= <user>
##$USERP5= <user>
##$WDW= 1
##$XDIM= 32768
##$YMAX_p= 376943032
##$YMIN_p= -335942
$$ End of Bruker specific parameters
$$ ---------------------------------
##NTUPLES= NMR SPECTRUM
##VAR_NAME=  FREQUENCY,     SPECTRUM/REAL,   SPECTRUM/IMAG
##SYMBOL=    X,             R,               I
##VAR_TYPE=  INDEPENDENT,   DEPENDENT,       DEPENDENT
##VAR_FORM=  AFFN,          ASDF,            ASDF
##VAR_DIM=   32768,         32768,           32768
##UNITS=     HZ,            ARBITRARY UNITS, ARBITRARY UNITS
##FACTOR=    0.157963299565203, 1,           1
##FIRST=     4132.6476996994, 0,             0
##LAST=      -1043.33573715361, 0,           0
##MIN=       -1043.33573715361, -335942,     0
##MAX=       4132.6476996994, 376943032,     0
$$ Real data points
##PAGE= N=1
##DATA TABLE= (X++(R..R)), XYDATA
$$ [...]
18979A16445K744J1339o474j892l889J1466n959R42L048M390j982j4743k5151
18966I0284l553j0666j1117O932M959J4704j070j2689J1060N514m442j9648j2196
18953E8072R745o614n729L436n846L315Q585J2541j4523n219J4595j3229k0750
18940C8379n150j0255n960P580M513J6089R832L004M407j5147j1097J533m36m296
18926C2996R85J1067o751K465m798j0190M1J946o634J1101J2226J109k2254L191
18912B6500J061P901O959n946r396o507J2315K0460q237j6697J1355P407j5389
18899C1786L980P811p712M433k993J979L307j7470j6377P826O536N055j316Q426
18885C5271L998P107P446J16k111r110J252N507m468J4608J3345K576J0945M397
$$ plain form
18979 116445 119189 130528 124054 122162 118273 129739 123780 124722 127770 132160 130178 115435 90284
18966 90284 86731 76065 64948 71880 76839 91543 90473 77784 88844 94358 89916 70268 58072
18953 58072 67817 61203 55474 58910 53064 56379 64964 77505 62982 57763 72358 59129 38379
18940 38379 33229 22974 17014 24594 29107 45196 55028 58032 62439 47292 36195 37728 37292 32996
18926 32996 33981 45048 38297 40762 35964 25774 25815 27761 21127 32228 44454 45563 23309 26500
18912 26500 27561 35462 42421 36475 27079 20572 32887 53347 45110 28413 39768 47175 31786
18899 31786 35766 43577 35865 40298 37305 39284 42591 25121 8744 16570 23106 28161 26845 35271
18885 35271 39269 46376 53822 53938 51827 42717 43969 49476 45008 59616 72961 75537 86482 90879
18871I0879J2238J1669j4161j2180q048n082J0109J8410J9083O955K3098K4655
18859A77625K7163K4114J7637L6216J7709J6086Q731q210J2484J6019L907k768
18847C46713L889J6386J0172M659r127L230J0074L90o322N124j6714k9721j1062
18834C27691k4566k2082l5520j8355k3751k4246k3299j8415m090R905J1323Q884
18822A63479n427n901N332K736K218M975L571n520o960l773q881J2857K2713J3256
18808A94675J0268Q072J1069P025N009J6041K3859J5136R302J9028L3628N423
18796C58535o502j2060O880k143k0048k7301k4407r474K216l844j7895p808r417
18783B26732j2043j3599j9817r164j7450o304R490K435l135o667L078K61o30J032
$$ plain form
18871 90879 103117 114786 100625 88445 80397 75315 85424 103834 122917 129872 152970 177625
18859 177625 204788 228902 246539 282755 300464 316550 325281 317071 329555 345574 349481 346713
18847 346713 350602 366988 377160 381819 372692 375922 385996 386386 380064 385188 368474 338753 327691
18834 327691 303125 281043 245523 227168 203417 179171 155872 137457 133367 143272 154595 163479
18822 163479 158052 152151 157483 160219 162437 167412 170983 165463 158503 154730 145849 158706 181419 194675
18808 194675 204943 213015 224084 231109 236118 252159 276018 291154 300456 319484 353112 358535
18796 358535 352033 339973 346853 344710 324662 297361 272954 263480 265696 261852 243957 236149 226732
18783 226732 214689 201090 181273 172109 154659 148355 157845 160280 157145 150478 153556 153817 153187 154219
18769A54219L014p015j272o32k898L49K146J6216r01R194Q426K0247P546J6695
18755B25334J6610J3572K7978J0063J3150J2546L965r70K113M832k793M054N898
18742C36352J4491J611L931j2696k3876k4715l0065l9284k3532n959j3180j28
18730A82950k1782l1274j405K568n053N933j0946j1917o16P258M437j1574N55
18717A09134L035r410k053J0637K4555J5097K5698J2773K1627L2375K6872J1385
18705B81725J7985L2408J3843L0813R948J1113m69r029J064j3100j5208j0995
18693C50098M824K273l053J0036K2735K4988Q680J376k9345m5661m1027m3940
18681B61984k8857k5046k7538k3681j4658L22j4003n999k522n542P132j165j6585
$$ plain form
18769 154219 157233 150218 148946 148314 145416 145765 147911 164127 163226 172420 180846 201093 208639 225334
18755 225334 241944 255516 283494 293557 306707 319253 323218 322248 324361 329193 326400 330454 336352
18742 336352 350843 352454 356385 343689 319813 295098 265033 225749 202217 196258 183078 182950
18730 182950 161168 129894 128489 131057 126004 131937 120991 109074 108458 115716 120153 108579 109134
18717 109134 112169 102759 100706 111343 135898 150995 176693 189466 211093 243468 270340 281725
18705 281725 299710 332118 345961 376774 386722 397835 397366 388337 389401 376301 361093 350098
18693 350098 354922 357195 354142 364178 386913 411901 420581 421957 392612 346951 305924 261984
18681 261984 233127 208081 180543 156862 142204 142526 128523 122524 120002 114460 121592 120427 103842
18668A03842j6129m66J3679n270m165o383j258n53p317j2114P114J0656m421Q534
18654H5749N372R684L822K713j35m185n258P735j3804k39R498N825m687J594N97
18639A04281n232N867P704j362j2288R753j354j9228L540K1855k396r614j310
18626A00216J392j314q721j3316k023J364p167j7808O353J6730J608k535k402
18613G2377o133J6369P345j0045r160J808P693o623P362J6270J469O504K236N473
18599A12945m624j2269J938J3773J81j0486L71P045m239p711m274n121j0761j1188
18585F5580K877M259P523J2050P87o246j4855n195j082j6992K910N721k046p900
18571D7391j224q714p935J0801J8204L116m800j19L135J1226N191q174m396K554
$$ plain form
18668 103842 87713 87247 100926 95656 91491 85108 83850 83297 75980 63866 70980 81636 77215 85749
18654 85749 91121 100805 104627 107340 107205 103020 97762 105497 91693 91454 100952 106777 102090 103684 104281
18639 104281 99049 104916 112620 111258 98970 108723 107369 88141 91681 113536 111140 101526 100216
18626 100216 101608 100294 91573 78257 76234 77598 70431 52623 58976 75706 77314 74779 72377
18613 72377 66244 82613 89958 79913 70753 72561 80254 73631 80993 97263 98732 105236 107472 112945
18599 112945 108321 96052 97990 111763 111944 101458 101829 108874 104635 96924 92650 87529 76768 65580
18585 65580 68457 72716 80239 92289 93076 86830 71975 66780 65698 48706 51616 57337 55291 47391
18571 47391 46167 37453 29518 40319 58523 61639 56839 56720 59855 71081 76272 68098 63702 66256
18557F6256J3480L73J3473m560M746K892r753j2481L293N371N828q875J896q105
18543G3834l544n832n050j0024j0636l51q041o715j4404j4676j5739j9010J129
18530c9059N370Q229J1193j596Q63O790R611J345J455r256P25n747J2093K5762
18516B7778R741j1153l156j981M953J2861p533j4583l484J1643K2238J9922l274
18503F3972n743J684j656k5K670L153j1090j985j684j2707j957m603J904N632
18489C7565J047O828k722j0647J2294q989j4619J1803J1359Q664J16J7635J1920
18476H2254J7771K6095L2708K6885J9367N621K1210J8358J0819m695L554l567
18464B56380k31Q534J5400O037M609N602Q7L250j568j181n445J32N993n214P570
$$ plain form
18557 66256 79736 80109 93582 89022 93768 96660 86907 74426 77719 83090 88918 80043 81939 73834
18543 73834 70290 64458 59408 49384 38748 38397 30356 23641 9237 -5439 -21178 -40188 -39059
18530 -39059 -33689 -25460 -14267 -15863 -15000 -8210 1401 2746 4201 -5055 -4330 -10077 2016 27778
18516 27778 37519 26366 23210 21229 26182 39043 31510 16927 13443 25086 47324 67246 63972
18503 63972 58229 59913 58257 58232 60902 64055 52965 50980 49296 36589 34632 30029 31933 37565
18489 37565 38612 45440 42718 32071 44365 35376 20757 32560 43919 52583 52699 70334 82254
18476 82254 100025 126120 158828 185713 205080 210701 231911 250269 261088 256393 259947 256380
18464 256380 256149 264683 280083 286120 290729 296331 296418 299668 298100 296919 291474 291606 297599 292385 299955
18449B99955K365j2781j2202N517m867l91K01p400j5908n136L454N68M144P430
18435B64949n799j384K1014K346p54k016M443J8803J3451J3063J8058K7561J9549
18422C93284R561J8417J5499K8679K0676J3005R891P222Q185J3585o563L91J5670
18409E47502J9164J1388J111N084P871J0992j727M42L071j0521L079N058J4446
18396F16960P184o531O990P202j810J5993K7456K4369K3788L9165L2941M9811
18384H43518O0727O6628P0306R0346J10601J08933J26559J44741J68765J96612
18374A987736K14367K51429L01186L55608M26974M93989N77748O63410P60227
18365F032674Q53481R71230J140526J370988J649657K013461K460068K932464
$$ plain form
18449 299955 302320 289539 277337 282854 277987 277596 277797 270397 254489 249353 252807 253375 257519 264949
18435 264949 259150 257766 278780 281126 280372 278356 282799 301602 315053 328116 346174 373735 393284
18422 393284 402845 421262 436761 465440 486116 499121 509012 516234 524419 538004 531441 531832 547502
18409 547502 566666 578054 579165 584249 592120 603112 601385 601827 604898 594377 597456 602514 616960
18396 616960 624144 617613 624603 631805 629995 645988 673444 697813 721601 760766 793707 843518
18384 843518 904245 970873 1041179 1131525 1242126 1351059 1477618 1622359 1791124 1987736
18374 1987736 2202103 2453532 2754718 3110326 3537300 4031289 4609037 5272447 6032674
18365 6032674 6886155 7857385 8997911 10368899 12018556 14032017 16492085 19424549
18357A9424549L483334M002304M301210M437051M754881N259337N640796N762849
18349E7066311N658953N284052N038464N036569L613523M06040k007585k288714
18341G7807613l310343n430274o202424n366159m690174m379883l824695l041948
18333D1561713k475014k474060k845188k917179k674170k572110k543511k356991
18325B0703490j977332j595442j280533r80090p16148m96073k90407p6330J53601
18316A3444736L73719N92564Q00105J011637J222230J448848J745413K105858
18308B2745110K436087K740976L055619L501073L911912L904054L585323L539435
18300D9419589L778207L787405L597238L555227L693296L522859K259139N74399
$$ plain form
18357 19424549 22907883 26910187 31211397 35648448 40403329 45662666 51303462 57066311
18349 57066311 62725264 68009316 73047780 78084349 81697872 82103912 80096327 77807613
18341 77807613 74497270 69066996 62864572 57498413 52808239 48428356 44603661 41561713
18333 41561713 39086699 36612639 33767451 30850272 28176102 25603992 23060481 20703490
18325 20703490 18726158 17130716 15850183 14870093 14153945 13657872 13367465 13291135 13444736
18316 13444736 13818455 14411019 15211124 16222761 17444991 18893839 20639252 22745110
18308 22745110 25181197 27922173 30977792 34478865 38390777 42294831 45880154 49419589
18300 49419589 53197796 56985201 60582439 64137666 67830962 71353821 73612960 74187359
18292G4187359L568n29994l033243n825458o234652n554889n689638n786268n078285
18283C6458500m067123l239503k527246k047886j913955j909301j764417j560626
18275A7428443j479523j409170j269599j080671r13851p94816o91990o30515n29960
18266H628348m64906m24392m00020l76433l35882l07567k78121k50192k43673
18257E547162k34777k16361k12861j87634j88792j67419j57973j61336j47163
18248C872846j48283j40136j38368j33348j17598j18834j40694j14857r1426r6225
18238B633077q8987r1339q6205p6378o1879p0494q2656o8810n8693o2634n7919
18227A827083m1409l6726l7619l7584m9586m2532k5701k8638l8881l6762j3080
$$ plain form
18292 74187359 74190927 73660933 70627690 64802232 58567580 53012691 47323053 41536785 36458500
18283 36458500 32391377 29151874 26624628 24576742 22662787 20753486 18989069 17428443
18275 17428443 15948920 14539750 13270151 12189480 11275629 10480813 9788823 9158308 8628348
18266 8628348 8163442 7739050 7339030 6962597 6626715 6319148 6041027 5790835 5547162
18257 5547162 5312385 5096024 4883163 4695529 4506737 4339318 4181345 4020009 3872846
18248 3872846 3724563 3584427 3446059 3312711 3195113 3076279 2935585 2820728 2729302 2633077
18238 2633077 2544090 2452751 2366546 2290168 2228289 2157795 2075139 2006329 1947636 1885002 1827083
18227 1827083 1785674 1748948 1711329 1673745 1624159 1581627 1555926 1527288 1488407 1451645 1438565
18216A438565l0191m2648k9863l2206k2828k7530k2510k1310k2157k7470l9867
18205A119985l9169l9248l1201k7435l4619j2507k9236l5269k4988j7517l2180
18194G96616k3131l3839l3623k5424l0044k7346j8127j8697k4159j6186k5110
18183E20930k0817q94q046l641n851j6621m601j183n770j533m552j886O026J3105
18169D64666O101R938N107L189j537o327O741n090P344m539j051P89j1920p076
18155D66335j3637k735j984k091j2655j9155k4564k9262j197q117r591O662J0936
18142C58945P620k985N187p670j3307P304K8819J3793j648K0028J9536K3619K3912
18129D83153L1043M7981O0734P3816J23027J84077K71881M28250O50950Q38204
$$ plain form
18216 1438565 1408374 1365726 1335863 1303657 1280829 1253299 1230789 1209479 1187322 1159852 1119985
18205 1119985 1080816 1041568 1010367 982932 948313 935806 906570 871301 846313 828796 796616
18194 796616 773485 739646 706023 680599 650555 623209 605082 586385 562226 546040 520930
18183 520930 500113 499219 491173 487532 481681 465060 460459 459276 453506 451973 447421 445535 451561 464666
18169 464666 470767 480705 485812 489001 487464 481137 487878 482788 490132 485593 484542 485331 473411 466335
18155 466335 452698 449963 447979 445888 433233 414078 389514 360252 359055 350938 341347 348009 358945
18142 358945 366565 363580 368767 361097 347790 355094 383913 397706 396058 416086 435622 459241 483153
18129 483153 514196 562177 622911 696727 819754 1003831 1275712 1703962 2354912 3193116
18119C193116Q37765P20189N65185L19990K52275O00323J200897J780644J451430
18110A0921814k48864j932959j922997j321018j064757q22221n88857m35309l39430
18101B245402k66013k24295j81252j57845j36888j05104p1300m8432o5389p6259
18091I12625n8998n1250n7222m4137m4657l4270p240m840j8512l1761l0854j3603
18079E15281l782j6756j9661k2290j9767m361J035k4763r936k633k1738j2102
18067C58527r070j7548j1543M69m449O73P992k0054k4619j9083j7441J570M610
18054B50034q010k0484p44J5556p163r493j1509M7j3090j7049p720j4475l842
18041A52058r72M114p527o911o002l58k27L1j2377l193K372k889L440K616J2794
$$ plain form
18119 3193116 4030881 4751070 5316255 5636245 5888520 6488843 7689740 9470384 10921814
18110 10921814 10672950 8739991 6816994 5495976 4431219 3608998 3020141 2584832 2245402
18101 2245402 1979389 1755094 1573842 1415997 1279109 1174005 1102705 1054273 988884 912625
18091 912625 853627 802377 745155 701018 656361 622091 614851 610011 591499 559738 528884 515281
18079 515281 511499 494743 475082 452792 433025 428664 429699 404936 395000 392367 370629 358527
18067 358527 349457 331909 320366 320835 316386 317059 325051 304997 280378 261295 243854 245424 250034
18054 250034 242024 221540 220796 236352 229189 219696 208187 208234 195144 178095 170375 155900 152058
18041 152058 151086 155200 147673 140762 134760 134402 134175 134206 121829 118636 121008 118119 121559 124175 136969
18026A36969r55K816n496j0019k0984m325J2422N08p380K642p998J369q595j8452
18012G2522j2008O439N822N999m892q311k484j2399m377J0457o642p944l881j2621
17998B5680k515J7063J0037K212n086N022p678r231m237J076M580Q662l835j4596
17984B7154J614o257j6049j136R471J6042J730j543O52N109n254k016K809j632
17970C0694r357o698Q037J861l460n902j754K824N858M380J8458j30j9714j4347
17956A0750J582J5303L153J400q907m45J6563L017j6978L94l236j2407j4857n943
17942a0611L076J2233p426r38O543J926m16M867Q388n114J0591M927P235p619
17928B7662j734P844M080n384m757N858j667m942o412M527M399N710j037j0132
$$ plain form
18026 136969 136014 138830 133334 123315 102331 98006 110428 110936 103556 106198 98200 99569 90974 72522
18012 72522 60514 66953 72775 78774 73882 65571 63087 50688 46311 56768 50126 42182 38301 25680
17998 25680 23165 40228 50265 52477 47391 52413 44735 35504 31267 32343 36923 45585 41750 27154
17984 27154 28768 22511 6462 5326 14797 30839 32569 31026 31678 36787 31533 29517 32326 30694
17970 30694 21337 14639 22676 24537 21077 15175 13421 16245 22103 26483 44941 44811 25097 10750
17956 10750 12332 27635 30788 32188 23281 22836 39399 42416 25438 25832 22596 10189 -4668 -10611
17942 -10611 -7535 4698 -2728 -3666 2877 4803 4387 9254 17642 12528 23119 28046 35281 27662
17928 27662 25928 33772 37852 32468 27711 33569 31902 26960 20548 25075 29474 35184 34147 24015
17914B4015j884J6651o434k240j2021K447P445O877o548l828p682J016R528P495
17900C4837M435p283j1251J5684J5839j3494l279l228K916j2373N335Q997n988
17887C1147o989K71l785N684J71j4545m162J825j455q86J5734n32r872j0586k398
17872c78L622Q767J622N407P665o472q440o227J7116l457q030J244J0986J8592
17858D2017L493l379O603K1676J1767J6190J5431O822J6887J9917Q252K8616J7368
17845B11660K6396K4219L7084L0246P742K028N787O586P622L19o033j0972q793
17832C33891L762O046j0619l3112k4505j3495k1315l8337k4456q970k1544n640
17820A41706l004j7822j6857j3377K537J167k550j2116q016O111O913j1329k704
$$ plain form
17914 24015 22131 38782 32348 30108 18087 20534 27979 34856 28308 24480 16798 17814 27342 34837
17900 34837 39272 31989 20738 36422 52261 38767 35488 32260 35176 22803 28138 37135 31147
17887 31147 24158 24429 20644 26328 26499 11954 7792 9617 8162 7276 23010 22478 12606 2020 -378
17872 -378 3244 12011 13633 19040 26705 20233 11793 5566 22682 19225 11195 12439 23425 42017
17858 42017 45510 42131 48734 70410 82177 98367 113798 120620 137507 157424 165676 194292 211660
17845 211660 238056 262275 299359 329605 337347 339375 345162 351748 359370 359689 353656 342684 333891
17832 333891 337653 343699 333080 299968 275463 261968 240653 202316 177860 168890 147346 141706
17820 141706 138702 120880 104023 90646 93183 94350 91800 79684 71668 77779 84692 73363 70659
17807G0659R359n380R303K2555J0552P216r112J8258L0126J9631L5246K3067K8119
17794B69599K3285J9615J1593L397n285L656K793j2185n373k731j6647j3098o373
17781B72246P873p608J029m260M528k074k5469k8353k2551j8681j2798K406j3700
17768A52588l4265k1762l019p725j846J231n933L18m745j2216k4769j2698N708
17755C0867O495J7144K948r560j1406k369N501J1314m645j2067r662j0304j0178
17742D078P125J3007R836k728j5853j494O741K107m603M767L6o343q488p044n035
17727c891m921j0396M144J3050q61Q943l498o056Q452M248k369o011L029J001
17713D864r68l104o54J7440O839j311q642n272J2202N066m514O115j7410j3152
$$ plain form
17807 70659 80018 74638 83941 106496 117048 124264 115152 133410 163536 183167 218413 241480 269599
17794 269599 292884 312499 324092 327489 322204 325860 328653 316468 311095 308364 291717 278619 272246
17781 272246 280119 272511 273540 269280 273808 271734 246265 217912 195361 176680 163882 166288 152588
17768 152588 118323 96561 93542 85817 83971 85202 79269 79587 74842 62626 37857 25159 30867
17755 30867 37362 54506 57454 47894 36488 34119 39620 50934 46289 34222 24560 14256 4078
17742 4078 11203 24210 34046 31318 15465 13971 20712 22819 18216 22983 23019 16676 8188 1144 -3891
17727 -3891 -8812 -19208 -15064 -2014 -2875 6068 2570 -3486 4966 9214 6845 834 3863 4864
17713 4864 3896 792 138 17578 24417 23106 14464 9192 21394 26460 21946 28061 10651 -2501
17699b501o60J0605L246j855q867Q864Q215j0382Q62J0156m530r014p157n002
17685h020P140J6915J0714K147j1778j979p824L172R061j3404j8708J147r691
17672b1108k96J8004J4378J0116j2219q984N099R39Q01L280L462j0676n006N98
17658a612J2585r381j3852L547J0517N062J1546j195m880j370K386P201Q555m768
17644B4341j3409o819J4291J4441j5846m006m004j0322J434J2903n795r518L170
17631H61Q576J2196p10n721j0534o42M419p963q961r216j886j729p109l069J4650
17616a6838M564r581R43M797K075Q292n24M612J7785M864L005o251k1535j2741
17602a6533O590K593P273J3089m077q918p639l34J2888p342l15N095m564j6289
$$ plain form
17699 -2501 -3161 7444 10690 8835 -32 8832 17047 6665 7527 17683 13153 4139 -3018 -8020
17685 -8020 -880 16035 26749 28896 17118 15139 7315 10487 19548 6144 -12564 -11417 -21108
17672 -21108 -21404 -3400 10978 21094 8875 -109 4990 5929 6730 10010 13472 2796 -2210 -1612
17658 -1612 10973 1592 -12260 -8713 1804 6866 18412 17217 12337 10967 13353 20554 29109 24341
17644 24341 10932 4113 18404 32845 16999 12993 8989 -1333 101 13004 7209 -2309 861
17631 861 9437 21633 20923 15202 4668 4026 8445 482 -8479 -17695 -19581 -21310 -28419 -31488 -16838
17616 -16838 -12274 -21855 -20912 -16115 -14040 -5748 -6272 -1660 16125 20989 23994 17743 -3792 -16533
17602 -16533 -9943 -7350 -77 13012 8935 17 -7622 -7956 4932 -2410 -2725 2370 -2194 -18483
17588a8483l063P489J3723P074p407m106k216n857J2339J3887q133r34m433j2896
17574a3016O592o92O630J0050j180j3334j3331N806J1907K161j7227l633L087
17561a6180L935j117l022p363n928r5J6077J9961k3606k1116P80J3197J8819Q509
17547B851Q618r65o328j2199k974m404p478L22J0549N458N49J0855l988k739m604
17532f477R746K405k599P507L646o637q27j0400N76P79l622j370K044l101j011
17517i341K09K29k958N101J3990l411M875L068j1861J062L010j0271N460Q371
17503G533j5294o135r603L578P630J8150P076J656O439q257o289p34j1924k0355
17489b6529n013R601m274M108J1457J1088j0584j4387j023J7032J2391k899n000
$$ plain form
17588 -18483 -21546 -14057 -334 6740 -667 -4773 -6989 -12846 -507 13380 5247 4313 -120 -13016
17574 -13016 -6424 -7116 -486 9564 8384 -4950 -18281 -12475 -568 1593 -15634 -19267 -16180
17561 -16180 -12245 -13362 -16384 -23747 -29675 -29770 -13693 6268 -17338 -38454 -37674 -24477 -5658 2851
17547 2851 11469 10504 4176 -8023 -10997 -15401 -22879 -22557 -12008 -6550 -6001 4854 866 -1873 -6477
17532 -6477 3269 5674 3075 10582 14228 7591 6764 -3636 -3060 -2281 -5903 -7273 -5229 -8330 -9341
17517 -9341 -9132 -8903 -11861 -6760 7230 3819 8694 11762 -99 963 3973 -6298 -838 7533
17503 7533 -7761 -13896 -23499 -19921 -12291 5859 12935 14591 21030 12773 6484 5750 -6174 -26529
17489 -26529 -31542 -21941 -26215 -22107 -10650 438 -10146 -24533 -25556 -8524 3867 968 -4032
17476d032j1367L891J2395j754r146p28Q167r69j512n529k781J8101J8175j696
17462B1215Q04P351P887r392j2395o103o647q215P781R901O582M834P430k203
17448B8830p834O85Q882J2760j824q874n968K982j1220j0404o121n495j3942j67
17434a7710k75m970j466J6811J1894N641j0152j4146m326L796O052n717p778J4192
17420h154J747Q037J1399q230j2412J3812J3097M693l319q027l883j2380j997
17407e617K444R8q591j424j2624k175O795q770o178J5627J0793J231j0200N301
17393a3290N418m548M817Q420K273l906j848n667R254P634K386j3173n104M955
17379b379O666q628J248J952L969j5015l048J1440o440j5009J0446J1176Q0p33
$$ plain form
17476 -4032 -15399 -11508 887 -867 -10013 -10741 -2574 -3543 -5055 -10584 -13365 4736 22911 21215
17462 21215 22019 29370 37257 27865 15470 9367 2720 -5495 2286 12187 18769 23603 31033 28830
17448 28830 20996 21681 30563 43323 41499 32625 26657 29639 18419 8015 1894 -3601 -17543 -17710
17434 -17710 -17985 -22955 -24421 -7610 4284 9925 -227 -14373 -18699 -14903 -8851 -14568 -22346 -8154
17420 -8154 -6407 1630 13029 4799 -7613 6199 19296 23989 20670 12643 8760 -3620 -5617
17407 -5617 -3173 -3075 -11666 -13090 -25714 -27889 -21094 -29864 -36042 -20415 -9622 -8391 -18591 -13290
17393 -13290 -7872 -12420 -7603 817 3090 -816 -2664 -8331 923 8557 10943 -2230 -7334 -2379
17379 -2379 4287 -4341 -3093 -1141 2828 -12187 -15235 -3795 -10235 -25244 -14798 -3622 -3542 -4275
17365d275J1775k298n646K634M459P716M237j4084k6015r990J2825L198J3721
17352a743L740l381J2753O591j8416j559Q931j104M795L715r259k357j348k057
17338f99r507l334N772P16n640j864k672k54R861K396m246J2316J175l949J2525
17323A2596o127j343L063Q322m062j260m720J223K620K840j0935l545K888p342
17309e782m75K0432n713n068j7443L596M895J1319J0133j3091m542j4368J731
17296a4376o247l20R004J0088m09J1927J1662J998m452k023j0763j0018N214n19
17282G66j7871l118J8762L130j0181M846n469m519Q091M225l803L963R545j5040
17268f673J306N271l213o225j3032p783J185r900j1540N426K0616K3370P182k6094
$$ plain form
17365 -4275 7500 5202 -444 2190 6649 14365 18602 4518 -21497 -31487 -18662 -15464 -1743
17352 -1743 1997 -1384 11369 17960 -456 -2015 6916 5812 10607 14322 5063 2706 1358 -699
17338 -699 -10206 -13540 -7768 -7052 -12692 -14556 -17228 -17482 -7621 -5225 -9471 2845 4020 71 12596
17323 12596 6469 5126 8189 16511 12449 11189 6469 7692 10312 13152 2217 -1328 1560 -5782
17309 -5782 -6257 14175 8462 3394 -14049 -10453 -5558 5761 15894 2803 -1739 -16107 -14376
17296 -14376 -20623 -20943 -11939 -1851 -2260 9667 21329 23327 18875 16852 6089 -3929 1285 766
17282 766 -17105 -20223 -1461 1669 -8512 -3666 -9135 -13654 -5563 -1338 -5141 -1178 8367 -6673
17268 -6673 -5367 -96 -3309 -9534 -22566 -30349 -29164 -39064 -50604 -45178 -24562 -1192 5990 -20104
17254b0104j920J1568o751m27m992J0719J4501M173K937L784o628J311O458j716
17240A2913k869j1130J570Q76l697j3436m816J747M414M49m765M912q492m606
17226b6930M79J0354p286M102K318j7036L476N722r681Q583J7234r613r55J0414
17212h819m591j0762L509J304J825n734o877J9126R818o418K838k87q84O457l876
17197c371O796k345n112r39j3119O219Q091k656n941m864k887N542l821J2523
17183e884O934P825R049j6001j6642L201L986m541n524j431r133k029J0241M830
17169a5119P005J8004J6736j4249j4220O457L398p700P205K222j1120M711K659
17156E989J0397K937j0511Q453l357L302k56O1o989K840j1942n131j0380r460
$$ plain form
17254 -20104 -22024 -10456 -17207 -17634 -22626 -11907 2594 6767 9704 13488 6860 8171 14629 12913
17240 12913 10044 -1086 484 1360 -2337 -15773 -20589 -18842 -14428 -13979 -18744 -13832 -22324 -26930
17226 -26930 -26451 -16097 -23383 -19281 -16963 -33999 -30523 -24801 -34482 -25899 -8665 -18278 -19233 -8819
17212 -8819 -13410 -24172 -20663 -19359 -17534 -23268 -30145 -11019 -1201 -7619 -4781 -5068 -5952 505 -3371
17197 -3371 3425 1080 -4032 -4971 -18090 -11871 -3780 -6436 -12377 -17241 -20128 -14586 -18407 -5884
17183 -5884 1050 8875 17924 1923 -14719 -11518 -7532 -12073 -17597 -19028 -28161 -30190 -19949 -15119
17169 -15119 -8114 9890 26626 12377 -1843 4614 8012 312 7517 9739 -1381 3330 5989
17156 5989 16386 19323 8812 17265 13908 17210 16954 17015 10026 12866 924 -4207 -14587 -24047
17142b4047k453m725r766N892l71J267J2522Q467J2062p538p314j9061r276J3261
17128c1080R202o741L361O776M962n255O676J5719O56j191p340K072J5170O351
17114A9338J819j7042m830P501J095j4272j0596k450K365R96o47j571P316N518
17100e460N74n001p238l199o076J475R957p771L56k085J6601l490K560P952N167
17085D322l481M042q205j1637N279R290j0775j300j014j157J644P446j2794K347
17071a5993p047O670J3320m821K9m060r285N13J1211K785p289m976L063J4625
17057a255L479j7673K047O014J828k004q834j5419J0311K0595O994r029O215L043
17043F312K67L431P845k091r904k0592K252P143n9O158J324k0052n688l195J296
$$ plain form
17142 -24047 -26500 -31225 -40991 -35099 -35470 -34203 -21681 -13214 -1152 -8690 -16004 -35065 -44341 -31080
17128 -31080 -21878 -28619 -25258 -18482 -13520 -18775 -12099 3620 4276 3085 -4255 -2183 12987 19338
17114 19338 21157 4115 -715 6786 7881 -6391 -16987 -19437 -17072 -16076 -16723 -18294 -10978 -5460
17100 -5460 -4886 -9887 -17125 -20324 -26400 -24925 -14968 -22739 -22383 -24468 -7867 -11357 -8797 -845 4322
17085 4322 841 4883 -3322 -14959 -9680 -390 -11165 -12465 -13479 -14636 -12992 -5546 -18340 -15993
17071 -15993 -23040 -16370 -3050 -7871 -7842 -11902 -21187 -20674 -9463 -6678 -13967 -18943 -15880 -1255
17057 -1255 2224 -15449 -13402 -7388 -5560 -7564 -16398 -31817 -21506 -911 6083 -2946 3269 6312
17043 6312 6579 10010 17855 15764 5860 -14732 -12480 -5337 -5396 762 2086 -17966 -23654 -26849 -25553
17028b5553P297m183N364M74l864N737J4065k094J3398m467k814N706m612j80
17014D274N206O684n854j0402o464O438k695L506J2006m797j1936q27J868j0087
17000a3080J666P166N431O728j1217j0701O477N491J5220M422l834o968r563j0274
16986a3036l46O734M109l380j945j0600n378J733N037r527o794N706J2952r853
16972b4588m80J0836K096j132j0822Q2J1472O130N960Q521J5651p549k719n083
16958H375L758N537O76q224r322j8013P343K988j1053j0210j136Q177m600M320
16944b1384K371p62j3599l011K3249L415r132j0909K42M337o442l773J1196M641
16930a9561K466O762o04o642L533l402j1896k434R179J5254R334J087k031J819
$$ plain form
17028 -25553 -18256 -22439 -17075 -16601 -20465 -14728 -663 -2757 10641 6174 3360 9066 4454 4274
17014 4274 9480 16164 10310 -92 -6556 -118 -2813 693 12699 7902 -4034 -4861 -2993 -13080
17000 -13080 -11414 -4248 1183 7911 -3306 -14007 -7530 -2039 13181 17603 13769 6801 -2762 -13036
16986 -13036 -13382 -6648 -2539 -5919 -7864 -18464 -23842 -22109 -17072 -26599 -33393 -27687 -14735 -24588
16972 -24588 -25068 -14232 -12136 -13268 -24090 -24008 -12536 -6406 -446 8075 23726 16177 13458 8375
16958 8375 12133 17670 18346 10122 800 -17213 -9870 -6882 -17935 -28145 -29281 -21104 -25704 -21384
16944 -21384 -19013 -19775 -33374 -36385 -13136 -9721 -18853 -29762 -29520 -25183 -31625 -35398 -24202 -19561
16930 -19561 -17095 -10333 -10937 -17579 -14046 -17448 -29344 -31778 -22599 -7345 1989 3076 1045 2864
16916B864k026J0996M934o003L42J0315M722j6332l290P034r536j4466l672K330
16902a1788R857M246p249o302N672j908j1382k705O606o141N600p103o836M543
16888b4890l291K671L355q477P028O634J3139J767R69K1j2969j1987k44P558J2165
16873f551q651l382J197k502O310O197J0288l811j2774o347N290q127l656R742
16859a6777M232o318R917j742P373j914n530j0292L467K3408r560n467M876R170
16845D843L786O87q261j1225O19Q423R5N47j1173l127N667Q894M902J0760r851
16830E586j6751J646J630p349k211K104Q403n16j806j4329r41k506k929Q594O224
16815a5151O269n441l002N267P494n366j3395n691M469J8902P861l465r201L551
$$ plain form
16916 2864 838 11834 16768 10765 11107 21422 26144 9812 6522 13556 4020 -10446 -14118 -11788
16902 -11788 -1931 2315 -4934 -11236 -5564 -7472 -18854 -21559 -14953 -21094 -15494 -22597 -29433 -24890
16888 -24890 -28181 -25510 -22155 -30632 -23604 -16970 -3831 -2064 -1095 -1074 -14043 -26030 -26274 -18716 -6551
16873 -6551 -15202 -18584 -17387 -19889 -13579 -7382 2906 -905 -13679 -20026 -14736 -22863 -26519 -16777
16859 -16777 -12545 -18863 -8946 -10688 -3315 -5229 -10759 -21051 -17584 5824 -3736 -9203 -4327 4843
16845 4843 8629 9316 1055 -10170 -9551 -1128 -1033 -486 -11659 -14786 -9119 -225 4677 15437 5586
16830 5586 -11165 -9519 -7889 -15238 -17449 -15345 -6942 -7458 -9264 -23593 -24534 -27040 -29969 -21375 -15151
16815 -15151 -8882 -14323 -17325 -12058 -4564 -9930 -23325 -29016 -24547 -5645 2216 -1249 -10450 -6899
16801f899n783j018l447k471L510K016R16O302M372J1011Q106p410j3792k220
16787f807L121j2440J295J4966K04L779l092l961l403Q073j1838r015J0137m967
16773a3948j3842J0472J9124j0763j0703Q754l670j0547O863J1553L379R897M042
16760A0611m170J0052J6936m801j4676n880j3351q942J0658M195J810q676m851
16747a1085j6316J843P800M233R070O849K976j1058p05J9227j0098j3730r009
16734b0003Q52O474J2554m9m470p369Q973J133M772m637n631o20Q466k1481j1402
16719c2438P138K732J3632K0864m69k735M123N518K108j3071n358K972o584r966
16705a1534O302J0924O07p141M35K149K59K636j3633O77R339k462J0875j6114
$$ plain form
16801 -6899 -12682 -13700 -17147 -19618 -16108 -14092 -13176 -6874 -2502 8509 16615 9205 -4587 -6807
16787 -6807 -3686 -16126 -14831 135 339 4118 1026 -2935 -6338 1735 -10103 -19118 -8981 -13948
16773 -13948 -27790 -17318 1806 -8957 -19660 -10906 -14576 -25123 -18260 -6707 -3328 6569 10611
16760 10611 6441 16493 33429 28628 13952 8072 -5279 -14221 -3563 632 2442 -6234 -11085
16747 -11085 -27401 -25558 -17758 -13525 -4455 2394 5370 -5688 -6393 12834 2736 -10994 -20003
16734 -20003 -19151 -12677 -123 -172 -4642 -12011 -3038 -1905 2867 -1770 -7401 -8021 445 -21036 -32438
16719 -32438 -25300 -22568 -8936 11928 11459 8724 12847 18365 20473 7402 2044 5016 -1568 -11534
16705 -11534 -5232 5692 6299 -842 -407 1742 2001 4637 -8996 -8319 1020 -1442 9433 -6681
16691f681j6550N381Q956N044m820r735l414O762J5235K967j319l761P236N932
16677A1233n610M059q469m079j065J8535j050j1530K475n120P707q81j369M497
16663I333J3177p169o472j2166j6622m623O322m076P96J4195N226j4992j553q855
16649b7479j038O423R279J3972J0530q477j1724j8919k485J6182N342J1042K0350
16636B2998j2958r006r07k336J2306N452j4533r334o615M21J1062Q570p005j2672
16622a4557l253p831O921n757L546N409J7996K55q204j4728j0396p987L846K819
16608c1921J0064J0502J9079K536j4776j0289p849R440N367J217m787J7303L711
16595I597l815j1447O47J693P061k14j741n732l165p299n206M5r79L958N970p805
$$ plain form
16691 -6681 -23231 -17850 -8894 -3850 -8670 -18405 -21819 -15057 178 3145 1826 -1935 5301 11233
16677 11233 5623 9682 1213 -2866 -3931 14604 13554 2024 4499 -621 7086 6205 4836 9333
16663 9333 22510 15341 8869 -3297 -19919 -24542 -18220 -22296 -21500 -7305 -2079 -17071 -18624 -27479
16649 -27479 -28517 -22094 -12815 1157 11687 3210 -8514 -27433 -29918 -13736 -8394 2648 22998
16636 22998 10040 1034 127 -2209 10097 15549 1016 -8318 -14933 -14512 -3450 5120 -1885 -14557
16622 -14557 -17810 -25641 -18720 -24477 -20931 -15522 2474 2729 -5475 -20203 -30599 -38586 -34740 -31921
16608 -31921 -21857 -11355 7724 10260 -4516 -14805 -22654 -13214 -7847 -6630 -11417 5886 9597
16595 9597 5782 -5665 -5018 -3325 3736 3522 1781 -3951 -7116 -14415 -19621 -19576 -20555 -16597 -10627 -18432
16579a8432O565M46l274j0827r783J3328K0450q592j514M461L315M165R529O91
16565A0528k864j8230o071J513j3066l252J012P818K894R939l897j3305L422M630
16551a8929R42O708J685K034j9311p601M570J0266J0341n636M187J2629l964L470
16537A391l847J730J3140M51J1272j2132j7196j2980p294j0109O045J4258J3342
16524a929P908r982j0865q081j3859o174N557J1769O940O630O709N14L505o879
16510h237Q467N284n627n556J0627j0408j667N606n732n693m027N964O925Q319
16496D245J988m582j4408K29l588Q79K413M708J1748l12N708n277j0644l55o736
16481a3984P025Q496j915j5457K205J0255K745j8477r158p812M261J7564J9141
$$ plain form
16579 -18432 -11867 -11421 -14695 -25522 -35305 -21977 -1527 -10119 -11633 -7172 -3857 308 9837 10528
16565 10528 7664 -10566 -16637 -15124 -28190 -31442 -30430 -22612 -19718 -9779 -13676 -26981 -23559 -18929
16551 -18929 -17987 -11279 -9594 -7560 -26871 -34472 -29902 -19636 -9295 -14931 -10744 1885 -2079 1391
16537 1391 -2456 -726 12414 12865 24137 12005 -5191 -18171 -25465 -35574 -29529 -15271 -1929
16524 -1929 5979 -4003 -14868 -22949 -36808 -42982 -37425 -25656 -18716 -12086 -5377 -4863 -1358 -8237
16510 -8237 230 5514 -113 -5669 4958 -5450 -7117 -1511 -7243 -12936 -16963 -10999 -4074 4245
16496 4245 6233 1651 -12757 -12528 -16116 -15237 -12824 -8116 3632 3320 9028 3751 -6893 -7248 -13984
16481 -13984 -6959 1537 -378 -15835 -13630 -3375 -630 -19107 -28265 -36077 -31816 -14252 4889
16468D889J5241L827r62q384j476n239k264J4884m045l767j8128L289N776n942
16454b301n830r2p457l921L960M376p327N340O501l700J113R340J573l076o187
16439g688q82J0942L383o144J1391q81r318j3964L824m3l899j4864n99J56k357
16424c0943N726R838L440P828J0685m397p872m012o626K560m53J606M816K782
16410e022M090j5763M750K174o409O789O75m589K632M791l484N117k930j4830
16396b2009K176J9043J99J407j1133J351Q088J1143J1779n028r443j7097o598
16383a6122q235L441j2908L70J2493Q50K085l964n376q557R875j188K685N738
16369a8813J2823P303J874L206L143o14R707j9313j2636J414J1733l029N15P851
$$ plain form
16468 4889 20130 23957 22995 14611 13135 7896 5632 20516 16471 12704 -5424 -2135 3641 -2301
16454 -2301 -8131 -8223 -15680 -19601 -15641 -11265 -18592 -13252 -6751 -10451 -9338 2 1575 -1501 -7688
16439 -7688 -8570 2372 5755 -389 11002 10121 803 -13161 -9337 -9380 -13279 -28143 -28742 -28586 -30943
16424 -30943 -25217 -15379 -11939 -4111 6574 2177 -5695 -9707 -16333 -13773 -14226 -12620 -7804 -5022
16410 -5022 -932 -16695 -11945 -9771 -16180 -9391 -8716 -13305 -10673 -5882 -9366 -4249 -7179 -22009
16396 -22009 -19833 -790 -591 816 -10317 -8966 -878 10265 22044 17016 7573 -9524 -16122
16383 -16122 -24357 -20916 -33824 -33454 -20961 -20111 -18026 -21990 -27366 -35923 -26048 -27236 -24551 -18813
16369 -18813 -5990 1313 3187 6393 9536 8922 18629 -684 -13320 -11906 -173 -3202 -2687 5164
16355E164p345k790P529m720k318n811n197R997j3284R37O636m49p373K135j7289
16340c4178K4931R868o379l561j2499L035m806J0K0239N416K539j5394j788K603
16326i964R444J390j3579l917J465L055Q780j3510l752K17L574L642j363M624
16312i894Q14P732J1101J587N493q176J471k129O760l540p993m581J827j2802
16298a2330O692J787J881o367l407R792P719o138J012l816k82l483j0389L55j0967
16283b7941J6005O367k1039J564M521O35O630J2258n266N336j0825r256J0342
16270a0669O471R590P011k39j077k809K418L953j0854j8034j204J6476Q919L898
16256A3850Q100L738o150p367j0138J221N316j10m640J22P69M037O654j0028Q401
$$ plain form
16355 5164 -2181 -4971 2558 -2162 -4480 -10291 -15488 -5491 -18775 -17838 -11202 -11651 -19024 -16889 -34178
16340 -34178 -9247 621 -5758 -9319 -21818 -18783 -23589 -23579 -3340 2076 4615 -10779 -12567 -9964
16326 -9964 -520 870 -12709 -16626 -15161 -12106 -3326 -16836 -20588 -20371 -16797 -13155 -14518 -9894
16312 -9894 -9080 -1348 9753 11340 16833 8657 10128 7999 14759 11219 3226 -1355 472 -12330
16298 -12330 -5638 -3851 -1970 -8337 -11744 -1952 5767 -371 641 -3175 -3457 -6940 -17329 -16974 -27941
16283 -27941 -11936 -5569 -26608 -25044 -20523 -19888 -13258 -1000 -6266 -930 -11755 -21011 -10669
16270 -10669 -4198 5392 12403 12164 11087 8278 10696 14649 3795 -14239 -15443 1033 9952 13850
16256 13850 21950 25688 19538 12171 2033 3254 8570 8460 3820 3942 4711 8748 15402 5374 13775
16241A3775L261N30R90j822m599p081k97K937l229p832j9152j6738J4041J7870
16227g346J0472n235p537J2064J42j2580p15J0494N142J619L045J988J315K087
16213A4955M192j0589j0861j385j2227n239M312N867o063L898L845j7m199n18
16199a4029L644M835R007p962L881R330j6357j1371r158J0517J5468m838n346
16186a2379M979K584p429j1646j2874J0331O235R349l494M038n429J559K535j168
16172a2809J0637L535Q980j1226L747l070j1431n018k636m683q010J4110J3454
16159d420n446j2400m978J3471R672k75m366M542J4728K899k564M189j0368j8133
16145a3449n87j2040O389Q049J931j3722k867j1981N231J6023J9149J861j2410
$$ plain form
16241 13775 17036 17566 18556 16734 12135 5054 4757 7694 4465 -3367 -22519 -39257 -25216 -7346
16227 -7346 3126 -2109 -9646 2418 2560 -10020 -10735 -241 4901 6520 9565 11553 12868 14955
16213 14955 19147 8558 -2303 -3688 -15915 -21154 -16842 -10975 -17038 -13140 -9295 -9312 -13511 -14029
16199 -14029 -10385 -5550 3457 -4505 -624 8706 -7651 -19022 -28180 -17663 -2195 -7033 -12379
16186 -12379 -7400 -4816 -12245 -23891 -36765 -26434 -20199 -10850 -14344 -10306 -15735 -14176 -11641 -12809
16172 -12809 -2172 1363 10343 -883 2864 -206 -11637 -16655 -19291 -23974 -31984 -17874 -4420
16159 -4420 -9866 -22266 -27244 -13773 -4101 -4376 -8742 -4200 10528 13427 10863 15052 4684 -13449
16145 -13449 -14036 -26076 -19687 -11638 -9707 -23429 -26296 -38277 -33046 -17023 2126 3987 -8423
16132h423k168J7911K2271k652J0424Q187l971j5641R82O302o284j6197j9498
16119h757j8142p212J3918O400n074Q019J2042J1390N97o488k97r546q211N56
16105a0805J191R749j533m542l143M238J6513p686j1978J0160P094r14j1831p326
16091a0813o431r975j882N303O753J0243Q30j464O054n075j3310j5666J490J0043
16077b3900k307k4817p226J5653M207q472J3089N392J4294Q78m339R795N667L235
16063A149L161j0742j2441N250R547J1373m930n613N415l903l962N046P747j609
16049E488j8231j520O018Q530n914j1603p442k932J8260N144j070p144Q771r68
16035d613L594m642j2881O788N837J161J238n306K769p151o956Q797K119k317
$$ plain form
16132 -8423 -10591 7320 29591 26939 37363 45550 41579 25938 26920 33222 26938 10741 -8757
16119 -8757 -26899 -34111 -20193 -13793 -18867 -10848 1194 12584 13181 6693 6396 -3150 -11361 -10805
16105 -10805 -9614 135 -1398 -5940 -9083 -4845 11668 3982 -7996 2164 9258 8344 -3487 -10813
16091 -10813 -17244 -27219 -29101 -23798 -17045 -6802 -5972 -7436 -1382 -6457 -19767 -35433 -33943 -23900
16077 -23900 -26207 -51024 -58250 -42597 -38390 -46862 -33773 -28381 -14087 -13209 -17548 -7753 -2086 1149
16063 1149 4310 -6432 -18873 -13623 -4076 7297 2367 -3246 2169 -1734 -5696 -650 7097 5488
16049 5488 -12743 -14263 -8245 285 -5629 -17232 -24674 -27606 -9346 -4202 -5272 -12416 -3645 -4613
16035 -4613 -1019 -5661 -18542 -11754 -5917 -4756 -3518 -8824 -6055 -13206 -20162 -11365 -9246 -11563
16021a1563j5242p556N662m715J3948N486k828O479J0408K086j4959P230J6973
16008A1409K006r229r599N39J024L652o338o022p676O217J0136Q483J019R16J682
15993H219j3220n082R076K642l364p011K998j6624J183J4536M675P9P976j1185
15979e102n050J728J5854l492r429N800J647j0773p184l632j305J1699l664J2428
15965d75m238j1447m106N167L747n886N56R077J8354n124k749k266k415j9375
15951b1180R67R251M919j962j1541n245K030L489M584J9114p594j9017J49J5573
15937f463J6657j7991M821r55j4074M665K1448R057j2661j7293L095L569p726
15924a3851j2023M23L547J7663J095R850R457P50r109j4326O607N319M633L113
$$ plain form
16021 -11563 -26805 -34361 -28699 -33414 -19466 -13980 -16808 -10329 79 2165 -12794 -5564 11409
16008 11409 13415 4186 -5413 -4874 -3850 -198 -6536 -12558 -20234 -14017 -3881 4602 5621 6537 8219
15993 8219 -5001 -10083 -1007 1635 -1729 -8740 -5742 -22366 -21183 -6647 -1972 -1893 6083 -5102
15979 -5102 -10152 -8424 7430 3938 -5491 309 1956 -8817 -16001 -19633 -20938 -9239 -12903 -475
15965 -475 -4713 -16160 -20266 -15099 -11352 -17238 -16682 -7605 10749 5625 2876 610 -1805 -21180
15951 -21180 -20213 -10962 -6043 -8005 -19546 -24791 -22761 -19272 -14688 4426 -3168 -22185 -22036 -6463
15937 -6463 10194 -7797 -2976 -3931 -18005 -13340 8108 17165 4504 -12789 -9694 -6125 -13851
15924 -13851 -25874 -25451 -21904 -4241 -3146 6704 16161 16911 7802 -6524 83 5402 10035 13148
15910A3148q693m84M795K237m047K052r137j0074J4783O234j5092q480p25K0309
15896F826J1754l063j4168j4316k215Q532P563J8022N142j2906k374K214q229
15883B782j0949K791J5333M020K052K264q820L528j0194k6124j449Q131N866k888
15869a3657L892q400J2158R514J368p608q89Q472q982j1432K197K558O79q75k803
15854a3808j0983m572j406L408J2176K6692K634k591P94N386j853o273o227n542
15840b165k132J9p040j2416M71j79n419O160L379j2778m427K954M510j958J0399
15825b0622J1058K288l092K972o5K686K149k477N988R956o727m545m453j0957
15811a5841J615j605N26O126l744J625J4604M884j1505r531M844L768l312k433
$$ plain form
15910 13148 4455 3971 8766 11003 6956 9008 -129 -10203 4580 10814 -4278 -12758 -13483 6826
15896 6826 18580 15517 1349 -12967 -15182 -6650 913 18935 24077 11171 8797 11011 2782
15883 2782 -8167 -5376 9957 13977 16029 18293 9473 13001 2807 -23317 -24766 -16635 -10769 -13657
15869 -13657 -9765 -18165 -6007 3507 4875 -2733 -3622 4850 -4132 -15564 -13367 -10809 -10130 -11005 -13808
15854 -13808 -24791 -29363 -30769 -27361 -15185 11507 14141 11550 12344 17730 15877 9604 3377 -2165
15840 -2165 -4297 -4278 -11318 -23734 -23263 -23442 -28861 -22701 -19322 -32100 -36527 -33573 -29063 -31021 -20622
15825 -20622 -9564 -7276 -10368 -7396 -7461 -4775 -2626 -5103 885 10841 4114 -431 -4884 -15841
15811 -15841 -14226 -15831 -15305 -9179 -12923 -11298 3306 8190 -3315 -12846 -8002 -4234 -7546 -9979
15797i979L962J0050O13k3061q919k976J2959K0641K471j38l184k676J9804Q372
15783B7939k2417m030j791j4207j0898k432J5126J2213j7583N62P482r267k437
15770b1740j1167k619m475R341P952K306N630m610k232J1242J3958J0274o70N569
15756A8759J2399K267m069k5831j0407J8m807k183o675N886M691J7071N435r511
15742C043q292M026k851P150K345L06Q858L711L585j3549j1936P381k790m164
15728c177K912j727o97l194j3166j1952m357j573N612J9665J5386P020o533n466
15714a247k288p97M460M812K552p631n971j1241k227k362M613M818j952Q005j2430
15699a8886q729L074K726K351Q188j4665n075l184R190J761J6158J2951k262j2613
$$ plain form
15797 -9979 -6017 4033 4646 -18415 -27334 -30310 -17351 3290 5761 5623 2439 -237 19567 27939
15783 27939 5522 1492 -299 -14506 -25404 -27836 -12710 -497 -18080 -17518 -10036 -19303 -21740
15770 -21740 -32907 -35526 -40001 -30660 -22708 -20402 -14772 -19382 -21614 -10372 3586 13860 13190 18759
15756 18759 31158 33425 29356 3525 -6882 -6864 -11671 -13854 -20529 -14643 -9952 7119 12554 3043
15742 3043 -5249 -1223 -4074 3076 5421 5727 14585 18296 21881 8332 -3604 3777 987 -3177
15728 -3177 -265 -1992 -2689 -5883 -19049 -31001 -35358 -36931 -31319 -11654 3732 10752 4219 -1247
15714 -1247 -3535 -4332 128 4940 7492 -139 -6110 -17351 -19578 -21940 -17327 -12509 -14461 -6456 -18886
15699 -18886 -27615 -24541 -21815 -19464 -11276 -25941 -31016 -34200 -25010 -23249 -7091 5860 3598 -9015
15685i015p432M215k10N817n671p274K702l316K499O264l562R80O34k491M655
15670a1205M073j1645p809J2678K548n858n811K467M478p783l907M292Q021m209
15656a9670J7477p060j3888p691P533R732J0410J2565j942r802n69k697j0718
15643a6320n170J3431j084N233J842k213m873K58L455r99O190m86J480j509o119
15628f884j1916q227K106n673M042J8209J5528j0035o293M879K73q011q237P941
15614a2298R397p757q142N205P312J2470j0946j0869J7209P685p984j875rO791
15600F189Q937r759j9789p800j382M809Q934L815q636J31M060R597n910J768l653
15585h689m917J58Q556Q402J73P700J1992n729p622l587n189q93j0097P62N983
$$ plain form
15685 -9015 -16447 -12232 -12442 -6625 -12296 -19570 -16868 -20184 -17685 -11421 -14983 -14003 -13369 -15860 -11205
15670 -11205 -7132 -18777 -26586 -13908 -11360 -17218 -23029 -20562 -16084 -23867 -27774 -23482 -15461 -19670
15656 -19670 -2193 -9253 -23141 -30832 -23299 -13567 -3157 9408 7466 -2336 -2905 -5602 -16320
15643 -16320 -21490 -8059 -9143 -3910 -2068 -4281 -9154 -8896 -5441 -6440 -250 -736 744 -765 -6884
15628 -6884 -18800 -27027 -24921 -30594 -26552 -8343 7185 -2850 -9143 -4264 -3991 -12002 -20239 -12298
15614 -12298 -2901 -10658 -18800 -13595 -6283 6187 -4759 -15628 1581 9266 1282 -593 -602 6189
15600 6189 15126 5367 -14422 -22222 -23604 -18795 -9861 -6046 -14682 -14551 -10491 -894 -6804 -5036 -8689
15585 -8689 -13606 -13448 -4892 3510 3683 11383 23375 17646 10024 6437 1248 355 -9742 -8980 -2997
15570b997Q591l403k212R951m362j2397n957K409j1919m042J7331J7936M319q081
15556E167o100M912q905j7936L200M840J2437q861J295J5406J4565j4848k8818
15543b3646k148N259O862m845J76p103J7533J9269L547o538j7316m058l241p455
15529b3704M42R404o515P955J3651r24q039L305j6745k0084k184J0753J6790Q443
15515g452n36p295j4756J4131O607o297j9860L854J9640P604J1513j2052j5958
15502b0857j3251p831N044M107j3195J051L1405j335q904K0661J0316o237j3611
15489a2637j2667M251M45J51P87M191j2505r787O040P84p006l99J2751j0384J3753
15474b2232O43J688j1843L179N406N99N369j631o879N69m584o391k1J1047R485
$$ plain form
15570 -2997 5594 2191 -21 9930 5568 -6829 -12786 -10377 -22296 -26338 -9007 8929 13248 5167
15556 5167 -933 3979 -4926 -22862 -19662 -14822 -2385 -11246 -9951 5455 20020 5172 -23646
15543 -23646 -25794 -20535 -13673 -18518 -18342 -25445 -7912 11357 14904 8366 -8950 -13008 -16249 -23704
15529 -23704 -23262 -13858 -20373 -12418 1233 309 -7730 -4425 -21170 -41254 -43438 -32685 -15895 -7452
15515 -7452 -7988 -15283 -30039 -15908 -9301 -15598 -35458 -31604 -11964 -4360 7153 -4899 -20857
15502 -20857 -34108 -41939 -36895 -32788 -45983 -44932 -13527 -14862 -23766 -3105 7211 974 -12637
15489 -12637 -25304 -21053 -20608 -20457 -19670 -15479 -27984 -37771 -31731 -30947 -37953 -38352 -25601 -35985 -22232
15474 -22232 -21589 -19901 -31744 -28565 -23159 -22560 -17191 -18822 -25701 -25132 -29716 -36107 -36128 -25081 -15596
15459a5596p57K556J4818O737l960o613q977l83P449O726Q65j0852J291k641R41
15444h396R500Q046J2117J634n296k3258k742J0031n077j1435p005j8429K135
15431c8175N003J322J2378J6592L795k53q053p899n121j753N573J0228J8604K811
15417A5052j5251J2742q548r626r004o921O744J4697N444P901r847l436J7992
15404A7939j4506k0858q539K346p518O590K0981Q216l91j3277K684J2072l075
15391B664l947J525J271o06q614j0025N208R39r683j1382P714J3833K8090K540
15377A9527r904l020j0937o794R694R037o407k508m876j384p211j9200j0957N591
15363c9349K0159M161n399o397J2188J6258P712n633j9307p263M54R124j591R753
$$ plain form
15459 -15596 -16353 -13797 1021 7758 3798 -2815 -11792 -12175 -4726 2000 2865 -7987 -6696 -9337 -8396
15444 -8396 1104 9150 21267 22901 17605 -5653 -8395 1636 -3441 -14876 -21881 -40310 -38175
15431 -38175 -33172 -31850 -19472 -2880 915 662 -7391 -15290 -20411 -22164 -16591 -6363 12241 15052
15417 15052 -199 12543 3995 -5631 -14635 -21556 -14812 -115 5329 13230 3383 -53 17939
15404 17939 3433 -17425 -25964 -23618 -31136 -24546 -3565 4651 4260 -9017 -6333 5739 2664
15391 2664 -1283 242 1513 907 -7707 -17732 -12524 -11585 -21268 -32650 -24936 -11103 16987 19527
15377 19527 9623 6603 -4334 -11128 -1434 7603 1196 -1312 -6188 -7572 -14783 -33983 -44940 -39349
15363 -39349 -19190 -15029 -20428 -26825 -14637 1621 9333 3700 -15607 -22870 -22416 -13292 -14883 -5130
15349e130J2893m723j2178l94J5382J037q597o59Q20K571J608m642m674J08M085
15334b493R642k511n460J329L561N267j972J4762n110l6396l271J5331O291k132
15320c162Q036l118O642j7043q429J4820L354m260P631q758q793J803N743j26
15306e660L293K584r932M466L494q256k262k683M351l325m99Q558P304J009k395
15291D7m687o679j39l467O139N028O57n649r43L701P420J0000r92j193p699j8047
15275a6503q160M355P939L247J1422l151o414j9440O076J1266J0716j07j0670
15262i424o292l263J0852J028j0292j062R35N556P046R65J0097J2120j1329p801
15248h64j31n355o847q403J0687J231J409P572J1200o226j0578N54n340l233O280
$$ plain form
15349 -5130 7763 3040 -9138 -9532 5850 6887 -1710 -2369 -1549 1022 2630 -2012 -6686 -6578 -2493
15334 -2493 7149 4638 -822 507 4068 9335 7363 22125 17015 -19381 -22652 -7321 -1030 -3162
15320 -3162 4874 1756 8398 -8645 -17074 -2254 1100 -3160 4471 -4287 -13080 -11277 -5534 -5660
15306 -5660 -2367 217 -9715 -5249 -1755 -10011 -12273 -14956 -10605 -13930 -14429 -5871 1433 2442 47
15291 47 -4640 -11319 -11458 -14925 -8786 -3758 -3101 -8750 -9693 -5992 1428 11428 10436 9243 1544 -16503
15275 -16503 -24663 -20308 -12369 -9122 2300 -851 -7265 -26705 -20629 -9363 1353 1246 -9424
15262 -9424 -15716 -18979 -8127 -7099 -17391 -18453 -17518 -11962 -4916 -3951 6146 18266 6937 -864
15248 -864 -995 -6350 -13197 -21600 -10913 -9682 -8273 -701 10499 4273 -6305 -5751 -11091 -14324 -8044
15233h044J6938j0917q295j440m527J634J0425j446R396K015N01q996k405p8N693
15218D54O706J0266M788p869m174j6480j0448j923l468p74Q854O028j7234j6064
15204d1338J3166J6241M640P954k83J321p944n413o550r225N134J789k377O129
15190a6756J0043P241p190q652j1445P322N339J2778N231K783J568k717k461K587
15176E671q560j0433n879m260j066J797O452Q19k298R62J20M213K772r52N216
15161e426L179l507K565P509q445p836n730m285K732R527J5623j176l227J386
15147B889R7Q80M323R09q83k602R911j447o642J0917r794j5565R24P70o461l402
15131a5176J125N497J114n879J235J3956j3401q176P493j718R824P546R860j5606
$$ plain form
15233 -8044 8894 -2023 -10318 -11758 -16285 -14651 -4226 -5672 3724 5739 6240 -2756 -5161 -5239 454
15218 454 7160 17426 22214 14345 10171 -6309 -16757 -18680 -22148 -22922 -14068 -8040 -25274 -41338
15204 -41338 -28172 -11931 -7291 663 380 1701 -6243 -11656 -18206 -27431 -22297 -20508 -22885 -16756
15190 -16756 -6713 528 -6662 -15314 -26759 -19437 -14098 -1320 3911 6694 8262 5545 3084 5671
15176 5671 -2889 -13322 -19201 -23461 -24527 -22730 -16278 -15459 -17757 -16795 -16675 -12462 -9690 -10642 -5426
15161 -5426 -2247 -5754 -3189 4320 -4125 -11961 -17691 -21976 -19244 -9717 5906 4730 1503 2889
15147 2889 2986 3866 8189 9098 8215 5613 15524 14077 7435 18352 8558 -7007 -6083 -5313 -11774 -15176
15131 -15176 -14051 -8554 -7440 -13319 -12084 1872 -11529 -19705 -12212 -13930 -4106 3440 13300 -2306
15117b306q625L214J1324n253K292J6788J1750l020m046K787r374j0837O666R177
15103B0537k269l032k854l842j5828o652J3516Q72o3L226l632j0199o291l707
15089b0218K618J2387J1602P265o362n739n878j2644j64J0340J5288M516r599
15076C412L241L90r33K723J065j3316q155k130j024L367N025M460k092j3228j062
15061a8257N183j3013N85J1287J3331l138n384p153n255j0343Q592R612p785l52
15047b2090P848N765N525n242j1908r730J5760k242Q577J3694j401M130P611K222
15033A8519j5746l194J7560l499n788K503o984O37L260M210l308j517j0773j2216
15019a6336J511M650N70j828q186o506q245J0230O154O293k745J1574L888j2910
$$ plain form
15117 -2306 -10931 -7717 3607 -1646 646 17434 29184 26164 22118 24905 15531 4694 11360 20537
15103 20537 18268 15236 12382 8540 -7288 -13940 -424 448 385 3611 -21 -10220 -16511 -20218
15089 -20218 -17600 -5213 6389 13654 7292 1553 -4325 -16969 -17133 -6793 8495 13011 3412
15076 3412 6653 7043 6110 8833 9898 -3418 -11573 -13703 -14727 -11360 -6335 -1875 -3967 -17195 -18257
15061 -18257 -13074 -26087 -25502 -14215 -884 -4022 -9406 -16559 -21814 -32157 -23565 -13953 -21738 -22090
15047 -22090 -14242 -8477 -2952 -8194 -20102 -29832 -14072 -16314 -7737 5957 4556 8686 16297 18519
15033 18519 2773 -421 17139 13640 7852 10355 3371 4008 7268 11478 8170 6653 -4120 -16336
15019 -16336 -14825 -10175 -9605 -11433 -19619 -26125 -34370 -24140 -17986 -11693 -14438 -2864 1024 -11886
15005a1886O436o254o08o826o48j334J2242L407J1310J0988K517L344M498j626
14991B5560q8q107m551m897j4933Q510M347J3205M675o556P910j844j3744p219
14977B268k708Q926P492n670q543j6119l473k102R251J0127K3742o650j3946j4268
14963a1673K694n451j0132O926J5303L721j2006k1921j2012N408Q561R912Q62
14950a9808K447o207l896J5485O174j3543q162P057J2386Q441m2m315j4717j0404
14936b9104J9145J4636j1283j757O990J795j0057m489m387P303K399K96r388k386
14922b0287K015R431J5069k320o170p165J2872o756K815m587k177J734j1069k928
14908a9523K030o463o053L21R426J1917l274L56j1524L687J2766J832O28q012
$$ plain form
15005 -11886 -5450 -11704 -12312 -19138 -19786 -21120 -8878 -5471 5839 16827 19344 22688 27186 25560
14991 25560 25472 17365 12814 7917 -7016 1494 5841 19046 23721 17165 25075 23231 9487 2268
14977 2268 -440 8486 15978 10308 1765 -14354 -17827 -19929 -10678 -551 23191 16541 2595 -11673
14963 -11673 -8979 -14430 -24562 -17636 -2333 1388 -10618 -32539 -44551 -39143 -30582 -20670 -19808
14950 -19808 -17361 -23568 -27464 -11979 -5805 -19348 -27510 -20453 -8067 374 332 -3983 -18700 -29104
14936 -29104 -9959 4677 -6606 -8363 -1373 422 -9635 -14124 -18511 -11208 -8809 -8513 -17901 -20287
14922 -20287 -18272 -8841 6228 3908 -2262 -9427 3445 -3311 -496 -5083 -7260 -5526 -16595 -19523
14908 -19523 -17493 -23956 -30009 -29688 -20262 -8345 -11619 -11263 -22787 -19100 -6334 -4502 -3874 -11886
14894a1886N465J1698k764j2071M886J1576j0482j227J1737N750q115r289j876
14881f598l517n946j328p88J3868P570j767j1182J0846m329k269L072J0942Q26
14867I400q394P323K496p920l579m06o5J80q021M584N474N233P55l0946q605o768
14851c9259J5069K4426J5941P232N01j0631K993L19m288j2617Q924L029N232o973
14837I898j1937k286K592o982n502N05O163L321M589O582M043j1436o627q792
14823a5869q278L423r93M793K530l237O83Q235K2820k559j4293J335J0173L458
14809A2221Q30J920m681J814j5061j2884R10j960m476k575J6414L321P530O841
14795A0164J1424r570k1379p661J003N134j0459q094J1048m338M71P087P24J4861
$$ plain form
14894 -11886 -6421 5277 2513 -9558 -4672 6904 -3578 -4805 6932 12682 4567 -4722 -6598
14881 -6598 -10115 -16061 -17389 -18177 -4309 3261 1494 -9688 1158 -3171 -5440 -2368 8574 9400
14867 9400 1006 8329 10825 2905 -674 -1080 -1145 -965 -8986 -4402 1072 6305 7060 -23886 -32491 -39259
14851 -39259 -24190 236 16177 23409 23910 13279 16272 16591 12303 -314 8610 11639 16871 9898
14837 9898 -2039 -4325 -1733 -8715 -14217 -13712 -7549 -4228 361 6943 10986 -450 -7077 -15869
14823 -15869 -24147 -20724 -21717 -16924 -14394 -17631 -16948 -8713 14107 11548 -2745 -1410 8763 12221
14809 12221 13051 14971 10290 12104 -2957 -15841 -14931 -16891 -21367 -23942 -7528 -4207 3323 10164
14795 10164 21588 12018 -9361 -17022 -16019 -10885 -21344 -29438 -18390 -22728 -22257 -15170 -14446 415
14781D15J4550o890j0076l94m165K998J0099k107j2691N67J0546j0471j4473j751
14767b3843K026O680l656J0410P901l90K984k151j5235l008P178O87j349K95j1951
14752b3422j079l35j746J0907n084L307p148m009M976J0687J780j5770j2400j2763
14738e2099O748J0372M465p67K0301J2551o074j3182k366R083O798j7220m921
14725b6311J5532k52k1256J7603K2414N491K021j0182J888l304q866o79k130N584
14711b447k685K745l11Q627J0276p81n908o692N770J650j2539p693J0122N317
14697E451j201k0521p155L873M681J3670j027L367J4559m762j7197o542k252q450
14683b3506J235Q987M616Q922n240l4j26p408k865J858O272J2875p720P474R741
$$ plain form
14781 415 14965 8075 -2001 -2395 -6560 -3562 6537 4430 -8261 -7694 2852 -7619 -22092 -23843
14767 -23843 -21817 -15137 -18793 -8383 -482 -872 2112 -39 -15274 -18282 -11104 -10417 -11766 -11471 -23422
14752 -23422 -24501 -24836 -26582 -15675 -20759 -17452 -24600 -28609 -23633 -12946 -11166 -26936 -39336 -52099
14738 -52099 -45351 -34979 -30514 -31281 -10980 1571 -4503 -17685 -20051 -10968 -4170 -21390 -26311
14725 -26311 -10779 -11031 -32287 -14684 7730 13221 15242 5060 6948 3644 -5222 -5901 -8031 -2447
14711 -2447 -5132 -2387 -2698 5929 16205 15424 9516 2824 8594 10244 -2295 -9988 134 5451
14697 5451 4250 -16271 -23426 -19553 -14872 -1202 -2229 1138 15697 10935 -6262 -12804 -15056 -23506
14683 -23506 -22271 -13284 -8668 254 -4986 -5020 -5146 -12554 -15419 -13561 -7289 5586 -2134 5340 15081
14668A5081p638n253K128k529j1532o19M119K051K98K565l38k060M156n85j1185
14653a1341J0771J101M010m822j3271K106J1950m463o818q672J113P157N258m401
14639a0322o456j477J0556N328j842l565m755l322j283O039j0776n162O86L341
14625b3010Q019k548l837Q782L48k859P044m665q308Q77l446q79J0329J2777k785
14610d161K705J3942m396j3368p293J2375K3856m39q138r733J57q880q393K3425
14596A1659J1618j4031l048j579m46K847j1368q880Q982M414q429k035n548J6377
14582E33r59Q044M516j0667O454J245j3756K341M607J186J09j0823n288J0640
14568a818N355j050k294J1642j2913j8161j545J2342n43P0J3856M345j105K016
$$ plain form
14668 15081 7443 2190 4318 1789 -9743 -10362 -6243 -4192 -3894 -1329 -1667 -3727 429 -156 -11341
14653 -11341 -570 531 4541 -281 -13552 -11446 504 -3959 -10777 -19449 -18336 -11179 -5921 -10322
14639 -10322 -16778 -18255 -7699 -2371 -4213 -7778 -12533 -15855 -17138 -11099 -21875 -27037 -26351 -23010
14625 -23010 -14991 -17539 -21376 -12594 -12246 -15105 -8061 -12726 -21034 -20157 -23603 -24482 -14153 -1376 -4161
14610 -4161 -1456 12486 8090 -5278 -12571 -196 23660 23221 15083 5350 5507 -3373 -11766 11659
14596 11659 23277 9246 6198 4619 4173 7020 -4348 -13228 -4246 168 -8261 -10296 -15844 533
14582 533 -426 7618 12134 1467 7921 9166 -4590 -2249 2358 3544 3653 -7170 -12458 -1818
14568 -1818 3537 2487 193 11835 -1078 -19239 -20784 -8442 -8985 -8915 4941 9286 8181 10197
14554A0197k620m986M060p691j4544p628j352j696P418J5003o614m955j617p369
14540b4394j835K112M257J0003L123k716L53J659J563m280R91J6506O48Q37p06
14525H121j8196l869j531J1852n001K224R100K060n171m161o002P869M973K693
14511D961k526q316R892k101k845q12m901m441l362K984K371p202p948j313J3155
14496a2404j87j734j303J1545J3769j311j5891N491M951n164J183k564M804J17
14482A302M736R058j536P154Q584J300j7470m824J755K153j1220J380q540j433
14468g601L004O75J3393o573j5191q997P745O509J5874k289K610l620j956p120
14454c537k93j8788n528K036R361N040J0148l050r145n306j2857P641J453N325
$$ plain form
14554 10197 7577 2591 6651 -1040 -15584 -23212 -24564 -26260 -18842 -3839 -10453 -15408 -17025 -24394
14540 -24394 -26229 -24117 -19860 -9857 -6734 -9450 -9097 -7438 -5875 -10155 -9164 7342 7990 8827 8121
14525 8121 -10075 -13944 -15475 -3623 -8624 -6400 2700 4760 -411 -4572 -10574 -2705 2268 4961
14511 4961 2435 -5881 4011 1910 -935 -1747 -6648 -11089 -14451 -11467 -9096 -16298 -24246 -25559 -12404
14496 -12404 -12591 -14325 -15628 -4083 9686 8375 -7516 -2025 2926 -2238 -1055 -3619 1185 1302
14482 1302 6038 15096 13560 20714 29298 30598 13128 8304 10059 12212 992 2372 -6168 -7601
14468 -7601 -4597 -3922 9471 2898 -12293 -21290 -13545 -7036 8838 6549 9159 5539 3583 -3537
14454 -3537 -3830 -22618 -28146 -26110 -16749 -11709 -1561 -4611 -13756 -19062 -31919 -24278 -22825 -17500
14440a7500O158N522L209m85K412j0124M234O848r77l882R46J5862L095k294j0476
14425B548j2303p602J770J2143j2918j4449j365l927J2059Q210q766J73J050J657
14411b1720o507R78J737J81O011J6689M945k455L670L936q264K213R843J233j2613
14396a23j627J2461o965j3763J140m927j9260q487J3753J2811J4536J7034m446
14383A2137l387L383p145l908q834P90j478R09M176R622j2973n255K518K684J6539
14368I778l565j0534j059p530M412O053N159R73n952j206M575m936p683L211Q142
14353a62J446J702J1734q28j655j3443j4461K770P883J4237k464j1465n585J1344
14339A053R634J414k5394m217n003q221j1163q218R448K1513O847l940J0267J0616
$$ plain form
14440 -17500 -11342 -5820 -2611 -3096 -684 -10808 -6574 274 -703 -4585 -3639 12223 15318 13024 2548
14425 2548 -9755 -17357 -15587 -3444 -16362 -30811 -32176 -36103 -24044 -15834 -24600 -24427 -23377 -21720
14411 -21720 -28227 -27249 -25512 -25331 -19320 -2631 2314 -141 3529 7465 -799 1414 11257 12490 -123
14396 -123 -1750 10711 3746 -10017 -8877 -13804 -33064 -41551 -27798 -14987 -451 16583 12137
14383 12137 8750 12133 4988 1080 -7754 -6964 -8442 -7533 -3357 6265 -6708 -11963 -9445 -6761 9778
14368 9778 6213 -4321 -5380 -12910 -8498 -2445 2714 3687 -2265 -3471 1104 -3832 -11515 -8304 -162
14353 -162 1284 2986 14720 13892 12237 -1206 -15667 -12897 -5014 9223 6759 -4706 -10291 1053
14339 1053 10687 12101 -13293 -17510 -22513 -30734 -41897 -50115 -40667 -19154 -12307 -16247 -5980 4636
14325D636j098L764K877O782j9672k1912Q658M899R339n956j931M493m660L68
14311i413P528J4668j5125r619q408J0202J0268L36M225j1103q107J056j2117
14298b5609k632J2188p693l862J0941J3737J0600n672j0539Q413L112n174j1453
14285a3643j369Q4M954K436J6863P32j2027K686J02m046J2516J1331r95n697j0538
14270C389n116k891L674j212N279o480j2274Q151M584O36J0216k2480p575P205
14256a4894J379Q387K554p378K796P602N447J277j8338r661P655M835m493M638
14242h194M381K214j338R858N194k956k609Q164j1401l75l246n867J288R428q988
14227d447J32K946M190m285n436o475L223n391M81J2052P173L574l253r155R683
$$ plain form
14325 4636 3538 7302 10179 16961 -2711 -24623 -15965 -11066 -1727 -7683 -9614 -5121 -9781 -9413
14311 -9413 -1885 12783 -2342 -11961 -20369 -10167 101 437 4662 -6441 -14548 -13492 -25609
14298 -25609 -28241 -16053 -23746 -27608 -16667 -2930 7670 1998 -8541 -128 2984 -2190 -13643
14285 -13643 -15012 -14928 -9974 -7538 9325 10057 -1970 716 818 -3228 9288 20619 19624 13927 3389
14270 3389 -1727 -4618 -944 -2156 3123 -3357 -15631 -7480 -2896 -2260 7956 -14524 -22099 -14894
14256 -14894 -13515 -5128 -2574 -9952 -7156 446 5893 7170 -11168 -20829 -13174 -8339 -12832 -8194
14242 -8194 -3813 -1599 -2937 6921 12115 9159 6550 14714 3313 2938 -308 -6175 -4887 4541 -4447
14227 -4447 -4315 -1369 2821 -1464 -6900 -13375 -10152 -15543 -15062 -3010 4163 7737 4484 -4671 5012
14212E012K0973P3o101j7542r193N876L932l683l821K966L993R352J1585j1276
14198A2146q510M836k240p771n200Q977j463K835N649N093L698Q501j015O910
14184C2446q518j6702q145J2919j49j493j8212k731K571k385Q445Q348K884K461
14170A1739O261r03l236o279j186n088R90N419j421J861n419o090q484J911m928
14155a4853P025k574J0695m43O222R817J614N199J2260q41j6142j0847j7099K754
14141g213l966l733J464k371O005J0972K433L548p958J2323r630K829J1355j0958
14127E100j3369k627L641J781O580O988M690k303p096N243k01Q42l09o771j2557
14112a0368m331J0811N735J0492R339m069j9273r655j1334J905N801n443j04J4989
$$ plain form
14212 5012 25985 26058 19957 2415 -6778 -902 3030 -653 -4474 -1508 2485 11837 23422 12146
14198 12146 3636 8472 6232 -1539 -6739 2238 775 3610 9259 14352 18050 26551 25536 32446
14184 32446 23928 7226 -919 12000 11851 10358 -7854 -10585 -8014 -10399 -1954 6394 9278 11739
14170 11739 18000 17097 13861 7582 6396 1308 2298 7717 6296 8157 2738 -3352 -11836 -9925 -14853
14155 -14853 -7828 -10402 293 -150 6072 15889 17503 22702 34962 34121 17979 7132 -9967 -7213
14141 -7213 -11179 -14912 -13448 -15819 -9814 1158 3591 7139 -819 11504 1874 4703 16058 5100
14127 5100 -8269 -10896 -7255 -5474 1106 8094 12784 10481 3385 8628 8427 9269 8960 2189 -10368
14112 -10368 -14699 -3888 1847 12339 21678 17609 -1664 -11319 -22653 -20748 -14947 -20390 -20494 -5505
14098e505M655L633j0320k3756j668O634L506m968j915O899J8059N948j1272m044
14084a4114J40m073K079J1662J359o984p184J856J3325R340L810L410p537K372
14070I461r665P85l865k722L944p260J1548K133q975J26Q240j1575M125P073P696
14055A1069j1434j5543k75L789J670l353k111P211O083l650J336J0087m556R424
14041I747p209j1349l226l155J5218K2598j961j5167k7296o411m789J0508J2403
14028a0089N670P425Q471K074O703l209n666k414J808p534M428J1650j688p325
14014A0304N282k71j059K570p344j1259n676N870k163N15K75j3154n550J8402
14000c258K055J2873M815M603o313j686N27k96J1942k856j0271o268M053q530
$$ plain form
14098 -5505 -850 2783 -7537 -31293 -32961 -26327 -22821 -27789 -29704 -22805 -4746 1202 -10070 -14114
14084 -14114 -13974 -18047 -15968 -4306 -2947 -9931 -17115 -15259 -1934 7406 11216 14626 7089 9461
14070 9461 -204 581 -3284 -6006 -2062 -9322 2226 4359 -4616 -4490 3750 -7825 -3700 3373 11069
14055 11069 -365 -15908 -16183 -12394 -10724 -14077 -16188 -8977 -2894 -6544 -5208 4879 323 9747
14041 9747 2538 -8811 -12037 -15192 26 22624 20663 5496 -21800 -28211 -33000 -22492 -10089
14028 -10089 -4419 3006 11477 13551 20254 17045 11379 8965 10773 3239 7667 19317 17629 10304
14014 10304 15586 15315 14256 16826 9482 -1777 -7453 -1583 -3746 -3231 -2956 -16110 -21660 -3258
14000 -3258 -1203 11670 16485 21088 14775 13089 13616 13320 25262 22406 12135 5867 9920 1390
13986A390q633N689N687K228m582j572n78j903j040j002q292M577k72L857J1109
13971F663J3404k841n213r806J0248P687o866M270N908p23j6266o415L059R237
13957A2346J1740l754r827p423J2655Q879M077L326l141j6829j0125r368j037
13944h481j216O924R958N550L77o540o008o411M108O068J1714J276j6081j1873
13930a0635l739K1525j438j4109N452J4674J903m218r979j8338R008J6853J271
13917H230q114Q644j38R984j775k58k118J6934l793j0786j5286n97r417Q912L468
13902C890j4278l919O819J7757k307j4974L822J0111L629L330R172M432l43Q61
13888B8002l610l026j967L453j4739j683O872k050o485r40M790J198J3462o737
$$ plain form
13986 1390 -7243 -1554 4133 6361 1779 207 -371 -2274 -3314 -4316 -12608 -8031 -8303 -4446 6663
13971 6663 20067 17226 12013 2207 12455 20142 13276 17546 23454 22731 6465 50 3109 12346
13957 12346 24086 20332 10505 3082 15737 24616 28693 32019 28878 12049 1924 -7444 -8481
13944 -8481 -9697 -2773 7185 12735 13112 6572 564 -5847 -1739 4329 16043 17319 1238 -10635
13930 -10635 -14374 7151 5713 -8396 -2944 11730 13633 9415 -564 -18902 -9894 6959 8230
13917 8230 116 8760 8622 18606 16831 16573 14455 31389 27596 16810 1524 927 -8490 422 3890
13902 3890 -10388 -14307 -7488 10269 7962 -7012 -3190 6921 10550 13880 23052 27484 27141 28002
13888 28002 24392 21366 19399 22852 8113 6430 13302 11252 4767 3827 8617 9815 23277 16540
13874A6540j04m454n120J0393J027j0391l715r635q389J213k051M400l595o137
13860b0018L459R236J4513J3510L826O170j2470L489j058j1765k2851L789N903
13847d267lP116k064P709M274o430m792o867J106j1381N553K802J1844j0236p007
13832a2643P602R169N737j4540j2515J4786P091j2792m980J3811J0925p99r316
13819A536o541N966K002k041J9028J3405j5852k168J517J299j384l193j4596N961
13805D939O618l594q558N646m333J588O479k972m06l849n444o17J3300J544l16
13790A0025l849k952n035J3695M384k928j0762o177p661N625J9879J36J136J014
13776A6530O90r522j316L420j1951j3211r853j1179K669o664M883J9291M080j030
$$ plain form
13874 16540 16436 11982 6862 17255 18282 7891 4176 -5459 -13848 -12635 -14686 -10286 -13881 -20018
13860 -20018 -16559 -7323 7190 20700 24526 30696 18226 21715 20657 8892 -13959 -10170 -4267
13847 -4267 -4270 2846 782 8491 12765 6335 1543 -5324 -4218 -15599 -10046 -7244 4600 -5636 -12643
13832 -12643 -5041 4128 9865 -4675 -17190 -2404 4687 -8105 -13085 726 11651 10852 1536
13819 1536 -5005 961 2963 922 19950 33355 17503 15335 16852 18151 16767 13574 -1022 4939
13805 4939 11557 7963 -595 5051 718 2306 8785 5813 5407 1558 -3886 -4503 8797 10341 10025
13790 10025 6176 3224 -1811 11884 16268 13340 2578 -3599 -11260 -5635 14244 14380 15516 16530
13776 16530 17220 7698 6382 9802 -2149 -15360 -25213 -36392 -33723 -40387 -35504 -16213 -12133 -13163
13762a3163o556p350J2044l327q763J0546J0666q40r17J4713j1767K324Q394J6964
13748B2968P294j554L45R591n184q506j5922l297J731q085l824m219R999j550
13734b13r52J8598k959K052l359K237m723Q441p988J0413J338j419M629J779J049
13719B8923j2792R62j94n261N430J1035j9703j2137M15J4726J0025k325N421L426
13705B7951j858J914L558q43k141L371N812n591M695M910o879k96J3464n085m123
13690C8859r495j5876o736Q435K568M20o257m641q59n663k57Q286J8346r419r050
13675H661l532k033l878L786L773j725n623n232K696P480M696K970N218L853k0068
13660A042p126J555L411Q002P073O119J9037N453m915n770j1748j4858n507j0437
$$ plain form
13762 -13163 -19719 -27069 -15025 -18352 -27115 -16569 -5903 -6743 -7660 7053 -4714 -2390 6004 22968
13748 22968 30262 28708 29053 38644 33460 24954 9032 5735 7466 -619 -4443 -8662 1337 -213
13734 -213 -1165 17433 14474 16526 13167 15404 10681 19122 11134 21547 22885 21466 26095 27874 28923
13719 28923 16131 17093 16899 11638 17068 28103 8400 -3737 -3322 11404 21429 19104 24525 27951
13705 27951 26093 28007 31565 30722 28581 31952 37764 32173 36868 41778 34899 34603 48067 42982 38859
13690 38859 29364 13488 6752 15187 17755 18175 11918 7277 6418 755 498 8784 27130 17711 8661
13675 8661 5129 3096 -782 3004 6777 5052 -571 -5803 -3107 4373 9069 12039 17257 21110 1042
13660 1042 -6084 -4529 -1118 6884 13957 20076 39113 44566 39651 33881 22133 7275 1768 -8669
13646h669P306N162P507J2522j733m30p282j4562J678M969L172j400L818M247
13632A6305m87L658j0850p065J2278N459P710j983l199O038j0963j7069n475k468
13618h111K651J0716K803M873j5289K886n095j2306J1881J4390J1212J666J196
13605B3473K772J895j1817K453Q632M988j4836p77L99J25j6074K84J3481n910
13591I088p358Q624N906J311P950R240r516j4307q062J01Q43l262P774P054J0700
13576B6086J6337R980K901p150j6788n70l718p044N612R328l685m5r461k4025
13562b242j9600J0036J2241L027j4102q714M838P709J2366R063R363L584q150
13549A9419k600J133R318qm352j727N723L190M332J2425l925m100j0172j744j5113
$$ plain form
13646 -8669 -1363 3799 11306 23828 22095 21665 14383 -179 1499 6468 9640 8240 12058 16305
13632 16305 15818 19476 8626 1561 13839 19298 27008 25025 21826 27864 16901 -168 -5643 -8111
13618 -8111 -5460 5256 8059 12932 -2357 529 -4566 -16872 -4991 9399 20611 22277 23473
13605 23473 26245 28140 16323 18776 27408 32396 17560 16783 17182 17307 1233 1517 14998 9088
13591 9088 1730 10354 16260 17571 25521 34761 25245 10938 2876 2977 3820 558 8332 15386 26086
13576 26086 42423 52403 55304 48154 31366 30796 27078 20034 25646 34974 31289 31244 21783 -2242
13562 -2242 -21842 -11806 435 3462 -10640 -19354 -14516 -6807 5559 14622 23985 27569 19419
13549 19419 16819 17952 27270 27262 22910 21183 26906 30096 34428 46853 42928 38828 28656 26912 11799
13534A1799r668k298L316M877R193J190Q55J664l701O734Q116L202j6089k783
13520A6407R093J4327o539N12J1741k340p553J371Q165O821K737n942r738p667
13506C1395j7749k969j294P382R095N571j3250j5160J5222N581J071L574m162
13493B4307j2333R958J5194O970o709R709O641o87n487j3326K100l721r796Q18
13479B3638L288J3907J1724K086j1279k426J4947L004o954M43k32K995q470L009
13465D9680k484n090j4321l109R733N283j056J1241K858k136L396P926J5722M29
13451G8072Q71J4232j757j9195l302q077j4816j2589k288P638J743p414j0896
13438B2222N048K4804J4737J0147n113j6511L37Q587k476o19R116J2422K12o057
$$ plain form
13534 11799 2131 -167 3149 8026 17219 18409 19264 20928 17227 23961 32077 35279 19190 16407
13520 16407 25500 39827 33288 33800 45541 43201 35648 37019 45184 52005 54742 48800 39062 31395
13506 31395 13646 10677 9383 16765 25860 31431 18181 3021 18243 23824 24895 28469 24307
13493 24307 11974 21932 37126 44096 37387 47096 53737 53050 47563 34237 36337 32616 22820 23638
13479 23638 26926 40833 52557 54643 43364 40938 55885 58889 51935 52378 52146 55141 46671 49680
13465 49680 47196 42106 27785 24676 34409 39692 38636 49877 52735 50599 53995 61921 77643 78072
13451 78072 78943 93175 91418 72223 68921 60844 46028 33439 31151 38789 40532 33118 22222
13438 22222 27270 52074 66811 76958 71845 55334 55671 64258 61782 61163 70279 82701 82913 76856
13424G6856k6226p709M350K812l144o141p959P796Q910o074N022q74n460q186
13410C3973Q36N446L394R169m868q73J319L584Q946q510r344l632J5071k513r70
13395E1028P343P14k697o537j7353j0116N233K5703R36j4956j571J5253o439p201
13381C9340K612K2211O041P160m911k4122j4363m350m526Q823J7178n508p380
13368C8205q577J5090J6296P156k914l0086j3005J7131O401j593j076N74Q218
13355E1820L566k200l678j811N7N706O037M585p162j0763k936l596p366J617n439
13340B8437K409J7336Q047L718l208N052J4210N490l594j4007k71k500J801j5647
13326D7273K190O367O552K785m975J2222J1795K538J73p366j1143O109J3067Q531
$$ plain form
13424 76856 50630 42921 47271 50083 46939 40798 32839 40635 49545 43471 48493 47619 42159 33973
13410 33973 34809 40255 43649 52818 47950 47077 48396 51980 60926 52416 43072 39440 54511 51998 51028
13395 51028 58371 59085 56388 49851 32498 22382 27615 53318 54254 39298 37727 52980 46541 39340
13381 39340 41952 64163 70204 77364 72453 48331 33968 29618 25092 33915 51093 45585 38205
13368 38205 29628 44718 61014 68170 65256 35170 22165 39296 45697 44104 43028 43602 51820
13355 51820 55386 53186 49508 47697 47754 53460 59497 64082 56920 46157 43221 39625 32259 33876 28437
13340 28437 30846 48182 56229 59947 56739 61791 76001 81491 77897 63890 63619 61119 62920 47273
13326 47273 49463 55830 62382 65167 60192 72414 84209 86747 86920 79554 68411 74520 87587 96118
13312I6118q253j2860p920j0369q64N055J7096m043p254Q348Q804q156k2232k078
13298E1392l55M118J852p70K5266K852o985J608j187j881q283k000j009L188P363
13283G5169N776M525j424o43J2853r9k759j4546n96K783q530n144o94K991O456
13268G6118l406o967o657N127J5450K8627J1469p643p606q174R110J0788K0806
13255A37042l185R330K3195K4356J3861P848K7077L8868O6118R8933J32151J56248
13243G31842J70055J52630J07429Q3894R0899R5588J83392K44918J98651K236
13233B061534k22877l06137k60765k31116j93974j28792j03991q5621n6092m2042
13223D30127m4985k0312l8100k6062k9537k1043j0023j9627j2012n376K052j5174
$$ plain form
13312 96118 87865 75005 67085 56716 55852 60907 78003 73960 66706 75054 83858 75702 53470 51392
13298 51392 51037 55155 57007 56237 81503 84355 77370 78978 77791 75910 67627 65627 64618 67806 75169
13283 75169 80945 85470 84046 83403 96256 96157 93398 78852 78256 81039 72509 67365 66671 69662 76118
13268 76118 72712 65745 59088 64215 79665 108292 119761 112118 104512 96338 105448 116236 137042
13255 137042 133857 143187 166382 190738 204599 212447 239524 278392 344510 443443 575594 731842
13243 731842 901897 1054527 1161956 1245850 1336749 1432337 1615729 1860647 2059298 2061534
13233 2061534 1838657 1532520 1271755 1040639 846665 717873 613882 528261 472169 430127
13223 430127 385142 364830 326730 300668 271131 250088 240065 220438 208426 203050 205102 189928
13211A89928j120j0096k0490j6411o985m502N043J0084k456n489l971n395r807
13198A18333k146N467n065j4501J0750N446j0459J203k465n011N54J6815L805
13185A22726p832k1088j111m92j0304L762O226J8080M056J506n680L43K9390K4848
13171A64430L718K3611L14r740P557j2153o665j0173l0932k6120j2996p274K16
13158H3793j513J220k747K231n866j7418L942P654J1510M90P44J2972o565m847
13144H5600q008k883L447j6217M571o93J1431R879J1776P465K487J2591k303j2618
13130A06525p416J2017j825Q960m447j2837M152n804q10k179P515O774R170l206
13116A16589q815k742m483j191M869J9629J5406j6110k327m881j1048M062K724
$$ plain form
13211 189928 188808 178712 158222 141811 134826 130324 135367 145451 142995 137506 133535 128140 118333
13198 118333 116187 121654 116589 102088 112838 118284 107825 109028 106563 101552 102106 118921 122726
13185 122726 114894 93806 92695 92203 81899 85661 91887 109967 114023 115529 109849 110192 139582 164430
13171 164430 168148 191759 192073 182333 189890 177737 171072 160899 129967 103847 90851 83577 83793
13158 83793 82280 83500 80753 82984 77118 59700 63642 71296 82806 83296 84040 97012 90447 85600
13144 85600 77592 74709 78156 61939 66510 65817 77248 87127 98903 106368 108855 121446 119143 106525
13130 106525 99109 111126 109301 118261 113814 100977 105129 99325 98515 96336 103851 110625 119795 116589
13116 116589 107774 105032 100549 99358 104227 123856 139262 123152 120825 115944 104896 108958 111682
13103A11682J4256J2534L706j1654O94O202j896J886K375R335P924M32O347r192
13089A54631m55J2410l359j0610J2385n049P391K37j3620k244K725l041J5479
13076A66880j598j402p228j5986j923R712l352N706R976j5130j4468J0780l651
13063A38316j2261n967K64L938l766k0209j0792K0715K0421l62p030j9927L640
13050A06980Q55J4315M284K909o460j9470K052M500O215K8139K0949O948J1661
13037A83877K5581J4780R379L0261J4783J4120K9501k745q141j8626k2923M524
13025B74371P818j4870j6084j6433j4049j7763n763P988L39j0403o597q073q009
13012A72472O620o395p563L333J2286J350j7604l046j731q988L213J1312P029
$$ plain form
13103 111682 125938 138472 142178 130524 131218 137420 135524 137410 139785 149120 157044 157476 163823 154631
13089 154631 154176 166586 163227 152617 165002 159953 167344 167581 153961 151717 154442 151401 166880
13076 166880 165282 163880 156652 140666 138743 148455 145103 150809 160785 145655 131187 141967 138316
13063 138316 126055 120088 120352 124290 120524 100315 89523 110238 130659 130297 123267 103340 106980
13050 106980 107835 122150 126434 129343 122883 103413 105465 109965 116180 144319 165268 172216 183877
13037 183877 209458 224238 233617 263878 278661 292781 322282 319537 311396 292770 269847 274371
13025 274371 282189 267319 251235 234802 220753 202990 197227 205215 205554 195151 188554 180481 172472
13012 172472 179092 172697 165134 168467 180753 182103 164499 161453 159722 150734 153947 165259 172288
12999A72288J1026N337l96j1212K381j1933k5114p901P141j681j545P490Q852
12986A54733L017K1198K609k179q607Q226j681l334N461J1320O086j8328j3085
12973A65436k0550k6209k2711k3988l3028k3925p297k4150m2457q6615j24543
12962b70037o5905K6364N6991M6981N3613K8432K8297L7811M3769N1479L1279
12951F9074K2232j0237k895J5697L2369J0717j1931m127J0751N588O851M195J7701
12938A65985J0482q805m031N795q675m260j2548Q346K938N196J2722J8536J2235
12925B03916K841N265J6237N587J0996L368o759K0500J7025L097J9158M8311N5855
12912D05397L6149J8221J0303K8135M3597M6919L0838N243L0987R5631J59121
$$ plain form
12999 172288 183314 188651 188255 177043 179424 167491 142377 134476 141617 139936 138391 145881 154733
12986 154733 157750 178948 181557 179378 170771 178997 177316 173982 179443 190763 196849 178521 165436
12973 165436 144886 118677 95966 71978 38950 15025 7728 -16422 -58879 -145494 -270037
12962 -270037 -335942 -309578 -252587 -205606 -151993 -123561 -95264 -57453 -13684 37795 69074
12951 69074 91306 81069 78174 93871 126240 136957 125026 120899 131650 137238 144089 148284 165985
12938 165985 176467 167662 163631 169426 160751 156491 143943 152289 155227 160423 173145 191681 203916
12925 203916 206757 212022 228259 233846 244842 248210 241451 261951 278976 282073 301231 349542 405397
12912 405397 441546 459767 470070 498205 541802 588721 619559 624802 655789 751420 910541
12901I10541J23870M1538k0694J2231j0390n3533o9898n9045k6384j3170Q559
12890H43625K4428J0082R43J1753J9924m091j8912j883j761p14R141m017o178
12877H82340j4421j7184k6697l8339k8009j4625o892k943J0061j5985p620q182
12865G11504O33p069l0055j6282o039j2138j9043O725L6810L0421L6639N7200
12853G89306K9371L2556K8254J1917K3600L2347J4547K4329L3369K1627J1776
12842A052999r382M57J9222M2054N8080K9546J4658K8282M3433K4476K4920L2075
12830A360820K3506K5422K0341J1988J1840K3899L5252K8199K1539J3715N3181
12819A629702Q8899J15076Q8538Q8704J01504J08962J58899J80073J92571J93647
$$ plain form
12901 910541 1034411 1075949 1055255 1067486 1057096 1003563 933665 874620 848236 835066 843625
12890 843625 868053 878135 879078 890831 910755 906664 887752 885869 884108 883394 892535 888518 882340
12877 882340 867919 850735 824038 785699 757690 743065 736173 733230 743291 727306 719686 711504
12865 711504 712137 705068 675013 658731 652692 640554 621511 628236 665046 695467 732106 789306
12853 789306 818677 851233 879487 891404 915004 947351 961898 986227 1019596 1041223 1052999
12842 1052999 1043617 1044074 1063296 1105350 1163430 1192976 1207634 1235916 1279349 1303825 1328745 1360820
12830 1360820 1384326 1409748 1430089 1442077 1453917 1477816 1513068 1541267 1562806 1576521 1629702
12819 1629702 1718601 1833677 1922215 2010919 2112423 2221385 2380284 2560357 2752928 2946575
12809B946575K08366K32664K74531L20048L50429M08290M75494N28985N84667
12800F330049O08287O64578P57325Q60383R87442J113765J245224J438442J722964
12791A5728459K178408K848751L861405N381013P569035J0963675J6053631K2549200
12783H7133577K8023102K9408814K6378121K1095774J4219398J1114121J8560166
12776B35933073L3245191M8013044M6772845J2978879l7601268o2121912n2420960
12769B24798892m2050622l3765091k5670078j9329833j4782136j1538339r131085
12762F8531708p359713o143786n327883m560131l770939l188740k878707k710906
12754C2590903k535405k320137k080402j814244j521987j297137j159539j019968
$$ plain form
12809 2946575 3154941 3387605 3662136 3982184 4332613 4740903 5216397 5745382 6330049
12800 6330049 6938336 7602914 8360239 9220622 10208064 11321829 12567053 14005495 15728459
12791 15728459 17906867 20755618 24617023 29998036 37567071 48530746 64584377 87133577
12783 87133577 115156679 144565493 170943614 192039388 206258786 217372907 235933073
12776 235933073 269178264 317191308 363964153 376943032 339341764 277219852 224798892
12769 224798892 182748270 148983179 123313101 103983268 89201132 77662793 68531708
12762 68531708 61171995 55028209 49700326 45140195 41369256 38180516 35301809 32590903
12754 32590903 30055498 27735361 25654959 23840715 22318728 21021591 19862052 18842084
12746A8842084q95021p90486o77566n86650n45504n22178n24443n19829n35273
12737A3245134n34432n08106m69763m27093l83518l96387l88596l76312l69297
12728I391630l52527l30498l16541l13656l02715k76437k44654k46971k70099
12719F737532k66321k40771j98056j81285j60629j47977j52505j22892j09405
12710E157691j23231j36300j02535j18247j45610j38919j37766j38842j17376
12701C998865r6867r3906q7082r4275o9423o8093o8638o6637q0264o1602m4485
12690C167593o6722q0032p8447q7002r4151p7746q6942r3386o5550n6075n5106
12679B326434m2618n8227p7130p7036q1433j00366j17741j10916r6519j24245
$$ plain form
12746 18842084 17947063 17156577 16479011 15892361 15346857 14824679 14300236 13780407 13245134
12737 13245134 12710702 12202596 11732833 11305740 10922222 10525835 10137239 9760927 9391630
12728 9391630 9039103 8708605 8392064 8078408 7775693 7499256 7254602 7007631 6737532
12719 6737532 6471211 6230440 6032384 5851099 5690470 5542493 5389988 5267096 5157691
12710 5157691 5034460 4898160 4795625 4677378 4531768 4392849 4255083 4116241 3998865
12701 3998865 3901998 3808092 3721010 3626735 3557312 3489219 3420581 3353944 3273680 3212078 3167593
12690 3167593 3100871 3020839 2942392 2855390 2761239 2683493 2596551 2503165 2437615 2381540 2326434
12679 2326434 2283816 2225589 2148459 2071423 1989990 1889624 1771883 1660967 1564448 1440203
12669A440203j19547r7765o9420n0737l4092m3836m7661l0589j4235l986k0426
12658I07909m113Q050j2964j3364J2898M0179K8560J4331J8836J0280L6381N0333
12646A097316L5617j8255o0179p2043k0186J042m847q154r413j4510k4841j6664
12634H84883j2826k2334j3650j7474l4432k6871k1783j6028j7593k7474j2922
12623F61496L074n540M746j4889j1955q553j4136j3754j2948j572o531j9563q345
12610E51530r315j0489l413J940N753r328k734r676p725r94K0424K4037l476K4305
12596E70839K6201K7279K8186M6175N3218N0312J2985m348O870K8651L0854J1233
12584H88455n7248j07220j11987r4867n6012l3611l4467m1221l5288l4689j0287
$$ plain form
12669 1440203 1320656 1222891 1153471 1102734 1068642 1024806 977145 946556 932321 928335 907909
12658 907909 903796 911846 898882 885518 898416 938595 967155 981486 1000322 1010602 1046983 1097316
12646 1097316 1132933 1114678 1054499 982456 962270 963312 958465 950311 940898 926388 901547 884883
12634 884883 872057 849723 836073 818599 784167 757296 735513 719485 701892 674418 661496
12623 661496 664570 659030 663776 648887 636932 628379 614243 600489 587541 585969 579438 559875 551530
12610 551530 542215 531726 528313 530253 536006 526678 523944 514268 506543 505549 525973 550010 546534 570839
12596 570839 597040 624319 652505 698680 751898 802210 815195 810847 817717 846368 877222 888455
12584 888455 831207 723987 612000 517133 461121 427510 393043 351822 316534 281845 271558
12573B71558l5408m2650m8004j2550q000n690k97K6419J1112K1206J2312J8367
12561B08375K7295J6274J4544J7527J4619J2237J867R497K401l348n805k2486
12549B92997p047J7840J5676K7548O835M97Q382m188k2529j1576O951j6116R900
12536C25170J2838R426J8193Q458k407p412q842q537l627J84J1070J0457R990
12523C74961Q848J3984J1883J6986K0432n578J3773Q90L508K8259M4407M9317
12511E81670L7642L2998J7936K4984J6272J707j4523j0649o487k2115j2799M471
12499F51107j3827j2205J3697N382j3956j0935J4407M552j0511k765o219j2449
12487F06278j7054k1539q944j747k425j0586j0127j3864q500j3341l367J526L386
$$ plain form
12573 271558 236150 193500 145496 132946 124946 119256 118959 145378 156490 177696 190008 208375
12561 208375 235670 251944 266488 284015 298634 310871 312738 322235 324636 321288 315483 292997
12549 292997 285950 303790 319466 347014 353849 354346 362728 358540 336011 324435 331386 315270 325170
12536 325170 338008 347434 365627 374085 371678 364266 355424 346887 343260 343444 354514 364971 374961
12523 374961 383809 397793 409676 426662 447094 441516 455289 456179 459687 487946 532353 581670
12511 581670 619312 652310 670246 695230 711502 713209 698686 688037 681550 659435 646636 651107
12499 651107 637280 625075 638772 644154 630198 619263 633670 638222 627711 624946 618727 606278
12487 606278 589224 567685 558741 556994 554569 543983 533856 519992 511492 498151 494784 496310 499696
12474D99696r805j9382n916j0399j9513n572M81M579K2750O917n024K724M029
12461D65565K8384L4702J2556J8709K3282K0755K8761J3044L218O107q044P231
12449F54270K5271K6854J8358R100J4397K0268K0785J9002K0850L1048L7200J0922
12437I08325l161L3315L5479P997J6612K3313K3031L6610K7009M1329M4959M0941
12425A235759P2393O1417O0806Q1608R3499J03627J18207J48734J47914J63013
12415B286977J91569K25459K66697L05893L42602M01711M92424N78921O59125
12406E751378P49095Q58132R78351J151053J351898J625418J982808K490834L187889
12397B0126856M116874N266390O570502P930220R243665J0430548J1491694J2468775
$$ plain form
12474 499696 489891 470509 464593 454194 434681 429109 429590 434169 456919 463836 458812 461536 465565
12461 465565 493949 528651 541207 559916 583198 603953 632714 645758 648976 655083 647039 654270
12449 654270 679541 706395 724753 733853 748250 768518 789303 808305 829155 860203 897403 908325
12437 908325 905164 938479 973958 981955 998567 1021880 1044911 1081521 1108530 1149859 1194818 1235759
12425 1235759 1308152 1369569 1430375 1511983 1605482 1709109 1827316 1976050 2123964 2286977
12415 2286977 2478546 2704005 2970702 3276595 3619197 4020908 4513332 5092253 5751378
12406 5751378 6500473 7358605 8336956 9488009 10839907 12465325 14448133 16938967 20126856
12397 20126856 24243730 29510120 36080622 44010842 53254507 63685055 75176749 87645524
12389H7645524J3378595J4111654J4385888J3889312J2613935J0608841P869280
12382A74503029M308791q4278m861637r255930j2560798j4725173j5839426j5925705
12374A05558873j4996697j3196708j0938241q741833o945025n527833m479754
12367D0732782l746994l215509k832619k550227k318472k110090j930009j771809
12359B0257053j591427j409681j219967j052821r14346p97162o99913o23113n55894
12350A1392729n07059m54137m25332m07088l85032l50183l42081l25165l12831
12341G883821l01032k92442k61164k53485k38844k17246k33086k26603k00032
12332E659887j90324j92556j66017j66640j62576j62728j45043j33494j39782
$$ plain form
12389 87645524 101024119 115135773 129521661 143410973 156024908 166633749 174503029
12382 174503029 178811820 178727542 173865905 164609975 152049177 137324004 121484578 105558873
12374 105558873 90562176 77365468 66427227 57685394 50740369 45212536 40732782
12367 40732782 36985788 33770279 30937660 28387433 26068961 23958871 22028862 20257053
12359 20257053 18665626 17255945 16035978 14983157 14068811 13271649 12571736 11948623 11392729
12350 11392729 10885670 10431533 10006201 9599113 9214081 8863898 8521817 8196652 7883821
12341 7883821 7582789 7290347 7029183 6775698 6536854 6319608 6086522 5859919 5659887
12332 5659887 5469563 5277007 5110990 4944350 4781774 4619046 4474003 4340509 4200727
12323D200727j24986j13592r5875q7679q0549o6068m2216r433J1378M4797O1123
12312C697627M1714L6583K3533O910J4630R7218J70560J61366o071k24416l45317
12301C674337l19983k56517k19091j78728j58890j38833j11128r3649p7372p6724
12291B043422q5198p1016p0450n7871o2986p9614p6958n7667o8872n7901o7268
12280A287621p7335o4381o5226m9463l7566n1380m5000n4097k9074k6623k5819
12269G61657j3975j9225k3544k4467n406k885M655m886J0713j1578r255R293n355
12256F65742L427R795l619K889j2721l0590j0094o181j4450j3935j1144j8725
12244E60394k4600j3084j383p602j6823j2583k1047k1164l81j3707m718j1990
$$ plain form
12323 4200727 4075741 3962149 3866274 3778595 3698046 3631978 3589762 3580329 3591707 3636504 3697627
12312 3697627 3739341 3775924 3799457 3806367 3820997 3918215 4088775 4250141 4244070 4019654 3674337
12301 3674337 3354354 3097837 2878746 2700018 2541128 2402295 2291167 2197518 2120146 2043422
12291 2043422 1958224 1887208 1816758 1758887 1695901 1616287 1539329 1481662 1412790 1354889 1287621
12280 1287621 1210286 1145905 1080679 1031216 993650 942270 897270 843173 814099 787476 761657
12269 761657 747682 728457 704913 680446 675040 672155 676810 671924 682637 671059 661804 671097 665742
12256 665742 669169 678964 675345 678234 665513 634923 624829 618648 604198 590263 579119 560394
12244 560394 535794 522710 521327 513725 496902 484319 463272 442108 441727 428020 423302 411312
12232D11312o936j1684j6240J0733K16m110L587J386L438j0109j7682m110l300
12219C56501K239j1936j0333N831R474R604Q867m74L999k26j620J4603J9248R453
12205D15230J3114L951J6174R532J4047J7898J2252R888P1j1977M460j3401j6532
12192D74707k9429k1976p197k1807j1092k5066m6728k1198l910j2266j6625n425
12180B51988K804J1262M720j0969j5588M404l982J149O317Q922k486m932q943
12167B44666n743K771n924J3669j048r043o673J805L716L158l929p639p798r868
12153B12120j9682l677K0183J5933L418j2167k263n766m189O289N258r483o197
12140A99777K686P837m159N822l086k9041L651J8073M937N406j0925j0220k1693
$$ plain form
12232 411312 404376 392692 376452 387185 387401 383291 386878 388264 391702 381593 363911 359801 356501
12219 356501 358740 346804 336471 342302 351776 361380 370247 369773 373772 373546 371926 386529 405777 415230
12205 415230 428344 432295 448469 458001 472048 489946 502198 512086 512157 500180 504640 491239 474707
12192 474707 445278 423302 416105 394298 383206 358140 311412 290214 286304 274038 257413 251988
12180 251988 254792 266054 270774 259805 244217 248621 244639 245788 252105 261027 258541 253609 244666
12167 244666 238923 241694 235770 249439 248391 239348 232675 234480 238196 241354 237425 229786 221988 212120
12153 212120 192438 188761 208944 224877 228295 216128 213865 208099 203910 210199 215457 205974 199777
12140 199777 202463 210300 206141 211963 208877 179836 183487 201560 206497 211903 200978 190758 169065
12127A69065r308O008R367R37O490J2817j1329j7376J5341J9817l262K406j390
12114A99583j2665m110J684L432l477j9444K109P360o844k467p507M4r499k893
12100A45306m539j3292j3101n779J0107J216k355j837p481j0518j4888O276N229
12087I4344Q630M216N856K390n100J480P614q904P946J3656J3979N535K0787J2878
12073A85307J737M192J452L768J5464N725j3767R640J7882k043o532M486j4249
12060B13062j7836j9116j5000l909n978k2322m258O70j3579L829M65N915r59L914
12046A24898M986j1017M01O139M487Q705m379J9398Q457Q570L11J3005Q255M73
12032A92689O454m118q073O259L584K658j3867q799O776p81R300J1221K438n860
$$ plain form
12127 169065 159757 165765 175132 176069 182559 195376 184047 166671 182012 201829 198567 200973 199583
12114 199583 186918 182808 184492 187924 184447 165003 167112 174472 167628 165161 157654 157698 148199 145306
12100 145306 140767 127475 114374 108595 118702 119918 117563 115726 108245 97727 82839 89115 94344
12087 94344 102974 107190 113046 115436 110336 111816 119430 110526 118472 132128 146107 151642 172429 185307
12073 185307 187044 191236 192688 196456 211920 217645 203878 213518 231400 229357 222825 227311 213062
12060 213062 195226 176110 161110 157201 151223 128901 124643 125313 111734 115563 116028 121943 120984 124898
12046 124898 129884 118867 119268 125407 129894 138599 134220 153618 162075 170645 170956 183961 192216 192689
12032 192689 199143 195025 186952 193211 196795 199453 185586 176787 183563 182782 192082 203303 205741 199881
12018A99881j4382j3441J007P875k899o595j2129p103j6135M413J4439k710q314
12005A43907q601M208p153J4158N663L528J3232J4651P327j280J7557N341J3005
11992B25543O615P425l525q797K4k790j3029m220j7854j1362n767LK790L838J3643
11977A92537J3327J6616L3146L1281L7998M4109O3084N4282N6251P0613O9960
11966F83204P5011O9312N9382N8193M8032M4913J9439p676m1812m8412p2489q9833
11954G97264p8074n9321o0931n7755o3907n2528k7059k0057k0714m5737j3356
11943B97825N51k8822k2436k7914k0832k3802j9024q671M961j2287N952N95O91
11930A46787J0251R965r061l3276j4980q662j1791j487r739K675k088j7890k252
$$ plain form
12018 199881 185499 172058 173065 180940 178041 171446 159317 152214 136079 140492 154931 152221 143907
12005 143907 135306 139514 132361 146519 152182 155710 168942 183593 190920 189640 207197 212538 225543
11992 225543 232158 239583 236058 227261 227285 224495 211466 207246 189392 178030 172263 172266 175056 178894 192537
11977 192537 205864 222480 255626 286907 324905 369014 432098 486380 542631 613244 683204
11966 683204 758215 827527 886909 945102 993134 1038047 1057486 1049810 1007998 959586 887097 797264
11954 797264 719190 659869 598938 541183 477276 424748 397689 377632 356918 311181 297825
11943 297825 298376 269554 247118 219204 198372 174570 155546 146875 151836 139549 145501 146096 146787
11930 146787 157038 167003 157942 124666 109686 101024 89233 87746 78007 80682 78594 60704 58452
11917E8452q27R827p113N147l470M481J9160o06q620n399J4596N487L071J0254
11903A04440k951j319K56k506j0721j0407K37O056l03o309J637n733o98M416M84
11888G6579j2600m835J3738m189j4939K832k65p771J412J1789k335n101K251r164
11874D7402l255M923L039P809p501n553k326J4115K203J934j5658P59J985q116
11860D1760J1582l219M770N441J2779o892r2r181p075J0798J0780j2651j9008
11847C9792j7244p104J0272R576J6658J252k4082o606J805l335L602N681K402
11834C2669p977K83K850j1994j449R832Q643O946j2950n512L557N071Q838l513
11820C5294r23m710o718k762N748r17P001Q120n172n803Q186k516J0464L642P009
$$ plain form
11917 58452 57625 67452 60339 65486 62016 66497 85657 85051 76431 71032 85628 91115 94186 104440
11903 104440 101489 100170 100426 97920 87199 76792 77029 83085 82782 76473 78110 72377 71679 76095 76579
11888 76579 63979 59144 72882 68693 53754 56586 56321 48550 49962 61751 59416 54315 56566 47402
11874 47402 44147 49070 52109 59918 52417 46864 44538 58653 60856 62790 47132 47891 49876 41760
11860 41760 53342 50123 54893 60334 73113 66221 66129 56948 49873 60671 71451 58800 39792
11847 39792 22548 15444 25716 35292 51950 53202 29120 22514 24319 20984 24586 30267 32669
11834 32669 24692 24975 27825 15831 14382 24214 32857 39803 26853 21341 24898 29969 38807 35294
11820 35294 34371 29661 22943 20181 25929 25012 32013 40133 34961 29158 37344 34828 45292 48934 55943
11805E5943Q761l502J9709Q823p967j1470j2560k288O000J753m787L45J2573j254
11791G0079K798p415Q90o629r899J996m687l442k003j4905k953J4061k523N746
11777D1114R269k239j1536j673L737M47m119k8j8o918M218k236j9259J517l737
11762H539O419M880L013Q325Q581k36r579K87n765j603n037P914l37M881Q575
11747C8857J879m156L027j0512J211J5468q336l172N908M147n198r395j0585O760
11733B5903J3149N743m36n233o546K637p399k246K695m890J4297R068m347j1735
11719C0660j850r42n721n13k924Q511P546j1296l963j4933j898J2308O944j3354
11705H575L56O239P843N08p44J1687k233q573k395N691Q43K560K11J2260J550
$$ plain form
11805 55943 64704 61202 80911 89734 81767 70297 57737 55449 61449 63202 58415 58760 71333 70079
11791 70079 72877 65462 66352 59723 49824 51820 47133 43691 41688 26783 23830 37891 35368 41114
11777 41114 50383 48144 36608 34935 38672 39119 35000 34972 34954 28036 32254 30018 10759 12276 8539
11762 8539 14958 19838 22851 31176 39757 39521 29942 30229 24464 22861 17824 25738 25401 30282 38857
11747 38857 40736 36580 39607 29095 30306 45774 37438 34266 40174 44321 39123 29728 19143 25903
11733 25903 39052 44795 44359 39126 32580 35217 27818 25572 28267 23377 37674 46742 42395 30660
11719 30660 28810 27868 22147 21634 18710 27221 34767 23471 19508 4575 2677 14985 21929 8575
11705 8575 8931 15170 23013 23521 22777 34464 32231 23658 21263 26954 27797 30357 30568 42828 44378
11690D4378j1096j2534J43j0307J7049J8055j2773k464j119k261j2597J951J650
11677A8075J1509l86J3748o122p023P169l662r257J134R310n81k837N852Q300
11663D5229J9121J3544n723r582K021P97k987j5313j453N875o585m713l16J4271
11649E4186J7750K239l730n086j1221n903j798K418Q114P146M549j7454q580j1019
11635C1611K435M533L892P212q280P02M030nM179m2p433J2519j2460q287J4868
11620D9474J698j2175K582Q829l887o981Q701o733O056P650l19Q502J778j5920
11606D9255r618O043l970N928k392O646P644J2252o923r002j035N671q115P667
11592F0051J1581k0413k997k42p368m143m195Q107J4041j158j4527q16J5165j596
$$ plain form
11690 44378 33282 20748 20891 10584 27633 45688 32915 30451 29332 27071 14474 16425 18075
11677 18075 29584 29198 42946 36824 29801 36970 33308 24051 25185 34495 33914 31077 36929 45229
11663 45229 64350 77894 72171 62589 64610 65407 62420 47107 45654 51529 44944 40231 39915 54186
11649 54186 71936 74175 70445 65359 54138 48235 46437 48855 56969 64115 68664 51210 42630 31611
11635 31611 34046 38579 42471 49683 41403 42105 46135 46130 50309 50267 42834 55353 42893 34606 49474
11620 49474 51172 38997 41579 50408 46521 39540 48241 41508 47564 55214 54895 63397 65175 49255
11606 49255 39637 45680 41710 47638 45246 51892 59536 71788 64865 55863 54828 60499 52384 60051
11592 60051 71632 51219 48222 47980 40612 36469 32274 40381 54422 53264 38737 37921 53086 51490
11578E1490r869m846j6322N605R913j550J200n629O37m760M266O812M941R271
11564E1159N363j632o971q987o908l745P234L563l435J3317R859P378L40j9515
11550D7020k375N9j837M589j822j024Q373l308m756O366K503M307m524j5654j422
11535C6495J3095k921J457Q471j175p937o13l642J572P461l059j7723m680O468
11521C3269N008j4254n714J4093J2946M927l955j0031N084l638J751L845j1408
11508C1923J5166J2703J945N473N36n846q163O398k336l860P242k058j9618o747
11494C2758P150J1059K1059J0159J740o643k533k3710k5541J7863L043J7588R913
11481G3905m452j374p795O075M972j7990j9908L070P025N437j631R524M272j453
$$ plain form
11578 51490 41621 36775 20453 26058 35971 34421 35621 29992 30629 25869 30135 36947 41888 51159
11564 51159 56522 54890 47919 38932 32024 28279 35513 39076 35641 48958 58817 66195 66535 47020
11550 47020 44645 44704 42867 47456 45634 44610 52983 49675 44919 51285 53788 58095 53571 37917 36495
11535 36495 49590 46669 48126 56597 55422 47485 46872 43230 44802 52263 49204 31481 26801 33269
11521 33269 38277 24023 18309 32402 45348 50275 46320 36289 41373 37735 39486 43331 31923
11508 31923 47089 59792 61737 67210 67746 61900 53737 60135 57799 53939 61181 59123 39505 32758
11494 32758 39908 50967 72026 82185 83925 77282 74749 51039 25498 43361 46404 63992 73905
11481 73905 69453 68079 60284 66359 71331 53341 33433 36503 43528 48965 47334 56858 61130 59677
11467E9677P491R963l396K768L989N582o660n26k647n627p480j7115J638N002
11453E2659Q686J1876O115j3144r203M707J636P488J0247K409J457j007r307Q261
11439H2880J0876j1742L939N984L899q022j3688O72j111j1864k795k185j8899
11426C7944m449M756P590K5014l703M80J948J4514R381L078o358j0433R912P707
11412I7381R133l048L966J4501r69p63J609O315q854o184k360k405o692l988q399
11397H9243k42P462L199O661J3090K439j9586J975O969J826M529J7405J0242J2233
11383A57445P808k568n414j8510k0603j9180j1146P625N179J837N028L045j1763
11370I8783P661j351J4202m38O17j4150p539N359k877K173J2467o226K317j564
$$ plain form
11467 59677 67168 77131 73735 76503 80492 86074 79414 78888 76241 70614 63134 46019 47657 52659
11453 52659 61345 73221 79336 66192 56989 61696 63332 70820 81067 83476 84933 83926 74619 82880
11439 82880 93756 82014 85953 91937 95836 87814 74126 74798 73687 61823 59028 56843 37944
11426 37944 33495 38251 45841 70855 67152 67632 69580 84094 93475 96553 90195 79762 89674 97381
11412 97381 106514 103466 107432 121933 120964 120201 121810 128125 119271 113087 110727 108322 101630 97642 89243
11397 89243 89001 96463 99662 106323 119413 121852 102266 104241 111210 113036 117565 134970 145212 157445
11383 157445 165253 162685 157271 138761 118158 98978 87832 95457 100636 102473 107501 110546 98783
11370 98783 106444 105093 119295 118857 119474 105324 97785 103144 100267 102440 114907 108681 110998 109434
11356A09434P691J6933O273N907R12m756M627o735n78P087P83k255j3237j505
11342A30581n255R168r831O636R949J3906k212k0652p452J8231J1708q23k892
11329A51062L831R626J3674L790r938j3555n518N364j4213j4026k331l360J4096
11316A38502J2880K310N625n971n819M647p425L483K043n46j0980R78N981q608
11302A37100j1706M771P343J2166N463m143o071l404o580r770p420m092L54p431
11288A06580K121J1977N235q440J414M593j16n864j0112k0979R352J5274K961
11275A13996L959l38j4942k506K1652J6062j267m266m685O887j949j4291J1855
11262A30167O697m640l645N451R895r78j8208o116R896J064k573o165J660n988
$$ plain form
11356 109434 117125 134058 140331 146238 147150 142394 147021 140286 139708 146795 147578 145323 132086 130581
11342 130581 125326 134494 124663 131299 141248 155154 152942 132290 124838 143069 154777 153954 151062
11329 151062 154893 164519 178193 181983 172045 158490 152972 158336 144123 130097 127766 124406 138502
11316 138502 151382 153692 159317 153346 147527 152174 144749 148232 150275 149729 138749 139727 145708 137100
11302 137100 125394 130165 137508 149674 155137 150994 144923 141519 134939 125169 117749 113657 114011 106580
11288 106580 108701 120678 125913 117473 118887 123480 123364 117500 107388 86409 95761 111035 113996
11275 113996 117955 117617 102675 100169 121821 137883 136616 132350 127665 134552 132603 118312 130167
11262 130167 136864 132224 128579 134030 143925 142947 124739 118623 128519 129583 127010 120845 122505 116517
11248A16517l575J2869R008J6807r83m782j4440r194N505M031j1371j2406K523
11235A10509J112k581k013J906N258p468j3765J242n200m414j4724j2200R709
11222F7371J7461K0992J838j2212K783O818P52k988R229K901p783r091J1944Q321
11208A18336j013m31K5013K820j9129r239n675J0841L844j0411r881K391L337
11195A10803o462J489p017p264J0788J2814P280n778j6533M494J7001o596j2028
11182A02991r395o425m031J0392J2838k631j4997J867L422P126J166Q773q103
11169A02993j1518J2630Q565O153r763j1620P164J0729Q246N621o81P886J3677
11156A50082m505J0800J5226R100K375q735j0811Q66n005p917r449j29j2797L278
$$ plain form
11248 116517 112942 125811 134819 151626 150643 145861 131421 122227 127732 131763 120392 107986 110509
11235 110509 111621 109040 107027 108933 114191 106723 92958 94200 89000 84586 69862 57662 67371
11222 67371 84832 105824 107662 95450 98233 105051 105803 102815 112044 114945 107162 98071 110015 118336
11208 118336 117323 116892 141905 144725 125596 116357 110682 121523 125367 114956 105075 107466 110803
11195 110803 104341 105830 98813 91549 102337 115151 122431 116653 100120 104614 121615 115019 102991
11182 102991 93596 87171 83140 93532 106370 103739 88742 90609 94031 101157 102323 111096 102993
11169 102993 91475 104105 112670 118823 109060 97440 104604 115333 123579 129200 128519 136405 150082
11156 150082 145577 156377 171603 180703 183078 174343 163532 164398 159393 151476 142027 141898 129101 132379
11142A32379J6913K1967J8920L191p106N259Q96j3662k665J6441Q689J3037o251
11129B08008j896N379K796N64K864J2412N437Q206J2140J1143J3889o422r582
11116B64938O320J8160K1418J2899Q614k973p716j9818k5370j5422P13M132N256
11103B71151l795j2429m481p204j0426P718J5931j4596j2139o988J531k314L695
11090B25654N227j363r594j8233n634J8773J9141J361j020r665q252J5555Q986
11077B40936J3312L0336K591j7590m667p945M833J7368J0236K703r870k3053j9510
11064B39680Q637k884j5814p707M422J5052k504j3755j02J861j1195j0030L932
11051B09593K075m407j68J2323k827j6306n199J671L206K198j0283j630J1112
$$ plain form
11142 132379 149292 171259 190179 193370 186264 191523 192419 178757 176092 192533 201222 214259 208008
11129 208008 206112 211491 214287 214851 217715 230127 235564 243770 255910 267053 280942 274520 264938
11116 264938 271258 289418 310836 323735 332349 329376 321660 301842 276472 261050 261763 265895 271151
11103 271151 267356 254927 250446 243242 232816 240534 256465 241869 229730 222742 224273 221959 225654
11090 225654 230881 229518 219924 201691 196057 214830 233971 235332 234312 224647 216395 231950 240936
11077 240936 254248 284584 287175 269585 264918 256973 261806 279174 289410 292113 282243 259190 239680
11064 239680 248317 245433 229619 221912 226334 241386 238882 225127 225025 226886 215691 205661 209593
11051 209593 211668 207261 207093 219416 216589 200283 195084 196755 199961 202159 191876 190246 201358
11038B01358Q235Q345J6079J840O72K8790K4909L872K449J863K1466K2891J2965
11025C55734K5492K9252L1893M703k6257j5044J8715j438N121Q913j283j871m487
11012D29443k928P566n646P777Q658K214q432M971N553P93k278m680q143n268
10998D29600R716K1887J6744J0278J871P724L2783K5397J5188L2707L9634K9105
10986F72634K8228L3198L7439K2103N711R81p79k7715l2045l5024l1228l1232
10974F42271j2483j0510j4510j0206q971O539l447r336l009k517j3200j2076k9312
10961E19233j2350n325j1458j1365n446P18N141p912J3290O926n708n218o755
10948D73771j087J490k519j0492m210l806j407J720m39k002j6328j3732m932k1397
$$ plain form
11038 201358 209593 217938 234017 235857 236529 265319 290228 294100 296549 298412 319878 342769 355734
11025 355734 381226 410478 442371 447074 420817 405773 424488 423050 428171 437084 435801 433930 429443
11012 429443 426515 434081 428435 436212 444870 447084 438652 443623 449176 449969 447691 443011 434868 429600
10998 429600 439316 461203 477947 488225 490096 497820 530603 556000 571188 603895 643529 672634
10986 672634 700862 734060 771499 793602 799313 800294 799515 771800 739755 704731 673503 642271
10974 642271 629788 619278 604768 594562 585591 592130 588683 579347 576338 573821 560621 548545 519233
10961 519233 506883 501558 490100 478735 473289 474007 479148 471236 484526 491452 485744 480526 473771
10948 473771 472684 474174 471655 461163 456953 453147 451740 453460 453021 451019 434691 420959 416027 394630
10934C94630k6439k9860k8013k7821k5381j2870J4037J0320j2486o501M662q698
10922B45580j2875j339l182J2559O231k396p102o656M235j3184N267o295j24J0676
10908B31395Q253m742j6327q520m311R424j0076k6512J121J8527Q003K013m265
10895B03983r09J0846M388j083N010j2850j9744J203J4926j001k58j0155k7245
10882A67111K111J1669j332n877j2331K968R153J634q218J1394N119q570k666
10869A72165Q151J4705N281o022R927J2690p120j366M397K2940J8312l501l129
10856B47430j821Q820j915l474o736j3671L45o111l905J8018K125P01L350J775
10842B44931O509L365k790o068j815M045j997r488K405J422K613j2754K902J5766
$$ plain form
10934 394630 368191 338331 310318 282497 257116 244246 258283 268603 256117 249616 254278 245580
10922 245580 232705 231366 228184 240743 246974 244578 237476 230820 235055 221871 227138 220843 220719 231395
10908 231395 239648 234906 218579 210059 205748 215172 205096 178584 179705 198232 206235 208248 203983
10895 203983 203074 213920 218308 217225 222235 209385 189641 190844 205770 204769 204511 194356 167111
10882 167111 169222 180891 179559 173682 161351 164319 173472 175106 166888 178282 183401 174831 172165
10869 172165 180316 195021 200302 194280 204207 216897 209777 208411 212808 235748 254060 250559 247430
10856 247430 245609 254429 252514 249040 242304 228633 228978 222867 218962 236980 239105 239806 243156 244931
10842 244931 251440 254805 252015 245947 244132 248177 246180 236692 239097 240519 243132 230378 233280 249046
10828B49046r361j2540l34K1907k889r556M330R394j871j770m167J947J4055J207
10814B59398K145L626o262j1302J3052M891j0522r605L447O691O168o601l212
10801B51914K814J301O495o497l189J1489J0154j6983o394M918n113q676m642
10788B37591J356J06l560m280q067j2359J2614P911j170J2569j5260Q95l71n072
10774B22903n966P752O317K0068J5246Q345M49j0094k810J288L623J884J631o064
10760B64572m830L145j2518j4874q223M271O823J1058j8367j7016j0210j6496
10748A87335K791j448n755O68n015o794J7319K6712O108k394K883P416J7391k90
10734B46927O714J5307P950m716J4353J6939k166K2932K7303K3194P419j882N815
$$ plain form
10828 249046 239685 227145 226811 248718 245829 236273 240603 249997 248126 246356 242189 244136 258191 259398
10814 259398 261543 265169 258907 247605 260657 265548 255026 245421 248868 255559 261727 255126 251914
10801 251914 254728 256029 262524 256027 252838 264327 274481 257498 251104 256022 250909 242233 237591
10788 237591 238947 239053 235493 231213 223146 210787 223401 231312 230142 242711 227451 228346 227975 222903
10774 222903 216937 224689 231006 251074 266320 274665 275114 265020 262210 263498 267121 269005 270636 264572
10760 264572 259742 262887 250369 235495 227272 231543 238366 249424 231057 214041 203831 187335
10748 187335 190126 188678 182923 183591 178576 171782 189101 215813 221921 219527 222410 229826 247217 246927
10734 246927 253641 268948 276898 272182 286535 303474 301308 324240 351543 374737 382156 380274 386089
10721C86089N243K898J6363K1553J4927J5218J8957K8758j410m527R256L1836
10709E45161J7216J654J0370J7096K9254K1205K7514J8553J3773J8341J6685K1629
10697G58451L6941L6736M1735M4812N5214M2292N4823O7125N7866M8159N2378
10686A296532O0143N5282N7861O1667N0566K5875J9131R397J1168L118j3133q511
10674A629096J2179K2164K8151L2959J9927J2809N538K8059L2673L6772L3108
10663A893435M0892J3808J8841J2465J4969K2140J6762N715R602L0373L4273N1190
10651B164465Q1270Q3637R7082J13659J07046J07183J12533J30398J48010J53522
10641C298805J41595J49920J52414J61469K04122K35347K39496K27691K49705
$$ plain form
10721 386089 391332 394230 410593 432146 447073 462291 481248 510006 508596 504069 513325 545161
10709 545161 562377 564031 574401 591497 620751 641956 669470 688023 701796 720137 736822 758451
10697 758451 795392 832128 873863 918675 973889 1016181 1071004 1138129 1195995 1244154 1296532
10686 1296532 1356675 1411957 1469818 1531485 1582051 1607926 1627057 1636454 1647622 1650740 1637607 1629096
10674 1629096 1641275 1663439 1691590 1724549 1744476 1757285 1762823 1790882 1823555 1860327 1893435
10663 1893435 1934327 1948135 1966976 1979441 1994410 2016550 2033312 2039027 2048629 2079002 2113275 2164465
10651 2164465 2245735 2329372 2426454 2540113 2647159 2754342 2866875 2997273 3145283 3298805
10641 3298805 3440400 3590320 3742734 3904203 4108325 4343672 4583168 4810859 5060564
10632E060564K64654L02324L65858M21053M24771L98725L43496K94942K40520
10623H116907K23709J88763J38480J34380J53255J55965J74743J66091J46864
10614I599157J74566L10408N42023Q64643J268807J682185K049693K283135K347826
10605B1122443K337523K339130K525988K988828L623489M054784L790676K699329
10597D5482190J211776j7963n84168m79960N1627O92416J169630J242246R09854
10588D9677648M23355q673j24911K29763Q15688J228400J257953J007678P84110
10579E5291011Q17464J063092J452167J905854K285728K411875K173517J662471
10571F9063179J166922R60329J215546J849226K677900L493371M054059M169273
$$ plain form
10632 5060564 5325218 5627542 5993400 6414453 6839224 7237949 7581445 7876387 8116907
10623 8116907 8340616 8529379 8667859 8802239 8955494 9111459 9286202 9452293 9599157
10614 9599157 9773723 10084131 10626154 11490797 12759604 14441789 16491482 18774617 21122443
10605 21122443 23459966 25799096 28325084 31313912 34937401 38992185 42782861 45482190
10597 45482190 46693966 46676003 46091835 45611875 45663502 46355918 47525548 48767794 49677648
10588 49677648 50101003 50092330 49967419 50197182 51012870 52241270 53499223 54506901 55291011
10579 55291011 56108475 57171567 58623734 60529588 62815316 65227191 67400708 69063179
10571 69063179 70230101 71190430 72405976 74255202 76933102 80426473 84480532 88649805
10563H8649805L807225L141614K568380K531303L127143L952450M408037L812805
10555A15998762J657289j495123l944381m636555m224862l505546k852273k316776
10547I4680535j929001j745149j801861j968056j980931j725886j387678j345982
10539H0795991j683936k158325k420187k508326k447470k247161j845939j287317
10531F4197330o60911k18607k16183n66673q76947q14248l22208L72281R11516
10522F1805350J040315O97190n3335r93819j681987j747986j215809m03576J48543
10513E7594886k13650j753012l730610m980212n147815m650346l903485l161920
10505C0053836k517275j989443j567914j261654j023166q27153o68716n09559
$$ plain form
10563 88649805 92457030 95598644 98167024 100698327 103825470 107777920 112185957 115998762
10555 115998762 117656051 116160928 112216547 107579992 103355130 99849584 96997311 94680535
10547 94680535 92751534 91006385 89204524 87236468 85255537 83529651 82141973 80795991
10539 80795991 79112055 76953730 74533543 72025217 69577747 67330586 65484647 64197330
10531 64197330 63536419 63317812 63101629 62534956 61658009 60843761 60521553 60893834 61805350
10522 61805350 62845665 63542855 63489520 62495701 60813714 59065728 57849919 57446343 57594886
10513 57594886 57381236 55628224 51897614 46917402 41769587 37119241 33215756 30053836
10505 30053836 27536561 25547118 23979204 22717550 21694384 20867231 20198515 19688956
10497A9688956l60517k84807k52147k86624l34331l75120m12838m55599m72063
10488A6454910m98089n29522n35300n28755n35611n78126n91716n85771n56512
10479A1515508m96320m63813m39199m23428l87363l43116l16202l07950l17554
10470H020563l27429l24868l30607l12505k72229k35001k20229k07202j79362
10461E611131j65693j51336j35474j30637j17460r8959j08376r8121o6871r0437
10451D447767q6306q4277r4738r8961q1133q5214q6297p6795o8466p7670o1508
10440C546402n9542l9650m5593o0024n7178l2395l8228l8428k4353j4031k7658
10429C109322o0502j03689j28800j30884j20658j17914r7255q0992p4396n2214
$$ plain form
10497 19688956 19328439 19043632 18791485 18504861 18170530 17795410 17382572 16926973 16454910
10488 16454910 15956821 15427299 14891999 14363244 13827633 13249507 12657791 12072020 11515508
10479 11515508 11019188 10555375 10116176 9692748 9305385 8962269 8646067 8338117 8020563
10470 8020563 7693134 7368266 7037659 6725154 6452925 6217924 5997695 5790493 5611131
10461 5611131 5445438 5294102 5158628 5027991 4910531 4811572 4703196 4605075 4538204 4447767
10451 4447767 4361461 4277184 4182446 4083485 4002352 3917138 3830841 3754046 3685580 3607910 3546402
10440 3546402 3486860 3447210 3401617 3341593 3284415 3252020 3213792 3175364 3151011 3136980 3109322
10429 3109322 3048820 2945131 2816331 2685447 2564789 2446875 2349620 2268628 2194232 2142018
10419B142018n7602p5684p0663p5473m5160l8257m1966l0719k4465l3266l5736
10408A613027n0766n6229o1577o6751m6625j8160k6891k5224k1711j1650k9561
10397A197882j7605j4412j2632k2995k1571j4437k1705j5756j6538n806m651j0344
10385A019430j3316j2344k2244k7542j4881o670j1537o811j7302k5788j4432q150
10373H38413p177k2147q089j2208L440J920r847q979j2968k9701j6500j0433j2598
10360F93126o421j0412j6134r636j2955n566J938r204k680j2908m344j3505j4836
10347E76463n477r679r115j7716p781o190j0332Q548K1731k782J005j0583L040
10334E31132m277r121J1266N705J171p756O657j0222n839J1735J2312j6070k8418
$$ plain form
10419 2142018 2084416 2008732 1938069 1862596 1817436 1779179 1737213 1706494 1682029 1648763 1613027
10408 1613027 1562261 1506032 1444455 1377704 1331079 1312919 1286028 1260804 1239093 1227443 1197882
10397 1197882 1180277 1165865 1153233 1130238 1108667 1094230 1072525 1056769 1040231 1034425 1029774 1019430
10385 1019430 1006114 993770 971526 943984 929103 922433 910896 904085 886783 860995 846563 838413
10373 838413 831236 809089 801000 788792 792232 794152 784305 775326 762358 732657 716157 705724 693126
10360 693126 686705 676293 660159 650523 637568 632002 633940 624736 622056 609148 604804 591299 576463
10347 576463 570986 561307 552192 534476 526695 520505 510173 518721 540452 537670 538675 528092 531132
10334 531132 526855 517734 529000 534705 535876 528120 534777 524555 518716 530451 542763 526693 498275
10321D98275l2659j4206k689p932j7948m295p664k755k8074k0005J3376j307j539
10308C70578Q860P896j0851n863l891n287k1605r561K153N80j0288k521j544r394
10294C09262q701J6477J5565J5525K036k5414j8137M935j4139l483p616N438n629
10281B86119j1534q09p254r782j3007J2070J5907m893j6555o775O052j0196j4741
10268B24602q351M318j665Q400q771m831R389o455j5194j9375M905M05o500M264
10254A85141o60o179P652k600o25n920Q97J0097J740j656N343R55j4058n453J283
10239A75957R124k720j3843l405p989J4943J5209m099j4196k54r832P249J92K5
10225A66361K209L353n68j548M797O04O79l792j6634j4193K519R784o88q264J0599
$$ plain form
10321 498275 465616 451410 448721 440789 422841 418546 410882 408127 380053 360048 373424 372117 370578
10308 370578 379438 387334 376483 370620 366729 361442 339837 330276 332429 333009 322721 320200 318656 309262
10294 309262 300561 317038 332603 348128 350164 324750 306613 311548 297409 293926 286310 291748 286119
10281 286119 274585 273776 266522 256740 243733 255803 271710 266817 250262 243487 249539 239343 224602
10268 224602 216251 220569 218904 227304 218533 213702 223091 216636 201442 182067 186972 187377 180877 185141
10254 185141 184481 178302 185954 183354 182729 176809 177706 187803 189543 187887 193230 194185 180127 174674 175957
10239 175957 185081 182361 168518 165113 157124 172067 187276 183177 168981 168727 158895 166144 166336 166361
10225 166361 168570 171923 171355 169807 174604 175208 175887 172095 155461 141268 143787 153571 152883 144619 155218
10210A55218M674J058r074l574q530P328q068L76J3068J1967O571J1955J366q529
10196A75806J571J4485K828Q73Q120k401o567P877J9793N328j2025J5344J2905
10183B43937j833o980K0456L2477R973p434j9K3913K1418J1493J4185O500k801
10170C65285J4951J3067N923J1030j231M75O445p668o787O99m486j3489k358p501
10156C74355q63n462n657J3713J7062J4964K0457Q626J7589N910M634J0704M519
10143D80551N451O366R380K7005J6248J22L730J2516J4030J7022J4671Q696Q783
10130F24571K5064L6469L3339K8439K0086K8728J9742L1705J1324j5206k2265
10119H21996k9077k1317k8753k9943l1567n843j1358k7464m401J0573J0539M536
$$ plain form
10210 155218 159892 160950 151876 148302 139772 147100 139032 139408 152476 164443 171014 182969 184335 175806
10196 175806 177377 191862 194690 195563 203683 201282 194715 202592 222385 227713 215688 231032 243937
10183 243937 242104 235124 255580 288057 298030 290596 290577 314490 335908 347401 361586 368086 365285
10170 365285 380236 393303 399226 410256 409025 409500 415945 408277 401490 402189 397703 384214 381856 374355
10156 374355 373492 368030 362373 376086 393148 408112 428569 437195 454784 460694 465328 476032 480551
10143 480551 486002 492368 501748 528753 545001 545123 548853 561369 575399 592421 607092 615788 624571
10130 624571 649635 686104 719443 747882 767968 796696 816438 848143 859467 844261 821996
10119 821996 792919 771602 742849 712906 681339 675496 664138 636674 632273 642846 653385 657921
10107F57921n197j378j3138J3546J0195J0061j039o863M412J340k273r170P166
10094F65583k495q683J2728J3420J6259J0528J1125l701m219K237J810O974l329
10081G18237j1105p094j4290o618j5576l1435k7136j786m193j4337k0077o320
10069E58270N716q38k697J5591J6935j079J9819P305p116L589R518J5758J6000
10056F56771L341J0254K3590J9582J5057K1595J9272J9962k746R473K5924R829
10044H31904J0547K3419J8619K0055K1598K4284L8627J9020J4113K1884L9375
10033A083445L1640M4284L7816L3244J4406K876L5031K8923L2008M0457K9706
10022A413836j9659m3611m3683j8864k1670l2570q752n555n423j7875k5892k4553
$$ plain form
10107 657921 652724 651346 638208 651754 661949 672010 670971 664108 668520 669860 667587 658417 665583
10094 665583 663088 654405 667133 680553 696812 707340 718465 714764 710545 712782 714592 721566 718237
10081 718237 707132 700038 685748 679130 663554 632119 604983 603197 599004 584667 564590 558270
10069 558270 563986 563148 560451 576042 592977 591898 611717 619022 611906 615495 625013 640771 656771
10056 656771 660112 670366 693956 713538 728595 750190 769462 789424 786678 796151 822075 831904
10044 831904 842451 865870 884489 904544 926142 950426 989053 1008073 1022186 1044070 1083445
10033 1083445 1115085 1159369 1197185 1230429 1244835 1247711 1282742 1311665 1343673 1384130 1413836
10022 1413836 1394177 1350566 1306883 1288019 1266349 1233779 1225027 1219472 1214049 1196174 1170282 1145729
10010A145729l9627k1759k2503k1026j9972j5925j3532k5307k9336k6615k6603
9999H83524k7424k4045J172k0759j5112m979j600k2546l1587k6068j9896m464
9987F86216r648p711m555q512k3446k3459n761n232l5732k3123j0403l433Q663
9974E33864j754j2358j5507Q259j0536o195N99J778j9491m969M08j8638l6498
9961D18962j0362J8540R687p518j2195o890M377J055j6389J2702p684Q685N129
9948D18099n156l180J0950J7211K985M100j1847P531P536l192Q150P244L914m904
9934D59441K096K832l562J067j0360j6041r829j8719k2241j626r369M096q808
9921C68977k014j5548k4231j4955j0643k305L46p693M904O050k5446j6625M793
$$ plain form
10010 1145729 1106102 1084343 1061840 1040814 1020842 1004917 991385 966078 936742 910127 883524
9999 883524 856100 832055 833227 812468 797356 792377 790777 768231 736644 710576 690680 686216
9987 686216 676568 668857 664302 655790 632344 608885 603124 597892 562160 539037 528634 525201 533864
9974 533864 532110 519752 504245 512504 501968 495773 496372 498150 478659 473690 474098 455460 418962
9961 418962 408600 427140 436827 429309 417114 410224 414601 415656 399267 411969 404285 412970 418099
9948 418099 412943 409763 420713 437924 440909 445009 433162 440693 448229 445037 453187 460431 464345 459441
9934 459441 461537 464369 460807 461874 451514 435473 425644 406925 384684 383058 373689 377785 368977
9921 368977 366963 351415 327184 312229 301586 299281 299627 291934 296838 302888 277442 260817 265610
9908B65610N669J5928J3239k359L998J5980J8664L953K0549J4992J5871K4576
9896D16670J6178K2676K0505K3281J4660J4611J2803R061J252j9377j5998Q548
9884E24870J0397j961j3374j3585l2255l0522j4988j4283j8201j5607j6295j253
9872C62943K670l18o310P156O008l615N148J2451j144J0488J1757n834J243r58
9858D01685K563O906M1179J7962N049N930J2942J6667K6073P408L6539M6264M3936
9845F71103K9165K3324L4065M1888L4281L2939M9031O0942M6386L7066K1623n119
9833A076694l8062o8300o8618o2574o6900m3353l9315l8970m5292k6245k1392
9822E57673j472k8n913q140j1788p395l827j2957k4977k2048O422J1263K561J746
$$ plain form
9908 265610 271279 287207 300446 298087 302085 318065 336729 340682 361231 376223 392094 416670
9896 416670 432848 455524 476029 499310 513970 528581 541384 550445 551697 532320 516322 524870
9884 524870 535267 533306 519932 506347 474092 443570 428582 414299 396098 380491 364196 362943
9872 362943 365613 365295 358985 366141 372149 368534 373682 386133 384989 395477 407234 401400 402643 401685
9858 401685 404248 411154 452333 470295 475344 481274 494216 510883 536956 544364 580903 627167 671103
9845 671103 700268 723592 757657 799545 833826 866765 915796 976738 1023124 1060190 1081813 1076694
9833 1076694 1038632 970332 901714 839140 772240 728887 689572 650602 605310 579065 557673
9822 557673 556201 556173 550260 542120 530332 522937 519110 506153 481176 459128 465550 476813 479374 481120
9808D81120j6982m875Q040j103P41O179Q767r568J5518K6251K0590K0083J4683
9795E69444N055J0078K4430K6265J1756J2018Q631K492j1185k4255l0238j2595
9783E91896k8436k4420l1759j6543k415j0888k8361j6691L659L931j1562k0029
9771D08382o7Q676K176O023m288j4551k1753k2577j4168k993l669Q126R3q256
9757C41154o301N43m215J715J6639J6973L000J9053J7587J7863K3075O787k538
9744D51335j838N088q956j485p210j9525j5064j4088l476P357n627j5620j4882
9731C56009k14N41q102j6418M93n33J673O472m395M967N056L955L075P424m085
9716C55918n787n130p140J506N34m587k371K602J2304J5695n76M636l909l587
$$ plain form
9808 481120 464138 459263 467303 466200 466941 473120 481887 472319 487837 514088 534678 554761 569444
9795 569444 574499 584577 609007 635272 647028 659046 667677 670169 658984 634729 604491 591896
9783 591896 563460 539040 507281 490738 488323 477435 449074 432383 436042 439973 428411 408382
9771 408382 408315 416991 419167 425190 420902 406351 384598 362021 347853 344860 341191 349317 349410 341154
9757 341154 334853 335396 331181 332896 349535 366508 369508 388561 406148 424011 447086 453873 451335
9744 451335 449497 454585 445629 444144 436934 417409 402345 388257 384781 392138 386511 370891 356009
9731 356009 355795 356336 348234 331816 332309 331776 333449 339921 335526 340493 345549 349504 352579 360003 355918
9716 355918 350131 345001 337861 339367 339901 335314 332943 335545 347849 363544 362968 367604 363695 360108
9702C60108K596M476r686J4065N144J284M600J1412J0796L392L656Q977N311R110
9688D35241L505j097J698M836R013L95J0489r54J2778J7804k315m222l031j4209
9674D69931r056j6499k658p427j1796j9298l451N222k144j347P043J0227n187
9661D13560P960Q584r774o646q606J3176K4335k936L484N313m55K525j603O390
9647D55307J8616l367j0100K903j0471o603R637K881k4021k5664M771M61l104
9634D11246O786j0592j9377K034l125j4121J0719K0106O212M655l486K543o750
9621D06850r039j8716j9419J1185J8314l373K563j0028k1616j5856j593J1563
9609C50835M653L831J5328P561Q216P494J8890J3810N621n475N790J2206J5931
$$ plain form
9702 360108 362704 367180 357494 371559 376703 377987 382587 393999 404795 408187 411843 420820 426131 435241
9688 435241 438746 437649 439347 444183 453196 453591 464080 463126 475904 493708 491393 487171 484140 469931
9674 469931 460875 444376 441718 434291 422495 403197 399746 404968 402824 401477 408520 418747 413560
9661 413560 421520 430104 420330 413684 405078 418254 442589 439653 443137 448450 447995 450520 448917 455307
9647 455307 473923 470556 460456 463359 452888 446285 455922 458803 434782 409118 413889 414350 411246
9634 411246 418032 407440 388063 390097 386972 372851 383570 403676 409888 414543 411057 413600 406850
9621 406850 397811 379095 359676 370861 389175 385802 388365 378337 356721 340865 339272 350835
9609 350835 355488 359319 374647 382208 390424 397918 416808 430618 436239 430764 436554 448760 464691
9596D64691O725L548K0228K1432K3211L673J0493J0435J1155j6997K755K9634
9584E90983J9936J8598L2425J9548L7999L0609O592J9296J1748Q556L2642M4116
9572H73048K5456K0414J8345J9422P968K6756K1792K6575K8146M4877M0176M3403
9560A196378O0511O7042O5059Q5816Q4116Q7442Q3526P5202R2438J20198J31306
9549B149034J17306J11369R7686Q2624P4911P5860Q8917P5225N7359L4423J568
9538B966282l9704o4735o5070m0933l4330m2836l4315k6404K7464Q4400R3151
9527B822970J12460J47850J83471K17166K35520K43654K55454K81789K89258L27786
9517E117378L42549L11578K44014J42023J9508o7540j40159j79043j74814j83792
$$ plain form
9596 464691 471416 474964 495192 516624 539835 543508 554001 564436 575591 558594 561349 590983
9584 590983 610919 629517 661942 681490 719489 750098 756690 775986 787734 796290 828932 873048
9572 873048 898504 918918 937263 956685 964653 991409 1013201 1039776 1067922 1112799 1152975 1196378
9560 1196378 1256889 1323931 1388990 1474806 1558922 1646364 1729890 1805092 1897530 2017728 2149034
9549 2149034 2266340 2377709 2475395 2558019 2632930 2708790 2797707 2872932 2930291 2964714 2966282
9538 2966282 2926578 2861843 2796773 2755840 2721510 2678674 2644359 2617955 2645419 2729819 2822970
9527 2822970 2935430 3083280 3266751 3483917 3719437 3963091 4218545 4500334 4789592 5117378
9517 5117378 5459927 5771505 6015519 6157542 6177050 6109510 5969351 5790308 5615494 5431702
9507E431702j83590j50837j30978r3987o0002k0474K1083P8896J26878J71644
9497E190335K46094K97973L28581L77325L91943L70640L73301L84350M37751M74395
9487H872688M68282L78291K25986J08559P8100J17202K33221M00935O56292R94351
9477A2533907J389037J841052K296220K643116K789039K809392K759443K741560
9469C1802766K916016L257847L624881L611777K768178J206025l31176j155410
9461D7700904j200934q32605k79935M26334J224715J904861K228522K214500K083183
9452E5469545K065365K163248K263190K397943K520873K475749K046064J128047
9444G2530024J08525m98217o36413n84048n84935o08058m70317l6020O87010J708904
$$ plain form
9507 5431702 5248112 5097275 4966297 4872310 4812308 4791834 4812917 4891813 5018691 5190335
9497 5190335 5436429 5734402 6062983 6440308 6832251 7202891 7576192 7960542 8398293 8872688
9487 8872688 9340970 9719261 9945247 10053806 10131906 10249108 10482329 10883264 11539556 12533907
9477 12533907 13922944 15763996 18060216 20703332 23492371 26301763 29061206 31802766
9469 31802766 34718782 37976629 41601510 45213287 47981465 49187490 48856314 47700904
9461 47700904 46499970 45667365 45387430 45813764 47038479 48943340 51171862 53386362 55469545
9452 55469545 57534910 59698158 61961348 64359291 66880164 69355913 71401977 72530024
9444 72530024 72638549 72140332 71503919 70919871 70334936 69726878 69256561 69220541 69907551 71616455
9434G1616455K881489M034388M890161N297217N268616M897612M381573L925810
9426A07193321L888263M474262N346582N304628L023167j269032n566472q060793
9418A14333926q761569q452550p319386n642097l842290k353480j412634j049870
9410G5500050j015649r08178m91734P9358N64124P62485O54962M50568K95477
9401G5891463K13515l0694o36449j627552k679135l422039l787331l701564l176942
9392E7043272k353713j439662p90353m87161m73371n84723o68425o47334n32046
9383D9066484k79039Q1177L14434P1947r15907k364484l625287m153301m001434
9374C4194590l554418l057482k549465k083365j687582j369642j087533q83464
$$ plain form
9434 71616455 74497944 78532332 83422493 88719710 93988326 98885938 103267511 107193321
9426 107193321 111081584 115555846 120902428 126207056 129230223 127961191 122394719 114333926
9418 114333926 105572357 97119807 89800421 84158324 80316034 77962554 76549920 75500050
9410 75500050 74484401 73576223 73084489 73163847 73727971 74490456 75145418 75595986 75891463
9401 75891463 76104978 76074284 75437835 73810283 71131148 67709109 63921778 60220214 57043272
9392 57043272 54689559 53249897 52459544 51972383 51499012 50914289 50245864 49598530 49066484
9383 49066484 48787445 48868622 49183056 49255003 48339096 45974612 42349325 38196024 34194590
9374 34194590 30640172 27582690 25033225 22949860 21262278 19892636 18805103 17921639
9366A7921639p04461n61516m82449m11402l45794l18125l22609l84984m68266
9357A3922033n73803o43961o59020o13254n45089m98339m56665l98920l64446
9348I168536k99294k51967k12705j69041j50503j18183r6652n3499j6160J0815
9338G811347J0078n075m6091p1282n7992m7475n9963j24432k13287l08766l85418
9327F501644m14936l91664l60358l18293k70125k24003j90922j61350j23021j22405
9317C924567j11170r3326q3978o2592n8056l3821j5762k0912j0921k4687j8827
9306C390515J150p174k0044l5637n7356r8075j27591j28740j28232j12735j07164
9295B568917q4883q7043q1373p0562n5130o8596o7002n8880m9706p2676p3563
$$ plain form
9366 17921639 17217178 16655662 16173213 15761811 15416017 15097892 14775283 14390299 13922033
9357 13922033 13348230 12704269 12045249 11431995 10886906 10388567 9931902 9532982 9168536
9348 9168536 8869242 8617275 8404570 8235529 8085026 7966843 7870191 7816692 7800532 7811347
9338 7811347 7821425 7816350 7770259 7698977 7640985 7593510 7533547 7409115 7195828 6887062 6501644
9327 6501644 6086708 5695044 5334686 5016393 4746268 4522265 4331343 4169993 4046972 3924567
9317 3924567 3813397 3720071 3636093 3573501 3515445 3481624 3465862 3444950 3434029 3409342 3390515
9306 3390515 3391665 3384491 3364447 3328810 3271454 3173379 3045788 2917048 2788816 2676081 2568917
9295 2568917 2484034 2396991 2315618 2245056 2189926 2121330 2054328 1995448 1945742 1873066 1799503
9284A799503o8256n4134l5167m5903m6105k8291l9422l8040l8519k2001l4420
9273A349245m0596k8107l6018j1347m555j4255q442j9477q127j3041O26j389j2397
9260A152120j8282j6224j6006j6009k1386l377k1909j4079k5244j2730k0037j4831
9248I52006J413K302N757J0207K061J5347O443J9258J4711Q980q712j5859l9142
9235I74772m1742l1424k4122k0359k8296l8268r638p156j1683r956n911M163L297
9222G53677o263j0454j5572J418j9050n233J494q236n866k0013k0809j8488k4822
9209F01783k2616J456J365j1648l903K299m466m886r137P60p489j4478K678P001
9195E38719r494o842j5864j624p970j2519k5525k4476j8431r785q476j2605q187
$$ plain form
9284 1799503 1731247 1677113 1641946 1596043 1549938 1521647 1482225 1444185 1405666 1383665 1349245
9273 1349245 1308649 1280542 1244524 1233177 1228622 1214367 1205925 1186448 1178321 1165280 1165906 1164517 1152120
9260 1152120 1133838 1117614 1101608 1085599 1064213 1060836 1038927 1024848 999604 986874 966837 952006
9248 952006 953419 955721 961478 971685 973746 989093 995536 1014794 1029505 1038485 1029773 1013914 974772
9235 974772 933030 901606 877484 857125 828829 790561 780923 773767 762084 752128 746217 750380 753677
9222 753677 747414 736960 721388 722806 703756 698523 700017 691781 685915 665902 645093 626605 601783
9209 601783 579167 580623 581988 570340 566437 568736 564270 559384 550247 551007 543518 529040 531718 538719
9195 538719 529225 522383 506519 504895 496925 484406 458881 434405 415974 406189 397713 385108 376921
9182C76921J436j3771q154M694l304k841P55J199p386k563j2969r387j7224k247
9168C05159o268M540q972j0375r102J075q406O699J528j4753j0564M117n86o001
9154B48091j3268o340J605M004m67j0743L832j1538k3348q032k550k812j023p22
9140A76689L694L002j0201p866M671L088j6871j2976k0048l810P646q183J165
9127A20000L13K855M397l039n605K947J493J5781J2649J1390q47n183m615N828
9113A58364q611j0373m890j6991n857K737J0728J9545Q316P779J576Q935Q133
9100A79391L865N175J1602J1246J0632K378O110j79m775n794k3923O711l757j4950
9086A83732j3532j4357k1060R865K1402J634j0549J643j7919k377J132K184P960
$$ plain form
9182 376921 378357 364586 356432 361126 357822 354981 355736 356935 349549 346986 334017 324630 307406 305159
9168 305159 298891 303431 294459 284084 274982 276057 267651 274350 275878 261125 250561 254678 254092 248091
9154 248091 234823 228483 230088 234092 233625 222882 226714 215176 191828 183796 181246 178434 177411 176689
9140 176689 180383 183385 173184 165318 169989 173077 156206 143230 123182 119372 127018 118835 120000
9127 120000 120313 123168 127565 124526 118921 121868 123361 139142 151791 163181 162334 157151 152536 158364
9113 158364 149753 139380 134490 117499 111642 114379 125107 144652 152968 160747 162323 171258 179391
9100 179391 183256 188431 200033 211279 221911 224289 230399 230220 225445 219651 195728 202439 198682 183732
9086 183732 170200 155843 134783 144648 166050 167684 157135 158778 140859 138482 139614 141798 149758
9073A49758J4660K4056M659m25J761j0371k256J2268J8502K1925J3257J5335J4625
9060B77754J0529J3651P141J8782K4038L2616M3132K5002J4876J6898J3288L745
9048E01452j6775k2074j7381j0601j1638k2797k3342j0507j9717k6008j5076p631
9036B97905k451m734k241m210r755M785O447n85q318l981J791j1071k295K702
9022B63989j423L877J2136P66J1093K0223J8289J6823P06J6456J0554J776J1824
9009C87089J7173L0725L1479K3781R665R084N606o37j3866Q450J3157j2303j271
8996E08132P284j8959j9905k0317k5140j0908q012j5115j1228j0555r821k0878
8984C44578r515j7308j4781K187j8825j2886n195j0247N022L253j309j5984r272
$$ plain form
9073 149758 164418 188474 193133 192708 194469 184098 181842 194110 212612 234537 247794 263129 277754
9060 277754 288283 301934 309075 327857 351895 384511 427643 452645 467521 484419 497707 501452
9048 501452 484677 462603 445222 434621 422983 400186 376844 366337 346620 320612 305536 297905
9036 297905 295454 290720 288479 284269 274514 279299 285746 285161 276843 272862 274653 263582 261287 263989
9022 263989 262566 266443 278579 279345 290438 310661 328950 345773 346479 362935 373489 375265 387089
9009 387089 404262 434987 466466 490247 499912 508996 514602 513965 500099 508549 521706 509403 508132
8996 508132 515416 496457 476552 456235 431095 420187 412175 397060 385832 375277 365456 344578
8984 344578 335063 317755 302974 305161 286336 273450 268255 258008 263030 266283 264974 248990 239718
8971B39718j7512l808k254p507q223L603R616O938K36J1422N260J2443J4482J6351
8957B80765K2496K7546K8928l515r931m246j541m409j8233r867K728j82p573j5842
8943B87124j1084l9248j6096j6398j4233j7713r40j0597k2722p443O131R782o1
8930A46502p290j3121j2214Q999J0512j0122q132j8022q545K2585m971j7162J5323
8917A04342K0210o024j114J365p071J1185K0296J1926J1150k90j3226r795j4415
8904A28539P502J3173k7538j5711r05o82j4675j4961K909O019j2721n892O724
8891G1781J426m672j930O420o686j1938k053o894L397K37J061k414N992k52p793
8876D5682L249j341n239m27R291R211j308n651j4533M440J1519j3696l391J538
$$ plain form
8971 239718 222206 218398 216144 208637 200414 204017 213633 220571 220807 232229 237489 249932 264414 280765
8957 280765 303261 330807 359735 356220 346289 342043 340502 336093 317860 307993 310721 310539 302966 287124
8943 287124 276040 236792 220696 204298 190065 172352 171412 160815 138093 130650 136781 146563 146502
8930 146502 139212 126091 113877 122876 133388 123266 115134 97112 88567 111152 106181 89019 104342
8917 104342 124552 118528 117414 118779 111708 122893 143189 155115 166265 165975 152749 142954 128539
8904 128539 136041 149214 121676 105965 105060 104378 89703 74742 77651 83670 70949 65057 71781
8891 71781 73207 68535 66605 73025 66339 54401 52348 45454 48851 49088 50149 47735 53727 53475 45682
8876 45682 48931 47590 42351 41924 51215 60426 59118 53467 38934 43374 54893 41197 37806 39344
8862C9344J0343j4250L964M993k063K168J865L056N763J992q316j808m541N691
8848D8201Q584j180j181p706r250r43r048k615j179J5186M609N195L336J3403
8834F5412K7591N867o201o721j386J341K5374K1719l331k0452j3346j436r329
8821H5102q164p950j8216j2242P704k733j966K546J0663K165K718j086j4086q515
8807C5940m910J0505J0399o895o390n699O409k297m764N171k772p045J766P093
8793C6511K484P885j0396k762q238k501P216j8538j0228R472J3467R443J2043
8780D5858K557M337L710J08k1065J5687J712j2517l336J446k23m535j7439m750
8766A1550K308J559J0704J710K498n583k615K602p414o970J997k23o69M67J730
$$ plain form
8862 39344 49687 35437 39401 44394 42331 44499 46364 49420 55183 57175 48859 47051 42510 48201
8848 48201 56785 55605 54424 46718 37468 36525 27477 24862 23683 38869 43478 48673 52009 65412
8834 65412 93003 98870 92669 85948 84562 85903 111277 132996 129665 109213 95867 94431 85102
8821 85102 76938 68988 50772 38530 46234 43501 41535 44081 54744 56909 59627 58541 44455 35940
8807 35940 31030 41535 51934 45039 38649 32950 39359 37062 32298 37469 34697 27652 29418 36511
8793 36511 38995 46880 36484 33722 25484 22983 30199 11661 1433 10905 24372 33815 45858
8780 45858 48415 52752 56462 56570 35505 51192 52904 40387 37051 38497 38274 33739 16300 11550
8766 11550 13858 15417 26121 27831 30329 24746 22131 24733 17319 10349 12346 12123 11454 11921 13651
8751A3651O026Q81o79R906q384k552P119K455J6194P423l476M459P809o670o90
8736E3472j169m359Q750L790N691j4695j3029J3162j3499n925J0708o633j5109
8723B1155l028P913Q088J6297M359K470K010J3452K1146p433j1902J549Q595m925
8709G9746n908o988k759o207L309J547o465K3L602p535k4648q937j2997j1683
8695e900M372J4609Q249Q894R026q801R88J4452J5201p923j1145l159P534j2479
8681C3918j276L859L286J198k225j5948j0005J8285K646o577N130O517L517p358
8667C4967k446P16r001K5207L759j9266J073R320J7782j150k2601p804J5629Q473
8653E4658j098K457l012o16r859O198Q816j1183k97l72m503J019p672P506j639
$$ plain form
8751 13651 19677 20558 19879 29785 21401 18849 25968 28423 44617 52040 48564 53023 60832 54162 53472
8736 53472 52303 47944 56694 60484 66175 51480 38451 51613 38114 32189 42897 36264 21155
8723 21155 18127 26040 34128 50425 54784 57254 59264 72716 93862 86429 74527 76076 84671 79746
8709 79746 73838 66850 64091 57884 61193 62740 56275 56298 59900 52365 27717 18780 5783 -5900
8695 -5900 -1528 13081 21330 30224 39250 30449 31437 45889 61090 53167 42022 38863 46397 33918
8681 33918 32642 36501 39787 40985 38760 22812 12807 31092 33738 27161 32291 38808 42325 34967
8667 34967 32521 33237 24236 49443 53202 33936 35009 44329 62111 60961 38360 30556 46185 54658
8653 54658 53560 56017 53005 52389 42530 48728 57544 46361 46064 45692 41189 42208 34536 42042 40403
8638D0403p513j1122K562J3815J3734J2586L093j1419j4631J2378l363j1560M060
8625D3023q74N479P021J81n614J548O914j5768j2030J801R993J0661q839q220
8611C5276K486P247N339m771R543L678J3230o794j1906O450P940M412j809M722
8597G5043K0443J6918J9488K9220L8984L3533K9730N2944P1196N7091M9686N6472
8585E50748N6255N7351M7467M3887L0534N573q496m0790m9095p1273q6664o8479
8573D67018o2685o1361m9456j9987k1672l0646k3760j8812k12m075j2030j716
8561A60606p901J4172Jj4056p939n166j5339j5944l43J0235J1960J2044k731k743
8547A36856q976M806J5989m092P802M71k079P272J0747P082P022m784q471j1282
$$ plain form
8638 40403 32890 21768 24330 38145 51879 64465 67558 56139 41508 53886 50523 38963 43023
8625 43023 42149 47628 54649 54830 49216 50764 57678 41910 29880 31681 41674 52335 43496 35276
8611 35276 37762 45009 50348 45577 55120 58798 72028 65234 53328 59778 67718 72130 70321 75043
8597 75043 95486 112404 131892 161112 200096 233629 263359 316303 387499 444590 494276 550748
8585 550748 607003 664354 711821 755708 786242 791815 783319 742529 693434 622161 535497 467018
8573 467018 404333 342972 293516 273529 251857 221211 197451 178639 178427 174352 162322 160606
8561 160606 152705 166877 166878 152822 144883 139717 124378 108434 108091 118326 130286 142330 139599 136856
8547 136856 127880 132686 148675 144583 152385 152856 150777 158049 168796 175878 182900 178116 169645 158363
8533A58363j8173n689n919j0440N4j7524j7501l711L676J6571J1620J8518J4804
8520A44649K0723J3700K688L772K0238K1926K0282J0452J1540O816J7814J0037
8508C04637m776j6309j8509n158j578m819l592m580r975J465l2J3730J5784J1836
8494B78124O778J2706J3168k05q95R758q48l43K8370K9125K4391J7276R865o412
8480D20858P41M643m196j3366k2826l3229k5484k3364j7157j8059j6720k0354
8468B31487k4391k2626k6761j6177k473j0876j3605j1096n239J050J551j53j1636
8455H9055q327J0556m590o199q655J0244O034n182o478l37L809q289j241j160
8441F9240k268J5320l230j6181n548Q830k853L924J1609j5649k4818L941m384
$$ plain form
8533 158363 140190 134501 128582 118142 118196 100672 83171 79460 83136 99707 111327 129845 144649
8520 144649 165372 179072 181760 185532 205770 227696 247978 258430 269970 276786 294600 304637
8508 304637 299861 283552 265043 259885 258307 253488 249896 245316 235341 236806 236774 250504 266288 278124
8494 278124 284902 297608 310776 310571 309676 319434 318586 318243 346613 375738 400129 417405 427270 420858
8480 420858 421599 426242 422046 408680 385854 352625 327141 303777 286620 268561 251841 231487
8468 231487 207096 184470 157709 141532 139059 128183 114578 103482 98243 99293 100844 100691 89055
8455 89055 80728 91284 86694 80495 71840 82084 88118 82936 76458 76121 79930 71641 70400 69240
8441 69240 66972 82292 79062 62881 57333 66163 63310 67234 78843 63194 38376 42317 37933
8428C7933M45J0344l031M974R633K91o66q873J153M518k936O605m135k352N343
8413E9246O198Q984k758o615r957j828J085K347j0638n73J2567n352J364M16P96
8398E5282N10k699m197K317J7193R425J916l396K508Q333J2265q236n909j004
8384H4308p237q528N274K814p505j4416k794R218K3747R771m391j1129L564J700
8370H4396K1942N519J328p341j807L442R005r241j3167L137J0774K429J0608P052
8356A28076n412r310p884Q025J0093K4901K0698L5742K2712Q457K2464K3937K0791
8343C03290J4954K2555J6922J3807J1866J355j0436k2799l5334m0480l9819k4342
8331B11539j0129k8688k2683m426n37k1561j2686j6474j0830p318M838m313l365
$$ plain form
8428 37933 38378 48722 45691 50665 60298 60589 59923 51050 52203 56721 53785 60390 56255 53903 59246
8413 59246 65444 74428 71670 65055 55098 53270 54355 56702 46064 45491 58058 52706 54070 54486 55282
8398 55282 55792 53093 48896 51213 68406 77831 79747 76351 78859 87192 99457 91221 85312 84308
8384 84308 77071 68543 73817 76631 69126 54710 51916 61134 84881 94652 90261 79132 82696 84396
8370 84396 106338 111857 113185 105844 104037 107479 116484 107243 94076 97213 107987 110416 121024 128076
8356 128076 122664 113354 105470 113495 123588 148489 169187 204929 227641 236098 258562 282499 303290
8343 303290 318244 340799 357721 371528 383394 384749 374313 351514 316180 275700 235881 211539
8331 211539 201410 172722 150039 145613 145076 123515 110829 94355 83525 76207 81045 76732 73367
8318G3367o249q465o263k855J2617j0429j1324j4638k931K987p161P581J1936
8305C8173o282j0764o306R11N797K861L776J503N745L68O456k676j17J2794M129
8290E6368r230r296m551n823j1395j0325L690O734j8936j2220J325J4577J1100
8277A2018Q633K511k311l495Q304o967j0534P741L204m150k544K845r18K739Q479
8262B5555Q792J823j2449l636K693k925j0198o623l755Q734J483k254m670l639
8248a069J4034J0188j89o907j5515K939J8202L618M216j672k339O547N573k269
8234C5357j1693P543P745j3477n535m37K339Q18M109q673o501J1502K6286K245
8220E1628j3963n246M542M994K29n613J3786Q534K695J589P658K0571J1626J2375
$$ plain form
8318 73367 67118 58653 52390 49535 62152 51723 40399 25761 22830 25817 18656 26237 38173
8305 38173 31891 21127 14821 15732 21529 24390 28166 29669 35414 35782 42238 39562 39445 52239 56368
8290 56368 47138 37842 33291 27468 16073 5748 9438 16172 -2764 -14984 -13659 918 12018
8277 12018 20651 23162 20851 17356 25660 18693 8159 15900 19104 14954 12410 15255 14337 17076 25555
8262 25555 34347 36170 23721 20085 22778 19853 9655 3032 -723 8011 9494 7240 2570 -1069
8248 -1069 12965 23153 22964 16057 542 3481 21683 25301 29517 27845 25506 32053 37626 35357
8234 35357 23664 31207 38952 25475 19940 19503 21842 22660 26769 18096 11595 23097 49383 51628
8220 51628 37665 32419 36961 41955 42184 36571 50357 58891 61586 63175 70833 91404 103030 115405
8206A15405J9512J2580k4852j8273p36j1148o882j133l384o672k7876j5781O148
8193C6908M887n920j1717P20l24M871J2568J6525J5293j931l828m634P354n800
8179F4972p298J0882j1368j6631j2272N220K539Q224N761q640j2903l750K996
8166B7732m386j2670l239K192K415m982N419Q049m397o189p362P255M072N401
8152A9310n364J4619N980j2548J5912J0376n654O90p483j0335k595M335K365p233
8138B2375j8768p935R141J0238K037j6182j597J1357N303K660J010q928r283K781
8124D209J2446j838n389n15o572J749q377q709N732J3947J0931p251m378J0981
8110A6966K3503m763p432P584J3730P644J2275K4284J7967M279J064L4820L1905
$$ plain form
8206 115405 134917 147497 122645 104372 103636 92488 85606 84473 81089 74417 46541 30760 36908
8193 36908 41795 35875 24158 24878 24554 29425 41993 58518 73811 71880 68052 63418 70772 64972
8179 64972 57674 68556 57188 40557 28285 33505 36044 44268 50029 41389 28486 24736 27732
8166 27732 23346 10676 7437 9629 12044 7062 12481 20530 16133 9944 2582 9837 13909 19310
8152 19310 13946 28565 34545 21997 37909 48285 42631 43321 35838 25503 22908 27243 29608 22375
8138 22375 3607 -4328 4813 15051 17088 906 -691 10666 15969 18629 19639 10711 1428 4209
8124 4209 16655 14817 9428 8913 2341 4090 -4287 -12996 -7264 6683 17614 10363 5985 16966
8110 16966 40469 35706 28274 35858 49588 57232 69507 93791 111758 116037 117101 151921 183826
8097A83826L0941M6288M7533N4858N3071N2895M5847M0681M0067M2810J1892R775
8085F60484j0008k8563m3783l7915l7373l4496m5279n1472n5732n9154k7132k7944
8073B01633l0214k0595p584j9014n072J3j4100j0633N667p505r966L862O749j3450
8059G9791J300P7j653j0206j7359j7032o425L67P34m750J46P482J0527p711J736
8044C7024K738o7J0244J3349r096q176L133m674j926j0154l7N683M064O965N995
8029E5065N254j2759k0982k669J4423R998n899r707N498R941k99p138N736m878
8015D1584k937j019j0630k777K525p49j4447m721j517J1773N837j402J789j6406
8001F903j8741Q452J5548j1558j3384J1321J5581j375p023M990m303p120L339
$$ plain form
8097 183826 214767 261055 308588 363446 416517 469412 515259 555940 596007 638817 650709 660484
8085 660484 650476 621913 578130 540215 502842 468346 423067 371595 315863 256709 229577 201633
8073 201633 171419 150824 143240 124226 119154 119167 105067 94434 100101 92596 82630 86492 93241 79791
8059 79791 81091 81168 79515 69309 51950 34918 28493 28860 29594 24844 24990 32472 42999 35288 37024
8044 37024 39762 39695 49939 63288 54192 46016 49149 44475 42549 32395 32358 38041 42105 49070 55065
8029 55065 60319 47560 26578 23909 38332 48330 42431 32724 38222 48163 47864 40726 46462 41584
8015 41584 38647 37628 26998 24221 26746 25997 11550 6829 5312 17085 22922 21520 23309 6903
8001 6903 -11838 -3386 12162 604 -12780 -1459 14122 12747 5724 10714 6411 -709 2630
7988B630N957O911K89o063M645Q546N031n658J0376n671j2261j1105M489M896
7974A3012M541k264M818Q163n601r000k059p000m25J3898M766M6K431r536n12
7959A5278p99k386k695Q250j300K882p878m866J005M164q2Q746M605J681q127
7944A8478L923J777J2131n308j6385j4730O580K878K070j3928R692J2323K544
7931B2045q099l0805j5429J4296J1236J157r395l679L748Q49J3278J6313M169
7918A9684N207j1255j6615l287m401P920J5614N392m227J721l860j2876l792J7802
7904A3027M237j858j9q870j3730o669J7208J0780r514r285m888p043K542m161
7890a8243j2248j211J6750k688m403J4701N958J948M616q813q190q153J693O134
$$ plain form
7988 2630 8587 15498 15787 9724 14369 22915 27946 22288 32664 26993 14732 3627 8116 13012
7974 13012 17553 15289 20107 28270 22669 13669 11610 4610 4185 18083 22849 22895 25326 15790 15278
7959 15278 14479 12093 9398 17648 16348 19230 11352 6486 7491 11655 11573 20319 24924 26605 18478
7944 18478 22401 24178 36309 31001 14616 -114 6466 9344 11414 -2514 7178 19501 22045
7931 22045 13946 -16859 -32288 -17992 -6756 -5599 -14994 -18673 -14925 -14076 -798 15515 19684
7918 19684 24891 13636 -2979 -6266 -10667 -2747 12867 18259 14032 15753 11893 -983 -4775 13027
7904 13027 17264 15406 15387 6517 -7213 -13882 3326 14106 4592 -4693 -9581 -16624 -14082 -18243
7890 -18243 -30491 -31702 -14952 -17640 -22043 -7342 -1384 564 5180 -3633 -11823 -19976 -18283 -12149
7876a2149J6836O355L788j9993m970J1561N823J6109l697K172p320o484n385j2859
7862a0213N464n093M08q742K214M86J539M631j331j7381Q027n264P316J4013k0190
7847b4116L798P648n800L654J0536L071L204m71O333l571o588J981o950r582r097
7832b5950J664J2369J0650K611l774q441j594K135P436j655j162n331o488J0965
7818f565K032m317L27J05p929L990J352Q735j0894k288l028l050J7269R861j1218
7803e618r537o439l826K615P606P746l217j7253M907J385R870L897J2156p833
7789c541j5664o292J486J38P552J8220J280o658m088L15J66j1341q12k493q282
7774c0014m62J7595K973R40N319O50n519m805o865P200K0427J0101q457j2912
$$ plain form
7876 -12149 4687 11042 14830 -5163 -10133 1428 7251 23360 19663 21835 14515 8031 2646 -10213
7862 -10213 -4749 -9842 -9434 -18176 -15962 -15476 -13937 -9306 -10637 -28018 -19991 -25255 -17939 -3926 -24116
7847 -24116 -20318 -12670 -18470 -14816 -4280 -1209 1995 1524 7857 4286 -2302 -321 -7271 -16853 -25950
7832 -25950 -24286 -11917 -1267 1344 -2430 -10871 -12465 -10330 -2894 -4549 -5711 -11042 -17530 -6565
7818 -6565 -4533 -8850 -8523 -8418 -16347 -12357 -11005 -2270 -13164 -15452 -18480 -21530 -4261 5600 -5618
7803 -5618 -15155 -21594 -25420 -22805 -15199 -7453 -10670 -27923 -23016 -21631 -11761 -7864 4292 -3541
7789 -3541 -19205 -25497 -24011 -23873 -16321 1899 3179 -3479 -7567 -7252 -7086 -18427 -19239 -21732 -30014
7774 -30014 -30476 -12881 -9908 -8968 -3649 -2999 -8518 -13323 -20188 -12988 7439 17540 9083 -3829
7760c829j0849l666Q404n057j6405j3082J2705P188j361J247J5560J0861P838
7747I554l106j3267J0465M889j4639l902r915n602Q966J4763N711m981J504M385
7733D825j2559L619N874j0995N486J0327N430L060l860J844r621q391p635j071
7719a3667m136k438M838k118l62J2324Q00J504J1295r76p653r706j1071l462O330
7704a8498Q899K741P191p35r546j913l236L150L57j0198o648L047k635L350O289
7689a8385j2222K283p4j719l833J187N72m864R118L049q078n014n458N456M295
7674c3687o790J5928O661q530k380L49N981n35l169M5M723J6528N084j1079q303
7659a9174J1345L324r259q788j513r731o677K496O519k694J31N154l014J5618
$$ plain form
7760 -3829 -14678 -18344 -9940 -14997 -31402 -44484 -31779 -24591 -25952 -24705 -9145 1716 9554
7747 9554 6448 -6819 3646 8535 -6104 -10006 -19921 -25523 -16557 -1794 3917 -1064 440 4825
7733 4825 -7734 -4115 1759 -9236 -3750 6577 12007 15067 11207 13051 3430 -4961 -12596 -13667
7719 -13667 -17803 -20241 -15403 -17521 -17883 -5559 -4759 -3255 8040 7064 -589 -10295 -21366 -24828 -18498
7704 -18498 -9599 -6858 333 -402 -9948 -11861 -15097 -11947 -11590 -21788 -28436 -25389 -28024 -24674 -18385
7689 -18385 -30607 -28324 -28398 -30117 -33950 -32763 -32191 -37055 -27937 -24888 -32966 -37980 -43438 -37982 -33687
7674 -33687 -40477 -24549 -17888 -26418 -28798 -28449 -22468 -23003 -26172 -26127 -21404 -4876 208 -10871 -19174
7659 -19174 -7829 -4505 -13764 -22552 -24065 -33796 -40473 -37977 -31458 -34152 -34021 -28867 -31881 -16263
7645a6263n53j3962L818J2898m902j0853%J515J2505K1633O294n631j2342k408
7631h251N191Q074j4039k901k014j4014l349P364J1584o738j1568P091J1832P441
7617d297K615O986M733o830j842p784o738N20J0991J864r392q128j742K251J0656
7602f137L138J0237J0105n674j3537j0684j7385M10O736p71l558N234M350p251
7588b4787J0336M13L338l82j939n11m679N831K797n817n813n738m483J2499J1404
7573g531J432J560k120k312J2996j2169j1455Q753p33N1K547K31q613O387J5263
7558D287K376M717K595n954n271m355m764P77N48l055m732k152q744o16q189k928
7542c5460O954J0032J6720j5744r411K140J516J1192K405j180j694q356P869Q592
$$ plain form
7645 -16263 -16816 -30778 -26960 -14062 -18964 -29817 -29817 -28302 -15797 5836 12130 6499 -5843 -8251
7631 -8251 -3060 5014 -9025 -11926 -13940 -27954 -31303 -23939 -12355 -19093 -30661 -23570 -11738 -4297
7617 -4297 -1682 5304 10037 3207 1365 -6419 -13157 -12637 -1646 218 -9174 -17302 -19044 -16793 -6137
7602 -6137 -2999 7238 17343 11669 -1868 -12552 -29937 -29527 -22791 -23562 -27120 -21886 -17536 -24787
7588 -24787 -14451 -14038 -10700 -11082 -13021 -13532 -18211 -12380 -9583 -15400 -21213 -26951 -31434 -18935 -7531
7573 -7531 -6099 -4539 -6659 -8971 4025 -8144 -19599 -10846 -11579 -11528 -8981 -8750 -17363 -10976 4287
7558 4287 6663 11380 13975 8021 2750 -1605 -6369 -5592 -5044 -8099 -12831 -14983 -23727 -24343 -32532 -35460
7542 -35460 -28506 -18474 -1754 -17498 -26909 -24769 -23253 -12061 -9656 -10836 -12530 -20886 -13017 -4425
7528d425M680N17o915j1972P601L023J1162n456N265O585o374q594j0660k548
7514a8111n047j934J0285J2232M291m472j699Q669M117K602l875q921m192j51
7500f206n167p369n85J4437Q705O037O699O67j1342k30l429j603j0319n997O213
7485i489J355j4251L997J4901K977L854j1960r543K698j1517k939J0930J5979
7472c008Q043r854j1714M04J4491J1705p509m776q040j0744O940N207k351K342
7458h864K1465O24j7628Q362m080l624j5260j1023o963L873J0982N875O34J594
7444a4033Q957o068l438R443P429k532J789l079j3283o505M78J348j0081o28L249
7429b6954Q489N948N044J1045l213m294J707P009j5168p199j223m329Q045m088
$$ plain form
7528 -4425 255 772 -6143 -18115 -10514 -7491 3671 -1785 3480 10065 3691 -4903 -15563 -18111
7514 -18111 -23158 -25092 -14807 -2575 1716 -2756 -4455 4214 8331 10933 7058 -1863 -6055 -6206
7500 -6206 -11373 -18742 -19327 -4890 3815 9852 16551 17218 5876 5646 2217 614 -9705 -15702 -9489
7485 -9489 -8134 -22385 -18388 -3487 -510 3344 -8616 -18159 -15461 -26978 -29917 -18987 -3008
7472 -3008 5035 -4819 -16533 -16129 -1638 10067 2558 -2218 -10258 -21002 -14062 -8855 -11206 -8864
7458 -8864 12601 13225 -4403 3959 -121 -3745 -19005 -30028 -36991 -33118 -22136 -16261 -15627 -14033
7444 -14033 -5076 -11144 -14582 -5139 2290 -242 1547 -1532 -14815 -21320 -20842 -19494 -29575 -30203 -26954
7429 -26954 -18465 -12517 -7473 3572 359 -3935 -2228 4781 -10387 -17586 -18809 -23138 -15093 -19181
7415a9181j7283R022J1673o983m49J1700J1648M987j0180M655l570K758L106j505
7401C98o241j1018l168j575p74k509J1618R511R995L702J3583m268j2166m961
7387B127r310j3685L070K905P746P663j220j1485j9548m068J5417J6746j038j4847
7373a9527j0186R414k629j4303j896J1897Q427N436P876m529j3238K463n15k418
7359b3728k342J1714J3596P59n140L040p700k3960M252J1680M965k724n82j6202
7345c2372l139O797P708p510N398J5186p558R947k019o594k160J0693j0235o799
7331b2657J622P575K485l678N78K274j1311k1861o546N468J6657Q047m199o078
7317c1624Q222J0512N926N553R164j0597r190j9118o30J5166J3365m916l803j485
$$ plain form
7415 -19181 -36464 -27442 -15769 -22752 -23201 -11501 147 5134 -5046 -391 -3961 -1203 1903 398
7401 398 -5843 -16861 -20029 -21604 -22378 -24887 -13269 -3758 6237 9939 23522 19254 7088 2127
7387 2127 -7183 -20868 -17798 -14893 -7147 516 -704 -12189 -31737 -35805 -20388 -3642 -4680 -19527
7373 -19527 -29713 -20299 -22928 -37231 -39127 -27230 -18803 -13367 -5491 -10020 -23258 -20795 -21310 -23728
7359 -23728 -26070 -14356 -760 -1 -5141 -2101 -9801 -33761 -29509 -17829 -12864 -15588 -16170 -32372
7345 -32372 -35511 -28714 -21006 -28516 -23118 -7932 -15490 -5543 -7562 -14156 -16316 -5623 -15858 -22657
7331 -22657 -21035 -13460 -10975 -14653 -14075 -11801 -23112 -44973 -51519 -46051 -29394 -21347 -25546 -31624
7317 -31624 -23402 -12890 -6964 -1411 7753 -2844 -12034 -31152 -31782 -16616 -3251 -8167 -11970 -13455
7303a3455L474O075j455J470k318p572R441O245p096j5836N068o868j2215L923
7289c1119J3103J832j674N152m997J629J0760J2654j3904M154k484j5330o988
7276b7212j110j1484K809J7757Q753N342J0971J97q546l386n60O855L874Jj44
7261D117J0729r96o606R012R704l845n178J036p69o384q304k244j328n187m148
7246a0391m779j747o221m352M404J3664n908N25J5214J0502r850j8830o252m068
7232b8089O281J4182J11r336j0385r334K513J8561N729j0936K975J4982R646P034
7218A3934r168j3837j4874K809J3472J4992L236J4124l03P054o543k0615J5754
7205B0035J6831j0753m513O664p020j6461p380j2627p407N350P680P942K732r551
$$ plain form
7303 -13455 -9981 -3906 -5361 -3891 -6209 -13781 -4340 1905 -5191 -21027 -15959 -22827 -35042 -31119
7289 -31119 -18016 -16184 -17858 -12706 -17703 -16074 -5314 7340 -6564 -2410 -4894 -20224 -27212
7276 -27212 -28322 -39806 -36997 -19240 -10487 -5145 5826 6023 -2523 -5909 -6469 386 4260 4261 4117
7261 4117 14846 13850 7244 16256 25960 22115 16937 17973 17204 10820 2516 272 -1056 -6243 -10391
7246 -10391 -15170 -16917 -23138 -27490 -23086 -9422 -15330 -14805 409 10911 1061 -17769 -24021 -28089
7232 -28089 -21808 -7626 -7515 -16851 -27236 -36570 -34057 -15496 -9767 -20703 -17728 -2746 6900 13934
7218 13934 4766 -9071 -23945 -21136 -7664 7328 10564 24688 24385 31439 24896 4281 20035
7205 20035 36866 26113 21600 28264 21244 4783 -2597 -15224 -22631 -17281 -9601 -1659 1073 -8478
7191h478K860Q688j568p37N907P562k251N104K484j6717j9556j0632p649O365
7177b8618J9509J1723K280q383p593O541J9403L646j4725l918O202n720K743M938
7163H028n896j4039p980J2571L428J335j8053n622P838J5901J5547j4658k2621
7150b4221r594N646O52K864m533J609O707j97o253P4J1208J2797J3673m835j0461
7135d864l337j6807L650R099p075p939k093j0543J0327J2334M309N332j1540n52
7121a9699R570M776r025L05p90m133l929j065P172O809J338j922K2873J767j9398
7106e351j1110Q25q624j0834M703q84J0664O783J4648N193j6987K273j298o331
7092a6330L237Q85j0933J2728J4265l96o724J2470l166l141J351R044O37r703
$$ plain form
7191 -8478 -5618 3070 1502 765 6672 14234 11983 17087 19571 2854 -16702 -27334 -34983 -28618
7177 -28618 -9109 2614 4894 -3489 -11082 -4541 14862 18508 3783 -135 6067 347 3090 8028
7163 8028 2132 -11907 -19887 -7316 -3888 -2553 -20606 -26228 -18390 -2489 13058 -1600 -24221
7150 -24221 -33815 -28169 -27517 -24653 -29186 -27577 -20870 -21067 -27320 -27246 -16038 -3241 10432 5597 -4864
7135 -4864 -8201 -25008 -21358 -12259 -19334 -27273 -29366 -39909 -29582 -17248 -12939 -7607 -19147 -19699
7121 -19699 -10129 -5353 -14378 -14073 -14863 -18996 -22925 -23990 -16818 -10009 -8671 -10593 12280 14047 -5351
7106 -5351 -16461 -15636 -24260 -35094 -30391 -31275 -20611 -13828 820 6013 -10974 -8701 -9999 -16330
7092 -16330 -13093 -12208 -23141 -10413 3852 3456 -3268 9202 6036 2895 4246 13290 13927 4224
7078D224j7151j3131o101P438J1076m126J0933P307q327j555J3237n707O53P066
7064E836p094J0544K52j9646J082J7249k0921q509J3784J5002o13j3664j2329
7051a9027o921M490Q114J3524l362k567l217p580O61O181p39k972J134J23p922
7036b0080m974N216L043N133J53l593L702o476j0858K635J0143n785n0K130M847
7021a4814J9987Q214M998j0171K964k976k295J627j0220J113Q267J581n805l087
7007f17K524N011k558j346k32J383J995j8668r688l61R325J4831n62j2951o9P358
6991d625l80R228N909p574j317L351p117O782J367J835r78j0765L380M581m004
6976c27q399j9378R435K5857o621q560Q60P329R211q693p578K774L243j083K783
$$ plain form
7078 4224 -12927 -26058 -32159 -24721 -13645 -17771 -6838 469 -7858 -9413 3824 -1883 -1230 5836
7064 5836 -1258 9286 9538 -10108 -9026 8223 -12698 -21207 -7423 7579 6966 -6698 -19027
7051 -19027 -25948 -21458 -13344 180 -3182 -5749 -8966 -16546 -15885 -9704 -10443 -13415 -12281 -12158 -20080
7036 -20080 -25054 -19838 -16795 -11662 -11509 -15102 -11400 -17876 -28734 -26099 -15956 -21741 -21791 -19661 -14814
7021 -14814 5173 13387 18385 8214 11178 8202 5907 7534 -2686 -1573 6694 8275 2470 -617
7007 -617 1907 6918 4360 3014 2782 4165 6160 -12508 -22196 -22557 -13232 1599 1037 -11914 -11983 -4625
6991 -4625 -5005 4223 10132 2558 1241 4592 -2525 4257 5624 7459 6481 -4284 -904 3677 -327
6976 -327 -8726 -28104 -18669 7188 567 -7993 -7133 196 9407 714 -6864 -4090 -847 -1930 853
6961H53J0832Q611q656q131j2215m064N683M218k511P94o801r480O72j323o361
$$ plain form
6961 853 11685 20296 11640 3509 -8706 -12770 -7087 -2869 -5380 -4586 -11387 -20867 -20195 -21518 -27879
$$ [...]
##END NTUPLES=NMR SPECTRUM
##END=
