##TITLE=Analysis number 320169
Compound Code cc 55709
Book Reference 467/50
Project Code adrs
Chemist Name benw
##JCAMPDX= 6.0         $$ Bruker NMR JCAMP-DX V2.0
##DATA TYPE= NMR SPECTRUM
##DATA CLASS= NTUPLES
##ORIGIN= Bruker BioSpin GmbH
##OWNER= nmr
$$ XWIN-NMR		Version 3.5
$$ Thu Jun 15 10:43:50 2006 GMT Daylight Time (UT+1h)  MAYBRIDGE\nmr@NMR_250MHZ
##.OBSERVE FREQUENCY= 250.131544655141
##.OBSERVE NUCLEUS= ^1H
##.ACQUISITION MODE= SIMULTANEOUS (DQD)
##.ACQUISITION SCHEME= undefined
##.AVERAGES= 16
##.DIGITISER RES= 18
##SPECTROMETER/DATA SYSTEM= dpx250
##.PULSE SEQUENCE= zg30
##.SOLVENT NAME= CDCl3
##.SHIFT REFERENCE= (INTERNAL, CDCl3, 0, 16.4474)
##AUDIT TRAIL= $$ (NUMBER, WHEN, WHO, WHERE, WHAT)
$$ ##TITLE= Audit trail, XWIN-NMR		Version 3.5
$$ ##JCAMPDX= 5.01
$$ ##ORIGIN= Bruker BioSpin GmbH
$$ ##OWNER= nmr
$$ C:\u/data/dgb/nmr/ADRS/840/pdata/1/auditp.txt
$$ ##AUDIT TRAIL=  $$ (NUMBER, WHEN, WHO, WHERE, WHAT)
(   1,<2006-06-15 10:43:18.54 +100>,<MAYBRIDGE\nmr>,<NMR_250MHZ>,
      <created by zg, POWCHK disabled, PULCHK disabled
       configuration hash MD5:
       E2 DF 36 D8 04 B2 41 60 5A D7 A3 38 5A 4B D0 FE
       data hash MD5: 64K
       FF F8 50 A6 1C D7 77 E4 DB DE D7 03 86 44 F1 0A>)
(   2,<2006-06-15 10:43:33.89 +100>,<MAYBRIDGE\nmr>,<NMR_250MHZ>,
      <Start of raw data processing
       ef LB = 0.3 FT_mod = 6 PKNL = 1 SI = 32K 
       data hash MD5: 32K
       CC E7 85 C9 DD F9 D6 6A A3 E4 1D 0B AB 69 98 84>)
(   3,<2006-06-15 10:43:36.75 +100>,<MAYBRIDGE\nmr>,<NMR_250MHZ>,
      <apk 
       data hash MD5: 32K
       42 70 12 A8 06 82 FD 02 93 FF 72 61 76 10 85 E7>)
(   4,<2006-06-15 10:43:38.11 +100>,<MAYBRIDGE\nmr>,<NMR_250MHZ>,
      <abs ABSG = 5 
       data hash MD5: 32K
       F4 D6 28 F8 D7 70 62 0B A5 07 6B C0 0B 46 6C 98>)
$$ ##END=
$$ 
$$ hash MD5
$$ A0 8F 30 1E A7 9E 27 5A DA E1 42 C2 75 44 81 5E
##$RELAX= 
##$RELAX= 
##$RELAX= 
##$RELAX= 
##$RELAX= 
##$RELAX= 
##$RELAX= 
$$ Bruker specific parameters
$$ --------------------------
##$DU= <C:\u>
##$EXPNO= 840
##$NAME= <ADRS>
##$PROCNO= 1
##$TYPE= <nmr>
##$USER= <dgb>
##$AMP= (0..31)
100 100 100 100 100 100 100 100 100 100 100 100 100 100 100 100 100 100 
100 100 100 100 100 100 100 100 100 100 100 100 100 100 
##$AQSEQ= 0
##$AQ_mod= 3
##$AUNM= <au_zg>
##$AUTOPOS= <33 >
##$BF1= 250.13
##$BF2= 250.13
##$BF3= 250.13
##$BF4= 250.13
##$BF5= 500.13
##$BF6= 500.13
##$BF7= 500.13
##$BF8= 500.13
##$BYTORDA= 1
##$CFDGTYP= 0
##$CFRGTYP= 5
##$CHEMSTR= <none>
##$CNST= (0..31)
1 1 145 1 1 1 1 1 1 1 1 1 1 1 1 1 1 1 1 1 1 1 1 1 1 1 1 1 1 1 1 1 
##$CPDPRG= <>
##$CPDPRG1= <>
##$CPDPRG2= <>
##$CPDPRG3= <>
##$CPDPRG4= <mlev>
##$CPDPRG5= <mlev>
##$CPDPRG6= <mlev>
##$CPDPRG7= <mlev>
##$CPDPRG8= <mlev>
##$CPDPRGB= <>
##$CPDPRGT= <>
##$D= (0..31)
0 1 0 0 0 0 0 0 0 0.06 0 0 0 0 0 0 0.0002 0 0 0 0 0 0 0 0 0 0 0 0 0 0 
0 
##$DATE= 1150364596
##$DBL= (0..7)
120 120 120 120 120 120 120 120 
##$DBP= (0..7)
150 150 150 150 150 150 150 150 
##$DBP07= 0
##$DBPNAM0= <>
##$DBPNAM1= <>
$$ [...]
##$SUBNAM7= <"">
##$SUBNAM8= <"">
##$SUBNAM9= <"">
##$SW= 20.6930455092707
##$SWIBOX= (0..15)
0 0 3 0 0 0 0 0 0 0 0 0 0 0 0 0 
##$SW_h= 5175.983436853
##$TD= 65536
##$TD0= 1
##$TE= 294.16
##$TE2= 300
##$TE3= 300
##$TEG= 300
##$TL= (0..7)
0 120 120 120 120 120 120 120 
##$TP= (0..7)
150 150 150 150 150 150 150 150 
##$TP07= 0
##$TPNAME0= <>
##$TPNAME1= <>
##$TPNAME2= <>
##$TPNAME3= <>
##$TPNAME4= <>
##$TPNAME5= <>
##$TPNAME6= <>
##$TPNAME7= <>
##$TPOAL= (0..7)
0.5 0.5 0.5 0.5 0.5 0.5 0.5 0.5 
##$TPOFFS= (0..7)
0 0 0 0 0 0 0 0 
##$TUNHIN= 0
##$TUNHOUT= 0
##$TUNXOUT= 0
##$USERA1= <user>
##$USERA2= <user>
##$USERA3= <user>
##$USERA4= <user>
##$USERA5= <user>
##$V9= 5
##$VALIST= <valist>
##$VCLIST= <CCCCCCCCCCCCCCC>
##$VD= 0
##$VDLIST= <DDDDDDDDDDDDDDD>
##$VPLIST= <PPPPPPPPPPPPPPP>
##$VTLIST= <TTTTTTTTTTTTTTT>
##$WBST= 1024
##$WBSW= 4
##$XGAIN= (0..3)
0 0 0 0 
##$XL= 0
##$YL= 0
##$YMAX_a= 272394
##$YMIN_a= -463821
##$ZGOPTNS= <>
##$ZL1= 120
##$ZL2= 120
##$ZL3= 120
##$ZL4= 120
##$ABSF1= 16.44741
##$ABSF2= -4.245762
##$ABSG= 5
##$ABSL= 3
##$ALPHA= 0
##$AQORDER= 0
##$ASSFAC= 0
##$ASSFACI= 0
##$ASSFACX= 0
##$ASSWID= 0
##$AUNMP= <proc_1d>
##$AZFE= 0.1
##$AZFW= 0.1
##$BCFW= 0
##$BC_mod= 0
##$BYTORDP= 0
##$COROFFS= 0
##$CY= 12.5
##$DATMOD= 1
##$DC= 0
##$DFILT= <>
##$DTYPP= 0
##$F1P= 14.0000005364418
##$F2P= -0.99999901652339
##$FCOR= 0.5
##$FTSIZE= 32768
##$FT_mod= 6
##$GAMMA= 0
##$GB= 0
##$INTBC= 1
##$INTSCL= 1
##$ISEN= 128
##$LB= 0.3
##$LEV0= 0
##$LPBIN= 0
##$MAXI= 10000
##$MC2= 0
##$MEAN= 0
##$ME_mod= 0
##$MI= 0
##$NCOEF= 0
##$NC_proc= -5
##$NLEV= 6
##$NOISF1= 0
##$NOISF2= 0
##$NSP= 0
##$NTH_PI= 0
##$NZP= 0
##$OFFSET= 16.44741
##$PC= 1
##$PHC0= 171.4448
##$PHC1= 6.675148
##$PH_mod= 1
##$PKNL= yes
##$PPARMOD= 0
##$PSCAL= 4
##$PSIGN= 0
##$REVERSE= no
##$SF= 250.130018654875
##$SI= 32768
##$SIGF1= 0
##$SIGF2= 0
##$SINO= 400
##$SIOLD= 32768
##$SREGLST= <1H.CDCl3>
##$SSB= 0
##$STSI= 32768
##$STSR= 0
##$SW_p= 5175.98343685301
##$SYMM= 0
##$S_DEV= 0
##$TDeff= 65536
##$TDoff= 0
##$TI= <Analysis number 999999
Compound Code 99
Book Reference 9
Project Code 9>
##$TILT= no
##$TM1= 0
##$TM2= 0
##$TOPLEV= 0
##$USERP1= <user>
##$USERP2= <user>
##$USERP3= <user>
##$USERP4= <user>
##$USERP5= <user>
##$WDW= 1
##$XDIM= 32768
##$YMAX_p= 409959648
##$YMIN_p= -227853
$$ End of Bruker specific parameters
$$ ---------------------------------
##NTUPLES= NMR SPECTRUM
##VAR_NAME=  FREQUENCY,     SPECTRUM/REAL,   SPECTRUM/IMAG
##SYMBOL=    X,             R,               I
##VAR_TYPE=  INDEPENDENT,   DEPENDENT,       DEPENDENT
##VAR_FORM=  AFFN,          ASDF,            ASDF
##VAR_DIM=   32768,         32768,           32768
##UNITS=     HZ,            ARBITRARY UNITS, ARBITRARY UNITS
##FACTOR=    0.157963299565203, 1,           1
##FIRST=     4113.99111607427, 0,            0
##LAST=      -1061.99232077874, 0,           0
##MIN=       -1061.99232077874, -227853,     0
##MAX=       4113.99111607427, 409959648,    0
$$ Real data points
##PAGE= N=1
##DATA TABLE= (X++(R..R)), XYDATA
$$ [...]
$$ plain form
17876 771979 798855 814131 766368 664013 622927 640054 715913 711869 675255 686884 710549
17865 710549 659495 645501 667732 697893 752310 751666 685269 651027 604739 579054 559767 557461
17853 557461 542306 581289 579330 518042 478589 506385 499897 470502 475097 540192 525781 528386
17841 528386 517024 473697 473626 520756 585016 544577 429118 373707 394340 387089 353213 402308
17829 402308 407453 374140 348279 350171 368581 382540 350356 312206 320166 335921 361514 422257
17817 422257 400801 387121 401426 401838 358056 307351 279676 297868 330380 330200 295974 283542
17805 283542 318754 295767 270300 248372 235155 208257 252254 286975 283938 250000 182778 161003
17793 161003 168877 213007 210909 204437 238434 302031 306559 263458 238722 223519 231033 291211
$$ packed form
17876G71979K6876J5276m7763j02355m1086J7127P5859m044l6614J1629K3665
17865G10549n1054j3994K2231L0161N4417o44o6397l4242m6288k5685j9287k306
17853E57461j5155L8983j959o1288l9453K7796o488k9395M595O5095j4411K605
17841E28386j1362m3327p1M7130O4260m0439j15459n5411K0633p251l3876M9095
17829D02308N145l3313k5861J892J8410J3959l2184l8150P960J5755K5593O0743
17817D22257k1456j3680J4305M12m3782n0705k7675J8192L2512j80l4226j2432
17805B83542L5212k2987k5467k1928j3217k6898M3997L4721l037l3938o7222k1775
17793A61003P874M4130k098o472L3997O3597M528m3101k4736j5203P514O0178
$$ plain form
17781 291211 292146 248748 141118 145746 156863 187506 228738 218057 149944 148237 228018 306614
17769 306614 307127 297255 302369 319475 346662 367102 430378 443136 471138 530430 542077 556755
17757 556755 542343 570152 635218 657633 620135 626211 662002 673296 666207 689628 690032 652634
17745 652634 639042 633925 649278 594645 558304 539058 483983 443746 411972 404455 375604 327835
17733 327835 316119 316355 328101 316305 276388 267909 217386 165755 166424 133911 112590 101135
17721 101135 128941 151814 95043 57376 72333 106038 108662 116936 112501 92448 34849 48005
17709 48005 98745 78249 77975 18518 50140 80248 112216 147751 145564 120848 129570 191522
17697 191522 198167 230374 337715 368607 377398 369086 334645 395341 443493 410906 416525 421839
$$ packed form
17781B91211R35m3398j07630M628J1117L0643M1232j0681o8113j707P9781P8596
17769C06614N13r872N114J7106K7187K0440O3276J2758K8002N9292J1647J4678
17757E56755j4412K7809O5066K2415l7498O076L5791J1294p089K3421M04l7398
17745F52634j3592n117J5353n4633l6341j9246n5075m0237l1774p517k8851m7769
17733C27835j1716K36J1746j1796l9917q479n0523n1631O69l2513k1321j1455
17721A01135K7806K2873n6771l7667J4957L3705K624Q274m435k0053n7599J3156
17709D8005N0740k0496k74n9457L1622L0108L1968L5535k187k4716Q722O1952
17697A91522O645L2207J07341L0892Q791q312l4441O0696M8152l2587N619N314
$$ plain form
17685 421839 354306 293726 267933 202230 115172 138122 183162 190527 198992 216001 289457 298420
17673 298420 311506 404141 477225 541315 680199 896196 1064275 1124003 1139681 1223455 1300614
17662 1300614 1351013 1305976 1205510 1116784 1041956 905987 727199 608932 545262 471039
17652 471039 393282 408145 424655 512647 565456 538616 570671 567641 617700 670779 708350 738465
17640 738465 719133 693734 696641 645546 539779 530195 453106 309124 308586 319989 252844 209554
17628 209554 236148 218124 179247 116217 75726 59435 72871 138447 152644 176502 180228 215868
17616 215868 176552 126060 143409 215334 249709 314726 325893 267042 273547 296200 365432 492659
17604 492659 423749 350194 344343 335147 384561 432338 500399 600125 626448 660894 701795 731353
$$ packed form
17685D21839o7533o0580k5793o5703q7058K2950M5040P365Q465J7009P3456Q963
17673B98420J3086R2635P3084O4090J38884K15997J68079N9728J5678Q3774P7159
17662A300614N0399m5037j00466q8726p4828j35969j78788j18267o3670p4223
17652D71039p7757J4863J6510Q7992N2809k6840L2055l030N0059N3079L7571L0115
17640G38465j9332k5399K907n1095j05767r584p7089j43982n38J1403o7145m3290
17628B09554K6594j8024l8877o3030m0491j6291J3436O5576J4197K3858L726L5640
17616B15868l9316n0492J7349P1925L4375O5017J1167n8851O505K2653O9232J27227
17604D92659o8910p3555n851r196M9414M7777O8061R9726K6323L4446M0901K9558
$$ plain form
17592 731353 714174 695308 691409 675661 642528 635488 604958 556704 494815 500278 513161 471184
17580 471184 437674 496032 514555 475066 413472 399036 429562 462228 528525 472625 399011
17569 399011 415610 544922 531968 479507 433787 406910 439392 460416 416488 469400 469753 453472
17557 453472 475934 443905 441124 432380 379311 378156 404389 361072 389251 469466 496562 471408
17545 471408 431076 388088 354461 344838 387902 394657 406488 440147 385315 392512 460081 496921
17533 496921 488881 453525 444394 435229 359678 319748 366334 371323 353903 347374 326539 342325
17521 342325 356441 314236 310126 326866 339573 276978 205889 146415 103489 105117 99761 107948
17509 107948 49156 31304 51624 108450 104657 62296 94707 77609 31409 24540 33076 106747
$$ packed form
17592G31353j7179j8866l899j5748l3133p040l0530m8254o1889N463J2883m1977
17580D71184l3510N8358J8523l9489o1594j4436L0526L2666O6297n5900p3614
17569C99011J6599J29312j2954n2461m5720k6877L2482K1024m3928N2912L53j6281
17557D53472K2462l2029k781q744n3069j155K6233m3317K8179Q0215K7096k5154
17545D71408m0332m2988l3627r623M3064O755J1831L3659n4832P197O7569L6840
17533D96921q040l5356r131r165p5551l9930M6586M989j7420o529k0835J5786
17521C42325J4116m2205m110J6740J2707o2595p1089n9474m2926J628n356Q187
17509A07948n8792j7852K0320N6826l793m2361L2411j7098m6200o869Q536P3671
$$ plain form
17497 106747 148807 118830 98732 66199 104813 180561 179159 105875 68613 7971 30315 82495
17485 82495 85067 7704 -46234 -72444 -30414 40301 46900 -4557 -39353 -74374 -100499 -107097
17473 -107097 -70182 -29430 61781 159121 200474 150000 106384 109168 51174 1120 65196 112931
17461 112931 116366 72187 98072 107284 117607 92997 117198 99697 91026 122911 133862 119503
17449 119503 33554 51351 44487 86138 201199 308455 308403 318054 296891 273401 187322 107662
17437 107662 55705 57277 80438 41220 27868 61033 7087 38118 70374 52166 56077 50528
17425 50528 58647 11301 -28384 836 28087 31276 35060 42265 1480 -3532 46564 31120 38952
17412 38952 64577 88642 55456 74327 119577 97330 92550 94083 95896 93628 74510 44908
$$ packed form
17497A06747M2060k9977k0098l2533L8614P5748j402p3284l7262o0642K2344N2180
17485H2495K572p7363n3938k6210M2030P0715O599n1457l4796l5021k6125o598
17473a07097L6915M0752R1211R7340M1353n0474m3616K784n7994n0054O4076M7735
17461A12931L435m4179K5885R212J0323k4610K4201j7501q671L1885J0951j4359
17449A19503q5949J7797o864M1651J15061J07256n2R651k1163k3490q6079p9660
17437A07662n1957J572K3161l9218j3352L3165n3946L1031L2256j8208L911n549
17425E0528Q119m7346l9685K9220K7251L189L784P205m0785n012N0096j5444P832
17412C8952K5625K4065l3186J8871M5250k2247m780J533J813k268j9118k9602
$$ plain form
17400 44908 4485 -27103 837 41801 9402 9302 42122 67454 100089 124825 124126 120855 121322
17387 121322 91317 77903 90134 62373 30289 10932 9648 -23089 -1139 35339 51389 60014
17375 60014 -338 -24022 32977 56265 17228 32615 15701 12086 -1714 -55556 -60714 12272
17363 12272 97467 71979 64611 81452 78463 39126 46371 41428 -18485 -5009 55188 59008 36132
17350 36132 4914 53716 54561 10929 -50915 -27322 -46399 -5569 18382 30858 50391 29043
17338 29043 -28360 -29200 397 5032 8366 7151 976 -37154 -16647 11423 22996 38346 -5340
17325 -5340 14494 15394 25395 101518 71617 68176 38446 8186 -8268 -17083 18202 -4594 -31040
17312 -31040 9248 17124 13770 19223 44732 33281 41106 62108 7390 -13916 -28060 -91443
$$ packed form
17400D4908m0423l1588K7940M0964l2399j00L2820K5332L2635K4736o99l271M67
17387A21322l0005j3414J2231k7761l2084j9357j284l2737K1950L6478J6050Q625
17375F0014o0352k3684N6999K3288l9037J5387j6914l615j3800n3842n158P2986
17363A2272Q5195k5488p368J6841k989l9337P245m943n9913J3476O0197L820k2876
17350C6132l1218M8802Q45m3632o1844K3593j9077M0830K3951J2476J9533k1348
17338B9043n7403q40K9597M635L334j215o175l8130K0507K8070J1573J5350m3686
17325e340J9834R00J0001P6123k9901l441k9730l0260j6454q815L5285k2796k6446
17312c1040M0288P876l354N453K5509j1451P825K1002n4718k1306j4144o3383
$$ plain form
17300 -91443 -97126 -63088 -78632 -44097 -11645 2089 80648 82632 59860 10005 -9946 8538
17288 8538 11066 -40693 -63064 -76531 -116888 -113390 -96981 -64280 -12003 -4701 11390 7915 23380
17275 23380 22290 6906 46526 69045 31175 -6816 -23140 2376 14050 62246 72326 49102
17263 49102 53753 50673 5964 644 -948 -24936 -27531 -11546 31322 49968 19704 -31718 9921
17250 9921 51726 21202 -2821 -25690 -11484 -26450 -29420 7320 26146 42545 33635 5671
17238 5671 21012 31019 6689 61784 30238 28636 -15063 -38427 -16014 5600 40535 32090
17226 32090 -7609 -27259 35075 59840 69951 -43638 -56275 -1199 -9175 -28898 -6515 -40173
17214 -40173 -45735 69339 123823 86764 88606 159279 161234 123159 57642 3773 -68217 -113642
$$ packed form
17300i1443n683L4038j5544L4535L2452J3734P8559J984k2772m9855j9951J8484
17288H538K528n1759k2371j3467m0357L498J6409L2701N2277P302J6091l475J5465
17275B3380j090j5384L9620K2519l7870l7991j6324K5516J1674M8196J0080k3224
17263D9102M651l080m4709n320j592k3988k595J5985M2868J8646l0264n1422M1639
17250I921M1805l0524k4023k2869J4206j4966k970L6740J8826J6399q910k7964
17238E671J5341J0007k4330N5095l1546j602m3699k3364K2413K1614L4935q445
17226C2090l9699j9650O2334K4765J0111j13589j2637N5076p976j9723K2383l3658
17214d0173n562J15074N4484l7059J842P0673J955l8075o5517n3869p1990m5425
$$ plain form
17202 -113642 -50332 12550 13145 35306 93425 128161 192381 171971 123111 109133 149515 46264
17190 46264 -4269 -1532 -32548 -60969 -74867 -24323 -9040 14093 21232 -6909 -21729 -33898
17178 -33898 -43961 26649 73338 55244 25990 43383 13930 -19802 3445 64863 51532 93733
17166 93733 108142 72425 52415 40957 36601 107792 75273 62190 32037 -16285 -63371 -84793
17154 -84793 -63659 -32830 27186 25539 21784 48753 21842 14779 13276 5144 -66146 -98135 -107633
17141 -107633 -106187 -6813 12349 -54994 -58206 -15886 4523 36572 46626 49482 31056 31639
17129 31639 66181 88661 49587 25014 43468 -22501 -57434 -111001 -114868 -99571 -31024 55010
17117 55010 91736 86715 70131 70855 81457 111260 69922 43599 -2134 -36036 -2201 -5062
$$ packed form
17202a13642O3310O2882N95K2161N8119L4736O4220k0410m8860j3978M0382j03251
17190D6264n0533K737l1016k8421j3898N0544J5283K3133P139k8141j4820j2169
17178c3898j0063P0610M6689j8094k9254J7393k9453l3732K3247O1418j3331M2201
17166I3733J4409l5717k0010j1458m356P1191l2519j3083l0153m8322m7086k1422
17154h4793K1134L0829O0016j647l755K6969k6911p063j503q132p1290l1989r498
17141a07633J446R9374J9162o7343l212M2320K0409L2049J0054K856j8426N83
17129C1639L4542K2480l9074k4573J8454o5969l4933n3567l867J5297O8547Q6034
17117E5010L6726n021j6584P24J0602K9803m1338k6323m5733l3902L3835k861
$$ plain form
17105 -5062 -13963 -11419 -48189 -18486 4231 348 8800 23402 1878 -18723 -26041 -33447 -35471
17092 -35471 -24424 23889 40653 31671 29402 33481 4104 28195 23276 23278 68954 145745 124258
17079 124258 60735 36104 -34873 10478 80941 34163 -10439 -57140 -54803 -11845 -11901 -63291
17067 -63291 -132640 -146021 -101900 -60765 -58612 -45410 -44754 -11130 -17493 30675 52250 -9801
17055 -9801 -40065 -985 18519 21968 45709 1468 -68001 -76722 -78892 -14852 26151 25887 33557
17042 33557 20426 14237 -15663 -14279 15002 -20337 -62919 -59052 -85036 -103675 -44155 -7515
17030 -7515 -30387 -42997 -32027 -60257 -18793 -10844 -17578 19605 29403 2897 -35858 -39851 5849
17017 5849 30864 33578 20914 32547 58624 65013 42496 58209 70951 35188 -7513 1074
$$ packed form
17105e062q901K544l6770K9703K2717l883Q452J4602k1524k0601p318p406k024
17092c5471J1047M8313J6764q982k269M079k9377K4091m919KM5676P6791k1487
17079A24258o3523k4631p0977M5351P0463m6778m4602m6701K337M2958n6n1390
17067f3291o9349j3381M4121M1135K153J3202O56L3624o363M8168K1575o2051
17055i801l0264L9080J9504L449K3741m4241o9469q721k170O4040M1003k64P670
17042C3557j3131o189k9900J384K9281l5339m2582L867k5984j8639N9520L6640
17030g515k2872j2610J0970k8230M1464P949o734L7183R798k6506l8755l993M5700
17017E849K5015K714j2664J1633K6077O389k2517J5713J2742l5763m2701Q587
$$ plain form
17005 1074 -22653 -38580 -56215 -52402 -64589 -70937 -62876 -52995 -51248 5997 10716 -8525 -17467
16992 -17467 -7916 -9744 -26825 -49645 -55983 -47525 -7610 -11303 -65039 -107851 -106888 -106834 -32679 -23697
16978 -23697 2398 5025 46564 68047 88629 70464 122894 117349 41938 37989 -10686 -61323
16966 -61323 -104161 -93385 -66018 -13240 -6509 -20523 -11972 34373 24893 -36530 -68124 -31316
16954 -31316 37843 25319 -25588 -13223 22903 41298 10713 13389 18949 26725 -2543 62622
16942 62622 119439 65140 17881 -5296 59242 74297 23130 -55153 -37665 -24172 -20065 18045
16930 18045 19727 60689 49579 11359 -66849 -65132 -33801 -28577 -36102 -50247 -65829 -75322 -31560
16917 -31560 -8977 42425 8285 4183 32660 23101 40334 42425 -220 -7046 -9963 -45361 -63534
$$ packed form
17005A074k3727j5927j7635L813j2187o348Q061R881J747N7245M719j9241q942
16992a7467R551j828j7081k2820o338Q458L9915l693n3736m2812R63N4P4155Q982
16978b3697K6095K627M1539K1483K0582j8165N2430n545p5411l949m8675n0637
16966f1323m2838J0776K7367N2778O731j4014Q551M6345r480o1423l1594L6808
16954c1316O9159j2524n0907J2365L6126J8395l0585K676N560P776k9268O5165
16942F2622N6817n4299m7259k3177O4538J5055n1167p8283J7488J3493M107L8110
16930A8045J682M0962j1110l8220p8208J717L1331N224p525j4145j5582r493M3762
16917c1560K2583N1402l4140m102K8477r559J7233K091m2645o826k917l5398j8173
$$ plain form
16904 -63534 -50786 -55592 40418 83930 65613 54196 -25409 -23408 17071 -130 -26427 27619
16892 27619 17693 16356 49089 61781 49317 4442 18783 34890 43735 -35725 1680 57454
16880 57454 30902 15418 55765 52813 41360 38023 15229 -10446 7606 68715 80141 93086
16868 93086 72690 73421 72844 80245 65516 21189 -41033 -61796 -27611 -38642 -47217 -46786 -36740
16855 -36740 -22169 -6041 44313 15602 10118 -7333 37927 62240 61171 54410 24105 14325
16843 14325 -25216 41988 61658 88888 73410 6089 -45241 -70253 -85784 -100924 -47215 33298
16831 33298 20916 721 -21333 1842 -7756 -31765 16528 67269 53845 -29884 28798 106477
16819 106477 123588 96190 48468 -5328 -16438 -10222 17309 -39446 -51021 -62236 -64435 -98503
$$ packed form
16904f3534J2748m806R6010M3512j8317j1417p9605K001M0479j7201k6297N4046
16892B7619r926j337L2733J2692j2464m4875J4341J6107Q845p9460L7405N5774
16880E7454k6552j5484M0347k952j1453l337k2794k5675J8052O1109J1426J2945
16868I3086k0396P31n77P401j4729m4327o2222k0763L4185j1031q575M31J0046
16855c6740J4571J6128N0354k8711n484j7451M5260K4313j069o761l0305r780
16843A4325l9541O7204J9670K7230j5478o7321n1330k5012j5531j5140N3709Q0513
16831C3298j2382k0195k2054K3175r598k4009M8293N0741j3424q3729N8682P7679
16819A06477J7111k7398m7722n3796j1110O216K7531n6755j1575j1215k199l4068
$$ plain form
16807 -98503 -78914 -71089 -61760 -37997 -31819 -34064 -97544 -89679 -96496 -135031 -158907 -71622 -17174
16794 -17174 35411 27758 -36628 -72749 -60445 -116949 -123475 -95812 -128832 -154506 -165962 -144320
16782 -144320 -103327 -60932 -43006 -48434 -14698 -27728 -43456 22863 28554 -34462 -41861 -67250
16770 -67250 -50170 -64057 -92005 -85929 -73629 -1255 3535 -29557 -31138 -1231 -14296 -24406
16758 -24406 -43552 -69517 -80726 -40703 4359 -11591 9724 38381 17251 -45363 -58010 -48228
16746 -48228 -128460 -105427 -42208 -88502 -88546 -128631 -52700 20360 -2610 35085 53711 46085
16734 46085 -6525 -66539 -71532 -87112 -103727 -100051 -108086 -88830 -107597 -112048 -70296 -50489
16722 -50489 -63748 -82509 -36104 22968 43196 12280 -88288 -45579 -853 14033 30818
$$ packed form
16807i8503J9589P825R329K3763O178k245o3480P865o817l8535k3876Q7285N4448
16794a7174N2585p653o4386l6121J2304n6504o526K7663l3020k5674j1456K1642
16782a44320M0993M2395J7926n428L3736j3030j5728O6319N691o3016p399k5389
16770f7250J7080j3887k7948O076J2300P2374M790l3092j581K9907j3065j0110
16758b4406j9146k5965j1209M0023M5062j5950K1315K8657k1130o2614j2647R782
16746d8228q0232K3033O3219m6294m4m0085P5931P3060k2970L7695J8626p626
16734D6085n2610o0014m993j5580j6615L676q035J9256j8767m451M1752J9807
16722e0489j3259j8761M6405N9072K0228l0916j00568M2709M4726J4886J6785
$$ plain form
16711 30818 41481 84989 91161 90394 123910 116351 65301 75900 89352 87132 93630 104291 79607
16698 79607 43313 28622 48326 18919 16799 -21524 -32737 -40742 -8809 -10286 -37616 -89797
16686 -89797 -57542 24121 17867 22191 -15894 4248 17 43552 49099 12063 -26223 -12531
16674 -12531 -13192 14228 49163 34993 20364 8074 -41238 -51523 14756 79764 49657 -5240
16662 -5240 -19078 -4481 36645 33266 37559 57872 22412 -46994 -46603 -5932 3268 -18849 -14189
16649 -14189 28208 22084 12679 85282 133620 104055 87506 59463 7461 8991 8281 -42987 -72287
16636 -72287 -88778 -71356 -56865 -68955 -12822 22067 107462 119063 91436 89600 98883 98495
16624 98495 84219 65655 59350 23274 25874 44518 52351 76659 96039 56919 7732 27543
$$ packed form
16711C0818J0663M3508O172p67L3516p559n1050J0599J3452k220O498J0661k4684
16698G9607l6294j4691J9704k9407k120l8323j1213q005L1933j477k7330n2181
16686h9797L2255Q1663o254M324l8085K0142m231M3535N547l7036l8286J3692
16674a2531o61K7420L4935j4170j4629j2290m9312j0285O6279O5008l0107n4897
16662e240j3838J4597M1126l379M293K0313l5460o9406L91M0671R200k2117M660
16649a4189M2397o124r405P2603M8338k9565j6549k8043n2002J530p10n1268k9300
16636g2287j6491J7422J4491j2090N6133L4889Q5395J1601k7627j836R283l88
16624I8495j4276j8564o305l6076K600J8644P833K4308J9380l9120m9187J9811
$$ plain form
16612 27543 31698 62592 35889 35459 79224 122094 151731 158011 157488 116092 76955 87804 76497
16599 76497 68557 60829 69399 76909 60240 68583 72335 73413 22136 -26383 -54926 -70830 -38132
16586 -38132 3753 36206 39172 139027 167563 107393 136182 120008 108014 120168 156898 166898
16574 166898 144058 189415 230467 210503 223603 269409 327492 405651 375413 311908 270586
16563 270586 302333 335114 388283 373432 343541 410442 425685 400317 396613 398943 438066 447885
16551 447885 455978 467450 463889 425791 402583 424721 416025 447598 425342 378878 382807 360875
16539 360875 338062 357723 368445 370025 359650 316335 297617 309966 384546 324691 256561 196915
16527 196915 240562 271591 241692 149021 133153 134255 117989 60539 68318 148117 166348 146319
$$ packed form
16612B7543M155L0894k6703m30M3765M2870K9637O280n23m1396l9137J0849j1307
16599G6497p940p728Q570P510j6669Q343L752J078n1277m8519k8543j5904L2698
16586c8132M1885L2453K966R9855K8536o0170K8789j6174j1994J2154L6730J0000
16574A66898k2840M5357M1052j9964J3100M5806N8083P8159l0238o3505m1322
16563B70586L1747L2781N3169j4851k9891O6901J5243k5368l704K330L9123R819
16551D47885Q093J1472l561l8098k3208K2138q696L1573k2256m6464L929k1932
16539C60875k2813J9661J0722J580j0375m3315j8718J2349P4580n9855o8130n9646
16527A96915M3647L1029k9899r2671j5868J102j6266n7450P779P9799J8231k0029
$$ plain form
16515 146319 174084 161898 123789 68430 39435 72892 38029 8143 18911 70355 120821
16504 120821 118587 142558 139833 153617 123802 64520 2629 -9702 76865 131072 93604 57721
16492 57721 17255 13200 23267 50891 25477 -9785 20552 51972 12525 25855 -5094 -21800
16480 -21800 -5779 -46421 -87533 -109673 -121437 -90983 -108332 -65820 -11077 13479 55579 69980
16468 69980 56472 33057 18507 56696 92719 78897 47921 14826 40500 52151 76332 62826
16456 62826 44487 56624 17123 22624 44698 63623 57713 98401 53686 -25004 -35796 -3816
16444 -3816 -4067 -61475 -112623 -174194 -143346 -154242 -68114 -34964 -55529 -38271 23433 37718
16432 37718 10672 -52716 -116640 -62071 -48663 -22202 -35327 -124168 -98506 -47913 -57863 -74031
$$ packed form
16515A46319K7765j2186l8109n5359k8995L3457l4863k9886J0768N1444N0466
16504A20821k234K3971k725J3784k9815n9282o1891j2331Q6567N4207l7468l5883
16492E7721m0466m055J0067K7624k5414l5262L0337L1420l9447J3330l0949j6706
16480b1800J6021m0642m1112k2140j1764L0454j7349M2512N4743K4556M2100J4401
16468F9980j3508k3415j4550L8189L6023j3822l0976l3095K5674J1651K4181j3506
16456F2826j8339J2137l9501N501K2074J8925n910M0688m4715p8690j0792L1980
16444c816k51n7408n1148o1571L0848j0896Q6128L3150k0565J7258O1704J4285
16432C7718k7046o3388o3924N4569J3408K6461j3125q8841K5662N0593r950j6168
$$ plain form
16420 -74031 -73208 26311 41517 44911 31310 18776 4216 -102 -3629 -27515 14717 21083 20754
16407 20754 -22072 6797 52194 -28114 -55278 -11631 48263 51534 -12549 -92417 -122018 -108211
16395 -108211 -65756 -59690 -128235 -60301 -49704 -83205 -103135 -78248 -93094 -51796 -3800 19948
16383 19948 -33952 -99235 -76882 -24083 -13299 1533 -4559 23964 88747 42394 30451 7542
16371 7542 23857 40750 20256 39698 53304 25124 57614 60437 26094 3714 -43240 -39511
16359 -39511 6612 4481 -39664 -25736 -16109 -35810 -49601 -77851 -87828 -65864 41330 41819
16347 41819 -31672 -2516 16869 8507 49953 55098 45050 51105 4515 -52854 -26912 -35573
16335 -35573 -63493 -47989 16122 -17340 -77281 -91165 -54893 -33732 -68285 -85677 -94985 -46974
$$ packed form
16420g4031Q23R9519J5206L394j3601j2534j4560m318l527k3886M2232O366l29
16407B0754m2826K8869M5397q0308k7164M3647N9894L271o4083p9868k9601J3807
16395a08211M2455O066o8545O7934J0597l3501j9930K4887j4846M1298M7996K3748
16383A9948n3900o5283K2353N2799J0784J4832o092K8523O4783m6353j1943k2909
16371G542J6315J6893k0494J9442J3606k8180L2490K823l4343k2380m6954L729
16359c9511M6123k131m4145J3928R627j9701j3791k8250r977K1964J07194M89
16347D1819p3491K9156J9385q362M1446N145j0048O055m6590n7369K5942q661
16335c5573k7920J5504O4111l3462n9941j3884L6272K1161l4553j7392r308M8011
$$ plain form
16323 -46974 -6911 -22575 -87017 -25204 26811 -7883 -74005 -90383 -71855 -48921 -22803 1375
16311 1375 36477 81886 38304 3873 -9951 -18624 12190 10795 55729 33608 -55185 -67821
16299 -67821 -25469 -23085 -41516 -58207 -63195 -100957 -104700 -101710 -54539 5124 19892 -4457
16287 -4457 -20691 -61911 -35614 -21543 -36831 -35407 -30842 -6311 10841 -30708 -33474 -10425
16275 -10425 -2965 -48972 -59167 -19223 -11302 -36768 -37139 -12877 -16962 -50503 3848 42901 51990
16262 51990 14784 9273 -9584 -7835 -1847 1788 36507 41257 21895 8446 1607 16765 -42484
16249 -42484 -105620 -80116 -58417 -16172 -27084 13386 8873 -36314 -63968 -37561 21895 17127
16237 17127 5340 55136 39173 14859 -16643 -30110 -45672 -6092 27074 43173 16855 -36546
$$ packed form
16323d6974M0063j5664o4442O1813N2015l4694o6122j6378J8528K2934K6118K4178
16311A375L5102M5409m3582l4431j3824q673L0814j395M4934k2121q8793j2636
16299f7821M2352K384j8431j6691m988l7762l743K990M7171N9663J4768k4349
16287d457j6234m1220K6297J4071j5288J424M565K4531J7152m1549k766K3049
16275a0425P460m6007j0195L9944P921k5466l71K4262m085l3541N4351L9053R089
16262E1990l7206n511j8857J749N988L635L4719M750j9362j3449o839J5158n9249
16249d2484o3136K5504K1699M2245j0912M0470m513m5187k7654K6407N9456m768
16237A7127j1787M9796j5963k4314l1502j3467j5562L9580L3166J6099k6318n3401
$$ plain form
16225 -36546 -33044 35092 61161 65419 82037 91974 82692 21020 31626 32965 55045 66988 68618
16212 68618 88754 66929 35686 74570 64052 8922 -111614 -153972 -98002 12478 37394
16201 37394 39754 41581 -2061 -8465 -36584 -84554 -72919 -30727 29822 -20250 -33762 -46511
16189 -46511 -54513 -44423 -66520 -46522 -13877 -31150 -27676 34818 44830 21079 -7871 -10029
16177 -10029 -8888 -52426 -63862 -71003 6787 17346 -14094 -46433 -48638 -54598 -32535 23147
16165 23147 8720 -28360 -21035 5937 -35816 -43589 -16484 8371 -21929 -52177 -69216 -147298
16153 -147298 -133146 -77223 -32689 -3950 -4771 -38664 -7796 17046 21975 18471 28014 22092 10375
16140 10375 -56299 -46750 -19902 -45605 -29908 11769 -26764 -56093 -72057 -66426 -50411 -27856
$$ packed form
16225c6546L502O8136K6069M258J6618R937r282o1672J0606J339K2080J1943J630
16212F8618K0136k1825l1243L8884j0518n5130j20536m2358N5970J10480K4916
16201C7394K360J827m3642o404k8119m7970J1635M2192O0549n0072j3512j2749
16189d6511q002J0090k2097J9998L2645j7273L474O2494J0012k3751k8950k158
16177a0029J141m3538j1436p141P7790J0559l1440l2339k205n960K2063N5682
16165B3147j4427l7080P325K6972m1753p773K7105K4855l0300l0248j7039p8082
16153a47298J4152N5923M4534K8739q21l3893L0868K4842M929l504R543n922j1717
16140A0375o6674R549K6848k5703J5697M1677l8533k9329j5964N631J6015K2555
$$ plain form
16128 -27856 -1260 -35503 -72241 -70687 -32632 -14979 2865 25986 84643 109041 92060 54432
16116 54432 10096 47781 73171 3403 -15077 25760 65321 41065 -7067 -19570 -29735 -68705
16104 -68705 -20740 -23559 -52599 -27327 10415 7766 -18843 -37498 -68497 -24084 -12888 -76114
16092 -76114 -58062 -54789 -37098 -23810 -45494 -33171 -21788 -22791 -34360 -38610 -74429 -123711
16080 -123711 -48844 -34853 -11582 -38220 -65983 -55764 -53913 -47112 -57966 -111586 -157761 -154284
16068 -154284 -142664 -158917 -147365 -98168 -92182 -64225 -102357 -132820 -120837 -97912 -67581 -22195
16056 -22195 -23720 -3682 455 49846 24050 40704 1694 38729 18993 26764 44764 -12283
16044 -12283 -17916 -14308 -17404 -38936 -24610 33043 65329 105195 50628 15252 -35935 -72990
$$ packed form
16128b7856K6596l4243l6738J554L8055J7653J7844K3121N8657K4398j6981l7628
16116E4432m4336L7685K5390o9768j8480M0837L9561k4256m8132j2503j0165l8970
16104f8705M7965k819k9040K5272L7742k649k6609j8655l0999M4413J1196o3226
16092g6114J8052L273J7691J3288k1684J2323J1383j003j1569m250l5819m9282
16080a23711P4867J3991K3271k6638k7763J0219J851O801j0854n3620m6175L477
16068a54284J1620j6253J1552M9197N986K7957l8132l0463J1983K2925L0331M5386
16056b2195j525K0038M137M9391k5796J6654l9010L7035j9736P771J8000n7047
16044a2283n633L608l096k1532J4326N7653L2286L9866n4567l5376n1187l7055
$$ plain form
16032 -72990 -34251 -36692 -39699 -70394 -38509 -4832 21213 -3030 -55039 -16391 50476 91675
16020 91675 47242 -29637 -77829 -55257 -53840 -12919 46053 33388 21523 3539 -20933 -40757
16008 -40757 -46180 -30912 -30117 -42174 -49329 -62557 -21292 11200 10535 -48564 -87546 -115469 -58598
15995 -58598 -11687 -1343 67298 100325 -9128 -40005 28242 37292 8406 -12070 55266 109212
15983 109212 97820 103513 64838 44955 7700 18552 60684 -1570 -42819 -88162 3115 77616
15971 77616 78950 16715 -9008 -15058 -81546 -85851 -51402 -20936 -33073 -71833 -29619 -71015
15959 -71015 -91514 -40733 925 -13049 4982 48546 71352 13533 6869 -8477 -6429 -1322
15947 -1322 -10224 17625 11580 -8805 -94519 -71554 -18080 -921 39090 -16871 -58571 -50886
$$ packed form
16032g2990L8739k441l007l0695L1885L3677K6045k4243n2009L8648O6867M1199
16020I1675m4433p6879m8192K2572J417M0921N8972j2665j1865j7984k4472j9824
16008d0757n423J5268P95j2057p155j3228M1265L2492o65n9099l8982k7923N6871
15995e8598M6911J0344O8641L3027j09453l0877O8247R050k8886k0476O7336N3946
15983A09212j1392N693l8675j9883l7255J0852M2132o2254m1249m5343R1277P4501
15971G7616J334o2235k5723o050o6488m305L4449L0466j2137l8760M2214m1396
15959g1015k0499N0781M1658j3974J8031M3564K2806n7819o664j5346K048N107
15947a322q902K7849o045k0385q5714K2965N3474J7159M0011n5961m1700P685
$$ plain form
15935 -50886 25692 40396 33995 35351 43663 49141 50980 14691 4006 30856 30766 1646 -44923
15922 -44923 -80948 -102681 -30644 -99 19523 37238 28250 17826 506 -17688 -37344 -17911
15910 -17911 -26208 -15696 36720 63155 129850 143198 125384 91882 49409 -1295 -37462 10261
15898 10261 37820 31620 24442 -34235 2401 -19282 -44180 -18530 11937 31576 25427 -4979
15886 -4979 -10621 -27598 -670 -35082 -44703 -50721 -91205 -55887 16869 88123 60536 12110
15874 12110 10469 -6457 -42756 -32692 -26171 -12964 -13577 10913 -967 -31980 -76959 -78439 -33304
15861 -33304 22550 10837 -16131 -45586 -53896 -85731 -116132 -104176 -78518 -19212 -17542 -25521
15849 -25521 -39530 -8928 -18674 -11932 -70968 -80269 -69984 -61512 -43650 -8146 24734 -13081
$$ packed form
15935e0886P6578J4704o401J356Q312N478J839l6289j0685K6850r0k9120m6569
15922d4923l6025k1733P2037L0545J9622J7715q988j0424j7320j8194j9656J9433
15910a7911q297J0512N2416K6435O6695J3348j7814l3502m2473n0704l6167M7723
15898A0261K7559o200p178n8677L6636k1683k4898K5650L0467J9639o149l0406
15886d979n642j6977K6928l4412r621o018m0484L5318P2756P1254k7587m8426
15874A2110j641j6926l6299J0064O521J3207o13K4490j1880l1013m4979j480M5135
15861c3304N5854j1713k6968k9455q310l1835l0401J1956K5658N9306J670p979
15849b5521j4009L0602r746O742n9036r301J0285Q472J7862L5504L2880l7815
$$ plain form
15837 -13081 -50104 -46904 -20912 -38467 -70258 -66841 -7390 5061 -53096 -34291 -28376 -6704
15825 -6704 39832 37233 -8038 14379 39464 25262 56162 44034 -71299 -101811 -66772 -42067
15813 -42067 -12367 20839 2641 -75252 -97561 -92783 -39605 29655 53690 14704 -7192 -52027
15801 -52027 -40664 -34343 -17314 35358 28388 -41560 -21494 39314 37329 -35270 -110282 -103456
15789 -103456 -102060 -14916 24044 -10825 -41277 -22957 -24839 13054 59985 29506 47441 -22251
15777 -22251 -7035 32043 30754 -3904 -22643 -28657 -20709 26031 77589 63842 20288 -9417
15765 -9417 -47185 -112391 -156510 -123680 -86270 -84622 -59995 -57077 -74688 -50424 10979 67835
15753 67835 39723 -5520 -17931 42038 60559 998 -36781 -3816 -3879 -47443 -46569 -46706 -69932
$$ packed form
15837a3081l7023L200K5992j7555l1791L417N9451J2451n8157J8805N915K1672
15825f704M6536k599m5271K2417K5085j4202L0900j2128j15333l0512L5039K4705
15813d2067K9700L3206j8198p7893k2309M778N3178O9260K4035l8986k1896m4835
15801e2027J1363O321J7029N2672o970o9948K0066O0808j985p2599p5012O826
15789a03456J396Q7144L8960l4869l0452J8320j882L7893M6931l0479J7935o9692
15777b2251J5216L9078j289l4658j8739o014P948M6740N1558j3747m3554k9705
15765i417l7768o5206m4119L2830L7410J648K4627K918j7611K4264O1403N6856
15753F7835k8112m5243j2411N9969J8521n9561l7779L2965o3m3564Q74j37k3226
$$ plain form
15740 -69932 -77825 -71189 -20278 -37412 -74698 -93181 -70772 -30991 -28817 44368 46672 38156 30900
15727 30900 -6743 -37268 -41949 -58167 -53002 -33384 -48562 -57444 -31981 -15645 -62868 -40793
15715 -40793 -25309 -47926 -122204 -151634 -109304 -83296 -49624 -59122 7334 54991 28848 10141
15703 10141 15530 27195 30993 -31139 -44248 -9291 -105 4344 -6525 24235 -15859 -39111
15691 -39111 -9947 -9118 -25757 -21637 -7343 -41609 -73464 -39211 -33372 -60438 -148027 -154835 -153052
15678 -153052 -146310 -75349 -95644 -97085 -78687 -79590 -94687 -119979 -63873 -5094 -28493 -16041
15666 -16041 -12844 -33977 -67385 -83991 -96843 -114911 -105550 -92076 -21912 -28418 -96734 -79269
15654 -79269 -61567 -50334 -55163 -74460 -31372 23121 11226 18795 4019 -6279 -42704 -84221
$$ packed form
15740f9932p893O636N0911j7134l7286j8483K2409L9781K174P3185K304q516p256
15727C0900l7643l0525m681j6218N165J9618j5178q882K5463J6336m7223K2075
15715d0793J5484k2617p4278k9430M2330K6008L3672r498O6456M7657k6143j8707
15703A0141N389J1665L798o2132j3109L4957R186M449j0869L0760m0094k3252
15691c9111K9164Q29j6639M120J4294l4266l1855L4253N839k7066q7589o808J783
15678a53052O742P0961k0295j441J8398r03j5097k5292N6106N8779k3399J2452
15666a6041L197k1133l3408j6606j2852j8068R361J3474P0164o506o8316J7465
15654g9269J7702J1233m829j9297M3088N4493j1895P569j4776j0298l6425m1517
$$ plain form
15642 -84221 -87426 -58891 -16594 9649 9800 -10679 -9816 -8089 7310 -28324 -35165 -61656 -66488
15629 -66488 -66561 -145583 -116973 -104379 -34119 -12332 26286 89772 90355 65209 1876 479 26514
15616 26514 46323 -26947 -26111 21091 49306 -5211 -31654 -60684 -46865 -29518 2315 -30515
15604 -30515 -40479 -44135 20732 32101 -7091 -29254 -62963 -100778 -97975 -73767 -86732 -63994
15592 -63994 -6250 -23538 -13820 -37229 -46830 -17338 12203 4678 -4110 -39255 -43324 -3147 14623
15579 14623 25014 13206 -56275 -93695 -83702 -87782 -74043 -44201 -24628 77516 96433 45338
15567 45338 28004 53811 63176 80591 88342 68800 38489 23273 35784 27240 -20563 -31192
15555 -31192 71034 193449 202443 143492 98688 51442 70711 51308 -20716 -34959 -85601
$$ packed form
15642h4221l205K8535M2297K6243J51k0479Q63J727J5399l5634o841k6491m832
15629f6488p3p9022K8610J2594P0260K1787L8618O3486N83k5146o3333j397K6035
15616B6514J9809p3270Q36M7202K8215n4517k6443k9030J3819J7347L1833l2830
15604c0515r964l656O4867J1369l9192k2163l3709l7815K803K4208j2965K2738
15592f3994N7744j7288R718k3409r601K9492K9541p525q788l5145m069M0177J7770
15579A4623J0391j1808o9481l7420R993m080J3739K9842J9573J02144J8917n1095
15567D5338j7334K5807R365J7415P751j9542l0311j5216J2511q544m7803j0629
15555c1192J02226J22415Q994n8951m4804m7246J9269j9403p2024j4243n0642
$$ plain form
15544 -85601 -64863 -53511 -19150 -5735 -7337 -8526 5863 21746 46289 38498 17140 52272
15532 52272 26825 -13293 -68466 -29942 20286 13187 -4498 -13504 -68787 -104024 -79918 -90488
15520 -90488 -120923 -130872 -118980 -17818 60797 56941 61012 -24654 -89071 -103580 -96140 -112085
15508 -112085 -105833 -125920 -127485 -109036 -81785 -233 12505 -15597 -77360 -96299 -50236 -25266
15496 -25266 -17411 4010 41752 -11002 -45714 -63494 -90068 -40462 -9644 -33030 -46981 -32775
15484 -32775 1691 9358 -34488 -30248 -28355 -48456 -622 -4450 -72348 -75184 -96832 -88390 -34381
15471 -34381 -69991 -56217 -41356 -21912 -7518 -27176 -53879 -39148 -17009 -36518 -31844 -20045
15459 -20045 -77605 -61423 -53023 -12738 -50983 -105324 -88996 -28643 -44264 -28713 -80271 -109873
$$ packed form
15544h5601K0738J1352L4361J3415j602j189J4389J5883K4543p791k1358L5132
15532E2272k5447m0118n5173L8524N0228p099j7685r006n5283l5237K4106j0570
15520i0488l0435r949J1892J01162P8615l856M071q5666o4417j4509P440j5945
15508a12085O252k0087j565J8449K7251Q1552J2738k8102o1763j8939M6063K4970
15496b5266P855K1421L7742n2754l4712j7780k6574M9606L0818k3386j3951J4206
15484c2775L4466P667m3846M240J893k0101M7834l828o7898k836k1648Q442N4009
15471c4381l5610J3774J4861J9444J4394j9658k6703J4731K2139j9509M674J1799
15459b0045n7560J6182Q400M0285l8245n4341J6328O0353j5621J5551n1558k9602
$$ plain form
15447 -109873 -29946 19208 14189 -3902 -38196 -72277 -59167 -74613 -93378 -133015 -102051 -81779
15435 -81779 -41932 -70846 -60153 -15790 24455 26223 -6796 4826 1844 17665 15839 18788
15423 18788 26487 -10179 3004 37822 5240 37157 27265 -37266 -41619 6783 -40753 9779
15411 9779 13008 -48200 -18569 45251 -8031 3315 48129 60160 53897 -1771 -47524 -37395
15399 -37395 -58565 -94927 -139480 -151859 -99482 -55715 -50471 -48281 15259 24692 2688 -1835
15387 -1835 -6054 27829 54678 68071 62994 27620 27155 40289 19834 -42623 -68285 -80039 -7773
15374 -7773 3695 25971 -12082 13748 16711 -12604 -24252 -15993 -11954 -23351 -55266 -59651 -15952
15361 -15952 -5438 22679 91003 76124 9840 6324 8107 17322 -22663 -33723 -56692 -80478
$$ packed form
15447a09873P9927M9154n019j8091l4294l4081J3110j5446j8765l9637L0964K0272
15435h1779L9847k8914J0693M4363M0245J768l3019J1622k982J5821j826K949
15423A8788P699l6666J3183L4818l2582L1917r892o4531m353M8402m7536N0532
15411I779L229o1208K9631O3820n3282J1346M4814J2031o263n5668m5753J0129
15399c7395k1170l6362m4553j2379N2377M3767N244K190O3540R433k2004m523
15387a835m219L3883K6849J3393n077l5374m65J3134k0455o2457k5662j1754P2266
15374g773J1468K2276l8053K5830K963k9315j1648Q259M039j1397l1915m385M3699
15361a5952J0514K8117O8324j4879o6284l516J783R215l9985j1060k2969k3786
$$ plain form
15349 -80478 -68849 -62437 -59452 -46928 -1635 15820 57279 79987 67881 34178 -32186 -72688
15337 -72688 -16872 -14067 -54236 -62138 -29256 -32749 3400 9430 -37505 -62598 -36872 -21403
15325 -21403 10489 5379 -43806 10242 68061 67068 21356 -15390 -41781 -50234 -22922 34164
15313 34164 123757 83362 59748 37076 -513 31907 57605 3617 -52535 -42811 32471 24228
15301 24228 30807 61330 48291 13494 -31158 -79428 -65275 -23209 -36796 -57991 -63081 -66917
15289 -66917 -47386 -71167 -38762 -44558 -98008 -142628 -77812 -75028 -101702 -107679 -103864 -77709
15277 -77709 -78255 -101907 -113228 -76221 -132496 -141172 -96299 -112032 -132304 -143357 -104071 -66241
15265 -66241 -32476 38068 65752 76227 49224 75936 35279 -4288 -22645 -18466 19433 38994
$$ packed form
15349h0478J1629O412K985J2524M5293J7455M1459K2708j2106l3703o6364m0502
15337g2688N5816K805m0169p902L2882l493L6149O030m6935k5093K5726J5469
15325b1403L1892n110m9185N4048N7819r93m5712l6746k6391q453K7312N7086
15313C4164Q9593m0395k3614k2672l7589L2420K5698n3988n6152R724P5282q243
15301B4228O579L0523j3039l4797m4652m8270J4153M2066j3587k1195n090l836
15289f6917J9531k3781L2405n796n3450m4620O4816K784k6674n977L815K6155
15277g7709n46k3652j1321L7007n6275q676M4873j5733k0272j1053L9286L7830
15265f6241L3765P0544K7684J0475k7003K6712m0657l9567j8357M179L7899J9561
$$ plain form
15253 38994 43652 98626 138153 58299 52807 65110 -35183 -52611 -29023 9408 29102 38569
15241 38569 37010 33907 -83102 -85313 -1802 23270 -29946 -8173 -9 -29497 -37885 -42699 -27192
15228 -27192 -53429 -47193 -40080 -63325 14356 41802 9617 -1502 13663 -5190 -42107 -41906
15216 -41906 -8502 38762 65559 24206 8291 18541 35630 27216 67071 -24268 -76215 -68507
15204 -68507 -58413 -77837 -57448 14114 6516 -24639 -88452 -57405 -26240 -57605 -1925 14564
15192 14564 126 -48211 -32048 -51385 -54628 -16187 25840 35914 39391 51185 42041 19956
15180 19956 -44906 -64261 -62527 -72088 -25313 49614 73042 -2318 -54935 -36738 -80890 -89996
15168 -89996 3385 14267 -13868 10719 61133 83588 51037 26216 28090 -1628 -12547 -3717
$$ packed form
15253C8994M658N4974L9527p9854n492J2303j00293j7428K3588L8431J9694R467
15241C8569j559l103j17009k211Q3511K5072n3216K1773Q164k9488q388m814J5507
15228b7192k6237O236P113k3245P7681K7446l2185j1119J5165j8853l6917K01
15216d1906L3404M7264K6797m1353j5915J0250J7089q414L9855r1339n1947P708
15204f8507J0094j9424K0389P1562p598l1155o3813L1047L1165l1365N5680J6489
15192A4564j4438m8337J6163j9337l243L8441M2027J0074L477J1794r144k2085
15180A9956o4862j9355J734r561M6775P4927K3428p5360n2617J8197m4152r106
15168h9996R3381J0882k8135K4587N0414K2455l2551k4821J874k9718j0919Q830
$$ plain form
15156 -3717 22770 58191 44082 9563 -42069 -31321 -3586 -11107 -24083 -50190 -2773 -20399
15144 -20399 -81055 -107579 -55608 65572 117671 82214 86222 15111 -44964 -50748 -29511 -30751
15132 -30751 -81968 -102887 -65075 -48707 -17189 1001 -312 20545 7474 -20315 -8096 49329
15120 49329 30603 48545 72965 34093 -16180 -35250 -55801 -95079 -75018 -62193 -36151 -25787
15108 -25787 -33612 40124 51189 84945 69208 13966 -22449 -32979 -30634 -82609 -79022 -15215
15096 -15215 19702 66293 141794 116894 117798 69424 60908 59237 15075 -18484 -34429 -27626 23097
15083 23097 44149 6553 22859 -44997 -65139 -103873 -28028 -18961 -11245 -56016 -94292 -59214
15071 -59214 -15620 -44508 -41969 -38089 -32516 4098 22722 269 -32162 -83047 -109194 -34919
$$ packed form
15156c717K6487L5421j4109l4519n1632J0748K7735p521j2976k6107M7417j7626
15144b0399o0656k6524N1971J21180N2099l5457M008p1111o0075n784K1237j240
15132c0751n1217k0919L7812J6368L1518J8190j313K0857j3071k7789J2219N7425
15120D9329j8726J7942K4420l8872n0273j9070k0551l9278K0061J2825K6042J0364
15108b5787p825P3736J1065L3756j5737n5242l6415j0530K345n1975L587O3807
15096a5215L4917M6591P5501k4900R04m8374q516j671m4162l3559j5945O803N0723
15083B3097K1052l7596J6306o7856k0142l8734P5845R067P716m4771l8276L5078
15071e9214M3594k8888K539L880N573L6614J8624k2453l2431n0885k6147P4275
$$ plain form
15059 -34919 28926 46892 49076 10562 -18905 53531 71327 80408 60539 40415 47332 4270
15047 4270 -20969 35101 91284 118999 64050 -9619 19575 58747 13391 -37063 -16073 -25755
15035 -25755 -21923 90 25217 -1485 -11176 17212 -11371 -33179 22379 86185 157872 121010
15023 121010 119493 102950 88990 60565 73296 60804 73718 91221 135989 182028 187962 167772
15011 167772 145199 188368 270046 306195 448932 596169 714329 840094 1107829 1493666
15001 1493666 2020166 2857584 4384238 7458576 12538600 17622586 18709085 17106220
14993 17106220 16524409 17666905 16177322 10079251 6149704 4370203 3463517 2854051
14985 2854051 2385187 2059191 1851775 1703278 1626268 1543479 1440898 1313376 1223965 1141185
$$ packed form
15059c4919O3845J7966K184l8514k9467P2436J7796R081j9869k0124O917m3062
15047D270k5239N6070N6183K7715n4949p3669K9194L9172m5356n0454K0990r682
15035b5755L832K2013K5127k6702r691K8388k8583k1808N5558O3806P1687l6862
15023A21010j517j6543j3960k8425J2731j2492J2914J7503M4768M6039N934k0190
15011A67772k2573M3169Q1678L6149J42737J47237J18160J25765K67735L85837
15001A493666N26500Q37418J526654L074338N080024N083986J086499j602865
14993A7106220n81811J142496j489583o098071l929547j779501r06686o09466
14985B854051m68864l25996k07416j48497p7010q2789j02581j27522q9411q2780
$$ plain form
14975 1141185 1060217 982127 937188 877714 787476 751036 712831 627700 628191 639181 676796 651059
14963 651059 654034 644057 620054 569807 520367 485905 458683 482340 480868 441047 370753 368576
14951 368576 373726 342366 284789 252983 266953 239421 239093 253433 298375 318546 286421 230809
14939 230809 227998 273082 264631 237442 225079 235059 242309 213292 179629 160019 147117 120660
14927 120660 137942 164016 172938 163145 95186 70149 78660 67998 53786 26171 41851 82095
14915 82095 55470 42619 9251 36459 64626 61418 -4637 8326 59265 83870 89235 71021
14903 71021 66138 62600 111880 117394 71286 139850 174500 203929 189844 175946 109580 79387
14891 79387 42379 11710 64169 85153 95153 89734 113363 154168 143575 137493 128971 78890
$$ packed form
14975A141185q0968p8090m4939n9474r0238l6440l8205q5131M91J0990L7615k5737
14963F51059K975r977k4003n0247m9440l4462k7222K3657j472l9821p0294k177
14951C68576N150l1360n7577l1806J3970k7532l28J4340M4942K0171l2125n5612
14939B30809k811M5084q451k7189j2363R980P250k9017l3663j9610j2902k6457
14927A20660J7282K6074Q922r793o7959k5037Q511j0662j4212k7615J5680M0244
14915H2095k6625j2851l3368K7208K8167l208o6055J2963N0939K4605N365j8214
14903G1021m883l538M9280N514m6108O8564L4650K9429j4085j3898o6366l0193
14891G9387l7008l0669N2459K0984J0000n419K3629M0805j0593o082q522n0081
$$ plain form
14879 78890 18672 18278 34129 47679 48848 47550 48255 74463 40137 -9600 28713 121415 100789
14866 100789 73161 55880 65675 65928 29670 -8138 -15307 12315 11363 -38021 -55173 -36273 -1688
14853 -1688 44629 26491 48568 78261 6094 18610 99790 69921 -38341 -57310 -36320 -41405
14841 -41405 -45541 -6638 -1429 17249 -25047 -34996 -69471 -61752 -45155 -36255 -20839 49661 61485
14828 61485 52257 103617 105353 45470 20332 2979 -34383 4075 61469 76109 65381 61988
14816 61988 46319 54796 33919 41976 50326 71278 120587 144276 86562 1070 -13066 -48617
14804 -48617 -1090 13692 1277 -25075 -53993 -56205 -26373 19857 -42317 -86776 -53923 -34981
14792 -34981 -735 22232 9870 -3107 21448 80342 87687 76021 11924 10813 61328 35191
$$ packed form
14879G8890o0218l94J5851J3550J169j298P05K6208l4326m9737L8313R2702k0626
14866A00789k7628j7281R795K53l6258l7808p169K7622r52m9384j7152J8900L4585
14853a688M6317j8138K2077K9693p2167J2516Q1180k9869j08262j8969K0990n085
14841d1405m136L8903N209J8678m2296r949l4475P719J6597Q900J5416P0500J1824
14828F1485r228N1360J736n9883k5138j7353l7362L8458N7394J4640j0728l393
14816F1988j5669Q477k0877Q057Q350K0952M9309K3689n7714q5492j4136l5551
14804d8617M7527J4782j2415k6352k8918k212K9832M6230o2174m4459L2853J8942
14792c4981L4246K2967j2362j2977K4555N8894P345j1666o4097j111N0515k6137
$$ plain form
14780 35191 -3753 -8067 -10817 -49622 -38469 -14526 -50032 -77422 -44755 -23834 -21665 -39714
14768 -39714 -13340 8469 2357 55935 118226 77004 101028 115260 94165 46612 37134 124613
14756 124613 119196 100716 74651 53680 74995 56858 18481 -48170 -12918 24105 5431 51946
14744 51946 110170 98919 50893 60445 63878 75135 66891 59408 49977 7930 -19659 -5259 -6696
14731 -6696 -42141 1525 54488 29652 68853 92054 82625 83331 60220 -3823 6440 18591
14719 18591 -12636 -20583 58669 92355 81312 59433 4000 -47043 -68437 -35048 -6500 -41607
14707 -41607 -24011 50179 116325 92547 32760 12357 -12581 73841 89809 87615 114780 119197
14695 119197 86440 79094 64295 71288 85413 50966 56015 69104 48186 -27027 -54558 -17758
$$ packed form
14780C5191l8944m314k750l8805J1153K3943l5506k7390L2667K0921K169j8049
14768c9714K6374K1809o112N3578O2291m1222K4024J4232k1095m7553r478Q7479
14756A24613n417j8480k6065k0971K1315j8137l8377o6651L5252L7023j8674M6515
14744E1946N8224j1251m8026R552L433J1257q244p483r431m2047k7589J4400j437
14731f696l5445M3666N2963k4836L9201K3201r429P06k3111o4043J0263J2151
14719A8591l1227p947P9252L3686j1043k1879n5433n1043k1394L3389K8548l5107
14707d1607J7596P4190O6146k3778n9787k0403k4938Q6422J5968k194K7165M417
14695A19197l2757p346j4799O993J4125l4447N049J3089k0918p5213k7531L6800
$$ plain form
14683 -17758 40231 51521 73214 84296 57854 18341 -758 -28848 -101899 -148845 -154506 -156386
14671 -156386 -105605 11391 89149 52271 103151 78888 46661 -13489 -29373 -15673 -3474
14660 -3474 22673 31177 52034 67140 22293 -32455 -79363 -106320 -104416 -121937 -126204 -142477
14648 -142477 -97047 -27279 -82522 -94761 -72808 -74482 -120070 -100127 -93644 -84520 -23403 5702
14636 5702 25844 102498 145951 107039 107851 45246 61344 76628 96459 62581 6677 -30810
14624 -30810 -57523 -43353 -12932 -24096 -54159 4298 62893 73495 41363 4372 -35232 -37611
14612 -37611 -13116 -18058 31159 23830 12787 9208 13409 29172 51805 110445 32687 12950
14600 12950 16118 13099 39239 18445 21779 -267 -1755 11641 50873 60830 29114 59456 70568
$$ packed form
14683a7758N7989J1290K1693J1082k6442l9513j9099k8090p3051m6946n661j880
14671a56386N0781J16996P7758l6878N0880k4263l2227o0150j5884J3700J2199
14660c474K6147Q504K0857J5106m4847n4748m6908k6957J904j7521m267j6273
14648a42477M5430O9768n5243j2239K1953j674m5588J9943O483R124O1117K9105
14636E702K0142P6654M3453l8912Q12o2605J6098J5284J9831l3878n5904l7487
14624c0810k6713J4170L0421j1164l0063N8457N8595J0602l2132l6991l9604k379
14612c7611K4495m942M9217p329j1043l579M201J5763K2633N8640p7758j9737
14600A2950L168l019K6140k0794L334k2046j488J3396L9232R957l1716L0342J1112
$$ plain form
14587 70568 103365 74406 -14383 9389 27778 51547 39030 27866 47394 58625 30714 16961
14575 16961 34791 99476 130201 87307 101529 185273 233310 231618 224998 224732 263408 436699
14563 436699 473593 475533 517764 513216 518915 549572 513498 477478 419303 298409 262433 240772
14551 240772 222491 230528 182202 151231 132499 93675 108104 74863 48481 57256 23060 59317
14539 59317 81713 66707 15031 12525 77734 88159 107237 74427 -10956 -39864 -11286 52654
14527 52654 103956 80617 54431 41716 24086 -25416 27421 105445 99137 82316 80933 88516
14515 88516 58520 34128 4588 -18018 2051 -33766 -51919 -32236 -27772 -51078 -23911 17520
14503 17520 67883 97461 50872 3289 20248 83205 76092 61060 64651 44363 50050 68252
$$ packed form
14587G0568L2797k8959q8789K3772J8389K3769j2517j1164J9528J1231k7911j3753
14575A6961J7830O4685L0725m2894J4222Q3744M8037j692o620k66L8676J73291
14563D36699L6894J940M2231m548N699L0657l6074l6020n8175j20894l5976k1661
14551B40772j8281Q037m8326l0971j8732l8824J4429l3241k6382Q775l4196L6257
14539E9317K2396j5006n1676k506O5209J0425J9078l2810q5383k8908K8578O3940
14527E2654N1302k3339k6186j2715j7630m9502N2837P8024o308j6821j383P583
14515H8516k9996k4392k9540k2606K0069l5817j8153J9683M464k3306K7167M1431
14503A7520N0363K9578m6589m7583J6959O2957p113j5032L591k0288N687J8202
$$ plain form
14491 68252 54111 53508 32146 42691 27045 55266 22814 -13212 -20327 -9727 26554 54000
14479 54000 13724 15571 10122 77550 176137 136962 71138 3099 37713 66167 32445 4768
14467 4768 65929 28241 16687 -17393 12611 71855 67494 81403 52301 9594 43272 106793
14455 106793 56719 28883 26676 30465 19738 34662 81991 76578 21584 60579 51250 38110
14443 38110 65340 82861 18458 -13223 36352 54834 34866 63896 83925 32313 61549 119494
14431 119494 196544 186696 255735 256312 291950 313844 269012 198366 162666 158709 188233 244968
14419 244968 273657 287836 284021 305291 368038 473832 572436 752368 900704 1050521 1194280
14408 1194280 1309943 1410115 1546751 1597661 1643332 1689506 1630186 1553644 1440881 1370000
$$ packed form
14491F8252j4141o03k1362J0545j5646K8221l2452l6026p115J0600L6281K7446
14479E4000m0276J847n449O7428R8587l9175o5824o8039L4614K8454l3722k7677
14467D768O1161l7688j1554l4080L0004N9244m361J3909k9102m2707L3678O3521
14455A06793n0074k7836k207L789j0727J4924M7329n413n4994L8995r329j3140
14443C8110K7230J7521o4403l1681M9575J8482j9968K9030K0029n1612K9236N7945
14431A19494P7050r848O9039N77L5638K1894m4832p0646l5700l957K9524N6735
14419B44968K8689J4179l815K1270O2747J05794R8604J79932J48336J49817J43759
14408A194280J15663J00172J36636N0910M5671M6174n9320p6542j12763p0881
$$ plain form
14398 1370000 1251566 1066275 853630 741942 656318 577049 490452 442657 446501 429052 416840
14387 416840 415911 337505 267707 246332 157725 167451 204441 223385 218772 143186 141176 128391
14375 128391 95470 132513 177909 146634 129411 147348 83688 68797 56838 83177 63602
14364 63602 82071 128645 153193 77046 -2096 -40522 -36214 -33604 -37389 -2672 43868 31930
14352 31930 18746 73118 27210 -14788 -12668 -23109 -9665 -6749 -39059 6978 58347 10551
14340 10551 -42919 3959 73109 79610 75224 58196 79196 98133 113966 152044 89050 93597
14328 93597 77775 34648 50431 60257 103042 139465 128759 68115 36625 9104 28125 75415
14316 75415 58361 70054 87644 63077 72267 88842 79563 22364 -20173 26876 51450 76823
$$ packed form
14398A370000j18434j85291k12645j11688q5624p9269q6597m7795L844j7449j2212
14387D16840r29p8406o9798k1375q8607R726L6990J8944m613p5586k010j2785
14375A28391l2921L7043M5396l1275j7223J7937o3660j4891j1959K6339j9575
14364F3602J8469M6574K4548p6147p9142l8426M308K610l785L4717M6540j1938
14352C1930j3184N4372m5908m1998K120j0441J3444K916l2310M6037N1369m7796
14340A0551n3470M6878O9150O501m386j7028K1000J8937J5833L8078o2994M547
14328I3597j5822m3127J5783R826M2785L6423j0706o0644l1490k7521J9021M7290
14316G5415j7054J1693J7590k4567R190J6575r279n7199m2537M7049K4574K5373
$$ plain form
14304 76823 89541 82968 119670 109254 161231 145848 147626 150204 64170 59351 88109 98283
14292 98283 59287 35767 49228 54574 66967 85043 79712 33227 9131 5616 63556 71067
14280 71067 49208 59083 59601 70427 36983 59092 20951 -57100 -41602 -25768 -61962 -93840
14268 -93840 -55460 2256 -4966 -1370 1010 25518 13150 38256 27356 25192 16491 15926 31871
14255 31871 31519 -8781 24518 76321 55580 63735 107783 185031 202893 172676 147582 148115 117526
14242 117526 87673 69317 102881 138208 120148 142344 111274 71953 64890 82203 74934 95369
14230 95369 146280 163676 170962 138240 102657 52524 94095 120434 119482 132409 124580 149128
14218 149128 197215 226196 229565 222769 263208 270486 287767 294112 300733 337586 355002 347198 308869
$$ packed form
14304G6823J2718o573L6702j0416N1977j5383J778K578q6034m819K8758J0174
14292I8283l8996k3520J3461N346J2393J8076n331m6485k4096l515N7940P511
14280G1067k1859R875N18J0826l3444K2109l8141p8051J5498J5834l6194l1878
14268i3840L8380N7716p222L596K380K4508j2368K5106j0900k164q701n65J5945
14255C1871l52m0300L3299N1803k0741Q155M4048P7248J7862l0217k5094N33l0589
14242A17526k9853j8356L3564L5327j8060K2196l1070l9321p063J7313p269K0435
14230I5369N0911J7396P286l2722l5583n0133M1571K6339r52J2927p829K4548
14218A49128M8087K8981L369o796M0439P278J7281O345O621L6853J7416p804l8329
$$ plain form
14205 308869 293431 254626 226916 214551 206596 164585 152899 160630 181809 147612 144071 135128
14193 135128 125150 126424 55510 92334 125258 160751 168430 194668 202851 170410 139371 130994
14181 130994 118143 134595 128748 177545 204538 232832 184898 160008 115068 83192 65211 74533
14169 74533 131743 126581 100804 53338 41284 116810 104914 134824 135308 89489 101928 90188
14157 90188 64057 82015 102066 112905 104965 106007 142182 139363 146123 140444 140683 167983 159550
14144 159550 150514 143336 189559 194401 192977 155782 140073 154965 140713 168414 192857 202555
14132 202555 213191 211941 170180 162580 133529 166052 182685 167515 137630 107347 77463 92745
14120 92745 121602 170774 233111 275110 329466 344887 332138 343993 321941 313335 324466 345348
$$ packed form
14205C08869j5438l8805k7710j2365p955m2011j1686P731K1179l4197l541q943
14193A35128r978J274p0914L6824L2924L5493P679K6238Q183l2441l1039q377
14181A30994j2851J6452n847M8797K6993K8294m7934k4890m4940l1876j7981R322
14169G4533N7210n162k5777m7466j2054P5526j1896K9910M84m5819J2439j1740
14157I0188k6131J7958K0051J0839p940J042L6175k819O760n679K39K7300q433
14144A59550r036p178M6223M842j424l7195j5709J4892j4252K7701K4443R698
14132B02555J0636j250m1761p600k9051L2523J6633j5170k9885l0283k9884J5282
14120I2745K8857M9172O2337M1999N4356J5421j2749J1855k2052q606J1131K0882
$$ plain form
14108 345348 344547 304173 304897 322951 382928 376923 365665 413296 401637 398407 394099 360201 405630
14095 405630 405397 381945 417721 422567 467909 525249 573421 649833 675962 656314 670423 700854
14083 700854 747664 756410 720718 677744 707503 781812 774954 708658 686585 706667 686756 720638
14071 720638 725466 708807 721217 750742 720572 695137 700143 664977 671471 691025 681430 724249
14059 724249 749121 754417 746761 768308 870855 961891 945600 906485 910540 913899 984580 1075654
14047 1075654 1084856 1084547 1068733 1112221 1131392 1139504 1197317 1215462 1224724 1167444 1176761 1245790
14035 1245790 1239643 1247889 1299106 1394542 1560266 1644657 1688692 1740279 1812005 1822446 1831265 1916649
14023 1916649 2035552 2201796 2378942 2540268 2697750 2901376 3030468 3054292 3091991 3023539
$$ packed form
14108C45348q01m0374P24J8054N9977o005j1258M7631j1659l230m308l3898M5429
14095D05630k33k3452L5776M846M5342N7340M8172P6412K6129j9648J4109L0431
14083G00854M6810Q746l5692m2974K9759P4309o858o6296k2073K0082j9911L3882
14071G20638M828j6659J2410K9525l0170k5435N006l5166O494J9554r595M2819
14059G24249K4872N296p656K1547J02547R1036j6291l9115M055L359P0681R1074
14047A075654R202l09j5814M3488J9171Q112N7813J8145R262n7280R317O9029
14035A245790o147Q246N1217R5436J65724Q4391M4035N1587P1726J0441Q819Q5384
14023A916649J18903J66244J77146J61326J57482K03626J29092K3824L7699o8452
$$ plain form
14013 3023539 2922631 2821368 2745145 2773909 2843332 2886240 2948490 3029467 3174373 3241460 3379458
14002 3379458 3534705 3662577 3781099 3898450 4084774 4267728 4466153 4716116 4961229
13993 4961229 5276901 5610365 5976887 6449057 6866331 7330247 7866655 8411387 8998692
13984 8998692 9656472 10462729 11347802 12382461 13584247 15042163 16806614 18873921 21275872
13975 21275872 24156964 27600131 31696806 36598009 42585862 50119526 59815535 72593829
13967 72593829 89323662 110636137 136524842 166411311 199164524 233317124 266500309
13960 266500309 295645107 317950358 331485455 335188773 328780929 313413028 291182878
13953 291182878 263896968 233727142 203415034 175421250 150821310 129748997 112168677
$$ packed form
14013C023539j00908j01263p6223K8764O9423M2908O2250Q0977J44906O7087J37998
14002C379458J55247J27872J18522J17351J86324J82954J98425K49963K45113
13993D961229L15672L33464L66522M72170M17274M63916N36408N44732N87305
13984H998692O57780Q06257Q85073J034659J201786J457916J764451K067307K401951
13975B1275872K881092L443167M096675M901203N987853P533664R696009J2778294
13967G2593829J6729833K1312475K5888705K9886469L2753213L4152600L3183185
13960B66500309K9144798K2305251J3535097L703318o407844j5367901k2230150
13953B91182878k7285910l0169826l0312108k7993784k4599940k1072313j7580320
$$ plain form
13946 112168677 97971624 86690213 77739508 70431796 64297565 59013338 54349686 50248347
13938 50248347 46662294 43452903 40538573 37938267 35562347 33410234 31554771 29875198
13930 29875198 28332085 26959661 25699319 24480402 23384551 22379444 21433154 20598902
13922 20598902 19792339 19017827 18220633 17508239 16923726 16331283 15668160 15089127 14571224
13913 14571224 14082936 13616230 13228935 12775252 12319598 11934277 11630446 11276714 10938122
13904 10938122 10594117 10246620 9983962 9653465 9379201 9115115 8872589 8604338 8283173
13895 8283173 7990172 7832818 7677289 7464162 7218628 7029383 6865987 6627594 6467406
13886 6467406 6292124 6101573 5927664 5751475 5548053 5382310 5241895 5090817 4918408
$$ packed form
13946A12168677j4197053j1281411q950705p307712o134231n284227m663652m101339
13938E0248347l586053l209391k914330k600306k375920k152113j855463j679573
13930B9875198j543113j372424j260342j218917j095851j005107r46290q34252
13922B0598902q06563p74512p97194p12394n84513n92443o63123n79033n17903
13913A4571224m88288m66706l87295m53683m55654l85321l03831l53732l38592
13904A0938122l44005l47497k62658l30497k74264k64086k42526k68251l21165
13895H283173k93001j57354j55529k13127k45534j89245j63396k38393j60188
13886F467406j75282j90551j73909j76189k03422j65743j40415j51078j72409
$$ plain form
13877 4918408 4756687 4611762 4537763 4449506 4368774 4237378 4081435 3951945 3831421 3772259
13867 3772259 3737769 3639494 3560838 3482633 3408889 3313503 3241843 3167321 3046355 2959611 2948659
13856 2948659 2924658 2801225 2727386 2644745 2554568 2483801 2375286 2270900 2146634 2017143
13846 2017143 1878327 1810202 1777277 1682463 1642499 1528437 1446503 1347584 1366437 1346805 1308769
13835 1308769 1355293 1332109 1291749 1249315 1222319 1250871 1188519 1130448 1120455 1083468 1051972
13824 1051972 1026499 949820 939853 943987 897187 833626 822117 826596 795055 732313 786458 798821
13812 798821 732717 722347 706048 715962 739949 752021 745487 706614 655582 679349 672382 663128
13800 663128 628370 631845 693736 690616 672345 668836 650531 582999 567031 595196 612747 586244
$$ packed form
13877D918408j61721j44925p3999q8257q0732j31396j55943j29490j20524n9162
13867C772259l4490r8275p8656p8205p3744r5386p1660p4522j20966q6744j0952
13856B948659k4001j23433p3839q2641r0177p0767j08515j04386j24266j29491
13846B017143j38816o8125l2925r4814l9964j14062q1934r8919J8853j9632l8036
13835A308769M6524k3184m0360m2434k6996K8552o2352n8071r993l6987l1496
13824A051972k5473p6679r967M134m6800o3561j1509M479l1541o2742N4145J2363
13812G98821o6104j0370j6299R914K3987J2072o534l8873n1032K3767o967r254
13800F63128l4758L475O1891l120j8271l509j8305o7532j5968K8165J7551k6503
$$ plain form
13788 586244 563354 570729 587350 613178 607672 607380 579882 558952 508473 478006 519797 587746
13776 587746 598099 559761 554489 585508 580331 508113 476449 471454 455048 478767 527860 537857
13764 537857 534444 491998 452482 477684 505613 525817 532745 509507 529335 532407 488790 453898
13752 453898 454140 508069 480116 492416 568722 612354 546547 488109 504677 508242 448293 388691
13740 388691 404884 388932 366043 352125 367884 422314 348983 317944 348567 340637 343439 415485
13728 415485 475885 441693 415040 423360 387277 335574 346430 419235 439045 425764 418768 400826
13716 400826 358589 370871 355551 362240 321982 332192 340690 445417 493911 422449 375946 359993
13704 359993 281632 212127 174386 155933 150475 162176 199747 217325 199035 211137 197731 174637
$$ packed form
13788E86244k2890P375J6621K5828n506k92k7498k0930n0479l0467M1791O7949
13776E87746J0353l8338n272L1019n177p2218l1664m995j6406K3719M9093R997
13764E37857l413m2446l9516K5202K7929K0204O928k3238J9828L072m3617l4892
13752D53898K42N3929k7953J2300P6306M3632o5807n8438J6568L565n9949n9602
13740C88691J6193j5952k2889j3918J5759N4430p3331l1039L0623p930K802P2046
13728D15485O0400l4192k6653Q320l6083n1703J0856P2805J9810j3281o996j7942
13716D00826m2237J2282j5320O689m0258J0210Q498J04727M8494p1462m6503j5953
13704C59993p8361o9505l7741j8453n458J1701L7571J7578j8290J2102j3406k3094
$$ plain form
13692 174637 168895 135388 126774 116381 161680 197669 214340 156657 101439 100115 132291 155230
13680 155230 163309 156370 136031 148989 161831 166879 188818 183589 219771 232893 250826 271358
13668 271358 281667 210996 175303 183950 214208 206217 205765 228223 195066 180311 213362 217063
13656 217063 203409 232735 255363 242763 231674 239784 253448 235702 213961 202049 252179 263092
13644 263092 172205 160207 187890 170433 160348 179940 252513 272164 162894 152736 182100
13633 182100 169275 204694 203377 179145 176788 185598 195743 169022 138040 97782 41032 -5996
13621 -5996 31144 34927 44421 90142 111444 128343 89417 15216 25675 54574 53963 67576 105086
13608 105086 166962 201432 156998 155688 223309 207365 178911 210350 249377 230922 164374 134516
$$ packed form
13692A74637n742l3507q614j0393M5299L5989J6671n7683n5218j324L2176K2939
13680A55230Q079o939k0339J2958J2842N048K1939n229L6182J3122J7933K0532
13668B71358J0309p0671l5693Q647L0258p991m52K2458l3157j4755L3051L701
13656B17063j3654K9326K2628j2600j1089Q110J3664j7746k1741j1912N0130J0913
13644B63092r0887j1998K7683j7457j0085J9592P2573J9651j09270j0158K9364
13633A82100j2825L5419j317k4232k357Q810J0145k6721l0982m0258n6750m7028
13621e996L7140L783R494M5721K1302J6899l8926p4201J0459K8899o11J3613L7510
13608A05086O1876L4470m4434j310O7621j5944k8454L1439L9027j8455o6548k9858
$$ plain form
13596 134516 147940 89005 43108 30167 47979 92210 124882 143125 115876 108751 41441 19624
13584 19624 19830 97997 94058 110795 149359 235348 193907 106304 55730 72058 92188 93399
13572 93399 91050 64698 93298 83433 120941 97803 83255 83786 111445 124503 120853 111266 147894
13559 147894 121967 56703 25178 42881 46596 64951 83508 115787 118057 119752 85832 76054
13547 76054 64504 83583 109101 144268 146759 105554 92361 90250 90665 122630 166907 155270
13535 155270 149590 171824 134303 133942 154470 126726 109596 122392 183878 138059 78409 164465
13523 164465 234360 252252 258787 252516 254888 315381 373053 419188 475405 584752 723524 833415
13511 833415 946381 1103855 1283123 1512615 1662726 1793499 1858174 1864805 1840704 1772415
$$ packed form
13596A34516J3424n8935m5897j2941J7812M4231L2672J8243k7249p125o7310k1817
13584A9624K06P8167l939J6737L8564Q5989m1441q7603n0574J6328K0130J211
13572I3399k349k6352K8600r865L7508k3138j4548N31K7659J3058l650r587L6628
13559A47894k5927o5264l1525J7703L715J8355J8557L2279K270J695l3920r778
13547G6054j1550J9079K5518L5167K491m1205j3193k111M15L1965M4277j1637
13535A55270n680K2234l7521l61K0528k7744j7130J2796O1486m5819n9650Q6056
13523A64465O9895J7892O535o271K372O0493N7672M6135N6217J09347J38772J09891
13511H33415J12966J57474J79268K29492J50111J30773O4675O631k4101o8289
$$ plain form
13501 1772415 1681882 1477804 1315397 1227781 1047398 878372 770351 702521 657764 613262
13491 613262 572562 538008 516050 479779 403477 364544 406895 399633 357400 321074 309196 329825
13479 329825 321240 318830 305347 266631 218863 158047 145967 139906 138503 144483 98362 149893
13467 149893 207353 198574 179943 202799 196583 228017 234433 223091 205994 220387 229767 235455
13455 235455 299473 253717 222126 228112 207747 264874 302685 250654 218921 222085 132028 99268
13443 99268 182149 248129 233397 166973 159231 144341 109912 86757 94590 9555 8768 1391 9091
13430 9091 8358 42914 81496 95474 92035 109169 117975 35947 41760 17744 -30301 -46500 23665
13417 23665 63400 33347 22662 -9636 -1435 89975 119519 109586 116088 146680 116105 109329
$$ packed form
13501A772415r0533k04078j62407q7616j80383j69026j08021o7830m4757m4502
13491F13262m0700l4554k1958l6271p6302l8933M2351p262m2233l6326j1878K0629
13479C29825q585k410j3483l8716m7768o0816j2080o061j403N980m6121N1531
13467A49893N7460q779j8631K2856o216L1434O416j1342j7097J4393R380N688
13455B35455O4018m5756l1591N986k0365N7127L7811n2031l1733L164r0057l2760
13443I9268Q2881O5980j4732o6424p742j4890l4429k3155P833q5035p87p377P700
13430I091p33L4556L8582J3978l439J7134Q806q2028N813k4016m8045j6199P0165
13417B3665L9735l0053j0685l2298Q201R1410K9544r933O502L0592l0575o776
$$ plain form
13405 109329 136426 96224 124281 89117 115527 60771 30760 52745 72281 101671 119204
13394 119204 122247 102118 58546 92382 37768 -19838 23118 68680 65609 26974 -10112 -37832
13382 -37832 42995 71769 44826 -18200 -18404 -6898 31702 69916 87499 57254 84867 94559
13370 94559 82974 23065 -48426 -30742 9191 36095 55802 44093 -397 28229 102459 107784
13358 107784 64954 25226 47988 48055 56104 88301 78151 57466 68307 71687 41478 19851
13346 19851 63039 109758 148060 119194 103470 139301 107917 67893 42192 -2714 -29922 -26751
13334 -26751 -33639 -57469 -37390 -25644 -22393 41937 57859 45758 -23695 -29349 7292 17167
13322 17167 -11449 13787 44139 73588 59627 -1281 -28419 19207 41689 47069 29527 -16614
$$ packed form
13405A09329K7097m0202K8057l5164K6410n4756l0011K1985J9536K9390J7533
13394A19204L043k0129m3572L3836n4614n7606M2956M5562l071l8635l7086k7720
13382c7832Q0827K8774k6943o3026k04J1506L8600L8214J7583l0245K7613R692
13370I4559j1585n9909p1491J7684L9933K6904J9707j1709m4490K8626P4230N325
13358A07784m2830l9728K2762O7Q049L2197j0150k0685J0841L380l0209k1627
13346A9851M3188M6719L8302k8866j5724L5831l1384m0024k5701m4906k7208L171
13334b6751o888k3830K0079J1746L251O4330J5922j2101o9453n654L6641R875
13322A7167k8616K5236L0352K9449j3961o0908k7138M7626K2482N380j7542m6141
$$ plain form
13310 -16614 52775 67635 46629 62575 88653 134632 114751 134623 131021 136587 99992 121217
13298 121217 166365 108378 114866 129548 149603 188172 197922 155507 134251 96399 61700 119448
13286 119448 111399 98360 90573 180385 200351 207146 225245 192841 134361 115542 119165 69521
13274 69521 91009 118432 48637 64064 123599 160088 145463 89502 73586 75472 100099 41092
13262 41092 37242 70391 39166 20001 23025 67991 37776 6909 47436 55126 20763 38996
13250 38996 96024 103022 95650 58356 39937 5145 -20841 -27654 18939 5964 -18161 22279
13238 22279 37069 72534 82222 63613 46950 61487 61795 2995 9548 8288 -31589 -45758 -37495
13225 -37495 -3285 -32609 -52232 -23072 57389 60049 80118 119296 94976 92157 91244 52684
$$ packed form
13310a6614O9389J4860k1006J5946K6078M5979j9881J9872l602N566l6595K1225
13298A21217M5148n7987O488J4682K0055L8569R750m2415k1256l7852l4699N7748
13286A19448q049j3039p787Q9812J9966O795J8099l2404n8480j8819L623m9644
13274F9521K1488K7423o9795J5427N9535L6489j4625n5961j5916J886K4627n9007
13262D1092l850L3149l1225j9165L024M4966l0215l0867M0527P690l4363J8233
13250C8996N7028O998p372l7294j8419l4792k5986o813M6593j2975k4125M0440
13238B2279J4790L5465R688j8609j6663J4537L08n8800O553j260l9877j4169Q263
13225c7495L4210k9324j9623K9160Q0461K660K0069L9178k4320k819r13l8560
$$ plain form
13213 52684 37595 -10776 -36967 -32139 7770 3772 28086 1989 39465 53429 47289 69131
13201 69131 121247 91390 63143 4498 15198 2065 -9890 -19762 -29426 -18759 -21179 -12610
13189 -12610 -37873 -49120 -53187 -83145 -96153 -22961 106020 163202 119306 91214 79086 34120
13177 34120 6522 -46476 -9406 19131 15656 23080 37214 13364 20414 34393 20873 -6137
13165 -6137 22240 65179 57228 50215 36732 3894 43425 36228 -48396 -71509 6910 131818
13153 131818 178503 87639 24516 10042 -57079 -42111 18266 11960 -29624 -2524 39101 60813
13141 60813 1985 -48940 -106088 -106145 -40885 2734 20314 -5165 13603 26151 -3183 -48041
13129 -48041 -19148 -23622 9624 63047 101399 111760 72643 18713 -1651 18309 24965 15238
$$ packed form
13213E2684j5089m8371k6191M828L9909l998K4314k6097L7476J3964o140K1842
13201F9131N2116k9857k8247n8645J0700j3133j1955r872r664J0667k420Q569
13189a2610k5263j1247m067k9958j3008P3192J28981N7182m3896k8092j2128m4966
13177C4120k7598n2998L7070K8537l475P424J4134k3850P050J3979j3520k7010
13165f137K8377M2939p951p013j3483l2838L9531p197q4624k3113P8419J24908
13153A31818M6685r0864o3123j4474o7121J4968O0377o306m1584K7100M1625K1712
13141F0813n8828n0925n7148n7O5260M3619J7580k5479J8768J2548k9334m4858
13129d8041K8893m474L3246N3423L8352J0361l9117n3930k0364J9960O656r727
$$ plain form
13117 15238 -14038 25063 14307 24857 27990 -13762 -46302 -23154 -15888 -57361 -54258 -28147
13105 -28147 -16447 -79284 -70958 -66258 -73770 -19571 -4390 -5792 35692 53217 50147 29907 50450
13092 50450 85453 69396 80269 94017 86141 62887 -2149 -40003 -20932 -13948 17378 29527
13080 29527 23479 28618 54074 41444 44493 172 -32932 29303 54357 60055 91706 54396
13068 54396 34263 38383 65246 25714 -35064 -15895 237 -24992 -8216 2949 -15001 17704
13056 17704 65224 17943 59675 108199 79606 86202 68439 19115 -19029 -8769 15424 20745
13044 20745 51713 64638 136601 82145 48595 74878 7520 118220 142005 45805 -4236
13033 -4236 -7777 -8644 -19226 -22313 9835 38189 20669 5033 45459 17000 5758 -22085 -39434
$$ packed form
13117A5238k9276L9101j0756J0550L133m1752l2540K3148P266m1473L103K6111
13105b8147J1700o2837Q326M700p512N4199J5181j402M1484J7525l070k0240K0543
13092E0450L5003j6057J0873J3748p876k3254o5036l7854J9071O984L1326J2149
13080B9527o048N139K5456j2630L049m4321l3104O2235K5054N698L1651l7310
13068E4396k0133M120K6863l9532o0778J9169J6132k5229J6776J1165j7950L2705
13056A7704M7520m7281M1732M8524k8593O596j7763m9324l8144J0260K4193N321
13044B0745L0968J2925P1963n4456l3550K6283o7358J10700K3785r6200n0041
13033d236l541q67j0582l087L2148K8354j7520j5636M0426k8459j1242k7843j7349
$$ plain form
13020 -39434 -23808 33412 51608 69018 77412 40292 -11599 -22063 -39416 -10113 38756 61000
13008 61000 32946 5156 -13961 -15255 -50073 -28868 73740 95828 90408 68510 48479 58533
12996 58533 3799 31732 109865 116994 85750 1974 2968 65051 80121 65739 51726 25930
12984 25930 43172 4788 -43322 -97088 -109467 -55626 -34929 -17675 -26346 5062 4072 48879
12972 48879 44440 67662 82527 36336 9840 35367 90241 115325 130806 80776 52918 5292
12960 5292 62356 102139 128923 123583 100558 93770 89610 56376 1368 -9994 -41948 -36017 29571
12947 29571 36040 10561 2583 8982 1526 467 9939 17228 31941 13438 48863 26924 -35633
12934 -35633 -55932 -7930 53802 47864 -4846 -19154 15427 27255 49082 37549 29569 44785
$$ packed form
13020c9434J5626N7220J8196J7410Q394l7120n1891j0464j7353K9303M8869K2244
13008F1000k8054k7790j9117j294l4818K1205J02608K2088n420k1898k0031J0054
12996E8533n4734K7933P8133P129l1244q3776R94O2083J5070j4382j4013k5796
12984B5930J7242l8384m8110n3766j2379N3841K0697J7254q671L1408r90M4807
12972D8879m439K3222J4865m6191k6496K5527N4874K5084J5481n0030k7858m7626
12960E292N7064L9783K6784n340k3025o788m160l3234n5008j1362l1954N931O5588
12947B9571O469k5479p978O399p456j059R472P289J4713j8503L5425k1939o2557
12934c5633k0299M8002O1732n938n2710j4308L4581J1828K1827j1533p980J5216
$$ plain form
12922 44785 43617 17329 67476 123699 135827 69911 58042 77670 40862 75859 96874 117287
12910 117287 122270 107733 83476 36722 41306 66612 52141 67591 71551 78329 47862 30879
12898 30879 22139 13799 41872 12427 14100 69314 150887 190107 172604 175359 130750 118878
12886 118878 77367 114731 117385 153380 137069 104812 107070 131042 121425 154663 184992 231374
12874 231374 259466 197046 163101 142703 79063 118805 126870 87022 81050 83638 138094 183881
12862 183881 187919 107258 42666 4073 4084 47948 114774 117354 56465 -9253 -35526 41654
12850 41654 28552 -29395 -28885 70407 120904 79427 56953 79004 89272 130271 98169 29415
12838 29415 -3732 -36393 -66975 -72819 -1834 53643 44559 91478 103840 103300 107800 64249 46823
$$ packed form
12922D4785j168k6288N0147N6223J2128o5916j1869J9628l6808L4997K1015K0413
12910A17287M983j4537k4257m6754M584K5306j4471J5450L960O778l0467j6983
12898C0879q740q340K8073k9445J673N5214Q1573L9220j7503K755m4609j1872
12886A18878m1511L7364K654L5995j6311l2257K258K3972r617L3238L0329M6382
12874B31374K8092o2420l3945k0398o3640L9742Q065l9848n972K588N4456M5787
12862A83881M038q0661o4592l8593J1M3864O6826K580o0889o5718k6273P7180
12850D1654j3102n7947N10R9292N0497m1477k2474K2051J0268M0999l2102o8754
12838B9415l3147l2661l0582n844P0985N5477r084M6919J2362n40M500m3551j7426
$$ plain form
12825 46823 29814 65120 74871 37494 51997 71549 47415 56954 84346 69622 35413 -12629
12813 -12629 12664 62206 91060 56874 91995 65903 32430 84076 128422 151345 166138 158153
12801 158153 167999 175454 142435 113764 90056 147060 149128 160629 149358 168536 171813 200455
12789 200455 151611 144012 156178 165831 147063 127742 113162 104047 106260 88199 87361 90465 88831
12776 88831 64843 53782 -18504 -53273 16975 76224 120762 115913 123784 87558 119772 163181
12764 163181 143455 129404 179979 208413 204406 182995 147414 106168 60852 48259 33761 50612
12752 50612 87099 108415 64193 47431 6751 674 56150 51462 5528 -59374 -31517 9581
12740 9581 8986 23618 21162 55904 60479 60830 105453 128375 150426 166664 171157 181150 172654 144271
$$ packed form
12825D6823j7009L5306R751l7377J4503J9552k4134R539K7392j4724l4209m8042
12813a2629K5293M9542K8854l4186L5121k6092l3473N1646M4346K2923J4793p985
12801A58153R846P455l3019k8671k3708N7004K068J1501j1271J9178L277K8642
12789B00455m8844p599J2166R653j8768j9321j4580r115K213j8061q38L104j634
12776H8831k3988j1061p2286l4769P0248N9249M4538m849P871l6226L2214M3409
12764A63181j9726j4051N0575K8434m007k1411l5581m1246m5316j2593j4498J6851
12752E0612L6487K1316m4222j6762m0680o077N5476m688m5934o4902K7857M1098
12740I581n95J4632k456L4742M575L51M4623K2922K2051J6238M493R993q496k8383
$$ plain form
12726 144271 221171 301411 293929 368418 505713 643646 805396 1011929 1173334 1337101
12716 1337101 1561338 1827282 1997795 2105711 2157977 2072097 1982094 1852326 1653840 1445451
12706 1445451 1222188 989130 886798 790056 703674 621155 531212 450463 443410 392280 392537
12695 392537 387217 373108 315058 301718 287827 293444 243913 180175 190016 186816 218151 216049
12683 216049 207600 244531 271238 211075 173923 152455 180008 167248 167798 178174 147218 133095
12671 133095 125357 150418 192495 187876 142224 143920 191175 201928 213611 217725 224707 202492
12659 202492 203845 206860 225936 241679 237137 249882 251335 223866 206675 193340 178143 205818
12647 205818 150729 149890 145174 174946 145780 136523 200904 194979 135728 122482 95626 175089
$$ packed form
12726A44271P6900Q0240p482P4489J37295J37933J61750K06533J61405J63767
12716A337101K24237K65944J70513J07916N2266q5880r0003j29768j98486k08389
12706A445451k23263k33058j02332r6742q6382q2519q9943q0749p053n1130K57
12695C92537n320j4109n8050j3340j3891N617m9531o3738R841l200L1335k102
12683B16049q449L6931K6707o0163l7152k1468K7553j2760N50J0376l0956j4123
12671A33095p738K5061M2077m619m5652J696M7255J0753J1683M114O982k2215
12659B02492J353L015J9076J5743m542J2745J453k7469j7191j3335j5197K7675
12647B05818n5089q39m716K9772k9166r257O4381n925n9251j3246k6856P9463
$$ plain form
12635 175089 257277 237293 186042 152056 168272 181962 139427 172935 168594 93586 80844 103074
12623 103074 102780 105871 181816 164009 145711 140076 202365 215508 164395 129634 113506 109638
12611 109638 187972 194241 205307 154943 128717 108513 88378 95297 114207 132568 168602 149575
12599 149575 107506 119175 168910 158627 141302 153992 164250 175524 177516 166017 198445 177990
12587 177990 222467 257882 278876 300470 265892 254271 243697 215793 178712 246560 347714
12576 347714 454095 489619 460224 468713 490513 507508 491042 457418 408196 451668 432131
12565 432131 418369 422658 425668 423362 460769 512946 536226 564958 588284 599746 583608 597686
12553 597686 649956 675664 661424 719313 803161 829716 819394 859729 874759 786269 698337
$$ packed form
12635A75089Q2188j9984n1251l3986J6216J3690m2535L3508m341p5008j2742K2230
12623A03074k94L091P5945j7807j8298n635O2289J3143n1113l4761j6128l868
12611A09638P8334O269J1066n0364k6226k0204k0135O919J8910J8361L6034j9027
12599A49575m2069J1669M9735j0283j7325J2690J0258J1274J992j1499L2428k0455
12587A77990M4477L5415K0994K1594l4578j1621j0574k7904l7081O7848J01154
12576C47714J06381L5524k9395Q489K1800J6995j6466l3624m9222M3472j9537
12565D32131j3762M289L010k306L7407N2177K3280K8732K3326J1462j6138J4078
12553E97686N2270K5708j4240N7889Q3848K6555j0322M0335J5030q8490q7932
$$ plain form
12542 698337 683200 740281 765591 800005 794537 832768 914848 930781 1009973 1200384 1410801
12531 1410801 1477812 1364937 1354709 1373352 1217528 1116697 1064165 976843 936078 907733 838769
12520 838769 726123 696161 687665 668101 651213 629581 651168 752999 719097 676712 579907
12509 579907 605156 703907 759083 767285 841771 907221 964761 1000511 1038161 1097936 1152408 1158895
12497 1158895 1152908 1059492 921389 860523 806454 799949 841771 843100 814493 767007 747263 737740
12485 737740 697203 617680 584806 539850 536911 536050 554125 539951 480938 369031 382185 400924
12473 400924 443882 430892 405352 470327 440333 393353 391796 387177 399615 428169 428101 376696
12461 376696 339313 326995 361475 424707 445178 477577 450343 428152 459552 462707 455935 465243
$$ packed form
12542F98337j5137N7081K5310L4414n468L8231Q2080J5933P9192J90411K10417
12531A410801O7011j12875j0228J8643j55824j00831n2532q7322m0765k8345o8964
12520H38769j12646k9962q496j9564j6888k1632K1587J01831l3902m2385r6805
12509E79907K5249R8751N5176Q202P4486O5450N7540L5750L7650N9775N4472O487
12497A158895n987r3416j38103o0866n4069o505M1822J329k8607m7486j9744r523
12485G37740m0537p9523l2874m4956k939q61J8075j4174n9013j11907J3154J8739
12473D00924M2958j2990k5540O4975k9994m6980j557m619J2438K8554o8n1405
12461C76696l7383j2318L4480O3232K0471L2399k7234k2191L1400L155o772R308
$$ plain form
12449 465243 517788 570465 516347 470263 483196 455580 475512 468133 444525 504855 508026 453518
12437 453518 462919 527580 520831 523155 455618 450561 509970 524689 516713 563641 607661 668305
12425 668305 737449 838014 830651 866713 895991 892668 853326 767009 711862 744371 763144 753396
12413 753396 724337 628058 610026 630273 685410 714685 758729 861036 935260 951404 969940
12402 969940 1033556 1051157 1092031 1199039 1272606 1469345 1622031 1834694 2107317 2355447
12392 2355447 2595093 2815087 2928558 3004545 3043630 2971328 2781955 2584818 2405363 2272006
12382 2272006 2110602 1957888 1827148 1691233 1700808 1702401 1600845 1567884 1554131 1524048 1472387
12371 1472387 1476659 1484406 1483918 1524924 1557046 1559215 1559121 1595111 1687020 1718644 1752756 1810628 1869990
$$ packed form
12449D65243N2545N2677n4118m6084J2933k7616J9932p379k3608O0330L171n4508
12437D53518R401O4661o749K324o7537n057N9409J4719p976M6928M4020O0644
12425F68305O9144J00565p363L6062K9278l323l9342q6317n5147L2509J8773r748
12413G53396k9059r6279j8032K0247N5137K9275M4044J02307P4224J6144J8536
12402I69940O3616J7601M0874J07008P3567J96739J52686K12663K72623K48130
12392B355447K39646K19994J13471P5987L9085p2302j89373j97137j79455j33357
12382B272006j61404j52714j30740j35915R575J593j01556l2961j3753l0083n1661
12371A472387M272P747m88M1006L2122K169r4L5990R1909L1624L4112N7872N9362
$$ plain form
12358 1869990 1843740 1739056 1679248 1612709 1531370 1498559 1503490 1537414 1604131 1750644 1851308
12347 1851308 1984146 2089733 2198100 2380362 2440590 2521916 2691480 2920009 3107200 3371203
12337 3371203 3646040 3968029 4337518 4812005 5275700 5771978 6195877 6552856 6823217
12328 6823217 7009829 7214931 7388555 7545873 7746997 8067766 8599652 9384485 10409519
12319 10409519 11761802 13500036 15573028 17938769 20625668 23637625 26900053 30436662
12311 30436662 34332858 39021155 45149756 53656901 66012388 84155142 110045272 144495292
12303 144495292 186424565 233696559 283518118 331386445 371437302 398653848 409959648
12296 409959648 403952969 382039377 348570014 307362754 261392620 216146899 177065329
$$ packed form
12358A869990k6250j04684n9808o6539q1339l2811M931L3924O6717J46513J00664
12347A851308J32838J05587J08367J82262O0228Q1326J69564K28529J87191K64003
12337C371203K74837L21989L69489M74487M63695M96278M23899L56979K70361
12328F823217J86612K05102J73624J57318K01124L20769N31886P84833J025034
12319A0409519J352283J738234K072992K365741K686899L011957L262428L536609
12311C0436662L896196M688297O128601Q507145J2355487J8142754K5890130L4450020
12303A44495292M1929273M7271994M9821559M7868327M0050857K7216546J1305800
12296D09959648o006679k1913592l3469363m1207260m5970134m5245721l9081570
$$ plain form
12289 177065329 145250432 119932981 100905514 87518253 78180845 71385137 66094836
12282 66094836 61590358 57473283 53656941 50051101 46566273 43158329 39910214 36987233
12274 36987233 34382128 32114947 30056553 28323460 26761129 25338425 24083352 23019813
12266 23019813 22101916 21207956 20345646 19517001 18731780 18005317 17340335 16677801 16070950
12257 16070950 15535086 15012544 14449764 13852297 13294991 12808837 12314281 11839049 11397344
12248 11397344 11050299 10680924 10394577 10104546 9747132 9410826 9113673 8804101 8510901
12239 8510901 8311059 8059325 7780703 7494629 7165543 6874778 6642587 6457932 6307695
12230 6307695 6091052 5869188 5645895 5528210 5372902 5280033 5200961 5091954 4993207 4877879
$$ packed form
12289A77065329l1814897k5317451j9027467j3387261r337408o795708n290301
12282F6094836m504478m117075l816342l605840l484828l407944l248115k922981
12274C6987233k605105k267181k058394j733093j562331j422704j255073j063539
12266B3019813r17897q93960q62310q28645p85221p26463o64982o62534o06851
12257A6070950n35864n22542n62780n97467n57306m86154m94556m75232m41705
12248A1397344l47045l69375k86347k90031l57414l36306k97153l09572k93200
12239H510901j99842k51734k78622k86074l29086k90765k32191j84655j50237
12230F307695k16643k21864k23293j17685j55308r2869p9072j09007r8747j15328
$$ plain form
12220 4877879 4751746 4625027 4475661 4284933 4135114 4051120 3935171 3845860 3776534 3672428
12210 3672428 3574909 3519213 3440684 3378753 3284904 3193704 3141965 3093635 3011873 2946309 2897826
12199 2897826 2835842 2772404 2670955 2580043 2536201 2552211 2511288 2416636 2256629 2116091 2003861
12188 2003861 1948921 1813251 1722776 1669517 1544485 1472736 1468804 1417738 1326892 1303456 1263830
12177 1263830 1234875 1261702 1238114 1190048 1126933 1094788 1094888 1081708 1017821 991424 996454 1018316
12165 1018316 940046 909095 905940 876731 853444 822920 807526 766772 745391 779324 748998
12154 748998 706779 724019 702604 706220 658587 620659 679725 691321 693685 688673 691362 664455
12142 664455 649265 636898 639684 652564 685260 663569 637162 611917 607819 567135 553226 539533
$$ packed form
12220D877879j26133j26719j49366j90728j49819q3994j15949q9311o9326j04106
12210C672428r7519n5696p8529o1931r3849r1200n1739m8330q1762o5564m8483
12199B897826o1984o3438j01449r0912m3842J6010m0923r4652j60007j40538j12230
12188B003861n4940j35670r0475n3259j25032p1749l932n1066r0846k3436l9626
12177A263830k8955K6827k3588m8066o3115l2145J00j3180o3887k6397N030K1862
12165A018316p8270l0951l155k9209k3287l0524j5394m0754k1381L3933l0326
12154G48998m2219J7240k1415L616m7633l7928N9066J1596K364n012K689k6907
12142F64455j5190j2367K786J2880L2696k1691k6407k5245m098m0684j3909j3693
$$ plain form
12130 539533 543021 516179 501121 511526 516632 541309 502139 542040 612579 633790 635531 616941
12118 616941 608612 560576 538937 531224 553262 547105 525064 477927 501038 530555 550211 549377
12106 549377 510929 519655 575709 621198 602139 589122 540309 514037 556929 537661 504767 498185
12094 498185 492907 549233 598253 612803 578011 654031 676572 627423 538739 487245 451111 508321
12082 508321 585818 608058 512889 518365 512715 485177 436985 393542 369874 372634 437314 457034
12070 457034 490124 529943 583356 626658 625639 686989 697175 648767 621369 561877 513123 517676
12058 517676 508737 447014 456175 500981 473497 420206 441535 456717 470271 462037 430097 421175
12046 421175 397215 344736 313923 331246 310493 302675 312217 274845 273082 285662 305578 296434
$$ packed form
12130E39533L488k6842j5058J0405N106K4677l9170L9901P0539K1211J741j8590
12118F16941q329m8036k1639p713K2038o157k2041m7137K3111K9517J9656q34
12106E49377l8448Q726N6054M5489j9059j3017m8813k6272M2892j9268l2894o582
12094D98185n278N6326M9020J4550l4792P6020K2541m9149q8684n1494l6134N7210
12082E08321P7497K2240r5169N476n650k7538m8192m3443k3668K760O4680J9720
12070D57034L3090L9819N3413M3302j019O1350J0186m8408k7398n9492m8754M553
12058E17676q939o1723R161M4806k7484n3291K1329J5182J3554q234l1940q922
12046D21175k3960n2479l0813J7323k0753p818R542l7372j763J2580J9916r144
$$ plain form
12034 296434 193518 131086 132491 176278 204915 198718 167864 224062 264052 292335 275536 287804
12022 287804 289186 230789 217480 181587 185779 220594 228994 265787 294471 275668 252710 238034
12010 238034 263225 284121 238295 203476 202057 243568 275549 296883 265081 243634 260993 243916
11998 243916 233583 254833 277838 278753 229988 195633 243634 258701 225510 232879 201288 200856
11986 200856 244370 253059 193737 165739 158406 166028 154339 91487 37349 113304 202942 244700
11974 244700 251538 184160 156993 158599 249615 246018 205274 163259 145920 104938 86044 129877
11962 129877 162300 188744 203753 237661 210154 227902 265212 283306 289142 256333 176817 202566
11950 202566 178801 149190 146369 143992 161628 179420 190916 222367 156549 131935 171039 174691
$$ packed form
12034B96434j02916o2432J405M3787K8637o197l0854N6198L9990K8283j6799J2268
12022B87804J382n8397j3309l5893M192L4815Q400L6793K8684j8803k2958j4676
12010B38034K5191K0896m5826l4819j419M1511L1981K1334l1802k1447J7359j7077
11998B43916j0333K1250K3005R15m8765l4355M8001J5067l3191P369l1591m32
11986B00856M3514Q689n9322k7998p333P622j1689o2852n4138P5955Q9638M1758
11974B44700O838o7378k7167J606R1016l597m0744m2015j7339m0982j8894M3833
11962A29877L2423K6444J5009L3908k7507J7748L7310J8094N836l2809p9516K5749
11950B02566k3765k9611k821k377J7636J7792J1496L1451o5818k4614L9104L652
$$ plain form
11938 174691 147899 191716 239445 248273 270938 218100 182879 247507 227999 236046 244652 207980
11926 207980 243244 262228 263324 256062 197451 195016 169066 150241 187037 193298 188965 213911
11914 213911 272986 310649 268990 258317 291539 292285 337486 335125 276976 267612 260105 261676 271034
11901 271034 300850 314399 315803 337674 371925 386636 391419 457854 458584 473540 485647 525186
11889 525186 559540 623021 745830 867631 981332 1138239 1297535 1579319 1894425 2220964
11879 2220964 2513095 2721213 2923608 3101327 3202862 3247674 3194177 3095228 2930824 2718995
11869 2718995 2513257 2338287 2207682 2128784 2104270 2108142 1963262 1854083 1743984 1741826
11859 1741826 1719812 1603875 1528912 1465433 1356894 1253662 1202112 1150956 1096385 1027768 935356
$$ packed form
11938A74691k6792M3817M7729Q828K2665n2838l5221O4628j9508Q047Q606l6672
11926B07980L5264J8984J096p262n8611k435k5950j8825L6796O261m333K4946
11914B13911N9075L7663m1659j0673L3222P46M5201k361n8149r364p507J571R358
11901B71034K9816J3549J404K1871L4251J4711M783O6435P30J4956J2107L9539
11889E25186L4354O3481J22809J21801J13701J56907J59296K81784L15106L26539
11879B220964K92131K08118K02395J77719J01535M4812n3497r8949j64404k11829
11869B718995k05738j74970j30605p8898k4514L872j44880j09179j10099k158
11859A741826k2014j15937p4963o3479j08539j03232n1550n1156n4571o8617r2412
$$ plain form
11848 935356 873632 836264 841453 778538 725302 703306 690709 656851 626598 610482 562848 486325
11836 486325 426393 409764 406051 384295 352144 365558 358212 364601 357325 357452 298299 294532 343684
11823 343684 331516 330715 337823 339151 362236 317752 255127 250265 257236 275388 244698 180005 217229
11810 217229 235669 248487 245501 234942 299598 341741 323162 295706 232107 220314 252827 282786
11798 282786 324227 297329 264560 245671 215516 218439 248102 229204 225623 265696 273161 260495
11786 260495 235635 229987 274126 300484 283262 273745 290611 289767 282652 256652 240227 255193
11774 255193 284599 348257 409427 402146 375349 319696 323999 342774 345242 340635 338424 296452
11762 296452 259000 238639 177750 195258 216782 212573 268659 266346 246210 195116 159700 192359
$$ packed form
11848I35356o1724l7368N189o2915n3236k1996j2597l3858l0253j6116m7634p6523
11836D86325n9932j6629l713k1756l2151J3414p346O389p276J27n9153l767M9152
11823C43684j2168q01P108J328K3085m4484o2625m862O971J8152l0690o4693L7224
11810B17229J8440J2818k986j0559O4656M2143j8579k7456o3599j1793L2513K9959
11798B82786M1441k6898l2769j8889l0155K923K9663j8898l581M0073P465j2666
11786B60495k4860n648M4139K6358j7222r517J6866q44p115k6000j6425J4966
11774B55193K9406O3658O1170p281k6797n5653M303J8775K468m607k211m1972
11762B96452l7452k0361o0889J7508K1524m209N6086k313k0136n1094l5416L2659
$$ plain form
11750 192359 220658 214478 220561 219531 255692 292082 312973 299949 282663 247792 226543 233634
11738 233634 204154 185609 221139 258814 231057 188153 169688 223353 258747 228544 210499
11727 210499 200528 177066 196547 245111 247864 215612 216538 231908 266611 260949 223105 224994 214463
11714 214463 200859 187648 212659 196693 173982 243387 316333 285645 267261 258801 213174 212334
11702 212334 191147 165772 202845 200893 202418 181118 185963 217267 274925 295752 321270 285551
11690 285551 269544 223887 207013 228081 252868 239596 248999 234967 256450 300293 331713 381856
11678 381856 359526 272903 214214 176787 173621 159452 161180 195789 197996 157158 161115 185924
11666 185924 194466 254213 313509 381402 305162 295647 307687 322217 307659 284056 276600 254978
$$ packed form
11750A92359K8299o180O083j030L6161L6390K0891j3024j7286l4871k1249P091
11738B33634k9480j8545L5530L7675k7757m2904j8465N3665L5394l0203j8045
11727B10499r971k3462J9481M8564K753l2252R26J5370L4703n662l7844J889j0531
11714B14463j3604j3211K5011j5966k2711O9405P2946l0688j8384q460m5627q40
11702B12334k1187k5375L7073j952J525k1300M845L1304N7658K0827K5518l5719
11690B85551j6007m5657j6874K1068K4787j3272R403j4032K1483M3843L1420N0143
11678C81856k2330q6623n8689l7427l166j4169J728L4609K207m0838L957K4809
11666A85924Q542N9747N9296O7893p6240r515J2040J4530j4558k3603p456k1622
$$ plain form
11654 254978 255309 330832 382970 366801 303633 291408 287932 283059 296765 306454 319860 331432
11642 331432 282931 306000 345803 341653 319536 286449 322602 371367 364215 395582 395414 344149
11630 344149 347603 359519 308438 223094 200568 224623 276452 307889 298718 268736 352581 361437
11618 361437 305558 292799 273774 232088 259552 269718 225583 271088 369308 330958 327311 376835
11606 376835 355516 363431 387749 384929 384851 390860 397054 372643 398607 298613 222282 275925 332094
11593 332094 464588 523860 516567 529660 585688 557880 470912 432113 431626 377894 347270 312967
11581 312967 297453 345097 372538 354875 382170 405932 394822 417707 428665 391414 338383
11570 338383 387337 413953 400419 386036 359357 362129 382854 398384 391455 458924 448745 475943
$$ packed form
11654B54978L31P5523N2138j6169o3168j2225l476m873J3706R689J3406J1572
11642C31432m8501K3069L9803m150k2117l3087L6153M8765p152L1367j68n1265
11630C44149L454J1916n1081q5344k2526K4055N1829L1437r171k9982Q3845Q856
11618C61437n5879j2759j9025m1686K7464J0166m4135M5505R8220l8350l647M9524
11606C76835k1319P915K4318k820p8O009O194k4411K5964r9994p6331N3643N6169
11593C32094J32494N9272p293J3093N6028k7808q6968l8799m87n3732l0624l4303
11581C12967j5514M7644K7441j7663K7295K3762j1110K2885J0958l7251n3031
11570C38383M8954K6616j3534j4383k6679K772K0725J5530o929O7469j0179K7198
$$ plain form
11558 475943 440709 424921 399089 328465 345165 373913 371416 331009 385221 424420 415842 377411
11546 377411 348469 358723 417971 430798 478744 487536 540192 561565 489738 483004 517977 488282
11534 488282 445716 490244 533453 526075 530480 588143 601281 617317 605356 587323 556820 551240
11522 551240 491613 435886 454562 447771 450604 486829 499904 515675 484682 462136 495179 544550
11510 544550 578316 562170 552162 511966 460506 440268 427665 410451 426253 460052 470185
11499 470185 457213 475851 489057 491069 504721 540856 571891 593671 592596 577765 598170 636425
11487 636425 682641 720076 680752 678412 645904 600025 596641 585977 572370 594033 608745 581763
11475 581763 599312 624249 547214 501283 467831 456280 510470 553647 571644 566667 585250 564560
$$ packed form
11558D75943l5234j5788k5832p0624J6700K8748k497m0407N4212L9199q578l8431
11546C77411k8942J0254N9248J2827M7946Q792N2656K1373p1827o734L4973k9695
11534D88282m2566M4528M3209p378M405N7663J3138J6036j1961j8033l0503n580
11522E51240n9627n5727J8676o791K833L6225J3075J5771l0993k2546L3043M9371
11510E44550L3766j6146j0008m0196n1460k0238j2603j7214J5802L3799J0133
11499D70185j2972J8638J3206K012J3652L6135L1035K1780j075j4831K0405L8255
11487F36425M6216L7435l9324k340l2508m5879l384j0664j3607K1663J4712k6982
11475E81763J7549K4937p7035m5931l3452j1551N4190M3177J7997m977J8583k0690
$$ plain form
11463 564560 537600 565900 578259 595619 626021 607517 594193 620094 606561 528773 500056
11452 500056 478903 489247 503104 557729 562037 579851 609072 549697 526521 517129 546736 546854
11440 546854 524737 564021 562776 571825 563176 551174 505730 504732 574743 579628 514310 441210 464183
11427 464183 535889 524453 552729 589161 596090 625657 647749 591122 614320 644457 643452 591544
11415 591544 621553 644023 603106 582620 592071 639150 653198 679622 647333 584598 635604 661197
11403 661197 735315 747678 733716 690642 680833 683664 682888 666409 636825 632764 635224 725775 718019
11390 718019 742795 725386 700787 686588 699268 643884 649632 622859 610836 670399 717057 737520
11378 737520 769871 771562 765387 781434 848335 849726 827640 803499 757859 744840 802298 807116
$$ packed form
11463E64560k6960K8300J2359J7360L0402j8504j3324K5901j3533p7788k8717
11452E00056k1153J0344J3857N4625M308J7814K9221n9375k3176r392K9607J18
11440E46854k2117L9284j245R049q649j2002m5444r98P0011M885o5318p3100K2973
11427D64183P1706j1436K8276L6432O929K9567K2092n6627K3198L0137j005n1908
11415E91544L0009K2470m0917k0486R451M7079J4048K6424l2289o2735N1006K5593
11403F61197P4118J2363j3962m3074r809K831p76j6479k9584m061K460R0551p756
11390G18019K4776j7409k4599j4199J2680n5384N748k6773j2023N9563M6658K0463
11378G37520L2351J691o175J6047O6901J391k2086k4141m5640j3019N7458M818
$$ plain form
11366 807116 813711 870628 832348 798708 852430 894045 812653 819119 836239 799822 810704 802046
11354 802046 766035 838178 899447 918818 903082 900539 898373 901347 854210 890035 868313 879802
11342 879802 877397 876619 943658 989818 1014524 1006279 1033263 1086775 1062797 1033724 1049472 1066226
11330 1066226 1043561 1018730 1020548 1005695 1020923 1077201 1126177 1130749 1141097 1189119 1212145 1163217
11318 1163217 1149570 1107059 1131619 1238323 1232383 1222197 1249383 1273782 1259604 1327709 1379643
11307 1379643 1361589 1350672 1355367 1305726 1273553 1289367 1315913 1318391 1360991 1437166 1457120 1443692
11295 1443692 1500976 1551130 1534629 1574183 1537471 1537353 1552378 1575050 1598340 1617650 1595644 1519267
11283 1519267 1504670 1510214 1497575 1500458 1569730 1607919 1614152 1634211 1642209 1709009 1752384 1763351
$$ packed form
11366H07116O595N6917l8280l3640N3722M1615q1392O466J7120l6417J0882q658
11354H02046l6011P2143O1269J9371j5736k543k166K974m7137L5825k1722J1489
11342H79802k405p78O7039M6160K4706q245K6984N3512k3978k9073J5748J6754
11330A066226k2665k4831J818j4853J5228N6278M8976M572J0348M8022K3026m8928
11318A163217j3647m2511K4560J06704n940j0186K7186K4399j4178O8105N1934
11307A379643j8054j0917M695m9641l2173J5814K6546K478M2600P6175J9954j3428
11295A443692N7284N0154j6501L9554l6712j18J5025K2672K3290J9310k2006p6377
11283A519267j4597N544j2639K883O9272L8189O233K0059P998O6800M3375J0967
$$ plain form
11271 1763351 1718824 1706127 1714411 1762346 1846095 1869852 1914505 1927601 1927799 1917707 1903343 1916316
11259 1916316 1949994 1993228 2005253 2049119 2053025 2071530 2084253 2095593 2090427 2098739 2131379 2152848
11247 2152848 2142531 2187190 2221335 2187787 2201022 2192155 2184608 2247145 2293125 2294171 2360179 2439314
11235 2439314 2414037 2405565 2435785 2509164 2537248 2517223 2513733 2567971 2548252 2499242 2544375 2610711
11223 2610711 2609376 2657929 2711642 2772872 2778211 2780819 2786912 2845751 2864942 2864776 2966971 2963983
11211 2963983 2966686 3016814 3115985 3190254 3233322 3299745 3353759 3380249 3354246 3377762 3396407
11200 3396407 3456837 3477125 3501351 3584663 3697817 3744524 3780140 3889139 3943930 3973030 3999727
11189 3999727 4065373 4088982 4198833 4249745 4275561 4358799 4367461 4408276 4438107 4551050 4664918
$$ packed form
11271A763351m4527j2697Q284M7935Q3749K3757M4653J3096J98j0092j4364J2973
11259A916316L3678M3234J2025M3866L906J8505J2723J1340n166Q312L2640K1469
11247B152848j0317M4659L4145l3548J3235q867p547O2537M5980J046O6008P9135
11235B439314k5277q472L0220P3379K8084k0025l490N4238j9719m9010M5133O6336
11223B610711j335M8553N3713O1230N339K608O093N8839J9191j66J02195k988
11211B963983K703N0128R9171P4269M3068O6423N4014K6490k6003K3516J8645
11200C396407O0430K0288K4226Q3312J13154M6707L5616J08999N4791K9100K6697
11189C999727O5646K3609J09851N0912K5816Q3238Q662M0815K9831J12943J13868
$$ plain form
11178 4664918 4730428 4821467 4877819 4910047 4952317 5066527 5073085 5046555 5128836 5221203 5304497
11167 5304497 5410360 5496861 5615449 5765265 5845966 5890276 5932457 5976354 6100109 6223410
11157 6223410 6312668 6396327 6447250 6570221 6716027 6833472 6964340 7011443 7045382 7149367
11147 7149367 7295452 7436733 7580469 7617334 7707091 7852546 7977286 8070352 8169933 8248426
11137 8248426 8392362 8544194 8690137 8874511 9006830 9171466 9272685 9400008 9528143
11128 9528143 9626874 9760205 9893452 10055693 10205070 10348160 10458322 10646894 10863628 11035525
11118 11035525 11182566 11370046 11519842 11615735 11816553 11979562 12148624 12337813 12431318 12569331
11108 12569331 12758144 12927295 13084041 13258428 13461698 13660107 13787982 13927494 14022951
$$ packed form
11178D664918O5510R1039N6352L2228M2270J14210O558k6530Q2281R2367Q3294
11167E304497J05863Q6501J18588J49816Q0701M4310M2181M3897J23755J23301
11157F223410Q9258Q3659N0923J22971J45806J17445J30868M7103L3939J03985
11147G149367J46085J41281J43736L6865Q9757J45455J24740R3066R9581P8493
11137H248426J43936J51832J45943J84374J32319J64636J01219J27323J28135
11128I528143R8731J33331J33247J62241J49377J43090J10162J88572K16734J71897
11118A1035525J47041J87480J49796R5893K00818J63009J69062J89189R3505J38013
11108A2569331J88813J69151J56746J74387K03270J98409J27875J39512R5457
$$ plain form
11099 14022951 14131966 14259149 14444839 14657798 14862695 15017110 15101334 15184075 15356146 15550967
11089 15550967 15697669 15782869 15881270 15979436 16086668 16116528 16211724 16363439 16426737 16534339
11079 16534339 16599762 16737289 16836781 16931229 17037848 17101237 17213041 17235805 17260455 17294381
11069 17294381 17294997 17347641 17388247 17379962 17328316 17375878 17401097 17343619 17331750 17381363 17378805 17383032
11057 17383032 17249509 17094744 17032528 17031935 16947977 16894607 16857817 16779775 16655777 16558764 16513450
11046 16513450 16424736 16285742 16145905 16053148 15975151 15839192 15759619 15663640 15548627 15468357
11036 15468357 15305562 15154512 15023249 14904327 14804512 14713089 14616786 14524654 14495641 14416290
11026 14416290 14348075 14158668 14012377 13935881 13781659 13634341 13563379 13463616 13270625 13120942
$$ packed form
11099A4022951J09015J27183J85690K12959K04897J54415Q4224Q2741J72071J94821
11089A5550967J46702Q5200R8401R8166J07232K9860R5196J51715O3298J07602
11079A6534339O5423J37527R9492R4448J06619O3389J11804K2764K4650L3926
11069A7294381O16N2644M0606q285n1646M7562K5219n7478j1869M9613k558M227
11057A7383032j33523j54765o2216n93q3958n3370l6790p8042j23998r7013m5314
11046A6513450q8714j38994j39837r2757p7997j35959p9573r5979j15013q0270
11036A5468357j62795j51050j31263j18922r9815r1423r6303r2132k9013p9351
11026A4416290o8215j89407j46291p6496j54222j47318p0962r9763j92991j49683
$$ plain form
11016 13120942 13033663 12921463 12776935 12655907 12453888 12322531 12151638 12008512 11896887
11007 11896887 11773351 11615590 11500726 11445592 11284303 11156306 11030118 10925983 10834524 10705976
10997 10705976 10621233 10547211 10479342 10379783 10310316 10182154 10106194 10081936 10049622 10022017 10020405
10986 10020405 10020946 9981376 9941644 9865707 9696783 9499767 9389996 9291414 9137467 9056148 8941362
10975 8941362 8793391 8719706 8679820 8678683 8597801 8510538 8512293 8489726 8493071 8491956 8439241 8386033
10963 8386033 8363447 8266567 8235887 8166960 8065901 7957962 7886691 7874117 7838876 7871286 7927310
10952 7927310 8005325 8079628 8135262 8138701 8127050 8098998 8089415 8122556 8083836 8001483 7821337
10941 7821337 7676653 7516807 7350153 7196462 7055027 6909567 6739171 6581840 6447537
$$ packed form
11016A3120942q7279j12200j44528j21028k02019j31357j70893j43126j11625
11007A1896887j23536j57761j14864n5134j61289j27997j26188j04135r1459j28548
10997A0705976q4743p4022o7869r9559o9467j28162p5960k4258l2314k7605j612
10986A0020405N41l9570l9732p5937j68924j97016j09771r8582j53947q1319j14786
10975H941362j47971p3685l9886j137q0882q7263J755k2567L345j115n2715n3208
10963H386033k2586r6880l0680o8927j01059j07939p1271j2574l5241L2410N6024
10952G927310P8015P4303N5634L439j1651k8052r583L3141l8720q2353j80146
10941G821337j44684j59846j66654j53691j41435j45460j70396j57331j34303
$$ plain form
10932 6447537 6316783 6218836 6107462 6029453 5924724 5807288 5718711 5654313 5615338 5529153
10922 5529153 5437628 5402802 5348074 5273531 5181742 5120739 4965078 4909186 4860775 4817867 4790441
10911 4790441 4709741 4628699 4559222 4510968 4434521 4372950 4336691 4362799 4354449 4299651 4267562
10900 4267562 4235847 4195125 4173536 4168470 4075882 3972469 3956835 3943922 3880979 3790071 3660724
10889 3660724 3672809 3684660 3652736 3588039 3552523 3481742 3489362 3495538 3484672 3465255 3422277 3396343
10877 3396343 3382493 3390727 3396523 3332891 3286921 3319674 3343196 3260297 3247647 3225440 3173479 3138865
10865 3138865 3144703 3087802 3035287 2986813 2948755 2953344 2934138 2935417 2918827 2921970 2950989 2968878
10853 2968878 2979158 3017721 3002287 2936727 2858035 2826812 2859447 2854381 2823582 2833000 2786094 2753863
$$ packed form
10932F447537j30754r7947j11374p8009j04729j17436q8577o4398l8975q6185
10922E529153r1525l4826n4728p4543r1789o1003j55661n5892m8411m2908k7426
10911D790441q0700q1042o9477m8254p6447o1571l6259K6108q350n4798l2089
10900D267562l1715m0722k1589n066r2588j03413j5634j2913o2943r0908j29347
10889C660724J2085J1851l1924o4697l5516p0781P620O176j0866j9417m2978k5934
10877C396343j3850Q234N796o3632m5970L2753K3522q2899j2650k2207n1961l4614
10865C138865N838n6901n2515m8474l8058M589j9206J279j6590L143K9019J7889
10853B968878J0280L8563j5434o5560p8692l1223L2635n066l0799R418m6906l2231
$$ plain form
10841 2753863 2737925 2721353 2771397 2760651 2690516 2619135 2596554 2556669 2517922 2485314 2446119
10830 2446119 2409429 2405867 2449304 2515482 2467830 2419155 2411220 2400494 2386628 2384424 2358564 2353943
10818 2353943 2321002 2316410 2269018 2237737 2248864 2245402 2229981 2277905 2268090 2231353 2222218 2259838
10806 2259838 2194862 2189928 2222780 2247653 2276407 2259036 2205812 2136105 2145913 2159507 2117214 2072819
10794 2072819 2108522 2109588 2098560 2069728 2065832 2140615 2138112 2077432 2014677 2015434 2051022 2055701
10782 2055701 2040835 2038836 2039746 2052798 2000220 1946150 1932161 1877041 1871288 1876742 1921532 1924428
10770 1924428 1905353 1878922 1901693 1937015 1921895 1933704 1915958 1892330 1909381 1950325 2000264
10759 2000264 2003436 1909995 1843255 1864728 1913373 1910360 1834222 1853827 1839692 1811364 1865559 1885247
$$ packed form
10841B753863j5938j6572N0044j0746p0135p1381k2581l9885l8747l2608l9195
10830B446119l6690l562M3437O6178m7652m8675p935j0726j3866k204k5860m621
10818B353943l2941m592m7392l1281J1127l462j5421M7924r815l6737r135L7620
10806B259838o4976m934L2852K4873K8754j7371n3224o9707R808J3594m2293m4395
10794B072819L5703J066j1028k8832l896P4783k503o0680o2755P57L5588M679
10782B055701j4866j999R10J3052n2578n4070j3989n5120n753N454M4790K896
10770A924428j9075k6431K2771L5322j5120J1809j7746k3628J7051M0944M9939
10759B000264L172r3441o6740K1473M8645l013p6138J9605j4135k8328N4195J9688
$$ plain form
10747 1885247 1881606 1865109 1815097 1785313 1750017 1735711 1777548 1778828 1794719 1754253 1772046 1808203
10735 1808203 1817139 1820856 1837632 1850606 1881532 1890321 1876108 1904153 1886209 1829103 1832089 1921733
10723 1921733 1979824 1999208 2023120 2064108 2032696 1993720 2022784 2056784 2056000 2046981 2049879 2060058
10711 2060058 2124372 2199975 2194570 2191019 2254477 2308493 2347910 2386145 2371257 2422669 2485920 2468816
10699 2468816 2456124 2481302 2509805 2553041 2625668 2617245 2583102 2672688 2841199 2964007 3090923
10688 3090923 3239159 3352524 3404680 3497348 3621899 3709442 3734318 3671605 3647771 3590828 3549148
10677 3549148 3544320 3598438 3630247 3660952 3653220 3610116 3644301 3750513 3854587 3880500 3941961
10666 3941961 4000842 4022245 4099673 4214219 4203261 4176430 4154407 4210687 4251936 4208859 4203390
$$ packed form
10747A885247l641j6497n0012k9784l5296j4306M1837J280J5891m0466J7793L6157
10735A808203Q936L717J6776J2974L0926Q789j4213K8045j7944n7106K986Q9644
10723A921733N8091J9384K3912M0988l1412l8976K9064L4000p84r019K898J0179
10711B060058O4314P5603n405l551O3458N4016L9417L8235j4888N1412O3251j7104
10699B468816j2692K5178K8503M3236P2627q423l4143Q9586J68511J22808J26916
10688C090923J48236J13365N2156R2668J24551Q7543K4876o2713k3834n6943m1680
10677C549148m828N4118L1809L0705p732m3104L4185J06212J04074K5913O1461
10666C941961N8881K1403P7428J14546j0958k6831k2023N6280M1249m3077n469
$$ plain form
10655 4203390 4260527 4315352 4395504 4494467 4570926 4675943 4871314 5112746 5382089 5620525
10645 5620525 5916052 6255969 6524884 6816329 7111227 7455097 7692996 7856509 8074828
10636 8074828 8360693 8725731 9206281 9781855 10446748 11200279 11981231 12754630 13523503
10627 13523503 14233327 14870703 15445668 15973833 16460676 16929724 17335565 17626132 17618481 17460976
10617 17460976 17316449 17190390 17074580 16977583 17117979 17698187 18568880 19887378 21777409
10608 21777409 24474111 28312396 33819948 41345195 50760222 60805834 69589557 76180324
10600 76180324 80872874 83905056 85067524 84506715 83388746 82992951 83849184 85566448
10592 85566448 87516170 89012078 89932087 90584102 91167060 91576489 91526987 91218257 91376965
$$ packed form
10655D203390N7137N4825Q0152R8963P6459J05017J95371K41432K69343K38436
10645E620525K95527L39917K68915K91445K94898L43870K37899J63513K18319
10636H074828K85865L65038M80550N75574O64893P53531P80952P73399P68873
10627A3523503P09824O37376N74965N28165M86843M69048M05841K90567p651j57505
10617A7460976j44527j26059j15810r6997J40396N80208Q70693J318498J890031
10608B1777409K696702L838285N507552P525247R415027J0045612Q783723O590767
10600G6180324M692550L032182J162468n60809j117969l95795Q56233J717264
10592H5566448J949722J495908R20009O52015N82958M09429m9502l08730J58708
$$ plain form
10583 91376965 92331787 93926859 95858373 98230450 101652861 106122406 111037756 115447754
10575 115447754 118944171 121536783 123522890 125125139 126553110 128283227 130680367 133971280
10567 133971280 138146797 142695165 147463138 153280205 161454001 172486628 185989076 200977539
10559 200977539 214567954 223096198 226093420 225762503 222810833 215290057 203469618 191652744
10551 191652744 182872286 177176174 173239683 169827711 166750033 164537864 163291674 162028893
10543 162028893 159656977 156285345 152590717 148779181 144281284 138681961 132630849 127250768
10535 127250768 123237239 120559483 118604575 116631103 114675587 113279744 112792470 112921025
10527 112921025 113253052 113616068 114178958 114795207 114807016 113955203 112728640 112150412 112843414
$$ packed form
10583I1376965R54822J595072J931514K372077L422411M469545M915350M409998
10575A15447754L496417K592612J986107J602249J427971J730117K397140L290913
10567A33971280M175517M548368M767973N817067Q173796J1032627J3502448J4988463
10559B00977539J3590415Q528244K997222l30917k951670p520776j1820439j1816874
10551A91652744q780458n696112l936491l411972l077678k212169j246190j262781
10543A62028893k371916l371632l694628l811536m497897n599323o051112n380081
10535A27250768m013529k677756j954908j973472j955516j395843m87274J28555
10527A12921025L32027L63016N62890O16249J1809q51813j226563n78228O93002
$$ plain form
10518 112843414 115167460 118570517 120909153 120207420 116709259 111623091 104649167 94692428
10510 94692428 82689844 71348890 62277957 55448567 50417318 46673988 43748936 41509084
10502 41509084 39864284 38668457 37828584 37248884 36793884 36456107 36246648 36034240 35734471
10493 35734471 35203526 34560764 33847902 32957978 32029258 31071751 30042820 28823635 27597671
10484 27597671 26482483 25322546 24105767 22931415 21837583 20900643 20159385 19495514
10476 19495514 18801278 18130151 17571976 17006739 16444675 15824130 15201707 14567893 13926959
10467 13926959 13332662 12806318 12381454 11959216 11566860 11182126 10832479 10564183 10320403
10458 10320403 10087115 9955756 9859348 9662963 9504323 9319452 9180400 9044485 8900449
$$ packed form
10518A12843414K324046L403057K338636p01733l498161n086168o973924r956739
10510I4692428j2002584j1340954r070933o829390n031249l743330k925052k239852
10502D1509084j644800j195827q39873n79700m55000l37777k09459k12408k99769
10493C5734471n30945o42762p12862q89924r28720r57507j028931j219185j225964
10484B7597671j115188j159937j216779j174352j093832r36940p41258o63871
10476A9495514o94236o71127n58175n65237n62064o20545o22423o33814o40934
10467A3926959n94297n26344m24864m22238l92356l84734l49647k68296k43780
10458A0320403k33288j31359r6408j96385j58640j84871j39052j35915j44036
$$ plain form
10449 8900449 8640322 8393567 8208569 8135693 7987489 7834760 7668903 7479005 7325509 7222257
10439 7222257 7053351 6944617 6832289 6731703 6732739 6766390 6776263 6734815 6646795 6487506 6307426
10428 6307426 6060355 5744728 5524465 5301434 4982621 4750258 4583696 4404220 4272236
10419 4272236 4202685 4089626 3956203 3850569 3764764 3705650 3660622 3583485 3477217 3370771
10409 3370771 3256391 3155275 3106718 3065312 2995677 2926846 2901274 2811283 2733990 2697511 2637364
10398 2637364 2552769 2539199 2545141 2511263 2515576 2495246 2459071 2439922 2399019 2344954 2339142 2322978
10386 2322978 2330365 2287171 2279186 2281896 2211054 2128311 2122121 2055017 1939076 1857886 1870791 1874420
10374 1874420 1890743 1928647 1943888 1958680 1925641 1841018 1772467 1734242 1791941 1878196 1892721
$$ packed form
10449H900449k60127k46755j84998p2876j48204j52729j65857j89898j53496j03252
10439G222257j68906j08734j12328j00586J036L3651R873m1448q8020j59289j80080
10428F307426k47071l15627k20263k23031l18813k32363j66562j79476j31984
10419D272236o9551j13059j33423j05634q5805n9114m5028p7137j06268j06446
10409C370771j14380j01116m8557m1406o9635o8831k5572q9991p7293l6479o0147
10398B637364q4595j3570N942l3878M313k0330l6175j9149m0903n4065n812j6164
10386B322978P387m3194p985K710p0842q2743o190o7104j15941q1190J2905L629
10374A874420J6323L7904J5241J4792l3039q4623o8551l8225N7699Q6255J4525
$$ plain form
10363 1892721 1854758 1793202 1730620 1710954 1698188 1630362 1681181 1683457 1714563 1780616 1733337
10352 1733337 1738538 1690231 1639131 1597246 1586804 1662377 1714227 1717408 1679835 1672875 1711046 1738720
10340 1738720 1737494 1714326 1737810 1810682 1787447 1734224 1730717 1709434 1706558 1703259 1701194 1623473
10328 1623473 1612086 1572823 1511490 1509037 1526332 1455198 1469576 1537524 1524812 1450485 1343059
10317 1343059 1306876 1308347 1386686 1473933 1534684 1513833 1458989 1405691 1358548 1365014 1381415 1337259
10305 1337259 1287683 1270955 1190869 1136433 1130549 1148786 1183393 1202597 1201138 1157574 1173838 1160076
10293 1160076 1161771 1123820 1148110 1173640 1163755 1173537 1131835 1142961 1207932 1173461 1053770 1005248
10281 1005248 954865 1037994 1078254 1086383 1052055 1078351 1043316 988145 964115 979200 964036
$$ packed form
10363A892721l7963o1556o2582j9666j2766o7826N0819K276L1106O6053m7279
10352A733337N201m8307n1100m1885j0442P5573N1850L181l7573o960L8171K7674
10340A738720j226k3168K3484P2872k3235n3223l507k1283k876l299k065p7721
10328A623473j1387l9263o1333k453J7295p1134J4378O7948j2712p4327j07426
10317A343059l6183J471P8339Q7247O0751k0851n4844n3298m7143O466J6401m4156
10305A337259m9576j6728q0086n4436n884J8237L4607J9204j459m3564J6264j3762
10293A160076J695l7951K4290K5530r885R782m1702J1126O4971l4471j19691m8522
10281A005248n0383Q3129M0260Q129l4328K6296l5035n5171k4030J5085j5164
$$ plain form
10270 964036 950887 947340 970276 968965 946052 931217 986123 971055 931318 907445 890140 841198
10258 841198 821980 863104 911786 907414 901892 915046 856992 903907 918363 913774 956906 984491
10246 984491 975407 939126 905094 869251 920933 894508 890215 889306 873280 876929 921149 959932
10234 959932 929656 900290 934907 911319 880980 937924 966067 897986 838071 852551 931764
10223 931764 972261 934059 944462 953726 992698 1061842 1160683 1276788 1428334 1623606 1809169
10212 1809169 1992443 2225075 2539813 2745815 2770312 2695209 2714030 2786036 2620151 2283334
10202 2283334 2028937 1840469 1693569 1461121 1284211 1200031 1176556 1142646 1081626 1011215
10192 1011215 1002382 1053815 1031950 1018692 1043408 1028221 1037317 991996 964944 925336 888534 879285
$$ packed form
10270I64036j3149l547K2936j311k2913j4835N4906j5068l9737k3873j7305m8942
10258H41198j9218M1124M8682m372n522J3154n8054M6915J4456m589M3132K7585
10246I84491r084l6281l4032l5843N1682k6425m293r09j6026L649M4220L8783
10234I59932l0276k9366L4617k3588l0339N6944K8143o8081n9915J4480P9213
10223I31764M0497l8202J0403R264L8972O9144R8841J16105J51546J95272J85563
10212A809169J83274K32632L14738K06002K4497p5103J8821P2006j65885l36817
10202B283334k54397j88468j46900k32448j76910q4180k3475l3910o1020p0411
10192A011215q833N1433k1865j3258K4716j5187R096m5321k7052l9608l6802r249
$$ plain form
10180 879285 908442 907111 881861 858794 864975 975205 963754 989477 1025223 1086945 1133581 1161059
10168 1161059 1130427 1153767 1200536 1204779 1193535 1213661 1234037 1207497 1129978 1094503 1071751
10157 1071751 1049468 1031875 1024257 1075045 1121087 1151102 1165953 1147747 1155422 1166312 1151622 1207533
10145 1207533 1289681 1325217 1306492 1303025 1315556 1359057 1427428 1444897 1428782 1474566 1501550
10134 1501550 1425747 1418510 1415170 1437702 1532757 1612660 1717306 1845721 1954937 2009489 2001616
10123 2001616 1953964 1959856 1944894 1930175 1873155 1808270 1698574 1628229 1559725 1533008 1471982
10112 1471982 1416334 1448275 1473158 1539882 1547435 1460040 1387643 1405377 1451470 1423671 1298364
10101 1298364 1273244 1264848 1236784 1225963 1285610 1357018 1392764 1394914 1310318 1222360 1214730 1249557
$$ packed form
10180H79285K9157j331k5250k3067O181J10230j1451K5723L5746O1722M6636K7478
10168A161059l0632K3340M6769M243j1244K0126K0376k6540p7519l5475k2752
10157A071751k2283j7593p618N0788M6042L0015J4851j8206P675J0890j4690N5911
10145A207533Q2148L5536j8725l467J2531M3501O8371J7469j6115M5784K6984
10134A501550p5803p237l340K2532R5055P9903J04646J28415J09216N4552p873
10123B001616m7652N892j4962j4719n7020o4885j09696p0345o8504k6717o1026
10112A471982n5648L1941K4883O6724P553q7395p2397J7734M6093k7799j25307
10101A298364k5120q396k8064j0821N9647P1408L5746K150q4596q7958p630L4827
$$ plain form
10089 1249557 1218499 1192241 1206404 1258318 1259489 1259885 1278594 1300838 1334757 1270965 1234085 1225443
10077 1225443 1167220 1074742 982108 966104 964839 916135 889923 907295 931034 917143 939945
10066 939945 954110 949285 891453 862927 860748 801992 842739 874183 906106 847608 846032 788268
10054 788268 762749 741503 735243 805198 791534 820130 849682 823171 732845 716182 760978 732207
10042 732207 763161 802657 772814 726600 666764 670594 699460 721913 754991 732243 703290 707992
10030 707992 668054 646007 636320 597567 574634 595213 641327 590073 597779 587073 652216 692679
10018 692679 667608 709588 706605 683574 632485 645790 663276 640711 615088 623640 654067 681692
10006 681692 716056 703487 661902 653199 642473 667405 628142 569600 577327 623613 689211 700313
$$ packed form
10089A249557l1058k6258J4163N1914J171L96J8709K2244L3919o3792l6880q642
10077A225443n8223r2478r2634j6004j265m8704k6212J7372K3739j3891K2802
10066I39945J4165m825n7832k8526k179n8756M0747L1444L1923n8498j576n7764
10054G88268k5519k1246o260O9955j3664K8596K9552k6511r0326j6663M4796k8771
10042G32207L0954L9496k9843m6214n9836L830K8866K2453L3078k2748k8953M702
10030G07992l9938k2047r687l8753k2933K0579M6114n1254P706j0706O5143M0463
10018F92679k5071M1980k983k3031n1089J3305J7486k2565k5623Q552L0427K7625
10006F81692L4364j2569m1585q703j0726K4932l9263n8542P727M6286O5598J1102
$$ plain form
9994 700313 643537 607697 601621 581946 621651 610989 613263 639813 643743 625974 638540 629352
9982 629352 540627 556560 612155 617048 575891 550572 528914 492841 525976 542977 577676 592238
9970 592238 599524 576079 552744 566403 594192 563176 549848 561277 521995 496944 527302 527824
9958 527824 518728 546641 580590 568013 523559 526971 525133 562927 571322 545363 601351 675595
9946 675595 659065 672856 666926 621965 622853 664918 677974 646287 641299 648677 602923 568613 625232
9933 625232 602304 569517 546688 525561 571739 555566 571738 592684 591054 584548 582244 566614
9921 566614 630375 700188 747614 768006 749441 787176 802453 770887 785811 805969 818722 732187
9909 732187 676474 649011 686769 717430 676076 651302 652587 639533 616963 625007 594820 581840
$$ packed form
9994G00313n6776l5840o076j9675L9705j0662K274K6550L930j7769J2566r188
9982F29352q8725J5933N5595M893m1157k5319k1658l6073L3135J7001L4699J4562
9970E92238P286k3445k3335J3659K7789l1016j3328J1429l9282k5051L0358N22
9958E27824r096K7913L3949j2577m4454L412j838L7794Q395k5959N5988P4244
9946F75595j6530J3791n930m4961Q88M2065J3056l1687m988P378m5754l4310N6619
9933F25232k2928l2787k2829k1127M6178j6173J6172K0946j630o506k304j5630
9921E66614O3761O9813M7426K0392j8565L7735J5277l1566J4924K0158J2753q6535
9909G32187n5713k7463L7758L0661m1354k4774J285j3054k2570Q044l0187j2980
$$ plain form
9897 581840 578530 576380 572293 616344 668395 660093 622259 614807 637097 639763 729113 746558 793872
9884 793872 844545 893151 909926 906800 927248 928291 951370 965998 997127 1046134 1073821 1075573
9872 1075573 1077001 1067023 1105637 1136283 1124779 1090968 1046927 1065445 1001688 909313 867920 798966
9860 798966 752663 766630 796854 801445 782386 797785 830087 819643 838860 839500 850403 797646
9848 797646 807317 814145 833960 842946 798489 826436 852047 867327 931927 999820 1036043 1014516
9836 1014516 1019737 1050188 1125720 1113295 1064233 1054276 1108078 1155763 1143213 1148801 1179425 1219162
9824 1219162 1235885 1313163 1294418 1205226 1239787 1255451 1263521 1225214 1184607 1142968 1108779 1046037
9812 1046037 1001638 971210 960532 1012935 1095535 1088533 1019572 949910 943977 968251 978419 969849
$$ packed form
9897E81840l310k150m087M4051N2051q302l7834p452K2290K666Q9350J7445M7314
9884G93872N0673M8606J6775l126K0448J043K3079J4628L1129M9007K7687J752
9872A075573J428r978L8614L0646j1504l3811m4041J8518o3757r2375m1393o8954
9860G98966m6303J3967L0224M591j9059J5399L2302j0444J9217O40J0903n2757
9848G97646R671O828J9815Q986m4457K7947K5611J5280O4600O7893L6223k1527
9836A014516N221L0451P5532j2425m9062r957N3802M7685j2550N588L0624L9737
9824A219162J6723P7278j8745q9192L4561J5664Q070l8307m0607m1639l4189o2742
9812A046037m4399l0428j0678N2403Q2600p002o8961o9662n933K4274J0168q570
$$ plain form
9800 969849 927186 914579 903730 857466 912518 990619 1001771 978132 945544 905100 912889 934209
9788 934209 924150 992968 1013129 1003111 989233 916755 955993 994107 1054582 1105181 1188872 1286076
9776 1286076 1345317 1386594 1474468 1507211 1417145 1290233 1215731 1173209 1105861 1012419 992815
9765 992815 1037292 1018160 960253 934568 906739 899197 831511 804486 769186 739773 758847 758182
9753 758182 787329 859883 835839 748461 710962 712358 768271 787294 774727 740452 696935 718908
9741 718908 793154 782150 774766 799192 819463 794993 795957 772295 771637 744031 806054 898469 952522
9728 952522 936489 910054 870823 814252 782238 760715 780333 750562 704222 680877 586531 568652
9716 568652 581582 656307 671321 630223 640832 607198 630646 653928 616370 636097 643851 707771
$$ packed form
9800I69849m2663j2607j0849m6264N5052P8101J1152k3639l2588m0444P789K1320
9788I34209j0059O8818K0161j0018j3878p2478L9238L8114O0475N0599Q3691R7204
9776A286076N9241M1277Q7874L2743r0066j26912p4502m2522o7348r3442j9604
9765I92815M4477j9132n7907k5685k7829p542o7686k7025l5300k9413J9074o65
9753G58182K9147P2554k4044q7378l7499J396N5913J9023j2567l4275m3517K1973
9741G18908P4246j1004p384K4426K0271k4470R64k3662o58k7606O2023R2415N4053
9728I52522j6033k6435l9231n6571l2014k1523J9618k9771m6340k3345r4346j7879
9716E68652J2930P4725J5014m1098J0609l3634K3448K3282l7558J9727P754O3920
$$ plain form
9704 707771 702810 696254 679258 675755 669070 717271 659480 634588 615006 612602 628241 617536 593697
9691 593697 589720 596746 610268 634837 679763 674029 649809 610622 609176 646892 686924 714545
9679 714545 680361 612962 583314 599371 596504 576131 589939 649871 659342 666791 709491 723734
9667 723734 700184 729058 763368 759496 796807 841874 823697 745818 734522 720834 744258 761053
9655 761053 720078 715850 672568 630468 612942 630294 642004 684505 723027 697489 694574 677102
9643 677102 682156 665286 639864 659904 664009 677540 650163 610143 644926 661024 695410 696831
9631 696831 699240 752201 727332 669238 638262 586852 633610 674965 693219 634176 610264 676895
9619 676895 703588 706451 720778 685946 690934 639803 618819 644905 661259 684628 622313 604191
$$ packed form
9704G07771m961o556j6996l503o685M8201n7791k4892j9582k404J5639j0705k3839
9691E93697l977P026J3522K4569M4926n734k4220l9187j446L7716M0032K7621
9679G14545l4184o7399k9648J6057k867k0373J3808N9932R471P449M2700J4243
9667G23734k3550K8874L4310l872L7311M5067j8177p7879j1296j3688K3424J6795
9655G61053m0975m228m3282m2100j7526J7352J1710M2501L8522k5538k915j7472
9643F77102N054j6870k5422K0040M105J3531k7377m0020L4783J6098L4386J421
9631F96831K409N2961k4869n8094l0976n1410M6758M1355J8254n9043k3912O6631
9619F76895K6693K863J4327l4832M988n1131k0984K6086J6354K3369o2315j8122
$$ plain form
9607 604191 588226 608589 635552 652011 635617 654413 696522 678465 629100 645284 657885 649951
9595 649951 702930 758100 762153 748599 736521 714716 753426 782055 815286 811515 853618 894157
9583 894157 908882 931620 989475 1068223 1146865 1216782 1223674 1231278 1285758 1291605 1282132 1274108 1265369
9570 1265369 1242373 1267032 1234081 1183639 1155809 1204369 1281640 1292410 1377075 1493298 1596769
9559 1596769 1666721 1689274 1710790 1836031 1957413 1930581 1833577 1769198 1734437 1722240 1831725
9548 1831725 1926869 1994729 2002897 2034611 2139203 2252318 2413165 2635156 2920426 3230751
9538 3230751 3537189 3895792 4128939 4314847 4547639 4750661 4869573 4833019 4865425 5029781
9528 5029781 5201863 5310727 5280481 5254255 5178225 5038699 4866394 4714540 4548599 4409189
$$ packed form
9607F04191j5965K0363K6963J6459j6394J8796M2109j8057m9365J6184J2601p934
9595F49951N2979N5170M053j3554j2078k1805L8710K8629L3231l771M2103M0539
9583H94157J4725K2738N7855P8748P8642O9917O892P604N4480N847r473q024q739
9570A265369k2996K4659l2951n0442k7830M8560P7271J0770Q4665J16223J03471
9559A596769O9952K2553K1516J25241J21382k6832r7004o4379l4761j2197J09485
9548A831725R5144O7860Q168L1714J04592J13115J60847K21991K85270L10325
9538C230751L06438L58603K33147J85908K32792K03022J18912l6554L2406J64356
9528E029781J72082J08864l0246k6226p6030j39526j72305j51854j65941j39410
$$ plain form
9518 4409189 4356254 4392832 4409811 4429543 4515292 4597687 4636976 4704626 4852564 5050479 5308967
9507 5308967 5758934 6413677 7276862 8167215 9078755 9951555 10702154 11230032 11515771 11546965
9497 11546965 11407797 11135682 10733967 10186502 9636787 9275301 8973504 8702186 8378833
9488 8378833 8043256 7822898 7824217 7889997 7947637 8071141 8368788 8768554 9291941 9850725
9478 9850725 10541639 11479252 12765492 14150129 15380142 16367356 17191989 17646984 17787929
9469 17787929 17659715 17246399 16698008 16325323 16254203 16497236 17094035 18228933 19920797
9460 19920797 22304095 25546087 29969156 35880269 43552971 53223399 64285699 74999529
9452 74999529 83222687 88276279 91085589 91980726 90442095 86323483 81524501 78233661
$$ packed form
9518D409189n2935L6578J6979J9732Q5749Q2395L9289O7650J47938J97915K58488
9507E308967M49967O54743Q63185Q90353R11540Q72800P50599N27878K85739L1194
9497A1546965j39168k72115m01715n47465n49715l61486l01797k71318l23353
9488H378833l35577k20358J319O5780N7640J23504K97647L99766N23387N58784
9478I850725O90914R37613J286240J384637J230013R87214Q24633M54995J40945
9469A7787929j28214m13316n48391l72685p1120K43033N96799J134898J691864
9460A9920797K383298L241992M423069N911113P672702R670428J1062300J0713830
9452G4999529Q223158N053592K809310Q95137j538631m118612m798982l290840
$$ plain form
9444 78233661 77217220 77885847 79281057 81111960 83893831 87705152 92181435 96955731
9436 96955731 102554591 109624142 117478639 124600652 129965024 133818933 136549070 137835957
9428 137835957 136856373 133867736 130163372 126693776 123760779 121489560 120219336 120228040 121352300
9419 121352300 123573455 126997766 131715056 137940535 146005122 156639944 170885229 189963462
9411 189963462 213337270 236448165 253013621 260577194 261439217 256894301 244895104 224736407
9403 224736407 201390027 180828533 165253563 154031434 145934146 139904326 135359467
9396 135359467 132136833 130103284 128805702 128108761 128566812 130628567 134193361 138981153
9388 138981153 144360585 149129116 151939094 152104268 149825240 145454993 139058794 130990632
$$ packed form
9444G8233661j016441O68627J395210J830903K781871L811321M476283M774296
9436I6955731N598860P069551P854497P122013N364372L853909K730137J286887
9428A37835957r79584k988637l704364l469596k932997k271219j270224Q704J124260
9419A21352300K221155L424311M717290O225479Q064587J0634822J4245285J9078233
9411A89963462K3373808K3110895J6565456P563573Q62023m544916j1999197k0158697
9403B24736407k3346380k0561494j5574970j1222129q097288o029820m544859
9396A35359467l222634k033549j297582o96941M58051K061755L564794M787792
9388A38981153N379432M768531K809978J65174k279028m370247o396199q068162
$$ plain form
9380 130990632 122412838 114595036 108083908 102698919 98177816 94490594 91791567 89949470
9372 89949470 88733978 88274178 89190896 92062195 96435699 100626417 102733902 102019291 98998504
9363 98998504 94293035 87539646 78715788 69123396 60471958 53434193 47874825 43460375
9355 43460375 39904490 37158321 35066516 33524792 32372821 31560588 31048702 30821033 30658808
9346 30658808 30454041 30071978 29475549 28566486 27437768 26221871 24889551 23469657 22206302
9337 22206302 21103816 20096800 19238101 18493677 17778834 17168348 16623309 16128821 15733300
9328 15733300 15490307 15273332 15078005 14998382 14971514 14934014 14982297 15134886 15322205 15532839
9318 15532839 15678925 15659380 15409941 14850501 14182307 13470200 12617149 11710235 10921377 10311523
$$ packed form
9380A30990632q577794p817802o511128n384989m521103l687222k699027j842097
9372H9949470j215492m59800R16718K871299M373504M190718K107485p14611l020787
9363I8998504m705469o753389q823858r592392q651438p037765n559368m414450
9355D3460375l555885k746169k091805j541724j151971q12233n11886k27669j62225
9346C0658808k04767l82063n96429r09063j128718j215897j332320j419894j263355
9337B2206302j102486j007016q58699p44424p14843o10486n45039m94488l95521
9328A5733300k42993k16975j95327p9623k6868l7500M8283J52589J87319K10634
9318A5532839J46086j9545k49439n59440o68194p12107q53051r06914p88858o09854
$$ plain form
9308 10311523 9715698 9225849 8852183 8496898 8212108 7985950 7725254 7519214 7347432
9299 7347432 7144596 6951212 6812090 6736313 6712699 6742610 6785682 6851980 6849456 6788642 6708708
9288 6708708 6612704 6463259 6308283 6158195 5903999 5650681 5459081 5193534 4917324 4753109
9278 4753109 4635209 4538582 4457623 4347088 4144890 3957531 3841971 3699315 3583525 3492061
9268 3492061 3401990 3255255 3181658 3082265 2945284 2866273 2780645 2737129 2685292 2651106 2641419
9257 2641419 2627058 2620787 2531926 2431604 2405848 2397301 2344048 2271607 2228852 2159092 2138837 2108075
9245 2108075 2083594 2073866 2029667 2000367 1983586 2000691 1978097 2001809 2001625 1931615 1916151 1965221
9233 1965221 2036927 2060619 2027735 1978149 1940893 1870191 1804887 1837272 1804077 1782355 1650540
$$ packed form
9308A0311523n95825m89849l73666l55285k84790k26158k60696k06040j71782
9299G347432k02836j93384j39122p5777k3614K9911M3072O6298k524o0814p9934
9288F708708r6004j49445j54976j50088k54196k53318j91600k65547k76210j64215
9278D753109j17900r6627q0959j10535k02198j87359j15560j42656j15790r1464
9268C492061r0071j46735p3597r9393j36981p9011q5628m3516n1837l4186r687
9257B641419j4361o271q8861j00322k5756q547n3253p2441m2755o9760k0255l0762
9245B108075k4481r728m4199k9300j6781J7105k2594K3712j84p0010j5464M9070
9233A965221P1706K3692l2884m9586l7256p0702o5304L2385l3195k1722j31815
$$ plain form
9222 1650540 1635074 1629928 1639202 1626693 1639804 1609038 1637122 1676047 1626183 1623183 1641930 1647913
9210 1647913 1638206 1624610 1598343 1600605 1579255 1561004 1573568 1566723 1499036 1429472 1432921 1461762
9198 1461762 1444915 1428598 1441554 1425481 1389306 1433637 1487514 1399315 1334181 1335332 1267555 1229793
9186 1229793 1226357 1208311 1146428 1088817 1094890 1149187 1164466 1170126 1120102 1125159 1147985 1119245
9174 1119245 1113745 1124744 1185119 1133248 1030632 987147 955239 945304 959438 1013870 1045159 976956
9162 976956 947297 910529 878894 828895 835594 858452 872391 873970 900019 877503 868022 817725
9150 817725 806688 803276 791195 762051 844214 861291 822758 847021 823856 743536 749752 742856
9138 742856 759723 826270 785149 741598 694356 676355 660616 686333 712371 702440 707850 676148
$$ packed form
9222A650540j5466n146R274j2509J3111l0766K8084L8925m9864l000J8747N983
9210A647913r707j3596k6267K262k1350j8251J2564o845o7687o9564L449K8841
9198A461762j6847j6317J2956j6073l6175M4331N3877q8199o5134J151o7777l7762
9186A229793l436j8046o1883n7611O073N4297J5279N660n0024N057K2826k8740
9174A119245n500J0999O0375n1871j02616m3485l1908r935J4134N4432L1289o8203
9162I76956k9659l6768l1635m9999O699K2858J3939J579K6049k2516r481n0297
9150H17725j1037l412j2081k9144Q2163J7077l8533K4263k3165q0320O216o896
9138G42856J6867O6547m1121m3551m7242j8001j5739K5717K6038r931N410l1702
$$ plain form
9126 676148 695684 667507 636234 667402 645832 629320 650639 681239 651470 605271 647367 667508
9114 667508 667348 655356 600438 525371 480690 491011 563939 594144 564155 527388 536140 545332
9102 545332 530979 533638 570645 608961 598719 529134 511039 516981 542855 562097 554452 570760
9090 570760 592894 594227 595062 602522 664968 748622 755207 724210 752032 751672 729000 801889 833409
9077 833409 785365 724191 663816 634052 659196 596122 557594 538218 559779 618891 608251 544734
9065 544734 516870 574867 645411 682800 652750 606249 588951 564032 552143 559614 610440 600116
9053 600116 591457 622206 649816 687227 714652 657582 701887 725326 758106 786246 740280 772650
9041 772650 873047 952956 1026481 1069987 1121947 1146241 1160008 1135471 1125961 1136791 1098550 1077407
$$ packed form
9126F76148J9536k8177l1273L1168k1570j6512K1319L0600k9769m6199M2096K0141
9114F67508j60j1992n4918p5067m4681J0321P2928L0205k9989l6767Q752R192
9102E45332j4353K659L7007L8316j0242o9585j8095N942K5874J9242p645J6308
9090E70760K2134J333Q35P460O2446Q3654O585l0997K7822l60k2672P2889L1520
9077H33409m8044o1174o0375k9764K5144o3074l8528j9376K1561N9112j0640o3517
9065E44734k7864N7997P0544L7389l0050m6501j7298k4919j1889P471N0826j0324
9053F00116q659L0749K7610L7411K7425n7070M4305K3439L2780K8140m5966L2370
9041G72650J00397P9909P3525M3506N1960K4294J3767k4537r510J0830l8241k1143
$$ plain form
9029 1077407 984770 914323 907564 889857 831404 855991 871044 890244 892102 859198 844451 796307
9017 796307 833956 824517 731126 645924 663180 676618 698073 736130 783660 790483 836121 811513
9005 811513 799277 784696 799868 768048 775854 754265 797439 869839 966010 942408 928854 1048806
8993 1048806 1163183 1210161 1217922 1221550 1231571 1227292 1221646 1143765 1092467 1076339 1060132 1043934
8981 1043934 1104652 1154045 1141953 1100067 1046777 979667 986638 1044025 1049131 989278 902167 870353
8969 870353 831563 708853 686618 711885 724160 724362 696202 741547 742590 723351 738453 757525
8957 757525 729953 658980 566101 602049 632596 626167 662333 688804 661703 642178 641219 712097
8945 712097 754612 842013 923094 967817 942058 915476 895312 911838 940600 1008020 1035250 1023974
$$ packed form
9029A077407r2637p0447o759j7707n8453K4587J5053J9200J858l2904j4747m8144
9017G96307L7649r439r3391q5202J7256J3438K1455L8057M7530O823M5638k4608
9005H11513j2236j4581J5172l1820P806k1589M3174P2400R6171k3602j3554J19952
8993A048806J14377M6978P761L628J0021m279n646p7881n1298j6128j6207j6198
8981A043934O0718M9393j2092m1886n3290o7110O971N7387N106n9853q7111l1814
8969H70353l8790j22710k2235K5267J2275K02k8160M5345J043j9239J5102J9072
8957G57525k7572p0973r2879L5948L0547o429L6166K6471k7101j9525r59P0878
8945G12097M2515Q7401Q1081M4723k5759k6582k0164J6526K8762O7420K7230j1276
$$ plain form
8933 1023974 985480 958709 905689 896182 879922 846282 777206 682107 652056 667617 657032 598117
8921 598117 539148 566812 590555 640962 668341 656904 632047 646244 577162 550312 544936 540587
8909 540587 511977 499350 501915 519107 515967 511551 550886 596459 634870 643521 697890 748915
8897 748915 788454 900232 954556 1017128 1061943 1143225 1199586 1338348 1450773 1605731 1686751
8886 1686751 1817278 2054825 2398958 2837855 3540772 4858981 7061673 10198608 13347756
8877 13347756 14891757 14766804 14365073 14229883 13116646 10127605 7160207 5366250 4293139
8868 4293139 3628324 3163626 2874141 2624164 2373641 2218013 2138249 2084585 1935605 1770354
8858 1770354 1612973 1502125 1431103 1354685 1246885 1134643 1070361 1083853 1030362 1008622 971491
$$ packed form
8933A023974l8494k6771n3020r507j6260l3640o9076r5099l0051J5561j0585n8915
8921E98117n8969K7664K3743N0407K7379j1437k4857J4197o9082k6850n376m349
8909E40587k8610j2627K565J7192l140m416L9335M5573L8411Q651N4369N1025
8897G48915L9539J11778N4324O2572M4815Q1282N6361J38762J12425J54958Q1020
8886A686751J30527K37547L44133M38897P02917J318209K202692L136935L149148
8877A3347756J544001j24953m01731j35190j113237k989041k967398j793957j073111
8868D293139o64815m64698k89485k49977k50523j55628p9764n3664j48980j65251
8858A770354j57381j10848p1022p6418j07800j12242o4282J3492n3491k1740l7131
$$ plain form
8847 971491 881434 890830 893723 839177 837696 773708 749972 712181 643424 628634 612160 652059
8835 652059 642012 574485 570557 570868 527908 558075 593183 590268 574615 629175 668545 600293
8823 600293 526845 472155 437339 439056 486416 474349 450928 412243 407240 423351 431771 447714
8811 447714 420832 405200 400287 382309 380359 419901 421306 350817 295359 252834 273120 304839
8799 304839 329195 336463 319202 302119 287049 329937 330561 301576 273330 274795 338659 348518 384088
8786 384088 364929 340178 328598 319270 287319 310880 368409 341650 322714 272477 227445 177835
8774 177835 177506 265342 275506 250255 257088 205031 183408 181190 214508 218747 266400 313507 301327
8761 301327 340116 375986 397259 344710 339715 325266 280330 247635 286080 274818 268648 258707
$$ packed form
8847I71491r0057R396K893n4546j481o3988k3736l7791o8757j4790j6474L9899
8835F52059j0047o7527l928L11m2960L0167L5108k915j5653N4560L9370o8252
8823F00293p3448n4690l4816J717M7360j2067k3421l8685n003J6111Q420J5943
8811D47714k6882j5632m913j7978j950L9542J405p0489n5458m2525K0286L1719
8799C04839K4356P268j7261j7083j5070M2888O24k8985k8246J465O3864R859L5570
8786C84088j9159k4751j1580r328l1951K3561N7529k6759j8936n0237m5032m9610
8774A77835l29Q7836J0164k5251O833n2057k1623k218L3318M239M7653M7107j2180
8761C01327L8789L5870K1273n2549m995j4449m4936l2695L8445j1262o170r941
$$ plain form
8749 258707 260350 262165 263380 263829 301093 368235 332862 311651 225615 187297 231543 254496 215727
8736 215727 185655 206605 250033 244728 283575 278386 263359 226488 243181 317382 254436 224384
8724 224384 215022 170944 165779 187500 210912 297905 278251 244378 281087 297097 273850 210924
8712 210924 205203 227527 229752 223923 190584 206132 284420 270774 210682 215824 271662 249779
8700 249779 282008 262176 225952 239258 207296 165923 99912 93426 123671 196129 235078 240004
8688 240004 187261 184736 194567 235062 273822 201085 175229 267242 317095 271662 219873 234347
8676 234347 282017 299861 308549 284833 253199 249828 273200 232015 197602 221342 258705 197508
8664 197508 163957 155969 143330 167408 150549 167773 215169 221294 231482 234711 182893 118294
$$ packed form
8749B58707J643J815J215M49L7264O7142l5373k1211q6036l8318M4246K2953l8769
8736B15727l0072K0950M3428n305L8847n189j5027l6871J6693P4201o2946l0052
8724B24384r362m4078n165K1721K3412Q6993j9654l3873L6709J6010k3247o2926
8712B10924n721K2324K225n829l3339J5548P8288j3646o0092N142N5838k1883
8700B49779L2229j9832l6224J3306l1962m1373o6011o486L0245P2458L8949M926
8688B40004n2743k525R831M0495L8760p2737k5856R2013M9853m5433n1789J4474
8676B34347M7670J7844Q688k3716l1634l371K3372m1185l4413K3740L7363o1197
8664A97508l3551p988j2639K4078j6859J7224M7396O125J0188L229n1818o4599
$$ plain form
8652 118294 102643 113089 141706 134808 166511 199913 215722 220729 215953 283596 311811 272389
8640 272389 253031 228515 260399 311413 331478 297851 280941 235434 222476 217770 137848 155140
8628 155140 209289 195411 196246 250753 341244 333346 286060 232485 263227 289384 279304 255502
8616 255502 250777 261086 266474 280780 242639 160448 242866 343557 360094 375724 435017 418022
8604 418022 395064 397367 465250 520006 539446 496771 498702 560535 644209 694584 659084 626507
8592 626507 633662 654607 589414 474230 342681 305128 269257 259942 285582 280560 307213 304829
8580 304829 248255 240740 254790 273796 244444 193676 190400 207021 219732 168651 181521 178312
8568 178312 127175 99877 130470 142388 91535 73351 101584 64448 132879 237674 273518
$$ packed form
8652A18294j5651J0446K8617o898L1703L3402J5809N007m776O7643K8215l9422
8640B72389j9358k4516L1884N1014K0065l3627j6910m5507j2958m706p9922J7292
8628A55140N4149j3878Q35N4507R0491p898m7286n3575L0742K6157j0080k3802
8616B55502m725J0309N388J4306l8141q2191Q2418J00691J6537J5630N9293j6995
8604D18022k2958K303O7883N4756J9440m2675J931O1833Q3674N0375l5500l2577
8592F26507P155K0945o5193j15184j31549l7553l5871r315K5640n022K6653k384
8580C04829n6574p515J4050J9006k9352n0768l276J6621J2711n1081J2870l209
8568A78312n1137k7298L0593J1918n0853j8184K8233l7136O8431J04795L5844
$$ plain form
8557 273518 247102 247772 236957 263095 315305 343107 394037 431879 403688 382088 370478 401350
8545 401350 384870 299386 231491 198182 239090 286916 316275 290520 203633 167036 191199 229056
8533 229056 231855 227010 181271 133850 63886 -2301 4424 78579 104385 92643 150054 164111
8521 164111 125598 126429 184777 192621 178090 185149 197307 217123 184907 112363 172261 187727
8509 187727 169658 186715 180617 240552 255669 259445 248910 236877 258038 214057 198255 154996
8497 154996 136267 126722 120138 102080 80276 107341 153082 124481 53330 32480 76377 135330
8485 135330 173130 172069 158096 157731 167679 205348 227504 222158 189160 198382 203243 175538 217108
8472 217108 188831 168748 192615 246854 211719 187311 185295 185867 136103 127305 123814 71059 22875
$$ packed form
8557B73518k6416O70j0815K6138N2210K7802N0930L7842k8191k1600j1610L0872
8545D01350j6480q5484o7895l3309M0908M7826K9359k5755q6887l6597K4163L7857
8533B29056K799m845m5739m7421o9964o6187O725P4155K5806j1742N7411J4057
8521A64111l8513Q31N8348P844j4531P059J2158J9816l2216p2544N9898J5466
8509A87727j8069J7057o098N9935J5117L776j0535j2033K1161m3981j5802m3259
8497A54996j8729r545o584j8058k1804K7065M5741k8601p1151k0850M3897N8953
8485A35330L7800j061j3973l65R948L7669K2156n346l2998R222M861k7705M1570
8472B17108k8277k0083K3867N4239l5135k4408k016N72m9764q798l491n2755m8184
$$ plain form
8459 22875 -55608 -21779 45953 87804 43220 38135 78426 89101 109996 146209 156433 135261
8447 135261 75524 72283 95976 91142 111844 91618 127832 172311 203119 205753 221093 223717
8435 223717 211479 158975 149975 170883 175753 172736 191345 216061 178029 123140 128080 172912
8423 172912 203768 237289 224741 213325 221313 191002 212329 290681 271803 227266 190694 161632
8411 161632 166265 187328 163205 148326 172328 206509 221651 175418 149934 220684 234399 228964
8399 228964 179156 154395 174121 161000 182159 197450 224136 212849 201655 194531 206358 217435
8387 217435 184974 153360 187729 170589 153869 128628 97652 136601 208335 227443 221926 221800
8375 221800 275011 359708 423341 404201 314122 349620 362145 261195 160617 165289 179195
$$ packed form
8459B2875p8483L3829O7732M1851m4584n085M0291J0675K0895L6213J0224k1172
8447A35261n9737l241K3693m834K0702k0226L6214M4479L0808K634J5340K624
8435B23717j2238n2504r000K0908M870l017J8609K4716l8032n4889M940M4832
8423A72912L0856L3521j2548j1416P988l0311K1327P8352j8878m4537l6572k9062
8411A61632M633K1063k4123j4879K4002L4181J5142m6233k5484P0750J3715n435
8399B28964m9808k4761J9726j3121K1159J5291K6686j1287j1194p124J1827J1077
8387B17435l2461l1614L4369j7140j6720k5241l0976L8949P1734J9108n517j26
8375B21800N3211Q4697O3633j9140r0079L5498J2525j00950j00578M672J3906
$$ plain form
8364 179195 137818 100094 88482 120326 131494 217066 177191 73795 2072 10261 -2217 30950
8352 30950 67023 78781 49695 51987 3833 -22069 28808 79112 115502 144352 133607 108145
8340 108145 138928 130443 157064 203828 213483 258999 236450 245416 212369 179335 159834 199836
8328 199836 269840 273663 253374 267542 293092 245311 224792 221434 219604 169223 142835 83657
8316 83657 83223 83085 93084 107620 87411 109536 94800 120799 129623 115373 94538 11261 5824
8303 5824 64982 90667 124610 131479 153060 140216 133168 118771 129777 118079 126097 99925 85409
8290 85409 88338 177493 201735 217982 206118 227477 197449 181631 159749 154805 139897 86737
8278 86737 61328 -7789 -29173 16871 25161 5987 53043 70489 35254 -14709 -76282 -75121
$$ packed form
8364A79195m1377l7724j1612L1844J1168Q5572l9875j03396p1723Q189j2478L3167
8352C0950L6073J1758k9086K292m8154k5902N0877N0304L6390K8850j0745k5462
8340A08145L0783q485K6621M6764R655M5516k2549Q966l3047l3034j9501M0002
8328A99836P0004L823k0289J4168K5550m7781k0519l358j830n0381k6388n9178
8316H3657m34j38R999J4536k0209K2125j4736K5999Q824j4250k0835q3277n437
8303E824N9158K5685L3943O869K1581j2844p048j4397J1006j1698Q018k6172j4516
8290H5409K929Q9155K4242J6247j1864K1359l0028j5818k1882m944j4908n3160
8278H6737k5409o9117k1384M6044Q290j9174M7056J7446l5235m9963o1573J161
$$ plain form
8266 -75121 -47031 -37533 -5536 24129 -8512 28735 97624 157951 107389 -21113 -57482 4373
8254 4373 5125 2997 30272 71739 35987 8246 22135 9758 19668 36909 83391 115137 98232
8241 98232 82706 102525 171841 144904 130898 97134 78586 44981 -9639 50688 68741 70909
8229 70909 52203 81738 125843 118132 115714 113074 93120 61429 -2002 -27672 57698 129548
8217 129548 156579 119617 149772 183368 186289 146471 132467 132505 83680 59855 34107 37286 28245
8204 28245 54385 95966 69535 -988 163 36418 22447 40595 33089 39225 34276 55778 58597
8191 58597 65824 77576 103269 133470 80333 3951 -29947 -15315 -5699 -24284 -11665 28527
8179 28527 73027 118057 91604 50312 83098 78690 58824 26933 17443 47569 10743 53114
$$ packed form
8266g5121K8090R498L1997K9665l2641L7247O8889O0327n0562j28502l6369O1855
8254D373P52k128K7275M1467l5752k7741J3889j2377R910J7241M6482L1746j6905
8241I8232j5526J9819O9316k6937j4006l3764j8548l3605n4620O0327J8053K168
8229G0909j8706K9535M4105p711k418k640j9954l1691o3431k5670Q5370P1850
8217A29548K7031l6962L0155L3596K921l9818j4004L8m8825k3825k5748L179r041
8204B8245K6140M1581k6431p0523J151L6255j3971J8148p506O136m949K1502K819
8191E8597P227J1752K5693L0201n3137p6382l3898J4632R616j8585J2619M0192
8179B8527M4500M5030k6453m1292L2786m408j9866l1891r490L0126l6826M2371
$$ plain form
8167 53114 93538 82249 29853 41545 78301 116287 102803 50112 3235 15487 26152 21203
8155 21203 -24154 17923 49184 53036 35536 30377 47296 81408 60094 11054 61494 135457
8143 135457 97996 55964 42763 80885 115351 95468 88048 92503 102801 131387 123236 129251
8131 129251 39299 -26218 36569 62937 74093 88523 46385 -3993 38302 75065 86247 88966
8119 88966 113690 88759 74422 -4632 -24839 -7828 -47102 -20376 42751 71425 63194 49113
8107 49113 95350 110283 84176 89227 113857 85371 79226 115410 169601 132696 77700 68137
8095 68137 79942 89277 102322 82254 67317 41266 14930 25554 67465 22926 80250 97635
8083 97635 63306 94444 147241 124757 137984 157366 151618 131064 133508 130190 77349 72089 44743
$$ packed form
8167E3114M0424j1289n2396J1692L6756L7986j3484n2691m6877J2252J0665m949
8155B1203m5357M2077L1261L852j7500n159J6919L4112k1314m9040N0440P3963
8143A35457l7461m2032j3201L8122L4466j9883p420M455J0298K8586q151O015
8131A29251q9952o5517O2787K6368J1156J4430m2138n0378M2295L6763J1182K719
8119H8966K4724k4931j4337p9054k0207J7011l9274K6726O3127K8674q231j4081
8107D9113M6237J4933k6107N051K4630k8486o145L6184N4191l6905n4996r563
8095F8137J1805R335J3045k0068j4937k6051k6336J0624M1911m4539N7324J7385
8083I7635l4329L1138N2797k2484J3227J9382n748k0554K444l318n2841n260k7346
$$ plain form
8070 44743 78648 88644 92318 95548 87480 63669 60696 83815 127171 109130 88139 130195 117014
8057 117014 139035 231850 238290 125169 124066 166339 165391 130613 116408 146297 156330 127514
8045 127514 86436 114887 96596 139973 133229 113685 106452 75247 83470 111896 79780 95345
8033 95345 129390 98076 105638 102589 123725 190540 138059 142644 186484 192135 152915 123282 110332
8020 110332 104737 101650 178852 190005 126391 83664 95323 161595 131395 120746 150484 146912
8008 146912 154847 129959 157504 189291 190189 209657 202574 120816 25175 38873 120584 168097
7996 168097 168174 173507 205769 165047 92331 60604 55505 85829 56304 62166 126167 159056 129966
7983 129966 124667 139707 62197 53597 50500 51115 127963 146793 75350 71732 45235 96919 208305
$$ packed form
8070D4743L3905R996L674L230q068k3811k973K3119M3356j8041k0991M2056j3181
8057A17014K2021R2815O440j13121j103M2273r48l4778j4205K9889J0033k8816
8045A27514m1078K8451j8291M3377o744j9544p233l1205Q223K8426l2116J5565
8033I5345L4045l1314P562l049K1136O6815n2481M585M3840N651l9220k9633j2950
8020A10332n595l087P7202J1153o3614m2727J1659O6272l0200j0649K9738l572
8008A46912P935k4888K7545L1787Q98J9468p083q1758r5641J3698Q1711M7513
7996A68097P7N333L2262m0722p2716l1727n099L0324k9525N862O4001L2889k9090
7983A29966n299J5040p7510q600l097O15P6848J8830p1443l618k6497N1684J11386
$$ plain form
7970 208305 187037 194387 251676 305227 244409 154901 100746 110279 135026 166138 163899 166035
7958 166035 193792 231393 219862 177095 142157 116791 131616 162383 177973 197384 118470 79670
7946 79670 86142 119598 109879 141652 227906 168647 83497 63132 50251 55465 100825 122624
7934 122624 116047 106409 125179 166153 138082 122875 97493 63849 51739 65253 142146 169588
7922 169588 198843 257574 253790 158147 104810 146846 172862 140559 175091 222936 181843 188050
7910 188050 193805 169230 128933 97702 103879 122507 159454 165857 152383 145831 153073 173521 145466
7897 145466 118563 60020 53941 76615 120270 122441 91997 11743 56269 175563 194538 154286
7885 154286 50985 60882 31177 -10701 42773 44938 91876 115154 155708 180651 176204 145443
$$ packed form
7970B08305k1268P350N7289N3551o0818q9508n4155R533K4747L1112k239K136
7958A66035K7757L7601j1531m2767l4938k5366J4825L0767J5590J9411p8914l8800
7946G9670O472L3456r719L1773Q6254n9259q5150k0365j2881N214M5360K1799
7934A22624o577r638J8770M0974k8071j5207k5382l3644j2110J3514P6893K7442
7922A69588K9255N8731l784r5643n3337M2036K6016l2303L4532M7845m1093O207
7910A88050N755k4575m0297l1231O177J8628L6947O403j3474o552P242K0448k8055
7897A45466k6903n8543o079K2674M3655K171l0444q0254M4526J19294J8975m0252
7885A54286j03301R897k9705m1878N3474K165M6938K3278M0554K4943m447l0761
$$ plain form
7873 145443 134055 142093 209795 159159 94336 125650 131166 113218 109033 123898 93973 94462 112270
7860 112270 130156 122904 75693 45579 46683 59655 100805 90769 50852 71644 78451 94263
7848 94263 83807 94335 113263 95697 67602 46097 -19907 -13852 23954 110583 129358 130761
7836 130761 74531 81156 103166 53788 52547 46813 18387 -6662 45349 89884 79753 43053
7824 43053 -19188 6873 41709 57398 20986 15006 -4060 1875 -9649 10073 6647 1507 55514
7811 55514 57941 48876 6342 -7540 15826 25299 44919 53521 38326 2527 -28338 -7424 23169
7798 23169 32236 12061 12318 25248 50729 66801 40371 6148 -6788 -18505 -9320 7155 78158
7785 78158 131056 131021 109255 66604 42519 17163 10493 21467 58351 16396 -54279 -75469 -32656
$$ packed form
7873A45443j1388Q038O7702n0636o4823L1314N516j7948m185J4865k9925M89J7808
7860A12270J7886p252m7211l0114J104J2972M1150j0036l9917K0792O807J5812
7848I4263j0456J0528J8928j7566k8095k1505o6004O055L7806Q6629J8775J403
7836A30761n6230O625K2010m9378j241n734k8426k5049N2011M4535j0131l6700
7824D3053o2241K6061L4836J5689l6412n980j9066N935j1524J9722l426n140N4007
7811E5514K427r065m2534j3882K3366R473J9620Q602j5195l5799l0865K0914L0593
7798B3169R067k0175K57J2930K5481J6072k6430l4223j2936j1717R185J6475P1003
7785G8158N2898l5k1766m2651k4085k5356o670J0974L6884m1955p0675k1190M2813
$$ plain form
7772 -32656 14498 77847 126962 89129 80817 92820 82440 61522 52419 8862 -83025 -38427
7760 -38427 39722 63769 51218 16822 -4799 -8446 -19204 3388 -21686 -67168 -68980 -41479
7748 -41479 18893 42336 46033 42061 59152 60049 51830 -15397 -23889 -18445 7869 22875 12515
7735 12515 6921 28973 75700 56177 68380 85049 80211 35457 -19963 -37563 -7878 5002
7723 5002 12004 11254 19390 13044 13533 23170 -15576 -30245 -11932 19106 22445 18209 -29684 -25691
7709 -25691 23422 12403 -21929 -43019 1215 25843 30624 -11442 -9656 44826 44397 60992 58902
7696 58902 2652 -4868 -18876 -2288 30668 42045 45783 -3763 27288 38940 30081 83798
7684 83798 94193 66597 14627 -9873 -27504 31907 92464 116643 107570 59439 43522 19514
$$ packed form
7772c2656M7154O3349M9115l7833q312J2003j0380k0918r103m3557r1887M4598
7760c8427P8149K4047j2551l4396k1621l647j0758K2592k5074m5482j812K7501
7748d1479O0372K3443L697l972J7091Q97q219o7227q492N444K6314J5006j0360
7735A2515n594K2052M6727j9523J2203J6669m838m4754n5420j7600K9685J2880
7723E002P002p50Q136o346M89R637l8746j4669J8313L1038L339m236m7893L993
7709b5691M9113j1019l4332k1090M4234K4628M781m2066J786N4482m29J6595k090
7696E8902n6250p520j4008J6588L2956J1377L738m9546L1051J1652q859N3717
7684H3798J0395k7596n1970k4500j7631N9411O0557K4179r073m8131j5917k4008
$$ plain form
7672 19514 -3820 -39146 -51729 21273 73710 72177 74327 62417 17865 32826 -21707 -11069
7660 -11069 13961 23387 14293 80079 56691 13633 16657 -8199 -25266 4167 10535 9683 61387
7647 61387 57009 3199 -5240 30075 29814 -75531 -48690 -11713 -36649 -77839 -9055 25067
7635 25067 53784 19268 16357 104479 66458 -15793 25414 52661 11874 -40744 5518 32647
7623 32647 83266 75568 78180 79720 87672 51835 -11164 -64939 -48810 -17302 -60293 -11232 37310
7610 37310 -3876 -36797 -58707 -34585 -40791 -16802 -19210 -42700 -43998 -73956 -6112 110757
7598 110757 103203 13242 6862 22552 58951 4971 -23612 -23176 29670 40187 13751 -35511
7586 -35511 -60265 -93024 -63650 -13485 51420 97531 61388 42038 23005 86695 118217 70986
$$ packed form
7672A9514k3334l5326j2583P3002N2437j533K150j1910m4552J4961n4533J0638
7660a1069K5030R426r094O5786k3388m3058L024k4856j7067K9433O368q52N1704
7647F1387m378n3810q439L5315k61j05345K6841L6977k4936m1190O8784L4122
7635B5067K8717l4516k911Q8122l8021q2251M1207K7247m0787n2618M6262K7129
7623C2647N0619p698K612J540P952l5837o2999n3775J6129L1508m2991M9061M8542
7610C7310m1186l2921k1910K4122o206K3989k408k3490j298k9958O7844J16869
7598A10757p554q9961o380J5690L6399n3980k8583M36N2846J0517k6436m9262
7586c5511k4754l2759K9374N0165O4905M6111l6143j9350j9033O3690L1522m7231
$$ plain form
7574 70986 37361 113178 84078 78000 55568 16344 -20193 -43664 -42451 -38982 -32600 -36910 -60261
7561 -60261 -52372 26463 50934 85166 137813 119083 65666 67690 63819 56851 -1757 -37721 -43489
7548 -43489 -39607 -1197 64063 80344 36572 21952 20471 54174 28253 8131 59382 118438
7536 118438 75684 57124 99013 83778 68198 95553 111558 70707 93361 24400 -23152 -64664
7524 -64664 -5179 55361 38698 57123 92477 63949 37008 -46476 -57111 -76205 -110681 -87605
7512 -87605 -54378 -23558 385 5302 3771 -53294 -66650 -24999 -38237 -36159 2978 -9501
7500 -9501 -41205 -120348 -119569 -7502 51819 -6482 -2357 2865 21702 40011 56812 68579 80020
7487 80020 25336 -31105 -13158 -45731 -59728 -54809 -76166 -69215 -55013 6145 51463 72866
$$ packed form
7574G0986l3625P5817k9100o078k2432l9224l6537k3471J213L469O382m310k3351
7561f0261P889P8835K4471L4232N2647j8730n3417K024l871o968n8608l5964n768
7548d3489L882L8410O5260J6281m3772j4620j481L3703k5921k0122N1251N9056
7536A18438m2754j8560M1889j5235j5580K7355J6005m0851K2654o8961m7552m1512
7524f4664N9485O0540j6663J8425L5354k8528k6941q3484j0635j9094l4476K3076
7512h7605L3227L0820K3943M917j531n7065j3356M1651j3238K078L9137j2479
7500i501l1704p9143P79J12067N9321n8301M125N222J8837J8309J6801J1767J1441
7487H0020n4684n6441J7947l2573j3997M919k1357O951J4202O1158M5318K1403
$$ plain form
7475 72866 63226 34588 86390 113670 126470 81674 17329 14132 46102 -7353 -77930 -91210
7463 -91210 -75390 -25263 -9172 -49710 -74747 -48613 -7918 -14213 -28192 5733 40855 30272
7451 30272 20191 10451 20401 35523 30174 -43192 -68139 -29609 -21734 -50974 -60195 -51685 -14565
7438 -14565 60239 41308 -32406 -34974 -5323 27721 72227 73116 32026 -30392 -14341 6575
7426 6575 -11399 -19753 10865 18250 20379 20102 48119 87421 35890 75055 61000 72460 103609
7413 103609 48944 12497 16261 -23089 -23953 38517 103196 76000 46815 26494 -45970 -55300
7401 -55300 7607 -16038 -34856 8880 19180 67574 105175 109994 48060 21080 10747 48160
7389 48160 -498 27547 72803 90778 30752 10061 -29169 -41584 52786 97140 98479 25926
$$ packed form
7475G2866r640k8638N1802K7280J2800m4796o4345l197L1970n3455p0577j3280
7463i1210J5820N0127J6091m0538k5037K6134M0695o295j3979L3925L5122j0583
7451C0272j0081r740R950J5122n349p3366k4947L8530P875k9240r221Q510L7120
7438a4565P4804j8931p3714k568K9651L3044M4506Q89m1090o2418J6051K0916
7426F575j7974q354L0618P385K129k77K8017L9302n1531L9165j4055J1460L1149
7413A03609n4665l6447L764l9350q64O2470O4679k7196k9185k0321p2464r330
7401e5300O2907k3645j8818M3736J0300M8394L7601M819o1934k6980j0333L7413
7389D8160m8658K8045M5256J7975o0026k0691l9230j2415R4370M4354J339p2553
$$ plain form
7377 25926 -30547 15680 45703 50601 24806 5643 -14259 -44054 -50161 -22849 -59684 -50121
7365 -50121 -5110 -8228 -19742 -32122 33635 85774 28213 -77954 -84125 -38603 -11009 -20298
7353 -20298 -36611 -72675 -76980 -120026 -129676 -113760 -96381 -79258 -72706 -61483 1259 17345
7341 17345 -2928 -6439 -14596 13297 -10663 -49019 -48460 -46710 -53613 -25871 24480 34051 -24129
7328 -24129 -20416 28657 -7553 25332 45660 71462 90006 112932 87639 49040 -290 48324
7316 48324 78199 45787 16755 -2777 32746 69593 79637 76032 -9752 -39819 11494 61086
7304 61086 57294 -32450 15967 13665 -1022 -22652 -118 56515 87009 69805 66179 72410 47305
7291 47305 32701 109709 101569 58955 -20918 -67847 -39149 -35887 -29593 -38104 5076 60652 96557
$$ packed form
7377B5926n6473M6227L0023M898k5795j9163j9902k9795o107K7312l6835R563
7365e0121M5011l118j1514j2380O5757N2139n7561j06167o171M5522K7594r289
7353b0298j6313l6064m305m3046r650J5916J7379J7123O552J1223O2742J6086
7341A7345k0273l511q157K7893k3960l8356N59J750o903K7742N0351R571n8180
7328b4129L713M9073l6210L2885K0328K5802J8544K2926k5293l8599m9330M8614
7316D8324K9875l2412k9032j9532L5523L6847J0044l605q5784l0067N1313M9592
7304F1086l792q9744M8417k302j4687k1630K2534N6633L0494j7204l626O231k5105
7291D7305j4604P7008q140m2614p9873m6929K8698L262O294q511M3180N5576L5905
$$ plain form
7278 96557 46726 -25306 5673 34107 46021 51084 -495 4352 8717 32063 75884 41624
7266 41624 55338 27568 -11663 -31358 -58063 -49101 -48625 -21002 8882 -22463 -65591 -17857
7254 -17857 16908 -3581 10640 22206 12841 -14323 -3384 -7815 -52843 -70639 -73828 -52413
7242 -52413 -72466 -120321 -126900 -67963 -61069 -60559 -64663 -67735 -23215 37433 98106 58123 -35914
7229 -35914 -46718 -50751 -75883 -69792 -101826 -89830 -72785 -74644 -93820 -51221 -10873 -2485 8719
7216 8719 -4822 -51892 -3120 -10618 -52952 -33511 -29614 -40590 -46077 -62286 -129177 -194306 -117251
7203 -117251 -84115 -116397 -82495 -37396 -64732 -41381 5782 9839 35693 -1965 -33343 -75196
7191 -75196 -93329 -62932 -33655 24015 60040 59920 80651 59752 67216 95222 56704 48595 40213
$$ packed form
7278I6557m9831p2032L0979K8434J1914N063n1579M847M365K3346M3821l4260
7266D1624J3714k7770l9231j9695k6705Q962M76K7623K9884l1345m3128M7734
7254a7857L4765k0489J4221J1566r365k7164J0939m431m5028j7796l189K1415
7242e2413k0053m7855o579N8937O894N10m104l072M4520O0648O0673l9983r4037
7229c5914j0804m033k5132O091l2034J1996J7045j859j9176M2599M0348Q388J1204
7216H719j3541m7070M8772p498m2334J9441L897j0976n487j6209o6891o5129P7055
7203a17251L3136l2282L3902M5099k7336K3351M7163M057K5854l7658l1378m1853
7191g5196j8133L0397K9277N7670L6025j20K0731k0899P464K8006l8518q109q382
$$ plain form
7178 40213 2355 -25945 -10804 -24336 -58897 -44291 -31791 -4095 -55447 -62033 -14654 -2728
7166 -2728 -12410 -30233 -29705 24 -6151 -789 15342 22678 12542 4350 58236 59448 4878 -36296
7152 -36296 -44955 -28181 19429 40443 12870 25774 43423 76967 58494 37765 1236 19114
7140 19114 33239 63621 89626 113269 86559 19329 -975 3584 37819 835 20033 -3158
7128 -3158 -23147 -56152 -13996 39997 54460 91372 135315 105774 52097 31410 15087 -37511
7116 -37511 -36762 -12375 33578 69959 57446 47962 35500 52125 47989 -3510 -15493 -2065 27506
7103 27506 4823 -24370 -34770 -22207 -14061 -40431 -1029 -19521 -86458 -97442 -36197 -12996
7091 -12996 -21374 -116711 -121704 -109843 -109956 -110944 -55826 -44111 -26243 -27383 3891 39990 7791
$$ packed form
7178D0213l7858k8300J5141j3532l4561J4606J2500K7696n1352o586M7379J1926
7166b728r682j7823N28K9729o175N362J6131P336j0136q192N3886J212n4570m1174
7152c6296q659J6774M7610K1014k7573J2904J7649L3544j8473k0729l6529J7878
7140A9114J4125L0382K6005K3643k6710o7230k0304M559L4235l6984J9198k3191
7128c158j9989l3005M2156N3993J4463L6912M3943k9541n3677k0687j6323n2598
7116c7511P49K4387M5953L6381j2513r484j2462J6625m136n1499j1983J3428K9571
7103B7506k2683k9193j0400J2563Q146k6370L9402j8492o6937j0984O1245K3201
7091a2996q378r5337m993J1861j13r88N5118J1715J7868j140L1274L6099l2199
$$ plain form
7078 7791 15356 -2958 -15191 -10686 24706 38018 80522 62202 39926 -7249 -14068 -54403 -84270
7065 -84270 -38281 35134 58267 43245 16557 -15632 -896 18081 22827 36048 35578 23265
7053 23265 23758 -32770 -19244 41359 65848 58135 31071 41911 66994 46395 27761 50975
7041 50975 -8425 -43570 -39230 -89965 -79769 -89006 -68845 -44227 -65562 -93942 -58178 2559
7029 2559 11018 -4761 -5359 17729 -7735 -81898 -57675 -108540 -208514 -176546 -162687 -160512 -88844
7016 -88844 -35613 -45066 -55746 -66153 -77571 -44214 -18317 -60056 -48540 64455 104938 44916
7004 44916 31530 -24111 -46347 -36703 -63571 -27761 -5541 -38619 22338 68511 38858 47006
6992 47006 30591 -17665 811 24139 28512 37846 -9507 -72324 -91899 -76174 -72685 -55885
$$ packed form
7078G791P565j8314j2233M505L5392J3312M2504j8320k2276m7175o819m0335k9867
7065h4270M5989P3415K3133j5022k6688l2189J4736J8977M746J3221m70j2313
7053B3265M93n6528J3526O0603K4489p713k7064J0840K5083k0599j8634K3214
7041E0975n9400l5145M340n0735J0196r237K0161K4618k1335k8380L5764O0737
7029B559Q459j5779n98K3088k5464p4163K4223n0865r9974L1968J3859K175P1668
7016h8844N3231r453j0680j0407j1418L3357K5897m1739J1516J12995M0483o0022
7004D4916j3386n5641k2236R644k6868L5810K2220l3078O0957M6173k9653Q148
6992D7006j6415m8256J8476K3328M373R334m7353o2817j9575J5725L489J6800
$$ plain form
6980 -55885 -18706 -6262 -37997 -47228 -31779 34706 46351 15200 34865 33607 -8770 -71
6968 -71 16448 29423 27181 -29852 -32941 36552 49076 -7989 -60172 -55028 -22397 9255 21648
6955 21648 38164 70010 61990 30672 22075 51219 85883 75317 34302 71978 108390 112295
6943 112295 82948 96176 93033 53888 -21007 -2174 35050 40687 36343 6135 34904 48312
6931 48312 42065 9750 -29243 39787 93928 32096 28736 44303 9981 24410 21557 29103 47930
6918 47930 -416 -58875 -46181 -4664 -19866 -7635 48793 90902 74979 30618 4203 7191
6906 7191 14656 11487 34963 36143 35752 46044 11010 -11567 -11289 31875 22416 -49844 -72695 -48102
$$ packed form
6980e5885L7179J2444l1735r231J5449O6485J1645l1151J9665j258m2377Q699
6968g1J6519J2975k242n7033l089O9493J2524n7065n2183N144L2631L1652J2393
6955B1648J6516L1846q020l1318q597K9144L4664j0566m1015L7676L6412L905
6943A12295k9347J3228l143l9145p4895J8833L7224N637m344l0208K8769J3408
6931D8312o247l2315l8993O9030N4141o1832l360J5567l4322J4429k853P546J8827
6918D7930m8346n8459J2694M1517j5202J2231N6428M2109j5923m4361k6415K988
6906G191P465l169K3476J180l91J0292l5034k2577K78M3164r459p2260k2851K4593
$$ [...]
##END NTUPLES=NMR SPECTRUM
##END=
