##TITLE=Analysis number 319952
Compound Code cc 56004
Book Reference 494/2
Project Code adrs
Chemist Name craigr
##JCAMPDX= 6.0         $$ Bruker NMR JCAMP-DX V2.0
##DATA TYPE= NMR SPECTRUM
##DATA CLASS= NTUPLES
##ORIGIN= Bruker BioSpin GmbH
##OWNER= nmr
$$ XWIN-NMR		Version 3.5
$$ Mon Jun  5 12:20:11 2006 GMT Daylight Time (UT+1h)  MAYBRIDGE\nmr@NMR_250MHZ
##.OBSERVE FREQUENCY= 250.131544655141
##.OBSERVE NUCLEUS= ^1H
##.ACQUISITION MODE= SIMULTANEOUS (DQD)
##.ACQUISITION SCHEME= undefined
##.AVERAGES= 16
##.DIGITISER RES= 18
##SPECTROMETER/DATA SYSTEM= dpx250
##.PULSE SEQUENCE= zg30
##.SOLVENT NAME= CDCl3
##.SHIFT REFERENCE= (INTERNAL, CDCl3, 0, 16.522)
##AUDIT TRAIL= $$ (NUMBER, WHEN, WHO, WHERE, WHAT)
$$ ##TITLE= Audit trail, XWIN-NMR		Version 3.5
$$ ##JCAMPDX= 5.01
$$ ##ORIGIN= Bruker BioSpin GmbH
$$ ##OWNER= nmr
$$ C:\u/data/dgb/nmr/ADRS/280/pdata/1/auditp.txt
$$ ##AUDIT TRAIL=  $$ (NUMBER, WHEN, WHO, WHERE, WHAT)
(   1,<2006-06-05 12:19:37.64 +100>,<MAYBRIDGE\nmr>,<NMR_250MHZ>,
      <created by zg, POWCHK disabled, PULCHK disabled
       configuration hash MD5:
       E2 DF 36 D8 04 B2 41 60 5A D7 A3 38 5A 4B D0 FE
       data hash MD5: 64K
       AE C7 30 5E 50 5A 68 8D 3B B0 A0 80 F5 45 B1 0C>)
(   2,<2006-06-05 12:19:54.59 +100>,<MAYBRIDGE\nmr>,<NMR_250MHZ>,
      <Start of raw data processing
       ef LB = 0.3 FT_mod = 6 PKNL = 1 SI = 32K 
       data hash MD5: 32K
       5D 57 25 CD 44 54 87 68 56 87 C8 D1 99 BD 8C 45>)
(   3,<2006-06-05 12:19:59.51 +100>,<MAYBRIDGE\nmr>,<NMR_250MHZ>,
      <apk 
       data hash MD5: 32K
       51 1F 0E 9D D1 F8 A1 25 F0 E1 28 E2 80 4E 00 F1>)
(   4,<2006-06-05 12:20:02.00 +100>,<MAYBRIDGE\nmr>,<NMR_250MHZ>,
      <abs ABSG = 5 
       data hash MD5: 32K
       22 E6 0A A8 CB 67 7C FD D8 35 82 FD 49 CC DB A8>)
$$ ##END=
$$ 
$$ hash MD5
$$ EE 50 C2 D3 B3 39 C6 E2 A9 24 C8 53 74 42 C7 15
##$RELAX= 
##$RELAX= 
##$RELAX= 
##$RELAX= 
##$RELAX= 
##$RELAX= 
##$RELAX= 
$$ Bruker specific parameters
$$ --------------------------
##$DU= <C:\u>
##$EXPNO= 280
##$NAME= <ADRS>
##$PROCNO= 1
##$TYPE= <nmr>
##$USER= <dgb>
##$AMP= (0..31)
100 100 100 100 100 100 100 100 100 100 100 100 100 100 100 100 100 100 
100 100 100 100 100 100 100 100 100 100 100 100 100 100 
##$AQSEQ= 0
##$AQ_mod= 3
##$AUNM= <au_zg>
##$AUTOPOS= <13 >
##$BF1= 250.13
##$BF2= 250.13
##$BF3= 250.13
##$BF4= 250.13
##$BF5= 500.13
##$BF6= 500.13
##$BF7= 500.13
##$BF8= 500.13
##$BYTORDA= 1
##$CFDGTYP= 0
##$CFRGTYP= 5
##$CHEMSTR= <none>
##$CNST= (0..31)
1 1 145 1 1 1 1 1 1 1 1 1 1 1 1 1 1 1 1 1 1 1 1 1 1 1 1 1 1 1 1 1 
##$CPDPRG= <>
##$CPDPRG1= <>
##$CPDPRG2= <>
##$CPDPRG3= <>
##$CPDPRG4= <mlev>
##$CPDPRG5= <mlev>
##$CPDPRG6= <mlev>
##$CPDPRG7= <mlev>
##$CPDPRG8= <mlev>
##$CPDPRGB= <>
##$CPDPRGT= <>
##$D= (0..31)
0 1 0 0 0 0 0 0 0 0.06 0 0 0 0 0 0 0.0002 0 0 0 0 0 0 0 0 0 0 0 0 0 0 
0 
##$DATE= 1149506376
##$DBL= (0..7)
120 120 120 120 120 120 120 120 
##$DBP= (0..7)
150 150 150 150 150 150 150 150 
##$DBP07= 0
##$DBPNAM0= <>
##$DBPNAM1= <>
$$ [...]
##$SUBNAM7= <"">
##$SUBNAM8= <"">
##$SUBNAM9= <"">
##$SW= 20.6930455092707
##$SWIBOX= (0..15)
0 0 3 0 0 0 0 0 0 0 0 0 0 0 0 0 
##$SW_h= 5175.983436853
##$TD= 65536
##$TD0= 1
##$TE= 296.16
##$TE2= 300
##$TE3= 300
##$TEG= 300
##$TL= (0..7)
0 120 120 120 120 120 120 120 
##$TP= (0..7)
150 150 150 150 150 150 150 150 
##$TP07= 0
##$TPNAME0= <>
##$TPNAME1= <>
##$TPNAME2= <>
##$TPNAME3= <>
##$TPNAME4= <>
##$TPNAME5= <>
##$TPNAME6= <>
##$TPNAME7= <>
##$TPOAL= (0..7)
0.5 0.5 0.5 0.5 0.5 0.5 0.5 0.5 
##$TPOFFS= (0..7)
0 0 0 0 0 0 0 0 
##$TUNHIN= 0
##$TUNHOUT= 0
##$TUNXOUT= 0
##$USERA1= <user>
##$USERA2= <user>
##$USERA3= <user>
##$USERA4= <user>
##$USERA5= <user>
##$V9= 5
##$VALIST= <valist>
##$VCLIST= <CCCCCCCCCCCCCCC>
##$VD= 0
##$VDLIST= <DDDDDDDDDDDDDDD>
##$VPLIST= <PPPPPPPPPPPPPPP>
##$VTLIST= <TTTTTTTTTTTTTTT>
##$WBST= 1024
##$WBSW= 4
##$XGAIN= (0..3)
0 0 0 0 
##$XL= 0
##$YL= 0
##$YMAX_a= 381664
##$YMIN_a= -509151
##$ZGOPTNS= <>
##$ZL1= 120
##$ZL2= 120
##$ZL3= 120
##$ZL4= 120
##$ABSF1= 16.522
##$ABSF2= -4.171173
##$ABSG= 5
##$ABSL= 3
##$ALPHA= 0
##$AQORDER= 0
##$ASSFAC= 0
##$ASSFACI= 0
##$ASSFACX= 0
##$ASSWID= 0
##$AUNMP= <proc_1d>
##$AZFE= 0.1
##$AZFW= 0.1
##$BCFW= 0
##$BC_mod= 0
##$BYTORDP= 0
##$COROFFS= 0
##$CY= 12.5
##$DATMOD= 1
##$DC= 0
##$DFILT= <>
##$DTYPP= 0
##$F1P= 14.0000005364418
##$F2P= -0.99999901652339
##$FCOR= 0.5
##$FTSIZE= 32768
##$FT_mod= 6
##$GAMMA= 0
##$GB= 0
##$INTBC= 1
##$INTSCL= 1
##$ISEN= 128
##$LB= 0.3
##$LEV0= 0
##$LPBIN= 0
##$MAXI= 10000
##$MC2= 0
##$MEAN= 0
##$ME_mod= 0
##$MI= 0
##$NCOEF= 0
##$NC_proc= -4
##$NLEV= 6
##$NOISF1= 0
##$NOISF2= 0
##$NSP= 0
##$NTH_PI= 0
##$NZP= 0
##$OFFSET= 16.522
##$PC= 1
##$PHC0= 166.5522
##$PHC1= 11.48698
##$PH_mod= 1
##$PKNL= yes
##$PPARMOD= 0
##$PSCAL= 4
##$PSIGN= 0
##$REVERSE= no
##$SF= 250.13
##$SI= 32768
##$SIGF1= 0
##$SIGF2= 0
##$SINO= 400
##$SIOLD= 32768
##$SREGLST= <1H.CDCl3>
##$SSB= 0
##$STSI= 32768
##$STSR= 0
##$SW_p= 5175.98343685301
##$SYMM= 0
##$S_DEV= 0
##$TDeff= 65536
##$TDoff= 0
##$TI= <Analysis number 999999
Compound Code 99
Book Reference 9
Project Code 9>
##$TILT= no
##$TM1= 0
##$TM2= 0
##$TOPLEV= 0
##$USERP1= <user>
##$USERP2= <user>
##$USERP3= <user>
##$USERP4= <user>
##$USERP5= <user>
##$WDW= 1
##$XDIM= 32768
##$YMAX_p= 391709834
##$YMIN_p= -351400
$$ End of Bruker specific parameters
$$ ---------------------------------
##NTUPLES= NMR SPECTRUM
##VAR_NAME=  FREQUENCY,     SPECTRUM/REAL,   SPECTRUM/IMAG
##SYMBOL=    X,             R,               I
##VAR_TYPE=  INDEPENDENT,   DEPENDENT,       DEPENDENT
##VAR_FORM=  AFFN,          ASDF,            ASDF
##VAR_DIM=   32768,         32768,           32768
##UNITS=     HZ,            ARBITRARY UNITS, ARBITRARY UNITS
##FACTOR=    0.157963299565203, 1,           1
##FIRST=     4132.6476996994, 0,             0
##LAST=      -1043.33573715361, 0,           0
##MIN=       -1043.33573715361, -351400,     0
##MAX=       4132.6476996994, 391709834,     0
$$ Real data points
##PAGE= N=1
##DATA TABLE= (X++(R..R)), XYDATA
$$ [...]
20630f7031l6260L0569J1668j7780M3683L5161r903j5769o6580j2224O2273l0245
$$ -67031 -103291 -72722 -61054 -78834 -35151 10 -9893 -25662 -92242 -104466 -42193 -72438
20618g2438m0830L0875O0864J4153K7879K6972k6623m7267m1298n104L9830N210
$$ -72438 -113268 -82393 -21529 -7376 20503 47475 20852 -26415 -67713 -72817 -32987 -27777
20606b7777Q666j1614k1757J0315L6683J9366K0285k0917k0643J4968J1738k211
$$ -27777 -19111 -30725 -52482 -42167 -5484 13882 34167 13250 -7393 7575 19313 17102
20594A7102K548j2973J42j1341J4915J2843l3838K2460N6580M0098q8067o1870
$$ 17102 19650 6677 6819 -4522 10393 23236 -10602 11858 68438 108536 20469 -41401
20582d1401j2463k6109J9066M714K0700L5706L2933J5906L6247l5818j8493K2514
$$ -41401 -53864 -79973 -60907 -56193 -35493 213 33146 49052 85299 49481 30988 53502
20570E3502R657K3422n8176q7553K3011J9492K1052k6308r876R872J6333k7501
$$ 53502 63159 86581 28405 -59148 -36137 -16645 4407 -21901 -31777 -21905 -5572 -33073
20558c3073l3495P953N043N3349L9736l775o078P81j9470j0663l3967N0891J8481
$$ -33073 -66568 -58615 -53572 -223 39513 35738 29660 30441 10971 308 -33659 17232 35713
20545C5713J8095m7004l9095K7076L3671q4082J6944M4147P263k0171p2018l4063
$$ 35713 53808 6804 -32291 -5215 28456 -55626 -38682 5465 12728 -7443 -79461 -113524
20533a13524Q841K6969k9281l187M4925M0170j118n155n667L1209J3875j9796
$$ -113524 -104683 -77714 -106995 -110182 -65257 -25087 -26205 -31360 -37027 -5818 8057 -11739
20521a1739N562l2142n9892l1160L5684N4708L9382K862J6882j9861m2875K3402
$$ -11739 -6177 -38319 -98211 -129371 -93687 -38979 403 3265 20147 286 -42589 -19187
20509a9187j0578P7113N3605j5407m6863m8585j8877n705k476N0950O2980P083
$$ -19187 -29765 47348 100953 85546 38683 -9902 -28779 -34484 -36960 13990 76970 84053
20497H4053L0910j3047p462J628k1471j7054k6415k0064l8234l4046J9808O7430
$$ 84053 114963 101916 94454 96082 74611 57557 31142 11078 -27156 -61202 -41394 26036
20485B6036Q832l7970J3926K90J1562m1681n0868J3837K6555k039N6793p255j9912
$$ 26036 34868 -3102 10824 11114 22676 -19005 -69873 -56036 -29481 -31520 25273 18018 -1894
20472a894m1993J0723L440j3006K7Q775K2584M8454L620K338p282J7113j7087
$$ -1894 -43887 -33164 -29724 -42730 -42703 -33928 -11344 37110 40730 43068 35786 52899 35812
20459C5812j4076k636k4645J9860j2829m008k3657K5680m2142n5647M8250r843
$$ 35812 21736 19100 -5545 14315 1486 -2522 -26179 -499 -42641 -98288 -50038 -59881
20447e9881P648K3670J8261L5061l1658M0259K156m8737r562J2259P0681l3335
$$ -59881 -52233 -28563 -10302 24759 -6899 33360 35516 -13221 -22783 -10524 60157 26822
20435B6822j9345l5431J6721N6374M5521m5220k5959J1971j8891k1804j843K717
$$ 26822 7477 -27954 -11233 45141 90662 45442 19483 31454 12563 -9241 -11084 -8367
20423h367K8544j7069n6099n1982R278K7106L7024J7103K519j9452L2862j0238
$$ -8367 20177 3108 -52991 -104973 -95695 -68589 -31565 -14462 -11943 -31395 1467 -8771
20411h771o2421k3124p085O4209K9822j699K6658M676p330l238J2827K2275m9394
$$ -8771 -71192 -94316 -101401 -37192 -7370 -9069 17589 22265 14935 11697 24524 46799 -2595
20398b595j8138P3080L3887k9103o0053m5485J4750K8994M2406K2140o5581L1096
$$ -2595 -20733 52347 86234 57131 -2922 -48407 -33657 -4663 37743 59883 -5698 25398
20386B5398j1515M2667J3908n6871l6499P505l8916J6323K8389R436m7708q6869
$$ 25398 13883 56550 70458 13587 -22912 -15407 -54323 -38000 -9611 -175 -47883 -134752
20374a34752N384K8570N2958O693J0203R14J2790P122k743j7874j8776K2380L0242
$$ -134752 -129368 -100798 -47840 -41147 -30944 -30030 -17240 -10118 -12861 -30735 -49511 -27131 3111
20361C111j2713J827j0254l5442j3134q254k2513k4848N8150M2000M4384N0081
$$ 3111 -9602 -7775 -18029 -53471 -66605 -74859 -97372 -122220 -64070 -22070 22314 72395
20349G2395k9694o6348L8252N4657m9307n2564K2565k0401J3542J4071N3218J853
$$ 72395 42701 -23647 14605 69262 19955 -32609 -10044 -30445 -16903 -2832 50386 52239
20337E2239j9610m0392j8265j1175M6937J546L5328R062l6831q6511q3446k0998
$$ 52239 32629 -7763 -26028 -37203 9734 11280 46608 55670 18839 -67672 -151118 -172116
20325a72116J1690P1792l7654M5675K4443k5860K407L7939n186p466Q0548m1168
$$ -172116 -160426 -88634 -126288 -80613 -56170 -82030 -79623 -41684 -46870 -54336 26212 -14956
20313a4956m8620N879L957P543p445m1095L07M6107N0302M8237p381m541K9273
$$ -14956 -63576 -57697 -53740 -46197 -53642 -94737 -94430 -48323 1979 50216 42835 38294 67567
20300F7567k91o6157j482m514l6965R328J1153M373O177j3491j334n449n365K5504
$$ 67567 67276 1119 -363 -4877 -41842 -32514 -21361 -16988 -10811 -24302 -25636 -31085 -36450 -10946
20286a0946k0601K8504O7765k5933l7909j1604K586L647Q061Q58R032k5128l6913
$$ -10946 -31547 -3043 64722 38789 880 -10724 -8138 -4491 3570 4428 13460 -11668 -48581
20273d8581J9958N7937M3551l361L4210p381p6521j9373j6500k615L475L3946
$$ -48581 -28623 29314 72865 69504 103714 96333 19812 439 -16061 -18676 -15201 18745
20261A8745P876k0127J9601l0353m2199M341Q9777K0733o660K2504o007j0740
$$ 18745 26621 6494 26095 -4258 -46457 -42116 47661 68394 61734 84238 78231 67491
20249F7491p2966k7581N3380K479o1426N599M5220K0810K1321o174n018J5936
$$ 67491 -5475 -33056 20324 22803 -38623 -33024 12196 33006 54327 48153 43135 59071
20237E9071j5195k4837M01K8308M994K7657j1118l2656l1269j0531j0856M8145
$$ 59071 43876 19039 19440 47748 52742 80399 69281 36625 5356 -5175 -16031 32114
20225C2114M4132P2806k2751o5604j2060K8471J0334J6543l9093n5668L4378j9889
$$ 32114 76246 149052 126301 60697 48637 77108 87442 103985 64892 9224 43602 23713
20213B3713l5896K7992j2548j1558L9089o819k2462J6700O499K331P768l2826
$$ 23713 -12183 15809 3261 -8297 30792 23973 1511 18211 24710 27041 34809 1983
20201A983m9779k0334k1463p650J9055L6715L0701k4144j2626J4149L9746k5616
$$ 1983 -47796 -68130 -89593 -97243 -78188 -41473 -10772 -34916 -47542 -33393 6353 -19263
20189a9263l2155L913Q1097M2414o8612n9471q847L8270O0190K1795p5360N547
$$ -19263 -51418 -47505 33592 76006 7394 -52077 -60924 -22654 37536 59331 -16029 -10482
20177a0482R879K4984k583j9920n7979N928M4530m8140K3148J5627K4791k2834
$$ -10482 -603 24381 21798 1878 -56101 -50173 -5643 -53783 -30635 -15008 9783 -13051
20165a3051n956L9203J7301R656k2977J8691M0398j0120l9540R049L466l53j4371
$$ -13051 -19007 20196 37497 47153 24176 42867 83265 73145 33605 42654 46120 45767 31396
20152C1396l0960k1904k1226K1553J4468j1991k201J0655j8879k7371M8956M7788
$$ 31396 436 -21468 -42694 -21141 -6673 -18664 -20865 -10210 -29089 -56460 -7504 40284
20140D0284r005j8294J2274l8561k9340l617K0864L5483k3677O723K7168K8806
$$ 40284 31279 12985 25259 -13302 -42642 -46259 -25395 10088 -13589 -6866 20302 49108
20128D9108o571j8560p926J7880J1640j02239j1364L4203o537K2349O4615J7415
$$ 49108 42537 23977 16051 33931 45571 -56668 -68032 -33829 -40366 -18017 46598 64013
20116F4013j0621l6751J6115j0485j5775k4584q7257M836K1524K1581O4312N514
$$ 64013 53392 16641 32756 22271 6496 -18088 -105345 -100509 -78985 -57404 6908 12422
20104A2422M9572R657J3420Q571m2323q681K0307j6231m146K1135O18l1696j8423
$$ 12422 61994 71651 85071 93642 51319 42638 62945 46714 42568 63703 64321 32625 14202
20091A4202M6710L2131j6595N9552m6815k3860J8069M8764k2443p9762j3516J5085
$$ 14202 60912 93043 76448 136000 89185 65325 83394 132158 109715 29953 16437 31522
20079C1522O9115l6857o6278O2227L6763L520j8990m0958o4224j9011K0731n2959
$$ 31522 100637 63780 -2498 59729 96492 100012 81022 40064 -24160 -43171 -22440 -75399
20067g5399j2822K1606J9653j8480k801k37r872j4945m8999M2654j1189J2024
$$ -75399 -88221 -66615 -46962 -65442 -68243 -68480 -78352 -93297 -142296 -99642 -110831 -98807
20055i8807N0077l130L4036L7219j4310m6922K5526L3842P804k4832N8056l9401
$$ -98807 -48730 -51860 -17824 19395 5085 -41837 -16311 17531 25335 503 58559 19158
20043A9158O849L5186J2793K2148J4187K1135m2786o3565j2768k137j8403j5887
$$ 19158 26007 61193 73986 96134 110321 131456 88670 25105 12337 10200 -8203 -24090
20031b4090m4671l7739N2530k149L1097K9028p904n32L0069O723J8480M3223K0713
$$ -24090 -68761 -106500 -53970 -56119 -25022 4006 -3898 -4430 25639 32362 50842 94065 114778
20018A14778j220n3211k7076k9638q0201O332K4059L7447J2543J1940K8280k2399
$$ 114778 113558 60347 33271 3633 -76568 -70236 -46177 -8730 3813 15753 44033 21634
20006B1634l624j598m4082P500J9452k8623L907M6523j057m4594k6118P232J2803
$$ 21634 18010 16412 -27670 -20170 -718 -29341 -25434 21089 20032 -24562 -50680 -43448 -30645
19993c0645M7394n1870m879O0723j1400K8095k5654j0480L929N94o151M9350J044
$$ -30645 16749 -35121 -40000 20723 9323 37418 11764 1284 5213 5807 -344 49006 50050
19980E0050n2645l5598N2788M4371m3021o5643o986n193K1403J4149J1666K5021
$$ 50050 -2595 -38193 14595 58966 15945 -49698 -56684 -61877 -40474 -26325 -14659 10362
19968A0362j6871l8804K5651Q8613J1021o9632k1688Q045K1134M0052j8937k7083
$$ 10362 -6509 -45313 -19662 68951 79972 10340 -11348 -3303 17831 57883 38946 11863
19956A1863q9556M178o417M3678L5534m8476k9653M4508K6109L2280j2289J8253
$$ 11863 -77693 -73515 -79932 -36254 -720 -49196 -78849 -34341 -8232 24048 11759 30012
19944C0012k1994j98K8620n2238o8296L284K0246P843p65n3587m078L4061L3232
$$ 30012 8018 7820 36440 -15798 -84094 -80810 -60564 -52721 -53486 -107073 -111151 -77090 -43858
19931d3858l7617l2371l4423J4650p481O201L4434L4744M4963K7389L580j7129
$$ -43858 -81475 -113846 -148269 -133619 -141100 -134899 -100465 -65721 -20758 6631 10211 -6918
19919f918k4471J4860j8742j1655m1978K0700K3537j2520M3690M8748m7288L8095
$$ -6918 -31389 -16529 -35271 -46926 -88904 -68204 -44667 -57187 -13497 35251 -12037 26058
19907B6058k7321o6901K697J5940L1110O2226k6809J5681P6281L0197r266q3519
$$ 26058 -1263 -68164 -65467 -49527 -18417 43809 17000 32681 108962 139159 129893 46374
19895D6374j2290K3480M918l3529l9982L2287n733r898J1996n2463n9131O321
$$ 46374 34084 57564 62482 28953 -11029 21258 15525 5627 17623 -34840 -93971 -87650
19883h7650k002L8463N5513n1886n8667J9045K6912M0555N3858N616k0534k4172
$$ -87650 -89652 -51189 4324 -47562 -106229 -87184 -60272 -19717 34141 39757 19223 -4949
19871d949n5083n1215J7043N5116j8132M6554P0293k36o9650M327J0609k3884
$$ -4949 -60032 -111247 -94204 -39088 -57220 -10666 59627 59391 -10259 -5932 4677 -19207
19859a9207k892k4862K4682m4428k784N9320Q68j8350N072j7765M9656P1630p425
$$ -19207 -22099 -46961 -22279 -66707 -69491 -10171 -9303 -27653 -22581 -40346 9310 80940 73515
19846G3515j4919m0192K7357J7522m8650L733M4031q818K3605K2793n9069m2349
$$ 73515 58596 18404 45761 63283 14633 18366 62397 53579 77184 99977 40908 -1441
19834a441R093P953K466N2797j166m0111j9096J9317j7520p2524K4197O807L464
$$ -1441 7652 15605 18071 70868 69702 29591 10495 29812 12292 -60232 -36035 -29228 -25764
19821b5764J0844k2717Q241J9854M0334J9435j9213l7387j4812K0392O3146N3050
$$ -25764 -14920 -37637 -29396 -9542 30792 50227 31014 -6373 -21185 -793 62353 115403
19809A15403o751j9014j3407j5562j6882m3865K6553L8182M4316J5503o4702J1394
$$ 115403 108652 89638 76231 60669 43787 -78 26475 64657 108973 124476 59774 71168
19797G1168O187l017m0677j1318J1709n905p1824p6550m760N4211L2532Q059K6315
$$ 71168 77355 74338 33661 22343 34052 28147 -43677 -120227 -124987 -70776 -38244 -30185 -3870
19784c870l960O2742k4050n984N2177j546m2506k8904O4916K6877J0267k3436
$$ -3870 -7830 54912 30862 24878 77055 75509 33003 4099 69015 95892 106159 82723
19772H2723J7341l2337k3866n770K9277M8631J499l6830n347J0867J0756j5848
$$ 82723 100064 67727 43861 38091 67368 115999 117498 80668 75321 86188 96944 81096
19760H1096L4850j8474k0425j1958m3369r824M1708n1519J4605O6709l209k3374
$$ 81096 115946 97472 77047 65089 21720 11896 53604 2085 16690 83399 80190 56816
19748E6816J3248k9455K5456K682k4496l5190L313K0277L7756l6216j2312j4505
$$ 56816 70064 40609 66065 68747 44251 9061 12374 32651 70407 34191 21879 7374
19736G374k3930j1641L409l6097o71j219K1776M9941j2048K2345J6288m8764K8527
$$ 7374 -16556 -28197 -24788 -60885 -61556 -62775 -40999 8942 -3106 19239 35527 -13237 15290
19723A5290K3790K3630P3901k7029l4193k3077K0297J9335m9959J3133J4592p3359
$$ 15290 39080 62710 136611 109582 75389 52312 72609 91944 41985 55118 69710 -3649
19711c649n6768M0342L0181j91O1709k0585l3991K8235m372K4160P3529j3513
$$ -3649 -60417 -20075 10106 9915 71624 51039 17048 45283 40911 65071 138600 125087
19699A25087k7167p290k8872l6576M8827O5719J4506n2261n3966q967K1669K6254
$$ 125087 97920 90630 61758 25182 74009 139728 154234 101973 48007 39040 60709 86963
19687H6963k0104l4786J5724K7159l0572K673J0244N4907L2487p6668l2694n301
$$ 86963 66859 32073 47797 74956 44384 47057 57301 112208 144695 68027 35333 30032
19675C0032J8187l928J4040J0066Q257M2691K9018K318m2458p4331M211n205N0713
$$ 30032 48219 44291 58331 68397 76654 119345 148363 150681 108223 33892 38103 32898 83611
19662H3611J468M4230J0201j1665j4947J957l4448o1R245K2104J6131p3947o2897
$$ 83611 85079 129309 139510 127845 112898 114855 80407 80346 89591 111695 127826 53879 -9018
19649i018J1367k4152J2363J9987M9038J6557O23J5403K7611j400m2085j8057
$$ -9018 2349 -21803 -9440 10547 59585 76142 76765 92168 119779 118379 76294 58237
19637E8237K3365K1693k6373l1167L5254j2012J222J3130k4114P220r49n6659
$$ 58237 81602 103295 76922 45755 81009 68997 70219 83349 59235 66455 65506 8847
19625H847k971m512r133J1856m8082l1967O5006m867M2237K5081l5829r826l0798
$$ 8847 5876 1364 -7769 4087 -43995 -75962 -10956 -15823 26414 51495 15666 5840 -24958
19612b4958N5845K3995l3814m0530N3394M8191j4429m5628M0424j3975L0260R357
$$ -24958 30887 54882 21068 -19462 33932 82123 67694 22066 62490 48515 78775 88132
19600H8132n2457j5657K6287L4450m0984k7328O7678J1186j6982M2789K2306J4060
$$ 88132 35675 20018 46305 80755 39771 12443 80121 91307 74325 117114 139420 153480
19588A53480J090l6064k0521k4870n875K9608K040M1649N2783N6077M3182M7108
$$ 153480 154570 118506 97985 73115 67240 96848 98888 140537 193320 249397 292579 339687
19576C39687Q3587J11249O2353Q846l7906k2304K4794M7736m9677l2920J2911
$$ 339687 423274 534523 596876 605722 567816 545512 570306 618042 568365 535445 548356
19565E48356P3708O7085P7179j361l0147N8916J0850m957o0294j41443m5593K1927
$$ 548356 622064 689149 766328 764967 734820 793736 804586 799629 739335 597892 552299 574226
19553E74226m1059p1932k5743r5600n5835k3755r050l147L5296o968n2559O205
$$ 574226 533167 461235 435492 339892 284057 260302 251252 248105 283401 276433 223874 230079
19541B30079p79j2713m3476j3304J3505Q912q711M0729O7394J0643k1411J1999
$$ 230079 229300 216587 173111 159807 173312 182224 173513 214242 281636 292279 270868 282867
19529B82867p731J0301N7480O2045K8981K5531M2869O8405J33939J20706N3435
$$ 282867 275136 285437 342917 404962 433943 459474 502343 570748 704687 825393 878828
19518H78828j6048P084O4742m6758k2075j8047p6819j3507q9385O072J55j514
$$ 878828 862780 869864 934606 887848 865773 847726 770907 757400 668015 674087 674242 672728
19506F72728p992l6563p1051j00884j02725M20j9342k8901J5289n3597K5117j0257
$$ 672728 664736 628173 557122 456238 353513 353933 334591 305690 320979 267382 292499 282242
19494B82242l6829j9440J9443j5784r158L3756J8533J7960L025o1821p6343k9314
$$ 282242 245413 225973 245416 229632 220474 254230 272763 290723 293748 231927 155584 126270
19482A26270J4252K9227K7560o646k029k0363n2185p994L2656M922m8194R581
$$ 126270 140522 169749 197309 190663 188634 168271 116086 108092 140748 145670 97476 107057
19470A07057J8648M210k6467J1105L0722J7150j2896N1835K2615j946m2568k5035
$$ 107057 125705 129915 103448 114553 145275 162425 149529 201364 223979 222033 179465 154430
19458A54430k0810o152k6940L735j1888l839M2315L4365N5935k9602n4822m1724
$$ 154430 133620 127468 100528 104263 92375 88536 130851 165216 221151 191549 136727 95003
19446I5003k2837m2573N457N4627Q6038m09j1173j6715k911K1278k6563L839N4560
$$ 95003 72166 29593 35050 89677 175715 175306 164133 147418 144507 165785 139222 143061 197621
19433A97621k2511O48o0631K1373O1816P3274n503k2834m0017q4226l7094J7356
$$ 197621 175110 175758 115127 136500 198316 271590 266087 243253 203236 119010 81916 99272
19421I9272L5114J9069m1654o1835j2410j7204k1542J435J4457L5494K9959k7857
$$ 99272 134386 153455 111801 49966 37556 20352 -1190 245 14702 50196 80155 52298
19409E2298J1114L0438M6660P343M6057M8116N4402l7227k6027l398K3644j6951
$$ 52298 63412 93850 140510 147853 193910 242026 296428 259201 233174 229776 253420 236469
19397B36469P127J221o4222m5841J4695J8549m6160M573j4212k058p415J6793
$$ 236469 243596 244817 180595 134754 149449 167998 121838 126411 112199 110141 102726 119519
19385A19519j8468K353K5615p3461k4224K3350M2638Q8516J8935j4372P578J9754
$$ 119519 101051 103404 129019 55558 31334 54684 97322 185838 204773 190401 197979 217733
19373B17733J9040k2625k0920N7085N2629k5291j2638J78830J79034K51795K82996
$$ 217733 236773 214148 193228 250313 302942 277651 265013 443843 622877 874672 1157668
19362A157668L02876J84682O8424O1376L3477l2361j84765l89417l82540j91019
$$ 1157668 1460544 1645226 1713650 1775026 1808503 1776142 1591377 1201960 819420 628401
19352F28401p8489o9627l8423k3932r281k0079p2640n1203P044K0910q927j4589
$$ 628401 549912 480285 441862 417930 408649 388570 315930 264727 271771 292681 283754 269165
19340B69165M7538K6091j1137m8559k1440j919k3138N304P424j1517k3531j4487
$$ 269165 316703 342794 331657 283098 261658 259739 236601 241905 249329 237812 214281 199794
19328A99794L7355L6507O444m584L0026K7755l9271j620J9102L3582K5667m032
$$ 199794 237149 273656 280100 275516 305542 333297 294026 292406 311508 345090 370757 366725
19316C66725K2848l3135n025k3223o8677l5875N6046M4261K4231j8900l2616n6561
$$ 366725 389573 356438 351413 328190 259513 223638 279684 323945 348176 329276 296660 240099
19304B40099L1052N811K5129M8474J5582o7197l1518L6206K4416K3628q7346k3070
$$ 240099 271151 276962 302091 350565 366147 298950 267432 303638 328054 351682 264336 241266
19292B41266L037m8672J1363N5683l087m6764M7343L5744J5255K3650j8620L9367
$$ 241266 244303 195631 206994 262677 259590 212826 260169 295913 311168 334818 316198 355565
19280C55565M1463m7609j2241J5062l2967m2723k5285J7973K3055N6235M5967
$$ 355565 397028 349419 337178 352240 319273 276550 251265 269238 292293 348528 394495
19269C94495j7834L9895j9238K321j1336k9975L969L8199r385l3107o8953L260
$$ 394495 376661 416556 397318 399639 388303 358328 362297 400496 391111 358004 289051 292311
19257B92311L3161j5860k4799j7443m95O891L3110M7646n022l9335p4736j645
$$ 292311 325472 309612 284813 267370 266875 273766 306876 354522 349500 310165 235429 233784
19245B33784N3525k5704j1310R968k247K5936p329j8630R068L4283j3562J5520
$$ 233784 287309 261605 250295 260263 258016 283952 276623 257993 267061 301344 287782 303302
19233C03302K5584K8727k4488n5464j9835J5680J0840J677j1751l7315k6721j6667
$$ 303302 328886 357613 333125 277661 257826 273506 284346 286023 274272 236957 210236 193569
19221A93569P9981L8730j8611q893o2075L7452J7960L0268L6722R2533P4062M0847
$$ 193569 273550 312280 293669 284776 222701 260153 278113 308381 345103 437636 511698 552545
19209E52545Q5304M3883J3217P1558M4576K409K3045K6503J8567j5610O835n3473
$$ 552545 637849 681732 694949 766507 811083 813492 836537 863040 881607 865997 872832 819359
19197H19359L6819P4184O4650L4786o0067k8154J7638J1814j7687m0967m0534
$$ 819359 856178 930362 995012 1029798 969731 941577 959215 971029 953342 912375 871841
19186H71841M711p7917m0372J1929j5884l0747k287m9411j10273K3950K9650K0412
$$ 871841 876552 798635 758263 770192 754308 723561 721274 671863 561590 585540 615190 635602
19174F35602J4739j4076j7001l9717q529N0916l414r6481m9851J5842L7532L3525
$$ 635602 650341 636265 619264 579547 571018 621934 618520 522039 472188 488030 525562 559087
19162E59087o972q5650k857M3805L3405L8809k347n2987O757K0217N1851k4863
$$ 559087 552115 466465 463608 507413 540818 579627 577280 524293 531050 551267 603118 578255
19150E78255k384N5052N371P52q708l9878L3037K5119j6585P4604Q7732L0338
$$ 578255 575871 630923 636294 637046 628338 588460 621497 646616 630031 704635 792367 822705
19138H22705N0270Q4796J2869N2802m050N1031K2312L3937K2036j3346n1550l3853
$$ 822705 872975 957771 970640 1023442 1019392 1070423 1092735 1126672 1148708 1135362 1083812 1049959
19126A049959M1107K0165m08k274o1725K5797L6945k9084o4045k211O6354P2669
$$ 1049959 1091066 1111231 1110823 1108549 1046824 1072621 1109566 1080482 1016437 1014226 1080580 1153249
19114A153249m438l4499j5670J9100J1569P7208K0967l4433L7158P4109N5007
$$ 1153249 1148811 1114312 1098642 1117742 1129311 1206519 1227486 1193053 1230211 1304320 1359327
19103A359327L2639K0920N3325R7630L681N2502L9943J18414M2230N4482J23410
$$ 1359327 1391966 1412886 1466211 1563841 1567522 1620024 1659967 1778381 1820611 1875093 1998503
19092A998503J71160K13097K32273K93585L10610L26194L70413L96879L86943
$$ 1998503 2169663 2382760 2615033 2908618 3219228 3545422 3915835 4312714 4699657
19083D699657M66696M94018N09877N30886O67886Q21004J128019J556460K134630
$$ 4699657 5166353 5660371 6170248 6701134 7369020 8190024 9318043 10874503 13009133
19074A3009133K638611L003397L195794L082949L012518L067719L263959M071364
$$ 13009133 15647744 18651141 21846935 24929884 27942402 31010121 34274080 38345444
19066C8345444N758721Q464605J2389568J6502052J9611830K0354732J8671192
$$ 38345444 44104165 52568770 64958338 81460390 101072220 121426952 140098144
19059A40098144J6128605J2404435N777610j443890r246092j5750778j7086062
$$ 140098144 156226749 168631184 174408794 172964904 163718812 147968034 130881972
19052A30881972j5539244j3157668j0295013p225422n215940l729322k927325
$$ 130881972 115342728 102185060 91890047 84664625 79448685 75719363 72792038
19045G2792038l401828m593425o035254p450622p551583o488167m984795l365329
$$ 72792038 69390210 64796785 58761531 51310909 43759326 37271159 32286364 28921035
19037B8921035k183469j451019r84033o43054m09399k88968j93269m9096J8324
$$ 28921035 26737566 25286547 24302514 23659460 23250061 22961093 22767824 22718728 22737052
19028B2737052K21337O26105J201903K027240L257528M687361O008573P028625
$$ 22737052 22958389 23584494 24786397 26813637 30071165 34758526 40767099 47795724
19020D7795724P180524O488022N546270M934596M365997M637478N614418P230148
$$ 47795724 54976248 61464270 67010540 71945136 76311133 80948611 86563029 93793177
19012I3793177J0386859J4587037J8305794K0468048K0080956J5320751P883587
$$ 93793177 104180036 118767073 137072867 157540915 177621871 192942622 200826209
19005B00826209L58492p625824j4465400j8798239k3126857k4378590k0508653
$$ 200826209 201184701 193558877 179093477 160295238 137168381 112789791 92281138
18998I2281138j5439388j0018848o003429m024279l146005l104949l508099m090663
$$ 92281138 76841750 66822902 60819473 56795194 53649189 50544240 47036141 42945478
18990D2945478m556524m371890l790619l008445k251345j696558j308805j078682
$$ 42945478 38388954 34017064 30226445 27218000 24966655 23270097 21961292 20882610
18982B0882610r78686q70204q02372p82351p44188p83201p88960p69817p48693
$$ 20882610 19903924 19033720 18231348 17448997 16704809 15921608 15132648 14362831 13614138
18973A3614138o85228o19971n89617n20960m65241l99284l81080l43440l11031
$$ 13614138 12928910 12308939 11719322 11198362 10733121 10333837 9952757 9609317 9298286
18964I298286k83716k84529l30816l25020k95206k90506k74956k52245k76075
$$ 9298286 9014570 8730041 8399225 8074205 7778999 7488493 7213537 6961292 6685217
18955F685217k70172k54614k21129j22584j70595k45425k15098j96678j73169
$$ 6685217 6415045 6160431 5939302 5816718 5646123 5400698 5185600 4988922 4815753
18946D815753k36463k02012j92072j26014j35498j26686j14380q2003j16758j38931
$$ 4815753 4579290 4377278 4185206 4059192 3923694 3797008 3682628 3600625 3483867 3344936
18936C344936j06336p3479j32025j03271j01666p3786j09719k3621n8693r1294
$$ 3344936 3238600 3165121 3033096 2929825 2828159 2754373 2644654 2621033 2562340 2471046
18926B471046j03151m6558j01927l8968o7691n293k6795q4747k6637p823J2160
$$ 2471046 2367895 2321337 2219410 2180442 2112751 2107458 2080663 1995916 1969279 1961456 1973616
18915A973616o3555o0733l6528n7950l7626l0415m3342o0244q784j6554q4336
$$ 1973616 1910061 1849328 1812800 1754850 1717224 1686809 1643467 1583223 1574439 1557885 1473549
18904A473549p9675p4033n6317m1698l8921O014j8959r4438k2973n0561L1785
$$ 1473549 1393874 1319841 1263524 1221826 1182905 1188919 1169960 1075522 1052549 1001988 1033773
18893A033773M668o8884j25834j20270M173k9622M1834J7172L1484R654j51j6639
$$ 1033773 1038441 969557 843723 723453 727626 698004 739838 757010 788494 798148 797997 781358
18881G81358l5952m0194k9361K7573L1914J6563j4071j2393j2269k7938j03811
$$ 781358 745406 705212 675851 703424 735338 751901 737830 725437 713168 685230 581419
18870E81419j4835J7237o334M0578Q1610j2699K8430K8240J0135k5865o8298o8087
$$ 581419 566584 583821 577487 618065 699675 686976 715406 743646 753781 727916 659618 591531
18858E91531n6257o309L9347K9120J8123j0635q72k5974j3358K9242j9538M2449
$$ 591531 535274 528965 568312 597432 615555 604920 604048 578074 564716 593958 574420 616869
18846F16869O2056o55J6906j250k3990q7452o1711P346k8437M3395J9123M668
$$ 616869 678925 678270 695176 693926 669936 582484 520773 528119 499682 543077 562200 566868
18834E66868L6273J1388j8428o873o9608p0979Q6971L0403j1654k8519L2151L9216
$$ 566868 603141 614529 596101 589228 519620 448641 535612 566015 554361 525842 557993 597209
18822E97209J9104n215l2113l3611j13044J7261Q35J8123M398n4987j6269O688
$$ 597209 616313 611098 578985 545374 432330 449591 450426 468549 472947 417960 401691 408379
18810D08379j1159Q596n552J0749n8629q0875J247K9653q619J3697K9625M0255
$$ 408379 397220 405816 400264 411013 352384 271509 272756 302409 293790 307487 337112 377367
18798C77367q0065l3303j6187j4712M132O3601P4901L6901k2927r2073q4440l6256
$$ 377367 297302 263999 247812 233100 237232 300833 375734 412635 389708 297635 213195 176939
18786A76939K9253L1712k5275k123M0218L7689j7459L5231L580k378N0028J1469
$$ 176939 206192 237904 212629 210506 250724 288413 270954 306185 309765 307387 357415 368884
18774C68884P6811R7417L3110l2432n0657k9772J6490M8803j7699o2557n514m042
$$ 368884 445695 543112 576222 543790 493133 463361 479851 528654 510955 448398 442884 438842
18762D38842k3615l0407K2732m7171j808M7679k1003P07J1990K7702l3315N2605
$$ 438842 415227 384820 407552 360381 358573 406252 385249 385956 397946 425648 392333 444938
18750D44938O3205O1681j5083p1924k331K5279K4781J2909Q655R937J2318L42
$$ 444938 508143 569824 554741 482817 480486 505765 530546 543455 552110 562047 574365 574707
18738E74707L868O0586k2717r908J1034J1587n9069J8575O8405l6226K1852N9666
$$ 574707 578575 639161 616444 606536 617570 629157 570088 588663 657068 620842 642694 702360
18726G02360Q496l1193l0035L5188J13180P6465l835l6898M7663J07982R5332
$$ 702360 710856 679663 649628 684816 797996 874461 870626 833728 881391 989373 1084705
18715A084705P4145Q577K70M5517J4678k5508J3596K5216M2321M5383K9111K665
$$ 1084705 1158850 1167427 1167697 1213214 1227892 1202384 1215980 1241196 1283517 1328900 1358011 1360676
18703A360676K7043j275P6068Q7640j8742m1894k9539q593k0846m913p6221p3717
$$ 1360676 1387719 1386444 1462512 1550152 1531410 1489516 1459977 1451384 1430538 1425625 1349404 1275687
18691A275687m1653L007k5532j3407J7211j5524j7100K9123K3994L7963N1684
$$ 1275687 1234034 1237041 1211509 1198102 1215313 1199789 1182689 1211812 1235806 1273769 1325453
18680A325453J3849K3188M4887N3274q787L5060J15528j7877N8799J58563R3140
$$ 1325453 1339302 1362490 1407377 1460651 1451864 1486924 1602452 1584575 1643374 1801937 1895077
18669A895077J2560N1010O0516J23129J27114J45492J36277J44322J40830J59645
$$ 1895077 1907637 1958647 2019163 2142292 2269406 2414898 2551175 2695497 2836327 2995972
18659B995972J76571J87809K29747J95339J40979J50530J48109K08535J83516
$$ 2995972 3172543 3360352 3590099 3785438 3926417 4076947 4225056 4433591 4617107
18650D617107K45425K40341K44807J66238K30296K98470L16329M11239N00010
$$ 4617107 4862532 5102873 5347680 5513918 5744214 6042684 6359013 6770252 7270262
18641G270262N01633N73053P37643Q81455J098857J260065J514669J899230K522899
$$ 7270262 7771895 8344948 9082591 9964046 11062903 12322968 13837637 15736867 18259766
18632A8259766L354191M489938N952389P660344R483108J0483530J0563417J0329889
$$ 18259766 21613957 26103895 32056284 39716628 49199736 59683266 70246683 80576572
18624H0576572J0127751R123905O737683L310084k02657k067665j864425q86969
$$ 80576572 90704323 99828228 106565911 109875995 109673338 107605673 105741248 104854279
18616A04854279m72383k82106O94914K265004L638069L720917J911295j468330
$$ 104854279 104381896 104099790 104794704 107059708 110697777 114418694 116329989 114861659
18608A14861659n277185q078250r085512r512887j0528197j1160901j0021845
$$ 114861659 109584474 101506224 92420712 82907825 72379628 61218727 51196882
18601E1196882p892606n934326m414044l330086k625627k150374j855755j525055
$$ 51196882 43304276 37369950 32955906 29625820 27000193 24849819 22994064 21469009
18593B1469009j321480j192944j106132r71045q38534p81766p53614o57973n57497
$$ 21469009 20147529 18954585 17848453 16877408 16038874 15257108 14503494 13845521 13288024
18584A3288024m98466m65943m39467m62471m13025l88827l76421l80281l41509
$$ 13288024 12789558 12323615 11884148 11421677 11008652 10619825 10243404 9863123 9521614
18575I521614l05147k94209l05594l03041k58881k30915k60256l15274k83704
$$ 9521614 9216467 8922258 8616664 8313623 8054742 7823827 7563571 7248297 6964593
18566F964593k75576k94726k77995j98111j76889j86052k39602j74381r8829j40490
$$ 6964593 6689017 6394291 6116296 5918185 5741296 5555244 5315642 5141261 5042432 4901942
18556D901942j79177j59987o9716r8228j25559j15358k4908l6867o7879l7415
$$ 4901942 4722765 4562778 4493062 4394834 4269275 4153917 4129009 4092142 4024263 3986848
18546C986848o4065q2576m7393l5108j3162R777o0221j16133j67049q6205n1490
$$ 3986848 3922783 3840207 3792814 3757706 3744544 3754321 3694100 3577967 3410918 3324713 3273223
18535C273223j31004j44989j25898j40778j07967r9005l8690j0155j1608l1975
$$ 3273223 3142219 2997230 2871332 2730554 2622587 2523582 2484892 2474737 2463129 2431154
18525B431154n1883o8173j8503q4280r7271j4268K020o7024q2869q8731o5862
$$ 2431154 2379271 2311098 2292595 2208315 2111044 2096776 2098796 2031772 1948903 1860172 1794310
18514A794310n3498l4175k0743n4216m5441k7990o770J5042O5653J2188K7959
$$ 1794310 1740812 1706637 1685894 1631678 1586237 1558247 1551477 1566519 1632172 1644360 1672319
18503A672319O5283m7060M9674O9092L0284m3664p1356j10200p2352l3399m6555
$$ 1672319 1737602 1690542 1740216 1809308 1839592 1795928 1724572 1614372 1542020 1508621 1462066
18492A462066q4641M578J3358K5166J04777M7514P169P1182r887k8631m7993p2323
$$ 1462066 1377425 1382003 1395361 1420527 1525304 1572818 1579987 1651169 1641282 1612651 1564658 1492335
18480A492335p5098j47895q1443k6018k3385m0366n9886M6029K6076M8134O745
$$ 1492335 1417237 1269342 1187899 1161881 1138496 1098130 1038244 1084273 1110349 1158483 1165228
18469A165228N7446L7587j2356j4422p010N7491P7547K38j1483j5918R568Q71
$$ 1165228 1222674 1260261 1247905 1233483 1226473 1283964 1361511 1361749 1350266 1334348 1343916 1344787
18457A344787J3025J6536K2111l511L8691N7280J1903O7225O6993M7372L263r334
$$ 1344787 1357812 1374348 1396459 1392948 1431639 1488919 1500822 1568047 1635040 1682412 1685675 1676341
18445A676341K9342J01562R7220J68174J87830K34835L18583K74577K55896K34586
$$ 1676341 1705683 1807245 1904465 2072639 2260469 2495304 2813887 3088464 3344360 3578946
18435C578946J79041R2090P3201J24390K32676J91538K60269L38058M81323O24023
$$ 3578946 3757987 3850077 3923278 4047668 4280344 4471882 4732151 5070209 5551532 6175555
18425F175555P29227Q34523J024634J346632J722139K228948L118453M687068
$$ 6175555 6904782 7739305 8763939 10110571 11832710 14061658 17180111 21867179
18417B1867179O955579R823206J2178212J3096865J2918572J2630567J2433320
$$ 21867179 28822758 38645964 50824176 63921041 76839613 89470180 101903500
18410A01903500J0820253O648680N43659n544525q350715q147273p349564p183692
$$ 101903500 112723753 119372433 119916092 114371567 106020852 97873579 90524015 83340323
18402H3340323n451504n87616M773717Q099876R227268R761687R757881P439419
$$ 83340323 77888819 77301203 82074920 90174796 99402064 109163751 118921632 126361051
18394A26361051K337988m281280r780205j1628574j1686789j2290285j3965687
$$ 126361051 128699039 124417759 114637554 103008980 91322191 79031906 65066219
18387F5066219j3468361j0574334p105405m565769l086319k314205j852767j527227
$$ 65066219 51597858 41023524 33918119 29352350 26266031 23951826 22099059 20571832
18379B0571832j343550j251217j154276r69728q83049p78369o30281m93264m58811
$$ 20571832 19228282 17977065 16822789 15853061 14970012 14191643 13561362 13068098 12609287
18370A2609287l57437l80395l99710l76427m05887m58529m53046m73398m32798
$$ 12609287 12251850 11871455 11471745 11095318 10689431 10230902 9777856 9304458 8871660
18361H871660m06678m13381l81129l38335k62244k34156k81280l28327k14087
$$ 8871660 8464982 8051601 7670472 7332137 7069893 6835737 6554457 6226130 6012043
18352F012043j81866k09979k80139j95738j33959r4964j63844j80026j38520j71249
$$ 6012043 5830177 5620198 5340059 5144321 5010362 4915398 4751554 4571528 4433008 4261759
18342D261759j38414p5617j62769q8582q8342r1501r1588j45405n8313o7491r3257
$$ 4261759 4123345 4047728 3884959 3796377 3708035 3616534 3524946 3379541 3321228 3253737 3160480
18331C160480r2854m1031l2688Q439n3023j02806j01482m0958p4409q3270l9661
$$ 3160480 3067626 3026595 2993907 3002346 2949323 2846517 2745035 2704077 2629668 2546398 2506737
18320B506737r4436j59722r4800J934P267k9590o3852p7629p2669l1125m2900
$$ 2506737 2412301 2252579 2157779 2159713 2166980 2137390 2073538 1995909 1923240 1892115 1849215
18309A849215m1015l6759n8248o1299j04055p9585K8730j9152p0883l0045p322
$$ 1849215 1808200 1771441 1713193 1651894 1547839 1468254 1496984 1477832 1406949 1376904 1369582
18298A369582k1219p6421P221k5968j5353k9421m06J2821O013j5094j24953m5962
$$ 1369582 1348363 1271942 1279163 1253195 1237842 1208421 1208015 1220836 1226849 1211755 1086802 1040840
18286A040840R4373j032j9398M8870j0130n1997l7429k9696j6661K9215N160K3767
$$ 1040840 1135213 1134181 1114783 1163653 1153523 1101526 1064097 1034401 1017740 1046955 1052115 1075882
18274A075882Q9776N692m37j1118L6018k2791n9680l26M1344L6174N0387l0433
$$ 1075882 1165658 1171350 1170913 1159795 1195813 1173022 1113342 1113016 1154360 1190534 1240921 1210488
18262A210488k9176o575n9821r425J09863Q0448J1789M4926J4286L1793j0675
$$ 1210488 1181312 1174737 1114916 1105491 1215354 1295802 1307591 1352517 1366803 1398596 1387921
18251A387921M4548Q5930L5151M1142P0516K6301L972L31N1120O4511J07088J36744
$$ 1387921 1432469 1518399 1553550 1594692 1665208 1691509 1695481 1695812 1746932 1811443 1918531 2055275
18239B055275P2743O8152J56014K02018J96630K09616L05634K84909K74504L41443
$$ 2055275 2128018 2196170 2352184 2554202 2750832 2960448 3266082 3550991 3825495 4166938
18229D166938M29563M96703M78619N82584P48344R27669J144994J393729J635209
$$ 4166938 4596501 5093204 5571823 6154407 6902751 7830420 8975414 10369143 12004352
18220A2004352J873287K242536K578972K969834L302793L651186M268998N392003
$$ 12004352 13877639 16120175 18699147 21668981 24971774 28622960 32891958 38283961
18212C8283961O725254P989347R173575J1284592J3635914J4581051J4890108
$$ 38283961 45009215 52998562 62172137 73456729 87092643 101673694 116563802
18205A16563802J4700039J3213842J0600575P358955M241190p57866m724041o501175
$$ 116563802 131263841 144477683 155078258 162437213 166678403 165920537 161196496 154695321
18197A54695321j0106377j2022051j0919303r698705r913471r452084p609649
$$ 154695321 144588944 132566893 121647590 111948885 102035414 92583330 84973681
18190H4973681o146877n803309n643731n691128n355975n231292n275173m809806
$$ 84973681 78826804 73023495 67379764 61688636 56332661 51101369 45826196 41016390
18182D1016390m073486l380675k920140k340803j667895j152772q01461m77488
$$ 41016390 36942904 33562229 30642089 28301286 26633391 25480619 24679158 24201670
18174B4201670j47845K05650O83584J147550J758793K280410K874279L631627
$$ 24201670 24053825 24259475 24943059 26090609 27849402 30129812 33004091 36635718
18166C6635718M230079M673932M997967N225306N497656N760314O231277P112191
$$ 36635718 40865797 45539729 50537696 55763002 61260658 67020972 73252249 80364440
18158H0364440P964173Q925854R300733R718385J0296421R877240Q408615N895879
$$ 80364440 88328613 97254467 106555200 116273585 126570006 136447246 144855861 150751740
18150A50751740K312806j039972l510564o515793j0656427j2042589j1672046
$$ 150751740 153064546 152024574 148514010 141998217 131341790 119299201 107627155
18143A07627155j2871239j2394513j0415642p995973p142830o411420m833663
$$ 107627155 94755916 82361403 71945761 63949788 56806958 50395538 45561875
18136D5561875l841210l374012l019654k840886k681961k427608k081185j809205
$$ 45561875 41720665 38346653 35326999 32486113 29804152 27376544 25295359 23486154
18128B3486154j605475j291349j034219q34185o45408n08997l27482m7120L24552
$$ 23486154 21880679 20589330 19555111 18720926 18075518 17566521 17239039 17191919 17516471
18119A7516471P83277J667896L405070O027648Q448927P820816L646582J443382
$$ 17516471 18299748 19967644 23372714 29400362 37849289 45670105 49316687 50760069
18111E0760069J771588k65227n96600l283954j2066567j0968424n749954l077434
$$ 50760069 52531657 52266430 51669830 48385876 36319309 25350885 19600931 16523497
18103A6523497j896972j376901j000148q02593p51174o08177n10973m71088m42397
$$ 16523497 14626525 13249624 12249476 11446883 10695709 10087532 9576559 9105471 8663074
18094H663074m77372m22727l46717l37488l50199k40482k57529k32898k53206
$$ 8663074 8185702 7762975 7416258 7078770 6728571 6488089 6230560 5997662 5744456
18085E744456j96195k45790k04751k32756j64657j54280k15461j23071o9840j25431
$$ 5744456 5548261 5302471 5097720 4864964 4700307 4546027 4330566 4207495 4137655 4012224
18075D012224j56759j03420j26923r2024j11893j05262o2248o4035o2584r6229
$$ 4012224 3855465 3752045 3625122 3533098 3421205 3315943 3253695 3189660 3127076 3030847
18065C030847q1809p9314m9963n2344j17443q7644l1744r7314n4179j1822r7761
$$ 3030847 2949038 2869724 2819761 2767417 2649974 2562330 2530586 2433272 2379093 2367271 2269510
18054B269510q3903m9517q1193j2896m4636p0217n6496l2626m5352j01640o5740
$$ 2269510 2185607 2136090 2054897 2042001 1997365 1927148 1870652 1838026 1792674 1691034 1625294
18043A625294k6855k8835n8500j4428q257n0248K6564P1398j5969n386J3916M5990
$$ 1625294 1598439 1569604 1511104 1496676 1488419 1438171 1464735 1536133 1520164 1514778 1528694 1574684
18031A574684N0460M1883p5061r5867l3410k6796o113j7325J3146m3879m3187
$$ 1574684 1625144 1667027 1591966 1496099 1462689 1435893 1429780 1412455 1425601 1381722 1338535
18020A338535J4142M720O985K8584m1943k4015r3713j10933j24187k8492n6364
$$ 1338535 1352677 1357397 1364382 1392966 1351023 1327008 1233295 1122362 998175 969683 913319
18009I13319j04665n9357l2273o0243j8202k26Q036k9267k9615k2269r958R0301
$$ 913319 808654 749297 717024 656781 638579 638353 646389 617122 587507 565238 555280 645581
17997F45581o0170p1168L433O4743N6823p862p6451p1641N0473J9092l7026m5532
$$ 645581 585411 514243 517676 582419 639242 631380 554929 483288 533761 552853 515827 470295
17985D70295P861j6509K4169K4258j6613m4707J7560N384j3062l7144n4197r39
$$ 470295 478156 461647 485816 510074 493461 448754 466314 471698 458636 421492 367295 366356
17973C66356k5639k6782m242J7240K9329K541M3918M817o027k8494k6694l3999
$$ 366356 340717 313935 309693 326933 356262 358803 402721 407538 401511 373017 346323 312324
17961C12324O915K9755l6873j0430O8429j8639p542L366j1953m4828J8618M5819
$$ 312324 319239 348994 312121 301691 370120 351481 343939 347305 335352 290524 309142 354961
17949C54961l1565l7038J7708j218k2844m5113j37028j32M6566K5633j5343j347
$$ 354961 323396 286358 304066 302848 280004 234891 97863 97731 144297 169930 154587 153240
17937A53240j7464M5611L9701n33l5854m4805o908J2178j8971j4237J128K5263
$$ 153240 135776 181387 221088 220555 184701 139896 132988 145166 126195 111958 113086 138349
17925A38349M5265j1432J6498k9977l3142k6723L0316K8347M9824k7957q710p0653
$$ 138349 183614 172182 188680 158703 125561 98838 129154 157501 207325 179368 170658 100005
17913A00005k0042L2883l8617j1829J470k4919j1228o2324k2044N2532L9812J9694
$$ 100005 79963 112846 74229 62400 63870 38951 27723 -34601 -56645 -4113 35699 55393
17901E5393n235K8318J8684j466p8962n068k6956o681K1473L4085r082l3690r895
$$ 55393 50158 78476 97160 95694 16732 11664 -15292 -21973 -500 33585 24503 -9187 -19082
17888a9082m6022j5185L3034L4647J1145k9335n066p750L310K363K7680L6395
$$ -19082 -65104 -80289 -47255 -12608 -1463 -30798 -35864 -43614 -40304 -37941 -10261 26134
17876B6134M1567K3487m9974K4366K8602k7673J148q598m7460M8120m3561n6110
$$ 26134 67701 91188 41214 65580 94182 66509 67657 59059 11599 59719 16158 -39952
17864c9952M309N0614K507n851K7028J1604j2610m2246N582K6412L2486L8634
$$ -39952 -35643 14971 17478 11627 38655 50259 37649 -4597 985 27397 59883 98517
17852I8517o636M430K4994j5140k5250J3388r65Q03L6325n955n0724N1895O4220
$$ 98517 91881 96311 121305 106165 80915 94303 93338 94141 130466 124511 73787 125682 189902
17839A89902m043o8792l8690Q473k8992k5352K4572N4871J7187O421k5166l1722
$$ 189902 185859 117067 78377 86850 57858 32506 57078 111949 129136 135557 110391 78669
17827G8669l5488M1130R3449O4040L7686O0694N9247O4935J10601P2907O0317
$$ 78669 43181 84311 177760 241800 279486 340180 399427 464362 574963 647870 708187
17816G08187j4213p9178p2293l6071l111J8881l738m3899O432O0253N4822J3772
$$ 708187 693974 614796 542503 506432 503321 522202 518464 474565 480997 541250 596072 609844
17804F09844N1776K3216K3419n762p8020m1808q5267r7934l1550k2824k1857m2096
$$ 609844 661620 684836 708255 702493 624473 582665 497398 399464 367914 345090 323233 281137
17792B81137l2930J5790l9388l9106K7343P888k6782l3713o2553m1348J5924L8534
$$ 281137 248207 263997 224609 185503 212846 220734 193952 160239 97686 56338 72262 110796
17780A10796p2103m7116N005M6883L536l2716M9548m257r106j4893k2442m0977
$$ 110796 38693 -8423 -3418 43465 47001 14285 63833 59576 50470 35577 13135 -27842
17768b7842o907k771N4188K1830J337L2820L8182l6359n4260J4540m35R323L2004
$$ -27842 -34749 -37520 16668 38498 39835 72655 110837 74478 20218 34758 34323 43646 75650
17755G5650k6961L7536Q383K297j4750L832O2177k5926o3424J286j1050l4401
$$ 75650 48689 86225 94608 96905 82155 85987 148164 122238 58814 60100 49050 14649
17743A4649j359M986N5501J5841o4742j3390p342j4189l880k8195J2270K8618
$$ 14649 13290 18276 73777 89618 24876 11486 4144 -10045 -13925 -42120 -29850 -1232
17731a232L5217l2300J2324n192K4278O381J3449j8637l294j3642J6452j9537
$$ -1232 33985 1685 14009 8817 33095 39476 52925 34288 30994 17352 33804 14267
17719A4267p9748j9391L5709L7327M8859j6112l6544K1755M761N2008Q5103L6214
$$ 14267 -65481 -84872 -49163 -11836 37023 20911 -15633 6122 10883 62891 147994 184208
17707A84208k7390p1481j9444Q3259J01433q446N811Q8842O0169N6674K2158M1216
$$ 184208 156818 85337 65893 149152 250585 242139 247950 336792 396961 453635 475793 517009
17695E17009L3999J4898r496J6205P5020M7890N6874m716l2808n6509j3992j4721
$$ 517009 551008 565906 556410 572615 647635 695525 752399 747683 714875 658366 644374 629653
17683F29653m2864l7911l1138p7346o0157o3298R864k876n8042o1673k4633O2922
$$ 629653 586789 548878 517740 440394 380237 316939 326803 323927 265885 204212 179579 242501
17671B42501L4378J3415O440k9802l8396j7184J1806K5477q639o4425l3844l2774
$$ 242501 276879 290294 296734 266932 228536 211352 223158 248635 239996 175571 141727 108953
17659A08953L6293J4730K0331O1089J4137j8880K6821L3143P0539Q4530K8651
$$ 108953 145246 159976 180307 241396 255533 236653 263474 296617 367156 451686 480337
17648D80337J8578j1647Q961M1351O778n3825L5320O296r504k5403m2834l2535
$$ 480337 498915 487268 496229 537580 544358 490533 525853 532149 522645 497242 454408 421873
17636D21873L6056L1267P2257K9306o194j7286K7570r7349p7811j9594n2648o838
$$ 421873 457929 489196 561453 590759 584565 567279 594849 497500 419689 400095 347447 340609
17624C40609j5689q0680r0952J7981l0354J6493m820r1887r2354m1665O546K1003
$$ 340609 324920 244240 153288 171269 140915 157408 152588 60701 -31653 -73318 -66772 -45769
17612d5769L9409L2709R0363M4235o3576m175J1383q057j2575j7263m6228j3846
$$ -45769 -6360 26349 116712 160947 97371 93196 104579 96522 83947 66684 20456 6610
17600F610J4822J6276N9322l749K3054o621q903l6227n3852m1081L8575L9385
$$ 6610 21432 37708 97030 93281 116335 109714 100811 64584 10732 -30349 8226 47611
17588D7611j742L123l9586l2336k2589L951q458k538J3388K2800j414m812M8989
$$ 47611 45869 48992 9406 -22930 -45519 -41568 -50026 -52564 -39176 -16376 -17790 -22602 26387
17575B6387J0965J6539L6565m9566m4075j7076K0138k528J2089K7292j791o5444
$$ 26387 37352 53891 90456 40890 -3185 -20261 -123 -2651 9438 36730 34939 -30505
17563c0505l2385L2981J1597r051n706K5155l0214l1346j6144l9376N1402L9970
$$ -30505 -62890 -29909 -18312 -27363 -33069 -7914 -38128 -69474 -85618 -124994 -73592 -33622
17551c3622J8772L1306J2710l0269p1921l8702N7930J1740l0901p2246L85Q4387
$$ -33622 -14850 16456 29166 -1103 -73024 -111726 -53796 -42056 -72957 -145203 -144818 -60431
17539f0431M3179j3647n2779K7707j7607l4896M3358n963M3797J4538J1485J8186
$$ -60431 -17252 -30899 -83678 -55971 -73578 -108474 -65116 -71079 -27282 -12744 -1259 16927
17527A6927j8503l3455k2006K7676M7013m2534K610q819r5130J4083k5949J7596
$$ 16927 -1576 -35031 -57037 -29361 17652 -24882 -22272 -31091 -126221 -112138 -138087 -120491
17515a20491P2365J7485r848R177j3397k3363J056M2309J2279j5333o779l4301
$$ -120491 -48126 -30641 -40489 -31312 -44709 -68072 -67016 -24707 -12428 -27761 -34540 -68841
17503f8841L8412K9662J7323M9973k9765p7421j5431L7002m353M9182M3474n0907
$$ -68841 -30429 -767 16556 66529 36764 -40657 -56088 -19086 -23439 25743 69217 18310
17491A8310l807K793M4j3023J4496l5721J98J2742K1241o7938Q709R834q403L1696
$$ 18310 14503 17296 17340 4317 18813 -16908 -16710 -3968 17273 -50665 -41956 -32122 -40525 -8829
17477h829P2419n1708l4788j09028j4427K5165K3176J6185k4411n3948j2818j1883
$$ -8829 63590 11882 -22906 -131934 -146361 -121196 -98020 -81835 -106246 -160194 -173012 -184895
17465a84895N5406Q1995N4659p0623R20J7983N0267n4145m0862J6040O7569N0373
$$ -184895 -129489 -47494 7165 -63458 -62538 -44555 5712 -48433 -89295 -73255 -5686 44687
17453D4687P01p61K8333L9438K7583R606K940L0011M6536L967k230p078o1337
$$ 44687 45388 44627 72960 112398 139981 149587 152527 182538 229074 233041 230811 223733 162396
17440A62396l5594j6091q4349p965m4766j2200p434k4826o809L6713J1177M836
$$ 162396 126802 110711 26362 18397 -26369 -38569 -46003 -70829 -77638 -40925 -29748 -24912
17428b4912M6266j4671o7218j04247k444N5768R2121P823j4529M839o659J0516
$$ -24912 21354 6683 -60535 -164782 -167226 -111458 -19337 -11514 -26043 -21204 -27863 -17347
17416a7347N7775M8142j1479n3603j8088n433L7569k0891l8211L482j5114N6578
$$ -17347 40428 88570 77091 23488 5400 -33 37536 16645 -21566 -18084 -33198 23380
17404B3380L7854p970k9701J5597k1010l1421m8080M907N4629M4940k7389k0109
$$ 23380 61234 53264 23563 39160 18150 -13271 -61351 -56444 -1815 43125 15736 -4373
17392d373J4241j8662l1215J545k0110j0840M0558j353m2555K2532j9117j969
$$ -4373 9868 -8794 -40009 -38464 -58574 -69414 -28856 -30209 -72764 -50232 -69349 -71318
17380g1318J0072L1499l14q542K3840k1688J891K721M4057J0184J5798J8226l4676
$$ -71318 -61246 -29747 -30061 -38603 -14763 -36451 -34560 -31839 12218 22402 38200 56426 21750
17367B1750l6523k875n165K8693M1545k6857m4182M3375K4926J5795o550l2007
$$ 21750 -14773 -17648 -22813 5880 47425 20568 -23614 19761 44687 60482 53932 21925
17355B1925l1997m9351j5186R077L0705O8190P6148K6300l7482l1669K2407k886
$$ 21925 -10072 -59423 -74609 -65532 -34827 33363 109511 135811 98329 66660 89067 86181
17343H6181q7206n9449L5107Q2368j0175p7808m3509j1714J4902Q2285L0851j1727
$$ 86181 -1025 -60474 -25367 57001 46826 -30982 -74491 -86205 -71303 10982 41833 30106
17331C0106K3181n1926j9600N0485P762J9527P932l0004n0082K1231O2663Q426
$$ 30106 53287 1361 -18239 32246 40008 59535 67467 37463 -12619 8612 71275 79701
17319G9701k5979p2663m9276m0730k511M8990J00025K5387q0968L2613J136m4505
$$ 79701 53722 -18941 -68217 -108947 -111458 -62468 37557 62944 -18024 14589 15725 -28780
17307b8780k6423o847M7559k412l3326l641M4026N1147l6064N94M0313j054n2118
$$ -28780 -55203 -62050 -14491 -16903 -50229 -53870 -9844 41303 5239 5833 46146 45092 -7026
17294g026K1447m9862l0760P390r162n0709M1265K0473N5462M1038o1752P637
$$ -7026 14421 -35441 -66201 -58811 -67973 -118682 -77417 -56944 -1482 39556 -22196 -14559
17282a4559p086J435P383j2241J0965L2806N9002K4075k5786o9619j873n287P855
$$ -14559 -21645 -20210 -12827 -25068 -14103 18703 77705 101780 75994 6375 4502 -785 7070
17269G070k880K3133O9107Q820J6931l7057k3094m2327k0577n198l4148O3281
$$ 7070 4190 27323 96430 105250 122181 85124 62030 19703 -874 -6072 -40220 23061
17257B3061m3281l7134K310J82M8002R544j1656p7900l9670J9687L9194j3088
$$ 23061 -20220 -57354 -55044 -54862 -6860 2684 -8972 -86872 -126542 -106855 -67661 -80749
17245h0749J8717q010J9902N0996L2824m1505k123J4998o1976m0922J3607J6421
$$ -80749 -62032 -70042 -50140 856 33680 -7825 -9948 5050 -56926 -97848 -84241 -67820
17233f7820K9590L9201l672J0835O792l3639J0261J1585R218l553O2542j5589
$$ -67820 -38230 971 -2701 8134 14926 -18713 -8452 3133 12351 8798 71340 55751
17221E5751l5346j0946l5192l041j3953o8310J9391O3239j4799L2903N5925N0500
$$ 55751 20405 9459 -25733 -28774 -42727 -111037 -91646 -28407 -43206 -10303 45622 96122
17209I6122o39l7742J8889K8208N6439O8931Q5010O9727J0253R355N3369o0474
$$ 96122 95483 57741 76630 104838 161277 230208 315218 384945 395198 404553 457922 397448
17197C97448l9948k9981l151L294J6151N3631P4882Q6529J08099L5896K3176k9912
$$ 397448 357500 327519 324368 327662 343813 397444 472326 558855 666954 702850 726026 696114
17185F96114j4997l7939j15072j01608p3371o6334P272M3717N7818j3736p381
$$ 696114 681117 643178 528106 426498 353127 286793 294065 337782 395600 381864 374483
17174C74483M0859l9266q0524l5923l519k6014k0874l9260j7837j6255J9884k8205
$$ 374483 415342 376076 295552 259629 256110 230096 209222 169962 152125 135870 155754 127549
17162A27549k0770l2068q0851K91O1825J0943K5778N304k1778k4869L6606M4333
$$ 127549 106779 74711 -6140 -5849 55976 66919 92697 98001 76223 51354 87960 132293
17150A32293L3201l146l9992o5687N070K1389J23k2272K4348j1329K1398K0873
$$ 132293 165494 162348 122356 56669 61739 83128 83251 60979 85327 73998 95396 116269
17138A16269l8738r2378l2175J5260k7873M2442R016o869L5682J2624n1608P0936
$$ 116269 77531 -14847 -47022 -31762 -59635 -17193 -8177 -15046 20636 33260 -18348 52588
17126E2588M5465o5419l2043j4060K044O5741J5011l0985k1650l4144j6199j3466
$$ 52588 98053 32634 591 -13469 -11425 54316 69327 38342 16692 -17452 -33651 -47117
17114d7117J7621K1957K4615l8081J8970K6558M6362J8658l1809j8787l7752j0297
$$ -47117 -29496 -7539 17076 -21005 -2035 24523 70885 89543 57734 38947 1195 -9102
17102i102P233m7526l8135K5350M2811L8795k0032m5001L681R681n779n309N5147
$$ -9102 -1869 -49395 -87530 -62180 -19369 19426 -606 -45607 -41926 -32245 -38024 -43333 11814
17089A1814j6200k0777K2092N2357N7286n6164l325J3798p4367o6935L1999l595
$$ 11814 -4386 -25163 -3071 49286 106572 50408 47083 60881 -13486 -80421 -48422 -52017
17077e2017L6500L4195j9003m2814n6232j2844M2140N0863K0112k026m4990n520
$$ -52017 -15517 18678 -325 -43139 -99371 -112215 -70075 -19212 900 -1126 -46116 -51636
17065e1636K5938l075m6801q250M2178L3391P753J4310J4606L7688J7221j3902
$$ -51636 -25698 -28773 -75574 -83824 -41646 -8255 -502 13808 28414 66102 83323 69421
17053F9421N2482L7208p0701j10037M798P3479L9434k6360o2156j8918O215J7814
$$ 69421 121903 159111 88410 -21627 -16829 56650 96084 69724 7568 -11350 -5135 12679
17041A2679m905L823N1045n5917l7306L6661k7622K294J2425J9874N7774L6888
$$ 12679 7774 11597 62642 6725 -30581 6080 -21542 -19248 -6823 13051 70825 107713
17029A07713k8603n6752M3590R908k7168r167j480O857l69j9357o727o2864p1494
$$ 107713 79110 22358 65948 75856 48688 39521 38041 44898 44529 25172 18445 -44419 -115913
17016a15913N978N3218O928k3673k6497j2537K6224K7059N5643n6337j8675k3869
$$ -115913 -109935 -56717 -49789 -73462 -99959 -112496 -86272 -59213 -3570 -59907 -78582 -102451
17004a02451Q402O8987K99k2874N87K1430J1051O592p454j2106m1965o7894K6434
$$ -102451 -94049 -25062 -24763 -47637 -47050 -25620 -14569 -7977 -15431 -27537 -69502 -137396 -110962
16991a10962J0861L3943P6614m145q7778k1194M0459j0430j4633O6991r540n1452
$$ -110962 -100101 -66158 10456 6311 -81467 -102661 -62202 -72632 -87265 -20274 -29814 -81266
16979h1266p793j4340o416L3340N5685K3111m1253M7797M9l4672M5492j7321j5040
$$ -81266 -89059 -103399 -109815 -76475 -20790 2321 -38932 8865 8914 -25758 19734 2413 -12627
16966a2627J900k1723l1011p821N3005K0572k7639P94k7692o0031K9525L8738
$$ -12627 -10727 -32450 -63461 -71282 -18277 2295 -25344 -24550 -52242 -112273 -82748 -44010
16954d4010J1596Q6487L3252k9317j0429L4852o16j1057r752m4887l9422n777
$$ -44010 -32414 54073 87325 58008 47579 82431 81815 70758 61006 16119 -23303 -29080
16942b9080J4121n868K3019J8719n086l0316j2198M6014L6595n4803j8647k4150
$$ -29080 -14959 -20827 2192 20911 15825 -14491 -26689 19325 55920 1117 -17530 -41680
16930d1680K6240O1255K9788o207K2030K9265m4535q2290K4982j6173J770K1376
$$ -41680 -15440 45815 75603 69396 91426 120691 76156 -6134 18848 2675 4445 25821
16918B5821r0476l8077k401K7655N2061M0308M4074l2481l871K5141M592k6240
$$ 25821 -64655 -102732 -105133 -77478 -25417 14891 58965 26484 22613 47754 52346 26106
16906B6106M0345J2606R834l3425j9512J4402l3627k488P5663N9865J0561m0745
$$ 26106 66451 79057 88891 55466 35954 50356 16729 14241 89904 149769 160330 119585
16894A19585k2924J2011K6945R361r716k4254j3290J9406J9284j5043p1545M182
$$ 119585 96661 108672 135617 144978 135262 111008 97718 117124 136408 121365 49820 54002
16882E4002M8211L8065K2822n4143l5358K3199L7890Q286k3683j0541J9604J4989
$$ 54002 102213 140278 163100 108957 73599 96798 134688 142974 119291 108750 128354 143343
16870A43343P503O181j300l2400o3789K9529l2320m3268J9170L3823M9598O2975
$$ 143343 150846 157027 155727 123327 59538 89067 56747 13479 32649 66472 116070 179045
16858A79045q448n3369J2294l6858l574j0487j6779m6731k7024J7401J5655n3606
$$ 179045 170597 117228 129522 92664 89090 78603 61824 15093 -11931 5470 21125 -32481
16846c2481l0200P344J6856P4907K2335k4381r997q790M099M3908M3407L6049
$$ -32481 -62681 -55337 -38481 36426 58761 34380 24383 15593 19692 63600 107007 143056
16834A43056j0152L867q9045q2867l1466q602m462N314K3628M4022N6844r711
$$ 143056 132904 136771 47726 -35141 -66607 -75209 -79671 -74357 -50729 -6707 50137 40426
16822D0426k8455m070l676k4607P66j9627l2045J3838j358j5170k3624N8413N6309
$$ 40426 11971 7901 4225 -20382 -19616 -39243 -71288 -57450 -58808 -73978 -97602 -39189 17120
16809A7120r550K7649q857K8199k533m1630m7468J9328J2642N706L028L3685J1247
$$ 17120 7570 35219 26362 54561 52028 10398 -37070 -17742 -5100 606 3634 37319 48566
16796D8566n4526l3342N2864J0185L478n3583p757L8767N4712M3022j1725l4484
$$ 48566 -5960 -39302 13562 23747 27225 -26358 -34115 4652 59364 102386 90661 56177
16784E6177M4656P751o0045l7356J4816j3644n043L597N1510M5118J5265j0580
$$ 56177 100833 108584 48539 11183 25999 12355 7312 10909 62419 107537 122802 112222
16772A12222M0560M3722m663l622Q402k207j6497K5257j4857k7687N4851N2615
$$ 112222 152782 196504 191841 188219 196621 194414 177917 203174 188317 160630 215481 268096
16760B68096J0085j3859l6136m6331k3372J1861K7491L6362L77L1924J9093k8477
$$ 268096 278181 264322 228186 181855 158483 170344 197835 234197 234574 266498 285591 257114
16748B57114l6871k6970M3877O1607J8487P987L829K8658J5349k4527p1500k0536
$$ 257114 220243 193273 237150 298757 317244 325231 329060 357718 373067 348540 277040 256504
16736B56504J2488k847J0668m5812r497M4582L5017j4796Q147O923j8875m7265
$$ 256504 268992 266145 276813 231001 221504 266086 301103 286307 294454 301377 282502 235237
16724B35237L3509n2437P0370R6070l3484n2071j5969M7020K9053J8402m8343
$$ 235237 268746 216309 286679 382749 349265 297194 281225 328245 357298 375700 327357
16713C27357N199j0109l0451j967l013j094L7500J1754L4189R774J9426j3268
$$ 327357 332556 322447 291996 290029 287016 285922 323422 335176 369365 379139 398565 385297
16701C85297N8081N222j0989K864k1842L8998K2976J8646j4540L1408J6055R3678
$$ 385297 443378 448600 437611 440475 418633 457631 480607 499253 484713 516121 532176 625854
16689F25854K7151Q506J2964K5587K7456j3003J265N0184R079O4978N8082R8871
$$ 625854 653005 661511 674475 700062 727518 714515 715780 765964 775043 840021 898103 996974
16677I96974L4700O8860R5225O4253J27602K14978J06649R0695O8889N7140Q5154
$$ 996974 1031674 1100534 1195759 1260012 1387614 1602592 1709241 1799936 1868825 1925965 2011119
16666B011119J74451J96453K40247L61314L29677L83253M63827N02443M86546
$$ 2011119 2185570 2382023 2622270 2983584 3313261 3696514 4160341 4662784 5149330
16657E149330N09557O81854P81079J007022J421484K086908L015541M589269O953841
$$ 5149330 5658887 6340741 7121820 8128842 9550326 11637234 14652775 19242044 26195885
16648B6195885R792720J1479298J0201458O754829M387372L140251J439472m40715
$$ 26195885 35988605 47467903 57669361 64424190 68811562 71951813 73391285 72950570
16640G2950570m874731q904381n854065J185517P893903J2850416J4951069J4513892
$$ 72950570 68075839 59171458 53317393 54502910 62396813 75247229 90198298 104712190
16632A04712190J3049193R438302M314457M04836n925833j2746656j4304712j5498322
$$ 104712190 117761383 127199685 131514142 131918978 125993145 113246489 98941777 83443455
16624H3443455j4490417q225439j059993M351696O662577N189739K490700J109376
$$ 83443455 68953038 60727599 59667606 64019302 70681879 75871618 78362318 79471694
16616G9471694k18013k079700m764184j0546561j3711681j0733780o801418m380627
$$ 79471694 79253681 77173981 72409797 61863236 48151555 37417775 30616357 26235730
16608B6235730l015343k248188j737676j354058j056644q41377q02223o88502
$$ 26235730 23220387 20972199 19234523 17880465 16823821 15982444 15180221 14491719
16600A4491719o10313n69864o56033o86346n71683n28133n38284n41385m41171
$$ 14491719 13881406 13311542 12655509 11969163 11397480 10869347 10331063 9789678 9348507
16591I348507l55223l59667k95419k77084l21581k75318k85742k02678j96535
$$ 9348507 8993284 8633617 8338198 8061114 7739533 7464215 7178473 6975795 6779260
16582F779260l26393l28471k47114k22910j95027j98197j95855j50136j21237
$$ 6779260 6452867 6124396 5877282 5654372 5459345 5261148 5065293 4915157 4793920
16573D793920k11202k24513j65260j44893j79799n2641q6314j19530n3586q0139
$$ 4793920 4582718 4358205 4192945 4048052 3868253 3815612 3729298 3609768 3556182 3476043
16563C476043j00180j12854r1104p6719j43753r8383l9932j16630j06603q3872
$$ 3476043 3375863 3263009 3171905 3095186 2951433 2853050 2813118 2696488 2589885 2506013
16553B506013n7711r1966r0847o1076k4556l2484n0003r7467j09606j02892m7753
$$ 2506013 2448302 2356336 2265489 2204413 2179857 2147373 2097370 1999903 1890297 1787405 1739652
16542A739652l76J18k1495l7554q4261j19468m4459Q011M1902q8636r7492m2584
$$ 1739652 1739276 1739394 1717899 1680345 1596084 1476616 1432157 1440168 1482070 1393434 1295942 1253358
16530A253358l7395m0674o5848m6190m6366k7331J4149n5321q9255j12014o3835
$$ 1253358 1215963 1175289 1109441 1063251 1016885 989554 1003703 948382 859127 747113 683278
16519F83278J09978L4800q0322p6183p3392p1640n382R362j073l0873n8448k5122
$$ 683278 793256 828056 747734 671551 598159 526519 521137 530499 529426 498553 440105 414983
16507D14983J1791O4987j2855m2315m6909r5708k5078j9645L4822j6171o2924
$$ 414983 426774 491761 478906 436591 389682 293974 268896 249251 284073 267902 204978
16496B04978j7744o204J5199K4179N6516j6519k1486J00589M8628m9780q1311
$$ 204978 187234 181030 196229 220408 276924 260405 238919 339508 388136 338356 257045
16485B57045J412l775j9529R134n3772J3799P3890L505n3357L5405N5246p135
$$ 257045 258457 254682 235153 244287 190515 204314 278204 281709 228352 263757 319003 311868
16473C11868M7658r698l4381j1053k1453P209l6618K332m8897O239M8931J736
$$ 311868 359526 349828 315447 304394 282941 290150 253532 255864 206967 213206 262137 263873
16461B63873l4422k084J9191N5572K066n4329R325l413m0894m3138l2691m293
$$ 263873 229451 227367 246558 302130 304196 249867 259192 255779 214885 171747 139056 134763
16449A34763K6977K56K7761l5532k1514P1688L3972j3338l6121j9396L0751J8655
$$ 134763 161740 161996 189757 154225 132711 204399 238371 225033 188912 169516 200267 218922
16437B18922K7317J531p1948K0641K3080l5069n9025j1389L1088J7121K4973k2253
$$ 218922 246239 247770 175822 196463 219543 184474 125449 114060 145148 162269 187242 164989
16425A64989l476K9566l0182k9862L429L4107l2973j8068k643k8033K2461L8556
$$ 164989 161513 191079 160897 131035 134464 168571 135598 117530 114887 86854 109315 147871
16413A47871L0240L5105j7092k0116q461k9986q989l0448k961K2335N689k9231
$$ 147871 178111 213216 196124 176008 167547 137561 128572 98124 95163 117498 123187 93956
16401I3956k1377J7639l826J348J1294J4736K7047k207n9959k6714L8881m382
$$ 93956 72579 90218 86392 87740 99034 113770 140817 138610 78651 51937 90818 86436
16389H6436p0073o825K6620L0406J8265n183L0606n0441J0757K5079k7468j4932
$$ 86436 16363 9538 36158 66564 84829 79646 110252 59811 70568 95647 68179 53247
16377E3247J09n0192L5293R701l811N240j4003o1749l6206K6814P688M4168M2248
$$ 53247 53356 3164 38457 48158 44347 49587 35584 -26165 -62371 -35557 -27869 16299 58547
16364E8547J2980J1355o0237j6773K4682L7149K6561p975l0054p452n6130j7064
$$ 58547 71527 82882 22645 5872 30554 67703 94264 86289 56235 48783 -7347 -24411
16352b4411j4788j7032K2083J6013J8974Q595j9672L1299J6637O077q3120n028
$$ -24411 -39199 -56231 -34148 -18135 839 9434 -10238 21061 37698 43775 -39345 -44373
16340d4373J6635j2119K862J2668J3498l7253m1346J8238K9709O3577J8026q7991
$$ -44373 -27738 -39857 -36995 -24327 -10829 -48082 -89428 -71190 -41481 22096 40122 -47869
16328d7869L5473L5914j3902n9626j6521N962O693O300j0146J1395K2100j6603
$$ -47869 -12396 23518 9616 -50010 -66531 -60569 -53876 -47576 -57722 -46327 -24227 -40830
16316d0830n171K9267q514M3272l2383j4204M9180J7222K3394J5955L061K1688
$$ -40830 -46001 -16734 -25248 18024 -14359 -28563 20617 37839 61233 77188 80249 101937
16304A01937L4093q1944j09834j5827K7284j3822J9749K5739j8448o481M3397
$$ 101937 136030 54086 -55748 -71575 -44291 -58113 -38364 -12625 -31073 -37554 5843
16293E843Q295J6761k7570n2727p388K6909k5527p8O5865R243k7373q838N2091
$$ 5843 14138 30899 3329 -49398 -56786 -29877 -55404 -55482 10383 19626 -7747 -16585 35506
16280C5506N6359K4599l4137m8657l8110J7056M5093m0009M027o748L8831M998
$$ 35506 91865 116464 82327 33670 -4440 12616 57709 17700 21727 14979 53810 58808
16268E8808Q463K7156n2448l3620M700n8363l965L3309j0672K692K267j403L2915
$$ 58808 67271 94427 41979 8359 13059 -45304 -49269 -15960 -26632 -23940 -21673 -23076 9839
16255I839J8607K5555j2818m2425K9691j0813k961M4372K3739J1583n2318l6481
$$ 9839 28446 54001 41183 -1242 28449 17636 14675 59047 82786 94369 42051 5570
16243E570m3686L4334j0365K7801J1143n702k6210K1717O7390K8494j2604k4669
$$ 5570 -38116 -3782 -14147 13654 24797 19095 -7115 14602 81992 110486 97882 73213
16231G3213J9703J3914q1151k4799J0435o3423K1159J8914j4609k1278J3587J659
$$ 73213 92916 106830 25679 880 11315 -52108 -30949 -12035 -26644 -47922 -34335 -32676
16219c2676J7266l8783k8701q762K4495K9396O483K0493J8240j0320J992k2630
$$ -32676 -15410 -54193 -82894 -91656 -67161 -37765 -31282 -10789 7451 -2869 -877 -23507
16207b3507l1310J5846K7757j3068J5801L89m1691J704M876m6059K639M624m0980
$$ -23507 -54817 -38971 -11214 -24282 -8481 -8092 -49783 -48079 -43203 -89262 -86623 -81999 -122979
16194a22979k1973M0548N6686M1329N19O460K7477J0463j0000k3667k4478J4128
$$ -122979 -144952 -104404 -47718 -6389 -5870 590 28067 38530 28530 4863 -19615 -5487
16182e487k2535M563l273L5578L1904l5873k2910J0171j6428j4811Q31L2774k2029
$$ -5487 -28022 -23459 -26732 8846 40750 4877 -18033 -7862 -24290 -39101 -38270 -5496 -27525
16169b7525m5735R684M8409j1533J3556P1014K8305K9146K0316p5957k6624N206
$$ -27525 -73260 -63576 -15167 -26700 -13144 57870 86175 115321 135637 59680 33056 38262
16157C8262J0899K3284j2140o8904k4518p3085l420J5308N7192p962M5647R36
$$ 38262 49161 72445 60305 -8599 -33117 -106202 -109622 -94314 -37122 -45084 563 1499
16145A499k2927m3347j9148N5777K9288L2167K9298J611l2105m3545M5994o439
$$ 1499 -21428 -64775 -83923 -28146 1142 33309 62607 64218 32113 -11432 34562 28123
16133B8123n788l7038m6953J6988j7849M9943J3640l2684q413l072k6047k5172
$$ 28123 22335 -14703 -61656 -44668 -62517 -12574 1066 -31618 -40031 -43103 -69150 -94322
16121i4322K1145Q2522L9257R5978k2106o1228p4651n7681k2148j4265J6909L8238
$$ -94322 -73177 9345 48602 144580 122474 61246 -13405 -71086 -93234 -107499 -90590 -52352
16109e2352O749N094j8346o7747r982J04146N0888k9407J90K7019m744Q1310r745
$$ -52352 -45603 -40509 -58855 -126602 -136584 -32438 18450 -10957 -10767 16252 11508 92818 83073
16096H3073p8365l4921n701k3010R5607N0177o0504q5754J663M0723N2483N3571
$$ 83073 4708 -30213 -35914 -58924 36683 86860 26356 -59398 -57735 -17012 35471 89042
16084H9042P3420P8430L4828l5990J0905L1433N2658N6104o597l5941l7555n765
$$ 89042 162462 240892 275720 239730 250635 282068 334726 390830 384233 348292 310737 304972
16072C04972R6048J09031P7630Q5445N7328L5956j6202k5912n675l4062j19388
$$ 304972 401020 510051 587681 673126 730454 766410 750208 724296 718621 684559 565171
16061E65171j29525p5155j1190o035M7474M2293O7677N6578l2122n0451j31425
$$ 565171 435646 360491 349301 343266 390740 433033 500710 557288 525166 474715 343290
16050C43290r1318l6943j1527k8130l9331k8150k9621K1022l4402k6211K4876
$$ 343290 251972 215029 203502 175372 136041 107891 78270 99292 64890 38679 63555
16039F3555J969m2384j8925R795L5334j4479M3349j2727j6394p566N9011n590
$$ 63555 65524 23140 4215 14010 49344 34865 78214 65487 49093 41527 100538 94948
16027I4948j3080l3291m7188J848o079k5724j5450M417N6557J0155j8453J6360
$$ 94948 81868 48577 1389 3237 -2842 -28566 -44016 -39599 16958 27113 8660 25020
16015B5020n2988k2517L8029J2499k9567J907k5124l9705k3085J8093K9253q624
$$ 25020 -27968 -50485 -12456 43 -29524 -27617 -52741 -92446 -115531 -97438 -68185 -76809
16003g6809K6181J4689l2055Q603K7979L0208L3095N9632K1382l4131m3006o792
$$ -76809 -50628 -35939 -67994 -59391 -31412 -1204 31891 91523 112905 78774 35768 28976
15991B8976K861l2256J1807J12065j5155p6815j4861O4515M985n1728j394K9214
$$ 28976 31837 -419 11388 123453 108298 31483 16622 81137 86122 34394 33000 62214
15979F2214K317m2008l149k417L910q506O640J5548j5612p5394l5856N2036O501
$$ 62214 64531 22523 19374 16957 20867 12361 19001 34549 18937 -56457 -92313 -40277 -33776
15966c3776J4726Q6425M3761m5415r1177r001j702K8803Q4345j5340n9197l429
$$ -33776 -19050 67375 111136 65721 -25456 -34457 -36159 -7356 76989 61649 2452 -977
15954i77K2232K5427O380m4025j3845K8472m6285m2559J9172M4038L772j1419
$$ -977 21255 46682 53062 9037 -4808 23664 -22621 -65180 -46008 -1970 1802 -9617
15942i617o167n29j4781J3589j2244M812K7356P862l615J0065J1187k4029M145
$$ -9617 -15784 -16313 -31094 -17505 -29749 -24937 2419 10281 6666 16731 27918 3889 8034
15929H034K6717j9876k1414K6967k8502Q074N1163M7921m9952j7578k8508J8096
$$ 8034 34751 14875 -6539 20428 -8074 0 51163 99084 49132 31554 3046 21142
15917B1142K6837m1535l9220l463Q5735N2820k5644n8722o062L6057K4331J5539
$$ 21142 47979 6444 -32776 -36239 49496 102316 76672 17950 11888 47945 72276 87815
15905H7815l5670K478r815J1706m8618k4088R869L2154l1544m3603l5552j7876
$$ 87815 52145 54623 44808 56514 7896 -16192 -6323 25831 -5713 -49316 -84868 -102744
15893a02744J1756J0939p761K0104q784J5825N0078M8754K7541P557m4773j6943
$$ -102744 -90988 -80049 -87810 -67706 -76490 -60665 -10587 38167 65708 73265 28492 11549
15881A1549K1724N7289q986j7220m0797l9712J4160K0613m599m745L5214K5117
$$ 11549 33273 90562 81576 64356 23559 -16153 -1993 18620 14021 9276 44490 69607
15869F9607k5508l6022N9048P641n3561p598Q925K7395l3049n8504j5484K0795
$$ 69607 44099 8077 67125 74766 21205 13607 22532 49927 16878 -41626 -57110 -36315
15857c6315K3393L0582j8575m1461R361M6802J7608J3680L768K6587n209o5511
$$ -36315 -12922 17660 -915 -42376 -33015 13787 31395 45075 48843 75430 70221 4710
15845D710m238k9289N699j8993J537K2256K7821L053J0040J5230r606m4337l8899
$$ 4710 472 -28817 -23118 -42111 -40574 -18318 9503 12556 22596 37826 28220 -16117 -55016
15832e5016L7575M4834J6458J4580J6760o87l0269q904M6101j9331l0638k8672
$$ -55016 -17441 27393 43851 58431 75191 74504 44235 35331 81432 62101 31463 2791
15820B791l5099K7665L2102j5533R358L1917O6477p0149n9373J4891N0264M68
$$ 2791 -32308 -4643 27459 11926 21284 53201 119678 49529 -9844 5047 55311 55779
15808E5779J5972L287J7665o502k2511k7194m5591L4555J4537P266L9786r66m2994
$$ 55779 71751 75038 92703 86201 63690 36496 -9095 25460 39997 47263 87049 86083 43089
15795D3089j0880M9383M453q689o1408J2618P1698n4366l1285n203k9783J7984
$$ 43089 32209 81592 86045 77356 15948 28566 100264 45898 14613 9410 -20373 -2389
15783b389N48k5449L1529n765J5756M4179n422P784l1729M403j5416Q852k2972
$$ -2389 -1841 -27290 4239 -1526 14230 58409 52987 60771 29042 33445 18029 26881 3909
15770C909k6803M0681j4089k2496k4029l560L4303j236L9814j9794J4484m7872
$$ 3909 -22894 17787 3698 -18798 -42827 -46387 -12084 -13320 26494 6700 21184 -26688
15758b6688o0320L4724K5358O6433L6631m6059k7773R266O6044j7331n3674m3424
$$ -26688 -87008 -52284 -26926 39507 76138 30079 2306 11572 77616 60285 6611 -36813
15746c6813M2159L4921k8216l8076j0775L7671R150m5016j269L8072M3315j9959
$$ -36813 5346 40267 12051 -26025 -36800 871 10021 -34995 -36264 1808 45123 25164
15734B5164j8048m634K5132j5875p118r97L7338J4552K6790J9236j31888o7820
$$ 25164 7116 2482 27614 11739 4621 3624 40962 55514 82304 101540 -30348 -98168
15722i8168K2324K9450L7292k9231K3753Q8588L7783J2414Q730p6558k6504R0324
$$ -98168 -75844 -46394 -9102 -38333 -14580 74008 111791 124205 132935 56377 29873 120197
15710A20197N4452P329J7516n3713m7397l3159n0119j2397K2396j5n9671Q789
$$ 120197 174649 181978 199494 145781 98384 65225 15106 2709 25105 25090 -34581 -25792
15698b5792J5683K5633j281O930j7363k5535j3738j2111O2667J00804L1247m7834
$$ -25792 -10109 15524 14243 21173 3810 -21725 -35463 -47574 15093 115897 147144 99310
15686I9310n902l4885m0766j2979o780K1243O60n5011l4987l19L8367k126K5047
$$ 99310 93408 58523 17757 4778 -2002 19241 19901 -35110 -70097 -70416 -32049 -34175 -9128
15673i128L8259j7613o514L8378j604m4942o1985n1714N1220j7151l9066M4722
$$ -9128 29131 11518 5004 43382 41778 -3164 -65149 -116863 -65643 -82794 -121860 -77138
15661g7138M5764J221L8518N7116L908k4258L3358N547J8347J2421j2253m2451
$$ -77138 -31374 -30153 8365 65481 69389 45131 78489 84036 102383 114804 102551 60100
15649F0100J0202j8701m8305l8116M3092M7161K4849K365j2877k8082l0505N853
$$ 60100 70302 51601 3296 -34820 8272 55433 80282 82647 69770 41688 11183 17036
15637A7036K7170O3174K2624m653M7330K4587R816M7234N0875J24641L0662Q0463
$$ 17036 44206 107380 130004 125351 172681 197268 207084 254318 305193 429834 460496 540959
15625E40959J46993J53063J65556K03316K55170J87680J73168J20655N8462L7759
$$ 540959 687952 841015 1006571 1209887 1465057 1652737 1825905 1946560 2005022 2042781
15615B042781K5663q6082j88182j64520j37935j62425j63138j41719j53636j60621
$$ 2042781 2068444 1982362 1794180 1629660 1491725 1329300 1166162 1024443 870807 710186
15605G10186j19866r8008j47499j6877l2517o6438l9738K3908j965J1050j1780
$$ 710186 590320 492312 344813 327936 295419 228981 189243 213151 211186 222236 210456
15594B10456m265k3966J0286P5255l4474n1913r1300o9479L5811L8014M3418l9674
$$ 210456 206191 182225 192511 267766 233292 181379 90079 20600 56411 94425 137843 98169
15582I8169j9859j6794R009P9046N8841k8711k0100m7454o4467k1656j6961K686
$$ 98169 78310 61516 70525 149571 208412 179701 159601 112147 47680 26024 9063 11749
15570A1749M0725K0178Q01j1104O900L55o366j1709M386k3947Q602j1550J4239
$$ 11749 52474 72652 73453 62349 69249 69604 63238 51529 55915 31968 40570 29020 43259
15557D3259J935n7682L8176J1182k2681k4195J4893L3596k5363m8971K1052K7706
$$ 43259 45194 -12488 25688 36870 14189 -10006 4887 38483 13120 -35851 -14799 12907
15545A2907k8570m8179O2725M5768j0737k9402l4467K3599N8119j3646p6762m2029
$$ 12907 -15663 -63842 -1117 44651 33914 4512 -29955 -6356 51763 38117 -38645 -80674
15533h0674K0384K302k5241L5819J0486M2293M3856K8296J4431k016n083l3236
$$ -80674 -60290 -57988 -83229 -47410 -36924 5369 49225 77521 91952 89936 84853 51617
15521E1617k7931O4314J4372P668l4170k2917K2032K3327M9431M765o2643o7380
$$ 51617 23686 88000 102372 110040 75870 52953 74985 98312 147743 152508 89865 22485
15509B2485j2066J5297L7423k032r776l1588M941k1563K1985M3215j0904n066
$$ 22485 10419 25716 63139 61107 51331 19743 24684 3121 25106 68321 57417 52351
15497E2351L5711k9942m0749j3654M7361O2000L5424L7793J5561m218r3507k8555
$$ 52351 88062 58120 17371 3717 51078 113078 148502 186295 201856 197638 104131 75576
15485G5576L9811L3565l5421l5818j7272K5138l0048N9655K8242j5648j0250j5321
$$ 75576 115387 148952 113531 77713 60441 85579 55531 115186 143428 127780 117530 102209
15473A02209k1276j4793L5703J3935J1732l747n3445L1055k501J6486K435k7222
$$ 102209 80933 66140 101843 115778 127510 123763 70318 101373 98872 115358 117793 90571
15461I0571m0892L6591O5851J5887j6267m1612r867K0837l631l2417j8774K1343
$$ 90571 49679 86270 152121 168008 151741 110129 100262 121099 117468 85051 66277 87620
15449H7620J3865L2466m4074k4304M1221O7145N3565k307n6984j6093K022N8281
$$ 87620 101485 133951 89877 65573 106794 173939 227504 225197 168213 152120 154142 212423
15437B12423L7433K7451L3142K709n027O9703k5097J8719j8997k7668n6601k3720
$$ 212423 249856 277307 310449 313158 308131 377834 352737 371456 352459 324791 268190 244470
15425B44470J5347j7432m6217k2876J2669N497l6601k3438n71k350J5104O3118
$$ 244470 259817 242385 196168 173292 185961 191458 154857 131419 130848 128498 143602 206720
15413B06720K8718k8075k1491j5301L2695K2338m6189o7699k206K0886J4863K3325
$$ 206720 235438 207363 185872 170571 203266 225604 179415 111716 109510 130396 145259 168584
15401A68584l5720J1766K1187k2502K337j0929R3669K3848l7629l5925K4368p981
$$ 168584 132864 144630 165817 143315 145652 134723 228392 252240 214611 178686 203054 195073
15389A95073k1297J7364j6579l8782K5636M8791J2896J1793p3177j5886R405k3416
$$ 195073 173776 191140 174561 135779 161415 210206 223102 234895 161718 145832 155237 131821
15377A31821j1737n2532k9794K1883K0645R243k1304l6209p2938k5088M1975K3703
$$ 131821 120084 67552 37758 59641 80286 89529 68225 32016 -40922 -66010 -24035 -332
15365c32j2256L4929l0579k4900m532L4426J5933j0835j6118o720L0340K1304
$$ -332 -12588 22341 -8238 -33138 -37670 -3244 12689 1854 -14264 -20984 9356 30660
15353C0660j8385l6437L1581J8970l7522r80K8253K5029L2822n4766j9276M6265
$$ 30660 12275 -24162 7419 26389 -11133 -12113 16140 41169 73991 19225 -51 46214
15341D6214K0255m9205l2994o0l400q428L862o530K7095N0887j1259j5634J0442
$$ 46214 66469 17264 -15730 -15790 -19190 -27618 -23756 -30286 -3191 47696 36437 20803 31245
15328C1245N0739K1515j3327m1348L9065M3349j7793j2000J5468J9639l4403P5
$$ 31245 81984 103499 90172 48824 87889 131238 113445 101445 116913 136552 102149 102224
15316A02224O1090L2609M4071N9209K2581P1559Q8189K9835J0319K8599N1409
$$ 102224 163314 195923 239994 299203 321784 393343 481532 511367 521686 550285 601694
15305F01694R8417M1818o978n5493m0081O082N171J1827m944j4050m2746j0904
$$ 601694 700111 741929 734951 679458 639377 645459 650630 662457 657513 643463 600717 589813
15293E89813k3926l1497k7959k6721k4332P220J9561K6071K330l9124O569o9926
$$ 589813 565887 534390 506431 479710 455378 462598 482159 508230 510560 471436 478005 408079
15281D08079J0038L2514M9985l240m1195M2175n257J9969K0684n4756m6395m8815
$$ 408079 418117 450631 500616 497376 456181 498356 493099 513068 533752 478996 432601 383786
15269C83786k135M6654K066N387K2807m2303J0939R0946P0263K2366M995O9689
$$ 383786 381651 428305 430371 435758 458565 416262 427201 518147 588410 610776 615771 685460
15257F85460L2047J1239k6175K8002J6525J6103R957J7944J9838J6101L8972L5305
$$ 685460 717507 728746 702571 730573 747098 763201 773158 791102 810940 827041 866013 901318
15245I01318L8342m0727k2530M6077k736k6422K0052L0793N088J8098R0895L7072
$$ 901318 939660 898933 876403 922480 919744 893322 913374 944167 949255 967353 1058248 1095320
15233A095320R820M8485M4961M0280k565P9128P1655Q0563R0225M5859M5951M5839
$$ 1095320 1105140 1153625 1198586 1238866 1236301 1315429 1387084 1467647 1557872 1603731 1649682 1695521
15221A695521N7154K7770P5187M8978M5180M2269N4450J05636J94289J71264K21582
$$ 1695521 1752675 1780445 1855632 1904610 1949790 1992059 2046509 2152145 2346434 2517698 2739280
15210B739280L07152L22840L27230L55123M81592N10999O43014P58306Q54503
$$ 2739280 3046432 3369272 3696502 4051625 4533217 5044216 5687230 6445536 7300039
15201G300039R99128J164027J373470J694028K013217K337008K708127L194710
$$ 7300039 8299167 9463194 10836664 12530692 14543909 16880917 19589044 22783754
15193B2783754L769067M531217N827478P901190J0814072J4749622J9631142K4714954
$$ 22783754 26552821 31084038 36911516 44812706 55626778 70376400 90007542 114722496
15185A14722496K9656978L4252826L8236197M0669126M0324050L6344255K8863659
$$ 114722496 144379474 178632300 216868497 257537623 297861673 334205928 363069587
15178C63069587J9443484R196763j337342j2085322k2762387l1361099l6796213
$$ 363069587 382513071 391709834 390372492 378287170 355524783 324163684 287367471
15171B87367471l8128216l6715911l3668082k9641558k5203884k0170708j5220686
$$ 287367471 249239255 212523344 178855262 149213704 124009820 103839112 88618426
15164H8618426j1028362q149923o407810n328277m633469m064952l604826l266754
$$ 88618426 77590064 69440141 63032331 57704054 53070585 49005633 45400807 42134053
15156D2134053k948849k693835k350869k058567j767250j568478j407696j262942
$$ 42134053 39185204 36491369 34140500 32081933 30314683 28746205 27338509 26075567
15148B6075567j137363j039500r60590r42329q33705p88383p88869o86140o46035
$$ 26075567 24938204 23898704 22938114 21995785 21162080 20373697 19584828 18898688 18252653
15139A8252653o29651o65725n78000n44915n85038n35514m39771l97837m84146
$$ 18252653 17623002 16957277 16379277 15834362 15249324 14713810 14274039 13876202 13392056
15130A3392056m48387n32495n06759l79430l84985m58170m16053l44369l20724
$$ 13392056 12943669 12411174 11904415 11524985 11140000 10681830 10265777 9921408 9600684
15121I600684k74890k63713l25896l25146k72212k80762k03505k59827k88896
$$ 9600684 9325794 9062081 8736185 8411039 8138827 7858065 7654560 7394733 7105837
15112G105837k15039k17116j67312k10460k44103k19336j51744o2812j65391k00080
$$ 7105837 6890798 6673682 6506370 6295910 6051807 5832471 5680727 5617915 5452524 5252444
15102E252444j39239j45952r0977j17868j59889j49086m4952j05467r5649q6181
$$ 5252444 5113205 4967253 4876276 4758408 4598519 4449433 4404481 4299014 4203365 4117184
15092D117184r5005r4624o1737r2152j33717j07423p2152o3996q1609q0817r9969
$$ 4117184 4022179 3927555 3865818 3773666 3639949 3532526 3460374 3396378 3314769 3233952 3133983
15081C133983j04789q8194r1122o5714q0617j40128j54651j67666j45624q6772
$$ 3133983 3029194 2941000 2849878 2784164 2703547 2563419 2408768 2241102 2095478 2008706
15071B008706j03146j11601p8741p8137r4125r9593r7457o0261J0416k4124o5927
$$ 2008706 1905560 1793959 1715218 1637081 1542956 1443363 1345906 1285645 1296061 1271937 1206010
15060A206010o0167n0516m1191j3852n1011n0155k1739J3895q1361l0734J9841
$$ 1206010 1145843 1095327 1054136 1040284 989273 939118 917379 931274 849913 819179 839020
15049H39020M978M8169M7192n0110m0079m0347l2741N295n592l9543M4339j6190
$$ 839020 843998 892167 939359 889249 849170 808823 776082 781377 775785 736242 780581 764391
15037G64391n0486J4618R213K3841J8323N021k5339J1778L8222k9491l9968N9542
$$ 764391 713905 728523 737736 761577 779900 784921 759582 771360 809582 780091 740123 799665
15025G99665K2788j6280n4673j4224M5667K944J5987m9631l4929K0099m9622l4443
$$ 799665 822453 806173 751500 737276 782943 785887 801874 752243 717314 737413 687791 653348
15013F53348O676J9093J4120L0238l9226K312K1230M3111L554n1891L5113M9273
$$ 653348 660024 679117 693237 723475 684249 686561 707791 750902 754456 702565 737678 786951
15001G86951n036p592k1516l0684l1156m2992L9564M5653R106l972j1209L4219
$$ 786951 781915 774323 752807 722123 690967 647975 687539 733192 742298 738326 727117 761336
14989G61336O08m8262p4612j9383j6445l4413k1352O5254K5665j9428k4887k4064
$$ 761336 761944 713682 639070 619687 603242 568829 547477 612731 638396 618968 594081 570017
14977E70017K2428J6685k1012n7915n8533P261j9682m0352l1459K3856l0976n4070
$$ 570017 592445 609130 588118 530203 471670 478931 459249 418897 387438 411294 380318 326248
14965C26248m38k9740L6305L4351K6983r968k8740N2977R102k7984k1407J3259
$$ 326248 325810 296070 332375 366726 393709 383741 355001 407978 417080 389096 367689 380948
14953C80948m717l1464j4323Q484r796n7954n2649L2199L0659j2773L4135k7149
$$ 380948 376231 344767 330444 338928 329132 271178 218529 250728 281387 268614 302749 275600
14941B75600k6812J4568l6176m6555K9943O4562J2854k9612K0435K0207m9086
$$ 275600 248788 263356 227180 180625 210568 275130 287984 258372 278807 299014 249928
14930B49928l7506M6422k5601l3544n3841m6390N7224L8671k4933p1576N3024
$$ 249928 212422 258844 233243 199699 145858 99468 156692 195363 170430 98854 151878
14919A51878k0225l8N3982J5237j0358N6406N4162o5581m0518q449m5384k6370
$$ 151878 131653 131615 185597 200834 190476 246882 301044 235463 194945 186496 141112 114742
14907A14742j0012O679J147N4142L8700M90m4700j3457K5849J5603o6936o1017
$$ 114742 104730 111409 112556 166698 205398 205888 161188 147731 173580 189183 122247 61230
14895F1230L9130L523L02M733J3361N2239N676l3602n6650j6910k1676q982M5511
$$ 61230 100360 103883 104185 108918 122279 174518 180194 146592 89942 73032 51356 42374 87885
14882H7885N3230K2573l4565l6276k3079K0179L7315q047k0883J7763M1216k306
$$ 87885 141115 163688 129123 92847 69768 89947 127262 119215 98332 116095 157311 155005
14870A55005o7410l1439J1878K8566k4185N723K3302J245p028J633P8389J6778
$$ 155005 87595 56156 68034 96600 72415 78138 101440 102685 95657 97290 175679 192457
14858A92457k9394m9813j9431K4930N526J9015L0156J1485k870k9353J6490Q133
$$ 192457 163063 113250 93819 118749 124275 143290 173446 184931 182061 152708 169198 177331
14846A77331m2937l8918Q784j1051J358L5851P957j7611l2432k6585j0714J12496
$$ 177331 134394 95476 104260 93209 94567 130418 138375 120764 88332 61747 51033 163529
14834A63529O6726r456n2064k0442L7231j4856o8978k5419L5588J3157N41P94
$$ 163529 230255 220799 168735 148293 185524 170668 101690 76271 111859 125016 125557 126351
14822A26351M936k8911J714j0842K9480K9486l5750J6231j2212l4779O001J147
$$ 126351 131287 102376 104090 93248 122728 152214 116464 132695 120483 85704 91705 92852
14810I2852O7647N7958j1994o9126n6338J6262j6404O169J8999k480J8748j2049
$$ 92852 160499 218457 206463 137337 80999 97261 80857 87026 106025 103545 122293 110244
14798A10244L1123L307o328N859O369J6952J9442M9542k1749j6661o7335p303
$$ 110244 141367 144674 138346 144205 150574 167526 186968 236510 214761 198100 130765 123462
14786A23462Q11k2055j4046N2645N402j9004l0309j0053J1355q537j0831j5032
$$ 123462 124273 102218 88172 140817 146219 127215 96906 86853 98208 89671 78840 63808
14774F3808M0913k2233j247J1340o568K3511m438j8992k4911k8767n876L7049
$$ 63808 104721 82488 81241 92581 86013 109524 105086 86094 61183 32416 26540 63589
14762F3589J3095j1985J9773L6652p583K476q34J809K0464j0076l4537M516J3491
$$ 63589 76684 64699 84472 121124 113541 116017 115183 116992 137456 127380 92843 97359 110850
14749A10850L9834N0042M4144K0748K8604N7340O0383R9165J90116J89630J50231
$$ 110850 150684 200726 244870 265618 294222 351562 411945 511110 701226 890856 1041087
14738A041087R9058J96256K38391K44102J36395N2771L1877O6961l7329j25196
$$ 1041087 1140145 1336401 1574792 1818894 1955289 2008060 2039937 2106898 2069569 1944373
14728A944373j33997j63680k31998k35068j89258j31541j17145m6085k1199j09595
$$ 1944373 1810376 1646696 1414698 1179630 990372 858831 741686 695601 674402 564807
14718E64807m1795m6847J0778o1445j01288l349k0514j910k6764l5288M1448k939
$$ 564807 523012 476165 486943 425498 324210 320861 300347 298437 271673 236385 277833 274894
14706B74894k0959j6697k7739n6364p5069M3682K5646k5129R2178M447n1396P482
$$ 274894 253935 237238 209499 153135 78066 121748 147394 122265 214443 218890 167494 174976
14694A74976k4283n645J101L8671J4581j6923j52n1430q0595J3058L8518n522
$$ 174976 150693 145048 146149 184820 199401 182478 182326 130896 50301 63359 101877 96355
14682I6355k6304N2514K7169j0198k8106k4479L8404K3742k6537n7600L72J1244
$$ 96355 70051 122565 149734 139536 111430 86951 125355 149097 122560 64960 65332 76576
14670G6576p942O590l099l7936l7280l0166K7374O1968l6485m3697M9515P2933
$$ 76576 68634 75224 72125 34189 -3091 -33257 -5883 56085 19600 -24097 25418 98351
14658I8351p2051m3836O773J7529j1084m082r042j8583O3430L7956p214r253k8465
$$ 98351 26300 -17536 -10763 6766 -4318 -8400 -17442 -36025 27405 65361 58147 48894 20429
14645B0429j4084J9051N1916N20J0217Q593m5962k6836J9641j9976J6958K2404
$$ 20429 6345 25396 77312 77832 88049 96642 50680 23844 43485 23509 40467 62871
14633F2871p630m6099j8981K0259K460n879J9757R861O038J8320n894l303m4787
$$ 62871 55241 9142 -9839 10420 12880 7001 26758 36619 42657 60977 55083 51780 6993
14620F993K2729K4723K9391Q506m4436K1439P300k0417Q583l6550k7036K3847
$$ 6993 29722 54445 83836 92342 47906 69345 76645 56228 64811 28261 1225 25072
14608B5072p427O1710j7893o1106k6288O1308o946J040J0963l7026m5388k6290
$$ 25072 17645 79355 61462 356 -25932 35376 28430 29470 40433 3407 -41981 -68271
14596f8271P0581K3227k0462k498N3612L2373k896j9191j5568O366M5807K4856
$$ -68271 2310 25537 5075 2577 56189 88562 85666 66475 50907 57273 103080 127936
14584A27936m0416m0672q231J858l7532L3050L3701L6809j9661l4092L444M7991
$$ 127936 87520 46848 38617 40475 2943 35993 69694 106503 86842 52750 56194 104185
14572A04185K7559L663J7872K6326n1447j7543r328l4019j32k0041n4945N1151
$$ 104185 131744 135407 153279 179605 128158 110615 101287 67268 67136 47095 -7850 43301
14560D3301N6561L12M2172J0256j00734n1239j3032L6077Q561k1321k9170l6125
$$ 43301 99862 100174 142346 152602 51868 629 -12403 23674 32235 10914 -18256 -54381
14548e4381L7982N684M6399J7450k0153j812l1956R039l1325l8842l65K7672L9051
$$ -54381 -16399 -10715 35684 53134 32981 31169 -787 8252 -23073 -61915 -62280 -34608 4443
14535D443J2312r009K7292J9776L136j152n9740l1679K1089O4385j0303m5057
$$ 4443 16755 7746 35038 54814 57950 56798 -2942 -34621 -13532 50853 40550 -4507
14523d507J4672J2707l4138J7717J7583J807J7206m5905j4591L7154M9662L0574
$$ -4507 10165 22872 -11266 6451 24034 25841 43047 -2858 -17449 19705 69367 99941
14511I9941l2639k7557j4788k5142j9620l2633K5639J9189M2499K2247J9413p0103
$$ 99941 67302 39745 24957 -185 -19805 -52438 -26799 -7610 34889 57136 76549 6446
14499F446k2636L8355l7214l945M0170q279j6102K107l0279J4801j5110J0278
$$ 6446 -16190 22165 -15049 -18994 21176 12897 -3205 -1098 -31377 -16576 -31686 -21408
14487b1408j0381R354K5197j8290p6642l3231L1042R5797L2625l6853N598Q089
$$ -21408 -31789 -22435 2762 -15528 -92170 -125401 -94359 1438 34063 -2790 2808 10897
14475A0897l592J3013K4351m3418k8376J6954K0907L4081L4380p659j6930k6405
$$ 10897 7305 20318 44669 1251 -27125 -10171 10736 44817 79197 71538 54608 28203
14463B8203j9490R27J9769J034k7575k8142N4760N0215l3248n8106n0209R90N6002
$$ 28203 8713 9640 29409 30443 2868 -25274 29486 79701 46453 -11653 -61862 -60872 -4870
14450d870qk2556P643M7129J3393K8273L6620q530k5509l0630L466n0428J9520
$$ -4870 -4878 -27434 -19791 27338 40731 69004 105624 97094 71585 40955 44421 -6007 13513
14437A3513k0051K096o158k6550M4437m1148L6808L5998J6169k9007q105J9426
$$ 13513 -6538 -4442 -10600 -37150 7287 -33861 2947 38945 55114 26107 18002 37428
14425C7428K4973O1899M2505j9739l2035m0918j4016K435m6234j2037L8046L8261
$$ 37428 62401 124300 166805 147066 115031 74113 60097 62532 16298 4261 42307 80568
14413H0568M3765o233M201n0363o9996J2175n638m5010l4369J4450J578j1506
$$ 80568 124333 118100 122301 71938 1942 14117 8479 -36531 -70900 -56450 -54872 -66378
14401f6378J181K5658K4914Q2866J0816p185p1448J0921N6091m689K6276J0536
$$ -66378 -65197 -39539 -14625 68241 79057 71872 424 11345 67436 62747 89023 99559
14389I9559k1677k8041l0275k6203L0968J65j8132K7400Q4666K2129n2856m8560
$$ 99559 77882 49841 19566 -6637 24331 24496 6364 33764 118430 140559 87703 39143
14377C9143j2884M3352L0350m3617p4354J0022M4533K2175K3630L1996m6280K437
$$ 39143 26259 69611 99961 56344 -18010 -7988 36545 58720 82350 114346 68066 70503
14365G0503P438J6719o76J308j0458l6293o0097k6680k9999J274K5177M1874j3077
$$ 70503 77941 94660 93984 95292 84834 48541 -11556 -38236 -68235 -66961 -41784 90 -12987
14352a2987K0446J1189K288M6755J2556n0341l2136N2398J0753q3936L1494K2805
$$ -12987 7459 18648 20936 67691 80247 29906 -2230 50168 60921 -23015 8479 31284
14340C1284l0261m3704J9817K3635K7158J0153l4891l905o8665L6739K1384K3913
$$ 31284 1023 -42681 -22864 771 27929 38082 3191 -714 -69379 -32640 -11256 12657
14328A2657N124K9763M1964L2978k9983J4761N5931o907o6143l938j6393l5505
$$ 12657 17781 47544 89508 122486 92503 107264 163195 156288 90145 86207 69814 34309
14316C4309j166J8884j1497J0423o5609K3292M0507n7364p646N1710j6107R543
$$ 34309 33143 52027 40530 50953 -14656 8636 49143 -8221 -15867 35843 19736 29279
14304B9279P5036m9218q7879J2843l8387m0189k6402j6436m8355K5314J16252
$$ 29279 104315 55097 -32782 -19939 -58326 -98515 -124917 -141353 -189708 -164394 -48142
14293d8142K4902K9540n426k6270j2479k4544L5081J4692P692k567l3541k3568
$$ -48142 -23240 6300 874 -25396 -37875 -62419 -27338 -12646 -4954 -7521 -41062 -64630
14281f4630N3172N3524j2757q537N892N2147j5836n9212Q605j2657j8728k3605
$$ -64630 -11458 42066 29309 20772 26664 78811 62975 3763 12368 -289 -19017 -42622
14269d2622k6478j1336L1576N534K6521L2277k7120L8567K386k3976n9817L9975
$$ -42622 -69100 -80436 -48860 -43326 -16805 15472 -11648 26919 29305 5329 -54488 -14513
14257a4513M8517P063k6084n720k092Q019O076k2875k8985L5732M1760J4719l031
$$ -14513 34004 41067 14983 9263 7171 15190 21266 -1609 -30594 5138 46898 61617 58586
14244E8586J2350o3955m5899K8516Q4307k7550m4304l0159K7460j0802M0331O1270
$$ 58586 70936 6981 -38918 -10402 73905 46355 2051 -28108 -648 -11450 28881 90151
14232I0151K7146J7675l7743j8737r974n9363k6408K2268K565L1078k3186r399
$$ 90151 117297 134972 97229 78492 68518 9155 -17253 5015 7580 38658 15472 6073
14220F073m4674p095K3932m182M0066K3173o4958l3382J059N4469L6175k2875
$$ 6073 -38601 -45696 -21764 -25946 14120 37293 -27665 -61047 -59988 -5519 30656 7781
14208G781L0492M5318q81k6201l4106m2722J7306N5403Q1220m28n6966k6062J065
$$ 7781 38273 83591 82710 56509 22403 -20319 -3013 52390 133610 133182 76216 50154 51219
14195E1219L9479M8031q024m628K001m0475k776n7673N07n095J9531K800j1509
$$ 51219 90698 138729 130705 126077 128078 87603 84827 27154 27661 22566 42097 44897 33388
14182C3388l9927k7012J5504K0073J0500J1868l290k544L374R107q7882k79j5444
$$ 33388 -6539 -33551 -18047 2026 12526 24394 21104 18560 21934 31041 -56841 -57120 -72564
14169g2564L1805J7687l6741L853j1425K4898M558L5796J6010r280O7274K7606
$$ -72564 -40759 -23072 -59813 -55960 -67385 -42487 -37929 -2133 13877 4597 71871 99477
14157I9477k3081k1563k2847l9022Q0453L4562l8712n9682J1912P9071L2492n496
$$ 99477 76396 54833 31986 -7036 73417 107979 69267 9585 21497 100568 133060 127564
14145A27564p6614R995N2510l0357n3048M0543K8368m1686j6285M595K886m2025
$$ 127564 50950 60945 113455 83098 30050 70593 98961 57275 40990 45585 48471 6446
14133F446j5892K3366J2286k9223J4030P7370l756n8424l5228m8705m5059r825
$$ 6446 -9446 13920 26206 -3017 11013 88383 84627 26203 -9025 -57730 -102789 -112614
14121a12614M8788L4540L5256J1442n4191o2316P5391k7041N359L9651P520M0984
$$ -112614 -63826 -29286 5970 17412 -36779 -99095 -23704 -50745 -45386 -5735 1785 42769
14109D2769j0261p61m8090j5230J6960m7163j8488N6014k7504P487J4515J6768
$$ 42769 32508 31747 -16343 -31573 -14613 -61776 -80264 -24250 -51754 -44267 -29752 -12984
14097a2984L4370j3422m0551Q235o545M6906O3109n1078q7368n3512j5416J8179
$$ -12984 21386 7964 -32587 -24352 -30897 16009 79118 28040 -59328 -112840 -128256 -110077
14085a10077O1327K8511n270k2610p146L6450L656k0470J490j921M76o4727k5682
$$ -110077 -48750 -20239 -25509 -48119 -55265 -18815 -15159 -35629 -34139 -36060 -35584 -100311 -125993
14072a25993J20677N5897l9719o0971K9555K5856n774J9672L6671o22K3425k0851
$$ -125993 -5316 50581 10862 -50109 -20554 5302 -472 19200 55871 55249 78674 57823
14060E7823k8500j4498L6829J1156o908M3984K925J3355k8786o0923j4522k4648
$$ 57823 29323 14825 51654 62810 55902 99886 102811 116166 87380 26457 11935 -12713
14048a2713J4811j6256p463O2393L9907L911k9531l7797k2000j6613J4676O057
$$ -12713 2098 -14158 -21621 40772 80679 84590 55059 17262 -4738 -21351 -6675 -618
14036f18K5639j5173K9734L8572l1142m9033l1620l2918P664L879Q6004O1139
$$ -618 25021 9848 39582 78154 47012 -2021 -33641 -66559 -58895 -55016 30988 92127
14024I2127k871M61M10k4743q0400m6060l2108K1642Q832O1138J5513q272k3902
$$ 92127 89256 89717 90127 65384 -15016 -61076 -93184 -71542 -62710 -1572 13941 5669 -18233
14011a8233k7303m848R697l3472k3738M3324N8915l414l4442k3801j8955L2040
$$ -18233 -45536 -50384 -40687 -74159 -97897 -54573 4342 928 -33514 -57315 -76270 -44230
13999d4230J9958K0952j0978k2962q4972l9076m5364N1073P6229O1774Q356J6663
$$ -44230 -24272 -3320 -14298 -37260 -122232 -161308 -206672 -155599 -79370 -17596 -9240 7423
13987G423J7239M4638L8655l4002j3329j4342M2144N4511m6435l1107K8108n432
$$ 7423 24662 69300 107955 73953 60624 46282 88426 142937 96502 65395 93503 88071
13975H8071P929L852L030k7767J859k8437n3888n2207n7536K282L533L1158L6144
$$ 88071 96000 99852 102882 75115 76974 48537 -5351 -57558 -115094 -112812 -109279 -78121 -41977
13962d1977J3252p585L2873P65m5485L651L8014N9476O2855K6981j5484m0384
$$ -41977 -28725 -36310 -3437 -2672 -48157 -44506 -6492 52984 115839 142820 127336 86952
13950H6952j8993J7342r951k3030K946o1228m2351m546L4156L4111L3061K5052
$$ 86952 67959 85301 75350 52320 55266 -5962 -48313 -52859 -18703 15408 48469 73521
13938G3521L2792k5114k3069l0550j2627k6987j0589O160n456k9586Q635M0739
$$ 73521 106313 81199 58130 27580 14953 -12034 -22623 -16463 -21919 -51505 -42870 -2131
13926b131N8091L4245O5062m301q4744o4688K3709K5171J7739j2622R866q818
$$ -2131 55960 90205 155267 150966 66222 1534 25243 50414 68153 55531 65397 56579
13914E6579o2162n613K862m1990l795J8724L1625M7606K1735k5608L3888K8726
$$ 56579 -5583 -11196 -8334 -50324 -54119 -35395 -3770 43836 65571 39963 73851 102577
13902A02577O33q0829m8748l9605Q786P6885J5084m8910K4204K4235k9763k4239
$$ 102577 103210 22381 -26367 -65972 -57186 19699 34783 -14127 10077 34312 4549 -19690
13890a9690Q822k826N3737n711l2035J4022L3281p8206n2763M7347K7333p8548
$$ -19690 -10868 -13694 40043 34332 2297 16319 49600 -28606 -81369 -34022 -6689 -85237
13878h5237L247M4246K3426O7962P2062l126l2090N6284J9830k8436k4855k7096
$$ -85237 -81990 -37744 -14318 53644 125706 122580 90490 146774 166604 138168 113313 86217
13866H6217m5014l1498J4975K0488P244j2297k8568L4469R427k0234k5268L0384
$$ 86217 41203 9705 24680 45168 52412 40115 11547 46016 55443 35209 9941 40325
13854D0325J6071j7263n0791q134k2188J0994J4815L1433j4617L5381M4672l9358
$$ 40325 56396 39133 -11658 -19792 -41980 -30986 -16171 15262 645 36026 80698 41340
13842D1340l8479k0173k9680J1139P7167K5094n019j5358J1392J379p2557J0573
$$ 41340 2861 -17312 -46992 -35853 41314 66408 61389 46031 57423 58802 -13755 -3182
13830c182R805J7995L3569J5420L1350k5629l2278j2147k7619m0850M9469j4325
$$ -3182 6623 24618 58187 73607 104957 79328 47050 34903 7284 -33566 15903 1578
13818A578r164N3013J7033m1273n0524O346J0177N366j0710O586P813J7147P038
$$ 1578 -7586 45427 62460 21187 -29337 -22991 -12814 -7448 -18158 -11572 -3759 13388 20426
13805B0426l2621O931J440R918K283j9364L1122k2855J7078J1546m1959J702M6142
$$ 20426 -12195 -5264 -3824 6094 8377 -10987 20135 -2720 14358 25904 -16055 -14353 31789
13792C1789n758R443L1158j037k1569R49J5437O6942n9784n9215m7070k6344r856
$$ 31789 26031 35474 66632 65595 44026 44975 60412 127354 67570 8355 -38715 -65059 -74915
13779g4915k3492r488O5559Q1205O302l707r09n197l9363k7835K487Q645K3383
$$ -74915 -98407 -107895 -42336 38869 45171 41464 40555 35358 -4005 -31840 -29353 -20708 2675
13766B675M0266l5674m1909K179N896j0823l6493j8314L6708M9040K8087M216
$$ 2675 42941 7267 -34642 -32463 -26567 -37390 -73883 -92197 -55489 -6449 21638 25854
13754B5854L928k500k1243L1909j4085k3662J658N4536l1705l4293m7303J3039
$$ 25854 29782 27282 6039 37948 23863 201 1859 56395 24690 -9603 -56906 -43867
13742d3867O4340j6678n8849L3629M6985J0413p24l3969J6653j5847K8810j6157
$$ -43867 20473 3795 -55054 -21425 25560 35973 35249 1280 17933 2086 30896 14739
13730A4739l2135o247N587R254L4940J1873j0050J0780K4322k831j7987m9140
$$ 14739 -17396 -23643 -18056 -8802 26138 38011 27961 38741 63063 60232 42245 -6895
13718f895k3817M5983M4557K2871o8974l6064J5470r936k6868m1185N892q214
$$ -6895 -30712 15271 59828 82699 13725 -22339 -6869 -16805 -43673 -84858 -78966 -87180
13706h7180J9309K8381k9818k9483L7733O0806J3564q516m5172j0587L2243l5289
$$ -87180 -67871 -39490 -69308 -98791 -61058 -252 13312 4796 -40376 -50963 -18720 -54009
13694e4009L2813J7564j3257L2512k901k3729l181K3479L4065J1521O383l8094
$$ -54009 -21196 -3632 -16889 15623 12722 -11007 -14188 9291 43356 54877 61260 23166
13682B3166O3569N9213j876l9746p0356l5221M483K8238O8508J4416m0397n8873
$$ 23166 86735 145948 144072 104326 33970 -1251 3232 31470 99978 114394 73997 15124
13670A5124J4153N1051J833p2354K7403K1107m9533k3194j5066K47l6027j2887
$$ 15124 29277 80328 82161 9807 37210 58317 8784 -14410 -29476 -29229 -65256 -78143
13658g8143Q7099J3411J8311J0827l6424N4537k6274k5407k5612k8744k0491k322
$$ -78143 8956 22367 40678 51505 15081 69618 43344 17937 -7675 -36419 -56910 -59232
13646e9232J6995M6883m287J9261n428J7960J0825l4050k3515k0186L2921K7895
$$ -59232 -42237 4646 359 19620 14192 32152 42977 8927 -14588 -34774 -1853 26042
13634B6042k386m9429P256n125L3866K1443p854n887q671k3929o2519q153O8455
$$ 26042 23656 -25773 -18517 -23642 10224 31667 23813 17926 9255 -14674 -77193 -85346 -16891
13621a6891M4708l975J4641Q163M9109p9469n8116M8103n24j7989n823K2833Q550
$$ -16891 27817 23842 38483 46646 95755 16286 -41830 6273 5749 -12240 -18063 4770 13320
13608A3320j3038J9703M6291m0835j2444n2835r925M1261l457m0964N028K7392
$$ 13320 282 19985 66276 25441 12997 -39838 -49763 -8502 -11959 -52923 -47895 -20503
13596b0503q7020q604K0981j1907J0449J9231M88J4358O7948P222J9032K1821
$$ -20503 -107523 -116127 -95146 -107053 -96604 -77373 -76885 -62527 5421 12643 31675 53496
13584E3496J3521j1020J8603K8395m5720m7281K2945M900j0732L704k41n564N350
$$ 53496 67017 55997 74600 102995 57275 9994 32939 37839 27107 30811 30570 25006 30356
13571C0356j5776m3787l0441J9904j5868J7653K3094O4235L8294l8310o024j7900
$$ 30356 14580 -29207 -59648 -39744 -55612 -37959 -14865 49370 87664 49354 43330 25430
13559B5430j0883O649p1490m7833N5938K8732j7358L4252J3543l0553k2877N0293
$$ 25430 14547 21196 -50294 -98127 -42189 -13457 -30815 3437 16980 -13573 -36450 13843
13547A3843Q0669k2573o4379m9465l657R226K1845j2250P00J3329L3837K6953
$$ 13843 94512 71939 7560 -41905 -45562 -36336 -14491 -26741 -26041 -12712 21125 48078
13535D8078j1818m9893j7300q35p402k989M1903J7605L4659L975J5026O552k6155
$$ 48078 36260 -13633 -30933 -31768 -39170 -42159 -256 17349 52008 55983 71009 77561 51406
13522E1406n4604k8077P042K7005K4160k443j575m5518o6921n247K9824N6025
$$ 51406 -3198 -31275 -24233 2772 26932 24489 22914 -22604 -89525 -94772 -64948 -8923
13510h923N034k1941L6518M5469j0598j1545m2735m437r531l6523L7173N6455
$$ -8923 -3889 -25830 10688 56157 45559 34014 -8721 -13158 -22689 -59212 -22039 34416
13498C4416J9197j096o84k9494o2121j4948j9453N7557J3515j7949J4259J2591
$$ 34416 53613 52517 51833 22339 -39782 -54730 -74183 -16626 -3111 -21060 -6801 5790
13486E790J2862L6720J0878M660k1819q891N9995N7616k1814m7810l4160l2632
$$ 5790 18652 55372 66250 70910 49091 40200 100195 157811 135997 88187 54027 21395
13474B1395m4317n180L5656K3210m948J2688k8882j8089M010l0498j4150L5526
$$ 21395 -22922 -28102 7554 30764 25816 38504 9622 -8467 -4457 -34955 -49105 -13579
13462a3579m7107k4389L6422J6027M8358M2455K8307j02940o9929L225J2709O596
$$ -13579 -60686 -85075 -48653 -32626 15732 58187 86494 -16446 -86375 -83150 -70441 -63845
13450f3845J6676N1379j6792l8129m160j0199J3305J4270K587J5636k4510O898
$$ -63845 -47169 4210 -12582 -50711 -54871 -65070 -51765 -37495 -34908 -19272 -43782 -36884
13438c6884l2360n6427L7200O7306k5268K2614M1471M5470l0356p966m8518j3118
$$ -36884 -69244 -125671 -88471 -21165 -46433 -23819 17652 63122 32766 24800 -23718 -36836
13426c6836K196j1366j2494L7776K7434K416o217l5184L420n0208P0312P3418
$$ -36836 -34640 -46006 -58500 -20724 6710 9126 2909 -32275 -28855 -79063 -8751 64667
13414F4667J6002l925l7309k0818K2908k979J3829n170j2554K8466j0597n0673
$$ 64667 80669 76744 39435 18617 41525 38546 52375 47205 34651 63117 52520 1847
13402A847q053K5901K0090m8403l6460j2672J1224R956N5349J12078m066p2714
$$ 1847 -6206 19695 39785 -8618 -45078 -57750 -46526 -36570 18779 130857 126791 54077
13390E4077Q92J1880k7160l1847n5723p383R597M9412m836P273m113q0274m3690
$$ 54077 54969 66849 39689 7842 -47881 -55264 -45667 3745 -1091 6182 2069 -78205 -121895
13377a21895N1384L7130L1401L0940m597m2238l1085L2419L2739j8857K9584M0462
$$ -121895 -70511 -33381 -1980 28960 24363 -17875 -48960 -16541 16198 -2659 26925 67387
13365F7387o8094O10O721j918J7561J2918k9255L341m9700J6447L0400L927p79
$$ 67387 -707 -97 6624 4706 22267 35185 5930 9271 -40429 -23982 6418 10345 9566
13352I566M2006m5286m7660K3914M5704P518l2825m7026k4645J1743J4427P291
$$ 9566 51572 6286 -41374 -17460 28244 35762 2937 -44089 -68734 -56991 -42564 -35273
13340c5273O727N5780R6446j3591j8084k0244j9903L0963K9815N6242l0815r2796
$$ -35273 -28546 27234 123680 110089 92005 71761 51858 82821 112636 168878 138063 45267
13328D5267p7283o682O7180Q406n2969K8973k0793m6963j099k5479k9349j8546
$$ 45267 -32016 -38698 28482 36888 -16081 12892 -7901 -54864 -55963 -81442 -110791 -129337
13316a29337L4809M9691Q651M6401K1627k4218q498o4743q381J7212L7529k4441
$$ -129337 -94528 -44837 -36186 10215 31842 7624 -874 -65617 -73998 -56786 -19257 -43698
13304d3698j205o688j516j3580K6501L2250L9020l0672l0155j9124R480j3318
$$ -43698 -44903 -51591 -53107 -66687 -40186 -7936 31084 412 -29743 -48867 -39387 -52705
13292e2705L0709K8468l4696n030L9964j5934N150j5023P925J0267l2782m8431
$$ -52705 -21996 6472 -28224 -33254 6710 -9224 -4074 -19097 -11172 -905 -33687 -82118
13280h2118m2854M1068J9139P566K2410J3308j1070m0897j2654K7799J6096J1786
$$ -82118 -124972 -83904 -64765 -57199 -34789 -21481 -32551 -73448 -86102 -58303 -42207 -30421
13268c0421n8764k4649L513K2682k1645K4198K9536O9041J324k4834j7691l6036
$$ -30421 -89185 -113834 -110321 -87639 -109284 -85086 -55550 13491 14815 -10019 -27710 -63746
13256f3746K9648J0306n1991L7351J6670K2703q113o936n837k3054r887J5572
$$ -63746 -34098 -23792 -75783 -38432 -21762 941 -7172 -14108 -19945 -42999 -52886 -37314
13244c7314J9564K678n9431N8110K5051k5355K3213M1629K7291j687L8269K7588
$$ -37314 -17750 -15072 -74503 -16393 8658 -16697 6516 48145 75436 73749 112018 139606
13232A39606p0523j9850L2624L6972o6979J8319j1609k8804R230k7968j5881K1611
$$ 139606 69083 49233 81857 118829 51850 70169 58560 29756 38986 11018 -4863 16748
13220A6748j9981N154N232K1018N4979L0467l6844o6776o3355R530k2605K5820
$$ 16748 -3233 1921 7153 28171 83150 113617 76773 9997 -53358 -43828 -66433 -40613
13208d0613Q9874L2144l8228l2854l113L1061r599k2691k8699L2899O9348O922
$$ -40613 49261 81405 43177 10323 7210 38271 28672 5981 -22718 10181 79529 86451
13196H6451L8281Q211l7073o255n7819j00957J6687P3067J3148j102k6142L648
$$ 86451 124732 132943 95870 89615 31796 -69161 -52474 20593 33741 32639 6497 10145
13184A0145M6754l278q4904j2228j8631l900j1684K5646M5129J8200K7574R637
$$ 10145 56899 53621 -31283 -43511 -62142 -66042 -77726 -52080 -6951 11249 38823 48460
13172D8460k2895n3201J224L6223k697m2912k0230N686L4469M0029N425l5801
$$ 48460 25565 -27636 -26412 9811 7114 -35798 -56028 -50342 -15873 24156 29581 -6220
13160f220J9503N8180J0226l4286m9449j7485J1252M2995k4227o000n0106l8722
$$ -6220 13283 71463 81689 47403 -2046 -19531 -8279 34716 10489 4489 -45617 -84339
13148h4339M3239L8052N9678P473n807k7484K6888k3632k1422k2442k8582J00663
$$ -84339 -41100 -3048 56630 64103 58296 30812 57700 34068 12646 -9796 -38378 62285
13136F2285N1573r6003L8425k0700k6697j6092O7934O828l2907J5682L7382r962
$$ 62285 113858 17855 56280 35580 8883 -7209 60725 67553 34646 50328 87710 77748
13124G7748m0862L0419K0026n417k2597j8318j5007r129L613K7136l8932o3004
$$ 77748 36886 67305 87331 81914 59317 40999 25992 16863 20476 47612 8680 -54324
13112e4324q2126K5790Q9935L2719M729K3128L048P871J0116l5038O406N1658
$$ -54324 -136450 -110660 -20725 11994 16723 39851 42899 50770 60886 25848 32254 83912
13100H3912L9560l9421m7834m9701L4844J1613J7970L8970K887l4424m0191j6555
$$ 83912 123472 84051 36217 -13484 21360 32973 50943 89913 92800 58376 18185 1630
13088A630l744J0675Q610m0621n9040l0040M35Q123K8835N1471k2716K8412J9218
$$ 1630 -2114 8561 17171 -23450 -82490 -112530 -112095 -103972 -75137 -23666 -46382 -17970 1248
13075A248M039j522n780j6114j6796R843j4486K456J028J9053p584J1446J128
$$ 1248 5287 3765 -2015 -18129 -34925 -25082 -39568 -37112 -36084 -17031 -24615 -13169 -12041
13062a2041O265K7663K0807o4621k8851L6860j2964r157J4684p376l164J5444
$$ -12041 -5776 21887 42694 -21927 -50778 -13918 -26882 -36039 -21355 -28731 -31895 -16451
13050a6451j6512P786k5811Q1192L4798n6874k8424j5323l1203j1839K1067O8659
$$ -16451 -32963 -25177 -50988 30204 65002 8128 -20296 -35619 -66822 -78661 -57594 11065
13038A1065K3677J0730j1892l3677k5458P523J5275J5076l5016j6406k1308p6816
$$ 11065 34742 45472 33580 -97 -25555 -18032 -2757 12319 -22697 -39103 -60411 -137227
13026a37227J191J7144k356P491J05937K7955l5765j4130k2236k5370k4462m2642
$$ -137227 -136036 -118892 -121248 -113757 -7820 20135 -15630 -29760 -51996 -77366 -101828 -144470
13014a44470O2439K3652q092K6947k716R065n975K4884P45k2060M0375k643m7368
$$ -144470 -82031 -58379 -66471 -39524 -42240 -33175 -39150 -14266 -13521 -35581 4794 2151 -45217
13001d5217R827k0477J1685N6139J2938j2587K5739J4946M7869l5723L2286R637
$$ -45217 -35390 -55867 -44182 11957 24895 12308 38047 52993 100862 65139 97425 107062
12989A07062l8521k0703J677m6481j5256K0555k7907n1537p2969K5437K5257n783
$$ 107062 68541 47838 49515 3034 -12222 8333 -19574 -71111 -144080 -118643 -93386 -99169
12977i9169O3645N8491o331P91K9153J4224L0432j6913l9441M1000j320m8445
$$ -99169 -35524 22967 16636 17427 46580 60804 91236 74323 34882 75882 74562 26117
12965B6117J9935N7710J2724k2499m1882l6654l527J9883K4047n893m7642m3823
$$ 26117 46052 103762 116486 93987 52105 15451 11924 31807 55854 49961 2319 -41504
12953d1504j0970j7603K1963p505J0967M332q326m0768k4230L9453M2020k5798
$$ -41504 -52474 -70077 -48114 -55619 -44652 -40320 -48646 -89414 -113644 -74191 -32171 -57969
12941e7969j958N0820M826m2252j7931P1603O2270p32m7674p878k6136J5332L9375
$$ -57969 -59927 -9107 -4281 -46533 -64464 7139 69409 68677 21003 13125 -13011 2321 41696
12928D1696q151L96j8883j1832K1949m0850k3531L8669O527J5514j8445r832j4010
$$ 41696 33545 33941 15058 3226 25175 -15675 -39206 -537 5990 21504 3059 -6773 -20783
12915b0783J3956j2795R635K8473k5694m8597n6049O3453O6984L2304J6882n4510
$$ -20783 -6827 -19622 -9987 18486 -7208 -55805 -111854 -48401 18583 50887 67769 13259
12903A3259n4314P6395N5033l6807l048o030O820K0010m9849m6413L0134K5203
$$ 13259 -41055 35340 90373 53566 50518 44488 51308 71318 21469 -24944 5190 30393
12891C0393k1408K2155j2111l6492p710R442K9902L3546K7350j727K6141p42n0799
$$ 30393 8985 31140 19029 -17463 -25173 -15731 14171 47717 75067 73340 99481 98739 47940
12878D7940j6731J5529J2280K270n1388J6223J4391L6330k776n625k9348n0852
$$ 47940 31209 46738 59018 61288 9900 26123 40514 76844 74068 68443 39095 -11757
12866a1757M6899N7711l8720p0229M3361j0404m598J0300n6114j3403N2615o488
$$ -11757 35142 92853 54133 -16096 27265 16861 12263 22563 -33551 -46954 5661 -827
12854h27k8377J3582M3308K4833L6863L7883n2112n20n666j8763m2112K3775K0215
$$ -827 -29204 -15622 27686 52519 89382 127265 75153 74633 68967 50204 8092 31867 52082
12841E2082k3834J0652J6529L4562m2355n7367k171j7367j2876P060M2825j1352
$$ 52082 28248 38900 55429 89991 47636 -9731 -11902 -29269 -42145 -35085 7740 -3612
12829c612m6497M9142O0870J6528l8540m6142l1898L0513j9191K7130K7565j0960
$$ -3612 -50109 -967 59903 76431 37891 -8251 -40149 -9636 -28827 -1697 25868 14908
12817A4908K7275K184k1488n4959n9187P0975L9718k3484j5717l5574p364L6435
$$ 14908 42183 44367 22879 -32080 -91267 -20292 19426 -4058 -19775 -55349 -62713 -26278
12805b6278k9836l9273N8052N8702j0754m3954l8947j6853J0196o268M1171L5187
$$ -26278 -56114 -95387 -37335 21367 10613 -33341 -72288 -89141 -78945 -85213 -44042 -8855
12793h855m3693j3326J6620M3757L5925n88p304J6202J3798k0230k6017K6024
$$ -8855 -52548 -65874 -49254 -5497 30428 29840 22536 38738 52536 32306 6289 32313
12781C2313O339m1353l5532j5443J111N7217n4280l6105M9980L8994L401P063
$$ 32313 38652 -2701 -38233 -53676 -52565 4652 -49628 -85733 -35753 3241 6642 13705
12769A3705l123r466J9701P864J7848l1398l8514p886p575K0181l2117J7492K6628
$$ 13705 10582 1116 20817 28681 46529 15131 -23383 -31269 -38844 -18663 -50780 -33288 -6660
12756f660l2376K9138J1234L8922K5412k852k3520K7449J6764m9420l240K6282
$$ -6660 -39036 -9898 1336 40258 65670 62818 39298 66747 83511 34091 30851 57133
12744E7133n4719m4739j2522O3869P9581q603m8589k0988K7297k5026L2779L5349
$$ 57133 2414 -42325 -54847 9022 88603 80000 31411 10423 37720 12694 45473 80822
12732H0822k7717l2463k1571l6730k0206L0014n4391M7348K3275O67L4622j3930
$$ 80822 53105 20642 -929 -37659 -57865 -27851 -82242 -34894 -11619 -10952 23670 9740
12720I740k6387k5788n6641P896O4567M5881m4600p293J7671L2465n6028j6215
$$ 9740 -16647 -42435 -99076 -91180 -26613 19268 -25332 -32625 -14954 17511 -38517 -54732
12708e4732J5288O483j834N580J4157J6285P63n9695k904R3952N1839m6308n1281
$$ -54732 -39444 -32961 -34795 -29215 -15058 1227 1990 -57705 -60609 33343 85182 38874 -12407
12695a2407K0734K8863M9348k0696l6039j9952k8522k7690m198k0l818M9952L3180
$$ -12407 8327 37190 86538 65842 29803 9851 -18671 -46361 -50559 -50579 -54397 -4445 28735
12682B8735j6114J066k4109J160K6931j8710P815K5197Q3475L1272l6912k3431
$$ 28735 12621 13687 -10422 -9262 17669 -1041 6774 31971 115446 146718 109806 86375
12670H6375o4129q276k6261O25j1993k1580J9113j5050J8591M0158j5857k9455
$$ 86375 22246 13970 -12291 -11666 -23659 -45239 -26126 -41176 -22585 17573 1716 -27739
12658b7739M5358L5768M512m7771l6912J2573l332J6441L1141m4958p8591m4076
$$ -27739 17619 53387 57899 10128 -26784 -14211 -17543 -1102 30039 -14919 -93510 -137586
12646a37586J06461R1392K965J8457K9828p0118n4915l9385M3937K7495m6918
$$ -137586 -31125 60267 63232 81689 111517 41399 -13516 -52901 -8964 18531 -28387
12635b8387l8073K5980K4745j3975M5019J4092J1796L0853k4575k1226K5263K3918
$$ -28387 -66460 -40480 -15735 -29710 15309 29401 41197 72050 47475 26249 51512 75430
12623G5430K1787j8778k8876k774J0134m5214k8703Q344N9977j4936n2392j2601
$$ 75430 97217 78439 49563 46789 56923 11709 -16994 -8650 51327 36391 -16001 -28602
12611b8602k2723R542m680M264j7302j4591L3304K1251n5608j8321L1810N4322
$$ -28602 -51325 -41783 -46463 -42199 -59501 -74092 -40788 -19537 -75145 -93466 -61656 -7334
12599g334l0157k9912J0473K5112L4818j7293J0469q479o47k2379o311J0319L73
$$ -7334 -37491 -67403 -56930 -31818 3000 -14293 -3824 -12303 -12950 -35329 -41640 -31321 -30948
12586c0948K6o4561k6941M8104k1648O524O4186Q5649l7591l2563m2467m8065
$$ -30948 -30922 -95483 -122424 -74320 -95968 -89444 -25258 60391 22800 -9763 -52230 -100295
12574a00295q870N2729j5873j5058L7958L2853O5114J4236n787J160J1217J3493
$$ -100295 -109165 -56436 -72309 -87367 -49409 -16556 48558 62794 57007 58167 69384 82877
12562H2877k4197l8391l0282o256J1823L1730n0589L1963M6345J3523j4740l3193
$$ 82877 58680 20289 -9993 -16249 -4426 27304 -23285 8678 55023 68546 53806 20613
12550B0613l514l176M505K549M82m6571O406l3128n3403L6187K9199l2478K2547
$$ 20613 17099 13923 18428 20977 21459 -25112 -18706 -51834 -105237 -69050 -39851 -72329 -49782
12537d9782K7430L5772L4596k020p5335K1429Q0746j9787k9406M3583l1214m4818
$$ -49782 -22352 13420 48016 45996 -29339 -7910 72836 53049 23643 67226 36012 -8806
12525h806J3233R257P950l7272K2964K5049p3769m4936M4313L0275m015l079J505
$$ -8806 4427 13684 21634 -15638 7326 32375 -41394 -86330 -42017 -11742 -15757 -18836 -17331
12512a7331k4412j6849K9012M5269L3411j5729r239k4861n4031p089M959K9890
$$ -17331 -41743 -58592 -29580 15689 49100 33371 24132 -729 -54760 -61849 -56890 -27000
12500b7000J0408L6404K1143J9698J5567m949j2712j8128j5834m6937m9748L7112
$$ -27000 -16592 19812 40955 60653 76220 71271 58559 40431 24597 -22340 -72088 -34976
12488c4976k2997K9697J8762M190j0894J6258O5597K4585l7621q8717n3652L4812
$$ -34976 -57973 -28276 -9514 -5324 -16218 40 65637 90222 52601 -36116 -89768 -54956
12476e4956K674m3814M6001K6730P796M523k2952m681M3562k3160m9934N1964
$$ -54956 -52282 -96096 -50095 -23365 -15569 -11046 -33998 -38679 4883 -18277 -68211 -16247
12464a6247J06877j0997o6084L4574J9291j2789l7163k2779J9143L0191l4025
$$ -16247 90630 79633 13549 48123 67414 54625 17462 -5317 13826 44017 9992
12453I992m6171M782Q338j4943J4705Q449n4795j3156J2629M7953O7752O9930
$$ 9992 -36179 -31397 -23059 -38002 -23297 -14848 -69643 -82799 -70170 -22217 45535 115465
12441A15465p513j6319m2941j5158j962K5848n635o1673j8786L561k663J555M6351
$$ 115465 107952 91633 48692 33534 31572 57420 51785 -9888 -28674 -25113 -27776 -26221 20130
12428B0130Q1552q97m2641m2540P8236m3981k6380K659p888J920K2397K5955K447
$$ 20130 101682 100785 58144 15604 93840 49859 23479 26138 18250 20170 42567 68522 70969
12415G0969m2903j6947N7948M1747o429o9172k0371j2738J9604J6261M8508M6902
$$ 70969 28066 11119 69067 110814 104385 35213 14842 2104 21708 37969 86477 133379
12403A33379m5554k4942R4901J134k0342K426M9350m1179L476M3534J4821K6432
$$ 133379 87825 62883 157784 158918 138576 141002 190352 149173 152649 196183 211004 237436
12391B37436J8731L8227N8348K6120k2350j8106k2045l4823j02503m6204j6101
$$ 237436 256167 294394 352742 378862 356512 338406 316361 281538 179035 132831 116730
12380A16730r19K4189j0519J0796j6405k56O4582l9164q1819n9073l1107M3346
$$ 116730 115811 140000 129481 140277 123872 123616 188198 149034 67215 8142 -22965 20381
12368B0381K8559l1199N720J7340l9293J4354l3034m3467j1941P1517R7757N9751
$$ 20381 48940 17741 23461 40801 1508 15862 -17172 -60639 -72580 -1063 96694 156445
12356A56445n8950m6166l1793k4776P403p766K5114K0355n9326m8959M8206O4985
$$ 156445 97495 51329 19536 -5240 2163 -5603 19511 39866 -19460 -68419 -20213 44772
12344D4772k241n1537L1588K3700R100M219k8115j1840O4801N6287l4187j8505
$$ 44772 42531 -9006 22582 46282 55382 59601 31486 19646 84447 140734 106547 88042
12332H8042m5977l8046J5818L7978k8609l9691L1278J032r998L433M6382q911
$$ 88042 42065 4019 19837 57815 29206 -10485 20793 21825 11827 15260 61642 52731
12320E2731K5366L0963j2550p0112k2973o7321j9666J4407N5080K8126L1694k8038
$$ 52731 78097 109060 96510 26398 3425 -63896 -83562 -69155 -14075 14051 45745 17707
12308A7707k9766L1902Q641L3131k7640l2163k1558R737M3648m4768m3499k6570
$$ 17707 -12059 19843 28484 61615 33975 1812 -19746 -10009 33639 -11129 -54628 -81198
12296h1198K1164M5893L0516n5404Q906o5237o04J2821J0917L3466P873k8596
$$ -81198 -60034 -14141 16375 -39029 -30123 -95360 -95964 -83143 -72226 -38760 -30887 -59483
12284e9483J8432O8920R743K0833Q216k7818n8392j9426j3237L1072m501J6812
$$ -59483 -41051 27869 37612 58445 66661 38843 -19549 -38975 -52212 -21140 -25641 -8829
12272h829J4503J3730M065m3294J996K8294l2600o278l0575l0086L2546J0594
$$ -8829 5674 19404 23469 -19825 -17829 10465 -22135 -28413 -58988 -89074 -56528 -45934
12260d5934P4047N0084O724p8581l269P901J5954K2352o687O609K1602K8710J7743
$$ -45934 28113 78197 84921 6340 3071 10972 26926 49278 42591 49200 70802 99512 117255
12247A17255k9777j04830L314J1541K4686P8147m4652p6224L2627l3048k7414
$$ 117255 87478 -17352 -14038 -2497 22189 100336 55684 -20540 12087 -20961 -48375
12236d8375R579j304K52L1445M5025M9864m3124m8013R777L7876m3032J4473K7754
$$ -48375 -38796 -40100 -39848 -8403 36622 86486 43362 -4651 5126 43002 -30 14443 42197
12223D2197n983K4116J7852l3267o111j763n2748M337k2657M4591M9858O67L417
$$ 42197 36214 60330 78182 44915 38804 37041 -15707 -11370 -34027 10564 60422 61089 64506
12210F4506l4027m1741n334r810N8549K9354L9077L5023l6804n1975l8724K8119
$$ 64506 30479 -11262 -16596 -26406 32143 61497 100574 135597 98793 46818 8094 36213
12198C6213J2012o360J3083K2500l0288o2618n0467p0618R0259N0454P161M945
$$ 36213 48225 41865 54948 77448 47160 -15458 -65925 -136543 -46284 4170 11331 16276
12186A6276j6562J4956l5918l3804k2849j0894k1114L7344J5140K7270J88J8556
$$ 16276 -286 14670 -21248 -55052 -77901 -88795 -109909 -72565 -57425 -30155 -29967 -11411
12174a1411P944O328M1147j9718q3635j848J4789J8048K8896J7208n6503o4726
$$ -11411 -3467 2861 44008 24290 -59345 -61193 -46404 -28356 540 17748 -38755 -103481
12162a03481K7817K9853k6535J0573Q4999K5798L9979J10m4346l3709Q098j4290
$$ -103481 -75664 -45811 -72346 -61773 23226 49024 89003 89113 44767 11058 19156 4866
12150D866P401P2971n553J6719N1069j2708j04212j8719o638l3748l2989K7176
$$ 4866 12267 85238 79685 96404 147473 134765 30553 11834 5196 -28552 -61541 -34365
12138c4365J380j4909J3327P4061K0845l8112J086k3242j7912j5234j8628N794
$$ -34365 -32985 -47894 -34567 39494 60339 22227 23313 71 -17841 -33075 -51703 -45909
12126d5909J8647M5010K0010j5735K4121J4608o393k6998m4143J0146J3208j3148
$$ -45909 -27262 17748 37758 22023 46144 60752 54359 27361 -16782 -6636 6572 -6576
12114f576J4344Q127j9393k3493J5214L2467j4293m6496q357j080k2599J7635
$$ -6576 7768 15895 -3498 -26991 -11777 20690 6397 -40099 -48456 -49536 -72135 -54500
12102e4500J9079J1190l3287p3039k3325M1194J2320L8012Q1878R485l7899k3185
$$ -54500 -35421 -24231 -57518 -130557 -153882 -112688 -100368 -62356 19522 29007 -8892 -32077
12090c2077K9136J986l71k9665j1292m257n022L3774l7098j475R506N063m3841
$$ -32077 -2941 -955 -1326 -30991 -42283 -46540 -51562 -17788 -54886 -56361 -46855 -41792 -85633
12077h5633K2086N5771m451j4817j8703k0830k9530j9641r502J263L3908N3613
$$ -85633 -63547 -7776 -12227 -27044 -45747 -66577 -96107 -115748 -125250 -123987 -90079 -36466
12065c6466J0199l9447L0119K9801M7476L4478l6761o6701l1076j9658K992n4660
$$ -36466 -26267 -65714 -35595 -5794 41682 76160 39399 -27302 -58378 -78036 -75044 -129704
12053a29704m234M8649Q1045L6825J4915j9771K2314j7869M7317J3047m5560P98
$$ -129704 -133938 -85289 -4244 32581 47496 27725 50039 32170 79487 92534 46974 47772
12041D7772j4623L3490J5290K148j3256K4061l4204j7027L0515J8388k1674m2631
$$ 47772 33149 66639 81929 84077 70821 94882 60678 43651 74166 92554 70880 28249
12029B8249o5888m4464J4350K8159L0884M0205P1033K008k9545o7116q1460j1457
$$ 28249 -37639 -82103 -67753 -39594 -8710 31495 102528 104536 74991 7875 -73585 -85042
12017h5042O6387Q121M37q16M0259N560M8220L447l1467L4674K2739l8720q5316
$$ -85042 -18655 -10534 -10097 -10913 29346 34906 83126 86573 55106 89780 112519 73799 -11517
12004a1517m5512k2999j5942l182N4972N6490J6661L9261K9245R069m9573n5536
$$ -11517 -57029 -80028 -95970 -99152 -44180 12310 28971 68232 97477 106546 56973 1437
11992A437r368j2868j7235J2077P9017j8057l7848O314J7689k7366l8368J5053
$$ 1437 -7931 -20799 -38034 -25957 53060 35003 -2845 3469 21158 -6208 -44576 -29523
11980b9523Q683n5408n568P5618J2485K9568R735N0526j5803o5161k1728N0301
$$ -29523 -20840 -76248 -81816 -6198 6287 35855 45590 96116 80313 15152 -6576 43725
11968D3725M016P306K6249r841j6021l5319m6227M8353K3275J0142k4344p3137
$$ 43725 47741 55047 81296 71455 55434 20115 -26112 22241 45516 55658 31314 -41823
11956d1823l1797l1892j307O713N1514L7027L7169L5619J0333J8849l3084k4104
$$ -41823 -73620 -105512 -106819 -100106 -48592 -11565 25604 61223 71556 90405 57321 33217
11944C3217M02m6812k0047J1706j3329L0091L8717K6303Q156K4427m253K5373
$$ 33217 33619 -13193 -33240 -21534 -34863 -4772 33945 60248 68404 92831 88578 113951
11932A13951n9216o5965J5817P2755K0520j3663o4121n69k611k7031p54r265P906
$$ 113951 54735 -11230 4587 77342 97862 84199 20078 19509 16898 -10133 -10887 -20152 -12246
11919a2246N1806P7576R600m4313o0908K6537L1810k2242m1435m1075J020j8423
$$ -12246 39560 117136 126736 82423 21515 48052 79862 57620 16185 -24890 -23870 -42293
11907d2293J7918K0104O214l593O6411J0976k7525l9683l0734j1891j3800R062
$$ -42293 -24375 -4271 1943 -1650 64761 75737 48212 8529 -22205 -34096 -47896 -38834
11895c8834K6411K9457J8947P07M198K4885k3276k5118J1039J240j3445K7588
$$ -38834 -12423 17034 35981 36688 40886 65771 42495 17377 28416 29656 16211 43799
11883D3799M7989l6228k4463j9733j8161L1627J1830k5881m1094J2702Q235l268
$$ 43799 91788 55560 31097 11364 -6797 24830 36660 10779 -30315 -17613 -9378 -12646
11871a2646l8994O1395O0434q295p0433k9684L0115k1158k3583L013K0829L3845
$$ -12646 -51640 9755 70189 61894 -8539 -38223 -8108 -29266 -52849 -49836 -29007 4838
11859D838J5566l314j3522J7819j9407o1992j7952L4673l2658J5725O6142J5326
$$ 4838 20404 17090 3568 21387 1980 -60012 -77964 -43291 -75949 -60224 5918 21244
11847B1244k6396k9700m5788O9792O9716N918k2013m8721k2604p990J2044n384
$$ 21244 -5152 -34852 -80640 -10848 58868 64786 42773 -5948 -28552 -36542 -24498 -29882
11835b9882J1270k1971o8457K9489N6561k8709j3099k1390j000j4496K3603N7378
$$ -29882 -18612 -40583 -109040 -79551 -22990 -51699 -64798 -86188 -87188 -101684 -78081 -20703
11823b0703n8112M074P2380K63K4378r75m1115k0018k4026j4902L8039K320L4035
$$ -20703 -78815 -74741 -2361 -2098 22280 21305 -19810 -39828 -63854 -78756 -40717 -38397 -4362
11810d362K5251j1332r524k8343K194J3060l3236R230N0692L3498m7445p4009
$$ -4362 20889 9557 33 -28310 -26116 -13056 -46292 -37062 13630 47128 -317 -74326
11798g4326K9321O243o303j5962k607Q8922j1161l5898J2176N393J242L279K6463
$$ -74326 -45005 -38762 -45065 -61027 -63634 25288 14127 -21771 -9595 -4202 -2960 319 26782
11785B6782N984m844l4544o598K2268k1089k2480K0472j565J3871J1403q120l0957
$$ 26782 32766 27922 -6622 -13220 9048 -12041 -34521 -14049 -15614 -1743 9660 1540 -29417
11772b9417j735l2409K5546L3740J3870M4788m2859j4721M7818K84P936J6147
$$ -29417 -31152 -63561 -38015 -4275 9595 54383 11524 -3197 44621 44905 52841 68988
11760F8988l5039k9067K2931n907l417r170j5201R491K7361K5678l1348m123m1263
$$ 68988 33949 4882 27813 21906 18489 9319 -5882 3609 30970 56648 25300 21177 -20086
11747b0086J8020j1138k2977j3771J2247K5797k5976L0511J8654L3042L732k235
$$ -20086 -2066 -13204 -36181 -49952 -37705 -11908 -37884 -7373 11281 44323 48055 45820
11735D5820j7928n2597m0667j3174l959l302K0745q50J4671N3257J4438m519j3394
$$ 45820 27892 -24705 -65372 -78546 -82505 -85807 -65062 -65912 -51241 2016 16454 11935 -1459
11722a459j4306J5600J5308o3024M3703K8125l1846j6449j924N4052N4865k8461
$$ -1459 -15765 -165 15143 -47881 -4178 23947 -7899 -24348 -26272 27780 82645 54184
11710E4184o1507J7957K8954k7252q0792j7211O537K0361J8971l39M3016k5162
$$ 54184 -7323 10634 39588 12336 -68456 -85667 -79130 -58769 -39798 -40137 2879 -22283
11698b2283o106k6221P827k0377M2665Q8614P731p5534m2859p874k8345Q4524
$$ -22283 -28389 -54610 -46783 -67160 -24495 64119 71850 -3684 -46543 -54417 -82762 1762
11686A762O202M0344k3527k1344l9084J3701J2385k4659j8340l1927L2915O7820
$$ 1762 7964 48308 24781 3437 -35647 -21946 -9561 -34220 -52560 -84487 -51572 16248
11674A6248Q0052j8293p5465J3506M8361k846J3096j2952l8450P428J493m6166
$$ 16248 96300 78007 2542 16048 64409 61563 74659 61707 23257 30685 32178 -13988
11662a3988l1798K8698O85j2021K8753j7243q092K9600N600m190l5k41J3979K73
$$ -13988 -45786 -17088 -16403 -28424 329 -16914 -25006 4594 10194 6004 5969 5728 19707 19980
11648A9980o347R080K6072j2077O395K9727k5416k0448m8423l4497K1207K7051
$$ 19980 13633 22713 48785 36708 43103 72830 47414 26966 -21457 -55954 -34747 -7696
11636g696J640o8776p889K7963L2446K3875l2672P039j989m260l4133K4044k0436
$$ -7696 -6056 -74832 -82721 -54758 -22312 1563 -31109 -24070 -26059 -30319 -64452 -40408 -60844
11623f0844o9977l4679O8836M5740O6556N8595K3844k0648o9066m8360j744L5505
$$ -60844 -130821 -165500 -96664 -50924 15632 74227 98071 77423 8357 -40003 -41747 -6242
11611f242Q708L7326M0568J3235j7141J1913R2737J4468n1097K4015j4567j21897
$$ -6242 2466 39792 80360 93595 76454 88367 181104 195572 144475 168490 153923 32026
11599C2026k2790L3107P234Q728k8730M8829L8063k3976j5974m445L97n876p953
$$ 32026 9236 42343 49577 58305 29575 78404 116467 92491 76517 72072 72469 66593 58640
11586E8640l8349J1557O5753M3361k4810m2124m5104k4072j6456l0986j3681j565
$$ 58640 20291 31848 97601 140962 116152 74028 28924 4852 -11604 -42590 -56271 -57836
11574e7836N8720M9850N1037Q202K0213j3466m8123o8742j7484K7691J3947p985
$$ -57836 884 50734 101771 109973 130186 116720 68597 -145 -17629 10062 24009 16024
11562A6024K8381k285k6407n8220k8601N1535Q968L8120J8667O046L4074N4756
$$ 16024 44405 42120 15713 -42507 -71108 -19573 -10605 27515 46182 52228 86302 141058
11550A41058q25o2768p9234l5520j7411k3119m848L6840L2761k100J9732m101
$$ 141058 140233 77465 -1769 -37289 -54700 -77819 -82667 -45827 -13066 -15166 4566 465
11538D65l7215J9377J6316r514P122k9488k5168k4353k2672L0812K7176J4412
$$ 465 -36750 -17373 -1057 -10571 -3449 -32937 -58105 -82458 -105130 -74318 -47142 -32730
11526c2730J2804n682M3948q120o788l4346k7052L0825L7164M742j8472j2666
$$ -32730 -19926 -25608 18340 10220 3432 -30914 -57966 -27141 10023 14765 -3707 -16373
11514a6373L754J8903K7499J4372n6152k4467l246J0747N7586L1777j5706K9791
$$ -16373 -12619 6284 33783 48155 -7997 -32464 -35710 -24963 32623 64400 48694 78485
11502G8485P849m6183l870M6882K514K4340m0674r5807j8643k4174J6429O4137
$$ 78485 86334 40151 36281 83163 85677 110017 69343 -26464 -45107 -69281 -52852 11285
11490A1285K076K3183p415j2991Q239J0072m8024K4226J3473l0130K5691K6024
$$ 11285 13361 36544 29129 16138 24377 34449 -13575 10651 24124 -6006 19685 45709
11478D5709m8252J8430K4349M0259j8619n9729J985K6976j4856j2899N5981j2224
$$ 45709 -2543 15887 40236 80495 61876 2147 4132 31108 16252 3353 59334 47110
11466D7110q7320k1944J713j9564J2305K6317j750K1555K0901P148J7884K742
$$ 47110 -40210 -62154 -60441 -80005 -67700 -41383 -43133 -21578 -677 6471 24355 27097
11454B7097J9946k2812n9135K1116K6833l5541l3461K1593L9237L1155k51L8542
$$ 27097 47043 24231 -34904 -13788 13045 -22496 -55957 -34364 4873 36028 35777 74319
11442G4319j2304q7409j7621N5006M8749m4290J763K2216m3328j6319m8786K6547
$$ 74319 62015 -25394 -43015 11991 60740 16450 18213 40429 -2899 -19218 -68004 -41457
11430d1457K5822n7039j3145K4793K5744O1154m2825j2390M2427j5929r3916J7409
$$ -41457 -15635 -72674 -85819 -61026 -35282 25872 -16953 -29343 13084 -2845 -96761 -79352
11418g9352L6131K0239J16l2786m1386j2570k3161K9579K7164J2462J5034K1964
$$ -79352 -43221 -22982 -22866 -55652 -97038 -109608 -132769 -103190 -76026 -63564 -48530 -26566
11406b6566J0238K322J4738L8266l0424m6877N078l853n062n263m3625L4605M8878
$$ -26566 -16328 -14006 732 38998 8574 -38303 -33225 -37078 -42140 -47403 -91028 -56423 -7545
11393g545M077N844L2877K9048k4582R759k927M198n4666j5287m4199J6314J7161
$$ -7545 -3468 2376 35253 64301 39719 49478 46551 50749 -3917 -19204 -63403 -47089 -29928
11380b9928j2424J0832Q5964K2030q1866o5693k7905L3444L1763O785k5002J7166
$$ -29928 -42352 -31520 54444 76474 -5392 -71085 -98990 -65546 -33783 -26998 -52000 -34834
11368c4834k800l067N6321N839K5376J1577l3633J1320K5830m5945o9965J8397
$$ -34834 -37634 -40701 15620 21459 46835 58412 24779 36099 61929 15984 -53981 -35584
11356c5584J5185l9500j7110L6572K4989L2835Q71L3504P151l5655n4629J8513
$$ -35584 -20399 -59899 -77009 -40437 -15448 17387 18258 51762 58913 23258 -31371 -12858
11344a2858J6099J3526K3198l6595K8011K8016k7400J185j1634j0461m0049M580
$$ -12858 3241 16767 39965 3370 31381 59397 31997 33182 21548 11087 -28962 -24382
11332b4382j0224J250k4850K4950L3426L931J6729L511p080n8524j1459K9579
$$ -24382 -34606 -33356 -58206 -33256 170 4101 20830 24341 17261 -41263 -52722 -23143
11320b3143L5919m8688k6477K0471M7548J1313r409n4844j3719m3171p391M3788
$$ -23143 12776 -35912 -62389 -41918 5630 16943 7534 -47310 -61029 -104200 -111591 -67803
11308f7803J5888l5019J6940N8206J8588L4645j6445l7208M7756m4964n4165J0049
$$ -67803 -51915 -86934 -69994 -11788 6800 41445 25000 -12208 35548 -9416 -63581 -53532
11296e3532L6423O6403K2278m889k7862l7278m788N185l6780m1000k2822O1050
$$ -53532 -17109 49294 71572 66683 38821 1543 -3245 1940 -34840 -75840 -98662 -37612
11284c7612J3181J3602J7771j1613k995N1008K2987J2599l268k9527n4582k5520
$$ -37612 -24431 -10829 6942 -4671 -7666 43342 66329 78928 75660 46133 -8449 -33969
11272c3969j7116P285j1465K8995M8589k0077l0344k7809J8879K6557m2585K2478
$$ -33969 -51085 -43800 -55265 -26270 22319 2242 -28102 -55911 -37032 -10475 -53060 -30582
11260c0582J8806j4182k9654n2921r210N4878L1002k8010k4801J0506L6854l3445
$$ -30582 -11776 -25958 -55612 -108533 -117743 -62865 -31863 -59873 -84674 -74168 -37314 -70759
11248g0759J2477N3157l9477o7148N5499R2861K5182l3323k8758J2466K2100j2707
$$ -70759 -58282 -5125 -44602 -111750 -56251 36610 61792 28469 -289 12177 34277 21570
11236B1570k8756l3144M0615K6361L9772O613m0654M482o271j3096m2031r4540
$$ 21570 -7186 -40330 285 26646 66418 73031 32377 36859 30588 17492 -24539 -119079
11224a19079j2816N1844N4619M037O378J4209l5239j154M1148L8645k1572n5901
$$ -119079 -131895 -80051 -25432 -21395 -15017 -808 -36047 -37201 3947 42592 21020 -34881
11212c4881k1954m8658J8830J6732k0699k9136P0346k0848m7591j2703L1761M0607
$$ -34881 -56835 -105493 -86663 -69931 -90630 -119766 -49420 -70268 -117859 -130562 -98801 -58194
11200e8194J4548k5246J5304q617l464K3156O639k7824K762J7763L6574O4970
$$ -58194 -43646 -68892 -53588 -62205 -65669 -42513 -35874 -63698 -60936 -43173 -6599 58371
11188E8371M2216o6143m8955j0661q91L1158j6796j6282J9511M4100M037l67n2519
$$ 58371 100587 34444 -14511 -25172 -26063 5095 -11701 -27983 -8472 35628 39665 39298 -13221
11175a3221p1712K1017j3432l4194j0404L6779L6273k2107j2796K5037M4731m399
$$ -13221 -84933 -63916 -77348 -111542 -121946 -85167 -48894 -71001 -83797 -58760 -14029 -18428
11163a8428n9281j7409q76J7928L2533l2238M357m404P688Q853k1353M3971J2313
$$ -18428 -77709 -95118 -95994 -78066 -45533 -77771 -73414 -77818 -70130 -61277 -82630 -38659 -26346
11150b6346J5289K1202L9449L5730l9964k1010n402J6274J1514J4234j3648l2703
$$ -26346 -11057 10145 49594 85324 45360 24350 18948 35222 46736 60970 47322 14619
11138A4619m0010j4810L2106N0613J3927m3898l7019P0957J8349n4188j1980k5498
$$ 14619 -25391 -40201 -8095 42518 56445 12547 -24472 46485 64834 10646 -1334 -26832
11126b6832J0355O1538j3295k3356L6205J8284l4178Q380l6431j7308R811l6180
$$ -26832 -16477 45061 31766 8410 44615 62899 28721 37101 670 -16638 -6827 -43007
11114d3007l1000n5396p071N2020P1475K5997J3872k2648j18Q436j504k8201j4625
$$ -43007 -74007 -129403 -136474 -84454 -12979 13018 26890 4242 4124 12560 11056 -17145 -31770
11101c1770l0982q738J6243L0508j1206J0097j238P476j1783j1597J4156l5580
$$ -31770 -62752 -71490 -55247 -24739 -35945 -25848 -27086 -19610 -31393 -42990 -28834 -64414
11089f4414k0961l322N2534j6693L022j475k7486m998M8129p347k7165m0778n13
$$ -64414 -85375 -88697 -36163 -52856 -49834 -51309 -78795 -83793 -35664 -43011 -70176 -110954 -111467
11076a11467N945M126J2092O1776M1495o3737j7560K7536L3323k6664o789N3923
$$ -111467 -105522 -101396 -89304 -27528 13967 -49770 -67330 -39794 -6471 -33135 -39924 13999
11064A3999N0242J627k1261j2624l2008OK1962N047K6715J1014k3229J7787M9405
$$ 13999 64241 65868 44607 31983 -25 -19 21943 26990 53705 64719 41490 59277 108682
11051A08682M7966n5067q1282n8440n2727o21K4487Q0693J9600m3258M9120q277
$$ 108682 156648 101581 20299 -38141 -90868 -91489 -67002 13691 33291 -9967 39153 30876
11039C0876p5888k1629Q758J3823n251N8826k6266j0575N8642J5050q5533K429
$$ 30876 -45012 -66641 -57883 -44060 -49311 9515 -16751 -27326 31316 46366 -39167 -36738
11027c6738J1404n34R731n2080l7129l90M9578O8736K2646K325L4680k1491o4798
$$ -36738 -25334 -25868 -16137 -68217 -105346 -105736 -56158 12578 35224 37549 72229 50738 -14060
11014a4060l625j526j2526J610J5378J7224J9860Q231l4875k9280J2608K7094
$$ -14060 -17685 -19211 -31737 -30127 -14749 2475 22335 30566 -4309 -33589 -20981 6113
11002F113Q7531O7151o5911r1046m6085k0489n0541K0883L7135K8072n284l199
$$ 6113 93644 160795 94884 3838 -42247 -62736 -113277 -92394 -55259 -27187 -32471 -35670
10990c5670n6636M7189P4843L0000j4448q1237n6042J041L5185M5554l5487k3419
$$ -35670 -92306 -45117 29726 59726 45278 -35959 -92001 -90960 -55775 -10221 -45708 -69127
10978f9127L9971k4839r008L0005M5075K0328N328J044r8252l2858m7257M2855
$$ -69127 -29156 -53995 -63003 -32998 12077 32405 37733 38777 -59475 -92333 -139590 -96735
10966i6735P2093j3396Q155k9396l9219L2833O05o3987J691L2346K4504J0973
$$ -96735 -24642 -38038 -29883 -59279 -98498 -65665 -65060 -129047 -127356 -95010 -70506 -59533
10954e9533L6784M6482K3262J8248J8101j001j0045o194k4847k616k9794j358
$$ -59533 -22749 23733 46995 65243 83344 82343 72298 66104 41257 38641 8847 7489
10942G489j4398l6549k2794j0371L0275O7374M0387j9931k4959j8411o1742L0875
$$ 7489 -6909 -43458 -66252 -76623 -46348 21026 61413 41482 16523 -1888 -63630 -32755
10930c2755N0052K9203j7955q258l2126o0831j1056O2618N3077k604q060m902
$$ -32755 17297 46500 28545 20287 -11839 -72670 -83726 -21108 31969 29365 21305 16403
10918A6403K4411p828r2957l8952P8127L9205r898R276N7733K1969m2810o6595
$$ 16403 40814 32986 -59971 -98923 -20796 18409 8511 17787 75520 97489 54679 -11916
10906a1916P891N347L5615K5105m2129q5005R248N9286r896O0368j0350m3578
$$ -11916 -4025 1322 36937 62042 19913 -65092 -55844 3442 -6454 53914 43564 -14
10894a4k0487O7235R333o8898k2084j5551L5847K6185j2656l154n2557l7235K8730
$$ -14 -20501 46734 56067 -12831 -34915 -50466 -14619 11566 -1090 -4244 -56801 -94036 -65306
10881f5306O5311R732m3771l2573J6566J2426L3570k3798K15k0031k6999k9685
$$ -65306 5 9737 -34034 -66607 -50041 -37615 -4045 -27843 -27628 -47659 -74658 -104343
10869a04343l0647K2588L7447L3501K1999k9771m9008l976M1945j598J4346Q0856
$$ -104343 -134990 -112402 -74955 -41454 -19455 -49226 -98234 -102210 -60265 -61863 -47517 33339
10857C3339L5411l0540l9885j0520K9422P471J6213l6371o1615o488K0451k3653
$$ 33339 68750 38210 -1675 -12195 17227 24698 40911 4540 -57075 -63563 -43112 -66765
10845f6765M3122O970n7624K0144L2650k4891m8836l033K7977P0181P2936K8202
$$ -66765 -23643 -16673 -74297 -54153 -21503 -46394 -95230 -98263 -70286 -105 72831 101033
10833A01033J2795r705l1011k0968k8602J497k3328j5244o0675n3745L4019L4242
$$ 101033 113828 104123 73112 52144 23542 25039 1711 -13533 -74208 -127953 -93934 -59692
10821e9692j1747k0069N9130j2314l0852q3180K5888P9307O9516Q949l3309Q60
$$ -59692 -71439 -91508 -32378 -44692 -75544 -158724 -132836 -53529 15987 24936 -8373 -7513
10809g513L512K9631j7814M8014o7679j8880K5965k4584N7894k891o1289J5954
$$ -7513 -4001 25630 7816 55830 -11849 -30729 -4764 -29348 28546 25655 -35634 -19680
10797a9680K4623k849L8234M9410J6967O51K434l5981j7984j6298q252J8669j5596
$$ -19680 4943 2094 40328 89738 106705 107356 109790 73809 55825 39527 31275 49944 34348
10784C4348j056k2673K6850O308m4172n6174j5380R711j9011K6975J8898m2929
$$ 34348 33292 10619 37469 43777 -395 -56569 -71949 -62238 -81249 -54274 -35376 -78305
10772g8305J3156Q3660P182J6936p955j0615n733J1395k502M573j9375k2109K8345
$$ -78305 -65149 18511 25693 42629 34674 24059 18326 29721 27219 31792 12417 -9692 18653
10759A8653k2037K008k8491k1712k7712j1431J5363J7347J741P3073r231k1520
$$ 18653 -3384 -1376 -29867 -51579 -79291 -90722 -75359 -58012 -56271 16802 7571 -13949
10747a3949L4126k24n6400j9323N6198L2064q740L689l2701k9678M203K8639K5065
$$ -13949 20177 19953 -36447 -55770 428 32492 23752 27441 -5260 -34938 -30735 -2096 22969
10734B2969J0287m9776K9111N7099J849k5454k1994Q160j1184O0057k3986K636
$$ 22969 33256 -16520 12591 69690 71539 46085 24091 32251 21067 81124 57138 59774
10722E9774j9087k7178K6930J3290k6879o6394O777L9489j6879k7279m2486K8027
$$ 59774 40687 13509 40439 53729 26850 -39544 -32767 6722 -10157 -37436 -79922 -51895
10710e1895J4244q940N605l4310j1129K3206J8403j3244r516J6720j9635j0102
$$ -51895 -37651 -46591 -40986 -75296 -86425 -63219 -44816 -58060 -67576 -50856 -70491 -80593
10698h0593Q0601l2516m5770j9874k8170j7829L088P1147L1599O455m0686j589
$$ -80593 8 -32508 -78278 -98152 -126322 -144151 -141063 -69916 -38317 -31862 -72548 -74137
10686g4137M7190L1225l8051r5471j0372O2765j9174q310K7404L1401P5446N1205
$$ -74137 -26947 4278 -33773 -129244 -139616 -76851 -96025 -104335 -76931 -45530 29916 81121
10674H1121k8594n5736k9434j1217k7233l0455K6002K1143P097k542l1883N0039
$$ 81121 52527 -3209 -32643 -43860 -71093 -101548 -75546 -54403 -47306 -49848 -81731 -31692
10662c1692M7830j1516m4790K293M7935m0815k9740q195l1664L5226P3300N3836
$$ -31692 16138 4622 -40168 -37875 10060 -30755 -60495 -68690 -100354 -65128 8172 62008
10650F2008k1041o369K1575k5100M258J8607l6974q4722j4645K8928K5780N2406
$$ 62008 40967 34598 56173 31073 35331 53938 16964 -67758 -82403 -53475 -27695 24711
10638B4711l4139k7793k2827j6606n2535m3583R8780N0281j517K6958M9562q539
$$ 24711 -9428 -37221 -60048 -76654 -129189 -172772 -73992 -23711 -25228 1730 51292 42753
10626D2753l1783m3370l504K0021M0606k6686k5103J3791J9574m2020l5227M6632
$$ 42753 10970 -32400 -35904 -15883 24723 -1963 -27066 -13275 6299 -35721 -70948 -24316
10614b4316J0284k5352Q40k0675N444K968p184l3117J5876L0862J9596J2439J0423
$$ -24316 -14032 -39384 -38544 -59219 -53775 -50807 -57991 -91108 -75232 -44370 -24774 -12335 -1912
10601a912O1466o7312l4037J2464J5545j713J5494j5277j4374J0006L6578J1034
$$ -1912 59554 -7758 -41795 -29331 -13786 -15499 -5 -15282 -29656 -19650 16928 27962
10589B7962J701k6585p8536j849M6756M1063p653k4456o1074k0616Q325O0180
$$ 27962 29663 3078 -75458 -77307 -30551 10512 2859 -21597 -82671 -103287 -94962 -34782
10577c4782j4495r544K0390N4720k8171l2439K7854n821o341P87n8195k1583J2476
$$ -34782 -49277 -58821 -38431 16289 -11882 -44321 -16467 -22288 -28629 -27842 -86037 -107620 -95144
10564i5144l448j098M0647O6560O8554m5236n7441P17k7175k1298M4930K7468
$$ -95144 -98592 -99690 -59043 7517 76071 30835 -26606 -25889 -53064 -74362 -29432 -1964
10552a964J2784k1128l9919m498M3066m6387J8131N9580R052M8299K1695j2219
$$ -1964 10820 -10308 -50227 -54725 -11659 -58046 -39915 19665 28717 77016 98711 86492
10540H6492m6187r9856o197l4222K0339L4371L754M2038l133J7980R528P661M6057
$$ 86492 40305 -59551 -65748 -99970 -79631 -45260 -41506 532 -2601 15379 24907 32568 78625
10527G8625K3833k6361p052m2206p594L6039N4403j7769L2104J1893k2299k6772
$$ 78625 102458 76097 69045 26839 19245 55284 109687 91918 124022 135915 113616 86844
10515H6844o5695l3417L1182L6662j9012k0307l2709j7941j827K5157N4832K4013
$$ 86844 21149 -12268 18914 55576 36564 16257 -16452 -34393 -36220 -11063 43769 67782
10503F7782J4647l0888p2385p939O1304j0727m4439j6929j0799m6094K0622N4596
$$ 67782 82429 51541 -20844 -28783 32521 21794 -22645 -39574 -50373 -96467 -75845 -21249
10491b1249K5510J8663m7194o607L3731j8360l434k2749R06J8519J6628k8469
$$ -21249 4261 22924 -24270 -30877 2854 -15506 -18940 -41689 -40783 -22264 -5636 -34105
10479c4105r446N4644O557l9407j8715J8867j17Q711n1106k3033K9410N4719L8412
$$ -34105 -43551 11093 17650 -21757 -40472 -21605 -21722 -13011 -64117 -87150 -57740 -3021 35391
10466C5391j2308j1361k019l6569R452j5168o285l2653J1814k234m8873J7338
$$ 35391 23083 11722 9703 -26866 -17414 -32582 -38867 -71520 -59706 -61940 -110813 -93475
10454i3475L7943O7906K8526o0616n9308m1304j4439N9968Q8020K9942l5853k2989
$$ -93475 -55532 12374 40900 -19716 -79024 -120328 -134767 -74799 13221 43163 7310 -15679
10442a5679j7236k1364K5348K3216M0108K8234l680o108j5487q3847m4784q26
$$ -15679 -32915 -54279 -28931 -5715 34393 62627 58947 52839 37352 -46495 -91279 -92105
10430i2105r868j3686j9373L1046N7962k1241j8743N7053L306j9686L6429n5405
$$ -92105 -101973 -115659 -135032 -103986 -46024 -67265 -86008 -28955 -25649 -45335 -8906 -64311
10418f4311J7862J2396k0263M2359J997j4992n7127k0825M1857M0106j5948J3170
$$ -64311 -46449 -34053 -54316 -11957 -9960 -24952 -82079 -102904 -61047 -20941 -36889 -23719
10406b3719j2955N125j6501l7979R765M3147j7601M3838P6042k4530k6889J2124
$$ -23719 -36674 -31549 -48050 -86029 -76264 -33117 -50718 -6880 69162 44632 17743 29867
10394B9867m7686l4140j950L6205M0280k1207M897l5071J637N5824k07n4989L8622
$$ 29867 -17819 -51959 -53909 -17704 22576 1369 6266 -28805 -27168 28656 28449 -26540 12082
10381A2082M1440O90K2101j6893k6230k1606n4763k4907M684M0539l301j8087
$$ 12082 53522 54212 76313 59420 33190 11584 -43179 -68086 -63402 -22863 -26164 -44251
10369d4251j6849N3055Q5055m285m2001l1678r886k9126j9342J2020k583K5995
$$ -44251 -61100 -8045 77010 72725 30724 -954 -10840 -39966 -59308 -47288 -49871 -23876
10357b3876L2476N4063J0473K2502m7040m5081j1683j056K1238j8653k0659K0180
$$ -23876 8600 62663 73136 95638 48598 3517 -8166 -9222 12016 -6637 -27296 -7116
10345g116K1716l5211l9511q40J2309J7680J4594N1207L1353p7863n0779M847
$$ -7116 14600 -20611 -60122 -60962 -48653 -30973 -16379 34828 66181 -11682 -62461 -57614
10333e7614L3956N77n077j0989Q0157N1327j7589k8654K7240q5700k3478J4836
$$ -57614 -23658 -23081 -28158 -39147 41010 92337 74748 46094 73334 -12366 -35844 -21008
10321b1008J1147K8710J5668p8613r1728L8017M1309K8417O6889j419J1828n5708
$$ -21008 -9861 18849 34517 -44096 -135824 -97807 -56498 -28081 38808 37389 49217 -6491
10309f491k5506N8171l83m7498j448N0068N34j1046o0851m6124L1917p5969k3701
$$ -6491 -31997 26174 25791 -21707 -23155 26913 27447 16401 -44450 -90574 -58657 -134626 -158327
10296a58327N1477L0607k793m5091K5713N4883j812j8747M4644M2941K19j5285
$$ -158327 -106850 -76243 -79036 -124127 -98414 -43531 -45343 -64090 -19446 23495 23714 8429
10284H429M7245j3795l5159Q827j682J1566J2933N961k2287j5958k2143p1639
$$ 8429 55674 41879 6720 15547 13865 25431 38364 44325 22038 6080 -16063 -87702
10272h7702n0113O3684N5775K5465o087l5401K2065l0251J7967K3852L706m3568
$$ -87702 -137815 -74131 -18356 7109 1022 -34379 -12314 -42565 -24598 -746 2960 -40608
10260d0608l6728j249M3803J479j9249k5904J5032J898L8293N8411O8382j6104
$$ -40608 -77336 -78585 -34782 -33303 -52552 -78456 -63424 -61526 -23233 35178 103560 87456
10248H7456p2419l0854j452J8043k0676J6009J2391K6707N1205K7708m9932n9522
$$ 87456 15037 -15817 -17269 774 -19902 -3893 8498 35205 86410 114118 64186 4664
10236D664N8923k9843o3669n8396J6793N5396O4687p3571p2613l7434K3172P2954
$$ 4664 63587 33744 -29925 -88321 -71528 -16132 48555 -25016 -97629 -135063 -111891 -38937
10224c8937J0816o091k271K5741N3766m559m2751J2371j5233l2752O1911K2679
$$ -38937 -28121 -34212 -36483 -10742 43024 38465 -4286 8085 -7148 -39900 22011 44690
10212D4690m9438n4640q381j8210J0816O4826K2986j2498j817J9878k6623m7795
$$ 44690 -4748 -59388 -67769 -85979 -75163 -10337 12649 151 -1666 18212 -8411 -56206
10200e6206K6710J706L523K9267k1537k0171k2181L4942j2464K7388j320k4286
$$ -56206 -29496 -27790 -24267 5000 -16537 -36708 -58889 -23947 -36411 -9023 -10343 -34629
10188c4629J3289L5202j056K134j5750L5443O550j9262J2539M2163L9457l5999
$$ -34629 -21340 13862 12806 14940 -810 34633 41183 21921 34460 76623 116080 80081
10176H0081k5341L070l9859n6973K4309Q310K3516Q310k2862n7268k8341K8225
$$ 80081 54740 57810 17951 -39022 -14713 -6403 17113 25423 2561 -54707 -83048 -54823
10164e4823k7712J0949K0291m3633k2431K1393j7644k4745M1916P2421l02m5345
$$ -54823 -82535 -71586 -51295 -94928 -117359 -95966 -113610 -138355 -96439 -24018 -24320 -69665
10152f9665K0350Q2898K7658L6728L8140N234O098k3251q0680q8033j3421N9018
$$ -69665 -49315 33583 61241 97969 136109 141343 147441 124190 43510 -44523 -57944 1074
10140A074O0051j8537j1008k1880j6591j2627P644k8431j9324j0424l0770L7778
$$ 1074 61125 42588 31580 9700 -6891 -19518 -11874 -40305 -59629 -70053 -100823 -63045
10128f3045M0931J9289l935j5304J4340J6751l2950N577N1775k3763m3264k8236
$$ -63045 -22114 -2825 -6760 -22064 -7724 9027 -23923 -18346 33429 9666 -33598 -61834
10116f1834k8578O4972M8848p038m1659l4211J3977j2722J6341K315o8053l7166
$$ -61834 -90412 -25440 23408 16370 -25289 -59500 -45523 -58245 -41904 -39589 -107642 -144808
10104a44808L0371J0064M6258J5109k2730j9790P1242l2545n0661J6351M1075
$$ -144808 -114437 -104373 -58115 -43006 -65736 -85526 -14284 -46829 -97490 -81139 -40064
10093d0064R64J8663O881j6250O285k1513m3365R134M9229K1020M2992J2696j1095
$$ -40064 -39100 -20437 -13556 -29806 -23521 -45034 -88399 -79265 -30036 -9016 33976 46672 35577
10080C5577n7684J4105M9867p2382m5680j3544Q9002M6872M694K1440o1621k8050
$$ 35577 -22107 -8002 41865 -30517 -76197 -89741 -739 46133 50827 72267 10646 -17404
10068a7404r03k8686K5249l3301M0519L2434k5405k9725j166k8742j7518L0993
$$ -17404 -18307 -46993 -21744 -55045 -14526 17908 -7497 -37222 -38388 -67130 -84648 -53655
10056e3655k3276l5651L189P1600P453j9707L4886M1426K2639K1435m1546k1128
$$ -53655 -76931 -112582 -109393 -37793 -30340 -50047 -15161 26265 48904 70339 28793 7665
10044G665r783K097L646j3712J8169K5964N55n08M6515O835l8951l9792K464P015
$$ 7665 -2118 -21 3625 -10087 8082 34046 34601 34093 80608 87443 48492 8700 11164 18179
10030A8179j9088k0203j4975Q916K3688m275L513o245K2393j6031k6919K2497
$$ 18179 -909 -21112 -36087 -27171 -3483 -7758 -4245 -10490 11903 -4128 -31047 -8550
10018h550O5125M8878K6105o9832m7574j749l2771K9979K6013j6065k9090J0910
$$ -8550 56575 105453 131558 61726 14152 12403 -20368 9611 35624 19559 -9531 1379
10006A379M943j2963M3856L6503Q092r894j4103k1917p1852l428j6063R721N9969
$$ 1379 6322 -6641 37215 73718 81810 71916 57813 35896 -35956 -39384 -55447 -45726 14243
9993A4243M2793j700k3922L6012K3006o488o7642l2702L0403K586o3748K20O6572
$$ 14243 57036 55336 31414 67426 90432 83944 16302 -16400 14003 16589 -47159 -46939 19633
9980A9633N5789r898n9053l7629m785l4808Q753P668J5073K1569O6743K6381j03995
$$ 19633 75422 65524 6471 -31158 -35943 -70751 -61998 -54330 -39257 -17688 49055 75436 -28559
9967b8559l8514J9260J6140P910L61q3116l730O0867O7598O6712L8444l3732n8711
$$ -28559 -67073 -47813 -31673 -23763 -23402 -106518 -110248 -49381 18217 84929 123373 89641 30930
9954C0930j5160q3621m9176J3729j347L0131J8321j2560J4733L2141P8358l9520
$$ 30930 15770 -67851 -117027 -103298 -104645 -74514 -56193 -68753 -54020 -21879 56479 16959
9942A6959p0336j0415M1092J1717N5985N141l0499k1249r502n964O3356J0772
$$ 16959 -53377 -63792 -22700 -10983 45002 50143 19644 -1605 -11107 -17071 46285 57057
9930E7057L2181R099J7442j0844l6558j8033n1839l051P5473L097j8914j2477
$$ 57057 89238 98337 115779 104935 68377 50344 -1495 -4546 70927 74024 55110 42633
9918D2633P689n8848p931J0885k1379k7470j1605K150M9586O0230k8400L2114
$$ 42633 50322 -8526 -16457 -5572 -26951 -54421 -66026 -63876 -14290 45940 17540 49654
9906D9654N6257L9908l1031k9248m6165P131R798p1583p725m8509l5165P097L6606
$$ 49654 105911 145819 114788 85540 39375 46506 56304 -15279 -23004 -71513 -106678 -99581 -62975
9893f2975L8866o316m265M591J240M3710l028K447j5751n769M8982N4984L3790
$$ -62975 -24109 -30425 -34690 -30099 -28859 14851 11823 14270 -1481 -7250 41732 96716 130506
9880A30506n4092l5474L7083j0315l4092r435K1062Q047K937P921J6146l1924
$$ 130506 76414 40940 78023 67708 33616 24181 45243 53290 56227 64148 80294 48370
9868D8370l151k2240l6762o6266K7452L1978O3080Q285l380J6678M385k3511K608
$$ 48370 45219 22979 -13783 -80049 -52597 -20619 42461 50746 47366 64044 68429 44918 47526
9855D7526j3516l574r504m1537j1186l855K2351L3638J9752J6237k095k6610J4933
$$ 47526 34010 30436 20932 -20605 -31791 -35646 -13295 20343 40095 56332 54237 27627 42560
9842D2560n7001k9500J4082P318J0276j5865j8697K562L1973L6781p07N2128Q254
$$ 42560 -14441 -43941 -29859 -22541 -12265 -28130 -46827 -44265 -12292 24489 23782 75910 84164
9829H4164J5966K4828K0824J5221j4353l3730l3730p9446J6594L8031r894n0227
$$ 84164 100130 124958 145782 161003 146650 112920 79190 -256 16338 54369 44475 -5752
9817e752K098k5487o329j5250p0177M990P2222K0532l1130j1120r363K8640O7558
$$ -5752 -3654 -29141 -35470 -50720 -120897 -115907 -43685 -23153 -54283 -65403 -74766 -46126 21432
9804B1432L6228m9193l3209R883J901m8262o813M4981k3021M0199J1023K5681
$$ 21432 57660 8467 -24742 -14859 -12958 -61220 -68033 -23052 -46073 -5874 5149 30830
9792C0830K8684m1004l2021J0402k297j2725k495k7908o1603O606M7301K8787
$$ 30830 59514 18510 -13511 -3109 -5406 -18131 -20626 -48534 -110137 -103531 -56230 -27443
9780b7443K5505j3441j0058k5867K0039K7477j9841l5531j0571J6400k222K6015
$$ -27443 -1938 -15379 -25437 -51304 -31265 -3788 -23629 -59160 -69731 -53331 -55553 -29538
9768b9538p416n9528j031J7468O100L5107M797m5959K030R257K6115l1632J4856
$$ -29538 -36954 -96482 -97513 -80045 -73945 -38838 -34041 -80000 -77970 -68713 -42598 -74230 -59374
9755e9374K8171J2587M9041L8863n4849m6120L3401k0082m1006K4147k2081l0857
$$ -59374 -31203 -18616 30425 69288 14439 -31681 1720 -18362 -59368 -35221 -57302 -88159
9743h8159J9690M2231p5Q9059M4351j4022n4523p1259j9590j6727M6330j6464
$$ -88159 -68469 -26238 -26313 62746 107097 93075 38552 -32707 -52297 -69024 -22694 -39158
9731c9158J9187J4875O986L4067K4631n9876L2685O2002J1224p3154l5567L1935
$$ -39158 -19971 -5096 1890 35957 60588 712 33397 95399 106623 33469 -2098 29837
9719B9837k2658k5595l0547q004K754J8536l9787Q043M6708K0917M7234j2110
$$ 29837 7179 -18416 -48963 -56967 -54213 -35677 -75464 -67421 -20713 204 47438 35328
9707C5328j8278l8925n794k5285k1432K8944K8699L4549L6496m1666o7906L3286
$$ 35328 17050 -21875 -27669 -52954 -74386 -45442 -16743 17806 54302 12636 -55270 -21984
9695b1984P1308m1009j6590J9814L6308M9497j3478m6392n2481l0436N402K7855
$$ -21984 49324 8315 -8275 11539 47847 97344 83866 37474 -15007 -45443 -40041 -12186
9683a2186L6423j9296o5491L5011j4923J2662O6599R422k3137J4033L5483m8511
$$ -12186 24237 4941 -60550 -25539 -40462 -27800 38799 48221 25084 39117 74600 26089
9671B6089l5213k4374l1377O820J3283M4406J3040j1472J2923N5106L4920l1678
$$ 26089 -9124 -33498 -64875 -58055 -44772 -366 12674 1202 14125 69231 104151 72473
9659G2473j4735l6685l4901k2465K9075J8386m594k2702K0840K3695l8659J1349
$$ 72473 57738 21053 -13848 -36313 -7238 11148 6554 -16148 4692 28387 -10272 1077
9647A077J7690p441K3334j7339j1791j1358J1672K5691L3259J9295l8632m6934
$$ 1077 18767 11326 34660 17321 5530 -5828 5844 31535 64794 84089 45457 -1477
9635a477j1902K0260n259k7599L2923Q7261J8443m040M0954l323o8273K4600J0420
$$ -1477 -13379 6881 1622 -25977 6946 94207 112650 108610 149564 146241 77968 102568 112988
9622A12988L13m4293j0683l8524j9359L533m8494M20K5877J212q869j2200j5094
$$ 112988 113301 69008 58325 19801 442 3975 -44519 -44099 -18222 -17010 -25879 -38079 -53173
9609e3173m8325m2083O2634N6043k92m6902j2912N2913M9502l3867m6891j78L9943
$$ -53173 -101498 -143581 -80947 -24904 -25196 -72098 -85010 -32097 17405 -16462 -63353 -63531 -23588
9596b3588k5600Q075k150r846K1162J8923M4660n6388k6190j1317J0897k0917
$$ -23588 -49188 -41113 -43263 -53109 -31947 -13024 31636 -24752 -50942 -62259 -51362 -72279
9584g2279m2297L3126P1844L8043j8016l1102j7814K8629m8409n502n207K9515
$$ -72279 -114576 -81450 -9606 28437 10421 -20681 -38495 -9866 -58275 -63777 -68984 -39469
9572c9469J258m1006k314N3965Q2969K0373k0326m9084J2008m351k1097k8781
$$ -39469 -38211 -79217 -81531 -27566 55403 75776 55450 6366 18374 14023 -7074 -35855
9560c5855p568O2319m7195m8187q7240M3850J0500L3268K4787J8298K787J5736
$$ -35855 -43423 18896 -28299 -76486 -163726 -119876 -109376 -76108 -51321 -33023 -30236 -14500
9548a4500l461l8674K159K9187L2602k0566k9093J5638n8J3237K7094K6304L3305
$$ -14500 -17961 -56635 -54476 -25289 7313 -13253 -42346 -26708 -26766 -13529 13565 39869 73174
9535G3174n4824o6003L2492J3976m4190k4734K1764L8991L0681J6516J3141k7976
$$ 73174 18350 -47653 -15161 -1185 -45375 -70109 -48345 -9354 21327 37843 50984 23008
9523B3008k9473o8811J2731O7853K0309O603J4880L0421N4862o1498j16889l490
$$ 23008 -6465 -75276 -62545 5308 25617 32220 47100 77521 132383 70885 -46004 -49494
9511d9494O0368J4826L1397l6030l4418q198k2051J6893J07757J1270o7010m2208
$$ -49494 10874 25700 57097 21067 -13351 -21549 -43600 -26707 81050 92320 25310 -16898
9499a6898K7993k4005J521p276p2604K2229Q9785j0753j8336L889M0155Q352l738
$$ -16898 11095 -12910 -11389 -18665 -91269 -69040 20745 9992 -8344 -4455 35700 44052 40314
9486D0314Q278L5003l4244l7099K1735K5436J2490m4146k096K5303q681J1138
$$ 40314 48592 83595 49351 12252 33987 59423 71913 27767 25671 50974 42293 53431
9474E3431j4508J3477j108j2495K8154Q696j5424N3063J6790m5650O486L6243
$$ 53431 38923 52400 51292 38797 66951 75647 60223 113286 130076 84426 90912 127155
9462A27155k9008k2258l2244J3407L6718J4202j0140m486m2526Q197O0733j0630
$$ 127155 98147 75889 43645 57052 93770 107972 97832 93346 50820 59017 119750 109120
9450A09120n7753k0473j0315M222j9549O2490J0601k9568O4989M1194P530O2083
$$ 109120 51367 30894 20579 24801 5252 67742 78343 48775 113764 154958 162488 224571
9438B24571j916M038K0939r91M3325j0363n7891o3358L2092N2278K7910O0542
$$ 224571 222655 226693 247632 246641 289966 279603 221712 158354 190446 242724 270634 331176
9426C31176L9398K2653N3613M0638Q4525K1395l3440J00897K07551J60037J17375
$$ 331176 370574 393227 446840 487478 572003 593398 559958 660855 868406 1028443 1145818
9415A145818J92081K28673K92664L00342L88286N70477O80323P71975Q45187P58078
$$ 1145818 1337899 1566572 1859236 2159578 2547864 3118341 3798664 4570639 5415826 6173904
9405F173904O48757N52289L70211J66650J8505j83960l93957n70760p07824o84600
$$ 6173904 6822661 7374950 7745161 7911811 7930316 7746356 7352399 6781639 6073815 5389215
9395E389215p16917o27957n61923m38550l71391k85195k23293k23393j82775j26592
$$ 5389215 4672298 4044341 3482418 3043868 2672477 2387282 2163989 1940596 1757821 1631229
$$ [...]
##END NTUPLES=NMR SPECTRUM
##END=
