##TITLE=Analysis number 317606
Compound Code cc 13047
Book Reference 446/194
Project Code adrs
Chemist Name roba
##JCAMPDX= 6.0         $$ Bruker NMR JCAMP-DX V2.0
##DATA TYPE= NMR SPECTRUM
##DATA CLASS= NTUPLES
##ORIGIN= Bruker BioSpin GmbH
##OWNER= nmr
$$ XWIN-NMR		Version 3.5
$$ Mon Feb 27 10:09:38 2006 GMT Standard Time (UT+0h)  MAYBRIDGE\nmr@NMR_250MHZ
##.OBSERVE FREQUENCY= 250.131544655141
##.OBSERVE NUCLEUS= ^1H
##.ACQUISITION MODE= SIMULTANEOUS (DQD)
##.ACQUISITION SCHEME= undefined
##.AVERAGES= 16
##.DIGITISER RES= 18
##SPECTROMETER/DATA SYSTEM= dpx250
##.PULSE SEQUENCE= zg30
##.SOLVENT NAME= CDCl3
##.SHIFT REFERENCE= (INTERNAL, CDCl3, 0, 16.3135)
##AUDIT TRAIL= $$ (NUMBER, WHEN, WHO, WHERE, WHAT)
$$ ##TITLE= Audit trail, XWIN-NMR		Version 3.5
$$ ##JCAMPDX= 5.01
$$ ##ORIGIN= Bruker BioSpin GmbH
$$ ##OWNER= nmr
$$ C:\u/data/dgb/nmr/ADRS/16890/pdata/1/auditp.txt
$$ ##AUDIT TRAIL=  $$ (NUMBER, WHEN, WHO, WHERE, WHAT)
(   1,<2006-02-27 10:09:13.07 +000>,<MAYBRIDGE\nmr>,<NMR_250MHZ>,
      <created by zg, POWCHK disabled, PULCHK disabled
       configuration hash MD5:
       84 BC 41 DB A1 6E 1D 46 DA 25 12 A5 C1 ED C5 3A
       data hash MD5: 64K
       F6 42 AA 47 80 C2 43 D5 C5 37 31 B4 73 54 83 64>)
(   2,<2006-02-27 10:09:27.39 +000>,<MAYBRIDGE\nmr>,<NMR_250MHZ>,
      <Start of raw data processing
       ef LB = 0.3 FT_mod = 6 PKNL = 1 SI = 32K 
       data hash MD5: 32K
       9D 79 5A EC EB 03 E3 4F 28 45 F0 66 F3 F0 61 94>)
(   3,<2006-02-27 10:09:29.28 +000>,<MAYBRIDGE\nmr>,<NMR_250MHZ>,
      <apk 
       data hash MD5: 32K
       70 EF 4E 42 90 3E 30 73 F4 A4 8F 8C 93 47 99 E0>)
(   4,<2006-02-27 10:09:30.00 +000>,<MAYBRIDGE\nmr>,<NMR_250MHZ>,
      <abs ABSG = 5 
       data hash MD5: 32K
       2F C3 2F 85 78 0C 65 3B 09 7D EB 27 D8 E0 21 1C>)
$$ ##END=
$$ 
$$ hash MD5
$$ BB 4F B9 8E 52 24 62 02 92 34 DB D7 07 B9 1C F7
##$RELAX= 
##$RELAX= 
##$RELAX= 
##$RELAX= 
##$RELAX= 
##$RELAX= 
##$RELAX= 
$$ Bruker specific parameters
$$ --------------------------
##$DU= <C:\u>
##$EXPNO= 16890
##$NAME= <ADRS>
##$PROCNO= 1
##$TYPE= <nmr>
##$USER= <dgb>
##$AMP= (0..31)
100 100 100 100 100 100 100 100 100 100 100 100 100 100 100 100 100 100 
100 100 100 100 100 100 100 100 100 100 100 100 100 100 
##$AQSEQ= 0
##$AQ_mod= 3
##$AUNM= <au_zg>
##$AUTOPOS= <6 >
##$BF1= 250.13
##$BF2= 250.13
##$BF3= 250.13
##$BF4= 250.13
##$BF5= 500.13
##$BF6= 500.13
##$BF7= 500.13
##$BF8= 500.13
##$BYTORDA= 1
##$CFDGTYP= 0
##$CFRGTYP= 5
##$CHEMSTR= <none>
##$CNST= (0..31)
1 1 145 1 1 1 1 1 1 1 1 1 1 1 1 1 1 1 1 1 1 1 1 1 1 1 1 1 1 1 1 1 
##$CPDPRG= <>
##$CPDPRG1= <>
##$CPDPRG2= <>
##$CPDPRG3= <>
##$CPDPRG4= <mlev>
##$CPDPRG5= <mlev>
##$CPDPRG6= <mlev>
##$CPDPRG7= <mlev>
##$CPDPRG8= <mlev>
##$CPDPRGB= <>
##$CPDPRGT= <>
##$D= (0..31)
0 1 0 0 0 0 0 0 0 0.06 0 0 0 0 0 0 0.0002 0 0 0 0 0 0 0 0 0 0 0 0 0 0 
0 
##$DATE= 1141034952
##$DBL= (0..7)
120 120 120 120 120 120 120 120 
##$DBP= (0..7)
150 150 150 150 150 150 150 150 
##$DBP07= 0
##$DBPNAM0= <>
##$DBPNAM1= <>
$$ [...]
##$SUBNAM7= <"">
##$SUBNAM8= <"">
##$SUBNAM9= <"">
##$SW= 20.6930455092707
##$SWIBOX= (0..15)
0 0 3 0 0 0 0 0 0 0 0 0 0 0 0 0 
##$SW_h= 5175.983436853
##$TD= 65536
##$TD0= 1
##$TE= 293.16
##$TE2= 300
##$TE3= 300
##$TEG= 300
##$TL= (0..7)
0 120 120 120 120 120 120 120 
##$TP= (0..7)
150 150 150 150 150 150 150 150 
##$TP07= 0
##$TPNAME0= <>
##$TPNAME1= <>
##$TPNAME2= <>
##$TPNAME3= <>
##$TPNAME4= <>
##$TPNAME5= <>
##$TPNAME6= <>
##$TPNAME7= <>
##$TPOAL= (0..7)
0.5 0.5 0.5 0.5 0.5 0.5 0.5 0.5 
##$TPOFFS= (0..7)
0 0 0 0 0 0 0 0 
##$TUNHIN= 0
##$TUNHOUT= 0
##$TUNXOUT= 0
##$USERA1= <user>
##$USERA2= <user>
##$USERA3= <user>
##$USERA4= <user>
##$USERA5= <user>
##$V9= 5
##$VALIST= <valist>
##$VCLIST= <CCCCCCCCCCCCCCC>
##$VD= 0
##$VDLIST= <DDDDDDDDDDDDDDD>
##$VPLIST= <PPPPPPPPPPPPPPP>
##$VTLIST= <TTTTTTTTTTTTTTT>
##$WBST= 1024
##$WBSW= 4
##$XGAIN= (0..3)
0 0 0 0 
##$XL= 0
##$YL= 0
##$YMAX_a= 408689
##$YMIN_a= -497068
##$ZGOPTNS= <>
##$ZL1= 120
##$ZL2= 120
##$ZL3= 120
##$ZL4= 120
##$ABSF1= 16.31351
##$ABSF2= -4.379658
##$ABSG= 5
##$ABSL= 3
##$ALPHA= 0
##$AQORDER= 0
##$ASSFAC= 0
##$ASSFACI= 0
##$ASSFACX= 0
##$ASSWID= 0
##$AUNMP= <proc_1d>
##$AZFE= 0.1
##$AZFW= 0.1
##$BCFW= 0
##$BC_mod= 0
##$BYTORDP= 0
##$COROFFS= 0
##$CY= 12.5
##$DATMOD= 1
##$DC= 0
##$DFILT= <>
##$DTYPP= 0
##$F1P= 14.0000005364418
##$F2P= -0.99999901652339
##$FCOR= 0.5
##$FTSIZE= 32768
##$FT_mod= 6
##$GAMMA= 0
##$GB= 0
##$INTBC= 1
##$INTSCL= 1
##$ISEN= 128
##$LB= 0.3
##$LEV0= 0
##$LPBIN= 0
##$MAXI= 10000
##$MC2= 0
##$MEAN= 0
##$ME_mod= 0
##$MI= 0
##$NCOEF= 0
##$NC_proc= -3
##$NLEV= 6
##$NOISF1= 0
##$NOISF2= 0
##$NSP= 0
##$NTH_PI= 0
##$NZP= 0
##$OFFSET= 16.31351
##$PC= 1
##$PHC0= -112.6803
##$PHC1= 4.648451
##$PH_mod= 1
##$PKNL= yes
##$PPARMOD= 0
##$PSCAL= 4
##$PSIGN= 0
##$REVERSE= no
##$SF= 250.130052147935
##$SI= 32768
##$SIGF1= 0
##$SIGF2= 0
##$SINO= 400
##$SIOLD= 32768
##$SREGLST= <1H.CDCl3>
##$SSB= 0
##$STSI= 32768
##$STSR= 0
##$SW_p= 5175.98343685301
##$SYMM= 0
##$S_DEV= 0
##$TDeff= 65536
##$TDoff= 0
##$TI= <Analysis number 999999
Compound Code 99
Book Reference 9
Project Code 9>
##$TILT= no
##$TM1= 0
##$TM2= 0
##$TOPLEV= 0
##$USERP1= <user>
##$USERP2= <user>
##$USERP3= <user>
##$USERP4= <user>
##$USERP5= <user>
##$WDW= 1
##$XDIM= 32768
##$YMAX_p= 366673426
##$YMIN_p= -142314
$$ End of Bruker specific parameters
$$ ---------------------------------
##NTUPLES= NMR SPECTRUM
##VAR_NAME=  FREQUENCY,     SPECTRUM/REAL,   SPECTRUM/IMAG
##SYMBOL=    X,             R,               I
##VAR_TYPE=  INDEPENDENT,   DEPENDENT,       DEPENDENT
##VAR_FORM=  AFFN,          ASDF,            ASDF
##VAR_DIM=   32768,         32768,           32768
##UNITS=     HZ,            ARBITRARY UNITS, ARBITRARY UNITS
##FACTOR=    0.157963299565203, 1,           1
##FIRST=     4080.49933082607, 0,            0
##LAST=      -1095.48410602694, 0,           0
##MIN=       -1095.48410602694, -142314,     0
##MAX=       4080.49933082607, 366673426,    0
$$ Real data points
##PAGE= N=1
##DATA TABLE= (X++(R..R)), XYDATA
$$ [...]
17793A56357L5952K3918J8825l0452j8708K1403j0905j8787m278l3748j4647J7831
$$ 156357 192309 216227 235052 204600 185892 207295 196390 177603 173325 139577 124930 142761
17781A42761J5655K5069k8963l3652k0083J3198L3599K7995J4930o179j1592j0073
$$ 142761 158416 183485 154522 120870 100787 113985 147584 175579 190509 184330 172738 162665
17769A62665O269L6890K3702K131J7578l8184l4837J808Q7398P8850P9498O3040
$$ 162665 168934 205824 229526 231657 249235 211051 176214 178022 265420 344270 423768 486808
17757D86808Q754j2375j6392n0228j4945K326j1956K933m065k1017O991L8748
$$ 486808 495562 483187 466795 416567 401622 403948 391992 394925 390860 369843 376834 415582
17745D15582j4580k2584K9779K8678L2959K4247r329k4439J7559J9555P7309N1149
$$ 415582 401002 378418 408197 436875 469834 494081 484752 460313 477872 497427 574736 625885
17733F25885M046K8138Q232J4136J4918R45O2590J05036J22406J90418K12786
$$ 625885 629931 658069 666301 680437 695355 696300 758890 863926 986332 1176750 1389536
17722A389536J34820k2217p9278r2111p9297j9960j756J8030L4670L2778L8776
$$ 1389536 1524356 1502139 1422861 1330750 1251453 1231493 1229737 1247767 1282437 1315215 1353991
17711A353991J09737K12265L20999L69500K95495K44438K24592J29995J03343
$$ 1353991 1463728 1675993 1996992 2366492 2661987 2906425 3131017 3261012 3364355
17702C364355J28978J94955M00644M73350M60576N03876O50211R48034J391301
$$ 3364355 3493333 3688288 4088932 4562282 5022858 5526734 6176945 7124979 8516280
17693H516280K045595L225090N495746J0036209J9328701L3592535L2915044O933294
$$ 8516280 10561875 13786965 19282711 29318920 48647621 82240156 115155200 122088494
17685A22088494j2496566k2869684k7305087j9820995j1429305o637111m059407
$$ 122088494 109591928 86722244 59417157 39596162 28166857 21529746 17470339
17678A7470339k647596j677822r14689m06196r620L73427O88663J053810J598748
$$ 17470339 14822743 13144921 12230232 11824036 11814416 12187843 12876506 13930316 15529064
17669A5529064K631461M792515R235261J7989780L1108863K9929758N671673j1483885
$$ 15529064 18160525 22953040 32188301 50178081 81286944 111216702 116888375 105404490
17661A05404490k0293115k3396950j5006567m857076M365001J6294654K8543925
$$ 105404490 85111375 61714425 46707858 41850782 46215783 62510437 91054362
17654I1054362K1078040j468701j4397651k2362726k2873152j5210511q765014
$$ 91054362 112132402 110663701 96266050 73903324 51030172 35819661 27054647
17647B7054647n294540l558316k494061j777051j134330o87936l41923r080L19166
$$ 27054647 21760107 18201791 15707730 13930679 12796349 12108413 11766490 11757410 12076576
17638A2076576P35489J385528K507298M842172R523607J8514426K8640050K0259214
$$ 12076576 12812065 14197593 16704891 21547063 31070670 49585096 78225146 98484360
17630I8484360j596581j3493047k0851954k1117454j3736069p849551m627951
$$ 98484360 96887779 83394732 62542778 41425324 27689255 19839704 15211753
17623A5211753k919063j988398j398114q82484m99823k73942j44645l37946n42896
$$ 15211753 12292690 10304292 8906178 8023694 7523871 7249929 7105284 6767338 6224442
17614F224442o33273o00465m50645k51034j49011j43330j16908j57066k29042
$$ 6224442 5591169 4990704 4540059 4289025 4140014 3996684 3879776 3722710 3493668
17605C493668l19496l51019l27859l08250k24839j13981p8622J9439O3542P6957
$$ 3493668 3174172 2823153 2495294 2187044 1962205 1848224 1769602 1789041 1852583 1929540
17595A929540m371o9762j17136j36538j31097j05141q9875q2250k2965n448j1595
$$ 1929540 1925169 1855407 1738271 1601733 1470636 1365495 1275620 1193370 1170405 1164957 1153362
17584A153362k0753k304j8015n5998q3239l5423n8807m1392l491m4652m7707o1529
$$ 1153362 1132609 1130305 1112290 1056292 973053 937630 878823 837431 833940 789288 741581 680052
17572F80052j0960k2797o3497J652m2211R519K115j5804k9460m8568k6266m6031
$$ 680052 669092 646295 582798 584450 542239 551758 553873 538069 508609 460041 433775 387744
17560C87744k1964m2059l7979K4874r009J868K1392L2153j5757l005M4014M115
$$ 387744 365780 323721 285742 310616 301607 303475 324867 357020 341263 338258 382272 386387
17548C86387j4115P8026J41811J76222J98086J06653J6894o7353j50740j03252
$$ 386387 372272 450298 592109 768331 966417 1073070 1089964 1022611 871871 768619
17538G68619N97J08947J72764P8637o9606j71109k34794j71163q0686r0547n3580
$$ 768619 769216 878163 1050927 1129564 1059958 888849 654055 482892 402206 311659 258079
17527B58079N101j6969k5758K2484j1209p200P716J5218k1886m6658j979K8302
$$ 258079 263180 246211 220453 242937 231728 224528 232244 247462 225576 178918 176939 205241
17515B05241J5919N6813Q7363J02935J08628L9128l1168r7981r9175o7506J6507
$$ 205241 221160 277973 365336 468271 576899 616027 584859 486878 387703 320197 336704
17504C36704R2809Q1899k75m8555j52278j29893j17208o0896j510J5464J6437
$$ 336704 429513 511412 511137 462582 310304 180411 63203 2307 797 16261 32698
17493C2698O853K5810k0211n2880j4153Q984J4514k2587k2493L223J5676M7040
$$ 32698 39551 65361 45150 -7730 -21883 -12899 1615 -20972 -43465 -40242 -24566 22474
17481B2474J8899r54m7498L1241m853m3143l42n0181k8409l89L5150L0260N7809
$$ 22474 41373 40419 -7079 24162 19309 -23834 -24176 -74357 -102766 -103155 -68005 -37745 20064
17468B0064r035k0088L0207o708J0574O546J5865n3501k2875J5848j0726J6030
$$ 20064 11029 -9059 21148 14440 25014 31560 47425 -6076 -28951 -13103 -23829 -7799
17456g799J4892J7550M633k55K818j3399k6295j0383M854N7080L5342J4415j4865
$$ -7799 7093 24643 29276 29021 31839 18440 -7855 -18238 -13384 43696 79038 93453 78588
17443G8588j4849K2582P6379J60184N9041j8909l9515p4123o5055n3442l2290
$$ 78588 63739 86321 162700 322884 381925 363016 323501 249378 184323 130881 98591
17432I8591k9062j4389k1631J084k5478J6034M8263J7534R436P504O348M702Q540
$$ 98591 69529 55140 33509 34593 9115 25149 73412 90946 100382 107886 114234 118936 127476
17419A27476k5565q884r835k1507K0108J414j3635l006K4893M609J0290p909Q961
$$ 127476 101911 93027 83192 61685 81793 83207 69572 66566 91459 96068 106358 98449 107410
17406A07410k158k6387K5414K6207L3344N86l574k8373K6443M2722K2031L5714
$$ 107410 105252 78865 104279 130486 163830 164416 160842 132469 158912 201634 223665 259379
17394B59379L0813K4197k0724l3782q523Q235j8635l4808J8919j5417j9470m1789
$$ 259379 290192 314389 293665 259883 251360 259595 240960 206152 225071 209654 190184 148395
17382A48395J3175J3683j2943j6362Q913k9580j8490l1528n2968m103j4513j692
$$ 148395 161570 175253 162310 145948 154861 125281 106791 75263 22295 18192 3679 1987
17370A987o475j4976J7208L364J930J462R169J0421L755j057j5847M701K1495
$$ 1987 -4488 -19464 -2256 1108 3038 4500 13669 24090 27845 26788 10941 15642 37137
17357C7137j5163J8069R347k8155R198k1046L852n8210m5743K1273K0508O567
$$ 37137 21974 40043 49390 21235 30433 9387 13239 -44971 -90714 -69441 -48933 -42366
17345d2366L4746P158k4991o006k0927o172k7378j994O0079K5302j3713j2680
$$ -42366 -7620 -462 -25453 -31459 -52386 -58558 -85936 -87930 -27851 -2549 -16262 -28942
17333b8942q257j5703L1147j1635J7627J9430K0274K9751j5375l6758K2742K2799
$$ -28942 -37199 -52902 -21755 -33390 -15763 3667 23941 53692 38317 1559 24301 47100
17321D7100r536l171j2477k2629r055m9107k6563J2578m9149kM0529M6575N0123
$$ 47100 37564 34393 21916 -713 -9768 -58875 -85438 -72860 -122009 -122011 -81482 -34907 15216
17308A5216J4408j8988j5052O080o943P566n689p377j4024j3548J1138J5664k1870
$$ 15216 29624 10636 -4416 1664 -5279 2287 -3402 -10779 -24803 -38351 -27213 -11549 -33419
17295c3419R924L0678j502j7792l6868N30J7436K6701J2233k6352K1737k882j7399
$$ -33419 -23495 7183 5681 -12111 -48979 -48449 -31013 -4312 7921 -18431 3306 424 -16975
17282a6975J9209P381k398M8062j038l5984j6832J2155j1831k1317l2812j9706
$$ -16975 2234 9615 7217 55279 54241 18257 1425 13580 1749 -19568 -52380 -72086
17270g2086N841J175L0022J367K0218L1757m5352k7092Q199K2829r010J8815K9422
$$ -72086 -66245 -65070 -35048 -33681 -13463 18294 -27058 -54150 -45951 -23122 -32132 -13317 16105
17257A6105O38j5437J300J7647k2971j9311P572R518J1550K8051Q240L559k0044
$$ 16105 16743 1306 2606 20253 -2718 -22029 -14457 -4939 6611 34662 42902 46461 26417
17244B6417Q60Q639q577k6108q39n735L0811K6300r371l8571l7315J5018j2210
$$ 26417 27277 35916 27339 1231 392 -5343 25468 51768 42397 3826 -33489 -18471 -30681
17231c0681q804J513k4450l1341J1350J7861J1973J1507J8521Q35J4322K904J1935
$$ -30681 -39485 -37972 -62422 -93763 -82413 -64552 -52579 -41072 -22551 -21716 -7394 -4490 7445
17218G445J7267j0675j0048j7994K4668J5722q661J0788r95q813M0109m2522m1295
$$ 7445 24712 14037 3989 -14005 10663 26385 17724 28512 27517 18704 58813 16291 -25004
17205b5004N075K1832p7K9542N310j7780m9295l2850Q334M0263J9172J0938J7496
$$ -25004 -19929 1903 1826 31368 36678 18898 -30397 -63247 -54913 -14650 4522 15460 32956
17192C2956K1695J1863M724k1785n1802l1987q593K9652j5535k0791r053p22N673
$$ 32956 54651 66514 71238 49453 -2349 -34336 -42929 -13277 -28812 -49603 -58656 -59378 -53705
17179e3705J6303J3518J4914j0945j0609K3029j1356j2327J9018l94N57M2890
$$ -53705 -37402 -23884 -8970 -19915 -30524 -7495 -18851 -31178 -12160 -12554 -11997 30893
17167C0893m763l3086N9J7877k2054j5715m247L3607M2631J7073j3404k5852p202
$$ 30893 26130 -6956 -6897 10980 -11074 -26789 -31036 2571 45202 62275 48871 23019 15817
17154A5817o539J7973K8179N2388J14167K08782J50476M5129q6080j68357j28269
$$ 15817 9278 27251 55430 107818 221985 430767 581243 626372 540292 371935 243666
17143B43666o4746n5975k9115m9256k1011q028J2474J5522k746K1471M0137j1669
$$ 243666 178920 122945 93830 44574 23563 15535 28009 43531 40785 62256 102393 90724
17131I0724j3553j574M1038N2382Q1908K08016J86936j3946o8457j40617j14465
$$ 90724 77171 75597 116635 169017 250925 458941 645877 631931 563474 422857 308392
17120C08392o9886j7802M3404J20050J48989N0985l5187j15117j58020j42177
$$ 308392 238506 220704 264108 384158 533147 584132 548945 433828 275808 133631
17110A33631o4415L2128J8501l1530j7807k3753l2648L2214P029q85J4421m1787
$$ 133631 69216 101344 119845 88315 70508 46755 14107 46321 53350 52465 66886 25099
17098B5099J852Q954M5267P0324R3399J60582J18060m3217p3344o6013p1296m4866
$$ 25099 26951 35905 81172 151496 244895 405477 523537 480320 406976 340963 269667 224801
17086B24801l6719o2956j4103k7567J6526P878o882r615m027Q311l9118m7398
$$ 224801 188082 125126 111023 83456 99982 107860 100978 91363 87336 95647 56529 9131
17074I131M158O688m2334j1807K5230R864K2102j6770j0241M448k4569O916k7045
$$ 9131 13289 19977 -22357 -34164 -8934 930 23032 6262 -3979 469 -24100 -17184 -44229
17061d4229J0866J3081j2706p598n54J9242L2889K7352k5568J6424k508l9270
$$ -44229 -33363 -20282 -32988 -40586 -41140 -21898 10991 38343 12775 29199 26691 -12579
17049a2579k6570K4658L3702j0374M019r970k911K2354J6010M138r300k9060m4192
$$ -12579 -39149 -14491 19211 8837 12856 2886 -25 22329 38339 42477 33177 4117 -40075
17036d0075M2495K9889M128l1642l2637R863K9716J1477k1471k9057P17J7272
$$ -40075 2420 32309 36437 4795 -27842 -17979 11737 23214 1743 -27314 -26597 -9325
17024i325j3538J0960L4504j8955l7666j3774p44L2479M752R186j1663j3261j8168
$$ -9325 -22863 -11903 22601 3646 -34020 -47794 -48538 -16059 -11307 -2121 -13784 -27045 -45213
17011d5213m797M832j1618K2463K1721L6532j2434n34j4998k4686J910l710l4479
$$ -45213 -50010 -45178 -56796 -34333 -12612 23920 11486 10952 -4046 -28732 -26822 -30532 -65011
16998f5011k829J4285M418m686K3939L1846j9156j9639L1956J8516l1721K1768
$$ -65011 -67840 -53555 -49137 -53823 -29884 1962 -17194 -36833 -4877 13639 -18082 3686
16986C686m988k9483l1941J2081J1631k6731M9337N2370k6946k2671j2206J0146
$$ 3686 -1302 -30785 -62726 -50645 -39014 -65745 -16408 35962 9016 -13655 -25861 -15715
16974a5715J9873J4204K87k9788P532M203Q73j1833p392r868K7741J8553J3234
$$ -15715 4158 18362 18649 -11139 -3607 596 1469 -10364 -17756 -27624 117 18670 31904
16961C1904j8269k4851l7443J0954K1383j3310l2485n968J9531K5160k9945k9055
$$ 31904 13635 -11216 -48659 -37705 -16322 -29632 -62117 -68085 -48554 -23394 -53339 -82394
16949h2394N842K9094O4190M5525j8298m3719j9827O801m220L486J2187j3308
$$ -82394 -76552 -47458 16732 62257 43959 240 -19587 -12786 -17006 -13520 -1333 -14641
16937a4641j0358N954p0L469o825L2083k315j2041J6637o007J5841k2682m5122
$$ -14641 -24999 -19045 -19115 -15646 -22471 9612 7297 -4744 11893 5886 21727 -955 -46077
16924d6077L42M4862K6008j2339j4695l992k1520M736J3248M481k6344j164J8351
$$ -46077 -45735 -873 25135 12796 -1899 -5891 -27411 -22675 -9427 -4946 -31290 -32454 -14103
16911a4103R781K1858M0477K2996j7411l4843j3093J194K9172L395m5368p358
$$ -14103 -4322 17536 58013 81009 63598 28755 15662 16856 46028 49423 4055 -3303
16899c303L5743J3836m696k3019k7357k0774J2421K3450L3189r405m2223m4821
$$ -3303 32440 46276 41580 18561 -8796 -29570 -17149 6301 39490 30085 -12138 -56959
16887e6959n057o408J4863J7632N046k649J2233l0227K507J5311k9371o279j8737
$$ -56959 -62016 -68424 -53561 -35929 -30883 -33532 -21299 -51526 -49019 -33708 -63079 -69358 -88095
16874h8095J6935K9806L8751j4450R959k656P483P158L313o437M5390J9255j0633
$$ -88095 -71160 -41354 -2603 -17053 -7094 -9750 -2267 4891 8204 1767 47157 66412 55779
16861E5779l0227k4641j6511R937J5247Q761q467k2273j5669q345K5745M8373
$$ 55779 25552 911 -15600 -5663 9584 18345 9878 -12395 -28064 -36409 -10664 37709
16849C7709j197m3991m4932M516l627J3147j2582m0387j0610M0436M9617j076
$$ 37709 36512 -7479 -52411 -47895 -51522 -38375 -50957 -91344 -101954 -61518 -11901 -12977
16837a2977k4262j1676J2477L0356j9423L6277j5761o1914O502M0845L8354k550
$$ -12977 -37239 -48915 -36438 -6082 -25505 10772 -4989 -66903 -60401 -19556 18798 16248
16825A6248j911j1276k2898L6222l5616j8555J2841l45p646N361j2089M1008M0588
$$ 16248 14337 3061 -19837 16385 -19231 -37786 -24945 -25290 -32936 -27575 -39664 1344 41932
16812D1932j7555l1944k2376k6852M7264o292J0745L3080N217n6190k5752j760
$$ 41932 24377 -7567 -29943 -56795 -9531 -15823 -5078 28002 33219 -22971 -48723 -50483
16800e0483J1742N2086k0466m8613m055J185j0210J7814k085r642Q76J6589M7869
$$ -50483 -38741 13345 -7121 -55734 -59789 -58604 -68814 -51000 -53085 -62727 -61851 -45262 2607
16787B607R321j2707M367k5458p485k0752l485K6237P524K8191J0445k4136j9326
$$ 2607 11928 -779 3588 -21870 -29355 -50107 -53592 -27355 -19831 8360 18805 -5331 -24657
16774b4657J6544P860l0476L4520J8048R46R710J2312J5995j9083l8303j4640
$$ -24657 -8113 -253 -30729 3791 21839 22785 32495 44807 60802 41719 3416 -11224
16762a1224n345j2120j6012M0312K5661k4183Q381J4476r655q207l735j5866j5644
$$ -11224 -16569 -28689 -44701 -4389 21272 -2911 5470 19946 10291 2084 -1651 -17517 -33161
16749c3161J5320l2579K2864K0756l301k3113K722j0454L251Q943R636l104J9792
$$ -33161 -17841 -50420 -27556 -6800 -10101 -33214 -30492 -40946 -37695 -28752 -19116 -22220 -2428
16736b428R408k4575o134l0555o951J7055o581J072K5714L2750j5971o0806R94
$$ -2428 6980 -17595 -23729 -54284 -61235 -44180 -50761 -49689 -23975 8775 -7196 -68002 -67008
16723f7008L5591O79k5569j6044R827M5872J5130k5872k509m204L2570K8681j4857
$$ -67008 -31417 -30738 -56307 -72351 -62524 -16652 -1522 -27394 -29903 -34107 -1537 27144 12287
16710A2287L221N754k3071j0891k6493N886L5843p409j0479K6811l0070n854n1526
$$ 12287 15508 21262 -1809 -12700 -39193 -33307 2536 -4873 -15352 11459 -18611 -24465 -75991
16697g5991q577J3368K445L0263L3132J5328j1248j8234k1457N748N1750L6264
$$ -75991 -84568 -71200 -68755 -38492 -5360 9968 -1280 -19514 -40971 -35223 16527 52791
16685E2791J0392m3428m668K7917k0444o5023k6456J1955Q259o491J4785K8341
$$ 52791 63183 19755 15087 43004 22560 -42463 -68919 -56964 -48705 -55196 -40411 -12070
16673a2070J7687J3966q628O341l6494l1006L277J6114N673L1989J3547r056l044
$$ -12070 5617 19583 10955 17296 -19198 -50204 -46927 -30813 -25140 6849 20396 11340 8296
16660H296n912n710J753k4361J8298K8186k1636O190J5829j6424J1879J8226J3261
$$ 8296 2384 -3326 -1573 -25934 -7636 20550 -1086 5104 20933 4509 16388 34614 47875
16647D7875J825p336k6925K409J2k1699K3814j3228P910j1531k2799r903N834
$$ 47875 49700 42364 15439 17848 17860 -3839 19975 6747 14657 3126 -19673 -29576 -23742
16634b3742L8431l727m4434m454J0547J2544J1959j3724J5238P41j5783L081K9771
$$ -23742 14689 10962 -33472 -37926 -27379 -14835 -2876 -16600 -1362 -621 -16404 -13323 16448
16621A6448j1343j7043j0091J5316k5112k4018J7208Q214p611Q945l8303j4429
$$ 16448 5105 -11938 -22029 -6713 -31825 -55843 -38635 -30421 -38032 -29087 -67390 -81819
16609h1819J7339K565J0563J9958M7533o602m8368j8088k5667J9967o981k772
$$ -81819 -64480 -61915 -51352 -31394 16139 9537 -38831 -56919 -82586 -62619 -69600 -72372
16597g2372N592J68J2175J3951k0492J2526J9114K7957j3021l817j0633J1708
$$ -72372 -66780 -66612 -54437 -40486 -60978 -48452 -29338 -1381 -14402 -18219 -28852 -17144
16585a7144r965l5123K0530J6812k4784n005l411j2697P645J1499M5551J0639
$$ -17144 -27109 -62232 -41702 -24890 -49674 -54679 -58090 -70787 -63142 -51643 -6092 4547
16573D547k4634L084J1912r894M622N090q821l7066K382K6227K8192l384n49R761
$$ 4547 -20087 -17003 -5091 -14985 -10363 -5273 -14094 -51160 -48778 -22551 5641 2257 1708 11469
16559A1469Q32j1231q874M450J2399J2577K2143N183m5475k0234J6863j0098k8689
$$ 11469 12301 1070 -7804 -3354 9045 21622 43765 48948 3473 -16761 102 -9996 -38685
16546c8685K4988J7277j661J6141j1354o6057m234L1653J2648k1624K4834R973
$$ -38685 -13697 3580 1919 18060 6706 -59351 -63585 -31932 -19284 -40908 -16074 -6101
16534f101n0043k754L8248J5660j6134J4747M51j8652L0576J1904q388J070Q899
$$ -6101 -56144 -58898 -20650 -4990 -21124 -6377 -5926 -24578 5998 17902 9514 10584 19483
16521A9483j6019r346k3582j3466J4102r117K4044L7021M3679Q510k8761n0706
$$ 19483 3464 -5882 -29464 -42930 -28828 -37945 -13901 23120 66799 75309 46548 -4158
16509d158j9391J4843K4476K84j1311k4424j0179k1181m0066M702J5416j8685
$$ -4158 -23549 -8706 15770 16054 4743 -19681 -29860 -51041 -91107 -86405 -70989 -89674
16497h9674n286O3666O760j5873K0843J1746n1024K2337J7857k4967k5575j5937
$$ -89674 -94960 -31294 -24534 -40407 -19564 -7818 -58842 -36505 -18648 -43615 -69190 -85127
16485h5127L2052N4289n685j4746L5471J691k7599K6023K5584j2528j8142K0937
$$ -85127 -53075 1214 -4471 -19217 16254 17945 -9654 16369 41953 29425 11283 32220
16473C2220Q053j3115j8603K517J823l6319n3635k514J7034q820M361M8419K7294
$$ 32220 40273 27158 8555 11072 12895 -23424 -77059 -79573 -62539 -71359 -66998 -18579 8715
16460H715Q031k3391k7275p385k0841j3592K3962r522J0557J8244K7515L5653
$$ 8715 16746 -6645 -33920 -41305 -62146 -75738 -51776 -61298 -50741 -32497 -4982 30671
16448C0671j0151L40J4751o883k799K4246p530n517n189m045j9779N566J8778
$$ 30671 20520 20860 35611 28728 25929 50175 42645 37128 31939 27894 8115 13681 32459
16435C2459j0335m5168l6079k5269J3752J9415K6248N783M1810K9348n1521k9486
$$ 32459 22124 -23044 -59123 -84392 -70640 -51225 -24977 -19194 22616 51964 443 -29043
16423b9043J2244J4861j213J247K7085j0147K172J7956m0090k1029k54q736m123
$$ -29043 -16799 -1938 -3151 -1904 25181 15034 17206 35162 -4928 -25957 -26211 -34947 -39070
16410c9070N403L2o816k6587k6731l92M0868J0983P27J2086O478K4792K4948K8593
$$ -39070 -33667 -33635 -40451 -67038 -93769 -94161 -53293 -42310 -41583 -29497 -23019 1773 26721 55314
16396E5314j2127j3158k4682k4475l523R63K1153p763k3084l5017r980M7971m13
$$ 55314 43187 30029 5347 -19128 -22651 -21688 -535 -8298 -31382 -66399 -76379 -28408 -28821
16383b8821J1634J8270p05k5987K0891K1017J0221j4588j3449j5004p812k768
$$ -28821 -17187 1083 378 -25609 -4718 16299 26520 11932 -1517 -16521 -24333 -27101
16371b7101K711K4636L466j852k0852j6075J0064Q162N535J9565K1383l8615j5761
$$ -27101 -24390 246 3712 1860 -18992 -35067 -25003 -16841 -11306 8259 29642 -8973 -24734
16358b4734Q497M191K6386J2110k6479m555L8969m1383m3589P908R908n984R746
$$ -24734 -16237 -12046 14340 26450 -29 -4584 34385 -6998 -50587 -42679 -32771 -38755 -29009
16345b9009J5335N154p460O3294J4742j7367k8667k4761j6121j1704L126N2887
$$ -29009 -13674 -8520 -15980 47314 62056 44689 16022 -8739 -24860 -36564 -33438 19449
16333A9449J5672K9920J1917p6238l5947L6587J1140j33j2443R002J6336N558
$$ 19449 35121 65041 76958 720 -35227 1360 12500 12367 -76 8926 25262 30820
16321C0820j0159K1677p138l8314p6505P484J5534P178O396M001K6705L6504l0381
$$ 30820 20661 42338 35200 -3114 -79619 -72135 -56601 -49423 -43027 -39026 -12321 24183 -6198
16308f198j7910k0426N773K953J4573J4781O247k1827n365j930j2376q808J9732
$$ -6198 -24108 -44534 -38761 -35808 -21235 -6454 -207 -22034 -27399 -29329 -41705 -50513 -30781
16295c0781j3405L3082N9175k194m2427j1529J4968j7270k7055J6663K2730l844
$$ -30781 -44186 -11104 48071 45877 3450 -8079 6889 -10381 -37436 -20773 1957 -1887
16283a887k3054r788Q658j4573l5374j1262L6432j6802k0366L6554L4643K6126
$$ -1887 -24941 -34729 -26071 -40644 -76018 -87280 -50848 -67650 -88016 -51462 -16819 9307
16271I307j611l5980l571K2899K5894M607m840m0054K814K1876l3538q83K0209
$$ 9307 7696 -28284 -31855 -8956 16938 21545 16705 -23349 -20535 1341 -32197 -33080 -12871
16258a2871n091M213j192j96J2437j0694j8133J3563R436k5847J8424r148k6534
$$ -12871 -17962 -13749 -14941 -15137 -2700 -13394 -31527 -17964 -8528 -34375 -15951 -25099 -51633
16245e1633K3602O72M178j4603J0294k4736j4289J830J1424k6988j0133K1746
$$ -51633 -28031 -27359 -23181 -37784 -27490 -52226 -66515 -64685 -53261 -80249 -90382 -68636
16233f8636J4608n589L5890N7978K6892j5438k1299m4264p196r749J271J9654
$$ -68636 -54028 -59617 -23727 34251 61143 45705 24406 -19858 -27054 -36803 -35532 -15878
16221a5878K9061P035k3474l7267j6544k0369L0307K4490J2101K4115J969k0007
$$ -15878 13183 20218 -3256 -40523 -57067 -77436 -47129 -22639 -10538 13577 15546 -4461
16209d461J3077p169M037J0989j5862K2255J0871j0613J275L651j4705J4408k2756
$$ -4461 8616 1447 5484 16473 611 22866 33737 23124 24399 28050 13345 27753 4997
16196D997k6568n35r287j5602L3769K4072M894j6023k848k012l3117J3530L983
$$ 4997 -21571 -22106 -31393 -46995 -13226 10846 15740 -283 -3131 -5143 -38260 -24730 -20747
16183b0747J9293j9600j5153L2323M746M246O345j239J2229O057m281k6927K935
$$ -20747 -1454 -21054 -36207 -3884 862 5108 11453 10214 22443 28500 24219 -2708 227
16170B27J1102k445j5957L980J5016J1691J1539o388j2407j520J3269N175j6014
$$ 227 11329 8884 -7073 -3093 11923 23614 35153 28765 16358 14838 28107 33282 17268
16157A7268o0621l3953M432N4868K8682J7059k2240l9588K632Q228J4372M333
$$ 17268 -43353 -77306 -72874 -18006 10676 27735 5495 -34093 -31461 -23233 -8861 -4528
16145d528J8102J1926j1160J5220J8658K3105j1827j1815l2280O891o121j8321
$$ -4528 13574 25500 14340 29560 48218 71323 59496 47681 15401 22292 16171 -2150
16133b150j4433J3565J2693J2253R268J5410J8228J3872k8877k4978j2452K5288
$$ -2150 -16583 -3018 9675 21928 31196 46606 64834 78706 49829 24851 12399 37687
16121C7687k0997k1765J4556K0826K226k1717J0573L837j9849p416n72j6160k433
$$ 37687 16690 -5075 9481 30307 32533 10816 21389 25226 5377 -2039 -2611 -18771 -21204
16108b1204K0270n379j9055j3460k892o579L5323N0139K9704j9715J432k4231
$$ -21204 -934 -6313 -25368 -38828 -41720 -48299 -12976 37163 66867 47152 48584 24353
16096B4353k8137m290J0027O672k6600K3588K3909L009j523o635N481k0421o204
$$ 24353 -3784 -8074 1953 8625 -17975 5613 29522 32531 31008 24373 29854 9433 3229
16083C229k426k2344j817k0415r163J6802K0810M0404J9076o746j9510j327j8712
$$ 3229 803 -21541 -23358 -43773 -52936 -36134 -15324 25080 44156 37410 17900 16573 -2139
16070b139m3529j3335l374J3955K4853J5498k756j3588P479J3968r828L517n487
$$ -2139 -45668 -59003 -62377 -48422 -23569 -8071 -10827 -24415 -16936 -2968 -12796 -9279 -14766
16057a4766j0366K5703K4958N25m433k2362j3150j0324J4712J2010J3815J8336
$$ -14766 -25132 571 25529 26054 21621 -741 -13891 -24215 -9503 2507 16322 34658
16045C4658o563k2728k3864M569L3004l827l3775K9041Q083j2765n1182K2874
$$ 34658 28095 5367 -18497 -13928 19076 15249 -18526 10515 18598 5833 -45349 -22475
16033b2475J6204J1792J3095k5537k0633J2369m057r887M090J0053j6421J6153
$$ -22475 -6271 5521 18616 -6921 -27554 -15185 -19242 -29129 -25039 -14986 -31407 -15254
16021a5254M131j994O269P404l6894o553Q060J8610K7596K267J8508k6478k4975
$$ -15254 -11123 -13117 -6848 556 -36338 -42891 -34831 -16221 11375 13642 32150 5672 -19303
16008a9303K601L293k68j2387J5547J8107N908R65p332k4938k3106K3156J6390
$$ -19303 -16702 -13409 -13677 -26064 -10517 7590 13498 14463 7131 -17807 -40913 -17757 -1367
15995a367J1370J8113J0405q634j4707k3306j6390j895p737L0832R416K213J4986
$$ -1367 10003 28116 38521 29887 15180 -8126 -24516 -26411 -34148 -3316 6100 8313 23299
15982B3299J8041j2996j4985j5263j4878M4665J1494j5196j6162k7572J279J1654
$$ 23299 41340 28344 13359 -1904 -16782 27883 39377 24181 8019 -19553 -18274 -6620
15970f620o866R647k3239L755K7648k8863N607j446j7704j8985N265N2329j5457
$$ -6620 -13486 -3839 -27078 -23323 4325 -24538 -18931 -20377 -38081 -57066 -51801 528 -14929
15957a4929k8060J3473K6949J5965k2230k1437k2843K414k857M1195J6815K943
$$ -14929 -42989 -29516 -2567 13398 -8832 -30269 -53112 -50698 -53555 -12360 4455 7398
15945G398J0413k702K2048O259j6666k7751m331N829m884j2038j3572n35J6581
$$ 7398 17811 15109 37157 43416 26750 -1001 -5332 497 -4387 -16425 -29997 -30532 -13951
15932a3951n728J1769K924J9385M1484P362m725j7865L8908j4500m3337J5710
$$ -13951 -19679 -7910 -4986 14399 55883 63245 58520 40655 79563 65063 21726 37436
15920C7436K2790p087J4029j8192j1246k288k3052k7314m8869Q986M7531L6439
$$ 37436 60226 53139 67168 48976 37730 35442 12390 -14924 -63793 -54807 -7276 29163
15908B9163J738k2136j5203j606m3820J0188K6471k0109l0142l0038j1014L3497
$$ 29163 30901 8765 -6438 -8044 -51864 -41676 -15205 -35314 -65456 -95494 -106508 -73011
15896g3011K1285K6556j0445L920r709L375K77Q491m679q305k3380J5012L9135
$$ -73011 -51726 -25170 -35615 -31695 -41404 -38029 -37752 -29261 -33940 -42245 -65625 -50613 -11478
15883a1478M1822K9642K9137j8396n1393l160n4539k8543M0727L4334j1465N5903
$$ -11478 30344 59986 89123 70727 19334 16174 -38365 -66908 -26181 8153 -3312 52591
15871E2591l373m7289P428Q451N203k4637K213K1650P776k2308K1461j3596k6049
$$ 52591 49218 1929 9357 17808 23011 -1626 587 22237 30013 7705 29166 15570 -10479
15858a0479n070R96J5675r480K717j5064L449k093j4827J0761Q409n694q238j8016
$$ -10479 -15549 -14553 1122 -8358 -5641 -20705 -17256 -19349 -34176 -23415 -15006 -20700 -28938 -46954
15844d6954L1605j2111l3061O963J9547L7377l039l2273K5296j2538P128L9548
$$ -46954 -15349 -27460 -60521 -53558 -34011 3366 327 -31946 -6650 -19188 -12060 27488
15832B7488L2290n33k1680m097l7748R480J8104K8434j6312k6490K0932L0571
$$ 27488 59778 59245 37565 33468 -4280 5200 23304 51738 35426 8936 29868 60439
15820F0439k6205m5809l2940m486P073L396r97R469p989J4492l08k0512L4885
$$ 60439 34234 -11575 -44515 -49001 -41928 -38532 -39529 -30060 -38049 -23557 -23865 -44377 -9492
15807i492j955k3741L979L6748P476r703k6091j4954K1379J2620j5218J5434J923
$$ -9492 -11447 -35188 -31209 5539 13015 3312 -22779 -37733 -16354 -3734 -18952 -3518 -1595
15794a595o888k417j2101k3645J542J4364n38K2953K8122p155j9280M831J6227
$$ -1595 -8483 -10900 -23001 -46646 -45104 -30740 -31278 -8325 19797 12642 -6638 -1807 14420
15781A4420j1823J0328J867k8945j1600N448J5050M575l4609J0984K6155K1573
$$ 14420 2597 12925 14792 -14153 -25753 -20305 -5255 -680 -35289 -24305 1850 23423
15769B3423j3225J7226R158m3716k9238k791l301J2128K7721j9790p74K6121K9777
$$ 23423 10198 27424 36582 -7134 -36372 -39163 -42464 -30336 -2615 -22405 -23179 2942 32719
15756C2719K46j383o0734j5541L7701J7658j5873K4900q282P011k5994j4799K4624
$$ 32719 32965 31582 -29152 -44693 -6992 10666 -5207 19693 11411 18422 -7572 -22371 2253
15743B253j1108k6143J7628J1078l3379L595J5311j637J9909K0752J5160l5429
$$ 2253 -8855 -34998 -17370 -6292 -39671 -36076 -20765 -22402 -2493 18259 33419 -2010
15731b010k8915P478K1450J5781O588r458N612L23K6235K9777o262j5181k3706
$$ -2010 -30925 -23447 -1997 13784 20372 10914 16526 16849 43084 72861 66599 51418 27712
15718B7712l5213m0824l2046L7673K4050j0913K0131P529l8283O641J2885M4874
$$ 27712 -7501 -48325 -80371 -42698 -18648 -29561 -9430 -1901 -40184 -33543 -20658 24216
15706B4216J634m4531k4610J3836k261L523M6120K6527m591k3427P076p690k0851
$$ 24216 25850 -18681 -43291 -29455 -31716 -28193 17927 44454 39863 16436 23512 15822 -5029
15693e029j9437o35j8518L0336R582k3209J6648N4229l8713l6624J0671K8329
$$ -5029 -24466 -25101 -43619 -13283 -3701 -26910 -10262 43967 5254 -31370 -20699 7630
15681G630K6595K049j8958M491m270L2119k141j0708j7505Q772J2646j3298J4747
$$ 7630 34225 36274 17316 21807 17537 49656 47515 36807 19302 28074 40720 27422 42169
15668D2169j8456j4465L5570J9935k8855L066J3245j0587J0173k818J7082l8727
$$ 42169 23713 9248 44818 64753 35898 38964 52209 41622 51795 48977 66059 27332
15656B7332k5943N084M906m1758m228j603j4230R355N429j4211J2064L6872k3159
$$ 27332 1389 6473 11379 -30379 -34607 -36210 -50440 -41085 -35656 -49867 -37803 -931 -24090
15643b4090j980J8094J2309j2479M227M329L275J8204k2826j0753K5294j836J881
$$ -24090 -26070 -7976 4333 -8146 -3919 410 3685 21889 -937 -11690 13604 11768 13649
15630A3649k2301m5358l4039J5116M1791M7098k0951q442L1509M1018m411k572
$$ 13649 -8652 -54010 -88049 -72933 -31142 15956 -4995 -13437 18072 59090 54679 52107
15618E2107j8278k4959l3889l0507K9911J3019l0089j8197K646J5699K326k1203
$$ 52107 33829 8870 -25019 -55526 -25615 -12596 -42685 -60882 -58236 -42537 -40211 -61414
15606f1414K7099q169J7069k1230k8418K0454L7995J9844M5814k1360j9541L7595
$$ -61414 -34315 -42484 -25415 -46645 -75063 -54609 -16614 3230 49044 27684 8143 45738
15594D5738L066q414l626J932l2393r680P238o394l4064k7082J8675j8257j0852
$$ 45738 48804 40390 36764 38696 6303 -3377 3861 -2533 -36597 -63679 -45004 -63261 -74113
15581g4113M4925N1802R507n3041q011K2093k939Q784R114p720P723R433J4180
$$ -74113 -29188 22614 32121 -20920 -28931 -6838 -9777 -993 8121 401 8124 17557 31737
15568C1737j1902k6193j2737p489l972j8901K671K9081j8248o0695J0704M6371
$$ 31737 19835 -6358 -19095 -26584 -30556 -49457 -46786 -17705 -35953 -96648 -85944 -39573
15556c9573K5098k9202K8836L1370k6025l8135K3320k3979k3351k271L6513L0933
$$ -39573 -14475 -43677 -14841 16529 -9496 -47631 -24311 -48290 -71641 -73912 -37399 -6466
15544f466L0548J3667J2529r113l526Q534m1j9544J929m928k5125J0195r476j931
$$ -6466 24082 37749 50278 41165 37639 46173 46132 26588 28517 23589 -1536 8659 -817 -2748
15530b748r498k3143P961J6561L0834n080j893k7427J8900K1457k5213m7125Q187
$$ -2748 -12246 -35389 -27428 -10867 19967 14887 12994 -14433 4467 25924 711 -46414 -38227
15517c8227K0983J0178J202N573o975j851m0854k2095M8945n384o094k0520q068
$$ -38227 -17244 -7066 -5864 -291 -7266 -9117 -49971 -72066 -23121 -28505 -34599 -55119 -63187
15504f3187M2132L6182n459m1018j8419L804m321M3152L0342Q539j7711n612J7352
$$ -63187 -21055 15127 9668 -31350 -49769 -45965 -50286 -7134 23208 31747 14036 8424 25776
15491B5776n78l0479j9671J8986M990j7347J3728K0139J117N950J9445r968k9594
$$ 25776 25198 -5281 -24952 -5966 -976 -18323 -4595 15544 16661 22611 42056 32088 2494
15478B494m5890k4371L1968O0812K7327l885N67n5532l9074K7573N005j7026J3174
$$ 2494 -43396 -67767 -35799 25013 52340 48455 49022 -6510 -45584 -18011 -13006 -30032 -16858
15465a6858j6691P089j1877l379M4453j737K3559L4421J1379m7524n269k2534
$$ -16858 -33549 -26460 -38337 -41716 2737 1000 24559 58980 70359 22835 17566 -4968
15453d968p980k0702J8298K1739K2914j0761k3028k6190l2778r229j6730L0695
$$ -4968 -12948 -33650 -15352 6387 29301 18540 -4488 -30678 -63456 -72685 -89415 -58720
15441e8720L4777M5456J4266j6001j9529K3185J9247k2021k7639q109M708K085
$$ -58720 -23943 21513 35779 19778 249 23434 42681 20660 -6979 -15088 -10380 -8295
15429h295q357m010m094N1652Q62k3665j8906n470p869K4344K874L232n08o428
$$ -8295 -16652 -20662 -24756 26896 27758 4093 -14813 -20283 -28152 -3808 -934 2298 1790 -4638
15415d638P011J1390k344J5704K7622j4749m2525J2636J7642j7424l4240K3351
$$ -4638 2373 13763 11419 27123 54745 39996 -2529 10107 27749 10325 -23915 -564
15403e64J2363k0964m599L621J5867r45n1543M116J5752j5085L18L64k1171N079
$$ -564 11799 -9165 -13764 -10143 5724 4779 -46764 -42648 -26896 -41981 -41663 -41299 -62470 -57391
15389e7391j3625J9753K8906j5804j1822k5685j5396K7947L2729k3480J1988L8351
$$ -57391 -71016 -51263 -22357 -38161 -49983 -75668 -91064 -63117 -30388 -53868 -41880 -3529
15377c529r996L529K1861K5055k6053j1754l6246q066M3236M849r270m0181l0362
$$ -3529 -13525 -9996 11865 36920 10867 -887 -37133 -45199 -1963 2886 -6384 -46565 -76927
15364g6927L7855M3534j9308J3252M1662M4030L093j2786k1484m2493n413j1868
$$ -76927 -39072 4462 -14846 -1594 40068 84098 87191 74405 52921 10428 5015 -6853
15352f853r759j5287k1475J0776LJ1629n78J7893J1558L349l1553k5224K2078
$$ -6853 -16612 -31899 -53374 -42598 -42595 -30966 -31544 -13651 -2093 1256 -30297 -55521 -33443
15339c3443K9945J2539J1082R894m229l5439j7240N72K1801J710j6515l6158P412
$$ -33443 -3498 9041 20123 30017 25788 -9651 -26891 -26319 -4518 -2808 -19323 -55481 -48069
15326d8069Q223j2319k3108L7250J914m716N1765K4220J6003j1190k9656j1876
$$ -48069 -39846 -52165 -75273 -38023 -36109 -40825 10940 35160 51163 39973 10317 -1559
15314a559L2374K81K7174K5038l371l1919p1471k5716M870j4220R738L3827J2701
$$ -1559 30815 31096 58270 83308 79937 48018 -23453 -49169 -44299 -58519 -48781 -14954 -2253
15301b253M2367m015J1081N17Q593K383n61k167m382j7926k6568l2274P190J1715
$$ -2253 40114 36099 47180 47697 56290 58673 58112 55945 51563 33637 7069 -25205 -18015 -6300
15287f300p031K8467K1317J1129j0313k5337k2159j2044l919k5542j5456J7769
$$ -6300 -13331 15136 36453 47582 37269 11932 -10227 -22271 -26190 -51732 -67188 -49419
15275d9419K7644k876j6384M080J4886L6461L6512R027l2494l181l001l400J2267
$$ -49419 -21775 -24651 -41035 -36955 -22069 14392 50904 59931 27437 24256 21255 17855 30122
15262C0122O490J224l764O640Q759K7299k0052k2672k4723j7099n890l7485L4370
$$ 30122 36612 37836 34072 40712 49471 76770 56718 34046 9323 -7776 -13666 -51151 -16781
15249a6781j3011j0886J0736M3288J0191j9667K1289J2450N434j5323j5682r847
$$ -16781 -29792 -40678 -29942 13346 23537 3870 25159 37609 43043 27720 12038 2191
15237B191l303J4534R287p359j5401l5486J726K4940K4661O555N819K8020j6730
$$ 2191 -1112 13422 22709 15350 -51 -35537 -33811 -8871 15790 22345 28164 56184 39454
15224C9454k1224m915k663n617m8008k5645L7873L4997j0866j0767J659J604K2242
$$ 39454 18230 13315 10652 5035 -42973 -68618 -30745 4252 -6614 -17381 -15722 -14118 8124
15211H124j2233j6049O82N715j5846K9195K8585O673j8021j4323k6330k1066p071
$$ 8124 -4109 -20158 -19476 -13761 -29607 -412 28173 34846 16825 2502 -23828 -44894 -51965
15198e1965J5419L5183L3642L5996j6887l3700j3387Q357m242m8769J1932p048
$$ -51965 -36546 -1363 32279 68275 51388 17688 4301 12658 8416 -40353 -28421 -35469
15186c5469j9765j8469R057M3104L0529q769l4629k708J686m66K2010j1905j4200
$$ -35469 -55234 -73703 -64646 -21542 8987 218 -34411 -37119 -35433 -35899 -13889 -25794 -39994
15173c9994R414K813j1984n966J5664j823j3083j027L6906J1368J0415k6099k3444
$$ -39994 -30580 -27767 -39751 -45717 -30053 -31876 -44959 -45986 -9080 2288 12703 -13396 -36840
15160c6840N235J5111M4686O922J663k2396o679j0588k5390J2575o098O094L4153
$$ -36840 -31605 -16494 28192 35114 36777 14381 7702 -2886 -28276 -15701 -21799 -15705 18448
15147A8448L4891j4881p816j2460m379j7486k6564m664J6492k9651l5015K9655
$$ 18448 53339 38458 30642 18182 13803 -3683 -30247 -34911 -18419 -48070 -83085 -53430
15135e3430L2932M223J1591k5336K3384K2128l2177J5135k3225l5822J6806J7301
$$ -53430 -20498 -16275 -4684 -30020 -6636 15492 -16685 -1550 -24775 -60597 -43791 -26490
15123b6490L1434J6380l823M578o412k7419N195k5531J2081L1703j412Q036k9443
$$ -26490 4944 21324 17501 22079 15667 -11752 -6557 -32088 -20007 11696 10284 18320 -11123
15110a1123l2090K1768K6914j7199j1493J0157M643P23L633o096l2398K0851K02
$$ -11123 -43213 -21445 5469 -11730 -23223 -13066 -8423 -7700 -4067 -10163 -42561 -21710 -21508
15097b1508K0600m7114o2608l63M7812K9815k736k3254L3746O519J2492K3212
$$ -21508 -908 -48022 -110630 -110993 -63181 -33366 -36102 -59356 -25610 -19091 -6599 16613
15085A6613k3157p512K2735N457j5422L7191K297j3430k700N709J8697Q818n2072
$$ 16613 -6544 -14056 8679 14136 -1286 35905 38202 24772 22072 27781 46478 55296 3224
15072C224k0683m139k3746J7125p825Q104J8895N561j7643R907j3873j6842J3960
$$ 3224 -17459 -21598 -45344 -28219 -36044 -27940 -9045 -3484 -21127 -11220 -25093 -41935 -27975
15059b7975J5451r739j9346J3281K7581k018k8514K5772M6254k0129l5698j5973
$$ -27975 -12524 -22263 -41609 -28328 -747 -2765 -31279 -5507 40747 20618 -15080 -31053
15047c1053m5j344J1672Q736k438k9925O964J7114J031K709K2490O64m9285K0532
$$ -31053 -31098 -32442 -20770 -12034 -14472 -44397 -37433 -20319 -19288 -16579 5911 6575 -42710 -22178
15033b2178P6318J6435l2994p2002J7477K8888j8149j509k6799J6977J2306k858
$$ -22178 54140 70575 37581 -34421 -16944 11944 -6205 -7714 -34513 -17536 -5230 -8088
15021h088j0497q646Q216J1918J6256Q653m0466k9038K6349J4939N107o397j9323
$$ -8088 -18585 -27231 -19015 -7097 9159 17812 -22654 -51692 -25343 -10404 -5297 -11694 -31017
15008c1017K7078K0911J1485J9577K5315J0034j9610j1868k5407k4580j5133l534
$$ -31017 -3939 16972 28457 48034 73349 83383 63773 51905 26498 1918 -13215 -16749
14996a6749m351k5133L2628K9350n836k3604R477J1936k2638j6282M8752j1595
$$ -16749 -21100 -46233 -13605 15745 9909 -13695 -4218 7718 -14920 -31202 17550 5955
14984E955l2291p958J243p091Q937k114l0313M583L5340J4018L2428p268r280
$$ 5955 -26336 -34294 -33051 -40142 -31205 -33319 -63632 -59049 -23709 -9691 22737 15469 6189
14971F189K1545j305l542l416k0471J1791K542p333K4670K4807K1189J6883J863
$$ 6189 27734 26429 22887 19471 -1000 10791 13333 6000 30670 55477 76666 93549 95412
14958I5412n2840q890q206K1265P749m7088k0237N746j435N804m1364J7698L027
$$ 95412 42572 33682 25476 46741 54490 7402 -12835 -7089 -8524 -2720 -44084 -26386 -23359
14945b3359J5026J3693K3083J1168J1556l1074J0891j9885m9782k7428j0144J1795
$$ -23359 -8333 5360 28443 39611 51167 20093 30984 11099 -38683 -66111 -76255 -64460
14933f4460K2855n219N494K0268m8595l592M8918p058l147K592l5809M787K4668
$$ -64460 -41605 -46824 -41330 -21062 -69657 -73249 -24331 -31389 -34536 -31944 -67753 -62966 -38298
14920c8298r013J3631K0941M7790q418n60K0979L547Q63l0765q766J9587p763
$$ -38298 -47311 -33680 -12739 35051 26633 26073 47052 50599 51462 20697 11931 31518 23755
14907B3755j5935j4582K3540J5483j1556L024j0576j2934j8583R337j7093O96
$$ 23755 7820 -6762 16778 32261 20705 23729 13153 219 -18364 -9027 -26120 -25424
14895b5424K2693O336k6637K4689j9064J9124J1010L4220j5912r035q43J020n1575
$$ -25424 -2731 3605 -23032 1657 -17407 1717 12727 46947 31035 22000 21157 22177 -29398
14882b9398k6794J5503M0611J3092N219k3254j3733j0125J1840r583k7570k806
$$ -29398 -56192 -40689 -78 13014 18233 -5021 -18754 -28879 -17039 -26622 -54192 -56998
14870e6998M2048M0758L8226j232O187j4779J2298o025k5309j7590k0590J2577
$$ -56998 -14950 25808 64034 62802 68989 54210 66508 60483 35174 17584 -3006 9571
14858I571r394j4425P43j5214K4352k7263k558K146K9307j6098j1654J0759l0078
$$ 9571 177 -14248 -13505 -28719 -4367 -31630 -34188 -32042 -2735 -18833 -30487 -19728 -49806
14845d9806J1070K5334j4116m920M4690N767j0892m501K5709J0969k7210l3412
$$ -49806 -38736 -13402 -27518 -32438 12252 18019 7127 2626 28335 39304 12094 -21318
14833b1318j0893J6854L9978O551J2277O101r037j5809l7889J5691k609n370k2295
$$ -21318 -32211 -15357 24621 31172 43449 49550 40513 24704 -13185 2506 -103 -5473 -27768
14820b7768j4123J1569L1557K8962j23l7335K3714L7043p125l307n632k1656j4069
$$ -27768 -41891 -30322 1235 30197 30074 -7261 16453 53496 46371 43064 37432 15776 1707
14807A707J0755J177k498n710M873J5174k9159k41R899R821m130k0135j4654j166
$$ 1707 12462 13639 11141 5431 10304 25478 -3681 -3922 5977 15798 11668 -8467 -23121 -24287
14793b4287M5076K3768j8036m4201k4274R665J8618J3655L5273p407J502K1471
$$ -24287 20789 44557 26521 -17680 -41954 -32289 -13671 -16 35257 27850 29352 50823
14781E0823l1690m0592J4185P299k8504K183J5451o395j4581J3726K6669P441
$$ 50823 19133 -21459 -7274 25 -28479 -26296 -10845 -17240 -31821 -18095 8574 16015
14769A6015j8594J5861K3516J1104j4108k1410O852J8451L07L5378J3450k8168
$$ 16015 -2579 13282 36798 47902 33794 12384 19236 37687 37994 73372 86822 58654
14757E8654q834o1193P073J1609r825K792r776o179J4766J0373Q981l659j7219
$$ 58654 49820 -11373 -4300 7309 -2516 276 -9500 -15679 -913 9460 18441 14782 -2437
14744b437J3856K856Q92N018r380K1315k528j0184Q318J1736J9182J8872k0258
$$ -2437 11419 14275 15167 20185 10805 32120 29592 19408 27726 39462 58644 77516 57258
14731E7258n0294m3385j2836N0156J4393m829Q291L878J0975k8612m0698n25O503
$$ 57258 6964 -36421 -49257 899 15292 10463 18754 22632 33607 4995 -35703 -36228 -29725
14718b9725J9497J8544J7678R337J432J4917K3742k4220k9597k2777J477j0445
$$ -29725 -10228 8316 25994 35331 36763 51680 75422 51202 21605 -1172 305 -10140
14706a0140J5699j4152J5751K7211r284J3318k1600k3275R81j1665K7787J2030
$$ -10140 5559 -8593 7158 34369 25085 38403 16803 -6472 -5491 -17156 10631 22661
14694B2661j0916l3690P383n925J1917L3028r700j7465l70O5N913J9186L6639
$$ 22661 11745 -21945 -14562 -20487 -8570 24458 14758 -2707 -3077 -3012 2901 22087 58726
14681E8726j214l5781j0230n88J2790j7149j2500J0556K6953P598j8048k0091
$$ 58726 57512 21731 11501 10913 23703 6554 -5946 4610 31563 39161 21113 1022
14669A022J7573K3297j911j037k56j1691o6604j3999J4895K2641J8069l0849N311
$$ 1022 18595 41892 39981 38944 38688 26997 -39607 -53606 -38711 -16070 1999 -28850 -23539
14656b3539P42q200J4023N1119J4660n6190l3768J6158O634j4207J0119p796L0732
$$ -23539 -22797 -30997 -16974 34145 48805 -7385 -41153 -24995 -18361 -32568 -22449 -30245 487
14643D87M29K2525k4952j3461K5679J4433j9477k3826j3645k6523j935M0287K0185
$$ 487 916 23441 -1511 -14972 10707 25140 5663 -18163 -31808 -58331 -60266 -19979 206
14630B06O098k162k6232J274o04k6304l1790L7030O0796j2572k9427p41k996L2633
$$ 206 6304 4142 -22090 -20816 -21420 -47724 -79514 -42484 18312 5740 -23687 -24428 -27424 5209
14616E209N497k0520O859J0964N973q880L619J0384j784j1242j8659j9776k4324
$$ 5209 10706 -9814 -2955 8009 13982 5102 8721 19105 17321 6079 -12580 -32356 -56680
14603e6680q985R241J3510k251N369M6906M700p942l6809l0266j5866Q636M248
$$ -56680 -65665 -56424 -42914 -45165 -39796 7110 11810 3868 -32941 -63207 -79073 -70437 -66189
14590f6189J3966M5784L917j5825l1045M224J7695J80q127J5759J4687L038l551
$$ -66189 -52223 -6439 -2522 -18347 -49392 -45168 -27473 -27293 -35420 -19661 -4974 -1936 -5487
14577e487k3211n444k2731m665L2913J5998N155M805j4194Q668j0253j0602L2019
$$ -5487 -28698 -34142 -56873 -61538 -28625 -12627 -7472 -2667 -16861 -8193 -18446 -29048 2971
14564B971L5652j3474j5203K1924l34J5970j4228l2534j2678j2314K0326l450
$$ 2971 38623 25149 9946 31870 31536 47506 33278 744 -11934 -24248 -3922 -7372
14552g372q924N524K845k3033P692r536J3239l0962J7165N1441j4348J5254k812
$$ -7372 -16296 -10772 -7927 -30960 -23268 -32804 -19565 -50527 -33362 18079 3731 18985 16173
14539A6173k4664k0455j2692L3559J2475l9289N716L0507K3093K5086m7871L677
$$ 16173 -8491 -28946 -41638 -8079 4396 -34893 -29177 1330 24423 49509 1638 5315
14527E315K8335p93N386j7610P506k3020j920p466k4134N768N621J251m824j688
$$ 5315 33650 32857 38243 20633 28139 5119 3199 -4267 -28401 -22633 -17012 -15761 -20585 -22273
14513b2273j6657J0925N999j456J2313k2128j8508K0068m991r927L926l5160K742
$$ -22273 -38930 -28005 -22006 -23462 -11149 -33277 -51785 -31717 -36708 -46635 -42709 -77869 -75127
14500g5127K4284Q124J1206L1195r107J0926P807m150l7012l625O893r115j0826
$$ -75127 -50843 -42719 -31513 -318 -9425 1501 9308 5158 -31854 -35479 -28586 -37701 -48527
14487d8527J6390J8134K2182J752j5771k6209r745o767J5572K3477L490Q714P794
$$ -48527 -32137 -14003 8179 9931 -5840 -32049 -41794 -48561 -32989 -9512 -6022 2692 10486
14474A0486k7902K2864K3826Q857l3591p209O861j1704N969K7694L0924k0519
$$ 10486 -17416 5448 29274 38131 4540 -2669 4192 -7512 -1543 26151 57075 36556
14462C6556j6411K2328O227n3905k7112j1502K2006K7919j205R185J6494o221
$$ 36556 20145 42473 48700 -5205 -32317 -43819 -21813 6106 4901 14086 30580 24359
14450B4359O312q739k5895j746k54R368l960L3142L2129j3931m3404o757l878
$$ 24359 30671 21932 -3963 -5709 -5963 3405 -555 32587 64716 50785 7381 624 -3254
14437c254m220p101j9495j768K2210L9073j3452q30p091m941K3336m882L17J3923
$$ -3254 -7474 -14575 -34070 -35838 -13628 25445 11993 11163 4072 -869 22467 17585 17902 31825
14423C1825K7184k5529k4721J6456O501J0441M35j0153k678k3483j5230j8546
$$ 31825 59009 33480 8759 25215 31716 42157 42592 32439 29761 6278 -8952 -27498
14411b7498O204M2499M433l1899j097L848k7005j1765J4053J4798n324l4223J2149
$$ -27498 -21294 21205 25638 -6261 -7358 -3510 -30515 -42280 -28227 -13429 -18753 -52976 -40827
14398d0827L3358R452r185K432N228J1082j4931m287K4355k3000k1814K676j4346
$$ -40827 -7469 1983 -7202 -4770 458 11540 -3391 -7678 16677 -6323 -28137 -25461 -39807
14385c9807k1778j2482l727R671L2621M9667J0628K8841n7897k9830J8862L9449
$$ -39807 -61585 -74067 -77794 -68123 -35502 14165 24793 53634 -4263 -34093 -15231 24218
14373B4218K2960j6178j92j6582l6241Q379k1843Q084M7257k4023r474L6086N702
$$ 24218 47178 31000 30808 14226 -22015 -13636 -35479 -27395 19862 -4161 -13635 22451 28153
14360B8153j9497k7866j02L2298M4777k2886n2607j3658L441l776l487J7935M3003
$$ 28153 8656 -19210 -19312 12986 57763 34877 -17730 -31388 -27947 -31723 -35210 -17275 25728
14347B5728q848n0017J9168K8685m426J3422J5950k7466p732K6672O60k9683K2086
$$ 25728 16880 -33137 -13969 14716 10290 23712 39662 12196 4464 31136 31796 2113 24199
14334B4199N783k0214M338l843q140n233J5935J3559k4792n1079j2755K3501j0960
$$ 24199 29982 9768 14106 10263 2123 -3110 12825 26384 1592 -49487 -62242 -38741 -49701
14321d9701K264m9550K2150M2700k824l32J6537j5381L977M2505L6318p210j4154
$$ -49701 -47437 -96987 -74837 -32137 -34961 -35293 -18756 -34137 -30160 12345 48663 41453 27299
14308B7299k4818k4917Q110Q939K37M1624l298k9327l449K240k6698L002N5331
$$ 27299 2481 -22436 -14326 -5387 -5150 36474 33176 3849 400 2640 -24058 -21056 34275
14295C4275J5277j8223l9165k2638m06K9710Q77J7344j6671l068K2316m212k6247
$$ 34275 49552 31329 -7836 -30474 -30880 -1170 -293 17051 380 -2688 19628 15416 -10831
14282a0831j0454J072N5392K7701L549q539K0664j6643n7143l460J2246K3406
$$ -10831 -21285 -20213 35179 62880 66429 57890 78554 61911 4768 1308 13554 36960
14270C6960p361m6271k2401L0712J0406J2806o310j1809R760k888L7363l134j1008
$$ 36960 29599 -16672 -39073 -8361 2045 14851 8541 -3268 6492 3604 40967 37833 26825
14257B6825R028j563l0215l3270p109J6980M3547J8978l2770j9701N777J6257
$$ 26825 35853 34290 4075 -29195 -36304 -19324 24223 43201 10431 -9270 -3493 12764
14245A2764J88J9652o825j7704j3669K5224K9320j2490n2832k5062J3210J5114
$$ 12764 12952 32604 25779 8075 -5594 19630 48950 36460 -16372 -41434 -28224 -13110
14233a3110k8569l787K2559M7780L3095m0525j8429M884m2185J4346K8603k7195
$$ -13110 -41679 -45466 -22907 24873 57968 17443 -986 3898 -38287 -23941 4662 -22533
14221b2533q875k8141k6043M91K3069K230q483k514j6347j927L3872L4882N0154
$$ -22533 -31408 -59549 -85592 -85101 -62032 -59802 -68285 -70799 -87146 -89073 -55201 -20319 29835
14208B9835J6300k7663j5431K57k0639k7484o140n39P431R874P236j0411k5456
$$ 29835 46135 18472 3041 3298 -17341 -44825 -50965 -51504 -44073 -34199 -26963 -37374 -62830
14195f2830m2443K7087M2547J2197N7624J1085k2613m8030j6702M1061L5774o58
$$ -62830 -105273 -78186 -35639 -23442 34182 45267 22654 -25376 -42078 -1017 34757 34099
14183C4099m6194k9722J15K1687k4692k9592R291M3715K1500m968J5170k014K3389
$$ 34099 -12095 -41817 -41702 -20015 -44707 -74299 -65008 -21293 207 -4761 10409 8395 31784
14170C1784N452L3970l1941m0650l3153l8366m627K2774J4884J3164J1806k2801
$$ 31784 37236 71206 39265 -1385 -34538 -72904 -77531 -54757 -39873 -26709 -14903 -37704
14158c7704L8375K4770j7989m993m065O484j1780k6690j2227K4056K4505M211
$$ -37704 671 25441 7452 2459 -1606 4878 -6902 -33592 -45819 -21763 2742 6953
14146F953J3447j5652k4481p223m632M607L5907J1407j6062M69K7132J6502j6233
$$ 6953 20400 4748 -19733 -26956 -31588 -26981 8926 20333 4271 4740 31872 48374 32141
14133C2141K44j8224L0799L3007K150J8046j8406n2646l3476N7420J3568n3737
$$ 32141 32385 14161 44960 77967 80117 98163 79757 27111 -6365 51055 64623 10886
14121A0886k1751m622J4041K8018J2411l0224j147M357K1424n581j0614k1990
$$ 10886 -10865 -15487 -1446 26572 38983 8759 7612 11969 33393 27812 17198 -4792
14109d792q619K2808K239k2226J5031J6625L024k2136k0810m0892n2689K7793
$$ -4792 -13411 9397 11636 -10590 4441 21066 24090 1954 -18856 -59748 -112437 -84644
14097h4644L2798J7879K310j5676M318Q81N870L293O17M533l554M2228K2122n174
$$ -84644 -51846 -33967 -31657 -47333 -43015 -42134 -36264 -32971 -32354 -27821 -31375 10853 32975 27801
14083B7801k8784m1534K1437L5855j8686n841K636j3209r750J4327k70m2233n645
$$ 27801 -983 -42517 -21080 14775 -3911 -9752 -7116 -20325 -30075 -15748 -16018 -58251 -63896
14070f3896J107O495J0092P122K4610j5856j8084j876L1151L7986M2945m88l6672
$$ -63896 -62789 -56294 -46202 -39080 -14470 -30326 -48410 -50286 -19135 18851 61796 61308 24636
14057B4636O928j9843l6172K1889q552j5222R259r857q01p619N071j0378K5448
$$ 24636 31564 11721 -24451 -2562 -11114 -26336 -17077 -26934 -27735 -35354 -30283 -40661 -15213
14044a5213L2641L1865k8373l7989J3274l1534l3034J2663K6232L1656K0119j3006
$$ -15213 17428 49293 20920 -17069 -3795 -35329 -68363 -55700 -29468 2188 22307 9301
14032I301j4892l370K1714J2919L331k4373k6910N50n719l37J9173M5654J4783
$$ 9301 -5591 -8961 12753 25672 29003 4630 -22280 -21730 -27449 -27786 -8613 37041 51824
14019E1824K444j6330j2689j8894J299j9789m2719N642k423J4052j6319j8506
$$ 51824 54268 37938 25249 6355 7654 -12135 -54854 -49212 -51635 -37583 -53902 -72408
14007g2408l3370K4597J7020m07L1077L1162J9887l1975j9542l8425r273J3344
$$ -72408 -105778 -81181 -64161 -64568 -33491 -2329 17558 -14417 -33959 -72384 -81657 -68313
13995f8313N820P7676J9899j3955k8199j1344P968k360P337R141J1666k914k6837
$$ -68313 -62493 15183 35082 21127 -7072 -18416 -10448 -12808 -5471 3670 15336 12422 -14415
13982a4415J0318K5468q274k3681j871K0209n628q733j0260K4316K3705K403q261
$$ -14415 -4097 21371 13097 -10584 -12455 7754 2126 -6607 -16867 7449 31154 33557 25296
13969B5296J881j3772L3o67k3164r457m036J1185K5783K1240J2559j571k1710
$$ 25296 27177 13405 13438 12771 -10393 -19850 -23886 -12701 13082 34322 46881 45310 23600
13956B3600j5562J5279j2194Q217l1587M927k9981K761K5396m3290l5085p763
$$ 23600 8038 23317 11123 19340 -12247 -7320 -37301 -34540 -9144 -52434 -87519 -95282
13944i5282R878N6531K5373q392l2126j8820j0930R611J1401J0469J6086J6033
$$ -95282 -85404 -28873 -3500 -11892 -44018 -62838 -73768 -64157 -52756 -42287 -26201 -10168
13932a0168K8766k8773K7307J9180r152Q575k0048k0593J1127k5669l8113J7692
$$ -10168 18598 -10175 17132 36312 27160 35735 15687 -4906 6221 -19448 -57561 -39869
13920c9869N152k036K192M00J7976J312r758m114J3149r752J3522j0088L5503
$$ -39869 -34717 -36753 -34561 -34161 -16185 -14873 -24631 -28745 -15596 -25348 -11826 -21914 13589
13907A3589K7791j4696l3484o300M582J633j6556j4034j027q51P201J7412J3362
$$ 13589 41380 26684 -6800 -13100 -8518 -6885 -23441 -37475 -38502 -39353 -32152 -14740 -1378
13894a378j0459o452j077N456o498J2134O69j0137k0355J886L9688M4475m4989
$$ -1378 -11837 -18289 -19366 -13910 -20408 -8274 -7605 -17742 -38097 -36211 3477 47952 2963
13881B963q64l9k2894J7719Q499l3782k4856K2887o634p948J2043K2396j2654
$$ 2963 2099 2060 -20834 -3115 5384 -28398 -53254 -30367 -37001 -44949 -32906 -10510 -23164
13868b3164j2788M821R4L1124M5431J469l1385l685J4295k1048P609j6402l828
$$ -23164 -35952 -31131 -31037 87 45518 46987 15602 11917 26212 5164 12773 -3629 -7457
13855g457k0532j3461K0465J8327k692Q271M1201K2453j8958m665j4278R019j7911
$$ -7457 -27989 -41450 -20985 -2658 -5350 2921 44122 66575 47617 42952 28674 37693 19782
13842A9782l8664m1139q847L3137K6019K0305j264k0705J5250J9871J0030m606
$$ 19782 -18882 -60021 -68868 -35731 -9712 10593 9329 -11376 3874 23745 33775 29169
13830B9169k9896j4549J7749R170j4804j1693L1136N1952N829K5978l3705J391
$$ 29169 -727 -15276 2473 11643 -3161 -14854 16282 68234 74063 100041 66336 67727
13818F7727k0186j8644k6834k9624J143M2383J7361j7620l0184L3988J2000k7623
$$ 67727 47541 28897 2063 -27561 -26418 15965 33326 15706 -14478 19510 31510 3887
13806C887P259K0118K4720L4967r975l0403k0767k4436m140k378J646n170J3561
$$ 3887 11146 31264 55984 90951 80976 50573 29806 5370 1230 -1148 498 -4672 8889
13793H889J483K1639j4905j2293J4791K1636j9646r822J0325M5468l033j7375
$$ 8889 10372 32011 17106 4813 19604 41240 21594 11772 22097 67565 64532 47157
13781D7157k5626n452O504k6053K5737L4322k9055m4842r054J2672J0439J9216
$$ 47157 21531 16079 22583 -3470 22267 56589 27534 -17308 -26362 -13690 -3251 15965
13769A5965L6931k874k8811p778j4746L1234K6727J247l1650k901P265k5308l2717
$$ 15965 52896 50022 21211 13433 -1313 29921 56648 57895 26245 23344 30609 5301 -27416
13756b7416N329K4815P70l7084l3931L1470O575k5698j3310M0169M2634k1350
$$ -27416 -22087 2728 3498 -33586 -67517 -36047 -29472 -55170 -68480 -28311 14323 -7027
13744g027l0796o096K7025P056p358q054j3939O563P493O626K2749J1632K9651
$$ -7027 -37823 -43919 -16894 -9838 -17196 -25250 -39189 -32626 -25133 -18507 4242 15874 45525
13731D5525L471j3993l9696P567L3188j5910J8154K5270n164j0627M153m1870
$$ 45525 48996 35003 -4693 2874 36062 20152 38306 63576 58412 47785 51938 10068
13719A0068k8773l5686j5439K9118L1680j1829k7347l4439L0340M2144J9321o656
$$ 10068 -18705 -54391 -69830 -40712 -9032 -20861 -48208 -82647 -52307 -10163 9158 2502
13707B502k4372l8740K1054L0208j6686L93J078k3962L4359L2660P069J3109K3016
$$ 2502 -21870 -60610 -39556 -9348 -26034 -25641 -24563 -48525 -14166 18494 25563 38672 61688
13694F1688j3884m7146J291O360j506J9121J6997l3754P041K7542q859m7512K4959
$$ 61688 47804 658 1949 8309 6803 25924 42921 9167 16208 43750 34891 -12621 12338
13681A2338q288o2474j5106J9154k1215k1749L2646K0998l989J2286j487J3550
$$ 12338 4050 -58424 -73530 -54376 -75591 -97340 -64694 -43696 -47685 -35399 -36886 -23336
13669b3336K4802J2794P852j7907l3084K491N9221K5379j2623J4742J3285j0999
$$ -23336 1466 14260 22112 4205 -28879 -26388 32833 58212 45589 60331 73616 62617
13657F2617k6879l9793l6552n555N132l0745l9494j5971M0311K8437L399k2262
$$ 62617 35738 -4055 -40607 -46162 -41030 -71775 -111269 -127240 -86929 -58492 -55093 -77355
13645g7355K0269L0855R096l507L4822R713K3310j5008l3128l5622n035r665k1314
$$ -77355 -57086 -26231 -17135 -20642 14180 23893 47203 32195 -933 -36555 -41590 -51255 -72569
13632g2569J630K3755j9814K8052J4340M652L3496J4408m479j3933O392k1743
$$ -72569 -70939 -47184 -66998 -38946 -24606 -19954 13542 27950 23471 9538 15930 -5813
13620e813n0810J1277P8617j4460k6339J520p86J8325l1121L1389R572K360l7702
$$ -5813 -56623 -45346 33271 18811 -7528 -6008 -6794 11531 -19590 11799 21371 23731 -13971
13607a3971l5348L1262M7574q844J0113j6030j0400l646m9780k8899k68M3992
$$ -13971 -49319 -18057 29517 20673 30786 14756 4356 710 -49070 -77969 -78237 -34245
13595c4245O286j3314P658J9292J0646l4740q798N978J973L9L4864L1377J842
$$ -34245 -27959 -41273 -33615 -14323 -3677 -38417 -47215 -41237 -39264 -39225 -4361 27016 28858
13582B8858k5859o795K5606m666j0627J2125Q495K465k8653l809J9250j4607O654
$$ 28858 2999 -3796 21810 17144 6517 18642 27137 29602 949 -2860 16390 1783 8437
13569H437J2129N176k1185P335j0457j1140j1216J3983j0180r550K2243R488m511
$$ 8437 20566 25742 4557 11892 1435 -9705 -20921 -6938 -17118 -26668 -4425 5063 552
13556E52R815j0118o515j2649k7082M0545J5434j6877J8674j5141K728L9814l0602
$$ 552 10367 249 -6266 -18915 -45997 -5452 9982 -6895 11779 -3362 -634 39180 8578
13543H578l454k0562j3415L7772L1096o972l8384j0370K101k8650j9723m673K3243
$$ 8578 5124 -15438 -28853 8919 40015 33043 -5341 -15711 -13610 -42260 -61983 -66656 -43413
13530d3413R971k709K6237k289Q248P28K443l5227j5667J1440J4459J3413J0497
$$ -43413 -33442 -36151 -9914 -12203 -3955 -3227 -784 -36011 -51678 -40238 -25779 -12366 -1869
13517a869K0363j3404J722M491m1823j9604J7424L5333J6773k4175l1821J5295
$$ -1869 18494 5090 6812 11303 -30520 -50124 -32700 2633 19406 -4769 -36590 -21295
13505b1295J1757k4798p201n321K4312k4777L3618J4651j2581J4375J0124j1269
$$ -21295 -9538 -34336 -41537 -46858 -22546 -47323 -13705 946 -11635 2740 12864 1595
13493A595N525j4177l983O928k8840o879K3597J016k407K95R026L991j3003n082
$$ 1595 7120 -7057 -11040 -4112 -32952 -39831 -16234 -15218 -17625 -17330 -8304 -4313 -17316 -22398
13479b2398k8981j8268J7520J4306K8789J4366J2707l0121l2694K0520L3857j6654
$$ -22398 -51379 -69647 -52127 -37821 -9032 5334 18041 -12080 -44774 -24254 9603 -7051
13467g051j0643N514J3842K7281n617m7513j5537n205J0031J3793J1728P3116
$$ -7051 -17694 -12180 1662 28943 23326 -24187 -39724 -44929 -34898 -21105 -9377 63739
13455F3739K2266k2679m5224J0960M3600j8660l7976N6138K7474l6441j9391k787
$$ 63739 86005 63326 18102 29062 72662 54002 16026 72164 99638 63197 43806 41019
13443D1019J0823l5550l3855j5560n002M556o839L3410K8760j0623J3343L77l3421
$$ 41019 51842 16292 -17563 -33123 -38125 -33569 -40408 -6998 21762 11139 24482 24859 -8562
13430h562M547J0896R531k0174q804K2031q33J0133n274m2934M724J5322J9684
$$ -8562 -4015 6881 16412 -3762 -12566 9465 8632 18765 13491 -29443 -24719 -9397 10287
13417A0287O004J3939P256k3685l6530K4147j8897m895J2858o303k4950j8911
$$ 10287 16291 30230 37486 13801 -22729 1418 -17479 -22374 -9516 -15819 -40769 -59680
13405e9680r588L6252j86L529L6637M4368n35L419l525l2437R965K936k0906k0309
$$ -59680 -69268 -33016 -33202 -29673 6964 51332 50797 54216 50691 18254 28219 31155 10249 -10060
13391a0060n333J1988j4089L918K2053J0299j7918k7254J4499K1284J825M916
$$ -10060 -15393 -3405 -17494 -13576 8477 18776 858 -26396 -11897 9387 11212 16128
13379A6128J5601K7776J6109o810j7411n853k4724k8994q851K4277j8996k947
$$ 16128 31729 59505 75614 68804 51393 45540 20816 -8178 -17029 7248 -11748 -14695
13367a4695J2837K412m0922j4773J4661L8539K0095j2083j0020L829J7484k3999
$$ -14695 -1858 554 -40368 -55141 -40480 -1941 18154 6071 -3949 -120 17364 -6635
13355f635l3110l5435J9492K9990K8916K9952j4463k6171l028m849j2435L3341
$$ -6635 -39745 -75180 -55688 -25698 3218 33170 18707 -7464 -10492 -15341 -27776 5565
13343E565J2493K8132L6490m1326l4156J7594M451m9309r096K0775j0050J0869
$$ 5565 18058 46190 82680 41354 7198 24792 29243 -20066 -29162 -8387 -18437 -7568
13331g568J3923j0838j5131j1599O007N282L639k399K1452J9769N450J9918M930
$$ -7568 6355 -4483 -19614 -31213 -25206 -19924 -16285 -18684 2768 22537 27987 47905 52835
13318E2835m2587R18J3872j6252K437J3906k1358K0076L5045N707k3224j4291
$$ 52835 10248 11166 25038 8786 11223 25129 3771 23847 58892 64599 41375 27084
13306B7084j299o117j7294l1203j4303M7112M2353o892N811K6175n005n090k1525
$$ 27084 25785 19668 2374 -28829 -43132 3980 46333 39441 45252 71427 66422 61332 39807
13293C9807j9050P081k9015k3535k2128L5272K7915m28m4865n5899J1296j604
$$ 39807 20757 27838 -1177 -24712 -46840 -11568 16347 15919 -28946 -84845 -73549 -75153
13281g5153M8198M0749J8664l1021m0003L5528O0112k1566k1481m2509K1810j1760
$$ -75153 -26955 13794 32458 1437 -38566 -3038 57074 35508 14027 -28482 -6672 -18432
13269a8432j2110R606j102J582l3940J4301J6023j9464Q381M8889K6363J4105
$$ -18432 -30542 -20936 -22038 -20456 -54396 -40095 -24072 -43536 -35155 13734 40097 54202
13257E4202J893P049l3986k5780o664j4552K3685N8750L8236J3990m1518o9171
$$ 54202 56095 63144 29158 3378 -3286 -17838 5847 64597 102833 116823 75305 6134
13245F134r870K9508K2641j0148j1975r583k315J7823j3045k8590J2139J2544
$$ 6134 -3736 25772 48413 38265 26290 16707 14392 32215 19170 -9420 2719 15263
13233A5263K0449J5235J0085j1332l2475J1987R917m0632j0405m392k1771M2851
$$ 15263 35712 50947 61032 49700 17225 29212 39129 -1503 -11908 -16300 -38071 4780
13221D780P066r814J0912J7408Q870k2035J3219j414l5502R931K7876O681j5262
$$ 4780 11846 2032 12944 30352 39222 17187 30406 28992 -6510 3421 31297 37978 22716
13208B2716l6131R476R150j8904L660L0905j6113j9000o993K9841M8314P452l7194
$$ 22716 -13415 -3939 5211 -13693 -10033 20872 4759 -14241 -21234 8607 56921 64373 27179
13195B7179M800j7957K3086j5225k3664l067J6019J8954p957k0311Q077k23K5778
$$ 27179 31979 14022 37108 21883 -1781 -4848 11171 30125 22168 1857 9934 9711 35489
13182C5489J9959l541r300j4213l253j5541k5738j1092o590J8698L4725k6820
$$ 35489 55448 51907 42607 28394 25141 9600 -16138 -27230 -33820 -15122 19603 -7217
13170g217k2946K7321r561o041L0785J8703l783k6847M989k0041n789K386P237
$$ -7217 -30163 -2842 -12403 -18444 12341 31044 27261 414 5403 -14638 -20427 -18041 -10804
13157a0804K7408j5082p824N42K207J9549K552k964r77k909k2350K275j0816k3798
$$ -10804 16604 1522 -6302 -5760 -3553 15996 18548 15584 14607 11698 -10652 -8377 -19193 -42991
13143d2991j5837P791M9443L9856J2234m8974j7123J3034K9082o0237m3025j2097
$$ -42991 -58828 -51037 -1594 38262 50496 1522 -15601 -2567 26515 -33722 -76747 -88844
13131h8844J7654N4813K0115J5569j1186k470j1154r463o93j1559j8689L788J6817
$$ -88844 -71190 -16377 3738 19307 8121 5651 -5503 -14966 -15659 -27218 -45907 -42119 -25302
13118b5302k218m044J326j6979P33L7664K9094j5872j5009j7917j8074J0034N275
$$ -25302 -27520 -31564 -30238 -47217 -46484 -8820 20274 4402 -10607 -28524 -46598 -36564 -31289
13105c1289o78N92L466o481j0273J8616j0376K983M0877L5165j2624k0773K0874
$$ -31289 -31967 -31375 -27909 -34390 -44663 -26047 -36423 -33440 7437 42602 29978 9205 30079
13092C0079J1369k2356j7728K2965K8838l005k4917J2213K0543j1761k3298k0366
$$ 30079 41448 19092 1364 24329 53167 50162 25245 37458 58001 46240 22942 2576
13080B576p706J851J0348P663J2149J2833k5497l4630O340M26M185p941m726l139
$$ 2576 -5130 -3279 7069 14732 26881 39714 14217 -20413 -14073 -13647 -9462 -17403 -22129 -25268
13066b5268N5631l30l7231M556n266o6540j9043M5423O776J3752Q90J1466K1448
$$ -25268 30363 30033 -7198 -2642 -7908 -74448 -93491 -48068 -41292 -27540 -26650 -15184 6264
13053F264p375j0975j7809m5340r951M8583j755K8768m788j6395M2272L0839l6950
$$ 6264 -1111 -12086 -29895 -75235 -85186 -36603 -38358 -9590 -14378 -30773 11499 42338 5388
13040E388K3209L4941k762j0530m1916k5674K9973J1562j0285n907J3230K2940
$$ 5388 28597 63538 60776 50246 8330 -17344 12629 24191 13906 7999 21229 44169
13028D4169J2517N847k893l0581k1269k87k1951l4965j8023j238L2400O0473K4933
$$ 44169 56686 62533 59640 29059 7790 7503 -14448 -49413 -67436 -68674 -36274 24199 49132
13015D9132p614j6716j4234k5205j8717L436M2428L8779k8069l5208M530k7801
$$ 49132 41518 24802 10568 -14637 -33354 -29918 12510 51289 23220 -11988 -7458 -35259
13003c5259l185L3963M2516j6226k2496k2154K0260K1203J5009K989m3048J165
$$ -35259 -38444 -4481 38035 21809 -687 -22841 -2581 18622 33631 36620 -6428 -5263
12991e263R356o889K885K222k0195j3261O6575K0854r571j5063j1631J0609K6590
$$ -5263 4093 -2796 89 2311 -17884 -31145 35430 56284 46713 31650 20019 30628 57218
12978E7218m420o106J8423l5628l8628q901J9801L9006Q611J7616k972k509l7112
$$ 57218 52798 46692 65115 29487 -9141 -18042 1759 40765 49376 66992 64020 61511 24399
12965B4399k6564l464j4739K5174N941P05J3280o280q865k0157k6485j0568J6414
$$ 24399 -2165 -5629 -20368 4806 10747 11452 24732 18452 9587 -10570 -37055 -47623 -31209
12952c1209K7259N233N209L7004K1542k1021j4817j1280j5243n872J7478J477
$$ -31209 -3950 1283 6492 43496 65038 44017 29200 17920 2677 -3195 14283 15760
12940A5760J0455j7632J540J7018m4143k5505K3389J2722k331M9320K1255l2174
$$ 15760 26215 8583 10123 27141 -17002 -42507 -19118 -6396 -8727 40593 61848 29674
12928B9674j1471j3764k3834J7490J7014K501J8323p664l172j1569k1192l359
$$ 29674 18203 4439 -19395 -1905 15109 17610 35933 28269 25097 13528 -7664 -11023
12916a1023J6097M7500N718J1928l0769k5981o974N629J7512l665l9902j3368
$$ -11023 5074 52574 58292 70220 39451 13470 6496 12125 29637 25972 -13930 -27298
12904b7298k9279K5945K7320k619j8920K0917J1854J4395p789l4955k6599J2605
$$ -27298 -56577 -30632 -3312 -5931 -24851 -3934 7920 22315 14526 -20429 -47028 -34423
12892c4423L051r589J739O234J9573J1311L4436L8893q069j1164m3087q647L4063
$$ -34423 -31372 -40961 -39222 -32988 -13415 -2104 32332 71225 63156 51992 8905 258 34321
12879C4321J4172j4964l7005n792j0310K6211k019J0588K7964J0872l80l0134
$$ 34321 48493 33529 -3476 -9268 -19578 6633 4614 15202 43166 54038 53658 23524
12867B3524j6995P453J7616L3805R925N65l0352q838K5997j7989l2749N354K0092
$$ 23524 6529 13982 31598 65403 75328 75893 45541 36703 62700 44711 11962 17316 37408
12854C7408J8844Q581l4926J2536R35m8363m8515J0512K7865K3264J5077R060
$$ 37408 56252 64833 29907 42443 43378 -4985 -53500 -42988 -15123 8141 23218 32278
12842C2278j6850r15k694l7330P917K3818J151j2093L6309K5986J943k7908k4311
$$ 32278 15428 14513 11819 -25511 -17594 6224 7375 -4718 31591 57577 59520 31612 7301
12829G301j5011r766L057L2461O184J738K3820m3958J740o724n1323R460j4921
$$ 7301 -7710 -17476 -14419 18042 24226 25964 49784 5826 7566 842 -50481 -41021 -55942
12816e5942J6696L3562K9841K5998M40l2694j3449K8238Q949P466J7844l8352
$$ -55942 -39246 -5684 24157 50155 50595 17901 4452 32690 41639 49105 66949 28597
12804B8597n0614R924L9746j0678k1483r237M578n640J131K2927J4769K9736k6235
$$ 28597 -22017 -12093 27653 16975 -4508 -13745 -9167 -14807 -13676 9251 24020 53756 27521
12791B7521J710L7703m285l6456Q353k2346r539K3485j4178r084J5490k0126r47
$$ 27521 29231 66934 62649 26193 34546 12200 2661 26146 11968 2884 18374 -1752 -2699
12778b699K0371M409l807J9509J1734m2581K0730K0182k7523J85L577N84o851
$$ -2699 17672 22081 18274 37783 49517 6936 27666 47848 20325 20510 24087 24671 17820
12765A7820j1340j1590P195j7720R577N566K3135Q911L2782Q512P284j001J0256
$$ 17820 6480 -5110 2085 -15635 -6058 -492 22643 31554 64336 72848 80132 79131 89387
12752H9387o075K7950m9090j6251j9977r359J4211p352O878r113j0227N838l112
$$ 89387 83312 111262 62172 45921 25944 16585 30796 23444 30322 21209 10982 16820 13708
12739A3708R326j5383n658N14Q856K0680P417k5456K7065J5979j9145P115o174
$$ 13708 23034 7651 1993 2507 11363 32043 39460 14004 41069 57048 37903 45018 38844
12726C8844k6132j8692P140k4067J1489K5361p686J0938K3791r562J3589L756
$$ 38844 12712 -5980 1160 -22907 -11418 13943 6257 17195 40986 31424 45013 48769
12714D8769p263R27L3973N3091k6980k8001j9529J0902L7276L8790L9332N8737
$$ 48769 41506 42433 76406 129497 102517 74516 54987 65889 103165 141955 181287 240024
12702B40024J19253K26469L68106M16730L53063K49867j7507k48174l25985l70728
$$ 240024 359277 585746 953852 1370582 1723645 1973512 1956005 1707831 1381846 1011118
12692A011118l65885k15084r7666n4579o8160l2776k5894l7804j7742p767o338
$$ 1011118 645233 430149 332483 277904 209744 176968 151074 113270 95528 87761 81423
12681H1423J8212l439l6950k6670m814K2602k6897l1236m631K4879M3522K2209
$$ 81423 99635 96196 59246 32576 27762 50364 23467 -7769 -12400 12479 56001 78210
12669G8210k1020K5063k1653l2053l2923j105p690L1652K0366L619J1354J9507
$$ 78210 57190 82253 60600 28547 -4376 -5481 -13171 18481 38847 42466 53820 73327
12657G3327N825k0841p218P381J9157J0537j6712l0854M3208K8505M0538q239
$$ 73327 79152 58311 51093 58474 77631 88168 71456 40602 83810 112315 152853 144614
12645A44614j1293M041m4335P757K1895n828k4128K47l3569m4651Q275N3514M4920
$$ 144614 133321 137362 93027 100784 122679 116851 92723 92970 59401 14750 23025 76539 121459
12632A21459J1967J9268N270L884R385N4168L7257N3859Q0480O8738R2473J37208
$$ 121459 133426 152694 157964 161848 171233 225401 262658 316517 396997 465735 558208 695416
12620F95416J73993K57851L85857N42851P50201R73341J137018J229836J093742
$$ 695416 869409 1127260 1513117 2055968 2806169 3779510 4916528 6146364 7240106
12611G240106P99358L47954p6822n90501r41655j114513j106823r65020p99383
$$ 7240106 8039464 8387418 8310596 7720095 6778440 5663927 4557104 3592084 2792701
12602B792701o28070m53874l13076k86845j93610j24835j23803j16100k5612k1243
$$ 2792701 2164631 1710757 1397681 1110836 917226 792391 668588 552488 526876 505633
12592E05633n4276p9066j5436m3916l8321J609m330m180m6894k4277k5161m0222
$$ 505633 451357 372291 356855 312939 274618 276227 271897 267717 220823 196546 171385 131163
12580A31163m224k629K8899n243J0283j968M142P062j0476j5430o4381j8293J4979
$$ 131163 126939 124310 153209 147966 158249 156281 160423 167485 157009 141579 77198 58905 73884
12567G3884k6375L801M2443j069j6935k7110l1042J0712R436L1585q273J5913
$$ 73884 47509 51310 93753 92684 75749 48639 17597 28309 37745 69330 61057 76970
12555G6970L4900l1977l0284j3169N156K46J378n544M978L927l8362K069J7661
$$ 76970 111870 79893 49609 36440 41596 41842 43220 37676 42654 46581 8219 10288 27949
12542B7949m56j4542l3381L728J1222l1606L4282J976OR572k3595l364K2713j0061
$$ 27949 27493 12951 -20430 -16702 -5480 -37086 -2804 -828 -822 8750 -14845 -18209 4504 -5557
12528e557N573O536R541K2587J2870k1282j4861k4679j8725j1503o794o756J4594
$$ -5557 16 6552 16093 38680 51550 30268 15407 -9272 -27997 -39500 -46294 -53050 -38456
12515c8456O5966M1587k9905l1193p889J0403J7999Q971J5656J0007M419j4692
$$ -38456 27510 69097 39192 7999 110 10513 28512 37483 53139 63146 67565 52873
12503E2873j7546k7264M373L5710r628j9089k1550M3776K6545j6289o590k3117
$$ 52873 35327 8063 12436 48146 38518 19429 -2121 41655 68200 51911 45321 22204
12491B2204m903J3128L5799N716j9625j2031J0027L221l0139k3681J0353k0592
$$ 22204 17301 30429 66228 71944 52319 40288 50315 53536 23397 -284 10069 -10523
12479a0523n021P169L4124q596j496J4278L231m2186k1383L2085L2163k122k3645
$$ -10523 -15544 -8375 25749 17153 15657 29935 33166 -9020 -30403 1682 33845 31723 8078
12466H078J2960R106j2265p105K3866K2524L0383j3000n1550m2545j5713K3788
$$ 8078 21038 30144 17879 10774 34640 57164 87547 74547 22997 -19548 -35261 -11473
12454a1473J7998K0449L2268j1794k4674p439j9974L1525K3847k2159m598M22
$$ -11473 6525 26974 59242 47448 22774 15335 -4639 26886 50733 28574 23976 24398
12442B4398J4379j8804j8844K4194L4723L422J9095r0o8l1541m6280J8009P778
$$ 24398 38777 19973 1129 25323 60046 63468 82563 82473 82405 50864 4584 22593 30371
12429C0371J2324N44l034k869j6068j5379o626N443L2044K259L3076l216o5932
$$ 30371 42695 43239 40205 37336 21268 5889 -737 4706 36750 39009 72085 68869 2937
12416B937k199K9011J5553L3880r144k7492m059J6305m735j1631K568j2942n091
$$ 2937 738 29749 45302 79182 70038 42546 38487 54792 50057 38426 40994 28052 22961
12403B2961L9958O60j9054L334o880J8587O907l638k7639Q2Q506k8339m8349j6359
$$ 22961 62919 63579 44525 47859 40979 59566 66473 62835 35196 35278 43784 15445 -32904 -49263
12389d9263L8297N3552J2747k414J2677j705j6058m3885l1957L0650J3048J8062
$$ -49263 -10966 42586 55333 52919 65596 63891 47833 3948 -28009 2641 15689 33751
12377C3751J6952p837J2574P433n0342J5922J2728l6692J8166k1138o935L3627
$$ 33751 50703 42866 55440 62873 12531 28453 41181 4489 22655 1517 -5418 28209
12365B8209J3204j6818M15j2064Q943n987n6509l060J6577N3655J0317j019L352
$$ 28209 41413 24595 25010 12946 21889 15902 -40607 -43667 -27090 26565 36882 35863 39215
12352C9215K872K7138J1931j6247k1269l1166j3460J9063L6053J2468j1220Q294
$$ 39215 42087 69225 81156 64909 43640 12474 -986 18077 54130 66598 55378 63672
12340F3672j8401M5462O745o1555m9332L1995L1984j8863j4971K666j3779k7217
$$ 63672 45271 90733 97478 35923 -13409 18586 50570 31707 16736 19402 5623 -21594
12328b1594r024J3969J2160N664J4707J4212j7083m6386j9707k9177K4732J2285
$$ -21594 -30618 -16649 -4489 1175 15882 30094 13011 -33375 -53082 -82259 -57527 -45242
12316d5242j7517K7867K6558K6569J7980K702J5923N164k0878l643K3463k5731
$$ -45242 -62759 -34892 -8334 18235 36215 38917 54840 60004 39126 35483 58946 33215
12304C3215m9140j6596L4360J935k5203M0769M5856P058k552o612Q993j1189m2603
$$ 33215 -15925 -32521 1839 3774 -21429 19340 65196 72254 69702 63090 72083 60894 18291
12291A8291J4746K9572K5824k7892j7536P522J5815M9476k9885k3495n475J4931
$$ 18291 33037 62609 88433 60541 43005 50527 66342 115818 85933 62438 56963 71894
12279G1894j4960J6017K5625J3518J7024o020j4459j0768k6052j4415r725k3900
$$ 71894 56934 72951 98576 112094 129118 123098 108639 97871 71819 57404 47679 23779
12267B3779K162n415k6115L0496N8807j2303j6532J3226j5610L533K2407K1904
$$ 23779 25941 20526 -5589 24907 83714 71411 54879 68105 52495 56028 78435 100339
12255A00339j4856k5635l0812J20P311K4067J9080j9253M281o475K9366K9905
$$ 100339 85483 59848 29036 29156 36467 60534 79614 60361 64642 58167 87533 117438
12243A17438L58j3687k0253j1778R929j7840j0041k8966k4893J5175J820L9547
$$ 117438 117796 104109 83856 72078 82007 64167 54126 25160 267 15442 17262 56809
12231E6809L7952j2652l0995j3182q924o623J4627M6963L9170j3679n707p832
$$ 56809 94761 82109 51114 37932 29008 22385 37012 83975 123145 109466 103759 95927
12219I5927Q123L0999j7022j1778K4401n731J2033J5672L2295K003n3214n6467
$$ 95927 104050 135049 118027 106249 130650 124919 136952 152624 184919 186922 133708 77241
12207G7241o6671k5408j3153l4796k3477L8203J7850j2601N949K8313L1050J5710
$$ 77241 10570 -14838 -27991 -62787 -86264 -48061 -30211 -42812 -36863 -8550 22500 38210
12195C8210K7114K1733k477j0845k594J9141M703k113J323m685n1236n0162L7948
$$ 38210 65324 87057 84580 73735 71141 90282 94985 92872 94195 89510 38274 -11888 26060
12182B6060M0115J6748J5371j3082k9035N425Q829j9287l8515L155l48O4994L7336
$$ 26060 66175 82923 98294 85212 56177 61602 70431 51144 12629 15784 15436 80430 117766
12169A17766j4954M625k9353q202J7491r281j5873O553m6753q465P218l7447J7064
$$ 117766 102812 107437 78084 69882 87373 78092 62219 68772 22019 13554 20772 -16675 389
12156C89N6439L1923m53n672M4147L2749L773K2928O5027N3593K0381K7648j1432
$$ 389 56828 88751 88298 82626 126773 159522 163295 186223 251250 304843 325224 352872 341440
12143C41440n2537j2032k1324m5504m6182k0413k735k4074k1590r727j792L6175
$$ 341440 288903 276871 255547 210043 163861 143448 140713 116639 95049 85322 83530 119705
12131A19705K1803j6406n4142k6784J0380p812R909R289j5675J4939L5821N088
$$ 119705 141508 125102 70960 44176 54556 46744 56653 65942 50267 65206 101027 106115
12119A06115l3472j034M4379J7969K583Q398j8818n5668J956J2381J387q755L0255
$$ 106115 72643 71609 115988 133957 136540 144938 126120 70452 72408 84789 86176 77421 107676
12106A07676M7602K5287K6456m62n087L7498N4133K3005k5126l5617j0630l4255
$$ 107676 155278 180565 207021 206559 201472 238970 293103 316108 290982 255365 244735 210480
12094B10480k2589J5278Q44m4107m6576m6365M162L335l3744K078J4069J997J0234
$$ 210480 187891 203169 204013 159906 113330 66965 71127 74462 40718 42796 56865 58862 69096
12081F9096r016k6485j1526L8480J0829K6714P304P215M249K9150L2386N7394
$$ 69096 60080 33595 22069 60549 71378 98092 105396 112611 116860 146010 178396 235790
12069B35790L1009P136q553N354N4946N9427K7760N8744J01870K79690M47777
$$ 235790 266799 273935 265382 270736 325682 385109 412869 471613 573483 853173 1300950
12058A300950M80977L90431K91864Q7241k03122m03299m38683m46061l58695k42888
$$ 1300950 1781927 2172358 2464222 2551463 2348341 1945042 1506359 1060298 701603 458715
12048D58715j37055n6534m0524o4391k3209j0590j3293J3295k6549j5499p316
$$ 458715 321660 265126 224602 160211 137002 126412 113119 126414 99865 84366 77050
12037G7050K7935K8936J0984J1664k4890q660k3385Q501K7823L6568R940L364
$$ 77050 104985 133921 144905 156569 131679 123019 99634 108135 135958 172526 182466 185830
12025A85830R48Q4369J3493m3061m5545l2806J2672n8445n8119r46l4828j406
$$ 185830 186778 271147 284640 241579 196034 163228 175900 117455 59336 58390 23562 22156
12013B2156J8164O6564J2659k5270L3359O0370p261k7436J5710k5495l17j3717
$$ 22156 40320 106884 119543 94273 127632 188002 180741 153305 169015 143520 143203 129486
12001A29486K7475J8935j0647l441K1327K9642K669r13J9982J8312k774p770P690
$$ 129486 156961 175896 165249 161808 183135 212777 215446 214533 234515 252827 250053 242283 249973
11988B49973O596q551m331J3696k1785k8815m9327m0819M058P5212J0874j4981
$$ 249973 256569 248018 243687 257383 235598 206783 157456 116637 120695 195907 206781 191800
11976A91800k4121L672L630J3824K4429L14j203M6299M3653K4102m546j5276j6922
$$ 191800 167679 171351 174981 188805 213234 213548 212345 258644 302297 326399 321853 306577 289655
11963B89655m9711J8246N1954k3276K6680M5810J3342J9420N7020N9536N2293
$$ 289655 239944 258190 310144 286868 313548 359358 372700 392120 449140 508676 560969
11952E60969J0662L3223P4469J5056j115k8780J2424K2540L0360J1533L4461Q0956
$$ 560969 571631 604854 679323 694379 693264 664484 676908 699448 729808 741341 775802 856758
11940H56758O8459J6042N010M278L9243P4648Q4252O3724N9127O6038K2422L2800
$$ 856758 925217 941259 946269 950547 989790 1064438 1148690 1212414 1271541 1337579 1360001 1392801
11928A392801K9576Q2434J01953J13529J61415J29034J82486K22071K71415L44062
$$ 1392801 1422377 1504811 1606764 1720293 1881708 2010742 2193228 2415299 2686714 3030776
11918C030776L46217M37186N41590O39342P84381J009917J230982J353636J513258
$$ 3030776 3376993 3814179 4355769 4995111 5779492 6789409 8020391 9374027 10887285
11909A0887285J677197K060303K667889L654788N258194P873325J2681095K2541560
$$ 10887285 12564482 14624785 17292674 20947462 26205656 34078981 46760076 69301636
11901F9301636M2760739O9513320P8650177O6244845M0202709k826957m8135175
$$ 69301636 112062375 181575695 260225872 326470717 366673426 363846469 315711294
11894C15711294p0192279o9224874n7128246l8152802k2273552j3562862r080104
$$ 315711294 245519015 176294141 119165895 81013093 58739541 45176679 36096575
11887C6096575o453667m726648l455053k476313j754914j400722j283416j258280
$$ 36096575 29642908 24916260 21461207 18984894 17229980 15829258 14545842 13287562
11879A3287562j281488j301647j224123j074417q34483o64432n63935m56074n03519
$$ 13287562 12006074 10704427 9480304 8405887 7571404 6906972 6343037 5886963 5383444
11870E383444m36918l55317l42739k63501k18307k32618k28284k65952k69361
$$ 5383444 4946526 4591209 4248470 3984969 3766662 3534044 3305760 3039808 2770447
11861B770447k31357j04996j20500j18569j25958j20048j04509r3697j00716r8521
$$ 2770447 2539090 2434094 2313594 2195025 2069067 1949019 1844510 1750813 1650097 1551576
11851A551576n9067o2247o1438l7042m9390p0291o3648l2613n8284m6658L653
$$ 1551576 1492509 1430262 1368824 1331782 1282392 1212101 1148453 1115840 1057556 1010898 1014551
11840A014551n6232p9249l2541k9647m3431l9503L2665K3107k6402o6829m2859
$$ 1014551 958319 879070 846529 816882 773451 733948 766613 789720 763318 696489 653630
11829F53630J6390k0912l9495k2191m1864o7566J7974o380k5533k8012m7050n3388
$$ 653630 670020 649108 609613 587422 545558 477992 495966 489586 464053 436041 388991 335603
11817C35603j6132k007q851o095J4776O744j0435k6295l7917n4817m9275J0461
$$ 335603 319471 317464 308613 302518 317294 324038 313603 287308 249391 194574 145299 155760
11805A55760k0765m0533p770j2251p161N982k7583L6986N6906K0797m264m382
$$ 155760 134995 94462 86692 74441 67280 73262 45679 82665 139571 160368 156104 151722
11793A51722K831K2690L0561J6159k3019j1256m126K1416Q108N95R69l576k4826
$$ 151722 154553 177243 207804 223963 200944 189688 185562 206978 215086 215681 216650 213074 188248
11780A88248K535m203Q102J9444J2922L6666r150k9411p8571n4093m2320k0590
$$ 188248 190783 186580 194682 214126 227048 263714 254564 225153 146582 92489 50169 29579
11768B9579K1763J4259Q481j1582L7512J4953r788J8121J099k6798k5487M531
$$ 29579 51342 65601 74082 62500 100012 114965 105177 123298 124397 97599 72112 76643
11756G6643j854K8277L9193m862k4227J089M03L5566K7363L1489L067n5102q1120
$$ 76643 74789 103066 142259 137397 113170 114259 114662 150228 177591 209080 212147 157045 75925
11743G5925p2279n4904n894J26841L26872M84913M69430L36187J07903j39248
$$ 75925 3646 -51258 -57152 69689 396561 881474 1350904 1687091 1794994 1655746
11733A655746l34348l94774l22853k09818j26819j24903o0481l3427J2001L914
$$ 1655746 1321398 926624 603771 393953 267134 142231 81750 48323 60324 64238
11723F4238o0548j0438J3181J8298J1505j3501J3168N2231J9655k1466j7263J6369
$$ 64238 3690 -6748 6433 24731 36236 22735 35903 88134 107789 86323 69060 85429
11711H5429n337l4808J2321K1838J3074l6504m236O28j2580r543Q007M177j500
$$ 85429 80092 45284 57605 79443 92517 56013 51777 52405 39825 30282 38289 42466 40966
11698D0966k747j0097m8027j7386m88j4150q93J790J7078K4458N6273k97l3940
$$ 40966 38219 28122 -19905 -37291 -37779 -51929 -52822 -51032 -33954 -9496 46777 46480 12540
11685A2540k1502K022L8003J1206J2581j20n3262j1362J819k293j2814q1766k473
$$ 12540 -8962 -6940 31063 42269 54850 54730 1468 -9894 -8075 -10368 -23182 -104948 -107421
11672a07421M0240K7475K6267L91K3488J5412j3445k1104k4815j985L0777L1715
$$ -107421 -67181 -39706 -13439 -13048 10440 25852 12407 -8697 -33512 -35497 -4720 26995
11660B6995R205J3617J4904J4502l9577j5668j5639m4654k1325J4508J4632J3470
$$ 26995 36200 49817 64721 79223 39646 23978 8339 -36315 -57640 -43132 -28500 -15030
11648a5030J0198J5847K8103K4358O186o896l8476L5615J789l1536j5887L1658
$$ -15030 -4832 11015 39118 63476 69662 62766 24290 59905 61694 30158 14271 45929
11636D5929l294n543k2366k7789L396K9628j2566j5513j5393j4782m230R080J5880
$$ 45929 42635 37092 14726 -13063 -9667 19961 7395 -8118 -23511 -38293 -42523 -33443 -17563
11623a7563L0557L4459j6222j1204J2235k3866m7682K0037J1316l2785N356J2346
$$ -17563 12994 47453 31231 20027 32262 8396 -39286 -19249 -7933 -40718 -35362 -23016
11611b3016M626L996k4356Q842m189O247k0452n852l028L9011O307j4127L0570
$$ -23016 -18390 -14394 -38750 -29908 -34097 -27850 -48302 -54154 -57182 -18171 -11864 -25991 4579
11598D579K9364j2108j3248K0838K9375K0388K9739k1049k2627K2648M2150J86
$$ 4579 33943 21835 8587 29425 58800 79188 108927 87878 65251 87899 130049 130235
11586A30235m3960n1915J4694k7903q3404j4334j7307j5910n025J0407P641K9505
$$ 130235 86275 34360 49054 21151 -62253 -76587 -93894 -109804 -114829 -104422 -96781 -67276
11574f7276L2077K1278m331j3740L3214J1494j4011k5726J9507K7946k5655p734
$$ -67276 -35199 -13921 -18252 -31992 1222 12716 -1295 -27021 -7514 20432 -5223 -12957
11562a2957J9610K3083m004O013k1683Q048L8521K017l6372l6176k2343m4774
$$ -12957 6653 29736 25732 31745 10062 18110 56631 58648 22276 -13900 -36243 -81017
11550h1017l5086K5708L1827r81L4823N6000M9039Q703q769j2128l6366J7358
$$ -81017 -116103 -90395 -58568 -59549 -24726 31274 80313 89016 80247 68119 31753 49111
11538D9111l651R389j5660L010j2376j2904m463j1244l123k0792J3102K7518j2011
$$ 49111 45460 54849 39189 42199 29823 16919 12456 1212 -1911 -22703 -9601 17917 5906
11525E906J5781J653o7490o066L1455L1790R311m5020k284k1631l422N527j0943
$$ 5906 21687 23340 -44150 -50216 -18761 13029 22340 -22680 -24964 -46595 -50017 -44490 -55433
11512e5433r364L45J7182O063k6537N0242N7927O589M206m617J1996L31j4979
$$ -55433 -64797 -64452 -47270 -41207 -67744 -17502 40425 47014 51220 46603 58599 58930 43951
11499D3951J0496N7504K6303L2240L8984N4037P2104Q7755K15017L58533O34339
$$ 43951 54447 111951 138254 170494 209478 263515 335619 423374 638391 996924 1631263
11488A631263R10122J000524P58903J50079m22259p66438r01262p67847n00431
$$ 1631263 2541385 3541909 4300812 4450891 4028632 3262194 2360932 1593085 1092654
11479A092654l46277k15184j15684p5777m4977n1462p0400p355m104k4445m254
$$ 1092654 746377 531193 415509 339732 294755 243293 172893 165538 161434 136989 132735
11468A32735K805m9244l2640O511J5412L852k8548M430N354j209R876J8888j3318
$$ 132735 135540 86296 53656 60167 75579 79431 50883 55313 60667 59458 69334 88222 74904
11455G4904m5186o5889j1669J1317o876j4120N211J7690l661J3158M1388L1670
$$ 74904 29718 -36171 -47840 -36523 -43399 -57519 -52308 -34618 -38279 -25121 16267 47937
11443D7937l4161n687j8398j6996K539o212J7213K855j4873R236L9072L4262N7093
$$ 47937 13776 8089 -10309 -27305 -24766 -30978 -13765 -10910 -25783 -16547 22525 56787 113880
11430A13880L9488J3213L2476l009o7023l8771l6372j8521J9668j2215j3276l8596
$$ 113880 153368 166581 199057 196048 129025 90254 53882 35361 55029 42814 29538 -9058
11418i058j8430N507R079J834L5868r795k8668m1744M0703J5615P068K9507q687
$$ -9058 -27488 -21981 -12902 -11068 24800 15005 -13663 -55407 -14704 911 7979 37486 28799
11405B8799n922l4753l0686K0224N224o762j3717J7610K4612M365r708j6167J1204
$$ 28799 22877 -11876 -42562 -22338 -17114 -23876 -37593 -19983 4629 8994 -714 -16881 -5677
11392e677M783k8446k3579Q172q812P62j3885K8148L7378k8541N247k0069K9674
$$ -5677 -894 -29340 -52919 -44747 -53559 -52797 -66682 -38534 -1156 -29697 -24450 -44519 -14845
11379a4845L8162O937k3440k9333k8237k949J7209K0866M8117P679k2217j9525
$$ -14845 23317 30254 6814 -22519 -50756 -53705 -36496 -15630 32487 40166 17949 -1576
11367a576k429p708j9318m1972J3860J5967J1928k5472k2141J3038Q029p8L5318
$$ -1576 -4005 -11713 -31031 -73003 -59143 -43176 -31248 -56720 -78861 -65823 -57794 -57872 -22554
11354b2554L3850k9318j3252K5085p399q219K4245j4574o2726j1864P667J5399
$$ -22554 11296 -18022 -31274 -6189 -13588 -21807 2438 -12136 -74862 -86726 -79059 -63660
11342f3660J8523N1917K8851j5795k1090P391n4296k6553J9198J9920K4636R748
$$ -63660 -45137 6780 35631 19836 -1254 6137 -48159 -74712 -55514 -35594 -10958 -1210
11330a210j2158j7470L992K0545j3232j3778l2497L023p690j5301L3573J0930
$$ -1210 -13368 -30838 -26846 -6301 -19533 -33311 -65808 -62785 -70475 -85776 -52203 -41273
11318d1273J137N077R576J0746k3672k3372k1311j691J3143L1610J3864K3392
$$ -41273 -40136 -35059 -25483 -14737 -38409 -61781 -83092 -84783 -71640 -40030 -26166 -2774
11306b774J0562J4771j6758L774l723r604p502j6926N196J2507L7018J370J6295
$$ -2774 7788 22559 5801 9575 5852 -3752 -11254 -28180 -22984 -10477 26541 27911 44206
11293D4206N4063K0137L2824k0261l8742m0635j7574R228O454P782k0740p349
$$ 44206 98269 118406 151230 130969 92227 51592 34018 43246 49700 57482 36742 29393
11281B9393j5025j4937k890j5459O40M1407J2773J8172j5685R517j8972L916n362
$$ 29393 14368 -569 -3459 -18918 -18278 23129 35902 54074 38389 47906 28934 32850 27488
11268B7488J8195J7023k0672o439k5367j370J8420k7994j9434p99N756l0832J685
$$ 27488 45683 62706 42034 35595 10228 8858 27278 -716 -20150 -20949 -15193 -46025 -44340
11255d4340J8468J3699l5088j8568K4685K0267k6955K1643J6204J225J1492j4061
$$ -44340 -25872 -12173 -47261 -65829 -41144 -20877 -47832 -26189 -9985 -8760 2732 -11329
11243a1329R799K9215j1156k8655l0180L9101M4687k5705j4678j2837j0203J8006
$$ -11329 -1530 27685 16529 -12126 -42306 -3205 41482 15777 1099 -11738 -21941 -3935
11231c935M4446K4785L4748M952l8291K429J0105j1718k4712m276j8529m359k2053
$$ -3935 40511 65296 100044 104996 66705 69134 79239 67521 42809 38533 20004 15645 -6408
11218f408J098j3316J667L5913l4453m9425K9312O8136L1194j2178l4952R7m351
$$ -6408 -5310 -18626 -16959 18954 -15499 -64924 -35612 32524 63718 51540 16588 16685 12334
11205A2334k0048j252J380J5725l6113j2900j4373M631J0572k5422l9710M3102
$$ 12334 -7714 -8966 -7586 8139 -27974 -40874 -55247 -50616 -40044 -65466 -105176 -62074
11193f2074M2684L6656K5518k7952o718J0896j5328j4240K6215L1115J6666k0597
$$ -62074 -19390 17266 42784 14832 8114 19010 3682 -10558 15657 46772 63438 42841
11181D2841l989J6257j4533J3442M4755K1373P007P200j475j2658l6693r145q203
$$ 42841 38852 55109 40576 54018 98773 120146 127153 134353 132878 120220 83527 74382 66179
11168F6179l3123N055K9491j262n2722m5295k031m230L8849L4217J068M414j7604
$$ 66179 33056 38111 67602 66340 13618 -31677 -33708 -37938 911 35128 36196 40610 23006
11155B3006k6794K4305R360j5344n317K713K225j5333M0345j0753K064P680n8268
$$ 23006 -3788 20517 29877 14533 9216 11929 14154 -1179 39166 28413 30477 38157 -20111
11142b0111l6979K6631K2642r743J4671J0065m762m7884m4171K8750M9983O8025
$$ -20111 -57090 -30459 -7817 -17560 -2889 7176 2414 -45470 -89641 -60891 -10908 57117
11130E7117L440l147k8240k8214j6371J6362J3933j9325n81Q609n987K264J6830
$$ 57117 60557 57410 29170 956 -15415 947 14880 -4445 -5026 3583 -2404 -140 16690
11117A6690j2589J7145p076P662q637q526l9165q816M7457M6240J2557l0114j2253
$$ 16690 4101 21246 14170 21832 13195 4669 -34496 -43312 4145 50385 62942 32828 20575
11104B0575J0938L5475Q144K4066K2236K8695K1877L1279R2759J73858L23637
$$ 20575 31513 66988 75132 99198 121434 150129 172006 203285 296044 469902 793539
11093G93539M13058L88603K86271J05654j22570l32469l89334l50046k67153j73133
$$ 793539 1206597 1595200 1881471 1987125 1864555 1532086 1142752 792706 525553 352420
11083C52420o1461o6108p5413k1822Q62J1419Q539j5285o4106l9086k0294K0625
$$ 352420 290959 224851 149438 127616 128478 139897 148436 133151 69045 29959 9665 30290
11071C0290L2000K590J1667l5753m9153j62K0071O089K552l3702R796M5633J6256
$$ 30290 62290 64880 76547 40794 -8359 -8521 11550 17639 20191 -13511 -3715 41918 58174
11058E8174M844k7653r042j9466j7693K6159N664K5121j7392l1315P757o747r168
$$ 58174 63018 35365 26323 6857 -10836 15323 20987 46108 28716 -2599 5158 -1589 -10757
11045a0757J8687J808R465J9836J5907l5660m891r988j5559K2408P738l328l64
$$ -10757 7930 9738 19203 39039 54946 19286 14395 4407 -11152 11256 18994 15666 15302
11032A5302J2702o68k8780N24K1134k8541k0077j3792L2355K2502l562K243k7592
$$ 15302 28004 27336 -1444 -920 20214 -8327 -28404 -42196 -9841 12661 9099 11342 -16250
11019a6250m6295m1532J1159K8553O517P348K4609K395L0849j4336m5040o2616
$$ -16250 -62545 -104077 -92918 -64365 -57848 -50500 -25891 -23496 7353 -6983 -52023 -114639
11007a14639J9323L6609K1930N468k561M615j1546o937M061K8556K7245k6159
$$ -114639 -95316 -58707 -36777 -31309 -33870 -29255 -40801 -47738 -43677 -15121 12124 -14035
10995a4035j3479K854K8276j5981k9216p880J2836N862k6727J6581Q899Q409l8459
$$ -14035 -27514 -24660 3616 -12365 -41581 -49461 -36625 -30763 -57490 -40909 -32010 -23601 -62060
10982f2060n894l144K9259N1624k333j8336K6157L452j8898k6360m1245N7196
$$ -62060 -67954 -71098 -41839 9785 7452 -10884 15273 18725 -173 -26533 -67778 -10582
10970a0582K6564k3143o264M554q944J1312M2282P637l1907j3037J397J3007J1309
$$ -10582 15982 -7161 -13425 -8871 -17815 -6503 35779 43416 11509 -1528 -131 12876 24185
10957B4185K771k5110j992l991J1354l4729R006N5828L2035n8026O621M9087j3542
$$ 24185 26956 1846 -146 -4137 7217 -27512 -18506 37322 69357 11331 17952 67039 53497
10944E3497m9476l698m857q95K0076O968K2566O007r464Q413o577p763n3927k2199
$$ 53497 4021 323 -4534 -5429 14647 21615 44181 50188 40724 49137 42560 34797 -19130 -41329
10930d1329J4382J977j6009K2402M1187M716J4723J7552o557o790k0208m2599
$$ -41329 -26947 -24970 -40979 -18577 22610 27326 42049 59601 53044 46254 26046 -16553
10918a6553L960J4421J4972j4893l2200K6543J0703j1675q399L8061L9810O043
$$ -16553 -12593 1828 16800 1907 -30293 -3750 6953 -4722 -13121 24940 64750 70793
10906G0793M0632l7316m3282k8935m0046j1050k005k0301M5923M2611L748J3820
$$ 70793 111425 74109 30827 1892 -38154 -49204 -51209 -71510 -25587 17024 20772 34592
10894C4592J0676J6716J6823Q083j4419k3230l9032j8647M576J0003J1105q890
$$ 34592 45268 61984 78807 86890 72471 49241 10209 -8438 -3862 6141 17246 8356
10882H356K3650k0112q73l290K2550Q566m321J0777j146K631k8964P009K1245
$$ 8356 32006 11894 11021 7731 30281 38847 34526 45303 44157 46788 17824 24833 46078
10869D6078k2034l5574j9494j2212J5827J8790R211r611J570K2169J977k0036
$$ 46078 24044 -11530 -31024 -43236 -27409 -8619 592 -9019 -7449 14720 16697 -3339
10857c339K5070J8542o268J2250J7256j154k8334M224J5538p818l0283N283L9186
$$ -3339 21731 40273 34005 46255 63511 62357 34023 38247 53785 45967 15684 20967 60153
10844F0153L6316R427n7872j0696N799m9874k9418L8945K2238j109m1596K8210
$$ 60153 96469 105896 48024 37328 43127 -6747 -36165 2780 25018 23909 -17687 10523
10832A0523K6168K0457j2477q551K7369J8594J5658J7061K3827Q923O995M029
$$ 10523 36691 57148 44671 36120 63489 82083 97741 114802 138629 147552 154547 158576
10820A58576j8556n859J2186j0446m6110k4900K4175K9755l113J4155L7504J548
$$ 158576 140020 134161 146347 135901 89791 64891 89066 118821 115708 129863 167367 168915
10808A68915k5749J169L6341L5495L3549N209N8631P2921O5505P0172P5444J07479
$$ 168915 143166 144335 180676 216171 249720 254929 313560 386481 451986 522158 597602 705081
10796G05081J10249J18007J47169J83877L22366M33181N77592Q31782J160290
$$ 705081 815330 933337 1080506 1264383 1586749 2019930 2597522 3429304 4589594
10787D589594J436268J735859J903377J957772J778436J349683P63088R8548o01698
$$ 4589594 6025862 7761721 9665098 11622870 13401306 14750989 15514077 15612625 15010927
10778A5010927j197726j633653j850640j849183j667645j419349j141989q79620
$$ 15010927 13813201 12179548 10328908 8479725 6812080 5392731 4250742 3371122
10770C371122o43352m72344l74403k66874k08728j84704r9352j10752r7869j09039
$$ 3371122 2727770 2255426 1881023 1614149 1405421 1220717 1121365 1010613 912744 803705
10760H03705j01236m7816l7354l3972o2142n5556j4454j5070Q527k5545l4765
$$ 803705 702469 654653 617299 583327 521185 465629 451175 436105 444632 419087 384322
10749C84322j7202k9396l7478n5617k8791l5127L043L9673m273m0054j2529J4924
$$ 384322 367120 337724 300246 244629 215838 180711 183754 223427 219154 179100 166571 181495
10737A81495M988M026j1015j9672M9922K2218K0439M7251J9127L769m997j5864
$$ 181495 186483 190509 179494 159822 209744 231962 252401 299652 318779 322548 317551 301687
10725C01687q428j9474j9174j2653n8187k543k0158l1836k3578L528R469j699
$$ 301687 293259 273785 254611 241958 183771 181228 161070 129234 105656 109184 118653 116954
10713A16954j9080k6359M7974J6563j3438j8108o951n32M1419p43p5441l699N3728
$$ 116954 97874 71515 119489 136052 122614 104506 97555 97023 138442 137699 62258 58559 112287
10700A12287J6329l0883k7896K34O809J1530K0158L7230n496m2188j0894r148
$$ 112287 128616 97733 69837 70071 76880 88410 108568 145798 140302 98114 87220 78072
10688G8072K1417j4993o274K0815J5045P948j8176j7677J0080m092L245l8471
$$ 78072 99489 84496 78222 99037 114082 122030 103854 86177 96257 92165 95410 56939
10676E6939L1439l919k329k2136k8194L3913L5357L0058l6712k4919j1733k2063
$$ 56939 88378 84459 82130 59994 31800 65713 101070 131128 94416 69497 57764 35701
10664C5701j6968j3270J8749P0J9677L347p818j1240N527K3087J4147j2928P10
$$ 35701 18733 5463 24212 24282 43959 47306 39488 28248 33775 56862 71009 58081 58791
10651E8791o593k5102K5202k7580k7383p279j4613K1143J0762K4746K7637q50
$$ 58791 52198 27096 52298 24718 -2665 -9944 -24557 -3414 7348 32094 59731 58881
10639E8881l1026K406p161J5418j362k3369M0589P718M109J290k6979j9225o886
$$ 58881 27855 30261 23100 38518 37156 13787 54376 62094 66203 67493 40514 21289 14403
10626A4403J2963j7472j4955J9357q183o3380L1479K9680j0714k9149K5999m716
$$ 14403 27366 9894 -5061 14296 6113 -57267 -25788 3892 -6822 -35971 -9972 -14688
10614a4688N318m39m105j9929m5507J6462M0638J6320J9174P906l3076k2721K2286
$$ -14688 -9370 -9809 -13914 -33843 -79350 -62888 -22250 -5930 13244 21150 -11926 -34647 -12361
10601a2361J7971L4656k0796J9328J2631m476k6338j8594p441j324N680P916L755
$$ -12361 5610 40266 19470 38798 51429 46953 20615 2021 -5420 -6744 -1064 6852 10607
10588A0607K373m5791n332j2845K9039L3147k4856J1759L7959N638k0159k351
$$ 10607 12980 -32811 -38143 -50988 -21949 11198 -13658 -1899 36060 41698 21539 19188
10576A9188p496l3521o069K4041r301k866l9317J5948L1052L106Q247J1681j0476
$$ 19188 11692 -21829 -27898 -3857 -13158 -16024 -55341 -39393 -8341 -5235 3012 14693 4217
10563D217j5074k1286L7165K7868k247m0877r761M99J1805r993j1333m441J4008
$$ 4217 -10857 -32143 5022 32890 30643 -10234 -19995 -19496 -7691 -17684 -29017 -33458 -19450
10550a9450J8940j9498j070J0728p777j6651K2004L5378P626j7871m8373j1114
$$ -19450 -510 -20008 -21078 -10350 -18127 -34778 -12774 22604 30230 12359 -36014 -47128
10538d7128K9027K4023k0511j5087j7005M354L7819L3951J9323l3718j1320k3299
$$ -47128 -18101 5922 -14589 -29676 -46681 -42327 -4508 29443 48766 15048 3728 -19571
10526a9571N267k685k9324O5095J4115o9378L884K6014j4144o594k074K5975j2705
$$ -19571 -14304 -16989 -46313 18782 32897 -36481 -32597 -6583 -20727 -27321 -29395 -3420 -16125
10513a6125J196j0391q414l909K5317m555L6063L0546k6527k8574j0516J9152
$$ -16125 -14929 -25320 -33734 -37643 -12326 -16881 19182 49728 23201 -5373 -15889 3263
10501C263r620l464o636K2790Q870j3547k9172n181J6746L5359j1283M815j607
$$ 3263 -6357 -9821 -16457 6333 15203 1656 -27516 -32697 -15951 19408 8125 12940 11333
10488A1333k3316j5966J9465J7887R79n489n578K6790J1566K7j2890j5034O268
$$ 11333 -11983 -27949 -8484 9403 10382 4893 -685 26105 37671 37698 24808 9774 16042
10475A6042m0127k3964J0208N8733K106q182M225J8489j2806R742J9313K8698
$$ 16042 -24085 -48049 -37841 20892 22998 14816 19041 37530 24724 34466 53779 82477
10463H2477Q603L0337M6312J5769k7830j037j796l2564j2484P031j3118o5422
$$ 82477 91080 121417 167729 183498 155668 154631 152835 120271 107787 114818 101700 36278
10451C6278l8938K1797J2630J661j7759m4694j0954K380L0705j4080j6892J2548
$$ 36278 -2660 19137 31767 33428 15669 -29025 -39979 -37599 -6894 -20974 -37866 -25318
10439b5318l782l5211J8282N3180K8717j3872J8547K8131J0156l5147m0909j3245
$$ -25318 -29100 -64311 -46029 7151 35868 21996 40543 68674 78830 43683 2774 -10471
10427a0471J5941J9592M598l990j8391L929l598N963l7810j8086J6376J8188J5569
$$ -10471 5470 25062 29660 25670 7279 11208 7610 13573 -24237 -42323 -25947 -7759 7810
10414G810j4259o228K8854m251k7066j9318p297L5052j5999K9116j2218k8986
$$ 7810 -6449 -12677 16177 11926 -15140 -34458 -41755 -6703 -22702 6414 -5804 -34790
10402c4790M036R466P730J777K5836J6084j6497k198P851m123m9006j0097K0471
$$ -34790 -30754 -21288 -13558 -11781 14055 30139 13642 11444 19295 15172 -33834 -43931 -23460
10389b3460M4639K694K6655K3395q347J088L621O518J2547k4854m8140m0430j5289
$$ -23460 21179 23873 50528 73923 65576 66664 70285 76803 89350 64496 16356 -24074 -39363
10376c9363K1545L9268L27j7238j8142j1729j2065j345K4160K9924q650k6341
$$ -39363 -17818 21450 21777 4539 -13603 -25332 -37397 -38742 -14582 15342 6692 -19649
10364a9649j7839R526R385r549l4929j5217k3824N4377P7887J0626k4106j4154
$$ -19649 -37488 -27962 -18577 -28126 -63055 -78272 -102096 -47719 30168 40794 16688 2534
10352B534P927J4314N218J3274J4352n54j8709k6113K5535J4832l3710j1386L321
$$ 2534 10461 24775 29993 43267 57619 57065 38356 12243 37778 52610 18900 7514 10835
10339A0835L51L1612l5434k0610j9919K1893L2539R449k949n7506p536M0091O5806
$$ 10835 11186 42798 7364 -13246 -33165 -11272 21267 30716 27767 -29739 -37275 2816 68622
10326F8622K5011n818l9375O556L5652L3563L592o752L8921K1572K8457P5492
$$ 68622 93633 87815 48440 54996 90648 124211 127803 121051 159972 181544 210001 285493
10314B85493Q6725J05712Q4437M6512N5615O1963q701k4621L2686l9001o3719
$$ 285493 372218 477930 562367 608879 664494 726457 717756 693135 725821 686820 623101
10303F23101j10429q8888k7855l1545n3086p5770m0965l5660l3681L3061q907
$$ 623101 512672 423784 395929 364384 311298 235528 194563 158903 125222 158283 149376
10292A49376m234L1487L6969K3316O7121O2983L7836M0184O5535M2546l4555r4893
$$ 149376 145142 176629 213598 236914 304035 367018 404854 445038 510573 553119 518564 423671
10280D23671o2893n3798n3627l4001k6858k2898j5580k535L4316M7941M1813M9497
$$ 423671 360778 306980 253353 219352 192494 169596 154016 151481 185797 233738 275551 325048
10268C25048O3669R2335Q5125K0205n112m6181q4754n7753n2280p7866o5056l3239
$$ 325048 388717 481052 566177 586382 581270 535089 450335 392582 340302 262436 197380 164141
10256A64141l660k276K3499K0453j0327n750J110j1281J9144M4412O1056J9998
$$ 164141 160481 158205 181704 202157 191830 186080 187190 175909 195053 239465 300521 320519
10244C20519j7664q573K0672O7563R8893Q5152J47648K01713J87021K40490K05405
$$ 320519 302855 294282 314954 382517 481410 566562 714210 915923 1102944 1343434 1548839
10233A548839K10452J74641J53257Q6395R043N192j4468l3017n9700j8185m407
$$ 1548839 1759291 1933932 2087189 2173584 2182627 2187819 2173351 2140334 2080634 2062449 2058042
10222B058042q8410j57288j16966m3012j77162j75351j38504j59831j76252j37240
$$ 2058042 1969632 1812344 1695378 1652366 1475204 1299853 1161349 1001518 825266 688026
10212F88026j20030r8368q9463l6931l9772m9045j0553o985k9506j8762K3053
$$ 688026 567996 469628 380165 343234 303462 254417 243864 236879 207373 188611 211664
10201B11664J0593l3557O402n7053m4284j8767L4432M969M116m394m814k7444
$$ 211664 222257 188700 195102 138049 93765 74998 109430 114399 118515 114121 109307 81863
10189H1863j2432R313J3142j1603k0994o999o78q031M2401M8290j4631k0577k8731
$$ 81863 69431 78744 91886 80283 59289 52290 51612 43581 85982 134272 119641 99064 70333
10176G0333o389l469j0691L2485K7127O014j2332n635L3928k0330p7695o198P81
$$ 70333 63944 60475 49784 82269 109396 115410 103078 97443 131371 111041 33346 27148 27929
10163B7929J3415O1504J9439N132l1098k6828j404L1901K5807j049M6648L9114
$$ 27929 41344 102848 122287 127419 96321 69493 68089 99990 125797 124748 171396 210510
10151B10510L3425O6449P6089P9638J02404J36310J97312J42716J20560J41166
$$ 210510 243935 310384 386473 466111 568515 704825 902137 1044853 1165413 1306579
10141A306579J01371O0134Q8529J16774J09235J22515P7233o601m5602j02101
$$ 1306579 1407950 1468084 1556613 1673387 1782622 1905137 1982370 1975769 1930167 1828066
10131A828066j10355o0561m9344q5765p4951m7421n9028o8898j23807j18079j19762
$$ 1828066 1717711 1657150 1607806 1522041 1447090 1399669 1340641 1271743 1147936 1029857 910095
10120I10095j11553j24732r0855q7828p5436n6248j7832j6038k0322m6986l4455
$$ 910095 798542 673810 582955 495127 419691 363443 345611 329573 309251 262265 227810
10109B27810o896k6121l3502K1047L4316O5036P9628J13206O2636n1110p0721
$$ 227810 220914 194793 161291 182338 216654 281690 361318 474524 537160 486050 415329
10098D15329l4450l872p3912o7774r004Q003l135k747r819K2776J8195K1556j6249
$$ 415329 380879 377007 303095 235321 226317 234320 231185 228438 218619 241395 259590 281146 264897
10085B64897k6770K1991Q1713M5014O3272P5896Q9809P7454M5487L4449K7485
$$ 264897 238127 260118 341831 386845 450117 526013 615822 693276 738763 773212 800697
10074H00697R0385P1238J25964J78900K60816L22992M69539P11833J128609J989626
$$ 800697 891082 962320 1088284 1267184 1528000 1850992 2320531 3032364 4160973 6150599
10064F150599L389256M602539M298560M757811N402396K022071q87516j590064
$$ 6150599 9539855 14142394 18440954 23198765 28601161 30623232 29735716 28145652
10056B8145652l747264m742600l741208k756365k350710k157616j766388j640288
$$ 28145652 24398388 19655788 15914580 13158215 10807505 8649889 6883501 5243213
10048E243213j305171q45516n48501l94958k83898k19144j29867j11053q1409
$$ 5243213 3938042 3092526 2544025 2149067 1865169 1646025 1516158 1405105 1323696
10039A323696q6524j09063j48489j02930n1243o6988p0851n0060n5526m6091l3361
$$ 1323696 1237172 1128109 979620 876690 825447 758459 687608 637548 582022 535931 502570
10028E02570l1612o6770m4285j3963l6291k1216k3963l1064j1551j0397j2125
$$ 502570 470958 404188 359903 345940 309649 288433 264470 233406 221855 211458 199333
10017A99333j4205n68Q418k6798j5811j7734j5840J1024P824m449q400l3793l1369
$$ 199333 185128 184560 192978 166180 150369 132635 116795 127819 135643 131194 122794 89001 57632
10004E7632R625q33L250j4233J3251k9008k500J7814L3660O252j5729j7492k4426
$$ 57632 67257 66424 69674 55441 68692 39684 37184 54998 88658 94910 79181 61689 37263
9991C7263l2978r852K6665K192J057r846k6443J8391L0145L9380l814j5397j8635
$$ 37263 4285 -5567 21098 23290 24347 14501 -11942 6449 36594 75974 72160 56763 38128
9978C8128J0738K8371l4978o6123j4107L4543J004j5955k415J9504L4013P785
$$ 38128 48866 77237 42259 -23864 -37971 -3428 -2424 -18379 -20794 -1290 32723 40508
9966D0508j0792m3478k2625O68j1716N93J9901K099K3281j0733k720J0214j4639
$$ 40508 29716 -13762 -36387 -35719 -47435 -46842 -26941 -24842 -1561 -12294 -15014 -4800 -19439
9953a9439L248M3004l8396j0796m075j7795J1159K8773J3418m5778l2670M040
$$ -19439 -16191 26813 -11583 -22379 -26454 -44249 -33090 -4317 9101 -36677 -69347 -65307
9941f5307L5932L1111N2625k9345j6594J0058k818n4916k9878K7438K2534L1069
$$ -65307 -29375 1736 54361 25016 8422 18480 15662 -39254 -69132 -41694 -19160 11909
9929A1909L0962J7469j2777N177n8422l5947L1804Q180N211K8034q705m8588j4816
$$ 11909 42871 60340 47563 52740 -5682 -41629 -9825 -1645 3566 31600 22895 -25693 -40509
9916d0509J4995r775k1903m422O4199M3281r629k8607o539j1470l803J3789j9528
$$ -40509 -25514 -35289 -57192 -61614 2585 45866 36237 7630 1091 -10379 -14182 -393 -19921
9903a9921m5346j8758L484L2739j0199J0800N7511K0731n1630j9347k771K8011
$$ -19921 -65267 -84025 -80541 -47802 -58001 -47201 10310 31041 -20589 -39936 -42707 -14696
9891a4696n693m3442p060N6989J8261k8408L085J4991q089j5657J3500L1732o088
$$ -14696 -20389 -63831 -70891 -13902 4359 -24049 -20964 -5973 -14062 -29719 -16219 15513 9425
9878I425j0161K247k007O333R993R610N252N121k1896l8803q010n488o263K1764
$$ 9425 -736 1511 -496 5837 15830 25440 30692 35813 13917 -24886 -32896 -38384 -44647 -22883
9864b2883j7397Q202M5941N1689L4853j1709j4751j3450K6872K615J6396l417
$$ -22883 -40280 -32078 13863 65552 100405 88696 73945 60495 87367 89982 106378 102961
9852A02961l1604m3901q943k3236k3904j1551J5982J5883J2970J2843J2182n0918
$$ 102961 71357 27456 18513 -4723 -28627 -40178 -24196 -8313 4657 17500 29682 -21236
9840b1236j8082J343K7827M4345K7907K8310l2098m0036k7829N131M734p23K3910
$$ -21236 -39318 -37975 -10148 34197 62104 90414 58316 18280 -9549 -4418 316 -407 23503
9827B3503k7276j447j0985J0339J2082j624j1868K5506M7187j9725l5501k4224
$$ 23503 -3773 -5220 -16205 -5866 6216 4592 -7276 18230 65417 45692 10191 -14033
9815a4033j3495k574j3176K333J1925p76L2086j2756K9727N4288k1660k0257j7908
$$ -14033 -27528 -30102 -43278 -40945 -29020 -29796 2290 -10466 19261 73549 51889 31632 13724
9802A3724Q489M0546j6434q613J8360m477j3184k9716o5376O345L2797K7566n03
$$ 13724 22213 62759 46325 37712 56072 51595 38411 8695 -56681 -50336 -17539 10027 9524
9789I524k4085j9089L7960L0494R623L684n042k331k9673j7393L632q176P075
$$ 9524 -14561 -33650 4310 34804 44427 48111 43069 40738 11065 -6328 -2696 -10872 -3797
9776c797K292M098m432n217j536J6319l1679J500R393l639M410K2929J1795k9808
$$ -3797 -1505 2593 -1839 -7056 -8592 7727 -23952 -22452 -13059 -16698 -12288 10641 22436 -7372
9762g372J1528R432p17k3205L0341l696N566L8769K9335j6655m6444j0913J5341
$$ -7372 4156 13588 12871 -10334 20007 16311 21877 60646 89981 73326 26882 15969 31310
9749C1310r312l3227Q617m741J6308J1267l0757k0090K1501J9168R847L4912k055
$$ 31310 21998 -11229 -2612 -7353 8955 20222 -10535 -30625 -9124 10044 19891 54803 52748
9736E2748R492Q607l4693L929K2999J1753j7855k7040l4716j5620j8569K816J4166
$$ 52748 62240 70847 36154 40083 63082 74835 56980 29940 -4776 -20396 -38965 -36149 -21983
9723b1983N3980k9719k8531J6818Q067k9063R958K7157R17O410J8700j6575m6436
$$ -21983 31997 2278 -26253 -9435 -1368 -30431 -20473 6684 7601 14011 32711 16136 -30300
9710c0300j9460O275l336L2797M3449k53N798l8328k8218m2211k0372j4395K7754
$$ -30300 -49760 -43485 -46821 -14024 29425 29172 34970 -3358 -31576 -73787 -94159 -108554 -80800
9697h0800M4225N47N586o59K3332P129L584P402p437K242J5852k082Q428J7197
$$ -80800 -36575 -36028 -30442 -31101 -7769 -640 2944 10346 2909 5151 21003 18921 27349 44546
9683D4546M1020M6571L7161J7665J5873Q138o687j4854n3860j7343j5595j7506
$$ 44546 85566 132137 169298 186963 202836 210974 204287 189433 135573 118230 102635 85129
9671H5129m5577n6069k0967M0319K3788n5200j3853P364M6480J8452j7562O113
$$ 85129 39552 -16517 -37484 2835 26623 -28577 -42430 -35066 11414 29866 12304 18417
9659A8417p232L7801N1226P090J7988P7717M5431m7118l5467o4914m4792J6807
$$ 18417 11185 48986 100212 107302 125290 203007 248438 201320 165853 100939 56147 72954
9647G2954L863j4674l8481K6023K5356j653J82l1641k0833l4235j7332R310n930
$$ 72954 76817 62143 23662 49685 75041 73388 73570 41929 21096 -13139 -30471 -21161 -27091
9634b7091p90J1859j0421R291L0669j9522o439K0179K6042k6374j4471J3511j7300
$$ -27091 -27881 -16022 -26443 -17152 13517 -6005 -12444 7735 33777 7403 -7068 6443 -10857
9621a0857j847J2722J9458L0032K04m1898k3872k7252L0988j4555l8393O371K6473
$$ -10857 -12704 18 19476 49508 49712 7814 -16058 -43310 -12322 -26877 -65270 -58899 -32426
9608c2426R439M885p867k2088j6075L8194L9495J3343J287j1693o510J7598r190
$$ -32426 -22987 -18102 -25969 -48057 -64132 -25938 13557 26900 28187 16494 9984 27582 18392
9595A8392k3182j5037K0403K0925J5271k0549K8371M634l5986k7061N983p30m1633
$$ 18392 -4790 -19827 576 21501 36772 16223 44594 49228 13242 -13819 -7836 -8566 -50199
9582e0199l105M1337L5196j249M306J1566J6422l5046m0812K073j2142P410M0185
$$ -50199 -53304 -11967 23229 21980 26286 37852 54274 19228 -21584 -19511 -31653 -24243 15942
9569A5942o739l6542J0943K7191L2641q68m1164Q545J9213r339j8747j4792J06
$$ 15942 9203 -27339 -16396 10795 43436 42568 1404 9949 29162 19823 1076 -13716 -13610
9556a3610j1451j3253j544M1338L2059k362k5057j4217k1925k8116J4430K6019
$$ -13610 -25061 -38314 -39858 1480 33539 31177 6120 -8097 -30022 -58138 -43708 -17689
9544a7689j5646j1692P241L3662p047J047M0038J0771k9528j3605j5116n0756
$$ -17689 -33335 -45027 -37786 -4124 -11171 -10124 29914 40685 11157 -2448 -17564 -68320
9532f8320j0640L1111J7344P452l326k571j8140q684O310K6902l427l99N0327
$$ -68320 -78960 -47849 -30505 -23053 -26379 -28950 -47090 -55774 -49464 -22562 -25989 -26388 23939
9519B3939J8105j3975K4040M64o507l0918k6869l528K0109M447J460J5401p783
$$ 23939 42044 28069 52109 52573 46066 15148 -11721 -15249 4860 9307 10767 26168 18385
9506A8385K5486j2520k7218q67j9476k1620M0071k6393k6743K1462N8649M7109
$$ 18385 43871 31351 4133 3266 -16210 -37830 2241 -24152 -50895 -29433 29216 76325
9494G6325j8090j4842r391R18k3829J811M893K3939Q684J8558J4228J0501k5040
$$ 76325 58235 43393 34002 34920 11091 12902 17795 41734 50418 68976 83204 93705 68665
9481F8665j7428j3014J9477N130q990j3163k2699j7776J4325N79j6023l9931J1924
$$ 68665 51237 38223 57700 62830 53840 40677 17978 202 14527 15106 -917 -40848 -28924
9468b8924J326N983J4885R259M873N259p22q807L283p053j6003q483J1554K8746
$$ -28924 -27598 -21615 -6730 2529 7402 12661 11939 3132 6415 -638 -16641 -25124 -13570 15176
9454A5176K7805O2954M369m2851k8307k6510j0764K5836j2844m1680j7757l0043
$$ 15176 42981 105935 110304 67453 39146 12636 1872 27708 14864 -26816 -44573 -74616
9442g4616J2452k109L402M0309J5022N221R257J7996j3072r391j0933M44K015
$$ -74616 -62164 -64273 -60871 -20562 -5540 -319 8938 26934 13862 4471 -6462 -6018 -4003
9429d003L7116k5483J7486L9153k8011m7053k4986J3239N0646J759m3050N834
$$ -4003 33113 7630 25116 64269 36258 -10795 -35781 -22542 28104 29863 -13187 -7353
9417g353L959l4422j5379K1205L4349L5856K0268l2015m4442J603O561L0185J0918
$$ -7353 -3394 -37816 -53195 -31990 2359 38215 58483 26468 -17974 -16371 -9810 20375 31293
9404C1293p374j2734q296k375J8026k0034J816K5569j3415j2618L7999J5361m3682
$$ 31293 23919 11185 2889 514 18540 -1494 322 25891 12476 -142 37857 53218 9536
9391I536m0305J8134K5206l0895m464n268r082l418m123K1753J0449P601K2254
$$ 9536 -30769 -12635 12571 -18324 -22788 -28056 -37138 -40556 -44679 -22926 -12477 -4876 17378
9378A7378M883K3303j1460k0503R643J3581j8458O892K3791J8089n79j0344n16
$$ 17378 22261 45564 34104 13601 23244 36825 18367 25259 49050 67139 66560 56216 55700
9365E5700k678J2585n122k5314k345r488J46J8837k1684o464K3867N720K2499
$$ 55700 53022 65607 60485 35171 32826 23338 23484 42321 20637 14173 38040 43760 66259
9352F6259K9644J2133j2054n1456k0968l2220K3867K7734K4589J183q52j4485
$$ 66259 95903 108036 95982 44526 23558 -8662 15205 42939 67528 68711 67859 53374
9340E3374M555J7454K1169J0576k913R634j1575l5038n0744j8230K2984L414J3275
$$ 53374 57929 75383 96552 107128 104215 113849 102274 67236 16492 -1738 21246 24660 37935
9327C7935J8687J505j5424j4758l7150k6013J1708L1001L6897N070k3576k773
$$ 37935 56622 58127 42703 27945 -9205 -35218 -23510 7491 44388 49458 25882 23109
9315B3109k4307j1858K9937M0634q255p781n422J746K22k2235L730o46j9235J1363
$$ 23109 -1198 -13056 16881 57515 49260 41479 36057 37803 38025 15790 19520 18874 -361 11002
9301A1002L1641K6180j884o0691K0083M2674j6662m592j5989J3334M47L7722N6825
$$ 11002 42643 68823 66939 6248 26331 69005 52343 47751 31762 45096 45543 83265 140090
9288A40090M0286j1359l0984m6548k1401r906j2086K5933J3168n7794l0274K6317
$$ 140090 180376 169017 138033 91485 70084 60178 48092 74025 87193 29399 -875 25442
9276B5442J8985K3207m4084l8497l1016K2115O7357J1829P167J6474q150o344
$$ 25442 44427 67634 23550 -14947 -45963 -23848 43509 55338 62505 78979 70829 64485
9264F4485J8694o819j5765k0559k0680L1109K6192K0255M6207J4204r350l2057
$$ 64485 83179 76360 60595 40036 19356 50465 76657 96912 143119 157323 147973 115916
9252A15916m4725k7885J2925K2823K6205Q89J0373J6868M122J3440k3818l9038
$$ 115916 71191 43306 56231 79054 105259 106148 116521 133389 137511 150951 127133 88095
9240H8095l3114J8999K4949J2812O628j8479J7478m301k2064l907j609p327M2219
$$ 88095 54981 73980 98929 111741 118369 99890 117368 113067 91003 87096 85487 78160 120379
9227A20379J9197j7661l3812J7517l670m8444k491p76N228m520m344j5723j4503
$$ 120379 139576 121915 88103 105620 101950 53506 51015 50239 55467 50947 46603 30880 16377
9214A6377k98k655j651J4548k7583R011J6847L7409j1686o211K7751q406j5176
$$ 16377 16079 13424 11773 26321 -1262 7749 24596 62005 50319 44108 71859 63453 48277
9201D8277n781J4613M765k2459J5057k2391K5126O1863L1728j2741k049j8112
$$ 48277 42496 57109 61874 39415 54472 32081 57207 119070 150798 138057 136008 117896
9189A17896R18k4989j4014Q586j0321j2845O424J168L1597o217q927l8768K5318
$$ 117896 118814 93825 79811 88397 78076 65231 71655 72823 104420 98203 89276 50508 75826
9176G5826J0051j221J0829J5104K1672m3856n0743K9970K3910J04m380k4479K646
$$ 75826 85877 84656 95485 110589 132261 88405 37662 67632 91542 91646 87266 62787 65433
9163F5433K587n978k4247j0541l3051L3332O5075K6587k9399n427j8544l1904
$$ 65433 68020 62042 37795 27254 -5797 27535 92610 119197 89798 84371 65827 33923
9151C3923k8656r075J2368J5761P248L847L4964K5339j9541Q341k6458n2002j6109
$$ 33923 5267 -3808 8560 24321 31569 35416 70380 95719 76178 84519 58061 6059 -10050
9138a0050K3509N3891K2209k705j1855N771j2542k6290n248K0246k0453L9516
$$ -10050 13459 67350 89559 86854 74999 80770 68228 41938 36690 56936 36483 75999
9126G5999J5639l4119k304m477O779j5461J0684M0632M764m3542l5769o077L4838
$$ 75999 91638 57519 55215 50738 57517 42056 52740 93372 98136 54594 18825 12748 47586
9113D7586Q983o616j3315j1531j1861k207K4353j4717K9338M8585J7204N1979
$$ 47586 56569 49953 36638 25107 13246 11039 35392 20675 50013 98598 115802 167781
9101A67781j4727k009K027j1331j2636j6802n574L5926L0416K1830J6218l725
$$ 167781 153054 151045 153072 141741 129105 112303 106729 142655 173071 194901 211119 207394
9089B07394r664J7610M2480l223m085M8154N9834K6158P8937P0881J22291J50213
$$ 207394 197730 215340 257820 254597 250512 298666 358500 384658 463595 534476 656767 806980
9077H06980J96137K85427M46491P63685J366991K632952L598002J839196o02334
$$ 806980 1003117 1288544 1735035 2498720 3865711 6498663 10096665 11935861 11333527
9068A1333527j786401k667516k376003j485663p89589m70722l16530j95194j14448
$$ 11333527 9547126 6879610 4503607 3017944 2228355 1757633 1441103 1245909 1131461
9059A131461o2295n358J34934K59118L79545L45469P0964k45873l55621l72513
$$ 1131461 1069166 1063808 1198742 1457860 1837405 2182874 2253838 2007965 1652344 1279831
9049A279831l43721j94204j27973j42993q6573m7103l6307m1834k2831L0381K3919
$$ 1279831 936110 741906 613933 470940 384367 337264 300957 259123 236292 266673 290592
9038B90592j5628j5799j4366k6373o766K6231L0558j9823J631k3321l5334j408
$$ 290592 274964 259165 244799 218426 211660 237891 268449 248626 250257 226936 191602 190194
9026A90194k5233O0K788q812m0501k5329k96R821J5991j1811o331K2885L6310
$$ 190194 164961 165021 167809 158997 118496 93167 92871 102692 118683 106872 100541 123426 159736
9013A59736K0451J0751j2922N637R049l4686j0471K1628L837J0113k267J8542
$$ 159736 180187 190938 178016 183653 192702 158016 147545 169173 173010 183123 180856 199398
9001A99398L3991K6777N09L0164K7600q046L798r253l1365l6912m0341n829q897
$$ 199398 233389 260166 260675 290839 318439 310393 314191 304938 273573 236661 196320 190491 181594
8988A81594j5051j6997Q933k2868k47j4682k5562L2826J6129l4293m9069J6107
$$ 181594 166543 149546 158479 135611 135364 120682 95120 127946 144075 109782 60713 76820
8976G6820k3009k7531L6735L0168M369k7281p338j7486J4397J5956K1515j4611
$$ 76820 53811 26280 63015 93183 97552 70271 62933 45447 59844 75800 97315 82704
8964H2704O144K0941k2612K510q801l667m0398m202M2482J9434Q671J4117j630
$$ 82704 88848 109789 87177 89687 80886 77219 36821 32619 75101 94535 103206 117323 115693
8951A15693j7642K0971q805k8656n097J3528j1023M708o031j6216j1780J6979
$$ 115693 98051 119022 110217 81561 76464 89992 78969 83677 77646 61430 49650 66629
8939F6629K280j5697K516K3906k0172J388J5661K5229L2717K7287J793P41n4573
$$ 66629 68909 53212 55728 79634 59462 60850 76511 101740 134457 161744 163537 164278 109705
8926A09705J917k4898j399J950j7211k4444P143J0140K0820J5677M471K4211J439
$$ 109705 111622 86724 85325 87275 70064 45620 52763 62903 83723 99400 103871 128082 129521
8913A29521l7010l0432r453m279R93K1426J2379L745l3789m8444l6322J2580M4577
$$ 129521 92511 62079 52626 48347 49340 70766 83145 86890 53101 4657 -31665 -19085 25492
8900B5492N4180M371l0663j3048k1902k208L7163l027L5622K1107L679k9918k5856
$$ 25492 79672 84043 53380 40332 18430 16222 53385 50358 85980 107087 110766 80848 54992
8887E4992Q467j8363J646J3054k0093m3950M2968N7117L177n155m1815O10J9161
$$ 54992 63459 45096 46742 59796 39703 -4247 38721 95838 99015 93860 52045 52655 71816
8874G1816J9601p234k8318J0632N087Q152n726j4930K4721M8820J2481l7282n0663
$$ 71816 91417 84183 55865 66497 71584 79736 74010 59080 83801 132621 145102 107820 57157
8861E7157j4198R081k1056K0199J3711k7471j3789L9379O2299J547l5313k4173
$$ 57157 42959 52040 30984 51183 64894 37423 23634 63013 125312 126859 91546 67373
8849F7373L7860J1267j0586l0552k2014O9398J1746j6975j2109L0873P382J479
$$ 67373 105233 116500 105914 75362 53348 122746 134492 117517 105408 136281 143663 145142
8837A45142j4629l2786j6950R744M286O886Q923N590j0538k7462r468K2288P932
$$ 145142 130513 97727 80777 90521 94807 101693 110616 116206 105668 78206 68738 91026 98958
8824I8958j6244j5355R294l375R692k113j6756j0924k4429L4544N8277K6787N992
$$ 98958 82714 67359 76653 73278 82970 80857 64101 53177 28748 63292 121569 148356 154348
8811A54348o142k2507j5479K3942j2876j6725J9222k2313l1487K5033k3803j8829
$$ 154348 148206 125699 110220 134162 121286 104561 123783 101470 69983 95016 71213 52384
8799E2384J6522M7141j5270j5855o990O51K7242K1443k4920j1317l0016r836J2929
$$ 52384 68906 116047 100777 84922 77932 78583 105825 127268 102348 91031 61015 51179 64108
8786F4108j1327m672l127k0612l178K0469j1888j719K8441O6880M4621l1332k0695
$$ 64108 52781 48109 44982 24370 21192 41661 29773 28054 56495 123375 167996 136664 115969
8773A15969j0257j4235O929J5179k9359J0261M7109q885O915K9981N2224j0495
$$ 115969 105712 91477 98406 113585 84226 94487 141596 132711 139626 169607 221831 211336
8761B11336j0994k0546J6518m434k1307J0682j8446l3197m4166q921J4568R029
$$ 211336 200342 179796 196314 191880 170573 181255 162809 129612 85446 76525 91093 100122
8749A00122Q131O69P41J915j7850M1439L3506k1276l0983l448N240J8742J527
$$ 100122 108253 108922 109663 111578 93728 135167 168673 147397 116414 112966 118206 136948 138475
8736A38475k5669p003k0274J7986L2519Q758K9556J3311J4541Q200n7958p330
$$ 138475 112806 105803 85529 103515 136034 144792 174348 187659 202200 210400 152442 145112
8724A45112O018K7676K8496J5621n050l16l6271k4430J6171q742j0799J1505J2660
$$ 145112 151130 178806 207302 222923 217873 217557 181286 156856 173027 164285 153486 164991 177651
8711A77651k8475L813K466Q559J3339j3895J549j49K1404M277j9624J0029K9020
$$ 177651 149176 152989 155455 164014 177353 163458 165007 164858 186262 190539 170915 180944 209964
8698B09964J5798k9044J1333M7253j758N196m029J9961K2051j9576M6227j6031
$$ 209964 225762 196718 208051 255304 253546 258742 254713 274674 296725 277149 323376 307345
8686C07345k6443J3701K2623L6567J9106M814k8650k7897K9923J0003J0364j9314
$$ 307345 280902 294603 317226 353793 372899 377713 349063 321166 351089 361092 371456 352142
8674C52142l070K5174K998P335p706K8165P971L1157R767K5075J7988J0591j3594
$$ 352142 349072 374246 377244 384579 376873 405038 413009 444166 453933 479008 496996 507587 493993
8661D93993m8992M579J5584O636l199K8009K7636Q040J0405N339j552K0391l304
$$ 493993 445001 449580 465164 471800 468601 496610 524246 532286 542691 548030 546478 566869 563565
8648E63565O314L1627K370m591L0962K2955O513J1288j5633N3193N0725M6099
$$ 563565 569879 601506 603876 599285 630247 653202 659715 671003 655370 708563 759288 805387
8636H05387K6903N7729J1320K3500L9798P12L5708O9488O3252O8538O7232P4942
$$ 805387 832290 890019 901339 924839 964637 965349 1001057 1070545 1133797 1202335 1269567 1344509
8624A344509J26131J30505J60230K10579K05241K23452K80416L42190M00683N03448
$$ 1344509 1470640 1601145 1761375 1971954 2177195 2400647 2681063 3023253 3423936 3927384
8614C927384N80473N95207O40928O97324Q59675J093766J446044K124102L412784
$$ 3927384 4507857 5103064 5743992 6441316 7300991 8394757 9840801 11964903 15377687
8605A5377687N654784Q794170J1725469J2620141R793401M028859l341899r143784
$$ 15377687 21032471 29826641 41552110 54172251 63965652 67994511 64652612 55508828
8597E5508828j1725299j1342164r025470o356052m118412k637027j697259j188536
$$ 55508828 43783529 32441365 23415895 17059843 12941431 10304404 8607145 7418609
8589G418609q47500o38623m92021m85514m78948m58087m51372l88723l00975k70069
$$ 7418609 6571109 5932486 5440465 4954951 4476003 4017916 3566544 3177821 2876846 2606777
8579B606777j98539j44306j17866r0292r6119j32003j49159q8855j43821j62247
$$ 2606777 2408238 2263932 2146066 2055774 1959655 1827652 1678493 1589638 1445817 1283570
8569A283570j02886k2624o9989m2429m0555n0605l0814K5727J0513J24746J55413
$$ 1283570 1180684 1158060 1088071 1045642 1005087 954482 923668 949395 959908 1084654 1240067
8558A240067J32813L7967o6525j51625j88534j65324p3766j7758j7576l0828j9214
$$ 1240067 1372880 1410847 1344322 1192697 1004163 838839 765073 747315 729739 698911 679697
8547F79697m4607j594L5530M0697K6939k1138m0217m1990p6263k6425L261o440
$$ 679697 635090 633496 669026 709723 736662 715524 675307 633317 557054 530629 533890 527450
8535E27450L0499J8712R495O5262R4917J32153N0935n8051q1107j09826q1984
$$ 527450 557949 576661 586156 651418 746335 878488 929423 871372 790265 680439 598455
8524E98455n5895r2167n1679r423K515K6439k6207J6492j2107k6875M2335K5001
$$ 598455 542560 450393 398714 389291 391806 418245 392038 408530 396423 369548 411883 436884
8512D36884j9780J5768N9470N4717m2972m5648j9354l4421n8796l3180j5465K0725
$$ 436884 417104 432872 492342 547059 504087 458439 439085 404664 345868 312688 297223 317948
8500C17948k5089l5664j1674M2049K4969K8715K3367l6251l6472L078N92p011
$$ 317948 292859 257195 245521 287570 312539 341254 364621 328370 291898 294976 295568 288557
8488B88557J1056N2328K9254J5053L2871k5008K4574L2885l4226m9649o0831o1265
$$ 288557 299613 351941 381195 396248 429119 404111 428685 461570 427344 377695 316864 255599
8476B55599j9415o363j0545J2476j3792k0440j1089j754j7844o341l579p339J9749
$$ 255599 236184 229821 219276 231752 217960 197520 186431 184677 166833 160492 156913 149574 169323
8463A69323K7013L9015n3967m0343j3543j6295j8779j1270l0115N391P1306N2230
$$ 169323 196336 235351 181384 141041 127498 111203 92424 81154 51039 56430 127736 179966
8451A79966J7336N631l664m8384k5212k2003p257M25o717l0407O233K5021J5639
$$ 179966 197302 202933 199269 150885 125673 103670 96413 96838 90121 59714 65947 90968 106607
8438A06607q970j8348O431J1523k6281K1362K70j2712L8145M586k1540j372J4963
$$ 106607 97637 79289 85720 97243 70962 92324 92594 79882 118027 122613 101073 99701 114664
8425A14664N505j9492N960K5225j6926r16K0101J5461l3912m5578K0939j206L499
$$ 114664 120169 100677 106637 131862 114936 114020 134121 149582 115670 70092 91031 89825 93324
8412I3324o011j9578m025J879L6010j153q162r13j5494K1737R033k7119J7623
$$ 93324 87313 67735 63710 65589 101599 100446 92284 91371 75877 97614 106647 79528 97151
8399I7151M1195k5348l1472m719q183p562L3498o693l9879k145n189j0714R637
$$ 97151 138346 112998 81526 76807 68624 61062 94560 87867 47988 45843 40654 29940 39577
8386C9577k5965L5039M7639O058j0009k8750N153J4363J4561j0200q34J5920J4032
$$ 39577 13612 48651 96290 102348 92339 63589 68742 83105 97666 87466 86632 102552 116584
8373A16584k2021k2323J5541J7858l2908k6428k1671j2018j0517J0881K9428o557
$$ 116584 94563 72240 87781 105639 72731 46303 24632 12614 2097 12978 42406 35849
8361C5849j53K0654J2866J0369K735m1099k891k731R949J5140k6409K9337K6673
$$ 35849 35696 56350 69216 79585 82320 41221 38330 35599 45548 60688 34279 63616 90289
8348I0289K2574l600m7469j2991L625k2091p065j5970l466j1461K4795K6407J3584
$$ 90289 112863 109263 61794 48803 52428 30337 23272 7302 3836 -7625 17170 43577 57161
8335E7161J6544r391L680l368j6687J1586L67J7940L951j2197K2199p660j6413
$$ 57161 73705 64314 67994 64626 47939 59525 59892 77832 81783 69586 91785 84125 67712
8322F7712k2274p796l1144J7792O650N3677l744k951o588r01k726l328k4233p84
$$ 67712 45438 37642 6498 24290 30940 84617 80873 77922 71334 70433 67707 64379 40146 39362
8308C9362k5965q374L5777N404P740J6177J0367o1071j2411L029J4659M2948J5120
$$ 39362 13397 5023 40800 46204 53944 70121 80488 19417 7006 10035 24694 67642 82762
8295H2762k9722j4956q424L4829K1589k7546Q692R469n326O710k608L0123j0688
$$ 82762 53040 38084 29660 64489 86078 58532 67224 76693 71367 78077 75469 105592 94904
8282I4904k7835j8741K193J9394m307o267K8229K1708m201j9156k1201m9051J8293
$$ 94904 67069 48328 50521 69915 65608 59341 87570 109278 105077 85921 64720 15669 33962
8269C3962N5844J8386j8678l4179j3200r998j4488N62L0519L7953j95l89k8769
$$ 33962 89806 108192 89514 55335 42135 32137 17649 18211 48730 86683 86488 86099 57330
8256E7330m0145k2542m462J7714l8958q961L4122L3392L9448J0482Q880K6j9517
$$ 57330 17185 -5357 -9819 7895 -31063 -40024 -5902 27490 66938 77420 86300 86326 66809
8243F6809j2979j5948j0531q123J7402Q230J4999J4488j5339m889k3135J116J1566
$$ 66809 53830 37882 27351 19228 36630 44860 59859 74347 59008 54119 30984 32100 43666
8230D3666p983j7468N0149M2444J4666j2923M263j9199j3711J0063j5015n8365
$$ 43666 35683 18215 68364 110808 125474 112551 116814 97615 83904 93967 78952 20587
8218B0587m0784J0496K8914N1821m721L923j2964J9498K6393j5904R332M367j1232
$$ 20587 -20197 -9701 19213 71034 66313 70236 57272 76770 103163 87259 96591 100958 89726
8205H9726L6089N4609L3766K6252K0076K5066P423R489l6767k6524l3182M594
$$ 89726 125815 180424 214190 240442 260518 285584 293007 302496 265729 239205 206023 210617
8193B10617m289k9237n1186n990P088m9797j2968J2231j8733K563J5738N461j2005
$$ 210617 206328 177091 125905 119915 127003 77206 64238 76469 57736 60299 76037 81498 69493
8180F9493Q710k5286j8299k1795k7858K1963j1599M4813M5681J1945j143L1069
$$ 69493 78203 52917 34618 12823 -15035 6928 -4671 40142 85823 97768 96625 127694
8168A27694j1267k3236q976N996J2704j5563j1216K6371N13k6351K1304J0091
$$ 127694 116427 93191 84215 90211 102915 87352 76136 102507 103020 76669 97973 108064
8156A08064l121J967N9639L7446m88J4042k280j1762j8702k4708l5139R959O495
$$ 108064 104943 106910 166549 203995 203507 217549 215269 203507 184805 160097 124958 134917 141412
8143A41412M322n80l1385K4329K8801k9800m505q326K8295l4465j3091J3373J0233
$$ 141412 145734 145154 113769 138098 166899 137099 132594 124268 152563 118098 105007 118380 128613
8130A28613m0543k1017J50l775J0212J9445N512K2583R959J3113j8458k8331M857
$$ 128613 88070 67053 67203 63428 73640 93085 98597 121180 131139 144252 125794 97463 102320
8117A02320K9995k222l618J623n4936k306J7656J3706N2613L844k2142L8534K3112
$$ 102320 132315 130093 126475 128098 73162 70856 88512 102218 154831 158675 136533 175067 198179
8104A98179K277Q250l9676l1272J9220K5753j7207j019J3657k5088j7765j2135
$$ 198179 200456 208706 169030 137758 156978 182731 165524 164505 178162 153074 135309 123174
8092A23174n569p069K3737J056J131j873l7930m8921N428M9218L7144J1213j0632
$$ 123174 117605 110536 134273 135329 136460 134587 96657 47736 53164 102382 139526 150739 140107
8079A40107l730l3653K1584K7499M4515L2171j3475j0216k1614j915k170J7441
$$ 140107 136377 102724 124308 151807 196322 228493 215018 204802 183188 181273 179103 196544
8067A96544N97m21P3200L4087J3023J1171J9901j4346j2286L2289K0633P206L0823
$$ 196544 197141 196720 269920 304007 317030 328201 348102 333756 321470 353759 374392 381598 412421
8054D12421K1196K7766L7706M0499k893k9491j2508m690l525K1948R050Q685j6049
$$ 412421 433617 461383 499089 539588 536695 507204 494696 490006 486481 508429 517479 526164 510115
8041E10115J0959J730k1793l4968l0957l5059O757j748j316r26k401p258L0640
$$ 510115 521074 522804 501011 466043 435086 400027 406784 405036 403720 402794 400393 393135 423775
8028D23775K7490J9277N247j0745J0479p922J8105L6603J2584J5088L8646O5821
$$ 423775 451265 470542 475789 465044 475523 467601 485706 522309 534893 549981 588627 654448
8016F54448O9659N1044L5549Q0078J42408J50631J54385Q3608L3386k7853j22622
$$ 654448 724107 775151 810700 890778 1033186 1183817 1338202 1421810 1455196 1427343 1304721
8005A304721j06627o4596n9574k3367m350l7729o6315p0821q2327q2254l2691
$$ 1304721 1198094 1133498 1073924 1050557 1046207 1008478 942163 871342 789015 706761 674070
7994F74070k9787m0108k5414k1708J1253k4726j5028j1378j072P478j2458P814
$$ 674070 644283 604175 578761 557053 568306 543580 528552 517174 516102 523580 511122 518936
7982E18936K1590K7674P273L619N0394P2034J5740j5256j8207O827q342L8411
$$ 518936 540526 568200 575473 579092 629486 701520 717260 702004 683797 690624 682282 720693
7970G20693O4896L7990N8878J3231O8934Q5792L9700J9722J6137k0315n9l0383
$$ 720693 785589 823579 882457 895688 964622 1050414 1090114 1109836 1125973 1105658 1105599 1075216
7958A075216l0416k3953r9073p6649r8904p3587k2037k5613n6702l4680k9824
$$ 1075216 1044800 1020847 921774 845125 746221 672634 650597 624984 568282 533602 503778
7947E03778k2636j1470j5348p785j2835m29l3108j3961o289m3900l3234p565L9134
$$ 503778 481142 469672 454324 446539 433704 433275 400167 386206 379917 336017 302783 295218 334352
7934C34352P206k7246J487j0734K0175L0349N7375M2931J7526k932J3960N194
$$ 334352 341558 314312 315799 305065 325240 355589 412964 455895 473421 470489 484449 489643
7922D89643o084J9404L4401k1968m3382l1208l0150n2455m3463j9741J795l6899
$$ 489643 483559 502963 537364 515396 472014 440806 410656 358201 314738 294997 296792 259893
7910B59893k3276n078k3181j3007p586q594j9322J481m017m6172M88N8113K0601
$$ 259893 236617 231539 208358 195351 187765 179171 159849 161330 157313 111141 111629 169742 190343
7897A90343m922p050j1622j3117L1810K5719p980m904j3480j5139o5300n8232
$$ 190343 185421 178371 166749 153632 185442 211161 203181 198277 184797 169658 104358 46126
7885D6126j7929M1628K8666M2237N5372j6725Q569k6880k3243l5859Q776J2537
$$ 46126 28197 69825 98491 140728 196100 179375 187944 161064 137821 101962 110738 123275
7873A23275p543J4788L290l3333m2891J725M837l785L9764J035l0299k5034k7036
$$ 123275 115732 130520 133810 100477 57586 59311 64148 60363 100127 101162 70863 45829 18793
7860A8793K7766K5207K5289l2821j5244K2453K7751o821j6314Q617m819j1359
$$ 18793 46559 71766 97055 64234 48990 71443 99194 92373 76059 84676 79857 68498
7848F8498m226Q248O877q796P43q931j9765j5352J1728K1192q68K218P899k1738
$$ 68498 64272 72520 79397 70601 71344 62413 42648 27296 39024 60216 59348 61566 69465 47727
7834D7727k4179r967J031P19l763J9470J4446o652m0236O076N5794K8127j8446
$$ 47727 23548 13581 14612 15331 11568 31038 45484 38832 -1404 4672 60466 88593 70147
7821G0147j1187m85J7267j320O946k8834k4913L828k5148J8926M7453n604k7396
$$ 70147 58960 58475 75742 74422 81368 52534 27621 31449 6301 25227 72680 67076 39680
7808C9680j4385K4493k890l4374K318J798J3791J9744J0262P462j3923m0017K0568
$$ 39680 25295 49788 46898 12524 14842 16640 30431 50175 60437 67899 53976 13959 34527
7795C4527k5466l5350j2823m702l968j721L2675K7983q31J8830R740J9444J405
$$ 34527 9061 -26289 -39112 -43814 -47782 -49503 -16828 11155 10324 29154 38894 58338 59743
7782E9743k9472k7177l6004m018K7870L7106L6035L117j5190j8917n0687m2893
$$ 59743 30271 3094 -32910 -36928 -9058 28048 64083 67200 52010 33093 -17594 -60487
7770f0487R535Q476K2365L0354J4240L2046L2162k3078o7889k9326L8959O841
$$ -60487 -50952 -42476 -20111 10243 24483 56529 88691 65613 -2276 -31602 7357 14198
7758A4198P478J2066L9608L929l3129m3097j0902p053p451L1500J2740L094P897
$$ 14198 21676 33742 73350 77279 44150 1053 -9849 -16902 -24353 7147 19887 22981 30878
7745C0878K6007j8156k9885r531l7136J3016K5556K6774J4409J4633j2004k3970
$$ 30878 56885 38729 8844 -687 -37823 -24807 749 27523 41932 56565 44561 20591
7733B0591j168m2628k4297o791Q848J1349L2814J7563P367j814J0876k5063K0937
$$ 20591 19423 -23205 -47502 -54293 -45445 -34096 -1282 16281 23648 21834 32710 7647 28584
7720B8584O207r496k0030j0354l485j4185J3009J756K3645l7622j9074M165L4152
$$ 28584 34791 25295 5265 -5089 -8574 -22759 -9750 -7994 15651 -21971 -41045 -36880 -2728
7707b728K459p754L1249J2467j1033l904p262l2132k988K0361J8259Q4K7173l6825
$$ -2728 -269 -8023 23226 35693 24660 20756 13494 -18638 -21626 -1265 16994 17078 44251 7426
7693G426J8941j4254p974l1704P495k684j0957k0044L8725O752l8054K462k779
$$ 7426 26367 12113 4139 -27565 -20070 -22754 -33711 -53755 -15030 -8278 -46332 -43870 -46649
7680d6649j7343K2703N592k756R51J0934J0808M221L4598o535j1374L464L5170
$$ -46649 -63992 -41289 -35697 -38453 -37502 -26568 -15760 -11539 23059 16524 5150 8614 43784
7667D3784o042o0334l6221p751K3943P258k0175J9713j5214j6155L3665k3472
$$ 43784 37742 -22592 -58813 -66564 -42621 -35363 -55538 -35825 -51039 -67194 -33529 -57001
7655e7001K241j3338K2755N7056p48m4863J0421M9472J9083j653k7502o594r068
$$ -57001 -54760 -68098 -45343 11713 10965 -33898 -23477 25995 45078 43425 15923 9329 261
7642B61j5016o2040K466L3110O303Q851m787N0045J2379l694o776J627j1313j9747
$$ 261 -14755 -76795 -74329 -41219 -34916 -26065 -30852 19193 31572 27878 21102 22729 11416 -8331
7628h331l463L8115n572k4737k7519L0843J2867k1028k3099j3284K2801L2850
$$ -8331 -11794 26321 20749 -3988 -31507 -664 12203 -8825 -31924 -45208 -22407 10443
7616A0443J4681j8069j9255J9442J3752n6887j1798K1788P363K8110L014j0149
$$ 10443 25124 7055 -12200 7242 20994 -35893 -47691 -25903 -18540 9570 12584 2435
7604B435l4284K6420r99k0504K4030N913P901N283m0455j6945p353K8405j1183
$$ 2435 -31849 -5429 -6428 -26932 -2902 3011 10912 16195 -24260 -41205 -48558 -20153 -31336
7591c1336j1857K9501O4055J4762k7472k0142m3439j7471R47l4227k1074K2725
$$ -31336 -43193 -13692 50363 65125 37653 17511 -25928 -43399 -42452 -76679 -97753 -75028
7579g5028N3629K4562O157p118p160K3292k7454k0392Q384j6409J3088J0135K4004
$$ -75028 -21399 3163 9320 2202 -4958 18334 -9120 -29512 -21128 -37537 -24449 -14314 9690
7566I690N16J1059J0603k7618k2953J6982k6634q909J5160J0590J3986j7320J193
$$ 9690 10206 21265 31868 4250 -18703 -1721 -28355 -37264 -22104 -11514 2472 -14848 -13655
7553a3655K3278j3881J2736J0245k3155L362l0098L333L6266j0527J7499m2316
$$ -13655 9623 -4258 8478 18723 -4432 -1070 -31168 -27835 8431 -2096 15403 -26913
7541b6913j7900J908J0140r101m599L2985L938J1372O783L3363j9671m6416l4086
$$ -26913 -44813 -42905 -32765 -41866 -46465 -13480 -9542 1830 8613 41976 22305 -24111 -58197
7528e8197K5516N0099r289k2154l7894K1444K7642j4491l5102k35j6548o863k0621
$$ -58197 -32681 17418 8129 -14025 -51919 -30475 -2833 -17324 -52426 -52661 -69209 -76072 -96693
7515i6693l1979K6776L5891J706k7550q735L7942J9243J0388m970L577L941k6071
$$ -96693 -128672 -101896 -66005 -64299 -91849 -100584 -62642 -43399 -33011 -37981 -34404 -30463 -56534
7502e6534r968M3500M0322J032j2204k2317R440q36M640J4005Q630k4236L3293
$$ -56534 -66502 -23002 17320 18352 6148 -16169 -6729 -7565 -2925 11080 19710 -4526 28767
7489B8767J0065k2596k3446L794M219k0606K591Q955j4935O964K2000M906J0238
$$ 28767 38832 16236 -7210 -3416 803 -19803 -17212 -8257 -23192 -16228 5772 10678 20916
7476B0916k0629O596j6055k848Q363k255m1995m2411o881K6810K955m500J7113
$$ 20916 287 6883 -9172 -12020 -3657 -5912 -47907 -90318 -97199 -70389 -67434 -71934 -54821
7463e4821j233k2856P753K0515J3764N1913L0723k6730n58Q19q487j0775M707
$$ -54821 -56054 -78910 -71157 -50642 -36878 15035 45758 19028 18470 19289 10802 27 4734
7450D734M145m7094m946K1030J1438L2843O729k7497m0186j6487k011J8245K0010
$$ 4734 8879 -38215 -43161 -22131 -10693 22150 28879 1382 -38804 -55291 -57302 -39057 -19047
7437a9047q189j1865o231Q990j0162J733J4046P597j3879K4781N490j9078j8248
$$ -19047 -27236 -39101 -45332 -36342 -46504 -44771 -30725 -23128 -37007 -12226 -6736 -25814 -44062
7424d4062N144n623J049k0216J7764J1114j3911k8580Q139K2841L2169r44l7089
$$ -44062 -38918 -44541 -43492 -63708 -45944 -34830 -48741 -77321 -69182 -46341 -14172 -15116 -52205
7411e2205j5350K8093K0827j5955m051k0277K4690K104p114p30J6315k8535K0913
$$ -52205 -67555 -39462 -18635 -34590 -38641 -58918 -34228 -32124 -39238 -39968 -23653 -52188 -31275
7398c1275k2749j4191K2535K4882l569k3195k273M8314N065O367j3084K3692J1242
$$ -31275 -54024 -68215 -45680 -20798 -24367 -47562 -49835 -1521 3544 9911 -3173 20519 31761
7385C1761k1530k9028k2569J5863q793k1704k0553j0903L3232K9291n800P277
$$ 31761 10231 -18797 -41366 -25503 -34296 -56000 -76553 -87456 -54224 -24933 -30733 -23456
7373b3456l2734K552J6760N3907l87j7251j7683J8250J7575K3404j0865p075j9144
$$ -23456 -56190 -53638 -36878 17029 16642 -609 -18292 -42 17533 40937 30072 22997 3853
7360C853q677J264K10q602K8894k3293q714l0242k7339J4811M9307R560L1453
$$ 3853 -4824 -3560 -3350 -11952 16942 -6351 -15065 -45307 -72646 -57835 -8528 1032 32485
7347C2485M219J876j8394l0928Q537O53K3716K049m2842R809J3646j2240p214
$$ 32485 36704 38580 20186 -10742 -2205 -1552 22164 24213 -18629 -8820 4826 -7414 -14628
7334a4628q458r128M936k8020l46K2290j5586P879L3347M152K065p565j2612k2457
$$ -14628 -23086 -32214 -27278 -55298 -55644 -33354 -48940 -41061 -7714 -3562 -1497 -9062 -21674 -44131
7320d4131K0393R144l0072k8175n788r68L2691Q85j5019J5984J4180K4415Q624
$$ -44131 -23738 -14594 -44666 -72841 -78629 -79597 -46906 -46021 -61040 -45056 -30876 -6461 2163
7307B163J3494P33J5169L294k5551l2966q43r845p814l9J7650J2362N977J9509
$$ 2163 15657 16390 31559 34853 9302 -23664 -24507 -34352 -42166 -42205 -24555 -12193 -6216 13293
7293A3293K0119m0573J4568P859J1582j6808k4896p452K5086o193K064r167Q742
$$ 13293 33412 -7161 7407 15266 26848 10040 -14856 -22308 2778 -3415 -1351 -10518 -1776
7280a776k405k8209J1087L8033L3980Q589k0252j6079l9412R268j1084k2684M13
$$ -1776 -4181 -32390 -21303 16730 50710 59299 39047 22968 -16444 -7176 -18260 -40944 -40531
7267d0531J8854Q262j237r855m781K8573K6439J0319j6933j605k5402j1469K2663
$$ -40531 -21677 -13415 -14652 -24507 -29288 -715 25724 36043 19110 17505 -7897 -19366 3297
7254C297Q373J4749J5058K6586k3362k5794k2417M589J7146R42j1618Q235k5915
$$ 3297 11670 26419 41477 68063 44701 18907 -3510 1079 18225 19167 7549 15784 -10131
7241a0131k4245j145R66M427J7936j7285k3128J9197J2116K332j1240p163r61
$$ -10131 -34376 -35521 -34555 -30128 -12192 -29477 -52605 -33408 -21292 -18960 -30200 -37363 -38324
7228c8324J9970K0486j1143j3893R558o62n160J2366K1882r170l1872j7357m62
$$ -38324 -18354 2132 -9011 -22904 -13346 -14008 -19168 -6802 15080 5910 -25962 -43319 -43781
7215d3781l1302J0972O583p332K5328O1392j1867j6177O880J3042j0061J7713
$$ -43781 -75083 -64111 -57528 -64860 -39532 21860 9993 -6184 696 13738 3677 21390
7203B1390j4126J5770J2923k2799J4264L6250m6879p149L6138j9044l0674j1375
$$ 21390 7264 23034 35957 13158 27422 63672 16793 9644 45782 26738 -3936 -15311
7191a5311k0134J1249K7895J6156K2994L200l2107k4536L1094r157L5329M2774
$$ -15311 -35445 -24196 3699 19855 42849 46049 13942 -10594 20500 11343 46672 89446
7179H9446r576k9471j3309n4227l5087j575L8070j0343N694J9988m4567k5056
$$ 89446 79870 50399 37090 -17137 -52224 -53799 -15729 -26072 -20378 -390 -44957 -70013
7167g0013j0641J4260M2994J110K4314k0953m0748J8311K2075k2145o74Q416L985
$$ -70013 -80654 -66394 -23400 -22290 2024 -18929 -59677 -41366 -19291 -41436 -42110 -33694 -29709
7154b9709L9287L1057k1477l0626m643R146K7512j6647O730l687K1424J5471k5409
$$ -29709 9578 40635 19158 -11468 -16111 -6965 20547 3900 10630 6943 28367 43838 18429
7141A8429k7660k3272l693o440N131l630j8639J0593L7224J344k1979n246o905
$$ 18429 -9231 -32503 -36196 -42636 -37505 -41135 -59774 -49181 -11957 -10613 -32592 -37838 -44743
7128d4743k9748M8752N4747m295l9099r689J456J8779k086j6606K3723J8777o047
$$ -44743 -74491 -25739 29008 24713 -14386 -24075 -22619 -3840 -5926 -22532 1191 19968 13921
7115A3921M588K2660m889o507k850k166k824N481k1042l3767J2314K8224l0280
$$ 13921 18509 41169 36280 29773 26923 24757 21933 27414 6372 -27395 -15081 13143 -17137
7102a7137j4934K084Q1719K5055j0958N127j0892j4734j3729o329n3240j4958
$$ -17137 -32071 -29987 51732 76787 65829 70956 60064 45330 31601 25272 -27968 -42926
7090d2926K6989K173J3968p238j2436Q307J879j345J5599K2907M4180N425k9877
$$ -42926 -15937 -13764 204 -7034 -19470 -11163 -9284 -10629 4970 27877 72057 77482 47605
7077D7605n2678n3056p493J0869K0884J7607k7663j7113K8064L624k7198J6737
$$ 47605 -5073 -58129 -65622 -54753 -33869 -16262 -43925 -61038 -32974 -29350 -56548 -39811
7065c9811J2790j771K9108K8090k5547J0673k1030l4164j6573p772K2054K3725
$$ -39811 -27021 -28792 316 28406 2859 13532 -7498 -41662 -58235 -66007 -43953 -20228
7053b0228J1697n860L7247l2028j7189J9706k429J2836j1562l3055k4596K5290
$$ -20228 -8531 -14391 22856 -9172 -26361 -6655 -9084 3752 -7810 -40865 -65461 -40171
7041d0171K4831J641r69j814J8381K3219N0931K8850k7564j0265k3632q908l0245
$$ -40171 -15340 -13699 -14668 -16482 1899 25118 76049 104899 77335 67070 43438 34530 4285
7028D285j8970K986J8337J7176j4283j2633K5380O9901L0120M0417L6712K5303
$$ 4285 -14685 -11699 6638 23814 9531 -3102 22278 92179 122299 162716 199428 224731
7016B24731Q9993K23852M70751O52496L47266j13567k78426m52393m18874k55562
$$ 224731 314724 538576 1009327 1661823 2009089 1895522 1617096 1164703 745829 490267
7006D90267j00709n5234m5651k5099k4532l7834n2939k3517J5547k8691j5499
$$ 490267 389558 334324 288673 263574 239042 201208 148269 124752 140299 111608 96109
6995I6109j0993K0642m440K865p934j9249P630K282j2746k7356m0624L2538r774
$$ 96109 85116 105758 101318 104183 96249 77000 84630 86912 74166 46810 6186 38724 28950
6982B8950l4341j6537P799K4187p660j0076J6994Q769j0770m1270J0723k589N277
$$ 28950 -5391 -21928 -14129 10058 2398 -7678 9316 18085 7315 -33955 -23232 -25821 -20544
6969b0544L1860k3344k0047M1426J3676M982N208L9912J6595J6564j4746l1665
$$ -20544 11316 -12028 -32075 9351 23027 28009 33217 73129 89724 106288 91542 59877
6957E9877j6074J149M104J4834j2321P67L765j1699j6463J4842N533m212k0081
$$ 59877 43803 44952 49056 63890 51569 52336 56101 44402 27939 42781 48314 44102 24021
6944B4021K5209N4046N3630K245K8171J01858J55010K99002K69377M3189j44205
$$ 24021 49230 103276 156906 159151 187322 289180 444190 743192 1012569 1055758 911553
6933I11553k43581k57700j32536o4819m7676n6378n1942j6019O467l379j7114
$$ 911553 667972 410272 277736 212917 165241 108863 56921 40902 47369 43990 26876
6922B6876p514O519k180l880m2382K1481M1705R1826J36531Q8644R47m5355p9522
$$ 26876 19362 25881 23701 19821 -22561 -1080 40625 132451 268982 357626 358573 313218 233696
6909B33696r4053m9991p158l0936o2891m9177M0164L5644j9158J1366L601L4213
$$ 233696 139643 89652 82494 51558 -11333 -60510 -20346 15298 -3860 7506 11107 45320
6897D5320j4983l0954K6882K8995l1408m0895P852K0769M9599n836j1441r38k9143
$$ 45320 30337 -617 26265 55260 23852 -17043 -9191 11578 61177 55341 43900 42962 13819
6884A3819k1643j2176k6083j3242L5981J793k520J7475k5141J559Q757j1259k698
$$ 13819 -7824 -20000 -46083 -59325 -23344 -21551 -24071 -6596 -31737 -30178 -21421 -32680 -35378
6871c5378m437K9985J2606Q746L6810M6629J08614P5782k2292o0828k7897l5501
$$ -35378 -39815 -9830 2776 11522 48332 94961 203575 279357 257065 196237 168340 132839
6859A32839m2318o1310l4851L290J2573j1356j957l4754K1647J1841l0514K855
$$ 132839 90521 29211 -5640 -2350 10223 -1133 -3090 -37844 -16197 -4356 -34870 -32015
6847c2015J0476L4449K4123j3542k0148K431p679j4628m175k0786j3564k0165
$$ -32015 -21539 12910 37033 23491 3343 5774 -1905 -16533 -20708 -41494 -55058 -75223
6835g5223M0282K3997k2639j9005J8633N0759L3510k9467l4665r100J6233R687
$$ -75223 -34941 -10944 -33583 -52588 -33955 16804 50314 20847 -13818 -22918 -6685 3002
6823C002l885M563k273K008J9963J9048j8068j7133N309K4658M3638n3614n1709
$$ 3002 -883 3680 1407 3415 23378 42426 24358 7225 12534 37192 80830 27216 -24493
6810b4493J1603N6436J4099k5230l1675j0818L9159J1757m1120l007l5718m662
$$ -24493 -12890 43546 57645 32415 740 -10078 29081 40838 -282 -3289 -39007 -43669
6798d3669L4350J2797K5810k080J1532J9204K0401M9258k775m519k0880j5964
$$ -43669 -9319 3478 29288 27208 38740 57944 78345 127603 124828 120309 99429 83465
6786H3465Q452j7560O359j1700j1583L1253j7496K530J5533K6873N0665P6093
$$ 83465 91917 74357 80716 69016 57433 88686 71190 73720 89253 116126 166791 242884
6774B42884J60118K43879N6655o2971r5420j48825j59557j07973m2182j2416q244
$$ 242884 403002 646881 703536 640565 545145 396320 236763 128790 86608 74192 65948
6763F5948J3369p176j1188m6278l5646M1222K4527j2974m122J9918j3284p557
$$ 65948 79317 72141 60953 14675 -20971 20251 44778 31804 27682 47600 34316 26759
6751B6759r964J6565j5854j131l443j9786M714k364J7447N1730L4314K7168M9365
$$ 26759 16795 33360 17506 16375 12932 -6854 -2140 -4504 12943 64673 98987 126155 175520
6738A75520P7809J01582p17k8216o6224r7371k9539j3649j1676Q134J7354k142
$$ 175520 253329 354911 354194 325978 259754 162383 132844 119195 107519 115653 133007 130865
6726A30865K5478J5198k718L5708N0331J60508K17146N2784q8489j31789j77537
$$ 130865 156343 171541 168823 204531 254862 415370 632516 685300 596811 465022 287485
6715B87485q5118o9150k5428n405L19k7930m3155l4202J4466k961k0023j3821
$$ 287485 202367 133217 107789 102384 102703 74773 31618 -2584 11882 8921 -11102 -24923
6703b4923k6274k587K8356O673K8686N749K3582L090m8436k849n095j455N395
$$ -24923 -51197 -53784 -25428 -18755 9931 15680 39262 42352 -6084 -8933 -14028 -15483 -10088
6690a0088K2021m378J4805J6698O486k2196r329L1883k797k4440j5053J9102k8895
$$ -10088 11933 7555 22360 39058 45544 23348 14019 45902 43105 18665 3612 22714 -6181
6677f181l7481K0665M3458j8089o949J7402l0462o256O909l7827j347M3024L0931
$$ -6181 -43662 -22997 20461 2372 -4577 12825 -17637 -23893 -16984 -54811 -56158 -13134 17797
6664A7797M387m7396j4359n924P337J2542l5728j0851K3368k0330l83O860K8282
$$ 17797 22184 -25212 -39571 -45495 -38158 -25616 -61344 -72195 -48827 -69157 -69540 -62680 -34398
6651c4398l928j0498k926n348l0138N8103K5579J0321q896J2609q650j6189j0360
$$ -34398 -38326 -48824 -51750 -57098 -87236 -29133 -3554 6767 -2129 10480 1830 -14359 -24719
6638b4719j2614Q948R13J9557j1414J703K3112J2084j3434l0394j6605o174k6928
$$ -24719 -37333 -28385 -27472 -7915 -19329 -17626 5486 17570 4136 -26258 -42863 -49037 -75965
6625g5965j2573K3135L005M8324k6629J1516J2119L6923L2977l6812k7472J890
$$ -75965 -88538 -65403 -62398 -14074 -40703 -29187 -17068 19855 52832 16020 -11452 -9562
6613i562o346K2781K7565o228L490J4817k8528J993p875J1827R739j7650k1932
$$ -9562 -15908 6873 34438 28210 31700 46517 17989 19982 12107 23934 33673 16023 -5909
6600e909k2951J4060M0386j8955Q853q099j6819j166o298K1239M5394n908n4545
$$ -5909 -28860 -14800 25586 6631 15484 7385 -9434 -10600 -16898 4341 49735 43827 -10718
6587a0718k9624j1999K1323P68P357j3282k4652o069P027O602J0124L6104J9562
$$ -10718 -40342 -52341 -31018 -30250 -22893 -36175 -60827 -66896 -59869 -53267 -43143 -7039 12523
6574A2523j5957K872J6513j1638j5051l8887k225m588R10K1125j2896J5539J9702
$$ 12523 -3434 -562 15951 4313 -10738 -49625 -51850 -56438 -55528 -34403 -47299 -31760 -12058
6561a2058K9347L4692J1193o470K311k5743l7315J6098j0512k4592J0459K5482
$$ -12058 17289 51981 63174 56704 59015 33272 -4043 12055 1543 -23049 -12590 12892
6549A2892L0278O167p309j4318k5186k0556K3519J6634l170K496k2877k521M2283
$$ 12892 43170 49337 42028 27710 2524 -18032 5487 22121 18951 21447 -1430 -3951 38332
6536C8332K8425l923m1402j4543j1736J8148j1371m727O654M1591M2622K2389
$$ 38332 66757 62834 21432 6889 -4847 13301 1930 -2797 3857 45448 88070 110459
6524A10459o6664m7712N75L1077l8770k3773j7004j7075K9344M0180N779J6189
$$ 110459 43795 -3917 -3342 27735 -11035 -34808 -51812 -68887 -39543 637 6416 22605
6512B2605P083k4929k9022K542N995r008j141L710L3482r213N114k0882j4782
$$ 22605 29688 4759 -24263 -21721 -15726 -24734 -25875 -22165 11317 2104 7218 -13664 -28446
6499b8446L563j0218K1881M9861k2983l860L2624O629k5904L56K5222j2849J6114
$$ -28446 -24883 -35101 -13220 36641 13658 9798 42422 49051 23147 23503 48725 35876 51990
6486E1990q367l8251k9872l142K5301n09j7038j0701k0192J5093l838M2428l363
$$ 51990 43623 5372 -24500 -27642 -2341 -2850 -19888 -30589 -50781 -35688 -39526 2902 -461
6473d61l5645p603J9035J5524O288O132J6535N260J3098L807j2260j2739K852
$$ -461 -36106 -43709 -24674 -9150 -2862 3270 19805 25065 38163 41970 29710 16971 19823
6460A9823j4537j1816j8259j3250j351K2406J6246j0393m4287k3914K561l659
$$ 19823 5286 -6530 -24789 -38039 -39390 -16984 -738 -11131 -55418 -79332 -76771 -80430
6448h0430K1693J4366K1577j940J1684K166q099J4537j1103M295j1369j8789q505
$$ -80430 -58737 -44371 -22794 -24734 -13050 -10884 -18983 -4446 -15549 -11254 -22623 -41412 -49917
6435d9917m868r237K7481L9306K667R139j1672o812J6949K8580j7677n3251k2729
$$ -49917 -54785 -64022 -36541 2765 5432 14571 2899 -3913 13036 41616 23939 -29312 -52041
6422e2041L0092L2705J46J5268k037k1238Q775R799k4336k2718J6264r495J3533
$$ -52041 -21949 10756 10902 26170 24133 2895 11670 21469 -2867 -25585 -9321 -18816 -5283
6409e283O689P958j4456k2937J744J1848j0353j1515M71j1071K0251O3686k005
$$ -5283 1406 9364 -5092 -28029 -26285 -14437 -24790 -36305 -35834 -46905 -26654 37032 35027
6396C5027j0549j2402M3395Q601j3841M717P89k0865j3033j7697j8567l197J5836
$$ 35027 24478 12076 55471 64072 50231 54948 55737 34872 21839 4142 -14425 -17622 -1786
6383a786j5986J5210K4370k2202j7015j1075k3535J7401l559K1903n068j3353
$$ -1786 -17772 -2562 21808 -394 -17409 -28484 -52019 -34618 -38177 -16274 -21342 -34695
6371c4695J2483K0696l070m8695K6735J2450n032J8568J8520j9961j6992K5644
$$ -34695 -22212 -1516 -4586 -53281 -26546 -14096 -19128 -560 17960 -2001 -18993 6651
6359F651J7891L2117j7752M846l5730l2695l6657M142K906N136K6529Q543k1565
$$ 6651 24542 56659 38907 43753 8023 -24672 -61329 -57187 -54281 -49145 -22616 -14073 -35638
6346c5638K3427K1358j0031k2215Q144L1265M808K3672L781o466N949j2770l2486
$$ -35638 -12211 9147 -884 -23099 -14955 16310 21118 44790 48571 42105 48054 35284 2798
6333B798l2306R788J1961Q706j2503o6624P631M8668k108k9744k0731N4996k40
$$ 2798 -29508 -19720 -7759 947 -11556 -78180 -70549 -21881 -23989 -53733 -74464 -19468 -19708
6320a9708M452k6341J0133J9084j0886n639l2415m4999M598J6228L0157L3043
$$ -19708 -15256 -41597 -31464 -12380 -23266 -28905 -61320 -106319 -101721 -85493 -55336 -22293
6308b2293L4825r707l38J9510K1568L2167k828r878o1034m0576J3359l2933j2214
$$ -22293 12532 2825 2487 21997 43565 75732 72904 63026 1992 -38584 -25225 -58158 -70372
6295g0372K2464K030l6948j8070o580K5528L2527K3481J3204K005J3170L2830
$$ -70372 -47908 -45878 -82826 -100896 -107476 -81948 -49421 -25940 -12736 -10731 2439 35269
6283C5269q1j0357j7102n776m876Q43J678L2648k0242k0070j0222q986K0178J5775
$$ 35269 35188 24831 7729 1953 -2923 -2080 -402 32246 12004 -8066 -18288 -27274 -7096 8679
6269H679M7692Q731k1128n0288k0267k1189K1082J9381k578l772n973k2675p492
$$ 8679 56371 65102 43974 -6314 -26581 -47770 -26688 -7307 -9885 -13657 -19630 -42305 -49797
6256d9797m442J0123j3111J3336L627k4407m385P452J2349K6961P190J5539M250
$$ -49797 -54239 -44116 -57227 -43891 -40264 -64671 -69056 -61604 -49255 -22294 -15104 435 4685
6243D685k4083k4607L330K9218j3318K017J2944j809j1473K2321R019Q86Q19l9266
$$ 4685 -19398 -44005 -40675 -11457 -24775 -22758 -9814 -11623 -23096 -775 8244 9130 9949 -29317
6229b9317n5236L0572O1494K04k4166K6098J5900j3516k9003m453K3362J5550
$$ -29317 -84553 -53981 7513 7717 -16449 9649 25549 12033 -16970 -21423 1939 17489
6217A7489j727j1598K7068M273l1703n4620l5682K3123J3046K7693J6595P992
$$ 17489 15762 4164 31232 35505 3802 -50818 -86500 -63377 -50331 -22638 -6043 1949
6205A949m97M619P508j2571m3396j3298k269N714M0924R432j2015m7339K7514
$$ 1949 1452 6071 13579 1008 -42388 -55686 -57955 -52241 -11317 -1885 -13900 -61239 -33725
6192c3725K5491m2232j8886M3038j6850q304L4161M0780P749j286q054k0203r556
$$ -33725 -8234 -50466 -69352 -26314 -43164 -51468 -17307 23473 31222 29936 21882 1679 -7877
6179g877j9841K4320L1060k6020l9620K4351K1944K175k6351Q243q410K405K4042
$$ -7877 -27718 -3398 27662 1642 -37978 -13627 8317 10492 -15859 -7616 -16026 -13621 10421
6166A0421j1298j0240N2095N7366K7618m7156l9791o582p035n951m1583k2564
$$ 10421 -877 -11117 40978 98344 125962 78806 39015 32433 25398 19447 -22136 -44700
6154d4700L0703O5089J0034r706J767j1659N850j6033k3590j0469J57j510k127
$$ -44700 -13997 51092 61126 51420 53187 41528 47378 31345 7755 -2714 -2557 -4067 -6194
6141f194J5202j1814J9705j0792Q078L49j4717k8376K1624J2601j0330J97K7997
$$ -6194 9008 -2806 16899 6107 14185 14534 -183 -28559 -6935 5666 -4664 -4467 23530
6128B3530o338m5525k8316L427K7648K1531K4478l3646j7422L5457j1l1687j2907
$$ 23530 17192 -28333 -56649 -53222 -25574 -4043 20435 -13211 -30633 4824 4813 -26874 -39781
6115c9781K3968K1455J3359o945k5816j5185J2799l446Q459J1883R378k2148p068
$$ -39781 -15813 5642 19001 12056 -13760 -28945 -16146 -19592 -11133 750 10128 -12020 -19088
6102a9088j9098j6243k1191M193L1718J5176Q456M881l4011l5629L7564K6346
$$ -19088 -38186 -54429 -75620 -71427 -39709 -24533 -16077 -11196 -45207 -80836 -43272 -16926
6090a6926j0399j9562k4947j1643K5960L0455k2930N443L3092J5710O83k7982
$$ -16926 -27325 -46887 -71834 -83477 -57517 -27062 -49992 -44549 -11457 4253 4936 -23046
6078b3046M92l540l2442k9944l925L2134R264J5783m779K5996J2450P631K110
$$ -23046 -22554 -26094 -58536 -88480 -92405 -60271 -51007 -35224 -40003 -14007 -1557 6074 8184
6065H184k2363k4682N570K7767J1624n393k2912N587l6610K5677K7736J0264m40
$$ 8184 -14179 -38861 -33291 -5524 6100 707 -22205 -16618 -53228 -27551 185 10449 10009
6052A0009K397j5707r329L5356J3137m839k1300l2177k2886L647O103L64L511
$$ 10009 12406 -3301 -12630 22726 35863 31024 9724 -22453 -45339 -41692 -35589 -35225 -31714
6039c1714j6744M926K9550l46l0431L2596K8338j4683k2073k1267m4928m1251
$$ -31714 -48458 -43532 -13982 -14328 -44759 -12163 16175 1492 -20581 -41848 -86776 -128027
6027a28027j4287K5480K4179L7182O3325L0115j4162J4124M483o816k3536j5669
$$ -128027 -142314 -116834 -92655 -55473 7852 37967 23805 37929 42412 35596 12060 -3609
6015c609j1885o815Q76j3991J8728k304N888M872k299J0325p063l9856j7324K7008
$$ -3609 -15494 -22309 -21433 -35424 -16696 -19000 -13112 -8240 -10539 -214 -7277 -47133 -64457 -37449
6001c7449J7699j211o091j3924l0593j770P1680K0528k8401M699K0896J1788K8790
$$ -37449 -19750 -20961 -27052 -40976 -71569 -73339 -1659 18869 -9532 -4833 16063 27851 56641
$$ [...]
##END NTUPLES=NMR SPECTRUM
##END=
