##TITLE=Analysis number 320007
Compound Code cc 56104
Book Reference 458/140
Project Code adrs
Chemist Name stevem
##JCAMPDX= 6.0         $$ Bruker NMR JCAMP-DX V2.0
##DATA TYPE= NMR SPECTRUM
##DATA CLASS= NTUPLES
##ORIGIN= Bruker BioSpin GmbH
##OWNER= nmr
$$ XWIN-NMR		Version 3.5
$$ Thu Jun  8 08:23:16 2006 GMT Daylight Time (UT+1h)  MAYBRIDGE\nmr@NMR_250MHZ
##.OBSERVE FREQUENCY= 250.131544655141
##.OBSERVE NUCLEUS= ^1H
##.ACQUISITION MODE= SIMULTANEOUS (DQD)
##.ACQUISITION SCHEME= undefined
##.AVERAGES= 16
##.DIGITISER RES= 18
##SPECTROMETER/DATA SYSTEM= dpx250
##.PULSE SEQUENCE= zg30
##.SOLVENT NAME= CDCl3
##.SHIFT REFERENCE= (INTERNAL, CDCl3, 0, 16.522)
##AUDIT TRAIL= $$ (NUMBER, WHEN, WHO, WHERE, WHAT)
$$ ##TITLE= Audit trail, XWIN-NMR		Version 3.5
$$ ##JCAMPDX= 5.01
$$ ##ORIGIN= Bruker BioSpin GmbH
$$ ##OWNER= nmr
$$ C:\u/data/dgb/nmr/ADRS/420/pdata/1/auditp.txt
$$ ##AUDIT TRAIL=  $$ (NUMBER, WHEN, WHO, WHERE, WHAT)
(   1,<2006-06-08 08:22:56.11 +100>,<MAYBRIDGE\nmr>,<NMR_250MHZ>,
      <created by zg, POWCHK disabled, PULCHK disabled
       configuration hash MD5:
       E2 DF 36 D8 04 B2 41 60 5A D7 A3 38 5A 4B D0 FE
       data hash MD5: 64K
       B4 90 9B 55 45 DF 37 6D 1F 81 0B 1B 26 1E 73 88>)
(   2,<2006-06-08 08:23:07.70 +100>,<MAYBRIDGE\nmr>,<NMR_250MHZ>,
      <Start of raw data processing
       ef LB = 0.3 FT_mod = 6 PKNL = 1 SI = 32K 
       data hash MD5: 32K
       42 76 D4 41 81 9F DA FF 34 18 02 B5 89 29 EC B0>)
(   3,<2006-06-08 08:23:09.33 +100>,<MAYBRIDGE\nmr>,<NMR_250MHZ>,
      <apk 
       data hash MD5: 32K
       AD 38 D5 81 76 BA EE 47 93 E1 1D 26 48 CF 81 7A>)
(   4,<2006-06-08 08:23:10.12 +100>,<MAYBRIDGE\nmr>,<NMR_250MHZ>,
      <abs ABSG = 5 
       data hash MD5: 32K
       1F 9A 98 3B 65 8F E8 6E D4 60 F2 82 90 5F 77 6F>)
$$ ##END=
$$ 
$$ hash MD5
$$ 40 1A 51 F3 C7 33 96 DD 82 0F F6 AF 72 39 6E 0D
##$RELAX= 
##$RELAX= 
##$RELAX= 
##$RELAX= 
##$RELAX= 
##$RELAX= 
##$RELAX= 
$$ Bruker specific parameters
$$ --------------------------
##$DU= <C:\u>
##$EXPNO= 420
##$NAME= <ADRS>
##$PROCNO= 1
##$TYPE= <nmr>
##$USER= <dgb>
##$AMP= (0..31)
100 100 100 100 100 100 100 100 100 100 100 100 100 100 100 100 100 100 
100 100 100 100 100 100 100 100 100 100 100 100 100 100 
##$AQSEQ= 0
##$AQ_mod= 3
##$AUNM= <au_zg>
##$AUTOPOS= <3 >
##$BF1= 250.13
##$BF2= 250.13
##$BF3= 250.13
##$BF4= 250.13
##$BF5= 500.13
##$BF6= 500.13
##$BF7= 500.13
##$BF8= 500.13
##$BYTORDA= 1
##$CFDGTYP= 0
##$CFRGTYP= 5
##$CHEMSTR= <none>
##$CNST= (0..31)
1 1 145 1 1 1 1 1 1 1 1 1 1 1 1 1 1 1 1 1 1 1 1 1 1 1 1 1 1 1 1 1 
##$CPDPRG= <>
##$CPDPRG1= <>
##$CPDPRG2= <>
##$CPDPRG3= <>
##$CPDPRG4= <mlev>
##$CPDPRG5= <mlev>
##$CPDPRG6= <mlev>
##$CPDPRG7= <mlev>
##$CPDPRG8= <mlev>
##$CPDPRGB= <>
##$CPDPRGT= <>
##$D= (0..31)
0 1 0 0 0 0 0 0 0 0.06 0 0 0 0 0 0 0.0002 0 0 0 0 0 0 0 0 0 0 0 0 0 0 
0 
##$DATE= 1149751375
##$DBL= (0..7)
120 120 120 120 120 120 120 120 
##$DBP= (0..7)
150 150 150 150 150 150 150 150 
##$DBP07= 0
##$DBPNAM0= <>
##$DBPNAM1= <>
$$ [...]
##$SUBNAM7= <"">
##$SUBNAM8= <"">
##$SUBNAM9= <"">
##$SW= 20.6930455092707
##$SWIBOX= (0..15)
0 0 3 0 0 0 0 0 0 0 0 0 0 0 0 0 
##$SW_h= 5175.983436853
##$TD= 65536
##$TD0= 1
##$TE= 296.16
##$TE2= 300
##$TE3= 300
##$TEG= 300
##$TL= (0..7)
0 120 120 120 120 120 120 120 
##$TP= (0..7)
150 150 150 150 150 150 150 150 
##$TP07= 0
##$TPNAME0= <>
##$TPNAME1= <>
##$TPNAME2= <>
##$TPNAME3= <>
##$TPNAME4= <>
##$TPNAME5= <>
##$TPNAME6= <>
##$TPNAME7= <>
##$TPOAL= (0..7)
0.5 0.5 0.5 0.5 0.5 0.5 0.5 0.5 
##$TPOFFS= (0..7)
0 0 0 0 0 0 0 0 
##$TUNHIN= 0
##$TUNHOUT= 0
##$TUNXOUT= 0
##$USERA1= <user>
##$USERA2= <user>
##$USERA3= <user>
##$USERA4= <user>
##$USERA5= <user>
##$V9= 5
##$VALIST= <valist>
##$VCLIST= <CCCCCCCCCCCCCCC>
##$VD= 0
##$VDLIST= <DDDDDDDDDDDDDDD>
##$VPLIST= <PPPPPPPPPPPPPPP>
##$VTLIST= <TTTTTTTTTTTTTTT>
##$WBST= 1024
##$WBSW= 4
##$XGAIN= (0..3)
0 0 0 0 
##$XL= 0
##$YL= 0
##$YMAX_a= 439446
##$YMIN_a= -541191
##$ZGOPTNS= <>
##$ZL1= 120
##$ZL2= 120
##$ZL3= 120
##$ZL4= 120
##$ABSF1= 16.522
##$ABSF2= -4.171173
##$ABSG= 5
##$ABSL= 3
##$ALPHA= 0
##$AQORDER= 0
##$ASSFAC= 0
##$ASSFACI= 0
##$ASSFACX= 0
##$ASSWID= 0
##$AUNMP= <proc_1d>
##$AZFE= 0.1
##$AZFW= 0.1
##$BCFW= 0
##$BC_mod= 0
##$BYTORDP= 0
##$COROFFS= 0
##$CY= 12.5
##$DATMOD= 1
##$DC= 0
##$DFILT= <>
##$DTYPP= 0
##$F1P= 14.0000005364418
##$F2P= -0.99999901652339
##$FCOR= 0.5
##$FTSIZE= 32768
##$FT_mod= 6
##$GAMMA= 0
##$GB= 0
##$INTBC= 1
##$INTSCL= 1
##$ISEN= 128
##$LB= 0.3
##$LEV0= 0
##$LPBIN= 0
##$MAXI= 10000
##$MC2= 0
##$MEAN= 0
##$ME_mod= 0
##$MI= 0
##$NCOEF= 0
##$NC_proc= -4
##$NLEV= 6
##$NOISF1= 0
##$NOISF2= 0
##$NSP= 0
##$NTH_PI= 0
##$NZP= 0
##$OFFSET= 16.522
##$PC= 1
##$PHC0= 166.1273
##$PHC1= 8.376431
##$PH_mod= 1
##$PKNL= yes
##$PPARMOD= 0
##$PSCAL= 4
##$PSIGN= 0
##$REVERSE= no
##$SF= 250.13
##$SI= 32768
##$SIGF1= 0
##$SIGF2= 0
##$SINO= 400
##$SIOLD= 32768
##$SREGLST= <1H.CDCl3>
##$SSB= 0
##$STSI= 32768
##$STSR= 0
##$SW_p= 5175.98343685301
##$SYMM= 0
##$S_DEV= 0
##$TDeff= 65536
##$TDoff= 0
##$TI= <Analysis number 999999
Compound Code 99
Book Reference 9
Project Code 9>
##$TILT= no
##$TM1= 0
##$TM2= 0
##$TOPLEV= 0
##$USERP1= <user>
##$USERP2= <user>
##$USERP3= <user>
##$USERP4= <user>
##$USERP5= <user>
##$WDW= 1
##$XDIM= 32768
##$YMAX_p= 350934324
##$YMIN_p= -221979
$$ End of Bruker specific parameters
$$ ---------------------------------
##NTUPLES= NMR SPECTRUM
##VAR_NAME=  FREQUENCY,     SPECTRUM/REAL,   SPECTRUM/IMAG
##SYMBOL=    X,             R,               I
##VAR_TYPE=  INDEPENDENT,   DEPENDENT,       DEPENDENT
##VAR_FORM=  AFFN,          ASDF,            ASDF
##VAR_DIM=   32768,         32768,           32768
##UNITS=     HZ,            ARBITRARY UNITS, ARBITRARY UNITS
##FACTOR=    0.157963299565203, 1,           1
##FIRST=     4132.6476996994, 0,             0
##LAST=      -1043.33573715361, 0,           0
##MIN=       -1043.33573715361, -221979,     0
##MAX=       4132.6476996994, 350934324,     0
$$ Real data points
##PAGE= N=1
##DATA TABLE= (X++(R..R)), XYDATA
$$ [...]
20551I5440n4587o5307k0697l5726n527n706M2116R323N4807K2008m9367L0079
20539A6856L9192J3296M328m6093m7315J5994K6800j421l3259j114j6292m1068
20527g0096J3067K7100L6466k8052o6373J4253K0010J0072o4611l0921N3407K1331
20515f4347J2213l7058O556M0367O3553N680l7744m8908O7812L6832r090n3388
20503a7522j2563l827J1167J7234l7909l5798K9581N4823J9383J433l9367n1152
20491f4517M6638L5554l3992N1540k5837l5837N057l97k3411N621j952k5844Q014
20478e9363L6117j111j1845l763j2209N382m0098L829j8870K2231L2052j2572
20466f0220l3209n949K6409N1617L7629Q05M9096j0536m8406p5669l2408j648
$$ y = [95440, 40853, -24454, -45151, -80877, -86404, -92110, -49994, -40671, 14136, 36144, -13223, 16856, 56048, 69344, 73672, 27579, -19736, -3742, 23058, 21637, -11622, -12736, -29028, -70096, -57029, -29929, 6537, -21515, -87888, -73635, -53625, -43553, -108164, -139085, -85678, -64347, -52134, -89192, -82636, -42269, 21284, 26964, -10780, -59688, 8124, 44956, 35866, -17522, -30085, -33912, -22745, -5511, -43420, -79218, -49637, 5186, 24569, 26002, -13365, -64517, -17879, 17675, -16317, 35223, 9386, -26451, -21394, -21791, -45202, -39581, -41533, -67377, -59363, -23246, -24357, -36202, -39965, -52174, -46792, -86890, -83061, -101931, -79700, -47648, -60220, -93429, -99378, -72969, -21352, 16277, 17082, 66178, 55642, 7236, -68433, -100841, -102489]
20454a02489M8235J7615m1184m7003O6563L7495K0982M4353j5240m164J3051m1405
20442c191j2133K5817K1791J6828n49m3037J6665q938k0733l8251m2526N1654
20430c6603k643k2526m249L3509O1330q782j5020K90q0994o425O2326Q363L2105
20417B0681k1378j0903l915L7717p392K527M1660M2283j5345l3416j3994j3471
20405B5054L4652o196m3520m627K988k9342k0477K3241l429N6855M771o14L0966
20392G0322j1771J5718L894J2759J0992m1051K8123k4011l5945K0194m3576L2597
20380C8245j0460j8068M2014j5566l6667O071j4729m7154K3286N430k2795J0781
20368c9612R534j4870m532L640m5457K5295L7470K7344N1075J5062n2616l5261
$$ y = [-102489, -54254, -36639, -77823, -124826, -58263, -20768, 214, 44567, 29327, 25163, 38214, -3191, -15324, 10493, 32284, 49112, 48563, 5526, 22191, 13253, -7480, -45731, -88257, -36603, -39246, -61772, -66021, -32512, 28818, 20036, 5016, 5306, -75688, -82113, -19787, -11424, 20681, -697, -11600, -15515, 22202, 14810, 17337, 58997, 101280, 85935, 52519, 38525, 25054, 59706, 53510, 9990, 5363, 8351, -20991, -41468, -18227, -21656, 35199, 39970, 39356, 70322, 58551, 74269, 78163, 90922, 101914, 60863, 88986, 64975, 29030, 49224, 5648, 38245, 27785, 9717, 51731, 36165, -502, 5569, -9160, -56314, -33028, -27598, -50393, -39612, -30078, -44948, -49480, -45840, -91297, -66002, -28532, -1188, 49887, 64949, 12333, -22928]
20356b2928k2309J0814K9077K7068K0383j3950O532J3378J657j1241m8801J4663
20344D343j4429k389k3054O892O3868L7302p642l01k6022K6368q443K6125N4452
20331A37070K016o8017l3685R961O0625n8548l0510J5222k2301Q981k2105J215
20319g6K8492M2471M8350m0482o4719j7037l9560n2763O5050L3080Q896j7292
20307e590r408J9426k8700k5218J3318J4987k1546k4737j8550m9615J6643L0378
20295h8612K686M2626L4585l7422J0760l1960N057L1215J5390r265K2989k5410
20283b7361j1732L1669L7649L3154j9556q734R442K1589l4259p1681m6613O815
20271g9618K3967K1393Q278R105J5563N0653m3593o7264K0347J3284k724J3876
$$ y = [-22928, -45237, -34423, -5346, 21722, 42105, 28155, 34687, 48065, 49722, 38481, -10320, 4343, -10086, -12475, -35529, -28637, 35231, 72533, 64891, 64590, 38568, 64936, 56493, 82618, 137070, 139086, 71069, 37384, 47345, 107970, 49422, 18912, 34134, 11833, 20814, -1291, -76, 28416, 70887, 119237, 78755, 14036, -3001, -42561, -95324, -30274, 2806, 11702, -5590, -14998, 4428, -24272, -49490, -36172, -21185, -42731, -67468, -86018, -135633, -118990, -88612, -85926, -43300, -8715, -46137, -35377, -67337, -62280, -31065, -15675, -24940, -1951, -27361, -39093, -7424, 30225, 63379, 43823, 35089, 44531, 66120, 31861, -39820, -86433, -79618, -55651, -34258, -25980, -16875, -1312, 49341, 5748, -61516, -41169, -27885, -30609, -16733]
20259a6733L5862l3398o7167J1886O5527O2772l230L5531k2149k9643K51Q543
20247D8052K4389J7893n4007l6368j1897O441L4715L5113n0162r135O9417j6069
20235E8382o3408q559L6204j4591m3456J2946L1210O1829K7066l2862j06k4692
20223C9963n6493J361M6836L0474J1842m4761J0413j975L9817l9926o8950p332
20211c8731J1437L1904Q603j6238N852L8605L5732M8199O975k8485l7536L8596
20199A04913j1105n1068J635k3023N0766J9199k0311k0375j8476j8308q713J9601
20187B4735j9215k0253L709l9842Q995M1981N6052j7652o0474l2738P8345J3367
20175C7010l4902J3946J1381m5354j2079j2352K8949K0904O602r461j137M2091
$$ y = [-16733, 19129, -14269, -81436, -69550, -4023, 58749, 55519, 91050, 68901, 39258, 39509, 48052, 72441, 90334, 36327, -41, -11938, -5497, 29218, 64331, 14169, 5034, 74451, 58382, -5026, -13585, 22619, 8028, -35428, -22482, 8728, 70557, 97623, 64761, 64655, 39963, -16530, -15169, 31667, 62141, 73983, 29222, 39635, 37660, 77477, 37551, -31399, -38731, -27294, 4610, 13213, -3025, 2827, 41432, 77164, 125363, 132338, 103853, 66317, 104913, 93808, 42740, 44375, 21352, 72118, 91317, 71006, 50631, 32155, 13847, 5134, 24735, 5520, -14733, -11024, -50866, -41871, 110, 56162, 38510, -21964, -54702, 23643, 37010, 2108, 16054, 27435, -17919, -29998, -42350, -13401, 7503, 14105, 4644, 3507, 45598]
20163D5598M3285l5181j8162J9895L6409k3718p9554j6377o055N7613n7847l096
20151c7190K6145K7907Q357J7450m8302p5381l7122j4731P2314K4444n4097O499
20139h3707R571j5307K2888n151j3557M2545L6403M5617N969p2922n2211P249
20127g2613J1573P2088L0879m4891k7237l930K2288j4576k0501l9423L220j126
20115h4249k045p554J10949K0852p2071m0400J7828P7445L5859K5054o0863k7943
20103g138j7107j8687o7262L112N6570P0555o0314o529J4723j0762M6348K0954
20091B4463k6647J7119L5265K8155l5689p9930Q64M0309L2321J5458N1420O7260
20079A70368m5137l2211l3901p356j9694j0838m4K9277r509o6035j0187N0505
$$ y = [45598, 88883, 53702, 35540, 55435, 91844, 68126, -11428, -27805, -33860, 23753, -34094, -37190, -11045, 16862, 25219, 42669, -5633, -81014, -118136, -132867, -60553, -36109, -90206, -83707, -74136, -89443, -66555, -71706, -85263, -42718, -6315, 39302, 45271, -27651, -79862, -72613, -61040, 11048, 41927, -2964, -30201, -34131, -11843, -26419, -46920, -86343, -83123, -84249, -86294, -93848, 17101, 37953, -34118, -74518, -56690, 20755, 56614, 81668, 20805, -7138, -24245, -42932, -110194, -107082, -50512, 20043, -40271, -46800, -32077, -42839, 3509, 24463, -2184, 14935, 50200, 78355, 42666, -37264, -36400, 3909, 36230, 51688, 103108, 170368, 125231, 93020, 59119, 51763, 32069, 21231, 21187, 50464, 40955, -25080, -35267, 15238]
20067A5238o1774M72K5027L0824P155L732m7910K5505M5810J6028J48j9096m8649
20054g490K1723p818j165K0025L7760K8534j9529k219J1579l1m7404j8401Q069
20041B3633J5560j1680M3261L5118o809o7225m012M9653K2824r160J6690K2666
20029A30519l1062m9259K0600k2980L2891m545O549L6139o1578J5707J3604J2464
20017I9049l1620l9623K0274J2364j0385J6151M4720o4016O09K4532K0j312j8069
20004E2694J7661n776M094l918n4112k056j567p900J4733P157l6217j2127M354
19991b2980K8392j3471l7621r609O7424P1728l2382l9297n3712J9960P6824j8296
19979C6960m4197J5976j8583k3446K9622P61n220l5147K0870M086K1449k6868
$$ y = [15238, -46536, -46064, -21037, 9787, 16942, 20674, -27236, -1731, 44079, 60107, 60255, 41159, -7490, 14233, 6415, 5250, 25275, 63035, 91569, 72040, 69821, 81400, 81369, 33965, 15564, 23633, 39193, 27513, 70774, 105892, 99083, 31858, 27846, 77499, 100323, 91163, 107853, 130519, 99457, 50198, 70798, 47818, 80709, 76164, 82713, 118852, 57274, 72981, 86585, 99049, 67429, 27806, 48080, 60444, 50059, 66210, 110930, 46914, 47523, 72055, 72075, 70763, 52694, 70355, 64579, 68673, 64755, 10643, 8587, 7020, -880, 13853, 21010, -15207, -27334, -22980, 5412, -8059, -45680, -55289, 12135, 83863, 51481, 12184, -41528, -21568, 55256, 36960, -7237, 8739, -9844, -33290, -3668, -2907, -8127, -43274, -22404, -18318, 3131, -23737]
19967b3737L1515J4221q030l08L1269M0094M6191L16p8210q790N6664K545k3689
19954H0051l0605q089l5168n1221O416L5501j4162n4776J527k582N6662J4121
19942b325k9689N8312L1039J5294l4276l264j3252L0611n439k2643J5405J0019
19930D9792n621k79Q3016J1894j2588m4244k8311l8614M821L4681J2258k3974
19918D2831j9713N0782R036l1648o2038l2141K6323P8084o464n217o166M509k1132
19905B7046K7938L8749J1819n5877M6612P2702L1171K5584O7938O4568L3338L3232
19893D24820O7250M5543M3427K5939M7954P6572P9432P1316J3476L2314L3936
19882I61979M8865K0905p3249p7857Q248K5958j7252m8540M2075K0375j9705o7595
$$ y = [-23737, 7778, 21999, 13969, 13661, 44930, 85024, 131215, 131531, 53321, 44531, 101195, 103740, 80051, 49446, 41357, 6189, -45032, -38616, -3115, -17277, -72053, -70526, -73108, -16446, -2325, -32014, 26298, 57337, 72631, 38355, 35091, 21839, 52450, 47011, 24368, 39773, 49792, 44171, 43892, 126908, 138802, 126214, 81970, 53659, 15045, 19866, 54547, 66805, 42831, 23118, 73900, 82936, 51288, -10750, -42891, -16568, 61516, 55052, 49835, 43669, 48178, 27046, 54984, 93733, 105552, 49675, 96287, 168989, 200160, 225744, 293682, 358250, 391588, 424820, 492070, 537613, 581040, 606979, 654933, 731505, 810937, 882253, 895729, 928043, 961979, 1010844, 1031749, 958500, 880643, 888891, 914849, 897597, 849057, 891132, 911507, 891802, 824207]
19870H24207p014m4951p6695p3151r3879r0429j43693k6523J4368j5009n4517
19859B12714j2680j8292l7149m5558k8760K6204m369r875K8269p082k4566m1692
19847C7164m211N574L7513L1427j0803m892L0331j2584o145m046k4336l7838J8280
19834E5434k6833n6697K5595L1645Q751K2231K9800k6405k6366J5137j0115n2099
19822i922K2707Q3498L5371m1624j55J1419L7119P3702k4158m4712J8492K9004
19810A90741j1378q1779o9818j526j882k5145J6333j7652K587j3627q458L9912
19798A8308J0855L4002L5695J5167n8626r002M8877l1K803m9267j2161J2966L1259
19785H0845n0971l8143K7265M3140J6273j5629J3857j7063J044K011N647j4023
$$ y = [824207, 817193, 772242, 695547, 622396, 528517, 438088, 294395, 267872, 282240, 267231, 212714, 200034, 181742, 144593, 99035, 70275, 96479, 92110, 82235, 110504, 103422, 78856, 37164, 32953, 38527, 76040, 107467, 96664, 91772, 122103, 109519, 103374, 99328, 74992, 37154, 55434, 28601, -28096, -2501, 29144, 37895, 60126, 89926, 63521, 37155, 52292, 42177, -9922, 12785, 96283, 131654, 90030, 89875, 101294, 138413, 212115, 187957, 143245, 161737, 190741, 179363, 97584, 27766, 26240, 24358, -787, 15546, -2106, 481, -13146, -21604, 18308, 29163, 63165, 98860, 114027, 55401, 46399, 95276, 95245, 98048, 48781, 36620, 49586, 80845, 29874, -8269, 18996, 62136, 78409, 62780, 76637, 59574, 60618, 62629, 68276, 54253]
19773E4253K6270m393o0137m2849K3908k569l8747J8595P254k1863l8034O896
19761g1416P83j8884r315K7845O2424O051K8892M5100J835N7928l3732o2438J2242
19748D7315N1653L445m6634R950K0319L7837L0661K4612m8937r2531j4537Q302
19736C1455K2097N4501J908n3324j0928K4668J3508J4845k7182K9881L0332K4281
19724A56042O492l6168M8824M508l7953l941l0491o6350m0701N6326N1741n9276
19712D9053n2192K6965L7911K7317l789k1976n5651P9155p574p0642k4087N679
19700i831k009k6991J9967L6492j7391L8130N5725k165r443j7309N236N9251K1588
19687A51250q0132j6937L9441l5141k7262K0871J6847j7965L5749j5665J7963
$$ y = [54253, 80523, 76130, 15993, -26856, -2948, -5517, -44264, -25669, -18415, -40278, -78312, -71416, -70633, -89517, -98832, -70987, -8563, -2512, 26380, 71480, 73315, 131243, 97511, 35073, 47315, 98968, 102413, 55779, 65729, 86048, 123885, 154546, 179158, 130221, 37690, 23153, 31455, 53552, 108053, 109961, 56637, 45709, 70377, 83885, 98730, 71548, 101429, 131761, 156042, 162534, 126366, 175190, 179698, 141745, 137804, 107313, 40963, 262, 56588, 108329, 49053, -3139, 23826, 61737, 89054, 85265, 63289, 7638, 86793, 79219, 8577, -15510, -9831, -11840, -38831, -18864, 17628, 237, 38367, 94092, 91927, 82484, 65175, 70411, 129662, 151250, 71118, 54181, 93622, 58481, 31219, 52090, 68937, 50972, 86721, 71056, 89019]
19676H9019L3675p679q3307o7680L1896J3467K2898k2424k3299O9624M6082k6080
19664G6192k3020J802J7269j7154R432k3022j0135K2240l1362j5727N1845L8431
19652I6791j9676J2185M7578k1997k7966q401O67L275P277j2658m3227K223Q370
19639D4441j9198k6442L9252K2590J699R492O4901K2576n1965l8967J9311N9416
19627A47106m2k3104k9385n0843J6474j9173N4655L8322k3481k043o664J1585
19615A13407l8583k3740n1086l0060J9368K9447J5306K831m0525j52L4710M1484
19603G2407O648j3068l0057L914J4090N671P749N8078J0624M1274j0831P441K0724
19590A94664O983q4440k2637K6794L7662m1063l1357J6369n244K130J7716j2838
$$ y = [89019, 122694, 115015, 31708, -35972, -4076, 9391, 32289, 9865, -13434, 56190, 102272, 76192, 53172, 54974, 72243, 55089, 64521, 41499, 31364, 53604, 22242, 6515, 58360, 96791, 77115, 89300, 136878, 114881, 86915, 78514, 79181, 82456, 89733, 77075, 33848, 36071, 44441, 25243, -1199, 38053, 60643, 62342, 71834, 136735, 159311, 107346, 68379, 87690, 147106, 147064, 123960, 94575, 43732, 60206, 41033, 95688, 134010, 110529, 108486, 101822, 113407, 74824, 51084, -2, -30062, -10694, 18753, 34059, 36890, -3635, -3787, 30923, 72407, 79055, 65987, 35930, 39844, 53934, 59605, 67354, 125432, 136056, 177330, 166499, 173940, 194664, 201647, 117207, 94570, 121364, 159026, 117963, 86606, 102975, 97731, 99861, 117577, 104739]
19578A04739J7146j3631L367k5385m225O080M7632L7347L0543m1923j4493Q080
19566A55277R3830J09858J42370J73478J49432O2388n8273N428Q5418J13636P3494
19555A106336R501m5423r415J9238M7931n4348m4034l3659Q527K1380K8478j47034
19543I07478j37697l9632j01070j34296o2446n67j881k4848n7936j8678p271J5161
19531C36317M7333k6722m025K8971k862m3630k7046P0707N8526L923M7717K125
19519D91334r771Q7500J15830J67687J97914J71705M8477j1161k928O1268O3257
19508A381112R853j203m2952L7555P3170m8739j1342k3129m1936l1804k0460q4466
19496A195659j23874j06479r7721o7974q9363r4834r2157j3625k872k7333m6322
$$ y = [104739, 121885, 108254, 111621, 86236, 82011, 88091, 135723, 173070, 203613, 161690, 147197, 155277, 249107, 358965, 501335, 674813, 824245, 886633, 828360, 833788, 919206, 1032842, 1106336, 1115837, 1070414, 1060999, 1080237, 1128168, 1073820, 1029786, 996127, 1004654, 1026034, 1054512, 907478, 769781, 730149, 629079, 494783, 432337, 431770, 429889, 405041, 347105, 328427, 321156, 336317, 383650, 356928, 352903, 381874, 379012, 335382, 308336, 379043, 437569, 441492, 489209, 491334, 481563, 569063, 684893, 852580, 1050494, 1222199, 1270676, 1259515, 1256587, 1317855, 1381112, 1390965, 1389762, 1346810, 1384365, 1457535, 1408796, 1397454, 1374325, 1332389, 1300585, 1280125, 1195659, 1071785, 965306, 867585, 799611, 710248, 615414, 523257, 509632, 506760, 479427, 433105]
19485D33105j6946L8421J5038q0292j1179M4652N5781J5465l6870K7554R842L5852
19473E30423l034l2058J8987M0000L6655k0206M8559J9035k7270o8520k7474o6318
19461D48779o1339k1077j7141m5389j4619K1350m7967j7445p066l8389Q915N0759
19449B59371J790l5238N816k346m4559n7645j4788L0765R6228N667q2485n7634
19437A04942J5812K6675R395J7885K2805j2729l3098l377K4706q038j9269j5458
19425A30251k4394K4565L2602L2145j6700l3735k5448O3994j3197q320m4924j1800
19413A05039p770K7246K0589K526K4729J417n1186R209J0063j6136k8082N0331
19401A47975P26l0415L3331p774j5870N9212L2650J9018n1622o5516K0990M0482
$$ y = [433105, 416159, 454580, 469618, 389326, 378147, 422799, 478580, 494045, 457175, 484729, 494571, 530423, 527389, 495331, 514318, 554318, 590973, 570767, 619326, 638361, 611091, 542571, 515097, 448779, 387440, 366363, 349222, 303833, 289214, 310564, 262597, 245152, 238086, 199697, 208612, 259371, 261161, 225923, 231739, 229393, 184834, 127189, 112401, 143166, 239394, 245061, 162576, 104942, 120754, 147429, 156824, 174709, 197514, 184785, 151687, 148310, 173016, 164978, 145709, 130251, 105857, 130422, 163024, 195169, 178469, 144734, 119286, 183280, 170083, 161763, 116839, 105039, 97269, 124515, 145104, 147630, 172359, 173776, 122590, 131799, 141862, 125726, 97644, 147975, 148701, 118286, 151617, 143843, 127973, 187185, 219835, 238853, 187231, 121715, 142705, 183187]
19389A83187j2528n6258M295K7118N0446L1697j2050k6750O827K1642K3037j535
19377B39128k2895k6122l0928l7003K1787J9126J109M82J8357p183l4424K8584
19365A70018L1131k752l6068q0462j5428J6606J924j9793m736L5581J2950P646
19353A16617l8732N3807l927p5803N3902P2471m4014j5307j6693O414K1752K1407
19341A51894l825j2958j9922J8561J0139N1775j6936q298J2021K6427J1896m3441
19329A77333p5629R37O3455L4814K5167K0358L8442J7760M9789O5798O630k1135
19317D03719m774J7950N9418K3907P5846L0231N9288P710j6747k392j0151L9070
19305F83075N8841M3384L1057L2934K8302J1320m2266k8134k8109k1687L7991
$$ y = [183187, 170659, 114401, 118696, 145814, 196260, 227957, 215907, 189157, 195984, 217626, 240663, 239128, 216233, 190111, 159183, 122180, 143967, 163093, 164202, 164684, 183041, 175858, 141434, 170018, 201149, 198397, 162329, 81867, 66439, 83045, 84969, 65176, 60440, 96021, 108971, 116617, 77885, 131692, 127765, 51962, 105864, 178335, 134321, 119014, 102321, 108735, 130487, 151894, 148069, 135111, 115189, 133750, 143889, 195664, 178728, 170430, 182451, 208878, 220774, 177333, 101704, 102641, 166096, 200910, 226077, 246435, 284877, 302637, 352426, 418224, 424854, 403719, 398945, 416895, 476313, 500220, 576066, 606297, 665585, 673295, 656548, 654156, 644005, 683075, 741916, 785300, 816357, 849291, 877593, 888913, 846647, 818513, 790404, 768717, 806708]
19294H06708j324q8886p7624m9247j7957o734o3550m0311j8385J1389l4892l4421
19282C84766l5641L4071P0297N0050k8582O230K133k3788k1318l1600k1353P582
19270C92847m400J6658m6360j2294p463K5315K4874J3958j1878k5139m8283M4195
19258C62030k051J7731L5242K1909m010j1149j9514l9440J4250k5981o218L790
19246C46589K9230Q804J9098k1172k3040n6596J818j8480q639N4745N1792l0431
19234C53718k0850L954k2462k1435N208k3797M063K6281j1944L7153O7647P9316
19222D76852m209m3393m1037O9460R6683o36k5869L3526n5553k9121Q033N8105
19210E42841N0551o525O289k5845j6057m0069M0853N8104O0964O4617L8879M2775
$$ y = [806708, 805384, 716498, 638874, 589627, 571670, 564936, 501386, 461075, 442690, 454079, 419187, 384766, 349125, 383196, 453493, 503543, 474961, 481191, 483324, 459536, 438218, 406618, 385265, 392847, 388447, 405105, 358745, 346451, 338988, 364303, 389177, 403135, 391257, 366118, 317835, 362030, 359979, 377710, 412952, 434861, 430851, 419702, 400188, 360748, 374998, 349017, 342799, 346589, 375819, 384623, 403721, 382549, 359509, 302913, 304731, 286251, 277612, 332357, 384149, 353718, 332868, 336822, 314360, 292925, 298133, 274336, 278399, 304680, 292736, 329889, 397536, 476852, 472643, 429250, 388213, 457673, 554356, 553720, 527851, 561377, 505824, 476703, 484736, 542841, 593392, 586867, 593156, 567311, 551254, 511185, 552038, 610142, 671106, 735723, 774602, 817377]
19198H17377l279J0023O6721Q3926O1399j3817K1408K1697o157L5829n010O566
19186A096683l9217l7300K8389N591n5496K5039K9973m2131j00160r234n7036
19175H45101q3176p2435l8041l4798l7172m522o781l9201Q765K0678m2892j5939
19163D99587l3429R242j4010k6512J7225N5054L0714K6138k9001l7005L6062P6588
19151F10653k6373O4704L9353j2499K3228K946k5108L2225O7179J3290k2242K78
19139G67634K4592l650o8424m5206k2691j2347m3004j1084K4021j7904n1923p458
19127E32556K7582R109P956J7610j8687J7193m0829k0636j0716l4065j1146r547
19115D66380N368L0118J5599K735j8595J5814R9720N8527q607k5104l2180m7314
$$ y = [817377, 814098, 824121, 890842, 974768, 1036167, 1022350, 1043758, 1065455, 1059298, 1095127, 1090117, 1096683, 1057466, 1020166, 1048555, 1054146, 998650, 1023689, 1053662, 1011531, 911371, 902137, 845101, 761925, 689490, 651449, 616651, 579479, 574957, 568176, 528975, 537740, 558418, 515526, 499587, 466158, 475400, 461390, 434878, 452103, 507157, 537871, 564009, 535008, 498003, 534065, 610653, 584280, 648984, 688337, 675838, 699066, 702012, 676904, 709129, 776308, 789598, 767356, 767634, 792226, 788576, 720152, 674946, 652255, 639908, 596904, 585820, 609841, 591937, 540014, 532556, 560138, 569247, 577203, 594813, 576126, 593319, 552490, 531854, 521138, 487073, 475927, 466380, 471748, 501866, 517465, 520200, 501605, 517419, 617139, 675666, 667059, 641955, 609775, 562461]
19103E62461K2821Q394L4952M0515J2798J7284K4962l4340K1067P1589N7056J4695
19091H54254N8170P6794N5440j3878k9927j492O5520M1441K4458n971K2326m187
19079A142948n809m8301j1145K1375l8079R819k1034j8270l6129n266k6737L966
19067I67338j6885O1284J1764j3817P1257L0356j0137K3924K0568K5501M2271
19056A213424N0890M5101N4272L3984L9308J0458k4706q360l172O5870J710L3508
19044A512287O9693J27983N9859N6828N9130J09435J29843J89748K00573K40626
19034B756005K21431K97239L21014K95989L91252N29521O89145R83450J378249
19025G863295J871500K266296K512542K789288K723612K405185K258942K185723
$$ y = [562461, 585282, 593676, 628628, 669143, 681941, 699225, 724187, 689847, 710914, 782503, 839559, 854254, 912424, 989218, 1044658, 1030780, 1000853, 999361, 1064881, 1106322, 1130780, 1124809, 1147135, 1142948, 1137139, 1088838, 1077693, 1099068, 1060989, 1070808, 1049774, 1031504, 995375, 990109, 963372, 967338, 950453, 1011737, 1023501, 1009684, 1080941, 1111297, 1101160, 1125084, 1145652, 1171153, 1213424, 1264314, 1309415, 1363687, 1397671, 1436979, 1447437, 1422731, 1414371, 1411199, 1477069, 1478779, 1512287, 1581980, 1709963, 1769822, 1826650, 1885780, 1995215, 2125058, 2314806, 2515379, 2756005, 2977436, 3274675, 3595689, 3891678, 4282930, 4812451, 5501596, 6485046, 7863295, 9734795, 12001091, 14513633, 17302921, 20026533, 22431718, 24690660, 26876383]
19017B6876383K207093K533683K858699L052407L310863L634060L460428K601789
19009E0535405J990358J660442J173358P81947K48524q03570j597738j673865
19001E2314861j896648k311298k207878j837862j773802j877169k150410k709207
18993C5550587l057632l056586k961502k659096k128697j673426j380160j108601
18985A7524887q20652n19017j04913K38501P75981J287660J826926K149648K419029
18976B4778050K858578K834417K427361K106231K120412K412899K775685L006341
18968D5319974L051722L439721M019195L953429L094682K254142J701966J116634
18960F7951465P53474J24297j238941k121391j964134k031927k681544k820385
$$ y = [26876383, 29083476, 31617159, 34475858, 37528265, 40839128, 44473188, 47933616, 50535405, 52525763, 54186205, 55359563, 56141510, 56390034, 55586464, 53988726, 52314861, 50418213, 48106915, 45899037, 44061175, 42287373, 40410204, 38259794, 35550587, 32492955, 29436369, 26474867, 23815771, 21687074, 20013648, 18633488, 17524887, 16704235, 16185218, 16080305, 16318806, 17094787, 18382447, 20209373, 22359021, 24778050, 27636628, 30471045, 32898406, 35004637, 37125049, 39537948, 42313633, 45319974, 48371696, 51811417, 55830612, 59784041, 62878723, 65132865, 66834831, 67951465, 68704939, 68829236, 67590295, 65468904, 63504770, 61472843, 58791299, 55970914]
18952E5970914k486183k447181k546842k747973l481815l926262l840678l788382
18944C0705598l632176l129910k525096k109943j707946j443756j275247j052985
18936A3828539q29651o95592o50875o26874n55215n12796m56174m93612l86545
18927H621205l39207l74011l78730l40390k87753k72215k64981j79323j96112
18918E988483k17887j87558j76840j43312j79513j02662j12847q3727o8596n4325
18908D661216l9713q9930q8970j7363J972m9623n0328q1860o8070l6442m3896
18897D096993m708p6591p4112j15323j39503q5177j20992r4013o2036k7209o5015
18886C232314n5814m9534j5695p0098q9227l7879m6104n0171j36703j16393M9065
$$ y = [55970914, 53484731, 51037550, 48490708, 45742735, 42260920, 38334658, 34493980, 30705598, 27073422, 23943512, 21418416, 19308473, 17600527, 16156771, 14881524, 13828539, 12998888, 12303296, 11652421, 11025547, 10470332, 9957536, 9501362, 9007750, 8621205, 8281998, 7907987, 7529257, 7188867, 6901114, 6628899, 6363918, 6184595, 5988483, 5770596, 5583038, 5406198, 5262886, 5083373, 4980711, 4867864, 4784137, 4715541, 4661216, 4621503, 4531573, 4442603, 4425240, 4427212, 4377589, 4327261, 4245401, 4177331, 4140889, 4096993, 4092285, 4015694, 3941582, 3826259, 3686756, 3601579, 3480587, 3386574, 3324538, 3297329, 3232314, 3176500, 3126966, 3111271, 3041173, 2951946, 2914067, 2867963, 2817792, 2681089, 2564696, 2613761]
18875B613761N1971l3880o4985p7945r0768m3315m5102p111j4616N173j0476Q239
18863B290946L2215N67L8906N2749J748l8476K2905L9400L6885L3149l6121o8434
18851B406439k8991l5640q1354L526J3610J4781j2841j0292O9416Q9172Q1203
18840B509029M7031J85258K36850K01441J44049J91939K95779K70952K99231L75728
18830D757287L53057N35533O37281P79923J025997J414664J921801K472798K745272
18821A6643613L024303L891354N017134N398884M697712M309241N048747O359729
18813E4390717O407632M865731L468243M195213O250906O933111N346153L301713
18805I5159419K999027M411161N420530M147227Q88255j694660j475830K46021
$$ y = [2613761, 2665732, 2631852, 2566867, 2488922, 2398154, 2354839, 2309737, 2302626, 2288010, 2293183, 2282707, 2290946, 2323161, 2323728, 2362634, 2415383, 2417131, 2378655, 2401560, 2440960, 2477845, 2510994, 2474873, 2406439, 2377448, 2341808, 2260454, 2263980, 2277590, 2292371, 2279530, 2269238, 2338654, 2427826, 2509029, 2556060, 2741318, 2978168, 3179609, 3323658, 3515597, 3811376, 4082328, 4381559, 4757287, 5110344, 5645877, 6283158, 7063081, 8089078, 9503742, 11425543, 13898341, 16643613, 19667916, 23559270, 28576404, 33975288, 38673000, 42982241, 48030988, 54390717, 60798349, 65664080, 69132323, 73327536, 79578442, 86511553, 91857706, 95159419, 98158446, 102569607, 107990137, 112137364, 113025619, 111330959, 109855129, 110101150]
18797A10101150j38650l390235o020433n399080l296910k747295m317794o136833
18789G8653920o260548m839963l801908m565385n766662n706723m602961l937427
18781C9172343l913301l745044l228149k654462k226459j842041j582760j369138
18773A8610989j211011j008042r10359q94139q32090p36466o56920o44398n10902
18764A1206662n38537n13698m73222m11174l79756l25776l39339l06693k54688
18755G663779k81439k44540j75230j74399j85597j30876j93767j93511j92968
18746E891452j08743j54171j17567r0356p5347j34935j85020q7312r6779j26093
18736D715129j39247o3837j35008q1864m6425r9283r4594p5070j11223n8869p5298
$$ y = [110101150, 109962500, 106572265, 100551832, 95152752, 91855842, 89108547, 84790753, 78653920, 72393372, 67553409, 63751501, 59186116, 53419454, 47712731, 43109770, 39172343, 35259042, 31513998, 28285849, 25631387, 23404928, 21562887, 19980127, 18610989, 17399978, 16391936, 15481577, 14587438, 13755348, 13018882, 12361962, 11717564, 11206662, 10668125, 10154427, 9681205, 9270031, 8890275, 8564499, 8225160, 7918467, 7663779, 7382340, 7137800, 6962570, 6788171, 6602574, 6471698, 6277931, 6084420, 5891452, 5782709, 5628538, 5510971, 5420615, 5345268, 5210333, 5025313, 4938001, 4841222, 4715129, 4575882, 4512045, 4377037, 4295173, 4248748, 4149465, 4054871, 3979801, 3868578, 3809709, 3734411]
18725C734411j05030r8013k0162n9603p3758m6874r2574p3639j12725p9430p5074
18714B897529m7459j02049o9066l2268l5807l8560n9396l3757m9127p361j4016
18703B408663n0129n5514k9743k7130p0127N27k6687o3700k6554k0984M7394M8141
18691B134157L2277m2745M587k8482p1489o6488p4021l7049j436k3020n4318K4828
18679A796801M0610M6355O799k7461L3710o430J1838j1625k8837P7596P0958P6953
18667B087267J51523P3285M3367L5577J9777N9969N940K0953M9958M8101O3248
18656B658965L3520J01302J09641J05806Q3032P7168M7527J26511J78446K24537
18646C746455J75826J28418J13163J24477J72143P7173J05848J45413K00818K80526
$$ y = [3734411, 3629381, 3531368, 3511206, 3451603, 3377845, 3330971, 3238397, 3164758, 3052033, 2972603, 2897529, 2850070, 2748021, 2678955, 2646687, 2610880, 2572320, 2512924, 2479167, 2430040, 2422679, 2408663, 2358534, 2303020, 2273277, 2246147, 2176020, 2176547, 2149860, 2086160, 2059606, 2038622, 2086016, 2134157, 2166434, 2123689, 2128276, 2099794, 2028305, 1961817, 1887796, 1850747, 1849311, 1826291, 1771973, 1796801, 1837411, 1883766, 1890565, 1863104, 1896814, 1890384, 1902222, 1890597, 1861760, 1939356, 2010314, 2087267, 2238790, 2312075, 2355442, 2391019, 2410796, 2470765, 2476705, 2497658, 2547616, 2595717, 2658965, 2692485, 2793787, 2903428, 3009234, 3092266, 3169434, 3216961, 3343472, 3521918, 3746455, 3922281, 4050699, 4163862, 4288339, 4460482, 4537655, 4643503, 4788916, 4989734, 5270260]
18636E270260K99945K72924K42857L30522L98522L87841M20484N08348N90284
18627H721987P43415Q50029J034297J265155J534006J953286K557306L345658
18619B2005139M381290N714609P120417Q033875Q205649P897342P782357Q026400
18611G9167078P631478N886841L378964J578845J451330K115058K151947J347919
18603A04709460M32137K02204P43676J603585J698327J05389k371417m390746
18595A02732615n104874n298989o224614p606916q331783q050041p085239o081623
18587D8948536n222508m366755l630436k953965k415816k063068j730407j536042
18579B5029539j292847j082866q57714p91118p41860p41724o73161n10558k95296
$$ y = [5270260, 5570205, 5843129, 6085986, 6416508, 6815030, 7202871, 7623355, 8131703, 8721987, 9465402, 10315431, 11349728, 12614883, 14148889, 16102175, 18659481, 22005139, 26386429, 32101038, 39221455, 47255330, 55460979, 63358321, 71140678, 79167078, 86798556, 92685397, 96064361, 97643206, 99094536, 101209594, 103361541, 104709460, 105141597, 105343801, 106087477, 107691062, 109389389, 109494778, 107123361, 102732615, 97627741, 92328752, 86104138, 78497222, 70165439, 62115398, 55030159, 48948536, 43726028, 39359273, 35728837, 32774872, 30359056, 28295988, 26565581, 25029539, 23736692, 22653826, 21796112, 21004994, 20263134, 19521410, 18848249, 18337691, 18042395]
18570A8042395k01080o0817L41898P71264J382421J992358K461395K766950K809405
18561C0306189K888203K878271K558246J946052J029107P8170q46318j641934
18553C9195986k222597k688365l001118l167633l125916k797620k360698j966966
18545A7865073j599168j248724j020867r05967o79589m76712l80912k92180j95776
18536A1065178j74364j34427n7025q8778n3754n9418m5882Q641j1550L2974J20775
18525A0602370K83838M60900O86632J026174J591219K341774L432861M753555
18517B5179323O247429P549784Q578064R100278R112569Q639643P540732N947775
18509H7895597L835652J265310j234113l529031n464026o814501p559991q011526
$$ y = [18042395, 17841315, 17780498, 18122396, 18893660, 20276081, 22268439, 24729834, 27496784, 30306189, 33194392, 36072663, 38630909, 40576961, 41606068, 41684238, 40837920, 39195986, 36973389, 34285024, 31283906, 28116273, 24990357, 22192737, 19832039, 17865073, 16265905, 15017181, 13996314, 13090347, 12410758, 11934046, 11553134, 11260954, 11065178, 10890814, 10756387, 10699362, 10610584, 10556830, 10497412, 10451530, 10460171, 10448621, 10481595, 10602370, 10886208, 11347108, 12033740, 13059914, 14651133, 16992907, 20425768, 25179323, 31426752, 38976536, 47554600, 56654878, 65767447, 74407090, 81947822, 87895597, 91731249, 92996559, 91762446, 88233415, 82769389, 75954888, 68394897, 60383371]
18501F0383371q054435p313891o206112n076383m132020l292754k550936j983682
18493B1773158j576475j278312j044738q06335o96704o72503n49510n14132m23845
18484A4210604l88516k86510k23580j20402o5477l4509R3457L24994N71997R11395
18474A4993453J257010J959766L130209M533249N807735O634275O756926O621321
18466E1693944O473713O409630N783303M137672J750096o53670k510289l653545
18458F9430854m292074m929145n497853n732322n004121l565300j968791m97849
18450C7943399N54381J250504K176343L338115L773108K986851K277059K391163
18442E6690923L327244M125776L813815K859913L100101M545410N235279M408807
$$ y = [60383371, 52328936, 45015045, 38808933, 33732550, 29600530, 26307776, 23756840, 21773158, 20196683, 18918371, 17873633, 17067298, 16370594, 15698091, 15148581, 14634449, 14210604, 13822088, 13535578, 13311998, 13191596, 13126119, 13091610, 13185067, 13510061, 14082058, 14993453, 16250463, 18210229, 21340438, 25873687, 31681422, 38315697, 45072623, 51693944, 58167657, 64577287, 70360590, 74498262, 76248358, 75594688, 73084399, 69430854, 65138780, 60209635, 54711782, 48979460, 43975339, 40410039, 38441248, 37943399, 38497780, 39748284, 41924627, 45262742, 49035850, 52022701, 54299760, 56690923, 60018167, 64143943, 67957758, 70817671, 73917772, 78463182, 83698461, 88107268]
18434H8107268L026287J729292J105309J158177Q12225j133699l190550l495988
18426H8118321k503107j953684k666436l334513l138437k360975j740455j857016
18418F8563698k830226k759145p29645J546513L559782N530774O927597O801361
18410H6610709O497726P425443Q517480P385715L435292r25465k969985k332447
18402A13644468j588930k077528k156642q9446K918507M380757M161518M555798
18394A23748502O130655P388451N275513K41531m112609n155057m449578n248854
18386A23818554p838744r974731r998052q444643o799254n904636n666530n368185
18378F3823779m521375l583866l232568l357629l112508k753197k355669k120775
$$ y = [88107268, 91133555, 92862847, 93968156, 95126333, 95938558, 94804859, 91614309, 88118321, 85615214, 83661530, 80995094, 77660581, 74522144, 72161169, 70420714, 68563698, 65733472, 62974327, 62244682, 63791195, 67350977, 72881751, 79809348, 86610709, 93108435, 100533878, 109051358, 116437073, 119872365, 118946900, 115976915, 113644468, 112055538, 109978010, 107821368, 107731922, 110650429, 115031186, 119192704, 123748502, 129879157, 137267608, 142543121, 142784652, 138672043, 133516986, 129067408, 123818554, 115979810, 106005079, 96007027, 87562384, 80763130, 74858494, 69191964, 63823779, 59302404, 55718538, 52485970, 49128341, 46015833, 43262636, 40906967, 38786192]
18370C8786192k266885k523173k380787k021207j928070k010277j818098j535579
18362B2302116j360358j219877j056862r85656r10030q42433p55152p25259o79625
18353A3766864o19861n06490m01520m34557m43062m34210m24158l54484k62617
18344I885905k50336k23558k08794k04001j08972q3629q3837j46609j09787r4881
18334H371501j78253j84681j68355k08006j87993k18856k05424j65580j67918
18325F686435q7732o8337j16098j04021p0814o9001j25371j57018k03883k15987
18315E468173k28643k25736j99730j80879j87002j70810j22636j33773j37883
18306C881081r1336q3231o1367q0567n5830j4583m5789m5136o7103q0735j12160
$$ y = [38786192, 36519307, 33996134, 31615347, 29594140, 27666070, 25655793, 23837695, 22302116, 20941758, 19721881, 18665019, 17679363, 16769333, 15926900, 15171748, 14446489, 13766864, 13147003, 12640513, 12238993, 11804436, 11361374, 10927164, 10503006, 10148522, 9885905, 9635569, 9412011, 9203217, 8999216, 8890244, 8806615, 8722778, 8576169, 8466382, 8371501, 8193248, 8008567, 7840212, 7632206, 7444213, 7225357, 7019933, 6854353, 6686435, 6598703, 6530366, 6414268, 6310247, 6239433, 6170432, 6045061, 5888043, 5684160, 5468173, 5239530, 5013794, 4814064, 4633185, 4446183, 4275373, 4152737, 4018964, 3881081, 3789745, 3706514, 3645147, 3564580, 3508750, 3494167, 3448378, 3403242, 3336139, 3255404, 3143244]
18295C143244j43487n5403o8015p2207m5564p6363p7655p2264p2124r6008o8443
18284B295711p0034r694L0095j3466J5302j3857q9946l768K8211j38968j45088
18273A884498l8862n9307n9886j10963n6498n8499j7117m9919r4335n3913M029
18262A289228K7835r677l2240m8564p8031J0392J9810J0015j4103m6276p4688
18251A053701m5811R136K5183n220J713k5116N1471k2151k1838J5196J03124Q4393
18239A223781L3519N2407M7650J07660O8240R8378J23206P4376K9947P5388K0759
18228A955311J0572j4533p5594j26594o9275j51992j52683o9015r3423j40664
18218A072110q4966k3961K3269j7423l6120L507q0147o9940m1975L4582M6302
$$ y = [3143244, 2999757, 2944354, 2876339, 2804132, 2758568, 2682205, 2604550, 2532286, 2460162, 2364154, 2295711, 2225677, 2215983, 2246078, 2232612, 2247914, 2234057, 2144111, 2140343, 2168554, 2029586, 1884498, 1845636, 1786329, 1726443, 1615480, 1558982, 1500483, 1483366, 1433447, 1339112, 1285199, 1289228, 1317063, 1307386, 1275146, 1226582, 1148551, 1158943, 1178753, 1188768, 1174665, 1128389, 1053701, 1007890, 1017026, 1042209, 1036989, 1038702, 1013586, 1065057, 1042906, 1021068, 1036264, 1139388, 1223781, 1257300, 1309707, 1357357, 1465017, 1533257, 1631635, 1754841, 1829217, 1859164, 1934552, 1955311, 1965883, 1951350, 1875756, 1749162, 1679887, 1527895, 1375212, 1306197, 1212774, 1072110, 987144, 963183, 986452, 969029, 932909, 936416, 856269, 786329, 744354, 778936, 825238]
18207H25238P6224M4084K0314l0338p6757l208K7304J1855M6771N7222o918k0747
18195I71044J4926K911O9288J07885O6175J35201J36567R3112J04646J05237J50433
18184A957425J09441J5445L724j3882J666L239p2034n8899o0713q7069r3749m9913
18172A654681j8573J2836O2258J0983J9028N4344J06182k849N5078K2378K7176
18161B003522K7595p87L0817l6508o2272P16j2035k5003l7333j4221k4417j12872
18149A737202j16808p5875j15810p2233o1865q5827j12562m2954J2706M211k670
18138A067515O669L6013l8153L7874N0474P0683P0707Q1626J29155J88096K54788
18127A955447K67008K83280L16713L91601N86054Q69311J364675K108836L511498
$$ y = [825238, 901462, 945546, 965860, 935522, 858765, 855557, 882861, 894716, 941487, 998709, 991791, 971044, 985970, 988881, 1058169, 1166054, 1232229, 1367430, 1503997, 1597109, 1701755, 1806992, 1957425, 2066866, 2082311, 2086035, 2072153, 2073819, 2077058, 2005024, 1946125, 1885412, 1798343, 1704594, 1654681, 1636108, 1648944, 1711202, 1722185, 1741213, 1795557, 1901739, 1898890, 1953968, 1976346, 2003522, 2031117, 2030330, 2061147, 2024639, 1962367, 1963083, 1951048, 1926045, 1888712, 1874491, 1850074, 1737202, 1620394, 1544519, 1428709, 1356476, 1294611, 1208784, 1096222, 1053268, 1065974, 1070185, 1067515, 1074184, 1110197, 1072044, 1109918, 1160392, 1231075, 1301782, 1383408, 1512563, 1700659, 1955447, 2222455, 2505735, 2822448, 3214049, 3800103, 4669414, 6034089, 8142925, 11654423]
18118A1654423N895806Q668175Q709768L442983r17634p23074K593193N090947
18110D4414587J780798n683254q685314o031393l906578l642234l184190k474081
18102A2588341j921096j469348j087505q70080p31033n66237m81889l95558l72334
18093D693261l20224k64276k93022k40038k34316j98405j81659j57662j23359
18084B680300r6649r0082j1289j22765j59555j46471o5133r5479j01651l1818
18074A759408l6420j15450q9971m5812Q024q665o3929k2986l8990j9821l8304
18063A287084q8847m3361n6201M3920k6937n9416p9573o3143j9421j7851r311
18052H66943J6226J7827j1467m9596j2103q1768k3982k1492j4660N7392L0685
$$ y = [11654423, 17550229, 26218404, 34928172, 38371155, 37453521, 36730447, 39323640, 44414587, 46195385, 40512131, 31826817, 25795424, 21888846, 18246612, 15062422, 12588341, 10667245, 9197897, 8110392, 7240312, 6509279, 5943042, 5461153, 5065595, 4693261, 4373037, 4108761, 3815739, 3575701, 3341385, 3142980, 2961321, 2803659, 2680300, 2583651, 2493569, 2482280, 2359515, 2199960, 2053489, 1988356, 1892877, 1791226, 1759408, 1722988, 1607538, 1517567, 1471755, 1479779, 1471114, 1407185, 1384199, 1345209, 1325388, 1287084, 1198237, 1154876, 1098675, 1142595, 1115658, 1056242, 976669, 913526, 894105, 876254, 866943, 883169, 900996, 889529, 839933, 827830, 746062, 722080, 700588, 685928, 743320, 774005]
18041G74005n1397N0465m26N6384R6809k028K6916J3533N988K4353L3168L556
18029A031326j5908L7242J7791l928n238O773N1139R815J7107N1402P301N252
18017A210074O2164N397O1032P2626J6125L0431Q9561P1848K8665M6303M9395
18006A743621O7632O0240J6638P4625m532L2684K5667O178N2761M0388L9143N4477
17994B209522N7084k8037o5361l2764K3067J652O2925O0976o3690n8423o0593
17983B106358n4634r8529j50749j67651j19088m8896l6140j28576j13362j27695
17973A061038j45434o3082O0392J5010n3955j9726K029M0984M976M5842P3498
17962A021572Q7153K478M1941M0992K8462L9603O399j3976J3182L3864M2267Q5464
$$ y = [774005, 722608, 773073, 772647, 829031, 925840, 923812, 950728, 964261, 970249, 994602, 1027770, 1031326, 1015418, 1052660, 1070451, 1066523, 1061285, 1068058, 1119197, 1129012, 1146119, 1197521, 1204822, 1210074, 1272238, 1277635, 1338667, 1411293, 1427418, 1457849, 1547410, 1619258, 1647923, 1694226, 1743621, 1811253, 1871493, 1888131, 1962756, 1958224, 1990908, 2016575, 2022753, 2075514, 2115902, 2155045, 2209522, 2266606, 2238569, 2173208, 2140444, 2163511, 2165163, 2228088, 2289064, 2225374, 2166951, 2106358, 2051724, 1953195, 1802446, 1634795, 1515707, 1466811, 1430671, 1302095, 1188733, 1061038, 915604, 852522, 912914, 927924, 873969, 854243, 856272, 897256, 902232, 948074, 1021572, 1108725, 1111203, 1153144, 1194136, 1222598, 1262201, 1268600, 1254624, 1267806, 1301670, 1343937, 1429401]
17950A429401M3318Q52j5056j8399k1305m143l2327j48l726o9019l0771K757j6615
17937A264819k0040O197M5161L838k1901p1542r078N720p2230q2784m2216J0436
17925A016380j5852l2795K8580M4479j8453j0980j479j6685J4424O0739P7858
17914A146216P164k7166m1691Q6586P0714J1531k2337K6958L7757j4862l4951
17903A245919o041j0407k2328O023l08p6949j27032n3058k1969m0701m8881j2521
17891H31747J6041l8314j0016K1973K4109K8472p7131l4227p404k7238l306P978
17879G32684m4716k7267m3658m0543J7018k0082Q23J2825l1662l0843o3925k4834
17867D35820n6955o1553L1616j8944j6342K3297O0640l962m6458l0230j2692n5128
$$ y = [1429401, 1472719, 1473571, 1458515, 1440116, 1418811, 1414668, 1382341, 1382193, 1378467, 1309448, 1278677, 1281434, 1264819, 1244779, 1250976, 1296137, 1299975, 1278074, 1206532, 1197454, 1203174, 1130944, 1048160, 1005944, 1016380, 1000528, 967733, 996313, 1040792, 1022339, 1011359, 1009880, 993195, 1007619, 1068358, 1146216, 1153380, 1126214, 1084523, 1171109, 1241823, 1253354, 1231017, 1257975, 1295732, 1280870, 1245919, 1239878, 1229471, 1207143, 1213166, 1212858, 1135909, 1008877, 955819, 933850, 893149, 844268, 831747, 847788, 809474, 799458, 821431, 845540, 874012, 796881, 762654, 755250, 728012, 724706, 732684, 687968, 660701, 617043, 576500, 593518, 573436, 574259, 587084, 555422, 524579, 460654, 435820, 378865, 317312, 348928, 329984, 313642, 336939, 397579, 393617, 347159, 316929, 304237, 249109]
17855B49109j1002K0293M421M389j898n8299n2103K2974M39L8962L3026o0658
17843A89653q6744L8689N4414m8797R967j76M7506K4268o864l6151n2048L091
17831A36808l5741m8571m594O191J5556N0239L6457M9911L3668L4442R548J5204
17819B99118O7259R2550O562K7939O9838J1636L719L6554k6269o1666Q02l1312
17807D96730o378J5810M3123M4696k209l9635N525j0079j2524N5940O3646p8257
17795E76388j74200o4143O4229Q282k4883r5062r5682j13006k0909N9114N3094
17784A73222m5244k6242l4473n1514O7761M8307m334n0869l3723l4268J0746j1788
17772G581K3203k0384l185l5222k3707P5961N5514j75m4389k252K7803J2014l0772
$$ y = [249109, 238107, 258400, 262821, 267210, 265312, 207013, 154910, 177884, 178323, 217285, 250311, 189653, 102909, 141598, 196012, 147215, 157182, 157006, 204512, 228780, 221916, 185765, 133717, 136808, 101067, 52496, 47902, 54093, 69649, 119888, 156345, 206256, 239924, 274366, 283914, 299118, 366377, 458927, 465489, 493428, 563266, 574902, 578621, 615175, 588906, 527240, 528042, 496730, 490352, 506162, 549285, 593981, 591772, 552137, 557662, 547583, 535059, 590999, 654645, 576388, 402188, 338045, 402274, 410556, 385673, 290611, 194929, 81923, 61014, 120128, 173222, 127978, 101736, 67263, 15749, 83510, 131817, 127483, 76614, 42891, 8623, 19369, 7581, 30784, 10400, 7215, -28007, -51714, 24247, 79761, 79586, 35197, 32945, 60748, 72762, 41990]
17759D1990N4429l1418n0408l1332Q321K420K377k72K9189l4J2555j6937j5837
17746E043o2973K9771Q402k5804j7890k0862M5713J8089m0161Q282N1797O2932
17734F2339L7972j7636m0651m6203m6438M3695J2277o6003K8549M3753k432k3874
17722a4652Q822l1384p9384K140J8144P812P8034L4480j355o132Q5824P4736J1800
17709A88885J3875m7007l2383L4874K1012L459j1099j6960l1367K8748M0994q67
17697A92164K137J2699J3082L7640Q334r08j4641m3042k2467o0539J6800j770
17685A39489k0726J7836j7371l8342p4K3661j3327K4446K711m8470k7640o269
17673C5924J8506k485r745m2113J2892J393K2585j520K6774j6247k0747m0R6482
$$ y = [41990, 96419, 65001, 14593, -16739, -8418, -5998, -3621, -3893, 25296, 25262, 37817, 20880, 5043, -57930, -28159, -19757, -45561, -63451, -84313, -38600, -20511, -60672, -52390, -593, 62339, 100311, 82675, 42024, -4179, -50617, -6922, 5355, -60648, -32099, 11654, 9222, -14652, -5830, -37214, -116598, -114458, -96314, -88502, -10468, 24012, 22657, 16525, 102349, 177085, 188885, 202760, 155753, 123370, 158244, 179256, 182715, 171616, 154656, 123289, 152037, 193031, 192164, 194301, 207000, 220082, 257722, 266056, 265148, 250507, 207465, 184998, 124459, 141259, 139489, 118763, 136599, 119228, 80886, 80812, 104473, 91146, 115592, 118303, 69833, 42193, 35924, 54430, 51945, 42200, 87, 12979, 14372, 36957, 35437, 62211, 45964, 25217, 25177, 121659]
17660A21659K8353k9909n682m6415l7751n5621l3285P5808J186n8068k2696k3175
17648h5596m763J3853L7656Q005n5092k0581J4437L4329M9705L0387l1739k7171
17636c6570j5958O6268K1286o2654k0302k9359k3926K3640J9097q289q167l3928
17624a08862J0229J3307O146j2028k9902M3396M1458J7431l3411k319L1241r428
17612c2742q132k6916L2145L6868j8781r7686M0092L7763j4702J9451L1772K5818
17600B4950k1922j5144N4615M8150l9588n3693K4004k0023m7971l2665N5185J8400
17588e702j0901l4649J2416n0052n1980j5873K623O2909J0404R59l1317M0860
17576g0303L6613j2638j6529J8085j9541k4145j6556L1014J4977M3668K8227K94
$$ y = [121659, 150012, 120103, 114421, 68006, 30255, -25366, -58651, 17157, 18343, -39725, -62421, -85596, -90359, -76506, -38850, -30845, -85937, -106518, -92081, -57752, -8047, 22340, -9399, -36570, -52528, 13740, 35026, -27628, -47930, -77289, -101215, -77575, -58478, -66767, -74934, -108862, -98633, -85326, -79180, -91208, -121110, -77714, -36256, -18825, -52236, -54555, -23314, -32742, -40874, -67790, -35645, 1223, -17558, -115244, -75152, -37389, -52091, -32640, -868, 24950, 3028, -12116, 42499, 90649, 51061, -2632, 21372, 1349, -46622, -79287, -24102, -5702, -16603, -51252, -38836, -88888, -140868, -156741, -154118, -91209, -80805, -79846, -111163, -70303, -33690, -46328, -62857, -44772, -64313, -88458, -105014, -74000, -59023, -15355, 12872, 13166]
17564A3166n0767k2352M1415M9150m5394j1477K168O29O553J1359m9067l955M5450
17551a3122L947j8531o9085l5260K4650J2001j6353K2918L7261Q1646K1704J1707
17539F3483k0497m8516k5579J671N148Q172J620l313K1426J9174K4675k7949j0740
17526H775k1229N0437l8513Q646K530n3629J564N0389L1540l8464j3574J1267
17514b61R554L2650p021l911P1370n886m7241m8300m067N3595P2035J6382m6836
17501I2063j0248l2977j0835j7723Q189O761J1589J7493K9427m0470L9509l1621
17489F1157L8755J4284k497J0453N016l1178k7340k8722k0146l8506J0932l3986
17477d1778K5007J1048L3332Q048k2074p5714k121o950L5607P9308m0962o298
$$ y = [13166, -37601, -59953, -18538, 30612, -14782, -26259, -24091, -23462, -16909, -5550, -54617, -58572, -13122, -9175, -27706, -96791, -132051, -107401, -95400, -111753, -88835, -51574, 30072, 51776, 63483, 42986, -5530, -31109, -29438, -24290, -16118, -14498, -17811, 3615, 22789, 47464, 19515, 8775, -12454, 37983, -530, 8116, 10646, -42983, -41419, 8970, 40510, 2046, -11528, -261, 9293, 41943, 34922, 31011, 102381, 96495, 49254, 954, -3113, 50482, 122517, 138899, 92063, 81815, 48838, 38003, 20280, 28469, 35230, 46819, 64312, 93739, 53269, 92778, 61157, 99912, 114196, 111699, 122152, 127168, 95990, 68650, 39928, 19782, -18724, -7792, -41778, -16771, -5723, 27609, 35657, 13583, -62131, -64252, -71202, -35595, 43713, 2751, -3547]
17465c547M7253L0187L6670L3026n8725N829q050k0244L4312M0716j6372j6380
17453A04675j9625O3363K3225M4491M0616j0300J451k7808M4097M6060n5392q3341
17441A71512n7447l0234M644q43k8592l8422R886J5871L4529K7793l8650J0541
17429H0588R217K12l9659m3190K0435N2956M297m4887l0900q212J6740J6342J1717
17416D5656m76J3780J1704l611o7356q698J8618k8982J2607o956L57L4669K0608
17403D1920j0950k1958J4301L5378J456j392m4017j1813M322K4255K5830L848
17391F1180J2279k0334M226j8054m1582r6184K0886M8389N4761q442o371M381
17379A5135p3565l2061P5157J4851M5917K0059l670l0785l5421L5350L210l2861
$$ y = [-3547, 43706, 73893, 110563, 143589, 84864, 90693, 82643, 62399, 96711, 137427, 121055, 104675, 85050, 148413, 171638, 216129, 256745, 246445, 247896, 220088, 264185, 310245, 254853, 171512, 114065, 83831, 88475, 87632, 59040, 20618, 30504, 46375, 80904, 108697, 70047, 80588, 89805, 90017, 50358, 7168, 27603, 80559, 84856, 39969, 9069, 857, 17597, 33939, 45656, 45180, 58960, 70664, 67053, -303, -9001, 9617, -19365, -6758, -13714, -13357, 21312, 41920, 30970, 9012, 23313, 58691, 60147, 58755, 14738, 2925, 7247, 31502, 57332, 61180, 73459, 53125, 57351, 39297, -2285, -98469, -77583, -29194, 25567, 17125, 10754, 15135, -58430, -90491, -15334, -483, 45434, 65493, 61823, 31038, -4383, 30967, 34177, 1316]
17367A316L3606m8679j07031j2248P5967N7531L5713o0934m3039o061K6762K2858
17355b4239j4219j7678k6982K183J16376K9649m6275j4840p0867k8577N1491J6021
17343b7957M1595R3261l379m4160k0255k1067n2505j0321J7102q0840m0280K3461
17331a25345P2772p626o611l4402K3906M9221M5338M2878p653k3528j0743J6787
17319C4994n5867n3518l4566P876L4454J8674j5266K2395L1434O4n068L3466L3968
17306E3040K6194n7542m8487l492M8935O1181K5293K2090m9923j64323p8413N5276
17294a10171K8480j3094J2396L3751r137J5376k9146M0793M3781K6749o3813J55
17282b3880J2188o2434K1088p665M1937P2596n5770k7320J4820m8973j9091k5796
$$ y = [1316, 34922, -13757, -120788, -133036, -57069, 462, 36175, -24759, -67798, -73859, -47097, -24239, -38458, -56136, -83118, -80935, 35441, 65090, 18815, 3975, -66892, -95469, -43978, -27957, 13638, 106899, 103520, 59360, 39105, 18038, -34467, -44788, -27686, -108526, -148806, -125345, -52573, -60199, -66810, -101212, -77306, -28085, 17253, 60131, 52478, 28950, 18207, 34994, -20873, -74391, -108957, -101081, -66627, -47953, -63219, -40824, -9390, -9326, -14394, 19072, 53040, 79234, 21692, -26795, -30287, 18648, 79829, 105122, 127212, 77289, -87034, -165447, -110171, -81691, -94785, -82389, -48638, -57775, -42399, -71545, -30752, 13029, 39778, -24035, -23880, -11692, -74126, -53038, -60703, -18766, 53830, -1940, -29260, -14440, -63413, -82504, -108300]
17270a08300j4964M2422K7623N3846l853l533J1060j757J2924j0299k0119r730
17258b4680k3438j7918m5038j6962K0364N7082k707M8277k414K5373j3581J0689
17246A5047j1868k9498l7200L9323q705M1981k4432o457L8299L5252p5585N049
17234a8794m882N964m0198j36371k7698L2581J5036Q5837J2595L9796J5335J4600
17222f199k062L3763k1078K3231P834K516j2196n8087q237K4137m5803p170R881
17209e9470L2491J579K8808m5023O741L0240k2806q864K8802J02410Q2786k6611
17197A51083n4906p295p842o3554j5669L7771L7993K8744J2624L6963N2541K7009
17185B35462j9392K3179K1923Q2782Q6685n7703p4525m1024N08L8214P0789J13496
$$ y = [-108300, -123264, -80842, -53219, 627, -3226, -6759, 4301, 2544, 15468, 5169, -14950, -24680, -48118, -66036, -111074, -128036, -107672, -50590, -53297, -5020, -7434, 17939, 4358, 15047, 3179, -26319, -63519, -24196, -32901, 9080, -15352, -21809, 16490, 51742, -23843, -18794, -23676, -17712, -57910, -194281, -221979, -189398, -174362, -88525, -75930, -36134, -20799, -6199, -8261, 25502, 4424, 27655, 35489, 38005, 25809, -32278, -40515, -16378, -62181, -69351, -59470, -26979, -25400, 3408, -41615, -34874, -4634, -27440, -36304, -7502, 94908, 177694, 151083, 96177, 88882, 81040, 17486, 1817, 39588, 77581, 106325, 118949, 155912, 208453, 235462, 216070, 239249, 261172, 343954, 430639, 372936, 298411, 257387, 257895, 296109, 366898, 480394]
17173D80394M1758O9757K0913J9903K1044m6170j6143L7211m0179l9570j29437
17162D19481p0429M6665M6245n6410j8549n621N5953k5376k7694l1677n7909p953
17150B66726l2338l6564l0125j4934K64K180q840J1467l8704o1142p355K4986
17138G5621R415m7517K0227J6978j332k4373K253j4192l6012K2622J264j8890
17126F064K2862j5316J2700j8142L2637K6339O932O0920j8865m1664J0078O386
17114I0931n0230L6038J8755J3737j6087m1496k8442J9584j7932l0424j0301J1750
17102d117O1135m2499k5373j6539K6754L1122L4325L1370k4481o9272N260R643
17090A7328L0326J5612l3870q326j529m0543q093N0040J6978j7630n8994m1441
$$ y = [480394, 522152, 591909, 612822, 632725, 653769, 607599, 591456, 628667, 588488, 548918, 419481, 349052, 395717, 441962, 385552, 367003, 361382, 417335, 391959, 364265, 332588, 274679, 266726, 234388, 197824, 167699, 152765, 153029, 155209, 146369, 157836, 119132, 57990, 50635, 75621, 85036, 37519, 57746, 74724, 73392, 49019, 51272, 37080, 1068, 23690, 24954, 6064, 28926, 13610, 26310, 8168, 40805, 67144, 74076, 134996, 116131, 74467, 84545, 90931, 40701, 76739, 95494, 109231, 93144, 51648, 23206, 42790, 24858, -5566, -15867, -4117, 57018, 14519, -10854, -27393, -639, 30483, 64808, 96178, 71697, 2425, 7685, 17328, 47654, 63266, 29396, 21070, 19541, -21002, -29095, 20945, 37923, 20293, -38701, -80142]
17078h0142K0820M8805M925L4948J4319m116j7172r601m7162k2050J8697K1444
17066a6285l4613K1872L6102l28j1729J3229r944j0339k6542k3012N5971K5079
17054A9461R031k235j6903j6064l4213K1593Q918K3072l656q986J757k5032j330
17041b4587k2779q866j1344M1730K726k0060j1602K2956J2425L2642K7095j590
17029C8746l988n657l782j692j5876m0104k7580J1174q071K3985M0221K1060l0249
17016a813J0951J6564j6040j1997j3877p867j8006K3221M0688Q1881l527l4148
17004F6030q4236m082N492j549j3479r446N3385l5177J3777N2479j8795j4721
16992I678j9979n391l6432J086m8794o063M9639k1817K0633J466M1773m608k2436
$$ y = [-80142, -59322, -10517, -5592, 29356, 43675, 39559, 22387, 12786, -34376, -56426, -37729, -16285, -50898, -29026, 7076, 6748, -4981, 8248, -1696, -12035, -38577, -61589, -5618, 19461, 28492, 26257, 9354, -6710, -40923, -19330, -10412, 12660, 9004, 18, 1775, -23257, -24587, -47366, -56232, -67576, -25846, -23120, -43180, -54782, -31826, -19401, 13241, 40336, 38746, 34758, 29101, 25319, 23627, 7751, -32353, -59933, -48759, -56830, -32845, 7376, 28436, -1813, 9138, 25702, 9662, -2335, -16212, -24079, -42085, -18864, 21824, 103705, 100178, 66030, -18206, -22288, -16796, -18345, -31824, -41270, 12115, -23062, -9285, 43194, 24399, 9678, -10301, -15692, -52124, -51038, -99832, -105895, -56256, -78073, -57440, -55974, -14201, -18809, -41245]
16979d1245J9997Q975K174Q4243o194k3181j1304k4403J3999Q477O0413L8402
16967A30353q6272n3862q989q191r392M791j8566n6005j8202J0675K6310L1123
16955e6227L9495K2598l486j627k8882k0053m1796M6160L7879j2609J1621L8567
16943C1640K4034j2733K2n6142m5656K2434j512Q788J4902K2520n7020m4323k2419
16930a15465R328M5460K8170j7212J1355K6878K3859M7462k4411o367j844j9716
16918G497J1940k0316l7354j9585Q590j8828P776O354K4650l6379P26L619j2116
16905g3426L4723K8037l2722k4144J9402O6387P173j2690j9178k7668J4853N6272
16893C7019o010K530N8634o330k6292j9457K3630K8715K234j1707J2800k7924
$$ y = [-41245, -21248, -12273, -10099, 74144, 67950, 44769, 33465, 9062, 23061, 31538, 91951, 130353, 44081, -9781, -18770, -26961, -36353, -31562, -50128, -106133, -124335, -113660, -87350, -56227, -16732, 5866, 2380, 753, -28129, -48182, -89978, -43818, -5939, -18548, -6927, 31640, 55674, 42941, 42963, -13179, -58835, -36401, -37913, -29125, -14223, 8297, -48723, -93046, -115465, -106137, -60677, -32507, -49719, -38364, -11486, 12373, 59835, 35424, 29057, 27213, 7497, 19437, -879, -38233, -57818, -49228, -68056, -60280, -53926, -29276, -65655, -64929, -61310, -73426, -38703, -10666, -43388, -67532, -48130, 18257, 25430, 12740, -6438, -34106, -19253, 37019, 31009, 33539, 92173, 85843, 59551, 40094, 63724, 92439, 94673, 82966, 95766, 67842]
16881F7842k0780k6559p817k883L0113M5180k1463j9815N830k916m734k782P953
16868D7169L5362O2197K3246l717r5396l1749J7620k454k3053L2161K3237M5845
16856A30468K2850k63j0116p9992j720p092K0982j6785m9404N8894R31m6698l1994
16843i939J5286N5584l3233J6677N5537L4535J0184j0501M7655N8793o0064r6788
16831H3726K2291M9699l9721K2460J4851J84P045N462M858l6591n9878N3865L9797
16818A68048k8123n6080P844J8227J281K055q205M2827O625j8975n3203m3265
16806C9056J8947K2844P641j5485Q883P2163K6451o1760p588k4300l1038j6305
16794C9509N5628L4849l0583o5555l98M2234L708k193N485M3017O8902l649K9489
$$ y = [67842, 47062, 20503, 12686, 9803, 39916, 85096, 63633, 43818, 49648, 46732, 41998, 39216, 47169, 82531, 144728, 167974, 164257, 68861, 37112, 54732, 52278, 29225, 61386, 84623, 130468, 153318, 153055, 142939, 62947, 61227, 54135, 75117, 58332, 8928, 67822, 68753, 22055, -9939, 5347, 60931, 27698, 44375, 99912, 134447, 144631, 134130, 181785, 240578, 180514, 83726, 106017, 155716, 115995, 138455, 153306, 153490, 160535, 165997, 170855, 134264, 74386, 128251, 168048, 139925, 83845, 91689, 109916, 111197, 113252, 105047, 147874, 154499, 135524, 82321, 39056, 58003, 80847, 88488, 73003, 81886, 154049, 180500, 118740, 111152, 86852, 55814, 39509, 95137, 129986, 99403, 33848, 33450, 75684, 79392, 77199, 82684, 125701, 194603, 190954, 220443]
16781B20443K1837j9250j9500m1013j0822m3373M5637K0485M423l1262p7363p0142
16769A00J0027M1638J9884K8974k9628m4511j2585L5978L1412L3518k5671J7062
16757A06198q133m7329M6428Q4610l8850K7413k6209K8385Q1868Q2200j3088n4293
16745B69200L2615L5878L3821O3921m909K3228m1965n4229m1413M6334K1595K976
16733C87052J4159r68o4380k2255L2490L3163k0069p095O979m842J8382L0166
16721D02782K9652J0981j8354j7686M6362l7645r2883J3433L7313L983J5270M254
16709C97462L7785M0779j0915M5496K8581j3096m9092K0444L4384J6215J2946
16698E60989k464n8855m0187k8792J6325k6757j8925M474L8660J06327R501l6484
$$ y = [220443, 242280, 223030, 203530, 162517, 151695, 108322, 153959, 174444, 178867, 147605, 70242, 100, 10127, 51765, 71649, 100623, 70995, 26484, 13899, 49877, 81289, 114807, 89136, 106198, 98065, 50736, 97164, 181774, 142924, 170337, 144128, 172513, 254381, 336581, 323493, 269200, 301815, 337693, 371514, 435435, 430526, 453754, 411789, 357560, 316147, 362481, 384076, 387052, 401211, 400243, 335863, 313608, 346098, 379261, 359192, 352097, 359076, 354234, 372616, 402782, 432434, 443415, 425061, 407375, 453737, 416092, 323209, 336642, 373955, 377938, 393208, 397462, 435247, 476026, 465111, 510607, 539188, 526092, 477000, 497444, 531828, 548043, 560989, 558525, 499670, 459483, 430691, 447016, 420259, 401334, 405808, 444468, 550795, 560296, 523812]
16686E23812j5632k8646P3505K0898L4583L2298J5736L540n6600m9955J2995J4905
16674E81439N2219O6504K2384J6071J9324P9458O1372Q4646L3922J3734J6634
16663A047707N6283N411O5497L1850L2210J15556J09437O6732J18926O8410J10843
16652A828862K04339J57885J05462J11342J64044K03129K31991K42148L32333
16643C581535L93992M33861M63186N46522N11733O66788R85349J367269J884727
16634A0834962K715798M073048O063516Q350882R314378P102628L264792J392670
16626E3112674K497253M477216M027438K32291k996959k080907J791167N987789
16618F7047962Q977952R557071Q261671O742866M938432L477540K222268k51205
$$ y = [523812, 508180, 479534, 553039, 573937, 608520, 640818, 656554, 660094, 603494, 553539, 566534, 581439, 633658, 700162, 722546, 738617, 757941, 837399, 898771, 983417, 1017339, 1031073, 1047707, 1103990, 1109401, 1174898, 1206748, 1238958, 1354514, 1463951, 1530683, 1649609, 1718019, 1828862, 2033201, 2191086, 2296548, 2407890, 2571934, 2775063, 3007054, 3249202, 3581535, 3975527, 4409388, 4872574, 5419096, 5930829, 6597617, 7582966, 8950235, 10834962, 13550760, 17623808, 23687324, 32038206, 41352584, 48455212, 51720004, 53112674, 55609927, 60087143, 64114581, 64346872, 61349913, 59269006, 61060173, 67047962, 76025914, 85582985, 93844656, 100587522, 105525954, 109003494, 111225762, 110974557]
16610A10974557l085719n636163q457678r409878o847513k669578P43094J701479
16602G7312601l72698k812322k735415o33479R22074q76805n490317q401761p786920
16593D9124958o146874n206237m643773l855802l079980k542968j991201j577080
16585B0081043j218238r73089q79771q78777p81804p02971o25405o21153o75039
16576A2724796o85046n73593m66230l88094k55405j68066j95227k55298k36561
16567I501276k81367k63722k84769l02421l32901l49440m23622l59166k33485
16558F670383j81858j64493j24149j75080j72327j41575j15989j85993k92043
16549E116876k62676j64101j66542k13631j92624j88368j75128j38370j58962
$$ y = [110974557, 107888838, 102252675, 93794997, 84385119, 77537606, 74868028, 75611122, 77312601, 76939903, 74127581, 71392166, 70758687, 71680761, 70803956, 65313639, 56911878, 49124958, 42978084, 37771847, 33128074, 29272272, 26192292, 23649324, 21658123, 20081043, 18862805, 17889716, 17009945, 16131168, 15349364, 14646393, 14020988, 13399835, 12724796, 12039750, 11466157, 10999927, 10611833, 10356428, 10188362, 9993135, 9737837, 9501276, 9219909, 8956187, 8671418, 8368997, 8036096, 7686656, 7263034, 6903868, 6670383, 6488525, 6324032, 6199883, 6024803, 5852476, 5710901, 5594912, 5408919, 5116876, 4854200, 4690099, 4523557, 4309926, 4117302, 3928934, 3753806, 3615436, 3456474]
16540C456474j44840j31427j20759j01843l2175k8190o8573j33265o4924p6812
16530B553666j14181j58030m9555m7314o1337q3927q3266l6469k4908n4940p58
16519A838981j5647J3493l1823j02226q4387j10343p2223j9212m9167o9714m4372
16508A253360l331k7077l2835k0682N482l9464n096p9069p1078j1610m4307m3421
16496H80872l5775j1501l4321n6377m2530k7821J3394O8064M3460L919N778q9328
16484G17834n3989j9234n5949M7318L3211n7566n5205J7230M394k6800l3743R170
16472E26671K8327p125j9941l4395o8549n9067k5731m148K8776L2548j3397O8410
16460D52379n170j8235K072k7640l1358P541j2946O154J4422Q065m5695o7266
$$ y = [3456474, 3311634, 3180207, 3059448, 2957605, 2925430, 2897240, 2828667, 2695402, 2630478, 2553666, 2439485, 2281455, 2231900, 2184586, 2123249, 2039322, 1956056, 1919587, 1894679, 1839739, 1838981, 1823334, 1836827, 1805004, 1702778, 1618391, 1508048, 1435825, 1416613, 1367446, 1297732, 1253360, 1250029, 1222952, 1190117, 1169435, 1174917, 1135453, 1130357, 1051288, 980210, 968600, 924293, 880872, 845097, 833596, 799275, 742898, 700368, 672547, 685941, 754005, 797465, 801384, 807162, 717834, 663845, 644611, 588662, 635980, 669191, 611625, 556420, 573650, 578044, 551244, 517501, 526671, 554998, 547873, 527932, 493537, 424988, 365921, 340190, 336042, 364818, 397366, 383969, 452379, 447209, 428974, 431046, 403406, 372048, 379589, 366643, 372797, 387219, 395284, 349589, 282323]
16448B82323k9122Q0835k5776r2377k656m9819j6081P6611L4659M2159J6020r672
16436C07104m9382J320m1997r9513L7530L7913j2019n576J276J1750K0245Q77
16424B09528j0640j9296n1791r63l9810p346L603j2285k1991O9525M744q848L0397
16411A44827J5294J6332M2941n064n8309k8502K4222j3339m1588j50j6219O392
16399H6837M1065r86l1996O1728j333o4288J087j2182j7876L8592O0892l2553
16387A28987o0308q907O0668K0029k6358n3120l653J6682K3278p915m5713l6757
16375F913L53O1704L3937r251l7827l8412J8045R4600n166j2288J6769J0896l9351
16362A00922l0810K753k1488j9520O5578L9825k0237n2608j6328N321l6900j4265
$$ y = [282323, 253201, 334036, 308260, 215883, 213227, 163408, 147327, 223938, 258597, 300756, 316776, 307104, 257722, 259042, 217045, 117532, 155062, 192975, 180956, 175380, 176656, 188406, 208651, 209528, 198888, 179592, 127801, 126838, 87028, 79682, 83285, 71000, 49009, 118534, 123278, 114430, 144827, 160121, 176453, 219394, 214330, 156021, 127519, 151741, 138402, 96814, 96664, 80445, 86837, 127902, 126916, 94920, 156648, 155315, 91027, 92114, 79932, 62056, 100648, 161540, 128987, 68679, 59772, 120440, 140469, 114111, 60991, 57338, 74020, 97298, 89383, 43670, 6913, 7266, 68970, 102907, 93656, 55829, 17417, 35462, 130062, 124896, 112608, 129377, 140273, 100922, 70112, 72865, 51377, 31857, 97435, 137260, 117023, 64415, 48087, 53408, 16508, 2243]
16350B243r854J4821k0606M9183N7249j0892L917j7988p8171l2774L5550J6038
16338H716l8235o78L0647J3313K5593n9060L3047L9500K0476m2070m2686O670
16326d767R114k2698l9207l234J5506L4201L0001l5937k3478M3339k4855j6234
16314c8249L9744l9923j9917K962q419O3227M3859m7938p1267m9683L3260J4348
16302g7996j8333M7849M91M1962R868j9685L1488K0585k4260p9900r702N0517
16290b7116M9019m7369j0740L5385K3174Q904J0763K7319m5039l0268K7600o232
16278A5400l2851j2735L3570k9249J9968j2426o1559J5280p153K5489N0882J7213
16266B1829j47n4906k9353k3550K7714N2160L5474p0155n2896K0160k6754P202
$$ y = [2243, -7611, 7210, -13396, 35787, 93036, 82144, 86061, 68073, -10098, -42872, -7322, 8716, -29519, -30197, 450, 13763, 39356, -19704, 13343, 52843, 73319, 31249, -11437, -4767, 4347, -18351, -57558, -60792, -45286, -11085, 18916, -17021, -40499, 2840, -22015, -38249, 1495, -38428, -58345, -55383, -63802, -575, 43284, -4654, -75921, -125604, -92344, -77996, -96329, -48480, -47989, -6027, 3841, -15844, 15644, 36229, 11969, -67931, -77633, -27116, 21903, -25466, -36206, -821, 22353, 31257, 42020, 69339, 24300, -5968, 21632, 15400, -17451, -30186, 3384, -25865, -5897, -18323, -79882, -64602, -71755, -46266, 4616, 21829, 21682, -33224, -62577, -86127, -58413, -6253, 29221, -40934, -93830, -73670, -100424, -93222]
16254i3222N4409m726N5275N7322j8844p8177q013M8095N56L5545K5260l8964
16242C4516J2778j9433j7043M0007j0693m5381j1513o2236O9777O0313l8379l4992
16230b2279J7454N4167m1323j346J0847K1591k8513n2710K5731J8291K4959M6129
16218G2998J0491p3810m9405j8971Q640L2287j69O1476J431m3183j2701m0066
16206e0982K5762O6553K2764J0962L0504o8787j03180L4329p725m8864L6367J734
16194e0563L9988M9511P473n9136l8419j4383m7292L7384P7527j7329O707l7369
16182d5901k3379k6615K3022M7426l5368p0828M4115M5561L9225n7078l3251q324
16170a01395R0143L9301m4540l2173k0788J6139O4915J7381J0120m4224k0978
$$ y = [-93222, -38813, -43539, 11736, 69058, 50214, -27963, -35976, 12119, 12675, 48220, 73480, 34516, 47294, 27861, 10818, 50825, 40132, -5249, -16762, -78998, -9221, 51092, 12713, -22279, -4825, 49342, 8019, 6673, 17520, 39111, 10598, -42112, -16381, 1910, 26869, 72998, 83489, 9679, -39726, -58697, -50057, -17770, -17939, 43537, 44968, 1785, -10916, -50982, -25220, 41333, 64097, 75059, 105563, 36776, -66404, -32075, -39800, -88664, -52297, -50563, -10575, 38936, 46409, -12727, -51146, -65529, -112821, -75437, 2090, -15239, -8532, -45901, -69280, -95895, -72873, -25447, -60815, -131643, -87528, -41967, -2742, -59820, -93071, -101395, -11252, 28049, -16491, -48664, -69452, -53313, 11602, 28983, 39103, -5121, -26099]
16159b6099m0119K9716O7870j2572j5117l1401K0736J4897m7277j1210j0250m4199
16147a05025R882M7135J9050K519K1427N710m9152l1524O9703P874K0137N334
16135B3070m0857K0794J2636p7971j2819m734K5068N4657J451j4607L0690l1566
16123a4188l477q764K613R914J5187O547L0682J889l3617l2076k7365r982k3894
16110h6531K3304r06K4265J5724J8104j302k1556j1588K2923N8513N0030m4166
16098D6814k4500J2972J5801J0753n555m7240j6674q024M1104j8199j4465j7890
16086b5103L8983J7651l80r869j1211k7512p2559M0583J2714L9666K9919P762
16074D0644j4736j6234J0064K7448J1671M9919N181M9745M5839Q1360n536n5400
$$ y = [-26099, -66218, -36502, 31368, 18796, 3679, -27722, -6986, 7911, -39366, -50576, -60826, -105025, -95143, -48008, -28958, -26439, -5012, 698, -48454, -79978, -10275, -2401, 17736, 23070, -17787, 3007, 15643, -62328, -75147, -79881, -54813, -156, 1295, -13312, 17378, -14188, -17665, -26429, -23816, -13902, 1285, 7832, 38514, 40403, 6786, -25290, -52655, -62637, -86531, -63227, -64133, -39868, -24144, -6040, -7342, -28898, -40486, -17563, 40950, 90980, 46814, 22314, 35286, 51087, 61840, 56285, 9045, -7629, -15653, 25451, 7252, -7213, -25103, 13880, 31531, 31151, 21282, 10071, -17441, -90000, -49417, -36703, 2963, 32882, 40644, 25908, 9674, 19738, 47186, 58857, 108776, 113957, 163702, 209541, 290901, 285365, 229965]
16062B29965J01528N7355K3163m2740r5808p4749J1696R4800P6547P4584J0086
16051D66427L1135J3429M3144M912k2324l5196J4367J325o7808n6997k7321N4752
16039D19845J7170l8846k0963j3717r054J8292J7232K0587l2440q9961q1849k0814
16027A85482l1520P074m6515k0448j1222K2992q711n821J8647q066n341k7045
16015F9506m2041m0632J1101J5624K0023M4303L9593J593l0929p8020K6794J0225
16003D7140O550k9854m5472J2256J6598l5431L3113K0842m3503k9490J2206Q093
15991b6952n7061R894N7998k2614q60O5314J667m6589j5121J1560K1781j062L8367
15978C6322K5163l1338O312k2348r222L6226N3555j0410m7955k8322K0061J9189
$$ y = [229965, 331493, 388848, 412011, 369271, 273463, 198714, 210410, 305210, 381757, 456341, 466427, 497562, 510991, 554135, 559047, 536723, 501527, 515894, 517219, 449411, 392414, 365093, 419845, 437015, 398169, 377206, 363489, 354435, 372727, 389959, 410546, 378106, 288145, 206296, 185482, 153962, 161036, 114521, 94073, 82851, 105843, 97132, 91311, 109958, 101892, 96551, 69506, 27465, -13167, -2066, 13558, 33581, 77884, 117477, 119070, 88141, 10121, 36915, 47140, 53690, 23836, -21636, -9380, 7218, -28213, 4900, 25742, -17761, -47251, -35045, -26952, -84013, -74119, -16121, -38735, -39595, 25719, 27386, -19203, -34324, -22764, -983, -2045, 36322, 61485, 30147, 36459, 14111, 4889, 41115, 94670, 84260, 36305, 7983, 28044, 47233]
15966D7233j7204J7538o2L1126j9590J0911q940q5718l5939j3733K7242K623j8652
15953f3165k9611m064N298J6377j6795J6821K2608j2357m2545r609N3997N8003
15941e042n006j9632K2673K9853m6950l9809J4716P9531M340m5488J3741J0718
15929A3645K5355R810M2331N754j2503O581k7838q4944J2839P7708J3741k4142
15917E8337k3696j6456N7203J2145m9865m632r393j8478J032j976P8400M5092
15905A27713P053p93O393q346p5625k5181j9491n6080l227L0006J4892p266m6091
15892e6043J6578K5809Q306k519J1700j9643K6763M7659L1660m1058k4270K3519
15880D8461L6012j2277j3995j6863n3613k7259j680l164P4683K2195m4142n3369
$$ y = [47233, 30029, 47567, 47505, 78631, 59041, 69952, 61012, -24706, -60645, -74378, -47136, -44513, -63165, -92776, -96840, -91542, -75165, -91960, -75139, -52531, -64888, -107433, -117042, -63045, -5042, -10048, -29680, -7007, 22846, -24104, -63913, -49197, 30334, 34674, -10814, 2927, 13645, 39000, 48810, 91141, 96895, 84392, 90973, 63135, -21809, -8970, 68738, 82479, 58337, 34641, 18185, 75388, 87533, 37668, 33036, 23643, 5165, 6197, 4221, 82621, 127713, 134766, 133973, 140366, 132020, 56395, 31214, 11723, -44357, -47584, -17578, -2686, -9952, -56043, -39465, -13656, -5350, -7869, 3831, -15812, 10951, 58610, 90270, 49212, 24942, 48461, 84473, 72196, 58201, 41338, -12275, -39534, -41214, -44378, 30305, 52500, 8358, -45011]
15868d5011K2926J0109l0544J042L2046N2344m2884j0343L9581R976J7568l666
15856E3144L916K7076n2026l1626R359j9143O953j7601J1638J936M9044M9737
15844I2407k85n0347M3609o986k8594n3753K2063K980K6074K2027p516o815J1632
15831F6496l6075J3922P194M6426K9091Q4039J08093Q6988L5794N1152J28057
15820F21177J14701J04506J0590J5828j6936q5202o3258K6644o9711j07141j19309
15809D31889n5861j5193k6159n1506l1110L1900k0225K7299Q477p4617m3433r111
15797A72350k9295o8033K8522m599j0101L3969L8845n039o6444K2459J2618L2743
15785A57995l7394l3582j4609l3756K691k6961k3989k9917K3457P7847O0164j4881
$$ y = [-45011, -22085, -11976, -42520, -41478, -9432, 42912, 28, -10315, 29266, 39242, 56810, 53144, 57060, 84136, 32110, 484, 9843, -9300, -2347, -19948, -8310, -6374, 42670, 92407, 92122, 41775, 85384, 78398, 49804, -3949, 18114, 21094, 47168, 69195, 61679, 54864, 66496, 30421, 44343, 51537, 97963, 127054, 211093, 319186, 406174, 441968, 493120, 621177, 735878, 840384, 850974, 866802, 849866, 764664, 701406, 728050, 658339, 551198, 431889, 376028, 360835, 334676, 283170, 252060, 283960, 263735, 291034, 299511, 224894, 181461, 172350, 143055, 75022, 103544, 98945, 88844, 122813, 161658, 156619, 90175, 112634, 125252, 157995, 120601, 87019, 72410, 38654, 41345, 14384, -9605, -39522, -16065, 61782, 121946, 107065]
15773A07065m4585n3051j6381O2540K1445j8178j8129l7443l3616J0618K6668
15762F953L5745n8526n0879L5720Q7312k2317m4745k6372j181K2202L0638M6738
15750F1288o555J7594K2979j7810M3709k8304n9272p3488q538L9716L2569j2548
15738A1340j4946J9026K329j6841J4465K7097O640J3415k6231n2183j3096K9706
15726G21M8730l484M536O6077m8741n6728M2980m476n619n411k9219m5822k5203
15713f1659K0468J03409N8404o051J4126m6799m8629n5333n448L2916o1618P1422
15701A5208J00278P5210J2844o0217n1438J2638k5375m777l8541k2377N7828M1425
15689A12706m3365k9778M361k5024J1330L5757J8941o641K5558n288l5493k6001
$$ y = [107065, 62480, 9429, -6952, 55588, 77033, 58855, 40726, 3283, -30333, -19715, 6953, 42698, -15828, -66707, -30987, 56325, 34008, -10737, -37109, -38290, -16088, 14550, 61288, 54733, 72327, 95306, 77496, 121205, 92901, 33629, -39859, -48397, -8681, 23888, 11340, -3606, 15420, 17749, 908, 15373, 42470, 49110, 62525, 36294, -15889, -28985, 721, 49451, 45967, 50503, 116580, 67839, 11111, 54091, 49615, 43996, 38585, 9366, -36456, -61659, -41191, 62218, 120622, 114571, 128697, 81898, 33269, -22064, -27512, 5404, -56214, 15208, 115486, 190696, 203540, 143323, 91885, 104523, 79148, 74371, 35830, 13453, 71281, 112706, 69341, 39563, 43924, 18900, 30230, 65987, 84928, 78287, 103845, 98557, 63064, 37063]
15677C7063j7566o031k2925m1401K6272R583J786Q576Q794K7669J3384k529J3841
15664E6516J8840K8524j6539j1683J2277q851k0864l1013J7756k1353q0199p0178
15652a26767M0958O0439J3762j3659J7493n124m8990J1476L8564J5523L8488N2391
15640I4554N2019J6105k6099m9971r166K4234m3335K249P162K3625O516m6304
15628E1589l0245j0533O1702M8949m1523q517M4738P9684O0682Q4095P0475P2192
15616D83288J00654J88474K03902J84278J39862J59287J68966J99615N6268m9785
15606A834809L06j3474r2601q2656j52769j32482j60757r8829j48135j32630r2493
15595G28289j01443r7149j0762o0864k7599Q627n1868n7547l0666q719n6778J6216
$$ y = [37063, 19497, 13466, -9459, -50860, -24588, -15005, -13219, -4643, 4151, 31820, 45204, 42675, 56516, 75356, 103880, 87341, 75658, 87935, 79084, 58220, 27207, 44963, 23610, -56589, -126767, -85809, -25370, -11608, -25267, -7774, -12898, -61888, -50412, -11848, 3675, 42163, 94554, 146573, 162678, 136579, 86608, 77442, 101676, 58341, 60590, 67752, 91377, 97893, 51589, 21344, 10811, 72513, 121462, 79939, 71422, 116160, 195844, 256526, 340621, 411096, 483288, 583942, 772416, 976318, 1160596, 1300458, 1459745, 1628711, 1828326, 1884594, 1834809, 1835115, 1821641, 1729040, 1646384, 1493615, 1361133, 1200376, 1101547, 953412, 820782, 728289, 626846, 529697, 518935, 458071, 430472, 439099, 387231, 329684, 299018, 290299, 233521, 249737]
15583B49737P673n5566m0748R293J0735k2904o4484K7793O3262l8770n0218o658
15571H9145K2034j1662J8236J5317k2795P678J1682j2364n05k0300j7068m5752
15559C3646l9954l8385L7077K626l4571m44K6045k5947J3932P1353J2540K2042
15547G9960J3222J5817l6257j4912J3014m8422m531M7536M1012k0916l6601m0031
15535H891J386k33p23K0316O0288K6552P579k7283j4799n02N939N6919j0502j0617
15521A23211q065K524L54L115k3320q202k6270l8063k1549J3756n7137k2126P5045
15508A3273J5140k7109p935J2933N0093J02234j6339l5514J6415k37j0088k720
15496A10146J8519j1010k4683j4957q455l0441O1991L9204M976J9685k28j5252
$$ y = [249737, 257410, 201844, 161096, 170389, 181124, 158220, 93736, 121529, 184791, 146021, 95803, 89145, 111179, 99517, 117753, 133070, 110275, 117953, 129635, 117271, 116766, 96466, 79398, 33646, -6308, -44693, -7616, -4990, -39561, -40005, -13960, -39907, -25975, 45378, 57918, 79960, 93182, 108999, 72742, 57830, 70844, 22422, 17891, 65427, 106439, 85523, 48922, 8891, 10277, 10044, 9321, 29637, 89925, 116477, 124056, 96773, 81974, 81472, 87411, 144330, 133828, 123211, 115146, 117670, 118024, 121139, 97819, 89617, 63347, 25284, 3735, 17491, -39646, -61772, 13273, 28413, 1304, -6631, 6302, 56395, 158629, 142290, 106776, 123191, 122954, 112866, 110146, 128665, 117655, 92972, 78015, 69560, 39119, 101110, 140314, 145290, 164975, 164747, 149495]
15484A49495q792m624j4166q140J8101m4160p5133o9866L1395N0590j2757j8643
15472f700M5231j5285m0888M0255P1032L4316K5109k3758P25r344j214o356p5566
15459C7557m2098K095M7685j210L803J8948p015L4290K148Q018m257L456M6197
15446A49617N2320j0307j6415n5343j1505K6672M9154L721k251m3031k0212k0478
15434A01942n2526K6671O0986J20287N2164j1035r21L9528j0690J3447N8512O557
15422D04922m2409l6292R401j3633k1476J6231J7465j2678j3850j7145n7582K9203
15410B62157O9037M022L893j5657J0953K2986L4222k6687q290K6680K954p9445
15398C06825j9418M5756p959m5661n1205O285j4467M09J7145J2263R219k5123
$$ y = [149495, 140703, 136079, 121913, 113773, 131874, 87714, 12581, -57285, -25890, 24700, 11943, -6700, 38531, 23246, -17642, 22613, 93645, 127961, 153070, 129312, 130037, 120693, 119479, 113123, 37557, -4541, -2446, 45239, 44029, 47832, 66780, 59765, 94055, 96203, 104221, 99964, 103420, 149617, 201937, 191630, 175215, 119872, 108367, 135039, 184193, 187914, 185663, 142632, 122420, 101942, 49416, 76087, 137073, 257360, 309524, 298489, 297568, 337096, 326406, 339853, 398365, 404922, 362513, 326221, 335622, 321989, 300513, 316744, 334209, 321531, 307681, 290536, 232954, 262157, 331194, 335216, 339109, 323452, 334405, 357391, 391613, 364926, 356636, 383316, 386270, 306825, 287407, 333163, 325204, 279543, 228338, 234623, 220156, 220565, 237710, 249973, 259192, 234069]
15386B34069J713m6901m8412K1447M0630L5592Q371l4878l35L367j4262j7420
15374A82981P3416m590L538L9317l1323K714J6334K9281J8351l3334k6673j0958
15362B59054k1503l8710K0934J1835J5986K3453m1712p6830K1280Q1066M7214
15351C02067l854n4134j5649l5340j7418J053J0533p238k6272m5288O51J7838
15339A26949R472L142J6078l7184o020K9999L756N3063j8018k9242j8169q492
15327A25334k9623k9082K0328R108n5582j2262P4665N3585O348j3155M4202O0866
15315B54732K4960k912L6766M8601J4501J0865j549Q857J9118M6469L4177N9966
15303E54551M2437J0191L8796O2024J2812N0228P5709n65k5177o438N5462M4285
$$ y = [234069, 235782, 188881, 140469, 161916, 202546, 238138, 246509, 211631, 211296, 214663, 200401, 182981, 256397, 251807, 255345, 294662, 263339, 266053, 282387, 311668, 330019, 296685, 270012, 259054, 237551, 198841, 219775, 231610, 247596, 271049, 229337, 152507, 173787, 254853, 302067, 298213, 244079, 228430, 193090, 175672, 176725, 187258, 180020, 153748, 108460, 109111, 126949, 136421, 139563, 155641, 118457, 112437, 142436, 146192, 199255, 181237, 151995, 133826, 125334, 95711, 66629, 86957, 96065, 40483, 28221, 102886, 156471, 162819, 149664, 193866, 254732, 279692, 276780, 313546, 362147, 376648, 387513, 385964, 394821, 413939, 460408, 494585, 554551, 596988, 607179, 645975, 707999, 720811, 771039, 846748, 846183, 821006, 814568, 870030, 914315]
15291I14315K0681j31367o3698L9394K8185m6171k037l1333l5836K602r132O2099
15279G47702J7145K5438m2856P321J0713n3236l2006P6288K9358l115Q0899O0544
15267I24195L8260K2687p8284j6105l2359m682j1084n2496K9963J022K6742k3600
15255H24259n9073N3171L9321J1591k8374o7985K3307l6020M5479J8881M854M905
15243H34316M4975Q6466K1098k5441o4720j5505R781j5089K9884M3121Q918L9739
15231I97543N1129L3545J4316J2401j5896n685j7610j6135P9k3084k681N887K2185
15218A055994K099M9502J14096R1979M3447K9492J58301J53552J59095K09738
15208B067295J36540J46267J55116J75208J78901K04420J98915J79986K53216
$$ y = [914315, 934996, 803629, 739931, 779325, 807510, 761339, 759302, 727969, 692133, 694735, 685603, 747702, 764847, 790285, 747429, 754750, 765463, 712227, 680221, 756509, 785867, 782752, 863651, 924195, 962455, 985142, 906858, 890753, 858394, 853712, 842628, 790132, 820095, 821117, 847859, 824259, 765186, 818357, 857678, 869269, 840895, 772910, 796217, 760197, 805676, 824557, 829411, 834316, 879291, 965757, 986855, 961414, 896694, 881189, 890970, 875881, 905765, 948886, 957804, 997543, 1048672, 1082217, 1096533, 1108934, 1093038, 1087353, 1069743, 1053608, 1053687, 1030603, 1027922, 1033809, 1055994, 1058093, 1107595, 1221691, 1313670, 1357117, 1386609, 1544910, 1698462, 1857557, 2067295, 2203835, 2350102, 2505218, 2680426, 2859327, 3063747, 3262662, 3442648, 3695864]
15199C695864K66411L51598M21988M79126N31712P26061Q18402R32787J117200
15190I341149J343315J599418J896740K160461K618952L063506L698211M593514
15182C0315266O079500Q261046J1430322J5290140J9501514K3513715K7307907
15175A41699410L0919906L3537042L4144364L2461504K8880538K3767176J6928718
15168C42338658Q595666q6305p837457j4561868k0607022k5908945k8804110k8868984
15160B24259633k7345900k5426347k3119147k0063173j6579751j3537717j1131138
15153H7056460r191702p636902o430906n411927m751290m201517l793930l314279
15145D2324007k945549k571239k375129k115208j922506j717828j511622j449642
$$ y = [3695864, 3962275, 4313873, 4735861, 5214987, 5746699, 6472760, 7291162, 8223949, 9341149, 10684464, 12283882, 14180622, 16341083, 18960035, 22023541, 25721752, 30315266, 36394766, 44655812, 56086134, 71376274, 90877788, 114391503, 141699410, 172619316, 206156358, 240300722, 272762226, 301642764, 325409940, 342338658, 350934324, 350848019, 343010562, 328448694, 307841672, 281932727, 253128617, 224259633, 196913733, 171487386, 148368239, 128305066, 111725315, 98187598, 87056460, 77864758, 70227856, 63796950, 58385023, 53633733, 49432216, 45638286, 42324007, 39378458, 36807219, 34432090, 32316882, 30394376, 28676548, 27164926, 25715284]
15137B5715284j310504j125193j093806j031337r02850q72318q21891q26870p26243
15128A7004272o15207n39387n20429n13798n01317m91499l99766m48235m26604
15119A2548030l30507l57352l43374l46804l91061m55034l84135l30290k84357
15110I325116k65563k78355k32218k15812k47586k64723k65508k19886j64973
15101G170492j26645j39875j84841j63598j10412j26766j72294k58025j64955
15092E723081j65925j96088j18114j66074j58857j61660j35969q9459j18662j62437
15082D249836j67669j73503p5385n8387n6501r7362j00129q5900q6840p1041j3942
15071C263177o0470q9689o3344o822j1561p9377o6000o2537n4104o7511j2810
$$ y = [25715284, 24404780, 23279587, 22185781, 21154444, 20251594, 19379276, 18557385, 17730515, 17004272, 16389065, 15849678, 15329249, 14815451, 14314134, 13822635, 13422869, 12974634, 12548030, 12217523, 11860171, 11516797, 11169993, 10778932, 10323898, 9939763, 9609473, 9325116, 9059553, 8781198, 8548980, 8333168, 8085582, 7820859, 7555351, 7335465, 7170492, 7043847, 6903972, 6719131, 6555533, 6445121, 6318355, 6146061, 5888036, 5723081, 5557156, 5361068, 5242954, 5076880, 4918023, 4756363, 4620394, 4530935, 4412273, 4249836, 4082167, 3908664, 3833279, 3774892, 3718391, 3621029, 3520900, 3435000, 3348160, 3277119, 3263177, 3202707, 3113018, 3049674, 3042852, 3031291, 2951914, 2885914, 2823377, 2769273, 2701762, 2688952]
15060B688952J9048j3144N7747J53730K42968L58520L62051M04624M98235O01012
15050E373743N72745M95646M34050M43719L58056J44145K5009r6965k44794m10927
15040G094427m11296m91174n17802m69828m16200l91902m24460l94161k62371
15031C315233k36572k42817k28884k08160j68565j11726j10117j33540o6028o1013
15021A747811p1740q5557j13659p7223j5441L546n4537r0338j4149L9070m545
15010A263238j4584J2738m8078m4603M070p9274r3702k2817l613J9516J6941j9197
14998I90635O220j3944k5894o761n3105p6965l2522j1845J9893m0573j679l1763
14986G21697r1747Q013j5590J442M7213j7584j9715L7835P0381q492j10624m6770
$$ y = [2688952, 2708000, 2694856, 2752603, 2906333, 3149301, 3507821, 3869872, 4274496, 4772731, 5373743, 5946488, 6442134, 6876184, 7319903, 7677959, 7822104, 7847113, 7750148, 7505354, 7094427, 6683131, 6191957, 5674155, 5204327, 4788127, 4396225, 3971765, 3577604, 3315233, 3078661, 2835844, 2606960, 2398800, 2230235, 2118509, 2008392, 1874852, 1808824, 1747811, 1676071, 1590514, 1476855, 1399632, 1384191, 1387737, 1333200, 1242862, 1228713, 1267783, 1263238, 1248654, 1261392, 1213314, 1168711, 1172781, 1093507, 999805, 976988, 973375, 992891, 1009832, 990635, 996855, 982911, 957017, 950256, 897151, 820186, 787664, 775819, 795712, 755139, 753460, 721697, 629950, 637963, 622373, 623815, 671028, 653444, 633729, 671564, 741945, 733453, 622829, 576059]
14974E76059J834M2787j8997o5147L589K6277k8712l8482N2521l7431l7779l1961
14962D44558j3780k5592j9428l0016L4636n2401m3693l4924J3051N1578n601L9809
14950C58197K9096J0977Q82m6332k9937l9828J4039L0010R765J2168n07L4037
14938C82567K7336k6163j2392k4467J0776J8654o201m7700j29679j5617N0198
14927B27312J1457l7690k8348J7032k2005M7318J3897l6066l0619M715K257K5002
14915A94262k9087K803l546o9306m885J6433k3625j5813J8550J7117K9043l2849
14903I9097n875M6198J5914l5770n0270j4342j9162M95j5732L6995Q861j3798
14891E2611L9648k4207j1895R223K2451J5354J8946j9491r588j0679P536k5630
$$ y = [576059, 577893, 620680, 601683, 536536, 540125, 566402, 537690, 499208, 551729, 514298, 476519, 444558, 430778, 405186, 385758, 355742, 390378, 337977, 294284, 259360, 272411, 323989, 318388, 358197, 387293, 398270, 399152, 352820, 322883, 283055, 297094, 327104, 336869, 349037, 348530, 382567, 409903, 383740, 371348, 346881, 357657, 376311, 370110, 322410, 192731, 177114, 227312, 238769, 201079, 172731, 189763, 167758, 215076, 228973, 192907, 162288, 167003, 169260, 194262, 165175, 167978, 164432, 95126, 90241, 106674, 83049, 67236, 85786, 102903, 131946, 99097, 93222, 139420, 155334, 119564, 69294, 54952, 35790, 36285, 20553, 57548, 66409, 52611, 92259, 68052, 56157, 65380, 87831, 103185, 122131, 102640, 93052, 82373, 89909, 64279]
14879F4279o9191L1996L6400j2394K1670N1620j5429k5627K7236k1090k5339M6102
14867A10233K8041l5795J272N461j1455q386J3801m8884k2866k5751O503K8067
14855D0241n5306M313M7641L0502L0406j2432K6976l2049j8310L2653L9563j8710
14843A15488n4387O6946Q4864J0337P359k3052n354P550l0416k8154m7610N623
14831A09194k512j6138j8755O8212M2017L353k8948P898L9684P2913M5790P9999
14819D02707N1326l2857p56P1755K0758j5334M0757M5951O508o2177q2330l815
14807D42493K1951J4608l7319R34k913n2319j50036q1241K6148K681m5232n1333
14795H8422l2463K4082L0559p153K64K8026m1298J7232J0104O731J2687p714k0909
$$ y = [64279, -4912, 27084, 63484, 51090, 72760, 124380, 108951, 83324, 110560, 89470, 64131, 110233, 138274, 102479, 103751, 109212, 97757, 89371, 103172, 54288, 31422, 5671, 12174, 40241, -15065, -10752, 36889, 67391, 97797, 85365, 112341, 80292, 61982, 94635, 134198, 115488, 61101, 128047, 212911, 223248, 230607, 207555, 202201, 209751, 179335, 151181, 103571, 109194, 106682, 90544, 71789, 140001, 182018, 185371, 156423, 164321, 204005, 276918, 322708, 402707, 454033, 421176, 420420, 492175, 512933, 497599, 538356, 584307, 590815, 528638, 446308, 442493, 464444, 479052, 441733, 442667, 439754, 387435, 237399, 156158, 182306, 184987, 139755, 88422, 55959, 80041, 110600, 103447, 103711, 131737, 90439, 107671, 117775, 124506, 137193, 129479, 108570]
14782A08570r451l8667M9063n753q505k2323j2579L9859k052O018Q117k7358j7029
14769F7910k1713j7648J3993O9940M3390r329k5932k0537k4561k1996K9315L8097
14757A20929N994J0755m4276l316l632M4910n281L5121n6674j3045K1910l1199
14745H2196L9491p698J556O302J7247m0282k0016O8380J22073N7413Q4772P6957
14733D88391K9820K5489J16981J51042K59025K53708J60260J05584J33769P3233
14723A797302N1283P687m1976l5979p3898j36496j70855j81859j70258j44507
14713I00444j08363r7685p2698p6119n8010k2096p4883n3260o5164m624K3493
14702B91035k1722k0315J5064k0296m3555j7888j1158J4323n5615O83L8138n0989
$$ y = [108570, 99119, 60452, 109515, 103762, 95257, 72934, 60355, 100214, 98162, 104180, 112297, 84939, 67910, 46197, 28549, 42542, 112482, 155872, 146543, 120611, 100074, 75513, 53517, 82832, 120929, 126923, 137678, 93402, 90086, 86454, 131364, 126083, 161204, 104530, 91485, 113395, 82196, 121687, 113989, 115545, 121847, 139094, 98812, 78796, 147176, 269249, 326662, 411434, 488391, 518211, 543700, 660681, 811723, 1070748, 1324456, 1484716, 1590300, 1724069, 1797302, 1848585, 1856272, 1814296, 1778317, 1704419, 1567923, 1397068, 1215209, 1044951, 900444, 792081, 694396, 621698, 545579, 487569, 465473, 390590, 337330, 272166, 267542, 291035, 269313, 248998, 264062, 243766, 200211, 182323, 171165, 185488, 129873, 130556, 168694, 117705]
14690A17705j4029m0906R9N3355n419l0972j6340J5956J5466Q94K8927j4551P087
14677A17272J694O690J1431P513m813k0348m0565L268L5881k9264L789L176M911
14664A00635m9024l5121L1208J9772l1600n641P0035M2362M0074J13082N4239
14653C50021J06905O7228L7413P6923J02125J53542K03880L42772L59153M41336
14643B241298M95040N71292O07272N51179N50489M76889K32950M8514q519j97255
14633E569149l51120m44886m56303m80557m79238m83045m23550l57707l06150
14624A786593k12716j57023r6446j44175j54849n0288j8427n3714q5281q0919
14614G32755j18641p2588o6111j492K6589k9428o0295l1912l5121p5791K954j4724
$$ y = [117705, 103676, 62770, 62869, 116224, 110805, 79833, 63493, 79449, 94915, 95809, 124736, 110185, 117272, 118966, 125656, 137087, 144600, 139787, 119439, 78874, 82142, 118023, 88759, 92548, 95724, 100635, 51611, 16490, 47698, 67470, 35870, 30229, 100264, 142626, 182700, 295782, 350021, 456926, 524154, 561567, 638490, 740615, 894157, 1098037, 1440809, 1799962, 2241298, 2736338, 3307630, 3914902, 4466081, 5016570, 5493459, 5726409, 5774923, 5766404, 5569149, 5218029, 4773143, 4316840, 3836283, 3357045, 2874000, 2450450, 2092743, 1786593, 1573877, 1416854, 1320408, 1176233, 1021384, 971096, 952669, 898955, 813674, 732755, 614114, 541526, 475415, 473923, 500512, 471084, 410789, 378877, 343756, 267965, 270919, 256195]
14602B56195K3709M7022P53o8247l3471L0886j1334j6625J1770j5475m674L0615
14590B51124l1087j9973R643k219m5905q7029O3237J26306m6883o1762O04m0819
14578A15237m7706P034K7735k6690m9187k9486P332K6273N0153J9909J2481J4590
14566A27675j7822n557m4866o1725j7563L2293L0477j338l952K8582K9648K5283
14554A21135l1163M557k1532m7477o690O9722k218k3075k4598K9488L0446K5597
14542A24192n465j0153j9005k8132j1765j9475k2846J8455k8672m5044M5785J933
14530a92r635O1748K8347L2315k5037j8969J2832K171K5215o7995k4538J5334
14518C1596j4371k8074O9761N4716o1189m7600l663n9223k8010L3844O0173O3978
$$ y = [256195, 279904, 326926, 327679, 259432, 225961, 256847, 245513, 228888, 240658, 225183, 220509, 251124, 220037, 200064, 209707, 207488, 161583, 74554, 137791, 264097, 217214, 155452, 156056, 115237, 67531, 74565, 102300, 75610, 26423, -3063, 4269, 30542, 80695, 100604, 113085, 127675, 109853, 104296, 59430, -2295, -19858, 12435, 42912, 41574, 37622, 66204, 95852, 121135, 89972, 94529, 72997, 25520, 18830, 88552, 86334, 63259, 38661, 68149, 98595, 124192, 118727, 108574, 89569, 61437, 49672, 30197, 7351, 25806, -2866, -47910, -2125, -192, -9827, 51921, 80268, 112583, 87546, 68577, 81409, 83580, 108795, 40800, 16262, 31596, 17225, -10849, 58912, 113628, 52439, 4839, 1176, -58047, -86057, -52213, 7960, 71938]
14506G1938J8257m1920k0443n6443j6201j292L6188K2337k356J7816J7531m3044
14494B368q4344K5848K6134N9662n736k9863Q402J9476J6350m86k6697J3756K2329
14481D7199k996m923l9026m4145L9246J1107o1779R711R0570j2148p9664r325
14469e6173K8454L7145k4025j0640m0845M5806K7778k1815j0403n062q238Q726
14457b9292O0587o0933l2477L6521J3491k2661K2727j0465J5932M50r61R537n0
14444B406N446R1459J6836m1622j9938L2848p3403J1288Q1096q217l7754K6941
14432H7386J7982O1142n7313j01332M04k0281K406k8752M6166J1217J7841J8535
14420E5401K1968j4087K0142j9245m0978j0862l1413K8582O8201K5215J933m0589
$$ y = [71938, 90195, 48275, 27832, -28611, -44812, -46104, -9916, 12421, 10065, 27881, 45412, 2368, -81976, -56128, -29994, 29668, 23932, -5931, 2471, 21947, 38297, 37811, 11114, 24870, 47199, 44203, 39280, 254, -43891, -4645, 6462, -55317, -45606, 44964, 32816, -46848, -56173, -27719, 9426, -14599, -25239, -66084, -20278, 7500, -14315, -24718, -29780, -38018, -29292, 31295, -29638, -62115, -25594, -12103, -34764, -12037, -22502, -6570, -6120, -7081, 2456, 2406, 7852, 99311, 116147, 74525, 54587, 87435, 14032, 25320, 106416, 98199, 60445, 87386, 105368, 166510, 109197, 7865, 8269, -12012, -9606, -38358, 7808, 19025, 36866, 55401, 77369, 63282, 83424, 64179, 23201, 12339, -19074, 9508, 77709, 102924, 104857, 64268]
14408F4268J3923K8578m6068l2729Q10j3673m4739P603N805K8872J8574l5769
14396d545J3015J3483m5380L4198J3398n2357K5281K2377n2800O62r214l1235
14384g3117M6478N1431K4043K7160l834m6974J4310J6113k2103L5458L852j7474
14372E5343p385m4052k0146J0511l8472K392M4354l8933q411L5631q742Q844J218
14359g848O92K0925m503j3133J8462K7162K3468l2806N1872k9315j0780l477q149
14346C2570n529p925j1414j5276k75O2344M067j3972L92q565l7490l7685Q031
14333c0727N7643k9878j4673j0484j5678j0790M0928L1800n0083l0044p487j470
14321g0943j5730k3146J1042q700p861j427L8205L1880K8706l5480n7039k1903
$$ y = [64268, 78191, 106769, 60701, 27972, 28782, 15109, -29630, -22027, -16222, 12650, 31224, -4545, 8470, 21953, -23427, 10771, 24169, -28188, -2907, 19470, -33330, -32668, -41882, -73117, -26639, 24792, 48835, 75995, 72161, 25187, 39497, 55610, 33507, 68965, 72817, 55343, 47958, 3906, -16240, -5729, -44201, -41809, 2545, -36388, -44799, -9168, -17910, -9066, -7848, -7156, 13769, 9266, -3867, 14595, 41757, 65225, 32419, 84291, 54976, 44196, 40719, 32570, 27041, 19116, 7702, -7574, -7849, 54495, 58562, 44590, 44982, 36417, -1073, -38758, -30727, 26916, -2962, -17635, -28119, -43797, -54587, -13659, 18141, -31942, -61986, -69473, -70943, -86673, -109819, -98777, -107477, -115338, -116765, -78560, -46680, -17974, -53454, -110493, -132396]
14309a32396L3698M493j5474O444L8727r645K6636P2443q445o3866J6526M7062
14297A6203P889l9355K1119J5082m1018Q461L46q90N136q752J0745K9918n142
14284A9742j1690l689m3112O385N4936m409l8891l9963m62J0967m8186J5854K2768
14271e9750L0748R306R595L4835J5216J2677l3463n2559K9084J2123l5841j924
14259b9953N569l856J8959M3868l2589l486L279l0816k8211J2185N2208k8589
14247b1432o9404n8336N1807N1007L0268k5742m5893O543m1533N87N5934R805
14235e6389K6320N5465Q50j7983j7255K5113m2026n6555J5766J9884J3983P80
14223c2047J455j0956j3244M3936K5917l4736m3704J5070M6144j4127k908k1607
$$ y = [-132396, -98698, -94205, -109679, -103235, -64508, -74153, -47517, 24926, 16481, -47385, -30859, 16203, 24092, -15263, 5856, 20938, -20080, -11619, -11273, -12163, -7027, -15779, -5034, 24884, 19742, 8052, 4363, -38749, -32364, 22572, 18163, -20728, -60691, -61153, -50186, -98372, -82518, -59750, -29002, -19696, -10101, 24734, 39950, 52627, 19164, -33395, -4311, 7812, -28029, -29953, -24384, -28240, -9281, 34587, 1998, -1488, 1791, -29025, -57236, -45051, 7157, -21432, -90836, -149172, -97365, -46358, -16090, -41832, -87725, -81182, -122715, -122128, -66194, -56389, -30069, 25396, 26246, 8263, -8992, 16121, -25905, -82460, -66694, -46810, -32827, -32047, -30592, -41548, -54792, -10856, 15061, -19675, -63379, -48309, -2165, -16292, -19200, -40807]
14211d0807L4445N7284K9017l4745J9000q2263m2767k0252N77J9166N8225j6460
14199a9580k4585K875N986M0774K1825m2358k8818N0156N7063J938Q355k75l000
14186G0356j0364m7470o4704j4604P038M418K3308P4274j6294m8354l1145m6729
14174a00270J0244J9675N7977M7114j3029o82k4719P837m2826L613j3093J9621
14162b8538M4582k8145L860J2483K49J5075j1176K5124K5600m9746p5129l2711
14150i8472J4861L7515N5905j081l7499N604J4530j0600j2700R636J2551n1167
14138f0917K9182J9645l2353L2555M4198l7263n0020J4699j0623k391K9132j3305
14126c7461K1505m9527j9612O2032k8365k9212M2698K4903l3391m869M5394N4867
$$ y = [-40807, -6362, 50922, 79939, 45194, 64194, -18069, -60836, -81088, -80511, -61345, -3120, -19580, -44165, -41290, -35304, 5470, 27295, -15063, -43881, 6275, 63338, 65276, 73631, 73356, 70356, 59992, 12522, -52182, -66786, -59748, -55330, -32022, 42252, 25958, -22396, -53541, -100270, -90026, -70351, -12374, 34740, 21711, 21029, -3690, 4147, -38679, -35066, -48159, -28538, 16044, -12101, -8241, 4242, 4491, 19566, 8390, 33514, 59114, 9368, -65761, -98472, -83611, -46096, 9809, 8728, -28771, -23167, -8637, -19237, -31937, -22301, -9750, -60917, -31735, -12090, -44443, -11888, 32310, -4953, -54973, -40274, -50897, -53288, -24156, -37461, -15956, -65483, -85095, -23063, -51428, -80640, -37942, -13039, -46430, -51299, -5905, 48962]
14114D8962J7912n0276J4893J58J7457m0734m0180j5549J6264M5688M0916M665
14102F0176r5782o9782n466J2655J8421p376m030K9737K1634l2648L8427J3183
14090b0851l283O1301P0582L5093n6271n988J0078n0988j00546r96N0039J1848
14078A8r684O0960J7450N204r595k3075n9110m2386K6130n005l9406m4698k7454
14065a50651N2905J19068O1181j0231k1660m8935j9548N30n4173j0107L5056J565
14053d5000m7687O2679J6274o4388l4483L9820M4205K4531L7543K1974J5712m053
14041F7127m1542n8832N042J3393J4863k7802m5688L9189L8572L6661N764l1624
14029A5123J9j8790q924M7889L860n3528p1721L6510L6244M4099k2847r252l0874
$$ y = [48962, 66874, 16598, 31491, 31649, 49106, 8372, -31808, -47357, -31093, 14595, 55511, 60176, -35606, -105388, -110854, -98199, -79778, -87154, -91184, -61447, -39813, -72461, -34034, -20851, -24134, 37167, 107749, 142842, 86571, 80583, 90661, 39673, -60873, -61869, -11830, 18, -9666, 51294, 68744, 73948, 64353, 41278, -17832, -60218, -34088, -39093, -78499, -123197, -150651, -97746, 21322, 82503, 72272, 50612, 1677, -17871, -17341, -71514, -81621, -46565, -45000, -92687, -30008, -13734, -78122, -112605, -72785, -28580, -4049, 33494, 55468, 71180, 67127, 25585, -33247, -28205, -14812, 51, -27751, -73439, -34250, 4322, 40983, 46747, 15123, 15142, -3648, -12572, 35317, 39177, -14351, -86072, -49562, -13318, 30781, 7934, -1318, -32192]
14016c2192O1263O5532o6936n3602L2985k9373m7381j1731k4353P1636N0827M0665
14004E7340L122l4030N918Q484J4268j3542J37K4292K4074P1967L1480o3611k9600
13991A00299l7409l6602l4935m0102M2320Q4736k0310l0724K5901q313m6948l7159
13979c9246J6411P4735l0582j7984M272P1954J779l2524k4801n8318m7013M1784
13967c9533K4216j1592j7229k1552l1107j8286m5294N619L3985Q4813P7593m366
13955C7267j8169Q023j1360l0044K3371m34k0288n6797J2320M7974J1314J839
13943E016M752j1522m1692j4878j2996j5506L9925j3550k3162K2604J247m8075
13931a07837m1807M1966L3185p374K8369j0345k2525n701L2762N4880J9733o4456
$$ y = [-32192, 29071, 94603, 27667, -25935, 7050, -22323, -69704, -81435, -105788, -34152, 16675, 57340, 60462, 26432, 32350, 40834, 55102, 41560, 41697, 65989, 90063, 162030, 193510, 129899, 100299, 62890, 26288, -8647, -48749, -6429, 78307, 57997, 27273, 53174, 44861, -2087, -39246, -22835, 51900, 21318, 3334, 7606, 79560, 81339, 48815, 24014, -34304, -81317, -39533, -15317, -26909, -44138, -65690, -96797, -115083, -160377, -154758, -120773, -35960, 41633, 37267, 19098, 27121, 15761, -14283, 9088, 8654, -11634, -68431, -56111, -8137, 3177, 5016, 9768, -1754, -43446, -58324, -71320, -86826, -46901, -60451, -83613, -61009, -59762, -107837, -149644, -107678, -74493, -81867, -53498, -63843, -86368, -92069, -59307, -4427, 15306, -49150]
13919d9150k5000k1079o775k8061j6409L0207N2734N8761O6696l3890n6607o8372
13907i6945K7098N1631R405k3869Q454P8608L0251r990m1934m8069o4235K1884
13895e7711l2791l2724L3625K1497l4542L3714P005k7636J9485J2116J2512N8810
13883A3360J2021m8305m4771k0032p206j5250J2983L7376L5025j3148l1815L378
13871f6384Q401J1176M7452k4882m1475p293J390l1624N7114K7108K1099J693
13859C775k5098J1805K0510r604l1428j4985J5853J7823j9739J2035Q509n3049
13847f3593j1268k855K4815R6381N770m7188l8923o7337j0462L1490K7049j084
13835e7205J2248K2395k224j3710K0020J152k6761K8472N2477l8860j9071N195
$$ y = [-49150, -74150, -95229, -102004, -130065, -146474, -116267, -63533, -4772, 61924, 28034, -28573, -96945, -69847, -18216, -8811, -32680, -24226, 54382, 84633, 74643, 32709, -15360, -79595, -57711, -90502, -123226, -89601, -68104, -102646, -68932, -61927, -89563, -70078, -57962, -45450, 13360, 25381, -22924, -67695, -87727, -94933, -110183, -97200, -59824, -24799, -37947, -69762, -66384, -57983, -46807, 645, -24237, -65712, -73005, -71615, -103239, -46125, -19017, 2082, 3775, -21323, -9518, 10992, 1388, -30040, -45025, -29172, -11349, -31088, -19053, -10544, -63593, -74861, -77716, -52901, 43480, 49250, 2062, -36861, -104198, -114660, -83170, -56121, -57205, -44957, -22562, -24786, -38496, -18476, -17324, -44085, -15613, 36864, -1996, -21067, -15872]
13823a5872m9617k3594N6056J9576N5337K1196p9356n4819k8548K8735K2997N2687
13811D778J0927n7809K1154N152o82L9809O968r9027o3154J7095O2098j9508J1759
13798f0440N0014Q440k0900o4203n5991O023P5464M7224R465j5730k2291m2143
13786h5068j9487r456L3581N5539L4382n424L552k3513l8571J5974N8065j8296
13774A278r1485l1117J9053N0432O4362M9956l0422K2555q0998k3322L3824N0210
13762C4326J1933k1988o0541j4912k642K4857P265m4L8888k1706L5989j8723q606
13749D096J3305L2158k0286m5460o5118k7910L6486J4342J8731n717n092l0528
13737h0993k9057K4907j622J2111N5786m1337k0628n694O6832O5623l6882L184
$$ y = [-15872, -65489, -89083, -33027, -13451, 41886, 63082, -16274, -71093, -99641, -70906, -47909, 4778, 15705, -42104, -20950, -15798, -16480, 23329, 30297, -68730, -131884, -114789, -52691, -72199, -60440, -10426, -1986, -22886, -87089, -143080, -137057, -61593, -14369, -4904, -20634, -42925, -85068, -104555, -114011, -80430, -24891, 9491, 4067, 7619, -15894, -54465, -38491, 19574, 1278, -90207, -121324, -102271, -51839, 12523, 62479, 32057, 54612, -26386, -49708, -15884, 34326, 46259, 24271, -36270, -51182, -53824, -28967, -21702, -21746, 17142, -4564, 31425, 12702, 4096, 17401, 49559, 29273, -16187, -81305, -109215, -72729, -58387, -39656, -45373, -50465, -80993, -110050, -85143, -86765, -74654, -18868, -60205, -80833, -86527, -19695, 45928, 9046, 12230]
13725A2230J2823l5257J5596M1135l7196l9726L1214P7719J6756l1394j7044n941
13713D0915Q177J2987K7619m7804l7501j3527k6661K5413K1219J6835K2598o1006
13701a0736p8098K2164L5749J7256L2107Q579l9069q052L9930M8330M28n0190
13689A8398n4448j8814l0649k2335K3163Q1359K4942k4916L6456K419m6117q159
13677a8701p532p704m981j0628J7625j3918m7118l7122N7279Q0334l8302L1401
13665F33l9974n2027J091L5658m1299o699M1556K3358k4001l3032K141J5273N294
13652g2028L0465K1334J2605J2971k2857K4956K2867m616m2383o3367j9830L0019
13640f9864N2133J7801p7733J4445m7619L691J8328N7559K8927r416J2280k1652
$$ y = [12230, 25053, -10204, 5392, 46527, 9331, -30395, 819, 78538, 95294, 63900, 46856, 40915, 49092, 62079, 89698, 41894, 4393, -9134, -35795, -10382, 10837, 27672, 50270, -10736, -88834, -66670, -30921, -13665, 18442, 27021, -12048, -20100, 19830, 68160, 68588, 18398, -36050, -54864, -85513, -107848, -84685, -3326, 21616, -3300, 33156, 35575, -10542, -18701, -26233, -33937, -38918, -49546, -31921, -45839, -92957, -130079, -72800, 7534, -30768, 633, -39341, -91368, -90277, -54619, -95918, -102617, -61061, -37703, -61704, -94736, -92595, -77322, -72028, -41563, -20229, -7624, 5347, -17510, 7446, 30313, 25697, -16686, -80053, -99883, -69864, -17731, 70, -77663, -63218, -110837, -107146, -88818, -31259, -2332, -11748, 532, -21120]
13628b1120j3162L0875L4447k2970q8099J0019L6666J8248K0327m3829k9566N5464
13616a2700K4406k5970j1681M4907K239k8924L1950j6021P193m2043K1392r15
13604f167k8642Q442k0880l7505J9544M6076j6255l7253j1848j3548P9470K8786
13592A0220j0296r63J4530p58j2711o422j6186K5552M8955K7717r682q0k2800
13579D7076N4123J4949L0221M8283Q764N4198P1342P25L189O776J3094p8003P021
13566B81758J2448l430l729n7977o5957n2589K4643l400K2600J6105l3557m2595
13554I4320m4157K8207k2006M78j6000k3724q621p625K5846m4729M68K2002l3042
13541b8583O661M2074m9374J8932k0269j0059k7771j0192L6797m8639M3199j249
$$ y = [-21120, -34282, -3407, 31040, 8070, -80029, -70010, -33344, -15096, 5231, -38598, -68164, -12700, 11706, -14264, -25945, 18962, 21201, -7723, 24227, 8206, 15399, -26644, -5252, -6167, -34809, -26367, -47247, -84752, -65208, -19132, -35387, -72640, -84488, -98036, -18566, 10220, -76, -1039, 13491, 12733, 22, -6400, -22586, 2966, 51921, 79638, 69956, 69876, 47076, 101199, 116148, 146369, 194652, 203416, 257614, 328956, 329681, 332870, 339646, 352740, 274737, 281758, 294206, 290776, 287047, 229070, 163113, 110524, 135167, 131767, 154367, 170472, 136915, 94320, 50163, 78370, 56364, 56842, 40842, 17118, 8497, 872, 26718, -18011, -17543, 4459, -28583, -21922, 20152, -29222, -10290, -30559, -40618, -68389, -78581, -41784, -90423, -47224, -48473]
13529d8473K6592M4920O0745L1100m2541p0135m4850N1942P784k802k3607r564
13517a8889m390J6985K6994j4107K4654k0928j5929l6440j9536K4954j620m9235
13505h7487P392J8053q2569m4797K4089L7167N9846K4034k4088j4949K1743n159
13493f6725k1620k1511l6052K9767M7995O329k24L3750J3663k4748L9821k5645
13481b5200j9106L9689j8422l8183p994Q526P470K2991O1938j4147k0431l0787
13469c3656o9305M4809O9467M9988K4229N485l9217k4150J5487r749M346P867
13457D5601p467k1420n0391j8201O4113l236m6765K7085K2539n7806n664K2742
13445b8870l0280Q082J2769K3447L3151K1066j1410j5127K4834J5770p9010m9844
$$ y = [-48473, -21881, 23039, 83784, 114884, 72343, 2208, -42642, 9300, 17084, 14282, -9325, -18889, -23279, -6294, 20700, 6593, 31247, 10319, -5610, -42050, -61586, -36632, -38252, -87487, -80095, -62042, -144611, -189408, -165319, -128152, -68306, -44272, -68360, -83309, -61566, -66725, -88345, -109856, -145908, -116141, -68146, -61817, -62041, -28291, -14628, -39376, 445, -25200, -44306, -4617, -23039, -61222, -69216, -60690, -53220, -30229, 31709, 17562, -2869, -33656, -102961, -58152, 11315, 61303, 85532, 91017, 51800, 27650, 43137, 33388, 37734, 45601, 38134, 16714, -33677, -51878, 12235, 8999, -37766, -10681, 11858, -45948, -51612, -28870, -59150, -51068, -38299, -14852, 18299, 39365, 27955, 12828, 37662, 53432, -25578, -75422]
13433g5422M748l66o217l0921K6881O6924L6460O02o9664m7708N0216J9407m7323
13420g2383L172P8682L684m1924n8177q1699J9485L3482q229L261L0208N1964
13408c8474k7814K8114L8500M294k6257L26L5232p892m3044l142l2354K4011O3733
13395A5233K0148l9405n6914M7474N8909R031J7137m4262n4326l8533k6716J8012
13383g4212K8076J2158k512l0952J6332l5251o8998k267K3684L0554N5014J4515
13371c3859N5270K687m3806K293P0587J2873J9041J4032k9095l9623L5547l7150
13359B8797j3156r01j2628l5978j0870J2102k337L6482J5606L9314K2651o4188
13347A4894l5832M7034J4772M2007J0704Q212l6317k1888l9347J0048O219o0868
$$ y = [-75422, -70674, -71040, -77257, -108178, -81297, -14373, 22087, 22689, -46975, -94683, -44467, -25060, -72383, -69211, 9471, 13155, -28769, -86946, -168645, -149160, -115678, -123907, -120646, -90438, -38474, -66288, -38174, 326, 4620, -21637, -21311, 13921, 6029, -37015, -40157, -72511, -48500, 15233, 35381, -4024, -60938, -13464, 45445, 54476, 71613, 27351, -26975, -65508, -92224, -74212, -46136, -33978, -36490, -67442, -51110, -86361, -155359, -157626, -133942, -103388, -48374, -33859, 21411, 24098, -19708, -17415, 53172, 66045, 85086, 99118, 70023, 30400, 65947, 28797, 15641, 14740, 2112, -33866, -44736, -32634, -34971, 1511, 17117, 56431, 79082, 14894, -20938, 26096, 40868, 82875, 93579, 101791, 65474, 43586, 4239, 14287, 20506, -40362]
13335d0362k401k7440J9869j772K5405l8543j2188l4668L8820P3198L3357n4883
13323b1608k0125N0241N0886K7290m3037n5333r320j9877k1637k3464l3089q248
13311a27321N4828M3417j2597R831J0925m8041J1277N8850k809J486j529k7397
13299b9080K9360P127J3680M784m1215L0968m9547n0606K1271O9958J9382K5020
13287E1102k5410m0237m411P717k9315P520m4774J384O6358O593r970N3428J1973
13274E1958j620K0124o1307k0895R928r274j5450j2615N59J1987J0905P826n431
13261a3305J0344o341J7040K1646o856M05L0342n1607j9400m759l2973r373M985
13248e9852K0774n3754p394Q982o789m757K0372J6437J4941m3662L9111P8627
$$ y = [-40362, -42763, -70203, -50334, -52106, -26701, -65244, -77432, -112100, -73280, -82, 33275, -21608, -41733, 8508, 59394, 86684, 43647, -11686, -21006, -40883, -62520, -85984, -119073, -127321, -72493, -29076, -41673, -31842, -20917, -68958, -57681, 1169, -1640, -154, -1683, -29080, 280, 7407, 21087, 25871, -15344, 15624, -33923, -84529, -63258, 6700, 26082, 51102, 25692, -14545, -18956, -11239, -40554, -33034, -77808, -76424, -10066, -3473, -13443, 39985, 51958, 50338, 70462, 9155, -11740, -1812, -11086, -26536, -39151, -38592, -26605, -15700, -7874, -13305, -2961, -9302, 7738, 29384, 22528, 22933, 53275, 1668, -17732, -22491, -55464, -64837, -59852, -39078, -92832, -100226, -91244, -98033, -102790, -82418, -65981, -51040, -94702, -55591, 23036]
13236B3036M4562r609j2676m3937L5077K0848m068k7403k1443l9657j9295L9891
13224a4674L5246L5986n0911m5752K4094Q3707j1594o9371k0118j8949M1853K3871
13212A3388j2156J2750L277K9367k2945j2870k1226m3612q01K9285J0054K0087
13200D598J6618P317R661j5734k6969K8385k1613n3405L2050m1616k3653N1678
13188c2683p230Q339l3685L9765l8088o962j4423J098o855O83M0222p926j2765
13175g0510J392O5067M1678j5438k4942L2787l873p6926L700L284J4127J9228
13163a0426l882p813L1441P284m711K7715m8187J3924J010L787Q0209K6046j2091
13150A04306J1301P431n8691l6294K1345n358l0902o7945n5998K6326l014K959
$$ y = [23036, 67598, 57989, 45313, 1376, 36453, 57301, 53233, 25830, 4387, -35270, -54565, -14674, 20572, 56558, 5647, -40105, -16011, 67696, 56102, -13269, -33387, -52336, -10483, 13388, 1232, 13982, 17259, 46626, 23681, 10811, -10415, -54027, -54828, -25543, -15489, 4598, 21216, 28533, 38194, 22460, -4509, 23876, 2263, -51142, -19092, -60708, -84361, -32683, -39913, -31574, -65259, -25494, -63582, -70544, -84967, -83869, -90724, -90041, -49819, -57745, -70510, -69118, -4051, 37627, 22189, -2753, 30034, 26161, -50765, -47065, -43781, -29654, -10426, -14308, -22121, 9320, 16604, 11893, 39608, -8579, 5345, 6355, 10142, 90351, 116397, 104306, 115607, 123038, 64347, 28053, 49398, 44040, 13138, -54807, -110805, -84479, -87493, -84534]
13138h4534O5233L5874J4003J6990j862Q47p526O6063k466m4393q1196j6844L26
13125c9485j059j159K5621L152L5521J6681O68L6859o7202J5776J4661j3636p086
13112A9312O8187M0554L9917q827O859M048l4385m1926K8490Q118J0149n2093
13100H8403n208k5659k4151P112k7166m427O681M1484R67R79j9779n8732r6271
13087a15767K5097L0529M995k9732K2617r929L2181M3166k2434j3580n4319o0547
13075a47723L0182K3750m2123J0838N0396l535j7541N2825M2910r895K0179N8545
13063F8808J7872l4823l6343n76N1725q251l9628k578J5807k4327J5191J7933
13051D0810l211j8596j8347k905N5278P192q6513o8797K6281Q42N6035M606j8370
$$ y = [-84534, -19301, 16573, 30576, 47566, 45704, 46551, 39025, 105088, 102622, 58229, -22967, -39811, -39485, -40544, -41703, -16082, -12930, 22591, 39272, 39940, 76799, 9597, 25373, 40034, 26398, 19312, 87499, 128053, 167970, 159143, 166002, 170050, 135665, 93739, 122229, 130347, 140496, 88403, 83195, 57536, 33385, 40497, 13331, 8904, 15585, 57069, 58036, 59015, 39236, -19496, -115767, -90670, -60141, -55146, -84878, -62261, -72190, -40009, 3157, -19277, -32857, -87176, -147723, -117541, -93791, -135914, -125076, -74680, -78215, -95756, -42931, -21, -9916, 10263, 68808, 86680, 51857, 15514, 14938, 66663, 58412, 18784, 16206, 32013, 7686, 22877, 40810, 37599, 19003, 656, -2249, 53029, 60221, -26292, -95089, -68808, -67966, -11931, -7325, -25695]
13038b5695j8402K7071j2332k9733J8581K6626j9982K3591J7763m4079L252L4342
13026A003L7383n5532p8614k2750L558P7669q132J6322l4864m6887M2691p954
13014g6107j375L8726j6286J6108L5962j0310K1496p157l998m448O2424O1660
13002A16695J5102n7609m5694m9693p897l4144l5000N773N7791l4512M296L8637
12990b6255O4733j759m8684l704k0745K228J4695r873j8219k5554L9253M2301
12978H417k3761n2164J6919k034L4886k9927M378Q432j0816k0288O047M0949N255
12965a3707J2608L7351K9899l0931m8436j1931J6934L9554k3764j1205L9235L9331
12953G4938o4948o4324N783N3501j1264j6271M0636j8421L9320J0536n2391k5105
$$ y = [-25695, -44097, -17026, -29358, -59091, -40510, -13884, -33866, -10275, 7488, -36591, -33339, 1003, 38386, -17146, -95760, -118510, -114952, -37283, -45415, -29093, -63957, -110844, -68153, -76107, -77482, -38756, -55042, -38934, -2972, -13282, 8214, 1057, -2941, -7389, 55035, 116695, 131797, 74188, 28494, -21199, -29096, -63240, -98240, -92467, -34676, -69188, -64892, -26255, 38478, 36719, -11965, -15669, -36414, -34186, -19491, -29364, -47583, -73137, -33884, 8417, -15344, -67508, -50589, -52623, -17737, -47664, -43286, -34854, -45670, -65958, -59911, -18962, -13707, -1099, 36252, 66151, 35220, -13216, -25147, -8213, 31341, 7577, -3628, 35607, 74938, 9990, -54334, -48551, 4950, -6314, -22585, 18051, -370, 38950, 49486, -2905, -28010]
12941b8010n0009m6890k768L4074N6171n70q358N2393J9591k335r022l7208j8894
12928d1835L577n0707k2920M3890K3532P317O1289K0697m1062J9312J6708J5619
12916E5417K781j4789m2278L9644k1524K4518O492J743L5370J4736j8022L504
12904H7592J1417n1274k8427l3827k7604O7856L5016q067j7109n472N423n7968
12892b2444K9633L5491m2472n0802K6500m798j9957N4358L6970j5439m7348m9454
12880f9762l7072N4554N3159J8748K1942J4272l1898K8745L3874m1805n5256k1554
12868c2053K206q07R272m5063k9106L1944N8316n3455n7767J0212J4178L6385
12856e5738K2247L7855J4488j8803J739M9242M6691J7688l6357J993M263m5668
$$ y = [-28010, -78019, -124909, -127677, -93603, -37432, -38002, -46360, 6033, 25624, 23289, 14267, -22941, -41835, -38258, -88965, -111885, -67995, -44463, -37146, 24143, 44840, 3778, 23090, 39798, 55417, 58198, 43409, 1131, 40775, 19251, 43769, 50261, 52004, 87374, 102110, 84088, 87592, 99009, 47735, 19308, -14519, -42123, 25733, 60749, 52682, 35573, 30101, 35524, -22444, 7189, 42680, 208, -50594, -24094, -28892, -48849, 5509, 42479, 27040, -20308, -69762, -106834, -52280, 879, 19627, 41569, 55841, 23943, 52688, 86562, 44757, -10499, -32053, -29847, -30654, -21382, -66445, -95551, -63607, -5291, -58746, -116513, -106301, -92123, -55738, -33491, 4364, 18852, 49, 1788, 51030, 97721, 115409, 79052, 81045, 85308, 39640]
12844C9640n7987O050l5948n9761J6079L1913l6691k963N0590M4372P569M1487
12832D4350k7103k9585j7669j7847K683N1817k791k3029J3759K6478J7672l7348
12820A387N007q730l9709K7210L9416J6263j2659l6422O223L6594q822J9425J6128
12807F1311m1359l1517K7242l666o883J4667j0800j6454K0152l1383K8050J7629
12795B6989k7301K9678K6335O6544J5226l0977J7994L4374j1869o8143l5147L2838
12783G6541K4730o4803k2565J6823J6722j8629q927J6296j1066M723J9378K9912
12771G9135r258k1293n0870k1420m431l7174k5022N0295M4097L3832k0326j3157
12759D408Q539j5459r520r290l7754M563m8658O512R1102M0459K2985M4182l7712
$$ y = [39640, -18347, -12297, -48245, -108006, -91927, -60014, -96705, -99668, -49078, -4706, 2863, 44350, 17247, -12338, -30007, -47854, -45171, 6646, 3855, -19174, -5415, 21063, 38735, 1387, 6394, -2336, -42045, -14835, 24581, 40844, 28185, -8237, -2014, 34580, 25758, 45183, 61311, 19952, -11565, 15677, 12011, 5128, 19795, 8995, -7459, 12693, -18690, 9360, 26989, -312, 29366, 55701, 122245, 137471, 106494, 124488, 158862, 146993, 78850, 43703, 76541, 101271, 36468, 13903, 30726, 47448, 28819, 19892, 36188, 25122, 29845, 49223, 79135, 69877, 48584, -2286, -23706, -28137, -65311, -90333, -40038, 4059, 37891, 17565, 4408, 12947, -2512, -12032, -21322, -59076, -54513, -103171, -96659, -5557, 34902, 57887, 102069, 64357]
12746F4357l0870l1099K6804j574n140j9064K1950j1011l5207L2330J8703R934
12734D0113K4101o8589j2662j0443j0050J7483O0047J0766j73O1471j4314o8271
12722B9479n0706O7997L2705l197j1446j9038j2660k5102n9802k7296L0797N5635
12710G366L2467L2792m0523q9228m5539K7150K9932j1212j4003j422R2063J8687
12698C8530K984n103n159j2045j7233N087j8129k6900K7409N4000r462j7618L8076
12685E4437n5949j4380J7977l1339P670L5467J1656k5938L1268J967o7489k8924
12673f3577k5030n979K3216Q604M1272m6947m1033K5702L1719J0345J8346J8138
12661e224l0433M7469K2086m9262k5071J9342l5754M8909K3300n9883k6312M5827
$$ y = [64357, 33487, 2388, 29192, 27618, 22478, 3414, 25364, 14353, -20854, 11476, 30179, 40113, 64214, -4375, -17037, -27480, -37530, -20047, 40000, 50766, 50593, 112064, 97750, 29479, -21227, 46770, 79475, 76278, 64832, 45794, 33134, 8032, -51770, -79066, -48269, 7366, 39833, 72625, 32102, -57126, -102665, -75515, -45583, -56795, -70798, -72220, 19843, 38530, 41514, 36411, 31252, 19207, 1974, 7061, -11068, -37968, -10559, 43441, 33979, 16361, 54437, -1512, -15892, 2085, -29254, -21584, 13883, 25539, -399, 30869, 32836, -34653, -63577, -88607, -94586, -71370, -62766, -21494, -68441, -109474, -83772, -52053, -41708, -23362, -5224, -35657, 11812, 33898, -15364, -40435, -21093, -56847, -7938, 15362, -44521, -70833, -25006]
12649b5006j0298p979M8552O5581j2241j6124p5885j8004M0003K7954L881r477
12637A0957L5725P538j5934m6778o5844j2087M6400J0449l8261J6913O6380l935
12625A1523p0009k4992J15L020K6960J1770k094p436L1558L349L05n248o064N393
12611b1850k4972j9096L3908J1519J0836K9775J846L3037M4059m8275l3063j3536
12599D188P723l6750k4846K6439M6868J2441o6645l1338m6962K4941j3022k7045
12587a24008O8618L5568j7719K3007J7874j06009l1186P9408N1940L2928r130
12576B1291K6035j8960q8784n4371j7777L4453o885R11L4385M0474M0013j5993
12564e208m826J3295n742j6904k2448l9256J9679k3621K6223q649J9708K5673
$$ y = [-25006, -35304, -43283, 5269, 70850, 58609, 42485, -33400, -51404, -11401, 16553, 20434, 10957, 46682, 54220, 38286, -8492, -74336, -86423, -40023, -29574, -67835, -50922, 15458, 11523, -58486, -83478, -83363, -80343, -53383, -41613, -43707, -51143, -19585, -16236, -15931, -21179, -27243, -21850, -46822, -65918, -32010, -20491, -9655, 20120, 21966, 55003, 99062, 50787, 17724, 4188, 11911, -24839, -49685, -23246, 23622, 36063, -30582, -61920, -108882, -83941, -96963, -124008, -55390, -19822, -37541, -14534, 3340, -102669, -133855, -54447, -2507, 30421, 21291, 47326, 28366, -60418, -114789, -132566, -98113, -104998, -104087, -69702, -29228, 10785, -5208, -10034, 3261, -2481, -19385, -41833, -81089, -61410, -85031, -58808, -67457, -47749, -22076]
12552b2076P449L361k040K4150n498K5554K2985n167m7117l5231L00l3640j7484
12539h4454N3241O4048j4400o7309k4114N941j5060N4877O0156Q43m4076J6791
12527F484p926l1310K2536k2083p177j88K7057J0521R1198N215n7881m6099m642
12514a4295m243l5702r049j0415J703J3489k14k1772k7261J9218K8167J6707n802
12501d9469N5025j4988j0007M3051J3797n43O5556R647q5388n0350K6676M3660
12489D6667L3164l8547o5768j4710j4146L3694K1560l0374p0832J2076N1492R907
12477b5817L967j4945L1853L3778n5721l4990J1431M5195Q6707J7728k9485q9299
12465a9598j09131K2459J00103Q0226J5632n775q415j270M7765j1967k0302J360
$$ y = [-22076, -14627, -11266, -13306, 10844, 5346, 30900, 53885, 48718, 1601, -33630, -33330, -66970, -84454, -31213, 32835, 18435, -48874, -72988, -67047, -82107, -27230, 32926, 33769, -10307, 6484, -1442, -32752, -10216, -32299, -39476, -39664, -12607, -2086, 89112, 94327, 36446, -9653, -14295, -18538, -54240, -63289, -73704, -72001, -58512, -58726, -80498, -107759, -88541, -60374, -43667, -49469, 5556, -9432, -19439, 23612, 37409, 36866, 102422, 112069, 26681, -23669, 3007, 46667, 79831, 41284, -24484, -39194, -53340, -19646, 1914, -28460, -99292, -87216, -35724, -25817, -21850, -36795, -4942, 28836, -26885, -61875, -50444, -5249, 81458, 99186, 69701, -19598, -128729, -106270, -6167, 74059, 89691, 83916, 75501, 74231, 121996, 110029, 89727, 91087]
12453I1087k1900l6192k3240k8092j7108N5643K2570k0569q689l3721J2184O3511
12441E5484k8556j4671O27n1688k5906M2187K9584k1575M034M523j1002k0720
12429c7679Q7K0578j4065n552m7372K591Q4364j8460J687j7198o5411J6665P2365
12416g400L7085N8042P1735l8988k9623l819n552n7113n5141M2537M8358O3250
12404A23371K3233m3020j6052o6183p7310L2533K6477P672n4131n809o988J1763
12392d4444Q685P48j3824J4705M1828J1401J91P090J4319l3554n3202j3485K3465
12379c6077M4231o8450k3405J4125L2252L3531L1382J5969J3273r027l9774O999
12367A5029j2347J0941q916j8520j3674M2980M3474l1953j3836l2574m402L3741
$$ y = [91087, 69187, 32995, 9755, -18337, -35445, 20198, 42768, 22199, 13510, -20211, -8027, 55484, 26928, 12257, 12884, -38804, -64710, -22523, 7061, -14514, -10480, -5957, -16959, -37679, -37592, -17014, -31079, -36631, -84003, -81412, 2952, -15508, -13821, -31019, -96430, -79765, -7400, 29685, 87727, 159462, 120474, 90851, 87032, 81480, 24367, -30774, 11763, 60121, 123371, 146604, 103584, 87532, 21349, -55961, -23428, 3049, 10721, -43410, -49219, -56207, -44444, -35759, -35011, -48835, -34130, 7698, 19099, 19290, 26380, 40699, 7145, -46057, -59542, -36077, 8154, -60296, -83701, -69576, -37324, -3793, 27589, 43558, 56831, 47804, 8030, 15029, 2682, 13623, 4707, -13813, -27487, 15493, 58967, 27014, 13178, -19396, -23798, 9943]
12355I943K9637J3150r236k6734n7451l8437J8958j0305K8220j7388K1844o248
12343d4047l817K8314J4264l5470P3502M22l3591m698n966q725l932j4196K0212
12330a7728j9575K144K6091L5646O3301J7288n5444j7961k1375l4475K0115q3308
12318h5281j9456L6559J7454K1368o694l1581J0536J2177L3908K7810J9995o3821
12306b7026k4356L4848l1814j4743N5254L1806k6461p7209k5751l188J4824o499
12294a00315L330R006j734O5368J2075m9397j4849N0279J7110N1418J1098K5223
12282G8612k0356n5507m4871r054K4174j4687K015K434M8733K2743j3382N3208
12270G4062J4092n1051n2654k0159j2051M7807J3667J0451j9486m5139j3100m0549
$$ y = [9943, 39580, 52730, 43494, 16760, -40691, -79128, -60170, -70475, -42255, -59643, -37799, -44047, -47864, -19550, -5286, -40756, 32746, 33168, -423, -5121, -11087, -19812, -23744, -37940, -17728, -37303, -35159, -9068, 26578, 89879, 107167, 51723, 33762, 12387, -22088, -1973, -85281, -104737, -68178, -50724, -29356, -36050, -67631, -57095, -44918, -11010, 16800, 36795, -27026, -51382, -16534, -48348, -63091, -7837, 23969, -2492, -79701, -105452, -108640, -93816, -100315, -96985, -87979, -89713, -24345, -12270, -61667, -76516, -26237, -9127, 42291, 53389, 78612, 58256, 2749, -42122, -51176, -27002, -41689, -39674, -37240, 11493, 34236, 20854, 74062, 88154, 37103, -15551, -35710, -47761, 46, 13713, 24164, 4678, -40461, -53561, -94110]
12258i4110n5402j494N8654L7104J2520m755n5901m584K4704K4692L781k2439
12246g7230J4151j5010j0625M61j9218O141J3955m5861K2324M6297J5486k5498
12234g4627l3877M7880M1127j519m4666L6981L806N988J2846J3200n7583m4777
12222i5221K6926N5229J8659k1548J6138j9277J2119K6479N003n2624K4973L2630
12210B9486K2675p5439l6872M4802j1445j2621k585m4874O09L2750R998J9519
12198b3997j1836m0814k3416L6263K281J858L6739m5785K4054L5671j8640j2070
12186c9692j1191R672o3469j0894Q2532L0690M8051M4744l2802l0507m9676m2264
12174f4806K3039J4634L4399m6521k7408M1942J2165r601p393o3667m7691P3531
$$ y = [-94110, -149512, -151006, -92352, -55248, -42728, -47483, -103384, -107968, -83264, -58572, -54791, -77230, -63079, -78089, -88714, -88253, -107471, -101330, -87375, -133236, -110912, -64615, -49129, -74627, -108504, -60624, -19497, -21016, -65682, -28701, -24895, -18907, -6061, 7139, -50444, -95221, -68295, -13066, 5593, -15955, 183, -19094, -6975, 19504, 24507, -28117, -3144, 29486, 52161, -23278, -60150, -15348, -26793, -39414, -41999, -86873, -86264, -53514, -43516, -23997, -35833, -76647, -100063, -63800, -61519, -59661, -22922, -68707, -44653, -8982, -27622, -39692, -50883, -41211, -104680, -115574, -33042, -2352, 45699, 90443, 57641, 27134, -22542, -64806, -41767, -27133, 7266, -39255, -66663, -24721, -12556, -22157, -29550, -93217, -140908, -67377]
12162f7377M2143K5309N4508J9621m7826j1524R902j5140j0405o6131J3380m9063
12150a02603j5015J00430r629n4239Q086N7624k7662J0041M8551L7473q7969k2472
12138e7384P7668J3556n2321l0521K7706J4028j1157M2699j7927m3047O441K5482
12126d777M2336N7350o1612k4137O9272p512n4536j8795l2620P6251N947n0244
12114c077l3895m10J6555M532J2333l8689l299n244p226N8607N919l2068K0179
12101e783K6547m0115k7346j1301J6650m666k0364j9654J529m3921k0115J4782
12089a33757P2724J04627l1297q1196l618L213N5565n52P789o118k7792L2472
12077g940J9388n3432J9886L5073M9558R472l6576J8859P6365k0587o1770O360
$$ y = [-67377, -25234, 75, 54583, 74204, 26378, 14854, 24756, 9616, -789, -66920, -53540, -102603, -117618, -17188, -26817, -81056, -72970, -15346, -43008, -32967, 15584, 53057, -34912, -57384, 20284, 33840, -18481, -49002, -21296, -7268, -18425, 24274, 6347, -36700, -30259, -4777, 37559, 94909, 33297, 9160, 78432, 70920, 16384, -2411, -35031, 41220, 47167, -3077, -36972, -37382, -20827, -16295, -3962, -42651, -45950, -51194, -58420, 187, 6106, -25962, -5783, 20764, -19351, -46697, -57998, -41348, -46014, -66378, -86032, -84503, -128424, -148539, -133757, -61033, 43594, 12297, -68899, -72517, -69304, -13739, -14291, -6502, -12620, -40412, -7940, 11448, -41984, -22098, 12975, 62533, 72005, 35429, 54288, 130653, 110066, 48296, 54656]
12065E4656l3816K7475m4026L6652J1021q375J315M3351L683J6013l9726k9113
12053C9110l8134n4735j3993k0361M8889L1052j0934J9759n7854J7996N2177M570
12041A7542j2128o1748k984Q3565m321m6140m7603k4392L371O978O4728O491M7871
12028C1230j9449l3887K6323l7644o2518k129R0532N9975j445m8559j0205j2527
12016b0303l3908l292M6364l280J6743K3119J4584k614K3679K5227J3096o4307
12004C5108q6754k5513p751o43j6111M9724P189m2207j4358M1818L6445N3818
11992C0765N575k5262m2418p5168j6657K3099N9625O216k1462K296j443J0920
11980d3914k0455R980l2870K8325N2658M3673o456k9434L1970k4096k8026o300
$$ y = [54656, 20840, 48315, 4289, 40941, 51962, 43587, 44902, 88253, 91936, 107949, 68223, 39110, 976, -53759, -67752, -88113, -39224, -8172, -19106, 653, -57201, -39205, 12972, 17542, 5414, -56334, -59318, 24247, 19926, -26214, -73817, -98209, -94838, -87860, -23132, -16641, 31230, 11781, -22106, 4217, -33427, -95945, -98074, -7542, 52433, 50988, 2429, -7776, -20303, -54211, -57503, -11139, -14419, 2324, 25443, 40027, 37413, 61092, 86319, 99415, 35108, -51646, -77159, -84910, -85553, -101664, -51940, -44751, -86958, -101316, -59498, -23053, 30765, 36340, 11078, -31340, -106508, -123165, -100066, -40441, -34225, -55687, -53391, -54834, -43914, -64369, -54389, -87259, -58934, -6276, 37397, 30941, 1507, 33477, 9381, -18645, -24945]
11968b4945N578j125j297j887M9643K0024o7820j2428j0688j2404M0849J8682
11956B182Q856J3751j8400L8134j3327n4793k0161J7865P3745M2056j06314k7989
11944d4395J2895K9805L5507J0500j4277J8322q74k8693p5555j0141M8699J4321
11932c886l699L088o56l1249k2397k1286k1693J5214L4250L6612L8539P3564k3372
11919G3029n1983j9553P431L649J1049K5374j2091R69L2095J4423K3099l2146
11907G5345l0603n11K7290M254L8885R39o3692o1640L039n0175J909N6705O1933
11894F3678l823n3549o872M367J9330J4932k6863l9276o447J811K9563r130k2420
11881c4699m1328K0538R712M036N8957P855l9597J604j1236k2994N778l389l4770
$$ y = [-24945, -19367, -20492, -21789, -23676, 25967, 45991, -21829, -34257, -44945, -57349, -16500, 2182, 11038, 24789, 6389, 44523, 31196, -23597, -43758, -25893, 47852, 89908, -16406, -44395, -31500, -1695, 33812, 44312, 30035, 48357, 47483, 18790, -56765, -66906, -18207, -3886, -7585, -4497, -5153, -36402, -58799, -80085, -101778, -86564, -52314, -15702, 22837, 96401, 73029, 21046, 1493, 8924, 12573, 23622, 48996, 36905, 37874, 69969, 84392, 107491, 75345, 44742, 44231, 71521, 75775, 114660, 115599, 51907, -9733, -6694, -56869, -54960, 1745, 63678, 59855, 6306, -566, 3801, 23131, 38063, 11200, -28076, -34523, -32712, -3149, -12279, -34699, -76027, -55489, -45777, -41741, 17216, 25071, -14526, -12922, -24158, -47152, -41374, -44763, -79533]
11868g9533m5110J4584Q7274k130l5108J7767m066R23k6288K1735L485N5757J0044
11855A9334m2403J4260L2729m209L664m2655r810J1086k6328K3253O0475K0510
11843E9906k159l0047k1852k288Q761p5020k6654M2048J6903o467M0969M19O23
11830E142n0277k2290L9274R346P824Q847q651J7881M6857J3306k5215n7189n8960
11817g4105J1106N312O524O454L427l4719K6142j9307j2765Q0372J7628o9181
11805e3112j4543L0722K1974N3560j7704o2192r072O0159k0376m5545n3577j5982
11793a25688j0928l3436N8914O5427k9616j266k965M6270N4730K6378l3411L246
11781A7655n3644j8606j0185k9546M0859J1884L7997L8784p6641n8946M0198O5191
$$ y = [-79533, -124643, -110059, -22785, -24915, -60023, -42256, -46322, -45399, -71687, -49952, -46467, 9290, 19334, -23069, -8809, 23920, 19711, 23375, -19280, -29090, -18004, -44332, -21079, 39396, 59906, 57747, 27700, 5848, 3560, 12321, -62699, -89353, -47305, -30402, -36869, 4100, 4519, 5142, -45135, -67425, -28151, -18805, -10981, -2134, -10785, 7096, 53953, 67259, 42044, -15145, -74105, -62999, -57687, -51163, -44709, -41282, -76001, -49859, -69166, -81931, -1559, 16069, -53112, -67655, -36933, -14959, 38601, 20897, -41295, -50367, 9792, -10584, -56129, -109706, -125688, -136616, -170052, -111138, -45711, -75327, -76593, -79558, -33288, 21442, 47820, 14409, 17655, -35989, -54595, -64780, -94326, -53467, -41583, -3586, 35198, -41443, -100389, -60191, 5000]
11769E000k9237n3513k2516m255n144K8566K9440O7068L791K438k4416J6022M0435
11756E3679M2823k3394l6563N833q202k2981k3322n1130M2530K9291l0048Q377
11744a3107l1450q983M2891j164q454k0286J6483P415L3043r933n2416k8137K6834
11731d7264K1036j6826k241L6423M6327j4167P4665K6985l1431m4145j8411l2389
11719a438m6089J2826O0919K211J167J544j9188j9746k5827p4820K3908N3116
11707c1417j123j4796L7839k18K5124n4960n7375J2127J9476N555j9481N1178
11695b8071O0773l7372m1669L8783K1054n645m8085k654J3622K8058j3189l3765
11683d8160J850M9908J2655J0465r502r351l3968J2003M0169J1491k1910m2088
$$ y = [5000, -24237, -77750, -100266, -104521, -109665, -81099, -51659, 15409, 19200, 21638, -2778, 13244, 53679, 96502, 73108, 36545, 42378, 34176, 11195, -12127, -63257, -20727, 8564, -21484, -13107, -44557, -53540, -10649, -11813, -20267, -40553, -24070, -16655, 16388, 6455, -45961, -74098, -47264, -26228, -43054, -45295, -8872, 37455, 23288, 97953, 124938, 93507, 49362, 30951, -1438, -47527, -34701, 26218, 28429, 29596, 31140, 11952, -7794, -33621, -108441, -84533, -31417, -32540, -47336, -9497, -9715, 15409, -39551, -96926, -84799, -65323, -59768, -79249, -28071, 32702, -4670, -46339, -7556, 13498, 7853, -40232, -42886, -29264, -1206, -14395, -48160, -46310, 3598, 16253, 26718, 17216, 7865, -26103, -14100, 26069, 37560, 15650, -26438]
11671b6438J123Q366j5142J1741M906l6471L3272k9643m4545j1155N1141M3407
11659i438o926l817r582O517o483o024J4658K2058L5061J4574J9530q0479k1324
11646c1675k5385K420r099R589N0759L256m489Q426J2295M1917k1787n1196l5412
11633e0381K6247l4102l75J9886n8751m3456O5109O3682l4416Q138l751N1957
11621I787j9027j08384j3402L8182P7396Q5235k9604j8551J1784r639J5892p681
11609C1988j3890j4469j1702P356j7962m894O148k6304p0635k2032j6333K7185
11597a25544O0094j8192r648P290O3801L3310k9891q672L4576j6474l932m2332
11585e5614q308K4614j6033Q599k676M3551J1295m193l0392P6033L3772n2662
$$ y = [-26438, -25315, -16949, -32091, -20350, -15444, -51915, -18643, -48286, -92831, -103986, -52845, -9438, -16364, -20181, -29763, -23246, -29729, -35753, -21095, 963, 36024, 50598, 70128, -10351, -31675, -57060, -54640, -63739, -54150, -3391, -135, -4624, 3802, 16097, 58014, 36227, -14969, -50381, -24134, -58236, -58611, -38725, -97476, -140932, -75823, -12141, -46557, -38419, -42170, 9787, -9240, -117624, -131026, -92844, -15448, 69787, 40183, 21632, 33416, 23777, 39669, 31988, 18098, 3629, -8073, -717, -18679, -23573, -17425, -43729, -114364, -136396, -152729, -125544, -65450, -83642, -93290, -86000, -22199, 11111, -18780, -27452, 7124, -9350, -13282, -55614, -63922, -39308, -55341, -46742, -49418, -5867, 5428, 1235, -29157, 46876, 80648, 27986]
11573B7986n0882k9999m301O0384K7563l4029k4242L0748K6438P308k3665j2216
11561A093n5601l6991M7956J02024j2688o2141j7188L2091J2359k2121l3137K5822
11549a8522j7941J1814P1384K9073K6193j4645k7957n3017j7900j6868J4151j570
11537a5805l5758r138J0183j7380m2702m4360K3582N3292M2498L2935L2990M3902
11525G4239j0106k6372q1999j1057j3110M1483K7296j3146n198J6162j2796K419
11513a2185l710l6804M556N136K2198J442L5720o5874l7007R2155j4137J1390
11501B880q5011J5470J5021j6211K2357J09707k46o213J6993j3025j9356q604
11489C3762K2736l759M977L1754L9469L6319n8879m0525o201L7131K7261R266
$$ y = [27986, -22896, -52895, -57196, 3188, 30751, -3278, -27520, 3228, 29666, 36974, 13309, 1093, -54508, -91499, -43543, 58481, 45793, -16348, -33536, -1445, 10914, -11207, -44344, -18522, -36463, -24649, 46735, 75808, 102001, 87356, 59399, 6382, -11518, -28386, -14235, -15805, -51563, -60701, -50518, -67898, -110600, -154960, -131378, -78086, -35588, -2653, 30337, 74239, 64133, 37761, -44238, -55295, -68405, -26922, 374, -12772, -17970, -1808, -14604, -12185, -15895, -52699, -48143, -43007, -20809, -19367, 16353, -49521, -86528, 5627, -8510, 2880, -82131, -66661, -51640, -67851, -45494, 64213, 63967, 57754, 74747, 61722, 42366, 33762, 56498, 52739, 57716, 89470, 128939, 165258, 106379, 65854, 59653, 96784, 124045, 133311]
11477A33311l8058N625m4966M080j290P948l5500k0823k9905j2546P434J1922
11465a2768o1848m0212J9425N2083P3570K690j1467L6569p1289m0626P020N5860
11453I007L236j9270p8078K5913R4806J5999K5576L9472K1761R017L3793l7925
11441A43307n5868P804M5108K1545Q352k5831J5618O1174k1690n4551K2895K8128
11429A95991k2617l3922m1225L9228M0626j9465J1866N5705l050j2994J7759o8768
11417A59134r4164m4484j4152O3422Q2526J4072m2775l728k1845J2733m7796l1999
11405C0944K617j1267J7195k5652j4047L0319K7611m1458L471m286K5920L1469
11393G2836m2128l9896L9938l3480k9622K7714J8632l9069k1058K3964K5013p220
$$ y = [133311, 95253, 100878, 55912, 59992, 58702, 66650, 31150, 10327, -19578, -32124, -24690, -12768, -74616, -114828, -95403, -43320, 30250, 32940, 21473, 58042, -13247, -53873, -46853, 9007, 12243, -7027, -85105, -59192, 35614, 51613, 77189, 116661, 138422, 147439, 181232, 143307, 87439, 95243, 140351, 161896, 170248, 144417, 160035, 221209, 199519, 144968, 167863, 195991, 173374, 139452, 98227, 137455, 178081, 158616, 170482, 226187, 223137, 210143, 227902, 159134, 64970, 20486, 6334, 69756, 152282, 166354, 123579, 119851, 98006, 110739, 62943, 30944, 33561, 22294, 39489, 13837, -210, 30109, 57720, 16262, 19733, 15447, 41367, 72836, 30708, -9188, 30750, -2730, -32352, -4638, 13994, -25075, -46133, -22169, 2844, -4376]
11381d376L2594L5403l1877K5574k595k7996o6739l1290j581L998k687r620o852
11368h8044j9928j9392L9984Q2627J1751O036k3854k0169P029M5902J0025p214
11356B4753n270O493k4850K5225J4132l9519K7552L2713k4418k9144l6107k507
11344c0947R41k051J0037p991K4027j7852N3612J8683l4292J769l006J3965m978
11331B1917k6679k8296L294K9409J5584n1153k137j7876m4187N3134l493l8535
11319h9018o2888K6976K4041L2438M5192P032l8081j2349M7742k2208J6521M9642
11307B5040r747J00l9549m5653j0629L1133Q287J7015O836R595J6380l3580l0129
11294e4901j2048M5538Q3038K9089P365k3360j7212l4259m3721M170l9469l0175
$$ y = [-4376, 28218, 63621, 31744, 57318, 54723, 26727, -40012, -71302, -72883, -68885, -71572, -81192, -88044, -107972, -127364, -87380, -4753, 6998, 13034, -10820, -30989, -23960, 21942, 31967, 24753, 19483, 25976, 1126, 26351, 40483, 964, 28516, 61229, 36811, 7667, -28440, -30947, -30006, -32057, -22020, -30011, -5984, -23836, 29776, 48459, 14167, 15936, 12930, 26895, 21917, -4762, -33058, -29764, -355, 15229, -35924, -38061, -55937, -100124, -46990, -50483, -89018, -151906, -124930, -100889, -68451, -23259, -16227, -54308, -66657, -18915, -41123, -24602, 25040, 15293, 15393, -24156, -69809, -80438, -49305, -41018, -24003, -17167, -7572, 8808, -24772, -54901, -66949, -21411, 61627, 90716, 98081, 74721, 57509, 23250, -20471, -16301, -55770, -85945]
11282h5945k3026K6204Q2504M3381m9537j4525N9501m737k8689O447M0724n7347
11270e045o1471J7689j6605j9536J901J0208L0480q922j8022L3223M4704M0768
11258D9372l3297j5892O115K1153L642m8842k3995m0223o508l2466J4215L8855
11246f7871L1089P4478R873m0720J3340M2639o608r6018n4143M2843K3263k93
11234b8128o3336m1072P3835L2989m5865l3036J4513k2322J3237L9641l6194j0054
11222a05792L7475N0665L8890m9209J4120J5646n9621n413P0504O0044k4961J3560
11210E5908J5477q3357m2734M701M9947K0007k5979n943j3020l780n238R295k644
11197b7360o219K0254M1066K4006N125j6321M753K6609K5075m4223q263P276L228
$$ y = [-85945, -108971, -82767, -263, 43118, -6419, -20944, 38557, 33820, 5131, 11578, 52302, -5045, -66516, -48827, -65432, -84968, -83067, -72859, -42379, -51301, -69323, -36100, 8604, 49372, 16075, 183, 6298, 27451, 31093, -17749, -41744, -81967, -88475, -120941, -106726, -67871, -36782, 37696, 47569, 6849, 20189, 62828, 56220, -39798, -93941, -51098, -27835, -28128, -91464, -132536, -58701, -25712, -71577, -104613, -90100, -112422, -99185, -59544, -95738, -105792, -68317, -17652, 21238, -27971, -13851, 1795, -57826, -63239, 7265, 67309, 42348, 55908, 71385, -11972, -54706, -50005, -58, 19949, -6030, -11973, -24993, -28773, -34011, -24716, -27360, -33579, -13325, 27741, 51747, 56872, 40551, 45304, 71913, 96988, 52765, 44502, 51778, 55006]
11184E5006l2545j7279k619l3310J0230O4470J8997j0338j9746K504M4171K8809
11172A08350J5265l3026o0305O187p8736n7778O7692P3014K8337K427J8735j5768
11160G4394l9980k6848k9465J8989r871j682N5831J1394m2831p3895j0235L6439
11148c7760N5456k6112q371J247p7017m490J1025N7256K9863L0202k0173n3505
11136d2379J6717M7462K7085n565m9337M589L7486K5590j6491l9134l3123K8404
11124A304Q580J7209r439o139n9916l4013O2969L2290L7068J1230n240k418m3764
11111I721o3969K0152k041L557O723K4686J9491l0600l1935K0453J0063M1568
11099B7869R996k2060j257n774j5441N5380l7126o5445J6158K2089m378O2120
$$ y = [55006, 22461, 5182, 2563, -30747, -20517, 43953, 62950, 52612, 32866, 35370, 79541, 108350, 123615, 90589, 30284, 36471, -42265, -100043, -32351, 40663, 69000, 71427, 90162, 74394, 34414, 7566, -21899, -2910, -12781, -14463, 41368, 52762, 9931, -63964, -74199, -37760, 17696, -8416, -16787, -15540, -92557, -97047, -86022, -28766, 1097, 31299, 11126, -42379, -25662, 21800, 48885, 43320, -6017, -1428, 36058, 61648, 45157, 6023, -27100, 1304, 9884, 27093, 17654, 11515, -48401, -82414, -19445, 12845, 49913, 61143, 55903, 53485, 9721, -54248, -34096, -36137, -32580, -25857, -1171, 18320, -12280, -44215, -23762, -13699, 27869, 37865, 15805, 14548, 8774, -6667, 48713, 11587, -53858, -37700, -15611, -19989, 42131]
11087D2131l3975k063o3099n7721K6693j6341o076L9171L3067L4667K2063M3990
11075F2507L712k0135j9189j0556j0622M012k1946k5188Q399L7942k0250J3445
11063B131R0094L3476l5607q2297J9350J0459k166k1753N297j0026k2684l2040
11051d5766n3506J1096K8484Q135K3523J2902k8638k2697K6885L193L7158P04
11039A473k126j4694j7478l665j5920m799P5798j2931k960L8384r850l9347n084
11026a3199J4971l3316m7679N23K7914N9874j5647j1116L8450M8651l8328n6971
11014b5873K6835J6695j9644k4815m13Q421O399J8610N0523n1547p7670L2091
11002d0388j331J7308o065n0801j72L6540J0131k3301k3384J0866l2827l7385
$$ y = [42131, 8156, 6093, -57006, -114727, -88034, -104375, -110451, -71280, -38213, -3546, 18517, 62507, 66219, 46084, 26895, 16339, 5717, 9729, -12217, -37405, -29006, 8936, -11314, 2131, 92225, 125701, 90094, 7797, 27147, 37606, 35440, 13687, 18984, 8958, -13726, -45766, -99272, -88176, -59692, -51557, -28034, -15132, -43770, -66467, -39582, -36389, 769, 1473, -653, -15347, -32825, -36490, -52410, -57209, 18589, 5658, 2698, 41082, 31232, -8115, -13199, 1772, -31544, -79223, -78700, -50786, 9088, -6559, -17675, 20775, 69426, 31098, -25873, 962, 17657, -1987, -26802, -27215, -18794, -12395, 6215, 56738, 5191, -72479, -40388, -41719, -24411, -30476, -81277, -81449, -44909, -34778, -58079, -81463, -70597, -103424, -140809]
10990a40809Q583P2363N1629M0896K028o0545l8417M9806K0282r332j3714l4498
10978e1728n5660j246J4447j4515J6471j6309l1390k4835L0425M5101k6843m4373
10966a60455l19K8122O4723K6605K1132O037j5723r32N923R916K8974p2609l5497
10953i4103M2046J2394k952n1051J7561N9144K8616p588K9435j2186n546J0982
10941B6752J1515j681L2755L5574o329K916j4900n3845m9720J0774N6470j5369
10929C4912o699J3515K540P041k421k5096p4539K6134o03J1518Q7593O4393K0404
10916A58692o0079n3359r434M2855j6565j8499n4935K6289R832k9653l2579j0396
10904d7831J2807J338K3890N2026k0628m2082m5995m4223r969N5717R8180l4958
$$ y = [-140809, -132226, -59863, -8234, 32662, 34690, -25855, -64272, -14466, 5816, -3516, -17230, -51728, -107388, -108634, -94187, -108702, -92231, -108540, -139930, -164765, -134340, -89239, -116082, -160455, -160774, -132652, -67929, -41324, -20192, -14155, -29878, -30810, -24887, -14971, 14003, -58606, -94103, -52057, -39663, -42615, -93666, -76105, -16961, 11655, 4067, 33502, 21316, 15770, 26752, 38267, 36586, 69341, 104915, 98586, 101502, 86602, 32757, -16963, -6189, 50281, 34912, 28213, 41728, 44268, 51309, 48888, 23792, -50747, -24613, -25216, -13698, 73895, 138288, 158692, 98613, 45254, 35820, 78675, 62110, 43611, -11324, 14965, 24797, -4856, -37435, -47831, -35024, -33686, -9796, 42230, 21602, -20480, -66475, -110698, -120667, -64950, 33230, -1728]
10892a728m3732K36j2791o455J2003M2756j1141O251j6524n627l4401L8256N7084
10879B4187J2096M2365n3844p7182m2496J4364N5964J2209N4943r796R983O159
10867D8952M0998j4043l2302J3372k3576J8921j6245P599K0575j184n8093N310
10855A0284k1024J2348J49j6812j4212n0234K7723M0337L2391M8248l2608l6414
10843A76k1557j7463j658K7096O9550Q312m3091R955M688k6370m6060M9985j2507
10830A056p2824l6755J5094J3808L24P1955M9545k0415O376J1315n0632K2441
10818A1288J9666l7017M8509K538k7610j9590o06J7306J328K8562O0674m1854
10806F3194q3312j5423R016m894R386K5483J038p4558O136N6893K5462k5395O843
$$ y = [-1728, -45460, -45224, -58015, -64470, -52467, -9711, -20852, -14601, -31125, -36752, -71153, -32897, 24187, 36283, 78648, 24804, -52378, -94874, -80510, -24546, -12337, 42606, 32810, 42793, 48952, 89950, 75907, 43605, 56977, 33401, 52322, 36077, 43676, 64251, 63067, 4974, 10284, -10740, 1608, 1757, -15055, -29267, -79501, -51778, -11441, 20950, 69198, 36590, 176, -21381, -38844, -40502, -13406, 56144, 64456, 21365, 31320, 36008, 9638, -36422, 13563, 1056, -71768, -108523, -93429, -79621, -79297, -7342, 42203, 21788, 28164, 39479, -11153, 11288, 30954, -6063, 42446, 44984, 17374, -2216, -2822, 14484, 15812, 44374, 105048, 63194, -20118, -35541, -26525, -31419, -22033, 3450, 4488, -70070, -63934, -7041, 18421, -6974, -131]
10793a31J3689l3112k8474K3086L5294K4071l9034m2289k7251N5071N9869j710
10781C9079j5025q14n4143o3974N7939M9797k164o3983J5000j8878m3531P1228
10769b9469K3320l9926L710M8908r0L1173Q405M20K903p1853o3118J9899Q558
10756e7160l8513J569O8220K5018l90J919K944J6884j0756L6620r459n2361l5853
10743e1318M3538M5610j2855l5941m202j0229q92k8491K1695o106M610K2052J3741
10730A212J6159m1440m1627R796K690l0064k8399r232K5878O7802M3444l2144
10718a5925N077K2380j2879J7444Q3881k9658n4074j2729L4461K5873j2701p703
10706D3447j1495j8138j2850N154K4815j0318n5866o4327K6587P0556L0922j0921
$$ y = [-131, 13558, -19554, -48028, -24942, 10352, 34423, -4611, -46900, -74151, -19080, 40789, 39079, 24054, 23240, -30903, -94877, -36938, 12859, 10695, -53288, -38288, -57166, -100697, -29469, -6149, -46075, -42365, 6543, 6453, 37626, 46031, 46451, 49354, -22499, -85617, -65718, -57160, -95673, -94104, -25884, -866, -1256, 663, 3607, 20491, 9735, 46355, 36896, -15465, -51318, -7780, 37830, 24975, -10966, -15168, -25397, -26289, -54780, -33085, -39191, -34581, -12529, 1212, 17371, -24069, -65696, -55900, -53210, -83274, -111673, -120905, -95027, -27225, 16219, -15925, -10848, 11532, -1347, 16097, 99978, 70320, 16246, 3517, 37978, 63851, 51150, 43447, 31952, 13814, 964, 6118, 30933, 20615, -35251, -99578, -72991, -2435, 28487, 17566]
10694A7566l896k7712M3666P595M540n1948l6415J06500O2019l3135k9926l332
10682E5522l2136o881J4058Q03m8244K9486N5573k2911m9956n1521M0043L936
10670a2228L091j9609j2518K1365J8375K3580K6060J6028l7336k9532J2389Q48
10658A0513o8512m7849l120P168q688L2495N2477j1976L2545L301p883j0378J5366
10645d541q520j4963n7619j8900N6669M1460k0076n4634O061J4699J605k485J8050
10632d3194O9795N5933l8779j0306m0804n849l327O000J4548r012k5501J0964
10620a9532k0246l059J9920P0673n0771m4074J7103K3979K7221K8989P978l3305
10608B4876o4735m828J5711l336j4124M7536J913j2385J5308J00009Q057k4810
$$ y = [17566, 13670, -14042, 29624, 37219, 41759, -10189, -46604, 59896, 121915, 88780, 58854, 55522, 23386, 16505, 30563, 31366, -16878, 12608, 68181, 45270, -4686, -56207, -16164, -12228, -9137, -28746, -41264, -19899, -1524, 22056, 48116, 64144, 26808, -2724, 9665, 10513, -57999, -105848, -108968, -101800, -110488, -77993, -25516, -37492, -4947, -1646, -9529, -19907, -4541, -13061, -28024, -85643, -104543, -47874, -6414, -26490, -81124, -75063, -60364, -58759, -61244, -43194, 26601, 82534, 43755, 33449, -7355, -13204, -16531, -10531, 4017, -4995, -30496, -19532, -39778, -42837, -22917, 47756, -3015, -47089, -29986, -6007, 21214, 50203, 58181, 24876, -39859, -44687, -28976, -32312, -46436, 1100, 3013, -9372, 5936, 105945, 114002, 89192]
10596H9192m9755k2921k9181j1013J6006N0809j5643k1992J1123J4530j6490j15053
10584a00388r019Q4984N9779J7942J3368K9623q196q56K3581n5468o0091l0619
10572c5360J0534n925J3525J4851M9886l6055m8720K0789K1968K1810K8867l2911
10560B3259m939m6517m8636p465j1875J03272J8179k7572J8308j601j5609J3567
10548A2371m664l7451K7226M210k5072j8035o99K0878j9684J1594L4375J1717
10536A6766J6450L3971q357n5722n02J2012M5414J0740m5881Q644N7609K7981
10524A19125o7768j4240k038J7647J7294Q97k9505K0839n2912q0404q190K8771
10512e0484m395k2436J1355K3138J0044N8402K2186J4280j5037K8061M7168p5309
$$ y = [89192, 39437, 16516, -12665, -23678, -7672, 43137, 27494, 5502, 16625, 31155, 14665, -100388, -109407, -24423, 35356, 53298, 66666, 96289, 88093, 87237, 110818, 55350, -4741, -35360, -24826, -30751, -17226, -2375, 47511, 11456, -37264, -16475, 5493, 27303, 56170, 23259, 18320, -28197, -76833, -84298, -96173, 7099, 25278, -2294, 16014, 14413, -1196, 12371, 7707, -29744, -2518, 1692, -23380, -41415, -42114, -21236, -40920, -29326, 5049, 16766, 33216, 67187, 58830, 3108, 2606, 14618, 60032, 70772, 24891, 33535, 91144, 119125, 51357, 37117, 35079, 52726, 70020, 70917, 41412, 62251, 9339, -71065, -79255, -50484, -54879, -77315, -65960, -42822, -32778, 25624, 47810, 62090, 47053, 75114, 122282, 46973]
10500D6973p3762J9231L4088J4359l0430J6510J3216K9111K7372n0167n4799j3092
10488b1390j2657L8197K510K3850J1635K1837o565L4326R735m9096K0985K3328
10476I6695L783O7953O6779M5591q72O8733M6889L2871O685K1822J13528J16791
10464F87248K0066p108k9282p1374o4470l2170p5385p2467p6368l8281l3019l9495
10452A67895J5268Q5996J1966r0719j03074l9083M8797j9330J109K9890j4711
10441I4004J0987j7568p9595M308R8954K8128l6481m182q673K3810j6715j3984
10429H2993J9369j01109l6982l4821L0711M5699j9183K7100O77K518l4891K2943
10417E024L5075j5266k3853J8425M0163j1268j4439J6678j0040l7843J8184J3903
$$ y = [46973, -26789, -7558, 26530, 40889, 10459, 26969, 40185, 69296, 96668, 46501, -8298, -21390, -34047, 4150, 6660, 30510, 42145, 63982, 57417, 91743, 101478, 52382, 73367, 96695, 100478, 168431, 235210, 280801, 279929, 348662, 395551, 428422, 435107, 456929, 570457, 687248, 707314, 700206, 670924, 599550, 535080, 502910, 427525, 355058, 278690, 240409, 207390, 167895, 183163, 269159, 281125, 190406, 87332, 48249, 97046, 77716, 78825, 108715, 94004, 104991, 87423, 7828, 12136, 111090, 139218, 102737, 98555, 89882, 113692, 96977, 82993, 102362, 1253, -35729, -70550, -39839, 5860, -13323, 13777, 14454, 16972, -17919, 5024, 40099, 24833, 980, 19405, 59568, 48300, 33861, 50539, 40499, 2656, 20840, 34743]
10405C4743l2550M5600R7903N127j4157R389m0132j22048m899L255n1533r002
10393g8304L7076k1551R214K506k9243L5858J5447M7168K7766O454n5824J3875
10381A0442K2875q325J3346K812J014L7597k2569p4809K7958O633K6224K8859
10369G2057L223k0704J2560Q298j7869m3563J9142l2919o2942J5498N0883M1039
10357D4703o202k6843m085M282j87K7092J0542N3102j6928o1150n2722j1685m395
10344d4476K7767L8012N580l0972Q368J0424M9881J12r670k8617r112K9633L719
10331E0649K149N3684L208L1103l0072m7758o06P5489J7373q3038l917J4582j0466
10318G2380j6135N4440K7879l7150r5577m0149j6215K6604K1092J0187n0524k5992
$$ y = [34743, 2193, 47793, 145696, 150823, 136666, 146055, 105923, -16125, -21024, -17769, -69302, -78304, -41228, -62779, -53565, -51059, -80302, -44444, -28997, 18171, 45937, 52391, -3433, 10442, 33317, 24992, 38338, 41150, 42164, 79761, 57192, -17617, 10341, 16974, 43198, 72057, 75280, 54576, 67136, 75434, 57565, 14002, 33144, 225, -62717, -47219, 3664, 44703, 38501, 11658, 7573, 11855, 11668, 38760, 49302, 102404, 85476, 24326, -28396, -40081, -44476, -16709, 21303, 26883, -4089, 4279, 14703, 64584, 64696, 55026, 26409, 17297, 46930, 50649, 52798, 106482, 109690, 140793, 110721, 62963, 62357, 137846, 155219, 72181, 68264, 82846, 72380, 56245, 110685, 138564, 101414, 5837, -34312, -50527, -23923, -2831, 7356, -43168, -69160]
10306f9160Q157P0180L5603K5761n2669k5961M5688p585K095L9359l8051K6095
10294E9512J047r5763n1762K7928o2691k9437M912N4462N6884K2656K5983j9171
10282e440J9585L5415J4424K5892k1916j585j1484j2166J4451m0592p1378l8442
10270i3236M7908Q1600K1280J2448p6227k9019L2792O4689M4193n2664l0388J8315
10258D1691J3112J86j3442M661Q541n772R763K1614l138j5918M4147R2771O1272
10245B59488L5100o3126K1271L8975n6844k8058j1162m0283j3067k433K1521O103
10233A67485M6702m7002p7947n2903L920R333k1849o5584J742L6272L1858j6170
10221A5857N405Kl1283n0927O6302L1464M917K9402j444k4833L895J3017j2576
$$ y = [-69160, -61003, 9177, 44780, 70541, 17872, -8089, 37599, 30014, 32109, 71468, 33417, 59512, 60559, -35204, -86966, -59038, -121729, -151166, -146254, -91792, -34908, -12252, 13731, -5440, 14145, 49560, 63984, 89876, 67960, 66375, 54891, 42725, 57176, 16584, -54794, -93236, -45328, 36272, 57552, 70000, -6227, -35246, -2454, 62235, 106428, 53764, 23376, 41691, 54803, 54989, 41547, 46208, 54749, 48977, 58740, 80354, 77216, 61298, 105445, 198216, 259488, 294588, 231462, 252733, 291708, 234864, 206806, 195644, 155361, 142294, 139861, 161382, 167485, 214187, 167185, 89238, 36335, 40255, 49588, 27739, -37845, -36103, 169, 32027, 15857, 21262, 21264, -10019, -60946, 5356, 36820, 41737, 71139, 69695, 44862, 48757, 61774, 49198]
10208D9198m9112J3426L1455K9558k2214o1363j7505M4360J2042K0282L4889Q866
10196I3882K1588l580m9553j7690K7953J2677l1955k735K1805j2346k8190M6675
10184G8531K9794j1539k2165k7214O452L6851J1809o6980M1007N4684O9475L9213
10172B39918k7501j5716K055K2592n1348m5712k2313l6935q552R06l0707m148
10160B2539Q432K120L3318J6686K0792M978n5300n4597R389j025L5659l625j0546
10147B8820l0720J9388M2401J2097N742j1471l3273M8419p048L7230L6793n0717
10135I7661q485J3775m8595K9061P2724j812L1803m294k9901j124j5879p4408
10123F0526j3857K2063K4510j0030k3323k9567l336K0133K8964o3919k8776P8225
$$ y = [49198, 86, 13512, 44967, 74525, 52311, -9052, -26557, 17803, 29845, 50127, 85016, 93882, 115470, 111890, 62337, 44647, 72600, 85277, 53322, 50587, 72392, 60046, 31856, 78531, 108325, 96786, 74621, 47407, 53859, 90710, 102519, 35539, 76546, 131230, 200705, 239918, 212417, 196701, 198756, 221348, 170000, 124288, 101975, 65040, 56488, 57394, 26687, 22539, 30971, 33091, 66409, 83095, 103887, 108865, 53565, -1032, 8357, 7332, 42991, 39366, 28820, -1900, 17488, 59889, 71986, 77728, 66257, 32984, 81403, 74355, 111585, 148378, 97661, 89176, 102951, 54356, 83417, 156141, 154329, 186132, 181838, 151937, 150813, 134934, 60526, 46669, 68732, 93242, 83212, 59889, 30322, 26986, 47119, 76083, 12164, -16612, 61613]
10111F1613M2908k805L476l8297p0267n0463L6344M7869N262k7973J8199R516
10099C5382j6293R337J6768l377k0215k9252J0706L2678K0224L0618m450L0577
10087A12703j9948o858m01n194Q344l2784j1305N619J7875r063O0508Q3432o7270
10074A35658k7953J2873n874o8790J568q657J4495N0361n7170l5250N489L9402
10062E6152M6018m34j6100l0045l3979k6128l492L4556L3103N1843n7645n9466
10050e617K9971R917K3785K6135l7027K4280K5219j1692L1417j5495k6252Q955
10038H3596p85K5827R601M1910L6487K1656j7094k1178r8860p1692L5848J0522
10026E5838K0118R550k8869K3454r917j2049K3518o255j1099n188J5043M0403
$$ y = [61613, 104521, 101716, 105192, 66895, -3372, -53835, -17491, 30378, 35640, 7667, 25866, 35382, 19089, 28426, 45194, 41817, 21602, -7650, 3056, 35734, 55958, 86576, 82126, 112703, 92755, 85897, 85496, 80302, 88646, 55862, 44557, 50176, 68051, 58988, 119496, 202928, 135658, 107705, 120578, 114704, 45914, 47482, 38825, 53320, 103681, 46511, 11261, 16750, 56152, 102170, 101736, 85636, 55591, 21612, -4516, -8008, 26548, 59651, 111494, 53849, -5617, 24354, 34271, 58056, 84191, 47164, 71444, 96663, 84971, 116388, 100893, 74641, 83596, 82811, 108638, 118239, 160149, 196636, 218292, 201198, 180020, 81160, 9468, 45316, 55838, 75956, 85506, 56637, 80091, 70174, 58125, 81643, 75388, 64289, 59101, 74144, 114547]
10014A14547K2637J7495j120J6247k2963K34L8174M1694l0488K8244M6851M7682
10002C19234k1074j30708r2697P36N6944o8497q852R8632m858n5229n073j117
9990H7441n7001K667J05609P6095L5188Q1754j3442m5257M1977L0975k401K0685
9978C64290r7033o1251n1708m0482k0392J9646J282l8591J4154M39l6431P0732
9966A24655K5232j1092j6930J5008L3803q752r0916k4507L7322L8009M0400M2204
9954B04436p827n1789k2549L0141K5179q804K0447L5868J9064j2106L3836J9837
9942B85733K5738k4624J3859O46J2453O252L7847O7726L3019P4380R6861J57474
9930G87364J39514K40324L30791N24100Q22256J345155J801018J796923J116362
$$ y = [114547, 137184, 154679, 153559, 169806, 146843, 147077, 185251, 226945, 196457, 224701, 271552, 319234, 298160, 167452, 74755, 75491, 132435, 63938, 55086, 153718, 148860, 93631, 88558, 87441, 30440, 33107, 138716, 214811, 249999, 331753, 318311, 273054, 315031, 346006, 343605, 364290, 267257, 206006, 154298, 113816, 93424, 113070, 114352, 75761, 89915, 90354, 53923, 124655, 149887, 138795, 121865, 136873, 170676, 161924, 71008, 46501, 83823, 121832, 162232, 204436, 196609, 144820, 122271, 152412, 177591, 168787, 189234, 225102, 244166, 232060, 265896, 285733, 311471, 286847, 300706, 301352, 313805, 320057, 357904, 425630, 458649, 533029, 629890, 787364, 926878, 1167202, 1497993, 2022093, 2844349, 4189504, 5990522, 7787445, 8903807]
9921H903807K77011N1665M17212P01883K84560p65042j519974j521322j102136
9912E727664r03960p14282o14220m51799l93708l77381l02401k07512j09080j48058
9902A505263j07403j03676j6532L9870K1669n2454j04194j30328p5959l9097o64
9891I36495k8146o9964n5066j347m1673J7948J6385J9662p3172n2958l2245o3631
9879E72288m6633l7041J2682P3758J2623n2044l9315K4336j9231k9983k5293l3334
9867D12813j45N784n9807n3313O772L1757M2387n6211n3792j6038K7578J425M2321
9854C31531j4597l0961l4616M1659J8457Q3737L7904J2414P1005J04545J04011
9843G25089J15204k2660j7275j7357M6152O8533o0694p4320j01217q5159n0858
$$ y = [8903807, 9180818, 9232483, 9649695, 10351578, 10636138, 9871096, 8351122, 6829800, 5727664, 4823704, 4109422, 3495202, 3043403, 2649695, 2272314, 1969913, 1762401, 1653321, 1505263, 1397860, 1294184, 1277652, 1317522, 1339191, 1286737, 1182543, 1052215, 976256, 937159, 936495, 908349, 838385, 783319, 781972, 740299, 758247, 774632, 794294, 721122, 668164, 635919, 572288, 525655, 488614, 501296, 575054, 587677, 535633, 496318, 520654, 501423, 471440, 446147, 412813, 412668, 418452, 358645, 305332, 312104, 343861, 386248, 330037, 276245, 260207, 287785, 289210, 331531, 316934, 285973, 251357, 293016, 311473, 395210, 433114, 445528, 516533, 621078, 725089, 840293, 817633, 800358, 783001, 829153, 897686, 836992, 762672, 661455, 576296, 525438]
9832E25438k4306k6716j4938j8076o9445K433k1670l8258l3736K3459N0368M2598
9820C97151N41l7838k5864K4798R253O085P448l2050r3974p1383O921j066L1290
9807B21312L8020M5543k6943m305o513k0800l0566r801l3364L3J678M165j4094
9794A64365n404k5949j0220K4481O5597j387m2829l833K0265K7282l8228j3938
9782A60202Q539L976l054K9380K631j2664P6238L6464p3673L8295N0456k3414
9770B93376k8194j1273l7044r3385k9628j9040J2210O3938N9477K4244L3722k3407
9758B44996k1292j3927Q558j0158J8437K5665N2212O165k5020Q928J4194L879
9746C12637K0695r634j7683j144J8870m3999m384m219R591k0007L3340j7177n0919
$$ y = [525438, 501132, 474416, 459478, 441402, 371957, 374390, 352720, 314462, 280726, 304185, 354553, 397151, 397692, 359854, 333990, 358788, 368041, 374126, 381574, 349524, 255550, 184167, 191088, 190022, 221312, 259332, 304875, 277932, 273627, 267114, 246314, 215748, 205947, 172583, 172616, 174294, 178459, 164365, 158961, 133012, 122792, 147273, 212870, 211483, 168654, 164821, 185086, 212368, 174140, 160202, 168741, 172717, 169663, 199043, 201674, 189010, 265248, 301712, 228039, 266334, 316790, 293376, 265182, 253909, 216865, 123480, 93852, 74812, 87022, 150960, 210437, 234681, 268403, 244996, 223704, 209777, 218335, 208177, 226614, 252279, 304491, 310656, 285636, 294564, 308758, 312637, 333332, 323698, 306015, 304871, 323741, 279742, 275358, 271139, 280730, 260723, 294063, 276886, 225967]
9733B25967m0550l4811J4106M7855Q849j1154m4486J7727M6519L4548j2170l1437
9721B20963N9269K485K5979j5784K5067j65J2446j0490k9562j4196m9935J3924
9709B40001O2271p054l4395j5992l3205J7655O2276n6747o2424K4084Q349O7493
9697B72312L3275j037N2771L1471m2839k0333n4694p2776L8092J04258O1208K2195
9685D23903m3921k1913k835K8535J7495p9448J2377j4602m3879J1619K6351K7337
9673C41019q242j8694J6699K0985j4723l6818L0745K9711j0572p691J9704j0717
9661C51406J8203K5285l3401m8877m6833o0457n984K4890O5288L8504J5802j0977
9649C32849J3245l8312j2879j4819L0469Q1576K5481j4896j223K7856R187j5152
$$ y = [225967, 185417, 150606, 164712, 212567, 221416, 210262, 165776, 183503, 230022, 264570, 252400, 220963, 280232, 282717, 308696, 292912, 317979, 317814, 330260, 319770, 290208, 276012, 226077, 240001, 302272, 295218, 260823, 244831, 211626, 229281, 291557, 234810, 172386, 196470, 204819, 272312, 305587, 304550, 357321, 388792, 345953, 325620, 270926, 198150, 236242, 340500, 401708, 423903, 379982, 358069, 355234, 383769, 401264, 321816, 334193, 319591, 275712, 287331, 313682, 341019, 332777, 314083, 330782, 351767, 337044, 300226, 330971, 360682, 350110, 342419, 362123, 351406, 369609, 394894, 361493, 312616, 265783, 205326, 199342, 224232, 289520, 328024, 343826, 332849, 346094, 307782, 294903, 280084, 310553, 392129, 417610, 402714, 401491, 429347, 438534, 423382]
9637D23382K4891q230j7654j4438j0708k358j1302J4411O2398N8889j8224m5896
9625D55161m9836K1005M8530k3551O639o483k0352J9703J0281k0846k2734M3686
9613D61203L9250p424l5797L0573M6484n8578l1184r545O4522M9213J8514l9491
9601E27740J9388K8381l7792k0064k4782m5371L9708O0713M612j5044j4228L0712
9589E53973K396k212P0531l333k9025k7843N4452K6248m0189k903l6256K2726
9577E88565l4429Q070M9721L5279k2264J8989K9684K1031J1764L3163k4605n7616
9565F57352m6433N5259P9673K0878l7638l4719j8436K7759J9572R395k5001j0151
9553F97510Q0374M6727o013L2181n689l2375n0555P226L6706M1987K4955o1452
$$ y = [423382, 448273, 440043, 422389, 407951, 397243, 394885, 383583, 397994, 460392, 519281, 501057, 455161, 405325, 426330, 474860, 451309, 457948, 451465, 431113, 450816, 461097, 440251, 417517, 461203, 500453, 493029, 457232, 487805, 534289, 475711, 444527, 434982, 499504, 548717, 567231, 527740, 547128, 575509, 537717, 517653, 492871, 447500, 487208, 547921, 552533, 537489, 523261, 553973, 556369, 554157, 624688, 621355, 592330, 564487, 618939, 645187, 604998, 602095, 565839, 588565, 554136, 562206, 611927, 647206, 624942, 643931, 673615, 694646, 706410, 739573, 714968, 657352, 610919, 666178, 745851, 766729, 729091, 694372, 675936, 703695, 723267, 732662, 707661, 697510, 777884, 824611, 818598, 850779, 845090, 812715, 762160, 769386, 806092, 848079, 873034, 811582]
9541H11582k7511J7609N1941L2487J573M815j6135m0161l7638L5831M1844N5144
9529I31381K9067J5040J0724k3969m6763K2724M7772L5597k0475l222L2560J1023
9517A041459k7123m047N1346L6433Q293l5596j751Q872l5281n2247p430L614L4354
9504A020896N5272L0952q359q4354m2111J8023R9737L8393m2158l1722j650j8640
9492A034279M2075J04955L6983l1549k0743k8991n1232l1378K0976K2721j7857
9481A080239l3673K8137m739k6381J1716N9844M1215o207L5226M8537N4527m3076
9469A245365N985k3799m9207k3352L5544O2876J0141o5723l7402J5364Q691J685
9457A186168o9249R582M9739M2866j0599n2356m4447K784M9180K9382l406j0026
$$ y = [811582, 784071, 801680, 853621, 886108, 887681, 892496, 876361, 836200, 798562, 834393, 876237, 931381, 960448, 975488, 986212, 962243, 915480, 938204, 985976, 1021573, 1001098, 997876, 1030436, 1041459, 1014336, 1010289, 1061635, 1098068, 1106361, 1070765, 1069014, 1077886, 1042605, 990358, 982928, 986542, 1020896, 1076168, 1107120, 1098761, 1014407, 972296, 990319, 1090056, 1128449, 1086291, 1054569, 1052919, 1034279, 1076354, 1181309, 1218292, 1186743, 1166000, 1137009, 1085777, 1054399, 1075375, 1098096, 1080239, 1046566, 1074703, 1069964, 1043583, 1055299, 1115143, 1156358, 1150151, 1185377, 1233914, 1288441, 1245365, 1251350, 1227551, 1178344, 1154992, 1190536, 1253412, 1263553, 1197830, 1160428, 1175792, 1184483, 1186168, 1116919, 1126501, 1176240, 1219106, 1208507, 1156151, 1111704, 1114488, 1163668, 1193050, 1189644, 1179618]
9445A179618k6187J3008P189o1259l3891K9934J2026l923O411k5338M2735j1762
$$ y = [1179618, 1153431, 1166439, 1173628, 1112369, 1078478, 1108412, 1120438, 1116515, 1122926, 1097588, 1140323, 1128561]
$$ [...]
##END NTUPLES=NMR SPECTRUM
##END=
