##TITLE=Analysis number 318292
Compound Code cc 13103
Project Code adrs
Chemist Name ugmt
##JCAMPDX= 6.0         $$ Bruker NMR JCAMP-DX V2.0
##DATA TYPE= NMR SPECTRUM
##DATA CLASS= NTUPLES
##ORIGIN= Bruker BioSpin GmbH
##OWNER= nmr
$$ XWIN-NMR		Version 3.5
$$ Wed Mar 22 15:54:17 2006 GMT Standard Time (UT+0h)  MAYBRIDGE\nmr@NMR_250MHZ
##.OBSERVE FREQUENCY= 250.131544655141
##.OBSERVE NUCLEUS= ^1H
##.ACQUISITION MODE= SIMULTANEOUS (DQD)
##.ACQUISITION SCHEME= undefined
##.AVERAGES= 16
##.DIGITISER RES= 18
##SPECTROMETER/DATA SYSTEM= dpx250
##.PULSE SEQUENCE= zg30
##.SOLVENT NAME= CDCl3
##.SHIFT REFERENCE= (INTERNAL, CDCl3, 0, 16.454)
##AUDIT TRAIL= $$ (NUMBER, WHEN, WHO, WHERE, WHAT)
$$ ##TITLE= Audit trail, XWIN-NMR		Version 3.5
$$ ##JCAMPDX= 5.01
$$ ##ORIGIN= Bruker BioSpin GmbH
$$ ##OWNER= nmr
$$ C:\u/data/dgb/nmr/ADRS/1220/pdata/1/auditp.txt
$$ ##AUDIT TRAIL=  $$ (NUMBER, WHEN, WHO, WHERE, WHAT)
(   1,<2006-03-22 15:52:49.23 +000>,<MAYBRIDGE\nmr>,<NMR_250MHZ>,
      <created by zg, POWCHK disabled, PULCHK disabled
       configuration hash MD5:
       84 BC 41 DB A1 6E 1D 46 DA 25 12 A5 C1 ED C5 3A
       data hash MD5: 64K
       DD 64 2F FE 2E BC AF 7A F0 4A 1E 30 89 CC 14 88>)
(   2,<2006-03-22 15:53:39.32 +000>,<MAYBRIDGE\nmr>,<NMR_250MHZ>,
      <Start of raw data processing
       ef LB = 0.3 FT_mod = 6 PKNL = 1 SI = 32K 
       data hash MD5: 32K
       37 EE 56 7A 06 73 8D AF 2E 48 E8 4F B4 B5 F0 C2>)
(   3,<2006-03-22 15:53:53.29 +000>,<MAYBRIDGE\nmr>,<NMR_250MHZ>,
      <apk 
       data hash MD5: 32K
       1B 24 8C BE 0D EB 2D 66 28 06 8B AF 63 49 11 F8>)
(   4,<2006-03-22 15:53:56.44 +000>,<MAYBRIDGE\nmr>,<NMR_250MHZ>,
      <abs ABSG = 5 
       data hash MD5: 32K
       C3 FA A8 7D 3A 59 C8 55 89 28 62 42 13 1A D6 9F>)
$$ ##END=
$$ 
$$ hash MD5
$$ A4 91 AB D5 92 F8 B8 8F 57 C7 FE 8B 9F 5B 08 8A
##$RELAX= 
##$RELAX= 
##$RELAX= 
##$RELAX= 
##$RELAX= 
##$RELAX= 
##$RELAX= 
$$ Bruker specific parameters
$$ --------------------------
##$DU= <C:\u>
##$EXPNO= 1220
##$NAME= <ADRS>
##$PROCNO= 1
##$TYPE= <nmr>
##$USER= <dgb>
##$AMP= (0..31)
100 100 100 100 100 100 100 100 100 100 100 100 100 100 100 100 100 100 
100 100 100 100 100 100 100 100 100 100 100 100 100 100 
##$AQSEQ= 0
##$AQ_mod= 3
##$AUNM= <au_zg>
##$AUTOPOS= <50 >
##$BF1= 250.13
##$BF2= 250.13
##$BF3= 250.13
##$BF4= 250.13
##$BF5= 500.13
##$BF6= 500.13
##$BF7= 500.13
##$BF8= 500.13
##$BYTORDA= 1
##$CFDGTYP= 0
##$CFRGTYP= 5
##$CHEMSTR= <none>
##$CNST= (0..31)
1 1 145 1 1 1 1 1 1 1 1 1 1 1 1 1 1 1 1 1 1 1 1 1 1 1 1 1 1 1 1 1 
##$CPDPRG= <>
##$CPDPRG1= <>
##$CPDPRG2= <>
##$CPDPRG3= <>
##$CPDPRG4= <mlev>
##$CPDPRG5= <mlev>
##$CPDPRG6= <mlev>
##$CPDPRG7= <mlev>
##$CPDPRG8= <mlev>
##$CPDPRGB= <>
##$CPDPRGT= <>
##$D= (0..31)
0 1 0 0 0 0 0 0 0 0.06 0 0 0 0 0 0 0.0002 0 0 0 0 0 0 0 0 0 0 0 0 0 0 
0 
##$DATE= 1143042765
##$DBL= (0..7)
120 120 120 120 120 120 120 120 
##$DBP= (0..7)
150 150 150 150 150 150 150 150 
##$DBP07= 0
##$DBPNAM0= <>
##$DBPNAM1= <>
##$DBPNAM2= <>
##$DBPNAM3= <>
$$ [...]
##$SUBNAM7= <"">
##$SUBNAM8= <"">
##$SUBNAM9= <"">
##$SW= 20.6930455092707
##$SWIBOX= (0..15)
0 0 3 0 0 0 0 0 0 0 0 0 0 0 0 0 
##$SW_h= 5175.983436853
##$TD= 65536
##$TD0= 1
##$TE= 294.16
##$TE2= 300
##$TE3= 300
##$TEG= 300
##$TL= (0..7)
0 120 120 120 120 120 120 120 
##$TP= (0..7)
150 150 150 150 150 150 150 150 
##$TP07= 0
##$TPNAME0= <>
##$TPNAME1= <>
##$TPNAME2= <>
##$TPNAME3= <>
##$TPNAME4= <>
##$TPNAME5= <>
##$TPNAME6= <>
##$TPNAME7= <>
##$TPOAL= (0..7)
0.5 0.5 0.5 0.5 0.5 0.5 0.5 0.5 
##$TPOFFS= (0..7)
0 0 0 0 0 0 0 0 
##$TUNHIN= 0
##$TUNHOUT= 0
##$TUNXOUT= 0
##$USERA1= <user>
##$USERA2= <user>
##$USERA3= <user>
##$USERA4= <user>
##$USERA5= <user>
##$V9= 5
##$VALIST= <valist>
##$VCLIST= <CCCCCCCCCCCCCCC>
##$VD= 0
##$VDLIST= <DDDDDDDDDDDDDDD>
##$VPLIST= <PPPPPPPPPPPPPPP>
##$VTLIST= <TTTTTTTTTTTTTTT>
##$WBST= 1024
##$WBSW= 4
##$XGAIN= (0..3)
0 0 0 0 
##$XL= 0
##$YL= 0
##$YMAX_a= 327019
##$YMIN_a= -331466
##$ZGOPTNS= <>
##$ZL1= 120
##$ZL2= 120
##$ZL3= 120
##$ZL4= 120
##$ABSF1= 16.45396
##$ABSF2= -4.239212
##$ABSG= 5
##$ABSL= 3
##$ALPHA= 0
##$AQORDER= 0
##$ASSFAC= 0
##$ASSFACI= 0
##$ASSFACX= 0
##$ASSWID= 0
##$AUNMP= <proc_1d>
##$AZFE= 0.1
##$AZFW= 0.1
##$BCFW= 0
##$BC_mod= 0
##$BYTORDP= 0
##$COROFFS= 0
##$CY= 12.5
##$DATMOD= 1
##$DC= 0
##$DFILT= <>
##$DTYPP= 0
##$F1P= 14.0000005364418
##$F2P= -0.99999901652339
##$FCOR= 0.5
##$FTSIZE= 32768
##$FT_mod= 6
##$GAMMA= 0
##$GB= 0
##$INTBC= 1
##$INTSCL= 1
##$ISEN= 128
##$LB= 0.3
##$LEV0= 0
##$LPBIN= 0
##$MAXI= 10000
##$MC2= 0
##$MEAN= 0
##$ME_mod= 0
##$MI= 0
##$NCOEF= 0
##$NC_proc= -3
##$NLEV= 6
##$NOISF1= 0
##$NOISF2= 0
##$NSP= 0
##$NTH_PI= 0
##$NZP= 0
##$OFFSET= 16.45396
##$PC= 1
##$PHC0= 173.4577
##$PHC1= 18.67166
##$PH_mod= 1
##$PKNL= yes
##$PPARMOD= 0
##$PSCAL= 4
##$PSIGN= 0
##$REVERSE= no
##$SF= 250.130017018524
##$SI= 32768
##$SIGF1= 0
##$SIGF2= 0
##$SINO= 400
##$SIOLD= 32768
##$SREGLST= <1H.CDCl3>
##$SSB= 0
##$STSI= 32768
##$STSR= 0
##$SW_p= 5175.98343685301
##$SYMM= 0
##$S_DEV= 0
##$TDeff= 65536
##$TDoff= 0
##$TI= <Analysis number 999999
Compound Code 99
Book Reference 9
Project Code 9>
##$TILT= no
##$TM1= 0
##$TM2= 0
##$TOPLEV= 0
##$USERP1= <user>
##$USERP2= <user>
##$USERP3= <user>
##$USERP4= <user>
##$USERP5= <user>
##$WDW= 1
##$XDIM= 32768
##$YMAX_p= 307647444
##$YMIN_p= -198963
$$ End of Bruker specific parameters
$$ ---------------------------------
##NTUPLES= NMR SPECTRUM
##VAR_NAME=  FREQUENCY,     SPECTRUM/REAL,   SPECTRUM/IMAG
##SYMBOL=    X,             R,               I
##VAR_TYPE=  INDEPENDENT,   DEPENDENT,       DEPENDENT
##VAR_FORM=  AFFN,          ASDF,            ASDF
##VAR_DIM=   32768,         32768,           32768
##UNITS=     HZ,            ARBITRARY UNITS, ARBITRARY UNITS
##FACTOR=    0.157963299565203, 1,           1
##FIRST=     4115.62939955184, 0,            0
##LAST=      -1060.35403730117, 0,           0
##MIN=       -1060.35403730117, -198963,     0
##MAX=       4115.62939955184, 307647444,    0
$$ Real data points
##PAGE= N=1
##DATA TABLE= (X++(R..R)), XYDATA
$$ [...]
28891 30931 18140 10532 -14015 -23453 -33131 -11373 18780 -3176 -58320 -73247 -50035 -42345
28879 -42345 -36392 26089 59047 12729 -69856 -79819 -70010 -80515 -50992 -37523 -33810 -45903
28867 -45903 -32236 13210 22620 23150 30117 9315 -9675 3176 11226 15040 18434 17111 13851
28854 13851 -14323 -53016 -65637 -45875 -55138 -62380 -55919 -17020 3271 -34756 -39726 14779
28842 14779 47111 40877 63027 38532 -5505 -27734 -34148 -17792 2225 -1576 -14161 -36663
28830 -36663 -75526 -41744 -11775 -21875 -10638 12914 -24560 -19686 -9263 -42499 -41921 -40157
28818 -40157 -72635 -58641 -46125 12799 36825 31802 28070 74197 38851 53296 76813 49038
28806 49038 56519 5287 -13061 -54072 -65345 -47076 -32390 -27462 -25331 -17746 8841 32680
28794 32680 43237 -4254 -31306 -8112 -33085 -30801 -24637 -487 37572 33786 26377 6426
28782 6426 -592 1507 -25027 -52779 -40903 -15625 -3279 30850 14671 9499 -1094 -14552
28770 -14552 -24271 11096 51422 16867 3852 13143 -8579 -53208 -83821 -51907 -25344 -33877
28758 -33877 -11704 1727 13205 -27568 -60459 -25813 -34778 -44925 -1528 39220 26640 12599
28746 12599 11537 -11547 -2790 23656 -16845 -11921 -13866 -37137 -7637 6042 -12335 -42282
28734 -42282 -68379 -68020 -57967 -36271 -27234 -33930 -40415 -30201 10625 50810 50092 36674 41395
28721 41395 31863 20988 10633 -38648 -29013 4137 15461 15408 63559 21697 -8360 10565 6496
28708 6496 -4542 5123 -17187 -32375 -18938 3539 -41051 -48836 -10958 1997 22872 37401
28696 37401 53982 41250 26186 21034 28660 6055 -14243 -12589 -10623 -33801 -57329 -32748
28684 -32748 -16923 -25291 -34384 -43743 -47460 -28143 -13205 4610 49145 57816 41488 -14916 -19053
28671 -19053 -43670 -60975 -71570 -80036 -60979 -44056 -18596 -18743 -12897 12273 -14002 -26865
28659 -26865 -11300 -10681 21063 22615 -14297 -26020 -14706 -20199 -16599 7766 13102 21794 17729
28646 17729 -1255 9402 43545 51852 27079 52294 57346 59180 60760 63109 65675 71040 85047
28633 85047 78931 98946 101674 60550 43011 39447 44107 59160 65618 31735 3990 -30280 -6266
28620 -6266 31411 -17834 -80386 -92935 -63779 -26001 12960 22736 -45478 -43187 -15896 -32541
28608 -32541 -66948 -56405 -49134 -16411 -35365 -20904 -7829 -39667 -46266 -42183 -16685 7070
28596 7070 -17229 10271 41047 -1880 -55356 -95296 -37023 10417 46334 30966 35918 30381
28584 30381 59154 61080 75447 45450 23864 45782 38729 28730 24698 24813 50020 53706 59117
28571 59117 39805 36435 66161 62442 62701 71058 67903 60743 88727 104984 66958 49656 -1710
28558 -1710 -17408 -19233 -17402 -8331 18576 15938 -13942 -18136 -129 19064 9676 8115 47167
28545 47167 21728 38256 44056 48822 79414 69237 38246 22088 65034 39941 19699 39241
28533 39241 69298 42501 28301 39196 25145 2209 -25261 -53046 -45210 6144 43260 84039
28521 84039 58830 19893 50400 54447 65818 51576 27843 -14624 -7736 -17342 -19362 -42536
28509 -42536 -20054 2118 5155 2921 -28714 -16604 -56608 -81277 -83583 -61899 -62814 -64973 -75980
28496 -75980 -72345 -66884 -48689 -53997 -69828 -46491 -24480 -50137 -46010 3542 38039 -2892
28484 -2892 -89431 -133080 -83762 -31927 -21403 -15693 13308 18912 -3075 -12945 -15374 -42752 -47079
28471 -47079 -62338 -30424 8318 15469 23945 17649 40921 72031 44157 13501 55146 50955
28459 50955 29045 -19188 -21616 945 18838 6120 -8208 -26436 14037 21962 8176 43960
28447 43960 51776 78894 67672 22663 4420 32345 52337 1687 8441 33545 35025 37680
28435 37680 48514 8154 -9528 14856 -2748 12491 78427 64432 55521 23139 -25906 -60774
28423 -60774 -43436 2910 24256 -2168 -5403 8404 -30786 -40494 -5618 3252 21638 32739
28411 32739 62369 90248 70109 14159 -15292 10445 67848 75844 28795 12080 19797 55192
28399 55192 73732 66759 30422 -6654 -23499 27338 74573 42136 16049 10004 29545 24499
28387 24499 -176 10964 8038 4262 31478 47339 49327 40864 40096 21107 9777 -24104 -34062
28374 -34062 -43035 -16049 -6050 -20997 -55526 -20491 16680 40061 88769 50322 15167 -1886
28362 -1886 -27162 -14677 24228 53392 57741 52449 19955 -17817 -6085 22816 59377 48980
28350 48980 14110 21878 35357 70041 120850 114376 68429 52408 32150 30444 34894 47803
28338 47803 44840 21956 -22378 -24445 219 28718 35841 21120 29559 25803 63897 88051 79199
28325 79199 40957 3737 42861 45085 53630 37258 746 -14886 21457 45672 44535 -1251
28313 -1251 -18935 -37925 -72484 -63765 -32517 -8936 -1258 18100 26599 28535 -7147 -20733 -2277
28300 -2277 14064 -1684 -3125 5471 -2318 11395 28602 16246 14046 41094 34868 14301 -17794
28287 -17794 -52068 -56457 -48916 -12093 -8111 -4778 12548 36010 6770 17870 50643 50488 21319
28274 21319 -5453 -19349 5291 -13416 32000 82731 36332 13413 647 -684 -21894 -21781
28262 -21781 -19645 11304 24718 29416 51657 62976 40227 49848 73739 70148 88974 58649
28250 58649 35469 35537 20599 27270 13551 -10177 -1243 -15974 -19929 -15606 -37200 -18825 7013
28237 7013 8541 -2875 27263 27406 37689 29237 6372 -23314 -52058 -86544 -56057 -30520 -36319
28224 -36319 -31655 -16324 -29328 -2001 1222 5338 -28231 -40621 -9562 -25047 -30185 -5272
28212 -5272 -6402 -19546 -43860 -57636 -29387 -15991 -12803 12409 51797 78909 55154 6635
28200 6635 -33864 -46072 -13272 10928 35455 50010 101530 90058 83436 44678 -9895 5221
28188 5221 34273 19167 31111 23201 44193 50199 23299 -7360 -54056 -71338 -31750 -3955
28176 -3955 -19214 -21412 -35486 -43144 -40239 -43244 -61752 -67008 -18395 -2828 23671 5115 15066
28163 15066 24147 21916 -5459 -8404 23625 8221 -37842 -29408 -44141 -25524 -16404 -2380 21646
28150 21646 39089 73676 52828 55800 56443 29074 -7592 -10736 36829 75840 49913 -34227
28138 -34227 -11025 18060 18700 16083 13758 -302 32893 14215 -23697 -14446 -14394 -6992 -15062 15374
28124 15374 -14966 -46146 -47045 -37064 6827 28195 57239 38184 4867 36436 65295 46695
28112 46695 18363 36219 28750 1684 -28999 26296 52305 48698 47528 27166 -13400 -17387
28100 -17387 17679 31477 -1640 13545 35410 42772 56132 49361 -8583 -52143 -70569 -44493
28088 -44493 -25090 -60058 -61114 -38918 22911 43972 -934 7011 50845 54748 23530 7222
28076 7222 1280 20521 10832 4423 -8514 2519 7149 1632 2005 -23223 -35871 -47626 -42155
28063 -42155 -30714 -6014 30573 25087 -7549 -24810 -5994 -37768 -75761 -55443 -5196 49934
28051 49934 50211 -15338 -20106 -11969 36059 47872 59002 54419 19987 -33759 -31210 -27508 -21288
28038 -21288 -24173 12561 9288 34183 43616 -15862 -43105 -53859 -36389 9832 14365 16096 26525
28025 26525 -22272 12116 27157 -16233 -53453 -15915 32324 45322 63565 38695 14507 1381
28013 1381 22727 38253 35404 55784 55882 23000 -18702 -27755 -40044 -2055 16238 -19239 5216
28000 5216 30772 -2687 31020 64599 96649 71794 58679 18034 -13743 -25408 -3047 870
27988 870 17199 -7840 -27878 -22871 2210 32728 38000 25235 42476 67965 73062 78160 42651
27975 42651 34641 57712 46389 32111 9454 39714 58367 4962 -49455 -19619 -15084 -22633
27963 -22633 2785 19594 14236 -28166 12582 71156 80129 51399 43710 29722 9443 -654
27951 -654 25436 75819 23317 -2695 -15827 -56897 -65042 -46529 -18516 -15299 -65004 -112707
27939 -112707 -84057 -54556 -20547 21263 45532 75048 67533 -1021 -29879 -21561 -25881 5330
27927 5330 48522 77593 59249 84734 89063 40756 7147 34207 45399 44243 31511 34488
27915 34488 22937 -23721 6480 26889 23081 -595 -29661 -45757 -39621 48648 76294 52037
27903 52037 57991 63803 52923 34385 21757 36420 37008 59848 43506 59484 76248 52924
27891 52924 6711 -63187 -67137 -36303 24168 39863 59949 71671 58828 36305 70442 30221
27879 30221 -19613 -29989 -55553 -39246 -15682 2540 -10125 -14266 -24832 16531 74375 78648
27867 78648 89494 75632 57836 34705 -24353 -29033 -42795 -13757 -1282 -36432 -29539 12835
27855 12835 -11232 -39126 -10974 10807 -9352 8376 35394 19829 19766 28015 14486 55769
27843 55769 62279 56269 28618 34462 38915 62019 31908 45880 30482 6965 14586 26092 29172
27830 29172 49261 46117 49355 -28610 -78934 -105583 -71498 -4415 27974 12667 -7476 256
27818 256 27035 14972 23450 41732 41448 35033 27212 -24307 -24682 29252 48863 36538 18609
27805 18609 -14981 -29052 -15448 -1800 25894 49099 78482 35312 8433 -39452 -42435 -55283
27793 -55283 -64597 -6425 28726 -53318 -107490 -101916 -97308 -52517 -38339 -13510 -3609 27681
27781 27681 39889 46361 31315 44505 57019 82692 71110 36497 16375 28557 -2268 26255
27769 26255 11895 14110 50536 8256 6159 9323 69249 105879 81349 16336 -18574 -207
27757 -207 29951 62523 43125 20883 20033 11946 4722 -10991 3138 -3735 15494 -3528 -19124
27744 -19124 -19062 9606 31127 72646 82945 73256 88669 115688 104744 73241 9964 -25098
27732 -25098 -51057 -44960 -44177 26245 71076 36549 46556 20499 30628 30762 9888 -4749 -13496
27719 -13496 37634 63497 69064 37383 49120 109309 134231 114421 112714 83700 68561 27349
27707 27349 28273 87831 93742 80435 7747 -61738 -54661 17343 66523 58522 17248 -6545 -25309
27694 -25309 -44291 -36427 -7070 -11531 15359 25105 21685 18599 -9048 -44374 -12712 -25367 -48494
27681 -48494 -11417 -42849 -30385 -432 6442 5765 -30706 -47434 -47621 -18419 -1531 20331 58309
27668 58309 47175 40225 26818 -2004 -974 9679 21252 -17006 -32928 8467 32182 -2046
27656 -2046 -12093 -9992 18007 23915 -12935 -66999 -42707 17709 18052 7230 -30691 -59298 -48207
27643 -48207 21470 73872 76915 65423 55413 42322 27601 28869 24617 16404 -17409 -22588 4695
27630 4695 17589 20619 -2195 -24414 -31620 -19920 -64965 -97327 -78887 -28876 -45518 -61376
27618 -61376 -15901 -17575 -28815 -16452 4450 2887 6355 20719 31778 50729 80594 59540
27606 59540 44519 34183 2680 -17106 -31235 -19794 -47478 -77961 -58063 -37395 -23032 15
27594 15 19914 43582 8168 -4654 -23986 -19923 -22550 -6019 29881 78137 67508 30280 44949
27581 44949 3947 -14504 -12138 -18121 19418 36615 5336 43611 46390 27305 37550 46055
27569 46055 51459 -4410 -17642 -19546 30287 71024 93544 54585 4060 -6068 -11526 -1815
27557 -1815 -1426 -4552 -2580 -12413 -9954 -16784 -25940 -25107 -26343 -28383 -37417 -20550 22682 134
27543 134 -38741 -8402 10844 34969 42597 -26493 -47142 -37741 -22035 -18712 -19982 -3448 -18815
27530 -18815 -38307 -18463 12847 29234 1268 10434 34047 46781 21537 -41061 -16607 -4737
27518 -4737 67715 41097 8457 13382 2812 4683 -33492 -66266 -10932 21617 12043 -45375
27506 -45375 -78375 -68775 1529 19880 -24488 -32121 -752 -21918 -34625 -85337 -64764 -22106
27494 -22106 32688 47707 11315 -11217 -20809 -2638 7901 11315 18028 14485 9511 -11803 -10576
27481 -10576 -32160 -12879 -17515 32974 45593 52710 31033 8725 4217 -7240 -46949 -18610
27469 -18610 -12033 -7048 -22075 -6446 17385 13219 4022 48643 98306 64529 35574 8868
27457 8868 2894 11428 28097 16266 -1669 24382 33007 27140 42186 45080 5051 2631 28742
27444 28742 11321 -14962 17051 64704 96392 95399 47502 10489 -19735 -27073 -30149 -70736
27432 -70736 -19968 13183 41249 44595 32065 62459 35894 -24459 6264 12092 19151 30179
27420 30179 27390 11744 23346 62839 24004 -1709 -24327 -39523 -63911 -39910 -27254 -16184
27408 -16184 -22149 -44457 -62079 -6105 44152 42385 51131 72957 72721 86620 81843 30309 -3712
27395 -3712 13508 41895 57689 43771 28898 40192 60170 35554 34585 12930 -12462 -5404
27383 -5404 -24761 -33623 -2632 35676 91312 105799 60236 17105 -8978 18107 39794 59457
27371 59457 -11937 -48452 -42015 -48429 -62271 -59331 -72320 -40598 -26778 -55134 -79165 -40815
27359 -40815 21132 13880 8227 -2885 6793 -5570 -57618 -56565 -7576 15058 3667 2224 732
27346 732 -22521 -32262 -29561 -2164 -4053 -14697 -16769 24984 19878 -12651 20021 31730 606
27333 606 -12714 -60875 -94336 -85471 -44726 -20993 -13993 -3373 -29508 -39699 -13843 -22318 -35286
27320 -35286 -25478 -39553 -31878 -7782 28442 28501 48014 9883 -12686 -41400 -62005 -43870 25712
27307 25712 41725 -2218 -12385 3396 5334 25175 32067 28651 6228 39137 13338 -5611
27295 -5611 17355 23458 43455 39965 13141 -3878 -11155 -39492 -49667 3964 21536 37184
27283 37184 33398 23796 38167 50572 31853 5482 -17151 -16081 -2916 -19947 -7861 -10900
27271 -10900 36319 72603 59123 58694 23158 -1699 20980 7057 -3627 -14386 -31303 -17041
27259 -17041 1172 53392 77411 22957 -8111 -32623 2742 19540 -32457 -49393 -30340 -31471
27247 -31471 -16278 -39741 -26369 -8604 -25503 -12509 -20853 -20014 4416 46077 71678 63612
27235 63612 71523 40016 22141 -38352 -71158 -58239 -58202 -38389 -48574 -38542 -12065 18423
27223 18423 75694 88656 73738 46706 37615 -713 -16952 30462 30218 27812 47054 35253
27211 35253 32212 24077 -18010 -48979 -2484 -10340 -60059 -87593 -84514 -65876 -75037 -74747 -26244
27198 -26244 -17076 -62480 -36099 -29168 -54003 -50856 -23143 -40810 -24058 -15274 -11436 -37128 -18165
27185 -18165 -24054 -34866 -45446 -18477 5612 -10477 -33114 -30017 -30588 -32480 -6915 13104 1632
27172 1632 -23499 -9912 -36789 -70428 -56245 -51138 -30824 -54150 -32530 37144 57269 -16473
27160 -16473 -74843 -91954 -90429 -94977 -38051 12018 43479 5777 41210 30960 -282 -34904
27148 -34904 -32052 -52774 -74122 -89909 -96450 -63104 -7033 58467 94440 77841 43933 -19449
27136 -19449 -19321 9013 39344 16008 14717 10931 7697 29015 10479 -10917 25461 21811 27826
27123 27826 26123 -9330 -7046 -14435 -4903 -17104 -17517 -7441 4070 -37336 -31496 -11894 31102
27110 31102 28607 -17570 -81244 -106839 -87546 -62676 -46123 -19818 -23001 3117 41838 39838
27098 39838 52165 29587 24724 49294 36377 46167 88774 68085 34737 22042 9139 -8555
27086 -8555 3924 7876 18386 22046 -12863 -38727 -36514 21963 39256 17921 -15418 -32707
27074 -32707 -42256 -84982 -84679 -59382 -21982 9226 -2553 -73270 -72691 -90705 -62440 -31763 -21383
27061 -21383 2716 8607 -15725 -14643 13181 -10397 -3717 11879 41699 28411 -4075 -40961
27049 -40961 -39084 -39692 -11339 45940 25409 19905 10188 13561 18642 16675 -47756 -72598 -45507
27036 -45507 -19509 -39749 -7079 34380 -2386 -18 49740 54148 25013 -31051 -5699 927
27024 927 -24982 -17192 -20053 -49184 -80855 -79823 -33071 -10678 -9245 -18675 -29574 -13366 9535
27011 9535 33086 -15537 -25647 -36065 -37190 -39921 -8024 -8053 -51482 -34835 -20903 2985 -983
26998 -983 -16853 -32853 -2032 13778 5379 -7201 -9488 10330 10283 17448 29385 30070 35920 24784
26984 24784 -35158 -79832 -70079 -68054 -51815 -18746 -18900 -37213 -68107 -82122 -91197 -60480 -3763
26971 -3763 -4718 -2682 -8206 14081 42952 73991 94176 58430 63538 27192 9887 41522 21791
26958 21791 -12525 340 7338 -7770 22502 -637 -10225 -12482 -17028 21331 6302 -38139
26946 -38139 -90776 -77104 -42848 28407 31837 17777 58999 72842 60899 68298 51171 31603
26934 31603 36160 32789 31129 41701 50496 -8774 9133 58446 72023 30572 114 14286
26922 14286 24874 -16006 -37627 -54511 -45944 2029 14681 -25670 -49511 -54945 -71705 -60930
26910 -60930 -27127 -4985 27762 49790 -15898 -24021 4055 11025 11033 3490 -42 -24282 -37587
26897 -37587 -80377 -44828 -5225 6043 13558 19772 -10985 -34390 -29179 -41587 -12561 5229
26885 5229 -17923 -19704 -6165 -33586 -63458 -53486 10059 21493 -701 14261 60457 107106
26873 107106 120377 49633 28071 26838 12527 -2018 10090 19845 21628 12384 -8914 5226
26861 5226 56304 35010 35395 26497 25880 25786 -27124 -53240 -45933 3892 -11994 110 44353 25142
26847 25142 -43253 -23934 32792 59134 68775 57606 32495 29473 49374 34249 30689 20473
26835 20473 -31422 -46479 -26572 -53653 -43703 -16425 -49572 -20640 18390 22144 -13260 -23364
26823 -23364 -8498 -11544 -32992 -22885 -2246 -22175 -32763 -40334 -74899 -47554 -40569 -33611
26811 -33611 -75133 -111991 -91950 -66359 -59934 -72432 -4308 35959 15704 34219 60259 60139
26799 60139 15104 364 -13561 -24553 335 -36418 -81596 -60107 -63144 -36964 1272 6675
26787 6675 41312 42985 50589 28336 -3511 -19243 -28561 -60494 -83087 -117581 -45175 23765
26775 23765 37006 -10866 -26098 -1869 -7930 -34859 -16195 -46821 -94647 -109545 -93169 -55933
26763 -55933 -58301 -64770 -63286 -62338 -78052 -87491 -67755 -29642 -34561 -51497 -2895 -13152 -2776
26750 -2776 5975 -7334 -21097 -21273 -20849 25923 71221 20516 -365 19597 12875 34377 44150
26737 44150 28246 -4461 -58510 -51645 12998 60832 111829 111899 82344 14019 -23551 -13562 13696
26724 13696 41250 38377 37251 16342 38137 29924 8149 -3612 -4351 -13972 -34784 -36170 -46217
26711 -46217 -40469 13319 34631 45732 71514 64517 24399 30839 42775 -4153 -25237 -11468
26699 -11468 18293 61822 38481 -20642 -28648 -16271 -11861 -31741 -43553 -47218 -48513 -28540
26687 -28540 -24496 -42604 -25884 558 50288 105301 67597 33761 51788 36965 18020 21532
26675 21532 11495 14760 13354 28785 22551 1441 -18175 -27060 -20811 -10803 -36249 -5735 -43876
26662 -43876 -33112 -82634 -84185 -27970 -11094 -18352 34805 18276 -21882 3413 15800 12959
26650 12959 16881 28956 3837 -17734 20985 29249 25935 22181 -5351 6466 53 -6506 -10685
26637 -10685 -10036 -5534 41311 46394 40514 3485 2984 13484 20062 24632 17979 30932 17962 52022
26623 52022 67256 52970 25470 19191 11641 -8303 15948 37483 70902 72404 52902 26288
26611 26288 -23339 -16701 775 28987 -13148 -22012 9649 -5456 15339 11753 -5365 -19931
26599 -19931 -10207 -24257 -28665 -15275 -14987 -49100 -60370 -25390 32578 75761 81159 60068 55724
26586 55724 57351 6381 -12626 -56651 -37232 1552 25012 59749 72926 37806 10647 1817
26574 1817 16576 9343 516 46705 79199 74139 25446 14019 41700 81354 78408 80636 46509
26561 46509 34017 32496 12991 35020 56346 40796 -5572 -13516 -15218 1007 9245 11843 13453
26548 13453 23218 34678 44571 22570 5598 33490 63304 29259 39295 16334 -28968 -14379
26536 -14379 -14008 -20328 -5164 8941 35268 28843 53744 35666 28365 24376 75221 54231 5577
26523 5577 -22306 12470 17989 7995 -2836 5097 17948 41847 36539 13160 6241 -15272 -19009
26510 -19009 -28761 -24378 -7597 -4754 -12653 -1925 13582 21343 -27756 -49543 -80571 -81277 -72892
26497 -72892 -79321 -109147 -88353 -41829 -25383 -31237 -14238 3371 13097 10768 14579 1522 50623
26484 50623 52317 21216 8566 25891 29455 75042 78668 52603 -128 -13388 -321 9807
26472 9807 68799 92585 24945 -11149 -23634 -37357 -27201 19824 1535 -7858 26898 38282
26460 38282 24878 22792 26108 29501 41337 33806 9519 16991 35079 -3486 -27222 -1937 2169
26447 2169 -14517 -17862 -15942 -35466 -34675 -21293 -32063 -38618 -27152 -4344 27456 21253 7126
26434 7126 -28694 -24029 -1500 -10976 -23308 -17812 2919 27148 14028 -11544 -10457 -23413 1762
26421 1762 4017 -33839 -46172 -44527 -48649 -45700 -1985 -20070 -54053 -12190 -17288 -47579 -22239
26408 -22239 -9574 -15763 43195 42378 10007 -7099 -18109 1879 19120 55099 77227 75752
26396 75752 81175 88862 70288 49765 62920 55732 25071 -8559 37865 32720 38531 29713 49587
26383 49587 23307 17157 44999 61901 24085 38494 10170 -2813 41450 69936 82412 71438
26371 71438 61494 46535 58292 41275 -12215 -46677 -73016 -64382 -52966 -20474 -5411 -25870
26359 -25870 -21472 26410 18322 -14412 -15098 12694 42736 59667 75094 72736 37764 15300 -8551
26346 -8551 -18713 -3446 -10221 -65045 -46482 -11993 -15573 -65024 -86113 -48513 -30675 -25834
26334 -25834 -35274 -5731 6306 46649 37970 37794 -11113 -48302 -49197 -57396 -23472 -27459 23360
26321 23360 42497 50701 45687 16355 -41584 -20207 7126 31831 67163 21903 -37468 -102092
26309 -102092 -95866 -53721 -6970 -13054 -46306 -49889 -56852 -83367 -96991 -22969 38373 31970
26297 31970 32926 36458 16545 21131 38940 -7100 -20465 -26167 -35911 -29620 -15474 -7394 22953
26284 22953 40631 25307 -27386 -10137 16278 -26518 -47100 -68929 -66896 -29846 4541 -2759
26272 -2759 -20021 -30247 -7598 28339 41981 -15586 -23772 -30015 -49537 -27492 -32974 -40148 -19795
26259 -19795 -24050 -475 -45576 -75810 -67924 -29856 10622 48610 46457 36125 15644 -23864
26247 -23864 -10732 16937 22003 -31832 -21030 -34550 -30387 -9128 9006 38140 5355 13856
26235 13856 -10808 -8315 9570 34071 15666 -17754 -53936 -54344 -53351 -30638 -57151 -37326 -7365
26222 -7365 -4679 -7147 42007 37665 -14046 13860 9414 27243 35210 51040 42414 12352 -15067
26209 -15067 -52186 -41293 -44931 -56693 -42298 -61383 -97205 -134905 -131390 -83673 -30923 -23624
26197 -23624 -29767 -5548 47941 43460 607 30363 24646 -16329 -31210 11719 1527 -28834
26185 -28834 -45501 -57096 -57432 -35288 -33237 -47672 -35984 33491 36352 -2348 12432 1175
26173 1175 1040 -11861 35509 54131 23354 5773 20110 23943 12656 -15510 -32745 -65383
26161 -65383 -69076 -34032 -21938 -50039 -46620 -36905 -55902 -75879 -82814 -44434 -43513 -39706 6938
26148 6938 21365 37732 18599 -14172 -48801 -50655 -23733 -26882 -46413 -12753 43370 55806
26136 55806 53327 24841 17519 -238 -5174 32414 -2377 302 11011 12240 39566 47268 31164
26123 31164 23486 56703 47055 13700 42795 49561 15153 7844 5540 -3451 -52510 -89104 -69549
26110 -69549 -48647 -46944 -71143 -56395 -16464 -4017 4004 -13631 -56413 -44505 -44233 -49092 -29895
26097 -29895 -43649 26789 25356 -1912 -1043 4717 7059 25356 26911 7486 -25809 -58769 -84703
26084 -84703 -105109 -133241 -142739 -100323 -108022 -76389 -28721 -24093 -37823 -69243 -97661 -16858
26072 -16858 28489 -26125 -75304 -61672 -43887 -34697 -9338 26969 27473 9943 10477 18176 9306
26059 9306 4444 27395 20127 -4178 -33813 -60144 -58230 -40353 -4549 17466 -4851 -10722 -21945
26046 -21945 -23067 -15919 -1788 2151 2842 -13613 14807 73414 41068 37952 40886 -5209 -31982
26033 -31982 -39416 -82075 -73629 -49701 33367 56339 19825 18182 7495 2916 -6714 -2771 14722
26020 14722 -15565 -84459 -81660 12063 73311 86770 72457 67825 39533 38946 30228 22443 -12405
26007 -12405 2309 -4772 -3987 17807 9750 -11850 -10872 -36747 -85964 -43226 31355 38147 19958
25994 19958 22524 27361 34334 -4140 -18644 -4368 -16442 -96 4056 -35293 -43367 -32654 -11028
25981 -11028 -31715 -26230 -50856 -24373 11194 15387 -1181 11855 15489 9601 -23314 -4456
25969 -4456 -13411 5290 18781 -15200 -21466 -33375 -42558 3727 31617 41099 36632 33129 8168
25956 8168 8235 -10167 -18913 -9266 25051 29535 -13262 -22760 -35552 -69181 -95804 -91587 -59401
25943 -59401 8873 54862 50396 39470 38060 70201 88633 112187 94271 47506 42317 6288
25931 6288 -54191 -50378 -32065 -37754 -14490 23172 34867 -18088 -38935 -38233 -16659 -9235 -21652
25918 -21652 -16264 -25530 -11024 43235 82562 63990 34791 31686 10983 26904 8314 32191
25906 32191 46966 27868 -11282 37535 65175 62299 15512 14911 -831 -58338 -45283 -59009
25894 -59009 -39211 -11008 -5200 21112 -2870 -24915 -80836 -81460 -80002 -66257 -46416 -36414
25882 -36414 -63271 -30973 17268 28438 31569 34814 -7169 13911 51442 91186 82787 60858
25870 60858 36656 74380 74025 37202 27870 24464 3745 -6367 5884 19602 23374 23294 26917
25857 26917 3076 52922 55625 10555 -3949 -3758 10632 40115 28046 -14996 -50841 -57999
25845 -57999 7816 58014 60494 30906 -9093 26994 63365 17294 4489 -41253 -67794 -43939
25833 -43939 -22229 -39013 -52866 -101713 -117148 -87865 -69390 -64019 -6907 -16532 -33300 -39574
25821 -39574 -35252 -2066 26203 17393 8664 2569 2780 14978 -12247 -43596 -29766 33483 69277
25808 69277 27253 -47668 -13133 -14560 -23129 -19339 -22384 -16856 19547 6208 -8338 -20337 -39818
25795 -39818 -20503 -32217 -39584 -77685 -87396 -38159 -1757 43802 65545 18332 -18316 -14134
25783 -14134 -25493 17550 27771 30280 49225 31759 30953 25480 5008 5096 15120 10697 11645 -4511
25769 -4511 -15349 2380 8863 3017 -11373 -22760 -25461 -50754 -30366 19359 41283 53928
25757 53928 91873 74293 53990 31917 34220 49532 1284 -18344 -16093 6761 -4050 8280
25745 8280 -4181 -3940 34128 57924 86869 75013 13889 -14290 -8332 12729 -6031 -42832
25733 -42832 -13783 25364 -19539 -33781 -8629 -797 -33077 -40823 -48638 -42589 -3719 25260
25721 25260 52103 34255 20071 35204 57106 34609 14518 -14629 -22830 -50337 -64645 -88133
25709 -88133 -68172 -54072 -11849 16731 27132 -2739 14580 36506 8171 -6670 -25756 -57604
25697 -57604 -50885 -78825 -118150 -110480 -101225 -86861 -92135 -65394 -24784 -64697 -94079 -64491
25685 -64491 -46060 -29947 9427 -2263 15606 -11449 -43618 -74339 -44274 -17123 -23216 -15981
25673 -15981 -33765 -16523 -20129 -26146 -29068 -1854 -845 -27974 -19307 -17770 -62161 -85030 -78491
25660 -78491 -95776 -97777 -69200 -51472 -62923 -63324 -64744 -47690 -54959 -54810 -25848 -32374 1863
25647 1863 34025 26346 12509 64959 80066 54830 -16287 -60464 -70761 -71507 -73286 -72710 -24707
25634 -24707 -3957 -10802 33374 43700 23278 53721 91842 108024 73186 3810 -14230 -35672
25622 -35672 -51329 -51370 -72579 -73718 -41913 -1733 -20324 -10881 15632 17447 -21777 -68442 -66878
25609 -66878 -55375 -53411 -39532 -34110 -60111 -15582 15446 -23765 -39944 2292 13679 33217
25597 33217 -12349 -46381 -37771 -30047 -10953 11882 -20449 -45099 -37125 624 6960 -2751 -12498
25584 -12498 -12145 -32497 -40362 -50769 -41075 -53124 -46841 -35313 -487 -16139 -33530 -36703 3233
25571 3233 10539 26941 9132 17796 28154 19117 -11247 1783 -15887 -61988 -44534 -60614
25559 -60614 -74314 -59546 -50530 -42366 13569 36397 44576 13686 -48146 -30183 -17913 -35403
25547 -35403 -68601 -49974 14177 5715 -10579 -24525 -8296 -26896 -8997 45531 60888 19957
25535 19957 23047 50809 61909 32712 -1100 27323 27715 21330 42501 73188 63547 33307 8065
25522 8065 4951 22254 -5511 -51164 -41929 -21132 40416 88789 68517 61801 40548 44448 35214
25509 35214 44089 22375 -7883 -10112 36166 37334 -12033 -24398 7306 411 9995 -22053 -16378
25496 -16378 7550 -45321 -85910 -70659 -7011 12199 -26148 -64980 -84680 -117176 -98327 -44495
25484 -44495 -24299 -2029 11390 -19800 30300 46194 40344 25811 -10520 -6452 28099 17132
25472 17132 -4299 30330 15274 -9425 -42387 -54158 -7012 -3848 -19168 -52179 -48059 -56311
25460 -56311 -65916 -48931 2567 -868 -39923 -56057 -35961 -23640 -8287 -9061 -10253 -16371 -26008
25447 -26008 -26324 -21696 -58541 -64428 -25956 18338 -8170 -25540 19259 12217 -13769 -12119 25953
25434 25953 76893 80874 76467 21759 -7078 11343 10673 -6985 -31044 -33635 23484 57985 61690
25421 61690 44665 8084 2987 -17602 -26673 -19530 -39084 -24909 -12981 1150 10782 14145 28116
25408 28116 7930 -241 14274 44095 93087 82566 46539 3048 -9030 -2185 -42687 -57703
25396 -57703 -39307 -3536 -39098 -37202 -8251 -25991 -24583 -5968 34576 24087 -2862 -21182
25384 -21182 -15231 18297 32333 44079 -5199 -1655 -9726 -17986 -10659 5355 30747 -8406 -32321
25371 -32321 -47920 -27586 -29505 -55051 -40204 -25570 -18085 34226 27650 13035 -45333 -73523
25359 -73523 -61859 -7936 -11594 -65103 -53460 -36135 -26887 -29799 -55365 -35353 -65919 -83262
25347 -83262 -43302 -21692 -36033 -14735 -3252 -14352 -61210 -61090 -33499 -13102 2818 -25078
25335 -25078 -65934 -28197 -16757 17163 62018 55481 51718 31322 -6338 11854 54874 70872
25323 70872 52489 21796 40913 37198 52493 39145 -31378 -58244 -54692 -465 48796 323
25311 323 -17482 -16470 -10363 1630 14041 8745 -943 -20671 -12620 8102 -10634 2472 5850
25298 5850 12356 -11976 -18113 -22092 16773 30255 24051 47720 56709 75703 49185 7989 -30040
25285 -30040 -55756 -35160 -22427 -61593 -22028 2620 -18483 -22031 -4652 34450 32522 -13863
25273 -13863 -33360 -36560 1747 43253 21136 25523 40192 80528 62604 76080 56160 7833
25261 7833 34823 52073 67405 66732 66508 24575 -7499 9542 30079 34982 17948 -8778 -14514
25248 -14514 -2881 5314 29640 38939 12093 -11224 -351 23548 -2906 -24548 -44444 -96113
25236 -96113 -56267 -26255 -29375 -18644 -3101 -37964 -32935 -13352 27957 21131 -14072 -53797
25224 -53797 -28023 -13772 -27195 -43028 -69592 -68909 -64260 -22758 15633 44505 39869 -5143
25212 -5143 -8751 23868 7949 -17197 -31305 -54465 3255 -1868 -22107 -12695 -34719 -36287 -37265
25199 -37265 -15248 14240 -7244 -30898 -33227 -35469 -54788 -17120 39896 112853 68718 22628
25187 22628 -19793 -53221 -35198 -19623 -2438 -13325 -3694 1022 19367 45138 30821 35605
25175 35605 40400 -37594 -27788 20285 8981 -22405 -33285 -46858 -42440 -12223 4265 527
25163 527 12574 10928 -743 -9833 -41479 -87085 -113709 -83224 -32621 -42397 -72159 -46036 -2119
25150 -2119 -8587 -55263 -68203 -59604 -23378 -10814 4598 44061 24382 30156 46539 37896 18239
25137 18239 53690 46383 35716 -19737 -71555 -78509 -53566 -26600 -38557 -36661 -9946 16244
25125 16244 -24398 -14335 9384 -12310 -14891 -12189 -30837 -10032 24395 41508 50588 33603
25113 33603 27988 14656 -55764 -34706 -8100 -52605 -25071 14511 7170 2465 148 -13929
25101 -13929 -9142 -12354 -56130 -51288 -5416 18787 34861 71304 31861 -11752 -25312 -29591
25089 -29591 -43523 -61646 -77852 -43808 -61679 -53194 -28381 -28046 -26350 -8381 30654 44714
25077 44714 22846 47473 23298 -11282 -34995 -48887 -43809 -28342 -5652 -12467 -6347 24527
25065 24527 16106 18222 24131 6852 -1700 1491 5809 18845 23169 57337 78941 45581 -6900
25052 -6900 -63253 -56873 -38107 -33067 -20997 -6448 -9507 -28866 -25803 -17233 -2045 22417 25832
25039 25832 19335 1976 48987 46935 45889 23066 22949 40385 47250 26539 -14407 -1336 25538
25026 25538 48764 53474 -2225 -37437 -51789 -45258 -30434 555 12159 17990 40895 36339
25014 36339 38426 15737 27045 17879 -933 33542 66245 43420 26754 8744 -19029 -25655
25002 -25655 -44266 -29377 -22047 33982 60653 67921 9636 -32138 -38173 -27673 -18242 -1214
24990 -1214 -42780 -67865 -51240 -14507 29162 93545 125374 99444 68589 19170 9678 48277
24978 48277 82657 57530 59688 -34 -45832 -11165 -8691 -33207 -16027 13890 8807 2686
24966 2686 -36860 -18721 13471 49674 37290 16931 -3319 -1691 -7143 -7179 -36480 -35069 -34453
24953 -34453 -9566 6851 48813 60648 67093 44202 65057 63773 58169 53124 77424 102974
24941 102974 84654 47614 45347 35564 45785 61319 -4877 -39252 33679 53379 27079 40214
24929 40214 18954 -11928 -37900 -51792 -47479 -25053 -16103 -4060 19265 18995 -7657 -44710
24917 -44710 -60285 -67596 -38947 -29598 2203 -33375 -43931 -24260 -42864 -65055 -20934 -35025
24905 -35025 -16829 -18675 -9264 -1215 -24924 -49537 -20226 -2990 -22106 -74813 -48795 -67342
24893 -67342 -40812 -38303 -30158 -27286 -13466 -4571 -45885 -68833 -80212 -53508 -28536 -51881
24881 -51881 -58817 -19851 -18669 -14348 -14211 -1769 -52489 -49525 -27803 -27433 -51346 -6410 31054
24868 31054 41007 46516 45221 43797 20683 -26036 -49379 -11428 7790 22472 -13083 -21158 17966
24855 17966 28558 37475 34722 27063 11800 -12317 -14986 -25386 -12292 7590 14976 14588 -14519
24842 -14519 -18589 -23835 -33802 -40477 -49568 -12415 35807 60251 37211 51182 57961 34565 23607
24829 23607 -10391 -38708 -26192 -59003 -60245 -57945 -33592 -34534 -17855 -29564 10192 47886
24817 47886 57347 65800 42703 38652 48765 15383 16079 -16405 -88001 -65787 -7644 -20067 -50509
24804 -50509 -19892 9925 -5341 -6732 -24382 -63057 -46245 -32863 7018 35299 31734 -17132
24792 -17132 -8632 13206 -6914 -9310 -35304 -51912 -55386 -25695 -19768 -6919 -33018 -18602
24780 -18602 2408 -48054 -102703 -117650 -101393 -81196 -38785 -9226 6904 3857 -35131 -41126
24768 -41126 20556 60388 45649 39810 8875 11638 6985 15881 12657 48 -65078 -84814 -63910
24755 -63910 -11359 14908 -12902 27465 100152 110829 86184 56355 20683 9548 53453 94765
24743 94765 88762 84367 87258 54174 59529 76106 77459 63908 46924 35237 1897 -20338 -2188
24730 -2188 50657 79165 52833 167 37301 90756 72796 61314 52190 49759 36332 -8419
24718 -8419 -32793 -56412 -15706 1839 26226 15218 44449 29300 -616 -33420 -51328 -48297
24706 -48297 -94280 -94399 -42840 -6551 -25587 -52684 21066 46741 -1595 -48218 -21518 -6963
24694 -6963 -5923 -15251 -5908 792 -35929 -76341 -26408 -12369 -3564 2984 15163 -19106 -25448
24681 -25448 21829 -15078 -37404 -48453 -85560 -40983 471 -27474 -62478 -59923 3712 -28517
24669 -28517 -31678 -39465 -56337 -26286 -12218 20905 51348 93458 107995 62252 59419 25340
24657 25340 9346 22763 61006 61436 27786 -12822 -19442 -10775 -17377 -58123 -62259 -50723 -67009
24644 -67009 -43320 -52381 -89434 -68381 -27494 -43381 -42954 -45505 -30089 4496 28234 8354
24632 8354 -4912 -4844 2475 -56420 -51855 -24014 -16593 -58075 -52970 -16323 -30208 -84619 -75280
24619 -75280 -64005 -36229 -66080 -66555 -32289 -22466 -52943 -57800 -32891 -21403 4569 -5372 -25538
24606 -25538 -35326 -18624 -8460 -24947 -37371 -11912 8795 54749 70166 62969 20418 -38980
24594 -38980 -66433 -87611 -92755 -19516 27871 35301 40571 50416 40437 -11624 -25579 -38815 -36703
24581 -36703 -38775 -60064 -86422 -77215 -47540 -14612 -15858 -18250 -29485 -23695 -29234 -11079 -31377
24568 -31377 -54439 -20530 -20817 -49230 -26680 14744 12222 30872 44345 30256 18636 7185
24556 7185 24088 55520 45564 5515 1752 1604 4267 51316 52255 67786 47724 11353 19011
24543 19011 63503 38595 13044 -12080 -28042 -24721 19582 54375 46319 9730 -30304 -16766
24531 -16766 34121 53774 29823 21901 -27158 -46308 -31009 -14807 11186 5620 13377 65320
24519 65320 92138 73715 46107 52191 33682 6887 30118 58076 -7598 -52904 -41331 -81920
24507 -81920 -90437 -78730 -91521 -33677 -22354 6186 6498 20830 43797 60183 30868 -9821
24495 -9821 -49858 -8752 23918 15293 13193 -27158 -9260 -6984 -13188 12085 47490 61032 40807
24482 40807 -11607 -26114 -24926 50 33849 25053 40819 67136 68360 88351 101910 112681
24470 112681 102397 65493 67901 81624 88410 83396 73189 54688 45651 48627 57078 55528 22098
24457 22098 -28764 -40666 -33891 -53455 -48315 -9913 28715 9812 11123 8309 3388 53502 63984
24444 63984 -6209 -46102 -21046 -24063 -23025 -16344 2499 -7813 -8489 -11146 -13796 -45464 -66943
24431 -66943 -50232 -34396 -41852 2200 -10341 -18513 -449 -10280 -50470 -43401 -26850 -11886
24419 -11886 -10678 -38176 -14635 5679 4626 -217 21926 8832 -41703 -28849 -24574 -10132
24407 -10132 -26222 -11384 -15746 -57087 -52254 -19186 10234 -839 20174 40095 13805 -11426
24395 -11426 -35253 -18487 3659 21253 9058 10785 26179 11073 24428 30163 10424 -9888
24383 -9888 -817 28160 32973 -23769 -45294 -43247 14946 44818 55900 83459 50906 -4619
24371 -4619 22922 60261 68594 47639 47378 47291 39629 35802 12853 34935 14233 -22340 -5401
24358 -5401 48363 37749 26931 53447 80171 64209 46743 -8302 7037 22391 11171 -7628
24346 -7628 -24165 -14403 34488 12813 -9880 -9942 16270 5715 -13353 -8125 -5182 14236 -2119
24333 -2119 -38774 -40704 28343 46494 14830 9889 -1776 -5288 -15869 -25884 -52758 -65453
24321 -65453 -7471 34584 65358 76155 78088 47553 42661 55441 19903 9679 1926 21424
24309 21424 6352 -12120 -7141 5008 -15727 -20053 9470 23957 -33435 -35025 -3900 -11149
24297 -11149 16629 -11443 -6588 -14992 154 12834 61844 49079 -19958 -32112 25799 55839
24285 55839 40704 5762 13975 12569 38053 30116 20209 -35833 -48058 -15026 -29844 -58419
24273 -58419 -49840 -33646 -23359 60649 73762 7027 -33974 -30242 -15367 33047 44140 -23054
24261 -23054 -39110 -4834 -6795 -20186 -61767 -81012 -62966 -19371 33154 50553 32821 -21632
24249 -21632 -44084 18790 14391 27827 30026 -7082 -44191 -33567 -24415 -49353 -13412 39880
24237 39880 7418 -33217 -17994 30566 34340 21769 56192 13683 -4959 -28363 -51973 -72130
24225 -72130 -103093 -66803 -7858 49312 48245 12191 -15317 -65962 -66521 -29560 -18351 -4665
24213 -4665 -24894 -41969 -42610 -27898 -1304 -6487 -41365 -57315 -20383 -29726 -51585 1896 46518
24200 46518 13669 -22999 -49258 -56948 -5553 37809 43811 -11305 418 59241 63387 54979
24188 54979 49634 56672 38550 -1091 -12664 -17867 -36117 -65316 -86597 -66590 9076 39040
24176 39040 27575 41815 43121 23179 -9565 -17433 -47352 -56570 -64558 -65950 -31686 2935 33420
24163 33420 48253 61159 28238 9125 -10362 4041 35627 38829 33891 -2913 -28415 -30984
24151 -30984 -19663 -4406 13406 14531 6504 -30734 -44243 -46885 -77686 -79696 -44264 -12271
24139 -12271 -25890 -6123 -10367 5391 48804 36564 -8380 9890 2216 29303 40331 15062
24127 15062 144 14430 -5470 -18565 -39660 -54858 -40155 -39117 302 32905 35834 56278
24115 56278 30135 -46944 -39012 688 -28288 -52222 -21524 -46274 -75792 -5803 44483 69556
24103 69556 42863 28481 20782 30811 2055 -8920 -32177 -6672 -7231 13606 24551 -8056
24091 -8056 -7463 3630 35881 55899 33665 -18879 -21425 -13469 3718 5781 19718 15891 -12901
24078 -12901 -35610 -49254 -45771 -13218 3820 37948 60894 27204 -3504 -27319 -11050 -24834
24066 -24834 -60685 -97047 -91745 -25152 -3131 -14361 -18514 -9083 13234 -6017 -56866 -106685
24054 -106685 -126329 -101875 -42072 -12711 -16666 -28289 -33224 -35008 -30314 -62760 -36050 -32407
24042 -32407 -42010 -9143 30156 48534 8844 -3747 -5268 40536 81764 39702 1612 -29173
24030 -29173 27903 49788 65117 80329 59422 70514 65484 16083 -8851 -27965 -45950 -37144
24018 -37144 -36406 -60075 -1528 28608 -13612 -56934 -43284 -38098 -39018 -45869 -26037 4197 10661
24005 10661 30547 40151 3772 11805 4532 -10617 2691 13203 -1549 -8450 -26509 -27308 -435
23992 -435 36328 7079 -12532 -8201 -15556 -4875 8470 -6544 4938 3683 -20679 -26859 11420
23979 11420 3285 -22612 -14962 -22814 -17487 -19168 -11066 20545 62129 39718 60978 32535 -19214
23966 -19214 9773 -6164 -61688 -33049 16893 5038 -34080 -34692 -5588 -12425 16112 31669
23954 31669 36501 43467 14773 -63191 -74395 -52654 -41172 -64129 -53790 -22621 -11665 3384
23942 3384 -22413 -2623 -10789 -60682 -73850 -31102 -5024 6222 8453 -21849 -70560 -36991
23930 -36991 -7550 3761 -1821 -35885 -49911 -53663 -34721 -40655 -62597 -62769 -81471 -102804 -105923
23917 -105923 -49846 40385 26602 30878 22509 14122 -1253 -5227 -25995 -1204 28077 47080
23905 47080 28957 -16543 -39930 13128 46699 7550 9685 38178 79049 46299 1578 5323
23893 5323 13278 25645 53170 85348 126788 82724 24509 15045 814 -1702 12723 11532 9937
23880 9937 39756 34384 28450 23123 10851 -2196 -28780 4875 32548 14484 -3860 13771
23868 13771 3937 -3053 -9057 -25338 -22039 -10949 -119 7869 8116 -55134 -68575 -49501 -75243
23855 -75243 -49914 -50158 -26162 -47718 -73744 -84057 -62854 -66128 -62888 -42436 -51165 -9866 31930
23842 31930 22085 3789 -3872 3174 -12097 -41845 -22062 -21555 -18474 -31140 -35937 -3308 -14065
23829 -14065 9246 17835 -29408 -49664 -49007 -32215 -30464 -2839 59849 56470 12137 -36706 -30337
23816 -30337 -14674 -6777 -7226 10521 11253 -11569 -18928 -24473 -46474 -16326 1310 34863 17717
23803 17717 -13699 -51249 -29430 -23355 -23102 -15484 3552 53486 32493 -30786 -24018 16534 46953
23790 46953 57188 52466 64064 30190 36555 75995 33650 25430 24588 5039 -29867 -15876 1343
23777 1343 11962 1602 40464 35294 8557 -27176 -51101 -421 -23134 12009 28121 -14486
23765 -14486 -38535 -3599 -11807 -8252 8697 46685 18150 19031 6520 -12333 -28061 -47438
23753 -47438 -35002 -47869 -71651 -68909 -48474 -12902 -7839 -37264 -3041 18988 -34739 -9062
23741 -9062 3167 -26134 -29998 -5013 -12249 -9794 -13507 4094 46669 32515 -10034 -6984 18908
23728 18908 30025 -35266 -72902 -41825 -39794 -13376 -221 35705 43076 53914 33620 10750
23716 10750 -37891 -44632 -37528 524 31145 20979 -24783 -47316 -50358 -33399 36835 37004 16419
23703 16419 -811 -49656 -27815 14514 28731 -38050 -57275 -118971 -139094 -91174 -32488 6379
23691 6379 -2493 -65830 -46824 11658 -5959 -3649 26597 42672 55298 24990 39251 16900
23679 16900 21333 49739 33073 21385 8016 -33190 -79679 -75669 -90069 -72332 -63498 -66850
23667 -66850 -85726 -112623 -67944 -3508 23866 6511 -17762 579 9071 -29410 5733 47983
23655 47983 36401 37324 9557 -17223 17338 2124 -26530 -17493 -24532 -55058 -61636 -41607 -8979
23642 -8979 64793 84946 31837 -5199 -22278 -26030 -1616 6145 24783 50299 64737 31531
23630 31531 -28086 -48844 1777 -8934 -23313 3289 12964 12517 19708 3173 -10335 -44325
23618 -44325 -42178 -5763 -17558 -14293 -3086 -882 15482 997 -35167 -95992 -96063 -91182 -36561
23605 -36561 -62010 -122288 -77963 -20020 43840 48429 31831 30443 20154 -4178 -17210 -18857
23593 -18857 -7036 -14265 -26893 4219 10774 30654 51595 22911 35263 40645 11527 49080
23581 49080 71629 76387 42937 -10913 -17861 17171 43947 67142 64012 38031 65151 43758
23569 43758 -31745 -21220 7724 -15821 -48433 -23110 19784 515 -9823 9607 15009 13136
23557 13136 7968 11442 -22507 -43996 1857 6428 -6682 -50253 -72192 -37807 -9954 25764
23545 25764 68199 67446 53898 18742 613 -513 -7834 16636 58105 91088 108591 51513
23533 51513 -9205 -73128 -58999 -48961 -62361 -77965 -56222 -20469 6223 26735 23663 29036
23521 29036 28458 59441 44583 3642 -45531 -66814 -32260 -25167 -37996 -23185 -35420 -57468
23509 -57468 -59623 -70435 -38448 -60466 -99848 -133394 -90611 -21396 -4612 -13145 -9159 22203
23497 22203 37051 20434 -7559 -7688 -24434 -81563 -65215 -70214 -76989 -54758 -35853 -56672
23485 -56672 -73966 -59924 -60061 -35069 5736 53357 42235 -3706 -34890 -1378 70498 72914
23473 72914 -2798 -49017 -13109 48992 52558 -1065 -33279 -43348 -49608 -49956 -43550 -45802 -15641
23460 -15641 -5033 -26830 -50618 -31190 -550 14737 -24974 -55059 -38084 -93875 -99739 -62615
23448 -62615 -15375 453 -11415 10412 13964 16678 29080 31654 5466 -30621 -16501 -43113
23436 -43113 -45420 -36813 -26703 -44475 -34140 -14035 -19514 -68967 -83334 -60487 -47581 -37863
23424 -37863 -44184 -42827 -54303 -86852 -70361 -43864 -48701 -53570 -22553 -7834 -3907 -1065 -36211
23411 -36211 -46462 -63483 -11073 -17238 -10871 -29177 -43088 -74751 -98115 -75703 -45430 -56252
23399 -56252 -21962 8623 24537 51616 57936 46534 53144 2931 -88538 -89567 -76204 -59432
23387 -59432 18941 44286 59234 35272 -13001 -42051 -63282 -51770 -24176 -1470 14889 9961
23375 9961 65333 35636 20237 -5257 -42745 -12345 6838 820 41685 22887 22316 16241 20004
23362 20004 -24105 -40031 -80635 -22940 36913 83139 98096 48436 59325 44505 29708 19660
23350 19660 29632 57230 59129 86536 91996 44012 18715 -12153 -42087 -47965 -31392 -788
23338 -788 -7 31900 28824 -9317 -3288 -44583 -47999 2216 29358 15129 117 -22301 -37439
23325 -37439 -60025 -65720 -38894 -41523 -2693 17053 40258 66794 86661 75986 24618 20480
23313 20480 20369 24160 21433 18603 18291 -8037 -8070 -19289 -58898 -44689 -775 -42850 -52716 -19293
23299 -19293 10464 30878 25096 14367 -16351 -7045 5382 -24199 -5447 17677 -6920 11910
23287 11910 34816 46687 50667 68301 86372 71593 60182 30595 15485 -21641 -55375 -63189
23275 -63189 -59092 -20382 -21322 -37230 -37485 -11168 -20250 -20891 -19657 -37586 -43667 -35119 17690 47062
23261 47062 46440 61219 56469 6350 -19034 -19312 -6695 8414 -15104 -17493 -2874 15884 43718
23248 43718 61968 6444 -15110 -30404 10426 22478 -27537 -36536 -15756 -19724 -37346 -45939
23236 -45939 -45073 -46733 -45312 -19832 -24445 -51051 -49330 -37590 -54375 -27061 -48889 -35974 -2547
23223 -2547 10181 -3606 -11649 -34216 -24150 -18800 6599 22747 8122 25232 64234 39008
23211 39008 40374 -1516 -13077 -30188 -24713 -16614 -17691 -23947 -29199 -34286 3149 349 25469
23198 25469 14190 23097 31463 56868 28570 -9006 17742 -14364 -68473 -52670 -58596 -45480
23186 -45480 -58627 -53591 -39687 -24242 -32623 -62030 -52681 -23498 36429 12735 -26764 -62379
23174 -62379 -55898 -10419 10649 7484 32453 42052 15291 -10715 -11475 11508 11904 10682 32675
23161 32675 46463 53598 55850 27540 4963 15553 20466 -38340 -22862 21726 77772 107689
23149 107689 127981 136766 93705 18602 7529 1681 -15528 6594 27616 27864 34425 46154
23137 46154 44615 44861 50224 35445 32820 44485 57347 35803 18762 20807 14172 -31873 -28958
23124 -28958 -8866 12627 -1606 -28804 -50899 -44102 -52802 -30222 -6547 -11692 20576 15063
23112 15063 35588 33728 -9555 -2639 14473 10339 68782 67682 49044 54440 46555 20886 -5259
23099 -5259 -7507 -37216 -41395 -16792 -33856 -29817 5995 27839 9737 -1024 4412 13321 -5201
23086 -5201 -20010 -716 -3268 17581 42746 34659 21041 9214 -18258 -26967 -16368 -10741 3105
23073 3105 14078 19484 24100 36396 18618 -2912 19094 38050 13489 -29324 -37478 25005
23061 25005 31595 7768 17676 18244 11492 -32404 -16482 -20515 -45375 -58010 -45931 -19543 -45625
23048 -45625 -30071 13361 38804 39519 35197 11637 -21060 5372 -7577 -45289 -48958 -67181
23036 -67181 -61172 -6333 -7728 -29910 -40001 -32058 -9260 5766 17681 17009 20228 6945 -34994
23023 -34994 -33381 -38954 -32671 -54479 -32290 -8423 21725 1149 -22046 -9315 -907 -13920
23011 -13920 -4449 19105 2738 -32411 18517 -5128 -16167 -8226 -18504 -3579 -23615 19939
22999 19939 22297 12282 16245 11859 -8753 -43 -18618 3927 3151 2988 2349 26405 30688 29068
22985 29068 36030 29409 34391 27621 37657 20285 1281 5909 24011 57413 45185 46243 25838
22972 25838 18830 43051 56964 41064 36637 37860 31798 19090 12821 1688 -1373 -10669 19944
22959 19944 1885 -11068 -25014 -24706 -32441 -58238 -50698 -735 28143 16479 70633 69042 73436
22946 73436 54176 41113 36498 19801 17192 23811 48633 3527 -47469 -32489 7355 20084
22934 20084 3794 -24283 -2884 -21890 -37840 -65211 -54707 -31769 3581 35040 51691 13904
22922 13904 -19467 -15258 1879 -5456 24765 24789 26063 -9823 -1 -3535 3109 27301 11792
22909 11792 29881 4541 6484 -6355 -22613 -53473 -61519 -37468 32375 -5420 -25711 -43536
22897 -43536 -43209 -47483 -37340 -31578 -15274 37774 39349 15206 682 -1516 23205 28217 35405
22884 35405 32275 -11364 -56577 -75096 -50320 -17897 15234 -3011 6508 25379 -3908 -24777
22872 -24777 -8555 30457 27750 -18982 -85855 -104205 -105527 -94785 -49208 -54430 -73911 -76276
22860 -76276 -32479 -8447 -14732 -13025 18182 20819 22793 23337 -23021 -51859 -75821 -49546 -32097
22847 -32097 -57665 -27028 -23084 -21235 9888 20848 36237 29972 -22751 -29500 -33779 -64484 -68861
22834 -68861 -18572 -4895 9154 56167 29714 -15964 -15628 6230 6547 6174 14324 45263 80642
22821 80642 85354 77867 53130 28060 -19511 -64658 -47569 16513 25180 9829 -12277 -3124
22809 -3124 13329 3994 31758 41362 25721 46156 76278 53513 12295 -735 -14487 28520
22797 28520 51088 91736 61851 26977 -11527 15338 -1221 -34998 -17870 -35742 -70210 -65444
22785 -65444 -68976 -63269 -30446 -28473 -52550 -28304 15790 17520 -21485 -30305 9703 8675 5021
22772 5021 -298 11667 41041 21159 -37358 -46080 -40886 -65192 -48881 5731 20806 48262
22760 48262 40889 6504 442 1077 -4408 7352 -17200 -10112 12996 7540 -17129 -42650 -34929
22747 -34929 -22789 49056 57986 20987 7630 10819 23062 6462 -9992 8295 -1401 -5567
22735 -5567 -35191 -50961 -51288 -78698 -94266 -79334 -43814 -38309 -37449 -16687 -18491 -46449 -31208
22722 -31208 -10838 -14422 -7135 17743 19131 3817 -3079 -16870 -39068 -20279 13763 46098
22710 46098 85041 92978 69027 41955 48331 17221 742 28289 26526 6814 27078 46405
22698 46405 59472 4363 -8082 6691 35164 36845 46069 70971 60096 36169 41024 13257
22686 13257 -22570 -7258 37490 44864 47294 25992 26084 -20053 -26707 -37796 -5458 -16323 -22401
22673 -22401 14658 96133 96812 37102 16527 35156 43123 84323 78899 59175 28236 -537
22661 -537 41104 57927 -14483 -38538 -28125 -45401 -56163 -84690 -90055 -63137 -14878 1182
22649 1182 -10952 -29631 -29576 -16238 17438 5694 -11390 -65019 -18740 31053 14631 10409 46247
22636 46247 45442 113 437 10129 21859 50069 43823 -13520 -43360 -39604 -39801 -5541 -5415 -47976
22622 -47976 -8328 26824 -26756 -99286 -87605 -71327 -75301 -107226 -32551 -19234 -32859 -86372
22610 -86372 -81219 -46104 -40626 -13266 -18806 -18906 14873 47098 32526 29012 36592 37442 62041
22597 62041 31879 27644 46529 54192 33452 4132 8335 5662 11041 20931 -22987 -29798 -59679
22584 -59679 -89080 -101744 -65024 -40921 7194 24580 -7257 -10807 -24474 21215 32564 8076
22572 8076 18517 -1317 -11994 14814 16622 7940 -43123 -39577 -20332 -39098 -48619 -59449 -29267
22559 -29267 -7020 25801 31515 19916 16884 -16920 4766 7768 22298 38712 22834 9958
22547 9958 5737 -14002 -67655 -64732 -54058 -37815 3510 -1005 -28020 -24903 -19240 -16835 -15872
22534 -15872 -10433 7942 34889 -2650 -9485 20783 11574 -17285 -27436 -32112 -23515 -3592 -12152
22521 -12152 -10234 7490 -22527 -5858 203 25089 23228 19249 9538 2094 29561 16989 -4199
22508 -4199 -3308 15276 6780 514 36040 32828 33207 7698 18234 28841 18578 12309 1157
22495 1157 15032 -13263 -10621 21080 71190 64890 62834 65042 28445 39032 35387 25068 31474
22482 31474 60388 50030 60966 61977 99015 58912 15853 61163 89341 59830 48447 22494
22470 22494 -1120 17363 33974 26506 10761 51047 102750 98441 77934 74738 33652 44718
22458 44718 41664 50276 40245 37158 50737 54603 57893 68902 69826 62385 57400 37423 -981
22445 -981 28020 90125 63824 35595 -904 19706 23458 27761 -3132 -39981 -32407 -22596 -48152
22432 -48152 -69421 -61850 -65823 -31570 18720 3545 -61586 -92873 -84169 -55353 -26566 16896
22420 16896 -3628 -22272 -45471 -98685 -104055 -24232 -2245 -7325 15872 36380 28780 -16385
22408 -16385 -33567 24737 63000 48109 4645 31113 37444 27853 22444 -18488 -40196 -33758
22396 -33758 12371 -10220 -11980 25814 16348 3844 59750 78531 64995 88555 62034 -20814
22384 -20814 -23020 -56873 -103504 -49588 25323 83146 95169 41249 7399 -9809 3731 33168
22372 33168 30150 22919 -1736 23169 -5225 -29204 -27901 -20584 -20755 -63703 -56666 -32781 -56837
22359 -56837 -117506 -141341 -86001 -80445 -61614 -55859 -98269 -75236 -47388 -39590 -52466 -41555
22347 -41555 -36987 -25853 7036 26378 31307 29432 13426 -85981 -48490 419 26685 2140
22335 2140 -47968 -21009 -10506 -28640 -11617 -57718 -75234 -59443 -31588 1918 3345 -13373
22323 -13373 3303 67243 52423 -14656 -43517 -32085 -17034 -20125 -6282 -8146 -41751 -65742
22311 -65742 -3125 38612 35390 38439 26660 3871 2969 9002 -39305 -54232 -39939 -22479 -12353
22298 -12353 -16383 -2382 16368 64527 18191 -8188 -61976 -97378 -107765 -57893 5708 13266
22286 13266 -18658 -27384 11503 13589 -9813 -39213 -9948 52296 80161 42199 43956 64179
22274 64179 80274 41750 -21273 -63564 -60699 -43961 -22336 -11912 -45840 -40351 -33250 32901
22262 32901 102891 70552 21974 34124 57659 45982 43074 -5390 1981 7749 6994 39323 57531
22249 57531 24661 19134 74969 67136 29643 -13070 -7051 -4451 -16477 -27915 -13503 -15727 10390
22236 10390 3054 5269 -48777 -112524 -58144 -31448 -30293 -26709 11777 36275 9428 -499 29722
22223 29722 19102 -35429 -59904 -31707 6283 13595 16179 40160 69734 59043 51776 12366
22211 12366 -38631 -81940 -104756 -64239 -27586 14369 12672 15276 21022 857 12487 -10330
22199 -10330 -30286 6601 28695 36324 51223 65437 78026 40372 13355 12012 -27846 -5042
22187 -5042 36038 26462 52897 78392 91697 90189 120693 127235 50508 1741 -2445 27167 72888
22174 72888 63864 36157 23334 14725 25548 8261 2997 19301 20885 49689 41979 5416 5763
22161 5763 18513 19603 9510 20007 25480 1804 -16271 -26706 -23836 -26320 -15195 -19158 -45254
22148 -45254 -27678 -16112 -5854 -14449 -22339 -12126 -10383 -12838 23165 54603 50680 6533 17822
22135 17822 2400 -9053 -28799 -50078 -55533 -86241 -64689 -28854 -19543 -12081 -14570 4671
22123 4671 12455 9598 -8599 -25747 -4835 -23551 -33005 -35260 -51868 -74655 -97301 -27248 26980
22110 26980 -8343 -29404 4943 16598 14446 606 -35709 -22281 -7560 -41005 -61038 -61097
22098 -61097 -49051 -43443 3961 4499 9716 20953 3605 10497 -27476 -24627 31873 58644 41379
22085 41379 37076 20037 -13130 -6558 -22351 -45202 -57580 -34010 -14881 -6155 -1500 -37489
22073 -37489 -77922 -41948 -6357 -2019 -9043 -19188 4347 -298 -2509 6742 -18118 -43938 -32914
22060 -32914 -21472 -18771 9383 14949 -101 -5254 -13787 -18986 -4951 -5904 5038 534 6330
22047 6330 -44356 -70184 -57608 -54114 -54181 -21695 -26211 -8809 -35660 -46158 -36229 -14513 10733
22034 10733 44355 67029 9474 -33261 -65760 -107789 -128034 -130507 -85487 -40511 -36430 -19153
22022 -19153 -48431 -77892 -66487 -21405 -1026 -3626 -3452 -1160 -9670 -23474 -49674 -92056 -127993
22009 -127993 -94420 -61211 -47387 -27602 -17012 -20677 -2099 1710 -5983 -23933 -50160 -41140
21997 -41140 -9939 4587 64939 74072 51616 11381 20457 15965 59027 36188 -35524 -19783
21985 -19783 -864 9403 -24693 -59634 -19681 1573 -17692 -23002 -42077 -81822 -73267 -16069
21973 -16069 -53099 -56766 -23605 -86100 -57711 -21438 8670 10883 19374 6791 25645 6704
21961 6704 -45566 -18260 5329 9059 1597 6476 16163 4740 -9489 -28169 -44753 9833 57190
21948 57190 100133 126668 75593 32550 8767 -11950 9320 20105 35675 32731 15353 49641
21936 49641 37838 2983 -14042 15799 12729 -13669 -36385 -33996 -14083 -37628 -52853 -44241
21924 -44241 -32626 -80214 -115982 -68603 2110 7057 -7510 -35537 -53679 -50065 -7 16140
21912 16140 -28126 -59182 -43467 5595 13527 12859 -3672 -45750 -11381 8930 -25557 -11315
21900 -11315 -17139 -34497 -30816 -30839 -44911 -39570 -52514 -49807 -76963 -105304 -81658 -98581 -119098
21887 -119098 -111397 -90290 -70074 -34430 -72871 -91802 -28590 -8059 -10642 -3692 -15316 -39137
21875 -39137 -18604 48311 72974 23480 -13085 -22319 -17785 -27343 -16954 -9892 -33666 -69522
21863 -69522 -49519 8153 24667 44727 -6258 -8906 -3023 -24206 -30535 -32363 -99817 -134115
21851 -134115 -82977 -30966 -2952 33206 37673 38135 16469 -6935 11218 946 -36927 -20518
21839 -20518 5538 28252 35365 52617 25235 1673 41880 72312 91519 71082 68656 12924
21827 12924 36774 -1136 -5795 -42507 -48475 -41572 -70161 -68380 -13947 25147 2170 19809
21815 19809 69753 55510 29132 57961 34921 26900 42822 18776 19834 26155 -1854 -13724
21803 -13724 20801 57395 83271 71800 52345 33963 88535 76538 65606 43472 15137 16899
21791 16899 18550 43827 40448 37868 36031 -12946 -20194 14658 -4075 -13232 -17969 -89073 -87892
21778 -87892 -74605 -59717 -25886 -89421 -83858 -14888 27542 4068 -139 -28263 -24430 -8788
21766 -8788 -36260 -45270 -29756 -44548 -5544 47682 28627 8680 1752 -47750 -42394 -39983 -12744
21753 -12744 10911 -14572 -27967 -10435 -30493 -15945 2477 4650 32296 42753 45858 34930
21741 34930 32515 11949 7804 -5412 -26027 -8220 23453 49641 67201 -9643 -36745 -26705
21729 -26705 -28595 -33074 -62107 -59094 -80880 -61665 -56235 -31571 8676 13341 13479 -7491 1320
21716 1320 10206 11066 38019 52051 16220 -4718 17619 50557 45739 48632 7716 -28755 13273
21703 13273 -16635 -17100 5672 6420 50208 41697 -40 -12257 8537 49742 59447 58165 18276
21690 18276 -11128 671 20180 12760 -30904 -37860 -34089 5706 42311 44817 39732 16250 3753
21677 3753 -11115 9554 68492 77970 92188 101329 81335 36148 -9482 -14616 33026 4487
21665 4487 -3834 -5473 11890 8149 2862 13049 -3014 18121 6780 -22581 -27120 578 17561
21652 17561 6767 5306 -2202 -10248 -7235 12618 70339 84250 89318 110445 108332 92284 63405
21639 63405 54312 69362 44970 -13493 -1032 45940 28320 -25472 -70883 -43086 -34216 -29008
21627 -29008 -36345 9123 79225 66540 -12598 -38867 -66642 -64458 -69249 -102245 -110351 -109874 -35329
21614 -35329 -10931 -24028 -5778 25383 35026 28121 4381 -24422 -40667 -42416 -41983 -54272 -58250
21601 -58250 -67175 -66180 -66531 -64853 -81647 -95072 -92182 -55360 -19246 -30063 -13225 -28165 -29950
21588 -29950 -43277 -7025 -10213 -30490 -67061 -15930 91286 93145 40271 67781 98662 65484
21576 65484 77439 61683 19559 -26108 -55527 -76412 -61532 -51450 -81758 -66133 -40870 -17906
21564 -17906 -31148 -68969 -59585 -8079 26857 49913 54028 32905 21055 16044 43760 78497
21552 78497 49055 20902 6471 -78408 -70876 -33009 -32151 -2384 18340 3003 21323 47771
21540 47771 49882 43893 21161 52558 5512 25957 52494 31573 54358 76832 47095 45233
21528 45233 52519 63324 84454 56132 -4745 -58285 -65077 -67305 -59187 -53600 -31086 -22210 -42484
21515 -42484 -74243 -30239 18596 31084 -11318 -35540 -52119 -83288 -108158 -71817 -74171 -91974
21503 -91974 -31902 -26248 -19303 -37366 -31899 -6519 -20186 -17800 -7757 5763 -32626 -29588 23016
21490 23016 26635 9909 59848 61883 16814 -12225 -7553 -4097 -31479 -35663 2340 -13594 -33581
21477 -33581 7327 21172 -21802 3329 12243 21494 55006 21205 -20460 -31118 -47888 -60593
21465 -60593 -97155 -114116 -83470 -87594 -62358 -55941 -68825 -65040 -41271 -13659 -13787 7896 28301
21452 28301 35320 7204 -10230 -4542 -12583 -2766 12139 -7935 20010 28250 11209 1496 -21088
21439 -21088 -19518 9918 -16427 -17638 -25548 -19785 -23875 -65278 -35924 -19037 -22121 11343 17080
21426 17080 42001 55142 49662 49880 80442 42778 28517 53008 60025 50742 52463 24716 28109
21413 28109 51282 24897 17604 10581 8815 43915 10792 -10527 -29227 -15178 -50286 -66081
21401 -66081 -59717 -22217 1248 15030 15302 -29903 -52511 -48241 -74979 -71986 -54914 -36351 -2274
21388 -2274 13794 -1053 1933 23411 18208 19932 19929 31563 -7118 -17956 -629 40784 49295
21375 49295 12008 -10616 -4574 -2912 67250 56668 13062 6737 34048 21295 3892 10628
21363 10628 27567 15388 -4560 -29306 -28084 -62167 -41611 -4751 526 -40296 -36623 -5438
21351 -5438 -34507 -52156 -17914 -20416 -44517 -37194 -53746 -58117 -13189 39459 45296 40743 41446
21338 41446 95917 135141 96441 67752 72347 8646 -30521 -35128 -3495 43703 24663 2728
21326 2728 -2506 -21506 -52910 -48246 -14826 986 22086 -18548 -15392 -20136 -11339 21596 19241
21313 19241 -10721 -11642 54862 83926 65918 5313 -55877 -38813 -17217 22040 40844 31511
21301 31511 29852 -12017 22685 39264 14713 -36257 -44456 -30690 -18208 -26073 -11104 -10796 -35468
21288 -35468 -31625 -31833 -10133 -13280 -33513 -40314 -3426 21085 49565 66573 52339 17585 -15443
21275 -15443 -32440 3586 10648 3030 -11166 -11312 -32769 -22545 -17538 6131 30210 30343 17148
21262 17148 32696 13734 23465 4650 -35324 -39195 -73740 -79099 -17880 3601 7911 -36180
21250 -36180 -57898 -50558 -26873 -13143 -49834 -81683 -64556 -47344 -58139 -81921 -60960 -37157
21238 -37157 -2393 53118 70285 55002 14004 31193 33099 46092 52943 41533 37634 1094
21226 1094 -26515 -26549 -7875 -14822 11652 27100 33487 17771 -12372 -5816 -10319 -25818 -17288
21213 -17288 -4385 9356 17503 48443 16924 18247 38335 11104 29214 79209 90999 59715
21201 59715 49365 43379 42854 28718 42922 51474 29925 -485 -35100 -56566 -53664 -28255 -36646
21188 -36646 -22114 -9132 -26355 -12640 15942 32123 10895 77465 76738 50213 24552 18672
21176 18672 44796 95574 75170 62989 46937 41671 12737 -10345 50452 72431 41896 19656
21164 19656 1276 -7554 13289 -5361 -35285 -52372 -16578 27241 38362 1085 -29714 -21080
21152 -21080 -4435 -3398 20461 24897 -18100 -56286 -56944 -33465 -33954 1445 5582 18620 47484
21139 47484 60666 72874 73481 1975 -16004 13415 11847 31466 31445 4841 16404 44801 23650
21126 23650 33532 27757 10748 -20482 -48369 -63561 -59748 -53752 -52076 -13461 -6025 -19009 -4542
21113 -4542 -6724 -27125 -21767 -8243 1232 28612 5007 3601 4582 -3325 -8432 -17229 -55380 -47204
21099 -47204 -28566 16404 85343 99374 81587 57148 -18299 -51115 -35989 1112 16543 18656
21087 18656 20626 13592 -16722 -4653 2365 10255 -3951 -5713 2466 -30851 -30207 -16244 -26020
21074 -26020 2253 28628 12616 11369 -10174 -52546 -50766 -57045 -49009 -30233 -43641 -49507 23081
21061 23081 89795 31940 -27104 -24675 -22006 -8116 12217 -397 -44304 -61602 -59043 -30821
21049 -30821 -9808 -9870 -15432 -16905 -20677 -70590 -55124 53187 31586 -55448 -77883 -38610 -19656
21036 -19656 16819 58061 68022 22502 -5198 -674 -6033 44642 49511 44606 6868 -8200 -36706
21023 -36706 -61109 -75954 -23671 36163 49490 62980 57151 40047 44700 59569 33164 -13896
21011 -13896 -1418 43941 37492 -2713 -29154 -22126 1950 25517 85853 47052 8633 -11421
20999 -11421 -25877 4726 -38212 -54921 -17839 27374 41196 5538 -16061 -11555 9645 5023
20987 5023 -8998 13413 50468 44626 40219 40249 45827 34335 7804 6496 26782 72604 75229
20974 75229 55093 -14398 -53019 -53476 -14231 -15662 -22907 26518 43764 7403 26381 59072
20962 59072 68054 66517 48720 2760 -29400 -21313 -43153 -39723 -57682 -5171 10785 14950 19639
20949 19639 24800 -6667 -42268 -58050 -33960 -33143 -34114 -50329 -9591 -18834 -18186 20592 6018
20936 6018 -640 -20987 -29218 -21060 -6903 2698 36543 40505 13871 -1674 40114 87695 73775
20923 73775 21887 11437 33943 30682 21967 -3983 -35116 -1668 4237 30036 -763 267
20911 267 27531 36410 37630 66856 56011 31263 17670 27201 21470 -13405 -20286 -41071 -56639
20898 -56639 -73065 -63204 -33871 -14692 -23272 -27988 26634 59430 42198 33681 36447 84927 82836
20885 82836 73018 82000 19665 -12186 10573 952 -28944 -12506 80541 85259 31704 588
20873 588 2035 47971 55361 7550 -46345 11098 46084 51969 89163 51253 -2482 -3469 308
20860 308 5177 -15669 -62389 -64636 -78371 -66938 -76571 -46863 22889 54315 30607 4012 -8752
20847 -8752 498 -9708 -29165 -14400 -7654 -14 -2790 18399 2606 4069 30101 48879 32640
20834 32640 44513 89564 89372 80777 54104 28020 35910 72253 62596 75726 76031 60157 40387
20821 40387 7750 -511 3466 -9069 -21886 -24153 -44990 -88501 -99916 -121294 -93270 -44799
20809 -44799 2204 -17975 -31212 -47689 -34490 -529 25190 32836 30537 41404 52984 49946
20797 49946 51350 41937 13435 -44868 -56241 -32828 -2625 -10231 -53027 -93940 -103013 -94815 -35557
20784 -35557 35129 33744 29363 10200 964 -11244 -33039 -74966 -64703 -4716 12028 20561
20772 20561 56688 45806 29701 64773 58997 43009 53331 15164 15930 -1241 -26974 -14942
20760 -14942 3432 25280 45707 72016 48736 131 -39387 8807 48432 64998 53690 3090
20748 3090 -23990 12173 34529 50185 94283 53938 36035 49118 60548 89885 86722 59547
20736 59547 60962 45440 50569 17818 15653 24644 52576 60913 26401 36374 15155 -15987 22610
20723 22610 56348 56818 41623 22960 35549 28053 16259 4749 -6999 -6394 -17639 -42084 -22518
20710 -22518 -13745 3792 6183 -236 -16880 -5599 13636 16136 27819 61481 45866 7199
20698 7199 19175 10015 -25696 -26248 -42721 -82929 -73202 -82752 -67842 -51299 -28217 -4671 -15228
20685 -15228 -62559 -77984 -40984 -16617 46973 80422 70325 34053 20720 -22645 -38078 -32923
20673 -32923 -11099 4475 -17675 -39097 -16072 4842 37556 50234 29738 -2823 -35581 -15778
20661 -15778 8546 47834 43753 57421 77880 38344 -21988 -41760 -40714 -14679 -12813 5029
20649 5029 -17234 -25110 -46616 -31600 -8421 955 -18873 -28840 -26690 -22788 -25415 -12113 54618
20636 54618 84443 66210 29465 -15878 -29622 44805 60959 33775 -12769 6955 -19961 -11180
20624 -11180 -28049 -21719 10070 37152 34563 52289 15616 13979 18571 22992 53666 66695 40326
20611 40326 45603 38814 35331 35813 34201 61127 26909 28954 14688 24951 75395 51916 -4239
20598 -4239 -37318 -51758 -51887 -46873 -31901 -935 43339 41044 34394 18980 37783 12832 11688
20585 11688 60672 66671 55748 55493 55406 67165 114051 112987 97313 102312 84579 84382 97511 72894
20571 72894 26162 -9773 -911 5865 36878 32854 5325 -7092 15881 47834 57451 40090
20559 40090 90187 88902 39882 48413 80012 64979 64578 87174 91478 88091 84561 74989 80292
20546 80292 61691 34442 32552 54373 42767 36672 37135 57140 61215 39629 31179 16497 24644
20533 24644 -28557 -56391 14038 14485 -26125 -24653 -69811 -69993 -17017 41039 53746 61360 72334
20520 72334 40387 45117 39839 54451 103087 158345 138000 147304 161972 131660 87969 61835
20508 61835 68300 26364 -3905 -19666 8358 43350 93616 89391 47143 53530 74302 62026
20496 62026 36641 11989 -1596 987 -9148 -28779 -48228 -49265 -63221 -46194 15114 28333
20484 28333 68993 57399 20403 19275 20975 51181 36142 26583 52680 12780 -36690 -96727
20472 -96727 -76951 -62389 -63391 -77619 -78875 -67507 -44191 -55992 -33474 -2601 2824 -20258
20460 -20258 -4193 7948 4207 -10055 1247 -25850 -22982 19606 22449 76698 89397 49284
20448 49284 27667 320 10372 -9741 -45549 -16066 -29710 -38544 -4889 -14661 -23242 -32623
20436 -32623 -32401 -31129 -43929 -36369 10813 29468 860 11903 58501 53265 58043 54088 26417
20423 26417 -7288 -20065 -33376 -49034 -61497 10275 27273 35717 50853 47543 52950 79261
20411 79261 27792 28525 73484 82909 77232 78517 77057 49633 70635 76020 78436 80631 65171
20398 65171 45664 34436 33329 64199 95434 63922 26913 43264 16800 -22472 19132 38718
20386 38718 43248 57211 39053 -46195 -25063 25015 69194 67969 6250 -54812 -37644 17576
20374 17576 59142 53208 30907 20323 -21490 -4950 31342 38960 70013 33002 3805 28249
20362 28249 52332 68503 38765 75725 96114 100779 59201 38169 69693 94830 51438 64981
20350 64981 56414 34370 26543 6829 290 4505 40465 70808 4376 -34262 1889 -4183 6022
20337 6022 20670 11096 7132 49384 46508 35069 47691 67138 66523 56896 6861 1023 39901
20324 39901 61776 91682 166645 208429 306413 391941 467713 472178 483622 373010 274370 251911
20312 251911 350289 392095 456442 513227 612627 686675 629302 539792 490796 429198 397728
20301 397728 437904 530475 550441 550893 503170 418346 339014 307769 285537 393012 492410 541152
20289 541152 597599 659873 563489 434927 336710 296764 287271 233771 198963 186164 110635
20278 110635 114849 82165 33636 66992 81114 65217 81202 99151 121118 127534 112763 92164
20266 92164 66057 23081 40479 76040 110901 93541 69293 53581 49799 70438 61684 26997
20254 26997 31450 43638 44909 43629 49804 25419 18591 11194 24559 45394 61474 114500 95708
20241 95708 76692 42416 10212 -19029 31651 71447 61180 71094 61353 46033 41779 64669
20229 64669 90632 70937 44057 34505 30689 54602 39433 9580 14749 46557 31597 34944
20217 34944 -7539 -57043 -66024 -18239 22410 18203 19335 36705 78170 83748 77923 50687 28227
20204 28227 8719 6700 39274 19287 12724 3159 -6734 9771 47119 53282 82848 61181 24046
20191 24046 24802 3141 21885 10017 3925 11748 2700 2357 15646 20546 19852 17149 -14035 -30723
20177 -30723 -30281 20320 53885 67351 72185 53136 15648 30774 65893 79020 70407 94469
20165 94469 77468 83035 89192 91617 92634 88238 39478 45929 81257 87753 133354 130715 103428
20152 103428 61731 44692 42440 35264 48542 49740 49331 68172 105990 138400 89323 58018
20140 58018 91226 39802 49221 45011 19889 -23219 -41196 -27251 30574 38433 -6 -4962
20128 -4962 -20953 -39461 -15451 -9213 -32384 -37645 -37036 -21145 32435 50001 73333 73304 50623
20115 50623 22551 -4930 22591 28588 47158 51854 55102 89866 72578 74330 80393 62655 52036
20102 52036 46635 53766 45225 -3226 -15126 -18079 -20729 25717 58088 24076 40027 58784 65460
20089 65460 94760 107055 116657 117958 100275 119234 123348 79951 66278 22367 33905 42799
20077 42799 46630 87076 84736 69209 83449 79202 88012 77475 52723 52020 59720 67183 52115
20064 52115 40774 64066 73161 91998 121302 156853 88271 50467 82031 95916 92054 93391
20052 93391 94993 86331 63611 23596 42636 53623 36670 46668 69017 89981 108698 57805
20040 57805 54642 67671 73587 91391 121311 166859 157203 116600 109089 110327 121210 101338 83688
20027 83688 37216 39710 41571 41564 31678 57997 82500 100389 121979 137982 127744 110542 151264
20014 151264 162065 130862 80412 70083 86801 72944 21168 47505 47557 36479 3914 -32110
20002 -32110 -22435 38563 101445 82064 62700 36506 9057 45845 62263 72256 64337 12272
19990 12272 -10243 8095 62880 69557 55691 44680 9220 25318 80864 136608 155834 115522
19978 115522 92105 102502 94280 88241 68078 57829 48615 70003 126420 159858 159307 144131
19966 144131 117358 134612 138432 120273 161465 159537 132121 101148 114368 129582 182497 173040
19954 173040 165869 189259 218078 180657 155256 134541 163639 218502 206214 199869 161105 167611
19942 167611 139734 104785 112647 134868 186973 180096 208676 253108 242810 180788 175494 144815
19930 144815 105561 56377 38844 56772 23365 7904 31241 61780 31828 34436 23254 41044
19918 41044 60965 52386 34087 17469 15965 10980 -13888 -38571 35819 99601 72115 39155
19906 39155 26206 -38218 -111606 -144128 -192348 -198963 -162753 -103866 -42398 -21772 81583 107529
19894 107529 85943 51361 4874 -32008 -25445 67846 64529 59688 126737 210445 214379 159469
19882 159469 154572 174146 163728 214169 302324 319311 238892 181321 151886 117818 79995 129645
19870 129645 161802 180805 224393 292519 337108 384771 397578 360499 305746 338211 346199 319508
19858 319508 316543 296425 268218 295554 314586 296477 320047 362929 370570 356934 372589 328603
19846 328603 295415 342753 400323 395470 404175 390903 344123 304295 317850 338657 372843 392582
19834 392582 436702 510487 522395 481824 467343 446220 449609 458026 492818 508521 511934 513763
19822 513763 455605 434131 445327 464428 461590 473711 502359 486438 403314 409393 428617 431606
19810 431606 432567 410877 443605 485994 500621 451183 425759 410859 409470 416357 433182 462472
19798 462472 499181 498800 503602 510295 506551 462347 462013 513605 536320 569947 560650 582143 617957
19785 617957 627741 606052 618400 607824 595206 597392 665267 709227 680283 638363 598932 597722
19773 597722 596574 618915 657450 673709 682378 659464 715883 772031 772999 773206 772568 795232 789490
19760 789490 836880 885015 892996 889246 906993 930500 983587 1015782 989537 1033434 1072303 1098501
19748 1098501 1123328 1124815 1197457 1291713 1433858 1557966 1681399 1837353 1977656 2067757
19738 2067757 2104703 1994052 1883618 1929745 1955290 2054579 2269852 2471324 2672024 2889364
19728 2889364 3001954 3149576 3396805 3670177 3996216 4424258 4929213 5575552 6244734
19719 6244734 7040345 8136941 9503233 11267169 13561703 16720716 21312923 28184427
19711 28184427 38965035 54885108 72194981 84772407 93757526 92166034 72029065
19704 72029065 54922989 47757305 47621044 53321683 65567327 82609780 97087783 107322858
19696 107322858 112805160 98147202 79712546 75358771 82960312 94894810 103817879
19689 103817879 109663684 104957481 84157992 66573874 58194771 56591276 60822631 71562909
19681 71562909 86436474 98009780 104884803 105345841 84870765 59547556 43981580
19674 43981580 35147389 29655521 25991242 23306354 21289432 19823153 18465538 17157071
19666 17157071 15895949 14783105 13843127 12936918 12207609 11703765 11323635 11042168 10631406
19657 10631406 10001235 9276501 8500706 7746589 7127842 6614832 6226923 5918718 5695537
19648 5695537 5503095 5207992 4825654 4335052 3907067 3575869 3349435 3112884 2858840
19639 2858840 2688277 2513946 2323571 2168583 2032598 1889683 1734997 1637738 1507478 1441707
19629 1441707 1389258 1331191 1254505 1160613 1071577 1044897 987929 913549 822652 794430 797276
19618 797276 770894 742866 709189 682458 600307 528657 483150 465769 410888 382191 344699
19607 344699 336074 311400 282721 247937 251328 256785 252280 184398 155985 143199 127970 127461 141588
19594 141588 179739 165336 149689 176400 165876 121760 102237 66548 68365 72827 124519 125473
19582 125473 104340 91951 64547 101980 120030 105229 105220 69722 55162 70726 48703 13704
19570 13704 -2355 27755 41754 71288 50652 -17135 -55746 -60397 -45568 -55677 -51843 -80345
19558 -80345 -87371 -50897 -42071 -48721 -57013 -11206 -2109 35463 32568 28315 40737 52506 22547
19545 22547 -5060 -17103 -19101 -28779 7505 45335 69673 86607 49607 44524 17744 6199
19533 6199 32144 38916 51696 49746 79715 94242 57143 14335 10462 -19715 -36280 -38847 -66938
19520 -66938 -93430 -92512 -70062 -78936 806 97908 75441 44821 34052 -24157 -87455 -84105
19508 -84105 -46645 -40037 403 88772 52060 51253 35122 81339 105575 159867 183231 187464
19496 187464 205350 210162 208212 195061 157915 126269 145927 185733 242802 308031 311418 289591
19484 289591 290482 230145 218912 221273 172210 155273 191684 211392 180175 147848 177432 186554
19472 186554 196680 152621 113894 99842 102708 117582 135620 138281 138906 121257 125068 147684
19460 147684 135624 110610 103267 114809 147497 184075 125037 66889 45429 24960 41922 2146
19448 2146 24742 49781 46525 58580 46876 62283 85589 60849 -26067 1577 76802 102484
19436 102484 62323 39397 28857 -9204 8154 27392 12637 35049 43737 47168 33948 57659
19424 57659 67032 18588 -18179 -48200 -49023 -6114 8982 -42161 -42816 23398 50920 76252 83240
19411 83240 81827 43905 5103 33596 29762 29652 41428 33517 42160 48452 65803 80427 57280
19398 57280 3167 -14589 17288 -24227 -44015 -18904 -2239 20773 52959 32294 -5656 -9600
19386 -9600 -30064 7369 -6638 -12312 24259 33213 35162 2318 6449 36560 42446 23693 15967
19373 15967 22573 1390 -4010 983 4492 -11451 -30356 -20491 -19373 -11157 11490 20445 -2234
19360 -2234 -494 42004 64632 43444 28240 29150 55322 59817 42805 49481 31890 15100 40358
19347 40358 103533 103752 117221 141192 138702 138084 141215 145390 115762 77009 77632 50244 70245
19334 70245 132055 131777 77768 60564 54244 71171 113113 118351 67105 57127 46675 63600 57254
19321 57254 39948 41654 23822 -2503 -27440 -50567 -20278 17282 15726 25298 28756 59215
19309 59215 100361 102154 58204 62301 83679 115947 146385 148719 95908 54958 31347 10830
19297 10830 11355 14535 12181 7814 48131 73351 74109 52264 54275 74245 50990 36895 -314
19284 -314 -28374 -12189 12298 -16328 12572 31625 28488 52262 82828 85556 118357 110556 93704
19271 93704 112408 108460 53969 22230 18051 23777 50091 69492 52810 8606 2056 38406
19259 38406 47721 51039 76622 89280 78325 70539 52275 47204 14400 13707 55934 95242 112146
19246 112146 80927 92789 75195 70845 33948 -2665 -5407 1565 -1651 -9068 9539 42236
19234 42236 84847 68227 41144 58673 23991 7934 67258 107300 106770 109419 97917 68714
19222 68714 85967 124623 116494 84376 84988 80147 110401 104823 124293 108053 75311 56984 118892
19209 118892 125485 126801 141587 125537 74486 25381 28993 42049 81096 81083 62717 56858 89290
19196 89290 142789 158659 98907 66077 73605 63056 41256 33988 9501 15389 13078 25632
19184 25632 35781 8674 10059 18328 38662 53482 61520 61121 60649 60924 68392 84419 110849 135156
19170 135156 130021 111114 112025 138052 184102 211078 298645 418931 466771 492641 507888 433039
19158 433039 358620 321511 283465 228115 180665 212378 278338 288693 335547 445287 510723
19147 510723 661343 781386 870713 978540 959384 939359 958199 1072294 1136447 1187420 1302969
19136 1302969 1386636 1422159 1328814 1109310 936612 941568 1035270 1256547 1475543 1658666
19126 1658666 1768503 1716798 1461218 1334180 1355385 1413217 1475456 1546630 1398176 1136727
19116 1136727 1053716 1122025 1288518 1477140 1713720 1934118 2016614 1995359 1835083 1752995
19106 1752995 1689229 1629527 1637122 1755877 1757686 1612720 1468170 1224567 978294 807201
19096 807201 786058 782026 779221 840967 936457 1100074 1285879 1523579 1701984 1812234 1888243
19085 1888243 1934818 1764270 1396031 1179295 1127090 1128482 1098064 1068114 981781 925865 946249
19074 946249 983314 931269 924158 859143 742226 656619 609286 575879 578082 611950 679734 735332
19062 735332 796189 787498 714074 598051 476371 410867 337131 285887 249681 224721 230079
19051 230079 247195 253204 243297 230585 210088 247964 295830 290589 282678 292993 372164 459046
19039 459046 550149 716635 871680 992002 1079018 959295 735188 584647 527185 514057
19029 514057 610667 751339 837435 871114 800845 624888 503426 437859 332432 296056 316297
19018 316297 316323 305639 276631 268785 281706 261895 235495 288360 343384 390662 512413 626028
19006 626028 799030 958932 1040140 1128239 1053786 807793 652231 611249 699273 818846
18996 818846 919988 976228 980982 857301 643805 499097 405716 376123 325345 305134 237781
18985 237781 225917 238585 212887 210942 171175 150989 158804 213263 198911 183139 209609 221655
18973 221655 284697 344688 405894 449057 439289 407432 368209 334841 261500 263009 277891 272418
18961 272418 280169 303152 322787 321965 250596 206685 186899 181436 197442 167496 178841 223006
18949 223006 252918 240617 202109 198232 195813 230302 227973 181940 175714 165722 205546 216205
18937 216205 157774 143434 150318 135752 142291 145431 162051 194080 198160 173898 178809 211656
18925 211656 200190 163985 143699 163494 144895 99192 124854 148422 195837 181189 189496 203367
18913 203367 187407 199867 159471 118873 158280 212260 203327 279249 308397 310977 333150 407792
18901 407792 530663 668351 905127 1168991 1358256 1469407 1430666 1069804 763452 579932
18891 579932 500899 452534 384961 338239 349895 336181 340981 375946 371926 362054 331582 346805
18879 346805 363558 339737 318128 352345 434877 554144 692248 823063 1009714 1212320
18869 1212320 1334039 1441830 1399886 1181381 1163468 1269468 1315092 1300198 1252089 982685
18859 982685 705764 550801 453674 405828 430115 448116 414525 401380 373043 388283 442254
18848 442254 384858 386779 418108 400765 441449 469810 451772 469344 533816 680470 854131
18837 854131 1056146 1194671 1261391 1282722 1005204 726577 614812 544577 514301 485836
18827 485836 480227 475635 524480 582413 579604 506710 451334 473531 492607 495801 529098 568234
18815 568234 608997 594715 572265 575694 536935 547360 550553 549646 597087 614919 571062 476516
18803 476516 391246 364072 342528 286072 283915 278177 286987 318728 326569 331192 268248 219665
18791 219665 236585 241477 269651 268566 221110 192822 201107 188222 179627 140638 159763 184551
18779 184551 143994 73767 73657 131231 173726 174229 192343 206936 163729 136405 131833 141259 170204
18766 170204 206291 246289 274852 318905 364896 304077 159345 67940 -17602 -61317 -81956
18755 -81956 -97352 -109590 -97286 -62884 -6729 100901 172822 124085 60922 -29905 -33024 14604
18743 14604 168181 390222 547635 640754 745171 713263 637038 584650 557801 488049 456112
18732 456112 424016 410873 384387 364387 363263 349407 399620 431981 506199 604895 626799 585526
18720 585526 543852 573742 594912 575899 649340 671692 607873 559005 487609 509512 538798
18709 538798 563074 619314 674743 679259 729006 699553 644569 597563 549530 562488 586012 614941
18697 614941 622597 604465 586194 612661 665421 690627 730996 843448 939422 981549 986901 956818
18685 956818 904575 862473 841120 844539 886186 870344 850774 880643 896965 831074 817329 834492
18673 834492 864183 803757 750771 722828 698036 668713 640047 639831 663152 737638 780708 778861
18661 778861 749645 747309 754096 777528 813179 852769 876142 872081 883174 904400 905177 930878
18649 930878 956582 950196 943916 962038 989132 978285 984555 1070397 1048875 1023681 993539 976804
18637 976804 1009198 1045518 1065339 1067211 1136050 1168029 1219096 1240583 1203974 1200784 1252212 1281276
18625 1281276 1316761 1355408 1390769 1415429 1517980 1548847 1594355 1689772 1766656 1807579 1785003
18614 1785003 1788134 1917283 2071572 2224553 2409181 2608999 2851296 3127657 3396903 3651801
18604 3651801 3956747 4400734 4945953 5673337 6812067 8584581 11408619 15337833 19038241
18595 19038241 21639686 23477360 21538333 16960650 14445785 14008208 15171571 18084050
18587 18084050 23083733 28845695 33078192 36126248 35531386 27815703 20945045 17388510
18579 17388510 15314295 14152448 13939584 14382518 15286847 16660714 18380260 20449467
18571 20449467 23145934 26923208 31923573 38353125 47278518 60602844 81418016 111937066
18563 111937066 145252847 170742860 190309298 190578447 159231941 135886970 134763041
18556 134763041 153849660 190806346 235891668 278135572 307647444 299821357 258464594
18549 258464594 196903181 140451117 106676224 87960617 77117790 70811228 67734071
18542 67734071 67280233 69408914 74553864 84510127 102383728 127798827 150962740 165529508
18534 165529508 172754081 151752571 110574109 81482512 64909170 54787191 48026186
18527 48026186 43192752 39625945 37177982 35857149 35779908 37126889 39171666 40448467
18519 40448467 41097936 39497092 33520441 28130144 24833294 22749817 21184474 19903309
18511 19903309 18899764 18202523 17648718 17396271 17769911 19012236 21708839 26315014 31387128
18502 31387128 34790896 36969057 35243140 26898637 19505453 15139431 12629248 10936201
18494 10936201 9744184 8923747 8297375 7755283 7229271 6690437 6193457 5843164 5618717
18485 5618717 5391880 5100076 4867812 4593901 4365161 4149913 3907311 3679434 3424060
18476 3424060 3163229 2972051 2796679 2648704 2522468 2389039 2292872 2228173 2153402 2069618
18466 2069618 1960507 1824066 1645077 1496412 1386071 1300942 1200933 1132328 1076347 974998
18456 974998 927463 901510 900571 877791 846539 820660 742580 704625 714198 676919 623572 605608
18444 605608 621650 650975 597350 540283 535350 572604 612976 588969 550920 517821 550780 592115
18432 592115 565121 573509 581589 595164 584842 543005 472496 435168 451889 489589 530402 494718
18420 494718 470103 436584 353096 336296 293010 257465 232874 201144 170643 180390 153352 97058
18408 97058 57467 40994 122069 187632 229437 216459 159245 147558 106258 95322 139313 246926
18396 246926 346761 426199 481881 490145 447470 413284 409368 397338 346086 314715 318777 275935
18384 275935 243023 189336 142016 163572 158318 114859 90053 85646 79916 45786 10411 8334
18372 8334 60384 102314 174884 222472 176031 129850 109162 84824 99409 138214 294652 517974
18360 517974 658811 722500 729547 678821 623105 635130 638186 542408 420059 341235 338595 289182
18348 289182 226146 216641 233907 310822 418310 534304 583687 573079 521378 492133 534123
18337 534123 531368 479849 421839 393339 403802 394173 351896 348382 415832 452674 416247 390283
18325 390283 391110 352147 312369 297405 321442 321975 271717 302272 314901 318692 288355 220206
18313 220206 227707 252815 274215 312177 335696 332289 293271 298317 268592 269577 221818 194719
18301 194719 193438 230663 207867 159025 137628 182526 240990 227922 205667 240155 268211 277844
18289 277844 257587 247951 225334 200029 172983 180265 180346 186725 207056 250006 257200 233492 204434
18276 204434 141645 144809 197277 211952 135270 103533 130273 133731 141256 162843 192544 195317
18264 195317 206782 174686 236903 246359 242246 230341 187853 186909 207912 171625 141687 139217
18252 139217 88212 104340 118177 138508 167363 127740 114439 171894 168583 123011 158880 158916
18240 158916 140779 176606 201962 233987 244563 233778 184010 145410 179465 227892 275698
18229 275698 243934 229035 206099 146875 112082 81788 50893 72014 99529 68738 61032 125880
18217 125880 170953 197303 199621 209780 219935 221153 191713 169073 151155 134194 111272 106493
18205 106493 136828 163564 181420 140690 91812 82403 93567 120945 118851 131620 178681 211508
18193 211508 176450 151521 161432 183787 185208 146656 169060 200814 208218 207721 186253 137161
18181 137161 147465 161277 155196 140699 133924 140076 203935 210233 164728 124953 113151 130596
18169 130596 113105 106361 121723 130222 120648 116622 117566 134446 193312 188230 142361 153124 152885
18156 152885 190608 189986 147340 178444 206192 209681 197520 183251 169950 151710 153588 164368
18144 164368 173921 182985 212452 242323 231866 240566 245649 259397 260928 232815 232997 224941 256602
18131 256602 267151 276859 291465 340717 340459 388623 467565 544138 662574 790244 909839
18120 909839 1048284 1324788 1620914 1917117 2365128 2921451 3572581 4424900 5553728
18111 5553728 7096670 9203736 12386294 17500568 25714560 36315099 44789534 50256568
18103 50256568 52315280 41226604 26422242 17573656 12874259 10116969 8313247 7059840
18095 7059840 6161406 5494110 4980490 4529412 4167915 3867970 3624323 3489029 3375559
18086 3375559 3274023 3214957 3176676 3100306 2969792 2786382 2542336 2363817 2185596 1995203
18076 1995203 1838246 1659302 1554415 1483112 1383639 1261797 1164601 1108452 1070404 1022956
18066 1022956 990198 974484 1016775 1060339 1134969 1274450 1438251 1591109 1650303 1651065 1384443
18055 1384443 1054573 816700 674927 594162 525467 496264 501567 436826 395863 412554 406944
18044 406944 364348 370096 371047 405510 425552 359128 356575 348847 375617 349335 386703 428208
18032 428208 471363 501478 559653 646140 810986 1113861 1434546 1732820 2053548 2226753
18022 2226753 2092843 1807711 1510581 1217098 978075 787576 726948 747565 753553 794152
18012 794152 821883 780479 674125 546552 466273 412967 414661 454737 469929 550835 627341
18001 627341 733074 880795 1008678 1086559 1187104 1127169 1001371 982429 1091388 1199930
17991 1199930 1268701 1321622 1258962 1083288 959821 838938 703307 672669 663468 663268 673818
17980 673818 691430 707712 693609 598734 523441 428052 347861 349251 345354 370913 456954 575017
17968 575017 705029 793291 881291 924979 772909 553579 435783 346630 290303 251911 307406
17957 307406 415228 478224 531027 582096 616993 629729 575022 412644 283969 278864 254359
17946 254359 219167 190980 164616 225872 211091 209254 202782 238170 255654 337959 452064 551857
17934 551857 633852 666764 689307 556453 380870 278516 299365 223225 196475 241780 313366
17923 313366 390821 454136 479147 480175 475772 441633 295355 174145 177455 199611 235542 293899
17911 293899 307805 296116 293908 282375 286301 298916 308587 372212 438217 445830 483997 522014
17899 522014 482826 399027 260870 195894 176108 192181 193924 183731 162692 160311 106380 96781
17887 96781 99135 102602 107469 140083 122465 106211 78633 112341 85908 73624 93074 35866
17875 35866 47447 102409 75211 32332 4700 7992 -2143 35720 28744 11552 13726 17721
17863 17721 19361 19015 6503 5853 26661 -14366 -9641 -1518 -13991 4340 41833 84474 44169
17850 44169 21700 56773 69228 60936 46780 25612 6091 -8996 -27495 -23844 -29758 -36134
17838 -36134 -36120 2549 -17595 -5202 15594 23509 35816 58220 73447 37513 9722 3361 -53
17825 -53 -1035 44114 22321 -45303 -34959 -70956 -77299 -44724 -41588 -23068 36216 113892 115712
17812 115712 103493 47636 14440 33778 54259 35924 44245 79974 93765 111087 71246 12136
17800 12136 32705 71704 80752 53498 57513 52246 38434 39705 26348 6822 -4317 1057 6921
17787 6921 24293 24119 35996 15864 -37350 -13013 -7310 13102 15590 21313 37546 28819 -38685
17774 -38685 -65090 -1283 13671 21613 28931 25477 83975 92243 74137 39921 52574 53139 17924
17761 17924 2071 11990 34846 29217 45689 1967 -25827 -45828 -23139 -25503 19179 84188
17749 84188 87957 17313 -24853 -4269 37110 54092 7485 9947 17440 10240 -13708 -17639 -36109
17736 -36109 -50344 -38956 -42342 -29361 -15099 7755 30710 13506 39716 54492 18637 -4209
17724 -4209 -20343 -14394 -18310 -6817 34108 41724 34492 20076 19306 22353 27027 49068 64808
17711 64808 53957 35988 22168 -18186 4217 11076 49750 71517 41706 -17099 -48119 -70167
17699 -70167 -25128 -406 -26278 -21411 24548 -31780 -68075 -39382 -11841 10779 31776 89098
17687 89098 90340 69720 49760 25619 -2643 -12930 -11048 -8572 -21118 -6897 -957 1775 58467
17674 58467 73429 32196 46798 34445 -4762 7204 -1801 7817 -6322 -43789 -81409 -46856
17662 -46856 276 -27390 -74194 -62045 -62571 -84098 -21725 1412 -15070 21372 19414 6272
17650 6272 30665 4636 17679 19194 35959 66725 69541 74221 37403 21883 5430 9393 5720
17637 5720 -35835 -45735 -34506 -21257 -49487 -59446 -31653 22454 36288 29439 23949 -18416 -60629
17624 -60629 -13305 -19117 -21049 -3653 -44294 -90089 -94991 -99791 -66750 -8889 6745 9366 -1423
17611 -1423 1722 2361 -610 -14795 26404 46631 21679 5863 -10024 -2061 3146 -11568 8891
17598 8891 38574 28460 2819 -17187 -51774 -49374 -38181 -40043 -54058 -46718 -50758 -44083 3956
17585 3956 24005 8518 28280 11823 -14201 9527 -6203 1682 36730 27830 16264 -4082
17573 -4082 12448 72120 66212 -8270 -54449 -36715 -16933 3050 -16903 -3185 61549 62404
17561 62404 21442 30530 19648 38443 54264 41394 34900 31023 -8620 -23211 26065 31878
17549 31878 22751 24530 20643 26900 -3080 3678 -273 -32941 -31781 -42687 -26648 -16115 -49993
17536 -49993 -39791 8239 6201 20007 26288 57276 102773 94319 29954 -35447 -34627 -4909 34240
17523 34240 62338 72597 61951 83575 40086 -8953 12906 20354 17374 -360 -17347 -45985
17511 -45985 -20143 -21229 -3743 -8424 11648 16058 5970 -26725 -48604 -10938 28481 14248
17499 14248 -21295 -74566 -57827 -36065 -24936 -12092 -32500 -43367 -65947 -91612 -69485 -56636
17487 -56636 -32643 -44925 -78020 -55686 -53668 -55860 -39237 -67013 -56653 -66066 -60731 -57618 -74151
17474 -74151 -81170 -77059 -23498 -6960 -14495 -42950 -40797 27627 26875 -23932 -29083 -13485 10973
17461 10973 24111 -22253 -75564 -53467 -9936 18389 30553 47243 84087 90673 84689 27022
17449 27022 -4681 -5268 -5621 -23522 3128 65947 72716 75880 103265 119754 198608 260854 322597
17436 322597 332963 212945 97784 86029 59078 41448 42823 39367 54853 58269 56414 57646
17424 57646 57585 50798 9705 6672 58208 33378 -9797 -37869 -44830 -20151 46212 87702 54497
17411 54497 40623 73501 94129 89548 63634 87381 99786 71011 14868 -28284 -35860 -13212
17399 -13212 -353 20796 9556 24743 24824 26617 -20345 -49727 -41408 846 -4003 1958 -8996
17386 -8996 -43936 -52669 -34730 -20601 -49027 -20570 36090 50085 38678 20814 10985 -12367
17374 -12367 -67670 -43964 -23568 5353 -11744 -12976 3243 47083 52051 41025 40088 34060 -3056
17361 -3056 -43448 -45945 -19453 16622 17626 4424 2017 28270 25409 33202 28470 16318 25993
17348 25993 41754 46061 16558 70158 108387 85932 31225 -22154 -38830 -36482 -57193 -85192
17336 -85192 -81348 -57495 -74153 -18786 19020 27328 12694 44357 73398 77244 41283 14945
17324 14945 2830 14492 49171 19525 12699 1306 35777 2947 -48133 -36039 -19057 -7755
17312 -7755 15880 -4579 -14627 -15828 -23723 -15754 14627 -823 -15653 25549 41965 38800 15661
17299 15661 -42658 -57476 -74391 -126700 -65826 -18976 -46378 -51658 -33526 19945 48340 59420
17287 59420 52186 35972 34441 81900 88679 38275 -9428 -47491 -62150 -67535 -55094 -47826 -31811
17274 -31811 14638 44364 7587 -17880 -45053 -33889 4769 17138 2030 -23318 26581 38136
17262 38136 22886 17219 27218 9090 -9732 10450 19531 -11019 -59009 -78378 -47880 -21951
17250 -21951 27084 4765 3137 24632 11839 -14006 -24827 2822 -24757 -14654 -20467 -11771
17238 -11771 22178 6810 -13081 -3807 21424 35451 49410 42479 -1564 -2217 -37828 -70703
17226 -70703 -11660 33496 19468 11004 28927 19385 36738 57014 60241 48337 39274 51386
17214 51386 23416 17517 26522 27056 4371 -29123 -15897 -54325 -46083 -17627 -5264 54746 54836
17201 54836 20466 -1639 51504 65496 -16393 -66648 -65206 -34153 2702 31209 23697 12749
17189 12749 -6531 7226 35408 35764 15235 5353 -2119 3438 18689 15928 -34401 -35208 19118
17176 19118 -25027 -39527 -23224 -21020 10038 -20539 -34797 -39998 -26718 -34504 -54208 -52421
17164 -52421 -30698 -25401 -60467 -109391 -97472 -55072 -22984 585 36984 41929 40429 41409 8585
17151 8585 -27850 -51484 -60564 -16155 1794 -28536 -22811 -25853 -945 -3363 3218 -24905 -8917
17138 -8917 9820 -17884 3173 -13007 -31512 -53135 -66259 -47169 -22755 36705 21687 43783
17126 43783 56202 24049 -36563 -64573 -47184 -45980 -21576 824 -8676 5718 20078 -3725
17114 -3725 -13363 -4635 21504 43470 23273 -11663 -29963 -51361 -40273 10056 20803 13790
17102 13790 21793 -15375 -56862 -111757 -124670 -95392 -48617 -36761 -57531 -71663 -65668 -53609
17090 -53609 -7389 18370 28888 -2098 -51279 -61327 -62353 -84621 -88567 -76308 -36935 -13649
17078 -13649 -14299 11606 -11425 -11308 14042 41517 23592 -12200 11141 25208 24104 -6614 -15585
17065 -15585 -29023 -22870 -10837 18296 8828 -3123 -1249 11754 61492 19910 -7989 16539
17053 16539 -2291 18197 5209 -13465 23109 1353 -39673 -37275 -28520 -27120 -5949 -31520
17041 -31520 -65807 -91659 -61333 -34638 -7692 -5959 -11450 -19968 8474 61217 71436 62008
17029 62008 34223 28527 13846 -23006 -27659 -1718 16331 32194 21380 -25461 -37694 -15241
17017 -15241 -5004 24562 24399 47523 49816 34634 10652 -9284 -33399 -15939 -22257 -81021
17005 -81021 -60664 -30781 -43746 -39472 -25565 -48793 -7526 -12287 -16294 -2031 -1206 11010 37025
16992 37025 36327 -13138 25693 46573 36655 45113 8534 -17897 -1861 28986 46279 1888
16980 1888 -58214 -81609 -54691 -21637 22687 3682 5953 13049 -12449 5457 -13205 -21692
16968 -21692 6243 29443 -2616 -1512 17296 66092 28246 18628 77468 77600 74070 55896 -6391
16955 -6391 -37809 -34370 -30442 15629 44493 87989 83254 28092 -22638 -10830 23696 -16829
16943 -16829 -30684 -41591 -42060 -34365 -28048 -28411 -48107 -33164 -43113 -36083 -33584 -34652 -16128 -26085
16929 -26085 -24792 -45716 -72245 -82963 -82532 -66050 -33104 -40144 -565 8306 -3232 -18954 -6232
16916 -6232 29059 37647 39576 22355 -5005 -14346 -26591 -17855 18293 46892 37186 -5026 5385
16903 5385 9008 -3637 -16766 12340 -5579 -2785 27877 48073 20669 18534 -19730 -16249 18975
16890 18975 31486 44208 42183 60581 94919 60001 -5129 -29010 -8834 9026 45354 81313
16878 81313 82745 66674 32774 1347 -874 -22770 -39249 9523 14123 18968 14802 4208 15081
16865 15081 10545 12885 428 8911 14178 17668 64911 78506 71550 42990 -18128 -33754 -11789
16852 -11789 -13289 -11026 -36394 -47535 -54483 -39118 -59069 -46633 -32638 1818 31829 81432
16840 81432 110675 98786 52332 16081 52728 21929 17649 11678 -15358 -40955 -54691 -17015
16828 -17015 20828 24019 19940 13193 -1735 -10350 -16942 29001 41832 -6568 -13573 -28758 -53888
16815 -53888 -21111 -34694 -35062 -31071 -36833 -25092 -4954 -10462 22781 -2103 -74783 -102578 -84751
16802 -84751 -58255 -46902 7803 50701 69970 36431 -8666 5372 -9995 -14573 12776 43833
16790 43833 -20634 -35761 -38764 -15013 72685 67716 50514 73407 68618 33604 2225 13538
16778 13538 21856 15334 20943 33466 40038 33965 31971 15583 -10638 -23777 -14900 -25876 -31002
16765 -31002 -1954 40422 59136 19485 5457 8511 -20767 3333 -10278 -62784 -64357 -51201
16753 -51201 -45489 -66888 -67764 -79715 -40552 -26027 -16524 -11144 -25182 -52293 -56578 -19712 -34221
16740 -34221 -68461 -85343 -55415 -8284 -18621 -31732 -35867 -60672 -35430 -34542 -16123 -12548
16728 -12548 -2261 -25157 -23315 -37598 -19674 -33398 -68204 -53083 -86868 -63607 -33793 -65459
16716 -65459 -114209 -98070 -69061 -42651 -40485 -58675 -47167 -83958 -78540 -15972 8886 -5391
16704 -5391 -5729 16115 20711 -7752 -46742 -15366 5906 3106 4802 16658 6202 12117 5319
16691 5319 9385 54638 92441 78860 56485 41748 45712 43527 29366 8722 17936 26228 58064
16678 58064 57781 -6800 -57249 -79765 -65674 -61084 -21227 5241 34047 17116 -5157 -10781
16666 -10781 -21954 -30502 -30410 -3877 -6168 4458 57975 46808 23915 16659 33014 30962 22427
16653 22427 37310 47012 15587 -13806 -47380 -27995 -52575 -7814 30821 18511 12657 -8271
16641 -8271 -28634 2976 32154 8360 -26966 7705 -14660 -77569 -103504 -91255 -47245 -32132
16629 -32132 -18294 -2301 -12375 1134 15766 34505 28009 27498 24161 35122 46212 54136 65079
16616 65079 57674 8499 2122 19993 -889 -25905 -34361 2399 7216 18110 28990 11841
16604 11841 -1321 -21974 -14903 5796 -17080 -16825 -8213 -6843 -17213 -14286 -12881 -27988 -18482
16591 -18482 -5105 -16410 -21343 -54511 -59460 -4298 -629 -22588 -7837 -52129 -55333 -25940
16579 -25940 -35928 -75557 -36510 -45118 -63820 -55209 2013 51896 6977 -21352 -39543 -41164
16567 -41164 -60641 -58075 -19091 14323 1429 -22437 -29298 9768 -8175 -42541 -36223 -18364
16555 -18364 -48958 -87422 -67190 -18931 -34728 -14638 -10555 -21017 -34671 -13922 -30358 -14844
16543 -14844 16808 31165 773 -44661 -73316 -52481 1695 20367 1771 -22184 -20349 -2854
16531 -2854 21978 -4323 -10075 -25672 4650 36576 26100 36908 24745 -11119 18007 63414
16519 63414 56343 28367 26272 37733 6514 1144 -5341 -25070 2873 10846 5678 5865 9043
16506 9043 -4652 -12358 14412 22652 6206 28373 31707 10022 -13908 -13447 17432 38411 22743
16493 22743 19052 -342 -32346 -30022 -24957 -23594 -26443 -42418 -7256 -8694 -24824 -44254 -39451
16480 -39451 -3140 -4954 -44311 -7292 20387 37084 -731 -25297 14735 8104 -2578 -28600
16468 -28600 27941 75980 43606 48532 77035 78396 73520 40499 17019 55763 38139 28607
16456 28607 23752 21477 31737 15216 34732 36954 19737 -7719 -393 -3606 -38693 -26946 4860
16443 4860 35657 59867 16614 7452 -4968 -22611 -23575 -30190 -15591 -26903 -25050 -24097 -9376
16430 -9376 -3761 9518 -7288 -28939 -16236 1898 -14794 -13564 -3301 -43739 -77089 -79968
16418 -79968 -47801 31770 41194 14170 -8456 8193 36353 40869 5310 -20422 -32681 5277
16406 5277 51168 89256 56219 -5628 -45257 -44595 -40261 -23818 24530 37998 25432 8093
16394 8093 -17051 2640 8887 -41628 -32692 -36093 -24762 19293 11450 -31057 -20448 -29444 -2891
16381 -2891 5166 2278 15433 -14624 -52282 -70769 -22682 -7074 -27634 -8921 -15493 -14935 -4281
16368 -4281 -58711 -41393 -43828 -71712 -61934 -16577 -43671 -48215 -12639 -21237 -15199 8231 27595
16355 27595 -6599 -16270 -4863 34595 24561 -41104 -80918 -84749 -27364 21979 -18684 -33525
16343 -33525 -33105 -32183 -64963 -60066 -31519 -39454 -39703 -13474 -60034 -113952 -101896 -104043 -31932
16330 -31932 -29881 1235 -26872 -51544 -48117 -23879 -23679 -24116 -13100 -47574 -45860 29864 40613
16317 40613 31022 11486 21313 53857 27772 -8015 7046 8542 -35732 -31507 -5113 -5300 22815
16304 22815 28258 28954 22687 -11690 -58267 -55713 -50625 -26666 4160 13597 24376 -2576 -22995
16291 -22995 -22212 16070 -1174 20448 22666 12174 15367 -5852 -29645 -63324 -94960 -78131
16279 -78131 -63703 -38454 -38257 -54539 -26117 14075 17656 15210 30247 8699 32509 55275
16267 55275 40633 6185 20779 18674 -9589 -12531 28148 81398 37191 24075 38635 -7575
16255 -7575 -29037 -56855 -68060 -37904 1422 25031 40399 36065 40220 42606 31707 2218
16243 2218 -8044 18232 13817 9312 -27602 -25052 -3796 18084 44496 36427 5702 33098 26392
16230 26392 -6124 -43942 -26114 -3107 36059 33083 -22425 -16346 -8596 -21590 -18133 -42976
16218 -42976 -96690 -79135 -49131 -16254 12984 -7079 3355 12931 25829 14675 14133 5691
16206 5691 14873 34187 -12952 -46282 -29374 -1665 -30435 -55732 -82375 -94876 -56064 -38964
16194 -38964 -12250 5129 7203 -5032 -13053 -14 -12783 -30752 -103062 -134415 -128350 -96074
16182 -96074 -61490 -26396 -20012 -33391 -11460 36853 30284 42271 48456 3069 -5500 68665
16170 68665 87722 73403 29578 -5295 -6327 -15130 -33753 -30635 -26157 9110 10396 -19449 -50157
16157 -50157 -79931 -59043 -58909 -53304 -32956 -35699 -32240 -20532 -8428 7947 52823 80369 77357
16144 77357 64674 23511 -3245 -15713 -11394 -17318 -25777 -35463 -28853 -21525 16781 49487 -23209
16131 -23209 -53584 -26190 -12642 27633 19 -39348 -41368 -32614 -12782 27048 -1216 12615
16119 12615 20236 16880 19626 21870 55603 76055 86903 71211 66659 11027 8456 3238 2692
16106 2692 26501 -13654 4450 43498 50555 47468 38410 46891 8905 -39887 -6621 34306 54361
16093 54361 97386 107223 70406 65555 12536 -34381 -47679 -25683 -47365 -51191 -25837 -7046
16081 -7046 14896 23145 5498 16270 34083 -769 -24585 -9236 -18191 -19097 -50128 -15287 23374
16068 23374 48671 67375 19683 -29829 -30894 -30652 -10679 -13282 22749 70059 80173 83727 67056
16055 67056 8560 3615 -17482 -30100 -35542 16905 37733 30231 -10692 -386 11381 31200
16043 31200 40829 41993 22409 41750 23747 13173 4106 1805 -23688 20727 62298 46888
16031 46888 17299 -6677 -12458 -6372 -39674 -31526 40745 63097 46827 14936 -610 6577
16019 6577 -14642 -21218 -1809 -766 -10430 17018 -4863 -14131 5589 35223 33094 40495 34200
16006 34200 1030 8018 18859 28863 -9355 -35055 -51308 -51854 -19696 31484 5508 -50629
15994 -50629 -41250 -30812 -31580 -38005 21123 53734 103181 126855 70420 35764 19972 -2210
15982 -2210 -22740 -40545 -10400 -25123 -46001 -90655 -114234 -59023 -31604 4173 26010 -15932
15970 -15932 -8525 -3624 -6710 27096 -3445 -51952 -59713 -26238 23813 57354 56608 30148 15124
15957 15124 -20792 8820 26159 52843 61263 42913 40162 92511 88746 21706 13463 20486 -52412
15944 -52412 -74710 -46482 -13703 -58224 -110969 -116642 -89702 -80338 -73435 -44982 -11761 -16275
15932 -16275 -8171 21668 6404 -31467 -30201 -83851 -47227 -31406 -42812 -35643 -23316 -3716
15920 -3716 -10195 -36672 -30689 -7347 7241 -6236 -2930 -59916 -56351 -53313 -1719 21184 38756
15907 38756 62613 69617 27974 8678 39484 36580 -1883 -31452 -53695 -95085 -125818 -131333
15895 -131333 -91497 -68938 -67648 -22000 -28223 -81275 -81268 -34132 -22937 -52041 -62900 -46084 -24270
15882 -24270 -25074 -51666 -22476 5395 -16078 -2429 5461 16476 25868 15451 -44768 -63723
15870 -63723 -49639 -27604 -10622 -11071 -45208 -54695 -21624 -7008 -30423 -47672 -35437 -28877
15858 -28877 -45728 -46718 -56253 -91593 -89159 -41589 -23469 -17011 -33601 -10806 14738 9888 -22854
15845 -22854 -27788 -34631 -35278 -6439 12238 20609 21793 50982 49996 67440 57486 21637 43746
15832 43746 59907 62218 73666 63989 75563 31900 11947 31694 5684 -9553 5525 38579
15820 38579 38593 2141 -1500 8429 -20740 -34753 -15911 -5166 -9850 -12102 -15251 -24302 -59063
15807 -59063 -35918 -9123 -17700 -43980 -28074 -6722 18050 14928 37346 37651 30282 -2109 4582
15794 4582 17663 10780 40445 22896 9426 -29731 -49368 -25801 -18242 -48756 -84567 -62612
15782 -62612 -57354 -48870 -55064 -53882 -42909 -24466 -43717 -41152 -29819 -22208 -20470 5803 44485
15769 44485 90509 95867 52731 57348 39455 -12698 -14484 -19535 -44321 96 52129 1151
15757 1151 -31631 -4921 55246 73362 42278 54092 39533 33604 12840 -5627 -2462 47169
15745 47169 75834 40767 6349 56086 62778 3540 -30444 -63868 -100063 -95825 -53793 -78348
15733 -78348 -64624 -37447 -42057 -28802 -32034 -26452 -23037 -32220 -16754 -33932 -30556 -673 26800
15720 26800 11743 4479 -20022 -4557 34670 25111 20200 34914 22001 10537 9521 10779 20377
15707 20377 42025 68197 49059 44445 42808 23053 -19429 -20813 -35448 -61269 -40305 34282
15695 34282 82432 66597 47282 10135 -2582 8325 21896 27405 73939 74704 49085 36301
15683 36301 -14412 -40514 -62120 -70873 -39890 -23501 -39797 8873 35798 32627 44454 52573
15671 52573 52011 77169 72477 58410 31890 52978 24581 77862 47608 -357 -24655 -38102
15659 -38102 -49707 -52768 -59743 -32757 -40445 -41295 -38372 -31285 -43647 -38243 -22078 12818 42463
15646 42463 28577 30050 30840 27987 37061 38024 22367 14866 42493 32283 44116 22557 -162
15633 -162 -713 54384 81034 56984 23064 -14369 -8709 22399 60957 41151 44280 44712 18219
15620 18219 15552 18544 19724 11465 -28559 -5598 47739 30240 -28139 -56448 -84351 -66505
15608 -66505 -57397 -38237 -30867 -34410 -6093 -4575 -10027 -26282 -44426 -31509 -12812 -6203 20132
15595 20132 78419 33834 -23489 -41458 -23358 41726 112461 133721 98561 9714 -31661 -41993
15583 -41993 -61551 -48606 -47278 -86897 -63854 -22923 -43179 -48937 -44769 -16447 -4438 -33279
15571 -33279 -54270 -58917 -80707 -88126 -57005 -33401 3753 10629 34902 -20839 -24128 10574
15559 10574 45620 27960 35182 -1643 -28341 -12027 20779 29831 18573 16967 15302 9005 -4092
15546 -4092 -19299 -7447 16248 30446 25929 28046 -4364 -14795 -3939 -43629 -45754 -10784
15534 -10784 1508 3369 -7297 -21362 -15070 -32541 -10677 5473 -26999 -9818 -562 -16575
15522 -16575 -17996 -45131 5197 32183 11194 5089 29301 -670 -3406 4413 65409 25368
15510 25368 -8587 1198 -152 5802 18714 21009 32551 50410 45290 48837 61123 44013 39928
15497 39928 12388 37696 40169 42772 12880 -5385 -44439 -43709 -56379 -37375 -19103 -27349 -42562
15484 -42562 -18967 -8415 -20505 -19255 -32583 -48870 -48552 -23021 -31608 -78280 -80397 -46445 -26601
15471 -26601 14635 45545 70904 11511 20495 -6823 -10987 12777 18426 14499 28605 24191 31595
15458 31595 -2395 -83518 -121161 -66904 -40244 -40227 -33291 -58017 -74086 -41019 -14628 30271
15446 30271 38972 12427 19968 14695 -30951 -20315 -3638 38913 43896 42008 24959 513 19118
15433 19118 7777 -15194 11642 32379 12266 23724 -8299 -37932 -19129 -33424 -51191 -12102
15421 -12102 3125 -36484 -89043 -98312 -80096 -56802 -52937 -59512 -56887 -47717 -40882 -56417 -112381
15408 -112381 -104914 -67622 -19651 20884 12768 -17590 -45102 -33387 -20616 -28164 -31041 -49295
15396 -49295 -45251 -4379 -10335 -37880 -48968 -45290 -36798 15860 14983 23157 47890 56983 48528
15383 48528 41190 21561 -521 8643 -37111 -62799 -29480 26877 29844 -22773 -23206 15010 11802
15370 11802 -2482 6044 49647 105144 77650 20302 26582 73866 108690 96448 118266 90231
15358 90231 46168 58695 45310 48646 19209 -20248 -16842 33955 30599 31609 54444 65381
15346 65381 78411 72983 33710 30940 43085 36153 -10202 -36907 19879 57242 41636 24768
15334 24768 10048 -2088 -11097 -26760 286 48184 34668 24392 -13816 -38688 -15860 21522
15322 21522 27560 -34672 -69060 -79759 -76417 -8043 24140 41485 46371 14703 32476 30402
15310 30402 -25446 -20057 -11454 -15005 -18666 -41106 -61755 -28641 4425 -42474 -65443 -67839 -6635
15297 -6635 26749 9698 6105 9936 20622 9927 1472 71437 79479 72298 52473 20992 -30254
15284 -30254 -15410 25686 35329 1686 -16568 -27731 -25644 -90742 -85332 -32117 -15481 9820
15272 9820 30975 36505 28538 43869 41397 40322 -7774 3090 20590 43001 47063 44894 33110
15259 33110 -15503 -50480 -32571 -10012 17409 74502 70623 44384 70317 81674 72818 74489
15247 74489 35652 22592 24166 22494 1818 -15703 -7034 13302 34552 39132 19137 -14563
15235 -14563 2844 2749 -20798 19925 19296 -2079 9594 -2181 8403 -38302 -35057 -3336 14734
15222 14734 8348 -14807 -54534 -96723 -76010 -31833 -17821 -71808 -102473 -114358 -72745 -11652
15210 -11652 25589 -240 -23489 -40277 -25520 -8313 22780 29458 28004 26549 33320 -7070
15198 -7070 -1077 25505 -27798 -61144 -17203 3540 -13074 -29199 -14173 -11781 -26431 -73090
15186 -73090 -89191 -107844 -125489 -71324 -46586 -49059 -55360 -15130 17771 -21937 -16886 -3959
15174 -3959 -39956 -48246 -5665 28211 -5841 -33046 -54599 -71551 -78574 -37004 -22263 -13982
15162 -13982 -16943 -52071 -50680 -87466 -80798 -95393 -63116 -51041 -54711 -28234 -34386 -69107 -70732
15149 -70732 -49302 -42130 3126 14706 63840 64455 61179 18068 -33616 -76082 -55592 -35843
15137 -35843 -1494 -21718 -6978 16593 22057 20327 -4619 -2074 -2068 28319 36066 -7423 -22751
15124 -22751 25990 56070 39095 23409 34269 -18178 -48005 -29023 -26278 -29153 -10390 16336
15112 16336 58524 43245 14596 15536 -964 -28047 -46307 11463 39869 60690 66852 14584
15100 14584 -764 22786 -11582 -15627 -20817 -33168 -18684 -18678 -33358 -29250 -17957 -36789 -52803
15087 -52803 -63663 -56670 -61517 -55565 -57178 -28329 -16941 -51092 -44109 -45882 -42186 5761 8254
15074 8254 20951 28389 34489 -1835 -18246 -3627 10896 35472 76588 16242 -17797 7860
15062 7860 -4623 36802 67214 39895 14108 1346 13756 21555 37082 7486 -15820 -2256
15050 -2256 7189 -8359 -32570 -58069 -61056 4074 65383 34820 -15142 -9479 2250 9827 -19629
15037 -19629 -8577 17399 25250 2782 6678 -2604 6383 8545 -29679 -50145 -71400 -27371 -29239
15024 -29239 -35380 -26073 -32493 -5090 11941 -14339 -19311 -16662 -34931 -12139 -714 -1856 -40197
15011 -40197 -8819 -8568 -32023 -39512 28397 39490 3929 11943 -46243 -78555 -31702 -10224
14999 -10224 -37750 -28970 -15199 -14748 -37682 -27104 -15217 17559 17172 12978 49290 60068 72585
14986 72585 73358 52750 14583 -7213 -51570 -87691 -33880 -11654 -75391 -76341 -27401 2574
14974 2574 20009 50119 27867 8706 31318 20392 7429 23247 28180 19229 46790 75041
14962 75041 68329 89604 98400 87281 63865 32584 -20359 -10854 19950 -14208 -1014 -35929
14950 -35929 -51865 -57002 -81604 -71816 -71156 -57520 -10803 -10276 -17309 20075 36095 46719 36982
14937 36982 34908 37269 18940 32264 33521 -4631 -2012 -8138 -43477 -43544 -9923 21371 5467
14924 5467 -28966 -48351 -59740 -62812 -27765 35110 68949 66734 31797 20773 20124 27773 46832
14911 46832 90352 63575 62478 54163 32875 15804 -12721 -55387 -62185 -44859 -34325 -18061
14899 -18061 -13596 30179 91328 49271 28498 24554 -61 -14765 -59590 -106202 -87351 -19322
14887 -19322 -17137 -68916 -53061 -12992 25452 44581 45929 66667 73766 42902 42933 18108 7124
14874 7124 2803 12210 -43977 -51716 -24857 -33447 5191 41628 25361 -2299 -13042 25164 37828
14861 37828 53991 55135 69552 56918 30014 31200 19715 32554 49498 48503 8589 -25191
14849 -25191 4362 -3231 -356 23700 14209 24913 -20922 -32456 -17418 -54416 -26262 -6883
14837 -6883 -36263 -24607 -33678 -13000 -29892 1304 22324 36109 -7412 -29946 24600 54083
14825 54083 35716 34529 7184 -30050 -57928 -70247 -22544 17158 11810 -3199 -12106 52045
14813 52045 64458 69204 31116 33302 12283 -2121 1715 -9369 6431 18966 16609 27762
14801 27762 60872 40384 38394 46004 70640 32390 -18126 -54086 -29317 256 -12692 -44309
14789 -44309 -20674 -4801 22601 23669 77803 113769 84883 70628 54311 -5149 -30196 -32177
14777 -32177 -7966 -24061 -37245 -25919 -17277 -14752 13042 -19209 -23438 -37038 -49245 -28699
14765 -28699 -50180 -32763 14715 28229 20651 19227 26250 45189 91950 90127 102650 75533
14753 75533 60826 42844 18291 -38437 -49478 7526 12624 -42280 -90353 -75897 -89783 -82704
14741 -82704 -61355 -49208 -30663 -59309 -31729 -7341 -15375 -15840 -12788 -10706 -27451 -60597 -61335
14728 -61335 -66340 -38228 -30045 -25778 -55684 -56402 -59765 -90246 -62472 -16195 -6408 -1370 -15809
14715 -15809 -25205 -46639 -25727 -16369 -15603 -13901 -46075 -48029 -34130 -26766 -44115 -35382 -3685
14702 -3685 44593 18128 22664 38379 9296 -13988 -53924 -45998 -50823 -26713 -25277 -25302 -37454
14689 -37454 -20501 -8880 -13229 27970 42950 52830 64017 -25263 -43848 -29303 -24666 -53050
14677 -53050 -63383 -112972 -86928 -68272 -47985 -46531 -15736 2661 272 -27334 -18617 -43570
14665 -43570 -44899 -17201 35130 25205 24400 9471 -29408 1066 20270 -2188 -26377 -54424
14653 -54424 -33756 -32517 -20034 12219 7710 -28607 -26341 17048 -11474 -43481 -44368 -15068 -19346
14640 -19346 -19278 -26117 -39454 -47900 -39995 -25323 -22282 -11877 22470 -3161 -22826 6048 2205
14627 2205 3771 44971 51014 35912 47972 3810 -15225 -37216 -63975 -31703 -21119 -25367
14615 -25367 -49483 -31034 -67633 -74286 -82112 -20992 49208 11702 18923 41742 47225 47473 25380
14602 25380 12942 4509 16967 25394 9311 14528 778 620 35714 -2418 -7801 -4684 2792
14589 2792 -25741 -39968 -20986 -2989 10425 4693 39870 36626 7866 39794 33074 -5715
14577 -5715 2350 -12705 -5671 10955 -7560 19315 62486 44319 17926 4421 -12323 -12835 25780
14564 25780 16615 3053 29650 22951 6640 -8774 17034 29904 1482 -5042 -6952 3880
14552 3880 -10468 -10018 2086 11548 30761 10333 38621 24485 -5531 554 -4374 -3187 25101
14539 25101 20613 720 19042 35426 12331 -13683 -35701 -41650 -20481 -2815 -20644 8031
14527 8031 30228 39960 42562 -1376 -5317 -34842 -27972 -12693 16745 5270 -22007 -35360 -9201
14514 -9201 -28668 -42778 -48303 -19667 12938 42354 31052 6475 1406 44038 68440 82633
14502 82633 71941 13797 -11772 -14819 -11655 13029 15547 -390 15719 -18681 -68874 -82742
14490 -82742 -78094 -89230 -88686 -38588 -27318 -97914 -102160 -57212 -19227 -12287 7526 16828 33928
14477 33928 -14790 -22957 -11236 16749 328 -21938 -57029 -63698 -51817 -34997 44300 47423
14465 47423 26332 22656 -1849 -5878 37388 37002 -3533 8363 -10578 -19012 -4684 -4374 -30213
14452 -30213 -4966 -20374 -53317 -14389 6451 -5471 3947 35402 75570 43210 -6815 -28332
14440 -28332 21915 100209 112028 84186 64795 51026 57651 89180 45616 -42656 -86977 -90190
14428 -90190 -18727 12025 42887 21697 21711 10805 -31199 35429 79474 73998 68081 46063 42376
14415 42376 62532 53206 27325 13552 -23839 -33681 -40517 -50295 -53298 -42378 -61580 -80101 -37658
14402 -37658 -32763 -9154 -8967 32952 49732 37706 46224 87314 134602 112417 74959 -5839
14390 -5839 -67738 -74813 -45506 -5262 20247 15419 -16228 -38996 -42144 -16599 -22155 2945 24897
14377 24897 52886 57807 72338 88590 95978 39172 -369 19097 23160 -7628 -29340 -21829
14365 -21829 -6364 20495 3041 -29503 -48502 -71218 -23624 38477 26631 -22204 -31689 -37992
14353 -37992 -24174 -27427 -25729 -9395 25179 -7146 5163 16159 77871 104477 68841 31968
14341 31968 3879 1578 21438 25688 -8856 -52736 -39859 -11070 -26021 -51193 -48312 -12230
14329 -12230 33181 6824 -26479 -67609 -32609 -9461 2402 20716 36754 17717 -6286 26785
14317 26785 61641 79140 73700 35182 15930 7873 14436 20554 45797 23415 -12803 -37609
14305 -37609 -24553 -11935 -12690 -94789 -60555 14495 -8611 -12210 18784 -36297 -48656 -10843
14293 -10843 26109 19174 4624 -21666 -27319 -37322 17564 636 -7557 29228 31973 4794
14281 4794 -7535 -33802 -59916 -53803 -52514 -64610 -61602 -47647 -54544 -57390 -24261 -43647 -38947
14268 -38947 -49316 -85622 -60091 -57893 -70907 -66266 -48297 -38340 -30798 20981 48562 55902 44716
14255 44716 76078 57244 28551 31561 23383 21521 -5368 -26924 -2732 -8986 -11898 12274 -707
14242 -707 9722 19159 -5229 -24136 -19262 -32885 -4842 5854 -34639 -61363 -19897 36655
14230 36655 50755 39605 29256 33827 -5961 -13734 -2399 9142 33915 26797 -11291 -4794
14218 -4794 22760 65634 32205 10343 33169 25634 12941 10557 1365 -15324 -6849 895 11389
14205 11389 2348 2734 50987 86707 122719 132823 129289 128810 72890 -39785 -114604 -105148 -43794
14192 -43794 1441 -19370 -6501 -19843 -19298 -49255 -82391 -66876 -15967 10080 -7145 16868
14180 16868 1016 -13924 -53356 -63696 -26767 -247 -4868 -17168 9668 23005 55162 37071
14168 37071 16181 -11087 9369 -24109 -68087 -85114 -86495 -52603 -39239 -30426 -37411 -62543
14156 -62543 -81651 -22556 26687 25319 -12200 -19211 -39658 -63720 -54736 -45785 -37901 -36660 -34197
14143 -34197 -52071 -67046 -61058 -66534 -43218 -43274 -27442 34039 26600 -14948 16030 3890 -43826
14130 -43826 -66355 -64057 -33044 -9514 -33590 -52981 -19081 -25621 3101 34810 59760 71296
14118 71296 57244 21031 1247 -953 -39071 -67287 -63057 -61115 -49723 -5447 32366 28144
14106 28144 19722 -6982 -33270 -55255 -33839 14021 32462 3582 -22841 -74691 -110155 -67772
14094 -67772 -52795 -18778 38056 9111 -24477 -38608 -59235 -78891 -94802 -66018 -77177 -45089
14082 -45089 -24554 7901 -26424 -10493 55269 65620 76316 107175 45591 -10430 -20660 -24134
14070 -24134 -21274 -3205 -2098 -36262 -5083 -11024 -3263 -5484 -54332 -61581 -44883 -64946 -72929
14057 -72929 -101917 -88704 -58345 -22740 -15984 15477 4698 -20531 -33949 -44768 -46782 -31771
14045 -31771 -37887 -61059 -83981 -119224 -138576 -101430 -5198 3529 53951 58274 49026 65450
14033 65450 21328 -3915 5704 16827 18793 39413 62104 56487 13439 -23946 -19636 -50083
14021 -50083 -62467 -44441 -12517 -9798 -27674 -28768 -19216 4875 -676 14638 78351 100697
14009 100697 64540 66844 50319 47882 70944 53781 1674 20434 29090 25299 39550 61859
13997 61859 50672 18536 89 -12918 -42615 -28468 -23020 -43068 -53241 3032 46811 87942
13985 87942 87856 108184 81714 57399 5481 -37228 -15157 15099 45793 19294 -4598 -1797
13973 -1797 16926 -2248 -15453 -28002 -2853 -16434 -59823 -44857 -61178 -104622 -72532 -44547
13961 -44547 -73726 -75126 -41507 -20016 -23118 -41988 -33413 -33453 -28506 -5757 34972 40734 -1224
13948 -1224 -3225 24530 71517 88570 77406 83347 81766 67148 53322 53057 34782 6009 3644
13935 3644 -20396 -10331 14513 763 7149 32895 58604 74792 74851 49088 13364 -23645 -55937
13922 -55937 -49719 -65020 -14008 37027 76467 99036 100979 80432 82857 98374 89602 62599
13910 62599 38064 31220 35514 60733 75314 7670 -31135 -45033 33364 97910 134534 114113
13898 114113 46547 44723 46724 20833 -991 -15412 3686 -2929 2766 32050 63400 77915
13886 77915 65244 29602 11159 -12323 -8419 -15134 -44791 -56779 -34175 -6177 42297 52016
13874 52016 27612 -16752 -40741 -14434 -10696 -16562 -15099 -5741 -56788 -101575 -87968 -71078
13862 -71078 -25259 -14671 25869 -29229 -84025 -71222 -34327 -22520 11436 24166 45277 57831
13850 57831 -12016 -28663 5966 10455 -34910 -43636 -47322 -51889 -5214 23744 22083 5256 36416
13837 36416 71133 60026 25153 23846 32608 -2663 -44043 -79135 -55921 -2196 -11474 -28980
13825 -28980 -4409 -16789 -37298 -46797 -41729 -45597 -43225 -63062 -44225 -30730 -2710 -657 -22441
13812 -22441 -2131 -22759 -60609 -53714 -28022 -711 6131 14873 -24595 -26652 7271 42574
13800 42574 57718 37276 25701 10463 -10848 -13902 -40107 -62611 -62095 -51829 -50449 -57962 -59144
13787 -59144 -15774 36231 31847 -319 -24627 8363 6232 44226 36885 46703 49113 23344 23832
13774 23832 15641 13131 46422 16829 -2972 25089 16738 -19067 -5478 40003 57298 43994
13762 43994 69337 71568 71532 50659 45890 19868 35184 25731 34372 20733 -3804 -60243 -62992
13749 -62992 -28971 -22965 -58001 -86603 -73725 -25026 376 -42160 -95237 -100405 -61826 -26492
13737 -26492 -18948 -22371 -533 12238 -18697 -38834 -22261 26789 63282 82257 45069 6694
13725 6694 20072 14720 912 1139 -22050 2678 29612 31760 38526 12496 -36921 -3990 49666
13712 49666 33579 7136 39550 4945 -26672 -32429 -34907 -25708 -24338 -32572 -38708 -88486 -86317
13699 -86317 -93277 -71149 -30521 -2791 44046 10318 17513 40496 66897 78592 70963 72655
13687 72655 53670 33297 17868 12751 33170 40035 43117 -10323 -37399 -17109 -4833 -10040
13675 -10040 -40174 -80192 -117064 -85356 -89058 -84293 -59634 -32230 26010 41814 48930 20466
13663 20466 -15002 -7505 -14504 27469 -17891 -18372 -45418 -51046 -8571 3759 -7634 13811 -16191
13650 -16191 -63979 -104889 -97350 -70172 -54962 -58662 -32022 -3245 -39526 -47666 -12935 11927
13638 11927 3926 1317 -36399 -16727 35890 30146 14331 4625 11862 -7055 -20285 -12449 -31024
13625 -31024 -49138 -14165 -1183 -36245 -30789 7540 69452 82890 76493 40484 28878 38155
13613 38155 15568 -20080 -22621 -41973 -84750 -74547 -60530 -48330 -18833 -36122 -50396 -16043
13601 -16043 184 -21387 -18585 8206 -14561 -29897 -25394 -66299 -88938 -70473 -26922 -43108
13589 -43108 -48539 -62746 -47872 -11128 -33087 -40909 -33833 -53500 -18972 -27307 -42244 -50260 -49713
13576 -49713 -45446 4035 -11313 -27730 -31883 -27879 -13457 -14594 -5159 -1772 -30623 -31286 -19895
13563 -19895 -30309 -6406 -17589 -16741 -20168 -48356 -25001 20928 27045 41468 59105 26330
13551 26330 16403 38354 50276 30619 -9788 -44711 -58954 -45739 -38860 -52820 163 -34239
13539 -34239 -43229 -12451 278 20332 17492 1543 -20971 -63803 -31371 807 9548 16881
13527 16881 35033 19243 5867 4467 29796 40766 13692 28766 31793 30257 23153 30998 15930
13514 15930 -1108 51057 99436 71689 31948 1422 8718 31665 40216 13787 22491 35260
13502 35260 -4438 -20952 -29146 -42256 -53505 -19753 379 24874 56722 44222 19822 30496
13490 30496 16147 -10798 -19432 -3225 -25817 -56550 -50778 20123 47633 56200 23534 14555
13478 14555 6664 17069 22927 -15523 824 3475 -7122 -10470 17648 -7865 -22921 -53766
13466 -53766 -52782 -55638 -43690 -18508 74193 98368 54487 32275 -5062 -5752 9143 33324 36371
13453 36371 -12890 -17470 -12244 1808 7528 -24577 -34201 -72419 -82040 -68346 -30380 -44745 -24316
13440 -24316 -7136 26193 61139 76087 24621 -14108 -9114 7309 -6185 -24449 -41378 -52068
13428 -52068 -33522 -30646 -7985 3504 6938 1928 -41406 -69935 -46149 -13650 10958 45723
13416 45723 47517 12876 -23172 22865 39659 34746 -2962 -40692 -41687 -56886 -55990 -8785 -8370
13403 -8370 -29349 -54981 -23196 -11513 -48564 -52255 764 8249 -21835 -25462 -12405 16711
13391 16711 22822 -6876 -9157 -7080 -6180 -4299 -48401 -97465 -66711 -30438 -30865 -16343 -16029 -2273
13377 -2273 -25929 -52405 -23431 13190 5100 -8887 -9145 10760 12469 22862 31512 18078 19466
13364 19466 23784 31347 35294 16904 -14431 -28658 -38737 -57821 -68900 -42809 -19889 -20134 -19818
13351 -19818 -31607 -4918 -5762 20746 55075 72272 45595 39279 22482 -8604 -20251 -41373
13339 -41373 -49683 -62210 -47535 6598 8654 -3941 26627 37024 -7154 -20566 -5762 -9649
13327 -9649 -41817 -5502 -10158 -13528 -27342 1701 45280 65238 45415 51927 47485 30255 5811
13314 5811 18488 10472 11381 16906 27266 32771 46868 39250 12245 2285 600 -8052 28617 33826
13300 33826 20964 43755 18551 17736 8172 9589 29356 63061 65831 50605 24410 50299 32524
13287 32524 33187 64748 25837 -35332 -82465 -66543 -50368 -60568 -31944 -10586 61 -9772
13275 -9772 -447 -27627 -60503 -44539 -12511 8381 15304 -6989 -41356 -24976 11144 30370
13263 30370 -9106 30524 9990 -19143 -33855 -29492 -29443 -16221 -9853 -17343 8039 57153 74508
13250 74508 73467 34789 40547 23181 -13034 1114 27711 -20966 -26804 -33348 -33234 -40485 -56199
13237 -56199 -38223 -28356 -52454 -42374 -39976 -5183 5538 -1347 -2137 8 -15771 354 -297
13224 -297 855 3004 3576 27189 21881 -19862 -48843 -67858 -34866 -3198 -4259 9815 2347
13211 2347 -26510 -22741 -26714 -34288 -41161 -61173 -67961 -16574 -1043 -19597 24160 22768 -2157
13198 -2157 -44664 -29480 -29409 2136 11648 19151 -13347 -28437 -12012 -38785 -67858 -84545 -37244
13185 -37244 -42959 -87313 -44615 -4025 1000 -2110 26819 28825 35246 37825 49353 4822 -28107
13172 -28107 1499 24109 48394 38087 17553 21953 60173 26016 -1042 -38386 12210 43162
13160 43162 42786 43955 54638 49032 17168 -34532 -39366 -54116 -70262 -38070 -5130 -45734 -89758
13147 -89758 -20072 40220 23497 -30755 -34525 -29919 4934 90065 116904 69070 40587 8117
13135 8117 16859 6857 -30671 -20874 -36810 18677 9259 -21798 -30163 -31799 1111 46506 41570
13122 41570 24349 31004 -2416 -46822 -25737 -1211 26082 20786 -5856 19414 13662 7817
13110 7817 27630 10531 488 -23692 -22732 -27673 -49173 2269 16879 16376 -3944 -43099 -26528
13097 -26528 -74649 -69868 -35373 7218 -7453 7500 -17164 -1595 -12525 -10923 47291 46160
13085 46160 -413 -12958 -32005 15951 48295 55628 34356 -19147 -5401 9277 -13847 -28974
13073 -28974 12057 -21613 -31246 -20668 3094 36909 20174 4283 7686 17006 -13477 -36207
13061 -36207 -9900 -327 33782 29733 14589 9796 29651 10602 6400 -1522 -12192 -11748 21651
13048 21651 25658 21107 -12663 12421 30400 43743 2191 -11398 -44653 -55251 -55632 -49221 -21157
13035 -21157 -37844 -56881 -77890 -53615 -15203 -11541 -26318 -16512 4556 3304 -7526 -161
13023 -161 -24095 15853 -18586 -47869 -29133 -23078 -48299 -72105 -83564 -102292 -118252 -111843
13011 -111843 -73230 -20648 -23532 -9620 -3369 -6069 -22294 -15170 -13160 -4438 -36222 -53440 -14352
12998 -14352 -16191 -29731 -21186 1494 -7351 12677 5562 -9882 -2539 -22389 -35647 -42526 -38822
12985 -38822 -22985 -22495 -5363 28961 43576 23385 4036 -5002 55234 87853 50504 15943
12973 15943 17514 57755 63794 31873 35295 -6628 -6673 -16630 -45084 -38398 -12951 -44329 -70010
12960 -70010 -34213 -10095 -9171 -29412 -32888 -9645 17713 -32816 -65026 -57978 -58717 -58888 -20801
12947 -20801 -5862 21372 49052 45672 44939 -1579 -88970 -119064 -135769 -107029 -88004 -100101
12935 -100101 -88840 -52839 -23722 -32277 -29096 -21968 11537 57718 35222 17203 49422 15932
12923 15932 -2465 15557 12295 27156 -3309 -52550 -35566 -41874 -43804 -3329 23059 -9776
12911 -9776 -47381 -23364 132 -30900 -85667 -78106 -69986 -64526 -62234 -55539 -20959 -14311 -17717
12898 -17717 -28242 8842 -9021 -59469 -63243 -49168 -51111 -61324 -99593 -88064 -19657 13570
12886 13570 28913 32676 -5224 -36290 -18110 -9559 -24798 -40882 -56986 -60417 -27827 13369
12874 13369 16810 -27132 -50222 -97261 -53351 8542 3311 -33810 -64279 -61163 -36124 -34548
12862 -34548 -27920 -8422 22343 63391 24306 -6357 18947 103021 101018 22256 -6472 -18732
12850 -18732 2259 22920 4319 -8074 9983 49684 45956 42813 45421 34147 36807 77289
12838 77289 48821 6155 1273 15452 9942 32780 59670 53439 21115 169 -28439 -21495
12826 -21495 -17218 7533 35113 1259 -44254 -28855 -48064 -62173 -46580 -18555 4690 -9827
12814 -9827 -17998 2047 -25139 -53764 -62837 -23701 -22800 -59656 -64104 -78450 -60057 -75163 -85775
12801 -85775 -72945 -19355 35239 506 -27212 -39628 -25534 -26409 -84074 -65385 -63487 -57208
12789 -57208 -49181 -56927 -50586 -39399 -32820 -30947 -8298 -4755 -42222 -39667 -7749 -4991 -13306
12776 -13306 -19681 15005 -2580 -21362 -4825 21581 15061 9588 -15395 -4786 13281 38999
12764 38999 36483 39462 -1635 -47904 -46765 -21414 37637 57789 52529 69056 63107 25465 -28825
12751 -28825 -23036 6218 36297 85407 14267 -46240 -8783 2076 -11764 -2031 -3075 -17436
12739 -17436 -15981 -2536 12476 70086 81332 49094 48956 52077 45090 33860 55022 49949 34544
12726 34544 65327 42200 18996 27907 13963 17996 75392 71265 3644 -54936 -51376 -31070
12714 -31070 1023 45787 74977 64599 409 -25387 -9206 -7960 970 -42117 19977 80301
12702 80301 73972 84836 79455 24585 13624 -14959 -29473 16323 37437 74710 99471 59547
12690 59547 -1985 -31120 -30705 -23744 25975 4088 -14454 -12842 -49383 -13191 21400 -10230
12678 -10230 -12580 -51917 -21469 -10667 -20121 1794 -9273 23103 23633 4498 8669 3283 -18263
12665 -18263 -51060 -44245 -21227 18393 158 -23276 -4512 2192 -22617 -38201 -31027 -41734
12653 -41734 -42263 -39890 -5606 5452 -13480 8681 30896 13649 30504 72337 94453 69007
12641 69007 62606 12312 -35104 -43394 -57128 -68240 -60133 -77644 -104586 -77659 -39731 -68376
12629 -68376 -38472 3134 23072 -14979 -34307 -45083 -77318 -93500 -79439 -65778 -57780 -66054
12617 -66054 -70503 -51328 -43632 -52465 -32018 -6763 -19715 -6473 27204 8405 -28491 -31317
12605 -31317 -26673 -18565 -50295 -37032 -64178 -52329 -39843 -98122 -89640 -63483 -23437 -21847
12593 -21847 -26285 -13751 -23777 -28706 -23782 -22821 -77460 -100207 -74451 -56798 -49788 -74534 -46858
12580 -46858 61904 68034 56962 68016 30921 -1518 -14617 -28194 -1746 10692 -20770 -15551
12568 -15551 -23387 -32688 -66252 -60715 -28639 -7125 -691 11124 34748 57053 47963 34549 27139
12555 27139 24835 18364 909 -30141 -32991 -44745 -76690 -65797 -43506 -11984 -19109 -5415
12543 -5415 7165 -15941 -41913 -7679 14296 66034 88182 71357 37540 12696 -8667 18820
12531 18820 -9040 -64711 -32504 -17028 -42546 -44460 -14996 -4671 -13953 -37023 -13608 -21893
12519 -21893 -16824 -19611 -17227 -13578 17243 34986 50043 20326 11292 16320 -23178 -12546 10077
12506 10077 53448 43739 -819 3053 -19817 2171 18256 7838 -3770 -15179 -16297 29409
12494 29409 35586 23554 -14301 -69995 -89993 -80932 -97836 -106760 -124822 -121642 -84657 -57224
12482 -57224 -66502 -50900 -15144 15932 18736 4318 38142 128193 175026 139255 127929 164439
12470 164439 184893 179162 186917 187545 165562 136711 111453 111747 120027 71810 56920 43488 30388
12457 30388 16671 35037 829 -2769 38904 81334 80762 67480 29388 5163 44163 18279
12445 18279 38234 68864 33887 25467 33464 51434 68648 56887 46241 69287 106094 110590
12433 110590 111755 116690 84973 74740 80967 59321 62119 83394 80785 125097 169584 179214 169382
12420 169382 160776 156034 156419 129366 105899 83654 66720 35496 66988 113383 106383 88558
12408 88558 66428 103425 121437 70051 32330 3057 -30323 -16446 -2783 17425 -24354 14072
12396 14072 34292 44262 34192 34707 17933 7046 757 -11541 22624 24287 36452 26726 30187
12383 30187 7882 -19327 -39278 -56650 -41058 12864 -2089 38010 82629 131685 164170 230016
12371 230016 252121 285046 264343 186488 123077 83940 46581 45881 33859 15127 -5944 -28826
12359 -28826 -34440 12960 76319 67616 30807 14687 33860 5610 30012 67296 86853 95898
12347 95898 92418 53901 27856 47024 50306 -5911 -33609 -37223 -24122 -6054 5081 6025 64422
12334 64422 74665 6169 -44988 -58647 -41096 -11284 -17446 -25054 -11566 -1640 11946 10737
12322 10737 1710 21434 42675 67146 73487 46673 60056 67042 32653 -966 26796 42186
12310 42186 4831 9439 26351 85241 68746 49413 39847 60020 65691 31420 35902 17121
12298 17121 64364 109872 44363 -5560 -16367 -50693 -44178 -27661 -26779 1780 16610 -24859
12286 -24859 -27187 -38049 -28325 -27914 5234 30605 62276 73369 34820 54401 62545 32177 18744
12273 18744 -18358 -13041 -9640 -19360 -14874 -13347 -11152 -763 -57 -42461 -53115 -34079 -20975
12260 -20975 -30947 -14886 -15746 -48818 -60921 -53587 -37212 -43512 -28544 -28466 -4709 14101 -4358
12247 -4358 5437 25440 2877 -67524 -40228 -43302 -30544 -49012 -49327 -26584 -25533 -38638 -36921
12234 -36921 10469 29958 9947 6517 28018 39419 24380 1037 -13216 -19654 -32065 -25896
12222 -25896 -19256 -21343 -37941 -45673 -46303 -38582 -56585 -54847 3811 17302 62823 80373 76056
12209 76056 46474 1639 -3976 -35617 -13237 20322 20971 -535 -55172 -24712 1033 -23399
12197 -23399 -43085 -9851 982 -8137 15405 54024 38657 9926 19628 58867 54851 26889
12185 26889 26253 42827 14306 41453 57592 -21145 -60178 -23208 -12474 -22060 -33106 -62001
12173 -62001 -109409 -133752 -75980 -59697 -50998 -36249 49778 47723 24251 43321 21211 30151
12161 30151 32545 14339 4970 8071 -1721 -5633 4872 9386 -25697 -29994 -4000 21095 40468
12148 40468 53111 46185 27154 9574 10916 46935 76925 120503 131457 130992 101308 82870
12136 82870 17913 -42316 -46664 -26370 2154 30764 29298 17776 31278 23476 29801 51681
12124 51681 26151 7030 -13442 -29561 -26830 -9347 3263 8268 47423 63635 76464 61230
12112 61230 53116 17982 -43971 -43426 -14245 -15715 -14095 12028 33539 35672 25175 29735 18289
12099 18289 -1076 2457 43330 54110 12951 -8620 26420 24807 -13321 3585 10584 -4219
12087 -4219 -19789 2158 -1554 -21486 -12432 -32422 -14345 19504 40124 74888 69372 22489
12075 22489 34958 35199 30544 37975 56137 37962 12464 26744 34270 30761 24119 9452 21399
12062 21399 -1354 26741 43567 31259 748 -11812 11534 -14584 -23262 -32428 -3683 -732
12050 -732 8696 32589 32996 42219 22916 13298 40551 12406 -56399 -50131 -30341 6984 15473
12037 15473 8642 12821 26217 48834 31059 18238 1735 11775 44069 77699 71885 30532
12025 30532 23486 -5953 -32260 -21259 9040 862 17998 15566 2295 1854 3647 55218 31996
12012 31996 21402 -5958 -47382 -42480 -40737 -3645 2984 10038 35971 50333 13816 -604
12000 -604 38675 58402 45837 31697 13984 -35381 -95913 -109773 -76676 -64533 -76677 -67047
11988 -67047 -52465 -29463 -11320 -3269 -33005 -13137 -3149 29621 56580 59310 31382 1972
11976 1972 3883 21164 19497 29284 48938 53217 5976 -1093 -2255 -18749 -56255 -84336 -43971
11963 -43971 -83294 -80527 -74288 -39468 -16629 -34128 -35617 -59409 -106432 -105383 -101962 -88450 -68609
11950 -68609 -87599 -101433 -89732 -40940 -25730 -13361 7861 15069 20691 8621 -20970 -17435
11938 -17435 55084 101473 49267 15607 11698 11256 22279 12184 29809 40855 38091 16546
11926 16546 -12475 9373 31829 27560 6294 -3318 -97 29570 41815 5998 -77759 -130819
11914 -130819 -109385 -48385 -20376 -41361 -32722 1104 -4141 -4173 -77627 -84324 -44933 -13154 -10656
11901 -10656 -30783 -33123 -29758 -37987 -14812 -12463 35 3390 27163 48345 8520 -36346 -49669
11888 -49669 -48975 -53050 -60096 -32061 -22017 -54575 -62745 -50809 -60377 -26407 -22876 -29014 -55806
11875 -55806 -52538 -25603 19275 16907 444 -34325 -24216 -958 -10689 -13213 -38640 -38095 -7390
11862 -7390 33283 41686 73212 51603 10205 -11303 -13492 -3531 5051 -30673 -17012 10652 -17145
11849 -17145 -41369 -20627 27496 -28872 -21282 5705 46672 63769 -18671 -63680 -62990 -65497
11837 -65497 -43947 1568 8512 -15335 -22385 -17533 -41892 -63241 -82839 -89760 -85910 -73216 -76720
11824 -76720 -39567 -11199 -19029 -103 38555 37293 28143 -5247 -31686 -37652 -46872 -52995 -64208
11811 -64208 -104397 -103722 -50943 -26463 -26927 -47435 -86351 -73935 -60592 -59033 -64684 -65615 -81257
11798 -81257 -58258 -63750 -107542 -62794 10713 39884 48680 20136 -15066 -67082 -70653 -39221
11786 -39221 -43196 -14587 -60245 -87346 -103071 -67577 -55265 -49453 -20821 -34346 -12329 1320
11774 1320 -44980 -47384 -42657 -21150 -15615 -30240 -69663 -73894 -61065 -35388 -72054 -104156 -78801
11761 -78801 -36908 -27592 -41272 -1632 -12413 -3623 -19533 -24884 -22443 2995 -10275 5517
11749 5517 18959 -4262 -39601 -32161 28170 12639 20552 27024 -13793 -5673 -12250 -41441 -42104
11736 -42104 7716 -1207 -21457 -19647 -19318 -78283 -69583 -33628 -60096 -64397 -51346 -52441 -60650
11723 -60650 -43874 -9690 -4069 -4974 2117 9610 3292 830 31112 63815 50603 24627 39373
11710 39373 42802 31573 4280 -34325 -26976 9359 727 5290 1047 -22646 -43471 -70746 -64893
11697 -64893 -29231 -54125 -74261 -71962 -47259 -47128 -11116 -23224 -57958 -101636 -63873 -64700 -88660
11684 -88660 -49673 -16736 -24275 -4618 4791 -68008 -46306 13354 9495 -25865 -7538 36515
11672 36515 33491 8323 5376 5847 3297 14819 659 -7920 25925 -9467 -41172 -38580 -45232
11659 -45232 -34363 14440 29831 26986 22246 -28175 -33258 -6597 -7667 -32165 -22529 -59717 -73226
11646 -73226 -54531 -12577 -26474 -62432 -45379 4519 13372 -18634 -7115 6897 -46137 -63456
11634 -63456 -51551 -15953 15112 -882 -3642 46605 34356 17450 -6876 8792 1516 -19681
11622 -19681 -40584 -63184 -26292 -42185 -52210 -56905 -109126 -113170 -102797 -97992 -36324 42447
11610 42447 29423 -43090 -64268 -34690 -15818 -19148 -45296 -81553 -20475 25419 7285 18003
11598 18003 12116 -9443 -13470 -19971 -18369 -4389 -15196 -35433 -16063 -12417 -26567 -28483 -26430
11585 -26430 -55819 -44635 -46184 -66917 -18584 -8447 -6483 -38070 -42040 -31257 18598 -5401
11573 -5401 -14271 -39064 -40039 -43438 -44030 -35613 -36257 -17389 -35940 -46860 -29615 -12102 695 -36410
11559 -36410 -59526 -8495 -10864 -45203 -29820 -10606 -52621 -88363 -58312 -49881 -77847 -71540
11547 -71540 -11573 -9127 10175 29129 27517 34922 40769 24878 19700 19112 41139 33716 70286
11534 70286 21102 17632 -12501 -52014 -84100 -104525 -68948 -38936 -26556 -23219 -24893 -16903
11522 -16903 3155 11651 14378 16136 -8403 -38997 -30579 -40642 -10343 -57874 -63147 -49673 -23581
11509 -23581 -29884 -39816 -65556 -65782 -68727 -47377 -13716 -33196 -48683 3957 6892 7287 16376
11496 16376 4681 34960 35920 10757 2176 -25075 -33961 -12060 -1996 -42064 -36718 -38185 -16271
11483 -16271 -23656 -38983 -13046 19539 34522 18989 -11622 -55449 -55512 -74364 -24375 35115
11471 35115 43464 -22723 -64052 -33387 -51710 -47314 -25299 -48003 -49055 33426 18850 -22436
11459 -22436 -12366 20246 61615 40400 11209 -17070 -28375 3324 61447 39395 27429 3783
11447 3783 -52448 -74158 -55875 -65279 -38663 -4691 28926 59889 19407 15948 35630 49309
11435 49309 86134 146383 138054 113438 52873 -2237 -11228 3480 -14133 -18034 -11823 -32763
11423 -32763 -23558 -7825 -509 -17654 -51838 -61875 -57720 -31329 -34345 -36369 -10733 2931 22418
11410 22418 42340 42568 34866 -8536 -18410 -30952 -38849 7679 42732 -7142 3444 7936 31473
11397 31473 20891 7320 -539 -9123 -32579 -12046 11279 34910 53797 57521 60961 27923
11385 27923 -32226 -54026 2758 -3172 8987 17935 4809 4391 3231 8122 -20030 -27652 -29963
11372 -29963 -60950 -65714 -15651 11302 11155 14045 19128 9655 -21640 -40180 -8302 28518 21265
11359 21265 34705 61949 14850 5237 28638 4395 -10554 -9526 13497 50720 25066 16666
11347 16666 13769 52421 15094 -1794 -4562 -39569 -60838 -34603 -18057 -17215 -34810 -33265 -63109
11334 -63109 -54488 -31116 -25312 3487 -4461 -21634 -37 16323 -37788 -58243 -55273 -58975 -40781
11321 -40781 -25306 -14940 -37629 -61131 -42860 -53050 -54583 -29814 -41267 -47467 -53094 -92054
11309 -92054 -86552 -22265 19665 18500 -11895 -39770 -36286 -29113 -25981 -38361 -78083 -22687 -18342
11296 -18342 -8463 -6875 -50484 -63809 -5674 8649 -7752 -271 -26163 -6791 -46231 -65980
11284 -65980 -91981 -97447 -136878 -121300 -79690 -33468 -28030 -22147 -16852 31385 34174 14731 -9352
11271 -9352 -11398 -17880 -2761 -20893 -44908 -45663 -45431 -105824 -120592 -119971 -83372 -36194 8595
11258 8595 1681 -4850 -24821 -9146 22947 23665 9639 16569 -8250 5336 -8818 -58094 -46272
11245 -46272 -59476 -30409 -38660 -61985 -81029 -120189 -132659 -120506 -90040 -30971 -27748 -17004
11233 -17004 -17367 -5260 -49525 -40458 -33351 -33186 -64902 -57221 -34301 -2683 -3470 -32298 -63099
11220 -63099 -81771 -39795 -30686 -42618 -28156 -7532 20944 16765 18453 39065 37942 19732
11208 19732 9299 17741 -8166 -45941 -58041 -62367 -19355 -20422 -21323 -42444 -52855 -47860 -27821
11195 -27821 40700 42141 24709 24298 -16001 -53848 -53790 25686 66939 56416 34627 46590 57276
11182 57276 52487 58387 70330 75569 42559 -3463 -46046 -39462 -22206 -36561 2896 34978
11170 34978 10786 -22015 -22769 -65621 -50574 4897 -7330 10250 -7986 1562 14783 28663
11158 28663 48528 51764 22875 2433 31044 31520 40879 18285 10956 25824 4388 -26800 -21660
11145 -21660 5847 53349 65601 73327 83794 114453 88328 75211 23035 -15930 2355 31576
11133 31576 63780 54285 29495 -15735 -63183 -64522 -38592 -29710 5668 13831 -47416 -50892 -42717
11120 -42717 -32906 -40166 -21305 -10355 -4363 -27065 -29520 -9229 19417 11051 18426 17617 16493
11107 16493 15890 17061 -23963 -56963 -13559 4548 -51967 -93915 -107670 -69573 -62882 -27072
11095 -27072 30220 45150 15050 23195 31220 22218 32209 35497 56138 35095 30848 74069 94635
11082 94635 97225 121114 76989 56277 30921 5347 17325 25831 10988 32266 32442 29923 54127
11069 54127 70340 50949 58386 53938 36922 41176 34160 41889 72838 64460 26198 -364 17308
11056 17308 -8847 53904 58547 9957 -8346 1529 13916 32130 13033 35464 9131 36555
11044 36555 31234 -16693 9752 69561 119109 112251 109200 103435 53073 59384 88605 112317 92573
11031 92573 78050 63517 71233 90179 140570 209015 242654 310325 418144 537344 637558
11020 637558 774749 971339 1240826 1558717 1920548 2366834 2994554 3892348 5219789
11011 5219789 7196688 10373546 15095832 19935595 23313182 25546030 23636413 16826426
11003 16826426 11357603 8273733 6480166 5337008 4526048 3961310 3490195 3103408 2812470
10994 2812470 2565670 2356710 2210868 2143556 2108088 2044133 1959677 1933836 1893442 1806872 1691469
10983 1691469 1560452 1443266 1352665 1228303 1132926 1081841 1079784 1008362 904910 836618 787984
10972 787984 749953 709417 643201 574284 526032 485412 491253 483425 436309 432752 451291 437403
10960 437403 439009 438381 409142 355057 300293 280534 283021 233104 217440 249853 254010 263576 284075
10947 284075 294118 272451 219844 218000 247065 314720 303107 212274 133606 146822 195138 182768
10935 182768 171459 174394 195676 241357 206403 166386 160390 135487 91371 78107 87746 86704
10923 86704 120829 128694 83356 57860 78400 79604 62131 49917 74810 109047 107782 126688
10911 126688 162909 110251 100001 120340 72111 96520 144150 98642 55761 71672 82599
10900 82599 99298 113631 115981 137529 131009 117744 112023 125605 158767 183839 191743 147739
10888 147739 128690 135233 129968 96104 86288 93734 113140 107245 70404 82107 71718 94468
10876 94468 79803 56299 70093 52242 8780 -12062 34935 48931 31565 46279 37221 28754
10864 28754 12239 9277 -2789 -22686 28498 36425 34409 48559 71153 49809 4469 -19016
10852 -19016 -321 69153 44462 48446 45195 68540 53457 54113 78574 90326 72191 61430
10840 61430 79702 26943 -20807 -17469 11703 15767 34311 26176 44846 80005 65326 49559
10828 49559 94046 63250 54820 15197 -14211 10985 -25973 -38117 -48166 -25766 -13762 23187
10816 23187 47671 65256 84064 138558 152120 117167 88932 16054 -16642 -153 54609 65728
10804 65728 60570 45938 25315 6069 10211 6562 5352 -1210 -2972 25864 34185 31340 15688
10791 15688 -20075 14866 56598 69629 41995 25109 7709 -18424 -33384 -7831 4166 3544
10779 3544 -35445 -61719 -46538 -21023 41993 48046 72699 77486 14313 -23532 -11261 11018
10767 11018 12991 -37138 -36583 -23440 -10118 -468 -485 20534 25765 12675 14982 -9377 -14002 33594
10753 33594 38339 20186 21204 40227 37160 26371 3932 -43308 -21389 48097 39655 -1803
10741 -1803 -21105 -31093 -17326 -48343 -86573 -47457 -16907 9922 47136 27089 18128 26101
10729 26101 19135 29890 27249 46749 50553 35983 40669 76733 72304 46043 59151 14439 -4936
10716 -4936 59514 38743 18763 29832 40796 13133 -24565 -38091 -78410 -72747 -30710 -42321
10704 -42321 -41585 5529 27458 25903 20972 7378 11539 41415 28896 19235 -8135 -3626 6393
10691 6393 -25527 -16826 8991 -31996 -69885 -38632 -39858 -34794 -2204 15932 -10422 -2179 9540
10678 9540 10958 -28597 -58645 -39759 -32294 -38181 -37931 -16660 -3659 16487 -3687 -25832 -4817
10665 -4817 -86 43716 55258 10250 2244 21008 25910 43417 55671 26708 9660 25508
10653 25508 -12964 -51646 -73169 -45457 -33885 -61871 -40138 -4136 13459 41562 61760 65289
10641 65289 31040 -18613 -50425 -10633 -25254 -58302 -86484 -60629 -36135 -2407 50822 63216
10629 63216 47788 1476 -45998 -56092 -21187 10975 -20979 -16972 3274 4512 30237 52211
10617 52211 72082 78738 76196 81308 48938 36446 38779 25428 39029 60255 63597 32866 21702
10604 21702 51858 32346 47818 60223 68627 19830 -27041 32878 89736 10623 -17975 9720
10592 9720 25533 55397 56399 40790 12454 -3885 -12878 14013 49838 84846 81489 58475
10580 58475 44725 26990 -7052 -46492 -50573 23150 52554 35080 65922 19969 -9481 -19907
10568 -19907 -13151 45147 38318 32986 30517 -24111 -18474 27952 67255 51610 27792 29287 45641
10555 45641 6367 -26867 -45833 -36973 -4531 34167 55886 52717 3111 -5614 -18335 -37579
10543 -37579 -41112 -14682 1349 -40644 -59473 -28898 34333 40458 7722 23254 11371 23948
10531 23948 29117 11417 -25416 -51141 -26510 16204 4055 4514 20237 27580 35369 25221 32499
10518 32499 57181 38678 9790 -33913 -39682 18112 77013 99098 86086 54714 27482 -6159
10506 -6159 -23575 2831 22015 18159 17551 23779 -7591 -35380 -66336 -57237 -42879 -54005 -9149
10493 -9149 -8125 15159 25110 41326 37847 18352 79110 57172 -9043 -44849 -28059 12711
10481 12711 -7575 7149 14049 -16009 -29030 -31311 -27142 -32605 -67100 -62013 -47589 -49025 -25056
10468 -25056 12073 9248 6652 6358 -10726 20651 32705 7099 13216 -6459 3601 59092 46584
10455 46584 33899 19566 17868 14687 -14526 -37246 -20105 -17112 -31892 3584 -29601 -45625
10443 -45625 -47208 -30563 2643 17865 24222 21365 22208 13510 17340 -20452 -27145 -2619 14483
10430 14483 43720 51543 21783 53463 68015 58385 57553 55879 32640 58827 44553 26726 36851
10417 36851 8882 35678 88470 54706 13846 1203 10073 34309 22207 19903 -12524 -26351
10405 -26351 7903 64755 50525 -5028 5894 -8608 -1333 46018 41072 57258 51935 14838
10393 14838 -28671 -27613 -23979 -25332 -849 -40689 -45833 -31735 -78622 -49388 -7925 283 -470
10380 -470 -906 66231 43358 -73614 -89398 -53565 -28510 -38143 -25261 -29082 -42197 -46129 -38813
10367 -38813 -38715 -33439 22513 -19388 -16674 16672 14696 26611 31364 13316 -15450 1561 15965
10354 15965 38965 26060 14648 16138 14162 22828 32030 67063 20551 -31725 -39340 -30178 -974
10341 -974 22979 8157 -25843 -6518 6823 -10707 -17716 -19908 -22017 -17673 -44523 -68292 -39639
10328 -39639 -31572 -20700 -4034 17962 15633 -8845 -4394 45059 644 -26873 -24718 -10036
10316 -10036 -15156 3868 -3394 -9458 -20606 -21920 -5719 -33635 -23742 31376 59563 25752 16021
10303 16021 34939 23341 -11822 -23757 36440 50456 80797 60522 46804 10622 -20515 -4174
10291 -4174 -6853 14801 -10444 -3380 11531 -17828 -2605 6442 -9069 -70320 -74663 -46495 20475
10278 20475 -13437 -53241 -27399 4490 -20692 -20770 1269 20466 36928 -9609 -53476 -16531
10266 -16531 7961 55138 73677 60645 20407 49095 5895 -12573 -22064 19234 81016 92637
10254 92637 68580 35520 18472 -867 2139 -37997 -32246 14560 2018 11123 -3681 2961
10242 2961 61998 68171 26366 2841 16169 33111 67435 62875 51553 62172 42235 57082
10230 57082 46763 1689 -12588 -8805 45607 99677 76567 41109 11407 32500 15849 -48023
10218 -48023 -91496 -79489 -83270 -64964 -58473 -27128 -5026 -23256 23998 75509 114203 107799
10206 107799 71127 55814 71135 50845 23151 9169 39536 61230 44959 41167 44918 44885
10194 44885 28428 -36488 -62838 -35498 8395 14002 15957 10252 -9382 -4947 -19641 -7394
10182 -7394 6726 3965 70932 84581 47674 49995 29241 37279 29279 -13081 -11389 -47659 -73670
10169 -73670 4959 15623 -12446 -52250 -76336 -65632 -43688 16434 24973 12370 30750 11832
10157 11832 -53904 -49840 -40322 -22819 -16388 -55960 -98212 -45868 7785 -38294 6326 6652 -8319
10144 -8319 -4205 2027 -8239 12564 5984 -26866 -34973 -10222 33770 37970 61813 83461 71620
10131 71620 85307 85225 37492 14811 7170 15366 19065 13131 -4818 -32012 -63087 -79657 -59321
10118 -59321 -6279 24888 -5693 -24983 -38344 -9573 34326 76286 53520 25785 39340 74492
10106 74492 70289 57429 49587 11209 -56849 -35337 10753 39099 49915 48687 22689 -11869
10094 -11869 -39071 -37394 -47511 19846 8676 -42943 -51075 15569 63940 12444 -43412 -47038
10082 -47038 -43634 -28920 -6352 -10751 -61824 -39759 -1163 -4414 -10965 9753 -989 -36649
10070 -36649 -31968 23039 63473 127590 136568 105348 70112 55741 30339 14080 4845 7057
10058 7057 -24199 -44663 -45174 -7342 717 -22264 -31897 -77199 -82557 -77562 -13322 18446 -17505
10045 -17505 -23635 -8376 -3021 29199 31403 25450 -3755 3653 -14587 -53167 -20757 4276 -5146
10032 -5146 3418 -21865 -16207 -3191 -33578 -73755 -91022 -36588 -51107 -3839 49852 32727
10020 32727 14280 887 10430 51563 56239 28533 55026 84174 50698 52993 68609 40078
10008 40078 46463 43058 49538 45114 53888 92973 86198 96543 73338 54129 56086 69146 38947
9995 38947 1900 4210 25892 33841 14459 -18621 -31185 -14967 -18813 14582 5166 49113 83924
9982 83924 61371 24372 -12852 -16078 18401 36218 22644 7802 -9639 20180 10392 -14179
9970 -14179 -23076 6208 18364 65306 50774 7320 -23554 -33687 -21183 -12876 35041 41621
9958 41621 43923 57119 80324 81244 85611 121442 128076 82080 16050 19251 15584 8768 -15450
9945 -15450 -10635 30385 33414 73378 84586 77675 48462 35996 30788 10846 -3293 -34498 -65166
9932 -65166 -32581 -20470 -12777 8296 1857 -3529 -5187 22458 9776 19377 11735 10548 21055
9919 21055 44635 5550 -42853 -48159 -29283 -16131 -22650 -54517 -61894 -16081 -42017 -61816
9907 -61816 -30642 -54222 -34919 -33284 -19777 -26077 -10987 3934 12118 39586 17940 -26308
9895 -26308 -42074 -25798 -11298 33665 46769 60971 53002 41847 28387 8789 8699 37428 66718
9882 66718 51287 55175 100094 133591 133275 138003 135261 120412 58111 49895 63953 15812 5307
9869 5307 8843 44467 78877 107990 100446 86894 61147 91180 58165 37465 44560 42561 27972
9856 27972 82279 83393 100558 125499 95429 58361 54512 34678 28921 43575 23674 29443 42753
9843 42753 39039 36507 86717 118444 90776 105142 113071 89207 74037 49390 73247 48475
9831 48475 67927 99201 96133 79347 97872 136483 146486 171415 167502 131961 72047 64587
9819 64587 97000 63292 60896 39106 -17703 -29988 4810 28496 71967 94653 126155 108234
9807 108234 99378 61320 14821 -4692 -7463 -16053 2078 17 12436 10625 26036 53632 48493
9794 48493 81935 76988 100456 141364 143529 120181 101230 99117 85766 51422 34191 34106 59956
9781 59956 84718 98475 88378 119884 131530 112958 116017 125063 120589 88923 92531 96564 96800
9768 96800 97723 118541 146691 136832 107310 96551 67635 17926 45122 61339 23327 38069
9756 38069 11562 6576 -27428 -67070 -51050 -33092 -18170 -29354 -26259 -34381 -27141 -11572 9446
9743 9446 26159 76209 94598 43692 -3324 12396 37522 2211 9664 27970 -9785 -26865
9731 -26865 -4769 -9124 20380 42772 17559 -4624 -74288 -105646 -73572 -30600 -29121 14667
9719 14667 38004 13451 5463 16900 -15457 -29299 -71988 -49367 -926 7321 731 42074
9707 42074 48471 -36970 -27594 9825 23708 25169 31957 16183 -5731 -30539 -62071 -53075 3631
9694 3631 32194 -5809 2932 56330 49469 25286 15993 27029 40421 22263 6029 28584 17537
9681 17537 -17588 -28037 -2860 -3102 44080 101576 58873 7678 10550 26021 67298 41627
9669 41627 10918 6278 -7741 -6888 -24103 -18653 -26651 -7022 34007 26987 -10362 -38754 -29978
9656 -29978 23945 81832 50974 8763 48623 57268 58095 64525 93104 101230 66506 41021 21901
9643 21901 -28636 -22066 3494 -13294 -15552 37244 55817 52939 49295 30687 41344 20620 15153
9630 15153 28846 30652 6655 1975 3458 9011 -35382 14388 18812 18760 -8773 -31059 -8584
9617 -8584 6969 29469 51846 40851 40692 32911 28977 18129 -13237 12331 -41311 -26954 -32271
9604 -32271 -47000 -66950 -78751 -25697 -26880 -46530 6397 -9878 -46542 -45863 -16351 -42137
9592 -42137 -14103 20083 -1295 -29838 -27449 -18154 -19782 266 -9612 -23266 -39936 -19189 3907
9579 3907 9593 15514 -26711 -28586 -19037 -46699 -54506 -35881 -6752 -4016 -34181 -28413 -30572 -30538
9565 -30538 -6521 1827 -7926 -23846 -30402 -25684 10623 41533 53591 70562 95001 66271 15398
9552 15398 28282 28315 40662 38723 -34345 -32045 -24777 -35232 -21062 9271 55211 72489 61320
9539 61320 19480 35972 61187 46575 -11943 -8407 -3461 -17854 -53061 -40910 -57546 -75047
9527 -75047 -49021 -44615 -38763 -37980 -14314 -21036 29429 34467 39135 1480 6999 45350 58122
9514 58122 64592 40732 24939 -4401 -24487 1089 -32031 -39098 -25282 -20915 18287 32583
9502 32583 19025 -7813 -3287 11546 -1038 19553 57254 39312 52998 57500 47115 41611
9490 41611 73388 65941 63999 106284 101078 72836 -1309 -17132 16741 31236 22986 33164 60663
9477 60663 57823 78766 63604 39891 33578 28009 16547 15453 18118 36205 32648 18175 35358
9464 35358 28469 23002 47630 25322 -15810 -32239 -29000 13705 50844 81500 105235 147442
9452 147442 121739 83602 64977 61784 95180 99338 73874 38480 45199 78661 147523 189641
9440 189641 145364 121119 97107 145678 165526 161071 129949 156671 185051 132084 72955 31625
9428 31625 37405 40684 60197 3400 -34118 7505 52571 64890 70430 61010 85219 100568 80064
9415 80064 85565 135384 154442 106240 102841 73861 99540 113984 100135 65829 47594 95103
9403 95103 156209 157724 169421 167253 116033 125692 138459 181145 218675 237999 258730 231058
9391 231058 228544 240284 215980 205897 206849 235180 226397 217581 240970 249589 267367 256726 277905
9378 277905 318087 310957 302557 334290 375507 348077 364389 388230 364545 357848 356316 344946
9366 344946 380962 403876 429469 464717 495129 509476 523079 570334 604564 625587 658227 677266
9354 677266 736835 742411 737774 718303 738170 729837 787869 801511 806291 830386 858099 937509
9342 937509 1016032 1080216 1121812 1135010 1169391 1205464 1241845 1245028 1299348 1397462 1427742 1438363
9330 1438363 1440113 1436702 1431348 1410701 1435112 1468167 1447383 1395603 1415457 1426135 1394207 1369144
9318 1369144 1369689 1351880 1330385 1313873 1285940 1239568 1211168 1182107 1143021 1081623 1021593 996138
9306 996138 955454 943327 933748 916072 881989 846121 824991 813081 770498 753839 696390 647580
9294 647580 631631 586172 547378 530821 574650 587001 560055 531564 483835 463127 466394 469141
9282 469141 479369 517550 504201 446912 402712 384607 389809 365811 407584 395050 372285 382765
9270 382765 360198 347659 346344 341667 327517 346819 341704 312140 256750 215734 215697 255692 272449
9257 272449 264002 264671 250651 192676 180974 232470 237891 239338 235723 266775 293125 284090 265386
9244 265386 219523 208349 229693 242985 238950 214248 186722 211258 185133 189468 211835 216779
9232 216779 229902 238533 228300 190302 195436 185552 166611 121610 86781 59372 61870 73823
9220 73823 70738 65696 89215 69375 72722 86454 124173 150097 116409 104432 132421 137253 150011
9207 150011 154328 118417 92740 76182 27277 11546 40136 45231 87711 115739 130507 116046
9195 116046 154295 164152 165853 198408 163941 138814 131880 140710 134179 94635 106027 76010 34902
9182 34902 41893 96413 153404 149966 123629 96358 100386 122690 124686 120537 87537 121925 127359
9169 127359 122022 116713 94944 36272 54550 167148 232987 233053 210283 191497 149506 123675
9157 123675 112583 59094 68139 106211 124983 137832 115438 89751 99845 88829 76812 64404
9145 64404 83830 81945 54488 45919 13884 -3941 26097 34584 20252 40517 111880 121532 64993
9132 64993 10528 610 51880 89081 84681 62485 -6527 150 43794 41629 60787 107486 115606
9119 115606 133220 98382 102919 113515 93527 130774 155804 149308 129889 112473 130042 88408
9107 88408 56436 52040 48516 64516 106240 102260 83496 103821 78766 50200 44571 28004 -27846
9094 -27846 -3421 58493 48120 50560 72147 78114 47258 2192 -7633 14530 23285 24799 29927
9081 29927 58312 103756 111229 129018 112117 109446 140239 105352 70796 103478 168957 168681 160507
9068 160507 117658 130427 161279 177444 194169 214053 198758 156699 129669 126188 114588 117306
9056 117306 126994 128719 78589 60964 88947 121549 111899 66674 26438 39029 58642 50533
9044 50533 50565 33992 3957 49912 45166 47108 92705 83679 94127 112462 107539 69238 48246
9031 48246 64262 88628 112554 92222 117769 169309 184338 195673 188028 161799 183000 201167
9019 201167 181964 178086 145269 176016 138500 86746 112148 127182 160090 180717 212764 191540
9007 191540 172444 136409 98780 95842 96144 88661 95726 97105 81917 56802 60578 64989 41294
8994 41294 3714 -7557 20328 47739 35634 66966 30739 19380 31506 -8730 -8198 -18975
8982 -18975 -4659 67456 83882 75667 79466 98968 112955 127850 159266 199078 190620 163051
8970 163051 113575 79746 72785 59252 19509 27339 36016 71651 58831 51092 62933 67051 41509
8957 41509 18210 26425 67025 103315 105092 66880 15703 6697 38146 35085 27609 999 -773
8944 -773 25083 29854 67431 93286 71133 41083 28650 32912 80235 78768 54990 31088 22196
8931 22196 29385 39928 48811 32469 42160 1598 -5762 22212 30594 50573 77265 51452 48754
8918 48754 32107 35746 34476 62592 81260 74485 3249 -35744 11050 62590 33841 1951
8906 1951 30025 71213 101286 73003 47706 7868 -1292 17846 31479 65092 86945 134417
8894 134417 101727 32123 30512 31404 -7485 -23334 -7335 28126 32383 13101 -2697 28583
8882 28583 38286 29591 20322 25854 -6637 -6156 2314 -12893 -5022 -6389 6777 2406 -1280 15765
8868 15765 -24557 10490 59953 35092 35338 29597 -799 -33577 -18002 30796 75520 93627
8856 93627 89692 80371 135280 166111 138171 89189 78615 66160 20381 62428 58979 65427 77729
8843 77729 44740 11118 40740 30264 30542 41511 45067 55077 45733 16039 6919 44512 45834
8830 45834 42324 26933 746 43623 70270 83813 64150 23009 -20040 4190 26268 727
8818 727 -30374 -4872 -1250 27671 47277 15307 55004 77490 71570 68924 31837 -27290 -45913
8805 -45913 -29344 20403 60724 21938 -2051 58256 71234 71508 44422 -9578 -13945 -15719 -22719
8792 -22719 -35876 -22928 -16300 8895 37292 22133 43608 44870 51823 69021 84537 65040
8780 65040 47484 34025 39309 15083 -3908 36121 32422 3451 -20955 -5509 -4331 37901
8768 37901 55714 90142 95600 54966 8630 -26950 -16971 -21336 830 30783 18244 -32557
8756 -32557 -24020 -35734 -51210 -22338 -5804 -6558 -37383 3570 10616 29870 25753 15972 30421
8743 30421 13753 12526 15183 6962 15306 44917 68383 56818 15305 7184 -18577 -37325 -58624
8730 -58624 -57805 2804 30358 8562 2127 4204 59812 41447 -23980 -14273 47051 99992 89663
8717 89663 23351 -10047 33312 37378 2903 12138 7805 -4683 -345 29851 31153 20938 9964
8704 9964 -29848 -54546 -31656 28253 45381 26316 4486 7629 16553 5091 -7224 29856
8692 29856 44064 45339 36804 -25689 -6830 7774 4449 43898 83026 68931 44678 62125
8680 62125 35418 778 29611 64946 84962 48937 42524 36075 40101 45426 52695 45619 121223
8667 121223 132067 88230 50364 64869 77736 46382 3094 -3532 4511 14844 -19451 -6794
8655 -6794 294 3341 -7207 -20700 -26094 -1688 26579 51337 24756 -25613 6948 40269 50504
8642 50504 70651 43924 10423 -36391 -94998 -56664 17387 57262 25681 37242 28969 43592
8630 43592 17780 3063 -27524 -12155 23239 45157 49228 75154 69498 36680 8224 1395
8618 1395 -34225 -53425 -36565 -13708 19709 21995 48206 69085 79542 85102 80715 107694 69157
8605 69157 13282 34626 75220 56354 56270 72767 96331 30288 48698 80423 67948 100073
8593 100073 143617 146696 155334 179715 115081 97123 117700 122321 128360 165112 86734 65556
8581 65556 74565 106888 138519 104391 86413 40656 67180 48689 61281 82414 37256 -8994
8569 -8994 -7633 -14724 25842 49872 56856 45146 67264 73509 95743 107296 98779 71987 44114
8556 44114 11285 5079 31218 53317 41997 42785 58539 30244 33981 78264 150741 149055 108342
8543 108342 102030 89111 77167 34630 11490 4613 -2028 -17784 5915 26189 -4648 -22024
8531 -22024 -30438 12602 45130 41738 27140 18812 37192 67334 69980 35066 5925 8278 18712
8518 18712 54028 91153 68638 41644 -311 3661 28542 14455 21210 51278 86689 83051
8506 83051 55299 53730 23007 27973 15536 10059 26126 58152 41876 -3584 11275 943
8494 943 -481 -10738 -12560 -23567 -44415 -18700 -15899 7600 26296 39471 61735 104889 136415
8481 136415 119592 85484 57298 64762 42547 35477 68363 79383 85871 73743 85446 85880 48169
8468 48169 46957 55343 21931 -7627 -14479 16157 31661 13111 -2906 30304 58024 41340
8456 41340 43580 30405 -26975 -101884 -59848 -54701 -56516 -20353 -11493 -18038 -7375 29888 40403
8443 40403 53144 45343 8481 -7525 -31619 -60270 -26287 -18159 -37275 -35021 -5958 12206
8431 12206 -23926 -24648 -2537 52742 48708 27294 75027 103347 96398 56582 18657 6769 18615
8418 18615 -15897 -47401 -80371 -136155 -128477 -66527 -49470 -19087 1081 -3658 9161 5957
8406 5957 23671 92644 94803 68374 35469 -2700 -50343 -56687 -41397 2979 -9528 -40725
8394 -40725 -58234 -66506 -58871 -39661 -8428 -10367 11212 10792 3200 -38933 -52693 -71233 -36829
8381 -36829 30440 18523 24683 9487 7353 -16522 -48302 -17377 21091 16795 -5517 1397 34037
8368 34037 71538 57800 6049 51375 62011 37201 5077 -29418 -15217 14710 -2788 -24127
8356 -24127 9919 -274 -21415 -21709 -31005 2306 30597 18661 -11460 6812 36232 36947 -6079
8343 -6079 -1771 -3408 -2287 -15454 -7276 -7698 3649 -908 -29737 15291 32100 19592 50266
8330 50266 67501 71392 88618 81746 63939 19512 -26777 -42627 -18268 -26623 -41443 -32531 -4863
8317 -4863 -18677 -83026 -104446 -76861 -84080 -65035 -347 11438 1444 13685 974 -17110
8305 -17110 1273 -31940 -13142 35190 37977 25687 32327 26160 -24066 -44000 -37035 -11553 6319
8292 6319 -8959 -15080 9397 18263 19506 11909 5774 -2526 24950 50361 64990 60539 20687
8279 20687 12527 15608 14727 33082 11116 -37609 -36878 -9839 -6980 -3775 6561 -8289 -31481
8266 -31481 -2493 25725 48981 42663 46193 41877 27654 -13107 28636 45791 56789 52620 74457
8253 74457 76866 38029 66315 50701 20486 27921 67385 93253 112840 113910 176234 259228
8241 259228 287316 277391 297396 267287 190273 141917 107206 79418 106505 122751 72631 78078
8229 78078 59027 29367 21576 35820 25408 9889 21391 46324 46311 64446 57413 71106 89269
8216 89269 99024 129217 101105 45675 21434 56210 99764 28019 6873 54092 65189 101109
8204 101109 121771 133694 153908 120716 154324 242907 273849 330337 453132 591327 664787
8193 664787 596398 532357 445426 372679 277038 230891 210851 161935 150771 160943 131741 146089
8181 146089 143342 120949 126485 148710 162531 106151 87913 84213 94759 116337 99978 75558
8169 75558 83240 64210 56831 106396 112465 103825 49050 47645 87842 97589 99637 84856 66141
8156 66141 87698 100406 75203 98539 145398 212939 245285 245652 275915 257488 232000 227406
$$ [...]
##END NTUPLES=NMR SPECTRUM
##END=
