##TITLE=Analysis number 320006
Compound Code cc 56109
Book Reference 458/138
Project Code adrs
Chemist Name stevem
##JCAMPDX= 6.0         $$ Bruker NMR JCAMP-DX V2.0
##DATA TYPE= NMR SPECTRUM
##DATA CLASS= NTUPLES
##ORIGIN= Bruker BioSpin GmbH
##OWNER= nmr
$$ XWIN-NMR		Version 3.5
$$ Thu Jun  8 08:15:52 2006 GMT Daylight Time (UT+1h)  MAYBRIDGE\nmr@NMR_250MHZ
##.OBSERVE FREQUENCY= 250.131544655141
##.OBSERVE NUCLEUS= ^1H
##.ACQUISITION MODE= SIMULTANEOUS (DQD)
##.ACQUISITION SCHEME= undefined
##.AVERAGES= 16
##.DIGITISER RES= 18
##SPECTROMETER/DATA SYSTEM= dpx250
##.PULSE SEQUENCE= zg30
##.SOLVENT NAME= CDCl3
##.SHIFT REFERENCE= (INTERNAL, CDCl3, 0, 16.522)
##AUDIT TRAIL= $$ (NUMBER, WHEN, WHO, WHERE, WHAT)
$$ ##TITLE= Audit trail, XWIN-NMR		Version 3.5
$$ ##JCAMPDX= 5.01
$$ ##ORIGIN= Bruker BioSpin GmbH
$$ ##OWNER= nmr
$$ C:\u/data/dgb/nmr/ADRS/410/pdata/1/auditp.txt
$$ ##AUDIT TRAIL=  $$ (NUMBER, WHEN, WHO, WHERE, WHAT)
(   1,<2006-06-08 08:15:13.61 +100>,<MAYBRIDGE\nmr>,<NMR_250MHZ>,
      <created by zg, POWCHK disabled, PULCHK disabled
       configuration hash MD5:
       E2 DF 36 D8 04 B2 41 60 5A D7 A3 38 5A 4B D0 FE
       data hash MD5: 64K
       9B 58 83 DB 8A 90 D6 38 A9 AD DC D9 2F 87 8E F8>)
(   2,<2006-06-08 08:15:31.00 +100>,<MAYBRIDGE\nmr>,<NMR_250MHZ>,
      <Start of raw data processing
       ef LB = 0.3 FT_mod = 6 PKNL = 1 SI = 32K 
       data hash MD5: 32K
       3C 38 CE 1A D7 EF F7 6B 43 F9 73 D3 F0 D8 67 B7>)
(   3,<2006-06-08 08:15:33.26 +100>,<MAYBRIDGE\nmr>,<NMR_250MHZ>,
      <apk 
       data hash MD5: 32K
       6E 3F 6A E2 BA 9A 5E 3B FC E2 1E FA C5 FA 8D FD>)
(   4,<2006-06-08 08:15:34.75 +100>,<MAYBRIDGE\nmr>,<NMR_250MHZ>,
      <abs ABSG = 5 
       data hash MD5: 32K
       0D 6D 31 A3 C6 32 E3 59 67 5B F8 EA 21 65 5A E2>)
$$ ##END=
$$ 
$$ hash MD5
$$ 23 C7 A1 98 13 F2 BD 77 0E C4 B4 5D 13 D2 E6 27
##$RELAX= 
##$RELAX= 
##$RELAX= 
##$RELAX= 
##$RELAX= 
##$RELAX= 
##$RELAX= 
$$ Bruker specific parameters
$$ --------------------------
##$DU= <C:\u>
##$EXPNO= 410
##$NAME= <ADRS>
##$PROCNO= 1
##$TYPE= <nmr>
##$USER= <dgb>
##$AMP= (0..31)
100 100 100 100 100 100 100 100 100 100 100 100 100 100 100 100 100 100 
100 100 100 100 100 100 100 100 100 100 100 100 100 100 
##$AQSEQ= 0
##$AQ_mod= 3
##$AUNM= <au_zg>
##$AUTOPOS= <2 >
##$BF1= 250.13
##$BF2= 250.13
##$BF3= 250.13
##$BF4= 250.13
##$BF5= 500.13
##$BF6= 500.13
##$BF7= 500.13
##$BF8= 500.13
##$BYTORDA= 1
##$CFDGTYP= 0
##$CFRGTYP= 5
##$CHEMSTR= <none>
##$CNST= (0..31)
1 1 145 1 1 1 1 1 1 1 1 1 1 1 1 1 1 1 1 1 1 1 1 1 1 1 1 1 1 1 1 1 
##$CPDPRG= <>
##$CPDPRG1= <>
##$CPDPRG2= <>
##$CPDPRG3= <>
##$CPDPRG4= <mlev>
##$CPDPRG5= <mlev>
##$CPDPRG6= <mlev>
##$CPDPRG7= <mlev>
##$CPDPRG8= <mlev>
##$CPDPRGB= <>
##$CPDPRGT= <>
##$D= (0..31)
0 1 0 0 0 0 0 0 0 0.06 0 0 0 0 0 0 0.0002 0 0 0 0 0 0 0 0 0 0 0 0 0 0 
0 
##$DATE= 1149750912
##$DBL= (0..7)
120 120 120 120 120 120 120 120 
##$DBP= (0..7)
150 150 150 150 150 150 150 150 
##$DBP07= 0
##$DBPNAM0= <>
##$DBPNAM1= <>
$$ [...]
##$SUBNAM7= <"">
##$SUBNAM8= <"">
##$SUBNAM9= <"">
##$SW= 20.6930455092707
##$SWIBOX= (0..15)
0 0 3 0 0 0 0 0 0 0 0 0 0 0 0 0 
##$SW_h= 5175.983436853
##$TD= 65536
##$TD0= 1
##$TE= 296.16
##$TE2= 300
##$TE3= 300
##$TEG= 300
##$TL= (0..7)
0 120 120 120 120 120 120 120 
##$TP= (0..7)
150 150 150 150 150 150 150 150 
##$TP07= 0
##$TPNAME0= <>
##$TPNAME1= <>
##$TPNAME2= <>
##$TPNAME3= <>
##$TPNAME4= <>
##$TPNAME5= <>
##$TPNAME6= <>
##$TPNAME7= <>
##$TPOAL= (0..7)
0.5 0.5 0.5 0.5 0.5 0.5 0.5 0.5 
##$TPOFFS= (0..7)
0 0 0 0 0 0 0 0 
##$TUNHIN= 0
##$TUNHOUT= 0
##$TUNXOUT= 0
##$USERA1= <user>
##$USERA2= <user>
##$USERA3= <user>
##$USERA4= <user>
##$USERA5= <user>
##$V9= 5
##$VALIST= <valist>
##$VCLIST= <CCCCCCCCCCCCCCC>
##$VD= 0
##$VDLIST= <DDDDDDDDDDDDDDD>
##$VPLIST= <PPPPPPPPPPPPPPP>
##$VTLIST= <TTTTTTTTTTTTTTT>
##$WBST= 1024
##$WBSW= 4
##$XGAIN= (0..3)
0 0 0 0 
##$XL= 0
##$YL= 0
##$YMAX_a= 360525
##$YMIN_a= -551042
##$ZGOPTNS= <>
##$ZL1= 120
##$ZL2= 120
##$ZL3= 120
##$ZL4= 120
##$ABSF1= 16.522
##$ABSF2= -4.171173
##$ABSG= 5
##$ABSL= 3
##$ALPHA= 0
##$AQORDER= 0
##$ASSFAC= 0
##$ASSFACI= 0
##$ASSFACX= 0
##$ASSWID= 0
##$AUNMP= <proc_1d>
##$AZFE= 0.1
##$AZFW= 0.1
##$BCFW= 0
##$BC_mod= 0
##$BYTORDP= 0
##$COROFFS= 0
##$CY= 12.5
##$DATMOD= 1
##$DC= 0
##$DFILT= <>
##$DTYPP= 0
##$F1P= 14.0000005364418
##$F2P= -0.99999901652339
##$FCOR= 0.5
##$FTSIZE= 32768
##$FT_mod= 6
##$GAMMA= 0
##$GB= 0
##$INTBC= 1
##$INTSCL= 1
##$ISEN= 128
##$LB= 0.3
##$LEV0= 0
##$LPBIN= 0
##$MAXI= 10000
##$MC2= 0
##$MEAN= 0
##$ME_mod= 0
##$MI= 0
##$NCOEF= 0
##$NC_proc= -4
##$NLEV= 6
##$NOISF1= 0
##$NOISF2= 0
##$NSP= 0
##$NTH_PI= 0
##$NZP= 0
##$OFFSET= 16.522
##$PC= 1
##$PHC0= 160.2244
##$PHC1= 18.36325
##$PH_mod= 1
##$PKNL= yes
##$PPARMOD= 0
##$PSCAL= 4
##$PSIGN= 0
##$REVERSE= no
##$SF= 250.13
##$SI= 32768
##$SIGF1= 0
##$SIGF2= 0
##$SINO= 400
##$SIOLD= 32768
##$SREGLST= <1H.CDCl3>
##$SSB= 0
##$STSI= 32768
##$STSR= 0
##$SW_p= 5175.98343685301
##$SYMM= 0
##$S_DEV= 0
##$TDeff= 65536
##$TDoff= 0
##$TI= <Analysis number 999999
Compound Code 99
Book Reference 9
Project Code 9>
##$TILT= no
##$TM1= 0
##$TM2= 0
##$TOPLEV= 0
##$USERP1= <user>
##$USERP2= <user>
##$USERP3= <user>
##$USERP4= <user>
##$USERP5= <user>
##$WDW= 1
##$XDIM= 32768
##$YMAX_p= 276545906
##$YMIN_p= -248220
$$ End of Bruker specific parameters
$$ ---------------------------------
##NTUPLES= NMR SPECTRUM
##VAR_NAME=  FREQUENCY,     SPECTRUM/REAL,   SPECTRUM/IMAG
##SYMBOL=    X,             R,               I
##VAR_TYPE=  INDEPENDENT,   DEPENDENT,       DEPENDENT
##VAR_FORM=  AFFN,          ASDF,            ASDF
##VAR_DIM=   32768,         32768,           32768
##UNITS=     HZ,            ARBITRARY UNITS, ARBITRARY UNITS
##FACTOR=    0.157963299565203, 1,           1
##FIRST=     4132.6476996994, 0,             0
##LAST=      -1043.33573715361, 0,           0
##MIN=       -1043.33573715361, -248220,     0
##MAX=       4132.6476996994, 276545906,     0
$$ Real data points
##PAGE= N=1
##DATA TABLE= (X++(R..R)), XYDATA
$$ [...]
23600 -18079 -618 -17396 -39279 -48708 -15360 6405 -23201 -43730 -74336 -51761 -27133 -31829
23588 -31829 -21147 13885 22148 30907 64303 72543 40874 54116 53136 14036 4431 -16760 -6309
23575 -6309 15791 17268 -7536 -48603 -90279 -80426 -78948 -53683 -34220 -75 14033 12598 2582
23562 2582 14078 17258 6245 29794 15515 -27392 -31602 -33961 -27983 -49483 -32110 -29588 -51470
23549 -51470 -49185 -31737 6778 13502 -33668 -54917 -61143 -69384 -88250 -46216 -20689 -31050
23537 -31050 -18729 -12400 -13794 -44110 -19572 17660 -333 -31035 -9479 -15748 -35680 -49293
23525 -49293 -40925 2764 50030 63737 19662 -38752 -65274 -61621 -44609 -51130 -40383 -9290
23513 -9290 7516 43312 45874 18775 15999 -8720 5212 22991 -28090 -13955 21773 27697
23501 27697 -4938 13267 44723 24430 35566 31281 -19468 -54935 -43878 -17683 10734 -10945
23489 -10945 -3136 -13798 27992 68744 52863 44441 -6608 -42043 -50592 -56757 -16581 16198
23477 16198 48997 49920 51073 44393 59085 50771 6998 -22443 -15374 -3240 -10003 6835 18058
23464 18058 -8467 -7075 21013 20835 35123 29101 -7035 11924 -4911 -50191 -35155 -2386
23452 -2386 -27685 -50590 -71403 -74576 -89492 -63667 5294 28264 23922 30944 5432 17043
23440 17043 37229 39010 51347 38382 25337 67962 66758 43413 14524 -15502 14752 16381
23428 16381 22866 -11546 -45688 -63197 -60871 -27129 -29082 -20714 -12800 -54996 -65023 -45696 -60604
23415 -60604 -46104 -34170 -26508 -3424 59439 45798 -18033 -46773 -50637 -18948 -13598 -10
23403 -10 -21296 -17501 -3696 -5992 12137 10060 -3815 -12191 17686 38652 32713 31022 -10644
23390 -10644 -29587 -57778 -36095 -4724 -10116 6738 18919 7633 7189 7981 -31355 -66066 -74603
23377 -74603 -54597 -33772 -4035 -13033 -1256 -17202 -21635 -20949 8106 13098 -11509 -12346 -6307
23364 -6307 16286 33541 28986 -7468 -2288 -10259 -132 41975 50039 29186 26100 59083 91342
23351 91342 101750 19368 -26015 -25357 -27491 -26648 -47433 -56294 -48931 -46608 -12886 14357 -8682
23338 -8682 11418 -6836 -7705 -9235 15794 -1154 -68615 -69004 -29298 -23876 -57916 -93868 -44801
23325 -44801 -17739 -3460 -24200 -49090 -84117 -36914 -24209 -26898 10691 -23013 -5155 5257
23313 5257 12498 38963 37834 33721 16893 37260 49438 7161 -15796 -14589 2654 2748 -44745
23300 -44745 -60532 -60613 -41629 -50930 -1764 11444 -10264 2773 31575 55726 4858 -31988
23288 -31988 -39052 -29950 -14449 -6853 28443 16228 32113 28497 -5886 -43804 -9986 -2808 12472
23275 12472 31470 17112 25585 46423 2037 -20104 -4317 -88 8265 18347 22569 43427
23263 43427 41843 46487 15600 3519 -44540 -53038 -58296 -28737 -9655 -47700 -89129 -71719
23251 -71719 -95737 -52453 -19436 -46377 -40687 -45169 -54944 -83593 -102898 -86224 -38260 -4714
23239 -4714 -5223 -5664 -8950 -22309 -9693 20019 10551 -20134 -30928 -42824 -42277 -45307 -25499 -14234
23225 -14234 7295 3956 7387 -18060 -29092 16783 62845 83104 34225 298 12143 17304
23213 17304 20895 14302 -44021 -97013 -96289 -61670 -51472 -36607 -15006 -19164 -21837 -9247 -16772
23200 -16772 -38543 -57851 -53226 -29003 -19446 -43883 -56971 -36763 598 45348 18426 8224
23188 8224 -2496 19821 68539 38769 -13144 -44463 -57428 -26881 -24476 -3863 6728 758
23176 758 1309 -18435 -33528 -15080 -18371 -33161 -11721 -28106 -45968 -41838 -12747 -656 1090
23163 1090 -16940 -7411 -8322 -611 2860 -21536 -2838 -10818 -27713 -40064 -37312 -4861 22062
23150 22062 50638 45466 21714 7982 -7187 -37866 -56613 -21210 -2173 -33809 -46866 -8990
23138 -8990 29984 37037 49957 21546 27099 23090 19556 19577 38569 14287 -15040 -12635 -28344
23125 -28344 -26151 -15275 12035 -18697 -14610 -23538 -29297 -19232 -27492 -1546 8032 725 13831
23112 13831 20059 20126 13652 26750 -41416 -31259 -24917 -70949 -39475 -8601 -8766 21016 7834
23099 7834 19579 23900 41444 83601 72582 56241 27149 18973 17352 -18464 3504 -26528
23087 -26528 -71937 -55936 -9849 42304 13424 11530 18705 18560 24636 98110 105814 77387 42983
23074 42983 -17170 -11979 42119 86854 84097 16744 -46520 -52432 -26644 -61328 -90663 -30142
23062 -30142 -2532 -14081 5325 21712 -20608 -42063 -54541 -12446 -18547 5026 41731 26714
23050 26714 13431 -26234 -29467 -8423 30475 53043 43786 65059 56313 10597 18161 34832
23038 34832 16454 16530 30257 -18285 -53608 -38431 -14264 -16008 -26390 -49878 -18590 25184
23026 25184 20986 -2246 -36755 -13758 -11450 -24996 3934 17240 31293 58422 56926 32008
23014 32008 21191 -4648 -12026 5940 -20189 -46653 -24514 27577 -1842 2850 53952 65013
23002 65013 59855 34717 6949 15667 17465 26928 -12958 -9371 -22096 -21097 -29278 -23196 20864
22989 20864 31239 -13623 -15531 984 8235 -1480 -13868 -13487 -2923 22059 18204 16381 16306 -8610
22975 -8610 -15198 4480 -13344 4515 22259 12196 14612 20994 39398 30615 -3137 -61212 -33756
22962 -33756 5001 26193 -21268 -56471 -50185 -30936 -547 19620 49498 77698 57907 44255
22950 44255 -1589 33973 41264 7241 -39314 -35465 -47978 -50689 -30538 -1388 4604 23271
22938 23271 30454 9090 -1480 24722 -10136 -51943 -44626 -40261 -12879 -15391 12861 7693 14871
22925 14871 73640 121453 101208 90739 55356 9081 -9376 -17924 8474 -5103 -5049 -12352 40913
22912 40913 48870 37679 18711 -6679 -22650 -51389 -71042 -49364 -9549 15353 49883 60172
22900 60172 35462 -18993 -25701 24130 14669 9116 7773 34418 22812 -6747 1380 29025 54524
22887 54524 52010 33527 23760 -23170 -4203 8407 3693 4124 14043 8976 -19992 -52792 -28964
22874 -28964 16376 -7377 -20605 3908 -4487 4231 6100 -2955 15676 37991 21487 -12614
22862 -12614 -67559 -70917 -81292 -93408 -63472 -43766 -45086 -45791 -59949 -42387 -30033 -42068
22850 -42068 -65878 -43924 -14826 -64635 -76820 -74475 -21544 19489 24206 24877 -250 11845
22838 11845 -4153 -24248 -19426 893 6574 -27505 -23122 3549 8424 -24312 -63137 -52714
22826 -52714 -31530 -26977 -39535 3177 47029 58885 43369 63747 40977 -19596 -8783 -18243
22814 -18243 -32822 -26642 -4447 4320 16418 5999 -11733 -16331 -9954 -20865 -2619 1146 658
22801 658 -20952 -9322 -15207 10883 35117 27941 -5537 -3028 -1226 -12875 -45562 -7526 5944
22788 5944 -15226 -39000 -22176 -37946 -38984 -36451 -13198 -23688 -42533 -46306 -2988 9012
22776 9012 -28950 -35306 -14237 23249 40574 54671 69603 62671 13639 21869 39158 25982
22764 25982 31265 41568 48787 13221 11108 32640 24472 40198 26527 382 4107 682 -6269
22751 -6269 -33935 -29440 17507 54942 22128 -34752 -63509 -37598 24637 65543 66105 15462
22739 15462 -26804 -30589 -42166 -38005 -40146 -41024 -13057 -9511 -35667 -68277 -36005 -20130 -1805
22726 -1805 29589 41971 62323 59754 50223 45573 16664 -9901 6505 -23145 -33115 7416 -10124
22713 -10124 -28719 -44195 -31303 -20487 -37366 -16142 -2593 20108 26113 34070 26465 5903
22701 5903 -4999 -21003 -8759 -23554 -17332 -7884 17469 5679 -16801 -13656 -35069 -20259
22689 -20259 9793 41829 -2426 -47330 -20473 -17600 -60911 -115102 -99546 -72782 -65611 -51213
22677 -51213 -35421 2858 -13666 -2541 33901 19234 7521 -11703 -41734 -39419 -32162 -17543
22665 -17543 -605 21821 50162 29973 26081 17589 -35409 -61682 -44247 -55297 -23417 -1820
22653 -1820 49639 61035 35817 -4299 -23732 -34897 -28350 -40935 -26475 -16500 -15635 -580 -462
22640 -462 -3271 25377 47165 38684 43366 58864 52773 26386 37381 14793 4347 -45361 -47169
22627 -47169 -41324 -22304 -47030 -72062 -39583 -9397 -19168 -38291 -56189 -36773 7514 -259
22615 -259 -11528 -11925 -8044 4416 -20935 -21269 -21202 -49734 1297 45758 16765 -22449 -8751 -31132
22601 -31132 -38349 1737 35014 56432 48936 53174 25890 13604 -10967 -41108 -44848 -3526
22589 -3526 16901 -23005 -9368 27544 34315 17663 31508 39554 14055 -18415 -35040 -49355
22577 -49355 8145 78863 80145 51103 35565 15716 16021 -16297 -40239 -5488 -16927 -43543
22565 -43543 -30435 -32886 -30823 -11900 14986 15425 -13336 27334 45194 9531 7309 18043 32026
22552 32026 -11827 -60545 -60804 -17654 -48929 -67489 -37466 -7056 -25212 -59540 -52214 -68062
22540 -68062 -67742 -44672 -27998 -22338 -11258 30845 -1704 5424 33976 27403 28069 8029 7532
22527 7532 39493 12657 -6984 3575 -29097 -45305 -17456 -43414 -47937 1828 -3568 -8755
22515 -8755 -798 -17999 -51881 -61332 -59925 -41980 -33781 -77592 -87506 -49631 8526 15390 28058
22502 28058 43679 20022 -15328 -5017 -9094 -46221 -40012 13851 10415 -29055 -51649 -9774
22490 -9774 7883 11764 -8310 -3680 2335 -11257 -33981 -56891 -35795 -32158 -23508 36651 31868
22477 31868 13955 20434 3506 -4044 -33431 -39917 -23070 3562 -43069 -66712 -61282 -68001 -38256
22464 -38256 -1021 4138 -7536 -6272 -39055 -19689 13838 -7637 -19603 -39127 -31660 -20083
22452 -20083 -9800 -36724 -28017 -9620 -23503 -74885 -74915 -32022 8387 24569 -28789 -64190
22440 -64190 -21942 22429 55514 32063 -745 40210 57091 65243 54706 43777 56506 48295
22428 48295 15352 2908 8598 -2790 -31619 -11224 -9675 -9501 -14221 20886 66345 63645 55036
22415 55036 29357 -5972 -21051 -16919 5015 34525 45512 33297 12213 -25343 -19943 12237
22403 12237 -4086 -15684 -29005 -1883 24438 62152 72421 61049 -4651 -35887 -39968 -72757
22391 -72757 -81941 -104496 -79583 -69061 -51408 -17689 -57011 -45351 1573 6533 7128 27148
22379 27148 32645 28392 41067 16215 14326 66682 90303 73327 52011 29611 10851 15684
22367 15684 -3139 -6354 -1401 -5098 -8372 33119 27398 -27670 -64226 -85171 -96228 -71388 -19581
22354 -19581 -9675 -16969 -12469 -44869 -50106 -39516 -8209 6350 -6779 33480 55902 21376
22342 21376 10888 -24557 -71412 -56486 -36439 -22188 -48439 -48534 -62804 -65781 -87205 -93798 -62728
22329 -62728 -21035 7650 -15795 -17424 -31415 -29500 -48456 -84977 -81077 -65791 -86159 -69723
22317 -69723 -26349 -21535 -17353 -8564 -6443 -5334 -17172 12867 17675 30076 42153 29963 -24574
22304 -24574 -65088 -28289 -607 28487 40369 14540 8475 -564 -26814 -51953 -28436 -17687
22292 -17687 -2482 12560 8865 -22211 -24285 -8140 -288 -18285 18874 2347 2971 3460 -32883
22279 -32883 -48661 -17803 -17058 -6425 -11019 -26212 -43666 -13912 18243 25539 16818 52339 81240
22266 81240 71339 77188 39335 16017 26742 17317 -5904 2619 7736 14641 5501 35284 45271
22253 45271 27271 32976 -14206 -31354 -33731 -49519 -53952 -67211 -67337 -12880 19971 854 28189
22240 28189 40097 38370 41522 35381 -6585 1930 15669 34989 47022 26088 4231 -36181
22228 -36181 -63770 -46144 -50148 -86359 -100551 -107717 -78297 -35057 -66949 -98146 -79399 -49661
22216 -49661 -12862 -8352 -20604 -13622 -2933 -19043 -5087 -38383 -90825 -78199 -77832 -79768 -15163
22203 -15163 -33538 -35739 -43378 -3337 17703 8185 30008 12659 22279 34052 39100 45656 -7794
22190 -7794 -13586 -18852 -34894 -33557 -26886 -22946 -16304 -29385 -50179 -104721 -123471 -98613 -48381
22177 -48381 12154 51325 52259 26234 -13928 -27841 -7145 6364 9271 5985 2782 15697 4996
22164 4996 -30891 -38473 -52274 -48368 -48436 10223 78050 66466 15681 -16919 -27532 -34139 -18122
22151 -18122 -3371 -9588 -37997 -96662 -83524 -91538 -76244 -8654 27698 20351 61 -4948
22139 -4948 -22717 -47637 -58322 -71275 -60492 -40128 -18143 -7356 -10513 -9463 -32652 -66312
22127 -66312 -68975 -55184 -53625 -54969 -60403 -24930 -11174 109 19796 19848 -40598 -54012 -65941
22114 -65941 -54857 -52924 -48350 -55743 -53898 -60639 -42604 1647 14029 21810 51384 32079 2751
22101 2751 28831 13355 -30297 -50649 -40662 -66096 -49194 -14612 -10343 -38634 -46816 18783
22089 18783 46747 29024 28453 22715 17495 14497 36299 13347 -23818 -26151 -15382 3247 -19891
22076 -19891 2418 3294 -16627 -27462 -45532 -107679 -57106 -1932 8625 -16103 -10806 -49514
22064 -49514 -44158 -33949 -8274 572 -465 -21061 -39631 -17750 -22986 -41785 -60919 -80492
22052 -80492 -62875 -8736 2860 13750 35066 48537 49298 15434 11896 25007 13899 -10511
22040 -10511 -15424 41898 56315 61654 32323 16359 4268 -2198 -4356 10130 35680 55662
22028 55662 47910 31914 8751 -744 11718 18749 7835 -4730 1590 4258 10562 2534 4677
22015 4677 -3638 -10679 5939 -14619 -29339 -19910 9414 33273 59821 97912 85100 33670
22003 33670 -4091 -11852 -7695 -91 14661 7814 5672 -2162 24271 41172 34791 -15430 -46981
21990 -46981 -45798 -37641 -41434 -4236 13164 47761 18899 10449 -2560 -1933 14170 9665 6881
21977 6881 8444 12835 -10150 -35979 -34945 -50101 -30187 -50060 -57061 -21322 41677 -5 -61502
21964 -61502 -70494 -70571 -41470 -32793 -23192 -40998 -34319 -52678 -27395 -9185 1677 -6675 -5625
21951 -5625 16553 28292 932 5103 26508 11380 870 19478 17686 -5916 -14305 -9263 -34500
21938 -34500 -23176 -34354 -44046 -41659 -24175 23826 44720 15863 28951 13450 -18220 7587
21926 7587 21392 25016 41080 63456 45542 16517 1187 -19236 12762 18025 54863 47775
21914 47775 37637 39097 29792 -16924 -3589 -14255 -20443 -6091 -12934 -12337 8414 25622 55094
21901 55094 61424 89490 62345 20446 -3700 9142 38934 41341 11515 -33096 -26806 -33352
21889 -33352 -20704 18236 25256 5974 38198 38741 19573 17403 -21823 -28964 90 -11869 24064
21876 24064 12972 21224 50186 44713 15763 3078 -10726 -30914 -36209 -25961 -3746 22430
21864 22430 60637 23958 -8012 -5924 8565 10991 2955 15415 13646 5767 -23335 -30927 -33921
21851 -33921 -1894 -9964 -23797 29059 66132 15473 -22459 -11806 27215 5477 7831 48562
21839 48562 23456 29106 8392 18345 59401 77893 67083 65636 22448 32236 -9398 -60246
21827 -60246 -64358 -37553 19207 32071 -18456 -68999 -38193 -12739 -14197 -31543 -1238 -10782
21815 -10782 -23297 -37407 -6268 8667 1907 6921 29342 19642 31362 60977 40496 22139
21803 22139 29251 36806 24660 31652 6439 -64851 -86699 -47266 7902 -11825 -28304 -3294
21791 -3294 -22949 -30739 -38500 -6973 37611 23975 5292 -9070 -34274 -40523 -42730 -47365 -47483
21778 -47483 -53350 -1480 43046 40374 -2158 -31834 -24042 15591 12666 -1187 -34993 -28083 -1055
21765 -1055 16480 44 -6000 5495 23566 25172 -1191 5991 2882 3191 4831 -10087 -36774
21752 -36774 -44322 -4079 20178 2719 -30061 -41543 -42413 -68061 -62375 -30195 8809 12861 1338
21739 1338 1547 11280 6865 -33579 -60880 -56839 -56324 -27174 -52881 -69762 -77384 -72541 -31932 -35585
21725 -35585 -28320 -3496 -8026 -11668 -12866 -20093 -13624 17193 12186 -11876 -3429 -20323 -36992
21712 -36992 -16699 -32948 -36921 -73237 -83353 -79502 -51871 -57767 -45866 -11583 535 -11839
21700 -11839 -24750 -42234 -58113 -25111 -23519 -17581 27161 26294 -264 -40613 -77496 -82397 -47335
21687 -47335 -22398 -12433 -19960 -30971 -35491 -17273 -7494 -31487 -10966 3743 21662 15308 38322
21674 38322 4444 -26239 -51184 -9003 18994 14143 3726 -32372 -82249 -46990 27012 -17076
21662 -17076 -38236 -28297 -14515 -6629 -43316 -64117 -97099 -63237 8351 6751 -693 -33247
21650 -33247 -14153 12921 16924 -13331 -29993 -17285 17479 28561 30112 45164 13261 -26730
21638 -26730 5046 19778 2454 4578 -24582 -52927 -33559 13921 15261 -2425 -31292 -16509
21626 -16509 -15045 -12817 -13010 -15105 13665 39669 39009 25502 -9747 1930 14321 10698 -7628
21613 -7628 -19968 -69676 -52948 -554 41598 -23225 -43390 -47103 -54600 -51772 -44382 -44484 -37459
21600 -37459 -16493 -24446 -26567 -3887 -7581 -34761 -31497 -22330 4394 19937 20119 22432 18330
21587 18330 3253 -34649 -33271 4858 47047 24299 -339 4398 -10636 -26975 -28045 -7574
21575 -7574 5823 18412 4375 35151 10425 4529 -10095 -29223 -43088 -68072 -76644 -26382
21563 -26382 -5548 9555 20936 28312 955 217 10574 -14264 4008 1658 -5682 -10413 1402
21550 1402 233 4517 5340 10196 14134 22931 15210 -3895 -28633 -4304 7116 -16082 -9575 14967
21536 14967 2838 5326 33006 54543 -9438 -37094 -17015 -15585 -35873 -31001 -24200 -27072 -34004
21523 -34004 -60719 -72179 -53909 -50920 -23914 11787 12879 12416 7059 -19113 1382 2007 10875
21510 10875 -9711 -43546 -24253 -126 8433 5283 119 -43491 -32235 5315 -23708 -8324
21498 -8324 -20670 6947 680 2684 26223 -4886 -38663 -18982 -3888 41145 65079 50502
21486 50502 34039 -20074 -77047 -48426 -14034 -10998 4008 35992 43908 18372 24079 33875
21474 33875 -5780 13241 -7947 -33101 -31206 -29871 -15755 -21117 -16270 -27735 -36740 -11257 15940
21461 15940 20383 29973 21049 28870 -9283 -40326 -27302 -14261 42623 62725 58993 39056 18433
21448 18433 13088 11042 -7242 -611 16757 -5887 -4686 13218 13073 31674 33709 27114 21671
21435 21671 7566 13227 37349 34846 -10686 3663 -33234 -62757 -76457 -42041 -22251 7333
21423 7333 45815 18134 -3804 17102 -16689 -42679 -59730 -79398 -39321 -15491 -24306 -18857
21411 -18857 32820 52709 40284 16178 -44807 -65815 -68998 -63273 -46833 -44556 -26176 -5608
21399 -5608 35 5969 24552 15832 -22037 -28955 -35283 -37899 -36981 11902 11325 -4411 2192 16880
21385 16880 42034 54697 13282 15047 -3668 -17294 -20923 -21428 -23038 13192 40824 84712 96094
21372 96094 59355 34208 37325 20282 10434 39057 11235 27537 37566 -13603 -43748 -31407
21360 -31407 -17498 10300 -21203 9582 33854 21309 -34520 -66056 -42760 -26298 -9705 -15091
21348 -15091 -16368 -14906 -39623 -20244 -20755 -21190 -40726 4779 26560 -6411 -72178 -63201 -35138
21335 -35138 -29314 -3549 8103 -7257 18057 21721 -18655 -58760 -61157 -52289 -31329 -23343 -19528
21322 -19528 -621 -5424 -14323 587 -7649 19584 38919 33408 62694 70846 53742 33871 13191
21309 13191 -15241 -20385 -4219 -9326 -1160 -16154 -41896 -68197 -62345 -21648 -24127 -43728 -20725
21296 -20725 19358 26519 41171 27380 21810 56385 54751 25184 -30490 -41568 -50998 -67942
21284 -67942 -45498 -15659 -8199 -2940 12859 29663 16343 -19259 -22016 -8538 -3915 -10432 3983
21271 3983 24690 -7329 -18617 -20497 -32875 1252 11042 -12120 -45390 -51815 -42285 -28736 -19922
21258 -19922 -29380 911 -1262 -6239 10191 46974 28949 -9855 -905 8925 434 20307 47651
21245 47651 1584 -28948 -3736 12825 4811 6035 -24239 -6825 25577 2473 -22080 -14396
21233 -14396 11581 -10298 -45199 -18598 25923 48002 39678 60274 50264 25013 10577 26491
21221 26491 27373 12576 -718 -29216 -57783 -60044 -51932 -3055 35869 13614 -2973 -43936
21209 -43936 -24966 5041 13797 -49255 -94751 -63520 -30296 -4071 -2025 -10863 3250 34728
21197 34728 10283 10610 18365 49627 54617 58028 47055 67511 59121 41095 12077 1372 -17235
21184 -17235 -56551 -56759 -40220 -25937 -8531 -23831 -46901 -54309 -77619 -39456 5124 10769
21172 10769 24931 30983 -3959 -56279 -62685 -30870 -6385 -2043 -4143 8968 4486 -9724 -21867
21159 -21867 19876 54034 47677 14799 9804 -3932 -62923 -68516 -65832 -61662 -52486 -26040 -3520
21146 -3520 14099 29006 23886 -6149 -13741 -31133 21558 41161 47392 42922 23012 31317 61814
21133 61814 76823 67478 42693 25423 16302 19984 3230 7296 36469 18217 -10240 -32906
21121 -32906 -29652 13167 2345 20070 42928 42064 -651 774 24126 23133 -1692 -31888 -38508
21108 -38508 -7851 -10334 -45228 -44745 -21070 -21941 -31456 -7839 -14552 -31673 13016 19271 -31087
21095 -31087 -11377 4115 15464 47356 23519 32472 56571 16185 -53012 -83964 -20110 33427
21083 33427 43030 -22401 -16020 37669 47624 45631 30336 -23014 -20531 -21678 -48156 -6251 30216
21070 30216 54643 37243 26646 -5869 17990 43892 41519 -10337 -49384 -51257 -37045 -32473
21058 -32473 -822 39908 57777 57501 49807 26189 -17035 -27977 11778 53155 24399 -4306
21046 -4306 -27164 -19074 14680 14154 22731 52665 -38887 -57325 -37390 -17411 -6776 -19318 14950
21033 14950 47941 7814 -22936 6268 35027 32134 735 -11857 8502 -3227 -11323 10762
21021 10762 6702 -8102 12093 37674 39897 32200 -7225 -29638 -36431 -40786 -18415 13120 33811
21008 33811 71966 87396 89296 74524 57807 47085 32537 32920 16309 45253 60571 49221
20996 49221 52762 40558 21269 -6139 38842 23530 31754 16956 -15368 -18659 20467 47759
20984 47759 33023 24554 27832 30072 23285 -36867 -74869 -11024 25193 19750 5497 -13051 -7256
20971 -7256 -4972 -19992 -34206 -50061 -57973 -28791 -21912 5646 29712 39550 51110 23318 24888
20958 24888 36668 36039 23213 46650 53901 -8833 -37977 12315 56497 64983 34987 30568 42800
20945 42800 21547 11597 11162 -7823 2182 23640 11272 -59428 -66247 -25501 -5203 -1799 -24081
20932 -24081 15857 42045 32944 31518 24463 -11076 -24492 -9289 -6450 -1950 -8650 -7128 -19052
20919 -19052 -12317 30236 70649 90526 35776 -1585 2758 8941 -2406 -1165 49785 33182
20907 33182 21253 21398 26364 2679 -54526 -82323 -51939 -41857 -61965 -45675 -43672 -66760
20895 -66760 -55590 -76581 -50006 -31447 -33021 -59103 -67707 -36835 -5975 -6225 -16477 -2776
20883 -2776 9100 4480 46996 47138 70517 85168 50466 15095 -2709 -24575 7935 44877
20871 44877 29451 -8994 -17954 242 -13002 -35817 11968 29696 20638 36772 40164 14008
20859 14008 24626 2153 18796 59460 35103 41784 63779 59015 50774 26797 26457 6762 -33641
20846 -33641 -55031 -59147 -58258 -50064 -36817 -37539 -13942 -24294 -55533 -70595 -82251 -68491 -10992
20833 -10992 41080 55773 54199 42765 33462 23542 -14946 -15484 11901 -28654 -62598 1056 37536
20820 37536 5193 -18571 -34225 -47127 -32202 -11686 2620 -2998 -1609 25617 28575 12196
20808 12196 7303 17303 24699 17185 13405 -4382 -7648 -4079 15842 -2517 -44438 -46049 -22308
20795 -22308 -16424 5210 16063 23467 44764 54986 39867 22362 20346 16142 13022 -21054 -47136
20782 -47136 -20389 8999 24662 52463 58112 51143 36483 54160 65079 47341 43818 51758
20770 51758 -5487 -12921 22240 44511 84 -23254 -10932 1813 -22682 -45100 -19885 1336
20758 1336 39801 65939 26032 18558 44016 14439 -434 1738 -14617 29753 40122 -3894
20746 -3894 3082 1092 2255 -44079 -63874 -56140 -68659 -83569 -31648 -33978 -62439 -55288 -40513
20733 -40513 -28985 -48054 -54998 -62499 -47649 13847 11673 -4381 13875 46826 44220 34793 30421
20720 30421 39592 44253 -3563 -19839 7693 44847 51283 24273 -18837 -23646 64 42568
20708 42568 40077 26025 28664 -4060 -16643 13551 49308 30299 8384 -11078 -7540 -15728
20696 -15728 -836 4359 -13260 -32647 -11919 55826 45959 25841 4872 -18486 -38008 -23185
20684 -23185 28683 -583 -38631 -39051 -20462 -12628 -51467 -49170 -66536 -68564 -48471 -55113 -18328
20671 -18328 33278 50859 88448 81111 55025 20410 14013 -22526 -14280 -11878 -2961 23051 -16454
20658 -16454 -11599 3089 4478 48850 1429 4152 12175 31396 56538 53305 52137 76105 62864
20645 62864 29713 34620 52392 20090 21845 30128 58503 29568 14671 71984 122158 119238
20633 119238 86359 51200 38174 27154 39262 51153 47533 52194 46083 65988 55415 20846
20621 20846 13222 37278 33776 23488 13832 -15688 -40007 -5380 26134 45993 82646 101493
20609 101493 101726 116816 115542 72746 50837 10482 1913 8098 -8237 3305 39934 13602
20597 13602 2636 -8664 9222 24176 -11955 -44767 -99669 -109916 -74260 -50479 -19990 15486
20585 15486 59066 64380 46272 -1849 -18466 12850 18134 11913 14661 -477 -15034 11113
20573 11113 18067 -4983 15891 74220 78330 73504 27559 -3192 13181 39526 33119 -14702
20561 -14702 -32998 -23514 55517 73290 56522 36890 18066 5353 -11230 -13570 -40747 -31402
20549 -31402 -20670 -17093 -27826 -37398 -27248 6020 13939 61271 55426 57549 56813 49736 90969
20536 90969 100806 92172 50907 9477 -1627 13045 11450 -16703 -12053 18638 203 7101 26221
20523 26221 26818 8086 -8489 -9670 21333 29172 6506 29132 22050 19252 58126 66860 49866
20510 49866 64771 78756 35561 13336 71892 56281 16729 34806 72754 20213 -23283 -28167
20498 -28167 -9678 9709 -3109 -31032 -11650 23829 58100 63274 46804 11869 -6782 -14588
20486 -14588 43786 58382 59707 48970 32348 23346 50992 39460 45649 43578 -14095 -44386
20474 -44386 -14207 25504 54873 37165 21281 15305 22442 41536 12952 7248 -5764 -4070
20462 -4070 36231 25093 -7528 -33507 -59750 -59253 -56036 -70978 -73648 -42268 17673 28687 11594
20449 11594 1626 -22960 -8135 25450 26137 51532 18363 30519 52729 27935 60425 72728
20437 72728 34198 30839 32259 60306 42624 -9506 -34573 -56284 -13951 24236 35324 54490
20425 54490 52432 32424 53376 65395 39488 42851 10269 5020 -44565 -55482 -26293 -4550
20413 -4550 -11962 2747 40877 51497 106423 101262 59531 13523 -72 -4019 21426 17876 -15993
20400 -15993 -7870 20401 51687 57198 46183 60954 35767 6608 30191 77848 62656 53050
20388 53050 59195 70274 86803 74373 66322 63120 62317 84418 68049 55905 59913 29366 11022
20375 11022 -29777 -47485 -54202 -20704 21330 40362 53647 66296 43861 -246 -8279 -16168
20363 -16168 1265 -6595 7391 27704 15749 -17658 -28524 -51719 -9826 25464 12797 35256
20351 35256 49766 51312 10059 -14780 -17372 -31774 -39992 1510 22000 2526 -14180 -53370
20339 -53370 -53538 -20786 -21154 -17833 -4685 -249 -16814 -30260 -39501 -13005 47677 55263 32901
20326 32901 50556 60932 24705 -15455 -34191 -80256 -65676 -36414 -17583 5117 47527 51179
20314 51179 32106 47253 28193 6404 -1682 -24629 5681 69871 55211 31079 13037 -5765
20302 -5765 -24724 -30728 -17687 54869 72613 24198 13016 26903 33613 33363 23816 4871 413
20289 413 25022 42999 29563 34500 64256 42218 34534 32446 30432 40230 37591 16969 -21825
20276 -21825 2817 -11090 16877 -1228 -7110 6169 25915 45182 69728 60977 32932 46864
20264 46864 45362 34090 11516 -10129 6780 15985 17070 19803 -12087 278 38466 22626
20252 22626 -6811 -32604 -38998 -4002 18837 -835 -5123 5830 -19012 -15934 5770 -336
20240 -336 3585 36202 41267 9896 -2271 -11909 -29656 -7307 50821 50144 19888 -8806 15224
20227 15224 34408 27535 29595 27627 44937 46752 51800 60244 58214 47141 43136 44550 51265 27003
20213 27003 31868 93636 76407 43611 25536 51290 89723 85607 86876 67845 51247 -9913
20201 -9913 -36176 -24109 -797 -20149 -46617 -12702 4184 -33535 -10196 5391 30884 46924
20189 46924 32923 12339 13537 -11877 -3934 37368 53934 50921 55166 53220 -2532 -9008 -11801
20176 -11801 20908 60106 50734 26839 42771 23948 1710 -38998 -51621 -3314 6176 48834
20164 48834 55365 1471 -39266 -37358 -36664 -20084 905 -14902 -2979 47155 55116 21204 56190
20151 56190 53164 9852 10349 36683 39311 14349 3813 20365 15485 51051 80572 73854 28041
20138 28041 10280 -13814 165 13455 -12147 8786 46392 62224 63006 73504 36890 21089
20126 21089 6259 56439 47793 21030 1031 23160 32633 33453 61471 72889 57454 47630 29695
20113 29695 -3197 -11396 -2680 -15056 -8008 6158 39130 49706 60942 47516 64557 73493
20101 73493 35017 10315 17128 -15953 5073 -11114 -69891 -80647 -91095 -61241 -26651 14080
20089 14080 -2579 -25794 -4704 -11375 -24466 -11678 15806 26946 43793 44928 38558 46321
20077 46321 17606 8887 17784 -19720 -32283 4116 10977 17181 32865 35362 61000 35050 19727
20064 19727 13840 8633 28378 85201 75701 44073 39364 39845 42312 57973 66794 51132 23866
20051 23866 33262 16462 45327 63893 65792 49008 26549 3667 20578 29214 21748 -33878
20039 -33878 -35116 11072 6116 -14418 26416 12684 -19713 -17529 7261 -5801 -23562 -9328
20027 -9328 22462 20697 28398 49529 35170 21155 29885 76974 79686 25317 564 38845 48516
20014 48516 40781 28553 37595 16406 8290 7137 37154 28301 20286 15552 1135 2769 8081
20001 8081 18872 50431 73679 89682 34027 12480 32492 43881 21597 1574 36695 63827
19989 63827 71174 76423 68994 46116 38449 2273 -31098 -18295 -4782 -26670 -11301 9216
19977 9216 42677 72826 46989 26348 29888 44760 23631 -5083 250 35233 19949 11819
19965 11819 31854 54315 49830 67622 58986 63588 68198 49899 63358 50348 29634 28029 46752
19952 46752 36063 52295 36711 30861 67417 79273 41839 4718 15389 51175 73722 63286
19940 63286 57734 56529 44552 58683 64881 61547 74360 43968 14097 29576 -5118 -26678
19928 -26678 -70319 -54906 502 2932 -14932 -26760 17783 68788 92145 99961 62140 35584
19916 35584 33750 61390 42847 44744 74142 65665 55662 73441 92580 96680 66589 32064
19904 32064 34544 48490 48395 57781 43984 23304 56801 54203 74570 70613 11224 3292 22727
19891 22727 -16529 -31363 12671 42056 33046 19327 28203 2170 24673 25431 8527 30928
19879 30928 43034 67502 54639 40132 19425 5640 -34359 -49653 -8398 57096 87570 51029
19867 51029 28922 15299 -7163 -556 29780 37804 29988 62008 75410 39379 31322 75804
19855 75804 95098 75010 30770 38910 38785 53304 62690 39450 2533 18188 4071 -10525
19843 -10525 -5762 2401 11192 33006 46249 25396 53142 74117 57581 70991 78332 68761 42312
19830 42312 18402 21981 58048 42119 30840 20278 16990 43798 29347 31858 33697 19402
19818 19402 -9483 -27271 19851 28394 19688 12741 -976 -24335 -8249 18785 24302 49611
19806 49611 34190 10092 31430 47964 47545 31396 13894 3106 44079 58717 69483 62030
19794 62030 61740 82124 46934 4094 2321 21533 49214 44134 25165 677 39266 75935
19782 75935 92564 104969 91505 85268 92948 98068 102520 74770 70422 53460 41197 71258 82174
19769 82174 76708 94081 82297 42454 28349 69924 102708 104058 86638 57958 46006 39242
19757 39242 21463 21127 37696 60471 54808 42405 74716 52707 5965 -20918 -8021 7471
19745 7471 28366 9295 -2580 7416 11894 22310 53372 62197 82032 105627 53451 46157 54248
19732 54248 83711 79989 57570 55118 69696 47429 38349 40217 29133 30754 25104 33172 60716
19719 60716 67121 54068 60209 59258 46212 2256 13915 23561 17639 29423 63608 90015 92452
19706 92452 90224 57638 58428 34851 -2439 -3339 -9582 -16594 -46862 -48164 -23419 -24792 9733
19693 9733 -3456 -16 17917 32025 35809 42752 38798 57014 68070 59996 37647 7207 10587
19680 10587 30758 48887 52418 51471 70786 71487 72043 18128 -16874 -18924 19700 54051 40417
19667 40417 10506 37745 50258 73422 46306 -483 -7068 -19561 -52317 -3460 45950 76305
19655 76305 91906 49063 49113 95442 104822 62239 -1533 -33482 -34332 -6638 41526 29205 18595
19642 18595 38996 59181 40666 51237 67453 80530 97452 96995 84406 49792 53610 70428
19630 70428 93827 63784 82677 67799 66123 98435 105835 85401 43028 37347 69678 77631
19618 77631 53168 65001 30268 -8691 -3684 30284 51304 31079 30284 76289 94356 100890
19606 100890 72146 81079 101411 95475 97635 86651 49792 50320 49996 36803 36406 23360 35296
19593 35296 60542 81638 83243 104440 94972 92450 89749 54514 36475 31303 42333 -4686 -1890
19580 -1890 19034 15624 12439 22270 32535 53404 48608 25611 30153 32819 -9922 -22750 5742
19567 5742 56301 98081 127686 132441 113890 68821 66405 83840 98132 115758 105057 113160
19555 113160 86912 58057 33483 90172 104600 120940 114308 117845 142958 125895 109181 98743
19543 98743 81505 89207 110337 72439 25600 -8854 45937 101132 84303 59586 41520 34025
19531 34025 44080 56134 67622 75009 82777 61634 52419 81701 85558 81049 90642 75861 82077
19518 82077 80059 68566 87684 121210 128847 141863 126629 102995 91283 81191 96940 74702
19506 74702 43044 14160 29616 48534 84719 101277 62358 46728 56217 51877 61879 58727
19494 58727 57724 64529 53296 36459 65410 60830 62981 95639 112084 87328 58719 61602 96025
19481 96025 99657 89327 92622 75419 35117 68017 100832 131960 124363 105081 97224 90221 47009
19468 47009 21466 2202 29047 70891 101419 91966 95768 105809 70544 41503 33571 22348
19456 22348 30243 76621 123957 154081 139733 77506 80129 37190 3991 -18411 -1000 40123
19444 40123 48123 37196 66152 44733 70048 109638 88901 32237 42634 94365 119381 74955
19432 74955 43550 14447 21040 27971 54349 96664 115876 97515 92022 86094 56633 14953
19420 14953 4136 47192 26125 76721 75094 64017 63600 80305 133539 134418 106477 130281 133742
19407 133742 123984 122070 155088 134933 106033 85692 62663 65017 85914 119426 152964 141671
19395 141671 155382 143993 140324 125177 128027 133415 140610 134194 110516 106082 127920 142761 158225
19382 158225 168635 134646 103331 105040 153273 152768 111988 115003 98504 75023 81765 97455
19370 97455 116032 104525 83241 103133 118247 94884 58384 58667 85305 91526 94999 85529 101281
19357 101281 107514 100005 122720 69542 35514 43307 37574 28819 29716 44634 56601 79485 77367
19344 77367 59461 102550 123666 129245 95499 64563 67307 82388 104873 99298 91847 40808
19332 40808 34696 38604 37533 88680 119599 117901 93240 114697 85661 81389 97716 120377 143380
19319 143380 144912 118176 76234 92485 154740 169021 153724 103542 77999 117074 108507 100277
19307 100277 126003 120331 115208 84607 64240 85665 104065 105534 132421 135657 103683 139924
19295 139924 141418 117209 130266 121267 88417 80459 103317 117810 127146 104672 95850 105697 124236
19282 124236 135346 113302 125179 118665 102197 78361 68987 44450 61842 109098 131846 112671
19270 112671 92263 118910 123016 112305 106881 115896 119862 128534 147322 173841 153561 122568
19258 122568 119558 103220 97457 145003 158813 161441 118237 91926 133437 134468 139703 173925
19246 173925 181243 162420 155083 144896 124645 121868 164968 149280 130452 131729 142962 126256
19234 126256 113293 94761 54561 29172 19661 12811 28409 39454 31524 62597 112470 135651
19222 135651 154043 165459 144233 142525 147343 141493 133262 122280 141833 118509 122573 83804
19210 83804 86852 113875 95898 66261 44294 62671 48847 54536 73275 73249 95286 70836 75582
19197 75582 93147 90565 43848 41498 95620 126915 122702 122778 91234 106221 121726 135148 150457
19184 150457 138623 128870 136263 135735 152413 177555 214395 291522 262239 194324 181804 229555
19172 229555 231912 215083 185020 159360 168933 182889 192526 202613 191379 164235 152076 139062
19160 139062 136852 132264 137964 164974 197469 165894 165396 141776 159694 163487 119919 129288 178054
19147 178054 172846 148579 176258 176595 148796 162742 177649 183802 170313 194689 206709 220912
19135 220912 232725 252931 260803 275069 272336 273829 280755 282738 260647 219192 226587 232971 231396
19122 231396 226865 239710 263825 236217 218145 207772 193995 173611 181843 190368 200133 183797
19110 183797 211317 241630 204460 146792 152217 179806 194451 253730 245899 262544 301186 303434
19098 303434 336802 364830 362158 408240 471820 506915 589376 619365 642417 621101 613056 561092
19086 561092 536522 527339 529058 563800 586675 582220 615429 632034 642619 584912 551134 503848
19074 503848 480190 453429 417715 365223 297741 260077 217169 262243 300633 309166 306493 318250
19062 318250 275865 279580 279867 225493 221499 240133 228910 202817 177416 149617 158923 173035
19050 173035 163749 172536 191668 170367 181026 172686 195782 200846 235045 238516 220848 213858 210501
19037 210501 225865 219133 234397 223290 218857 216823 183850 145700 169954 195370 207682 206753
19025 206753 212222 213562 200341 187825 175757 192309 228853 248742 210147 200375 183951 186026
19013 186026 181882 195111 201785 178500 166875 199828 208916 222108 219793 233758 228232 219281 212853
19000 212853 196286 175756 217619 255570 257765 265185 232345 236837 245618 225731 177358 187232
18988 187232 211246 217411 181590 141100 174984 172364 173249 198874 202018 169117 173323 216892 224108
18975 224108 247082 239406 191710 203316 225764 230492 228593 258706 273278 258271 250967 237365
18963 237365 224635 251662 265627 263684 294185 310617 318147 341068 339374 314895 299383 270444
18951 270444 261930 211394 251790 284624 278007 263145 236468 244377 223271 224906 227645 261094
18939 261094 302411 314341 253921 196502 165029 172968 158938 139460 178371 194126 194377 215056
18927 215056 215095 209196 242745 277990 297444 262400 259061 269068 260422 258427 246398 220718 221815
18914 221815 232137 250136 264140 252051 225441 244237 253503 242173 250901 242965 254556 231350
18902 231350 230874 286792 324901 302872 347303 429903 439382 460327 505884 542493 601897 643332
18890 643332 673551 705546 736588 747037 734281 699391 639054 601450 592870 618699 633722 660292
18878 660292 672281 659726 656825 675058 698759 704080 662236 643249 613675 577245 510529 427209
18866 427209 366496 352331 345319 367823 351723 342284 351470 318392 243196 261356 296462 324375
18854 324375 326201 312293 303788 314890 328085 334734 347053 330743 287098 321516 327797 290726
18842 290726 262476 301278 338972 304892 254809 191609 177372 214291 276854 294943 281366
18831 281366 305404 319273 336995 306706 285080 266444 232187 248241 271270 275893 318127 347370
18819 347370 331830 311283 290420 287652 282546 316602 345009 355161 376530 341908 346141 331447
18807 331447 309293 332497 334235 309832 296915 285377 276980 276885 301574 322827 375999 394497
18795 394497 330091 262625 294362 322807 304959 271470 300601 355450 358575 336004 353934 382144
18783 382144 393342 390138 376772 373624 388172 374187 345116 353438 418799 438578 417358 433298
18771 433298 481854 499838 480407 484195 503151 517393 498933 481702 472100 439792 411358 432391
18759 432391 446554 487626 501896 461456 420437 462928 510838 496927 477228 464146 437677
18748 437677 436638 435822 446789 456451 451737 480161 497228 515072 565872 601624 592921 560952 540112
18735 540112 524893 525439 509267 516261 515041 509783 489870 473855 507784 546455 520314 468593
18723 468593 477058 443400 427422 466565 476821 426012 430681 456367 481488 532912 555655 536108
18711 536108 480846 420939 414968 480667 491204 487840 505673 520619 502821 508247 508388 534868
18699 534868 551382 579383 615871 664040 663058 664712 685529 738802 802552 817126 799741 814171
18687 814171 832628 833365 821090 774377 733403 703559 709030 690758 652214 624216 626771 584952
18675 584952 613097 633376 642003 680579 718820 735162 776740 799807 832882 856240 882839 866825
18663 866825 828063 841710 884049 918978 897762 871703 873560 857780 888388 883707 884228 892058
18651 892058 891583 892034 873311 896292 905129 943319 988917 999865 1000528 1041663 1098930 1113436 1122986
18638 1122986 1132757 1126331 1101881 1073439 1063646 1051502 1016558 1007236 1030832 1028040 1049922 1092490
18626 1092490 1125218 1149353 1174666 1189631 1208812 1255897 1282153 1301580 1293824 1293078 1309674 1320848
18614 1320848 1337288 1362613 1372252 1391675 1384821 1387478 1379713 1383063 1364945 1405677 1434138 1439809
18602 1439809 1433524 1407074 1364046 1366805 1400932 1442041 1439896 1450001 1493259 1560340 1687298 1808700
18590 1808700 1976756 2174239 2440710 2730491 3038780 3335171 3598386 3867191 4196985
18581 4196985 4599734 4954739 5073362 4925427 4686084 4518905 4425831 4414558 4486809 4554693
18571 4554693 4678397 4825160 5002246 5257313 5513165 5589896 5399948 5033961 4645843 4302986
18561 4302986 4008729 3830370 3712393 3637501 3574829 3554863 3643122 3726758 3771989 3825494 3887176
18550 3887176 3988985 4042682 4042864 4121561 4183928 4242202 4369803 4475985 4626311 4735825 4810463
18539 4810463 4892194 5003758 5107403 5179043 5244758 5356942 5533113 5735339 5980933 6233723
18529 6233723 6575030 7059888 7575936 8198071 8991336 9974185 11268365 13015748 15375376
18520 15375376 18455910 22263370 26726827 31722152 37166319 43056142 49486106 56608548
18512 56608548 64043488 70460846 74726533 77184211 79311675 81677697 82880268 82064816
18504 82064816 80133408 78671535 78561809 79999998 82465318 84476749 84487382 82472927
18496 82472927 79701549 76706784 72395766 65847938 57821190 49932697 43173794 37493728
18488 37493728 32764784 28923557 25799752 23263963 21147829 19382171 17925819 16668366
18480 16668366 15559691 14577211 13673774 12833364 12084512 11406441 10840298 10347336 9927846
18471 9927846 9484773 9066094 8698610 8369532 8079648 7780379 7514842 7219320 6925310
18462 6925310 6702057 6527582 6339291 6116468 5905281 5710374 5491573 5361601 5231781
18453 5231781 5106037 4937171 4783227 4642156 4527876 4382238 4290994 4196106 4068621 3923568
18443 3923568 3826302 3767290 3669715 3597915 3551765 3487680 3423889 3340123 3277059 3241294 3187092
18432 3187092 3159345 3075559 3013917 2960159 2921838 2851721 2774195 2714102 2698314 2648657 2590938
18421 2590938 2527571 2494365 2494583 2468524 2446301 2443430 2428351 2374338 2327028 2282488 2197540 2104839
18409 2104839 2100924 2096667 2050495 2022701 2022563 1988730 1945854 1952452 1902262 1871173 1810844 1803950
18397 1803950 1815573 1814263 1759981 1754740 1767563 1788684 1767953 1735728 1716831 1698464 1705785 1687634
18385 1687634 1690949 1693884 1700098 1723884 1757068 1780397 1765907 1751474 1791985 1828936 1850065 1848897
18373 1848897 1844061 1856477 1845487 1895329 1978857 2031961 2027129 2030377 2075957 2124814 2110541 2110804
18361 2110804 2090658 2072604 2055940 2083098 2098878 2108490 2107265 2135145 2139563 2140877 2147448 2143656
18349 2143656 2140672 2166162 2212372 2233464 2244008 2268867 2306769 2312286 2390363 2522086 2626613
18338 2626613 2736350 2940597 3187234 3406927 3660410 3916282 4150872 4396676 4627445
18329 4627445 4886002 5170165 5438556 5652438 5856232 6126063 6508483 6933795 7471045
18320 7471045 8174563 9163236 10569258 12630924 15477238 19226875 23842893 29066332
18312 29066332 34721765 40799204 47402787 54932626 63351531 71519449 77327629 79816917
18304 79816917 80030960 79763436 79211350 77245979 73659788 69586008 66747101 65782058 66704083
18295 66704083 69532333 74257890 80095993 85199983 87489042 86636302 84080567 80990871
18287 80990871 76562645 69622293 60499246 51067274 42892752 36386883 31363241 27489931
18279 27489931 24497186 22151331 20161016 18535112 17182298 16008366 14983796 14091848
18271 14091848 13266746 12559284 11941869 11457543 11061888 10724394 10452869 10154384 9886124
18262 9886124 9620086 9366373 9106886 8836986 8618533 8425509 8330699 8333110 8472369 8837739
18252 8837739 9419777 10091231 10945050 11931985 12993917 14211161 15586224 17009311 18286377
18243 18286377 19122720 19377908 19281384 18963963 18325199 17225534 15782054 14280925 12929495
18234 12929495 11790793 10889859 10266654 9812473 9437173 9113790 8813364 8556518 8337558
18225 8337558 8114158 7919154 7740876 7576680 7466129 7387230 7354471 7290271 7269591 7302538
18215 7302538 7368541 7544101 7729946 7986609 8401408 8983800 9748336 10724339 12049432
18206 12049432 13857414 16240422 19408849 23325933 27564611 31636012 35663021 40185966
18198 40185966 45517091 51219628 56212326 59393360 60441387 59903105 58424580 56134368
18190 56134368 52473495 47323381 41471082 35980156 31412155 27746174 24866118 22717610
18182 22717610 21171139 20062644 19266397 18652880 18248879 17996597 17954958 18226409 18840860
18173 18840860 19736981 20889764 22363804 24232515 26517423 29223796 32347382 35924991
18165 35924991 40055678 44857444 50598742 57191401 64135105 71077569 78036566 85295865
18157 85295865 93796790 104646633 117737574 129843072 136495847 137459645 137298302 139840095
18149 139840095 143127360 142621128 136179193 125674432 114779837 105121438 96767876 89990963
18141 89990963 84938089 81231668 78229243 75167503 71392274 66627032 61020523 55102460
18133 55102460 49232852 43717166 38884145 34815237 31532961 28944042 26894593 25372681
18125 25372681 24288999 23589841 23283937 23439053 24250158 25916021 28391930 31139171 33780862
18116 33780862 36142376 37809885 39464513 42603580 47803467 52099548 51490452 46060000
18108 46060000 39959111 36065813 33169083 30829750 29004037 27472854 26115130 24811345
18100 24811345 23471560 22186457 20929069 19638396 18354682 17178591 16164149 15337930
18092 15337930 14715867 14210006 13731425 13307617 12834879 12250170 11617711 10912609 10159884
18083 10159884 9507792 8930012 8446312 8047340 7675392 7300927 7007735 6801160 6585947
18074 6585947 6376124 6187605 6014985 5847101 5672669 5488158 5312940 5142256 5006019
18065 5006019 4899545 4751644 4580267 4503697 4394888 4272011 4166626 4051979 3944204 3859258
18055 3859258 3741258 3633214 3539737 3500702 3415580 3337937 3304897 3236909 3140443 3114231 3126733
18044 3126733 3147205 3130959 3115834 3091681 3071084 3039631 3039758 3006720 2979145 3005555 3061712 3093453
18032 3093453 3166330 3263027 3375726 3461006 3562945 3717297 3925379 4135603 4410710 4708227
18022 4708227 5112433 5638690 6216006 6876258 7758296 8900922 10251114 11878655 13825121
18013 13825121 16098905 18539153 21366857 24679461 28240453 31622580 35093064 39113878
18005 39113878 43475613 47377081 50698695 54187995 58229754 62141912 65501404 68617998
17997 68617998 71859697 74989465 77855193 80388880 82352493 83428024 83861214 83943249
17989 83943249 83596824 82371457 79999136 76929343 73879626 71003541 67640975 63462780
17981 63462780 59060510 55262591 51868785 48174639 43970161 39889729 36379223 33187842
17973 33187842 29964598 26776253 24006081 21680457 19652209 17836883 16240840 14920788
17965 14920788 13823582 12868837 12019387 11299643 10660075 10115805 9555955 9064977 8630155
17956 8630155 8264121 7946018 7699964 7458386 7191451 6948395 6751994 6542063 6336824
17947 6336824 6157198 5990581 5842773 5732515 5647706 5553987 5445434 5307892 5216254 5136147
17937 5136147 5063125 4945813 4817155 4715693 4616303 4524854 4431208 4347737 4345559 4331907 4349574
17926 4349574 4455056 4613306 4752267 4870686 4976002 5129283 5407217 5704066 5878370
17917 5878370 5812574 5610201 5383385 5218753 5146065 5115544 5020502 4847284 4637188 4445006
17907 4445006 4304034 4200493 4099366 4052985 4021430 3999657 3994903 4008195 4048690 4082718 4132604
17896 4132604 4241643 4416920 4644399 4959411 5383073 5946369 6716207 7699474 8887009
17887 8887009 10273111 11920109 13809305 15887220 18110012 20388857 22647431 24700175
17879 24700175 26490949 28172005 29596202 30565160 31322340 32231006 33255853 34278537
17871 34278537 35555880 37132347 38912596 40679629 42412851 44099022 45366796 45892983
17863 45892983 45689612 44861178 43275364 41180496 38934643 36847701 35105194 33681469
17855 33681469 32643275 31893855 31158686 30306880 29163066 27735742 26225277 24740283
17847 24740283 23366333 22267126 21493114 21072889 21003478 21341200 21993341 22580533 22985345
17838 22985345 23486744 24340606 25330105 25901892 26192409 26729219 27647474 28605800 29376017
17829 29376017 30339093 31628989 32955698 34008020 34947921 35882438 36586113 36677917 36135917
17820 36135917 35271054 34301623 33090940 31599018 29984698 28626523 27559757 26495255
17812 26495255 25401357 24399402 23449681 22287654 20912425 19405609 17867282 16197804
17804 16197804 14499095 12977066 11599407 10354410 9292258 8432685 7736923 7189167
17796 7189167 6720079 6308333 5993922 5714889 5443291 5179003 4938975 4736593 4556967
17787 4556967 4389760 4237437 4078154 3885480 3694739 3590410 3496953 3401360 3287852 3181888
17777 3181888 3077461 2965480 2910546 2811213 2754792 2692375 2595266 2484703 2360959 2276992
17767 2276992 2225683 2190204 2131115 2054217 1977788 1852297 1755591 1713495 1676632 1595221 1537528
17756 1537528 1516507 1488273 1434421 1361052 1327838 1283082 1304519 1260189 1194684 1134136 1090982
17745 1090982 1073923 1056729 1058956 1058319 1040720 1006804 1003742 992165 983234 981289 961040 928581
17733 928581 926088 937469 923710 874758 840621 832790 850557 854212 855985 871178 884563 920020
17721 920020 947777 958462 964614 971914 1007405 1020678 999353 959639 916089 875471 853222 858781
17709 858781 830023 787034 743395 694664 665822 668450 695817 711957 716050 685585 665364 673830
17697 673830 704967 700557 650961 591044 534326 522681 517585 490310 448241 423949 414281 425996
17685 425996 447234 430441 448530 435545 401408 451975 493364 504665 554093 536360 566605
17674 566605 622779 677363 656540 640488 657664 648381 610244 593260 545843 434014 407886
17663 407886 427113 384905 362291 355668 330310 324336 338332 341334 306014 280561 301107 282279
17651 282279 242599 229406 223366 182867 171384 183845 201477 136148 94801 87851 71347 68769
17639 68769 32189 7167 17463 7958 2300 -15645 -5811 23674 30402 47612 79560 131032
17627 131032 160672 176757 148903 186730 195460 183546 198914 196665 180980 170388 145210 100267
17615 100267 72008 85878 108098 142096 128259 118072 160065 202921 207546 201117 210521 155746
17603 155746 120560 85628 79778 114220 106803 76038 45671 76924 23007 -9255 865 12904
17591 12904 16930 2716 5960 -25463 -33019 -43075 -2336 3365 29309 30277 -6686 -3019 -8536
17578 -8536 -16170 3290 -3615 1829 30406 7197 -35192 -71471 -12960 605 -6374 -9440 -25575
17565 -25575 -23237 -5897 -23177 -69341 -100015 -83163 -55907 -55890 -51268 -59684 -84195 -40091 13902
17552 13902 31242 12031 -67987 -90497 -82023 -102511 -108810 -115317 -91485 -113316 -137472 -88771
17540 -88771 -88179 -84652 -102779 -107909 -150480 -162429 -145345 -153046 -147627 -165717 -151685 -133473 -121758
17527 -121758 -135491 -150271 -132381 -95267 -86228 -93996 -116915 -137302 -128500 -101380 -106938 -119413
17515 -119413 -100014 -79852 -109338 -118543 -81395 -40820 -9530 22930 46944 43750 86907 151937
17503 151937 177631 218867 220938 216110 200731 221732 246804 261949 280312 264095 268246 241536
17491 241536 260753 275264 274385 251895 240733 260100 239982 186263 170015 153582 144361 104582
17479 104582 63361 32123 28371 6646 -10171 -24216 -4938 -20708 -63452 -72081 -68174 -83344
17467 -83344 -117742 -134469 -151162 -109718 -74397 -52823 -95872 -119788 -132382 -168889 -211249 -231073
17455 -231073 -210842 -148998 -94523 -75154 -75485 -58007 -53621 -45493 -50038 -12753 16435 46255
17443 46255 32587 -11361 -45177 -82896 -132474 -131708 -107291 -105270 -149297 -169394 -179729 -151349
17431 -151349 -110393 -123507 -148027 -160047 -145669 -152330 -178965 -205911 -222298 -208963 -193799 -167025
17419 -167025 -175330 -229993 -207306 -158161 -128444 -127446 -128122 -108746 -144735 -169652 -162587 -162062 -136102
17406 -136102 -122964 -149407 -152673 -205338 -191170 -152258 -142550 -154029 -150093 -165250 -152624 -167183
17394 -167183 -155548 -126988 -121193 -118306 -115096 -138745 -189059 -166262 -163113 -181352 -156528 -159634
17382 -159634 -128570 -83393 -70819 -54509 -18123 -11111 -29642 -10850 -32408 -13072 -44764 -21771
17370 -21771 9144 38905 72290 75011 51381 71962 96269 90839 74830 106040 90709 82355
17358 82355 83961 70295 70380 51553 31919 38963 33731 3951 -41369 -23792 -26659 -38692 -52301
17345 -52301 -49721 -59230 -55041 -18396 912 -37992 -62968 -51867 -51857 -36097 -2772 -52943 -28993
17332 -28993 -26878 -20081 20832 63552 49756 15164 20448 22032 27977 42672 81781 100387 85376
17319 85376 63016 33495 4491 10804 25787 48917 69298 53376 32679 -14187 -25411 -2920
17307 -2920 -14462 -67399 -100847 -92624 -113811 -96696 -55441 -61602 -92261 -120051 -155353 -160605
17295 -160605 -129488 -142799 -130556 -136548 -173479 -195061 -161027 -146137 -111258 -102230 -78849 -71570
17283 -71570 -88616 -77783 -109713 -150530 -178500 -175926 -165983 -149042 -131893 -139285 -154748 -161911
17271 -161911 -158483 -158125 -165525 -178923 -159119 -149024 -153514 -110207 -89472 -163973 -161404 -161861 -166567
17258 -166567 -155202 -170196 -190183 -161864 -115116 -84710 -124255 -185513 -189826 -196306 -194507 -171976
17246 -171976 -141468 -160109 -171929 -137269 -91677 -133059 -166692 -173447 -177262 -162244 -159466 -174219
17234 -174219 -183613 -175696 -200987 -212071 -176832 -126845 -119742 -96569 -79172 -75692 -127666 -170856
17222 -170856 -160286 -117290 -130277 -144217 -111313 -102477 -151484 -137605 -112980 -104011 -110112 -131178
17210 -131178 -194601 -203648 -169319 -162798 -200429 -248220 -199412 -136109 -134808 -153670 -186607 -179809
17198 -179809 -127713 -124100 -173065 -144312 -143293 -161303 -132723 -115176 -130898 -130337 -114311 -105270
17186 -105270 -105142 -119444 -106065 -118605 -84109 -100729 -111698 -119308 -122321 -100494 -94557 -79901
17174 -79901 -80758 -94262 -66917 -44550 -71170 -28884 -35809 -13705 -34914 -107702 -153437 -132250
17162 -132250 -66497 -31297 -43743 -40104 -38982 -73594 -64391 -10885 13257 -15804 -3433 3076
17150 3076 -7097 -27948 -28837 -18513 -11527 -35947 -46119 -19322 574 -11432 -20078 -29300 -36635
17137 -36635 -50329 -64090 -39530 -58796 -66693 -46636 -27446 -59441 -124544 -123819 -77028 -90305
17125 -90305 -65235 -75873 -63024 -53706 -48087 -46805 -54439 -89299 -92965 -113418 -111649 -91598 -78476
17112 -78476 -82272 -27078 37765 110693 139245 140811 179927 173168 166091 163118 147284 144018 160487
17099 160487 177775 225351 256113 251091 274553 328495 342204 378687 358386 306344 291212 273513
17087 273513 255082 210943 162687 171250 157218 94454 86876 107662 125348 148041 152642 103706
17075 103706 57712 3908 -19902 -11384 -6404 -14647 -43504 -72143 -80447 -85280 -64526 -25631
17063 -25631 -41972 -47602 -13981 -10512 -68061 -109782 -115993 -86366 -91323 -108781 -116187 -122203 -133488
17050 -133488 -134673 -124744 -108622 -106797 -119873 -137576 -126517 -101984 -104045 -127733 -160134 -117011
17038 -117011 -94625 -77031 -33353 -43148 -61413 -69723 -80426 -85299 -63168 -79097 -87744 -74221
17026 -74221 -78170 -117273 -128682 -96224 -122523 -149476 -144758 -139232 -121170 -123270 -122524 -136642 -147044
17013 -147044 -155507 -158559 -148603 -111537 -57926 -58209 -66066 -140066 -181691 -175469 -126073 -122785 -177654
17000 -177654 -132880 -98733 -107975 -114746 -101801 -80890 -70808 -84952 -59554 -25302 -29215 -62854
16988 -62854 -95589 -125639 -91237 -83708 -108844 -108255 -92778 -120293 -124727 -80480 -62131 -66032 -78164
16975 -78164 -60545 -84262 -85507 -45662 23672 30733 -7012 -27653 -52696 -60156 -65110 -48826
16963 -48826 -87797 -173845 -171951 -126416 -93468 -138554 -186466 -172497 -150665 -112693 -103968 -117707
16951 -117707 -123434 -116313 -78483 -49376 -67457 -98889 -106674 -109446 -110673 -123046 -138240 -127658
16939 -127658 -112312 -80280 -70157 -86396 -113480 -118697 -110222 -106877 -114279 -125536 -104794 -75129
16927 -75129 -76022 -75866 -40793 -81086 -109973 -96754 -80195 -81311 -82572 -92933 -54782 -43464 -75026
16914 -75026 -90378 -110626 -112374 -154127 -175342 -160919 -86138 -41247 -82493 -101975 -68685 -92713
16902 -92713 -126574 -129709 -96981 -39923 -24556 -57220 -97539 -72817 -82372 -92507 -97472 -95265
16890 -95265 -92928 -90611 -77761 -90590 -109053 -99687 -87926 -106434 -131048 -128007 -61626 -20644
16878 -20644 -56154 -79288 -76090 -79203 -58955 -62233 -77569 -103524 -125778 -111885 -88880 -71405
16866 -71405 -75949 -63980 -73314 -89248 -94276 -92124 -71148 -25545 27543 29438 -27200 -53333 -50193
16853 -50193 -73861 -102988 -79144 -80963 -137497 -110867 -67939 -10508 45632 21130 -25267 -50927
16841 -50927 -47322 -32882 -7652 9758 -9819 -36218 -50808 -55257 -38753 -64160 -93710 -88526
16829 -88526 -45366 -29543 -54486 -60712 -45366 -32629 -25473 -91141 -106175 -68241 -42141 -74158
16817 -74158 -53796 -35404 -50368 -85077 -50324 -23485 -29750 -23760 -42847 -43163 -26779 -53209
16805 -53209 -53294 -18711 12127 34312 29503 25600 -6156 525 31814 -19289 -8767 47003 6956
16792 6956 -30190 -14887 31675 -3130 9450 -4845 -20419 1967 353 35681 53385 10910
16780 10910 -6189 2772 22840 -21929 13190 46989 71905 64011 23740 38305 45027 2186
16768 2186 -32290 -66437 -35666 -5894 22722 35774 20309 26243 55161 71694 68243 55200
16756 55200 31616 19966 24925 14070 29120 -33485 -70086 -67630 -33569 -7964 2921 24387
16744 24387 25257 25231 10127 15347 -6045 -3564 2840 -29775 -29124 6599 23220 978 -21755 -28988
16730 -28988 -10335 8148 -34935 -31544 -33893 -54747 -76640 -104319 -95297 -51817 32367 33004 -4122
16717 -4122 -28371 -33601 -24612 -61317 -64940 -44716 -25988 -884 -10243 -56353 -87114 -59600 -51521
16704 -51521 -85013 -75276 -49879 -42623 -44204 -19272 646 40122 67536 94701 87874 59767
16692 59767 -5665 -8314 10954 -7020 -32489 13703 77398 101269 138965 144617 127560 92818
16680 92818 114815 126656 129580 157627 191976 199985 226701 242401 207390 200551 217697 188143
16668 188143 163059 210425 259872 275756 298523 319216 349701 367083 392453 381789 397886
16657 397886 453635 460666 455785 436035 411501 407050 443032 461787 491024 502739 508216 512467
16645 512467 560349 575001 612260 654874 696220 740335 799235 877403 937460 990483 1062997
16634 1062997 1148231 1275904 1389363 1427367 1396365 1354961 1342033 1398822 1473411 1537147 1655418
16623 1655418 1780222 1897173 2021159 2237103 2485492 2535590 2389157 2170862 1965692 1838671
16613 1838671 1724436 1641156 1621623 1620155 1630734 1674874 1744345 1822690 1875863 1828188 1682620
16602 1682620 1533501 1361947 1298911 1253975 1204475 1132412 1098207 1070282 1074689 1091367 1143487
16591 1143487 1170253 1206897 1197324 1245890 1351416 1442798 1511167 1555690 1627010 1723486 1858630
16580 1858630 2009796 2099847 2150602 2172202 2233363 2333723 2482913 2643146 2796437 2980447
16570 2980447 3243282 3570440 3908371 4202977 4485529 4734935 5004249 5289201 5693210
16561 5693210 6346847 7386140 8916678 11182575 14414759 18397939 22622057 26729433
16553 26729433 30382712 33551818 37262337 42858429 49770056 54702561 54868503 51352398
16545 51352398 48282023 47960818 49831454 53262800 57545057 62066321 67231663 73757632
16537 73757632 81498985 88464591 92226519 91540234 86435898 77927046 68441883 61279012
16529 61279012 56888694 54195453 52519017 51416736 50940446 52055998 55383293 59046225
16521 59046225 59344347 54432282 46467623 39001448 33096790 28243630 24344344 21292386
16513 21292386 18854517 16921135 15394524 14177603 13154259 12239678 11492514 10903092
16505 10903092 10340013 9777738 9197106 8665587 8130151 7656014 7278354 6937978 6614644
16496 6614644 6355040 6112409 5887032 5705433 5525907 5328559 5114483 4920914 4711089
16487 4711089 4500956 4303493 4139816 4038472 3939076 3797291 3672347 3565128 3437940 3336487
16477 3336487 3237017 3089787 2977326 2879924 2758625 2647732 2549764 2463374 2386896 2343684
16467 2343684 2317992 2262941 2197729 2129646 2048972 1971901 1931780 1876583 1786957 1681293 1627301
16456 1627301 1575175 1513235 1481016 1388242 1327489 1335624 1326954 1307126 1233742 1138806 1093518 1060157
16444 1060157 1053054 1012060 985849 965395 916539 876052 835255 826205 801419 786648 733080 673546
16432 673546 650181 638441 623364 638019 612319 603941 585745 537645 534663 585008 600549 567157
16420 567157 556283 549979 575911 590208 536562 566986 577576 568662 554310 513499 489200 462899
16408 462899 441223 485695 515574 521046 495832 473292 469771 495253 448447 432284 399364 388393
16396 388393 397450 402320 394689 368144 327573 287079 290846 331494 362900 332273 297830 243022
16384 243022 195105 163291 131634 123884 128089 152227 146443 174641 151312 158860 186142 153203
16372 153203 112130 101764 155980 144545 125114 135548 150557 134057 88863 84987 118188 115865
16360 115865 134934 137729 104917 128609 125499 105172 92365 71124 77781 87074 70600 86599
16348 86599 74341 25621 5624 17786 707 6019 8503 24965 32584 25789 -1320 814 -27527
16335 -27527 -36390 -39373 -35637 -46046 -11094 -26123 -45904 -56579 -38455 -37763 -63096 -98688 -113415
16322 -113415 -131007 -130373 -127001 -135570 -119407 -105637 -75789 -68384 -91335 -110503 -143045 -133063 -113963
16309 -113963 -138896 -124047 -140439 -153266 -153705 -114409 -96782 -56893 -68699 -87960 -98573 -40892
16297 -40892 -42117 -76464 -64116 -30898 -4579 -1415 -31194 -34534 -22381 -48575 -48878 -65299 -82760
16284 -82760 -64990 -33896 749 -36756 -48070 -23731 -63174 -61046 -76476 -84297 -50175 -69670
16272 -69670 -98829 -82343 -76073 -97489 -119068 -111327 -67588 -59150 -66561 -59488 -76638 -88399 -71115
16259 -71115 -59891 -51653 -61477 -73377 -62245 -60724 -88338 -80349 -82873 -52469 -65494 -61695 -44485
16246 -44485 -47949 -51642 -45823 -58042 -103048 -159151 -161029 -136198 -122348 -67839 -71727 -129592 -109325
16233 -109325 -125661 -129012 -119324 -104212 -89896 -99592 -150890 -140171 -94464 -128573 -138251 -70421
16221 -70421 -72781 -95166 -84551 -60304 -34738 -109328 -131415 -137253 -158265 -144827 -96174 -76797
16209 -76797 -117244 -124244 -124224 -123850 -97349 -75498 -69220 -54451 -62144 -85065 -113493 -73137 -57018
16196 -57018 -53892 -78033 -75846 -92258 -152783 -163035 -105046 -67474 -70755 -101086 -100775 -110305 -82184
16183 -82184 -63372 -68299 -69974 -69786 -77224 -103275 -103814 -129056 -130091 -72532 -42394 -38192 -48222
16170 -48222 -93617 -111470 -103527 -97057 -79918 -58733 -43769 -62567 -34795 -15892 -20768 -10538
16158 -10538 -57571 -76610 -65657 -51895 -77039 -73001 -73735 -60425 -96113 -140968 -113670 -164855
16146 -164855 -172959 -119653 -111134 -130008 -123536 -107965 -97306 -78917 -88065 -36674 -29875 -1251
16134 -1251 5481 -47626 -93163 -78441 -74327 -54301 -52433 -73865 -88437 -105884 -114970 -108240 -98299
16121 -98299 -105644 -80616 -118680 -143682 -114072 -72633 -45283 -55845 -48263 -60301 -92961 -139527
16109 -139527 -134236 -125429 -143012 -161794 -112308 -86289 -66809 -66136 -71912 -59823 -59840 -42246 -45632
16096 -45632 -60959 -41229 -64724 -79751 -59305 -68590 -99280 -115645 -106034 -102360 -133587 -139897
16084 -139897 -152058 -162458 -133646 -135388 -124745 -124486 -108337 -80943 -124275 -157751 -123823 -103473
16072 -103473 -74191 -64326 -65302 -105107 -123645 -142450 -120682 -112330 -94213 -73829 -75241 -75570 -80592
16059 -80592 -74937 -51083 -78474 -70776 -36870 -51379 -66574 -55795 -59618 -73396 -111834 -103444
16047 -103444 -85811 -95835 -124688 -149296 -167990 -188011 -150368 -87967 -84386 -77371 -115221 -88664
16035 -88664 -69381 -82170 -92022 -134089 -154182 -134081 -103812 -80116 -73468 -86675 -101150 -67688
16023 -67688 -42543 -92082 -101137 -77303 -104721 -125330 -108446 -119812 -124292 -107673 -110209 -106042
16011 -106042 -52621 -56557 -40971 -9357 -20166 -12015 -53735 -49026 -57275 -121739 -110657 -68536
15999 -68536 -77725 -123793 -122940 -71334 -39121 10705 70244 79249 86372 96105 113601 140381 156202
15986 156202 215100 268651 248028 181055 158849 136753 149274 189667 260749 288774 319358
15975 319358 337538 376293 401080 413844 443279 434034 356621 300596 251219 220916 202643 193628
15963 193628 194547 197055 175589 177544 205352 193480 172159 132725 109081 61181 36481 13409
15951 13409 20864 -9784 -46502 -76528 -118572 -79920 -36079 -63394 -88778 -66758 -55367 -39588
15939 -39588 -27255 -40583 -42390 -87703 -124644 -123629 -103742 -55145 -67481 -57579 -49574 -51451 -11261
15926 -11261 -5667 -32846 -32559 -36583 -56103 -74254 -68244 -55536 -39766 -74233 -44737 -2645 -11797
15913 -11797 -37135 -59177 -47792 -54140 -77184 -94131 -91283 -106608 -116873 -117985 -63531 -22607
15901 -22607 -17567 -83550 -72518 -58054 -88974 -119439 -110165 -119810 -70497 -64121 -92747 -127618
15889 -127618 -126859 -126072 -109213 -56430 -67815 -63152 -43216 -36413 -73318 -90344 -79848 -92088 -102903
15876 -102903 -119589 -117528 -128696 -161870 -144294 -130560 -98792 -78642 -103106 -126991 -96012 -91106
15864 -91106 -119992 -141168 -150213 -164693 -192256 -148912 -64465 -29553 -33265 -54771 -65909 -36780
15852 -36780 -44841 -113122 -111070 -95100 -78803 -106036 -164312 -167075 -162584 -152084 -151672 -117838 -127734
15839 -127734 -99059 -86201 -103560 -92771 -92571 -84718 -121234 -139302 -145829 -154881 -155581 -148161 -125718
15826 -125718 -140136 -188161 -169292 -125632 -94395 -132674 -161834 -139270 -106597 -123174 -116819 -113691
15814 -113691 -81523 -49973 -28978 -44117 -72305 -108175 -126323 -77672 -63774 -71999 -86517 -89792
15802 -89792 -88122 -98908 -66056 -84929 -111196 -91121 -98835 -96693 -80423 -51770 -77759 -85601
15790 -85601 -93399 -139849 -109945 -70707 -63618 -91640 -119178 -149495 -154250 -134323 -97982 -71046
15778 -71046 -85483 -85208 -110909 -127476 -124049 -110185 -84073 -100012 -117802 -87780 -60033 -57847
15766 -57847 -91625 -77059 -73568 -80523 -110845 -184026 -170443 -105385 -97108 -102641 -124374 -160090
15754 -160090 -134187 -110936 -96677 -108901 -74028 -46932 -67399 -84942 -66120 -55733 -70133
15743 -70133 -123830 -82544 -59653 -71940 -86296 -70150 -58787 -29413 -38417 -55905 -63901 -77903
15731 -77903 -115904 -146911 -100528 -44067 -12736 8132 -4444 -34484 -43291 -46006 -52814 -45273
15719 -45273 -31838 -20612 -63432 -69482 -74270 -97499 -112174 -92386 -59182 -96167 -102409 -85005
15707 -85005 -92033 -110285 -128069 -121891 -128477 -96630 -137339 -137324 -124284 -146646 -170560 -136091 -78734
15694 -78734 -32747 -34129 -72564 -102242 -88151 -68925 -82093 -117462 -135095 -109892 -85294 -98484
15682 -98484 -123712 -141620 -161669 -167526 -177808 -154629 -83036 -79551 -70727 -90217 -85871 -64565
15670 -64565 -83135 -137448 -198198 -205721 -200800 -196682 -169114 -137847 -150111 -143729 -127258 -86678
15658 -86678 -77300 -68410 -68202 -64628 -85415 -89119 -110220 -133070 -133789 -103081 -70017 -48739 -63025
15645 -63025 -66012 -37495 -34891 -60286 -51288 -30252 6180 14270 14429 8579 -13291 3365 -33510
15632 -33510 -52985 -59115 -68160 -34580 -20330 -23495 -44616 -62788 -57875 -46918 -56128 -35622 -35954
15619 -35954 -29053 -40079 -33889 -30317 -32534 -42159 -37783 -27089 -21689 -22859 -32265 -18965 23165
15606 23165 58159 22559 2251 -9870 -29491 3510 10562 33243 24123 -17260 -46145 -50757
15594 -50757 -69579 -68685 -66202 -54376 -18568 -19596 -38099 -73479 -81650 -92637 -93258 -70340 -60058
15581 -60058 -54506 -65463 -91622 -96372 -115046 -136914 -148520 -116951 -112520 -89122 -82063 -65458
15569 -65458 -52019 -65155 -67735 -75799 -89944 -105708 -118153 -95808 -38121 -16782 -60032 -76443
15557 -76443 -71944 3748 22805 1379 -73872 -98392 -51611 -27927 -23445 -43939 -73333 -94170
15545 -94170 -37907 -11014 -25220 -38147 -52090 -61902 -60428 -53310 -88513 -86066 -92543 -117170 -147596
15532 -147596 -124532 -56777 22616 36420 -2843 -31562 -47188 -46348 -57720 -53714 -30720 5366
15520 5366 27851 18523 5285 -6151 -35460 -55910 -64458 -49671 -17435 -4229 -31512 -67104
15508 -67104 -80689 -61709 -42259 -31405 -41036 -70935 -96741 -99605 -78136 -38742 -27449 -53332
15496 -53332 -34607 -27516 -30613 -29766 -71111 -83299 -70384 -29622 41125 48578 60949 44238 3022
15483 3022 -15857 -2335 -58935 -76803 -78585 -57766 -23213 -22774 5 -27507 -36080 -42731 -34277
15470 -34277 -38431 -42177 -38807 -48010 -25814 -22437 -24756 -21480 2410 16527 13487 10636 -17527
15457 -17527 -17748 -14100 -46165 -25898 -8640 -32694 -32199 -25753 -44004 -27007 -33420 -28052 -4681
15444 -4681 -6468 -17076 11354 15178 16564 58146 69685 47653 31175 -13119 -15627 -18599 -2487
15431 -2487 -5554 808 14935 36825 23569 -40039 -71197 -73788 -8566 39877 76790 96869
15419 96869 96980 134888 168220 205460 229592 276441 347531 398913 461707 514372 624400 782341
15407 782341 927727 1081129 1190949 1242336 1290436 1362177 1375783 1336577 1248974 1134579 1041375
15396 1041375 941314 814105 717765 595048 501089 435173 379041 336631 310178 269877 225435
15385 225435 181294 178018 202850 189956 157529 115113 94969 111891 97557 83806 85980 64477
15373 64477 77591 63642 37682 -7445 -23100 -7882 -1937 18906 -1773 -33538 -47053 -40737
15361 -40737 -20093 22118 34239 8807 2367 10206 29841 18898 19186 -17270 -40012 -39921 -38037
15348 -38037 -24236 -32730 -33421 -35486 -41945 -38005 -30089 -61199 -80887 -55278 -34554 -1973 33822
15335 33822 20759 -30259 -25164 -32839 6783 33693 48903 40912 34636 40750 62840 62285 45283
15322 45283 21559 -46 -19188 -26219 -23697 -20492 5047 16928 -17892 15960 76600 76845 49658
15309 49658 31409 18919 -1411 -33759 -32993 -29921 -38488 -9244 10934 27866 25984 19945 19779
15296 19779 10428 -37589 -15233 10376 -4456 -13021 45272 51384 -15122 -4551 5718 -11256
15284 -11256 -40828 -39065 -51742 -65894 -58745 473 14660 24789 33686 44676 5617 -16957
15272 -16957 -31072 -38720 -25342 -8315 -5938 -5928 -14845 -26329 -38311 -44696 -38521 -44291 -33624
15259 -33624 -53036 -41273 -64861 -55760 -14370 -32494 -78942 -68977 -22087 -1022 32746 68078
15247 68078 46852 20583 25400 38232 4014 -11523 -9051 -14075 -12693 -20532 -54484 -39063 -39957
15234 -39957 -9661 16533 -33673 -3513 12923 44129 63158 85071 124387 167958 170488 174244
15222 174244 193910 194187 199149 163493 175385 221576 221086 223052 224188 183898 111242 84009 77264
15209 77264 91607 117390 126561 152923 143636 113178 107410 96750 57177 75420 123317 153901
15197 153901 175294 159088 149291 168531 158917 155807 146101 111136 100529 133039 157997 151392
15185 151392 127979 106453 84308 109864 102503 123032 115559 80048 53575 51817 52529 42369
15173 42369 77643 62315 54636 81649 47979 29865 59331 81431 73619 82783 99019 62609
15161 62609 13119 -8928 -2073 -7423 -36398 -49829 -70170 -92620 -70284 -41528 -56657 -66959
15149 -66959 -68706 -47550 -72009 -83170 -86593 -74936 -33493 11030 32740 11251 50546 67990
15137 67990 66732 60962 50804 47755 54295 66984 79798 83728 111840 79202 84500 84554 65700
15124 65700 41960 45336 51569 64617 66685 93327 110421 121051 97678 99129 81677 102886
15112 102886 129029 104828 108599 116428 145520 169478 167148 166343 203840 253186 303062 341989
15100 341989 385926 482135 562571 604893 728345 872389 1025403 1132682 1290890 1415695
15090 1415695 1444691 1466200 1459731 1421162 1343244 1253813 1195966 1115351 1052696 1002500 987965
15079 987965 940370 948470 967615 977011 947549 922943 874988 834911 840254 867118 854322 850464
15067 850464 863412 850003 822147 821194 867529 859072 860725 883432 901143 913651 923128 941623
15055 941623 931796 931504 933725 936447 943042 932813 922398 949483 908403 880336 899885 908039 914895
15042 914895 928634 936820 957305 967800 974666 998971 1035370 1130100 1218820 1301968 1446591 1668597
15030 1668597 1879415 2109650 2392321 2717676 3071204 3440646 3826998 4189641 4518913
15021 4518913 4814463 4971889 5016174 4961540 4852100 4692443 4406812 4096504 3761877 3425731
15011 3425731 3111184 2857818 2685373 2560538 2457424 2377401 2317348 2324338 2361349 2368072 2424136
15000 2424136 2495536 2577320 2715909 2903832 3071369 3290636 3542488 3841815 4171116 4582958
14990 4582958 5100698 5696191 6350164 7160085 8106025 9181555 10454713 11962323 13751268
14981 13751268 15913099 18688289 22337759 27202306 33741955 42343282 53366312 66952140
14973 66952140 83081905 101759890 123094482 147081894 173069592 199352486 223774579
14966 223774579 244639071 261095301 272243843 276545906 272679865 260718331 242466214
14959 242466214 220400798 196549741 172351329 148935357 127451295 108942666 93648116
14952 93648116 81325015 71404735 63338657 56701192 51105730 46236515 41984379 38287398
14944 38287398 34967625 32033489 29459350 27250049 25277959 23587976 22095889 20787054
14936 20787054 19625517 18658388 17804154 17010600 16258960 15566442 14879527 14271330 13706145
14927 13706145 13174957 12708735 12232057 11770717 11326331 10902121 10496912 10141718 9804722
14918 9804722 9487474 9170878 8878963 8584939 8305052 8074643 7882292 7677777 7500432
14909 7500432 7308312 7132005 6952719 6792595 6643713 6525042 6361862 6182615 6041033
14900 6041033 5877059 5655214 5484861 5307238 5159981 5031193 4935481 4789181 4615347 4460463
14890 4460463 4281618 4111575 3990972 3884317 3780320 3625237 3549284 3446730 3316395 3179542
14880 3179542 3082780 3007600 2913681 2819834 2759655 2684188 2611919 2540234 2453810 2332535 2201614
14869 2201614 2138912 2132671 2084375 2010242 1928535 1870918 1829495 1817749 1789268 1718050 1684095
14858 1684095 1625207 1606830 1608187 1578042 1533614 1489136 1447935 1354696 1348802 1359540 1349023 1360170
14846 1360170 1359691 1335915 1336633 1356561 1364414 1403499 1472671 1525878 1553892 1532906 1544660 1571340
14834 1571340 1552352 1553048 1574724 1552134 1522443 1472022 1435390 1444468 1416087 1367044 1312955 1249826
14822 1249826 1181395 1100092 1069427 1049049 1020060 996331 946813 897863 867717 847208 817530
14811 817530 747672 705937 679004 690090 693227 662373 610045 552624 515212 542803 534677 523000
14799 523000 530452 513807 486395 448741 457797 477002 466407 465986 443566 440214 455445 432477
14787 432477 411420 427778 442105 434483 453572 469496 474935 479538 497974 501548 523834 537908
14775 537908 507934 463321 418847 405963 450110 466183 457129 444799 405995 373579 379020 395569
14763 395569 411560 404259 419145 418765 407973 430725 448113 491291 498633 510699 483683 466472
14751 466472 434533 456703 496085 473704 454192 475231 389294 325022 352676 339306 288406
14740 288406 275405 226344 195457 218198 206438 166617 140638 141201 133641 95568 70588 88664
14728 88664 86806 95842 82027 87949 131161 152151 144080 135238 107335 127237 156682 126981 100623
14715 100623 113218 126792 151095 180236 202298 182754 146974 147678 166014 151143 134797 75431
14703 75431 11725 22067 50774 69091 115117 141455 160445 130061 100435 92276 97971 173863
14691 173863 214636 213577 197979 203036 203830 217175 230176 178109 183137 185258 168472 193937 234419
14678 234419 244163 241598 239191 247128 241966 212249 186372 225468 222522 223485 199288 161470 134354
14665 134354 98796 97308 119282 126594 123702 114729 89953 49440 36984 65640 86518 114052
14653 114052 126312 147827 167705 202096 240583 275100 312578 369069 496004 658174 858745
14642 858745 1098748 1365374 1700510 2035381 2426553 2764542 3136846 3463142 3763830 3996368
14632 3996368 4095347 4050253 3870295 3602479 3255849 2887469 2515770 2138049 1799136 1519416
14622 1519416 1342633 1162500 1000301 906986 813579 716858 648468 587974 543715 524267 452622
14611 452622 369152 329530 347831 353926 346803 321057 297342 232800 235977 277361 268821 232994
14599 232994 159561 155846 181897 182708 177815 166867 163163 127650 151976 194797 202245 161795 126212
14586 126212 119354 187017 204966 177305 184882 166863 160883 189605 198939 171684 120031 119217 130061
14573 130061 95757 87884 100003 118300 154658 207540 169437 117742 97360 84799 102811 141396
14561 141396 131529 120689 155648 117931 54512 50156 93311 79070 62606 53731 46912 1072
14549 1072 -34680 -22074 -8603 40419 53641 40020 33264 28486 35093 37411 72807 103955 132368
14536 132368 106239 100454 149117 173006 182230 213167 266994 341029 475791 591961 670048
14525 670048 792936 921012 1028931 1128534 1198822 1319434 1411733 1420989 1387320 1344292 1280799
14514 1280799 1115765 968138 871961 804033 682513 582901 503330 421054 355728 357829 355240
14503 355240 320106 278654 297957 252640 194812 167661 127241 116212 129547 133350 107703 82887
14491 82887 107666 133530 147387 110951 99243 98751 93385 109646 119951 100560 106034 117970
14479 117970 75474 55460 14198 23566 10728 -29092 -26758 30569 60688 66249 30529 55112
14467 55112 102141 97769 87191 58007 36810 16842 96 15054 28765 -4611 687 4635
14455 4635 -15169 2516 29658 32374 58096 52532 44861 56355 59593 60991 4890 -31971 -38216
14442 -38216 -23317 19927 71242 76885 83927 97667 77537 37920 17553 -6434 -48819 -90216
14430 -90216 -73127 -59730 -49059 2745 -27598 -42491 -3506 25247 33530 13023 -8520 -12849
14418 -12849 16488 8455 -14253 -22611 -25601 14267 60130 110000 128946 75341 62095 90172
14406 90172 87259 104057 128076 109919 151044 244051 332936 428000 475275 542116 661389 801116
14394 801116 899332 1032308 1153960 1245074 1299276 1363911 1357978 1347548 1378176 1319007 1215035
14383 1215035 1130528 980333 795972 662845 558883 469749 402498 381111 332505 262076
14373 262076 275339 302919 271878 200134 158324 174117 149713 155713 150234 110500 105893 118028
14361 118028 134341 80638 49950 54194 70897 95042 108781 136832 133787 135482 111613 89324
14349 89324 68792 72565 64195 86221 84341 40521 54756 61978 49099 48772 22521 -30690 -28825
14336 -28825 10351 1311 5102 32130 20684 -6859 -8947 11264 24945 -8315 13510 52503
14324 52503 92659 107800 98655 83293 111678 149659 181080 162427 171742 154403 148763 145817
14312 145817 116749 108702 65753 -2606 -31934 -19278 7264 52885 44303 12153 -729 -18065
14300 -18065 -21205 -11019 -11569 -13172 -13251 4238 43190 50203 60185 101532 100532 85648 39815 23869
14286 23869 2337 55602 96788 108952 99952 104349 130561 130467 128326 118548 98755 79984 67360
14273 67360 71060 77075 81577 100737 70659 27124 35350 13224 10851 23838 32408 21529 20439
14260 20439 33009 38970 13374 5193 22709 21580 10297 698 35313 21059 4810 -2314 -26414
14247 -26414 -238 32945 25443 14155 19880 2166 20887 30828 60032 34315 1217 -20712
14235 -20712 -26119 -31830 7936 17457 9410 7715 1902 148 4537 42765 62207 84749 61815
14222 61815 42965 19264 32051 36966 16992 13877 -10486 2008 2183 -11593 32072 52068
14210 52068 57466 68939 108779 142659 103786 75939 53343 53047 79109 132402 195817 224161
14198 224161 193416 165149 134100 181033 218011 184551 170715 172909 178584 171657 162721 160987
14186 160987 163959 181875 144672 137030 130624 146343 145210 146888 151862 141719 153391 141691 154332
14173 154332 169527 189999 178148 129739 71751 72426 112095 150754 141365 109765 85170 61229
14161 61229 93869 111481 125344 123087 147406 149208 115141 62558 29687 68823 81275 102589
14149 102589 95864 115345 104464 91420 63304 66327 83370 66739 55296 79911 66558 69843
14137 69843 51181 23204 41007 12741 -14420 -32384 -95354 -106390 -100731 -92169 -71173 -86400
14125 -86400 -80435 -43192 -50674 -78616 -70604 -31214 8617 36015 57249 73218 96515 94940
14113 94940 55553 50680 62483 3906 -16818 -3855 -3756 -1220 31081 49991 62231 90332 131511
14100 131511 129023 119201 128235 146460 128321 121551 137378 142856 159818 151083 133226 142897 185250
14087 185250 201520 198810 151199 176224 254620 315540 359380 396006 416045 505047 591329 679288
14075 679288 781241 806199 886999 988564 1067705 1129525 1146462 1193148 1207645 1207136 1206292 1191401
14063 1191401 1150012 1078614 1083161 1115151 1082835 1026804 968104 956427 980975 980762 1013645 1047417
14051 1047417 1055373 1109608 1150229 1201006 1274896 1341146 1454095 1612437 1860106 2187031 2540633
14040 2540633 2878159 3218620 3509498 3801883 4214318 4685166 4992526 4926460 4502531 3927693
14030 3927693 3391890 2941900 2589403 2335728 2124767 1986431 1901636 1793505 1699935 1608662
14020 1608662 1543869 1463988 1425493 1383989 1346898 1292725 1260869 1240960 1249900 1240412 1228519 1230367
14008 1230367 1268732 1304785 1317703 1297255 1288800 1293918 1310601 1300166 1289633 1323281 1293736 1279258
13996 1279258 1319836 1333242 1381791 1430423 1464241 1475023 1488991 1531117 1600959 1726586 1821768
13985 1821768 1910599 2063609 2287976 2531222 2838505 3229012 3663673 4177366 4768176 5449845
13975 5449845 6178308 6905734 7648353 8340302 8950652 9482139 9889488 10211842 10436604
13966 10436604 10580064 10774426 11061887 11498440 12102971 12937875 14091776 15636248 17723475
13957 17723475 20483334 24210327 29301922 36210531 45318831 56888634 71043286 87656107
13949 87656107 106538908 127993637 152191422 178233268 204069238 227553937 247184057
13942 247184057 261777571 270219226 272166421 267484950 255273877 235666796 211739716
13935 211739716 187418920 164353742 142439656 122281710 104900358 90668805 79208569
13928 79208569 69886758 62204983 55753402 50315168 45581700 41435719 37770632 34575108
13920 34575108 31760511 29306371 27191005 25353410 23829009 22450503 21232944 20175931
13912 20175931 19283629 18462569 17632479 16867223 16190295 15520087 14948538 14399911 13854077
13903 13854077 13343946 12893420 12440206 12019909 11602284 11183336 10802198 10441717 10091776
13894 10091776 9753775 9448610 9160689 8855454 8563519 8310372 8065976 7838844 7655383
13885 7655383 7439040 7252991 7107710 6987516 6819344 6666202 6495513 6339747 6235426
13876 6235426 6086676 5936091 5766738 5609370 5437977 5273034 5062246 4879115 4749555
13867 4749555 4596257 4446119 4313953 4166739 4050926 3928058 3803872 3696028 3610099 3518439
13857 3518439 3440644 3347587 3239317 3129037 3056094 2940965 2867676 2750605 2627728 2553837
13847 2553837 2507233 2461138 2387882 2316773 2279189 2207465 2157618 2110856 2041008 1916938 1822663
13836 1822663 1787212 1781056 1759634 1736965 1706998 1678874 1617363 1560767 1506142 1479451 1471587 1458638
13824 1458638 1467588 1479167 1501563 1527659 1543692 1584495 1570342 1594984 1635142 1634848 1618970 1678023
13812 1678023 1681484 1692177 1680572 1646444 1593094 1558041 1520027 1483821 1451685 1432966 1368697
13801 1368697 1333383 1310697 1297144 1250596 1179450 1135490 1060948 1003898 956553 914510 919162
13790 919162 911263 878677 901904 878077 898293 854198 822202 840717 793120 744599 749065 741799
13778 741799 715388 676967 628381 577392 605505 601772 572946 543986 511503 536343 557840 567453
13766 567453 582803 595670 559489 555332 599456 636065 670478 668139 637600 662358 704664 729758
13754 729758 657790 636182 635268 591903 554053 524999 537253 577371 542463 492390 466233 432917
13742 432917 432534 388332 321013 311497 343211 367582 385782 368811 337331 327512 306353 287115
13730 287115 294139 321526 301134 276346 226607 225664 238885 217299 238472 248740 216049 173283
13718 173283 168613 188584 173332 151194 145443 139162 129748 109458 115103 143890 147822 138355 147717
13705 147717 174260 190393 175105 168330 169556 151788 176904 171035 181041 192431 182287 213626
13693 213626 212619 220463 260938 284998 325231 324716 295794 262755 270086 283023 248937 231739
13681 231739 222727 231471 239481 226336 213290 221174 204506 180411 113936 108648 135053 157755
13669 157755 159967 174245 190971 186345 175141 169488 165384 145352 159277 199850 231870 220942
13657 220942 204347 177864 136604 126496 167285 159741 142623 151447 155291 121567 110792 133885
13645 133885 102486 77757 85078 92789 79773 114692 135830 122490 95469 58526 28773 33950
13633 33950 17212 6832 70 -14546 13317 45427 66099 68738 66378 93071 58955 51248
13621 51248 71921 72000 58721 66630 71157 69141 63860 91930 72004 109486 90457 50439 43906
13608 43906 33094 -534 -8768 6264 42490 95288 127167 127970 121852 95051 82233 80065 59763
13595 59763 56261 43977 59149 73807 89342 96064 84594 92175 81851 79262 69608 88252 115805
13582 115805 144870 141335 115104 85081 62196 53694 78159 85907 92927 133226 138820 127826
13570 127826 85714 87271 72131 24262 19919 7324 45732 47862 50698 68971 107433 87228
13558 87228 59935 12178 -142 48978 52214 54503 98297 122465 103132 77003 44604 22061
13546 22061 32418 39523 46005 67526 54765 40759 37782 52003 74791 49193 33717 8433
13534 8433 2874 44031 47225 42337 24586 17163 39317 39850 65273 59578 58186 65427 76607 86959
13520 86959 65416 62524 51072 108598 143051 167994 195521 200795 190262 146938 121814 138182
13508 138182 162589 149666 98573 92038 130286 168559 197984 178210 207951 268324 321724 382342
13496 382342 493470 626819 739735 851414 959777 1094507 1216267 1357639 1434765 1475035
13486 1475035 1491708 1495925 1467721 1415713 1310235 1191277 1059911 930543 811299 681369
13476 681369 596747 526333 472003 431755 412545 416377 448861 444911 406428 376415 369749 347086
13464 347086 292711 283625 260568 233816 189061 175427 170872 155663 167408 161580 152913 163855
13452 163855 126934 120474 136571 136059 127207 106980 113590 160848 136132 100981 91640 117787 135735
13439 135735 151251 136132 138334 122697 78488 65599 57021 83786 81856 66810 48041 46650
13427 46650 19684 -7815 4922 4430 35278 62177 65887 39429 42019 75044 107090 91520
13415 91520 93387 102064 102696 96402 98457 92305 85701 72557 56228 26744 20961 36308 19686
13402 19686 28199 21725 38031 72021 80659 41874 49954 105108 115247 77572 14494 18924 6715
13389 6715 784 19460 53028 67929 87297 100071 61274 41007 42243 23264 40014 15517
13377 15517 -1053 28477 9982 11459 13451 10486 16476 4118 2931 21072 50031 48453 39370
13364 39370 21336 33647 80672 90063 85854 81924 54125 8920 -26324 -3689 11576 17975
13352 17975 16015 19086 11937 22067 57370 49086 31354 42707 58874 62539 58083 73805 86826
13339 86826 82585 48292 47133 84894 46475 49527 40622 34439 28151 22508 1962 -5889 -1829
13326 -1829 12917 8818 26869 46330 29119 -24659 -45601 -19910 11265 18733 -727 -50424
13314 -50424 -75873 -33802 -2954 31409 28476 21209 8183 -27296 -45778 -21188 -54190 -890
13302 -890 54008 38144 48771 90733 92342 103203 129071 192815 239297 235990 244451 245118 236226
13289 236226 248217 239951 227533 217186 206741 155606 129926 117860 115373 85126 88006 107613
13277 107613 117495 123490 90539 86423 55405 71322 106030 84645 73523 50671 18780 3336
13265 3336 -3149 -32780 -7736 40290 20106 26244 21447 37286 20092 -22210 -9036 1680
13253 1680 -50195 -36266 -38192 -28453 -17205 -28521 -25965 -14801 22672 6105 -43870 -108839
13241 -108839 -112220 -65278 -40329 -32494 -17260 -1303 -5002 -27531 -14385 2907 17529 24088
13229 24088 16109 23386 5032 6867 7451 49543 80952 80634 40038 -20695 -45717 -56528 -32458
13216 -32458 -6973 45568 42004 8514 12498 6534 3501 -9369 16597 -6960 -63725 -34183
13204 -34183 3601 19711 54051 67246 67585 37321 42899 55203 50865 17601 59411 56592 14031
13191 14031 2341 36332 12254 -19505 -17703 -25452 -27456 -7827 16745 36916 15337 -29624
13179 -29624 -34844 -24454 -41177 -76369 -62991 -42936 -15870 -10109 3694 -7719 3975 3265
13167 3265 1833 -3043 -22229 -54898 -50554 -1174 46871 44225 31847 73555 106792 123511 147302
13154 147302 146232 171566 185302 247262 246378 202588 173386 145149 113649 92379 101833 82759
13142 82759 56720 89868 112871 95293 58046 57661 68242 65224 46944 16966 37563 31379
13130 31379 31894 36865 36337 16981 -2529 -6161 15944 19727 33160 25701 47787 53383 71761
13117 71761 82234 92166 123953 174498 180751 165673 152366 165018 179137 186405 229834 284910
13105 284910 291491 270109 208557 144921 144863 148492 144370 157505 133198 108038 80649 84608 97779
13092 97779 56480 32414 25150 10112 -14547 -20473 -19894 -22323 12517 49243 48369 41405 54913
13079 54913 57966 26720 20904 43206 54548 61944 55164 38024 49295 70941 46868 46142 56098
13066 56098 63987 98317 91093 93780 73763 73799 96202 119572 78651 52668 74434 85376 57610
13053 57610 30200 26081 29542 28905 8319 6386 -857 -41201 -10347 31634 60473 44082 29923
13040 29923 64105 50233 30575 11232 -40801 -43380 -23308 -25508 -5035 -5442 -22262 -28796 -19187
13027 -19187 17627 23703 29631 53783 65952 66703 60314 58835 41576 44185 21401 7344 -12417
13014 -12417 -2508 12767 14063 -7600 -51245 -43203 -37264 -38877 3437 69266 72809 46282 34660
13001 34660 25672 17280 21773 11137 4773 -3372 23596 44162 -2197 -35754 -29231 -4025 -14861
12988 -14861 -26013 -43600 -46622 -41075 -31530 -3152 -10527 -15650 -3104 15607 1393 -13078 -18761
12975 -18761 -38210 -29710 -25858 -41432 -43010 -6115 10564 -26604 -21245 4256 41779 44342 33187
12962 33187 43500 35120 8979 9081 -27988 -58046 -52115 -51469 -21663 21010 85501 63198 18760
12949 18760 25562 5756 4036 11072 -21072 -23008 38682 75877 65671 43579 35120 -22232 -52887
12936 -52887 -25019 -13787 -2486 -16897 -36026 -26787 -76681 -89047 -68386 -33052 24174 24341
12924 24341 -978 14657 39532 59856 58692 67832 74824 36853 17154 9707 21974 63212
12912 63212 34200 3828 -9397 -40625 -46780 -12711 8239 -4939 32814 15790 -25020 -21340
12900 -21340 -12355 28193 81636 100565 86397 31937 -19710 4984 34253 12828 18883 -7114
12888 -7114 -19708 -15299 49135 59412 15353 -16134 15877 42493 7848 -26216 -2029 21664
12876 21664 43912 66493 61961 56905 30858 4980 -24189 -34602 -34217 -10324 6409 -14425
12864 -14425 -26463 -24922 -25565 -46475 -26361 -21385 -52891 -35592 16780 9252 -14781 -42958 -43907
12851 -43907 -13848 -17228 -8499 -4424 -19910 10229 35434 4338 -17924 -37620 -20008 -13486
12839 -13486 -1796 5859 -7198 -1060 -35873 -49067 -21260 3010 3145 17591 54390 19823
12827 19823 3350 14616 2728 1871 38652 70639 34804 -21935 -28244 -45448 -56548 -43265
12815 -43265 -59810 -48992 -21941 -36803 -1787 48326 10724 -28091 -31397 4447 23500 -1915
12803 -1915 -51262 -50263 -6921 -4771 -8346 25242 13020 -2333 28983 32862 29868 9462 -2662
12790 -2662 42243 62923 51442 59712 73825 87065 99247 94156 94630 73227 38687 -1218 35755
12777 35755 37288 61368 31289 -13449 10318 15290 30383 34260 53287 59104 36908 30793 39907
12764 39907 60242 48619 -1694 -33457 1733 21324 6007 12536 14220 9217 2752 -6918 11527
12751 11527 33055 50665 42586 25360 -4322 8031 8084 36099 50737 30241 338 -6316 22150
12738 22150 67172 61766 74629 60406 26892 -449 38013 39372 19871 52243 75271 70215
12726 70215 84040 102049 60810 38470 30757 53909 48582 58285 38458 23328 30301 43974
12714 43974 44144 55475 66520 41627 23517 21119 -14048 -27857 -26803 24422 31377 58961 60623
12701 60623 51630 50023 9183 -8919 -27403 -30465 19 -974 -26194 -8011 10685 30113 4992
12688 4992 17419 -428 -29040 -40955 -20737 20258 21648 30753 54309 26825 63960 87754
12676 87754 78167 76830 65428 61942 75037 60802 74344 91805 97580 83660 45934 59420
12664 59420 52330 65544 47727 30733 43263 77879 97804 127538 120455 97013 50766 55393
12652 55393 76480 65353 45442 68147 101694 71140 623 24301 19617 -17481 -7640 3726
12640 3726 11603 6833 10531 -660 -21024 26742 4286 -5470 17991 21255 3458 22656 19636
12627 19636 -8003 -25217 1305 6213 2008 13722 33027 25463 10021 17580 5516 -25053
12615 -25053 -20430 19555 43811 39820 76355 80547 52317 51525 27467 25271 16642 20257 35801
12602 35801 68683 67054 22664 92 -42121 -62752 -44643 -62023 -69682 -58033 -33903 -11915
12590 -11915 3012 19675 6975 -20155 -11792 6108 -35954 -74924 -81379 -56942 -88760 -66498
12578 -66498 -62159 -58453 -78678 -45514 -8187 -19005 -41732 5452 49117 70059 95132 69881
12566 69881 44923 37727 -10218 -39390 -37649 -42582 -42525 -31502 -11672 -7628 -428 6388 2153 11103
12552 11103 6141 1969 -5439 33661 41503 37511 32694 34978 2967 -5929 -7476 -6627 2370 39083
12538 39083 30481 36184 -6157 -53315 -48281 -5229 1983 -857 8115 13924 9363 3146 16351
12525 16351 31144 12577 26369 33728 27734 44452 47559 55749 98370 92490 7180 7832 10889
12512 10889 18491 34355 34098 42489 26368 -31012 -47612 -50112 -22577 29248 14647 -17112 -16690
12499 -16690 -31109 -34364 -13048 -14018 -27021 7052 26163 17043 -16501 -21245 -28000 -55740 -30936
12486 -30936 -17987 -9647 -10757 -7421 -16716 -28811 -37290 -16066 -6339 1693 56163 75397 67147
12473 67147 69347 34006 36157 60820 104286 78810 44245 18431 41836 35623 49815 62328
12461 62328 83704 80016 44964 23473 -19328 -372 29488 20728 3574 -18893 -45799 -13033
12449 -13033 39034 57514 29004 42039 56201 18105 -15746 -35929 -53331 -96578 -82900 -49696
12437 -49696 -23967 -16846 15616 15263 26136 -19430 -43508 -73457 -99090 -47991 -55261 -41112
12425 -41112 28865 32251 41042 27733 14207 -6997 -699 14535 3529 39338 60569 67252
12413 67252 77827 87817 60101 22752 43392 70774 33310 87817 74502 39245 23138 34956
12401 34956 50224 99244 125918 112336 69431 49083 53539 39799 1108 -18109 -3034 10670
12389 10670 42928 49715 13975 -5001 16607 47951 43591 51919 60276 41640 22561 24766 50274
12376 50274 82526 114017 111384 104069 141391 108357 49735 31231 8428 -1415 38392 35731
12364 35731 24651 8236 17906 40537 60757 58882 28628 42458 33387 20895 24454 40158
12352 40158 45242 41449 27556 48942 53366 37330 2941 -51576 -37670 -2018 29759 25064
12340 25064 41100 38311 33841 6020 35292 61047 85498 81599 56543 52612 37689 58632
12328 58632 49319 38682 33330 41433 27268 28557 22031 22287 10973 -8196 -44726 -53101 -25443
12315 -25443 20981 45795 56248 73106 117802 86737 59758 79532 93990 62750 73403 65611
12303 65611 46864 86047 130694 101086 47154 42358 27790 -7253 -33453 -71351 -149 62007
12291 62007 70947 56436 63021 60216 41861 39759 29663 20296 48295 66276 58849 35284 20773
12278 20773 40305 57333 59959 41296 20891 -780 -32726 -45335 -25841 1584 80366 115370
12266 115370 70354 52036 37974 41258 61945 77347 75205 68421 105989 115338 118516 79263
12254 79263 63268 49611 34647 42595 40377 26897 18350 263 43969 89201 82603 79831 61156
12241 61156 16745 9291 40172 40411 49968 37767 53278 76860 67871 73146 85895 62537 78973
12228 78973 78722 5563 -24636 -21475 1696 -19301 -14143 -17633 11577 44639 37533 35689 59739
12215 59739 47806 41360 38493 77628 125312 126034 109863 115950 124546 138943 117825 110436 137991
12202 137991 103551 80414 51616 8466 10606 24185 35287 39058 37604 48875 72304 96943
12190 96943 67012 60973 34170 30618 37968 72436 106195 80058 36218 60747 85053 87218
12178 87218 78176 67948 40386 52978 87225 104047 109212 90197 51938 89979 108534 79332
12166 79332 60529 45801 59662 47302 60177 62480 95862 89526 47198 38274 71978 122310
12154 122310 141470 81325 63215 56431 63931 54424 42479 -13497 -28752 9542 45482 48913
12142 48913 15963 46720 57849 42276 43647 42841 61962 51778 34057 22782 32025 46946
12130 46946 37716 -2792 -1761 27035 45917 38047 26700 20921 12195 40042 74081 96516 80892
12117 80892 50584 26718 69880 98272 49529 38078 45051 65361 74546 76043 74571 68398 69825
12104 69825 87377 93791 84903 46106 2280 -31039 7686 47309 49278 19740 9270 68427
12092 68427 111902 137703 154832 132089 114228 99191 99227 99129 82787 102131 67716 34110 22496
12079 22496 52335 72675 73580 78741 44522 22263 66844 99569 73106 32090 27510 37011 14788
12066 14788 -18854 -16085 24414 55542 69883 60071 69031 74824 69293 64326 81551 79155 39797
12053 39797 27046 33841 57219 87829 123879 119873 125971 131989 116046 96808 100829 117104 64146
12040 64146 41415 74996 86346 90177 82322 98024 102927 104868 76424 67924 55783 71784 73893
12027 73893 78900 57002 56218 59106 33181 31148 39654 11494 16999 59804 97095 103273 140027
12014 140027 115514 99434 77303 103002 110934 125350 112701 110033 62978 20903 10116 11839
12002 11839 20231 49687 29865 9138 -1099 31733 71655 92296 102436 106820 102979 119181
11990 119181 102640 86605 93935 112774 103672 48975 1758 34014 27872 22539 70696 113970
11978 113970 98809 103402 96891 102264 82512 29054 -10841 -15921 17356 71463 80511 82232 65061
11965 65061 91206 81298 64702 36829 30148 72239 95218 72105 68329 85387 92467 94948 78361
11952 78361 48352 29030 61994 93549 88628 95250 104539 115264 118678 107119 98237 103549 114670
11939 114670 158845 182297 162040 157787 115583 148558 127924 83583 93283 79772 98503 91001
11927 91001 86670 75168 109147 157042 122422 94572 130356 144272 125949 113609 85737 77778
11915 77778 88208 96155 96274 125532 133062 120602 110442 124132 98349 91692 97437 95881 38336
11902 38336 41890 64831 67652 86610 76617 66902 86930 113560 58616 36609 76030 124330
11890 124330 171293 155643 129984 112374 91780 91534 84580 55796 33202 35221 72791 88274
11878 88274 87461 103100 108814 102505 70037 27881 43822 86048 120642 110652 130525 148586 138551
11865 138551 112318 118486 166284 187359 149848 131213 117002 85378 90410 94266 104935 99385
11853 99385 48162 55435 64710 98239 168439 186643 129713 110813 127897 126194 159252 119336
11841 119336 124742 137080 144432 162334 157131 137267 167342 207903 169009 108871 80800 111380
11829 111380 190536 191349 161994 138608 147294 99613 87644 137337 126595 123818 97897 104404
11817 104404 113709 131141 172189 177376 173827 160936 120406 107403 138593 108866 146071 194055
11805 194055 190229 166044 186763 183385 179718 170437 172640 175485 190102 171919 159990 149546 132387
11792 132387 132320 129595 147587 136410 99334 110359 121566 123403 124234 114250 99015 96889 110114
11779 110114 137873 160593 159103 198383 194838 170457 138415 159440 204843 203849 171294 149446
11767 149446 167672 191213 166089 166704 175204 179859 161512 140285 151706 203223 205984 160706
11755 160706 182827 180840 151040 126131 115768 118702 141356 135837 126861 120337 138340 121156
11743 121156 117726 152139 162231 185327 185193 175480 194816 150641 120938 154387 213550 222506
11731 222506 179583 180190 213481 217851 207092 193548 201825 200426 207466 167168 168675 191880 191744
11718 191744 216816 233548 257714 227205 240212 252545 235214 198907 188128 196216 148819 119139
11706 119139 117532 142603 164765 208419 198405 205888 206814 176629 194279 196520 209881 221900
11694 221900 223606 191572 195946 195134 204103 274525 259392 236692 206505 207011 200176 224287 198190
11681 198190 184453 191154 193929 192061 200585 233142 218008 214437 233160 216516 198470 205072 235947
11668 235947 267948 260997 251271 256495 276404 273579 268861 239628 224995 243048 260809 248511
11656 248511 240746 241925 270127 290827 269360 251168 213488 216632 204013 251380 254589 251175
11644 251175 219151 241720 246735 213090 179817 232777 301131 271526 260932 285700 300013 296024
11632 296024 262417 265880 235900 238003 240313 245451 250541 312617 328169 303373 325177 330514 289224
11619 289224 234863 230982 242902 263977 326392 338714 321671 310400 287288 267834 290778 303538
11607 303538 329024 322867 311993 313193 333554 353584 357282 343450 313290 300286 289649 262207
11595 262207 269624 292548 287708 279033 254134 257754 287095 315086 302388 256194 239716 272958
11583 272958 304353 309093 303392 313716 343289 351453 335464 304085 297307 328624 337036 352235
11571 352235 375314 358409 335782 353493 389304 405298 363686 338377 339297 326447 359441 360413
11559 360413 338602 298169 274809 290429 333992 338105 328459 348334 342963 353491 377750 383737
11547 383737 385605 392722 422799 440646 445846 423332 373264 353618 346409 376775 393211 368875
11535 368875 366441 362024 400534 445408 452806 404548 371205 370652 404021 432828 399496 399904 397505
11522 397505 394348 410986 422987 458367 476845 496146 527286 525786 519999 504287 486115 497130
11510 497130 488793 495638 487108 482470 496385 497409 463493 470053 523608 532596 531830 554702 552587
11497 552587 506876 533755 551826 514413 485243 474666 504540 464063 472733 455996 486062 537463
11485 537463 554612 551366 580034 594941 562043 571025 578979 571508 571217 545631 587586 580298 593895
11472 593895 595796 567612 540218 540431 589206 614939 593601 568157 563658 559055 544501 566390
11460 566390 639120 668376 628004 613111 624177 604723 573757 590340 617374 615055 673819 687827
11448 687827 686756 679856 675012 671003 674474 676783 698476 697649 683344 673249 651627 641203 675959
11435 675959 741956 775710 767983 755383 759079 739642 748635 750348 797596 805427 783311 760944
11423 760944 728736 708601 693796 728592 770360 796354 806888 827464 818966 868756 872009 802285
11411 802285 799210 804710 787829 806007 808142 795475 770673 756143 778000 806927 839976 851551
11399 851551 852825 882819 897460 878283 903651 899900 870611 868003 886516 893122 904480 932407
11387 932407 954105 936323 951376 951018 939993 953703 974941 968400 941789 980766 1008686 981918
11375 981918 959422 964892 1002113 1010647 1002575 982126 962147 1002192 1008014 1005865 1029956 1065954
11363 1065954 1090479 1087969 1068693 1076030 1086001 1095627 1133215 1116899 1160905 1184607 1167000 1140949
11351 1140949 1137725 1143730 1190721 1189163 1231788 1259584 1284366 1276270 1291894 1328214 1351283 1355047
11339 1355047 1352340 1361232 1359567 1424674 1485623 1528270 1562776 1543002 1541191 1554773 1528102 1495438
11327 1495438 1490854 1452274 1459397 1457521 1427430 1435510 1450467 1476294 1481716 1515320 1521762 1528507 1499394
11314 1499394 1497578 1480865 1523083 1533481 1534493 1549733 1574384 1587394 1594456 1600493 1599321 1635695
11302 1635695 1632263 1654386 1682674 1708202 1746539 1778301 1817972 1854793 1890258 1911549 1897706
11291 1897706 1932931 1950875 1999756 1985158 1988062 1997526 1996702 1978233 1945235 1953126 1933514 1957045
11279 1957045 2002681 1991068 1972099 1953187 1968561 1987720 2012962 2016985 1980895 2018023 2056656
11268 2056656 2085211 2067688 2064665 2071219 2073297 2109241 2137686 2171831 2177322 2173631 2213656 2224712
11256 2224712 2238292 2217978 2208185 2254074 2281230 2240097 2251130 2284123 2334958 2387399 2426157
11245 2426157 2457836 2496691 2465171 2460539 2513114 2551556 2603043 2598616 2580704 2605858 2613884 2625466
11233 2625466 2636660 2608452 2668876 2709639 2700939 2737871 2769105 2775992 2770088 2763907 2770963 2820537
11221 2820537 2872798 2882707 2953749 2989164 2965006 2998204 3039146 3085154 3121857 3156207 3183168
11210 3183168 3239973 3304570 3335346 3368903 3417524 3454163 3485653 3514768 3568481 3571565 3571681 3584415
11198 3584415 3587904 3580926 3592120 3603624 3611663 3661453 3686536 3719143 3721123 3716018 3754986 3829033
11186 3829033 3862855 3888343 3956479 3972643 3985986 3981195 3970092 4035825 4109491 4127983 4132600 4175344
11174 4175344 4194488 4240312 4273358 4322801 4353277 4378401 4412376 4387765 4384389 4471425 4531920
11163 4531920 4546679 4567670 4667449 4728045 4726906 4725861 4779334 4835589 4899935 4906555 4923010 4980171
11151 4980171 5029313 5029564 5077554 5171286 5171882 5158095 5173535 5197113 5266752 5314436 5390812 5444777
11139 5444777 5476324 5479479 5505895 5566318 5590044 5630750 5657604 5720731 5753267 5810509 5860548
11128 5860548 5908963 5904996 5901434 5945071 5989277 6010243 6070590 6143188 6188680 6167720 6197799 6255593
11116 6255593 6286212 6346943 6380165 6374008 6398903 6435249 6464748 6523056 6574988 6638192 6673779
11105 6673779 6701196 6721788 6741082 6789991 6845139 6874856 6905664 6903508 6887328 6922739 6954352
11094 6954352 6987690 7065287 7089146 7086326 7113737 7108804 7138073 7200903 7242459 7267203 7295494 7271623
11082 7271623 7296061 7331580 7307101 7296619 7332758 7372114 7380410 7404297 7391172 7374377 7370154 7354854
11070 7354854 7358595 7377948 7398339 7404359 7400538 7432919 7477133 7484595 7455740 7453448 7427717 7452196
11058 7452196 7476431 7493196 7508502 7474041 7469545 7483737 7515758 7498997 7451580 7405935 7401442 7352927
11046 7352927 7316075 7362662 7416224 7398066 7340713 7335991 7326115 7334470 7316261 7307669 7302118 7287984
11034 7287984 7298218 7272688 7242592 7218634 7222316 7161857 7100513 7041363 7018797 6995311 6968874
11023 6968874 6983178 6986798 7007024 6964913 6879925 6826160 6778794 6755436 6720962 6683454 6640279
11012 6640279 6614917 6583658 6581051 6534022 6481849 6460595 6455178 6445304 6424657 6371258 6349450 6326100
11000 6326100 6279844 6259262 6213403 6181330 6176624 6159273 6114443 6083047 6081582 6050830 6021158 5952450
10988 5952450 5890823 5814685 5778209 5780688 5777998 5711419 5658931 5647046 5583868 5568299 5548529 5570639
10976 5570639 5554660 5499432 5414755 5397616 5388932 5398167 5325498 5263825 5267776 5245996 5199985 5144468
10964 5144468 5133054 5037329 4965895 4925226 4902980 4868944 4830191 4796399 4778473 4774873 4773374 4695743
10952 4695743 4665611 4669860 4616142 4594915 4595684 4554734 4493016 4436993 4386335 4358523 4356867 4296671
10940 4296671 4241123 4261772 4258467 4217554 4167473 4168448 4123171 4090816 4077563 4047380 4021722 4045728
10928 4045728 4053706 4021551 3976960 3945109 3885189 3819398 3826163 3816259 3774289 3758874 3682485 3660671
10916 3660671 3679271 3679142 3666263 3654313 3639409 3640889 3600278 3560629 3533998 3503675 3456244 3408982
10904 3408982 3370474 3320854 3332382 3336636 3289171 3280548 3247717 3215461 3213514 3199243 3131807 3114463
10892 3114463 3132818 3073943 3057263 3080754 3085033 3056071 2992148 2961608 2994886 2960912 2908920
10881 2908920 2878942 2882577 2868725 2814770 2796423 2795002 2780084 2769417 2764180 2740101 2698779 2667865
10869 2667865 2675453 2653728 2624108 2567914 2553477 2557230 2587702 2610405 2563665 2540375 2531135 2502199
10857 2502199 2498406 2469930 2461037 2437142 2416713 2364463 2381745 2417336 2410737 2357162 2294177 2280650
10845 2280650 2276245 2258873 2257003 2238624 2266206 2321210 2300194 2251691 2210830 2152864 2112770 2094266
10833 2094266 2075681 2050466 2069550 2065587 2039065 2036637 2035242 2063546 2065678 2064994 2053034 2048434 2008878
10820 2008878 1995932 2001036 1988092 1980465 1934143 1945131 1950605 1956369 1954845 1948858 1943798 1921872 1883944
10807 1883944 1866452 1898313 1887620 1848617 1821547 1813121 1817137 1821998 1802353 1780910 1792526 1812569
10795 1812569 1779880 1752839 1730367 1702547 1693093 1691211 1685268 1690716 1662731 1623330 1611674 1623295
10783 1623295 1615841 1630661 1671341 1617137 1582112 1561648 1559236 1571845 1558525 1545955 1535906 1566570
10771 1566570 1555177 1539486 1540391 1529339 1508564 1503032 1512925 1465607 1421299 1398756 1429832 1427710
10759 1427710 1427262 1439516 1442643 1429181 1423599 1437894 1429501 1430882 1420232 1432886 1405876 1382467
10747 1382467 1385258 1360946 1320387 1299297 1286788 1282813 1290782 1273634 1285407 1278348 1298362 1308077
10735 1308077 1285444 1251979 1248070 1268912 1286987 1291774 1264281 1242142 1229401 1219017 1202183 1169010
10723 1169010 1167512 1166991 1220591 1233415 1222516 1198135 1181933 1189029 1201163 1189743 1160087 1125223
10711 1125223 1156796 1160471 1182834 1207159 1196673 1197682 1154732 1125898 1143719 1126172 1093151 1069528
10699 1069528 1024305 1066591 1100573 1106374 1128833 1110012 1072150 1076054 1047705 1016826 1011681 1033943
10687 1033943 1055605 1028444 1016433 1057485 1079154 1036466 974134 970945 988106 960927 931294
10676 931294 925375 948869 949346 967639 999971 1030673 1045683 1023591 1004422 993186 983843 937251
10664 937251 922762 918101 901146 923364 947989 903895 889246 914528 913761 878614 873990 873099 864506
10651 864506 864118 870270 828760 811270 808378 792676 773082 777866 784849 787453 803170 829033 852928
10638 852928 858907 860867 875871 889530 833989 809970 772717 749890 748347 732262 739326 721087
10626 721087 711570 738199 757921 771200 768735 796285 835404 831493 827751 810663 809731 779690 776221
10613 776221 760740 750968 763660 788421 762068 687292 692543 700645 702165 710511 720699 742060
10601 742060 780173 803327 796494 778912 760115 769109 801005 800399 761109 746746 721307 690611
10589 690611 666216 708599 727604 715570 749363 777638 749108 736893 745781 729652 725357 724134
10577 724134 655355 624606 598243 630037 661471 698851 704767 669670 642728 625066 633855 632997
10565 632997 637559 633849 612748 591495 580810 585986 594248 598594 624620 639615 642680 603441 620240
10552 620240 637064 632324 633370 631400 650016 655963 635063 642681 605059 652129 688670 704716
10540 704716 726494 725165 643385 643676 675295 660950 663780 655049 628685 606712 604088 573974 588632
10527 588632 609562 609194 591212 577093 565603 545523 541809 552256 573159 591241 588036 553925
10515 553925 529778 533970 492774 517728 563369 563414 533408 552328 512975 492643 505507 512732
10503 512732 503356 531860 593846 584296 537842 524294 511864 544066 550528 563338 553547 547759
10491 547759 538600 534074 555562 581828 578357 564925 546073 517354 525029 561309 583626 587230
10479 587230 598384 559494 502214 459400 448178 460906 462899 487484 489411 514055 481068 492839
10467 492839 511730 526088 522863 514316 529382 533322 563719 554012 560205 552312 503716 492472 504162
10454 504162 486487 484998 494404 494442 476795 464715 479601 497320 522795 521204 523858 511827 519042
10441 519042 506899 465836 436301 465878 477054 474898 450727 427142 420128 435864 433387 401439
10429 401439 414434 424366 411203 410950 410612 435197 450853 458879 439281 380317 407465 404837 422438
10416 422438 438706 443800 453822 462751 456281 449262 497240 477627 402764 375176 389930 423785
10404 423785 458750 471309 471186 469275 476558 486315 465509 430000 423023 416942 428800 449538 448774
10391 448774 413622 389961 417423 429074 419616 392440 400055 437356 444694 446650 431264 431556 437678
10378 437678 407127 384494 399454 389113 419679 466661 467841 427156 442692 432121 403648 385530
10366 385530 372243 370636 396897 416384 390295 394328 404030 423443 457087 472150 450276 448628
10354 448628 453888 442696 413608 435517 451390 446992 456919 477240 473396 508997 538021 573390
10342 573390 617868 675306 755739 807708 853874 870582 916429 944042 943645 914473 932893 976359
10330 976359 932840 852618 766282 738237 714371 685762 617881 587654 564000 582717 588364 578665
10318 578665 487405 411160 439260 451996 445140 427975 406304 399527 424719 394752 387475 365634
10306 365634 382136 428400 442133 433972 391348 352582 355295 394846 395570 396238 362720 394400 407110
10293 407110 419642 438746 429319 429588 432870 426029 412556 409352 426372 418324 436083 428487 413770
10280 413770 391711 416462 429710 419306 393556 398687 446000 447160 456694 431509 415390 404775
10268 404775 398223 424055 410835 376142 384050 431781 419768 418403 408634 387196 353435 313935
10256 313935 343089 394966 400083 426966 405821 403758 397813 362709 307541 335988 360605 394030
10244 394030 450346 411687 372884 346630 366673 354704 328958 348616 350588 327336 331743 346596
10232 346596 355982 345388 356186 349968 359939 364518 330546 327450 372379 378948 371801 424908 458112
10219 458112 435485 413048 384510 381354 380639 385993 406283 393361 344273 348246 319596 334673
10207 334673 337943 340152 333063 337107 327061 330878 341925 338095 405292 445846 475267 477101 482100
10194 482100 478151 486131 506253 526592 499669 465414 464503 448728 436406 445152 429664 423476 444144
10181 444144 423152 393788 338122 293105 306004 315228 367729 370413 360767 378548 349562 352005
10169 352005 381871 393434 385196 348488 328918 378518 356657 322470 329240 323319 297569 280138
10157 280138 280830 326700 350734 358451 341518 330925 291733 263780 282023 297150 279850 302572
10145 302572 336432 333599 281906 250170 220334 217700 241908 286449 305997 313342 319385 294722
10133 294722 306350 313008 308869 305813 314567 295382 301329 317853 304938 267727 291555 336156
10121 336156 365143 398943 395462 372040 352653 351579 338829 354738 352504 337689 314571 358752
10109 358752 338907 331534 338736 332670 366495 388806 380562 348343 336184 372783 388699 404388
10097 404388 433054 392516 364782 367832 351141 357883 361882 342073 339063 352859 287224 282736
10085 282736 311575 336071 313211 317402 323815 307170 276840 303088 300311 271632 248347 244268
10073 244268 250932 280351 305350 308122 302938 301717 324232 324552 322741 343476 388084 358838 313460
10060 313460 309217 304684 280702 301396 327911 289357 268172 259846 226144 246383 277647 289855
10048 289855 270665 273927 299295 277035 292160 317220 337310 357175 356788 348905 336747 326986
10036 326986 328760 360747 397831 400804 436062 425967 399337 346057 307678 310565 381877 417146
10024 417146 371873 336516 323844 321603 341771 339259 278439 278326 228712 228206 255724 278658 300233
10011 300233 331924 317850 304997 288842 277466 320209 327026 331266 376852 394683 407517 372968
9999 372968 332501 331621 359444 375828 387777 404765 401488 355151 354825 348047 303414 306511 345721
9986 345721 327807 328916 346383 328241 315977 342533 354812 303017 244135 180292 188918 252380
9974 252380 275991 271603 265579 278249 267020 282757 281795 265095 319845 348194 315225 296346
9962 296346 293260 266121 249081 289761 288828 263114 266335 318713 351199 355385 315361 298472 319441
9949 319441 342030 347660 333104 318683 350845 348614 378886 392988 392822 386508 419417 455160 429350
9936 429350 404618 439776 472992 510548 552063 634391 714408 800907 984233 1295720 1773518
9925 1773518 2402906 3158106 3891867 4517856 4986820 5453056 6158732 7263466 8458099
9916 8458099 8857002 8154053 6805352 5519988 4520844 3755698 3124923 2675982 2357880
9907 2357880 2106383 1903325 1750015 1613555 1481290 1407501 1337231 1253164 1173017 1106374
9897 1106374 1091325 1070682 1013915 920849 870185 835787 807537 765595 748176 739806 716527 679945
9885 679945 651810 625545 610854 601025 580496 629870 655735 641610 560167 533608 525307 493793
9873 493793 495330 506224 536298 506893 496481 474644 488673 522955 538370 555638 534471 518194
9861 518194 504393 501849 516121 542242 593567 594915 561650 574507 656453 669227 672784 724122
9849 724122 790780 865264 957040 1030571 1111562 1157661 1202561 1332241 1515483 1624720 1597389
9838 1597389 1423593 1214519 1041640 900023 831808 801688 764424 705417 721863 702441 651949
9827 651949 600052 580235 549758 566603 538010 500435 477395 461418 459339 459184 468899 449680
9815 449680 394395 366105 354740 334436 372911 452197 459916 449714 433526 418880 433047 389459
9803 389459 324839 309097 306073 326989 349957 352577 318069 305093 328274 327333 321928 347678 351258
9790 351258 367260 366148 375564 385754 397687 380570 336151 316826 342316 369841 370947 356764
9778 356764 352207 345067 337867 349415 346129 297842 270285 266748 271796 269563 263782 254037 281682
9765 281682 298207 265207 285615 302545 316077 324320 309372 315271 328135 285998 264580 278245
9753 278245 297892 309709 326562 308357 302139 321136 281662 255874 267497 301046 319940 324598
9741 324598 331995 299660 297817 331513 351852 338344 321958 285519 260052 258875 270803 273105
9729 273105 284615 301129 289741 295417 323412 358112 336411 298654 277711 253752 246177 282167
9717 282167 296731 291178 266688 261805 241363 250151 292573 331601 322882 311823 298685 302571 319647
9704 319647 258619 217498 253126 291719 292312 304448 260673 247796 267495 256589 239275 206585
9692 206585 211705 261253 242293 228791 229734 231912 267651 313245 289365 245727 188642 197627 226843
9679 226843 229022 275897 262391 226216 238297 262525 281667 261573 210960 223848 220626 227770
9667 227770 226071 241879 235757 228895 238183 255946 249136 229396 229184 217584 236199 249940 291094
9654 291094 274375 246557 228859 210683 205367 206973 229711 229050 232342 272780 233539 234181 232323
9641 232323 239317 223385 210499 224469 220249 214511 231475 262234 230745 254493 262012 250806
9629 250806 264347 280111 255852 242530 225459 226777 255238 237291 222918 257424 210652 197082
9617 197082 183949 217796 235016 217337 192923 194751 202652 193601 209356 218105 234698 249093
9605 249093 222345 202464 194401 161487 155083 206289 205432 188914 214556 247543 240537 224596 249617
9592 249617 241051 217097 216611 234910 236011 218779 179451 135028 149222 169652 147652 124482
9580 124482 151679 179704 199954 237358 228602 158454 147651 173531 187584 208314 211839 194572
9568 194572 213832 214606 205583 201785 175958 187432 201697 182232 173017 178745 179895 207008 213052
9555 213052 176817 197712 259687 219581 157565 130740 137311 147539 154015 129475 125657 166517
9543 166517 196192 210923 244423 272823 256883 244908 248262 255979 229084 194588 199782 204133
9531 204133 202373 261354 285573 241596 218678 210063 216404 212729 161630 169354 170568 187131 200189
9518 200189 186042 129559 147673 170871 216923 206347 166196 175258 180384 160148 147820 150375
9506 150375 163287 189484 226562 247968 242183 215873 204632 187652 184157 194557 170407 180010
9494 180010 148019 155010 172516 178142 187603 163584 141159 117534 110660 83385 102001 162568
9482 162568 183620 181990 172060 170440 164064 164664 196437 202452 173320 160067 127446 158706 211001
9469 211001 215416 170708 132429 120829 127329 152607 181275 151829 150225 159337 163308 161783 120923
9456 120923 57337 96662 146671 144092 154603 161034 143392 133314 179127 167406 154423 112679
9444 112679 88427 79407 93987 102949 117965 142710 170594 143084 137435 150377 158213 179958
9432 179958 191791 146783 109573 123214 125209 139511 139414 121372 114111 142444 141315 161765 160343
9419 160343 121294 115387 98274 111145 131932 109141 129978 136977 148065 159711 151664 163682
9407 163682 194572 165881 151524 156178 143500 147128 158456 139252 147212 148187 153821 162116 164350
9394 164350 166377 161513 149363 111638 90467 75770 45542 36645 94222 101486 94084 105370 112189
9381 112189 118263 125576 103945 84334 90127 102382 87940 116768 142144 156494 162401 146469
9369 146469 98599 91003 85665 99338 124187 116663 100076 86969 80007 85522 91365 80909 120650
9356 120650 147885 122225 125692 118446 86200 93502 112136 118832 98443 115458 67898 68685 121110
9343 121110 102095 96248 57068 20295 43844 62865 55386 53480 87142 113572 133292 138885
9331 138885 154230 166881 164015 159629 167374 212139 245835 209741 155412 100993 123129 140927
9319 140927 106768 114917 121155 109635 91204 69579 56380 60932 95578 130876 138174 100238
9307 100238 86656 84773 61739 57164 72874 84656 115912 119126 86804 75964 97585 127347
9295 127347 119317 70843 15118 19498 63127 102654 78455 30055 63033 114347 110610 113657
9283 113657 115887 100261 90732 111425 141339 115251 92399 72587 57917 37210 21693 21215
9271 21215 2785 45021 68100 82587 61743 69279 79878 69313 106912 140544 181170 179679
9259 179679 156670 163075 199244 229510 184786 156813 124019 141063 157677 141293 122310 104243
9247 104243 86122 93500 88324 109233 121297 74332 64116 28435 32209 105073 75112 84920
9235 84920 127091 154359 161353 161256 148679 163439 138023 96661 84061 121222 127895 118127 95877
9222 95877 65138 43300 45458 56090 20703 -5132 16590 35118 40128 41832 16737 65486
9210 65486 104773 119691 71785 42617 49413 51141 42131 40252 48269 61061 58497 72991 87890
9197 87890 84894 80184 101769 104021 79645 37233 39850 51159 52098 67855 61744 46808 62858
9184 62858 86634 86288 68469 54222 51778 42433 52890 23808 8824 31910 41436 79911 117004
9171 117004 139792 111060 116401 115103 104694 120994 125861 120123 114647 128819 113063 68903 78968
9158 78968 68211 53766 77607 64385 44209 69287 91531 68559 68939 35874 21096 42887
9146 42887 67104 78994 96642 117289 97429 69869 39747 52428 71225 73463 116000 123595
9134 123595 81819 40951 17611 36016 26779 17039 42140 52260 42813 79228 88863 75938
9122 75938 33961 30846 25586 30301 58984 75351 25875 37457 77319 129799 135420 104482 125728
9109 125728 133427 103692 131985 155906 133608 123268 156360 185804 141110 67720 40428 43171
9097 43171 36329 70206 79521 64304 16453 -13287 -10431 11013 33696 52636 91376 98893 116670
9084 116670 91028 51944 57184 62790 50873 12076 4915 45892 69865 90237 114028 115578
9072 115578 120659 126312 116532 58416 46323 51173 59049 53616 60785 117958 122860 138183 124734
9059 124734 91309 73898 103133 105404 110983 116019 102541 90068 85206 92591 33295 30192 14940
9046 14940 12237 39816 71403 87197 86446 73150 51001 66941 58927 46735 70592 46303 66495
9033 66495 54059 36464 33806 21232 32725 45865 58798 60222 91785 106630 102294 47410
9021 47410 32545 37244 41 -16679 -3931 30020 79316 148896 130618 113132 94258 42555
9009 42555 -4439 20655 65171 73325 52069 27637 55094 65243 77971 63627 62782 45837
8997 45837 31350 18651 18690 30387 41109 54082 52261 61417 43799 29094 13202 -14429 -61526
8984 -61526 -64383 -39737 -6252 20812 36242 33763 28101 -978 19396 37085 37768 48108 93868
8971 93868 78330 74283 47797 31325 29161 43757 63369 66503 62021 51885 34857 -18528 -52399
8958 -52399 -35209 9432 29989 52369 66740 33454 2721 -19087 9393 9021 -6569 -7261 -27798
8945 -27798 -53667 -31854 -35117 -52051 -3201 27480 19214 39540 50554 62679 79470 51780
8933 51780 27204 21687 12708 -22314 -26792 -34805 -7500 20736 42110 18450 -25503 -16824 -4038
8920 -4038 23222 34874 44956 44668 16332 24642 40769 2328 25286 31900 61665 71997 54290
8907 54290 22325 36385 14104 905 9282 29623 30443 31187 28221 18678 29 779 25944 86297
8893 86297 102247 66329 46299 38438 36613 31500 5742 600 -17352 -17232 -47431 -18992 58133
8880 58133 46854 -14760 -11719 19850 17311 51672 32776 14299 22921 40613 29982 23877 41801
8867 41801 24799 30968 29733 37032 55108 47792 55639 48049 44464 30072 54491 21445 -7238
8854 -7238 -16946 43900 51221 26997 23817 67257 87324 76834 77965 73649 69310 55314 82621
8841 82621 91568 60507 37568 1706 29795 30476 16295 40251 52704 68501 81277 61322
8829 61322 15083 11828 34837 47332 18748 -12243 7660 22402 20218 27500 21219 14745 41237
8816 41237 80496 89694 70504 107189 132263 126925 77567 67130 60565 49577 -14980 -91368
8804 -91368 -101213 -60908 -34084 -30949 -12523 9494 15918 40566 76507 66234 36049 16013
8792 16013 22428 16974 32338 19750 36584 14274 847 -6660 -24284 1910 -595 9809 10390
8779 10390 35244 60368 57727 50942 38093 39441 61420 44353 29666 29243 13143 8315 38215
8766 38215 53737 77939 67325 23076 17204 18034 5407 -13920 -16453 4662 12645 14947 33986
8753 33986 34758 40051 49592 37115 52369 54657 46493 62268 54604 30507 44644 64990 75128
8740 75128 83157 84957 87321 65040 34733 19816 25281 44491 32219 42028 70077 71463 96033
8727 96033 107945 109800 120474 131319 98718 66085 42068 39781 85384 120088 85204 36089
8715 36089 10506 16226 45785 45838 49740 56014 42165 28956 19842 9944 18535 72015 84615 61640
8701 61640 40897 13319 20159 40421 64557 81706 88120 95158 66175 46913 78428 102672
8689 102672 89039 86240 77519 46641 86588 141564 155174 113094 87776 68203 80557 99102
8677 99102 113202 88827 87828 74342 84282 74384 64560 39994 37818 60372 77866 96283 119602
8664 119602 122469 89967 68739 94710 77747 66722 113573 126122 109676 147448 178670 221813
8652 221813 288568 293547 311164 331187 342781 411840 490251 514311 502623 458039 398152 339695
8640 339695 313725 259991 215457 211756 251955 302285 318403 339458 292400 243952 224398 237663
8628 237663 233647 239264 246349 286273 319784 337618 344520 329250 376572 404505 418579 440498
8616 440498 455429 505015 550625 564294 647693 707850 793450 915757 1017464 1119241 1239487
8605 1239487 1313727 1385628 1483568 1562842 1643464 1720545 1733344 1625291 1448002 1284869 1179949
8594 1179949 1065797 942293 886287 793997 680521 629393 562913 508103 461765 447531 472027
8583 472027 447032 424296 416536 381590 323753 264637 207547 241930 263658 265522 271493 219156
8571 219156 194653 228927 227504 222809 221638 207954 234006 277885 281617 276054 287009 319645 333913
8558 333913 328199 339334 369993 385872 413637 398400 331265 317308 287729 262898 222881 189500
8546 189500 199489 167799 112515 127249 144678 181072 160967 124506 85296 92161 113896 77160
8534 77160 63609 93866 85592 93237 100415 87157 88440 72430 86153 79907 97404 81182 62956
8521 62956 54953 52739 82176 72235 26884 57502 50668 76612 91618 60767 86839 113769 157501
8508 157501 143449 103698 90276 97285 115125 91700 124373 110523 96659 99147 91727 58339
8496 58339 49208 48080 75437 102953 83869 79329 92181 101661 31147 -6836 31982 22748 13536
8483 13536 12604 12976 6757 -7226 14475 30368 42833 57322 51594 41978 52286 75920 48720
8470 48720 64349 59909 84185 118258 88147 70752 77860 111547 105401 104247 85441 55577 71023
8457 71023 106877 163430 143937 133247 92904 59498 16893 27811 40882 47208 15939 -29187
8445 -29187 -7453 8951 17323 41729 44027 38299 49499 19806 -31279 -25087 -3819 -19547 3638
8432 3638 18546 21888 23470 22402 12337 18493 11291 13763 20696 20900 38647 60575 98900 84631
8418 84631 60178 22854 33219 57370 107586 108322 95400 87648 72422 87322 136209 115086
8406 115086 94041 96119 82747 41694 40989 43672 61150 86091 94689 111437 135024 104146 85231
8393 85231 79684 51194 -25198 -21725 22032 28253 18515 -4489 -34939 -54437 -73666 -28088 -8330
8380 -8330 -9333 -20519 9221 23312 38379 29356 -11427 -12046 19776 17075 15702 36331 41606
8367 41606 14162 -24564 -5066 7779 28170 10060 4175 6149 -17576 39780 60883 49409
8355 49409 10150 -44135 -29004 -8237 17456 2275 3196 9212 10783 12428 30466 6261 -559
8342 -559 15306 3365 14093 54994 39857 -16282 -66644 -27319 -12389 -26056 -16576 40693
8330 40693 80706 92141 53247 15292 2399 -24758 -17937 952 17897 39981 16465 53112
8318 53112 76795 53013 13932 14112 30001 45364 4299 -41725 -22111 -9701 -21290 -14669
8306 -14669 8347 -7270 -23807 34317 57451 56016 44731 24683 43082 68242 44533 23684
8294 23684 29902 16881 16776 3212 21621 20527 14443 3506 -5944 -1457 -7643 12690 37912
8281 37912 36869 10100 -1856 33359 16074 5093 -5640 -4340 45806 66166 49993 56528
8269 56528 88830 67888 64505 97386 78698 47727 26125 41218 75807 70437 82882 61129
8257 61129 37839 48904 64597 44686 45145 35788 31955 40993 35626 39813 36122 29364 32234 11684
8243 11684 6303 2556 -38736 -56419 -22477 -31784 -33984 -39926 -27606 462 20231 67718 79752
8230 79752 78767 65603 37057 60045 70410 72634 61157 29806 32478 38570 9548 -40154 -7399
8217 -7399 64570 44633 10512 13730 9176 -35178 -48782 -61889 -18928 -294 16440 8781 -3422
8204 -3422 11676 13956 -9293 18021 37620 61238 58875 60420 77788 80284 92548 80410 60873
8191 60873 45641 67249 61633 50620 56264 69608 92529 110554 82497 53358 56357 61352 43174
8178 43174 18158 18754 38343 40173 74540 73570 58507 65726 82136 45579 26156 3875 -20150
8165 -20150 2524 32025 47837 87378 78232 58035 67252 57309 92632 98598 92847 46997 22022
8152 22022 11311 8351 270 -4421 21798 5883 153 -35239 -39109 -22533 -44416 -51732 -18805
8139 -18805 -39880 -44338 -46754 -42147 -27549 4822 21380 17217 11678 1940 6636 -11107 -6828
8126 -6828 7718 35240 76302 86770 78177 77699 63605 70925 61871 69566 60316 -2900 -38007
8113 -38007 -77907 -87247 -63069 -51759 -25942 23840 37297 -10432 -16131 5716 30270 54348
8101 54348 70014 67133 46285 7992 20379 1324 16336 41995 45459 6911 -5249 -10213
8089 -10213 -19981 4144 7083 -30319 20412 106486 79622 21294 26193 27118 18470 12436 -5226
8076 -5226 -3186 5511 41819 31658 -8790 -32512 1533 34806 29369 32228 48931 48323 41474
8063 41474 64865 45880 61810 95248 84502 51758 44259 41975 49573 54618 51517 61506 46705
8050 46705 62564 69630 61177 35589 52395 67047 52397 48523 81907 111574 111804 93962 57950
8037 57950 23553 50290 80215 82563 40527 18735 24096 47057 52888 75505 85724 77020 74406
8024 74406 132174 144353 119925 79277 33726 11263 46320 51436 78008 90722 91344 89131 95071
8011 95071 80901 89212 107795 125322 111597 157468 157731 138114 116666 123941 135598 111908 79426
7998 79426 87073 66923 85768 74847 27355 26567 38375 21777 28246 45801 66857 79375 83890
7985 83890 67071 55544 57962 40773 79965 84135 56427 81139 106814 122584 150776 172786
7973 172786 153132 94201 82361 90774 142038 168598 160662 150827 152740 128086 122447 120900 141638
7960 141638 152948 190580 222310 208061 179968 142374 101387 61486 88389 122447 167612 194621
7948 194621 185367 163932 146811 84462 37758 67710 102647 123257 110759 86420 87539 78338
7936 78338 86370 88945 50604 50869 68067 97226 113513 141295 136083 124154 122737 131796 114553
7923 114553 174329 215849 196512 211962 182041 132600 113236 94970 63689 76752 107218 90477
7911 90477 84155 51686 63050 62438 52133 93685 135200 145859 120724 117992 123347 80427 65332
7898 65332 101874 130015 116307 88048 71097 42677 44157 55004 55103 74453 83892 52911 -2002
7885 -2002 -14991 42848 90851 101656 63994 40085 42846 34206 18643 -8338 4041 29588
7873 29588 49391 20531 44629 59336 44613 76037 57695 75920 76366 40407 5684 -22083
7861 -22083 24162 55646 -4587 2142 27038 28519 75003 68765 74494 46167 25131 34275 36786
7848 36786 38680 3336 5886 43023 18934 12257 4748 9228 8059 25579 40660 -1087 1061
7835 1061 44010 58593 51267 78676 64424 49773 45286 1182 -22781 8062 21385 4958
7823 4958 11169 -9111 -5488 48797 23220 -6056 20602 56153 47748 10785 -39901 -31976 3064
7810 3064 16310 -14396 -50900 -65229 -16194 -6225 -26126 -22228 -8884 38520 52788 59580 41825
7797 41825 -17028 -10375 -14991 -60646 -77545 -54315 -31693 10127 49558 54907 16747 30151
7785 30151 -19242 -26466 -2264 22889 14836 10865 24103 20672 23014 28317 37688 -14226 -56452
7772 -56452 -61938 -30918 -5876 16086 15598 20283 -4585 -23372 -27179 -42985 -2089 -13631 -41055
7759 -41055 -45505 -63046 -28052 -22892 -22327 -3651 22293 73500 26585 -7921 -10114 -15193 8900
7746 8900 -4548 -26855 -21490 -26805 -29058 -24950 -416 -18441 -60680 -101488 -92110 -19693 29620
7733 29620 3178 -25568 -51605 -48603 -54449 -54655 -10523 -36685 -52032 -49750 -58912 -82239 -96525
7720 -96525 -73064 -62939 -60181 -94139 -121366 -120516 -101238 -65079 -58250 -47312 -10537 11403 19986
7707 19986 -30249 -56437 -64380 -83337 -69098 -43951 -13785 -31476 -55171 -43310 -44063 -61344
7695 -61344 -30925 -34151 1132 38879 52082 58506 51364 51271 17108 -6978 -17678 -58182 -76422
7682 -76422 -24582 27525 35597 39136 24743 3816 33083 62604 86384 63276 17881 8257
7670 8257 30565 13088 22537 26880 25939 20717 18099 21791 -4710 -37827 -28922 -29339 -46181 -19734
7656 -19734 8978 -21001 -36916 -7223 6206 3582 -6338 16736 26515 -18682 9423 49308
7644 49308 45581 73753 64630 30612 29014 11754 21106 19020 19233 57937 113177 89642 76006
7631 76006 55735 10017 -27701 -35747 -36763 -23129 -45436 -43762 -37587 -27173 -51923 -92018 -124981
7618 -124981 -79029 -41926 -23342 6347 40955 29924 17432 -4302 -11074 -30197 -48994 -40993
7606 -40993 887 26072 -10293 -44452 -14052 3016 20029 12889 -16022 -14048 -28529 -27964 -18297
7593 -18297 -53172 -62957 -62831 -24003 -2565 13742 17302 -3155 -42639 -52834 -23131 -5438 8674
7580 8674 9635 14195 51942 51742 50269 17950 14249 41902 47859 31247 14394 22818 -1592 -28316
7566 -28316 27388 36401 -16950 -19425 19466 25058 -22194 -52523 -35852 -24243 -33505 -61887 -55826
7553 -55826 -35568 -19357 -2043 -19326 18338 13073 12336 -8916 -30127 -6263 25729 28289 -3218
7540 -3218 -7064 2537 -17556 -8143 7212 15349 13636 29865 18672 45428 84991 67878 45487
7527 45487 20387 15727 -6596 -8384 8446 39619 32039 35728 18569 8138 6974 5075 -24825
7514 -24825 -9649 -9792 -7823 -21031 -28159 -84376 -97731 -106231 -101034 -67351 -54024 -39996 -47214
7501 -47214 -60516 -41434 9118 34542 45538 25450 -21977 -45701 -65749 -63503 -26612 -16737
7489 -16737 -80012 -93345 -66338 -79438 -67465 -41063 -26256 -45795 -82175 -61823 21501 59250
7477 59250 32907 2170 -33799 -59463 -56049 -75896 -77380 -64375 -58552 -27725 3729 13015 -13989
7464 -13989 -18662 -7838 -8744 -21279 23177 56196 45855 40013 24180 2432 -18882 -32708 -76015
7451 -76015 -73321 -64079 -52246 -33490 -65819 -59376 -41910 -40003 -53586 -44082 -41595 -63632 -57703
7438 -57703 -43998 -65843 -65287 -68901 -89037 -86737 -51829 -11244 6516 26532 23435 -3623 -39126
7425 -39126 -47955 -86617 -94899 -56866 -47097 -37119 -17851 -25440 -13301 -4512 -23266 -3645 -6952
7412 -6952 20139 25163 25718 43401 23059 29281 61193 43354 43416 46787 -10259 -40906 11356 58468
7398 58468 15951 -17653 7757 49542 20529 20146 9207 42366 46293 22366 3312 -33590
7386 -33590 721 -10117 -8182 -2441 -20081 -53850 -59935 -48217 1562 6871 -44364 -51556 -15848
7373 -15848 -32823 -53136 -51397 -67631 -58397 -72791 -79924 -65634 -63278 -46047 -22639 7367 -28965
7360 -28965 -18201 -25528 -61365 -67690 -34687 20849 11240 -26730 -16700 -20225 -17007 2 -52201
7347 -52201 -76246 -43912 -27494 -17141 4276 1453 -20346 -31986 -21510 -2110 21224 13297
7335 13297 32796 -11226 -43745 19520 47730 34914 7729 21164 29760 47512 41833 -7213
7323 -7213 -29684 -16409 16613 9246 32676 11288 -19415 -11652 8781 15528 -7829 -19316 -19711
7310 -19711 -12118 -23897 -56327 -35543 -4082 -27002 -13693 18064 39767 37289 -7305 -54055
7298 -54055 -62798 -35924 -17930 -3961 -6653 -27894 -43721 -46243 -10716 -12876 -16360 -38490 -54356
7285 -54356 -100530 -67927 -2273 5916 -24071 -22055 -27162 -32898 -33152 -43102 -32338 -37427 -37551 -32695
7271 -32695 -60319 -60634 -16287 -829 29631 19377 -11486 -26754 -25249 -50765 -67516 -51292
7259 -51292 -17332 -30226 -7268 11809 13617 9501 -10219 3905 43061 12673 -17983 -22935
7247 -22935 -1848 -3818 -31164 -69502 -84870 -101089 -73432 -71297 -61589 -10348 -13697 19777 31994
7234 31994 18274 -26890 -48443 -45745 -59943 -25072 36591 63689 61132 61816 55564 32921 32536
7221 32536 43140 32675 -8055 -46680 -48907 -22802 -5261 -1071 3843 -27699 -47056 -29099
7209 -29099 -28169 -63543 -68741 -74369 -68807 -58157 -43571 -28836 -10489 -9926 20749 25778 63036
7196 63036 60244 36649 39062 50227 27883 7060 -13914 -3368 11490 25243 24432 -2459 -8091
7183 -8091 -50404 -57909 -24851 -32170 -21071 -1915 -8082 2726 -22796 -52104 -32219 -16232 -15576
7170 -15576 -2838 2011 -44578 -59142 -67248 -22223 18330 51167 96122 29710 24219 -5990
7158 -5990 -25574 -10073 -23278 -22371 -15955 -26886 -10353 19424 -5109 -35043 -52243 -49219 -17400
7145 -17400 13264 14531 17813 -13876 -29626 -52823 -14409 33790 39550 46279 31678 35416 52700
7132 52700 41885 17227 28394 28471 27131 9201 -7194 -38718 -27092 -8001 3880 8145 7912
7119 7912 15723 8040 3994 -47305 -78989 -106423 -51208 -40558 -77852 -36792 -7278 18730 -630
7106 -630 -29740 -51162 -38590 -47025 -46970 -18486 -5318 -21409 -20470 32034 34900 35773 30954 27788
7092 27788 -3715 -59357 -46058 -43737 -36168 -57637 -71021 -76769 -88590 -50919 5892 19612
7080 19612 16386 24329 42058 49069 38596 41428 22353 -569 -11862 -22911 -34178 -23144 4717
7067 4717 -6912 8893 -28055 10584 15297 -34505 -24625 21703 -1516 -13598 -9470 -58030 -56953
7054 -56953 -46122 1382 17462 17498 33018 -9216 -40633 -28466 19831 26681 18184 -714 -480
7041 -480 30675 32893 31893 20499 -31231 -15406 -4487 28571 44330 43573 28598 28476 2407
7028 2407 3831 60872 61961 70152 70085 75962 59669 31989 19896 34299 23844 -43432 -73023
7015 -73023 -69396 -87944 -56885 -38387 -51239 -45336 -53192 -16858 -13297 -44962 -67862 -33182 -34960
7002 -34960 -17163 -22784 13453 -7361 -21634 -36687 -54022 -51010 -40642 -61550 -56901 -61306 -81031
6989 -81031 -81378 -34912 -18597 -523 -1755 -13093 -1394 11749 3937 -30980 -30169 -50146 -67803
6976 -67803 -69805 -66494 -67954 -53563 -32600 -16013 -20403 -31456 -37973 -37486 -38441 -44205 -40659 -35824
6962 -35824 -23703 -44999 -114368 -75679 -47418 -56290 -56218 -47267 -26157 -1973 -11680 -41162 -80967
6949 -80967 -85266 -63308 -12488 -11079 -51409 -56649 -42664 -46342 -43705 1006 -9304 -47339 -73003
6936 -73003 -76184 -67113 -60069 -19148 -6387 -24814 -63105 -34479 -24344 -59071 -67648 -44870 -41651
6923 -41651 -40619 -48190 -18077 -7608 -13960 8491 10831 9658 4209 32959 52841 33612 817
6910 817 -44406 -38150 -43724 -26681 -55586 -55876 -48857 -41860 -42679 -59662 -8959 24549 32142 75465
6896 75465 77145 36013 37583 37247 26346 5092 7674 -20804 -50183 -64514 -21255 -3096 -10265
6883 -10265 -6307 -18945 -45390 -63388 -74291 -11708 6686 -13383 -22672 -9991 -11087 -59645
6871 -59645 -63996 -37670 -25830 15742 64540 72247 67653 51978 51314 25450 -29695 -67107 -17560
6858 -17560 23928 7825 10150 24831 17929 -6206 5777 -11394 -3982 -11601 -17726 -7785 -11604
6845 -11604 -7050 -12392 25712 47532 8087 -15946 -29428 -32402 -62784 -38842 4006 9747 3119
6832 3119 3455 3176 -403 -3027 -9695 4647 -7494 -7148 -14160 -29540 -144 25315 26891 -13228
6818 -13228 -5660 -9092 -14916 -7825 24981 54997 65741 46380 -927 -13492 16662 27771 29979
6805 29979 39620 68446 71351 61880 41479 13743 16770 30686 53773 55194 30411 14823 45810
6792 45810 47022 65494 65370 48041 9953 -26247 -25279 -16353 -10997 -5748 2002 -15740 -45896 -3712
6778 -3712 16888 -34707 -64881 -58228 -14623 -32728 -31943 73 -5921 -16107 -26873 -9746 8680
6765 8680 -13148 5412 30027 43658 8552 50408 64576 4966 929 23670 19793 30163
6753 30163 -21222 -40119 -43381 -44753 -52683 -64724 -85631 -61177 -50145 -94655 -92034 -56852 15672
6740 15672 42009 41555 24917 -22869 -33039 -24129 -13722 12310 8374 13015 -55084 -72652 -52361
6727 -52361 -62443 -53785 -35770 -39428 -57754 -31268 -48036 -43596 -28386 -39008 -43327 -59472 -66732
6714 -66732 -63682 -95664 -39604 -10632 -19786 -42595 -53108 -75640 -71312 -50935 -34288 -30327 4911
6701 4911 7116 932 -11294 -49098 -40769 -32052 -13582 -21988 6572 52675 59415 21597 -3943
6688 -3943 1593 -4641 -32197 -54875 -61435 -59733 -67873 -43667 -6453 13286 36843 2070 -6591
6675 -6591 -27615 1387 7297 3182 13577 6986 19242 51416 46563 -15297 -43897 -52952 -110988
6662 -110988 -78152 -20098 -24453 -39700 -89073 -123732 -137466 -156458 -123926 -79983 -61486 -46866
6650 -46866 -21218 -46003 -51982 -55219 -10269 -14055 -31359 -36133 -40762 -48777 -86127 -114028 -132598
6637 -132598 -130881 -88841 -37519 -14158 -45257 -65057 -62689 -57303 -46950 -17226 -42327 -12198
6625 -12198 -22138 -68351 -43971 -898 -5034 -17357 -9445 25776 -7518 -18298 -32442 40457
6613 40457 59635 13880 -19928 -8404 -19825 -16387 -10335 -34345 -49724 -32119 -22970 -8881
6601 -8881 -26411 -32926 -31830 -21369 -22315 -5403 6783 14987 18031 34399 32703 -1609 10001
6588 10001 1056 -44798 -59904 -44356 -29159 -6714 -8770 -13477 -21789 -27950 -5772 -5406 -36049
6575 -36049 -53315 -48324 -61104 -48168 -43150 -61290 -54864 -35600 2774 -5543 6382 6292 -16130
6562 -16130 -27216 -21913 -35257 -49420 -19610 -7830 -31610 -49146 -40839 -41544 -50992 -66588 -4596
6549 -4596 30960 -9976 -33342 -72553 -86963 -66885 -33416 -9758 -26546 -68437 -83402 -65779
6537 -65779 -61414 -34407 -35105 -20835 7836 28191 38996 45187 36410 14306 9694 -10098 -36804
6524 -36804 -29266 -35682 -61166 -29797 -24745 -16414 -804 -21018 -33963 -20948 -32461 -66511 -49281
6511 -49281 -33242 -32086 -32636 -43764 -40951 -7345 3585 -46329 -62023 -47138 -51443 -34823 615
6498 615 11724 45951 59299 3483 -1392 3957 9677 42686 39996 38524 18638 -1754 12891
6485 12891 19017 12098 -1932 -20491 11838 55409 69510 67179 52064 31436 4684 16494
6473 16494 17035 12017 -6269 -14897 28485 28465 26840 19632 -11871 -36604 -53122 -66024 -56517 -42047
6459 -42047 -34005 -26076 -35862 -18577 3348 46156 42416 32503 1862 26403 2513 -41323 -46223
6446 -46223 -35080 5832 -8373 -35141 -35957 -21251 -17057 17419 16122 7214 -40526 -49645 18226
6433 18226 14858 -5758 -17972 4255 15758 40627 29964 -17248 -35567 -35904 -12648 -13135 -46842
6420 -46842 -53169 -46318 -52232 -44723 -37787 -29325 -45699 -30363 6638 13335 -3381 -9453 5624
6407 5624 -3294 -19082 -41854 -19104 -91 -15098 -11552 -41516 -75186 -62353 -62887 -71962 -71946 -54243
6393 -54243 -20827 -16326 -66491 -69365 -60483 -29248 -15071 -39147 -57604 -42263 -38176 -33441 4622
6380 4622 27437 -5438 -60896 -102564 -109054 -62248 -40358 -66707 -110591 -141680 -116785 -41864
6368 -41864 -25986 -47610 -54529 -67421 -23869 -20158 -43988 -55329 -38132 -40054 -38060 -62914 -107461
6355 -107461 -110737 -94831 -63706 -54357 -37645 -21257 -22141 -25259 -12687 2741 -6418 -21738 -39990
6342 -39990 -81278 -78590 -53726 -59300 -28036 -7621 16517 8891 -5437 -17461 -13904 -33797 -8611
6329 -8611 19372 42043 43210 16901 12564 -38670 -51040 -30588 -34841 -58745 -49921 -37131 -47314
6316 -47314 -25985 -37210 -60825 -38685 -49991 -33474 20219 67040 30172 17282 58882 66952
6304 66952 23935 -13639 -27503 -12051 15708 23598 11978 -2519 -23090 19735 48939 30213
6292 30213 -9518 -9910 14703 -2594 -31217 -38346 -16288 6356 -7657 -20218 -13848 -15959 -42528
6279 -42528 -74035 -32810 -19523 -22761 -33243 -34467 -47852 -59654 -58257 -45851 -21476 -62502
6267 -62502 -65176 -14005 -1868 3246 25291 16871 -43645 -62259 -34806 13135 16947 -26443 -45899
6254 -45899 -61829 -64614 3078 -10337 -5962 -25027 -3808 1523 13342 -13409 -9348 31589 21689
6241 21689 -13309 -6745 11903 6712 -31573 -40700 -55714 -91438 -63630 -29812 -477 20713
6229 20713 26323 -4581 -43670 -29487 -37207 -36547 -13777 -36833 -42251 -39650 -29675 -44665 -28532
6216 -28532 -9593 -12408 -13442 -44386 -41374 -10998 -4356 -49672 -65767 -16381 24927 11775 -18132
6203 -18132 -32285 -12894 21117 10726 3937 -3731 9488 -28281 -34572 -11510 3933 5843 29553
6190 29553 31492 23160 16044 27573 12941 24766 39099 34827 -17112 -43664 -62402 -47366 -1850
6177 -1850 10632 -28502 -49266 -6968 13266 7450 -18609 -6238 -1023 831 -27617 -53038 -59024
6164 -59024 -5741 31368 24520 34338 38009 2965 -29285 -73648 -38140 -1425 -5523 10644 10323
6151 10323 14865 -14302 -12452 7973 -17749 -23460 -46686 -58153 -69783 -45203 -24124 -19808 8667
6138 8667 -5599 -43975 -39426 -34663 -27941 -31374 -30592 -19413 -10594 -26146 -66574 -86511 -71488
6125 -71488 -80711 -74986 -75780 -29046 -23043 -29447 -16381 13467 38411 -2490 -5820 -8541 2555
6112 2555 -12559 -16058 -19481 -41386 -51471 -74526 -69789 -63077 -39300 -40251 -30864 -21556 9465 22613
6098 22613 21602 3293 -10712 -33478 -40335 -35455 -46141 -32302 -43312 -37853 -890 8614 44072
6085 44072 50539 19936 -2934 -35697 -33354 -52684 -39571 -44440 -56448 -45406 -32884 -24536 10004
6072 10004 30116 22980 15975 -42628 -68668 -81793 -32690 -1216 -21309 -21218 -28001 -36068 -16483
6059 -16483 -34675 -43255 -43362 4347 8856 78 -40189 -27058 -48014 -52017 -46961 -33592 -55136
6046 -55136 -84459 -69014 -74986 -112061 -94014 -76417 -54907 -60385 -24461 6702 11469 14281 11103
6033 11103 35581 28771 -884 -13489 -13315 -46326 -62011 -41029 -48694 -9868 8785 10593 5314
6020 5314 10819 11239 20251 5662 -44418 -75709 -69013 -41260 -30999 -20504 -9007 -39696 -30780
6007 -30780 -7397 -12706 3777 -6103 -17781 -44894 -50015 -43438 -64873 -44456 -4056 12328 -21752
5994 -21752 -46342 -36130 -10766 30322 -1651 -14347 -1197 22293 -6016 -56363 -55444 -32677
5982 -32677 -44600 -51401 -48019 -40507 -7909 14141 -22356 -58357 -51832 -46569 -59963 -62698 -33110
5969 -33110 -5518 9490 27137 20076 -4326 -7184 28038 24337 1794 14768 -14721 -27869
5957 -27869 2303 -2525 -15052 -12198 4051 2580 426 2753 -24692 -30828 3548 -28895 2458
5944 2458 2496 13473 12599 22680 1731 -11717 -56021 -74258 -52587 -45449 -35752 -53318 -59925 -63550
5930 -63550 -23247 -3348 20380 61090 77453 62918 -10954 -38773 -69887 -85158 -80529 -83666
5918 -83666 -97072 -82601 -26426 7792 23068 29876 -34654 -83492 -111168 -47078 -18966 -11495
5906 -11495 -3581 10808 -33494 -36959 -50235 -58412 -27266 -17691 4185 10737 -362 21956 43483
5893 43483 10424 -36372 -51773 -40396 -39170 -66995 -63788 -89211 -65356 -37699 -13699 -5154
5881 -5154 -22013 -10307 17498 18160 23051 10526 -7550 6242 4497 -11441 -44800 -21900 30
5868 30 -5277 -8117 10959 27585 -19609 -26202 6159 53673 50569 40567 7110 -24603 6639
5855 6639 5568 -16142 -13450 -36090 -75415 -74317 -56382 -60615 -27296 -20669 -48211 -34323 25202
5842 25202 25885 -21159 -6685 1899 15021 -3328 9126 14720 -16356 -54693 -43099 -29784 -29381
5829 -29381 -31379 -50775 -72595 -77209 -70724 -24126 -28282 -2451 -10238 -19998 -5262 1974 -29862
5816 -29862 -51825 -79314 -55696 -37821 -25718 -38564 -49235 -50410 -47691 -34426 -10555 -10170 -12848
5803 -12848 -4941 16232 -19867 -24814 -21047 -1515 6420 3509 22886 2221 -13593 -3547 8316
5790 8316 -5693 -21858 -33027 -45776 -4711 -6542 -53275 -58752 -52802 -70154 -69918 -38694 -42304
5777 -42304 -38606 -31523 -32367 -15516 -22784 -24135 -74 32267 22836 20901 12934 39649 13831 5068
5763 5068 -21643 -13567 9202 -40072 -52730 -59652 -51032 -34944 -31117 -49954 -49924 -102803 -115612
5750 -115612 -92360 -72273 -39875 -8739 -24954 -15312 -6640 -10172 4375 -12527 -35409 -23613
5738 -23613 -27827 -24971 3928 -15108 -50934 -48949 -47771 -38903 -57154 -94692 -73986 -23067 23934
5725 23934 2480 -9831 -22941 -53540 -41994 -26939 -12699 -12955 506 -23441 -315 17603
5713 17603 -2418 -41110 -23112 -25057 -38030 -64280 -67759 -46994 -22404 -10524 -29168 -38317
5701 -38317 -37317 -10269 -26132 -50604 -30472 -44044 -61983 -45100 -58822 -55580 -24571 -4307
5689 -4307 11474 9576 16444 -4798 4519 -18728 -57329 -85954 -69561 -15805 2999 -23880 -14801
5676 -14801 -1343 -17327 -20589 -33208 -32057 -18770 -45726 -72993 -99227 -60087 -34290 -63059
5664 -63059 -33558 -26047 -54700 -52891 -83420 -121940 -90859 -56571 -52424 -23337 -20608 -80248 -66071
5651 -66071 -59195 -27734 -15386 -34599 -465 28565 23031 36531 27866 56709 45896 26656
5639 26656 -19961 -18698 20311 9774 25946 21158 25619 18741 -12347 -3525 19459 70189 97438
5626 97438 72013 13802 7243 -19946 -27193 -37672 -17474 -2266 -18690 -36433 -32510 -22188
5614 -22188 41386 55453 43747 -927 -26294 -73177 -65616 -29326 -27362 -3342 -16754 -29421
5602 -29421 -49940 -79905 -78037 -84871 -53028 -25865 -42384 -53208 -95566 -54858 -13194 -52862
5590 -52862 -68355 -62272 -58230 -61946 -22403 554 -10755 -25307 -5096 -22583 -32223 9902 38552
5577 38552 19689 -22396 16178 29673 60159 68445 83815 72748 16177 -34232 -47281 -49746
5565 -49746 -49923 -33558 12576 54892 53600 31367 -26293 -30220 -21460 -35916 -42476 -25046 -16525
5552 -16525 -44953 -38599 -26634 -37865 -24306 -29408 -21628 -748 702 -8074 -10281 -5801 -15903
5539 -15903 -20613 -36030 -20316 -43975 -81396 -92930 -50618 -34101 -43015 -36743 -8819 15795
5527 15795 -354 -49855 -59885 -34136 -30131 7738 11245 -19405 -12723 -16697 -26197 1827 6439
5514 6439 -51693 -57081 -61245 -44626 14396 10839 25850 17113 -3000 -1500 30354 40202 9454
5501 9454 -10753 -32821 -44482 -46456 -40760 -44854 -30737 -27235 -12920 -11384 -30660 -65254 -24878
5488 -24878 29359 3065 -25705 -38195 -21339 -9468 -18472 -34838 -8592 -11270 -16255 -43744
5476 -43744 -48114 -33116 -53457 -17078 -40786 -84823 -112866 -112532 -95567 -28122 -10256 -48481
5464 -48481 -70370 -46562 -55982 -82649 -12028 10412 1102 14264 4666 -11137 -16916 -24888 -60481
5451 -60481 -44976 -22521 -17895 -12651 19397 11659 -38157 -66821 -69907 -44284 -8639 43635 37393
5438 37393 27216 1549 -13912 -36561 -51242 -49406 -17939 18022 8878 18743 46276 48932 54415
5425 54415 40896 -4048 -21425 -3697 32101 50499 2485 -8998 -21140 -47451 -34118 19301
5413 19301 19935 33082 63830 46226 314 -34770 -47480 -30266 -55589 -107104 -112563 -61334
5401 -61334 -62968 -70928 -53399 -45933 -32723 -9223 -10127 8418 5883 11601 -92 8710 17323 27894
5387 27894 6316 -18516 -4209 5168 17890 -24222 889 3817 -47611 -49342 309 27598
5375 27598 2713 -35986 -45391 -25830 -5566 17158 35823 36280 29785 -5523 18411 41852 45685
5362 45685 27888 -2138 -20925 -27454 -37795 -47652 -28140 -4886 -1366 -16698 -26212 -5452 8980
5349 8980 -23836 -32454 -17179 -11386 463 -7027 -35772 -39103 -43185 -60336 -89392 -95169 -68586
5336 -68586 -68757 -55928 -20619 -22626 -25191 -5269 33401 19432 -16444 5391 44271 5111 -42021
5323 -42021 -76424 -87639 -73273 -75002 -63775 -42099 -9884 16487 17815 25058 -267 -30545
5311 -30545 -52914 -51259 7448 7770 -11953 -78768 -123106 -103934 -60773 -10005 32485 13869
5299 13869 -15745 -42593 -32313 -10124 -35272 -28434 -5711 9908 34505 38579 22204 18942
5287 18942 35788 -3465 -34985 -20363 -27466 -339 17992 30203 -10136 -41709 -17388 1076
5275 1076 10341 11246 15419 16657 -16700 -37993 -26275 -65032 -75113 -10603 7207 6079 11058
5262 11058 -12160 -54281 -52589 -19612 -13720 -54118 -81234 -68933 12286 37280 32362 17138
5250 17138 26926 35804 49929 46506 8540 -12328 169 2254 6638 -17619 -1545 8201 -1667
5237 -1667 -39723 2768 27427 -26158 -62192 -54032 -22897 21074 18785 -9462 -35344 -50967
5225 -50967 -47535 -6813 -17820 -30345 -47245 -38757 -23146 -50562 -36710 -31563 -88049 -66264
5213 -66264 -47379 -32323 -25372 -13426 21532 25518 1962 -13836 -12902 1 -1972 -24548 -39201
5200 -39201 -26415 13859 75088 24953 -33921 469 3063 -15019 -25523 9068 19119 26872
5188 26872 -9331 -34719 -21112 -1346 13413 -23140 -31050 -29233 1830 44221 32566 27724
5176 27724 -1610 -37948 -53755 -18998 -12227 17769 24706 32558 67067 62511 28249 63338 79864
5163 79864 58939 45571 7755 -37792 -48582 -52875 -26286 18691 7583 43784 41028 45033
5151 45033 42263 33732 45339 55332 45630 25242 49860 57907 25074 -23299 -63528 -46755 -65533
5138 -65533 -42647 -38673 -9022 -2258 -14560 -45329 -58420 -8313 -2787 -1671 6075 -32180 -15797
5125 -15797 -17831 -58511 -58528 -33701 -1882 22991 2219 -16122 -44392 -57997 -47990 -14004 18215
5112 18215 25310 26937 23859 26003 17556 -22369 -14952 6564 -3862 -23976 -4441 6073 9886
5099 9886 -969 -27161 -45696 -26718 -26990 -13835 8466 -383 -16016 -7822 -30035 -55470 -48247
5086 -48247 -11933 7689 -20782 -19975 -8632 -13210 12163 21360 -9590 -27053 -51805 -65003 -54466
5073 -54466 -34052 -35076 -50176 -41918 -54162 -61340 -35251 1289 -15871 -13452 -26048 -11302 962
5060 962 -2770 -14277 4697 -8891 -39631 -52381 -36087 -14423 4515 -4792 7428 -5651 -53774
5047 -53774 -16538 19262 5137 15296 40600 914 -71038 -64734 -46257 -33781 -23752 -42648
5035 -42648 -38448 -57026 -59371 -83477 -56571 -61614 -62236 -38526 -36873 -1895 28131 22881 -8952
5022 -8952 -4853 17872 -3169 -26966 -49178 -25161 -5999 7835 -7104 1787 -8675 2698
5010 2698 -33258 -54970 -27827 -15769 -24798 -63573 -65011 -34470 -46983 -56618 -36866 -3249 -777
4997 -777 6432 8370 10458 -397 -30938 -16753 -27432 -57695 -63693 -53336 -16065 -3408 1201
4984 1201 -3988 10903 21813 16744 26121 56922 46445 5361 -842 8465 -8109 -21438 -21954
4971 -21954 -69353 -48266 1673 10128 17091 28888 19452 6385 -12226 -35520 -49740 -17821
4959 -17821 -4538 -18526 -10774 1682 26081 33944 38474 24799 16225 21855 6285 -6334 24863
4946 24863 29162 21061 -8817 -44888 -21961 -7450 11352 52389 -823 -21469 15946 36099
4934 36099 22966 65643 67689 32286 6889 -3672 -14717 -11499 3586 29563 -1727 -17277
4922 -17277 7737 -15995 6635 22405 28972 -1235 -176 -50888 -47911 -4367 1815 -28655 -36142
4909 -36142 -4435 -16648 599 -4233 6180 8846 -26645 -18650 -10957 6768 18724 -22499 -53053
4896 -53053 -32261 6384 -2360 -14346 -25473 -38579 -66383 -72533 -39765 18163 27537 29840 27493
4883 27493 24905 33134 20192 11492 194 -24827 11282 40560 19163 -8023 27901 21488 24725
4870 24725 22792 20721 -28765 -71692 -56603 -53469 -51067 -8201 -10939 -23768 3936 -5708 -39183
4857 -39183 -47071 -52060 -66543 -100555 -90741 -67734 -56900 -45887 -85817 -92003 -53915 -60420 -46518
4844 -46518 -4596 29672 61073 56786 67564 54929 18109 -27992 -35490 -12061 -11657 -46334 -28071
4831 -28071 -35670 -54230 -60124 -55346 -73152 -63746 -43238 -49930 -62987 -87761 -59426 -21298 -19827
4818 -19827 -33282 -30139 -2226 -5346 -21094 1251 2924 948 -38294 -46799 -17170 -9547 245
4805 245 -6320 -35221 -45461 -57033 -36732 3820 -12973 -28815 -31566 -52897 -36963 -36080 -47246
4792 -47246 -25405 -8456 5930 -37817 -79370 -61780 -44464 -55023 -36195 4024 39028 39792
4780 39792 28088 -20726 -23447 -12300 -3859 -4929 -31552 -58018 -37321 -34197 -51174 -58616 -70739
4767 -70739 -55604 -48999 -22999 18165 43419 -2027 -9461 -42800 -18797 -36907 -47028 -33199
4755 -33199 -18174 -32528 -41310 -7243 -32355 -41427 -22120 -23406 -1094 29251 4450 -20405
4743 -20405 -411 22937 45319 33114 51769 46057 42360 56084 58945 74585 55289 12002
4731 12002 -10434 -11746 5638 10499 18611 8646 897 -6519 5207 10422 8065 -10660 -43580
4718 -43580 -36906 -41367 -39831 -26401 -15489 11443 6945 -39659 8837 50250 29549 44459 48222
4705 48222 26891 5723 -23892 -57634 -45449 -21031 15115 47251 15938 29664 41174 20457
4693 20457 24259 48563 39032 62403 36690 29776 17422 -1306 9251 55565 62255 31499 5261
4680 5261 9240 24974 -3142 -15891 -5718 40034 31913 5803 18104 4141 -30471 -31848 3164
4667 3164 24229 13023 12827 -1662 -1617 -27637 -30367 -27155 -23609 26454 53504 27669 6342 -32367
4653 -32367 -57011 -30187 721 425 -13368 -28802 4492 12625 41101 58554 49412 53955 19611
4640 19611 -4153 3516 -3516 -1115 25444 12886 -6400 3374 18686 8185 14479 -70641 -96116
4627 -96116 -91560 -99661 -59748 -50490 -64318 -89899 -63207 11410 42739 69645 25563 -10278
4615 -10278 -38015 -47091 -69725 -79927 -50371 -63507 -63795 -87830 -108816 -80590 -37243 -6658
4603 -6658 -18485 -31719 -7120 7491 -25559 -69858 -63732 -62468 -52542 -37291 10073 14073 21288
4590 21288 42473 12990 7750 27294 57847 33937 -1868 -29386 -63988 -45761 18650 30020
4578 30020 -7568 -36140 -29288 -36179 -47514 -50597 -72882 -94698 -89283 -68655 -41683 -38417 -13716
4565 -13716 -26635 -38824 -85907 -99233 -70559 -27394 -31785 -45611 -27870 8746 40293 39658
4553 39658 21315 -2098 1366 7776 -9950 -20769 -7461 22481 -12142 -33085 -23780 -4411
4541 -4411 994 32718 36404 23377 39123 35209 -21818 -24136 45143 38445 35228 19742 -21721
4528 -21721 -5858 -3077 -17092 -10784 22004 23936 23010 16789 -12498 -18902 -35934 -15230 28136
4515 28136 25439 -22010 -28711 3980 34875 59779 53556 46377 8818 25674 15911 39794 -2921
4502 -2921 -6232 31120 43414 30884 20585 32486 10751 -38398 -94322 -73197 -47541 -46329
4490 -46329 -13367 -13786 -9976 31858 21165 45203 42403 -20726 -55367 -58882 -7240 13191 7013
4477 7013 14309 11408 7534 -727 -44874 -43762 -28232 -433 -13203 -26004 -5286 1249 -4702
4464 -4702 -3056 34910 63227 77843 16776 12332 12078 33083 59314 29377 61675 71453 50816
4451 50816 1732 -15971 -4511 -8047 -18617 -59051 -77230 -78357 -46403 -11451 -5388 -2849 -4468
4438 -4468 -25490 -19203 -33067 -22548 717 -34128 -47896 -22131 11878 -22173 -79591 -92261
4426 -92261 -95074 -88465 -49280 -33360 -37058 1364 35267 63611 51486 16497 -16279 -75099
4414 -75099 -66509 -14897 17173 5413 -400 -1985 -9581 25857 31065 25245 -3667 1786 -28165
4401 -28165 -63343 -41219 -13342 -17186 10506 8765 -20712 17405 3357 -52465 -35852 4989
4389 4989 -8904 546 -13786 -39965 -12612 20938 19398 12504 28263 63711 50465 35205 45257
4376 45257 27240 -17386 -23804 -19434 -13339 29756 59381 62645 66684 52611 55940 51184 34298
4363 34298 14370 20515 59575 62342 37013 13548 434 -7943 -12285 22646 42142 47165 35510
4350 35510 -15858 -39627 -35376 -31210 -23279 -2362 23247 10769 4651 34664 -25868 -50576 -32537
4337 -32537 -49781 -9882 -3233 -3844 12705 -13154 -11803 -37755 -68160 -82789 -53330 -34467 -91576
4324 -91576 -105758 -62852 -49230 -52233 -73221 -54105 -55841 -68303 -66800 -66789 -13787 10161 -11603
4311 -11603 -29549 -37967 -59715 -48431 -24450 -5283 -30421 -72321 -77062 -18352 -8286 22356
4299 22356 53936 55663 35483 -4012 -2938 6309 4727 20544 25310 33103 18151 26158 -1164
4286 -1164 -22537 -47941 -84626 -69229 -31746 -39666 -33898 -39616 -39033 -28525 -29885 -23311 -20881 -6793
4272 -6793 -661 24085 45717 29135 10593 4818 -23876 -18328 -19703 -23391 -34718 -11634 2112
4259 2112 -15978 -30319 -36984 -43536 -11138 -8178 10648 43377 27063 34194 17149 -17391 -53139
4246 -53139 -38003 -16852 -32647 -66265 -46956 88 32987 24963 -4364 -31772 -41852 -40943
4234 -40943 -24403 27237 41198 16279 22678 29139 19768 16421 17772 25243 41787 37083 -984
4221 -984 12189 -14151 -44494 -45725 -58818 -52693 -63561 -49685 -26769 -24123 -43622 -48654 -59283
4208 -59283 -54508 -78106 -68616 -70660 -88948 -62049 -12976 12805 36436 3467 15075 47711
4196 47711 46129 16776 -15124 -6185 30545 15700 1024 24426 24191 -32317 -46712 -26764 7278
4183 7278 4647 -31109 7654 4295 19529 6131 -30480 -38563 -48349 -65783 -73016 -29617 -22506
4170 -22506 -10740 -14596 -19767 -42129 13780 19289 31195 21975 33265 50133 52112 45655 19012
4157 19012 16819 33591 37091 -1908 -9882 28009 46416 33928 6773 24650 52920 2671
4145 2671 -5547 8277 -1130 -5902 17175 573 -27735 -30036 -53234 -40092 -47826 -17526 -3878
4132 -3878 -54829 -93598 -67838 -13572 17599 10975 9405 22955 13213 11833 33343 11101 12069
4119 12069 26858 15837 12846 -49830 -68280 -8669 68884 121494 72038 65188 61400 7334
4107 7334 4642 37636 49415 5498 -35848 -53772 -40360 -46809 -14476 -2555 3417 11018 48949
4094 48949 61825 12579 -2045 28248 5330 -28449 -34302 -32122 -21440 -18957 -10736 -41406 -1022
4081 -1022 23487 4542 8918 36476 28479 48564 42331 18096 16726 2665 -38561 -22997 -11860
4068 -11860 -39687 -55908 -65717 -45713 -24928 8797 16427 -5015 -11175 -33323 -5853 -14627 -7543
4055 -7543 -27868 -53245 2156 10495 12760 32338 34407 10642 -20142 15289 -26982 -18214 780
4042 780 1533 186 -12828 21085 17065 26878 9566 -20096 10209 55399 80620 88321 56344
4029 56344 4750 -1547 -6107 13270 -9104 -11227 -6691 -19370 -31368 -26403 -13547 -17653 -26608
4016 -26608 -6113 19361 28534 37177 25899 16172 9697 10755 35912 33650 48488 32687 28496
4003 28496 25514 39922 63451 63697 42990 25286 -3427 -26133 -40080 -36260 -11910 26794 65840
3990 65840 73401 37488 12298 4182 -28204 -62792 -49421 -13937 -20635 -39972 -37510 -41965 -53354
3977 -53354 6930 48672 65852 49444 23505 6678 25915 45203 72123 21580 -21536 -21445
3965 -21445 -31115 -29150 -36916 -35257 -36682 -27933 -56660 -58300 -25134 -17206 1609 219 20317 45754
3951 45754 23340 -3711 -24347 -11707 -26439 -45600 -63715 -77259 -72957 -26085 -26333 -46685
3939 -46685 -54676 -14879 36311 33839 18076 -12330 12874 20875 -30433 -53043 -50286 -59015 -73173
3926 -73173 -76928 -86252 -59643 -25241 -14041 22035 -8224 3 20711 2185 -9915 24585
3914 24585 34958 9545 6041 13158 18254 6622 -7770 1966 -7615 -9231 25949 27795 10737
3901 10737 -18385 28000 52827 34602 10207 -2057 -15681 -61782 -38479 -23956 -30662 33856
3889 33856 31802 -11298 -15193 3115 30772 -2752 -37224 -59983 -29464 -42028 -38689 -24568
3877 -24568 -20177 -15316 10853 32449 47055 23612 9229 -3258 -8085 -1723 -1703 -24014 -5821
3864 -5821 2402 -126 28147 28863 -1720 8192 11966 16162 12392 -7142 -37352 -62053 -29724 -20630
3850 -20630 -30532 -44521 -7079 21340 -8724 -26181 -15765 -12614 -30816 -13445 -1044 21019
3838 21019 8210 26378 10111 6509 12867 6346 11617 5135 -5379 -19283 -2972 -6848 -15030
3825 -15030 21 -4719 22182 23078 -15152 -32813 -29289 -924 -38586 -43072 -8605 -21295 -31989
3812 -31989 13904 8523 -9664 24728 43845 54216 63046 49796 27849 34259 -11747 -59202
3800 -59202 -64002 -61156 -46729 -53939 -78032 -77463 -42210 -22730 2706 11876 -26971 -31399 -38142
3787 -38142 -38459 -61434 -50128 -49551 -9430 -919 13392 9124 7691 -8629 -6277 -3174 -7824 22816
3773 22816 37243 44355 48138 40402 7373 11635 9272 30198 41383 48394 9015 26726 33989
3760 33989 19501 -11779 -25578 -19712 -23347 -11106 10991 -14331 -55332 -31996 -32409 -17561 6305
$$ [...]
##END NTUPLES=NMR SPECTRUM
##END=
