##TITLE=Analysis number 320389
Compound Code cc 57146
Book Reference 488/50
Project Code adrs
Chemist Name miguelg
##JCAMPDX= 6.0         $$ Bruker NMR JCAMP-DX V2.0
##DATA TYPE= NMR SPECTRUM
##DATA CLASS= NTUPLES
##ORIGIN= Bruker BioSpin GmbH
##OWNER= nmr
$$ XWIN-NMR		Version 3.5
$$ Thu Jun 22 13:20:42 2006 GMT Daylight Time (UT+1h)  MAYBRIDGE\nmr@NMR_250MHZ
##.OBSERVE FREQUENCY= 250.131544655141
##.OBSERVE NUCLEUS= ^1H
##.ACQUISITION MODE= SIMULTANEOUS (DQD)
##.ACQUISITION SCHEME= undefined
##.AVERAGES= 16
##.DIGITISER RES= 18
##SPECTROMETER/DATA SYSTEM= dpx250
##.PULSE SEQUENCE= zg30
##.SOLVENT NAME= CDCl3
##.SHIFT REFERENCE= (INTERNAL, CDCl3, 0, 16.522)
##AUDIT TRAIL= $$ (NUMBER, WHEN, WHO, WHERE, WHAT)
$$ ##TITLE= Audit trail, XWIN-NMR		Version 3.5
$$ ##JCAMPDX= 5.01
$$ ##ORIGIN= Bruker BioSpin GmbH
$$ ##OWNER= nmr
$$ C:\u/data/dgb/nmr/ADRS/1230/pdata/1/auditp.txt
$$ ##AUDIT TRAIL=  $$ (NUMBER, WHEN, WHO, WHERE, WHAT)
(   1,<2006-06-22 13:19:58.82 +100>,<MAYBRIDGE\nmr>,<NMR_250MHZ>,
      <created by zg, POWCHK disabled, PULCHK disabled
       configuration hash MD5:
       E2 DF 36 D8 04 B2 41 60 5A D7 A3 38 5A 4B D0 FE
       data hash MD5: 64K
       65 99 2D 36 B0 34 D9 7E 09 BB 96 80 D1 B8 32 93>)
(   2,<2006-06-22 13:20:17.96 +100>,<MAYBRIDGE\nmr>,<NMR_250MHZ>,
      <Start of raw data processing
       ef LB = 0.3 FT_mod = 6 PKNL = 1 SI = 32K 
       data hash MD5: 32K
       9A 86 04 6A 04 64 44 00 CB D2 12 EF C6 93 76 EB>)
(   3,<2006-06-22 13:20:19.64 +100>,<MAYBRIDGE\nmr>,<NMR_250MHZ>,
      <apk 
       data hash MD5: 32K
       FB 80 DA 27 77 03 EF 76 EF E7 96 CE 0B 14 1A D5>)
(   4,<2006-06-22 13:20:20.62 +100>,<MAYBRIDGE\nmr>,<NMR_250MHZ>,
      <abs ABSG = 5 
       data hash MD5: 32K
       C1 55 7F 0E F5 2A 99 8B C8 59 FE F2 48 6A 07 12>)
$$ ##END=
$$ 
$$ hash MD5
$$ 46 B6 39 A8 9A 5C 76 E4 51 6D 00 7C C1 B2 A0 8A
##$RELAX= 
##$RELAX= 
##$RELAX= 
##$RELAX= 
##$RELAX= 
##$RELAX= 
##$RELAX= 
$$ Bruker specific parameters
$$ --------------------------
##$DU= <C:\u>
##$EXPNO= 1230
##$NAME= <ADRS>
##$PROCNO= 1
##$TYPE= <nmr>
##$USER= <dgb>
##$AMP= (0..31)
100 100 100 100 100 100 100 100 100 100 100 100 100 100 100 100 100 100 
100 100 100 100 100 100 100 100 100 100 100 100 100 100 
##$AQSEQ= 0
##$AQ_mod= 3
##$AUNM= <au_zg>
##$AUTOPOS= <29 >
##$BF1= 250.13
##$BF2= 250.13
##$BF3= 250.13
##$BF4= 250.13
##$BF5= 500.13
##$BF6= 500.13
##$BF7= 500.13
##$BF8= 500.13
##$BYTORDA= 1
##$CFDGTYP= 0
##$CFRGTYP= 5
##$CHEMSTR= <none>
##$CNST= (0..31)
1 1 145 1 1 1 1 1 1 1 1 1 1 1 1 1 1 1 1 1 1 1 1 1 1 1 1 1 1 1 1 1 
##$CPDPRG= <>
##$CPDPRG1= <>
##$CPDPRG2= <>
##$CPDPRG3= <>
##$CPDPRG4= <mlev>
##$CPDPRG5= <mlev>
##$CPDPRG6= <mlev>
##$CPDPRG7= <mlev>
##$CPDPRG8= <mlev>
##$CPDPRGB= <>
##$CPDPRGT= <>
##$D= (0..31)
0 1 0 0 0 0 0 0 0 0.06 0 0 0 0 0 0 0.0002 0 0 0 0 0 0 0 0 0 0 0 0 0 0 
0 
##$DATE= 1150978797
##$DBL= (0..7)
120 120 120 120 120 120 120 120 
##$DBP= (0..7)
150 150 150 150 150 150 150 150 
##$DBP07= 0
##$DBPNAM0= <>
##$DBPNAM1= <>
$$ [...]
##$SUBNAM7= <"">
##$SUBNAM8= <"">
##$SUBNAM9= <"">
##$SW= 20.6930455092707
##$SWIBOX= (0..15)
0 0 3 0 0 0 0 0 0 0 0 0 0 0 0 0 
##$SW_h= 5175.983436853
##$TD= 65536
##$TD0= 1
##$TE= 294.16
##$TE2= 300
##$TE3= 300
##$TEG= 300
##$TL= (0..7)
0 120 120 120 120 120 120 120 
##$TP= (0..7)
150 150 150 150 150 150 150 150 
##$TP07= 0
##$TPNAME0= <>
##$TPNAME1= <>
##$TPNAME2= <>
##$TPNAME3= <>
##$TPNAME4= <>
##$TPNAME5= <>
##$TPNAME6= <>
##$TPNAME7= <>
##$TPOAL= (0..7)
0.5 0.5 0.5 0.5 0.5 0.5 0.5 0.5 
##$TPOFFS= (0..7)
0 0 0 0 0 0 0 0 
##$TUNHIN= 0
##$TUNHOUT= 0
##$TUNXOUT= 0
##$USERA1= <user>
##$USERA2= <user>
##$USERA3= <user>
##$USERA4= <user>
##$USERA5= <user>
##$V9= 5
##$VALIST= <valist>
##$VCLIST= <CCCCCCCCCCCCCCC>
##$VD= 0
##$VDLIST= <DDDDDDDDDDDDDDD>
##$VPLIST= <PPPPPPPPPPPPPPP>
##$VTLIST= <TTTTTTTTTTTTTTT>
##$WBST= 1024
##$WBSW= 4
##$XGAIN= (0..3)
0 0 0 0 
##$XL= 0
##$YL= 0
##$YMAX_a= 304631
##$YMIN_a= -441781
##$ZGOPTNS= <>
##$ZL1= 120
##$ZL2= 120
##$ZL3= 120
##$ZL4= 120
##$ABSF1= 16.522
##$ABSF2= -4.171173
##$ABSG= 5
##$ABSL= 3
##$ALPHA= 0
##$AQORDER= 0
##$ASSFAC= 0
##$ASSFACI= 0
##$ASSFACX= 0
##$ASSWID= 0
##$AUNMP= <proc_1d>
##$AZFE= 0.1
##$AZFW= 0.1
##$BCFW= 0
##$BC_mod= 0
##$BYTORDP= 0
##$COROFFS= 0
##$CY= 12.5
##$DATMOD= 1
##$DC= 0
##$DFILT= <>
##$DTYPP= 0
##$F1P= 14.0000005364418
##$F2P= -0.99999901652339
##$FCOR= 0.5
##$FTSIZE= 32768
##$FT_mod= 6
##$GAMMA= 0
##$GB= 0
##$INTBC= 1
##$INTSCL= 1
##$ISEN= 128
##$LB= 0.3
##$LEV0= 0
##$LPBIN= 0
##$MAXI= 10000
##$MC2= 0
##$MEAN= 0
##$ME_mod= 0
##$MI= 0
##$NCOEF= 0
##$NC_proc= -4
##$NLEV= 6
##$NOISF1= 0
##$NOISF2= 0
##$NSP= 0
##$NTH_PI= 0
##$NZP= 0
##$OFFSET= 16.522
##$PC= 1
##$PHC0= 172.8979
##$PHC1= 7.037456
##$PH_mod= 1
##$PKNL= yes
##$PPARMOD= 0
##$PSCAL= 4
##$PSIGN= 0
##$REVERSE= no
##$SF= 250.13
##$SI= 32768
##$SIGF1= 0
##$SIGF2= 0
##$SINO= 400
##$SIOLD= 32768
##$SREGLST= <1H.CDCl3>
##$SSB= 0
##$STSI= 32768
##$STSR= 0
##$SW_p= 5175.98343685301
##$SYMM= 0
##$S_DEV= 0
##$TDeff= 65536
##$TDoff= 0
##$TI= <Analysis number 999999
Compound Code 99
Book Reference 9
Project Code 9>
##$TILT= no
##$TM1= 0
##$TM2= 0
##$TOPLEV= 0
##$USERP1= <user>
##$USERP2= <user>
##$USERP3= <user>
##$USERP4= <user>
##$USERP5= <user>
##$WDW= 1
##$XDIM= 32768
##$YMAX_p= 385730383
##$YMIN_p= -106880
$$ End of Bruker specific parameters
$$ ---------------------------------
##NTUPLES= NMR SPECTRUM
##VAR_NAME=  FREQUENCY,     SPECTRUM/REAL,   SPECTRUM/IMAG
##SYMBOL=    X,             R,               I
##VAR_TYPE=  INDEPENDENT,   DEPENDENT,       DEPENDENT
##VAR_FORM=  AFFN,          ASDF,            ASDF
##VAR_DIM=   32768,         32768,           32768
##UNITS=     HZ,            ARBITRARY UNITS, ARBITRARY UNITS
##FACTOR=    0.157963299565203, 1,           1
##FIRST=     4132.6476996994, 0,             0
##LAST=      -1043.33573715361, 0,           0
##MIN=       -1043.33573715361, -106880,     0
##MAX=       4132.6476996994, 385730383,     0
$$ Real data points
##PAGE= N=1
##DATA TABLE= (X++(R..R)), XYDATA
$$ [...]
16439D952J4898k7925l1070R942L1732p485j643Q546Q685J0068n069J725M773
16426B2129k0637l2344K4511N939K22j282N041J5377j1218m560K0159K224k2586
16413B975Q479J2281j1222k4631J1768R953R118m839n201R433k0288K631M7045
16400D7502K0117l761m6O886j8988j6865k6434o12j9309J6639K445m385M466r422
16386a767o343j1414m973J1970L4380L66K2615J7317p210j0028m1576k7532j1893
16373c6088K6105K3424k2135J1369J6830J059J0760M589k0907j5960J3484L1045
16361D3575Q83q02k5356j4364N961J4105M598J501O392m280O960Q686m012k5804
16347A8043m2341J2934J8427J0503J1063j3324p063q542j6012J1129J6608r518
$$ y = [4952, 19850, -8075, -39145, -29203, 2529, -4956, -6599, 1947, 10632, 20700, 15631, 17356, 22129, 1492, -30852, -6341, -402, -180, -1462, 3579, 18956, 7738, 3178, 23337, 25561, 2975, 11454, 23735, 12513, -12118, -350, 9603, 18721, 13882, 8681, 18114, -2174, 457, 47502, 67619, 63858, 63812, 70698, 51710, 34845, 8411, 7799, -11510, 5129, 7574, 3189, 7655, -1767, -8110, -19524, -24497, -12527, 21853, 22219, 44834, 62151, 54941, 44913, 3337, -24195, -36088, -9983, 13441, -8694, 2675, 19505, 20564, 31324, 35913, 15006, -954, 12530, 43575, 44458, 43656, 18300, 3936, 9897, 24002, 28600, 30101, 36493, 32213, 39173, 47859, 43847, 18043, -24298, -11364, 7063, 17566, 28629, 15305, 8242, -300, -16312, -5183, 11425, 1907]
16335A907P521J7739l8434j2177L1018J9359j3560l2717K6388J1240O70j1196
16323G758n579L928n580K1154J0454j317J1539k7998j0112J9643L2059k0749l0428
16310D772J1187Q249j8823k5937M674O648J5565J9765J59j3080K2061J1622j8706
16297B8156J6652j8176m8861N237J1897r109l3464K0671K5512K3066k1945p496
16285g860L4333J4015K682k1952j9589O041J7660k5885j9782J6980J2324K296
16273A1263j10j7164O640k781K2752L8775j3207o571q546m969k4871M873K6170
16260C2254k3609k484L616j3626j7866J6240K571Q14n861l995M506O55j2592J4041
16246e336J8845J6162k6452j2218Q66J4817O818j3428j7043P815K0315p085j8129
$$ y = [1907, 9428, 27167, -11267, -23444, 7574, 26933, 13373, -19344, 7044, 18284, 18954, 7758, 2179, 6107, 527, 21681, 32135, 30818, 42357, 14359, 4247, 23890, 55949, 35200, 4772, 15959, 24208, 5385, -20552, -15878, -9230, 6335, 26100, 26259, 13179, 35240, 46862, 28156, 44808, 26632, -22229, -16992, -5095, -14204, -47668, -26997, -1485, 21581, -364, -7860, 26473, 40488, 43170, 21218, 1629, 7670, 25330, -555, -20337, -3357, 8967, 11263, 11153, -6011, 629, -2152, 20600, 59375, 46168, 39597, 31051, 26082, 1211, 6084, 32254, 8645, 6161, 9777, -3849, -21715, -5475, -2904, -2090, -7951, -11946, -7440, -6785, -19377, -5336, 13509, 29671, 3219, -8999, -8133, 6684, 13502, 74, -16969, -9154, 11161, 4076, -14053]
16233a4053l521M050J1965J7842k1919j896K8520N932k242k0487m484L6694L838
16220D0239k109j5018k5839M21K8174Q779k097J3264M13l1507k7716K0499j9271
16207a1768O554J0001j1538K052j8802j2929O508L7899J2962M80p084N810J8514
16194C8659k8486m9755J9585J7878J9627j8675j8079J2556J6497L965j1638K293
16182D427J0038J5723N973n662k1444k0478P65P964K9092J915o309p186j1359
16169C459J7815l56p071j8448r886l1209J3022J7118J0870J9750J1520k4542l2046
16156c0004J6691P116J3921J7638K9798j497l3612m831J3930J998j7586N755J5955
16143C5272J6332o702k7622J2866M0706J7391N780m2525k5346m033J3283J1972
$$ y = [-14053, -17574, -13524, -1559, 16283, -5636, -7532, 20988, 26920, 24678, 4191, -293, 36401, 40239, 38130, 23112, -2727, -2306, 25868, 34647, 32550, 45814, 46227, 14720, -12996, 7503, -11768, -5214, 4787, -6751, -4699, -23501, -36430, -29922, 7977, 20939, 21419, 14335, 20145, 38659, 10173, -39582, -19997, -2119, 17508, -1167, -19246, -6690, 9807, 13772, 2134, 4427, 14465, 30188, 36161, 30499, 9055, -11423, -10658, -2694, 26398, 28313, 22004, 14818, 3459, 21274, 20918, 13847, -4601, -14487, -45696, -32674, -15556, -4686, 15064, 26584, 2042, -30004, -13313, -6197, 7724, 25362, 55160, 53663, 20051, 15220, 29150, 31148, 13562, 19317, 35272, 51604, 44902, 17280, 30146, 70852, 88243, 94023, 51498, 26152, 22119, 35402, 47374]
16131D7374l0094N361L8162O047j247k1240j0062r538j2695O34o800k9112J7046
16118f164K2612J4181r362m459m380L9169q329k4138j7758m2489l978N8833L320
16105A7058j1989Q784j0232p430j4396R104j2642K385J3494J6818J577M331J0414
16092B7276n098k2217j7131J4173J3473k1413j246J4163J0737l672R590l049k3510
16079g924N289Q804k2753j4209l800K6121L1089j7596n514k554R362K3552Q022
16066C7889j4001j0034r678p151j425k901K666K5544j9439j0538J8472P648m0105
16053b3053j428K0059J3731k0640J2102J7832k464J3664m87j1885j1083q879L049
16040E18M079J5379O897Q551m990K772j1947j8762j9820J6404o270k9635K3499
$$ y = [47374, 17280, 22641, 60803, 66850, 65603, 44363, 34301, 24763, 12068, 12702, 5902, -23210, -6164, 16448, 30629, 21267, 16808, 12428, 51597, 43268, 19130, 1372, -41117, -45095, 13738, 17058, 5069, 13853, 3621, -3809, -18205, -9101, -21743, -19358, -5864, 10954, 12531, 16862, 27276, 22178, -39, -17170, -2997, 10476, -10937, -12183, 1980, 12717, 9045, 18635, 15586, -7924, -2635, 6169, -16584, -30793, -34593, -8472, 22617, 5021, -493, -3047, 6315, 29867, 37889, 23888, 13854, 4176, -2975, -4400, -7301, -4635, 20909, 1470, -9068, 9404, 17052, -23053, -24481, -4422, 9309, -11331, 771, 18603, 16139, 29803, 29316, 17431, 6348, -2531, 518, 4597, 19976, 26873, 35424, 30434, 33206, 21259, 2497, -17323, -919, -7189, -36824, -13325]
16027a3325L3340p315j9979j5681J0526J3657r234l183J9417N913K1613N437j6482
16014B4704m842k9797k4001j1134J3192O507M894J7012L953l3016j2963L4382
16002a1109J2742j617J3929n614k6483N33J0023J2146j3796j3753L2131P798O948
15989B3878j1959j0289k0874R664J7545L125K397L923q728J7113j0184k6612r981
15976b0982j3571R29J8840r034p284J1870K4502J9870k3035J768k697n444k0247
15963b4515j5299m924n749K528l971J2559J3493k340L4873J2984L5684K044N426
15950F2793n476j0081j4064k436L265j7135j0107m399j983j0913j219K9018m330
15937A2933k1249p517l8941J5333P359K1912K0911l100P627j0676K2262L4414
$$ y = [-13325, 20015, 12700, -7279, -22960, -12434, 1223, -8011, -11194, 8223, 14136, 35749, 41186, 24704, 19862, -9935, -33936, -45070, -31878, -25371, -20477, -3465, 488, -32528, -45491, -11109, 1633, 16, 13945, 8331, -18152, -17619, -7596, 4550, -9246, -22999, 9132, 16930, 23878, 11919, 1630, -19244, -9580, 7965, 11090, 13487, 17410, 8682, 25795, 15611, -11001, -20982, -34553, -33624, -14784, -23818, -31102, -19232, 5270, 25140, 2105, 3873, 1176, -4268, -24515, -39814, -44738, -50487, -47959, -51930, -39371, -25878, -28218, 6655, 19639, 55323, 57367, 62793, 57317, 47236, 33172, 30736, 34001, 16866, 6759, 2360, 377, -10536, -11755, 17263, 12933, -8316, -15833, -54774, -39441, -32082, -10170, 10741, 7641, 15268, 4592, 26854, 61268]
15925F1268L350l1473j4262j515j3947O221J0962J2791O90j6499k0667J1369m544
15912C744K051L6302k729n168j3280j7587L6038l596k4963o004o603l3111J2403
15899b2503M1393J6418l4976l2443j9985O505K0231j528J2516m79R312K3725R959
15886B8145l428J0004j4288k7455J3075o157Q752K0677p687M529K3444m987k8074
15873A6550R44j1889k1498J546p272q970j6914J8895K0250J1043K2336J8793j335
15860D2479j91o135k2902K2328K3024q347k2754j8483j8663J6985P743k458L402
15847A6028j0566k8343J271K8091K1620K613l557l334j4600q3J9975o351k5624
15834b860k0147J451Q983M782P062J6601J5311k5193j7503j2148J418J3514K2344
$$ y = [61268, 64618, 33145, 18883, 17368, 3421, 9642, 20604, 33395, 34085, 17586, -3081, 8288, 3744, 5795, 42097, 39368, 34200, 20920, 3333, 39371, 35775, 10812, 4808, -1795, -34906, -22503, 18890, 35308, 332, -32111, -52096, -45591, -25360, -26888, -14372, -14851, -5539, 18186, 28145, 24717, 34721, 20433, -7022, 6053, -104, 8648, 29325, 21638, 26167, 49611, 44624, 16550, 17494, 5605, -15893, -14347, -21619, -30589, -47503, -28608, -8358, 2685, 25021, 43814, 42479, 42288, 36153, 13251, 35579, 58603, 50256, 27502, 9019, -9644, 7341, 15084, 12626, 16028, 5462, -22881, -21610, 6481, 28101, 30714, 27157, 23823, 9223, 9140, 29115, 22764, -2860, -23007, -21556, -12573, -7791, -729, 15872, 31183, 5990, -11513, -23661, -22243, -8729, 13615]
15821A3615K2384l4919j5532O419j7457j0545J9991J9098j3171l046K3219q69
15809I187R411p795J7051R407P337j5021k9776l950J1033K399J3263P887O497
15796C6930j7443j0470l94L1927K2666j2797M577j7073N229j0098q833Q498J0678
15783D3397l1987o652Q417l4957m976J5793n938k811j8200K4848K5595j8672j8255
15770b4398J7293m10j1828M739k502J4392J0287j8017Q50L448J7519J3825R99
15757B6197j0143k3313k3936k7256k278K741J9755K4233J8171O734L214J5066
15745B9185l2078m4191M2231J3123l348l7259k0947K236j031j3807J6827L5080
15733a3979L696J7272l906J1250m243J9184o750O414j7985k1812l918l872m90
$$ y = [13615, 35999, 1080, -14452, -8033, -25490, -36035, -16044, 3054, -10117, -13163, 10056, 9187, 18598, 10803, 27854, 37261, 44598, 29577, -199, -4149, 6884, 9283, 22546, 30433, 36930, 19487, 9017, 8623, 40550, 63216, 50419, 54996, 37923, 43152, 33054, 24221, 32719, 43397, 11410, 4758, 13175, -21782, -26758, -10965, -16903, -19714, -37914, -13066, 12529, -6143, -24398, -7105, -7515, -19343, -14604, -17106, -2714, 7573, -10444, -9594, -6146, 11373, 25198, 26197, 16054, -7259, -31195, -58451, -60729, -57988, -38233, -14000, 4171, 10905, 14119, 29185, -2893, -47084, -4853, 8270, 4922, -32337, -53284, -51048, -52079, -65886, -49059, -13979, -10283, 6989, 3083, 14333, 10090, 29274, 22524, 28938, 10953, -10859, -14777, -18649, -19139]
15720a9139K0161L728j9226Q813j2533j1549k8039K2474M3261O912o601M500K648
15707A5410K2389J0487p050j0575j8792j5078J1090J8742j9557j8648J2427J8659
15695A9504j701j6494j8220j2625j2102j4230K24j3262Q016K2250K8247K0429
15683A0036j5019l6975J5351k923N399J7871k500J548R710J6797p718l480K4957
15670C3054n087o065j4444p684M569J1161K2687J774j0391k5545J004j3531k905
15657a1403K0718K523L077K7128O25p035l2186j3734j7142P566K7003Q272K3313
15644C8725J2378j9348j9177j0246J1546P488Q392P473O016j5660j7125j6732
15632f270l589M960K487Q145p066K1397R371j4006m495J473J8347N611k8180m4451
$$ y = [-19139, 1022, 4750, -14476, -5663, -18196, -29745, -57784, -35310, 7951, 14863, 8262, 12762, 15410, 37799, 48286, 41236, 30661, 11869, -3209, 7881, 26623, 7066, -11582, 845, 19504, 17803, 1309, -16911, -29536, -41638, -55868, -55644, -68906, -60890, -38640, -10393, 10036, -4983, -41958, -26607, -29530, -24131, -6260, -8760, -7212, 2498, 19295, 11577, 8097, 33054, 27967, 21902, 7458, -226, 4343, 15504, 38191, 39965, 29574, 4029, 5033, -8498, -11403, 9315, 11838, 14915, 42043, 42668, 35633, 3447, -10287, -27429, -19863, 7140, 15412, 38725, 51103, 31755, 12578, 2332, 13878, 21366, 29758, 37231, 43247, 27587, 10462, -6270, -9859, -4899, -2412, 5733, -1333, 20064, 29435, 15429, 10934, 12407, 30754, 36365, 8185, -36266]
15618c6266k3746L1047M0397R009J0774k4375j9974J9730K8046j6852m4962J4322
15606a2850K9433q022o920J3602Q247R03j076l4775L442J4793K1231L276l7791
15593f507j4821Q736q489k4826J5992R540o654M179O734J3104q546J036n53j5750
15579b6825K5869L9729n960j1533O792k7219p573M827J6741J3096N743k0018k7236
15566a3567k3925o348l988K3336J5414Q414J0024R156r129k6108J6358M0420K3744
15553F3801J730l6258j4633J1586j1016k3384j0823M156M450m650l877o400k3825
15540d9143j3831J8879K1304j205o167K7751L4465P664j8877j4421M798k1815
15528a0598K419J9776J2361N006k5778p599n564l1413j2232J9952L1300m662m1152
$$ y = [-36266, -60012, -28965, 11432, 20441, 31215, 6840, -13134, 6596, 34642, 17790, -27172, -12850, 16583, 8561, 1641, 15243, 23490, 24393, 23317, -11458, -8016, 6777, 28008, 31284, -6507, -21328, -12592, -21081, -45907, -29915, -20375, -27029, -22850, -16116, -3012, -11558, -10522, -11075, -26825, -956, 38773, 32813, 21280, 28072, 853, -6720, -1893, 14848, 27944, 33687, 13669, -13567, -37492, -43840, -47828, -24492, -9078, -664, 9360, 18516, 9387, -16721, -363, 40057, 63801, 65531, 29273, 14640, 26226, 15210, -8174, -18997, -14841, -10391, -15041, -18918, -25318, -49143, -62974, -44095, -22791, -23996, -30163, -2412, 32053, 39717, 20840, 6419, 11217, -10598, -8179, 11597, 23958, 28964, 3186, -4413, -9977, -41390, -53622, -33670, -2370, -7032, -48184]
15515d8184O604L7802M8596r953q600j5569j7562p491J1183j258r265k61P821
15502f137K2624q339O355J5419j3661j379L335J0574k2256n283J2895J4114J0254
15489C8515k9461k2136q688J9855J3591K8516J0365k4839K682l050k4357j1454
15477a0461k1692K4369L1170J5600l1896k5782j7700P212K6096j9665J7865L8182
15465C3298j4295l4419J2074j2622k9363j0439M615K1414N3777J0734r081l0424
15453d731q419J7429J7656j6986j170l542r150J8035R840j4065j7969j5292J8952
15440i412j2618n831J9768Q79M269j6171q832r67J3085J7164j8294k556K0215
15427F99R28O491K931K6861J8255l628m2324L379j1970j810j1611l2057L160Q909
$$ y = [-48184, -41580, -3778, 44818, 34865, 26265, 10696, -6866, -14357, -3174, -4432, -13697, -13958, -6137, 16487, 8148, 14503, 29922, 16261, 14882, 18217, 28791, 6535, 1252, 14147, 28261, 38515, 9054, -13082, -21770, -1915, 11676, 40192, 50557, 25718, 28400, 25350, 993, -10461, -32153, -7784, 23386, 38986, 7090, -18692, -36392, -29180, -3084, -22749, -4884, 33298, 19003, -15416, -3342, -15964, -45327, -55766, -51151, -29737, 24040, 34774, 25693, -4731, -13150, 4279, 21935, 4949, 3779, 237, -8913, 9122, 18962, 4897, -13072, -28364, -9412, -22030, -27861, -8093, -7214, -2945, -19116, -27948, -28915, -15830, 1334, -16960, -19516, 699, 1627, 8118, 11049, 37910, 56165, 52537, 10213, 13592, 1622, -188, -11799, -43856, -40696, -31787]
15413c1787j1197N5M6945L3353K5952j7355m2457l8469j2615J886M41m997J1678
15400c8567M0823Q167n897N89j2650j8343J893J0472L667J5447l1864M095N055
15387a7113r748Q85j2319K2815j2256P778j3797n006J6806O445j0823m763O171
15374b4925P585R136j5453R707O100j9368J1197L9180L2261l3616k4906L259M351
15361D508p042K0944R52k5577m296k0275j0835p314M4596j3326j9803q588J155
15348d4901k8087o923J9568K8429J6144l341K391L675R863J277R634K861k3764
15335a3174l3463J1275N933J3079K761K6967m27o446j3647k550J0454O51M31m5
15321A799q562j83L169L6202K773k4987L00Q836n326j9526k8697j534J6508k561
$$ y = [-31787, -42984, -42929, 4016, 37369, 63321, 45966, 3509, -34960, -47575, -45689, -45248, -50245, -38567, 2256, 10423, 4526, 5115, -7535, -25878, -23985, -13513, -9846, 5601, -26263, -22168, -17113, -26861, -25976, -38295, -15480, -27736, -19958, -33755, -38761, -21955, -15510, -26333, -31096, -24925, -17340, -8204, -23657, -13950, -7850, -27218, -16021, 23159, 55420, 21804, -3102, 157, 4508, -2534, 18410, 19362, -6215, -10511, -30786, -41621, -48935, -4339, -17665, -37468, -46056, -44901, -72988, -79911, -60343, -31914, -15770, -19111, -16720, -13045, -3182, -1905, 7729, 10590, -13174, -46637, -35362, -29429, -16350, -13589, 13378, 12951, 6505, -7142, -9692, 762, 1413, 1844, 1799, -6763, -6946, -3777, 32425, 35198, 10211, 10511, 19347, 14021, -5505, -34202, -35736, -19228, -21789]
15307b1789J7740j546N921j1056l7589J3877K1677J616J0554M255n285K0643O669
15294B5687n028l408j3335q484J3319L3341Q101k6054J4786K0373N538q87j2444
15281E1505N661j2957j4233k1416R486j3966p598j2622o424n411K1850J5705J0760
15268B0340q016j4494r236L216j1591L719J7519J1851q538J9913J2068J0781o037
15255D1495l9418l5370o287k652M2039N8930L662k4790n5776q026L697k007L72
15242b4131L590K2410L722K8620K3768l4394k0013l2119q031j1085K1509J9503
15230f651K0518r184j8787o850j3919p696K2125J6894P283J212j3195k8605o37
15217c7492J443j2657q395p798J0890K7698K3597q401P910j7622M442n211L967
$$ y = [-21789, -4049, -5595, 326, -10730, -48319, -34442, -12765, -11149, -595, 3660, -1625, 19018, 25687, 20659, 17251, 3916, -4568, 8751, 42092, 50193, 24139, 38925, 59298, 64836, 63949, 51505, 57166, 44209, 29976, 8560, 18046, 4080, -3518, -16140, -22564, -27975, -6125, 9580, 20340, 12324, -2170, -11406, -8190, -19781, -16062, 1457, 13308, 4770, 24683, 36751, 47532, 41495, 2077, -33293, -39580, -42232, -193, 58737, 62399, 37609, -18167, -26193, -22496, -24503, -24131, -20541, 1869, 5591, 34211, 57979, 23585, 3572, -28547, -36578, -47663, -26154, -6651, 13867, 4683, -14104, -20954, -34873, -42569, -20444, -3550, 3733, 4945, -8250, -36855, -37492, -36049, -48706, -57101, -64899, -54009, -26311, -2714, -11115, -3205, -20827, -16385, -21596, -17629]
15204a7629q852J6010J3981n032o814q863j916J8361J2965O923k1809j0838q6
15191a3599O551J684j7145j9206p819J8115L4504P523k3672L932K6096j2480K1959
15178B6443k189j0375r989L6120R025j8180k0705m3181J7695K9801k0247m461
15166a0243N212j0435j0039k8933L695J2083Q472J7352J5251J0797L411j6018
15154F05q708j4308j8679k645O445J9929k210N681n789N177k1646O259K9309j2033
15140a2613J2963j1901k4684p297M0061J8180j4166j4838J4614J57P907k6427
15128a8044j4603k5869J9061R358k9191J256K3123K6112j2018N148J0258J9712
15116A4303m907o585M746j8730J1019J8613k8616K950l237l412l446J18r761L861
$$ y = [-17629, -26481, -10471, 3510, -1522, -8336, -17199, -19115, -754, 12211, 19134, -2675, -13513, -13599, -7048, -5364, -22509, -41715, -49534, -31419, 3085, 10608, -13064, -9132, 16964, 4484, 26443, 24254, 13879, 3890, 40010, 49035, 30855, 10150, -33031, -15336, 14465, -5782, -10243, -5031, -15466, -25505, -54438, -50743, -38660, -30188, -12836, 2415, 13212, 16623, 605, -8103, -22411, -41090, -43735, -37290, -17361, -19571, -13890, -19679, -14502, -36148, -29889, -580, -12613, 350, -11551, -36235, -43532, -3471, 14709, 543, -14295, 319, 476, 8383, -18044, -32647, -58516, -39455, -30097, -59288, -58032, -34909, -8797, -20815, -15667, -5409, 14303, 9396, 2811, 7557, -11173, -154, 18459, -10157, -7207, -10444, -13856, -17302, -17184, -26945, -23084]
15102b3084K0068q620j3748j1474k4331O538O68J1698N269J2635k00K54J9579
15089d748p532r39L622j5380N256J0991K2927p322n468K8336k0746j0017J3189
15076A2169l644J1451j3881m2925m239L1663j522J6623O714L801J0646Q741P989
15063D3586j2120l4694k1981j3607j4085J5665M2115K5118J044m0231k0099J7165
15051a2124q37K3686L784k1816J0022K1663K7286R943L905l0037p954j1576j614
15038A4331j2365q871L5103J1213l2728o701J8558p776j8898j6616J938K9856
15026G044J1949j9020j654P37J012M451R221m554k0160l744J8732k5370j2710
15013c4066M777J9919J3755K0623k695K008k231K0114K9868Q569J156L1141Q8527
$$ y = [-23084, -3016, -11636, -25384, -36858, -61189, -54651, -53983, -42285, -37016, -24381, -24581, -24327, -4748, -12280, -13219, -9597, -24977, -19721, -8730, 14197, 6875, 1407, 29743, 8997, -1020, 12169, 8525, 19976, 6095, -36830, -41069, -9406, -10928, 5695, 12409, 16210, 26856, 35597, 43586, 31466, -3228, -25209, -38816, -52901, -37236, 4879, 29997, 31041, -9190, -29289, -12124, -12961, 10725, 14509, -7307, 2715, 24378, 51664, 61607, 65512, 35475, 27521, 15945, 14331, 1966, -6905, 28198, 39411, 6683, -18, 18540, 10764, -8134, -24750, -22812, 7044, 18993, -27, -1681, -944, 68, 4519, 13740, 9186, -10974, -14718, 4014, -21356, -34066, -29289, -9370, 4385, 25008, 22313, 24321, 22090, 42204, 72072, 80641, 81797, 112938, 201465]
15000B01465J29570J74170J68354M3886j4607K5673N7076j3693k27019j96558
14990C48317j07524n7443k2045n336J640j9751n8710r701J1673P498r165p701
14978G1752j3863N631k1971m3068j6342J169J0372P183R830K5718J710p256k323
14965B8542J6098P916j1125k2003k0009l0931N722M9649K4655K7041J8378l3947
14953E9986l9518q412k762l0431r030K2426M3402l2774l3549m966q76N580K5688
14940e236J1195j0489j6325j1229J5830J4948L4426N145Q105l9655m1663M241
14928c0707L2595K7818J4047l54m7412j8167m873O083J2427J6203j1884J1622
14916G398J7901J4582J8417L781j1855j6237J2155k6772k2909j9081k644k8646
$$ y = [201465, 331035, 505205, 673559, 717445, 702838, 728511, 785587, 771894, 544875, 348317, 240793, 183350, 161305, 155969, 157609, 137858, 79148, 69447, 81120, 88618, 79453, 71752, 57889, 63520, 41549, -1519, -17861, -16692, -6320, 863, 10693, 36411, 38121, 30865, 28542, 44640, 52556, 41431, 19428, -581, -31512, -25790, 23859, 48514, 75555, 93933, 59986, 20468, 12056, 9294, -21137, -30167, -7741, 35661, 2887, -30662, -35628, -36504, -30924, -5236, 5959, -4530, -20855, -32084, -16254, -1306, 33120, 38265, 46370, 6715, -34948, -30707, 1888, 29706, 43753, 43399, -4013, -22180, -27053, -20970, -8543, 7660, -4224, 7398, 25299, 39881, 58298, 62079, 50224, 33987, 46142, 19370, -3539, -22620, -25264, -53910]
14904e3910q497K1459J2942k7053J014L5482J0254K7300J9578O530j8336j5697
14892A1066L606l574m5173k4933l33k314J3310Q203J9763k2834M836K8406J8000
14879H029M022j2619k943r154K2669L4090O695l3423j3960l401j250K7843K3738
14866E0336j3895R988K486j4289l7929j1141K2245o111k7618j4173K967J9513
14854a7621m835J6j3711m1455L8333j0902k25L3658K3120J2189L209l1564j1982
14841b1770k8947k6211K345K2890j169J5641J0823K757j468L088l6467j2592N905
14828f5175J7016q539L475K5320k404R288J8406J0380P539K1374m4700k6187k7590
14815f1797K6712L1646L1123R911j8959j1995p04j4127k0681j0061j998k425J718
$$ y = [-53910, -62407, -40948, -28006, -55059, -54045, -18563, -8309, 18991, 38569, 45099, 26763, 11066, 14672, 11098, -34075, -59008, -59341, -61655, -48345, -40142, -20379, -43213, -38377, -9971, 8029, 12051, -568, -3511, -12665, 10004, 44094, 50789, 17366, 3406, 5, -1245, 26598, 50336, 36441, 46429, 48915, 34626, -3303, -14444, 7801, 1690, -25928, -40101, -37134, -17621, -22456, -22440, -36151, -77606, -39273, -50175, -50400, -16742, 6378, 18567, 21776, -9788, -21770, -50717, -76928, -74583, -51693, -52862, -37221, -26398, -23641, -25109, -22021, -58488, -71080, -65175, -48159, -56698, -53223, -27903, -30307, -21019, -2613, 7767, 15306, 36680, -8020, -34207, -61797, -35085, -3439, 27684, 37595, 18636, 6641, 5937, -8190, -28871, -38932, -40930, -43355, -41637]
14802d1637N847k781M464J3957L0776K5936q098N411j1079l8229J0281K8481q038
14789A5291l2456j4491K0155K4716Q024n4648q358J8929J9331r299K067L776J046
14776e917k2314J9780K8094L554J0762l2066j3794J7285o124j9424n104J6495
14764h773j1745r030J7712M064J0065j0205j70K1140j2014k8617j8427K4040J2138
14751i822j8759J0700J4434J2725J8177J739j4291j6579J1000J0837M971k6316
14739a184l606k1111Q399j7166l2352J305J3003J3126J1734J3133J2929J977K1536
14726B1723k101q400r003k9345q303J9205K1831J3286K7302k0836k5810j0501
14714a0952J7680K5233j2456n509j3200L4856l099k8079k973j5151l3917K6648
$$ y = [-41637, -35790, -38571, -34107, -20150, 10626, 36562, 28464, 33875, 22796, -15433, -5152, 23329, 15291, -17165, -31656, -11501, 13215, 21239, -33409, -41767, -22838, -3507, -12806, -10739, -6963, -5917, -28231, -8451, 19643, 23197, 33959, 1893, -11901, 5384, -740, -20164, -25268, -8773, -20518, -29548, -11836, -7772, 2293, -7912, -8082, 13058, 1044, -27573, -46000, -21960, -9822, -28581, -17881, -3447, 9278, 27455, 29194, 14903, -1676, 9324, 20161, 25132, -1184, -4790, -25901, -17502, -34668, -67020, -65715, -52712, -39586, -27852, -14719, -1790, 187, 21723, 19622, 11222, 2219, -27126, -35429, -16224, 5607, 18893, 46195, 25359, -451, -10952, 6728, 31961, 19505, 13996, 796, 35652, 32553, 4474, 1501, -13650, -47567, -20919]
14702b0919J7554j0479J8141P390n684j2733K030K2493k0437n405Q178o91K343
14689A781K1485J5439j4780j4328O124J3222l305j113j6355q491j5489p272j2095
14676c5177j4621m582J675L3664J2782J6678m4349O830R20M322J3662j8918J7235
14663i879K8721j4692k7811k8610L422L6149K5799J4641k4596j2211Q068p936
14651h935J8259K1758J0400r426p879K183K551m799j7823l1885K0904K4669j5661
14638D316J1810R828K939J4184m108N476j8798j4530N402o93M838j8757p94P31
14624A844j4939k9696o97L4090j7725j6284R708L4697L7846n357l0912o252K8519
14611B4842j2774k4607N171K8997r711r031M814j7370k1166J595L981J1914M916
$$ y = [-20919, -3365, -13844, 4297, 11687, 6003, -6730, -4700, 17793, -2644, -8049, 129, -562, 1781, 23266, 38705, 23925, 9597, 15721, 28943, 25638, 24525, 8170, -321, -15810, -23082, -35177, -49798, -54380, -52705, -19041, -6259, 10419, -33930, -27100, -26180, -21858, -8196, -27114, -9879, 18842, 4150, -23661, -52271, -48849, -12700, 13099, 27740, 3144, -9067, -999, -8935, 9324, 31082, 41482, 32056, 24177, 26360, 28911, 24112, 6289, -25596, -4692, 19977, 4316, 16126, 25954, 28893, 43077, 38969, 44445, 25647, 11117, 16519, 15826, 20664, 1907, 1113, 1844, -13095, -42791, -43488, -9398, -27123, -43407, -33699, 998, 38844, 33487, 2575, -3677, 24842, 12068, -12539, -7368, 21629, 11918, 2887, 7701, -9669, -30835, -29240, -25259, -13345, -8429]
14598h429O529j1487j0847K118p49n406Q597j1296j070K9629j1502J039k3602
14585c6476J6376J2340j5894K9261l357j5228q269K17k427l342L3340L7096r719
14572C3918l5173k4229l95L3117k2958j7925Q961K9396L601k379J4039J2131j3757
14559A8347k0368j2579L27n679K2458P663j4301l2548j8369j3327R530P262J8950
14546c2634N3955J0317k813j2042P059N412j4388j5773j0294K8470L2653l539
14534D6383k0591j3301m764J3435L305j274k9966n196J7678o905L269K546K667
14521G286L461O367l7835l6933O746K0622P806J7067J7410k8263k4137K0212j0363
14508c0554J586k613J4553l726L3026L0481k907j0676l5080j2166r486K107K092
$$ y = [-8429, -1900, -13387, -24234, -22116, -22865, -28271, -19674, -30970, -32040, -2411, -13913, -12874, -36476, -20100, -7760, -23654, 5607, 2250, -12978, -21247, -21030, -23457, -26799, 6541, 43637, 33918, -1255, -25484, -25879, 7238, -15720, -33645, -24684, 4712, 8313, 5934, 19973, 32104, 18347, -2021, -14600, -14273, -19952, 2506, 10169, -4132, -36680, -55049, -68376, -58846, -51584, -32634, 21321, 31638, 28825, 16783, 23842, 29254, 14866, -907, -11201, 17269, 49922, 46383, 25792, 12491, 7727, 21162, 24467, 23193, -6773, -11969, 5709, -1196, 2073, 4619, 7286, 10747, 17114, -20721, -57654, -50908, -30286, -22480, -5413, 11997, -16266, -40403, -20191, -30554, -28968, -31581, -17028, -20754, 12272, 42753, 39846, 29170, -5910, -18076, -27562, -25455, -23363]
14495b3363K5169J7175l663j8684k515k5937J1265J6436o983l0596K783L3828
14483e085K099p97o990k998q385K516l60M847m39N571J713k9k6398p96K1619j00
14467a4012J0049M8463j4259o696Q05r369m9145j2519K2913L855K8196L896j7130
14454d953r088Q589N838q932j926j2111j8715J7607L8354j3036O09K0731j265
14441B1702j4088j2890m351l6120K7599l77j111P167j9683N215J1241o409q980
14428c1085L508l0402M339K0087Q957J3281K1716P0r920j9470P502J1262K0365
14415B0210j0816k2645L237M551k6710q972j7593K6916L5112K6689j6496k2551
14403i068J6402M475j0746K986r087k2166r787J7647J1714J4729J3438j3772r326
$$ y = [-23363, 1806, 18981, 15318, -3366, -5881, -31818, -20553, -4117, -11100, -41696, -38913, -5085, -2986, -3783, -10773, -13771, -22156, -19640, -20000, -15153, -15592, -10021, -8308, -8337, -34735, -35531, -13912, -14012, -3963, 44500, 30241, 23545, 24350, 14981, -34164, -46683, -23770, -19915, 8281, 12177, -4953, -14041, -5452, 386, -8546, -10472, -22583, -41298, -23691, 14663, 1627, 2236, 22967, 21702, 7614, -5276, -9627, -45747, -18148, -18525, -19636, -12469, -32152, -26937, -15696, -22105, -31085, -27577, -57979, -53640, -33553, -24596, -11315, 10401, 10471, 551, -18919, -11417, -155, 20210, 9394, -13251, -10014, -5463, -32173, -41145, -58738, -31822, 3290, 29979, 13483, -9068, 7334, 11809, 1063, 4049, -5038, -27204, -36991, -19344, -7630, 7099, 20537, 6765, -2561]
14390b561J7138k0461l3908j0616o352J9466J1451M956n602J2648K144L1904J0255
14377C0462m0685J59p5R355K2941J4115k697p207J6610j0659k8846R064q899q391
14363d753j0768R054O287M903k2018k5930L003J5906J2811k8558j1234M738L2943
14350a3616j0878j2654K3778K547l7231J9005J4089j2288r496M3106M112j1791
14338a317j874n071k3115l093j7544J979K8655k2081O640q600k2300O595K1746
14325c9380K5075j7686j9149k9997J156R013K0471L205J2281j0623j9074J9710
14313d4998J5902l171K1836K1387J4924l5520k6140L8095J3944M276O679l0896
14301c682k8835J661J7492J2744J8334K4060r725o407j1006k5986N315L789m222
$$ y = [-2561, 14577, -5884, -39792, -50408, -56760, -37294, -25843, -20887, -26489, -13841, -11697, 20207, 30462, -10223, -10064, -10139, -784, 22157, 36272, 33575, 26368, 42978, 32319, 3473, 12537, 3638, -4753, -15521, -6467, -180, 4723, -17295, -43225, -40222, -24316, -11505, -40063, -51297, -46559, -13616, -24494, -37148, -13370, -10823, -48054, -29049, -14960, -27248, -36744, 6362, 10474, -1317, -3191, -8262, -31377, -34470, -52014, -50035, -21380, -43461, -36821, -45421, -67721, -61126, -39380, -14305, -31991, -51140, -81137, -79981, -70968, -50497, -47292, -35011, -45634, -64708, -44998, -29096, -32267, -10431, 10956, 25880, -9640, -35780, 2315, 16259, 20535, 27214, -3682, -32517, -30856, -13364, -620, 17714, 41774, 32049, 25642, 14636, -11350, -6035, -2246, -6468]
14288f468k3613j36j3041p486K5361L9023l296j8784j3323L577l943K4487J6859
14275A9217M250j2653j5971k626p94j9665j6342K1147J218J3666M8108J6261k3078
14262C2738l5272L3856L2607k0571k9129J8971l568j1284K4469O615j6045J5332
14250D8719l4647l5651j7284J7737K5412l369j7568J1375l874j2120K0949O313
14238E992k0965J3501j027k893J3121k136J009O786n203j440l445P178M793j017
14224A4254m473J7672L4128R496o133J5045R055k1337R616J9179j0683j5270l2104
14211C8445p461j48l5252L918N9887j8306m4370J0934J677j6638r965P421r126
14198a8984K8650K8032o960k2979m328j1432k9978K2034J6346O300k5052k4902
$$ y = [-6468, -30081, -30217, -43258, -50744, -25383, 13640, 10344, -8440, -21763, -18186, -22129, 2358, 19217, 23467, 10814, -5157, -7783, -8577, -28242, -44584, -23437, -22219, -8553, 39555, 55816, 32738, -2534, 31322, 63929, 43358, 14229, 33200, 29632, 18348, 42817, 49432, 33387, 48719, 14072, -21579, -38863, -21126, 4286, 917, -16651, -5276, -9150, -21270, -321, 5992, -14973, -1472, -2499, -5392, 7729, 5593, 6602, 13388, 8185, 6745, 3300, 10478, 15271, 14254, 9781, 27453, 61581, 71077, 64944, 79989, 89044, 67707, 77323, 96502, 85819, 70549, 38445, 30984, 30836, -4416, -498, 59389, 41083, -3287, 7647, 9324, -7314, -17279, -9858, -18984, 9666, 37698, 30738, 7759, 3431, -8001, -37979, -15945, 401, 6701, -18351, -43253]
14186d3253J1679J6497L1074J1733m1049q771o082p749o350J5707J2850J9307
14174E593N606l1482j2488P955J4450M343j325R2K0038J1496j7703k7923J0364
14161a0984j777Q926N244j2352q542o167J4574n554j7238j3230J1333L1502J1677
14148G412P97J2856j097l60J1448O171n425o716j2570k665j6167k8400j1205L484
14134d2437l1164L6973K8651j4605j2897j074P466r242R957k0050M180M5457Q677
14121I892r730j2532J812o11k7501N259j0224j388K1166J0274m83k9456K522L4248
14107f752J6839M49k0896p87L5520P605j0462r372l7321J6038K8193q813P547
14094A7788L9085k7661l0102k7935j1908J7055R906J0569J4631J2899OK358k4567
$$ y = [-43253, -31574, -15077, 15997, 27730, -13319, -22090, -28172, -35921, -42271, -26564, -13714, 5593, 11199, -20283, -32771, -24816, -10366, -6023, -7348, -7256, 12782, 24278, 6575, -21348, -10984, -12761, -3835, 1409, -10943, -19485, -25652, -11078, -16632, -33870, -47100, -35767, -4265, 7412, 8209, 21065, 19968, 19608, 31056, 37227, 31802, 25086, 12516, 9851, -6316, -34716, -45921, -42437, -73601, -36628, -7977, -22582, -35479, -36553, -29087, -38329, -28372, -48422, -44242, 1215, 9892, 162, -12370, -10558, -11169, -38670, -33411, -43635, -45023, -23857, -13583, -14066, -43522, -41000, -6752, 10087, 10536, -10360, -11147, 24373, 31978, 21516, 12144, -25177, -9139, 19054, 10241, 17788, 56873, 29212, -890, -28825, -40733, -23678, -13772, -3203, 11428, 24327, 24333, 26691, 2124]
14081B124k1087K3060J6348k1505j8515K4887j0225j4118m392l531J237L965j2070
14068c3822J6925k851q437M52o30k376J6182P122j1414P485j9208p706q012j444
14054d7734k2178M887L5582K0824J5390o237j6808j1802o991N492P713K5203J6671
14041B0012m990J459j6858J9857l4069j0114K0605q798l2600k888R060L0041J3507
14028D224r080K6661N590j3827r052j1302j6165k1526j7539J4351K2820r971M719
14015c0097K9182j6447j3762j3756j7239k6J5510L0394J8251J6384k9461k3235
14003c4302L491R853j7842j0166J9776k3493k6110K2132L230L3452J2739r178
13991a6418O672J4251p931k1892k0073K1974L3743K235n369l3182q923J8207L0335
$$ y = [2124, -18963, 4097, 20445, -1060, -19575, 5312, -4913, -19031, -23423, -26954, -25717, -21752, -33822, -16897, -19748, -28185, -27733, -28363, -30739, -14557, -7435, -18849, -11364, -30572, -38278, -46290, -47734, -69912, -65025, -29443, -8619, 6771, 534, -16274, -28076, -35067, -29575, -21862, 3341, 20012, 15022, 16481, -377, 19480, -14589, -24703, -4098, -12896, -45496, -48384, -39324, -9283, 4224, -4856, 21805, 27395, 13568, 4516, -6786, -22951, -44477, -62016, -47665, -24845, -34816, -30097, -915, -17362, -31124, -44880, -62119, -62145, -46635, -16241, 2010, 18394, -11067, -34302, -30811, -20958, -38800, -48966, -29190, -52683, -78793, -56661, -53431, -19979, -7240, -16418, -9746, 4505, -3426, -25318, -45391, -23417, 10326, 12561, 7192, -25990, -34913, -16706, 13629]
13978A3629r203L008J3555J1628n873Q797j2376l6453M346M1391J5310j946j4623
13965C1190k472K5065M1941N9543j1369m226M066K9408L8183L241k0161k3614
13953A70795j2348P191j4726l6033k2032l030N889j109j5452k8985j786j8607
13941B9767j5185j6138n541r916R916j2702R5R689O437q825o218j7826m7911J145
13927h3213K0669M2086J1411k4023J9598K9598L0619r700j6636J0113j9781j2357
13915a616J5722K3995p59k8295k696P109J7296L764j5431L680k2203k4889K657
13902b1666P157j2301J5509l126l6752j5521p385K3013L2819J0392k9230K5160
13890a1931R770p241N713N090Q251K084j6982J100n167j2509P205J9470j3686
$$ y = [13629, 4426, 7434, 20989, 32617, 26744, 35541, 23165, -13288, -8942, 32449, 47759, 45813, 31190, 28718, 53783, 95724, 155267, 143898, 139672, 143738, 173146, 211329, 214570, 194409, 170795, 158447, 165638, 150912, 114879, 92847, 89817, 95706, 94597, 79145, 50160, 48374, 29767, 14582, -1556, -7097, -17013, -7097, -19799, -19704, -10015, -3578, -12403, -18621, -36447, -84358, -83213, -62544, -20458, -9047, -33070, -13472, 16126, 46745, 37045, 20409, 30522, 10741, -1616, 14106, 38101, 37342, 9047, 6351, 13460, 30756, 34520, 19089, 22769, 566, -24323, -21666, -14509, -26810, -11301, -14427, -51179, -66700, -74085, -51072, -18253, -7861, -37091, -11931, -2161, -9402, -3689, 1401, 9652, 11736, -5246, -4146, -9313, -21822, -14617, 4853, -8833]
13877h833n116Q26r7J5952R540j9051J8578k7385j5728K183o765j0348J6519K3649
13863f076j9521j7989L6432K0766q705l662J5858L4534Q644k9348k0129k1498
13851a0694n146k826O579j0250k4950j3703K2888L0457L517k3767K0805L384m991
13838h697r710J1429J2348J7795l605j171k343o469r867j1440R996l4377l458
13825c9569J4488j5333J8058O754K7482o385j7272J2492J2031p6l0787l2114l158
13812e3389L1335K6280J4492k7350n3315K91K5608J4207J4477k0345o329l366
13800c7404j9136O185J5377J5506K1885J9046J1104k0748j0999J9297l339k3238
13788f464j417l0372l5455K009K2997M2757K962k2517j4321M992L620k3075Q761
$$ y = [-8833, -13949, -13123, -13220, 2732, 12272, -6779, 11799, -15586, -31314, -29131, -35896, -46244, -29725, -6076, -25597, -43586, -7154, 13612, 4907, 1245, 17103, 51637, 60281, 30933, 10804, -10694, -15840, -18666, -12087, -22337, -47287, -60990, -38102, -7645, -4128, -27895, -7090, -3706, -8697, -18407, -6978, 5370, 23165, 19560, 18389, 16046, 9577, -290, -11730, -1734, -36111, -39569, -25081, -40414, -22356, -15602, 11880, 5495, -11777, 715, 12746, 12670, -18117, -50231, -53389, -22054, 4226, 18718, -8632, -61947, -61656, -36048, -21841, -7364, -27709, -34038, -37404, -56540, -50355, -34978, -19472, 2413, 21459, 32563, 11815, 816, 20113, 16774, -6464, -7881, -38253, -73708, -71699, -48702, -5945, -2983, -25500, -39821, -34829, -31209, -54284, -45523]
13775d5523K9137j2778J2123r054J904J9617J3519K7250l5568m5201q508J7968
13763c5114J2165L2139k63k5858l4682j1000Q475k1559J6691M0423J3756K6073
13751B1246k6427J069j626m507J2602Q441K750L180J492P267J3009k3367k8547
13738a3418M225r096o60j5663o722N500K9932K8337o385j4485j1299m784J1107
13725c411J2900J9425q022k1963N632r279o097n418q563L3171P628l2626l5779
13712e2402K5093K1253N357k4015N831J3677j2251o685L1735J1063R18p952r611
13699B011r958m866J3176j8839l5564j2897L9438J0277M529J9486p516j3478K3226
13686I025J3603j489L327r08o857J596R637M004j4718r501m773K0952k562o932
$$ y = [-45523, -16386, -29164, -17041, -26095, -24191, -4574, 8945, 36195, 627, -44574, -53082, -35114, -22949, 9190, 8927, -16931, -51613, -62613, -54138, -75697, -59006, -18583, -4827, 21246, -5181, -4112, -5738, -10245, 2357, 10798, 13548, 16728, 18220, 25487, 38496, 15129, -13418, -9193, -18289, -18949, -34612, -41334, -35834, -5902, 22435, 16050, 1565, -9734, -14518, -3411, 9489, 28914, 20892, -1071, 4561, -4718, -10815, -16233, -24796, 8375, 16003, -16623, -52402, -27309, -6056, -699, -24714, -18883, -5206, -17457, -24142, 7593, 18656, 19574, 11622, 2011, -7947, -12813, 363, -18476, -54040, -66937, -27499, -17222, -12693, 6793, -723, -14201, 9025, 22628, 21139, 24466, 23558, 16701, 18297, 27934, 31938, 17220, 7719, 2946, 23898, 21336, 14404]
13672A4404P287P689N050p599j2150j3613Q766L575J2402J2435K0130l0374l3628
13659e626j834Q975J1315J4117k052j094j3142j5324M5734J2544j0333K4666k8382
13646C9564k7524J1659M758P827q327M64j218k1149m500o589j7362k3479O463
13633c9413P3093N559j0251j8782L1802M227j2304l272j8756P4o64k4124N249
13620g562k181J5570K2704K8398r240k3516m1830J0915J7504q420L4113p104l104
13607B6247j0015m941J3796R153o945J0413j0646j5536j5879L736j066j0415J7171
13594E073P137L0869O492o953j6939k874l4264l5966k2304J2851K3585M3878o433
13581D152l755J2786J4082O32l8571J2622K7212J5185p035j9253k2323K1487J9236
$$ y = [14404, 21691, 29380, 34430, 26831, 14681, 1068, 9834, 13409, 25811, 38246, 58376, 28002, -5626, -7460, 1515, 12830, 26947, 24895, 23801, 10659, -4665, 41069, 53613, 43280, 67946, 39564, 12040, 23699, 28457, 36284, 27957, 28421, 27203, 6054, 1554, -5035, -22397, -45876, -39413, 33680, 39239, 28988, 10206, 42008, 46235, 33931, 30659, 11903, 11977, 11313, -12811, -7562, -9743, 5827, 28531, 56929, 47689, 24173, -17657, -6742, 10762, 2342, 36455, 29351, 26247, 16232, 11291, 25087, 34240, 27295, 37708, 27062, 11526, -4353, -617, -1683, -12098, 5073, 12210, 43079, 49571, 42618, 25679, 22805, -11459, -47425, -69729, -56878, -33293, 10585, 4152, 397, 13183, 27265, 27897, -10674, 1948, 29160, 44345, 37310, 18057, -4266, 17221, 36457]
13568C6457L593p542j0658k3213N978j3574r653N096P106J5693L1821r401k4879
13555F824k9385j98n460k1086J1006m289J2429N493L944K4109J9437j2010r129
13542A685R298k0534k811P652l7781j9236L5628J2355j0781N698J6689K4159k0253
13529A768q171J5794q507J024k799k2122l3207l249k478J0509J0763J1559k2250
13516e1366l44L0429J7216j201r799l0804N800K7439J6827q393j2021k301J356
13503a7162m954J1123K3782p06N629j5478l4231j5717l660K6130J6181K3042J899
13490A5878J1406r778j2817J1859j7684N430j2327n306p950J3084n040o285L486
13477a6044n449R040K4944j6480k9325Q095J3656O490J0099N260j2574m9019m123
$$ y = [36457, 40050, 32508, 21850, -1363, 4615, -8959, -18612, -13516, -6410, 9283, 41104, 31703, 6824, -22561, -22759, -28219, -49305, -38299, -42588, -30159, -24666, -20722, 3387, 22824, 10814, 1685, 10983, -9551, -12362, -4710, -42491, -61727, -26099, -13744, -24525, -18827, -2138, 22021, 1768, -6403, 9391, 884, 1908, -891, -23013, -56220, -59469, -61947, -51438, -40675, -29116, -51366, -51710, -21281, -4065, -5266, -15065, -45869, -40069, -12630, 4197, -4196, -16217, -18518, -17162, -22116, -10993, 12789, 12083, 17712, 2234, -31997, -47714, -51374, -25244, -9063, 13979, 15878, 27284, 17506, 4689, 16548, -1136, 4294, -8033, -13339, -21289, -8205, -13245, -19530, -16044, -21493, -12453, 12491, -3989, -33314, -25219, -11563, -5073, 5026, 10286, -2288, -51307, -55430]
13464e5430J1057J0381J3900K7733J0825k4686l0841k7586P517K4665m901r704
13452d7070k8941o406K0118K909Q373J49r675q800R014Q361J0731k7322k2523
13439i1082L1453N0221N866J144l6385M250L5768J4810n681j4369J4003q041J0281
13426A2238O739j2374k5928j0098o975M7360J6371k6401j6689K533J2270J8324
13414A7370M25j6338k1823K2679K0975q023p574l591k0858j8702q148N019J6698
13401b1891J5638L2470k1800l3690J1221L98M809l605j2396k349J0313M151L200
13388a3531L33J3434r639J8932m165l5626L709J0957J7338P018m716J2340l011
13375A3373p585j4190L043N755O015J4419Q539P114n884q754J341K2907P870L695
$$ y = [-55430, -44373, -33992, -20092, 7641, 18466, -6220, -37061, -64647, -57130, -32465, -37366, -47070, -76011, -82417, -62299, -59390, -51017, -50868, -60543, -69343, -60329, -51968, -41237, -68559, -91082, -59629, -9408, -3542, -2398, -38783, -34533, 1235, 16045, 10364, -4005, 9998, 1957, 12238, 18977, 6603, -19325, -29423, -36398, 10962, 27333, 932, -15757, -13224, -954, 17370, 17795, 1457, -20366, 2313, 23288, 15265, 7691, 4100, -16758, -35460, -43608, -38589, -21891, -6253, 26217, 4417, -29273, -18052, -17654, -12845, -16450, -28846, -31195, -20882, -16731, -13531, -13198, 236, -9403, 9529, 5364, -30262, -26553, -15596, 1742, 8760, 4044, 16384, 13373, 5788, -8402, -5359, 396, 6411, 20830, 29369, 36483, 30599, 21845, 23186, 46093, 53963, 57658]
13361E7658k1817J313K7844K5925R121O53k1662J1095r357k2963j8970k0268K023
13348B0595K3799L008k4101j3781j634j4694r178R333k737K3401l666J8418p382
13335B1381P323j0169k0629l021J9531J4435L042p964J7314q528J2280J7401M71
13322F2867k3894j2225j0265O628l106j8098j5128r71p289K0278J3728j1852K1394
13309B2067K8816r570J1820J5652m418j7773l2146L498k6114NJ2179R754q574
13296E196j7770p306j9813J6373J7327K0852J8069j5369l373R762K1923J0035
13284E5906m4684O198L1j0572M0455q349o424j9009K1370N433O381j0974M221
13271C9983J8030p920O177j6971j8861j1652k1055L0530J9289J1594M1038r628
$$ y = [57658, 35841, 37154, 64998, 90923, 100044, 100697, 79035, 90130, 80773, 57810, 38840, 18572, 20595, 44394, 47402, 23301, 9520, 7886, -6808, -15986, -6653, -9390, 14011, 10345, 28763, 21381, 28704, 18535, -2094, -5115, 14416, 28851, 31893, 23929, 41243, 32715, 44995, 62396, 62867, 38973, 26748, 16483, 23111, 20005, 1907, -13221, -14192, -21481, -1203, 12525, 673, 22067, 50883, 41313, 53133, 68785, 64367, 46594, 14448, 17946, -8168, -8163, 4016, 13770, 5196, -12574, -19880, -39693, -23320, -5993, 14859, 32928, 17559, 14186, 23948, 45871, 55906, 11222, 17420, 17451, 6879, 47334, 38985, 32561, 13552, 34922, 40355, 46736, 35762, 39983, 58013, 50093, 56270, 39299, 20438, 8786, -12269, 18261, 37550, 49144, 90182, 80554]
13259H0554k7026r631Q544j2765j8589j6888J6658J2852k0625m3937J9405o330
13247a7778Q412R753O145K525k7267l1371J6552l55J4321j2073J7192O217j2062
13234a9789l14P886L919N0922L1791r195p21J582l4189l5682q188r231k3568K0157
13220b4620K4592p864j9062N168o605m934O06J2149K7808L0708Q062r051l1696
13207E261m40J9088o288k1854L3946K8716p150j5605j8012o554K6877j3112j9762
13194E111J375l5073o018K1487J1199o822N820k1783P314J1151K218J0646j6287
13181i662M306J979J1640j7460J2455K4829L616P178K3908k087p62m9663q386
13168A891k0073N048M986R573j0425M462J6438j5639l686k424j6527N897l27J0477
$$ y = [80554, 53528, 43897, 52441, 39676, 21087, 4199, 20857, 33709, 13084, -30853, -11448, -17778, -9366, 387, 6532, 9057, -18210, -49581, -33029, -33384, -19063, -31136, -13944, -7727, -19789, -20103, -12217, -8298, 42624, 74415, 65220, 64499, 66081, 31892, -3790, -11978, -21209, -44777, -24620, -28, -7892, -26954, -21786, -28391, -33325, -32719, -20570, 7238, 37946, 46008, 36957, 5261, 4821, 23909, 17621, -4233, 29713, 58429, 51279, 35674, 17662, 11108, 37985, 24873, 5111, 6486, -28587, -34605, -13118, -1919, -8741, -2921, -24704, -17390, -6239, -4021, 6625, -9662, -5356, -3377, 8263, -9197, 3258, 28087, 31703, 38881, 62789, 60702, 59940, 10277, 1891, -18182, -13134, -8148, 1425, -9000, -4538, 11900, -3739, -7425, -9849, -26376, -20479, -20806, -10329]
13154a0329J587k7515K3121K3650J8533j0404k135j1905P452J1803J736p752k5888
13141h046j9959J3295K4958n414l5782L1516K9196r834L2693J1834m7416n024
13129A2017J5472p47J1019K6484K7905j8214j1722Q61j1488l3888q517j0906R996
13116H272J7876J4709K8605M1110L5741L1513K3754J983l3950Q644J2337K2364
13104B12958N005j7537n4438n0874r14R089K550j1844P093n528J4838M674J6634
13091A31706o944L0013K8721j4526K3388P6073N6480M2296M2626L9521R955j0565
13079D48744k0361l0445k6694j7881L69k9819m0890l0190k606j4638r572k5626
13067B00391m0736j5121J3615J9697L081j3823L519Q247l628K0407L7886M6889
$$ y = [-10329, -8742, -36257, -13136, 10514, 29047, 18643, 16508, 4603, 12055, 23858, 25594, 17842, -8046, -28005, -14710, 10248, 4834, -30948, 568, 29764, 19930, 52623, 64457, 17041, 12017, 27489, 26742, 37761, 64245, 92150, 73936, 62214, 63075, 51587, 17699, 9182, -1724, 8272, 26148, 40857, 69462, 110572, 146313, 177826, 201580, 203563, 169613, 178257, 190594, 212958, 217963, 200426, 145988, 95114, 94200, 103289, 105839, 93995, 101088, 95560, 110398, 115072, 131706, 124762, 154775, 183496, 168970, 192358, 268431, 324911, 367207, 409833, 449354, 459309, 448744, 428383, 397938, 371244, 353363, 353732, 323913, 283023, 252833, 250227, 235589, 226017, 200391, 159655, 144534, 158149, 177846, 180927, 167104, 170623, 178870, 175242, 195649, 233535, 280424]
13055B80424M7727M9446M2653J9251n071P933j2866m4805o2442n6831o0971k3058
13043A81390k1027l6269j9847Q750Rk3002n996k4314M928r650L77j1553n794m831
13029C3171J7680L2824K5132K2228j055m0060l6744r971J471o044m840j151L820
13016C6461O111m850O746M413j6298k3072j2090j3866O868K3886L792J1780M088
13003C3969k1930k0483j392M958Q199l6479J3001k539j079j976J9355J3939M0183
12990D7726J4820J3687k2482m4972o677K244m390r724K4517K7680l800q235K4784
12977E5178j5868k7034r156M77P98L3593l81j1115K2035l599j8289j5184P461
12964A8916m201m522j9703K4185L2258r858j8347J9050K6859R571j4777O49L0715
$$ y = [280424, 328151, 377597, 420250, 439501, 434430, 442363, 429497, 384692, 322250, 265419, 204448, 181390, 160363, 124094, 104247, 112997, 113006, 90004, 84008, 59694, 64622, 54972, 55349, 43796, 38002, 33171, 50851, 83675, 108807, 131035, 129980, 89920, 53176, 43205, 44676, 38632, 33792, 32641, 36461, 42572, 37722, 44468, 48881, 32583, 9511, -2579, -16445, -9577, 14309, 18101, 29881, 33969, 12039, -8444, -9836, -4878, 3321, -33158, -20157, -22696, -23775, -25751, -6396, 7543, 47726, 62546, 76233, 53751, 8779, 2102, 4346, -44, -9768, 14749, 42429, 38629, 30394, 55178, 39310, 12276, 3120, 3597, 4395, 37988, 37607, 26492, 48527, 44928, 26639, 11455, 18916, 14715, 10193, -9510, 14675, 46933, 37075, 18728, 37778, 64637, 74208, 59431, 60080, 90795]
12951I0795J5406Q968N980Q691K907K9969L9258M8986O2958P4276O0911J04013
12939E53118J00461P9892P4975R7870R4615M9706k723j1254l2850p2919j03262
12928H27629j08193r8153q5595q0048m8463k3634n0566n2328l8221r871j8662
12917B13895j4916n292n1253j7444J8784j561J8127k8430j7827P821K3081j3245
12905A31740j585m951k9509j3899R928p324j0573j4549j6030k328L4085J7481
12893I2486Q034j8122m206m5549k1591K3828L1189K5142K0607j4223K480N2123
12881A52198J9734O82L1749M9974L9084M1359K7398L1195L2165J7389j0278j5152
12869D17497m1245p0610n0807k4398k0705k4529l1688J0375J5982J88J051j2564
$$ y = [90795, 106201, 115169, 121149, 129840, 132747, 162716, 201974, 250960, 313918, 388194, 449105, 553118, 653579, 733471, 808446, 906316, 1000931, 1050637, 1047914, 1036660, 1003810, 930891, 827629, 719436, 621283, 535688, 455640, 407177, 383543, 332977, 280649, 242428, 232557, 213895, 198979, 193687, 142434, 124990, 143774, 142213, 160340, 131910, 114083, 121904, 144985, 131740, 130155, 125204, 95695, 81796, 91724, 84400, 73827, 59278, 43248, 40920, 75005, 92486, 100520, 82398, 78192, 32643, 11052, 34880, 66069, 91211, 111818, 97595, 100075, 152198, 171932, 172614, 204363, 254337, 293421, 334780, 362178, 393373, 425538, 442927, 432649, 417497, 376252, 305642, 254835, 230437, 209732, 185203, 153515, 163890, 179872, 180060, 181111, 168547]
12857A68547q857n343J0562L1588K3221J8599L2793N3492J1871k1008K2310J8032
12845C55807L4854L3047M1905K9542k38j2859j982m9539r8305n0889l4184j0674
12833B36485Q67P41k4182j8506p145N49r225N490r501m142P138R927J5378R166
12819B13040J7492N4598L9980M6739J6359k3226n4193o5436l3221k7978n058j6571
12807A62525m0283l5248k2509J921K5554o507l4449j5055J1753J5725J3842n553
12795G1716N592l0456P641K1118K0739J1032k4216k4728N52q387N673K7056J6212
12782I9544K476J0053K269k711K1264m349j050j6376L0856K7525O286N886M108
12769A85781J0458P877m685J0185J0414j6792l6665r108k5001K953O485k1399
$$ y = [168547, 159690, 154347, 164909, 196497, 219718, 238317, 271110, 324602, 336473, 315465, 337775, 355807, 390661, 423708, 465613, 495155, 494917, 482058, 480076, 430537, 332232, 281343, 247159, 236485, 237352, 238093, 213911, 195405, 188260, 188809, 179584, 185074, 175573, 171431, 178569, 188496, 203874, 213040, 230532, 285130, 325110, 371849, 388208, 364982, 310789, 245353, 212132, 184154, 179096, 162525, 122242, 86994, 64485, 66406, 91960, 85453, 51004, 35949, 47702, 63427, 77269, 71716, 77308, 46852, 54493, 75611, 96350, 107382, 83166, 58438, 58990, 50603, 56276, 83332, 99544, 102020, 112073, 114342, 111631, 132895, 128546, 127496, 111120, 141976, 169501, 175787, 181673, 185781, 196239, 204116, 199431, 209616, 220030, 203238, 166573, 157465, 132464, 135417, 141902, 120503]
12757A20503l2778j668j2747p746L1936M3730J4244j0794j6638j7313j5169K620
12745I8180l072P715K4466J7002L772M114J0876l9813l2855p577J4776j8762k3733
12732E5089P74J1639j120N035J4770o44m744L105j2679P726J2276j4330j6385
12719F0512j162L8321Q096P262o730r224m295J6974L15m067k6775k2612m0930
12706A5685j5712j4008j7338K6974J1906m150N028p753j3058j5905J5198L3523
12694B0390L6746J1305k8077l833L921P035j787N787J1575P153O001O84j6461
12681F0439k564K5799P295k7895j5327J6316n859K1670Q250J796k3975O367K9084
12668A01396N554K765J8907K4017o890L654L1054P518p707L151R881J5619K1459
$$ y = [120503, 87725, 86057, 73310, 65564, 97500, 141230, 155474, 144680, 128042, 110729, 95560, 98180, 95108, 102823, 127289, 144291, 148063, 152177, 163053, 123240, 90385, 82808, 97584, 78822, 55089, 55863, 67502, 66382, 71417, 86187, 85543, 80799, 83904, 71225, 78951, 91227, 76897, 60512, 59350, 97671, 105767, 113029, 106299, 97075, 92780, 109754, 110069, 106002, 79227, 56615, 15685, -27, -14035, -31373, -4399, 7507, 3357, 8385, 632, -12426, -28331, -13133, 20390, 57136, 68441, 40364, 36531, 40452, 47487, 45700, 51487, 63062, 70215, 76216, 76900, 60439, 57875, 83674, 90969, 63074, 47747, 64063, 58204, 79874, 88124, 89920, 65945, 72312, 101396, 106950, 109715, 128622, 152639, 145749, 149403, 180457, 187975, 180268, 183419, 193300, 208919, 230378]
12655B30378K8679K7154Q244M25L0619R720L9230L7297L3564j1992L0982K2883
12643D87183k7520j3904l5072n7088k8399o072j7476r199J1596J0374q047J5208
12631C21584M036J9191K3431K9052j2353j2722l115q495K7554K5752J9677N0586
12619D84178O4721P1003Q3172P6856J21504J08695J02170R5535O7077J5486l0907
12608A259490j7225j9507p0210r9951p4970p3819o4100m6621l0923n6645m3760
12597F61759m620j9817m835J7807L959j1368j8330m894j752l2627J4874K5051
12585F25207J6135K3179J9777P182J531K4690L5746k5130j3459J4892M9391M5638
12573H24779K8679L5619J3282m1350k5244K6288P3570N0718J7124L4338J4685
$$ y = [230378, 259057, 286211, 294455, 294880, 325499, 335219, 374449, 411746, 445310, 433318, 464300, 487183, 459663, 445759, 410687, 353599, 325200, 319128, 301652, 292453, 304049, 314423, 306376, 321584, 325620, 344811, 368242, 397294, 384941, 372219, 369104, 360609, 388163, 413915, 433592, 484178, 548899, 619902, 703074, 779930, 901434, 1010129, 1112299, 1207834, 1274911, 1290397, 1259490, 1242265, 1222758, 1152548, 1052597, 977627, 903808, 839708, 793087, 762164, 705519, 661759, 657139, 637322, 632487, 650294, 654253, 642885, 624555, 619661, 617909, 585282, 600156, 625207, 641342, 664521, 684298, 691480, 693011, 717701, 753447, 728317, 714858, 729750, 779141, 824779, 853458, 889077, 902359, 861009, 835765, 862053, 935623, 986341, 1003465, 1037803, 1052488]
12562A052488M0516M1887L6612O4032Q1305O4945N4970N7359R4512J09868R2708
12551A791202J33142J52283J67008J79625J82639J80464K00733K83925L30109
12542C601130L58495L36733L80558M54698N31138O52536P67619Q98503J078349
12533I059759J252504J450280J653432J884912K163851K545970L111522L891763
12525B7013993N053569O745467Q934679J1498580J4167666J6754063J9059117
12518A09227134K0523281K0548090J8810894J5603189J1163786N630795o79467
12511B00827702o792488j1910486j5841935j8430169j9402533j8662489j6752738
12504I3034864j4328184j1808035r243260o934559n169953l958703l207557k732301
$$ y = [1052488, 1093004, 1134891, 1171503, 1235535, 1316840, 1381785, 1436755, 1494114, 1588626, 1698494, 1791202, 1924344, 2076627, 2243635, 2423260, 2605899, 2786363, 2987096, 3271021, 3601130, 3959625, 4296358, 4676916, 5131614, 5662752, 6315288, 7082907, 7981410, 9059759, 10312263, 11762543, 13415975, 15300887, 17464738, 20010708, 23122230, 27013993, 32067562, 38813029, 47747708, 59246288, 73413954, 90168017, 109227134, 129750415, 150298505, 169109399, 184712588, 195876374, 201507169, 200827702, 194035214, 182124728, 166282793, 147852624, 128450091, 109787602, 93034864, 78706680, 66898645, 57655385, 50720826, 45550873, 41592170, 38384613, 35652312]
12496C5652312k416050k220014k038272j917923j829739j682707j571609j403170
12488B0572828j221614j127649r78623q84395p89999p13697o57683n97970n74996
12479A3026202n45062n10638m63997m55501m10071m06532l89495l80155l52503
12470I112248l22101l22999k92540k85042k67547k92568k95018k76667k50489
12461F507277k58516k35114k09116k23439k07419k12631k05697j86924j56118
12452D612303j38301j34158j51877j36387j14375j01044j16771j10949j09557
12443C498884j14067p7286p2788q6072j14025p9940q5560r2346l7946k7783m4220
12432B666851q4882o2190o7274n1222l5556n6849n5039j1299k6362l3126m9940
$$ y = [35652312, 33236262, 31016248, 28977976, 27060053, 25230314, 23547607, 21975998, 20572828, 19351214, 18223565, 17244942, 16360547, 15570548, 14856851, 14199168, 13601198, 13026202, 12481140, 11970502, 11506505, 11051004, 10640933, 10234401, 9844906, 9464751, 9112248, 8790147, 8467148, 8174608, 7889566, 7622019, 7329451, 7034433, 6757766, 6507277, 6248761, 6013647, 5804531, 5581092, 5373673, 5161042, 4955345, 4768421, 4612303, 4474002, 4339844, 4187967, 4051580, 3937205, 3836161, 3719390, 3608441, 3498884, 3384817, 3307531, 3234743, 3148671, 3034646, 2954706, 2869146, 2776800, 2738854, 2711071, 2666851, 2581969, 2519779, 2452505, 2401283, 2365727, 2308878, 2253839, 2242540, 2216178, 2183052, 2133112]
12421B133112o8312m0140l2399J5892k6852o6189o6322n0193m9325m4791n8325
12410A646156n0558r1536p2647o0418l1201n5138m9102m5421l3686n1345o0000
12399A045104n2044j6549k1535m9336l6142m3869q842k0614l8783k7032J6989
12388G47347j060l2529n4531p1622k8832j9630n2089o4770m6244m2899K934J1216
12376C47291k5794l0884J2960O527k8594o770J0320K9795L1080K5962J1394J374
12364C84661R179j3387J1789J6699r087j2601p600j6045J0434J4058N500k2932
12352C70668L296J1433k53k0713J0436J0137Q687j0382j1378N130O221O684j1600
12339C78366j2754k642j6936j6670J7714L6223r067k3786K0820K317J6846K5458
$$ y = [2133112, 2064800, 2024660, 1992261, 2008153, 1981301, 1915112, 1848790, 1798597, 1749272, 1704481, 1646156, 1595598, 1504062, 1431415, 1370997, 1339796, 1284658, 1235556, 1190135, 1156449, 1105104, 1045104, 993060, 976511, 954976, 905640, 869498, 825629, 816787, 796173, 757390, 730358, 747347, 746287, 713758, 659227, 587605, 558773, 539143, 487054, 422284, 376040, 333141, 336075, 347291, 321497, 290613, 303573, 310100, 281506, 274736, 285056, 314851, 345931, 371893, 383287, 384661, 393840, 380453, 392242, 408941, 399854, 387253, 379653, 363608, 374042, 388100, 393600, 370668, 373964, 385397, 385144, 364431, 374867, 385004, 393691, 383309, 371931, 377061, 383282, 389966, 378366, 365612, 362970, 346034, 329364, 347078, 383301, 374234, 350448, 371268, 373585, 390431, 415889]
12327D15889N863M6433k2627l4495K2496n179k2349j6649n84j7255m266k1602
12315C45675o593j2219M126O262j0914l447k9910l4968K258q16q426k1674q383
12302B20971J5289K4077J1819j0921m4829p826L2444J4591n2484k2864Q751K3151
12290B12169M758J3374L275J2387N248J461j0044L1980N907o343l4528k2348O75
12277B17971J4381p291j276J6139K2976J5141n804J9909O4529M0904q417M603
12265C93765k055K5779N3807L7162J4261P322n3091j5794O949m1866o8929m9103
12253C08207m6956j9413k0000p980m659J173K242k2533k8911J490P69j3227j8812
12240A31390j947K681J905Q449j1089L718K0673k4885j189j0293K3625J7069k4716
$$ y = [415889, 421752, 468185, 445558, 411063, 433559, 428380, 406031, 389382, 388798, 371543, 367277, 345675, 339082, 326863, 330989, 337251, 326337, 322890, 292980, 258012, 260270, 259454, 251028, 229354, 220971, 236260, 260337, 272156, 261235, 216406, 208580, 241024, 255615, 203131, 180267, 189018, 212169, 216927, 230301, 233576, 245963, 251211, 252672, 242628, 274608, 280515, 274172, 239644, 217296, 217971, 232352, 225061, 223785, 239924, 262900, 278041, 272237, 292146, 356675, 397579, 389162, 393765, 391710, 417489, 471296, 508458, 522719, 530041, 476950, 461156, 468105, 426239, 357310, 308207, 261251, 241838, 221838, 213858, 209199, 210372, 212614, 190081, 161170, 162660, 163429, 150202, 131390, 129443, 132124, 134029, 142478, 131389, 135107, 155780, 130895, 129706, 119413, 143038, 160107, 135391]
12227A35391m0080m724m664k1859j4994q350J4928p687K2062J5158J4009o534
12215I2656l3165q250R857P666J0506k1595q451m043K6498k541j7994j81J5272
12202F6235J0531j2418k0666m539K25R318J0043J0523k9158n633j7349M437P284
12189B8833j786O432L8184l033k6324N041j9944J2273J5830J3602K4716M788k6698
12176G1914k2113q925P5o530m07l284R106l8487l2779P489J9936K5919J8457K5142
12162F5513J6241j5514j4014N740K5277j3932l8262k4913J942M0429J6431n777
12150E9161N903K79p511m734K0385J2476K0896k6189k4834j2543l217J590o706
12137C4956P938N707j3917J0144J759J902j5888j5499l330j3063K0899K0824j4537
$$ y = [135391, 95311, 90587, 85923, 64064, 49070, 40720, 55648, 47961, 70023, 85181, 99190, 92656, 59491, 51241, 61098, 68764, 79270, 57675, 49224, 45181, 71679, 69138, 51144, 50963, 66235, 76766, 64348, 43682, 39143, 39368, 48686, 58729, 69252, 40094, 34461, 17112, 21549, 28833, 27047, 33479, 71663, 68630, 42306, 47347, 27403, 39676, 55506, 69108, 93824, 98612, 71914, 49801, 40876, 40951, 34421, 34014, 30730, 39836, 1349, -31430, -23941, -4005, 21914, 40371, 65513, 81754, 66240, 52226, 57966, 83243, 69311, 31049, 6136, 8078, 48507, 64938, 59161, 65064, 65343, 57832, 53098, 73483, 85959, 106855, 80666, 55832, 43289, 40072, 41662, 34956, 42894, 48601, 34684, 44828, 46587, 48489, 32601, 17102, 13772, 709, 21608, 42432, 27895]
12124B7895j0902O230P95M29j1164P41J2287r777j662K3546L4824L0701p482k4179
12110G2282k2617Q313P25J660L195K7313N1238o240M423J7531J0003j682P6744
12097B42888N5719K8953R9975R4746R0364J26579J34361J19322J07619P5683L9861
12086A216070L9704l4311n2559o8999j06965j21349j19856j20217q2983p2415
12076D76120o0461l5967k7273m1254n9222n374n564j8462k5290p176l247l6581
12064A50249K19r473k4119p249J78J2961k7540J226K7752j0673l5523L17P734
12051H6059L2875J2011k2350l7663L77p768j37J837j2960J0060J9203K5126K923
12038A09593j569k9384j0798j302M1021q005k6243p014n27l647j3667N815L562
$$ y = [27895, 16993, 23223, 24018, 24447, 13283, 14024, 26311, 16534, 14872, 38418, 73242, 103943, 96461, 72282, 49665, 57978, 58703, 60363, 63558, 90871, 142109, 135869, 140292, 157823, 167826, 166144, 242888, 298607, 327560, 427535, 522281, 612645, 739224, 873585, 992907, 1100526, 1176209, 1216070, 1255774, 1221463, 1168904, 1099905, 992940, 871591, 751735, 631518, 548535, 476120, 415659, 379692, 352419, 311165, 251943, 246569, 241005, 222543, 197253, 190077, 186830, 150249, 150468, 140995, 116876, 109627, 109805, 122766, 95226, 96452, 124204, 113531, 78008, 78325, 86059, 118934, 130945, 108595, 70932, 71309, 63541, 63404, 65241, 52281, 62341, 81544, 106670, 109593, 108024, 78640, 67842, 66540, 107561, 99556, 73313, 66299, 65772, 62125, 48458, 54273, 57835]
12025E7835J4261l197k1717k9382j3447N72J7040J7728N625p142J5582J5302j6241
12012E2819l6962J2948J1582j131p652m008L728J4331J4610o955K1907M0145M6494
11999A61856J7660K9324J2470L4449M9606J5926k6571j6762J0152J3187j0448
11988B90849m4272l5614J009q411l8865k7337J1512k9776n5751m7788k7568o36
11976a2648M7970L2593p008r351l695l3383J5793L6808j8486k2805j3004M670
11964A7454M630j2385J8341l583J0182L4097K1632k8392j8677q414J143L457j4162
11951B5323k7423K7719L2103j1024k2760J502n816j9829o979K5487K0895K6844
11939F6042j6819j9420k2628R818J0533k9010R465K6190o170k9188j5412L1839
$$ y = [57835, 72096, 68899, 47182, 17800, 4353, 4925, 21965, 39693, 45318, 38176, 53758, 69060, 52819, 15857, 28805, 40387, 39256, 31604, 27596, 31324, 45655, 60265, 53310, 75217, 115362, 161856, 179516, 208840, 221310, 255759, 305365, 321291, 294720, 277958, 288110, 301297, 290849, 246577, 210963, 211972, 203561, 164696, 137359, 148871, 119095, 63344, 15556, -12012, -12648, 35322, 67915, 60907, 51556, 47861, 14478, 30271, 67079, 48593, 25788, 12784, 17454, 22084, 9699, 28040, 24457, 34639, 68736, 90368, 61976, 43299, 34885, 36028, 39485, 25323, -2100, 25619, 57722, 46698, 23938, 25440, 19624, -205, -7184, 18303, 39198, 66042, 49223, 29803, 7175, 16993, 27526, -1484, 7981, 34171, 28001, -1187, -16599, 15240]
11927A5240J3232j7648j0310O23L046J0424J5005o389k0420k0191P991n582k0359
11914c5338R612J6816J3838J9677L4467J6360j9978j0352J9609J578m4573k3703
11902a987j039j6422n843j0218n667J0046n12k604M087L6095J6774R107j6115
11889A5702j8692l247k6349k6764Q869J2495R072M0730q346P05K0549K1359O215
11876E2298k2474L621K4727j3891j2936l0736k0874J4206K7847l3755j7766J1418
11864a8315M4368M1353r706N365m447k2447l4511j5299n838O170o626n160o583
11851c1676l919n733J534K6701J3619Q115J4839q582l81p36j976Q20L956k0880
11837d299k1059M982J9608J0269j0297J5064q279m5851m537R168K9263K6686k4062
$$ y = [15240, 28472, 10824, 514, 1137, 4183, 14607, 29612, 23223, 2803, -17388, -9397, -14979, -35338, -25726, -8910, 4928, 24605, 59072, 75432, 55454, 45102, 64711, 66289, 21716, -1987, -3026, -19448, -25291, -35509, -41176, -31130, -31642, -34246, -30159, 5936, 22710, 31817, 15702, -2990, -6237, -32586, -59350, -50481, -37986, -28914, 11816, 3470, 4175, 24724, 46083, 52298, 29824, 33445, 58172, 44281, 31345, 609, -20265, -6059, 21788, -11967, -29733, -18315, 26053, 67406, 57700, 63065, 58618, 36171, 1660, -13639, -19477, -13307, -19933, -25093, -31676, -35595, -41328, -39794, -13093, 526, 8641, 23480, 14898, 14517, 13781, 11805, 12625, 16581, -4299, -25358, -20376, -768, 9501, -796, 14268, 5989, -39862, -44399, -35231, -5968, 20718, -3344]
11824c344p130Q211j5204R172j176J2161p290j0037k7291L5798O170J1280j1187
11811A33l8659j3142R203K9485J6554J3704M501j1263k666p268k0577j7425j9150
11798e6570L1344p422J1563K3567L8576J0237l8258k8567j2718j4512K714K3840
11786a6206Q253P808J7591n281k5300p249J1662K6944P401j1976m17P559m122
11773A6667j1777j4410p641J4184J6985K658j7114l798Q266J4584r751P178j0166
11760E865j52L068j2584Q849k35R250J225p01P428m455p107k3722Q332P329P885
11745A0275K3044m116l7170j6461K189J0957p376j9389m331L2378M799q691P744
11732f148P353o684l4820k5310j7610K015K5335J6274K181J3723M994m536r570
$$ y = [-3344, -10474, -2263, -17467, -8295, -9471, 2690, -4600, -14637, -41928, -6130, 40, 11320, 133, -38526, -51668, -42465, -12980, 3574, 17278, 21779, 10516, 7850, 582, -19995, -37420, -56570, -25226, -32648, -21085, 2482, 41058, 51295, 13037, -15530, -28248, -42760, -40046, -16206, -7953, -145, 17446, 12165, -13135, -20384, -8722, 18222, 25623, 13647, 13230, 20789, 16667, 4890, -9520, -17161, -2977, 14008, 16666, -448, -4246, 4020, 18604, 8853, 16031, 5865, 5713, 8781, -3803, 5046, 4811, 14061, 15286, 14585, 22013, 17558, 10451, -13271, -4939, 2390, 10275, 33319, 29203, -7967, -24428, -22239, -11282, -18658, -38047, -42378, -10000, -5201, -13892, -6148, 1205, -5479, -40299, -65609, -83219, -81204, -55869, -39595, -37414, -23691, -18697, -23233, -32803]
11719c2803J2591J2643P152L5604J370k1559k4m171j7065J375j0005l066R285
11706h673L353k2124j3599k5120j4030K8315K2967J182K3081K0017L3847J10l7827
11693A1499j6243J3052J7221k3503l0697k0404J5849L3127J1139l635n853l1731
11681c0179j6706K1634J1376J6781O256k0230j6876o980J4350J1080j892k7616
11669c9002p064P580J5556J6927J2617K3820j0292o010j9508J1943M549k1998
11657a0882j4978j121J7184J0732K0504J7205j52p972o686n670j0495j7425J4986
11644E230P426o214M625q32l901P964m28o762P243R427k4920l506j1791k5159
11630d1598l850K7340o172k6545J5832L5254K815N946j0529l9303j3727K7317
$$ y = [-32803, -20212, -7569, -417, 35187, 36557, 14998, 14974, 10803, -6262, -4887, -14892, -17958, -8673, -5320, -27444, -41043, -66163, -80193, -51878, -28911, -27729, -4648, 15369, 49216, 49326, 11499, -4744, 8308, 25529, 2026, -28671, -49075, -33226, -99, 11040, 7405, 1552, -30179, -46885, -25251, -13875, 2906, 9162, -11068, -27944, -34924, -20574, -9494, -11386, -39002, -46066, -38486, -22930, -6003, 6614, 30434, 20142, 14132, -5376, 6567, 11116, -10882, -25860, -26981, -9797, 935, 21439, 38644, 38492, 30520, 23834, 18164, 7669, -9756, 5230, 12656, 6442, 11067, 10235, 6334, 14298, 13870, 7108, 14351, 23778, -1142, -4648, -16439, -41598, -45448, -18108, -24280, -50825, -34993, 261, 3076, 9022, -1507, -40810, -54537, -27220]
11618b7220R667J7601K8475o129N43J1514J5673k9237m556q73P601J2340J1271
11605D6670n819p770k2273R584k0073L375j1413k4968L046l122O674M05J9709
11592e975J681j0709N545J4482J2407K3665K295P488j5259l3417r49O921q163
11579A2k8554N58K6753j263K858k3459R496l0688J549K6298L6146J0194j738k4091
11565D071j8714J4190L1972L1105q125O114k1820L742j7353k2317j3825m18J2022
11552F44j533R174o593K1217J4463j2585j7410q275j6457j2761K519J0574L2464
11539A5441K4465k4303q204k0420j8002k543J3749P187j0056j1179J8890L2743
11527A7768q771R335o5j5168J6477l44J9381P82k9341j7206j7983P365k235j577
$$ y = [-27220, -17553, 48, 28523, 22394, 22937, 34451, 50124, 20887, 16331, 15458, 23059, 35399, 46670, 40851, 33081, 10808, 20392, 319, 3694, -7719, -32687, -29641, -32763, -26089, -25684, -5975, -4294, -15003, -9458, 5024, 17431, 41096, 43391, 50879, 35620, 2203, 1254, 8175, 12, -28542, -27984, -1231, -2494, 364, -23095, -13599, -44287, -42738, -16440, 19706, 29900, 28162, 4071, -14643, -453, 31519, 62624, 54499, 60613, 38793, 42535, 25182, 2865, -10960, -11378, 644, -889, 8285, 1692, 22909, 37372, 24787, 7377, -898, -17355, -30116, -27597, -17023, 15441, 39906, 15603, 7399, -13021, -31023, -33566, -19817, -12630, -22686, -33865, -14975, 17768, 8997, 18332, 18267, 3099, 19576, 19232, 38613, 39395, 10054, -7152, -25135, -17770, -20005, -21582]
11513b1582j1565K4952l418M590k5232q232l495K4761j717q703R031K9690j0178
11500a098k2062l2160n201J0769j0564L0577J2027j2641L3005M35l87J1453j1982
11487B171j6957k7190o672J1542j1547j581J5907J3330K0167l873J3702j9690
11475a0691Q213q5J7318o083j8985p615j5158J4088j1982k5826j7017J3306M6835
11462a3682J7674r672j4544l593J3107k944p874p78N799J3508l095o763O903K707
11448c247K2523J7911l3668k7808K166L208l6172J4632J780J5055K2592R65J1284
11435A1221j6479J2315j280m547J4488M097j1057J716K6252J7454j5163k2379
11423A6638J2812o202k4777j1340K5881R801J0457j4113k8168M639j6936Q201
$$ y = [-21582, -33147, -8195, -11613, -7023, -32255, -40487, -43982, -19221, -20938, -29641, -20610, 9080, -1098, -23160, -55320, -60521, -49752, -60316, -29739, -17712, -30353, 2652, 3087, 2700, 14153, 2171, -14786, -41976, -48648, -37106, -48653, -50234, -34327, -20997, -830, -4703, 8999, -10691, -2478, -2563, 14755, 8672, -10313, -17928, -33086, -18998, -30980, -56806, -73823, -60517, -13682, 3992, -5680, -20224, -23817, -10710, -13654, -21528, -22306, -16507, -2999, -6094, -12857, -5954, -3247, 19276, 37187, 3519, -24289, -22123, -18915, -55087, -40455, -38675, -23620, -1028, -63, 11221, -5258, 7057, 5777, 1230, 15718, 19815, 8758, 10474, 36726, 54180, 39017, 16638, 29450, 23248, -1529, -12869, 13012, 22813, 33270, 19157, -9011, -4372, -21308, -13107]
11411a3107K2063J0102M574l3034j4918j3837J9262M1076k0154p490Q197k924
11399a90J6110N882l327K210J0182K021o366j7145l1070r7K6035n269N51L689
11385C216O107M002K0604j9494j9073L440K8013M0049k9414n1434J4197k083l491
11372e361k716R368J4132j2033O28J6365P472P941J3690j0149k106K8951j1667
11359E4515o908J5273J853K4948K4921O664O439M9657M3997O2193L351k6888j5755
11346B44260j6458m437l1387l7100k3427k8934k0655m052j0124j041n493j5832
11334D5320J9190K6344r631k4192j341J2720N669L2389K207P494O82l5335L050
11321H4566L2436j1058k8907l5488l431P704l732j9322j1695m420o919J8235J4280
$$ y = [-13107, 8956, 19058, 23632, -9402, -24320, -38157, -18895, 22181, 2027, -5463, 2734, -190, 15920, 21802, 18475, 20685, 30867, 32888, 26522, 9377, -21693, -21790, 4245, -1024, -473, 3216, 9323, 13325, 33929, 14435, -4638, -1198, 26815, 66864, 37450, -13984, 213, -1870, -5361, -8077, 1291, 15423, 3390, 4018, 20383, 27855, 35796, 49486, 39337, 37231, 66182, 54515, 47607, 62880, 64733, 89681, 114602, 121266, 127705, 177362, 221359, 283552, 286903, 260015, 244260, 227802, 223365, 191978, 154878, 131451, 102517, 81862, 77810, 67686, 66645, 61152, 45320, 64510, 90854, 81223, 57031, 55690, 68410, 74079, 106468, 108675, 116169, 116851, 81516, 84566, 117002, 105944, 77037, 41549, 38118, 45822, 42090, 22768, 11073, 6653, -266, 17969, 32249]
11308C2249o77Q529K4436k4524j3479N818n236M868O547j5761l1500j7537R926
11295a6341J6116L2667M876L388K3539K380n828J8815L327k5584j9758j014k089
11282C4494k8458m534k557J2398P931Q23L106j5430K771k905k2294o656J635J3705
11268e971J2342j3665J8236J4012J5235k3154j7393j3631q18l46j224K4191K1519
11255B9333J8846L551P43l477j4676j2004k1968k0571l3928L3763M0126l863J5944
11242C1819j4095j3796j2562K1485J9072j5565k5535J597J525J5716J2951j0130
11230A2482l4468j6633J4783K168N847j9123j9973J093J2548K266Q684o558J3643
11217b3241n337m939K1762R047j3758L644L036J5699M261j2146j434r991N14m392
$$ y = [32249, 31572, 40101, 64537, 40013, 26534, 32352, 27116, 31984, 38531, 22770, -8730, -26267, -16341, -225, 32442, 37318, 40706, 64245, 66625, 60797, 79612, 82939, 57355, 37597, 36583, 34494, 6036, 1502, -1055, 11343, 19274, 20097, 23203, 7773, 10544, 7639, -14655, -21311, -19676, -5971, 6371, -7294, 10942, 24954, 40189, 17035, -358, -13989, -14807, -15153, -16377, 7814, 29333, 48179, 51730, 52473, 48996, 34320, 22316, 348, -20223, -54151, -20388, 19738, 15875, 31819, 17724, 3928, -8634, 12851, 31923, 16358, -9177, -7580, -6055, 9661, 22612, 12482, -21986, -38619, -23836, -21668, -15821, -34944, -54917, -53824, -41276, -39010, -30326, -36884, -23241, -28578, -33517, -11755, -2708, -16466, -12822, -9786, 5913, 10174, -1972, -3406, -13397, -12883, -17275]
11203a7275K972p024j1186L9916j264r543k6986m5394l011N1544R295n355Q454
11190a4857j8876j6259J4865M848J9503K3037J0659j419j0453M931J4759k3439
11178G299n27l923j8018k9618J9578K7919J5781M335j4889R426K5301K562j0947
11165C4279J339k2456q288K8033K4047j2206j2366j0832M529J1335r976k6283
11153A155J4031J0604l2400J1918P715n257M288q332k6317n41L2147L8363K9196
11140G6570m500m408m0854j2158j1977n030N808L70n056K2248J9913j6749j5793
11127H384L168l87J6229K9063l2761n294J0156o738j5068j2342j0834r193J611
11114b4006O0324R384j1236m753M592j5852J5107K3671n870k255Q592L805J8403
$$ y = [-17275, -14303, -21327, -32513, 7403, 6139, -3404, -30390, -75784, -78795, -27251, -17956, -23311, -14857, -33733, -49992, -35127, -30279, -10776, 12261, 22920, 21501, 11048, 15979, 30738, 7299, 6772, 2849, -15169, -44787, -25209, 2710, 18491, 22826, 7937, 17363, 42664, 45226, 34279, 35618, 13162, 4874, 32907, 56954, 44748, 32382, 21550, 26079, 37414, 27438, 1155, 15186, 25790, -6610, 5308, 13023, 7766, 12054, 3722, -22595, -23136, 9011, 47374, 76570, 72070, 67662, 26808, 14650, 2673, -2357, 3451, 3821, -1235, 21013, 40926, 24177, 8384, 11552, 11165, 27394, 56457, 23696, 18402, 28558, 21820, 6752, -5590, -16424, -25617, -24006, 36318, 45702, 34466, 29713, 34305, 18453, 33560, 57231, 51361, 49106, 57698, 61503, 79906]
11101G9906l816j5327j3736j3927n736L783P111j6858j0774J6382O305j2437j7812
11088C064L1750j2270j5194J128j1741k6773P987K6663J7486R729K6611K51j5289
11075D3402K5695N345p656k3436m321r346O08k7974K1686k578j4650K245J6726
11062B5746N719j1339JJ2834j9143j5130M336P944O98K4761m4797N238M3763j436
11048C9195j1082Q01p874L236j5640k0777J6720k313l2527J8231K2623K7213M4718
11035H2524j074m9823k0597K1691J7596K7652l1771k5401l947K581J658J3644
11023C4733M993M937j5107r366J0362j8808r143j1306K9336J1467m421l6602k9412
11010c8337J6088L5776K0131J2042N141n996k926k3203q398J3381K56J5882J6863
$$ y = [79906, 76090, 60763, 47027, 33100, 27364, 31147, 38258, 21400, 10626, 27008, 33313, 20876, 3064, 34814, 22544, 7350, 8478, -3263, -30036, -22049, 4614, 22100, 31829, 58440, 58691, 43402, 69097, 74442, 66786, 43350, 39029, 29683, 30291, 2317, 24003, 21425, 6775, 9020, 25746, 31465, 20126, 20127, 32961, 13818, -1312, 3024, 10968, 11666, 36427, -8370, -3132, 40631, 39195, 28113, 28914, 21040, 24276, 8636, -12141, 4579, 2266, -30261, -12030, 10593, 37806, 82524, 81450, 31627, 11030, 32721, 50317, 77969, 46198, 20797, 16850, 19431, 21089, 34733, 39726, 44663, 29556, 20190, 30552, 11744, 2601, -8705, 20631, 32098, 27677, -8925, -38337, -22249, 13527, 33658, 45700, 50841, 44845, 41919, 18716, 10318, 23699, 23955, 39837, 56700]
10997E6700J2559l415j6540J8775q229j8344J0780K5669j2208j746k1474l8245
10985D282p182K2159j1455l8520J6394L4286j4305l5084j6726N2640L7461K2209
10973F6159j5283n1117j3879j0282J3238j5009Q464p573J5039J3334j4522j3730
10961b5161j526O505P631j3141K6266J5867l4330k5031L2805L9917k1531j9684
10949a1413K093J2543K51j4869N961r727q330L307K6538K750J3820K018r678j1507
10935C757j3909r202J7050J2362J2009K4012L323J6132K7406j4298J6656J4540
10923A09838j6277J3444L4686n301J4131L2360R361K9572K7717M5231Q9750J02792
10911D87304J56506K38780L04289L40574K69850J55198Q2043N3711o9475k00238
$$ y = [56700, 69259, 65844, 49304, 68079, 59850, 41506, 52286, 77955, 65747, 64001, 42527, 4282, -2900, 19259, 7804, -30716, -14322, 19964, 5659, -29425, -46151, 6489, 43950, 66159, 50876, -241, -14120, -24402, -11164, -26173, -17709, -25282, -10243, 3091, -11431, -25161, -26687, -20182, -12551, -25692, 574, 16441, -17889, -42920, -10115, 29802, 8271, -11413, -9320, 3223, 3474, -11395, -5434, -15161, -23491, -20184, 6354, 9104, 22924, 24942, 15264, 3757, -10152, -19354, -2304, 10058, 22067, 46079, 49402, 65534, 92940, 78642, 95298, 109838, 93561, 107005, 141691, 136390, 150521, 182881, 192242, 221814, 249531, 294762, 384512, 487304, 643810, 882590, 1186879, 1527453, 1797303, 1952501, 2034544, 2088255, 2018780, 1818542]
10901A818542l15774l34715k62780j94153j23916p8796m9090n8331l1251m7213
10891C22523o5285m0475J0755K4417j8474R916K3888k8826k3828j1304J2984o558
10879B09733k3572j2725K3786J936j9616R28j2200l1587l0199k839J5917p125
10867A12437l7681j3610K5913k1552j0420M001K2969Q009k2517j0256p800J9516
10855F9009r990q679K136n233j3659K6662J0211o256n506J852j11k8447O444m774
10841C3659K942k708k0255k0467J8691m220j3687K923P589K3533P546L142n503
10828C3185K2791l327P971j3386J4868J70j1746k0622K8971L4013J4369j7276
10816H9981j1820m585J155k1803j3469K3086J1143m629M855Q82J0280L5043J5061
$$ y = [1818542, 1502768, 1168053, 905273, 711120, 587204, 508408, 459318, 400987, 369736, 322523, 257238, 216763, 227518, 251935, 233461, 243377, 267265, 238439, 214611, 203307, 216291, 209733, 186161, 173436, 197222, 199158, 179542, 180470, 168270, 136683, 106484, 103645, 119562, 112437, 74756, 61146, 87059, 65507, 55087, 59088, 82057, 90066, 67549, 57293, 49493, 69009, 59019, 50340, 52476, 47243, 33584, 60246, 70457, 64201, 58695, 60547, 60436, 31989, 38433, 33659, 36601, 33893, 13638, -6829, 11862, 7642, -6045, -3122, 4467, 28000, 35546, 38688, 33185, 55976, 52649, 60620, 47234, 62102, 62272, 50526, 29904, 58875, 92888, 107257, 89981, 78161, 73576, 74731, 52928, 39459, 62545, 73688, 69059, 73914, 74796, 85076, 120119, 135180]
10803A35180l7937K2385J8050p651j3544j8611o33K1053k6666k4276K4773J4432
10791A06555j3248M448j8290o8008l766J9591m266K1516L105L898l007N12J0033
10778E9073L221P165n084r275M210J8870m36l0376l1470j0489K363R27j2404O731
10764C026J574j889J3928M039J3909L242j5990p244J1737K3293J3949J3615J2662
10751H9851K023K9072N582K1756K6304J3068M0155J7033J4407K3489J1347K984
10739B97071J8491O530J4536n1336m2315n976n409j9883l234j4637n2940k3345
10727A17553k3370O954K9409r690M427k858O662l926j1404p988R874O748K5497
10714A47888j0798q0j6798l5564j3048K7407J1349j7503l131r6j0384J703J0170
$$ y = [135180, 97243, 119628, 137678, 130027, 116483, 97872, 97239, 118292, 91626, 67350, 92123, 106555, 93307, 97755, 79465, 11457, 7691, 27282, 23016, 44532, 47637, 51535, 48528, 49040, 59073, 62294, 69459, 64375, 55100, 59310, 78180, 77744, 47368, 15898, 5409, 7772, 8699, -3705, 3026, 4600, 2711, 16639, 20678, 34587, 37829, 21839, 14595, 26332, 49625, 63574, 77189, 89851, 91874, 120946, 126528, 148284, 174588, 187656, 227811, 244844, 259251, 282740, 294087, 297071, 315562, 322092, 336628, 285292, 242977, 237001, 231592, 211709, 208475, 193838, 140898, 117553, 94183, 101137, 130546, 120856, 125283, 122425, 129087, 125161, 113757, 105769, 115643, 122391, 147888, 137090, 137010, 120212, 84648, 71600, 99007, 110356, 92853, 89722, 89626, 79242, 80945, 91115]
10701I1115J0339J7209J793l4138O443P595O994q151J580J2112o800L039R568
10688A18698j3733k1981n117n366J3832L427k108J2994m1133l6564m0291m7784
10676f5126p639L905J9341P485o657q560m80J4330L0757J4568K7653K4830K532
10663E6939j8414q285J4503L1848M819j8333p527K2480M403q360K4951j0069m120
10650H4835J1926j5274M917J96J0785Q666N218P276m210M805J7870p140m487j601
10636A23782J9999Q984p555K2257L6190N1326N7183L2414L1286j62J7994M0762
10624D34460M9254O4394N1061L5266L7622P8751Q1007Q7932N1945j061p8405q6850
10612H05376r7801m6987n5452m4633o7018m280j3726j2580L421R880j4831P86
$$ y = [91115, 101454, 118663, 120456, 86318, 92761, 100356, 107350, 99199, 100779, 112891, 106091, 109130, 118698, 104965, 82984, 77867, 72501, 86333, 89760, 87652, 100646, 59513, 22949, -17342, -65126, -72765, -68860, -49519, -42034, -48691, -57251, -57731, -43401, -12644, 1924, 29577, 54407, 56939, 38525, 30240, 44743, 76591, 81410, 63077, 55550, 78030, 82433, 74073, 99024, 88955, 84835, 96761, 81487, 86404, 86600, 97385, 106051, 111269, 118545, 114335, 119140, 137010, 129870, 125383, 123782, 143781, 152765, 145210, 167467, 203657, 254983, 312166, 344580, 375866, 375704, 393698, 434460, 483714, 548108, 599169, 634435, 672057, 750808, 831815, 919747, 971692, 970631, 892226, 805376, 707575, 660588, 605136, 560503, 493485, 489205, 475479, 462899, 466320, 476200, 461369, 462155]
10600D62155J5393K4298j0920j4147k3922j9674j2164j4526n160M386J1667J9413
10588D36799J0259P621l986r68J0310J8624O479k6865J2895M0758K0661J2258
10576E44845J7226J2076K2380J1071J7J2052j391M853J8690J3320r853j3945J596
10563F32937M0564N0116M7135o745j4960j7590K5061L4995L8200K0665L5300L1664
10551I17342M1973M6522P1343N0688K9857K7347J6680j1362Q618K5839R240R254
10539A243341J1559P43O8885Q2037R3963P5676J04782Q3938R1335J21218J29226
10528B106703J32683J05496J16155K06495K57941K15585J93530K26585K59332
10519C820505L00919L14933L50575M10791M28142M65073M98075N70127O06403
$$ y = [462155, 477548, 501846, 490926, 476779, 452857, 433183, 421019, 406493, 401333, 405719, 417386, 436799, 447058, 454679, 450693, 449725, 460035, 478659, 485138, 458273, 471168, 511926, 532587, 544845, 562071, 574147, 596527, 607598, 607615, 619667, 618276, 623129, 641819, 655139, 645286, 631341, 632937, 673501, 723617, 770752, 764007, 749047, 731457, 756518, 791513, 829713, 850378, 885678, 917342, 959315, 1005837, 1077180, 1127868, 1157725, 1185072, 1201752, 1190390, 1199008, 1224847, 1234087, 1243341, 1254900, 1255643, 1324528, 1406565, 1500528, 1576204, 1680986, 1764924, 1856259, 1977477, 2106703, 2239386, 2344882, 2461037, 2667532, 2925473, 3141058, 3334588, 3561173, 3820505, 4121424, 4436357, 4786932, 5197723, 5625865, 6090938, 6589013, 7159140, 7765543]
10510G765543P25631R13588J160523J372658J530620J689092J884128K100651
10502A9142434K270506K548017K959803L634679M612887O033795Q289695J1594168
10494F1085984J6417677K3681556L4510524M8720658O1108984O1038211M3758996
10487C50322590K1694514R769490L943789j2442164m3245482o5691157o2750004
10480B01601576m6545319l1670157k1556263j5057149j0890778q119517o167456
10473F1594937m763496l740990l078432k682235k515421k401942k340082k270797
10465C7801542k263325k228255k046518j768873j473980j212873j026345r13597
10457B4867776r04245q98060q60801q95288r16044r70514r53929q89500q05351
$$ y = [7765543, 8491174, 9404762, 10565285, 11937943, 13468563, 15157655, 17041783, 19142434, 21412940, 23960957, 26920760, 30555439, 35168326, 41202121, 49491816, 61085984, 77503661, 101185217, 135695741, 184416399, 245525383, 306563594, 350322590, 372017104, 381786594, 385730383, 373288219, 330042737, 264351580, 201601576, 155056257, 123386100, 101829837, 86772688, 75881910, 67762393, 61594937, 56831441, 53090451, 50012019, 47329784, 44814363, 42412421, 40072339, 37801542, 35538217, 33309962, 31263444, 29494571, 28020591, 26807718, 25781373, 24867776, 23963531, 23065471, 22204670, 21309382, 20393338, 19422824, 18468895, 17579395, 16774044]
10448A6774044p03313o37749n83103n38220n17868n05343m74185m61325m92726
10439A1860212m69170m21839m16165l96672l97168l71581l29778l52077l05974
10430H399788l12730l21077k82389k87154k79890k32095j93128j89925j67130
10421F134270j58793j73876j88901j73367j54179j57814j37503j23991j25856
10412D739990j20387j30510j44665j22796j00915j04230j02982j11311n5248q0620
10402C666326j05574r7848m3769m2630n2264n1613l5327n5253m7019k3381k3009
10391C088639j6978o2575p1961n9876p9812j01965j27038j21428r3019j36090
10381B217897j12457q8874q1089l1020p3872q4086n8473o2818o3313m5367m9787
$$ y = [16774044, 16070731, 15432982, 14849879, 14311659, 13793791, 13288448, 12814263, 12352938, 11860212, 11391042, 10969203, 10553038, 10156366, 9759198, 9387617, 9057839, 8705762, 8399788, 8087058, 7765981, 7483592, 7196438, 6916548, 6684453, 6491325, 6301400, 6134270, 5975477, 5801601, 5612700, 5439333, 5285154, 5127340, 4989837, 4865846, 4739990, 4619603, 4489093, 4344428, 4221632, 4120717, 4016487, 3913505, 3802194, 3746946, 3666326, 3560752, 3462904, 3419135, 3376505, 3324241, 3272628, 3237301, 3182048, 3135029, 3111648, 3088639, 3071661, 3009086, 2937125, 2877249, 2797437, 2695472, 2568434, 2447006, 2353987, 2217897, 2105440, 2016566, 1935477, 1904457, 1830585, 1746499, 1688026, 1625208, 1561895, 1516528, 1466741]
10370A466741p4438m3620k0121j7723O178K0018j0504m7985o4485n6291m3637
10359A114133n6026n9679j21189j21012q1934n2201k4702j7105j4569j8647m926
10348E42143r653J4958L9902P815l173K1308j66j0334K1657N380J9274N318M0627
10335F95056j3262p969K7141J7663l7305l9861l0009l1291K5454L8428j817p825
10323F34403j7286N789K3776K9454l188l6184j2051K8632K7943n120N818r250
10311F72736L137R04K8602N234K1474K2348P342r774N1049M5597J9654K7166O223
10298I01692k3120l0648j6100m669l2129p0594l8133o6245n7352k6718j1834k6651
10286D97499r435l8645m5491k7904J7287N128N580K3982Q729k8840k802k2060
$$ y = [1466741, 1392303, 1348683, 1328562, 1310839, 1317017, 1337035, 1326531, 1278546, 1214061, 1157770, 1114133, 1058107, 998428, 877239, 756227, 674293, 622092, 597390, 580285, 565716, 547069, 542143, 532490, 547448, 587350, 595165, 591992, 613300, 613134, 602800, 624457, 629837, 649111, 654429, 695056, 681794, 673825, 700966, 718629, 681324, 641463, 611454, 580163, 605617, 644045, 642228, 634403, 617117, 622906, 646682, 676136, 672948, 636764, 624713, 653345, 681288, 676168, 681986, 672736, 675873, 676777, 705379, 710613, 732087, 754435, 761777, 752003, 803052, 848649, 868303, 895469, 901692, 878572, 847924, 831824, 827155, 795026, 724432, 686299, 620054, 562702, 535984, 524150, 497499, 488064, 449419, 403928, 376024, 393311, 398439, 404019, 428001, 436730, 407890, 405088, 383028]
10274C83028J777n213J2280j1909p043j7190n605k4651J5573J7606J8658l269
10262C74042N820l145k462q210O623J6332l468l3744j8067j3982r987o299k5654
10249B77799l0417p4p352K1700R556J8822P26k9320j2170K4672P263k4949N735
10236B61991m311k7371K767Q811M996J198k1244j5510q288k2147L50k9793R99
10223A52448M807k6854n234J3361j1709j0603j1988K1856M5535J6878j3860j0034
10211A64603J1370K6137k1355l4815l406K9288N482R518J177k1217j3615l3504
10199A19663j6198K1189R223R437J6089J0320K136k7598k6946K437L902O631l640
10186A26645j1788j7331j1444J5518K0275J127l950j0022j3577l1633r31J9650
$$ y = [383028, 384805, 379592, 391872, 379963, 372920, 355730, 350125, 325474, 341047, 358653, 377311, 374042, 379862, 376717, 374255, 366045, 372668, 389000, 385532, 351788, 333721, 319739, 309752, 303453, 277799, 247382, 247308, 239956, 261656, 271212, 290034, 290760, 261440, 249270, 273942, 281205, 256256, 261991, 257680, 230309, 233076, 241887, 246883, 248081, 226837, 211327, 203039, 180892, 181242, 151449, 152448, 157255, 130401, 125167, 138528, 126819, 116216, 104228, 126084, 171619, 188497, 174637, 164603, 175973, 202110, 180755, 145940, 142534, 171822, 177304, 186822, 187999, 166782, 153167, 119663, 103465, 124654, 133877, 143314, 159403, 169723, 171859, 144261, 117315, 119752, 123654, 130285, 126645, 114857, 97526, 86082, 101600, 121875, 123002, 119052, 109030, 95453, 63820, 62889, 82539]
10174H2539J7889o28Q951L4065N284J5814K9654K8574J4397l1986j9830N2643
10162B37366L7865M4660L9324P8678J05328J44115J39230J60492J34369R1368
10152A212795O399j7761r2976j07470j65786j86113j35140p8929p3505l6737k621
10141C22156k5589j3446l5762j2205o765L653J7598j5035o1395p280n164O173
10129A66939K2711j8090j1555p559Q117M339l528K740K1086L4500O411L016J5980
10116B45107l189J8816j2727k3137l4956j1433n919J2091J5458K0021J4856K8430
10104B63418K0173P0543P9021Q5119P4091Q4468R9083N9728R685m9169m7419o7954
10092F80787j18572p8499o5648l6007n4032m9175j4277j509j7137K0947J0774
$$ y = [82539, 100428, 99800, 108751, 142816, 148100, 163914, 193568, 222142, 236539, 204553, 184723, 237366, 275231, 319891, 359215, 437893, 543221, 687336, 826566, 987058, 1121427, 1212795, 1219194, 1201433, 1108457, 1000987, 835201, 649088, 513948, 435019, 361514, 324777, 322156, 296567, 283121, 247359, 235154, 228389, 232042, 249640, 234605, 173210, 165930, 160766, 166939, 189650, 171560, 160005, 152446, 160563, 164902, 161374, 164114, 185200, 219700, 226111, 229127, 245107, 241918, 260734, 248007, 224870, 189914, 178481, 172562, 184653, 200111, 220132, 234988, 263418, 283591, 354134, 433155, 518274, 592365, 676833, 775916, 835644, 845329, 796160, 748741, 680787, 562215, 483716, 418068, 382061, 328029, 278854, 264577, 263068, 245931, 266878, 277652]
10081B77652q609Q614K8787J877j2113P770j0589J1599L9313P8900N9201N7285
10069E39687J28964J34334J59981K32323K75195L16557J99904R3045Q2563J2140
10059B174693j02178k40865l40427l00335k38403j68418q4886n0431o8085q8412
10049D92253p7345p9014k3283j3454p579M294j512k2829R366J9131O453j9198
10037B87283k8959m1815K8466n005k2552j9666N409R393l403j9094k2148j7507
10025A50402k6983K5445Q626q553N605j236K39K1364k998n58j9091m1854k0096
10012I0312j254j1042K2147K0413L6232J3604K564k7711L465L160L615j7520j2287
9999A25698K2451J6226k4569l1094l738p62L971l881k8477n678J7184N682p714
$$ y = [277652, 269043, 277657, 306444, 308321, 296208, 303978, 293389, 304988, 344301, 423201, 482402, 539687, 668651, 802985, 962966, 1195289, 1470484, 1787041, 1986945, 2079990, 2162553, 2174693, 2072515, 1831650, 1491223, 1190888, 952485, 784067, 699181, 648750, 580665, 492253, 414908, 335894, 312611, 299157, 291578, 295872, 294360, 271531, 280897, 300028, 306481, 287283, 258324, 216509, 244975, 239970, 217418, 197752, 203161, 212554, 209151, 190057, 167909, 150402, 123419, 148864, 157490, 148937, 154542, 153306, 153545, 174909, 171911, 171353, 152262, 110408, 90312, 89058, 78016, 100163, 120576, 156808, 170412, 172976, 145265, 148730, 151890, 155505, 137985, 125698, 148149, 164375, 139806, 108712, 104974, 104212, 108183, 104302, 75825, 70147, 87331, 93013, 85299]
9986H5299j3305J0183k2491q556J7429J0498K868k7964k4086r342J1177n846q311
9973A7553J3696L249j0755j5396L3273K9267M1057P986q424j4680j5610R923j529
9960H9610j4169j5614k651J6985J4213K762j7317j309J0252K2831K8877p268l4741
9947I2461j4932j1986j902j3053J2495j0912j4486j5862J2523J3717J5192M301
9935F7556k958k6059J7280R230j7779l1963r685J0578N2967j6540j5531O56J9238
9922E6990J5026j5064j546J6668J9742j0312K566k8598l7011j9229q017J7811
9910I026K5524r243n981J3085n214j7665L384n355L5180M455o414N883K9765j6726
9896E9704k6706O57J4113Q731l8128j5357J4176K3251n116M51j396k318J4484
$$ y = [85299, 71994, 82177, 59686, 51130, 68559, 79057, 81925, 53961, 29875, 20533, 31710, 25864, 17553, 31249, 34498, 23743, 8347, 41620, 70887, 111944, 119930, 111506, 96826, 81216, 91139, 89610, 75441, 59827, 57176, 74161, 88374, 91136, 73819, 72510, 82762, 105593, 134470, 127202, 92461, 77529, 65543, 63641, 50588, 63083, 52171, 37685, 21823, 34346, 48063, 63255, 67556, 64598, 38539, 55819, 65049, 47270, 15307, 5622, 16200, 69167, 52627, 37096, 37752, 56990, 72016, 56952, 55406, 72074, 91816, 81504, 84070, 55472, 18461, -768, -8785, 9026, 34550, 25307, 19326, 32411, 27197, 9532, 12916, 7561, 42741, 47196, 40782, 46665, 76430, 59704, 32998, 33655, 47768, 56499, 18371, 3014, 17190, 40441, 35325, 35776, 34380, 32062, 46546]
9883D6546K3390K957k7317r058P712k4002R386J5983k463R998k028k2807q376
9870A9921K0359J2429k1877J0533r672O946N816P846L953j7147j1552j3962l383
9857A0210J2081O596L0384K2770P200l5716l3118K1002R559L3510Q498r099k0693
9844F3184k7153n543M33N346M232j535J4603R68J0282N157k1520j3419M51k622
9830C2864n99R394J8935j9383N177p07N002m1744K038J3064r808l3656N203j320
9816a5540L1735J4317N313N204L2040j1401P541J1672k7835j8286r490p611Q271
9803B5930k4616k0668K2985K0490k6447l810K0026J8121j6433L31j167L498J0545
9790B8785j0048j1287j0564J6051K5920P819j4631p451K4775K1145j3415j4786
$$ y = [46546, 69936, 72893, 45576, 36518, 44230, 20228, 29614, 45597, 43134, 53132, 51104, 28297, 19921, 40280, 52709, 30832, 41365, 31693, 38639, 44455, 52301, 56254, 39107, 27555, 13593, 10210, 22291, 28887, 59271, 82041, 89241, 53525, 20407, 41409, 50968, 84478, 92976, 83877, 63184, 36031, 30488, 30921, 36267, 40499, 38964, 53567, 54535, 64817, 69974, 48454, 35035, 35486, 32864, 32265, 41659, 60594, 41211, 46388, 45681, 50683, 8939, 10977, 24041, 14233, -19423, -14220, -15540, 16195, 30512, 35825, 41029, 73069, 61668, 69209, 80881, 53046, 34760, 25270, 17659, 25930, 1314, -19354, 3631, 24121, -2326, -6136, 13890, 32011, 15578, 15909, 14742, 18240, 28785, 18737, 7450, -3114, 12937, 38857, 46676, 32045, 24594, 49369, 70514, 57099, 42313]
9778D2313J925J7194k913j6525K1699q362k8953K4973J8856l0806j7982k8706
9766g287J5346K9751J9176K6795j111k4274j5811p821M543K0999j5439L361R917
9753E8145j2663J2857R67l488k320j1240o328O995r322l36J1687l1409o542L159
9739A0162k0265J845N3317J4694k1714p718n9j249K0354j7782J5084L4855K0169
9726A01693K247k8367l8178p263O060j1287L091R296l527l0381J3784L5016r944
9713D2240j9615m5727r241L0029M7352P570k2512R213k506j7976L695l177r661
9700I684K3111Q919j8421j1283O406J9533j6460J6566p342j5437L392j031Q430
9687B6067J2974j520o956L453j2068l977J3981P26Q196q735k3489j4490j548J2695
$$ y = [42313, 44238, 61432, 58519, 41994, 63693, 55331, 26378, 51351, 70207, 39401, 21419, -7287, 8059, 37810, 56986, 83781, 82670, 58396, 42585, 34764, 39307, 60306, 44867, 48228, 58145, 45482, 58339, 59306, 55818, 53498, 42258, 35930, 42925, 33603, 33267, 44954, 13545, 7003, 10162, -10103, -8258, 45059, 59753, 38039, 30321, 30262, 29013, 49367, 31585, 46669, 81524, 101693, 103940, 75573, 37395, 30132, 36192, 24905, 27996, 37292, 33765, 3384, 17168, 52184, 42240, 22625, -23102, -32343, -2314, 45038, 52608, 30096, 39309, 36803, 18827, 22522, 19345, 9684, 32795, 41714, 23293, 12010, 18416, 37949, 21489, 38055, 30713, 15276, 18668, 17637, 26067, 39041, 37521, 30565, 34018, 21950, 17973, 31954, 32680, 40876, 32141, 8652, -5838, -7386, 5309]
9673E309M378P095r47K5109J0698m507L994l328L2965J4794m7449l4324j8148
9660d361j1832K5939J2449j726j0863k6215J6252L1053M44J694m127k911Q45j5745
9646A0896J844k796O249R437j7697M3713K3488j4914k0233k3937o710K4915J1487
9633D5742j4670k0648L564j3458k071J1730O958J2529q187n721N289O104k0864
9620F297j205J1808J3300j5267k3128J107l5250O815M7155R566J3105J3144j7921
9607B9526m2776L616L2527p315l9677j3876J8726M0431k554j8659k2240J0860
9595a1411L3568k300k420K1880j4119k9704O919K4690j5026r270P010l575J1915
9582A8157r393j6257L481j751k0544J3248K5730K6854J1881J2891j7185k0187
$$ y = [5309, 9687, 16782, 15835, 40944, 51642, 47135, 51129, 47801, 80766, 95560, 48111, 13787, -4361, -16193, 9746, 22195, 20469, 9606, -16609, -357, 30696, 31140, 32834, 28707, 25796, 26641, 10896, 12740, 9944, 16193, 25630, 7933, 51646, 75134, 60220, 39987, 16050, 9340, 34255, 45742, 31072, 10424, 13988, 530, -1541, 10189, 17147, 29676, 21489, 15768, 21057, 27161, 6297, 5092, 16900, 30200, 14933, -8195, -7088, -42338, -35523, 11632, 21198, 34303, 47447, 29526, -13250, -9634, 22893, 15578, -24099, -37975, -19249, 21182, 18628, -31, -22271, -11411, 22157, 19857, 17437, 39317, 25198, -4506, 2413, 27103, 12077, 2807, 9817, 6242, 18157, 8764, -7493, -4012, -5763, -26307, -13059, 12671, 39525, 51406, 64297, 47112, 26925]
9570B6925J0581K3793j3894l568k0991o750k788q569k413M021l608j435J2024
9557A3328K849Q081K4220N072k1524j6359J2833R074P823j919k713j0181k1579
9544I005J861j275j7916Q048K0577J5418L0003m478l9021o257N727J3277N966
9531D0935M436O951k7166M43P707J1902r549k521j3270m4600m500K8463L722l90
9517B563r716j871K2812J0168J1530r969r106K9021k41K572j0551j021r44j0969
9503B4278p823K726m233K5762L365j3048J6781O297j3433l5928k7339k48K4304
9490A461K5957j578Q652k1608o174p532k1651J6327j4626J9231J8539n722p962
9477C314O047K9321J8469K9658M453k9139k2464j5887o153J4420J61j1969o200
$$ y = [26925, 37506, 61299, 47405, 43837, 22846, 16096, 13308, 4739, 2326, 6347, 2739, 1304, 13328, 16177, 24258, 48478, 53550, 32026, 15667, 28500, 37574, 45397, 43478, 40765, 30584, 9005, 10866, 9591, -8325, -277, 20300, 35718, 65721, 61243, 22222, 15965, 21692, 34969, 40935, 45371, 52322, 25156, 25599, 33306, 45208, 35659, 33138, 19868, -24732, -29232, -769, 2953, 2563, -7153, -9024, 13788, 23956, 35486, 25517, 16411, 45432, 45191, 47763, 37212, 36191, 35247, 24278, 16455, 19181, 14948, 40710, 44075, 31027, 47808, 54105, 40672, 4744, -22595, -22843, 1461, 27418, 25840, 34492, 12884, 6710, -822, -22473, -6146, -20772, -1541, 16998, 11276, 3314, 9361, 38682, 57151, 86809, 91262, 62123, 39659, 23772, 17619, 32039, 32200, 20231, 14031]
9464A4031m408L600m296K7433O265l5451K228J9581K3279L761P816k1660k8601
9451A3578K2679J0038k1677j6899k1352J8335o263K5929J9836k709R009k3158
9439B7346j5784R881j0572l5506k9871K0175O8269L9900m216q857j5596J2549
9427E7718O963j6706l0560K6642L9429k4011j4861m439k9350k1073J0251K7304
9415B7307R581J8349J7418k216k4428k755N008n513M379R554N467k073K272M313
9401F6663j5071j6803l778k3043l986M3448O188k2006j3473r284K8013j6264j1434
9388I170R147K3008j152q662r691L958L1392l082r574K83j375j4699n758L284
9374B6249r866j5929p256J284K0814J098r394Q649K574N00N490p775o287K7075
$$ y = [14031, 9623, 13223, 8927, 36360, 42625, 7174, 9402, 28983, 52262, 56023, 63839, 42179, 13578, 36257, 46295, 24618, 7719, -13633, 4702, -1561, 24368, 44204, 41495, 50504, 27346, 11562, 21443, 10871, -24635, -54506, -34331, 33938, 73838, 69622, 60765, 45169, 57718, 64681, 47975, 17415, 44057, 83486, 59475, 44614, 40175, 10825, -10248, 3, 27307, 36888, 55237, 72655, 70439, 46011, 43256, 48264, 42751, 47130, 56684, 62151, 60078, 62350, 66663, 51592, 34789, 31011, 7968, 3982, 47430, 53618, 31612, 18139, 8855, 36868, 20604, 9170, 18317, 41325, 40173, 31511, 21820, 25778, 57170, 54088, 44514, 44797, 43422, 28723, 22965, 26249, 16383, 454, -6802, -5518, 15296, 16394, 7000, 15649, 18223, 18723, 24213, 16438, 10151, 37226]
9360C7226K9052k186j7037R890P434N593k9200l5069q758J6853R476j2835j8314
9347g875m101J5405K0782O222l846R10J0000j0766j0125J4018k571o926J885K7349
9333E0361k5677j9748q568J9850J9073J3951q536p298M568J6338O819J0005k4166
9320D6972Q244J1517j384k1676l6442P474K5407L2227p16l9874k2394m535R538
9307A4358P511m262Q863L3631K644l7733N468J897K164J8240n553K644k6041l0631
9293f800K037j9743q155L6777R670J1541j3069q498J8348j3856J630J817N9j9566
9279g808j4720J3340J5770j902m248J7842Q735K6395J5949J960r875j3394l0669
9266A7375m530K2433j2734m5148J8162K4362r350J3923j1938m896k0827J728J4546
$$ y = [37226, 66278, 64092, 47055, 56945, 64379, 69972, 40772, 5703, -3055, 13798, 23274, 10439, -7875, -11976, 3429, 24211, 30433, 26587, 27497, 37497, 26731, 16606, 30624, 28053, 21127, 23012, 50361, 24684, 4936, -3632, 16218, 35291, 49242, 40706, 33408, 37976, 54314, 61133, 71138, 46972, 55216, 66733, 65349, 43673, 7231, 14705, 40112, 72339, 71623, 31749, 9355, 4820, 14358, 21869, 17607, 26470, 60101, 62745, 25012, 30480, 32377, 34541, 52781, 47228, 49872, 23831, -6800, -4763, -24506, -32661, 4116, 13786, 25327, 12258, 3760, 22108, 8252, 9882, 11699, 11758, -7808, -22528, -9188, 6582, 4680, 432, 18274, 27009, 53404, 69353, 71313, 61438, 48044, 17375, 12845, 35278, 22544, -22604, -4442, 19920, 10570, 24493, 12555, 7659, -13168, -11440, 3106]
9253C106L219j6199K8398l319O287p498J290P704j9334J73J5488K0297P454o586
9239D0480L438Q131k0867q940L0377O703j7821P450J3624J4853o944K889P428
9226H0801k3645k625K3560k3470j4111j1650l8831j694J2031P622q655j27J4155
9213A3361K0922J989j887K4714L2016p294l4136K6959R275j832j7367k7563j8969
9200B0188J7549J1820J5871J807J0809m0720k6412K7359M14r730J0750J6971J22
9187E6798J1296J0928l345n024K6790k6977m4048k4183j4556L2997L6545J1507
9175F8728l5953J3081o153K517J5374j9640P216q475j7808K355J8083P266k0630
9162B5961J6562K7446j1707n3395j8826L2972J3777P552J636J8073j8333n499
$$ y = [3106, 6325, -9874, 18524, 15205, 21492, 13994, 15284, 22988, 3654, 3827, 19315, 39612, 47066, 40480, 43918, 52049, 31182, 22242, 52619, 59322, 41501, 48951, 62575, 77428, 70484, 73373, 80801, 57156, 54531, 78091, 54621, 40510, 28860, -9971, -11665, 366, 7988, -667, -794, 13361, 34283, 36272, 34385, 59099, 91115, 83821, 49685, 76644, 85919, 84087, 66720, 39157, 20188, 37737, 49557, 65428, 67235, 78044, 37324, 10912, 38271, 38685, 28955, 39705, 56676, 56798, 68094, 79022, 75677, 70653, 97443, 70466, 26418, 2235, -12321, 20676, 57221, 68728, 32775, 45856, 39703, 42220, 57594, 37954, 45170, 36695, 18887, 21242, 39325, 46591, 25961, 42523, 69969, 58262, 4867, -13959, 19013, 32790, 40342, 41978, 60051, 41718, 36219]
9150C6219K5383J3496m632j6923o941j2259j8240j1283K7144r468p716L0311K4933
9137G0024J0498j0608l563m5120m6536K3952J2517J1122J7964j9016p993k065
9125A1176k3782L548K7571K7175J3689Q116K146k2348n1339q325J1279K0261J2590
9112C1757R958r770M729L8553K3589k1541J2035j6565r003n87K339k2919m394
9099C8181J623J374m711q083k0698n54L570j424o957P558M2477K6631j6235m4773
9085A7979J7638K2224M0696K2283j5551m3621l1853l1800Q62L2535K5844r495
9073D7741L264K8399K0494L356p739m245q792j2392q803R636r907M798j0567j7402
9059C7841R573j4989M546J7174j1522q644r751j4619J5430J4945M4697K5352j1567
$$ y = [36219, 61602, 75098, 70466, 53543, 46602, 34343, 16103, 4820, 31964, 22496, 14780, 45091, 70024, 80522, 69914, 66351, 21231, -25305, -1353, 11164, 22286, 40250, 21234, 13241, 11176, -12606, -9058, 18513, 45688, 59377, 67493, 69639, 47291, -4048, -12373, -1094, 19167, 31757, 41715, 31945, 36674, 75227, 98816, 77275, 89310, 72745, 63742, 63155, 65494, 42575, 38181, 39804, 41178, 36467, 28384, 7686, 7132, 10702, 9278, 2321, 9879, 52356, 78987, 62752, 17979, 35617, 57841, 98537, 120820, 105269, 61648, 29795, -2005, -1143, 31392, 57236, 47741, 51005, 79404, 99898, 103254, 95515, 91270, 82478, 70086, 61283, 70919, 61012, 65810, 55243, 37841, 47414, 32425, 36971, 54145, 42623, 33979, 24228, 9609, 25039, 39984, 84681, 110033, 98466]
9046I8466n2119k2816J619L19J2293J3307L9272r710j7184Q85J7407J1980k1847
9033G1872l311K1459N0265L7164l0003l4029o192j7028p188L58k41q029k4933
9020E0164j6753J5842J5039n816k6123k980J8214j7318N520O3087j8687k7527
9008E2662N343K0224J5116N126q440r066L232m778j7193Q348N927n033j5521J1073
8994F7020l314m698j0961N7055J0048j9828J1610J6340k6016k5960n087k3685
8982D2524L9915J6270J5637J0536N0k910r292Q99m525J5177k807j2467o498J6646
8968A19155K5609N653j65m582j1348J5697K0702m437j0672m813k3901j5560J6413
8955A27751L1250M915m8953l3018J3241J3847J3834J0114k4395j3703K3267R972
$$ y = [98466, 46347, 23531, 25150, 25469, 37762, 51069, 90341, 80631, 63447, 64332, 81739, 93719, 71872, 68561, 90020, 140285, 177449, 147446, 113417, 107225, 90197, 83009, 83367, 83126, 75097, 50164, 33411, 49253, 64292, 58476, 32353, 29373, 47587, 30269, 35789, 98876, 80189, 52662, 58005, 78229, 93345, 98471, 90031, 80965, 84197, 79419, 62226, 70574, 76501, 71468, 55947, 67020, 63706, 59008, 48047, 105102, 115150, 95322, 106932, 123272, 97256, 71296, 66209, 42524, 82439, 98709, 114346, 124882, 124932, 122022, 112730, 113629, 109104, 124281, 121474, 109007, 102509, 119155, 144764, 150417, 150252, 145670, 134322, 150019, 170721, 166284, 155612, 150799, 126898, 111338, 127751, 159001, 163916, 114963, 81945, 95186, 109033, 122867, 132981, 108586, 94883, 118150, 128122]
8943A28122p860j6637p049O056k077L911K7667K4243K4010l576k766m2842r74
8930A30228L6610K3712j1502k2086R675J402N909j1936l259j3343n512o265K3754
8917A57387m361L946J6428J7560L5919R469p411l4555R535J946l4183n850q171
8904A57659P524L1050J4228O01j0364J0026O187j8684J0902K2264q166j225l8641
8891A83361l1596O722J1332K2402J6154J0334o851M053K599j2855j0347k0682
8879A74626J3217Q468j4722J4531k3152k3077L1180M1814k2292J2120N460j5826
8867B02347r438K3302O163j7394K2609K833k9566k3879m168K098L4077J1085K7639
8854B47708l079K308j7912J8219J1076M140J9252N538M41q402j6047j2574L8625
$$ y = [128122, 120262, 103625, 96576, 102632, 100555, 104466, 132133, 156376, 180386, 176810, 174044, 131202, 130228, 166838, 190550, 179048, 156962, 166637, 168039, 173948, 162012, 158753, 145410, 139898, 133633, 157387, 153026, 156972, 173400, 190960, 226879, 236348, 228937, 194382, 203917, 205863, 171680, 165830, 157659, 165183, 196233, 210461, 211062, 200698, 210724, 216911, 198227, 209129, 231393, 223227, 222002, 183361, 151765, 158487, 169819, 192221, 208375, 218709, 211858, 215911, 218510, 205655, 195308, 174626, 187843, 196311, 181589, 196120, 172968, 149891, 181071, 222885, 200593, 212713, 218173, 202347, 192909, 216211, 222374, 204980, 227589, 230422, 200856, 176977, 172809, 174907, 208984, 220069, 247708, 244629, 246937, 229025, 247244, 258320, 262460, 281712, 287250, 287691, 279289, 263242, 250668, 289293]
8841B89293J647l0074J0176L4720R118l0833j1141K5060K690J0622j5021J702
8829B97959R867N1725Q201k1072q079J1078J1452J2548j5977p309l598L8912m975
8816C80732J2130K9927L5343K3017j8963k2137J8236J3464M019J3791L673N648
8804D98880L0349J1003O110R800K834j1962k0207O484K2355J6815N3J7093N528
8791E95135j0417J5177K1029M68j9034j7427J9227m296q674J8672L4929L7467
8779F82256k2881n966L9144L0576J0768L6350L9426k868j5254k298j1002r360
8767G68891Q425J5058K9049K4515L3248L1528K1374L9448K7780k758L545o385
8755I93718L4898N2483N1419L3966J4950J7853J5184M6819R078P333L1037L3694
$$ y = [289293, 290940, 260866, 271042, 305762, 314880, 284047, 272906, 297966, 300656, 311278, 296257, 297959, 307826, 359551, 367752, 346680, 338601, 349679, 361131, 373679, 357702, 350393, 346795, 385707, 380732, 392862, 422789, 458132, 481149, 462186, 440049, 458285, 471749, 475768, 489559, 493232, 498880, 529229, 540232, 546342, 556142, 558976, 547014, 526807, 533291, 555646, 572461, 572514, 589607, 595135, 584718, 599895, 620924, 621392, 602358, 584931, 604158, 599862, 591188, 609860, 644789, 682256, 659375, 653409, 692553, 723129, 733897, 770247, 809673, 806805, 791551, 789253, 778251, 768891, 777316, 792374, 821423, 845938, 879186, 910714, 932088, 971536, 999316, 996558, 1000103, 993718, 1028616, 1081099, 1132518, 1166484, 1181434, 1199287, 1214471, 1261290, 1270368, 1277701, 1308738, 1342432]
8743A342432P1626M5167K0234L1989K8390N8737O0126L2461M4469M9883N3828
8732A839342P2493O6919N8378M0344P1117L6147M9665N7500Q3805R6790P4884
8721B547384J14197J29080J02237P9778P8957J10494J23468J24742J05463J37152
8711C652952J74025J88373J75119J99117K03868K32239K10707K54255K82557L13194
8701E886406K85964L32318L72470L75806M07398M35710N08114N37461N83169O28071
8691A0352887O76787O97885P75377Q56263R32995R87229J092771J178211J276596
8682A8827001J419421J524394J658697J793556J906015K008193K143985K185648
8674C3466910K234991K189329K071469J924777J736228J449255J082665O76624
$$ y = [1342432, 1414058, 1459225, 1479459, 1511448, 1539838, 1598575, 1658701, 1691162, 1735631, 1785514, 1839342, 1911835, 1978754, 2037132, 2077476, 2148593, 2184740, 2234405, 2291905, 2375710, 2472500, 2547384, 2661581, 2790661, 2892898, 2972676, 3051633, 3162127, 3285595, 3410337, 3515800, 3652952, 3826977, 4015350, 4190469, 4389586, 4593454, 4825693, 5036400, 5290655, 5573212, 5886406, 6172370, 6504688, 6877158, 7252964, 7660362, 8096072, 8604186, 9141647, 9724816, 10352887, 11029674, 11727559, 12502936, 13359199, 14292194, 15279423, 16372194, 17550405, 18827001, 20246422, 21770816, 23429513, 25223069, 27129084, 29137277, 31281262, 33466910, 35701901, 37891230, 39962699, 41887476, 43623704, 45072959, 46155624, 46832248]
8666D6832248J95647k30336o53427j026219j307787j557691j730701j816224j843130
8657C6862380j868401j862898j783097j687120j594664j532403j438677j337746
8649B3757374j187585j117026j093975j004419r28144q74194p93913p77519p18295
8640A5262304o48729o01264n97502n47885n20256m82822m48319m08501m18264
8631A0588762m00598m07697l41842l21231l12363k95760k81511k72017k47964
8622G707779k52080k47851k35605k01562j68976j73769j93297j64848j44087j72253
8612E753451j68237j41282j23101j31031j43521j55796j20998j46976j07277j33400
8602D381832j65289j20064j12083j22570j14486j23386r0863r3738p8995j00946
$$ y = [46832248, 47027895, 46797559, 46144132, 45117913, 43810126, 42252435, 40521734, 38705510, 36862380, 34993979, 33131081, 31347984, 29660864, 28066200, 26533797, 25095120, 23757374, 22569789, 21452763, 20358788, 19354369, 18426225, 17552031, 16758118, 15980599, 15262304, 14613575, 14012311, 13414809, 12866924, 12346668, 11863846, 11415527, 11007026, 10588762, 10188164, 9780467, 9438625, 9117394, 8805031, 8509271, 8227760, 7955743, 7707779, 7455699, 7207848, 6972243, 6770681, 6601705, 6427936, 6234639, 6069791, 5925704, 5753451, 5585214, 5443932, 5320831, 5189800, 5046279, 4890483, 4769485, 4622509, 4515232, 4381832, 4216543, 4096479, 3984396, 3861826, 3747340, 3623954, 3533091, 3439353, 3360358, 3259412]
8592C259412q3987m7767q7966p5703n3224o9469r1296r7292p5863o4756m0518
8581B471571n0450m2416l6162n3322m6485m8773p1472l4422l6688l9694k8370
8570A983317q3996n2292j1617l4141n8699j3858k205p436k5554n6283r4601n9154
8558A483481k706m992k2j4075l3804p0671n5048j3531k2565k2179l6183j5722
8546A191983J9909k7632l3731n1009o3402m7710j6701k9664q630k5403l2734j6839
8534H58437j5652P713k1610k2321j7125l7119j294M30l3014L10J5372j5980J2180
8521G30327L6160l6177o148j5185j9914o316j0452l4836j2111k921L0637J5110
8509F68174l9280k3336o203o532J5461m3130k7617P58K309R067J0421l939j8847
$$ y = [3259412, 3175425, 3127658, 3039692, 2963989, 2910765, 2841296, 2750000, 2652708, 2576845, 2512089, 2471571, 2421121, 2378705, 2342543, 2289221, 2242736, 2193963, 2122491, 2088069, 2051381, 2011687, 1983317, 1899321, 1847029, 1835412, 1801271, 1742572, 1728714, 1726509, 1719073, 1693519, 1637236, 1542635, 1483481, 1480775, 1475783, 1475761, 1461686, 1427882, 1357211, 1302163, 1288632, 1266067, 1243888, 1207705, 1191983, 1211892, 1184260, 1150529, 1099520, 1036118, 988408, 971707, 942043, 933413, 908010, 875276, 858437, 842785, 850498, 828888, 806567, 789442, 752323, 751029, 751459, 718445, 718755, 734127, 718147, 730327, 766487, 730310, 724162, 708977, 689063, 682747, 672295, 637459, 625348, 622427, 653064, 668174, 628894, 605558, 599355, 592823, 608284, 565154, 537537, 538295, 540604, 549671, 560092, 556153, 537306]
8496E37306m818N114n170M378P870q357j0142j5429j8635j7808j5166M225J2255
8483D75623K882m140k4343M195K0869K572p618M881R057J759k1234j3926j3489
8470D37088k6554J1501K6452j0934j3697J2601K3082O811O252K8833R068m4929
8458D65574j5249P907k8313j5618K555l5896m0892k6594k0415k3943K2683K1547
8446C13346k038k4463j3039L604k390k0097r060k2066J5056J8015L2725J0430
8434C00023q070l5062q871O31o688j9233K1403M020K0077J0568J8072J7796o810
8421C07856k4575R68j4797l841K7479j5093l6159o965O242L223N584k35k8524
8408B21163J0374K1186r092K620L3553K762l0311q11m425k3040k3980Q902J5211
$$ y = [537306, 532488, 537602, 532432, 536810, 544680, 536323, 526181, 510752, 492117, 474309, 459143, 463368, 475623, 478505, 474365, 450022, 454217, 475086, 477658, 470040, 474921, 483978, 485737, 464503, 450577, 437088, 410534, 422035, 448487, 437553, 423856, 436457, 459539, 466350, 472602, 501435, 510503, 465574, 450325, 458232, 429919, 414301, 416856, 380960, 340068, 313474, 293059, 269116, 291799, 313346, 311308, 286845, 273806, 277410, 275020, 254923, 245863, 223797, 238853, 256868, 289593, 300023, 291953, 256891, 248020, 248651, 241963, 222730, 244133, 248153, 268230, 278798, 296870, 314666, 307856, 283281, 284249, 269452, 265611, 293090, 277997, 241838, 234873, 241115, 244338, 249922, 249687, 221163, 231537, 252723, 243631, 246251, 279804, 282566, 252255, 251444, 247019, 223979, 199999, 208901, 224112]
8395B24112J5463l6515k7075N411J4753J3600L4475K4089l0403J0132N4088O1325
8383C63455J8941N8127N3878N9389P1392J08390N9759O3924N9065M0586Q320j0553
8371I54673n5510q4240p0076r7643r6903n4729l9039j7231o0915n0483l1499j2030
8359B84375J7824j2176k5894J255M4887p948l8715l1561J1325J8738L3334J0314
8347C05758k6608n2485k3030P966K5882J8297K1734J7092R899N1166N3126L5461
8335D44258L5782L6336O0708K3575J1347k0543k2704p278r522l7006m1597k9714
8323D43642j8980k2633l6094l7403P715p408p624n665l5634l2368K1534L243m5040
8310B27285o163q357j3181o216J2641l8072k9323j7398j350Q005J7585O893p445
$$ y = [224112, 239575, 203060, 175985, 181396, 196149, 209749, 244224, 268313, 237910, 248042, 302130, 363455, 382396, 440523, 494401, 553790, 625182, 733572, 793331, 857255, 916320, 956906, 965226, 954673, 899163, 814923, 744847, 647204, 550301, 495572, 456533, 439302, 378387, 327904, 296405, 284375, 302199, 290023, 264129, 265384, 310271, 302323, 263608, 232047, 243372, 262110, 295444, 305758, 279150, 226665, 203635, 211601, 237483, 255780, 277514, 294606, 304505, 355671, 408797, 444258, 480040, 516376, 577084, 600659, 612006, 591463, 568759, 561481, 551959, 514953, 473356, 443642, 424662, 402029, 365935, 328532, 336247, 328839, 321215, 315550, 279916, 247548, 269082, 272325, 227285, 221122, 212765, 199584, 193368, 206009, 167937, 138614, 121216, 119866, 127871, 145456, 152349, 144904]
8297A44904K371k5884J378K9890J2389J4297j4881k536N641o973n471l5977J9804
8284A38952j5571j0403J3327j901R565J4509J0310j0907j7271k6782M278K8749
8272A36855k3908J3574j7030k2790J3750K8857k524K295r803J5734o223j015k3501
8259A04271k1669j3063r095P257M4737K2335L132L076p840k3441j2634j9876J3459
8246I0649m930JL96m620K7303J3082J2381O17k5387k853M242K3244k1524J5284
8232A27885K4011p271k5306J6318m395j8478K5047j4144r70k928J3413r07k1226
8219A11049K429K3051k219N241j3440o248j4551p22l023o08j073p891k1945k5844
8205D4206k426j7944J5365K3255L244J2346k3856j417l753j9530J4423K5860L6110
$$ y = [144904, 147275, 121391, 122769, 152659, 165048, 179345, 164464, 161928, 167569, 160596, 155125, 119148, 138952, 123381, 112978, 126305, 124404, 133969, 148478, 158788, 147881, 130610, 103828, 108106, 136855, 112947, 126521, 109491, 86701, 100451, 129308, 126784, 129079, 119276, 135010, 128787, 127772, 104271, 82602, 69539, 60444, 67701, 112438, 134773, 137905, 140981, 133141, 109700, 97066, 77190, 90649, 85719, 85720, 86116, 81496, 108799, 121881, 134262, 134879, 109492, 106639, 110881, 134125, 112601, 127885, 151896, 144625, 119319, 135637, 131242, 112764, 137811, 123667, 122697, 119769, 133182, 132275, 111049, 113478, 136529, 134310, 139551, 126111, 119863, 105312, 104590, 101567, 100959, 99886, 91995, 70050, 44206, 41780, 23836, 39201, 62456, 65700, 78046, 54190, 52773, 49020, 29490, 43913, 69773, 105883]
8192A05883J5498k6946m4088j1454K2705j1456J9799N99Q71l178J3499M229k6205
8179E9756k6204R530M1151J012J512j2003j5920N098J1183k1591k6280j3848l277
8166A0119M523k875J0652L3188K2202K566m0213j0964M6664R384O757J5265J7299
8153A24567q391j8561J0159k3935j5060Q646q946J818J247J505J2762J2819m52
8140I8178j8902k9969K7055l089L150k960J1262P214O533j6631j371k4298j2381
8127D3791R378j8608J5305Q072J844j4808l3079L683N8013J1926P735k2300l2421
8114C8531k335K927K993J8844K9996n933j7164j0948l098K702m969L845j8499
8101C6892q328L689k234J6865o338J2194m201j4793J0643N208J7086k0679O016
$$ y = [105883, 121381, 94435, 50347, 38893, 61598, 50142, 69941, 70540, 71411, 68233, 81732, 85961, 59756, 33552, 43082, 84233, 85245, 86757, 74754, 58834, 63932, 75115, 53524, 27244, 13396, 10119, 14642, 11767, 22419, 55607, 77809, 80375, 40162, 29198, 75862, 85246, 92003, 107268, 124567, 116176, 97615, 107774, 83839, 68779, 77425, 68479, 70297, 71544, 73049, 85811, 98630, 98178, 79276, 49307, 76362, 73273, 76423, 73463, 84725, 91939, 98472, 81841, 80470, 56172, 43791, 53169, 34561, 49866, 57938, 59782, 44974, 11895, 15578, 73591, 85517, 93252, 70952, 38531, 36196, 39123, 42116, 60960, 90956, 85023, 67859, 56911, 53813, 56515, 51546, 55391, 36892, 28564, 32253, 30019, 46884, 40546, 52740, 48539, 33746, 44389, 49597, 66683, 46004, 52020]
8088E2020P174j5765N247O273j3568j5885j939J8417N159k408L40J7372O949k72
8074F9114r675L75K3701K0164j6043j2631l796r378L724K6339Q65o625K243J2724
8060A01101j6951k6117j5519K4092j5955q419r029J7997J8751j242K77j2045J3032
8047F9973M3607k5461l2953j2788j6121K2459N7248J1822o918l7859j8682J02
8035E4429L835j6392m706M0567P433M755K5316N661l166k2629K252j0870j1793
8022G4692k2869L4682J4691O764j4543k2127p86K6639m022P838J7768J2627j0986
8009A20368l1615l2760j5443J6257N034R154j5481J3507R965J0830O537L673J028
7996A01054j3182j3413o366K0491l178j9787j7181L4244J7299q41K516l3712l0745
$$ y = [52020, 59194, 43429, 48676, 54949, 41381, 25496, 23557, 41974, 47133, 44725, 45065, 62437, 69386, 69114, 59439, 59814, 83515, 103679, 87636, 75005, 71209, 61831, 65555, 91894, 92759, 86134, 88377, 101101, 84150, 58033, 42514, 66606, 50651, 42232, 33203, 51200, 69951, 68709, 68986, 56941, 69973, 113580, 88119, 55166, 42378, 26257, 48716, 105964, 117786, 110868, 73009, 54327, 54429, 58264, 41872, 37166, 77733, 85166, 89921, 115237, 120898, 117732, 95103, 97355, 86485, 74692, 51823, 86505, 101196, 107960, 93417, 71290, 70504, 97143, 93121, 100959, 118727, 131354, 120368, 88753, 55993, 40550, 56807, 61841, 70995, 55514, 69021, 78986, 89816, 96353, 100026, 101054, 87872, 74459, 68093, 88584, 85406, 65619, 48438, 82682, 99981, 99140, 101656, 67944, 37199]
7983C7199N98L6228J0954k3560j1336K6660J0186j7568J2858N172l341L1172L127
7970A18349L290J228j7476j4377J3111J3784j734j4361n16o005r098j1201N259
7957H0253J814j9406m513K2042R235k6351j1720J931j995N830L970k647j0334
7944D8109j1655L390L1064Q954P256j675l948O291j9783k3427P01K1499m75L9873
7930A06174K0016m6570k2137J9610j998Q003J5630j2208o017K644K8256k9944
7918H1459j8913p723q985k5282J1833K8925p281R866j898m951J670l0545Q186
7905C6361K2961k6821j7961J6533L2827o400k3491M312J974K3515N818j4695p802
7892D7131j4121q730n28K3200P33q770k7833p167J5024J2430k655k5309K1304
$$ y = [37199, 37797, 74025, 84979, 61419, 50083, 76743, 86929, 69361, 82219, 87391, 84050, 115222, 118349, 121639, 122867, 105391, 91014, 104125, 117909, 116175, 101814, 101298, 95293, 86195, 74994, 80253, 82067, 62661, 58148, 80190, 89425, 63074, 51354, 53285, 51290, 57120, 61090, 58443, 48109, 36454, 39844, 70908, 79862, 87118, 85443, 81495, 87786, 68003, 44576, 45277, 66776, 66301, 106174, 126190, 79620, 57483, 77093, 75095, 83098, 98728, 86520, 80503, 83147, 111403, 81459, 62546, 54823, 45838, 20556, 32389, 61314, 54033, 63899, 62001, 57050, 58720, 28175, 36361, 59322, 32501, 14540, 31073, 63900, 57500, 34009, 38321, 40295, 63810, 69628, 54933, 47131, 33010, 24280, 23752, 46952, 47685, 38915, 11082, 3915, 18939, 31369, 28714, 3405, 24709]
7879B4709L97l996M360J259K6042K4245p600j7349P456L331k442n678p94J7923
7865G1863L951k0170J1950L738n612O063J26j2947N650J6794j0657L311j143p830
7851F5087J0646N480q943L73J2851L492k1811m876k7410K5719K4829q321m7184
7838B9932r776J8531K2119j3047j0425L203L96l8458o391j188K0029K43J956k9557
7824a2433P576Q972j4787j3597J8100M7036N506m4317J0476J9102J402j840K3222
7811E4418p658k3593j9371J7033m97r371J2101r743K5928K41k3821n417R755J0352
7797C0357k467j5790j6330P754J1686m208M149K793K909J0307O721k673J5920
7784E1128n20n370j5660k3525j0376j09K961J875j0269J108M574O736r534o84
$$ y = [24709, 25106, 21110, 25470, 26729, 52771, 77016, 69416, 52067, 59523, 62854, 60412, 54734, 53940, 71863, 75814, 55644, 67594, 71332, 65720, 71783, 71909, 58962, 64612, 81406, 70749, 74060, 72917, 65087, 75733, 81213, 72270, 72643, 85494, 88986, 67175, 62299, 34889, 60608, 85437, 77116, 29932, 20156, 38687, 60806, 47759, 37334, 40537, 40933, 2475, -3916, -5104, 14925, 15168, 17124, -12433, -4857, 4115, -10672, -24269, -6169, 40867, 46373, 2056, 12532, 31634, 33036, 31196, 54418, 46760, 23167, 3796, 20829, 20332, 10961, 23062, 13319, 39247, 39488, 15667, 10250, 20005, 30357, 27890, 12100, -4230, 3524, 15210, 11002, 15151, 17944, 20853, 31160, 37881, 35208, 51128, 50608, 45238, 29578, 6053, -4323, -4432, -1471, 404, -9865, -8757, -4183, 2553, -6981, -7665]
7770g665K8538J4500j5590P361N036j5828J0326j0097k984N643m74o419J4181
7757B6528j3802j39L603r453p69J5244Q298j9974r243k0319J2838l757m155J9293
7743D193O9784q108j5866l1218l552p036j0529k7114K4078J8659K1682n845j3407
7730A5721l6061l2238O802K2810R438L0137o057j7303R514L676M734J2562j726
7717B2009j0550K650L4605P420n791k7207j4090k0728K0980J1992J8188K0843
7705F0321Q691k0326m486k5356k0150R847J3473j7482K263j1870l3522J5448P348
7692a5801J6233L5722J8277J476j9063j5195K0472p663k3446J6648n420k6712
7680d472k5162J6290J1714j3741m574O96Q565J5165P398j7916L884l2262j4533
$$ y = [-7665, 20873, 35373, 19783, 27144, 32180, 16352, 26678, 16581, 13597, 19240, 18766, 12347, 26528, 12726, 12587, 16190, 6737, 5968, 21212, 29510, 9536, 293, -20026, -7188, -10945, -15100, 4193, 73977, 65869, 50003, 18785, 15233, 8197, -2332, -29446, -5368, 13291, 34973, 29128, 15721, -20340, -52578, -45776, -22966, -13528, 16609, 10552, -6751, 2763, 6439, 11173, 23735, 22009, 11459, 14109, 48714, 56134, 50343, 23136, 9046, -11682, 9298, 21290, 39478, 60321, 69012, 48686, 44200, 18844, -1306, 8541, 22014, 4532, 6795, -5075, -38597, -23149, -15801, 432, 36154, 54431, 55907, 36844, 21649, 42121, 34458, 11012, 27660, 22240, -4472, -29634, -13344, -1630, -15371, -19945, -19249, -10684, 4481, 11879, -6037, -2153, -34415, -48948]
7667d8948L0030P855r619j7268p986P0327M0727j6083j5945q899J2399n167k9007
7654B416k8409k70J079m0384j5295J9647L9656N8065o100j4769J1368K3603j2274
7641C8333j4998J5180J0143l5573N323J8103L2759n967l0476j8604K4847L4929
7629G3999j0571j9566j2584J6118O55p519j4824k7217k3595K6101r019r107N061
7616a2068j8538J8259M3966L887l5861q138n050r514l791Q665j5341j7666j7926
7603f9116M2509K8457J0657L2616N260k7858p359o523r084k963j1087L742M54
7590a0295p543k458p80J2966L4119j3287l7703j3457L2976J8627l0975O98K0028
7577B916R778J1294J7655n300K267j1883k6070J3850K3902R750j8101j7614k1651
$$ y = [-48948, -18918, -11063, -20682, -37950, -45936, 24391, 65118, 49035, 33090, 24191, 36590, 31423, 2416, -25993, -26263, -25184, -65568, -80863, -61216, -21560, 36505, 30405, 15636, 27004, 50607, 38333, 23335, 38515, 48658, 13085, 18408, 36511, 69270, 63303, 32827, 14223, 39070, 73999, 63428, 43862, 31278, 47396, 48051, 40532, 25708, -1509, -25104, 997, -8022, -17129, -12068, -30606, -12347, 31619, 35506, -355, -8493, -13543, -23057, -26848, -18183, -33524, -51190, -69116, -26607, 1850, 12507, 45123, 50383, 22525, 15166, 8643, -441, -3404, -14491, -10749, -10295, -17838, -20296, -21076, -8110, 26009, 12722, -24981, -38438, -5462, 13165, -17810, -17112, 2916, 12694, 23988, 41643, 36343, 38610, 26727, 657, 14507, 38409, 48159, 30058, 12444, -9207]
7564i207l002o706k2570r250K0542J2298R224Q00J5589j4598J5284K2497j8672
7551A2229j0229r523k0059j3621J9769N8188L459m3461l9360j537m286q51N1026
7538A744L7455l850k5159l746O460J7586k3784l2934o44M699K8444P3j3544k5057
7524c2257L3023J6683k1123J635o165k6564Q373J6364M823J0499K5843K6178k6007
7511C1305k9156R032Q857k0480k6965l046J4701o418o518j3938L390J6110J3278
7498i848j0543j0107J1091r77J2924j0522K767n369j74j3787m31M6225K1613L1655
7484F4517m53o013N304l565k4944k0489P553k8529j6651J3938O219K806j3990
7471a4297m30j4855M683L6074j8632k4737J4427J0061J0301L1071j1541p070J5598
$$ y = [-9207, -12209, -18915, -41485, -50735, -30193, -17895, -8671, -7871, 7718, -6880, 8404, 30901, 12229, 2000, -7523, -27582, -41203, -21434, 36754, 40213, -3248, -42608, -44145, -48431, -49282, 1744, 39199, 35349, 10190, 6444, 12904, 30490, 6706, -26228, -26872, -22173, 6271, 6344, -7200, -32257, 766, 17449, -3674, -2039, -8204, -34768, -26395, -10031, -5208, 5291, 31134, 57312, 31305, 2149, 11181, 20038, -442, -27407, -30453, -15752, -22170, -28688, -42626, -39236, -23126, -9848, -20391, -30498, -19407, -20384, -7460, -17982, -15215, -20584, -20758, -34545, -34976, 11249, 32862, 64517, 64064, 58051, 63355, 59790, 34846, 14357, 21910, -6619, -23270, -9332, -3113, -307, -14297, -14727, -29582, -24899, 11175, -7457, -32194, -17767, -7706, 2595, 33666, 22125, 15055, 30653]
7458C0653J5885J2261N662m3143r068j6335L7200J2955p222Q66J4736k1416m0698
7445g664r116R079K3630P651j5072k5101r168J874J7889q515N123J789r819j1791
7431b9211k3899N563K5901k376J9152J1076k6670K662L398L4363K9656k2500l3899
7418f784j6128J4942P999j4348j2178j3767J3255K1579J302j3773J4925q4j4544
7405a7604k9976L7455L1830j1890k2922j3247o691j591J7147P691R73l874J9009
7392F310J7132o054n931M305L799j094l5880j2486L0601M8496O608r559k1873
7379B4374j033O595k0042O729p360j8707J5730n02j3129L299j8012L3130N999
7366A7071l397j3227Q817Q897J3711l318q056q886j4442j595p348n912m038P225
$$ y = [30653, 46538, 58799, 64461, 21318, 12250, -4085, 33115, 46070, 38848, 39714, 54450, 33034, -7664, -16780, -7701, 15929, 23580, 8508, -16593, -25761, -23887, -5998, -14513, -9390, -7601, -17420, -29211, -53110, -47547, -21646, -24022, -4870, 6206, -20464, -17802, -14404, 19959, 49615, 27115, -6784, -22912, -7970, 29, -14319, -26497, -40264, -27009, -5430, -4128, -17901, -2976, -3060, -17604, -47580, -10125, 21705, 9815, -13107, -26354, -33045, -34636, -17489, -9798, -8825, -12699, 6310, 23442, 17388, 11457, 15762, 19561, 18467, -17413, -29899, 702, 49198, 55806, 46247, 24374, 23341, 29936, 9894, 16623, 9263, -9444, 6286, 5784, -7345, -4046, -22058, 11072, 17071, 13674, 447, 9264, 18161, 31872, 28554, 20498, 11612, -2830, -4425, -11773, -17685, -21723, -14498]
7352a4498n345J7020J1384L458j5438k7K3937J0315j589k1061K0934J8882P265
7339E5237k0227k170J3197K0085o328K3470l5105k7115j0352k2939M310L859K063
7326b015K62K3075O418J1415M40l1398O605k037k2917j0233K5440o419K754R867
7312A1257r904J6325O905m3432k9998M3280K5253P08j3472j722k4820k1949O62
7299d0907N742J629J249j5140L225l088j3355P15J9407K9596M695K1648L7612
7286E3028l9366k7902q961K1964L1499O131j4957J0528Q837o532k4929J1170r961
7273A0549q513n49o378j4783j8407R188q852n804L645K3736N326j155J4615n561
7259b943j0299o078J7896j1264j257j2454j6351J6225R00q96K50K8581R879j4076
$$ y = [-14498, -19843, -2823, 8561, 12019, -3419, -3446, 20491, 30806, 29217, 8156, 29090, 47972, 55237, 35010, 32840, 46037, 66122, 59794, 83264, 48159, 21044, 10692, -12247, -7937, -4078, -2015, -1753, 21322, 27740, 39155, 39595, 8197, 14802, 12765, -10152, -20385, 5055, -1364, 1390, 11257, 1353, 17678, 24583, -18849, -48847, -5567, 19686, 20394, 6922, 5200, -19620, -41569, -40907, -35165, -33536, -32287, -47427, -44202, -47290, -60645, -59930, -40523, -10927, -6232, 15416, 53028, 13662, -14240, -23201, -1237, 30262, 36393, 21436, 31964, 40801, 34269, 9340, 20510, 10549, 2036, 1487, -4891, -19674, -38081, -28893, -37745, -43549, -39904, -16168, -10842, -11997, 2618, -2943, -13242, -19320, -1424, -12688, -13945, -26399, -42750, -26525, -25625, -26521, -26271, 2310, 12189, -1887]
7245a887J1923M129Q669k4389j0683M638L205j042J5665K2089j1539j9138Q588
7232A0228r89k0606j9563J4240J6236k5775J0169L3365o990J4654J2967m110J0876
7219D4702j6919k243l1768j1487J2873M573J3502r09p012j358j4522L021O343
7206a204N559k1805K220J2244R213L5934J0536j9299N812J2611K391l3969j8350
7193A893k1983j2256k4861k4268N2355L4474J5007J291K2307j4926l4745Q609
7181B897R778J1459J7867p434k5610k5599L878M5845j1533J6310K3893j6905k9248
7168A5598J4251L240n719k6258k2525l745K1567J4270J6613M600k5233l3848P544
7155a9645K1869N327k8348k139M211k172j590R559j0483J805K611k4795P920J8958
$$ y = [-1887, 10036, 14165, 22834, -1555, -12238, -7600, -4395, -5437, 10228, 32317, 20778, 1640, 10228, 9239, -11367, -30930, -16690, -454, -26229, -16060, 17305, 10315, 24969, 37936, 33826, 44702, 27783, 25540, -6228, -17715, -4842, -269, 13233, 12324, 5312, 3954, -10568, -7547, -1204, 4355, -17450, -15230, -2986, 6227, 42161, 52697, 33398, 39210, 51821, 54212, 20243, 1893, -20090, -32346, -57207, -81475, -29120, 5354, 20361, 21652, 43959, 29033, -5712, 2897, 12675, 24134, 42001, 34567, 8957, -16642, -12764, 33081, 21548, 37858, 61751, 44846, 15598, 29849, 33089, 27370, 1112, -21413, -25158, -3591, 10679, 27292, 31892, 6659, -27189, -19645, 2224, 7551, -20797, -22936, -18725, -20897, -22487, -12928, -23411, -21606, -18995, -43790, -35870, -16912]
7141a6912J1387J3089J9768k8876J2008l040j4533L4286K0661o847N980k2769
7129B4202q965J1674j8820j3955p149j067K9467Q674j9388p553P746q004M296
7116A158l2438j7110K702L6798J825k4718l1613J6047K8558Q078j707J75J4747
7103B502J9478N686j2619O156k0597O700n401k1439K278J4678J6228J1149l3470
7090h671l0549M446J5741N055j5034J0467j1371j232j0346K2922J0662k1691j1596
7077d1197l272K1807J1436j1931j7867J005K1493J0558M417m010p465P202K312
7064e512o314J7216M089l2243p664L1053l844j8370l777J0800J0169J981n237
7051g653J659K728k144n43k8844J7657J2048k9826P72K7923O705o897k3620n62
$$ y = [-16912, -5525, 7564, 27332, -1544, 10464, 7424, -7109, 27177, 47838, 40991, 46971, 24202, 15237, 26911, 8091, -5864, -13013, -14080, 15387, 24061, 4673, -2880, 4866, -3138, 1158, -31280, -48390, -45688, -8890, -7065, -31783, -63396, -47349, -18791, -10713, -12420, -12245, 2502, 21980, 27666, 15047, 21203, 606, 7306, 1905, -19534, -17256, -2578, 13650, 24799, -8671, -39220, -34774, -19033, -13978, -29012, -18545, -29916, -31148, -41494, -18572, -7910, -29601, -41197, -44469, -22662, -11226, -23157, -41024, -40019, -18526, -7968, -3551, -7561, -15026, -7824, -5512, -11826, 5390, 9479, -22764, -30428, 625, -3219, -21589, -25366, -14566, -4397, -2416, -7653, -5994, -3266, -5410, -5953, -34797, -17140, -5092, -34918, -34146, -6223, 482, -6415, -30035, -30597]
7037c0597Q509J3615N960J3651k0157k9965J4160P953L466J9813o883m1597k7226
7024f9298N790M743K1571K1941N656J243j2547k111K1666j203r72q203n070L0719
7010A3925N562J0786k4823J4814n02K2494K970k9652j2142J0710j0234k4110m057
6997b4259K1459j3779l1126K3619K5443l804K1122r60l6304k422k0982P504L928
6984c0561J7487r367J8025J3030J0076J9980J2322k998k3821J0834j0829k1275
6972B903J814L511L088j0615k0281p656J2636k301n09j613j058l745j8150K5N544
6957c6407O215J3388K59N949M015k9929Q51J8659k979K590K0273N343J4193K320
6943B4740N315K0621r807J427J1460l6354j0688j3419R721M508k3197m938J3612
$$ y = [-30597, -22088, -8473, -2513, 11138, -9019, -38984, -24824, -16871, -13405, 6408, -475, -42072, -69298, -63508, -58765, -37194, -15253, -9597, -8354, -20901, -23012, -1346, -2549, -3521, -11724, -16794, 13925, 19487, 30273, 5450, 20264, 19762, 42256, 45226, 15574, 3432, 14142, 3908, -20202, -24259, -2800, -16579, -47705, -24086, 1357, -2447, 18675, 17715, -18589, -21011, -41993, -34489, -30561, -13074, -22441, -4416, 8614, 18690, 38670, 50992, 47994, 24173, 35007, 24178, 2903, 4717, 8228, 11316, 701, -19580, -27236, -14600, -16901, -17410, -19023, -20081, -23826, -41976, -41951, -36407, -30192, -16804, -16545, -10596, -6581, -36510, -35659, -17000, -19979, -17389, 2884, 8227, 22420, 24740, 30055, 50676, 40869, 42296, 53756, 17402, 6714, -6705, 3016, 7524, -15673, -20611, -6999]
6930f999J047J1231K0470m795k7962N634P651k562J9394K629K1440K8003j6956
6917E8225r059o433m629k4175k2048J0232P68q522J382O408L2933J7319l1951
6904B0450k8139o994K3453O039k6296k7324J1365O625k0992j1920J057J8541j454
6891c5589K7446N428j0350m782j4159m0454j665L3163K1982J0236j1114l242L0757
6878G657p712k067R677k3418P698J645L988m946q455j1506J3504K5188J1063Q715
6864C1031J8090l1633m2904m1056n112K7826J0593J1938J0870J4658L0397m825
6852B9873k4193l1317r095j7160J7190O706l498j2605R013K6964J1690j8269j5031
6839b9732L338K5671J1943l7203l38K1756Q88J7926J7363Q548o021K0355L512
$$ y = [-6999, -5952, 5279, 25749, 20954, -7008, -1374, 6277, 3715, 23109, 25738, 47178, 75181, 58225, 49166, 42733, 38104, 13929, -8119, 2113, 2881, -5641, -4259, 2149, 35082, 52401, 20450, -7689, -14683, 8770, 14809, -11487, -38811, -27446, -20821, -41813, -53733, -52676, -34135, -35589, -8143, -2715, -13065, -17847, -32006, -72460, -74125, -40962, -18980, -8744, -19858, -23100, 7657, -55, -2122, 7555, -15863, -8165, -6520, -2532, -7478, -15933, -27439, -13935, 11253, 22316, 31031, 49121, 17488, -25416, -66472, -71584, -43758, -33165, -21227, -10357, 4301, 34698, 29873, 5680, -25637, -34732, -51892, -34702, -27996, -31494, -44099, -35086, -8122, 3568, -14701, -29732, -26394, -723, 11220, -25983, -26321, -4565, -3677, 14249, 31612, 40160, 34139, 54494, 58006]
6826E8006k1507k0071j6298j5548j1620k8634j0876J1219L0516J9972J5182k764
6814G577j6529j2323L2151Q583Q220k4237k1808J891j9494k0194q862m579L0787
6801c8817L9218j0747j3448K6934k2471j5407J4383J807J2211l2987m815L2132
6789a2007N013J0299L3004J3907j1895k9753l8794R473K0175R978K6784o037j7312
6776A2835N767O018j5780K2959O342j1001J0109q722k0920l9772K375K4009M379
6763a402L498N892k878j0433j9217R161J3653m704P712m101M688P573o11l0404
6749b1573Q709K7450K4951j491J5686L562k3826N893N192J4774L8466K8649r654
6736A16788j6226m4215q972o640l141J3686j7802j4252J1609r493o0250N407J2016
$$ y = [58006, 36499, 16428, 130, -15418, -27038, -55672, -66548, -55329, -24813, -4841, 10341, 7577, -8952, -21275, 10876, 19459, 27679, 3442, -18366, -16475, -35969, -56163, -65025, -69604, -38817, 401, -10346, -23794, 3140, -19331, -34738, -20355, -18548, -6337, -39324, -44139, -12007, -6994, 3305, 36309, 50216, 38321, 8568, -30226, -20753, -578, 9400, 36184, 30147, 12835, 18602, 24620, 8840, 31799, 38141, 27140, 37249, 28527, 7607, -32165, -29790, -5781, -1402, 2096, 7988, 5110, -5323, -24540, -15379, -1726, -6430, 1282, -2819, 1869, 9442, 8831, -21573, -12864, 14586, 39537, 38046, 53732, 57294, 33468, 39361, 44553, 59327, 97793, 126442, 116788, 100562, 56347, 47375, 40735, 37594, 51280, 33478, 19226, 30835, 21342, -38908, -33501, -21485]
6723b1485K2583M92K6858K0603k7231k7111l207J938J0682p336q236J4743j736
6710A557o269o24J4570L120J8393o242k0288J5271j7351P41m880K2659Q174k1791
6696G040k5977j0996n058J3262R802j0646L1757n115M009j0916J6950k0117k3626
6683b9631n486J0087J2376J4771j6882p001p6P802J6166J9805J9370j2305m4740
6670a5744k2242o986m516J1870P19j7889L6985N7546q572k0208l2448j6704K2480
6657a5709K554K112j3006l123J6689j7100R982J5170j8493k1916j0326j1608J2514
6644e2260J3712m992J4931J5172L725P597j2950j828j6601j5391J1167K0570K0106
6631B958k0531p439l006L4345Q177O800k5435k6746J2217J1653j259K1150K915
$$ y = [-21485, 1098, 1590, 28448, 49051, 21820, -5291, -8498, -6560, 4122, -3214, -11450, 3293, 1557, -4712, -5336, 9234, 12354, 30747, 24505, 4217, 19488, 2137, 2878, -2002, 20657, 28831, 7040, -18937, -29933, -34991, -21729, -11927, -22573, 9184, 4069, 8078, -2838, 14112, -6005, -29631, -35117, -25030, -12654, 2117, -14765, -21766, -21842, -14040, 2126, 21931, 41301, 28996, -15744, -37986, -44972, -49488, -37618, -36899, -54788, -17803, 39743, 31171, 10963, -21485, -38189, -15709, -13155, -11043, -24049, -27172, -10483, -27583, -17601, -2431, -20924, -42840, -53166, -64774, -52260, -38548, -43540, -28609, -13437, -9712, -2115, -15065, -16893, -33494, -48885, -37718, -17148, 2958, -17573, -25012, -28018, 6327, 14504, 21304, -4131, -30877, -18660, -7007, -8266, 12884, 15799]
6618A5799R50N758j2439j5619j2787Q653L0448K5950J3263p85k194m6001m2392
6605c1396j3679L979J0389Q788k0877k1073K5037K4017k028j8898k1862J0585
6593d7018K8622K7164N333j0668j7862n971K6045K1360m250J7263P581l8704l469
6580E426L0127j065j9746j0068p870l4825P263P273j0619K3887L197k792O87k682
6566a1807J4392L6525k071k5850k5615k8681J3310J9809j0472r319n805K5576
6554a0008o376J1102K1433k8559k535K7276m475L884n546k7054M293j9070j6603
6541e2238p098J0974O698J3737l6012Q92r350q879J9897M927K8283M8383J1548
6528C1762j8175J2666K2937l0438j6862k5318j9755n831J1711K4447k8055J1140
$$ y = [15799, 16749, 22507, 10068, -5551, -18338, -9685, 20763, 46713, 59976, 59191, 56997, 10996, -31396, -45075, -41096, -30707, -21919, -42796, -63869, -38832, -14815, -16843, -35741, -57603, -47018, -18396, 8768, 14101, 3433, -14429, -20400, 5645, 27005, 22755, 40018, 47599, 8895, 5426, 35553, 34488, 14742, 4674, -3196, -38021, -30758, -23485, -34104, -10217, -7020, -9812, -9125, -11807, 2585, 39110, 37039, 11189, -14426, -43107, -29797, -9988, -20460, -29779, -35584, -10008, -16384, -5282, 16151, -12408, -14943, 12333, 7858, 11742, 6196, -20858, -16565, -35635, -52238, -59336, -48362, -41664, -27927, -63939, -63047, -72397, -81276, -61379, -56452, -28169, 20214, 31762, 13587, 26253, 49190, 18752, 1890, -23428, -43183, -49014, -37303, -12856, -40911, -29771]
6516b9771J3075L1631K6472k755J3661j5163k8651l0336q169O030L5853J8724
6504C0601l4919k8446N961L218L847n643J8027Q985l477R135l177o800R333K7295
6490C3940k1824m1104k0689P566K3362J367o293J1192j5028J952K5652J7646k456
6477A5283n532j1029K6775J0243l8906r887J7286J9830j5984k7782O407J6445
6465C149P655J2517P918p976l0551n7717n078M5853Q881j5669L977L2725j5321
6452i637q778J6476K386K8601q84j9302L0725K0111j3592j4419l4218j3052r987
6439b5570N423r262J325k8227l2343K1245J1108J8626K4626K765J8738j7098l581
6426a2225o981j3394O600L619K3013J3645l2967m528K1083J684J4883J0229k3460
$$ y = [-29771, -16696, 14935, 41407, 38652, 52313, 37150, 8499, -21837, -30006, -23976, 11877, 30601, -4318, -32764, -26803, -23585, -19738, -25381, -7354, 1631, -1846, 7289, 4112, -2688, 6645, 33940, 12116, -28988, -49677, -42111, -18749, -17382, -23675, -12483, -27511, -25559, 93, 17739, 15283, 9751, -1278, 25497, 35740, -3166, -13053, 4233, 24063, 8079, -19703, -13296, 3149, 10804, 23321, 31239, 23263, -7288, -65005, -70083, -24230, -15349, -31018, -27041, 5684, -9637, -18415, -1939, 447, 29048, 28164, 8862, 39587, 59698, 46106, 31687, -2531, -15583, -25570, -20147, -29409, -28084, -56311, -88654, -67409, -56301, -37675, -13049, -10284, 8454, -8644, -12225, -19206, -32600, -26000, -22381, 632, 14277, -18690, -23218, -2135, -451, 14432, 24661, 1201]
6413A201r138N371j9654J3821J6450n372p267J5416O885j6364k649O038m868k1890
6399b2020j5357j82J0319J1060R209j1720K207K0015J296K757J8224k6027r036
6386i255K3843l042J9036J9978k2417m8871k5178K4451K3995l1362M359N493j4294
6373c3264J0083J9007Q468M342j2183k7644k755K6263J9184r107j4490J7783J6829
6360B2516j1927O240K306j647J2115J913o362j7180j574N949M048K818r140j6160
6346f085k4874j1281j587K3101P248R704K219p505K1257J6244J168K948j1872
6333B0685l1059j4202Q088J6331k6476k8976L330K1557K7266J5269J7633j6480
6321A2966q278p51K24m951o760j764Q362K748K1154J0858l9485j9830K0272j0506
$$ y = [1201, -7937, -2566, -22220, -8399, 8051, 2679, -4588, 10828, 17713, 1349, -1300, 4738, -130, -22020, -37377, -37559, -27240, -16180, -6971, -18691, -16484, 3531, 4827, 7584, 25808, -219, -9255, 14588, 11546, 30582, 50560, 28143, -20728, -45906, -21455, 2540, -28822, -24463, -18970, -33264, -23181, -4174, 4294, 8636, -3547, -31191, -33946, -7683, 11501, 2394, -12096, 5687, 22516, 10589, 16829, 19135, 17488, 29603, 31516, 25154, 7974, 6400, 12349, 16397, 19215, 10075, -6085, -30959, -42240, -43827, -20726, -13478, -3774, -1555, -9060, 12197, 28441, 29609, 32557, 20685, -10374, -24576, -16488, -157, -26633, -55609, -52279, -30722, -3456, 11813, 29446, 12966, 4688, 3937, 4161, -790, -7550, -9314, -952, 1796, 22950, 33808, -5677, -25507, -5235, -15741]
6307a5741J2392J5249J3939l3020j9358o454j9583N02n413j5781K8001N999R530
6294b9738k8377k211J5820R429J6837j110j3881j2666k1540J9572K6174L2738
6282A1047J621o646m345r427M552L5381m296q042J9031l2954j5710q63J211o545
6268a5985l729r865q64J1998J5515j0352J0826K3354j8151j6862P19N490J9686
6255A1780J9799k0808k7259J7767j7255k951M0917J7803O24j207j80j5339l2271
6242h580j8666J664j0186J4118J788J1751K3935j770n514q12L609J5073l552n130
6228A7728k8291k0994J2563L493N506L645l041j067J081K5480r769k8050q929
6215c0645M2496o251j3712O122L181l2597L997k6501j2017K0683k429K581J014
$$ y = [-15741, -3349, 11900, 25839, -7181, -26539, -32993, -52576, -52074, -57487, -73268, -45267, -39268, -29738, -58115, -60326, -44506, -35077, -18240, -19350, -33231, -45897, -67437, -47865, -21691, 11047, 12668, 6022, 1677, -7750, -3198, 32183, 27887, 19845, 38876, 5922, -9788, -10651, -9440, -15985, -19714, -29579, -30443, -18445, -2930, -13282, -2456, 20898, 2747, -14115, -13396, -7906, 11780, 31579, 10771, -16488, 1279, -15976, -18927, 21990, 39793, 40417, 39210, 39030, 23691, -8580, -27246, -25582, -35768, -21650, -19862, -8111, 15824, 14054, 8540, 7728, 11337, 26410, 22858, 17728, -10563, -31557, -18994, -15501, -9995, -6350, -9391, -10458, -9377, 16103, 6334, -21716, -30645, 11851, 5600, -8112, -1990, 1191, -31406, -27409, -53910, -65927, -45244, -47673, -45092, -44078]
6202d4078j3199J0382L365l2639N221J9640J8095k2982N641J2803n52P743R136
6189b1424K0725k1208j5248j4957J0423J6589o328j6725k0753J6676j2257l86
6177f4873K9428J7425J4656l2930R029K3433j2237k0575k934n610K8706n588N755
6164a6315J2888l086L843j8269l888L629M992j7670k4109J3864K9478J3903J3365
6151A2625R069K1396j0913r715j7774m9274J5265L2993n474j2300J843R479k0659
6138b3439M789P403K1578r850m9042k3234L1899M8729J4239J137J8004m5107l4114
6125c7008m653J989k094o54L7791K8780o079j4927j3968Q317J0754k1845P111
6112f486J0346m996k4337j9345j4130J2680J6643N836L960K0044Q335O175m714
$$ y = [-44078, -57277, -46895, -43530, -76169, -70948, -51308, -33213, -56195, -50554, -37751, -38303, -30560, -21424, -699, -21907, -37155, -52112, -41689, -25100, -31428, -48153, -68906, -52230, -64487, -64873, -35445, -18020, -3364, -36294, -27265, -3832, -16069, -36644, -39578, -45188, -16482, -22070, -16315, -3427, -6513, -2670, -20939, -24827, -21198, -16206, -33876, -57985, -44121, -14643, -740, 12625, 21694, 43090, 32177, 22462, 4688, -44586, -29321, 3672, -1802, -14102, -12259, -2780, -23439, -18650, -11247, 10331, 481, -48561, -71795, -39896, 8833, 23072, 24209, 42213, -2894, -37008, -41661, -39672, -41766, -42420, -4629, 24151, 18072, 3145, -10823, -2506, 8248, -13597, -6486, 3860, -1136, -25473, -44818, -58948, -46268, -29625, -23789, -19829, 215, 8550, 14725, 10011]
6099A0011j3967k4869j6148Q378J5414j1635J9851O429m9602j4202R857R036J7865
6086c3582j3031R219J3705p601J1859K411Q671K5550M355M40j1951k858j1616
6073d429l442L871M495l8839l2001K2013N36J9489L4046N146N279l783j5876l4989
6059c8484j4309J1894J6047J1543J405j7688j828J2262J0431q346l34l147M998
6046a5556q687j4560j2610m084l120J2021K999k536J013J3661q529q486N45O687
6032d1242j1269K3443n038j5067Q967J4880r38j9806K131K7752K5966L368p029
6019F118m370J6192M834j9241j2850m064J425j1230K396L5973K5580J207l1395
6006A0575o734k1368p214L96K1282j4676j8478j6270O049J4415J6533J4818K2238
$$ y = [10011, -3956, -28825, -44973, -36595, -21181, -32816, -12965, -6536, -56138, -70340, -60483, -51447, -33582, -46613, -37394, -23689, -31290, -19431, -17020, -8349, 17201, 21556, 21996, 10045, 7187, -4429, -7871, -4000, 495, -38344, -70345, -48332, -47796, -28307, 5739, 10885, 16164, 12381, -3495, -38484, -52793, -40899, -24852, -13309, -11904, -29592, -31420, -19158, -8727, -17073, -17407, -20554, -15556, -24243, -38803, -51413, -55497, -58617, -46596, -43597, -46133, -45120, -31459, -39988, -48474, -47929, -41242, -52511, -29068, -34106, -49173, -40206, -25326, -26264, -46070, -43939, -16187, 9779, 13147, 6118, 1748, 17940, 22774, 3533, -9317, -13381, -11956, -23186, -20790, 15183, 40763, 41970, 10575, 3841, -17527, -24741, -24345, -3063, -17739, -36217, -52487, -46438, -32023, -15490, -672, 21566]
5993B1566J5167J1740k3658k4493L1759j2751j7428L803K2663o26m9221m5177
5981f6656M484P509K1835L324j4655L0346L6041m08k4853l6279J313K3167k979
5968a7811J882L3196Q166k8516K467P575p059L5637J1367M495j0786k4147j3786
5955B680J1487N388J4623J5129k8362k8157p536M564n776J5916R916M81j2350
5942a997m227r065l970j1203J9601M708n821j2216j1519k0550M489m799k9677
5929h6246J5844K3490K329r430J0436K9889J2122j3227k874l466j5933j0125P935
5916c9256P338n213Q713O95O922O525Q961P593J3339j5828R904p158J4032K773
5902A9340l0077m438O666J5883J3670j9128j2511j6664l23j5812R752K7798k125
$$ y = [21566, 36733, 48473, 24815, 322, 32081, 19330, 1902, 5705, 28368, 27742, -21479, -66656, -62172, -54663, -32828, -29504, -44159, -13813, 22228, 21820, -3033, -39312, -37999, -14832, -17811, -15929, 17267, 25433, -3083, -616, 6959, -100, 35537, 46904, 51399, 40613, 16466, 2680, 14167, 19555, 34178, 49307, 20945, -7212, -14748, -10184, -15960, -44, 9872, 10353, -1997, -6224, -15289, -19259, -30462, -10861, -6153, -11974, -24190, -35709, -56259, -51770, -56569, -86246, -70402, -46912, -44583, -54013, -43577, -13688, -1566, -14793, -17667, -21133, -37066, -47191, -39256, -31918, -37131, -28418, -27723, -20801, -14276, -5315, 2278, 15617, -211, 9693, 2535, 16567, 19340, -10737, -15175, -8509, 7374, 21044, 1916, -10595, -27259, -27582, -43394, -33642, -5844, -7969]
5889g969q484j0718k375K0625O205N592j3976O527M848J3415p659l2912n425j007
5875c3313k1997N2K5130P000J4487J1429K17m3692K213K4858k196k853l984R823
5861a2826J892J7166l751j0757l138J6206M506j0491n296r03r341j6803j0074
5848d3610r940j7897J5203L3343j9738M705K08m507k757J2923k8698N674K9528
5835b5563K620L29M491K0365J876O60J5732N181r721j0445j5463j3507n068k691
5821c1204K154J0489k4442m351L1906K7946J2667j648j8669l3305j1470j5396
5809e5323J6072J1473K649L501K9149N143L014k2244j9936q708J6265J7246O528
5796D829Q528Q192J7709j2217q62J4882j3346J3452J9551k5674q012k1494j7661
$$ y = [-7969, -16453, -27171, -29546, -8921, -2716, 2876, -11100, -4573, 275, 13690, 6031, -26881, -32306, -33313, -55310, -55258, -30128, -23128, -8641, 2788, 3005, -40687, -38474, -13616, -15812, -18665, -22649, -12826, -10934, 6232, 2481, -8276, -11414, 4792, 9298, -1193, -6489, -7392, -16733, -33536, -43610, -53550, -71447, -56244, -22901, -42639, -37934, -37726, -42233, -44990, -32067, -60765, -55091, -25563, -22943, -22614, -18123, 2242, 4118, 4778, 20510, 25691, 15970, 5525, -9938, -23445, -28513, -31204, -29050, -18561, -43003, -47354, -15448, 12498, 25165, 23517, 4848, -28457, -39927, -55323, -39251, -27778, -25129, -21628, 7521, 12664, 15678, -6566, -26502, -35210, -18945, -1699, 4829, 13357, 21549, 39258, 27041, 26179, 41061, 27715, 41167, 60718, 35044, 27032, 5538, -12123]
5783a2123J8557q245j9419J7104J2237P376K0625j5225l197j3236J0123j706m5564
5770c2693j0941R353J2170Q871K1477L624l154J4353R50j6766Q253J6804k839
5757B9462j2605n750J7476l755J523q512j2257j5289R525J6571m284J7865P342
5744C7312k3659j9218k3463r241J2949O68J3807J8334J7288l189k0894k64l009
5731b579j3160k4917J9547k977O517R224q854j3786J181K686o023O652L913k5669
5717d8245J671K5346N788N303K9823O944j9410n251q283k9384j8960j1112K80
5704f5490m1390K2652K7736J496J8935M002J3622J4917k6642P536R060O481k0434
5691b7519K4792J5072o976k0917j4124q687j4113K11K106j38N800O575L0452L5776
$$ y = [-12123, 6434, -1811, -21230, -4126, 8111, 15487, 36112, 20887, 17690, 4454, 14577, 12871, -32693, -43634, -34281, -22111, -13240, 8237, 11861, 8707, 23060, 24010, 7244, 15497, 32301, 29462, 16857, 11107, 28583, 24828, 26351, 17839, 5582, -9707, -182, 16389, 12105, 29970, 37312, 13653, -5565, -29028, -38269, -25320, -24652, -10845, 7489, 24777, 21588, 694, 430, -2579, -15739, -40656, -21109, -24086, -17569, -8345, -17199, -30985, -29804, -27118, -33141, -26489, -22576, -48245, -46574, -21228, -15440, -10137, 19686, 26630, 7220, 1969, -6314, -35698, -54658, -65770, -65490, -106880, -84228, -56492, -54996, -36061, -32059, -18437, -3520, -30162, -22626, -13566, -7085, -27519, -2727, 12345, 5369, -15548, -29672, -38359, -52472, -52261, -50155, -50293, -44493, -37918, -7466, 28310]
5677B8310j2479o971R757r290K392j8544k8351j0384R487L8226r65J3167O541
5664B0896j7964j1264n985p379J2713K4163l190j3610j8151K784J3810J9672k793
5651A3702l9935k2634m021M4526K235J703L8614j3310K2258j2455j6952J2064
5639B5795L457q876k9389l4374j1537O591K2608M678k692L2862J38m4419j7976
5626e3134J3606Q319Q571j1176j4939Q401k103K5730k78j9860k228N97q295R861
5612c6928J4274K1334j1567m1491l697M0569P580J5642M54j6003n927q823K3352
5599a231k2670j3685J0780j8151j881J3012J3287K023m838K7554n429M92K2975
5586B2238j7758j1697j579J8991K6819j398k4083r927K5296j1164k1547P500J149
$$ y = [28310, 15831, 8860, 18617, 9327, 11719, -6825, -35176, -45560, -36073, 2153, 1188, 14355, 20896, 2932, -8332, -14317, -21696, -8983, 15180, 11990, -1620, -19771, -16987, -3177, 16495, 13702, -26233, -48867, -52888, -8362, -6127, -4424, 34190, 20880, 43138, 30683, 13731, 25795, 29252, 20376, -9013, -43387, -54924, -48333, -25725, -21047, -23739, 9123, 9261, -35158, -53134, -39528, -31209, -22638, -33814, -48753, -40352, -42455, -16725, -17003, -36863, -39091, -38494, -46789, -36928, -22654, -1320, -12887, -54378, -58075, -17506, -9926, 5716, 6170, -9833, -15760, -24583, -1231, -23901, -37586, -26806, -44957, -46838, -33826, -20539, -18516, -23354, 4200, -1229, -737, 22238, 4480, -7217, -8796, 10195, 37014, 35616, 11533, 1606, 26902, 15738, -5809, 1691, 2840]
5573B840R588K2823l7815k3176N175m914k2931j2139K7558n875m733K4817K3933
5560E151Q034J6319K5259k713k6632L879K744m1241j4847J9345q749j6058q576
5547c8085j0236m230j2248J4399Q993J543L0278k0493j1587K6073j5123Q600K8206
5534F090J6547J3545q948k4016q52j8253j2733k194q049J5930M9098l704l1817
5521i356m547k2054r355J410K748J1995j1753J1337O766m697J939j5930R174k775
5507c5098J2265k1874j3920L4442J5521J4577l0496l8819K3235K7637q437l5023
5495e5990N907R025j2971L8851l411o087Q615q448j418j0794j1319j4453o754
5482f9247K3218O541J4902J9456j475K052k0762n719K0627Q868m979L8700j6372
$$ y = [2840, 12428, 35251, -2564, -25740, -20565, -25479, -48410, -60549, -32991, -38866, -43599, -18782, 5151, 13185, 29504, 54763, 52050, 25418, 29297, 32041, -9200, -24047, -4702, -13451, -29509, -38085, -48321, -52551, -64799, -50400, -41407, -39864, -9586, -30079, -41666, -15593, -30716, -22116, 6090, 22637, 36182, 27234, 3218, 2366, -15887, -28620, -30814, -38863, -22933, 26165, 22461, -9356, -13903, -35957, -45312, -43902, -41154, -29159, -40912, -29575, -22809, -27506, -25567, -41497, -32323, -35098, -22833, -44707, -58627, -24185, -8664, 5913, -24583, -63402, -40167, -12530, -20967, -55990, -50083, -41058, -54029, -15178, -18589, -24676, -16061, -24509, -25927, -36721, -48040, -62493, -69247, -46029, -39488, -24586, -5130, -6605, -4553, -25315, -31034, -10407, -1539, -6518, 32182, 15810]
5469A5810j2827L0080k789L482k090k095j6647j5381m782J1711j2429j9095l841
5456c0893j6524L4531M2920J7886J048m306m5445k2368K4433k028j6799O088K0600
5443I143K7503k1819L737P446k5874j2131K3969J0590p626q962J0161J9260j2058
5430B3339l1166o482Q38n631k361L4425j406j1464j3529j8878j3441M288K6471
5417a4997J8974J7292J1607k582k6193l5032l1179n647K5881K1929L021M129j981
5404a4778q835J4987K1604R696J5396k367k9112j3599J4976M482n689j0472j5186
5391a8897j3030M976K1535K0550J9544J8393l0931l4066p333l759R455Q785J3755
5378H977K7923J0426l5159l2676j3361l844J0530K1179M919r388R272M771k6070
$$ y = [15810, 2983, 33063, 30274, 33756, 31666, 29571, 12924, -2457, -7239, 4472, -7957, -27052, -30893, -47417, -12886, 30034, 47920, 48968, 44662, -783, -23151, 1282, -746, -17545, -11457, 9143, 36646, 14827, 18564, 26010, 136, -11995, 11974, 22564, 14938, 5976, 16137, 35397, 23339, -7827, -14309, -13471, -19102, -21463, 12962, 11556, 92, -13437, -32315, -45756, -41468, -14997, 3977, 21269, 32876, 30294, 4101, -30931, -62110, -67757, -41876, -19947, -16926, -12797, -14778, -23613, -8626, 12978, 22674, 38070, 35703, 6591, -7008, 7968, 12450, 6761, -3711, -18897, -31927, -26951, -5416, 15134, 34678, 53071, 22140, -11926, -19259, -23018, -13563, -4778, 8977, 36900, 47326, 12167, -20509, -33870, -37714, -27184, -6005, -1086, -10474, -1202, 3569, -22501]
5365b2501N850K3398k6698K1163L1861j4762m0598r623q787k3768k0425j2368
5353i7258M0921L6277M196L9606J4499k4600m0867J0715J6048p515l1123j0010
5341d9111K2985K0975Q650j7030j0925J6475M4933j273j4827O247j1985m2740
5329b7626q493K2502K6315K3144K4049j3027j720M084j5854j021R82p46j4828
5316A7761k5486j0275J3758J4871J1093j9787m1424j437m370J4886L8946n527
5304C009R509Q480j20j7139k7985j8044L16J4651K8566j4244o995l0152k0458
5291g0606J1614J8906K3351R37k0994l0528K893J8409K4989J106J0517P21K4900
5278A6215J2793j4027j6281j8747J3138l127j6786k5603K6118K0547O893j3274
$$ y = [-22501, -16651, 6747, -19951, 1212, 33073, 18311, -22287, -31910, -40697, -64465, -84890, -97258, -56337, -20060, -15864, 23742, 38241, 13641, -27226, -16511, -463, -7978, -39101, -49111, -26126, -5151, 3499, -13531, -24456, -7981, 36952, 35679, 20852, 27099, 15114, -27626, -36119, -13617, 12698, 35842, 59891, 46864, 45144, 49228, 33374, 32353, 33335, 32589, 17761, -7725, -18000, -4242, 10629, 21722, 1935, -39489, -40926, -45296, -30410, 8536, 3009, 12518, 20998, 20878, 3739, -24246, -42290, -41974, -27323, 1243, -13001, -19996, -50148, -70606, -58992, -40086, -16735, -15798, -36792, -67320, -64427, -46018, -21029, -19923, -9406, -8685, 16215, 29008, 14981, -1300, -20047, -6909, -10036, -26822, -52425, -26307, -5760, 1133, -12141]
5266a2141J9065j4337j0506J1411q399J5033l2352q762N142Q514l746j8199k4933
5253g4210j1536O221p235L019K6924O0089J7005k6775j8000r113j7194J1071J3818
5240b5916J2130J1533M600P479k1403J2202N670q134j6989j0748J9907L4835M493
5227B9659m2200j7607K1178Q735j1097K647k037o932q049L151J1871K9845J5521
5214C4685j9778p940K575j1383J149J105k7471j7187P714O153o398P606J7492
5201a1678J5695q554M019n766j9753j7061o415J2954j7062K6859K7005K4615j8550
5188F308k3110J5964J0100P068j3717l3072k8863K2853J2794p083N337m379j6789
5175d6589P911R261n497O481K3330m264m43k6898k3920Q034J8663J1807M805l940
$$ y = [-12141, 6924, -7413, -17919, -6508, -14907, 126, -32226, -40988, -35846, -27332, -31078, -49277, -74210, -85746, -79525, -86760, -83741, -56817, 3272, 20277, -6498, -24498, -33611, -50805, -39734, -25916, -13786, -2253, 2347, 9826, -11577, 625, 6295, -1839, -18828, -29576, -9669, 25166, 29659, -12541, -30148, -8970, -235, -11332, -8685, -10722, -17654, -25703, -22552, -10681, 19164, 34685, 14907, 6967, 9542, -1841, -692, 413, -27058, -44245, -36531, -30378, -36776, -29170, -11678, 4017, -4537, -518, -6284, -26037, -43098, -49513, -36559, -53621, -26762, 243, 24858, 6308, -16802, -838, 9262, 16330, 2613, -30459, -59322, -36469, -23675, -30758, -25421, -29800, -46589, -38678, -29417, -34914, -28433, -5103, -9367, -9810, -36708, -60628, -52594, -33931, -22124, -17319, -21259]
5161b1259Q354J8763J0888n170k270j8241L870k753r683o554J6906n144j7311
5148b9604j4388M0637j5332k0305J3556p999M883J2695L984J81q952J464J7456
5135a724j830j9258l384J0618R150k9846k496K329p572J3267j0073K4425j1758
5122b8152J3231K4409m113M058o579o4j2370P078O334M31j2129J7315M859P513
5108B1821J6485j6266j7962k1757k3929J3577J5080K0271J2593m0611j7183J8821
5096a9060l570P410K6630k0455P366K4582o28l8624q545K6933k2121j5958J3512
5083b2528J9015R915j3150r718l984p765j4537M860K1684j862J1007m352j3342
5070b4757K814L5879J9786Q508j9580k0563r082K314j1356R53p694K8537N09j3261
$$ y = [-21259, -12905, 5858, 16746, 11576, 9306, -8935, -5065, -7818, -17501, -24055, -7149, -12293, -29604, -43992, -3355, -18687, -38992, -25436, -33435, -28552, -15857, -11873, -11692, -20644, -19180, -1724, -3554, -22812, -26196, -15578, -6428, -36274, -38770, -36441, -44013, -30746, -40819, -16394, -28152, -14921, 9488, 5375, 9433, 2854, 2790, -9580, -2502, 3832, 4263, -7866, 9449, 14308, 21821, 38306, 22040, 4078, -17679, -41608, -28031, -12951, 7320, 19913, -20698, -37881, -19060, -22630, -15220, 11410, -9045, -1679, 22903, 22275, -16349, -24894, 2039, -20082, -36040, -22528, -3513, 6402, -6748, -16466, -20450, -28215, -42752, -37892, -16208, -18070, -7063, -11415, -24757, -21943, 13936, 33722, 42230, 22650, 2087, -6995, -4681, -16037, -15084, -22778, 5759, 6268, -6993]
5056f993j0629J6053o500K6364N1750k528l6529m7653k2401q984K647R254J5596
5043b0553k2530k0764N160m277K1535K8407m177q602K07J6752L705m64K1629J3678
5029B9706J5760k4969m6260N928L2282q165J847j7221J1318j711k6656k1025J2581
5016c6585J0237J3422j5216l717r897J9717J4384K4705k564Q626R267K825j844
5003C3360l8995n1462k912L5702K2725K64j9946P530J4157j2515R837q897L574
4990g578r401k1636j463J861l435Q451J4880J6824l928J9907j8254k286l346J929
4976g475K182P976K0832J02k0205q460l2590o11K9310J9177j1689j2351J614j9775
4962c1963P241J5965K0471q299k7045N098K1476r500m4210p536J2463J1479K554
$$ y = [-6993, -17622, -1569, -8069, 18295, 70045, 67517, 30988, -16665, -39066, -48050, -45403, -36149, -20553, -43083, -63847, -58687, -62964, -41429, -13022, -17199, -25801, -25594, -8842, -5137, -5601, 16028, 29706, 45466, 20497, -25763, -19835, 12447, 4282, 6129, -11092, 226, -1485, -28141, -49166, -36585, -26348, -12926, -28142, -31859, -41756, -22039, -7655, 17050, 14486, 23112, 32379, 35204, 33360, -5635, -57097, -60009, -24307, -1582, -1318, -21264, -13734, 423, -12092, -2255, -11152, -7578, -16979, -38615, -40078, -38217, -41652, -33201, -18321, -1497, -5425, 14482, -3772, -6058, -9404, -7475, -5293, 2683, 23515, 23617, 3412, -5048, -37638, -38249, -8939, 10238, -1451, -13802, -12188, -31963, -24722, -8757, 11714, 3415, -23630, -18532, 2944, -6556, -50766, -58302, -45839, -34360, -31806]
4949c1806K8115K6296r25j7076n493j0591J4699K1178J0453k1878Q588k3395o516
4936h351k533J9297L0957M542m6922j8763o505p410R471K6859N5272K419k9502
4923B8831K418j0106j3225Q94k2375R513M054j2749k2985o025J0891J5178j929
4910a7615K951Q340O63J5314P118M128K5855Q968p073R247o3370l8271j4374J8028
4896d0091J0424K7152K6766K0461o225j2631k3542Q914K0707j1088k6040l6757
4884d1950m1771L6676N0335k287j1845K2459p580n411j3514k219k6001j4494J3857
4871d3745K5791K5078N854N759N808q260j1912M504J471J8559J4997k7660k6814
4858a0570j5060M261n758J3358o306k1690R341J9217J3387l4102K4313L0510M207
$$ y = [-31806, -3691, 22605, 21680, 4604, -889, -11480, 3219, 24397, 34850, 12972, 21560, -1835, -8351, -10884, 8413, 39370, 43912, -3010, -21773, -28278, -35688, -26217, 642, 55914, 58333, 28831, 31249, 21143, 7918, 8812, -13563, -4050, 4, -12745, -35730, -41755, -30864, -15686, -17615, -14664, -6324, -5661, 9653, 16771, 20899, 46754, 55722, 48649, 57896, -5474, -43745, -58119, -40091, -29667, -2515, 24251, 44712, 38487, 25856, 2314, 11228, 31935, 20847, -5193, -41950, -83721, -47045, 3290, 1003, -10842, 11617, 4037, -1374, -14888, -17107, -43108, -57602, -43745, -17954, 7124, 12978, 18737, 24545, 16285, 4373, 8877, 10348, 28907, 43904, 16244, -10570, -25630, -21369, -27127, -13769, -20075, -41765, -32424, -13207, 180, -33922, -9609, 20901, 25108]
4845B5108n0801j6722L7271P856q257R135j0420j0714j7875j0888K482K9812j969
4832a5982o877k404m928K3167O042j2507J5235K460k1865j0839n187K311N894
4819b5480k713M605K654j1047n390M560K1345k902k3678j123j8455R230J7845
4806c0549l169k9497L880Q925m351J335J6354n129O138K0163J0711j592j8136
4793b4917J2968j0373n863J4452O063J045j7981k6041J9054L1409J1125k7706
4781a6765j9932J2729J2128N328M607M775j2210o487R21P460K7855j740P750q811
4767A7608r378l4839j8511j033J361J8118J9494j3639R087K2268K553N158m031
4754A4216j9288j5061j5005O4j2419p195J8804J0411J1694L7522J4756j1168k8141
$$ y = [25108, -25693, -42415, -5144, 2712, -5545, 3590, -6830, -17544, -35419, -46307, -43825, -14013, -15982, -22859, -25263, -30191, -7024, -982, -13489, 1746, 4206, -17659, -28498, -33685, -31374, -25480, -28193, -23588, -20934, -31981, -37371, -32811, -11466, -14368, -38046, -39169, -57624, -48394, -30549, -33718, -63215, -59335, -50410, -54761, -53426, -37072, -42201, -36063, -15900, -5189, -6781, -24917, -11949, -22322, -28185, -13733, -7670, -6625, -24606, -50647, -31593, -184, 10941, -16765, -36697, -23968, -11840, -6512, -1905, 2870, -9340, -15827, -14906, -7446, 20409, 18669, 26419, 17608, 8230, -26609, -45120, -46153, -44792, -26674, -7180, -20819, -11732, 10536, 13089, 18247, 14216, -5072, -20133, -35138, -35074, -47493, -54688, -35884, -25473, -13779, 23743, 38499, 27331, -810]
4741h10l0795o522K576P261j605R699J4770j1655j0426K8351J0776p195J1371
4728A5796q800m750m107J6188K5616k448l0212k734K2929O468k9911J0385j3988
4715D32q694K8513k153k1239K1324j2172L150j6096j1583N083K0709K8118N383
4702D0775k8539R627M920j4302p940J097k150j2448J289J2634N81l263j3348j9312
4688c0379J4574j8415j096J1067L0603M521q743n099K043q213k9621K8208K7248
4675A6698J2626j852N012l4906k5534r620l252K707L8573k533L637j4578j9228
4662c2250r836O610J0916L3158N722k2655k8579j2447K1751l58O346n613K135
4649b5100K7405Q170k3999n804j0565J151J4584j2666k4282j458L0214j196J8538
$$ y = [-810, -31605, -38127, -35551, -28290, -29895, -20196, -5426, -17081, -27507, 844, 11620, 4425, 15796, 6996, 2246, -1861, 14327, 39943, 37495, 7283, 4549, 27478, 33946, 4035, 14420, 432, -8262, 20251, 18098, -3141, 18183, 6011, 9161, -6935, -18518, -13435, 7274, 35392, 40775, 12236, 21863, 26783, 12481, 4541, 5638, 3488, -8960, -7671, 4963, 5544, 2281, -11067, -30379, -15805, -34220, -35316, -24249, 6354, 10875, 2132, -2967, -924, -9137, -38758, -10550, 16698, 29324, 27472, 32484, -2422, -27956, -37576, -40828, -38121, 452, -2081, 1556, -13022, -32250, -42086, -35476, -24560, 8598, 14320, -8335, -36914, -49361, -27610, -27968, -21622, -27235, -25100, 2305, 10475, -13524, -19328, -29893, -28742, -14158, -26824, -51106, -52564, -22350, -23546, -5008]
4636e008K6075j0952o614j2254k0508O21Q177Q949O930l1564J058J2076o444J1162
4622a8296l675J1529P99j9120r694M003K3355j250j7961M562n681l1477J1052
4609e1854N419K2025K0132Q647m922j1484J511k4321q744j103j72N862J64j5704
4595e4544O09p371K1536p042J0549J2386r208M583l548k7902M022Q470p22J8793
4581b9389K5175P833M837j5701l601L207j7833K4828L0142m111J5184j3311j1363
4568A5897J4807L290m758j6106j6648k3598l2514K5656J2364O344M70k161j3261
4555c0218K0342J7387K0889M080p659Q931j3937l4673j4866Q14N859J8239L8495
4542C3683L1950o205m0086l47j5841l3745k0862J7488J1868q482p862L4401J3601
$$ y = [-5008, 21067, 10115, 3501, -8753, -29261, -28640, -20463, -11514, -4584, -36148, -35090, -23014, -29458, -18296, -21971, -10442, -9643, -28763, -38457, -34454, -11099, -12349, -30310, -25748, -31429, -62906, -51854, -46435, -24410, -4278, 4369, -553, -12037, -10526, -34847, -43591, -44694, -44866, -39004, -38840, -54544, -53935, -61306, -39770, -46812, -36263, -23877, -33085, -28502, -32050, -59952, -55930, -47460, -48182, -29389, -4214, 3619, 8456, -7245, -10846, -7639, -25472, -644, 29498, 25387, 40571, 27260, 15897, 30704, 33994, 29236, 13130, -3518, -27116, -59630, -33974, -21610, -15266, -14796, -16957, -30218, -9876, 7511, 28400, 32480, 24821, 33752, 19815, -14858, -29724, -28910, -23051, -4812, 33683, 65633, 59428, 19342, 18995, 3154, -30591, -51453, -33965, -22097, -30579, -38441, -4040, 9561]
4529I561j9293j5212L202K4758J0211k7393o461K3745J2904k128L824l752K5084
4516C9050L746k1520O780O039k8133j2595j0717N046o80L618L683K333j499O644
4502A795P784l2322k4006J419M0220R987j039L449k6659j5620p719J8973J6604
4489g134j0467j4654N402J2267k4302K5583K3213r199o175j806P096k6203q799
4476c5178K557J9630l0970m560O785J4518K8757J9267k1871k454l2502j0093J917
4463d4197R156Q700L477J1535J4430N459p97J069K793P587j5344k2077j9246l0256
4449f7711L421L0289M9714K4138K626l1044m4937o672J0347J9625L3376O834j566
4436B8440l6053m2125l630M1546N5039L6706l8188j3463J3696k0814M4J4680J7988
$$ y = [9561, -9732, -24944, -21742, 3016, 13227, -14166, -20627, 3118, 16022, 13894, 17718, 13966, 39050, 42796, 21276, 28056, 34095, 5962, -6633, -17350, -12304, -12984, -9366, -5683, -3350, -4849, 1795, 9579, -22743, -46749, -45330, -5110, 4877, 3838, 7287, -19372, -34992, -42711, -23738, -7134, -17601, -32255, -26853, -14586, -38888, -13305, 9908, 709, -5466, -7272, -176, -26379, -35178, -32621, -12991, -43961, -48521, -41736, -27218, 1539, 20806, -1065, -3519, -36021, -46114, -44197, -35041, -26341, -22864, -11329, 3101, 8560, 7763, 8832, 11625, 19212, 3868, -18209, -37455, -67711, -64290, -34001, 15713, 39851, 42477, 11433, -33504, -40176, -29829, -10204, 23172, 30006, 28440, -7613, -49738, -53368, -11822, 43217, 79923, 41735, 28272, 41968, 21154, 21198, 35878, 53866]
$$ [...]
##END NTUPLES=NMR SPECTRUM
##END=
