##TITLE=Analysis number 320468
Compound Code cd 09887
Book Reference b
Project Code adrs
Chemist Name stores
##JCAMPDX= 6.0         $$ Bruker NMR JCAMP-DX V2.0
##DATA TYPE= NMR SPECTRUM
##DATA CLASS= NTUPLES
##ORIGIN= Bruker BioSpin GmbH
##OWNER= nmr
$$ XWIN-NMR		Version 3.5
$$ Tue Jun 27 09:14:04 2006 GMT Daylight Time (UT+1h)  MAYBRIDGE\nmr@NMR_250MHZ
##.OBSERVE FREQUENCY= 250.131544655141
##.OBSERVE NUCLEUS= ^1H
##.ACQUISITION MODE= SIMULTANEOUS (DQD)
##.ACQUISITION SCHEME= undefined
##.AVERAGES= 16
##.DIGITISER RES= 18
##SPECTROMETER/DATA SYSTEM= dpx250
##.PULSE SEQUENCE= zg30
##.SOLVENT NAME= CDCl3
##.SHIFT REFERENCE= (INTERNAL, CDCl3, 0, 16.522)
##AUDIT TRAIL= $$ (NUMBER, WHEN, WHO, WHERE, WHAT)
$$ ##TITLE= Audit trail, XWIN-NMR		Version 3.5
$$ ##JCAMPDX= 5.01
$$ ##ORIGIN= Bruker BioSpin GmbH
$$ ##OWNER= nmr
$$ C:\u/data/dgb/nmr/ADRS/1550/pdata/1/auditp.txt
$$ ##AUDIT TRAIL=  $$ (NUMBER, WHEN, WHO, WHERE, WHAT)
(   1,<2006-06-27 09:13:44.12 +100>,<MAYBRIDGE\nmr>,<NMR_250MHZ>,
      <created by zg, POWCHK disabled, PULCHK disabled
       configuration hash MD5:
       E2 DF 36 D8 04 B2 41 60 5A D7 A3 38 5A 4B D0 FE
       data hash MD5: 64K
       E9 84 2D 80 C2 D5 26 3D 6C 54 A4 27 04 87 65 A9>)
(   2,<2006-06-27 09:13:56.04 +100>,<MAYBRIDGE\nmr>,<NMR_250MHZ>,
      <Start of raw data processing
       ef LB = 0.3 FT_mod = 6 PKNL = 1 SI = 32K 
       data hash MD5: 32K
       6B 42 65 75 88 F5 58 26 16 48 AA D9 56 40 6B CC>)
(   3,<2006-06-27 09:13:57.65 +100>,<MAYBRIDGE\nmr>,<NMR_250MHZ>,
      <apk 
       data hash MD5: 32K
       73 E4 B2 A7 16 75 0A 01 4E 1A 6C 78 BF 47 E4 85>)
(   4,<2006-06-27 09:13:58.45 +100>,<MAYBRIDGE\nmr>,<NMR_250MHZ>,
      <abs ABSG = 5 
       data hash MD5: 32K
       E6 E2 E7 E4 64 4F F1 66 60 30 9F C3 AD 75 99 51>)
$$ ##END=
$$ 
$$ hash MD5
$$ D2 16 74 17 16 49 CC 6C 87 ED A5 D9 A0 AB 57 A0
##$RELAX= 
##$RELAX= 
##$RELAX= 
##$RELAX= 
##$RELAX= 
##$RELAX= 
##$RELAX= 
$$ Bruker specific parameters
$$ --------------------------
##$DU= <C:\u>
##$EXPNO= 1550
##$NAME= <ADRS>
##$PROCNO= 1
##$TYPE= <nmr>
##$USER= <dgb>
##$AMP= (0..31)
100 100 100 100 100 100 100 100 100 100 100 100 100 100 100 100 100 100 
100 100 100 100 100 100 100 100 100 100 100 100 100 100 
##$AQSEQ= 0
##$AQ_mod= 3
##$AUNM= <au_zg>
##$AUTOPOS= <7 >
##$BF1= 250.13
##$BF2= 250.13
##$BF3= 250.13
##$BF4= 250.13
##$BF5= 500.13
##$BF6= 500.13
##$BF7= 500.13
##$BF8= 500.13
##$BYTORDA= 1
##$CFDGTYP= 0
##$CFRGTYP= 5
##$CHEMSTR= <none>
##$CNST= (0..31)
1 1 145 1 1 1 1 1 1 1 1 1 1 1 1 1 1 1 1 1 1 1 1 1 1 1 1 1 1 1 1 1 
##$CPDPRG= <>
##$CPDPRG1= <>
##$CPDPRG2= <>
##$CPDPRG3= <>
##$CPDPRG4= <mlev>
##$CPDPRG5= <mlev>
##$CPDPRG6= <mlev>
##$CPDPRG7= <mlev>
##$CPDPRG8= <mlev>
##$CPDPRGB= <>
##$CPDPRGT= <>
##$D= (0..31)
0 1 0 0 0 0 0 0 0 0.06 0 0 0 0 0 0 0.0002 0 0 0 0 0 0 0 0 0 0 0 0 0 0 
0 
##$DATE= 1151396023
##$DBL= (0..7)
120 120 120 120 120 120 120 120 
##$DBP= (0..7)
150 150 150 150 150 150 150 150 
##$DBP07= 0
##$DBPNAM0= <>
##$DBPNAM1= <>
$$ [...]
##$SUBNAM7= <"">
##$SUBNAM8= <"">
##$SUBNAM9= <"">
##$SW= 20.6930455092707
##$SWIBOX= (0..15)
0 0 3 0 0 0 0 0 0 0 0 0 0 0 0 0 
##$SW_h= 5175.983436853
##$TD= 65536
##$TD0= 1
##$TE= 296.16
##$TE2= 300
##$TE3= 300
##$TEG= 300
##$TL= (0..7)
0 120 120 120 120 120 120 120 
##$TP= (0..7)
150 150 150 150 150 150 150 150 
##$TP07= 0
##$TPNAME0= <>
##$TPNAME1= <>
##$TPNAME2= <>
##$TPNAME3= <>
##$TPNAME4= <>
##$TPNAME5= <>
##$TPNAME6= <>
##$TPNAME7= <>
##$TPOAL= (0..7)
0.5 0.5 0.5 0.5 0.5 0.5 0.5 0.5 
##$TPOFFS= (0..7)
0 0 0 0 0 0 0 0 
##$TUNHIN= 0
##$TUNHOUT= 0
##$TUNXOUT= 0
##$USERA1= <user>
##$USERA2= <user>
##$USERA3= <user>
##$USERA4= <user>
##$USERA5= <user>
##$V9= 5
##$VALIST= <valist>
##$VCLIST= <CCCCCCCCCCCCCCC>
##$VD= 0
##$VDLIST= <DDDDDDDDDDDDDDD>
##$VPLIST= <PPPPPPPPPPPPPPP>
##$VTLIST= <TTTTTTTTTTTTTTT>
##$WBST= 1024
##$WBSW= 4
##$XGAIN= (0..3)
0 0 0 0 
##$XL= 0
##$YL= 0
##$YMAX_a= 559874
##$YMIN_a= -676452
##$ZGOPTNS= <>
##$ZL1= 120
##$ZL2= 120
##$ZL3= 120
##$ZL4= 120
##$ABSF1= 16.522
##$ABSF2= -4.171173
##$ABSG= 5
##$ABSL= 3
##$ALPHA= 0
##$AQORDER= 0
##$ASSFAC= 0
##$ASSFACI= 0
##$ASSFACX= 0
##$ASSWID= 0
##$AUNMP= <proc_1d>
##$AZFE= 0.1
##$AZFW= 0.1
##$BCFW= 0
##$BC_mod= 0
##$BYTORDP= 0
##$COROFFS= 0
##$CY= 12.5
##$DATMOD= 1
##$DC= 0
##$DFILT= <>
##$DTYPP= 0
##$F1P= 14.0000005364418
##$F2P= -0.99999901652339
##$FCOR= 0.5
##$FTSIZE= 32768
##$FT_mod= 6
##$GAMMA= 0
##$GB= 0
##$INTBC= 1
##$INTSCL= 1
##$ISEN= 128
##$LB= 0.3
##$LEV0= 0
##$LPBIN= 0
##$MAXI= 10000
##$MC2= 0
##$MEAN= 0
##$ME_mod= 0
##$MI= 0
##$NCOEF= 0
##$NC_proc= -2
##$NLEV= 6
##$NOISF1= 0
##$NOISF2= 0
##$NSP= 0
##$NTH_PI= 0
##$NZP= 0
##$OFFSET= 16.522
##$PC= 1
##$PHC0= 170.8941
##$PHC1= 6.599967
##$PH_mod= 1
##$PKNL= yes
##$PPARMOD= 0
##$PSCAL= 4
##$PSIGN= 0
##$REVERSE= no
##$SF= 250.13
##$SI= 32768
##$SIGF1= 0
##$SIGF2= 0
##$SINO= 400
##$SIOLD= 32768
##$SREGLST= <1H.CDCl3>
##$SSB= 0
##$STSI= 32768
##$STSR= 0
##$SW_p= 5175.98343685301
##$SYMM= 0
##$S_DEV= 0
##$TDeff= 65536
##$TDoff= 0
##$TI= <Analysis number 999999
Compound Code 99
Book Reference 9
Project Code 9>
##$TILT= no
##$TM1= 0
##$TM2= 0
##$TOPLEV= 0
##$USERP1= <user>
##$USERP2= <user>
##$USERP3= <user>
##$USERP4= <user>
##$USERP5= <user>
##$WDW= 1
##$XDIM= 32768
##$YMAX_p= 269641148
##$YMIN_p= -26314
$$ End of Bruker specific parameters
$$ ---------------------------------
##NTUPLES= NMR SPECTRUM
##VAR_NAME=  FREQUENCY,     SPECTRUM/REAL,   SPECTRUM/IMAG
##SYMBOL=    X,             R,               I
##VAR_TYPE=  INDEPENDENT,   DEPENDENT,       DEPENDENT
##VAR_FORM=  AFFN,          ASDF,            ASDF
##VAR_DIM=   32768,         32768,           32768
##UNITS=     HZ,            ARBITRARY UNITS, ARBITRARY UNITS
##FACTOR=    0.157963299565203, 1,           1
##FIRST=     4132.6476996994, 0,             0
##LAST=      -1043.33573715361, 0,           0
##MIN=       -1043.33573715361, -26314,      0
##MAX=       4132.6476996994, 269641148,     0
$$ Real data points
##PAGE= N=1
##DATA TABLE= (X++(R..R)), XYDATA
$$ [...]
22097 -234 -2737 -504 -1735 -6657 -4157 -154 -1059 -3050 -5266 -6274 -10022 -11068 -15998 -16289 -17978
22082 -17978 -22623 -16113 -6527 -1451 4582 7221 8800 796 -8465 -9369 -4589 -207 -3000 420 -655
22067 -655 -2576 1552 1914 -1836 1373 1802 1575 -3547 -4854 -6909 -2376 -412 274 -3759 -10111 -16599
22051 -16599 -16546 -8344 -5054 -4581 -5598 -9502 -6988 -574 1609 2699 3286 1541 1224 1562 4562 -1757
22035 -1757 -4409 -9503 -11162 -10606 -3471 3778 4062 -1407 1189 -3227 -10010 -11498 -11748 -3408 -907
22020 -907 3414 8679 239 -5384 -4531 -1382 2066 1865 2954 7310 3045 -452 959 1736 -968 6980
22004 6980 6135 5137 6549 10746 9582 3199 1249 3905 4742 6063 6119 9037 15110 11591 9028 10941
21988 10941 5226 4908 2934 -825 2853 4816 -1951 -3209 -6962 -3616 4252 3052 -1352 3990 2643
21973 2643 -1903 -442 2178 1833 77 -3273 -628 5368 4399 4769 8250 5929 2126 3947 672
21958 672 4017 2514 -3332 -1660 212 6659 9332 9127 1370 -1445 2190 5588 -962 -4012 642
21943 642 1875 546 -1695 -3934 -4002 -2438 -5218 -1731 -1147 -1778 -371 3185 8775 6365 2240 -930
21927 -930 -3178 -1186 2462 3477 5216 12702 10386 6679 2040 867 909 1245 -6651 -9535 -3082 5770
21911 5770 -914 396 -4880 -3513 -7358 -10130 -7039 1892 -815 -4486 -621 -12 -2287 -4948 -1688
21896 -1688 -2855 -5050 -1465 1185 -4674 -4156 -4621 -4242 -2324 -2570 -4971 -6359 206 -1841 -759 -1889
21880 -1889 -7684 -9794 -13774 -8592 -3680 -5987 -350 -378 -242 -5095 -5168 -2925 -1621 -1678 -264 6007
21864 6007 7503 4437 -1204 2253 8595 11916 4141 -3060 -7533 -7181 -4508 782 2076 -186 5209
21849 5209 9450 4275 1791 3231 -510 -7161 -278 1239 -1873 -521 -570 3139 -935 400 5549
21834 5549 3560 -4605 -10725 -10372 -12639 -10110 -1668 1150 563 5012 7509 2706 1524 6529 13435
21819 13435 10858 5355 -716 -9336 -3342 766 -3495 -8988 -11163 -8015 -9512 -3956 -885 2066
21805 2066 3992 2964 -7192 -9854 -6704 4473 1961 -8663 -13125 -7012 5257 12706 9065 3174
21791 3174 -1404 -6629 -3132 -7953 -9204 -6588 -3062 -1231 -80 3509 6586 6204 -1374 -8327 -9583
21776 -9583 -4880 -4024 -2244 4462 10057 4976 4807 6080 2776 -2563 -3682 1745 6593 4964 4123
21761 4123 -653 -821 5 4036 -323 1102 -4772 -11689 -11808 -8897 -4349 1842 1318 -6184 -2801 2304
21745 2304 4288 6021 1757 -3523 -4423 -6273 -4606 -100 5042 4076 -4658 -10496 -12461 -11175 -3542
21730 -3542 6396 10016 6351 3907 1813 -1669 -446 6262 5783 6328 13392 11703 3208 -2452 2869
21715 2869 3433 523 -6797 -5617 -1772 -1568 -1759 -6262 -6498 -9624 -8986 -9968 -4529 -3327 -3114 2129
21699 2129 6080 5836 537 -2361 777 -674 -238 5031 9315 6656 2891 5163 -1639 -3126 4050
21684 4050 2844 356 3515 4800 5351 -1225 -761 3149 8205 6408 1584 3967 3344 4486 -680
21669 -680 2076 5967 7312 10025 16316 10855 8096 11886 13031 7711 1184 -64 31 5359 5364 1676
21653 1676 -2677 -3359 -2729 -3365 -8637 -6450 -5468 -4200 -7516 -5902 3848 10392 5683 4561 4420 1859
21637 1859 -1946 -5640 -3166 -2424 -5724 -8264 -12428 -9647 -2083 4375 6603 3432 2675 -2554 -9238
21622 -9238 -3322 -615 -1984 -6795 -4771 -6008 -5416 -3991 -1187 1234 4268 1999 -3766 1223 12512
21607 12512 10518 5970 7983 7026 3095 1822 -205 6873 5509 10959 5840 -3728 -5525 944 3039
21592 3039 -972 -1630 -3655 4346 6991 9097 3060 -531 -2965 -3710 -4661 -4081 3372 2947 -1064 3038
21576 3038 6779 4461 -77 -9300 -12678 -11138 -4528 2980 4861 2166 -5457 -16742 -20908 -11770
21562 -11770 -3080 -1847 -5759 -11747 -18305 -3729 10026 18257 17806 14900 13429 16246 15067 7916
21548 7916 8306 8000 1257 773 -3254 -8925 -6458 924 9968 9323 -134 -870 4919 1820 2675 5475
21532 5475 4185 -715 -5764 -2904 2574 -3328 -10993 -9187 -8027 -9000 -7919 2095 6354 7201 2879
21517 2879 -5787 -6730 -4087 974 -1088 -1783 -2032 -7165 -8594 -10183 -13647 -10248 -10971 -7516 -4911 -8721
21501 -8721 -4742 -10256 -11480 -11348 -11314 -11022 -7022 -4057 -5252 -8808 -14909 -14743 -7116 -1143 2027 -3860
21485 -3860 -4933 -1135 -4282 -6447 4302 8032 4401 -1389 -981 -2671 -1816 -2528 -5958 -2096 2060
21470 2060 -3595 -3837 -1840 -1778 -359 7293 9282 9855 12904 14174 12568 7764 7530 7437 6097 1747
21454 1747 1223 2032 5964 6816 609 -1240 -5944 -4681 -8223 -11045 -10844 -7296 -2110 4298 -1663 -4818
21438 -4818 -3074 -3654 -6743 -7060 -2853 3668 3431 2001 -2807 -10072 -10355 -11251 -9883 -10546 -9766 -5828
21422 -5828 -599 -1786 -7079 -6335 -6522 1820 3405 -518 3709 5274 -46 -7623 -6039 -5656 -1318
21407 -1318 4102 -1187 -3662 -6041 -9394 -2282 4163 1600 3246 3164 -3462 -7397 -10598 -14089 -5449
21392 -5449 1066 4898 -4512 -5596 1694 3901 1992 1565 3934 176 -3815 -6970 -2264 -256 -4176
21377 -4176 -6237 -6482 -7286 -9067 -6865 -3419 -1274 -3056 -675 -1170 2509 -3395 -3407 6831 10402 5983
21361 5983 1330 -5402 -5879 -4851 -1126 -4535 -8145 -5966 -263 -1587 -1571 2598 4749 9993 9051 4560
21345 4560 5985 9352 3804 223 199 -226 -3480 -1306 5595 8573 6473 2271 -3300 -68 735 126
21329 126 -3317 -7250 -6824 -7022 -2050 -619 -9944 -10105 -11555 -10977 -6383 -4021 -4694 -7787 -7735 -6268 -1988
21312 -1988 5797 9780 13149 8776 724 4630 5857 1895 5139 5852 597 36 -2890 -6996 -6710
21297 -6710 -6585 -8023 -7588 -4242 -632 323 1862 8093 3903 -5507 -2533 5419 9062 5328 1361
21282 1361 1768 -3811 1506 467 -3457 -7456 -3941 -4496 -10914 -17726 -9746 210 1757 2066 -1440
21267 -1440 198 -3276 -5457 -348 -3699 -3288 -2399 -7275 -8174 -7782 -12242 -8541 -1918 -7127 -13880 -13782
21251 -13782 -12463 -3673 -831 1727 1761 854 3220 -280 -1618 1712 2861 -735 -49 -2599 -8723
21236 -8723 -12699 -10093 -13508 -11322 -6109 -4638 -3267 -4394 -4315 759 8565 5410 5202 3405 -879
21221 -879 42 -3756 -2382 -4710 -6272 -3744 -4137 -381 -1953 -7111 -2995 1456 5510 4429 2063
21206 2063 7889 9737 10094 2737 -1133 -537 -1387 3090 4630 2172 -5642 -7908 -4627 6348 6468
21191 6468 -2050 -6748 -6750 -495 -574 -100 6301 8976 14789 15653 12844 7218 4565 -1345 3344 5064
21175 5064 3395 -4184 -7988 -4307 -1048 1070 3843 -2198 -381 -1738 1096 -3180 -6464 -9637 -6427
21160 -6427 -3292 -3965 399 5306 8274 3614 509 -5 -3798 -10721 -6086 -4580 3601 5674 4113
21145 4113 1118 -1196 3576 3728 -1548 -6889 -5690 -9519 -7116 -3990 -2556 -8483 -4930 -2921 5160
21130 5160 7973 7123 6477 7989 4769 8525 8579 11773 10668 9121 5524 9680 9028 1863 -9436 -9232
21114 -9232 -5467 -8739 -2319 -6655 -12052 -9312 -4186 1593 3903 7573 11729 6563 717 -1776 -1759
21099 -1759 1448 2529 -211 -2684 -3470 -6852 -6047 -4143 669 -135 -1146 1734 5831 13412 9843
21084 9843 11165 12435 8361 2613 -1205 -582 -5206 -1929 1460 -3507 -2372 2875 6058 -930 2073
21069 2073 4680 629 -3462 -10890 -7680 -4491 -8461 51 -451 -991 -1251 -993 -6828 -3910 -3651 -7622
21053 -7622 -990 6082 -1193 -742 -2500 -2837 4725 -2118 -1377 -554 -1967 -171 -1330 -9942 -11442 -3807
21037 -3807 -798 1620 3707 4456 1135 -739 3609 3179 5207 1635 1370 -1460 -5644 -6202 1796 1038
21021 1038 3549 1746 592 2080 5558 8381 162 604 7533 5808 5480 4062 607 -2986 1953
21006 1953 3523 -1886 -8831 -10292 -8585 -426 4950 367 -4109 1072 2909 -2328 849 5972 -2215
20991 -2215 333 971 4779 9778 4172 -242 -2851 -5276 -12230 -9456 -8906 -9472 -8924 -232 -832 -177
20975 -177 6464 6794 737 2593 9816 8918 -245 -2135 -679 -2665 -1078 1151 2598 -3961 -5590
20960 -5590 -3878 -6330 -3169 -1888 -5726 -1942 2467 5724 3920 -6614 -7996 -7331 -1388 1664 2047
20945 2047 2013 4343 8646 4466 342 4100 4213 3397 3880 4657 6695 4624 -2656 -6542 -8836 -6062
20929 -6062 -5991 -4737 -6618 -12812 -12991 -9511 -3672 -735 2396 6260 4651 4703 6180 1602 -3288 2825
20913 2825 18 1014 510 1249 -2124 2426 -737 -6491 -3555 3965 2793 7847 7966 3899 6318 -5839
20897 -5839 -10379 -1102 3608 175 2860 4718 3447 -4142 -11271 -10576 -3393 -8194 -10368 -7471 -3168
20882 -3168 -2709 -3144 -2223 -1416 -251 -514 -2924 -3850 -1512 644 -1699 -8010 -5973 -5900 -6393 -3741 4615
20865 4615 5136 -1323 -6185 -5498 -6895 -5357 -4687 -1446 8213 18623 20716 10932 3638 1598 -946
20850 -946 511 799 2248 -3498 -382 5234 -1260 -4219 1393 6039 5937 6383 3911 2186 -2066 -2692
20834 -2692 7654 10004 7371 3799 2054 -2102 -1400 -538 -530 2757 -687 -1355 -4151 -2533 -3945 -4854
20818 -4854 -2733 -2701 -4049 -3692 -7491 -6649 -6886 -5623 -4873 -6431 -7092 -8320 -9166 -3285 1075 -1108 104
20801 104 -146 340 -2569 -4116 -3293 -3574 665 5992 3693 -80 625 3783 481 3485 2114 -1908
20785 -1908 1249 5824 6636 6571 8645 5765 1882 1973 -5392 -3035 617 -831 -551 5158 8192 3131
20769 3131 -2711 -1657 279 -1552 5198 2473 2870 8526 3247 6081 9857 4484 10047 11284 -812
20754 -812 -4189 -7985 -10742 -5993 1572 -2084 -3956 986 24 -8290 -3745 -2978 -3996 -3721 -4703 -7021
20738 -7021 -13753 -11742 -6319 -3551 -410 -4734 -11857 -8978 -12840 -14508 -10892 -5890 -7565 -3174 -3758
20723 -3758 -1840 4103 3474 -934 -5566 -4473 -1330 -6379 -8513 -12046 -13571 -14831 -5504 6162 10106
20708 10106 6596 -2880 -4120 -1212 3327 3925 -5924 -10543 -7714 -7601 -9397 -7683 -7662 -3059 -11757
20693 -11757 -9897 111 2639 -1540 -3001 -5247 -989 1133 -226 1147 6806 9038 3386 -4829
20679 -4829 -5654 -6194 -8184 -9963 -5176 1506 -2957 -8826 -11248 -6834 -11473 -13965 -12843 -13436 -7357
20664 -7357 -8181 -6005 -909 -2033 -547 -3918 -172 3342 926 -4778 1280 5008 -1258 -9179 -4913
20649 -4913 -3347 -2135 -2465 -1086 -2973 -7798 -10763 -10588 -9959 -11759 -11675 -12662 -12922 -9615 -7638 -3615
20633 -3615 -6455 -13396 -15162 -6593 -7255 -9400 -12490 -5158 -1877 -1692 2445 638 -2273 -1385 3778
20618 3778 4545 1424 295 4047 -1579 -965 764 2980 2826 3877 3589 -3509 -8911 -7912 -2950 2451
20602 2451 360 -4027 -7772 -1613 -601 -931 -7295 -11133 -5113 5537 9657 5211 400 -9 38
20587 38 3606 6026 2169 -3265 195 -1156 -4580 -5899 -5266 73 2642 1107 -1325 -2342 -5717
20572 -5717 -15200 -21060 -17581 -9692 -5817 -7280 -3867 -1114 2378 2660 -9030 -12320 -5760 6746
20558 6746 6156 -2388 -8052 -8105 -9003 -6891 -616 -1129 -4257 -15211 -17328 -17882 -20200 -16575 -9914 -7002
20542 -7002 -9612 -4549 -2363 -549 3223 3501 -4638 -3752 687 807 6982 12281 12544 10064 8322 1314
20526 1314 2274 1576 -3589 -1325 -3486 -2917 -1163 -680 99 -1912 -5963 -3097 -3276 -4515 -5199 -7842
20510 -7842 -16243 -19818 -10329 -7286 -2866 721 2618 1976 -1762 -36 5313 3875 -528 -7505 -11735
20495 -11735 -8376 -4523 -6747 -4884 4912 3353 -73 3945 6507 3562 4410 4486 28 -6854 -8966
20480 -8966 -6477 -2167 -3790 -2999 -3352 -3906 3952 8232 5074 -1459 -9214 -4650 -4148 226 4785 3889
20464 3889 236 -8368 -4488 3933 5761 1634 5641 8342 3408 -489 -4993 253 6718 5023 6878
20449 6878 5810 -5956 -13217 -10874 -5099 4228 6409 2713 -3078 -7646 -9812 -6744 -862 -41 -3833
20434 -3833 473 -504 -3831 -5268 -7373 -10369 -7299 -5336 -7771 -13119 -7398 -30 984 4195 6131
20419 6131 -3360 -12853 -9489 -4302 -3327 2485 1664 -9320 -12053 -3327 6387 11782 16581 13465 12324
20404 12324 15726 3967 4915 5377 5679 7035 7673 5288 4830 -7 701 3815 2740 2218 1255 -780
20388 -780 5525 12038 8508 6458 6418 10137 6257 5515 5621 5982 4499 4418 5555 3625 1271 2166 2798
20371 2798 -279 3544 12289 10539 3194 -2817 -3302 3805 5195 1441 -4429 -9591 -3788 4250 5319
20356 5319 4036 -3833 -3361 4713 -3475 -2115 1719 5862 11508 13612 5866 1813 4425 10532 7683
20341 7683 5227 4428 5932 395 -4546 -2495 -742 -5731 -9796 -9158 -11471 -12540 -16681 -19897 -21176
20326 -21176 -17616 -18399 -17492 -11382 -3798 -3541 -1743 3744 1202 4765 1863 -3603 -2039 467 76
20311 76 -1646 -11541 -16076 -18501 -15932 -11822 -10937 -12374 -19636 -22317 -21575 -17076 -15254 -13420 -3544 -5451
20295 -5451 -7168 -10155 -9771 -3321 3247 6399 5558 -172 -9733 -6780 1726 2996 -124 5656 1199
20280 1199 -10522 -12143 -11245 -8606 -6365 -4388 -2174 -1998 -1736 -3037 106 -804 -4354 -5909 -4687
20265 -4687 -2988 2963 3234 -1934 -5456 2282 5481 9906 11380 10825 13574 9360 -821 994 3296
20250 3296 49 1264 2908 83 4373 10515 16372 15650 7700 -4517 -3686 1696 2979 668 -7631
20235 -7631 -7346 -11321 -9519 -12054 -7185 1265 8806 11844 12649 9900 1956 3669 6412 655 -2238
20220 -2238 -477 -2778 -5783 -8110 -7157 -4280 -3542 842 5132 -406 -2743 -1838 226 -8377 -9970
20205 -9970 -8302 2027 7483 13219 10702 3809 5615 9723 5271 -3958 -4339 -11236 -10980 -9790 -2660
20190 -2660 747 885 -8272 -16670 -14758 -7771 -7599 -2910 3033 -2248 -6858 -12954 -11052 -2409 3239
20175 3239 2882 5299 4319 5361 7591 1569 -824 1708 -3822 -11581 -17686 -23982 -16297 -1074 -1156
20160 -1156 -843 4800 8502 5920 -1034 -2568 5116 10922 3091 -1483 5189 7587 6318 5169 4443
20145 4443 1865 1473 -4178 -729 3984 3992 3110 -5874 -8862 -5620 -9761 -9773 -12280 -10222 -9592 -634 2450
20128 2450 -557 -4559 -5522 -10225 -14278 -10305 -10785 -13347 -11159 -9202 -9753 -11754 -15982 -16504 -6388
20113 -6388 2808 219 2322 8284 6727 5630 14487 23063 19591 9392 301 -5104 -5896 -7802 -9967
20098 -9967 560 7998 5247 7392 2285 -2282 372 -2318 -4084 -1213 -1477 -1914 -858 -306 -5261
20083 -5261 -15695 -15164 -9508 -5562 -4871 -4238 -3375 -2623 -1605 -5347 -11332 -13395 -11760 -13799 -9120 -8130
20067 -8130 -3690 -4337 -221 -1965 -3094 -4319 1283 6083 5899 1972 -1770 -4954 -11227 -7837 -8223
20052 -8223 -11663 -14006 -9904 -9204 -6084 1037 5583 5594 542 -6092 -18171 -14787 -7668 -2444 1316
20037 1316 -499 -5614 -484 2653 -2443 -7887 -8634 -6350 -7064 -3538 1961 6992 9760 5370 6192
20022 6192 558 -7254 -12054 -7869 -6390 -5710 -6879 -7775 -10 5853 10255 5943 7308 1545 -7313
20007 -7313 -6357 -15227 -19033 -12954 -5462 -4814 -1561 4479 1379 -4005 -3762 -2593 -3828 -9385 -9123 -1689
19991 -1689 3255 2044 1786 8014 8307 2295 2631 5040 3790 0 -1007 -1992 -1419 -4761 1491 3143
19975 3143 -1061 -4634 -7872 -6312 3867 8303 8154 2659 -2256 -5755 -4546 5330 8936 7514 8635
19960 8635 3423 -2091 1195 3230 -1741 -653 -1494 1354 -51 -1852 -5801 -4531 -3723 -4351 -2313
19945 -2313 -5303 -2979 1208 2668 -1343 -6881 -8988 -756 5926 8008 5122 1212 -291 -5158 -9516
19930 -9516 -10133 -7356 -733 1847 -1405 -1386 3036 12864 12789 10763 12341 15480 15800 4226 -7746 -6978
19914 -6978 -3714 -3737 -5588 32 479 -4394 -6758 -7413 -9126 -7681 -4288 -5291 -8412 -6579 -11319 -16865
19898 -16865 -21395 -18012 -13069 -968 12658 13281 13077 8686 4401 -404 3438 3080 -7627 -12641
19884 -12641 -6967 2495 5822 6894 2309 3837 5527 -1712 -2822 -3891 -9254 -9092 -6441 -1518 -336
19869 -336 -5683 -6156 -10747 -15809 -7063 -1532 -5391 -8926 -10006 -3360 1819 -2692 -7538 -12014 -10364
19854 -10364 -9006 -9610 -7043 -1073 -149 -2609 -7034 -7752 -8387 -4219 -9242 -12106 -1706 2441 -2576
19839 -2576 -2391 -2045 5812 6773 -1017 -145 -3432 698 -2536 -4021 162 1198 -758 2797 4704 2927
19823 2927 4063 5153 -230 -2392 174 540 10258 15790 11462 16348 16381 13611 13410 10771 735
19808 735 -10017 -9635 -8672 -1931 -4220 -4643 -4338 -2139 -5941 -5063 -2433 -2019 1984 -582 3975 2748
19792 2748 176 -2619 -3406 -4572 -3813 -6297 -5902 -150 872 4707 12998 10152 2473 -4170 167
19777 167 1196 -6453 -13168 -8359 1126 -420 -4319 -9147 -9918 -6982 -3769 -1448 -4678 -6542 -4818
19762 -4818 5070 8177 -364 -8090 -9282 1097 1086 3716 7748 -3711 -4136 -6275 -2006 5320 4962
19747 4962 3389 2534 220 4630 -853 -2121 2480 5826 3100 1078 2880 4874 -3489 -8612 -6460
19732 -6460 -4929 477 -1002 -2560 -3560 -241 -1605 -7084 -7333 -3460 -2150 -8981 -13942 -6608 -3923
19717 -3923 1837 -797 -867 1919 3270 960 -3334 -1501 -49 2726 1445 -4182 -4224 3829 7380 3279
19701 3279 -624 -1029 4388 1930 -947 3020 10563 7937 3851 -1922 6825 8363 2868 1407 -2297
19686 -2297 -3679 70 -325 -1807 -3067 -895 -9387 -14354 -13056 -12153 -19106 -25051 -18552 -12792 -18062
19671 -18062 -16654 -16437 -15719 -15532 -15403 -8580 -4737 -7932 -5245 -2376 -3288 -5055 -2687 3708 328 -2362
19655 -2362 1965 2671 2591 1244 -1755 -2926 -1740 -1884 -10748 -11671 -8425 -9282 -10039 -12032 -7137 1391
19639 1391 901 4666 842 -6275 -14155 -13980 -3813 -3969 -1735 -3588 -4582 -518 1097 -2405 -4905
19624 -4905 -9559 -8859 -6597 -8885 -7556 -11442 -10220 -234 112 7826 8052 13620 15425 10697 6217
19609 6217 6506 -312 -4620 -5288 -5525 -7196 -5018 3059 1381 -66 5435 8330 5737 -2373 -6139
19594 -6139 -7229 2492 2345 3232 -2774 -2797 -887 -5228 -5234 -1185 402 -2941 -5542 -3178 4135 9351
19578 9351 6542 539 1205 2876 3432 2094 468 3944 518 420 1010 -705 -5098 409 -6065 -13909
19562 -13909 -15301 -21969 -15726 -8432 -8213 -12220 -6352 -2973 -5579 -9215 -9814 -7688 -6637 -7712 1419
19547 1419 5405 2060 -286 4451 7490 4947 -5296 -2220 -2843 -5235 -5102 -10939 -6187 -1766 1816
19532 1816 439 -4009 -3474 4565 4337 -952 4448 9721 11114 10953 9127 5209 6397 11776 9981
19517 9981 3438 -3625 -9672 -2649 2191 2965 -3522 -2399 7733 17095 9342 -418 -5121 -4836 -6720
19502 -6720 -221 3619 1052 -5598 -14725 -15049 -8580 1893 5279 -656 2747 2954 5980 4490 -2021
19487 -2021 587 240 -703 -2346 2113 1533 1227 2921 3994 2851 131 -4017 -2499 -4090 -1731 -3052
19471 -3052 -5293 -7106 -4372 -4491 -8952 -6692 -3821 -5657 -3973 -4100 -5545 -8661 -9401 -8355 -17830
19456 -17830 -15162 -14548 -14504 -11559 -3423 -7197 -8548 -3160 -501 11802 12066 4004 -4785 -6129 -6676
19441 -6676 -3713 -2195 76 -3289 -6951 -9947 -8729 -4064 -872 -2645 45 -6643 -6350 -2183 2462
19426 2462 -224 -5902 -8560 -11439 -5352 -4541 -8480 -7969 -8629 -5768 -5874 -6828 -220 3450 3507 2512 -1639
19409 -1639 -6237 -5106 -5733 -2871 -4702 -4051 -4754 -6795 -7243 -6305 -6524 3831 11184 5531 -1737 -6973
19393 -6973 -1733 -1603 -1082 -1956 -5656 -12192 -12065 -565 -197 -3502 -3558 -2785 -2531 -1973 5126 342 -4093
19376 -4093 -3714 -3769 -4818 -2895 -4947 -1935 -3535 -5534 -5226 -7278 -7322 -4390 -1252 1991 -5392 -1186
19360 -1186 -2116 -7101 -6883 -11052 -15281 -9692 -10813 -14038 -9876 -11751 -9018 -2074 -1862 -7981 -7777 -2275
19344 -2275 2585 948 -1953 -2059 1265 5100 9117 7602 4702 5749 11439 10016 3867 2233 -3769
19329 -3769 -6076 -5545 -2480 566 622 901 -3732 -10991 -14906 -11612 -254 -1170 -1668 4392 11652 8391
19313 8391 3947 299 2138 -2238 -5578 -1664 -503 -86 1364 -5287 -7166 1348 7305 9559 1876
19298 1876 1897 -4586 -9175 -14581 -15972 -13760 -9741 -8981 -9398 -11134 -4225 5072 10201 10889 7206 8558
19282 8558 533 -4945 -6139 -9559 -8485 -3159 2185 3895 6294 7493 10412 5312 -1779 -6963 -5926
19267 -5926 -7045 -10062 -5367 -7383 -8451 -9872 -5981 -3227 -4880 -6263 -10526 -15529 -6544 1368 1693
19252 1693 -4212 -10005 -8067 -8145 -7505 -8370 -473 9344 11129 19028 17730 9451 2185 -4974 -56 7359
19236 7359 8430 5115 6971 11366 7926 620 283 4732 8627 3090 2453 5209 5383 51 -1702
19221 -1702 3006 5959 11210 9136 10330 15861 15162 7558 -1716 -10932 -12480 -6865 -252 1919 -4509
19206 -4509 -580 1223 5094 7648 4284 7249 4444 3470 2230 1164 -89 111 -355 5946 7600
19191 7600 5723 3682 1940 2157 2112 -7364 -11152 -3166 2548 -3105 -3760 2156 3417 -7069 -9825
19176 -9825 -12047 -12731 -4694 156 3612 4633 -1725 -941 409 -2107 -1797 -34 5492 6212 3835 -48
19160 -48 -2153 -2612 -3189 -4283 -2892 -6126 -7469 -6147 -8578 -7500 -5056 -3772 -6695 -8657 -10263 -5487
19144 -5487 751 6691 7874 12943 15762 10087 -1057 3414 1539 -5795 -5039 143 574 -709 130
19129 130 1284 -2076 -10829 -12010 -11019 -16729 -16502 -9574 -11215 -16880 -10137 -7201 -5893 -2418 -3487
19114 -3487 -5321 -9167 -6468 -5468 -876 -35 -5064 -7426 -4885 -5778 -6762 -7352 -9365 -3286 1773 7200
19098 7200 4290 -3623 -2764 -3299 -3553 4034 11882 10701 3743 2087 2261 -350 3293 4342 -644 -4635
19082 -4635 -6097 -10886 -7667 -873 3951 6441 4717 4486 1051 5591 4632 798 981 -301 -3110
19067 -3110 -4108 -2715 275 -2697 -6320 -3222 130 4366 4641 5589 2152 590 -388 -3029 -5732 -5603
19051 -5603 -1336 1850 6086 1730 -1764 6070 3529 -2953 -1072 -3081 1259 -1478 -9390 -8467 -5673
19036 -5673 -5812 480 3458 4456 2152 1040 -7033 -9858 -8075 -12475 -15742 -6556 -5952 -13053 -13142 -5099
19020 -5099 2913 1227 -1877 -7127 -6978 -2478 -2454 -4139 -705 -3963 -13403 -13506 -17251 -14878 -5596 -1807
19004 -1807 -4532 -7770 -9341 -8813 -8531 -6814 -13026 -11116 -1375 929 3189 -4013 -4956 -7003 -5559
18989 -5559 -4233 -6649 -6805 -7718 -9221 -11644 -6505 -553 4663 5708 4612 -349 223 8065 8221 6097
18973 6097 2422 6936 7894 3939 5840 10176 17505 12270 4069 -922 -4450 -1080 1013 891 -4320
18958 -4320 -7383 -370 5054 4412 6233 12922 7396 5596 6180 1360 -1729 -2997 -3804 -5588 -5733 -8844
18942 -8844 -8573 -5968 -7270 -2927 -4434 -1923 3602 3502 -1697 -5337 -6479 -5309 -6892 -1553 -4863
18927 -4863 -5072 -7122 -8277 -5428 -793 244 -2846 -8640 -6575 1028 371 -687 -477 -2002 -231
18912 -231 1482 3216 3152 3344 713 -2131 -1081 -5877 1253 1617 51 4620 2276 3834 9572 5470
18896 5470 3302 1218 -3837 -4259 -5277 -4253 -2260 -2403 -2011 -328 -1579 699 -1587 -4032 -5700
18881 -5700 747 2559 -274 1895 3366 3959 3883 8409 7310 6507 1787 1119 330 217 -2452 -5378
18865 -5378 -3800 -2649 -5708 -4196 -946 -4324 -6033 -911 2719 1380 3072 7818 470 -5187 -2138
18850 -2138 -4359 1526 9192 12204 14032 12026 13935 9670 823 -4247 -1672 -3108 -4016 2313 7286
18835 7286 5498 10278 10781 1727 -1959 -3612 -7001 -8899 -7064 -3624 -3913 -12941 -12998 -13341 -13697 -8027
18819 -8027 -7216 -9194 -6530 -9945 -9567 -3684 -3912 -5622 -5120 -9953 -1432 5397 7065 7006 5837 3681
18803 3681 -3787 -5243 2348 9757 397 -6108 -4059 -7771 -15666 -16922 -11079 -12718 -13872 -7377 -6383
18788 -6383 1845 8982 10302 8520 1397 -3448 -3157 -4491 -11526 -8030 -4310 -8 665 -3004 -9488
18773 -9488 -8898 2636 14245 31307 46125 51765 54221 40321 24272 11765 9763 8644 8869
18760 8869 9735 9624 9252 3520 6409 4513 4728 3918 618 -1045 -2135 -3736 -6161 -1752 11 -1317
18744 -1317 -2269 -1908 4781 4447 743 -5423 -2467 5125 6723 9548 3115 -6085 -12106 -8880 -2143
18729 -2143 -168 -4957 -8793 -12473 -12216 -4596 3744 7265 12925 8524 4751 9531 6841 1877 2328
18714 2328 2047 -3527 -3976 1008 2937 2301 206 -802 -3378 -10504 -12008 -3585 5956 3731 -4252
18699 -4252 -9529 -9902 421 1530 3190 2823 -1454 -2324 -4834 -6234 -10204 -4872 -13 -5235 -4855
18684 -4855 -3465 -7699 -4441 1366 1370 -7432 -935 7551 10071 2793 -6080 -5669 7433 7941 7834 1527
18668 1527 -5084 -7593 -9302 -11399 -10685 -3495 -706 -1530 -46 2684 -4775 -6696 -6279 -381 -1307 -7338
18652 -7338 -2745 1288 1164 3410 -2637 -8822 -6055 -2391 -1051 -3233 252 -3175 -3549 -4010 -9266
18637 -9266 -6814 -5970 185 -230 1742 3935 2437 -254 -4437 -2621 6626 11260 2315 1954 -239
18622 -239 -3880 -188 4451 11943 15443 17084 13309 12485 8021 6793 1499 1044 2597 5054 7841
18607 7841 2202 -5389 -5816 -5515 -7467 -4787 -4646 -3472 -4275 -3379 -1848 -2422 -4752 -5352 -549 5522
18591 5522 16218 16348 11649 6660 3498 3245 2243 381 -6826 -743 1000 -3133 -8303 -8956 4302
18576 4302 7795 -835 -2967 -6170 -7329 -7319 -8753 -7275 -7387 -4661 2344 -2463 -3004 -7231 -9427 -8010
18560 -8010 -4782 -533 1414 4635 9316 11299 6077 590 -3098 -3283 119 5312 841 512 -1334
18545 -1334 -7164 -12572 -8571 -2121 -549 567 1565 -2001 -5464 1381 3403 905 6393 7205 8490
18530 8490 9801 -1105 -948 497 1257 5203 10887 7282 2611 4733 828 -1727 3087 1407 -7733
18515 -7733 -7309 -199 4781 9900 11437 11651 12793 10850 7287 10760 14882 8705 -1699 -9216 -14877
18500 -14877 -11432 -8589 -3600 136 1810 -1892 -396 1600 1921 -1964 -6485 -6484 -1050 4203 3115
18485 3115 -4524 244 412 -5242 -9206 -9508 -9566 -13914 -10402 735 3788 8023 5829 -3465 -173
18470 -173 3373 3431 2707 6332 7371 4593 -253 -2858 -6303 -8623 -4620 6643 9014 4806 3443
18455 3443 2404 -320 4124 10305 8036 5489 5211 1670 -423 -3515 2635 7037 2533 1353 9544
18440 9544 9574 11471 12653 17783 15150 9706 6501 9278 2483 -896 -7616 -2576 2999 2170 525
18425 525 370 -2438 2538 -166 -2941 -6238 -5636 -688 403 -3110 -5257 -4552 -2535 -2841 -732 3887
18409 3887 2515 -4706 -4427 -1907 -1928 -44 3808 4604 -2132 1169 2826 3517 2983 1967 66 -1514
18393 -1514 -2637 -5775 -6885 -8282 -5837 4474 6643 4717 8363 6254 14915 14028 3971 -2607
18379 -2607 1410 11388 14634 11364 14749 15690 13551 9382 6492 6985 16286 18400 19770 12775 6560
18364 6560 8989 15137 16385 15458 17153 18789 13535 8959 4950 3746 6005 20251 23953 15200 5493
18349 5493 1787 4382 5738 1896 -474 2253 2079 -158 -9816 -4721 2225 8401 10329 9980 8543
18334 8543 8474 7596 4258 -1607 -1432 1694 11203 12969 14267 11739 4373 -1752 -2428 -3106 -433 4681
18318 4681 -565 6597 12293 6360 5712 2924 -667 -2703 -923 8259 11287 11476 13315 18388 17881
18303 17881 11265 1936 8078 11301 11064 11177 16110 15744 19595 16406 13397 10649 13705 13160 18723
18288 18723 20547 23526 19823 19384 21434 20710 12897 13748 17664 21657 23157 24125 25394 26010 31699 41820
18272 41820 44584 49811 63789 76142 105245 148034 179390 193002 189772 213391 256003 300260
18260 300260 312740 276129 239892 224949 219821 220588 195543 154412 127934 102015 83612 71515
18248 71515 66595 61740 53884 48882 48280 50811 49981 42401 45565 46248 45124 47769 46125 35476 26349
18233 26349 20992 20318 21516 22116 28241 31231 35986 31535 27434 37012 37474 28651 30580 33001 31579
18218 31579 34145 29710 22281 24351 29050 27366 21753 18923 23890 24949 17058 15486 22249 21280 19417
18203 19417 16448 14070 24605 26839 21200 20059 16486 13479 15236 23087 26282 23207 18929 18821
18189 18821 19094 13184 15940 19100 22776 25324 18806 16040 19615 23392 25269 26051 25338 22518 22868
18174 22868 27231 25774 18010 10479 11877 16039 19277 21540 20954 22601 25529 21353 24919 28625 26322
18159 26322 19505 14212 21843 17500 17179 23671 28953 36529 35417 40156 46209 49021 46891 47008 48101
18144 48101 50061 49018 53147 60815 62813 58965 53932 45724 47208 56849 66734 72920 86439 97960
18130 97960 110867 126568 130403 139964 152074 168973 192568 230459 263474 307984 361443 430321
18118 430321 522324 627543 760949 953969 1260817 1780421 2725365 4402630 6639914
18109 6639914 8525972 8695446 6252355 4107911 2993494 2372771 1962305 1668050 1444896
18100 1444896 1267378 1125016 1008389 915366 835423 757259 704688 664456 612441 565626 530305
18089 530305 492491 463125 443537 425568 403328 387703 373487 358231 343110 330613 321213 313281
18077 313281 302337 299447 299174 286521 273003 261661 253806 237692 231968 225317 212000 197294 187317
18064 187317 176155 170978 171443 171536 172019 168149 160564 155012 148555 143422 136496 139080 133267 125484 120220
18049 120220 117696 114373 110095 111692 111140 105310 103249 92873 89993 91939 94070 90677 97050 97908
18035 97908 92956 83825 80217 76610 73736 75342 72489 67205 60324 57248 54023 60441 62051 54951
18021 54951 55781 57905 54943 46291 43513 42807 47273 50256 51940 47657 48845 44532 37060 31354 30476
18006 30476 32900 30794 25939 25390 32284 44613 41341 38370 41760 38215 36558 36136 30947 24472 20360
17991 20360 20792 19693 12011 7079 10681 15068 16921 20489 16536 14825 13441 10037 5222 1457 2187
17976 2187 10162 10500 8837 9982 4794 9387 12189 14353 11948 10655 10871 12587 18192 28150 26635
17961 26635 21644 19617 20745 18191 21897 28829 24554 32848 36155 34551 31319 24797 20473 24046
17947 24046 15955 11308 10447 15599 16417 13000 14725 15611 18432 20559 25455 33989 34294 35288 35983 36131
17931 36131 38954 46411 47692 40588 31993 27114 26368 34836 39208 36923 37407 38404 38843 36273 37258 47254
17915 47254 49705 50676 48765 47287 40722 40311 42873 33531 24542 19521 20286 20149 20249 20140 23590 31065
17899 31065 34623 30466 32765 26670 17992 18257 17699 12967 11371 13537 18704 14946 17453 20655 20009
17884 20009 18849 14781 16547 14696 18477 22932 25005 22868 20535 20788 30906 31984 21414 13020
17870 13020 13040 5776 6833 16287 24519 22270 22406 31365 27600 24955 26577 34516 46230 51695 57965
17855 57965 60527 47418 43811 40169 38232 39979 39191 38317 32027 28144 30926 34044 32433 32970 33516
17840 33516 39995 39124 36554 39534 40262 45466 46429 44788 46364 43198 38305 37870 34215 33336 35473 37283
17824 37283 34404 38610 42734 41803 42598 44163 40177 41823 45227 43355 39320 37872 39374 41945 39947
17809 39947 40364 51472 55605 54967 57176 63206 62929 62505 65402 67170 72645 77065 79071 81703 89004
17794 89004 102908 108726 114015 120493 118435 124455 124997 123701 131063 140334 146434 142471 145325 143587
17780 143587 141808 138684 132471 129056 134793 140285 133802 125048 115812 119495 128256 127413 118560 111768
17766 111768 119923 126599 128461 125180 122589 126906 129203 131758 128141 127615 128738 123059 127198 137295
17752 137295 138197 136606 138074 140851 142632 148562 153170 164596 166582 162739 169940 181650 188935 185171
17738 185171 181627 186295 197030 198988 206008 207396 209410 199687 200719 206541 211248 212110 218932 225527
17724 225527 223655 225834 231104 233995 234355 234211 239743 245133 255496 267118 292303 303851 311925 316140
17710 316140 327441 348477 385757 418427 449213 471816 486595 514304 556711 606299 651724
17699 651724 694773 753942 843321 953494 1048864 1125573 1223276 1392193 1602200 1817243 1988822
17688 1988822 2131373 2347223 2666221 3049628 3496366 3983306 4581870 5470796 6770181
17679 6770181 8700340 11769976 16648273 23205308 29689967 33522106 33446674 35746775
17671 35746775 43547115 52983997 58388780 52489629 42189239 38120710 38201195 38340249
17663 38340249 34708160 27112594 20960954 17153202 14626059 12801307 11390363 10253141
17655 10253141 9340000 8593384 7987669 7485899 7018333 6578217 6176822 5858503 5593065
17646 5593065 5305126 5005310 4740822 4534861 4362513 4193270 4000998 3820553 3680822
17637 3680822 3558947 3445390 3340574 3213053 3074450 2955862 2844434 2728152 2622139
17628 2622139 2516632 2411527 2311508 2217448 2140798 2066967 1988890 1912566 1850373 1782351 1714999
17617 1714999 1651512 1593459 1547826 1503310 1455999 1403051 1352067 1309258 1266185 1218528 1171683
17606 1171683 1127840 1084239 1047500 1012775 980027 952706 915753 878789 860966 846692 832929
17595 832929 811223 784858 764911 743767 728204 714064 686066 668248 643403 624696 609713
17584 609713 588756 573937 555211 531595 517224 501034 488334 476357 455414 440195 423042
17573 423042 409402 399621 387653 380284 375836 374128 365227 356424 346044 338439 337784 335774 329145 317072
17559 317072 301410 290462 281708 258978 241701 230300 217148 198485 182148 169861 153974 149049
17547 149049 142597 135863 134014 125233 123419 122539 118043 113620 114134 112652 109375 105249 98242 82560
17533 82560 72538 66510 61754 60477 67982 65374 65578 58073 57044 56024 59278 62478 54735 51585
17519 51585 50375 49146 53932 56722 56058 51091 47651 47793 47461 36258 38678 42853 45207 48110 48824
17504 48824 47711 44990 41289 34076 34006 37841 38070 40044 41521 41336 41566 41483 37080 27771 25806 35317
17488 35317 36770 32904 30282 31622 34944 29728 27121 24053 21681 27231 36993 33970 37673 41474
17474 41474 33171 40589 46287 50701 53343 55934 60166 59237 61159 61730 66296 62592 61589 55736 50102
17459 50102 51358 49869 44461 44266 53299 55023 51304 44924 43498 51434 55754 48565 44471 55568
17445 55568 58967 62400 77976 92530 94856 79504 60865 50677 51640 47584 45780 41548 43777
17432 43777 42362 45185 44047 36091 30123 32132 27634 20851 26060 29193 35506 37659 26235 28841
17418 28841 27290 22298 26556 32299 39784 38164 33450 29887 26012 21891 10444 936 -2740 -4678
17404 -4678 -2034 -734 -1021 -182 2955 2516 2844 1548 4038 6732 9035 5978 4228 4421 1369 7432
17388 7432 10635 1082 -6090 -7260 -6865 -5616 -3718 -6118 -1111 -202 -2957 -4671 -13039 -11636 -1830
17373 -1830 1178 -2841 -6522 -5890 -739 323 -1592 -2721 -3684 1468 9280 15311 11908 7660 8509
17358 8509 12888 9860 9322 3891 -1325 4070 10909 6159 587 -403 -1622 -3295 92 3620 7841
17343 7841 11762 12922 8138 9813 4716 5531 6535 5406 6246 -7326 -13672 -12440 -2932 5200 5999
17328 5999 6393 8451 11274 5537 8221 5890 3314 -1117 -7302 -3108 3607 -1653 -4754 -844 4121
17313 4121 4959 4139 1410 -846 968 -1222 1519 3755 -1544 -2259 1112 838 -1874 -4618 -5436 1077
17297 1077 5915 3008 -2778 -3201 -11791 -17419 -15566 -8645 -5060 1116 2447 -1009 4388 6923 4283
17282 4283 -2367 -2108 -5184 -4060 -263 -3704 2031 7505 4331 -3349 -4707 -1123 -2182 -77 1507
17267 1507 783 2099 4631 -1014 -1306 2377 228 4621 7204 3666 4291 3147 4732 1447 1240 -3931
17251 -3931 -5595 -3736 195 6032 6172 8396 5502 1658 2736 1349 -1716 -3074 -806 4159 9048
17236 9048 11062 10607 -3264 -8256 -7222 -324 3354 65 -6010 -12316 -6382 1713 4444 5566 3533
17221 3533 6296 6881 5539 5031 11955 12714 6295 9643 11780 5251 -7750 -9314 -43 1599 8837
17206 8837 12615 20529 20119 23256 26433 29221 37852 51361 63936 80245 109541 125923 122682 126388
17192 126388 153501 206776 278409 326229 322206 275221 241716 243444 281207 325450 346784 313190
17180 313190 253080 216917 199224 187021 181409 170565 140182 109862 91127 77603 68907 65515
17168 65515 67403 60534 55406 49890 42465 38301 38964 43444 42538 42663 35538 21324 18940 20562 23716
17153 23716 18874 12872 14482 10362 1098 3442 12521 17498 16087 14772 15199 18319 18798 14795 9393
17138 9393 7585 8472 7857 4733 5575 8025 10469 5000 5796 10443 14121 13009 6524 -2756 -2249 1914
17122 1914 939 -977 -7044 -11621 -9600 -3680 182 4091 4478 8951 4323 3172 761 -3419 -6006
17107 -6006 -6187 -6736 -7530 -4980 1743 -2671 -6871 3535 14340 19140 20009 16751 21916 17215 14046
17092 14046 8306 6325 4916 7995 5567 6623 10226 14624 19967 24725 29338 35417 48060 70714
17078 70714 94592 124847 159966 181410 183072 194740 233382 285180 316221 292622 239508 216224
17066 216224 214567 206327 181566 143846 112654 90494 74148 69105 65318 56270 45093 42862 40885
17053 40885 45648 49307 40877 34046 26349 21754 22313 26291 27993 24453 19798 17398 16933 12971 10183
17038 10183 13151 13800 11512 7807 10982 9330 10203 8821 6256 10452 16842 16890 13707 10318 10357 9058
17022 9058 3646 218 641 2458 -1579 402 -649 1909 -509 -2869 -4817 -8667 -6645 -2910 -1617
17007 -1617 3700 2968 -740 -2421 -2153 3392 -1417 -12395 -18246 -11223 -3324 2591 3342 -2144 -1163
16992 -1163 -5235 -3660 -4968 -5080 -3807 -4600 -7487 -13583 -17241 -17082 -10647 -4659 -283 -1671 2110
16977 2110 2553 3291 6154 2285 4518 8969 1381 -5671 -2671 -584 -2830 -446 2939 -1500 -10029
16962 -10029 -17301 -22456 -11616 1828 2389 -9948 -10202 -8740 -3361 -7367 -11794 -8818 -1052 -1755
16948 -1755 -2694 -3620 -4487 -3915 4926 -946 -2737 376 340 -7075 -7957 716 3637 -1762 -2345 -3756 -8364
16931 -8364 -8204 -4662 -958 -2855 -7908 -3395 -720 139 -2554 -4176 -11545 -8004 -3028 -6863 -7909
16916 -7909 -3909 288 -8481 -9050 -5942 -672 5611 1615 -3436 -10596 -16253 -16610 -13818 -10787 -7078
16901 -7078 -3908 -1267 -4036 -7548 432 3979 4732 2674 -7308 -6811 -12010 -13676 -10423 -9990 -11598
16886 -11598 -14247 -11142 -11440 -11472 -5970 -4073 -3018 -8006 -16573 -13550 -10369 -6344 -1490 1066 -3931
16871 -3931 -9718 -15097 -14224 -14972 -13426 -10555 -8483 -8673 -8543 -7495 -6798 -2649 -2512 -3548 -6083 -4024
16855 -4024 -4181 -2359 -3471 -5448 -6517 -9512 -4119 -1079 1236 3308 884 -12031 -17652 -15879 -11187
16840 -11187 -12817 -12059 -9569 -11421 -7606 -2605 -5219 -6013 -12325 -10167 -4852 -979 -4945 -6753 -9315
16825 -9315 -13082 -14693 -8539 -2458 -1122 -8333 -7677 -4073 -8823 -15543 -18194 -25690 -21454 -13633 -12350
16810 -12350 -13729 -11754 -6613 -8188 -11069 -6885 451 3908 5535 2642 -2275 -1150 -3337 -4933
16796 -4933 3068 -1365 -12557 -12955 -11766 -10371 -15066 -8492 -4682 -1102 1786 -1561 -6718 -1037 -4155
16781 -4155 -5755 2088 8146 2145 87 2273 3606 -709 -4546 -2638 -1715 -1373 -1265 -5086 -3400
16766 -3400 -5266 439 -116 -2335 1669 -3337 -8480 -4581 1151 2674 -2308 898 5208 4557 5833
16751 5833 9825 6054 -6204 -2496 3489 3755 -3749 -8228 -13268 -16887 -18131 -15109 -6019 -3648 -7758
16736 -7758 -3347 -1414 -3190 -6309 -237 -128 -8242 -15326 -15675 -17372 -16518 -10595 2562 11694 12976
16721 12976 4758 -1214 -4477 -7620 -10672 -8758 -5628 -3084 1026 3407 -1666 1145 5443 4839 866
16706 866 -3775 -10797 -14390 -18458 -15244 -11931 -13143 -17862 -16802 -15677 -9801 -9411 -11234 -7051 -6405
16691 -6405 -4254 -10307 -12238 -8915 -7804 -10072 -13125 -11626 -10547 -8036 -5954 -6547 -10550 -10602 -7928
16676 -7928 -2540 -4702 -4411 -5830 -3108 4292 6696 1403 -7339 -12926 -7983 -4193 213 12 -3690
16661 -3690 -3737 675 -415 -2203 -1910 -1609 -4003 -8045 -5127 -2109 -7147 -5739 -2799 -2042 2484 -2461
16645 -2461 -2285 -4454 -1235 -5683 -1850 -1431 -9133 -4097 -861 -209 38 -3927 -10842 -3034 187 -3540
16629 -3540 -10261 -12392 -5183 7361 9134 2788 -3527 -10917 -12681 -10967 -10496 -4098 3688 4008 -1847
16614 -1847 1549 4980 3951 109 -4400 -6828 -8051 201 6179 8353 5291 67 2346 4383 1997
16599 1997 -2154 -629 3174 -1746 -10316 -19337 -25247 -20372 -5648 -608 -1337 -3082 -4939 -1663 -1401
16584 -1401 -5235 -5687 -3671 -3987 -8119 -8434 -8402 -16482 -11515 869 3452 1307 1443 -5829 -6199 -1079
16568 -1079 -776 -3640 2347 3723 -1378 -5510 -1172 527 -2022 -3067 -5510 -2103 -197 -1162 4617
16553 4617 7630 8650 14577 14239 5919 3059 -3766 -2198 -14229 -22924 -11328 619 -852 -6706
16539 -6706 -10242 -11112 -14846 -17813 -8557 -2714 1234 -3158 -6594 -6144 -1829 -3452 -12021 -10044 -3859
16524 -3859 -3605 2235 8736 7243 391 1215 4671 2249 2062 4354 4079 4468 -1280 -11149 -11451 -5953
16508 -5953 1287 -898 -10361 -13559 -12163 -13812 -17001 -24948 -25091 -15816 -376 2182 -4204 868 -3053
16493 -3053 -3619 -5153 1592 6372 1257 -4263 -1883 6952 5330 6948 8701 6730 -5270 -6095 -5154
16478 -5154 -6211 -7519 -7120 -1112 -3452 -7258 -7340 -13008 -11425 -3056 6876 6811 6776 9059 5749 7433
16462 7433 10449 7246 -724 -3070 -3691 -1977 1269 561 -2733 -3285 -3676 -3782 8138 4533 1843 -15
16446 -15 1612 -1069 -455 -412 -3820 -305 -6681 -11249 -16608 -15732 -12071 -5841 -3813 -7218 -8704 -13290
16430 -13290 -12073 -7797 -4632 -3841 -2927 3683 5257 1133 -1477 -3301 -1576 -268 3757 6308 7704
16415 7704 3375 7057 5814 2781 2569 4243 4273 4642 4279 9614 9176 4201 951 -5742 -7522 -9420
16399 -9420 -15339 -16269 -9808 -4558 -6210 -6304 -1875 -1911 -2650 -6559 -5804 2992 5774 -1443 -4110 5364
16383 5364 14514 2528 -7865 -8950 -10461 -13176 -8199 -1775 2496 4122 1657 -3689 -7743 -6899
16369 -6899 -7039 -2190 -5610 -9211 -674 -2976 -7704 -3477 -951 -2078 -3982 -4409 -5774 -2722 -3120
16354 -3120 992 3101 470 3652 4565 -2668 -3414 2482 558 -4653 -2848 -280 4617 5843 5600
16339 5600 11094 10248 7303 7946 6452 -6210 -172 4357 601 -3871 -4101 -8867 -8963 -7865 -7476 -9787
16323 -9787 -7980 -8337 -17076 -13617 -5550 -2022 -1044 -420 1048 -4834 -7557 -9283 -10518 -6962 -2110
16308 -2110 3933 7996 5533 6941 5474 2271 2872 408 4264 7502 5056 124 -7319 -8842 -4950
16293 -4950 707 -5462 -8331 -11525 -11546 -10135 -1037 87 -4110 -5942 -12665 -14374 -12479 -7524 -4543
16278 -4543 -4514 2429 -689 -1664 -2442 -1237 7666 9424 4179 2934 -1785 -8298 -18331 -26063 -26314 -15134
16262 -15134 -8165 -9108 -9998 -6551 -6785 -931 795 369 867 -2838 -449 -1440 1066 6332 10082 4642
16246 4642 2396 -328 -3354 853 -6644 -2935 -423 2563 565 -1212 5202 2746 3550 1005 1649
16231 1649 -3251 -2975 -2274 -1797 -3285 -1398 1984 4022 -6118 -10057 -7491 -13745 -13516 -6514 -5482
16216 -5482 -9405 -9468 -5475 -5798 147 5602 3719 2383 209 -4810 -6584 -9042 -10337 -10062 -13736 -15767
16200 -15767 -7446 -8282 -12674 -5333 -8467 -14271 -10213 -4985 -4599 -4652 -8117 -6912 -7712 -6267 -14681 -17204
16184 -17204 -14454 -10621 422 -618 -6115 -10397 -10245 -6905 -1514 1869 -683 -2820 -2057 -10189 -5122
16169 -5122 1355 1376 1159 -2405 -7466 -10579 -11799 -10077 5500 12576 6316 1275 6095 5162 170
16154 170 -8203 -11489 -5206 324 517 -815 -4774 -7416 -5286 -2939 605 1490 -667 -6094 -5528 -3670
16138 -3670 -27 6379 3791 164 -8627 -13881 -10970 -13572 -13599 -14057 -11199 -9783 -8869 -5193 -95 -1993
16122 -1993 -7152 -2217 -265 -4525 207 686 -2385 -6158 -9728 -10556 -9430 -2544 -3605 -3053 -8112
16107 -8112 -12096 -7143 -3709 830 -393 1250 -1469 -5038 6245 15123 9492 5900 -3386 -9712
16093 -9712 -11005 -11259 -5837 -991 -1202 -2853 -6557 -11019 -8250 -3855 21 -3618 -4204 -2575 -4636
16078 -4636 948 5354 -1216 -5964 -2598 2819 4815 883 -2814 -4417 -6344 -654 1035 825 -3930
16063 -3930 -6460 -7115 -5447 -660 2498 1885 -3062 2141 2446 -3348 1972 12453 11728 15158 9378
16048 9378 5521 5392 7988 4764 -2366 -8833 -9459 -2335 5382 5251 7370 9270 11449 8920 4397
16033 4397 3934 6460 7994 7495 5658 3431 4065 -1645 -6199 -849 3105 1533 -4662 -1275 -2639
16018 -2639 253 -9863 -11080 -854 11982 7525 2298 712 -2193 -3402 -8544 -8940 -12520 -12809
16004 -12809 -13526 -12967 -9533 -5856 -6081 -6818 -9268 -8189 -8104 -7170 -7906 -3912 2888 -554 -8663 -10867
15988 -10867 -14539 -7689 2220 -7108 -8738 -7953 -9897 -7733 -7808 -6045 -4423 231 -429 -6763 -15788
15973 -15788 -16874 -8566 5124 8557 1268 -4592 -4065 1946 2084 1017 5864 16410 25251 29634
15959 29634 33156 38371 40125 33224 30665 34593 37599 42033 41075 50781 62457 65260 63171 53634
15945 53634 54289 46904 46446 43985 48080 54640 57458 57053 54937 49789 46914 38640 32215 38482 45125
15930 45125 50357 49905 47824 43984 36981 33912 30955 28322 31195 31753 30573 23565 17286 18414 17600
15915 17600 12780 8372 7305 6902 6597 3338 7251 7440 10299 13687 10310 1452 7138 8256 10060
15900 10060 9212 1319 4223 7243 -922 -5384 -4104 -1909 9417 18439 18616 17116 11226 3969 2397
15885 2397 8044 13224 15521 6757 -311 1919 -1810 6496 11940 12493 10492 9479 9190 9404 10368 9998
15869 9998 8825 7176 8595 6802 144 -4384 -3433 -317 1570 5782 8448 6781 3994 -1180 -6510
15854 -6510 -1480 2703 2909 2654 6182 2522 263 671 -3478 1197 5008 6974 9359 1280 -2874
15839 -2874 -3210 -4159 -5408 -6329 -10987 -15825 -9968 -6464 -6452 -3819 -5070 -6274 -7107 -8358 -13658 -18700
15823 -18700 -16218 -10019 -7522 -10159 -9593 -7086 -11498 -10609 -10501 -14887 -13542 -12570 -14641 -13499 -10372
15808 -10372 -6941 -2100 -5287 -7267 -6981 -3516 893 5005 6418 12418 10168 8825 5257 5410 9838
15793 9838 11542 12243 12849 9099 5811 -2840 1431 -1552 2811 10066 7594 5555 -1817 -1542 -1048 -8113
15777 -8113 -10635 -2946 -7940 -10440 -7066 -7920 -7346 -6287 -5476 -171 1977 8217 4389 597 -2976
15762 -2976 -6112 -2466 2271 2655 -1437 -13126 -15014 -13503 -7131 -3273 -12090 -10781 -9232 -14845 -11126
15747 -11126 -10992 -10411 -7407 -7822 -12550 -12556 -11385 -3572 2775 797 -7966 -13122 -18109 -18561 -11349 -7665
15731 -7665 -6570 365 -593 -1647 -1237 2709 338 -1971 69 2850 -338 -7281 -14250 -20539 -19805
15716 -19805 -8865 -6236 -7342 -8919 -266 7324 13208 5460 1257 5607 5286 3194 2876 1495 6814
15701 6814 11282 5651 -1088 812 10391 13126 18177 15977 16811 15891 13706 11452 13205 16750 21316
15686 21316 19682 15294 9104 5743 -329 -3479 -319 -3475 -9067 -12122 -6503 2668 5687 1352
15672 1352 -258 3992 8599 13786 13919 6204 3345 7264 17119 21451 16317 9473 4529 -3514 -2086
15657 -2086 -1135 -4518 -8618 -3873 -354 1296 -1499 -4289 -2168 4482 11686 7737 -4690 -9651 -13910
15642 -13910 -8876 4085 977 -4160 -2414 1397 7711 6465 -1272 527 -219 2472 -4559 -6225
15628 -6225 -9274 -1956 1082 -6021 -12510 -10906 -7348 -10179 -9506 -4307 -3491 -9078 -2409 1028 -4356
15613 -4356 -6977 -8445 -6162 -2452 -340 141 -6758 -6174 -1601 7227 3446 -4729 -3022 2857 6189
15598 6189 2516 1548 -630 3289 4639 -1907 -2060 -2739 4318 5799 8946 7035 1075 -6318 -11108
15583 -11108 -9998 -5111 -4562 -3715 -2831 -4892 -5503 -6341 -2395 -5724 -11084 -19327 -25062 -14573 -17381
15568 -17381 -17766 -7791 -5078 -531 -7898 -4225 -2075 1096 -1783 -8562 -8425 -4945 5603 4178 5897
15553 5897 3339 538 2530 74 1228 3990 7030 7041 6155 6771 -4553 -9899 -5462 -6198 -11519 -8382
15537 -8382 -4366 -3502 -7045 -3391 -5122 -1096 8680 9419 5770 -6280 -7326 -12646 -19182 -17430 -12989
15522 -12989 -5765 -5161 -3152 -8733 -5878 -4500 6432 14332 12003 9141 321 -8399 -9126 -8732 -12960
15507 -12960 -15755 -15070 -10827 -6726 -3633 -6689 -6682 1339 3990 4701 4264 -2521 -8241 -6566 -6639 -11794
15491 -11794 -18722 -23573 -26205 -17264 -8961 -656 9668 6695 -5227 -10460 -10252 -5707 -4738 -2374
15477 -2374 3881 833 -14682 -20461 -16641 -18039 -19036 -18976 -16832 -13664 -9828 -7036 -6312 -1931 1237
15462 1237 -6301 -9735 -13319 -11218 -6185 -4155 -2604 -1611 800 -3172 -5778 -1991 2167 -2493 -3087
15447 -3087 -2039 2335 403 501 -1611 -6954 -1538 4097 2915 -6808 -15711 -13403 -9390 -8448 -5731
15432 -5731 1956 -8976 -12843 -18728 -18878 -16482 -13788 -9678 -8638 -6162 -805 -3672 -7624 -12012 -15613
15417 -15613 -535 -1321 -4862 1960 -396 -6163 -3894 -3005 302 -5334 -4224 -399 1801 -4291 -6701
15402 -6701 -2778 -985 -5506 -2276 1528 3905 3050 4719 2825 3434 928 -6245 -14809 -15227 -9711
15387 -9711 -10241 -6398 -7973 -12295 -7390 348 2321 -1358 358 2206 4504 11583 10002 3868 673
15372 673 2373 7894 7163 -202 -974 3365 -4363 -10186 -11384 -11819 -6038 -2611 -2564 -1801 -30 -1622
15356 -1622 -832 -1607 1385 7639 6452 -1383 -10773 -14317 -11429 -9869 -11785 -13380 -13890 -15602 -13568
15341 -13568 -8719 -6889 -7828 -4968 -8463 -12387 -17600 -14166 -4624 -2375 -730 -3651 -7148 -9289 -11215
15326 -11215 -6010 -3892 -3628 -524 -5423 -13903 -11911 -5742 -879 -1787 2765 237 -3340 -8324 -6127
15311 -6127 -6598 -1791 3275 5148 233 -4865 -8031 -4286 -3287 -7681 -1603 2285 1918 -4730 -4081 -652
15295 -652 -1143 1360 -4713 -8210 -7215 -7513 775 1121 1001 1002 982 -2553 2156 6035 3746 3055 2971 3251
15277 3251 4716 5061 166 505 -2032 -4415 -5128 -4013 -6018 -2484 230 -4476 -7801 -11208 -9161
15262 -9161 -8503 -3688 -110 2468 5237 9966 7202 6421 1571 330 -2210 -7676 -7851 -8465 -13145 -10953
15246 -10953 -3090 3780 3179 4286 -1826 -14372 -15865 -16291 -6260 -3370 -6047 -7893 -5138 -2863
15232 -2863 5117 9258 7296 6286 8331 10188 3551 3296 -311 -1917 -3333 -8086 -13939 -6226 -1888
15217 -1888 2095 4727 4696 12683 23393 30276 28771 27081 35669 52995 64720 69577 62341 57957
15203 57957 55699 48661 44526 36176 32207 30256 28010 17503 11962 15436 13562 -113 -1187 -2375
15189 -2375 -4550 -1611 1660 -2292 -8734 -672 7901 5893 583 -3939 -6300 -10241 -6568 3126 9103
15174 9103 5091 -3011 -954 -3664 -1472 347 -1982 -213 -3261 -10699 -10759 -3870 -1949 -2220 -6781
15159 -6781 -5967 -6948 -8786 -1522 3742 -4108 -10366 -7821 -3000 -1888 -3750 -5175 -3265 -7 -7572
15144 -7572 -6209 -4973 -2277 5435 6250 -2937 -9525 -14456 -11355 -6919 -3369 -4711 -13387 -8084 -5320
15129 -5320 -6746 -6622 -8943 -6970 -5215 -4865 750 7526 1690 -841 -5171 -7160 -8713 -9946 -11030
15114 -11030 -10702 -11565 -9831 -9142 -3579 -6901 -9370 -5314 -6685 -3108 -1804 -5650 -1364 -4203 -5145
15099 -5145 -5916 -7801 -4855 -5481 -9537 -5534 -1203 -3921 -6561 -2341 1019 -867 -8699 -12638 -13872
15084 -13872 -17253 -20518 -24043 -13480 -11470 -18342 -12530 -7224 -7819 -8543 -6971 -9235 -6390 3015 360
15069 360 -455 -4613 -8600 -8708 -5792 1112 -701 -1243 -2953 -947 448 686 2426 -1985 -3197 -5571
15053 -5571 -6579 -11247 -13213 -15088 -13204 -13956 -6366 2181 586 -5943 -9632 -11553 -6420 -5031 -6584
15038 -6584 -9556 -5920 -6682 -4870 -5604 -4180 2506 7919 816 2749 9544 7922 5483 -654 -1629
15023 -1629 -4791 -10615 -3901 -1928 -5031 -10809 -7579 -552 -764 154 6025 14082 20649 18320 20630
15008 20630 26487 24899 16475 12479 7503 9137 8636 849 -7472 -8967 -1627 -1430 -5158 -3687 -460
14993 -460 -3954 -1946 -1373 -4675 -7167 -687 12556 12492 5857 -1765 -7853 -2385 5890 5045 332 -2033
14977 -2033 -2888 -665 2704 1204 -9250 -14377 -2472 1830 5777 4214 895 6231 5092 2610
14963 2610 -1292 1369 5685 13901 14730 12367 7630 2281 4665 -1384 -6892 -10596 -9354 -10895 -13528
14948 -13528 -11223 -6214 -5197 -3104 -785 4632 -1840 -4096 -624 2875 1047 -7389 -8783 -6803
14934 -6803 -300 -4558 -6503 -935 -196 -3357 -963 -3329 -3938 -12333 -12402 -361 114 -6956 -6721 -6990
14918 -6990 -7688 -1882 -7363 -10941 -6082 -5499 -1686 1635 457 956 -3659 -10337 -10984 -13685 -10606 -2476
14902 -2476 -650 -2528 936 4928 5503 3646 -1168 -5011 485 1081 209 4966 24 1504 3588
14887 3588 3703 2320 1017 -3649 -1845 -2166 -2586 3284 8499 14410 10681 -5956 -9125 -4038 -11881
14872 -11881 -12551 -2453 -3195 -10480 -14557 -17716 -20359 -16088 -11099 -15527 -19167 -8370 -7508 -2834 2968
14857 2968 5435 1193 -1925 -1891 -8790 -13197 -11933 -4082 -3206 -2448 -997 -4602 -11371 -9863 -2193 -1391
14841 -1391 -10075 -7895 -6822 -2945 -2945 3153 204 684 -3840 -2091 -450 2564 3538 8028 6346 3703
14825 3703 -2705 -2907 -2833 -13235 -14117 -8984 1005 14418 16711 11515 5539 3881 3424 8499 13487
14810 13487 3126 -4878 -780 -7770 -13656 -11731 -10434 -8779 -9732 -14604 -12738 -6616 -6436 1190 8238
14795 8238 -530 -2061 3986 7937 11507 6051 -1086 499 91 -118 -5549 -5046 -3484 2737 464
14780 464 -5501 -5730 1509 4277 1719 2919 -3029 -7634 -10221 -8304 -8366 -10014 -6504 -3540 -5582 -13629
14764 -13629 -15703 -13016 -9679 -11924 -14101 -9798 -3695 -5050 -9115 -10961 -16599 -19221 -20035 -19870 -14647
14749 -14647 -10982 -6128 2465 2180 -936 -2704 -4133 -2580 4511 5004 3161 3263 1264 -1420 867
14734 867 -5472 -10156 -6271 -10089 -8135 -9186 -7830 -3705 -4165 -6157 706 -1333 -10382 -8424 -9954
14719 -9954 -8725 -10607 -8648 1111 3754 1748 2052 -2135 5308 9095 2665 -8311 -5072 2203 3642
14704 3642 855 -3381 -3847 -2689 -3769 -5213 -4477 -1658 -3763 -4788 -6259 -9104 -13876 -14386 -17149
14689 -17149 -16328 -8869 -8436 -9368 -7832 304 -3039 -8071 -7204 -9997 -16726 -21814 -14652 -7189 843
14674 843 4938 -2822 -8474 -10590 -16273 -17800 -13864 -12898 -8745 -6408 -7493 -8359 2037 7131 12928
14659 12928 13338 6303 3681 3643 3116 7132 1832 3504 4068 3389 -828 4095 11559 9646 605 -3209
14643 -3209 -7823 -2857 -5583 -7575 -6023 -8781 -4904 -910 -720 1980 1982 2778 -2039 -1638 -2673 -9644
14627 -9644 -16694 -10481 -2608 2475 7829 6310 -2223 -9908 -12941 -4698 810 7475 5520 7036 9151
14612 9151 9854 7599 11940 9631 4607 4088 11406 12523 10063 7488 2539 -3585 -3502 -114 -683 -5456
14596 -5456 -1646 -1857 269 -448 -26 -5919 -7490 -4285 -10584 -12152 -9996 -758 1312 5258 2576
14581 2576 -1163 -6460 -10880 -5581 -4768 2635 3909 127 -3662 -6307 -4462 960 -2430 -3803 -3063
14566 -3063 -3751 -381 3149 -1886 -10693 -15179 -13428 -13142 -8103 -11424 -13329 -9671 -5104 -5629 -3886
14551 -3886 233 -5051 -9666 -5163 2137 -896 -6181 -4473 -2645 -6794 -805 2807 1934 8441 9299
14536 9299 3929 -3024 -5234 -2213 6495 6294 6830 7808 3996 211 -5575 -2731 4466 5512 3675
14521 3675 939 -3561 -2877 -1930 -5215 -6752 -3551 -7836 -17475 -19872 -21133 -18474 -14642 -7832 -7360
14506 -7360 -5067 -3769 -9659 -5265 -838 -1852 -3807 -3894 -6180 -4094 -4204 -3852 -4291 -7517 -901 557
14490 557 -1960 -6339 -10539 -15038 -12388 -3531 3326 3171 7862 2047 2725 3488 4109 1143 -5071 -7415
14474 -7415 -12008 -8653 -2844 2558 3013 472 -4274 -7710 -1674 3541 5605 4796 108 -1348 -6922
14459 -6922 -4999 -135 -1536 -3591 3490 5658 3133 748 967 -462 4735 7096 -4603 -11879 -14831
14444 -14831 -15545 -5651 -125 -2919 -3936 -3251 528 4783 -1922 -9596 -4565 1928 2681 -11269 -12342
14429 -12342 -2630 -1704 -6634 -7660 -3541 -2752 3021 5627 1369 -3263 -721 -75 2025 84 -6921
14414 -6921 -13364 -7631 -2355 -5603 -10755 -15704 -11311 -6437 -3012 -2158 -5397 -8911 -8242 -5849 -6071
14399 -6071 -10266 -9230 -13193 -16487 -15133 -9686 693 5758 4125 6703 1651 -3362 3515 4133 -4543
14384 -4543 -2399 4234 12725 9982 11540 11094 3982 2070 -1929 3190 85 -8850 -9344 -7731 -10254
14369 -10254 -10018 -9480 -5888 -1187 -1951 916 19 -2637 -2154 -1601 -131 -1412 333 -169 2801 -66
14353 -66 -992 -6670 -4981 -4262 -3505 1462 63 1572 911 3737 2359 1695 9427 10714 5135 -3688
14337 -3688 -5302 -501 -6961 -13418 -14290 -10292 -8569 -5300 -2673 -901 -4364 -4922 2527 15427 14227
14322 14227 11622 8862 2089 -3150 -2737 -9163 -8969 -7063 -6542 -435 5650 9359 2278 6546 7920
14307 7920 4227 -615 -8433 -8760 -14162 -15717 -12781 -6632 -7735 -11424 -11192 -15856 -20745 -13697 -3452
14292 -3452 3444 5275 4046 3588 6755 896 -7860 -4650 -951 3335 7080 4386 -10 -3392 -2944
14277 -2944 2486 2132 5266 3015 -6368 -9460 -10829 -7501 -3616 -2159 -68 -909 -3282 -2873 -5366
14262 -5366 -4541 -1994 -2830 -7794 -11614 -13024 -10833 -10695 -12787 -5004 -1091 -2382 1413 4945 8577
14247 8577 9755 4552 -4782 -5536 -14777 -11935 -5799 -1462 -4011 -4617 -4353 -8094 -9644 -2722 -6479
14232 -6479 -12358 -9148 -7758 -11255 -9393 3466 7201 -1775 -7374 -9070 -10664 -8326 -2667 301
14218 301 -3397 -5661 -10028 -6011 511 1618 240 2613 1687 -224 -1304 -1644 3199 -228 695 2092
14202 2092 4363 2067 -2664 -5663 -7658 -8152 -7739 -9824 -9370 -6305 -9692 -7154 -6281 -7517 -6825 -4183
14186 -4183 -2677 -3488 1926 2895 4182 2458 1330 -2315 1954 162 -3324 -3532 -690 2105 -533
14171 -533 -7267 -3385 4690 3208 2965 -1987 -2063 -3388 -1043 -468 -1655 -4314 -4046 -1100 1707 81
14155 81 -987 823 3510 2133 3137 2129 -3484 -7206 -6549 -7064 -8729 -8770 -2293 288 -3768 -9136
14139 -9136 -5893 -339 -2883 -6728 -7763 -8593 -6946 -12280 -11768 -4832 -3524 -6238 -3891 -190 3196
14124 3196 3856 1300 -7315 -3385 -6832 -13595 -17564 -14957 -15670 -14554 -7633 -3949 -6112 -6887 -7921
14109 -7921 -11035 -7621 -2500 -3958 -10056 -4389 -2021 -7949 -8569 -8868 -9420 -6295 -3219 -3388 -2362 -3904
14093 -3904 -4924 -10418 -9251 -1110 -508 -5314 -9178 -7811 -1882 2681 -3822 -6035 -3683 2821 10145
14078 10145 13135 8444 2160 -4199 -1251 2191 7807 2349 1974 3876 -802 368 2148 -2092 -4532
14063 -4532 -6521 -9009 -4771 1871 3515 2720 1099 -577 -1353 -2544 -7248 -8979 -9623 -4919 -2269
14048 -2269 -6700 -3995 -5275 -7289 1923 4975 2393 -6968 -11871 -5531 -2880 -10589 -14302 -5246 1583
14033 1583 3019 4923 3744 708 -7404 -13161 -11653 -4376 -408 2080 7468 -1889 -10372 -5091 -6690
14018 -6690 -8022 -3559 -4678 -11170 -15103 -14480 -10847 -10007 -3325 -451 -16 3952 5399 6192 3129 5273
14002 5273 9042 7650 2568 -3049 -1667 3812 1421 -3285 1907 7278 11107 9191 10557 8956 3612
13987 3612 7608 13058 12543 16140 15593 14730 9258 7010 12229 11349 3619 5561 8193 5344 6492 3067
13971 3067 -5174 -6244 -7168 -8699 -10643 -7220 3709 5234 4673 -5187 -7579 562 -306 862 10331
13956 10331 16930 15275 11232 13644 12836 7061 2657 4028 -4816 2300 5296 7548 10462 18192 22553
13941 22553 22360 22990 17591 18152 25252 28703 34290 30223 23723 20650 25005 23961 26518 26891 16547
13926 16547 17942 17220 17927 16812 19436 32028 39745 43345 48140 46223 40169 30217 21906 17443 16109
13911 16109 29140 31089 26444 27560 29488 37927 43088 38996 29914 21534 20765 23783 32166 42096
13897 42096 42138 38109 32435 23630 26551 19042 15085 19029 21237 18932 16753 18781 26448 26763 20791
13882 20791 12048 6015 5607 11905 16096 14741 5563 2790 26 2513 5340 1808 4594 16005
13868 16005 16320 7762 10992 7838 -1735 -3284 -1215 2405 18780 30638 25982 18943 13336 2091
13854 2091 4583 11634 11158 7725 10003 15485 16743 9197 3369 4786 9051 8579 3849 7170 12413
13839 12413 16366 9108 6961 1426 -3046 4066 8165 11836 11138 7222 5176 4108 8376 9265 9125
13824 9125 9264 5060 4205 3485 4654 2304 1746 -410 819 1370 3945 9165 12187 6779 4593 5895
13808 5895 7209 12116 12622 11062 19040 15638 15203 12922 8312 9188 10063 12485 13034 12397 14253 20416
13792 20416 20190 18470 16486 15105 15918 12729 7725 4786 6818 6788 7332 16201 21147 19426 22163 23839
13776 23839 18243 17812 15226 11689 9679 9912 6020 3401 12071 22267 22487 16187 12070 10759 5585
13761 5585 5201 10973 10461 8107 8102 9182 14198 16811 18149 19717 25042 23197 21914 26682 29823 35611
13745 35611 40877 41522 55238 85186 108869 121130 110708 96122 79769 64838 48450 43485
13733 43485 40813 48464 41347 31560 25211 21465 15456 19622 16797 15676 18257 26107 27260 28677
13719 28677 27458 26078 29646 31275 33759 33903 34393 27480 22255 29708 35318 38522 43999 50860 53719
13704 53719 51861 58936 68080 82995 97056 120974 159396 218349 283202 328913 333479 295497
13692 295497 237338 181108 149633 125401 102682 86584 85522 83863 79176 67259 64753 64535 64992
13679 64992 49612 45130 52299 53268 52655 52089 40179 36131 41893 48437 45950 42151 45227 45403 45933
13664 45933 53254 57785 57717 51965 54866 64752 74010 75834 84534 96951 122507 163761 222572 292693
13650 292693 350115 361571 322216 262837 200446 159481 131489 113293 101626 87417 80996 81206
13638 81206 75381 76731 79244 72110 62893 56024 50808 49541 50109 50379 54041 47307 44022 44063 52667
13623 52667 49777 41419 41601 45185 46490 44322 45217 48357 47956 53411 52297 47257 47725 53658 60030
13608 60030 67425 92454 116044 137277 140807 124316 109320 91643 75586 68720 68925 61223 54805
13595 54805 49253 37921 31462 31690 40199 39119 30989 29513 33306 29789 26266 28639 38538 44710
13581 44710 42320 34342 39809 38648 39707 41873 33800 33484 39676 36808 25429 24753 34910 36048
13567 36048 29787 25629 24105 23877 24344 25076 24819 21527 23778 27328 26431 22639 22233 22356 21300 25526
13551 25526 24820 19918 17725 20998 21528 18407 12866 6595 7863 15104 18830 18064 13326 18033 11746
13536 11746 3510 6310 17231 21893 18794 14035 15419 23631 30224 35516 41233 43461 40907 43773
13522 43773 37909 42304 44835 41480 43959 44421 39180 38169 40671 41527 35463 35863 33654 29175 35372
13507 35372 39181 35269 20551 28869 40663 52767 54512 51086 47934 47810 41552 32300 27723 27948
13493 27948 25581 20829 24383 26089 29130 35248 41041 42731 40150 37551 39764 42323 49707 56156
13479 56156 54528 50909 52547 63840 65823 63899 70918 70330 68241 70217 66818 64863 70605 87281
13465 87281 99602 101455 93256 74313 62674 56488 51991 53247 56574 59331 53957 50797 51199 54390
13451 54390 59676 59439 54295 50967 46994 49340 51228 54144 57663 56884 56209 58325 60404 57429 56355
13436 56355 60855 64936 64621 61276 61896 69527 75931 81865 95685 117359 133640 137574 141981 146514
13422 146514 169859 196666 225938 240809 226145 192390 159169 137429 121800 111048 99761
13411 99761 96316 96193 100175 104022 102770 98293 88889 91050 91635 85443 78472 81777 98934 103497 108917
13396 108917 117764 116643 115274 110369 114378 108037 104811 106289 113623 120524 126012 128789 128714 138999
13382 138999 156064 167742 175924 180488 188127 204295 238397 275674 294516 284743 245416 208343
13370 208343 184815 169599 165354 163483 164644 170050 169177 168101 166338 168516 174240 171186 159933 150295
13356 150295 161466 173751 181485 201054 214553 224342 225770 229956 237068 233173 231384 239571 243994
13343 243994 244392 243333 243816 248870 255899 268127 276335 275724 272095 269381 275304 293380 297243 303453
13329 303453 310741 310687 297996 282724 276687 278232 292140 305408 314937 322343 319653 317292 328109
13316 328109 336816 343743 352187 353755 353407 362647 375043 399548 438032 468774 482502 502379 529695
13303 529695 563081 583895 610692 648203 701049 749554 791056 833225 882461 940416 1014615
13292 1014615 1100373 1199872 1332605 1506667 1720677 1976375 2296578 2692611 3206342 3960301
13282 3960301 5142425 7039565 9954147 13824440 17756962 20085719 19483457 16393088
13274 16393088 12814902 10075061 8266524 7012866 6061260 5339872 4793478 4359235 3988881
13265 3988881 3684505 3436692 3239921 3087464 2952260 2833274 2751772 2696367 2661018 2636698
13255 2636698 2643985 2686860 2754986 2833182 2919548 3017454 3149487 3320958 3536840 3815077 4172303
13244 4172303 4630477 5223573 5965252 6869874 7966138 9392909 11450181 14620755 19726122
13235 19726122 27785112 39091824 51657848 60680766 61111491 52310164 40194749 30326804
13227 30326804 23889351 19758427 16930085 14885635 13325611 12045287 10929982 9950148
13219 9950148 9109516 8408123 7825828 7338147 6909763 6531962 6205719 5935573 5716217
13210 5716217 5537736 5415161 5345034 5305182 5294797 5324227 5389931 5498015 5655018 5868684
13200 5868684 6163284 6560842 7085685 7752901 8563523 9556881 10849380 12707588 15583202
13191 15583202 20223629 27632525 38396683 51126053 61477225 63985674 56627515 44290880
13183 44290880 33417347 26126164 21477004 18331601 16059032 14332835 12950456 11765076
13175 11765076 10702274 9762598 8970225 8319439 7755488 7259578 6816078 6419252 6058205
13166 6058205 5744898 5478157 5246375 5062820 4910558 4791912 4698915 4640192 4598038 4576060
13156 4576060 4582064 4610139 4667498 4770188 4906279 5074749 5308883 5643850 6159012 6993820
13146 6993820 8380909 10637060 13992191 18087713 21670720 22934137 20988048 17071144
13138 17071144 13281834 10578056 8810688 7603716 6727548 6065962 5538971 5078961 4674443
13129 4674443 4322317 4014046 3752014 3527813 3323205 3123556 2946976 2784608 2637997
13120 2637997 2504912 2378220 2268435 2176912 2097425 2032078 1970924 1911300 1860703 1811613 1766128
13109 1766128 1723565 1672326 1616039 1550104 1494912 1433987 1376880 1322051 1281530 1242339 1199197
13098 1199197 1161046 1124197 1094067 1058440 1019881 975801 935923 897486 863815 837433 817653
13087 817653 803580 785328 770922 766233 757358 755337 744234 725668 705942 682531 662438 634678
13075 634678 612011 585312 559915 542909 523783 496164 472260 455581 449587 443334 433149 421053
13063 421053 411040 404195 388808 375257 364320 353709 344926 338695 330811 316814 306875 297492 291398
13050 291398 283872 275385 265058 260016 253040 243424 233520 229710 223025 216467 215999 224484 237248 237936
13036 237936 237386 241030 239635 243536 244366 233314 220310 207318 205228 211147 205370 201809 192136 182597
13022 182597 176728 170609 171819 170721 167921 163018 156191 156728 159942 154228 147047 143720 147751 148127 146437
13007 146437 146036 143019 147420 158343 156273 157324 153076 148193 147719 158769 172449 178911 185664 183463
12993 183463 180937 176822 170971 158118 152374 148165 150764 159223 160833 161076 163966 170770 185086 198755
12979 198755 207945 230989 276610 329531 406796 497461 578044 619374 622323 627247 641936 658101
12967 658101 653268 600206 513831 424785 360386 318523 284104 257948 241719 230892 222615 212773
12955 212773 201539 199798 208202 220998 225052 229781 227367 209814 184092 166740 155350 155017 159478
12942 159478 151453 151323 151678 145616 146513 148629 144484 141971 140106 136178 135920 140883 144623 148818 149886
12927 149886 150876 149132 152421 153840 146294 135725 121550 106968 102020 99946 99342 95631 94057 92456
12913 92456 92162 90466 86861 83856 83675 88342 88938 92039 90836 87247 85778 81356 75716 74282 73798
12898 73798 69611 68146 67247 62594 61072 58471 51822 50377 50502 50300 48882 52000 56978 51581 48768
12883 48768 55708 50031 48983 48919 50389 45988 47969 36851 27839 22837 22974 25471 29059 26288 24015
12868 24015 21516 17348 13580 11416 19099 28997 33554 35890 42723 52148 56200 54333 50948 42674
12854 42674 43906 46605 51688 58299 62154 56713 53466 55198 56499 48521 34000 36190 43636 50557
12840 50557 58835 54592 56642 65223 65537 61896 57584 54314 63569 66971 69895 68553 64693 63012 58427
12825 58427 57336 60774 56456 56286 59003 62776 75794 87010 86746 90061 95944 99010 105948 112767
12811 112767 117362 123589 138954 153259 170302 189901 195467 174062 147927 128330 118377 114442
12799 114442 103980 100021 91679 85441 73097 62910 61682 62082 60679 60547 67724 66928 61300 59537
12785 59537 58593 62121 69071 63075 62505 61170 62249 61803 65416 69793 67190 65918 60943 60718 65020
12770 65020 74185 79142 78000 81771 95064 120695 153515 205786 272910 334462 361767 344466
12758 344466 296905 245872 222945 207331 195930 184197 180573 183521 186755 178198 175776 186826
12746 186826 202473 212994 228485 236796 234091 231864 236080 235278 235460 232290 208037 189188 169657
12733 169657 153738 148396 149111 146465 146118 142060 140839 140217 146390 151100 152448 159090 165242 186980
12719 186980 224963 282643 350389 407095 431931 412625 357085 295295 249699 228290 210697
12708 210697 202404 192443 188170 194799 191724 189408 182431 182412 180430 178414 176403 175036 173791 173144 182016
12693 182016 192114 198240 198087 200015 203815 219585 241212 259822 275810 286411 301459 316919
12681 316919 336824 350537 362458 364909 371636 386264 393591 389873 391523 398055 416233 419122 417356
12668 417356 401315 379743 363632 354420 345831 340567 334023 335449 329320 327802 319245 305375 303452
12655 303452 314054 324206 318294 314459 314441 322850 333412 341517 340307 334531 331534 333984 333056 333549
12641 333549 334938 332814 338662 342328 348070 363021 381315 393990 407456 425903 445894 456160
12629 456160 462034 464160 463328 467368 471095 475493 481037 484456 486843 486497 490565 496296 506471 519306
12615 519306 522272 532799 540572 554707 573303 597528 612869 620535 635660 657759 683737 718714
12603 718714 765070 815803 862899 921666 992505 1072484 1169032 1261894 1349112 1433884 1544031
12592 1544031 1702005 1921871 2184840 2460142 2723903 2965527 3215562 3470770 3734329
12583 3734329 4020799 4344502 4681155 5064719 5506763 6011474 6606483 7366571 8363295
12574 8363295 9670256 11343521 13496795 16427357 20718634 27377710 37779994 52881352
12566 52881352 71515970 89237608 100186758 102213743 100163993 101013511 105671477 107977449
12558 107977449 101473614 86185081 68301231 53564264 43374792 36498977 31621872
12551 31621872 27930362 24985607 22555517 20522837 18834728 17433561 16272075 15275626
12543 15275626 14377846 13574423 12862519 12220888 11657950 11176502 10740735 10327906 9928818
12534 9928818 9550222 9176351 8806435 8430738 8058008 7704307 7385042 7093791 6818388
12525 6818388 6555841 6292292 6025058 5766531 5522645 5293294 5082894 4891692 4708257
12516 4708257 4533378 4364472 4202800 4054220 3906525 3772313 3643021 3513331 3394316
12507 3394316 3281293 3170518 3063805 2959277 2851692 2746422 2651032 2562861 2479496 2394561
12497 2394561 2311413 2229888 2151529 2082276 2016263 1957930 1905768 1851268 1798185 1756149 1708470
12486 1708470 1670223 1634018 1596637 1554537 1514619 1474572 1439117 1399762 1351094 1298908 1252755
12475 1252755 1222672 1194188 1169469 1150240 1134984 1122944 1097012 1061804 1008434 959008 930704
12464 930704 908541 887063 870035 856618 833148 810390 804146 796394 783628 777979 765013 748297
12452 748297 727578 697308 667220 643183 611837 572385 536118 506138 483445 462588 453140 441855
12440 441855 428052 419137 402580 384212 372533 355312 331590 317664 313995 296155 289534 288986
12428 288986 295879 313331 318880 326280 325064 307452 277601 244469 221980 216814 205695 193397
12416 193397 192577 190347 189627 180851 176194 174618 175882 180730 173961 166146 171255 165288 163160 165032 160733
12401 160733 152315 157521 163182 163358 162507 161257 158115 160763 166941 173895 166739 164315 165023 156274 145827
12386 145827 154790 155222 158120 170891 178473 184950 183526 173504 157039 137650 128557 129679 133100
12373 133100 127178 118984 115592 119194 131305 145969 158506 171335 189634 222857 264103 317599
12361 317599 396388 494797 585250 618648 578927 494960 408214 347445 313152 287904 266302
12350 266302 250253 250898 246394 235303 227802 229019 240145 248744 258964 274027 280677 274006 262825
12337 262825 247450 224597 206573 196225 186029 183057 177413 167687 165717 167563 165182 163526 163113
12324 163113 170683 186551 205432 217790 227427 232811 225897 210314 188879 170109 158910 144302
12312 144302 133997 122401 118153 118647 120737 120570 108201 101157 99927 94652 87194 88427 89487 82297
12298 82297 71018 58932 57687 65117 65399 65876 70224 74728 87241 91736 88890 93436 103745 117151
12284 117151 118496 112698 100089 89913 83340 76468 64055 59572 54742 52249 47111 45625 49233
12271 49233 40415 36401 42370 42936 47523 49947 53558 52941 61673 71249 80615 76867 75023 75731 74729
12256 74729 71465 80437 88074 85637 91981 100638 95006 89033 91688 96169 95356 85041 82956 85706
12242 85706 89667 94394 98577 106011 112346 114982 115823 117339 120164 120540 125994 131407 139424 160025 189835
12227 189835 215445 224773 233177 229721 209753 192749 172054 150291 133766 119122 106193 92496
12215 92496 85088 82630 82205 80067 77664 82019 83947 88975 88920 90772 84367 68454 54495 48914 52745
12200 52745 58861 55261 49262 46735 49065 52392 52253 57180 58749 61273 61850 62969 63065 65854 70046
12185 70046 68465 66017 66215 70818 70963 68578 70831 81450 77976 65282 57682 53462 55566 56257 56020
12170 56020 54587 51993 60448 66053 71065 73864 79423 85911 88184 94723 109067 110492 117898 137806
12156 137806 163678 199259 259798 337715 437271 523169 571947 581075 575977 577831 593738 592114
12144 592114 548421 465241 377383 305282 257977 227759 199197 176727 165158 153965 140609
12133 140609 133767 135664 134517 131431 123870 104315 88595 93010 100660 101602 110960 119242 126577 137908
12119 137908 141289 136722 130706 116212 105432 90512 80019 73712 64600 62071 61112 53845 49431
12106 49431 48197 45946 41584 39340 40714 45685 39520 33555 34111 38915 34875 30671 32214 29731 25318
12091 25318 27535 26699 27014 23513 25401 24532 23415 24227 24207 28969 24670 24553 27423 41098 39374 37931
12075 37931 46528 49289 48694 47016 58666 77617 91851 96511 99042 96333 86909 80690 68042 59078
12061 59078 55682 54878 52436 52870 53916 52994 59341 74326 81419 82297 85241 82590 74006 58429 38863
12046 38863 34727 40029 41064 32826 31197 38182 51784 55535 61975 79540 108172 136331 152090
12033 152090 168148 179243 177691 162983 143629 128096 110085 89220 80054 74592 70255 61324
12021 61324 52490 43959 40838 42236 49677 59338 67734 98211 115997 125437 132656 139835 132620 119053
12007 119053 104951 92499 80477 70493 54815 47584 43861 36980 35105 36784 34914 38317 41077
11994 41077 35374 29443 30814 38302 36094 33002 36650 37601 36117 38800 38013 30449 30494 28077 28804 28371
11978 28371 31495 29022 31079 31906 36472 35380 31020 23333 16505 16452 18130 18981 24521 28364 33296
11963 33296 30016 26806 26172 19614 24765 24616 19623 21748 28578 27175 27093 28164 27116 30773 32295
11948 32295 37619 32951 31835 37400 42780 46329 47748 49651 50099 53234 57445 60635 59198 57033 68665
11933 68665 80234 95568 112572 129817 145925 161002 168568 170143 167114 159825 142502 123585
11921 123585 103640 84783 71672 69570 61955 54919 55701 57869 58124 57578 53753 52821 46205 38648
11907 38648 37232 33091 28188 24434 27667 34951 44338 51131 59734 61938 57841 54053 53739 53869 41280
11892 41280 30985 30242 31787 39620 41896 48093 51075 61543 68661 87122 106225 126718 147604
11879 147604 171997 184866 185815 187756 175606 152250 134131 126273 106270 95849 94671 89773 89499
11866 89499 87196 99199 101162 96238 94615 99859 100742 111724 125514 138267 147129 158265 161134
11853 161134 157831 157492 158118 148455 132164 116558 114749 119263 117353 118267 124730 137547 156379 168833
11839 168833 180546 195341 207829 217105 222775 221760 230699 237451 235426 219792 202367 186536 177390
11826 177390 159881 139874 131171 131103 130240 121663 125091 134390 143776 160667 180939 199217 233276
11813 233276 269993 304181 330069 327347 323960 313204 289575 281039 282970 285906 288394 283301 278219
11800 278219 282827 286740 286455 271226 253561 240408 246515 245992 225995 192980 170742 155008 147901
11787 147901 138597 129304 127263 115243 107197 101102 90068 83117 81517 86669 83014 84402 85654 77413
11773 77413 74525 72881 78218 84905 87503 83870 95937 104378 110744 104697 92253 84084 87316 98907
11759 98907 104238 112107 121547 107070 95392 87528 78694 71297 67286 64396 64761 68597 68026 59607
11745 59607 54146 56215 53541 54526 59173 69454 76471 80684 88362 96704 97908 99439 91875 85321
11731 85321 83399 82317 76278 70417 65314 63709 64467 59144 50642 42024 37889 41092 43524 39414 41234
11716 41234 40474 36719 34244 30310 34184 43458 48112 53172 60384 65539 69938 74854 79243 93181
11702 93181 99930 113838 123875 138936 155157 175566 203953 242408 284785 342333 413962 488285
11690 488285 543832 553239 512823 443839 383526 335886 292259 255246 228013 205758 185037 162929
11678 162929 148473 144170 137284 123871 106184 98557 98737 98174 92057 83794 85723 93675 89388 79251
11664 79251 68712 66555 60024 55926 58334 59504 55630 59146 62533 69780 59096 54009 59266 54519
11650 54519 53032 44638 44436 41032 42555 40826 37132 41387 42602 39448 32642 32818 34380 34971 34539
11635 34539 27761 27372 31307 36992 33774 26515 20104 17291 15001 19189 19761 24421 30519 30952 34491
11620 34491 38361 36694 32704 33478 38280 39613 39805 39157 28967 24855 15547 15165 17263 19911 18624
11605 18624 16469 11412 13825 19510 24701 21056 20797 20244 20340 25442 16840 13526 19387 28289 31070
11590 31070 26703 26699 31364 32204 29401 20616 15530 16826 19279 27274 28282 22376 21299 21694 18397 17652
11574 17652 22510 21205 21584 23048 27503 24457 25824 25504 27438 23191 20644 22751 24687 22433 18135
11559 18135 11018 9552 17879 25506 26440 20451 25273 26292 19627 21183 20625 25920 24317 26674 30668
11544 30668 21948 14990 12360 16056 19632 24515 23499 22727 27912 30060 30568 25845 32289 41737 48444
11529 48444 51095 46748 50674 49478 50856 54161 52728 50330 46875 48462 47603 50158 48492 47333 50606
11514 50606 48352 49462 48909 46221 41982 48414 48788 41895 39024 40418 37553 35978 41111 43930 43469
11499 43469 43695 44261 45504 50195 50243 41354 35241 34811 31676 30966 35787 33018 31147 34604 31064 26979
11483 26979 15976 5848 3898 12951 16408 18716 15432 24021 24837 16739 18848 21571 23842 23435
11469 23435 24391 21364 25760 30627 27087 18668 11734 13260 15218 18520 15834 16402 9722 7259 11143
11454 11143 14075 17677 18030 15260 16918 13177 20212 18565 24379 23127 20350 14831 13413 21143 28417
11439 28417 26414 21291 16475 14658 14247 14962 18898 18342 16558 14483 6146 809 6927 12831 13312
11424 13312 13571 18443 21387 19307 11893 9537 5531 1779 -37 2071 4806 14402 10678 -14
11410 -14 -377 -876 1740 7971 10169 15626 11250 7602 12554 21506 26108 20119 13071 8314 4632 6013
11394 6013 12946 11138 8706 15856 23238 21911 19579 18535 17970 13984 11597 17005 20259 17029 9820
11379 9820 8932 17499 31726 29128 23058 26181 24402 22109 20273 29131 43634 43743 45263 47558 50362
11364 50362 50445 44260 42513 33140 30430 28704 29323 36973 37139 36804 37022 33202 24699 26968 30214 26648
11348 26648 26364 18885 18811 19954 16549 16279 16011 15955 15615 16774 17150 25746 33765 27821 23827 28564 34791
11331 34791 39124 39609 33924 30690 33199 42692 53607 57112 49448 38694 39080 40984 30201 28259
11317 28259 19669 18977 21887 24877 38966 46223 44127 42901 37564 29614 26186 21997 27283 33463
11303 33463 31258 30852 30066 27336 21276 21064 27270 33157 37816 35902 32362 31680 33505 36940 41063
11288 41063 43045 47401 50653 55078 62793 69680 68460 65692 61487 57877 66065 72439 71147 68504
11274 68504 70814 78993 87158 91058 86006 80595 80175 81953 89651 93217 100616 101359 106030 117344 137862
11259 137862 161108 203503 252202 316575 419686 608338 901971 1247184 1510887 1504817 1205903
11248 1205903 881479 660297 520132 436894 372144 323827 291225 263640 245091 228582 216187
11237 216187 197302 184041 170421 159681 157711 152971 143249 133071 119093 117732 119354 116575 114500
11224 114500 112703 109153 108299 113104 110491 101541 105416 106257 101201 98021 102629 105132 101939 98459 97882
11209 97882 87577 83810 77882 74202 73621 69348 64589 63203 67160 66712 59514 54125 51973 51913 58662
11194 58662 61435 58861 57555 53308 51150 50052 49049 43582 34112 30813 40611 48089 58266 59709
11180 59709 49420 41911 37989 42900 47246 48953 47212 43311 37520 35313 28380 30895 35569 33608
11166 33608 33103 28649 26206 24360 17444 14394 10750 7318 10981 13354 11403 12097 11008 11013 11062 5351
11150 5351 -1906 -3299 4942 11292 17869 16797 18978 19260 21873 32025 36174 41956 44441 44957 58531
11135 58531 71830 79373 89317 92424 91227 96077 101054 107649 110609 115283 118458 112320 100881 100979
11121 100979 102088 98061 87968 71001 57633 56456 65774 77481 85791 84818 86053 85167 86917 89158
11107 89158 91251 85548 78761 80089 87202 85551 83292 92695 107709 122447 127117 138467 140152 140926
11093 140926 142563 139574 139601 140942 133924 124076 117913 115442 115927 119649 118939 115195 106954 100736 97106
11078 97106 94044 83922 79587 82133 88957 89520 87564 80826 74477 67004 59195 56952 54811 61465
11064 61465 62018 64230 62004 55338 47264 40345 35158 40457 46946 48661 50329 51906 44392 39987 32706
11049 32706 17274 2854 -3811 -691 4249 11976 18002 25287 27937 29904 34521 45139 74782
11036 74782 96063 109049 122194 140023 158926 177663 175110 154780 129584 114503 106537 102492
11024 102492 101670 93908 92862 93601 88263 89987 92394 95556 99702 102666 110707 115752 115276 113722 113305
11009 113305 117520 127896 128347 126017 122776 117267 114671 125742 131769 125964 126309 130826 127670 119782
10995 119782 114876 111214 109991 111541 123349 139463 153408 163076 168940 159762 153046 152842 151627 157892
10981 157892 163168 167431 167685 171940 179896 178998 178069 191101 213413 238327 254632 267067 267579 263784
10967 263784 265696 296305 340487 402896 450691 472504 481954 492697 507671 511471 496094 460675
10955 460675 423650 402281 395702 398410 399037 397767 406327 417470 424486 417906 410555 404333 406145 414343
10941 414343 423390 423445 417201 415401 408840 399468 400252 420065 434226 456416 468062 468564 471140 475253
10927 475253 490130 486648 472601 449901 426836 405424 400717 423005 455192 487451 516081 544565
10915 544565 566819 592447 622798 642388 658148 675523 692515 702699 698202 679659 664817 650127
10903 650127 647295 665666 684293 703251 717246 724295 728159 725780 725545 741906 758730 780424 808976
10890 808976 845863 901018 942180 958475 962515 951802 969861 1028861 1124673 1257098 1398162
10879 1398162 1513144 1618404 1739111 1877352 2018064 2134560 2200417 2230914 2302719 2478506
10869 2478506 2781105 3211033 3766153 4400215 5012035 5392935 5529268 5704442 6039492
10860 6039492 6505537 7110001 7888149 8905172 10204012 11861973 13959437 16577771 19862171
10851 19862171 23939471 29214225 36727063 48209226 66714567 97711833 146533206
10844 146533206 207477877 258507228 269641148 224079123 161681267 118684336 92800334
10837 92800334 76100431 64553860 56131054 49731807 44531884 39928484 35835941 32318576
10829 32318576 29412444 27058985 25050716 23280493 21695696 20268854 19017449 17992589
10821 17992589 17206315 16641274 16175198 15609066 14817035 14005759 13389878 12922741 12518954
10812 12518954 12148090 11793464 11435471 11047723 10607463 10131239 9678813 9276322 8924777
10803 8924777 8620682 8321126 7994010 7648860 7313106 7002418 6720888 6466497 6224543
10794 6224543 6003416 5800126 5616068 5431171 5248468 5065198 4877989 4707402 4558189
10785 4558189 4421750 4291921 4159144 4017738 3865250 3705279 3553482 3414431 3299480
10776 3299480 3200788 3107125 3020478 2933364 2852892 2772503 2692358 2623132 2563498 2512535 2471259
10765 2471259 2433663 2386430 2324137 2236761 2147443 2061562 1988523 1938524 1894957 1835220 1774744
10754 1774744 1718149 1658464 1600987 1546408 1491474 1451693 1418012 1385370 1344580 1307279 1272274
10743 1272274 1249684 1230463 1203614 1183850 1162747 1150849 1157963 1154866 1148296 1121679 1076847 1028763
10731 1028763 971450 908441 844465 798080 760932 719588 674578 622919 580721 556008 542027
10720 542027 529051 519757 515116 503458 479124 448392 418679 388176 384883 389729 380044 362334
10708 362334 341833 327990 320214 309658 303011 290584 277133 263062 242823 228151 231379 232945
10696 232945 227731 225745 226780 236106 243178 247320 246570 246601 240940 236561 225319 217040 223532 222476 222343
10681 222343 224372 223373 220317 217661 217119 216498 220546 212493 201466 195282 195867 199099 197019 196415 199535
10666 199535 195308 201917 210340 210445 207794 210426 209877 195431 179956 169734 154126 131221 112181
10653 112181 111850 133375 151168 158464 167072 185313 205979 217618 224045 228679 235242 236466 240171
10640 240171 254933 260100 255069 246007 231850 215252 206988 208150 205720 201515 206585 214428 223614
10627 223614 228819 228692 218870 207530 202733 200271 207444 224578 237050 236050 228905 233167 233140 221983
10613 221983 214554 200508 190350 182637 179892 184067 186980 187445 181076 172125 164012 166163 165620 169136
10599 169136 169882 168378 169152 166267 167258 164983 158232 156347 155890 158406 150400 143795 146784 151940 146762
10584 146762 138703 129463 109139 95359 89010 91216 85242 72235 68187 69187 68746 73511 74203 72042
10570 72042 76832 90882 93196 85981 82421 90802 99236 99690 99325 95009 89506 81925 75423 71047 71854
10555 71854 61591 53580 49812 53349 56944 53589 55646 59197 66145 70352 79977 87247 90508 97010
10541 97010 99407 101576 103764 112836 120588 126750 128412 136699 133251 131279 131364 126384 117607 114462 119176
10526 119176 114577 119640 120773 107061 103105 97993 95477 91071 97174 113680 125039 131338 123128
10513 123128 115805 116047 111850 111723 108330 109621 112698 108529 107665 108136 112197 118651 122255 118688 112857
10498 112857 106327 103978 109644 115970 111190 104522 109239 111564 115521 115451 113259 112222 115828 108742 110564
10483 110564 116980 122232 116409 115468 117734 122589 121180 120009 115867 109135 107572 105693 108291 107744 103225
10468 103225 99148 94391 92266 100072 109618 117051 123980 127888 127697 138513 149330 151288 148721 146707
10454 146707 143544 147943 159571 168300 177460 181352 172795 165039 170705 184059 196594 207312 216195
10441 216195 223946 239835 258333 278725 302821 341387 392770 457853 566733 750599 1038999
10430 1038999 1390068 1657122 1657869 1362074 1028539 815947 685782 600619 539780 493195
10420 493195 462282 438641 422576 411838 400188 383281 376497 369172 367883 364153 365095 367078 370172
10407 370172 374484 377252 389760 413504 444294 489020 549427 659783 831192 1056569 1293447
10396 1293447 1451900 1452430 1341366 1263469 1297235 1421655 1543679 1554582 1403015 1162625
10386 1162625 953326 816102 727593 658430 602883 568269 554648 537406 512401 496279 484979
10375 484979 472670 464117 462300 451419 441794 435353 428966 430878 434253 437169 432530 436689 439832 429072
10361 429072 417074 407707 399610 387655 381122 383756 387065 386349 382833 382706 387092 387499 383565 370904
10347 370904 368889 372146 373246 370465 361166 360942 359750 362933 359979 354857 345614 349980 340609 337869
10333 337869 344039 347729 344151 339905 333790 332852 324969 318100 314656 310042 306625 304240 299407 305143
10319 305143 303793 302213 295607 290733 291735 291979 291409 293057 295688 290821 278791 276628 283377 290289
10305 290289 284567 279815 271380 261106 258025 259935 262266 260896 259035 255635 253680 246226 240977 250094
10291 250094 246528 239372 236759 242541 241407 241337 236596 230940 226270 225830 225772 220916 213664 212626 218337
10276 218337 209492 199358 200389 206591 209034 204695 196476 195997 206552 211183 211715 206070 202164 200630
10262 200630 202529 210079 220289 221704 222728 216164 209606 204437 194463 188147 181883 179293 180495 174384
10248 174384 168404 167634 163011 166106 167271 162730 161196 159842 161621 160141 166984 177369 184206 183395
10234 183395 180781 185167 185734 178661 174554 175867 171367 175167 181112 183707 186671 189145 197033 215154
10220 215154 239799 275256 333991 385374 428884 474530 497559 498974 515096 544506 588516 658273
10208 658273 711073 744383 771402 736527 651278 588270 516861 429473 367220 342166 325856
10197 325856 298574 273897 259441 250241 240094 229843 218701 217024 218397 207298 199152 193685
10185 193685 192443 193818 185828 184397 188550 188095 190393 208000 240457 271668 313917 374389 444654
10172 444654 528642 606529 687185 725771 735686 724039 659179 564386 484879 416006 350289 301693
10160 301693 274433 259588 243871 231248 224198 232668 243607 254266 267719 287944 309542 326010
10148 326010 313642 279004 249865 227345 201718 182605 164506 150717 146935 141459 134754 133342
10136 133342 126531 122591 124491 123428 112861 110462 107650 103270 100398 101553 97685 93395 86253 82146
10122 82146 86899 85301 78666 80089 83954 84056 81692 77492 81410 79369 79943 77474 75615 72883 76909
10107 76909 76265 77398 74685 68265 65499 64617 63552 60614 50979 49240 48960 50670 55087 62495 66737
10092 66737 64282 67075 68014 64605 63446 56117 43060 34363 34030 36339 38807 38289 41453 46428 57641
10077 57641 55478 45014 34407 28764 30442 34266 43580 44339 38762 32620 30978 32408 39367 47251
10063 47251 43071 36072 36665 43922 42232 44387 51428 48314 37426 31106 34258 39738 41046 37950
10049 37950 31774 30468 29986 34861 36487 40231 38859 33809 35994 36701 27120 21387 25047 28266 29764
10034 29764 36608 42649 38172 34840 31984 31425 35478 39791 35049 28262 28998 31146 28590 30009 29392
10019 29392 27476 35394 42715 41972 34069 37640 42611 47634 55763 57349 51995 51975 55907 59229 51942
10004 51942 40967 38045 32947 28956 33083 34931 32135 28026 27122 33664 31897 29561 34105 33805 36523
9989 36523 40206 35094 31509 27760 26377 27697 26657 29715 31557 34828 35099 35324 37787 33428 32917
9974 32917 33262 31682 28348 23236 22801 16045 12426 14908 18993 21263 24056 30635 30060 24159 20463
9959 20463 15574 11667 8275 7156 14723 22193 26332 23809 15587 9548 5313 4085 10363 17876 18493
9944 18493 28157 23850 24711 20036 15576 14783 7947 7045 5082 5340 10804 17899 21684 17743 19107 17223
9928 17223 22121 20329 14695 11642 7828 14720 16620 18856 24006 24172 16889 19929 25122 30078 32893
9913 32893 34214 36333 36328 30602 36009 38916 37480 46541 66005 90118 103749 97453 75416 64967
9899 64967 62765 65458 74935 88321 99981 108249 98290 71308 50672 42748 45980 42768 37172 30886
9885 30886 34000 35718 33538 32605 31359 30579 26237 31266 31655 25068 18782 18818 22041 26400 30806 29005
9869 29005 28959 27111 22786 19744 21586 23436 23197 21162 15724 12333 13729 19352 21580 20623 24511 28968
9853 28968 28116 23698 12266 9535 18917 25602 27191 22032 25664 29997 37040 48410 51277 47096
9839 47096 39191 34652 32486 25830 23424 28111 37487 40271 34815 24516 22441 22622 22810 29953 32967
9824 32967 36026 34619 35147 37190 51237 60996 59001 61443 61042 62163 63034 58401 57638 62992 63735 71967
9808 71967 83743 84890 70528 60159 58390 54271 49908 51692 53988 55502 54726 56679 67815 83991
9794 83991 99491 123323 153694 197901 247785 292839 338667 382997 430820 449570 414840 372374
9782 372374 344050 310270 260981 213333 176896 159913 144693 133017 130891 127170 122303 121920 128038
9769 128038 142401 154786 175309 189661 204651 220210 244426 268365 282855 284662 289934 291659
9757 291659 296619 294038 304989 311756 307747 290730 258417 235567 216742 197750 177578 159112
9745 159112 146833 132767 124095 116013 112184 107147 95103 87592 82703 79700 78063 74817 68968 62276
9731 62276 55956 52381 47622 51328 52939 51338 48551 45768 39888 31710 32546 27326 25196 31720 36762
9716 36762 32404 33166 37968 32748 28972 29705 31298 31267 34514 36207 36973 34070 31430 32271 26985 24589
9700 24589 21320 25377 30379 32683 29580 25832 22927 19616 18762 17052 19465 23155 18972 20839 29670
9685 29670 31756 37634 37579 35616 46426 65434 84670 101830 109384 96311 86705 79040 75630 81031
9671 81031 84095 100026 119249 128997 131254 128224 138747 146139 151906 160218 162603 152678 145730 132733
9657 132733 107662 92522 81759 70401 54313 39491 43190 45718 41474 35156 30723 26983 31020
9644 31020 34499 35477 37330 34807 34907 34742 30781 28028 34485 49899 60928 68556 76962 94475 121323
9629 121323 139821 128992 98969 87401 85528 75947 61460 53503 52243 50085 46688 45636 44380
9616 44380 40125 35777 36398 38233 38072 35789 34779 24826 22639 29861 32044 30601 26254 26610 29082
9601 29082 27119 31408 37651 37536 31574 21832 15647 17275 11364 10043 18069 29815 38490 30757 17908
9586 17908 14226 21782 25401 36238 51016 68814 79327 78334 61894 49951 44749 47359 47203 47368
9572 47368 53096 47289 36489 31018 26428 19025 16468 16709 2861 -1151 10767 9178 7919 11905
9558 11905 14851 19390 26918 32287 34945 27849 16957 19903 25098 28035 30733 25886 25927 26092 30982
9543 30982 30914 30751 32529 29431 30753 37529 38510 31376 29911 28473 28460 30531 36741 40541 32460 27152
9527 27152 27769 27237 29402 24641 22619 21644 13879 8735 13329 8945 4789 -728 4684 14617 19146
9512 19146 18714 11041 3494 5067 5808 3358 1335 9331 14745 20366 23589 23406 26581 25467 26450 34305
9496 34305 38039 40146 47235 44337 46501 51514 59501 56984 54509 54824 58043 46821 38441 39484 47799
9481 47799 50271 42908 38029 32021 27444 25936 26390 24684 19224 16390 15495 4934 630 5612 7170
9466 7170 9089 7240 10743 10835 6329 1966 3937 2154 2293 5432 7513 6826 10196 10979 17099 27524
9450 27524 25329 26412 18841 12929 14647 13042 6398 3105 6677 6402 2395 3479 4008 6457 4954
9435 4954 2475 12056 14882 9779 11440 6884 11843 5300 -105 3594 10634 4420 5613 14431 21773
9420 21773 20699 17067 14559 13027 14844 13222 12672 24581 25792 23318 19103 10109 10434 10574 12355
9405 12355 8453 5225 9467 7917 5736 5476 2292 5722 21067 24504 25443 23422 20347 19892 21408
9390 21408 18890 15756 11831 6710 8479 6449 196 4511 4962 5821 11520 6687 -481 1750 1643
9375 1643 3782 10368 16070 15767 21613 19643 23341 26142 25792 22683 21656 28313 29906 29646 26793 22230
9359 22230 18825 22861 24745 23103 21179 21558 17765 12759 15429 16449 10124 7442 13221 19618 18897
9344 18897 12423 6246 11142 18462 22271 17947 10518 12157 19663 24708 26814 24396 26857 24006 14513
9329 14513 8459 7395 7205 7945 11226 16446 14995 16172 22333 22962 22850 18959 17382 18727 12893 13072
9313 13072 17128 13927 15254 17917 13983 12775 17335 22208 22998 22908 21470 21626 18802 15532 17747 18211
9297 18211 20193 24391 22775 21505 13164 12777 12296 14317 26179 35055 32434 25864 23199 24272 24794
9282 24794 25721 26871 32620 25988 20648 21453 20862 22026 27043 29570 30546 35514 39563 38143 28882 23136
9266 23136 22044 21458 23972 22520 21109 26999 24733 18068 16698 19940 25743 26177 17782 12369 12437 13298
9250 13298 10778 10609 7115 11829 23269 24597 28201 29068 25739 19851 27958 31639 34148 31657 26599
9235 26599 20633 20631 16310 23493 29323 32301 34293 28985 17720 19469 22984 23451 19529 20431 26934 36273
9219 36273 38756 39137 40631 40195 29218 18947 17814 18578 20846 29734 32226 34862 32493 25276 25231
9204 25231 23412 29390 26419 22989 17681 20215 21162 19400 19706 17448 19914 21510 22215 24352 21745
9189 21745 14439 13386 15353 24741 26918 23649 21557 16577 19642 16829 14933 18616 17233 13468 20288
9174 20288 15243 6832 11952 22480 28768 20135 21771 25220 22299 17305 19330 24750 22543 21480
9160 21480 27457 30099 25832 21434 16996 13494 8008 2316 -1153 1129 6580 11265 12120 11608 11229
9145 11229 16365 23604 24687 27193 30291 24838 18755 14042 7484 5520 4056 6814 11733 9376 6527
9130 6527 14364 23754 21629 25665 28417 31184 35812 37209 43437 47956 38083 31410 18469 15657 16293
9115 16293 10269 10524 10402 10159 21601 23030 25967 29823 30122 29728 23062 19774 16286 8915 8322 13118
9099 13118 12259 19496 28324 28514 29895 33892 31000 31784 29880 29364 26443 24506 20699 19333 18183 14667
9083 14667 11653 12590 8580 9455 16476 23204 27154 28637 25354 23698 31318 35066 38966 44065 42465
9068 42465 35690 35429 35382 38682 38161 37612 37845 38108 35281 36789 41363 41501 47801 46211 35037 31530
9052 31530 33949 36454 40161 44244 43119 42480 44803 52203 57621 64871 64784 63298 73448 100161 134362
9037 134362 192045 273261 351350 394439 372208 298707 234632 189939 152819 134954 125329 117187
9025 117187 100635 88168 84056 90073 90376 85719 86701 88785 84783 73936 63607 59815 65787 64615
9011 64615 64341 62489 59992 54215 54375 65973 62745 57108 66056 76777 82861 85311 85852 86900 104369
8996 104369 123753 140971 174272 228552 328326 477048 650838 774388 748565 590661 439106
8985 439106 338933 281428 242036 204186 176793 160197 152607 140341 132935 125495 116876 114101
8973 114101 103664 98537 90281 80682 77477 81210 90278 94707 89011 83518 80615 79916 85797 88285
8959 88285 94206 94393 88287 81949 84447 90518 91200 86457 92642 102922 119789 148421 180650 231732
8945 231732 307196 378096 378801 316396 241303 184125 148938 125238 114111 109615 102327 100182 89765
8932 89765 84453 79212 78851 87351 92838 93579 85129 80293 82622 78295 72473 66058 63103 61028 56535
8917 56535 56856 57715 60642 62568 67297 65663 53829 49153 48646 39672 36132 39906 37130 31902 30644
8902 30644 38564 37596 35151 28255 22477 16247 23976 33630 36632 34748 42873 52049 56375 62055 67890
8887 67890 72112 78786 86463 95617 101950 108691 109524 105544 105043 112799 117473 118571 118229 123160 134547
8872 134547 146569 153039 152612 134159 117104 109770 105209 101927 95571 91257 88898 92294 100809 105078
8858 105078 105322 99474 88367 76299 69932 69757 65048 65033 58671 60906 64802 74150 82451 98664 107861
8843 107861 117752 126420 131000 129571 132480 135965 128429 119532 115273 119795 120531 120319 119036 131851 159888
8828 159888 196568 241103 271536 263961 226463 195122 176679 156243 132225 118067 112622 106359
8816 106359 100114 103369 100646 100140 101708 109519 112189 113604 104884 93603 91788 99730 95718 90588
8802 90588 89465 91609 99137 102610 108142 105494 99437 94486 87788 87084 88700 84535 85004 89103 95598
8787 95598 100710 105102 114497 138108 160746 178911 205672 221430 214462 198305 185168 163329 139698
8774 139698 127874 118563 109219 115110 127947 133458 135440 143774 160364 173339 182333 185640 172059
8761 172059 161391 152343 150610 156818 164182 187681 206153 206111 199812 202015 203272 196349 197685 189161
8747 189161 177564 172879 176376 182996 186382 197558 211179 226395 228808 224730 240536 250236 259854
8734 259854 268253 271590 265643 260223 254635 242931 242887 250812 279800 326843 375764 416370 430170
8721 430170 412257 404330 404901 391017 370756 346851 322614 308820 323221 348121 380566 418909
8709 418909 437532 450885 464128 483863 487046 482382 474644 469050 460617 465190 462824 466692 476461
8696 476461 489555 497307 498282 490956 492043 495514 500693 501185 498756 505090 514301 531360 548589 566818
8682 566818 589671 637161 703792 790275 867364 885512 842993 812823 820209 836262 844394 844509
8670 844509 842159 846693 880755 942638 1014293 1077191 1138609 1207191 1275284 1325576 1385959 1453675
8658 1453675 1536276 1651112 1781762 1910548 2058674 2226249 2421763 2654013 2933403 3281033
8648 3281033 3679498 4107724 4550135 5126245 5910663 6935623 8339377 10387377 13498159
8639 13498159 18498794 26916929 40121218 56189139 68764010 69299699 54961765 39500838
8631 39500838 29672457 23716714 19811036 17020245 14898435 13250502 11928168 10881544
8623 10881544 10086404 9479391 9017037 8627509 8246465 7861205 7493778 7144981 6838996
8614 6838996 6632635 6523405 6508290 6541761 6603983 6731567 6954157 7261734 7633537 8064640
8604 8064640 8622336 9290277 10016735 10777181 11718674 13031797 14800297 17217820 20742077
8595 20742077 26095212 34670077 49348937 73665325 105625667 133582042 140945956 114893803
8587 114893803 82236988 60995643 48258551 39971994 34078076 29596509 26106601 23316079
8579 23316079 21056598 19276159 17875547 16758098 15845166 14982731 14061204 13146020 12327319
8570 12327319 11599485 10961771 10419521 9993593 9662006 9385835 9184855 9091847 9086342 9120790
8560 9120790 9187816 9303124 9480201 9694682 9932873 10212314 10628949 11262005 12210447 13667851
8550 13667851 15963235 19661924 25908841 36304635 50814626 64991423 71421576 62787549
8542 62787549 46506915 34542395 27339531 22742084 19518403 17086281 15178089 13640435
8534 13640435 12387476 11391475 10591390 9951142 9426769 8954758 8484855 8005050 7542190
8525 7542190 7074293 6605258 6194081 5859425 5574606 5324863 5104132 4912656 4760624 4622399
8515 4622399 4498564 4383857 4275600 4171485 4055497 3917767 3754589 3593183 3436925 3295632
8505 3295632 3181049 3084400 2982783 2866056 2753921 2651162 2566815 2488899 2407001 2334188
8495 2334188 2273903 2218720 2165265 2096370 2020265 1945596 1883190 1832805 1789783 1757491 1734739
8484 1734739 1727404 1723036 1714443 1682029 1604804 1517682 1434335 1356397 1287951 1232043 1185562 1138537
8472 1138537 1089316 1043599 1009122 981378 958215 935772 914550 895627 868026 836475 806294
8461 806294 767605 734601 722740 716634 697053 669181 652644 646255 643065 639265 638551 640069 642862
8448 642862 634652 596492 551229 527089 504084 489092 479722 476272 486199 492282 494811 494423 489411
8435 489411 479385 455808 431827 415860 405767 393037 376398 360197 335542 323683 310353 306041
8423 306041 307653 298048 289472 289768 286331 278202 267889 257113 248940 252012 257301 253554 251521 249532
8409 249532 252914 260817 262023 265650 268393 258549 242059 220835 200394 184535 185860 188811 186678
8396 186678 190545 198977 205391 209816 216845 214979 215274 213023 217219 216220 211401 207201 202414 191184 178830
8381 178830 182412 182433 184920 189639 187680 179408 175344 173228 182593 169661 157060 154309 147015 156318
8367 156318 166276 173792 170832 167311 168909 171930 162542 159535 153597 142597 130753 127339 125675 127833
8353 127833 140402 142165 136486 128145 126935 133014 131631 126376 124119 125667 128416 127505 118741 112885
8339 112885 114820 120571 119135 111901 110210 118397 122411 120840 112236 99729 99748 99731 97792 86867 77329
8324 77329 78781 81368 84243 88822 92066 92095 89902 95045 92145 94811 92558 84901 76100 68171 68786
8309 68786 73517 70734 67233 58856 54484 53816 58599 55642 51301 39886 34812 28071 21369 28101 34775
8294 34775 44362 47617 46898 56222 60109 58728 55911 60996 60920 53578 51556 63531 76027 70915 59173
8279 59173 61644 62940 63045 61404 55564 52534 52710 57351 60391 58058 51666 50035 52282 47731 45898
8264 45898 51165 48929 42898 38352 34267 37048 36562 30174 28452 33975 34203 28058 23500 22768 26686
8249 26686 28532 36463 44009 46299 45538 44941 45150 49372 55013 56397 59471 72774 83355 97317 117462
8234 117462 144654 187622 257084 337847 397244 401262 332299 249459 200118 162172 132543 110313
8222 110313 94979 85951 85585 73491 61895 60031 63903 65353 65964 71518 69861 63470 57498 58944
8208 58944 54670 54854 53577 51167 59840 61177 52652 47665 49603 50463 58486 65006 65267 80901 90480
8193 90480 99768 113580 134049 159518 214097 296686 418036 583136 731253 769143 640942
8182 640942 468611 352761 279198 237151 203608 177615 161297 140468 125170 114998 114428 109045
8170 109045 107672 101138 95946 87331 83364 77550 71076 66976 69990 74349 68695 65076 64175 66578 66774
8155 66774 67795 68605 61454 54351 50029 51932 61829 75148 85598 88614 100019 118195 152769 215105
8141 215105 296521 368697 392068 343645 266551 207701 165956 134813 118245 102932 86134 77902
8129 77902 66543 64353 64577 61931 57598 51730 55562 54362 49743 45858 43696 44764 43183 33916 29696
8114 29696 33576 32099 23669 20072 28223 30628 27753 27061 26087 22929 21319 29492 29453 29484 31241 29264
8098 29264 26859 29453 28856 31512 35237 28638 21068 12981 9488 13707 15999 12792 8806 10040 10834
8083 10834 9656 7321 7802 9975 11873 8808 5566 12627 14082 12050 7883 3099 3549 5131 3922
8068 3922 14725 18136 12830 10373 9473 2610 2006 9562 12717 12118 7058 2002 3494 7782 16552
8053 16552 23991 31780 32502 26247 19829 11850 6834 639 -1613 -4079 -2927 -1714 -936 -3291 -4611
8038 -4611 -901 3508 11719 16111 13806 13349 12342 11802 15929 13859 13692 13246 13897 17751 22529 24591
8022 24591 20069 14664 15883 14698 11958 10641 12942 9961 6015 5155 6219 2396 4296 7312 8628
8007 8628 10369 9884 10566 9139 9645 12312 13689 571 47 7320 2089 4600 5072 1461 5997 15155
7991 15155 15937 16812 21564 19954 11562 5457 8627 9811 3839 1770 -2635 -172 762 5891 13787
7976 13787 11260 10637 15860 18477 15146 11379 15833 13497 8282 4074 7829 11538 6913 6001 8385
7961 8385 11239 5310 2151 3414 5709 7552 6333 1060 5013 -215 -3598 3380 10626 14331 11028
7946 11028 12463 15015 11074 3845 4691 6288 8484 11194 7191 4449 7000 13961 17025 14429 7884
7931 7884 10491 8807 7732 10690 16793 21315 19892 21246 23648 22035 27686 22525 21308 31690 33235
7916 33235 36349 28098 20217 14842 16507 16480 17368 14814 16361 16564 18591 23812 20603 20205 23483 20392
7900 20392 18493 17850 8438 -847 -254 6371 14833 18059 13138 2100 -2664 -2087 5747 15603 12691
7885 12691 2831 10211 16323 12816 13935 9982 9054 9190 13028 9970 13 -2727 -499 -2956 -954
7870 -954 1209 2632 8718 7606 4608 -3584 1317 8821 6078 2059 -3935 3357 10566 11159 13199
7855 13199 15640 8812 -694 -912 4105 542 1289 4328 1091 -3455 -322 6993 12929 17493 15378
7840 15378 9450 7922 5434 1574 3279 7729 12700 7411 2108 -11142 -13127 -3670 -3010 -5798 -5675
7825 -5675 -5179 -4846 686 5019 3980 3060 -1334 -2863 6022 11625 8900 4946 3164 493 -2406 -7136
7809 -7136 -882 4212 1623 -3240 -2823 -1628 1764 2234 645 3869 3270 778 -653 -1654 1893 -1554
7793 -1554 -6 2373 6446 5786 9265 17890 17940 16285 11058 5909 1174 2390 7106 15122 11700 4816
7777 4816 2475 -993 90 3505 -1600 29 2635 8355 5253 1792 1929 991 -6437 -3511 -1487
7762 -1487 213 -313 2871 759 1169 851 7142 2220 -2666 -2927 -5399 -3829 -3750 -1825 -3184 -5000
7746 -5000 -4312 -2097 -7974 -9118 -8632 -11376 -7549 -867 703 -4628 -9207 -7921 -6516 -1886 191
7731 191 1216 6237 1913 -1305 -2514 -3137 -6021 -497 3020 -275 -1282 173 3474 2424 3861
7716 3861 5638 2664 1298 1566 796 -2519 -8890 -1536 4277 5692 1718 -6620 -13399 -13489 -2489 -2557
7700 -2557 -2670 835 572 -3118 -3126 -3355 -1352 -5959 -1638 4212 10091 5810 2107 1541 10208 9456 4278
7683 4278 2447 6037 7814 2644 2491 1265 9842 8035 -4788 -6396 4240 6546 9169 -406 -5913
7668 -5913 -1960 2054 2387 2897 1138 3803 37 -3861 -3741 -2961 -2544 6199 7333 9448 6751 1312
7652 1312 -5430 -7840 -11227 -8579 -8174 -754 -3399 -4295 -3040 -5429 -3371 -979 -2277 -1009 655
7637 655 537 -1079 -713 2219 -5567 -11196 -6122 -1610 -6143 -5786 4201 10130 2491 2506 3208 1361 2754
7620 2754 2382 -3960 -11461 -7371 -185 1421 2090 1530 3265 -780 -940 7744 5927 -8946 -8658 -5302
7604 -5302 -5046 -5365 -5442 -10412 -7615 -4011 -3648 -7922 -12174 -7459 -2668 -3433 -5692 -4567 -1323 -5128
7588 -5128 -4741 -686 1529 8558 11113 1854 -1529 -538 7432 7365 -2504 -1821 1766 4751 -2606 -1254
7572 -1254 8032 6776 7964 -2230 -2418 3087 409 -2687 -4409 -9065 -11459 -9526 -9469 -10938 -4087
7557 -4087 2481 99 -8270 -10021 -280 4425 3143 4012 5278 1854 -304 -4577 -8247 -8874 -6561
7542 -6561 -8456 -8573 -10728 -9688 -5457 -6959 -7847 -4944 1155 -4841 -6768 -3406 -2320 -1748 -1967 -8010
7526 -8010 -6321 -3638 -11122 -10393 -5269 -2123 402 2246 9424 4440 -441 -3415 -4034 -1557 -4825
7511 -4825 -3485 -4389 -144 -1682 388 2699 4930 8730 7799 4324 773 -2486 -5871 -3650 1938
7496 1938 -2955 -4310 -5718 -6163 -2261 285 357 -54 7847 4105 -5587 -2863 2004 2791 -398 -723
7480 -723 -5577 -6480 -10459 -7266 1965 8224 5560 -160 -675 -1511 -2303 -6883 -3166 4412 3482 -1446
7464 -1446 2067 3233 2362 4428 5152 -121 -3547 -7335 -10281 -8343 -5688 -5786 -112 -1436 -8880 -15994
7448 -15994 -11229 -12579 -15773 -13547 -10065 -675 493 -11134 -3454 -1620 -5184 -8300 1476 5004
7434 5004 4518 8213 3313 2062 2729 -1195 -8066 -2929 -5793 -3908 -6164 -3741 -2282 -3581 -6541
7419 -6541 -10847 -4797 -683 6202 11427 8281 -2887 -10370 -11506 -7971 -5863 -8705 -9602 -6883 -4920
7404 -4920 -8001 -10170 -5207 6272 8093 -872 -5483 -6786 -5483 -1985 -2249 5395 7655 5219 6694
7389 6694 6673 4255 2285 5243 6556 1793 -4505 -1747 1143 2995 -5200 -4766 -1542 -3682 -1219 1128
7373 1128 -4900 -6499 -9074 -7500 -459 1352 -1123 8313 13344 10469 324 1554 5701 6293 4811
7358 4811 2972 -212 -1668 3966 3113 -780 1877 5487 1776 -3194 -3185 3981 15376 14196 11700 11872
7342 11872 10455 4489 -3048 -1427 -517 -5491 -15758 -17834 -13014 -4523 -2386 -4749 -719 -262 -7800
7327 -7800 -8615 -3995 4214 8100 3160 5030 824 -398 2410 -4188 -6996 -9870 -4331 -535 -7649
7312 -7649 -14712 -8553 -3325 -2445 -3874 -2947 1537 6047 2556 5839 4896 9660 9542 3333 -872 1257
7296 1257 2281 -11056 -20237 -18155 -9000 -6489 -942 -1065 -1572 460 -401 -1906 613 7727 10792
7281 10792 10312 1255 -9715 -6638 -8322 -13371 -8128 -3191 84 -4542 1915 4079 55 -6387 -12530
7266 -12530 -5534 -854 -3466 42 3705 4430 4355 -4416 -6797 -327 2292 2453 617 3999 7397 6315
7250 6315 4366 4488 1635 -533 1627 -487 -1769 -4882 -7360 -4063 -1848 3822 -7770 -8446 -4566
7235 -4566 -7303 -9736 -18774 -17159 -11481 -9196 -12876 -12183 -12946 -7892 -4956 -3251 -2374 -3149 784 -3550
7219 -3550 -6940 -2256 5345 3598 3028 3218 4085 3461 378 -4930 -8235 -5169 1389 2017 1207 -110
7203 -110 5727 6972 667 -1525 -3 -5977 -12704 -13679 -5844 -3290 -3012 2435 1403 1171 -3817 -2628
7187 -2628 4350 3253 1370 -1863 -4652 -4010 -4049 -4092 -3360 -405 6272 5973 10322 4375 -4413 -6560 -15275
7170 -15275 -15993 -12590 -2520 10682 13868 8555 5135 3889 7707 8277 7310 6569 -1478 -1191 1138
7155 1138 2305 -5300 -4605 -1663 7133 5913 27 -1565 -7817 -15359 -16413 -10007 -9673 -8323 -11079
7140 -11079 -8815 -14002 -14922 -6004 -2847 -407 5785 5436 -3833 -3294 1687 4029 4917 2334 3554 3404
7124 3404 -581 -2532 -5393 -8896 -8616 -12213 -8697 1089 -1656 -5935 -8981 -8123 -14157 -19410 -21646
7109 -21646 -15094 -10889 -5131 -1415 3330 3805 2912 8192 14324 12809 6012 -724 -2648 -2518 -2688 2780
7093 2780 1729 -1028 1001 5761 2366 -7639 -4868 2493 4762 5122 1896 -272 -441 -7455 -13478
7078 -13478 -13191 1401 2039 -2941 519 2421 -2149 2043 7843 8681 11534 11173 9440 7495 1562
7063 1562 -3044 -12567 -10501 -4837 -4508 -4367 -1913 6811 8124 3923 254 -2071 -2227 -3966 -9130 -10615
7047 -10615 -4066 -2232 -4149 2025 5086 6070 9002 4653 -3160 -7898 -11376 -7038 -422 1006 1379
7032 1379 245 6352 14534 10459 9981 3404 2340 4674 10557 8465 1186 2672 9138 10941 7404
7017 7404 3359 4595 598 2506 -4484 -5616 368 3120 -63 4010 3072 -7791 -7361 -12828 -16380
7002 -16380 -15688 -10200 -6993 449 2613 7526 4675 -6335 -12048 -11311 -9316 -5861 -5451 -3188 -4686
6987 -4686 -9493 -12705 -15058 -10815 -8709 -9573 -8550 -7181 -8543 -3916 -3662 -9045 -13111 -12496 -8746 -7515
6971 -7515 -9482 -2081 902 -2164 -7508 -7928 -11348 -16940 -13712 -1633 -4676 -9403 -5816 -4748 -4553
6956 -4553 -2440 1435 3000 -116 -3820 -5495 -8366 -9207 -4161 -3300 -8082 -5976 -2985 -9327 -12546
6941 -12546 -9698 441 1981 -1272 -829 -2582 -3856 -12375 -10891 -9730 -3848 -1127 -2673 2516 3346
6926 3346 -2191 -5866 77 3327 -1730 1121 6128 -1443 -6844 -9349 -7573 -6434 -2323 546 3833
6911 3833 2775 3074 -394 -2367 -5417 -3270 -6158 -7762 -1787 1431 -358 -4937 6330 5413 -1800
6896 -1800 -2699 299 2543 855 1107 1524 7681 2073 -454 -1812 -9936 -10758 -1341 3371 6386 7421
6880 7421 1726 851 -897 -4600 -5250 -635 6604 5409 6566 293 2847 9642 13926 9180 -4717
6865 -4717 -8345 -4536 582 -3961 -10015 -10907 -12362 -14350 -17621 -12152 -5490 -9577 -8443 -3656 -7388
6850 -7388 -5194 -1331 -2704 -460 -8970 -8190 -7542 -10271 -5848 -785 6369 3643 4550 4074 6532 444
6834 444 -4196 -4621 -385 5438 9948 9891 12971 10532 8751 17191 24033 14586 10015 4614 -2415 -6429
6818 -6429 -13775 -14627 -5322 1154 32 1336 3728 1947 859 3902 5473 -987 71 -3411 520
6803 520 2918 3492 2330 1537 7359 13887 13602 6064 7367 12591 13078 11258 7761 -3604 -6497 -8793
6787 -8793 -9636 -9592 -9321 -3687 -6303 -7427 -3880 -2777 -8239 -12781 -10894 -10049 -17190 -11592 -7539 -7507 -3323
6770 -3323 205 -2144 -4673 -2712 -5342 -14949 -15707 -5026 -1942 -2237 -2710 -5840 -7288 -3314 3308
6755 3308 896 -753 -4647 -10841 -11566 -7930 -7476 -16250 -19147 -9827 -11328 -10514 -4861 -1910 -5084 -2748
6739 -2748 3002 5824 -3839 -5133 -444 5346 983 -104 -2258 -10890 -15476 -14103 -15357 -13078 -9495
6724 -9495 -15495 -13028 -9232 -3995 2224 3421 6858 8670 -789 -2334 2195 1230 -2362 -10374 -17568
6709 -17568 -12120 -11000 1948 4811 4595 4723 931 -377 204 1610 -6552 -8682 -9187 -4590 500
6694 500 2220 3831 2614 1588 3493 1176 -3855 -3439 -4812 -3604 -1452 -5508 -1051 2147 -1894
6679 -1894 -8902 -18179 -17357 -10199 -9891 -6898 -10349 -10228 -1918 -683 -6915 -4137 1076 6072 6250 3893
6663 3893 6175 232 -7895 -11913 -10697 -11195 -4770 6364 3033 -2799 -4459 3230 636 -2688 -4636
6648 -4636 -6528 -1747 -629 -3505 3756 2553 -3289 -3927 -2140 116 6788 6513 -172 -8075 -11223
6633 -11223 -9642 -11641 -10349 -9362 -8788 -14462 -19106 -17648 -11304 -2693 -516 -2849 -2176 -2758 -584 5472
6617 5472 5088 3445 -2157 -3688 -5865 -8416 -7299 839 6989 6895 4569 -1119 -8894 -10332 -5387 -1854
6601 -1854 -3387 -1770 -1000 -315 -3652 -5570 -8456 -11142 -4094 -2814 1268 2336 2143 -1238 2104 3370
6585 3370 -715 2320 -821 3597 3293 -2700 -11794 -18193 -21050 -13479 -3050 448 128 4904 -4193
6570 -4193 -8918 -1278 2314 -747 2606 6763 14006 7121 2997 -941 -8143 -12866 -9356 -4274 -68
6555 -68 -2215 -1297 -627 -3457 2383 3843 2666 6439 8307 9056 6275 4206 -3332 -6903 -603 6361
6539 6361 4312 2999 2360 -2321 -9364 -12174 -10928 -11255 -9369 -3331 920 217 3321 -2085 -8060 -8637
6523 -8637 -11704 -10548 -6343 -4713 -2768 -1413 632 5823 1683 -418 625 821 3359 6596 8215
6508 8215 5509 7146 4763 3322 6115 -1442 -445 -2208 -1738 -1749 -5032 -6857 -12885 -13452 -12243 -10221
6492 -10221 -7068 -5933 -3632 1280 -6303 -11188 -14025 -7325 -400 2680 2457 -2102 -9267 -8507 -10141
6477 -10141 -7067 -9441 -9767 -12993 -17779 -8352 1381 -4820 -7121 -6552 -7452 -2281 4954 8563 7010
6462 7010 836 -5558 -9422 -10540 -9174 -4230 730 971 4658 5193 -3119 -7208 -8811 -7376 -11857
6447 -11857 -16439 -16752 -10732 -7856 -4445 -7035 -11348 -15056 -13508 -5778 -7938 -9123 -10365 -7286 -8916
6432 -8916 -9086 -4468 3638 7415 10154 10162 11640 15566 7123 2865 3209 4957 1618 -1683 634 -504
6416 -504 -2730 -1371 1635 3262 7598 5402 5453 1965 1528 4207 7828 7789 12461 13416 12015 10188 5937
6399 5937 1829 -4222 -4853 -6188 -9689 -5628 -3939 -2119 777 -5318 -12941 -12529 -12183 -9918 -7745 -18
6383 -18 10877 13379 3497 -3451 -14702 -22317 -21932 -19279 -22999 -13668 -7738 -12398 -12434 -9798 657
6368 657 3597 -1683 -968 -722 -7489 -9161 -10717 -13469 -13803 -10107 -5698 -2806 2244 6900 10332 6933
6352 6933 8699 6820 -1603 -1069 -2060 -8134 -11917 -7132 -1223 5857 5938 1823 1146 3110 3105 4615 2484
6335 2484 1083 -463 -2327 -4090 -5325 -1644 -1746 5150 1856 2535 1125 -5725 -6429 -11120 -9710 1496
6319 1496 11303 6242 7972 11449 5104 -544 -3652 -1742 1722 -461 -1991 -6500 -10341 -15310 -15127
6304 -15127 -9416 -2198 -1558 -6270 -1878 10502 10181 9146 5616 -4318 -6669 -4137 2659 8031 12272
6289 12272 4234 -8271 -8609 -12209 -12976 -5441 -2754 -904 1813 4856 -2629 -5098 -9363 -7153 -7102
6274 -7102 -7571 785 7140 8457 750 -1678 -3657 526 3340 8097 3499 -1085 -3095 -6390 -8005
6259 -8005 -3571 -6945 -11473 -4718 -3781 -6123 2452 7102 8864 6925 2629 4945 14765 14983 10769
6244 10769 4748 2302 -477 3822 5183 2272 -3498 -11599 -13964 -13166 -12675 -13378 -11332 -3931 -2235
6229 -2235 -2385 -5248 -6533 -4129 -9900 -17989 -18608 -6552 1739 2958 -1619 -5309 -15604 -20801 -18922
6214 -18922 -12789 -2818 -2357 591 1639 -5169 -5631 -4781 -1640 2427 4407 -681 2160 12586 12658 11239
6198 11239 4558 -2935 277 -1550 -6125 -7859 -11691 -11296 -9345 -8739 -8682 -5419 -8146 -9895 -7735 -13514
6182 -13514 -18984 -18868 -14694 -5663 -2071 2239 2551 6229 3127 -7573 -10733 -9517 -3221 -841 -2769
6167 -2769 -4904 -7250 -5834 -4489 -6186 -704 -9376 -12203 -2639 1920 11715 15278 12144 12826 9544
6152 9544 -86 -8956 -7481 -2003 238 1048 5431 9376 13753 5546 -1016 -6232 -4148 1485 -1702
6137 -1702 -4188 -7355 -6551 -2045 3910 2206 2009 3759 -323 -3023 1763 -232 -11463 -15987 -15478
6122 -15478 -13305 -8276 -932 -2211 -7150 -13725 -10793 896 -110 -120 6795 7904 2658 3583 950
6107 950 162 -2415 -6077 -4237 -2310 -254 3261 2611 4363 4418 3625 1019 1176 -400 9606 8514
6091 8514 -1994 -2476 -2416 -4170 -14208 -12167 -2043 687 -183 -856 -12272 -7936 -393 11 -8635
6076 -8635 -4358 583 -827 -1 -918 -4653 -15036 -7415 688 5686 4611 910 1198 2511 3286 -433
6060 -433 -1604 3947 13958 15806 17351 14994 5721 -3 -2391 3522 8321 5373 -3382 -10983 -10405
6045 -10405 -13630 -18749 -11898 -10822 -14367 -12246 -11272 -10740 -7740 -6651 -4772 -1769 -3264 -2686 -1983 2853
6029 2853 -2145 -596 731 14 -1770 392 657 -694 -7039 -4518 -4440 -8569 -9527 -4464 -2051 -3656
6013 -3656 1507 263 -4000 -6740 -13462 -13486 -14029 -9657 -3892 2273 3986 1732 843 -9525 -19814
5998 -19814 -15566 -8900 -4452 -6786 -10952 -5403 -2294 -4784 -2357 3504 4421 8850 2336 4636 6411
5983 6411 -966 -5633 -11348 -11482 -11723 -11698 -9517 -1799 4284 4563 3119 2519 10 -354 1764 -4564 -10345
5966 -10345 -4180 -7371 -7820 -5430 -807 3229 1352 -991 -1802 -1571 -974 -5323 -2671 3420 88 -4789
5950 -4789 -214 -1917 -6279 -3424 -2882 2008 2464 -1924 -957 787 4724 164 -2982 -6361 -8943 -5234
5934 -5234 -2824 -3027 429 -3178 -8373 -8670 -11748 -9981 -5997 2805 8446 8482 5196 3546 5168 -3986
5918 -3986 -14951 -14453 -15510 -14854 -15441 -15298 -4937 1335 2040 2278 2939 2247 -1525 -3090 -8699 -8650 -1511
5901 -1511 -621 -4446 -9039 -4125 1106 -5918 -6451 -340 3097 5334 4139 -2149 -688 2223 -5481
5886 -5481 -14003 -1961 3622 2085 537 -806 -2055 -6539 -2781 -4818 -7754 -7982 -9557 -12546 -16476
5871 -16476 -16809 -20745 -21114 -10600 723 3653 -2659 -8770 -8923 -3326 -3544 -810 -3027 -6176 -2969
5856 -2969 -8662 -11461 -10118 -12241 -10375 -10320 -12706 -11024 -9467 -6002 -3648 -3898 -10082 -15250 -8331 -3068
5840 -3068 2157 2127 4150 5117 -2907 -2341 991 -855 -4227 -3734 -11920 -4376 6076 7555 7338 2001
5824 2001 -2050 -4329 -5344 -3956 -4758 -2189 4774 7449 9670 10198 10541 7053 -2701 -6205 -9284 -15198
5808 -15198 -16297 -10891 -9124 -4305 -3518 -2705 -220 -1893 -7063 -8239 5722 9208 6910 2921 543
5793 543 -2364 -221 810 2936 2732 2097 9022 13291 5824 1810 2281 -187 -4144 -8377 -19616 -19481
5777 -19481 -8750 -483 5573 3533 -6626 -9178 -11179 -11572 -2951 -3642 -13999 -13204 -10433 1471
5763 1471 5507 -2486 -1733 -468 1325 -2131 -1383 4527 6314 -413 -8504 -13543 -8108 162 3751
5748 3751 5046 5442 2712 -6302 -252 1468 -2396 3327 4914 5351 8530 8393 3261 -326 1963 4165
5732 4165 5274 -3060 -4709 -5114 -3910 149 2529 -891 -1733 -1608 -1671 -586 1536 -2622 -4520 -6484
5716 -6484 -6336 -2306 -1280 254 -10373 -14320 -11571 -8756 -7987 -8179 -10690 -11500 -14051 -8901 -8508 -8145
5700 -8145 -8534 -3822 375 -1130 2585 1263 330 878 4067 -2983 -5419 -3899 2032 -5629 -9125 -10086
5684 -10086 -11410 -8615 -7896 -7706 -6339 -3378 -1000 -3490 -839 -3049 -1727 -7979 -13904 -11526 -10643
5669 -10643 -13457 -10146 -656 5779 -3388 -5465 -1455 -2070 -5156 -2645 -449 3421 -2149 -8844 -9112
5654 -9112 -10047 -5768 -3293 3095 8316 10550 7748 456 -1742 -9103 -8263 -10014 -8171 -8756 -6076 -135
5638 -135 1827 1779 -506 -1819 -1082 -1115 -3282 -4749 -8357 -11881 -5620 -4963 793 373 3029 873 421
5621 421 -1529 -8024 -11032 -10747 -6483 -5643 -5282 4241 6663 57 -7482 -3326 3905 6916 1069 -2422
5605 -2422 -2913 1684 3486 6504 2068 1934 3937 1486 -2338 220 6858 6503 232 -7372 -3554 -74
5589 -74 1957 8524 234 1799 636 -3440 -4312 -1457 -499 1524 1155 -567 -2538 -1793 -7503 -16699
5573 -16699 -15784 -10366 -2514 2117 -3488 -6751 -5392 -1806 -865 -4311 -7813 1142 11858 5966 650
5558 650 -700 -11168 -15634 -17599 -19328 -11010 -3338 -6000 -5235 313 3385 1942 5925 5079 -2462
5543 -2462 -6408 -9118 -5989 -3516 -7743 -5824 -16 -4174 -3079 1055 -1747 187 321 -3725 -10346
5528 -10346 -7207 -8202 -8463 -10988 -9017 -15776 -19219 -14603 -6698 -4928 -2005 -4505 -3569 517 -2308
5513 -2308 -1466 3557 3553 -4675 1173 12212 16159 14765 6711 988 1615 -224 6024 821 -9242 -18370
5497 -18370 -18781 -13180 -9398 -7447 -2145 -7018 -10738 -7821 -1315 2110 2148 5758 8907 4670 -1500
5482 -1500 -2306 -3788 -1264 993 3664 132 -762 5525 2201 2019 -1685 -3150 -2183 1063 5269 2527
5466 2527 -1936 -3504 -1386 4624 6901 5858 1282 -3551 -863 571 -7381 -13189 -11926 -6524 -12018
5451 -12018 -6501 -7500 -3700 -7978 -7754 -920 4408 3098 935 170 1245 -6504 -7035 -1868 -10285 -15670
5435 -15670 -11611 -4991 -1132 5046 10131 7905 3396 -4679 -8180 -15017 -15265 -14464 -10966 -1993 4828
5420 4828 8525 9412 17 -10011 -11092 -12099 -10949 -5362 67 -1832 -943 -2325 -4782 -5462 -11573
5405 -11573 -15170 -11395 -6480 -7646 -10786 -10657 -8845 -3888 -3273 -5951 -5320 -1665 5323 -1920 -10660
5390 -10660 -8839 -865 653 -4547 -3194 -2243 -149 -4685 -953 -607 3491 9228 10041 11968 9682
5375 9682 110 -5721 -8199 -6846 211 456 2792 4405 613 -3836 -501 -1818 -1044 -2389 575
5360 575 -3164 -2794 1189 312 -2538 -1105 -4976 -11401 -13583 -14940 -12174 -10057 -9474 -7836 -4860 -14497
5344 -14497 -11546 -9840 -6264 -5189 -4962 -3582 -5308 -6497 252 -745 -3227 -10257 -5834 -10174 -14602
5329 -14602 -18326 -14503 -8831 -3750 -2833 -5789 -8744 -5941 4057 2835 4376 977 -6566 -5760 -4762
5314 -4762 -2558 -6612 235 1318 -1423 2228 1638 -2387 -4836 -3260 -1303 4221 11282 9231 2643
5299 2643 -3810 -3116 -3391 -8415 -7613 -1415 5601 7827 -1725 -2809 -1406 -5332 -4643 -1247 -1587 -6027
5283 -6027 -9351 -5333 5221 4539 -205 1424 2849 1426 -417 -1510 1864 4833 1940 4640 5503
5268 5503 -478 809 401 -3035 -1868 801 -1028 -277 3857 -1849 -4796 -4636 2727 8585 5919 3055
5252 3055 4743 6918 7973 6955 3127 966 -4278 -4346 -2746 -6673 2709 11020 6144 3117 2366 1541
5236 1541 -214 -5584 -12843 -7141 -2982 441 2996 1082 -2846 -12513 -7339 -5349 -2548 -3207 3202
5221 3202 4876 2944 4890 -480 -7309 -8431 -8988 -4569 -6166 -12880 -17527 -16021 -10040 1482 9763
5206 9763 9878 5162 -144 -5030 -2138 3377 -1995 -3140 -1021 4235 2272 123 3955 793 2228
5191 2228 5988 2648 -5635 -13585 -12122 -6425 -4551 2009 1091 -1945 2073 3909 -2778 -6573 -3404
5176 -3404 -7193 -12564 -8568 -9326 -15114 -18189 -11781 -3875 -6065 -9411 -6221 -7180 -9984 -12877 -13397 -10256
5160 -10256 -7056 -11599 -11639 -8130 -9211 -9927 -9408 -5869 -4598 -2017 -8103 -5391 -2476 -340 6843 9426
5144 9426 -104 -3151 -1348 4634 -62 -2716 973 1959 -1355 1632 1376 2914 464 -8817 -5335
5129 -5335 1673 -4829 -552 3220 8230 7388 1778 2136 964 2652 -3846 -6623 3438 2949 -1336
5114 -1336 1802 9351 2457 -8026 -14660 -10990 -4437 -8581 -4350 6623 12451 14287 3239 -921
5100 -921 313 1997 2394 3891 4660 219 -2585 -4572 -1949 5564 1447 -3174 -4448 -8820 -6922 2088
5084 2088 253 -2557 -7281 -7865 -6510 -534 3727 5677 3926 -2905 -8695 -5542 -3546 -3082 -10565
5069 -10565 -13549 -12046 -5947 1040 3045 -2464 -1874 4606 197 2764 4084 1820 3655 3345 7315
5054 7315 7653 6117 7248 2464 -679 -3482 -7835 -8622 -1814 -867 -3540 2185 -110 1378 -6970 -5035
5038 -5035 609 8446 6280 -7908 -7529 -4282 -8020 -13282 -11000 -6816 -5432 -11195 -14627 -7174 -3400
5023 -3400 -4019 -5471 -9330 -5412 113 6369 5727 2171 -4418 -8639 -7966 -7850 -8605 514 6803 5552
5007 5552 -5668 -8378 -7638 -7096 -3447 1129 2011 3439 1180 -2470 -5918 -1750 -6796 -11291 -8430
4992 -8430 -10966 -14562 -11813 -9636 -7080 -3181 -3054 -7807 -16823 -11632 -4558 -3757 -8011 -5956 -5195 -2091
4976 -2091 -4416 1111 7851 10170 4185 36 -379 -528 -28 3817 689 -1172 -1324 5298 985 2617
4960 2617 5841 7211 9838 4429 2925 6113 3588 8926 9497 3729 7009 6342 10696 11190 2361 -3375
4944 -3375 1946 9105 13466 9187 12517 17956 17355 9605 5657 12388 7353 4590 2028 -1270 -5084
4929 -5084 -6710 -3904 1072 -1294 -1884 2537 270 1908 -4624 -11229 -9007 -1374 246 -936 -750
4914 -750 5193 12127 6443 2854 -2524 -5745 -574 -976 -1750 -245 3357 4484 6341 13519 11730 8581
4898 8581 2683 1034 3516 11076 7225 4281 3182 -5431 -6541 -5011 -5694 -3186 2049 1477 4605
4883 4605 7897 6535 562 2718 3683 9110 10139 1834 -66 -6582 -11073 -10751 -11720 -11784 -10817 -8769
4867 -8769 -5916 1018 -108 -8692 -6584 -6439 -10044 -6430 -752 5163 7692 7646 6377 499 -5140 -8412
4851 -8412 -9204 -8617 -8112 -3616 -812 -953 -10046 -16485 -17910 -10185 -3081 -749 -6735 -8585 -6514 -4541
4835 -4541 -1047 1246 1050 208 -3109 -6072 -3115 7753 1976 -1775 -1725 590 1928 3143 4823 10598
4819 10598 15545 17095 17322 11785 4075 4281 -1830 -1217 881 2509 464 651 1127 -1714 -8173 -4166
4803 -4166 5118 6684 8080 5363 1365 -3713 -5941 -5446 -3570 -1339 -4935 -8585 -11783 -9901 -7879
4788 -7879 -4171 -4922 -7621 -6878 -8988 -5329 3001 7686 7426 3361 1036 -300 -3948 -3606 -3178 -4263
4772 -4263 -7182 -6970 -6036 -10629 -11970 -13058 -5726 -5918 -1759 4346 13098 8039 3349 1742 1315 -6003
4756 -6003 -11516 -6656 -318 4634 3933 -3784 -2309 -8307 -16855 -14129 -10254 -8674 -4249 -5584 -571
4741 -571 10689 17263 10491 3375 5101 10892 9105 -1998 -4460 -4852 -8634 -3827 6347 11830 11666
4726 11666 12686 9806 11405 9306 10154 5490 1144 2506 5363 2314 8992 9451 9014 1940 -2609
4711 -2609 -4082 -4933 -7201 -2644 -1878 -3993 -3685 -3295 -3381 -3680 2406 7652 4353 7205 9013 8366 1428
4694 1428 -3639 -461 -707 2289 -640 -1435 1239 608 -2583 -1281 3702 396 -4969 -7034 -8621 -4183
4678 -4183 1769 -1365 4041 5421 -146 -7942 -8882 -11931 -12527 -8789 -2589 -367 -4625 -8538 -6829
4663 -6829 -4402 -1719 -596 2779 3149 -1395 -1168 2788 1906 3085 6816 7514 6820 -174 -3382 -2216
4647 -2216 -7021 -8619 -15237 -20253 -13009 -5520 -5307 -10729 -8577 -8698 -9878 -16185 -8545 -5048 -1618
4632 -1618 1508 1625 -2415 -8570 -8676 -6407 -5570 -3163 -10022 -16525 -11475 -5689 140 4783 1975 4439
4616 4439 4954 915 -4386 -8464 -6227 -1348 5722 6784 4152 8397 10549 4887 228 2044 7858
4601 7858 4720 -4694 -1730 2724 2044 -7524 -14477 -17163 -19789 -13393 -5736 -3353 -3837 191 -739 -2582
4585 -2582 -916 2946 3210 -189 -2124 -1889 -6402 -11553 -7730 -4430 -1967 -3496 -4563 -9546 -9935 -5288
4569 -5288 -4412 -4890 -3587 4199 4677 2105 33 -817 1622 -2515 -8412 -6999 -8484 -10358 -11478 -9495
4553 -9495 -7412 -4751 -7526 -2380 1144 -5693 -8692 -8455 -8357 -7491 -9992 -9130 -7795 -6079 -6774 -3934
4537 -3934 -7765 -6531 -4322 -3859 -4257 -1282 -3845 -9345 -5580 -3978 -698 2241 3734 -5304 -9464
4522 -9464 -8858 -9959 -8689 -2032 -4963 -4621 2416 -2371 -7890 2790 2153 796 -1759 -3797 -3483 -4914
4506 -4914 -4544 -2432 622 -421 -6069 -6472 -9095 -1718 4384 5068 -1733 -5838 -7135 -9674 -5345 1477
4490 1477 -3071 -5483 -6593 -125 5421 4902 10652 9620 8754 11286 9507 2678 2999 2218 -1922 -1889
4474 -1889 2378 -801 -3573 -7429 -5967 -10436 -13699 -9834 -3293 791 6260 3275 -4200 -3095 -1613
4459 -1613 -10330 -17395 -15610 -9725 -2922 1286 499 -2655 -1665 -585 1805 1287 816 2052 -859 -608
4443 -608 2797 6739 12785 9385 672 468 -154 -6374 -6394 -4575 -8803 -12558 -11825 -6138 -3373 -4248 -10186
4426 -10186 -10598 -7628 -5439 -223 -4514 -11070 -8239 -8709 -14620 -8798 -8910 -9326 -10101 -937 1410 3999
4410 3999 4037 -194 -3501 3898 14720 18052 13225 11991 7575 723 -350 -5351 -7635 -5629 -1399
4395 -1399 4315 4260 3482 713 1888 808 156 6305 7325 8472 9414 5800 285 -5336 -6306 -443
4379 -443 -2088 -11671 -5155 -6117 -8063 -4381 2485 4434 1521 -4199 -3797 -4306 -3928 -8860 -10299 -3767
4363 -3767 -8421 -14246 -14714 -3745 -1938 -5933 -5318 -2892 -6659 -12193 -10976 -6105 -2215 -5029 -10500
4348 -10500 -6903 -3720 -5701 -6978 -2611 5051 2604 1929 -501 1217 1709 4665 4410 5704 -679
4333 -679 -4909 -2528 2474 1169 1704 5890 7855 -327 -5445 -6510 -11313 -5284 2692 2392 -2631 -498
4317 -498 2268 489 4737 397 -4292 -2763 -3846 -7881 -10035 -4817 -3587 612 -4529 -5365 -4482 -3752
4301 -3752 -661 1123 2647 1717 -1459 -2379 -3807 -1839 168 -2002 2568 3847 -1167 -1081 3787 1463
4285 1463 -5104 -3956 -435 -2578 -4213 -5012 -1109 -2705 -1316 -3390 -9553 -9599 -5186 -5872 -7445 -5926
4269 -5926 -9991 -16779 -11374 -2742 2347 1898 -4736 -5136 1543 2624 7474 3976 -2095 -2228 -6083 -7098
4253 -7098 -8480 -5867 -6406 -6202 -10227 -9786 -5868 -1292 244 -1339 -2753 -8979 -9584 -5077 -4492 -3580
4237 -3580 654 734 -132 -654 -693 -1408 -3164 -5498 -3813 1619 2845 4372 6897 9119 10362 12921 7406
4220 7406 6046 6996 7087 4839 2335 -3225 1936 -1024 -5910 -5913 -3153 -1002 352 38 1754 1368 -3757
4203 -3757 -764 4463 5931 7700 2646 663 2475 339 -2983 -4502 -6469 -8818 -5628 -2285 -2602
4188 -2602 -2255 -1835 4902 7357 7769 10988 8978 7377 5748 -5608 -11451 -3115 3886 680 480 1200
4172 1200 3974 7567 4003 -1048 -5657 -4806 -2235 1835 -224 -5114 -2934 -3827 -3273 -2768 2363 1926
4156 1926 -3759 -3098 2931 7564 11209 9890 14255 14283 4729 4886 10686 6981 -1311 -2093 1701 -4564
4140 -4564 599 264 -2204 6388 10514 7509 7264 3320 4385 1929 312 -6300 -3338 -5343 -3568
4125 -3568 -4986 -8562 -6866 -6825 -2228 1338 2392 7052 332 -5772 -9028 -11768 -618 6168 3786
4110 3786 6817 421 -6902 -5131 -1661 -5449 -7368 -8758 -15212 -11368 -4237 -3384 -436 -1752 5376
4095 5376 8366 8853 12186 7918 897 230 784 2928 701 -6787 -12692 -10659 -1069 -3384 -1508 5058
4079 5058 4659 -480 1014 6387 5436 -3412 -13297 -10488 -618 13969 9234 2696 279 724 948 1372
4063 1372 -3019 -815 1513 5305 2318 -276 -4250 -4561 2396 -265 -4044 70 -468 -95 1712 8495
4047 8495 9516 3641 -1895 -5978 -7176 -4670 -3696 -10873 -13849 -10150 -4624 -7895 -13156 -21628 -25334
4032 -25334 -19295 -14262 -14361 -10798 -3174 -7874 -10806 -9225 -7590 -7045 -1917 4493 -1917 -2285 6201 11905
4016 11905 17623 16453 9241 10360 7409 12820 12198 8260 8574 6630 4086 1744 -2585 -3773 -2678
4001 -2678 2768 2668 -697 -6511 -4653 -619 -2961 -1949 3293 6686 6966 -5140 -2986 2652 3824
3986 3824 -2611 -12993 -11780 -6399 -11217 -7888 -4031 -4274 -1652 141 1497 4882 3411 -5601 -8419
3971 -8419 -10145 -11288 -8029 -4407 2703 2062 5032 6965 6428 1609 -7017 -12381 -9618 -1359 755
3956 755 6137 6971 6807 1438 -1982 -377 2822 5660 53 -7801 -4197 -2146 -1400 2581 1239 -522
3940 -522 3869 -2051 -10018 -11664 -773 8752 8783 -845 -255 5644 7112 5566 4585 8379 9248 7132
3924 7132 6099 6847 4536 3107 3573 2382 2908 3755 5014 7194 5242 5559 -1891 -3227 640 -864
3908 -864 2662 -415 -2112 -4753 -14374 -11592 -6933 133 -2243 5145 3117 861 4551 -829 494
3893 494 3667 -4963 -11512 -14716 -11021 -8655 -8074 -9063 -13676 -7926 -7556 -2343 -1726 -2841 -10867 -8492
3877 -8492 -1587 397 -3091 -6750 -11251 -13809 -16298 -9273 -7398 -4898 -7461 -11122 -8044 -2239 2439
3862 2439 -248 -784 -6547 -9676 -4499 -8409 -11965 -9091 -6458 -4080 -4516 -3694 -1958 -4164 -1597 334
3846 334 4612 2994 -8438 -1840 7573 6021 4048 2386 -4419 -9473 -11890 -5054 1267 4513 2082
3831 2082 1155 3067 -503 -1299 -1240 -626 -1110 -3525 -10296 -1039 1015 4366 4752 -3913 1066 510 -5793
3814 -5793 -11677 -3200 3079 12672 15081 9852 2836 3891 340 -1165 5804 1049 -4991 -2822 2759
3799 2759 706 -6202 -3616 -9221 -9676 -11730 -12069 -5720 -1172 4052 6300 11519 8333 -713 -4753
3784 -4753 -4168 -1874 440 6112 7534 3844 5115 5141 2517 -2466 -4506 -6225 -6208 -10232 -16040 -16754
3768 -16754 -11060 -5337 -1163 -2817 1082 522 5723 7939 -1328 -5820 -4622 -2095 632 5963 2911
3753 2911 -1033 -2145 1751 5666 1443 -7061 -15691 -15907 -11900 -17174 -17208 -11891 -7076 -3478 1588 -3941
3737 -3941 -4564 -11338 -7355 -3291 -2767 -4393 6738 11793 6592 4033 5290 5653 2541 -2912 -4728
3722 -4728 -9253 -8971 -4702 -1339 1857 4623 10208 2765 8637 19897 23423 15068 11988 16097 15640
3707 15640 16313 12142 6695 4923 7197 11029 14583 18322 13470 6498 7866 6370 3004 3225 -739
3692 -739 -5278 745 2298 -4267 -14843 -14762 -8841 -4727 3299 -137 -1286 -3367 -1606 -1854 -7552 -10875
3676 -10875 -9453 -1436 1272 -4771 -4353 -4543 -261 3274 3082 247 -1339 -7374 -3607 423 -321 -5543
3660 -5543 -5914 -4838 -3666 -6737 -15155 -10463 -4224 -2445 3665 2929 -1354 -2509 -10385 -10689 -9749 -10999
3644 -10999 -10087 891 13820 10154 -3797 -13759 -12193 -8629 -4035 1189 -10 2710 2365 -1871
3630 -1871 2541 1395 -4620 -14115 -7978 -6177 -4011 -2749 -7846 -11749 -11369 -2100 825 -599 -441
3615 -441 -5294 -2936 812 2075 5119 2232 5410 3970 6674 7963 8560 3690 -1879 5318 3928
3600 3928 -2675 -4102 -8134 -15305 -21973 -23773 -17894 -15754 -11815 -4039 -3106 -9717 -12492 -1519 5527
3585 5527 8478 10185 11379 10058 7712 2021 -946 6071 6116 573 -1568 1463 2044 4228 -258 -2963
3569 -2963 -2239 -1647 165 -333 -2963 -7492 -7869 -4753 -2315 -3024 -9901 -18551 -20564 -14696 -6558 -442
3553 -442 -1479 -5337 -9264 -9387 -8381 -1210 -2394 367 -2414 -5651 -3437 -1376 3901 2355 -8272
3538 -8272 -7601 -6131 -1450 1795 2698 -5748 -6585 -11396 -12043 -9434 -10149 -6791 -3346 -381 -5122 -13306
3522 -13306 -17751 -19096 -19533 -6607 6745 7751 647 -4372 -1815 7516 14058 12445 3057 -845
3508 -845 1339 119 7759 6804 137 -5268 1097 572 -5554 -4766 -4362 -2819 -2765 148 4333 5891 4055
3491 4055 -786 -2856 928 4798 2053 -4752 -6991 -9790 -9503 -6346 -5956 -3430 2017 5444 3911
3476 3911 5917 4321 -5106 -8225 -5427 -3478 -3542 -2185 3037 3268 -3754 -7320 -3487 1562 6364 12570
3460 12570 14843 10333 5393 4223 8492 7952 4747 4224 4848 4023 5358 3811 3417 1999 4377 803
3444 803 -2428 -146 -559 -754 2995 5158 -1163 -6649 -7258 -7607 -3265 -5945 -3445 1371 3320 -2215
3428 -2215 -5661 -2148 -10422 -12403 -10055 -7920 -5617 -5630 -1677 6882 4347 -549 -207 -8795 -7006 -6407
3412 -6407 -4473 -3110 -540 -4773 566 6927 10874 5876 -2243 1791 5548 12911 8776 10227 14736
3397 14736 6907 2897 -439 -1865 -1259 -92 5660 -60 -4603 -458 -1728 3102 3750 -253 -4448
3382 -4448 -8534 -10629 -11411 -7005 -5937 -2997 -4398 -3785 -4446 -1829 -2632 -84 -8009 -7950 946 4200
3366 4200 1784 9177 5245 -1378 -8835 -11530 -12964 -10013 -7615 441 2617 -4835 -4137 -3188 -7417
3351 -7417 -3486 3432 5923 6969 4302 4164 5990 9129 11686 6663 1428 -1054 569 2587 37
3336 37 3186 -3307 -3775 -5342 -7752 -635 -2321 -2829 -3495 -345 -4818 1641 4298 5833 4191 -2856
3320 -2856 -3532 -9748 -8273 -9741 -6270 -6836 -9143 -646 7794 5185 32 -4684 -6033 -6234 -5616 -5639
3304 -5639 -4644 -32 -3742 -2295 1790 2765 7992 6641 1460 -4858 -10966 -10258 -7879 -5976 -2438 467
3288 467 -4623 -8861 -1121 2099 -2426 -781 -2548 -1292 -2229 -1816 1419 5832 5172 4666 -8638 -14735
3272 -14735 -15308 -15649 -16412 -13477 -13716 -12190 -11602 -15622 -12400 -16906 -11654 -5823 -1993 -1626 2029 -4307
3256 -4307 -8075 -6251 -6610 -3530 2282 -915 -7846 -9584 -7232 -5309 -7817 -5863 -5858 -10017 -12343 -2186
3240 -2186 -406 -9101 -12693 -6062 -424 -1359 4049 5007 3307 4864 646 2078 1922 5700 6251 4972
3224 4972 6132 9733 12958 4173 792 2350 -1886 -4191 -5953 -2690 -252 1761 4575 6064 5492
3209 5492 -4211 -6814 -8254 -3828 -3819 102 4789 5408 1835 -1975 180 -174 -2205 -4498 -5899 -8161
3193 -8161 912 8011 7341 -1917 -2684 1932 -3651 -4851 -812 4379 7595 10695 6010 -493 4925
3178 4925 4621 -1692 -2453 -3948 3249 -2041 -9826 -16262 -12145 -8550 507 1503 -3111 -7694 -6335 -1777
3162 -1777 -1096 -1301 1830 -586 -1223 -477 4410 9451 4240 -4300 -8014 -2008 4280 9099 8322 3653
3146 3653 -1176 -8353 -9502 -7537 -7704 1596 99 -3483 -8377 -8808 -2874 2196 5924 1889 -947
3131 -947 -2128 -6529 -6929 -8714 -8107 -5432 -3534 -1263 -1360 -3624 2066 -1266 -336 -1003 -965 -1739 25
3114 25 4477 285 -3117 -858 -2452 3324 6729 7766 3438 10376 3728 -340 -3211 -2697 2831 5829
3098 5829 3784 5045 9350 9238 3167 6793 10068 3310 -440 2399 3593 -2380 -83 370 -754
3083 -754 1399 7964 7253 -3323 -3784 6429 11210 10213 13363 11847 10162 9720 3364 2024 -942 -5362
3067 -5362 -9070 -8688 -414 -239 2296 -8116 -8178 -6251 -9676 -5869 -221 4217 1263 2767 549 -3595
3051 -3595 443 4112 3136 3486 8977 7764 5917 6218 9134 8598 1048 -1057 -3943 -4655 -5936 -10283
3035 -10283 -6175 3187 3224 -71 -3464 -5356 -7787 -7092 -4965 -4209 -4585 -5165 -1557 2131 77 -1015
3019 -1015 2609 -1493 59 219 -2466 2016 6762 3847 -4549 -141 1546 2822 -3842 -8432 -13240
3004 -13240 -12048 -9510 -6928 -2887 4560 2833 -4943 -7430 -3680 -3519 -4668 635 -1626 -8962 -9134
2989 -9134 -7501 -5850 -2463 -6164 -4191 -1701 -394 5192 3846 1798 -3426 -4566 -8814 -2863 -1601
2974 -1601 -5085 -2542 7276 11761 11838 9097 4793 -893 2845 2689 5545 8293 13381 14039 8021 6097
2958 6097 -5717 -12132 -3791 -5143 -8397 -6542 -4470 84 2007 -4741 -4571 -3771 1788 8581 7353
2943 7353 4495 5922 -576 1582 2879 5152 8321 11539 10105 11860 9277 1016 -3229 -1798 -8864
2928 -8864 -12523 -10802 -6070 -1439 783 -620 -3342 -7241 -4498 -5414 -6501 -1485 -192 -548 -6268
2913 -6268 -9665 -3713 -3511 -1203 -3514 -2332 -2471 -3797 -4082 -6978 -8055 -8784 -9764 -5701 -3420 -2886
2897 -2886 -5453 -7704 -5894 -5722 -1499 -4163 -4358 1171 -516 979 3546 1086 -374 -5804 -12826
2882 -12826 -8643 2647 2675 3679 -493 901 6065 10059 7257 6579 6859 6950 2970 2468 -3376 -8294
2866 -8294 -6593 -2915 4594 13033 10426 9654 7799 2240 8623 13704 6161 579 -563 -1103 -8568
2851 -8568 -9169 -5346 -5511 810 6160 661 -4133 1215 5054 5655 1366 -1455 1936 11556 15464 11216
2835 11216 6184 5822 6757 6257 5935 1351 1748 -5340 -8764 -4631 -710 -5257 -3298 -2468 -6236 -5643
2819 -5643 -4145 -4852 -8418 -10290 -12695 -12362 -7281 -624 6762 7436 -3227 -5712 2244 1472 -461 -1576
2803 -1576 -986 -2882 -3059 -1224 1506 511 -3353 -5153 -5536 -1162 1022 3657 6296 -2624 -6139 -6245
2787 -6245 -4727 86 643 -1429 -2647 -1137 -698 4481 8486 1652 -4696 612 -1805 -2372 3257 2931
2771 2931 2403 -1155 2501 5516 -6689 -11254 -9312 -11461 -17023 -19725 -17931 -12974 -5556 -6558 -1166
2756 -1166 -1098 2121 6934 8196 8269 8998 1807 -10230 -15056 -10024 -7326 -882 -2583 -677 2121 -4149
2740 -4149 -2916 617 3028 4343 -5230 -14214 -9926 -4525 -3054 -4903 320 964 -1526 -4129 -3088
2725 -3088 1345 5996 7983 3965 -3035 -3105 -2157 1604 -1462 -2165 -5141 -10340 -7120 -128 -179 3442
2709 3442 6675 6980 1382 -2974 -1079 5604 1793 2265 -686 -3960 -6474 -2768 -859 286 -4275
2694 -4275 -7606 -2504 4784 3578 3187 -827 -4628 -1896 2965 -6993 -7767 -4935 1373 8177 10954
2679 10954 12417 13948 9911 7800 9811 5399 -792 911 2295 -3191 886 3191 -497 -1882 -3658
2664 -3658 -6612 -1253 5375 5246 -492 4614 8489 8365 1999 -167 7424 9051 3300 -1303 1342
2649 1342 7783 10158 2204 -4059 316 1966 8102 10469 9995 8222 3501 -2584 -2584 3960 5018 2776
2633 2776 9699 7729 608 544 3963 10471 13375 15288 10529 6191 3412 9482 9980 13591 13954 8462
2617 8462 8907 10486 8328 5475 6777 7138 2372 -3928 -3695 1494 -3238 -6524 -4013 1319 1223 -4863
2601 -4863 -5709 -5174 -4426 -2592 -4593 210 9906 6275 2393 -44 -4423 2745 9299 6757 5923 -252
2585 -252 -794 -1119 8641 15150 12963 15965 14291 11111 10950 8473 5354 8057 14781 23265 22560 14547
2569 14547 7710 10764 13664 9551 5734 2543 4381 6428 1668 4799 8382 9082 6008 3168 6739
2554 6739 7749 3356 656 5138 3981 692 6174 12639 11861 15255 14324 12456 9036 6751 6109 10544
2538 10544 5102 -409 -3193 306 1594 -476 -7512 -8021 -4992 -2228 -4031 -5140 -10007 -5513 -2248
2523 -2248 597 2902 -2367 -2428 -2253 -4105 -4800 1370 3723 -3163 -11719 -13481 -9999 -2979 3249 7252
2507 7252 5481 1236 984 -137 -1526 -339 -3562 -8225 -5186 -4793 -5072 -4481 -6897 -7651 -4990 3072
2491 3072 3884 -359 -1432 -5970 -6694 -2785 -5271 -7931 -8323 -5988 -7087 -9428 -12229 -5445 3107 1970
2475 1970 873 -186 -1485 2460 6980 5722 521 -5110 -2556 -3146 -7072 -10220 -9150 -985 2784
2460 2784 5133 10878 12061 8226 8810 13458 9611 2290 -6244 -3929 1149 9752 7274 4369 -627
2445 -627 3159 6770 5783 4017 45 6598 10701 9879 7093 5364 -509 1302 2162 7504 9958 2740
2429 2740 7450 4312 -953 6178 6467 4778 4807 4046 4792 11426 8331 4791 1603 2326 1710 -6490 -7149
2412 -7149 1517 -818 472 1335 -3794 -8809 -5081 2569 8235 4544 6607 7962 2544 -5213 -4243
2397 -4243 -1602 -8478 -3761 3696 5940 5263 6610 -2147 -7641 -13233 -13595 -12736 -7698 -1024 7046 13741
2381 13741 10371 6957 5813 7639 3414 4074 4761 2732 3233 7202 5550 2908 10830 10723 -1171
2366 -1171 -9150 -9007 -5181 -7805 -14405 -7458 734 -375 -428 61 -5635 -7067 -4523 -3561 -5644 1025
2350 1025 2565 3617 4138 9177 10148 16414 14911 7556 5427 1670 1219 2070 5358 10024 5028 8607
2334 8607 8539 4956 5219 1129 -3659 -1764 5183 11949 11842 8216 1670 1753 1589 -717 -2686 -2727 -4028
2317 -4028 -8089 -7917 -11360 -10981 -9942 -12285 -17646 -20707 -17927 -17289 -14477 -10588 -12849 -12194 -5570 -2225
2301 -2225 -3987 -12705 -7483 -7557 -11145 -14195 -12323 -15212 -7290 1843 -3976 -10323 -7581 -8098 -1442 3376
2285 3376 147 462 -2868 -8239 -9123 -4327 673 1577 -3182 -5947 2876 5484 5773 3817 47 2427
2269 2427 5763 15302 14388 15943 10791 2346 -8797 -8034 -2851 4347 6078 2493 -1188 9910 12630
2254 12630 7271 3220 4408 1066 -5678 -1347 1158 -6359 -6876 -7511 -6992 -8959 -5714 5832 6713
2239 6713 5103 2838 -338 -6008 -1748 1465 2162 3567 5921 5053 6857 10136 10626 2566 2630 2223
2223 2223 8190 10604 13306 10206 6323 2046 -2741 -8999 -7136 307 5556 6949 4677 1367 2678
2208 2678 -714 -102 4110 7504 7768 11863 15218 7701 5385 3300 9386 12996 10186 4856 5738 11866
2192 11866 12348 11757 11281 10477 12162 16996 13579 4866 -1832 -3471 -2398 -2088 -816 -4584 -5649 -10202
2176 -10202 -13609 -11483 -1655 7915 15930 9249 7434 14641 6517 -2662 -3061 1532 3651 8547 7309
2161 7309 925 -571 -3933 -6324 -3661 -1296 4618 5147 8488 9988 7492 7020 8244 3182 7259
2146 7259 9484 1778 -3464 4590 7881 2564 -1825 -5684 -8867 -8022 -1218 7613 12528 13633 8014
2131 8014 8729 6915 8925 8314 64 -3851 -3625 1605 2936 6573 5868 -4 -2927 -1040 -3830 -4728
2115 -4728 -4448 2065 -114 429 2564 11092 15766 9378 6243 5110 4151 -3528 -2855 2918 6499 5661
2099 5661 6154 7768 13621 16578 2314 -3313 963 -782 2257 6194 9933 2209 3274 4893 4618
2084 4618 6232 13401 10680 2008 362 388 -3819 2722 7305 6366 9074 5422 4564 1807 -1122 -3764
2068 -3764 -2450 -2107 -350 -643 -995 -3388 -5103 -7383 -4069 -1081 6211 4951 2001 -2007 -7438 -7644
2052 -7644 -680 -1524 -6950 -4068 -3589 -5298 -5948 -5949 -1220 4344 3325 -4110 -5682 -3083 -2097 463 6287
2035 6287 13081 15780 16245 15482 12167 10851 7729 8625 4387 -2440 -1838 998 6976 7958 4478 4834
2019 4834 819 -8161 -9574 -8750 929 4349 3693 2453 -1268 -695 5155 -4864 -4482 -933 -2415 2701
2003 2701 -299 -5716 2292 14078 10939 5930 7542 7137 4379 6140 -1282 -2359 -6480 -5426 -2486
1988 -2486 -7817 -8691 -6488 -2466 -888 6892 9227 4426 68 -1085 873 -361 3633 5421 5901
1973 5901 5624 1155 -3859 -6639 -6498 -9611 -8608 -2530 319 -1259 -768 2567 -7710 -2355 -3213 -3995
1957 -3995 -7484 -8974 -3614 -1898 -901 -8638 -14288 -18926 -12974 -8615 -3921 -5708 -13156 -11063 -3029
1942 -3029 2637 -4690 -9300 -4797 -6603 -9704 -5574 3310 7107 8638 8091 1449 -2805 2143 7055
1927 7055 12093 12142 7099 2680 4240 6701 -723 -9429 -4308 -3969 -7683 -3539 -4339 -3551 -3384 733
1911 733 -3594 -1865 -1599 826 1027 5715 4512 130 -180 -4748 -2820 -3762 -6626 -8395 1852 9289
1895 9289 3957 -1512 -2407 -854 337 -111 3477 4555 2521 -3833 -3119 2534 3744 4295 -848 -3663
1879 -3663 3153 10068 6250 2876 -6661 -7471 770 6917 4209 -1262 -6839 -2450 2140 3113 586
1864 586 437 2461 -464 972 10555 2241 4057 1337 -557 -5376 -16474 -12926 -3816 -2376 -2849
1849 -2849 -4342 -6337 -3836 -5216 -8556 -4598 -1466 -5093 -2535 4203 8121 8476 8522 5658 -1113 -1363
1833 -1363 -2322 -87 2481 3667 6055 9663 2506 3769 -2373 -7573 139 7105 10492 7212 8299
1818 8299 3053 1422 3436 -3637 -613 4273 -3996 -15481 -12635 -4365 3491 2110 3410 -2059 -6302
1803 -6302 -3599 -6861 -3909 1128 642 -1228 -1150 3710 6896 3546 688 6154 10109 9212 14299 10133
1787 10133 6904 1186 -2466 -9694 -14577 -17015 -8514 1112 -4023 -13615 -10814 -10506 -11205 -14563 -11753
1772 -11753 -5430 -5714 -6535 -1609 8972 6215 1293 -5 6801 9615 8913 -960 -5012 1650 7721
1757 7721 6556 3776 3117 4384 7973 989 -6032 2362 2624 1226 2129 2617 2660 -3028 -6625 -4847
1741 -4847 -2840 -5154 -4677 -3503 -1364 -10179 -12655 -13763 -12742 -6461 -6895 -1711 4066 4469 2138 -7529
1725 -7529 -10726 -8105 567 -6285 -14353 -13917 -5119 7502 13444 16771 6960 4989 11553 13569 10014
1710 10014 12101 2817 -7723 -5873 -8655 -5115 -4500 -3433 -1077 5118 7051 8272 12611 10051 6150
1695 6150 -6323 -10177 -4869 2362 13546 11649 1448 -2202 -1010 -235 -202 1130 7109 12397 10610
1680 10610 6953 7515 -74 -10644 -13136 -11652 -7725 -6437 -7872 -9302 -6993 -3320 -3555 -1383 -3412
1665 -3412 -1169 -3100 228 1405 344 -1491 -3417 -465 2947 12004 7537 -3450 -2594 5087 5331
1650 5331 2999 -619 -2151 2638 -1596 176 9556 8507 2490 25 2254 3749 3644 2985 -3171
1635 -3171 -5656 -1944 2622 -857 -936 920 5526 5532 2510 -1132 -1207 1645 -4942 -2320 -1429 1806 5422
1618 5422 4507 4967 -1121 -11968 -11195 -6495 -6025 1237 -1529 -1174 -2235 -8913 -12320 -12122 -3221 -276
1602 -276 -5807 -2521 1463 5524 217 -2884 -1207 -345 2389 8178 17143 17248 10617 8998 7060 7049
1586 7049 4174 -2215 -3065 5336 6883 6343 6424 7462 8565 11513 12598 7685 2027 -5470 -6826 -8063
1570 -8063 -5674 -1620 976 -1754 57 7298 12118 3700 -1471 -2268 -4476 -7080 2767 3194 -5994
1555 -5994 -7745 -10765 -9969 -11503 -11815 -9821 -8780 -156 7691 9199 6470 2774 -2391 660 5621
1540 5621 9834 10460 8199 4936 -823 -2370 -3022 -6594 -8384 -2546 5179 11676 9898 6864 2601
1525 2601 2117 4865 3506 4138 9296 8979 6481 -1273 -4591 -3111 -2167 4959 7845 1029 -2732 -617
1509 -617 -2958 -7366 -6827 -6905 -12605 -12204 -10806 -5928 1219 1220 -253 3022 7181 4415 -1200 -2913 -6607
1492 -6607 -1103 -2683 -732 2324 -1254 -6496 -3132 3756 9667 5191 1697 5679 2439 3373 6249
1477 6249 2886 -5067 -12000 -4726 8369 7089 3072 6256 10257 6445 5145 11653 8200 7335 9516
1462 9516 8895 4579 5404 1260 -2186 9535 12292 9274 5207 2222 -1507 4102 5543 428 -4173
1447 -4173 1702 1109 1358 4039 -446 -999 -1585 -4376 -3000 -5127 -14273 -12388 -8879 221 2555 -1629
1431 -1629 3278 5749 4851 3495 7504 8084 4685 9652 8623 12200 13052 11772 5459 -4730 -16435
1416 -16435 -16440 -11550 -6460 -5995 -11708 -12715 -14515 -12462 -9481 351 5621 7377 2915 -348 -2175 -7536
1400 -7536 -1853 1528 -552 104 -5039 -4604 -1237 4668 5453 11555 11429 -1577 -4369 -3753 -2198 6287
1384 6287 5666 797 -7542 -8098 161 271 689 -2696 -12744 -11516 -10892 -7060 -4230 -2122 6189 4475
1368 4475 6148 2706 2058 -5134 -5686 -2270 -618 4129 2408 3352 7590 6788 4721 10938 15854 9005
1352 9005 4521 2132 3617 8938 9017 7367 690 4258 5429 8001 11694 11700 9630 9825 2923 -5240
1336 -5240 -7908 -8492 -7950 -3071 -2802 -3195 -1094 -587 2344 359 -805 2000 5134 3302 3656 1219
1320 1219 -5165 -5889 -6639 -4387 3750 11425 10473 6976 -424 -11161 -10941 -3931 7866 2401 -2449
1305 -2449 218 7805 4513 331 4003 2310 4342 -2833 -7980 -7474 -5144 1552 1094 4945 7531
1290 7531 10272 995 -2386 5900 2431 986 -988 -6276 2449 840 1817 3673 11043 4591 -900
1275 -900 -2577 -3717 -3888 4534 4107 1499 513 7635 9988 8016 8271 4882 358 1602 7729 10614
1259 10614 5274 -2 -2051 -1896 -3156 -2166 1811 -2408 -7103 -4508 -854 -4294 291 1569 1426
1244 1426 2332 -63 -3586 1222 505 -5300 -4199 -1447 -2285 -1571 3296 4865 5331 391 -1832 -1872 -3435
1227 -3435 1042 3333 3596 5766 5297 4739 -57 -49 6452 5104 -1210 -8705 -9630 -6216 250 6424 6139
1210 6139 9297 3286 -290 3540 119 -3345 584 2425 113 3300 4921 7417 7024 5596 -3619
1195 -3619 -3020 -6376 -9816 -6306 -121 -2682 -2671 1573 11266 17036 18083 17764 14382 7005 1835 -2517
1179 -2517 -2783 -1696 -5016 -6569 -6554 -6446 -6257 -1664 -1188 -7332 -8601 -1943 2364 -532 -934 -1688 -1598
1162 -1598 -8210 -11002 -1633 8485 10185 7963 877 -3205 -536 5236 6833 5244 1536 835 -504
1147 -504 -2259 -1123 -1799 -410 1112 -1810 1700 5130 5129 2735 4685 7835 11375 11055 9008 4773
1131 4773 1176 1016 17155 17179 14159 10161 8844 2098 2185 407 3044 7236 6921 -308 -4895 -1833
1115 -1833 -3163 -4719 -1432 -5387 6117 7253 921 -975 4152 11533 14978 7690 5364 3207 2324
1100 2324 2255 -7122 -7281 -4445 -1345 -9148 -18461 -13774 -8081 -5852 784 -317 2458 -68 -7284 -15632
1084 -15632 -10498 -10965 -13431 -4183 2050 -2974 -1495 880 -2184 8678 8737 2604 -3554 -5058 -51
1069 -51 9364 2345 525 -1412 -2135 1526 1478 434 6279 12875 10249 6315 5313 2072 -2095 -1163
1053 -1163 -1000 7638 6750 4458 963 -2459 5382 8659 6640 -907 -10334 -14529 -17293 -12434 -9285
1038 -9285 -7052 -4109 54 4729 8768 4820 -162 -213 6027 4978 2721 2786 617 -2915 -4123 -5526
1022 -5526 -3438 -1270 306 -1263 -1514 7100 9064 7341 -476 -5625 -2803 -3946 -6017 -5184 4231
1007 4231 5517 5240 6686 11850 7804 7966 13507 12504 3956 7572 9370 2421 -1701 2921 3686 3858
991 3858 3057 5011 4595 928 1761 4089 6597 1228 -1071 4777 12730 18680 14647 8570 4246 -1067
975 -1067 1211 5442 -197 -3139 5924 8669 2620 1064 1725 4788 5173 -1308 -3676 3053 8033 8638
959 8638 9152 7578 12374 11747 1162 -6834 -11647 -8482 -2754 -1770 -3081 -7518 -9338 -5427 1202 8217
943 8217 15092 11722 6231 8744 12513 12929 6844 6878 6763 3579 -1594 -3169 5527 14378 9282 4747
927 4747 7319 10101 11787 13513 12918 8608 9559 8242 12207 11807 9245 4724 7848 13055 12314 6467
911 6467 -1378 -4823 -5839 -3780 -984 1121 -1132 -5016 -7806 -9220 -3910 1629 5677 6629 6678 4305
895 4305 2961 -2392 2077 7001 8814 8872 8494 9109 14105 9028 5385 8129 9326 4896 1312 568
879 568 2733 3406 8288 5830 -412 -1803 1668 3044 3589 -284 2099 508 1866 11675 9126 1605
863 1605 2080 3353 3627 5376 5997 9817 3992 501 901 9195 16566 12491 2298 2095 5155 6753
847 6753 12937 14159 15087 10713 -1016 1253 8059 8573 8232 7552 6001 -852 -613 -2257 -362 -1455
831 -1455 -1696 -679 4969 10916 13283 14924 10420 2806 180 3681 169 489 4198 2014 -5510 -388
815 -388 7684 8073 5216 9093 5768 5713 2137 6197 12042 10217 -639 68 8700 6098 7092 6000
799 6000 3509 1677 -4452 -6453 -693 2314 5493 12055 11549 8932 13641 11947 14131 17646 15805
784 15805 11623 11231 15857 16970 15873 17851 17056 14838 12763 5585 -3513 -1726 2533 -36 4727
769 4727 7470 3609 4464 6929 3138 1355 5259 1540 409 -2395 -3394 3705 8758 10949 10194 12436
753 12436 13212 11208 10071 9179 2222 1318 613 -2530 91 -4505 1219 5507 12023 16337 10925 4316
737 4316 -1329 -1235 -50 6577 12208 12498 7739 11417 18146 21037 17854 14801 6703 4917 6848 4040
721 4040 5507 8971 6276 -5174 -8396 -10268 -10215 -10967 -7767 4861 10194 10190 8247 1567 -1210 1942
705 1942 4539 7266 13746 22524 14334 11007 20718 12478 -1911 -1099 7385 6225 -1898 -2408 222
690 222 3895 9738 8079 7925 10061 11855 7801 3196 2122 4581 10193 17603 16589 16609 14716 18575
674 18575 15428 13451 13906 12227 6396 2304 12394 22209 19649 17183 12853 10230 16199 18874 19631
659 19631 14618 6789 11004 17501 18070 17642 11337 3299 -4372 984 1871 -2652 583 4502 4716 3252
643 3252 -3548 3238 13651 15746 8720 2326 -261 5261 12455 14296 14067 4442 -666 -261 -422 1212
627 1212 4098 7167 4248 7187 13041 12118 7430 4035 8483 12811 7813 1832 -1690 -1873 2425 5802
611 5802 5831 7254 9934 4782 1770 2521 2516 3030 3279 7854 9602 12808 10938 7407 13256 11733 11027
594 11027 2723 -6243 -6440 777 5203 9754 -818 -2818 2243 -1608 -3238 -2681 6718 7246 8630
579 8630 18703 19701 13546 8492 7367 6217 4931 6182 4264 4533 3133 2357 4815 12499 14552 14434
563 14434 18052 14924 11976 5153 1605 1460 251 109 -1239 1305 9341 11762 6085 8774 6292
548 6292 3947 7544 -492 -6202 -4959 -4329 0 7779 12362 12941 7925 5218 6454 5575 4320 4801
532 4801 7427 -826 -547 5868 7098 5906 1249 2638 509 509 136 3334 1353 440 4630 5376 8283
515 8283 4895 3482 415 676 8104 11176 5960 8314 6226 9090 9430 2891 3295 9497 9796 4728
499 4728 9818 7662 15613 16350 11086 11562 13479 7610 6166 11572 15867 8312 4718 9081 8810 1326
483 1326 6223 12004 5953 3379 9565 14888 9133 3745 4031 11304 14704 6402 8744 9918 7192
468 7192 12639 19254 19230 9848 11656 11618 7429 8394 6848 7177 3149 -2285 -6324 -5762 -3743 -3804 320
451 320 3262 4647 7642 4936 -182 2631 15666 16933 10787 5182 4869 6826 8037 6650 13321
436 13321 15631 13841 9320 8526 8375 13152 20553 21801 21496 21947 21327 17976 17771 16798 12765 13799 12603
419 12603 12498 7895 816 909 7725 4915 7849 1738 -3989 -334 6413 6781 5217 8549 9110 7793
403 7793 10534 8202 10689 17933 13691 4083 -1590 -1985 -1301 7137 4693 7354 14711 10846 11836 12166
387 12166 13084 19625 13344 7512 9874 10004 4857 7747 10401 5451 4313 4879 720 3280 10781 13936
371 13936 11377 16501 14055 16395 21376 20048 13994 3440 111 5050 7160 6198 3797 1890 2925
356 2925 5562 9229 17581 15144 15489 10075 10329 12204 7908 3211 5921 7737 6170 3904 3929 5276
340 5276 6875 11119 9469 5393 7100 14694 14164 16801 15650 12284 11289 8110 8039 4559 2692 5045
324 5045 3877 6892 14371 17556 11911 6135 9033 9648 7032 6006 5991 3661 4164 8242 12307 9797
308 9797 12164 14201 10225 10498 13475 11886 11450 12732 8390 1293 -1592 4534 6681 3042 31 3240
292 3240 6754 8450 12267 12592 10565 7875 -1286 419 -873 2742 7448 11558 7879 1982 -3492
277 -3492 -1586 6296 5618 8936 5261 5332 3444 5530 6669 4174 482 3027 4976 5776 9281 4184
261 4184 -761 3800 10753 14846 9051 12365 16196 14456 8095 6466 -1358 -3685 -1109 3624 6883
246 6883 7676 11228 11251 12641 12357 10031 5818 7879 7798 5715 6913 8029 5705 3611 5532 8990 4141
229 4141 1396 8407 14678 16103 14414 12546 11842 12971 11155 5742 6448 12058 17205 16082 9331 2904
213 2904 5835 10222 9643 7863 6206 7343 9245 10967 11555 11168 11155 6676 8108 8528 1609 -4739 -6363
196 -6363 -275 7855 10333 10324 12239 13849 12310 13187 12082 6624 5009 7097 5064 8857 7757 2581
180 2581 1791 1292 2986 7726 8763 10457 11308 4405 5920 10799 13776 14299 16036 11753 7735 7896
164 7896 4604 5258 9734 7553 6228 4966 4077 455 -1253 3768 9068 7939 3711 3880 9077 11409
148 11409 15073 17048 12382 7871 4306 1862 -833 -677 6285 8451 2509 8169 9518 9647 9088 9650
132 9650 7548 12219 14893 17752 18185 14132 19037 21629 22882 21924 15716 6619 1509 5709 5199 7555
116 7555 11512 11919 7620 9477 8809 5702 2628 2620 32 -863 670 1723 765 3784 5634 7333 13889
99 13889 13553 8235 11378 11329 5894 1193 1221 2779 2772 1850 3023 7907 13817 14627 18716 16847 21118 20684
81 20684 20506 20866 18800 13237 12883 9828 7105 3747 2432 6986 11932 13952 12003 9217 9171 14739
65 14739 9209 8088 7357 6870 11106 10907 11070 8930 6836 7899 7627 9210 11291 9035 4195 2399
49 2399 5705 8578 5832 4960 7910 9316 5105 3302 855 6377 14349 17248 11423 9874 8993 8557
33 8557 5336 2722 6624 13862 13480 15297 17836 16211 15116 11988 7853 7770 7209 7268 11541 14812 10884
16 10884 5347 6612 8685 8172 7061 8126 10803 7112 4020 4001 6786 10494 7198 4582 4703 2044
0 2044
$$ Imaginary data points
##PAGE= N=2
##DATA TABLE= (X++(I..I)), XYDATA
32767 37693 38746 34383 36414 38398 36740 38111 38615 36725 40196 39602 35094 35559 36902 39269 38085
32752 38085 41668 41252 40282 39884 37558 37252 43126 50126 48639 44998 46738 45299 49105 53785 53899 52438
32736 52438 54754 57095 56375 56019 52825 48611 53221 58322 56921 60062 56873 54714 48791 52530 52076
32721 52076 48657 47723 47751 49788 51332 54831 55128 54050 59688 64952 65602 65849 66090 67246 64842 63849
32705 63849 63839 57053 53929 60675 66368 65649 66222 65349 60035 62039 69962 70615 73479 76237 75517 74377
32689 74377 76348 75128 74595 76732 77971 80082 81341 77949 74537 76138 77075 74010 71803 71377 74528
32674 74528 76819 84499 87759 83650 78916 79541 78890 80400 83201 87942 89554 86888 86628 82753 82029
32659 82029 73690 71424 74520 79891 86294 91760 95021 97910 98770 97747 94809 93082 91821 89147 95362
32644 95362 98765 95496 90229 90275 89132 89184 88833 93225 94802 101891 110953 116829 115020 106343 97039 97618
32628 97618 101908 105649 102395 102126 103673 102763 99996 102567 107039 106701 105619 112060 114483 107949 103199
32613 103199 106298 105583 101961 104583 110694 112037 109401 108106 107834 107125 108670 110280 111435 117280 119315
32598 119315 115969 110102 111075 112109 113169 112483 111124 112003 107876 104615 109452 112213 112237 110205 106854
32583 106854 109500 113111 117093 119915 119543 120026 117508 118327 122942 125412 127052 134439 134916 130725 129592
32568 129592 131280 129610 130419 133784 130521 129446 127268 128937 132935 131152 135620 139950 137044 133025
32554 133025 134379 135153 134449 134766 132572 132852 132693 132075 137194 135678 131145 131744 134818 135984 138714 140881
32538 140881 132405 126830 131338 130513 132202 138030 137899 136143 136708 141391 143602 145671 146735 145943 143110
32523 143110 142411 140841 139950 139603 140436 141237 144930 144264 143373 150787 158073 156872 147064 143920 142332 145005
32507 145005 145258 145505 145411 144687 143318 140843 139229 139463 143043 142682 145108 144586 142091 148262 152511 152097
32491 152097 151735 148909 147443 152510 158144 157330 159025 157714 150192 149348 151630 158661 159208 161928 166305
32476 166305 168843 163035 158669 154596 156860 165311 167492 161091 156194 159785 165329 168138 161005 156531
32462 156531 152692 153434 151472 152875 152858 156899 165772 163687 162032 166855 162189 164209 166318 160325 161744
32447 161744 156179 155050 158700 157766 157505 155274 152884 157363 157520 160606 160926 156482 159481 160244 166482
32432 166482 169786 168379 168323 163419 164263 169958 172276 169160 175400 173295 168512 167576 163293 167813 168455
32417 168455 170332 165708 166422 171062 173176 171163 170443 176097 181058 178983 174322 171267 174518 183576 188589
32402 188589 183633 185252 189172 185271 184290 183679 174605 170847 169390 170005 167992 170731 170028 171790 177905
32387 177905 175299 175921 177159 173025 168658 171922 172861 171333 176281 180043 178440 178263 181874 188129 182427
32372 182427 180990 182094 184098 181091 180567 180311 181413 179983 175475 172056 173829 175078 176063 170106 173814
32357 173814 177570 181467 184683 179368 177385 181437 180259 173902 168605 166892 168226 175257 177020 179296
32343 179296 179117 182385 183530 186053 189273 178036 175784 182502 184979 192276 184923 176012 175186 174792 181108
32328 181108 181139 181555 180896 185573 189631 186053 187151 189788 190921 191597 199093 202359 199369 203710 206994
32313 206994 200692 197421 191994 189411 187771 197460 196867 193068 184105 177216 182984 182455 180326 178043 172268
32298 172268 176586 178865 178721 179776 183584 182734 185189 189878 196034 192237 185319 183290 186403 188442 188827
32283 188827 187977 184152 192002 203625 201343 197511 195422 198567 202044 196796 189646 189492 190186 198899 200620
32268 200620 200624 192879 189891 189710 191456 196390 194668 197525 202056 201089 198929 198971 200746 198458 196289 198386
32252 198386 203013 193541 191455 193186 192410 195459 198581 200702 200201 199759 193195 190587 197128 196812 194333
32237 194333 196012 193024 191389 192596 187422 189370 190961 193162 189915 185708 188868 195793 196616 192778
32223 192778 195458 205017 205147 203113 198346 194186 194738 189475 191653 189068 188922 190521 191550 194852 195928
32208 195928 198336 194535 192915 197528 194520 195877 196951 194982 188854 193854 195317 194073 196301 193452
32194 193452 190508 187813 189285 188129 183580 184198 194792 203638 200372 196676 196887 194781 190301 188818
32180 188818 187901 186468 191329 196762 202585 205626 200865 200216 198985 192789 181195 178939 184277 190653
32166 190653 191722 192342 198479 192952 193174 197493 197988 200103 200380 197091 194213 198540 205999 206291 208164
32151 208164 204538 204123 204699 209628 199671 194246 189834 191639 194657 197953 194746 191095 192499 193051 184889
32136 184889 183949 190320 199091 201870 201328 203408 195144 195511 199886 197366 199116 200116 199081 192982 184984
32121 184984 178929 180948 182461 190690 189072 186852 196156 197394 199395 201224 199526 196799 200443 199413
32107 199413 196613 203037 209731 212410 209290 208787 210136 208208 207522 206065 200205 198557 206042 204124 201985
32092 201985 205418 204105 199299 192223 190323 188709 191109 200923 203087 204051 198814 201920 204649 205326 197030
32077 197030 186805 183975 189996 193104 193437 193565 196304 198064 200885 194070 193713 196263 197575 204345 201360
32062 201360 191748 193467 197209 202662 205332 201668 187145 191528 197608 202858 203225 201096 203484 199010
32048 199010 199562 201928 203574 201954 195714 195131 199813 199126 201455 204951 194838 193905 197092 196712 196388
32033 196388 198466 199127 199643 201842 197923 194325 194445 194151 191186 195796 196895 193965 200810 200504 194992
32018 194992 197690 210406 208335 202418 195721 198473 208016 213569 207637 198914 200147 197711 199888 202476
32004 202476 198745 193879 192583 194348 194964 195474 194441 186473 183687 189209 197562 199977 198372 199778 197502
31989 197502 197133 196060 196399 198341 198649 197496 198834 197012 194117 189719 195098 198987 201645 211165 210080
$$ [...]
##END NTUPLES=NMR SPECTRUM
##END=
