##TITLE=Analysis number 320400
Compound Code gk 00438
Book Reference a
Project Code adrs
Chemist Name flurochem
##JCAMPDX= 6.0         $$ Bruker NMR JCAMP-DX V2.0
##DATA TYPE= NMR SPECTRUM
##DATA CLASS= NTUPLES
##ORIGIN= Bruker BioSpin GmbH
##OWNER= nmr
$$ XWIN-NMR		Version 3.5
$$ Fri Jun 23 08:48:17 2006 GMT Daylight Time (UT+1h)  MAYBRIDGE\nmr@NMR_250MHZ
##.OBSERVE FREQUENCY= 250.131544655141
##.OBSERVE NUCLEUS= ^1H
##.ACQUISITION MODE= SIMULTANEOUS (DQD)
##.ACQUISITION SCHEME= undefined
##.AVERAGES= 16
##.DIGITISER RES= 18
##SPECTROMETER/DATA SYSTEM= dpx250
##.PULSE SEQUENCE= zg30
##.SOLVENT NAME= CDCl3
##.SHIFT REFERENCE= (INTERNAL, CDCl3, 0, 16.522)
##AUDIT TRAIL= $$ (NUMBER, WHEN, WHO, WHERE, WHAT)
$$ ##TITLE= Audit trail, XWIN-NMR		Version 3.5
$$ ##JCAMPDX= 5.01
$$ ##ORIGIN= Bruker BioSpin GmbH
$$ ##OWNER= nmr
$$ C:\u/data/dgb/nmr/ADRS/1270/pdata/1/auditp.txt
$$ ##AUDIT TRAIL=  $$ (NUMBER, WHEN, WHO, WHERE, WHAT)
(   1,<2006-06-23 08:47:49.68 +100>,<MAYBRIDGE\nmr>,<NMR_250MHZ>,
      <created by zg, POWCHK disabled, PULCHK disabled
       configuration hash MD5:
       E2 DF 36 D8 04 B2 41 60 5A D7 A3 38 5A 4B D0 FE
       data hash MD5: 64K
       78 85 50 52 08 FB 83 A5 BE FF 1A DD 0F 79 97 8C>)
(   2,<2006-06-23 08:48:06.19 +100>,<MAYBRIDGE\nmr>,<NMR_250MHZ>,
      <Start of raw data processing
       ef LB = 0.3 FT_mod = 6 PKNL = 1 SI = 32K 
       data hash MD5: 32K
       43 6B 9D 56 36 E7 34 6C 06 3D BB 8C D7 8C 2D C8>)
(   3,<2006-06-23 08:48:07.68 +100>,<MAYBRIDGE\nmr>,<NMR_250MHZ>,
      <apk 
       data hash MD5: 32K
       07 10 D2 71 D3 C1 01 AB 5C 79 67 A5 25 6F 59 A0>)
(   4,<2006-06-23 08:48:08.47 +100>,<MAYBRIDGE\nmr>,<NMR_250MHZ>,
      <abs ABSG = 5 
       data hash MD5: 32K
       74 D1 3E 83 D9 E1 B8 1B 8A FE 87 33 E7 B6 E9 3C>)
$$ ##END=
$$ 
$$ hash MD5
$$ 56 48 A1 C6 79 2B 22 F7 D0 5C F5 0E CE 72 B0 24
##$RELAX= 
##$RELAX= 
##$RELAX= 
##$RELAX= 
##$RELAX= 
##$RELAX= 
##$RELAX= 
$$ Bruker specific parameters
$$ --------------------------
##$DU= <C:\u>
##$EXPNO= 1270
##$NAME= <ADRS>
##$PROCNO= 1
##$TYPE= <nmr>
##$USER= <dgb>
##$AMP= (0..31)
100 100 100 100 100 100 100 100 100 100 100 100 100 100 100 100 100 100 
100 100 100 100 100 100 100 100 100 100 100 100 100 100 
##$AQSEQ= 0
##$AQ_mod= 3
##$AUNM= <au_zg>
##$AUTOPOS= <3 >
##$BF1= 250.13
##$BF2= 250.13
##$BF3= 250.13
##$BF4= 250.13
##$BF5= 500.13
##$BF6= 500.13
##$BF7= 500.13
##$BF8= 500.13
##$BYTORDA= 1
##$CFDGTYP= 0
##$CFRGTYP= 5
##$CHEMSTR= <none>
##$CNST= (0..31)
1 1 145 1 1 1 1 1 1 1 1 1 1 1 1 1 1 1 1 1 1 1 1 1 1 1 1 1 1 1 1 1 
##$CPDPRG= <>
##$CPDPRG1= <>
##$CPDPRG2= <>
##$CPDPRG3= <>
##$CPDPRG4= <mlev>
##$CPDPRG5= <mlev>
##$CPDPRG6= <mlev>
##$CPDPRG7= <mlev>
##$CPDPRG8= <mlev>
##$CPDPRGB= <>
##$CPDPRGT= <>
##$D= (0..31)
0 1 0 0 0 0 0 0 0 0.06 0 0 0 0 0 0 0.0002 0 0 0 0 0 0 0 0 0 0 0 0 0 0 
0 
##$DATE= 1151048868
##$DBL= (0..7)
120 120 120 120 120 120 120 120 
##$DBP= (0..7)
150 150 150 150 150 150 150 150 
##$DBP07= 0
##$DBPNAM0= <>
##$DBPNAM1= <>
$$ [...]
##$SUBNAM7= <"">
##$SUBNAM8= <"">
##$SUBNAM9= <"">
##$SW= 20.6930455092707
##$SWIBOX= (0..15)
0 0 3 0 0 0 0 0 0 0 0 0 0 0 0 0 
##$SW_h= 5175.983436853
##$TD= 65536
##$TD0= 1
##$TE= 295.16
##$TE2= 300
##$TE3= 300
##$TEG= 300
##$TL= (0..7)
0 120 120 120 120 120 120 120 
##$TP= (0..7)
150 150 150 150 150 150 150 150 
##$TP07= 0
##$TPNAME0= <>
##$TPNAME1= <>
##$TPNAME2= <>
##$TPNAME3= <>
##$TPNAME4= <>
##$TPNAME5= <>
##$TPNAME6= <>
##$TPNAME7= <>
##$TPOAL= (0..7)
0.5 0.5 0.5 0.5 0.5 0.5 0.5 0.5 
##$TPOFFS= (0..7)
0 0 0 0 0 0 0 0 
##$TUNHIN= 0
##$TUNHOUT= 0
##$TUNXOUT= 0
##$USERA1= <user>
##$USERA2= <user>
##$USERA3= <user>
##$USERA4= <user>
##$USERA5= <user>
##$V9= 5
##$VALIST= <valist>
##$VCLIST= <CCCCCCCCCCCCCCC>
##$VD= 0
##$VDLIST= <DDDDDDDDDDDDDDD>
##$VPLIST= <PPPPPPPPPPPPPPP>
##$VTLIST= <TTTTTTTTTTTTTTT>
##$WBST= 1024
##$WBSW= 4
##$XGAIN= (0..3)
0 0 0 0 
##$XL= 0
##$YL= 0
##$YMAX_a= 405847
##$YMIN_a= -426106
##$ZGOPTNS= <>
##$ZL1= 120
##$ZL2= 120
##$ZL3= 120
##$ZL4= 120
##$ABSF1= 16.522
##$ABSF2= -4.171173
##$ABSG= 5
##$ABSL= 3
##$ALPHA= 0
##$AQORDER= 0
##$ASSFAC= 0
##$ASSFACI= 0
##$ASSFACX= 0
##$ASSWID= 0
##$AUNMP= <proc_1d>
##$AZFE= 0.1
##$AZFW= 0.1
##$BCFW= 0
##$BC_mod= 0
##$BYTORDP= 0
##$COROFFS= 0
##$CY= 12.5
##$DATMOD= 1
##$DC= 0
##$DFILT= <>
##$DTYPP= 0
##$F1P= 14.0000005364418
##$F2P= -0.99999901652339
##$FCOR= 0.5
##$FTSIZE= 32768
##$FT_mod= 6
##$GAMMA= 0
##$GB= 0
##$INTBC= 1
##$INTSCL= 1
##$ISEN= 128
##$LB= 0.3
##$LEV0= 0
##$LPBIN= 0
##$MAXI= 10000
##$MC2= 0
##$MEAN= 0
##$ME_mod= 0
##$MI= 0
##$NCOEF= 0
##$NC_proc= -2
##$NLEV= 6
##$NOISF1= 0
##$NOISF2= 0
##$NSP= 0
##$NTH_PI= 0
##$NZP= 0
##$OFFSET= 16.522
##$PC= 1
##$PHC0= 176.0877
##$PHC1= 4.327971
##$PH_mod= 1
##$PKNL= yes
##$PPARMOD= 0
##$PSCAL= 4
##$PSIGN= 0
##$REVERSE= no
##$SF= 250.13
##$SI= 32768
##$SIGF1= 0
##$SIGF2= 0
##$SINO= 400
##$SIOLD= 32768
##$SREGLST= <1H.CDCl3>
##$SSB= 0
##$STSI= 32768
##$STSR= 0
##$SW_p= 5175.98343685301
##$SYMM= 0
##$S_DEV= 0
##$TDeff= 65536
##$TDoff= 0
##$TI= <Analysis number 999999
Compound Code 99
Book Reference 9
Project Code 9>
##$TILT= no
##$TM1= 0
##$TM2= 0
##$TOPLEV= 0
##$USERP1= <user>
##$USERP2= <user>
##$USERP3= <user>
##$USERP4= <user>
##$USERP5= <user>
##$WDW= 1
##$XDIM= 32768
##$YMAX_p= 316581383
##$YMIN_p= -94384
$$ End of Bruker specific parameters
$$ ---------------------------------
##NTUPLES= NMR SPECTRUM
##VAR_NAME=  FREQUENCY,     SPECTRUM/REAL,   SPECTRUM/IMAG
##SYMBOL=    X,             R,               I
##VAR_TYPE=  INDEPENDENT,   DEPENDENT,       DEPENDENT
##VAR_FORM=  AFFN,          ASDF,            ASDF
##VAR_DIM=   32768,         32768,           32768
##UNITS=     HZ,            ARBITRARY UNITS, ARBITRARY UNITS
##FACTOR=    0.157963299565203, 1,           1
##FIRST=     4132.6476996994, 0,             0
##LAST=      -1043.33573715361, 0,           0
##MIN=       -1043.33573715361, -94384,      0
##MAX=       4132.6476996994, 316581383,     0
$$ Real data points
##PAGE= N=1
##DATA TABLE= (X++(R..R)), XYDATA
$$ [...]
19037E4596k592R385L8565J3983N082M788o0039m0509Q352Q069K324p324M022
$$ 54596 52004 61389 99954 113937 119019 123807 63768 23259 31611 39680 42004 34680 38702
19024C8702Q788j0134j1902q170n453j0145J177r300L538J1507K0213J2606M366
$$ 38702 47490 37356 25454 17284 11831 1686 2863 -6437 -2899 8608 28821 41427 45793
19011D5793j3040m065j0776l601J3652l564L415Q918J1787J0089o668k2353R420
$$ 45793 32753 28688 17912 14311 27963 24399 27814 36732 48519 58608 51940 29587 39007
18998C9007m2j0014k5331N332J8795o71j5129r736J4102P467K993J0040p87n202
$$ 39007 38965 28951 3620 8952 27747 27076 11947 2211 16313 23780 26773 36813 36026 30824
18984C0824r591J6248n897o693O306O791J1502n560j2558j8898j0817Q538K2756
$$ 30824 21233 37481 31584 24891 31197 37988 49490 43930 31372 12474 1657 10195 32951
18971C2951J467l4547k4349R574O175K7281q377J1129o57K4368K5341k939j595
$$ 32951 34418 -129 -24478 -14904 -8729 18552 10175 21304 20647 45015 70356 67417 65822
18958F5822J3045p852J3333K9557R917k0498k6839k2376j7176k321k1648n919
$$ 65822 78867 71015 84348 113905 123822 103324 76485 54109 36933 34612 12964 7045
18946G045K3551J4101L758J3001j0685j4128j0500j7298j1317M47J185R311K1648
$$ 7045 30596 44697 48455 61456 50771 36643 26143 8845 -2472 -2025 -840 8471 30119
18933C0119K9784Q551k3512l791J3601k1480M532K5073l209K1361K0463k759J8628
$$ 30119 59903 68454 44942 41151 54752 33272 37804 62877 59668 81029 101492 98733 117361
18920A17361n86l8125k1280j0860j3658k4644J8088K5602k3298l5675L461j46
$$ 117361 116775 78650 57370 46510 32852 8208 26296 51898 28600 -7075 -3614 -3760
18908c760m361j249K6080K3771J2304q011q736n523q189r19J2508K292P608J2220
$$ -3760 -8121 -9370 16710 40481 52785 44774 36038 30515 22326 21407 33915 36207 43815 56035
18894E6035l211j6323r923l036J82J8477n097l7154j4478N7O567R581J6031J1843
$$ 56035 52824 36501 26578 23542 23724 42201 37104 -50 -14528 -14471 -7904 1677 17708 29551
18880B9551Q825n63J182n837j8487q591n870P276K4354J4124Q450p284m099J7579
$$ 29551 38376 37813 38995 33158 14671 6080 210 7486 31840 45964 54414 47130 43031 60610
18866F0610m873o072m555O757J9478P171k1697j3918j983Q346L977j0537M0508
$$ 60610 55737 49665 45110 51867 71345 78516 56819 42901 40918 49264 53241 42704 83212
18853H3212R830l5077k0038J0894J0354K7017M679r069M900R690J4996L04p616
$$ 83212 93042 57965 37927 48821 59175 86192 90871 81802 86702 96392 111388 111692 104076
18840A04076Q330R489k4724r339j3426j8560N292j829K395J2855n156r414K162
$$ 104076 112406 121895 97171 87832 74406 55846 61138 59309 61704 74559 69403 59989 62151
18827F2151O558J8770L3244J1752R627L1671K5842K1258O360j2971k4007k5570
$$ 62151 68709 87479 120723 132475 142102 173773 199615 220873 227233 214262 190255 164685
18815A64685j5563L346K288K4466J9669K6629o68m233P686j2470k8919Q814P829
$$ 164685 149122 152468 154756 179222 198891 225520 224852 220619 228305 215835 186916 195730 203559
18802B03559l2931K682p91K3528L6042j599N265K7205J4665j6222k1410J689J7130
$$ 203559 170628 173310 172519 196047 232089 230490 235755 262960 277625 261403 239993 241682 258812
18789B58812K0915O4910M2787N8790N4902N6601N0770N1711K7322J4220M4932
$$ 258812 279727 344637 387424 446214 501116 557717 608487 660198 687520 701740 746672
18778G46672O9616R0358J12356J51129J93358J99060K10182K62592L32990N52406
$$ 746672 816288 906646 1019002 1170131 1363489 1562549 1772731 2035323 2368313 2920719
18768B920719R42829J564745K819850M754074N920506M594677L307614M316541
$$ 2920719 3863548 5428293 8248143 13002217 18922723 23517400 26825014 31141555
18760C1141555L251308J236088k848459j0934220p925935l788197j940657j136797
$$ 31141555 34392863 35628951 32780492 21846272 13920337 10132140 8191483 7054686
18752G054686p69735n65549m11914l30518k50857k69708k61000j21393l0761L7333
$$ 7054686 6284951 5719402 5307488 4976970 4726113 4456405 4195405 4074012 4043251 4080584
18742D080584J46122K08905K94656L53394M63169N67820P30140J109604J790571
$$ 4080584 4226706 4435611 4730267 5083661 5546830 6114650 6844790 7954394 9744965
18733I744965L150582N850297R645723J1518560Q613197O593456Q303905N638219
$$ 9744965 12895547 18745844 28391567 39910127 48523324 55116780 63420685 69058904
18725F9058904K031324p637845k1653356j4709805p185881l830575k414611j748286
$$ 69058904 71090228 63452383 41799027 27089222 19903341 16072766 13658155 11909869
18717A1909869j361647j050623q28137o53069o10984n44405m17346l23995k39590
$$ 11909869 10548222 9497599 8669462 8016393 7405409 6861004 6443658 6119663 5880073
18708E880073j68631q6292n8959n3059l6534n9014j35764k24093l06874k85076
$$ 5880073 5711442 5625150 5566191 5513132 5476598 5417584 5281820 5057727 4750853 4465777
18698D465777j96521j37829p3215r0132j28807r1480q7317q9735j05288j96130
$$ 4465777 4269256 4131427 4058212 3968080 3839273 3747793 3660476 3570741 3465453 3269323
18688C269323j78603j19561n8780n1422j9974j2547N158J3671P0544J28291J30960
$$ 3269323 3090720 2971159 2912379 2860957 2840983 2828436 2833594 2847265 2917809 3046100 3177060
18677C177060J43448J20786J15424J12649N5625R9333J79539L48051O44291R84663
$$ 3177060 3320508 3441294 3556718 3669367 3724992 3824325 4003864 4351915 4996206 5980869
18667E980869J481681K392168M205373P402221J0868695J0937468P245091P240973
$$ 5980869 7462550 9854718 14060091 21462312 32331007 43268475 50513566 57754539
18659E7754539Q212732M137045L48600j4533059k0519911j1392657n655610l123946
$$ 57754539 65967271 70104316 70452916 55919857 35399946 24007289 18351679 15227733
18651A5227733k028844j627190j278590r28769o82481m84602l47590k93596k65153
$$ 15227733 13198889 11571699 10293109 9364340 8681859 8197257 7849667 7556071 7290918
18642G290918k26952j59001j02701j16964j93364j66387J005J67877L43401O16771
$$ 7290918 7063966 6904965 6802264 6685300 6491936 6325549 6326554 6494431 6837832 7454603
18632G454603J123901K090218L828634N535337N254451L330483L651804L938759
$$ 7454603 8578504 10668722 14497356 20032693 25287144 28617627 32269431 36208190
18624C6208190J774268k48992q621072j0286974n368590k657044j554540j037169
$$ 36208190 37982458 37733466 29112394 18825420 13456830 10799786 9245246 8208077
18616H208077q31028o65789n09828l96718l02675k56615k50268k79398k16355
$$ 8208077 7377049 6711260 6201432 5804714 5502039 5245424 4995156 4715758 4499403
18607D499403j69524j49144j23995j53975j53748j05215j11873q4030r0496j22394
$$ 4499403 4329879 4180735 4056740 3902765 3749017 3643802 3531929 3447899 3357403 3235009
18597C235009j17290j02786p7620o1470q6826o9650k7143L155O942o1890n8090
$$ 3235009 3117719 3014933 2937313 2875843 2789017 2719367 2692224 2695379 2702321 2640431 2582341
18586B582341k4189k6788l9471j38282k25617j80635j21561o9157p7824n6024
$$ 2582341 2558152 2531364 2491893 2353611 2127994 1947359 1825798 1756641 1678817 1622793
18576A622793n3989l7564l2564l3634m5631n3496m9774l9900k0128k7907k1588
$$ 1622793 1568804 1531240 1498676 1465042 1419411 1365915 1316141 1276241 1256113 1228206 1206618
18565A206618k0610j9712j0327l566l4168o0718k5477l3809o8290m2333k9711
$$ 1206618 1186008 1166296 1155969 1152403 1118235 1057517 1032040 998231 929941 887608 857897
18554H57897O133r879j6747j4866n831k9446l7189j4016j4602j1630n841J0365
$$ 857897 864030 854151 837404 822538 816707 787261 750072 736056 721454 709824 703983 714348
18542G14348l9256l4224J4438j498j6498r428k5463m5509j7040N4J3502M206N578
$$ 714348 675092 640868 655306 653808 637310 627882 602419 556910 539870 539924 553426 557632 563210
18529E63210l826m4104m7698P270M886q815j944j0322j3847j2156j4325j4455
$$ 563210 559384 515280 467582 474852 479738 470923 468979 458657 444810 432654 418329 403874
18517D03874j7443k8861j2956n603J611q095k5009q359K359J165j9074j6339L4448
$$ 403874 386431 357570 344614 339011 340622 332527 307518 299159 301518 302683 283609 267270 301718
18504C01718J5039m205k5247O195n415q851J7429j3846j2921L768J4049m1091
$$ 301718 316757 312552 287305 293500 288085 279234 296663 282817 269896 273664 287713 246622
18492B46622k0516l138j3739j5781L478J8821n483k3373L929m142o967L789n143
$$ 246622 226106 222968 209229 193448 196926 215747 210264 186891 190820 186678 179711 183500 178357
18479A78357r444J0701O646J392J97k0154K908N243q131j0620L895J3216J6387
$$ 178357 168913 179614 186260 187652 187849 167695 170603 175846 167715 157095 160990 174206 190593
18466A90593K5695O713j4591K290j6819j1894k2566j4546L279R804j3770M507
$$ 190593 216288 223001 208410 210700 193881 181987 159421 144875 148154 157958 144188 148695
18454A48695J8515p366m125J0388N940j3773K340P665j4040k5580j1001J9385
$$ 148695 167210 159844 155719 166107 172047 158274 160614 168279 154239 128659 117658 137043
18442A37043J2641j026j0727k4375n632p050q399j2581R007K2718L8881J1189
$$ 137043 149684 148658 137931 113556 107924 100874 92475 79894 88901 111619 150500 161689
18430A61689J04l910l79j5671k8549l627M390k341k3685j0175J1459J7012K429
$$ 161689 161793 157883 157504 141833 113284 109657 114047 111706 88021 77846 89305 106317 108746
18417A08746K604k6043l23J2323J3833J1408o739k2277L41j2191K838P698J0770
$$ 108746 111350 85307 84984 97307 111140 122548 115809 93532 93873 81682 84520 92218 102988
18404A02988j441J6916O615l1570J650J8020l846j6177J5603Q857J7644J6862
$$ 102988 101547 118463 125078 93508 95158 113178 109332 93155 108758 117615 135259 152121
18392A52121j4945Q222M284j0290r565o275j6831p775k311M070K140K515j125
$$ 152121 137176 145398 149682 139392 129827 123552 106721 98946 96635 100705 102845 105360 104235
18379A04235j8594j7927K783j2959o984J8839Q894Q065q549r995J1401q983j4499
$$ 104235 85641 67714 70497 57538 50554 69393 78287 86352 77803 67808 79209 70226 55727
18366E5727q514J1534J8156J1259M810J5582K3917Q275J8169J3129r703p20J1674
$$ 55727 47213 58747 76903 88162 92972 108554 132471 140746 158915 172044 162341 161621 173295
18353A73295j8977l6067l3263n548k1496k7461n640K2292K7668q790k6591j1549
$$ 173295 154318 118251 84988 79440 57944 30483 24843 47135 74803 66013 39422 27873
18341B7873o454j0102L4560m561j9838O474K4344J7409k0967p295K3844N628l412
$$ 27873 21419 11317 45877 41316 21478 27952 52296 69705 48738 41443 65287 70915 67503
18328F7503O579J3300k1050k6075j4031k692J0621J1583p306J1684r619k1924
$$ 67503 74082 87382 66332 40257 26226 23534 34155 45738 38432 50116 40497 18573
18316A8573l754J0631k266l661o201j2850j1994p550J0569j0526L289O51n387
$$ 18573 14819 25450 23184 19523 13322 472 -11522 -19072 -8503 -19029 -15740 -15089 -20476
18303b0476P115L2000J4022Q303n062k2277j0488J7958R594j3254n741J0502J9843
$$ -20476 -13361 18639 32661 40964 35902 13625 3137 21095 30689 17435 11694 22196 42039
18290D2039O94j1342K3696K197J3539K287p381k2990k6109J4343J0963j8846R11
$$ 42039 42733 31391 55087 57284 70823 73110 65729 42739 16630 30973 41936 23090 24001
18277B4001J1100k6016q464o380m504q979j4815O158M885K8129Q547j0081J4105
$$ 24001 35101 9085 621 -5759 -10263 -19242 -34057 -27899 -23014 5115 13662 3581 17686
18264A7686J7559j4885k6393P94J1409K0354M333l606K2851K766R07k4610j2681
$$ 17686 35245 20360 -6033 -5239 6170 26524 30857 27251 50102 52868 53775 29165 16484
18251A6484K193L0969R77n754J0035j991q259j7676q333k362R585J3173J0359
$$ 16484 18677 49646 50623 44869 54904 52913 44654 26978 18645 16283 25868 39041 49400
18238D9400j240k1070j9627J1253R311o822q917N693M710J1110j2312J4405O992
$$ 49400 48160 27090 7463 18716 28027 21205 12288 17981 22691 33801 21489 35894 42886
18225D2886M613p208j5782Q750J0130p218j7191r653J2506J3137J0184J2139q870
$$ 42886 47499 40291 24509 33259 43389 36171 18980 9327 21833 34970 45154 57293 48423
18212D8423k0857j826j1566p752Q089J4290K3730j2500j8439p382J2253O882n905
$$ 48423 27566 25740 14174 6422 14511 28801 52531 40031 21592 14210 26463 33345 27440
18199B7440K9538J3109j6739Q10J8546L182l691J1592J5776N3243L2143L8427
$$ 27440 56978 70087 53348 54158 72704 75886 72195 83787 99563 152806 184949 223376
18187B23376L9804K0263N811R717j0460l0312n4420n0493m5810k6503j85J2167
$$ 223376 263180 283443 289254 298971 288511 258199 203779 153286 107476 80973 80788 92955
18175I2955P234j7936k6650Q66J5784O697q423l6299J6952K2906k283k3618L9
$$ 92955 100189 82253 55603 56469 72253 78950 70527 34228 51180 74086 71803 48185 48224
18162D8224M786J7459K252K1764K1792K7497j009K1819N6981M6840K4204K1530
$$ 48224 53010 70469 72721 94485 116277 143774 142765 164584 221565 268405 292609 314139
18150C14139J1950L0170j1835p1984p5091l7350j0140p885Q155K7696L3922r968
$$ 314139 326089 356259 344424 272440 197349 159999 149859 141974 150129 177825 211747 201779
18138B01779q911R7J2619M92K0160N0374M3192K7337N674j1227j6154K1132M7425
$$ 201779 192868 192965 205584 206076 226236 276610 319802 347139 352813 341586 325432 346564 393989
18125C93989L1452N1261N0949P7897J01847J27352K13180L10310M74734P42223
$$ 393989 425441 476702 527651 605548 707395 834747 1047927 1358237 1832971 2575194
18115B575194J286219K294919L622074M043955K828514K465609L011897J734354
$$ 2575194 3861413 6156332 9778406 13822361 16650875 19116484 22128381 23862735
18107B3862735N31702l964479p668648m570962k184817j171626p30268n39626
$$ 23862735 24394437 20429958 12761310 8190348 6005531 4833905 4103637 3564011
18099C564011m02997l31551k78824k21269j92096j48666j27766j28502j01824
$$ 3564011 3161014 2829463 2550639 2329370 2137274 1988608 1860842 1732340 1630516
18090A630516o6913m5629l3758l0248n3367m6519l6414m6312k9574m0263o4742
$$ 1630516 1563603 1517974 1484216 1453968 1400601 1354082 1317668 1271356 1241782 1201519 1136777
18079A136777p0422p6908l9989m8422n6614m1325m0299l5273J571N504k8651m0145
$$ 1136777 1066355 989447 949458 901036 844422 803097 762798 727525 729096 734600 705949 665804
18067F65804m6843j111J3014M163k4479k7768k0055Q820j4912M684J3665K9627
$$ 665804 618961 617850 630864 635027 610548 582780 562725 571545 556633 561317 574982 604609
18055F04609L6673L8156L6626J9835O115m0122q3629o7773m1705n3541n3720j9270
$$ 604609 641282 679438 716064 735899 742014 701892 618263 550490 508785 455244 401524 382254
18043C82254q930j3816j8204J3789l041l6626j1499j3142n974k2196j3173K3166
$$ 382254 373324 359508 341304 355093 352052 315426 303927 290785 284811 262615 249442 272608
18031B72608j0546j2533J3844o713J229K0311L4500K0990N990L2307L8974J9650
$$ 272608 262062 249529 263373 256660 257889 278200 312700 333690 339680 371987 410961 430611
18019D30611J8909K0739p000m9199q0491m2666j4754k9396k7681o045j475r969
$$ 430611 449520 470259 463259 414060 333569 290903 276149 246753 219072 213027 211552 201583
18007B01583k2904m3173K358J1133Q384K0395j4606K599M277k2793j2921K5020
$$ 201583 178679 135506 137864 148997 157381 177776 163170 165769 170046 147253 134332 159352
17995A59352p783j5505o655j778j1599K603J2235r022k3109O701N139N598k0158
$$ 159352 151569 136064 129409 127631 116032 118635 130870 121848 98739 105440 110579 116177 96019
17982I6019R75l362J6696Q581L474o437k141k579n731m596n716q96J2470j0753
$$ 96019 96994 93632 110328 118909 122383 115946 113805 111226 105495 100899 95183 94287 106757 96004
17968I6004q64J4256P006k0812k1517q17J4019P141j4391k9605j1643o441L405
$$ 96004 95140 109396 116402 95590 74073 73256 87275 94416 80025 50420 38777 32336 35741
17955C5741J2357J7734r196m881j0641j2250m289J6641O059k1930J4681r547J602
$$ 35741 48098 65832 56636 51755 41114 28864 24575 41216 47275 25345 40026 30479 32081
17942C2081p379n663j442O811l398j8610M981R041O87J6538J2556j2259j4157
$$ 32081 24702 19039 17597 24408 21010 2400 7381 16422 17109 33647 46203 33944 19787
17929A9787j222J2010J1991K3018J7540j5890l5426j3459J3111J461n904n386
$$ 19787 18565 30575 42566 65584 83124 67234 31808 18349 31460 32921 27017 21631
17917B1631K749r212r963Q907P199q230j7706q720J0399J1873J4013K6867m055
$$ 21631 24380 15168 5205 14112 21311 13081 -4625 -13345 -2946 8927 22940 49807 45752
17904D5752N519J199j1771O420k385O437q904k548M726J0988l2161p301J2398
$$ 45752 51271 52470 40699 47119 44734 51171 42267 39719 44445 55433 23272 15971 28369
17891B8369j554L679j0899k3985O96l639K8199R209j960j9754J5362J4922L794
$$ 28369 26815 30494 19595 -4390 -3694 -7333 20866 30075 28115 8361 23723 38645 42439
17878D2439j0044r561q588j5803j7802P552J2478R241k127r665O194r283J885
$$ 42439 32395 22834 14246 -1557 -19359 -11807 671 9912 7785 -1880 4314 -4969 -3084
17865c084l85j8935n900O136J1727L3088l399R479l228P01J8871L982j9709k551
$$ -3084 -3469 -22404 -28304 -22168 -10441 22647 19248 28727 25499 26200 45071 49053 29344 26793
17851B6793j5994J9364r681l699j7946o5408m990M3040J0952L780K1372J8848
$$ 26793 10799 30163 20482 16783 -1163 -66571 -71561 -28521 -17569 -13789 7583 26431
17839B6431K14j8191q683q830j7400l878J2500O191J1510J2783J5315M27p298
$$ 26431 26645 8454 -229 -9059 -26459 -30337 -17837 -11646 -136 12647 27962 28389 21091
17826B1091j3943o656J366j36r594k210l142J1430N239J0545R489o4O282O544
$$ 21091 7148 492 1858 1722 -7872 -10082 -13224 -1794 3445 13990 23479 23415 29697 36241
17812C6241k0211j2898J582K1514L2816n384k2049r256L587K738L223K964J5662
$$ 36241 16030 3132 4714 26228 59044 53660 31611 22355 25942 28680 31903 34867 50529
17799E0529k044j8396l0229r705J2253o778M058M74K1152J8488r741j9263R028
$$ 50529 48485 30089 -140 -9845 2408 -4370 -312 162 21314 39802 30061 10798 19826
17786A9826j437l397J4317o314m145K3891J7990j1413l1846k1441k2055n278N49
$$ 19826 18389 14992 29309 22995 18850 42741 60731 49318 17472 -3969 -26024 -31302 -30753
17773c0753l800K5363J2199q30J156J5822l191n544j8709K193J3104J8705J9183
$$ -30753 -34553 -9190 3009 2179 3335 19157 15966 10422 -8287 -6094 7010 25715 44898
17760D4898j34j0024k527N330M584M154k1245l666J2879k9891k294l800J0413
$$ 44898 44764 34740 32213 37543 42127 46281 25036 21370 34249 4358 2064 -1736 8677
17747H677j3606L081J4783K4752J3169l425q209L2155J5206l8127k5436J162O807
$$ 8677 -4929 -1848 12935 37687 50856 47431 39222 71377 86583 48456 23020 24182 30989
17734C0989J4081J8282k0356k2659o76P740n337J9898K0226j4961n2808j1192
$$ 30989 45070 63352 42996 20337 19661 27401 22064 41962 62188 47227 -5581 -16773
17722a6773J5379K5815R279J976j308k5610j0187N973J9163M510q216J0302K92
$$ -16773 -1394 24421 33700 35676 34368 8758 -1429 4544 23707 28217 20001 30303 30595
17709C0595J0591J5638L865j2334p529R194J1106j2819k3148j4126N606K225Q153
$$ 30595 41186 56824 60689 48355 40826 50020 61126 48307 25159 11033 16639 18864 27017
17696B7017P633M232J2057r205k0863j3666M932j0079n06J4112p57p358l35M321
$$ 27017 34650 38882 50939 41734 20871 7205 12137 2058 1552 15664 14907 7549 7214 11535
17682A1535j1796N32q557K1690j15J1300J086l3020N025N261k5495j5931K4714
$$ 11535 -261 271 -8286 13404 13289 24589 25675 -7345 -2320 2941 -22554 -38485 -13771
17669a3771J03q260K8438J9536k1127j1910j4988N216J2996j75Q840K139O313
$$ -13771 -13668 -21928 6510 26046 4919 -6991 -21979 -16763 -3767 -3942 4898 7037 13350
17656A3350j375q819J212r303Q285K401n02j9380K461J1347L584k4280J9490J0231
$$ 13350 11975 3156 4368 -4935 3350 5751 5249 -14131 -11670 -323 3261 -21019 -1529 8702
17642H702M783l238j9231k215j53l542q977J0784K4051k474O310K2492N976k3732
$$ 8702 13485 10247 -8984 -11199 -11352 -14894 -23871 -13087 10964 8490 14800 37292 43268 19536
17628A9536j7606k893P172p25j5688j0824o788J053q478q189J9716J3860R128
$$ 19536 1930 -963 6209 5484 -10204 -21028 -27816 -26763 -35241 -43430 -23714 -9854 -726
17615g26Q598k001j2221J6258P866j415N519k22l1645q073J7856j0191k2474J4423
$$ -726 7872 5871 -6350 9908 17774 16359 21878 21656 -9989 -18062 -206 -10397 -32871 -18448
17601a8448N764l1599J5678K0408j2333j0183L2171J1197m535K2155J1273j6439
$$ -18448 -12684 -44283 -28605 -8197 -20530 -30713 1458 12655 8120 30275 41548 25109
17589B5109r392n298l6640J0677q634J1850j4458q59M514Q557J2623r297r693
$$ 25109 15717 10419 -26221 -15544 -24178 -12328 -26786 -27645 -23131 -14574 -1951 -11248 -20941
17576b0941J0485o13J2932j4872J683J2899O256R060k8228k1436j7619J4783N19
$$ -20941 -10456 -11069 1863 -13009 -11326 1573 7829 16889 -11339 -32775 -50394 -35611 -35092
17563c5092R296K224J4229P905j375J3342J9452J5267l0421n123J2850J6532l2911
$$ -35092 -25796 -23572 -9343 -1438 -2813 10529 29981 45248 14827 9704 22554 39086 6175
17550F175q503K3182J29N672j2289k3061l100l406k7411k9526K7993K6221J8314
$$ 6175 -2328 20854 20983 26655 14366 -8695 -11795 -15201 -42612 -72138 -44145 -17924 390
17537C90p569p915r799j730k924J0099K1752J2741r889j1446P697K4742J5489
$$ 390 -7179 -15094 -24893 -26623 -29547 -19448 2304 15045 5156 -6290 1407 26149 41638
17524D1638r01j5008M816j449j1931j7455j2634J0111O603j249o254j1047J6116
$$ 41638 40737 25729 30545 29096 17165 -290 -12924 -2813 3790 2541 -3713 -14760 1356
17511A356N078J6484r36n745J5972j413m314k4626K945J6438N251J6633p230j4752
$$ 1356 6434 22918 21982 16237 32209 30796 26482 1856 4801 21239 26490 43123 35893 21141
17497B1141p861p46o008J0182m869j5390K655L2348J1231p314n66K788r204r311
$$ 21141 13280 12534 6526 16708 11839 -3551 -896 31452 42683 35369 34803 37591 28387 19076
17483A9076j1610L2761J1160k5644k3970J3058J7585k3379k4571K3391q6m630
$$ 19076 7466 40227 51387 25743 1773 14831 32416 9037 -15534 7857 7771 3141
17471C141J2190R588l683k0785j3639k439J2724l088j5699K586K611K796m123
$$ 3141 15331 24919 21236 451 -13188 -15627 -2903 -5991 -21690 -19104 -16493 -13697 -17820
17458a7820m37k310O408N675J489l304n032n97K6991K4024K24J8294K2549K2337
$$ -17820 -18257 -20567 -14159 -8484 -6995 -10299 -15331 -15928 11063 35087 35311 53605 76154 98491
17444I8491K6121J1758r369j6242p244k4202k3921k2024j4361j7234K537J8964
$$ 98491 124612 136370 127001 110759 103515 79313 55392 33368 19007 1773 4310 23274
17432B3274L2294p74k422k4441k8922k5019L772Q452K4077J3450k1112J250K366
$$ 23274 55568 54794 52372 27931 -991 -26010 -22238 -13786 10291 23741 2629 3879 6245
17419F245K941r592j4611Q132J4641l644r623j4279J0832J1076j9183J1474J8974
$$ 6245 9186 -406 -15017 -6885 7756 4112 -5511 -19790 -8958 2118 -17065 -5591 13383
17406A3383M910J811o966Q26o883k706j4535R566j999l266J0992L123l018R09
$$ 13383 18293 20104 13138 13964 7081 4375 -10160 -594 -2593 -5859 5133 8256 5238 6147
17392F147K0886J1552o77k8512N432k137m820L304J1530q795r785O466R259O048
$$ 6147 27033 38585 37908 9396 14828 12691 7871 11175 22705 13910 4125 10591 19850 25898
17378B5898o721j5286l378j6843k729J6012J1027r868J1958J8391J351j3542j1916
$$ 25898 19177 3891 513 -16330 -19059 -3047 7980 -1888 10070 28461 29812 16270 4354
17365D354j7041j227J5663R014j2431n497R85J9300J591j3899N749J2956j7509
$$ 4354 -12687 -13914 1749 10763 -1668 -7165 -6180 13120 14711 812 6561 19517 2008
17352B008j7078R304J3911n498J8374n033K564k173m08q832M035L4487L158j6416
$$ 2008 -15070 -5766 8145 2647 21021 15988 18552 16379 15971 7139 11174 45661 48819 32403
17338C2403k241j2089N400L2560J4980l259k6143k3077k0492j8470L539K9524
$$ 32403 30162 18073 23473 56033 71013 67754 41611 18534 -1958 -20428 -16889 12635
17326A2635P678k5790o072l05p348N377J2642r709R743J2315J5636Q981j1086
$$ 12635 20313 -5477 -11549 -11854 -19202 -13825 -1183 -10892 -1149 11166 26802 35783 24697
17313B4697l6902q620K267J4803J273J5428r97P150k2558J1203M513j449j0460
$$ 24697 -12205 -20825 -18558 -3755 -2482 12946 11949 19099 -3459 7744 12257 10808 348
17300C48k6714p976L4388K7052N268l315P948k392Q429j6062O258k145p317r163
$$ 348 -26366 -34342 46 27098 32366 29051 36999 34607 43036 26974 33232 31087 23770 14607
17286A4607j6847J0358K177P210P052j6349j4622j0332P212j4819J8863N291R071
$$ 14607 -2240 8118 10295 17505 24557 8208 -6414 -16746 -9534 -24353 -5490 -199 8872
17273H872j13j2543k4373j1682k8K5048J6995q707p035j1832J027M172J106P857
$$ 8872 8759 -3784 -28157 -39839 -39867 -14819 2176 -6531 -13566 -25398 -24371 -20199 -19093 -11236
17259a1236J0267P732j4935k0325l101J1925N379j1348k86K06L272J4106K513
$$ -11236 -969 6763 -8172 -28497 -31598 -19673 -14294 -25642 -25928 -25722 -22450 -8344 -5831
17246e831j546P496K2195L444q026j3746j4085j3675k2347j3561P937J6916J7932
$$ -5831 -7377 119 22314 25758 17732 3986 -10099 -23774 -46121 -59682 -51745 -34829 -16897
17233a6897N589J6184N775j6014l518K003L912J3993O404P423M650J0291M381
$$ -16897 -11308 4876 10651 -5363 -8881 -6878 -2966 11027 17431 24854 29504 39795 44176
17220D4176j3122O100j2673k2366q638j4566K108J1685J1374j5316n634J2539
$$ 44176 31054 37154 24481 2115 -6523 -21089 -18981 -7296 4078 -11238 -16872 -4333
17208d333J1811J2063j205M50j2842j4426J556J5460j4588k2845J2798L339J0910
$$ -4333 7478 19541 18336 18786 5944 -8482 -6926 8534 -6054 -28899 -16101 -12762 -1852
17195a852J9034l962N452N673k5907p255l414M57j8982j8079Q259J0006R018J8834
$$ -1852 17182 13220 18672 24345 -1562 -8817 -12231 -11774 -30756 -48835 -40576 -30570 -21552 -2718
17181b718J3496o791k0534N336O649R88Q871K782p627k189l858j1278M043K3540
$$ -2718 10778 3987 -16547 -11211 -4562 -3574 5297 8079 452 -1737 -5595 -16873 -12830 10710
17167A0710J5138n956M778Q598k3298l4733J0054J6384k7425q171J0661J7753
$$ 10710 25848 19892 24670 33268 9970 -24763 -14709 1675 -25750 -33921 -23260 -5507
17155e507J5153j2431R868m614j235J8685j0429j7812Q48O455N767J5050J0457
$$ -5507 9646 -2785 7083 2469 1234 19919 9490 -8322 -7474 -1019 4748 19798 30255
17142C0255j8719j8959r806J2767L229N648L8634q522k0168J383R185o751j014
$$ 30255 11536 -7423 -17229 -4462 -1233 4415 43049 34527 14359 15742 24927 18176 17162
17129A7162k537r637J2083O728k0946M500O043Q579J0064n828j1200j9367J0244
$$ 17162 14625 4988 17071 23799 2853 7353 13396 21975 32039 26211 15011 -4356 5888
17116E888q183j1693K1022Q116q158j0093r868j176J6807R7j1792P491j4401J3568
$$ 5888 -2295 -13988 7034 15150 6992 -3101 -12969 -14145 2662 2759 -9033 -1542 -15943 -2375
17102b375K9251r905k6491n03O599p756j4827Q99O752J0374O658J1137K7858L2903
$$ -2375 26876 16971 -9520 -10023 -3424 -11180 -26007 -25108 -18356 -7982 -1324 9813 37671 70574
17088G0574k559l1021o500J900Q148M909j0357p782l3982j9268K7336J7866j0720
$$ 70574 68015 36994 30494 32394 40542 45451 35094 27312 -6670 -25938 1398 19264 8544
17075H544K0091n092r444K4107k2806k8628L222r14J214Q446Q50P09p647l054
$$ 8544 28635 23543 14099 38206 15400 -13228 -10006 -10920 -9706 -1260 -410 299 -7348 -10402
17061a0402K338O577j4771k4970j4274K5188J2144J1800N190L35k2278l192K4474
$$ -10402 -8064 -1487 -16258 -41228 -55502 -30314 -18170 -6370 -1180 -845 -23123 -26315 -1841
17048a841R10J0623Q439j4701J78j4058r612N226K6054P496n661k1772n899j976
$$ -1841 -931 9692 18131 3430 3608 -10450 -20062 -14836 11218 18714 13053 -8719 -14618 -16594
17034a6594j0665J5189J8326m498N367j3153j2789O751K5053P993J3137p865o215
$$ -16594 -27259 -12070 6256 1758 7125 -6028 -18817 -12066 12987 20980 34117 26252 20037
17021B0037j2918m212j604P7l2876j0407j107Q390K4239O708j226n733M944P842
$$ 20037 7119 2907 1303 1380 -31496 -41903 -43010 -34620 -10381 -3673 -4899 -10632 -5688 2154
17007B154P427k8529q728j5590R394n794L713m250L415K1087J4664J4117P010
$$ 2154 9581 -18948 -27676 -43266 -33872 -39666 -35953 -40203 -36788 -15701 -1037 13080 20090
16994B0090O52j7144q090J5048j6984n266j1226J1311K6145J0671q174j0289l817
$$ 20090 20742 3598 -4492 10556 -6428 -11694 -22920 -11609 14536 25207 17033 6744 2927
16981B927q838R304J1423M602k0200P572J2348j1640k1340k758P421m772J5617
$$ 2927 -5911 3393 14816 19418 -782 6790 19138 7498 -13842 -16600 -9179 -13951 1666
16968A666R755j3327O106P700J0361l774j751O178j2141j8506M520j0617J149
$$ 1666 11421 -1906 4200 11900 22261 18487 16736 22914 10773 -7733 -3213 -13830 -12681
16955a2681p879k1P53j3126J51J6418J5140R32j3160J6515J0021j8691k179N921
$$ -12681 -20560 -20581 -19828 -32954 -32803 -16385 -1245 -313 -13473 3042 13063 -5628 -7807 -1886
16941a886K4518j034k9931R07K9888M29j5397q588k8438P885J7814K631K3431
$$ -1886 22632 21598 -8333 -7426 22462 22891 7494 -1094 -29532 -21647 -3833 -1202 22229
16928B2229K3115j489j9234L27j0316p186n675J5506J8872k4175n0053n780J8536
$$ 22229 45344 43855 24621 24948 14632 7446 1771 17277 36149 11974 -38079 -43859 -25323
16915b5323R105M69J4050n226R292K5985j0700K991j978j3844j8829o443J2432
$$ -25323 -16218 -15749 -1699 -6925 2367 28352 17652 20643 18665 4821 -14008 -20451 -8019
16902h019j627k4097l142J0465R684O915J258N48J408l039q963J3257J1317l358
$$ -8019 -9646 -33743 -36885 -26420 -16736 -9821 -8563 -8015 -6607 -9646 -18609 -5352 5965 2607
16888B607m848j366j7489J1069N676J0922o520m270q711k1352J1079J9256p610
$$ 2607 -2241 -3607 -21096 -10027 -4351 6571 51 -4219 -12930 -34282 -23203 -3947 -11557
16875a1557J591j610M319J5601J1716L020k9890j7995K1599q298J5163N364k1283
$$ -11557 -9966 -11576 -7257 8344 20060 23080 -6810 -24805 -3206 -11504 3659 9023 -12260
16862a2260J3175L684p590n212J2095J6238l012j545K343k2999j7675p450j641
$$ -12260 915 4599 -2991 -8203 3892 20130 17118 15573 17916 -5083 -22758 -30208 -31849
16849c1849j8834j6986K9552K4501Q316J2468L829j1856l325k957L37M262O80
$$ -31849 -50683 -67669 -38117 -13616 -5300 7168 10997 -859 -4184 -7141 -6804 -2542 -1862
16836a862O049O644O303k1415K23j664p614L064N306k491J160J1153o795j2785
$$ -1862 4187 10831 17134 -4281 -4058 -5722 -13336 -10272 -4966 -7457 -6297 4856 -1939 -14724
16822a4724J192K1233q359J1720p626j6914o482L300J840J7055J2984J1094j0296
$$ -14724 -13532 7701 -658 11062 3436 -13478 -19960 -16660 -14820 2235 15219 26313 16017
16809A6017j1548m112M128J4052q566j8346p957p969N776L1772M314k799j5720
$$ 16017 4469 357 4485 18537 9971 -8375 -16332 -24301 -18525 13247 17561 14762 -958
16796i58k4154J022M158J7546L618j2423J1590O385k2782J49J1646J5515J6998
$$ -958 -25112 -24090 -19932 -2386 1232 -11191 399 6784 -15998 -15849 -4203 11312 28310
16783B8310r968k4150j9061L660J2206Q603O457j5720j3804J6590L3550n886p399
$$ 28310 18342 -5808 -24869 -21209 -9003 -400 6057 -9663 -23467 -6877 26673 20787 13388
16770A3388j165M816K5304k822j4465l4693k9720o708J8534P370Q507L108k638
$$ 13388 12223 17039 42343 39521 25056 -9637 -39357 -46065 -27531 -20161 -11654 -8546 -11184
16757a1184K0263Q89N183J1724n216j4052n703k2221k0282M515J0568K7224O496
$$ -11184 9079 9968 15151 26875 21659 7607 1904 -20317 -40599 -36084 -25516 1708 8204
16744H204j2086J4331J1230l4314j4756L7392j4041m517N481k618L712k204P122
$$ 8204 -3882 10449 21679 -12635 -27391 10001 -4040 -8557 -3076 -5694 -1982 -4186 2936
16731B936J4286n021l478k0717k364P627J8245J27j87j3778Q826k4239k037J3902
$$ 2936 17222 12201 8723 -11994 -14358 -6731 11514 11641 11454 -2324 6502 -17737 -19774 -5872
16717e872j3974j1526O654K1207J1595q710j7886j0075Q793L901J5551k816L4733
$$ -5872 -19846 -31372 -24718 -3511 8084 -626 -18512 -28587 -19794 -15893 -342 -3158 31575
16704C1575R804j5024k4148k6128J1709m219j6106P04L2087L0815l1118j0480
$$ 31575 41379 26355 2207 -23921 -12212 -16431 -32537 -31833 254 31069 -49 -10529
16692a0529n399k0749j2392K3459J2645k465o385J0933J4470R86q697L680K8280
$$ -10529 -15928 -36677 -49069 -25610 -12965 -15430 -21815 -10882 3588 4574 -4123 -443 27837
16679B7837m035j5642m340j354N250j1855J0032L28L132J9385r989o470n776P156
$$ 27837 23802 8160 3820 2466 7716 -4139 5893 6221 9353 28738 18749 12279 6503 13659
16665A3659j0610k1324K800R371J3442J3591m517l571k7899J9914J2321j6546
$$ 13659 3049 -18275 -15475 -6104 7338 20929 16412 12841 -15058 4856 17177 631
16653F31p413J786j0882o532o265m746P232O78o719L4886R850j6932J3123j568
$$ 631 -6782 -4996 -15878 -22410 -28675 -33421 -26189 -25511 -32230 2656 12506 -4426 8697 7129
16639G129r312j979O031k1050R76J5221Q390j1781q114K27J0019M015K985J818
$$ 7129 -2183 -4162 1869 -19181 -18205 -2984 5406 -6375 -14489 -14262 -4243 -228 2757 4575
16625D575K776J394j2097P236j2479n419J6263m793k2860n071J5665j993k051
$$ 4575 7351 8745 -3352 3884 -8595 -14014 2249 -2544 -25404 -30475 -14810 -16803 -18854
16612a8854k1057J2630L177k6478m764K0810J7939K880j31k5419K9J3445K0928
$$ -18854 -39911 -27281 -24104 -50582 -55346 -34536 -16597 -13717 -13848 -39267 -39238 -25793 -4865
16599d865j588J3788p150j4880m551R986J5350m034l965m275J4381K031l542j2303
$$ -4865 -6453 7335 185 -14695 -19246 -9260 6090 2056 -1909 -6184 8197 10228 6686 -5617
16585e617j9638J8819j2589r230N500Q160J9742q762P417K1054O366j3944k098
$$ -5617 -25255 -6436 -19025 -28255 -22755 -14595 5147 -3615 3802 24856 31222 17278 15180
16572A5180J0909j0564j3942Q754P475n589k111l852j8498q514K3659m56Q640
$$ 15180 26089 15525 1583 10337 17812 12223 10112 6260 -12238 -20752 2907 2451 11091
16559A1091q350K789l41j1710k0525N421j0954j2391J5479K6748p182O826j5035
$$ 11091 2741 5530 5189 -6521 -27046 -21625 -32579 -44970 -29491 -2743 -9925 -3099 -18134
16546a8134l187O722O047M709o34j4163K0696k415j6434K454K2759P935q029j880
$$ -18134 -21321 -14599 -8552 -3843 -4477 -18640 2056 -359 -16793 -14339 8420 16355 8326 6446
16532F446j7412J0193K1512J5401k6432j5790L712Q531j7172k4112J9315K2483
$$ 6446 -10966 -773 20739 36140 9708 -6082 -2370 6161 -11011 -35123 -15808 6675
16520F675l170k778l247N583J7244Q95j2572N306J9319j2486j3596M65J637R533
$$ 6675 3505 727 -2520 3063 20307 21202 8630 13936 33255 20769 7173 7638 9275 18808
16506A8808j8453m033J2779q539k0885k2780P121K1070j2670r036J1251R565j4899
$$ 18808 355 -3678 9101 562 -20323 -43103 -35982 -14912 -27582 -36618 -25367 -15802 -30701
16493c0701o123J7523K7213N881k1116m282J8841J505j1144K3877J2881k1500
$$ -30701 -36824 -19301 7912 13793 -7323 -11605 7236 8741 -2403 21474 34355 12855
16481A2855j8777J7480j670k7727M660J9758K0204p161j4334R177J7751P733k8812
$$ 12855 -5922 11558 9888 -17839 -13179 6579 26783 19622 5288 14465 32216 39949 11137
16468A1137R779J3025k2011K456k488K62J7692j5576k7314k3682n109J8431J7202
$$ 11137 20916 33941 11930 14386 11898 12160 29852 14276 -13038 -36720 -41829 -23398 -6196
16455f196J6553N675o615j0046L390p924o592J8161R314j5569J1737j3683j9573
$$ -6196 10357 16032 9417 -629 2761 -5163 -11755 6406 15720 151 11888 -1795 -21368
16442b1368o30P294j2495L544J2315N800p045p726j4673l31l272K3371P735o262
$$ -21368 -21998 -14704 -27199 -23655 -11340 -5540 -12585 -20311 -34984 -35315 -38587 -15216 -7481 -13743
16428a3743l144L692K632l413R835M951j0986k3346p213R095J2753j2777m663
$$ -13743 -16887 -13195 -10563 -13976 -4141 810 -10176 -33522 -40735 -31640 -18887 -31664 -36327
16415c6327K7J1672K8161K4471J7333J331o063O96l816j9487R402r741O310j5304
$$ -36327 -36300 -24628 3533 28004 45337 46668 40605 41301 37485 17998 27400 17659 23969 8665
16401H665j7476n132l4711j7410O272Q096N105k697j4535J3043L3381K2279Q735
$$ 8665 -8811 -13943 -48654 -66064 -59792 -51696 -46591 -49288 -63823 -50780 -17399 4880 13615
16388A3615j3869p269R568M191L718j648J5663k890r699k1595k0779j2731N083
$$ 13615 -254 -7523 2045 6236 9954 8306 23969 21079 11380 -10215 -30994 -43725 -38642
16375c8642N019K4697p519L225P046p387j8050N113J0772N753J1535J2518o632
$$ -38642 -33623 -8926 -16445 -13220 -6174 -13561 -31611 -26498 -15726 -9973 1562 14080 7448
16362G448o464k3231o860r166m10n082J8708J8003r008O18K6659l049K088K51
$$ 7448 984 -22247 -29107 -38273 -38683 -43765 -25057 -7054 -16062 -15444 11215 8166 10254 10505
16348A0505n237j1845N725j1367j1897j2655O190J322m857j178K0830J0170J5572
$$ 10505 5268 -6577 -852 -12219 -24116 -36771 -30581 -29259 -34116 -35294 -14464 -4294 11278
16335A1278J3884o984r892o038p193o94m712J1013J0348j3750l396P552p862k1276
$$ 11278 25162 18178 8286 2248 -4945 -5639 -10351 662 11010 -2740 -6136 1416 -6446 -27722
16321b7722n944K4735J9582J2121l389r263o207J1907J610j3408L982L907j2523
$$ -27722 -33666 -8931 10651 22772 19383 10120 3913 15820 17430 4022 8004 11911 -612
16308f12J1113o174j8050j4162J5999m12j1251K573k00j888J5687n404k262J3090
$$ -612 10501 4327 -13723 -27885 -11886 -12298 -23549 -20976 -21176 -23064 -7377 -12781 -15043 -1953
16294a953K93J2836k1091k5693m462M505Q241J6553L421J0229j2932j244n506
$$ -1953 -1660 11176 -9915 -35608 -40070 -35565 -27324 -10771 -7350 2879 -10053 -11297 -16803
16281a6803m809K5950J3486j0387P089o863j0672j2588j7976N429Q9J433M300
$$ -16803 -21612 4338 17824 7437 14526 7663 -3009 -15597 -33573 -28144 -28055 -26622 -22322
16268b2322l154P323J9585j0378P007K5678k748j4321N697r549k4087J7057L3497
$$ -22322 -25476 -18153 1432 -8946 -1939 23739 20991 6670 12367 2818 -21269 -4212 29285
16255B9285q144j8410j1093m802M982J1634J1709Q690K5232j5249j5246m246j4439
$$ 29285 21141 2731 -8362 -13164 -8182 3452 15161 23851 49083 33834 18588 14342 -97
16242i7O612J1161p240j4268J1569j0734k2329O85J1880O058k349P588O51n62
$$ -97 6515 17676 10436 -3832 7737 -2997 -25326 -24641 -12761 -6703 -9052 -1464 -813 -1375
16228a375n67q857m966k363K849j1515R867J6791O241J89k4685j1834P440M924
$$ -1375 -1942 -10799 -15765 -18128 -15279 -26794 -16927 -136 6105 6294 -18391 -30225 -22785 -17861
16214a7861j6474Q869J2459J2274r005k2932j598J6460K6183q576k31m820j1053
$$ -17861 -34335 -25466 -13007 -733 -9738 -32670 -34268 -17808 8375 -201 -432 -5252 -16305
16201a6305k3735K419K0679J9J914K8610k10l859R560R443O34l7686j3381L9739
$$ -16305 -40040 -37621 -16942 -16923 -15009 13601 13391 9532 19092 28535 29169 -8517 -21898 17841
16187A7841K5285j7799k2850j2401M148P490j3704j415m812n997J1114M231n307
$$ 17841 43126 25327 2477 -9924 -5776 1714 -11990 -13405 -18217 -24214 -13100 -8869 -14176
16174a4176Q497O015k54N687J5033K1495L036k3169k3991j5558R09L0942L1145
$$ -14176 -5679 336 82 5769 20802 42297 45333 22164 -1827 -17385 -16476 14466 45611
16161D5611j78K421k0117K65K1314p42r903m657l1283j8770J9124k1956M809J719
$$ 45611 45433 47854 27737 28002 49316 48574 38671 34014 2731 -16039 3085 -18871 -14062 -12343
16147a2343m159Q555L279q308j548o895P678J5705J5357j5060q696J1458j4145
$$ -12343 -16502 -7947 -4668 -12976 -14524 -21419 -13741 1964 17321 2261 -6435 5023 -9122
16134i122j934N676K943R99J9798l341j7742k3378j5273N162K6799j0956r473
$$ -9122 -11056 -5380 -2437 -1438 18360 15019 -2723 -26101 -41374 -36212 -9413 -20369 -29842
16121b9842K486m620K1578L555K8674J4527o08j5805k1273k3338J1476P054K3406
$$ -29842 -27356 -31976 -10398 -6843 21831 36358 35750 19945 -1328 -24666 -13190 -6136 17270
16108A7270M718k1385m4436j6705K3312K6469K1473j0086q025N190J2201j1012
$$ 17270 21988 603 -43833 -60538 -37226 -10757 10716 630 -7395 -2205 9996 -1016
16096a016j1568J6755N665m166j3231J7866n228o874L312p452J342J4975J2263
$$ -1016 -12584 4171 9836 5670 -7561 10305 5077 -1797 1515 -5937 -4595 10380 22643
16083B2643P829j462j933n064p442j2828O62J5277n007J6724J4267j2382j2875
$$ 22643 30472 29010 27077 22013 14571 1743 2405 17682 12675 29399 43666 31284 18409
16070A8409k4230j4720m920K4917k264K413J6333O847l1043j0716K2862K4629
$$ 18409 -5821 -20541 -25461 -544 -2808 -395 15938 22785 -8258 -18974 3888 28517
16058B8517j145j7352k0520L428M005K720l468m84P234n999R434J1279m694q956
$$ 28517 27372 10020 -10500 -7072 -3067 -347 -3815 -4299 2935 -3064 6370 17649 12955 3999
16044C999N642j6278K558J8374L3561L1477J4233N077q844p659k603j4585l5751
$$ 3999 9641 -6637 -4079 14295 47856 79333 93566 98643 89799 82140 79537 64952 29201
16031B9201l8171K424Q081M552J3050j0140q863P649K31j3511K2516L787j1959
$$ 29201 -8970 -6546 1535 6087 19137 8997 134 7783 8014 -5497 17019 20806 8847
16018H847J5129L126j3361o593J6229o018j0851j1875N621Q259l228J2310n003
$$ 8847 23976 27102 13741 7148 23377 17359 6508 -5367 254 8513 5285 17595 12592
16005A2592j2687j3759R993J1601M665K838r524j0191j777N424O488o193j2180
$$ 12592 -95 -13854 -3861 7740 12405 15243 5719 -4472 -6249 -825 5663 -530 -12710
15992a2710o195O906J1785k7990j2140L4500k840N127J0578J8327K7316K968l6434
$$ -12710 -18905 -11999 -214 -28204 -40344 -5844 -8684 -3557 7021 25348 52664 55632 19198
15979A9198k3365l7064Q755K6365K1002o136o57q256J7888K4700o737l7677L872
$$ 19198 -4167 -41231 -32476 -6111 14891 8755 8098 -158 17730 42430 35693 -1984 1888
15966A888O212K7568J463k4094q87K2711j3156p12Q074q105j7967k739K3653M700
$$ 1888 8100 35668 37131 13037 12150 34861 21705 20993 29067 20962 2995 256 23909 28609
15952B8609l4294m1575j0683K0449K7797J6834O988j0047N539k5128l218J2760
$$ 28609 -5685 -47260 -57943 -37494 -9697 7137 14125 4078 9617 -15511 -18729 -5969
15940e969Q299r079j0291K5190J3665k929J7778j2366p368J0417l6131j3738j4555
$$ -5969 2330 -6749 -17040 8150 21815 18886 36664 24298 16930 27347 -8784 -22522 -37077
15927c7077M624N079q946L011r490q542J0436L0561J3528Q502k472j082p39M413
$$ -37077 -32453 -27374 -36320 -33309 -42799 -51341 -40905 -10344 3184 11686 9214 8132 7393 11806
15913A1806j4431r379Q817K6543j3023k2074J143K121R76L456J3335k4791j0414
$$ 11806 -2625 -12004 -3187 23356 10333 -11741 -10598 -8477 -7501 -4045 9290 -15501 -25915
15900b5915J50J3247R489M535R210p091l583m087M806n194J7832r719R715K3427
$$ -25915 -25765 -12518 -3029 1506 10716 3625 42 -4045 761 -4433 13399 3680 13395 36822
15886C6822j5893j1273O165L711j4030n858Q023K7399J0485n981l9469k6213R586
$$ 36822 20929 9656 15821 19532 5502 -356 7667 35066 45551 39570 101 -26112 -16526
15873a6526J2399n397o254Q38j5010J2146J6055K0271Q399Q294M253J079j4723
$$ -16526 -4127 -9524 -15778 -14940 -29950 -17804 -1749 18522 26921 35215 39468 40547 25824
15860B5824k0041j512K962O866n62J6873J1424j5229j5214j0573L830O119J580
$$ 25824 5783 4271 7233 14099 13537 30410 41834 26605 11391 818 4648 10767 12347
15847A2347r945M831J1344p522k1298Q409J2784l149k5070r515J5413J7149j4666
$$ 12347 2402 7233 18577 11055 -10243 -1834 10950 7801 -17269 -26784 -11371 5778 -8888
15834h888K89l279j5051J3585l083J3773J3516J642L639j9356M026Q351j4511
$$ -8888 -8599 -11878 -26929 -13344 -16427 -2654 10862 12504 16143 -3213 813 9164 -5347
15821e347j1363o12o852r142J153K1487K8111J0901l611q705J5062J8643j3781
$$ -5347 -16710 -17322 -24174 -33316 -32163 -10676 17435 28336 24725 16020 31082 49725 35944
15808C5944N557l62j0597j7743M149L230j6074j0871K522m970j0518M123P538
$$ 35944 41501 41139 30542 12799 16948 20178 4104 -6767 -4245 -9215 -19733 -15610 -8072
15795h072p38M701m298J828n548p448p193l735o924j1511O960J9609J4121l751
$$ -8072 -8810 -4109 -8407 -6579 -12127 -19575 -26768 -30503 -37427 -48938 -41978 -22369 -8248 -11999
15781a1999M139J3813K177p616o599P050J9852K367p715L093l431j4574j5363
$$ -11999 -7860 5953 8130 514 -6085 965 20817 23184 15469 18562 15131 557 -14806
15768a4806j6954j1449J5077J1077K3927J5253j3495p435k463J6672J8501J1890
$$ -14806 -31760 -43209 -28132 -17055 6872 22125 8630 1195 -1268 15404 33905 45795
15756D5795j6448j1252n126J126j3148O983P03k206o501O532J8642p17k7566N345
$$ 45795 29347 18095 12969 14095 947 7930 8633 6427 -74 6458 25100 24383 -3183 2162
15742B162L015J4509p9o642n637J0743j9399N534P819P800P913R815K430l157
$$ 2162 5177 19686 19607 12965 7328 18071 -1328 4206 12025 19825 27738 37553 39983 36826
15728C6826j1952j7851p061n853Q27K3469J6896o895k1191n453n54j1788L977
$$ 36826 24874 7023 -38 -5891 -5064 18405 35301 28406 7215 1762 1208 -10580 -6603
15715f603J3238p795k0810l60M331Q150J3242K923m55K1448K6332K407j8003J9516
$$ -6603 6635 -1160 -21970 -22330 -17999 -9849 3393 6316 5861 27309 53641 56048 38045 57561
15701E7561j0986k7873j2347J624j2575j303J8285K3103k9836r276K420K4668
$$ 57561 46575 18702 6355 7979 -4596 -5899 12386 35489 5653 -3623 -1203 23465
15689B3465l332q672l512k978j9817j4838l511k770O280R555K6691j1412q311
$$ 23465 20133 11461 7949 4971 -14846 -29684 -33195 -35965 -29685 -20130 6561 -4851 -13162
15676a3162L10j4794J5459q15P845n015q288L577R058j788p653J0080N764O306
$$ -13162 -12852 -27646 -12187 -13002 -5157 -10172 -18460 -14883 -5825 -7613 -15266 -5186 578 6884
15662F884j784j0223n298j0646p685R238J0396k2233l923L4991J0961k4174p86
$$ 6884 5100 -5123 -10421 -21067 -28752 -19514 -9118 -31351 -35274 -283 10678 -13496 -14282
15649a4282K4068K676k2229n313P901J2697n879j2478q153j2894L631J1345j0333
$$ -14282 9786 12462 -9767 -15080 -7179 5518 -361 -12839 -20992 -33886 -30255 -18910 -29243
15636b9243q540O443N681j1212l378R58M482J7563K0446J0462J1479J6765k7192
$$ -29243 -37783 -31340 -25659 -36871 -40249 -39291 -34809 -17246 3200 13662 25141 41906 14714
15623A4714l5396j1716J7891J3744j6053o347J3463q801R098J1802P677K233j589
$$ 14714 -20682 -32398 -14507 -763 -16816 -23163 -9700 -18501 -9403 2399 10076 12309 10720
15610A0720j7671l51q052P412l542j4401j8713K1620R839R344J0266j326l475
$$ 10720 -6951 -7302 -15354 -7942 -11484 -25885 -44598 -22978 -13139 -3795 6471 5145 1670
15597A670N601j9152O918J6970l1050j6327J4780J9446L4354J5904j3943j2510
$$ 1670 7271 -11881 -4963 12007 -19043 -35370 -20590 -1144 33210 49114 35171 22661
15585B2661L579j0610j5041j416K1331J5352o772k1965K248Q981M797k6373n915
$$ 22661 26240 15630 589 -827 20504 35856 29084 7119 9367 18348 23145 -3228 -9143
15572i143n641m572J0975k237k388J4237J1469j3293j816P15P036O773M309l349
$$ -9143 -14784 -19356 -8381 -10618 -13006 1231 12700 -593 -2409 -1694 5342 12115 16424 13075
15558A3075O625j2588k3460K0644J6782n199l6756p380L3727N482j3994k2623
$$ 13075 19700 7112 -16348 4296 21078 15879 -20877 -28257 5470 10952 -3042 -25665
15546b5665j2764K1018J1663J3350j008k766P163O936j845R59n278k4465j1463
$$ -25665 -38429 -17411 -5748 7602 6594 3828 10991 17927 16082 17041 11763 -12702 -24165
15533b4165p550j0160K6308J3474J7256j1589o855J0028J5204r222J3276m91n335
$$ -24165 -31715 -41875 -15567 -2093 15163 3574 -3281 6747 21951 12729 26005 25514 20179
15520B0179q079o104K666R502M629j6363k829Q16J994P501l151j5463m952r022
$$ 20179 12100 5996 8662 18164 22793 6430 3601 4417 6411 13912 10761 -4702 -9654 -18676
15506a8676J2239l611K20k398J872Q077J5430N730j379K299k4735j5212j398J8705
$$ -18676 -6437 -10048 -9828 -12226 -10354 -2277 13153 18883 17504 19803 -4932 -20144 -21542 -2837
15492b837J2781P78j1685O306q894P480N281J2423j3215j3978J7097M185k1251
$$ -2837 9944 10722 -963 5343 -3551 3929 9210 21633 8418 -5560 11537 15722 -5529
15479e529j9493P036J6598J1221r74q989q564K3314r439n517j3246j9706j0188
$$ -5529 -25022 -17986 -1388 9833 8859 -130 -8694 14620 5181 -336 -13582 -33288 -43476
15466d3476K4246K3810K772j3462P363O956J1906r266j1852m788k353O888m657
$$ -43476 -19230 4580 7352 -6110 1253 8209 20115 10849 -1003 -5791 -8144 -1256 -5913
15453e913J157j178m922O126O908n981J3004q828j8993j2286m338R434k674N424
$$ -5913 -4756 -5934 -10856 -4730 2178 -3803 9201 373 -18620 -30906 -35244 -25810 -28484 -23060
15439b3060k661N297J9650K558m964J359j1190L291n34K79p937J7949K5567j4153
$$ -23060 -25721 -20424 -774 1784 -3180 -1821 -13011 -9720 -10254 -9975 -17912 37 25604 11451
15425A1451o353n46k680J8761K411j0802k95m840j106j7007j1907J5229K1685
$$ 11451 5098 4552 1872 20633 23044 12242 11947 7107 6001 -11006 -22913 -7684 14001
15412A4001k95j566k6337m544J8266J4012r215l870k771m838o369J5460J283k0136
$$ 14001 13706 12140 -14197 -18741 -475 13537 4322 452 -2319 -7157 -13526 1934 3217 -16919
15398a6919j5983J4486L3559J1127k2889l0708m094P722k629J116m33L4296K2321
$$ -16919 -32902 -18416 15143 26270 3381 -27327 -31421 -23699 -26328 -25212 -25645 8651 30972
15385C0972N484N12r186j3293k1511m798j2437J466P829O792L247R536l641j9382
$$ 30972 36456 36968 27782 14489 -7022 -11820 -24257 -22791 -14962 -8170 -4923 4613 972 -18410
15371a8410J2772N240R50L0920K148n355L111R869L320j1196o51R463n276J147
$$ -18410 -5638 -398 552 31472 33620 28265 31376 41245 44565 33369 32718 42181 36905 38052
15357C8052j1756n0368k654K7175J8145q631j4731k7446J574J6999j0743l898
$$ 38052 26296 -24072 -26726 449 18594 9963 -4768 -32214 -30640 -13641 -24384 -28282
15345b8282K5453Q739k3806j9228K1348j3112j5861o875N830l614j685j340O434
$$ -28282 -2829 5910 -17896 -37124 -15776 -28888 -44749 -51624 -45794 -49408 -51093 -52433 -45999
15332d5999J2668O581L362j565J249K4769J2472N146k4094j0723R921J5119N683
$$ -45999 -33331 -26750 -23388 -24953 -23704 1065 13537 18683 -5411 -16134 -6213 8906 14589
15319A4589M011o86J0329j5737j809K935n763m480K469l409J5030K4945j2687
$$ 14589 18600 17914 28243 12506 10697 13632 7869 3389 5858 2449 17479 42424 29737
15306B9737k3699o351Q746Q235R599R989j1438o682m749j4227r962l846R680K1900
$$ 29737 6038 -313 8433 16668 26267 36256 24818 18136 13387 -840 -10802 -14648 -4968 16932
15292A6932M771j7351j7950k280J0654l583K999p603P344R121M202O346P903k0825
$$ 16932 21703 4352 -13598 -15878 -5224 -8807 -5808 -13411 -6067 3054 7256 13602 21505 680
15278F80N291K0529l7435k0499K7554J4546J2929J007k9021k2983J56k1036J1652
$$ 680 5971 26500 -10935 -31434 -3880 10666 23595 24602 -4419 -27402 -27246 -48282 -36630
15265c6630K0098K3530j4938p712j1009N378J745J061R903j9209n356K4938J4286
$$ -36630 -16532 6998 -7940 -15652 -26661 -21283 -19538 -18477 -8574 -27783 -33139 -8201 6085
15252F085m800l365J264j0851p438J0771K6205J3377j6534j5485l676J3988R344
$$ 6085 1285 -2080 -816 -11667 -19105 -8334 17871 31248 14714 -771 -4447 9541 18885
15239A8885l17k124J416p073k0304r892k4012l7761j3202L4471M2530J6534J2938
$$ 18885 18568 16444 17860 10787 -9517 -19409 -43421 -81182 -94384 -59913 -17383 -849 12089
15226A2089j867J0303K716o660j7547J5096R07m080J9618k419j8326o923K3165
$$ 12089 10222 20525 23241 16581 -966 14130 15037 10957 30575 28156 9830 2907 26072
15213B6072J8466K358j7717j4622j0723Q152J6445J4595L093n318k6738j8707
$$ 26072 44538 46896 29179 14557 3834 11986 28431 43026 46119 40801 14063 -4644
15201d644m860J3213k83j335j284q954N397k786j5837J4540Q567j0855J013j1236
$$ -4644 -9504 3709 3426 2091 807 -8147 -2750 -5536 -21373 -6833 1734 -9121 -8108 -19344
15187a9344j6513K368K3350L1315P016J658q694j3747j3849K041p322k339N431
$$ -19344 -35857 -33489 -10139 21176 28192 29850 21156 7409 -6440 -4399 -11721 -14060 -8629
15174h629J4747j0001m573l698N679o70J4300l953p41Q464j5387j2421r06j2252
$$ -8629 6118 -3883 -8456 -12154 -6475 -7145 7155 3202 2461 10925 -4462 -16883 -17789 -30041
15160c0041j4594R98N910m817J5923K600J3591J1191o885j6088N199J287q113
$$ -30041 -44635 -43637 -37727 -42544 -26621 -24021 -10430 761 -6124 -22212 -17013 -15726 -23839
15147b3839J6653j128K555J4172L537k929j5929l095r12n403n840m430j0566O350
$$ -23839 -7186 -8314 -5759 8413 11950 9021 -6908 -10003 -10915 -16318 -22158 -26588 -37154 -30804
15133c0804J7453j367l567p508j0401J3590J7247J4390j6885k2954Q382L1345
$$ -30804 -13351 -14718 -18285 -25793 -36194 -22604 -5357 9033 -7852 -30806 -22424 8921
15121H921J7347m253o064N394j6553m130j0429l0987k4284N045K1743K0920L652
$$ 8921 26268 22015 15951 21345 4792 662 -9767 -40754 -65038 -59993 -38250 -17330 -13678
15108a3678r072k2426r622N140J0836O502J4447M101j899Q517o0J1737J0589N599
$$ -13678 -22750 -45176 -54798 -49658 -38822 -32320 -17873 -13772 -15671 -7154 -7214 4523 15112 20711
15094B0711j0926L176k456M738j2066p399K4265k095r132q398k976k483j9149
$$ 20711 9785 12961 10505 15243 3177 -4222 20043 17948 8816 418 -2558 -5041 -24190
15081b4190n52L343j2350J2891K0363N242k368N500Q449o935j4170j8219j7248
$$ -24190 -24742 -21399 -33749 -20858 -495 4747 2379 7879 16328 9393 -4777 -22996 -40244
15068d0244J7J2992J4661j7328J9822K1469P017N812j7367j205l913j5977N920
$$ -40244 -40227 -27235 -12574 -29902 -10080 11389 18406 24218 6851 5646 1733 -14244 -8324
15055h324J5610k248P029j473J3873m307l1553o683j8145J0062N385K2033J7294
$$ -8324 7286 5038 12067 10594 24467 20160 -11393 -18076 -36221 -26159 -20774 1259 18553
15042A8553J6771N427n936j1914o508k1499q403N427m656j5313J6989J2989l208
$$ 18553 35324 40751 34815 22901 16393 -5106 -13509 -8082 -12738 -28051 -11062 1927 -1281
15029a281J8570j0555l1194k5213j0692J8581K7938l388P940R431k0371k0806
$$ -1281 17289 6734 -24460 -49673 -60365 -41784 -13846 -17234 -9294 137 -20234 -41040
15017d1040j868J6745Q647J499q493J398K1402K8904j1092n520j1915o58j0669
$$ -41040 -42908 -26163 -17516 -16017 -24510 -23112 -1710 27194 16102 10582 -1333 -1991 -12660
15004a2660j6943k268L038J2822L3159m013k5249Q305J830j2080N298K650j4115
$$ -12660 -29603 -31871 -28833 -16011 17148 13135 -12114 -3809 -1979 -14059 -8761 -6111 -20226
14991b0226K221m376L286P847K2934J9887O182k0167j1873r715r096J6631m21
$$ -20226 -18005 -22381 -19095 -11248 11686 31573 37755 17588 5715 -4000 -13096 3535 3114
14978C114q499p881r501j4589J5132J5461j3222k0484J9927R078j9182j5701J4649
$$ 3114 -5385 -13266 -22767 -37356 -22224 -6763 -19985 -40469 -20542 -11464 -30646 -46347 -31698
14965c1698J9609J1473j989p262l691J4283K0701o378j9055p874m29L3402K3027
$$ -31698 -12089 -616 -2605 -9867 -13558 725 21426 15048 -4007 -11881 -12310 21092 44119
14952D4119p266q083M24L659Q195j2661j087k0262J0924J6716q779j5595N704
$$ 44119 36853 28770 29194 32853 41048 28387 27300 7038 17962 34678 25899 10304 16008
14939A6008J175p986q914k5662j3635J0855k048O279Q91K453J0067J3208N235
$$ 16008 17183 9197 283 -25379 -39014 -28159 -30207 -23928 -23037 -20584 -10517 2691 7926
14926G926K5026R027k5377j4172k2506K5160q182m000N831j9025j0956J6354P99
$$ 7926 32952 41979 16602 2430 -20076 5084 -3098 -7098 -1267 -20292 -31248 -14894 -14095
14913a4095p606J8501J4990O37O711Q166k8288j870J7034r423J224j4485o335
$$ -14095 -21701 -3200 11790 12427 19138 27304 -984 -2854 14180 4757 5981 -8504 -14839
14900a4839K8183K9521j395j1158j2984p995p229k9960r801J5987J6150m530j2401
$$ -14839 13344 42865 41470 30312 17328 9333 2104 -27856 -37657 -21670 -5520 -10050 -22451
14887b2451J8750K8764j963r842j2424q110j5195R528Q219K1074J10j4074j1376
$$ -22451 -3701 25063 23100 13258 834 -7276 -22471 -12943 -4724 16350 16460 2386 -8990
14874h990l148L206j2855R565J0637p933N759J8789n704q283Q970J4692K6226
$$ -8990 -12138 -8932 -21787 -12222 -1585 -9518 -3759 15030 9326 1043 10013 24705 50931
14861E0931M008j7693k054k0853l911L0503J908l116j537N469N651k3340M864
$$ 50931 54939 37246 35192 14339 10428 40931 42839 39723 38186 43655 49306 25966 30830
14848C0830j3366p864J0788n419L3035j4122j7787k9300K747j3161N768m483M602
$$ 30830 17464 9600 20388 14969 48004 33882 16095 -13205 -10458 -23619 -17851 -22334 -17732
14835a7732J9806K426n871M313J018k7110R409n819j928j1130N127J0475J4184
$$ -17732 2074 4500 -1371 2942 3960 -23150 -13741 -19560 -21488 -32618 -27491 -17016 -2832
14822b832L1647r880j7845k843R260j7826j8778R213P220K3114J9446j1816j9282
$$ -2832 28815 18935 1090 -1753 7507 -10319 -29097 -19884 -12664 10450 29896 18080 -1202
14809a202K8029K556j7948L818n879j3125k1783j2807J9832N688k46r116k1301
$$ -1202 26827 29383 11435 15253 9374 -3751 -25534 -38341 -18509 -12821 -13067 -22183 -43484
14796d3484N714L3659J4919J4869J6784j6110j7805r455l0585r241P147J4738
$$ -43484 -37770 -4111 10808 25677 42461 26351 8546 -909 -31494 -40735 -33588 -18850
14784a8850J8682J5499j6095r410n116O929K0982m445n183L299L3641J490k2567
$$ -18850 -168 15331 -764 -10174 -15290 -8361 12621 8176 2993 6292 39933 41423 18856
14771A8856j6914J4657K415j0217l920J2917K5505p287j4016j729k5659j076N544
$$ 18856 1942 16599 19014 8797 4877 17794 43299 36012 21996 20267 -5392 -6468 -924
14758i24J4904J6555j6157o191o13j3939k5027j49L3093J2531l167o311j2559
$$ -924 13980 30535 14378 8187 7574 -6365 -31392 -31541 1552 14083 10916 4605 -7954
14745g954J1838q994j8568k9328m218J7376O772O959J1864L821L888O272J3060
$$ -7954 3884 -5110 -23678 -53006 -57224 -39848 -33076 -26117 -14253 -10432 -6544 -272 12788
14732A2788j1041j2189P112j8908j0679J9546J0871k41r353j4157J1210r484o888
$$ 12788 1747 -10442 -3330 -22238 -32917 -13371 -2500 -2741 -12094 -26251 -15041 -24525 -31413
14719c1413Q849O876J3400N752J5548o079l6n480J814L304l727l657k498j7969
$$ -31413 -22564 -15688 -2288 3464 19012 12933 12897 7417 9231 12535 8808 5151 2653 -15316
14705a5316o551n010Q09O431L003K265j459p99O25o607j4278O258R851J7666l348
$$ -15316 -21867 -26877 -26068 -19637 -16634 -14369 -15828 -16627 -16002 -22609 -36887 -30629 -20778 -3112 -6460
14690f460o303P622J5977R447o088j5509j1618N283p877k0495J5718K1805j1332
$$ -6460 -12763 -5141 10836 20283 14195 -1314 -12932 -7649 -15526 -36021 -20303 1502 -9830
14677i830r76Q643j6545j5706J2504J2663P511J3427P082m506P950k0483k9017
$$ -9830 -10806 -2163 -18708 -34414 -21910 -9247 -1736 11691 18773 14267 22217 1734 -27283
14664b7283R788K837J9910l746j657k092n412K2285j4014o199j0309L966J8922
$$ -27283 -17495 -14658 5252 1506 -151 -2243 -7655 14630 616 -5583 -15892 -11926 6996
14651F996n249N249R67j9153K401J0137q831j5294j9294P065P936R049J1558M543
$$ 6996 1747 6996 7963 -11190 -8789 1348 -7483 -22777 -42071 -35006 -27070 -18021 -6463 -1920
14637a920L814L026o201O888J0999k0216K1178k3331k6308p655m850J7673J3842
$$ -1920 1894 4920 -1281 5607 16606 -3610 17568 -5763 -32071 -39726 -44576 -26903 -13061
14624a3061O451n239j484K386Q631K5678L589J3069m422k6833l0763K3843K7965
$$ -13061 -6610 -11849 -13333 -10947 -2316 23362 26951 40020 35598 8765 -21998 1845 29810
14611B9810j0051k2713j5539N668M980R455r393N034j844k800K442M991k951P45
$$ 29810 19759 -2954 -18493 -12825 -7845 1610 -7783 -2749 -4593 -7393 -4951 40 -2911 -2166
14597b166K3568J5248j2635l9339m927J7336l992j187P31J63j807M380j643q279
$$ -2166 21402 36650 24015 -15324 -20251 -2915 -6907 -8094 -7363 -7200 -9007 -4627 -6270 -14549
14583a4549n231J3803j342j4001L869J7309R936r289j8577j3279J0445j5224J3158
$$ -14549 -19780 -5977 -7319 -21320 -17451 -142 9794 505 -18072 -31351 -20906 -36130 -22972
14570b2972K812k284j3637K421R702P556J9348l533o491R859L908J0043n037k2801
$$ -22972 -20160 -22444 -36081 -33660 -23958 -16402 2946 -587 -7078 2781 6689 16732 11695 -11106
14556a1106p384J8605M163K100n622j3174j2167l319O571o792M81L3538J8399
$$ -11106 -18490 115 4278 6378 756 -12418 -24585 -27904 -21333 -28125 -27644 5894 24293
14543B4293j1672k3646K635K180r849j4093o447J7541J5194m227l897K5085q298
$$ 24293 12621 -11025 -8390 -6210 -16059 -30152 -36599 -19058 -3864 -8091 -11988 13097 4799
14530D799J0620J2385j0535j9834j4012K9659K974k8525j9719l314K2979J663
$$ 4799 15419 27804 17269 -2565 -16577 13082 16056 -12469 -32188 -35502 -12523 -10860
14518a0860p210j8431k0816J5710L0543L0941M253n158j3993J1287n032n052M478
$$ -10860 -18070 -36501 -57317 -41607 -11064 19877 24130 18972 4979 16266 11234 6182 10660
14505A0660J1260k518j545k9313n903R388J5739l788n471J1640o818p151j3502
$$ 10660 21920 19402 17857 -11456 -17359 -7971 7768 3980 -1491 10149 3331 -3820 -17322
14492a7322o901o002j264N515J7379R168p699r392P523l684K2124J9173k106r659
$$ -17322 -24223 -30225 -31489 -25974 -8595 573 -7126 -16518 -8995 -12679 9445 28618 26512 16853
14478A6853k4730J3204K2539j7150n140k3379K689O395J6212N929J3816M990l3326
$$ 16853 -7877 5327 27866 10716 5576 -17803 -15114 -8719 7493 13422 27238 32228 -1098
14465a098o116m519K432J8145J5715j1363m715R402k6976j1350L0408R181j718
$$ -1098 -7214 -11733 -9301 8844 24559 13196 8481 17883 -9093 -20443 9965 19146 17428
14452A7428j6457l228k918M10J4207N333j2720q774J1741J2495O934j6905N644
$$ 17428 971 -2257 -5175 -4765 9442 14775 2055 -6719 5022 17517 24451 7546 13190
14439A3190p64j4658k3390l974n08L426Q850K5669M16m2155k001K0501K6509l869
$$ 13190 12426 -2232 -25622 -29596 -30104 -26678 -17828 7841 8257 -33898 -35899 -15398 11111 7242
14425G242J966J3465j363N084k1678k429L683R822p918p229P545P964Q987J4688
$$ 7242 9208 22673 21310 26394 4716 2287 5970 15792 7874 645 8190 16154 25141 39829
14411C9829k1774o465j0201j6239o375J9298J7206Q428r549J1774J6612j5444
$$ 39829 18055 11590 1389 -14850 -21225 -1927 15279 23707 14158 25932 42544 27100
14399B7100j5163p117R198R157j3647m389j759k2114J0300J9285J7373J8193P5
$$ 27100 11937 4820 14018 23175 9528 5139 3380 -18734 -8434 10851 28224 46417 46492
14386D6492j9114j7279p409j6140P941j0847N94J0061J0944J1891R931j9831j3057
$$ 46492 27378 10099 2690 -13450 -5509 -16356 -15762 -5701 5243 17134 27065 7234 -5823
14373e823P593n297r11k5072R875p762L698q136K0243M5428L531j5700j4496J5941
$$ -5823 1770 -3527 -4438 -29510 -19635 -27397 -23699 -31835 -11592 33836 37367 21667 7171 23112
14359B3112N834k7778q745l317j0955J5873k34o955M395l771K3424K22k4198N81
$$ 23112 28946 1168 -7577 -10894 -21849 -5976 -6210 -13165 -8770 -12541 10883 11105 -13093 -12512
14345a2512O434p67R459J0937J8001J5439K79j9914j8257j088k2127L383K1860
$$ -12512 -6078 -6845 2614 13551 31552 46991 47270 27356 9099 8011 -14116 -10733 11127
14332A1127J513j4121j1464K94J8290K1104Q002k0918n339Q121n897Q616K1915
$$ 11127 12640 -1481 -12945 -12651 5639 26743 34745 13827 8488 16609 10712 19328 41243
14319D1243m267k0319j2427k2089m402L8253L493n412K010j6564m944k237L196
$$ 41243 36976 16657 4230 -17859 -22261 15992 19485 14073 16083 -481 -5425 -7662 -4466
14306d466k0030R497J1058j2434m773M681K2674J1942q122K10J2225r86j2635
$$ -4466 -24496 -14999 -3941 -16375 -21148 -16467 6207 18149 10027 10237 22462 21476 8841
14293H841K989k729r137j2338P22J6732R716R0r860j9879k7327m816J2442J5855
$$ 8841 11830 9101 -36 -12374 -11652 5080 14796 14886 5026 -14853 -42180 -46996 -34554 -18699
14279a8699J3999J5140r964k1655j580O074j3477N714K8301J6322j6974o475L54
$$ -18699 -4700 10440 476 -21179 -22759 -16685 -30162 -24448 3853 20175 3201 -3274 -2920
14266b920j6120j0224N129P15J5565J128j5821K305j467j5721P432J4504J7297
$$ -2920 -19040 -29264 -24135 -23420 -7855 -6727 -22548 -20243 -21710 -37431 -29999 -15495 1802
14253A802K160l280J0310K536k996j9922k7613j3289p589M285J1963K2963J1085
$$ 1802 3962 682 10992 13528 10532 -9390 -37003 -50292 -57881 -53596 -41633 -18670 -7585
14240g585k2431j3086m738O061L1981L1083j7330l5264J0563J9489J9484M465
$$ -7585 -30016 -43102 -47840 -41779 -9798 21285 3955 -31309 -20746 -1257 18227 22692
14228B2692o677j4990j3342J019K1377J3352J3571k5069m549N059p856j6927J93
$$ 22692 16015 1025 -12317 -11298 10079 23431 37002 11933 7384 12443 4587 -12340 -12147
14215a2147R769j1079j7970Q418P77J010p585n397L1773L351P034P17O703J4498
$$ -12147 -2378 -13457 -31427 -23009 -22232 -21222 -28807 -34204 -2431 920 7954 8671 15374 29872
14201B9872j396j4719j0466M595m709r539j1283J1794J6596j4709n13K472r55
$$ 29872 28476 13757 3291 7886 3177 -6362 -17645 -5851 10745 -3964 -4477 -2005 -2960
14188b960l353K133K1870J0523r174l7422j86P736k460J007j3786M557K266J2176
$$ -2960 -6313 -4180 17690 28213 19039 -18383 -18569 -10833 -13293 -12286 -26072 -21515 -19249 -7073
14174g073J1406n073j0148k5998J3647J6646j3087r186K442J6032j367j6645N777
$$ -7073 4333 -740 -10888 -36886 -23239 -6593 -19680 -28866 -26424 -10392 -11759 -28404 -22627
14161b2627k6161j2460Q577M2141K1521k99j1820j3685M950J1182k116j991J3055
$$ -22627 -48788 -61248 -52671 -10530 10991 10692 -1128 -14813 -9863 1319 -797 -2788 10267
14148A0267j9050j7934L1923O386o802j9076r790M088k551N306J3637N572j0138
$$ 10267 -8783 -26717 5206 11592 4790 -14286 -24076 -19988 -22539 -17233 -3596 1976 -8162
14135h162j4112M589q247m824J0004L3480J4244O268j0522j807o560j9979j6269
$$ -8162 -22274 -17685 -25932 -30756 -20752 12728 26972 33240 22718 20911 14351 -5628 -21897
14122b1897Q402J4187K0740p05k2765J5688J5911o250k9154m286K97j479l884
$$ -21897 -13495 692 21432 20727 -2038 13650 29561 23311 -5843 -10129 -9832 -11311 -15195
14109a5195j3358J4169K0304j8662j9679J2050J4871P062l576r473j7866Q69R443
$$ -15195 -28553 -14384 5920 -12742 -32421 -20371 -5500 1562 -2014 -11487 -29353 -28484 -19041
14096a9041J9946m21j2303j3469J2966K4846r593j4512j5697R099P715J0587r547
$$ -19041 905 484 -11819 -25288 -12322 12524 2931 -11581 -27278 -18179 -10464 123 -9424
14083i424J5900K200l338K556N225P312J6933m305J1593k1267k6572j8997J4565
$$ -9424 6476 8676 5338 7894 13119 20431 37364 33059 44652 23385 -3187 -22184 -7619
14070g619j642j0286j5090o175K258J1712K8567J5201j4779j6130Q967K0231N227
$$ -7619 -9261 -19547 -34637 -40812 -38554 -26842 1725 16926 2147 -13983 -5016 15215 20442
14057B0442n793l793L07m209p041N485J5815M338j1881k4411j2164q971J2092
$$ 20442 14649 10856 11163 6954 -87 5398 21213 25551 13670 -10741 -22905 -31876 -19784
14044a9784O911n671Q914P097j4537n917j017P168J217N71K4700O106j5130P243
$$ -19784 -12873 -18544 -9630 -2533 -17070 -22987 -24004 -16836 -15619 -15048 9652 15758 628 7871
14030G871k152n440M447K2176K4105j954j1473J3427j5083k6464L140o65J151
$$ 7871 5719 279 4726 26902 51007 49053 37580 51007 35924 9460 12600 11935 13086
14017A3086j3874j5541R083N04j569J6719N885n468o417J0190j0655n612o42K965
$$ 13086 -788 -16329 -7246 -6742 -8311 8408 14293 8825 2408 12598 1943 -3669 -4311 -1346
14003a346l1786J840J4646n69L246J975J0293K2950J4556j5645m446j0919N649
$$ -1346 -33132 -31292 -16646 -17215 -13969 -11994 -1701 21249 35805 20160 15714 4795 10444
13990A0444L915j6842R573J8714l836n544K3274J3664k8769j2615k0415n490j575
$$ 10444 14359 -2483 7090 25804 21968 16424 39698 53362 24593 11978 -8437 -13927 -15502
13977a5502K646o674R843N888K2407P400J663j8265j7126Q625J4298j06j7466
$$ -15502 -12856 -19530 -9687 -3799 18608 26008 27671 9406 -7720 905 15203 15097 -2369
13964b369J463l820r345R512L484k929k2288k668L56M178K8132J7462j5137q682
$$ -2369 -906 -4726 -14071 -4559 -1075 -4004 -26292 -28960 -28604 -24426 3706 21168 6031 -2651
13950b651n89j6626J122L689j241r325O711J6128N038o681N987j2422q558M341
$$ -2651 -3240 -19866 -18744 -15055 -16296 -25621 -18910 -2782 2256 -4425 1562 -10860 -19418 -15077
13936a5077Q90k351J6574j4153M459l17nO825j3723l865L7547L071j7114p80k4260
$$ -15077 -14187 -16538 36 -14117 -9658 -9975 -9980 -3155 -16878 -20743 16804 19875 2761 1981 -22279
13921b2279j8553Q712J1652L0663J5167j1174l108N799j6012J4219J74J0397k0020
$$ -22279 -40832 -32120 -20468 10195 25362 14188 11080 16879 867 15086 15260 25657 5637
13908E637O746l347j6002J4883K5256j2386L4p724j5044r581l0432Q605K5801
$$ 5637 12383 9036 -6966 7917 33173 20787 20821 13097 -1947 -11528 -41960 -33355 -7554
13895g554J1595J5265r595j2236q801k1595J7136Q886n80J5929M624l3251j1418
$$ -7554 4041 19306 9711 -2525 -11326 -32921 -15785 -6899 -7479 8450 13074 -20177 -31595
13882c1595O437r388K1578J5564k4798p224n32O697J9789O024j07J0509O866o747
$$ -31595 -25158 -34546 -12968 2596 -22202 -29426 -29958 -23261 -3472 2552 2445 12954 19820 13073
13868A3073j9907k4112l340j537m188O568O781J4423k562o065M217J8307J5684
$$ 13073 -6834 -30946 -34286 -35823 -40011 -33443 -26662 -12239 -14801 -20866 -16649 1658 17342
13855A7342J4432N279k1838N121l438n867M974r46J3964J2867o630J1353j1972
$$ 17342 31774 37053 15215 20336 16898 11031 16005 15059 29023 41890 35260 46613 34641
13842C4641J5964M153j8351l517R339j0586j3651n183j5536K1143O390k0039j6863
$$ 34641 50605 54758 36407 32890 42229 31643 17992 12809 -2727 18416 24806 4767 -12096
13829a2096j8952P38n498J0797J8870p628J4155J0293j4702p48J1687l459k633
$$ -12096 -31048 -30310 -35808 -25011 -6141 -13769 386 10679 -4023 -4771 6916 3457 824
13816H24R882J6395J685j1004O62R942j3236p302L5717l157k7616l1196p078J6905
$$ 824 10706 27101 28786 17782 18444 28386 15150 7848 43565 40408 12792 -18404 -25482 -8577
13802h577J2269j75j2287o661L0996m174l2972j3481K0143K1109j4010j8128k644
$$ -8577 3692 3517 -8770 -15431 15565 11391 -21581 -35062 -14919 6190 -7820 -25948 -28592
13789b8592J6314Q890N574J3293J7396m118j0762J5869o124j121q049j9055j3085
$$ -28592 -12278 -3388 2186 15479 32875 28757 17995 33864 27740 26619 18570 -485 -13570
13776a3570k492r135J2652k83j4428J1069m865K3758J8633j739j4147R765J1370
$$ -13570 -16062 -25197 -12545 -12828 -27256 -16187 -21052 2706 21339 19600 5453 15218 26588
13763B6588P633k6979j4393M112J642L331j1918k1012J296J2311J8162J82p994
$$ 26588 34221 7242 -7151 -3039 -1397 1934 -9984 -30996 -29700 -17389 773 955 -7039
13750g039R951K0052J5538L300j3858k584j3098q755p009k241J0551k15l59N318
$$ -7039 2912 22964 38502 41802 27944 25360 12262 3507 -3502 -5743 4808 4593 4234 9552
13736I552m57k5273Q634P86K264n632J323k635R120n532n865O943J4579J4415
$$ 9552 9095 -16178 -7544 -6758 -4494 -10126 -8803 -11438 -2318 -7850 -13715 -6772 7807 22222
13722B2222m248K015k0580k382J5949j2029l823J965J9622J1736J1935k6169j7599
$$ 22222 17974 19989 -591 -2973 12976 947 -2876 -911 18711 30447 42382 16213 -1386
13709a386Q847o857R942P078M408L992J8421k87k1876j054L525k8303p155J7336
$$ -1386 7461 604 10546 17624 22032 26024 44445 44158 22282 21228 24753 -3550 -10705 6631
13695F631k970N114j7115J3680M680m741o711j8426L084j995N172o665n999L8708
$$ 6631 3661 8775 -8340 5340 10020 5279 -1432 -19858 -16774 -18769 -13597 -20262 -26261 12447
13681A2447J8463q654k8247m857o468o624J2927K060p919J5734L804j7087J3863
$$ 12447 30910 22256 -5991 -10848 -17316 -23940 -11013 -8953 -16872 -1138 2666 -14421 -558
13668e58N520O29P58j3691q362J0763J4886K4599K154p36j9789j3202N795J6959
$$ -558 4962 5591 6349 -7342 -15704 -4941 9945 34544 36698 35962 16173 2971 8766 25725
13654B5725r979M261J3420O46P178j4419j383n845m475J0250l622k539k2056n002
$$ 25725 15746 20007 33427 34073 41251 26832 25449 19604 15129 25379 21757 19218 -2838 -7840
13640g840j2303J1612R743P834m358K184L620n799j7155p329K3129K4851j344
$$ -7840 -20143 -8531 1212 9046 4688 6872 10492 4693 -12462 -19791 3338 28189 26845
13627B6845j1837j3517N799M706m644M205K3396j6471j5943L626J2890J4648J6563
$$ 26845 15008 1491 7290 11996 7352 11557 34953 18482 2539 6165 19055 33703 50266
13614E0266k0428l1508o090k565K1225K9860J2752k7024l479q092o356o32j2376
$$ 50266 29838 -1670 -7760 -10325 10900 40760 53512 26488 23009 14917 8561 7929 -4447
13601d447o527R043J2164q704j3807n413J0332n264j1733J0542K223J2879J0971
$$ -4447 -10974 -1931 10233 1529 -12278 -17691 -7359 -12623 -24356 -13814 -11591 1288 12259
13588A2259J1938N219j3722o559p56p306j49K455l593J2766M864J229P842j1333
$$ 12259 24197 29416 15694 9135 8379 1073 924 3379 -214 12552 17416 18645 26487 15154
13574A5154o80j0641L788J0805J7752p830J0391J905j7401j2491K01P69M5Q926
$$ 15154 14474 3833 7621 18426 36178 28348 38739 40644 23243 10752 10953 11722 11767 20693
13560B0693l38N491R335o71j2262O427q269k2841q16M7J280j8483J2004K7320
$$ 20693 20355 25846 35181 34510 22248 28675 20406 -2435 -3251 -3204 -1924 -20407 -8403 18917
13546A8917O125R03k0251k1049K063J541j3631j9946N902K4630J2579q744J659
$$ 18917 25042 25945 5694 -15355 -13292 -11751 -25382 -45328 -39426 -14796 -2217 -10961 -9302
13533i302P596m033k9905j652J2828N18J6277R18j2297o544J7511J6479j550k1164
$$ -9302 -1706 -5739 -35644 -37296 -24468 -23950 -7673 -6755 -19052 -25596 -8085 8394 6844 -14320
13519a4320J931j572K2468J1308J9398L1116l272j1923j2743j3253q769j1688
$$ -14320 -12389 -13961 8507 19815 39213 70329 67057 55134 42391 29138 20369 8681
13507H681j9601k2692q615P150J5264J0825J1299J152J4884J795J1286K095p421
$$ 8681 -10920 -33612 -42227 -35077 -19813 -8988 2311 3463 18347 20142 31428 33523 26102
13494B6102J2768j278j9373N787o08r4m232r725j7824n827J6171J8575K2037Q781
$$ 26102 38870 37592 18219 24006 23398 23304 19072 9347 -8477 -14304 1867 20442 42479 51260
13480E1260k1323j9949O251Q98l014O044m831j0971K301m427r346p038J0932P250
$$ 51260 29937 9988 16239 17137 14123 20167 15336 4365 6666 2239 -7107 -14145 -3213 4037
13466D037J1712J5668j7059l983L019K134q620j7406r332J3743N926l138J1698
$$ 4037 15749 31417 14358 10375 13394 15528 6908 -10498 -19830 -6087 -161 -3299 8399
13453H399N104kJ7880M517j4364L698p092J0924m369j9310j8146Q763M814L65
$$ 8399 13503 13501 31381 35898 21534 25232 18140 29064 24695 5385 -12761 -3998 816 1181
13439A181M695K648q291J0773J697R0O055k0679k0623M553J6315Q784l139R747
$$ 1181 5876 8524 233 11006 12703 12793 18848 -1831 -22454 -17901 -1586 7198 4059 13806
13425A3806J3538J404O694J0408K7796k73J095L0610K3421J7001K4888N7851Q1512
$$ 13806 27344 28748 35442 45850 73646 73373 74468 105078 128499 145500 170388 228239 309751
13412C09751J53140K32036K61629K11504J32664J77587J48513N2667j32017m33860
$$ 309751 462891 694927 956556 1168060 1300724 1478311 1626824 1679491 1547474 1113614
13402A113614l93927j92077q8788o5866m5928m0191k2468l6769k745j1033l4407
$$ 1113614 719687 527610 438822 372956 327028 286837 264369 227600 224855 213822 179415
13391A79415j8535J4534n77n509N278J5022j6751q936p139j3790k5023J6958j3157
$$ 179415 160880 175414 174837 169328 174606 189628 172877 163941 156802 143012 117989 134947 121790
13378A21790l7429j3726J3208J5429l1920p767N895L1J2593J2422j490k2476J237
$$ 121790 84361 70635 83843 99272 67352 59585 65480 65511 78104 90526 89036 66560 67797
13365F7797J7567l774K481K145o875r672j8752L687O213j4399j503L861p858N985
$$ 67797 85364 81590 84071 86216 79341 69669 50917 54604 60817 46418 44915 48776 40918 46903
13351D6903J6866l469J2946j440j3972k0448N322J4896j4431k9122l714J4343
$$ 46903 63769 60300 73246 71806 57834 37386 42708 57604 43173 14051 10337 24680
13339B4680R744Q069o936P394J1480j5351M492J3558K3974L795k7031j2047R198
$$ 24680 34424 42493 35557 42951 54431 39080 43572 57130 81104 84899 57868 45821 55019
13326E5019k276r130k0854j619q46L01J2532j961o447j5685P719J1483J1179K1367
$$ 55019 52743 43613 22759 21140 20294 20595 33127 31166 24719 9034 16753 28236 39415 60782
13312F0782k2629J1794J8025j7177k5489L933j1290j6855J7408J9743J5396n52
$$ 60782 38153 49947 67972 50795 25306 29239 17949 1094 18502 38245 53641 53089
13300E3089p922j1164j9874k1283J0892N675J7843k870o434J6257J1726j8383
$$ 53089 45167 34003 14129 -7154 3738 9413 27256 24386 17952 34209 45935 27552
13288B7552M579K071j1168K288R217j3730j3988q000j4307M789K2166L3101q464
$$ 27552 32131 34202 23034 25322 34539 20809 6821 -1179 -15486 -10697 11469 44570 36106
13275C6106N068M573R34r861J6403J7214J054p385j8249j7333q611m585l698O617
$$ 36106 41174 45747 46681 36820 53223 70437 71491 64106 45857 28524 19913 15328 11630 18247
13261A8247N785Q444k223l7819N178L34J0468m629N106m848l443R837L306J2761
$$ 18247 24032 32476 30253 -7566 -2388 -2054 8414 3785 8891 4043 600 10437 13743 26504
13247B6504N775j190P25l742k995N281p418j7667m192j278J3968J6268J2226J7
$$ 26504 32279 31089 31814 28072 25077 30358 22940 5273 1081 -197 13771 30039 42265 42282
13233D2282l0081j8575Q791K8496L578J8392J4385l6786L301Q597J7484L4504
$$ 42282 12201 -6374 2417 30913 34491 52883 67268 30482 33783 42380 59864 94368
13221I4368k187J1606M214J3698m3305j0365K9502j121m607R57J8077L8k831N567
$$ 94368 92181 103787 108001 121699 78394 68029 97531 96410 91803 92760 110837 110875 108044 113611
13207A13611r212j5534k0848l021J1148k484k8848o141j5156J7927r918k6043
$$ 113611 104399 88865 68017 64996 76144 73660 44812 38671 23515 41442 31524 5481
13195E481R153J3798P398J4211K9949k984j7363L026K1675j7401o949n993n045
$$ 5481 14634 28432 35830 50041 79990 77006 59643 62669 84344 66943 59994 54001 48956
13182D8956l38N798L2943l7526j5379K1184J7474J1734N938p793J1337L343J5741
$$ 48956 48618 54416 87359 49833 34454 55638 73112 84846 90784 82991 94328 97671 113412
13169A13412j3441k0191R540j4842n192Q97q168L256k339N097J9112j7750L752
$$ 113412 99971 79780 89320 74478 69286 70183 62015 65271 62932 68029 87141 69391 73143
13156G3143N499j5416J4283K1733N334j7320o938k030p515j540k0789N959K0695
$$ 73143 78642 63226 77509 99242 104576 87256 80318 78288 70773 69233 48444 54403 75098
13143G5098p121k3979j3060P290M702N609J4266K7598L0534K5236R958p916l2813
$$ 75098 67977 43998 30938 38228 42930 48539 62805 90403 120937 146173 156131 148215 115402
13130A15402l1805J2796k1073l7255n943J1798N671j8374m420l2369n836j358
$$ 115402 83597 96393 75320 38065 32122 43920 49591 31217 26797 -5572 -11408 -12766
13118a2766K313J8184j1845j3685K4459P217Q133L6234o240j3479Q081Q115j6213
$$ -12766 -10453 7731 -4114 -17799 6660 13877 22010 58244 52004 38525 46606 54721 38508
13105C8508p160j1397j0577j4912j8353l27P022Q798J6898M044k3522k1148J917
$$ 38508 31348 19951 9374 -5538 -23891 -24218 -17196 -8398 8500 12544 -10978 -32126 -30209
13092c0209j3090q335J4789M4727K1718k6944j2836M318J1540J2568N485p468
$$ -30209 -43299 -51634 -36845 7882 29600 2656 -10180 -5862 5678 18246 23731 16263
13080A6263q77M2164N2443L9880J6397K8632K3542j7772k4325K08k016K1060J2056
$$ 16263 15386 57550 109993 149873 166270 194902 218444 200672 176347 176555 174539 195599 207655
13067B07655l294O08L9102Q5666R6060O5552K9147K7969K8070K5062j4687j22542
$$ 207655 204361 204969 244071 329737 425797 491349 520496 548465 576535 601597 586910 464368
13055D64368q1336l0301l2430k5675j3515J7597J8277m87o765j2233j1291k6603
$$ 464368 383032 352731 320301 294626 281111 298708 316985 316498 309733 297500 286209 259606
13043B59606k8445j2336j389J6960p44J313Q02K0277K4716J6635J4069k9775k5971
$$ 259606 231161 218825 217436 234396 233652 234965 235767 256044 280760 297395 311464 281689 255718
13030B55718L4489K1245J6923K818N527N935m64M929j1712j3171l490M004j86
$$ 255718 290207 311452 328375 331193 336720 342655 342191 347120 335408 322237 318747 322751 322565
13017C22565L1960K4850k502j551J701K830j0069q457r230Q754j386R166k7690
$$ 322565 354525 379375 376873 375322 377023 379853 369784 361327 352097 360851 359465 368631 340941
13004C40941N741L8128J4382o048J7820J5896J0402r289L4999J7770O945k6K9979
$$ 340941 346682 384810 399192 393144 410964 426860 437262 427973 462972 480742 487687 487661 517640
12991E17640J7885J4373J0856K0096M2198L6558N1260O5370O1459N5870O1220
$$ 517640 535525 549898 560754 580850 623048 659606 710866 776236 837695 893565 954785
12980I54785P1167J11007J10211O4505M9309N2732L5907M326J6571M3431P3666
$$ 954785 1025952 1136959 1247170 1311675 1360984 1413716 1449623 1453949 1470520 1513951 1587617
12969A587617R4708J13055J25928J92921K24191K75209L48365L20528L60740M71496
$$ 1587617 1682325 1795380 1921308 2114229 2338420 2613629 2961994 3282522 3643262 4114758
12959D114758N74709P23933Q52233R77178J087421J282742J597525J918572K541857
$$ 4114758 4689467 5413400 6265633 7242811 8330232 9612974 11210499 13129071 15670928
12950A5670928L339591M782402P769056J3045586K2482453L7624555N1024717
$$ 15670928 19010519 23792921 31561977 44607563 67090016 104714571 155739288
12943A55739288M6858106L1956632L4241693L3228304J4557360q602950p5069428
$$ 155739288 202597394 234554026 268795719 302024023 316581383 307978433 232909005
12936B32909005q3585831m6762985k4488272j4172339r423761o959430n393489
$$ 232909005 149323174 102560189 78071917 63899578 54475817 47516387 42122898
12929D2122898m266071l313814k567074k164148j878493j916842j911106j468155
$$ 42122898 37856827 34543013 31975939 29811791 27933298 26016456 24105350 22637195
12921B2637195j040768p75773o57843n77494n50531o46646o86253o55614o89724
$$ 22637195 21596427 20820654 20162811 19585317 19034786 18388140 17701887 17046273 16356549
12912A6356549p06390p13160p24177p06720o44932o15489n60447n14279m85312
$$ 16356549 15650159 14936999 14212822 13506102 12861170 12245681 11685234 11170955 10685643
12903A0685643m38094l87513l53854l10521k82900k35820k16015k38759k44681
$$ 10685643 10247549 9860036 9506182 9195661 8912761 8676941 8460926 8222167 7977486
12894G977486k55672k46930k03898k17927k34989k32744j87516j76628j65981
$$ 7977486 7721814 7474884 7270986 7053059 6818070 6585326 6397810 6221182 6055201
12885F055201j60430j29223j29874j22708j31449j32933j67808j55905j61053
$$ 6055201 5894771 5765548 5635674 5512966 5381517 5248584 5080776 4924871 4763818
12876D763818j19154j10674j14704j08292r6266o3307k163Q9602J41936J24055
$$ 4763818 4644664 4533990 4419286 4310994 4214728 4151421 4149258 4238860 4380796 4504851
12866D504851J31266J08118K9621j5246k31784l31764l62536l71656k61172j75143
$$ 4504851 4636117 4744235 4773856 4758610 4526826 4195062 3832526 3460870 3199698 3024555
12856C024555j02686p8969r3684q4048p0347o3818q4015q3232o9773m4647m3704
$$ 3024555 2921869 2842900 2749216 2665168 2594821 2531003 2446988 2363756 2293983 2249336 2205632
12845B205632o8471n9606k6021l3379l4597m4479o4884n5372n2216n3887l8792
$$ 2205632 2137161 2077555 2051534 2018155 1983558 1939079 1874195 1818823 1766607 1712720 1673928
12834A673928o2246k2668L471m253j2815j6066k5070j7252l067k9682j2284M1266
$$ 1673928 1611682 1589014 1592485 1588232 1575417 1559351 1534281 1517029 1513962 1484280 1471996 1513262
12822A513262M9579P3460N2863N4079N0322K8809J27j06148k11513j11448n9840
$$ 1513262 1562841 1636301 1689164 1743243 1793565 1822374 1822501 1716353 1504840 1393392 1333552
12811A333552m3086k2996n7152j00255n2178k5691k8227j5123q970K0509M2967
$$ 1333552 1290466 1267470 1210318 1110063 1057885 1032194 1003967 988844 979874 1000383 1043350
12800A043350M069j4690j8782q2505p5511o5647n2170m8539k0780j7697o258k5969
$$ 1043350 1047419 1032729 1013947 931442 855931 790284 738114 689575 668795 651098 644840 618871
12788F18871M18J3481N2916M2437L6381J9564K3506O704j2926j5766q0794j10899
$$ 618871 619289 632770 685686 728123 764504 784068 807574 814278 801352 785586 704792 593893
12776E93893o1634k9705l3403j8119j5837l974j1367P817j5647l3849M412M167
$$ 593893 532259 502554 469151 451032 435195 431221 419854 427671 412024 378175 382587 386754
12764C86754J7685j0107l593O895k8930k6081j1672J2940N419K483K2606j9190
$$ 386754 404439 394332 390739 397634 368704 342623 330951 343891 349310 351793 374399 355209
12752C55209j7521n7648m8221j3235m2172k7046O869M728N487J8925K5878K2797
$$ 355209 337688 280040 231819 218584 176412 149366 156235 160963 166450 185375 211253 234050
12740B34050m776M656L0956p873k2900m666L489Q21k2995m1621k906J5215K2348
$$ 234050 229274 233930 264886 257013 234113 229447 232936 233757 210762 169141 166235 181450 203798
12727B03798O543j1400q645Q555J5764l07l383k155K572M772j038j0635k07j5200
$$ 203798 210341 198941 190296 198851 214615 214308 210925 208770 211342 216114 215076 204441 204234 189034
12713A89034j864q20P447l75j6428j4803O141o854p435J2640j354j7703J2007
$$ 189034 187170 186350 193797 193422 176994 162191 168332 161478 154043 166683 165329 147626 159633
12700A59633J269k1553j2310j0202Q008J8950J323J1699l10R159O496j0958N77
$$ 159633 160902 139349 127039 116837 124845 143795 145118 156817 156507 165666 172162 161204 161781
12687A61781J5383l55O592P754o882j708J6710J547j9247k038m082j4034p23j5884
$$ 161781 177164 176809 183401 191155 184273 182565 199275 200822 181575 179537 175455 161421 160698 144814
12673A44814N801R245K3813N977k4321J257L155K090n716J0756n215n928k633
$$ 144814 150615 159860 183673 189650 165329 166586 169741 171831 166115 176871 171656 165728 163095
12660A63095j438j2448k0125k0309k0606l507j625k3569m012K1203K0555o734
$$ 163095 161657 149209 129084 108775 88169 84662 83037 59468 55456 76659 97214 90480
12648I0480j7501q358J5510P86K5008R768N119k1305k2775j3912J1165j0470M881
$$ 90480 72979 64621 80131 80917 105925 115693 120812 99507 76732 62820 73985 63515 68396
12635F8396O261r830n3362j0855K2243P301o521J618N243J2964J8646j8514r736
$$ 68396 74657 64827 11465 610 22853 30154 23633 25251 30494 43458 62104 43590 33854
12622C3854L052Q403J3603k5813k1641J1458R13R394R21n059k3627k2236k472
$$ 33854 36906 45309 58912 33099 11458 22916 23829 33223 34144 29085 5458 -16778 -19250
12609a9250L1710J1209j3030j319J2354K2997N732p936p997l3249n145J8705N369
$$ -19250 12460 23669 10639 9320 21674 44671 50403 42467 34470 1221 -3924 14781 20150
12596B0150k01J3573P945j9867o171O824J3146K848L1906r953n654q296l5562
$$ 20150 19949 33522 41467 21600 15429 22253 35399 38247 70153 60200 54546 46250 10688
12583A0688J255O98Q376P018r388n59J5222k9211k2245J6421j0273M997K5817
$$ 10688 11943 12641 21017 28035 18647 18088 33310 4099 -18146 -1725 -11998 -7001 18816
12570A8816O888O259k4278o368q530P868O888K0572J4042j0200q761j6386n698
$$ 18816 25704 31963 7685 1317 -7213 655 7543 28115 42157 31957 23196 6810 1112
12557A112Q924J95K1519J0109j9231K346k2421j3558L834J0891R197K577j0781
$$ 1112 10036 10231 31750 41859 22628 24974 2553 -11005 -7171 3720 12917 15494 4713
12544D713J8079L313j8465L607q778K126J9671k747m143K278j4670N94K7288K4325
$$ 4713 22792 26105 7640 11247 2469 4595 24266 21519 17376 19654 4984 5578 32866 57191
12530E7191K495j8683j4957p439J1891N200j0204j2085J4329K1249k2528L184
$$ 57191 59686 41003 26046 18607 30498 35698 25494 13409 27738 48987 26459 29643
12518B9643j045J06K236J0382k0067O94J3014n226O394l382J1219j7847l067K6113
$$ 29643 28598 28704 30940 41322 21255 21949 34963 29737 36131 32749 43968 26121 23054 49167
12504D9167N175j1059P793J1806j0146k1523l0752j2958k197J0024J2329J4753
$$ 49167 54342 43283 51076 62882 52736 31213 461 -12497 -14694 -4670 7659 22412
12492B2412M131j5362l000K5778M59L852J095n736K0054j0153j1571r66j1217
$$ 22412 26543 11181 8181 33959 34418 38270 39365 33629 53683 43530 31959 30993 19776
12479A9776j0416K2381N6334M0535K7606N8208N6656O6008J47243K53522K61371
$$ 19776 9360 31741 88075 128610 156216 214424 271080 337088 484331 737853 999224
12468I99224J93761J62947J92293J24389J5009k51109m77991l16442j78035q5501
$$ 999224 1192985 1355932 1548225 1672614 1687623 1436514 958523 642081 464046 378545
12458C78545n7036k3394k5372l7166j6970m558j9823k4330j7737k6552n444J1220
$$ 378545 321509 298115 272743 235577 218607 214049 194226 169896 152159 125607 120163 131383
12446A31383j6524k0789r540K903n113o718K094j3845J2888Q953j2517k9739k7917
$$ 131383 114859 94070 84530 87433 82320 75602 77696 63851 76739 85692 73175 43436 15519
12433A5519N290J9981L1478l771k4146N118o258m207P295L591j1240O305j1155
$$ 15519 20809 40790 72268 68497 44351 49469 43211 39004 46299 49890 38650 44955 33800
12420C3800n659L268K7386N86j8400K183k886M32J1910J8345R239j5553j5430
$$ 33800 28141 31409 58795 59381 40981 43164 40278 40710 52620 70965 80204 64651 49221
12407D9221k1855j8842N655K1752K6877J518j7939j7270j4471L9086J3041J1269
$$ 49221 27366 8524 14179 35931 62808 64326 46387 29117 14646 53732 66773 78042
12395G8042J0833j4891k0806o403p404J1107Q364M12k693q941p968k973L501j6487
$$ 78042 88875 73984 53178 46775 39371 50478 58842 59254 56561 47620 39652 36679 40180 23693
12381B3693k1160j7460K554J3149J5937q987j0943M623J1409N044P33J249p974
$$ 23693 2533 -14927 -12373 776 16713 7726 -3217 1406 12815 17859 18592 19841 11867
12368A1867k131o083r590L58Q949L2618L088k6339j6719r66m152r63Q988J5728
$$ 11867 9736 3653 -5937 -5579 3370 35988 39076 12737 -3982 -4948 -9100 -10063 -1075 14653
12354A4653J2912j4024j6546l786p977O109L9133j4168J516J0015k0829R58M831
$$ 14653 27565 13541 -3005 -6791 -14768 -8659 30474 16306 17822 27837 7008 7966 12797
12341A2797Q053k0298j5688m258L176r991J954M252J468K2124P866l116m989J4249
$$ 12797 20850 552 -15136 -19394 -16218 -26209 -24255 -20003 -18535 3589 11455 8339 3350 17599
12327A7599K294j0660k2364j6735J184o301J3085j5466j9862L448L1094J7099
$$ 17599 19893 9233 -13131 -29866 -28682 -34983 -21898 -37364 -57226 -53778 -22684 -5585
12315e585J1608K2053K080M210L608j4650Q632q753j0414J2919L4097j1755j4315
$$ -5585 6023 28076 30156 34366 37974 23324 31956 23203 12789 25708 59805 48050 33735
12302C3735j0950j1231J4242J3807j1980l320P208J7986J1145k9321j8278r722
$$ 33735 22785 11554 25796 39603 27623 24303 31511 49497 60642 31321 13043 3321
12290C321k5893P502P641L5637J336j5446K4621K0602J397k0303K227L262k1337
$$ 3321 -22572 -15070 -7429 28208 29544 14098 38719 59321 60718 40415 42642 45904 24567
12277B4567m129Q429r515j9375k920j3157J2673Q90K8733K1935k5006r368K4084
$$ 24567 20438 28867 19352 -23 -2943 -16100 -3427 -2537 26196 48131 23125 13757 37841
12264C7841J5263r031j0571N196k4487k3867J4726Q953P148P441r865k7047r445
$$ 37841 53104 44073 33502 38698 14211 -9656 5070 14023 21171 28612 18747 -8300 -17745
12251a7745J6761j0060J0682N428J749J0573J0143J1423k528j6062l624j2851
$$ -17745 -984 -11044 -362 5066 6815 17388 27531 38954 36426 20364 16740 3889
12239C889P182K0292J2342r424k5411j5334Q117J447P338J7605J1856n996j5485
$$ 3889 11071 31363 43705 34281 8870 -6464 1653 3100 10438 28043 39899 33903 18418
12226A8418O97n322m940j663j7563l6621K6743J9792Q904J037K726q878q97j3195
$$ 18418 19115 13793 8853 7190 -10373 -46994 -20251 -459 8445 9482 12208 3330 2433 -10762
12212a0762J4450Q501j8983k2506o514K8479K870P784q7o655j8438J6443J6724
$$ -10762 3688 12189 -6794 -29300 -35814 -7335 -4465 3319 3232 -3423 -21861 -5418 11306
12199A1306l958l324m313N68j4675M627J6914M902m737J590j0486M992J081k785
$$ 11306 7348 4024 -289 279 -14396 -9769 7145 12047 7310 8900 -1586 3406 4487 1702
12185A702m495M947R60L791R198j1107k1758J049N343K5681p462j9016j1159K9211
$$ 1702 -2793 2154 3114 6905 16103 4996 -16762 -15713 -10370 15311 7849 -11167 -22326 6885
12171F885R094Pm190J5731J2673j987O260k6666J3589K0525j5094j7994l046J4598
$$ 6885 15979 15986 11796 27527 40200 38213 44473 17807 31396 51921 36827 18833 15787 30385
12157C0385J173K1295K392j6168p020m739k1942p518J811L274k0719j7505j1452
$$ 30385 31558 52853 55245 39077 32057 27318 5376 -2142 -331 2943 -17776 -35281 -46733
12144d6733j2045M062J7852R711r879R505L438J8867J8810J0885L416J565R801
$$ -46733 -58778 -54716 -36864 -27153 -37032 -27527 -24089 -5222 13588 24473 27889 29454 39255
12131C9255N769J8375j123k1981j9141M936N151j639M641K459j3237n354N366
$$ 39255 45024 63399 62276 40295 21154 26090 31241 29602 34243 36702 23465 18111 23477
12118B3477N596J4441Q895k393l346j0309j5712j4581K2505J3424o507R496J7093
$$ 23477 29073 43514 52409 50016 46670 36361 20649 6068 28573 41997 35490 44986 62079
12105F2079n627j3609J3893P622n269r143j1758j0340k1533O099J3816J067K92
$$ 62079 56452 42843 56736 64358 59089 49946 38188 27848 6315 12414 26230 27297 27589
12092B7589k0207O56K5985o060q77m065j4448R120N178N145j4838l0385q217J5072
$$ 27589 7382 8038 34023 27963 27086 23021 8573 17693 22871 28016 13178 -17207 -25424 -10352
12078a0352J1641J756r210J4309L865J2743k1490k4365J0559j3863o286K1669
$$ -10352 1289 3045 -6165 8144 12009 24752 3262 -21103 -10544 -24407 -30693 -9024
12066i024m733J5348j6610k838L1299J7612M744J0822m39m3948j6378L6361n151
$$ -9024 -13757 1591 -15019 -17857 13442 31054 35798 46620 46181 2233 -14145 22216 17065
12053A7065k136j2048n764K679j033J034j2187j3217P416J8646K2788j9639j8474
$$ 17065 14929 2881 -2883 -204 -1237 -203 -12390 -25607 -18191 455 23243 3604 -14870
12040a4870p187J123J3218j4202j3757J4118r454N198r742j6170J4752J0033o949
$$ -14870 -22057 -20934 -7716 -21918 -35675 -21557 -31011 -25813 -35555 -51725 -36973 -26940 -33889
12027c3889J6126L4919J5006J1292k1767p748p9J359j0379j7301j1160l17R999
$$ -33889 -17763 17156 32162 43454 21687 13939 13860 15219 4840 -12461 -23621 -23938 -13939
12014a3939Q366r658j2309J8644j219k8914j090J8555Q885J2278J6656O26j9977
$$ -13939 -5573 -15231 -27540 -8896 -10115 -39029 -40119 -21564 -12679 -401 16255 16881 -3096
12001c096j322Q124J395j9988q9P254m338J7394L1473J4173N414r878j891j0650
$$ -3096 -4418 3706 5101 -14887 -14976 -7722 -12060 5334 36807 50980 56394 46516 44625 33975
11987C3975R593O795k2804k6931n087j601O912L4504j2859k1763K828p737j7380
$$ 33975 43568 50363 27559 628 -4459 -6060 852 35356 22497 734 3562 -4175 -21555
11974b1555R840m396P142m608J246j4519J4333K3409l661K715r450p817N595l253
$$ -21555 -11715 -16111 -8969 -13577 -12331 -26850 -12517 10892 7231 9946 496 -7321 -1726 -4979
11960d979J5012Q066N779O065J975K4549R77k3997k7689l0543m225L321j907J0863
$$ -4979 10033 18099 23878 29943 31918 56467 57444 33447 5758 -24785 -29010 -25689 -27596 -16733
11946a6733R057K671k2551J6029L7373P057j3365m284n295p538m007K0020k1561
$$ -16733 -7676 -5005 -27556 -11527 25846 32903 19538 15254 9959 2421 -1586 18434 -3127
11933c127j9566J9798k0044j7746Q012J2464j2519J6106M400K827N75k048Q105
$$ -3127 -22693 -2895 -22939 -40685 -32673 -20209 -32728 -16622 -12222 -9395 -8820 -10868 -2763
11920b763q86q61J2822Q948m775k6090l519J6208J7174L419j3450j4225L71m371
$$ -2763 -3649 -4510 8312 17260 12485 -13605 -17124 -916 16258 19677 6227 -7998 -7627 -11998
11906a1998L664Q638r211j3678K465L745P089P855J2415P601o487K211O939p116
$$ -11998 -8334 304 -8907 -22585 -20120 -16375 -9286 -1431 10984 18585 12098 14309 21248 14132
11892A4132k636o355p372J4814J1851K167k27p624J318m504k0199L614N725M641
$$ 14132 11496 5141 -2231 12583 24434 26601 26374 18750 20068 15564 -4635 -1021 4704 9345
11878I345n950J3943n57k4059j8928J0534J1040K3209n100J3244n386k6117k005
$$ 9345 3395 17338 16781 -7278 -26206 -15672 -4632 18577 13477 26721 21335 -4782 -6787
11865f787J274Q46j3969o272m674O02p3L872J4988r746k0002J9167M994J5343
$$ -6787 -5513 -4667 -18636 -24908 -29582 -28980 -29053 -25181 -10193 -19939 -39941 -20774 -15780 -437
11851d37K6217J4304p092J356M09K1079M283j3844k1720j5914p20j6283q946N586
$$ -437 25780 40084 32992 34348 34757 55836 60119 46275 24555 8641 7921 -8362 -17308 -11722
11837a1722K035j977l774j3191j0685O602J8967Q706k260k1372k4878L084K4281
$$ -11722 -9687 -11664 -15438 -28629 -39314 -32712 -13745 -5039 -7299 -28671 -53549 -50465 -26184
11824b6184n239j8272K1364K193J4895J3235q484k1726J4065K3561N049J4861
$$ -26184 -31423 -49695 -28331 -26138 -11243 1992 -6492 -28218 -14153 9408 14457 29318
11812B9318L552l8442k9406L2218K4980q642j3646j7253N396K8300M237j9223
$$ 29318 32870 -5572 -34978 -2760 22220 13578 -68 -17321 -11925 16375 20612 1389
11800A389k5366k809J5779K0311O427q285k4757n948R763O755m554p555K1870
$$ 1389 -23977 -26786 -11007 9304 15731 7446 -17311 -23259 -13496 -6741 -11295 -18850 3020
11787C020J8128j9786O930O247J3702j4950r572Q310P26j2248j0716j2846r259
$$ 3020 21148 1362 8292 14539 28241 13291 3719 12029 12755 507 -10209 -23055 -32314
11774c2314l254O378J0982K8797L0012j4203J7494J831k9894j8773k501r007j432
$$ -32314 -35568 -29190 -18208 10589 40601 26398 43892 45723 15829 -2944 -5445 -14452 -15884
11761a5884j439J9665J5012J2531j1652m413J0361Q916k65l494n99o575j5211
$$ -15884 -17323 2342 17354 29885 18233 13820 24181 33097 32832 29338 28739 22164 6953
11748F953O309J935L966J1432j0945P75O618J2750L546j4589j2550l4506J2384
$$ 6953 13262 15197 19163 30595 19650 20425 27043 39793 43339 28750 16200 -18306 -5922
11735e922L0216J394r352j3641k457K5074k338j4421J3341J1677j4008q631j5802
$$ -5922 24294 25688 16336 2695 238 25312 22974 8553 21894 33571 19563 10932 -4870
11722d870j8231K2858O210j4944l1121J1407J9332M623j379o849M248J8446K2638
$$ -4870 -23101 -243 5967 -8977 -40098 -28691 -9359 -4736 -6115 -12964 -8716 9730 32368
11709C2368m591J709k8610L526j285j4907j4377O402j3444o500M311N194K4978
$$ 32368 27777 29486 876 4402 3117 -11790 -26167 -19765 -33209 -39709 -35398 -30204 -5226
11696e226R30j5696j5413K528N659J528L2167L053k0857q511K210N357m232K586
$$ -5226 -4296 -19992 -35405 -32877 -27218 -25690 6477 9530 -11327 -19838 -17628 -12271 -16503 -13917
11682a3917J2532N006K3080m773J1326n409p353M198l624k545J8333k4753j8537
$$ -13917 -1385 3621 26701 21928 33254 27845 20492 24690 21066 18521 36854 12101 -6436
11669f436Q488J0910r703j260K767n635l361j699j6071J1215J4936p360J0540
$$ -6436 2052 12962 3259 1999 4766 -869 -4230 -5929 -22000 -10785 4151 -3209 7331
11656G331J3852j0894k1414l918j742J4402m718k4655L950J1738J31R255J5685
$$ 7331 21183 10289 -11125 -15043 -16785 -2383 -7101 -31756 -27806 -16068 -15937 -6682 9003
11643I003K2798j916k6484j084m954O30o473J5637J3124M506j0049n693j174k3678
$$ 9003 31801 29885 3401 2317 -2637 -2007 -8480 7157 20281 24787 14738 9045 7871 -15807
11629a5807K5009J4266r826k7785j1008K3362L08K397k0304K582J6153P951j6486
$$ -15807 9202 23468 13642 -14143 -25151 -1789 -1481 916 -19388 -16806 -653 7298 -9188
11616i188j0440O6J4302j2087l430J239o398J6495K3820j1863J3669K750N736
$$ -9188 -19628 -19562 -5260 -17347 -20777 -19538 -25936 -9441 14379 2516 16185 18935 24671
11603B4671J0269R410M118n491p14o121j488J327l485P07j0677j6970j3973l9678
$$ 24671 34940 44350 48468 42977 42263 36142 34654 35981 32496 33203 22526 5556 -8417 -48095
11589d8095O673K7414P672Q973Q350j0876j2910J6642J5582J0067K0696j2626
$$ -48095 -41422 -14008 -6336 2637 10987 111 -12799 3843 19425 29492 50188 37562
11577C7562m3395j3093J6041Q86L461j516q888M634K3420n15p633k0793l415R060
$$ 37562 -5833 -18926 -2885 -1999 1462 -54 -8942 -4308 19112 18597 10964 -9829 -13244 -4184
11563d184p965J0881J1919j0489j1055J6643m174n381L074K391l719l0318M966
$$ -4184 -12149 -1268 10651 162 -10893 5750 1576 -3805 -731 1660 -2059 -32377 -27411
11550b7411K4083J5843l066q132r695K0157K3050J6274p687k6258l1750J907j5127
$$ -27411 -3328 12515 9449 1317 -8378 11779 34829 51103 43416 17158 -14592 -12685 -27812
11537b7812p448J2462J5432j5220J2963J3220k0499k544J7293n019O908J254k2695
$$ -27812 -35260 -22798 -7366 -22586 -9623 3597 -16902 -19446 -2153 -7172 -264 990 -21705
11524b1705j8390K4718K5559K2173l1187k677l160n725J985o021p21J926o777
$$ -21705 -40095 -15377 10182 32355 1168 -1509 -4669 -10394 -8409 -14430 -15151 -13225 -20002
11511b0002M015m115J0504J0517l148k1661J2736j050J7636n059j0066n777j2625
$$ -20002 -15987 -20102 -9598 919 -2229 -23890 -11154 -12204 5432 373 -9693 -15470 -28095
11498b8095K467J2791P038Q647K365Q828j909j8485J6153O897M222M873j4922
$$ -28095 -25628 -12837 -5799 2848 5213 14041 12132 -6353 9800 16697 20919 25792 10870
11485A0870q619k137j0303Q65q748l62K6196L3061L1457o159l1706p361j3591
$$ 10870 2251 114 -10189 -9324 -18072 -18434 7762 40823 72280 66121 34415 27054 13463
11472A3463j3977j2735J5745j15O824j1596o829J681j8260J1988P005k5709j0963
$$ 13463 -514 -13249 2496 2381 9205 -2391 -9220 -7539 -25799 -13811 -6806 -32515 -43478
11459d3478J2384L147O836q85L387N967P164j4324j5926J3055J3800J6395J9965
$$ -43478 -31094 -27947 -21111 -21996 -18609 -12642 -5478 -19802 -35728 -22673 -8873 7522 27487
11446B7487j9972j0205k196p771J2792J2358K5309J0690l420j465k4539O802J656
$$ 27487 7515 -2690 -4886 -12657 135 12493 37802 48492 45072 43607 19068 25870 27526
11433B7526k5521j2052Q490K462K450m805J3036N101m694j4349m761k822M148
$$ 27526 2005 -10047 -1557 905 3355 -1450 11586 16687 11993 -2356 -7117 -9939 -5791
11420e791N351o849J4147j1319j8670J3450K1738J0130L905k621K3466J0557j7512
$$ -5791 -440 -7289 6858 -4461 -23131 -9681 12057 22187 26092 23471 46937 57494 39982
11407C9982k3590j1376o917L839R256o432J8492L001O241Q121l689k5620k5554
$$ 39982 16392 5016 -1901 1938 11194 4762 23254 26255 32496 40617 36928 11308 -14246
11394a4246J6083N744k531j2516l178J1887q304K357K0055J0194j337j4932k0917
$$ -14246 1837 7581 5050 -7466 -10644 1243 -7061 -4704 15351 25545 24208 9276 -11641
11381a1641k289K1383J5902k93j5403K0945J9588j5146j0325q616k1440k3827
$$ -11641 -13930 7453 23355 23062 7659 28604 48192 33046 22721 14105 -7335 -31162
11369c1162m822K2372N918k0852J4481J5361j5792k2755J9317J896j0804j1081
$$ -31162 -35984 -13612 -7694 -28546 -14065 1296 -14496 -37251 -17934 -16038 -26842 -37923
11357c7923j944N896j4253m653M501j3347Q413L1547J6459p948k3149J1786L6677
$$ -37923 -39867 -33971 -48224 -52877 -48376 -61723 -53310 -21763 -5304 -13252 -36401 -24615 12062
11344A2062J731j5656J4215k916k423o822r612j4835r374Q031J4450j7645l4587
$$ 12062 13793 -1863 12352 9436 7013 191 -9421 -24256 -33630 -25599 -11149 -28794 -63381
11331f3381Q341M3401J0257K4661j2965k3848j4305O992N729P395K3537q223k3059
$$ -63381 -55040 -11639 -1382 23279 10314 -13534 -27839 -20847 -15118 -7723 15814 7591 -15468
11318a5468l502J7504J3563J9549J6484Q114j4236k1671k7763Q416q740m037l576
$$ -15468 -18970 -1466 12097 31646 48130 56244 42008 20337 -7426 990 -7750 -11787 -15363
11305a5363J2357K170Q674L412n197q937j1280q309J5109p757j9917J2040J1242
$$ -15363 -3006 -836 7838 11250 6053 -2884 -14164 -22473 -7364 -15121 -35038 -22998 -11756
11292a1756j5948J7927J2171K057R999L199J618k3253j0095j342P787n800r82
$$ -11756 -27704 -9777 2394 4451 14450 17649 19267 -3986 -14081 -15423 -7636 -13436 -14418
11279a4418K8680n766q959k485o22j0042r261J0201K882j7203J9698J7272J3896
$$ -14418 14262 8496 -463 -2948 -3570 -13612 -22873 -12672 -9790 -26993 -7295 9977 23873
11266B3873J0439m287N54j6287N427j26k0044j4093j3889Q275K519K1910r2j4686
$$ 23873 34312 30025 30579 14292 19719 19593 -451 -14544 -28433 -20158 -17639 4271 4179 -10507
11252a0507n477m84K2164L43j4814l2302q261J9173J2555J1190J5031l668O842
$$ -10507 -15984 -16468 5696 6039 -8775 -41077 -49338 -30165 -17610 -6420 8611 4943 11785
11239A1785m801M475j239q173J273n62p091q989j414J1768R75J1868J5039k336
$$ 11785 6984 11459 10220 2047 3320 2758 -4333 -13322 -14736 -2968 -1993 9875 24914 22578
11225B2578q96p472K397j4397j8594k0415m014J8667J7453O224k238j5076O956
$$ 22578 21682 14210 16607 2210 -16384 -36799 -40813 -22146 -4693 1531 -707 -15783 -8827
11212h827L970n059L026r8K1011q174j9298j2411M175J6088L216J5796J6484p869
$$ -8827 -4857 -9916 -6890 -6988 14023 5849 -13449 -25860 -21685 -5597 -2381 13415 29899 22030
11198B2030J4595j2422k7251L27J3588J3281j2951j4896j4505n616K928J4478
$$ 22030 36625 24203 -3048 -2721 10867 24148 11197 -3699 -18204 -23820 -20892 -6414
11186f414J9966J39j0929l4415j9028j5012o287O007J1712J7172n062M314J2202
$$ -6414 13552 13691 2762 -31653 -50681 -65693 -71980 -65973 -54261 -37089 -42151 -37837 -25635
11173b5635K0562J5476n782k369p231k288q365N125Q974j1568l340J1923L126
$$ -25635 -5073 10403 4621 2252 -4979 -7267 -15632 -10507 -1533 -13101 -16441 -4518 -1392
11160a392J6324k389Q407j0763K064j7947k0930J985R768n104M866K945M7542
$$ -1392 14932 12543 20950 10187 12251 -5696 -26626 -24641 -14873 -19977 -15111 -12166 35376
11147C5376j8004k2055j1995l357m560J5181Q599q830J912J0937M537R422K0395
$$ 35376 17372 -4683 -16678 -20035 -24595 -9414 -815 -9645 -7733 3204 7741 17163 37558
11134C7558j0684k3137L43j741M505r330j5408M523l721J1293j882k3966j5315
$$ 37558 26874 3737 4080 2339 6844 -2486 -17894 -13371 -17092 -5799 -7681 -31647 -46962
11121d6962J6020P354P90Q525K22L5203q766p504q545o976k3523j4150K2103J5612
$$ -46962 -30942 -23588 -22798 -14273 -14051 21152 12386 4882 -3663 -10639 -34162 -48312 -26209 -10597
11107a0597r954K0002J7757J2058j5522P230J486k577j6989J2458O336q195M301
$$ -10597 -20551 -549 17208 29266 13744 20974 22460 19883 2894 15352 21688 13493 17794
11094A7794m870j2813J612q8M285n154n70J8496Q065N47M08p710j0091k9343j3653
$$ 17794 12924 111 1723 1635 5920 766 196 18692 26757 27304 27712 20002 9911 -19432 -33085
11079c3085J0780J8169R712q332J35m939j1501j1358q395J3149J4010J1568o215
$$ -33085 -22305 -4136 5576 -2756 -2621 -7560 -19061 -30419 -38814 -25665 -11655 -87 -6302
11066f302m833L714J8072J1561K5144J16j3787j5941q122M569Q726j2008j3764
$$ -6302 -11135 -7421 10651 22212 47356 47472 33685 17744 9622 14191 22917 10909 -2855
11053b855K5790j4456j1349O774j3009m928J4538P768M721j6000m615J857r728
$$ -2855 22935 8479 -2870 3904 -9105 -14033 505 8273 12994 -3006 -7621 -5764 -15492
11040a5492J3947j489k4210J343K1718K184O690K0705N841k0697J3273q42j3471
$$ -15492 -1545 -3034 -27244 -25901 -4183 -1999 4691 25396 31237 10540 23813 22971 9500
11027I500l1071j4531K431q063J6925M216J6406J5561k812p457L679j2309j8086
$$ 9500 -21571 -36102 -33671 -41734 -24809 -20593 -4187 11374 8562 1105 4784 -7525 -25611
11014b5611r610J2396P089J4068r61j6792L07n313Q422K4734j419j8582k5608
$$ -25611 -35221 -22825 -15736 -1668 -2629 -19421 -19114 -24427 -16005 8729 7310 -11272 -36880
11001c6880J9736J8782R543r84K754J1751J08o298k006R777O135k456j3242J1486
$$ -36880 -17144 1638 11181 10197 12951 24702 24810 18512 16506 26283 32418 29962 16720 28206
10987B8206J0679j016j6169j9955P844J3213R431k300Q76r168k6975j771J1788
$$ 28206 38885 37869 21700 1745 9589 22802 32233 29933 30809 21641 -5334 -7105 4683
10974D683Q37j7646m417J532j0480J3558J8388K459j2401Q207J1494M269j853
$$ 4683 5520 -12126 -16543 -15011 -25491 -11933 6455 8914 -3487 4720 16214 20483 18630
10961A8630p576J5177j103j7444j0290J1956O493q099k5137L028K4791J6087j2336
$$ 18630 11054 26231 25128 7684 -2606 9350 15843 7744 -17393 -14365 10426 26513 14177
10948A4177m413r080k6960j3593J1071J8534l249J0791Q150M795J3896j1564q824
$$ 14177 9764 684 -26276 -39869 -28798 -10264 -13513 -2722 5428 10223 24119 12555 3731
10935C731Pj5620j0302P813p34J5714j683l201q976J0238K4159l531j6638l5899
$$ 3731 3738 -11882 -22184 -14371 -15105 609 -1074 -4275 -13251 -3013 21146 17615 977 -34922
10921c4922L993N178K385J9673j1266Q003j0729K049P598J1667n344j0176L121
$$ -34922 -30929 -25751 -23366 -3693 -14959 -6956 -17685 -15636 -8038 3629 -1715 -11891 -8770
10908h770O11o020J0195J7810j3306q308Q85j8111j309p644K3774K2014l136m950
$$ -8770 -8159 -14179 -3984 13826 520 -7788 -6903 -25014 -26323 -33967 -10193 11821 8685 3735
10894C735J410l194J871n265j2216j0670o169j710K8709P039k399j7885J4218
$$ 3735 5145 1951 3822 -1443 -13659 -24329 -30498 -32208 -3499 3540 1141 -16744 -2526
10881b526J5173l504J1755j6490j14l715o323N83J836L5409O941n003J8852J5659
$$ -2526 12647 9143 20898 4408 4294 579 -5744 -5161 -3325 32084 39025 34022 52874 68533
10867F8533O129j7468o604k1562j5694L328K5363N264r937k174J0658N888q981
$$ 68533 74662 57194 50590 29028 13334 16662 42025 47289 37352 35178 45836 51724 42743
10854D2743j3034k1796k1202k245K1130l80J9615r44j220j7227j1038O72j2738
$$ 42743 29709 7913 -13289 -15534 5596 5216 24831 23887 22667 5440 -5598 -4926 -17664
10841a7664K507J580j0995j4846O343n249n612R889j484Q410Q098K2950J217n437
$$ -17664 -15157 -13577 -24572 -39418 -33075 -38324 -43936 -34047 -35531 -27121 -19023 3927 5144 -293
10827b93q620J1145J16j5714k3698K775J3322M903o800M695p226j12R274N057
$$ -293 -8913 2232 2348 -13366 -37064 -34289 -20967 -16064 -22864 -18169 -25395 -25507 -16233 -11176
10813a1176K953m570K0138R442n889J1534J8583j8402o574q135j0344n632j5152
$$ -11176 -8223 -12793 7345 16787 10898 22432 41015 22613 16039 7904 -2440 -8072 -23224
10800b3224Q231K478K1597K4699Q19o019K687J3483n974n579j2120j8765R66O508
$$ -23224 -14993 -12515 9082 33781 34600 28581 31268 44751 38777 33198 21078 2313 3279 9787
10786I787n889o189P634p146k0028L258J4016K431L80j6223l991o121J4952M710
$$ 9787 3898 -2291 5343 -1803 -21831 -18573 -4557 -2126 -1746 -17969 -21960 -28081 -13129 -8419
10772h419J592N686j7651j2149J2133J0376R889L622J1660l768m958j7103k1656
$$ -8419 -6827 -1141 -18792 -30941 -18808 -8432 1457 5079 16739 12971 8013 -9090 -30746
10759c0746L993J5488J1883r548N630Q663J2647N085N218k862o030P617j08j2093
$$ -30746 -26753 -11265 618 -8930 -3300 5363 18010 23095 28313 25451 19421 27038 26930 14837
10745A4837l314O429J1673k2157j1953j794J3226J2777r673r138j1903J8449J0755
$$ 14837 11523 17952 29625 7468 -4485 -6279 6947 19724 10051 913 -10990 7459 18214
10732A8214J97l187r115J7796J4307j5116j3666j9767n621K946j938P232J2773
$$ 18214 18411 15224 6109 23905 38212 23096 9430 -10337 -15958 -13012 -14950 -7718 5055
10719E055J1876j3229J384J4018n403q297r705o756J4576k262j8097J158n385
$$ 5055 16931 3702 5086 19104 13701 5404 -4301 -11057 3519 1257 -16840 -15682 -21067
10706b1067r431k737J2176m528q132J0551K3457Q001j7453L373K8570O020j6644
$$ -21067 -30498 -33235 -21059 -25587 -33719 -23168 289 8290 -9163 -5790 22780 28800 12156
10693A2156m104p350l792J5036N248k7351o144J0262l000k4472J6807K9400m578
$$ 12156 8052 702 -3090 11946 17194 -10157 -16301 -6039 -9039 -33511 -16704 12696 8118
10680H118j4384m042J4149J8019N90k4223o97M249L85j3046J2444K1893l580p148
$$ 8118 -6266 -10308 3841 21860 22450 -1773 -2470 1779 2164 -10882 1562 23455 19875 12727
10666A2727j6777j6146j1505O989J1964J5486J9350J220j790J169L893J4656j9016
$$ 12727 -4050 -20196 -31701 -24712 -12748 2738 22088 23308 21518 22687 26580 41236 22220
10653B2220l4894J0586J0579k903K8925L0463J2583j8861j1289N599N776k154
$$ 22220 -12674 -2088 8491 5588 34513 64976 77559 58698 47409 53008 58784 56630
10641E6630l1535k9962r028M741J5756L95p749L641j2130o901M182q272J2199
$$ 56630 25095 -4867 -13895 -9154 6602 6997 -752 2889 -9241 -16142 -11960 -20232 -8033
10628h033J1067J299j2735j4753J2096R502k0735n654K5564L845o00n835j7167
$$ -8033 3034 4333 -8402 -23155 -11059 -1557 -22292 -27946 -2382 1463 863 -4972 -22139
10615b2139J7643O316j534Q303j3286q005j1975O465J348j2548n10J1293J6245
$$ -22139 -4496 1820 286 8589 -4697 -12702 -24677 -18212 -16864 -29412 -29922 -18629 -2384
10602b384j3870j542m278m891p796j600R03L189L32Q481J7053J3440J163n415
$$ -2384 -16254 -17796 -22074 -26965 -34761 -36361 -35458 -32269 -31937 -23456 -6403 7037 8200 2785
10588B785j669k760O831j0063J880J3721K735n434j0705k630j7300p461p832P513
$$ 2785 1116 -1644 5187 -4876 -2996 10725 13460 8026 -2679 -5309 -22609 -30070 -37902 -30389
10574c0389K4795j582p493J1392j8590J765Q447M390j1353j853k479M351K8920
$$ -30389 -5594 -7176 -14669 -3277 -21867 -20102 -11655 -7265 -18618 -20471 -22950 -18599 10321
10561A0321J3571m210L200j1560l117j1262J5730l228k176j1119k4271J0653J7246
$$ 10321 23892 19682 22882 11322 8205 -3057 12673 9445 7269 -3850 -28121 -17468 -222
10548b22l394L077J6145O435n209m403R80j0510j5393k2099J8604L0705K1900
$$ -222 -3616 -539 15606 22041 16832 12429 13409 2899 -12494 -34593 -15989 14716 36616
10535C6616J900l5743n232k239m393J9948L93J7217K499k1651k0355l806Q716
$$ 36616 38516 2773 -2459 -4698 -9091 10857 11250 28467 30966 9315 -11040 -14846 -6130
10522f130j2774Q25J2113L211J7330n701q915J434o633j558l653P039K2535j2908
$$ -6130 -18904 -18079 -5966 -2755 14575 8874 -41 1393 -5240 -6798 -10451 -3412 19123 6215
10508F215j1755j396l7N763j3042N282l728K568q462m639K8003J458J2520r16
$$ 6215 -5540 -6936 -6973 -1210 -14252 -8970 -12698 -10130 -18592 -23231 4772 6230 18750 17834
10494A7834k7635M321P800J2705L0942l18k3964l298q763l649l520R444j5523
$$ 17834 -9801 -5480 2320 15025 45967 45649 21685 18387 9624 5975 2455 11899 -3624
10481c624r015o048o501o230m649j4673Q856L6068K7813K193l004p142l782J0950
$$ -3624 -12639 -18687 -25188 -31418 -36067 -50740 -41884 -5816 21997 24190 21186 14044 10262 21212
10467B1212N792k3963j4874J315k281j127j0408N114K2443J8483K609n592J591
$$ 21212 27004 3041 -11833 -10518 -12799 -13926 -24334 -19220 3223 21706 24315 18723 20314
10454B0314K942j2387l5721k9061J542K3386J2358J1724j10r809j6875N144J2588
$$ 20314 23256 10869 -24852 -53913 -52371 -28985 -16627 -4903 -5013 -14822 -31697 -26553 -13965
10441a3965R136J974k233J7787R377j0724o881Q323J4535j3316k4054m539N469
$$ -13965 -4829 -2855 -5088 12699 22076 11352 4471 12794 27329 14013 -10041 -14580 -9111
10428i111N958p276P165p01j027J648Q253J610M068q287j9329q352K30J3465K3672
$$ -9111 -3153 -10429 -3264 -3965 -4992 -3344 4909 6519 10587 2300 -17029 -25381 -25151 -11686 11986
10413A1986r319l39j9272k6574j4356K0214L7823k184n450K0947N599p096q62
$$ 11986 2667 2328 -16944 -43518 -57874 -37660 163 -2021 -7471 13476 19075 11979 11117
10400A1117j5775j8221L0249J7883m693p73k3341J7386J3034j3871o865L039p874
$$ 11117 -4658 -22879 7370 25253 20560 19787 -3554 13832 26866 12995 6130 9169 1295
10387A295o511j393J64J3404J0597M321Q252j4788o953p668r898J852J1236J5707
$$ 1295 -5216 -6609 -6445 6959 17556 21877 30129 15341 8388 720 -9178 -7326 3910 19617
10373A9617o51j9634q034J1191J2302m5570k2587K8921K5619K453J2345J2740
$$ 19617 18966 -668 -8702 2489 14791 -30779 -53366 -24445 1174 3627 15972 28712
10361B8712j2936n050o809r228J914j2477k720J1658N304J779j7531j0527K1552
$$ 28712 15776 10726 3917 -5311 -3397 -15874 -18594 -6936 -1632 147 -17384 -27911 -6359
10348f359O137j852K914M439j1866M054j8216K732K5874j1342j0274J029P896
$$ -6359 -222 -2074 840 5279 -6587 -2533 -20749 -18017 7857 -3485 -13759 -12730 -4834
10335d834Q471j3030l054J7751K1381r865k4706Q148O78q256K6834J5999n107
$$ -4834 3637 -9393 -12447 5304 26685 16820 -7886 262 940 -7316 19518 35517 30410
10322C0410j2819K241K305p026j4940j1555j6660L876K2416P465n788J0780Q569
$$ 30410 17591 19832 22137 15111 171 -11384 -28044 -24168 -1752 5713 -75 10705 19274
10309A9274L546J1080k7104J0779N531r645l5366m521K7389J4973J7461q202q992
$$ 19274 22820 33900 6796 17575 23106 13461 -21905 -26426 963 15936 33397 25195 16203
10296A6203N971J4561J0565l915j2197j0743O362J3088n29L290l648k8801k5452
$$ 16203 22174 36735 47300 43385 31188 20445 26807 39895 39366 42656 39008 10207 -15245
10283a5245l002J0862Q126j5357n08J8420m100O018J8376J5034J2448L469q885
$$ -15245 -18247 -7385 741 -14616 -15124 3296 -804 5214 23590 38624 51072 54541 45656
10270D5656k2902M825k0024o502M696M15j5780q58J6065O451p484J0422K0099
$$ 45656 22754 27579 7555 1053 5749 6164 -9616 -10474 5591 12042 4558 14980 35079
10257C5079J5655j6673o562J477m0764q729J9312M649J9356K7498j2513j9919
$$ 35079 50734 34061 27499 28976 -11788 -20517 -1205 3444 22800 50298 37785 17866
10245A7866n147N35o736M861K011N083n0K4657J2935k0004j2785o3Q173k4416
$$ 17866 12719 13254 6518 11379 13390 18473 18423 43080 56015 36011 23226 23163 31336 6920
10231F920j3513L202J4525q134k8093l926n249N418J6551M3435R458k4961k6084
$$ 6920 -6593 -3391 11134 3000 -25093 -29019 -34268 -28850 -12299 31136 40594 15633 -10451
10218a0451j9159M364J3614j6754m920K6247J6907J5921q486j1673M164k1364
$$ -10451 -29610 -25246 -11632 -28386 -33306 -7059 9848 25769 17283 5610 9774 -11590
10206a1590j2175M713M142L933L2235K167j3110j1538k0037J5532J5586n384N581
$$ -11590 -23765 -19052 -14910 -10977 21258 23425 10315 -1223 -21260 -5728 9858 4474 10055
10193A0055L270k897n266k43n618m904j068k1611J373M751j2660O890J8624J3025
$$ 10055 13325 10428 5162 4919 -699 -5603 -6671 -28282 -26909 -22158 -34818 -27928 -9304 3721
10179C721j5651k0639K5165J9128j2907J126K4428P377p819L638j7593L918Q463
$$ 3721 -11930 -32569 -7404 11724 -1183 -57 24371 31748 23929 27567 9974 13892 22355
10166B2355M823p317q856j3498N192r405k1100k3145J1134J9781K2552P15Q098
$$ 22355 27178 19861 11005 -2493 2699 -6706 -27806 -50951 -39817 -20036 2516 3231 11329
10153A1329M80M263p270R515l629p247R812L803N752R046j4298j8430p291j179
$$ 11329 11809 16072 8802 18317 14688 7441 17253 21056 26808 35854 21556 3126 -4165 -5344
10139e344l159j8991J0523K3309N745n581J6691k069q145j6136J2098J0368j9264
$$ -5344 -8503 -27494 -16971 6338 12083 6502 23193 21124 12979 -3157 8941 19309 45
10126D5O211l918m05j4237O612j1534l067J1200q355P968J5866j1505Q90M01j94
$$ 45 6256 2338 1933 -12304 -5692 -17226 -20293 -9093 -17448 -9480 6386 -5119 -4229 -3828 -4022
10111d022n983K9502J4508k6160j2551K212j3395r542O890P752m698j2578j0943
$$ -4022 -10005 19497 34005 7845 -4706 -2494 -15889 -25431 -18541 -10789 -15487 -28065 -39008
10098c9008J9555K1103j7645m384J0713j8434m192M797L615R175J8225j348j3805
$$ -39008 -19453 1650 -15995 -20379 -9666 -28100 -32292 -27495 -23880 -14705 3520 2172 -11633
10085a1633l683M218J4633j6070k138K083K672M659R401R86J2290j3764j1804
$$ -11633 -15316 -11098 3535 -12535 -14673 -12590 -9918 -5259 4142 5128 17418 3654 -8150
10072h150J6179l172o151l1788J4181K5814o341O29M051q941M396m018p321j7640
$$ -8150 8029 4857 -1294 -33082 -18901 6913 572 1201 5252 -3689 707 -3311 -10632 -28272
10058b8272J6574J4801j1797N096K7301p404J087J7264K4644O281N717P577l4132
$$ -28272 -11698 3103 -8694 -3598 23703 16299 17386 34650 59294 65575 71292 78869 44737
10045D4737j2680n258o32k250j3488j1970L151M157N093k915J0149j9896r156
$$ 44737 32057 26799 26167 23917 10429 -1541 1610 5767 10860 7945 18094 -1802 -10958
10032a0958q565R524J2587o275k735j5559L879l034P613p135N557J826J6803J6760
$$ -10958 -19523 -9999 2588 -3687 -6422 -21981 -18102 -21136 -13523 -20658 -15101 -13275 3528 20288
10018B0288j171q050J4004r223j4839R168n248L341J0973j3083k1600J5478J2237
$$ 20288 19117 11067 25071 15848 1009 10177 4929 8270 19243 6160 -15440 38 12275
10005A2275L785j6649q774O987J1072J194k4192j926K8263m061L128m871J0155
$$ 12275 16060 -589 -9363 -2376 8696 9890 -14302 -16228 12035 7974 11102 6231 16386
9992A6386K650J1757Q451j4118n166k5670l151p168J16L8460j1417p491J0151
$$ 16386 19036 30793 39244 25126 19960 -5710 -8861 -16029 -15913 22547 11130 3639 13790
9979A3790K4206j4298r292j3054o436J3695J3781l363k1671K2838R748k611j1306
$$ 13790 37996 23698 14406 1352 -5084 8611 22392 19029 -2642 20196 29944 27333 16027
9966A6027k2787P350J632J3599j3212N802k2298o797P312J0706Q746k85J6837
$$ 16027 -6760 590 2222 15821 2609 8411 -13887 -20684 -13372 -2666 6080 5795 22632
9953B2632n306M363K3164p18j3629j5019R929O290r379j0446K0544K9058J6414
$$ 22632 17326 21689 44853 44135 30506 15487 25416 31706 22327 11881 32425 61483 77897
9940G7897j3380j0144O84j7874j1767j4147j1498j5117K2953K8837J1973k2717
$$ 77897 64517 54373 55057 37183 25416 11269 -229 -15346 7607 36444 48417 25700
9928B5700j1664K1720q49k2733o338l600J7299r864j877J0515J8000q857j8679
$$ 25700 14036 35756 34907 12174 5836 2236 19535 9671 7794 18309 36309 27452 8773
9915H773m840o510Q144p391R928Q652K890N80j5213J4179O378M113n375r509l556
$$ 8773 3933 -2577 5567 -1824 8104 16756 19646 20226 5013 19192 25570 29683 24308 14799 11243
9900A1243J5782l020k899k431m83J8939j4098k446M929n225j1747j1043K239L951
$$ 11243 27025 24005 21106 18675 18192 37131 23033 20587 25516 20291 8544 -2499 -260 3691
9886C691J2111j0038p916p962k784K2636J3194j1573j2391o202R60J8010Q677
$$ 3691 15802 5764 -2152 -10114 -12898 9738 22932 11359 -1032 -7234 -6274 11736 20413
9873B0413j1630n370J1180j1248k5569J0864J4116j641M859r104J4774K7l655
$$ 20413 8783 3413 14593 3345 -22224 -11360 2756 1115 5974 -3130 11644 11671 8016
9860H016k445o904K2261j6916j3291J675O879J957K7420K7465j0260l0542l959
$$ 8016 5571 -1333 20928 4012 -9279 -7604 -725 1232 28652 56117 45857 15315 11356
9847A1356l531m515j7767J1169K2517J8584J4263M824j9746N196k330k6602j3531
$$ 11356 7825 3310 -14457 -3288 19229 37813 52076 56900 37154 42350 40020 13418 -113
9834a13N666j0384J4057o265J0253K1101J0980k5912q834o035j1053j7193J2696
$$ -113 5553 -4831 9226 2961 13214 34315 45295 19383 10549 4514 -6539 -23732 -11036
9821a1036R535K4311o87j5461J1398Q756j7761k7325M676J7522J180J01l715o846
$$ -11036 -1501 22810 22123 6662 18060 26816 9055 -18270 -13594 3928 5108 5209 1494 -5352
9807e352o050K4378J3105J9224k5166p135L276J794L159k957M022k2175M780J2970
$$ -5352 -11402 12976 26081 45305 20139 13004 16280 18074 21233 18276 22298 123 4903 17873
9793A7873j16P88p510m828q556k3699P931J5751j5979m814J5571J8403R582m103
$$ 17873 17757 18545 11035 6207 -2349 -26048 -18117 -2366 -18345 -23159 -7588 10815 20397 16294
9779A6294q378k5070J2138L6669J58j3696K157J7291J7991n181k9114q714J7615
$$ 16294 7916 -17154 -5016 31653 31811 18115 20272 37563 55554 50373 21259 12545 30160
9766C0160j0799j8165j0258K5280r196l014N881n653j4002l703N217K5542k2670
$$ 30160 19361 1196 -9062 16218 7022 4008 9889 4236 -9766 -13469 -8252 17290 -5380
9753e380j7293K1992Q786k4321J3191L3454l049K631O339n3k1194k3448P240P720
$$ -5380 -22673 -681 8105 -16216 -3025 30429 27380 30011 36350 36297 15103 -8345 -1105 6615
9739F615n928k3415J0718K282k991J1973K2278K312M889j7847n312L267l730j182
$$ 6615 687 -22728 -12010 -9728 -12719 -746 21532 23844 28733 10886 5574 8841 5111 3929
9725C929J6513l63O691J2941l646J0393K3827l262k9725k5182K4813K3606j2204
$$ 3929 20442 20079 26770 39711 36065 46458 70285 67023 37298 12116 36929 60535 48331
9712D8331J9M736n948j911J1502j269K0612Q972k4018l156j2578o631K2385j1207
$$ 48331 48350 53086 47138 45227 56729 55460 76072 85044 61026 57870 45292 38661 61046 49839
9698D9839k0410J753J5980K4995J9868j0104j414o476j2015O352n976j1346K1835
$$ 49839 29429 31182 47162 72157 92025 81921 80507 74031 62016 68368 62392 51046 72881
9685G2881L268J1207L991J2609q725J30n922k966K593j3106K887O871J3921J1261
$$ 72881 76149 87356 91347 103956 95231 95361 89439 86473 89066 75960 78847 85718 99639 110900
9671A10900k863K90N326l715J2793l122k4049p419l153K2764K3969m212L35J232
$$ 110900 108037 108327 113653 109938 122731 119609 95560 88141 84988 107752 131721 127509 127844 129076
9657A29076J3425N32j0950o169J5047J9360O208J6978R18R30j5495J2064K1094
$$ 129076 142501 143033 132083 125914 140961 160321 166529 183507 184425 185355 169860 181924 203018
9644B03018M612J8178M500L522J5201J3518K3987J1583P646Q550J9092J6448M4142
$$ 203018 207630 225808 230308 233830 249031 262549 286536 298119 305765 314315 333407 349855 393997
9631C93997L4514P934K1324K1811L9423L7750N2075O3814O2967P4455P4768P4181
$$ 393997 428511 436445 457769 479580 519003 556753 608828 672642 735609 810064 884832 959013
9619I59013O9315J00237R7111R1869Q7748J09386J03240Q2016J04251R8121P9447
$$ 959013 1028328 1128565 1225676 1317545 1405293 1514679 1617919 1699935 1804186 1902307 1981754
9608A981754O7162N5154P6531P5840Q9520O7138N1496L7332L8326N6089J3777
$$ 1981754 2048916 2104070 2180601 2256441 2345961 2413099 2464595 2501927 2540253 2596342 2610119
9597B610119J5218J4654M843K9181K9795J7410J6231J2634R249J3401l885j0661
$$ 2610119 2625337 2639991 2644834 2674015 2703810 2721220 2737451 2750085 2759334 2772735 2768850 2758189
9585B758189j2537k2689j3132l8916l7553J633J105k5271p995l3291k0131j4264
$$ 2758189 2745652 2722963 2709831 2670915 2633362 2634995 2636100 2610829 2602834 2569543 2549412 2535148
9573B535148l5063m1580k6373k5429l7177k0117n488j0618k9192j6712j2331q489
$$ 2535148 2500085 2458505 2432132 2406703 2369526 2349409 2343921 2333303 2304111 2287399 2275068 2266579
9561B266579n271j3374l5498l2762k6920l0949p129k1912l0153j3885l4877m3439
$$ 2266579 2261308 2247934 2212436 2179674 2152754 2121805 2114676 2092764 2062611 2048726 2013849 1970410
9549A970410r184J3548l6570m2032l8071m3539n6166n2032m3952m7501m5858l1915
$$ 1970410 1961226 1974774 1938204 1896172 1858101 1814562 1758396 1706364 1662412 1614911 1569053 1537138
9537A537138k4317j5514j7564m4641k3032k6562l6809j5788k8823l7570k2887
$$ 1537138 1512821 1497307 1479743 1435102 1412070 1385508 1348699 1332911 1304088 1266518 1243631
9526A243631k9551k7038l9541n8180m2382l5842k5228j9518k7324k7848k9303
$$ 1243631 1214080 1187042 1147501 1089321 1046939 1011097 985869 966351 939027 911179 881876
9515H81876m4781k5826j5320l4938m0363j6131j3336k1278l6636k0664k7643k0717
$$ 881876 837095 811269 795949 761011 720648 704517 691181 669903 633267 612603 584960 564243
9503E64243k1350j4790l1585k0095m3995k0836j5422j2552K243M421k1332l2378
$$ 564243 542893 528103 496518 476423 432428 411592 396170 383618 385861 390282 368950 336572
9491C36572j3392q119j0177P208k3228j2491j9995N096K7955J168j4267k8328
$$ 336572 323180 315061 304884 312092 288864 276373 256378 261474 289429 290597 276330 248002
9479B48002j6091p180j8845j0719o35j801k1090j5063N619K0131J8956K354j7142
$$ 248002 231911 224731 205886 195167 194532 192731 171641 156578 162197 182328 201284 203638 186496
9466A86496k4999l655p448m285k1502j5632K1170j464L131K1431P45K066j5967
$$ 186496 161497 157842 150394 146109 124607 108975 130145 128681 131812 153243 153988 156054 140087
9453A40087j0900k1264k5132p435J969K3783P276j1730j2568o709Q327m821j3354
$$ 140087 129187 107923 82791 75356 77325 101108 108384 96654 84086 77377 85704 80883 67529
9440F7529k197Q682m327O473J6753L728q865j0752q55Q899n794m423n715k3745
$$ 67529 65332 74014 69687 76160 92913 96641 87776 77024 76169 85068 79274 74851 69136 45391
9426D5391j5520P113J159K4044j7900l223R00j3170n654L235J6884J7818J7560
$$ 45391 29871 36984 38143 62187 44287 41064 41964 28794 23140 26375 43259 61077 78637
9413G8637r534l972K9345k124l4672r846m26J6494r389M651j0239k7063J4552
$$ 78637 69103 65131 94476 92352 57680 47834 47408 63902 54513 59164 48925 21862 36414
9400C6414K1711j3696n5015r031J6532J3764M8040J3872l046j4165j1536m136
$$ 36414 58125 44429 -10586 -19617 -3085 10679 58719 72591 69545 55380 43844 39708
9388C9708Q922M202k5820k5285r837l39J181j391J6137K6888J0418l3787K992
$$ 39708 48630 52832 27012 1727 -8110 -8449 -7268 -8659 7478 34366 44784 10997 13989
9375A3989K9879J550k1138r679q860L015K3461R509q329L320j328m168m722R34
$$ 13989 43868 45418 24280 14601 5741 8756 32217 41726 33397 36717 35389 31221 26499 27433
9361B7433j7548j993q434N253L696j514N577N022L943K0145k569P349J8395o37
$$ 27433 9885 7892 -542 4711 8407 6893 12470 17492 21435 41580 39011 46360 64755 64118
9347F4118j8308l6563k583K82Q950M204N971q393R327k6185m412j8394K5932L9056
$$ 64118 45810 9247 6664 6946 15896 20100 26071 17678 27005 820 -3592 -21986 3946 43002
9333D3002j1536r818r26k311K686j5553j0407o569n376J0871J3098n848J6651
$$ 43002 31466 21648 20722 18411 21097 5544 -4863 -11432 -16808 -5937 7161 1313 17964
9320A7964J2999K814N222k2613J4457K823L575N916K286j1004n257j029l121j6523
$$ 17964 30963 33777 38999 16386 30843 33666 37241 43157 45443 34439 29182 28153 25032 8509
9306H509R930q412o235K794j609J7865q838j3018L778K4342l806j4716j3932l153
$$ 8509 18439 10027 3792 6586 4977 22842 14004 986 4764 29106 25300 10584 -3348 -6501
9292f501J2404J7950l600p647j0352k4N609K139m525k0849J1933O190r61J0051
$$ -6501 5903 23853 20253 12606 2254 2230 7839 9978 5453 -15396 -3463 2727 1766 11817
9278A1817n459J3025O114k404j184k1883m428q938J3472J4564n631J0302j7182
$$ 11817 6358 19383 25497 23093 21909 26 -4402 -13340 132 14696 9065 19367 2185
9265B185k5339J4832J0451q695k0894o116j292J3906J4599K0249J9485l389k3073
$$ 2185 -23154 -8322 2129 -6566 -27460 -33576 -34868 -20962 -6363 13886 33371 29982 6909
9252F909J2758q92q053k315n199K692p19k5728o520J5307j6008q381J3682Q054
$$ 6909 19667 18775 10722 8407 3208 5900 5181 -20547 -27067 -11760 -27768 -36149 -22467 -14413
9238a4413M540P846Q619o689l571P633J2237l2154J2769L7545p173m010j655O602
$$ -14413 -9873 -2027 6592 -97 -3668 3965 16202 -15952 -3183 34362 27189 23179 21524 28126
9224B8126Q550j1813r760J3132J0344j1941j2300j0279m125j1490q216J9913K9557
$$ 28126 36676 24863 15103 28235 38579 26638 14338 4059 -66 -11556 -19772 141 29698
9211B9698p875j1916j0059Q316l514J8681O094j4574K0609j5884j3790K0991k4795
$$ 29698 21823 9907 -152 8164 4650 23331 29425 14851 35460 19576 5786 26777 1982
9198A982k2033J0738P950O061q74l742q065j9799N186K7610K6050j7425m144j0709
$$ 1982 -20051 -9313 -1363 4698 3824 82 -7983 -27782 -22596 5014 31064 13639 9495 -1214
9184a214K164L286j2502L722L958J1386J6217J0714N391k7465k5058k3554J4924
$$ -1214 950 4236 -8266 -4544 -586 10800 27017 37731 43122 15657 -9401 -32955 -18031
9171a8031J7004J3831N926l069q459Q829J0216J8817j8613j3353r813m820m635
$$ -18031 -1027 12804 18730 15661 7202 16031 26247 45064 26451 13098 3285 -1535 -6170
9158f170j4537j900P015m872Q699k686K0883m822k3776o772J0137L8705J5842
$$ -6170 -20707 -22607 -15592 -20464 -11765 -14451 6432 1610 -22166 -28938 -18801 19904 35746
9145C5746l979O236k9773j8018K729P447J2947K7520m03j8142p755Q760r830r793
$$ 35746 31767 38003 8230 -9788 -7059 388 13335 40855 40452 22310 14555 23315 13485 3692
9131C692j4145J7843R446m421M99L587P618j0746j511q803K9837M401j2835k4314
$$ 3692 -10453 7390 16836 12415 12914 16501 24119 13373 11862 3059 32896 37297 24462 148
9117A48j3747r229k754R081N175Q466r509j135J9315J7951j2819j0340j2047k2739
$$ 148 -13599 -22828 -25582 -16501 -11326 -2860 -12369 -13504 5811 23762 10943 603 -11444 -34183
9103c4183l514l109K4974J0921J715K322O996J808J0265o510j7195j5427m144
$$ -34183 -37697 -40806 -15832 -4911 -3196 -874 6122 7930 18195 11685 -5510 -20937 -25081
9090b5081J4304J3955N511k7643k3552o499J0915J4431J8947J0750R703J1511
$$ -25081 -10777 3178 8689 -18954 -42506 -49005 -38090 -23659 -4712 6038 15741 27252
9078B7252r285k8136j6176p21j383J7684J4709l96P528Q12k1605j5169R877J9056
$$ 27252 17967 -10169 -26345 -27066 -28449 -10765 3944 3548 11076 11888 -9717 -24886 -15009 4047
9064D047j1743k4380j803m889J6641J6008j130L818M776n642P697K3698j1663
$$ 4047 -7696 -32076 -33879 -38768 -22127 -6119 -7249 -3431 1345 -4297 3400 27098 15435
9051A5435m1514j7113m099L060L571j076K0004J8601j925p814k26j79M457N442
$$ 15435 -26079 -43192 -47291 -44231 -40660 -41736 -21732 -3131 -5056 -12870 -13096 -13275 -8818 -3376
9037c376r190m113m767J7622K9159J5731k6912k9186o430J1229J5302j4856K799
$$ -3376 -12566 -16679 -21446 -3824 25335 41066 14154 -15032 -21462 -10233 5069 -9787 -6988
9024f988L1098J7300J2486p122j0227Q118N383j4920K70K4402j00l629j1547j9732
$$ -6988 24110 41410 53896 46774 36547 44665 50048 35128 35398 59800 59700 56071 44524 24792
9010B4792r281j110j333k679K3703N185n174k2076k0169r33p786n512j313K1538
$$ 24792 15511 14401 13068 10389 34092 39277 34103 12027 -8142 -9075 -16861 -22373 -23686 -2148
8996b148n631J1906j123m112J1779J3592J4700R639o163k2119r249N15N829j7120
$$ -2148 -7779 4127 3004 -1108 10671 24263 38963 48602 42439 20320 11071 11586 17415 295
8982B95R68j0083k023P566m737Q293k860j1988K908N759o02J9141l602O161j5210
$$ 295 1263 -8820 -10843 -3277 -8014 279 -2581 -14569 -11661 -5902 -6504 12637 9035 15196 -14
8967a4j3011k319R99K484J5690J5017j938j0507j3795o392L935J9571K919R408
$$ -14 -13025 -15344 -14345 -11861 3829 18846 16908 6401 -7394 -13786 -9851 9720 12639 22047
8953B2047Q509M542k0891p671j7694l532p63p610L163O736j3854j2836K255J2363
$$ 22047 30556 35098 14207 6536 -11158 -14690 -15453 -23063 -19900 -13164 -27018 -39854 -37599 -25236
8939b5236K3770J8862J3361O748k2223l0448J4705J3089N582j326O160l666M670
$$ -25236 -1466 17396 30757 37505 15282 -15166 -461 12628 18210 16884 23044 19378 24048
8926B4048K1618j2460j7932p295j7602J8059J2916J123J820O087j4464l3765k9720
$$ 24048 45666 33206 15274 7979 -9623 8436 21352 22475 24295 30382 15918 -17847 -47567
8913d7567N469J4690N428J4771K899k25j960j5609J2580n491Q367J8316o683j3986
$$ -47567 -42098 -27408 -21980 -7209 -4310 -4535 -6495 -22104 -9524 -15015 -6648 11668 4985 -9001
8899i001R461R080K8712L4705J0841k5881k1517k8545j2922l937K3913N880K743
$$ -9001 460 9540 38252 72957 83798 57917 36400 7855 -5067 -9004 14909 20789 23532
8886B3532k6910o862K215J7395K0737O121m33j4744k1277j2014J8709Q694j9942
$$ 23532 -3378 -10240 -8025 9370 30107 36228 35795 21051 -226 -12240 6469 15163 -4779
8873d779r946m144K3695M808o073q367m669J304R201N848L93J9708j0859k0461
$$ -4779 -14725 -18869 4826 9634 3561 -4806 -9475 -8171 1030 6878 7271 26979 16120 -4341
8859d341r851j240K832J429k5958j0100J2930J2070q53j3344j9255J3656J4516
$$ -4341 -14192 -15432 -12600 -11171 -37129 -47229 -34299 -22229 -23082 -36426 -55681 -42025 -27509
8846b7509K2469j1849k6155J4032K2127k701j5376k042n414K643M320k230l393
$$ -27509 -5040 -16889 -43044 -29012 -6885 -9586 -24962 -27004 -32418 -29775 -25455 -27685 -31078
8833c1078j443M093j0708l648K7281R958j5165J462J324j3261J5313J1156K486
$$ -31078 -32521 -28428 -39136 -42784 -15503 -5545 -20710 -19248 -17924 -31185 -15872 -4716 -2230
8820b230j8430k8918n278j27M853J9562L736j7064R296K0649m746r225j476J7481
$$ -2230 -20660 -49578 -54856 -54983 -50130 -30568 -26832 -43896 -34600 -13951 -18697 -27922 -29398 -11917
8806a1917q239n436J8585j187j8721r181L184J313l42q891J7483J8216k5148Q774
$$ -11917 -20156 -25592 -7007 -8194 -26915 -36096 -32912 -31599 -31941 -40832 -23349 -5133 -30281 -21507
8792b1507J1428K1567P022J462P607k3010o663R503L794j0629j4667K759J3968
$$ -21507 -10079 11488 18510 19972 27579 4569 -2094 7409 11203 574 -14093 -11334 2634
8779B634J9068r328l1757j767J7824J1420Q333r219j8365n786j3243l393K1065
$$ 2634 21702 12374 -19383 -21150 -3326 8094 16427 7208 -11157 -16943 -30186 -33579 -12514
8766a2514l408J0779R003J7156l837j6829j8545j4706J8112K3505R18j3303k1251
$$ -12514 -15922 -5143 3860 21016 17179 350 -18195 -32901 -14789 8716 9634 -3669 -24920
8753b4920N356P54k0671J9066L4453K057m980j9206l225K2501j5617l4J0051k0366
$$ -24920 -19564 -18810 -39481 -20415 14038 16095 11115 -8091 -11316 11185 -4432 -4466 5585 -14781
8739a4781n435j2365J9181K2721N298K856J2091j8711k4414k3217L115R975J2921
$$ -14781 -20216 -32581 -13400 9321 14619 17475 29566 10855 -13559 -36776 -33661 -23686 -10765
8726a0765p068L96p031o546k3608J3206K1714J0474K16M718M596l999l5805j6213
$$ -10765 -17833 -17437 -24468 -31014 -54622 -41416 -19702 -9228 -9012 -4294 302 -3697 -39502 -55715
8712e5715P811K3532J6779r233l84P580j7227M015M830J7837J7052K1465R024
$$ -55715 -47904 -24372 -7593 -16826 -17210 -9630 -26857 -22842 -18012 -175 16877 38342 47366
8699D7366j3221k0396L954O963J7027M24J20k1589l608j1279j6508L041O35J6344
$$ 47366 34145 13749 17703 24666 41693 42117 42237 20648 17040 5761 -10747 -7706 -7071 9273
8685I273L474m185n17Q777k933O442r562j6202L572O517J174L423j1648j304m554
$$ 9273 12747 8562 8045 16822 13889 20331 10769 -5433 -1861 4656 5830 9253 -2395 -3699 -8253
8670h253k511J8433J0281l858j1527j6975P922O654K3070k0952l634P98n231q895
$$ -8253 -10764 7669 17950 14092 2565 -14410 -6488 166 23236 2284 -1350 -552 -5783 -14678
8656a4678j0977k131j0640L860K1165L2777j716j7987j9176q481K242j1105O352
$$ -14678 -25655 -27786 -38426 -34566 -13401 19376 17660 -327 -19503 -27984 -25742 -36847 -30495
8643c0495J0609J9190J8932L467j0824p635j9138j2889m895R050L5935K5384j6494
$$ -30495 -19886 -696 18236 21703 10879 3244 -15894 -28783 -33678 -24628 11307 36691 20197
8630B0197r708Q311j1807k0248J1997m022P130l111J3038J6754J4055J465j4880
$$ 20197 10489 18800 6993 -13255 -1258 -5280 1850 -1261 11777 28531 42586 44051 29171
8617B9171N785L59j1014k9089J2611K8766q268j1190O77Op370K441R990J3351
$$ 29171 34956 35315 24301 -4788 7823 36589 28321 17131 17808 17814 10444 12885 22875 36226
8603C6226j6270k49J3822K0222j897M413m622P008R36m395J854k772M172j7843
$$ 36226 19956 19707 33529 53751 51854 56267 51645 58653 59589 55194 57048 54276 58448 40605
8589D0605k1157J3526O418l933R190M178j3189r143Q19j8825j524J6342J6377
$$ 40605 19448 32974 39392 35459 44649 48827 35638 26495 27314 8489 6965 23307 39684
8576C9684j2786q309l271k097m934K3457q11k7230P783M211P259J1525j709m84
$$ 39684 26898 18589 15318 13221 8287 31744 30933 3703 11486 15697 22956 34481 32772 32288
8562C2288l167k4071n776J8904j7897j6363k74K2126K1074K64J3781M317p591
$$ 32288 29121 5050 -726 18178 281 -16082 -16356 5770 26844 27108 40889 45206 37615
8549C7615l2768m995K3260j7064m132J6172J5544o372M643m80j063k371p696j6595
$$ 37615 4847 -148 23112 6048 1916 18088 33632 27260 31903 31423 30360 27989 20293 3698
8535C698j0031k483j3102m836k3685Q730J1649K2576J1216J150M672R167J3436
$$ 3698 -6333 -8816 -21918 -26754 -50439 -41709 -30060 -7484 3732 4882 9554 18721 32157
8522C2157m66j6430j7148O471j9805K651Q231J4454j6398j0976J2856J1888n42
$$ 32157 31691 15261 -1887 4584 -15221 -12570 -4339 10115 -6283 -17259 -4403 7485 6943
8509F943J2138k162j3486m703k0478r461N503J1438J4632J550Q134J6046J0330
$$ 6943 19081 16919 3433 -1270 -21748 -31209 -25706 -14268 364 1914 10048 26094 36424
8496C6424j7682k8970L838J5120O429r566k2105J0892K3552L684K729k7029k8560
$$ 36424 18742 -10228 -6390 8730 15159 5593 -16512 -5620 17932 21616 24345 -2684 -31244
8483c1244J5765K1341l721j7890o76K8561J2397M623O007Q191j1963n769j5565
$$ -31244 -15479 5862 2141 -15749 -16425 12136 24533 29156 35163 43354 31391 25622 10057
8470A0057j7748L854J6625J8127l665j1559j5298N519J2121r62R943J5288J58
$$ 10057 -7691 -3837 12788 30915 27250 15691 393 5912 18033 17071 27014 42302 42460
8457D2460M901j585k0932n785J140O64p535j6793j1616k3725O094K149M152o207
$$ 42460 47361 45776 24844 19059 20199 20863 13328 -3465 -15081 -38806 -32712 -30563 -26411 -32618
8443c2618k1335J6789J4298O033q410N299L605M12m964K9413M825k6701J3058
$$ -32618 -53953 -37164 -22866 -16833 -25243 -19944 -16339 -15927 -20891 8522 13347 -13354 -296
8430b96P21j5982j0622J672j5470l218J1129K9022N948j288p653m190k240K5725
$$ -296 425 -15557 -26179 -24507 -39977 -43195 -32066 -3044 2904 1616 -6037 -10227 -12467 13258
8416A3258o036J6237J0661k1304j8261K8425j0960j6313J7324J2737n074j2748
$$ 13258 7222 23459 34120 12816 -5445 22980 12020 -4293 13031 25768 20694 7946
8404G946l118N712l228M269m120j2584j1329j7610L5314K1502L14j5502l1938
$$ 7946 4828 10540 7312 11581 7461 -5123 -16452 -34062 1252 22754 23068 7566 -24372
8391b4372r774J7509N181P24q203M593J391k7249N709m12k1396J5754K7342J7249
$$ -24372 -34146 -16637 -11456 -10732 -18935 -14342 -12951 -40200 -34491 -34903 -56299 -40545 -13203 4046
8377D046j160J1726J7352o345j2854j7476j7853q752R497J488j5509o148l912
$$ 4046 2886 14612 31964 25619 12765 -4711 -22564 -31316 -21819 -20331 -35840 -41988 -45900
8364d5900J9686K464j2552K1702J3078K8520J7585J2471j0726q016k1405m815
$$ -45900 -26214 -23750 -36302 -14600 -1522 26998 44583 57054 46328 38312 16907 12092
8352A2092j3987k2338n607J3644K101M713m330J269P056J3490o916j4625O948
$$ 12092 -1895 -24233 -29840 -16196 -14095 -9382 -13712 -12443 -5387 8103 1187 -13438 -6490
8339f490l560j0183M432K7506P208L249k2414k2471j0998N804J6471k270j4543
$$ -6490 -10050 -20233 -15801 11705 18913 22162 -252 -22723 -33721 -27917 -11446 -13716 -28259
8326b8259M007J6003M504K1810m073k0723J113Q297n127k02j3192j4228Q49J697
$$ -28259 -24252 -8249 -3745 18065 13992 -6731 -5618 2679 -2448 -2650 -15842 -30070 -29221 -27524
8312b7524Q772l579J8355J2521o912l268j691m955N761J770L977J449J4875N993
$$ -27524 -18752 -22331 -3976 8545 1633 -1635 -3326 -8281 -2520 -750 3227 4676 19551 25544
8298B5544L417P50r297k4208r961J2969n4L86O840j4001K605J3581r223j3389
$$ 25544 28961 29711 20414 -3794 -13755 -786 -840 -454 6386 -7615 -5010 8571 -652 -14041
8284a4041J5673n491p502J0200J3084R059l4656M267J9125k900R47j2093r334
$$ -14041 1632 -3859 -11361 -1161 11923 20982 -13674 -9407 9718 6818 7765 -4328 -13662
8271a3662J3250J630L556J3160j9011j1872J6098M178M211J1170j1795Q845p275
$$ -13662 -412 1218 4774 17934 -1077 -12949 3149 7327 11538 22708 10913 19758 12483
8258A2483k992k748l3006k577O821K6173J0605J6132k6507q222r81r504J5772
$$ 12483 9491 6743 -26263 -28840 -22019 4154 14759 30891 4384 -3838 -4819 -14323 1449
8245A449n708J2806J2749K5282j1441j1460N925j0242k8661j6368J2276K6975
$$ 1449 -4259 8547 21296 46578 35137 23677 29602 19360 -9301 -25669 -13393 13582
8233A3582j67l3257J5475R389p084Q330R192o326j4127j0638j2044K1280L4704
$$ 13582 13415 -19842 -4367 5022 -2062 6268 15460 9134 -4993 -15631 -27675 -6395 28309
8220B8309J550j8800k3815j490m039j0538j335P263p53Q28K0237O055j2772J044
$$ 28309 29859 11059 -12756 -14246 -18285 -28823 -30158 -22895 -23648 -22820 -2583 3472 -9300 -8256
8206h256O807R725o162n110k250j9072N44J7475L700J3474P143n431j5294J4462
$$ -8256 -1449 8276 2114 -2996 -5246 -24318 -23774 -6299 -2599 10875 18018 12587 -2707 11755
8192A1755L342q131q346r163J243L0580J2558j2855R094K163j2414k8315N876
$$ 11755 15097 6966 -1380 -10543 -9300 21280 33838 20983 30077 32240 19826 -8489 -2613
8179b613Q724j3133l836O772j1539K1424J9869J487p138l66l0848L171K7159j718
$$ -2613 6111 -7022 -10858 -4086 -15625 5799 25668 27155 20017 19651 -11197 -8026 19133 17415
8165A7415j9568K1j7410r393n893R352m30K0895j891J789J2053k2262r731J562
$$ 17415 -2153 -2132 -19542 -28935 -34828 -25476 -25906 -5011 -6902 -5113 6940 -15322 -25053 -23491
8151b3491J0503L1846J3740k3484j6376M542Q087J8668Q745j1916k2590j8121
$$ -23491 -12988 18858 32598 9114 -7262 -2720 5367 24035 32780 20864 -1726 -19847
8139a9847o955Q045Q089m717j7885m876O242J6594J1907k634L809k629J6682q981
$$ -19847 -26802 -18757 -10668 -15385 -33270 -38146 -31904 -15310 -3403 -6037 -2228 -4857 11825 2844
8125B844k9787M959m487K984K6010J0687o138r430J5348k0535j247m632j5544
$$ 2844 -26943 -21984 -26471 -23487 2523 13210 7072 -2358 12990 -7545 -8792 -13424 -28968
8112b8968N742K73k801k283O565L86P887J0328K6484j5972j7803J4489J1737j1735
$$ -28968 -23226 -22953 -25754 -28037 -21472 -21086 -13199 -2871 23613 7641 -10162 4327 16064 4329
8098D329r994m391Q556R350j8284L762R223L61m099q106j3056J1993R539L382
$$ 4329 -5665 -10056 -1500 7850 -10434 -6672 2551 2912 -1187 -9293 -22349 -10356 -817 2565
8084B565l053q831R716j1604q489J381r667L335K065Q608M505N088p826M75L141
$$ 2565 -488 -9319 397 -11207 -19696 -18315 -27982 -24647 -22582 -13974 -9469 -4381 -12207 -11732 -8591
8069h591j2077K8199K0232j4984K188j0771j0611q076j2849m308o504J9610K3878
$$ -8591 -20668 7531 27763 12779 14967 4196 -6415 -14491 -27340 -31648 -38152 -18542 5336
8056E336j1066p190J0681K444K759k864J3572J3389r564l8478M199K0846P776
$$ 5336 -5730 -12920 -2239 205 2964 100 13672 27061 17497 -20981 -16782 4064 11840
8043A1840J9289K705j4436k0493K359N213J0865r901p855L282N685Q049l629j6450
$$ 11840 31129 33834 19398 -1095 1264 6477 17342 7441 -414 2868 8553 16602 12973 -3477
8029c477j4691M294J9969Q785K4392J8982j4518r301j0092k2806j479k775k199
$$ -3477 -18168 -13874 6095 14880 39272 58254 43736 34435 24343 1537 58 -2717 -4916
8016d916J0769P294O285j3039K76N752j2910k969k052j4868Q504M3j371K8164
$$ -4916 5853 13147 19432 6393 6669 12421 -489 -3458 -5510 -20378 -11874 -11831 -13202 14962
8002A4962n597j8235j2149k37K82J3290m744j306l930Q986J4881M775j2651k1693
$$ 14962 9365 -8870 -21019 -21256 -20974 -7684 -12428 -13734 -17664 -8678 6203 10978 -1673 -23366
7988b3366J6467K1072r423k294J6747m662o93r070n220r284m461P510J8986K1793
$$ -23366 -6899 14173 4750 2456 19203 14541 13848 4778 -442 -9726 -14187 -6677 12309 34102
7974C4102J6649j4631j1228o064j3926j1285j5977k4501J3559L0647j1528k3236
$$ 34102 50751 36120 24892 18828 4902 -6383 -22360 -46861 -33302 -2655 -14183 -37419
7962c7419J1264J1911J4831P969j187r524k1384l373K3494K7945K3348R675j2620
$$ -37419 -26155 -14244 587 8556 7369 -2155 -23539 -26912 -3418 24527 47875 57550 44930
7949D4930p415J0467k7002k2677m367o621p956K2849J1256j2454J0857J8112J1311
$$ 44930 37515 47982 20980 -1697 -6064 -12685 -20641 2208 13464 1010 11867 29979 41290
7936D1290n486m006q824J4037o563j9358k0979j1109M907n919J2711J0360j6241
$$ 41290 35804 31798 22974 37011 30448 11090 -9889 -20998 -16091 -22010 -9299 1061 -15180
7923a5180j4051m020J1484L2030P283j2720K4544J5101J594k584k8086k537k2948
$$ -15180 -29231 -33251 -21767 10263 17546 4826 29370 44471 46065 43481 15395 12858 -10090
7910a0090J1015J6672K1731m949j4211j7109L104P303j0599k246n826j3899P760
$$ -10090 925 17597 39328 34379 20168 3059 6163 13466 2867 621 -5205 -19104 -11344
7897a1344O269o475P387K2356p200j4705M367K1509K1715k0137j6742M069M106
$$ -11344 -5075 -11550 -4163 18193 10993 -3712 655 22164 43879 23742 7000 11069 15175
7884A5175r983j3429J2024K856n575M372Q028l46l706M461K2841Q761j0523j5307
$$ 15175 5192 -8237 3787 6643 1068 5440 13468 13122 9416 13877 36718 45479 34956 19649
7870A9649q395J2559n996j7683J0389j6395K142k258O863N660k059j4017j0622
$$ 19649 11254 23813 17817 134 10523 -5872 -3730 -5988 875 6535 4476 -9541 -20163
7857b0163L93K4572K4697M060k4263k51K5726K985k2823l586m990J445j5379J9685
$$ -20163 -19770 4802 29499 33559 9296 9045 34771 37756 14933 11347 6357 7802 -7577 12108
7843A2108Q056k1793M308P134j9475J2150R953P088K0947o331K647j8293k3199
$$ 12108 20164 -1629 2679 9813 -9662 2488 12441 19529 40476 34145 36792 18499 -4700
7830d700N956J4743n07q525J0907R96k4442j4794o719L150K9473J6818j484l32
$$ -4700 1256 15999 15492 6967 17874 18870 -5572 -20366 -27085 -23935 5538 22356 20872 20540
7816B0540K020j9183l07P423M486K214J0447j5863k8731j8679J6619J2978j7149
$$ 20540 22560 3377 3070 10493 14979 17193 27640 11777 -16954 -35633 -19014 -6036 -23185
7803b3185O318O669q615N6p78j4946J6770P949k2075l091K2155N517N034N580
$$ -23185 -16867 -10198 -18813 -18757 -19535 -34481 -17711 -9762 -31837 -34928 -12773 -7256 -2222 3358
7789C358p916O454K474J7745O178n587j8439k8407n152J1205l1J5081J4699k2388
$$ 3358 -4558 1896 4370 22115 28293 22706 4267 -24140 -29292 -18087 -18118 -3037 11662 -10726
7775a0726K7366K6361m362j6492q748m684P499j7846j6601l665j2205K278K7848
$$ -10726 16640 43001 38639 22147 13399 8715 16214 -1632 -18233 -21898 -34103 -31825 -3977
7762c977j9983j0733L290n560M656j735J3310q065J0233K2344j5340k3732j1231
$$ -3977 -23960 -34693 -31403 -36963 -32307 -34042 -20732 -28797 -18564 3780 -11560 -35292 -46523
7749d6523J4267J2860K5197J1325O905j5694j6742J6444P719p226p170o994n975
$$ -46523 -32256 -19396 5801 17126 24031 8337 -8405 8039 15758 8532 1362 -5632 -11607
7736a1607L033O489L788m358J393o308j133o835n750J1876J4660o610j3247J1932
$$ -11607 -8574 -2085 1703 -2655 -1262 -7570 -8703 -15538 -21288 -9412 5248 -1362 -14609 -2677
7722b677J3035k6513J2977J5186J1702N496j0623K069j0634j507q142k3453K743
$$ -2677 10358 -16155 -3178 12008 23710 29206 18583 20652 10018 8511 369 -23084 -20341
7709b0341r806J3167L881l009j239K73L01L830j2664J3852R528N924j8047N532
$$ -20341 -30147 -16980 -13099 -16108 -17347 -17074 -16773 -12943 -25607 -11755 -2227 3697 -14350 -8818
7695h818m02J4670l92M453j730r037L134j0061k0259k6380K6134J1591K927J993
$$ -8818 -9220 5450 5058 9511 7781 -1256 1878 -8183 -28442 -54822 -28688 -17097 -14170 -12177
7681a2177J0917J9475j0885N271n955J1143K959O58J3093j6525P519j0449j7655
$$ -12177 -1260 18215 7330 12601 6646 17789 20748 21406 34499 17974 25493 15044 -2611
7668b611j4407k020l188K973L046J0876Q921l367j750Q120Q647l260l746m527
$$ -2611 -17018 -19038 -22226 -19253 -16207 -5331 3590 223 -1527 6593 15240 11980 8234 3707
7654C707J4497j102j1289K7171j0787j5902M358J0679J483r697K356J5376r465
$$ 3707 18204 17102 5813 32984 22197 6295 10653 21332 22815 13118 15474 30850 21385
7641B1385r265j2653j2641J261m709J2791N204m388j0599M407K7071j106k0755
$$ 21385 12120 -533 -13174 -11913 -16622 -3831 1373 -3015 -13614 -9207 17864 16758 -3997
7628c997J8760j014K841J2211j4063l4212j3423j4328k915K0767K0719Q148Q247
$$ -3997 14763 13749 16590 28801 14738 -19474 -32897 -47225 -50140 -29373 -8654 -506 7741
7615G741q582j1649j2957J6335M439O978J3155Q837j4036j8808J0769P932k0990
$$ 7741 -841 -12490 -25447 -9112 -4673 2305 15460 24297 10261 -8547 2222 10154 -10836
7602a0836p512K2476j5547O348R569N130J2582L574m6526k2466j388j628q229
$$ -10836 -18348 4128 -11419 -5071 4498 9628 22210 25784 -20742 -43208 -44596 -46224 -54453
7589e4453J3184K2093q853j1801m136j5669P121L2000J5777o576j4861N237m542
$$ -54453 -41269 -19176 -28029 -39830 -43966 -59635 -52514 -20514 -4737 -11313 -26174 -20937 -25479
7576b5479J368J1780J4542R04r212r732M085J0430K2891J0846r565l313o83K263
$$ -25479 -24111 -12331 2211 3115 -6097 -15829 -11744 -1314 21577 32423 22858 19545 18862 21125
7562B1125N626K716O926l943M832j7697k8055j9821r526K1030L0542J9056q954
$$ 21125 26751 29467 36393 32450 37282 19585 -8470 -28291 -37817 -16787 13755 32811 23857
7549B3857j3048q012J0110j7925j5989K088M76l730K266K326m164o04L510J3769
$$ 23857 10809 2797 12907 -5018 -21007 -18919 -18443 -22173 -19907 -17581 -21745 -22349 -18839 -5070
7535e070L4170j175l710j0847o333q952p017J9556n375j2960q832L158k2468m009
$$ -5070 29100 27925 24215 13368 7035 -1917 -8934 10622 5247 -7713 -16545 -13387 -35855 -39864
7521c9864Q819M329n210K1306K588J984k666Q436j4714j6021P282K416p003J6336
$$ -39864 -31045 -26716 -31926 -10620 -8032 -6048 -8714 -278 -14992 -31013 -23731 -21315 -28318 -11982
7507a1982m135J1152n423J062m631J2322q15M738o377J2601J9767l431k9975k314
$$ -11982 -16117 -4965 -10388 -9326 -13957 -1635 -2450 2288 -4089 8512 28279 24848 -5127 -7441
7493g441J3310l124J240K0452p797k4741J7916K3826j0608q731j49k7270j1980
$$ -7441 5869 2745 3985 24437 16640 -8101 9815 33641 23033 14302 14153 -13117 -25097
7480b5097k463l137J3562J6268L843j408K557j9952k495K479O944O205Q721r626
$$ -25097 -27560 -30697 -17135 -867 2976 1568 4125 -15827 -18322 -15843 -8899 -2694 6027 -3599
7466c599O954o257J471k647P323m988J421L2491l418j9474j2728q863k361J1379
$$ -3599 3355 -2902 -1431 -4078 3245 -1743 -322 32169 28751 9277 -3451 -12314 -14675 -3296
7452c296l675J4755J2081j0359O643m198K727Q726J3676j7812l4305n733J7039
$$ -3296 -6971 7784 19865 9506 16149 11951 14678 23404 37080 19268 -15037 -20770 -3731
7439c731P850o180k226o134O162N245M816q427m5776L529J8602O771L107J8603
$$ -3731 4119 -2061 -4287 -10421 -4259 986 5802 -2625 -48401 -44872 -26270 -19499 -16392 2211
7425B211J8360k47J8309j072p906k516J2906P393K731m940k6340N03L634k5145
$$ 2211 20571 20324 38633 37561 29655 27139 40045 47438 50169 45229 18889 19392 23026 -2119
7411b119k5559J0887j762j175N453J2891K1103q744j2499q253J4515R762P935
$$ -2119 -27678 -16791 -18553 -19728 -14275 -1384 19719 10975 -1524 -9777 4738 14500 22435
7398B2435r58K682j2365j0211J6894O095n935K126K5362l026l3317j5110J6669
$$ 22435 21477 24159 11794 1583 18477 24572 18637 20763 46125 43099 9782 -5328 11341
7385A1341p234j2944j1766J4563K7876j4544j8255L003N439r723j2368J2989m441
$$ 11341 4107 -8837 -20603 -6040 21836 7292 -10963 -7960 -2521 -12244 -24612 -11623 -16064
7372a6064K948n59r111N031J7835r876l0218R838R445j7650r571J3787m363o920
$$ -16064 -13116 -13675 -22786 -17755 80 -9796 -40014 -30176 -20731 -38381 -47952 -34165 -38528 -45448
7358d5448J4641P587J2751n150P747j0267m100J9350M694m934M558Q711L714M925
$$ -45448 -30807 -23220 -10469 -15619 -7872 -18139 -22239 -2889 1805 -3129 1429 10140 13854 18779
7344A8779k5166K157n232j8699k735J3369Q243N853j0612j3563K2751n999p987
$$ 18779 -6387 -4230 -9462 -28161 -30896 -17527 -9284 -3431 -14043 -27606 -4855 -10854 -18841
7331a8841K1014o201P398K318K114k687J4462K7993O810k1332o892j8595k2813
$$ -18841 2173 -4028 3370 5688 7802 5115 19577 47570 54380 33048 26156 7561 -15252
7318a5252L85J1374k905K484L608o099N272J1896K512l282j0060k0691J5624J1922
$$ -15252 -14867 -3493 -6398 -3914 -306 -6405 -1133 10763 13275 9993 -67 -20758 -5134 6788
7304F788K555k3582j4186K6552l413l084k838J0873K4799J7036R831l3567j7039
$$ 6788 9343 -14239 -28425 -1873 -5286 -8370 -11208 -335 24464 41500 51331 17764 725
7291G25n619l7159K654P28l800J3519K303K4294L2153j8813q583l889m846N799
$$ 725 -4894 -42053 -39399 -38671 -42471 -28952 -26649 -2355 29798 10985 2402 -1487 -6333 -534
7277e34M895J947O878k904j7840k4445j2708J6121K0952J0356q104K447L638K2295
$$ -534 4361 6308 13186 10282 -7558 -32003 -44711 -28590 -7638 2718 -5386 -2939 699 22994
7263B2994j384k7277k6480j0525J6295L7216k461j3423j3279P127K1982q949o021
$$ 22994 21610 -5667 -32147 -42672 -26377 10839 8378 -5045 -18324 -11197 10785 1836 -4185
7250d185Q078J1245j0562j4921Q653J009R67K003K3080J2606r018L484K208p130
$$ -4185 3893 15138 4576 -10345 -1692 -683 284 2287 25367 37973 28955 32439 34647 27517
7236B7517r203L267n132j7955j0061k1604q244k148J6780J3057J8442M129N659
$$ 27517 18314 21581 16449 -1506 -11567 -33171 -41415 -43563 -26783 -13726 4716 8845 14504
7223A4504J0116k1870J8235k4826l1030j501o380R168N408O077j930k056j0689
$$ 14504 24620 2750 20985 -3841 -34871 -36372 -42752 -33584 -28176 -22099 -24029 -26085 -36774
7210c6774P130K2338L5020J4132k2434l0847l766M354q002J5648l127k0644r513
$$ -36774 -29644 -7306 27714 41846 19412 -11435 -15201 -10847 -18849 -3201 -6328 -26972 -36485
7197c6485l804Q879P215q38j3713O6M029J121L279O683K1157k283o696m396P804
$$ -36485 -40289 -31410 -24195 -25033 -38746 -38680 -34651 -33530 -30251 -23568 -2411 -4694 -11390 -15786 -7982
7182g982Q982j6214j0030n517L372q159j714P433K5598K8204j8071k0462k7766
$$ -7982 1000 -15214 -25244 -30761 -27389 -35548 -37262 -29829 -4231 23973 5902 -14560 -42326
7169d2326P629R391j2854j2564N495K4573O716o2K5342P80R52o295O808L623o444
$$ -42326 -34697 -25306 -38160 -50724 -45229 -20656 -13940 -14002 11340 12120 13072 6777 13585 17208 10764
7154A0764J277l147l911N968l159k4002j743K3052J4006j7891j8522J0193R427
$$ 10764 12041 8894 4983 10951 7792 -16210 -17953 5099 19105 1214 -17308 -7115 2312
7141B312J4525P346R098P94n110M042p890k6478k0488j0440k5299J1588K6624
$$ 2312 16837 24183 33281 34075 28965 33007 25117 -1361 -21849 -32289 -57588 -46000 -19376
7128a9376J6154j4051r648J8172K7470Q746n440o443j242j3387k7422P810N081
$$ -19376 -3222 -17273 -26921 -8749 18721 27467 22027 15584 14342 955 -26467 -18657 -13576
7115a3576j0302j7731J6839K3221j227M551k858r028L124l655l572j4737k7761
$$ -13576 -23878 -41609 -24770 -1549 -2776 1775 -1083 -10111 -6987 -10642 -14214 -28951 -56712
7102e6712j2830J4309K8096M754J6897Q935j3270J9502J4312j3522p416O011J8087
$$ -56712 -69542 -55233 -27137 -22383 -5486 3449 -9821 9681 23993 10471 3055 9066 27153
7089B7153M575r889k5154j2556K283J0549J0844J260j8920q580O437J9851J1893
$$ 27153 31728 21839 -3315 -15871 -13588 -3039 7805 9065 -9855 -18435 -11998 7853 19746
7076A9746j6061o376q250l0247L632R547k631N379K6506J3643k0179o685k1179
$$ 19746 3685 -2691 -10941 -41188 -37556 -28009 -30640 -25261 1245 14888 -5291 -11976 -33155
7063c3155r81K9596K1888N899k1769p040K7749L5m3271M944J1585Q924J592R984
$$ -33155 -34136 -4540 17348 23247 1478 -5562 22187 22222 -21049 -16105 -4520 4404 5996 15980
7049A5980p006l039J2926N139J5207j8905k154r473O834r099Q769j373M264r084
$$ 15980 8974 5935 18861 24000 39207 20302 18148 8675 15509 6410 15179 13806 18070 8986
7035H986r551k237J3309j7541m459J1156J0208j137j3343k973K2456j3566O170
$$ 8986 -565 -2802 10507 -7034 -11493 -337 9871 8734 -4609 -7582 14874 1308 7478
7022G478J4218J1763k7184l0557J892J5367J8567j3550k1818j1993O695J9163
$$ 7478 21696 33459 6275 -24282 -22390 -7023 11544 -2006 -23824 -35817 -29122 -9959
7010i959K4011p008k4718J1605n75J993q891O69K5250R979p202k7047K216J0780
$$ -9959 14052 7044 -17674 -6069 -6644 -4651 -13542 -12873 12377 22356 15154 -11893 -9677 1103
6996A103P499K192R120j221k9093O68R316J343R173K9181n588k5647j0578J609
$$ 1103 8602 10794 19914 18693 -10400 -9732 -416 927 10100 39281 33693 8046 -2532 -923
6982i23J8581N604J1486j1704o418K5640j0997p859Q637J5602m623J093k7480
$$ -923 17658 23262 34748 23044 16626 42266 31269 23410 32047 47649 43026 44119 16639
6969A6639j0090o969j4485p51J0103j425j777l140m175K7554P221k7782j6829
$$ 16639 6549 -420 -14905 -15656 -5553 -6978 -8755 -11895 -16070 11484 18705 -9077 -25906
6956b5906M427l948J5973m660j0281n461K2314J442j5446R215J8719O955N112
$$ -25906 -21479 -25427 -9454 -14114 -24395 -29856 -7542 -6100 -21546 -12331 6388 13343 18455
6943A8455q427n308k004j1496k0072j4043J834J0143O148J2886P220Q204q773
$$ 18455 10028 4720 2716 -8780 -28852 -42895 -41061 -30918 -24770 -11884 -4664 3540 -5233
6930e233j2448O653J2155j0789j3752j6002k366J8902K6658K403P993l795r915
$$ -5233 -17681 -11028 1127 -9662 -23414 -39416 -41782 -22880 3778 6181 14174 10379 464
6917D64n392l793k302l597r122M729J8232J0434q41k287o422P282J5794j0438
$$ 464 -4928 -8721 -11023 -14620 -23742 -19013 -781 9653 8812 6525 103 7385 23179 12741
6903A2741j9193N433J1210P059J2283n796j9031l6276j5766J0443o211m924O219
$$ 12741 -6452 -1019 10191 17250 29533 23737 4706 -31570 -47336 -36893 -43104 -48028 -41809
6890d1809J1778Q246j4475K3305K753k3546J8093J7312j0549k4861J1094O46q91
$$ -41809 -30031 -21785 -36260 -12955 -10202 -33748 -15655 1657 -8892 -33753 -22659 -22013 -22904
6877b2904k2490j1856r199N602J743L871K7360R224l547m928J8812q550k6702
$$ -22904 -45394 -57250 -66449 -60847 -59104 -55233 -27873 -18649 -22196 -27124 -8312 -16862 -43564
6864d3564J0054P016J4531j0624k6406K7799J5989m286q275K100m860K7751Q82
$$ -43564 -33510 -26494 -11963 -22587 -48993 -21194 -5205 -9491 -17766 -15666 -20526 7225 8107
6851H107j8603n979R165J4694j2035k3744q608K705J290P014J6R676L9226M496
$$ 8107 -10496 -16475 -7310 7384 -4651 -28395 -37003 -34298 -33008 -25994 -25978 -16302 22924 27420
6837B7420O684k628q169l0090k662o541J3792J040j1334j1904O92Q033J5920k7225
$$ 27420 34104 31476 23307 -6783 -9445 -15986 -2194 -1154 -12488 -24392 -23700 -15667 253 -26972
6823b6972k1463L2573J0431j708j350J0328l767j9824m943J3834J3683J5887K1
$$ -26972 -48435 -15862 -5431 -7139 -8489 1839 -1928 -21752 -26695 -12861 822 16709 16730
6810A6730p423q640o806J2991j6657j6345j0234J2317J6016p416j8237k2956J2354
$$ 16730 9307 667 -6139 6852 -9805 -26150 -36384 -24067 -8051 -15467 -33704 -56660 -44306
6797d4306J5041L2429o609k6776R002J5191J1240j6470O348K0714M543P316j9207
$$ -44306 -29265 3164 -3445 -30221 -21219 -6028 5212 -11258 -4910 15804 20347 27663 8456
6784H456k1058R5K1037K1777M542l4173r330J4712M371P331n142j7449j1340j2559
$$ 8456 -12602 -12507 8530 30307 34849 676 -8654 6058 10429 17760 12618 -4831 -16171 -28730
6770b8730K9108K1401j2143o957K833k1603M107j3906R050j807q595J3688K2742
$$ -28730 378 21779 9636 2679 5512 -16091 -11984 -25890 -16840 -18647 -27242 -13554 9188
6757I188J1923Q44n226r402O932J0691J2078j1866p57J606j0649j7640J5849l052
$$ 9188 21111 21955 16729 7327 14259 24950 37028 25162 24405 26011 15362 -2278 13571 10519
6743A0519J3350M21k3755l471J4333J1223j1297j4538j4998j2890j45J1423J6774
$$ 10519 23869 24290 535 -2936 11397 22620 11323 -3215 -18213 -31103 -31248 -19825 -3051
6730c051L621O529J9746J7196j3385%n595n542l621L398l339l322M489J8797R344
$$ -3051 570 7099 26845 44041 30656 30656 25061 19519 15898 19296 15957 12635 17124 35921 45265
6715D5265L594J1944p825k5640k2181M509K4101N427J973l7469j8513j6283Q33
$$ 45265 48859 60803 52978 27338 5157 9666 33767 39194 41167 3698 -14815 -31098 -30265
6702c0265L4253n356n266j136j3512J6500O2L742J0018p345j2252j125O553m62
$$ -30265 3988 -1368 -6634 -7770 -21282 -4782 -4720 -978 9040 1695 -10557 -11682 -5129 -5591
6688e591J664j0024j5042N318K5849m180k4803J371J4484j2847r822p120j751
$$ -5591 -3927 -13951 -28993 -23675 2174 -2006 -26809 -25438 -10954 -23801 -33623 -40743 -42494
$$ [...]
##END NTUPLES=NMR SPECTRUM
##END=
