##TITLE=Analysis number 315528
Compound Code cc 13112
Project Code adrs
Chemist Name cuschem
##JCAMPDX= 6.0         $$ Bruker NMR JCAMP-DX V2.0
##DATA TYPE= NMR SPECTRUM
##DATA CLASS= NTUPLES
##ORIGIN= Bruker BioSpin GmbH
##OWNER= NMR
$$ XWIN-NMR		Version 3.5
$$ Tue Nov 22 12:41:52 2005 GMT Standard Time (UT+0h)  MAYBRIDGE\NMR@NMR_250MHZ
##.OBSERVE FREQUENCY= 250.131544655141
##.OBSERVE NUCLEUS= ^1H
##.ACQUISITION MODE= SIMULTANEOUS (DQD)
##.ACQUISITION SCHEME= undefined
##.AVERAGES= 16
##.DIGITISER RES= 18
##SPECTROMETER/DATA SYSTEM= dpx250
##.PULSE SEQUENCE= zg30
##.SOLVENT NAME= DMSO
##.SHIFT REFERENCE= (INTERNAL, DMSO, 0, 16.522)
##AUDIT TRAIL= $$ (NUMBER, WHEN, WHO, WHERE, WHAT)
$$ ##TITLE= Audit trail, XWIN-NMR		Version 3.5
$$ ##JCAMPDX= 5.01
$$ ##ORIGIN= Bruker BioSpin GmbH
$$ ##OWNER= NMR
$$ C:\u/data/dgb/nmr/ADRS/12850/pdata/1/auditp.txt
$$ ##AUDIT TRAIL=  $$ (NUMBER, WHEN, WHO, WHERE, WHAT)
(   1,<2005-11-22 12:41:04.87 +000>,<MAYBRIDGE\NMR>,<NMR_250MHZ>,
      <created by zg, POWCHK disabled, PULCHK disabled
       configuration hash MD5:
       62 19 C7 07 E1 42 D1 B7 37 6C 3D D0 77 39 F9 E6
       data hash MD5: 64K
       6B 85 1B 21 A7 CD BC 44 60 23 D0 96 59 00 61 58>)
(   2,<2005-11-22 12:41:26.17 +000>,<MAYBRIDGE\NMR>,<NMR_250MHZ>,
      <Start of raw data processing
       ef LB = 0.3 FT_mod = 6 PKNL = 1 SI = 32K 
       data hash MD5: 32K
       74 E1 72 D0 A0 17 A5 DE 6A 1A CD 45 2C D4 85 53>)
(   3,<2005-11-22 12:41:30.07 +000>,<MAYBRIDGE\NMR>,<NMR_250MHZ>,
      <apk 
       data hash MD5: 32K
       86 2C 70 8F CF 5A 7D 29 78 51 97 63 69 6D E9 FA>)
(   4,<2005-11-22 12:41:31.42 +000>,<MAYBRIDGE\NMR>,<NMR_250MHZ>,
      <abs ABSG = 5 
       data hash MD5: 32K
       91 A8 49 D4 0D 41 FB 79 B3 21 83 A2 AF DB E4 24>)
$$ ##END=
$$ 
$$ hash MD5
$$ 0E BB ED 80 F4 BC 84 35 E4 6F E0 6B D2 B2 56 F8
##$RELAX= 
##$RELAX= 
##$RELAX= 
##$RELAX= 
##$RELAX= 
##$RELAX= 
##$RELAX= 
$$ Bruker specific parameters
$$ --------------------------
##$DU= <C:\u>
##$EXPNO= 12850
##$NAME= <ADRS>
##$PROCNO= 1
##$TYPE= <nmr>
##$USER= <dgb>
##$AMP= (0..31)
100 100 100 100 100 100 100 100 100 100 100 100 100 100 100 100 100 100 
100 100 100 100 100 100 100 100 100 100 100 100 100 100 
##$AQSEQ= 0
##$AQ_mod= 3
##$AUNM= <au_zg>
##$AUTOPOS= <25 >
##$BF1= 250.13
##$BF2= 250.13
##$BF3= 250.13
##$BF4= 250.13
##$BF5= 500.13
##$BF6= 500.13
##$BF7= 500.13
##$BF8= 500.13
##$BYTORDA= 1
##$CFDGTYP= 0
##$CFRGTYP= 5
##$CHEMSTR= <none>
##$CNST= (0..31)
1 1 145 1 1 1 1 1 1 1 1 1 1 1 1 1 1 1 1 1 1 1 1 1 1 1 1 1 1 1 1 1 
##$CPDPRG= <>
##$CPDPRG1= <>
##$CPDPRG2= <>
##$CPDPRG3= <>
##$CPDPRG4= <mlev>
##$CPDPRG5= <mlev>
##$CPDPRG6= <mlev>
##$CPDPRG7= <mlev>
##$CPDPRG8= <mlev>
##$CPDPRGB= <>
##$CPDPRGT= <>
##$D= (0..31)
0 1 0 0 0 0 0 0 0 0.06 0 0 0 0 0 0 0.0002 0 0 0 0 0 0 0 0 0 0 0 0 0 0 
0 
##$DATE= 1132663262
##$DBL= (0..7)
120 120 120 120 120 120 120 120 
##$DBP= (0..7)
150 150 150 150 150 150 150 150 
##$DBP07= 0
##$DBPNAM0= <>
##$DBPNAM1= <>
##$DBPNAM2= <>
$$ [...]
##$SUBNAM7= <"">
##$SUBNAM8= <"">
##$SUBNAM9= <"">
##$SW= 20.6930455092707
##$SWIBOX= (0..15)
0 0 3 0 0 0 0 0 0 0 0 0 0 0 0 0 
##$SW_h= 5175.983436853
##$TD= 65536
##$TD0= 1
##$TE= 294.16
##$TE2= 300
##$TE3= 300
##$TEG= 300
##$TL= (0..7)
0 120 120 120 120 120 120 120 
##$TP= (0..7)
150 150 150 150 150 150 150 150 
##$TP07= 0
##$TPNAME0= <>
##$TPNAME1= <>
##$TPNAME2= <>
##$TPNAME3= <>
##$TPNAME4= <>
##$TPNAME5= <>
##$TPNAME6= <>
##$TPNAME7= <>
##$TPOAL= (0..7)
0.5 0.5 0.5 0.5 0.5 0.5 0.5 0.5 
##$TPOFFS= (0..7)
0 0 0 0 0 0 0 0 
##$TUNHIN= 0
##$TUNHOUT= 0
##$TUNXOUT= 0
##$USERA1= <user>
##$USERA2= <user>
##$USERA3= <user>
##$USERA4= <user>
##$USERA5= <user>
##$V9= 5
##$VALIST= <valist>
##$VCLIST= <CCCCCCCCCCCCCCC>
##$VD= 0
##$VDLIST= <DDDDDDDDDDDDDDD>
##$VPLIST= <PPPPPPPPPPPPPPP>
##$VTLIST= <TTTTTTTTTTTTTTT>
##$WBST= 1024
##$WBSW= 4
##$XGAIN= (0..3)
0 0 0 0 
##$XL= 0
##$YL= 0
##$YMAX_a= 592238
##$YMIN_a= -508546
##$ZGOPTNS= <>
##$ZL1= 120
##$ZL2= 120
##$ZL3= 120
##$ZL4= 120
##$ABSF1= 16.522
##$ABSF2= -4.171173
##$ABSG= 5
##$ABSL= 3
##$ALPHA= 0
##$AQORDER= 0
##$ASSFAC= 0
##$ASSFACI= 0
##$ASSFACX= 0
##$ASSWID= 0
##$AUNMP= <proc_1d>
##$AZFE= 0.1
##$AZFW= 0.1
##$BCFW= 0
##$BC_mod= 0
##$BYTORDP= 0
##$COROFFS= 0
##$CY= 12.5
##$DATMOD= 1
##$DC= 0
##$DFILT= <>
##$DTYPP= 0
##$F1P= 14.0000005364418
##$F2P= -0.99999901652339
##$FCOR= 0.5
##$FTSIZE= 32768
##$FT_mod= 6
##$GAMMA= 0
##$GB= 0
##$INTBC= 1
##$INTSCL= 1
##$ISEN= 128
##$LB= 0.3
##$LEV0= 0
##$LPBIN= 0
##$MAXI= 10000
##$MC2= 0
##$MEAN= 0
##$ME_mod= 0
##$MI= 0
##$NCOEF= 0
##$NC_proc= -4
##$NLEV= 6
##$NOISF1= 0
##$NOISF2= 0
##$NSP= 0
##$NTH_PI= 0
##$NZP= 0
##$OFFSET= 16.522
##$PC= 1
##$PHC0= 71.57315
##$PHC1= 6.518377
##$PH_mod= 1
##$PKNL= yes
##$PPARMOD= 0
##$PSCAL= 4
##$PSIGN= 0
##$REVERSE= no
##$SF= 250.13
##$SI= 32768
##$SIGF1= 0
##$SIGF2= 0
##$SINO= 400
##$SIOLD= 32768
##$SREGLST= <1H.DMSO>
##$SSB= 0
##$STSI= 32768
##$STSR= 0
##$SW_p= 5175.98343685301
##$SYMM= 0
##$S_DEV= 0
##$TDeff= 65536
##$TDoff= 0
##$TI= <Analysis number 999999
Compound Code 99
Book Reference 9
Project Code 9>
##$TILT= no
##$TM1= 0
##$TM2= 0
##$TOPLEV= 0
##$USERP1= <user>
##$USERP2= <user>
##$USERP3= <user>
##$USERP4= <user>
##$USERP5= <user>
##$WDW= 1
##$XDIM= 32768
##$YMAX_p= 455937801
##$YMIN_p= -219023
$$ End of Bruker specific parameters
$$ ---------------------------------
##NTUPLES= NMR SPECTRUM
##VAR_NAME=  FREQUENCY,     SPECTRUM/REAL,   SPECTRUM/IMAG
##SYMBOL=    X,             R,               I
##VAR_TYPE=  INDEPENDENT,   DEPENDENT,       DEPENDENT
##VAR_FORM=  AFFN,          ASDF,            ASDF
##VAR_DIM=   32768,         32768,           32768
##UNITS=     HZ,            ARBITRARY UNITS, ARBITRARY UNITS
##FACTOR=    0.157963299565203, 1,           1
##FIRST=     4132.6476996994, 0,             0
##LAST=      -1043.33573715361, 0,           0
##MIN=       -1043.33573715361, -219023,     0
##MAX=       4132.6476996994, 455937801,     0
$$ Real data points
##PAGE= N=1
##DATA TABLE= (X++(R..R)), XYDATA
$$ [...]
29453 42036 -14441 -12025 37956 30989 3316 10457 7736 -7948 -19252 -17103 75804 98559 142674
29440 142674 132746 137726 141063 98667 65663 84966 145831 94806 84879 56796 55488 -14772
29428 -14772 -96524 -69259 -28005 -28116 -13093 -35494 -99252 -116279 -101206 -66892 -53940 -105793
29416 -105793 -123687 -58344 -8668 -6433 -2702 -15314 -29721 -48055 -48868 -70309 -50584 -37415
29404 -37415 33703 92552 99589 85622 50789 41705 -35627 -46911 -6933 7875 17908 92930
29392 92930 122728 127015 125417 73133 6926 36345 69940 23860 32012 31465 36930 28710 27410
29379 27410 33784 18876 -67221 -137480 -143082 -64991 -18749 -8862 -61600 -84365 -78148 -14656
29367 -14656 10457 52907 44533 57262 34527 -56972 -58911 -55020 -4583 19560 16800 28222
29355 28222 20162 25617 77496 71467 7094 28141 87428 71891 47544 19168 38403 71661
29343 71661 91509 91537 120020 50672 2470 19375 -53822 -54661 62563 91040 66035 71542 37883
29330 37883 29375 -65453 -85995 -24253 -29021 -34198 -60704 -70462 -49192 -23591 -44532 -62785
29318 -62785 -40891 -29009 -8731 8018 6137 58961 86206 20757 -37161 -6005 31028 74077
29306 74077 57949 -15840 -21026 -31732 -73139 -44588 44571 71049 63033 113576 68419 20178
29294 20178 11894 26297 -8418 -37605 -45318 -67952 -127167 -149044 -92078 -42616 -14528 -13466
29282 -13466 -7028 -19806 -56510 -25997 -43934 -22225 -56046 -115548 -65893 -36943 -21623 -4485
29270 -4485 33344 52963 41707 -4529 12909 24365 76228 99129 36203 -6384 25141 48544
29258 48544 49516 11519 -30731 -34337 22289 15274 -13174 -40257 -17623 -407 -8386 -13075 -20937
29245 -20937 10404 42923 15889 -41873 -48733 1925 -29912 -21792 -2440 18733 25857 -839
29233 -839 -60356 -128337 -61586 -46291 -9529 51019 54412 69292 75832 61985 53487 39290 22928
29220 22928 -18288 -15877 17655 -9564 -78748 -49941 4196 39907 47166 64132 112067 142393
29208 142393 46509 -8723 -32518 3309 49827 82118 81046 121285 62830 8807 -20701 7640
29196 7640 52029 47627 -9243 -42572 -9932 -20955 1639 29683 550 37292 74849 31967
29184 31967 -27742 -32555 -36302 8341 46108 32373 18031 45575 53064 4483 -2518 -16367
29172 -16367 1987 25614 67795 62695 75886 59911 105451 46026 26427 29960 -10473 -8900
29160 -8900 -9989 -10309 -6786 -3909 1422 -24656 18823 2250 30137 96694 127259 102925 40685
29147 40685 -5155 -4467 -13988 2246 38631 32319 60522 80493 85792 60120 57345 61303 46729
29134 46729 42700 41152 93093 92500 73716 77891 83124 54830 18894 7883 15554 -46200 -100521
29121 -100521 -96409 -48621 54662 87005 16534 -57161 -19117 28237 61490 66680 6112 3796
29109 3796 17919 15170 43528 19161 16633 48457 5150 -23551 -15897 -62703 -72449 -93906 -127190
29096 -127190 -28414 3685 -19652 1451 -12390 -7118 3858 39958 54883 65814 -5882 -15148
29084 -15148 14216 34644 33746 31889 -10647 -31493 -36942 34728 75395 51234 73674 94556
29072 94556 96048 54927 -17697 -37173 -20375 -19203 -21228 -25872 -22234 22554 -15168 -47249 -46181
29059 -46181 -39585 -63547 -35626 -8308 -23274 -3197 -35070 -5133 36695 -1469 2784 -26490
29047 -26490 -25131 4589 64787 44003 104702 81386 21962 10690 -25192 -42326 -54341 -37098
29035 -37098 -61882 -76878 -70995 -65952 -65530 -57860 -69802 -63521 -37715 -41972 -93804 -131328 -80111
29022 -80111 -70979 -15607 24521 554 13572 18894 6211 3063 40661 52113 103047 167187
29010 167187 180934 153198 79056 58287 56340 26131 -9484 -30338 -60502 -96041 -76208 -31895
28998 -31895 -11298 -82352 -108663 -92273 -29549 -61669 -17458 26647 23902 78297 81641 91888
28986 91888 65123 75414 62011 40745 -994 -5154 14314 -9233 12626 -20210 974 23028
28974 23028 69775 113789 52536 6406 61430 53929 20288 9911 -20343 -36369 -25095 -48773
28962 -48773 -35850 -45567 -30172 -2532 -16518 -47446 -11783 7331 6826 -35276 -36686 -33192 -23444
28949 -23444 -29013 -18216 -6363 -57382 -70806 -11444 27264 29968 41652 81702 88295 99536
28937 99536 50156 29404 45801 43171 60645 11809 8345 6290 42350 67373 66517 21795 30592
28924 30592 27597 61713 69886 24892 -38763 -58127 -34767 -10117 -7452 -17601 15214 83600
28912 83600 59849 44656 -14361 11041 41377 41907 18485 -31095 21543 36622 5569 -100684
28900 -100684 -89427 -29659 -39044 -18716 20810 21510 6648 -10869 -49603 -49544 -74518 -71621 -74294
28887 -74294 -110156 -131766 -69692 23497 48602 32364 -13 27592 69687 53992 46027 84000
28875 84000 80186 51431 71655 97305 79243 -33382 -20298 74751 99333 38852 125 -25084
28863 -25084 1132 -57601 -99052 -41422 -60114 -69324 -52191 8352 1848 44461 108698 70215
28851 70215 34247 54564 44381 13882 60592 17989 56077 65495 36476 16542 -10273 -90361
28839 -90361 -100682 -63176 -100928 -8828 2017 -5427 26489 -10726 -2586 -25692 -42975 -61753
28827 -61753 -112972 -102420 -19642 15359 -761 -9835 -43743 -12897 -5354 -7738 -20958 -21623 18570
28814 18570 35837 50282 16568 33341 94090 119243 86680 88041 43050 10402 -50153 -37939
28802 -37939 1578 26141 32732 35427 -68117 -107074 -27507 -17792 -17670 -32054 38867 99173
28790 99173 45397 26553 43027 67630 36495 56103 100712 124929 79690 9007 35173 60010
28778 60010 1060 -3628 -15674 -21707 5734 34485 49737 20018 -30612 -11929 35834 13986
28766 13986 2575 -44245 -55530 -44248 -19803 -10568 10996 40025 11927 13441 32001 20921
28754 20921 22576 36695 -14568 -70581 -110399 -108858 -57654 -13588 -23324 36611 128122 165435
28742 165435 124798 105345 49865 -7495 -247 -17419 -37472 23112 3363 53720 96050 51258
28730 51258 81578 83608 43309 -2295 75486 79559 36525 -17181 -33855 22840 19490 85908
28718 85908 130178 130607 76148 -13398 -41362 -70474 -136931 -90177 -27805 -12432 11885 -6208
28706 -6208 14355 58231 78528 126334 102609 68351 23565 -37843 -38746 -33700 -35598 -44008 -40008
28693 -40008 -2353 17047 30898 36063 23440 -16334 -26150 13436 25872 -29460 -30241 -11021
28681 -11021 -12649 -1198 -2640 40517 44942 25353 3567 13731 41368 27061 -22356 -2226
28669 -2226 -10243 5939 34572 -8856 -82778 -61617 -43501 -25016 -27436 -74592 -44619 -26048
28657 -26048 -89417 -84060 -37715 -10877 -48284 -69982 -50339 8419 15870 -10718 -26942 -90488
28645 -90488 -89275 -15823 26143 31925 -1767 -25986 -70728 -118707 -126206 -73462 -11350 -12750
28633 -12750 -71547 -98780 -65524 -60082 -41371 -10895 -23142 -4276 42875 22675 23607 39021
28621 39021 67943 54362 70560 132360 190541 104289 36971 40709 54367 29984 47246 44042
28609 44042 18587 -48911 -110054 -97491 -19639 31015 40451 60372 101841 112665 95754 51972
28597 51972 15468 27584 11130 40344 36246 20712 13972 -11143 -6180 -1518 16271 -24937
28585 -24937 4435 51496 27739 37073 54811 24596 36677 23848 10170 6654 19113 69752
28573 69752 91812 84511 29323 -34568 16949 44488 46946 60368 32944 -19433 -24085 -20662
28561 -20662 -19923 25022 14635 -1032 -46282 -25655 9685 15307 -7300 -2126 42508 44217 -21603
28548 -21603 -46842 14223 33187 63245 60544 410 -15876 -8843 96496 124018 80123 37909
28536 37909 -24052 1510 52475 75269 50426 19513 17138 30225 54608 55891 74688 50310
28524 50310 13694 -5804 44961 61798 57565 30849 72706 49738 -9882 3009 23943 27151
28512 27151 51822 33283 24723 95734 118102 139349 130639 167584 149666 125164 92730 62797
28500 62797 94304 28191 -23667 -49490 -37660 -4422 4308 44345 50534 71274 124592 60958
28488 60958 29530 12080 -37038 -72705 -111152 -71356 -62576 -38661 10903 -66094 -84112 -10143
28476 -10143 44635 19290 -24418 -15330 36064 64783 82211 94775 68005 -13743 -45799 -30323
28464 -30323 26661 31443 -10709 -7837 42410 36669 5121 70611 115885 97621 25799 34335
28452 34335 16033 8825 36499 81775 92404 107606 103540 100764 94641 95509 74312 21708 -3976
28439 -3976 -2603 -1537 31397 20296 62968 70796 39088 33374 17152 5118 -50437 -34605 -14202
28426 -14202 -6700 31688 49339 37157 15640 -36523 -56431 -61198 -46697 -39014 -26700 -1038
28414 -1038 19016 -9589 -10494 3187 34286 62167 23344 -33206 -16395 48284 50183 -34456
28402 -34456 -37630 -46432 -67870 -33891 -55349 -16718 -22211 -48362 -76775 -59672 -36350 31081
28390 31081 119273 118058 129621 149829 82346 42627 30052 23602 -29880 -53366 -31779 -34473
28378 -34473 -55214 -60298 -34938 -19690 -15349 4671 3198 19218 -55 -25730 -60618 -6497
28366 -6497 26141 -34392 -21461 33632 45558 44511 -47063 -53561 24278 65333 55891 89879
28354 89879 139554 113736 55877 -13623 -30343 54636 81102 89477 22268 8548 -4084 -59171
28342 -59171 -75493 -85712 -20661 1899 -19425 -12767 -42051 -89929 -60400 -59790 -36582 3798
28330 3798 11044 22606 13465 4181 19524 -21103 -56646 -47597 -52430 29819 27008 -2470 -22378
28317 -22378 17478 23352 53980 6581 -66088 -131361 -123838 -30828 17972 4616 -47278 -124811
28305 -124811 -70842 -21281 31287 43198 20234 14323 -42165 -30278 9393 -14371 92 41751
28293 41751 8812 -4336 27481 15223 5136 41892 52924 78484 40491 8636 57423 109086
28281 109086 109482 40227 -15747 -17613 -59404 -117186 -90917 -15836 34133 73180 87279 13002
28269 13002 -33326 -38895 -12326 -61394 -38583 -31067 5568 27659 -21460 -36345 -49530 30971
28257 30971 5785 -16983 -8780 44640 86778 104561 76161 20083 30600 9513 -18886 -38718
28245 -38718 -33698 16591 41024 44556 54347 80479 105497 91164 103160 35299 49782 43323
28233 43323 -9705 -11947 41168 21369 -38252 -39592 -11886 4308 22466 58576 105639 129733
28221 129733 101433 80619 59941 51407 109616 85133 50101 28434 44470 51077 14749 -41605
28209 -41605 -24293 46051 105566 43935 -2880 -17805 -31290 -97 30196 -10413 827 16924
28197 16924 17057 37265 -14022 10215 -3555 -27476 -29085 -59008 -70265 -83346 -94572 -72504
28185 -72504 -20396 64135 92204 83289 125159 131068 78405 23376 23583 42982 13769 -49072
28173 -49072 -99485 -109253 -32171 -28497 7884 73577 58492 24823 15484 21349 43006 5475
28161 5475 -57593 -75005 -73245 28614 34380 15413 -38356 -50666 -23460 38242 54482 24955
28149 24955 -61838 -48278 -9414 -48398 -18873 46804 64642 22268 -6478 31082 93974 82166
28137 82166 50339 75029 84217 70022 108000 82846 64606 89383 3875 -22553 -35351 -53748
28125 -53748 -18407 -21303 -4721 -3484 40740 48114 48664 5626 38829 54227 29173 -3500 -20673
28112 -20673 18489 4245 -25120 32233 83184 61560 11041 58805 75274 64825 48673 -12884
28100 -12884 -54931 -75849 -7835 41357 102242 57390 -26553 -5307 11390 -24369 -70254 -106056
28088 -106056 -34183 -20338 35995 24151 -18361 -347 -59285 -48623 17598 20488 3625 -192
28076 -192 -29291 25378 75775 44932 -8603 -43439 -88956 -76961 -91018 -96923 -57651 -46080
28064 -46080 -23713 -5843 55570 77950 72003 12663 5705 1825 23995 34373 21257 -28495
28052 -28495 -69179 -81804 -113281 -121318 -92867 -15450 -43499 -48571 2641 58582 33381 -1168
28040 -1168 18659 -1211 5657 41231 60925 -18195 -62562 -62247 -12395 6656 -16508 -44905
28028 -44905 -47878 -36625 7574 33437 14693 10240 52472 83728 121754 89838 69520 63188
28016 63188 28236 -46987 -63397 -84352 -129304 -195480 -144058 -67111 -68228 -69807 -60006 -2328
28004 -2328 30623 -9860 5326 42893 89078 72470 32960 9785 38208 61104 63147 65020
27992 65020 -2812 -10819 4804 21151 12841 4970 62039 122819 127618 55972 -34205 -77413
27980 -77413 -96924 -44515 -30392 -19148 37994 68893 82544 69783 92443 138002 152553 122987
27968 122987 133348 124656 91895 87805 80659 11442 -31239 -59095 -67274 -18253 18601 -2075
27956 -2075 753 15047 48239 10031 116 92997 123057 136407 148699 92482 90664 145991
27944 145991 143957 137791 150847 132762 22284 -16400 20202 105911 143509 138248 112081 86019
27932 86019 41707 36517 21264 45860 59852 -11087 -20998 -46234 -46150 -18659 28030 24003 67804
27919 67804 151950 197668 144039 87764 62578 50719 1336 -26184 -5021 2013 3479 16268
27907 16268 29611 51865 71729 89086 107453 86066 13225 22771 70144 100537 104923 87158
27895 87158 75322 12917 -52408 -48084 -63477 -35506 -22478 -50929 -56485 27532 52486 53799
27883 53799 51896 92304 82801 70209 39669 53186 45430 -17639 -25139 -43189 217 1860 4801
27870 4801 -3760 -34138 -60311 -22972 19095 35463 5749 28186 20144 -16848 11648 -13067
27858 -13067 -33630 -44499 -40706 -5642 -31426 -44268 -55845 -24704 -46306 -35205 -24196 16673
27846 16673 29815 21666 19960 29384 107944 129208 114797 125395 89136 62132 42516 34056
27834 34056 7383 5299 -15754 -9957 6104 42404 34823 20994 36951 68279 53846 30365
27822 30365 26246 -16962 -48579 13132 12999 24092 39801 37190 17951 -5575 1734 30495 26606
27809 26606 25084 10855 38187 109006 64242 36360 -29703 -57272 -54327 -31153 53373 72270
27797 72270 122828 140741 116489 82260 95888 93146 64621 40038 52616 5531 -64938 -13669
27785 -13669 12777 49304 49165 37219 31130 -1585 10270 95896 129308 103622 18594 36396
27773 36396 12940 -9982 8756 27241 61276 28657 -1731 -36792 -12969 92149 131577
27762 131577 84099 18592 -13322 1075 40177 33219 46037 26637 -10784 -56722 -72154 -81085
27750 -81085 -22019 73276 40792 -8294 25158 25818 80067 119753 34671 -47088 -68605 1880
27738 1880 41216 13124 35438 56672 39834 55006 43370 35849 -13970 -61419 -27349 -15870
27726 -15870 -37987 -40310 8135 13886 52936 103373 110258 112601 27659 -45271 2380 11775 -2286
27713 -2286 -1992 13210 -37129 -92016 -92337 -56785 -41530 -38131 -14121 23932 34003 18673 17891
27700 17891 49311 87446 63186 -26952 -82340 -40769 6791 -21207 -126849 -155392 -112221
27689 -112221 -90617 -91530 -96806 -46085 -29865 -25711 -43602 -83228 -49821 -12932 10983 -13546
27677 -13546 -31915 -86612 -106265 -67734 -17896 17785 13833 2973 35038 28359 -38220 -71345
27665 -71345 -29465 -5900 -13367 15497 17887 7435 7364 6465 37251 51011 24726 -54204 -111466
27652 -111466 -105169 -69887 -85975 -112526 -45595 -24083 11101 19874 3696 -17759 -61269 -7603
27640 -7603 -12979 -28278 -24145 -33481 14516 68356 36791 34225 9362 -15142 -49360 14672 3726
27627 3726 5170 24972 40814 23539 30086 70926 85568 92132 67968 40541 1498 -37303
27615 -37303 9910 18783 34837 58305 105738 115000 63182 13661 -46688 9797 45721 18720
27603 18720 -1957 6841 40804 79837 66882 44883 13675 18179 44494 79419 109291 94002
27591 94002 124501 61556 32009 70966 19734 -1252 31761 5711 -7865 37461 1197 -21931
27579 -21931 -34920 29161 3243 -48558 -8368 8216 -31902 -91399 -69884 -25350 -11221 13417
27567 13417 14933 7872 -32439 -55266 -47590 -61068 -106709 -120427 -105217 -112829 -82038 -15465
27555 -15465 28349 -6094 987 32866 79414 84522 48625 3843 -1510 -66181 -110247 -52866
27543 -52866 -27680 -19365 -51674 -37081 -1035 82924 101442 105384 105745 81794 59579 40716
27531 40716 -39096 18939 75225 63437 32051 26401 30288 41165 63814 91480 108077 99457
27519 99457 52055 23909 33631 53518 48640 5419 15649 7568 -37769 3153 59888 66755
27507 66755 19779 56288 133029 130892 91047 52240 8904 -68133 -40799 1316 -22306 -107604
27495 -107604 -93063 -65435 -101729 -84382 -34098 -24864 26286 69048 -5092 14450 38908 77114
27483 77114 47277 18400 -22244 -26834 16050 26179 21617 70502 80771 75496 24796 -28437
27471 -28437 -32483 -32687 -20518 10181 -56537 -127443 -106473 4662 72574 36546 10806 6290
27459 6290 -677 15368 45275 86379 42928 -5936 -14669 50681 96280 87379 58145 -20274
27447 -20274 -51439 -44767 -65967 -44298 -12109 10263 -12578 -20904 11290 -24619 -22772 -46212
27435 -46212 -16538 12085 -35451 -67157 -32791 6311 -12610 -18603 -38671 -32236 -19012 -24454
27423 -24454 -10610 17955 40339 17311 -36284 -80863 -84969 -18043 24211 27793 -38593 -13201
27411 -13201 -54368 -49358 19123 58698 67678 38163 -17039 -8550 42526 6940 -42019 -42659 -45708
27398 -45708 -4578 21707 27464 -11444 -32587 -29497 -42316 -68477 -27119 3969 30327 16319
27386 16319 2610 29548 57590 138607 108300 71148 103366 93100 76488 61932 39233 36677
27374 36677 37941 42717 41754 54477 5083 4474 -3806 19395 37547 26752 19605 98327 121343
27361 121343 127784 65140 13731 22994 103051 115977 87526 51544 36339 26341 23885 90682
27349 90682 114341 96032 57030 28382 -1826 -39860 4871 43851 16927 -65983 -79635 -35117
27337 -35117 -68320 -5721 35066 4762 13270 15370 -25263 1825 48809 47456 82581 115801
27325 115801 76259 96927 63659 46340 67406 8949 -19731 -9628 11835 -650 16037
27314 16037 -19609 -30691 -4676 2833 -19122 21250 98752 77859 32868 34841 -27419 -63317
27302 -63317 -14246 3734 -34868 25653 71384 -10841 -109415 -83894 -90381 -108514 -116272 -128725
27290 -128725 -124123 -106692 -116098 -79647 -75160 -90525 -83243 -22300 -81135 -103480 -78063 6902
27278 6902 71815 46813 5184 -35838 -18688 -22529 -27774 -39903 -11875 -9779 39630 32933 21864
27265 21864 -39724 -51316 -34299 -30299 8356 19895 -5235 -38551 -15134 -2130 -29622 13988
27253 13988 51122 88933 65532 111580 104009 61656 15764 35875 56135 97880 78029 -1506
27241 -1506 -22875 -12915 -49144 -20465 -4202 3784 -11540 -35181 -20044 2382 -14898 -59323
27229 -59323 27675 59134 65546 68548 -7780 13974 2736 -43693 -11929 4826 -28744 -52658
27217 -52658 -31663 -68958 -63328 -40244 -57886 -99925 -75639 -95712 -138523 -153962 -162277 -99678
27205 -99678 -99862 -62294 -31440 -20648 -15996 -20574 17889 66188 65244 21505 -3149 30046 12868
27192 12868 -24672 -40467 10440 65698 61659 62058 36772 -31549 -36181 -72048 -91622 -87535 -33188
27179 -33188 -23959 -64021 -66888 -49666 -59071 -53701 -20277 1655 68508 45230 8822 -21261
27167 -21261 -71651 -100046 -74892 -14579 24277 14903 -15265 -77441 -61176 -58286 -64824 -46685
27155 -46685 -15359 -10307 31133 41756 -21307 -85943 -107580 -29148 14697 3862 4779 20912
27143 20912 15064 -13884 31319 94569 54174 50143 60606 30717 40086 -7900 -65496 -118302
27131 -118302 -94007 -38355 -9550 39335 106098 83853 28630 7141 -24141 -12681 -65172
27120 -65172 -43819 -35419 -24642 1858 47385 34413 7284 -7618 45248 106868 87849 39838
27108 39838 -20731 -11508 -7576 -63568 -63807 4758 -19681 -1060 -5264 -56585 -37108 -1482 -20776
27095 -20776 16107 50688 60564 79735 88346 67337 26597 92942 87687 25806 -29522 -70627
27083 -70627 -68467 -11847 19366 58571 90379 108161 96552 9237 -22629 47288 104197 127197
27071 127197 95467 25360 5056 21774 63267 128347 80921 73749 95504 18608 -15651 -13591
27059 -13591 -21953 -71892 -12457 -6792 -24782 -52938 -62953 -40636 6675 44429 4355 4099
27047 4099 -7010 881 47884 33061 -50864 -66047 -30178 61306 97608 115675 23076 -14255
27035 -14255 17022 50805 26241 15080 32666 34544 36529 -17093 -8955 1309 -21700 2238
27023 2238 61132 34364 -30473 -72069 -42090 -44380 -60691 -78109 -75705 -77622 -44934 -92004
27011 -92004 -109476 -113571 -66191 2307 17265 9438 14544 9334 15849 42744 30637 8905 -3817
26998 -3817 27427 92103 49474 25017 -4946 -40468 -13129 -32247 -39407 468 37575 14422
26986 14422 -37873 -48507 20531 21307 -20848 18814 40656 -25026 -86582 3383 46930 57981
26974 57981 34533 -76639 -108227 -77087 -26612 -20882 -45126 -77852 -74328 -67887 -65698 -49694
26962 -49694 8477 56066 -10206 -59988 -68246 -65338 -31322 23161 36355 -26772 -56147 -41631
26950 -41631 -68402 -70993 -54354 -19747 13068 67496 127088 86949 -7458 -33316 -62225 -35316
26938 -35316 31352 58463 64045 49388 55498 -6333 -43390 22746 80965 57339 -16490 -499
26926 -499 41139 39076 25374 -29361 8085 93145 128498 79163 54551 74790 115195 119549
26914 119549 5408 -54660 -11008 26917 19867 4379 49087 58890 98039 72610 -37110
26903 -37110 -108127 -114811 -101454 -91640 -62959 -53846 -100150 -67613 -7183 70887 50275 17005
26891 17005 7016 10290 21882 -20113 -63650 -90131 -127148 -130273 -66225 -50814 -32669 -38809
26879 -38809 -21610 -13217 7482 39627 81275 2736 32347 136949 106901 105679 47180 12628
26867 12628 30395 6403 -7729 -59394 -75711 30 29631 11347 31414 77852 44517 51976
26855 51976 57689 47691 41799 -20253 -18815 -16855 23868 31791 9800 -25101 -72152 -80665 -37003
26842 -37003 56286 49400 23775 19525 -21785 -34323 -556 1208 -2579 -43534 38382 16739
26830 16739 -32965 -19756 48432 78676 26633 -19347 44672 93447 93402 109671 105656 82772
26818 82772 40957 -11187 -21583 25268 31535 14141 -33471 -36603 19013 44117 5558 -2564
26806 -2564 -8739 18452 5306 -3792 45153 22072 -32541 18136 53125 105405 116703 88127
26794 88127 64433 22265 -46344 28477 52340 34566 -25883 11839 38241 21823 40029 77851
26782 77851 98883 71078 47217 -985 21181 81276 87373 48078 -8395 -26650 -31572 -18808
26770 -18808 10538 -17763 -61236 -19201 58174 27856 25264 71511 24840 22967 64326 50524
26758 50524 47418 24859 -18473 -30970 -59664 -36145 47945 58402 81297 75395 40124 51409
26746 51409 123833 98030 49611 62246 63202 34056 19270 28296 4857 -16356 54999 63736
26734 63736 39116 32957 -851 -21073 -66319 -40546 16235 -4063 -27396 -16703 17588 32571
26722 32571 -57289 -74206 -14518 -55343 -55219 -25661 27759 55730 45029 43934 1983 -39686
26710 -39686 33284 13242 -27362 -51513 -35477 -73719 -90163 -86904 -90085 -52316 -44661 -68001
26698 -68001 -14178 22847 59436 63140 54695 22401 -3878 28097 63554 19147 11827 -8958
26686 -8958 -16733 37359 72369 81308 76921 25236 7224 26767 24779 13192 41372 93136 191990
26673 191990 195441 117584 109159 67164 36906 81546 89435 50921 77149 80889 47029 16997
26661 16997 108159 90715 4549 -25555 -39712 -99915 -66843 -53295 69653 99206 48990
26650 48990 26051 -16372 -82289 -98731 -109504 -86495 -65180 24856 40988 15285 -43780 -70417
26638 -70417 -46525 41575 76293 85431 111294 104135 80771 36621 24651 -25308 -39872 -27942
26626 -27942 -18213 51412 65696 50544 -1837 11669 51309 52556 53312 25149 31293 72140 94928
26613 94928 44654 35007 13466 -47587 -78453 -41814 -31271 -65033 -42446 686 -12973 -49887
26601 -49887 -86695 -102012 -40201 42334 91257 129564 113338 92236 107417 116335 48583 41377
26589 41377 4525 17945 25820 -34258 -21294 15403 9609 22853 69969 106355 86625 23834
26577 23834 58349 106677 87006 6531 -64853 -45837 -30464 -11530 25784 5618 -16995 15088
26565 15088 -24326 -29844 -38173 -77562 -80627 -16324 -15286 -26659 -17828 -43888 -20875 55589 58083
26552 58083 -11862 -83788 -59824 -36337 -32034 -21888 17092 41634 -22682 -47287 10922 32772
26540 32772 64148 13386 -68020 -133574 -156243 -145456 -55052 -28472 -29363 42168 38787 2816
26528 2816 19456 10937 13217 26434 11723 14604 25417 23839 -53177 -76654 -11274 33273 9245
26515 9245 -14349 -20500 -8956 -56908 -40623 4230 42654 82380 126033 87114 25191 10559
26503 10559 -1379 5189 19368 -14072 30519 43714 16860 -20246 55200 86375 103041 90598
26491 90598 59083 90997 129561 64989 24258 -52291 -34604 -13239 -19691 -2079 26952 59735
26479 59735 50310 3179 25459 55846 69686 48395 61988 49227 13113 -32008 -58892 -46324
26467 -46324 -42637 1677 57578 32047 -39480 -33317 47866 62396 54701 72536 107889 60032
26455 60032 51214 54944 41860 1038 29121 60775 102165 145849 138705 83363 63673 5164
26443 5164 -36391 -61648 -53924 -18629 64241 74825 59654 -853 11484 77179 78566 -739
26431 -739 -52534 -50170 -39798 -13897 -25021 -31156 8203 20257 -25793 -9446 -259 -44911 -27431
26418 -27431 -11235 37943 22717 -289 -48475 -101563 -83565 -57759 11073 43615 8928 11845
26406 11845 33038 -24281 -4775 77514 45286 -25346 -83192 -65054 -28864 -21050 -53333 -20969
26394 -20969 5338 -25459 -37759 2581 44174 31057 4289 16141 29418 10124 3712 65870
26382 65870 52265 -3434 25452 77460 96084 51158 8166 -66721 -69737 -62314 -74786 -46732
26370 -46732 -56194 -54925 -30999 -26618 -15915 -49515 -81887 -104983 -102381 -43185 -54850 -38275
26358 -38275 -10292 -1825 -37945 -18555 19342 -18708 -65619 -120355 -99282 -69048 -55190 -55094
26346 -55094 -58302 -70994 -93051 -71593 47107 72498 9982 -11113 12417 -20946 -31193 -34802
26334 -34802 13680 64825 62691 644 -62375 -34546 -7655 6588 61945 9546 -11460 -78673
26322 -78673 -46134 -7647 -29272 -31660 -81296 -137247 -95357 -57206 -69591 -75389 -97344 -75057
26310 -75057 -32439 13216 59541 39849 -37475 -64755 -45546 -8149 25271 47534 35120 17565
26298 17565 8628 -34830 -61571 -89034 -83307 19536 3537 -17190 41842 71229 56352 34904
26286 34904 63434 97552 98303 80625 53168 -12995 29706 67917 43852 41747 38347 13674
26274 13674 -42498 -52518 56260 87860 23439 -20267 -76973 -120373 -118852 -74449 -45244 -22207
26262 -22207 -26483 -10822 30343 36565 32780 -3986 -10490 -15871 40622 -9091 -56846 -23377 1798
26249 1798 60592 61948 22830 -24494 19818 49785 75719 121001 97152 60582 63809 5063
26237 5063 -21094 19466 64821 47426 8189 -32374 -21983 -38952 8043 74815 145386 104342
26225 104342 33418 23481 371 -45980 -35740 28895 60802 76401 73945 27157 -39118 -49694
26213 -49694 14569 32618 46679 36090 -21071 -21766 6529 79800 70396 75412 63130 14608
26201 14608 7370 43652 49999 79364 69063 76930 92012 44461 43808 -2165 18859 48984 10357
26188 10357 -631 -20463 -7204 27817 184 -14330 -29953 12491 58203 91803 106665 70116
26176 70116 48679 58256 11685 35455 83622 43922 82348 59171 -25764 -79972 -129961 -146278
26164 -146278 -89781 -39534 -68628 -37553 -15272 26912 59944 47729 -55623 -62116 -1257
26153 -1257 -172 -32426 -58209 -55376 -11831 19380 -29840 -20741 -40351 -39254 -45080 13906 41742
26140 41742 40609 34787 38065 28010 36389 3540 -103114 -139521 -130743 -96314 -22202 -26998 -57156
26127 -57156 -83133 -79071 -49232 -2704 1297 43708 58604 16060 -45319 -30679 -22816 -37013
26115 -37013 -46894 -15133 -8323 -32871 -28983 -3818 25945 47830 29438 -9459 26383 -6794
26103 -6794 -29984 10610 80551 53386 36851 32279 63771 19211 -45895 -14099 -2558 5170
26091 5170 22162 1854 -74157 -69209 -84625 -10192 7876 -53421 -22343 19323 38022 23046
26079 23046 -25150 12707 72244 44200 28886 100153 88999 76373 65652 50098 10171 61273
26067 61273 65526 52032 83240 89302 46568 11541 51035 52599 43480 39154 51900 90709 162083
26054 162083 176428 157185 107656 72185 68803 3460 -27157 62205 95406 92276 109626 77419
26042 77419 64151 86221 115302 91572 103113 137030 171051 88894 24606 -6822 17720 -1823
26030 -1823 62 10059 37130 44699 19950 -10525 -67173 -98356 -89272 -8059 24918 -70876 -88444
26017 -88444 -48999 -17763 32828 10568 -9502 5151 12445 3899 65041 99581 51758 62539
26005 62539 33698 -14669 -28047 -33892 -43327 -37665 -3534 -591 11339 7032 -5576 61233 103343
25992 103343 64246 62552 28655 14999 52487 47538 731 32949 18409 15462 8401 38074
25980 38074 99599 99684 105688 114357 102288 106601 77965 75543 66682 15323 -42233 -14484 -6395
25967 -6395 -44499 -54024 -5610 44762 73324 59980 41522 -12188 15371 75439 118336 73052
25955 73052 47707 38431 56922 69129 60233 65949 6416 -37726 38212 49671 33468 14511
25943 14511 -12735 -41549 679 25882 -13572 -18489 -16147 -13161 55922 89060 98866 96037 107518
25930 107518 90557 53265 23529 33165 -16062 -57175 -33533 -8987 29954 73451 93601 50511
25918 50511 -27948 -64434 -31204 8761 31450 22129 -15458 -71133 -116460 -69252 -30779 -46014
25906 -46014 -49407 -32179 28315 9576 -16564 -29601 -34627 -15470 -33130 18601 33795 3330
25894 3330 -19540 -55871 -93870 -92044 -112508 -44217 41342 98257 132386 84410 27023 -1886
25882 -1886 27135 6667 43319 20287 4513 10334 -12206 -12350 80922 135594 126694 116364 128922
25869 128922 96739 66817 34966 37366 31354 20977 41685 67695 63131 5890 -28926 -14660
25857 -14660 31263 34992 2482 -30945 23242 49256 78545 100229 80266 26248 -11947 -25350
25845 -25350 -19483 28506 104509 128702 68250 16523 20386 3295 -25039 -72581 -25438 49380
25833 49380 38266 63502 52616 55898 29863 49511 67819 56109 100369 103486 66193 -14411
25821 -14411 -75095 -69865 -65038 43837 81291 111724 134384 114659 79811 38827 -24889 -71317
25809 -71317 -15819 70043 77902 64035 44205 -9279 -35845 -49088 -74855 -51402 2457 11761
25797 11761 -41128 -71975 -30211 22890 44443 32028 29652 -10564 -48154 -67665 -83360 -86919
25785 -86919 -94884 -110066 -64146 -23346 -42539 -76172 -87704 -69909 -37500 -75266 -85743 -141036
25773 -141036 -111366 -31291 17621 22765 35541 62521 58882 24527 -16141 -59196 3354 96013
25761 96013 56425 -12606 -21515 10493 -12698 -72239 -73235 -100881 -69196 -44582 -69526 -46746
25749 -46746 27310 12248 -64708 -8797 -647 -13048 -18985 -27943 29617 6571 17588 35317
25737 35317 17114 -1653 -56728 -46651 10663 -9875 -30857 31227 57463 20375 -9714 -9348
25725 -9348 47842 117648 79120 41823 107072 91599 26415 30689 -36958 -55086 -8913 22889
25713 22889 54370 44514 45238 98653 77375 109241 104174 28888 -41546 -42668 21771 21887 42071
25700 42071 71621 66504 55540 64300 58406 33815 24660 16732 -26406 -37913 -39155 6436 26613
25687 26613 -10360 -59090 -74569 -39038 -21259 -8032 39770 7293 -62405 -46594 29697 91851
25675 91851 124070 97602 48608 33980 -54178 -68522 -55520 -41231 -33700 -29656 -58735 -40782
25663 -40782 15414 -45796 -47245 -8662 -5770 -13764 -13426 12539 3768 13154 42900 54664 4026
25650 4026 22021 -24396 -94513 -65199 -683 39543 9784 11157 13694 -29075 -22154 12320
25638 12320 25064 60891 18945 39049 14324 2559 -2676 -9281 -21077 4896 -9070 31532
25626 31532 73600 47965 23444 34812 40260 -6558 -12236 31703 47895 67718 34648 60750
25614 60750 56616 35111 -24645 -55553 -30828 47844 69738 35339 -3770 -6784 35552 54715
25602 54715 103457 137359 49365 -35561 -32972 7150 6405 -47658 4682 -6768 -30430 -35456
25590 -35456 15656 43731 50477 49708 10213 -67522 -82107 -86938 -89464 -66623 -47887 -65960 -112087
25577 -112087 -158324 -162931 -92621 -23727 -23926 14174 -22451 -59381 -92888 -59037 3357 1165
25565 1165 -1096 -31803 -3797 20834 42679 90333 77822 25407 -42583 -33862 -52839 -105580
25553 -105580 -117880 -79911 -39246 -88582 -85376 -15096 21377 5067 30506 57248 43646 59358
25541 59358 64940 3913 -28576 -11673 9718 23520 3002 -4757 -23403 -55955 -61253 -70878
25529 -70878 -84828 -68352 -33698 -33691 -15017 -26132 -36897 -37083 -81006 -45313 21751 6241 -63751
25516 -63751 -94018 -58790 -71717 -64759 -20508 51534 18673 -32180 -41309 4138 33607 33112
25504 33112 -17090 30048 81999 58651 4703 -36766 -27520 -41029 -73072 -38186 1669 53481
25492 53481 15340 -33496 -46564 -35836 -10172 -6786 -52867 -88362 -113063 -82261 -65372 -60732
25480 -60732 -67808 -30702 -50304 20370 7799 13665 36948 55969 33242 48167 5721 -30778
25468 -30778 -29473 -49467 -66924 12727 8723 -33624 -76681 -49969 -25843 -7426 -13941 10365
25456 10365 57477 128148 94445 57255 12123 -28262 -63075 -89552 -88211 -86543 -50123 -88019
25444 -88019 -773 -16017 -31771 -58534 -65906 -56570 -50454 -67019 7387 54723 57003 89882
25432 89882 81720 46955 -15968 30603 72927 83899 46599 37753 68374 25631 -41151 -20149
25420 -20149 6566 73743 119557 118985 104496 114083 83511 43106 -30317 -48204 -70895 -43846
25408 -43846 -21837 -72984 -44660 2612 -32132 -76126 -70503 -26847 19986 79331 66327 65248
25396 65248 45339 61887 25073 -55586 -3957 62016 10545 8148 14076 39382 63864 29539
25384 29539 -11903 -8396 42139 39242 -632 -34156 -12141 10370 1175 -43235 -38793 -2192
25372 -2192 9516 37594 49781 24930 31657 2754 -2023 -4625 53455 97764 62162 10390
25360 10390 13285 5048 224 -8958 732 638 -44613 -59469 -32060 57475 62348 9743 27514
25347 27514 13185 -29333 -10778 5685 -1650 -5014 26981 78903 106214 104670 66570 18637
25335 18637 -19542 -127281 -175218 -123902 -42385 46388 29059 14598 39587 -6841 -55697
25324 -55697 -40278 -43266 -69056 -70593 -4423 81388 31897 -73412 -36467 6931 -2120 -30488
25312 -30488 -45158 -68657 -79688 -42543 -45297 -37300 -55150 -80293 -28909 -52239 -42901 -38429
25300 -38429 -33018 -12723 -57478 -48582 -42509 -29671 11658 23472 -4343 -15762 -43412 -4153
25288 -4153 24627 50789 32757 20483 33633 9457 -33823 40102 13191 -26545 36592 9614
25276 9614 -16669 -15305 -43949 -43647 3357 51546 58483 67361 36604 -3238 3733 -36128 -26405
25263 -26405 -33719 -25266 -7363 49462 87537 59033 45358 42092 74273 64979 -12746 -7672 42914
25250 42914 74688 129115 81211 8571 13565 1792 5652 -29606 -76426 -44267 -21474 -46267
25238 -46267 -89055 -102242 -72735 -106126 -124385 -99420 -52948 -50632 -71952 -41573 8714 33998
25226 33998 58 -23046 -12529 46986 76755 44221 -13558 -78652 -142536 -156591 -80282 -25385
25214 -25385 7295 -19279 -84263 -137157 -109969 -43362 21482 -30718 -33412 -60397 -102622 -20039
25202 -20039 17233 24573 18350 -10091 -2010 -11248 6080 3089 -80464 -45279 -42795 -27645 21444
25189 21444 -7987 19826 66380 38829 -4166 28694 36069 -33219 -31521 18242 40822 56383
25177 56383 46936 -47919 -99452 -92327 -125772 -30084 64123 44807 -75011 -132855 -117832 -90416
25165 -90416 -71530 -74334 -84100 -50267 -118506 -145470 -185046 -187329 -119036 -127878 -160340 -115206
25153 -115206 -42859 -23737 -2381 -47602 -55434 -27245 -24311 -41680 -97526 -117486 -32178 -47611
25141 -47611 -51177 -23663 1189 13031 31419 19815 -40305 2303 83571 109680 37870 4005
25129 4005 10456 5533 29922 19741 -9254 18275 70435 99238 58990 8056 36846 66297
25117 66297 43422 37482 101685 44694 -37447 -5656 5149 -13945 -51964 -53069 -68538 -34966
25105 -34966 1024 -39177 -91494 -94674 -34321 10717 23058 26092 74952 18443 -35040 -5506
25093 -5506 -1941 -23664 -66287 -57892 -23492 23279 71522 104100 80207 45911 36776 85479
25081 85479 60812 31142 64950 57744 20894 19879 80106 131847 92258 55382 2305 24313
25069 24313 22009 -1957 -19612 -26188 -27392 1516 -9691 -46174 -67258 -60747 7797 44944
25057 44944 -18964 -94266 -77717 -19414 35782 13482 5831 21095 25889 16448 17336 23685 6201
25044 6201 31788 -11524 -38672 -13367 -27916 -69221 -34962 -11284 -3508 -32960 -61289 -97623
25032 -97623 -38806 -28197 -67083 -13032 58785 2867 12527 30409 16099 -9534 -237 44756
25020 44756 76940 32405 -19520 -19005 416 -23989 -100794 -48201 -45264 -27675 -12286 23433
25008 23433 55881 81874 21508 11946 30978 2144 19121 58299 77232 27467 -52640 -68859
24996 -68859 -69712 -101614 -49908 -21288 -4935 -45557 -71681 -3335 34847 27634 -516 -33943
24984 -33943 -48013 -66751 -18792 24458 -32144 -44490 8344 53588 86254 55587 19160 32849
24972 32849 5798 -5843 -9442 39101 65096 39532 -14093 11465 34639 30408 -1611 -13557
24960 -13557 -26007 -13269 34747 59195 52054 60979 40021 51143 3749 -16599 -10867 -28466
24948 -28466 -44630 -59799 -3056 99779 93743 22442 7821 4024 -53376 -107351 -130348 -72132
24936 -72132 -65776 -49600 -60713 -10323 -1037 15061 8576 -9564 -13812 -5019 21486 18705 -10091
24923 -10091 -15585 -802 -2543 -4810 29698 18000 -12139 -8502 -13872 48613 32350 21339 53540
24910 53540 -16084 -21442 19516 23256 5395 -13873 31829 4197 -20909 -4507 51955 64845
24898 64845 72022 54527 66805 94549 86444 24219 -11805 -12491 -12033 -34374 -58405 -30292 -26307
24885 -26307 7494 40827 41981 77903 129550 106554 61339 30622 8889 -24035 -25296 -51442
24873 -51442 -70685 -116022 -58990 4030 22203 37051 53710 26454 11151 76123 107060 112766
24861 112766 128224 46669 15127 -9602 -38856 -12093 -4050 22531 -18032 -20600 -97 46965
24849 46965 71332 45446 -19263 -85424 -72669 -30614 -28569 46496 128024 115898 84379 22219
24837 22219 19956 14903 24585 85142 106558 14344 -13522 -947 55915 40644 40425 33616 31500
24824 31500 29541 1557 18467 4758 37911 33576 4608 28870 55156 49775 52306 90779
24812 90779 127629 101146 56271 70863 84466 38160 -35735 -37059 -40529 -17486 -7783 -32709
24800 -32709 -21589 46121 21285 15029 12269 34013 75745 80211 37828 42603 59696 15922
24788 15922 -15243 659 26818 36700 27178 15982 21023 65073 92305 36083 42138 44555 -13881
24775 -13881 -32241 -8375 -33771 2181 39468 -25695 -44951 -73117 -60985 -42665 -40186 5975
24763 5975 87100 159894 135149 85522 47974 9236 2852 10564 20641 56714 20255 -8781
24751 -8781 5353 5020 -48957 -23550 -17213 -38376 -20729 -22004 -12180 -73066 -134161 -162645 -113126
24738 -113126 -108775 -46440 -12713 -32742 -31080 -50809 4941 46937 82898 47014 29921 17279
24726 17279 2517 -42284 -92879 -127932 -106138 -87392 -67960 -68064 -40803 -11907 61231 26199
24714 26199 51625 56241 70480 113457 77313 73211 5586 -2003 34134 76590 91812 84453
24702 84453 119070 69549 76146 90965 51573 -49916 -52681 39405 -8848 -53255 -10022 33397
24690 33397 34769 62699 51545 57046 62085 43460 28977 -10771 -79044 -164242 -145207 -25198
24678 -25198 -59556 -88894 -33176 9183 49948 49778 33358 -3833 -28852 5744 60840 88226
24666 88226 23472 42062 125026 96157 52320 42921 58835 63932 44678 46820 12993 -7684
24654 -7684 -47724 -34902 25174 43677 63284 -11361 -18796 51906 84496 67072 53544 79413
24642 79413 36808 1649 -19324 -47078 -51204 -17236 -31497 9973 -14325 -98628 -99343 -90716
24630 -90716 -93796 -16649 38019 70705 79094 64538 80894 104245 13480 -53538 -32524 12324
24618 12324 -12224 -26746 -51808 -31 71205 72330 1172 -15806 50197 87135 18202 -49533
24606 -49533 -44551 -58847 -57564 -43523 -17492 -1038 -10438 85739 84319 16493 -34008 48500
24594 48500 33275 12873 11991 10016 37705 65501 39028 21640 -9484 -3568 49760 81440
24582 81440 69749 64714 35611 82011 79268 91814 77384 -3544 -56153 -68423 -106442 -136437
24570 -136437 -82541 10387 66503 18543 -51787 -9509 -17971 -98792 -147036 -136688 -95616 -6946
24558 -6946 14050 -24328 -67827 -102906 -58435 -56077 -9763 -11741 -6105 -938 28654 54552 43628
24545 43628 88165 40966 16040 16446 6726 14977 33412 95336 92951 19276 -39609 -52962 -49118
24532 -49118 -28698 6782 -1527 -75568 -101172 -44126 -549 -39312 -49867 -7469 38829 67977
24520 67977 8753 -71710 -97431 -87103 -71287 -58380 -31846 -48934 -41186 -46293 -142253 -181557
24508 -181557 -104599 -21394 8480 45995 14063 -13301 -29875 -83615 -35928 13801 8775 -8602
24496 -8602 -28401 -92621 -109616 -58249 -47095 -100342 -118614 -135897 -82307 -12196 -105361 -110803
24484 -110803 -8952 51936 52914 8839 28832 -734 -22410 -15017 -3240 27359 66087 51085
24472 51085 65278 18958 6971 44799 54346 43144 35500 92945 105888 102465 54461 -10527
24460 -10527 -5946 24540 33419 -8178 -11036 -11367 -51363 -40282 -7242 50634 73339 60133 37559
24447 37559 65159 30045 -33793 27096 43900 68805 87127 26008 -34763 -31683 -10248 18310
24435 18310 -15302 -24878 -17530 -13062 5553 10100 20534 27205 46173 37813 17140 -20541 1542
24422 1542 38302 40003 30302 27304 7703 16604 -11010 -74943 -87105 -63578 -843 15373 41515
24409 41515 39285 33974 -11461 -109263 -57413 96229 91831 69854 52615 47464 5113 -19394
24397 -19394 -22295 -13884 -32524 -6099 -12439 -72303 -130944 -109125 -41830 -57325 -59558 -34929
24385 -34929 -74264 -31316 -42718 -51482 -67959 -100977 -53469 -55810 -66228 -61105 -17997 13781
24373 13781 45356 60676 52143 40373 18623 -14302 -2358 22344 29492 52844 36010 15314
24361 15314 12452 27716 -12495 -30302 -34178 -34076 -52268 -41195 -87312 -82175 -44805 -44669 -58422
24348 -58422 -47492 17639 20072 8120 24490 27818 -35698 -15422 -38135 -87861 -74959 -42880
24336 -42880 -68311 -70599 -44170 -68544 -87747 -24025 53066 60482 61351 43547 39110 35730 88940
24323 88940 102982 54974 74646 18889 -2485 10370 25964 35980 66101 47589 51800 55626
24311 55626 62602 43528 56477 31276 13806 -40802 -105449 -100351 -36184 -21047 -23119 -4033
24299 -4033 40980 58954 48501 20513 34548 59357 27394 3262 65185 98389 73798 22047
24287 22047 -59793 -21024 53843 126352 58273 -24794 10850 -10483 -32554 -24493 -6587 28494
24275 28494 -20926 -39181 -22469 -34712 905 48074 25440 996 -59406 -84990 -77243 -60503
24263 -60503 -57425 -25684 53672 45620 54560 -1779 -13633 -29803 36054 68374 -18973 -16153
24251 -16153 -9326 -652 57086 98629 45369 -45999 -85515 -40635 -94543 -107949 -125893 -135496
24239 -135496 -114848 -74579 -95927 -17543 36227 108 27884 -4109 -35256 -40062 -69141 -80287
24227 -80287 -52372 -22030 40306 44316 -27310 -65101 -30122 -895 -33031 -40758 17450 86836
24215 86836 64392 54669 107936 88064 -9592 -34518 -2439 5774 -26542 -34147 -63764 -87299
24203 -87299 -70676 -23874 -12239 -53618 -57594 -34691 -53866 -11671 56481 17669 -36790 -23373
24191 -23373 15670 71717 20357 -28080 -38 57688 73358 50344 -18936 -71844 -61367 -50320
24179 -50320 -33565 -982 11106 -35083 -109509 -110961 -61597 -5513 -25288 -40109 -67179 -26914
24167 -26914 7133 28152 51702 50720 82728 101150 98265 136589 191259 147126 56521 9250
24155 9250 26348 13737 3996 -2246 22427 17846 48558 84806 46542 9576 -32895 -95524
24143 -95524 -84129 -63409 -703 41917 5593 -33389 -12867 -17122 21250 1138 -25711 -32789
24131 -32789 -40954 -38131 -36763 -10520 -28816 -10788 -30095 -20259 -461 28942 61287 12603
24119 12603 354 31994 1418 -25392 30145 30359 -2235 -60499 -55354 -31532 -31126 -53791 1726
24106 1726 104026 99060 77354 56946 83928 35632 13337 6056 -6245 4932 -5756 -28354
24094 -28354 -61680 -28894 63177 132979 89809 19971 -54757 -85282 -80307 -62554 -23462 19516
24082 19516 25948 30141 -7286 -35712 1047 34619 640 15943 9388 -18657 -71397 -121063
24070 -121063 -50197 13596 28716 -3008 -32881 -11618 -8709 -38178 -38594 -20205 61624 64280
24058 64280 29796 -15541 -19795 -12637 -4853 -29930 -87306 -74524 -48797 -29409 -99780 -105135
24046 -105135 -83999 -52086 -43577 -39843 -8124 54545 51186 -106 -39065 -21216 1354 -10335
24034 -10335 -26873 51245 66815 -32211 -92027 -47961 42759 57479 11485 -21471 -11836 -25055
24022 -25055 -13104 -36767 -36698 -43609 -51478 6246 37820 -44877 -63015 -75641 -75794 -20889 3250
24009 3250 -49132 -88223 -94909 -57892 -71751 -116062 -52758 -12849 -55994 -79456 -54054 -95670
23997 -95670 -94987 -97916 -50715 -49245 -50096 -17085 10286 -1489 -62772 -70782 -97209 -142651 -103564
23984 -103564 -65724 34282 75659 95057 61703 -26179 3033 44540 72315 22929 -53637
23973 -53637 -60430 -79835 -97155 -71252 -35415 -38004 -814 58764 77515 66505 85239 77960
23961 77960 60799 71372 47241 82039 91596 45917 -13515 -8381 -43226 -83744 -59706 -48158
23949 -48158 -34563 -24030 -2507 -53378 -61781 14614 -21841 -37248 7153 -9330 9245 62881
23937 62881 25590 7537 35222 -1140 -62080 -109849 -90289 -59317 -43553 -40756 -19595 3230
23925 3230 -55823 -71813 -9933 16001 -9606 -15023 -75389 -108199 -144406 -103868 -4090 -39437
23913 -39437 -89111 -47596 -45354 -43571 -45081 -45798 -86344 -68382 -37335 -77228 -98559 -54363 -18448
23900 -18448 -52592 -22838 11559 11823 -7902 -17526 -29145 -51926 -13951 -10200 -46714 -85150
23888 -85150 -58451 -5267 16211 -18821 1320 4872 -11085 -24725 1533 37777 23598 14868
23876 14868 -26533 13762 51933 17268 -13361 1927 13257 29005 -13790 -51895 -121050 -62743
23864 -62743 -27570 9153 20842 3392 1680 228 -30120 -30081 -39407 -23974 -8484 -11047 -60031
23851 -60031 -93389 -156906 -143838 -74318 -19176 -27572 -29912 -30907 -9358 5204 29029 44643
23839 44643 1589 -5734 10187 56810 20401 -58158 -46090 -7742 -19588 19261 19196 68229
23827 68229 73659 41036 2504 -41303 -4003 33985 22567 17505 -5502 -2999 -20636 -29736
23815 -29736 -10945 -10619 -17347 -45482 -31990 15556 -22831 -60963 -5934 28159 36376 78066
23803 78066 62498 69820 49928 -1384 14473 47288 92339 122411 162574 136960 99628 17303
23791 17303 -2412 25057 31186 -10412 -4121 -33489 13283 44203 15746 19207 -4061 -42917
23779 -42917 -49512 -16330 -26168 -25531 16741 24180 -19372 -15734 51588 122313 152971 75392 -6744
23766 -6744 -689 3492 -4351 16109 -5585 -21706 -27135 -26576 -69194 -56550 -79888 -95138 -166143
23753 -166143 -124629 -72715 -63061 -37023 -1807 -47228 -74215 -65033 -52720 -34580 -84307 -110736
23741 -110736 -52285 -16480 -27953 -68588 -34166 16798 20619 -4066 -18003 1561 34063 79859
23729 79859 48833 2409 15964 13385 508 25005 29576 -10195 -5565 -43933 -38148 -64066
23717 -64066 -52158 -43722 -50022 -87385 -116910 -61759 -54188 5254 17553 35841 27577 32080 33358
23704 33358 42368 104940 57870 76651 111495 34076 -28867 -31723 -6194 46227 85016 40054
23692 40054 13487 -29111 36728 92883 53125 17840 -13603 -31252 -63406 -49129 706 37439
23680 37439 -5310 -47113 -65 10237 31056 7142 -17910 24027 32185 -30534 -54446 -98027
23668 -98027 -61303 -22774 -34992 -67210 -55717 1648 -11714 -65944 -76602 -15390 5878 2721
23656 2721 -37382 -38746 8715 50607 -35788 -42765 -41653 1778 -12626 3895 17071 -61263
23644 -61263 -96937 -109750 -88779 -88891 -51113 1767 801 16303 53668 21349 -54433 -41938
23632 -41938 10748 48443 96438 22981 -3345 70011 90606 53585 25147 -22976 11098 32878
23620 32878 -29344 -39434 -34781 -19829 33802 55831 70650 42535 26266 50458 25270 18378
23608 18378 -2055 32750 53262 56822 10489 37499 52630 8913 -15636 8745 64250 130125
23596 130125 171740 146940 118309 74912 -11574 -68758 -61143 -64200 -8974 -3724 -43261 -37837
23584 -37837 -30697 20633 20467 24991 36815 37864 -4578 -66592 -72856 -91223 -116562 -91673 975
23571 975 9516 41379 100765 84828 67518 36444 56104 60225 43293 29233 49981 42639 -6981
23558 -6981 -4380 19378 8002 -20206 -30373 -8125 26205 86328 118098 102275 43391 -11109
23546 -11109 -39790 -74581 -115991 -66434 -36492 -42102 23992 50167 31758 -24357 -21549 1069
23534 1069 3606 -6885 -19971 -53127 -75785 -27706 37951 31608 -7695 53093 66755 -16886
23522 -16886 -32738 24631 25363 34863 74771 86972 27109 -8230 -9976 349 27107 -14951
23510 -14951 -34003 -34735 -59003 -76138 -81495 -146344 -110429 -68983 -84660 -48383 11978 -26477
23498 -26477 -44961 -9260 -29580 -29153 -31510 -51665 -58 -515 -48102 -41034 -82513 -77021 -50112
23485 -50112 -87446 -53981 34918 77688 69150 3027 -41352 -34552 -9702 3480 27045 61227
23473 61227 -24453 -775 4522 -1394 37122 62915 40061 35753 25635 27670 -17888 -61603
23461 -61603 -47484 -57086 -49105 -45167 -65810 -84339 -149669 -174962 -110224 1091 20676 24266
23449 24266 22199 28036 40152 37379 -15858 -48076 -37414 1764 19095 -3441 -40045 -114952
23437 -114952 -137351 -144318 -134047 -129923 -135950 -99442 -53123 -46043 3027 -26751 -52889 -78999
23425 -78999 -120192 -108566 -86436 -56838 -82033 -102602 -64069 -42749 -49393 -36110 -41588 -75780
23413 -75780 -64052 -30559 -548 4114 -4464 -27634 -65697 -18539 13044 -59686 -95238 -67344
23401 -67344 -16670 25931 42863 56943 54563 31291 6378 35219 38767 59577 56993 2435
23389 2435 -27682 -69369 -75746 -8091 -8667 -78833 -70566 -101228 -128657 -130142 -103288 -106273 -109518
23376 -109518 -93467 -58120 -57077 -79758 -29320 -64109 -77570 -49710 -4740 9176 17035 -19751
23364 -19751 -18576 387 55204 48514 -8989 -1728 74105 117824 86334 67839 50647 27477
23352 27477 23504 11555 -8322 -19483 32202 57278 -1328 -7782 -2694 -19185 1795 -52535
23340 -52535 -129535 -196537 -187245 -149822 -74871 -14926 29208 28839 54435 67761 52118 -10396
23328 -10396 -76231 -120980 -131498 -89507 -47453 -47409 -66710 -25084 1329 8489 180 -15128 -10669
23315 -10669 -16280 8249 -21134 -50837 -66661 1676 -27836 -25182 -42503 -56716 1278 20524
23303 20524 -14925 -10484 -16829 -21383 12289 -5305 -24272 -156 -18962 896 -5536 -43449
23291 -43449 -27880 10356 10574 -20761 -6955 -30134 -111220 -123987 -89123 -75512 -64174 -35171
23279 -35171 35407 26668 -16294 -106002 -84469 -26874 49322 88664 52571 34400 -1968 -41247
23267 -41247 -27376 2045 26086 27248 39833 -2621 -8590 -26345 -49007 -107483 -97014 -38487
23255 -38487 -60221 -75614 -52472 -59028 -45388 -70003 -56206 -81425 -113311 -146135 -136634 -82355
23243 -82355 -64997 -49646 -62097 -13260 4334 27370 60672 13454 -17704 28135 47306 51973
23231 51973 99903 107170 68260 37777 47527 50202 -24039 -49865 -17702 22585 2714 4464
23219 4464 79214 91003 97957 117760 112117 55886 -5596 -38234 -69334 -107358 -84666 -92659
23207 -92659 -86411 -40211 -3251 25233 22474 31865 -13689 -68842 -80720 -51435 -106496 -156165
23195 -156165 -42004 17666 43108 53030 9204 22995 43843 35238 94089 76716 96028 25037
23183 25037 -18149 -4159 -54671 -114316 -68269 -18244 -9956 15404 -15051 10240 31700 73544
23171 73544 78541 62863 88653 15368 -89925 -119782 -56186 -57529 -55830 -68912 -36784 -29119
23159 -29119 9215 -3393 -80557 -70142 -5829 -27828 -54004 -16414 18778 34611 -17882 -69375
23147 -69375 -91454 -55109 -17546 -2690 8928 5382 -2699 -23077 -9152 -32403 -23618 -28857
23135 -28857 -80205 -140349 -166167 -151613 -120956 -22596 2818 -50427 -90079 -41181 -17239 -40194
23123 -40194 -81479 -45340 -62414 -33991 -45287 -8127 -18052 -51836 -71914 -55674 -7777 23903
23111 23903 86717 44052 -8873 -23924 -67768 3785 47963 16119 -19009 -25078 -5530 26962
23099 26962 66173 74471 51747 20444 -15200 -39134 -39916 -42988 -54746 -24457 -66134 -17749
23087 -17749 74131 67560 60300 24929 -17696 24451 -31385 -51739 -8537 -29090 -118261 -118658
23075 -118658 -83416 -72367 -37383 -28568 23387 9813 14868 30250 74588 30492 12669 -46729
23063 -46729 -101918 -96264 -59163 4096 38763 55671 84636 87848 80330 59665 94435 128759
23051 128759 85861 54331 6340 34038 93821 85266 34920 -53418 -66148 -53506 -80798 -95183
23039 -95183 -80205 -41664 6349 43456 49341 47178 78446 103063 83803 59035 105312 90388
23027 90388 21444 5404 65997 85513 28512 23314 74120 142980 148319 49006 -6141 -1897
23015 -1897 5736 -21058 -61079 -31922 -12088 -1563 -8429 5503 47900 38945 53897 56018 2639
23002 2639 -53923 -69184 -23175 -14307 -58295 -28585 -23912 -20621 48201 39013 61359 42707 -20289
22989 -20289 -34859 -45230 -11314 3570 -38342 -50336 -61482 10414 45651 50811 64626 67553
22977 67553 87525 56368 -59735 -95115 -70758 -123825 -94324 -31845 -35206 18043 30566 59644
22965 59644 33368 -21855 -5585 16272 -14414 -75139 -61923 -37649 -29059 -44798 -63827 -50526
22953 -50526 -53970 -75103 -58211 -22531 -45316 -14435 -3085 -107208 -138076 -112386 -39652 13717
22941 13717 -388 -60694 -113781 -94485 -115898 -146317 -124654 -128401 -50875 -61599 -87891 -126534
22929 -126534 -134224 -62392 -35262 -45905 -50090 -73130 -19126 25069 -40117 -82124 -65860 -49872
22917 -49872 -44055 4756 7023 42321 68360 28479 -26715 -32118 -12854 -21280 -2807 23484
22905 23484 786 -82387 -181682 -122016 -70671 -37311 -58223 -53962 -45218 -11416 -35663 -45057
22893 -45057 -20575 -56552 -108306 -128227 -103085 -59642 -32301 -45700 -5460 44278 36490 -55396
22881 -55396 -88912 -39788 -35557 -16060 -49445 -42780 -73519 -91346 -155074 -219023 -175155 -127707
22869 -127707 -112454 -92123 -52441 -25230 -12848 -53391 -66162 -51877 -2410 16175 2561
22858 2561 -48068 -55514 -43874 -54018 -20725 -2884 -56164 -47486 -54626 -52823 -25226 -73443 -85632
22845 -85632 -110862 -61598 -371 7453 -2805 -14622 -21325 -25145 -4602 -17709 -48594 -51745
22833 -51745 -85017 -70534 -72902 -59119 -14467 -29251 -37683 -41789 -31912 5131 38750 47123 9581
22820 9581 25868 -55476 -131485 -65175 19705 19674 19525 84839 101198 52177 -736 -6319 -35642
22807 -35642 -24377 -19679 -13268 -5678 -3281 24433 7872 8445 -12142 -66208 -106725 -110857 -70735
22794 -70735 -47512 -16999 -5890 -18712 -30512 -26110 -10770 -9093 -32895 -96480 -146676 -131370
22782 -131370 -77157 4082 62904 77826 62185 32449 -26777 -85237 -97565 -47905 15132
22771 15132 -6068 10107 16635 59602 32752 11923 38968 15027 -50065 -68974 -31700 -76419
22759 -76419 -44451 11003 -27660 -50939 51217 96031 117505 75747 62754 61714 2728 -50159
22747 -50159 1217 38208 51700 -13745 -70998 -91252 -61815 -90628 -101891 -104473 -16891 30002
22735 30002 52968 39684 -172 -24908 -10261 -40007 16770 47664 9500 8136 2939 -37827
22723 -37827 -11398 5957 -16771 -43157 -107204 -95929 -59969 -21793 55189 36367 37827 85006
22711 85006 59404 16973 -14460 7490 -34021 -46068 -45312 -30700 15617 49029 41901 43336
22699 43336 27642 -4985 18090 44564 83160 32683 -42435 -69129 -89169 -77031 -86768 -90250
22687 -90250 -66116 -6313 10330 -73208 -17782 -88368 -201623 -194033 -114804 -90448 -85250 -26282
22675 -26282 20756 73702 70571 18593 -22267 -35271 -10061 20474 56835 37057 25305 6305
22663 6305 -39424 23377 62960 56963 30835 29758 72293 82458 23222 -31736 -105430 -99152
22651 -99152 -119007 -121554 -77679 -53964 -534 -14684 -25188 -27730 37089 10172 -56974 -14474
22639 -14474 26425 23611 14755 -35114 -93421 -54257 44510 62372 91887 58887 45114 79714
22627 79714 86334 57282 48485 16985 -9732 3644 8741 37227 28510 -13955 -94965 -46666
22615 -46666 15938 20963 13268 18889 13603 -14870 7196 -1666 -42730 -82522 -37541 9414 30259
22602 30259 -17487 -3318 9527 701 -51818 -89912 -87821 -86026 -53012 -26301 -20101 -20293 -75206
22589 -75206 -73890 -27473 -21604 -1403 -9903 3546 48516 60252 39625 731 -24256 -81859
22577 -81859 -107347 -129717 -140133 -113239 -21515 29436 22457 34378 54380 44376 24557 -37471
22565 -37471 -22454 44147 87662 55136 43277 26034 14047 -18848 -10447 9859 -23368 -27795
22553 -27795 -18942 -19663 -15979 -21024 25648 86817 38492 22474 10517 15041 38836 5684 971
22540 971 36562 38403 -16136 -43370 -4517 -30365 -35185 27633 32778 -38443 -78388 -79036 -57801
22527 -57801 -19459 -22859 -80581 -99686 -72780 -24190 -14049 -35199 -30050 38247 75894 68479
22515 68479 81772 39433 40058 32685 43956 41777 52667 77568 89831 102137 66731 51236
22503 51236 -36403 -95701 -36495 42269 107884 110404 84339 55892 41130 30690 -19209 -20676
22491 -20676 -14773 -45039 -61945 -78099 -27283 -28798 -45747 845 -10998 -29762 -31881 -23540
22479 -23540 43230 28566 5057 21941 67104 57331 145443 192400 205723 127300 62699 66702
22467 66702 139978 152378 53578 -7332 -20793 31802 60415 61847 50043 51146 65667 19479
22455 19479 -14524 -41030 -3213 -11329 -20457 -54017 -83872 -110477 -112418 -93165 -10899 -6603
22443 -6603 -59304 -38420 -25146 -63313 -96430 -35672 -34926 -85976 -38647 -54424 -52309 -35376
22431 -35376 3373 41930 21002 -23628 41175 88393 102840 1596 4729 31177 53498 26773
22419 26773 27294 -6712 -5266 10193 -50563 -78701 -42693 -53006 -30102 -14160 -10563 -61433
22407 -61433 -105603 -101580 -71823 -50492 -50481 18635 53206 39122 52847 56172 13726 12921 71029
22394 71029 103967 65709 -7832 -22019 -44665 -68253 -83433 -47838 -60469 -18350 185 -28812
22382 -28812 -10372 -20645 -46411 -31072 -1551 -25281 -9272 28147 -16295 -69098 -32452 26818
22370 26818 -3612 3241 -6534 4669 29581 26469 14059 54417 7680 -3716 9289 -17964
22358 -17964 -57405 -82401 -111079 -86276 -85925 -55763 -52596 -84726 -65820 -54558 -21284 32125
22346 32125 81550 77771 80767 75855 4741 -51680 -45594 7336 39590 41932 75297 121363 80384
22333 80384 37904 44143 92737 80608 51954 -2511 43253 27958 -23850 -44505 -51871 -62916
22321 -62916 -86653 -55276 -44237 -74617 -65527 -59387 -68469 -129377 -73820 826 -7498 -65948
22309 -65948 -119699 -120297 -121682 -96759 -74893 -57227 -82950 -140424 -125692 -51797 45543 39683
22297 39683 -33051 -72175 -29215 -28939 -46819 -68708 -61903 -34817 10354 4708 27192 25718 -5769
22284 -5769 -6132 -64560 -23591 -3526 -18036 -7493 -35030 25765 55182 2085 -32544 -27472
22272 -27472 -41603 15850 18784 21502 17433 -11633 -6791 -5833 -41048 -41626 14790 50980 22523
22259 22523 -14342 -9235 -10024 5684 31081 11612 -32776 16517 67593 35449 -3508 -52738
22247 -52738 -37434 -30380 -53048 -99307 -68504 -53832 -46831 -20508 37616 38789 37025 -2889
22235 -2889 -24172 -51598 -40818 -216 -10113 2660 5977 -30626 -47521 -89916 -63362 -11437
22223 -11437 -20484 25238 54698 30294 1533 25807 64421 48027 21322 13841 -9007 -18997
22211 -18997 -9494 -20207 4690 45108 59659 42027 15716 7394 -59716 -103264 -58108 -8936
22199 -8936 -36498 -55940 -5673 14270 -21764 -34096 -33731 -10265 1823 -39912 -52254 -7973
22187 -7973 -10680 -9945 733 19578 19785 -2236 1076 46194 34454 79 34398 -12955 -11525
22174 -11525 13712 24299 -5083 13037 38730 53027 26529 -17596 -38823 -51380 -86188 -97067
22162 -97067 -42888 -7524 35776 37649 25916 44840 25433 -5043 13852 43241 57592 101198
22150 101198 133261 148747 146496 133849 123513 124118 82976 14149 27260 44558 8651 -37443
22138 -37443 -52162 -20667 -10076 -6899 -18087 -54117 -96787 -72175 -49667 -70291 -89194 -94200
22126 -94200 -30519 -8395 -22259 -4610 28389 3592 -19645 17449 54888 7259 18366 16495
22114 16495 -25299 -32884 -9302 25643 53888 43513 -18615 -26021 -8704 -63610 -147101 -117206
22102 -117206 -10443 25557 -42834 -30664 11459 14103 28371 33706 -14845 -19381 -10811 -77519
22090 -77519 -95476 -38636 -20364 -12758 -6488 -21157 13436 10925 4459 14796 55201 -2839
22078 -2839 -76811 -63667 -11911 -14450 -47105 -59700 -48783 -67339 -56334 55607 53535 39014
22066 39014 19158 -16047 5411 -34299 -84649 -91094 -59405 -14856 48122 64280 31150 -27482
22054 -27482 -22529 -32814 -9647 38454 31203 -39625 -33871 -42001 -32290 -51059 -100352 -97666 -132031
22041 -132031 -133077 -146286 -104000 -130563 -167273 -169278 -128244 -54926 -51917 -32886 62447 113043
22029 113043 72870 57206 41798 -14809 -46193 -49605 -76357 -74744 -80749 -26550 -16225 -18759
22017 -18759 -43084 -40289 -62694 -112947 -43148 2091 12859 -32483 -79294 -70739 -7829 51321
22005 51321 63918 -5538 -19014 -43746 -21913 30138 5247 66140 38868 -638 -48719 -63734
21993 -63734 -72949 -153557 -133991 -57277 -16057 9511 53078 79815 79434 72010 49660 55057 50198
21980 50198 -17919 -39820 -9386 -55086 -55786 -30851 -46292 -24008 48473 33015 -45934 -3714
21968 -3714 57173 77249 35176 45946 41002 -30157 -68994 -57745 -25443 -69230 -129019 -97390
21956 -97390 -55175 -70095 -37967 -60288 -65046 -82365 -83034 -25605 -36350 -70805 -28629 53570
21944 53570 64420 59567 37069 3141 40609 66544 48392 51519 57624 109 21148 26332
21932 26332 -48162 -92418 -91619 -53423 -74055 -73930 -747 49753 33036 -22671 -61879 -75748
21920 -75748 -36557 58095 61435 91372 64739 36043 -14222 -51246 -21787 3309 18045 46778
21908 46778 -24377 -28269 -34919 -90592 -95178 -79782 -26920 70926 91040 88386 12776 -44432
21896 -44432 -37847 -1500 -32745 -72989 -45785 6448 22308 27512 16527 -12682 -14142 51000
21884 51000 71777 52349 23642 -9804 -37710 -68029 -60721 -27063 7940 26571 16804 6982
21872 6982 -27872 -25563 -29127 -56929 -38811 3889 -44577 -98421 -78269 -92965 -76216 -41301
21860 -41301 -42965 -7918 -15767 -45267 -66923 -33819 -6948 -5170 8187 -3788 -38020 -31543
21848 -31543 -12055 -22153 -44632 14758 28005 1447 -56650 -35148 -10681 17737 116718 127811
21836 127811 73706 35675 33758 52616 -28561 -40335 -64166 -27195 -22894 -45224 -73039 -36570
21824 -36570 -27886 10832 -15835 -37464 -32703 26202 43010 9966 19447 -57971 -120121 -132154
21812 -132154 -115805 -87881 -42756 17354 14481 20305 -46901 -81483 -40049 55169 139717 122758
21800 122758 50908 18768 39104 12318 -28562 -75875 -58425 8603 69847 43503 10526
21789 10526 -765 -43937 -57056 -44234 -12194 -14610 -49124 -78221 -78078 -110142 -73101 -63774
21777 -63774 -48394 -81707 -140659 -92059 -41405 -28829 -11173 -67227 -127714 -113714 -109006 -101375
21765 -101375 -123757 -55102 43926 89478 67441 59193 21188 5791 -25773 -63208 -59464 -48020
21753 -48020 -38448 -41132 7010 -51270 -16405 44793 85485 77855 114116 137441 111801 34396
21741 34396 -30545 -35793 -66468 -110364 -140841 -110338 -36398 -30171 -17382 7417 12417 32217
21729 32217 20118 11158 -7861 44503 22826 -43212 -66791 -39013 -70976 -106500 -58174 -97363
21717 -97363 -96581 -100869 -65088 5567 66196 17775 -1250 -7799 -42516 -21788 6277 -10353
21705 -10353 -50398 -19292 -30013 -65975 -42095 20262 -2884 -6205 11392 -32782 -103482 -88443
21693 -88443 -50528 -22069 -6361 -18996 -12066 22567 -18619 -18627 -73624 -76179 -87281 -78325 -61847
21680 -61847 -70508 -86211 -77660 -19813 -50300 -47140 -11703 2944 -75201 -90512 19860 64190
21668 64190 -6406 -79663 -97856 -89658 -40733 -58135 -62199 -31158 -34240 -53634 15072 8053
21656 8053 27981 -26501 -97842 -68699 -25945 -11572 11528 10828 -13421 -44815 -32915 2373
21644 2373 -73962 -75670 -69281 -22386 2388 -22320 15341 -45572 -81637 -93230 -96749 -99543 -102267
21631 -102267 -51437 -21304 -19927 -35420 -41797 -9151 5081 6591 -25946 -49637 -59203 -36772
21619 -36772 -52591 -71521 -104762 -116359 -68715 -43217 -25215 -20458 -54071 -79817 -134193 -148835
21607 -148835 -117425 -104966 -46493 -3079 -2027 1636 -1210 -40686 -29966 5985 -7494 16285
21595 16285 35330 -22997 2125 -42994 -43592 9292 -8720 -97104 -89721 -53749 10861 108473
21583 108473 26445 -53850 -45653 -6055 -9809 13680 32540 5922 26582 9661 15903 29236
21571 29236 31490 -2938 16226 -9091 -47722 -46596 -80994 -91233 -73977 -69464 -55820 -52204
21559 -52204 -71705 -112661 -146134 -135292 -102176 -42742 -31794 -3964 7196 -59994 -66080 -76421
21547 -76421 -105145 -38696 11046 -39214 -60041 -99368 -100884 -73195 -57813 -58029 -49527 -54651 -96607
21534 -96607 -66659 -55571 -62682 -26481 -32002 -56291 -13833 -2135 -16491 -3722 49783 11140
21522 11140 -8383 -3491 -19066 -16152 -19164 -35445 1790 25251 42862 -8997 -18416 -8987 3333
21509 3333 24875 16692 49564 28965 -28688 7943 -3964 -46963 21313 46833 30973 50966
21497 50966 54075 30422 359 13728 -16124 -32514 -84010 -76645 -22029 9376 -8753 -39597
21485 -39597 -55862 -32116 -28861 -70227 -60319 -77628 -94272 -61703 -53461 -15448 -10017 21644
21473 21644 -24354 -97904 -84394 -82243 -59222 -52514 -66260 -38747 -51538 -99623 -148999 -156501
21461 -156501 -116738 -101305 -91059 -81210 -1492 -14430 -56270 -21339 33427 29424 7460 13980
21449 13980 3949 -88152 -167153 -98845 -56207 -70117 -77092 -47917 -42432 -4892 11313 27690
21437 27690 33650 -8471 -50818 -65422 -45357 -57393 -11201 -12496 6460 -42141 -81899 -35155
21425 -35155 -13918 -11951 42199 107221 176099 112461 -2689 25040 4218 39697 33261 14516
21413 14516 -11745 -17830 -90402 -88809 -21016 -22402 -92052 -103568 -99651 -54488 53672 51699
21401 51699 22517 -38809 -80513 -99130 -111243 -86081 -85748 -22814 34193 -21023 -13063 -12641 -74
21388 -74 10754 17233 -1747 28334 27835 31667 -10876 31817 38151 -236 27479 48100 6252
21375 6252 8828 -10575 5978 16272 11287 11781 -32633 -61540 -76506 -42797 -49251 -61496 -25579
21362 -25579 18336 -19747 -129063 -105891 -73076 -110032 -69916 -51358 -74381 -40641 -62573
21351 -62573 -96387 -55252 -31596 -36434 35968 48487 9240 4452 -63787 -83388 -47694 6004
21339 6004 14986 -8573 -41540 -22951 -50137 -92771 -99592 -79833 -31251 -41497 -70710 -82178
21327 -82178 -72566 -88004 -34224 -32165 -57176 3572 11665 31332 69927 74035 -32551 -18882
21315 -18882 -38449 -29681 -55826 -94179 -109284 -51359 7446 16012 -78339 -53104 -11553 -26267
21303 -26267 -52855 -40622 -38958 -26126 -36167 -59623 -53959 -85677 -68653 -57824 -66608 -38370
21291 -38370 -3810 18493 5727 -80651 -50363 5197 -17183 -37886 -50859 -66112 -33912 -12775
21279 -12775 -36447 -34031 -14661 -28883 16853 70972 11844 -6095 -38208 -14157 20217 -2471
21267 -2471 -11768 -27031 -2129 12458 -23600 -43027 -67976 -69568 -50468 -9528 26270 36422
21255 36422 43530 63176 58556 100406 62893 46988 39907 98054 96163 76455 43725 3319
21243 3319 18541 24176 -33034 -53691 -126540 -87724 -118977 -125020 -63234 46362 25096 8089
21231 8089 -59961 -13860 30771 34523 34345 24185 4172 5211 5942 -12717 -29232 -26332 -63708
21218 -63708 -56918 -40690 13446 34242 75578 88606 60559 10062 -40489 -48275 -40762 -105334
21206 -105334 -157764 -186225 -147662 -130418 -129212 -115923 -38809 -529 -26262 -64088 -74042 -93387
21194 -93387 -88131 -75824 -31583 8621 11456 12907 7245 -27305 -39711 -89549 -92491 -92766 -83801
21181 -83801 -23578 -1646 -12763 1517 -23138 -2309 60137 45714 64508 52311 31159 29278
21169 29278 21930 14395 25020 12258 25161 15516 50471 65107 72769 77760 63694 75413 104286
21156 104286 117517 91411 46925 12044 -21152 -14340 -46366 -29645 -16800 -88690 -75771 -84229
21144 -84229 -75916 -24727 42735 29467 -38455 -84144 -86102 -79327 -94078 -131931 -107221 -77055
21132 -77055 -23207 -64947 -97116 -124383 -133662 -96691 -72599 -108655 -137025 -125201 -58353 -9402
21120 -9402 -73661 -63263 -45204 -39326 -41134 -31807 -65844 -101907 -112858 -52372 -9501 -43446
21108 -43446 -48749 -76102 -106875 -89187 -56119 -52474 -87037 -109538 -15885 6526 -21056 -57529
21096 -57529 -115835 -122165 -66935 -81590 -119646 -139453 -160668 -182653 -148079 -167648 -151448 -66557
21084 -66557 -37289 -74940 -85809 -91475 -116504 -131019 -155732 -88261 -26986 -40287 -93578 -78209
21072 -78209 -49009 -65188 -77184 -125729 -142030 -74673 -48515 -69368 -80013 -49313 -64106 -44547
21060 -44547 -11924 -3391 -66652 -83872 -33299 11784 29753 14114 -54743 -118836 -131941 -130471
21048 -130471 -69951 -65134 -60291 -102018 -123345 -99869 -96461 -57143 -48599 -72618 -15287 5190
21036 5190 4420 -17008 -51671 11128 18879 -25425 -52991 -85317 -102515 -95011 -114493 -93946 17454
21023 17454 77179 5680 -27872 10756 52247 66913 36638 35307 22934 -37767 -39661 12785
21011 12785 38291 15852 -22160 -15250 7205 6806 -49341 -62719 -74682 -62300 -61167 -91640
20999 -91640 -64045 -10747 28 26326 -30892 -95361 -66839 -66307 -88477 3814 33971 -4335
20987 -4335 -7774 -44764 -11467 31183 -15466 -53593 -34181 13875 80074 107402 124558 131667
20975 131667 89851 14587 -26997 -46889 -60255 -97790 -140709 -144554 -130515 -65615 -7304 -11650
20963 -11650 -8306 -21835 -57133 -74916 -49213 -45068 -41984 -21509 -9298 -41632 -27561 -19164
20951 -19164 62323 66169 44730 -18611 -53050 -26169 20355 -16906 -12929 27091 26049 46145
20939 46145 78779 50971 -13375 -62066 -65060 -30561 -17762 -19115 -23980 -6895 -5185 27259
20927 27259 58508 63000 -10992 -80970 -43472 -86075 -98406 -71667 -36910 4256 12375 53543
20915 53543 90488 64899 110455 96659 41558 -39688 -29822 -5040 -14045 5332 8734 -23071
20903 -23071 33165 18782 -25089 10253 -828 29394 84627 49071 14852 -56934 -44907 16169
20891 16169 -14351 -69580 -79237 -72512 -84592 -72750 -50515 -66603 -27249 20439 60318 35866
20879 35866 -20447 -65818 -60374 -39647 -36751 -62055 -56977 -59869 -26050 -5799 -4985 -48497 -68689
20866 -68689 21466 24405 33560 51241 -35203 -97561 -86078 -100396 -14557 55196 5076 133
20854 133 -15076 -44281 -7154 -47765 -46463 18936 25931 28188 40549 -3744 -3132 38139 12529
20841 12529 -4872 1131 29152 25261 4859 -21113 11389 18949 -22813 -39488 -118321 -122285
20829 -122285 -43255 6923 -254 -21878 -21028 -21864 6932 -41557 -101834 -135006 -65469 16159
20817 16159 28545 -21733 -39330 -28935 40123 57548 29809 6003 1454 -6122 -58178 -17230
20805 -17230 -8000 -53782 -46926 14630 40716 105685 51246 22173 -34603 -71484 -82652 -40588
20793 -40588 59176 81434 1995 -27923 -17046 -23092 -13542 -42051 -37587 -12910 -14199 -34230
20781 -34230 -13134 21798 21604 -18767 -36980 47476 70603 77828 26042 11998 69251 46476
20769 46476 51753 45511 104378 114118 152981 163157 111716 105667 138248 116026 135536 159967
20757 159967 139541 143662 217415 303829 318010 308837 266437 239490 311884 402023 529981 703767
20745 703767 853018 975981 1092297 1241645 1451449 1693500 1882558 1949372 1900223 1696308
20735 1696308 1503218 1384456 1256129 1095559 887217 672023 528548 442780 355458 347390
20725 347390 322214 302073 260677 173817 156349 144141 126766 114268 99865 105907 155107 223255
20713 223255 195904 150418 155138 130686 51220 32903 63396 67924 70142 98077 99810 19081
20701 19081 1947 79847 80342 -16592 -69115 -62128 44725 81183 106075 104853 21367 -46626
20689 -46626 -13945 45018 57748 42332 -43771 -73802 -22017 -16938 -36654 24050 22723 -13232
20677 -13232 -30441 -24207 22878 58579 37141 3159 6807 -2643 -12967 -33051 -19730 12504
20665 12504 34342 -39562 -56100 -71959 -79629 -104145 -58392 4055 -5177 -19758 -60791 -67716
20653 -67716 -62502 -66424 -129344 -111518 -106398 -100217 -112081 -91066 -28458 34662 31000 -88708
20641 -88708 -85709 -23145 -12847 -24257 -57339 -68117 4483 37000 -30601 -25974 19318 4058
20629 4058 -26935 -50001 -75777 -79942 -89343 -68491 -69587 -191 25317 55017 104452 70588
20617 70588 30094 10625 13842 -7147 14372 1830 -59352 -91147 -80587 -76997 -50003 -22563
20605 -22563 3505 -1311 -18801 -43892 -32315 -21094 -33829 -54781 -42903 -712 17179 44409
20593 44409 76759 97393 81624 76068 87818 122671 59559 6777 22911 -5186 26811 46955
20581 46955 8924 29223 2115 -12024 13286 36380 75957 134430 220207 364903 386440
20570 386440 328722 283109 263724 149979 68950 86008 114554 74116 64342 28387 48220
20559 48220 -804 13343 15649 -22838 -42897 -9762 26897 63229 60555 77563 54558 -26612
20547 -26612 -49201 -49184 24341 25064 -5135 -3869 60465 68100 34231 54588 46746 28409 23403
20534 23403 38212 64358 22024 1167 8480 -17513 -6023 6648 -7261 33823 14420 -23624
20522 -23624 -37992 -46442 -69085 -13110 46111 63294 97298 49487 4118 -4505 53471 50203
20510 50203 16403 -3760 9812 -4564 -14069 -29237 -47637 -31983 -12945 -51006 -21285 4205
20498 4205 10553 18319 -4224 -32121 -54256 -76679 -74968 -13577 -2140 6939 -15649 -65702 -23434
20485 -23434 55577 83853 34256 5101 -20123 -102595 -140616 -79880 -71944 -58167 -47220 -30698
20473 -30698 -26831 -7912 -25281 -33331 -35358 -33634 -19819 3849 5226 -31619 -54973 -8632 16377
20460 16377 -3069 -19977 36722 49452 36518 -8700 -10737 40054 98052 79971 45506 25997
20448 25997 32169 -9821 -594 -45497 -67075 -53230 -30765 -26922 -40813 -8875 48641 50945
20436 50945 -22364 -40756 10115 -11875 -66572 -25517 31016 105575 161277 102061 50797 49917
20424 49917 75605 85576 142717 125643 124634 141145 133611 143356 80096 44713 43966 6464 35740
20411 35740 39032 77135 101766 124901 118271 -385 -49038 -73892 -75614 -23247 -13548 -15658
20399 -15658 39751 54583 -289 -36287 -38417 -18120 8526 50592 62631 77050 52332 1226
20387 1226 46664 49918 42846 86442 143719 133774 26953 -61268 -90890 4867 51414 50623 -12897
20374 -12897 -28010 -20887 1321 40726 27572 57081 52355 41393 67289 74049 77690 72894 98817
20361 98817 102036 102169 83294 55599 70788 92856 87102 57195 46002 88195 134065 83329
20349 83329 78467 59915 89486 59364 72942 26285 630 -11247 38071 54541 50064 -23957
20337 -23957 -48855 24910 30257 36919 30384 -200 22738 7010 9568 38747 26328 27231 42190
20324 42190 99177 60467 35953 -14347 -48363 -89197 -88047 -60883 -38489 -50079 -11541 22385
20312 22385 -35168 -44513 -21987 -27766 -14463 29742 52800 119247 136663 119167 69923 27329
20300 27329 14814 -23150 -62132 -92040 -79005 -53753 -11533 33869 14843 -33115 -44017 66096
20288 66096 115015 105616 12129 -30276 -59117 -30518 44304 103369 97735 118577 107963 40267
20276 40267 33296 9843 15772 62699 55079 93134 91696 63314 79789 64118 69648 -7708 -99598
20263 -99598 -105532 -47543 -63208 -46712 10488 -13005 -79093 -63326 -54620 -78150 -40539 -10621
20251 -10621 -14208 -59070 -79078 -102139 -93831 -83877 -96193 -40048 -42040 -97465 -48070 106926
20239 106926 122624 114869 62633 77672 25677 24423 28961 30209 57051 85580 59289 6778
20227 6778 -62718 -82406 -55206 -62517 -10384 8735 -10160 45796 45341 41711 59496 39782 64594
20214 64594 65097 25999 22388 53361 40005 58900 52296 -6754 -7203 -26308 -19974 -21085 13910
20201 13910 8430 2744 -32917 12312 39542 40496 -32522 -69015 -42772 -9241 -68251 -53883
20189 -53883 -27734 -53891 15759 102226 106525 74485 71066 58388 45720 49373 38873 9728
20177 9728 -2458 36652 111290 89245 55101 72876 98112 40987 11154 -4661 -21251 -27931
20165 -27931 -5895 34817 50474 22427 25286 130389 86017 27843 34432 1546 22512 15349
20153 15349 21544 39630 78 -32298 -62595 18302 31396 135 -25455 14109 41291 26678
20141 26678 66735 66491 60019 46196 38265 34049 -43853 -125552 -126423 -87167 -28407 34812 8483
20128 8483 -22342 -2207 35271 34212 26663 21426 -20570 -15908 -42159 -87997 -3093 25330 27759
20115 27759 55232 33235 50756 29925 -1552 27061 83462 155805 177777 149846 99226 53910
20103 53910 14280 -57971 -93556 -73318 -58117 -30177 60005 78640 9374 -20683 50263 23361
20091 23361 37682 57093 79277 81121 26200 -9395 -22392 -32474 -53415 4351 44011 74408
20079 74408 92467 91859 94910 52426 85670 131457 74358 65704 37297 -10807 -45359 -45140 27503
20066 27503 30372 -54983 -71823 -10280 14369 11749 40787 23219 30423 38142 64941 40325
20054 40325 63106 44986 48496 95499 106907 45674 15353 43632 51519 53215 39844 20030
20042 20030 -20221 -79868 -66011 -3693 11148 19419 20191 31306 72299 48326 -19292 -2140
20030 -2140 37448 -61881 -105347 -56982 -11182 5956 10399 -24983 -6157 11258 -7211 -4201
20018 -4201 15567 24744 39384 70589 101897 98333 153475 203161 135091 94047 105419 100181
20006 100181 95722 116003 124970 135230 142808 171958 153891 187910 202079 183274 181594 153258
19994 153258 136783 152454 230700 243333 282200 314842 315904 343607 283559 207054 225400 234535
19982 234535 251670 180440 106838 141162 173137 98953 99739 15577 36893 67501 48276 36731
19970 36731 -8709 -4419 16881 39093 32958 53864 98402 104342 147153 133207 138170 119747
19958 119747 138725 99314 55709 53557 122998 131593 118031 113645 47521 16087 55616 113491
19946 113491 96007 30774 4274 21061 75364 127529 185946 213676 145282 114548 154748
19935 154748 169866 146943 181103 128210 55005 159374 232930 197686 168949 97193 50815
19924 50815 36288 27084 40530 47917 65487 79865 58676 -32464 3594 33537 -647 -365
19912 -365 64009 128412 88874 54909 52152 74136 100707 145528 121240 91350 63656 18346
19900 18346 10972 67130 123625 131735 122894 67743 72060 109792 81238 101761 143571 93023
19888 93023 95107 90469 115773 109170 90269 64469 22254 42179 72059 39660 65076 80806
19876 80806 34603 58740 106556 125996 149829 160564 217656 222191 156496 136756 83443 64030
19864 64030 109479 120312 214485 195287 131773 110676 141859 140838 117253 125496 182890 227915
19852 227915 179978 157865 194237 191624 200289 279396 273816 254217 230598 191050 185250 285220
19840 285220 328722 396630 404121 390223 467922 533669 592228 642884 713630 843787 971238
19829 971238 1090669 1039972 1012256 1070926 1101960 1116185 1174446 1207511 1176507 1070930 946704
19818 946704 843819 797335 846639 960032 1109001 1227722 1205857 1168920 1105807 1049667 1065067
19807 1065067 1185828 1239370 1197636 1054361 898089 754652 605506 462681 365736 338421
19797 338421 381143 345337 288798 271019 237087 285102 282383 215889 193110 236096 244451 173674
19785 173674 131907 122501 104977 128191 174194 256229 282575 270271 274237 219288 250987 311958
19773 311958 290202 240383 218450 205427 217520 173362 155613 159801 153884 114932 114410 158608
19761 158608 100903 57191 74452 142733 171904 148640 149054 113325 87641 115549 156567 192124
19749 192124 211656 206676 238984 269309 232538 142994 123027 184523 189171 194607 203089 166568
19737 166568 130401 196791 263706 236557 181553 164301 146707 127155 129804 213202 260771 272433
19725 272433 261924 237631 233614 262741 309645 261420 260110 255339 270585 269860 242679 185574
19713 185574 217561 206556 160997 170341 176571 192091 190030 242285 182513 112794 79052 139907
19701 139907 189592 192353 171860 164513 163702 224043 256030 263875 324072 316289 271150 245028 236356
19688 236356 285265 374240 378878 420472 355812 247156 195387 215860 255450 183679 177147 289542
19676 289542 304499 313358 333556 340490 333896 426580 433567 415678 357584 297888 342683 375577
19664 375577 319850 278979 283360 296397 353366 368749 349810 377125 391639 355711 332613 340595
19652 340595 337162 324147 261223 250541 270447 209333 236948 278423 320747 318807 380792 415500
19640 415500 388720 409505 441787 474713 436336 392886 364553 357088 352888 412514 419188 376809
19628 376809 363488 374334 400891 443251 437003 429434 398516 410673 500958 525950 546369 566388
19616 566388 583937 647947 782087 865717 893411 932052 1050818 1248881 1496520 1728739
19606 1728739 1934963 2136163 2270352 2386525 2502736 2432852 2309207 2166808 1975454 1788398
19596 1788398 1680154 1552284 1378383 1268425 1142074 1008653 917900 868275 858901 874150
19586 874150 812573 801431 789434 732185 756794 764863 723253 749262 715770 688882 717063 622967
19574 622967 647494 675474 682371 707441 731831 751967 789360 829582 856135 936261 913462 877901
19562 877901 878558 815549 779465 765025 764533 770444 793217 793875 753541 722950 729084 698876 704290
19549 704290 723282 705660 690486 647122 617483 627939 652037 643080 627822 643209 629244 533737
19537 533737 510134 605792 664473 690331 681580 674246 695266 681786 691365 734206 682691 682710 722139
19524 722139 703312 744903 755114 685901 674844 768075 833496 858425 861245 837427 824197 813057
19512 813057 837999 916735 937014 935345 931538 904802 921997 954165 970682 1015929 1053397 1130895
19500 1130895 1081446 1029258 1020815 1089509 1179698 1251238 1322234 1342777 1341572 1335813 1314533 1328667
19488 1328667 1311881 1341043 1351404 1352422 1382451 1398483 1391225 1359569 1354276 1327849 1368264 1435449
19476 1435449 1418899 1419361 1361268 1280502 1251734 1217771 1232148 1265992 1262177 1214792 1188912 1227293
19464 1227293 1218249 1160826 1229186 1194825 1202144 1253969 1251127 1305514 1282046 1292354 1306984 1378668
19452 1378668 1398220 1422109 1383634 1397596 1481005 1544879 1569110 1608091 1694543 1716915 1726941
19441 1726941 1762912 1793227 1818825 1935860 2070839 2153871 2214511 2337798 2521771 2626204
19431 2626204 2723126 2783549 2856901 2893948 2904249 2945757 2972305 2979671 3035294 3109629 3140523
19420 3140523 3253810 3217458 3230939 3287122 3339510 3372594 3393827 3466693 3550356 3687039 3755481
19409 3755481 3820228 3874098 3904386 3855681 3886448 3879390 3941791 4017283 4038983 4072290 4106454
19398 4106454 4213030 4310421 4406375 4521930 4663806 4724510 4762088 4892640 4968814 5123304
19388 5123304 5259402 5394729 5487909 5553481 5679176 5771475 5936806 6123425 6313980 6476915
19378 6476915 6605692 6795698 7032745 7309075 7560030 7762422 7959122 8191344 8468818
19369 8468818 8767618 9141780 9429796 9709092 10063144 10347458 10646802 10985720 11389144
19360 11389144 11857119 12332416 12847733 13376421 13869704 14362801 14843120 15382215 16115792
19351 16115792 16963403 17751708 18492659 19244818 20129795 21036291 21954725 23006055 24168839
19342 24168839 25387792 26636767 28079096 29662277 31342434 33212092 35214326 37484181
19334 37484181 39909570 42533164 45422008 48564458 52000941 55887828 60165176 65000754
19326 65000754 70372869 76377467 83146664 90711237 99248084 108871877 119762276 132126165
19318 132126165 146186088 162200623 180410243 201062722 224352595 250342050 278862153
19311 278862153 309546989 341516960 373210884 402790545 427948179 446311918 455937801
19304 455937801 455824270 446223912 428323680 404109872 375878859 345711593 315352089
19297 315352089 286058481 258650990 233618751 210928191 190650357 172607041 156574530
19290 156574530 142383713 129728942 118493506 108627281 99899307 92078393 85107241
19283 85107241 78871729 73300272 68378598 64007826 60121498 56567773 53219899 50177441
19275 50177441 47473343 45019326 42872585 40924530 39035663 37295233 35671693 34215113
19267 34215113 33058433 32210769 31561638 30963415 30518307 30248450 30113750 30046268 30118305
19258 30118305 30460531 31021099 32029631 33571737 35818776 39134719 44342052 52518716
19250 52518716 65354519 85810760 117657323 162004367 205134134 215785608 200974600
19243 200974600 185171515 175591228 180983732 205523402 233282637 229455858 199493397
19236 199493397 167783421 139016222 119202343 113434878 122832068 149006798 191950910
19229 191950910 234787513 239241387 216465352 195216080 181361609 184029126 207136422
19222 207136422 232863132 225147332 190006020 152280161 115979048 85950744 65382662
19215 65382662 52117661 43335897 37148273 32501298 28851500 25908351 23641649 21868833
19207 21868833 20432357 18973147 17522127 16219460 15078812 14139912 13437797 12897430
19199 12897430 12221647 11605319 11115132 10607386 9967728 9354514 8874045 8475495 8193899
19190 8193899 7945673 7565707 7137281 6713795 6354839 6049251 5727108 5486266 5286613
19181 5286613 5079922 4857487 4718361 4573099 4470446 4396366 4382437 4334903 4226742 4075973
19171 4075973 3947457 3923069 3917147 3914468 3887335 3828624 3733407 3633992 3529109 3459236 3452822
19160 3452822 3486173 3480097 3482819 3456283 3372867 3350963 3272510 3256181 3188465 3139880 3104869 2994918
19148 2994918 2925976 2849436 2841671 2822088 2767524 2666705 2540458 2466307 2439290 2474946 2447387
19137 2447387 2420069 2416152 2391179 2369113 2373233 2320819 2299730 2303587 2255844 2283319 2280014 2301092
19125 2301092 2328501 2248783 2174603 2231740 2301379 2406049 2504787 2520579 2501039 2578589 2735207
19114 2735207 2932141 3082887 3294317 3563228 3865900 4143827 4467620 4879611 5300172
19105 5300172 5682191 6031189 6318730 6470641 6613080 6730180 6881882 7015050 7154308
19096 7154308 7257925 7339771 7225948 7119725 7104625 7177751 7241406 7337002 7442494 7459985
19086 7459985 7444606 7441840 7390938 7328702 7245074 7069555 6841314 6564714 6230355 5849569
19076 5849569 5541026 5259595 4886034 4502827 4268976 3949513 3652855 3463856 3294148
19067 3294148 3198941 3081645 2913769 2856780 2847474 2894821 2871186 2708186 2518395 2346840
19057 2346840 2242758 2110960 1936017 1754104 1689998 1732627 1737663 1795249 1849698 1832278 1871050
19046 1871050 1893702 1979708 2019093 1975030 1889436 1801978 1696400 1618266 1562597 1506910 1515737
19035 1515737 1532073 1623130 1733907 1827989 1911705 1931227 1815367 1669110 1595879 1467104
19025 1467104 1424750 1430151 1383136 1360632 1351952 1401929 1429193 1417890 1470983 1604663 1722870
19014 1722870 1786761 1756034 1673397 1588540 1476701 1417849 1380993 1301177 1262817 1156336 1015109
19003 1015109 988422 1064869 1085434 1088318 1091100 1078385 1098482 1196784 1240406 1195962 1141675 1147189
18991 1147189 1214539 1284632 1264914 1254153 1212301 1149200 1133491 1109315 1086404 1118643 1121187
18980 1121187 1156170 1192074 1136753 1066165 1047702 1071545 1076273 1053608 1005882 944181 858580
18969 858580 853061 891288 930980 919271 878648 861424 876393 905872 901170 873662 853362 832883
18957 832883 779655 691643 642202 622109 607923 598586 639382 617950 567694 561346 610548 573150
18945 573150 581075 566011 557745 527595 552978 662733 707799 678670 634207 634821 680440 670842
18933 670842 637852 669563 616009 529879 486899 459444 481759 478263 489169 524605 570522 602024
18921 602024 624434 627465 624974 599288 599341 659014 591423 566128 588692 604489 592467 574935
18909 574935 602165 679739 713085 741739 827519 886179 965159 1118635 1276016 1289051 1247461
18898 1247461 1241027 1270025 1285859 1335684 1409699 1437197 1381234 1309857 1262893 1270526 1326853 1295939
18886 1295939 1216842 1140566 1148912 1261014 1345675 1218554 1087709 981604 941787 903894 876269
18875 876269 885334 901266 1019229 1169014 1338510 1472821 1483247 1505017 1527713 1514260 1514249
18864 1514249 1578110 1601219 1533245 1517236 1553531 1600045 1588569 1424120 1315832 1301724 1235469
18853 1235469 1281817 1310698 1225063 1088608 936731 818626 728578 569898 497921 494806 502110
18842 502110 481537 460103 441421 449099 456485 422914 395518 387672 328544 308992 346007 372801
18830 372801 368453 353394 350404 325410 331535 349307 365088 342678 327486 353324 372964 276199
18818 276199 283533 336397 419223 419765 360168 290443 232804 337511 395156 415989 412468 406458
18806 406458 394068 438087 474078 510968 499476 502930 504533 613404 779690 941558 1104159
18795 1104159 1150779 1124230 1039328 954073 944335 938167 960192 863276 764197 676448 575192
18784 575192 504968 504962 438781 489780 496407 537476 528089 548768 667893 847317 1004904 1033890
18772 1033890 992430 885520 827915 852990 903489 938029 781057 619333 539519 484828 461657
18761 461657 395717 314530 272040 240588 212716 216518 235704 211628 233773 285925 311476 352736
18749 352736 373134 361585 340960 308934 273784 304896 301999 288487 283629 221899 249713 280708
18737 280708 280527 324950 338551 335272 325764 349381 356496 307177 329793 373605 351678 357905 320237
18724 320237 311331 340260 343921 304245 264360 237596 213132 174813 210114 241710 249238 325359
18712 325359 348709 380426 391398 385839 393445 341791 311037 325174 366941 325364 341874 288495
18700 288495 226877 222961 171208 130307 118775 161054 190202 173809 232114 302557 334807 245220
18688 245220 252074 252459 244887 211134 212410 184797 150523 149669 179292 224483 222880 225133 180615
18675 180615 229681 251914 243798 210052 221072 227273 300420 342563 373730 427102 428043 377536
18663 377536 378446 414941 478409 576308 668753 747313 830146 917321 1007766 1131232 1232400
18652 1232400 1250517 1223412 1178978 1204011 1258132 1270708 1215056 1068600 961835 936856 867642
18641 867642 845279 979677 1181658 1358745 1511493 1530060 1553983 1453989 1418154 1380621 1442163
18630 1442163 1546532 1469660 1375676 1172256 975740 884103 819015 741282 706164 686443 639527
18619 639527 559308 498713 491689 452496 378559 406626 425449 435558 420513 438913 439233 487164
18607 487164 554617 524544 559452 492824 404091 388999 353817 369270 309969 257774 310232
18596 310232 304881 286363 407784 526950 556700 570700 630669 549899 404929 278711 260209
18585 260209 251088 263375 296256 351341 425629 456886 422569 557350 650002 696501 811331
18574 811331 802027 646866 512543 488061 520532 499920 519160 491428 488682 496391 570688 605481
18562 605481 696391 795451 855469 930106 993852 952890 888477 919925 964466 944989 900628
18551 900628 905359 865658 886858 920334 943131 933757 988790 1097533 1217251 1347801 1561828
18540 1561828 1827683 1883466 1770084 1695336 1618261 1498678 1418563 1386307 1365631 1307164 1245473
18529 1245473 1227997 1318460 1379872 1534792 1720641 1901389 2117427 2189499 2169713 2111103
18519 2111103 2073783 2068140 2115499 2138797 2236369 2462983 2708784 3025150 3499737 4100146
18509 4100146 4659840 5114862 5580498 6109250 6577275 6804826 6866859 6767240 6594506 6481483
18499 6481483 6492141 6647646 6991696 7469151 8034443 8692855 9493721 10448977 11479527
18490 11479527 12606693 13891848 15409585 17249084 19715350 23531687 29704132 39910225
18482 39910225 57119768 84963125 123735300 153403846 144109080 120117753 96775806
18475 96775806 73608790 55833608 44797508 38383183 34679400 32783209 32653166 34670407
18467 34670407 39555584 48698631 64435078 89806190 124773183 150486786 140970168
18460 140970168 119182775 98455324 78341752 64077149 57276554 56615330 61614917
18453 61614917 73691833 96205411 134901234 194083564 258511615 271143897 231869158
18446 231869158 187696986 143276839 104433597 78609836 63367898 54568472 50007100
18439 50007100 48812036 51081994 57730960 70739023 93776011 132508689 190934548
18432 190934548 253264753 262694781 221451460 176239396 130852946 91237216 64580226
18425 64580226 48457058 38525665 31914401 27076570 23204393 20177585 17766672 15857665
18417 15857665 14427259 13393232 12696032 12195094 11635623 11084501 10557163 10195132 10010455
18408 10010455 9976155 10126405 10283469 10206067 9996684 9803761 9702096 9726392 9850111 9947942
18398 9947942 10086094 10118326 9981638 9916019 10058205 10326579 10917666 11618670 12293139 12877825
18388 12877825 13659468 14837819 16411628 18612896 21680041 25946659 32212837 41555418
18380 41555418 56007075 78914507 115217549 170259477 239026963 281240606 267585862
18373 267585862 240056587 218487930 211467716 231730668 273942322 295409908 263104434
18366 263104434 214104688 165699419 121203467 88378788 67490022 54514928 46002252
18359 46002252 40019602 35799288 32987814 31246056 30439584 30643411 31831918 34150629
18351 34150629 37804623 43458481 52679538 67965185 92613122 128190271 162864030
18344 162864030 166880289 150092384 134308975 123409393 124839122 142536478 163714671
18337 163714671 157226218 130382138 103451379 77366429 56106579 42050605 33330484
18330 33330484 27690068 23780937 20934585 18895658 17404907 16324442 15563507 15098384
18322 15098384 14791302 14617524 14395306 14086796 13825313 13608752 13375654 13183713 12969673
18313 12969673 12606099 12037712 11302913 10568040 9973009 9414619 8907733 8518718 8117245
18304 8117245 7701882 7331681 7110640 6982617 6927690 6851098 6856649 6924826 7039302 7157662
18294 7157662 7316392 7490693 7608725 7727977 7970128 8312545 8566890 8827919 9159911
18285 9159911 9541174 9933350 10318341 10652283 10905797 11171168 11391625 11554313 11771018
18276 11771018 11928279 12001172 11992999 11968446 11891472 11820745 11763893 11656070 11548643 11215137
18266 11215137 10780436 10342802 9882840 9486998 9202464 8984666 8595503 8074369 7507401
18257 7507401 6947945 6523296 6174080 5811758 5464371 5228977 5033039 4892981 4709264
18248 4709264 4515951 4303368 4063463 3907383 3848063 3782264 3775025 3768677 3789292 3836403 4003223
18237 4003223 4080005 3943812 3778571 3664582 3602486 3534451 3555997 3442068 3205168 3031035
18227 3031035 2864044 2630945 2458949 2300822 2222447 2206720 2192118 2177830 2142321 2044604
18217 2044604 1898498 1810418 1832259 1856076 1893341 1922908 1850615 1707047 1561925 1489007 1496148
18206 1496148 1527029 1490863 1414702 1370443 1305822 1253434 1213081 1136065 1102238 1163815 1122523
18195 1122523 1086256 1120041 1084833 1082742 1074614 1015548 1017051 957123 919546 942923 951665 941986
18183 941986 960319 887780 831749 791867 765958 765377 777336 805541 774671 775007 753523 717925
18171 717925 723149 713728 692458 666262 649794 578918 562805 567105 602417 597006 605521 616715
18159 616715 637183 651329 640717 646094 667298 692698 648583 672060 636754 559951 494677 484423
18147 484423 545117 539973 493918 470914 565837 635752 598774 567762 531296 510450 531455 528722
18135 528722 500712 476317 529970 535050 499122 460877 431058 452803 471545 535500 553795 468388
18123 468388 453390 451193 467309 444185 445946 459789 400701 426874 468455 459264 441045 382879
18111 382879 366116 424161 461804 392971 373628 467980 460614 396696 383586 384253 378339 364786
18099 364786 347473 305639 300340 326188 362256 363267 350129 392069 396442 403748 368190 365655
18087 365655 360041 342275 334709 285633 319188 352819 377945 385509 398512 396853 394612 351109
18075 351109 337382 302050 268528 286999 316023 356730 378356 406100 419706 384639 331455
18064 331455 301128 393358 392434 397388 360143 353263 315832 304743 276180 255338 260394 225904
18052 225904 268634 241352 266321 294148 309119 365303 368031 303663 259468 293571 340194 310648
18040 310648 293958 306088 266086 222395 247164 297194 294330 201964 169117 211065 228780 239446
18028 239446 260335 231884 251331 263597 227428 216156 176442 104866 136072 210743 223565
18017 223565 199655 194127 202078 205575 192345 178342 143430 142800 164453 170386 160828 157633 134877
18004 134877 111865 119229 175064 186248 223155 329067 337636 284847 356310 474693 630701
17993 630701 788663 921125 871617 736739 577117 451186 380931 385821 345556 310976 279873
17982 279873 285705 257392 238614 255678 264153 201476 195821 290993 388081 498475 733954 877347
17970 877347 929738 832270 718589 635156 585620 602548 683229 798148 864971 787887 783661
17959 783661 754226 625275 509426 408236 351334 333650 324373 323218 324727 330122 292242 291549
17947 291549 306204 266566 312540 392499 522016 692121 838984 817741 709444 608564
17937 608564 528000 398717 286174 244362 206088 189305 192240 211930 179948 206512 241377
17926 241377 184930 189551 142198 119653 171341 269528 315846 284118 222770 243793 264721 227948
17914 227948 197406 139405 172386 263096 238898 211410 209362 235601 260078 180426 171767 191911
17902 191911 162544 169855 157567 169494 197162 169562 221254 288831 256884 300131 329453 361737
17890 361737 440436 483564 489292 586176 762871 1014234 1179723 1143982 999366 866728 692422
17879 692422 526100 437173 466688 465818 424429 377560 337905 396281 534658 613497 745735
17868 745735 891160 1023418 1029994 1001424 926013 767815 632846 543441 546894 568923 574114
17857 574114 695253 852395 1023113 1140589 1232700 1286298 1273420 1281421 1349506 1426135 1385421
17846 1385421 1343652 1352225 1335640 1391234 1399557 1405832 1416029 1440957 1431604 1387100 1288425 1136917
17834 1136917 975827 879663 806151 687314 548586 496670 467165 454656 468962 472341 470274
17823 470274 480530 484178 544291 698090 885597 1066599 1141884 1094372 1043784 1026938 1052689
17812 1052689 1079884 1112993 1134382 1059066 953478 795577 679859 519855 413000 398822
17802 398822 355398 327030 313756 288408 307175 312006 254613 203956 223527 264442 241365 204190
17790 204190 177899 128755 160733 192197 96788 81886 107409 133584 155049 151473 168915 167071
17778 167071 168226 187079 156439 84551 43799 50318 79224 70204 137556 166283 96069 55064
17766 55064 37156 37282 16500 -9681 40882 44235 43101 21698 -54648 -78642 -70926 9915 20999
17753 20999 30191 34709 69889 76419 164767 187837 151374 89643 53093 50746 38115 23854
17741 23854 56881 143826 166482 167880 122012 38734 -4087 61465 66915 23890 35399 62169
17729 62169 34320 56561 75275 119977 72969 42839 26946 49960 83822 50939 20774 -40776
17717 -40776 -51016 7579 84094 84057 44180 15626 3170 45685 85971 132872 136613 114841
17705 114841 57133 70919 120303 123923 142046 152511 132245 65889 60233 89522 63868 -3598
17693 -3598 13305 52528 80233 100577 107180 65502 52107 -32774 -30042 -63039 -18839 22557
17681 22557 28262 40291 79354 54587 -29297 -45828 -44996 18561 96969 120866 131865 193451
17669 193451 194119 119534 39338 2426 14324 56806 31742 -6681 44443 82292 73909 91665
17657 91665 81208 54027 65564 25353 42030 81282 108025 58427 78353 120291 111044 157488
17645 157488 168540 171869 103119 38785 53080 98035 140619 99155 85745 98200 47442 45760
17633 45760 43737 39723 1315 36374 62908 81712 111907 122421 95456 23400 -31498 -16553
17621 -16553 26208 66682 58823 50265 29153 26826 9648 28336 2780 -69674 -108381 -64743
17609 -64743 -26176 -19301 -8727 -26686 3959 -2219 -23203 76645 149963 178513 162118 132515
17597 132515 148172 131604 143737 181683 171011 99804 15501 29127 46223 22083 -43471
17586 -43471 -47175 -14355 16575 13629 40611 56321 62144 37923 93130 103083 76455 21070
17574 21070 -42128 -610 1691 33307 83119 115229 46591 -4119 -6702 9945 -1438 28609
17562 28609 102412 159321 119441 56170 -29855 -93428 -30480 16904 -29983 -98756 -105129 -29214
17550 -29214 -42389 -25440 -21788 29741 64555 32682 11121 5852 101435 132978 103792 58688
17538 58688 -8021 10883 57551 40128 45811 82631 86390 90033 19110 25348 33224 36087 -166
17525 -166 -921 39597 63053 123225 107256 97519 78287 -9931 3224 20936 45073 54121 40869
17512 40869 1641 -30869 14596 83628 70951 77563 25919 -17076 -8834 -28553 -75992 -67255
17500 -67255 -41452 -10125 71119 123980 129450 124815 121926 58265 -930 -16673 -35632 -26635
17488 -26635 -13314 -2456 72124 52877 -34745 7810 34472 45382 -2807 -6162 -33590 -49222
17476 -49222 -81316 -66345 -19842 -28034 -42272 -57663 -137352 -148035 -116225 -52979 -36409 -88310
17464 -88310 -49969 -49107 -41211 -7175 -17116 -47823 1803 20844 -5281 -11402 -30861 -11077 -11826
17451 -11826 -47916 -25280 -37312 -14490 -2503 -38939 -57435 -20073 -14808 42558 114987 128948
17439 128948 94958 69539 86295 47831 -29542 -30445 -33092 -75681 -67963 -41110 -91623 -83637
17427 -83637 -106 -2759 -52332 -37442 5115 22905 50208 -4898 -28166 30284 37829 30148
17415 30148 46715 72815 62204 61139 16379 38371 73288 48683 -21017 -50534 -4598 55253
17403 55253 66509 73786 68922 93606 167606 155210 58102 42675 26612 18144 -17284 -41135
17391 -41135 -64796 -60913 -53617 -29613 17767 10942 7151 -17412 17705 20687 10379 15152 44483
17378 44483 60898 52789 60416 88705 60284 64069 62858 59723 93917 74624 59465 77219 13301
17365 13301 -9295 19285 -16818 3554 14825 -18857 -9339 -78740 -46315 -42471 -42555 -4652 -13574
17352 -13574 -13304 -28513 -22205 19658 3899 -21631 3998 -12631 -33968 -3162 91054 127672
17340 127672 95202 65345 18225 4302 36297 76313 86542 111016 195634 214291 186507
17329 186507 135534 96520 76520 99020 87422 40975 32713 48123 66653 59456 97035 102665
17317 102665 38147 -39996 -60366 17501 22920 48214 49310 16695 24311 -33737 -66615 -107842
17305 -107842 -79604 -18444 19112 14367 46444 58567 31197 29781 55949 -3968 -29491 16880
17293 16880 41284 40605 2545 -20850 29616 43776 -8870 -42877 -19606 45838 55788 -30258
17281 -30258 -76664 -12941 2239 34340 69011 113194 153001 141210 55752 38981 6102 -12566
17269 -12566 16690 36725 53821 26955 17672 24662 31436 1577 219 -2144 5379 26864 52036
17256 52036 38886 22001 40832 50333 8776 -30846 -18413 14225 51046 39805 26083 35400
17244 35400 30811 11575 -13935 -61976 -57160 -16712 19236 50260 44918 79800 114579 131024
17232 131024 131463 147578 99151 37113 -5377 36379 93200 100654 43160 -6820 18637 48951
17220 48951 20174 -5342 9230 9355 -62734 -23979 -4258 23372 60586 2109 -19599 -12476
17208 -12476 -24724 -3962 -41828 -27217 644 18907 44131 49663 54943 70118 82349 132849
17196 132849 127021 145439 161113 138641 90860 81074 99710 112435 70939 -12555 -29068 29705
17184 29705 81402 61958 65406 64184 104263 110839 82821 45964 14601 45160 31500 57760
17172 57760 90427 26152 -23951 -1635 15252 13626 -27660 -21859 8147 46104 79444 113230
17160 113230 28304 -23874 37030 88925 28875 19503 30723 49395 58314 82474 50795 34035
17148 34035 37726 -6759 -31643 -66989 -24389 -21625 -55728 -84761 -33482 -1080 -5353 6542
17136 6542 8354 44108 51270 43417 58701 63178 54502 -20639 -7858 52085 39144 20864 58287
17123 58287 65609 50814 37817 42038 38461 72794 99854 102065 113348 64604 111710 138350
17111 138350 152850 116300 72292 38557 77782 43806 49410 85686 83301 125089 139898 99644
17099 99644 61824 70646 32726 12662 36062 36110 29482 32409 36931 30702 44705 55684 58209
17086 58209 71129 57590 41724 -20311 -17107 -1584 59326 68983 56534 41894 78771 71335
17074 71335 40426 152 9861 20476 77 -38749 42469 51151 -7545 -19706 -26016 -47227
17062 -47227 -75668 -44716 -64708 -60725 -55413 -48816 -17026 -16283 46621 57371 22743 -9776 14598
17049 14598 52156 80928 15163 -10173 -180 15443 70055 94982 38154 -7427 1012 -19071
17037 -19071 -9044 25418 28291 46073 105846 77188 38732 23375 -21429 -51081 214 38301
17025 38301 58854 60832 42860 52679 63364 70475 124773 47051 13230 36060 36672 -27191 -50637
17012 -50637 47067 150757 163496 129243 158734 135375 111165 93824 99324 81458 42801 34961
17000 34961 51948 47302 5045 -26385 9376 6627 30705 88997 111319 100580 125900 115916
16988 115916 94466 72865 58201 42733 27945 56461 63807 92909 76468 45445 33892 54414
16976 54414 68849 66803 93081 61970 42114 35214 26960 10155 -23387 -17379 27475 23838 -19294
16963 -19294 37934 38745 49218 46842 52200 71463 48498 20051 18954 -5461 20779 35841 73858
16950 73858 104582 187946 228704 224980 221109 194866 92792 52667 56579 27411 -14274 -32652
16938 -32652 -50997 -35744 -48093 30916 60172 69142 71663 48219 42571 41135 -3111 -56305
16926 -56305 -155948 -134818 -67445 -15033 -20536 -8305 -27486 -4858 21670 125012 145027 109837
16914 109837 87658 70292 57582 62714 111514 166885 200696 185658 139703 59869 -14806 -19568
16902 -19568 -7130 -13960 27227 54615 24362 41144 65116 70249 3663 -34638 9004 17643
16890 17643 26610 -16438 -43810 -33678 -43825 -40155 -51505 -38072 27546 107243 80208 87095
16878 87095 80532 20007 38252 93688 117953 143952 148210 92184 58876 20008 -25367 7398
16866 7398 24196 57642 55627 64269 84741 125607 83659 57985 9095 10172 28893 15577
16854 15577 17974 20236 34477 19408 61731 22395 -21532 -22782 -16302 36385 17058 -22028
16842 -22028 8852 62329 18675 39893 117218 133225 174169 169966 184943 220413 248669 202350
16830 202350 138511 124300 71588 31488 55944 100947 112466 117833 34535 -9741 36302 73368
16818 73368 -11670 11981 77504 43424 34442 75010 65434 42492 33138 10927 -21743 -30763
16806 -30763 12081 60628 66451 94151 37698 -16354 21641 46592 51411 87657 70587 13441
16794 13441 43660 47380 29427 12604 34902 57621 26123 32046 16091 -12815 70189 79546
16782 79546 59087 55815 52817 12703 -46275 -40946 -46355 -29578 52354 92026 108006 -8028
16770 -8028 -42350 -18892 12169 14104 22432 63302 71798 37769 26426 54631 91683 44618
16758 44618 39799 31854 24087 37565 72899 85769 79030 47492 51799 32279 -59232 -26068 54570
16745 54570 35346 65640 51183 -32801 -84509 -59139 -27445 9933 43390 41026 82515 102937
16733 102937 54721 2175 6491 -9058 -27566 11034 65038 12054 -12981 -25030 -58546 -25915
16721 -25915 -51682 -103600 -13222 44513 36759 -751 4552 -23215 -57034 -59182 -80546 -34205
16709 -34205 -37741 -36782 -47527 -60965 -40476 -17831 16178 72329 62622 66032 45992 29486 16563
16696 16563 -17110 -13516 -39503 -17106 26463 51155 73105 55225 -31477 -50584 -61346 -78066
16684 -78066 -74081 -9922 -72360 -84084 -90965 -124718 -130527 -38405 19422 38377 16714 46341
16672 46341 32883 328 6598 18683 11930 85839 64334 43697 73820 101887 75404 70896
16660 70896 122904 134670 91578 77288 58173 38248 29688 54483 43639 -14756 35960 55540
16648 55540 39572 21283 -24451 15957 84692 88299 110896 80609 31946 20557 66980 46787
16636 46787 -43676 -39506 -30295 10794 58919 101616 63316 56087 5229 -48831 -78383 -37623
16624 -37623 -47205 -20681 26635 34699 49744 12789 -10845 25576 57804 102210 56438 -14587
16612 -14587 -44393 -18790 -24868 11944 15410 -26256 -50951 -48460 -41999 2341 22959 32212 7006
16599 7006 -996 31590 21425 13655 15926 -14035 331 -6065 -29411 -6394 19737 21806 27456
16586 27456 70219 28149 -15125 -39637 -23746 23145 68237 90846 131972 128118 86902 59529
16574 59529 -32373 11543 74044 69913 24316 -16535 -4186 16669 409 46472 78415 1602
16562 1602 -9238 407 8914 24528 -4397 -9368 8184 -18756 -26690 42101 62032 54916 1839
16549 1839 8152 47314 82110 117730 69263 -8680 13535 60408 47010 49381 29549 -9114
16537 -9114 28898 21125 -30955 -46328 -10008 -13137 -7746 -33692 -15125 25879 39495 31861 8915
16524 8915 25328 15719 25402 22057 -29066 -49755 -44988 -40388 986 -21012 -4394 -43988 -78706
16511 -78706 -104206 -137112 -101101 -56739 -1611 48364 54846 11703 27079 56628 87088 62639
16499 62639 -23122 -26893 -635 18747 76895 102277 89214 44903 58422 9068 20317 14627
16487 14627 -61506 -41644 -20363 -19678 -49751 -48323 9506 71636 60756 24244 11526 14124
16475 14124 -449 14652 -8945 54295 27603 19032 -42917 -26407 -62832 -149098 -116787 -11377
16463 -11377 -99864 -123309 -128457 -124557 -96889 -78877 -64134 -41781 20830 -10575 -36591 -74109
16451 -74109 -129442 -117199 -58260 27397 63126 19801 -28304 -16612 3569 13360 4795 -8715
16439 -8715 -21242 12478 -7348 -59393 -58868 -93821 -115364 -41829 -35604 -6453 112522 131100
16427 131100 80689 4651 -14489 -30592 -32111 29478 70081 93944 36584 -5479 55630 71660
16415 71660 28745 -35317 -71047 -35824 1864 61384 57308 2561 2886 13878 -10885 -55052
16403 -55052 -16833 -8565 3828 71461 84692 45724 8426 25429 445 84829 111990 78530
16391 78530 44589 -10861 -43263 -80585 -100340 -63097 -355 -26876 -43270 -45370 15670 -4837
16379 -4837 8136 -3442 -21206 -81431 -82990 -77942 -66239 -21888 45965 49548 47566 52450 79612
16366 79612 37199 39991 35789 603 -35253 -75181 -56254 -14975 -1106 -6559 -42728 -45551
16354 -45551 -30807 -11131 5724 69038 82360 37875 35439 34050 -29244 -58303 -87758 -75241
16342 -75241 -39654 18910 94803 77556 38744 6639 -23402 -4986 -16801 -31349 -43529 -45618
16330 -45618 -56353 -19526 -37063 -35971 -52307 439 39069 42282 42939 -14795 -44357 3497
16318 3497 8924 -62928 -92718 -57670 -39130 -18860 19888 -56137 -89769 -47561 -20702 -9768
16306 -9768 -27864 7648 13103 40442 43317 60320 102724 153476 129826 92551 20334 -10159
16294 -10159 -39335 -49646 -28859 -16609 47916 43868 59988 71110 86232 68720 -4462 -82767
16282 -82767 -87280 -97655 -93107 -53779 -58107 -114180 -99569 -88918 -53169 -92690 -94225 -39465
16270 -39465 -30403 -2907 43600 52262 46158 23827 10245 -3829 -12702 -41076 -37627 -46945 -52688
16257 -52688 -40339 -32443 44869 6883 -36649 3702 12412 40210 36049 71912 94710 116411
16245 116411 112207 97552 97879 58427 39732 47708 107555 115767 76897 17140 -37089 -77964
16233 -77964 -97363 -92837 -69736 -66967 -8266 -26490 -29567 32521 57597 31568 8534 8575 -93566
16220 -93566 -127615 -58591 -30230 -75311 -96927 -48799 -13738 -37198 -54861 -25489 -58985 -71174
16208 -71174 -31199 -8693 42957 64322 45316 22567 -36324 -79611 -62169 -12711 13119 2419
16196 2419 -11137 -4692 -34853 -47736 -41705 -58341 -30108 13260 -65891 -52194 -2414 -29729
16184 -29729 -15866 -12691 -46660 -17572 20378 39208 7165 -11436 2592 11654 22157 5393
16172 5393 4919 -22538 -51232 -63262 -68474 -47864 -34542 -72474 -84429 -38078 53433 105131
16160 105131 121915 70022 -19375 -69060 -39468 -17727 -49553 -90431 -85973 -77795 -72876 -98855
16148 -98855 -73428 -65815 -96673 -97230 -82469 -70116 -33383 -71195 -123012 -60561 5408 20390
16136 20390 26161 79178 72445 39975 58845 51890 24583 -15377 -12737 32051 45568 30686
16124 30686 42646 40428 22274 -47704 -49154 -79519 -34868 41957 76712 31232 43541 25499
16112 25499 -3492 1064 -19071 -28631 -65786 -96705 -103486 -52080 -40468 -75245 -126260 -94367
16100 -94367 -74365 3368 36298 -41050 -51893 -15931 18107 28434 17216 -7475 -1087 34530
16088 34530 23439 -1345 -17229 10535 5584 11921 3658 -22447 -9070 1678 -21907 -12541
16076 -12541 -34642 -37400 -5276 13960 51763 4522 -23095 -18909 -12296 -37656 -34747 -5199
16064 -5199 -18378 1685 -13963 -58544 -57765 -16001 -30779 -67329 -75731 -49917 -67838 -111847
16052 -111847 -122509 -113680 -118994 -71781 -33164 -3053 11582 -28456 4392 -26854 -12623 5879
16040 5879 36354 58808 39144 -10434 -24029 8604 -21927 946 -3831 57939 66842 -15928
16028 -15928 -8306 37396 -7046 3755 32813 7891 -40747 -28045 -37458 -19253 -40055 -28397
16016 -28397 -90840 -68125 -46433 -7628 -42154 -30652 -20166 -9264 -12727 4481 33420 -9570
16004 -9570 -102751 -152542 -155683 -133881 -141027 -96155 -47467 -95723 -125022 -152480 -91507 -75968
15992 -75968 -49199 -47425 -28615 23178 -29932 -32733 20024 30532 -22140 -78850 -136976 -52573
15980 -52573 953 -41521 -25448 15642 76909 23413 -38685 -44590 -33223 -28033 -49209 -46724
15968 -46724 -26207 4431 -11972 -21922 -2829 -41154 -54785 -16565 1656 -9407 8503 4888
15956 4888 41403 18282 -12936 -73 -80782 -113374 -121723 -96605 -89847 -96806 -82865 -67280
15944 -67280 -50203 -74581 -47758 -37623 -31176 -36339 -62854 -81431 -64823 -23675 90820 134794
15932 134794 43622 -24039 -109590 -117794 -132437 -101448 -69026 -53689 -15327 -15860 -28884 -38515
15920 -38515 -12337 -57561 -58829 13867 33094 -20034 -76217 -69574 -44191 -60738 -65138 -64524 -59828
15907 -59828 -52484 -94629 -39190 -26345 2184 16646 30462 -12151 -45616 -20002 47973 53383
15895 53383 -8520 -63856 -91088 -44064 -60905 -102241 -44044 -16359 24321 15849 -34791 -77653
15883 -77653 -108302 -140621 -131410 -113417 -102936 -132082 -108198 -69964 -84703 -95608 -112924 -103838
15871 -103838 -75357 -82672 -107181 -42120 -64678 -107051 -91472 -108750 -66624 -26906 9365 4678
15859 4678 -10159 -65166 -72599 -48088 -44391 2147 38653 34882 -884 3477 -59841 -29376 27477
15846 27477 15190 -7083 -12019 -72979 -90448 -33485 -90428 -99781 -124431 -82066 -54479 -26386
15834 -26386 -37163 -8018 36305 29429 39659 29342 21351 -14740 14361 34929 20812 -3998
15822 -3998 45193 -6482 -61150 -73890 -53969 -12823 34623 29837 22551 55625 81555 105340
15810 105340 135291 23236 -81948 -124720 -2824 44938 30950 -9439 -6770 -19046 -47474
15799 -47474 30492 42858 67797 15171 18159 88618 45931 22948 23528 73814 60331 72815
15787 72815 68281 22342 8753 -45723 -34604 7290 18054 -25182 -88064 -57401 36342 69975
15775 69975 24431 9791 16892 -22921 -52940 -30826 4391 -723 54655 81602 51201 91833
15763 91833 84898 98542 54121 -31864 19866 28889 46423 78186 -7577 8677 14584 7233
15751 7233 -24795 -61217 -65792 -1826 18480 -977 -8492 -63717 -99765 -137314 -96792 -51034
15739 -51034 10024 69216 127275 129579 52987 68431 86097 90989 106262 31840 15462 -9912
15727 -9912 25099 49186 42139 -26269 -43687 -23639 -294 19722 41827 45407 5154 15001
15715 15001 -12204 -43241 -33822 11649 38227 60646 120363 110805 72288 61741 10180 55365
15703 55365 76813 89958 107317 64309 20956 -4921 -34903 -65096 -74658 -123301 -116821 -102412
15691 -102412 -86013 -85104 -111885 -96616 -24093 -17712 -16500 37458 47336 -1835 -50634 -84695
15679 -84695 -147133 -162415 -127810 -130404 -109566 -84001 -76186 -10975 13614 -29420 -59795 -64857
15667 -64857 -55525 5080 89328 43263 -6335 -9707 23538 46108 36143 8326 64415 98684
15655 98684 27021 -95102 -109983 -83025 -45075 -68749 -117704 -108358 -47744 -28968 -19874 -5584
15643 -5584 41107 10928 -13742 -56059 -10702 36147 -30382 -30204 33745 13442 -21254 -26101
15631 -26101 -20284 -23209 -38432 -37263 20473 56725 5748 -16519 -7970 -30046 -77516 -30312
15619 -30312 22666 15213 31597 68325 28800 16897 13848 -2744 20326 61904 13784 -22758
15607 -22758 -75521 -99087 -81018 -73120 -75392 -71767 -105156 -74366 -33253 -18312 -61823 -57483
15595 -57483 -20620 -25320 25800 34762 10459 36994 -3820 -21493 7299 6997 -13302 -59258
15583 -59258 -92059 -81190 -72363 -92313 -53098 -25887 -49386 -20804 -13819 -36845 -37421 -35095 -68596
15570 -68596 -50996 -38785 -18267 -33555 -95806 -136677 -149842 -129640 -86546 -22388 16040 37617
15558 37617 24426 14067 -22441 -5614 86956 114531 58178 22093 -25746 -32132 -30273 27788
15546 27788 -3867 -41840 -24954 -7432 -14437 -14738 1812 -23163 -30137 -18528 30269 15692
15534 15692 -1049 15813 48283 120160 141716 119454 80425 31896 10582 905 -80484 -124701
15522 -124701 -132467 -115352 -73537 -103076 -121065 -86974 -74051 -51466 1222 12659 -5555 71786
15510 71786 95813 80165 52427 -31457 -66867 -41849 32538 7439 -34906 12971 -17150 -13296
15498 -13296 -5287 18964 9819 -4097 -48785 -57041 -61265 -111580 -131278 -92989 -71652 -31171
15486 -31171 19936 38311 74852 99381 98261 46178 18786 -25190 -41200 -40553 -2128 28388
15474 28388 52443 27016 -35321 -27856 -32997 9963 35978 15685 4429 69835 108066 64833
15462 64833 -6816 -30907 -9536 -62261 -34355 -16820 -4616 689 28115 14321 -45649 -7398
15450 -7398 37648 -3600 -26964 -39804 -70984 -76957 3905 57121 28120 68834 53479 15623
15438 15623 28658 44456 47717 47917 32330 22141 56696 133951 100773 54124 2685 12270
15426 12270 14125 -33602 -38499 -55183 -22023 67481 22879 -384 -9497 -3163 -20168 26242
15414 26242 68773 49760 33534 68128 102160 56988 -29232 -46141 -21794 -3883 -5114 1913
15402 1913 -6810 -33062 3799 -24995 -55762 -35198 -22420 18085 -43771 -19278 52106 21350
15390 21350 -17901 -67136 -44061 8802 -1865 -3439 -6347 -88824 -101457 -56588 -3595 10611
15378 10611 3576 15116 26227 38398 19273 10016 -36864 -48226 -17625 26707 -5339 -42931
15366 -42931 -98395 -94765 -49253 -38837 -41304 -37158 -46432 -38862 -41266 -9132 3087 -2830 37087
15353 37087 38289 38704 87048 120540 112776 99915 79431 28271 17798 14940 21253 -1056 -46624
15340 -46624 -676 6745 -107688 -118266 -88657 -46589 -35231 -49432 -44338 27497 25754 -36817
15328 -36817 -137197 -192062 -162044 -75661 -18197 -4936 7102 3390 -29116 -42901 -50025 -76373
15316 -76373 -72061 -41800 -19568 -13408 -21059 3194 -5330 -25245 -60764 -60966 -34096 -13247 -89439
15303 -89439 -92592 -124456 -130083 -94111 -10775 1679 61994 125342 55689 60581 92872 80285
15291 80285 28238 77611 98157 54779 -12535 7799 1032 -28665 -49327 -46971 -36708 -70285
15279 -70285 -95411 -94004 -78904 -76051 -95249 -47422 -8204 24591 27519 20884 -22627 -49603
15267 -49603 -67446 -43018 22847 29466 53775 26723 -18747 -20789 78863 105064 75917 45715
15255 45715 10482 2932 -3688 -52958 -74778 -43830 -33116 -45137 -31812 -34656 -5486 -6692
15243 -6692 5326 66443 104071 62895 22257 37027 40582 589 8611 55572 90813 71463
15231 71463 70546 38797 9629 29682 17359 48824 58358 33806 1480 17867 63826 40960
15219 40960 32357 16840 23370 41460 -8689 -7542 8455 31490 31872 -29074 -24268 12207 1020
15206 1020 -21463 12395 30691 22937 -20961 -19167 -13892 -51293 -49532 -53401 -65260 -33662 7965
15193 7965 -4951 -11279 -35876 35798 46501 -21435 -40109 -14284 -5760 -25994 8777 32905
15181 32905 8496 -47790 -35704 -28493 -33611 -76345 -43568 38968 96102 90889 101260 26790
15169 26790 -70135 -46322 -37830 -69984 -63703 -24414 40382 105688 78874 110551 124006 94857
15157 94857 50036 -32351 -37481 -4502 2411 -4716 4098 11788 -6093 -5549 18243 6930 50450
15144 50450 37523 -6568 -35182 6435 9883 -46908 -86783 -107922 -55475 -26767 10870 16748
15132 16748 36665 40036 8446 40536 50285 37428 -14244 -76317 -166876 -173693 -151779 -105410
15120 -105410 -55043 -44121 -63910 -106375 -68730 -28367 -17092 5491 -28852 -99070 -130140
15109 -130140 -84181 5257 66018 76302 39750 6474 -9139 6779 -43948 -34164 -18083 10517
15097 10517 25618 11814 -20214 33491 100334 139681 82593 24764 44288 77309 63712 20037
15085 20037 77355 162256 249810 247009 178221 141950 77179 3247 14838 28747 65956 95207
15073 95207 115901 120859 107795 96650 123638 82937 65885 68946 38336 69 19188 6533
15061 6533 -20939 10587 72995 41441 -33318 -18643 -44314 7223 -11046 -2132 23634 -47951
15049 -47951 -83265 10449 92084 23231 -8997 -41067 -828 -1653 -4996 13675 58891 36965
15037 36965 -53261 -37890 -13364 9416 -16476 -39841 -8726 35766 53711 9005 -10054 -20037
15025 -20037 -9237 41214 47074 -4793 7808 18799 -39305 -43312 -52072 -68497 -46699 -25550
15013 -25550 -16231 -13592 -18440 -82001 -49655 26667 15770 -50496 -27313 64326 97678 117879
15001 117879 87370 101067 90276 108445 52686 -2571 -11181 14012 77216 77656 34356 17243
14989 17243 21764 71674 84200 91117 91993 95814 103145 72537 60507 59015 109488 182485 206599
14976 206599 119546 77974 121282 158764 181463 228251 250648 290729 267604 207255 154208
14965 154208 139060 135010 153004 158720 132669 70956 67457 102688 65702 39593 5478 22301
14953 22301 2806 -30870 -65473 -6226 617 48439 -5657 -63319 7313 3588 -1687 -39303
14941 -39303 -84493 -116276 -41166 14380 -17794 -65829 -87046 -40358 32331 67904 63503 70144
14929 70144 21083 -8489 -40526 -38035 -58380 -30450 12919 19827 -16157 -15201 -15880 -55540 -54815
14916 -54815 -65538 -12557 23422 560 42714 31596 27396 47810 71786 49344 58081 35779
14904 35779 -7924 -26137 -77720 -3619 15257 18467 -21705 -35590 -12572 -55973 -101564 -71564
14892 -71564 -38899 -52633 -9528 -19939 -50203 -65671 -61323 -26331 -6873 35504 40831 -2003
14880 -2003 -14596 -61321 -42616 -30104 -5550 -4041 8998 70565 78375 45091 50987 65357
14868 65357 85679 40396 29372 18987 -12181 -7297 -52967 -14437 34499 -7338 5700 32723
14856 32723 31488 47532 -2100 -30711 -32464 -32718 -45800 -14341 11141 -41262 -6571 -35479
14844 -35479 -31456 -48770 -32398 -23182 -10936 26965 -19540 -100996 -73726 -55498 -11767 37379
14832 37379 18956 -17363 -38078 -57252 -48516 -76666 -68681 -81244 -72804 -27481 -53786 -30705
14820 -30705 67838 125376 40194 -39118 -16757 -56754 -44404 647 -15331 -19674 -44327 -51924
14808 -51924 -40252 5642 -55315 -70891 -34448 -70773 -102999 -59904 -39015 -41996 -43321 -77250
14796 -77250 -81013 -15550 -3531 -54217 -117772 -146507 -95520 -12086 33827 22073 42697 -1156
14784 -1156 -75280 -61178 -36964 -58312 14632 17533 -82921 -153783 -139951 -32938 27901 39969
14772 39969 5542 -30579 -19587 -18965 48837 59690 34903 13522 -9959 930 36799 -8735
14760 -8735 -20412 -16824 -25038 -69098 -125765 -123639 -59065 -28577 -1718 20898 47741 34765
14748 34765 -1338 -2022 12384 -50889 -73796 -23770 20616 8761 -42867 -73241 -51351 -35137
14736 -35137 -6113 31144 35944 52950 17643 -39460 32632 49704 24404 6403 -27681 15636
14724 15636 13383 -27464 -25309 40614 25705 26181 79891 91009 56999 24641 22050 54784 59208
14711 59208 21862 -53744 -83212 -102524 -113176 -43759 -10223 -41866 -39889 -99945 -66525 -29770
14699 -29770 -5129 -86982 -50745 -87097 -109658 -49003 2244 26105 -29745 -77588 -101977 -70111
14687 -70111 -43819 -34565 1379 25281 -20400 -41095 -12379 14075 -24444 -94110 -69146 -71752
14675 -71752 -107316 -90826 -67323 -99608 -99359 -93027 -33251 42979 11916 5633 931 24244 14369
14662 14369 -64038 -111228 -93893 -90279 -139194 -166965 -122890 -55681 -19787 -37529 -39826 -46401
14650 -46401 -35090 14558 1936 -88734 -83895 -9930 34862 -22783 -19683 1713 -64119 -107780
14638 -107780 -55508 5197 -27975 -33454 -47605 -24756 -13599 -64135 -80372 -77860 -79698 -22991
14626 -22991 -42258 -37097 -60477 -46387 -25926 -28914 -34594 9453 -149 -27155 5012 -18443
14614 -18443 -29494 515 46807 30082 49609 52133 43621 7668 26042 67335 82654 57254
14602 57254 -48122 -33931 -43 20224 48218 67129 56714 16767 -53815 -41240 -50955 12152
14590 12152 9306 3692 -13643 17162 42714 56844 86818 98033 98765 67932 57883 34094
14578 34094 2645 -13591 -50856 -83974 -82551 2704 63693 35953 16430 524 -7877 15217
14566 15217 11144 48580 43073 44530 19485 575 8615 -8506 -31918 -16619 51104 56669 14262
14553 14262 26020 42468 -185 3393 -36316 -45877 -69807 -109410 -98186 -26507 54401 68396
14541 68396 70377 75651 54947 11930 -23834 -50262 -68677 -65973 -41365 -20983 -50570 -47143
14529 -47143 34112 -16797 -109881 -88181 -42465 -46186 -104474 -94199 -71999 -28086 -27001 -27719
14517 -27719 17631 55488 14867 -27533 -82609 -95960 -56648 1557 -1450 -2951 77176 102399
14505 102399 51031 50396 41306 23046 -31967 -103155 -60050 -46511 -59635 -19631 19985 13763
14493 13763 68881 90245 49717 -10528 -1104 69118 91102 45970 30313 -9032 55137 75601
14481 75601 42695 45533 -55617 -54526 -19384 -32346 -48484 -52595 -98843 -62569 -23034 -42186
14469 -42186 -58069 -49675 -103580 -77506 -27916 7559 -14369 -17075 29143 24830 11529 3592
14457 3592 22372 50291 53858 27092 45200 17020 18531 7826 -15884 -39388 -52664 -38687
14445 -38687 -71701 -104158 -105483 -94170 -37967 21439 56014 31550 -7012 -21373 -800 30725
14433 30725 22537 9556 14123 14357 -28574 -8450 -17844 -45213 -55403 -76728 -93256 -76852 -74148
14420 -74148 -107304 -99058 -83982 -85475 -78502 -37807 35 -8792 -10260 -24271 -61418 -56774 34823
14407 34823 70130 -15586 -57699 -34048 12433 77270 75778 52434 -25836 -56211 -23117 47535
14395 47535 67162 34057 49326 64950 62400 -8097 -38987 -13348 32523 71386 77728 39075
14383 39075 17906 20670 25824 4728 33112 -39902 -44359 15150 -3397 -70841 -63238 -57416 -39417
14370 -39417 -9055 34323 42847 43542 -1624 -33920 -44314 -83202 -61094 -47713 -35837 -23109
14358 -23109 -30726 -39940 -108816 -117649 -59798 -22575 -53535 8643 56454 32003 19417 -23989
14346 -23989 -41972 8733 53634 -12765 5551 14970 29483 35252 8107 -51308 -125697 -141017
14334 -141017 -75646 -47139 -31835 -9063 -12988 8860 17562 82046 82721 11566 -5415 21284
14322 21284 -10579 22913 5045 -6908 60023 101612 96466 85653 60700 41830 -4610 -29368
14310 -29368 17539 47981 30809 -44037 -89385 -113282 -91615 -19022 -26139 -72769 -107103 -89929
14298 -89929 -118247 -61459 -5868 -17769 5950 -5646 -39563 -66001 -31743 16569 51166 58129
14286 58129 15431 -7588 15036 56554 61019 61347 1418 -14845 -99 -64846 -65398 -7643 47038
14273 47038 53643 9686 -13359 -7093 -9451 -1340 70636 79415 33374 -12152 -13842 -57093 -91576
14260 -91576 -94763 -105551 -100803 -94014 -89682 -58250 -28802 -40184 -13968 6835 2373 43334 41131
14247 41131 -10917 -61183 -93275 -60481 -83970 -95079 -138341 -124017 -66229 13492 9446 -55937
14235 -55937 -93735 -99913 -34379 31385 -38629 -53911 -24240 -3392 -60508 -56858 -29269 -1421
14223 -1421 39739 124042 132785 157652 97457 15830 10360 -47469 -27859 33950 28326 45783
14211 45783 97701 106272 53968 23942 40431 -11739 -45149 -80878 -53459 -62957 -48067 -9411
14199 -9411 -31559 -45750 -16669 -12562 12523 -3030 24245 53902 61189 39836 5144 6515
14187 6515 -46940 -83094 -84277 -89674 -28381 -65312 -69466 -10426 -23236 -106429 -82418 20396
14175 20396 59632 45384 36404 42437 80807 48901 31642 42952 -26463 -88427 -30849 -35754
14163 -35754 -84884 -63167 -16445 -57351 -48340 -5917 37073 47649 -19891 -30412 -18709 24603
14151 24603 -12726 -24187 5497 -15798 -48171 -67182 -15374 4514 -11913 -53546 -40675 -31955
14139 -31955 4154 26863 -50311 -29658 -30830 6930 -197 -37695 -44877 26815 25915 -21533 13422
14126 13422 9983 19913 23881 -2319 -38392 -92113 -87883 -9177 4271 21195 44312 -14129
14114 -14129 -89261 -155567 -83043 -33943 -27161 -33309 -22288 4391 -24765 -5035 38913 7331
14102 7331 -12965 1023 57534 112155 95889 77994 109219 148477 130321 103342 62131 57238
14090 57238 30175 -9719 -46763 -41245 3271 24409 28563 29968 28075 -750 -27574 -40612
14078 -40612 -2899 -13608 -19353 -11150 -10370 -37660 -52235 -5837 22101 -15080 -29843 -21365 -66636
14065 -66636 -127206 -96806 -72646 -35008 -6891 -16830 -44337 -51242 -56554 -80211 -28944 -23066
14053 -23066 -18074 -38804 -33858 -62123 -61894 24473 43802 29851 1182 -23917 -4479 -29359
14041 -29359 -74145 -73050 -52279 -79879 -140166 -113410 -147572 -99193 -19304 -17281 -13481 -37354
14029 -37354 9439 -3140 11577 52051 9278 23393 42939 43638 -14019 -28068 23734 59340
14017 59340 66953 86139 81591 81021 81338 78401 79497 20907 -55202 -87456 -79571 -80101 -67317 -59710
14003 -59710 -46302 -53826 -67495 -66512 -80987 -57399 -46846 10973 24729 -3961 -5684 5208
13991 5208 -3615 -13595 -22285 -39648 -106419 -121432 -110705 -83247 -41229 -74163 -101071 -99028 -85999
13978 -85999 -101602 -120815 -119600 -76831 -42487 37889 28311 -4116 1561 3796 73599 103524
13966 103524 17487 -29356 -44391 -34088 -88082 -56123 21465 259 19391 49395 68288
13955 68288 21245 524 3088 16131 32402 -21993 -31704 -90655 -116726 -93281 -53693 -831
13943 -831 31541 25924 -28205 -25301 -40989 -55031 -55024 -61978 -46234 -18679 -10704 -41564 -1335 12293
13929 12293 45876 38833 55917 59764 25111 -49674 -47659 -33966 -71490 -59958 -97972 -85155
13917 -85155 -39637 8330 29655 -28891 -30551 -20669 -39987 -53830 -57174 -18760 -22133 -92544
13905 -92544 -129594 -85402 -75778 -65214 -55105 -53138 -34300 -37522 -51130 -48599 -11321 -13645 -18831
13892 -18831 -19362 29077 3400 -32594 13178 -30756 -68477 -40362 -40149 -64392 -55805 -59548 -32672
13879 -32672 -20893 14399 36799 44544 9126 -8143 -13479 -18575 -1398 -35540 -13269 -6314
13867 -6314 -16688 -59058 -65334 -18852 -31382 -27317 -19583 -17427 5754 27847 7301 -52151 -90395
13854 -90395 -95681 -38091 46805 53680 57612 72781 91972 106984 117010 37786 -52101 -53178
13842 -53178 -35018 -28976 -77401 -33199 7153 15875 8829 -2743 68041 76603 64237 -15952
13830 -15952 -25319 -14430 -26569 36474 68587 50238 44120 23926 13826 -9323 -27505 -16051
13818 -16051 -8320 -6917 4620 5592 -14664 -28191 21453 22763 -54182 -23122 -45032 -34419 -27295
13805 -27295 -20166 -26874 -58658 -57058 -104744 -87332 -60709 -18122 6902 2630 -5103 361 29074
13792 29074 -569 -31348 1242 -8861 -8257 837 1052 36618 -36099 -69701 -45769 -69530 -29965
13779 -29965 -66114 -91331 -113702 -130579 -57780 -17728 14928 16755 8158 -31149 -40362 -76846
13767 -76846 -47033 -4155 19133 23082 6038 1446 -30383 -74696 -85481 -118786 -75787 -51399
13755 -51399 24301 84942 112920 37195 -42032 -51520 -30527 -65687 -82815 -31944 -5452 15200
13743 15200 58492 55296 44761 -5646 12171 -3843 -9097 -29125 -14691 -56195 -93410 -35303
13731 -35303 -42286 -66030 -31123 20061 41702 1099 -47854 -23245 -3952 63247 94271 32979
13719 32979 5512 10953 18719 11053 25202 -34171 7677 42740 70599 36878 -9231 -29739
13707 -29739 -27584 -27390 -5433 31471 20348 -25052 -19718 -44423 995 -5446 -44600 -27997 -53732
13694 -53732 -11585 85622 73027 15111 25904 -18714 -53563 -45978 -18973 -54014 -80345 -69352
13682 -69352 -18687 1258 15458 -4543 -28607 33637 77273 36878 30858 30659 60508 100074
13670 100074 80304 38922 -3936 34870 75528 -2690 -36838 -20121 -29204 -34665 7331 35384
13658 35384 36362 32429 19750 22152 1109 19754 -29637 -9050 30988 -4775 -30507 8326
13646 8326 6214 -43865 -64809 -28975 9101 -33630 -55422 -57136 -44349 -64249 -78662 -50598
13634 -50598 -11844 -366 684 36320 730 -36587 -3312 9806 77240 49442 -38348 -111323
13622 -111323 -119609 -100199 -59352 -29664 9843 48775 85147 84680 58499 46602 75475 98958
13610 98958 82567 4855 -41115 -33511 8645 61453 54667 -16982 1556 35612 51931 31754
13598 31754 69691 53673 24919 -24551 -3951 12576 -10648 -53373 -29409 16314 65281 64799
13586 64799 8326 -66866 -52531 -66937 -41406 38315 97270 154574 168191 127819 80156 89152
13574 89152 72727 23278 9631 -13767 37731 38634 53596 79607 88375 54201 63099 107294
13562 107294 77710 10817 43212 31899 -56069 -88389 -32740 -36247 -58286 -53189 10852 94612
13550 94612 107588 65345 2932 6869 -44334 -52750 -65908 -96863 -68623 -28314 -34098 13858
13538 13858 61131 30069 -19965 -25050 -33081 -27599 56766 106719 86675 66151 73160 74391 68108
13525 68108 48844 44429 92516 105747 64305 26945 59056 104227 52434 20459 -30364 -92393
13513 -92393 -86818 40172 26502 -47823 -59040 -71106 -32401 75165 125084 54635 62817 87506
13501 87506 98669 55853 30312 2290 -3570 35313 47861 24671 30561 82729 45255 12310
13489 12310 38588 31209 50269 50073 49178 29884 -12786 -3143 7815 -563 -6126 -42401 -45645
13476 -45645 14038 14644 333 -23687 -11880 -48418 -53442 -28602 -5389 -14989 -72738 -59164
13464 -59164 -20784 49002 54546 31707 43975 13975 -14053 -18403 8889 30471 14657 45455
13452 45455 14821 -32256 -64602 -98967 -82451 -66041 -56664 -50569 -87307 -47270 -55686 -46510
13440 -46510 -2872 -10759 -7549 42134 42971 75495 100773 72614 38541 20215 825 -24136
13428 -24136 3604 46218 31759 21625 49397 94620 99520 102396 111781 68800 10726 -1078
13416 -1078 30366 51036 48263 48536 40591 13042 31833 -1992 -17892 10119 96199 96802 47090
13403 47090 -12153 -60494 -70719 -37206 -56500 -29237 -25988 -1652 80772 50569 18265 30214
13391 30214 62755 54242 37490 -20200 -44587 -78150 -110405 -99266 -103741 -55145 -40236 -19623
13379 -19623 32445 6438 -35572 -19088 -12767 -3420 -11735 -684 -16721 -5521 28228 -5652
13367 -5652 -531 20435 -12739 -15786 1347 19712 47665 80917 62148 47443 9041 43705
13355 43705 22165 -4536 17403 43295 34426 -18152 -40699 -20291 -8531 -33215 -79833 -71194
13343 -71194 -75176 -71314 -56398 -54982 375 53138 98965 74323 66495 37030 343 22062
13331 22062 6856 -14261 -35960 -42057 -21495 -35950 -67341 -62479 -58114 -8710 63306 7647
13319 7647 -40075 -44985 35443 48718 -2625 6388 26686 20253 -29180 -15609 -3546 -5708 8556
13306 8556 24292 54958 8779 21775 51733 72469 47431 27722 -3910 -25509 -8118 7306
13294 7306 -1348 20235 34311 -19096 -7931 -14798 -52382 -47658 8461 34793 5732 51096
13282 51096 37141 1763 63342 58899 41307 -21247 -146345 -152606 -68736 -9734 29186 -26105
13270 -26105 -37624 -9361 6882 17296 -30135 -11738 48530 28736 8558 13406 70805 88594
13258 88594 84633 138037 125516 31300 -11811 -50638 -39489 -15065 -7635 18899 27287 21077
13246 21077 17095 9406 9539 38294 100840 65957 43609 35479 51029 66834 50462 37409 22987
13233 22987 199 32935 44314 -49579 -117881 -65220 23448 53341 35362 33003 69138 4603
13221 4603 -23290 13220 14268 -42720 -68498 -81612 -20772 15388 -17379 -43628 -61590 -40754
13209 -40754 -29676 -22450 -34280 -13450 52083 56016 33898 -3227 -18709 -43078 -54145 -31506
13197 -31506 -22215 -13664 -8202 -11165 19372 -43046 -79014 -113101 -99886 -31141 -51775 -5875
13185 -5875 41059 19257 11985 -15337 -14579 24479 24010 -8367 -35358 -50407 -88737 -108726 -85487
13172 -85487 -42882 -34205 21401 -15739 -34711 -32610 -9126 50104 23443 -5991 -32857 -83862
13160 -83862 -23003 27943 84517 -17900 -84431 -29921 -60233 -56756 -51844 -13044 -23312 -37293
13148 -37293 -36996 -32470 7127 27994 2366 21201 46843 23148 -16322 32943 71748 66452
13136 66452 94327 101630 45949 -36416 -37173 -43162 -22468 23084 38228 42109 25924 -14655 -31464
13123 -31464 -29658 20595 77501 83549 61434 65218 45141 -23080 -72948 -22852 34939 52478
13111 52478 125263 101322 60138 35913 57705 54930 50126 55263 56776 38561 67768 102440
13099 102440 23566 -68311 -84860 -65258 -1648 17910 -37829 -68235 -80975 -19403 31000
13088 31000 25183 8547 -4684 -22698 14545 31922 4137 25566 38088 65902 -17066 -81299
13076 -81299 -56952 897 59559 84898 132764 118528 98754 65266 18236 -50522 -45108 -38144
13064 -38144 -48433 -21001 3461 55569 84589 150613 111781 37944 6508 -2246 -15652 8904
13052 8904 44117 66853 -28383 -2165 58580 77225 54501 34833 -7592 -20963 -24042 -42366
13040 -42366 -60812 -2993 20591 10138 30835 332 -72215 -27334 29600 39370 18587 -6983
13028 -6983 11239 26260 53221 78093 102763 64934 39143 63224 66091 28082 -27451 4077
13016 4077 42591 -50484 -56602 -49478 -3527 25114 6895 -10338 -33623 -55517 -59881 -78449
13004 -78449 -4095 9181 8658 2680 9530 -22229 -58362 -54517 -22991 -3364 28940 41695 60673
12991 60673 47977 67793 32546 -3175 -30825 -47155 -40596 -3455 -6556 -9632 16101 -23393
12979 -23393 -62632 -48643 6393 47365 -4722 -46001 6025 72931 67787 90241 34357 -31406
12967 -31406 -21748 60813 47535 6200 14795 69611 80472 22250 171 14191 98543 126269
12955 126269 136915 102691 53186 11990 9203 27058 8153 -2875 -431 -26206 -65023 -47331
12943 -47331 22448 42144 -7314 -78813 -36366 -48505 -76361 -106788 -32761 32842 56112 52188
12931 52188 89294 65752 73790 48642 12587 44694 71954 129574 193885 243993 281685 297824
12919 297824 273857 226421 230296 180367 145282 92993 73488 98044 82926 110173 139966 156568
12907 156568 73792 32181 56864 70155 106545 155740 173063 154435 93553 36204 31399 -20496
12895 -20496 12165 672 -35512 -9787 -19928 -27143 -22772 -49691 -31248 -12659 37297 65786
12883 65786 56564 42373 80477 161191 212889 215887 290534 303812 267507 195954 174026 131939
12871 131939 46796 -34326 -32033 -30728 -21007 -56708 -25495 35615 -9442 1967 -15687 5005
12859 5005 88302 104398 84659 50603 -12911 -75049 -50176 -45730 -48403 -40392 40768 23651
12847 23651 -16033 4732 22165 17711 22894 -40920 -73300 -63444 9040 51319 27900 25519
12835 25519 65679 45170 107269 222540 179841 127725 109830 111494 119475 26047 16367 41679
12823 41679 80426 90345 72449 49444 -9178 1819 40670 8511 7950 41069 93438 139167
12811 139167 73714 4061 -54089 -64686 -51634 8675 5371 -31474 -54354 -86517 -34684 42021
12799 42021 74317 55331 82411 135394 192356 213346 182943 194016 124678 48932 48271 3083
12787 3083 -41369 -27365 -24224 -20950 24403 25332 38539 83379 43524 5403 25051 23199 -4111
12774 -4111 -4825 18088 31387 22602 35116 53545 45206 -14653 -14307 5164 -28554 -75263 -67969
12761 -67969 -6640 43442 10957 -2213 8489 -48063 -54068 -3188 -7416 -2845 -2022 11707 99985
12748 99985 107582 126651 120804 154605 167394 111682 104512 129252 118804 127542 13635 5172
12736 5172 4549 -14357 -30920 -32030 -2761 -9959 10329 36947 58310 31866 3149 29799 76953
12723 76953 54027 26304 11708 15976 113335 122876 104468 101221 117558 110895 60044 77093
12711 77093 64792 -20644 -41487 -41733 -22729 42721 35377 36799 42744 84865 61783 47137 65273
12698 65273 63207 41000 -15026 42104 51144 68933 89653 99862 116078 108683 157379 158307 101185
12685 101185 69373 89382 69038 37779 81264 154905 155230 161317 110292 45717 15232 25586
12673 25586 59786 50484 40153 28575 39242 64837 94642 112426 131014 135443 125993 64963
12661 64963 49951 75050 106447 113673 105881 142641 142136 108115 99948 130538 99541 64896 57488
12648 57488 65923 58976 51444 7141 -7350 56174 89581 79040 24304 -63 -32848 4413
12636 4413 46816 74545 119644 137970 56692 40780 78821 138509 114567 45172 21592 72106
12624 72106 91450 59544 38218 34460 17065 -18032 -11990 8944 63162 51914 16915 -24348
12612 -24348 49720 117550 92337 64198 52200 -13980 -91855 -8725 45375 65238 69388 108510
12600 108510 122645 103054 89166 69472 27817 35013 -420 8812 35965 68225 72930 88696
12588 88696 158452 174892 151433 108231 50757 -673 14163 74159 106169 196003 189594 90743
12576 90743 90172 120575 98695 135054 127352 123632 118962 87505 149582 160858 108481 131122 172480
12563 172480 158410 145159 126962 113767 105307 112064 43915 2511 25342 71337 60206 20678
12551 20678 16287 49585 70915 83872 82558 119705 120831 91451 83997 116050 91698 69036
12539 69036 6921 13500 30226 27173 8553 400 30059 4466 -10005 -15132 15399 59922
12527 59922 86465 114165 136122 91832 63633 55012 97116 101352 71068 5092 -73891 -68543
12515 -68543 47810 100668 64836 78085 120342 133632 114338 101467 110161 56617 29011 -9443
12503 -9443 3432 79760 180050 162544 159974 135303 92779 160462 234581 226942 188173 174052
12491 174052 128120 122583 158961 122787 119167 107566 112788 77228 86427 94712 59382 43414
12479 43414 51754 43002 35639 110639 133372 126930 135834 164872 154681 133379 96398 134960 117465
12466 117465 101365 127082 142140 184271 191232 209954 185034 101962 95201 139219 148245 155458
12454 155458 166111 169029 152667 170327 232567 199926 226044 210828 170102 111265 133306 187029
12442 187029 154045 119163 145560 185187 217986 166581 102761 142783 169842 159299 146604
12431 146604 145708 142380 164475 180594 160313 109512 87094 96716 90231 92960 164817 196731 215658
12418 215658 178066 111411 117957 170818 183478 184121 176697 89182 55642 147099 215452 219539
12406 219539 291137 256952 243460 211842 192237 211533 248583 271998 242132 229058 249710
12395 249710 225330 176416 214837 210851 149039 209430 274781 249698 237856 243335 228917 247264
12383 247264 227973 235759 296726 275201 138013 93509 117524 164864 177983 199754 217999
12372 217999 186143 173553 159501 163865 185880 252614 252541 283353 277548 208075 202832 241431 260521
12359 260521 294928 310918 291290 289376 270442 222435 223485 270892 307591 283446 255490 222446
12347 222446 185957 150094 198868 240579 255115 271639 279667 286273 297160 289958 242746 251766
12335 251766 252024 239252 186353 147938 155730 186875 205173 184024 170870 196266 156174 175887
12323 175887 236358 285058 268325 255372 247402 285303 328682 420926 433338 431080 407929 368374
12311 368374 315463 282720 303725 258322 230702 271820 393204 384786 285861 242677 165461
12300 165461 163854 167473 160742 144382 166848 206824 222305 223271 277140 264849 274255 299371 307555
12287 307555 263383 227602 227381 258485 284932 300919 315114 322867 307484 354695 358025 324978
12275 324978 347775 328761 301902 279934 313103 328141 319844 353255 393404 387569 358793 436535
12263 436535 427821 369480 383088 410362 449648 458482 397811 395655 381695 382138 298973 290666 331225
12250 331225 359526 380397 378103 397208 410560 358337 338259 362314 407681 448492 420420 447182
12238 447182 469565 475183 505084 573339 562632 462516 462442 520135 478829 467443 461601 509978
12226 509978 480740 500376 540881 546199 550910 635344 631197 527289 525745 595686 602755 650491
12214 650491 679286 597946 572411 566098 556523 563776 611556 612601 644235 673082 626115 601333
12202 601333 595035 540758 522257 616619 683200 720209 691403 671720 739546 776532 723159 754003
12190 754003 809425 787961 716250 745852 786575 834616 831651 784518 761896 798203 842932 862644
12178 862644 877861 908988 798815 794627 845175 857100 787768 816697 905691 891542 855741
12167 855741 832300 806267 766808 762383 839647 926721 929519 915158 897127 992584 1086783 1054866
12155 1054866 1049452 1031691 978948 987713 1035324 1073543 1114335 1095342 1124633 1134013 1123310 1093624
12143 1093624 1061716 1060080 1138299 1249485 1276541 1281763 1329786 1366922 1389431 1391777 1405156 1343903
12131 1343903 1251033 1288047 1378458 1395911 1392918 1385304 1432856 1506965 1567033 1564636 1565922 1583990
12119 1583990 1584027 1604321 1581484 1603535 1635073 1685208 1738791 1740318 1740800 1800133 1864737 1821298
12107 1821298 1820412 1922073 1967622 1923137 1934960 1998657 2038169 2090221 2095842 2162843 2281850
12096 2281850 2337750 2447066 2483078 2554639 2581176 2588636 2575622 2550611 2569636 2590737 2591384 2654880
12084 2654880 2707951 2699224 2719054 2756200 2772934 2924986 3049200 3068355 3096186 3157015 3172474
12073 3172474 3191998 3312219 3418114 3443140 3512548 3599124 3650804 3688407 3705923 3756008 3861894
12062 3861894 3939471 4045595 4094717 4180584 4318822 4497815 4599871 4791327 4928191 5009570
12052 5009570 5139216 5252791 5363022 5453460 5569729 5674230 5841522 5995177 6117082 6240480
12042 6240480 6285950 6380479 6539399 6703648 6946734 7139003 7311385 7456863 7633729 7827299
12032 7827299 8052014 8271297 8468151 8706881 8971198 9215741 9483114 9764845 10083375
12023 10083375 10355041 10696668 11084166 11377150 11685271 12028762 12416237 12780128 13192419
12014 13192419 13653888 14107105 14519088 14987400 15471110 15985764 16502856 17025699 17581640
12005 17581640 18096507 18637255 19281779 19965114 20542631 21140191 21763367 22428127 23110988
11996 23110988 23772555 24489152 25206665 25862304 26598169 27294773 27946504 28609243 29271050
11987 29271050 29889681 30517454 31030587 31531841 32073318 32563029 32972889 33344207 33666185
11978 33666185 33900801 34020935 34104255 34136914 34080420 34017298 33811646 33480414 33141903 32811232
11968 32811232 32474211 32034074 31505653 30920432 30341538 29672392 29041692 28377091 27661720
11959 27661720 27011718 26388684 25698441 25102555 24438940 23687039 23018453 22393194 21711599
11950 21711599 20993019 20345051 19746065 19125741 18507870 17958867 17410580 16843517 16294766
11941 16294766 15752827 15292357 14888295 14454031 14011463 13598772 13197425 12742794 12366714
11932 12366714 12013890 11683368 11358765 11013302 10641784 10319735 10069973 9806361 9503991
11923 9503991 9178626 8900973 8631329 8406358 8175353 7933407 7760388 7593558 7415594
11914 7415594 7201160 7003319 6844137 6662282 6466968 6344544 6232397 6124164 5939275
11905 5939275 5735095 5567079 5464217 5358746 5254746 5137416 4978472 4813552 4760427 4722876
11895 4722876 4599886 4511250 4441305 4333426 4210074 4126525 3998352 3900780 3840296 3776822
11885 3776822 3692622 3640800 3555327 3519103 3462053 3381043 3275192 3172869 3124469 3113458 3052260
11874 3052260 2986324 2877028 2827833 2793874 2745642 2631602 2647049 2648970 2579847 2570306 2542898
11863 2542898 2411869 2346726 2318267 2307989 2351116 2338376 2299092 2257579 2227960 2206569 2169985
11852 2169985 2127158 2079914 2015901 1979523 2010636 1981733 1933158 1891483 1824519 1803036 1771805
11841 1771805 1756333 1686795 1650812 1670825 1655582 1669983 1706128 1733872 1651911 1581892 1588140
11830 1588140 1588069 1514216 1457530 1390511 1369394 1339217 1337274 1367403 1404177 1455663 1375237 1336689
11818 1336689 1335667 1312607 1226895 1200078 1182629 1168148 1188847 1174323 1144085 1072719 1092360
11807 1092360 1105549 1108381 1207504 1231210 1167591 1171222 1132836 1046609 988668 1057900 1051568 1045830
11795 1045830 1025212 968314 989653 934287 868164 851867 875061 915990 942521 896368 928750
11784 928750 972453 907947 824349 767484 773069 816844 848525 853147 844847 830312 842729 821963
11772 821963 751481 737582 715607 695529 665651 666863 706448 710054 682341 662911 685937 670631
11760 670631 622050 636889 676987 615179 601115 579785 569178 579566 630513 597785 540225
11749 540225 561169 586961 637513 696598 670337 591245 591641 628774 610926 623179 606008 607434
11737 607434 586138 561665 533002 485497 520463 583693 578477 560433 522530 544326 616020 606647
11725 606647 556465 547554 560196 572476 544036 509526 540283 561981 547845 494003 442144 429730
11713 429730 456683 500000 513493 439441 417233 435626 423596 404077 413309 472272 425709 441144
11701 441144 513382 533045 504583 506670 534263 484846 411448 402836 398337 396929 469628 469072 451516
11688 451516 413870 316653 252118 248432 327065 344659 370626 354446 341899 303207 292937 295714
11676 295714 343110 400976 373346 314880 304049 349304 376560 349975 332539 246583 236842 283690
11664 283690 314658 309811 355172 369614 364982 386026 415708 434228 442738 404315 360997 372458
11652 372458 419269 365347 323767 376502 382035 372349 349435 319942 304629 305596 333160 307534
11640 307534 297389 356989 317295 310142 286036 306735 358110 378360 398363 355202 372370 381835
11628 381835 323203 308424 291340 276472 305053 272193 193448 153788 178385 199127 233996
11617 233996 244839 247019 220562 261390 274916 210806 138345 148058 131904 203226 202762 174811
11605 174811 119488 97937 137232 142055 133569 153814 184918 161311 148843 178946 171726 163750
11593 163750 209426 233149 184199 213373 216726 97750 81908 85118 84995 129652 238645 252005
11581 252005 264349 195460 181762 207911 222364 244627 235350 131675 120755 186833 195280 223001
11569 223001 211912 216392 239140 274551 231232 169007 120152 71511 131691 187846 203461 213603
11557 213603 170379 122615 69289 103428 158964 140961 89557 49408 39958 73524 74028 -88
11545 -88 33574 80302 79517 66080 124762 181277 211583 165625 151282 186769 203474 142756 104861
11532 104861 91766 128353 147427 162591 135277 134526 113971 190525 189529 164620 172364 149071
11520 149071 111765 150413 217107 228677 193713 206595 211161 220020 174449 126127 123298 164370
11508 164370 208203 126207 17847 7447 27016 72180 167157 145152 105788 42315 87737
11497 87737 132437 90085 96706 125674 112478 84422 156171 138009 82795 79194 68870 69966
11485 69966 131102 175721 214034 225996 185309 100815 53472 84643 102728 127427 134430 101457
11473 101457 106520 103080 84450 91675 159577 127910 112876 132724 109207 87672 28869 -11428
11461 -11428 -39446 -1562 16211 83183 36851 38100 93109 75848 43137 46593 35854 65066
11449 65066 39939 -13401 -13665 10987 51005 71906 48718 69978 63577 61266 29734 -26879
11437 -26879 -7848 60937 147349 124954 51414 38585 67078 60169 87207 147363 144696 115588
11425 115588 162941 137326 129994 113772 63586 99316 126685 90421 96869 112508 141460 139500
11413 139500 112126 70404 290 -36473 -20389 -33301 -17060 2630 -20215 12140 40526
11402 40526 897 -9584 17355 31556 75711 64187 67820 70687 73600 77293 76304 80029 49157
11389 49157 100127 77111 55640 21478 9171 24259 75549 100063 51422 1411 7567 5783
11377 5783 -29258 8831 48488 82367 81371 114108 147739 135597 73049 44772 64395 131824
11365 131824 103778 61495 95589 57244 7115 10134 -20537 1336 114043 165576 169229 119043
11353 119043 86477 23912 25361 18126 -20809 -4093 -481 28029 53348 65341 71825 53126
11341 53126 20517 -11081 -33308 7080 1729 -14970 -1156 24136 44516 82860 70276 48903
11329 48903 4426 20145 45835 80610 133923 152363 136819 137461 149047 101178 60632 51790
11317 51790 31741 87438 82703 33564 31626 47001 27413 40995 81719 85713 92956 55427
11305 55427 43527 83312 71803 41494 41395 50657 15477 -35794 12929 79556 101953 68471
11293 68471 63785 73508 74578 52038 62051 120181 90133 50958 62013 84812 47069 24386
11281 24386 11450 -40205 12477 79236 84593 37480 16592 32058 -12727 -30349 24115 -20992
11269 -20992 -78092 -8010 29286 4752 -13995 21209 37146 -21013 -47537 -51553 -59152 -75428
11257 -75428 -33801 28637 18836 21019 20575 -4087 40080 -18923 -55906 -12465 25840 36279
11245 36279 34053 7775 160 -49401 -34521 4037 -17986 22169 37772 49176 1225 11567
11233 11567 40721 60671 67694 71068 58340 75897 37202 17511 15713 -63194 -61207 -50092
11221 -50092 17149 -12299 -5712 -355 -29109 -48542 -25450 -19767 -42078 -51571 -40399 -41342 -58997
11208 -58997 37802 124635 60707 36116 79462 28931 -39243 -8170 -12568 -4079 37499 70958
11196 70958 78903 85371 99273 24556 -33947 3316 7257 32353 22932 -34853 -11629 6683
11184 6683 60410 108572 93359 76238 32840 9288 27424 4686 -77598 -95653 -45991 -5484
11172 -5484 -22425 -28405 -14688 -38856 -72681 -51441 29460 25142 -586 -16586 -13149 -2005
11160 -2005 2431 62201 56080 -39488 -24806 57689 71285 3424 17770 77398 49063 32992
11148 32992 32588 105363 91775 70422 48698 65203 59203 24221 -11716 -24212 -33873 -22052
11136 -22052 35782 22284 -51187 -45505 -53769 -53265 8840 61251 80376 38248 51313 90252
11124 90252 19021 -27692 -16669 19109 90135 105126 61484 -2701 -14496 29819 1349 -30713
11112 -30713 13934 5191 -29856 -23898 -19374 31010 12649 -8737 -5631 25688 49160 20331
11100 20331 36272 44193 42197 58168 61136 29546 -41851 -5094 27706 -38377 -52838 45032
11088 45032 103609 99947 121919 83598 47465 -284 -45790 -80357 -87399 -74268 -22010 40355
11076 40355 -42453 -26818 66206 102550 67545 56646 79147 125867 100408 115237 110432 20773
11064 20773 -20774 -22733 -18230 29633 68075 30075 -106432 -93082 -7672 75300 51889 -39778
11052 -39778 -29371 -52660 -23922 31550 3209 -2374 9850 50459 40974 18225 33085 36014
11040 36014 24101 46380 64366 119673 146085 166335 194799 266430 260857 199064 193214 229314
11028 229314 265867 301546 308570 319737 323705 311405 271512 316960 331177 288049 241438 316134
11016 316134 395320 438136 492655 448274 438486 394254 322870 302645 285491 325084 355013 333747
11004 333747 261853 299244 370038 396712 354131 274919 206698 225394 208195 175182 173753 179102
10992 179102 107759 11792 24536 41644 37595 5260 25840 44909 50627 30047 -5108 44777
10980 44777 102632 128214 115167 25938 -23286 -38752 -35053 19854 15025 -25434 9417 26535
10968 26535 908 -32428 -72874 -111756 -55944 -18279 18004 1024 6269 21381 -23959 -15058
10956 -15058 -19182 -5965 -7458 -53998 -73184 -34656 -14109 -73050 -107014 -79739 -74022 -51872
10944 -51872 -73846 -61762 -33620 26486 55478 32118 16949 17160 87456 93216 9301 18318
10932 18318 29561 -14111 -121730 -212371 -193686 -153116 -121681 -35750 24166 75190 54095
10921 54095 8667 -24586 -45223 -90276 -94203 -51477 -46872 -26343 1792 24375 -14799 -1456
10909 -1456 17735 -11734 -41541 -56906 -77094 -1084 8985 5351 31256 28918 56680 20888
10897 20888 -29666 -64317 -42443 -83041 -81698 -20331 10913 -54647 -10552 -11754 -21815 -39074
10885 -39074 -19431 -6977 -16811 -11047 -39139 -56279 -88050 -74627 -56073 -11574 67431 37527
10873 37527 -22258 -91143 -57715 -9987 -89921 -127435 -134865 -88152 -61265 -45979 -11449 -31195
10861 -31195 -46819 -88579 -70588 -3439 43600 -766 -50301 -61879 -84429 -38890 21739 -53859
10849 -53859 -69103 -101396 -99578 -107432 -68665 -23326 48996 10324 -35261 -101350 -98002 -22045
10837 -22045 12999 -67717 -40048 -4471 10372 -20679 16112 42607 -33216 -30478 14049 -355
10825 -355 -39657 -53969 -67676 -85038 -73468 -25441 -79221 -105101 -132354 -120514 -70287 -42453
10813 -42453 -69226 -63397 3405 46707 39847 36392 63234 88923 55371 -49627 -93527 -103228
10801 -103228 -73202 -55183 -107190 -124378 -123725 -62343 -34962 -57824 -66085 -20168 9754 -11137
10789 -11137 -39138 -122755 -94567 -25457 24877 -370 -52194 -53669 -9786 32000 8255 -20979
10777 -20979 -43037 -62879 -12420 11120 -9357 1360 -7610 -24283 13113 4985 -9517 -32706
10765 -32706 -26052 -51857 -13562 -16552 -28323 -65084 26407 8131 -78188 -92271 -65948 -54949
10753 -54949 -25176 7711 -41043 -109772 -133874 -60192 -79272 -87121 -86339 -81311 -68011 -67346 -64666
10740 -64666 -34299 -19195 -21703 -2096 12883 -13052 -20094 -25307 14876 36030 36187 -63871
10728 -63871 -129622 -161779 -159499 -139471 -59086 -67210 -18522 -28361 -36243 -265 8977 -7312 -34144
10715 -34144 -112644 -123859 -45968 -26133 30586 55529 49819 35118 10871 36786 12180 -38607
10703 -38607 21909 106312 86609 123351 129554 93702 80329 100448 92161 27666 25325 54356
10691 54356 69923 51477 32177 34550 51991 58457 24654 -24813 -12004 11610 120224 106083
10679 106083 81265 103571 105643 139143 140092 128859 159542 129116 136771 136662 136675 150673 101997
10666 101997 108941 108046 129256 143986 86049 79230 121353 109662 98318 122120 128384 162028
10654 162028 194064 228910 223416 203852 243112 317017 316488 297991 273650 245182 260411 258001
10642 258001 352850 435767 412352 400273 427526 435692 461998 525980 518598 482328 473015 496449
10630 496449 611304 698235 742503 834014 911964 1036674 1196694 1441131 1590979 1735208
10620 1735208 1899404 2127034 2443433 2843530 3283943 3908017 4791829 6021470 7726462
10611 7726462 9964572 12824273 16419472 20282009 23614269 25615406 26167495 25706902
10603 25706902 24950663 24444383 24794513 26521143 29875774 35105262 42140680 49906154
10595 49906154 56102220 58598171 57245129 53687352 49623892 46448709 45181621 46256738
10587 46256738 50089249 56685848 65543676 74947988 81387532 81837554 76818266 69104724
10579 69104724 60879804 53865018 48969881 46732493 47131057 49840737 54192974 58674121
10571 58674121 60898088 58972203 53622897 46787103 40007746 34337849 30266319 27830180
10563 27830180 26839028 27049938 27881227 28579931 28343498 26566187 23491572 19876087 16311346
10554 16311346 13185425 10622298 8600239 7131165 6029449 5132865 4457992 3859643
10546 3859643 3454083 3152390 2862482 2565764 2317084 2112832 2006663 1788977 1599238
10537 1599238 1483354 1324344 1231437 1188655 1141187 1053469 942184 936860 935629 876814 793076
10526 793076 709792 646451 638195 631027 610297 630083 582681 539697 540599 519128 468155 437034
10514 437034 409323 359899 367270 418570 411749 359590 359671 338790 298976 337294 322312 247266
10502 247266 226757 188994 205007 216284 182827 200133 176057 121760 125893 161701 185632 180224
10490 180224 128991 133312 190942 260463 196023 159103 149384 197474 225998 194843 122287 103105
10478 103105 63848 83313 90985 99331 115094 99131 80044 25231 -6191 -53877 -99395 -134581
10466 -134581 -12603 89093 119671 159367 161874 123840 95713 141966 116080 94104 103270
10455 103270 126615 110747 112760 147719 189425 121290 117569 122720 155438 215876 192264 106304
10443 106304 101705 57420 101606 152930 215831 193958 90417 60686 85132 87397 84684 165160
10431 165160 148144 78528 65675 108460 126729 91558 103902 101217 103899 110569 124339 71310
10419 71310 58446 27943 20638 120697 143726 82828 66429 89584 78330 74557 3517 -42897
10407 -42897 -8255 15942 26307 49420 53810 59667 91251 57269 39517 40442 54029 92627
10395 92627 113070 52016 -13613 -25661 24157 68317 83193 95248 79159 105258 119953 73798
10383 73798 70939 74826 68600 52894 40294 59635 93650 45980 -6767 17174 72229 80887
10371 80887 106353 60057 39807 58357 20751 40184 38936 24030 27106 52486 24239 -4860
10359 -4860 596 62793 56208 -1388 -32752 6353 47111 23864 8174 6085 -22631 25401
10347 25401 40279 10743 -25752 -25652 -21070 -4506 25298 39903 50647 79068 54122 66139
10335 66139 57504 -5546 -15998 -31084 -56836 -50853 -17852 13330 27294 35373 15873 9127
10323 9127 17556 -8034 -1188 24632 57856 94283 52137 -1380 51251 48199 7260 -3949
10311 -3949 -9411 -12020 -26738 -70572 -54764 19610 19268 -25812 -25676 -30384 -18124 -60926 -79905
10298 -79905 -23069 45827 21284 -22501 -4529 -12502 -21109 -39020 -14135 37357 -22952 -87414
10286 -87414 -93345 -79257 -48877 13779 45428 22067 32923 172 -37031 -12960 48996 60202
10274 60202 -12510 -32149 -66747 -65811 -57767 -65975 -53232 24444 67867 71400 70985 27647 25102
10261 25102 10714 16653 70217 12787 33479 -25910 -9928 17821 76433 98593 38995 -24626
10249 -24626 -50945 -1766 13412 -7647 -12163 33893 11480 -36820 36924 72440 66693 20332
10237 20332 -4592 38986 47404 30272 15577 58550 57118 34379 -7845 -1057 -4337 9116
10225 9116 8902 -10603 1969 -45699 -46559 -9242 -1863 -10420 -24642 -14731 13884 19517 13285 -29284
10211 -29284 -1368 40752 -119 -72702 -123126 -59332 -7130 44489 97681 114387 71502 3143
10199 3143 -3610 -14067 4977 -40923 17079 94774 15089 -6526 15284 5428 14552 9593 -33703
10186 -33703 -39081 -81399 -67872 -74037 -70086 -70784 -28297 38229 23528 -5215 29291 84065 166215
10173 166215 159251 161887 183079 195607 184169 213550 151947 88064 12380 62577 117600 141622
10161 141622 188581 231698 252430 289369 358148 305135 224201 198554 187900 226771 258452
10150 258452 229815 248793 328122 445223 498486 534685 519352 481140 365751 326195 273360
10139 273360 229778 264052 299993 307119 277735 338908 389729 314732 189001 102262 98066 107354
10127 107354 111100 159428 176249 165350 144739 148872 168557 132125 121882 98532 106210 117741
10115 117741 116471 60183 63786 94922 70843 38339 94083 75335 53039 42553 24322 -577
10103 -577 -41789 -27073 16627 35232 -19008 -40599 -43348 -103330 -96202 -57293 -38880 -9326
10091 -9326 -26001 -64323 -19937 -21386 -27117 -50052 -6462 61294 87081 73471 66338 61934 108988
10078 108988 133037 67084 18743 -13625 -14240 11956 -31844 -6855 -552 -21479 3014 -11154
10066 -11154 -29863 -33713 22193 8126 -52228 -33206 16441 34025 10075 5172 61266 7639
10054 7639 -58876 -64709 -41637 13811 27122 31204 60035 16841 33132 18000 -31222 -37893
10042 -37893 -47991 -106333 -104012 -57670 -16761 38548 3476 -27647 -26874 -46392 -27329 20948
10030 20948 15263 -34184 -25284 -43874 -17503 54152 78480 14139 -9259 -30551 -22163 51804
10018 51804 75237 43493 39829 59771 62455 16414 -43129 -17153 29089 45172 56678 51383
10006 51383 51336 43957 12430 -31147 -42013 -5983 24458 40677 70499 110239 104297 22160 -32498
9993 -32498 -19544 -4330 44664 46473 37014 10346 45495 20308 7153 11823 -11460 16331
9981 16331 18644 -24782 -60062 -13362 -11757 -60390 -94551 -103776 -91378 -35173 -16032 -9910 -19304
9968 -19304 -65746 -86124 -59239 -9571 48965 108111 86776 78905 82451 49533 36807 89971
9956 89971 156313 166192 181045 150299 153694 184817 165318 202787 244694 242151 221738 157422
9944 157422 140622 159887 201307 243857 246989 205831 184189 168059 217405 181049 80525 25034
9932 25034 44522 -5636 -55738 -44217 -5641 58888 64982 -320 -33759 9986 5238 18377
9920 18377 24841 62726 86892 29750 33330 146705 146793 131540 140852 156610 184996 201710 141674
9907 141674 174720 252432 290106 326452 295145 250135 217737 164262 168440 166457 211299 158244
9895 158244 153478 201220 229451 176608 85225 49628 74141 62008 -3524 -18976 -50148 -51509
9883 -51509 -59707 -69105 -68881 -48628 -58390 -29196 16507 88035 80038 32667 40115 41202 71728
9870 71728 62720 130141 223646 241252 255824 254719 216039 80339 51538 95350 132564 94306
9858 94306 72706 171393 158953 180667 171907 196954 234399 208647 125582 117559 135235 185199
9846 185199 144676 99100 115923 74512 57755 120664 95682 52921 25672 8876 19992 18360
9834 18360 20642 73917 63251 84047 68152 39616 48195 130290 113035 37935 15491 45536
9822 45536 37244 451 -50074 -21973 5930 -3248 -44502 -69320 -103903 -74459 -45768 -8347
9810 -8347 47630 71928 53716 55628 49835 50193 45477 -49875 -125868 -88987 -62333 -18569 -34766
9797 -34766 -41564 -38103 -23161 11553 -52611 -117985 -114147 -102881 -83589 -56490 -79226 -91902
9785 -91902 -58909 17873 37037 -35870 -17616 31606 86181 77301 47329 22914 40653 5584
9773 5584 -45661 -109383 -130470 -137815 -147200 -121106 -82792 -5746 108808 130433 341 -69106
9761 -69106 -85616 -76145 -42325 -15766 60349 51260 27603 13218 -35745 -63082 -17268 -6317
9749 -6317 -213 -35231 -60704 -53096 7268 -34566 -63155 -53542 -37384 -5142 21135 60723 -3023
9736 -3023 -11155 26342 -59103 -151393 -171689 -85071 -31126 3986 8807 -11137 4426 57756
9724 57756 109713 84155 56136 11572 -6284 -43025 -32870 -39330 -20288 12754 27206 81358
9712 81358 94210 44547 41860 46486 19707 552 26097 42437 -23954 -72346 -105886 -91800
9700 -91800 -51857 -92452 -126427 -84549 -45439 -80614 -90023 -62829 -102719 -16579 -33897 -66162
9688 -66162 -73444 -18061 -13059 -21362 -68634 -66778 -32115 5815 2504 -20759 -65689 -57619 -17386
9675 -17386 49819 88966 79618 32635 43393 30105 -14927 -11940 -7730 -76416 -100613 -86128
9663 -86128 -109331 -104316 -65121 -103118 -86805 -73451 -39098 -70829 -74123 934 49169 17405
9651 17405 17639 65573 82631 81567 110259 108868 81695 47891 -36196 -62443 -53146 -70180 -12703
9638 -12703 -4174 -11248 -84516 -81739 -3825 5147 -5716 -55019 -13033 -67227 -76492 -35617 -23059
9625 -23059 21441 -24847 9631 70788 19481 -34835 -31362 -37900 -59976 -26612 -41165 -103331
9613 -103331 -64297 -11974 -7980 -77273 -104428 -79708 -75197 -28642 28145 47648 55842 38431
9601 38431 30577 -4001 21419 -8712 -73751 -74048 -67240 -82790 -106860 -100770 -88875 -75995 -72972
9588 -72972 -17039 67973 37240 -929 20643 17730 -6299 -13726 -76281 -78170 -86529 -77439 -61166
9575 -61166 -47314 -45476 -17033 11449 8819 -65117 -84120 -50950 -53208 -8805 37156 80247
9563 80247 36555 -5700 15623 89080 117237 109530 123349 154551 104214 12621 -40767 -95989
9551 -95989 -95634 -36845 -56059 -98339 -139441 -138749 -103700 -71250 -79269 -973 35706 19606 -22754
9538 -22754 -88971 -74169 -23118 -45015 -51517 -44082 -5209 69599 58462 -20778 -11525 -1236
9526 -1236 66023 65703 24708 -22286 -57792 -54192 -19547 -10675 -33630 -87857 -94082 -97108 -47612
9513 -47612 -53426 -74141 -83175 -95722 -47528 10605 -12312 -65035 -19604 -3594 -48705 -24911
9501 -24911 -5158 -1047 655 44662 40997 -1537 -33568 -56498 -42353 -39923 -19348 -24574 -11139
9488 -11139 28431 -2972 -62743 -77453 -115947 -134622 -131507 -121496 -105081 -85384 -66731 -47460
9476 -47460 -46535 -34850 -10291 43434 57686 42626 28277 39580 48021 22729 -900 -12503
$$ [...]
##END NTUPLES=NMR SPECTRUM
##END=
