##TITLE=Analysis number 320489
Compound Code gk 01024
Project Code adrs
Chemist Name prosynth
##JCAMPDX= 6.0         $$ Bruker NMR JCAMP-DX V2.0
##DATA TYPE= NMR SPECTRUM
##DATA CLASS= NTUPLES
##ORIGIN= Bruker BioSpin GmbH
##OWNER= nmr
$$ XWIN-NMR		Version 3.5
$$ Tue Jun 27 12:24:08 2006 GMT Daylight Time (UT+1h)  MAYBRIDGE\nmr@NMR_250MHZ
##.OBSERVE FREQUENCY= 250.131544655141
##.OBSERVE NUCLEUS= ^1H
##.ACQUISITION MODE= SIMULTANEOUS (DQD)
##.ACQUISITION SCHEME= undefined
##.AVERAGES= 16
##.DIGITISER RES= 18
##SPECTROMETER/DATA SYSTEM= dpx250
##.PULSE SEQUENCE= zg30
##.SOLVENT NAME= CDCl3
##.SHIFT REFERENCE= (INTERNAL, CDCl3, 0, 16.522)
##AUDIT TRAIL= $$ (NUMBER, WHEN, WHO, WHERE, WHAT)
$$ ##TITLE= Audit trail, XWIN-NMR		Version 3.5
$$ ##JCAMPDX= 5.01
$$ ##ORIGIN= Bruker BioSpin GmbH
$$ ##OWNER= nmr
$$ C:\u/data/dgb/nmr/ADRS/1590/pdata/1/auditp.txt
$$ ##AUDIT TRAIL=  $$ (NUMBER, WHEN, WHO, WHERE, WHAT)
(   1,<2006-06-27 12:23:47.28 +100>,<MAYBRIDGE\nmr>,<NMR_250MHZ>,
      <created by zg, POWCHK disabled, PULCHK disabled
       configuration hash MD5:
       E2 DF 36 D8 04 B2 41 60 5A D7 A3 38 5A 4B D0 FE
       data hash MD5: 64K
       66 4D A5 E9 58 7D 92 42 B1 8F 36 F5 86 06 87 FF>)
(   2,<2006-06-27 12:23:59.78 +100>,<MAYBRIDGE\nmr>,<NMR_250MHZ>,
      <Start of raw data processing
       ef LB = 0.3 FT_mod = 6 PKNL = 1 SI = 32K 
       data hash MD5: 32K
       34 80 15 00 09 9C 14 33 8A AA 37 3E 79 C9 A6 63>)
(   3,<2006-06-27 12:24:01.28 +100>,<MAYBRIDGE\nmr>,<NMR_250MHZ>,
      <apk 
       data hash MD5: 32K
       29 95 ED 84 7C F5 18 F8 BC F7 7C 8F 8A 10 2C B6>)
(   4,<2006-06-27 12:24:02.04 +100>,<MAYBRIDGE\nmr>,<NMR_250MHZ>,
      <abs ABSG = 5 
       data hash MD5: 32K
       13 B4 FD DE BE 28 28 52 84 F4 D3 33 67 94 9B 13>)
$$ ##END=
$$ 
$$ hash MD5
$$ 84 32 AD A7 F6 03 CE F5 24 C7 8D 89 76 F6 0A 0E
##$RELAX= 
##$RELAX= 
##$RELAX= 
##$RELAX= 
##$RELAX= 
##$RELAX= 
##$RELAX= 
$$ Bruker specific parameters
$$ --------------------------
##$DU= <C:\u>
##$EXPNO= 1590
##$NAME= <ADRS>
##$PROCNO= 1
##$TYPE= <nmr>
##$USER= <dgb>
##$AMP= (0..31)
100 100 100 100 100 100 100 100 100 100 100 100 100 100 100 100 100 100 
100 100 100 100 100 100 100 100 100 100 100 100 100 100 
##$AQSEQ= 0
##$AQ_mod= 3
##$AUNM= <au_zg>
##$AUTOPOS= <27 >
##$BF1= 250.13
##$BF2= 250.13
##$BF3= 250.13
##$BF4= 250.13
##$BF5= 500.13
##$BF6= 500.13
##$BF7= 500.13
##$BF8= 500.13
##$BYTORDA= 1
##$CFDGTYP= 0
##$CFRGTYP= 5
##$CHEMSTR= <none>
##$CNST= (0..31)
1 1 145 1 1 1 1 1 1 1 1 1 1 1 1 1 1 1 1 1 1 1 1 1 1 1 1 1 1 1 1 1 
##$CPDPRG= <>
##$CPDPRG1= <>
##$CPDPRG2= <>
##$CPDPRG3= <>
##$CPDPRG4= <mlev>
##$CPDPRG5= <mlev>
##$CPDPRG6= <mlev>
##$CPDPRG7= <mlev>
##$CPDPRG8= <mlev>
##$CPDPRGB= <>
##$CPDPRGT= <>
##$D= (0..31)
0 1 0 0 0 0 0 0 0 0.06 0 0 0 0 0 0 0.0002 0 0 0 0 0 0 0 0 0 0 0 0 0 0 
0 
##$DATE= 1151407426
##$DBL= (0..7)
120 120 120 120 120 120 120 120 
##$DBP= (0..7)
150 150 150 150 150 150 150 150 
##$DBP07= 0
##$DBPNAM0= <>
##$DBPNAM1= <>
##$DBPNAM2= <>
$$ [...]
##$SUBNAM7= <"">
##$SUBNAM8= <"">
##$SUBNAM9= <"">
##$SW= 20.6930455092707
##$SWIBOX= (0..15)
0 0 3 0 0 0 0 0 0 0 0 0 0 0 0 0 
##$SW_h= 5175.983436853
##$TD= 65536
##$TD0= 1
##$TE= 297.16
##$TE2= 300
##$TE3= 300
##$TEG= 300
##$TL= (0..7)
0 120 120 120 120 120 120 120 
##$TP= (0..7)
150 150 150 150 150 150 150 150 
##$TP07= 0
##$TPNAME0= <>
##$TPNAME1= <>
##$TPNAME2= <>
##$TPNAME3= <>
##$TPNAME4= <>
##$TPNAME5= <>
##$TPNAME6= <>
##$TPNAME7= <>
##$TPOAL= (0..7)
0.5 0.5 0.5 0.5 0.5 0.5 0.5 0.5 
##$TPOFFS= (0..7)
0 0 0 0 0 0 0 0 
##$TUNHIN= 0
##$TUNHOUT= 0
##$TUNXOUT= 0
##$USERA1= <user>
##$USERA2= <user>
##$USERA3= <user>
##$USERA4= <user>
##$USERA5= <user>
##$V9= 5
##$VALIST= <valist>
##$VCLIST= <CCCCCCCCCCCCCCC>
##$VD= 0
##$VDLIST= <DDDDDDDDDDDDDDD>
##$VPLIST= <PPPPPPPPPPPPPPP>
##$VTLIST= <TTTTTTTTTTTTTTT>
##$WBST= 1024
##$WBSW= 4
##$XGAIN= (0..3)
0 0 0 0 
##$XL= 0
##$YL= 0
##$YMAX_a= 316074
##$YMIN_a= -342504
##$ZGOPTNS= <>
##$ZL1= 120
##$ZL2= 120
##$ZL3= 120
##$ZL4= 120
##$ABSF1= 16.522
##$ABSF2= -4.171173
##$ABSG= 5
##$ABSL= 3
##$ALPHA= 0
##$AQORDER= 0
##$ASSFAC= 0
##$ASSFACI= 0
##$ASSFACX= 0
##$ASSWID= 0
##$AUNMP= <proc_1d>
##$AZFE= 0.1
##$AZFW= 0.1
##$BCFW= 0
##$BC_mod= 0
##$BYTORDP= 0
##$COROFFS= 0
##$CY= 12.5
##$DATMOD= 1
##$DC= 0
##$DFILT= <>
##$DTYPP= 0
##$F1P= 14.0000005364418
##$F2P= -0.99999901652339
##$FCOR= 0.5
##$FTSIZE= 32768
##$FT_mod= 6
##$GAMMA= 0
##$GB= 0
##$INTBC= 1
##$INTSCL= 1
##$ISEN= 128
##$LB= 0.3
##$LEV0= 0
##$LPBIN= 0
##$MAXI= 10000
##$MC2= 0
##$MEAN= 0
##$ME_mod= 0
##$MI= 0
##$NCOEF= 0
##$NC_proc= -3
##$NLEV= 6
##$NOISF1= 0
##$NOISF2= 0
##$NSP= 0
##$NTH_PI= 0
##$NZP= 0
##$OFFSET= 16.522
##$PC= 1
##$PHC0= 175.4513
##$PHC1= 6.308413
##$PH_mod= 1
##$PKNL= yes
##$PPARMOD= 0
##$PSCAL= 4
##$PSIGN= 0
##$REVERSE= no
##$SF= 250.13
##$SI= 32768
##$SIGF1= 0
##$SIGF2= 0
##$SINO= 400
##$SIOLD= 32768
##$SREGLST= <1H.CDCl3>
##$SSB= 0
##$STSI= 32768
##$STSR= 0
##$SW_p= 5175.98343685301
##$SYMM= 0
##$S_DEV= 0
##$TDeff= 65536
##$TDoff= 0
##$TI= <Analysis number 999999
Compound Code 99
Book Reference 9
Project Code 9>
##$TILT= no
##$TM1= 0
##$TM2= 0
##$TOPLEV= 0
##$USERP1= <user>
##$USERP2= <user>
##$USERP3= <user>
##$USERP4= <user>
##$USERP5= <user>
##$WDW= 1
##$XDIM= 32768
##$YMAX_p= 501663968
##$YMIN_p= -233127
$$ End of Bruker specific parameters
$$ ---------------------------------
##NTUPLES= NMR SPECTRUM
##VAR_NAME=  FREQUENCY,     SPECTRUM/REAL,   SPECTRUM/IMAG
##SYMBOL=    X,             R,               I
##VAR_TYPE=  INDEPENDENT,   DEPENDENT,       DEPENDENT
##VAR_FORM=  AFFN,          ASDF,            ASDF
##VAR_DIM=   32768,         32768,           32768
##UNITS=     HZ,            ARBITRARY UNITS, ARBITRARY UNITS
##FACTOR=    0.157963299565203, 1,           1
##FIRST=     4132.6476996994, 0,             0
##LAST=      -1043.33573715361, 0,           0
##MIN=       -1043.33573715361, -233127,     0
##MAX=       4132.6476996994, 501663968,     0
$$ Real data points
##PAGE= N=1
##DATA TABLE= (X++(R..R)), XYDATA
$$ [...]
18659B5944j5101L5252K3524k5176l1393j9375l7646J9793J5633P68N816J4443
18647A2482o203O152m5568K250j1480M7443j9791n8986m602K6735P1482M8500
18635F8414m7520n1785K2491J1867j7128l3602l694j3504N5631J616k0939k6234
18623e4387L8594L8752J4223L673j2762M9781J0285o1456k4553P694l15l0503
18611b0974k4474k8849m4061l2034L3931J33899M1887k7109J6582l177n5864m5576
18599e5819R491k1122L5648j245j7134L5127K5794j6584r507j5740k7696j5799
18587g4586N602J7311J8590K6062j6979k1888L2275j1144n497l1266L4491K3935
18575c094o730k0159L0521M1792L0480K1284m4788p4304J6767L5127O8400J0535
$$ plain form
18659 25944 10843 46095 69619 44443 13050 -6325 -43971 -24178 -8545 -7777 -1961 12482
18647 12482 6279 12431 -33137 -30887 -42367 5076 -14715 -73701 -78303 -51568 19914 68414
18635 68414 20894 -30891 -8400 3467 -13661 -47263 -50957 -64461 -8830 -7214 -28153 -54387
18623 -54387 -15793 22959 37182 40855 28093 77874 88159 26703 2150 9844 9529 -20974
18611 -20974 -45448 -74297 -118358 -150392 -116461 17438 59325 32216 48798 45621 -10243 -55819
18599 -55819 -46328 -67450 -31802 -33047 -50181 -15054 10740 -5844 -15351 -31091 -58787 -74586
18587 -74586 -68984 -51673 -33083 -7021 -24000 -45888 -13613 -24757 -30254 -61520 -27029 -3094
18575 -3094 -9824 -29983 538 42330 72810 94094 49306 -24998 -8231 26896 95296 105831
18563A05831J1244k5667j0403k7340n1527m941m2369R721M5922M8452L2997R429
18551A01349n2275J6078L9096L0532j0234k9653p173n6358j643k738m1314q349
18539b2682K754K8486K31N5373p692j7410k3985k432J6775P4634L8837k2437n9950
18526F0502k2585j9641n986N5509M0922K035m2927l8219L2050K918j1840j5403
18514C7335m0575j9419K6717n6541n9133l522Q6681L9713o669k3483k2963j3900
18502e5759J1793M498P2229K6126n7315m5100Q285k346R7375J05953k9295m8520
18490H7924m9438l8688k3940m802M7654O5414o723o5303k6083J8660k4358J1305
18478h378M7022k3853l9269l1530L2725O0193K1007j8977m0480O5945M9583j8715
$$ plain form
18563 105831 117075 91408 81005 53665 2138 -2803 -45172 -35451 10471 58923 91920 101349
18551 101349 49074 65152 104248 134780 124546 94893 87720 31362 29719 26981 -14333 -22682
18539 -22682 -19928 8558 8789 64162 56470 39060 15075 12643 29418 104052 142889 120452 60502
18526 60502 37917 18276 12290 67799 108721 110756 67829 29610 61660 64578 52738 37335
18514 37335 -3240 -22659 4058 -52483 -111616 -115138 -28457 11256 4587 -18896 -41859 -55759
18502 -55759 -43966 -39468 32761 58887 1572 -43528 -35243 -37589 59786 165739 136444 87924
18490 87924 38486 -202 -24142 -28944 18710 84124 77401 12098 -13985 4675 -19683 -8378
18478 -8378 38644 14791 -24478 -56008 -23283 36910 57917 38940 -1540 64405 113988 95273
18466I5273L9039n4572j36826m7180O6143k9480J9650M0945L6929K2090K9612
18455H1623p1108o0023m3821l7192j045K8438k2181K2606m482J8242M3307M0909
18443d727l6276J695J0730J442n578k7247j5931M7808K4493L0813K6232r48o197
18430D6309k9991Q843K8180k9578k3111k1148J9787Q2162j2515n8545J7148J0270
18418C7811n5813o4410K7352J7052M5726L0797j3756j9831r680l1359l8990k9367
18406a04468L7030Q5003j8267m4427k4128P0439P1163L6927l8259o4523n0784
18395d4294L4872K5962n877n6352j9957N867r076j5597j5744j380K8057ml7953
18382a11476J712J8034O2584O692J895j5246L8897j9413j3748O9768l9756J837
$$ plain form
18466 95273 134312 79740 -57086 -104266 -38123 -67603 -47953 -7008 29921 52011 81623
18455 81623 10515 -49508 -93329 -130521 -131566 -103128 -125309 -102703 -107185 -88943 -45636 -4727
18443 -4727 -41003 -39308 -28578 -27136 -32714 -59961 -75892 -28084 -3591 27222 53454 52506 46309
18430 46309 16318 25161 53341 23763 652 -20496 -709 81453 68938 10393 27541 37811
18418 37811 -18002 -82412 -55060 -38008 7718 38515 24759 4928 -4752 -36111 -75101 -104468
18406 -104468 -67438 17565 -702 -45129 -69257 1182 72345 109272 71013 6490 -44294
18395 -44294 -9422 16540 10663 -45689 -65646 -59779 -68855 -84452 -100196 -101576 -73519 -73523 -111476
18382 -111476 -109764 -91730 -29146 -22454 -20559 -35805 3092 -16321 -30069 39699 -57 1780
18370A780L0023j837N546N750q098p112m010P405K2607J9706L3728o2246l9869
18357C373l9665N719K1070M048K4884n0801J1399M8893l5742k9634O5791r401
18345A9934n2037m1378P836M9733J2002j6131m1217J1414J7405m1414l2800N2435
18333e4218K5323L136k4099l1634N890L5297K3571L5710j7423k9139m9470n4677
18321a31733J7237O2041J4272N1017K2380j4645j1012P451l6935k7771M1482N4855
18309D8639j1538J4190K0100j3088Q016L7604J7598j8565k9047p436J0016J662
18297G8151N333j7525p709K6971m9044l4627M91P0532K2043m3226k9285Q783N123
18284C6011L3431j0260n0742p400l7519O0372N7390q654m7805o6034k124L5630
$$ plain form
18370 1780 31803 29966 35512 41262 33164 26052 22042 29447 52054 71760 105488 43242 3373
18357 3373 -36292 -30573 -9503 -5455 19429 -31372 -19973 28920 -6822 -36456 29335 19934
18345 19934 -32103 -73481 -65645 -15912 -3910 -20041 -61258 -49844 -32439 -73853 -106653 -54218
18333 -54218 -28895 -25759 -49858 -81492 -75602 -40305 -16734 18976 1553 -27586 -77056 -131733
18321 -131733 -114496 -52455 -38183 12834 35214 20569 9557 17008 -19927 -47698 -6216 48639
18309 48639 37101 51291 71391 58303 66319 103923 121521 102956 73909 66473 76489 78151
18297 78151 83484 65959 58250 85221 36177 1550 2041 72573 94616 51390 22105 30888 36011
18284 36011 69442 59182 8440 1040 -36479 23893 81283 72629 24824 -41210 -43334 -7704
18272g704j9289K3124O974l0066n690L5860J17839k1055q7561j5704O515L2677
18260C5920K1156j3492k7939J981j4234J4754q573j8957l6718o178m7626r378
18248a09284N4242Q3124P2116P813r6309n5591K2761K0351M5420P8780p304n1922
18236F4197J8956N9548m6832k0145l1783r0557l375J0431K3068M7479k5910q5719
18224h0642N383M9071J06578K0105M494p5054m774p924o844j186l1033l7567J4075
18211d5318M6752J7381N2206J4162m6508m2583m7944P5508J09490k1635j4729
18200I6782K0834Q66m3266p2912K1463K3592K2879L038K06J3116n8065j467M2360
18187F9426j9038J2291J176J1967L4395J3362Q082K8821j6104l3070l6094J6362
$$ plain form
18272 -7704 -26993 -3869 3105 -26961 -32651 3209 121048 99993 12432 -3272 3243 35920
18260 35920 57076 43584 15645 17626 3392 18146 9573 -9384 -46102 -52280 -99906 -109284
18248 -109284 -55042 28082 100198 108011 11702 -43889 -21128 -777 44643 123423 116119 64197
18236 64197 83153 142701 95869 75724 43941 -46616 -49991 -39560 -16492 30987 5077 -80642
18224 -80642 -75259 -26188 80390 100495 104989 29935 25161 17237 10393 9207 -21826 -59393 -45318
18211 -45318 1434 18815 71021 85183 38675 -3908 -51852 23656 133146 111511 96782
18200 96782 117616 118482 75216 2304 23767 47359 70238 73276 73482 86598 28533 27066 69426
18187 69426 50388 62679 63855 75822 110217 123579 131661 160482 144378 111308 75214 91576
18175I1576k1538j2106Q563j0557M7307L5051L017J5527K6197r801p4921L700
18163A02015n2334n1850K9439J0726L2006Q2976O5406l3108R870K0632N2930K563
18151B71271q4488n9660k6757o4121O873P1552N5940J4477m2359j0183M6623K6304
18139B05472K5009M5903j182m243Q5213K9435J256N6564J04165J12686O2607L496
18127G26381J18831J61212K07869K49406K43336L00250K35790K92360M00037N32568
18117C468040O67718J035053J663247K707336M888635R525329J6645990J8554850
18109E9156198J2003773K906307j8048320j9568899j0364045n891248l896380
18102A6297386k658747j887796j438326j114766r33492p82811p19559o01201m57179
$$ plain form
18175 91576 70038 57932 66495 55938 103245 138296 141313 156840 183037 173236 98315 102015
18163 102015 49681 -2169 27270 37996 70002 152978 218384 185276 195146 215778 268708 271271
18151 271271 186783 127123 100366 36245 43118 114670 170610 185087 142728 132545 179168 205472
18139 205472 230481 276384 275202 270959 356172 385607 386863 443427 547592 660278 722885 726381
18127 726381 845212 1006424 1214293 1463699 1707035 2007285 2243075 2535435 2935472 3468040
18117 3468040 4135758 5170811 6834058 9541394 14430029 23955358 40601348 59156198
18109 59156198 71159971 74066278 56017958 36449059 26085014 20193766 16297386
18102 16297386 13638639 11750843 10312517 9197751 8264259 7481448 6761889 6160688 5703509
18093E703509l44863k96462k98433k28823k10035k26438k66951k88030k04765
18084C338709j26248n1220j06504j90206j22178j17555j45522q6301j37394r4712
18074B160869n9447q3623m9327n7033p1320r5526j66991q4031J6876L6801J2179
18063A559427j1643n9390q8040n8682j16000o327R796l0674n2720k5072j5929
18052A104746m6695m2472j4770J0387j7630k6481o4297n4031o6739r337K5707
18041G98388m4117m5338J2040J2174n3137n4137M1948k7376n9512M6643O874m9654
18029E84796k9419L0637k2214R884k2515m1885m3015k9435J466m4046p1287k0404
18017C02563k5719K8878n7766K8028J5322l437R113J0110p261k7179M0436J2427
$$ plain form
18093 5703509 5358646 5062184 4763751 4534928 4324893 4098455 3831504 3543474 3338709
18084 3338709 3212461 3161241 3054737 2864531 2742353 2624798 2479276 2392975 2255581 2160869
18074 2160869 2101422 2017799 1968472 1911439 1840119 1744593 1577602 1493571 1510447 1547248 1559427
18063 1559427 1547784 1488394 1400354 1341672 1225672 1219345 1229141 1198467 1145747 1120675 1104746
18052 1104746 1058051 1015579 1000809 1011196 993566 967085 902788 848757 782018 772681 798388
18041 798388 754271 708933 720973 733147 680010 625873 667821 640445 580933 627576 634450 584796
18029 584796 555377 586014 563800 573684 551169 509284 466269 436834 438300 394254 322967 302563
18017 302563 276844 305722 247956 275984 291306 287869 296982 307092 299831 272652 313088 325515
18005C25515L0180k603r0906m4899K3190J0182o1923k8954m0410o241P7754M6798
17993B37683L057P107m0291J5827l0589m17O0010m5232k3527k2462n3846m3916
17981F3404m2086O9946K1216m9063J4880M767L9920M3165N5879k5089o0150j0202
17969A26587l2005J6578q76l5389p460q682J7418n3718m3394k7845L657L8978
17957f151O0902J0627j8771n3525j9948R0457M0126o4403n839j6297j5615J7674
17945A9237L7977J4601J6749l9629m789j9093l0553q089j8961o068k0088M9683
17933i023L2751L0561l0759N785N5658M2646q14L1390m1421l6849j3466m8105
17921A8354p915J1866K68n3153o2359l4669M559K7959K6521k032N6780J0486K7957
$$ plain form
18005 325515 355695 353092 262186 217287 240477 250659 188736 159782 119372 113131 190885 237683
17993 237683 240740 247847 207556 223383 192794 192377 252387 207155 183628 161166 107320 63404
17981 63404 21318 91264 112480 63417 78297 83064 122984 166149 222028 196939 136789 126587
17969 126587 94582 111160 110284 74895 67435 58753 76171 22453 -20941 -48786 -45129 -6151
17957 -6151 54751 65378 46607 -6918 -26866 63591 103717 39314 33475 17178 1563 19237
17945 19237 57214 71815 88564 48935 44146 25053 -5500 -13589 -32550 -38618 -58706 -9023
17933 -9023 23728 54289 23530 29315 84973 127619 126805 158195 116774 79925 66459 18354
17921 18354 10439 22305 22573 -30580 -92939 -127608 -123049 -95090 -68569 -70601 -13821 -3335 24622
17908B4622L0019l1446j9372K9082j7836o006k9431l6099L1290L4775K2090l9323
17896g635m7509p7423J9705J4405j1462J1054L8396M8366r476J7728O6146m2677
17884A9618m4735p746r605K510l3962K6457M1454O7996M0117m8766K9282m787
17872G7833k464o4983p2849M0560P2070L7638k3421n4899l2083N3078M4600p3636
17860A444k6368L0986L9009R252j8374m973o194K2442O776l7983k8915K6825K8640
17847D2567N1634n5854r9561l2431Q6000P3872P7979J2193j3899k5696l2152l0043
17835E4609P839J0395J3494l7961j939J4247J9032k9293k4316l9905o126k9606
17823d9530k7090l388N654M9022O8282J2996m1014L6637J5414L9079l0336K2168
$$ plain form
17908 24622 54641 23195 3823 32905 15069 9063 -20368 -56467 -25177 9598 31688 -7635
17896 -7635 -55144 -132567 -112862 -98457 -109919 -98865 -60469 -12103 -21579 -3851 62295 19618
17884 19618 -25117 -32863 -42468 -39958 -73920 -47463 -6009 61987 102104 53338 82620 77833
17872 77833 75369 10386 -62463 -21903 50167 87805 64384 9485 -22598 30480 75080 1444
17860 1444 -24924 6062 45071 54323 35949 30976 24782 47224 54000 16017 -12898 13927 42567
17847 42567 94201 38347 -61214 -93645 -7645 66227 144206 156399 142500 116804 84652 54609
17835 54609 62448 72843 86337 48376 46437 60684 79716 50423 26107 -13798 -19924 -49530
17823 -49530 -76620 -80008 -74354 -25332 42950 55946 14932 51569 66983 106062 75726 97894
17811I7894o6058j6492M0033k6968j4990J0292n5669k5380J9149J9759j5440M6133
17799A2263r581q973k4757R837k5602p97L3329N9939j8661k1402K4874m12M567
17786C4624Q940k8976P200l524m769l116o79j11k8164L8801M2950L5004l1510
17773F6670j27284l6148P9668L3546K064J5671m7324l324K2259l8060j8636M3788
17761g110M38K6953n2292l7845O7075j0655j3699k1528M8891N1938l6654o9527
17749e4015o0980K527L9220n252k3878j6727L4730N2406Q3430p4990n2244J3733
17737f2040L4036j1355n0975P7287J150J9985l8492r55j3214R216j1089j9428
17725f5874K6001r884J4176j512J0614M5043j471L7725j4881m3310k4916j9938
$$ plain form
17811 97894 31836 15344 55377 28409 13419 23711 -31958 -57338 -38189 -18430 -33870 12263
17799 12263 2682 -6291 -31048 -21211 -46813 -47610 -14281 45658 26997 5595 30469 30057 34624
17786 34624 43564 14588 21788 18264 13495 10379 9700 9589 -18575 20226 63176 98180 66670
17773 66670 -60614 -96762 -17094 16452 18516 34187 -13137 -16461 5798 -32262 -50898 -7110
17761 -7110 -6672 20281 -32011 -69856 -2781 -13436 -27135 -48663 228 52166 15512 -54015
17749 -54015 -114995 -112468 -73248 -78500 -102378 -119105 -84375 -31969 51461 -23529 -75773 -62040
17737 -62040 -28004 -39359 -90334 -13047 -11897 8088 -30404 -31359 -44573 -35357 -46446 -65874
17725 -65874 -39873 -49757 -35581 -37093 -26479 18564 17093 54818 39937 -3373 -28289 -48227
17713d8227N0036L88k3356k9114n066j8670n4230J018K6955M3990k4955J5055
17701f6176m555k1712L5353J3342K6309J8623K935K9753l2257J3534K9062Q611
17689E2822K5349p1798q6958J8167M0797K2818j9116K1474M6717J5773J9027M3968
17677A29040O316j1989l7951l6637m9424j8779K6097K5706p7442m4336Q6703Q7292
17665H4596m2854O677m2003L3555l1072K1198N712O469O3618N2193N6924m8105
17653A66908o8009m2629p635j7610o6750K8771K3942N2640J0875p4210l1620k5358
17641e0685n6481J8392M0891M6698O358n0090l2693j676J4440j6594M5882R709
17629b5849J186j1453J1977K528n0978q450j2640K5547j0823j8424K7551J4713
$$ plain form
17713 -48227 1809 2197 -21159 -50273 -55339 -74009 -128239 -127221 -100266 -56276 -81231 -66176
17701 -66176 -70731 -92443 -57090 -43748 -17439 1184 4119 33872 1615 15149 44211 52822
17689 52822 78171 6373 -80585 -62418 -21621 1197 -17919 3555 50272 66045 85072 129040
17677 129040 135356 123367 85416 48779 -645 -19424 6673 32379 -45063 -89399 -2696 84596
17665 84596 41742 48419 6416 39971 8899 30097 35809 42278 105896 158089 215013 166908
17653 166908 98899 56270 48635 31025 -35725 -6954 16988 69628 80503 6293 -25327 -50685
17641 -50685 -107166 -88774 -47883 -1185 5173 -44917 -77610 -79286 -64846 -81440 -35558 -25849
17629 -25849 -24663 -36116 -24139 -21611 -72589 -81039 -93679 -68132 -78955 -97379 -69828 -55115
17617e5115K8667L3409l5767K1545L4300J4520j11082m8086j4257k4673R8437
17606e8102P2773n91j7861l112K4970K7879m708m0549J3771L9010j7451q637O664
17593C4056J7952r336l6771o783K6104K9456J5737K1204K8246l6495m0158j6447
17581B6765j9062o991K4063L224o1085p1215J067J31575M9695l4755l5721q375
17569h15j8233L1532j4708j7413j8779k4680k0557J0938j3646L8084K4731K3897
17557C51j3106J1531K5693O346m7877n9807L1646J8054K9138J9862P8046J38j05765
17544e750m6540p4986n8001O599J3038J6995L2375N3226P863M9347k575j6092
17532b4501K1373R3981j1469J1098J2752m1728j17628l2342k1505m149l8057J9241
$$ plain form
17617 -55115 -26448 6961 -28806 -7261 27039 41559 -69523 -117609 -131866 -156539 -58102
17606 -58102 14671 14080 -3781 -6893 18077 45956 41248 699 14470 53480 36029 27392 34056
17593 34056 52008 42672 5901 -882 25222 54678 70415 91619 119865 83370 43212 26765
17581 26765 7703 712 24775 27999 -33086 -104301 -103234 28341 78036 43281 7560 -815
17569 -815 -19048 12484 -2224 -19637 -38416 -63096 -83653 -72715 -86361 -48277 -23546 351
17557 351 -12755 -1224 24469 30815 -17062 -76869 -45223 -27169 1969 21831 99877 100015 -5750
17544 -5750 -52290 -127276 -185277 -178678 -165640 -148645 -116270 -63044 -55181 -5834 -8409 -24501
17532 -24501 -3128 90853 79384 90482 103234 61506 -56122 -88464 -109969 -114118 -152175 -132934
17520a32934J5118M8449j4231J8889L7161q489L2968j8362n1008N9591L7306o8606
17508d4148Q159Q0864J8996m8915n0522q814M7373J877j9950K2528m2933k7932
17496f3417o238N3898K5140L9783l2857n0638L1381k8629K7687O672o921P065
17484B926j865k056j58K709l5615M7043k2177l0303K2370L8028j3335n1669o8421
17471a12523J4317j2789j1014j3866O2132L2870M8786N686m5990p9177J8089r422
17459a02901M6622M2026k8895j8246J1164J9563J244k3857J398K9463K5970N7578
17447F1129M3327P9161P1532R6703P8669J3889j09688j51516k5950n0794m1178
17436F5284J890L1161n1228k0235L2866m2146J9175M8414K651m8261j3298K7606
$$ plain form
17520 -132934 -117816 -69367 -83598 -64709 -27548 -36037 -3069 -21431 -72439 -12848 24458 -44148
17508 -44148 -35989 44875 63871 14956 -35566 -44380 2993 4870 -15080 7448 -35485 -63417
17496 -63417 -69655 -15757 9383 49166 16309 -34329 -2948 -31577 -3890 2782 -4139 2926
17484 2926 1061 -995 -1153 1556 -34059 12984 -9193 -39496 -17126 20902 7567 -44102 -112523
17471 -112523 -98206 -110995 -122009 -135875 -73743 -40873 7913 13599 -32391 -111568 -93479 -102901
17459 -102901 -56279 -14253 -43148 -61394 -50230 -30667 -29423 -53280 -51882 -22419 3551 61129
17447 61129 104456 183617 255149 351852 430521 444410 334722 183206 157256 106462 65284
17436 65284 67174 98335 47107 26872 59738 17592 36767 85181 87832 39571 26273 53879
17424E3879n0300o2671K0708L9477K2953m292k2291n619N392M193n5531l692n922
17411f3716j4507q46N5688M9404K7830j8928k3500k7272J2718J0545o1805J257
17399e3132K7626J08635r539o0580o0231J8953R457J0317n5165Q8897M4301p9421
17387i882n312P9335M7003k3863j7160m7695o2449o7942L7528l2699k893L5656
17375g0373M1905k5611j0247q764j2384P0259N2837Q164k8887r453L1141M289
17363D2876l5718m16k1215m191M461Q259K5114j2555l7239j4969k3255k7951N2779
17350d4020K7595o507J7731l2916L1480P6050l2752m5739N238K9101J2098k5513
17338A1846K3187R062J9570Q843n6887j406L7870N2672k432r1925m1327k8452
$$ plain form
17424 53879 3579 -59092 -38384 1093 24046 19754 -2537 -8156 -2764 1429 -54102 -57794 -63716
17411 -63716 -78223 -79069 -23381 26023 53853 34925 11425 -15847 -3129 7416 -54389 -53132
17399 -53132 -25506 83129 73590 13010 -47221 -28268 -18811 -8494 -63659 25238 69539 -9882
17387 -9882 -15194 64141 111144 87281 70121 22426 -40023 -107965 -70437 -103136 -106029 -70373
17375 -70373 -28468 -54079 -64326 -73090 -85474 -15215 37622 45786 16899 7446 38587 42876
17363 42876 7158 6742 -14473 -18664 -14203 -5944 19170 6615 -30624 -45593 -68848 -96799 -44020
17350 -44020 -16425 -22932 -5201 -38117 -6637 69413 36661 -9078 -3840 25261 37359 11846
17338 11846 35033 44095 63665 72508 15621 14215 52085 104757 102325 10400 -30927 -59379
17326e9379l9518J5051M6270N4472M0672P124j5037k1685p6799O3295K0930l1875
17314C521J6077M1743q3827r728N6983Q695K9396n416L219o7573k3097J9343j1139
17301b1803N0465n79n7015K1188K3765k8771J3072K6135J3206k1L0640m0717o4437
17288c4872n9495l6152m8620l9873J00669r562N9924O3385M9735k488k9505J6526
17276B9672R400j773k5873j3004J6484J3913l5237O410R155K239Q845p15k6926
17263g410j2446p555j8230L3285M1971K3857l0224k9492n557J4126k5000n0792
17251g3467K2736r981K2585Q3062Q1297j0998r9702l7808M653o64n759o892J1990
17238a8948j1960J5698J3348n0685l2075O326K9495j4009n3799n39N129O876m1955
$$ plain form
17326 -59379 -98897 -83846 -37576 16896 57568 64692 49655 27970 -48829 14466 35396 3521
17314 3521 19598 61341 -22486 -32214 24769 33464 62860 57444 60663 -6910 -30007 -10664 -21803
17301 -21803 28662 28083 -28932 -7744 16021 -12750 322 26457 39663 39642 70282 29565 -34872
17288 -34872 -94367 -130519 -179139 -219012 -118343 -127905 -67981 -4596 45139 42651 13146 29672
17276 29672 39072 37299 11426 -1578 14906 28819 -6418 -8 9147 11386 20231 19516 -7410
17263 -7410 -19856 -27411 -45641 -12356 29615 53472 23248 -6244 -11801 2325 -22675 -73467
17251 -73467 -50731 -60712 -38127 44935 126232 115234 15532 -22276 -17623 -18287 -24046 -30938 -18948
17238 -18948 -30908 -15210 -1862 -52547 -84622 -78296 -48801 -62810 -116609 -117148 -112019 -105143 -147098
17225a47098J393J1464K9060m6090M303M0342R092m800k1329M653O7131O8243
17213A6364k9711k483l5983m248L9001l823k9070L2023M6249k1458m4705M030
17201c3814k0517j5795M7378J4008k691K0597j1164j9843j7335J6688N7201N8362
17189I3075O349l5202m0600m2417m9498M1185N0657K261M822l9159k2865j3200
17177d4592k246J8419J5247l7965M2445J7980J6709l4132R16l3743m1088o1958
17165a44008O4357M0297J1949M3962J6747o1263L4788K428j6473j0971Q4849r13
17153F5749m036j6682j8711J1621q111o690m6857l3472j6656j5392J3594N1306
17141b4337O368J3446k2359l3778K4159P191J109k5117J9378R827N5597l883j6552
$$ plain form
17225 -147098 -145705 -134241 -105181 -151271 -146968 -106626 -97534 -102334 -123663 -119010 -51879 16364
17213 16364 -13347 -15830 -51813 -56061 -17060 -20883 -49953 -17930 28319 6861 -37844 -33814
17201 -33814 -54331 -70126 -22748 -8740 -11431 9166 -1998 -21841 -39176 -22488 34713 93075
17189 93075 99424 64222 23622 -18795 -68293 -27108 23549 25810 30632 -8527 -31392 -44592
17177 -44592 -46838 -28419 -13172 -51137 -8692 9288 25997 -8135 -7219 -40962 -82050 -144008
17165 -144008 -79651 -39354 -27405 16557 33304 -27959 6829 9257 -7216 -18187 66662 65749
17153 65749 61713 45031 26320 37941 29830 23140 -23717 -57189 -73845 -89237 -75643 -24337
17141 -24337 -17969 -4523 -26882 -60660 -36501 -29310 -28201 -53318 -33940 -24113 31484 27601 11049
17128A1049J0227l303K4289j5866L6028L0694j1288k4981j2700r9921j4143L2422
17116c7493j874M7399N1415q796r758n994k7355k7644R163L1103l1805n1304K9891
17103c3052N0523n2793J7268l6903p302j3065k486P136O2396J1493j4725l095
17091a4605j1790J6219J3154L5007J1116l7025k1064l6779k2408L4395K7548L0371
17079B4139M7597r345N6980j2936k2439m5874l2031M4196M410L4356j5810n5773
17067A7470L6572M2904m0885m8116K565m8638o3813M5404N3079m221K3432J2848
17055B8601O384l1155m4219o8458N6195L7902m96P6294J2252o510k2492k4364
17043A9934k2503r374J8889L5588K0728j3721M8730m4681n9616j2858P016L5557
$$ plain form
17128 11049 21276 17973 42262 26396 62424 93118 81830 56849 44149 -55772 -69915 -37493
17116 -37493 -39367 8032 59447 50651 40893 34899 7544 -20100 -10937 20166 -11639 -62943 -33052
17103 -33052 17471 -35322 -18054 -54957 -62259 -75324 -77810 -70674 -8278 3215 -11510 -14605
17091 -14605 -26395 -10176 2978 37985 49101 12076 -8988 -45767 -68175 -33780 -6232 24139
17079 24139 71736 62391 119371 106435 83996 38122 6091 50287 54697 89053 73243 17470
17067 17470 54042 96946 56061 7945 10510 -38128 -101941 -56537 -3458 -7679 15753 28601
17055 28601 34985 3830 -40389 -108847 -52652 -14750 -15246 61048 73300 66790 44298 19934
17043 19934 -2569 -11943 6946 42534 63262 49541 98271 53590 -6026 -18884 -11868 23689
17031B3689J5663k0995m4252N2698k0252m6831K204M1450L0763o937j3708q4018
17019g0526j1832J1479K7892K7647J3325qJ7693r786m5795j5162K2567j9565l0088
17006h2159O8765m393j6677R782L6678J06755l5410n4817K220J1393n0962m6288
16994e5113k4462J5857K0209O8646J3733m2458L590J3521n474k0119j2222l8794
16982f3086J0079j8344n2176N3844N1189q863o9636j6569N3781O0400K4994L6130
16970F1743K3604m3134o7649K7668l224J2306l9888p2456J6987P2752J8352o2544
16958e5483J9628N671O368J4845O577o1724n0653q228j9159K7926P2122M0063
16946b047m1152l057L7080O22m2605L0279n4639l9732q4036L4830P8783Q7832
$$ plain form
17031 23689 39352 18357 -25895 26803 6551 -40280 -38076 3374 34137 27200 13492 -70526
17019 -70526 -82358 -70879 -42987 -15340 -2015 -2023 15670 5884 -39911 -55073 -32506 -52071 -82159
17006 -82159 -13394 -17787 -34464 -24682 11996 118751 83341 28524 30744 42137 -8825 -55113
16994 -55113 -79575 -63718 -43509 25137 38870 -3588 2 13523 8049 -12070 -24292 -63086
16982 -63086 -53007 -71351 -123527 -69683 -18494 -27357 -96993 -113562 -59781 619 25613 61743
16970 61743 85347 42213 -25436 2232 -992 11314 -28574 -101030 -84043 -11291 7061 -55483
16958 -55483 -35855 -30184 -23816 -8971 -2394 -64118 -114771 -122999 -142158 -114232 -42110 -2047
16946 -2047 -43199 -46256 -9176 -8554 -51159 -20880 -75519 -115251 -199287 -164457 -85674 2158
16934B158k0134m0694O785j531M8807l9377l6111J8638k969K0737J5587J5796
16922a2308J3763o50j2774l5929O2570k7710m9032o869l098L7312L8451K8303
16910C2029l8303Q113K9672l4777K1289l1309o8824j1307J6806l6247Q0693O4694
16898C2529j0160j524n8753p1789r403L3968P6987L2996M2583J72m6189k0863
16886E54l1697J6128l883j3904p783l839M9489N6197k9306R241j5126L1716M844
16873F2631J2082l9409J935L7619j9513j4421j1553k2940j1720l2640l3188k5421
16861i6538m0107K4133R9667N6039m637m6451K126n3607L2535L2059m5605K955
16849c7431L3438M3460J9271J7988K3070M662r3903m0519K2348k0842l9339J5070
$$ plain form
16934 2158 -17976 -58670 -51885 -53416 -4609 -43986 -80097 -61459 -64428 -43691 -28104 -12308
16922 -12308 1455 805 -11969 -47898 14672 -13038 -62070 -68939 -72037 -34725 3726 32029
16910 32029 -6274 1839 31511 -3266 18023 -13286 -82110 -93417 -76611 -112858 -32165 32529
16898 32529 22369 20845 -37908 -109697 -119100 -85132 -8145 24851 67434 67606 21417 554
16886 554 -31143 -15015 -18898 -32802 -40585 -44424 5065 61262 31956 41197 26071 57787 62631
16873 62631 74713 35304 37239 74858 55345 40924 29371 6431 -5289 -37929 -71117 -96538
16861 -96538 -136645 -112512 -12845 43194 38557 -7894 -5768 -59375 -26840 5219 -40386 -37431
16849 -37431 -3993 39467 58738 76726 99796 104458 10555 -29964 -7616 -28458 -67797 -52727
16837e2727m289M3576M6801m68p966K9137Q618o8914k9133k2457J8378K0994k1469
16824c9919J5151m7292l6378O9234n4385j9510L0827k2199M7188K0934Q653K3316
16812d380l8438J0605M111k858q881M1143Q167j5500j2130r224N8065l32n7247
16799b6899o1099j4576M8764M8670k1846m1455j0674p795q044N9118J6639Q1909
16787F2712N3756M535p1207l2320n660k0558J0431l5434J6392J422M975l679J4406
16774b29N3283N1007k8369q8382P885L0362O4513J3530q7505q7831K3127J11565
16762F2956J1465l5778j8394K2974m451p2888m6395L1007P2193O964L6560j4258
16750E1955L860L3689J848J1485o38m6533l1098o988k8252J0407j110J2128K6703
$$ plain form
16837 -52727 -57016 -13440 33361 32893 24927 54064 62682 -6232 -35365 -57822 -39444 -18450 -39919
16824 -39919 -24768 -72060 -108438 -39204 -93589 -113099 -82272 -104471 -57283 -36349 -27696 -4380
16812 -4380 -42818 -32213 -28102 -30960 -39841 1302 9469 -6031 -18161 -27385 30680 30348 -26899
16799 -26899 -87998 -102574 -53810 -5140 -26986 -68441 -79115 -86910 -94954 -35836 -19197 62712
16787 62712 116468 121003 49796 17476 11816 -8742 1689 -33745 -17353 -15931 -10956 -14635 -229
16774 -229 53054 104061 75692 -12690 -4805 25557 90070 103600 16095 -71736 -48609 62956
16762 62956 74421 38643 20249 43223 38772 -34116 -80511 -49504 22689 29653 66213 51955
16750 51955 55815 89504 91352 102837 102199 55666 24568 17580 -10672 -265 -1375 10753 37456
16737C7456k324j9592N3826l2361k933J3402k3842k1152L5633l8136l758l717
16725g498O975N4778J6757m0317K5983k7196k5354n6565j6915M1600k681j1602
16713d2035M1180L194k7299j9351J3946M4372P8066k4177m9388K4n3867J5572
16701a9763j2237k9730l743K7384l67m3511R496O3757k200l3885J2034Q382J3550
16688a0833P339K4889J7877q2082j4783Q7283J0278m4801k3602m7439J1138N0771
16676a3965K0790k3283P65J2690Q315l0072P453j5431L0274K0250j635l2244k1758
16663c7851N739l712k4984J3385K2077k5038J3707K3542J6546J7278K752l729
16651A9712j7357O3324n914q3956l0983q328M4586M6776J5455l8583j4863j1777
$$ plain form
16737 37456 35132 15540 69366 37005 34072 47474 23632 2480 38113 -23 -3781 -7498
16725 -7498 -523 54255 71012 30695 56678 29482 4128 -52437 -69352 -27752 -30433 -42035
16713 -42035 -855 2339 -24960 -44311 -30365 14007 92073 67896 18508 18532 -35335 -19763
16701 -19763 -32000 -61730 -65473 -38089 -38456 -81967 -72471 -8714 -10914 -44799 -32765 -24383 -10833
16688 -10833 -3494 21395 39272 -42810 -57593 29690 39968 -4833 -28435 -75874 -64736 -13965
16676 -13965 6825 -16458 -15693 -3003 5312 -24760 -17307 -32738 -2464 17786 16151 -16093 -37851
16663 -37851 -32112 -35824 -60808 -47423 -25346 -50384 -36677 -13135 3411 20689 23441 19712
16651 19712 2355 65679 59765 -24191 -55174 -63502 -18916 27860 43315 4732 -10131 -21908
16639b1908k6150m2605k2629o5125L4775j8315k4556K4423L6321Q6656P303k3137
16627e4947M2079M1856m29m3114n4384M0371L130n295M2853n908O52J0722J9978
16614C7564m6789j9264N697L015k7490o097L4714K6082m0798J5479M8167k8684
16602A596j2155m879K9950K2758j3031o9192j6311M8322O3953K5071j3770k4251
16590C8061N511j2249J8978j8400l214l934J0535K4990M653m214o2494J0693l743
16577E173N816N6160q609o9008n812K8148l6363k8025M3031M8111N347j6809j6106
16564A1054L3399o5544j0636p570k781K32J3103j2693l6191q250j6418m5110n7801
16551b05206l474M1789R188L2882O567M2848M1392k8484M2099K5736k6520M1090
$$ plain form
16639 -21908 -48058 -90663 -113292 -178417 -143642 -161957 -186513 -162090 -125769 -39113 -31810 -54947
16627 -54947 -12868 28988 28559 -14555 -68939 -28568 -25438 -30733 12120 6212 6864 17586 37564
16614 37564 -9225 -28489 -22792 -19777 -47267 -53364 -18650 7432 -33366 -17887 30280 1596
16602 1596 -10559 -15438 14512 37270 24239 -44953 -61264 -12942 51011 76082 62312 38061
16590 38061 43572 31323 50301 31901 28687 24753 35288 60278 64931 60717 -1777 8916 5173
16577 5173 10989 67149 58540 -10468 -16280 11868 -24495 -52520 -9489 38622 43969 27160 11054
16564 11054 44453 -21091 -31727 -39297 -42078 -41846 -28743 -41436 -77627 -85877 -102295 -147405 -205206
16551 -205206 -208680 -166891 -157703 -124821 -118254 -75406 -34014 -62498 -20399 5337 -21183 19907
16539A9907M8015n0830J555J862p283j9822k92k4862J0656q21K4640K016m5684
16526d0943r993K511P7282L4167M2014l2913m0317N935P218k9580j4800K2168
16514B2749k2432K2658j1093l4680J8114R94J8964K2699L8348l5287m4824l1439
16502c5229K28P786K903r8780l3931M3745L2012K1873L5106j7857P088N351M6097
16489A6392j7120p552J9797j8223J3708R3714M6266o9531k3719m7070n5253m7375
16477i5966J1630N8422j3946j2824M3069K4557M078j3849L0142j3592m0324J812
16465a6791l3296m9490j3264J7474m4966K2797M9762N2926o265j4379M3485K5371
16453C3364J8046k852K4133n9155k9901j8767k2929l3047k040N7186J9979k637
$$ plain form
16539 19907 67922 17092 18647 20509 13226 -6596 -6888 -31750 -21094 -21915 2725 4741 -40943
16526 -40943 -50936 -48425 28857 63024 105038 72125 31808 37743 44961 15381 581 22749
16514 22749 317 22975 11882 -22798 -4684 -3690 15274 37973 76321 41034 -3790 -35229
16502 -35229 -35001 -27215 -24312 -123092 -157023 -113278 -81266 -59393 -24287 -42144 -35056 -29705 16392
16489 16392 -728 -8280 11517 -6706 7002 100716 146982 77451 53732 6662 -48591 -95966
16477 -95966 -84336 -25914 -39860 -52684 -9615 14942 19020 5171 35313 21721 -18603 -16791
16465 -16791 -50087 -99577 -112841 -95367 -140333 -117536 -67774 -14848 -21113 -35492 7993 33364
16453 33364 51410 48558 72691 13536 -16365 -35132 -58061 -91108 -93148 -35962 -15983 -18620
16441a8620K4336q763j2876j8283K455N7715L2428m8472k8220n6851J0283L4609
16429c0259O2023J5261N228o63j1544n1298o4237q254O3601P0807L71O019q7241
16416c0186r8467N6389N3074j2586m263q024K2215L7493P129k9134M5745k0883
16404A8502m5478o088Q5162M0985j9070n837N792k5405m3807J0023L5871k4309
16392B6341n4504m5171o775K1844L7627K7310k2649n657L1422O506Q356L6514
16380F1164M56p332M113l7909l0532K0469O756K76j3803j7287L2374j4185k7552
16367b2992o17J776O3462k4959l3932K5500m2158k0506m7897J7495Q9752M0396
16355D5320M6435Q289n0892l9191K8135P4689j2162l6022j0635j7267O385o304
$$ plain form
16441 -18620 5716 -3047 -15923 -34206 -31751 25964 58392 9920 -18300 -75151 -64868 -30259
16429 -30259 31764 47025 52253 51590 40046 -11252 -75489 -83743 -20142 50665 51036 57055 -30186
16416 -30186 -128653 -72264 -19190 -31776 -36039 -44063 -21848 15645 22774 -6360 39385 18502
16404 18502 -26976 -33064 52098 93083 74013 68176 73968 48563 4756 14779 50650 26341
16392 26341 -28163 -73334 -80109 -58265 -20638 6672 -15977 -21634 9788 16294 24650 61164
16380 61164 61620 54288 58401 20492 -10040 10429 17185 17461 3658 -13629 18745 4560 -22992
16367 -22992 -23609 -21833 41629 16670 -17262 8238 -33920 -54426 -102323 -84828 4924 45320
16355 45320 91755 100044 49152 9961 38096 112785 100623 64601 53966 36699 43084 36780
16343C6780m7953o4379K1625N7626l3937j8509r236N203O3840j2319N4193l4225
16331A8709M28N5300K6255J7491j6616R404j0112q2236n1122m9748r038N9850
16319c1435N1331k0504n5294p6457N168K1051O4762K6689J0811m8332n4726J7993
16307h8943Q4421M5290q144j9749l3628M2194K8231J2931l1816o5912j307J0182
16295b6250L210L8458Q0336n4592o1469J9364M4948J8590l9608r3030l243N8779
16283a4507k1491p977J8764J00905P057O679o7404n9552j7431J6710K4882K7050
16271A3685o706m1680j2715J8109n093R28P213k3440J5681k4785n5821J8089M7755
16258d8780M8849M8834l617M5584r501j8760J2096P297j8024n7329n644p779M509
$$ plain form
16343 36780 -11173 -75552 -53927 3699 -30238 -48747 -57983 -52780 11060 -1259 52934 18709
16331 18709 19137 74437 100692 118183 101567 110971 100859 18623 -32499 -82247 -91285 -31435
16319 -31435 19896 -608 -55902 -132359 -127191 -106140 -41378 -14689 -3878 -52210 -106936 -88943
16307 -88943 -4522 40768 32624 12875 -20753 21441 49672 62603 30787 -35125 -36432 -26250
16295 -26250 -23040 15418 95754 41162 -20307 -943 44005 62595 22987 -70043 -73286 -14507
16283 -14507 -35998 -43975 -25211 75694 82751 89430 22026 -37526 -54957 -38247 -13365 13685
16271 13685 6979 -34701 -47416 -29307 -34400 -33472 -26259 -49699 -34018 -58803 -114624 -96535 -48780
16258 -48780 69 48903 45286 90870 81369 62609 74705 82002 63978 6649 1005 -6774 -2265
16245b265K3380n8888j0836M1176J6702k2262m2429L9827L0583L7180j7990Q115
16233D2293j927k5905K19Q755j1939O894K755p2061q9079J589P060K4225P9523
16220b7598N3980o0266n9497N1263L0171o154J2898p727J5336o410K1233l9282
16208b2053l6127k6259L5645M1244N1647m1321j7984K8860L1059l3366k693K2840
16196C1492j5522j7691M2063K8700M6811l0828l8054j3031m3261j7876Q9980K9767
16184I2550m7454l0198o7802k9418O3002O1004J8647n7948k441k0888N477R808
16172e661j6726j9763j6340M5752O16l495J0532N4411M233j4639o390K1785l3474
16159B0841l1839J4314M3560O0491l659n6199o3637k5374m073M3691j4666l4704
$$ plain form
16245 -2265 21115 -37773 -48609 -7433 9269 -12993 -55422 -15595 14988 52168 34178 42293
16233 42293 40366 14461 14680 23435 11496 18390 21145 -50916 -139995 -138406 -131346 -107121 -27598
16220 -27598 26382 -33884 -93381 -42118 -11947 -18101 -5203 -12930 2406 -4004 17229 -22053
16208 -22053 -58180 -84439 -48794 -7550 44097 2776 -15208 13652 44711 11345 8652 31492
16196 31492 15970 -1721 40342 69042 115853 85025 46971 33940 -9321 -27197 62783 92550
16184 92550 45096 14898 -52904 -82322 -19320 41684 60331 2383 -58 -20946 -15469 -5661
16172 -5661 -22387 -42150 -58490 -12738 -12122 -15617 -5085 49326 53559 38920 32530 54315 20841
16159 20841 -10998 3316 46876 107367 103708 47509 -16128 -41502 -45575 -1884 -16550 -51254
16147e1254o280K0077K601K8591O4559j5975l5310k4641J7760j4167J2573N8622
16135E7156j06287o0582O7821M0969K6936o369K7473j5991k6562J2786n036l196
16123I118Q357j758Q272k1344l8335Q09P875N1037l4822j6418j0503J5624L9969
16110A7881j1887l3989m5085l32M9431K2095L76J159M4341l6932q5998m3017J591
16097a20366N3499n696N0265l2783O8714O340j5545j2790Q862j678k3746K717
16085b2207L3109k3233j508o2236q9401J134O1376M1873O477M1094K1666k424
16073E720q4731n8268N832R4087M8407k8694l4144Q188m5989L6653K4708j2125
16061d0356l4780N1234K3371K0698k6597L0222k471N669p538J5921k164n1277
$$ plain form
16147 -51254 -57534 -37457 -34856 -6265 58294 42319 7009 -17632 128 -14039 -1466 57156
16135 57156 -49131 -109713 -41892 -923 26013 19644 47117 31126 4564 17350 12314 9118
16123 9118 17475 15717 23989 2645 -35690 -34881 -27006 24031 -10791 -27209 -37712 -22088 17881
16110 17881 5994 -27995 -73080 -73412 -23981 -1886 -1510 -351 43990 7058 -78940 -121957 -120366
16097 -120366 -66867 -72563 -22298 -55081 13633 19973 4428 -8362 500 -1178 -24924 -22207
16085 -22207 10902 -12331 -13839 -76075 -165476 -164342 -102966 -61093 -54616 -13522 8144 5720
16073 5720 -79011 -137279 -131447 -37360 11047 -17647 -51791 -43603 -89592 -52939 -28231 -40356
16061 -40356 -75136 -23902 -531 20167 -6430 23792 21321 26990 19452 35373 33209 -18068
16049a8068m9564o533P3387O435L2778N131j7432J3676k733m0173P897J2610k4788
16036g377l0652Q713M6560K868k3648n36M689k4352k5384L9650l0557l8464j1884
16023i0374L4554K6663J1770j8107j4901J3N6313N1382K6324J4759l2973n4184
16011A1239m2089o0978o637L6309L8254P682L9448M9495k0422p8337o7039l7216
15999a30291l6272O8868P6510m834K0311R931Q753N5225J6565j5249j422J9167
15987H7262m174p7935p3748m716L5734M2116l3868L8223n707j3567O0835R826
15975F0281m8958k7913j2955n059J8862L1662j2069M3495M6453k3368N944l8627
15963C7748L0493k2818k2163r658l1201n3032K0532N0737m883l4769L3885K5343
$$ plain form
16049 -18068 -67632 -74165 -778 5657 38435 43566 26134 39810 37077 -3096 4801 17411 -7377
16036 -7377 -38029 -29316 17244 20112 -3536 -4072 617 -23735 -49119 -9469 -40026 -78490 -90374
16023 -90374 -55820 -29157 -17387 -35494 -50395 -50382 5931 57313 83637 98396 65423 11239
16011 11239 -30850 -91828 -98465 -62156 -23902 -16220 23228 72723 52301 -26036 -93075 -130291
15999 -130291 -166563 -97695 -21185 -26019 -5708 4223 12976 68201 84766 69517 68095 87262
15987 87262 83088 5153 -68595 -73311 -37577 4539 -29329 8894 3187 -10380 50455 60281
15975 60281 11323 -16590 -29545 -34604 -15742 15920 3851 47346 93799 70431 76375 37748
15963 37748 68241 45423 23260 13602 -17599 -70631 -50099 638 -4245 -39014 -5129 20214
15951B0214j0603j5265k8333K7791j0615N68K3483q460J8509P106K8420k8513
15939B4302j5578L4601k6880J3383K6943L9553q1o6502m6583k3794K4159k5971
15927d2448j2243q31N731K4952o686l40O6221m4325l537p379K339J8737O5147
15914F5338J0050q8967o8029j0596L9184J1334j0617J029K5480K3762o423o538
15902a4993n051m8265m7809Q1255L7851m7806j9388P379N0485l6812J0550L1950
15890f54J7646R022j0330L2915o0757k1791l3126O1722K7363k6255o801k3254
15878c4300J829M591m9584J1084j0187L6052N1578L0011q706l0636k1339J3250
15866f357M4240J6923J3560N9418o2484q7197J4919J5438l957m0322o2098k2221
$$ plain form
15951 20214 9611 -5654 -33987 -6196 -16811 -16243 7240 -1220 17289 24395 52815 24302
15939 24302 8724 43325 16445 29828 56771 96324 96243 29741 -16842 -40636 -16477 -42448
15927 -42448 -54691 -55522 -49791 -24839 -31525 -31865 34356 -9969 -13506 -20885 -18546 191 65338
15914 65338 75388 -13579 -81608 -92204 -53020 -41686 -52303 -51274 -25794 -2032 -8455 -14993
15902 -14993 -20044 -68309 -116118 -34863 2988 -44818 -64206 -56827 -6342 -43154 -32604 -654
15890 -654 16992 26014 15684 48599 -12158 -33949 -67075 -5353 22010 -4245 -11046 -34300
15878 -34300 -32471 -27880 -77464 -66380 -76567 -40515 11063 41074 32368 1732 -19607 -6357
15866 -6357 37883 54806 68366 127784 65300 -21897 -6978 8460 4503 -35819 -97917 -120138
15854a20138K7362K7461L8612m2763k9792M2168P9829p933l7567m3719Q085O1981
15842C586M5333R216l3428q3390J7878N3396k0487m4013M2021M1378j2625O114
15830B4979K6122o32p0067J0650K1652k7695K0313l0973m7679J6751O4844K5901
15818C4166m1579o3806k2691j2009J3475L5924J1098n4618K3565P1724R827J5224
15806B0300L943o6068k7425k6521Q735N7506K9354p738j8498l5198j3372K3530
15794e1452K5925K7752K9168K8357p3699n8900K0927M0781k6904j2709L6101L4029
15782A9376J5848n7135N513m1610n9532R209P4919O5565k0988j9125K4190m2477
15770b6247l1933J6022Q552J8263K2967m3461n3731L4595O2138j8347j1196l347
$$ plain form
15854 -120138 -92776 -65315 -26703 -69466 -99258 -57090 22739 14806 -22761 -66480 -58395 3586
15842 3586 48919 58135 24707 -58683 -40805 12591 -7896 -51909 -9888 31490 18865 24979
15830 24979 51101 50469 -19598 -8948 12704 -14991 5322 -25651 -73330 -56579 8265 34166
15818 34166 -7413 -71219 -93910 -105919 -92444 -56520 -45422 -100040 -76475 -4751 5076 20300
15806 20300 24243 -41825 -69250 -95771 -87036 -29530 -176 -7914 -26412 -61610 -74982 -51452
15794 -51452 -25527 2225 31393 59750 -13949 -72849 -51922 -11141 -38045 -50754 -14653 19376
15782 19376 35224 -21911 -16398 -58008 -117540 -108331 -33412 32153 11165 -7960 16230 -26247
15770 -26247 -58180 -42158 -33606 -15343 7624 -35837 -89568 -54973 7165 -11182 -22378 -25725
15758b5725M7680K9067k7767J6972K8631l9789j1574J3145j6064m9146l727K9665
15746h632j3930M1754j281k0797q7655j4261M5659l3278N1256P5221k5691j05995
15734i7630n3732L0256J0958P1333L8413r478m171n388o780j8027j4402M784l2209
15721h6073M5376L4838N3604k785l7113M616P6788K6798p0607n2009n2q2641l3480
15708a22740K8389K4422L6684j8282r435j780K1066K0855r659K1581l19M3280
15696C4062j5830l9082k2293o316O5931N7532J1895K134l0962l6809m4678M2224
15684A7808N1896j607M591J2314p210k6869l9088o4505j071L5290L5337L6688
15672E3574n1135l65K2417q9991K6324l2143k8899O1660K7384K0353M4314k389
$$ plain form
15758 -25725 21955 51022 23255 40227 68858 29069 17495 30640 14576 -34570 -38297 -8632
15746 -8632 -22562 19192 17911 -2886 -90541 -104802 -59143 -92421 -41165 34056 8365 -97630
15734 -97630 -151362 -121106 -110148 -38815 -402 -9880 -14051 -19439 -26219 -44246 -58648 -53864 -86073
15721 -86073 -40697 -5859 47745 44960 7847 12463 89251 116049 45442 -6567 -6619 -89260 -122740
15708 -122740 -94351 -69929 -33245 -51527 -60962 -62742 -41676 -20821 -30480 -8899 -9218 34062
15696 34062 18232 -20850 -43143 -49459 16472 74004 85899 88033 57071 20262 -24416 17808
15684 17808 69704 68097 72688 85002 77792 50923 11835 -52670 -53741 -18451 16886 53574
15672 53574 2439 2074 24491 -65500 -39176 -71319 -100218 -38558 -11174 9179 53493 51104
15660E1104P49k5245o6898k2351O3617k3706k7150J5817m678J7598R565L6198
15648B4620L0813J8072o5332m9613Q924M5912J9985N6618M9623j2919p2643o6421
15636a2361J9252L1235K3129j3374m4544j5630j3196J5164M0129J7843K8575K8208
15624A04430m612j7498n9999J8699K8736p770l8977K6827N4177K7622J7057k2153
15612A26539j1636M324L687j7513k0952J8586J3715m4533K869j7805k5868j0849
15600B0564K0275M3190k7911p1255P2269J9595l2511M0527k7359k1462m3082o0379
15588f7539K7277O8856N1167m9489n9996j5278K4940o110J881L3934j2339k9609
15576c2305K3872N7151R353j9530n322J0021l376l0685N5760n9645J0358N892
$$ plain form
15660 51104 51853 26608 -40290 -62641 976 -22730 -49880 -34063 -38741 -21143 -11578 24620
15648 24620 55433 73505 8173 -41440 -32516 13396 33381 89999 139622 126703 54060 -12361
15636 -12361 6891 38126 61255 47881 3337 -12293 -25489 -10325 29804 47647 76222 104430
15624 104430 99818 82320 22321 41020 69756 61986 23009 49836 104013 131635 148692 126539
15612 126539 114903 119227 122914 105401 84449 103035 116750 72217 75086 57281 31413 20564
15600 20564 40839 84029 56118 -15137 57132 76727 44216 84743 57384 35922 -7160 -67539
15588 -67539 -40262 28594 79761 30272 -29724 -45002 -20062 -26172 -24291 9643 -2696 -32305
15576 -32305 -8433 48718 58071 38541 33219 43240 39864 9179 64939 5294 15652 21544
15564B1544j2763o025K3372N240O741J3791n5603r8454m8996J4052K7602M0697
15552f8802R3353J9329k5041m5719j7638l1376k5964J5350K6045P3979N1637k1848
15540D3305q232M5977k7397l9445J5171K4767L7310o9341m7445o349k8032m0881
15528a00592j6470M4470J3364r109j242K6817Q6860L1458l445r742J340k0029
15516D3680l0885P775m3502o1676K7510m0421O8263n691j5155k3488p1134Q647
15504a36077L6059Q0228J7835l7789q986J2357M3240j4876R097R564q306J0744
15492A3090O3166O8785j4480k2611J2737j22028k3641l5459Q693O6990N8215J1088
15480H4545l1944l0758o817n6245r255M5235J6722O349n8733P318J6145J9154
$$ plain form
15564 21544 8781 2756 26128 31368 38109 51900 -3703 -102157 -151153 -137101 -109499 -68802
15552 -68802 24551 43880 18839 -26880 -44518 -75894 -101858 -86508 -60463 13516 65153 43305
15540 43305 35073 81050 53653 14208 29379 54146 91456 22115 -25330 -31679 -59711 -100592
15528 -100592 -117062 -72592 -59228 -68337 -69579 -42762 44098 75556 72111 62369 63709 43680
15516 43680 12795 20570 -22932 -84608 -57098 -97519 -29256 -34947 -50102 -73590 -144724 -136077
15504 -136077 -100018 -19790 -1955 -39744 -48730 -36373 6867 -8009 1088 10652 2346 13090
15492 13090 76256 145041 130561 107950 120687 -1341 -24982 -60441 -51748 15242 73457 84545
15480 84545 52601 21843 15026 -41219 -50474 -5239 11483 17832 -40901 -33583 -17438 1716
15468A716M3722j2461r6624p148J0283l9865J7579p0281J3014P2285M0409K1116
15456f255l42Q560k9234l2000k3060M6167J0590O5266K2991o052j0751N921M2167
15443I3968n7789p3703l8485M400N3375J6026j8377p974J8109L1810L0244j0720
15431D0884q8377m5992r095N2912Q0731K3671k8235r80l1419l3006L5311j4203
15419a7798l3558L7952J5798m6404K9675J147j2548l1231m4168n8161N8483N7466
15407d3347m3076o5706L5490P1498N571K495K9633l1025k1662J0502n036k0772
15395g5435j2226n807p299J6517K1975J8262M8848m1075l6000K8804J1786K5889
15383e761k9059J2651R582Q259j6601R537O43l9156K7053N5622K3667L0458j1906
$$ plain form
15468 1716 45438 32977 -63647 -70795 -60512 -100377 -82798 -153079 -140065 -67780 -27371 -6255
15456 -6255 -6597 1963 -27271 -59271 -82331 -36164 -25574 39692 62683 56631 45880 51801 93968
15443 93968 36179 -37524 -76009 -71609 -18234 -2208 -20585 -28559 -10450 21360 51604 40884
15431 40884 -47493 -93485 -102580 -49668 31063 54734 26499 25519 -5900 -38906 -3595 -17798
15419 -17798 -51356 -13404 2394 -44010 -14335 -13188 -25736 -56967 -101135 -159296 -100813 -43347
15407 -43347 -86423 -152129 -116639 -45141 -39570 -37075 -7442 -38467 -60129 -49627 -54663 -75435
15395 -75435 -87661 -93468 -100767 -84250 -62275 -44013 4835 -36240 -72240 -43436 -31650 -5761
15383 -5761 -34820 -22169 -12587 -4328 -20929 -11392 -10749 -49905 -22852 32770 56437 86895 74989
15370G4989q4742P522K3087q0517N2123M7943M7916l996L830j9425J7777K4775
15358A11282Q92n6366l2557K327l7715Q410K8746O664j9225K1584K7251j5352
15346D5941m3968m3607J7759O83M3969n0748m1208L8270k2797l0965O3897N3347
15334C0573m7896j3193P9864Q0159j4413o6661p4478k393m266j3801K6126J5156
15322e223k4155l0095O489J5333Q155j2059O150N0885M9177m478q8696K7466M9900
15309D8849J7530k2252l0966o5909K821O9311K564m6307L849j3698r72K808J4404
15296a7968N0870L8115L6836j9531P26O534p7876m0868j4129O862k0260o76R6667
15283D5302N6549n0051l0453k0579L9979l2235o656O903p762l8635j3971N2072
$$ plain form
15370 74989 -9753 -2231 20856 -59661 -7538 40405 88321 84325 88155 68730 86507 111282
15358 111282 112174 55808 23251 25578 -12137 -3727 25019 31683 12458 34042 61293 45941
15346 45941 1973 -41634 -23875 -23192 20777 -29971 -71179 -32909 -55706 -86671 -22774 30573
15334 30573 -17323 -30516 49348 129507 115094 48433 -26045 -28438 -32704 -46505 -20379 -5223
15322 -5223 -29378 -59473 -52984 -37651 -29496 -41555 -35405 15480 64657 60179 -28517 -1051 48849
15309 48849 66379 44127 13161 -52748 -49927 19384 21948 -24359 -20510 -34208 -35180 -32372 -17968
15296 -17968 32902 71017 107853 88322 89048 95582 17706 -23162 -37291 -30429 -50689 -51365 45302
15283 45302 101851 51800 21347 768 40747 8512 1856 8759 997 -37638 -51609 463
15271D63Q1324J8726m3033o4553k7231k123M913R737J8336j517J4672m4088n9427
15258i3801P8772N2867K6482J0587l4624m112l1175N088o0666l0652Q9268R8909
15246A06943j1084o4599n2737j858l113k9812j0556L2908O237L1833m5067K7708
15234a3197K8441m1234j8775N0761L1438K8969Q9517k1378L353q702N054M6959
15222A81206p9023o3628j3831o820j5559j1747J1951K0291l1108r356n667J5612
15210g679K4553Q807o8458j7536M6476M2852J3952K9242m2509n6873O8217N6258
15198I7302j8885L3175k7428l9406k841j2117l7064r1641k8800K6636N0649O3151
15186A2731m523j7219J6340j4230J899m6885j5432N4446L3891m0198m2786K5883
$$ plain form
15271 463 81787 100513 57480 -7073 -34304 -36427 -31514 -21777 -3441 -4958 9714 -34374 -93801
15258 -93801 -15029 37838 64320 74907 40283 36171 4996 10084 -50582 -81234 8034 106943
15246 106943 95859 31260 -21477 -23335 -26448 -56260 -66816 -33908 -27671 4162 -40905 -13197
15234 -13197 15244 -25990 -44765 5996 37434 66403 155920 134542 137895 129193 134247 181206
15222 181206 102183 38555 24724 17904 2345 -9402 2549 22840 -8268 -17624 -23291 -7679
15210 -7679 16874 25681 -42777 -60313 -13837 29015 42967 72209 29700 -27173 41044 97302
15198 97302 78417 111592 84164 44758 41917 29800 -7264 -98905 -127705 -101069 -50420 12731
15186 12731 8208 -9011 7329 -6901 -5002 -51887 -67319 -12873 21018 -19180 -61966 -36083
15174c6083M967j9857j101N9791N345j199l7636m285Q505K184K9763j7153J5010
15161H251R737l9793k1946N1224O9799N1403o0843j4859K2746J4858J4732r8656
15149F653p3911K1667L2644j6293l2417K9419k3932l0898P9199Q5600O765l003
15137H1493J5457k6436k2813l643k7062l0789j3970M7467K7808J4675j3085n8247
15125i145m2217Q132n013j9018R94M7339Q060K5916K928N846m3242J4520J2251
15112G351J5974L5686m7952m3355J6239Q2201J6754j06645n3415L781K3575M2083
15100g723m7766O396P155j8034J4698n899P720j344K4644j3267M656K3749j9760
15087b4775O751J9408l5105J6069K1626M9844K6824n6294o9866N6658k8853q315
$$ plain form
15174 -36083 -31116 -50973 -52074 7717 13062 11863 -25773 -30058 -21553 -19369 10394 -6759 8251
15161 8251 17988 -21805 -43751 7473 77272 128675 67832 52973 75719 90577 105309 6653
15149 6653 -67258 -45591 -12947 -29240 -61657 -32238 -56170 -87068 -7869 77731 84496 81493
15137 81493 96950 70514 47701 44058 16996 -13793 -27763 19704 47512 62187 49102 -9145
15125 -9145 -51362 -43230 -48243 -67261 -66267 -18928 -10868 15048 17976 23822 -19420 -4900 7351
15112 7351 23325 59011 11059 -32296 -16057 66144 82898 -23747 -77162 -73381 -49806 -7723
15100 -7723 -55489 -49093 -41938 -59972 -45274 -51173 -43453 -44797 -20153 -33420 -28764 -5015 -24775
15087 -24775 -18024 1384 -33721 -17652 3974 53818 80642 24348 -45518 11140 -17713 -26028
15075b6028K9664n6999m6144K3795M6850J7568P6368o830k8414J0885M290K9110
15063G4115j7035m092l7230l5003m5823k4866M844J0480K7067j2992o4840O465
15051a18910j0025N8159N4989J4364m921m260j7951m2670P761O6849L0574q9549
15039e5590J3636M6126J4110K3593M105J425l0617k0825j5126n368K886J5849
15027e796m4205J8451J7735o4444J9294L4778P0278L533n9650o2012k7104j102
15015a00244J2458O209j706L3369M4160K6739k1157l2601J6471j2242j0261K1164
15003a7641M4879N8900l136q2752m2536K7122j34O1546L4962k7367k4809J0543
14991C9577k2408k7207l556k0007K6955J0883K0527r1462m3715M0710L9250Q776
$$ plain form
15075 -26028 3636 -53363 -99507 -75712 -28862 -11294 65074 58244 29830 40715 45005 74115
15063 74115 57080 52988 15758 -19245 -65068 -89934 -85090 -74610 -47543 -60535 -125375 -118910
15051 -118910 -128935 -70776 -15787 -1423 -6344 -10604 -28555 -71225 -63464 3385 33959 -55590
15039 -55590 -41954 4172 18282 41875 45980 47405 16788 -4037 -19163 -24531 -21645 -5796
15027 -5796 -50001 -31550 -13815 -78259 -58965 -24187 46091 49624 -10026 -72038 -99142 -100244
15015 -100244 -87786 -81577 -83283 -49914 -5754 20985 -172 -32773 -16302 -28544 -38805 -17641
15003 -17641 27238 86138 83002 250 -42286 -15164 -15298 46248 81210 53843 29034 39577
14991 39577 17169 -10038 -13594 -33601 -6646 4237 24764 -66698 -110413 -69703 -30453 -21677
14979b1677J1883n4026R50j8085k0560N1589J06483j886n1382k0263o2967l8282
14967a18223M1702Q6321N1897k8443l8185j5598J0370K954K6657k1340L3699K8000
14955E9811j2327J9305l4563j1492j8567k6404m6277l480K3522j9144q489k7578
14943a05683M5301M6893K6993P803R284K0606n4395l6898l3723M3951K8991M1098
14931D0221L8142l1537j06568o520K6755M1447j8663l5336K8969L2335j1822m9488
14919e2065m4573j0209o809M5785M7601J652J1037K6561L0220L7510j4220J258
14907G3748Q994n7384k6111n1060j1316L831M1999L3151N989p9708J6416p396
14895d8847k3657J302L8035j9635k490O2785O2173Q8262k3778o6240j0117j4772
$$ plain form
14979 -21677 -9794 -63820 -62870 -80955 -101515 -49926 56557 54671 3289 -16974 -79941 -118223
14967 -118223 -76521 9800 61697 33254 -4931 -20529 -10159 -7205 19452 -1888 31811 59811
14955 59811 47484 66789 32226 20734 2167 -24237 -70514 -73994 -50472 -69616 -78105 -105683
14943 -105683 -60382 -13489 13504 21307 30591 51197 -3198 -40096 -73819 -29868 -877 40221
14931 40221 78363 46826 -59742 -66262 -39507 1940 -16723 -52059 -23090 9245 -2577 -52065
14919 -52065 -96638 -106847 -113656 -67871 -20270 -18618 -7581 18980 49200 86710 72490 73748
14907 73748 82742 25358 -753 -51813 -63129 -59298 -17299 15852 21841 -57867 -41451 -48847
14895 -48847 -72504 -71202 -33167 -52802 -55292 7493 69666 157928 134150 67910 57793 43021
14883D3021k7524P317J461J7458Q8643K6419r4260l2947L5743r629K4428j1402
14871F8728n3432l9294l7009M065j5663j844K6295P18j9052K0499J0987O0303
14859B5301L0154p3658k8888n8925k3172M3461N1701j6653k2409J9202j1097K2891
14847d2092M8527l2824K575N2311k2869M1888K2274p9218l7702N5826P3158l6211
14835D5643o4756l5122r220K9802o494N7371m2609r251M9656M1156N1761l5233
14823G2704q7687q602K7820L9554K910K5868K7083m5625k6606M0384o581n5121
14811F101m0113j2803K3853L3033m4136j8495j1407k6594l5107O8977J8145J3385
14799b5161K081r145L7662P5192j4458k3466k3946j7530n091o451L6963K2021
$$ plain form
14883 43021 15497 22814 24275 41733 130376 156795 62535 29588 65331 55702 80130 68728
14871 68728 15296 -23998 -61007 -56942 -72605 -74449 -48154 -47436 -66488 -45989 -35002 25301
14859 25301 55455 -18203 -47091 -106016 -129188 -85727 -34026 -50679 -73088 -53886 -64983 -42092
14847 -42092 6435 -26389 -23814 28497 5628 47516 69790 -9428 -47130 8696 81854 45643
14835 45643 -19113 -54235 -63455 -33653 -40147 17224 -25385 -34636 15020 56176 107937 72704
14823 72704 -14983 -23585 4235 43789 46699 72567 99650 54025 27419 67803 61222 6101
14811 6101 -34012 -46815 -22962 10071 -34065 -52560 -63967 -90561 -125668 -56691 -38546 -25161
14799 -25161 -23080 -32225 5437 80629 66171 42705 18759 1229 -3862 -10313 26650 48671
14787D8671p0284o152K4297J4263J0509j0053l3847J3275k4102l717L4381k8649
14775c1408n4381J6331J4056j3499k5656P297L3518P3220J5150m6452m1462L8413
14763a4873j6126K2481M8067J9673l266o1670n4780O8452K3905k0578n2964m2069
14751h3748j5752K1939l1947L392M5138l0273k2286L7874K1178J8717k4519n269
14739f5556K3496O3699M1382k1411j7717J4600l8647o3316j3718m73N0325j8385
14727d5721k8414q93K2864r685R406j2994N2008M1579O5542L1750p469j4722o2306
14714D0945k4547k7602n382O1651k5726j7549J6922M2786P8665J0690m8558l6683
14702F5612K791p123k2037L2000r2964j6446K9210M2762k8180k1883j256K0412
$$ plain form
14787 48671 -21613 -27765 -3468 10795 21304 11251 -22596 -9321 -33423 -37140 -2759 -31408
14775 -31408 -85789 -69458 -55402 -68901 -94557 -87260 -53742 19478 34628 -11824 -53286 -14873
14763 -14873 -30999 -8518 39549 59222 55956 -5714 -60494 7958 31863 11285 -41679 -83748
14751 -83748 -99500 -77561 -109508 -106116 -60978 -91251 -113537 -75663 -54485 -35768 -60287 -65556
14739 -65556 -42060 21639 63021 41610 23893 38493 -154 -63470 -77188 -77661 -27336 -45721
14727 -45721 -74135 -75028 -52164 -61849 -52443 -65437 -13429 28150 93692 125442 117973 103251 40945
14714 40945 16398 -11204 -16586 45065 19339 1790 18712 61498 140163 150853 102295 65612
14702 65612 68403 61280 39243 71243 -21721 -38167 -8957 33805 5625 -16258 -17514 2898
14690B898O8990m2561m8995k8210j018K0244P852J0724J4795l3891n4405q409
14678i1986p25M7479J36848J784m9036j7079N27Q2N7247j6817l7233l6497j16907
14665a22313l1664M7506K2065J0401J5284K0909K9559Q140l5267K5188j8744o5600
14653i4536J0514L201o1487N0321o2938m7308Q758M6247N3526k87m8510N2404
14641i0095P5565J1165j8312m7684l8777J2775K6346K2936Q593q704K0535Q9437
14629F3780K4882p5505J4869N1143m494k8849M0118r129n9535m4790j8106M904
14617d0712N5207K6405j4289j4258m4929N5496L0048l0692K2147L105l2169k2687
14605g328o108l1905n4202O747R0219M1236j0692q5689j6642Q6159J6512K0907
$$ plain form
14690 2898 71888 29327 -19668 -47878 -48896 -28652 -20800 -10076 4719 -29172 -83577 -91986
14678 -91986 -92711 -45232 91616 93400 44364 27285 27812 27894 85141 68324 31091 -5406 -122313
14665 -122313 -153977 -106471 -84406 -74005 -58721 -37812 -8253 -113 -35380 -10192 -28936 -94536
14653 -94536 -84022 -80821 -142308 -91987 -154925 -202233 -193475 -147228 -93702 -93989 -142499 -90095
14641 -90095 -14530 -3365 -21677 -69361 -108138 -95363 -69017 -46081 -37488 -46192 -25657 63780
14629 63780 88662 13157 28026 79169 74675 45826 85944 76815 17280 -27510 -45616 -40712
14617 -40712 14495 40900 26611 12353 -32576 22920 52968 22276 44423 47528 15359 -7328
14605 -7328 -13436 -45341 -99543 -92796 -2577 38659 27967 -57722 -74364 11795 28307 49214
14593D9214m138R757L839k8416K4304N013p5448o2250P7986J8380J30418l2341
14581A16318j6803o0244l2038j4846N3891P1790k0041l9158n2574k9902o86J2072
14569a2221M1571o187l812q472R391k9571k5364k3866J1469L7326M0115J4638
14557D5017m3401L7112J3916l6795k4933n253J8612K0933K7134K1727M290p581
14545G0778O74q528K3323k1853l3102k3830L9131J5177j0478p824p4248L3098
14533B318N4507k370k5391k0726j6182P4270O106L732l2527L6371m0230m6128
14521f250o900k8001Q828j6250r869K3633l376k4992K093k6488o9938j8420M6327
14508a29603N0430J9789l469q189q318O2768j4769j1601O6534o145m323k7868
$$ plain form
14593 49214 45076 54833 58672 30256 54560 59573 -15875 -78125 -139 18241 148659 116318
14581 116318 99515 39271 7233 -7613 46278 118068 98027 58869 6295 -23607 -24293 -12221
14569 -12221 29350 23163 19351 10879 20270 -9301 -34665 -58531 -47062 -9736 30379 45017
14557 45017 1616 38728 52644 15849 -9084 -14337 4275 25208 52342 74069 78359 70778
14545 70778 71452 62924 86247 64394 31292 7462 46593 61770 51292 43468 -30780 2318
14533 2318 56825 54455 29064 8338 -7844 66426 72532 76264 43737 80108 39878 -6250
14521 -6250 -13150 -41151 -32323 -48573 -58442 -34809 -38185 -63177 -61084 -87572 -157510 -175930 -129603
14508 -129603 -79173 -59384 -62853 -71042 -79360 -16592 -31361 -42962 23572 17427 13104 -14764
14496a4764n797n4990M1088L7669n6283l9116P6563L4424J4599K4791m373O462
14484F0273R800Q990m4085j8105m6183m9395J9314L3404J11111k4906p0175j933
14472a1890K9686j944K9526m563n9321k5215N1562R031j9997M750J2090k5718
14460a2003R0339P522n7835k6796k7687P2590P6752r821j2541k4344l5594l3176
14448G406L9733L5879n8270p7417M073j01261q091P3328R1544J9289Q274j8525
14436A5962l0840l0952J643M47J5955k7895L5522M9026n5635j2261J7281J7583
14424d164M4420J9451N655m5427j2314J9909M6736K5561l9240p5709O331O262
14412b529m588l9941L5492q052m484Q2099K0421j2558P433J2407p1262k9909M5664
$$ plain form
14496 -14764 -20561 -75551 -34463 3206 -53077 -92193 -15630 18794 33393 58184 53811 60273
14484 60273 70073 79063 34978 16873 -29310 -78705 -59391 -25987 85124 60218 -9957 -11890
14472 -11890 17796 15852 45378 40815 -18506 -43721 7841 16872 -3125 1625 13715 -12003
14460 -12003 78336 85858 28023 1227 -26460 46130 122882 113061 100520 76176 40582 7406
14448 7406 47139 83018 24748 -52669 -48596 -149857 -157948 -84620 6924 26213 34487 15962
14436 15962 -14878 -45830 -44187 -43740 -27785 -55680 -20158 28868 -26767 -39028 -21747 -4164
14424 -4164 40256 59707 65362 19935 7621 27530 74266 99827 60587 -15122 -8791 -2529
14412 -2529 -7117 -47058 -11566 -19618 -24102 57997 78418 65860 73293 85700 14438 -15471 30193
14399C0193J4098j0629J3944j7855k3185j0161K1720o999k0763Q44N986k9090
14387c1897K3849L2236l4959k1091J15k5598J8640p346L3845O8002K2897j7003
14375F1690l8286o7229l3396M3814P657l1798J2214O0874L3659j3014l2809N295
14363H671k2576K5256j8215r116O378K3848m9935l056L9414M1118O609k5163M190
14350B7423P3900r698l1430k6015k4874J8582R462L1207m0066N573j3572J0849
14338C1341k0928j8200k6431r506Q1946M801l7212K6116L4268L3791l5796n2209
14326A1981L0455K6808l5932o4413k5506J811O3922M9036K4337m9860j0416Q135
14314C0358j9666r109R214l927l6878L7300j9687Q23N2081l2856n0663L980J5987
$$ plain form
14399 30193 44291 33662 47606 29751 6566 -3595 18125 11126 -9637 -8793 -2807 -31897
14387 -31897 -8048 24188 -10771 -31862 -31747 -57345 -38705 -46051 -12206 55796 78693 61690
14375 61690 23404 -43825 -77221 -33407 -25750 -57548 -45334 15540 49199 36185 3376 8671
14363 8671 -13905 11351 -6864 -15980 -9602 14246 -35689 -38745 669 41787 48396 23233 27423
14350 27423 101323 91625 60195 34180 9306 27888 37350 68557 28491 34064 20492 31341
14338 31341 10413 -7787 -34218 -43724 38222 43023 5811 31927 66195 99986 64190 11981
14326 11981 42436 69244 33312 -31101 -56607 -54796 9126 58162 82499 32639 22223 30358
14314 30358 10692 1583 10797 6870 -30008 7292 -12395 -11572 40509 7653 -43010 -39030 -23043
14301b3043r351j7794J3423l3072J3906L9957N8688l713p9436Q627m5952J453
14289g6307N0973L490P211K2004k0632N9983m5822k4565L8536j1191L6463M5469
14277H5612o6604m3003J9685M4144P5589J3865o5305L2201J6906j0813n0927n132
14265D6218P298p557j1157M3007j1611l5491j1268J5941n1352o759L3198J24l0017
14252a9426o5506P918J1671k2462M3919L0460K9990O408K066o12k661K7026J6694
14239F5485l0972J747M5653l2895m4069R615O2764K5980l3678K8293K3445n979
14227A15389K1470j9133p0513k9402m1333q7589J3697o35Q592L7795J7354M1823
14215G515M3260R6428L924o0874p3502j6290K4271k6322o761l9558j3738l513
$$ plain form
14301 -23043 -32394 -50188 -36765 -69837 -55931 -15974 42714 39001 -40435 -31808 -77760 -76307
14289 -76307 -25334 -21844 -14633 7371 -13261 46722 900 -23665 14871 3680 40143 85612
14277 85612 19008 -23995 -4310 39834 115423 129288 63983 96184 113090 102277 51350 46218
14265 46218 53516 45959 34802 77809 66198 30707 19439 35380 -15972 -22731 10467 10591 -19426
14252 -19426 -84932 -77014 -65343 -87805 -43886 -13426 16564 22972 25038 24426 21765 48791 65485
14239 65485 34513 36260 81913 49018 4949 14564 77328 103308 69630 97923 121368 115389
14227 115389 136859 117726 47213 17811 -23522 -111111 -97414 -98049 -89457 -51662 -34308 7515
14215 7515 50775 147203 151127 90253 16751 461 24732 -1590 -8351 -47909 -61647 -65160
14203f5160K777k624R702l0785l397N3696M4323L5428K8305L0494n3023l5261
14191A4475m313J7451r717J1653l2518L987Q7749K040q4281j9388k1533j7231
14179e1626l768k7277K1548R4756P2804n6791m2607K679J2204l6733j8334n036
14167c8181K5050N5368M954M5505k4813m1304j6301J9399j2091j2780l4957J8175
14155a1976N6861J891L064K3575N328n582n3391l7187L1360L7901n6684P511P541
14142A0212n770j5427q033l5028J7098P5108Q6410j3925j8931J0923l0300M061
14130G6398n2020n4869l4179L8354k0755Q400L7880M368j345l5081K5629K4946
14118A7726p534J9135L4474k3954k7018L0492P3708m651n6211l874L0669L3833
$$ plain form
14203 -65160 -62383 -65007 -55305 -86090 -89487 -35791 8532 43960 72265 102759 49736 14475
14191 14475 10162 27613 17896 29549 -2969 1018 88767 90807 6526 -12862 -34395 -51626
14179 -51626 -55394 -82671 -61123 33633 106437 49646 7039 9718 21922 -14811 -33145 -38181
14167 -38181 -13131 42237 47191 92696 67883 26579 10278 29677 17586 4806 -30151 -11976
14155 -11976 44885 46776 49840 73415 78743 73161 19770 -17417 13943 51844 -4840 2671 10212
14142 10212 4442 -10985 -19018 -54046 -36948 38160 124570 110645 91714 102637 72337 76398
14130 76398 24378 -30491 -64670 -26316 -47071 -38671 -791 3577 2232 -32849 -7220 17726
14118 17726 10192 29327 63801 39847 12829 43321 117029 112378 56167 52293 82962 116795
14106A16795J6500n5828r0295j2942k1922n978j066n4529m4884O4627J16456K7594
14094E4528J2981l7709j1145N5061K5451j5274j9882L1332J9067l9864p4334l8682
14082c8470O8954L3436O522R323k3328J4829K3219l1717m6962K8369L515M5790
14070I3480k3298m2980k7674k8856k3715N5269J910P108J7733o7372j2259K8664
14058b1990J0591J5431N4910L1025J4581o2654k3332O7591m1548o4897J3177m7518
14046e4633k3104J2563L3361N4228K2809j0326J0980k0084L3806k637k8941j9882
14034H140l6808P7190N1014n1486m9702k2239l1421L9347K6530J764K8960N4026
14022I5315m9681j7117O237m0151m136j8782P7495L3166J7783p7545q7160J3156
$$ plain form
14106 116795 133295 77467 -12828 -25770 -47692 -53670 -54736 -109265 -154149 -89522 26934 54528
14094 54528 67509 29800 18655 73716 99167 83893 64011 95343 114410 74546 212 -38470
14082 -38470 30484 63920 70442 79765 56437 71266 94485 62768 15806 44175 47690 93480
14070 93480 70182 27202 -472 -29328 -53043 2226 4136 11244 28977 -38395 -50654 -21990
14058 -21990 -11399 4032 58942 89967 104548 41894 18562 86153 44605 -20292 -7115 -54633
14046 -54633 -77737 -65174 -31813 22415 45224 34898 45878 25794 59600 56963 28022 8140
14034 8140 -28668 48522 99536 48050 -1652 -23891 -55312 -15965 10565 12329 41289 95315
14022 95315 45634 28517 34754 -5397 -9533 -28315 49180 82346 100129 22584 -64576 -51420
14010e1420J4622Q030k4081j0276k9783R168Q3529k5481N6553J6216o6723M138
13998a5508K3318K3988k3519l078l7458R122N6703k7196p140O5351J5343k4624
13986E5302K4489l603K0757l448K997m5157l8079j3280m464L0792j450k4188o368
13973e700j1871o6174j0691N893M4127J7575l4552o6602j9228N3485N2804M4987
13961D053M3752m7560j7512L395Q848j0060k8051K0077J141J2203n0846M4109
13949a6451K5788J2564M669n0942j4476k0860l4917r322k4165O0980j6102m4315
13937a27549k4051N3470K8506l855k9817l7757O4549R3095l073p6765L2044P6498
13925D5295J2369k9111l3739j8147K8240Q2094k7094k1894j1689j5085j9289R811
$$ plain form
14010 -51420 -36798 -28768 -52849 -63125 -92908 -83740 -211 -25692 30861 47077 -19646 -15508
13998 -15508 7810 31798 8279 5201 -32257 -23135 33568 6372 -768 64583 79926 55302
13986 55302 79791 76188 96945 93497 96494 51337 13258 -22 -4486 26306 24856 668 -5700
13973 -5700 -17571 -83745 -94436 -88543 -44416 -26841 -61393 -127995 -147223 -93738 -40934 4053
13961 4053 47805 245 -17267 -13872 -5024 -15084 -43135 -23058 -21917 -9714 -60560 -16451
13949 -16451 9337 21901 26570 -24372 -38848 -59708 -94625 -103947 -128112 -67132 -83234 -127549
13937 -127549 -151600 -98130 -69624 -73479 -103296 -141053 -76504 16591 13518 -63247 -31203 45295
13925 45295 57664 28553 -5186 -23333 4907 87001 59907 38013 26324 11239 -8050 1761
13913A761n521m9811J9234J7303L7946m2750j5716m799O4820k9164k6865M0513
13901F951N0878K7637m5828K0048r11m0168r748j2001M6801j0916J9418N918n1117
13888F962k3974l3909l1907j2676j1433k0081L9248R4506m963m3007K0475n3682
13876g4441k0583L8244K7338j5123J386K1257Q8127J3952n8962L300L0580K3484
13864G8559k7920j3310K7559o2866k2126L5652N1975K9807k2832L055J8583n845
13852I0291l2335p67l0705k3314j5632k3858m3236j2915M132l3j7802P3428Q0637
13839D7891K5329k3759J2714K6604p1254n9974M6565K7500l0768m915N8588K9240
13827H3761k9499J2326p291n707j3199m3290K9855L2588L0750j2713M3119J0347
$$ plain form
13913 1761 -3760 -53571 -34337 -17034 20912 -21838 -37554 -42353 22467 -6697 -33562 6951
13901 6951 57829 85466 39638 59686 58775 18607 8859 -3142 43659 32743 52161 58079 6962
13888 6962 -17012 -50921 -82828 -95504 -106937 -127018 -87770 6736 1773 -41234 -20759 -74441
13876 -74441 -95024 -56780 -29442 -44565 -43179 -21922 66205 80157 21195 24495 55075 78559
13864 78559 50639 37329 64888 2022 -20104 15548 67523 97330 74498 77553 96136 90291
13852 90291 57956 57189 26484 3170 -12462 -36320 -79556 -92471 -88339 -88372 -106174 -32746 47891
13839 47891 73220 49461 62175 88779 17525 -42449 4116 31616 848 -4067 54521 83761
13827 83761 54262 66588 59297 53590 40391 -2899 26956 59544 90294 77581 120700 131047
13815A31047p4935J2259J8645o3295m8885j7444J8863N1839O4613j6443m6116
13804C0148l1975p5337o887K9321K8179M8772M0541k0926p3251m1488J2279O5783
13792E159M2543K635m5795o408m719k8634M9640M8875l766k3370l1754O7645L8837
13779A10888K7842j7786m7646q249N0706M7885k8970q9460n7820M6356J2910k1620
13767B5036J2061l0668j3149k4066j5417N0456k545j8729j4115k130L745L6661
13755G140M0767J5371M1813L1476l1414l608K946O594R49j1411n1541m5760k5803
13742b2481Q030J0490M8784m091m1671J683J2917q90N3805K2842j1398m6173l9643
13729g796r460l9056n552M3612M6749k5358P5300K101m9450o503L5765M0702l
$$ plain form
13815 131047 56112 68371 87016 23721 -25164 -42608 -23745 28094 92707 76264 30148
13804 30148 -1827 -77164 -84051 -54730 -26551 22221 62762 41836 -31415 -72903 -60624 5159
13792 5159 47702 50337 4542 -1866 -6585 -35219 14421 63296 59530 36160 4406 72051 110888
13779 110888 138730 120944 73298 65049 115755 163640 134670 45210 -12610 33746 46656 25036
13767 25036 37097 6429 -6720 -30786 -46203 4253 1708 -17021 -31136 -33266 -29521 7140
13755 7140 47907 63278 105091 136567 105153 101545 104491 111085 112034 100623 49082 3322 -22481
13742 -22481 -14451 -3961 44823 40732 -939 744 13661 12771 66576 89418 78020 31847 -7796
13729 -7796 -17256 -56312 -61864 -18252 28497 3139 78439 80540 31090 24587 60352 101054 101051
13716A01051o8407K3111J3785J2530L1109l903o1559m3841K017o8351M023L4917
13704b3518o8671k6216O4220Q0795L5092m6820J3476O3260K4980k7612L1944q0197
13692D0733q4766j0k6052k68N486J21655K0192o572o0660l4112L4524R3132k3371
13679G9911m2244l2299q660N2836O32j8412l8479k8087l9997k8365L2628k3423
13667i3959L7833N2j4951J5661q056O7203P5695M3231L5030K737j5764o4082n0231
13654C0399J0689m6832K3577L4394l4755R277j6092K5264j4619j8380j5718J5422
13642B626L0148K1620J8754M3270L3864J8504l6149l4254m6739l4902j2308o98
13630C736J2013n433M7046N0250k1161l9470J6594K6107q934P401p642K4219l3276
$$ plain form
13716 101051 32644 55755 69540 82070 113179 109276 47717 3876 5893 -62458 -58435 -23518
13704 -23518 -92189 -118405 -54185 26610 61702 14882 28358 91618 116598 88986 120930 40733
13692 40733 -44033 -44043 -70095 -70363 -64877 56778 76970 70398 9738 -24374 10150 103282 79911
13679 79911 37667 5368 -3292 49544 50176 31764 -6715 -34802 -74799 -103164 -70536 -93959
13667 -93959 -56126 -56074 -71025 -55364 -63420 3783 79478 122709 157739 160476 144712 80630 30399
13654 30399 41088 -5744 17833 52227 17472 26749 10657 35921 21302 2922 -12796 2626
13642 2626 32774 54394 73148 116418 150282 168786 132637 98383 51644 16742 4434 3736
13630 3736 15749 10316 57362 107612 86451 46981 63575 89682 80748 88149 80507 104726 71450
13617G1450o1373o909M4433M1354m6787m4326l7951l0191K7218P5479j23k7867
13605D407m5070K403k0082Q8889O2736o6773n2817k4161k6468k5701K0227L8508
13593d3902J4517j4485J7463j5003j7323P374L9146M8887M9139l6420n004j1910
13581C2479N4550N1396l9150p0294l4508l4787j7049K721j4039L688P1838J06629
13569A13474j5903o9733n835k4408L6464K0008j1611l2884q098l209p621N556
13557c800L9652K0949l521j3081j6047j3583l3430M6154O5722M623n3518p3720
13545c3600j0092R050L2740j4496q899j5105Q1777p334k5368K0404j8776k6979
13533a6678J20093O3743n5586l4576m586j5962K8532m2327p7815K2192K8650J1100
$$ plain form
13617 71450 10077 3168 47601 88955 42168 -2158 -40109 -70300 -43082 32397 32274 4407
13605 4407 -40663 -38260 -58342 30547 93283 26510 -26307 -50468 -76936 -102637 -82410 -43902
13593 -43902 -29385 -43870 -26407 -41410 -58733 -51359 -12213 36674 85813 49393 44389 32479
13581 32479 87029 138425 99275 28981 -5527 -40314 -57363 -54642 -68681 -64993 6845 113474
13569 113474 97571 27838 22003 -2405 34059 54067 42456 9572 1474 -1735 -9356 -3800
13557 -3800 35852 56801 53280 40199 24152 10569 -22861 23293 89015 93638 40120 -33600
13545 -33600 -43692 -34642 -1902 -16398 -25297 -40402 41375 34041 8673 29077 10301 -16678
13533 -16678 103415 167158 111572 76996 72410 56448 84980 42653 -35162 -12970 15680 26780
13521B6780O2597M6684p2297q4178N866K6620N24k3958j1922r970m2195J2696
13509f2753O7847O5618J6729J604k7109M8039k3272o226N376R350K9120l4137
13497I0186j5763j0020n4991Q996O2092N1881K1279J675J4343j1364j2517o5892
13485G9905o9687n2707N4162L1606K9584L6225j2971q6629j5992J5232k0524n0115
13473f1911j2324K4708P949O3677o942m4648O1631O1524N2137J7865k678p6012
13461H4976m2215n119N903j6605j9381K9505N36k0322K4891O8293j78k208m4511
13448F3565J850N793K2158L2848l2044o5922l820K697j9391m0187Q179L7620M6290
13435E9636K5481l1817k4971J0239L0303K1114l6699m5400j6093K9048j8101L9904
$$ plain form
13521 26780 89377 136061 63764 -20414 -14548 12072 12596 -11362 -23284 -33254 -75449 -62753
13509 -62753 5094 70712 87441 89045 61936 109975 86703 80477 85853 95203 124323 90186
13497 90186 74423 64403 9412 18408 80500 132381 153660 155335 169678 158314 145797 79905
13485 79905 10218 -42489 11673 43279 72863 109088 96117 9488 -6504 8728 -11796 -61911
13473 -61911 -74235 -49527 -41578 22099 15157 -29491 32140 93664 145801 163666 160988 84976
13461 84976 42761 37642 43545 26940 7559 37064 37600 17278 42169 110462 110284 108076 63565
13448 63565 65415 71208 93366 126214 94170 28248 24428 27125 7734 -32453 -24274 13346 59636
13435 59636 85117 53300 28329 38568 68871 89985 53286 7886 -8207 20841 2740 42644
13423D2644K0739J5738M9028N2434j01131p0660L9719O2516r450m1857j5826m3149
13411G45j2506k6774j9863K3233O9594j971J9768m6524N4680K5230J4974M7346
13399A47932j1377Q665k3767o762M0402j5208k8377j8678p034M33k8312m3740
13387A4177k7985J257k280M23m9481K4144N1960K9716O7859m8709n7392K504K9198
13374C5391k3504n471J344J2775j0328n259K5993K1268j6290l876l2240l7250
13362c7447L348O3389L7687Q545P801j8733o560l7601k0415j2935J3212q765K3260
13349A4786M2687J1137K1465O9783M5461l3353l5458j9806q662j0478L2607J4790
13337A44959J0361M2842k8312K957L4755M219J06802O8878J22936J96614J78658
$$ plain form
13423 42644 63383 79121 128149 180583 79452 8792 48511 111027 101577 59720 43894 745
13411 745 -11761 -38535 -58398 -35165 34429 32458 52226 5702 60382 85612 100586 147932
13399 147932 136555 145220 121453 114691 155093 139885 111508 92830 85796 86229 57917 14177
13387 14177 -13808 -12551 -14831 -14408 -63889 -39745 12215 41931 109790 61081 3689 6193 35391
13374 35391 11887 6416 7760 20535 10207 4948 30941 52209 35919 32043 -197 -37447
13362 -37447 -34099 29290 66977 75522 83323 64590 58030 20429 14 -12921 291 -8474 14786
13349 14786 57473 68610 90075 159858 205319 171966 136508 116702 108040 97562 130169 144959
13337 144959 155320 198162 169850 172807 207562 211781 318583 387461 510397 707011 885669
13326H85669L46733L91686L83813L16473K01482J03808j8241j13153k16410l13230
13316A968630l28252l18292j94047j44729j30486j23252p5018n0720n2497m1283
13306E10054K624q2414m4654j612o8525k3897j3345m7006M4129Q346o9922o93
13294B13085K5889k39J1278L2422n983q8234k7907L5313n1833n0675M7380N95
13282A41091m5841M3054M4382n6394l0146j3203k8676l2214N5874J00142N876
13271A83945j5561L0378j5397k0420O2688O784l7866m6676k8381N820J4959j9893
13259A20380M4221M3864n325m5039j6247m3763O828o710k5583k0477K5674l9927
13247C7896m9959N6381Q6087J5617o9239M3005j983k8860M9778P8647L712p4183
$$ plain form
13326 885669 1232402 1624088 2007901 2324374 2525856 2629664 2611423 2498270 2281860 1968630
13316 1968630 1640378 1322086 1128039 983310 852824 729572 654554 603834 551337 510054
13306 510054 512678 430264 385610 383998 315473 291576 278231 231225 275354 283700 213778 213085
13294 213085 238974 238735 250013 282435 276452 188218 160311 195624 143791 93116 140496 141091
13282 141091 95250 138304 182686 126292 96146 82943 54267 22053 77927 178069 183945
13271 183945 168384 198762 183365 162945 225633 232417 194551 147875 119494 125314 140273 120380
13259 120380 164601 208465 203140 158101 141854 98091 104919 98209 72626 52149 77823 37896
13247 37896 -12063 44318 130405 146022 76783 119788 117805 88945 138723 217370 221082 146899
13235A46899l8129j1810R7535M2277n3722j8792p004j3664J1787k766j55j4248
13223A38208j4260K5665R935K7335M8578J0533m3801l9372K6969k6867l8322k2214
13211A02387M0834J1369j6866J4819k298p2644J7543l0096m943l5765l538J9191
13199C9993n450j1977J5742O771m0945J1394j0602j3147k0812L036K5738j557
13187a816j6078n155n0537N4056M3747j1842j0925M4745L5511K5965o2684l6619
13175H368K966N0121R0372L1090o2794j0574j921J5945K2116j7742l613j5850
13163A08484k7599N380J9099m2384L3568N1128L229l0073n6101m2498K5472L9526
13151H7231K2798l6667m2217J116N3031r343K748m2533k6542r449J9870P3376
$$ plain form
13235 146899 108770 96960 194495 236772 183050 164258 157254 143590 155377 152611 152456 138208
13223 138208 123948 149613 159548 186883 235461 245994 202193 162821 189790 162923 124601 102387
13211 102387 143221 154590 137724 152543 150245 77601 95144 65048 60105 24340 20802 39993
13199 39993 34543 22566 38308 45079 4134 15528 4926 -8221 -29033 -25997 -259 -1816
13187 -1816 -17894 -23049 -73586 -19530 24217 12375 1450 46195 81706 107671 44987 8368
13175 8368 11334 61455 151827 182917 120123 109549 107628 123573 145689 127947 124334 108484
13163 108484 80885 86265 105364 62980 96548 147676 150905 120832 64731 22233 47705 87231
13151 87231 110029 73362 31145 32261 85292 75949 78697 36164 9622 173 20043 93419
13139I3419l5513l2058J1198j3556N0083O6372L0158N9944M5423L9459j325j3633
13127B99971J3087K4800P4182l6542o3619k0647L8931M5530j2675o3146j08959
13116A90913J8955L8554j5670J6176k6774l5256M4664M2815j6814k3555l6041
13105A97967j241N4764N5247j04947l8598P9397l2314j6089p3998K3870l598r332
13093A31128Q0011L0167m1849n5633n8510l0055L485n042m0171K932P6704M9029
13081A42196L6250K428J1730k0002m6657K6364K1521j2915J7095R065j9779k067
13069A65229j1554l8167J273J033k195j60L2326N948O3193N6139K3267K428L1888
13056C30648m7778k9363j4414l2072o3887M2051J15267N55P183J2350L6703j3094
$$ plain form
13139 93419 57906 25848 37046 23490 73573 139945 170103 230047 275470 314929 313604 299971
13127 299971 313058 337858 412040 375498 311879 291232 330163 375693 363018 299872 190913
13116 190913 209868 248422 232752 248928 222154 186898 231562 274377 257563 234008 197967
13105 197967 196726 251490 306737 201790 163192 242589 210275 194186 120188 144058 140460 131128
13093 131128 211139 241306 199457 143824 85314 55259 58744 53702 13531 16463 93167 142196
13081 142196 178446 180874 192604 172602 125945 152309 173830 160915 178010 187075 167296 165229
13069 165229 153675 115508 116781 117814 115619 115459 147785 153733 216926 273065 296332 298760 330648
13056 330648 282870 253507 239093 207021 143134 185185 300452 301007 308190 320540 357243 344149
13044C44149l6084l2263J5732M6390p035n0564K1539J2382l1797L6108J9060L3602
13032C71219j9953k3350j7079k7194n1270K2373Q8587O6190K5241M2821K468l7117
13020D42936l5784l3723k3909p136l2473m5439L3717O2589K70k1147J8140k2906
13008C35135K8866K6698O3936L4199K4622L5163J0285P2458R5970P0846Q5060
12997H83238N2246L979j00202q9400J5396Q547k3331K5103N7186L8085N8897l80
12985I29364o5158m7270J3708L5030p644K5048J7594o2734k5254j8605m7168o7766
12973F79145R647N2840l0376o5793l044L9162K8174N162O2469K0867R644N9464
12961H67361K3993K8066l72j7498L5489o88n5378k9831m1031l5340l7204O1075
$$ plain form
13044 344149 308065 275802 291534 337924 330889 280325 301864 314246 282449 318557 337617 371219
13032 371219 351266 327916 310837 283643 232373 254746 343333 409523 434764 477585 480053 442936
13020 442936 407152 373429 349520 342384 309911 264472 298189 360778 361048 339901 358041 335135
13008 335135 364001 390699 454635 488834 513456 548619 558904 631362 727332 798178 883238
12997 883238 935484 939463 839261 749861 765257 773804 750473 775576 832762 870847 929744 929364
12985 929364 864206 816936 830644 865674 858030 883078 900672 837938 812684 794079 746911 679145
12973 679145 688792 741632 711256 645463 642419 681581 709755 714917 777386 798253 807897 867361
12961 867361 891354 919420 919048 901550 937039 936351 880973 851142 810111 774771 737567 798642
12949G98642L9762P7224L5015J134L2706L9005O1047k1883m1806m6504O364J8367
12937I99073j7672O0913R890k3661k186M217M2907M2759M5741K5484N3173M103
12925A244741O8945L9088J02557J31840L474P6484P6398O1282N9356J31084J11530
12914B106779m9878N0184K5250J05389J00018J29981R9418J57678Q7273J75269
12904B987361J78107K55633K77768K03883K91271M26417M43069N34826N94105
12895F192440O11461O65017P70821R25094J214902J511456J864027K293797K813304
12886A8862319L342375M074100N062129O426893Q636539J2436395J9003909K9599977
12878A07444636M2436937N5095850O9287738P4170164O5199815N7909117L0119711
$$ plain form
12949 798642 838404 915628 950643 951777 984483 1023488 1084535 1062652 1020846 974342 980706 999073
12937 999073 981401 1042314 1052204 1028543 1026357 1030574 1073481 1116240 1161981 1187465 1240638 1244741
12925 1244741 1313686 1352774 1455331 1587171 1590645 1667129 1743527 1804809 1864165 1995249 2106779
12914 2106779 2056901 2107085 2132335 2237724 2337742 2467723 2567141 2724819 2812092 2987361
12904 2987361 3165468 3421101 3698869 3902752 4194023 4620440 5063509 5598335 6192440
12895 6192440 6803901 7468918 8239739 9164833 10379735 11891191 13755218 16049015 18862319
12886 18862319 22204694 26278794 31340923 37767816 46404355 58840750 77844659 107444636
12878 107444636 149881573 204977423 274265161 348435325 413635140 471544257 501663968
12871E01663968q030565j9915561m3969548o9411186o0634193n2555005m8955070
12864A98192840l6831516k5141615j8265925j4075723j1070924r189580p717091
12857G5900466o427389n331257m550468l853421l429157l045486k643932k464588
12849D4154768k409265k146533j973313j872562j709890j573507j525140j371262
12841B9573296j183511j185551j167230j068226r59615q62809q38972q41321q20438
12832B0645623p61264p61204p11222o47737n90871o14552n75180n82056n31649
12823A4869888m53609l53144m12887m58200l92422m15200l10356l31224l04047
12814A1438799k82334l65122l41030l11235l12453k81168l05370k31366k18390
$$ plain form
12871 501663968 493633403 473717842 429748294 360337108 299702915 247147910 198192840
12864 198192840 161361324 136219709 117953784 103878061 92807137 83617557 75900466
12857 75900466 69473077 64141820 59591352 55737931 52308774 49263288 46619356 44154768
12849 44154768 41745503 39598970 37625657 35753095 34043205 32469698 30944558 29573296
12841 29573296 28389785 27204234 26037004 24968778 24009163 23146354 22307382 21466061 20645623
12832 20645623 19884359 19123155 18411933 17764196 17173325 16558773 15983593 15401537 14869888
12823 14869888 14416279 14063135 13650248 13192048 12799626 12384426 12074070 11742846 11438799
12814 11438799 11156465 10791343 10450313 10139078 9826625 9545457 9240087 9008721 8790331
12805H790331k79749k93602k27752l09756k76995k14880k07873j90929j21210
12796F667585j72949j76516j37474j52189j40275j40867j45784j39643j34805
12787E327083j15617j79507o7960j02243k06921q9980m2384j04248j04949j08908
12777D204366j47247j00028n7783j48707j04038j10257q8845p5075r3227n2850
12767C226309m2076p9569j68232j26004q5167p6470r3379p8655m8586r9578o4297
12756B264296r6191p0464p079m9170N396k4203n0233n3757n8488n0708j20872
12745A688527j30225K3746K1210k5151K3603n0265L9081K7145J0887l9765L029
12734A591822k1732o2191j8241q265o2306j09733n4034j2182n1910o9972q0868
$$ plain form
12805 8790331 8510582 8216980 7989228 7679472 7402477 7187597 6979724 6788795 6667585
12796 6667585 6494636 6318120 6180646 6028457 5888182 5747315 5601531 5461888 5327083
12787 5327083 5211466 5031959 4963999 4861756 4654835 4564855 4522471 4418223 4313274 4204366
12777 4204366 4057119 3957091 3899308 3750601 3646563 3536306 3447461 3372386 3279159 3226309
12767 3226309 3184233 3104664 2936432 2810428 2725261 2648791 2555412 2476757 2428171 2328593 2264296
12756 2264296 2168105 2097641 2090562 2041392 2046788 2022585 1972352 1918595 1860107 1809399 1688527
12745 1688527 1558302 1582048 1603258 1578107 1601710 1551445 1590526 1617671 1628558 1588793 1591822
12734 1591822 1570090 1507899 1489658 1481393 1419087 1309354 1255320 1243138 1191228 1121256 1040388
12723A040388o9500n6704j33484k9986k3074p2269r9230p768M9323J9445j175
12712F15966R556r552j5941J7582o1215n1991p1932l2378j0482j8838n112m5764
12700C19899k6049L6730O3708J3290q6996K1399O8224L4412k1132m4183p455j222
12688C70625k2178n3678J7476J2846J4783j8062m6775M69j730J0140K1481q161
12676B97236N8883k5934q7983j5855K5135M6397m650o1825j6273L0736j3592J4467
12664B46742M2122l9985J6648J0900q632j4654M3843j4444L5787O7095K318k5607
12652C62133J2927n0480m8075j9253l2557J4338r550L3158L0559j2966n1427m022
12640B24785K6522M1041k4150o1919j197K4796J0783P710L0443L1489L5403m6809
$$ plain form
12723 1040388 970888 914184 780700 750714 727640 655371 556141 548373 597696 617141 615966
12712 615966 625522 615970 600029 617611 556396 504405 432473 400095 389613 370775 365663 319899
12700 319899 293850 330580 394288 407578 320582 341981 410205 444617 423485 379302 371847 370625
12688 370625 348447 294769 312245 325091 339874 321812 275037 275506 273776 283916 305397 297236
12676 297236 356119 330185 242202 226347 251482 297879 293229 231404 215131 245867 232275 246742
12664 246742 288864 248879 265527 276427 267795 253141 296984 282540 318327 385422 387740 362133
12652 362133 375060 324580 276505 257252 224695 239033 229483 262641 293200 280234 228807 224785
12640 224785 251307 292348 268198 206279 205082 229878 240661 248371 278814 310303 345706 298897
12628B98897j4950m4501k0226p002J8555k1422m8248r186J4368K0956m8685L3497
12616A72053P8847L2935m2388m230j5130l1328J9691m0788L9337R7084L7190m6869
12604B96404j4982n879L7336J02467J2064p5351k735K8229M3569l7233n1481m5456
12592B86952q6515J2467L6128J925J8098l1596j312l1556r457m2414J5362K3837
12580A91919j7568m7739M4077Q741o0924m7210Q570K6266J084J7781k7609j04310
12568f922K8855P9185n616N546K6392O9593P955n354n7313k1085k9303J1904K5448
12555A29285P861r6591j4115K2581n830L7329O821n3476o886r276k7978M267L171
12542b837M6450M7092J4096l3271j6766k904Q755Q6699M9399p5554j9039m5541
$$ plain form
12628 298897 283947 239446 219220 212218 230773 209351 161103 151917 166285 187241 138556 172053
12616 172053 250900 283835 241447 237217 222087 190759 210450 169662 208999 306083 343273 296404
12604 296404 281422 275543 312879 415346 427410 352059 349324 377553 421122 383889 332408 286952
12592 286952 200437 212904 249032 250957 269055 237459 236147 204591 195134 152720 168082 191919
12580 191919 174351 126612 170689 179430 118506 71296 79866 106132 107216 124997 97388 -6922
12568 -6922 21933 101118 95502 101048 127440 197033 204988 199634 142321 121236 91933 103837 129285
12555 129285 137146 40555 26440 49021 43191 80520 87341 33865 26979 17703 -10275 -6008 -2837
12542 -2837 43613 90705 104801 71530 54764 51860 60615 147314 196713 121159 102120 56579
12530E6579l3674P892K6183N9332M2395q010j9475k8900L0613N8801n667L93n2290
12517A34172n9748j7396q5396q0751K2086j9850p849L9143Q2009L9157j3306L1239
12505F3510M0165L6544J2294n0321m3547j6111n103L0201M5719P6359j6572n5317
12493A17821j3970J7277Q540K240l5654R415K6477L0771j9527k0331k6712j7168
12481G9179N986k3173n551p1722L4773J21227L6421j4483k5072l6859k8773J6118
12469H8071o386k311J7310J721K1657L314k1137j6598j5884M3115J0754n3879
12457F9747j3195Q534Q200m8421o1807n2566O6226N7137L114j0731k4362j3669
12445a1793o8752N1337O3839j8797m3284N0430j3057k2547l8685K9036O8956k2922
$$ plain form
12530 56579 22905 30797 56980 116312 158707 150697 131222 102322 132935 191736 186069 186462 134172
12517 134172 74424 57028 -28368 -109119 -87033 -106883 -114732 -75589 6420 45577 32271 63510
12505 63510 103675 140219 152513 102192 58645 42534 37431 67632 113351 189710 173138 117821
12493 117821 103851 121128 129668 131908 96254 105669 132146 162917 143390 123059 96347 79179
12481 79179 85165 61992 56441 -15281 19492 140719 177140 162657 137585 100726 71953 88071
12469 88071 81685 79374 96684 98405 120062 123376 102239 85641 69757 112872 123626 69747
12457 69747 56552 65086 73286 24865 -36942 -89508 -23282 33855 36969 26238 1876 -11793
12445 -11793 -80545 -29208 34631 15834 -27450 22980 9923 -12624 -51309 -22273 46683 23761
12433B3761J0299N0979k4697K5755L5141P8810k618N0976N8839Q0653J15053J70806
12421F73757L04302L67842M14381L71160L20717K49595K9701j00245k15541l24687
12411B090982l24140k24601k68995k61726j45274j11238j21437p1853j01249j0828
12401D49641J2693l9723q3177m1099l6364j4348k3902l8996j9882N3370l4553
12390A83660k3653L8590L254j1643m6288N414j1201K4789K541l3360J0946j7465
12378A25584n1579k2367K5889M4037K7230L0427K0738L7730l84K5131o199m5200
12366B11037K5630n498o3918j8699j8865J6760K85m300l9070l4657L0189k553
12354I6341k7536J8616k32O7956l0395m5372n5588m2836K1604p678K4290N6112
$$ plain form
12433 23761 34060 85039 60342 86097 121238 200048 197430 248406 307245 387898 502951 673757
12421 673757 978059 1345901 1760282 2131442 2452159 2701754 2731455 2631210 2415669 2090982
12411 2090982 1766842 1542241 1273246 1011520 866246 755008 633571 561718 460469 449641
12401 449641 462334 422611 339434 298335 261971 247623 223721 184725 164843 218213 183660
12390 183660 160007 198597 201851 190208 143920 149334 138133 162922 165463 132103 143049 125584
12378 125584 74005 51638 77527 121564 148794 179221 199959 237689 237305 262436 256237 211037
12366 211037 236667 231169 167251 148552 129687 146447 146732 142432 103362 68705 98894 96341
12354 96341 68805 87421 87189 155145 124750 79378 23790 -19046 2558 -5120 19170 75282
12342G5282k9464K703j7350k6234m648L3482K4882N6885J7930P3985j7537r423
12330A80493L5854J3129q9173n3162K4466k2358k4581K1340L3056M871o7408j21844
12318f5317q5261Q296J00368N057l1209O323L969K1247L0516j8879l4426L6128
12306b3188M7768L0194q4n1266k3797P1539L8634L220m7825o3928k9353k8375
12294g6461o0524Q8790L7260j2906J9210J7235M828p1465P990N2614M1192M987
12282E2750k1675j8631l9855J6106L7501M4978J168r352k4038K5091l096j5976
12270D4971q5881o0481J7826O9648O8309l4115J7973M4976k9068o045j1612m0345
12258c844l318l3014l5540k3227q911L6364M5033l873N4213J0894k0107j4277
$$ plain form
12342 75282 45818 48521 31171 4937 289 33771 58653 115538 133468 207453 189916 180493
12330 180493 216347 229476 140303 87141 111607 89249 64668 86008 119064 123935 56527 -65317
12318 -65317 -150578 -142282 -41914 -36857 -68066 -61743 -57774 -36527 -6011 -24890 -59316 -23188
12306 -23188 24580 54774 54690 3424 -20373 51166 89800 93020 45195 -18733 -48086 -76461
12294 -76461 -136985 -48195 -10935 -23841 -4631 12604 17432 -54033 -46043 6571 47763 52750
12282 52750 31075 12444 -27411 -11305 26196 71174 72342 62990 38952 64043 60947 44971
12270 44971 -40910 -101391 -83565 -13917 54392 20277 38250 83226 54158 48113 36501 -3844
12258 -3844 -7162 -40176 -75716 -98943 -107854 -71490 -26457 -30330 23883 34777 14670 393
12246C93m2424j0495L2197L5729M2966j1653o0504J8383L4098n1077k204K7954
12234A3363r912o7887k1969P3450P6272j7117k3891m2857k5701J465P184L4462
12222c138K3134J6474M5119Q8628l5634q3945l9864K4355K2959R306l0735J2488
12210D9147N5344n4364n7740l3889K2804k5571k6094j5408j4579k0330L1585L6229
12198e2866M8454M3936K7323p3789m3412K5912M7530L5774r280q401j3521M1310
12186F8970j3804j05980o828L2820N7017K0004k8164k1109J6312m0037l4708k4750
12174h0257N4323l980l522J5410K0834R54J3776k5206l3954n5408j6463K715Q0024
12161c0754o191R432M9300J4822m1217R058J8050l0566l2356p756M1196K961J5581
$$ plain form
12246 393 -42031 -52526 -20329 15400 58366 46713 -13791 4592 38690 -12387 -14591 13363
12234 13363 3451 -64436 -86405 -12955 63317 46200 22309 -20548 -46249 -44784 -37600 -3138
12222 -3138 19996 36470 81589 170217 134583 50638 10774 35129 58088 67394 36659 49147
12210 49147 104491 50127 -7613 -41502 -18698 -44269 -70363 -85771 -100350 -120680 -89095 -52866
12198 -52866 -4412 39524 66847 -6942 -50354 -24442 23088 58862 49582 41181 27660 68970
12186 68970 55166 -50814 -57642 -24822 32195 52199 24035 2926 19238 -20799 -55507 -80257
12174 -80257 -25934 -29914 -33436 -18026 2808 3762 17538 -7668 -41622 -97030 -113493 -110778 -30754
12161 -30754 -36945 -27513 21787 36609 -4608 4450 22500 -8066 -40422 -48178 -6982 -4021 11560
12148A1560q499L029J3608k9329o4782m9237K5863M244Q9226N0835p39k9563l2172
12135a5956N8283j2827m5594O815l3446K4509J9374J1752m021J2359J2450N1870
12123H5568O314j2409m7658k4566P44L182l057n5019J2916M2969P2968j5346k9932
12110C6674k2144n378m1327j0597N0261j1845j9132K6503K1648L7309O7039n6680
12098G2331j0806J7115K069p3099m6413L8237j7074n3215j8394P8567K8705K0679
12086C8702m4169P508Q444K01k3918P770M1704p197l3420n2433k313q830j7463
12073h5414R959M0185J3589l8250l8075J8910P8863M2436R02L1288n2469L737
12061B5661K7297l6344r54K8264p691q2810J6571j3868k7728M7013L4845j8179
$$ plain form
12148 11560 3061 6090 19698 -9631 -74413 -123650 -97787 -93543 -4317 46518 45779 16216 -15956
12135 -15956 42327 29500 -16094 -9279 -42725 -18216 1158 12910 8889 21248 33698 85568
12123 85568 91882 79473 31815 7249 7993 11175 8118 -46901 -33985 8984 81952 66606 36674
12110 36674 14530 9152 -32175 -42772 7489 -4356 -23488 3015 24663 61972 129011 72331
12098 72331 61525 78640 80709 7610 -38803 -566 -17640 -70855 -89249 -10682 18023 38702
12086 38702 -5467 2041 10485 10686 -13232 -5462 36242 29045 -4375 -56808 -59121 -67951 -85414
12073 -85414 -75455 -35270 -21681 -59931 -98006 -79096 -233 42203 43105 74393 21924 25661
12061 25661 52958 16614 15660 43924 36233 -46577 -30006 -43874 -71602 -24589 10256 -7923
12049g923l474O618m0160n4943l7889O5994M5540m2122M1522L0020p277j9194
12037b3288K0292P749O2066Q517K0818l5039j5666n2074o0287J6128K3417K0012
12025g355P1164J8947n4017l5162N396k1421m2942J284L776J3520M0437k7865
12013c4238R512P5059n6675n4886J1327r829j1122O0512J2432o4771Q242R0026
12001C5589M2910k2014j7048l4576n3989j3929L7615M2851j6817J2894K4838L298
11989D1622j6495l0702K4319k3885j6458j4747J9663N7492j9515L578k0757K4533
11977B8648j3832m0625K2713L2779J9604k008m6991o0637N436O8906N3463J7033
11965H4489l6547k5022K9215J11108j0065n3705j57349o3368N3178Q230k994K106
$$ plain form
12049 -7923 -11397 -4779 -44939 -99882 -137771 -71777 -26237 -68359 -26837 3183 -4094 -23288
12037 -23288 -2996 4753 66819 75336 96154 61115 45449 -6625 -66912 -50784 -27367 -7355
12025 -7355 63809 82756 28739 -6423 -1027 -22448 -65390 -64106 -60330 -46810 -6373 -34238
12013 -34238 -24726 50333 -6342 -61228 -49901 -59730 -70852 -10340 2092 -62679 -54437 35589
12001 35589 78499 56485 39437 4861 -49128 -63057 -25442 17409 592 13486 38324 41622
11989 41622 25127 -5575 18744 -5141 -21599 -36346 -16683 40809 21294 24872 4115 28648
11977 28648 14816 -25809 -3096 29683 49287 47279 288 -60349 -54913 13993 67456 84489
11965 84489 47942 22920 52135 163243 153178 99473 -57876 -121244 -68066 -59836 -62830 -60724
11953f0724k9204M0928K6938J8928L4357j1960K6582l0785k2996M0907k2906J4623
11941B4688l2086n2083l578M5750L5913J2639J5576m363j2774j0887M6187j8454
11929D6528l2532r389m6256M375M0814k1866K4357M7230j9206o352J1464m7545
11917h378P132k62n0189K4915k783K6329m7991l7944J2245K5868P1157N4010l524
11904G0585P660J4993n9713o3619m3093K7863m890J9420J2092k939l0237K4776
11892b7102J7747K4902Q530l7561K865P44k3521J3537j9436K3247N0724J6525
11880E1201j3654j3670K5417k5324k1143J2532J0624k3661k8199J7816P5743j757
11868F5925m1013m2393q7243l5728J7868N9181N3110J6785n919k6604l7137L1170
$$ plain form
11953 -60724 -89928 -49000 -22062 -3134 31223 19263 45845 15060 -7936 32971 10065 24688
11941 24688 -7398 -59481 -63059 -17309 18604 31243 46819 42456 29682 18795 64982 46528
11929 46528 13996 4607 -41649 -37274 3540 -18326 6031 53261 34055 27703 39167 -8378
11917 -8378 -1246 -1508 -51697 -26782 -29565 -3236 -51227 -89171 -76926 -51058 20099 74109 70585
11904 70585 78245 93238 33525 -30094 -73187 -45324 -50214 -30794 -18702 -21641 -51878 -27102
11892 -27102 -9355 15547 24077 -13484 -10619 -9875 -33396 -19859 -39295 -16048 34676 51201
11880 51201 37547 23877 49294 23970 2827 15359 25983 2322 -25877 -8061 67682 65925
11868 65925 24912 -17481 -104724 -140452 -122584 -63403 -10293 6492 573 -26031 -63168 -31998
11856c1998q19k8883R97j0772k2855K3418j9631j078N4491O1155J2048m7690O36
11843a0981j0722M9166L4958j2493l9790o5724J0186O7020k0334m5391K1174J1888
11831a1043N493o98r076n236j7802j1036K1874m785l160J4307k613N3621k8390
11818A456q1494J7016m528l8866K3959L3153R4723N3261M8101m1580j3084l3273
11806E8844j0377K1697M364J7822j8373J1934J1787n5711P359m639m6672J8007
11794A6042R713q0580j522J0881J4777L7850l9631l0068J7134m26k5983K3194
11782d8619l5864N095O0322P771L533K492J6289L7100k068n387O947O474Q3104
11769A37189L1737k1156o1912n4392o9208m4561R217M5729O626K1123K0959L12
$$ plain form
11856 -31998 -32817 -61700 -60703 -71475 -94330 -70912 -90543 -91621 -37130 24025 36073 -11617 -10981
11843 -10981 -21703 27463 62421 49928 10138 -55586 -45400 21620 1286 -44105 -22931 -11043
11831 -11043 -5550 -6248 -15324 -20560 -38362 -49398 -27524 -32309 -35469 -21162 -23775 29846 1456
11818 1456 -80038 -63022 -67550 -106416 -82457 -49304 45419 98680 146781 105201 92117 58844
11806 58844 48467 70164 74528 92350 73977 85911 97698 41987 49346 44707 -1965 16042
11794 16042 25755 -54825 -56347 -45466 -30689 7161 -32470 -62538 -45404 -45830 -71813 -48619
11782 -48619 -84483 -79388 -19066 -11295 -7762 -5270 11019 48119 46051 40664 47611 54085 137189
11769 137189 168926 147770 85858 31466 -37742 -82303 -73086 -27357 -20731 392 21351 21663
11757B1663k8687K9997q086k5728m1599L139Q430J1139P7175Q3348j5951l3639
11745H1201j8416M710k5932o1276O795k4633r5035o9373P5751J6173l1424n8727
11733b00186L8062O6293m3646k5350Q367L6815J9653k2273J9447J7218k4856J2128
11721i8328K2610K3248j7290k757N2677j46L9803Q82K0969k9145l626K3500k8198
11708D199j0480j1231l9830M2820N4064J0739o448K9059J467n4029l6280N192
11696a0758J3672l8640o8799j7551N11J0706K5059j435l074o24P2044K6570k5178
11683a7497O151J298m8525n5929J3874K5878j5605O1894O0684M1380o6561p7939
11671g0897k6185K5300K2162j6012j171O0586N5140N6017l8297n8320J2064p2354
$$ plain form
11757 21663 -7024 22973 14887 -10841 -52440 -49301 -40871 -29732 47443 130791 114840 81201
11745 81201 62785 67495 41563 -19713 -12918 -37551 -132586 -201959 -126208 -110035 -141459 -200186
11733 -200186 -162124 -95831 -139477 -164827 -156460 -119645 -99992 -122265 -102818 -85600 -110456 -98328
11721 -98328 -75718 -52470 -69760 -72517 -19840 -19986 19817 20699 41668 12523 8897 32397 4199
11708 4199 -6281 -17512 -57342 -14522 39542 50281 43833 72892 74359 20330 -15950 -10758
11696 -10758 2914 -35726 -104525 -122076 -121565 -110859 -85800 -87235 -90309 -90933 -18889 7681 -17497
11683 -17497 -11346 -10048 -58573 -114502 -100628 -74750 -90355 -28461 32223 73603 7042 -70897
11671 -70897 -97082 -71782 -49620 -65632 -66803 -6217 48923 104940 66643 8323 20387 -51967
11659e1967K0877Q2503O116J025n0925p9343J5072O0080j4169o949j4683N3114
11647B0751K4188p0662k0628K8810L2271O3998J530m0600k0942M416M5961j8224
11635E0869J7887R858n6608Q30o0485l6205O8858K3375P4618j5341m7678j2766
11623A7212j023j5815M45N424p1813K0906K0342j8152Q1288M3716M753o3246l3144
11610i107J1895L2991n7877k9938L8382O4937k8742j028M4439J0077J2662j8931
11598F9760J7872j6683l9891m0894l919j4612n6960K1133N461Q5091j7k0873k9745
11585b4277P982J7373o5746K5450N6492K2346M0207j9448k1704j6329N3225L5860
11573A11431m7046q8865K4105O1888L0940k581k7816n3325o3127o7447K5281P0797
$$ plain form
11659 -51967 -31090 51413 57529 58554 7629 -71714 -56642 3438 -10731 -17680 -32363 20751
11647 20751 44939 -25723 -46351 -17541 14730 78728 80258 39658 18716 23132 69093 50869
11635 50869 68756 78614 22006 22836 -37649 -73854 -4996 18379 92997 77656 29978 17212
11623 17212 16189 374 819 6243 -65570 -44664 -24322 -42474 38814 82530 87283 24037 -9107
11610 -9107 2788 35779 -22098 -52036 -13654 51283 22541 21513 65952 76029 88691 69760
11598 69760 87632 70949 31058 -9836 -13755 -28367 -85327 -64194 -58733 26358 26341 5468 -24277
11585 -24277 -16295 1078 -64668 -39218 17274 39620 79827 60379 38675 22346 75571 111431
11573 111431 64385 -24480 -375 61513 92453 89872 62056 8731 -54396 -121843 -96562 -25765
11561b5765O7916k0836p501N021K2512r888k0660r066O996k0616l3398M6121K1664
11548B2500j0416l2646r020k0650K985Q6537K7057m6422m8448j1978k9556K9498
11536d0559j3590j8226O1772L5371J6706J5007J6286p046K9112r10J3729l6182
11524G1470m6096m1678k5014K8812m9258N08j4908M2330L5392m5780N54P6644
11512C2976j8160J3853J0271j6491j7446R480r884j0769K0564J1255k8015j01696
11500a04062J4587L8979L9377p296K7049J4220k3041K8022Q126p897K4462J0571
11488F3097j8865n3227o2376k0831O8166L5528M376l9044J6520J1129L8009K1528
11476F4010n4807L0585j8175K3908k2713L0787n5992j3245L2978J6747K4293K655
$$ plain form
11561 -25765 42151 21315 13814 18835 41347 31459 10799 1733 8729 -11887 -45285 836 22500
11548 22500 12084 -20562 -29582 -50232 -47247 39290 66347 19925 -28523 -40501 -70057 -40559
11536 -40559 -54149 -72375 -10603 24768 41474 56481 72767 65721 94833 93923 107652 71470
11524 71470 25374 -16304 -41318 -12506 -61764 -61256 -76164 -33834 1558 -44222 -43668 32976
11512 32976 14816 28669 38940 22449 5003 14483 4599 -6170 14394 25649 -2366 -104062
11500 -104062 -89475 -50496 -11119 -18415 8634 22854 -187 27835 35961 28064 52526 63097
11488 63097 44232 -8995 -71371 -92202 -24036 11492 15868 -23176 -6656 4473 42482 64010
11476 64010 9203 39788 21613 45521 22808 53595 -2397 -15642 17336 34083 58376 61031
11464F1031k093m4954j7006L1618L8391J0598L0526p401p7075o0242R1676M7327
11452A02396p9249l0827J7595k4976q5062m2963N1223J4458P273j1662L3232K0422
11440b8140M958P544L3942K5884l2050j6070J6050m0070K5666j1197k9120j0497
11428e3100O1311J0577l9633k662L3130m3320m5271k6969m010O8994N3206n0395
11416c8142j1521j2101K6288L2044J2908j3090K2002N937k4103r3140l4398M5644
11404h1672l548L6573N3195N7954J0625K3147r316j0083K8318j4138q6005k1970
11392a6920J7660J7390l863q6810m9984P010M2369L6588l7452M8492N940J2652
11380f928K1791j1060M6203Q1007m2596m5115N3746k7755p1285J8117M0574o7880
$$ plain form
11464 61031 58938 13984 -3022 28596 66987 77585 108111 100710 23635 -36607 55069 102396
11452 102396 23147 -7680 9915 -15061 -100123 -143086 -91863 -77405 -70132 -81794 -48562 -28140
11440 -28140 -23182 -15638 18304 44188 12138 -3932 12118 -27952 -2286 -13483 -42603 -53100
11428 -53100 8211 18788 -20845 -23507 9623 -33697 -78968 -105937 -109947 -40953 12253 -38142
11416 -38142 -49663 -61764 -35476 -3432 9476 -3614 18388 24325 222 -92918 -127316 -81672
11404 -81672 -85220 -48647 4548 62502 73127 96274 86958 76875 105193 91055 5050 -16920
11392 -16920 740 18130 14267 -72543 -122527 -115517 -73148 -36560 -74012 -25520 -19580 -6928
11380 -6928 14863 3803 50006 131013 88417 43302 97048 69293 -1992 16125 56699 -11181
11368a1181j4156q786K087O452n723P885l1827o6292M9821R8940O7078M4840n635
11355A33503n650J0882n9088n9378j1777R270J9295K0475L5002j4117j9795J1457
11343G0079k4886o1620j7741l253m961P807m358k4778n5240j808O3569J5372J7566
11330b4252O2479O0521N5452o59p5398j00060m7439N0344L2738P15k7833L4775
11318B1383j201k6340J9575N6507J6449R162l0959J2242j7198k4505m6995o129
11306a8009N0142K0828k127L0252l9824n5541M6283J1553n3334q411j774J9533
11294d29J2815M4320L0339n6401p1435O199J5164M3730j0040q8448n474J5038
11282f4622J0751L360L9476N500K5988N5806o2996p6612k7526P0150L3915l195
$$ plain form
11368 -11181 -25337 -34123 -32036 -25584 -31307 -23422 -55249 -121541 -71720 27220 94298 139138 133503
11355 133503 127853 138735 79647 20269 8492 17762 37057 57532 92534 78417 58622 70079
11343 70079 45193 -16427 -34168 -37421 -42382 -34575 -38933 -63711 -118951 -120759 -57190 -41818 -24252
11330 -24252 38227 98748 154200 153541 78143 -21917 -69356 -19012 13726 14441 -13392 21383
11318 21383 20182 -6158 13417 69924 86373 95535 64576 76818 59620 35115 -11880 -18009
11306 -18009 32133 52961 50834 81086 41262 -14279 32004 43557 -9777 -18188 -19962 -429
11294 -429 12386 56706 87045 30644 -40791 -34592 -19428 24302 14262 -74186 -79660 -64622
11282 -64622 -53871 -50511 -11035 -5535 20453 76259 13263 -63349 -90875 -20725 13190 9995
11270I995q143k4528o841l4000q484K3709P0174O8466Q051O417m0463j0418m6597
11257G338j8364K5902j8736J1303N714P455m7578j7390k7079m9096k6970R1097
11245e6404Q1930m121J7435m9259o9815n3400J2354j6485L6925M8151J3853J330
11233c7506N2473M5202J7181l6237j2707J3391j8374J0900M976J4017k7880k6039
11221f03l5339r2600N6541o002k0563R5189Q430l9323k8278K7732L2878K6342
11209B4404j5561o2094k3657m4036P409K2148j6721P5234J06208K9872r5965l1956
11197b4715L7845m9490m0034j6211j1936l8358K0246P9632L9987j2236J6180K4370
11185B5280M7833n770l2347o9072m9700K8760L4647r981K1614J2379j4469Q583
$$ plain form
11270 9995 1852 -22676 -29517 -63517 -72001 -48292 21882 90348 98399 104816 64353 53935 7338
11257 7338 -11026 14876 -3860 7443 13157 20612 -26966 -44356 -71435 -120531 -147501 -56404
11245 -56404 25526 21405 38840 -10419 -80234 -133634 -121280 -137765 -100840 -52689 -38836 -37506
11233 -37506 14967 60169 77350 41113 28406 41797 23423 34323 39299 53316 25436 -603
11221 -603 -35942 -128542 -72001 -78003 -98566 -3377 5053 -34270 -62548 -34816 -1938 24404
11209 24404 8843 -53251 -76908 -120944 -113535 -91387 -108108 -32874 73334 103206 7241 -24715
11197 -24715 13130 -36360 -76394 -92605 -104541 -142899 -122653 -43021 -3034 -15270 910 25280
11185 25280 73113 67343 34996 -34076 -83776 -55016 -20369 -30350 -8736 3643 -10826 -2243
11173b243l01o8632J6503L4677l2153k1925M1426M6331n2617l2064L5061l3171
11161f9108k052K351q346M1846k5331k6744L4357K3073k70O0666K5739j3655k5575
11148A6951k1968K1482O9619N0761m9619J7178R273o0324q0964J4906J9325m630
11136A990N427k9894J8769K4731k4448K1125j2798o4570K170N6767k451Q966J2819
11123A8603m0582n679k8957O2741N3202j1679l0415j3353k3384l521M1430M1249
11111E9655m47n8768m186M1885K518n942l125O69M445j4291j7025l3191l28j8798
11097d6929K0022K2123J6030J0470l2890o8648K7920K2156J9915O6515N8883q8139
11085B7428L1916L9040k5072m478K7952J8393n6926l4678k6348L6633l197J7674
$$ plain form
11173 -2243 -2544 -71176 -54673 -19996 -52149 -74074 -32648 13683 -38934 -70998 -35937 -69108
11161 -69108 -71160 -68809 -77155 -35309 -60640 -87384 -53027 -29954 -30224 30442 56181 42526 16951
11148 16951 -5017 16465 86084 136845 87226 104404 113677 53353 -27611 -12705 6620 1990
11136 1990 7417 -22477 -3708 21023 -3425 17700 4902 -59668 -57498 -731 -3182 5784 18603
11123 18603 -21979 -27658 -56615 6126 59328 47649 17234 3881 -19503 -23024 18406 59655
11111 59655 59208 440 -3746 38139 40657 34715 31590 32259 36704 22413 5388 -27803 -28131 -46929
11097 -46929 -26907 -4784 11246 21716 -11174 -79822 -51902 -29746 -9831 56684 115567 27428
11085 27428 59344 98384 73312 68834 96786 115179 58253 23575 -2773 33860 30663 48337
11073D8337j895l804k0061l1079N2629J05K7769R862l3112n9159k1793K2952k1282
11060c0531L2773K589l5349K2964k7949l0440K003j904o405L8806j5133j1787
11048f0363K0277M9967K0742o4536m1493O5889M7443o0254r4614Q3412Q5290K6877
11036G8637n32n8487K276O1159o430n4237m0879o5677L371M6171K0995j5358l9613
11023f8604J6916J4127M137L2237L0954L1699M9266l7302l7305j8104O094l1100
11011f985L3004K975m7825j7662J7401j1875k0872m7528N4839M5494j4289J6493
10999C170K8881J0883k6836r983K4883K6860O707q2867k5758M6931N2727R320
10987F4918n3900r8305l0459k9448K6919j2517O8968Q9666J7976k9914l6767j122
$$ plain form
11073 48337 46442 42638 22577 -8502 44127 44232 72001 81863 48751 -10408 -32201 -9249 -30531
11060 -30531 2242 4831 -30518 -7554 -35503 -65943 -63940 -65844 -72249 -33443 -48576 -60363
11048 -60363 -40086 9881 30623 -33913 -75406 -9517 37926 -22328 -116942 -33530 51760 78637
11036 78637 78105 19618 21894 83053 76623 22386 -18493 -84170 -80799 -34628 -13633 -28991 -68604
11023 -68604 -51688 -37561 -33424 -1187 29767 61466 110732 73430 36125 18021 24115 -6985
11011 -6985 26019 28994 -18831 -36493 -19092 -30967 -51839 -99367 -44528 966 -13323 3170
10999 3170 32051 42934 16098 6115 30998 57858 64565 -18302 -44060 2871 55598 64918
10987 64918 11018 -87287 -117746 -147194 -120275 -132792 -63824 25842 43818 13904 -22863 -23985
10975b3985Q677k7568J5510Q0610Q8110L5711j360P049n423p7911k2443M3266
10963A20243K1689k1598n1634J1334m9507j9443J5745N2296Q15l2615K3773M5070
10951A16168O9k8149L3813j5412k6572l5941n224k5069m3992O650J08136N1055
10939A35532m1198l684M0867O9763O4048K1670J6229M844J0522O3581K1459k7139
10927C76494l1224R830j0482j8292o30m1369j6917l6783n4030j3755n4320n3413
10915E5109q7918l698M9564M6713N7873K8513J3293M0650N986o3676n8791O337
10903H9955M7545j3463j3639j6952M744j7292j4791K4295P7131j5851l9329O9142
10891A81495M1480K763o0568m431L4396m8426l7676L8617n800l0832n1518k4256
$$ plain form
10975 -23985 -15308 -42876 -27366 53244 141354 177065 175705 182754 177331 99420 76977 120243
10963 120243 141932 120334 68700 80034 30527 11084 26829 79125 79940 47325 71098 116168
10951 116168 116237 88088 121901 106489 79917 43976 38752 13683 -30309 -23659 84477 135532
10939 135532 94334 90650 131517 201280 265328 286998 303227 308071 318593 382174 403633 376494
10927 376494 345270 355100 344618 326326 325696 284327 267410 230627 176597 162842 108522 55109
10915 55109 -32809 -36507 13057 59770 117643 146156 159449 200099 206085 142409 83618 89955
10903 89955 137500 124037 110398 93446 98190 80898 66107 90402 167533 151682 112353 181495
10891 181495 222975 225738 165170 160739 195135 146709 109033 147650 141850 111018 59500 35244
10879C5244K394m9817M4345K7914j7371m7035j0168J0504n354P188m332Q227j5306
10866a3567M5574j8183j0175L6986M8358k7162n9771j9682M7061j4040m90k0607
10854e698l9477M2806k2351O112N9141k0855K3889m9147p1658J9696L7010K1048
10842E16O1302K0783K1308m4917o6896k1855J8854j5904l5290M8373N7464L2375
10830G6113J7207n7168r3k5124l9012q520j3732P55l1754j4587k7720L9068P0023
10817a4544L6842q818L0373m5819l3931M3387J627J97j5795k3457R129J3877l7713
10804d4645j4714J4606P68J3700l1722L1063r408M257J2186M3233L5032o1151
10792f795p0944n2265K2578N7699L5715M2622l0665o0812N998M0910n2823r166
$$ plain form
10879 35244 37638 -12179 32166 60080 42709 -4326 -14494 -3990 -9344 -2156 -6488 1739 -13567
10866 -13567 32007 13824 3649 40635 88993 61831 2060 -17622 29439 15399 14909 -5698
10854 -5698 -45175 -2369 -24720 -18608 40533 19678 43567 -5580 -77238 -57542 -20532 516
10842 516 61818 82601 103909 58992 -7904 -29759 -10905 -26809 -62099 -13726 43738 76113
10830 76113 93320 36152 36059 10935 -28077 -36597 -50329 -49574 -81328 -95915 -123635 -84567 -14544
10817 -14544 22298 13480 43853 -1966 -35897 7490 9117 9314 -6481 -29938 -20809 -6932 -44645
10804 -44645 -59359 -44753 -43985 -30285 -62007 -30944 -40352 -36095 -23909 19324 54356 -6795
10792 -6795 -77739 -130004 -107426 -49727 -14012 28610 -2055 -62867 -56869 -15959 -68782 -77948
10780g7948K1717R142j0878J6183K2222k1905N8671j1307p4657R811M0211l3516
10768e2254l9299m6969J3402J05388N7087K822l1757m2359L3441Q3946K6662m8615
10756F1495l1911n303M0730l4858l5802J8495K1872q837l1433o920L3087M9292
10744F9907n835m7293r139j8255q1042N2101L0834k7634l76j3289O7257J4088
10732C1324j2920M368j424j6249p2680o9856J6250K8588O4502M3307M994L7277
10720E7481j9716o3878M4797j4682K7118O2358k9473m5901l47k1422N218J6102
10708A7655k2131k0171K6839O1328L5175o2352l1524Q884n471J2737M3298M5124
10696A09391M417j5770l8566k9817n5485l3285j2202J0460o803O474J4360p202
$$ plain form
10780 -77948 -56231 -47089 -57967 -41784 -19562 -41467 17204 5897 -68760 -58949 -18738 -52254
10768 -52254 -91553 -138522 -125120 -19732 37355 40177 8420 -33939 -498 83448 110110 61495
10756 61495 29584 24281 65011 30153 -5649 12846 34718 25881 -5552 -12472 20615 69907
10744 69907 64072 16779 7640 -10615 -91657 -39556 -8722 -36356 -36732 -50021 17236 31324
10732 31324 18404 22772 21348 5099 -67581 -137437 -121187 -92599 -28097 15210 20204 57481
10720 57481 37765 -26113 18684 4002 31120 93478 64005 18104 17757 -3665 1553 17655
10708 17655 -4476 -24647 2192 63520 98695 36343 4819 13703 8232 20969 64267 109391
10696 109391 113808 98038 59472 29655 -25830 -59115 -71317 -60857 -67660 -61186 -46826 -54028
10684e4028K8580n7965L3927J9662J1466j1345J787m3093N8414L3400p867p0778
10672e7840L1301l7914N5757N8782k0433l1973j9050l2009m21l9112j957M8833
10660d6036J07511K6153j2178p7411o2439r342o209M8055l7650M502O9809O2172
10648F6937j7329J3885J1743q4476k4730Q4692L9597l0907K4352j3340l209l1208
10636C6007J3092o0147k0907L7396O7495R47j7498K1919j6347m044n8855r5549
10624i6491j7302K2666O656l3659k9172N3096K4049K6867M4798N2304L4313l6269
10612E1856j3667N199l7690K9392l746J4708L4759k6910n3103m1951l5636k9556
10600a06345Q0200N193l6756J4108P3380J107J7537k251o2003k3754l1809l29
$$ plain form
10684 -54028 -25448 -83413 -49486 -29824 -18358 -29703 -27916 -71009 -12595 20805 12938 -57840
10672 -57840 -26539 -64453 -8696 50086 29653 -2320 -21370 -53379 -53800 -92912 -94869 -46036
10660 -46036 61475 87628 75450 -1961 -64400 -73742 -79951 -31896 -69546 -65044 4765 66937
10648 66937 49608 63493 75236 -9240 -33970 50722 90319 59412 83764 70424 67215 36007
10636 36007 49099 -11048 -31955 5441 72936 73883 56385 78304 61957 57913 -942 -96491
10624 -96491 -113793 -91127 -84471 -118130 -147302 -94206 -70157 -43290 1508 53812 88125 51856
10612 51856 38189 43388 5698 35090 31344 46052 80811 53901 798 -41153 -76789 -106345
10600 -106345 -26145 -20952 -57708 -43600 29780 30887 48424 46173 -15830 -39584 -71393 -71722
10588g1722K1333M8045J1548n198L9115O664l6886N311j6592k7242j6089K9438
10576a2275M0257M9012Q888m0215j1748l2502j8923M5445J8194k241l7481n2073
10564d5662r7J7657l189N2654n8679j0813O8731p776n3819o1987L1161R5073K5893
10551D9147n8701j8834p852K4368k8828N841J0961J0903m260N6510J0101r387
10539C9969p708j6916L1706k6274j0875J3909q2006l0043M1065K8183K6382N852
10527A3244n629n634m2742j5571K4386N6340m834j0497j6310N77M161K1929j1605
10514G815o2575N385L3520J3545L325L2250j1801N6851j2299K7980K0129L0753
10502A44878n127l0513k3962j2628k7417p7243K3466m6718o4454m0021J0204R1908
$$ plain form
10588 -71722 -50389 -2344 9204 4006 43121 49785 12899 18210 1618 -25624 -41713 -12275
10576 -12275 27982 76994 85882 45667 33919 1417 -17506 27939 46133 43892 6411 -45662
10564 -45662 -45759 -28102 -31291 21363 -37316 -48129 20602 12826 -40993 -102980 -71819 23254 49147
10551 49147 -9554 -28388 -36240 -11872 -40700 -34859 -23898 -12995 -17255 39255 49356 39969
10539 39969 32261 15345 47051 20777 9902 23811 -58195 -88238 -47173 -18990 7392 13244
10527 13244 7615 1981 -40761 -56332 -31946 24394 19560 9063 -7247 -6670 -2509 19420 7815
10514 7815 -54760 -49375 -15855 -2310 1015 33265 21464 78315 66016 93996 114125 144878
10502 144878 139751 109238 85276 72648 45231 -32012 -8546 -55264 -119718 -159739 -149535 -57627
10490e7627M6169K4926N3065K1772o4013j807Q084k3547l493k0665j0350L1463
10478C977K2982m5603J366M5706J232k0950o3174l2338l570L4777N6182m2271
10466d1684j182j3897M6890P1886L7597q044p9479j5004K1824j9192p0787k9959
10454a01031K7171M06k5311L2987M1020j1059L037L2786L0271K4735k4087k9311
10442A614J2503M1712O148l8384O7665N0142l6055k1708p4597k678J2217k8054
10430i475J6510K9770K681P322J1379j576m1602n8817j4790K6222l954j8463P818
10417d6975l4432K8007P4297K9517n0120J7995k1876p751J0674m5460l496L7125
10405a2495p984J1833k7765j9045J6653N3045L0181r257O268j8047j6422P339
$$ plain form
10490 -57627 -11458 13468 66533 88305 24292 22485 30569 7022 3529 -17136 -27486 3977
10478 3977 26959 -18644 -17278 28428 29660 8710 -54464 -86802 -90372 -55595 587 -41684
10466 -41684 -42866 -56763 -9873 62013 99610 91566 12087 -2917 18907 -285 -71072 -101031
10454 -101031 -73860 -73454 -98765 -65778 -24758 -35817 -32780 6 30277 55012 30925 1614
10442 1614 14117 55829 61977 23593 91258 141400 105345 83637 9040 6362 18579 -9475
10430 -9475 7035 36805 39486 46808 58187 56611 15009 -43808 -58598 -32376 -36330 -54793 -46975
10417 -46975 -81407 -53400 20897 50414 294 18289 -3587 -11338 -664 -46124 -49620 -12495
10405 -12495 -20479 -8646 -36411 -55456 -38803 14242 44423 35166 41434 23387 6965 14304
10393A4304P0880J773p9546n1429q887J3204p233L7154J5149l9718L7593N4229
10381E7473Q278m7460j8351k221l245j1570l9861m386p488Q194M3041M1703J2337
10368C6444k9705l738o3652K2659L9160L5796K7031N738o71k9335J0985j0812
10356C9900j9307j3187k2308m3649o94Q1142J036l5434N3838J7140l6515m5824
10344b3862m6164L7265n112L8859m3128k3373R365R526J0034p675J5481K4633
10332d151j6928K96O729J2818k183n1665m0893j0097M2523M1471O1055M5292n1850
10319C2417n3929N1126J3951j0837K5443P077J0650N176l7398k4649K3754O0248
10307A03029l388n9205m7720M0183J1948k2889Q133L202K4574o487M9613J0135
$$ plain form
10393 14304 85184 86957 7411 -44018 -52905 -39701 -46934 -9780 5369 -34349 3244 57473
10381 57473 65751 18291 -60 -2281 -5526 -17096 -56957 -61343 -68831 -60637 -17596 24107 36444
10368 36444 6739 3001 -60651 -37992 1168 36964 63995 69733 69062 39727 50712 39900
10356 39900 20593 7406 -14902 -58551 -59245 21897 22933 -12501 41337 58477 21962 -23862
10344 -23862 -70026 -32761 -37873 986 -42142 -65515 -56150 -46624 -36590 -44265 -28784 -4151
10332 -4151 -21079 -20783 -14054 -1236 -3419 -55084 -95977 -106074 -63551 -22080 38975 84267 32417
10319 32417 -21512 29614 43565 32728 58171 65248 75898 81074 43676 19027 42781 103029
10307 103029 99641 40436 -7284 32899 44847 21958 30091 33293 57867 51380 100993 111128
10295A11128o0592p7545k5422l822K2802r2048n1090Q459J7246O3665K7593P7786
10283A8160K4137j6791l3913q205q5022J5454N5123L3802L7787n0526k2069P451
10271b4612O4303j7469m7885k9803O5398K14p9950j0661l7k1627J04137N8995
10259F1003k2379q354J238J7769l5207J1950J5774L1759j9791k5602j0806K0203
10247C7557r920q717j2952m9332n0873p28P7991N916J9208K335Q089K9853n9720
10234a1293n9728o85j8846j5897L0395r296J870M6617K6993j3085j0841Q864M9492
10221B4560L1758j7972l2608m6551Q669O9212P3139k2494k2702l2090l4004J2851
10209A1768N2523K0586n2155n0217l6294M0331N7625N5267k0003p2625j6161J3765
$$ plain form
10295 111128 50536 -27009 -52431 -56253 -33451 -125499 -176589 -168130 -150884 -87219 -59626 18160
10283 18160 42297 25506 -8407 -16612 -101634 -86180 -31057 2745 40532 -9994 -32063 -24612
10271 -24612 39691 22222 -25663 -55466 9932 10146 -69804 -80465 -80502 -102129 2008 61003
10259 61003 38624 30270 31508 49277 14070 26020 41794 73553 53762 28160 17354 37557
10247 37557 27637 18920 5968 -43364 -94237 -94965 -16974 -11058 8150 10485 18574 48427 -11293
10234 -11293 -71021 -71706 -90552 -106449 -76054 -85350 -83480 -36863 -9870 -22955 -33796 -24932 24560
10221 24560 56318 38346 5738 -40813 -32144 37068 110207 87713 65011 32921 -1083 11768
10209 11768 64291 84877 32722 -17495 -53789 -13458 44167 99434 79431 6806 -9355 4410
10197D410k0995j2294j3381J0466M5204J5443N6745k6745n1882L3581L4069l1379
10185D3242p8895L2097K4555K8108m6418l51k4656k727N2234m217k150M618M1904
10172F7344q496n5754k2933O9889o366q8756q292K3303K2014m2996r813J5314
10160d5542J487o987O3029N596M9480K4885K7557l1728k2126k3595k1567p245
10148A3244J2667o396P2550K2867m9408P116m7413L062J3447m332J413N500j9534
10135B4783o8488m0207M4464M3913L9784k696N3214R868j6947J413m8400l0398
10123A0303j3361K6918p128R582j2673n1599k0838K6764N793M6854j3415m079
10111C121K1031p415k6697K8081N0722l0816j900J733L6240j6767n1804l3742
$$ plain form
10197 4410 -16585 -28879 -42260 -31794 13410 28853 85598 58853 6971 40552 74621 43242
10185 43242 -35653 -3556 20999 49107 2689 2338 -22318 -25045 27189 22972 20822 25440 67344
10172 67344 58848 3094 -19839 50050 43684 -45072 -53364 -30061 -8047 -51043 -60856 -45542
10160 -45542 -44055 -51042 11987 17583 67063 91948 119505 87777 65651 42056 20489 13244
10148 13244 25911 19515 92065 114932 65524 72640 25227 28289 41736 37404 38817 44317 24783
10135 24783 -43705 -83912 -39448 4465 44249 41553 94767 104635 87688 89101 40701 10303
10123 10303 -3058 23860 16732 26314 13641 -37958 -58796 -32032 -26239 20615 7200 3121
10111 3121 24152 16737 -9960 18121 68843 38027 36127 37860 74100 57333 5529 -28213
10099b8213M1801j0167o1997K2731L4119n0810L1659L2142O3322j8182k8581K6257
10087E4081l0054K894M0182M3034M6115n3484m9628j2829N3132o5045m4464l855
10075a9921P276q398m2426M502P3271K5299q8445J3942Q4565O799l222R148K6639
10062H9029M6553O1226L2086p7397L650P1285P8829M8654Q791Q3594J59724Q8544
10050F94568J85850K35544N67157J130393K022186K429272J627122N93654k128714
10041G357032k585873j358814p81455n53994l25692k24202j79403j08435r3537
10032A145627j51791r4166n6234q9908r1290j7614j0988o9538n0533J5448l7165
10021D91848J2195m2131l2724J2844n5708J3715n2373o7722l1016J4575N8867
$$ plain form
10099 -28213 13588 3421 -58576 -35845 -1726 -52536 -20877 11265 74587 56405 27824 54081
10087 54081 24027 26921 67103 110137 156252 102768 53140 40311 93443 28398 -16066 -19921
10075 -19921 -12645 -21043 -63469 -58967 14304 39603 -48842 -34900 49665 56464 53242 62390 89029
10062 89029 135582 196808 228894 151497 155147 226432 305261 353915 362706 446300 606024 694568
10050 694568 880418 1115962 1683119 2813512 4835698 7264970 8892092 9485746 7357032
10041 7357032 4771159 3412345 2630890 2076896 1751204 1527002 1347599 1239164 1145627
10032 1145627 993836 899670 843436 753528 662238 644624 633636 564098 513565 529013 491848
10021 491848 504043 461912 429188 442032 386324 400039 347666 279944 248928 263503 322370
10010C22370K2576m6786l7791m2863k8487j6879J7578j7133Q939o9350J1322Q263
9998A31759K9811l243K5428M7839j8611m8613J4352J2518l3699p0601m6881K8314
9986F8373M0869K3206j4765k2702k1008l7011k9393j0276J12545O4791K732o4807
9974A12554o7149L557M8189j8908n0961j492Q5748k6470m5108j0727K6311K8105
9962H3649q237j4008j0027j7466p042J4772N0388p31m8804n527j0408j7651L1644
9949D0552K701m600j0386n4240J0661j7572K4740N3927k7068K7489l1367J6726
9937C1563P2378m509J5811m022J6318R6n1461n0518j7424Q992J41j7427n1050
9924e1112M978K7474M631q141r993J3168m1568l56K0428p29o543n930J4333N454
$$ plain form
10010 322370 344946 298160 260369 217506 189019 172140 189718 172585 181524 112174 123496 131759
9998 131759 161570 158327 183755 231594 212983 164370 178722 191240 157541 86940 40059 68373
9986 68373 109242 132448 117683 94981 73973 36962 7569 -2707 109838 174629 177361 112554
9974 112554 45405 48962 97151 78243 27282 25790 111538 85068 39960 29233 55544 83649
9962 83649 75412 61404 51377 33911 26869 41641 92029 91298 42494 36967 26559 8908 40552
9949 40552 43253 38653 28267 -25973 -15312 -32884 -8144 45783 18715 46204 14837 31563
9937 31563 103941 99432 115243 111221 127539 127635 76174 25656 8232 17224 17365 -62 -51112
9924 -51112 -46134 -18660 -14029 -22170 -32163 -18995 -60563 -60919 -40491 -41220 -47763 -53693 -39360 -33906
9910c3906L0095J2403L4457k762L589K4523j3539o367M6J7538K143P556L8643
9897A14419m8956k6029l0593n6765L1768O5501N8852l1447p6758l4795L5140J7153
9885A7490J3167m8072l2315J8036m390N5150L7778m0756n7502m560L1197k3414
9873c8191m5122K7067M6142j5340m5048l5920j6794P2734j0737K621n6131l5511
9861a50230L161Q103Q3486Q097k469K4071L591P8659M7614J7866n053k6799o1165
9848B8932l022J4208q741j599j1295J9884L5629P267l622m0817K1219l0908n3923
9835b6788J9053K9626P9255K0760l0185j05717m7019N563K2772M4358N3516K451
9823F7645o0443k9349O5725j5618m9073j4375M17K0181L6076L9267J0200k8609
$$ plain form
9910 -33906 -3811 8592 43049 40287 43876 68399 54860 48493 48539 66077 68220 75776 114419
9897 114419 65463 39434 8841 -47924 -16156 49345 108197 76750 -8 -34803 337 17490
9885 17490 30657 -17415 -49730 -31694 -36084 19066 56844 16088 -41414 -45974 -14777 -38191
9873 -38191 -83313 -56246 -10104 -25444 -70492 -106412 -123206 -50472 -61209 -58588 -114719 -150230
9861 -150230 -147069 -138966 -55480 -47383 -49852 -25781 -22190 56469 104083 121949 116896 90097 28932
9848 28932 25910 40118 31377 29778 18483 38367 73996 81263 77641 36824 58043 27135 -26788
9835 -26788 -7735 21891 101146 121906 91721 -13996 -61015 -55452 -32680 11678 65194 67645
9823 67645 7202 -22147 43578 27960 -21113 -35488 -35071 -14890 21186 60453 70653 42044
9811D2044j5387m1025O022j3087J1146L9803K8820p4647l9888L919K5377J9157
9799g746J09112L2894n8849o224l273K1985p7510p507K4522L3163M0721j7781
9787H3507l4301m6588m942N3492N7176j6377k5723j1579J6784l5885m5953o814
9775a7203J3166L7478n3457m675m542M645K3988m9837j4357J1856M7230K218o217
9762i707n954p79J970P9679K0932L2672l3030j2501k7115k9811m449j8915p0567
9749g7575J674R177M459K6847L4125l6282N5815M8255O2168L6343o1797K5071
9737A28280k0717p5265k7421J015o9694k9202N8218j9958J530R3780Q9962q4080
9725D6448r2665J9290R3834K3107m9381m7432j9185N0740K5449l3584n3458j7092
$$ plain form
9811 42044 26657 -14368 -8346 -21433 -10287 29516 58336 -16311 -56199 -52280 -26903 -7746
9799 -7746 101366 134260 75411 69187 65914 87899 10389 2882 27404 60567 101288 83507
9787 83507 49206 2618 -2324 51168 108344 91967 66244 54665 71449 35564 -10389 -17203
9775 -17203 -4037 33441 -20016 -24691 -29233 -24588 -600 -50437 -64794 -52938 -5708 -3490 -9707
9762 -9707 -15661 -16440 -14470 65209 86141 118813 85783 73282 46167 16356 11907 -7008 -77575
9749 -77575 -75901 -66724 -62265 -35418 -1293 -37575 18240 66495 128663 165006 103209 128280
9737 128280 107563 32298 4877 5892 -63802 -93004 -34786 -54744 -53214 40566 130528 46448
9725 46448 -46217 -26927 66907 90014 40633 -6799 -25984 24756 50205 16621 -36837 -53929
9713e3929K4885J04895M3871J3885l6071j6146j6248j5103j3909J8558l6769J1431
9701B9350K3762k8112k4460l7610P5840M0619J6601m7737l0607M259n094p9205
9689f2394L5785O6279n8004K069M6402N445j2601k4030k9181j8539R3390L3988
9677G8609n4042p1245O63L3157K5321m3487L159R410l7758J0391M5604k8203k0456
9664d8877o7963L0818L0963k0945J4266L794m4958k9443K6893K0866R1738K4098
9652C1250l05J725n7733M8184j2826J4557l451J9721j5070K4044J3774o5437m0832
9639d2399j0487L7763M0441j4206r65m516j8578k2619L0795j794r177K1328l308
9626B278l0877n817n168K7055J8006K2250R910M0857P217L7415n1746m4172L8674
$$ plain form
9713 -53929 -29044 75851 119722 133607 97536 81390 65142 50039 36130 54688 17919 29350
9701 29350 53112 25000 540 -37070 38770 79389 95990 48253 17646 21905 16811 -62394
9689 -62394 -26609 39670 -18334 -16265 30137 35582 22981 -1049 -30230 -48769 44621 78609
9677 78609 24567 -46678 -46015 -12858 12463 -31024 -27865 -18455 -56213 -45822 -218 -28421 -48877
9664 -48877 -116840 -86022 -55059 -76004 -61738 -57944 -102902 -132345 -105452 -84586 7152 31250
9652 31250 30945 32670 -25063 23121 10295 24852 21401 41122 26052 50096 63870 -1567 -42399
9639 -42399 -52886 -15123 25318 11112 10147 5631 -12947 -35566 -4771 -6565 -15742 5586 2278
9626 2278 -28599 -34416 -39584 -12529 5477 27727 37637 78494 85711 123126 71380 27208 65882
9613F5882m6622k9508L4120k0009Q11Q912k7309j8740M1154j323o315l940m2993
9600d5880J4570J6727J0321J0494N2901P9928L9500q8388q6859q0255Q834P1318
9588C211L8911n607M642n7619J03920L2370j08173p4214k0179l4570J3673J1504
9576i2131k6316J1144k5257M0083Q4474Q7263p874m4610r2601m2476M3968L1530
9564c2803j7228L1543L7079K1303j3552j1689j2244k7944J9232j2458P0882q621
9552D3500K9680L7964q5650O4432j0921p6813j8625m3825l4088J9656J3577L5374
9540b5739Q069o9712o237k065l131K6601q099j1787J7603K8881K5383L6042L4666
9527E0475m1729j1093k8267k5501J8901j5512K0318J0663k3556n098K3261O0390
$$ plain form
9613 65882 19260 -10248 23872 3863 4674 13586 -13723 -32463 8691 7368 1053 -2887 -45880
9600 -45880 -31310 -14583 -4262 6232 59133 139061 178561 90173 3314 -76941 -68107 3211
9588 3211 42122 36515 41157 -16462 87458 119828 11655 -62559 -82738 -117308 -103635 -92131
9576 -92131 -118447 -107303 -132560 -92477 -8003 79260 71386 26776 -65825 -108301 -64333 -32803
9564 -32803 -50031 -18488 18591 39894 26342 14653 2409 -25535 -6303 -18761 52121 43500
9552 43500 73180 111144 25494 89926 79005 2192 -16433 -60258 -94346 -74690 -61113 -25739
9540 -25739 -17670 -87382 -93619 -95684 -98815 -72214 -80313 -92100 -74497 -45616 -20233 15809 50475
9527 50475 8746 -2347 -30614 -56115 -37214 -52726 -32408 -21745 -45301 -50399 -27138 33252
9515C3252J7458l7360n2305o341J827J3028Q3324j5372O213L2632j6049n0595
9503I712K0887J922n0422J9539L6966J1222Q204J005n384J2323J4956k1501k8769
9490C0660n8011j0564R686k233j8422k5862K0404K1189J8170m251Q219R654K7898
9477B6537O5383K2808K1160k9042k2432o2008J1176M2929J9504j0525r8366J52
9465a2724K4658p708K8092L6420n3631k9652m1063J7073M9116O7811k1015l3064
9453B4313L780J6381k5507l4977J9771j1746j8695k7595P9727J04560N073o5515
9441F9570O230k9018L8523K2292k1540j6408n806l9800k4383K0782J9139o6721
9429b7140k4347M573m4802O235K7306O8530J8703P828O760l9284j5198J6671K8417
$$ plain form
9515 33252 50710 13350 -38955 -45296 -43469 -30441 52883 37511 43724 76356 60307 9712
9503 9712 30599 32521 -17901 1638 38604 49826 58030 59035 53651 65974 80930 59429 30660
9490 30660 -27351 -37915 -28229 -30462 -48884 -74746 -54342 -33153 -14983 -19234 -11015 -1361 26537
9477 26537 91920 114728 135888 106846 84414 22406 33582 76511 96015 85490 -12876 -12724
9465 -12724 11934 4226 32318 68738 15107 -14545 -55608 -38535 10581 78392 57377 24313
9453 24313 28093 44474 18967 -16010 3761 -7985 -26680 -54275 25452 130012 135085 69570
9441 69570 75800 46782 85305 107597 86057 69649 63843 24043 -340 20442 39581 -27140
9429 -27140 -51487 -46914 -91716 -85481 -58175 10355 29058 36886 43646 4362 -10836 5835 34252
9416C4252k7230j3262Q4287j9296l5820r673l518N286M3210K2449P434L4581K1984
9403A44684L2207L582j00783l3411k367j1538J5520P7833r223l1635l0330M4707
9391I9246j2685p5690k1521k6j68j0016k4780Q149o027j6799n421j1820o52Q9103
9377A0893K3981l1934J6768O9745q43k0335p151o293n1888j0198l0095r896l988
9364e1234M77j763L7959K634k4514l9864L5708K3407R0758L4371j7849O622L9726
9351A36438n6765m4614n940N203N712n0074J1106j2926K309K048N763N2431L5460
9338H6151n4068k9389M2076K3155P176Q7180q750j6424l0389J033m9787l5996
9326B1968M0484N9728l3612L1166J1412m6484l4478k7415N6758k8046L5155Q211
$$ plain form
9416 34252 7022 -6240 78047 58751 22931 13258 9740 15026 58236 80685 88119 122700 144684
9403 144684 176891 180473 79690 46279 43912 32374 47894 125727 116504 84869 54539 99246
9391 99246 86561 10871 -10650 -10676 -10844 -20860 -45640 -37491 -43518 -60317 -65738 -77558 -78210 10893
9377 10893 34874 2940 19708 89453 88610 68275 61124 54831 2943 -7255 -37350 -47246 -51234
9364 -51234 -50757 -52520 -14561 -11927 -36441 -76305 -40597 -17190 73568 107939 90090 96712 136438
9351 136438 79673 35059 29119 34322 40034 -10040 1066 -11860 -9551 -7503 -1740 50691 86151
9338 86151 32083 2694 44770 67925 75101 162281 153531 137107 106718 107751 57964 21968
9326 21968 62452 122180 88568 119734 131146 84662 50184 22769 79527 51481 86636 94847
9314I4847M6400J7102l1580o634k7554J8300l676k5258j2570J1458K7356L7636
9302A45827j804L8742R579r3137l1064m230l2586K9192M5519j5090j6962L4091
9290A08077N2152J03796j121m3893m7134o9R223l2938k5615K5495K9279J8936
9278A96188m9203J8733K0976K361L8754P200K7850m1059M948n34m1034n942q056
9265A71182Q7432K2849j5342r057J1875L999r0140n4884L7880R64K3702K6727
9253B17187L0322M5888l4911p336L9448K1794L0264o2503l0907N7431J7058J8730
9241C42465j9136l4813K0213k5249L5545J9401J110L2610M4147j3190o5741k9242
9229C08120L360L1989J10681P462j3805k0745L8260L5108J4470k2832l2120k2521
$$ plain form
9314 94847 141247 158349 126769 120135 92581 110881 107205 81947 69377 80835 108191 145827
9302 145827 144023 182765 192344 99207 68143 63913 31327 60519 106038 90948 73986 108077
9290 108077 160229 264025 262904 219011 171877 171808 181031 148093 122478 147973 177252 196188
9278 196188 146985 165718 186694 189055 227809 235009 262859 221800 226748 226214 185180 179238 171182
9265 171182 258614 281463 266121 257064 268939 272938 182798 127914 165794 166758 190460 217187
9253 217187 247509 293397 258486 251150 290598 312392 342656 280153 249246 306677 323735 342465
9241 342465 323329 288516 308729 283480 319025 338426 339536 372146 416293 403103 337362 308120
9229 308120 311480 343469 454150 461612 447807 427062 465322 500430 514900 492068 459948 437427
9217D37427m3650L1830K5247K8478L3302L9027L6610j5148k130k342J7242K0685
9205F06578k8844L3453O5666L8688L3498M8267K1209O3969L4991j9888N3339L520
9193I54446P1499L6102J4889K3709K1886j9070M1461P8805P4320P1122J5178J3429
9181A397776R0244L5883N1454N1806O2169J01128O2649Q9717O2790P0236R3880
9170B169732J58487J56948R6880J09775J51406J71432K30861K06895J44183J57493
9160C754092J34078Q6124K16682J91566K19263J78960K46745K53987J93186J97649
9150E672332K24766J77858J62741J26806J06214Q6194N5751K3644K5554n0515
9140F611345p5741j23259n2456j05344j21975j62137j44843j44210k09252j22379
$$ plain form
9217 437427 393777 425607 450854 479332 512634 551661 588271 573123 570993 568651 585893 606578
9205 606578 577734 611187 676853 715541 749039 797306 818515 882484 917475 897587 950926 954446
9193 954446 1025945 1062047 1076936 1100645 1122531 1103461 1144922 1223727 1298047 1369169 1384347 1397776
9181 1397776 1488020 1523903 1575357 1627163 1689332 1790460 1853109 1942826 2005616 2075852 2169732
9170 2169732 2328219 2485167 2582047 2691822 2843228 3014660 3245521 3452416 3596599 3754092
9160 3754092 3888170 3974294 4190976 4382542 4601805 4780765 5027510 5281497 5474683 5672332
9150 5672332 5897098 6074956 6237697 6364503 6470717 6556911 6612662 6636306 6661860 6611345
9140 6611345 6535604 6412345 6359889 6254545 6132570 5970433 5825590 5681380 5472128 5349749
9130E349749j33017j87575j72487j65437j50012j58929j33192j45150j87432j45499
9120C771019j15942p7527j41866j47504j11431j51233o3874j03753j18162m6831
9110B692896j05637p3589r3841j02572q3244j11387o2735n4293n2660j0054N2205
9099A995089q7770j22128j03826j33433l6721m8417n0918j5753o7565j3443N555
9088A320670q3843l4865k5219m8823K7265J7177L994n0153m7414o7175M690l3652
9076I82652k032k9206l712p4607J4346P2299l817m0215j7429m7853o6916l9743
9064G43767m2070N589j0907J3473j010L443L310m7123p0836k1133L009K6812J8598
9051F24922k4281Q27l1918l5360K6440J462n67n2231o1519j7692m473m4753K5887
$$ plain form
9130 5349749 5216732 5029157 4856670 4691233 4541221 4382292 4249100 4103950 3916518 3771019
9120 3771019 3655077 3577550 3435684 3288180 3176749 3025516 2961642 2857889 2739727 2692896
9110 2692896 2587259 2513670 2419829 2317257 2234013 2122626 2059891 2005598 1952938 1942884 1995089
9099 1995089 1907319 1785191 1681365 1547932 1511211 1462794 1411876 1396123 1328558 1315115 1320670
9088 1320670 1236827 1201962 1176743 1127920 1155185 1172362 1176356 1126203 1078789 1011614 1016304 982652
9076 982652 980620 951414 947702 873095 887441 959740 955923 915708 898279 850426 783510 743767
9064 743767 701697 707286 696379 709852 708842 712285 715595 668472 597636 576503 579512 606324 624922
9051 624922 600641 601468 569550 534190 560630 562092 561525 509294 447775 430083 425610 380857 406744
9038D06744N2269k3212k0957j9360N987j5126j3383J8452j5838l0847q699j5983
9026C20047K163J0883j6237J2105J369K996n0206o6071j015J0347n187j7571O89
9013B04312R6492N5389j0514k4284j6288j3615k1934L2480M0233M4898k1966n3829
9001C11374n9420p432L0654j5747o7820P840J6625m6224p4591j9530J6593K2291
8989A14613K4024l0484l5501L5774M9654k2956j2452K4578k7275k282L8652j0410
8977A45935K320L9889M3605M8096k2857l1298K73K1293q384k0832L393m2727J5236
8964A93942K1287q163l4791o1309m8062J221r644K2347J4687N0463K4469J0631
8952A77078l4304q2169j1390P347L5143K7261k3806j3074O223k4352j3072L032
$$ plain form
9038 406744 459013 435801 414844 395484 401471 386345 372962 391414 375576 344729 336030 320047
9026 320047 322210 333093 316856 328961 330330 333326 283120 217049 216034 226381 221194 203623 204312
9013 204312 300804 356193 345679 321395 305107 291492 269558 302038 342271 387169 365203 311374
9001 311374 251954 244522 275176 259429 191609 199449 216074 169850 95259 75729 92322 114613
8989 114613 138637 108153 72652 108426 158080 135124 122672 147250 119975 117693 156345 145935
8977 145935 148255 188144 231749 279845 256988 225690 225963 247256 238872 218040 221433 178706 193942
8964 193942 215229 207066 172275 110966 62904 64125 54481 76828 91515 141978 166447 177078
8952 177078 142774 60605 49215 56562 91705 118966 95160 82086 88309 63957 50885 53917
8940E3917R403N0901M248l4819m978M052N0929m9164k4387J0644J6999O1848O162
8927A55755Q074N066k0072q986j3691K225j6608p666O416o5709n5315K0643j7614
8914g482L8240J9158o4187m17M0029N2329K8773l5688o499K9282J8214n6627j6444
8901C8681J4657N1931m0142l4575K5572K3490j4627J2299j678O728p480j3275
8889F1581l7998j2432m1814o706o203r835L9033R1906K6700k1384o2987L8635
8877E8496M305m5760l5558j8523O687k1462O4325P3415L2634m0499O722L4748
8865A19530k205l7411J6547K0609j1446J187L2126j7349q6497k7397K6606K3608
8853E7908o961k9802q984J571J3425L6220L1290L7659k0684l9058r006J2295J9385
$$ plain form
8940 53917 63320 114221 118469 83650 78672 82724 133653 84489 60102 70746 87745 149593 155755
8927 155755 163829 168895 148823 139837 126146 128371 111763 104097 110513 44804 -10511 10132 -7482
8914 -7482 30758 49916 -14271 -14688 25341 77670 106443 70755 64256 93538 111752 55125 38681
8901 38681 53338 105269 65127 30552 56124 79614 64987 77286 75608 82336 74856 61581
8889 61581 23583 11151 -30663 -37369 -43572 -53407 -14374 77532 104232 82848 19861 58496
8877 58496 62801 17041 -18517 -37040 -30353 -51815 12510 85925 118559 78060 84782 119530
8865 119530 117325 79914 96461 117070 105624 106811 138937 121588 35091 7694 34300 57908
8853 57908 50947 21145 12161 13732 27157 63377 94667 132326 111642 72584 63578 75873 95258
8840I5258j8108n1499r08M9340K1424q855J8l3301l3361K4765j4517n1810j5639
8827c7193n2572o140r754k5532O2985O7165n339j0997n28Q516m3966j8552P221
8814f4686O507P350L2595L6454N5269J0546o1385J6357l3027M817M5046N4670
8802A10513j6021n9560m1741K8366k953J2896N3335O427j4305j2369j083J1358
8790G4863K221k9679m4984k6567j9408j4637L5416N2881o2295m9824J1155j8642
8778h9500M8709M1390L1404m853M737j122K5612j0034J72l8660j6888n342M8073
8765C3698J4399l4341j4977k4976O4382p296q811n482l7004M0563M4l3454O563
8752f692O006P880j9596n9761n337R676J08418J6791j2507k8230o2124l9169K4824
$$ plain form
8840 95258 77150 25651 24743 74083 95507 86652 86670 53369 20008 44773 30256 -21554 -37193
8827 -37193 -89765 -95905 -105659 -131191 -68206 -1041 -6380 -17377 -17905 -9389 -53355 -71907 -64686
8814 -64686 -58179 -50829 -18234 18220 73489 84035 22650 39007 5980 10797 55843 110513
8802 110513 94492 34932 -6809 21557 18604 31500 84835 91262 76957 64588 63505 74863
8790 74863 77084 47405 2421 -24146 -43554 -58191 -22775 30106 -32189 -82013 -70858 -89500
8778 -89500 -40791 599 32003 27150 31887 30765 56377 46343 46515 7855 -9033 -14375 33698
8765 33698 48097 13756 -1221 -26197 38185 30889 22078 16596 -20408 20155 20199 -13255 -6692
8752 -6692 -686 7194 -12402 -72163 -77500 -67824 40594 57385 44878 16648 -45476 -84645 -59821
8739e9821J4814j2685L6924J6817j510J7129n635K138J3983k3379n4943Q17J0519
8726d4832j0450K0614J375M1946J1181O7858j1499j8202n2780j3538O1412L0335
8714H3420r050j2503N0987J7063r4145K9542L1602J2756j04768j1987R974M1497
8702D4388M2432L6104L4565p0604k9919J2599q840o570K0558M041j8283j6126
8690D4345k3839l693K140O380K7770L958n5527j0023k7149J3106M0135j1065K348
8677H886J9307P747m7264j4912j4140O397m1001P008K7720M4164N9703K333m4924
8664B1024k3621k2962j7309k6680K0458k1958R155j5418l0375K6701K5802P2136
8652A6953J9086j2271p402K3718K8423J4069j7748k7291o0479K6310L2888P48
$$ plain form
8739 -59821 -45007 -57692 -20768 -3951 -5461 11668 6033 8171 22154 -1225 -56168 -55351 -44832
8726 -44832 -55282 -34668 -33293 8653 19834 87692 76193 57991 5211 -8327 53085 83420
8714 83420 74370 61867 112854 129917 35772 65314 96916 109672 4904 -7083 2891 44388
8702 44388 86820 122924 157489 86885 56966 69565 60725 54155 74713 78754 60471 44345
8690 44345 20506 16813 18953 25333 53103 57061 1534 -8489 -35638 -22532 17603 6538 8886
8677 8886 28193 35940 -11324 -26236 -40376 -33979 -74980 -67972 -40252 3912 63615 65948 21024
8664 21024 -2597 -25559 -42868 -69548 -49090 -71048 -61893 -77311 -107686 -80985 -55183 16953
8652 16953 36039 23768 16366 40084 68507 82576 64828 37537 -22942 3368 36256 37004
8640C7004p892O837J0300M865K9040m1875l8644R001J2962o757N3107m3151l8761
8627a3964K4504O2748M2263o6196l9052j9286L8146N9777R2058J6807n2974l2626
8615A12205k3298o3380J5065O6978N5133K6506k3048o1720J031l7113n0231k3811
8603e683P0468M6517j585K6498p074L6004o7451l1055R918L283m3176r2352N820
8590d9868L1069O1656J1202j0725L000O839m957K029L8040l0673j6741j0363j9106
8577A1402l2902k0815k6079l7509q840L7020N876L8850K1007k6195j0215j2924
8565f1324J2476M2023p373r003P0150K8875j1553j793K2748K9077J379j1919O2713
8552A66476k2525j02429n0049M7868K4912k3805k8536l6104j2456k5682L3940
$$ plain form
8640 37004 29112 35949 46249 51114 80154 38279 -365 8636 21598 14841 67948 24797 -13964
8627 -13964 10540 73288 115551 49355 10303 -8983 29163 88940 180998 197805 144831 112205
8615 112205 88907 25527 40592 107570 162703 189209 166161 104441 105472 68359 18128 -5683
8603 -5683 64785 111302 109717 136215 129141 165145 97694 66639 76557 79840 36664 -55688 -49868
8590 -49868 -18799 42857 54059 43334 46334 53173 48216 50245 88285 57612 40871 30508 11402
8577 11402 -21500 -42315 -68394 -105903 -114743 -77723 -71847 -32997 -11990 -38185 -48400 -61324
8565 -61324 -48848 -6825 -14198 -23201 46949 75824 64271 62478 85226 114303 115682 103763 166476
8552 166476 143951 41522 -8527 39341 64253 40448 11912 -24192 -36648 -62330 -28390
8541b8390o515K9039j0554L8143K9016p826m6254l7340J5023L421q415l3131J3384
8528e0399O5073N1858L9076K4864l8363k3057l6918K6465p832N7811J683M0742
8516A51003j1229n8850o2511o683j0455P403k0343m6628j7431L8218P4366j0508
8504B6352j3839L3403L2748j02750k5484M5830j4112J2254M2328K5883n6177p462
8492a026J7794K6993k7490j7208l0589K6211M0481J024o010L1118l7779l6585
8480a3066J4252j9734l44J5110m1954r359l792N318l929l116O9425M1803K0964
8467G1578m5620m6921N741j5954J8958l638k8379l8640m960j0797M9652P0610
8455B1630j1724l4523j1023K2354m8548j2764M6656J5402O1019M6720n3256L2222
$$ plain form
8541 -28390 -34905 -5866 -16420 21723 50739 42913 -3341 -40681 -25658 -22237 -30652 -63783 -50399
8528 -50399 14674 66532 105608 130472 92109 69052 32134 58599 50767 108578 110261 151003
8516 151003 139774 80924 18413 11730 1275 8678 -11665 -58293 -75724 -37506 36860 26352
8504 26352 12513 45916 78664 -24086 -49570 -3740 -17852 -5598 36730 62613 6436 -1026
8492 -1026 16768 43761 16271 -937 -31526 -5315 35166 36190 30180 61298 23519 -13066
8480 -13066 1186 -18548 -18892 -3782 -45736 -55095 -58887 -53569 -57498 -60614 8811 50614 71578
8467 71578 25958 -20963 -15222 -31176 -12218 -15856 -44235 -82875 -87835 -98632 -48980 21630
8455 21630 9906 -24617 -35640 -13286 -61834 -74598 -27942 -12540 48479 95199 41943 74165
8443G4165j4064n7344m5697p1176L4789J6691K1830L4561j647J135m722k3098
8431c4577l3116o906L0298N5738K5501k5526o0466K0464n166k994k444J5421O9322
8418D5549j9471q400K23J1581l9036j5704P584L0892L5191N6290M3907j0790n1012
8405H6804o619L7239n1139p5098j0123O1859q882J3918O187l3242k9728k5154
8393c3978K3439j0955n2518j8298Q385K5520L4887p370M8305P709J7397j6316
8381B6207r303J726K5706L190k1459J8379j1410o1867K3053K18K1304N0500j699
8368F4545j0602J088k6355r828m1066m4652j355L3616N7174m1923K158J3924n6594
8355e9870k598N550J0391K1121m207L0047L2944J1155o7j9050o5030j0340L0403
$$ plain form
8443 74165 60101 2757 -42940 -114116 -79327 -62636 -40806 -6245 -7892 -6757 -11479 -34577
8431 -34577 -67693 -74599 -44301 11437 36938 11412 -49054 -28590 -33756 -36750 -39194 -23773 45549
8418 45549 26078 17678 17901 29482 -9554 -25258 -17674 13218 48409 104699 148606 137816 86804
8405 86804 80185 117424 66285 -8813 -18936 42923 34041 47959 54146 20904 -8824 -33978
8393 -33978 -10539 -21494 -74012 -92310 -83925 -58405 -23518 -30888 17417 25126 42523 26207
8381 26207 16904 18630 44336 47526 26067 44446 33036 -28831 -5778 -5560 15744 66244 64545
8368 64545 53943 55031 28676 18848 -22218 -66870 -68225 -34609 22565 -19358 -17200 -3276 -59870
8355 -59870 -62468 -56918 -46527 -25406 -29613 434 33378 44533 44466 25416 -39614 -49954 -19551
8342a9551l0050N0950M6005J1341o1779l1306K5331q803P183P2962N3712n490
8330A10505o2758k5702N4493k4567P000L157o0722j1331j888k2147k0768P492
8318d7236j2973J5061J2713l0870n586j4800K1697L1232l9615j3424r779P869
8306h5711J7457M7552M253J5210N5450L2112k9102j7980j4878l8619k2882n2355
8294h9493n5729M7273O9764j5764n7750j2372k522Q2011O3332r270p806J2964
8282B4638n0586Q349N9599k7365l7377l8258o760k6503k1593l361O8995l16K2833
8269b7705N0375K3756J5180l7660o0584j8986L8557L5100K7108J7519k8997J7320
8257E0983M3668j9585p5891l1249N204L0866J0313o6696K5104Q2641k9098l6354
$$ plain form
8342 -19551 -49601 1349 47354 58695 -3084 -34390 -9059 -17862 -10679 62283 115995 110505
8330 110505 47747 22045 76538 51971 58971 62128 1406 -9925 -11813 -33960 -54728 -47236
8318 -47236 -60209 -45148 -32435 -63305 -68891 -83691 -61994 -30762 -70377 -83801 -93580 -85711
8306 -85711 -68254 -20702 -16449 -1239 54211 86323 57221 39241 24363 -14256 -37138 -89493
8294 -89493 -145222 -97949 -28185 -43949 -101699 -114071 -116593 -34582 28750 19480 11674 24638
8282 24638 -25948 -17599 42000 14635 -22742 -61000 -67760 -94263 -115856 -119217 -50222 -50538 -27705
8269 -27705 22670 46426 61606 23946 -36638 -55624 -17067 18033 45141 62660 33663 50983
8257 50983 94651 75066 -825 -32074 -26870 3996 14309 -52387 -27283 55358 26260 -10094
8245a0094k27p078l3873j8795p30k4085L6303L7943j0067o0675N2100L8054o0611
8232f1835m3046N2093L779K4720M598J1228J1486N566l2705j4861l1338j0845
8220h1160P0592K0843l7218J2723K3913m369K5526k8166k5127k0052n8554J0121
8208i0928L2111J7079j170N6004N1512j6762l8057o796k051k29m5767j190K7465
8195a8779M5794M8023K7914l9039k7778K9603l0585N604Q4588o1622j03904K9952
8183a0229M0537q3609k6418J00622L2871k0349l0113J416j2315K3352l6721m5706
8171f6662O31N4022K4962l5863p3496N9648L2557m6291J3685O9135l6732K3864
8159A9460j3501o4011k286K4549N2771p709L0207L318J2649j9350L171k0956o352
$$ plain form
8245 -10094 -10321 -17399 -51272 -70067 -70797 -94882 -58579 -20636 -30703 -91378 -39278 -1224 -61835
8232 -61835 -104881 -52788 -49009 -24289 -19691 -8463 3023 8589 -24116 -38977 -70315 -81160
8220 -81160 -10568 10275 -26943 -14220 9693 5324 30850 2684 -22443 -42495 -101049 -90928
8208 -90928 -58817 -41738 -42908 13096 64608 47846 9789 2993 942 713 -45054 -46244 -18779
8195 -18779 27015 75038 102952 63913 36135 65738 35153 40757 125345 63723 -40181 -10229
8183 -10229 30308 -53301 -79719 20903 53774 33425 3312 4728 -7587 15765 -20956 -66662
8171 -66662 -66031 -12009 12953 -22910 -96406 -36758 -4201 -50492 -36807 32328 -4404 19460
8159 19460 5959 -58052 -60338 -35789 16982 9273 39480 42798 55447 36097 39268 18312 11960
8146A1960L0875M0936L6919m1116q894J0954j7379l4630O339O6891R145J3802
8134A25802m5003k7789r0192j9677J9572M6405k7148n1967J4459K5844R357P553
8122a2784l3573J1441J0489n455L0732o090r442l6211J7674R149O1602J9517j9307
8109C7742j933m9214j1564J1639k3310L50L3584K7068O492j4086L1612O595j6467
8096C8508q156j6391M0391j6545l0657M9660K5220k4675P797k9057r167J8021
8084D4949K9419l820j5609n465j3435p0951M1895P2862j580J0215o225p897j8234
8071E6124j4501M5756J462O057k3689q2506o6487N4386O9087J9888M1308O9087
8059A75972n6070l4960J5819p1869l8744n8252k510M4061L5835M9864K536r596
$$ plain form
8146 11960 42835 83771 120690 79574 70680 81634 64255 29625 35964 102855 112000 125802
8134 125802 80799 53010 -37182 -56859 -37287 9118 -18030 -69997 -55538 -29694 -20337 -12784
8122 -12784 -46357 -34916 -24427 -29882 850 -5240 -14682 -50893 -33219 -24070 37532 57049 37742
8109 37742 35809 -13405 -24969 -13330 -36640 -36290 -2706 24362 30854 16768 48380 54975 38508
8096 38508 30352 13961 54352 37807 7150 56810 82030 57355 65152 36095 26928 44949
8084 44949 74368 70548 54939 49474 36039 -34912 6983 79845 78265 88480 82255 74358 56124
8071 56124 41623 87379 88841 94898 71209 -11297 -77784 -23398 45689 65577 106885 175972
8059 175972 119902 84942 100761 28892 -9852 -68104 -70614 -26553 9282 59146 61682 52086
8047E2086L560o7248P051K0345o561o670n105o481Q578J7188J6876q090K2263
8034D7792j245k3158l3001l9178k8403n3953N3908O5601K4924N8k0894k2057m7767
8021g7373l1566L7721N1715o3224J1331N0604M5700L547m2367l851N988l7456
8009d9231L3509R103k9765N994k2811L0248Q929n658K8763K7491m7019J6174M9534
7996E5261l6947r826N1390K842N1501L0725l3218k4229k6964k7857J027K1419
7984E5124k9724l0629K9122N1067J6417n9776k9563k6111q762O3290R6015M9609
7972A76079m9661q9744p8015J1193J7511J077O801l0919L3807J6021L5015J4271
7960F3436K2979n9068m8200L2363L100j7475j2294R9593P551n3016K6625K4772
$$ plain form
8047 52086 55646 -11602 -4551 15794 9233 2563 -2542 -9023 -445 16743 33619 25529 47792
8034 47792 46547 23389 -9612 -48790 -77193 -131146 -77238 -11637 13287 13345 -7549 -29606 -77373
8021 -77373 -108939 -71218 -19503 -82727 -71396 -20792 24908 28455 -13912 -17763 -11775 -49231
8009 -49231 -15722 -6619 -36384 -30390 -53201 -22953 -14024 -19682 9081 36572 -10447 5727 55261
7996 55261 18314 8488 59878 62720 114221 144946 111728 87499 60535 32678 33705 55124
7984 55124 25400 -5229 23893 74960 91377 31601 2038 -24073 -32835 30455 126470 176079
7972 176079 126418 36674 -41341 -30148 -12637 -11560 -4759 -35678 -1871 14150 49165 63436
7960 63436 86415 27347 -20853 11510 14610 -2865 -15159 84434 91985 38969 65594 90366
7948I0366k2572o2191m5361j1959K9619P0591J791R486k0122l9022n2266L2964
7936a8676n050l5038J5485M9954M6360k9669l6703j4709N178N9137k6825n1010
7924d1566j3354J5435L5803O3970L7194q1666k1490l6060J6146K5831l5592m5042
7912h0391P1367M3646m0967k7003J3655m5652K6640j4927J3097L1809k8599j0805
7900d8130K8518L8538M4182j1699L9079p4542m3977j807J1189K4293p938M3233
7888D0939k6589J6393n7373l356Q2725j7759J230j9556L8830J4252L78m4966j2228
7875A2920r584p4798K719M1248l2414j8955O404K4227P4708L4984k6054J0876
7863D6281M158j2164p0032k6415j302k5821N4244L840L2364J1050m0014k5456
$$ plain form
7948 90366 67794 5603 -39758 -51717 -22098 48493 50284 59770 39648 626 -51640 -18676
7936 -18676 -23726 -58764 -43279 6675 53035 23366 -13337 -28046 -22868 36269 9444 -41566
7924 -41566 -54920 -39485 -3682 60288 97482 15816 -5674 -41734 -25588 243 -35349 -80391
7912 -80391 -9024 34622 -6345 -33348 -19693 -65345 -38705 -53632 -40535 -8726 -37325 -48130
7900 -48130 -19612 18926 63108 51409 90488 15946 -28031 -29838 -18649 5644 -2294 40939
7888 40939 14350 30743 -26630 -29986 52739 34980 36210 16654 55484 69736 70114 25148 12920
7875 12920 3336 -71462 -68743 -27495 -59909 -78864 -72460 -48233 26475 61459 35405 46281
7863 46281 50439 38275 -31757 -58172 -59474 -85295 -31051 -27211 5153 16203 -23811 -49267
7851d9267l2240M1574Q2105L0670J0824j8617k6531K7909j4447m7923J7797O9412
7839I1266l4848n3675m5941m763o136Q112o6675J3319N1065O0794J3433m8705
7827b2754k36J1840K0800p866k3239K8790j1059k0612J266n923j8238n0880J2708
7814h5403M1867P1817m1918k2934m3569P251L6160L0134M7678K8238l789l9443
7802B6089P301J293m6623o5564r074L6219L6602J2023q009K568J2116j7374n6108
7789f8541k4692N459J5743J0452M578m8004L2634O0588J0433J1983k9025o232
7777b4624P8629l046o3131L4288j1591r985O3969j5225j05147j6862J5637K6597
7765c0491J6109j503k1589L2433j9074N4931N4548o6270l8007K3135o4059m3077
$$ plain form
7851 -49267 -81507 -39933 42172 72842 83666 65049 38518 66427 51980 4057 21854 91266
7839 91266 56418 2743 -43198 -47961 -54097 -45985 -112660 -99341 -48276 12518 25951 -22754
7827 -22754 -22990 -11150 9650 1784 -21455 7335 -3724 -24336 -23070 -28993 -47231 -98111 -85403
7814 -85403 -43536 28281 -13637 -36571 -80140 -72889 -36729 -6595 41083 69321 65532 26089
7802 26089 33390 34683 -11940 -77504 -86578 -50359 -13757 -1734 -9743 -7175 4941 -12433 -68541
7789 -68541 -93233 -87774 -72031 -61579 -57001 -105005 -72371 -11783 -1350 10633 -18392 -24624
7777 -24624 54005 50959 -12172 22116 10525 540 64509 49284 -55863 -72725 -57088 -30491
7765 -30491 -14382 -15885 -37474 -5041 -24115 30816 85364 19094 -18913 4222 -59837 -102914
7753a02914o90L3414M7335O6161k0002J5551n5487L9491k2765k8172l355N2052
7741B0619K7281o0294m1777N4951Q2764J3824J1528l4755l4551o929J605l0921
7729C345j40K2754L3065q110n2017j11084r908O7597O6858l040l8172R0O8432
7716C9670J7337p769L3790r217J3891K5834l880J7813L1014p0826r6520n3915
7704f2778n2498M9174P0465P65k2334l87K0983J2847l9504J4896k7291j0973K959
7691d3676o2440J5001N4658j0135n9456k8951n8736j0720R7657J05201n1399L6687
7679a6309N3001j8045l6530N5197J597K1609m2402q168J2237K7295J0997p1692
7667a1213l0019j9846K8541O1115j755J065l8738k4450o571l584J6959M7849k8704
$$ plain form
7753 -102914 -103604 -70190 -22855 43306 23304 38855 -16632 22859 94 -28078 -31433 20619
7741 20619 47900 -12394 -54171 780 83544 97368 108896 74141 39590 32661 34266 3345
7729 3345 3205 25959 59024 50914 -1103 -112187 -122095 -54498 12360 9320 -28852 -28762 39670
7716 39670 57007 49238 83028 73811 87702 113536 109656 127469 158483 87657 -8863 -62778
7704 -62778 -115276 -66102 4363 5128 -17206 -17593 3390 16237 -23267 -8371 -35662 -46635 -43676
7691 -43676 -106116 -91115 -36457 -46592 -106048 -134999 -193735 -204455 -106798 -1597 -52996 -16309
7679 -16309 36692 18647 -17883 37314 38911 60520 18118 9950 22187 49482 60479 -11213
7667 -11213 -41232 -61078 -32537 28578 26823 27888 -10850 -35300 -41871 -45455 -28496 19353 -9351
7654i351l2149O003L6421l61j4202M635n0218l9371p716K2518J315R3321M9784
7641F0629N0382m7533l1146l8041n4753J7566L0832k2053n8098O363Q88O082M8795
7628c0087O0158j8245J2936j1840K045J6859o8039K1739K8553k5331m716k3502
7616c9470j7714K4642J4474l7671K9808P4646P179M0319L784r9765M7825P5730
7604A23787j3347n9179j5199R414l6600p6316j2597K1598l1199n3435Q4837N6536
7592a700L351k1895m990J221p564L599k394J1889J1829R998J2287j5142N3128
7579E3617M6397k7830o1412L4894L989k7885K0552P525N379K46m31l7174M6284
7566F4151J6175l3269O301k7663m5916O4826M1604m8631l216m4722n2388k6163
$$ plain form
7654 -9351 -41500 -35497 924 563 -13639 -9004 -59222 -98593 -106309 -83791 -82476 10845 60629
7641 60629 111011 63478 32332 -5709 -60462 -42896 -12064 -34117 -92215 -85852 -84964 -78882 -30087
7628 -30087 30071 11826 24762 12922 14967 31826 -36213 -14474 14079 -11252 -15968 -39470
7616 -39470 -57184 -32542 -18068 -55739 -25931 48715 55894 96213 99997 232 48057 123787
7604 123787 110440 51261 36062 45476 8876 -67440 -80037 -58439 -89638 -143073 -58236 -1700
7592 -1700 1651 -20244 -25234 -24013 -31577 -27978 -30372 -18483 -6654 3344 15631 489 53617
7579 53617 100014 72184 10772 45666 49655 21770 42322 49847 55226 55472 55041 17867 64151
7566 64151 80326 47057 53358 25695 -20221 44605 86209 37578 34362 -10360 -62748 -88911
7554h8911p797P6273M2636O419k1623M4098m0356r1611n099K9172J8616k9235
7542f7418L318J4852O3065R665k9904k5501l201m534l4365L295P4642N0220j2556
7529D1578o3118n5097M5187r281p033K4450m682N002j9583m2375J5426L7696L3608
7516A778J5993L758L5096n4259K7428N6230L7806n9102q8482q1831K9074J6621
7504e9890J9260j9274M8327J1404n2922L613N8466K00K901K3060O1350j2318n4220
7491B9957p9139L0124K3184K2386P40R171l7267j3380M0467m6783K7198q270Q511
7478F899M9704Ll4447k0966l42K4037L6266l3565k0447J2602q278p7082p910K3649
7464d9877M5936M6234K5132l0153n5645j8658M0522j8584m7597j6255j5293M3070
$$ plain form
7554 -88911 -96708 -20435 22201 28620 6997 51095 10739 -80872 -85971 -56799 -38183 -67418
7542 -67418 -64100 -49248 13817 23482 -6422 -31923 -35124 -39658 -74023 -70728 3914 54134 41578
7529 41578 -21540 -76637 -31450 -40731 -47764 -23314 -27996 -22994 -42577 -84952 -69526 -31830 1778
7516 1778 17771 21529 56625 2366 29794 86024 123830 64728 -23754 -105585 -76511 -59890
7504 -59890 -40630 -59904 -11577 -173 -53095 -49482 8984 9184 12085 35145 96495 84177 29957
7491 29957 -49182 -19058 4126 26512 27252 36423 -844 -14224 26243 -20540 6658 -1612 6899
7478 6899 56603 56606 22159 1193 851 24888 61154 27589 7142 19744 11466 -65616 -73526 -49877
7464 -49877 -3941 42293 67425 37272 -18373 -37031 3491 -15093 -62690 -78945 -94238 -51168
7452e1168L1000J4059M2874O732l6356m2151O7472n5938q6412l5410K6728Q3305
7440c5265Q2586N1234J0724n9038L0514j711q1122p4815J8348P828K546L129k1263
7427f6305j1703N2031j739n497j4410o2j4250m3329n3085K4910M1831Q483K3705
7414e9420J9326l1086j7916K1201N5421L402n413J9443p47M9904j9970n7339K3763
7401E69l1998L574M4732L4925Q90j1865m5583k0813J3307N6915M4561j4136j9686
7388E5392j03785p7913M9116J3706k7734N4455O295N9043k782J3051j103m8968
7376a1227M140J4039k1700k1602K9850M2548K2152p847Q730j6560l2626L6081
7364D5978J1639L223j4411q711q932k8579O324k9667n313l140Q187O8340M1304
$$ plain form
7452 -51168 -20168 -6109 36765 43497 7141 -35010 32462 -23476 -109888 -145298 -118570 -35265
7440 -35265 47321 98555 109279 50241 80755 79044 -2078 -76893 -58545 -50717 -48171 -45042 -66305
7427 -66305 -78008 -25977 -27716 -33213 -47623 -47685 -61935 -105264 -158349 -133439 -91608 -83125 -59420
7414 -59420 -40094 -71180 -89096 -67895 -12474 -9072 -14485 4958 4211 54115 34145 -23194 569
7401 569 -31429 -27855 16877 51802 52692 40827 -4756 -25569 -12262 44653 89214 75078 55392
7388 55392 -48393 -126306 -77190 -63484 -91218 -36763 -30468 28575 25793 38844 37741 -11227
7376 -11227 -7087 6952 -14748 -36350 -6500 36048 58200 50353 59083 42523 9897 45978
7364 45978 57617 60840 46429 37718 28786 207 6531 -23136 -28449 -31589 -23402 44938 86242
7351H6242k6361k7782k1402r876J5035L3834J2260m8037j0959k1479R6k4535j3011
7338e5975M924k3934j0293k9302N7071K6949n6385n122q276K2680N5238m877J9868
7325g434J9580n133j4996q0726l2695J9227N7084K5345P450p4638J04O8644J8979
7312G91j2447K9226j3970n7185k5428o316J8518M5104Q3120k06j0201k540l042
7299D5424k2729L046k8291L6617N6847K4873q3735j9772J543J639K9578J7882
7287F2922l9684j0137J2360J1519K0956N629l4291L533j4702Q876l3685j5337
7275b2041O2010J15863j0136n8594l4817m9030k0661k856k8074k7293P014m2217
7263a10832m2463Q6127M6312j0223k7242K128N0052J6273k820Q401j5202j9426
$$ plain form
7351 86242 59881 32099 10697 821 15856 49690 61950 13913 2954 -18525 -18429 -42964 -55975
7338 -55975 -51051 -74985 -85278 -114580 -57509 -30560 -86945 -92067 -100343 -77663 -22425 -27302 -7434
7325 -7434 12146 7013 -7983 -88709 -121404 -102177 -45093 -19748 -12298 -86936 -86832 -18188 791
7312 791 -11656 17570 3600 -53585 -79013 -85329 -66811 -21707 61413 61207 51006 48466 45424
7299 45424 22695 25741 -2550 34067 90914 115787 32052 12280 13823 15462 45040 62922
7287 62922 23238 13101 25461 36980 57936 63565 29274 32807 18105 26981 -6704 -22041
7275 -22041 39969 155832 145696 87102 52285 3255 -17406 -20262 -48336 -75629 -68615 -110832
7263 -110832 -153295 -67168 -20856 -31079 -58321 -56193 -6141 10132 7312 15713 511 -18915
7251a8915j2202J7878J4917M2024M2689K7690p9915n5162p4224m5264N227J2088
7239a23169o255J0340l0747K492P7951Q4982l478K0613K045o8445K1052O7325
7227E4706k6543l5251J9961l8674n99L6171P4462j4522l8905j3644m252L2235
7215D5145R7321k0730Q638r059k2935l5060n5644p326k9829l285N976L7862J2882
7202B3956L3095J1829n9653o6132J2005N3665L5613K6361K8629J4290n0256l7247
7190B6155n22m561K1443J1193l7020j9544j4306J9943K7925j7864j5140l8850
7178d1148j417N3935l6063R8453L7572J7961m2042o5952k8042L7635j9826P637
7166A8703L5076j221j8585p0555j1371m5872M5717J3497P098K3330J0610j9260
$$ plain form
7251 -18915 -31117 -13239 1678 43702 86391 114081 34166 -20996 -95220 -140484 -135257 -123169
7239 -123169 -129424 -119084 -149831 -147339 -69388 15594 12116 32729 34774 -33671 -12619 54706
7227 54706 28163 -7088 12873 -25801 -26400 9771 84233 69711 30806 17162 12910 45145
7215 45145 142466 121736 130374 121315 98380 63320 7676 350 -29479 -32764 -26788 11074 23956
7202 23956 57051 68880 9227 -56905 -44900 8765 44378 70739 99368 113658 63402 26155
7190 26155 25633 21072 42515 53708 16688 -2856 -17162 2781 30706 12842 -2298 -41148
7178 -41148 -42565 11370 -24693 73760 111332 129293 87251 21299 -6743 30892 11066 18703
7166 18703 53779 52558 33973 -36582 -47953 -93825 -48108 -34611 -27513 -4183 6427 -12833
7154a2833k9400k184j9997Q74J0746J2635j3818J9289l203M383K5066M369J4949
7141A0876K3533L8542J1046q702M2930k9927l3138l5175l1921m814L2383j6677
7129a044m5781q1099k2917J4247Q8041O536p0293J3801M1176N3413M9588o3662
7117a7994n5233o794m3304J0126J5815K8113o6538L6626M6161Q7759N7226k6063
7105F5900j3417K0393n0944n4596j3312k1732k2009J1137L8932m5547K4355L5598
7093b5242m3348k1117l706l5075M19L8243M74j482k6125M0400N1723K4230k8978
7080b9584n8621m9921J8655M6617m7331O4063J7269l005j6131j0059k6910M1764
7068e3194l2468m1021M9495j9379O9493M0583K3578l6196p9020k6370K5150K6998
$$ plain form
7154 -12833 -42233 -44417 -64414 -63540 -52794 -40159 -53977 -34688 -37891 -33508 -8442 -4073 10876
7141 10876 34409 72951 83997 75295 118225 88298 55160 19985 -11936 -16750 15633 -1044
7129 -1044 -46825 -127924 -150841 -136594 -48553 -42017 -112310 -98509 -57333 -3920 45668 -17994
7117 -17994 -73227 -80021 -123325 -113199 -97384 -69271 -135809 -99183 -53022 34737 91963 65900
7105 65900 52483 72876 21932 -32664 -45976 -67708 -89717 -78580 -39648 -85195 -60840 -25242
7093 -25242 -68590 -89707 -93413 -128488 -128069 -89826 -89352 -90834 -116959 -76559 -24836 -606 -29584
7080 -29584 -88205 -138126 -119471 -72854 -120185 -56122 -38853 -41858 -57989 -68048 -94958 -53194
7068 -53194 -85662 -126683 -77188 -96567 -27074 13509 37087 891 -78129 -104499 -79349 -52351
7056e2351m6841N7216Q6873p350J7326K8398l494p528q8009q6666r31M3466M8519
$$ plain form
7056 -52351 -99192 -41976 44897 37547 54873 83271 79777 72249 -15760 -102426 -103357 -59891 -11372
$$ [...]
##END NTUPLES=NMR SPECTRUM
##END=
