##TITLE=Analysis number 317816
Compound Code cc 13202
Book Reference 438/102
Project Code adrs
Chemist Name antons
##JCAMPDX= 6.0         $$ Bruker NMR JCAMP-DX V2.0
##DATA TYPE= NMR SPECTRUM
##DATA CLASS= NTUPLES
##ORIGIN= Bruker BioSpin GmbH
##OWNER= nmr
$$ XWIN-NMR		Version 3.5
$$ Mon Mar  6 13:29:06 2006 GMT Standard Time (UT+0h)  MAYBRIDGE\nmr@NMR_250MHZ
##.OBSERVE FREQUENCY= 250.131544655141
##.OBSERVE NUCLEUS= ^1H
##.ACQUISITION MODE= SIMULTANEOUS (DQD)
##.ACQUISITION SCHEME= undefined
##.AVERAGES= 16
##.DIGITISER RES= 18
##SPECTROMETER/DATA SYSTEM= dpx250
##.PULSE SEQUENCE= zg30
##.SOLVENT NAME= CDCl3
##.SHIFT REFERENCE= (INTERNAL, CDCl3, 0, 16.522)
##AUDIT TRAIL= $$ (NUMBER, WHEN, WHO, WHERE, WHAT)
$$ ##TITLE= Audit trail, XWIN-NMR		Version 3.5
$$ ##JCAMPDX= 5.01
$$ ##ORIGIN= Bruker BioSpin GmbH
$$ ##OWNER= nmr
$$ C:\u/data/dgb/nmr/ADRS/80/pdata/1/auditp.txt
$$ ##AUDIT TRAIL=  $$ (NUMBER, WHEN, WHO, WHERE, WHAT)
(   1,<2006-03-06 13:28:42.56 +000>,<MAYBRIDGE\nmr>,<NMR_250MHZ>,
      <created by zg, POWCHK disabled, PULCHK disabled
       configuration hash MD5:
       84 BC 41 DB A1 6E 1D 46 DA 25 12 A5 C1 ED C5 3A
       data hash MD5: 64K
       B3 2F 70 6F D1 FC 92 1C 63 D1 2B B0 D5 A6 17 45>)
(   2,<2006-03-06 13:28:56.36 +000>,<MAYBRIDGE\nmr>,<NMR_250MHZ>,
      <Start of raw data processing
       ef LB = 0.3 FT_mod = 6 PKNL = 1 SI = 32K 
       data hash MD5: 32K
       4B 2E 37 CD 1C D3 28 83 72 8E 4B F6 00 7D 8B C4>)
(   3,<2006-03-06 13:28:58.08 +000>,<MAYBRIDGE\nmr>,<NMR_250MHZ>,
      <apk 
       data hash MD5: 32K
       BF 77 DA F1 E0 BF 20 95 8B 7F FB CD 32 61 66 92>)
(   4,<2006-03-06 13:28:58.94 +000>,<MAYBRIDGE\nmr>,<NMR_250MHZ>,
      <abs ABSG = 5 
       data hash MD5: 32K
       51 A0 53 B2 E1 B3 E6 79 A9 CE F5 1F 48 AB 08 F3>)
$$ ##END=
$$ 
$$ hash MD5
$$ AD D7 A3 7E C3 F5 56 99 4F B6 CD EC E8 3F 85 FF
##$RELAX= 
##$RELAX= 
##$RELAX= 
##$RELAX= 
##$RELAX= 
##$RELAX= 
##$RELAX= 
$$ Bruker specific parameters
$$ --------------------------
##$DU= <C:\u>
##$EXPNO= 80
##$NAME= <ADRS>
##$PROCNO= 1
##$TYPE= <nmr>
##$USER= <dgb>
##$AMP= (0..31)
100 100 100 100 100 100 100 100 100 100 100 100 100 100 100 100 100 100 
100 100 100 100 100 100 100 100 100 100 100 100 100 100 
##$AQSEQ= 0
##$AQ_mod= 3
##$AUNM= <au_zg>
##$AUTOPOS= <34 >
##$BF1= 250.13
##$BF2= 250.13
##$BF3= 250.13
##$BF4= 250.13
##$BF5= 500.13
##$BF6= 500.13
##$BF7= 500.13
##$BF8= 500.13
##$BYTORDA= 1
##$CFDGTYP= 0
##$CFRGTYP= 5
##$CHEMSTR= <none>
##$CNST= (0..31)
1 1 145 1 1 1 1 1 1 1 1 1 1 1 1 1 1 1 1 1 1 1 1 1 1 1 1 1 1 1 1 1 
##$CPDPRG= <>
##$CPDPRG1= <>
##$CPDPRG2= <>
##$CPDPRG3= <>
##$CPDPRG4= <mlev>
##$CPDPRG5= <mlev>
##$CPDPRG6= <mlev>
##$CPDPRG7= <mlev>
##$CPDPRG8= <mlev>
##$CPDPRGB= <>
##$CPDPRGT= <>
##$D= (0..31)
0 1 0 0 0 0 0 0 0 0.06 0 0 0 0 0 0 0.0002 0 0 0 0 0 0 0 0 0 0 0 0 0 0 
0 
##$DATE= 1141651721
##$DBL= (0..7)
120 120 120 120 120 120 120 120 
##$DBP= (0..7)
150 150 150 150 150 150 150 150 
##$DBP07= 0
##$DBPNAM0= <>
##$DBPNAM1= <>
$$ [...]
##$SUBNAM7= <"">
##$SUBNAM8= <"">
##$SUBNAM9= <"">
##$SW= 20.6930455092707
##$SWIBOX= (0..15)
0 0 3 0 0 0 0 0 0 0 0 0 0 0 0 0 
##$SW_h= 5175.983436853
##$TD= 65536
##$TD0= 1
##$TE= 294.16
##$TE2= 300
##$TE3= 300
##$TEG= 300
##$TL= (0..7)
0 120 120 120 120 120 120 120 
##$TP= (0..7)
150 150 150 150 150 150 150 150 
##$TP07= 0
##$TPNAME0= <>
##$TPNAME1= <>
##$TPNAME2= <>
##$TPNAME3= <>
##$TPNAME4= <>
##$TPNAME5= <>
##$TPNAME6= <>
##$TPNAME7= <>
##$TPOAL= (0..7)
0.5 0.5 0.5 0.5 0.5 0.5 0.5 0.5 
##$TPOFFS= (0..7)
0 0 0 0 0 0 0 0 
##$TUNHIN= 0
##$TUNHOUT= 0
##$TUNXOUT= 0
##$USERA1= <user>
##$USERA2= <user>
##$USERA3= <user>
##$USERA4= <user>
##$USERA5= <user>
##$V9= 5
##$VALIST= <valist>
##$VCLIST= <CCCCCCCCCCCCCCC>
##$VD= 0
##$VDLIST= <DDDDDDDDDDDDDDD>
##$VPLIST= <PPPPPPPPPPPPPPP>
##$VTLIST= <TTTTTTTTTTTTTTT>
##$WBST= 1024
##$WBSW= 4
##$XGAIN= (0..3)
0 0 0 0 
##$XL= 0
##$YL= 0
##$YMAX_a= 551499
##$YMIN_a= -619838
##$ZGOPTNS= <>
##$ZL1= 120
##$ZL2= 120
##$ZL3= 120
##$ZL4= 120
##$ABSF1= 16.522
##$ABSF2= -4.171173
##$ABSG= 5
##$ABSL= 3
##$ALPHA= 0
##$AQORDER= 0
##$ASSFAC= 0
##$ASSFACI= 0
##$ASSFACX= 0
##$ASSWID= 0
##$AUNMP= <proc_1d>
##$AZFE= 0.1
##$AZFW= 0.1
##$BCFW= 0
##$BC_mod= 0
##$BYTORDP= 0
##$COROFFS= 0
##$CY= 12.5
##$DATMOD= 1
##$DC= 0
##$DFILT= <>
##$DTYPP= 0
##$F1P= 14.0000005364418
##$F2P= -0.99999901652339
##$FCOR= 0.5
##$FTSIZE= 32768
##$FT_mod= 6
##$GAMMA= 0
##$GB= 0
##$INTBC= 1
##$INTSCL= 1
##$ISEN= 128
##$LB= 0.3
##$LEV0= 0
##$LPBIN= 0
##$MAXI= 10000
##$MC2= 0
##$MEAN= 0
##$ME_mod= 0
##$MI= 0
##$NCOEF= 0
##$NC_proc= -4
##$NLEV= 6
##$NOISF1= 0
##$NOISF2= 0
##$NSP= 0
##$NTH_PI= 0
##$NZP= 0
##$OFFSET= 16.522
##$PC= 1
##$PHC0= 245.2921
##$PHC1= 5.542983
##$PH_mod= 1
##$PKNL= yes
##$PPARMOD= 0
##$PSCAL= 4
##$PSIGN= 0
##$REVERSE= no
##$SF= 250.13
##$SI= 32768
##$SIGF1= 0
##$SIGF2= 0
##$SINO= 400
##$SIOLD= 32768
##$SREGLST= <1H.CDCl3>
##$SSB= 0
##$STSI= 32768
##$STSR= 0
##$SW_p= 5175.98343685301
##$SYMM= 0
##$S_DEV= 0
##$TDeff= 65536
##$TDoff= 0
##$TI= <Analysis number 999999
Compound Code 99
Book Reference 9
Project Code 9>
##$TILT= no
##$TM1= 0
##$TM2= 0
##$TOPLEV= 0
##$USERP1= <user>
##$USERP2= <user>
##$USERP3= <user>
##$USERP4= <user>
##$USERP5= <user>
##$WDW= 1
##$XDIM= 32768
##$YMAX_p= 531198774
##$YMIN_p= -243814
$$ End of Bruker specific parameters
$$ ---------------------------------
##NTUPLES= NMR SPECTRUM
##VAR_NAME=  FREQUENCY,     SPECTRUM/REAL,   SPECTRUM/IMAG
##SYMBOL=    X,             R,               I
##VAR_TYPE=  INDEPENDENT,   DEPENDENT,       DEPENDENT
##VAR_FORM=  AFFN,          ASDF,            ASDF
##VAR_DIM=   32768,         32768,           32768
##UNITS=     HZ,            ARBITRARY UNITS, ARBITRARY UNITS
##FACTOR=    0.157963299565203, 1,           1
##FIRST=     4132.6476996994, 0,             0
##LAST=      -1043.33573715361, 0,           0
##MIN=       -1043.33573715361, -243814,     0
##MAX=       4132.6476996994, 531198774,     0
$$ Real data points
##PAGE= N=1
##DATA TABLE= (X++(R..R)), XYDATA
$$ [...]
29103 72533 26408 1166 1 -23923 -27607 -45111 -76483 -73175 -18002 12556 36697 12569
29091 12569 10935 57559 31760 50245 59250 72934 49645 7004 -25381 -37266 -62637 -74213
29079 -74213 -71779 -44171 26143 42396 37048 14067 -3972 18542 23257 -13198 -54302 -12255
29067 -12255 45696 61359 54884 423 4725 56559 53835 26438 1773 -29451 -61826 -55755
29055 -55755 -72123 -56738 -81816 -132686 -101263 -32657 -37472 -66680 -31482 21951 38849 -11315
29043 -11315 27070 65250 117022 99276 26197 -23932 14050 82349 73611 -10093 -9472 -47344
29031 -47344 -46265 -18446 -28882 -55398 -55382 -33731 -6650 -25968 -34167 -31899 9150 29041 -12961
29018 -12961 -21788 58764 95169 87251 116981 66138 17669 15269 48919 20187 -1253 19431
29006 19431 3939 -41497 -41039 -22762 -8646 -21468 -21969 14423 21695 -18875 -43559 -38230 -1427
28993 -1427 56616 35526 20293 21072 27024 82389 97903 61922 26483 -66 -1497 -25592 -38596
28980 -38596 -31851 10265 51590 45804 66233 80495 65945 92409 106718 42375 -171 -14252
28968 -14252 -16783 13045 31639 13165 61133 40765 -16495 29349 56718 43460 23198 -27661
28956 -27661 -48667 -47420 -67055 -22869 2972 7483 11036 3321 -9360 -13587 20370 29109 33452
28943 33452 74972 83458 34380 -12811 -30018 -44887 -60755 -64583 -19887 63905 34313 75840
28931 75840 85139 76746 80038 74357 99713 63958 23963 1529 -9727 -16566 -22931 -32007 -25788
28918 -25788 1966 47502 14063 8588 27686 25862 38279 27080 17433 46338 115254 83232
28906 83232 4526 -36804 -35304 -72684 -89018 -44316 -52608 -69801 -40468 -32838 -46213 -57054
28894 -57054 -74772 -124961 -154868 -107671 -35383 -6796 9627 39545 85621 71370 45664 -7381
28882 -7381 -43231 -67634 -50682 -29479 -2010 52507 44089 33094 51500 37372 8880 2052
28870 2052 -49418 -121827 -99103 -37660 -51619 -27626 -9655 46484 120286 81231 -24899 -57594
28858 -57594 -80384 -83386 -77527 -88629 -83948 -42279 -79417 -130889 -50000 41194 34208 16604
28846 16604 39388 37647 29130 36686 28426 19473 -23348 8608 -36693 -101341 -80633 -81518 -23229
28833 -23229 25523 682 39839 50830 -6672 -21252 -22842 -21381 -1804 -19911 3365 93209
28821 93209 124366 127275 104501 92609 82749 39542 11940 20198 73006 71768 77276 59436 15645
28808 15645 -3205 7008 -21957 -39333 5239 13316 -15792 15891 -13496 -27257 -4795 -11300
28796 -11300 19528 38221 103470 111462 111439 61599 -10192 -29965 -41565 -563 10853 5702 74746
28783 74746 73838 -19924 -31331 -2613 8385 8995 30653 29616 16857 -22474 -19624 -16731 -40691
28770 -40691 -52131 -789 16455 -27409 -42397 -25585 -22545 -56253 -81353 -65827 -30778 3461
28758 3461 -33871 -80483 -48662 -47454 -97143 -110824 -25480 71467 50400 32948 30208 23394
28746 23394 91845 106381 93749 75907 8041 -29764 -23181 -2139 -23282 -40610 -6654 69878
28734 69878 85766 25335 -30443 -6230 81903 49327 -43438 -70696 -112212 -99465 -76356 -104997
28722 -104997 -76704 11760 51559 69174 50341 23159 -5238 -42177 -91838 -89282 -77199 -54292
28710 -54292 15519 33501 30398 4466 -7109 39516 86438 59617 -2960 24867 -25237 -42691
28698 -42691 -42495 -12513 46796 49354 37049 56388 94690 60799 48094 51716 88396 182289
28686 182289 169275 100743 58989 45887 25142 -8240 -29966 -14303 48788 52453 -8735 -28636
28674 -28636 20260 45142 39772 25292 19939 43909 55823 70709 61603 32432 9508 -3959
28662 -3959 -19108 -13685 19008 56202 78808 74827 85294 27582 5028 25596 72047 87702
28650 87702 87939 61110 3794 37434 33801 34070 22379 33535 9063 -24772 -42690 -14647 -55281
28637 -55281 -70782 -47585 -64851 -45399 -50971 -56868 -35509 -45200 -20315 22410 755 17787
28625 17787 -7794 -73035 -90137 -71432 -98090 -77923 -5929 49198 45825 54207 48099 43445
28613 43445 21491 -9040 16503 2339 -18221 5795 3748 -7430 23410 31743 25668 32113
28601 32113 71417 51089 25081 27508 -5926 -29540 7611 34496 2551 2246 32801 5149
28589 5149 -49998 -22710 5355 57090 3743 39111 107507 114313 78991 23056 -2421 4992
28577 4992 65401 68120 55748 42365 -8919 1907 28595 61348 59948 -5156 28619 65184
28565 65184 53715 33372 -20703 -486 -23841 -22719 -43095 -76792 -53456 1542 77463 98605
28553 98605 76973 53012 25009 31350 54547 69107 56951 -280 6551 18892 11391 54062
28541 54062 102824 80020 51655 -18487 -69665 -63870 -7768 62908 28932 -3016 28881 74586
28529 74586 69205 82451 45915 -37697 -63236 8542 62257 73498 67895 67688 45243 88558
28517 88558 84916 20138 34875 23326 4124 -1680 36877 100258 74274 42604 29562 48730
28505 48730 63156 77445 43576 71151 101502 55855 43936 49226 35165 57009 74861 35369
28493 35369 -10008 -21088 -2923 11206 77682 111077 53153 -19346 -69853 -39302 -27674 -2761
28481 -2761 13591 30414 -1608 -54875 -68994 -79565 -112589 -74389 -25327 -36481 -3254 7367
28469 7367 -45749 1108 93395 117368 103306 96479 39088 -8943 -4328 17449 58925 62386
28457 62386 21384 -15465 -18535 -13800 -6562 38472 87010 -17382 -94627 -66964 -25107 -19763
28445 -19763 25467 32401 67989 75715 42899 -22938 15203 26621 -7751 -19862 -73773 -92572
28433 -92572 -60358 -22750 17163 31314 16711 3190 -14345 -61413 -79891 -58056 -44258 -11598
28421 -11598 -7901 137 -5789 13379 -51190 -46400 -74494 -32689 -15268 11543 -4475 -17650
28409 -17650 16202 66532 37698 58151 28619 13846 47504 35837 5685 -8123 -10273 23286
28397 23286 58373 86857 77305 25746 -27366 12936 36157 -25442 -15149 -8260 28761 21985
28385 21985 59632 54300 71999 82244 67745 -44778 -48133 4762 58181 9137 32959 99875
28373 99875 58745 23552 23817 17931 -37504 -57004 -62614 -95312 -89450 -39158 -38818 -29752 -20248
28360 -20248 -22155 21520 59800 36514 24000 -25731 -102466 -103029 -87070 -93817 -84017 -25150 35147
28347 35147 20419 -17452 -52753 -45839 -29666 -18588 -22263 -18420 9595 8833 11890 -22866 -10716
28334 -10716 -1412 9928 9897 15043 -6009 -64922 -97084 -88303 -87732 -60601 -20978 28510 60230
28321 60230 36745 32189 -22281 -25794 -33141 -47210 -60597 -20521 28285 60937 73976 76323
28309 76323 54774 38552 64684 57750 27063 69578 48454 -11937 -59958 -34765 3669 16426
28297 16426 59296 59060 -22166 -34122 -13760 14003 -6491 -17503 -29700 -6336 11157 76464
28285 76464 99109 55867 32740 75512 67516 68207 -3216 -44300 -57879 -16186 44703 60636
28273 60636 59494 21206 -26960 -17035 -4825 24796 19944 17116 -5456 15311 2806 -21991
28261 -21991 11163 -8096 -15641 -25842 -33226 -42133 -39054 -15263 -25823 -29301 -18898 -51506 -12384
28248 -12384 3180 -2278 -21719 24533 54602 60812 55772 68058 69929 100997 82309 79046 63547
28235 63547 46695 59418 27348 -71957 -85212 -65168 -37609 -33023 43848 73916 27638 -15958
28223 -15958 -3167 -730 36653 21579 -6205 -8071 29859 38622 14763 42906 44806 11365
28211 11365 -8475 -2007 28277 9371 -33164 -134283 -124075 -86281 -86715 -106979 -67000 -17127
28199 -17127 3526 -24395 -33132 19753 49925 -4312 -16276 13028 14520 -22625 -7198 4207
28187 4207 25311 13936 34934 41967 50723 -2584 -51547 -83505 -57730 29348 41848 947
28175 947 -36956 -15652 34436 59581 59462 59862 105836 133986 168618 74454 27392 44104 17603
28162 17603 -14553 -30109 -55653 -30072 -42273 -50215 -8782 2663 -57427 -66037 -42437 17576
28150 17576 40402 286 -87881 -22481 23064 7677 15103 18991 3026 9154 25222 -2860
28138 -2860 15389 1825 -22502 -54282 -65783 -28182 12693 19732 30150 85083 64395 25301
28126 25301 20663 -14150 -18351 -38410 -25211 -12519 -26203 -45858 -28947 -14283 -77942 -66745
28114 -66745 15047 37271 13465 -38976 -4102 8917 -10941 -22476 36150 43306 19963 -25332
28102 -25332 -67772 -78886 -57905 -67556 -33716 -32667 -63053 -47599 -66540 -25864 17499 1778
28090 1778 -52980 -63079 -46862 -16738 -5964 -23529 -63067 -73189 -30181 -32892 -78929 -73086
28078 -73086 -56118 -28771 -18439 -24339 -88567 -94811 -86822 -43665 -52089 -37666 10503 28870
28066 28870 28042 -6239 -24040 -38240 -82400 -75926 -105634 -84130 -8959 -18455 -28613 -2369
28054 -2369 -10370 -23893 -35016 -37351 -55644 -43184 -6871 35831 -14616 -40055 2573 58885
28042 58885 68900 71359 76324 26218 1930 782 -37801 1316 26637 -4132 -15636 49748
28030 49748 137235 91463 18320 1267 35913 53922 16339 -22067 -44769 -34267 -15092 -1020
28018 -1020 54506 86388 65415 56365 46625 95538 99734 124170 112405 62791 27481 18189 34900
28005 34900 12667 5383 -28264 -2155 13179 46189 93171 142653 97675 57615 38720 -3539
27993 -3539 -30286 -15496 -73555 -96821 -63957 -23194 -10040 515 46315 38037 13103 52260
27981 52260 61190 7291 -31817 -22917 -4444 92027 98318 76694 37450 32684 21491 -4258
27969 -4258 -38434 -8491 -5242 -23952 1413 3226 -52157 -34476 11400 31500 30595 12836 34495
27956 34495 39396 16956 65420 74146 73630 80337 39293 49956 71416 98771 61322 7089 -6994
27943 -6994 20857 -52920 -102097 -87427 4077 53843 112 -16221 2477 19655 -12488 -17734
27931 -17734 13244 33941 21715 39446 39081 62874 17151 -23768 -1635 -23101 -38851 21926
27919 21926 52118 -15037 -60499 -76631 -27611 -57933 -60687 -77158 -138535 -125430 -87583 -45576
27907 -45576 -13191 -9003 -814 -21083 -24993 -38325 -77408 -86634 -41800 15453 52768 81191
27895 81191 62613 21480 14670 39167 33665 -32017 -96924 -106310 -49685 13220 47085 2091
27883 2091 -18631 50171 88663 76972 10698 -6175 11976 -33591 -39697 23478 78672 103342
27871 103342 63860 -13401 -2417 8878 -9528 23376 58951 62544 -5328 -45216 19247 79104
27859 79104 24988 -70950 -159849 -147353 -115616 -85797 -38678 -67262 -99118 -87487 -11922 -14836
27847 -14836 -21410 22431 69336 98975 113889 59866 19700 -14639 -51597 -81190 -27905 -19341
27835 -19341 -53592 -22973 -30451 -60166 -91969 -108430 -44689 -12597 13055 39532 61178 100358
27823 100358 152634 76401 -9669 -97291 -86870 -63170 -31975 -29785 -67396 -59966 -112223 -80784
27811 -80784 -28090 3136 -4418 1684 -17765 -13970 -6483 28983 46359 16468 29540 -13683
27799 -13683 1294 -10064 3777 73181 81049 54613 41201 38561 28427 -30386 6844 1456
27787 1456 -1246 34888 37824 40047 -33703 -39627 -3626 12371 48406 67171 35775 13709 -32598
27774 -32598 -57214 -37817 -9535 1845 -7292 7357 6323 46127 77822 73678 60692 61201 13824
27761 13824 -6375 -31081 -91083 -90654 -83951 -84372 -115806 -76415 -76124 -31966 5402 15771 50128
27748 50128 58681 28949 91447 65222 42975 43893 -17258 -68649 -80374 -15595 -5016 -5667 28354
27735 28354 27810 -21204 -52225 -83806 -112176 -67030 -7405 -5173 -3435 22601 54075 99572
27723 99572 88357 83722 35470 6223 68473 42525 -50285 -70889 -29929 4684 -4709 1917
27711 1917 12294 26688 40979 28691 44684 52745 68163 -33274 -54740 -11789 82284 131450
27699 131450 132066 136971 51669 -5554 -23164 -39564 -42214 2921 19999 -29755 -691 23120
27687 23120 68575 58842 73519 121804 134064 105317 72247 80233 67795 45961 57173 94223
27675 94223 120471 116872 85354 62429 59479 6898 7670 -11890 -42599 10810 8643 -36755 -42990
27662 -42990 8270 32393 -24760 -45818 -26616 -12868 22753 39497 -3473 7743 46869 73670
27650 73670 101327 130286 86974 56859 27987 -34890 -79990 -53702 -26750 -17836 -13229 71279
27638 71279 13214 -40892 -50113 -13152 -21552 -33608 -11790 -17327 -46313 -39393 -49232 -91414 -121803
27625 -121803 -49120 -31111 -482 51530 30023 -52224 -76862 -35991 -42633 29270 56624 62620
27613 62620 33564 -3423 15123 26065 -7010 -30115 4680 54461 59930 71667 54593 56716
27601 56716 45574 -12619 9829 8138 16721 23972 10922 28695 13814 -1504 22088 53435
27589 53435 35243 -22807 -22442 -44718 -46150 -6532 -29526 -41238 17017 16098 -22263 -100163 -42688
27576 -42688 -60882 -108279 -99249 -61200 11444 35902 25808 4901 55971 102884 33961 46020
27564 46020 109195 127220 98505 52748 28890 39453 42900 39695 43735 39782 45702 25510 49222
27551 49222 65704 58232 -4787 7669 37892 36950 32500 31541 48229 62842 2919 -75739 -80188
27538 -80188 -40449 88365 72863 -7667 -23271 7754 17432 38701 18046 -24681 -47009 -67067
27526 -67067 -32947 4896 27469 -28671 -85347 -62362 -1346 -12228 24627 -4476 -8238 -49802
27514 -49802 -106718 -56455 -7006 455 14928 62830 63026 55303 21601 23303 24287 56203 80146
27501 80146 84459 37343 -24911 -84381 -92313 -10716 40581 77868 98894 57171 -6661 -34933
27489 -34933 -7378 67086 64403 58199 72590 105800 67946 21311 15508 -6703 -22608 -24577
27477 -24577 -10661 10131 18284 -27948 -47211 -40710 -75431 -30866 -7552 15178 7696 -15171
27465 -15171 -66653 -73301 -48859 -23809 -40313 10611 77713 86866 91663 94610 86213 19018 -6915
27452 -6915 -396 -9330 40637 69651 43663 -38130 -123468 -149013 -82401 -59460 -72043 -20264
27440 -20264 -7290 -38626 -46330 -21852 -34931 -62549 -45933 -16922 -9958 12807 58020 39450
27428 39450 27105 -14105 -10038 22559 41656 28790 -46073 -29277 35061 30551 31691 33566
27416 33566 -18126 -41400 -35765 -60468 -65455 -41610 26235 -19042 -64323 -54353 -56533 -29380
27404 -29380 -13528 -4558 -15611 7085 9745 29453 78058 102101 73725 86356 37922 -4723
27392 -4723 3556 30047 63983 26903 -3711 -248 692 3223 -75459 -75945 -44595 -21946 16964
27379 16964 20344 12614 -16848 -15792 -4089 -47306 -111987 -101625 -52465 -3605 24228 37312
27367 37312 32584 62790 64196 88913 45117 7719 -116 -33697 -17320 -13541 -17010 22009 59759
27354 59759 63935 -10490 -65346 -69318 -54531 -27487 -9656 -15772 -29253 16368 11814 32436
27342 32436 -8985 -25834 -53086 -80585 -31671 -9895 -23898 -34132 1267 45199 22005 74680
27330 74680 88247 34619 35179 43509 62411 27664 98797 124025 119772 75336 51361 25858
27318 25858 4466 -6062 -26159 -34633 -7111 36228 86886 70106 58834 38788 41000 105400
27306 105400 94849 51549 -36578 -33537 10520 60292 62884 45685 57864 1034 -55199 -42309
27294 -42309 -689 9763 10592 -12510 -46559 -24923 77061 63615 12111 -68647 -43637 -10909
27282 -10909 -12287 25505 41728 5896 -67037 -70896 -69178 -59752 -24538 -9583 33501 57887
27270 57887 41632 16934 5461 -18596 -11108 -49135 -63168 -51797 -43018 -31600 -14578 22871
27258 22871 30280 8194 394 31654 63362 97804 55454 9483 -18156 33193 92246 67565
27246 67565 48304 45365 56040 87001 59874 43949 39066 34483 10389 -13846 -18632 44932
27234 44932 -2764 -33545 11982 6388 -33037 -12957 29838 52426 41424 81970 120243 119726
27222 119726 41473 23209 16969 48532 30080 -13181 -4662 -17146 -12994 19415 15926 34670
27210 34670 49148 74526 47236 -14024 -19341 45412 66280 48683 23119 28205 37496 68400
27198 68400 52681 62491 45078 955 -19378 -26796 -27597 -35668 10963 11382 3308 30693 52575
27185 52575 31656 10329 -19254 -48141 -37491 12740 12590 -39005 -60490 -48354 -11698 6925
27173 6925 -3671 -68397 -65463 -29613 62048 100624 67201 48953 45844 25288 -12394 12774
27161 12774 7243 34663 61263 -20790 -6524 19385 -39396 -50622 -36871 -49113 -56197 -80120
27149 -80120 -125668 -101099 -39517 -38507 -29675 -4522 3433 -708 5699 5621 23168 17298 -12750
27136 -12750 18480 28717 -2985 -38628 -50163 5819 4778 -19714 -59319 -26632 32557 69089
27124 69089 87508 61468 87959 113516 118653 53534 29049 9827 -36104 -70864 -45029 -73037
27112 -73037 -89378 -92543 -31094 19647 16279 40325 10990 -14289 2626 36236 26741 36968
27100 36968 90344 106451 77819 38991 71144 16470 -9006 -50359 -47587 -15702 7584 -11349
27088 -11349 -14793 4024 20687 19574 -23807 7089 77500 54337 23321 7504 -6428 -10537
27076 -10537 -8189 40431 25181 39573 31262 -22127 -18040 9754 4914 -53117 -107163 -90433
27064 -90433 -51392 -35958 -36489 -73159 -64786 -75950 -108975 -76523 -32330 -76658 -78788 2977
27052 2977 60301 30987 9128 26212 42777 6016 -1088 -5017 29652 40529 36087 16646
27040 16646 -26100 -29513 -42308 -20564 -2144 -848 -19807 -34465 -40674 -23532 -25956 -92603
27028 -92603 -16832 -2692 -31365 -36833 -86575 -27416 44980 36199 -64861 -55230 -21474 -71967
27016 -71967 -119758 -58957 -23110 -7208 36806 40745 40375 7125 -17153 4524 -10777 -15572
27004 -15572 -64054 -73585 -51399 -52314 25950 88510 99331 54164 30152 43530 61874 23797
26992 23797 5607 -29654 -21184 -15737 36231 58080 27781 58309 9642 -4725 70494 132991
26980 132991 125435 22899 -55434 -125711 -54040 -14716 -49778 -35694 3036 -30578 -51671
26969 -51671 -50852 -83271 -77202 16572 56891 28583 6210 -60719 -52685 -14175 38233 5710
26957 5710 12738 63783 84094 76302 15503 6185 -31526 -70584 -17771 34485 58775 -627
26945 -627 -23676 -30529 -56277 41812 63587 54039 55617 51068 9361 -7577 -62258 -89973 -92977
26932 -92977 -66106 -32279 -47045 -89294 -12601 -13488 -46326 -62827 -44709 -23097 13169 -20221
26920 -20221 -44448 -28582 -19695 -7049 -11637 3368 18536 56374 91314 48641 62925 16855
26908 16855 -62333 -23281 10359 21839 46580 93080 70273 32464 65672 83786 29240 8558
26896 8558 15512 -15221 -51741 -86282 -81142 5541 76029 44743 17113 5073 -18447 10067
26884 10067 35406 20706 21379 14732 46762 55964 -17653 -100721 -100133 -24043 13959 -4154 36175
26871 36175 67290 -29639 -85514 -87350 -76279 -70020 -3857 -17934 -9689 60405 110659 97570
26859 97570 40548 60705 111726 100176 64625 46645 13820 30146 32744 21927 86378 47546
26847 47546 -1285 2943 -21038 -53021 -104448 -56769 -45876 -25012 -10298 37070 82841 127050
26835 127050 168696 108871 28774 18734 5547 -18066 -59061 -60553 -61979 -28552 10938 -29200
26823 -29200 -86388 -38904 -35335 -40016 17007 4927 16986 23421 -18450 30602 47377 47644 13461
26810 13461 49958 55078 1402 44097 54000 61576 79897 75570 37058 31649 40883 88462 56927
26797 56927 15969 -8228 17433 45626 40867 37516 8183 -32541 10595 14762 -16488 16437
26785 16437 -2859 14340 -19546 -18505 -40664 -19776 -19121 -56486 -17049 42234 62318 50596
26773 50596 31217 3343 -4862 24865 37704 83927 75330 44557 18824 18193 37710 79246
26761 79246 88850 82480 70267 81285 77157 47534 33947 -19570 -25350 -51590 -603 17176
26749 17176 -8971 -26013 -36140 -15665 5870 -18466 53121 112383 91647 75345 47375 8992
26737 8992 13470 41857 -4907 -18884 29744 31966 10269 28068 53524 2680 -9136 -34361
26725 -34361 -61155 -48561 -13550 13580 16923 17796 7186 8294 60828 32509 -19168 27859
26713 27859 3763 -34469 -12521 12066 1081 27762 34666 57722 32825 -23934 -31289 -31918
26701 -31918 -51952 -35266 -45334 -41527 -3510 -8094 -25696 54138 116798 88875 15534 -7930
26689 -7930 -10619 35503 25124 -80860 -42767 2895 20308 18998 -8733 -25937 -7284 29841
26677 29841 85146 53371 -19207 -20476 17342 5361 29958 55338 107265 118330 70583 7926
26665 7926 34429 57535 32180 55458 55524 40261 34811 2083 -4464 -32920 -24804 -7288 42905
26652 42905 54382 72345 5783 -46158 -53603 -679 15231 -6130 4014 7020 13853 13577 -55388
26639 -55388 -26467 7737 60287 27175 3765 -36092 -330 81099 63493 15372 57 48820
26627 48820 66974 28800 37681 -32924 -24953 -4175 -20811 -59879 -63577 8091 7222 -6876 7835
26614 7835 -86199 -105165 -39139 -14724 -21133 -41913 -41097 -27475 -39655 -49936 -28318 11870
26602 11870 39017 39904 25436 75004 48878 54984 87083 70325 33509 -897 -21146 -4638
26590 -4638 35051 -1666 -29376 -36478 -24932 -6523 -86334 -67029 19166 28583 11768 -2715
26578 -2715 -56626 -73588 -53439 -48028 9605 38444 8732 25362 3555 -57298 -35304 -3718
26566 -3718 -34046 4615 15151 69607 125435 110016 56189 37196 97026 111468 122277 29742
26554 29742 -22705 -8712 -26414 -65271 -20010 10164 1213 12464 9915 8387 -35500 -91275
26542 -91275 -96702 -64646 -9803 36293 30759 51398 23906 -4757 -30694 -36234 -41390 -60405
26530 -60405 -69271 -58403 -15654 29850 17485 14189 52634 45603 32977 42581 -16415 30193
26518 30193 55677 59827 69113 12868 1428 -7746 -6766 -2199 14600 16598 -72 -39996 -20600
26505 -20600 -28951 -24284 -6971 -22023 11197 31004 67274 92046 60984 -19665 -15356 -26312
26493 -26312 -2633 39542 47596 -483 -21381 -15593 6454 -15165 -33763 -57330 -67877 -99928
26481 -99928 -80484 -26363 14548 64396 81349 65852 67447 -6481 -8002 30308 50848 30510
26469 30510 -7962 23158 66778 93397 98463 63217 45655 12715 -1618 12597 -14128 61951
26457 61951 99678 57193 11574 -53272 -79293 -66703 -37159 -39637 7591 33365 38074 19622
26445 19622 -11876 22394 24619 54403 36231 -22028 -26712 -7868 -24771 47378 101698 77383
26433 77383 113441 83834 30751 36179 -386 56644 133940 144139 111091 86193 27457 -19185
26421 -19185 -14613 -22878 41967 71486 53957 26806 47136 28459 24805 74688 60335 -4885
26409 -4885 -200 72411 74530 60360 66851 45885 30824 13221 3519 -10530 -27951 -29156 -21064
26396 -21064 6118 -17925 -23100 -31685 9344 40258 34998 48158 52604 3848 -5337 -36788 -46588
26383 -46588 -29363 -41000 -35116 -37571 23160 117092 116541 83163 57805 47422 36052 18140
26371 18140 -8516 28501 31860 17264 26346 25132 45031 53884 54464 30926 -4173 -12297 25619
26358 25619 59426 42257 40588 -14303 -3561 65142 73056 65264 8748 -7902 69891 71286
26346 71286 41980 32593 14621 -4528 53321 64975 48496 76233 63055 23280 -25188 -38002
26334 -38002 21165 -16069 -66706 -61877 -46597 -28539 -53769 -12828 56619 42073 -10806 32957
26322 32957 -30543 439 4114 -9101 24679 -9117 -23291 -27329 32058 74691 33417 63863
26310 63863 48109 36144 -617 -9695 18424 34237 17321 -8365 2594 -33184 -74034 -67743
26298 -67743 -35654 241 29188 9134 14166 26315 43269 89633 54801 60531 78111 18666
26286 18666 -64729 -63834 -77095 -34931 -25358 -32880 -65077 -37018 -42161 -29240 9026 31880 34419
26273 34419 1032 -56887 -69924 -91169 -52473 -12578 18366 1616 -19450 -27110 -91833 -113557
26261 -113557 -79522 -44961 -35811 -61323 -97431 -87924 -75011 -37345 3283 15692 15820 17637
26249 17637 26033 28919 33765 43672 27080 45121 12088 -44294 -51179 -28047 52851 59427 89109
26236 89109 101374 48867 88849 57508 27366 13334 96521 63719 -24735 -11430 32331 90077
26224 90077 91174 19372 16944 46157 61271 88993 51404 83125 78267 46133 6281 3314
26212 3314 14610 -28955 -35124 -53962 -57601 -82728 -133573 -97538 -109514 -106567 -39582 -1796
26200 -1796 -8734 -5796 -26204 -46264 -19562 7901 -4634 60 81297 131895 82436 22190
26188 22190 27466 5380 32820 22240 33194 57589 -7878 -47091 -41098 -30891 -18502 39129
26176 39129 92357 43560 7912 254 -16129 -55666 12147 51149 77270 68879 61945 20286
26164 20286 21170 34779 38565 40336 41870 72971 57095 57913 39807 -10263 49999 35789 -1127
26151 -1127 74611 89902 96634 137275 117749 52427 31507 50960 52959 10252 -4959 -7467
26139 -7467 -24644 -12042 -19780 -2867 803 -62892 -54794 -104700 -169464 -108926 -38653 982
26127 982 6444 36496 61642 41542 84169 49637 35448 33952 77039 112399 69278 21624
26115 21624 30239 23854 -10386 -15031 879 385 23551 90149 98455 70048 59479 19890 352
26102 352 -67636 -36431 18954 21103 -10407 -46013 -19465 -9165 1203 14902 -7671 3710
26090 3710 80559 73353 20645 2497 14939 38433 40810 83264 122733 61981 23422 35019
26078 35019 50566 108845 144776 91589 -848 -11671 34993 42256 47659 94603 107611 92520
26066 92520 86038 5673 -50456 -11394 -30138 -85054 -77744 -1858 72928 61331 -24790 -44237
26054 -44237 -70640 -6031 72452 75858 82198 49479 30327 29440 94226 101206 66002 32061 14193
26041 14193 -21032 -38407 20984 30567 31294 53774 45275 67028 80641 88604 62004 -4685 2596
26028 2596 28392 27674 54254 61036 43544 31826 32200 36386 48551 79531 101926 40323 -5426
26015 -5426 -21110 -34421 -65110 32882 34940 34437 54495 31435 24314 41267 1136 429 -4368
26002 -4368 9062 -16111 -4855 11676 11648 27284 47607 82091 115748 96186 62226 42307
25990 42307 16890 65652 61444 -43843 -36831 -28806 -27317 -24336 -11018 -25346 -27586 -43189 -45556
25977 -45556 -16523 -3891 8846 10324 -16662 -24591 12341 77472 74540 67520 66178 51303 12298
25964 12298 10953 -18062 2592 -10787 -84443 -48147 44093 59518 44958 -16980 -16174 12384
25952 12384 66686 57820 46370 45718 99478 97294 50524 26649 -12122 -4423 -26710 -35746 16897
25939 16897 96692 103201 15363 -19428 -17695 -8117 -35246 -70910 -58562 -11597 8007 39247
25927 39247 97946 110046 48678 -7117 -33623 -32029 -12506 -597 -15236 4116 17646 23606
25915 23606 -6169 7999 14593 42833 124704 134047 86940 77119 74478 78003 63121 48907 73834
25902 73834 83074 48330 70174 86991 65061 28769 19191 51801 31057 -2440 -21438 -22263
25890 -22263 -66587 -49370 3708 16125 9287 8230 3523 30926 41447 -33919 -88305 -54013
25878 -54013 -123198 -68699 -20654 4792 2423 -7805 -11994 26028 -9843 -16320 -10338 19354
25866 19354 -14724 -22455 22531 38412 14580 17941 43432 14871 23474 23911 -26696 -68464 -144954
25853 -144954 -110866 -103148 -91037 -66155 -16394 -35135 -20531 -4860 -3616 12271 -3825 -9762
25841 -9762 -26440 -10323 22627 -1020 17038 31451 70942 40302 10201 -503 -70032 -34014
25829 -34014 16624 -61495 -105795 -28985 11424 5557 33079 5951 -23164 14559 41294 24773
25817 24773 -32616 -10961 59435 79591 95944 92621 1315 -40689 27017 82292 69235 53381
25805 53381 37684 2195 -76380 -127693 -98261 -36165 -7569 -34738 -31155 -51099 -85896 -59418
25793 -59418 4400 25080 8146 -9239 -51069 -86195 -78352 -1368 -6015 -14106 -15114 -28580
25781 -28580 -90243 -75499 -33171 -8019 18121 -30293 -36276 -34231 -47187 -9228 13526 59058
25769 59058 35210 -17505 -51595 -33618 43353 65818 63338 62384 9742 5326 32739 40136 -14581
25756 -14581 -70906 -1891 31842 46773 50620 27632 27374 18329 -48915 -30189 6077 -11221
25744 -11221 -16462 7991 40960 51649 14473 -2689 -28779 -82613 -74727 -66591 -57902 -33943
25732 -33943 -6197 -46494 -77422 -21253 8143 1597 13401 37972 45642 -14104 -49196 -48158
25720 -48158 -34895 -2360 40702 60890 68918 72839 32099 -17307 -29885 -11735 -907 9500
25708 9500 18868 -38519 -25993 -38558 -56145 -59598 -62555 -32124 7981 9265 -38490 -106360 -70909
25695 -70909 -23768 -7323 -32527 -27264 -12025 -7764 25556 26143 41995 74851 72388 15036 -33752
25682 -33752 -43488 -8089 8759 59731 126310 80970 48131 15890 14606 -2595 -86145 -44397
25670 -44397 -1648 49599 47411 31332 12370 -2364 92230 125112 87953 85592 61573 46383
25658 46383 9834 -16674 24865 23313 21280 32501 38565 43392 -21062 -87357 -71688 -76747 -27969
25645 -27969 27571 67903 81867 86004 46240 69530 76792 -9601 7764 50502 65851 2773
25633 2773 -57792 -122511 -80999 -72468 -37314 -34320 -14187 71818 112318 63049 4698 -37546
25621 -37546 -87104 -56002 -50685 -37646 -9502 -84788 -62752 725 -3504 -38120 -35309 -4612
25609 -4612 41862 64420 23194 -9665 3816 45121 12291 -31339 -13968 42867 93496 63219
25597 63219 33477 34059 -18774 -57590 -32158 81922 94289 19326 -43931 -17454 -11767 -41593
25585 -41593 -52461 -43711 -29071 -40555 -55405 -36887 -90802 -150686 -130095 -132320 -78039 -67856
25573 -67856 -64186 -45826 -25454 7825 -25570 12272 48880 83458 71843 60104 41367 34679
25561 34679 38845 49833 75934 68626 21413 -20803 -62107 -110026 -96422 -33560 -22420 6887
25549 6887 38101 13724 43903 22569 29276 52870 35506 24326 5761 -22807 33179 55809
25537 55809 -21874 -44430 -31523 -68655 -48223 -38729 -69874 -106258 -100040 -105530 -126261 -62158
25525 -62158 -36040 -65847 -44571 -120065 -96853 -59808 -33867 -4358 -44891 -13808 40591 18600
25513 18600 53584 66913 20805 24030 59020 45261 17067 -15898 13530 42071 57535 30286
25501 30286 28119 9924 10499 -30893 -2621 59339 93108 84907 48749 65437 64027 57743 58124
25488 58124 44508 2931 -2106 -3418 -6969 -5451 3311 36880 -7744 -617 7195 -58827 -60354
25475 -60354 -63703 -84613 -102166 -42417 -54726 -102840 -42021 -13683 5296 -36933 -64011 -15773
25463 -15773 -30548 -38126 -52673 -21779 -29645 -39173 -33582 -15636 -7651 -32910 -14419 46232 73012
25450 73012 54351 24967 8830 -10042 22349 30761 2261 39069 24540 23201 25326 -6213
25438 -6213 -35375 -6873 -10843 9764 49688 9354 649 16575 6312 7121 22732 45281 57794
25425 57794 10302 14343 35484 31659 -1115 -9584 -54453 -70424 -33862 -1932 -27554 -27822 -31744
25412 -31744 -44021 -4101 -1108 -7932 -34375 -8990 29042 16420 -39727 -17982 -98116 -95802
25400 -95802 -20069 9205 11666 -25998 -62771 -99577 -51705 -29063 -41793 -53182 -53625 -48639
25388 -48639 -50726 -64269 -38890 4708 -65547 -120499 -122850 -92566 -36148 -49632 -46341 -40840
25376 -40840 -60237 -45680 37341 36077 -32309 -48791 -57108 -61561 -80505 -60981 -56717 -42429
25364 -42429 -37210 -22204 -60725 -99635 -66028 -39922 -45881 -37898 -608 39266 16898 14460
25352 14460 -33483 -63051 -95532 -61097 -41670 -36018 -38021 6251 20692 -119 -25201 -60636
25340 -60636 -94042 -134289 -81671 -20233 1293 -9607 38687 64002 111784 109767 80854 -10554
25328 -10554 -61691 -35679 30688 41528 81932 91420 80821 34834 -17239 -32867 -19944 -51333
25316 -51333 -70460 -68243 -100169 -54341 -21492 -33506 -42335 -64075 -26655 -6145 -44325 13855
25304 13855 18550 -32725 -86369 -134863 -156832 -133833 -106224 -56110 -49651 -82766 -50868 2018
25292 2018 -17135 -25268 -53377 -69933 -21382 32054 13212 -29877 -80465 -49989 -51284 -66523
25280 -66523 -34234 -12105 14978 13987 -12586 -21484 -34628 -28095 10293 20867 -8948 6419
25268 6419 16308 49912 28878 -3076 -32014 -70260 -31560 6680 64909 54354 21721 26423
25256 26423 -9559 -41653 -32605 -15907 3071 65084 67013 32383 40774 70396 73320 -5253
25244 -5253 -59518 -63918 -42510 10347 7523 -15635 -37990 -24531 36264 40543 58935 102593
25232 102593 71366 18175 -33645 -79209 -42258 46944 86107 94920 -7686 -36839 -16875
25221 -16875 -47650 -74343 -63052 -8067 3114 -28293 18707 36280 40028 20516 8763 -23337
25209 -23337 -28721 -24881 -39732 -541 -54660 -29523 -8747 12159 -23594 -7145 18603 14920
25197 14920 -28458 -35248 -33139 3808 16906 11444 7269 -19016 -15110 -15238 -50840 -69321 -34135
25184 -34135 -59476 -52061 -35550 15875 26184 -16976 11356 39524 25678 23451 234 -31145
25172 -31145 -19113 -18560 -2203 43112 23189 15885 3648 -20456 -17201 -16551 -23777 -65133 -108667
25159 -108667 -77191 2633 -30165 -28438 -12920 -658 2075 -50073 -70879 -98817 -100226 -48527
25147 -48527 -31110 -37035 19560 39465 42960 25153 -2787 -26781 -61999 4978 46285 25249
25135 25249 13405 -9290 -15802 -44992 -27159 35240 24021 -47785 -61121 -34254 65770 102693
25123 102693 18148 -48159 -55286 -63364 -65589 -91465 -52232 -12013 71293 61957 48595 61645
25111 61645 61869 78007 52200 -1454 40844 69564 101569 101065 86997 64393 41349 53237
25099 53237 64427 72775 89129 87887 88725 91223 55129 -4176 -72488 -106736 -58760 -13527 -2267
25086 -2267 2042 -30756 5045 33054 -7888 -44354 -64168 -81726 -89734 -74578 -63972 -81465
25074 -81465 -78889 -74441 -76948 -62922 -73214 8002 50617 43569 -19493 -54400 -31754 -63928
25062 -63928 -90081 -77594 -51876 -40065 -7659 -5211 29411 -13615 -51388 -85785 -91247 -105318
25050 -105318 -120997 -62860 29484 -1013 -78713 -113920 -93521 -60131 -48834 -112730 -131509
25039 -131509 -104254 -20401 29876 23762 -2790 -34361 -1952 -12342 -40528 -38513 -4244 -39731
25027 -39731 -126761 -95223 -65387 -27356 5007 -38024 -21814 65433 123733 62978 58811 21935
25015 21935 -15311 4095 40094 70625 78225 54163 55220 -10473 -24990 6811 29893 9933
25003 9933 19369 -1240 -8841 33753 85161 68410 50439 42706 1070 6860 19094 51056 81363
24990 81363 12692 -67907 -81701 -108173 -104284 -89966 -89572 -65680 -57775 -72688 -19141 -39914
24978 -39914 5129 53764 71065 47563 52792 42121 42146 88902 89544 -63 -29800 -12606 22227
24965 22227 37794 -2419 25837 -5527 683 43734 18497 -5763 1161 35759 12720 50134
24953 50134 145246 68855 47536 33627 -12913 -38546 -26034 -23804 -19788 -9636 15358 -25083
24941 -25083 -8351 -8061 10274 6021 -68246 -71255 -43115 -79959 -100401 -62258 -20078 -45423
24929 -45423 -45034 -24190 -22981 -38835 -19344 -39850 -59816 -24210 29998 75372 80565 97285
24917 97285 114066 111937 117289 75160 12036 -22831 -19322 2032 3143 37225 57922 118186
24905 118186 68900 22545 17188 -13388 41352 70037 29434 29939 17445 -70306 -63827 -72856
24893 -72856 -99667 -101081 -117474 -147751 -137270 -41573 56624 91861 127288 143836 102270 20200
24881 20200 -35575 -44922 -23193 -8982 -16374 9611 -19335 361 25860 45576 10448 20356
24869 20356 11118 65294 37984 -12972 -21864 -50160 6125 26649 -47001 -28889 -37271 -102615
24857 -102615 -58137 19290 -9386 -60951 -86695 -51293 39600 78394 45349 38993 64648 4468
24845 4468 -24489 -4863 67889 64838 28281 -25224 -39950 -45275 -74341 -73398 -21495 4412 8794
24832 8794 50322 97413 34168 -52439 -108020 -121462 -63152 12052 -5615 -35641 -3194 10497
24820 10497 27350 73515 84818 137702 96630 30398 19046 41961 26949 -23018 5464 -30122
24808 -30122 -20375 -3608 14719 26470 46192 22909 29636 89312 63573 61242 71751 15090
24796 15090 53500 14520 -64520 -65586 -42529 -11565 2046 -30556 -68611 -77732 1414 26727
24784 26727 49668 59555 45179 56511 33292 15085 21757 -27864 -39159 -60402 -28310 -37427
24772 -37427 -39577 -735 45490 63045 110854 134186 104854 95552 50781 36141 7858 13309
24760 13309 -12991 -112262 -113444 -92542 -59814 30076 78526 116522 59914 4372 -30806 -32779
24748 -32779 -5856 -9422 22649 15646 30880 -26670 -55165 -44594 -4854 -32703 -41796 -40274
24736 -40274 3908 46881 57770 69255 72346 120987 66459 -41049 -56524 -10692 54606 84281
24724 84281 32341 -19340 -2017 34306 -17392 -40999 -60208 -42045 7002 16532 -7210 7129
24712 7129 -5119 -4271 -31971 -30401 -43244 -71250 -39299 -24115 3012 41346 86167 63209
24700 63209 39256 24196 35932 -2966 9885 -14897 1564 26336 22435 6616 -7896 13500
24688 13500 88172 30744 -5713 5577 81382 80903 11964 1672 -32480 -59928 -65736 -112388
24676 -112388 -100889 -47470 -111095 -102159 -53513 -37078 -44393 -64131 -5717 43702 41803 51991
24664 51991 33586 -2741 56751 105190 124659 39110 -16861 19770 13508 -9995 -40521 -19746
24652 -19746 -8828 72 3417 449 66057 83266 56960 -3051 -54547 -50558 -72091 -65371 -12165
24639 -12165 -24883 -48326 -30733 -10404 -578 5484 29347 23022 -30987 -36703 -51056 -17901
24627 -17901 3996 21367 -8105 -14472 -61897 -32146 4458 4722 -9356 -77899 -91248 283
24615 283 12030 37752 39549 -424 -8042 56424 85350 59682 -33242 -40807 23796 59725 50864
24602 50864 13289 31188 -26950 -36869 -60480 -43013 14715 79975 125000 26972 -10605 15561
24590 15561 -18418 -47628 -15867 12032 -16014 -33599 -10579 -6707 -20229 -49257 -18865 53992
24578 53992 30528 -3138 19081 35044 4464 -33338 -7928 -5581 19725 13897 28900 16842
24566 16842 38983 77204 78790 27082 -49779 -130280 -109506 -86577 -31139 -36124 -59108 -12987
24554 -12987 22092 59440 34544 21094 54843 14933 -40869 -3844 -3109 -64160 -74892 -111269
24542 -111269 -97882 -76542 -63710 -71356 -28478 36682 74334 127162 66919 11866 5759 36935
24530 36935 -19494 -70157 -109781 -120755 -162780 -199105 -164226 -89010 -24830 2347 -13732 5247
24518 5247 -17246 -29217 -2364 -4582 -15746 -48679 -35490 -28575 7236 -12222 -9800 -12245 -43157
24505 -43157 -2281 -14148 -75221 -46890 24707 114603 87473 -5700 1974 53109 77401 56782
24493 56782 51346 40926 -27828 -920 13324 43118 64580 22147 -42149 -72965 -27840 -15483
24481 -15483 -54286 -103848 -87659 -56716 -34902 -12870 19021 -10431 22362 111266 109969 64584
24469 64584 -4551 -22472 -44344 -39539 41196 88284 109171 126909 101749 55131 29379 -27592
24457 -27592 -57173 -71938 2010 55193 45402 24884 22716 49753 16567 -47099 -65421 -95730
24445 -95730 -75086 -58585 -74371 -58342 -55402 -31809 -38246 -52771 -60052 -58177 -45689 -38835 -40961
24432 -40961 8291 27596 55494 6380 -43565 -2982 41527 10750 12220 11234 20977 13140 -523
24419 -523 2634 -18515 -77587 -104068 -123179 -107744 -85229 -81869 -81135 -45120 -14161 -22615 1643
24406 1643 60082 52010 41127 72265 84902 71623 51797 43815 -569 -13531 -24850 -86212
24394 -86212 -107609 -49922 -41267 -14967 -1239 -36197 -54059 -36437 -59068 -69904 -7395 40758
24382 40758 19759 -16065 7099 39855 -6182 5959 6976 -68669 -35993 21012 52079 35962
24370 35962 32249 13684 22062 54443 58384 57806 17487 -703 6973 49969 88557 59754 45091
24357 45091 2367 -15373 -2760 54545 36707 39044 1045 -29719 -17593 47545 63480 86222
24345 86222 112808 95582 80108 68193 67135 21913 -16598 33670 56237 60678 59063 -19381
24333 -19381 -4829 49538 75821 91851 41111 53919 -7622 -36807 -9374 -17168 -53100 -62339
24321 -62339 -32755 40703 35051 680 7566 4565 15834 4078 -33047 -30977 -19054 -135
24309 -135 61164 55788 19102 7022 -6428 54703 26916 -463 -22724 -97161 -75073 -10427
24297 -10427 -17096 195 59204 63073 62000 59025 48956 13632 -7834 30381 72360 86717
24285 86717 91197 106028 85961 -5085 -67161 -23381 20485 6612 -14802 -15644 -18136 12640
24273 12640 -16861 -10003 -4440 11337 29964 -41151 -56369 -12638 65558 106379 16585 -90034
24261 -90034 -112304 -70768 8087 33076 50317 43329 30246 -77137 -143684 -125926 -67167 -39372
24249 -39372 6247 42771 12405 17099 79137 148301 139660 55743 6918 -20967 22184 79108
24237 79108 122388 208224 166167 88975 37426 -16583 -66975 -33157 -13740 -7182 54683 82442
24225 82442 93479 65682 40194 4847 40816 103357 56483 -6206 -47000 -115141 -162089 -99107
24213 -99107 -23915 14245 -785 -10380 -16128 31187 39451 80617 82661 43114 -6497 2415 14711
24200 14711 -2888 -4342 6963 2332 36946 62743 37050 6207 8477 -10781 -6648 -31174
24188 -31174 -67046 -74753 -48788 -69737 -57316 -35758 -55455 -5029 -28375 -27269 -77203 -107881
24176 -107881 -77617 -86865 -75849 -27839 -31908 -73661 -63247 -35063 20994 37825 26214 -49507
24164 -49507 -63871 -62686 -19541 -26185 -79020 -85554 -88869 -78927 -51026 6368 -14522 -7142 28037
24151 28037 14840 14474 48787 69208 62877 38345 29905 28830 20855 40589 15859 -90714 -111270
24138 -111270 -62783 -84274 -52706 -40053 -62866 11548 20449 -20194 39 63140 97910 104821
24126 104821 106680 91693 129046 117133 105662 96163 75178 88913 124183 125656 38376 -40526
24114 -40526 -8899 -3378 -36424 -31064 -19501 -49128 -9270 -5334 -15721 -26333 -78837 -75609
24102 -75609 -35631 -51464 -36943 -15292 -46918 -43582 -30528 -12394 -11534 48584 67683 84929
24090 84929 35753 -55347 -144253 -105211 -54280 -58683 -60797 -24657 46335 54332 33179 -5249
24078 -5249 -14663 -19684 -16139 1751 -43496 -42903 -23740 -27474 -37156 -25392 -35427 -42828 -37183 16835
24064 16835 72359 72377 43528 13906 54032 24234 29228 -26617 -19922 69113 91083 66899 90739
24051 90739 98834 100533 21184 42808 39864 -3981 -33748 -47979 -54672 -46703 -16714 32100 62371
24038 62371 89391 74272 77968 64411 32342 18788 -11469 -53105 -65190 -56979 -20874 17412
24026 17412 60203 64737 43146 13858 27892 29997 44185 7802 4476 -32545 -48818 27306
24014 27306 59634 24465 -24788 -29814 -77563 -93896 -97263 -111183 -60053 19076 83432 40122
24002 40122 -23585 1087 37188 11411 -14821 -44097 -3046 36684 15275 15133 14172 -3839
23990 -3839 -9203 -17315 4659 -15585 9177 60610 40010 -17392 -33774 -15977 -1154 -8806
23978 -8806 -37642 -40437 7321 -9097 -25793 -37761 -110357 -153981 -107329 -59173 10390 -1806
23966 -1806 -9301 -13833 2115 20866 34591 18035 59984 65461 46260 20070 -2621 -31469
23954 -31469 -53580 -40534 -38004 -37676 -2082 2696 -2524 -15496 61322 137258 152851 79834 -37774
23941 -37774 -24888 -27574 2691 6541 10872 12441 -2875 -1546 55441 68269 24845 -48634 -70526
23928 -70526 -65795 -19524 12321 26383 50367 -12722 -59746 -51120 -12765 -573 30602 18033
23916 18033 -33115 -41997 -7525 -26364 -26902 -29572 52902 38118 -3112 9493 -5732 -9162 12446
23903 12446 18842 40513 16103 18414 22131 15448 6936 35737 61311 21856 4441 -27002 -55046
23890 -55046 -68606 -58331 -5458 11579 -44225 -28869 16373 -33051 -78356 -27409 -10070 -13750
23878 -13750 -83505 -78562 -38791 -66150 -103789 -90630 -38216 -30364 -37242 9985 68260 99318
23866 99318 78188 58672 -15050 -15031 -46527 -67591 1114 14254 1131 2234 -42 6305 21123
23853 21123 -4308 -39421 -7352 64834 45397 8400 -11179 -25122 -35260 15370 2128 -15007
23841 -15007 -50096 -29456 15791 2903 -80871 -97210 -77895 -51245 -42760 -21546 -11749 -41364
23829 -41364 7396 26821 55004 45432 38104 52925 -5097 -67559 -14085 -8867 -72949 -72565 4227
23816 4227 49173 63739 51708 49640 -12581 -60481 -53036 -69506 -79875 -38173 6415 9131
23804 9131 12896 19733 -21969 35042 13372 -8663 -12926 -28388 1165 14688 -23214 -23722 -40034
23791 -40034 -23834 -2663 -841 -10997 -25456 13854 31736 37252 27636 -13191 -12473 48386 35607
23778 35607 -13135 -83057 -53543 -25573 -20839 23383 -36607 -76571 -74424 -11054 -12201 -35295
23766 -35295 741 -65310 -89158 -60751 -31495 -19302 -33944 16763 -18662 -17564 3740 17548
23754 17548 15473 -30125 -68544 -54618 -7872 -41824 -47633 -63585 -47505 -34107 -58589 -67050
23742 -67050 -19453 38117 84448 60445 36366 67584 72440 25835 -12330 -50500 -7596 -42265
23730 -42265 -66139 -53656 -38213 -54367 -79212 -42655 -6089 23338 19612 -58057 -78751 -64129
23718 -64129 -30984 5320 11554 11334 18308 38147 8927 -32725 -26360 5129 19842 10787 -31898
23705 -31898 -54235 -35444 -1448 -15069 -25865 -16237 56591 54737 77986 65024 26936 10514
23693 10514 63213 45952 -3299 13116 1868 -19908 14781 3075 -17696 -35026 -2764 -15637
23681 -15637 -6925 18584 41497 83647 109991 128161 163794 151759 105429 73576 59987 84726
23669 84726 71843 31618 -24766 -48511 -76075 -24776 -19531 -47623 -44084 -459 -10248 16268
23657 16268 646 -35862 -55235 -49950 18699 31275 77297 39709 13387 -29432 -36268 -5497
23645 -5497 35318 48202 43087 10223 45297 -1965 -33088 2129 40968 35007 75775 20010
23633 20010 -48681 18986 58182 30602 39411 95964 109534 78808 63354 62192 78977 102874
23621 102874 103637 137698 177308 152303 67476 9275 64686 21507 12062 67585 63953 55674
23609 55674 67215 25665 706 -12219 8032 -24860 -52183 -36025 18955 10553 -7452 -70523
23597 -70523 -59693 -9049 -21218 -59375 -102381 -94839 -112093 -131712 -95280 -63930 -62336 -25331
23585 -25331 22058 48741 41554 1951 -2216 -13282 -6092 -2117 -11584 -52327 -31865 -3770 -13184
23572 -13184 -17896 5639 9081 -23054 -52882 -49808 -22448 -47202 -7087 52061 53615 -22897
23560 -22897 -65351 -106533 -175854 -128559 -65815 -40444 -9588 -412 22440 44717 10449 -77846
23548 -77846 -132319 -137143 -63768 -20817 1481 -5455 -42254 -54061 -44784 -79866 -80987 -86568 -56432
23535 -56432 -36526 -52429 -88508 -119126 -133829 -122305 -107939 -80388 -60986 -53426 -67566 -13572
23523 -13572 19224 -45653 -93816 -157379 -158595 -107668 -121273 -97732 -92182 -63893 -9405 -8177
23511 -8177 -49143 -62007 4019 53192 12393 -14963 -9036 37848 86902 34588 29546 59678
23499 59678 61473 31074 54657 93761 67429 36906 22171 -8409 -7433 42334 10936 -4684
23487 -4684 -29766 -42056 -26314 -20529 -19584 -20997 -41754 -69294 -74338 -13776 13181 -14157 -7173
23474 -7173 39342 85157 30692 -24812 -48706 -97235 -95088 -48006 -41665 -56187 -7334 27449
23462 27449 39594 30745 -16650 -33091 -8652 16517 67987 95138 50414 16180 -44760 -6364
23450 -6364 34264 71137 66742 61751 74425 64342 37137 -276 -33169 -74627 -58479 -26473
23438 -26473 -5127 9786 -31171 -99252 -107625 -55155 42514 92867 77118 58340 34950 25100
23426 25100 47732 27276 20912 90135 134859 93848 26208 -23218 -48260 -21138 -45734 -64502
23414 -64502 -16 28967 14816 30020 3674 16161 9796 53177 24030 -40269 -27366 -22984
23402 -22984 48393 79225 52725 7731 -39651 -44955 34964 268 -32855 63626 97635 42658
23390 42658 16736 37551 8517 2280 20604 8962 -25277 31769 88242 78230 61264 73092
23378 73092 12278 19114 49796 50493 21748 26250 36835 43023 75231 103038 44363 -3643 54511
23365 54511 60364 23138 -73667 -92087 -64168 -47575 -11736 36066 66814 91400 42650 2876
23353 2876 12048 -14785 -34645 -24859 -27408 -203 28233 24327 3424 72002 104983 73725 65578
23340 65578 41752 30867 39553 83978 99898 52372 31357 16646 37159 76394 64841 50016
23328 50016 22310 -21546 -21110 -36016 15866 -12022 -6510 39797 85548 88532 66146 34021
23316 34021 12099 -18078 -9285 34605 62947 -15036 -94656 -73113 -28578 -85103 -130377 -104628
23304 -104628 -36662 48919 40737 -21826 -44779 -78995 -86930 -90564 -97331 13056 16395 -29225
23292 -29225 -12979 36252 56758 67747 43283 6210 -12478 -46559 -15582 13405 23228 78918
23280 78918 79685 63699 20815 9863 -31102 -45475 -91341 -71958 -108998 -109759 -21954 63102
23268 63102 80912 94326 138630 101905 60394 27647 66054 90579 80730 25508 -26540 -19855
23256 -19855 34664 50285 1694 -15221 -23853 8271 40204 22901 -7407 -25049 -42002 -71989
23244 -71989 -59669 -24532 -17826 -1244 -90087 -163606 -152394 -97779 -94838 -79944 -18207 -11847
23232 -11847 23176 88395 100925 74516 31007 -4752 -21004 51932 98747 105120 28308 -51258
23220 -51258 -24557 5183 -17769 4367 -33195 -39130 -7761 -31577 22349 44867 27303 -9425
23208 -9425 9040 24295 -44794 -139753 -103994 -103573 -122375 -117918 -65058 -70800 -40506 -3516 -47918
23195 -47918 -64489 -6716 24014 28268 75891 62963 58538 78792 119005 119029 127210 158778 135912
23182 135912 117795 76510 80999 76652 20281 33382 57612 92278 119375 49653 40924 8035
23170 8035 -87602 -137276 -73547 -27561 2435 66910 75266 5856 -17886 -40540 -60442 -49087
23158 -49087 -55811 -38886 -4423 12790 9748 -12018 -61243 -26881 26114 41703 18759 79043
23146 79043 49368 20136 25468 16835 -35869 -31432 -36710 -25461 -4466 3359 5180 -21122 12665
23133 12665 68666 51631 37375 -10977 -38224 -97008 -88729 -57645 -65017 -68751 -37004 2885
23121 2885 73696 41224 -16799 -36745 -5270 12865 -3455 -35839 -63964 -36133 -79245 -86946
23109 -86946 -53153 -52420 -24973 5893 4634 10357 -28423 -18336 -23453 -38915 9172 -10850 -4098
23096 -4098 -15570 4599 58729 40716 13785 41579 28307 -5672 -42825 -54652 2434 29312
23084 29312 40792 24988 23395 24574 -28814 -110053 -104151 -92184 -48075 -15119 -34777 -41694
23072 -41694 -52379 -52892 -17072 -29056 -28469 12074 26571 -11191 -15540 13849 -10933 -26429 -57430
23059 -57430 -38283 -2159 -45723 -62912 -71521 -21267 -52623 -88406 -60556 -15628 -27600 -30699
23047 -30699 -30516 -49322 -61601 -28229 16045 -1659 -3926 32132 44110 72736 87462 93564
23035 93564 150041 100585 57059 27005 12996 37969 1582 1936 -32100 -45717 -18545 -29123
23023 -29123 -65252 -52573 -22779 5542 -54728 -55534 -79205 -69921 -5635 -4513 3954 23039 -79431
23010 -79431 -132060 -117865 -45565 -24475 14661 36829 48515 37522 -16799 -67444 -34061 -2595
22998 -2595 41090 99835 102176 4529 -50063 -77529 10618 88594 33118 -26677 -23485 20149
22986 20149 43315 102426 81882 174 -57253 -52731 -1787 59979 4158 -28085 -40216 -70602
22974 -70602 -99581 -66011 -57183 -20259 -17806 -25058 -16505 7481 44135 67598 50431 24402
22962 24402 -20105 49202 92449 93050 -3577 -65318 -23145 -12575 -36152 -69225 -90339 -75780
22950 -75780 -62416 -81011 -69677 -53305 -83108 -35663 31237 6281 -42166 12290 18949 25497
22938 25497 -1752 -2179 10145 -7380 -36560 -50817 -81502 -36001 -12571 12264 -6931 -79260
22926 -79260 -71385 -60812 -38201 2184 22769 -6316 -20844 -54584 -115731 -90857 -53900 -45466
22914 -45466 -35369 -41774 4492 18093 36924 43444 25249 14496 -17164 -3488 -20509 -10670
22902 -10670 18324 -2321 -4436 -52293 -67979 -78461 -97093 -136858 -119343 -79727 -66228 -40922
22890 -40922 -4258 58772 3023 -20789 -41565 -68264 -62254 -43198 -2842 -23803 -39195 11707
22878 11707 4007 -4161 11188 6977 -15886 -27686 -17429 -11629 -2569 -40458 -114169 -134972 -105776
22865 -105776 -23917 -42119 -31951 14205 38207 68486 48416 63744 73601 44811 8823 12173
22853 12173 -36384 -88350 -82503 -39405 -21225 -27045 -29485 2900 91054 141143 89331 63240
22841 63240 76861 83637 49740 -7842 -38977 -15983 -33331 -23256 -31644 -90261 -62798 -25905
22829 -25905 24327 10205 -29509 8042 110505 155725 155048 110861 136982 92953 52219 61580
22817 61580 59305 21827 10105 19062 -6721 -15063 -32150 -38268 -33051 -69577 -63166 32875 57892
22804 57892 10789 -9065 -35536 -11776 27639 -2400 8089 30268 26508 56066 11553 -2185
22792 -2185 49649 70068 92785 60931 3637 -31748 -74704 -69643 9950 33909 37801 41536
22780 41536 55034 29945 37001 21538 12690 -18803 16820 42296 44335 52279 37905 93992
22768 93992 95106 64752 54012 29758 70872 81222 87142 87555 66195 37993 -53521 -35540
22756 -35540 20119 67217 57222 53531 84282 47345 24542 -1068 -28666 -23687 -8263 -5738
22744 -5738 46417 67573 48061 4513 2532 -6771 -29068 -36510 -57623 -47322 -50873 -43111 -40709
22731 -40709 -65964 -78758 -36182 23707 70105 61664 40165 2034 -6905 25062 26165 34157
22719 34157 -32112 -60511 -51944 -14325 -42208 -17531 11522 8817 9280 -35269 -57310 1239
22707 1239 -10757 -44295 -31797 15865 -8521 -28324 -54514 -52494 -1927 29919 2837 4717
22695 4717 8825 1674 30515 44444 14054 -1045 -783 2533 22042 38808 -30284 -45177 -9693
22682 -9693 39943 32407 3722 14039 23674 61576 97370 106939 76424 50221 24639 32345 50561
22669 50561 33267 2737 -43723 -74091 -80641 -105829 -112732 -31522 81909 92629 62571 62800
22657 62800 47441 29288 -10889 8972 74582 62391 54615 37112 48478 86536 126736 159575
22645 159575 184758 140296 79581 103368 81068 20704 6270 8195 -47417 -13503 25702 53692
22633 53692 60255 64568 51294 -27554 -14397 -15971 -28577 85 -12413 -61170 -5401 30045
22621 30045 14968 35722 46307 -264 1826 -16288 -22770 -41970 -7284 -21056 -70171 -103238
22609 -103238 -77843 -29436 -22571 -10742 6421 13661 -17061 -28755 -23137 -92794 -72370 -8131
22597 -8131 -11138 35509 71549 50242 -19641 -13267 17864 39472 59791 69039 13942 -24720
22585 -24720 -980 53760 28872 -63051 -126707 -117211 -72395 -32430 -43524 -101328 -167914 -175526
22573 -175526 -133333 -79504 -3916 19635 -13544 -69917 -71323 -58916 -53219 -50501 -45948 -58796
22561 -58796 -102464 -145420 -117298 -47472 51171 118711 51410 2670 -18546 -58495 -81546 -65913
22549 -65913 -41844 -19214 7172 5403 10663 31660 32250 -7020 -12226 65438 74431 42136 -13959
22536 -13959 -21126 16723 106019 55426 -26421 -54029 -51961 -12753 -70098 -107481 -102736 -77733
22524 -77733 -87628 -86278 -72223 -63341 -45983 -45467 -55176 -103463 -156391 -141984 -62683 -32020 -48704
22511 -48704 -26671 -10401 4228 7074 23129 19421 44230 107517 113171 97125 56467 48181
22499 48181 45807 71465 94085 57438 70181 77045 62145 75509 70416 39786 -366 32502
22487 32502 -16700 -29228 50335 49876 29430 28642 -38772 -63846 -66727 -37387 -50782 -51769 -2407
22474 -2407 2654 -46548 -72221 -40490 -37358 -43780 -43172 -61257 -60724 -61161 11508 42080 50995 41906
22460 41906 -8431 -47527 -73990 -86692 -32833 -58364 -48023 -57222 -29184 -31383 -105447 -137670
22448 -137670 -136661 -88548 -50703 -100009 -169250 -175060 -120468 -43501 -30201 -26428 -23170 -779
22436 -779 2575 9685 7630 14322 26998 12081 -15551 -7911 1525 -51752 -96278 -39543 -53906
22423 -53906 -44158 -20297 16067 66545 93007 88378 80074 39680 -6454 10908 14327 -19048
22411 -19048 -42827 -40640 -55399 -64341 -65546 -53551 -90351 -108726 16312 59341 32577 -39494
22399 -39494 -119341 -97639 -37158 -54016 -48919 -35830 -5164 -48250 -50097 -17457 -11352 6311
22387 6311 11945 -11966 -8491 7160 -34716 -51591 -76148 -26159 -18364 -60643 -28115 -59014
22375 -59014 -135188 -210075 -196157 -98536 -5243 -29245 -126160 -191044 -164076 -121190 -90706 -19712
22363 -19712 10099 33319 53795 46344 8391 -15099 8690 26555 26581 21905 -31263 -50862 -52863
22350 -52863 -87237 -83764 -60659 -67471 -49042 -86041 -123175 -58053 -12359 -28128 -21106 17860
22338 17860 56330 104573 73779 33116 22625 -680 48012 57290 29081 -14970 -8074 2441
22326 2441 -9851 -39612 -42557 -23953 -42055 -6620 41390 9846 -36369 -6067 35078 46189
22314 46189 93335 110146 61337 2319 -38445 -65020 -87500 -84068 -30221 -57651 -112267 -43933
22302 -43933 3027 26342 29814 -35312 -60214 -46218 -48738 14956 44610 25274 16191 11728
22290 11728 -36398 -45779 -19839 -2699 850 1357 -25671 -22560 -55184 -98196 -134647 -101892 -73203
22277 -73203 -55533 -78833 -92189 -87187 -54034 -36997 16714 95579 48551 -2149 -30576 -518
22265 -518 -28238 -38965 -37206 -79861 -130015 -79246 10709 59198 30134 68946 78985 69478
22253 69478 50458 14307 -58508 -38123 20050 -954 2227 7601 62329 50038 17870 27684
22241 27684 70525 71619 52208 46780 40695 -56578 -99324 -71522 -45005 -35174 -64949 -36992
22229 -36992 16411 -3516 -5472 -23917 -55442 -3319 2526 -27175 -103693 -109098 -76368 -42870
22217 -42870 -35987 5426 45608 49488 -25960 -91812 -82233 -78013 -98248 -120066 -109833 -28827
22205 -28827 -50431 -17990 7741 -31211 -108759 -97398 -56058 -20956 -22510 -82749 -71001 -57909
22193 -57909 -21600 -32157 -49893 -51146 -16138 7884 14049 20940 -12844 -49604 -25622 -14279
22181 -14279 -3448 -18011 -12916 -34198 -56474 -57672 -73055 -20192 17279 10179 889 -25374
22169 -25374 -69279 -89385 -48237 -8700 -10587 -27381 27765 -12996 -37974 -27495 -16041 -35818
22157 -35818 -42018 -43726 -14125 28908 18349 -43930 -75987 6865 4768 -16771 -51471 -101871
22145 -101871 -52482 -29607 -45930 -54589 -61722 -45678 -6260 -7534 8265 25615 -3704 18567
22133 18567 404 17745 62601 49534 46311 20108 1799 -1586 29648 53615 40844 64061
22121 64061 -27443 -120686 -124844 -98134 -87628 -117981 -128001 -94918 -71818 -59956 -36948 -12581
22109 -12581 11099 48348 29980 31188 63951 64575 14571 -7039 -23473 -33991 -63158 -8786
22097 -8786 19928 -1855 -22650 -234 -8404 -37581 -33332 -46729 21519 38470 11150 39032
22085 39032 73328 69668 63494 65468 77844 66238 23368 -14607 -27314 -30481 -16575 24526
22073 24526 15307 -26480 -29995 -41896 4391 51344 46230 2113 -632 -47462 -39852 -32761 -45367
22060 -45367 -20726 -21550 -10557 18659 38147 65255 67988 78896 42402 27642 -15245 -53742
22048 -53742 -11677 54154 47997 51439 82269 109428 71443 16754 -10654 24830 23695 48219
22036 48219 99043 110832 53584 18980 12027 31370 19377 31398 -12505 -18850 32697 30588
22024 30588 -6994 18916 42506 -4194 -25129 -20512 37774 23151 42195 31963 15467 1726
22012 1726 -39896 -18977 5643 -11617 14888 -26697 -63673 -49560 -10580 -1722 -1886 -43354
22000 -43354 -93431 -110752 -107080 -97176 -93856 -59471 -34529 -43855 -24094 -26797 -47636 -69862 -85977
21987 -85977 -33220 10153 35187 7824 -35280 -49406 -26072 8077 59732 73554 -18759 -84642
21975 -84642 -55583 -33080 -23024 -30307 -63961 -79015 -44522 -25674 -7554 69465 27142 -20215
21963 -20215 -23044 -38344 -24514 -34212 -7015 61032 74428 49842 63100 67916 25265 12699
21951 12699 7263 -8462 -57861 -72816 -60459 -33341 -35807 -32925 -17566 -2821 19648 55493
21939 55493 -6398 -80862 -110890 -60539 -57365 -86486 -65302 -12193 29338 -3534 -34264 -37516
21927 -37516 -43112 -31305 -61811 -76166 -60452 -66597 -61532 -18983 -52529 -41835 11093 -7868
21915 -7868 17319 9096 7636 -51257 -93232 -57271 -27272 -31049 -39706 -12049 48620 81416 85294
21902 85294 91985 27107 -15789 -9609 -53068 -53639 -22221 45901 -17575 -38970 -15725 -7722 -3105
21889 -3105 18482 -22515 -106777 -96434 -69019 -85808 -33160 -35387 -15119 6947 46330 81535
21877 81535 29903 21488 -15041 -5169 -6806 -6915 -34809 -44023 -18175 13983 24975 44913 74525
21864 74525 30660 -44383 -98316 -107449 -86733 -55765 7572 9272 -32626 18120 33348 18637
21852 18637 -8558 -8848 73122 53504 6935 25198 49489 23745 30370 -12890 -93484 -65608
21840 -65608 -61508 -66786 -23849 20779 12728 -28118 -66062 -31507 -43965 -26078 -20780 -48371
21828 -48371 -74669 -121750 -82720 -12502 1761 -3443 19253 -13425 19499 51176 25483 6538
21816 6538 49024 78524 61571 31088 -29183 -52574 -17062 56286 95223 61937 40243 6708
21804 6708 -15438 -14400 6185 -40735 -74862 -80596 -100002 -127108 -78950 -69023 -58747 8238
21792 8238 -9780 -32027 -55682 -73798 -80821 -92185 -99582 -132598 -109424 -91512 -46844 -17009
21780 -17009 -19073 -17423 13673 60673 87135 57821 8578 -17793 -46606 -29558 -38212 -87416
21768 -87416 -31516 8153 -23104 -30438 -24180 14968 29825 45214 -13157 -57360 -30291 33583
21756 33583 21562 10603 -28237 -28478 -38829 -62538 4288 50759 73919 92334 67457 43583
21744 43583 13265 -24038 -82726 -148151 -139417 -65803 -649 7650 -4843 12265 -4203 -71500
21732 -71500 -52973 -50630 -45657 -17530 -46297 -30116 -40091 -21700 16528 10094 11720 -2500 -30388
21719 -30388 -55493 -63998 -74920 -65928 8069 -12675 -36713 -35052 262 16 13125 33619 7174
21706 7174 -2146 10347 46910 45558 5931 42929 59128 47593 28248 16825 56596 35984
21694 35984 25838 59888 7154 -27452 -2010 29704 15974 -4284 41949 23668 16272 37044
21682 37044 11029 35795 -29353 -76867 -59510 2714 -5026 -35388 -71148 -132763 -175497 -135733
21670 -135733 -68188 -35492 -44800 -38297 22300 52023 11796 762 57693 98232 55781 -7376
21658 -7376 -21667 -24590 3817 32541 -24127 -84185 -92996 -69601 -43118 -46855 -63278 -34932
21646 -34932 -45581 -75127 -42840 32720 111109 67914 599 -25435 -5701 17628 19750 2572
21634 2572 -7379 -32654 -71873 -29337 -12011 4976 -28130 -38469 -74767 -57347 3475 1192
21622 1192 4434 -16065 -74835 -107024 -49103 -18886 -8597 -15629 4442 -2948 -40165 41650
21610 41650 92562 90994 73201 62372 28421 -18943 -39705 -41096 -56272 -18450 -42014 -24054
21598 -24054 22199 1898 -39344 -55483 -64098 -17000 -5320 -5459 40952 25799 21957 -31230
21586 -31230 -43997 -45039 -27433 289 -7100 -15439 -8381 -12244 11959 -1006 25872 13339 5474
21573 5474 -50183 -65471 -15061 13094 -35783 -17644 -39046 53234 78027 50160 -49271 -69003
21561 -69003 -64863 -58094 -55669 -61984 -63310 -97110 -60579 -20208 36693 4074 9919 13426 30141
21548 30141 19598 37098 65601 59295 30153 -2198 -19160 -16077 26050 14136 580 -15144
21536 -15144 -60968 -76487 -38137 23739 -18936 -70029 -41009 -18932 -58738 -18203 24895 -1135
21524 -1135 -28767 -78589 -26946 18540 37763 11386 16276 49630 36196 45537 -24483 -97303
21512 -97303 -82292 -9440 44492 48223 94513 58036 -69980 -50109 14616 35896 16429 -37747
21500 -37747 -31917 -14350 27049 58043 79065 66559 26063 22694 51304 4474 -5996 63141
21488 63141 74104 32236 13959 -17823 14736 10491 -38351 28872 28442 29733 -17006 -6919
21476 -6919 -44516 -45296 10012 -4135 19815 32006 41696 25436 -27413 -146059 -113643 -68112
21464 -68112 -58327 -58060 -54983 -72889 -72063 -48393 -20575 -7549 -13142 -8236 -35810 -35728 -29001 -92822
21450 -92822 -154436 -164818 -107729 -38922 -45952 -22934 -11118 -43452 -11072 18672 5973 12233
21438 12233 -26288 -17400 34726 70638 65036 66518 106038 100530 65953 -16105 -33801 -32341 -33076
21425 -33076 -40110 -1007 23491 724 3370 -6952 -43133 -76210 -70964 -42214 -58608 -107810
21413 -107810 -115294 -94498 -89926 -32146 17557 17107 -42027 -17725 42766 34304 -18190 25805
21401 25805 49234 45507 49587 75698 86939 100762 102578 46747 48358 68723 76490 31078 -42668
21388 -42668 -43569 -8558 20730 -9855 -47529 -40720 -24293 -32095 6629 49539 65651 46323
21376 46323 24058 -564 -47404 -83591 -60898 -8541 -13112 -71199 -52936 -65739 -52794 20776
21364 20776 43807 3520 -25486 1065 4023 -11227 -64226 -111042 -118811 -68820 -34872 -56705
21352 -56705 -91984 -91747 -82375 -50146 -21193 -6793 -10459 -21190 30550 34064 73495 91853 102878
21339 102878 48789 -26049 -1519 23400 -20159 -43578 -5248 19256 5249 -61633 -48207
21328 -48207 -94017 -143617 -81200 18620 9183 -25384 42987 53634 23613 -2378 -16437 21284
21316 21284 35314 24932 -66638 -83541 -65144 -33456 -4649 8339 5314 8698 -18153 -5906
21304 -5906 26976 50418 90979 66906 39565 -20352 -44562 -47132 -80992 -69329 -15105 7846
21292 7846 -28805 -21102 -40108 -54372 -44793 6218 -25536 -77179 -95923 -74275 -32262 -56776
21280 -56776 -106353 -27705 14239 -26195 -17619 7793 -39938 -102385 -129003 -108688 -81229 -40016
21268 -40016 -35449 -6572 7552 -21058 -33596 52541 26233 17554 34928 10035 -40176 -63580
21256 -63580 -22004 21568 -452 10343 49551 44623 28634 -16338 -80687 -69829 -84716 -71241
21244 -71241 -75132 -80319 -59060 -62032 -62887 -58756 9949 18305 -22228 -53382 -64836 -73989 -55993
21231 -55993 -50217 -27930 24591 43553 -40644 -27971 18365 12181 -16360 19291 -36730 -63678
21219 -63678 -71048 -44117 2722 93417 64845 -9529 -49024 -3852 -22424 -67732 -118351 -91922
21207 -91922 -89674 -34473 -4224 24794 17963 17128 -11451 -15271 8554 42569 35399 7627 65657
21194 65657 52746 103844 56217 37948 5668 -6697 2012 47240 -26777 -80283 -49016 -40095
21182 -40095 -17143 -6181 -25437 -61875 -49412 -87633 -86393 -41554 -48901 -23183 -20967 -65259
21170 -65259 -47964 -34821 -50578 -45888 -37639 18938 81970 103006 32241 18821 23437 41349
21158 41349 59916 21201 32763 19563 48220 97127 104443 59782 -38969 -50951 -66888 3076
21146 3076 37884 -33968 -86271 -46346 -9230 36308 74917 91300 64602 62850 97275 161287
21134 161287 188481 222971 96872 63471 84650 47568 -16765 -78617 -50970 -20822 586
21123 586 28401 14652 -69581 -98628 -38987 -8258 -39558 -47398 -50138 -15401 -30371 -66961
21111 -66961 -101990 -69618 -71772 -87521 -58443 -11321 33370 19432 38288 10721 -59919 -96525
21099 -96525 -91866 -76545 -40954 46004 31951 -2851 14460 39566 -36613 -63920 -5183 33083
21087 33083 -20095 -48058 9861 39376 21140 25061 6577 76 39217 44921 3087 -21178
21075 -21178 27438 36422 -19992 -79722 -69063 -77462 -46274 -6339 15510 58502 72833 10530
21063 10530 -47386 -32748 13961 17728 -15660 -64401 -59171 -63360 -27042 24976 40903 63854
21051 63854 25079 14985 24066 67606 66222 30881 -43813 -62168 -5821 27948 24431 -2165
21039 -2165 22641 -3378 -8718 -20089 -62886 -81328 -58594 -72118 -82487 -53424 -27093 51119
21027 51119 61165 48264 44395 13422 26094 14583 -21620 -68975 -51414 -24506 -18392 -28094
21015 -28094 -59627 -66694 -34048 -12450 -871 44237 12215 -14861 -17505 -51837 45838 93067
21003 93067 41307 11747 -36154 -59412 -1880 1825 79215 50416 3266 -43987 -61090 -53650
20991 -53650 -66490 -59045 -42261 2597 45666 48936 26683 6894 -1930 -49226 -59805 -58647
20979 -58647 -20603 -58210 -47953 -36431 4252 21002 6648 -14501 -18477 6579 -23543 -47763
20967 -47763 -17334 47163 27265 -27140 -50805 -16932 -4478 -23305 -93214 -116038 -94507 -28487
20955 -28487 -12478 11450 42014 -2358 -69446 -60276 -117413 -70268 -44422 -61813 -106745 -128744
20943 -128744 -116777 -36906 32645 72105 -2746 -39010 -21050 -21086 -49295 -36850 19121 35372
20931 35372 21326 4612 -14970 -830 8310 -3182 -6243 37625 79961 49120 43818 -50876
20919 -50876 -64537 -37007 -45814 -75094 -79920 -52299 -53331 -32370 -11027 -31715 -65982 -32451
20907 -32451 -27231 15468 32913 57475 72497 41841 54356 -837 -95929 -116993 -91844 -74890
20895 -74890 -66146 -25316 -40480 -76346 -118972 -81024 -37028 -34276 -17319 -22979 -23943 -11005 19198
20882 19198 -15659 -33495 -24764 19139 47940 10901 34602 60878 29292 -10526 7587 -24788
20870 -24788 -39777 -36174 -30128 13594 40108 50699 37585 3743 -65249 -30817 43999 69972
20858 69972 -10361 -5722 18321 -29027 -46859 10287 -2578 -37717 12218 -1836 -43789 -62110
20846 -62110 -54913 -36178 -37215 -3673 8474 6894 -42965 -14325 -45981 -14510 3264 16488
20834 16488 9120 22260 13497 -27740 3182 59700 62882 -1870 -1561 58032 36972 2243 -6559
20821 -6559 47269 29777 -33533 463 22656 -27463 -120513 -147746 -104699 -23815 -11574 -32070
20809 -32070 -68868 -65752 -50422 -63055 -111479 -158465 -149810 -141075 -91886 -30916 18445 40085
20797 40085 31344 72143 47214 18798 35063 6621 -8766 11405 33840 28272 14660 8216
20785 8216 -20608 -61366 -54082 -80603 -21544 27540 -7004 -69234 -61235 -55395 -23689 15328
20773 15328 19720 29093 42983 59168 70065 17428 -20703 -4930 2039 19682 -81656 -100418
20761 -100418 -118821 -106760 -59761 -2768 -9924 -75986 -108157 -67880 -56707 -45610 -3555 -52919
20749 -52919 -53185 2451 585 772 -11318 -42381 9909 5817 -64735 -95859 -18040 1956 37826
20736 37826 25427 37377 21439 -17088 -88500 -94083 -73502 -78718 -72002 -53149 -57165 11079
20724 11079 40750 51556 20439 21493 28044 8239 -243 -9474 3845 4544 72356 75497 1704
20711 1704 -36655 -4151 16505 33297 42457 69329 58260 97497 35932 4773 4318 29001
20699 29001 24626 13077 62404 3011 -51071 -35779 -76836 -56661 -18592 -9347 8198 26187
20687 26187 -50634 -56166 -41789 -53458 -30285 -40198 -64466 -31836 -25483 -49118 -20443 4499
20675 4499 -18228 -6387 12144 49413 131396 162865 128796 71525 -10169 -35449 -90261 -56496
20663 -56496 -14097 -49049 -89548 -56793 -18770 6229 -2350 -54295 -17612 78203 90701 47766
20651 47766 10100 27701 16929 7103 8622 8370 -14994 21374 48725 7032 8759 22467 7494
20638 7494 16908 6733 -17853 -23437 26915 58178 -7344 -91533 -114481 -95531 -73289 -60916
20626 -60916 -13460 57711 -5533 -50609 -42485 -28831 3377 1719 29055 26365 -40550 -55556
20614 -55556 -82281 -63080 -22693 -1864 -4824 -2860 56896 48954 22107 -16482 -73187 -74778
20602 -74778 -83538 -73377 -67845 -53832 -40567 -19138 -31009 -18354 -22092 -50588 -60054 -26698
20590 -26698 -78715 -65065 21122 36433 -8933 -15940 -32291 -58353 -23942 -7321 -13915 10792
20578 10792 -19048 -72798 -14030 -10415 -27067 -31796 1117 64935 74396 17291 -49279 -31109
20566 -31109 -36246 4090 11831 11478 30504 24327 2771 42881 19180 -57517 -59892 10384 35920
20553 35920 48551 7388 -21524 21462 -4504 -28190 -53485 -96779 -44470 -18820 -33240 3682
20541 3682 45640 12306 -47401 -64601 -37598 -26372 -32218 2502 9304 14374 90815 107838
20529 107838 41837 24363 29907 49227 23931 -29996 21441 122399 100082 47964 48403 36906
20517 36906 32581 33358 10179 -3440 -30796 -31893 -24158 26273 48452 13449 17532 47538 -994
20504 -994 -56336 -23155 -29744 -54251 -8946 47144 22984 13588 -59948 -70012 -3196 28508
20492 28508 45091 34773 36197 36008 88955 85000 48555 35911 2778 26150 16702 5413 24352
20479 24352 -10573 -23532 -24457 -2594 33614 19032 9062 -16634 25182 39188 22539 16186
20467 16186 20327 7972 30170 -41226 -75283 -31154 -33624 -10268 -12679 -52422 -89387 -45299
20455 -45299 -28984 -25673 -47763 -89235 -47559 -39137 -23927 8226 11160 20015 -13829 -36817
20443 -36817 -109149 -109010 -11893 27582 28939 33542 -12546 14950 73531 62697 71269 69744 -24203
20430 -24203 -62096 23818 73234 46802 36560 23494 5471 38986 76082 71708 15739 -14652
20418 -14652 -28131 -18961 -37852 -51096 -90646 -146434 -97794 -44049 -27922 -1323 12564 -36409
20406 -36409 -38205 -3541 38226 82859 81024 23462 -62347 -114576 -121722 -66768 -92875 -79410
20394 -79410 -66290 -38771 29655 12345 -38329 -47692 -51010 -47828 -1692 -4151 28664 7788
20382 7788 2469 -15378 -14595 -19371 -56018 -82216 -123409 -100371 -39314 -74018 -48269 -37961 -10354
20369 -10354 16095 2785 -3885 38424 65675 77426 46860 20657 -358 7573 14693 -143
20357 -143 26200 41800 30530 -24872 -38885 -8882 77881 85852 52785 69379 50069 93215
20345 93215 138772 140835 107309 47514 35532 23526 -42151 -25574 28169 75716 50292 24041
20333 24041 20239 -72438 -145331 -150695 -110866 -69472 -61226 -77737 -65336 -10537 22518 -31189
20321 -31189 -41807 -53262 -74864 -41710 783 17755 16557 24457 26192 -10242 -60358 -136937
20309 -136937 -103111 -61007 -45815 -33017 18134 14446 -16614 -8555 12032 41572 3707 -40218
20297 -40218 -46606 -16554 5744 -15798 -26290 19194 39828 45174 56158 33704 -52303 -96895
20285 -96895 -43905 -42164 -25422 -42843 -89194 -102270 -102468 -67521 25634 55517 82938 113137
20273 113137 35717 -33151 -48148 10854 25416 17944 5030 -33596 2309 47481 23224 -29937
20261 -29937 -39733 -17474 -18560 -6548 28435 45071 55888 95316 134253 81580 -11073 -72670
20249 -72670 -10789 25314 59672 47990 18294 10037 62127 53991 4981 4953 30354 -17117 -69308
20236 -69308 -59309 6361 22220 88146 75821 43115 -2861 -41669 -20552 21497 -7232 -13723
20224 -13723 -51662 -81146 -46651 -20458 -13610 32241 57084 11600 -34145 -424 46513 10248
20212 10248 5828 3268 -11426 4436 -6399 -57698 -114170 -112428 -40609 -4077 19237 24029
20200 24029 -26303 -91620 -43493 795 4939 13103 47626 36644 -24408 -12049 -954 2293
20188 2293 -930 53267 59044 11398 1448 43045 73775 87915 66729 -15959 -45907 -69675
20176 -69675 -57610 51043 46856 7923 -16970 24509 46654 28602 14285 -9891 -24057 8682
20164 8682 51236 47495 25404 87666 113969 96227 56721 15023 23820 -2579 -81695 -55997
20152 -55997 -31039 -14945 17093 31001 39441 37715 38431 37629 39113 42977 6725 -2935 -3885 -32720
20138 -32720 -120201 -140984 -121697 -71415 -41348 -18675 -28658 -41283 -17086 -26194 -11650 -25238
20126 -25238 -64526 6035 22968 8876 -25702 -30975 -42925 8407 86121 119160 72799 25383
20114 25383 33025 69689 130201 125783 107557 57958 41347 3447 -11554 19462 14562 25077
20102 25077 73341 104389 115240 104303 100411 76734 32990 23289 72738 89558 46329 -5254
20090 -5254 -13530 -5904 47842 32251 -30178 -10696 25810 36170 21373 -14989 245 29099
20078 29099 -18467 -33749 -67165 2285 19335 2057 -7946 -29948 -57879 -23572 15158 7970
20066 7970 10252 42726 46007 52960 57780 2131 -14428 32219 37248 -4803 1077 32507 58385
20053 58385 -1499 -23722 -56471 -64650 -43618 -28438 33770 91970 66354 39160 10540 43
20041 43 11825 -65714 -88199 -51302 10502 30448 69940 140183 141329 57321 30264 36638 12162
20028 12162 -39988 22580 48990 -27049 -50720 -46743 3611 36474 21547 37447 27871 -15321
20016 -15321 -25024 -25108 -41868 -76136 -110217 -85003 -41405 3667 -4770 -36822 -5704 -721 -7444
20003 -7444 35585 43087 58936 52783 60202 22574 17049 -3009 91008 111571 103336 58896 46834
19990 46834 18071 32054 27056 12843 43951 53646 19653 30151 20799 -28539 -18400 -9425
19978 -9425 2944 -23211 13122 59158 79576 31460 -6168 -19648 -59783 -49483 -26438 -2129
19966 -2129 -44024 -101219 -90178 -52204 8777 -70 23155 17021 -34930 -39409 17510 50392
19954 50392 -10456 11853 66259 115081 144356 140049 29009 -10580 -6387 -29965 -7976 -36515
19942 -36515 -38503 -11973 17217 19759 8442 43014 37931 61930 64062 44842 52851 54469 34831
19929 34831 -4491 -5256 -15508 20357 64548 13176 43898 26970 -8896 12600 66057 9380
19917 9380 -21422 -45200 -62556 -26158 24864 -1590 -19336 -14582 -22587 28625 31111 32346 30394
19904 30394 30136 -5492 20883 5380 -8812 74808 107576 116206 106844 51738 39768 64356
19892 64356 44112 60173 85315 66123 58398 10596 2593 -21820 -13281 43032 62387 84977
19880 84977 51307 -14085 -11691 -22433 -39467 21350 32821 40215 31178 539 -8735 -31142
19868 -31142 -48013 -36004 -56875 -50436 679 -10270 -37898 -45806 -104400 -178833 -123250 -44524
19856 -44524 3120 45621 56700 87229 86677 80140 88511 40862 18547 18253 -2754 -5061 -54605
19843 -54605 -51774 -39835 -60661 -33386 -33586 -1953 65619 66588 53800 25987 52028 64338 1291
19830 1291 -37670 -37496 31821 -14910 -61305 -57913 -77537 -72616 -88745 -66393 -38384 -42716 -73208
19817 -73208 -14986 6029 11074 18544 75178 87921 51892 19743 20309 -18464 -74147 -55903
19805 -55903 -20739 20374 55183 23279 -41519 -45029 -17601 -15254 -45772 -35499 4647 -22346
19793 -22346 -23419 -17568 16379 -7141 -21953 -14987 46515 22443 -76874 -112113 -98354 -41431
19781 -41431 -50044 -63634 -29948 -23707 31329 79326 33057 38108 4794 -76576 -112099 -99989
19769 -99989 -76065 -40166 -11992 21550 35855 26449 23839 -4120 -62763 -43893 4197 154
19757 154 10007 70467 42469 44964 62893 67633 28072 -4090 17617 6413 713 48880 50413
19744 50413 46376 -6478 -1141 68104 54744 17160 -2946 16552 -25975 -43129 -59093 -3603
19732 -3603 -13215 13594 16211 -17131 -18007 24472 75718 74077 61899 -1101 18231 27401 -9444
19719 -9444 -23544 3841 20653 3420 -12390 16796 15320 51842 44794 10260 39048 -27314
19707 -27314 -35609 -3252 60531 79570 34120 46691 8522 -18000 23349 36068 15152 2040
19695 2040 -4751 1635 -45539 -54524 -85363 -32568 -8210 -47626 -40086 31377 78898 77805 90380
19682 90380 36800 7223 578 -4353 17729 30919 11609 -1345 37149 -2779 -66532 -19230
19670 -19230 37110 -15638 -23416 -24925 34684 25834 1928 19461 7047 -31264 -57225 -44748
19658 -44748 -83505 -25723 -17551 -35764 -14522 -37917 -53833 -25605 14798 26499 37665 71321
19646 71321 39133 -21825 -52306 -19712 607 26924 71169 74951 44902 58251 60607 41931
19634 41931 16472 -29972 -55086 -30893 11103 4746 -33963 -39042 -18481 -22386 -35146 -11717
19622 -11717 66140 89546 56299 14028 25125 18050 32621 32101 37568 33051 54143 85328 62702
19609 62702 31700 33219 65694 21441 -23402 -14994 9312 202 -11738 7622 -6116 -26402
19597 -26402 716 -2822 9919 111662 120417 131691 94947 59368 42116 25003 11510 -8212
19585 -8212 -44088 -25205 -23478 -22278 13109 5208 9910 33839 33590 44820 46979 20951 -1403
19572 -1403 52129 70559 72273 55374 58638 43099 19633 56995 108925 96958 38938 -15516
19560 -15516 -70527 -77010 -70231 -28709 -26887 -55164 -82369 -58822 -7504 37458 29632 -16598
19548 -16598 -44858 -23316 6940 3715 34394 38756 -6253 -31819 -18674 -9035 20183 -12625
19536 -12625 27154 31271 -48223 28478 62307 36750 -1108 -24060 -3369 -10280 16265 -8483
19524 -8483 -36940 -51200 -15781 30815 25283 32924 93344 120982 68956 37296 20016 26145
19512 26145 15427 -18833 20706 204 -3574 25785 30416 12645 -45273 -55396 -47617 31098
19500 31098 41778 22350 -2646 -20569 30863 70836 49718 71687 68227 103095 96402 83657
19488 83657 88529 45126 25163 22919 92910 135886 98020 89145 59031 66747 87606 93529 51056
19475 51056 38298 23569 49917 -20732 -35514 -14503 -47594 -31385 -10737 -36530 -58524 -72791
19463 -72791 -20463 13002 4580 882 -1082 72370 75529 24881 104652 119378 89388 116273
19451 116273 138457 103275 74272 37333 34551 14052 -4270 41004 82921 85225 54280 88384
19439 88384 71281 52612 3608 -25187 -44455 41351 101782 37963 42556 81441 103483 140624
19427 140624 120935 88456 68781 53319 42702 38289 -22992 -22183 31674 61812 81976 36169
19415 36169 5443 26079 84938 96232 65491 91237 80735 61583 6931 -2798 37258 53365
19403 53365 61602 77174 38738 38629 68760 68889 58047 41902 69993 38950 48569 70321 69713
19390 69713 65141 44440 109347 129228 129072 85687 101389 68238 79620 116163 153105 119745
19378 119745 111282 153914 148645 195319 255064 206050 163416 100134 10639 -14858 22051 69887
19366 69887 112950 142266 170334 202792 261742 435385 654446 998115 1509100 1933915 2132494
19355 2132494 2062045 1729064 1167137 752206 588246 535465 487604 485316 507081 635202
19345 635202 862199 1306943 1794840 2172423 2225545 1978116 1540925 1142215 839745 581181
19335 581181 436220 355188 301227 275674 262206 289377 246850 250309 239048 214448 167091
19324 167091 140509 152528 191504 208319 195165 163004 166242 162571 152382 135254 85944 38378
19312 38378 23691 128337 226673 226186 264236 273595 259583 244106 253793 390282 628012 852961
19300 852961 989114 805677 564652 411298 328353 269569 203223 169123 158480 201804 298839
19289 298839 416165 572318 738598 965203 1020030 822493 620156 397711 248248 179958
19279 179958 182995 234820 236471 200072 184273 159381 183668 173143 138253 81362 94919 142636
19267 142636 132474 128924 132786 115150 87333 52534 35120 71421 77957 102875 187477 184490
19255 184490 167292 165677 99108 95727 74035 54399 50953 24078 18855 15551 30990 68498
19243 68498 37683 78629 99728 86497 95533 92197 46108 47477 -6802 -49874 -38359 16033
19231 16033 3968 31091 30306 92057 119141 125252 103728 133760 112789 116220 118835 114661 85708
19218 85708 35005 14621 40008 21294 -10562 -28437 -6494 1689 81552 117639 105289 91458
19206 91458 132097 161598 152129 129659 119916 141990 176924 160124 118264 73367 55415 68742
19194 68742 87835 101833 107125 92542 66878 125643 119150 176661 172380 185610 184087 123674
19182 123674 72554 37335 33775 142323 188254 181581 149557 140625 166282 170776 147804 132499
19170 132499 123804 132992 130255 135102 149154 169731 164378 139806 132906 131280 132898 91088 117265
19157 117265 135959 176613 205095 211331 239087 267914 284312 267788 180161 158920 251867 260916
19145 260916 261981 322156 338220 250953 197814 183775 149482 129161 158363 201919 217885 202782
19133 202782 181872 115622 65929 69731 56963 130157 197852 139711 109892 64828 43713 127115
19121 127115 179513 218054 266269 235731 157992 174012 171597 204340 263255 246866 234419 183592
19109 183592 123300 151244 153701 150419 109294 119825 126245 161813 175708 142555 163795 200121
19097 200121 262237 297495 319073 316230 313363 385005 409147 372417 371766 396937 405728 441651
19085 441651 479191 538031 545878 518615 510922 497781 434647 428327 412457 378505 323616 279387
19073 279387 240360 194548 161263 151815 179579 206792 225873 193870 206258 258014 237712 292378
19061 292378 297810 244520 237398 311377 266083 241740 237108 265238 247407 224549 204640 284135
19049 284135 390124 369292 343170 335079 271048 269762 344005 354689 370800 362284 380640 379731
19037 379731 442871 543539 605037 547945 469583 496980 526060 546825 533670 521767 516341
19026 516341 532589 516511 570580 614424 700754 749872 755976 689978 658569 622035 556965 499945
19014 499945 447645 425651 408124 384549 352519 335338 294107 334081 339555 305175 215065 255541
19002 255541 304394 276186 242751 353808 450880 428686 414683 326596 310904 386874 395177
18991 395177 389518 387523 366056 376879 302649 251657 323515 327236 370032 416967 407778 410147
18979 410147 378636 305625 301880 266017 278273 291711 337625 424334 429438 423800 432379 509409
18967 509409 629939 654712 611477 523404 429469 405407 349514 374519 330537 359675 452975
18956 452975 586628 657089 660997 678015 632801 598860 661498 659899 591122 590036 575670 556319
18944 556319 594517 604612 592569 594633 552148 546444 580335 565079 515143 531217 608000 583765
18932 583765 561090 504703 497461 486843 512906 526714 565450 571413 542748 520018 536629 586683
18920 586683 631846 620324 622207 565467 508934 550298 627919 703099 751638 755869 763582 779365
18908 779365 725971 721944 789959 822190 851757 845955 933048 949444 861258 854336 848909 890485
18896 890485 923732 959995 1016216 1041880 1119452 1166854 1155011 1160574 1239397 1324028 1423614 1449352
18884 1449352 1474689 1509531 1612524 1808876 1873286 1897887 1857366 1840782 1848402 1847569 1939655
18873 1939655 2120393 2286881 2508182 2729081 2920664 3086698 3307386 3570319 4043525
18864 4043525 4699907 5470034 6188755 6647788 6824073 7082098 7706915 8752997 10228429
18855 10228429 11350455 11407901 11228296 11311979 12072977 13947252 17357197 22535048 30507641
18846 30507641 42704534 54748338 60066770 65883008 84974782 124254070 157420562
18839 157420562 145199493 110117692 84932402 75833910 80144797 97848006 136350768
18832 136350768 215117722 346770837 462845049 511928417 531198774 500394292 444050172
18825 444050172 376985971 278656866 184077141 122496739 88111826 69377777 57908192
18818 57908192 48859826 41835077 37840320 37679609 42200107 46804994 43418544 35292074
18810 35292074 28575677 24607392 21942357 19437308 17439708 16160193 15050145 13815194
18802 13815194 12694740 11700471 11030458 11078656 11415213 11527001 11463026 11080060 10408369
18793 10408369 9858020 9293460 8610457 8191490 8135838 8539055 9303092 10583876 12559121
18784 12559121 15572530 19772364 25787909 34890187 50873085 82117880 139846374 206441297
18776 206441297 210979887 154582825 97536869 63712941 45549249 35104855 28856651
18769 28856651 25588672 24894698 26881029 32091329 43250230 66138064 106451090 142993250
18761 142993250 132310097 91029391 56640510 37490333 27196074 20769780 16349627
18754 16349627 13503688 11594607 9962542 8517505 7405038 6610680 6157786 6000155
18746 6000155 5937911 5575382 4918857 4384443 4161220 3916275 3572729 3227086 2841474 2498669
18736 2498669 2204514 1971015 1781482 1683814 1792109 2008204 1992393 1727816 1404858 1135464
18726 1135464 962241 864668 755691 667088 642914 616131 581513 572022 585234 620502 637073
18715 637073 558538 515017 512103 490335 399020 344747 380212 442749 538348 654595 682507
18704 682507 664329 811982 1121909 1316472 1194496 919549 744450 699484 729457 758998
18694 758998 662778 610378 645189 697159 797219 912382 1035870 960489 755531 596350
18684 596350 494719 449999 390727 325731 317327 415050 456668 445430 434885 407997 390525
18673 390525 328041 318961 273319 237904 176142 168842 210666 220080 236957 232790 120340 61176
18661 61176 82533 79617 75044 64597 24740 -5756 90366 140901 100273 53199 41067 78920
18649 78920 137325 193070 235172 216279 248586 205714 197868 160081 175950 144172 91393 82944
18637 82944 43020 -18823 -80068 -21671 67817 133983 114794 48186 13413 2906 33569 54359
18625 54359 44222 82865 78645 137522 118792 69579 11884 22208 -42394 -2448 19571 27246
18613 27246 46032 106234 66525 42749 156057 229512 251742 404904 543402 615280 581100
18602 581100 522697 497596 367726 313398 320311 272044 217603 233747 229674 322220 467851
18591 467851 599034 653174 620574 495798 330059 145765 5597 18918 71902 64676 28566
18580 28566 33527 23574 40079 37205 19715 24748 53945 74342 51011 15861 -8129 -48077
18568 -48077 -88907 -146030 -128666 -52264 -7804 28045 41827 19665 -2814 -4480 34660 43563
18556 43563 26654 25488 35850 29039 19508 61779 61677 37100 9600 32476 55336 64519 81785
18543 81785 58975 90827 98731 63686 46122 48225 59302 51177 59920 9260 -7847 13987
18531 13987 42102 55637 121807 102181 74185 -10760 -25308 40543 27916 -28337 -72393 -90034
18519 -90034 -97632 -105742 -105432 -77420 -43325 -27933 -6358 -27408 1776 7187 -31455 -24640 436
18506 436 -7471 -24750 -94273 -55160 -9866 -47710 -56140 -5481 -55636 -122091 -87262 -6019
18494 -6019 48541 87901 59372 5706 1365 -74728 -87417 -83079 -81383 -56936 -20891 -14078 -635
18481 -635 36 -6949 38780 27126 67103 74910 -1284 17571 35069 5237 -52547 -87611 -20864
18468 -20864 28242 -24832 -71371 -65462 -18693 39075 19258 6773 -10260 -14192 -73242 -136411
18456 -136411 -69419 -34591 3028 -6966 15504 43710 20324 -18552 2070 -61863 -84527 -55137
18444 -55137 -13588 24562 12694 55637 71199 78665 81118 105273 84976 80440 124327 147216
18432 147216 125821 125337 81119 77219 60627 22953 11191 29251 -33710 -59473 -24657 -18928
18420 -18928 2049 -19798 -50739 -25096 6577 -49630 -68644 -22073 42918 66898 12781 -22007
18408 -22007 -22885 -385 -6454 14123 13706 28108 -6006 10117 7138 -3538 6891 56220 97159
18395 97159 60658 -20945 -86829 -110240 -56072 -11074 27072 36859 4579 21827 45527 68641
18383 68641 53712 -3070 -18654 6049 6875 48758 57752 76208 87683 58564 53832 58405 46720
18370 46720 33195 46465 12980 67406 139001 106495 59376 28094 -6434 29194 107184 131384
18358 131384 142322 128820 63257 37103 105426 87939 83529 86806 82666 24600 15204 88351
18346 88351 120867 66182 17008 24971 50265 32281 519 31152 36095 15828 43680 53482
18334 53482 84922 130761 101704 94067 81626 64507 75861 78211 115667 211652 280663 295210
18322 295210 354233 546085 940919 1397660 1696646 1653977 1357815 997772 716765 559210
18312 559210 520225 510383 469900 508617 642152 793839 1048124 1555046 2100071 2284702
18302 2284702 1974776 1444695 1037821 819062 642561 491955 426451 412523 354876 333583
18292 333583 392183 472481 622395 800743 810387 611102 436466 365173 316513 253966 188846
18281 188846 170832 169421 151557 100542 56932 17314 47453 75375 79630 103412 143151 185090
18269 185090 155569 143159 160225 171066 130049 146602 88634 100822 171911 186508 193573 196210
18257 196210 172759 147800 167985 189411 259134 459284 683305 938514 1105038 936251
18247 936251 663836 468478 330225 317268 272352 267827 302736 268916 260296 414062 610577
18236 610577 890623 1138551 1138679 1024537 809410 733795 768154 861192 1044312 1264385 1211082
18225 1211082 931424 731636 721478 904712 1110040 1086215 857095 607590 467523 433046
18215 433046 394675 342764 310644 281065 248184 161657 133543 110589 108880 134937 90201 57445
18203 57445 61691 151178 199110 167363 111938 103420 102901 40838 63954 34474 -23098 5758
18191 5758 75156 157626 189353 198557 155627 140293 183612 210475 252138 247981 198272 231531
18179 231531 390152 617626 733596 688234 588790 541092 573798 756500 931411 908481
18169 908481 691752 477657 428584 399553 317755 306000 330189 354728 390188 391561 357878
18158 357878 293089 302242 364430 352853 312337 305387 332234 348453 310695 328138 296084 289178
18146 289178 292126 301545 318541 360877 362203 334243 263543 296782 366644 366097 362356 379866 419911
18133 419911 469583 473089 462689 468707 541587 573780 593134 636594 784952 986399 1107589
18122 1107589 1152820 1130824 1165605 1329641 1568533 1927560 2317844 2765454 3391943 4143363
18112 4143363 5232488 6944065 9676986 14423741 23429916 42057657 78943419 118018552
18104 118018552 110882599 72457461 41289557 24917215 16550835 11916122 8989615
18097 8989615 7010318 5557872 4603766 3879279 3326678 2846413 2519176 2263256 1951947
18088 1951947 1715221 1514993 1380004 1299251 1252032 1206684 1212427 1191826 1128907 1031252 965678
18077 965678 805096 594062 479046 433966 417069 426327 425185 441516 393377 328604 236755
18066 236755 197108 215804 142094 82370 15984 14024 97302 194583 251702 244375 188972 128237
18054 128237 127075 197199 241356 212664 229942 220688 221053 247398 208043 173047 127464 115862
18042 115862 99306 102625 147814 141563 83441 78828 71967 43899 70873 15471 -6836 -2639
18030 -2639 63010 59843 86737 121425 160193 169356 186442 221852 199111 148709 137030 115195
18018 115195 92634 77834 62018 51614 90926 118463 96477 110245 117098 78438 60201 77067
18006 77067 66077 119458 106872 38768 -1636 9844 6771 57988 36061 48747 62137 65464
17994 65464 89187 64058 47863 68286 86731 66396 132526 204794 193621 113579 74211 92239
17982 92239 96854 99509 88805 94071 48584 78604 100490 111567 135834 183446 204771 214776
17970 214776 176511 122228 138287 159230 208635 206053 206868 201033 186777 150903 170421 178133
17958 178133 160522 144454 143165 170107 178215 186228 171023 154671 139259 135655 136697 207120
17946 207120 257666 223969 156796 152100 164997 176028 202992 179693 126326 118970 109397 118927
17934 118927 142949 111646 75788 93084 144780 190676 226194 237987 208071 174767 135988
17923 135988 130467 144671 148995 124636 167758 210431 159810 79891 50485 63872 142773 145630
17911 145630 181815 269574 306277 275001 226323 224847 156813 131194 153170 169326 184876 148639
17899 148639 122058 126822 130229 133787 165495 146666 109571 44405 46249 35373 50989 64920
17887 64920 50456 79457 106303 129469 148921 181071 178649 273824 220771 143487 158027 200974
17875 200974 181623 151907 157695 134119 92445 106441 95040 118004 145208 116002 89256 104978
17863 104978 128962 74660 -11548 19094 135232 189891 182622 141633 117692 130479 165638
17852 165638 226015 288584 287141 288488 245772 177512 91622 82644 137472 151044 134128 99350
17840 99350 141758 154411 165638 163532 156961 134650 184833 209212 251053 221946 209346 196838
17828 196838 186680 167601 172465 158676 203373 264440 302230 282426 211879 170881 167558 175406
17816 175406 181119 161001 199824 200661 173707 118251 127050 164000 237470 299627 348227 301964
17804 301964 272326 301601 283372 224680 269310 376464 462662 529798 562554 587216 617267
17793 617267 652330 631641 597768 559184 564814 660756 824413 891765 838932 791942 782332 857148
17781 857148 861987 782246 652617 605782 623833 650892 595367 532766 504068 544988 601840
17770 601840 647105 637577 645315 617968 717974 762436 794030 847203 850733 866507 853289 813781
17758 813781 838686 951281 1030202 1133203 1332348 1552774 1816550 2300620 2714675 2979992
17748 2979992 3325987 3636383 3554124 3327954 3296752 3247102 3034033 2884039 2903260 3107380
17738 3107380 3412327 3607653 3743221 4187843 4773121 5081792 5243908 5591047 6400752
17729 6400752 8016746 11208397 17170157 26124157 31661694 28707266 22701811 18740057
17721 18740057 17515136 18618793 21687363 26966992 36013000 52640907 84987271 141510512
17713 141510512 193131028 186569612 148624842 132444338 154526808 182368785 161696104
17706 161696104 110503173 69312017 46100265 33535951 26280764 21391341 17576842
17699 17576842 14691485 12711188 11453237 10699337 10357420 10397321 10870192 11228863 10839050
17690 10839050 10044818 9555841 9188727 8476254 7494566 6637966 6194493 6076961 6048829
17681 6048829 5937337 5943221 6288929 6718671 6725406 6514392 6562902 6930131 7690163 8819290
17671 8819290 10100354 11544148 13354256 16285304 21017430 28265456 40879095 65098098
17663 65098098 107477243 149875682 152874790 130905960 124900165 152368880 185660265
17656 185660265 168856852 117355104 74319732 49671220 36112682 28119699 23048501
17649 23048501 20154705 19206870 20292010 24220698 29607511 29775456 23788961 17328244
17641 17328244 13308828 11035190 9328836 7929081 6967279 6218212 5475060 4861110 4392708
17632 4392708 4099561 3973966 3674049 3247624 2964797 2905282 2754064 2390472 2011722 1724062
17622 1724062 1562696 1456336 1294531 1171874 1100450 1002972 916671 895907 792929 725374
17612 725374 721429 734413 756337 730330 677829 603391 467957 421533 432097 438820 465335 559545
17600 559545 615940 595254 634819 719286 805986 880259 861706 735449 610071 522761 466384
17589 466384 397301 331073 301232 259466 282942 245939 190999 226552 293241 284711 251969 291962
17577 291962 284807 224280 202721 206047 198157 157553 123725 152928 151790 153707 153416 208337 231026
17564 231026 221267 232080 225957 240327 190020 169448 205618 183921 116059 128666 126217 42274
17552 42274 -49566 -35296 18660 30333 26629 19731 -34992 -122379 -75172 1191 9110 25390
17540 25390 41815 62635 6176 -6468 3505 -4935 17763 16224 15722 -34173 7177 111154
17528 111154 153103 135247 61674 67801 74132 50936 30457 8280 14179 6601 -2585 223 -33322
17515 -33322 -46749 -16609 -9360 17397 -685 37688 86522 84467 65117 41583 30950 -17887
17503 -17887 -70938 -62225 -78612 -90121 -40595 -23204 -7937 41794 67270 -10705 -45195 -27546
17491 -27546 -41056 -9092 42199 -9130 -34425 -38880 51074 22322 -11482 72980 90178 101286
17479 101286 105562 57094 35402 42267 -6367 -49412 -21412 -27281 -83076 -85195 -65595 -65264 -62623
17466 -62623 -49838 -43088 -66879 -60470 -66282 -14601 30512 3622 10141 2195 -72269 -82385 -85884
17453 -85884 -64165 -11957 -21907 -52247 -21937 -11151 -49220 -67407 -110720 -97375 42957 61421
17441 61421 115061 280214 557761 601486 436452 245062 98450 35761 411 -10969 33731
17430 33731 59210 87527 129753 127744 115582 114429 111870 97306 4126 -66210 -45292 -45273 -45720
17417 -45720 -15864 -16618 11858 25514 23375 52144 34262 -8722 -40945 -60685 -60588 -34168 -29734
17404 -29734 -11790 -57571 -97942 -99387 -87201 -42673 -1276 -30548 -35342 6457 8922 -51466
17392 -51466 -63369 -4104 22907 71750 23349 -50845 -46843 -42660 4250 217 28474 40589
17380 40589 22684 73453 79085 -4177 -75593 -41604 -28574 -54109 -58901 14674 67737 3391
17368 3391 -13574 28293 63469 75223 43336 10689 -46312 -62050 -48712 -54479 -15045 -32808
17356 -32808 -39499 -21631 -38196 -27081 -16081 -13412 -44623 -93918 -60092 -4325 5945 -56247
17344 -56247 -68336 -70169 -103502 -120061 -178402 -165159 -77535 -64602 -135896 -109816 -24303 19395
17332 19395 16022 -32896 -39988 -69881 -100919 -104236 -76803 -52711 -40726 -20385 15500 9928
17320 9928 -31645 -81778 -64160 -48984 -20471 -49212 -31390 -27532 -30740 -43688 -84704 -57682
17308 -57682 -66785 -36551 -36167 -44674 -67319 -70962 -57949 -58862 -71778 -82324 -71812 -52291 -15471
17295 -15471 18023 80595 59040 -43360 -76395 -90603 -92570 -112137 -99196 -55283 -108736 -148006
17283 -148006 -99613 -105689 -63233 -90 -19077 -85492 -23653 5820 -61472 -74858 -45090 -60681
17271 -60681 -69175 -90661 -130957 -75279 -19713 -61248 -23532 71390 69370 -10607 -61338 -70310
17259 -70310 -43369 -26951 -960 -24687 -22691 -50654 -54964 -68974 -93765 -109538 -155708 -127255
17247 -127255 -29820 -35656 -17681 -74953 -103868 -53711 -62792 -69182 -70851 -120865 -131435 -138371
17235 -138371 -117884 -105097 -70690 -104074 -108172 -97198 -52426 -39005 -58173 -94648 -103651 -91849
17223 -91849 -74118 -32093 -33652 -35124 -69912 -12248 14793 66691 86822 75830 34246 -26218
17211 -26218 7556 -46906 -17470 -5287 -54923 -116551 -98347 -5837 15230 62903 111036 161473
17199 161473 182872 261809 301458 303514 444152 738722 1022300 1068126 991359 1030039 1061820
17188 1061820 835199 556218 365647 169134 86410 75482 91474 62870 66773 84296 39421
17177 39421 45557 13428 -7632 -72371 -83629 -70433 -52588 29294 6293 -77154 -57446 -38449
17165 -38449 -65742 -57906 -62901 9675 43639 51805 49649 14069 7114 16773 -12042 -20559 -46200
17152 -46200 -48053 -63649 -24787 -17843 41877 60595 120948 182282 209195 300643 538644 838024
17140 838024 960225 901171 943556 1056450 944390 664962 460805 308530 176246 129394
17130 129394 26394 21620 53935 34005 53166 -14059 -19844 -31258 -69244 2146 67757 90163
17118 90163 77916 16510 -45345 -69785 -82692 -79070 -47986 -34420 24512 24867 23155 -14025
17106 -14025 -72648 -91617 -82110 16462 93974 92661 42954 35606 31777 1225 -83250 -103940
17094 -103940 -87604 -32119 -32567 -5127 -25436 -68264 -99648 -66389 -50276 -45239 -48640 -23180
17082 -23180 5377 6794 3610 30484 39015 2417 -20620 -42232 -71040 -61468 -96882 -43880
17070 -43880 -6493 -12304 -47450 -48298 -48163 -25242 -38534 -48472 -44131 -108791 -102235 -110840 -166651
17057 -166651 -178885 -138643 -70632 -30931 -48641 -64756 -61205 -22079 -5846 8324 -2694 -15409
17045 -15409 -42708 -39411 -46237 -42752 -60770 -68182 -131328 -82964 -84610 -103003 -87547 -90542 -111791
17032 -111791 -135592 -107826 -77804 -73827 -77510 -45179 -90447 -82921 -73635 -89604 -81762 -88402 -87384
17019 -87384 -80824 -112927 -135538 -82215 -64644 -60968 -46490 -73176 -63095 -34248 -18736 -22551
17007 -22551 -27904 -28955 -9040 -2368 -47782 -59344 -52666 -35688 -74387 -116190 -150822 -136978
16995 -136978 -120371 -98075 -114461 -113271 -106820 -81546 -58840 -76414 -78438 -72438 -65651 -84625
16983 -84625 -135398 -135722 -148634 -104874 -98526 -87195 -90607 -109151 -136040 -148478 -120195 -122958 -134704
16970 -134704 -96586 -76846 -34005 -23623 -16972 2276 -21718 -19141 -23830 -20636 -38327 -39749
16958 -39749 -27882 -27477 8646 -17640 -56606 -132425 -146660 -117722 -93512 -133656 -109229 -72794
16946 -72794 -55591 -15821 30867 -11108 -18832 -19065 -28882 -59475 -50628 -67113 -81780 -138174 -164285
16933 -164285 -159650 -172901 -113758 -94167 -74465 -72612 -156966 -154429 -129699 -111972 -61663 -37352
16921 -37352 -17830 -16810 -40076 -40810 12599 5999 13748 231 -35832 -49633 -10264 11300 -38697
16908 -38697 -14656 -28816 -73611 -76114 -31440 -31932 -50683 -46414 -19498 -2628 -4273 -71340 -70155
16895 -70155 -28181 -7497 -79810 -108311 -82962 -104994 -52991 16696 1214 10354 4603 47570
16883 47570 5918 -38066 -73308 -82478 -127062 -27192 -7752 -19127 2731 -2788 -57375 -77479
16871 -77479 749 42519 29378 27935 15521 3781 -2986 -68143 -84227 -118828 -123543 -88316
16859 -88316 -90824 -143115 -156191 -122117 -75382 -46478 -38617 -49101 -74844 -95905 -123675 -81230
16847 -81230 34433 40800 -4442 13178 55564 81478 66658 5649 1662 58711 61877 -1967
16835 -1967 -65174 -61794 -47275 -25721 47523 45394 -42151 -97953 -98089 -30068 -22454 -1038 -29031
16822 -29031 -31438 20232 81898 67691 55494 -14018 -42793 -31841 -11192 15233 19003 -43897
16810 -43897 -42656 14069 72407 7657 -20659 -49994 -103750 -163900 -112203 -59908 -35116 -17549
16798 -17549 2635 23614 17975 -6560 -12097 -3686 50150 87000 10529 18233 41708 42306 2237
16785 2237 -19621 13768 4394 67231 87463 9683 14962 17158 -5562 34409 36442 -5439 -15020
16772 -15020 -12790 46145 20573 5381 -22453 -46814 -145 -54221 -101638 -63761 -40031 -69581
16760 -69581 -103434 -83664 -36076 -50464 -58825 -25763 18792 17596 -7221 -26195 -57247 -64766
16748 -64766 -107168 -105028 -85974 -55725 -62518 -86535 -111032 -102709 -119588 -125960 -128275 -109445 -114130
16735 -114130 -50736 -23759 -32206 -52220 -84331 -44839 -42337 -26134 41707 55539 83054 53253
16723 53253 16735 -21319 -23650 26525 7848 -5118 -12583 27416 68528 39002 -24135 -82964
16711 -82964 -30493 -42239 -59602 -41446 -31390 -82290 -114007 -131638 -90280 -59954 -65491 -106158
16699 -106158 -94807 -61636 -19786 5080 -31548 -65099 -72052 -38116 -20368 -37 13620 15825
16687 15825 3296 28255 35264 6232 -14599 -3807 31479 58085 30955 32157 -26587 -25124
16675 -25124 -251 -21662 -47511 -44413 -42479 -67028 -47208 -21667 -24349 16831 30758 51682
16663 51682 85982 88996 49878 37262 6100 -9053 -8901 11178 37454 55447 71238 90488
16651 90488 37802 -37701 -71106 -45512 -14994 -31262 -64540 -87120 -79510 -61748 -31561 -49692
16639 -49692 -98067 -75729 -99067 -32171 -11532 -33646 -8822 -10872 -19478 -17979 -19031 -42257
16627 -42257 -32361 -75770 -63984 -37733 -13457 -28939 -24178 -48747 -113645 -114125 -48361 -91778
16615 -91778 -130479 -130586 -87373 -50592 -62145 -23851 58075 52202 27929 22028 21166 25951 47590
16602 47590 17151 -15981 -20313 -45503 -12215 -15467 -58454 -96831 -70600 -38022 -82711 -122554
16590 -122554 -121501 -67428 18059 35745 20187 13150 -40580 -80413 -111407 -89006 -77934 -103484
16578 -103484 -80947 -67853 -44595 -84136 -54347 -33111 10346 -17450 -58380 -98200 -116310
16567 -116310 -92878 -42014 -31766 -37432 -43321 -4965 -58440 -60671 -54962 -99947 -64983 -17709
16555 -17709 -29985 -39282 -38533 -16521 -21546 -19705 27676 62697 52205 21872 23014 -1511 -22652
16542 -22652 -43565 -22546 -24792 -41771 -3020 53146 57215 36710 -38553 -80498 -23597 -9123
16530 -9123 17275 23585 -11311 -3565 -31829 -41658 -59261 -26467 8603 -34525 -21327 14752
16518 14752 37522 -10394 -67142 -44672 -68029 -47039 -65391 -84833 -33516 -4572 -39395 -55492
16506 -55492 -46005 -77098 -93393 -75296 -63347 -14454 27341 -15315 -24336 -71150 -142395 -109336
16494 -109336 -54937 -81970 -168158 -109869 -63757 -9348 62154 79866 54233 25711 -11309
16483 -11309 -13754 -43824 -104290 -93081 -86884 -116207 -112851 -57718 18273 -34739 -22636 -1378
16471 -1378 -3304 -27072 24646 80961 140560 160779 108526 68281 45955 16354 29044 51497
16459 51497 21599 -33246 -57675 -49361 -9469 -31674 -71024 -45760 -57848 -23548 -12040 -20114
16447 -20114 17119 40425 34024 71615 56832 5333 1537 -6621 3988 19224 -34299 -32106
16435 -32106 379 23638 7532 1284 -28551 -82488 -110722 -75563 -81330 -97594 -110893 -92759
16423 -92759 -101994 -80216 -113475 -109420 -72640 -96194 -69253 -30459 -19813 -26442 -63524 -68867
16411 -68867 -29710 21847 -49092 -31723 -16829 -36094 -25700 6542 36484 54114 25972 -1106
16399 -1106 44785 68511 35520 -2676 23278 13449 7485 -15627 -34621 -30699 -22941 -47669 -89417
16386 -89417 -115863 -120461 -64523 4894 5943 26084 -1001 -26483 5146 57323 62465 34063
16374 34063 9305 -2902 11369 -7295 -46385 -22917 -18506 -3600 -49218 -81913 -56570 -14658
16362 -14658 5933 6146 9721 10412 22454 34112 8307 -49751 -43584 -49665 -61612 -48757 -43308
16349 -43308 -24095 -13201 -32929 -36077 -78286 -113805 -116827 -105272 -101487 -62980 -22179 26523
16337 26523 -11187 -52774 -32314 -49816 -68139 -12370 -6518 22352 48659 44323 55965 35476
16325 35476 26683 -31144 -88642 -26966 50615 57548 75222 62926 -12621 -47969 -50727 -107411
16313 -107411 -138478 -135299 -151814 -137565 -110124 -50971 -23039 -63227 -45304 -36667 -71696 -34401
16301 -34401 -79642 -75442 -94626 -83160 -68719 -22277 32814 31232 30656 65529 17474 -35679
16289 -35679 -14327 3504 -21117 -20033 -20713 -23822 -9805 -100013 -115161 -19379 4304 21832
16277 21832 31078 -2193 -26614 -255 39162 51355 27786 -3312 -52658 -78922 -60005 -63845
16265 -63845 -76236 -37050 33761 61986 31840 -19412 1585 26368 15332 22501 31921 -7623
16253 -7623 -5235 -26213 29265 4851 -2754 34137 49015 12310 -16638 8429 -40930 -88770
16241 -88770 -59200 -45655 -44393 -31046 -1077 -26427 -19989 -22924 1071 -29743 -68269 -47235
16229 -47235 -8167 17262 20362 7316 -55137 -90870 -74494 35722 61492 -18745 -1434 58650
16217 58650 77294 104106 105855 35112 9436 26967 26792 5482 22257 42357 -25501 -47349
16205 -47349 62377 120333 67225 48447 50463 27128 51036 18832 -2639 -592 30154 -17367
16193 -17367 -43388 -50117 -34011 -51323 -63065 -44142 -40985 -43978 -64267 -44142 -30185 -20518
16181 -20518 11680 54806 -10665 -108765 -151005 -93045 -42989 -37366 -55118 -63264 -83628 -55231
16169 -55231 -40224 -58970 -65515 -100614 -65482 -28740 -22858 -39774 -53927 -66887 -26411 2364
16157 2364 11944 3062 -30953 -58138 -58506 -50528 -24590 -56150 -107903 -98508 -80368 -55575 -8110
16144 -8110 66082 63133 -7452 -65288 -78840 -92844 -65988 -22004 -42458 -63408 -98617 -95469
16132 -95469 -95437 -88330 -92986 -26336 -24051 -30629 -39130 -938 48351 82700 88183 70382 18134
16119 18134 -23271 -15263 -14593 -58695 -53378 -47799 -42199 -10775 16329 10604 -7810 -18772 -2400
16106 -2400 6721 52270 38420 7288 8704 -38155 -47582 -21709 7855 31020 31173 47389 50674
16093 50674 -16641 -8044 40428 26311 -20718 -7092 16741 29543 60097 31000 36057 61219
16081 61219 -36027 -56568 -46329 -11760 -21700 -63987 -53506 -42656 -61533 -32199 23632 32964
16069 32964 31124 7252 32996 29899 41174 -15812 -35632 -59762 -19077 -46290 -27594 -2489
16057 -2489 -16817 -29482 -40101 -10233 40498 17588 63187 48789 3618 23028 44410 68791
16045 68791 11962 -43109 -58208 -75278 -72186 -35992 -56480 -3466 38511 12759 -51594 -51241
16033 -51241 -33740 27307 75615 36163 18755 -328 34830 75705 69017 36044 32350 66265
16021 66265 92951 62577 38697 68348 59659 833 20935 -2516 -28447 -9303 -26622 -4875
16009 -4875 14905 16786 75421 69438 69701 103464 115760 119691 96501 62830 22420 -7876 -57661
15996 -57661 -19873 15698 24515 -10664 -39151 -37182 -57471 -49704 -46527 -19455 -11074 -17373 -15903
15983 -15903 -26876 -10244 35376 22309 15795 -4739 -8612 48957 31655 -2099 -47799 -52644
15971 -52644 -21134 -29793 -34464 -15852 -24442 -18930 -11043 -37754 34219 -45250 -130545 -133971 -82797
15958 -82797 -91402 -79596 -12457 -13073 -58040 -115587 -181388 -172196 -98508 -4485 32233 48490
15946 48490 37853 68736 38975 -20713 -58734 -20964 43518 67716 88408 58253 39565 62305
15934 62305 53149 46771 22940 -66097 -141187 -119333 -177120 -200577 -84656 -50474 -57597 -71151
15922 -71151 -59790 -10711 19660 42685 51063 67888 44139 31311 62392 21641 -1845 21992
15910 21992 -46548 -116396 -113272 -102732 -144792 -140747 -64816 -53009 -58103 -92855 -53812 -26345
15898 -26345 -67909 -80548 -32776 -51679 -37062 -45106 -26466 28818 -15117 -79272 -116302 -122140
15886 -122140 -115570 -120447 -118027 -37852 22113 30525 48379 66541 29103 11411 8394 54981
15874 54981 52149 77701 51743 58620 61594 88771 91513 42675 40901 1809 33519 30246 36773
15861 36773 49621 -15403 -14443 10501 -35503 1947 -38028 -39549 -22276 -8888 168 8970 -33974
15848 -33974 -43529 -21475 20665 23649 86565 115990 112106 89656 40117 -5049 -34236 -50887
15836 -50887 -29357 7419 2657 -4262 -62550 -96754 -107908 -66936 34465 54375 -14047 -14184
15824 -14184 -9983 -8283 2285 13077 19277 42390 79416 106694 38756 4266 51558 79150
15812 79150 80333 40689 -41916 -81274 -55670 -34423 -32772 -71091 -97768 -66501 -76582 -72561
15800 -72561 -64776 -103845 -101473 -50519 19928 52556 -8964 -23336 -30148 -7415 18957 -1960
15788 -1960 -7229 -31585 -21099 -13633 -15990 39678 76233 77098 64780 55255 -34425 -76784 -58726
15775 -58726 -49870 -10897 51250 8181 47823 56552 35956 31457 30784 -18129 39896 22792 19593
15762 19593 -16791 -26797 25673 31067 3663 19780 35138 -12128 -8517 -19114 -87548 -103297
15750 -103297 -56871 -39012 -49629 -71830 -60274 -81121 -80966 -92263 -107266 -107896 -64223 -61102
15738 -61102 -38902 19266 36819 37751 -17296 -26407 -3524 10566 59827 69311 48391 47251 -31596
15725 -31596 -75978 -24103 32791 1139 -17818 -83989 -92891 -47054 -28404 -70126 -111484 -93905
15713 -93905 -39061 -89419 -139387 -133252 -140886 -78441 -41265 -57052 -37346 16870 -545 -15434
15701 -15434 -26793 11106 19570 69013 96910 122809 68867 32861 -22714 -81315 -104260 -48632
15689 -48632 14825 32254 5324 -17260 -6918 6848 -53074 -108543 -71453 -27990 -36683 -64557
15677 -64557 -108389 -96452 -93685 -70222 -5410 -33391 -72743 -31232 -1909 13440 11821 -12726
15665 -12726 -44118 -87167 -66984 -28407 -31529 -61032 -116024 -54614 -8290 -60708 -78501 -66604
15653 -66604 -9823 -27203 -34424 -45104 -34310 -113355 -136711 -104885 -39014 -32739 -45750 -80863
15641 -80863 -63572 -24829 -18442 -109201 -127559 -51493 -8068 -10762 1136 12387 12986 -42805
15629 -42805 -57123 -32164 -16709 -5449 36023 -37994 -75518 -44476 3008 -2934 -619 18520
15617 18520 37055 20342 7011 -11757 -2429 -33089 -21821 8369 42274 6226 -40247 -56104
15605 -56104 -32637 -51755 -97433 -65918 -18522 32 -22096 -25625 -85407 -110857 -89746 -73097
15593 -73097 -33352 -23460 2820 -11424 -25086 -19188 -12394 -12162 -38908 -74144 -69874 -53833 -24339
15580 -24339 -14198 -92098 -71440 -37655 -56217 -73090 -57042 10398 -717 -18003 -21665 -18126
15568 -18126 10732 10657 -31734 -33481 -39576 -56832 -46240 -22869 -17329 19211 -7369 -20530 5323
15555 5323 34391 23031 84 41921 64223 89730 78167 57203 5244 -8808 -33440 -42596
15543 -42596 -78189 -65813 -9639 49773 18580 -26816 -6282 20283 24458 -37280 -53893 -6236
15531 -6236 -15431 -35191 -59071 -61920 196 -32691 -38164 12650 1980 -34225 -6101 38029
15519 38029 52452 49112 53000 38220 35825 51227 59249 51907 68360 54634 43992 79581 69732
15506 69732 -4493 -44851 -62564 -114773 -126502 -126923 -138044 -109810 -79921 -55638 -22709 -15061
15494 -15061 -38811 -21126 -74884 -68156 -19163 37640 29398 53366 106253 94454 33700 6129
15482 6129 9679 -41132 -25712 7826 45256 36362 -84164 -87248 -27015 -12757 -20214 35138
15470 35138 22146 -19568 -90068 -117766 -80776 -30787 -57638 -58389 -25004 -783 -26917 -22699
15458 -22699 -26597 -7068 -28520 -29068 -46504 -13254 5496 -33617 -47988 -47669 -18681 70562 92882
15445 92882 56018 23444 -17994 -40973 -33874 -49578 -39110 9297 15496 -21509 -35192 -575
15433 -575 -27602 -13671 -44540 -50737 -14605 7094 17940 20559 19844 -16506 -893 32984 14999
15420 14999 814 -37115 -31597 -964 25113 -3790 -74190 -64111 -21891 -26569 -55651 3630
15408 3630 -16412 -36971 -21241 -19322 22329 45542 3218 -35680 -57056 -66781 -39488 2197
15396 2197 29802 35193 40443 -30299 -382 39996 85390 47384 29514 58604 52173 50891 3001
15383 3001 -52365 -72426 -43450 -40960 -67979 -71137 -59223 -11955 29708 35001 21759 5453
15371 5453 -34342 -53938 -73104 -62524 -66604 -16084 40289 19767 8658 -6731 -38004 -12965
15359 -12965 -10660 -37715 -35588 -56196 -19352 27923 37265 -12676 -15086 -3389 -48941 -79309
15347 -79309 -39109 -28503 -72784 -80757 -78652 -102432 -55516 -47940 -15992 3880 39712 11004
15335 11004 36782 50058 35632 -51039 -69934 -8330 51860 31399 23030 43261 27532 -12109
15323 -12109 -16957 15511 4199 -1424 -182 12424 -13683 29521 74391 106005 149636 169153
15311 169153 83055 -3372 -26534 -8776 28751 -1350 -12398 -13882 -10467 -57667 -57358 -36706
15299 -36706 -13669 -18372 30789 15193 -65174 -71070 -37000 -23944 34611 72021 92764 91399
15287 91399 42754 -53259 -150215 -203274 -161053 -78540 -51113 -20446 8618 -54757 -60676 -71590
15275 -71590 -87017 -78897 -62882 12103 1703 -30001 -38903 -30552 -17901 -23880 -34426 -84751
15263 -84751 -77911 -80503 -80928 -54658 -48650 -103141 -12667 41187 41910 14752 -22429 -37009 12090
15250 12090 -11473 39785 58832 84992 49485 23659 23569 2752 7380 -26265 -67986 -98504
15238 -98504 -36986 33099 32495 -16213 -49862 2883 32413 49243 75191 54927 45193 1316
15226 1316 41140 -2958 -11384 23188 30662 42915 27398 -22155 -50397 -38177 -25697 -46286
15214 -46286 -45716 -33989 -44969 -62721 -39845 -15970 -67658 -109692 -85042 -61176 -61601 -85609
15202 -85609 -35570 57670 95910 40454 -2943 -8330 -11257 -40076 -30392 34382 84537 112348
15190 112348 50446 39140 42938 54817 21404 12810 710 -10219 -8734 14387 27035 -1471
15178 -1471 26761 58730 46958 96173 95472 -25348 -78690 53862 81554 63112 14440 -48098
15166 -48098 -68209 -48286 9427 22179 43091 16131 -26179 -25036 -14264 -23237 1985 58649
15154 58649 100502 64483 4029 -3283 -32987 -50706 -43203 -30229 38877 82257 121760 101805
15142 101805 71508 10144 -55917 -38729 74255 77226 26818 -38677 -79916 -68008 9290
15131 9290 56574 46674 8568 -24854 -8537 14093 -3705 -25951 -59824 -59638 -35722 -42641 -65811
15118 -65811 -9301 25697 42836 6258 -19857 -13742 -52709 -28516 15968 23093 29332 12964
15106 12964 -45169 -21070 -2892 23550 45671 73132 84984 41131 -17557 -485 -5472 17342
15094 17342 -8145 9871 23000 50798 19049 -43443 -68491 -73221 -72790 48011 123946 119541
15082 119541 139261 158021 150363 125987 80071 35294 10636 -14287 18864 -6689 -65689 -55330
15070 -55330 -25525 -16925 -39530 -34546 -19432 26123 18127 21423 60015 47732 37311 53914
15058 53914 35094 -41679 -43346 -8547 -16917 -45192 -46030 23448 36699 30188 63451 63952 21331
15045 21331 36492 46505 16005 691 -13128 -12450 -17761 -19035 24593 72255 98823 42733
15033 42733 35445 64296 -6648 -59086 -76152 -36572 37760 21992 27930 61691 36178 52961
15021 52961 47314 -30811 -42958 14798 60256 76486 67471 73129 113058 95239 73140 59254
15009 59254 33249 36243 19328 51489 32022 69113 58202 -16549 -23945 7078 -39166 -82536
14997 -82536 -55120 -41209 -76573 -83974 -77719 -11573 18576 25903 -1985 -13596 -3130 6169
14985 6169 25789 38785 1073 -53190 -44937 -64717 -74634 -24640 24351 104094 117472 91731
14973 91731 68710 -5975 4505 26509 48402 101224 65301 7921 22451 46502 54554 -29106
14961 -29106 258 26914 39198 50956 -9744 9912 39924 64112 46474 7666 40162 47042
14949 47042 42134 57861 121266 81949 30055 97590 83351 21697 74757 69387 -117 -24318
14937 -24318 -25188 -88388 -136155 -148688 -128514 -40345 4752 8108 51862 50053 -15188 -28013
14925 -28013 16648 66049 103379 108473 93244 47063 739 -71225 -93079 -103988 -44019 31794
14913 31794 52259 43090 1596 -58719 -13112 -27593 -80023 -81246 -44659 -27619 4011 15544
14901 15544 26327 31293 51262 70124 63885 90630 108621 117094 136613 114956 96590 91992
14889 91992 85688 22490 -271 -3154 6577 19114 67626 77968 88364 96287 125164 101320
14877 101320 82433 72227 65621 97444 59360 40161 -26994 -109461 -85994 -44850 -4809 51573
14865 51573 85006 66575 18978 -16137 -22418 19847 75622 21432 -21213 -7214 15694 65027
14853 65027 75783 18744 58759 33746 28964 15598 -10410 34641 66386 77219 112568 109690
14841 109690 117359 96309 85788 120618 172606 120523 84006 26400 -13987 -14831 11719 49971
14829 49971 63124 154840 170165 153736 84437 47620 74597 86613 116766 133991 111191 95974
14817 95974 55687 46458 4475 24052 35865 70854 113257 103266 35888 31608 53915 81998
14805 81998 113993 141243 130846 58372 68345 33770 -23473 -1375 51999 12054 18845 38828
14793 38828 73392 48631 49296 68078 4926 35777 27256 738 21050 78877 119762 82583
14781 82583 49975 5752 4776 28062 -16429 18975 49177 31504 8071 7466 8863 61149 55515
14768 55515 46414 5532 -6271 21287 3006 -321 -6302 13967 -10997 27799 33225 20212
14756 20212 15051 -23145 -63812 -35813 -16737 10694 55896 72730 56813 41266 64026 124244
14744 124244 115576 71839 76262 86715 102242 77728 9994 -8581 -3026 23019 19333 -1834
14732 -1834 19428 30008 22513 6336 11637 1038 -7840 47672 111645 91957 58854 76049
14720 76049 112196 86149 102696 100233 55390 41489 -34265 7149 102902 102819 91695 76629
14708 76629 71448 39481 47263 50207 36102 -332 -55381 -78027 -80566 -73131 -17532 -66861 -58754
14695 -58754 989 -5994 9260 64171 117691 92449 16676 -2094 14973 10474 31639 64881
14683 64881 12029 -45071 -24868 -10352 76550 130268 98372 99626 111228 67057 65181 37460
14671 37460 -7358 36279 35173 58804 95884 73190 19041 -63947 -81567 -75545 19731 105611
14659 105611 127489 50099 26064 27211 11283 81344 95813 72553 4251 -35934 -59330 -102457
14647 -102457 -86728 -8038 17851 7698 24463 77963 83421 92158 34050 -15327 -48459 -45669
14635 -45669 -4831 81297 138598 133523 81988 22027 -45172 -88325 -37070 -7949 -23447 -18542
14623 -18542 -25087 1122 -45558 -41600 -7709 -25903 16363 97143 65434 84460 120101 138671
14611 138671 78276 -23166 -22284 -7532 17198 37674 30823 -30599 -41590 -3387 -194 46262
14599 46262 48195 36759 28398 27491 79531 175456 174830 141083 92471 62594 37726 47287 47422
14586 47422 16848 -15818 60618 142774 85572 -26078 -116217 -76623 -31956 -17144 10607
14575 10607 -7408 -93802 -75140 -65022 -34565 3468 66363 73755 40277 9233 12811 27585
14563 27585 8350 -6156 -2499 6547 31607 37107 38256 34850 1633 6829 6013 26948 28461
14550 28461 -29950 -42423 -19371 8799 88843 99006 56762 39540 67682 107084 136138 44788
14538 44788 -47675 -66070 5580 -13911 -35367 15239 35221 5459 6722 84490 121234 79883
14526 79883 62263 47589 39391 29018 43406 -15333 860 12591 33387 66893 12975 -21702
14514 -21702 -22124 12886 21879 76802 75611 104602 113665 80818 86918 92358 150607 99125 77959
14501 77959 75237 59272 62079 9144 -18088 -40106 -10972 -56585 -68907 -26856 16833 60869
14489 60869 101941 107658 39671 -55742 -36330 43874 58652 65891 50136 70868 101105 100132
14477 100132 116040 66341 4839 43136 100017 70934 40607 62670 125212 90069 49897
14466 49897 102250 86994 78423 76193 52896 23204 18551 50779 18043 59410 120973 105883
14454 105883 80649 35993 60236 88985 55473 15346 30077 105652 126087 94032 118137
14443 118137 143405 119142 113997 102575 63375 16467 26971 15067 57456 45713 20188 34127
14431 34127 47324 22185 13184 -9181 64615 94299 49867 105090 121031 121233 87422 50853
14419 50853 18692 -4520 20250 77088 63606 51519 30877 28491 13727 34898 124626 133631
14407 133631 96204 116119 113501 78081 67497 69299 26131 7662 32461 116831 154285 92618
14395 92618 60169 42449 -3545 -20310 10957 18932 29958 60900 62925 25113 9618 9285
14383 9285 53714 56430 39929 17133 6721 66633 81995 80536 98534 47436 -27693 64896
14371 64896 115426 113038 123196 101620 106134 47491 -5717 -4773 39624 24389 7226 -7859
14359 -7859 -57861 -69649 -33815 31083 68917 56641 31552 -20260 -33483 42058 50892 94341
14347 94341 117782 28928 -55465 -58025 20679 58337 32790 19788 24115 31462 20966 5197
14335 5197 -4847 30393 34204 42720 99587 38045 13571 18796 19701 34238 71252 178978 119456
14322 119456 104071 64476 45207 43187 20821 16919 8413 8322 82948 108409 109316 49138 -150
14309 -150 4084 1655 25971 92509 111648 118914 86866 79801 123585 159768 89366 66813 46340
14296 46340 -13096 -42380 -47136 -36221 -54115 -41641 30557 33107 41518 22367 86447 68444
14284 68444 65904 72230 94469 54087 67750 138660 178448 154927 90092 75143 104336 136265
14272 136265 175909 136804 107332 128571 99066 70661 19265 30883 60882 46879 41677 35920
14260 35920 49966 124886 101193 133654 67968 52065 51310 134573 173686 187207 208176 189631
14248 189631 85509 32724 16969 25321 26132 17208 103665 155495 119571 99612 106360 109229
14236 109229 117760 76298 57145 21635 27118 28191 51322 64146 93179 142166 63398 21542
14224 21542 25426 63946 82962 109537 93475 87677 106337 144332 122309 75671 30115 24130
14212 24130 -33181 -33832 35147 105704 127303 137874 106575 145128 181868 168913 128264 126783
14200 126783 152744 132846 94506 70122 70594 63465 83362 46819 20219 -20995 11248 33048
14188 33048 56128 72817 136225 107649 56032 52221 54366 54600 86147 111862 128809 111354
14176 111354 120769 169057 129721 132618 129021 105062 109377 85608 78073 72317 38072 48373 -11820
14163 -11820 -9031 12569 43261 94694 143229 116400 72661 64842 52009 9546 11793 48594
14151 48594 12502 27761 29168 41742 54967 63753 92644 84763 70589 77046 86832 59574 84713
14138 84713 105835 118269 120388 131373 139413 132791 59549 70926 33743 6788 18297 55153
14126 55153 64972 9512 3602 34667 45524 80235 104911 142863 161262 78410 22934 44539
14114 44539 65575 17057 2147 -33297 37388 66315 60793 79257 109171 87758 48209 30181
14102 30181 -4316 37175 101983 109415 137781 105799 6994 -48921 -16699 -25913 2510 -10888
14090 -10888 9301 24616 70160 83746 95243 111959 147394 113067 83453 93146 86460 32285
14078 32285 70152 117490 117558 127514 83831 59715 86105 46103 42342 54556 150244 228306 254877
14065 254877 208509 154886 153878 148540 196569 232976 171273 81928 115695 113649 57903 73335
14053 73335 120876 171634 218963 223025 192943 247931 271847 310650 426428 503217 540565 686002
14041 686002 876927 1200907 1437311 1347476 1116469 871422 721615 571609 490363 406733
14031 406733 361422 359461 314841 255962 209796 172176 201191 271520 342685 411678 358884 334339
14019 334339 341697 322490 305799 333501 319352 299407 322776 360529 423495 517245 564186 696775
14007 696775 998683 1288228 1531252 1701385 1820057 1841716 1788316 1632966 1450679 1191233
13997 1191233 925271 732720 642737 565800 508411 404051 364236 388002 399980 389894 342070
13986 342070 301376 335757 353955 349748 317800 294405 253137 149018 173699 214496 268762
13975 268762 299661 325692 411579 508726 543984 510423 679126 951929 1284312 1532964 1484268
13964 1484268 1250959 965552 748114 586444 485795 409484 339034 309950 328494 393614
13954 393614 360497 316842 292478 250618 236702 250302 238084 206169 238749 250449 207197
13943 207197 211821 244331 281965 313612 272291 297706 332556 283450 198492 167749 212253 216093
13931 216093 210747 239097 283922 330092 339853 333011 318451 288236 284250 258792 267420 264290 213632
13918 213632 237303 303950 386253 401715 432099 465180 514557 702266 971334 1279186 1505752
13907 1505752 1494285 1221098 916855 719826 556505 427073 354804 308418 235686 233605
13897 233605 282710 357590 359952 352382 358070 328049 320448 304928 356026 415585 465352 443250
13885 443250 414265 372221 270027 280644 371790 446267 464984 482283 520975 580102 705716
13874 705716 950818 1250145 1672929 2182003 2551417 2558485 2199599 1733702 1350390 1054237
13864 1054237 879063 760216 648369 607829 585615 508719 429187 393846 335513 295388 314685
13853 314685 338645 349132 366550 426032 438969 420291 500160 491465 493277 497239 436877 439821
13841 439821 474059 482858 411575 459936 557928 662886 811434 1090310 1427772 1699929 1743421
13830 1743421 1492725 1173633 976641 838467 706400 662092 591927 563123 515890 468204
13820 468204 435059 427913 483646 474108 409949 401446 369457 369000 381818 358644 383119 396817
13808 396817 436924 406454 399610 388978 383157 390493 378512 453021 491732 528469 573059 604684
13796 604684 643100 587807 569024 605044 591588 570224 540214 548236 488595 470749 522299 551061
13784 551061 546162 509063 499974 464012 473007 512812 509110 463646 436266 485015 516566 554620
13772 554620 603121 566293 505247 485398 473251 481104 496710 505364 590444 596945 586544 553599
13760 553599 517648 516579 538665 541911 602001 628720 622204 631571 592559 559820 522077 462007
13748 462007 414157 407368 432055 429087 490213 580504 623239 639863 606029 602515 558653 461823
13736 461823 457059 476524 474513 435653 410841 467477 509175 503581 529879 494064 501677 443082
13724 443082 364798 390686 457503 487547 474733 478485 487275 559713 577812 553631 587527 601906
13712 601906 646157 665959 677226 685453 648016 638707 704033 804944 874194 916645 886300 805629
13700 805629 737545 683868 676256 644788 609037 599719 625627 617012 638355 643025 663782 621017
13688 621017 573993 563998 533824 532287 576222 604139 622604 636692 601287 602074 602146 624204 658105
13675 658105 670031 659219 679566 707830 768817 861621 932449 980498 974215 993602 1043200 1089174
13663 1089174 1085494 1053009 1060650 1087378 1088739 1103703 1081159 1036451 1038454 1003359 994263 992044
13651 992044 1045858 1106499 1134513 1161456 1154283 1156320 1144373 1121568 1095934 1070150 1054989 1017434
13639 1017434 1043335 1092936 1140675 1165356 1166380 1285640 1399430 1485356 1595761 1689260 1766419
13628 1766419 1713514 1589933 1556257 1621494 1693529 1799878 1893591 2014613 2090474 2122494 2163358
13617 2163358 2238868 2356835 2394658 2386658 2413720 2555964 2644998 2706877 2787164 2868666 2938636
13606 2938636 2965846 2985278 3177450 3431428 3682549 4031488 4493470 5072222 5872303 6924364
13596 6924364 7893171 8572658 9012779 9279200 9670965 10319613 11380284 12874663 14935172
13587 14935172 17685553 21398758 26779480 34814228 47153919 66405489 98138105 149845195
13579 149845195 218790676 266538112 251129507 192270158 134064002 93868230 68821311
13572 68821311 53129565 42804574 35662133 30543501 26944151 24537006 23202687 23028256
13564 23028256 24133273 26726614 30759861 35521881 39016550 39227366 36650669 33523491
13556 33523491 31254350 30221442 30448163 32034471 35064329 40074036 47848981 59672167
13548 59672167 78272863 108404906 155115650 214913143 270638765 311639171 338903593
13541 338903593 341127120 317046045 288087714 258049499 213336761 160223977 115567179
13534 115567179 85132782 65729623 53214988 44844417 39096390 35209154 32912963
13527 32912963 32105067 32771118 34885142 38156755 41313848 42071216 39386490 34843274
13519 34843274 30699427 28023301 26805218 26823783 27880730 29810978 32723903 37141757
13511 37141757 44007665 54783620 71930064 100138556 146772424 213752473 272679777
13504 272679777 273070088 217198904 151510828 103320868 73221750 54711288 42711991
13497 42711991 34365154 28223754 23783553 20614655 18286640 16589652 15395092 14435362
13489 14435362 13664454 12998063 12344446 11581612 10684530 9860376 9279488 8847293 8529488
13480 8529488 8310049 8083472 8017609 8051870 8079188 7873573 7568546 7202619 6919344 6880191
13470 6880191 7152929 7718601 8475305 9134384 9490967 9818956 10266303 10751313 11265473
13461 11265473 12132633 13479316 15441111 18067113 21475504 26298801 33370299 44066150
13453 44066150 60883533 88697287 135293150 203676349 264575356 265623768 210892278
13446 210892278 147705652 102175944 74011474 56813121 45791692 38124861 32442515
13439 32442515 28141731 24876390 22492028 20851783 19999337 19894633 20237757 21067947 22687422
13430 22687422 25064771 27366150 29078449 30156148 30225197 29325738 28440291 28647622 30219681
13421 30219681 33200670 37844770 44820711 55301944 71356650 96181110 133537892
13414 133537892 190060785 276470164 384921845 465690294 470288392 402464430 303977501
13407 303977501 217154232 157063107 117567326 90661200 72078527 58918687 49357867
13400 49357867 42207806 37015033 33533252 31771964 31522644 32022679 32051395 31312614 30202054
13391 30202054 28489920 26341298 24438389 22981017 21929668 21272078 21098882 21512376
13383 21512376 22569838 24332519 27095560 31403019 38167502 48778788 65609979 93296544
13375 93296544 139257173 207571986 272820639 280369351 226016610 157826486 107326029
13368 107326029 76201601 57478840 45404025 36767838 30134237 24918698 20888827
13361 20888827 17849253 15574165 13923580 12805471 11955425 11037747 10220888 9744225 9327429
13352 9327429 8621760 7736416 6916004 6251635 5657586 5133692 4669794 4239530 3839028
13343 3839028 3520474 3317082 3162984 3105131 3196873 3319210 3389297 3374994 3252580 3055862
13333 3055862 2804708 2635708 2571892 2633885 2738697 2678697 2542523 2318421 2163486 1980982
13323 1980982 1804789 1702097 1646501 1651592 1671538 1684739 1671544 1657870 1578772 1501150 1412201
13312 1412201 1325224 1233739 1121781 1054586 1065679 1078548 1015917 1090706 1151576 1233342 1321605
13301 1321605 1452692 1657272 1800941 1744711 1652661 1546433 1424690 1303991 1171614 1095399
13291 1095399 1083126 1128788 1150270 1182795 1072729 957232 931997 945650 1011357 1129180 1251314
13280 1251314 1282777 1248959 1162117 1070163 994331 926595 901168 851858 808643 762967 761633
13269 761633 733096 697864 728844 772025 823602 947658 1019640 991117 942025 907804 860421
13258 860421 811286 765025 820837 846831 931275 1034995 1153038 1201189 1174988 1091559 927770
13247 927770 786486 645038 605451 640496 632362 573600 530965 447733 384590 346153 394530
13236 394530 365905 375820 350364 273830 281718 328113 312777 290042 299530 290500 229352 192582
13224 192582 275327 303877 242389 213549 226981 224152 269181 313328 373835 391321 398903 417055
13212 417055 391728 374518 282013 225176 222866 240917 244858 205739 109239 113616 63546 8366
13200 8366 5522 107465 170256 114554 53889 36698 31528 4547 -984 -21763 -21171 -38033 -19043
13187 -19043 -21002 1276 32986 45056 -271 3064 50530 -17685 -104749 -138567 -156221 -116730
13175 -116730 -75040 -94202 -87903 -76976 -62423 -97911 -79690 -71301 12774 58879 -4058 -66014
13163 -66014 -110675 -107439 -114063 -114250 -7177 -39734 -41138 19343 66491 96610 70040 18338
13151 18338 -69719 -124506 -134150 -137076 -93917 -6980 33481 14179 -297 -14433 -30631 -31578
13139 -31578 19078 48662 41158 19913 82175 103797 55450 64463 95956 114088 109065 76078
13127 76078 67745 53540 44912 48922 61658 63547 66749 81254 140424 206176 198968 202648 256458
13114 256458 273130 322816 483841 698801 992622 1254086 1283134 1030892 755742 522201
13104 522201 349135 274803 209307 89587 41145 60721 95371 140789 147586 153519 142045
13093 142045 108965 136357 139938 62102 2619 69131 156109 226279 252936 228426 184896 211849
13081 211849 172579 209638 416495 626615 874016 1130958 1345494 1531408 1657030 1684531
13071 1684531 1649353 1502481 1329552 1127878 836220 587290 417616 293443 216472 159119
13061 159119 125338 126844 115111 198218 215459 237610 238929 188221 177422 147955 168927 234664
13049 234664 252713 235679 166369 105429 133355 169758 192866 163964 236718 322692 452542
13038 452542 668807 974672 1275179 1367875 1168839 876439 642452 443281 311437 249247
13028 249247 206365 112201 67850 33347 55978 74393 115268 84671 82042 41769 21810 -6792
13016 -6792 36926 35073 10062 35473 52384 38694 35823 25544 41945 50764 84205 68262
13004 68262 32247 26861 25808 32377 43561 7381 -12686 -12456 47225 27444 -578 67363 157723
12991 157723 164921 127796 91315 93194 132393 290512 456781 614534 900855 1176161 1208821
12980 1208821 1016235 778333 614635 512014 414385 322198 274888 202244 128761 89408
12970 89408 90659 107063 148561 126600 79951 72096 102166 112697 157091 190157 206558 194115
12958 194115 105446 75346 115738 135913 109419 89781 173237 232328 367501 532408 764081
12947 764081 1044275 1401995 1930585 2319892 2307202 2068673 1653885 1172641 862585 630880
12937 630880 436379 323208 234350 157264 129479 155897 151753 179565 156389 161076 162400 156662
12925 156662 166127 177054 142155 105821 83529 82676 82394 81220 110346 93800 112495 150712 248902
12912 248902 280309 333187 460576 612006 822832 1107450 1363742 1432373 1168691 869941
12902 869941 678996 482700 348872 283646 181658 91176 46734 39857 51143 61425 12255
12891 12255 31511 107036 72015 34362 21603 -49039 -86540 -48434 -20620 -41417 -53573 -54021
12879 -54021 -31093 -31939 -19950 1721 22179 -6579 -30827 -39260 14389 57458 36090 -12829
12867 -12829 -43865 -68229 -41688 20169 71080 68316 22755 -46527 -80265 -139929 -129571 -85386
12855 -85386 -86211 -95053 -110166 -80684 -54238 -52913 -50206 -27783 -29892 -56327 -61895 -73055 -36614
12842 -36614 -3521 -46649 -33056 43781 15821 23960 93208 63550 50014 -877 14086 24054
12830 24054 -20131 -69509 -102592 -101457 -54544 -69034 -106427 -69692 -11893 -1789 -5138 -37093
12818 -37093 4097 59545 9703 -70220 -132757 -131152 -65978 -36062 -32275 -7544 4380 -6275
12806 -6275 -60449 -57598 -64925 -20777 -23302 26150 66683 92548 18002 -26255 24230 56845
12794 56845 27665 37476 -14239 -31662 -53751 -56478 -72061 -46119 -48949 -69544 -112211 -64628
12782 -64628 -102494 -143483 -113349 -15167 20111 87 -16256 -26993 1514 -25633 -32804 -29071
12770 -29071 -30303 -35339 -30087 -41636 24150 30151 47057 82028 88485 25848 28105 87875 82869
12757 82869 46806 45770 39551 45236 20091 15525 -27180 -72757 -97370 -137340 -156112 -119930
12745 -119930 -121107 -109961 -85641 -50173 28224 88419 118122 146203 121350 64137 61485 70154
12733 70154 62084 14599 311 1308 -1457 -33670 -15624 -3830 9372 -52712 -60464 -13967 -11842
12720 -11842 5829 6641 20711 56143 41343 35134 -28791 -56616 -65103 -45330 -14879 3600
12708 3600 -2832 -20252 -74132 -120541 -105749 -74460 -79818 -32017 -15887 -14066 -13439 -820 21367
12695 21367 -22793 -68134 -72306 -122655 -79564 -11871 -14561 -14873 -14210 -202 -18237 -53984 -19576
12682 -19576 32522 35806 -22948 -93223 -92176 -29619 -33302 -90714 -89336 -68720 -46984 -36873
12670 -36873 -59329 -52314 -1888 31701 14745 -20876 -72823 -69268 -65237 -55144 1412 40678
12658 40678 -16604 7315 78299 57987 14791 -4874 -22185 -15612 -38590 -40860 -10290 -54572
12646 -54572 -116472 -19598 51560 55309 53989 56981 41691 7604 14618 31987 92402 110662
12634 110662 54655 90743 121758 88972 178745 176689 76019 112561 153881 227454 303830
12623 303830 431010 518750 622005 680240 741966 753636 808313 877259 868421 730702 578908
12612 578908 462662 332184 280577 263162 256951 265119 261938 280406 243249 190096 149034 149694
12600 149694 147436 172708 217231 274495 312000 412375 432731 417394 408750 423117 389078 358922
12588 358922 350921 386736 474856 564986 700905 844544 979998 1136628 1317310 1466773
12578 1466773 1590938 1716545 1722104 1547374 1303503 1040381 818632 611022 484015 371395
12568 371395 325193 264174 253965 255793 237156 249454 227577 266889 242896 216326 246178 229863
12556 229863 242955 242827 241808 250808 227504 173948 139560 137610 167951 302902 382474 397478
12544 397478 434593 472872 551795 698930 806318 966580 1034012 1033000 998151 845396 588796
12533 588796 430813 392297 327986 203921 170969 173162 184973 194297 144869 110369 112758 87186
12521 87186 76880 38638 54443 77295 10407 -27474 585 -11811 -18004 29012 29087 22134 27361
12508 27361 12002 9379 57226 90175 45337 -21346 -88990 -142571 -162706 -134820 -93857 -25714
12496 -25714 -24492 -34894 -17973 7960 48717 57348 2738 -33108 -23737 15714 27244 12074
12484 12074 9382 -17478 -26545 -31046 -6958 19070 -13645 17519 28437 61293 43157 75823
12472 75823 88383 32193 1572 69811 73517 60153 80941 70236 36386 50062 38424 17729
12460 17729 13536 14826 16858 -32472 -44856 -29297 -24726 46462 50607 53314 32659 -12564 -22321
12447 -22321 -40604 1021 46343 18686 8688 -28931 -73685 -33695 -30840 -10359 -13769 -26209
12435 -26209 1268 -8577 34902 56788 48496 41704 -14594 -5099 75960 112845 90680 57778
12423 57778 26085 33550 28521 -6630 -19314 -5223 13800 -42550 -70109 -36802 -92197 -112041
12411 -112041 -41682 -21337 -7053 -16628 16099 22696 29081 -1192 -26399 24274 75567 140457
12399 140457 131488 55952 83467 142344 125568 45922 23532 60194 66309 53165 76518 100244
12387 100244 87206 87801 94142 37658 -22343 17872 77864 108378 106322 111916 131344 130109 158391
12374 158391 150716 109380 70075 75768 115322 107156 128018 124311 56168 52260 72946 58952
12362 58952 46499 49050 54632 81506 53442 16811 -13051 14547 -14371 -61454 -52196 -24719
12350 -24719 27891 56650 35302 -24643 -98668 -100202 -77658 -41674 -21434 -65421 -67473 -46869
12338 -46869 -24857 -9558 934 -9720 -76400 -55378 -46664 -58455 -93109 -136772 -88766 -26117
12326 -26117 -17775 -18664 -16282 9354 25814 21439 -15792 -46495 -12803 23014 59789 10074 -24531
12313 -24531 -6030 -5587 28798 63716 44849 -19271 -39949 4784 -21647 -80213 -66123 -59220
12301 -59220 -57796 -51055 -76760 -132635 -115544 -16194 3775 19786 -8296 -7987 -52679 -34111
12289 -34111 13182 14009 5877 -22712 -12981 29046 48827 -14218 -41749 -8033 -29148 15798
12277 15798 41550 34976 -1672 34900 -484 -80550 -114401 -99598 -43995 -21095 50638 67279
12265 67279 -8213 -7537 7011 -22491 -66509 -86208 -79479 -57417 -85082 -100969 -70679 -24212
12253 -24212 15462 -19036 5557 37411 1693 -66776 -42977 1673 -13451 -32536 -50143 -45066
12241 -45066 17963 21856 -15205 -11347 20295 29181 5180 -16112 -26937 -4400 28030 45027
12229 45027 43946 42078 -7941 -31387 -7396 4786 -34075 -68892 -88049 -96995 -77791 -64013
12217 -64013 -30003 -1901 -22563 -65957 -82629 -57380 20639 36836 4703 -19704 7305 -10219
12205 -10219 -43680 -47830 -81171 -55287 -31598 -29046 -59751 -28386 -19886 13252 -13140 -12920 53656
12192 53656 35984 20645 77591 73336 57441 35745 26464 20993 13665 -4812 -34709 -31091 -11206
12179 -11206 -345 3436 9243 -8751 -34039 -29681 24533 118550 191209 358823 484988 419710
12167 419710 314608 211364 121054 112700 122627 88541 71898 47040 51377 57433 74099 115984
12155 115984 96899 57946 16830 39696 89331 90800 75390 95711 74440 17718 -28715 960
12143 960 20732 49971 27817 -40823 -31285 15339 -41328 -86352 -54776 -11317 5088 37290
12131 37290 85068 89981 107645 108648 113747 149235 120685 99269 60097 71002 80014 62508
12119 62508 107620 265071 414875 455685 330877 166300 162284 167407 147277 128795 98448
12108 98448 31629 -23437 -42967 -63186 -79438 -24405 24697 11993 -20632 -1976 -2756 -13907
12096 -13907 -6619 13685 12251 -7010 -73450 -62707 -74741 -29581 1371 36980 82978 19261
12084 19261 -56021 570 59374 49600 7645 -4563 -607 24360 42363 47862 65335 -11144
12072 -11144 -42579 -73330 -84320 -32992 -30799 -38893 -102134 -123542 -29340 -10709 -70747 -80895
12060 -80895 -61630 -25773 41838 46711 6116 16324 -6087 14843 10646 -7914 -323 -19282
12048 -19282 -28706 5669 22667 22902 -28612 -9580 -23899 -255 36803 46040 36392 82738 119642
12035 119642 173081 225854 264814 175579 82679 50728 12303 -17348 29373 86518 57954
12024 57954 31367 -11140 -52604 -17519 6212 -5918 -25625 -62561 -51492 -65084 -20486 55274
12012 55274 40942 -751 -21228 -21703 4956 42242 75097 77302 64730 51307 -26064 1157
12000 1157 34013 2342 10541 37874 62129 57327 92410 88074 88787 103042 109337 120343 79815
11987 79815 75716 88554 24197 -24579 -8088 -28235 -21174 -16356 -35 -7158 -58863 -5135
11975 -5135 -2407 -2853 2930 -3521 7849 -22770 -36969 -50675 -41966 5905 -14160 -93719 -76001
11962 -76001 1411 50200 68764 70959 76129 66624 38208 -4604 -13192 26395 31735 5402 50309
11949 50309 22334 -40795 -66054 10987 33837 -38511 -40610 -12202 36208 30062 41082 31921
11937 31921 71645 112352 135604 146704 153473 103313 19980 33342 77758 93075 86341 76845
11925 76845 110831 72984 17987 25768 -31550 -10796 1439 16598 32591 46785 44693 -4009
11913 -4009 -21348 -104493 -193831 -180652 -112383 -98886 -140057 -134857 -88379 -91207 -89037 -46951
11901 -46951 -32462 -54626 -29169 15412 -14471 -7597 -2802 8882 55003 73001 46643 20638
11889 20638 13825 -9248 11841 81006 47817 -17145 -15953 -15474 -25436 911 -10661 -32191 7389
11876 7389 28953 33591 33572 11734 3077 -29329 -49256 -40235 -11379 -17959 -45847 7738 74572
11863 74572 87737 39803 3158 -55227 -70959 -40855 8751 60593 84325 82238 59006 77718
11851 77718 93722 2424 -19799 10540 7400 -12096 -12909 42178 100878 59751 48588 58040
11839 58040 24666 -18635 -48755 -4037 -38183 -36897 -55702 -61310 -68309 -18746 44256 7546
11827 7546 -28701 -46561 11246 -21971 -31669 -59398 -114694 -87801 -73103 -64144 -76915 -39348
11815 -39348 -74735 -63060 -10841 74757 68834 28588 50631 54875 57109 36969 43065 76929
11803 76929 49454 44347 65177 30692 31980 25241 31530 25507 43880 93671 86902 36611 15730
11790 15730 59870 48784 37377 10117 29155 18606 -17841 -28115 -23141 -61559 -27911 92886
11778 92886 128367 146976 166678 203027 193139 151297 111431 69584 90076 69473 74707 64164
11766 64164 65482 96400 141216 119145 59885 -15311 -31730 3292 10674 -2273 -1466 -7895 -33304
11753 -33304 -66356 -73969 -17100 -21094 -74086 -70692 -754 33727 25716 10055 44656 117199
11741 117199 127098 65390 42376 38405 89475 56861 26580 45331 9392 -22608 12604 30268
11729 30268 33444 32187 62079 23178 -14218 5539 27504 13718 44664 -27815 -72100 -38311
11717 -38311 -36684 -20317 10363 5961 -9688 2474 -23638 -5142 70359 41097 16309 29627
11705 29627 50598 68805 146282 129704 29888 -72949 -45163 -1807 48187 46474 57138 43353
11693 43353 26662 -12532 2532 -14110 -37199 -57225 -39051 -50459 -77805 -19126 -10512 -107
11681 -107 8745 -18580 -69941 -69926 -29765 26703 -8342 -48319 -66852 -72576 -74964 -63762 -19642
11668 -19642 -23485 -60215 -25781 -19903 681 31922 53936 91468 67124 42996 2260 56108
11656 56108 73209 40783 17360 25292 53847 48106 68026 90803 62818 54084 55033 36669 -25470
11643 -25470 -17399 11808 31429 12176 9230 39546 14147 35428 8287 -3091 -19087 -52647
11631 -52647 -64925 -79459 -84331 -83013 -50748 -50618 -61347 -2283 -82 -23420 -26536 -2267 65039
11618 65039 34269 -58398 -42547 16710 28863 9246 14799 31059 34993 40992 70562 122915
11606 122915 102317 39440 83898 98366 52257 36156 54716 63219 13381 -30948 -17509 -14590
11594 -14590 -48229 -9306 16362 21363 12589 821 13572 -17575 -13263 6868 8097 -9568
11582 -9568 3816 -36255 -46854 -17515 16990 -33282 -299 69405 79954 55183 29640 30925
11570 30925 -30166 -47561 21870 26048 -13767 -15537 88554 79360 30223 43285 16985 15267
11558 15267 4905 -7091 -13204 -9404 6311 -84580 -95004 -12309 30368 35396 -29814 -62930
11546 -62930 -43302 -71040 -64375 13826 19773 -13982 -5383 -35239 -33117 4715 -32580 -42308 -39939
11533 -39939 -91682 -85169 -38482 -42696 -10483 25608 79519 116301 92741 98580 80568 14557
11521 14557 -12917 -41850 -19191 -24590 -43565 -53663 -35916 17626 67263 36041 5271 44666
11509 44666 93766 65595 54107 49805 -16732 -62492 -19321 38539 3519 -18303 -49475 11604
11497 11604 26716 50834 85583 30877 27258 45110 10575 13769 50275 68063 98283 120942
11485 120942 55963 60300 81764 97216 69792 22849 18421 73272 92257 62108 60558 59023
11473 59023 16989 12401 37210 53511 70527 108894 79322 69237 118167 118019 110095 114722 88073
11460 88073 60780 87096 135853 189557 246969 287021 221523 213956 190843 104388 115715 193111
11448 193111 165112 150769 140911 116864 141621 185719 176255 188813 212512 232678 207602 217197
11436 217197 266676 334202 393119 489401 594201 705631 801658 876025 951049 1176021 1584149
11425 1584149 2171234 2862405 3598145 4171597 4382664 4172680 3612620 2942632 2367989
11416 2367989 1903824 1630465 1336532 997309 773349 640101 621466 626983 557290 462999
11406 462999 402324 385543 317653 242749 286103 305499 254614 255945 242831 206109 172569 200555
11394 200555 172906 160519 176766 165985 179427 179044 174491 144108 77773 59311 83171 52902
11382 52902 20935 21698 87931 174741 152764 26812 16021 31789 35313 55246 75503 77806
11370 77806 102064 136186 203060 279048 247868 211988 155290 207983 233320 251927 230768 208092
11358 208092 194652 189323 167780 159434 174632 177490 215407 237691 237575 186813 182042 199564 145222
11345 145222 140414 155551 98195 12673 10349 74500 78786 38909 52960 111099 133767 121142
11333 121142 64189 56858 51291 42746 39586 46573 47386 28674 63930 22161 -52717 -60863 -15948
11320 -15948 -8039 -13881 18543 24053 55767 -6852 -84711 -43225 45280 34523 -2863 2548
11308 2548 58273 116510 127240 71026 38706 -7464 -23192 -17803 -4763 6899 42491 136331
11296 136331 171645 167491 123862 67109 26052 -1917 47535 112785 152612 130644 106400 106383
11284 106383 98765 93009 72225 76366 59537 104909 99084 58848 -16341 -16588 -6536 -8955 89808
11271 89808 123707 76881 36783 93605 141203 175470 103882 82488 34574 -7411 -2788 2598
11259 2598 2108 -9520 -5518 -13550 -18543 -20544 9314 47584 46575 29755 72269 39902 30711
11246 30711 33694 47827 36930 16354 14950 -19076 -1406 27844 -41097 -59495 53704 121323
11234 121323 63311 34419 48531 71993 93818 -8499 -23356 16082 -11039 -23633 -52482
11223 -52482 -84793 -53449 -29992 -8777 21588 17391 9792 16271 44541 73423 60482 86798
11211 86798 86327 51258 72964 67694 23560 -38556 -74365 -84184 -99886 -58440 -30821 -35727 -15731
11198 -15731 9098 32438 105072 159290 145690 150306 120076 104554 69748 -467 -1909 51794
11186 51794 80821 58293 69992 37708 41397 63372 49893 25576 40535 88968 81149 46149
11174 46149 79662 104893 124636 108723 88750 23314 22026 51246 64996 63088 35954 9861
11162 9861 21091 33538 40574 34015 30058 -28287 -67228 16774 69615 6629 -63542 -85076
11150 -85076 -40940 4089 -2344 -70716 -106959 -69141 -8172 11940 13449 36357 49176 48257
11138 48257 79364 88599 22758 -6094 -6430 7694 -40344 -98304 -55216 -2660 41991 73954
11126 73954 57226 26698 38029 -4851 21002 10985 2417 -36860 -24797 12424 53699 61837
11114 61837 15883 -20428 -26752 13380 89117 72005 84868 99966 120539 71433 40164 66924
11102 66924 87210 87295 85395 95998 113049 95317 48982 -5763 -4332 -29963 -31901 -27476 11589
11089 11589 70690 62466 -2261 -48947 -25218 20717 42351 22975 18880 47832 123060 117540
11077 117540 64549 -6385 -18540 -43465 2813 68876 70207 63171 64611 34464 4172 14684
11065 14684 69913 90400 124571 136836 89352 57004 92373 71686 51751 44748 42829 82513
11053 82513 123166 103709 61214 68732 58244 29602 20585 39872 44630 27794 46208 62421
11041 62421 16403 5288 15144 2998 -27594 -59648 -43360 -20229 23400 52023 83168 54079
11029 54079 72575 141144 116930 63644 61343 58718 83199 95416 50425 21287 57932 93207
11017 93207 90299 62358 69988 45150 7046 39414 -4063 -12020 -42355 -40647 34604 51842
11005 51842 51118 104357 175240 230440 136727 -9235 -7749 -1524 -43600 -56521 -69152 -47830
10993 -47830 -10735 -10753 -47491 -42489 -373 5889 31945 30707 73436 83433 -7399 -47920 -235
10980 -235 27525 80093 71568 76888 58450 51502 60912 70395 57264 63608 71912 143734 115654
10967 115654 45117 4077 28282 50378 86147 44805 51199 85393 95298 120024 145585 127233
10955 127233 93087 -1658 -5508 -6648 9580 23279 77953 49792 39838 55267 39211 79792
10943 79792 55579 37005 33333 20571 -29085 -93829 -113110 -32564 43438 27972 22240 34240
10931 34240 42151 5075 17099 42443 49722 60498 65396 44498 48522 41368 32373 43205 69425
10918 69425 70940 39917 8119 -22822 -26397 26370 77316 97893 130693 135123 89418 104333
10906 104333 77877 20807 -13210 -21822 20486 15939 14799 -27712 -44466 -35345 -12532 27287
10894 27287 31641 20174 433 2728 -6932 25805 55142 103006 145527 140864 114369 74719
10882 74719 33085 44300 12200 -14812 61697 83103 19651 -25352 -14946 52859 91349 95364
10870 95364 23604 -2198 31441 41023 39866 66111 55500 36830 84194 142851 112948 32216
10858 32216 75596 127135 89700 43083 28319 24267 -17265 -41668 -58875 30713 61252 42807
10846 42807 46866 79293 70182 40482 72655 82055 72023 104209 65132 26613 -11057 -4205
10834 -4205 10551 -24716 -27016 36566 22878 9379 45326 87570 122585 146127 139453 99095
10822 99095 44805 30917 5792 24322 41703 25955 -19792 -17364 38250 48691 132971 132076
10810 132076 88300 81912 76960 47339 42277 -14573 19360 78410 83094 50440 23429 52649
10798 52649 90927 97176 96017 122362 157182 117796 46046 32699 48448 58051 100890 94802
10786 94802 82483 95241 150043 117930 58953 60630 105636 134499 79897 54443 25547 -15159
10774 -15159 -3977 37981 104148 150723 85853 62509 106149 51657 -2134 28941 88093 171700
10762 171700 161620 125629 157167 158071 182456 166930 89738 14934 37704 67026 86478 137767
10750 137767 152747 99371 88142 29222 11407 3600 19046 19317 -3307 -4307 7962 2989
10738 2989 -9252 58565 87413 41175 57838 65378 104733 135146 143779 118665 132064 142522
10726 142522 138787 139678 133458 102624 93746 113777 138005 140687 109093 49728 69143 89057 55578
10713 55578 59522 16136 -27271 -10255 38189 95591 106100 151194 200738 174362 127448 71612
10701 71612 68836 175991 204955 130513 103355 113533 131846 142670 141437 138246 122955 113403
10689 113403 92004 78243 122938 160309 162857 162199 132512 73061 111093 107787 138370 129618
10677 129618 125785 143249 160292 178767 211662 275783 353034 464888 484727 392795 328430
10666 328430 300683 231401 177532 180028 164524 164482 170640 101405 79665 112975 171695 185053
10654 185053 148260 182365 140117 97118 117337 128665 180662 206504 193763 221325 280628
10643 280628 253080 205208 249527 278891 341389 417258 423563 544809 659720 815960 928386
10632 928386 1056862 1143627 1062039 857427 690779 555507 391034 340315 281624 243181
10622 243181 243769 280909 316307 357389 356166 396860 378441 360657 343496 296262 296630 380970
10610 380970 363147 272921 240276 205673 259864 296671 326117 449374 551303 629609 695795
10599 695795 766112 922784 1048742 1227040 1344046 1373010 1294606 1146293 1065626 935729
10589 935729 771823 692704 567185 492750 461017 402100 416304 389591 329039 307853 347564
10578 347564 352632 305396 327446 322185 297219 259536 260872 281370 244833 282421 303849 296681
10566 296681 268352 316903 403923 497358 530883 628537 804881 961981 1043576 1087203 1075984
10555 1075984 1005571 882939 738699 635231 536798 428466 382049 373135 406792 396732 339189
10544 339189 321186 275823 315830 312954 245190 240986 195145 232483 282780 287254 231919 207418
10532 207418 190348 233572 293203 335119 281254 277849 316321 320616 277102 325323 388536 413331
10520 413331 455191 395835 351560 322911 348226 409635 411310 377890 380972 338335 258397 210104
10508 210104 252739 286384 309096 273521 279030 260285 279281 265270 207354 219970 250303 310831
10496 310831 346130 377101 358507 354635 339557 321768 323329 307644 365954 411372 423775 407000
10484 407000 391029 355091 318776 296854 257770 265196 318297 308357 258501 239750 234362 235315
10472 235315 301146 325497 324262 298016 280946 303472 267392 201954 278350 302292 281232 234468
10460 234468 241192 334610 399522 363874 341861 381243 415614 342634 309170 381471 415989 475734
10448 475734 538945 586198 490918 442439 465055 477932 458175 444035 351493 291987 344001
10437 344001 372756 356214 395308 464098 452677 398896 383493 362959 377274 373479 370824 413382
10425 413382 429281 416095 413413 355183 286539 331590 372775 321871 316371 330895 332517 375232
10413 375232 432585 453393 397329 414849 435057 475266 482710 455493 500130 525802 497267 483697
10401 483697 481304 458547 448069 469661 448963 396185 430947 451132 447928 428226 452302 498952
10389 498952 549725 516241 469144 430370 410728 413493 381849 430821 453539 412990 403462 464743
10377 464743 494725 495831 499154 531094 523758 428338 435820 472884 502189 518566 579422 583995
10365 583995 569842 607867 661716 652033 648352 613792 625698 709217 800868 757137 699946 692413
10353 692413 713521 709684 752863 715585 634707 667008 705778 667925 638023 628700 652448 685582
10341 685582 722417 711199 693206 732410 727776 768610 790728 834066 810311 754983 783989 838608
10329 838608 827321 801674 845300 936776 1017505 1005838 1016197 1056616 1132434 1164839 1261339
10318 1261339 1356146 1414015 1514740 1594391 1561683 1543331 1491655 1449633 1425148 1390596 1399130
10307 1399130 1376478 1354226 1336750 1336161 1343563 1358895 1379123 1407858 1533983 1605140 1614988 1718702
10295 1718702 1772026 1779652 1814733 1842127 1912971 2044863 2228432 2413295 2566772 2826820
10285 2826820 3084906 3352078 3724034 4225770 4791864 5492842 6392752 7496616 8771990
10276 8771990 10475310 12948033 16707638 22618174 31842548 44924657 58942865 65695066
10268 65695066 60301519 47673431 35355382 26376746 20488644 16671472 14151175 12457114
10260 12457114 11387607 10739722 10201135 9792685 9572376 9672959 10206239 11223253 12755678
10251 12755678 14234207 14850671 14853155 15067588 15443411 15715311 16037680 16888273 18497447
10242 18497447 21072995 24789594 29963514 37521258 48851859 65182316 85435916 107722143
10234 107722143 134560528 165530297 190016904 197438432 183537338 152056961 115617749
10227 115617749 85613749 64925272 51397934 42491613 36498474 32453847 29759155
10220 29759155 27989967 27095681 27205469 28685381 31870529 35510368 36616691 33921740
10212 33921740 29741896 26511475 24877822 24621365 25374645 26894029 29434776 33275095
10204 33275095 38927967 47143830 59550795 78670182 105056527 132159355 155104166
10197 155104166 180728883 212671490 240795079 250705560 237764547 211271409 182479803
10190 182479803 151892672 119794671 91634762 70849365 56759785 47389347 40890081
10183 40890081 36152026 32487515 29751581 28090915 27582127 28527488 31360344 35124459
10175 35124459 36521274 34086862 29924419 26404247 24408063 23750094 24161528 25364560
10167 25364560 27404342 30665488 35647956 43119711 54798830 73036222 99080746 128333045
10159 128333045 152985434 170331620 177341481 168728717 147337059 122882704 99687288
10152 99687288 77823744 59393414 45929232 36838820 30724898 26426078 23272910 20906192
10144 20906192 19152648 18046077 17181214 16305865 15684736 15371906 14905555 13677802 12110595
10135 12110595 10932270 10194284 9757594 9620838 9690491 9939170 10383026 11055740 12007257
10126 12007257 13595301 16270736 20671559 27572064 37765918 50101222 58788356 57475770
10118 57475770 47290816 35002296 25267688 18690074 14363721 11501033 9491368 8208554
10110 8208554 7305730 6493972 5754415 5061705 4433246 3910346 3515396 3257089 3105054
10101 3105054 2969084 2865691 2760741 2691658 2636404 2521457 2387730 2243350 2067124 1827491
10091 1827491 1685251 1643757 1579153 1481548 1430371 1343644 1266042 1207579 1206030 1175302 1145125
10080 1145125 1113940 1082602 1006575 944807 995140 1041195 1110519 1086982 1030538 1035468 1030780 978272
10068 978272 960288 1009896 1093131 1236086 1409457 1472230 1544662 1489957 1425666 1462301 1534286
10057 1534286 1703978 1813238 1915982 2055949 2418697 3051005 4047889 5767068 9254746
10048 9254746 16783073 29434969 34694065 26097444 15232338 8984596 5924658 4283946
10040 4283946 3380023 2831147 2343564 1980019 1670029 1461133 1321118 1208778 1162782 1094044
10030 1094044 1059874 1082049 1104119 1167269 1198182 1106239 1012577 930573 916090 926766 868776
10019 868776 782006 687656 606338 615585 617526 589321 552850 527010 595113 596800 510148 485201
10007 485201 470526 479623 499466 514659 477296 405280 406017 422148 452345 438156 407481 348393
9995 348393 320834 341233 322387 307760 344593 395030 443090 490530 463277 421727 409983 412177
9983 412177 427101 439379 468857 481560 432633 411972 365465 352332 321901 352729 381042 409026
9971 409026 409274 416023 432066 407249 374193 320092 313521 336851 327268 289475 300699 246882 216097
9958 216097 175212 183222 193233 218482 250018 308833 345879 392979 372636 359429 380073 373928
9946 373928 333970 365920 463557 542062 545828 515988 477576 464606 417248 399052 386327 289308
9934 289308 271911 289776 308767 334102 296481 298295 326280 312039 300589 262061 233572 244452
9922 244452 299710 320423 290291 260527 255981 300313 333455 330518 340409 351425 294385 222637
9910 222637 240721 313199 395735 382927 341351 351175 360423 346540 301042 296632 283807 248362
9898 248362 212171 213773 232494 286868 290131 278653 342072 368779 392807 387330 334715 275935
9886 275935 289273 306844 356131 382057 381924 350636 324024 312675 348689 327673 292481 335171
9874 335171 388872 394516 320234 274635 286951 300679 374797 439249 454322 506894 583602 631387
9862 631387 599052 510870 465226 473375 467240 390119 314329 289436 264771 269512 312739 361966
9850 361966 302127 190684 210780 221316 204479 231263 328509 364053 338061 286194 310576
9839 310576 346051 366446 373494 432018 494697 493268 501615 534150 605006 733207 853869 943411
9827 943411 1075430 1191420 1202073 1132066 963517 725307 672785 637310 525058 399424
9817 399424 327433 349671 369644 297525 353609 396808 359148 369960 435662 409182 378771 389280
9805 389280 365918 346774 301654 280348 289362 258072 259450 358626 439067 499284 631663 765133
9793 765133 944255 1087062 1227637 1354102 1438322 1462243 1397235 1227858 1068308 931230
9783 931230 812968 662879 597520 561632 495990 431460 410207 388992 368082 310311 345586
9772 345586 386646 416719 412096 299658 238929 283458 299650 275034 252343 279136 303090 354422
9760 354422 370821 385723 414719 490909 575119 684029 810240 946863 1028394 1098434 1036291
9749 1036291 878709 777429 696978 573252 433929 344638 312089 329884 288928 245492 262612
9738 262612 272037 264900 223283 184146 207102 188785 205927 211157 183371 211873 216347 219796 212446
9725 212446 220992 218341 239483 213082 235339 238703 191641 175727 210417 241186 360971 434427
9713 434427 406763 333648 222819 122489 128788 159850 185474 185818 163723 120576 113443 130936
9701 130936 136186 85005 83347 90579 94597 118591 133419 123494 115962 52889 7498 71845 79179
9688 79179 81389 69823 9971 31412 100741 138274 91734 89043 82893 55105 107120 143186
9676 143186 140580 70278 105807 168565 142477 139796 121633 140803 119512 80981 84105 114078
9664 114078 120673 112756 52063 37365 65708 46132 59639 108704 89551 121644 140321 130991
9652 130991 131978 123095 147585 98511 71738 86281 104252 197319 189251 129012 110407 109555 129008
9639 129008 184665 162553 186735 237667 249419 213421 175296 170303 176542 114367 79499 120152
9627 120152 87679 66679 81089 80143 76568 110016 96788 94290 108712 112620 117737 144266 126853
9614 126853 138192 103747 122234 155300 169344 165522 119465 134793 121402 77877 22299 -29303
9602 -29303 34594 40352 39752 101743 116777 132629 94323 69663 54221 80018 84861 37557 62991
9589 62991 39902 97602 122891 71109 31954 -13256 29544 41598 37330 11436 90937 109381
9577 109381 65776 60745 42958 87318 89393 71480 88689 107717 117142 62536 58466 73274
9565 73274 81163 93863 70696 86939 24616 -4890 25042 33458 4750 -26281 9735 30765
9553 30765 115283 81144 60053 10305 8862 64987 78382 84436 22711 2531 28492 50535
9541 50535 77214 144227 141132 89639 105002 142266 145555 62650 24684 74190 58177 41864
9529 41864 68430 74008 9347 44187 15709 33125 14242 -16086 21836 81488 90211 95139
9517 95139 109170 46374 -3351 -36509 -23994 5832 9185 36181 26719 27252 36923 9807 12924
9504 12924 -70 5770 43610 94379 147833 214353 207016 126578 63086 49555 46253 82182
9492 82182 33457 30894 18630 10722 14084 24228 108662 137043 68436 19129 46758 94061
9480 94061 68121 94359 162089 249452 226265 204327 131923 58878 15939 35806 919 36982
9468 36982 44113 11498 32012 45409 20021 -14053 -11589 -16481 -26890 -30632 14856 56793 97635
9455 97635 73517 1632 -11692 -18094 -36286 -35564 11545 64692 52318 4503 40460 66611
9443 66611 52392 63269 26891 -18294 25339 55394 47717 53476 20423 30084 38440 58205 52737
9430 52737 41134 55068 121971 165380 178888 145731 98230 57727 60277 92455 61882 36001
9418 36001 -11456 -46080 -47227 -80212 -45035 -27339 -72208 -103488 -119050 -119786 -132344 -114352
9406 -114352 -100633 -25297 -20200 -20249 -58183 -7175 7448 -34408 -89243 -92219 -44582 -33306 -37136
9393 -37136 -26660 6220 -7841 -42 -99855 -140865 -89990 -66830 -11278 -46850 -70551 -42764
9381 -42764 -6453 -41591 -30617 -28888 -30992 -62661 -20248 -18211 -33065 -55959 -59342 -77899 -78606
9368 -78606 -22360 9667 16259 28192 35726 46708 31653 -22686 -24855 10272 -33319 -28896 -40525
9355 -40525 -8329 22217 51119 43722 4719 56730 88173 104404 -18478 -66827 -31101 -25850
9343 -25850 68133 82588 76202 66361 87621 98479 95494 72636 35800 10689 17715 -30531 -52085
9330 -52085 3138 8651 -15245 20307 42844 67281 77409 29054 42073 35276 15628 -16329
9318 -16329 325 -23017 -20653 19637 78150 114678 79151 64707 74959 13673 -6757 -2821
9306 -2821 -22915 -3683 -40725 -39450 -51349 -75870 -94413 -88108 -31475 11276 34891 2393
9294 2393 4200 6456 -2638 -8049 45037 30557 -20860 1221 412 -44176 -44217 5223 34031 45775
9280 45775 71460 37184 -14169 -91042 -93211 -73365 -86221 -59362 -73453 -111228 -124391 -87116
9268 -87116 -60505 -57046 -47597 -63186 -34393 15648 37575 48772 37776 24336 14636 -10358
9256 -10358 -67083 -41447 -26006 4570 268 -10608 -39631 -50654 -272 -656 -38049 -53988
9244 -53988 -101808 -64867 16771 24099 15194 7352 12160 -13182 6966 7212 -16359 -29008 -19280
9231 -19280 33937 8584 -47903 -35220 -5106 1745 -31057 -53815 -76868 -60373 -68583 -52507
9219 -52507 -25935 -43513 -108165 -137179 -77515 -36204 6540 39985 25341 26268 37679 12134
9207 12134 -30643 -68575 -43274 -43946 -27184 -31407 -108939 -147098 -130863 -116758 -22895 30867
9195 30867 16690 24831 30960 -5432 -24578 -10467 300 62230 86120 63383 58869 41156
9183 41156 50216 55239 7883 -72082 -53242 8170 -39080 -60201 -80506 -86002 -45818 26825
9171 26825 44169 -57288 -91789 -95374 -88450 -49006 15229 26006 79643 69457 27377 -6772
9159 -6772 -62413 -57687 -28123 -15966 9824 4449 -943 -37096 -42985 -33657 -71186 -75720 -21372
9146 -21372 9848 14142 17727 5798 -5761 53967 57596 -9605 -33318 -5440 2652 36276 -2822
9133 -2822 -7153 -27137 -54575 -8088 28331 -2649 5366 -18520 -10009 27409 44388 1110 -39433
9120 -39433 -29484 -87854 -103399 -9477 57302 92723 108160 165023 159590 89128 77345 19131
9108 19131 26367 37614 29626 17313 1800 -17689 -4774 -20505 -58532 -56466 -39931 -38302 10850
9095 10850 31629 37726 5608 17328 -12413 -82847 -132590 -113504 -86320 -155398 -161453 -138768
9083 -138768 -105154 -93939 -81200 -95972 -55377 -20750 -35312 -30398 7153 52070 54118 19849
9071 19849 1165 -10902 -1894 17689 16595 16902 -21639 -39974 -64037 -100831 -81606 -43501 -27203
9058 -27203 -7451 21109 21569 -28007 14205 41605 56531 46260 5898 39733 19196 -28312
9046 -28312 -42786 -70345 -57506 -93408 -182626 -126690 27853 7529 -37080 6383 73817 60424
9034 60424 827 -12637 7811 -26818 -29428 -62103 -81986 -3614 15444 21653 21604 58262 53073
$$ [...]
##END NTUPLES=NMR SPECTRUM
##END=
