##TITLE=Analysis number 318099
Compound Code cc 13224
Project Code adrs
Chemist Name fudan
##JCAMPDX= 6.0         $$ Bruker NMR JCAMP-DX V2.0
##DATA TYPE= NMR SPECTRUM
##DATA CLASS= NTUPLES
##ORIGIN= Bruker BioSpin GmbH
##OWNER= nmr
$$ XWIN-NMR		Version 3.5
$$ Wed Mar 15 11:29:44 2006 GMT Standard Time (UT+0h)  MAYBRIDGE\nmr@NMR_250MHZ
##.OBSERVE FREQUENCY= 250.131544655141
##.OBSERVE NUCLEUS= ^1H
##.ACQUISITION MODE= SIMULTANEOUS (DQD)
##.ACQUISITION SCHEME= undefined
##.AVERAGES= 16
##.DIGITISER RES= 18
##SPECTROMETER/DATA SYSTEM= dpx250
##.PULSE SEQUENCE= zg30
##.SOLVENT NAME= CDCl3
##.SHIFT REFERENCE= (INTERNAL, CDCl3, 0, 16.522)
##AUDIT TRAIL= $$ (NUMBER, WHEN, WHO, WHERE, WHAT)
$$ ##TITLE= Audit trail, XWIN-NMR		Version 3.5
$$ ##JCAMPDX= 5.01
$$ ##ORIGIN= Bruker BioSpin GmbH
$$ ##OWNER= nmr
$$ C:\u/data/dgb/nmr/ADRS/740/pdata/1/auditp.txt
$$ ##AUDIT TRAIL=  $$ (NUMBER, WHEN, WHO, WHERE, WHAT)
(   1,<2006-03-15 11:29:24.57 +000>,<MAYBRIDGE\nmr>,<NMR_250MHZ>,
      <created by zg, POWCHK disabled, PULCHK disabled
       configuration hash MD5:
       84 BC 41 DB A1 6E 1D 46 DA 25 12 A5 C1 ED C5 3A
       data hash MD5: 64K
       66 B1 8D 0E 2F A6 48 5E E1 C3 BF 7B BB 9D 84 0A>)
(   2,<2006-03-15 11:29:35.79 +000>,<MAYBRIDGE\nmr>,<NMR_250MHZ>,
      <Start of raw data processing
       ef LB = 0.3 FT_mod = 6 PKNL = 1 SI = 32K 
       data hash MD5: 32K
       98 31 CC 1B 93 36 E3 39 E7 0B 48 78 29 EB 13 A0>)
(   3,<2006-03-15 11:29:37.60 +000>,<MAYBRIDGE\nmr>,<NMR_250MHZ>,
      <apk 
       data hash MD5: 32K
       07 3B F7 E5 3F 17 47 A7 0C 6F E3 48 0D 88 0D 60>)
(   4,<2006-03-15 11:29:38.43 +000>,<MAYBRIDGE\nmr>,<NMR_250MHZ>,
      <abs ABSG = 5 
       data hash MD5: 32K
       D6 BD C3 D1 B6 0D 17 4B E0 51 19 F1 D0 36 94 A2>)
$$ ##END=
$$ 
$$ hash MD5
$$ 29 7E 48 6C 12 C0 AB BD 40 82 6F 64 35 1A 6C 3C
##$RELAX= 
##$RELAX= 
##$RELAX= 
##$RELAX= 
##$RELAX= 
##$RELAX= 
##$RELAX= 
$$ Bruker specific parameters
$$ --------------------------
##$DU= <C:\u>
##$EXPNO= 740
##$NAME= <ADRS>
##$PROCNO= 1
##$TYPE= <nmr>
##$USER= <dgb>
##$AMP= (0..31)
100 100 100 100 100 100 100 100 100 100 100 100 100 100 100 100 100 100 
100 100 100 100 100 100 100 100 100 100 100 100 100 100 
##$AQSEQ= 0
##$AQ_mod= 3
##$AUNM= <au_zg>
##$AUTOPOS= <19 >
##$BF1= 250.13
##$BF2= 250.13
##$BF3= 250.13
##$BF4= 250.13
##$BF5= 500.13
##$BF6= 500.13
##$BF7= 500.13
##$BF8= 500.13
##$BYTORDA= 1
##$CFDGTYP= 0
##$CFRGTYP= 5
##$CHEMSTR= <none>
##$CNST= (0..31)
1 1 145 1 1 1 1 1 1 1 1 1 1 1 1 1 1 1 1 1 1 1 1 1 1 1 1 1 1 1 1 1 
##$CPDPRG= <>
##$CPDPRG1= <>
##$CPDPRG2= <>
##$CPDPRG3= <>
##$CPDPRG4= <mlev>
##$CPDPRG5= <mlev>
##$CPDPRG6= <mlev>
##$CPDPRG7= <mlev>
##$CPDPRG8= <mlev>
##$CPDPRGB= <>
##$CPDPRGT= <>
##$D= (0..31)
0 1 0 0 0 0 0 0 0 0.06 0 0 0 0 0 0 0.0002 0 0 0 0 0 0 0 0 0 0 0 0 0 0 
0 
##$DATE= 1142422163
##$DBL= (0..7)
120 120 120 120 120 120 120 120 
##$DBP= (0..7)
150 150 150 150 150 150 150 150 
##$DBP07= 0
##$DBPNAM0= <>
##$DBPNAM1= <>
##$DBPNAM2= <>
##$DBPNAM3= <>
$$ [...]
##$SUBNAM7= <"">
##$SUBNAM8= <"">
##$SUBNAM9= <"">
##$SW= 20.6930455092707
##$SWIBOX= (0..15)
0 0 3 0 0 0 0 0 0 0 0 0 0 0 0 0 
##$SW_h= 5175.983436853
##$TD= 65536
##$TD0= 1
##$TE= 294.16
##$TE2= 300
##$TE3= 300
##$TEG= 300
##$TL= (0..7)
0 120 120 120 120 120 120 120 
##$TP= (0..7)
150 150 150 150 150 150 150 150 
##$TP07= 0
##$TPNAME0= <>
##$TPNAME1= <>
##$TPNAME2= <>
##$TPNAME3= <>
##$TPNAME4= <>
##$TPNAME5= <>
##$TPNAME6= <>
##$TPNAME7= <>
##$TPOAL= (0..7)
0.5 0.5 0.5 0.5 0.5 0.5 0.5 0.5 
##$TPOFFS= (0..7)
0 0 0 0 0 0 0 0 
##$TUNHIN= 0
##$TUNHOUT= 0
##$TUNXOUT= 0
##$USERA1= <user>
##$USERA2= <user>
##$USERA3= <user>
##$USERA4= <user>
##$USERA5= <user>
##$V9= 5
##$VALIST= <valist>
##$VCLIST= <CCCCCCCCCCCCCCC>
##$VD= 0
##$VDLIST= <DDDDDDDDDDDDDDD>
##$VPLIST= <PPPPPPPPPPPPPPP>
##$VTLIST= <TTTTTTTTTTTTTTT>
##$WBST= 1024
##$WBSW= 4
##$XGAIN= (0..3)
0 0 0 0 
##$XL= 0
##$YL= 0
##$YMAX_a= 443199
##$YMIN_a= -442077
##$ZGOPTNS= <>
##$ZL1= 120
##$ZL2= 120
##$ZL3= 120
##$ZL4= 120
##$ABSF1= 16.522
##$ABSF2= -4.171173
##$ABSG= 5
##$ABSL= 3
##$ALPHA= 0
##$AQORDER= 0
##$ASSFAC= 0
##$ASSFACI= 0
##$ASSFACX= 0
##$ASSWID= 0
##$AUNMP= <proc_1d>
##$AZFE= 0.1
##$AZFW= 0.1
##$BCFW= 0
##$BC_mod= 0
##$BYTORDP= 0
##$COROFFS= 0
##$CY= 12.5
##$DATMOD= 1
##$DC= 0
##$DFILT= <>
##$DTYPP= 0
##$F1P= 14.0000005364418
##$F2P= -0.99999901652339
##$FCOR= 0.5
##$FTSIZE= 32768
##$FT_mod= 6
##$GAMMA= 0
##$GB= 0
##$INTBC= 1
##$INTSCL= 1
##$ISEN= 128
##$LB= 0.3
##$LEV0= 0
##$LPBIN= 0
##$MAXI= 10000
##$MC2= 0
##$MEAN= 0
##$ME_mod= 0
##$MI= 0
##$NCOEF= 0
##$NC_proc= -3
##$NLEV= 6
##$NOISF1= 0
##$NOISF2= 0
##$NSP= 0
##$NTH_PI= 0
##$NZP= 0
##$OFFSET= 16.522
##$PC= 1
##$PHC0= 20.82537
##$PHC1= 1.799434
##$PH_mod= 1
##$PKNL= yes
##$PPARMOD= 0
##$PSCAL= 4
##$PSIGN= 0
##$REVERSE= no
##$SF= 250.13
##$SI= 32768
##$SIGF1= 0
##$SIGF2= 0
##$SINO= 400
##$SIOLD= 32768
##$SREGLST= <1H.CDCl3>
##$SSB= 0
##$STSI= 32768
##$STSR= 0
##$SW_p= 5175.98343685301
##$SYMM= 0
##$S_DEV= 0
##$TDeff= 65536
##$TDoff= 0
##$TI= <Analysis number 999999
Compound Code 99
Book Reference 9
Project Code 9>
##$TILT= no
##$TM1= 0
##$TM2= 0
##$TOPLEV= 0
##$USERP1= <user>
##$USERP2= <user>
##$USERP3= <user>
##$USERP4= <user>
##$USERP5= <user>
##$WDW= 1
##$XDIM= 32768
##$YMAX_p= 286231054
##$YMIN_p= -39465
$$ End of Bruker specific parameters
$$ ---------------------------------
##NTUPLES= NMR SPECTRUM
##VAR_NAME=  FREQUENCY,     SPECTRUM/REAL,   SPECTRUM/IMAG
##SYMBOL=    X,             R,               I
##VAR_TYPE=  INDEPENDENT,   DEPENDENT,       DEPENDENT
##VAR_FORM=  AFFN,          ASDF,            ASDF
##VAR_DIM=   32768,         32768,           32768
##UNITS=     HZ,            ARBITRARY UNITS, ARBITRARY UNITS
##FACTOR=    0.157963299565203, 1,           1
##FIRST=     4132.6476996994, 0,             0
##LAST=      -1043.33573715361, 0,           0
##MIN=       -1043.33573715361, -39465,      0
##MAX=       4132.6476996994, 286231054,     0
$$ Real data points
##PAGE= N=1
##DATA TABLE= (X++(R..R)), XYDATA
$$ [...]
25185 -377 -313 2371 7022 5076 87 -437 1486 6265 6620 3139 -3596 -5976 522 9116 5458 8040
25169 8040 10123 7896 6625 3161 6916 7136 1273 -3987 2971 7826 8823 10477 8526 6197 1126
25154 1126 3783 7410 7610 7092 9153 10880 8766 8787 10878 7275 1441 -6848 -3060 4387 5307 11334
25138 11334 12438 5383 389 3859 11537 15533 15596 14407 12910 14826 10741 2348 -3401 -5296 -1954
25123 -1954 -2046 -5274 -10217 -13494 -17120 -14428 -9001 -6226 -4901 -6072 -1204 2950 6335 6318 4397 1019
25107 1019 -484 439 -249 786 918 -1576 421 3868 4534 9449 11666 9604 3455 -491 2951 4818
25091 4818 1951 1307 267 -2527 108 5138 8066 9416 8988 10658 6807 1060 -1422 36 4041
25076 4041 5361 1929 -2290 -2603 -1071 -2918 -3398 727 8838 11155 9095 2091 -6689 -4931 590
25061 590 1727 2152 7775 5348 144 -16 2674 -706 -2828 -3732 -3710 -3261 -3733 -3213 -2986 -5486 1273
25044 1273 4344 2383 1713 5756 5759 1915 -334 -2317 -1075 -2751 -5787 -9400 -9353 -5317 1660 1771
25028 1771 -4780 -6898 -7521 -5913 -5069 -4323 -4459 6 2934 4936 8862 10446 7655 6782 4307 1082
25012 1082 1149 473 420 957 1236 289 450 -2411 -449 1061 4883 1915 -1376 -119 -1799 975 1721
24995 1721 1861 3201 1951 3307 4741 8405 10580 10581 12752 16675 11257 3714 -13 2066 7650 8971
24979 8971 8705 6349 1556 194 3268 8835 8699 5306 -507 807 7254 6100 3290 1452 -1393
24964 -1393 -2964 2360 6770 4858 2737 1762 -378 259 2787 4586 3954 2140 -44 -2167 -1778 227
24948 227 -2709 -3979 -1076 -434 168 2493 1315 -1143 -2155 -3228 -3286 -961 6759 12480 6348 6559
24932 6559 5333 5917 4686 2913 2958 1039 -2114 917 3338 2130 427 -713 -6397 -3174 -882
24917 -882 490 -1436 -6097 -8816 -5793 -4914 -6054 -4914 -1835 -3800 -1778 -2687 -5125 -881 2452
24902 2452 3136 4288 4724 4900 6237 3175 -231 716 -27 3937 10496 12753 11094 6865 2138 2423
24886 2423 2022 5175 6874 12688 9591 4228 3662 3579 445 -4046 -3477 -2013 -3500 544 1568 -524
24870 -524 1741 306 -3538 -3102 1319 1591 2091 1603 4741 6455 82 -1589 3058 8979 9034 1611
24854 1611 38 1730 410 1098 1824 2775 197 -2382 -1582 -620 -765 1397 3044 3089 4238 8549 5907
24837 5907 7853 6315 5243 7017 2430 1386 2358 422 36 -1317 -3267 -5394 -7629 -1455 -59
24822 -59 -2029 -6484 -7900 -9745 -10754 -8118 -6849 -8015 -4733 -2528 -3972 -2824 -724 -419 -2905
24807 -2905 -2405 -2976 -1384 1281 2574 -1270 -3603 -2298 635 357 -1186 2765 4114 7724 8050 5119
24791 5119 4447 5770 2325 152 1191 4653 4189 -1290 -2439 2661 2613 -1063 -4370 -6804 -1398 1449
24775 1449 1353 4560 4928 5044 5619 6929 10395 10776 3875 -1391 -5139 -7859 -2839 -330 5505 7685
24759 7685 1092 -2116 436 6807 5917 5102 5967 6110 3082 624 2326 4994 2016 1520 4830 6650
24743 6650 6275 4337 6380 11166 7622 -2571 -1722 -4012 -9062 -5924 -2403 -1471 6038 5781 2450
24728 2450 1268 2866 6256 6079 2773 1918 3106 -153 -5412 -8826 -206 3370 -3018 -1876 4085
24713 4085 2388 7342 2798 1890 7414 9165 5922 6964 9607 5179 1865 1382 1736 3337 1880
24698 1880 3319 6582 9589 5708 5370 3476 -2815 73 715 3598 6888 11142 5117 18 -5063
24683 -5063 -5307 -2598 -4386 -10333 -8259 -3682 -3619 -5986 -8960 -9426 -7871 -4634 -3242 -3772 -1903 1216
24667 1216 6188 7761 4840 -47 -6063 -4281 -2697 -2083 -664 -3974 -2733 -4189 -4732 -2674 1148
24652 1148 4455 6013 2590 -2662 -1606 -4560 -5807 -2340 3737 6929 3232 4865 7087 3197 -1972
24637 -1972 -4556 -5902 -11796 -9147 -6223 -2132 3084 7555 6798 2628 993 1556 3890 4647 464
24622 464 1145 3994 6245 4105 2001 3658 3784 9663 6916 4333 1307 -2169 -2294 3092 7741 11848
24606 11848 10641 10470 12257 12670 9359 5957 4132 7638 7734 2450 -1477 490 -44 -3677 -380 -2529
24590 -2529 -6203 -6093 -5974 47 -418 2702 -33 -5434 -248 607 -846 -1743 -4314 -5182 -6300 -5918
24574 -5918 -1463 2733 6176 5910 1458 1404 3884 4789 6572 1296 -1312 -1454 -713 -332 -279 -367 -621 2651
24556 2651 632 3984 9744 2942 -6472 -7658 -3580 -1085 -5094 -5221 -3972 -6799 -8539 -2635 4673
24541 4673 8535 5392 2183 -3173 -3474 -4110 -6244 -2120 254 -2623 -536 -784 470 711 -2848 -522
24525 -522 -54 -707 -2048 1126 2756 3294 4560 7554 4192 2289 -112 -6730 -7562 -8504 -5848 909
24509 909 7699 10993 6285 -12 -8064 -10931 -10864 -9802 -7608 -5703 -4869 -5775 -8385 -6482 -5544 -3393
24493 -3393 -2799 -3769 -1616 1094 450 408 4654 8328 5715 129 -3215 -4800 -4075 -3645 -6031 -1999
24477 -1999 3187 6710 5327 2544 -1421 -1977 -1270 -2963 -2539 -2607 4566 7432 3105 1453 1183 3554
24461 3554 2661 7498 6764 2788 5904 6566 4277 3182 1826 -1110 -3931 -4609 -2116 -3170 -4973 -8026
24445 -8026 -7254 1608 6417 7766 2448 1153 4026 9699 10918 7891 4362 3841 -656 -438 178 -3551
24429 -3551 -1901 2359 7779 5263 1497 -714 3242 7246 6742 3885 1980 281 1830 3544 3770
24414 3770 5397 6051 2565 4028 1191 1526 2114 -2254 -1549 6570 5914 786 -818 752 3778 4692
24398 4692 46 -1661 -2307 4150 11026 13672 13490 7839 -382 -3271 -581 3586 817 1209 -2214
24383 -2214 -5926 -5209 3246 9369 5502 2681 -253 6171 7564 6726 2387 421 1868 -1596 121
24368 121 818 1798 1559 8344 4864 -1549 -1280 4227 4597 72 558 5247 2252 208 -1054 785
24352 785 4346 5116 5651 2651 -1492 -4654 -3991 -5979 -5556 9 3070 6241 8292 4218 -62 3598
24336 3598 1250 2088 2193 96 -3276 -778 2161 7458 5472 3270 -2144 -1925 -1818 -3909 -888 -409
24320 -409 3215 4740 6009 4338 3917 1752 1166 -2489 1032 -645 -3139 -574 -2099 -5443 -750
24305 -750 2115 4345 503 -923 301 3578 2008 165 1422 -370 -2710 -3377 -1408 -288 -2413
24290 -2413 -1981 644 2360 -1085 -1807 -3955 -3705 3199 4697 4891 3454 3363 580 469 -673 -1605 -1952
24273 -1952 -8008 -8966 -8416 -8364 -5369 -4105 -389 5046 9418 9704 12700 8212 1813 2638 7112 9565
24257 9565 7856 4841 -1334 -9224 -6709 -3278 -1888 -413 -1793 -1318 2156 1517 3146 881 2143
24242 2143 4673 1919 -5309 -7113 1096 2261 1745 -1136 -1763 427 -1917 -1611 -4127 1127 6645
24227 6645 4760 2035 1593 2881 3280 -59 -6207 -8294 -4625 1136 4556 2971 263 -5055 -5284
24212 -5284 -5120 -5909 -6495 -3193 690 4981 8898 4143 -473 1455 2753 3159 -1231 -5347 -11149 -10981
24196 -10981 -8468 -2255 3007 6891 3432 -3513 -4969 -10143 -7512 -6845 -6888 -3464 -2468 -2620 305 238
24180 238 -99 3831 2967 -1795 -3197 -6734 -7267 -9149 -9250 -3452 -1249 1944 429 -635 2580 4239
24164 4239 6950 12276 9634 3484 2761 2743 1500 165 -212 -4629 -749 1689 525 3596 4526 1230
24148 1230 -804 -1648 414 1507 3424 5455 7704 2861 445 5098 7270 6515 -2965 -4302 -1789
24133 -1789 2675 4614 7451 5588 4320 5703 5032 8804 7663 5393 8221 8509 7034 7503 9585
24118 9585 10180 11881 11522 3729 -309 -1242 -226 1337 660 192 1535 3016 5592 3983 2392 -1095
24102 -1095 -6620 -3913 2426 4849 692 -536 -121 537 2401 5656 3051 863 -1578 -2365 -3012 5391
24086 5391 1187 -10050 -7902 -3804 -3860 -4461 -2612 -3269 -8439 -7768 -4108 -6412 -12432 -8958 -2980 -3114
24070 -3114 -1989 -4728 -8308 -11677 -12873 -7659 -7119 -7922 -5989 -5676 -5581 -5385 -2692 1981 1535 2229 3441
24053 3441 3401 3064 5158 9157 6607 6247 3929 -3119 -8466 -2616 906 -432 -2282 -2542 -4434 -8143
24037 -8143 -7747 -11038 -14557 -16465 -13216 -7213 -5885 -4204 1243 2181 1101 -3229 -3961 -6064 -5733 -3752
24021 -3752 1724 4843 1204 2696 1215 -1798 -3227 743 763 1825 -1023 -2093 -1445 -679 422 2370
24005 2370 3777 6653 7244 7781 7298 -1578 -6470 -4720 290 6606 8444 7379 4462 2289 -2475
23990 -2475 -4746 -1168 215 -1749 -448 1163 4089 10823 8077 6722 14075 8314 4246 3683 6276
23975 6276 2169 1225 3163 1383 -104 2840 5369 4647 53 -3310 -2110 -1260 4562 6127 6152 6704
23959 6704 8156 6555 5777 -1123 -6356 -9377 -6992 -1696 365 351 2828 5112 1427 -5018 -7977
23944 -7977 -8926 -4641 -5085 -4655 -5340 -7988 -8135 -6609 -7001 -6518 -6235 -6185 -1541 2 -1608 -4601 -3080
23927 -3080 85 2539 496 -492 5205 8728 1682 -2486 -4068 -5503 -6180 3246 5763 7346 9341
23912 9341 7148 1225 2586 1200 2827 3339 2866 10452 5186 139 -1304 699 3383 3702 4451 -1590
23896 -1590 -5823 -6143 -7096 -3143 696 1876 1210 4711 6435 5711 5681 4449 3418 10473 6153 1611
23880 1611 1350 -4804 -9123 -5805 1302 5649 11950 12553 8135 2061 -6045 -4771 -1776 89 -1492
23865 -1492 2799 4688 5258 8648 11840 8026 4437 -22 -972 -153 7915 12820 9864 2553 -1453
23850 -1453 826 4695 2118 5079 6068 3501 -824 -1266 4965 6813 176 2032 1198 -2363 -3958
23835 -3958 -6915 -8606 -7305 -8550 -7854 -5791 -1451 2653 3817 1502 -2263 -2807 -1483 193 -1775
23820 -1775 -2023 5367 9309 7275 1228 445 2261 5313 7266 5564 1380 -766 6525 2355 -1895
23805 -1895 1612 2170 2364 1027 -948 -3492 -1017 511 -3507 -3770 -2415 444 -611 -981 1285 996
23789 996 4857 5236 3443 3357 2223 -342 -1123 -531 3385 6419 3989 -430 1846 560 221 8032
23773 8032 9029 6755 6854 6080 5132 3914 5739 4519 2045 811 1891 3370 2425 916 790 -1535
23757 -1535 -5047 -4629 912 3189 2942 3060 1476 -1403 -5980 -2089 -1734 729 1256 -5501 413 5527
23741 5527 2343 -2987 -8078 -5849 402 4144 2959 -3296 -4610 -3320 -1340 904 440 -473 438
23726 438 -1280 4355 5246 1009 1094 -3086 -8426 -6129 -1983 -1253 -2214 3728 2851 2851 4530 6252 8981
23709 8981 8437 3804 5006 3507 -1189 -2902 -2792 -3436 -997 -1859 -4580 -4821 447 2325 1101 -1003
23693 -1003 2531 11110 9392 5068 2831 3528 2709 5666 2950 -5480 -4054 -1179 974 5949 3946
23678 3946 -179 -3685 -2905 -5659 -3863 -5013 -1249 -1754 -439 -37 -468 1021 -1538 -907 -440 -216
23662 -216 1156 1533 -3274 -3902 191 2890 -4301 -11001 -10927 -8002 -3309 -283 -5020 -2038 1169 -1807
23646 -1807 2046 2995 1178 993 2337 412 -3780 -4182 -1109 4574 7217 3980 -2173 1011 114 668
23630 668 4120 8032 5685 -2201 -4671 27 3594 169 -3987 -5012 -6378 -6823 -3568 752 465
23615 465 -1553 -3519 -4244 -3571 773 -3317 -2791 2823 5892 7462 3122 2480 400 -2053 -3529 2775
23599 2775 2130 -2177 -4305 -3416 -95 3780 5680 6385 1495 -2050 -5057 -6572 -9474 -11892 -5290
23584 -5290 -1476 -1686 730 3829 5551 5220 8109 4764 -2122 -4319 -3827 -1976 944 2535 -4837
23569 -4837 -8350 -7758 -7712 -2983 -1374 -4540 -5069 -8425 -8218 -5377 -4162 -2893 -3310 -3773 -1511 850
23553 850 4479 1523 -5302 -5752 -4276 -4220 -3095 -4576 -371 5879 4222 910 -977 -628 4218 7505
23537 7505 8012 7984 5663 7917 5665 -583 -397 -1969 -1738 -2869 -4410 -6496 -5976 -2601 -4836 -4540
23521 -4540 -4884 982 1595 3796 4325 961 -886 -3337 -3254 -4594 -5793 -6199 -4272 365 1002 1802 3539
23504 3539 3105 -1338 -1789 -2662 -3304 -114 2578 6738 6279 -2769 -6138 -300 6877 4804 -3355 -5921
23488 -5921 -4460 -5116 -5711 -4865 -581 3670 9243 9147 7888 9603 8312 -2014 -6089 673 395 -3885
23472 -3885 -3648 -3822 -9217 -5536 -1170 886 1175 1615 5482 763 -4155 -2069 -3876 -5905 -8004 -10483
23456 -10483 -9519 -5165 940 1767 384 4648 4521 106 2021 -388 793 5501 1914 1023 -6465
23441 -6465 -4377 1379 6299 11225 10328 -1717 -6218 -6605 -3022 -5704 -4908 -1002 -646 -4125 -1489
23426 -1489 2071 3072 6280 6954 7378 5682 4697 1323 -2500 -2902 205 5360 8946 11568 12295 10638
23410 10638 9757 8941 8613 10263 4353 -2410 -3452 -1262 1545 1558 2255 319 -1025 -2336 -4016 -5349
23394 -5349 -3820 -2687 -3232 -3947 -5448 -10004 -8751 -1478 6229 10897 10345 3952 1907 -2465 -5148
23379 -5148 408 4145 8578 3184 -3250 -2873 1182 3281 2911 2724 -445 1186 5784 2324 6174
23364 6174 12248 11353 5362 -789 -1555 100 2474 4763 6251 2540 2598 7583 6879 4173 1266 3877
23348 3877 2977 1907 3711 1465 534 2906 3749 322 -186 1219 2999 3621 6298 5845 6541 9244
23332 9244 12322 14371 10505 8244 1560 -362 -1550 -3108 -4554 -7864 -6377 -2781 307 3363 2038
23317 2038 -2132 -2835 -1979 -5314 -10540 -9834 -6084 -6876 -7397 -6367 -5286 -1761 -1128 -248 12 -885 -2348
23300 -2348 -4152 -3772 2130 6209 5389 5015 6088 4997 5616 5418 3996 243 -4942 -10358 -9076 -8444
23284 -8444 -5737 -45 2742 1709 -3470 -3945 -3047 -1571 -4149 -4235 -3753 490 -2791 -6136 -51 975
23268 975 -3318 -4905 -8122 -10534 -12168 -9992 -11137 -11823 -7730 3081 5243 -588 571 1654 3178
23253 3178 2235 4639 3479 -2587 -2697 -6095 -9207 -5726 -1741 867 -128 2549 -1321 -5914 -8385
23238 -8385 -11580 -12895 -8262 -2538 -1288 132 -750 -3118 -4518 -2353 -3335 -6027 -3911 -3355 -1716
23223 -1716 3133 4167 4278 2515 2267 -639 -6700 -2063 5929 2302 -2521 2204 2763 -14 2217
23208 2217 -1232 -1271 -6986 -5996 -4210 3336 8491 3117 -109 -3763 -5128 -4406 -4470 -1348 514 3583
23192 3583 926 -3858 -5114 -2013 1608 3116 -1851 -1167 664 5323 6971 5347 4623 2752 4963
23177 4963 3659 1667 4321 5710 2125 3138 4335 2568 274 -3079 1132 1557 5829 6201 5749
23162 5749 7447 7929 8650 9739 12389 10408 6929 4513 4517 -340 -3029 2940 2576 3577 3331 -1136
23146 -1136 -6845 -5598 -4201 3449 3553 1882 1788 920 2996 4554 2460 3010 3398 2787 5425 720
23130 720 -4043 -5171 -8646 -5711 -3797 -3709 -6822 -7576 -1375 4219 2382 -771 -3891 -4556 -749 -1446
23114 -1446 -1039 -3379 -4983 -8887 -12406 -9220 -4829 -4150 -993 5826 8912 8306 5611 -1743 -2520 -520
23098 -520 234 1717 952 2236 -3782 -8411 -7118 -2794 415 -1131 -895 400 -6484 -4137 -3888 498
23082 498 4898 7349 6347 7504 8214 10656 10086 4813 -1052 -5151 -2376 814 1886 -433 68 1399
23066 1399 2968 5846 7560 5359 4051 138 -1594 -454 492 882 -246 -104 -3687 2642 5360
23051 5360 1129 -417 -1315 -1094 -2527 -2993 852 -267 -868 -3521 -1663 -608 -258 5989 11361 8280
23035 8280 4546 6461 2799 -3614 -3229 -4828 -5511 -5568 -3123 1261 3822 2518 3173 561 -684 781
23019 781 887 1999 -832 -6873 -3121 2682 2376 1533 1535 2365 848 1035 1043 -2324 -2591 -6124 -9342 -12369
23001 -12369 -13319 -9408 -3221 -1515 1570 2617 -159 -1146 -1644 3181 1107 -4288 -7310 -6248 -2004
22986 -2004 -1749 -4005 -3400 -1520 -3948 -8464 -6388 -2305 -2582 -736 -2519 -3027 -1091 -1828 -618 -4230
22970 -4230 -4414 -961 3534 6243 4576 3689 1275 3722 3766 3633 6759 9184 4829 -1770 -4401 -1688
22954 -1688 1375 5948 8705 2331 4844 5736 3136 -4974 -6147 -1632 1808 6915 4748 -1854 -1315
22939 -1315 -10702 -12118 -4463 -274 1813 1821 1066 1446 278 -1282 -724 3651 1783 2167 -409 -1917
22923 -1917 -2187 718 2773 7677 10549 7147 1134 554 -4134 -5869 -7604 -6297 -3681 -3173 -2806 -3618
22907 -3618 -2300 -2518 1261 526 -4667 -3290 -410 -2093 -5504 -1825 3011 6580 6376 838 -4008
22892 -4008 -4242 -2947 -3224 -3162 -4666 788 6746 10300 7757 4771 1212 -3274 -10129 -11036 -10848 -8769
22876 -8769 -6906 -2522 1291 1714 -1961 -5621 -6658 -7593 -5529 2703 2868 1295 -3315 -6061 -5362 -2642
22860 -2642 496 3116 2470 -6362 -14425 -16941 -12237 -7149 -3117 -1209 -1240 -1144 529 1845 3368 5072
22844 5072 6315 4799 4560 1520 1268 -25 -2794 -6007 -3878 -1266 -3243 -4360 -5995 -8673 -10195
22829 -10195 -13146 -12039 -8142 -9854 -9159 -10701 -9460 -9907 -7018 -8683 -7635 -3458 -1311 -3353 -1915
22814 -1915 1423 4533 -1089 -9357 -7505 -3392 -3040 -4513 -4121 -9218 -9883 -8072 -5633 -7564 -5911
22799 -5911 -4587 -4209 2594 1197 -6565 -4401 -6675 -8767 -9275 -10943 -9541 -3398 2087 -1322 -5403
22784 -5403 -4547 -3319 -1681 1670 5532 8877 7275 3073 1473 4268 3600 -2137 -8854 -12020 -9642
22769 -9642 -9860 -6261 -6573 -6077 -4258 -3446 -1343 1322 5343 550 -2970 -1782 2718 3135 -150 2724
22753 2724 1986 2175 1044 -464 -586 1453 10496 10239 -1344 -6518 -3762 542 -1563 -139 910
22738 910 6114 8608 4258 2984 -676 -649 -103 432 4356 -528 -7366 -8781 -4983 -2047 2631 3915
22722 3915 763 -934 -5264 -4664 -2845 5971 10677 11735 7244 4312 6307 3894 -3577 -1774 -4021
22707 -4021 -4143 -1524 -174 1344 -576 -1391 -4499 1456 1550 1445 -1292 -2119 -134 -3146 -2450 3213
22691 3213 7153 5847 623 -3240 -651 -429 1324 2347 -3685 -9497 -5254 -2626 -417 -3744 -1406
22676 -1406 2311 4840 1725 3209 4702 2790 4953 2900 234 -2608 -5243 -4174 -6384 -8133 -9365
22661 -9365 -6689 -3254 -1790 -5243 -6583 -3030 -2949 -2390 -1169 -1556 -541 1821 -584 263 -1503 -4612
22645 -4612 -1780 1056 2451 -1171 -4332 -1479 676 2163 4383 6763 4091 -1854 -922 2705 -1122
22630 -1122 -4201 -4003 -5686 -4479 -5025 -9586 -13745 -12872 -5515 -7575 -10417 -4853 -4513 -2236 -2224 -1452
22614 -1452 3764 4278 3759 2155 1497 -3449 -3623 -4111 2039 1838 171 -389 370 -1094 -5403 -7609 -4058
22597 -4058 -197 539 576 1934 -481 930 1228 -7859 -8079 -8797 -11821 -9888 -4034 -2404 -3971 -1618
22581 -1618 180 -3209 -5356 -595 1653 951 256 -1751 1996 3523 -289 1368 -1843 -6525 -12088
22566 -12088 -12911 -714 3620 -35 -1978 16 712 3132 3973 3176 6722 5512 -98 -8373 -9386
22551 -9386 -2938 -4871 -3516 -3717 -2554 2354 1792 -488 153 -1192 -4576 -7706 -3464 435 261 -1672
22535 -1672 -4492 -5662 -5947 -7448 -7891 -6156 -6268 -10453 -5327 -2013 -781 -294 -624 1754 373 -3280
22519 -3280 -6872 -6687 -3248 1320 3768 4329 -1990 -9209 -11193 -7224 -3324 -5075 -7183 -4668 -3440
22504 -3440 -325 -1418 83 1895 6600 5710 3888 8809 13689 11233 7131 2543 2739 6234 6345
22489 6345 887 -592 -1469 -2740 -6706 -8079 -1519 2347 -1568 -6179 -908 -2975 -6716 -7620 -7984
22474 -7984 -3901 2204 1697 177 -1366 -395 1646 1446 -673 -1754 -4999 -805 5090 6911 7341 3504
22458 3504 2292 1156 5376 5023 969 -2777 -5135 -3394 -4783 -11295 -7893 -3044 -2163 -585 -3152
22443 -3152 -5408 -5644 -2552 -281 373 -2944 -2426 -3852 -6764 -6543 -4359 869 2855 2558 1771 1754 2396
22426 2396 5979 10608 10263 5862 2778 1607 7235 9288 5281 2405 2176 812 -3474 -2170 3499
22411 3499 4524 2104 2451 -355 -4514 -4170 -3645 2727 2257 -1709 -2935 -3842 -3886 -3695 -3689 1950 4057
22394 4057 1892 2153 6031 10752 7014 -156 2586 2336 -123 -1047 -1504 -2067 -1237 -4176 -3036 -4647
22378 -4647 -9408 -9138 -3745 -899 -1046 55 -2208 -5013 -5019 -4534 -9317 -4120 -2305 -8963 -12262 -14550
22362 -14550 -9191 -3518 2060 2917 1976 -4322 -6705 -3251 -3210 -6276 -580 5853 5907 6483 5673 2744
22346 2744 -215 -2856 -448 -257 -125 -3473 -6406 -4289 -1621 -4744 -7446 -4245 -2302 -1335 -4671
22331 -4671 -1198 2851 -242 -1409 -1119 -2540 -671 37 5266 5892 2273 3547 5916 6128 3541 4255
22315 4255 4883 2924 3288 2472 6473 7564 3686 -179 -4193 -6749 -7562 -2807 -1688 -3491 -1091 -613
22299 -613 1885 4048 9239 11567 13355 14050 14597 13341 7274 1235 -424 -6468 -7909 -6152 -3498
22284 -3498 951 780 1600 541 -4375 -9640 -9079 -3567 -3580 -3098 723 3676 5608 10500 7364 6335
22268 6335 5439 5316 4058 3596 5936 4759 3351 5954 10147 7011 614 694 -7 216 4092 6691
22252 6691 6252 -2751 -1575 1000 3194 2849 1190 21 2075 878 3681 4793 1185 -37 -1220
22237 -1220 -2347 -1796 -3388 -3653 3022 8284 9276 6249 4473 123 -5267 1771 -890 -2780 -1984 -5576
22221 -5576 -2151 -741 2576 1947 109 2727 4807 1998 -1409 -3112 -866 4025 9647 20679 32796
22206 32796 58446 98251 140046 171757 192084 201022 181949 148375 112043 79916 53343 34002
22194 34002 26387 20219 12618 5238 1820 4955 3271 4393 3635 3870 2332 3232 8524 11561 3805
22179 3805 569 3415 2723 2386 2796 1345 4249 4601 5912 5008 6207 8298 7353 5795 7901 7412
22163 7412 6182 6275 4096 -1433 -2273 -1542 -1051 2371 -1179 -5967 -4718 -5216 -7036 -1313 33 1511
22147 1511 -1243 -3641 5363 9086 6487 5338 4933 4987 7346 3048 1323 1570 -482 619 -1061 -6684
22131 -6684 -8363 -11766 -12466 -6162 -963 -5282 -6005 -3978 -225 327 -2153 -3503 414 -4190 -190
22116 -190 3894 3695 5848 10639 10120 10270 6273 1254 -5448 -7850 -4217 -1833 -705 -2645 -5196 -6583
22100 -6583 -9871 -10993 -14021 -15718 -14308 -12071 -7426 -6051 -7796 -3225 4704 2392 -393 1068 3488
22085 3488 1016 -2557 -2298 -44 -157 -3218 -6684 -6131 -2595 -2284 -1889 -415 792 4083 513 -1791
22069 -1791 1121 4650 5152 -1307 -1950 1057 1082 2267 1787 -2230 -4393 -1590 2647 -922 -1077 393
22053 393 -1064 -3251 -6979 -4624 -46 -3151 -5532 -4663 -6314 -2062 -810 278 -35 2 -150 6815
22037 6815 13949 12087 6757 -507 -9219 -9360 -7914 -7669 -7453 -1520 5812 7034 4729 3982 -33 -6712
22021 -6712 -6940 -7443 -3126 3099 3239 2360 1334 -2163 -449 1553 243 -2462 -2170 183 1498 3952
22005 3952 766 1310 6694 5750 947 334 603 1859 1101 -762 4146 6181 6111 2440 -1210 -6738
21989 -6738 -2654 -718 1732 -1046 2718 4008 -669 2574 3349 1945 -2746 -6862 -10522 -8037 -2530
21974 -2530 -1161 -6428 -12862 -15657 -11309 -5983 -7234 -7154 -6296 -5309 -6339 -9645 -5810 3288 9326 11604
21958 11604 8672 2480 -5804 -10668 -9432 -3251 4832 5769 3639 212 -4875 -4899 -6049 -4570 1021
21943 1021 5450 1447 -4103 -9285 -11202 -9696 -6469 -4083 -4382 -5812 512 3369 2528 2911 6
21928 6 2167 3691 3252 4578 944 -4242 -7544 -6052 -8630 -10261 -5085 -1479 -2423 -662 -1518 1998
21912 1998 -2531 -5089 -4628 -8927 -9464 -7243 -5074 -6686 -6066 -2069 -5753 -11424 -11146 -8874 -1319 7093
21896 7093 7455 9281 6002 1102 -6174 -9334 -2307 1870 5324 7225 3870 -135 -3414 -5648 -5242
21881 -5242 266 5375 3146 -456 -3410 -8701 -8010 -3184 -859 3905 764 -5511 -10516 -11104 -8201
21866 -8201 -2875 -4883 -2844 -3414 -6075 -1040 3932 1556 -149 649 -3241 -6591 -5717 -8024 -4840
21851 -4840 -1396 -4207 -5870 -4515 -4049 -6307 -10813 -9170 -5631 -7438 -9322 -5507 -4065 -3137 -5746
21836 -5746 -5105 -1509 -1994 -1916 -1543 -1847 -2201 -1286 1840 2639 2355 -6696 -9790 -4600 -1471 2964 3072
21819 3072 468 -3069 -453 2224 5686 5342 782 -6136 -8906 -8051 -3433 -728 193 -86 -957 -2363
21803 -2363 -4505 -5270 -4961 3669 6655 5970 6864 2345 -1400 -4756 -4664 -5238 -4471 -5413 -7452 -11510 -5158
21786 -5158 -2329 -3418 -4185 -4646 -7564 -10683 -11321 -7969 -9198 -10141 -8700 -2773 -2843 446 -483 -1794
21770 -1794 -731 -460 26 -7015 -3841 669 2926 2934 3366 1597 178 -6837 -12962 -7947 -7917 -9360 -9014
21753 -9014 -5026 -2733 1804 1531 -5534 -5784 -4259 -1831 -2480 -4447 -6586 -4683 -994 -2004 3715
21738 3715 3082 -3556 -6164 -2270 1319 1281 1556 -949 -3068 -7237 -11741 -11542 -5601 -4616 1137 -1102
21722 -1102 -5798 -4373 -2802 -2308 -3755 -7864 -8844 -6832 -8531 -4952 -3098 -6959 -9699 -9606 -7132 -5888
21706 -5888 -2004 3988 3268 2293 -702 -47 -1732 -1283 6391 12613 9677 4395 5369 4637 3778 1658
21690 1658 -771 -7576 -10274 -9527 -3454 -1419 -3401 -4950 -6243 -4767 -1252 347 1780 3519 3073
21675 3073 2783 3216 822 543 110 -5769 -7432 -7370 -5899 -6714 -7346 -7160 -5478 -3622 -6187 -7865 -10168
21658 -10168 -10602 -11431 -12403 -12027 -6044 -5174 -5555 -5677 -6834 -4726 -5944 -7140 -4695 -2285 -1406 761
21642 761 2009 2192 -565 -2863 -5390 -5075 -3713 -3370 -7330 -13356 -11240 -9462 -10404 -7867 -6292 -8603
21626 -8603 -9934 -13376 -15033 -14264 -10564 -8834 -10610 -15238 -12944 -11662 -10350 -10719 -7110 -10986 -15453
21611 -15453 -12340 -8609 -13622 -14096 -12297 -8845 -9058 -5318 -8028 -8529 -3468 -7007 -8453 -11320 -10003
21596 -10003 -7148 -6716 -5139 -4099 -1896 -5378 -9308 -12078 -7479 -683 1489 7040 14276 16339 11515
21581 11515 5924 1572 849 -3382 -5745 1689 10116 10445 6035 5294 3489 4234 2694 3867 4834 6430
21565 6430 5479 4619 342 14 6146 5103 210 -866 -1928 -5788 -5960 -2625 -5711 -6298 -4867 -1914
21549 -1914 -5052 -8408 -10735 -7782 -3378 -3624 -7994 -9687 -10416 -11145 -17215 -19409 -13731 -10594 -8978
21534 -8978 -9246 -14947 -12848 -8475 -8972 -7365 -5328 -5708 -4939 -2742 277 4662 1517 -685 343 1780
21518 1780 3542 740 -3822 -9288 -9926 -9574 -7738 -6155 -7831 -10261 -7812 -8131 -10977 -13730 -14915
21503 -14915 -12672 -10046 -10931 -8077 -7862 -2442 1118 -2315 -12862 -13627 -5927 288 891 530 3596
21488 3596 8510 10639 7696 1011 -3253 -10652 -12968 -7871 -4240 2545 14383 29937 29766 15502
21474 15502 -223 -10517 -10735 -14091 -1632 25963 44029 46156 33237 12971 -2752 -11407 -18367
21461 -18367 -14897 -2293 7020 11414 8766 2366 -2347 -6918 -8776 -12412 -14903 -15695 -11993 -5277
21447 -5277 -6560 -9214 -11809 -12027 -10132 -8475 -8545 -8662 -9914 -12785 -11809 -8428 -9209 -13361 -12319 -6404
21431 -6404 -8211 -9367 -6334 -3479 -7336 -9828 -12658 -12934 -11305 -5078 -2429 -4469 -4311 1187 -6950
21416 -6950 -14012 -8810 -6399 -7531 -6393 4035 9120 6263 4134 8 -9061 -12151 -10812 -2123
21402 -2123 1826 -3441 -5962 -4455 -451 -3564 -4003 -6569 -6517 -2337 -1384 3778 5958 -3539 -8330 -2043
21386 -2043 -3939 -2190 2865 5374 5378 -1648 -3213 -2926 -4846 2872 3444 -4686 -5908 -2318 -3358 -3050
21370 -3050 1392 736 878 5828 12372 8364 -755 -8830 -7394 -5329 -7954 -9494 549 7266 5789
21355 5789 3963 5539 3277 -2934 -9196 -13852 -9396 -5353 -3531 -1276 -1831 -4991 -10689 -15397 -10674
21340 -10674 -10414 -11733 -12697 -10416 -5811 -8396 -6772 -130 298 2050 4254 3748 2205 3481 1246
21325 1246 -2066 -270 -4626 -4465 1582 3790 942 -3389 -7916 -9008 -8377 -4890 -3050 -7069 -4189
21310 -4189 -2844 -218 -3439 -11886 -11517 -5095 -6059 -1513 -1574 -5973 -10407 -7927 -8596 -5174 -1491 -1184
21294 -1184 -3137 -3529 -3755 -1173 2845 1115 600 1619 1091 3234 1034 -393 -1910 -8995 -11677 -10146
21278 -10146 -8836 -12419 -12029 -8222 -5323 -3745 -831 -1396 -366 -8911 -14445 -12108 -5595 -3276 -157
21263 -157 -2997 -4337 -5627 -6536 -6499 -4240 -1205 -3225 -4082 -4865 -4039 -4072 -5560 -5104 -4785 -9196 -8330 -7672
21245 -7672 -13054 -16609 -11366 -8502 -6179 -10487 -10180 -9435 -1909 -126 -639 -4166 -2858 -2820 -5033 -8379
21229 -8379 -6565 -7018 -6615 -1667 2797 -2840 -4383 -4501 -4048 -6597 -8229 -8550 -4429 4186 4076 -90
21213 -90 -3133 -653 -4384 -8300 -10249 -14503 -17023 -11835 -10451 -13741 -13677 -10993 -8823 -8347 -5920 -6242
21197 -6242 -7677 -7378 -7087 -6541 -3241 -1872 -2771 -4586 -8706 -8696 -4574 -4777 -7339 -8263 -4157 -2115 2514
21180 2514 4669 463 -2863 -4518 -2028 -901 2281 -823 -5024 -8943 -5097 -3884 -2514 -1642 -909
21165 -909 -1445 -3953 -3941 -7636 -2115 1586 3485 2115 -2650 -4079 3142 7515 5586 5605 2506 194
21149 194 -1427 -5203 -5319 -4959 -3846 -274 2126 3082 2784 -971 -6442 -8629 -11050 -6749 -4811 -11011
21133 -11011 -12483 -9983 -5064 -108 -4280 -7435 -7912 -2295 -1654 -718 -2778 -3175 994 167 -261 -349
21117 -349 -3241 -194 -346 -2459 -3302 -4231 -94 4584 4667 2641 5631 6854 6116 2709 1576 6120
21101 6120 3226 -2926 -7673 -10291 -10148 -3880 3554 3535 916 3742 3913 7743 7029 4116 7102 9796
21085 9796 6755 5910 9698 10047 5904 2045 -5329 -9194 -13006 -11130 -7699 -7800 -9055 -8260 -4910 -2201
21069 -2201 38 -3882 -4679 -993 3635 5234 4090 2450 6967 8345 4511 -625 -3934 -3392 -2499
21054 -2499 -1424 -1567 818 985 -134 2218 3910 4342 1490 -1501 -4563 -6205 -3402 4696 3201
21039 3201 6535 4525 3311 3804 1186 -1723 -1759 -1799 -2514 1442 4135 306 -399 -216 -912 -3358 -3522
21022 -3522 -5011 -5426 -5447 -5649 -5121 -5026 -8600 -10980 -9565 -4348 -3210 -4357 -2651 -1336 -2456 -4400
21006 -4400 1473 3053 3460 5579 6651 1905 2242 -4956 -2590 465 -3618 -9037 -8481 -6867 -5473
20991 -5473 -1334 -263 1521 6072 6183 7805 2100 -3248 -6793 -4927 1944 8133 2783 -291 -3190
20976 -3190 -7994 -4958 -5992 -1739 671 -316 -2131 -2036 -205 -4051 -6100 -3857 -1175 -1691 -5876 -2886
20960 -2886 -3518 -4502 -3809 1089 598 -3147 -2814 -3775 -774 -432 3457 2607 -2213 -4428 -1230 2713 3250
20943 3250 4582 8330 12217 13863 9284 2851 717 2290 1363 -3695 -5801 -3181 -238 -4667 -7867
20928 -7867 -5093 -5206 -2009 910 2105 2286 547 -3402 -5930 -6911 -6414 -4701 -2078 -302 -4292 -4151
20912 -4151 -4316 -2145 -2156 -2364 -86 -2916 -4448 -520 -2974 -1763 -1657 -1060 -1611 -491 -1727 -6553
20896 -6553 -13662 -10727 -7177 -2672 451 923 1584 3378 -808 1214 3844 3813 5011 2806 479 -1000
20880 -1000 -1274 -1780 171 -479 -2921 -4142 -2529 254 1205 -1118 -6428 -1876 3541 1416 -3778 -9014
20864 -9014 -6206 -7593 -5555 -1339 -677 -1595 -3673 -3400 492 2077 1615 -74 -894 4210 6657 1946
20848 1946 -2487 -9438 -9941 -6962 -2067 -1742 -5540 -6429 -4435 -5599 -6096 -7697 -11032 -12825 -5791 -4500
20832 -4500 -488 -3667 -10772 -11413 -5961 1106 -262 -3329 -2866 -2791 -7500 -6595 -2268 -533 3697 208
20816 208 782 2458 -105 -637 -2444 2206 4697 6217 4642 3220 2787 1884 824 -4231 -3812 -3924
20800 -3924 -5988 -10924 -7807 -9019 -4810 -379 2764 4090 4622 3118 3759 2469 -159 2364 1281
20785 1281 -2139 -4132 445 -2100 -9595 -10259 -7488 -12358 -10615 -8078 -4673 -351 2833 1674 -2465
20770 -2465 -2567 -7851 -5956 -4494 -2093 -1708 -4495 -8170 -6700 -4684 -5644 -6414 -10451 -11618 -6195 -1919
20754 -1919 -1395 -860 -3708 -7425 -6612 -3200 -3326 3940 3161 -3409 -4338 -1584 3388 628 -861 2557
20738 2557 507 -2060 -1548 -3228 -3961 -5068 -6902 -6101 -4558 -6117 -5861 -2247 -1516 -742 -4773 -8427
20722 -8427 -5154 -631 338 4427 2871 5646 4050 -2359 -6553 -5894 -2010 958 324 -2745 -3994
20707 -3994 -4046 -2894 -8429 -6609 -1271 -3213 -9696 -12695 -17119 -13072 -4132 -940 -369 -1947 -7116
20692 -7116 -5978 1110 292 -2151 -2260 -4653 -6024 -1843 -3519 -139 4597 523 -2581 -6323 -2861
20677 -2861 1805 -1271 -3094 -4517 -338 -1171 -7492 668 5388 3740 3644 -971 -1473 -3188 -2654 -2041
20661 -2041 -5369 -6126 -6323 -7641 -11815 -8967 -4578 -7406 -5127 -7169 -8993 -4755 -2778 -7185 -4276
20646 -4276 -3238 -2529 -2962 -6691 -11098 -5451 -4998 -7674 -5645 -3073 -4445 -4538 -1884 -7207 -9933 -5926
20630 -5926 3298 3284 -1802 -2569 -3583 -9392 -14641 -14713 -14037 -8381 -5492 100 104 369 -5081 -8237 -5790
20613 -5790 -11251 -13149 -7316 -3327 -964 -3006 -6769 -5820 -2781 -2934 -3347 -1759 -3947 -4327 -2294 325
20597 325 3632 5744 3299 -1115 -2270 -4490 -5411 -4064 -2048 -2291 -6705 -6056 -4209 -673 -908 -3787
20581 -3787 -4786 -3545 -4733 -5403 -1056 -2657 -4555 -5242 -3874 -1390 -636 4277 1543 3447 5463 4607
20565 4607 7051 5461 8054 3796 1936 1116 3478 3035 1254 3218 3563 845 -1155 -3055 -6270
20550 -6270 -7974 -7357 -8291 -5894 -4807 -8620 -9964 -6773 -3255 -1852 687 -3836 -9111 -10484 -7050
20535 -7050 -6275 2039 6151 6708 5709 -203 -3261 -158 -901 349 -535 -2159 -72 -1982 -4810 -11223
20519 -11223 -12651 -13390 -15476 -11202 -5070 -5062 -8410 -8671 -9628 -4284 -4758 -5785 -6204 -7145 -7057 755 7878
20502 7878 6663 4836 4168 5379 1541 -5530 -5468 -10971 -12299 -8616 -3601 2561 -339 -2019 -711
20487 -711 2775 2995 645 751 -1494 -4711 -7345 -9405 -10868 -6734 -349 2991 7592 7154 8281 6837
20471 6837 2107 711 4097 4139 603 -2263 -4694 -9355 -7391 -3972 -6400 -4887 -3091 -4062 -4925 -6374
20455 -6374 -5875 -4780 2001 5490 2434 445 2252 2715 -389 -4895 -4402 -5808 -1873 -4763 -5447 -2997
20439 -2997 -6883 -8826 -6238 -1050 1431 -1697 -831 -3602 384 5671 1800 -1695 -1219 -5365 -10399
20424 -10399 -2471 3574 2744 -1189 529 3147 1211 -1888 -3249 -412 -6205 -2424 -2725 -5422 -2442
20409 -2442 -353 -960 -7057 -7677 -6612 -2687 -2370 -4055 -7190 -8847 -8111 -1423 26 -5570 -9470 -7343
20393 -7343 -4402 -2545 -4399 -7668 -8972 -2992 -876 -2971 -2791 2438 3891 -3414 -9557 -7720 -3067
20378 -3067 -717 185 -4312 -5815 -2516 -3750 -8164 -342 1948 -2539 -7202 -12046 -9855 -10800 -13743
20363 -13743 -8186 -2984 -4111 -4316 836 391 -892 1445 -532 -1451 -3470 -3281 -2822 -4892 -5659 -3158
20347 -3158 903 7060 6498 6664 3164 -2824 -2245 644 -1434 -5460 -4954 -3107 -1994 -551 -3701 -3505
20331 -3505 -3561 -5367 -4567 -3274 -6557 -3743 -5417 -10763 -9007 -3616 -2713 886 3496 2430 4901 3114
20315 3114 247 -3555 -5224 -6274 -6636 -5218 -5851 -7379 -6875 -8581 -6422 -4546 261 -1141 -2293
20300 -2293 -191 89 2341 5816 5375 2021 1343 -1187 -784 5608 8091 11234 11759 6550 1897 2520
20284 2520 3319 2352 6393 3453 1707 -3480 -4731 -7215 -8435 -2581 -3663 -5034 -2327 -5313 -2784
20269 -2784 -595 2772 6165 2720 -2175 -2665 672 803 -2153 -2022 -2476 -2593 -2633 -946 6602 11967
20253 11967 11433 3519 1162 -454 688 3065 1777 -1268 -2115 3158 5128 4921 2269 6741 2933
20238 2933 1070 658 887 6482 10157 16613 14303 9548 -1289 -6287 -6599 -3375 1217 -323 4901
20223 4901 8611 7577 8107 1843 695 -2336 -1182 1096 2306 6937 9688 8361 8470 4047 -721
20208 -721 -8252 -1427 -2059 -3260 -1708 -6032 -5958 -8554 -11374 -10104 -8809 -7702 -5074 -1489 1157 4003
20192 4003 -918 -5543 -3915 -2073 -4595 -2766 -435 -3411 -2446 -874 -1471 -6045 -8692 -5975 -6287
20177 -6287 -4214 -2258 1324 -2593 -7543 -11723 -12004 -13041 -9663 -12329 -8790 -3334 -6052 -6219 -3794
20162 -3794 -3687 -3426 -2073 -3151 -5328 -6603 -7432 -4495 -2865 -2351 -4847 -2652 -6404 -8409 -7908 -6384
20146 -6384 -4687 -7352 -6495 -5261 -6851 -3364 -4180 -6713 -6782 -10353 -6776 -35 4929 4506 3396 3839
20130 3839 2785 1091 6330 4664 -2353 -1864 941 -1518 3211 6979 4125 365 -2115 -7125 -11745
20115 -11745 -9229 -3721 -6432 -7785 -8493 -11155 -8484 -5247 -831 2958 3139 -2112 -1323 3251 -444
20100 -444 349 2777 2239 -757 -3195 -1999 -1438 -4960 -6469 -7287 -11329 -10640 -9275 -11978 -15514 -13802
20084 -13802 -9048 -8919 -8985 -10744 -8286 -8164 -6554 -7244 -3589 -5577 -8696 -8483 -7114 -4697 -922 1352
20068 1352 2055 -1941 475 4874 228 -7603 -9801 -5727 -1959 3163 6600 6767 2452 -6060 -6188
20053 -6188 -7791 -11312 -8359 -8530 -9435 -8531 -3828 -5759 -6771 -3840 -667 -4854 -5877 -3078 -1298
20038 -1298 -7974 -12293 -12375 -8712 -5076 -2711 6992 5819 3154 2353 -1013 -228 -312 1617 3064 -462
20022 -462 -2226 -3653 -2068 1205 5654 6021 8776 6308 4049 -1526 -10708 -6203 -1375 -2434 -697
20007 -697 -1424 -7008 -6923 -5949 -11767 -13495 -14319 -10523 -8350 -4278 -2820 -3692 -5461 -3883 -1182 -1935 -6463
19990 -6463 -9617 -4816 -1523 -678 -6312 -4865 -1444 3218 2495 220 5914 8034 7345 2008 -3909
19975 -3909 -5888 -6205 -4185 -2869 -1852 -2536 -204 -750 -1019 1733 63 -2083 -6215 -9071 -4866 -2562
19959 -2562 -2430 -5781 -6003 -2746 -1061 -2255 -3469 -59 -1352 -2653 -6646 -13276 -15318 -9447 -6628
19944 -6628 -7235 -4410 859 19 -2357 -5281 -6435 -3897 -5160 -4260 -6245 -8062 -4341 -7585 -4752
19929 -4752 -2372 -4450 -8190 -8403 -8003 -4437 -3854 -1324 -4635 -9235 -7076 -5873 -137 -479 -31 -1909
19913 -1909 679 6301 4655 2724 -1765 3217 3572 -1630 966 355 -2083 3248 1750 -5833 -5546
19898 -5546 -5748 -3101 -55 936 -1464 -1007 -1192 -1029 -1790 -4803 -10517 -12950 -14152 -8625 -4801 -2126
19882 -2126 2903 3390 3525 -820 -4793 -6367 -3733 -1358 -1985 -3044 -767 3162 9280 8886 8780 9917
19866 9917 1697 -6414 -10405 -6115 -5119 -3191 1675 1440 -5191 -9904 -8277 -4877 -4672 -2134 -2439 -6547
19850 -6547 -10371 -5029 -1131 -103 -2392 -7101 -7442 -5861 -9489 -6240 -2989 -4204 534 1885 3408
19835 3408 3619 3589 5224 3512 3611 374 159 -2281 628 -1377 -3177 -2610 2338 969 2907 3886 2513
19818 2513 198 -1260 -1912 -2800 -97 -2070 -682 1578 1992 313 -2215 -814 -2587 -6541 -3100
19803 -3100 -5908 -7801 -6952 -5612 -9565 -12955 -12084 -7095 -7941 -11962 -4613 1100 4047 155 -489 -3150
19787 -3150 -2085 2291 1291 -4680 -5770 -5313 -6648 -7593 -9514 -14775 -16981 -10670 -4865 674 -1857
19772 -1857 -2793 -3817 -4688 -4362 -8849 -11752 -11315 -10949 -5503 -2913 -3801 -9607 -9893 -6606 -4367 -6996
19756 -6996 -6930 -1869 704 3853 4333 4384 6008 6874 4311 1894 1631 1456 -2133 -4819 -5465 -3507 -4068
19739 -4068 -3497 -1791 -2156 -2133 -2929 -13203 -15934 -9925 -6461 -5942 -6065 -7562 -6636 -8941 -5456 -4610 -3647
19722 -3647 -1985 -4077 -10901 -13098 -16457 -9210 -2955 2451 -678 -3581 -3448 -3966 -5658 -10514 -10998
19707 -10998 -5705 -4561 -6995 -7422 -10281 -7911 -2482 2138 3131 3746 1028 -1604 -1928 -1686 -3072 -5671
19691 -5671 -5824 -8033 -5148 -2128 -2099 -428 2660 4749 3036 -4412 -6093 -6765 -5842 -3265 -3562 -1032
19675 -1032 2520 1672 -2224 -3205 -3514 -2604 209 2736 1503 -3110 -3764 2753 -2612 -2501 -6132 -10108
19659 -10108 -8686 -7892 -4511 -4107 -2363 -3551 -2381 -762 -84 -6231 -12080 -9225 -1821 180 -1704
19644 -1704 -7816 -12883 -12706 -7632 -1371 613 1665 4475 1418 -1225 -3587 -5813 -8143 -6254 -3999
19629 -3999 464 -229 -132 2070 3196 872 6376 3885 -3399 -5420 -5942 -2812 -3862 -1969 -3383 -472
19613 -472 -1297 -229 -1400 -6931 -4739 -1912 -421 977 2152 3867 989 -3767 -1596 5523 6993
19598 6993 3549 5122 5427 -3765 -11726 -10925 -8098 -7300 -22 -204 -5513 -6067 -7070 -1685 1453 -5746
19582 -5746 -11308 -9148 -5540 -3053 124 -588 -304 -5668 -5872 -8098 -8166 -3973 -1328 2027 2894 2414
19566 2414 5565 4291 1772 235 811 -917 3105 3898 3913 2240 -4350 -4925 -1614 -2598 -4283 -8489
19550 -8489 -7828 -4388 -8 -3137 -2631 -4607 -6775 -9942 -8765 -1631 25 -3244 -1941 -5671 -2479
19535 -2479 2470 3537 802 -1885 -3549 -3561 -1946 -4497 -3265 -7041 -13806 -10128 -642 2670 5531
19520 5531 7412 8241 9138 6432 3405 1556 -3096 -4738 350 -7438 -12454 -8459 -1136 5887 2379
19505 2379 -5420 -5557 -4000 -840 813 -2079 -5422 -5189 -1480 -2242 1724 2444 1745 1162 338 63 175
19488 175 -2917 -4977 -5253 -4405 -4811 -7887 -10750 -13147 -12984 -11590 -6854 36 -2190 -1346 1748 542
19472 542 3712 3707 5453 6828 5479 4110 6818 9636 13120 13557 12276 11366 8227 2929 1379 527
19456 527 -1681 -3283 2149 9661 9483 4158 -2951 -3332 -5266 -6271 -6195 -4909 -2949 -808 6577 1112
19440 1112 -5159 -4612 -4865 -2840 -2166 -8758 -11799 -10918 -11041 -9110 -6731 -6958 -7474 -4499 1328 -152
19424 -152 -4636 -5662 -7024 -3084 -6807 -9302 -7585 -5252 -3309 -6126 -3105 -1099 -2167 -7894 -8503
19409 -8503 -3573 834 3002 7359 2856 68 -1270 -348 -2533 -5304 -4406 -5642 -10654 -12364 -9736
19394 -9736 -4931 1490 3665 -1721 -696 -1991 -1830 0 -3031 -7364 -7815 -9252 -4867 -3205 -601
19379 -601 -593 -6148 -7941 -3273 -4375 -6117 -8123 -8641 -7763 -3453 1607 2261 -3699 -7793 -7263 -3606 85
19362 85 301 255 -1946 204 3070 247 -606 -216 -338 1321 -1439 -3016 -621 -1355 -1737 -9473 -6400
19345 -6400 -3379 -444 1449 276 2974 3462 3069 2040 5209 5416 7453 7130 -113 -3465 -6670 1272
19329 1272 4800 2227 -3368 -1548 -1329 -7495 -8847 -6759 -3146 -1128 -5058 -9788 -11730 -8493 -4888
19314 -4888 -533 -4055 -804 2422 1379 -1625 -1229 -6101 -7394 -8339 -8598 -5589 -5155 -9240 -7219 -4464
19298 -4464 866 1478 -7570 -5808 1643 570 -3301 -1613 -5301 -1598 2765 9732 12703 8342 1328
19283 1328 436 4121 3059 3566 8429 4012 -3684 -6116 -4504 -3967 510 5254 4653 -1683 -6165 -8084
19267 -8084 -6325 -4328 -3502 -2636 1604 452 -1613 -2212 -4525 -2473 -3230 -3480 -5082 -5046 -5145 -5735 -9627
19250 -9627 -8968 -11396 -14048 -10178 -4038 1294 4904 7099 3222 2731 5313 4066 6545 1619 -6721
19235 -6721 -7570 -3839 -5199 -3647 -1665 -4298 -8929 -11679 -13622 -10124 -1266 543 -2065 -6517 -2165
19220 -2165 -2263 -146 1101 -2491 -1549 -1763 -2954 -5005 -2625 -1948 -5355 -6129 -5020 -3097 -3712 -6398
19204 -6398 -8594 -4298 -396 5614 4342 1308 -1563 -2848 -1682 120 -1019 1882 1803 -2639 -5307
19189 -5307 -3901 -5243 -363 5093 3619 251 -1819 2269 4321 -1482 -3873 -1120 -2122 -5273 -4535
19174 -4535 -4848 -4374 -964 -3861 -4546 1279 3782 -1709 -3282 2156 4455 3425 1941 7943 8825 4667
19158 4667 5025 2057 -267 1290 4652 10063 11889 6856 5241 2143 -234 657 74 102 834 1497
19142 1497 2441 -849 -4595 -4644 957 4872 2649 1646 2682 4271 3394 6771 6138 6768 9843 8021
19126 8021 3840 2467 -2059 -4504 -3366 -638 -849 -1167 4113 7878 5132 -1308 -1782 -562 525
19111 525 1925 2008 3311 5254 2910 4985 3939 2604 896 604 -1264 -4135 802 -617 201 -3252
19095 -3252 -3903 -3645 -3457 -1106 -561 3421 7943 11136 9911 6466 4776 4435 1905 -880 -3352 -2835
19079 -2835 -6755 -8420 -4758 -1857 -4621 -5840 -1102 4852 6125 1357 3057 -332 2587 -364 -3687
19064 -3687 -1869 2446 5602 4438 -1510 -4323 -304 53 -1833 2402 6221 3130 2674 10467 9435
19049 9435 10120 9955 11935 12240 10156 7602 6392 7417 6915 3497 5652 2912 4524 4724 4309 7735
19033 7735 6932 1984 3009 4176 1510 3498 9636 9875 8362 8165 5054 2840 -2000 -2422 -237 2216
19017 2216 8210 5341 12 2295 10435 17298 17713 15356 8049 2110 -239 -1580 -1639 457 1857
19002 1857 2542 -2205 -6239 -7238 -5180 -7081 -9719 -8868 -4754 -232 81 2487 241 2585 2241 876
18986 876 3941 -33 -2010 -1512 2391 5485 7395 10058 10335 8070 4996 2773 5616 5123 6716 4321
18970 4321 1192 -648 2048 2342 -11 -5469 -7262 -1582 1272 -284 2233 4592 8156 8540 -286
18955 -286 -4982 -1540 2332 7097 8835 1896 491 -2156 -4240 -141 -1154 -3816 -2036 -603 -1591
18940 -1591 -1705 -3621 -8097 -6767 -3441 1354 563 -985 -691 -603 -1298 1266 -1202 -4109 -600 1476
18924 1476 3062 10565 9363 4622 1046 -2389 -634 6505 6122 7425 9701 9106 8677 6211 6161 -1480
18908 -1480 -5498 425 76 -1827 -262 4417 331 -801 -3229 -4525 -3286 -4783 -2143 -2816 -3580
18893 -3580 -5332 -4992 -5971 -4016 1253 2130 3180 4403 8313 6462 9167 9085 6645 4475 1222 1107
18877 1107 876 2322 1709 2909 5313 11389 12351 13956 11954 12087 7579 6508 3971 -3933 -1929 3168
18861 3168 1867 1713 3542 672 -1046 706 -2271 -374 7244 6863 8050 15170 11054 6158 6992
18846 6992 11118 10423 2704 -1814 590 7149 8621 7087 9542 8792 3561 1704 1961 4428 9001
18831 9001 9134 6399 1933 343 4326 7821 6414 6142 7317 7785 6357 7644 4786 2755 603
18816 603 4851 3547 377 106 -1949 -3837 -3517 -4140 -3242 1368 7084 10148 10031 8028 6942 7203
18800 7203 4083 3301 -629 -3081 -3918 -4452 -2539 2591 6538 5854 8312 10584 12999 14668 10101 255
18784 255 -1035 -1632 -554 4379 6807 7044 6716 4645 3837 5331 4440 2232 -247 -2054 2454 15027
18768 15027 30040 33287 34974 31750 26697 23178 18316 13047 17114 18696 16923 18831 18509 17239
18754 17239 13897 9213 9694 7539 8749 10071 14146 18026 14574 13109 8249 6978 4990 5390 6703
18739 6703 9445 10937 13016 11660 13070 14813 12842 12091 7678 443 2549 6213 8996 11152 8929
18724 8929 8757 9838 11957 9667 13028 11339 7495 3973 5844 11115 3736 2449 3411 1937 4281
18709 4281 4296 473 -4574 -5608 -4249 1460 4337 5236 738 -2068 2785 7878 8349 9013 4190 -3288
18693 -3288 -7581 -5233 -1380 1332 3613 2466 -3142 -3895 -1971 -1441 2970 155 -1630 7014 11248
18678 11248 11180 8448 10508 15166 14882 12880 10394 7677 6995 7981 14594 16817 11452 4633 1279 4701
18662 4701 7186 12902 13266 7458 3375 5599 4712 4095 -1467 -1493 1368 3366 5298 8112 3544 2700
18646 2700 4199 6257 3645 1849 1318 5725 10699 12470 14142 11184 11918 14323 14702 9351 10857
18631 10857 13907 11776 9554 11301 8198 5787 446 700 3014 4459 5023 5003 5514 9171 13657 13609
18615 13609 8501 3267 814 -1017 -2595 352 -2325 -1560 301 4670 6236 4697 7164 4370 2190
18600 2190 6564 6054 3310 7129 6413 841 4807 9650 9125 6164 2876 4151 2764 218 4993
18585 4993 4054 -3955 -8289 -4127 -2489 -1151 2671 6006 5434 3829 5155 8045 9859 7869 5543
18570 5543 214 2245 7719 10485 12503 11124 9247 4191 3678 7751 10518 7657 3275 7786 7329
18555 7329 6349 6108 9135 9617 11254 13931 9268 8235 5973 6818 9090 14379 14908 13013 9814 7396
18539 7396 5454 7570 12707 16069 14058 13413 16191 15705 14281 15555 12781 17452 18030 17730 16087 11360
18523 11360 7738 13585 19930 18465 16740 14415 7007 5350 4304 5446 6305 5677 3630 5795 9203
18508 9203 6559 5047 11751 15257 9953 7249 8462 11861 14519 17750 14116 13343 10578 12758 12507
18493 12507 8327 11444 18269 17168 17733 26119 28174 27711 22718 19101 15459 15781 15137 12777 12892 16562
18477 16562 20669 17153 13287 12763 16453 19593 24802 30265 29550 28309 27635 28317 35620 48705 70807
18462 70807 109595 163511 214604 249093 248542 217514 173267 135070 101980 80698 68666 65651
18450 65651 77623 89300 100353 102761 98622 82476 64557 52270 46516 39199 33637 24368 22319
18437 22319 21969 20106 21184 27208 25944 21472 20795 26006 26278 20369 17723 19919 18532 24266 30755
18422 30755 29948 26805 28585 29932 39175 61455 81910 87663 85549 79179 62227 49000 40854 34289
18408 34289 28692 29710 27373 32274 45534 60563 66469 56969 45847 42545 36632 34783 29267 24475
18394 24475 23164 20894 20488 22566 21069 20523 18521 17716 17680 19143 20578 19212 16249 17197 18805 19928
18378 19928 21187 20717 19160 17865 15151 15318 14175 16351 16780 16340 18913 20627 20389 16823 17133 20598
18362 20598 23151 19425 17985 21187 23014 21202 17346 17352 20082 23487 23852 20818 21143 19301 20063 21973
18346 21973 21966 21079 16971 16882 18409 21249 25119 22071 20433 14996 12630 10192 10601 9229 9413 8170
18330 8170 9395 18427 19648 16299 15223 14573 13942 15565 24193 20015 16844 15621 19677 20144 23482
18315 23482 25368 28579 34539 38845 41819 44990 48958 47657 43585 36523 31032 31298 33694 33905 34175
18300 34175 26748 29164 29137 23960 21542 17369 21376 24091 25803 29366 30535 33246 27078 23536 26307
18285 26307 29897 31233 26103 19974 19125 21769 23999 25995 37409 42739 41067 43031 42987 44705 46928
18270 46928 43360 39620 35164 31658 26835 29743 28652 30247 32581 32549 29788 29804 33149 34248 31928
18255 31928 30246 26349 20674 18642 18806 20545 23773 25011 26567 29414 38536 41592 38460 32636 37570
18240 37570 41371 48888 45997 41633 39352 37894 40465 41912 46776 50362 61047 76116 95332 117891
18226 117891 142737 178538 220558 254275 275040 289364 300537 311947 315693 318206 323099 333192
18214 333192 349468 366357 370486 366694 358429 343237 324988 310533 286518 257924 226312 190509
18202 190509 152958 125296 102966 85605 77631 75321 69759 59470 50147 46040 48145 48691 48003
18189 48003 48262 53148 51408 45486 45170 46720 51581 51882 51047 46705 40863 38111 42572 44601 50552
18174 50552 53782 53455 51931 47486 52882 57226 58653 61684 67234 68650 61273 57623 59845 62523 62947
18159 62947 67717 70979 75820 81346 76685 69954 70931 74548 83662 89847 96051 107573 127581 160626
18145 160626 201450 252815 322511 398282 470226 529137 555443 538313 481682 403773 336659
18134 336659 285751 251376 232719 232241 242806 264722 285809 291538 287897 285411 278588 268914 265541
18121 265541 275808 293721 313049 338247 376920 438496 543180 703713 954502 1381454 2201960
18110 2201960 3818652 6062943 7303360 6941541 5781683 4212397 2741159 1787519
18102 1787519 1253672 943820 752240 619661 522793 453720 403253 394482 412863 447545 495743
18091 495743 562150 640429 706502 749601 757068 719503 643364 548133 453598 378440 326534 303820
18079 303820 301003 312644 327243 341089 345982 334840 307224 271965 237053 217930 200340 194518
18067 194518 190897 188999 187633 181989 178321 176941 168381 161306 158817 154337 151694 140698 132515 124454
18053 124454 115871 106614 104525 98801 90876 80393 72252 68719 64762 70650 79171 83188 83624 84991
18039 84991 86570 82084 75135 73231 77197 68844 58297 54121 50142 54911 63298 64811 62988 64227
18025 64227 71561 75018 78795 90123 93971 90952 82929 83119 86801 88134 88940 91372 90647 95954 94328
18010 94328 94006 92317 95208 104798 111122 117256 122616 132099 139154 140930 142858 146469 146113 143193 137054
17995 137054 133926 136811 135611 135703 139067 136879 126047 116964 108556 104261 106374 108214 103734 103402 104729
17980 104729 105827 103925 107363 111004 112196 119492 126566 128499 127090 129213 130720 131469 135965 139913
17966 139913 136225 141806 143831 144600 142471 136191 132140 140611 150243 149722 142679 137460 133036 129959 124352
17951 124352 123127 119172 116824 117127 121523 120587 116610 116525 115404 108785 101444 93856 88717 88711 92780 101871
17935 101871 105235 106852 115418 121001 125088 133108 142990 151344 151592 143079 136990 133869 129655 121021
17921 121021 115652 113610 112377 114049 113518 116381 117020 121034 120236 118028 121030 118979 119890 119986 125786 136436
17905 136436 139411 137279 132495 124660 120429 115374 115844 120277 130366 135447 135789 136296 131589 127184 122377
17890 122377 125023 128468 133404 133343 127789 124978 121084 118722 121407 118613 119521 123793 127296 135278 136969
17875 136969 137501 142704 150314 158820 163773 168089 169252 172055 184086 193072 196513 199676 199904 207810
17861 207810 218396 232864 242112 241360 234103 229065 221238 216150 214828 213760 207287 209507 199318 182655
17847 182655 168125 151654 147107 138618 137717 143440 147035 151066 146488 141256 140446 142813 143790 153917
17833 153917 162257 168399 175319 181417 183665 185935 188504 186644 183346 186850 190488 196517 202203 206277
17819 206277 214074 222636 236828 260734 279524 296727 308408 305155 293747 279657 259031 239451
17807 239451 225708 221066 220251 223091 225481 222787 215794 204418 217570 240673 251428 256921 252208
17794 252208 238525 231087 232630 244013 261955 283825 300821 315937 319531 320954 320764 322033 327288
17781 327288 336526 341653 347606 357802 362732 369907 383108 406758 431695 468437 511972 549797
17769 549797 584860 601749 604802 596293 597620 605640 610134 614807 622004 627727 637211 655830 681924
17756 681924 711007 741688 773602 812790 865213 937094 1023302 1130264 1249640 1366852 1482437
17745 1482437 1587396 1680775 1768254 1865551 1985446 2130583 2306938 2518908 2758169 3078079
17735 3078079 3505297 4009495 4615545 5398369 6489038 8103302 10651357 14541715 19387426
17726 19387426 24647162 30412757 35047477 37314006 38714684 40192676 43101997 48551991
17718 48551991 55596972 64149316 71393043 73199585 70407455 64907476 58662618 53798010
17710 53798010 50911888 50318770 51091099 49954044 46543844 41641173 34810164 27479801
17702 27479801 21154669 16087792 12401778 9929588 8269899 7097790 6208400 5515645
17694 5515645 4977837 4543268 4190718 3896985 3642514 3434395 3255042 3065705 2886378
17685 2886378 2733903 2587908 2444237 2293936 2145816 2012357 1890419 1771543 1671258
17676 1671258 1593644 1542634 1511330 1489119 1476506 1472465 1491284 1555178 1693248 1898231 2112818
17665 2112818 2338830 2593956 2767052 2833432 2798393 2635881 2396468 2162684 1992837 1962036
17655 1962036 2164778 2615006 3016306 3050207 2826957 2475462 2092444 1808020 1649912 1577074
17645 1577074 1546161 1543448 1557770 1593755 1662843 1754747 1873688 2022742 2193456 2391840 2616919
17634 2616919 2886385 3180016 3452153 3709639 3984094 4283433 4618909 4942079 5257880
17625 5257880 5663831 6249040 7076981 8136712 9365661 10658793 11990415 13558443 15686983
17616 15686983 18789217 23375567 30268317 41397627 61020466 95878000 145142217
17609 145142217 184765632 192732450 176321484 147796766 118388712 102760677 109820569
17602 109820569 136936500 163511339 169850053 156145550 128896379 96532584 68573231
17595 68573231 48987461 36564641 28755645 23584892 19849363 17003079 14773557 13025593
17587 13025593 11694594 10698089 9945645 9338367 8767890 8201604 7670546 7158000 6635155
17578 6635155 6095815 5524591 4955837 4436301 3987074 3624624 3339754 3118360 2941816
17569 2941816 2789450 2645947 2492296 2340852 2196832 2066039 1947330 1831607 1733123 1652436
17559 1652436 1593740 1570773 1553265 1510138 1438872 1350236 1261936 1192772 1165497 1196465 1284710
17548 1284710 1367317 1381141 1320527 1210092 1084401 966290 876740 823070 803540 793733 804920
17537 804920 808839 794538 766145 723623 674931 636269 605009 581135 571757 571935 566322 558106 563807
17524 563807 570842 561198 544255 520832 479543 436487 401347 381487 364353 347117 327054 312170
17512 312170 302571 302322 315962 335658 361639 394969 424999 440690 440990 425454 400690 365134
17500 365134 322304 290639 273990 270443 284272 306087 335271 371173 385967 373067 347710 321757
17488 321757 296469 273044 252235 237652 240378 253172 262946 266677 286977 324390 371619 431737
17476 431737 502276 566351 605706 626115 621526 595983 554449 516226 489113 476664 489038 517061
17464 517061 551146 589385 615844 613259 580530 522158 448503 373369 311775 266218 229783 211630
17452 211630 207575 208181 197310 178547 160417 141932 127669 122549 133408 149931 171793 184770
17440 184770 175387 154637 133063 112752 103336 98701 99082 96381 95595 97625 102331 106593 120927 133114
17426 133114 147813 163056 172161 175322 173403 165463 151801 141256 141241 142906 145612 143058 143868 152044
17412 152044 162922 178415 193379 196608 186647 167040 140734 113145 92283 83026 81464 80248
17400 80248 72923 62002 43191 33132 31853 40284 46357 50958 55361 55750 57177 54381 47512 47094
17386 47094 52903 59488 60672 59519 55597 54648 58755 56538 61332 69467 75662 74523 69136 70795 72995
17371 72995 72139 66710 61797 61492 56760 49421 43831 46127 49782 45955 44146 43535 37315 34128 25419
17356 25419 25169 27562 35752 41529 38815 34616 31366 28141 26180 18116 18244 18052 18860 16002 14629
17341 14629 13396 13425 17901 16043 10015 3659 4081 6919 4290 4956 10081 7280 7999 6240 9528 10972
17325 10972 8224 7567 13456 18649 21785 23397 27108 32914 33244 31007 26912 24799 19422 13849 16151
17310 16151 21223 25921 27926 33140 31538 27100 20747 19535 17444 15944 13835 17708 18021 16009 14716
17295 14716 19518 24052 34133 36618 37346 39742 34359 28644 24194 27008 30644 26851 23396 21214
17281 21214 26763 23366 22299 25072 22073 18796 22229 22521 19997 25134 32257 32891 32145 27170 25811
17266 25811 25949 26627 25661 22620 18422 17536 18126 17168 17011 13133 9462 7963 5859 11007 6501 4944
17250 4944 9425 11259 15827 19578 22910 15902 13849 19127 20825 22764 26564 26431 33411 31540 33188
17235 33188 29737 29032 33794 34774 33948 34542 33356 32110 39072 44404 42898 48115 68294 91316 128880
17220 128880 168011 209708 242742 265514 285321 303397 321601 328131 329935 326290 312441 296765
17208 296765 287412 287222 291646 301785 304782 297924 290970 269642 239539 203045 167508 134556 101532
17195 101532 72099 53248 38451 30570 29746 31283 31746 30232 27283 23760 14293 9543 14377 23137
17181 23137 27474 28647 27062 21446 21026 19279 12354 17205 19480 19319 22571 19218 15155 11199 6099
17166 6099 5402 12960 14894 13014 11190 11565 12261 17799 17240 16914 18085 17539 18524 20685 20926 21006 23283
17149 23283 27344 30889 27589 26295 24872 19041 13636 17393 23951 26595 27130 32243 33027 29454 34261
17134 34261 40744 44839 48921 60768 80391 114417 157441 208725 264474 318529 372817 429664
17122 429664 486240 531970 559105 546604 490895 416649 341319 282342 242510 226484 233466 243622
17110 243622 247877 236235 213756 179283 141232 109734 84659 73463 63181 54979 51126 42303
17098 42303 40673 44727 48010 47861 43195 29306 18940 19588 26774 24468 27061 34034 32820 30608
17084 30608 32947 35977 36356 39305 44313 55693 72888 94761 124147 153401 191800 242302 297711
17071 297711 357052 413271 447615 449529 423801 365218 302638 251172 212441 189889 183340 189810
17059 189810 193382 192971 182068 166266 140192 114071 93641 75741 59582 44754 35145 25322
17047 25322 16609 10682 6749 10735 11056 8050 6155 9522 13871 10370 8291 10642 7312 7976 8268
17032 8268 7820 7523 7245 4755 3112 6600 5251 6629 7360 7474 7167 1511 -3780 -3761 2474 4909 8071
17015 8071 13050 15049 14597 16486 15480 13755 12762 16049 22016 27790 25533 26573 28166 31618 28746
17000 28746 30316 32597 33840 37200 42571 48954 49014 52263 55414 58536 58243 53125 50213 49744 49598 43939
16984 43939 34175 20756 18989 19489 10383 11971 12643 13022 11779 7762 8345 11369 12163 10927 11653 13382
16968 13382 11806 9067 6212 -633 -3514 895 3651 1193 -788 596 -2039 -6022 -2808 162
16954 162 4326 10883 9460 5176 2721 5980 1187 -7163 -9999 -7305 -3062 -3331 -1105 -1432 -4378
16939 -4378 -6599 -9741 -11430 -12138 -12717 -9009 -5458 -7217 -5748 -9548 -13086 -15699 -18924 -14736 -10126
16924 -10126 -9725 -7374 -8165 -3473 0 -520 3271 7 -510 338 -1396 -4531 -4625 359 -4295 -9166
16908 -9166 -10282 -13850 -11771 -8088 -6810 -2809 -516 -833 -6488 -12117 -10954 -9609 -8044 -3415 -3853
16893 -3853 -6256 -11426 -12474 -9936 -9481 -7760 -7769 -7462 -2998 -1847 -1980 -4327 -4860 -5660 -2856 430 -4237
16876 -4237 -8946 -10757 -13359 -14878 -12116 -5563 -5045 -7527 -7157 -6363 -6308 -8235 -12220 -10420 -9669 -12404
16860 -12404 -19786 -21790 -18913 -20541 -21175 -19608 -14938 -11027 -10019 -9327 -6839 -10643 -13529 -10760 -12327
16845 -12327 -11916 -11348 -7832 -8457 -8639 -7467 -8664 -7866 -6984 -4495 34 1504 -1193 -5475 -9483 -10255
16829 -10255 -11846 -10786 -8505 -5665 -2140 -3444 -11047 -11011 -10304 -9402 -5963 -3282 -4595 -1625 2754
16814 2754 -953 -3341 -6804 -11044 -10843 -11797 -13251 -10406 -9411 -6255 -12892 -16286 -14084 -9519 -8265
16799 -8265 -10043 -11149 -11663 -11469 -12271 -16137 -13234 -6674 -3531 -9284 -9444 -4145 -748 2248 3242 -540
16783 -540 -848 -5328 -12114 -7396 -10007 -10276 -11306 -12434 -13226 -12231 -10586 -11431 -9351 -8908 -4678 -1440
16767 -1440 -1289 -7928 -8804 -7449 -10744 -8796 -4877 -2359 -7282 -11970 -11499 -15184 -17146 -15511 -10890
16752 -10890 -9803 -7124 -9126 -7287 -9986 -8777 -5426 -7528 -10836 -7628 -4368 -8798 -8164 -8101 -6502
16737 -6502 -6040 -9970 -12470 -8945 -7418 -5718 -4374 -5786 -12363 -14632 -13833 -11320 -11041 -12084 -9121
16722 -9121 -4750 -4908 -6334 -11062 -10039 -6657 -5095 -3265 2148 6141 2135 -726 -4005 -6202 -6993
16707 -6993 -7605 -11416 -15224 -15008 -13152 -14677 -15847 -15107 -11415 -6864 -2854 -2865 -3957 -4679 839 2467
16691 2467 16 -1061 -11 1057 3164 90 -7051 -8949 -4604 2 -921 -1700 -4298 -4628 -6420
16676 -6420 -5775 -3124 -4554 -6185 -9959 -12058 -6878 -5983 -13159 -18694 -17840 -11566 -9693 -10605 -11559 -9808
16660 -9808 -10433 -6407 -8284 -10228 -17342 -17208 -9772 -9062 -11860 -8069 -5320 -5492 -6695 -12635 -12344 -10459
16644 -10459 -11429 -11668 -8120 -3028 -1156 -4797 -6944 -4510 -9421 -7225 -4038 -4032 -1622 938 1335 1900
16628 1900 -1738 -6015 -2407 2306 -45 67 709 -1671 -4348 -2648 -3422 -6569 -7795 -3340 1000
16613 1000 -2057 -2810 715 -2883 -8216 -8009 -3907 -4026 -7870 -11129 -6232 -888 -5782 -9188 -5321
16598 -5321 -4583 -6645 -4453 4286 4028 -179 3214 -2492 -8978 -6431 -5352 -3697 9 204 -2856
16583 -2856 -3071 -4973 -4771 -5824 -8084 -9212 -4860 -5118 -3170 -299 -2952 -5127 -8548 -8850 -7363 -7079
16567 -7079 -7820 -8488 -9945 -9895 -13343 -12252 -11643 -5574 131 210 701 -448 -2023 -6007 -6440 -3470 -3764
16550 -3764 -7871 -5657 785 5509 1707 -5848 -8075 -5156 -297 1511 2634 6601 4652 -582 -7777
16535 -7777 -11106 -8873 -7934 -6284 -8320 -7806 -4824 -5896 -3754 -4080 -2870 -4094 -6950 -7935 -8316 -6078
16519 -6078 -5340 -5706 -4899 -5658 -2723 -1852 -2328 -4605 -2265 -3060 -7876 -6925 -4403 -3740 -4261 -2324 -2035
16502 -2035 2186 -2035 -1789 77 3800 9052 2245 2936 3009 -2671 -5425 -8354 -8977 -3671 1700 1559
16486 1559 -4186 -5385 -6538 -7959 -7037 -5059 -6148 -8868 -10561 -6614 -2023 -240 -1452 -1237 2392
16471 2392 1421 1126 2102 -2394 -3427 -4286 -8468 -3893 496 2446 1705 -3350 -10265 -7803 -4661 -4070
16455 -4070 -1755 -523 -137 -2218 479 153 4743 5040 2620 -275 -1422 -5269 -1943 -592 -1162 -5638
16439 -5638 -8114 -8913 -7563 -5322 -6767 -4416 -4034 -7305 -5719 637 2671 -356 -3695 -6493 -10231
16424 -10231 -9444 -7776 -4419 -2398 -5979 -6210 -8537 -8014 -7954 -8708 -11199 -5043 -8853 -12393 -7705 -5098
16408 -5098 -4856 -6947 -10030 -14085 -18646 -13679 -9323 -6665 -5443 -7757 -5430 -5568 -6861 -2583 3374
16393 3374 7368 8506 5580 4067 3496 3744 41 -1927 -7049 -10546 -6091 -5186 -1157 3644 10014
16378 10014 15071 24691 25023 24032 20572 9315 3433 7400 7114 4573 5150 3523 3961 7364 8866
16363 8866 8003 6800 5476 3463 3806 3799 3537 4420 5291 11188 16755 27220 33031 39467 44435 42782
16347 42782 46109 50007 61669 73665 81884 87157 92047 83279 68015 53744 43562 35264 30144
16334 30144 27376 28529 32747 31234 27924 22845 15864 11515 11355 14782 17099 17244 17345 23200 28325
16319 28325 42930 61661 75913 82387 82650 74683 70435 75858 92437 106504 120429 126273 111784
16306 111784 92329 75099 57529 45235 38565 37553 33427 31189 27652 23091 25483 24242 21960
16293 21960 19549 17898 15137 15177 19906 21604 29164 44955 64189 78826 83401 81508 75022 74638
16279 74638 82229 101934 122037 136050 137054 130463 115088 100873 84436 74988 74641 77786 73845
16266 73845 72864 72295 66518 53398 39591 33738 33363 34596 34621 35598 36321 37466 39839 49683 67415
16251 67415 88487 102293 98028 85089 78039 74068 81242 101495 124331 146693 162353 161249 145636
16238 145636 120791 108092 107087 120048 133188 138370 136287 121290 103090 85156 67320 53560
16226 53560 48882 47531 51743 49794 47795 46122 46201 55734 65023 72687 76430 71639 70712 66779 63398
16211 63398 70937 90137 112474 136419 143239 141404 125249 117814 115090 125113 139444 152153 167841
16198 167841 168953 154530 132334 108019 87697 72640 58402 51277 46403 42888 48229 48476 37789
16185 37789 30800 28772 28808 31007 38088 47972 55592 59828 74154 89614 105165 115673 114381 107589
16171 107589 98795 103713 123876 144686 156893 167094 162553 142981 115597 88031 64457 50205
16159 50205 46471 48534 49953 50557 53025 51899 47086 48460 46252 41367 40313 35255 33880 38456 47419
16144 47419 56740 66738 90430 111310 122691 124867 119159 109557 102312 110343 121124 131255 140056
16131 140056 136216 118571 99784 75490 58887 48688 43907 45816 47767 45408 45379 45632 41590 32799
16117 32799 30058 30317 29404 29197 33500 38025 48337 56794 67844 73165 77422 69510 55479 50085
16103 50085 48447 45451 44446 51252 63630 65901 61025 48843 36442 29868 24099 18882 20044 21017
16089 21017 20537 18630 15045 12210 12419 13218 10260 13223 14313 20795 29592 30858 31380 24473 27884
16074 27884 23795 18527 18856 17862 22024 29502 30209 31349 28531 26730 19491 18477 20237 18569 22464
16059 22464 21135 17214 14324 10730 8055 7122 6292 6838 10548 11661 12746 13695 19662 27140 27921 22889
16043 22889 22224 21841 17794 17173 17441 22346 28729 25172 19983 15300 15787 15938 15668 15125 14439 19095 23312
16026 23312 28287 30587 27943 23727 17212 15562 12357 14215 17645 15281 10145 9160 10015 9700 16233
16011 16233 21173 23316 22064 20612 21883 25039 29958 31949 28822 24246 16273 8841 7676 5874
15997 5874 5327 2588 4838 1807 947 3978 4319 5608 7594 7388 7703 10490 12190 13838 11439 6273
15981 6273 7493 7447 10132 7331 3828 8094 14064 17257 14777 16346 16278 17144 20397 29945 35937 36490
15965 36490 36644 31629 16749 9535 12568 18075 17275 10389 5072 7286 6736 3573 1114 1440 -3773
15950 -3773 -1875 445 -31 -2217 61 4170 6651 2345 3117 4727 3233 6734 3040 831 -752
15935 -752 1479 1458 4276 8214 8689 3162 5021 6423 7950 11299 12364 12323 13338 14271 16185 14500
15919 14500 9699 10096 15697 18998 18537 23901 26868 27792 18858 12177 8044 3808 317 252 4364 9895
15903 9895 7845 3975 4042 7054 11569 11180 9880 11786 19529 22172 20725 20861 19668 16868 19521 23985
15887 23985 26064 30431 35576 37987 33030 31083 27454 26681 23074 14606 6667 4086 853 -1235 3700
15872 3700 7312 6695 3647 3346 4591 4373 7847 10549 7785 8373 12888 13796 10545 9013 6220 4829
15856 4829 7056 12705 14421 13451 9100 13225 17676 18361 14666 11742 16858 21049 16329 12689 11112
15841 11112 7147 8778 378 -5673 -779 2690 1275 1031 5492 9020 9569 11155 8870 6275 310
15826 310 -4732 -2640 -1006 -3435 -2828 -3622 88 6888 8950 7275 5012 3123 3888 6019 3190 -1479
15810 -1479 -2800 521 6026 7346 10330 9657 8720 8379 10536 11967 7548 5922 3673 -2918 -2917 -865
15794 -865 1216 4991 5918 1476 152 -206 1104 5844 11348 13786 7990 2408 -1517 -1304 3928 3554
15778 3554 3077 3213 4724 9056 9251 9949 10903 13761 13740 7981 4834 10041 4695 2662 8794 9285 6278
15761 6278 4141 4222 2998 -831 -132 2817 898 963 375 146 2091 2307 533 783 3001 232 6327
15744 6327 7873 6355 6134 6803 6964 7057 8739 9352 9958 5297 6260 5506 1115 2845 7472 5574 4719
15727 4719 12277 18941 17647 11579 7535 3308 163 6665 9714 5771 6785 1593 -5201 -4358 2348
15712 2348 6764 4671 533 319 -1940 938 5743 5482 2335 5140 6933 6661 6976 6790 8835 5095
15696 5095 -4041 -5908 -3271 -892 874 5249 8461 9457 10992 8295 4092 1910 -1260 -3483 1413
15681 1413 -1655 -6110 -6939 -9874 -6087 -1400 2850 2625 4908 5500 5297 212 -1353 -1051 4934 7817
15665 7817 6606 6959 11293 12724 11763 4445 5563 10939 11652 10338 9528 7643 9816 10599 7854 8723
15649 8723 7675 6143 9777 14055 10334 9526 6741 6069 5556 954 5091 4896 5307 6065 4644 -483
15633 -483 852 -620 -607 1248 427 -269 4532 6852 5322 9087 14567 10714 5687 2817 -1462 1078
15617 1078 6687 6722 2593 2396 1899 3387 5860 8195 7298 6715 6530 7216 5031 2804 -258 4303 10342
15600 10342 12637 9296 9837 8158 5212 6852 5603 7057 4313 62 1420 678 -320 -2206 2331
15585 2331 4397 6185 8178 5313 3841 249 -848 -1992 -1818 1405 4597 5236 6863 6257 2836
15570 2836 77 1660 2689 1388 534 1636 -1111 -3350 -3259 494 255 -711 3927 2281 1372 3475
15554 3475 -346 -1234 705 5049 354 352 4613 5435 6834 4366 2662 5878 6779 5123 8209 6623
15538 6623 5087 7473 6694 1877 2338 2227 3320 6289 4967 734 2317 4584 5841 -3334 -5323
15523 -5323 1428 4936 7481 9113 7932 14787 16758 15826 16277 15433 14109 12253 13945 23031 29328
15508 29328 39733 52854 70020 79625 81139 78690 69738 54699 44995 40134 32834 24692 26476
15495 26476 22052 18350 20753 19490 20512 17499 10320 9423 10353 9406 7597 7267 4361 2964 2308 2331
15479 2331 3367 9893 12219 10664 6884 7847 13775 17290 15997 12902 12030 15337 14306 8538 2741
15464 2741 5923 6395 3542 3735 6844 3828 3852 7709 10397 10160 7411 5636 8734 8200 8009 10080
15448 10080 7479 6824 4602 8672 9620 8198 9890 14737 12421 6741 5926 4364 7226 12562 12151
15433 12151 6472 1515 1336 5530 1658 3374 8250 10441 8703 8823 7603 6030 3109 3504 3411 3251
15417 3251 6923 9012 12234 18334 17764 9414 7668 7415 9932 12523 11504 3635 1183 -1539 2031
15402 2031 8822 7321 4292 2579 3789 11960 12093 13720 16904 9234 6860 11042 16150 16231 8190
15387 8190 8347 8860 7552 8907 5375 8309 11810 9970 9960 11345 16932 20322 21097 17452 13541 9374
15371 9374 6299 5786 7486 10036 10679 15450 17289 14683 12393 6334 3053 4724 9562 19192 15934
15356 15934 14031 13117 7305 1911 4372 9970 9537 13349 13142 12420 13133 15197 14701 14581 16159 15755
15340 15755 15418 15275 8250 3329 -78 7495 13795 21642 23800 18678 9786 9078 9243 5645 9549
15325 9549 9566 8682 8190 7749 10753 13340 12757 15737 16981 14166 13065 10970 7569 12178 12090 9594 10284
15308 10284 10966 12381 15802 15122 12612 13042 19021 19914 15793 11729 10818 14708 17779 16132 9519 11353
15292 11353 20261 24412 27063 29757 36127 43766 58842 72541 76203 69938 57907 47213 44093
15279 44093 57084 75609 107559 148604 184365 193065 184548 164854 140070 116053 105705 110669
15267 110669 131386 164411 201139 222797 223938 212508 195752 184483 174873 168351 160324 157998
15255 157998 157140 163298 173682 195515 232335 283368 310138 300543 269078 229205 187585 163121
15243 163121 163121 176980 208864 261730 300735 301050 271433 228321 178588 141072 119041 106072 108134
15230 108134 119663 127431 127332 122773 109800 87111 69355 56342 49078 46297 42299 41536 39079 31654
15216 31654 30488 31953 31884 31392 30557 30533 28477 25561 21484 21152 19299 18530 23714 32139 36794 34319
15200 34319 23698 24064 25550 24981 22488 21740 22117 21192 25360 32155 29475 18307 17079 19928 24826
15185 24826 22478 25316 20621 18257 25375 33057 35294 43736 57555 70112 71928 64988 62458 60395
15171 60395 58770 68530 78027 99992 122407 140140 154429 152920 136906 118528 104758 94788 93180
15158 93180 101852 125344 157745 179997 185728 172534 158101 145605 142586 137022 133521 130409 136376
15145 136376 138466 141167 153834 180324 219075 253283 257783 235681 200702 166732 142404 129644
15133 129644 135055 156975 195384 235763 247124 227964 191568 152741 123832 107449 95808 87526
15121 87526 90183 100348 109709 109228 100726 86454 70464 60786 52348 46753 35619 29503 31714 32314
15107 32314 27755 26835 26486 24641 27675 27496 27687 30737 26172 19546 25238 31954 30056 27161 29335
15092 29335 32600 30309 25810 24466 25310 24452 24503 23004 16974 15146 20953 27918 32379 30165 21824
15077 21824 17975 15594 14253 14302 15579 16092 18952 26554 28192 25071 26551 28009 25826 22306 24227
15062 24227 25793 25072 22496 16865 20043 21789 24214 24373 27959 29118 36795 38506 33691 36990 37065
15047 37065 39367 41908 47084 57000 71649 85280 84187 81461 80429 75732 83620 96403 120899
15034 120899 151129 171945 169951 160587 145142 136335 136913 145196 171745 203537 228183 229150 215904
15021 215904 193499 177597 180900 203762 233900 247733 242436 230175 210326 192989 187052 195404
15009 195404 219021 242498 245258 230262 213899 195445 176759 179622 197276 220398 226774 214548
14997 214548 189492 165253 142507 131206 135405 144848 158679 167190 161622 142103 115811 92572
14985 92572 79803 77550 79215 88297 94080 90932 86443 83194 86562 90477 87639 89174 85655 83430
14971 83430 83293 89601 112012 139505 161702 170711 169589 156466 136661 134205 139258 156216 184579
14958 184579 210363 212978 198384 181605 170583 166304 177908 205142 225913 227005 215308 189945
14946 189945 167916 160568 164002 184336 209101 224049 218191 202566 179288 158515 145605 159237
14934 159237 185559 198740 197549 178224 151164 131577 119656 112629 115829 133467 146407 142524
14922 142524 124446 104445 83625 69376 58033 56472 59137 62368 64337 63351 61983 54944 43001
14909 43001 33775 28487 26904 24503 20111 17883 22456 26435 28016 30718 32650 32480 32740 28940 27232
14894 27232 26862 28892 30599 30068 30560 29303 26223 23167 21859 20511 16797 16226 16499 16798 15755 18001
14878 18001 20766 24629 23050 21213 19678 21831 23296 27627 31255 36067 38079 37859 36393 34593 34902
14863 34902 32140 32777 37187 37711 35543 30056 31185 33098 34322 34359 31493 27295 26285 23294 19174
14848 19174 21117 23201 22340 21425 22208 22357 20734 17998 21349 22925 19607 27958 28869 25100 23225 20706
14832 20706 14486 12433 18262 25405 30119 31035 27809 30941 27642 24738 26943 27369 30402 30603 30333
14817 30333 32766 31639 26380 25085 26286 27709 29191 26321 24952 21377 22898 32256 37652 33883
14803 33883 33440 33611 32272 34596 37231 35329 34560 35993 37434 35669 30549 24906 32139 34217 33936
14788 33936 32515 29601 27700 28660 28730 29724 38203 38024 31313 26841 29264 27996 26393 31404 30799 29139
14772 29139 35630 40700 47862 48595 46392 45750 45761 39375 37435 37941 34496 36159 39240 43411 41928 41421
14756 41421 40208 39587 45014 43923 43615 41436 42103 44785 44004 42573 42038 39435 36931 41057 44532 47853
14740 47853 44426 41892 38172 38184 40800 37078 38007 38428 38546 36054 35780 38912 43493 44903 43660 40361
14724 40361 40864 40544 38191 41599 43995 45048 44885 39599 38347 41343 41621 42621 48614 49503 51064 54849
14708 54849 55150 52051 52337 51306 50994 49217 45714 39231 42198 44069 48677 52070 53561 53560 53239 53760
14692 53760 56292 55542 61380 66150 71808 77063 78097 81618 83454 78105 76486 75661 75091 72632 68806
14677 68806 66201 61603 61317 68574 75811 79586 83010 81932 80126 74752 71363 75012 80560 91594
14663 91594 107035 120018 127134 129101 118256 108747 108950 114195 120183 124106 126402 124850 119463 114927
14649 114927 110280 107532 104809 104131 102557 95132 93256 92734 88874 78151 73393 75255 67149 67931 74813
14634 74813 75183 69519 63700 57858 63862 66159 63410 63673 66172 63424 61287 61579 63940 61089 60888
14619 60888 57247 58026 56691 56644 57412 61661 57957 49059 45799 50856 54422 60181 66582 70538 71601
14604 71601 72807 74390 70921 68407 68030 67741 74572 81290 88715 90819 91480 88396 84817 86235 86849
14589 86849 89339 94694 103463 109710 116536 125514 129403 124417 117706 106485 94166 97814 103542 103794
14575 103794 104690 106156 108479 109020 107911 103360 97089 94636 91388 82868 79445 88221 100955 109381
14561 109381 109765 105481 101521 88393 78881 76736 72103 75211 78969 90532 100594 106249 100995 86101
14547 86101 78261 68857 63938 66916 66024 66758 71426 73321 73661 69114 67448 67116 62607 62986 65616 62305
14531 62305 58920 60080 59950 61313 55531 51135 47828 42689 45031 41633 39749 44534 48348 52238 59467
14516 59467 60087 60745 57624 53647 52982 48103 45373 42440 42252 47735 50494 44283 39724 41608 42096 35554
14500 35554 32740 33851 37977 36601 36080 34618 37800 36336 37119 43700 45689 49681 45989 42173 42571
14485 42571 50553 49614 51793 51461 49348 55040 61075 55535 51982 53252 52123 52471 59843 64607 63484
14470 63484 61563 60578 64259 63126 58301 56788 55330 58302 63641 64812 60979 61991 59669 56156 55864
14455 55864 57471 53394 52517 55492 55310 54985 56111 54928 54042 51257 50251 50858 45324 35403 33472 40793
14439 40793 43179 46027 44804 41916 41990 41563 43013 40620 47206 49808 48841 43449 39265 45084 45014 45981
14423 45981 47556 53786 53540 52507 50921 49956 48083 47114 51057 54710 54727 49192 47575 49721 50354 54220
14407 54220 52474 48763 53058 53042 61726 60959 59014 58039 56231 63646 67950 66693 61078 57117 55419
14392 55419 58117 63540 63540 57579 55189 55737 54594 56971 58320 53248 46811 50280 61533 62111 57658
14377 57658 58905 57675 58182 57114 61573 56282 51037 46541 39390 41958 52259 58155 61490 59262
14363 59262 57657 58865 63293 63352 62471 65057 67535 69316 72772 72428 71971 69806 64989 63120 64832 63735
14347 63735 61590 54620 51060 53658 50752 49596 47991 42734 44373 49595 53801 52326 49848 48498
14333 48498 50430 47405 48011 53121 53489 50448 49785 51503 52178 49231 48762 56000 58405 54071 50430 48888
14317 48888 51001 54164 53246 55826 59260 61465 57406 54082 52388 49493 46975 47837 49568 52694 53476
14302 53476 51038 48337 48118 50783 54344 57083 62111 68026 62273 56927 60793 64602 63069 64393 63815
14287 63815 61038 56877 58745 63472 66424 69246 67526 65512 67516 64935 64191 65493 62917 63194 66912
14272 66912 68046 67918 71181 68600 70613 75277 77919 77260 73363 75108 75101 73481 69220 69514 67060 72778
14256 72778 78912 75415 74800 78942 77304 77456 75865 74638 75557 78563 82751 86959 85280 79954 81192
14241 81192 80271 79320 83930 85367 90022 98188 105932 111812 122811 134055 141498 148341 156336 165802
14227 165802 175885 184469 201320 231417 284922 365684 505530 736200 1033718 1314454 1511900
14216 1511900 1607424 1552956 1354902 1087020 821094 596289 435305 330597 269669 229358
14206 229358 197537 178800 168913 168470 170086 168029 166754 163036 158788 154724 151781 142049 126764 116375
14192 116375 112963 111051 113307 106176 97698 88256 85404 83404 81777 81759 76654 75142 71218 66587 70058
14177 70058 72909 72480 72039 74420 83425 79522 70479 68898 71515 68400 60953 58831 63965 72547 83017
14162 83017 92791 98697 104341 104891 105516 107117 107819 111467 106616 101437 92448 87955 82196 76322 75825
14147 75825 79991 86756 96967 99931 104991 108984 111934 110971 107373 104364 97013 101130 103257 99210
14133 99210 97934 98596 99343 103791 107342 109063 104277 100834 96930 94360 97981 99788 96656 94067 94552
14118 94552 96872 94655 96097 99297 96967 96061 95972 101518 101438 99921 101243 107143 105860 110117 106626 96241
14102 96241 97042 100820 108612 112586 112599 113916 110743 108565 105861 104968 102737 105319 108169 111142 113454
14087 113454 112505 118828 115869 107735 108616 107949 103053 100756 98507 101712 106428 107648 109890 118119 119824
14072 119824 121157 125518 127686 130344 127234 119973 120715 118227 113332 110807 108623 104476 99438 99945 108538
14057 108538 112421 116900 122692 122703 123130 130824 130062 126018 127914 124701 122237 120520 125648 128843 130050
14042 130050 138693 140840 139714 133344 127725 126146 116163 108702 105866 104293 105318 112033 120772 126671
14028 126671 130872 134291 129464 120959 119653 126658 132129 134459 138328 138431 139194 140739 140309 142616 143554
14013 143554 145610 149013 151292 155261 155597 158111 161243 167259 174281 177115 180369 186060 196538 208558
13999 208558 220472 236930 244252 256865 266303 271131 277592 278977 275835 257062 235837 209492 189405
13986 189405 172441 156723 148173 148617 148386 147257 138607 130083 126419 129370 130985 130738 133568 136963
13972 136963 142289 141580 148296 153931 156531 159007 159799 161288 167333 178207 189137 198531 212880 222011
13958 222011 227733 241028 271571 299771 333101 353814 352023 344327 332349 330565 351204 397517
13946 397517 460827 520434 564122 575672 555932 513300 473488 451201 451768 467753 480451 490118
13934 490118 500055 504904 506443 522293 555647 597056 643030 673054 672242 646315 611841 583443
13922 583443 576971 594954 632576 674114 700790 721463 729709 726917 719790 715411 725663 743794
13910 743794 761501 772061 778967 792839 814610 829924 836222 817842 784438 746646 714600 709470
13898 709470 725662 763916 821954 871964 897747 887986 849363 791811 739689 706502 696511 704632
13886 704632 726942 760556 798527 815413 805887 770837 722158 674944 638252 624201 630743 655465
13874 655465 697238 742934 752343 721958 700033 661625 605511 588340 597149 588905 592598 600380
13862 600380 601962 592532 565106 534137 509634 497368 491013 498513 514780 537534 565877 594690
13850 594690 622116 643679 654708 659405 660396 645035 628499 606173 577793 555451 538468 519811
13838 519811 508104 505955 498735 496388 500252 510428 522328 541556 564720 592510 621659 644741
13826 644741 653726 655778 667008 694925 752848 852587 1001606 1189389 1387429 1575361 1706371
13815 1706371 1749968 1712153 1609681 1478786 1373609 1322808 1346500 1450381 1612297 1794664
13805 1794664 1962506 2071872 2096871 2037980 1903998 1728352 1556182 1419824 1330180 1273981
13795 1273981 1240885 1234404 1240556 1250124 1258834 1275953 1309672 1368996 1456579 1557511 1642199 1698752
13783 1698752 1750729 1815791 1905946 2013101 2101716 2155848 2180222 2197785 2212774 2245534 2308719
13772 2308719 2393444 2499065 2626966 2780928 2964714 3178600 3438527 3762148 4167880 4684956
13762 4684956 5360524 6235744 7304381 8524991 9844748 11239361 12678070 14112256
13754 14112256 15573446 17202435 19230278 22013655 26150943 32557004 42778320 59792933
13746 59792933 88886221 134659798 189895064 237290752 270431970 286231054 273219110
13739 273219110 234810002 186300087 137402912 95976343 66952672 48569215 36967326
13732 36967326 29401119 24313989 20842361 18454175 16763205 15464124 14303409 13128183
13724 13128183 11867596 10532569 9222549 8036235 7041501 6249451 5636676 5166400 4816268
13715 4816268 4553919 4348709 4171479 4006726 3839629 3686671 3544858 3379526 3161947
13706 3161947 2894531 2605805 2322898 2066959 1849234 1666860 1520445 1405939 1302543
13697 1302543 1206636 1125628 1050848 976811 912429 868769 841294 819533 798029 764513 715551
13686 715551 656114 590960 532239 488336 452379 418256 386277 361868 346895 336307 334550 329059
13674 329059 323826 323304 326154 334893 337924 329961 315394 303471 292716 283999 280740 279620 283885 288986
13660 288986 298009 299045 298732 299195 293281 286005 272267 262968 261349 254671 251049 250059 246056 237047 231248
13645 231248 223310 213763 204090 193023 186149 186245 183435 178672 178270 186590 194529 203068 218228 242680
13631 242680 272514 297651 325560 353532 377102 379043 367520 348710 321063 291920 264606 246138
13619 246138 233158 229994 225950 222322 219608 216963 203867 190892 180422 175005 172282 175715 187907
13606 187907 201766 217826 226438 234681 246468 258309 267889 267759 261380 257468 251320 239688 228115
13593 228115 215510 197093 180690 166027 155531 151863 157432 171666 200215 229328 259001 285465
13581 285465 312776 333524 350230 364985 363851 356764 351211 341264 326010 304160 287263 271317
13569 271317 257344 247495 240557 228860 221386 213136 212565 210652 199025 193227 187034 181157 171430 154748
13555 154748 137235 134056 153246 172463 199926 233667 263646 283286 292873 302678 309255 308369 299325
13542 299325 286164 265790 250102 242997 242790 252782 278292 305637 317960 314348 297649 275967
13530 275967 252295 230224 216240 210471 209360 202214 189505 179428 174501 175524 185263 195866 207380
13517 207380 222624 237146 243850 253134 266502 279111 289428 301799 317342 329944 340258 345370
13505 345370 348837 359360 377277 397945 414667 425724 431061 423977 411413 403294 386251 365142
13493 365142 343700 319789 291087 275713 263380 258474 252949 246131 246452 254754 256603 256811 256973 263605
13479 263605 277912 293800 302142 306041 312059 316008 314758 317329 320200 319979 325788 338586 348651
13466 348651 360727 381605 419608 470758 510890 520608 517471 497161 476220 453922 445121 439326
13454 439326 429280 419058 411984 399748 394839 396288 399550 398204 402484 408298 409671 411499 419614
13441 419614 438242 457885 471229 483738 502008 522599 533365 529188 519390 504169 481422 468898
13429 468898 462391 457436 463948 474491 481833 485244 491676 497035 498765 507136 512433 510759 509004 515862
13415 515862 518101 527097 540917 554687 559896 571609 587278 597821 607552 620782 635767 654458
13403 654458 677177 702359 732220 773603 812032 843301 860907 861848 853517 842172 832697 826111
13391 826111 828561 833739 847363 856919 865261 874752 876991 887227 907253 925615 938191 950979 958514
13378 958514 972547 995075 1017182 1042402 1062613 1086240 1110778 1144713 1180738 1221044 1259333
13367 1259333 1310213 1374213 1438843 1511505 1589564 1682391 1776507 1860053 1934647 2008602 2085721
13356 2085721 2170482 2263393 2367389 2494393 2650029 2846714 3096480 3400304 3753001 4118404
13346 4118404 4464952 4802010 5176384 5631774 6195449 6856379 7590021 8419285 9443701
13337 9443701 10825528 12778039 15601680 19732783 25944985 35560980 49854968 67408540
13329 67408540 82282331 89191056 88992850 86228256 85786663 89610031 93359338 91288452
13321 91288452 82481349 69267332 54857860 42461679 33644720 28105177 24860973 23092825
13313 23092825 22202770 21627252 21111559 20785194 20812386 21320312 22202577 22976755 23479771
13304 23479771 24036975 25090052 27181610 30714818 35973652 43931234 55782986 71074843
13296 71074843 87592752 103984674 119156498 131373112 141167736 150171546 156734771
13289 156734771 158548668 156166221 149435946 138968074 127059964 114650389 100863985
13282 100863985 85752215 70919112 57723463 46809761 38499675 32688127 28856966
13275 28856966 26530165 25251426 24438743 23693284 22991319 22422812 22117066 22133386 22370872
13266 22370872 22736849 23339074 24393685 26308676 29741068 35599605 45292481 59943360
13258 59943360 77444797 91363853 97065397 96140263 93300406 93191022 96606018 98363559
13250 98363559 93513567 82157004 66995489 51406953 38391586 28979495 22550683
13243 22550683 18151034 15060374 12812146 11117632 9812082 8781204 7950091 7277362
13235 7277362 6747390 6313587 5917680 5516655 5085887 4635735 4200636 3815649 3500985
13226 3500985 3249570 3047788 2880848 2724499 2573627 2417985 2258656 2099823 1961782
13217 1961782 1841016 1724647 1624120 1527798 1434069 1350503 1270295 1196516 1126764 1065737 1016985
13206 1016985 975353 924495 864404 804979 757005 711475 667001 629059 597701 569015 542711
13195 542711 512302 487239 466877 450364 441832 435755 434298 435270 430931 416297 390291 357362 332468
13182 332468 316295 305588 290929 270396 259841 255261 240464 231252 233365 238622 243025 251964 254361
13169 254361 245820 238786 230927 221560 213781 212643 206259 200568 191457 179719 169169 163659 151719
13156 151719 138201 125655 115642 110974 109503 107829 102461 99890 102682 102450 103337 92208 87568 82924
13142 82924 72851 66162 54321 50280 54271 60038 64001 65253 64440 66038 75000 88066 101314 108492
13128 108492 108005 107218 118648 138213 146463 144158 148285 152091 157798 165487 164398 153691 138082 118977
13114 118977 104915 96632 84152 67985 52980 38284 25532 9854 1637 -3837 -6375 -6952 -2544
13101 -2544 161 4738 12532 18561 22024 28414 37783 38244 36839 35607 37166 31003 18547 6833
13087 6833 1297 1438 1585 -2514 -8465 -9908 -7446 -11920 -14958 -13532 -7871 -1506 -2683 -9478 -6064
13072 -6064 -6415 -11003 -14423 -21008 -22112 -18061 -16066 -5219 7443 12148 15714 16228 18380 17755 20112
13057 20112 24448 20383 12225 4493 -286 -3564 -4903 -4191 -11902 -17765 -19236 -17051 -13424 -11898 -6685
13042 -6685 -1530 -4556 -3093 -5432 -7708 -6065 -12623 -11858 -7572 -9599 -8525 -4834 -3892 -7749 -9638
13027 -9638 -9739 -14475 -16039 -16651 -11474 -10754 -13716 -15908 -15262 -13676 -11488 -14581 -16568 -20759 -18142 -18433
13011 -18433 -20039 -20092 -14810 -8980 -13210 -19035 -18219 -14526 -11352 -9197 -9595 -11621 -11267 -9810 -9897 -10944
12995 -10944 -16399 -18712 -21131 -21515 -24670 -25648 -25144 -26903 -25804 -23089 -20409 -12884 -7531 -7297 -10999
12980 -10999 -13235 -9672 -3192 -1463 12387 32186 62443 97613 140152 180820 212843 212706 195235
12967 195235 167575 130335 94005 63707 41437 30963 26106 25232 22758 19730 14930 8647 10262
12954 10262 11570 15298 21607 21401 27411 36543 45107 51260 53329 53255 55665 58415 52666 52296 53954
12939 53954 57862 69022 77022 88286 98032 106411 120543 161356 218281 300596 390920 460637
12927 460637 493526 478264 415147 331954 249876 185976 133865 97163 77819 64578 54309
12916 54309 46690 33122 26431 28047 34122 44820 49197 57347 67017 72014 85496 106746 115570
12903 115570 113608 108270 96848 84785 78737 81871 87757 99530 110295 118991 126202 126846 128210
12890 128210 134096 155400 188921 226598 266670 281655 274368 240854 195761 151237 113956 89871
12878 89871 72799 59263 53498 52567 56717 60310 68463 86354 112184 142926 188480 252459 337465
12865 337465 422724 480194 502354 499447 491390 495315 506033 498942 469776 417389 354946 292562
12853 292562 242383 211630 189010 166469 150684 139786 132093 121718 114072 109557 113670 109967
12841 109967 103809 106963 119376 133067 148267 165789 193729 246016 315480 399413 489800 575800
12829 575800 651344 709361 749863 780961 799694 801818 785225 740915 677791 607097 534389 456676
12817 456676 380783 310799 251218 202417 163601 132899 106892 91221 87643 90272 89499 84811
12805 84811 88188 89288 88327 93884 97972 103989 114381 126900 150252 190051 253058 337789 413857
12792 413857 460111 473827 459498 450927 465542 475703 463741 420635 352188 280619 211047 154220
12780 154220 109721 79465 54757 41118 30944 24566 20202 10807 7155 10332 6302 -4412 -6205
12767 -6205 -593 472 -5135 -13834 -19056 -20751 -18423 -14624 -16375 -17965 -17185 -16328 -22278 -20275 -9654
12752 -9654 -7400 -11215 -16115 -20378 -20532 -22870 -27339 -24901 -20365 -19540 -17815 -16883 -19867 -21604 -20719 -23344
12736 -23344 -26303 -34854 -35634 -30381 -27538 -29639 -32352 -34230 -34808 -33894 -32836 -30044 -30232 -36428 -33162
12721 -33162 -27801 -23674 -27604 -30081 -28870 -30696 -34804 -37533 -31866 -29947 -25119 -25539 -24691 -27939 -31442
12706 -31442 -33257 -34979 -33737 -31612 -30486 -27129 -25525 -28253 -31095 -27897 -22624 -26855 -29423 -31483
12692 -31483 -27924 -22464 -25117 -26534 -24294 -24928 -22518 -24722 -29442 -29143 -30649 -30138 -28042 -27596 -30536
12677 -30536 -29335 -28143 -31062 -31394 -27692 -21752 -22001 -25977 -32464 -36167 -36674 -28580 -24882 -28255 -27752
12662 -27752 -27776 -27171 -30368 -29084 -27716 -28114 -29152 -31851 -29170 -21981 -19178 -22220 -24688 -25697 -25874 -26797
12646 -26797 -23578 -26708 -31017 -31615 -31789 -31295 -31808 -30728 -28219 -30251 -31263 -34383 -36520 -35745 -37558 -36367
12630 -36367 -33580 -35717 -32554 -22826 -23281 -27057 -28488 -30967 -35076 -35615 -30011 -27056 -29153 -26031 -22789
12615 -22789 -18910 -20922 -26475 -29026 -32984 -36061 -31354 -24871 -17327 -8444 -6614 -8983 -11874 -21264
12601 -21264 -26284 -27057 -31104 -32836 -32268 -27945 -22189 -22348 -28924 -29506 -31224 -34409 -31631 -30987 -36397 -34994
12585 -34994 -32776 -33946 -33578 -32526 -32559 -30000 -27221 -27511 -29931 -33450 -33208 -31228 -30220 -34247 -35650 -37616
12569 -37616 -34523 -31050 -26273 -25695 -33882 -30340 -24595 -22896 -23151 -21925 -25794 -26120 -23273 -26385 -29559
12554 -29559 -30215 -31954 -28614 -23832 -28740 -33545 -33511 -27656 -29448 -31368 -28630 -31175 -36293 -39286 -37310
12539 -37310 -32492 -33200 -36210 -35431 -33773 -29752 -28500 -29995 -31055 -27223 -25668 -25925 -27757 -30893 -34266
12524 -34266 -33036 -34323 -37089 -39465 -33507 -27878 -26986 -30569 -34916 -33823 -31123 -32109 -34334 -30508 -26627
12509 -26627 -26679 -27657 -25258 -30297 -32942 -30157 -27442 -27221 -27135 -19667 -20188 -22267 -24564 -27169 -27166 -25961 -26810
12492 -26810 -25821 -17276 -17290 -26540 -33741 -33975 -27198 -24827 -23372 -26893 -24769 -25138 -27879 -30326 -26052 -24401
12476 -24401 -23037 -26156 -30345 -28222 -30193 -28956 -21113 -13571 -12631 -16566 -20283 -22961 -22206 -22594 -18479
12461 -18479 -15603 -16568 -13207 -8429 -2769 896 -4244 -9060 -9351 -11957 -18790 -17729 -17905 -23112 -21018
12446 -21018 -18419 -19856 -19991 -21819 -21799 -19881 -14076 -11689 -10761 -11240 -17602 -22727 -21993 -18861 -17826 -15425
12430 -15425 -15609 -16127 -16379 -19414 -17582 -15921 -13547 -13217 -17377 -20168 -13428 -6803 3599 4382 2959
12415 2959 4400 232 -9533 -13831 -16288 -15013 -14694 -17987 -21868 -18248 -12679 -10328 -11805 -16487 -15916
12400 -15916 -16349 -14312 -18982 -20714 -20583 -18089 -11990 -10746 -11211 -12583 -13982 -15800 -17647 -14376 -11487
12385 -11487 -15178 -13226 -13531 -17050 -17830 -17622 -16260 -8803 -8765 -7205 -7369 -9995 -11954 -14247 -20953 -23618
12369 -23618 -25046 -27693 -28798 -29904 -31847 -33419 -33904 -37589 -35160 -30221 -25520 -24053 -26659 -22060 -17919
12354 -17919 -17224 -20283 -23781 -18988 -19039 -15693 -11260 -6458 -7628 -8641 -9359 -11676 -12410 -17180 -19286 -19418
12338 -19418 -19117 -20968 -17774 -18591 -20977 -19876 -15647 -8960 -7336 -9108 -9731 -5616 4182 11500 13984
12323 13984 14946 14514 17016 23738 27698 28445 22547 19389 22377 26668 24871 28041 33879 32445 27942
12308 27942 28168 26755 23492 20119 17688 12957 11723 7367 11220 20402 25799 33106 33315 28237 26421
12293 26421 27380 31971 36236 34192 39158 53999 61456 69172 76942 81568 86349 88667 98264 107229
12279 107229 110268 107090 93536 77925 69231 62691 61404 59730 61344 60410 62955 68727 68008 67564
12265 67564 61604 59003 52176 48132 47510 43023 40291 39050 39856 44500 44944 36708 31329 26071 26188
12250 26188 30202 36600 42202 48180 48351 50272 51577 59262 64293 60927 53893 43894 33400 30032
12236 30032 27385 20677 12950 14883 19209 22390 19389 16779 13457 12891 13909 16287 16321 19392 29416
12221 29416 48283 62622 76950 77183 71022 59986 44965 26223 17581 13468 12734 11961 11196 4594
12207 4594 3886 3705 187 -1489 -1007 -4382 -6642 -10577 -11912 -12037 -12068 -13706 -12101 -9930 -7350 -7913
12191 -7913 -12202 -16671 -21276 -15163 -10729 -8446 -9825 -12881 -15628 -11775 -9896 -2688 6533 22559
12177 22559 43716 65907 76514 73257 64120 44179 25961 11028 4516 1549 737 -3538 -6807
12164 -6807 -5972 -7348 -16742 -19766 -14841 -14871 -13916 -16885 -17309 -13922 -13501 -17305 -25064 -26424 -23654 -24458
12148 -24458 -25964 -25240 -24063 -17217 -8108 -9789 -15883 -17549 -12107 -10544 -7826 -1695 3240 11469 20197
12133 20197 27220 32034 31010 25268 16544 6897 -4338 -10040 -13116 -15516 -12425 -8394 -11136 -9070
12119 -9070 -15086 -21160 -18196 -21701 -18374 -15376 -16591 -14940 -12155 -9690 -11661 -16944 -20298 -18450 -12873
12104 -12873 -12451 -6818 -1760 -8230 -13865 -7560 -1578 -2240 -2778 -1910 1049 13917 17573 18922 14445
12089 14445 9124 7585 9312 -1010 -7413 -7139 -13496 -17275 -15182 -14186 -18924 -14310 -10763 -10787 -13036
12074 -13036 -7823 -6087 -9110 -10957 -9802 -11888 -17564 -17955 -22646 -24844 -21940 -16591 -11200 -8322 -10230
12059 -10230 -9810 -11039 -12402 -11573 -10410 -10038 -10202 -7417 -2473 353 3223 1101 -1921 -6623 -10401
12044 -10401 -11441 -13348 -9040 -11607 -11452 -10146 -9460 -15147 -14156 -13020 -12097 -8307 -8583 -8569 -1692 -3210
12028 -3210 -2346 847 2009 -4532 -7016 -9923 -10433 -8387 -6689 -7372 -7706 -7647 -9543 -8924 -9788 -9446 -7827
12011 -7827 -8311 -11246 -13082 -10401 -13860 -16401 -14831 -11008 -8613 -3463 -1354 2070 8417 11407 12603
11996 12603 13765 16078 15910 17105 23200 35600 43902 56448 63028 72359 79998 85846 86155 80225
11982 80225 72971 74198 80578 85107 93341 98216 99668 100579 95529 82197 74534 66064 57082 55688
11968 55688 53579 41397 32530 34239 34671 32114 22180 19573 16275 13495 15521 15215 20257 21063 20607
11953 20607 23490 26517 31244 39421 53202 62893 67086 68222 70879 73023 77967 81172 80628 78754
11939 78754 80332 83802 87746 92462 97853 98847 91017 77409 67460 57296 51099 42535 37021 33197
11925 33197 33550 33565 30845 19792 10193 6393 2680 -4319 -6414 -9675 -10882 -12957 -15833 -12160 -2231
11910 -2231 -851 -5433 -9980 -9924 -9701 -15132 -17973 -21481 -27400 -27405 -19811 -12209 -7255 -8438 -9227 -8381 -12299
11893 -12299 -15780 -12843 -11116 -18931 -26904 -25990 -23391 -22036 -19249 -13075 -14196 -16222 -14993 -15012 -17027
11878 -17027 -16260 -18470 -19915 -22202 -22403 -21836 -23020 -25284 -21792 -20400 -22024 -21331 -22471 -16628 -10472
11863 -10472 -10894 -15472 -16518 -17041 -23418 -26315 -24277 -19824 -17264 -16899 -12427 -13800 -22081 -25087 -18881
11848 -18881 -14593 -16111 -22841 -25242 -20800 -24401 -22283 -21605 -22443 -20855 -20790 -23754 -22449 -23119 -22780 -21976
11832 -21976 -18218 -13656 -10585 -15113 -17332 -18850 -19137 -16339 -16393 -18307 -14797 -18031 -24357 -18945 -16056
11817 -16056 -20550 -17902 -17069 -12208 -5384 -3818 -10978 -12171 -11563 -14061 -13215 -12890 -14943 -11347 -6851
11802 -6851 -9609 -16332 -17098 -14493 -12581 -17348 -19117 -17058 -14430 -10573 -8166 -13835 -17709 -16119 -18063
11787 -18063 -19245 -17184 -19373 -29215 -25983 -19121 -17794 -16294 -15903 -15613 -15102 -15030 -12523 -11082 -14236 -16176
11771 -16176 -9546 -3584 -6224 -10127 -11087 -16597 -18709 -13319 -5554 -7826 -11887 -13310 -10845 -12498 -14358
11756 -14358 -13136 -12825 -13415 -14359 -14604 -15278 -19720 -19630 -16052 -10333 -5437 -5786 -7475 -8788 -5814 -4216
11740 -4216 -6469 -9578 -13336 -14532 -15066 -11424 -9658 -12984 -16055 -14180 -12469 -16366 -11368 -8743 -10667
11725 -10667 -15852 -12378 -8847 -7463 -6944 -7559 -8922 -12330 -14687 -14563 -15577 -17863 -20300 -19335 -17388
11710 -17388 -19873 -20657 -19572 -12529 -10368 -11802 -11382 -9479 -13776 -16949 -17417 -12300 -12986 -9581 -9994 -11940
11694 -11940 -13014 -10443 -19092 -20185 -19956 -17776 -11627 -8151 -6052 -8257 -13204 -11413 -8299 -6009 581
11679 581 178 -2840 -1914 2274 -3652 -5917 -4823 -5163 -3628 -7070 -8944 -12176 -16184 -13667 -6159 -2916
11663 -2916 -2572 -2302 -188 2296 -4298 -9641 -8485 -8032 -8983 -9910 -11521 -10160 -11781 -13103 -17028 -18293
11647 -18293 -16284 -11613 -9528 -14528 -15626 -15029 -15754 -18336 -22510 -25478 -22850 -18715 -12946 -9684 -10790
11632 -10790 -11334 -11217 -9331 -8214 -10078 -10865 -12351 -12322 -13692 -13435 -15514 -11000 -721 2469 2080 824
11616 824 -1598 -6027 -6607 -3510 -1090 -1294 -927 3601 3501 2433 2134 1391 2889 5800 4020 -406
11600 -406 1758 4367 6152 5897 -679 -3177 -6102 -5039 -7214 -6225 -5653 -8557 -13292 -14378 -15487 -13600
11584 -13600 -8411 -15126 -17117 -15904 -11371 -7667 -10708 -9682 -7559 -9927 -7943 -7450 -10049 -10612 -7408
11569 -7408 -4855 -9618 -12049 -13207 -13692 -10163 -7314 -5305 -3973 -3902 -4958 -4237 -5565 -4045 -5639 -6656
11553 -6656 -6208 -5744 -5770 -13329 -14084 -10131 -11127 -7663 -8071 -8322 -13891 -13277 -11146 -10085 -7841 -5538 -2849
11536 -2849 -3710 -2591 -5555 -10530 -7234 -2457 -6426 -10122 -7701 -5047 -3055 -5174 -1308 -1857 -8076
11521 -8076 -8950 -8064 -10912 -7461 -5097 -9224 -9148 -10231 -14208 -12166 -12518 -12655 -12701 -18115 -18175 -11031 -10073
11504 -10073 -11139 -13163 -16362 -16392 -14885 -15745 -14456 -16753 -15320 -14013 -12176 -9503 -6123 -6355 -3382
11489 -3382 -803 -7059 -9646 -8349 -7453 -8456 -12837 -16619 -18818 -21613 -20868 -17536 -13674 -12716 -10126
11474 -10126 -8437 -7869 -4484 -2461 1009 1384 4764 5189 7731 1932 -8479 -11214 -15955 -16938 -11411
11459 -11411 -10327 -8728 -4111 -34 2093 -278 -5731 -3639 -6419 -12193 -14755 -12771 -15540 -17516
11445 -17516 -20719 -15538 -8668 -7304 -7738 -11286 -12702 -13759 -10539 -8156 -9252 -7391 -9404 -12658 -16866
11430 -16866 -18601 -13819 -10480 -11252 -14009 -8461 -5981 -5194 -6672 -6844 -7029 -6043 -8682 -8596 -11236 -11701
11414 -11701 -9526 -8897 -3555 -5952 -13111 -13244 -12072 -13407 -16322 -13337 -11448 -5042 593 -338 -2844
11399 -2844 -4559 -6909 -9021 -10202 -9972 -1251 -402 -2139 -895 251 -3501 -6272 -1429 -5704 -11164
11384 -11164 -10942 -9154 -5078 -4427 -2584 -3123 -5854 -2684 -2445 -1991 -4169 -4566 -6320 -2164 387 -342
11368 -342 -6358 -8134 -11582 -11674 -6079 -3993 -4284 -3271 -5521 -4812 -4756 -7893 -4170 -3005 -4401 -10974
11352 -10974 -12727 -8577 -5784 -7852 -7906 -7258 -7263 -9142 -5939 -3789 -1801 -2791 -4232 -1547 -4304 -5351
11336 -5351 -11044 -16510 -9296 -5153 -5272 -4235 -5242 -2688 -5467 -10193 -12067 -8904 -8260 -8384 -9341 -10456
11320 -10456 -4071 -403 -1184 -6302 -10216 -9477 -9936 -9175 -8976 -8787 -7689 -5094 -169 939 663 -977
11304 -977 -2551 -3845 -1687 -4204 -5279 -5877 -6175 -3575 -1192 -1313 9 -513 -3277 -7350 -8073 -4864
11288 -4864 -1350 -2768 1419 9487 4738 998 5018 9322 14215 21469 21571 21239 28683 36455 38960
11273 38960 40116 41326 39587 37471 38134 28676 23390 16684 11586 6805 7872 13754 12431 7516 1635
11258 1635 -5316 -7827 -6760 -7180 -5425 -2290 -3388 -2042 -1186 3119 2572 1339 2227 6465 6962 7601
11242 7601 5805 9419 13348 16039 21624 24618 24541 24647 27107 34731 46343 55072 68826 83715 91507
11227 91507 92338 93093 85203 72004 64282 54219 47966 42784 36494 25644 20142 16655 11572 7971
11213 7971 6949 7225 8681 9273 2559 5553 7872 8231 4497 2147 2587 4790 5636 4403 6393 9708
11197 9708 7971 1366 -3948 -5057 -4903 -1902 5128 10028 9707 9678 13974 22459 28824 33918 39236 44888
11181 44888 48122 55246 57618 55903 51545 46147 35492 27745 20751 12248 10762 5654 2303 3059
11167 3059 7024 2417 652 4801 5258 1226 2493 4047 4434 7536 10419 9415 10347 11535 8694
11152 8694 6657 10540 9394 5316 5081 5665 4755 2181 -3705 -2241 1396 40 -3113 -475 -3935
11137 -3935 -4332 -2354 -1614 -5058 -4331 2454 7291 7919 7087 6458 5023 4430 4128 4942 1154 -2796 -588
11120 -588 -102 -2935 606 4541 5290 1051 1652 7973 10514 6281 9597 14259 9238 4848 4213 3904
11104 3904 8000 9462 4965 1394 2144 10819 12591 11206 9516 7291 5915 4814 4854 9120 10151
11089 10151 9086 6761 4738 6469 5540 2492 1736 6119 7746 6466 6071 8211 11887 12651 7106
11074 7106 3972 3863 5220 8527 7338 4584 7795 10767 11459 8280 3872 5560 10539 10466 11932 10114
11058 10114 9588 8107 5277 1315 7593 5414 3158 8353 7829 1460 355 -180 1305 2027 6079
11043 6079 9791 13161 5799 1215 3473 8961 10606 4731 3247 847 122 2070 3210 7325 7468
11028 7468 3996 3504 4099 671 672 4644 8556 10050 8489 6136 7816 6505 7296 9515 7701 2829
11012 2829 3142 5865 7492 12755 11066 12595 15964 22782 28071 23751 13003 9391 11117 10718 11964
10997 11964 11782 11651 12039 14642 18245 16344 7768 11040 11624 8338 11302 8187 4778 2536 2355 3076
10981 3076 6304 9164 10520 9641 10421 9569 8917 9366 11791 10272 11902 4141 1154 3429 2112 8481
10965 8481 9734 6236 4137 8418 15824 13789 8340 7958 8507 6895 7928 12771 12376 7962 8972
10950 8972 6461 2086 1273 5962 7800 5543 5826 9078 11025 11452 9231 10172 13718 17668 15256 17318
10934 17318 17018 18694 21418 22252 22379 14488 11110 15165 15553 12191 13362 18148 23229 22313 18588 12401
10918 12401 15166 19201 18349 12023 10983 11236 8076 7223 12427 18187 20731 14265 7427 12684 17626
10903 17626 17766 15855 20195 20967 24653 25708 23544 20562 20674 16842 14022 9889 13123 14615 15936
10888 15936 18123 15102 18968 18155 15341 16736 17624 19512 23779 24841 22025 20800 18535 15199 14660
10873 14660 21526 22498 20529 23980 24609 19520 15454 20773 27628 27639 25795 27671 29510 35129 33534
10858 33534 33383 31037 28690 27427 23342 22770 27448 28622 28102 30649 29446 30418 35790 38611 35031
10843 35031 28288 25052 23816 23107 22123 19651 18456 23945 27953 30812 31389 27694 27388 23570 26753
10828 26753 32901 29495 29979 26524 27278 27494 26611 28379 28589 27946 25926 23165 27806 28569 30284 31665
10812 31665 29607 33148 29109 24668 31030 36268 39265 41394 41939 36643 36242 34329 29354 23992 29285
10797 29285 35012 36159 34549 28644 32281 30718 34473 36374 35689 38208 35888 36445 36480 37161 37386 39334
10781 39334 39621 39976 36447 37564 36641 37724 39252 40454 34862 29023 25686 22619 25358 29884 28597
10766 28597 29112 31705 36041 37033 34677 35338 35381 34133 35924 39308 41196 43629 41560 41655 38141 39717
10750 39717 42108 43839 40007 40191 45386 51212 54311 50084 46753 49112 50234 53961 51863 50250 46926
10735 46926 51665 49971 46740 50544 53219 49308 49771 49495 49490 49512 44280 39476 41358 43223 42526 43507 46247
10718 46247 44342 40182 38958 37083 37898 38185 36431 37449 41915 42730 42365 40461 39765 45064 48927 44988
10702 44988 45978 45785 41487 46503 51062 51762 44486 43494 50654 48577 48250 47337 48933 51261 51407 47519
10686 47519 47332 43978 38894 39201 39359 40364 46179 43728 38199 38690 43631 40307 34436 35539 34504
10671 34504 34704 40959 43627 46002 44225 40268 37949 36340 40322 38000 36754 36876 35009 33744 37241
10656 37241 39172 37806 40066 37885 39785 40076 41899 45411 45759 48474 51390 52722 52165 48319 46407
10641 46407 48610 48524 41934 41116 43410 41733 44805 49087 45051 35595 35131 37965 41763 43196 47085
10626 47085 48480 43221 35760 35269 40687 41756 42522 49237 48837 45010 45116 44224 38955 36148 41639 48362
10610 48362 50273 49534 51987 51110 49868 48946 54404 57610 55288 49873 45306 43930 46588 49485 52534
10595 52534 49014 48508 46232 45484 42407 41109 47548 45405 42349 44301 41723 38574 41977 42722 40654
10580 40654 38490 35358 33817 38252 40820 45762 48920 50158 46245 47804 51478 55731 59788 56298
10566 56298 52447 56210 65836 70703 66312 61794 59028 53853 53038 52325 59365 64932 66881 75099 83688
10551 83688 96890 113533 130778 137550 139760 138044 128170 113845 99913 92091 80115 68179 67785
10538 67785 70576 75161 78174 82573 88381 94796 97561 105131 106510 100119 99355 101327 102508 100642 100980
10523 100980 95140 95786 98332 106780 128949 150387 179900 205640 228987 252643 278784 301805
10511 301805 309776 310016 298359 278215 242096 205445 179868 160243 146127 139469 136442 135951 131657
10498 131657 131105 132876 135601 136698 138433 139424 138635 137063 132767 129443 136174 139455 150298 167629
10484 167629 185849 207343 221326 239607 261294 302527 355181 408417 442631 447409 417958 373003
10472 373003 331250 300691 276898 250979 228495 204254 184993 167491 147733 139926 139148 144472
10460 144472 146392 140001 135768 137457 137835 139905 145770 145765 142576 137599 137831 146068 156066 175296 201251
10445 201251 221464 241795 258351 279925 303601 309278 314119 311773 298667 270325 237803 204315
10433 204315 177572 153245 140140 132638 127016 118689 112315 113085 115301 115831 112987 116526 118847 119855
10419 119855 114873 112291 109326 110485 112648 113793 116034 121828 128553 134010 144244 155099 164103 176770
10405 176770 193863 206489 205090 196123 180694 166761 163805 162285 158849 148411 141944 136334 137520
10392 137520 131154 120563 114280 118176 127025 129449 127548 123417 121004 118281 117996 120012 118515 123497
10378 123497 128282 133582 132187 125763 121347 124176 128000 133863 136795 138362 140972 146722 149141 152305
10364 152305 155590 156113 158905 164298 162171 159454 164041 177687 195854 219230 244469 270434 298780
10351 298780 327783 353359 369490 378217 378837 378800 369845 348055 326091 298266 276500 260024 244619
10338 244619 232529 219729 210453 203143 196467 193181 189845 192761 193938 196738 199677 201892 196320 191144
10324 191144 188667 184796 180992 184447 185156 184372 186282 188749 190870 194119 196959 197520 194120 192622 194698
10309 194698 196002 195921 194089 196047 202594 209016 216935 226752 228434 232704 232833 232282 233405 229645 222680
10294 222680 221798 227097 237301 244159 246858 245510 250634 255504 258715 266005 274549 287197 294148 291664
10280 291664 280073 262578 248215 243701 232885 228039 234003 234772 237786 241285 240830 246164 252389 254072
10266 254072 254674 255930 257354 258041 256837 254665 253987 260095 266554 270728 281538 294916 302383 304309
10252 304309 304805 310886 314994 324563 334962 347798 347692 346484 349411 347618 340089 336250 334386 324855
10238 324855 318580 314177 311669 314897 316732 323799 336571 336994 333896 335774 343455 351955 358105 362735
10224 362735 369162 369272 364745 361278 358812 361188 367055 369105 371927 383987 395985 412307 435808
10211 435808 458379 467520 471977 481015 487876 489541 503519 521961 528204 526250 519996 511578 504001
10198 504001 498100 504173 515443 531755 553862 583605 616662 646993 681862 721960 759049 786276
10186 786276 804848 816748 831987 833183 826958 817605 816681 817341 824352 835352 848924 862425 883159
10173 883159 912942 944681 976127 1021550 1085388 1154187 1215777 1279860 1361117 1467625 1604088
10162 1604088 1779359 1985557 2233134 2534215 2915922 3434010 4179220 5285836 6977289
10153 6977289 9532820 13007530 16656317 18978013 19095973 17347351 14519935 11477820
10145 11477820 8923017 7089177 5867675 5077846 4574232 4282298 4155024 4177953 4393481
10136 4393481 4871019 5584578 6258563 6570776 6497512 6186571 5822038 5586395 5580382 5813770
10126 5813770 6280985 7004804 8060957 9584670 11839381 15231587 20049527 25779169
10118 25779169 31195886 36086938 41129760 45967923 49155516 49967672 48742113 45469256
10110 45469256 40158515 33872478 27698164 22241430 17987539 15151977 13572955 12871792
10102 12871792 12535801 12261433 11948705 11554205 11240517 11189607 11341448 11402235 11257476 11046713
10092 11046713 10978773 11288751 12237407 14080041 17085535 21242298 25673853 29027051 31245149
10083 31245149 33553820 37535185 44894680 55976796 67444978 73847305 72921219 66213912
10075 66213912 56663748 47635750 41168102 36694629 32818036 28771150 24471017 20337665
10067 20337665 16856614 14277833 12622841 11774194 11480786 11338513 11080734 10768292 10569213
10058 10569213 10628586 10972030 11400127 11602701 11559513 11530036 11818381 12752595 14711753 18036428
10048 18036428 22673015 27642339 31972409 35913181 39901938 43442284 45581680 45868066
10040 45868066 44549041 41614121 36841062 30973812 25010907 19559090 15112071 11872150
10032 11872150 9630768 8079001 6981018 6198603 5667175 5373670 5332188 5550920 5889940
10023 5889940 6037103 5837763 5367605 4776380 4218552 3822675 3609448 3560420 3648511 3875295
10013 3875295 4292120 4973726 6057971 7760924 10272662 13399727 16166278 17328168
10005 17328168 16522857 14273570 11366123 8570990 6365359 4808719 3746462 3018672
9997 3018672 2509001 2135490 1834092 1589746 1381120 1206953 1061468 942237 847225 763780
9987 763780 686900 620709 561891 506165 458649 419987 390071 363950 335439 312762 293607 272387
9975 272387 252779 230588 216053 202561 186622 177052 157868 144901 134665 130944 133391 124145
9963 124145 120704 116625 112984 105971 98560 94565 94006 88598 82661 79480 80615 82322 83543 76936 73316
9948 73316 80534 87206 90285 92304 90038 80821 70368 57730 50040 50870 51231 52116 52173 58624 64532
9933 64532 64842 70400 70056 61672 64788 71667 69762 63312 58643 57324 56262 54085 55644 62053 65823
9918 65823 59341 49169 46733 45185 45239 44674 50877 60962 69548 70598 63437 52203 41698 39245
9904 39245 44113 55665 65136 67629 58327 55850 51719 42211 34873 30910 22333 14502 6310 1912
9890 1912 4978 6244 17351 31430 57011 77000 83781 83941 81137 68289 53079 40531 43564
9877 43564 46084 49036 61541 79196 77498 63594 49370 26228 -2810 -20109 -25136 -25890 -21004
9864 -21004 -14090 -3806 5261 9128 13471 9127 -770 -7041 -9868 -6635 -9652 -11506 -956 3294
9850 3294 4453 3308 5088 12601 14177 9436 1508 -5911 -9565 -9583 -6578 -1910 -738 -2204 3792
9835 3792 4152 7408 9726 6526 5805 3075 7256 5421 -1396 -6633 -7793 4845 5256 1575 1556 -1020
9819 -1020 -2618 -6876 -3633 -4053 -6837 -2240 -2232 1611 2396 3862 5254 -1580 -10816 -7597 -4088 -6303
9803 -6303 -7570 -10418 -9027 -10020 -11204 -10012 -9918 -8386 -5025 2694 4828 8210 8573 5211 208 -2222
9787 -2222 -126 -3566 -8581 -12567 -12842 -10911 -10964 -9736 -10367 -10631 -9904 -9559 -9378 -9222 -6036 -2269 -1058
9770 -1058 -8629 -12439 -12592 -13056 -12327 -7976 -2534 2755 5363 973 -4552 -7579 -8055 -6569 -57 4202
9754 4202 11751 15459 15058 23971 37411 47969 61684 77781 89003 89766 81183 69917 50772 37906
9740 37906 33228 26291 23606 20114 18062 20200 18265 19108 27814 32491 34210 41196 41398 40319 41457
9725 41457 39465 31642 29417 36018 46320 55243 63684 76236 101147 127854 160152 190109 218138
9712 218138 248956 277754 290028 291117 280119 254068 225563 196281 165749 130398 109002 99130
9700 99130 94396 93283 87533 87892 88573 93226 98664 107440 126392 140870 143754 140334 132120 121672
9686 121672 122134 134364 155378 172359 190636 206874 221143 230094 246418 284201 341191 389300
9674 389300 414103 404453 365722 320541 279763 250764 225557 204567 179990 155629 135304 120544
9662 120544 102765 94213 90809 84715 75584 72716 75845 77990 80159 88904 95601 95192 97490 96544 102239
9647 102239 106799 124292 153858 186150 219029 255444 286399 317690 337829 352348 359006 352170
9635 352170 333978 304981 266067 219732 179655 145505 119602 108074 101008 92638 81043 77669
9623 77669 74085 69826 71233 74669 74535 74722 76959 81311 82512 82294 78381 76704 80213 80428 85951 93599
9607 93599 97117 109491 125947 134719 145551 149962 150815 150819 158275 169020 174471 185164 210658 241992
9593 241992 267860 279805 277805 264497 245266 228233 208741 181735 158015 140857 127886 115536
9581 115536 107539 99621 97030 103598 116851 120886 120658 127157 138550 139933 135689 138588 138365 132808
9567 132808 128612 120879 106204 95212 93074 91050 92123 94734 94889 102907 110498 119292 130874 142700
9553 142700 158480 177136 198080 220505 241148 262663 284743 300937 298993 276598 241869 209600
9541 209600 180617 156853 144929 136537 130536 116756 104247 96111 94582 96986 100695 105635 107208
9528 107208 115293 122413 121974 124257 123571 119620 109314 100865 91549 83836 82344 80477 71362 65313 57728
9513 57728 50679 57780 61928 64536 74228 82194 89137 105944 127605 142121 150989 161276 161462 151360
9499 151360 142017 134247 123564 111487 92729 80581 68797 60585 57760 55949 53626 49028 48356
9486 48356 55821 67463 78904 85978 94431 99823 99894 106476 110493 109218 107047 106695 96294 89410 83283
9471 83283 81879 77923 72957 61366 53722 55385 60381 70105 78768 83667 84054 81234 79206 77059 83263
9456 83263 85305 80297 78405 65760 56388 48143 47939 50539 54054 57837 56415 60484 68089 77699 80706
9441 80706 81553 85740 96092 110074 120453 120971 121971 116332 108051 96481 85451 80739 75576 69234
9427 69234 67972 63132 58751 61888 61828 53093 51017 49111 46605 47109 46749 45022 36172 31406 33958 35568
9411 35568 34952 33280 36638 42067 41316 36913 41206 54249 57468 55194 54666 59302 67677 67026 65073
9396 65073 60762 57944 51978 50526 53494 52242 52312 49977 41348 31379 26964 25125 26659 29532 27833
9381 27833 24995 28903 19833 14023 18264 18721 20932 23026 24820 26402 29535 33230 31901 30259 27645
9366 27645 19918 24458 26948 26467 27149 29861 29886 31315 35977 36324 32133 27288 22016 21286 24709 27443
9350 27443 24949 18955 17048 17882 21762 24466 28576 29647 34319 32163 34266 30180 22453 25606 27657
9335 27657 25698 32666 42526 43567 38629 38610 37301 33286 29183 26882 32340 34634 35274 32723 32056 36276
9319 36276 40629 41251 44649 44926 42343 40230 39918 45016 47378 49490 50351 51873 50572 52511 52591 51655
9303 51655 50882 47969 41789 37729 41099 41864 43887 45176 42976 42672 46060 46972 47939 50272 49679 50652
9287 50652 56995 62615 62621 58001 58643 62886 65858 67749 67899 67850 70244 71603 83021 97309 102804 99088
9271 99088 100633 109449 124392 133420 147126 164126 179551 195885 217304 242488 281474 330675
9259 330675 385334 467505 583760 751554 999671 1366600 1868281 2462979 2960596 3076567
9249 3076567 2746754 2190725 1649308 1222994 920584 713696 568469 464560 387980 330430
9239 330430 282415 249888 219466 194940 178281 165452 150296 135793 126721 119586 113792 108025
9227 108025 106021 100067 97353 101958 102512 95705 84800 73356 70114 71833 70947 71452 72859 64698 52429
9212 52429 47833 49256 55125 56790 56176 59530 56978 52194 49818 50293 56216 61212 59347 55573 49849
9197 49849 47757 41922 41774 40234 41383 44010 45035 48643 46388 46814 51309 52447 53094 57015 63383
9182 63383 68317 66370 69769 65769 59415 56834 56341 54002 53964 56831 62599 63597 66298 69540 68789 69858
9166 69858 70731 69911 69286 64804 59945 53867 52998 51068 45567 44419 44615 48906 58326 60175 64588 63867
9150 63867 63007 67347 76262 83127 81203 79006 81348 82177 81293 75448 68969 69365 68261 65508 68359 69491
9134 69491 69143 69141 71532 74119 74491 66863 68110 69225 68632 67113 65918 66294 64489 58857 57365 59571
9118 59571 58414 55860 49794 50609 56994 60186 58118 61283 63482 65884 66010 67063 67790 64126 67044
9103 67044 69654 64603 63611 65233 67225 71626 74709 74363 81399 88229 90878 83255 78606 74999 78354
9088 78354 79167 82915 80252 80478 79150 79093 80414 69922 63616 63802 65382 66557 66183 61376 62653 62056
9072 62056 61951 61155 67336 71307 69800 64441 66067 68902 67910 66171 64709 68999 71197 73161 73900 75063
9056 75063 76048 77893 74313 67597 64497 66824 70126 70352 64146 62908 65536 68680 64743 61425 66788
9041 66788 69897 74369 69615 64658 62894 66441 65860 61386 61677 64879 61367 57218 54618 59330 60944
9026 60944 63736 72474 76476 71826 68428 64700 62019 64331 65159 64956 67180 67796 60542 59908 65414 70936
9010 70936 76045 78709 81015 82165 79279 80318 73097 67288 61420 59075 58885 62224 67340 68638 67664
8995 67664 64501 65531 68890 70145 71590 68616 70040 75986 83951 89386 88973 88176 86042 89283 96175
8980 96175 97958 99015 94570 91968 85265 84621 89740 91781 85628 84872 83739 83604 81555 83132 83161 83876
8964 83876 83250 81698 80917 79028 77461 75161 76559 76454 74203 71021 72366 69784 67993 64814 61844
8949 61844 59078 58748 62701 60805 55169 59251 60428 63118 66616 66808 69649 71241 73827 71890 70519
8934 70519 73157 68917 71294 74544 70736 74094 80132 75996 74177 74302 77937 75174 77342 76368 76283 72769
8918 72769 72993 80089 81891 76563 78319 80514 80374 77124 77222 80777 81082 85428 85736 85659 88444 89252 87605
8901 87605 87033 83862 83782 86979 88395 84284 84577 83718 82870 88872 91224 84409 77979 75625 70292 65909
8885 65909 69727 70088 66178 68217 68175 70458 69116 70413 75983 78497 75285 71443 71356 70517 66911 65940
8869 65940 66895 68299 69366 68772 70368 71955 69287 67589 67223 71190 73507 75280 70766 66446 63587
8854 63587 64016 66912 70861 74406 79744 83052 88121 88729 91223 91358 85150 82632 80164 80937 85554 88738
8838 88738 85093 78100 72920 69491 70531 77877 75048 75816 81103 81581 85300 93838 95743 94010 80470
8823 80470 70733 64467 57427 54712 58277 66685 73796 78346 79627 77533 73520 70147 67344 65917 66561
8808 66561 63875 63956 67398 70146 67613 58785 55152 56681 60464 60102 60990 62977 57904 51950 52339 56736
8792 56736 61383 64478 67343 64684 68941 70882 71711 77520 86413 87871 88714 87944 81697 74337 67195
8777 67195 66228 64529 59339 59832 64383 65796 62790 65026 66193 66991 64811 59323 56169 55592 56646 61878
8761 61878 60768 62198 68498 75969 74718 72415 68390 66826 67638 67885 69875 71182 69537 69008 68999 72346
8745 72346 77391 81551 85798 84552 88467 88294 93341 94744 94314 86754 79710 73972 70830 64262 66298
8730 66298 69287 68984 66781 64620 64691 60843 57486 58602 63063 61689 60981 62773 67334 67016 65625 67736
8714 67736 67115 68259 69299 69604 75232 80539 83735 83718 84032 86151 86358 86157 85147 88893 88958 91766 95605
8697 95605 95868 99569 109165 119484 126296 128051 122995 113210 109060 107428 110510 112459 112497 114749 118416
8682 118416 115559 106481 102627 106822 108115 104361 104159 107878 113239 115166 121296 119601 116265 117646 120910
8667 120910 118088 123734 127216 128089 125778 128612 126316 132297 135480 131879 126396 130981 136657 136423 134573
8652 134573 135651 134911 140387 141729 143339 139454 138826 143223 150571 155186 157085 159961 169903 177386 182980
8637 182980 192461 196565 203806 210396 219482 233538 247457 260404 278140 292755 311718 336988 361450
8624 361450 390352 427436 470482 511059 548213 573552 573304 553653 514817 466538 421300 372603
8612 372603 331462 297572 268906 246202 230678 218582 205023 189166 179778 169672 165194 164759
8600 164759 166606 163559 155575 146228 139763 137505 135959 137187 132215 129831 131569 128973 126026 126821 126578
8585 126578 122494 118382 121235 124348 127117 134690 140366 158581 181225 204437 217695 214064 193165
8572 193165 169382 146990 129081 119995 114906 111984 115518 120110 120934 118445 114037 115161 116647 111610
8558 111610 105429 102584 98475 97596 93425 95911 100962 104202 107729 106637 107755 109458 110370 112539 117682
8543 117682 115533 111626 106544 101375 100531 104724 113236 116203 115755 118826 123775 136514 145141 146964 139622
8528 139622 126947 112374 98168 90246 83045 77934 78379 79163 81909 85115 85585 82937 87574 87834 89375
8513 89375 85199 83770 82767 85977 85974 86477 86267 89533 92289 90075 86381 81710 82215 85136 86466 86913
8497 86913 89835 87873 89732 87914 84111 82889 82854 77652 81149 85329 88112 92782 94597 95476 92868
8482 92868 89794 84936 86624 89893 89904 86919 84209 77864 73409 73067 72361 72578 74490 77304 81631 84509
8466 84509 83890 85194 85483 78614 71289 65277 65452 72501 73175 66368 64316 65876 65897 67615 72367 73457
8450 73457 72704 68300 64476 66583 72975 75070 73230 75732 83622 86654 77025 72098 78690 82108 84491
8435 84491 89590 92197 93283 91509 85519 80087 76287 79122 76491 68019 62022 63142 67160 68362 61820
8420 61820 58346 59208 60642 63224 68010 69614 72570 70101 68499 69649 70078 69245 70535 72284 74941
8405 74941 69878 66192 65625 69719 74756 83523 88881 84971 82371 91432 94574 95100 90039 85942 78151
8390 78151 74304 75213 78619 80910 79358 75906 70966 72802 77520 74306 72597 67323 70515 71300 69536
8375 69536 66575 61963 64299 68154 65238 62541 62321 64442 69683 69290 67651 65717 63446 58313 60438
8360 60438 63488 69846 74011 76193 78831 86180 92678 94115 94284 93221 91550 95353 98150 93273 93455
8345 93455 98639 104092 108410 110237 117621 132861 151055 170732 211445 274846 350918 423511 470136
8332 470136 477894 444099 386331 326912 269939 224715 197526 177312 162798 150311 143418 143278
8320 143278 145591 153221 169464 185981 192832 196414 192796 180217 165769 158518 159636 155693 153435
8307 153435 155132 159352 160262 159012 162495 164797 162924 162416 160597 156245 159197 157801 158418 170257 187992
8292 187992 217343 265268 345022 471344 640350 801279 893910 885478 798567 670598 542202
8281 542202 437199 359011 301462 257481 226089 210371 206144 206400 216020 235937 269284 302180
8269 302180 317371 315092 300024 278246 260726 246830 231752 220502 212570 204103 202895 211738 224700
8256 224700 231798 231614 212715 190367 173105 160569 149391 141280 138309 140325 144363 158284 184824
8243 184824 220022 266255 322382 389789 432502 440658 412567 363345 307155 258924 227229 200533
8231 200533 172361 153478 143081 145487 150704 154719 160585 176958 189927 192152 188887 183064 174954
8218 174954 167296 162515 155516 156622 155995 153696 146971 146947 150108 151946 146915 138389 129220 117515 107804
8203 107804 107980 107926 101920 98321 96634 95357 92854 96316 100063 103174 107874 110014 108972 105919 104808
8188 104808 102247 96474 91651 90610 89296 90817 95863 102758 103440 99800 102466 108186 106015 104119 103504
8173 103504 105000 106705 105068 102831 100243 104998 111029 112460 114797 112820 112647 113768 113547 114969 109601
8158 109601 109426 106986 106289 106618 110755 113488 116950 115704 121239 126931 130184 129521 125440 122250 119272
8143 119272 120983 118360 117502 115326 117138 119691 120764 120899 126862 128261 133596 135174 129319 128426 132084
8128 132084 134496 132610 127611 126573 134466 138833 138292 140742 146603 154461 160104 161499 163684 163781 158994
8113 158994 155331 148840 147824 151872 147762 142199 138857 144169 154068 161043 158102 157472 158290 154567 153167
8098 153167 150752 150957 152289 147154 141159 140725 145777 153542 155662 156710 160674 158233 156305 154340 155177
8083 155177 159955 154583 161452 167407 166943 168217 171284 172990 180180 189994 198938 208290 212477 210207 201944
8068 201944 198587 196630 193690 190023 191102 193334 192583 191340 190487 194512 193497 192525 197135 198936 195896
8053 195896 192797 193347 196133 193999 192806 190956 189259 186382 191785 197957 195594 192925 193173 190812 189784
8038 189784 192763 196509 204048 204378 205271 208290 213325 217301 218731 222205 229394 238091 246184 251056 255343
8023 255343 261041 264141 263205 261150 252978 241031 235456 228256 221157 216062 215026 212084 207890 204621
8009 204621 202296 200444 195362 188633 193469 194459 188280 185875 183785 179462 183696 192417 198944 196780 193772
7994 193772 195722 196167 191525 190594 191157 196223 199136 192861 193247 197501 199771 203952 208294 214319 215808
7979 215808 214466 215648 215834 210561 206036 202968 200462 195756 189883 179875 168704 167312 161405 152030
7965 152030 149708 150676 148818 143397 142400 142051 142890 144449 147213 142689 139721 132736 132907 139213 137950 139049
7949 139049 141262 143279 141077 133299 130662 132589 132748 135018 130053 131886 134312 132992 132028 132517 127052
7934 127052 124637 122455 121711 120164 111584 105998 101285 102048 100430 99776 99742 98597 98765 99238 94298 93596
7918 93596 88244 88177 87216 82639 82383 82355 86135 80701 75393 76503 79093 77551 72127 72608 73093 70994 70574
7901 70574 76998 73511 73184 73801 68003 68582 69724 68820 71553 71263 70714 76125 75985 75322 72672 67984 66548
7884 66548 65296 65708 62343 62290 58929 58065 60082 60452 63539 64674 64665 67424 62684 55429 54719 49853 49096
7867 49096 48107 41808 39496 37643 37738 40922 44668 48259 47062 46240 48673 50612 42946 41896 44856 45735
7851 45735 43621 39903 32952 35375 36008 36892 34305 37018 38771 43480 45613 44234 41889 42145 40420
7836 40420 38154 34360 34125 32817 30515 29095 26057 25602 28079 28630 26978 23836 24099 27108 29813 30120
7820 30120 24050 27339 28080 26587 32806 33742 31999 29169 29094 36934 34519 29272 30635 30804 28119 27574
7804 27574 26710 25743 25550 16810 14828 19161 21588 21346 21807 21106 21092 20398 24032 26493 25832 19442 21758
7787 21758 22435 21100 18068 23417 27462 21349 15592 19090 20217 13900 13110 12431 9561 10257 8326 8623
7771 8623 6601 8595 10045 12861 15252 20621 20356 20991 22049 16095 7752 3718 3673 3183 7660 9066
7755 9066 7036 11693 10928 9690 12631 10815 9917 11578 10913 8523 7532 5939 4730 2740 1131 1358
7739 1358 -2133 845 6562 6895 9217 15815 16804 14864 13742 13645 13927 9148 5202 1809 -660 4875
7723 4875 6348 3007 1544 -707 -1233 3271 1404 -618 3438 2460 1731 948 1597 2847 4453 4909
7707 4909 7902 7710 4995 4113 3733 4386 3279 -1503 -981 17 -6415 -5026 -1503 -3035 -3348 -1754 4278
7690 4278 4151 4389 2456 -1340 -3266 -2857 -2310 -687 452 714 -2623 -5656 -2294 -3123 -4280 -2479
7674 -2479 -1549 -449 -3948 -1596 850 -2460 -3726 -6063 -10737 -14342 -7991 -3860 -7570 -8569 -869
7659 -869 3032 5576 4692 2350 2583 3088 6762 9841 7448 -1653 -5783 -2548 -913 -3448 32 -1207
7643 -1207 -1278 -2647 -3582 -756 602 -176 -3354 -3980 -8765 -17005 -18135 -15882 -11463 -13337 -10699 -8182
7627 -8182 -9949 -13494 -9532 -5981 -3720 -1586 -5250 -5580 -6330 -13654 -14203 -13728 -14139 -12905 -11427 -4379
7611 -4379 -1607 -2162 -2693 -925 3908 -315 -6767 -5845 -2812 -513 3775 3195 -3336 -7925 -11738 -10759
7595 -10759 -10503 -7576 -4716 -1571 -5662 -7422 -8031 -9386 -10189 -10668 -11708 -15896 -16504 -11992 -9741 -8906
7579 -8906 -13949 -19187 -17400 -18367 -18752 -11744 -10443 -13894 -14267 -14075 -15589 -8751 -7259 -10304 -10093 -1003
7563 -1003 2781 2409 4053 -330 -5349 -6566 -3489 -144 -3872 -7849 -3502 -3455 -2965 -4141 -3445 -4068
7547 -4068 -4632 -2741 -8404 -10621 -12973 -9231 -864 189 -8695 -12107 -9991 -5618 -4695 -5778 -6678 -4541
7531 -4541 -7814 -4721 -1057 -4310 -3621 -7865 -7614 -6693 -8698 -9305 -11125 -5298 -3075 -6085 -6055 -450
7515 -450 2887 571 -3356 -6702 -12026 -18438 -16755 -9912 -4355 -106 -873 -579 -5144 -9552 -11831 -14229
7499 -14229 -14615 -9742 -9336 -9641 -6983 -6567 -5558 -12875 -10005 -11567 -15104 -12578 -10769 -12143 -13644 -13478
7483 -13478 -7679 -4652 -5128 -7770 -11169 -12330 -12321 -8692 -10443 -19420 -16467 -11845 -8756 -11235 -16514 -17181
7467 -17181 -12082 -15877 -24577 -24063 -19964 -14664 -13369 -10936 -12905 -14085 -11854 -9398 -8924 -7923 -12202
7452 -12202 -15144 -13933 -13624 -14035 -17969 -19764 -16871 -14769 -19156 -19225 -14433 -12741 -11577 -13267 -8508 -11879
7436 -11879 -15540 -17385 -16422 -16461 -15144 -9776 -6123 -10714 -16443 -18369 -14801 -12770 -12446 -11137 -14785 -17594
7420 -17594 -19539 -13377 -11968 -13574 -20226 -18389 -10660 -11305 -9563 -5720 -5473 -4100 -2026 -9311 -16190
7405 -16190 -14064 -11538 -8981 -12515 -13748 -17483 -18893 -11378 -9231 -13770 -10638 -9704 -12523 -8492 -10017
7390 -10017 -11618 -8020 -8529 -11564 -11378 -9965 -8304 -10778 -10711 -8339 -3980 -5021 -8487 -14485 -20456 -20446
7374 -20446 -13444 -9481 -7457 -6241 -5996 -2747 -350 -3757 -13100 -15837 -14225 -13902 -12896 -11873 -14262
7359 -14262 -9963 -10418 -10955 -11498 -12033 -14440 -17065 -13641 -4196 -3192 -10459 -10737 -16310 -16040 -15558 -12714
7343 -12714 -13183 -12826 -14417 -13861 -11410 -8333 -7395 -7882 -10830 -10637 -8250 -11051 -8876 -5655 -4653 -7548
7327 -7548 -9480 -6552 -5749 -7173 -12314 -10402 -7267 -8263 -8425 -5633 747 -4158 -5336 -618 3179 3076
7311 3076 -3024 -4693 -6666 -8111 -8394 -11187 -7172 387 1072 322 -1461 -5459 -7168 -6895 -6489 -4792
7295 -4792 -8551 -9888 -6702 -5201 -3558 -6946 -8663 -18679 -18019 -12998 -14064 -14942 -10873 -8867 -14438
7280 -14438 -15173 -9390 -12979 -12159 -6949 -7130 -12618 -17815 -15770 -17480 -17903 -19744 -18824 -10503 -10504 -14761 -11480
7263 -11480 -8694 -11483 -12895 -10925 -15534 -17269 -16410 -12767 -12287 -15432 -13432 -7613 -9791 -8730 -11978
7248 -11978 -16906 -19195 -15406 -11835 -11405 -8911 -5644 -9829 -16107 -16032 -13095 -10644 -10326 -15215 -16435 -10856
7232 -10856 -9715 -16845 -14662 -12343 -13596 -13842 -14681 -19490 -18499 -19486 -17955 -14973 -15108 -16392 -10275 -7881
7216 -7881 -12016 -11719 -11756 -10400 -13256 -11158 -9553 -8514 -4451 -7050 -3145 3300 2349 962 -1800 -3178
7200 -3178 942 -3201 -9324 -10646 -11617 -12595 -13735 -15553 -10322 -3424 -4300 -10100 -11262 -12343 -7607 -4451
7184 -4451 -4975 -8415 -11114 -11158 -15002 -15181 -12930 -7025 -1155 -7384 -15455 -15552 -8565 -5933 -7995 -9529
7168 -9529 -9948 -11852 -15108 -14562 -13654 -5745 -5230 -5135 -2981 -5356 -9415 -7975 -8126 -9140 -3222 -2942 -6985
7151 -6985 -9828 -10363 -8231 -6566 -8659 -4819 -6544 -4211 -4561 -7640 -11336 -12119 -15010 -16379 -14286 -14677
7135 -14677 -15965 -13023 -9811 -5658 -5062 -3449 -2738 -3103 -7722 -11841 -15783 -13261 -8934 -7638 -5048
7120 -5048 -6204 -4954 -4500 -3041 -3697 -5214 -7828 -5052 -4875 -7003 -9739 -15335 -13645 -16899 -18974 -19097
7104 -19097 -16168 -13678 -12479 -12608 -11744 -13692 -15815 -18032 -17218 -15647 -19241 -19552 -17489 -12993 -8747 -8962
7088 -8962 -8693 -12685 -12468 -8010 -5665 -4398 401 -980 -4894 -8529 -7184 -5039 -7346 -4448 -4959 -10750
7072 -10750 -13719 -16956 -18861 -18095 -16602 -16389 -17745 -14652 -13124 -16306 -18393 -19081 -16819 -11875 -8437
7057 -8437 -7936 -8750 -9304 -9146 -2125 -5088 -13310 -11842 -8878 -8646 -11919 -13076 -15154 -13656 -4032 -1607
7041 -1607 -4786 -4170 -2048 -3731 -7735 -9771 -7628 -2479 -746 -1516 -9913 -10620 -2922 -2337 -7387 -13182
7025 -13182 -11486 -10613 -14895 -14219 -12363 -9037 -3019 -1224 -3121 -7718 -11847 -6636 -7420 -11587 -15307
7010 -15307 -11640 -11680 -10458 -14263 -15355 -11307 -11454 -12545 -15001 -14955 -17113 -18710 -16534 -16282 -18955 -17622
6994 -17622 -11795 -13896 -15559 -12359 -11121 -11761 -10025 -12553 -12032 -15807 -15375 -10047 -8165 -8186 -10111 -7528
6978 -7528 -10762 -16347 -11925 -9384 -11892 -11254 -7043 -6790 -11180 -14512 -15111 -9500 -8854 -13234 -15274 -16582
6962 -16582 -15474 -14088 -12736 -12078 -15677 -16812 -12453 -10879 -12499 -13302 -5280 -3749 -5354 -9374 -12152
6947 -12152 -13672 -13861 -11298 -13077 -5237 -1451 -4037 -4470 -5726 -11235 -15978 -13291 -3986 -73 -3100
6932 -3100 -6444 -5342 -1791 -5301 -10435 -8250 -6162 -5044 -2451 -4602 -5604 -11962 -18156 -16079 -14589
6917 -14589 -16123 -16394 -17659 -12901 -10721 -6180 -5801 -4342 -9294 -10883 -9118 -365 2988 -870 -7776
6902 -7776 -5098 -1677 -5659 -8083 -7795 -8567 -7489 -8513 -15114 -18579 -16231 -10870 -10832 -8989 -9339 -8099
6886 -8099 -6099 -7303 -7899 -12031 -15771 -15106 -11633 -10950 -10690 -14516 -11335 -8574 -11438 -13579 -3746 5242
6870 5242 -1763 -6830 -6719 -6673 -1106 -1336 -3580 -4027 -8820 -11938 -9204 -4734 -4650 -2979 -3740 -7555 -11365
6853 -11365 -8605 -10913 -11579 -9350 -7410 -6546 -1686 -2888 -8373 -7883 -7224 -9388 -5410 -6198 -5006 -1088
6837 -1088 -5385 861 4415 1284 -40 -2226 -3526 -4294 -5221 -4043 -2898 -4444 -5533 -6429 -3434 -2696
6821 -2696 -3911 -8839 -8399 -4767 -6491 -6509 -3806 -4431 -9900 -13881 -13784 -13794 -8679 -1441 -1263 -1571 -1304 -6582
6803 -6582 -6266 -3892 -4137 -4132 -2300 -658 -1532 -3272 -3897 -2938 -2347 -1512 -2634 -2080 -2960 -3059 -626 -4013
6785 -4013 -7947 -7465 -4477 -2766 113 3725 7044 7914 1749 -7996 -9230 -5831 -144 6066 11125
6770 11125 11373 15823 20200 29178 34599 44749 52835 59624 76455 87302 91840 89407 71955 51162
6756 51162 35748 24641 18719 14397 10085 5087 2887 3207 -802 -1811 -1961 -3133 -738 6106 8630
6741 8630 3869 -581 807 3058 155 -1373 -2637 -3608 140 -781 -1192 -4498 -8212 -10802 -12493 -11661
6725 -11661 -11123 -13134 -9877 -4858 -3285 -4377 -7917 -11385 -10231 -6436 -9009 -10770 -6882 -3771 -5527
6710 -5527 -6201 -5276 -6489 -8812 -10988 -7609 -7512 -9174 -9871 -8323 -2493 2212 260 -3687 -8011 -13201
6694 -13201 -11305 -10842 -9318 -8747 -6513 -8992 -11956 -13654 -8034 -5367 -5600 -7264 -5569 -3458 -4214 -6032
6678 -6032 -5932 -9724 -17502 -14065 -14291 -11803 -8877 -11536 -14995 -12560 -10526 -14881 -13000 -12133 -8286 -8935
6662 -8935 -11736 -8489 -5792 -3871 -8895 -8294 -12639 -10534 -10707 -13807 -16044 -14726 -11594 -8189 -6232
6647 -6232 -3984 -9042 -11452 -15377 -10521 -4495 -2097 -2666 -3541 -2733 -5441 -9368 -9115 -8603 -12228 -16596
6631 -16596 -13692 -9726 -9529 -9499 -9284 -3292 -4646 -10044 -12263 -13630 -12901 -8272 -8807 -9138 -9253 -11600 -9961
6614 -9961 -3244 64 -3963 -6615 -9800 -11182 -14385 -12505 -10486 -9823 -12183 -11066 -15215 -15044 -9097
6599 -9097 -6208 -1841 -4614 -1054 1335 -2779 -5895 -9239 -12234 -10166 -6834 -1509 -1633 -3136 1956
6584 1956 -2127 -6268 -6357 -9657 -7675 -4811 -7356 -9813 -10927 -10814 -5621 -4193 -2071 2226 -318 -8260
6568 -8260 -13813 -19325 -19682 -13198 -10526 -8065 -8166 -6885 -4128 -1161 -2549 -6478 -995 432 -7494
6553 -7494 -7361 -9142 -6086 -3378 -4774 -6620 -6799 -8681 -9789 -10518 -13008 -12058 -7898 -2319 -3727 -4961
6537 -4961 -2794 2533 3304 -1659 -4281 -7418 -4912 -1788 -8543 -5885 -4927 -5787 -9364 -8024 -5258 -9053
6521 -9053 -8621 -3466 -5279 -8546 -10037 -8142 -7224 -10448 -15107 -18546 -17657 -10699 -2628 -3937 -4647 -2576
6505 -2576 -4914 -7365 -7655 -4679 1619 3931 255 -2401 -6105 -13461 -13770 -8155 -7762 -8034 -10678 -16441
6489 -16441 -15753 -9881 -6676 -367 -2843 -3968 -4878 -5562 -7556 -6622 -4587 -7789 -7062 -7688 -9312 -5699
6473 -5699 -6729 -1504 -3242 -9310 -13694 -12539 -7018 -4413 -4220 -489 754 139 -1686 -655 -1194 -8704
6457 -8704 -14912 -15609 -10879 -5882 -5170 -2508 -4309 -2124 -198 3749 -1380 -3483 -427 -753 -4634 -8830
6441 -8830 -10576 -11236 -8806 -6090 -3410 -4649 -8123 -4588 -1447 -6641 -8551 -6928 -748 2966 -68
6426 -68 -2318 -4403 -2933 -507 -4478 -6357 -5980 -3051 -3884 -2106 -3390 -5294 -3079 209 -1744 -5481
6410 -5481 -7038 -9540 -8153 -9619 -5932 -5009 -6873 -8986 -12034 -14264 -12055 -10638 -10785 -12665 -12439 -4910
6394 -4910 -5886 -10592 -6707 -4608 -6649 -4179 -3502 -2194 -1029 4374 980 -6991 -7409 -4281 -3021 -4435
6378 -4435 -3188 -1735 1964 1539 -3366 -5193 -6657 -4476 -5944 -12811 -12448 -12119 -7738 -4614 -6113 -1356
6362 -1356 -2466 -1872 -720 152 137 2124 1094 -880 -5928 -7785 -4225 -2065 -463 990 3462 -1151
6346 -1151 -5634 -6278 -6190 -2550 2431 2368 -1451 -1192 4208 3281 -907 -3659 -7712 -6839 -5062 -8865 -5965
6329 -5965 -1852 -2864 -6898 -9852 -8747 -8027 -2316 4261 4311 2756 -670 -2900 -5275 -5388 -1362 -1563
6313 -1563 -5366 -13977 -12992 -5690 -4707 -4689 -5278 -2992 2370 -2516 -2816 -812 103 42 -606 -43 -5368 -9630
6295 -9630 -10330 -9406 -5021 189 -2201 -4501 -8148 -12528 -11615 -9225 -6662 241 5288 2516 -831 -3370
6279 -3370 -865 -2517 -4526 -42 3479 -485 -169 2563 5979 5630 2844 2520 -2476 -9090 -12716 -14100
6263 -14100 -16093 -16219 -13048 -12156 -8773 -11285 -12146 -6771 -2680 -2259 -3625 -7449 -13394 -18090 -13778 -9709
6247 -9709 -4370 -3796 -3942 -5147 -3131 -2810 -7178 -5056 -3624 -5504 -9666 -9259 -4792 -1315 -2517 -2762
6231 -2762 -2546 -3085 -6122 -7697 -13792 -16489 -13466 -9875 -7872 -6814 -4594 -590 -104 354 -3662 -12203
6215 -12203 -11511 -10284 -9397 -1202 1775 -465 -6538 -8292 -12372 -13545 -7846 -3038 -15 -2002 -7788
6200 -7788 -6232 -3670 -1809 -3028 2419 42 -6710 -11809 -12449 -10409 -5438 -2036 -7665 -14105 -11283
6185 -11283 -10584 -10364 -10685 -11743 -8915 -6324 -9304 -9779 -10820 -11249 -6783 -2828 1833 4422 -139 -4017
6169 -4017 -5492 -6826 -3608 -3032 -2003 -2360 -511 827 -3736 -5346 -7810 -6762 -8556 -7843 -5079 -1938
6153 -1938 -3916 -5750 -4674 -4418 -3893 -700 -3931 -2886 -6232 -11063 -13415 -11528 -8525 -5293 -4360 -2074
6137 -2074 40 4320 3427 2939 1828 -914 -2685 -823 581 -1477 -5780 -3839 1836 4065 50
6122 50 -4190 -3722 -3524 -5692 -1271 793 1157 5885 7467 6468 2177 -4901 -6086 -9960 -14230 -13941 -16756
6105 -16756 -16620 -13730 -12306 -6250 -2573 -4420 -7433 -11349 -11400 -11917 -12833 -8925 -4111 -4297 -7601 -11239
6089 -11239 -13428 -13811 -17874 -18014 -16366 -10207 -7251 -7506 -5475 -531 -1785 -3398 -548 329 -2249 -3617
6073 -3617 -962 -1782 77 -5765 -5567 -7683 -9888 -9873 -5276 -2989 628 3428 177 -813 -1314 -3664
6057 -3664 -3045 -1193 2641 5705 3156 3114 817 -2963 -1085 -1920 -389 1316 -4420 -9513 -14083 -12650
6041 -12650 -8208 -4039 -5392 -6447 -6394 -5648 -5993 -7585 -5424 -242 2485 -263 -1246 -1996 -4596 -1770
6025 -1770 1008 679 3266 7847 5351 781 -5494 -11707 -17673 -17564 -17699 -14716 -12993 -9101 -4909 -4705
6009 -4705 -6073 -5202 -3334 -3532 -5336 -1782 -787 2048 2982 4311 2900 1748 1668 518 -3559 -7767
5993 -7767 -9469 -8508 -4757 -59 1841 -1448 -4789 -3274 -1370 3703 3273 4179 7032 4684 2180 1436
5977 1436 2029 4081 8201 6774 5263 6945 9183 5916 1350 -301 -1957 -6010 -8874 -9576 -6407
5962 -6407 -4832 -2225 -4936 -6992 -2705 1812 3616 -1571 -10378 -9602 -10595 -5713 -4705 -5475 -5921 -8719
5946 -8719 -10600 -11892 -12729 -11423 -9035 -4669 854 -211 -5111 -9321 -12062 -6488 -5534 -4843 -2050 -829
5930 -829 -1506 -3299 -5600 -6423 -7034 -8626 -9043 -9559 -6276 1549 1879 2950 4843 -516 -4600 -4671 -4701 -7530
5912 -7530 -11614 -12212 -17813 -14321 -9322 -13273 -12193 -11781 -3700 -1180 -3937 443 -4137 -7676 -8994
5897 -8994 -6797 -7030 -6927 -4990 -7033 -4162 -3460 -2248 -3301 -6284 -7487 -9804 -10015 -9620 -12440 -9149
5881 -9149 -4309 -1178 -3631 -6223 -6507 -7674 -9019 -6963 -2563 -3245 -2913 1814 2858 4380 3600 633
5865 633 -6078 -9801 -9721 -10862 -9546 -4767 748 -2 -1915 -4401 -5392 -4507 -9540 -12137 -9871 -1113
5849 -1113 2879 4811 4843 2543 152 -640 2526 4964 2927 -6234 -3474 -790 -683 -5 5692 5197
5833 5197 5002 1991 1444 -675 -7336 -14332 -16651 -8413 -3776 -5307 -7948 -6354 -7636 -3195 -7136
5818 -7136 -9927 -8656 -3447 -1207 -2015 -1141 -8292 -9436 -7113 -1711 4047 4466 2680 298 1143 -668
5802 -668 -2061 -1002 1148 5090 4497 3202 2197 5501 4007 -628 -1637 23 65 -2021 -1617 3374
5786 3374 -729 2980 8388 4155 -1654 -4027 -1611 -6419 -10102 -11797 -9902 -6046 -988 3697 4322
5771 4322 -3209 -1354 2528 3890 1920 -84 5226 4176 5742 11262 13386 15432 13123 6406 1593
5756 1593 1274 5111 5697 -5400 -4945 -1354 -1284 2114 5698 2946 -3132 -6214 -3528 -245 3423 560
5740 560 -4817 -3885 228 -1974 260 5949 7409 5256 3084 1663 3517 4167 3735 4350 2633 1949
5724 1949 -602 1646 880 2177 5896 5161 8599 5901 -2022 -5098 -4075 -319 -3294 -6361 -6734 -9089
5708 -9089 -7113 -6607 -6605 -5688 -6037 -4657 -2977 2226 2548 -2649 -7920 -7807 -5367 -2900 -357 3278 6873
5691 6873 5164 1770 127 -3762 860 1516 107 -1139 -969 -2672 -1344 -1861 -1083 -5863 -6350 -5150
5675 -5150 -5112 -5296 -1302 3313 1268 808 795 -2193 -2092 1598 1672 42 -375 -2611 -4125 -8009 -5561
5658 -5561 1070 3165 4826 7433 7561 -414 -6876 -6440 -3320 693 2024 6576 8505 882 -5805
5643 -5805 -5268 -4105 -8052 -10356 -2093 5848 10622 4568 -707 -6167 -3043 3801 7197 4799 5188
5628 5188 3693 4913 5461 147 -6525 -6923 -1973 -2574 -3760 -2196 -999 3320 5069 4274 2370 794
5612 794 691 1626 3896 4516 2444 -1817 -8531 -13147 -13674 -13397 -10687 -2217 1254 -413 -8755 -11637
5596 -11637 -10599 -8105 -2507 -263 -593 2708 4049 395 1268 -462 -3329 -2543 -4483 -1933 726
5581 726 -4400 -6179 -378 605 -1139 -2613 -2044 -2586 -6831 -6577 -7586 -7771 -7128 -4420 -3812 638 285
5564 285 1879 2375 676 29 -3428 -8029 -10130 -4731 712 -1702 1218 967 2483 3215 476 -616
5548 -616 1537 4284 1756 3238 -5207 -8619 -8086 -7056 -8490 -10518 -11384 -6155 -2287 -812 919 -3249
5532 -3249 -2496 1106 3686 1236 -726 -420 -2845 -9674 -7825 -6247 -5223 -1845 -2896 -6613 -4169
5517 -4169 -3178 -365 -287 5417 9894 7882 8975 7030 3634 -3672 -6656 -7699 -8245 -8940 -10141 -8614
5501 -8614 -6143 -3664 -3832 -6387 -4375 146 1254 5726 7836 3564 595 -905 -760 544 -3634
5486 -3634 -9472 -12328 -9349 -6990 -6310 -5067 -4454 -5562 -6849 -4345 -3325 -3262 -2558 -4353 -2168 -1129
5470 -1129 -774 -2514 -4696 -6197 -1589 3400 3781 -106 -6682 -3007 968 -2606 -8929 -4887 -1520
5455 -1520 -2131 -5815 -3664 -3465 -4269 -5040 -3024 -65 -4945 -6964 -1647 4926 3740 4436 4959 4977 1911
5438 1911 5544 6011 6847 8719 13227 10175 5692 2563 -2284 -5254 664 2002 1390 1497 -1430 -823
5422 -823 837 4593 6435 5256 7181 10824 6164 2229 4336 2248 698 593 -3200 -2533 1463 6047
5406 6047 5428 6748 3161 -1126 -2479 -4943 -6188 -1836 1632 4303 104 -6605 -6609 -4779 -4261 -6118
5390 -6118 -5608 -2551 4399 6645 5400 1501 2309 6663 9166 6162 4506 3748 3658 4069 1552 -1552
5374 -1552 -2393 -5429 -2218 -1171 -2964 -5947 -7835 -7402 -6206 -4029 -9554 -8036 -5474 -5954 -5549 -4206
5358 -4206 -6068 -5297 -7853 -10177 -10920 -9974 -8422 -10731 -7377 -3463 -4323 483 3622 -1837 -11158 -10397
5342 -10397 -6749 -8495 -9894 -14702 -15925 -9215 -7799 -10210 -5707 -1619 -4307 -6196 -8166 -5172 -934
5327 -934 547 4151 4078 4638 6071 4076 -1774 -7869 -10421 -7415 -4422 -4277 -5133 -6809 -4443 -3833 -7448
5310 -7448 -7215 -9838 -9340 -3924 -800 207 1606 -401 -5379 -8988 -7030 -2773 -938 -502 37 2240
5294 2240 7373 7165 3170 -6116 -4607 -2352 -5449 -7074 -6304 -2474 -1681 -9601 -14699 -10983 -7851 -4163
5278 -4163 -4820 -1331 -1272 -4676 -2143 -5446 -12745 -15684 -14994 -14329 -9953 -3749 7093 12738 6808 -1452
5262 -1452 544 2732 740 -2876 -2986 -3054 -79 -2200 -3405 -2362 -579 336 1314 3075 -2045 -6532
5246 -6532 -7862 -5786 -246 2839 2395 1493 2970 -564 -6575 -8972 -6114 -1781 1812 9477 13658
5231 13658 8272 6035 3092 3551 5443 -61 -5217 -8850 -1608 2385 2921 4818 10617 9873 6220
5216 6220 2893 2820 5693 4687 1726 2927 5498 5796 94 -4382 -4276 -4533 -5320 -1432 2906 4555
5200 4555 -526 2048 5892 3297 -1601 1360 2539 -1598 -6596 -338 7075 10030 9146 9828 1840
5185 1840 -3178 2087 6564 5539 6597 10834 5680 -2581 -2697 -1057 -367 -3001 -4058 -2631 -2128 -3419
5169 -3419 -4216 -3746 -3601 -2199 -4645 -7496 -7878 -4797 -1522 -1395 -5446 -4297 -8870 -15244 -10408 -8078
5153 -8078 -6823 -3895 -86 1518 2467 1940 1609 9347 9322 7065 2543 -3123 -4026 -3294 -5659 -8569 -1764
5136 -1764 2049 -414 1442 6835 8387 3640 5560 5553 -1035 -3465 -2927 -5684 -3960 -3535 -3590 -4655 -4715
5119 -4715 -3473 -2682 -1641 -3384 -8020 -5550 -1973 -15 -4546 -2088 -4276 -5342 1591 3510 821
5104 821 -1183 -3070 -251 479 -1467 3383 5459 1435 -1752 -4980 -8925 -11772 -6101 -1610 2686
5089 2686 1617 1797 3047 6373 1702 124 664 1162 -2487 -7280 -7069 -8613 -7737 -5003 -1852 549
5073 549 3041 808 -1423 -1248 -3209 8351 12531 6543 2138 1512 3167 2885 1110 1537 1530 -244 -1204
5056 -1204 -3657 1311 1755 1151 217 -1587 1415 5458 2876 4510 9840 6060 845 -1587 -1315 84
5040 84 1415 2140 4786 -1067 -2552 121 722 623 1676 -460 3130 8545 7409 2746 -3384 -5462
5024 -5462 -1445 -3156 -2081 3446 9557 12274 6158 1699 2757 1456 -2157 -3571 -1727 -4026 -3345
5009 -3345 -4587 -4556 -4965 -3609 3035 1464 1951 -3097 -3886 1956 3626 6526 6822 4721 1997 -609
4993 -609 -1611 -4346 -6570 -3033 -4330 -4381 -989 1520 -17 -1989 1541 4957 4416 2741 8773 8093
4977 8093 1823 -1802 -5970 -7827 -14431 -15469 -9068 -2342 -1308 -3500 -3451 623 -1851 -7917 -5970
4962 -5970 -2381 -1923 -3505 -775 1095 6381 8103 7297 11960 11859 6296 753 -291 -776 1492 2008
4946 2008 1872 639 1807 1557 3311 -2703 -6682 -5733 -4975 -6301 -784 -1526 -2336 1909 6482 4869
4930 4869 -3421 -3773 -6234 -6926 -5257 -1517 2173 -1719 -3899 -2254 -703 -1532 -5615 -2878 1473 2223
4914 2223 3753 6333 5949 5214 3535 1650 2648 2531 1908 3027 6601 5349 6587 1891 3349 4153
4898 4153 6940 10503 9092 9667 6944 4919 1572 -310 -472 -3623 -6841 -5403 -3405 -859 -1303 -2168
4882 -2168 -1967 -3875 -4838 -4953 -5635 -662 1868 3726 3672 1976 -285 -3111 -1034 -1735 -2190 1768 -732
4865 -732 -5148 -5132 -4753 4085 8750 6192 2706 1464 2186 5884 12395 10301 2845 -2612 -1996 89
4849 89 1238 4086 4018 -185 -5166 -416 4873 575 -589 1404 8130 8111 9666 11558 8207 4982
4833 4982 382 3196 7431 8256 7113 4560 4172 547 -216 1534 3422 2645 3228 7221 5554 4146
4817 4146 2123 7042 10594 8532 12616 9884 10366 6796 5572 7513 8142 9777 7120 3418 3815 3712
4801 3712 5428 4977 1529 -5171 -10700 -10143 -3053 68 -3001 -1780 2583 4457 7788 9349 4375
4786 4375 2095 3440 4480 5598 7838 4236 -3035 -4344 -1283 -2557 -6024 -5050 153 2547 212
4771 212 1013 4468 3370 -1456 -2499 -1853 363 980 723 1252 1649 3490 2474 4500 2900 1874 708
4754 708 -2401 -2001 -2347 -2713 2266 -2507 -8981 -10710 -9495 -8435 -5186 -32 58 -5538 -6473 -4558 -214
4737 -214 627 -620 -1348 2282 -3011 -4952 -8129 -6363 -7213 -4654 4336 6630 904 -4291 -8757 -12005
4721 -12005 -5636 -1591 1921 4360 9607 9754 7993 11204 14767 9357 5876 6119 3809 1183 261
4706 261 2772 3406 3714 670 -1013 -592 4781 9790 8150 6282 3834 -341 -2270 -4019 -3979 -5170
4690 -5170 -5788 -6883 -3498 558 604 -147 417 -2064 -492 696 -8 1775 1174 1378 -692 2076 4304
4673 4304 2392 1536 -399 503 4339 4124 -21 -1453 1673 1409 3219 2241 -1427 -1464 1242 4334 31
4656 31 -3403 -2983 -1353 -1614 -3480 -481 1709 2929 3172 491 2604 -269 -4867 -4369 -3977 -2774 -3128
4639 -3128 -2755 873 7029 4215 4129 5361 4140 4941 5433 1185 3470 6523 6557 3878 -3785 -1160 -1550
4622 -1550 -136 3237 4404 4070 5747 3555 2043 2833 -198 -1805 -2568 167 1513 5206 4761 3427
4606 3427 3857 5129 5393 3826 1620 47 -801 -7531 -6702 -3894 1293 1652 2426 2876 3961 2722 3858
4589 3858 3613 6492 8518 6173 1635 3999 5618 4792 7095 10198 6815 5289 292 162 63 1397
4573 1397 9038 11519 6905 5094 6415 2400 835 -1617 -3628 -2080 -510 -1365 3444 4343 5308 5710
4557 5710 4559 4706 10784 8708 2032 -3023 -2034 -1601 1148 5292 5746 4094 5137 3247 4358 9377
4541 9377 8739 668 -154 2848 -96 328 -2155 -2764 3625 9630 12025 9192 2052 -1550 -521 1882
4525 1882 6317 12541 9911 2461 25 -1944 -1189 708 790 6721 6920 2635 3250 9255 7378 8160
4509 8160 4685 895 4571 3388 4384 975 7 -114 2074 7027 7156 6897 7238 826 -2546 -3076 1139
4492 1139 7011 4035 2184 4448 7868 6674 2225 6106 14203 14971 12342 8683 3112 -2526 -1212
4477 -1212 -1989 1998 799 -3739 -1258 6524 9111 4651 6195 3137 660 -951 -228 3301 4257 1291
4461 1291 -1300 437 5599 4966 2747 4449 3400 8107 3563 2971 8801 7173 -2626 -3784 -2665
4446 -2665 1602 4601 5478 4799 2321 1631 -3341 -4595 -4244 -2740 2612 5646 3857 2990 1997 -2344
4430 -2344 -5369 -5304 -5243 -6999 -5851 -6700 -922 3001 7544 796 -271 3575 1086 2813 9591 10207
4414 10207 4865 -5234 -9110 -526 561 -4511 -6605 -4726 -1205 2232 5488 3997 -300 -3713
4400 -3713 -4498 -4314 -2059 3380 1794 3390 7338 8913 5982 -664 -4577 -2567 -157 5039 8820
4385 8820 9160 11403 7562 6313 -199 -4738 -3194 82 3860 9019 3580 3799 3570 2220 570 -7491
4369 -7491 -8471 -8241 -6537 -6111 -9599 -9167 -4934 -3251 -190 2629 2584 -423 -1208 3513 2165 -876 -2023
4352 -2023 1848 4615 69 -1687 871 2602 -2041 -2095 4110 6857 3139 258 -692 -3726 -1181 636
4336 636 5923 4062 3712 -1012 237 2649 -875 677 1748 -2474 2738 3187 6004 6516 2858 628
4320 628 3048 3460 6437 12357 12461 8565 6404 9613 4129 1584 2443 3617 6478 6424 5868 7421 6648
4303 6648 3334 670 1952 -457 -2846 1215 5307 2363 -1985 -3225 -1442 -2987 -3701 -1116 3162
4288 3162 -1575 2181 5127 4069 7426 11990 9509 7859 4423 7598 9742 11998 7493 648 -2328
4273 -2328 -3600 -3021 -1794 1995 5662 6134 -1070 -1347 -112 757 2729 3358 1351 2091 -1636 -5213
4257 -5213 -6219 -825 3130 1017 3504 4605 2676 2016 2696 286 90 -2532 -472 4299 2984 -312
4241 -312 -2680 -7346 -1366 1734 4539 6746 6103 4282 2526 -62 -3686 -2828 -2973 -520 3972 5240
4225 5240 2061 1727 7524 7350 3535 3610 7224 6819 6447 6490 9697 6765 3378 5696 5976 7957 11262
4208 11262 10847 10719 11250 12083 11026 8927 4581 3783 4004 4620 7864 8621 4384 -170 765 6096 7999
4191 7999 7105 6268 4686 2506 3543 4617 -1250 -3450 1583 -235 -1102 1298 2392 4297 4940 5433
4175 5433 6569 2303 -1389 -1441 -579 -3370 1170 5653 3402 144 2236 5058 -1788 -1971 3149 872
4159 872 -4184 -1811 -102 2670 742 1375 2909 1900 306 -1778 -2230 -1125 5194 11779 9213 4253
4143 4253 5748 8987 9024 10050 11423 10328 10732 12697 12576 11638 11819 14307 16348 14037 7538 4514
4127 4514 6476 8599 4811 4852 5203 9803 12011 15567 13743 6279 1225 -640 2086 2494 2556 1006
4111 1006 -2001 -3738 -7720 -6675 -2668 2207 5560 2169 3279 1239 3682 5434 4623 720 4386
4096 4386 8171 6774 5367 2310 1252 3084 3196 4075 8295 5326 233 -3057 -2369 -809 3813 6841
4080 6841 8956 1163 -1381 2223 1167 727 3099 5306 11166 8324 1630 -1820 -1637 -3175 1894
4065 1894 5376 9029 7692 4499 5580 -1281 -3683 428 5598 11311 15336 14641 13001 12791 9427
4050 9427 3561 2918 3689 401 -2778 -2492 -499 801 -1298 -3074 -662 3331 6322 -630 -3520 -4911
4034 -4911 -2205 1037 4281 6812 3916 -86 1519 -723 1258 2373 4453 4747 7880 9159 4833
4019 4833 576 3390 -203 -4182 -4826 -3164 -3492 -1078 2964 9391 9041 5620 4597 1286 5775 8898
4003 8898 6733 7373 6186 9485 9496 7556 9854 9908 8125 4210 6215 10947 14669 10334 3882 902
3987 902 5668 7158 2731 2218 3457 4629 7052 6332 6459 6761 2042 925 1270 1681 -306 1131 5731
3970 5731 7967 6055 6185 1572 4198 528 -249 4527 7009 4899 5360 6922 7720 8735 8245 2834
3954 2834 2262 5155 8035 5186 -202 -1887 3423 -639 -4645 -2209 -4738 -5221 -1371 -1349 5353 8147
3938 8147 5252 1053 1801 3972 3564 6096 10430 9108 9165 4675 1787 8320 3879 4 1623 5662
3922 5662 8197 6402 12235 11652 11436 11021 10532 7280 2108 3627 7063 4683 2207 1451 -121 6016
3906 6016 7037 7778 7872 5057 2467 171 -296 83 498 2651 7723 9203 9703 5709 6637 6283 6920
3889 6920 6557 7915 9792 7005 2207 -1931 -4203 -723 6062 9146 6735 1173 869 -1602 -1128 66
3873 66 1791 2172 29 -503 963 2825 2108 -270 3457 6901 7731 11107 11392 7886 6100 9358 8746
3856 8746 5517 3049 2980 3858 7066 8997 3647 -2073 -1456 -846 3501 5908 2948 3645 326 -683
3840 -683 2041 905 1899 3618 4644 6884 11782 9125 4371 6457 5745 6251 6076 6757 6407 8149 9081
3823 9081 7775 2247 3428 2772 6253 7458 6135 1346 -165 0 2428 5676 3421 -3429 -5506
3808 -5506 -1807 -1079 3138 7754 11293 7519 2860 -1458 -3814 -2162 -469 1790 2525 -1115 -403 2892
3792 2892 6332 6614 6006 8128 8838 9702 9095 7876 10497 13040 3485 1788 4538 1026 -1657 2230
3776 2230 6253 9257 9206 11361 13899 9194 2176 5711 8794 2097 2141 11607 12193 7010 8970 5574
3760 5574 2935 3689 7460 6890 8449 12482 9185 6246 6539 6642 2706 498 3469 4078 3042 4199
3744 4199 1836 3120 2005 -1139 -1935 -944 -155 3960 4674 -348 -2931 -3299 330 5916 9654 9762
3728 9762 11182 12453 1904 -3855 -310 4363 4539 4603 8222 11807 8987 3488 2034 1272 2300 3689
3712 3689 279 2404 7811 7346 3737 4210 1612 2426 4567 7000 4172 4235 3075 6593 7088 7008 8733
3695 8733 10790 10967 5634 1303 1589 2004 9025 16741 17550 16167 12404 8059 7810 6338 8673 8152
3679 8152 6866 6377 4646 3096 5025 8549 2524 -1780 2441 8535 7754 -266 1552 7518 8750
3664 8750 10496 10712 8435 9607 11186 6872 642 -1343 3777 4447 2109 -3159 -1830 5200 6527
3649 6527 6822 6216 8775 7950 4745 4128 4669 4282 4172 6255 7777 5831 2542 5016 4266 3290 5230
3632 5230 7229 6405 3877 3867 805 3618 9529 9319 10202 8523 2041 -2637 1840 2305 5141 8218
3616 8218 4099 907 1944 -1215 -3377 2910 7057 1847 -1112 -3649 -166 2003 6123 5933 754
3601 754 2159 7181 299 -7123 -3383 2796 7618 3463 211 742 1236 4361 4559 6457 9747 7720
3585 7720 5613 -427 -2974 1272 1389 8916 12376 8009 5203 6305 9023 11786 6607 2706 -3524
3570 -3524 -7163 -5911 -3567 -5570 -5892 2931 7900 7052 6484 9425 10495 8999 8987 5801 2698 5764
3554 5764 9317 11507 11486 9056 6316 4398 3248 2458 2325 8195 13703 12337 8066 10005 11106 6242
3538 6242 -1768 -674 5634 8227 6322 1895 2160 6955 5496 6309 10515 14669 17554 13421 7978
3523 7978 4168 -809 -215 286 1047 4061 9136 12176 12637 13268 16190 13385 3734 414 -168 4227
3507 4227 6297 8337 8585 4151 4724 5776 6741 10485 11048 11133 56 -2829 -576 -1917 -5182 -4518
3491 -4518 -147 1026 2283 6251 4954 1198 1022 3257 5474 6173 8816 11233 9740 6512 3780
3476 3780 1300 5539 7013 13441 12674 9672 7945 3828 -3053 -5785 -791 3148 4229 6422 6503 317
3460 317 -3729 1657 9715 9296 11365 15514 10511 8993 11786 7838 3669 -1033 193 8238 10908
3445 10908 5109 7361 7686 3478 948 2655 5821 7794 7772 5133 2778 3842 3978 6435 3570 704
3429 704 -177 3659 6847 10504 6280 6970 4625 7419 9600 12930 15026 7650 4380 4921 8322 11374
3413 11374 15249 18716 12806 9717 9645 6432 2593 4730 5644 9402 11831 7649 2928 -1402 1174
3398 1174 7382 11084 15255 10841 3237 3636 819 -3668 70 2296 5377 7136 3152 3191 7081 5064
3382 5064 5831 10557 7406 3458 6921 8365 2300 2160 4460 4106 -177 364 7599 9361 7171 1420
3366 1420 2688 4824 3136 1837 5710 6121 8562 10238 7737 5581 7606 7256 5343 8792 7334
3351 7334 6109 5350 5076 5589 4772 1949 2299 4056 2234 2836 554 231 5709 7592 2540 -1618 -1839
3334 -1839 1738 3000 8284 9587 6250 2543 2741 -42 1603 2336 1292 3564 3522 5048 4538 741
3318 741 1768 358 328 1305 1063 7101 8913 10679 10269 10583 8661 9893 11605 9669 9827 6892 4861
3301 4861 6083 5987 5758 4256 2461 5721 7629 7705 9175 9767 10176 10117 7738 6144 4885 3984 3231 5504
3283 5504 11572 14391 7693 4155 6675 10003 5919 4753 8197 8075 1615 -1380 -773 -1524 -4701 -4087
3267 -4087 728 617 2202 7207 10089 10491 8937 5904 3777 2561 4681 4830 2319 4628 5867 5727
3251 5727 5475 5445 3338 -3432 -7505 -7937 -5847 -6240 -4605 5289 15798 12605 10262 11255 12342 6140
3235 6140 -1882 -5958 -7734 -4444 385 1539 -1380 -1871 620 5542 6064 6528 8527 9832 11720 8490
3219 8490 7752 9744 3099 5627 7707 5092 3317 -501 1466 7100 380 815 3644 1343 1652 4527
3203 4527 -25 -1454 798 508 2072 8625 10527 11768 15017 12484 7341 7423 7915 9107 13287 16736
3187 16736 9667 5110 2813 2216 2039 -1623 -2151 -3134 -5816 -5633 -5323 -1717 2918 4820 2741 -1444
3171 -1444 -806 416 3113 6853 8473 11062 9391 568 -1978 -3943 -568 5656 8955 13514 20175
3156 20175 18516 12513 7394 6218 9261 7287 9035 10820 8890 14824 11135 2044 -712 -413 -5465
3141 -5465 -6064 176 1338 317 1117 4228 8057 6389 5521 6525 1866 -4570 -5945 -3240 -1991 -2894
3125 -2894 -1529 1759 6753 9086 5110 4243 4368 3755 7192 6250 3356 8214 10039 11489 15413 10058
3109 10058 6678 9049 10384 6566 6872 7565 4344 5848 5334 4131 207 453 3341 1682 2237 -863
3093 -863 2122 8503 10221 9736 5572 3553 -1043 -1522 -1763 -4954 -3490 -359 1758 6112 2373 1699
3077 1699 6959 9594 9577 8035 6594 9130 13775 16697 14044 10207 12583 11295 8627 6404 5219
3062 5219 3839 6635 8759 11662 13295 14946 13916 7975 1508 -1978 -1936 1741 705 1087 2909 3796
3046 3796 3247 5218 3442 2898 -365 3667 5438 -471 -3143 -360 4347 1448 5593 4452 4480 5979
3030 5979 3207 3650 7696 7054 5834 9346 9326 10339 10598 9669 11195 7239 4241 1659 110 314 6860
3013 6860 5506 8006 8350 5321 1642 1938 1942 -231 7274 10403 6679 3779 2559 -725 -1429 4265
2997 4265 9163 8432 5910 4587 6818 8314 9055 10763 13310 17539 15616 11373 4775 1110 307 344
2981 344 -2202 -1041 2925 4092 2066 -1556 -1711 -1801 -2216 -2754 -5450 -4217 -1051 1378 5496 6186 -5
2964 -5 -3651 -532 235 -3450 -3497 381 2113 4207 6974 7634 -646 -7147 -7283 140 1420 -810 1206
2947 1206 737 4019 11088 9858 8544 5620 3536 6458 10625 13353 15313 13301 8528 3805 6691
2932 6691 6931 8419 6152 -409 -33 3338 2192 3965 5198 7389 4429 -2682 351 945 1592 4546
2916 4546 6682 5351 6212 6544 7815 11969 5082 3166 -2821 -3967 3704 7328 4605 465 2584
2901 2584 3751 2350 7735 6530 2230 -37 293 -550 -2614 2910 5114 5112 6079 4072 4936 2008 836
2884 836 3789 3583 3239 -897 -2450 -948 554 1029 -1128 -2898 -5691 -5101 -2072 -1912 -3403 -2206
2868 -2206 -1303 -2696 -114 -1598 1287 6999 10468 10163 9588 12485 13617 11940 8451 7680 11605 8321
2852 8321 7828 4353 -2935 -2347 582 2633 1540 3269 6903 9652 12214 8299 2866 5174 6719
2837 6719 7813 8008 9002 7091 7164 5773 3157 4136 -1161 -6542 -6997 -909 4654 10353 8400 5494
2821 5494 6143 2795 942 747 -93 -2046 75 1963 5062 11621 13090 13402 12526 7248 6586 6969 1622
2804 1622 -2088 3534 7476 6237 4827 769 2147 7849 9519 5378 3410 499 -3349 -2049 2150
2789 2150 5239 5764 6247 2159 3461 5416 8443 8594 1791 -3527 1904 7892 9305 4064 4709 2797
2773 2797 603 -424 2077 9097 8197 2016 2548 -2799 484 5993 1970 -145 2062 3132 -535
2758 -535 2200 2871 -7021 -6706 -7778 -4536 -1141 1621 3402 3432 2779 3745 -205 2138 1230 -1870 880
2741 880 6905 10115 4304 -1783 1202 3791 5929 4688 5344 4775 1700 2149 3904 3321 1609 -1743
2725 -1743 1283 294 1145 1844 1677 7495 4091 1337 4323 6522 3016 588 1765 -2103 -5892 -10776
2709 -10776 -8098 -6862 -11156 -7185 -1346 2160 3687 10763 16152 14870 7388 2730 6716 9832 10618
2694 10618 9288 4286 -2197 -2278 -4499 -10632 -12176 -6062 -305 4505 3932 3552 -424 -3822 -4196 269
2678 269 -646 2191 3989 5918 8553 10241 8610 7910 6686 5671 4364 6099 4460 7612 4909 1827
2662 1827 627 2744 9766 8771 7953 6476 1846 6672 10094 8960 10648 9259 5299 2440 2553 -815
2646 -815 -5441 -1934 495 2175 -636 -848 7948 11652 8700 6938 7451 6106 4327 2995 5993 5893
2630 5893 5725 3020 2441 4480 795 2332 1205 -1432 -4097 -3659 811 5600 3657 -266 -1875 -1962
2614 -1962 -965 2061 3450 4048 282 -159 2950 3213 5438 9452 7922 9196 4896 3930 5260 4684
2598 4684 -3291 -2695 2174 4507 3155 833 3284 2021 -106 -3200 -62 -877 -1199 431 7196 8128
2582 8128 6470 5642 8180 4239 -3297 -5757 -5908 -2445 -2368 -1524 -2334 -1725 2039 4496 1941 -2125 3530
2565 3530 8381 4691 2899 -528 -907 -2027 2029 5735 5329 5759 5430 8764 8714 6348 1987 586
2549 586 -35 1382 2114 -366 -888 -1183 -2924 1056 5687 7160 8984 11246 8651 8566 4650 108 1999
2532 1999 2655 3118 -195 -3128 -4190 682 8157 10609 11329 3394 -848 -6134 -6253 -3449 -1144 -2257
2516 -2257 -41 583 710 2835 3341 5742 9411 9523 11644 10017 9593 9456 7627 2570 4018 7840
2500 7840 5824 7473 8407 6313 8500 8920 4596 1304 -176 1603 -1576 -5948 -2281 -1877 -1828 1285
2484 1285 4202 4182 1118 3411 8126 5856 4500 6138 3968 9222 12848 13609 8857 6102 2657 1819
2468 1819 6835 6762 1820 561 6940 10732 9296 7828 2471 3421 2839 3141 3686 1644 -2018 -429
2452 -429 -400 -1298 1664 5618 -1507 -5185 -5203 -2223 183 185 2419 4178 5047 3214 3404 3287 4761 3503
2434 3503 5134 7324 9232 7665 6880 5062 3139 4468 5423 8424 8930 8661 6318 -595 -2708 -4157
2418 -4157 -6231 -7671 -6882 -5894 -1419 -838 -4284 -3427 -3440 -4386 2587 373 -1579 271 -2092 -5828 -5121
2401 -5121 328 6648 8214 2944 -2491 -3456 -2426 968 4469 5723 10783 5582 -1167 -4690 -2949
2386 -2949 2867 3305 4250 7761 9948 9998 6263 8115 5459 2591 2280 1829 3831 7796 12667 10996
2370 10996 7802 5703 2698 1876 1278 -1127 -1783 3804 521 142 4064 7579 6868 4640 729 -419
2354 -419 681 3101 3004 2585 5589 5632 4312 4615 1690 -341 -1516 -3743 -4315 -5670 467 5871 4482
2337 4482 -930 2664 1582 -4554 -7061 -4531 -6004 616 5828 7809 8489 8979 7659 7048 5998 0
2321 0 2430 4630 2669 5732 7419 8712 9332 9845 9999 6435 10105 12780 10027 9333 5176 2145 -1397
$$ [...]
##END NTUPLES=NMR SPECTRUM
##END=
