##TITLE=Analysis number 320488
Compound Code gk 02804
Project Code adrs
Chemist Name endeavour
##JCAMPDX= 6.0         $$ Bruker NMR JCAMP-DX V2.0
##DATA TYPE= NMR SPECTRUM
##DATA CLASS= NTUPLES
##ORIGIN= Bruker BioSpin GmbH
##OWNER= nmr
$$ XWIN-NMR		Version 3.5
$$ Tue Jun 27 12:01:00 2006 GMT Daylight Time (UT+1h)  MAYBRIDGE\nmr@NMR_250MHZ
##.OBSERVE FREQUENCY= 250.131544655141
##.OBSERVE NUCLEUS= ^1H
##.ACQUISITION MODE= SIMULTANEOUS (DQD)
##.ACQUISITION SCHEME= undefined
##.AVERAGES= 16
##.DIGITISER RES= 18
##SPECTROMETER/DATA SYSTEM= dpx250
##.PULSE SEQUENCE= zg30
##.SOLVENT NAME= DMSO
##.SHIFT REFERENCE= (INTERNAL, DMSO, 0, 16.522)
##AUDIT TRAIL= $$ (NUMBER, WHEN, WHO, WHERE, WHAT)
$$ ##TITLE= Audit trail, XWIN-NMR		Version 3.5
$$ ##JCAMPDX= 5.01
$$ ##ORIGIN= Bruker BioSpin GmbH
$$ ##OWNER= nmr
$$ C:\u/data/dgb/nmr/ADRS/1580/pdata/1/auditp.txt
$$ ##AUDIT TRAIL=  $$ (NUMBER, WHEN, WHO, WHERE, WHAT)
(   1,<2006-06-27 12:00:40.07 +100>,<MAYBRIDGE\nmr>,<NMR_250MHZ>,
      <created by zg, POWCHK disabled, PULCHK disabled
       configuration hash MD5:
       E2 DF 36 D8 04 B2 41 60 5A D7 A3 38 5A 4B D0 FE
       data hash MD5: 64K
       9E 6B 4F D1 D7 3F 59 DF F7 C6 E2 6A C4 C2 20 90>)
(   2,<2006-06-27 12:00:51.81 +100>,<MAYBRIDGE\nmr>,<NMR_250MHZ>,
      <Start of raw data processing
       ef LB = 0.3 FT_mod = 6 PKNL = 1 SI = 32K 
       data hash MD5: 32K
       42 C1 A9 8E 02 89 82 A1 E4 F4 4F 5D 0B 95 F5 66>)
(   3,<2006-06-27 12:00:54.09 +100>,<MAYBRIDGE\nmr>,<NMR_250MHZ>,
      <apk 
       data hash MD5: 32K
       FF EF C0 BD 40 7F FF 08 85 3B 40 CF E7 5F A5 52>)
(   4,<2006-06-27 12:00:54.96 +100>,<MAYBRIDGE\nmr>,<NMR_250MHZ>,
      <abs ABSG = 5 
       data hash MD5: 32K
       31 2A EF F9 8A 81 F4 A4 80 63 C1 E4 D2 D2 5B 93>)
$$ ##END=
$$ 
$$ hash MD5
$$ 3B B9 16 5A EB DC 00 DC 20 35 50 23 B5 D0 30 A6
##$RELAX= 
##$RELAX= 
##$RELAX= 
##$RELAX= 
##$RELAX= 
##$RELAX= 
##$RELAX= 
$$ Bruker specific parameters
$$ --------------------------
##$DU= <C:\u>
##$EXPNO= 1580
##$NAME= <ADRS>
##$PROCNO= 1
##$TYPE= <nmr>
##$USER= <dgb>
##$AMP= (0..31)
100 100 100 100 100 100 100 100 100 100 100 100 100 100 100 100 100 100 
100 100 100 100 100 100 100 100 100 100 100 100 100 100 
##$AQSEQ= 0
##$AQ_mod= 3
##$AUNM= <au_zg>
##$AUTOPOS= <26 >
##$BF1= 250.13
##$BF2= 250.13
##$BF3= 250.13
##$BF4= 250.13
##$BF5= 500.13
##$BF6= 500.13
##$BF7= 500.13
##$BF8= 500.13
##$BYTORDA= 1
##$CFDGTYP= 0
##$CFRGTYP= 5
##$CHEMSTR= <none>
##$CNST= (0..31)
1 1 145 1 1 1 1 1 1 1 1 1 1 1 1 1 1 1 1 1 1 1 1 1 1 1 1 1 1 1 1 1 
##$CPDPRG= <>
##$CPDPRG1= <>
##$CPDPRG2= <>
##$CPDPRG3= <>
##$CPDPRG4= <mlev>
##$CPDPRG5= <mlev>
##$CPDPRG6= <mlev>
##$CPDPRG7= <mlev>
##$CPDPRG8= <mlev>
##$CPDPRGB= <>
##$CPDPRGT= <>
##$D= (0..31)
0 1 0 0 0 0 0 0 0 0.06 0 0 0 0 0 0 0.0002 0 0 0 0 0 0 0 0 0 0 0 0 0 0 
0 
##$DATE= 1151406039
##$DBL= (0..7)
120 120 120 120 120 120 120 120 
##$DBP= (0..7)
150 150 150 150 150 150 150 150 
##$DBP07= 0
##$DBPNAM0= <>
##$DBPNAM1= <>
##$DBPNAM2= <>
$$ [...]
##$SUBNAM7= <"">
##$SUBNAM8= <"">
##$SUBNAM9= <"">
##$SW= 20.6930455092707
##$SWIBOX= (0..15)
0 0 3 0 0 0 0 0 0 0 0 0 0 0 0 0 
##$SW_h= 5175.983436853
##$TD= 65536
##$TD0= 1
##$TE= 296.16
##$TE2= 300
##$TE3= 300
##$TEG= 300
##$TL= (0..7)
0 120 120 120 120 120 120 120 
##$TP= (0..7)
150 150 150 150 150 150 150 150 
##$TP07= 0
##$TPNAME0= <>
##$TPNAME1= <>
##$TPNAME2= <>
##$TPNAME3= <>
##$TPNAME4= <>
##$TPNAME5= <>
##$TPNAME6= <>
##$TPNAME7= <>
##$TPOAL= (0..7)
0.5 0.5 0.5 0.5 0.5 0.5 0.5 0.5 
##$TPOFFS= (0..7)
0 0 0 0 0 0 0 0 
##$TUNHIN= 0
##$TUNHOUT= 0
##$TUNXOUT= 0
##$USERA1= <user>
##$USERA2= <user>
##$USERA3= <user>
##$USERA4= <user>
##$USERA5= <user>
##$V9= 5
##$VALIST= <valist>
##$VCLIST= <CCCCCCCCCCCCCCC>
##$VD= 0
##$VDLIST= <DDDDDDDDDDDDDDD>
##$VPLIST= <PPPPPPPPPPPPPPP>
##$VTLIST= <TTTTTTTTTTTTTTT>
##$WBST= 1024
##$WBSW= 4
##$XGAIN= (0..3)
0 0 0 0 
##$XL= 0
##$YL= 0
##$YMAX_a= 182405
##$YMIN_a= -374505
##$ZGOPTNS= <>
##$ZL1= 120
##$ZL2= 120
##$ZL3= 120
##$ZL4= 120
##$ABSF1= 16.522
##$ABSF2= -4.171173
##$ABSG= 5
##$ABSL= 3
##$ALPHA= 0
##$AQORDER= 0
##$ASSFAC= 0
##$ASSFACI= 0
##$ASSFACX= 0
##$ASSWID= 0
##$AUNMP= <proc_1d>
##$AZFE= 0.1
##$AZFW= 0.1
##$BCFW= 0
##$BC_mod= 0
##$BYTORDP= 0
##$COROFFS= 0
##$CY= 12.5
##$DATMOD= 1
##$DC= 0
##$DFILT= <>
##$DTYPP= 0
##$F1P= 14.0000005364418
##$F2P= -0.99999901652339
##$FCOR= 0.5
##$FTSIZE= 32768
##$FT_mod= 6
##$GAMMA= 0
##$GB= 0
##$INTBC= 1
##$INTSCL= 1
##$ISEN= 128
##$LB= 0.3
##$LEV0= 0
##$LPBIN= 0
##$MAXI= 10000
##$MC2= 0
##$MEAN= 0
##$ME_mod= 0
##$MI= 0
##$NCOEF= 0
##$NC_proc= -4
##$NLEV= 6
##$NOISF1= 0
##$NOISF2= 0
##$NSP= 0
##$NTH_PI= 0
##$NZP= 0
##$OFFSET= 16.522
##$PC= 1
##$PHC0= 155.6628
##$PHC1= 24.74059
##$PH_mod= 1
##$PKNL= yes
##$PPARMOD= 0
##$PSCAL= 4
##$PSIGN= 0
##$REVERSE= no
##$SF= 250.13
##$SI= 32768
##$SIGF1= 0
##$SIGF2= 0
##$SINO= 400
##$SIOLD= 32768
##$SREGLST= <1H.DMSO>
##$SSB= 0
##$STSI= 32768
##$STSR= 0
##$SW_p= 5175.98343685301
##$SYMM= 0
##$S_DEV= 0
##$TDeff= 65536
##$TDoff= 0
##$TI= <Analysis number 999999
Compound Code 99
Book Reference 9
Project Code 9>
##$TILT= no
##$TM1= 0
##$TM2= 0
##$TOPLEV= 0
##$USERP1= <user>
##$USERP2= <user>
##$USERP3= <user>
##$USERP4= <user>
##$USERP5= <user>
##$WDW= 1
##$XDIM= 32768
##$YMAX_p= 346036194
##$YMIN_p= -408605
$$ End of Bruker specific parameters
$$ ---------------------------------
##NTUPLES= NMR SPECTRUM
##VAR_NAME=  FREQUENCY,     SPECTRUM/REAL,   SPECTRUM/IMAG
##SYMBOL=    X,             R,               I
##VAR_TYPE=  INDEPENDENT,   DEPENDENT,       DEPENDENT
##VAR_FORM=  AFFN,          ASDF,            ASDF
##VAR_DIM=   32768,         32768,           32768
##UNITS=     HZ,            ARBITRARY UNITS, ARBITRARY UNITS
##FACTOR=    0.157963299565203, 1,           1
##FIRST=     4132.6476996994, 0,             0
##LAST=      -1043.33573715361, 0,           0
##MIN=       -1043.33573715361, -408605,     0
##MAX=       4132.6476996994, 346036194,     0
$$ Real data points
##PAGE= N=1
##DATA TABLE= (X++(R..R)), XYDATA
$$ [...]
$$ plain form
23968 447482 392837 413168 487710 527874 537197 510793 431134 411539 418672 420184 423852 481040
23956 481040 510358 524302 631224 701874 673232 693157 695647 681172 668758 525935 500161
23945 500161 517539 491172 479829 442840 445488 447021 426929 414603 428346 465953 460380 458792
23933 458792 403399 400535 346675 332770 415966 514360 530101 572258 576628 546473 431162 451089
23921 451089 459486 447427 504709 579941 525011 578840 663577 560136 373668 298381 353455
23910 353455 530775 564212 520806 468590 475959 589337 566999 407901 381744 325648 431748
23899 431748 464429 399840 323277 376909 429562 415096 400198 417980 404532 440795 442694 423839
23887 423839 304777 235297 296268 429931 495902 388946 294649 342706 364529 474527 524910
$$ packed form
23968D47482n4645K0331P4542M0164R323k6404p9659j9595P133J512L668N7188
23956D81040K9318J3944J06922P0650k8642J9925K490j4475j2414j42823k5774
23945E00161J7378k6367j1343l6989K648J533k0092j2326J3743L7607n573j588
23933D58792n5393k864n3860j3905Q3196R8394J5741M2157M370l0155j15311J9927
23921D51089Q397j2059N7282P5232n4930N3829Q4737j03441j86468p5287N5074
23910C53455J77320L3437m3406n2216P369J13378k2338j59098k6157n6096J06100
23899D31748L2681o4589p6563N3632N2653j4466j4898J7782j3448L6263J899j8855
23887D23839j19062o9480O0971J33663O5971j06956r4297M8057K1823J09998N0383
$$ plain form
23876 524910 496889 462839 458454 497041 464784 386566 387588 407723 371272 380381 472764 342284
23864 342284 193405 251251 396786 345097 368799 401673 443920 350676 259816 306242 406733
23853 406733 384283 403251 557301 488638 416276 360462 404757 329595 238750 308609 394677
23842 394677 424107 402135 374235 455078 507277 464782 382532 363554 376432 343946 240907
23831 240907 258276 222071 247856 318755 298662 395839 408150 339683 385875 510270 550024
23820 550024 474272 455772 440197 450138 392001 381135 370943 321988 474630 519783 406361
23809 406361 399678 410177 389655 310150 361404 426995 504565 483039 472961 503315 460655 567105
23797 567105 551490 414700 272391 175594 236939 300701 284907 312359 267027 272501 310181
$$ packed form
23876E24910k8021l4050m385L8587l2257p8218J022K0135l6451R109R2383j30480
23864C42284j48879N7846J45535n1689K3702L2874M2247r3244r0860M6426J00491
23853D06733k2450J8968J54050o8663p2362n5814M4295p5162r0845O9859Q6068
23842C94677K9430k1972k7900Q0843N2199m2495q2250j8978J2878l2486j03039
23831B40907J7369l6205K5785P0899k0093R7177J2311o8467M6192J24395L9754
23820E50024p5752j8500j5575R941n8137j0866j0192m8955J52642M5153j13422
23809D06361o683J0499k0522p9505N1254O5591P7570k1526j0078L0354m2660J06450
23797E67105j5615j36790j42309r6797O1345O3762j5794K7452m5332N474L7680
$$ plain form
23786 310181 296429 252099 306221 389457 335010 338939 305636 292443 211194 222134 267780 233904
23774 233904 200853 277413 381607 348688 283190 244266 242669 260621 305340 397928 356863
23763 356863 288392 255622 166050 105656 215964 262327 253329 267340 267451 268775 334989 356671
23751 356671 253045 246284 282540 282297 289579 249435 244801 315817 370940 323519 265500 291163
23739 291163 344067 234490 117411 90387 107202 190392 232750 226208 258508 237792 273644
23728 273644 303307 286558 350480 323278 280566 213316 286127 424927 454662 400171 341949
23717 341949 342026 352953 362466 323710 364447 370972 251652 129319 37809 66895 261037 369090
23705 369090 302895 236180 357240 426498 300840 276572 259912 215402 268446 384225 349845
$$ packed form
23786C10181j3752m4330N4122Q3236n4447L929l3303j3193q1249J0940M5646l3876
23774B33904l3051P6560J04194l2919o5498l8924j597J7952M4719R2588m1065
23763C56863o8471l2770q9572o0394J10308M6363q998J4011J11J324O6214K1682
23751C56671j03626o761L6256k43P282m0144m634P1016N5123m7421n8019K5663
23739B91163N2904j09577j17079k7024J6815Q3190M2358o542L2300k0716L5852
23728B73644K9663j6749O3922k7202m2712o7250P2811J38800K9735n4491n8222
23717C41949P7J0927R513l8756M0737O525j19320j22333r1510K9086J94142J08053
23705C69090o6195o6715J21060O9258j25658k4268j6660m4510N3044J15779l4380
$$ plain form
23694 349845 361050 430018 426507 420927 436665 383581 453635 463425 408228 513009 494887 419410
23682 419410 321418 282347 289711 379633 361508 302447 247304 215525 197136 191493 247145 301594
23670 301594 338372 313117 277519 283874 303464 299517 395105 438991 436831 465624 487475 450501
23658 450501 350762 273242 312481 308249 275388 275834 262373 241768 313409 365582 397749 350367
23646 350367 455639 456058 423191 386414 292793 231258 233960 211195 136610 170614 190190 246173
23634 246173 295151 254489 208844 280905 345144 302733 272927 310203 301536 293732 281027 143123
23622 143123 191745 286610 338439 299265 289718 308280 305739 278179 214752 228169 239465 249648
23610 249648 247798 330721 259424 206559 275950 250501 259483 229862 154935 90984 164742 267833
$$ packed form
23694C49845J1205O8968l511n580J5738n3084P0054R790n5197J04781j8122p5477
23682D19410r7992l9071P364Q9922j8125n9061n5143l1779j8389n643N5652N4449
23670C01594L6778k5255l5598O355J9590l947R5588M3886k160K8793K1851l6974
23658D50501r9739p7520L9239m232l2861M46j3461k0605P1641N2173L2167m7382
23646C50367J05272M19l2867l6777r3621o1535K702k2765p4585L4004J9576N5983
23634B46173M8978m0662m5645P2061O4239m2411k9806L7276q667p804j2705j37904
23622A43123M8622R4865N1829l9174r547J8562k541k7560o3427J3417J1296J0183
23610B49648j850Q2923p1297n2865O9391k5449Q982k9621p4927o3951P3758J03091
$$ plain form
23598 267833 254122 273021 334702 329004 382648 338604 299743 220326 206535 257648 307489 323096
23586 323096 278454 205457 266426 233615 173465 92917 168825 182340 240063 287278 317954
23575 317954 256074 202170 265380 327997 398735 330030 301776 293607 294719 323888 294902 264367
23563 264367 224248 189016 305537 258231 253129 329387 370969 397367 432058 444217 359616
23552 359616 187633 94495 132517 267075 321995 270218 260611 269942 387201 290219 157239
23541 157239 201354 260390 185419 96578 158937 300871 373948 331465 213459 233337 296384
23530 296384 291310 189900 177397 231343 187005 81071 56951 90920 131804 266170 386842
23519 386842 436689 406465 321878 386714 422534 346337 237256 198852 250413 229060 181813
$$ packed form
23598B67833j3711J8899O1681n698N3644m4044l8861p9417j3791N1113M9841J5607
23586C23096m4642p2997O0969l2811o0150q0548P5908J3515N7723M7215L0676
23575C17954o1880n3904O3210O2617P0738o8705k8254q169J112K9169k8986l0535
23563B64367m0119l5232J16521m7306n102P6258M1582K6398L4691J2159q4601
23552C59616j71983r3138L8022J34558N4920n1777r607R331J17259r6982j32980
23541A57239M4115N9036p4971q8841O2359J41934P3077m2483j18006J9878O3047
23530B96384n074j01410j2503N3946m4338j05934k4120L3969M0884J34366J20672
23519C86842M9847l0224q4587O4836L5820p6197j09081l8404N1561k1353m7247
$$ plain form
23508 181813 154841 168278 263228 327896 369483 326206 361299 337476 353108 260955 182006
23497 182006 152385 291949 313354 236983 290307 320943 218821 144543 228167 268886 332530
23486 332530 343558 267748 153784 93734 143616 229796 266915 182064 163426 162358 180079
23475 180079 215811 83253 66940 62156 175796 303900 267627 212836 83373 148189 166001
23464 166001 108874 103404 41474 -23616 -107753 -108928 84853 158291 186446 164293 110819 127206
23452 127206 187291 217723 190469 74857 78414 67625 45130 74852 193653 117624 43526
23441 43526 31927 72485 115901 123434 140165 136403 88760 160215 215829 270708 196218 108403
23429 108403 -49002 -13681 119079 103866 138150 225445 240849 199643 210783 237727 222855
$$ packed form
23508A81813k6972J3437R4950O4668M1587m3277L5093k3823J5632r2153p8949
23497A82006k9621J39564K1405p6371N3324L0636j02122p4278Q3624M0719O3644
23486C32530J1028p5810j13964o0050M9882Q6180L7119q4851j8638j068J7721
23475A80079L5732j32558j6313m784J13640J28104l6273n4791j29463O4816J7812
23464A66001n7127n470o1930o5090q4137j175J93781P3438K8155k2153n3474J6387
23452A27206O0085L0432k7254j15612L557j0789k2495K9722J18801p6029p4098
23441D3526j1599M0558M3416P533J6731l762m7643P1455N5614N4879p4490q7815
23429A08403j57405L5321J32760j5213L4284Q7295J5404m1206J1140K6944j4872
$$ plain form
23418 222855 160113 154008 165005 204927 179155 94405 25699 125874 222816 326862 257026
23407 257026 162896 226647 293640 243990 189901 152193 134132 171849 246258 340872 308292
23396 308292 186323 69480 77223 222578 240979 229426 244126 254687 202263 109474 1470
23385 1470 -25510 -24010 47256 176623 133824 44842 116941 194921 80211 37968 -31403 23358
23373 23358 -82456 -100769 -13750 70845 38745 49928 145672 162094 126139 177351 104738
23362 104738 44776 155778 248046 289436 298786 243069 61916 92224 213106 250936 184284
23351 184284 177459 202661 147358 102778 157673 245701 359036 267586 132150 63892 101821
23340 101821 35849 26077 69772 55419 160676 122632 136231 137188 127091 64872 361 45648
$$ packed form
23418B22855o2742o105J0997L9922k5772q4750o8706J00175R6942J04046o9836
23407B57026r4130O3751O6993m9650n4089l7708j8061L7717P4409R4614l2580
23396C08292j21969j16843P743J45355J8401j1553J4700J0561n2424r2789j08004
23385A470k6980J500P1266J29367m2799q8982P2099P7980j14710m2243o9371N4761
23373B3358j05814j8313Q7019Q4595l2100J1183R5744J6422l5955N1212p2613
23362A04738n9962J11002R2268M1390R350n5717j81153L0308J20882L7830o6652
23351A84284o825K5202n5303m4580N4895Q8028J13335r1450j35436o8258L7929
23340A01821o5972r772M3695j4353J05257l8044J3599R57j0097o2219o4511M5287
$$ plain form
23328 45648 60063 161583 213756 193761 215945 315417 311041 258090 288017 349460 325543 257753
23316 257753 191057 147896 159416 125517 78650 136935 197843 252151 202744 147659 138036 147800
23304 147800 119535 37673 -74290 -3220 77291 61105 117006 116179 87335 60380 84437 68878
23292 68878 56608 121768 120794 99963 207893 320654 225769 262842 288042 240419 152252 154152
23280 154152 159357 93482 78411 49208 331 -104691 9056 87987 -49692 -94663 -38088
23269 -38088 -64481 -61062 -47212 -71235 -56219 -35468 -60725 -18056 -12745 -15975 139129 228596
23257 228596 229665 68475 83355 2824 -68483 -106474 -108280 -10942 57043 -89450 -103676
23246 -103676 -15212 71716 82782 3473 64075 97502 119831 92275 55929 15460 102826
$$ packed form
23328D5648J4415J01520N2173j9995K2184R9472m376n2951K9927O1443k3917o7790
23316B57753o6696m3161J1520l3899m6867N8285O0908N4308m9407n5085r623R764
23304A47800k8265q1862j11963P1070Q0511j6186N5901q27k8844k6955K4057j5559
23292F8878j2270O5160r74k0831J07930J12761r4885L7073K5200m7623q8167J900
23280A54152N205o5875j5071k9203m8877j05022J13747P8931j37679m4971N6575
23269c8088k6393L419J3850k4023J5016K0751k5257M2669N311l230J55104Q9467
23257B28596J069j61190J4880q0531p1307l7991j806R7338O7985j46493j4226
23246a03676Q8464Q6928J1066p9309O0602L3427K2329k7556l6346m0469Q7366
$$ plain form
23235 102826 77293 80728 112852 108080 97732 118702 57481 -36567 -30371 -29450 -8405 62282
23223 62282 124935 206589 247113 183099 114963 85295 96902 172922 245459 225308 177160 156017
23211 156017 106046 131997 64863 11814 84876 106398 148343 125765 145020 255980 190667
23200 190667 142809 179082 174735 61999 72568 180425 141039 248041 324783 175469 99354
23189 99354 202507 216660 163225 212529 200055 17658 26552 151728 91923 10706 59925
23178 59925 46496 89030 122795 128817 59149 170170 222097 165943 86332 133914 83080 4772
23166 4772 9679 114890 177291 184078 163924 250460 230628 255665 253510 244981 186061 192464 134633
23153 134633 93441 132559 146497 184225 222763 98506 61315 151555 115551 51810 -26486
$$ packed form
23235A02826k5533L435L2124m772j0348K0970o1221r4048O196R21K1045P0687
23223F2282O2653Q1654M0524o4014o8136k9668J1607P6020P2537k0151m8148k1143
23211A56017m9971K5951o7134n3049P3062K1522M1945k2578J9255J10960o5313
23200A90667m7858L6273m347j12736J0569J07857l9386J07002P6742j49314p6115
23189I9354J03153J4153n3435M9304j2474j82397Q894J25176n9805q1217M9219
23178E9925j3429M2534L3765O022o9668J11021N1927n6154p9611M7582n0834p8308
23166D772M907J05211O2401O787k0154Q6536j9832K5037k155q529n8920O403n7831
23153A34633m1192L9118J3938L7728L8538j24257l7191R0240l6004o3741p8296
$$ plain form
23142 -26486 -37500 -58431 -75298 -109017 -8637 -7431 42765 30120 84002 88728 -8466 -18668
23130 -18668 -37770 -52093 -28123 -62481 54028 166045 175425 139573 183023 183162 280807 165286
23118 165286 98407 76196 90534 91408 173532 151091 165915 211532 109421 67964 46025 108617
23106 108617 120681 36966 42982 -48435 -40661 20680 33757 107209 55158 -84864 -42173 96919
23094 96919 73985 57234 116240 215831 271176 268624 193721 209136 187935 162025 87322 33906
23082 33906 106469 148468 69078 40401 108997 140234 69673 46746 47846 97567 281377 294645
23070 294645 164275 4843 -49717 -27608 -7915 88621 167503 160742 69878 -13795 -92093
23059 -92093 -86195 -55748 -3468 78292 59694 12965 61624 61751 -7084 -18194 -43226 -30447
$$ packed form
23142b6486j1014k0931j6867l3719J00380J206N0196j2645N3882M726r7194j0202
23130a8668j9102j4323K3970l4358J16509J12017R380l5852M3450J39R7645j15521
23118A65286o6879k2211J4338Q74Q2124k2441J4824M5617j02111m1457k1939O2592
23106A08617J2064q3715O016r1417P774O1341J3077P3452n2051j40022M2691J39092
23094I6919k2934j6751N9006R9591N5345k552p4903J5415k1201k5910p4703n3416
23082C3906P2563M1999p9390k8677O8596L1237p0561k2927J100M9721J83810J3268
23070B94645j30370j59432n4560K2109J9693R6536P8882o761r0864q3673p8298
23059i2093N898L0447N2280Q1760j8598m6729M8659J27o8835j1110k5032J2779
$$ plain form
23047 -30447 5263 90688 116778 120715 113874 119428 155833 180038 176405 304734 319467 226365
23035 226365 123690 142950 78488 17926 -56858 -83332 -72964 -155584 -26008 50922 -48254
23024 -48254 51054 187628 156481 117547 174775 199569 158500 89255 99029 38482 51762 117661
23012 117661 143019 73983 69833 67774 59049 142594 133590 226939 208475 188616 94625 50833
23000 50833 -22349 -38452 -9008 122740 233107 263822 251639 239868 210142 90352 37276
22989 37276 118233 114475 111432 55223 111997 113226 80354 80962 81268 92221 63481 71124 52986
22976 52986 85550 83805 8444 -69785 47492 -7454 -20784 3108 -35652 -103842 -49765 -32048
22964 -32048 91856 87777 -39420 34900 70211 40189 6376 118065 186861 157026 23716
$$ packed form
23047c0447L5710Q5425K6090L937o841N554L6405K4205l633J28329J4733r3102
23035B26365j02675J9260o4462o0562p4784k6474J0368q2620J29576P6930r9176
23024d8254R9308J36574l1147l8934N7228K4794m1069o9245R774o0547J3280O5899
23012A17661K5358o9036m150k059q725Q3545r004R3349j8464j9859r3991m3792
23000E0833p3182j6103K9444J31748J10367L0715j2183j1771k9726j19790n3076
22989C7276Q0957l758l043n6209N6774J229l2872O08L06J0953k8740P643j8138
22976E2986L2564j745p5361p8229J17277n4946j3330K3892l8760o8190N4077J7717
22964c2048J23904m079j27197P4320L5311l0022l3813J11689O8796k9835j33310
$$ plain form
22953 23716 39247 48966 83388 58465 30718 72356 81423 103813 152011 162307 161825 115342
22941 115342 88739 174342 184680 -18301 -92318 -87375 -19021 -91513 -111255 -71526 -54348
22930 -54348 -54718 -78149 -32661 6398 71987 6523 53700 64849 110241 20752 -58559 -82651
22918 -82651 -85109 9940 -34252 -80189 -101352 12823 77451 164532 181245 105318 41064 -7591
22906 -7591 -11863 93611 166757 6305 -67631 -12583 71566 96829 24515 -6448 43192 85258
22894 85258 -20313 -9209 35208 63313 88994 82197 -40881 -77055 -66445 6286 4926 -68711
22882 -68711 27431 70013 47905 55818 15095 -51431 -20911 28934 41565 78009 21304 -198742
22870 -198742 -210191 -125312 30415 110774 27677 15541 30462 37880 47031 39063 51146 56955
$$ packed form
22953B3716J5531R719L4422k4923k7747M1638R067K2390M8198J0296m82m6483
22941A15342k6603Q5603J0338k02981p4017M943O8354p2492j9742L9729J7178
22930e4348l70k3431M5488L9059O5589o5464M7177J1149M5392q9489p9311k4092
22918h2651k458R5049m4192m5937k1163J14175O4628Q7081J6713p5927o4254m8655
22906g591m272J05474P3146j60452p3936N5048Q4149K5263p2314l0963M9640M2066
22894H5258j05571J1104M4417K8105K5681o797j23078l6174J0610P2731j360p3637
22882f8711R6142M2582k2108P913m0723o6526L0520M9845J2631L6444n6705k20046
22870a98742j1449Q4879J55727Q0359q3097j2136J4921P418R151p968J2083N809
$$ plain form
22858 56955 127566 147785 158461 145434 221191 195737 116117 54051 39421 67839 99811 104643
22846 104643 139400 177949 226734 226290 76219 112832 140969 165505 181454 139215 164672 231044
22834 231044 185115 194073 173792 97496 81881 72884 52045 64815 58087 50974 -66292 -189319
22822 -189319 -235099 -121143 -90589 -26195 53088 65473 76592 -19985 -37039 -7100 11738
22811 11738 -45520 -96336 -14474 -41659 -97234 -100504 -106496 -175594 -144639 -138973 -83125 -52939
22799 -52939 -66565 5437 36988 32100 -12036 -52221 -135041 -103869 -62486 -27861 39148 28050
22787 28050 88594 84384 54127 111686 113485 138738 18864 24659 90860 135305 149765 169305
22775 169305 169258 66586 -43845 -35168 -29504 -20594 60317 39050 42204 109506 88065 -5897
$$ packed form
22858E6955P0611K0219J0676j3027P5757k5454p9620o2066j4630K8418L1972M832
22846A04643L4757L8549M8785m44j50071L6613K8137K4536J5949m2239K5457O6372
22834B31044m5929Q958k0281p6296j5615q997k0839J2770o728p113j17266j23027
22822a89319m5780J13956L0554O4394P9283J2385J1119r6577j7054K9939J8838
22811A1738n7258n0816Q1862k7185n5575l270n992o9098L0955N666N5848L0186
22799e2939j3626P2002L1551m888m4136m0185q2820L1172M1383L4625O7009j1098
22787B8050O0544m210l0257N7559J799K5253j19874N795O6201M4445J4460J9540
22775A69305m7j02672j10431Q677N664Q910Q0911k1267L154O7302k1441r3962
$$ plain form
22763 -5897 -32909 -86448 -74081 -89276 -36696 39517 58876 86366 13156 -87811 -55330 -20743
22751 -20743 -21426 -76317 -114533 -130044 -58390 -55299 -72068 -35447 -78331 -53905 63125 52282
22739 52282 129811 62666 -67447 -164606 -205853 -215246 -131647 -44870 -28956 -25143 -130055 -182361
22727 -182361 -143781 -94421 40648 178439 134413 87902 93642 -67311 -161491 -143606 -169122
22716 -169122 -159192 -189400 -191668 -111643 -169616 -225080 -194572 -78754 -1104 -57670 -72984 -136919
22704 -136919 -127000 -10034 30536 45013 4799 -59576 -152150 -186174 -145965 -90510 -105530
22693 -105530 -183851 -112573 -151868 -46764 6674 -64313 -178684 -110995 -49640 -96868 -39300
22682 -39300 -10256 -87150 -74870 -46063 -123853 -161001 -69259 -2946 -32507 -63347 -164822
$$ packed form
22763e897k7012n3539J2367j5195N2580P6213J9359K7490p3210j00967L2481L4587
22751b0743o83n4891l8216j5511P1654L091j6769L6621m2884K4426J17030j0843
22739E2282P7529o7145j30113r7159m1247r393Q3599Q6777J5914L813j04912n2306
22727a82361L8580M9360J35069J37791m4026m6511N740j60953r4180J7885k5516
22716a69122R930l0208k268Q0025n7973n5464L0508J15818P7650n6566j5314o3935
22704a36919R919J16966M0570J4477m0214o4375r2574l4024M0209N5455j5020
22693a05530p8321P1278l9295J05104N3438p0987j14371O7689O1355m7228N7568
22682c9300K9044p6894J2280K8807p7790l7148R1742O6313k9561l0840j01475
$$ plain form
22671 -164822 -87758 -97234 -102518 -29379 20822 -13716 -7327 39048 44295 -56392 59982 147720
22659 147720 82052 60339 45639 129604 184902 145483 105760 38668 -17979 -94259 -151943
22648 -151943 -275753 -284765 -70037 6388 7377 25328 52450 11465 -7316 -87377 -108677 -46548
22636 -46548 -48838 -31363 -38148 -54359 -91914 -68339 -6536 93023 111333 126071 113066 48097
22624 48097 52778 35376 67809 68225 5708 -16324 -11765 57205 -16266 -43179 -83696 -69107
22612 -69107 -84798 -112954 -48335 -9179 -74008 8858 23361 63954 35497 -71765 -26044
22601 -26044 97950 139638 165638 162196 17316 -42465 -67442 -53641 17765 -8908 7028
22590 7028 54402 -22852 -65700 -104074 -112300 -128016 -104208 4824 104955 82433 144292 184370
$$ packed form
22671a64822P7064r476n284P3139N0201l4538O389M6375N247j00687J16374Q7738
22659A47720o5668k1713j4700Q3965N5298l9419l9723o7092n6647p6280n7684
22648a51943j23810r012K14728P6425R89J7951K7122m0985j8781q0061k1300O2129
22636d6548k290J7475o785j6211l7555K3575O1803R9559J8310J4738j3005o4969
22624D8097M681j7402L2433M16o2517k2032M559O8970p3471k6913m0517J4589
22612f9107j5691k8156O4619L9156o4829Q2866J4503M0593k8457j07262M5721
22601b6044J23994M1688K6000l442j44880n9781k4977J3801P1406k6673J5936
22590G028M7374p7254m2848l8374q226j5716K3808J09032J00131k2522O1859M0078
$$ plain form
22578 184370 57604 -82248 -88225 -35259 -11584 -151421 -246254 -166340 -81240 -115219 -66015
22567 -66015 -8478 148715 45928 -33097 -120386 -126294 -40397 -6349 48571 88171 20549
22556 20549 74130 64188 17842 -81665 -101518 -74562 -4476 46823 69840 88459 133562 175255
22544 175255 208956 254983 262414 86519 -27175 -39117 -75479 -23685 65392 33362 -27235
22533 -27235 -103818 -104801 -59025 -32530 -117996 -106936 -92903 -90243 -32273 1802 -143668 -240749
22521 -240749 -193127 -128973 -145091 -96256 -124698 -9959 -36602 -64287 -19174 -27330 -15610
22510 -15610 -40761 -122893 -118394 -55563 15077 44417 -110372 -175441 -253142 -262571 -187897 -194945
22498 -194945 -214627 -183068 -214509 -179224 -136342 -161145 -102669 -92665 -17157 -26798 -33102 -43905
$$ packed form
22578A84370j26766j39852n977N2966K3675j39837r4833P9914Q5100l3979M9204
22567f6015N7537J57193j02787p9025q7289n908Q5897L4048N4920L9600o7622
22556B0549N3581r942m6346r9507j9853K6956P0086N1299K3017J8619M5103M1693
22544A75255L3701M6027P431j75895j13694j1942l6362N1794Q9077l2030o0597
22533b7235p6583r83M5776K6495q5466J1060J4033K660N7970L4075j45470r7081
22521b40749M7622O4154j6118M8835k8442J14739k6643k7685M5113q156J1720
22510a5610k5151q2132M499O2831P0640K9340j54789o5069p7701r429P4674p048
22498a94945j9682L1559l1441L5285M2882k4803N8476J0004P5508r641o304j0803
$$ plain form
22486 -43905 -79571 -21570 19765 -22191 -93849 -45596 26215 -5412 -27907 -19446 66923 98274
22474 98274 63305 57951 119821 48038 -22339 -150571 -121281 -82755 -36231 76047 80442 -82521
22462 -82521 -25307 40194 28262 -92926 -112436 -64840 -979 -30272 -31348 -6321 -75783 -110494
22450 -110494 -52200 -77050 -68780 -92139 -31259 -23698 -43761 -46768 50505 66068 68586 19094
22438 19094 11438 -55289 46454 28850 -36904 34104 80774 -61087 -152515 -161663 -154390 -169668
22426 -169668 -109985 -39771 -3799 62326 58863 -28178 4239 -22988 33253 64022 67186 -69755
22414 -69755 -88578 -21475 11889 -98611 -51957 32228 -2736 -44852 -21214 -8904 14039
22403 14039 16477 55775 -36266 -144461 -43107 4116 -112261 -160142 -171651 -100318 -72697
$$ packed form
22486d3905l5666N8001M1335m1956p1658M8253P1811l1627k2495Q461Q6369L1351
22474I8274l4969n354O1870p1783p0377j28232K9290L8526M6524J12278M395j62963
22462h2521N7214O5501j1932j21188j9510M7596O3861k9293j076K5027o9462l4711
22450a10494N8294k4850Q270k3359O0880P561k0063l007R7273J5563K518m9492
22438A9094p656o6727J01743j7604o5754P1008M6670j41861r1428r148P273j5278
22426a69668N9683P0214L5972O6125l463q7041L2417k7227N6241L0769L164j36941
22414f9755j8823O7103L3364j10500M6654Q4185l4964m2116K3638J2310K2943
22403A4039K438L9298r2041j08195J01354M7223j16377m7881j1509P1333K7621
$$ plain form
22392 -72697 -204 -45906 -31229 38479 58919 -79777 -87124 -3399 -43011 -74027 -82255 -80677
22380 -80677 -62014 -72553 -90469 -5635 -16855 -104214 -120532 -145084 -129217 -47926 4046 55934
22368 55934 32532 -22650 -93897 -199148 -143133 -206452 -207703 -153256 -90523 -89777 -88909 12754
22356 12754 12949 -18834 -49236 -22814 -97537 -71983 -104436 -171498 -104925 -79392 -28796 -104007
22344 -104007 -107402 -184175 -136133 -65934 -73209 -191626 -232723 -140551 -34817 77326 -19887
22333 -19887 33578 33418 -85869 -74384 119353 108125 20062 -55946 -266917 -256872 -189465
22322 -189465 -122239 -95458 -3136 72297 2836 -23643 -40621 -130830 -41540 7215 -82227
22311 -82227 -143627 -25337 -23681 -53498 -75935 -81233 -72151 -194388 -224064 -98614 -102679 -108333
$$ packed form
22392g2697P2493m5702J4677O9708K0440j38696p347Q3725l9612l1016q228J578
22380h0677J8663j0539j7916Q4834j1220q7359j6318k4552J5867Q1291N1972N1888
22368E5934k3402n5182p1247j05251N6015o3319j251N4447O2733P46Q68J01663
22356A2754J95l1783l0402K6422p4723K5554l2453o7062O6573K5533N0596p5211
22344a04007l395p6773M8042P0199p275j18417m1097R2172J05734J12143r7213
22333a9887N3465j60j19287J1485J93737j1228q8063p6008k10971J0045O7407
22322a89465O7226K6781R2322P5433o9461k6479j6978r0209Q9290M8755q9442
22311h2227o1400J18290J656k9817k2437n298R082j22237k9676J25450m065n654
$$ plain form
22299 -108333 -116200 -48810 1766 -4824 -27941 -140361 -218819 -80126 -31309 -102772 -72124
22288 -72124 -78260 -66083 -63571 -27381 -49784 11593 32949 -41807 -48429 75133 199430 113865
22276 113865 26754 -22146 42323 88629 96133 47963 -31216 -43792 -1956 -40792 -64717 -84175
22264 -84175 -65882 -60505 -5271 -22195 -8146 43807 21676 -49207 -52831 20857 65068 74613
22252 74613 188200 214704 114966 20368 -5472 -108920 -212226 -160331 -119994 -72954 -98243
22241 -98243 -118168 -117126 -79459 -105260 -157611 -154924 -79319 -79788 -144702 -132743 -197417 -216317
22229 -216317 -76418 87075 110238 -39331 -175993 -152587 -239468 -244465 -245360 -252401 -236517
22218 -236517 -167661 -47510 -1057 -33967 -75326 -80831 -173398 -333987 -309949 -227063 -137462
$$ packed form
22299a08333p867O7390N0576o590k3117j12420p8458J38693M8817p1463L0648
22288g2124o136J2177K512L6190k2403O1377K1356p4756o622J23562J24297q5565
22276A13865q7111m8900O4469M6306P504m8170p9179j2576M1836l8836k3925j9458
22264h4175J8293N377N5234j6924J4049N1953k2131p0883l624P3688M4211R545
22252G4613J13587K6504r9738r4598k5840j03448j03306N1895M0337M7040k5289
22241i8243j9925J042L7667k5801n2351K687P5605m69o4914J1959o4674j8900
22229b16317J39899J63493K3163j49569j36662K3406q6881m997q95p041J5884
22218b36517O8856J20151M6453l2910m1359n505r2567j60589K4038Q2886Q9601
$$ plain form
22207 -137462 -77800 -97383 -211155 -273443 -268356 -277528 -240512 -310757 -357714 -223106 -70762
22196 -70762 -119614 -189822 -134350 -159225 -189020 -146341 -2303 56771 17419 -7680 -34810
22185 -34810 -103944 -65559 -76026 -139315 -132971 -210435 -193479 -135364 -102281 -101765 -14833 -111108
22173 -111108 -145950 -59702 746 80730 121497 94779 52432 113544 114010 -30866 -125199 -69732
22161 -69732 -92609 -40138 -28106 55368 10607 -44291 -63043 -97871 -169266 -241010 -232715 -126983
22149 -126983 -127769 -76303 34630 -1528 -72114 -114909 -99629 -118294 -41598 -55821 -101826 -203643
22137 -203643 -228650 -223064 -112578 -108124 -80980 10106 63569 12872 -21935 -13342 105328 40290
22125 40290 -93243 -100222 -153762 -149993 -83526 -90804 -72785 -122390 -150837 -134992 -160285 -122728
$$ packed form
22207a37462N9662j9583j13772o2288N087r172L7016p0245m6957J34608J52344
22196g0762m8852p0208N5472k4875k9795M2679J44038N9074l9352k5099k7130
22185c4810o9134L8385j0467o3289O344p7464J6956N8115L3083N16Q6932r6275
22173a11108l4842Q6248O0448P9984M0767k6718m2347O1112M66j44876r4333N5467
22161f9732k2877N2471J2032Q3474m4761n4898j8752l4828p1395p1744Q295J05732
22149a26983p86N1466J10933l6158p0586m2795J5280j8665P6696j4223m6005j01817
22137b03643k5007N586J10486M454K7144R1086N3463n0697l4807Q593J18670o5038
22125D0290j33533o979n3540L769O6467p278J8019m9605k8447J5845k5293L7557
$$ plain form
22113 -122728 -108520 -7341 25108 70886 19208 -67529 -47352 -161628 -211634 -119209 -128628
22102 -128628 -40876 -1637 -7845 -48580 -73413 -15792 -61139 -154529 -189181 -148176 -75039 -156737
22090 -156737 -136401 -85743 -100419 -189623 -150651 -50440 -24033 -63373 -61314 -123911 -73837
22079 -73837 -37070 76112 59267 -21741 -48621 -27366 6943 -37045 -69734 -128927 -184965
22068 -184965 -198123 -259490 -278959 -189062 -162021 -154492 -183181 -180830 -130457 -80822 -71168 -76172
22056 -76172 42366 93023 -3637 -48116 -58329 -100808 -188590 -103871 -43582 -47492 -76529 -138101
22044 -138101 -179147 -190656 -187283 -163809 -42603 50652 57285 -61196 -129477 -154321 -137378
22033 -137378 -187574 -212851 -195733 -130300 10177 32204 5064 -25227 -74253 -106219 -110869
$$ packed form
22113a22728J4208J01179L2449M5778n1678q6737K0177j14276n0006R2425r419
22102a28628Q7752L9239o208m0735k4833N7621m5347r3390l4652M1005P3137q1698
22090a56737K0336N0658j4676q9204L8972J00211K6407l9340K059o2597N0074
22079g3837L6767J13182j6845q1008k6880K1255L4309m3988l2689n9193n6038
22068a84965j3158o1367j9469Q9897K7041P529k8689K351N0373M9635R654n004
22056g6172J18538N0657r6660m4479j0213m2479q7782Q4719O0289l910k9037o1572
22044a38101m1046j1509L373K3474J21206R3255O633j18481o8281k4844J6943
22033a37378n0196k5277J7118O5433J40477K2027k7140l0291m9026l1966m650
$$ plain form
22022 -110869 -37086 -90084 -149933 -200392 -2411 77111 -10931 -128242 -197061 -81437 -129783
22011 -129783 -230325 -269562 -179482 -213157 -189249 -163317 -91867 -179739 -189300 -101546 -66652
22000 -66652 -30571 -45881 3706 7719 40271 96074 55039 -27926 -86844 4081 -36139 -137006
21988 -137006 -88671 48667 76411 15243 -13577 -117880 -181253 -174626 -202103 -145918 -196589
21977 -196589 -263216 -191636 -165822 -213132 -189159 -208076 -172726 -131778 -111603 -107199 -118144 -156933
21965 -156933 -188239 -195210 -147442 -123953 -108266 -54685 -58387 -162499 -206980 -83190 24056
21954 24056 26176 -1751 -80588 -55966 58832 28849 -130953 -178551 -96445 -128055 -121204 -116359
21942 -116359 -100617 -222206 -200245 -153855 -164418 -128311 -54786 -25163 -46902 -52716 -100500
$$ packed form
22022a10869P3783n2998n9849n0459J97981P9522q8042j17311o8819J15624m8346
22011a29783j00542l9237R0080l3675K3908K5932P1450q7872r561Q7754L4894
22000f6652L6081j5310M9587M013L2552N5803m1035q2965n8918R0925m0220j00867
21988a37006M8335J37338K7744o1168k8820j04303o3373O627k7477N6185n0671
21977a96589o6627P1580K5814m7310K3973j8917L5350M0948K0175M404j0945l8789
21965a56933l1306o971M7768K3489J5687N3581l702j04112m4481J23790J07246
21954B4056K120k7927p8837K4622J14798k9983j59802m7598Q2106l1610O851M845
21942a16359J5742j21589K1961M6390j0563L6107P3525K9623k1739n814m7784
$$ plain form
21931 -100500 -163370 -67834 64984 89844 42346 -81656 -151232 -154970 -91075 -99906 -5670
21920 -5670 -24884 -76853 -110367 -128571 -72146 -56383 -157942 -197680 -242508 -293712 -215736 -101983
21908 -101983 54942 32645 -44307 -166947 -289513 -216276 -208854 -140489 -211249 -131078 -91471
21897 -91471 -125237 -187690 -82245 -20467 -55240 -99268 -107844 -175516 -234449 -102073 -35154
21886 -35154 -151958 -184493 -24116 -22490 3860 74195 66243 81662 58047 140796 186953 111813
21874 111813 69964 24458 85279 20665 14007 -85210 -211259 -196126 -200217 -135041 -13884
21863 -13884 -53547 -140296 -86372 -16285 83752 51317 90501 118732 24802 -51232 1327
21852 1327 44996 -1811 -57556 -134347 -179613 -155361 -90340 -157104 -172011 -145045 -160183 -170885
$$ packed form
21931a00500o2870R5536J32818K4860m7498j24002o9576l738O3895q831R4236
21920e670j9214n1969l3514j8204N6425J5763j01559l9738m4828n1204P7976J13753
21908a01983J56925k2297p6952j22640j22566P3237P422O8365p0760Q0171L9607
21897i1471l3766o2453J05445O1778l4773m4028q576o7672n8933J32376O6919
21886c5154j16804l2535J60377J626K6350P0335p952J5419k3615Q2749M6157p5140
21874A11813m1849m5506O0821o4614o658r9217j26049J5133m091O5176J21157
21863a3884l9663q6749N3924P0087J00037l2435L9184K8231r3930p6034N2559
21852A327M3669m6807n5745p6791m5266K4252O5021o6764j4907K6966j5138j0702
$$ plain form
21840 -170885 -128984 -25729 -64846 -80733 -183704 -191662 -91468 -119775 -111003 -91832 -73926
21829 -73926 -9664 29088 -30574 -33635 -114091 -201673 -173245 -165586 -96501 -47463 -1362 68175
21817 68175 125229 36596 -15105 -109064 -209082 -285479 -323539 -263815 -220682 -193933 -221764
21806 -221764 -159354 -93168 -112868 -145221 -156053 -74687 -43815 1703 16345 -96277 -101645
21795 -101645 -143333 -209551 -112628 -139373 -189186 -69853 -76233 -153269 -204477 -137229 -19950
21784 -19950 23060 -53546 -89474 -66956 -65565 -89087 -9071 28956 -23299 12360 84764 74906
21772 74906 20116 15559 90359 90094 13833 26466 -28537 -143007 -31530 13538 13485 43818
21760 43818 -48249 -38399 67449 17900 -26996 -80715 -133185 -137578 -76296 38467 65253 44356
$$ packed form
21840a70885M1901J03255l9117j5887j02971p958J00194k8307Q772J9171J7906
21829g3926O4262L8752n9662l061q0456q7582K8428P659O9085M9038M6101O9537
21817F8175N7054q8633n1701r3959j00018p6397l8060N9724M3133K6749k7831
21806b21764O2410O6186j9700l2353j0832Q1366L0872M5518J4642j12622n368
21795a01645m1688o6218R6923k6745m9813J19333o380p7036n1208O7248J17279
21784a9950M3010p6606l5928K2518J391k3522Q0016L8027n2255L5659P2404r858
21772G4906n4790m557P4800k65p6261J2633n5003j14470J11477M5068n3L0333
21760D3818r2067R850J05848m9549m4896n3719n2470m393O1282J14763K6786k0897
$$ plain form
21748 44356 36015 -46607 -35852 -73992 -77630 -51835 -84819 -117654 -119452 -57768 -29484 -23691
21736 -23691 -28665 -71373 -89494 -103737 -191179 -162843 -85586 -121765 -49689 -103769 -99379 -63904
21724 -63904 -111751 -89372 -31432 -48657 -175982 -316712 -335760 -242984 -135657 -124048 -276309
21713 -276309 -241283 -205252 -193776 -82306 -125046 -208430 -302472 -300325 -226643 -80306 60934
21702 60934 79657 78908 64018 -33765 -64860 -41685 33151 -56114 -142615 -60337 -55802 -50797
21690 -50797 -68975 -74907 -49693 -25514 -99639 -113776 -194180 -214771 -193138 -186443 -114932 -119477
21678 -119477 -135533 -109402 -120703 -136034 -95528 13530 2300 -76205 -152665 -169168 -83838
21667 -83838 89100 71640 -13099 -104541 -134016 -131411 -190048 -269418 -214166 -168686 -148006 -192981
$$ packed form
21748D4356q341q2622J0755l8140l638K5795l2984l2835j798O1684K8284N793
21736b3691m974m2708j8121j4243q7442K8336P7257l6179P2076n4080M390L5475
21724f3904m7847K2379N7940j7225j27325j40730j9048R2776J07327J1609j52261
21713b76309L5026L6031J1476J11470m2740q3384r4042K147P3682J46337J41240
21702F0934J8723p49j4890r7783l1095K3175P4836q9265q6501Q2278M535N005
21690e0797j8178n932K5214K4179p4125j4137q0404k0591K1633O695P1511m545
21678a19477j6056K6131j1301j5331M0506J09058j1230p8505p6460j6503Q5330
21667h3838J72938j7460q4739r1442k9475K605n8637p9370N5252M5480K0680m4975
$$ plain form
21655 -192981 -111969 -62309 11985 -20600 -46465 5164 52865 51078 -1243 -88951 -205718
21644 -205718 -211719 -99448 -82432 -143604 -97861 -16182 -81818 -80089 -20746 -70614 -50950 -11361
21632 -11361 75237 66299 46701 -45487 -148615 -265387 -251111 -153988 -99989 -98129 -104628 -76522
21620 -76522 -89595 3794 -27202 -70601 -60987 -30855 -15880 -46282 122 -24276 -43659 -175876
21608 -175876 -283034 -201537 -156014 -117137 -104399 -40626 -41534 -94655 -31737 215 -11 -109442
21596 -109442 -137359 -118726 -64528 -51463 5885 22324 8729 -85869 -122869 -102819 -28585
21585 -28585 -60431 -105514 -174037 -104448 -53820 -79222 -49762 2092 -64476 -118869 -82404 -29468
21573 -29468 -61111 -107636 -127198 -105723 -57953 -59039 -49212 -99515 -153441 -172855 -94205 -142527
$$ packed form
21655a92981Q1012M9660P4294l2585k5865N1629M7701j787n2321q7708j16767
21644b05718o001J12271J7016o1172M5743Q1679o5636J729N9343m9868J9664L9589
21632a1361Q6598q938j9598r2188j03128j16772J4276R7123N3999J860o499K8106
21620g6522j3073R3389l0996m3399R614L0132J4975l0402M6404k4398j9383j32217
21608a75876j07158Q1497M5523L8877J2738O3773r08n3121O2918L1952k26j09431
21596a09442k7917J8633N4198J3065N7348J6439j3595r4598l7000K0050P4234
21585b8585l1846m5083o8523O9589N0628k5402K9460N1854o6568n4393L6465N2936
21573b9468l1643m6525j9562K1475M7770j086R827n0303n3926j9414P8650m8322
$$ plain form
21561 -142527 -260338 -227339 -110514 -114431 -154937 -88522 -51564 13073 90601 122191 48232
21550 48232 -34637 -150763 -177073 -192272 -214047 -198789 -122813 -76533 -59798 -57753 -66831 -102273
21538 -102273 -149437 -226204 -267947 -146803 -87845 -119211 -125016 -119663 -123057 -133968 -112750 -105808
21526 -105808 -95602 -65928 -102836 -146701 -247223 -215786 -27274 131157 212457 173522 41439
21515 41439 -11953 -1883 -8194 39360 27616 23424 41363 -90512 -162965 -182692 -139391 -84467
21503 -84467 -97792 -120931 -192710 -155513 -47602 -14870 13063 150691 90204 -26680 31849
21492 31849 18327 -30241 -76525 -100156 -49608 -54705 -149150 -178814 -172052 -223227 -328121 -278584
21480 -278584 -224784 -201929 -188023 -154891 -144578 -175415 -88640 9892 -42604 39315 174095
$$ packed form
21561a42527j17811L2999J16825l917m0506O6415L6958O4637P7528L1590p3959
21550D8232q2869j16126k6310j5199k1775J5258P5976M6280J6735K045r078l5442
21538a02273m7164p6767m1743J21144N8958l1366n805N353l394j0911K1218O942
21526a05808J0206K9674l6908m3865j00522L1437J88512J58431Q1300l8935j32083
21515D1439n3392J0070o311M7554j1744m192J7939j31875p2453j9727M3301N4924
21503h4467j3325k3139p1779L7197J07911L2732K7933J37628o0487j16884N8529
21492C1849j3522m8568m6284k3631N0548n097r4445k9664O762n1175j04894M9537
21480b78584N3800K2855J3906L3132J0313l0837Q6775R8532n2496Q1919J34780
$$ plain form
21469 174095 113200 -78696 -119014 -161175 -152251 -87598 -2205 37673 -6689 -48030 -73816
21458 -73816 -4130 25520 -9982 43853 43014 -106157 -141675 -211665 -190559 -94732 -66255 22539
21446 22539 -3588 -42839 -52817 -116260 -112105 -4897 -4401 -25287 -16540 27135 68689 -51913
21434 -51913 -7090 -50541 -128639 -104888 -52279 -69754 -137526 -283495 -215459 -135084 -136513 -173132
21422 -173132 -215617 -317053 -283583 -174717 -133437 -56367 22002 3510 -69756 -164441 -213808
21411 -213808 -223766 -124564 -5298 47309 -71701 -153947 -102970 -93417 -87716 -100612 -204182
21400 -204182 -176491 -163354 -152285 -142973 -162425 -135649 -72258 -15045 -34791 -87186 -110971 -25580
21388 -25580 67560 -9614 -104293 -134415 -215629 -262490 -202497 -123633 -49634 -54508 -103560 -11969
$$ packed form
21469A74095o0895j91896m0318m2161Q924O4653Q5393L9878m4362m1341k5786
21458g3816O9686K9650l5502N3835q39j49171l5518o9990K1106R5827K8477Q8794
21446B2539k6127l9251r978o3443M155J07208M96k0886Q747M3675M1554j20602
21434e1913M4823m3451p8098K3751N2609j7475o7772j45969O8036Q0375j429l6619
21422a73132m2485j01436L3470J08866M1280P7070P8369j8492p3266r4685m9367
21411b13808r958R9202J19266N2607j19010q2246N0977R553N701j2896j03570
21400b04182K7691J3137J1069R312j9452K6776O3391N7213j9746n2395k3785Q5391
21388b5580R3140p7174r4679l0122q1214m6861N9993P8864P3999m874m9052R1591
$$ plain form
21376 -11969 30711 -87951 -83093 -75322 -86372 -89317 -38082 67914 96947 2313 -41353 -118078
21364 -118078 -283298 -175973 -126114 -135508 -144045 -261318 -293665 -310322 -288562 -292584 -286817 -209494
21352 -209494 -77104 -18541 -45215 -89423 -60326 -7367 -39598 -74536 -169605 -160891 -150954 -7301
21340 -7301 94567 -45449 -154303 -100616 -42058 -54956 -80736 -8246 -22055 -9661 -70938
21329 -70938 -72508 -80927 -122355 -129021 -17846 -21826 -5211 -59162 -183038 -213444 -169882 -206517
21317 -206517 -195462 -122602 -86901 -89065 -117234 -153504 -137803 -99859 -66318 -63161 -70314 -47448
21305 -47448 25958 -56787 -72517 -87864 -56258 -104668 -106851 -173479 -257030 -300334 -187813 -198979
21293 -198979 -95917 -21073 -36825 -76729 -120931 -51899 -60967 16222 89602 86568 -41924
$$ packed form
21376a1969M2680j18662M858P771j1050k945N1235J05996K9033r4634m3666p6725
21364a18078j65220J07325M9859r394q537j17273l2347j6657K1760m022N767P7323
21352b09494J32390N8563k6674m4208K9097N2959l2231l4938r5069Q714R937J43653
21340g301J01868j40016j08854N3687N8558j2898k5780P2490j3809J2394o1277
21329g0938j570q419m1428o666J11175l980J6615n3951j23876l0406M3562l6635
21317b06517J1055P2860L5701k164k8169l6270J5701L7944L3541L157p153K2866
21305d7448P3406q2745j5730j5347L1606m8410k183o6628q3551m3304J12521j1166
21293a98979J03062P4844j5752l9904m4202O9032r068P7189P3380l034j28492
$$ plain form
21282 -41924 -83029 -59193 -78853 -92726 -129530 -164287 -131648 -22153 -22506 -6500 14306 -102822
21270 -102822 -124183 -143670 -162363 -154121 -55797 -7360 -12748 26017 -6096 -70988 -147357 -123005
21258 -123005 -36206 -87216 -63865 -59907 -151458 -255288 -261784 -268972 -267565 -237271 -232217 -147962
21246 -147962 -109614 -169464 -175215 -173635 -70626 47221 73779 90625 28658 -60604 -87373
21235 -87373 -93727 -79321 -72593 -52717 -26899 1120 -39103 -87050 -93975 -84295 -138281 -191876
21223 -191876 -219351 -292644 -377326 -373320 -291181 -181710 -190892 -238485 -114665 -24438 -91170
21212 -91170 -111901 -120223 -91697 -84217 -75523 -80240 -13410 -27538 -84735 -115719 11441 10148
21200 10148 -41303 23867 71669 105807 58049 -88624 -104144 -68783 -133248 -213827 -189937
$$ packed form
21282d1924m1105K3836j9660j3873l6804l4757L2639J09495l53J6006K0806j17128
21270a02822k1361j9487j8693Q242R8324M8437n388L8765l2113o4892p6369K4352
21258a23005Q6799n1010K3351L958r1551j03830o496p188J407L0294N054Q4255
21246a47962L8348n9850n751J580J03009J17847K6558J6846o1967q9262k6769
21235h7373o354J4406O728J9876K5818K8019m0223m7947o925R680n3986n3595
21223a91876k7475p3293q4682M006Q2139J09471r182m7593J23820R0227o6732
21212i1170k0731q322K8526P480Q694m717O6830j4128n7197l0984J27160j293
21200A0148n1451O5170M7802L4138m7758j46673j5520L5361o4465q0579K3890
$$ plain form
21189 -189937 -59009 -96683 -159511 -131800 -119264 -154150 -143344 -208684 -111705 25641 16188
21178 16188 -58136 -152482 -128453 -61383 -46507 -87559 -185631 -166277 -226591 -273414 -278351 -189367
21166 -189367 -173281 -171561 -191716 -192721 -156736 -103183 -157389 -219318 -179371 -179244 -148461 -203398
21154 -203398 -176615 -214307 -201009 -274257 -237440 -107090 26486 35987 -15574 16789 88460
21143 88460 -784 -121114 -165644 -185564 -148160 -53861 -110594 -145798 -183420 -105375 -11152
21132 -11152 -81904 -99238 -108190 -41319 -38199 -178406 -282218 -147505 -79291 -113733 -98884
21121 -98884 -88891 -39624 -73970 -187992 -176257 -122583 -152948 -190770 -117853 -22196 66292 87362
21109 87362 82747 -4321 -56420 -93417 -142935 -138068 -123478 -93259 -25834 -2809 -5557 30279
$$ packed form
21189a89937J30928l7674o2828K7711J2536l4886J0806o5340R6979J37346r453
21178A6188p4324r4346K4029O7070J4876m1052r8072J9354o0314m6823m937Q8984
21166a89367J6086J720k0155j005L5985N3553n4206o1929L9947J27L0783n4937
21154b03398K6783l7692J3298p3248L6817J30350J33576R501n1561L2363P1671
21143H8460q9244j20330m4530j9920L7404R4299n6733l5204l7622P8045R4223
21132a1152p0752j7334q952O6871L120j40207j03812J34713O8214l4442J4849
21121i8884R993M9267l4346j14022J1735N3674l0365l7822P2917R5657Q8488K1070
21109H7362m615q7068n2099l6997m9518M867J4590L0219O7425K3025k748L5836
$$ plain form
21097 30279 138688 208508 158378 -16207 -222666 -203008 -100818 -61157 -154975 -195904 -236015
21086 -236015 -356479 -365898 -218565 -154626 -12070 -32514 37255 43732 -78497 -168709 -180889
21075 -180889 -198893 -240300 -178230 -210613 -201680 -190636 -220295 -259598 -320995 -268043 -235795 -192218
21063 -192218 -131416 -213475 -273570 -160007 -133240 -124238 -63895 5194 14208 -35501 79137
21052 79137 128206 120661 -18287 -110534 -113089 -241549 -299877 -228156 -149895 -134054 -135134 -186637
21040 -186637 -233130 -150281 -89678 -77732 -72268 -50664 39552 91603 55573 35239 41133 -34497
21028 -34497 -98418 -114513 -151740 -106354 -66209 -138630 -120388 -63397 8200 3372 45407 117238
21016 117238 188910 112545 -99978 -119099 -50931 -83057 -168724 -220267 -301083 -266776 -178694
$$ packed form
21097C0279J08409O9820n0130j74585k06459J9658J02190L9661r3818m0929m0111
21086b36015j20464r419J47333O3939J42556k0444O9769O477j22229r0212j2180
21075a80889j8004m1407O2070l2383Q933J1044k9659l9303o1397N2952L2248M3577
21063a92218O0802q2059o0095J13563K6767R002O0343O9089R014m9709J14638
21052G9137M9069p545j38948r2247k555j28460n8328P1721P8261J5841j080n1503
21040a86637m6493Q2849O0603J1946N464K1604R0216N2051l6030k0334N894p5630
21028c4497o3921j6095l7227M5386M0145p2421J8242N6991P1597m828M2035P1831
21016A17238P1672p6365k12523j9121O8168l2126q5667n1543q0816L4307Q8082
$$ plain form
21005 -178694 -28786 61037 92050 -39540 -98698 -72279 -35214 -38847 -122733 -84383 -66895
20994 -66895 -84015 -161239 -228202 -179019 -44210 -34900 -80604 -83291 -105832 -121886 -91367 -82726
20982 -82726 -16659 -68281 -130267 -147816 -115576 -123933 -164567 -159238 -129169 -182261 -201224 -239938
20970 -239938 -246088 -146370 -98448 -131283 -131010 -69439 -129103 -220589 -197646 -147833 -140026 -131490
20958 -131490 -7235 33447 25544 -33322 -157812 -211934 -217225 -106977 -58932 -98339 -93800
20947 -93800 -78123 17744 41353 -39475 -83873 -122835 -191027 -207380 -114712 -95009 -123847 -190336
20935 -190336 -221838 -260329 -189360 -49464 -9421 40445 7989 -29093 -22976 -98041 -119712
20924 -119712 -202877 -225090 -163163 -101215 -61337 -82589 -29640 -67629 -113997 -75337 -66161 -96094
$$ packed form
21005a78694J49908Q9823L1013j31590n9158K6419L7065l633q3886L8350J7488
20994f6895j7120p7224o6963M9183J34809R310m5704k687k2541j6054L0519Q641
20982h2726O6067n1622o1986j7549L2240q357m0634N329L0069n3092j8963l8714
20970b39938o150R9718M7922l2835K73O1571n9664r1486K2943M9813P807Q536
20958a31490J24255M0682p903n8866j24490n4122n291J10248M8045l9407M539
20947i3800J5677R5867K3609q0828m4398l8962o8192j6353R2668J9703k8838o6489
20935a90336l1502l8491P0969J39896M0043M9866l2456l7082O117p5065k1671
20924a19712q3165k2213O1927O1948L9878k1252N2949l7989m6368L8660R176k9933
$$ plain form
20912 -96094 -149879 -214987 -226197 -185214 -229514 -187968 -182228 -152874 -86548 -150129 -168504 -105588
20900 -105588 -29805 6744 39795 32873 -18055 -127160 -180399 -112630 -127157 -125942 -182922 -213382
20888 -213382 -145197 -96837 -62296 -135175 -149825 -218658 -267218 -168726 -174948 -231260 -206424 -178653
20876 -178653 -93690 -31525 -79735 -10308 73759 59546 -15118 16092 14115 -157000 -251461
20865 -251461 -297662 -185758 -112458 -147341 -198621 -294223 -235145 -90457 -98551 19552 -28405
20854 -28405 -143815 -250743 -223096 -191906 -235828 -221894 -134622 -35357 -24879 -67336 -146863
20843 -146863 -55238 -69449 -165729 -212767 -157506 -91076 -63020 -3225 88055 95157 6499 -104588
20831 -104588 -135091 -154896 -71281 -50857 -33231 1761 20881 87000 189729 117895 45118
$$ packed form
20912i6094n3785o5108j1210M0983m4300M1546N740K9354O6326o3581j8375O2916
20900a05588P5783L6549L3051o922n0928j09105n3239O7769j4527J215n6980l0460
20888b13382O8185M8360L4541p2879j4650o8833m8560R8492o222n6312K4836K7771
20876a78653Q4963O2165m8210O9427Q4067j4213p4664L1210j977j71115r4461
20865b51461m6201J11904P3300l4883n1280r5602N9078J44688q094J18103m7957
20854b8405j15410j06928K7647L1190m3922J3934Q7272R9265J0478m2457p9527
20843a46863R1625j4211r6280m7038N5261O6430K8056N9795R1280P102q8658j11087
20831a04588l0503j9805Q3615K0424J7626L4992J9120O6119J02729p1834p2777
$$ plain form
20820 45118 77781 99172 22135 -54263 -113418 -111314 -110111 -74106 -60932 -96290 -79500 -150143
20808 -150143 -117617 -141257 -81483 -90340 2591 32485 -1228 -54152 -106848 -113319 -167354 -250143
20796 -250143 -237624 -180454 -133360 -137757 -74851 -13885 41587 56152 -18088 -145537 -64339
20785 -64339 16773 59383 15424 -35742 -67597 -39420 -39627 -128374 -207531 -365661 -290894 -228125
20773 -228125 -137565 -70446 -113127 -179598 -190923 -206349 -243113 -169684 -131891 -179680 -150409
20762 -150409 -69304 -24399 -37385 -40366 -78866 -79205 -77122 -68250 -126591 -138567 -269931 -327849
20750 -327849 -241523 -159700 -186015 -170290 -158626 -159334 -82206 -120033 -237811 -219829 -202467 -179446
20738 -179446 -170922 -203979 -314138 -352193 -198271 -46801 -54545 -142160 -154338 -156500 -155351 -83546
$$ packed form
20820D5118L2663K1391p7037p6398n9155K104J203L6005J3174l5358J6790p0643
20808a50143L2526k3640N9774q857R2931K9894l3713n2924n2696o471n4035q2789
20796b50143J2519N7170M7094m397O2906O0966N5472J4565p4240j27449Q1198
20785f4339Q1112M2610m3959n1166l1855K8177k07q8747p9157j58130P4767O2769
20773b28125R0560O7119m2681o6471j1325j5426l6764P3429L7793m7789K9271
20762a50409Q1105M4905j2986k981l8500l39K083Q872n8341j1976j31364n7918
20750c27849Q6326Q1823k6315J5725J1664p08P7128l7827j17778J7982J7362K3021
20738a79446Q524l3057j10159l8055J53922J51470p744q7615j2178k162J149P1805
$$ plain form
20726 -83546 -88642 -89152 -64768 -34680 -112908 -67084 -46333 -98727 -96300 -187291 -222105 -145964
20714 -145964 -61460 -96990 -143603 -107384 -59444 -178575 -312788 -306249 -273629 -237088 -152627
20703 -152627 -43527 34706 17483 -84816 -142885 -95210 -131712 -227688 -195985 -47415 -6348
20692 -6348 41450 52334 77886 -53182 -23738 -76078 -119954 -123521 -166761 -100563 -27272 -28758
20680 -28758 -67812 -45622 -6203 -73502 -29288 41718 73404 56286 -74309 -83649 12697 14929
20668 14929 56275 54454 86672 -16715 -28594 -23188 11489 -73705 -106819 -84449 -58246 -102395
20656 -102395 -4733 -62999 -71172 -38818 -28108 -84588 -95511 -166587 -98109 -66050 -117153 -139234
20644 -139234 -199128 -162725 -86098 -84686 -121815 -128438 -103716 -134406 -212413 -248603 -182146 -165711
$$ packed form
20726h3546n096n10K4384L0088p8228M5824K0751n2394K427r0991l4814P6141
20714a45964Q4504l5530m6613L6219M7940j19131j34213O539L2620L6541Q4461
20703a52627J09100P8233j7223j02299n8069M7675l6502r5976L1703J48570M1067
20692f348M7798J0884K5552j31068K9444n2340m3876l567m3240O6198P3291j486
20680b8758l9054K2190L9419o7299M4214P1006L1686j7118j30595r340R6346K232
20668A4929M1346j821L2218j03387j1879N406L4677q5194l3114K2370K6203m4149
20656a02395R7662n8266q173L2354J0710n6480j0923p1076O8478L2059n1103k2081
20644a39234n9894L6403P6627J412l7129o623K4722l0690p8007l6190O6457J6435
$$ plain form
20632 -165711 -145571 -75117 -29751 -61372 -114338 -108715 -85092 -100199 -84967 14235 82681 58190
20620 58190 -77691 -176189 -217617 -98910 -63138 -40252 -99667 -123782 -128545 -109723 -75433
20609 -75433 -115972 -118255 -91075 -158197 -133852 -108999 -254967 -257690 -133950 -81732 -85438 -156192
20597 -156192 -52781 -26047 -41585 -6063 -10034 -35481 8760 66546 54204 -19349 -38625
20586 -38625 -126749 -131378 -128433 -149989 -121407 -66827 38315 11556 5017 5759 -52582 -88555
20574 -88555 -77203 -89623 -85304 -67711 -47103 -143992 -203731 -187155 -59603 -57141 -89549 -436
20562 -436 -2549 -32726 -26285 -51059 -84732 -55884 -19075 -154752 -129025 -82756 -74192 -91962
20550 -91962 -111068 -38954 -45944 -20976 -68258 -170784 -145032 -152713 -136811 -76530 -95495 -152415
$$ packed form
20632a65711K0140P0454M5366l1621n2966N623K3623j5107J5232R9202O8446k4491
20620E8190j35881r8498m1428J18707L5772K2886n9415k4115m763J8822L4290
20609g5433m0539k283K7180o7122K4345K4853j45968k723J23740N2218l706p0754
20597a56192J03411K6734j5538L5522l971k5447M4241N7786j2342p3553j9276
20586c8625q8124m629K945k1556K8582N4580J05142k6759o539P42n8341l5973
20574h8555J1352j2420M319J7593K0608r6889n9739J6576J27552K462l2408Q9113
20562d36k113l0177O441k4774l3673K8848L6809j35677K5727M6269Q564j7770
20550i1962j9106P2114o990K4968m7282j02526K5752p681J5902O0281j8965n6920
$$ plain form
20538 -152415 -105003 -102533 -146989 -210402 -212797 -181069 -138056 -106224 -91230 -72820 -28857 -104595
20526 -104595 -161617 -155094 -144902 -241181 -225313 -116894 -96093 -79245 -18849 -15239 -68332 -66731
20514 -66731 -99870 -21434 36030 156181 140371 48255 -118156 -175827 -143134 -224969 -214562
20503 -214562 -120298 -136510 -211378 -222184 -261998 -283750 -118905 -15093 11914 25426 16351
20492 16351 -34378 -74870 -14190 63306 47846 22760 79857 61266 72071 62632 37969 65819
20480 65819 63726 31145 17986 -30759 -49374 -25623 -137895 -131957 -45927 -77052 -64986 -64573
20468 -64573 -52828 -52719 -153003 -245943 -80613 -28585 -29295 -161647 -208311 -120345 -171733 -101230
20456 -101230 -74755 -94907 -221667 -288548 -150737 12005 22100 -51139 -152484 -234677 -239473
$$ packed form
20538a52415M7412K470m4456o3413k395L1728M3013L1832J4994J8410M3963p5738
20526a04595n7022O523J0192r6279J5868J08419K0801J6848O0396L610n3093J601
20514f6731l3139P8436N7464J20151j5810r2116j66411n7671L2693q1835J0407
20503b14562R4264j6212p4868j0806l9814k1752J64845J03812K7007J3512r075
20492A6351n0729m0492O0680P7496j5460k5086N7097j8591J0805r439k4663K7850
20480F5819k093l2581j3159m8745j8615K3751j12272N938Q6030l1125J2066M13
20468f4573J1745J09j00284r2940J65330N2028p10j32352m6664Q7966n1388P0503
20456a01230K6475k0152j26760o6881J37811J62742J0095p3239j01345q2193m796
$$ plain form
20445 -239473 -277708 -337762 -327358 -289776 -273338 -207661 -35882 27966 -67437 -55657 -23248
20434 -23248 -29694 -149215 -222216 -152136 -106832 -143062 -173716 -141274 -104520 -94636 -162493 -150572
20422 -150572 -188890 -127100 -119283 -116316 -144490 -199409 -111423 -35900 84757 30858 -50085 -112056
20410 -112056 -99993 -67261 -43247 175933 160419 8851 -51066 25440 58698 -16351 -108433
20399 -108433 -148633 -167712 -135487 -67581 -44732 16228 13763 88261 73257 78897 67029 49137
20387 49137 14111 -63045 -68153 -149253 -249413 -226968 -168431 -138115 -147839 14409 98278 62444
20375 62444 46421 -34458 -101568 -130757 -109289 -62593 -198887 -195526 -145697 -93739 -610 12499
20363 12499 -131046 -208897 -129246 5453 80297 111207 103304 15832 -63781 -167888 -296381
$$ packed form
20445b39473l8235o0054J0404L7582J6438O5677J71779O3848r5403J1780L2409
20434b3248o446j19521p3001P0080M5304l6230l0654L2442L6754R884o7857J1921
20422a50572l8318O1790P817K967k8174n4919Q7986P5523J20657n3899q0943o1971
20410a12056J2063L2732K4014K19180j5514j51568n9917P6506L3258p5049r2082
20399a08433m0200j9079L2225O7906K2849O0960k465P4498j5004N640j1868j7892
20387D9137l5026p7156n108q1100j00160K2445N8537L0316r724J62248Q3869l5834
20375F2444j6023q0879o7110k9189K1468M6696j36294L361M9829N1958R3129J3109
20363A2499j43545p7851P9651J34699P4844L0910p903q7472p9613j04107j28493
$$ plain form
20352 -296381 -312189 -288774 -131088 -156891 -122386 -23473 92917 137627 -34613 -197627 -153067
20341 -153067 -135813 -217872 -175550 -159952 -52693 98432 115278 48647 -14527 -147746 -114537
20330 -114537 -80686 19648 64278 94408 142739 230228 218805 51808 -108999 -180498 -117925
20319 -117925 -31546 -70253 -160086 -119636 -150158 -243439 -297858 -268184 -183009 -216426 -134164
20308 -134164 -73858 -180950 -242403 -274369 -202594 -210729 -114642 -7739 34179 -1110 -48662
20297 -48662 -106334 -46506 44751 145075 134465 24314 -92116 -125039 -26761 -60324 -114639
20286 -114639 -168932 -148108 -49094 -52261 -127271 -170969 -168022 -129527 -132852 -164643 -208643 -107802
20274 -107802 -79168 -159483 -278885 -203147 -123883 -161210 -119915 -140767 -57724 -92990 -155360
$$ packed form
20352b96381j5808K3415J57686k5803L4505R8913J16390M4710j72240j63014M4560
20341a53067J7254q2059M2322J5598J07259J51125J6846o6631o3174j33219L3209
20330a14537L3851J00334M4630L0130M8331Q7489j1423j66997j60807p1499O2573
20319a17925Q6379l8707q9833M0450l0522r3281n4419K9674Q5175l3417Q2262
20308a34164O0306j07092o1453l1966P1775q135R6087J06903M1918l5289m7552
20297d8662n7672N9828R1257J00324j0610j10151j16430l2923R8278l3563n4315
20286a14639n4293K0824R9014l167p5010m3698K947L8495l325l1791m4000J00841
20274a07802K8634q0315j19402P5738P9264l7327M1295k0852Q3043l5266o2370
$$ plain form
20263 -155360 -210124 -181463 -145397 -84383 -52889 -36725 -36441 -173354 -274265 -178113 -48960
20252 -48960 -10679 -77668 -91276 7068 3496 -51875 -24279 -73322 -96278 -110167 -65742 -94036
20240 -94036 -255419 -191862 -153694 -166830 -189356 -198929 -221477 -80317 -33461 -91206 -80033
20229 -80033 -122978 -178141 -190853 -128597 -140861 -182557 -108138 -101184 -98428 3385 -15385 -80397
20217 -80397 -99827 -76214 -17108 -69215 -177594 -118646 -23772 -48591 -140602 -118817 -87649
20206 -87649 8087 -9765 -66867 -88579 66025 132892 110354 98258 -141129 -203817 -219195
20195 -219195 -306908 -254407 -183447 -114663 -69629 -58112 -36481 -20349 -63972 -92513 -127973
20184 -127973 -73432 24460 9350 -73531 -191433 -162073 -127665 -199423 -225494 -180505 -12191
$$ packed form
20263a55360n4764K8661L6066O1014L1494J6164K84j36913j00911R6152J29153
20252d8960L8281o6989j3608R8344l572n5371K7596m9043k2956j3889M4425k8294
20240i4036j61383O3557L8168j3136k2526r573k2548J41160M6856n7745J1173
20229h0033m2945n5163j2712O2256j2264m1696P4419O954K756J01813j8770o5012
20217h0397j9430K3613N9106n2107j08379N8948R4874k4819r2011K1785L1168
20206h7649R5736j7852n7102k1712J54604O6867k2538j2096k39387o2688j5378
20195b19195q7713N2501P0960O8784M5034J1517K1631J6132m3623k8541l5460
20184a27973N4541R7892j5110q2881j17902K9360L4408p1758k6071M4989J68314
$$ plain form
20173 -12191 69210 -59334 -81325 -31759 -125966 -128672 -121693 -143052 -117726 -27968 -9068 51151
20161 51151 28048 32544 -4887 -173206 -195696 -127239 -146724 -121046 -158984 -141543 -144600 -112299
20149 -112299 -73650 -66779 -34362 -13538 -55068 -110621 -88956 -88197 -110213 -119504 -97608 -148110
20137 -148110 -140398 -138922 -152580 -170900 -94333 -52402 -44420 12958 99485 39358 -17017 9503
20125 9503 75004 81857 52392 118456 128474 75993 -66007 -160570 -202712 -40904 70390
20114 70390 530 -58669 -69781 -77300 -23825 -75191 -145336 -170220 -227040 -265461 -186776 -194144
20102 -194144 -133490 -139808 -270566 -308319 -269362 -229730 -260571 -205502 -172197 -204981 -211746 -102324
20090 -102324 -146496 -176815 -220673 -204791 -161635 -166220 -98815 -71468 52142 9097 -106576
$$ packed form
20173a2191Q1401j28544k1991M9566r4207k706O979k1359K5326Q9758J8900O0219
20161E1151k3103M496l7431j68319k2490O8457j9485K5678l7938J7441l057L2301
20149a12299L8649O871L2417K0824m1530n5553K1665P59k2016r291K1896n0502
20137a48110P712J476j3658j8320P6567M1931P982N7378Q6527o0127n6375K6520
20125I503O5501O853k9465O6064J0018n2481j42000r4563m2142J61808J11294
20114G0390o9860n9199j1112p519N3475n1366p0145k4884n6820l8421P8685p368
20102a94144O0654o318j30758l7753L8957L9632l0841N5069L3305l2784o765J09422
20090a02324m4172l0319m3858J5882M3156m585O7405K7347J23610m3045j15673
$$ plain form
20079 -106576 -198202 -227259 -292229 -267968 -154273 -83167 -97749 -180981 -95050 -34920 -50424
20068 -50424 27505 106837 34946 -10043 -112982 -7684 -2075 -50739 -14242 -46472 -143078
20057 -143078 -211548 -207077 -107497 -105447 -22483 33533 16830 33739 59735 67280 72682 59989
20045 59989 89042 31855 22164 -48314 -149569 -170663 -161220 -156045 -129001 -109754 -135789 -230182
20033 -230182 -304181 -129324 -7629 -19109 -119036 -123331 -145546 -302931 -335252 -239962 -182033
20022 -182033 -158035 -216464 -187986 -208902 -109118 -65894 -96965 -217036 -238193 -184063 -146351
20011 -146351 -93986 -108722 -110251 -132797 -116638 -100432 -110143 -76981 -84403 -70517 18779 -38172
19999 -38172 -77272 -98773 -67034 -141834 -160560 -115616 -43122 14334 37344 -41758 40309 20195
$$ packed form
20079a06576r1626k9057o4970K4261J13695P1106j4582q3232Q5931O0130j5504
20068e0424P7929P9332p1891m4989j02939J05298N609m8664L6497l2230r6606
20057a43078o8470M471R9580K050Q2964N6016j6703J6909K5996P545N402j2693
20045E9989K9053n7187r691p0478j01255k1094R443N175K7044J9247k6035r4393
20033b30182p3999J74857J21695j1480r9927m295k2215j57385l2321R5290N7929
20022a82033K3998n8429K8478k0916R9784M3224l1071j20071k1157N4130L7712
20011a46351N2365j4736j529k2546J6159J6206r711L3162p422J3886Q9296n6951
19999c8172l9100k1501L1739p4800j8726M4944P2494N7456K3010p9102Q2067k0114
$$ plain form
19987 20195 -89235 -163915 -227986 -151855 -145483 -127760 -18327 -18771 -140646 -128029 -108883 -62627
19975 -62627 -10737 -60367 -80859 -73074 -163403 -236855 -179264 -85879 -67962 -32570 -59327 -105787
19963 -105787 -158113 -107458 -127402 -167742 -28640 67484 119371 36357 61983 99264 63772
19952 63772 101386 99140 30400 18883 38072 42869 -41315 -58760 -105657 -133763 37436 22294
19940 22294 -60836 -35503 -68204 -44781 -2254 -5510 74084 134066 132055 40731 -73607 -167735
19928 -167735 -135935 -74120 -71518 -129561 -228621 -186231 -218642 -244417 -242773 -181073 -126160 -56143
19916 -56143 -17855 -88110 -72464 -84558 -188413 -246574 -154383 -86305 -60237 -13198 -63915
19905 -63915 -79335 81452 194179 96448 -6630 -18873 -31019 -32001 84948 204707 168894
$$ packed form
19987B0195j09430p4680o4071P6131O372J7723J09433m44j21875J2617J9146M6256
19975f2627N1890m9630k0492P785r0329p3452N7591R3385J7917L5392k6757m6460
19963a05787n2326N0655j9944m0340J39102R6124N1887q3014K5626L7281l5492
19952F3772L7614k246o8740j1517J9189M797q4184j7445m6897k8106J71199j5142
19940B2294q3130K5333l2701K3423M2527l256P9594N9982k011r1324j14338r4128
19928a67735L1800O1815K602n8043r9060M2390l2411k5775J644O1700N4913P0017
19916e6143L8288p0255J5646j2094j03855n8161R2191O8078K6068M7039n0717
19905f3915j5420J60787J12727r7731j03078j2243j2146r82J16949J19759l5813
$$ plain form
19894 168894 140891 44269 -3089 99237 76573 -41654 -77392 -110405 -101519 -14124 -46310
19883 -46310 -34312 -23808 -3198 -13851 -107488 -147705 -117107 -84158 -50734 -24826 4686 4894
19871 4894 48471 -45592 -66486 -21693 -25821 -36925 34214 -36718 -62768 -16436 -1422 -84207
19859 -84207 -66975 -141478 -137824 -170657 -156179 -191157 -220767 -127542 -74603 -121299 -173737 -218740
19847 -218740 -176180 -173788 -216996 -185636 -239696 -293473 -230408 -62072 12181 -10290 -412 -95089
19835 -95089 -148808 -177737 -169085 -96340 -175344 -207962 -126662 -110326 -78776 -28871 -55378 -232851
19823 -232851 -205197 -213542 -220217 -152668 -64071 -66316 -51037 -63449 -66705 -65193 -75932 -47445
19811 -47445 26555 -9793 -84950 -165980 -162496 -116443 -23953 -35334 -88083 -68765 -9971 51058
$$ packed form
19894A68894k8003r6622m7358J02326k2664j18227l5738l3013Q886Q7395l2186
19883d6310J1998J0504K0610j0653r3637m0217L0598L2949L3424K5908K9512K08
19871D894M3577r4063k0894M4793m128j1104P1139p0932k6050M6332J5014q2785
19859h4207J7232p4503L654l2833J4478l4978k9610R3225N2939m6696n2438m5003
19847b18740M2560K392m3208L1360n4060n3777O3065J68336P4253k2471R878r4677
19835i5089n3719k8929Q652P2745p9004l2618Q1300J6336L1550M9905k6507j77473
19823b32851K7654q345o675O7549Q8597k245J5279j2412l256J512j0739K8487
19811d7445P4000l6348p5157q1030L484M6053R2490j1381n2749J9318N8794O1029
$$ plain form
19799 51058 28840 -2782 -24477 -79964 -7150 34004 45088 -15282 -2499 38585 16976 -37503
19787 -37503 -20137 -40714 -57374 -100864 -58899 -50307 -23901 -40865 -108866 -120866 -158334 -7706
19775 -7706 56527 14766 -56260 -27443 56458 126206 54342 20786 -24017 -118370 -220769 -288472
19763 -288472 -268892 -185361 -104559 -106872 -115534 -103297 -128451 -140419 -177157 -49446 -143559 -228610
19751 -228610 -49746 44362 -10537 -29586 -70432 -13724 68905 -33220 -14104 -40631 -24133
19740 -24133 67452 69167 -36126 -73360 -99921 -133161 -172402 -193554 -171705 -136067 -71333 -10822
19728 -10822 -21285 -65161 -43734 -92708 -188837 -224369 -183107 -146076 -161476 -137091 -135189 -113599
19716 -113599 -107961 -28273 32955 -902 -5165 -48190 -99385 -283968 -281452 -151328 -108832 -70592
$$ packed form
19799E1058k2218l1622k1695n5487P2814M1154J1084o0370J2783M1084k1609n4479
19787c7503J7366k0577j6660m3490M1965Q592K6406j6964o8001j2000l7468J50628
19775g706O4233m1761p1026K8817Q3901O9748p1864l3556m4803r4353j02399o7703
19763b88472J9580Q3531Q0802k313q662J2237k5154j1968l6738J27711r4113q5051
19751b28610J78864R4108n4899j9049m0846N6708Q2629j02125J9116k6527J6498
19740b4133R1585J715j05293l7234k6561l3240l9241k1152K1849L5638O4734O0511
19728a0822j0463m3876K1427m8974r6129l5532M1262L7031j5400K4385J902K1590
19716a13599N638P9688O1228l3857m263m3025n1195j84583K516J30124M2496L8240
$$ plain form
19704 -70592 -50008 -90166 -97359 -73434 5731 -9049 -91966 -188979 -291331 -336901 -291312 -170270
19692 -170270 -136213 -101879 -66002 -9129 -92186 -164997 -172470 -157647 -22027 -13210 78344 60927
19680 60927 98005 77085 49347 34057 -1805 -78263 -195228 -228495 -231788 -253878 -289978 -182564
19668 -182564 -78780 -76280 -82045 -142791 -74087 -55366 -72119 -50792 -50643 -94843 -93628 -46796
19656 -46796 -48023 -148757 -183277 -138809 20911 69195 74403 81013 129878 35583 -116369 -64637
19644 -64637 29646 -13001 -60313 -122290 -81844 -1247 60983 61638 48458 -41069 -77918 -100599
19632 -100599 -45244 -151939 -83610 99437 183569 149503 90522 84287 29037 -123574 -90687
19621 -90687 23889 48318 42521 55848 -10091 22490 75797 86260 39038 50424 77041 78337
$$ packed form
19704g0592K0584m0158p193K3925P9165j4780q2917r7013j02352m5570M5589J21042
19692a70270L4057L4334L5877N6873q3057p2811p473J4823J35620Q817R1554j7417
19680F0927L7078k0920k7738j5290l5862p6458j16965l3267l293k2090l6100J07414
19668a82564J03784K500n765o0746O8704J8721j6753K1327J49m4200J215M6832
19656d6796j227j00734l4520M4468J59720M8284N208O610M8865r4295j51952N1732
19644f4637R4283m2647m7312o1977M0446Q0597O2230O55j3180q9527l6849k2681
19632a00599N5355j06695O8329J83047Q4132l4066n8981o235n5250j52611L2887
19621i0687J14576K4429n797J3327o5939L2581N3307J0463m7222J1386K6617J296
$$ plain form
19609 78337 83705 52250 3747 20907 122480 99190 158776 66262 -36800 -71512 -70684 -91959
19597 -91959 -108828 -72598 -38953 53568 69925 51093 -12779 48546 16170 -50781 -102245 -8901
19585 -8901 -21772 -19818 -44943 46350 135252 192576 193589 178389 177243 96677 -27308 -34043
19573 -34043 -92274 -195089 -120270 -109301 -131596 -54130 9661 -54669 -161834 -150905 -113520
19562 -113520 -118240 -105037 -234266 -217234 -144512 -22269 -4132 -26276 -66216 -129865 -36575
19551 -36575 -3619 -127184 -195288 -169949 -149653 -236208 -155023 -123004 -127945 -164841 -158820 -146556
19539 -146556 -97179 -92017 -62404 33971 64629 -44007 -74816 -10410 -64819 -26682 -71308
19528 -71308 -96893 -70648 -3651 85478 72802 -12213 5477 49704 25759 53219 78822 -21896
$$ packed form
19609G8337N368l1455m8503J7160J01573k3290N9586r2514j03062l4712Q28k1275
19597i1959j6869L6230L3645R2521J6357j8832o3872O1325l2376o6951n1464R3344
19585h901j2871J954k5125R1293Q8902N7324J013j5200j146q0566j23985o735
19573c4043n8231j02815P4819J0969k2295P7466O3791o4330j07165J0929L7385
19562a13520m720J3203j29229J7032P2722J22243J8137k2144l9940o3649R3290
19551c6575L2956j23565o8104K5339K0296q6555Q1185L2019m941l6896O021J2264
19539a46556M9377N162K9613R6375L0658j08636l0809O4406n4409L8137m4626
19528g1308k5585K6245O6997Q9129j2676q5015J7690M4227k3945K7460K5603j00718
$$ plain form
19516 -21896 16055 107795 170625 213846 151123 3779 -8186 -47089 -70816 -10326 37916
19505 37916 29312 77188 131176 134560 149494 197406 252515 152415 114923 106990 128380 102549
19493 102549 98726 134864 125715 -36995 -68372 11765 34009 88235 136434 45250 18496 -26142
19481 -26142 -60123 -108848 -16114 -22910 11516 75421 9686 -74904 -63228 -15328 12380 52003
19469 52003 68408 -31110 -71621 -37035 42191 -14020 38736 155114 102762 70158 17013
19458 17013 3971 41749 17621 45599 63637 22803 64710 57270 -36616 35944 51065 -31041
19446 -31041 -84731 -37678 -87021 -55953 16629 -71053 -125201 -111070 -74759 -26050 81476
19435 81476 104193 25124 -104360 -231232 -117227 -38974 27549 -3560 -85545 -61399 -122186
$$ packed form
19516b1896L7951R1740O2830M3221o2723j47344j1965l8903k3727O0490M8242
19505C7916q604M7876N3988L384J4934M7912N5109j00100l7492p933K1390k5831
19493A02549l823L6138r149j62710l1377Q0137K2244N4226M8199r1184k6754m4638
19481b6142l3981m8725R2734o796L4426O3905o5735q4590J1676M7900K7708L9623
19469E2003J6405r9518m0511L4586P9226n6211N2756J16378n2352l2604n3145
19458A7013j3042L7778k4128K7978J8038m0834M1907p440r3886P2560J5121q2106
19446c1041n3690M7053m9343L1068P2582q7682n4148J4131L6311M8709J07526
19435H1476K2717p9069j29484j26872J14005P8253O6523l1109q1985K4146o0787
$$ plain form
19424 -122186 -50150 59205 65233 62794 -65929 -68678 22738 132697 179881 126562 30722
19413 30722 57672 148303 171839 167990 92813 3371 -16846 42659 -15798 -35590 -81163 -102680
19401 -102680 3502 73862 113417 137781 54089 122523 75616 14365 58828 67876 27002
19390 27002 -25727 -12779 -19859 -48827 -21583 65909 55823 87249 61260 63727 102663 111430
19378 111430 6710 49152 66591 84130 23570 -4141 -29724 -10333 79838 114643 144913
19367 144913 94364 9265 -24403 18778 57814 73731 97489 15702 -47080 -17756 30583
19356 30583 -42860 -1836 111692 204964 181163 101340 89956 79703 29381 -27191 22372
19345 22372 87522 101822 49694 -50474 -123958 -19968 86727 15819 -40075 -22853 35933
$$ packed form
19424a22186P2036J09355O028k439j28723k749R1416J09959M7184n3319r5840
19413C0722K6950R0631K3536l849p5177q9442k0217N9505n8457j9792m5573k1517
19401a02680J06182P0360L9555K4364q3692O8434m6907o1251M4463R048m0874
19390B7002n2729J2948p080k8968K7244Q7492j0086L1426k5989K467L8936Q767
19378A11430j04720M2442J7439J7539o0560k7711k5583J9391R0171L4805L0270
19367A44913n0549q5099l3668M3181L9036J5917K3758q1787o2782K9324M8339
19356C0583p3443M1024J13528R3272k3801p9823j1384j0253n0322n6572M9563
19345B2372O5150J4300n2128j00168p3484J03990J06695p0908n5894J7222N8786
$$ plain form
19334 35933 9106 -110105 -126230 -91768 -80605 -73957 904 85638 60532 133309 149569 115854
19322 115854 45604 22150 52710 7646 -32596 -6282 -2078 -37736 43738 62753 16551 17540
19310 17540 37389 -74563 37238 85628 38138 106914 191264 199822 248038 247575 244381 181710
19298 181710 170966 175156 112124 131214 94433 105884 127548 74154 106379 116436 122520 182553
19286 182553 117532 -1166 -38724 55485 12147 -111872 -9789 35072 -8596 26665 82658
19275 82658 83693 30255 112636 195451 133504 -11338 32024 138659 118775 118455 37526 -85400
19263 -85400 -90546 51565 109060 125125 159666 97736 110880 98065 16840 10390 45254 136037
19251 136037 131683 50520 67656 18674 69273 140310 88316 -28291 46610 103970 32030
$$ packed form
19334C5933k6827j19211j6125L4462J1163O648P4861Q4734k5106P2777J6260l3715
19322A15854p0250k3454L0560m5064m0242K6314M204l5658Q1474J9015m6202R89
19310A7540J9849j11952J11801M8390m7490O8776Q4350Q558M8216m63l194o2671
19298A81710j0744M190o3032J9090l6781J1451K1664n3394L2225J0057O084O0033
19286A82553o5021j18698l7558R4209m3338j24019J02083M4861m3668L5261N5993
19275H2658J035n3438Q2381Q2815o1947j44842M3362J06635j9884l20q0929j22926
19263h5400n146J42111N7495J6065L4541o1930J3144j2815q1225o450L4864R0783
19251A36037m354q1163J7136m8982N0599P1037n1994j16607P4901N7360p1940
$$ plain form
19240 32030 88360 150722 215604 284382 309468 225055 208994 208617 148173 116968 100417 87121
19228 87121 73632 186699 163031 132958 107207 102129 188175 209198 144604 107961 28947 -28825
19216 -28825 46793 93749 133976 117051 81733 73246 23615 -2065 -1408 -88197 -93652 -8293
19204 -8293 24122 35441 75245 146168 116604 156415 136174 113898 162345 94152 37604 147695
19192 147695 141912 119890 130289 -39160 -84903 -55114 -31030 91414 152176 84323 36694
19181 36694 130435 167662 144754 57867 -663 -50331 -8026 93266 15655 -71653 29300
19170 29300 21375 -24936 58497 199392 262855 172498 175706 258822 290923 219256 183420 171405
19158 171405 224004 260591 283263 207356 150589 141219 135647 168138 290675 480852 634060
$$ packed form
19240C2030N6330O2362O4882O8778K5086q4413j6061l77o0444l1205j6551j3296
19228H7121j3489J13067k3668l0073k5751n078Q6046K1023o4594l6643p9014n7772
19216b8825P5618M6956M0227j6925l5318q487m9631k5680O57q6789n455Q5359
19204h293L2415J1319L9804P0923k9564L9811k0241k2276M8447o8193n6548J10091
19192A47695n783k2022J0399j69449m5743K9789K4084J22444O0762o7853m7629
19181C6694R3741L7227k2908q6887n8530m9668M2305J01292p7611q7308J00953
19170B9300p925m6311Q3433J40895O3463r0357L208Q3116L2101p1667l5836j2015
19158A71405N2599L6587K2672p5907n6767r370n572L2491J22537J90177J53208
$$ plain form
19147 634060 697745 827173 885727 949870 1200456 1397644 1546753 1565421 1545410 1386089
19137 1386089 1142035 855395 719288 574910 533709 528832 494840 403531 371480 265714
19127 265714 294415 300025 265293 184239 100342 183702 218689 148056 179015 216015 234130 213765
19115 213765 215384 259880 273866 192727 139577 199651 136355 192879 206222 140855 137142 90976
19103 90976 83148 77084 35164 116684 187682 162377 120303 94576 128139 216794 237443 158884
19091 158884 178564 136120 -21254 -53124 -94925 -72370 15347 118542 173941 143091 97372
19080 97372 100937 109052 137967 152092 137465 175081 214935 250050 265545 320010 367880 287363
19068 287363 152553 183201 231692 211932 239399 220579 184022 92031 11311 59630 -39516
$$ packed form
19147F34060O3685J29428N8554O4143K50586J97188J49109J8668k0011j59321
19137A386089k44054k86640j36107j44378m1201m877l3992r1309l2051j05766
19127B65714K8701N610l4732q1054q3897Q3360L4987p0633L0959L7000J8115k0365
19115B13765J619M4496J3986q1139n3150O0074o3296N6524J3343o5367l713m6166
19103I0976p828o064m1920Q1520P0998k5305m2074k5727L3563Q8655K0649p8559
19091A58884J9680m2444j57374l1870m1801K2555Q7717J03195N5399l0850m5719
19080I7372L565Q115K8915J4125j4627L7616L9854L5115J5495N4465M7870q0517
19068B87363j34810L0648M8491j9760K7467j8820l6557r1991q0720M8319r9146
$$ plain form
19057 -39516 -41991 94577 111288 221832 204348 183574 161519 144818 115233 135892 122023
19046 122023 158223 113748 111719 176919 222103 217156 271272 262336 236245 203872 221785 222930
19034 222930 187304 140488 61317 20647 82373 53959 127498 120952 86509 113096 96592 15715
19022 15715 56371 95842 81885 63453 53572 94221 128776 67509 58267 83464 154442 117122
19010 117122 22606 24117 92384 151045 167711 163743 135896 209715 195601 142461 106500 167759
18998 167759 248383 267524 286372 298489 297028 232218 31984 -65586 -155697 -148991 48002
18987 48002 138792 236999 276587 250994 205343 187346 143042 218038 316580 297466 217122 201714
18975 201714 269265 254691 230376 274370 221339 226153 229196 157964 91628 86605 189162 230063
$$ packed form
19057c9516k475J36568J6711J10544j7484k0774k2055j6701k9585K0659j3869
19046A22023L6200m4475k029O5200M5184m947N4116q936k6091l2373J7913J145
19034B22930l5626m6816p9171m0670O1726k8414P3539o546l4443K6587j6504q0877
19022A5715M0656L9471j3957j8432r881M0649L4555o1267r242K5197P0978l7320
19010A17122r4516J511O8267N8661J6666l968k7847P3819j4114n3140l5961O1259
18998A67759Q0624J9141J8848J2117j461o4810k00234r7570r0111O706J96993
18987D8002R0790R8207L9588k5593m5651j7997m4304P4996R8542j9114q0344j5408
18975B01714O7551j4574k4315M3994n3031M814L043p1232o6336n023J02557M0901
$$ plain form
18963 230063 159619 113091 157404 131607 55768 4795 22422 20610 -8632 107742 79344
18952 79344 110656 188105 180373 80982 -29166 11275 115377 155749 212799 274615 276873 274137
18940 274137 272950 177966 95059 79893 107934 183203 201736 176257 233447 231008 267827 290685
18928 290685 235482 264896 337537 252163 86004 30665 80521 232129 365984 277636 199732
18917 199732 179788 141709 159701 191303 268258 304407 286736 262392 245764 208405 183196
18906 183196 199006 200844 151056 100643 164468 252257 249756 210248 225976 169129 138233 146385
18894 146385 174988 184026 209516 140723 108928 138908 36185 34236 112202 163038 119927 114550
18882 114550 177394 121012 170471 181016 262629 271669 359566 328615 205023 226762 237109
$$ packed form
18963B30063p0444m6528M4313k5797p5839n0973J7627j812k9242J16374k8398
18952G9344L1312P7449p732r9391j10148M0441J04102M0372N7050O1816K258k736
18940B74137j187r4984q2907j5166K8041P5269J8533k5479N7190k439L6819K2858
18928B90685n5203K9414P2641q5374j66159n5339M9856J51608J33855q8348p7904
18917A99732j9944l8079J7992L1602P6955L6149j7671k4344j6628l7359k5209
18906A83196J5810J838m9788n0413O3825Q7789k501l9508J5728n6847l0896Q152
18894A46385K8603R038K5490o8793l1795K9980j02723j949P7966N0836m3111n377
18882A14550O2844n6382M9459J0545Q1613R040Q7897l0951j23592K1739J0347
$$ plain form
18871 237109 259920 263029 218586 155193 245513 331833 344532 283399 337038 231150 193284
18860 193284 191216 298719 349714 264795 268115 245733 251322 243490 215519 240789 281684 325062
18848 325062 259448 208542 235661 291897 249677 202410 290322 340613 251637 234989 209208
18837 209208 163045 136463 113378 138783 241384 316184 253518 134415 134932 291116 324191
18826 324191 262489 310889 308799 289149 293474 379346 306514 223127 284056 347024 458908 597345
18814 597345 634552 698335 732949 671042 692648 687084 682879 581307 474334 536299 539956 549685
18802 549685 406046 348388 277967 288589 443584 531662 467262 350276 329639 372908 446663
18791 446663 585827 613613 522108 470060 456730 457042 500678 476921 488479 534490 598765 502814
$$ packed form
18871B37109K2811L109m4443o3393R0320Q6320J2699o1133N3639j05888l7866
18860A93284k068J07503N0995q4919L320k2382N589p832k7971K5270M0895M3378
18848C25062o5614n0906K7119N6236m2220m7267Q7912N0291q8976j6648k5781
18837B09208m6163k6582k3085K5405J02601P4800o2666j19103N17J56184L3075
18826C24191o1702M8400k090j9650M325Q5872p2832q3387O0929O2968J11884J38437
18814E97345L7207O3783L4614o1907K1606n564m205j01572j06973O1965L657R729
18802E49685j43639n7658p0421J0622J54995Q8078o4400j16986k0637M3269P3755
18791D46663J39164K7786r1505n2048j3330L12M3636k3757J1558M6011O4275r5951
$$ plain form
18779 502814 349337 291571 377532 348258 337567 431375 513901 447288 427586 475143 390155
18768 390155 330159 396247 395474 385204 420170 383485 333619 312062 355797 342551 367337 395666
18756 395666 491762 613174 599247 441899 469178 440504 521191 600578 688191 800794 785063
18745 785063 742791 767698 701558 581910 540720 555634 566131 574424 601078 521075 396330
18734 396330 318024 341696 446303 423948 420754 510801 590803 588331 629634 711056 649686 584233
18722 584233 612723 612681 564348 544601 487275 431554 444596 528450 598992 548061 544601 521084
18710 521084 477312 498968 592190 624264 710930 762690 719515 672737 689984 649691 659842
18699 659842 768276 835615 752891 816275 875864 898672 911611 911696 910089 937573 850377 748971
$$ packed form
18779E02814j53477n7766Q5961k9274j0691R3808Q2526o6613j9702M7557q4988
18768C90155n9996O6088p73j0270L4966l6685m9866k1557M3735j3246K4786K8329
18756C95666R6096J21412j3927j57348K7279k8674Q0687P9387Q7613J12603j5731
18745G85063m2272K4907o6140j19648m1190J4914J0497Q293K6654q0003j24745
18734C96330p8306K3672J04607k2355l194R0047Q0002k472M1303Q1422o1370o5453
18722E84233K8490m2m8333j9747n7326n5721J3042Q3854P0542n0931l460k3517
18710E21084m3772K1656R3222L2074Q6666N1760m3175m6778J7247m0293J0151
18699F59842J08434O7339q2724O3384N9589K2808J2939Q5j607K7484q7196j01406
$$ plain form
18687 748971 637965 618844 695962 719539 826083 863935 816586 770215 909652 956886 929174
18676 929174 1001652 1014940 1053264 1164841 1167056 1150614 1214723 1175002 1264112 1272745 1206750 1105390
18664 1105390 1132297 1157346 1099195 1105886 1235621 1275551 1323419 1258818 1233358 1246466 1294521
18653 1294521 1253013 1155781 1200343 1158368 1112148 1095582 1183663 1163347 1285839 1407861 1441753
18642 1441753 1448060 1427519 1452725 1386875 1286592 1213493 1257637 1292936 1301724 1379011 1361317
18631 1361317 1354835 1382333 1470224 1633218 1739490 1682657 1659458 1677013 1669382 1788247 1759109
18620 1759109 1730801 1659991 1741086 1808735 1859457 1910172 2116387 2209207 2206198 2280458 2345621
18609 2345621 2385884 2362983 2345081 2400514 2485104 2631369 2677005 2739045 2940617 3068391 3188320
$$ packed form
18687G48971j11006j9121P7118K3577J06544L7852m7349m6371J39437M7234k7712
18676I29174P2478J3288L8324J11577K215j6442O4109l9721Q9110Q633o5995j01360
18664A105390K6907K5049n8151O691J29735L9930M7868o4601k5460J3108M8055
18653A294521m1508r7232M4562m1975m6220j6566Q8081k0316J22492J22022L3892
18642A441753O307k0541K5206o5850j00283p3099M4144L5299Q788P7287j7694
18631A361317o482K7498Q7891J62994J06272n6833k3199J7555p631J18865k9138
18620A759109k8308p0810Q1095O7649N0722N0715K06215R2820l009P4260O5163
18609B345621M0263k2901j7902N5433Q4590J46265M5636O2040K01572J27774J19929
$$ plain form
18598 3188320 3299495 3423934 3550955 3697771 3882978 4119357 4410174 4765316 5213568
18589 5213568 5739920 6280906 6931981 7468360 7903829 8274333 8692750 8926910 9074430
18580 9074430 9385836 9893073 10412401 11071774 11902786 12997390 14506804 16071091 17560605
18571 17560605 19272092 21182255 23228088 25403240 27914827 31393765 36118146 42557138
18563 42557138 51531811 64635955 84369941 114299371 157481717 211692601 262574610
18556 262574610 296668196 323957881 346036194 337398041 280271071 207737239 150819340
18549 150819340 113742469 89909248 73645556 62070472 53574769 47253513 42459632
18542 42459632 38837680 35997269 33691902 31793318 30117066 28624762 27185873 25639166
$$ packed form
18598C188320J11175J24439J27021J46816J85207K36379K90817L55142M48252
18589E213568N26352N40986O51075N36379M35469L70504M18417K34160J47520
18580I074430L11406N07237N19328O59373Q31012J094604J509414J564287J489514
18571A7560605J711487J910163K045833K175152K511587L478938M724381O438992
18563D2557138Q974673J3104144J9733986K9929430M3182346N4210884N0882009
18556B62574610L4093586K7289685K2078313q638153n7126970p2533832n6917899
18549A50819340l7076871k3833221j6263692j1575084q495703o321256m793881
18542D2459632l621952k840411k305367j898584j676252j492304j438889j546707
$$ plain form
18534 25639166 24302956 23132339 22130417 21205146 20334861 19677991 19154816 18692626 18123953
18525 18123953 17470739 16726780 15886200 14918377 13674902 12625589 11793351 11161890 10562211
18516 10562211 9968060 9478378 9118112 8725718 8332079 7985288 7678737 7352384 7057270
18507 7057270 6684463 6296520 6091507 5948563 5743925 5486466 5331905 5129158 4926499
18498 4926499 4732745 4669802 4474900 4298140 4240795 4198970 4118189 4000399 3895431 3803732
18488 3803732 3618537 3515289 3417492 3268360 3156504 3076203 2974969 2845267 2742344 2589811
18478 2589811 2445729 2458494 2463717 2410820 2224278 1997558 1845796 1843547 1796563 1841013 1821860
18467 1821860 1765260 1642636 1585264 1542744 1501780 1436719 1388570 1284214 1186193 1117646 1052609
$$ packed form
18534B5639166j336210j170617j001922r25271q70285o56870n23175m62190n68673
18525A8123953o53214p43959q40580r67823j243475j049313q32238o31461n99679
18516A0562211n94151m89682l60266l92394l93639l46791l06551l26353k95114
18507G057270l72807l87943k05013j42944k04638k57459j54561k02747k02659
18498D926499j93754o2943j94902j76760n7345m1825q0781j17790j04968r1699
18488C803732j85195j03248r7797j49132j11856q0301j01234j29702j02923j52533
18478B589811j44082J2765N223n2897j86542k26720j51762k249m6984M4450j9153
18467A821860n6600j22624n7372m2520m0964o5061m8149j04356r8021o8547o5037
$$ plain form
18456 1052609 965238 961596 963661 943213 1000604 1025774 965116 858680 763191 719852 737857
18445 737857 843582 889522 871062 741206 711357 690037 675904 628621 538930 419741 389581
18434 389581 411593 417857 510532 514928 512408 583933 564227 455944 520022 614979 537295 434944
18422 434944 345970 215808 182924 146901 202593 304673 303314 255736 320764 413650 348180
18411 348180 232599 221753 270083 245313 194863 269489 274589 305446 392427 312522 322541
18400 322541 450311 401441 261317 79824 -2206 26703 32863 -913 -36766 -198563 -162073
18389 -162073 -97431 -107119 16102 43262 -8878 -3441 -98064 -121772 -113881 -145426 -140358 -60483
18377 -60483 -75793 -134977 -133595 -144157 -151445 -131135 -171996 -108404 -13589 -78949 -141097 -178759
$$ packed form
18456A052609q7371l642K065k0448N7391K5170o0658j06436r5489m3339J8005
18445G37857J05725M5940j8460j29856k9849k1320j4133m7283q9691j19189l0160
18434C89581K2012O264R2675M396k520P1525j9706j08283O4078R4957p7684j02351
18422D34944q8974j30162l2884l6023N5692J02080j359m7578O5028R2886o5470
18411C48180j15581j0846M8330k4770n0450P4626N100L0857Q6981p9905J0019
18400C22541J27770m8870j40124j81493q2030K8909O160l3776l5853j61797L6490
18389a62073O4642r688J23221K7160n2140N437r4623k3708P891l1545N068P9875
18377f0483j5310n9184J382j0562p288K0310m0861O3592R4815o5360o2148l7662
$$ plain form
18365 -178759 -194637 -133747 -41627 -17435 -74456 -227850 -244142 -190156 -170102 -141302 -206484
18354 -206484 -235066 -302909 -305044 -232475 -197003 -231426 -213135 -183298 -135226 -209509 -257808 -260843
18342 -260843 -223846 -137931 -160016 -123056 -89569 -165306 -212101 -131796 -48627 -34065 -45233
18331 -45233 -4792 -68391 -182844 -162226 -188240 -161124 -41268 -115456 -232046 -258294 -245115
18320 -245115 -108896 20795 -28713 -62869 -59370 -87692 -57917 -101919 -154520 -114702 -59663
18309 -59663 -87937 -53153 -69750 -13480 57759 -28067 -85224 -139053 -155548 -82851 -40096 -59250
18297 -59250 -98148 -56607 -94866 -93861 -51205 -102870 -145447 -63620 71170 103134 68562 95920
18285 95920 125690 29454 -21195 -45647 -134595 -153864 -132371 -62017 -47652 -112761 -178605 -136730
$$ packed form
18365a78759j5878O0890R2120K4192n7021j53394j6292N3986K0054K8800o5182
18354b06484k8582o7843k135P2569L5472l4423J8291K9837M8072p4283m8299l035
18342b60843L6997Q5915k2085L6960L3487p5737m6795Q0305Q3169J4562j1168
18331d5233M0441o3599j14453K0618k6014K7116J19856p4188j16590k6248J3179
18320b45115J36219J29691m9508l4156L499k8322K9775m4002n2601L9818N5039
18309e9663k8274L4784j6597N6270P1239q5826n7157n3829j6495P2697M2755j9154
18297e9250l8898M1541l8259J005M2656n1665m2577Q1827J34790L1964l4572K7358
18285I5920K9770r6236n0649k4452q8948j9269K1493P0354J4365o5109o5844M1875
$$ plain form
18273 -136730 -128084 -60090 -40222 -65939 -59369 -9287 -26534 -95054 -93202 -18997 29454 54658
18261 54658 -78265 -162388 -118296 -85172 -47013 -34952 -114402 -94097 -118175 -207646 -191738
18250 -191738 -61329 -58392 -93181 -130993 -167321 -208022 -243044 -210296 -110178 -178911 -197509
18239 -197509 -37792 30470 57059 82095 -16317 -6847 -29162 -174832 -285700 -263047 -210281
18228 -210281 -125156 -160322 -144795 -116812 -15661 -14102 -78450 -98688 -106522 -212445 -152813
18217 -152813 -40974 -96780 -106044 9679 67111 55272 44287 -7823 -21846 -61669 -171024
18206 -171024 -178281 -168855 -61606 -31259 -40734 -20681 -75893 -99302 -164708 -181575 -242844 -200909
18194 -200909 -126513 -95230 95808 131865 -8917 -22756 71429 40661 -4006 -92372 -95884
$$ packed form
18273a36730Q646O7994J9868k5717O570N0082j7247o8520J852P4205M8451K5204
18261E4658j32923q4123M4092L3124L8159J2061p9450K0305k4078q9471J5908
18250a91738J30409K937l4789l7812l6328m0701l5022L2748J00118o8733j8598
18239a97509J59717O8262K6589K5036r8412R470k2315j45670j10868K2653N2766
18228b10281Q5125l5166J5527K7983J01151J559o4348k0238p834j05923N9632
18217a52813J11839n5806r264J15723N7432j1839j0985n2110j4023l9823j09355
18206a71024p257R426J07249L0347r475K0053n5212k3409o5406j6867o1269M1935
18194b00909P4396L1283J91038L6057j40782j3839R4185l0768m4667q8366l512
$$ plain form
18183 -95884 -10094 76337 49778 -3043 -22887 68363 45855 38025 15726 -73058 -202036 -88734
18171 -88734 -12973 -132966 -233051 -254479 -255716 -194309 -117934 -145256 -149081 -165448 -101473 -42225
18159 -42225 -51076 40784 27029 -124864 -137695 -74571 -61646 -15618 72442 70571 -19786 21028
18147 21028 -135759 -212016 -74981 129692 105338 -26995 -91899 -89287 -1505 65317 82001
18136 82001 19308 -61086 -12517 24861 -12142 -64700 -106989 -85656 -39826 5628 -14948 -74049
18124 -74049 -114774 -149179 -208692 -178760 -193479 -197185 -100348 -10960 37196 66407 86305 83502
18112 83502 83913 109310 139049 175142 330102 517976 752643 825097 939806 982706 757311
18101 757311 542708 403519 355693 335000 412283 468306 527234 693542 835482 859416 877404
$$ packed form
18183i5884Q5790Q6431k6559n2821j9844R1250k2508p830k2299q8784j28978J13302
18171h8734P5761j19993j00085k1428j237O1407P6375k7322l825j6367O3975N9248
18159d2225q851R1860j3755j51893j2831O3124J2925M6028Q8060j871r0357M0814
18147B1028j56787p6257J37035K04673k4354j32333o4904K612Q7782O6822J6684
18136H2001o2693q0394M8569L7378l7003n2558m2289K1333M5830M5454k0576n9101
18124g4049m0725l4405n9513K9932j4719l706R6837Q9388M8156K9211J9898k803
18112H3502M11K5397K9739L6093J54960J87874K34667P2454J14709M2900k25395
18101G57311k14603j39189m7826k0693P7283N6023N8928J66308J41940K3934J7988
$$ plain form
18090 877404 854748 744302 569772 418489 363154 239072 123108 32339 50782 45276 90072
18079 90072 100060 186814 152634 134109 68888 49114 93550 63802 78151 164444 169002 16712
18067 16712 -70761 -20058 -30293 22226 19478 -74020 -166268 -112725 -49986 59794 119403 -3427
18055 -3427 -95308 30190 191835 133574 63238 -14969 -12202 93923 114206 33082 46298
18044 46298 63371 29710 -52043 -79733 -153613 -249578 -205208 -86924 11130 46717 -28310
18033 -28310 24868 78586 92035 137318 219119 196325 137295 77139 145443 47413 -94948
18022 -94948 -20241 58522 50719 -32777 -9952 58028 49222 74059 127023 77325 70700 100294
18010 100294 97519 111875 135264 76232 39414 75072 35464 5332 -80369 -57977 -38939 -20645
$$ packed form
18090H77404k2656j10446j74530j51283n5335j24082j15964r0769J8443n506M4796
18079I0072R988Q6754l4180j8525o5221j9774M4436k9748J4349Q6293M558j52290
18067A6712q7473N0703j0235N2519k748r3498r2248N3543O2739J09780N9609j22830
18055c427r1881J25498J61645n8261p0336p8207K767J06125K0283q1124J3216
18044D6298J7073l3661q1753k7690p3880r5965M4370J18284R8054L5587p5027
18033b8310N3178N3718J3449M5283Q1801k2794n9030o0156O8304r8030j42361
18022i4948P4707P8763p803q3496K2825O7980q806K4837N2964m9698o625K9594
18010A00294k775J4356K3389n9032l6818L5658l9608l0132q5701K2392J9038J8294
$$ plain form
17998 -20645 -15112 9407 33733 -66820 -116593 -107948 -27334 71581 8182 24705 42444 114489
17986 114489 114147 -17119 -65595 -187713 -132598 10459 26934 66049 182574 222260 284724
17975 284724 323159 254793 218267 205998 261651 369365 400966 424288 510683 597291 735352
17964 735352 882278 1023135 1081728 1176860 1305911 1331068 1258234 1125879 945948 745352
17954 745352 577274 423503 303304 258636 275271 252298 145800 44053 132655 174460
17944 174460 130550 75371 41629 41884 60074 93992 135644 121537 33104 27765 5381 -20143
17932 -20143 7051 101989 95148 56099 90131 113183 63630 47538 56440 28993 91075 153576
17920 153576 124284 67289 -36937 -115193 -94121 -94358 -195472 -99879 -78346 -38720 -63048
$$ packed form
17998b0645N533K4519K4326j00553m9773Q645Q0614R8915o3399J6523J7739P2045
17986A14489l42j31266m8476j22118N5115J43057J6475L9115J16525L9686O2464
17975B84724L8435o8366l6526j2269N5653J07714L1601K3322Q6395Q6608J38061
17964G35352J46926J40857N8593R5132J29051K5157p2834j32355j79931k00596
17954G45352j68078j53771j20199m4668J6635k2973j06498j01747Q8602M1805
17944A74460m3910n5179l3742K55J8190L3918M1652j4107q8433n339k2384k5524
17932b0143K7194R4938o841l9049L4032K3052m9553j6092Q902k7447O2082O2501
17920A53576k9292n6995j04226p8256K1072k37j01114R5593K1533L9626k4328
$$ plain form
17909 -63048 -60638 -73907 -124139 -88867 133835 99072 82194 67645 67963 81496 134961 139777
17897 139777 115770 130671 132764 133774 47872 21600 -17528 -86577 -39721 37337 -36205 -159467
17885 -159467 -25243 24345 104561 61491 47753 79356 146344 149143 97263 172901 186987
17874 186987 135832 65046 15729 31667 34411 16283 77160 154221 173513 34185 -5368
17863 -5368 132613 114993 19541 48566 79665 101464 -26743 -92021 -1203 98705 -17495
17852 -17495 -93584 -31781 -29756 -369 -29552 24223 115982 97137 41020 45366 52710 72482
17840 72482 147238 221976 303983 287517 133795 -24018 -133416 -107191 -107561 30896 29637
17829 29637 -92486 -91545 22474 11602 30752 119120 100792 -81497 -90341 -6647 -23463 -6691
$$ packed form
17909f3048K410j3269n0232L5272K22702l4763j6878j4549L18J3533N3465M816
17897A39777k4007J4901K093J010q5902k6272l9128o9049M6856P7058p3542j23262
17885a59467J34224M9588Q0216m3070j3738L1603O6988K799n1880P5638J4086
17874A86987n1155p0786m9317J5938K744j8128O0877P7061J9292j39328l9553
17863e368J37981j7620r5452K9025L1099K1799j28207o5278R0818R9908j16200
17852a7495p6089O1803K025K9387k9183N3775R1759j8845n6117M346P344J9772
17840G2482P4756P4738Q2007j6466j53722j57813j09398K6225l70J38457j259
17829B9637j22123R41J14019j0872J9150Q8368j8328j82289q844Q3694j6816J6772
$$ plain form
17817 -6691 -4738 11886 151947 157025 99443 96135 144110 159836 157483 99085 63458 14548
17805 14548 -76715 -25526 -4590 -5784 24056 34429 61132 81604 50330 -30715 -92887 -76116
17793 -76116 -24194 28553 7413 -37914 -23377 117169 100889 -18179 -83356 -36524 -25723
17782 -25723 32888 150461 149462 100865 78276 27516 14646 -4104 99046 116154 14897
17771 14897 -67603 -118634 -61714 -46660 -85514 -117132 -143391 -123051 -89231 88937 95788 15344
17759 15344 62814 154494 156781 115614 172838 203574 189472 167206 184655 78179 30132 72544
17747 72544 47137 6 -9557 26055 -47861 -69370 -86718 -97297 -46384 99622 162834 123082
17735 123082 8723 -39778 3372 61116 24824 29689 106798 40459 69813 139310 31610
$$ packed form
17817f691J953J6624J40061N078n7582l308M7975J5726k353n8398l5627m8910
17805A4548r1263N1189K0936j194K9840J0373K6703K0472l1274q1045o2172J6771
17793g6116N1922N2747k1140m5327J4537J40546j6280j19068o5177M6832J0801
17782b5723N8611J17573r99m8597k2589n0760j2870j8750J03150J7108j01257
17771A4897q2500n1031N6920J5054l8854l1618k6259K0340L3820J78168O851q0444
17759A5344M7470R1680K287m1167N7224L0736j4102k2266J7449j06476m8047M2412
17747G2544k5407m7131r563L5612p3916k1509j7348j0579N0913J46006O3212l9752
17735A23082j14359m8501M3150N7744l6292M865P7109o6339K9354O9497j07700
$$ plain form
17724 31610 62064 120221 159589 155702 332843 367089 237195 8889 93991 100379 91837 41766
17712 41766 81198 193301 229832 165117 82606 32973 103779 216338 166800 49093 55973
17701 55973 34393 -104690 -112586 2651 177099 177354 68900 44430 91417 165584 246601
17690 246601 282650 195226 187391 164312 134107 111533 126647 186931 255169 287323 216996 158725
17678 158725 163470 175367 123044 66811 -1894 40643 166054 171750 111738 107611 171478 180013
17666 180013 183148 152627 170102 202678 249377 345807 411549 408263 322268 272623 185979 95571
17654 95571 54400 62152 108372 200959 300697 354680 354773 167493 167682 205294 111366 86109 107381
17641 107381 225822 263396 327989 306458 279313 257314 242787 248630 233712 97061 111721
$$ packed form
17724C1610L0454N8157L9368l887J77141L4246j29894k28306Q5102O388q542n0071
17712D1766L9432J12103L6531o4715q2511m9633P0806J12559m9538j17707O880
17701E5973k1580j39083p896J15237J74448K55j08454k4470M6987P4167Q1017
17690B46601L6049q7424p835k3079l0205k2574J5114O0284O8238L2154p0327n8271
17678A58725M745J1897n2323n6233o8705M2537J25411N696o0012m127O3867Q535
17666A80013L135l0521J7475L2576M6699R6430O5742l286q5995m9645q6644r0408
17654I5571m1171P752M6220R2587R9738N3983R3j87280J89L7612r3928k5257K1272
17641A07381J18441L7574O4593k1531k7145k1999j4527N843j4918j36651J4660
$$ plain form
17630 111721 123367 11643 28090 124547 142758 173936 208791 279416 232904 251275 200033
17619 200033 154306 112712 153265 213501 302113 248224 197771 167846 154683 134628 233330
17608 233330 224925 173593 176467 176048 155456 148129 82499 47890 170369 229053 243404 165756
17596 165756 112601 142113 104167 63428 132394 112806 37021 48127 87602 3455 24718
17585 24718 140981 187729 191180 255887 363646 438256 398373 384901 353234 235890 224329
17574 224329 308551 352101 383636 483284 405443 308049 186640 163910 135663 143233 228948
17563 228948 259843 187232 33454 -60364 32872 232286 408443 516325 472606 451555 348991
17552 348991 306919 315539 298949 316468 351600 344934 316374 324746 304998 209933 195448 201928
$$ packed form
17630A11721J1646j11724J6447R6457J8211L1178L4855P0625m6512J8371n1242
17619B00033m5727m1594M0553O0236Q8612n3889n0453k9925j3163k0055R8702
17608B33330q405n1332K874m19k0592p327o5630l4609J22479N8684J4351p7648
17596A65756n3155K9512l7946m0739O8966j9588p5785J1106L9475q4147K1263
17585B4718J16263M6748L451O4707J07759P4610l9883j3472l1667j17344j1561
17574B24329Q4222M3550L1535R9648p7841r7394j21409k2730k8247P570Q5715
17563B28948L0895p2611j53778r3818R3236J99414J76157J07882m3719k1051j02564
17552C48991m2072Q620j6590J7519L5132o666k8560Q372j9748r5065j4485O480
$$ plain form
17540 201928 89150 -113294 -104963 -66830 -2551 56743 109615 135575 145388 212941 266072
17529 266072 271459 289922 313151 282396 255842 189818 193625 174934 195106 305587 216763 120513
17517 120513 116203 169528 239611 215394 246318 257999 322392 341522 365227 264633 260958 216732
17505 216732 153124 217767 198730 178673 200322 288228 303475 330386 431885 420018 408723
17494 408723 317636 219814 169109 36162 43771 131722 175812 226614 151597 201925 223561
17483 223561 240929 156003 60826 102771 139411 245840 210643 76696 161563 269944 236949
17472 236949 221197 244443 269471 167492 232529 283091 168972 117371 163451 196687 189117
17461 189117 265000 303093 335942 352231 349459 249618 255924 436066 395477 321017 424731
$$ packed form
17540B01928j12778k02444Q331L8133O4279N9294N2872K5960R813O7553N3131
17529B66072N387J8463K3229l0755k6554o6024L807j8691K0172J10481q8824r6250
17517A20513m310N3325P0083k4217L0924J1681O4393J9130K3705j00594l675m4226
17505B16732o3608O4643j9037k0057K1649Q7906J5247K6911J01499j1867j1295
17494D08723r1087r7822n0705j32947P609Q7951M4090N0802p5017N0328K1636
17483B23561J7368q4926r5177M1945L6640J06429l5197j33947Q4867J08381l2995
17472B36949j5752K3246K5028j01979O5037N0562j14119n1601M6080L3236p570
17461A89117P5883L8093L2849J6289k772r9841O306J80142m0589p4460J03714
$$ plain form
17450 424731 443007 387354 329692 204867 182058 188371 233826 238529 375591 447369 471351
17439 471351 309349 208780 173955 150337 248626 325441 212366 223681 295817 310348 228406
17428 228406 286399 292084 258120 240106 224080 161507 206217 270311 306855 320657 340059 356440
17416 356440 314770 299022 323542 361096 328709 256721 232699 194313 193370 141636 157950 161218
17404 161218 187243 206893 243241 376270 456903 392581 332804 381768 361857 428043 387799
17393 387799 222077 189921 138875 215769 307976 300339 263220 277028 327070 300214 286505
17382 286505 183969 91246 132862 44199 -12055 48409 110657 196411 271509 268335 187230
17371 187230 168304 174635 383092 463821 481925 396570 349833 346903 301300 242297 311698 319447
$$ packed form
17450D24731J8276n5653n7662j24825k2809O313M5455M703J37062P1778K3982
17439D71351j62002j00569l4825k3618R8289P6815j13075J1315P2136J4531q1942
17428B28406N7993N685l3964j8014j6026o2573M4710O4094L6544J3802J9402J6381
17416C56440m1670j5748K4520L7554l2387p1988k4022l8386r43n1734J6314L268
17404A61218K6025J9650L6348J33029Q0633o4322n9777M8964j9911O6186m0244
17393C87799j65722l2156n1046P6894R2207p637l7119J3808N0042k6856j3709
17382B86505j02536r2723M1616q8663n6254O0464O2248Q5754P5098l174q1105
17371A87230j8926O331K08457Q0729J8104q5355m6737k930m5603n9003O9401P749
$$ plain form
17359 319447 334601 291891 166597 194215 199405 100637 135925 229886 281831 230480 207439
17348 207439 309586 365519 410196 449097 429333 329394 315252 275777 355833 340055 280166
17337 280166 234794 241267 252270 182967 91542 131522 241520 258787 285484 313678 322351 339998
17325 339998 321758 452770 444591 396192 346768 329448 282700 231655 84684 115021 156416
17314 156416 179645 244638 373555 416086 441675 310608 232006 340260 440929 464432 544742
17303 544742 622616 626936 523371 358885 352874 328164 317385 309443 366113 414995 348205 313423
17291 313423 348216 324035 341461 321200 221686 253526 392752 401199 332749 374576 420703
17280 420703 383652 351068 416540 552976 546555 457792 408176 328823 360064 343872 343486 485828
$$ packed form
17359C19447J5154m2710j25294K7618N190r8768L5288R3961N1945n1351k3041
17348B07439J02147N5933M4677L8901j9764r9939j4142l9475Q0056j5778n9889
17337B80166m5372O473J1003o9303r1425L9980J09998J7267K6697K8194Q673J7647
17325C39998j8240J31012q179m8399m9424j7320m6748n1045j46971L0337M1395
17314A56416K3229O4993J28917M2531K5589j31067p8602J08254J00669K3503Q0310
17303E44742P7874M320j03565j64486o011k4710j0779p942N6670M8882o6790l4782
17291C13423L4793k4181J7426k0261r9514L1840J39226Q447o8450M1827M6127
17280D20703l7051l2584O5472J36436o421q8763m9616p9353L1241j6192l86J42342
$$ plain form
17268 485828 633039 542700 526031 517460 554070 482739 410000 314545 307823 407003 487134 451363
17256 451363 449385 377284 417131 353607 271186 267558 307202 381745 532012 536814 465977 368494
17244 368494 338585 301266 289113 280872 307978 266143 310326 351758 263700 289399 451315
17233 451315 506076 447865 421594 438715 369407 312098 315444 422400 430345 429085 363220 306804
17221 306804 328902 331219 402042 438984 397318 305265 225017 192642 261289 378654 387739 476422
17209 476422 573978 592659 492138 458926 442125 367097 386465 463365 420040 469787 537308
17198 537308 477536 502828 614156 490223 491344 515362 415943 343479 441459 487130 444936
17187 444936 365238 373008 384724 377514 429551 577373 579795 630180 583250 533701 454427 531858
$$ packed form
17268D85828J47211r0339j6669q571L6610p1331p2739r5455o722R9180Q0131l5771
17256D51363j978p2101L9847o3524q2421l628L9644P4543J50267M802p0837r7483
17244C68494k9909l7319j2153q241K7106m1835M4183M1432q8058K5699J61916
17233D51315N4761n8211k6271J7121o9308n7309L346J06956P945j260o5865n6416
17221C06804K2098K317P0823L6942m1666r2053q0248l2375O8647J17365R085Q8683
17209D76422R7556J8681j00521l3212j6801p5028J9368P6900m3325M9747O7521
17198E37308n9772K5292J11328j23933J121K4018r9419p2464R7980M5671m2194
17187D44936p9698P770J1716p210N2037J47822K422N0385m6930m9549p9274P7431
$$ plain form
17175 531858 575012 594248 639939 630371 688828 523262 392699 376422 493215 564024 548492
17164 548492 597386 663050 582343 440368 401305 305803 321939 312027 271860 211983 288593
17153 288593 278194 260264 321523 375638 390734 339245 241091 358830 491298 450859 486854
17142 486854 509035 397944 348820 402136 501774 507417 367353 347613 449664 473701 463998
17131 463998 382906 423601 507188 488976 567317 591817 441657 398440 355097 259647 183263
17120 183263 154078 192426 332118 407934 417541 493111 531678 505755 462404 455589 565862
17109 565862 633595 599031 586652 665211 668711 544683 582301 593866 563376 631421 728211
17098 728211 684672 638953 576636 622745 618067 598099 556653 581359 584134 533204 472464 382126
$$ packed form
17175E31858M3154J9236M5691r568N8457j65566j30563j6277J16793P0809j5532
17164E48492M8894O5664q0707j41975l9063r5502J6136r912m0167n9877P6610
17153B88593j0399j7930O1259N4115J5096n1489r8154J17739J32468m0439L5995
17142D86854K2181j11091m9124N3316R9638N643j40064j9740J02051K4037r703
17131D63998q1092M0695Q3587j8212P8341K4500j50160m3217m3343r5450p6384
17120A83263k9185L8348J39692P5816R607P5570L8567k5923m3351o815J10273
17109E65862O7733l4564j2379P8559L500j24028L7618J1565l0490O8045R6790
17098G28211m3539m5719o2317M6109m678j9968m1446K4706K775n0930o0740r0338
$$ plain form
17086 382126 317491 384842 481659 513291 518023 560259 608046 569626 531553 487989 476523 522829
17074 522829 615245 648755 647377 675817 616297 606499 707948 666656 517070 475007 465271 456858
17062 456858 390504 335762 381689 459539 479084 516108 459141 442883 432351 471020 470015 492269
17050 492269 611091 656161 620789 612756 582968 480121 465975 562230 628894 582866 617293
17039 617293 579564 574621 485209 379753 490352 555246 555528 497388 521222 533541 544928 698649
17027 698649 710309 640975 664285 667283 612125 556548 511545 600012 615101 591233 530856 519598
17015 519598 508461 510994 327819 360894 490948 513580 481078 534348 651161 686787 598559
17004 598559 558965 567947 655300 654590 498010 444173 462451 401957 437903 569137 530275 451418
$$ packed form
17086C82126o4635O7351R6817L1632M732M2236M7787l8420l8073m3564j1466M6306
17074E22829R2416L3510j378K8440n9520r798J01449m1292j49586m2063r736q413
17062D56858o6354n4742M5927P7850J9545L7024n6967j6258j0532L8669j005K2254
17050D92269J18822M5070l5372q033k9788j02847j4146R6255O6664m6028L4427
17039F17293l7729m943q9412j05456J10599O4894K82n8140K3834J2319J1387J53721
17027F98649J1660o9334K3310K998n5158n5577m5003Q8467J5089k3868o0377j1258
17015E19598j1137K533j83175L3075J30054K2632l2502N3270J16813L5626q8228
17004E98559l9594Q982Q7353p10j56580n3837J8278o0494L5946J31234l8862p8857
$$ plain form
16992 451418 443416 431452 404039 414809 538448 605636 573347 586038 582947 633576 573863 556442
16980 556442 507560 551676 645407 735981 791674 741381 719772 799434 790116 731597 653385 623280
16968 623280 636765 651995 654816 610257 607703 562694 487424 542454 670119 654162 585537 644071
16956 644071 674113 577320 564303 591846 562563 654123 743709 803572 742374 659202 576945
16945 576945 525114 562849 585086 695491 771434 679664 639836 662404 696493 762760 689446
16934 689446 664984 654051 625451 636647 687822 794867 731877 722876 735449 757265 746178
16923 746178 814528 786916 680418 666427 659586 669113 544827 649754 757883 712666 658428
16912 658428 627078 641943 703181 763171 861523 861353 877080 903019 859318 904189 898889 834123
$$ packed form
16992D51418q002j1964k7413J0770J23639O7188l2289J2691l091N0629n9713j7421
16980E56442m8882M4116R3731R0574N5693n0293k1609P9662r318n8519p8212l0105
16968F23280J3485J5230K821m4559k554m5009p5270N5030J27665j5957o8625N8534
16956F44071L0042r6793j3017K7543k9283R1560Q9586N9863o1198q3172q2257
16945E76945n1831L7735K2237J10405P5943r1770l9828K2568L4089O6267p3314
16934F89446k4462j0933k8600J1196N1175J07045o2990r001J2573K1816j1087
16923G46178O8350k7612j06498j3991o841R527j24286J04927J08129m5217n4238
16912F58428l1350J4865O1238N9990R8352j70J5727K5939m3701M4871n300o4766
$$ plain form
16900 834123 800020 805118 745818 838083 815701 720137 697945 673161 676526 662118 770003 853713
16888 853713 1066064 1089515 978389 967356 872411 922425 870833 754513 764415 706344 646308
16877 646308 617003 617210 635696 824419 911268 844427 791747 713669 719535 716463 675271 726237
16865 726237 761487 841771 920758 945391 920171 900547 841606 711648 683318 629078 672799
16854 672799 693786 711340 704466 730378 733930 725792 752558 837643 755592 668301 756299 833597
16842 833597 869382 893246 872574 831246 786749 902025 928056 892344 967574 984876 892900
16831 892900 814583 808161 782177 796030 802982 852345 905853 908300 805224 784523 727503 744899
16819 744899 853241 930812 931510 923131 952284 918198 925349 969537 900267 859349 892867 885736
$$ packed form
16900H34123l4103N098n9300R2265k2382r5564k2192k4784L365j4408J07885Q3710
16888H53713K12351K3451j11126j1033r4945N0014n1592j16320R902n8071o0036
16877F46308k9305K07J8486J88723Q6849o6841n2680p8078N866l072m1192N0966
16865G26237L5250Q0284P8987K4633k5220j9624n8941j29958k8330n4240M3721
16854F72799K0987J7554o874K5912L552q138K6766Q5085q2051q7291Q7998P7298
16842H33597L5785K3864k0672m1328m4497J15276K6031l5712P5230J7302r1976
16831H92900p8317o422k5984J3853O952M9363N3508K447j03076k0701n7020J7396
16819G44899J08342P7571O98q379K9153l4086P151M4188o9270m0918L3518p131
$$ plain form
16807 885736 811120 801080 804420 806543 876813 901461 924519 902871 872479 851457 920489 943508
16795 943508 973900 987778 997923 891562 899061 916910 844081 782580 770395 876635 936502
16784 936502 978703 928718 979763 1021106 1019992 1017392 1082026 1040063 955205 930823 1034722 997199
16772 997199 926537 921550 882228 875941 860072 812416 873176 885255 907210 1002212 998982 993475
16760 993475 1046648 1071058 1122640 1041169 988524 970368 1023259 1007424 963314 955125 939338 963976
16748 963976 965028 990837 1007918 947420 848405 883819 941018 960918 943871 939132 929728 887933
16736 887933 920752 1024608 1035967 1025523 1053795 989561 954560 946943 951030 927659 954930 1023277
16724 1023277 1022697 993563 981642 1016615 1074610 1059173 1027054 989580 1023623 1062363 1101008 1085691
$$ packed form
16807H85736p4616j0040L340K123P0270K4648K3058k1648l0392k1022O9032K3019
16795I43508L0392J3878J0145j06361P499J7849p2829o1501j2185J06240N9867
16784I36502M2201m9985N1045M1343j114k600O4634m1963q4858k4382J03899l7523
16772I97199p0662m987l9322o287j5869m7656O0760J2079K1955R5002l230n507
16760I93475N3173K4410N1582q1471n2645j8156N2891j5835m4110q189j5787K4638
16748I63976J052K5809J7081o0498r9015L5414N7199J9900j7047m739r404m1795
16736H87933L2819J03856J1359j0444K8272o4234l5001p617M087k3371K7271O8347
16724A023277n80k9134j1921L4973N7995j5437l2119l7474L4043L8740L8645j5317
$$ plain form
16712 1085691 1001543 916856 918143 998728 1031462 1104219 1134022 1176414 1211268 1148771 998991
16701 998991 981821 1042190 1098196 1119348 1037609 1018357 957992 1082822 1158564 1038494 1034751
16690 1034751 1140097 1096407 1140063 1171544 1214277 1184670 1245403 1215591 1199165 1196126 1111569
16679 1111569 1035025 1038299 1088012 1174257 1164034 1173978 1270481 1241231 1110207 1044513 1085173
16668 1085173 1126364 1156474 1047187 999766 1087469 1118671 1234003 1247945 1200333 1178976 1190547
16657 1190547 1149609 1136411 1303603 1438919 1411633 1360064 1227145 1110595 1083576 1176348
16647 1176348 1217329 1199521 1073003 1051169 1106766 1012120 1025914 1208460 1270756 1276542 1272349
16636 1272349 1247640 1266517 1288208 1383813 1341653 1272493 1202445 1220178 1345188 1436865 1420325
$$ packed form
16712A085691q4148q4687J287Q0585L2734P2757K9803M2392L4854o2497j49780
16701I98991j7170O0369N6006K1152q1739j9252o0365J24830P5742j20070l743
16690A034751J05346m3690M3656L1481M2733k9607O0733k9812j6426l039q4557
16679A111569p6544L274M9713Q6245j0223R944R6503k9250j31024o5694M0660
16668A085173M1191L0110j09287m7421Q7703L1202J15332J3942m7612k1357J1571
16657A190547m0938j3198J67192J35316k7286n1569j32919j16550k7019R2772
16647A176348M0981j7808j26518k1834N5597r4646J3794J82546O2296N786m193
16636A272349k4709J8877K1691R5605m2160o9160p0048J7733J25010R1677j6540
$$ plain form
16625 1420325 1332107 1421178 1471326 1342167 1323284 1324529 1366200 1372826 1283803 1302495 1310211 1326847
16613 1326847 1316480 1371896 1374455 1321003 1393575 1436861 1296477 1195834 1215937 1384730 1436549
16602 1436549 1359434 1328242 1305122 1301194 1341356 1366089 1331191 1378039 1502049 1420703 1336879
16591 1336879 1302435 1278840 1394213 1598409 1539278 1454854 1368583 1318719 1310132 1314652 1418336
16580 1418336 1445881 1374609 1402575 1406630 1332498 1335164 1382166 1480384 1422401 1361528 1321792 1383535
16568 1383535 1466382 1378074 1264407 1256227 1188802 1180807 1323800 1487347 1434102 1333117 1338563
16557 1338563 1404206 1462775 1551095 1495089 1498248 1504702 1490114 1431321 1440745 1566653 1519871 1446968
16545 1446968 1493633 1570785 1519688 1444157 1494276 1478715 1535631 1511027 1501589 1420709 1305232
$$ packed form
16625A420325q8218Q9071N0148j29159j8883J245M1671O626q9023J8692P716J6636
16613A326847j0367N5416K559n3452P2572M3286j40384j00643K0103J68793N1819
16602A436549p7115l1192k3120l928M0162K4733l4898M6848J24010q1346q3824
16591A336879l4444k3595J15373K04196n9131q4424q6271m9864q587M520J03684
16580A418336K7545p1272K7966M055p4132K666M7002R8218n7983o0873l9736O1743
16568A383535Q2847q8308j13667q180o7425p995J42993J63547n3245j00985N446
16557A338563O5643N8569Q8320n6006L159O454j4588n8793R424J25908m6782p2903
16545A446968M6665P7152n1097p5531N0119j5561N6916k4604r438q0880j15477
$$ plain form
16534 1305232 1421347 1510124 1561925 1501116 1618198 1642758 1630803 1716502 1698615 1778025 1751556
16523 1751556 1674224 1613028 1602930 1656919 1689756 1595479 1579437 1494221 1378943 1388314 1467456
16512 1467456 1518275 1499562 1482346 1513958 1584127 1573145 1494436 1420100 1423767 1470939 1459069
16501 1459069 1421343 1459245 1491778 1530774 1572412 1599838 1612927 1662774 1624326 1650458 1672304
16490 1672304 1667393 1555149 1543476 1632842 1657095 1624464 1611708 1592720 1593864 1545850 1517277
16479 1517277 1564377 1707479 1740194 1701253 1753567 1764558 1739986 1680051 1642973 1637088 1646434
16468 1646434 1654949 1703828 1666843 1674620 1630635 1602608 1568819 1622481 1748938 1793448 1809507
16457 1809507 1822226 1744533 1788912 1901235 1816392 1728393 1672941 1702624 1813895 1905565 1923257
$$ packed form
16534A305232J16115Q8777N1801o0809J17082K4560j1955Q5699j7887P9410k6469
16523A751556p7332o1196j0098N3989L2837r4277j6042q5216j15278R371P9142
16512A467456N0819j8713j7216L1612P0169j0982p8709p4336L667M7172j1870
16501A459069l7726L7902L2533L8996M1638K7426J3089M9847l8448K6132K1846
16490A672304m911j12244j1673Q9366K4253l2631j2756j8988J144m8014k8573
16479A517277M7100J43102L2715l8941N2314J0991k4572n9935l7078n885R346
16468A646434Q515M8879l6985P777m3985k8027l3789N3662J26457M4510J6059
16457A809507J2719p7693M4379J12323q4843q7999n5452K9683J11271R1670J7692
$$ plain form
16446 1923257 1940484 1949619 1920631 1872447 1708129 1718705 1847765 1942868 1886997 1891567 2030342
16435 2030342 2002680 1958469 1954139 1962187 1949261 1891070 1852747 1842838 1865428 1878170 1924632 1921412
16423 1921412 1839380 1844465 1822468 1884490 2013147 1956382 1855982 1926336 1965268 1906855 1945009
16412 1945009 1892252 1851205 1895219 2063927 2068087 1961170 1921947 1814633 1787833 1880780 1946482
16401 1946482 1938214 1970564 1984122 1965775 1956183 1916318 1883391 1936041 1971891 1996705 2010105 2020907
16389 2020907 1978735 2049545 2110492 2102152 2107516 2072865 2069711 2161839 2194228 2288142 2253329 2201542
16377 2201542 2115915 2014935 2053533 2042793 1928540 1935972 2030043 2091075 2115837 2090710 2023742
16366 2023742 2040978 2022037 2077877 2171545 2123217 2112426 2157444 2189804 2211634 2186232 2075895
$$ packed form
16446A923257J7227R135k8988m8184j64318J0576J29060R5103n5871M570J38775
16435B030342k7662m4211m330Q048j2926n8191l8323r909K2590J2742M6462l220
16423A921412q2032N085k1997O2022J28657n6765j00400P0354L8932n8413L8154
16412A945009n2757m1047M4014J68708M160j06917l9223j07314k6800R2947O5702
16401A946482q268L2350J3558j8347r592l9865l2927N2650L5850K4814J3400J0802
16389B020907m2172P0810O0947q340N364l4651l154R2128L2389R3914l4813n1787
16377B201542q5627j00980L8598j0740j14253P432R4071O1032K4762k5127o6968
16366B023742J7236j8941N5840R3668m8328j0791M5018L2360K1830k5402j10337
$$ plain form
16355 2075895 2165433 2187499 2179624 2194453 2225605 2180446 2103151 2091278 2119587 2173441 2114913
16344 2114913 2099536 2185831 2205938 2140284 2220469 2275350 2364845 2346618 2297372 2204805 2164502
16333 2164502 2144393 2263050 2238198 2303411 2342064 2282760 2234975 2221902 2268762 2265738 2261603
16322 2261603 2332899 2360117 2383011 2461527 2464289 2382819 2428663 2469507 2387370 2351943 2307231
16311 2307231 2254270 2140540 2082141 2184683 2260606 2236536 2263297 2332387 2315624 2394364 2370294
16300 2370294 2292227 2339214 2282353 2327313 2391674 2381194 2393410 2403768 2467921 2475320 2422729
16289 2422729 2371677 2434300 2411190 2421817 2436784 2408682 2524597 2600578 2603529 2545140 2454891
16278 2454891 2461460 2490783 2494933 2457627 2471400 2511966 2584334 2727178 2743116 2740009 2755067 2643807
$$ packed form
16355B075895Q9538K2066p875J4829L1152m5159p7295j1873K8309N3854n8528
16344B114913j5377Q6295K0107o5654Q0185N4881Q9495j8227m9246r2567m0303
16333B164502k0109J18657k4852O5213L8653n9304m7785j3073M6860l024m135
16322B261603P1296K7218K2894P8516K762q1470M5844M0844q2137l5427m4712
16311B307231n2961j13730n8399J02542P5923k4070K6761O9090j6763P8740k4070
16300B370294p8067M6987n6861M4960O4361j0480J2216J0358O4153P399n2591
16289B422729n1052O2623k3110J0627J4967k8102J15915P5981K951n8389r0249
16278B454891O569K9323M150l7306J3773M0566P2368J42844J5938l107J5058j11260
$$ plain form
16266 2643807 2629604 2641421 2656288 2607876 2675038 2637791 2620254 2595558 2663108 2715370 2668497
16255 2668497 2707326 2689531 2692224 2677247 2581399 2604360 2648329 2780732 2832539 2811574 2738278
16244 2738278 2719868 2817026 2785368 2747206 2762346 2771117 2781721 2705890 2751345 2746217 2785598 2739834
16232 2739834 2743109 2789556 2744300 2738339 2790867 2772195 2714723 2831523 2920627 2892891 2864750
16221 2864750 2857978 2791790 2686804 2586317 2590589 2678804 2716851 2775764 2804457 2832873 2962718
16210 2962718 3037107 2964217 2943163 3064314 3178461 3100834 3052611 3019030 2962603 2858216 2860652
16199 2860652 2977043 3045092 3048764 3013211 3113168 3199840 3152713 3086422 3084588 3065902 2993833
16188 2993833 3007498 2918178 2995449 3041178 3092746 3183760 3171680 3120906 3147095 3212475 3174745
$$ packed form
16266B643807j4203J1817J4867m8412O7162l7247j7537k4696O7550N2262m6873
16255B668497L8829j7795K693j4977r5848K2961M3969J32403N1807k0965p3296
16244B738278j8410R7158l1658l8162J5140Q771J0604p5831M5455n128L9381m5764
16232B739834L275M6447m5256n961N2528j8672n7472J16800Q9104k7736k8141
16221B864750o772o6188j04986j00487M272Q8215L8047N8913K8693K8416J29845
16210B962718P4389p2890k1054J21151J14147p7627m8223l3581n6427j04387K436
16199B860652J16391O8049L672l5553R9957Q6672m7127o6291j834j8686p2069
16188B993833J3665q9320P7271M5729N1568R1014j2080n0774K6189O5380l7730
$$ plain form
16177 3174745 3070557 3135008 3281617 3255996 3224027 3249229 3215277 3162815 3177054 3240552 3233785
16166 3233785 3233387 3248558 3276640 3309036 3272112 3246293 3251187 3292897 3291462 3284097 3323548 3278453
16154 3278453 3279367 3307089 3400516 3307137 3266480 3223912 3225850 3303112 3347286 3358356 3345067 3350914
16142 3350914 3347039 3337344 3281531 3326064 3419809 3480121 3556206 3610246 3678380 3687547 3584790 3445595
16130 3445595 3428946 3457776 3424454 3415890 3537464 3577117 3601977 3605521 3614533 3532873 3453470 3532743
16118 3532743 3655631 3622020 3662016 3685352 3688476 3691067 3713818 3803184 3725285 3691774 3662283
16107 3662283 3683462 3727566 3811224 3813531 3733683 3668080 3624236 3700542 3764780 3804875 3803660 3783586
16095 3783586 3759921 3702142 3712370 3824379 3891627 3956602 3997377 3988984 3996286 3973033 3909001
$$ packed form
16177C174745j04188O4451J46609k5621l1969K5202l3952n2462J4239O3498o767
16166C233785l98J5171K8082L2396l6924k5819M894M1710j435p365L9451m5095
16154C278453R14K7722R3427r3379m0657m2568J938P7262M4174J1070j3289N847
16142C350914l875r695n5813M4533R3745O0312P6085N4040O8134R167j02757j39195
16130C445595j6649K8830l3322q564J21574L9653K4860L544R012q1660p9403P9273
16118C532743J22888l3611L9996K3336L124K591K2751Q9366p7899l3511k9491
16107C662283K1179M4104Q3658K307p9848o5603m3844P6306O4238M0095j215k0074
16095C783586k3665n7779J0228J12009O7248O4975M0775q393P302k3253o4032
$$ plain form
16084 3909001 3919673 3913410 3963040 4015452 3953570 3867887 3885615 3858895 3892904 3950664 3933773
16073 3933773 4004161 4098949 4133409 4170465 4185359 4234949 4171795 4130370 4043521 4054754 4029553
16062 4029553 4076255 4142172 4192942 4241797 4305722 4296079 4179418 4091362 4113257 4196637 4185242
16051 4185242 4216890 4206056 4242517 4182158 4144858 4089915 4158385 4131848 4166761 4259251 4246512
16040 4246512 4283403 4319780 4289474 4339921 4405257 4383206 4445050 4479941 4520542 4437173 4325718
16029 4325718 4328229 4347176 4382897 4499645 4481881 4416038 4373927 4320069 4310341 4300877 4431430
16018 4431430 4482526 4592285 4656332 4614429 4617443 4672209 4718018 4824308 4897238 4731740 4658811
16007 4658811 4713447 4782524 4846228 4955466 4918069 4853610 4802410 4826328 4745726 4635555 4684297
$$ packed form
16084C909001J0672o263M9630N2412o1882q5683J7728k6720L4009N7760j6891
16073C933773P0388R4788L4460L7056J4894M9590o3154m1425q6849J1233k5201
16062D029553M6702O5917N0770M8855O3925r643j16661q8056K1895Q3380j1395
16051D185242L1648j0834L6461o0359l7300n4943O8470k6537L4913R2490j2739
16040D246512L6891L6377l0306N0447O5336k2051O1844L4891M0601q3369j11455
16029D325718K511J8947L5721J16748j7764o5843m2111n3858r728r464J30553
16018D431430N1096J09759O4047m1903L014N4766M5809J06290P2930j65498p2929
16007D658811N4636O9077O3704J09238l7397o4459n1200K3918q0602j10171M8742
$$ plain form
15996 4684297 4827805 4883739 4920568 4990664 4933325 4897690 4880790 4861708 4803952 4849425 4882657
15985 4882657 5012694 4988155 4912583 4927322 4873295 4748438 4711858 4735721 4886811 4991229
15975 4991229 4982780 4874686 4956215 5036848 5174271 5192787 5138489 5109951 5074261 5087190 5095669
15964 5095669 5030850 4979133 5068935 5113398 5050106 5076092 5072844 5110189 5179365 5187273 5196775 5175207
15952 5175207 5092335 5166729 5268042 5266938 5334135 5353239 5330992 5266700 5209059 5230060 5247721
15941 5247721 5173184 5292422 5369772 5435761 5545220 5596315 5473890 5311903 5295869 5375266
15931 5375266 5387868 5438067 5444501 5334384 5249488 5403197 5428845 5455506 5535804 5591625 5550062
15920 5550062 5537105 5544692 5495500 5531130 5558119 5489766 5553332 5652173 5679410 5806057 5817607
$$ packed form
15996D684297J43508N5934L6829P0096n7339l5635j6900j9082n7756M5473L3232
15985D882657J30037k4539p5572J4739n4027j24857l6580K3863J51090J04418
15975D991229q449j08094Q1529Q0633J37423J8516n4298k8538l5690J2929Q479
15964E095669o4819n1717Q9802M4463o3292K5986l248L7345O9176P908R502k1568
15952E175207q2872P4394J01313j104O7197J9104k2247o4292n7641K1001J7661
15941E247721p4537J19238P7350O5989J09459N1095j22425j61987j6034P9397
15931E375266J2602N0199O434j10117q4896J53709K5648K6661Q0298N5821m1563
15920E550062j2957P587m9192L5630K6989o8353O3566R8841K7237J26647J1550
$$ plain form
15909 5817607 5785178 5680899 5599449 5643709 5561087 5557093 5575305 5606929 5643874 5631462 5671554
15898 5671554 5694149 5753723 5795166 5842549 5875245 5828136 5825141 5765051 5701602 5800460 5843533
15887 5843533 5864901 5918133 5973714 5956146 6008486 6082503 6088740 6011946 5879032 5938745 5901946
15876 5901946 5911808 5960052 5943168 5982682 6007774 6003167 5973520 6073192 6006061 5901575 5870750
15865 5870750 5986745 6029401 6007843 6049576 6040390 6015627 6005656 5968212 6074203 6100827 6072919
15854 6072919 6087130 6143816 6236638 6235002 6122308 6086987 5988440 6061160 6163051 6189601 6241357
15843 6241357 6226782 6265199 6222449 6145129 6286428 6289058 6169455 6140633 6305668 6289030 6215827
15832 6215827 6150911 6172507 6279406 6297886 6185692 6209090 6216329 6283663 6300803 6304879 6244304
$$ packed form
15909E817607l2429j04279q1450M4260q2622l994J8212L1624L6945j2412M0092
15898E671554K2595N9574M1443M7383L2696m7109k995o0090o3449R8858M3073
15887E843533K1368N3232N5581j7568N2340P4017O237p6794j32914N9713l6799
15876E901946R862M8244j6884L9514K5092m607k9647R9672o7131j04486l0825
15865E870750J15995M2656k1558M1733r186k4763r971l7444J05991K6624k7908
15854F072919J4211N6686R2822j636j12694l5321r8547P2720J01891K6550N1756
15843F241357j4575L8417m2750p7320J41299K630j19603k8822J65035j6638p3203
15832F215827o4916K1596J06899J8480j12194K3398P239O7334J7140M076o0575
$$ plain form
15821 6244304 6327595 6352897 6349099 6447707 6493246 6586880 6587596 6581180 6597074 6492937 6559636 6581351
15809 6581351 6519129 6483203 6509959 6457087 6398448 6384255 6424200 6429826 6460200 6532042 6619158
15798 6619158 6635708 6618321 6620036 6551032 6536127 6528180 6594055 6683683 6662831 6680220 6540905
15787 6540905 6589940 6665640 6759657 6840678 6794809 6768289 6819907 6749329 6639390 6638819 6709280
15776 6709280 6702006 6779407 6834813 6778354 6847040 6916085 7035857 6878221 6765245 6809453 6805912
15765 6805912 6879557 6905584 6920575 6822062 6792060 6750058 6806691 6780148 6845297 6972154 6986206
15754 6986206 6858284 6756109 6741632 6762114 6878567 6868916 6911374 7005498 7065200 7104605 7121169
15743 7121169 7144499 7097265 7014807 7069613 7149677 7035531 6992198 7007842 6973850 6930068 6936741
$$ packed form
15821F244304Q3291K5302l798R8608M5539R3634P16o416J5894j04137O6699K1715
15809F581351o2222l5926K6756n2872n8639j4193L9945N626L0374P1842Q7116
15798F619158J6550j7387J715o9004j4905p947O5875Q9628k0852J7389j39315
15787F540905M9035P5700R4017Q1021m5869k6520N1618p0578j09939n71P0461
15776F709280p274P7401N5406n6459O8686O9045J19772j57636j12976M4208l541
15765F805912P3645K6027J4991r8513l0002m2002N6633k6543O5149J26857J4052
15754F986206j27922j02175j4477K0482J16453r651M2458R4124N9702L9405J6564
15743G121169K3330m7234q2458N4806Q0064j14146m3333J5644l3992m3782O673
$$ plain form
15732 6936741 6926037 6919084 6971360 6986116 6963695 7002507 6982115 6892022 6927987 6877348 6796744
15721 6796744 6747417 6772875 6889727 6885866 6855148 6903186 7024222 7010675 6960065 6986127 7104242
15710 7104242 7274827 7292539 7166782 7113844 7024139 6960382 6926093 6979551 7002096 7016848 7030861
15699 7030861 7092078 7118247 7128261 7226056 7235459 7207969 7086724 7022759 7067508 7181914 7119958
15688 7119958 6968934 6901170 6984858 6960170 6919132 6973207 7056522 7155120 7202286 7149402 7125890
15677 7125890 7107413 7119002 7151848 7092239 7047927 7007440 6950360 6869048 6815176 6857964 6787292
15666 6787292 6890450 7019547 7081331 7046126 6980709 6867196 7001783 7135437 7124520 7039022
15656 7039022 6972620 6972636 6968259 7030273 7013503 6888648 6897285 6889324 6923340 6895816 6857302 6849431
$$ packed form
15732F936741j0704o953N2276J4756k2421L8812k0392r0093L5965n0639q0604
15721F796744m9327K5458J16852l861l0718M8038J21036j3547n0610K6062J18115
15710G104242J70585J7712j25757n2938q9705o3757l4289N3458K2545J4752J4013
15699G030861O1217K6169J0014R7795R403k7490j21245o3965M4749J14406o1956
15688G119958j51024o7764Q3688k4688m1038N4075Q3315R8598M7166n2884k3512
15677G125890j8477J1589L2846n9609m4312m0487n7080q1312n3872M2788p0672
15666F787292J03158J29097O1784l5205o5417j13513J34587J33654j0917q5498
15656G039022o6402J6m377O2014j6770j24855Q637p961L4016k7524l8514p871
$$ plain form
15644 6849431 6836161 6850409 6918582 7013979 7039532 6930895 6875541 6872065 6935346 6971282 7031995
15633 7031995 7054976 6999888 7038928 7051289 7041941 6931501 6927277 6873126 6880952 6840622 6847888 6775791
15621 6775791 6732433 6714858 6622668 6691556 6780029 6771591 6788901 6766230 6811926 6890023 6945993
15610 6945993 6747048 6584198 6654907 6807175 6899146 6855277 6837440 6776980 6817545 6850728 6731336
15599 6731336 6667896 6666947 6714685 6746984 6639621 6603937 6654026 6695863 6690672 6760298 6808775 6761107
15587 6761107 6716990 6757476 6783432 6833550 6831472 6714452 6634259 6659762 6698231 6711550 6701533
15576 6701533 6676713 6668149 6619658 6638758 6632366 6605311 6664082 6584887 6554838 6512342 6496999 6574755
15564 6574755 6604698 6503998 6452339 6556360 6565191 6503979 6465124 6521980 6545926 6426854 6427859
$$ packed form
15644F849431j3270J4248O8173R5397K5553j08637n5354l476O3281L5936O0713
15633G031995K2981n5088L9040J2361r348j10440m224n4151P826m0330P266p2097
15621F775791m3358j7575r2190O8888Q8473q438J7310k2671M5696P8097N5970
15610F945993j98945j62850P0709J52268R1971m3869j7837o0460M0565L3183j19392
15599F731336o3440r49M7738L2299j07363l5684N0089M1837n191O9626M8477m7668
15587F761107m4117M0486K5956N0118k078j17020q0193K5503L8469J3319j0017
15576F701533k4820q564m8491J9100o392k7055N8771p9195l0049m2496j5343P7756
15564F574755K9943j00700n1659J04021Q831o1212l8855N6856K3946j19072J005
$$ plain form
15553 6427859 6517059 6488374 6477146 6486867 6452851 6433293 6376088 6422366 6434984 6455603 6355838
15542 6355838 6313967 6404328 6429099 6378656 6253851 6269638 6243546 6342347 6366500 6305709 6344041
15531 6344041 6370828 6444349 6437380 6402343 6300227 6234715 6229703 6185176 6114795 6060561 6092362
15520 6092362 6069959 6117168 6172462 6171555 6128066 6066501 6101662 6128654 5973715 5802783 5821617
15509 5821617 5904788 5933036 6020803 6008537 6002694 5921200 5987570 5981218 5913311 5891447 5991378 5995634
15497 5995634 5873557 5840018 5740150 5699552 5606226 5638053 5768127 5832998 5850833 5867524 5830390
15486 5830390 5797781 5820099 5843205 5866410 5808046 5735679 5691296 5694238 5650741 5615113 5588660
15475 5588660 5519080 5541560 5696139 5694055 5641775 5599275 5588919 5667587 5568189 5542476 5543981
$$ packed form
15553F427859Q9200k8685j1228R721l4016j9558n7205M6278J2618K0619r9765
15542F355838m1871R0361K4771n0443j24805J5787k6092R8801K4153o0791L8332
15531F344041K6787P3521o969l5037j02116o5512n012m4527p0381n4234L1801
15520F092362k2403M7209N5294r07m3489o1565L5161K6992j54939j70932J8834
15509E821617Q3171K8248Q7767j2266n843q1494O6370o352o7907k1864R9931M256
15497E995634j22077l3539r9868m0598r3326L1827J30074O4871J7835J6691l7134
15486E830390l2609K2318K3106K3205n8364p2367m4383K942m3497l5628k6453
15475E588660o9580K2480J54579k084n2280m2500j0356P8668r9398k5713J505
$$ plain form
15464 5543981 5469207 5405508 5422907 5401429 5474344 5493103 5448101 5403748 5397768 5357029 5312654
15453 5312654 5373642 5461760 5490018 5407280 5336059 5331266 5340237 5382471 5344537 5310023 5308903 5338185
15441 5338185 5235881 5179537 5153180 5245277 5325862 5273844 5193182 5172975 5173065 5090291 5067118 5151177
15429 5151177 5216987 5140219 5014395 4855134 4960555 5004545 5143597 5122518 5034881 4990071
15419 4990071 4981668 4950717 5004526 5050034 5026236 5016674 4952188 4882579 4893453 4818474 4841331 4808250
15407 4808250 4772134 4731578 4751750 4813607 4821154 4764598 4709336 4708538 4706411 4643025 4754381 4842232
15395 4842232 4904648 4913665 4810947 4763161 4790821 4766977 4740531 4732907 4599575 4607973 4510895
15384 4510895 4536958 4646815 4749923 4806342 4719936 4601450 4616056 4654388 4768133 4738338
$$ packed form
15464E543981p4774o3699J7399k1478P2915J8759m5002m4353n980m0739m4375
15453E312654O0988Q8118K8258q2738p1221m793Q971M2234l7934l4514j120K9282
15441E338185j02304n6344k6357R2097Q0585n2018q0662k0207R0q2774k3173Q4059
15429E151177O5810p6768j25824j59261J05421M3990J39052k1079q7637m4810
15419D990071q403l0951N3809M5508k3798r562o4486o9609J0874p4979K2857l3081
15407D808250l6116m0556K0172O1857P547n6556n5262p98k127o3386J11356Q7851
15395D842232O2416R017j02718m7786K7660k3844k6446p624j33332Q398r7078
15384D510895K6063J09857J03108N6419q6406j18486J4606L8332J13745k9795
$$ plain form
15374 4738338 4661334 4602692 4656319 4654282 4507756 4611932 4691683 4661815 4523687 4429042 4346799
15363 4346799 4345223 4436735 4387430 4373706 4345119 4472152 4526118 4522326 4451775 4386664 4388424 4343573
15351 4343573 4366346 4309626 4228967 4140613 4157601 4113193 4113247 4014395 4024348 4113007 4076868 3987632
15339 3987632 3951462 3989170 4088150 4056852 3941205 3865147 3939910 3960194 4038157 4091079 4090041
15328 4090041 4141977 4123447 4135109 4067114 4011184 3955716 4020770 4059703 4083823 4072017 4058714
15317 4058714 4107127 4043343 3983809 3933305 3940691 4015438 3967655 3851394 3780859 3723064 3717240
15306 3717240 3718503 3751703 3759659 3816014 3859982 3854124 3817466 3833598 3766795 3669402 3740668 3763693
15294 3763693 3702664 3732886 3633549 3565651 3629932 3660317 3608282 3636353 3721480 3681755 3594918
$$ packed form
15374D738338p7004n8642N3627k037j46526J04176P9751k9868j38128r4645q2243
15363D346799j576R1512m9305j3724k8587J27033N3966l792p0551o5111J760m4851
15351D343573K2773n6720q0659q8354J6988m4408N4r8852R953Q8659l6139q9236
15339C987632l6170L7708R8980l1298j15647p6058P4763K0284P7963N2922j038
15328D090041N1936j8530J1662o7995n5930n5468O5054L8933K4120j1806j3303
15317D058714M8413o3784n9534n0504P386P4747m7783j16261p0535n7795n824
15306C717240J263L3200P956N6355M3968n858l6658J6132o6803r7393P1266K3025
15294C763693o1029L0222r9337o7898O4281L0385n2035K8071Q5127l9725q6837
$$ plain form
15283 3594918 3526164 3488803 3451014 3530197 3534031 3459923 3431299 3487385 3466505 3478159 3535944
15272 3535944 3642464 3576618 3505045 3622918 3624554 3455465 3426217 3452329 3452760 3475171 3460618
15261 3460618 3433294 3422999 3365494 3347402 3480302 3549884 3489518 3421536 3408893 3339417 3245602
15250 3245602 3261186 3322383 3368434 3393996 3419581 3286175 3200905 3032020 2973619 2936490 2962111
15239 2962111 3048936 3106264 3155971 3180326 3229390 3247523 3262417 3266931 3126849 3041859 3032610
15228 3032610 3016290 3029415 3107027 3104203 3142960 3184645 3119818 3128670 3063837 2961317 2956670 2888250
15216 2888250 2869595 2929523 2922193 2987053 3052979 3086645 2926572 2876731 2861897 2859852 2801043
15205 2801043 2804214 2821274 2836795 2805997 2735638 2782973 2696749 2674736 2670623 2634257 2635441 2681131
$$ packed form
15283C594918o8754l7361l7789P9183L834p4108k8624N6086k0880J1654N7785
15272C535944J06520o5846p1573J17873J636j69089k9248K6112M31K2411j4553
15261C460618k7324j0295n7505j8092J32900O9582o0366o7982j2643o9476r3815
15250C245602J5584O1197M6051K5562K5585j33406q5270j68885n8401l7129K5621
15239B962111Q6825N7328M9707K4355M9064J8133J4894M514j40082q4990r249
15228C032610j6320J3125P7612k824L8757M1685o4827Q852o4833j02520m647o8420
15216B888250j8655N9928p330O4860O5926L3666j60073m9841j4834k045n8809
15205B801043L171J7060J5521l0798p0359M7335q6224k2013m113l6366J184M5690
$$ plain form
15193 2681131 2695267 2736687 2800384 2806539 2642230 2552200 2596397 2629299 2703085 2835983 2800083
15182 2800083 2673949 2698997 2684299 2725800 2706119 2589271 2557626 2570319 2545537 2640892 2781928
15171 2781928 2781177 2704389 2646847 2688708 2772888 2689225 2533162 2648666 2752887 2719944 2745994
15160 2745994 2607102 2462115 2547710 2638212 2645743 2691183 2692398 2518969 2529587 2631140 2572984
15149 2572984 2462605 2426009 2425092 2423270 2476046 2359479 2267281 2420344 2502490 2567850 2657882
15138 2657882 2670364 2693401 2775102 2903212 2987484 3050503 3175749 3142662 3241851 3268384 3189181
15127 3189181 2995638 2778857 2748299 2723374 2739321 2830881 2963073 3118453 3186754 3221979
15117 3221979 3258035 3336935 3202774 2940709 2793195 2626795 2459010 2449110 2517552 2404200
$$ packed form
15193B681131J4136M1420O3697O155j64309r0030M4197L2902P3786J32898l5900
15182B800083j26134K5048j4698M1501j9681j16848l1645J2693k4782R5355J41036
15171B781928p51p6788n7542M1861Q4180q3663j56063J15504J04221l2943K6050
15160B745994j38892j44987Q5595R0502P531M5440J215j73429J0618J01553n8156
15149B572984j10379l6596r17j822N2776j16567r2198J53063Q2146O5360R0032
15138B657882J2482K3037Q1701J28110Q4272O3019J25246l3087R9189K6533p9203
15127C189181j93543k16781l0558k4925J5947R1560J32192J55380O8301L5225
15117C221979L6056P8900j34161k62065j47514j66400j67785r900O8442j13352
$$ plain form
15107 2404200 2325739 2284587 2261266 2205745 2166227 2219601 2286882 2271681 2182247 2178816 2149318
15096 2149318 2131891 2190052 2142514 2151395 2198491 2124168 2173102 2217057 2172499 2203379 2156365
15085 2156365 2079908 2106664 2087232 2101502 2214219 2218915 2109070 2035037 2006446 1920804 1842251
15074 1842251 1865717 1942385 1888831 1917486 1873694 1861357 1894876 1928864 1978979 1934198 1863200
15063 1863200 1891066 1963849 1920503 1956698 2015686 1985104 1909179 1855729 1781458 1746739 1800799
15052 1800799 1934592 1983294 1879033 1795184 1859695 1823724 1790434 1742228 1720094 1824688 1869212
15041 1869212 1792601 1813455 1816268 1706853 1605182 1609494 1708729 1747723 1691347 1767374 1841781
15030 1841781 1793345 1734826 1669233 1602970 1593179 1541232 1546637 1665498 1718378 1866841 1807598
$$ packed form
15107B404200p8461m1152k3321n5521l9518N3374O7281j5201q9434l431k9498
15096B149318j7427N8161m7538Q881M7096p4323M8934M3955m4558L0880m7014
15085B156365p6457K6756j9432J4270J12717M696j09845p4033k8591q5642p8553
15074A842251K3466P6668n3554K8655m3792j2337L3519L3988N0115m4781p0998
15063A863200K7866P2783m3346L6195N8988l0582p5925n3450p4271l4719N4060
15052A800799J33793M8702j04261q3849O4511l5971l3290m8206k2134J04594M4524
15041A869212p6611K0854K813j09415j01671M312R9235L8994n6376P6027P4407
15030A841781m8436n8519o5593o6263r791n1947N405J18861N2880J48463n9243
$$ plain form
15019 1807598 1785152 1785519 1707210 1682990 1718882 1697966 1746257 1794876 1690339 1704931 1754238
15008 1754238 1622993 1573998 1640111 1575269 1459137 1540947 1759586 1812346 1740028 1724422 1658899
14997 1658899 1620855 1593266 1606818 1568202 1525146 1531389 1538686 1588188 1603712 1669873 1720948 1711827
14985 1711827 1560620 1553633 1673808 1703294 1754364 1687480 1642815 1679398 1660440 1571541 1468433
14974 1468433 1306988 1326728 1401417 1494243 1541459 1498045 1561271 1565858 1606805 1610508 1630819
14963 1630819 1652404 1685536 1640286 1624459 1495371 1425154 1412260 1514600 1526694 1466197 1579814
14952 1579814 1661148 1591989 1548578 1390425 1291273 1378596 1374082 1366460 1316568 1255319 1333884
14941 1333884 1347530 1249005 1273607 1437478 1516644 1535114 1491000 1433643 1427591 1388610 1416978
$$ packed form
15019A807598k2446L67p8309k4220L5892k0916M8291M8619j04537J4592M9307
15008A754238j31245m8995O6113o4842j16132Q1810K18639N2760p2318j5606o5523
14997A658899l8044k7589J3552l8616m3056O243P297M9502J5524O6161N1075r121
14985A711827j51207o987J20175K9486N1070o6884m4665L6583j8958q8899j03108
14974A468433j61445J9740P4689R2826M7216m3414O3226M587M0947L703K0311
14963A630819K1585L3132m5250j5827j29088p0217j2894J02340J2094o0497J13617
14952A579814Q1334o9159m3411j58153r9152Q7323m514p622m9892o1249P8565
14941A333884J3646r8525K4602J63871P9166J8470m4114n7357o052l8981K8368
$$ plain form
14930 1416978 1313735 1241095 1302715 1393182 1437790 1335851 1297374 1309254 1412535 1510825 1467913
14919 1467913 1432634 1437211 1456671 1432707 1448260 1389985 1361228 1298353 1263671 1302562 1358594
14908 1358594 1384058 1404747 1231181 1212078 1324937 1320465 1277524 1315636 1333569 1314273 1277208
14897 1277208 1216846 1251667 1307735 1362864 1285627 1194011 1102513 1090744 1174443 1205792 1226800
14886 1226800 1247678 1253273 1128193 1050205 1093077 1055819 1142857 1139333 1135337 1083408 1080768 1110671
14874 1110671 1126445 1134316 1237758 1251610 1267594 1321493 1279159 1258418 1192877 1096786 1084721
14863 1084721 1156748 1189251 1188831 1168229 1178362 1123699 1088792 1049349 1042381 1057658 1082963 1088067
14851 1088067 1131474 1130357 1203380 1152109 966637 1053443 1116168 1216442 1242203 1216543 1176468
$$ packed form
14930A416978j03243p2640O1620R0467M4608j01939l8477J1880J03281R8290m2912
14919A467913l5279M577J9460k3964J5553n8275k8757o2875l4682L8891N6032
14908A358594K5464K0689j73566j9103J12859m472m2941L8112J7933j9296l7065
14897A277208o0362L4821N6068N5129p7237r1616r1498j1769Q3699L1349K1008
14886A226800K0878N595j25080p7988M2872l7258Q7038l524l996n1929k640K9903
14874A110671J5774P871J03442J3852J5984N3899m2334k0741o5541r6091j2065
14863A084721P2027L2503m20k0602J0133n4663l4907l9443o968J5277K5305N104
14851A088067M3407j117P3023n1271j85472Q6806O2725J00274K5761k5660m0075
$$ plain form
14840 1176468 1141992 1151827 1107272 1116172 1037459 1044108 1118318 1129601 1173028 1133904 1123152 1025751
14828 1025751 956718 962728 981811 988765 976612 1000518 1083103 1068981 1171689 1166440 1116402 934575
14816 934575 873779 891782 830063 873442 855490 819772 810422 804717 766204 756965 778702 879438
14804 879438 905493 929301 941848 967137 1023271 1061693 1084648 1164442 1160291 1044010 1037729 986102
14792 986102 953759 977208 1010709 1029444 1120326 1143155 1069153 1019426 960755 881074 943811
14781 943811 1080781 1119811 1040773 1027758 934166 891949 877529 858757 851421 890886 941375
14770 941375 900828 902385 888755 912230 972048 958045 838898 748892 751866 774359 895736
14759 895736 956610 889487 758248 764187 675748 744856 870456 879165 872126 951069 917961 879198
$$ packed form
14840A176468l4476R835m4555Q900p8713O649P4210J1283M3427l9124j0752r7401
14828A025751o9033O010J9083O954j2153K3906Q2585j4122J02708n249n0038j81827
14816I34575o0796J8003o1719M3379j7952l5718r350n705l8513r239K1737J00736
14804H79438K6055K3808J2547K5289N6134L8422K2955P9794m151j16281o281n1627
14792I86102l2343K3449L3501J8735R0882K2829p4002m9727n8671p9681O2737
14781I43811J36970L9030p9038j3015r3592m2217j4420j8772p336L9465N0489
14770I41375m0547J557j3630K3475N9818j4003j19147r0006K974K2493J21377
14759H95736O0874o7123j31239N939q8439O9108J25600Q709p039P8943l3108l8763
$$ plain form
14747 879198 819783 897944 1012503 1024722 832649 832785 894452 927164 909900 909761 868570 903661
14735 903661 957162 826437 688423 795941 884362 857275 916153 925227 842446 738247 768905
14724 768905 762839 714002 896656 885247 827486 846509 908615 904532 895848 825198 638205 556731
14712 556731 625653 604230 708944 786813 685454 674804 703723 714177 675735 775866 816607
14701 816607 842015 837139 770318 590183 580625 690276 629629 656042 699454 716212 733236
14690 733236 716036 730594 793118 775114 770038 754322 723327 654182 660915 664000 681767 670619
14678 670619 722246 726483 673458 536028 449715 471883 639000 569540 527996 618223 688852
14667 688852 676413 680296 647174 694533 786184 760084 734013 654169 567269 557273 604042 638155
$$ packed form
14747H79198n9415P8161J14559J2219j92073J36O1667L2712j7264j39m1191L5091
14735I03661N3501j30725j38014J07518Q8421k7087N8878R074q2781j04199L0658
14724G68905o066m8837J82654j1409n7761J9023O2106m083q684p0650j86993q1474
14712E56731O8922k1423J04714P7869j01359j0650K8919J0454l8442J00131M0741
14701H16607K5408m876o6821j80135r558J09651o0647K6413M3412J6758J7024
14690G33236j7200J4558O2524j8004n076j5716l0995o9145O733L085J7767j1148
14678F70619N1627M237n3025j37430q6313K2168J67117o9460m1544R0227P0629
14667F88852j2439L883l3122M7359R1651k6100k6071p9844q6900r996M6769L4113
$$ plain form
14655 638155 713802 775240 796471 695362 625810 723836 714995 616568 561728 531088 508871
14644 508871 612613 632403 541381 638789 698317 631815 589342 676683 687439 602874 522815
14633 522815 518304 545791 572917 512284 477613 606068 721359 623801 579098 613760 615739
14622 615739 639205 634082 698575 722500 612680 533178 606497 726277 729463 756096 613095
14611 613095 475539 459401 465759 463305 442064 537956 672205 680508 631697 664250 597571 614798
14599 614798 699053 636424 634245 602387 548931 555645 551499 498998 465001 474729 499040 519148
14587 519148 579137 584917 455448 430500 512842 666953 715641 573535 519894 530494 555740
14576 555740 557511 566252 501128 487755 453986 538977 554059 603041 590685 535125 524315 443269
$$ packed form
14655F38155P5647O1438K1231j01109o9552R8026q841r8427n4840l0640k2217
14644E08871J03742J9790r1022R7408N9528o6502m2473Q7341J0756q4565q0059
14633E22815m511K7487K7126o0633l4671J28455J15291r7558m4703L4662J979
14622F15739K3466n123O4493K3925j09820p9502P3319J19780L186K6633j43001
14611F13095j37556j6138O358k454k1241R5892J34249Q303m8811L2553o6679J7227
14599F14798Q4255o2629k179l1858n3456O714m146n2501l3997R728K4311K0108
14587E19148N9989N780j29469k4948Q2342J54111M8688j42106n3641J0600K5246
14576E55740J771Q741o5124j3373l3769Q4991J5082M8982j2356n5560j0810q1046
$$ plain form
14564 443269 453805 426831 442723 549473 491426 525577 524112 463851 407150 470112 419339
14553 419339 369627 432312 466046 579109 651845 666888 595337 563170 598232 580818 529139
14542 529139 435437 409918 423991 452488 493986 491192 442989 378689 397870 459476 427434 441558
14530 441558 441791 451047 502298 579654 569299 506134 493787 424955 343925 363845 459409 494200
14518 494200 382682 408746 473352 423534 469395 459482 431240 505065 543524 562098 516855
14507 516855 514792 585704 599851 510835 453575 382327 301275 290960 408072 481268 452587
14496 452587 489732 553579 517312 401946 360805 381862 329917 322068 339829 291985 407164
14485 407164 451457 482076 481356 441824 438510 421454 416558 449195 487734 471168 430400 303422
$$ packed form
14564D43269J0536k6974J5892J06750n8047L4151j465o0261n6701O2962n0773
14553D19339m9712O2685L3734J13063P2736J5043p1551l2167L5062j7414n1679
14542E29139r3702k5519J4073K8497M1498k794m8203o4300J9181O1606l2042J4124
14530D41558K33R256N1251P7356j0355o3165j2347o8832q1030J9920R5564L4791
14518D94200j11518K6064O4606m9818M5861r913k8242P3825L8459J8574m5243
14507E16855k063P0912J4147q9016n7260p1248q1052j0315J17112P3196k8681
14496D52587L7145O3847l6267j15366m1141K1057n1945p849J7761m7844J15179
14485D07164M4293L0619p20l9532l314j7056m896L2637L8539j6566m0768j26978
$$ plain form
14473 303422 298455 342865 386582 306129 330266 396964 413487 429406 377566 310761 379808 421542
14461 421542 376117 351550 378641 327584 282794 277296 293314 246565 331765 323233 209558 97328
14449 97328 53473 110127 355986 466041 426557 347329 296549 303599 326856 380550 396533
14438 396533 311810 215531 210054 250590 228438 218763 178119 211475 253581 254877 218538 325143
14426 325143 429283 378638 301883 265956 260945 273239 291365 291194 284653 186876 146623 153680
14414 153680 231732 308149 275049 296621 360206 388749 390288 318572 232868 169725 203032 224346
14402 224346 340144 409962 364745 304233 313137 342952 351284 311849 479771 487291 405111 326749
14390 326749 376040 388143 408896 475192 529289 460936 514373 515111 508586 522841 517927 496730
$$ packed form
14473C03422m967M4410M3717q0453K4137O6698J6523J5919n1840o6805O9047M1734
14461D21542m5425k4567K7091n1057m4790n498J6018m6749Q5200q532j13675j12230
14449I7328m3855N6654K45859J10055l9484p9228n0780P050K3257N3694J5983
14438C96533q4723r6279n477M0536k2152r675m0644L3356M2106J296l6339J06605
14426C25143J04140n0645p6755l5927n011J2294J8126j71o541r7777m0253P057
14414A53680P8052P6417l3100K1572O3585K8543J539p1716q5704o3143L3307K1314
14402B24346J15798O9818m5217o0512Q904K9815Q332l9435J67922P520q2180p8362
14390C26749M9291J2103K0753O6296N4097o8353N3437P38o525J4255m914k1197
$$ plain form
14378 496730 452900 387396 322462 351946 326289 235207 261805 453873 488791 449055 456988
14367 456988 342617 225614 216339 328000 459691 478736 280055 46730 42979 107911 63115
14356 63115 144076 96067 245390 400851 382580 241864 163107 146828 234604 322087 261045
14345 261045 205821 289041 360393 305146 119186 51517 123907 803 -91975 26692 56787
14334 56787 52057 23880 129743 154541 196890 242673 259993 247781 314013 274127 276862 230104
14322 230104 139511 71660 134667 198748 217765 207109 165858 189526 190582 122704 162468 201894
14310 201894 203372 314829 274643 198244 122711 162178 242499 264917 207321 137581 161016
14299 161016 209945 223978 225248 237647 252223 338907 326272 243616 93616 107993 205854
$$ packed form
14378D96730m3830o5504o4934K9484k5657r1082K6598J92068L4918l9736P933
14367D56988j14371j17003r275J11661J31691J9045j98681k33325l751O4932m4796
14356F3115Q0961m8009J49323J55461j8271j40716p8757j6279Q7776Q7483o1042
14345B61045n5224Q3220P1352n5247j85960o7669P2390j23104r2778J18667L0095
14334E6787m730k8177J05863K4798M2349M5783J7320j2212O6232l9886K735m6758
14322B30104r0593o7851O3007O4081J9017j0656m1251K3668J056o7878L9764L9426
14310B01894J478J11457m0186p6399p5533L9467Q0321K2418n7596o9740K3435
14299A61016M8929J4033J270J2399J4576Q6684j2635q2656j50000J4377R7861
$$ plain form
14288 205854 288667 346568 343451 268397 203634 175753 136960 151286 193953 244125 258664 198356
14276 198356 100928 67121 37514 131968 156405 226018 285241 272663 244235 185709 160535
14265 160535 137558 100653 119605 169918 199025 223950 201637 245497 303815 391341 353658
14254 353658 252511 246477 223137 165094 223920 262891 276695 210984 176404 123245 43267
14243 43267 176784 342437 330871 334501 301437 362350 390710 325541 317963 334007 241391 158519
14231 158519 211934 196815 197745 167484 137282 187356 298439 310219 265263 232064 208359 147044
14219 147044 176996 189600 76322 162433 138845 98584 163690 228113 221051 213741 191414 289670
14207 289670 335548 219843 256438 336995 313755 189486 117905 83489 106073 248429 253896
$$ packed form
14288B05854Q2813N7901l117p5054o4763k7881l8793J4326M2667N0172J4539o0308
14276A98356r7428l3807k9607R4454K4437O9613N9223j2578k8428n8526k5174
14265A60535k2977l6905J8952N0313K9107K4925k2313M3860N8318Q7526l7683
14254C53658j01147o034k3340n8043N8826L8971J3804o5711l4580n3159p9978
14243D3267J33517J65653j1566L630l3064O0913K8360o5169p578J6044r2616q2872
14231A58519N3415j5119R30l0261l0202N0074J11083J1780m4956l3199k3705o1315
14219A47044K9952J2604j13278Q6111k3588m0261O5106O4423p062p310k2327R8256
14207B89670M5878j15705L6595Q0557k3240j24269p1581l4416K2584J42356N467
$$ plain form
14196 253896 162085 87115 114875 185309 186622 192969 150264 53777 6721 116765 201933 132241
14184 132241 121051 126301 246317 322539 259487 281516 285679 243212 131789 16540 82496
14173 82496 191000 307810 276171 198360 109985 140871 214037 160434 88946 159490 177349
14162 177349 147473 43378 102931 243358 171931 25438 43349 178593 210689 165399 121102
14151 121102 199475 241944 175225 87087 125242 154582 213677 360236 388060 333653 276675
14140 276675 246508 250221 124516 125984 128943 97775 81663 4589 88308 198145 202062 249266
14128 249266 150171 188724 168960 156368 70163 -40711 57700 136772 154972 156152 200866
14117 200866 294366 351362 246797 139201 64176 20009 118450 168125 138275 99796 159074
$$ packed form
14196B53896r1811p4970K7760P0434J313O347m2705r6487m7056J10044Q5168o9692
14184A32241j1190N250J20016P6222o3052K2029M163m2467j11423j15249O5956
14173H2496J08504J16810l1639p7811q8375L0886P3166n3603p1488P0544J7859
14162A77349k9876j04095N9553J40427p1427j46493J7911J35244L2096m5290m4297
14151A21102P8373M2469o6719q8138L8155K9340N9095J46559K7824n4407n6978
14140B76675l0167L713j25705J468K959l1168j6112p7074Q3719J09837L917M7204
14128B49266r9095L8553j9764j2592q6205j10874R8411P9072J8200J180M4714
14117B00866R3500N6996j04565j07596p5025m4167R8441M9675k9850l8479N9278
$$ plain form
14106 159074 208218 264100 235516 224285 66284 -2885 -19891 72056 137765 168455 251080
14095 251080 279783 188377 42737 103883 165214 228542 212741 229015 248418 278598 258944
14084 258944 179712 134194 89111 43332 102708 53996 95264 106012 154766 185952 156942
14073 156942 105936 17090 -92871 -56297 46603 17968 -14580 30540 147062 109812 101018
14062 101018 180624 227410 249338 164930 89795 158858 226511 130676 125262 121492 93646 177408
14050 177408 162846 148755 202353 232325 279363 171583 46329 75159 140436 98355 105347
14039 105347 131665 157963 60002 93120 144553 150877 210043 259767 280761 197251 176293 203156
14027 203156 275659 188660 85444 131935 144831 82278 154676 340224 359862 219786 215712
$$ packed form
14106A59074M9144N5882k8584j1231j58001o9169j7006R1947O5709L0690Q2625
14095B51080K8703r1406j45640O1146O1331O3328j5801J6274J9403L0180j9654
14084B58944p9232m5518m5083m5779N9376m8712M1268J0748M8754L1186k9010
14073A56942n1006q8846j09961L6574J02900k8635l2548M5120J16522l7250q794
14062A01018P9606M6786K1928q4408p5135O9063O7653r5835n414l770k7846Q3762
14050A77408j4562j4091N3598K9972M7038j07780j25254K8830O5277m2081O992
14039A05347K6318K6298r7961L3118N1433O324N9166M9724K0994q3510k0958K6863
14027B03156P2503q6999j03216M6491J2896o2553P2398J85548J9638j40076m074
$$ plain form
14016 215712 242934 173242 145422 126902 81623 58463 53116 108738 84651 74097 159238 155943
14004 155943 333302 345523 306205 245269 148271 65418 2452 64463 44164 31717 76059
13993 76059 198434 216894 210037 198018 144672 155730 86072 72314 179325 155693 78452
13982 78452 117328 154954 213893 315445 282409 276617 203313 198143 275158 269699 229914 178593
13970 178593 33842 -22746 -44664 22877 1487 -33383 -53369 -57080 30664 111784 113798 193777
13958 193777 204650 95036 71522 51860 50539 60929 -20578 -44370 -13352 -45985 -7549
13947 -7549 55740 43455 8629 34734 34333 78313 177942 214989 219224 257737 182287 32662
13935 32662 -91249 -137868 -42259 82729 102603 153990 132563 62240 -8326 -20927 12758
$$ packed form
14016B15712K7222o9692k7820j8520m5279k3160n347N5622k4087j0554Q5141l295
14004A55943J77359J2221l9318o0936r6998q2853o2966O2011k0299j2447M4342
13993G6059J22375J8460o857j2019n3346J1058o9658j3758J07011k3632p7241
13982G8452L8876L7626N8939J01552l3036n792p3304n170P7015n459l9785n1321
13970A78593j44751n6588k1918O7541k1390l4870j9986l711Q7744Q1120K014P9979
13958A93777J0873j09614k3514j9662j321J0390q1507k3792L1018l2633L8436
13947g549O3289j2285l4826K6105m01M3980R9629L7047M235L8513p5450j49625
13935C2662j23911m6619R5609J24988J9874N1387k1427p0323p0566j2601L3685
$$ plain form
13924 12758 115109 132196 142993 45867 56437 109146 156682 181783 63697 9073 73705
13913 73705 129360 50506 61607 70252 77859 114632 165292 121582 41100 49593 81250 177526
13901 177526 228242 130994 67878 19996 -8111 8364 139726 170891 87964 81639 129301
13890 129301 74248 149818 188009 192575 167550 53980 25591 -25802 60399 -14031 54195
13879 54195 66641 87635 143912 143447 179644 221929 138095 127776 151178 172098 85178 -83554
13867 -83554 -100245 -62462 57462 54482 59382 99328 172509 241295 284642 284538 224447 132967
13855 132967 66939 63440 117915 237847 222218 141561 89055 58095 2039 9458 188089
13844 188089 239125 227427 142561 101283 32231 7124 53940 49509 92220 -37837 21376
$$ packed form
13924A2758J02351J7087J0797r7126J0570N2709M7536K5101j18086n4624O4632
13913G3705N5655p8854J1101Q645P607L6773N0660m3710q0482Q493L1657R6276
13901A77526N0716r7248o3116m7882k8107J6475J31362L1165q2927o325M7662
13890A29301n5053P5570L8191M566k5025j13570k8389n1393Q6201p4430O8226
13879E4195J2446K0994N6277m65L6197M2285q3834j0319K3402K0920q6920j68732
13867h3554j6691L7783J19924k980M900L9946P3181O8786M3347j04o0091r1480
13855A32967o6028l499N4475J19932j5629q0657n2506l0960n6056P419J78631
13844A88089N1036j1698q4866m1278o9052k5107M6816m431M2711j30057N9213
$$ plain form
13833 21376 90175 108563 126323 158689 45671 36923 48624 101133 138103 122800 100663 206303
13821 206303 200594 210272 179678 130492 119401 86670 20720 -32153 37204 76088 86726 48653
13809 48653 -49030 -72260 37574 -2398 -36992 -49012 -91150 -123020 -56265 46183 29425
13798 29425 -1574 -77375 16573 105627 223096 198316 213117 163906 108322 125328 171308
13787 171308 242328 240012 254293 122517 104990 90847 129907 118868 109102 28874 9170 32474
13775 32474 -25325 -32735 -99854 -40614 -51225 8512 -50935 -85838 -146700 -115657 -38833 -119139
13763 -119139 -182823 -49130 103890 102893 25053 25464 -50373 -78115 -38677 15600 42607 -48051
13751 -48051 -26449 96431 48690 45331 150456 133454 35603 42051 56598 4288 75434 88107
$$ packed form
13833B1376O8799J8388J7760L2366j13018q748J1701N2509L6970j5303k2137J05640
13821B06303n709R678l0594m9186j1091l2731o5950n2873O9357L8884J0638l8073
13809D8653r7683k3230J09834l9972l4594j2020m2138l1870O6755J02448j6758
13798B9425l0999p5801R3948Q9054J17469k4780J4801m9211n5584J7006M5980
13787A71308P1020k316J4281j31776j7527j4143L9060j1039r766q0228j9704K3304
13775C2474n7799p410o7119N9240j0611N9737n9447l4903o0862L1043P6824q0306
13763a19139o3684J33693J53020r97p7840M11p5837k7742L9438N4277K7007r0658
13751d8051K1602J22880m7741l359J05125j7002r7851O448J4547n2310P1146J2673
$$ plain form
13739 88107 -21375 -14238 -40553 22221 16353 -91206 -104724 -137306 -120927 -6064 46974
13728 46974 84820 53945 73902 77610 67524 203637 214780 117921 -31000 17702 66859
13717 66859 17084 -35959 30802 176228 244878 174849 69786 41313 50173 29741 24415 64609
13705 64609 51819 27976 -40297 -10925 85926 101928 8014 -86030 -91572 -151320 -114985 -24964
13693 -24964 -60926 -41021 -12736 42803 103619 99799 117298 74249 39516 53842 4024 -188547
13681 -188547 -215859 -118515 -68874 -64628 56348 81921 129289 109389 89039 40634 663
13670 663 71598 94366 -55035 -97625 -57789 -34948 11847 72257 160354 102420 76223 12824
13658 12824 5801 102420 109317 16118 -2345 9500 39272 130841 165717 107987 65783 23976
$$ packed form
13739H8107j09482P137k6315O2774n868j07559j3518l2582J6379J14863N3038
13728D6974L7846l0875J9957L708j0086J36113J1143r6859j48921M8702M9157
13717F6859m9775n3043O6761J45426O8650p0029j05063k8473Q860k0432n326M0194
13705F4609j2790k3843o8273K9372R6851J6002r3914r4044n542n9748L6335R0021
13693b4964l5962J9905K8285N5539O0816l820J7499m3049l4733J4326m9818j92571
13681a88547k7312R7344M9641M246J20976K5573M7368j9900k0350m8405l9971
13670F63P0935K2768j49401m2590L9836K2841M6795O0410Q8097n7934k6197o3399
13658A2824p023R6619O897r3199j8463J1845K9772R1569L4876n7730m2204m1807
$$ plain form
13646 23976 44909 34855 52852 20177 9505 37233 42717 38 116287 89255 65942 91142
13634 91142 2536 -36427 70071 57992 17974 -24054 -97713 -188332 -90783 -4678 23341
13623 23341 1879 68585 52071 16883 56782 41601 -6692 27511 35483 -22271 15628 -4094
13611 -4094 -31319 -23404 -21127 -61978 -13405 -36853 -82107 -11796 -26520 12143 -24880 -34774
13599 -34774 -10112 -13042 67577 43403 36817 64493 -2281 -13142 50821 184580 141210 49170
13587 49170 27790 2479 10734 46063 133067 81386 -20420 21639 -54781 -47210 50375 72656
13575 72656 60690 99910 134735 57980 56340 49111 -19166 -26926 -83949 -196796 -143406 -62787
13563 -62787 -37645 -3757 -43768 20470 61988 21171 989 83967 92765 112785 115029 44662
$$ packed form
13646B3976K0933j0054J7997l2675j0672K7728N484m2679J16249k7032k3313K5200
13634I1142q8606l8963J06498j2079m0018m2028p3659r0619R7549Q6105K8019
13623B3341k1462O6706j6514l5188L9899j5181m8293L4203P972n7754L7899j9722
13611d094k7225P915K277m0851M8573k3448m5254P0311j4724L8663l7023r894
13599c4774K4662k930Q0619k4174o586K7676o6774j0861O3963J33759m3370r2040
13587D9170k1380k5311Q255L5329Q7004n1681j01806M2059p6420P571R7585K2281
13575G2656j1966L9220L4825p6755j640p229o8277p760n7023j12847N3390Q0619
13563f2787K5142L3888m0011O4238M1518m0817k0182Q2978Q798K0020K244p0367
$$ plain form
13551 44662 31096 104934 96818 11561 -59566 -88827 -49066 -103638 -99049 24385 72103 93957
13539 93957 98237 158 -61872 -52654 -21720 50414 89055 107468 74297 102287 85703 17069
13527 17069 -18113 68237 162892 150271 133448 122616 119684 68262 79956 76032 118724 160259
13515 160259 98603 103926 90839 106651 93683 -20727 -28606 27666 -5517 -39967 -29415 -49606
13503 -49606 -27738 17164 62733 84262 73898 108672 241830 195558 103851 54547 -68445
13492 -68445 -25393 76048 126365 69554 2488 -21637 -29355 -116232 -155092 -169358 -150337 -95251
13480 -95251 11624 25099 -102315 -187816 -137597 -54228 -36320 28291 -2819 13783 68645
13469 68645 70977 -30770 -58309 -69016 -146298 -84862 45744 73417 59749 134474 171224
$$ packed form
13551D4662j3566P3838q116q5257p1127k9261L9761n4572M589J23434M7718K1854
13539I3957M280r8079o2030R218L0934P2134L8641J8413l3171K7990j6584o8634
13527A7069l5182Q6350R4655j2621j6823j0832k932n1422J1694l924M2692M1535
13515A60259o1656N323j3087J5812j2968j14410p879N6272l3183l4450J0552k0191
13503d9606K1868M4902M5569K1529j0364L4774J33158m6272r1707m9304j22992
13492f8445M3052J01441N0317n6811o7066k4125p718q6877l8860j4266J9021N5086
13480i5251J06875J3475j27414q5501N0219Q3369J7908O4611l1110J6602N4862
13469F8645K332j01747k7539j0707p7282O1436J30606K7673j3668P4725L6750
$$ plain form
13458 171224 139531 8957 25827 -10467 -12270 32971 128757 202540 240249 178644 93464
13447 93464 93149 147672 87397 -59033 -170304 -209395 -265011 -182768 -47980 40520 131266
13436 131266 207690 113893 170072 158946 131934 10101 -34606 11217 84504 38969 88272
13425 88272 174867 114407 76664 149350 52015 -80416 4463 78362 93438 8041 -68723
13414 -68723 -117234 -255318 -297856 -237470 -136430 67587 143772 83504 9798 20780 23785
13403 23785 73515 99563 28914 819 99394 215818 166305 193951 124623 47272 101921
13392 101921 237578 188155 140039 77453 25790 -144374 -147066 -29797 5224 -39079 -113829
13381 -113829 -126497 -54167 -8448 -19333 -5787 63618 43622 83673 150538 105706 -16618
$$ packed form
13458A71224l1693j30574J6870l6294j803M5241R5786P3783L7709o1605q5180
13447I3464l15N4523o0275j46430j11271l9091n5616Q2243J34788Q8500R0746
13436A31266P6424r3797N6179j1126k7012j21833m4707M5823P3287m5535M9303
13425H8272Q6595o0460l7743P2686r7335j32431Q4879P3899J5076q5397p6764
13414f8723m8511j38084m2538O0386J01040K04017P6185o0268p3706J0982L005
13403B3785M9730K6048p0649k8095R8575J16424m9513K7646o9328p7351N4649
13392A01921J35657m9423m8116o2586n1663j70164k692J17269L5021m4303p4750
13381a13829j2668P2330M5719j0885J3546O9405j9996M0051O6865m4832j22324
$$ plain form
13370 -16618 -12714 -99829 -85770 3598 -18156 -66680 -84156 -53505 -86953 -83671 -34409 39922
13358 39922 66884 116336 59076 75234 140628 167244 100881 21860 31199 15613 37682 165999
13346 165999 123079 76152 65525 -25081 -63532 -115320 -106634 -64448 44219 36898 25591 100827
13334 100827 139827 149113 106671 83515 113977 91421 10692 7636 -7583 -111212 -53338 108178
13322 108178 61140 -60944 -26589 107236 11550 813 23559 28396 82554 128362 55863
13311 55863 75777 112154 45186 -32174 -20602 36388 72151 -92085 -168529 -57873 -50071
13300 -50071 -31161 -13941 78068 211244 276023 240115 213269 150037 203190 175824 145089
13289 145089 136355 196716 253689 151841 135311 113456 53169 139760 192311 132981 29654
$$ packed form
13370a6618L904q7115J4059Q9368k1754m8524j7476L0651l3448L282M9262P4331
13358C9922K6962M9452n7260J6158O5394K6616o6363p9021R339j5586K2069J28317
13346A65999m2920m6927j0627r0606l8451n1788Q686M2186J08667p321j1307P5236
13334A00827L9000R286m2442k3156L0462k2556q0729l056j5219j03629N7874J61516
13322A08178m7038j22084L4355J33825r5686j0737K2746M837N4158M5808p2499
13311E5863J9914L6377o6968p7360J1572N6990L5763j64236p6444J10656P802
13300e0071J8910J7220R2009J33176O4779l5908k6846o3232N3153k7366l0735
13289A45089q734O0361N6973j01848j6530k1855o0287Q6591N2551n9330j03327
$$ plain form
13278 29654 75543 57706 95763 192269 200630 128230 88800 146455 125985 161149 113283 1306
13266 1306 -87720 -61688 5807 1461 64907 91665 102637 100671 69671 73245 -60250 -162892
13254 -162892 -105033 -63110 -67907 10936 142678 137316 136175 191427 135358 108898 -15612 -161355
$$ packed form
13278B9654M5889j7837L8057R6506Q361p2400l9430N7655k0470L5164m7866j11977
13266A306q9026K6032O7495m346O3446K6758J0972j966l1000L574j33495j02642
13254a62892N7859M1923m797P8843J31742n362j141N5252n6069k6460j24510j45743
$$ [...]
##END NTUPLES=NMR SPECTRUM
##END=
