##TITLE=Analysis number 317421
Compound Code cc 14203
Project Code qc-cat
Chemist Name ugmt ltd
##JCAMPDX= 6.0         $$ Bruker NMR JCAMP-DX V2.0
##DATA TYPE= NMR SPECTRUM
##DATA CLASS= NTUPLES
##ORIGIN= Bruker BioSpin GmbH
##OWNER= nmr
$$ XWIN-NMR		Version 3.5
$$ Mon Feb 20 12:39:08 2006 GMT Standard Time (UT+0h)  MAYBRIDGE\nmr@NMR_250MHZ
##.OBSERVE FREQUENCY= 250.131544655141
##.OBSERVE NUCLEUS= ^1H
##.ACQUISITION MODE= SIMULTANEOUS (DQD)
##.ACQUISITION SCHEME= undefined
##.AVERAGES= 16
##.DIGITISER RES= 18
##SPECTROMETER/DATA SYSTEM= dpx250
##.PULSE SEQUENCE= zg30
##.SOLVENT NAME= CDCl3
##.SHIFT REFERENCE= (INTERNAL, CDCl3, 0, 16.522)
##AUDIT TRAIL= $$ (NUMBER, WHEN, WHO, WHERE, WHAT)
$$ ##TITLE= Audit trail, XWIN-NMR		Version 3.5
$$ ##JCAMPDX= 5.01
$$ ##ORIGIN= Bruker BioSpin GmbH
$$ ##OWNER= nmr
$$ C:\u/data/dgb/nmr/ADRS/16310/pdata/1/auditp.txt
$$ ##AUDIT TRAIL=  $$ (NUMBER, WHEN, WHO, WHERE, WHAT)
(   1,<2006-02-20 12:38:41.17 +000>,<MAYBRIDGE\nmr>,<NMR_250MHZ>,
      <created by zg, POWCHK disabled, PULCHK disabled
       configuration hash MD5:
       84 BC 41 DB A1 6E 1D 46 DA 25 12 A5 C1 ED C5 3A
       data hash MD5: 64K
       68 9D 1A F9 2C C9 BE 78 D5 2F 2A 2B 3B 21 F2 66>)
(   2,<2006-02-20 12:38:56.92 +000>,<MAYBRIDGE\nmr>,<NMR_250MHZ>,
      <Start of raw data processing
       ef LB = 0.3 FT_mod = 6 PKNL = 1 SI = 32K 
       data hash MD5: 32K
       0F F3 C0 62 9C B0 AB D9 F9 2F 4B 87 1C E9 57 22>)
(   3,<2006-02-20 12:39:00.31 +000>,<MAYBRIDGE\nmr>,<NMR_250MHZ>,
      <apk 
       data hash MD5: 32K
       7D A3 EF 7C 91 FD FD 63 EF D4 0B 89 7A 7E 21 6D>)
(   4,<2006-02-20 12:39:01.82 +000>,<MAYBRIDGE\nmr>,<NMR_250MHZ>,
      <abs ABSG = 5 
       data hash MD5: 32K
       F6 35 31 C0 04 B7 20 CE 82 35 DC CF C1 9A E2 AD>)
$$ ##END=
$$ 
$$ hash MD5
$$ DD 61 2D 9D FD 13 70 B2 EF DA 00 DF 10 CA 12 CF
##$RELAX= 
##$RELAX= 
##$RELAX= 
##$RELAX= 
##$RELAX= 
##$RELAX= 
##$RELAX= 
$$ Bruker specific parameters
$$ --------------------------
##$DU= <C:\u>
##$EXPNO= 16310
##$NAME= <ADRS>
##$PROCNO= 1
##$TYPE= <nmr>
##$USER= <dgb>
##$AMP= (0..31)
100 100 100 100 100 100 100 100 100 100 100 100 100 100 100 100 100 100 
100 100 100 100 100 100 100 100 100 100 100 100 100 100 
##$AQSEQ= 0
##$AQ_mod= 3
##$AUNM= <au_zg>
##$AUTOPOS= <22 >
##$BF1= 250.13
##$BF2= 250.13
##$BF3= 250.13
##$BF4= 250.13
##$BF5= 500.13
##$BF6= 500.13
##$BF7= 500.13
##$BF8= 500.13
##$BYTORDA= 1
##$CFDGTYP= 0
##$CFRGTYP= 5
##$CHEMSTR= <none>
##$CNST= (0..31)
1 1 145 1 1 1 1 1 1 1 1 1 1 1 1 1 1 1 1 1 1 1 1 1 1 1 1 1 1 1 1 1 
##$CPDPRG= <>
##$CPDPRG1= <>
##$CPDPRG2= <>
##$CPDPRG3= <>
##$CPDPRG4= <mlev>
##$CPDPRG5= <mlev>
##$CPDPRG6= <mlev>
##$CPDPRG7= <mlev>
##$CPDPRG8= <mlev>
##$CPDPRGB= <>
##$CPDPRGT= <>
##$D= (0..31)
0 1 0 0 0 0 0 0 0 0.06 0 0 0 0 0 0 0.0002 0 0 0 0 0 0 0 0 0 0 0 0 0 0 
0 
##$DATE= 1140439120
##$DBL= (0..7)
120 120 120 120 120 120 120 120 
##$DBP= (0..7)
150 150 150 150 150 150 150 150 
##$DBP07= 0
##$DBPNAM0= <>
##$DBPNAM1= <>
##$DBPNAM2= <>
$$ [...]
##$SUBNAM7= <"">
##$SUBNAM8= <"">
##$SUBNAM9= <"">
##$SW= 20.6930455092707
##$SWIBOX= (0..15)
0 0 3 0 0 0 0 0 0 0 0 0 0 0 0 0 
##$SW_h= 5175.983436853
##$TD= 65536
##$TD0= 1
##$TE= 294.16
##$TE2= 300
##$TE3= 300
##$TEG= 300
##$TL= (0..7)
0 120 120 120 120 120 120 120 
##$TP= (0..7)
150 150 150 150 150 150 150 150 
##$TP07= 0
##$TPNAME0= <>
##$TPNAME1= <>
##$TPNAME2= <>
##$TPNAME3= <>
##$TPNAME4= <>
##$TPNAME5= <>
##$TPNAME6= <>
##$TPNAME7= <>
##$TPOAL= (0..7)
0.5 0.5 0.5 0.5 0.5 0.5 0.5 0.5 
##$TPOFFS= (0..7)
0 0 0 0 0 0 0 0 
##$TUNHIN= 0
##$TUNHOUT= 0
##$TUNXOUT= 0
##$USERA1= <user>
##$USERA2= <user>
##$USERA3= <user>
##$USERA4= <user>
##$USERA5= <user>
##$V9= 5
##$VALIST= <valist>
##$VCLIST= <CCCCCCCCCCCCCCC>
##$VD= 0
##$VDLIST= <DDDDDDDDDDDDDDD>
##$VPLIST= <PPPPPPPPPPPPPPP>
##$VTLIST= <TTTTTTTTTTTTTTT>
##$WBST= 1024
##$WBSW= 4
##$XGAIN= (0..3)
0 0 0 0 
##$XL= 0
##$YL= 0
##$YMAX_a= 445983
##$YMIN_a= -469520
##$ZGOPTNS= <>
##$ZL1= 120
##$ZL2= 120
##$ZL3= 120
##$ZL4= 120
##$ABSF1= 16.522
##$ABSF2= -4.171173
##$ABSG= 5
##$ABSL= 3
##$ALPHA= 0
##$AQORDER= 0
##$ASSFAC= 0
##$ASSFACI= 0
##$ASSFACX= 0
##$ASSWID= 0
##$AUNMP= <proc_1d>
##$AZFE= 0.1
##$AZFW= 0.1
##$BCFW= 0
##$BC_mod= 0
##$BYTORDP= 0
##$COROFFS= 0
##$CY= 12.5
##$DATMOD= 1
##$DC= 0
##$DFILT= <>
##$DTYPP= 0
##$F1P= 14.0000005364418
##$F2P= -0.99999901652339
##$FCOR= 0.5
##$FTSIZE= 32768
##$FT_mod= 6
##$GAMMA= 0
##$GB= 0
##$INTBC= 1
##$INTSCL= 1
##$ISEN= 128
##$LB= 0.3
##$LEV0= 0
##$LPBIN= 0
##$MAXI= 10000
##$MC2= 0
##$MEAN= 0
##$ME_mod= 0
##$MI= 0
##$NCOEF= 0
##$NC_proc= -3
##$NLEV= 6
##$NOISF1= 0
##$NOISF2= 0
##$NSP= 0
##$NTH_PI= 0
##$NZP= 0
##$OFFSET= 16.522
##$PC= 1
##$PHC0= 257.5214
##$PHC1= -18.30691
##$PH_mod= 1
##$PKNL= yes
##$PPARMOD= 0
##$PSCAL= 4
##$PSIGN= 0
##$REVERSE= no
##$SF= 250.13
##$SI= 32768
##$SIGF1= 0
##$SIGF2= 0
##$SINO= 400
##$SIOLD= 32768
##$SREGLST= <1H.CDCl3>
##$SSB= 0
##$STSI= 32768
##$STSR= 0
##$SW_p= 5175.98343685301
##$SYMM= 0
##$S_DEV= 0
##$TDeff= 65536
##$TDoff= 0
##$TI= <Analysis number 999999
Compound Code 99
Book Reference 9
Project Code 9>
##$TILT= no
##$TM1= 0
##$TM2= 0
##$TOPLEV= 0
##$USERP1= <user>
##$USERP2= <user>
##$USERP3= <user>
##$USERP4= <user>
##$USERP5= <user>
##$WDW= 1
##$XDIM= 32768
##$YMAX_p= 300209974
##$YMIN_p= -314899
$$ End of Bruker specific parameters
$$ ---------------------------------
##NTUPLES= NMR SPECTRUM
##VAR_NAME=  FREQUENCY,     SPECTRUM/REAL,   SPECTRUM/IMAG
##SYMBOL=    X,             R,               I
##VAR_TYPE=  INDEPENDENT,   DEPENDENT,       DEPENDENT
##VAR_FORM=  AFFN,          ASDF,            ASDF
##VAR_DIM=   32768,         32768,           32768
##UNITS=     HZ,            ARBITRARY UNITS, ARBITRARY UNITS
##FACTOR=    0.157963299565203, 1,           1
##FIRST=     4132.6476996994, 0,             0
##LAST=      -1043.33573715361, 0,           0
##MIN=       -1043.33573715361, -314899,     0
##MAX=       4132.6476996994, 300209974,     0
$$ Real data points
##PAGE= N=1
##DATA TABLE= (X++(R..R)), XYDATA
$$ [...]
28585 -6638 7103 -9406 -19854 26882 66415 60883 6664 32325 49632 -55720 -64850 -51199
28573 -51199 -9309 -23433 -20684 52794 76859 51105 19214 22496 66985 32749 -44050 -50110
28561 -50110 -58140 -45109 -28768 -67 -9428 23405 78549 126444 78093 -8678 -44069 -69438
28549 -69438 -64489 10584 38754 25723 108090 124505 74838 25966 14189 -3602 -8209 -17433
28537 -17433 29981 29925 29957 1347 4557 26441 87240 90662 98879 23132 -17976 19338 -11578
28524 -11578 -61242 -26667 -59817 -67411 -20266 -27121 51844 108923 52671 9410 -15126 -62453
28512 -62453 -35860 -31833 74807 59540 11594 29674 23882 -17956 -20937 11084 79952 59975
28500 59975 33333 63975 11101 33307 38669 90679 34402 39330 56849 55297 25450 47330
28488 47330 74305 34761 -62072 -109362 -83889 -14429 7249 -6201 -37994 -57814 -85294 -64717
28476 -64717 18358 18144 10010 42728 40954 13657 -14681 -33754 -70455 -11394 27339 35804 55915
28463 55915 78781 115096 136874 138341 118486 25000 -18021 6255 28375 11386 34328 51536
28451 51536 26812 -18446 -53963 -14289 -36778 -96356 -91090 -51075 27826 53835 52442 24732
28439 24732 -4811 -36993 -20322 29792 65006 57230 -811 34636 32865 18245 58967 58120
28427 58120 4624 -44298 -43262 -29189 -1862 18346 -48123 -93121 -61456 -32121 -56296 -28042
28415 -28042 32268 -2034 -86059 -107707 -82535 -27731 13035 16027 -7966 -23791 11776 35391
28403 35391 -6018 -40184 -46408 -87176 -26395 -105446 -122485 -69660 -60467 19964 139213 68527
28391 68527 59313 63699 26901 -50312 -11513 -20934 -71103 -76760 -48328 -26695 35639 -39121
28379 -39121 -52362 -92811 -140375 -87134 -86561 -77009 -39460 -32581 -76169 -93125 -11952 -21599 -76258
28366 -76258 -111137 -78675 -1096 -4883 -19242 23085 41629 28131 31280 8944 -2432 -25198
28354 -25198 -29936 22407 -3001 1209 34201 16166 -15282 -14746 -18311 -64583 -96221 -64401 -52324
28341 -52324 -64395 -17168 25819 -6629 -40576 -55844 -49288 -23203 -32347 -71963 -39820 -9411
28329 -9411 29819 75990 85794 29815 -2926 47021 116945 77487 20272 -7277 -39288 20704
28317 20704 62385 25212 11755 29865 31260 -4541 -42219 -42534 -3230 -25391 44251 77069
28305 77069 37160 -7279 -62832 -22584 65354 63233 9512 -9442 -25949 -68846 -49431 60151
28293 60151 49456 41852 66512 8711 -11106 52639 93500 60347 -2901 -141043 -134168 -80875
28281 -80875 -13701 9717 39090 35288 46188 47915 25731 -22545 -56258 -66811 -1545 -26478
28269 -26478 -73394 -77085 -50872 -9083 11772 -18850 -34486 -41463 -56679 -92676 -98957 -20481
28257 -20481 -12731 32292 38784 24013 -62995 -101865 -65530 -35179 -2455 -27186 -32755 -12879
28245 -12879 -35985 2149 31141 -29616 -81805 -43543 -39301 8512 22706 10287 12703 5406
28233 5406 -45941 -96031 -61232 -12127 -10027 -3850 30280 -11852 -21580 -10641 -63266 -77454
28221 -77454 -64609 -67412 -59990 -46417 -62460 -98830 -74461 -30308 -549 45304 78313 52380
28209 52380 -4652 -36887 -73188 -19636 9207 20639 59509 104227 62342 49936 58875 23876
28197 23876 -3688 -28423 -24699 -42433 30614 66806 78890 108520 77315 41970 -1152 1344
28185 1344 26603 16960 94729 105181 56439 56417 -5331 -16494 -16659 -65490 -79161 -32906 -12110
28172 -12110 -20370 19628 69149 40123 -49214 -18295 -10120 -52396 -47353 -3403 49323 64217
28160 64217 43127 7085 -21655 12608 48288 26110 -74000 -63647 19950 72870 28012
28149 28012 82202 126789 114759 102696 28052 4760 11431 50937 -8858 -23533 -10701 15940
28137 15940 -3713 -56504 -87523 -22855 -12479 -89787 -94602 -76758 -35580 24159 37943 51570
28125 51570 38326 41964 82649 68712 14508 -6069 -66224 -2306 16947 34561 -24501 -90982
28113 -90982 -86286 -105198 -125125 -79100 -48719 -55047 -55763 -3460 47871 85179 113161 67669
28101 67669 -13149 -18411 50310 62805 4095 -21481 -13844 -2429 35375 2609 -13477 -27314
28089 -27314 -112739 -82771 -40379 -45092 -26099 18605 37286 -5737 8427 51413 -4737 -36805
28077 -36805 -26089 -50150 -19735 -12448 -37020 17703 35142 21490 -32927 -28586 -24938 -27891
28065 -27891 15463 44574 77819 163638 135270 77571 23341 -24085 32718 19733 -49074 36723
28053 36723 80719 11391 -33973 -25503 -19123 -16622 -3952 1289 -40189 -53610 -64897 -51525
28041 -51525 -67378 -30563 -15148 12386 54925 55643 70506 29129 -31090 -42850 -28601 -10725
28029 -10725 -8061 12022 14712 61818 36770 -5337 57751 53603 -16991 -59544 -106001 -59256
28017 -59256 -76715 -32731 -2875 29625 62791 45099 -3219 -4484 71965 131753 167459 107708
28005 107708 74299 50391 38328 26370 37320 6056 -33276 -12559 -41699 -51167 -35108 -37819
27993 -37819 20057 22173 -28191 610 12667 36195 -20218 -3043 46966 47426 41491 21202
27981 21202 11087 -31909 -44132 -78119 -74619 -72115 -40486 -38006 -37427 -3892 -17596 -55260 -11900
27968 -11900 12378 -12980 -19665 -29121 20601 56200 -6740 -72474 -68618 -33223 -13839 27706
27956 27706 15908 -18902 -34010 -94968 -109216 -127125 -56123 -2904 63520 58427 61465 34154
27944 34154 13000 111368 112200 79521 33743 8061 -630 -25582 -10765 -43471 -20866 -5454
27932 -5454 23994 53207 12563 17926 21591 -6721 -11467 13521 -38215 -107088 -106423 -50744 -27890
27919 -27890 -16516 -7531 729 -32025 -90509 -126079 -114300 -46104 -31182 23992 14642 18247
27907 18247 9881 -840 16577 101846 142471 117532 46673 35525 28448 22428 3391 31053
27895 31053 25867 43120 52929 113293 87950 112534 123887 112776 147917 140877 157430 90161
27883 90161 17906 -34348 -69989 -25230 -13107 -49897 -33241 -51308 -66619 507 11035 -5931
27871 -5931 8476 53278 42303 -6747 10200 -39248 -91951 -128990 -118508 -51686 18341 20444
27859 20444 22013 73876 108851 62824 2713 -5030 20811 -41357 -9467 77104 83311 27729
27847 27729 24369 24697 -8504 -18659 -46067 -40795 -38186 -63927 -39185 -34061 -95777 -70053 -43790
27834 -43790 10521 67714 76064 18954 35008 29930 16592 -28024 -111279 -36936 14175 22175
27822 22175 25479 9067 15304 69867 45794 50376 74256 122886 148695 132460 74739 35741
27810 35741 47170 108673 112158 83330 91868 84770 44367 65977 17327 22819 13875 4443 28308
27797 28308 -44443 -56387 -4562 27400 -20190 11210 29756 56014 -23160 -110084 -96933 -42622
27785 -42622 6490 43656 34802 31013 61209 76365 27920 -48982 -95103 -102520 -80450 -36657
27773 -36657 3796 -18415 14759 26186 -14921 6326 46122 -3491 -84398 -72680 -99393 -122973
27761 -122973 -99570 -62563 -77301 -19193 32599 15717 -3797 12459 21515 22566 66919 70040
27749 70040 51499 -27421 -71316 -63972 -51679 -27098 -240 -49620 -37144 -11888 57690 115910
27737 115910 104720 38450 9862 8031 -18611 -20736 42296 9477 10052 69807 31270 -4925
27725 -4925 10829 23808 48819 51228 72677 70034 114196 36165 -36422 -91226 -37090 -28549
27713 -28549 -47891 -14733 13615 39888 1122 -23287 1714 -16685 5330 -2528 15778 25232
27701 25232 28716 56670 67988 81915 28659 2397 7366 -7072 -8427 16075 11272 -21422
27689 -21422 -96572 -110934 -146988 -86107 29271 40016 -12370 -56652 1332 52517 75707
27678 75707 43518 29373 38887 11295 -19949 3500 -930 -49477 2535 73602 50289 67849
27666 67849 43284 -58770 -61183 -38891 9181 75252 68019 60718 52174 93529 77875 67498
27654 67498 44241 70933 77045 51399 24717 31902 31575 33403 17001 47042 36264 43549 74558
27641 74558 77246 19167 2389 52649 51943 70406 73514 50211 -34741 -25333 2875 45252 32171
27628 32171 6791 29147 18014 26198 48631 34295 60334 83761 73487 3825 -10813 371
27616 371 26860 35847 17285 -15723 -48742 1581 58334 86579 17241 57170 58360 33703
27604 33703 -4896 -70520 -97748 -114546 -111531 -25687 -43156 -53330 -61789 -81031 -105048 -93851
27592 -93851 -45167 32630 57815 46736 33953 3702 -23227 -34597 -40658 6865 5411 26516
27580 26516 49063 19464 -29700 -6458 -4491 39421 53744 -7175 -70161 -78799 -75190 -4946
27568 -4946 42293 20947 23720 21308 71600 48440 545 9404 30075 -14787 -40866 -15649
27556 -15649 -42962 -2806 -2099 67207 90342 49221 20130 -1748 -18263 -18998 -19693 22538 12087
27543 12087 24411 72146 72937 -15328 -26537 12611 -4292 -44923 -28385 27600 26165 -13345
27531 -13345 -7888 47005 84359 92412 74476 41333 -7916 6879 70233 101763 98834 94872
27519 94872 142207 106934 116080 97785 56842 7201 -44318 -61037 26524 71834 45284 95917
27507 95917 104160 85104 63759 13868 -14903 1869 60034 48171 47853 67777 9502 -4222
27495 -4222 59309 118345 102315 53391 80013 67800 18756 -44328 -1187 32971 35536 4632
27483 4632 -987 3139 -25394 -24785 -16009 27273 36314 38874 22220 14323 -26877 -81681 -72031 -40703
27469 -40703 -29223 -21369 -18800 -2139 15566 15886 -22780 21870 15780 44420 124394 105907 45060
27456 45060 4599 -21991 -11599 -81706 -120238 -63901 -41512 -32784 -18003 -21837 -10534 -32570
27444 -32570 -45675 -43157 -23731 -19380 -29402 -49314 -27744 -40979 -45393 -73201 -99050 -84428
27432 -84428 -16940 -29434 2796 6544 50948 54687 62750 79331 30570 -32036 -54423 -63980
27420 -63980 -74155 -60249 -44841 -75626 -78078 -54176 -17700 -19557 1921 12283 39657 -7056
27408 -7056 -15381 8763 -4044 8827 25632 22202 28196 6052 -15378 -78773 -109241 -126660
27396 -126660 -87810 -48893 45644 47394 -21489 -55253 558 -5415 15598 -7845 -47342 -16427
27384 -16427 -19016 10364 5198 -24692 -95870 -57965 -8448 22563 120159 109484 52306 101683
27372 101683 53506 31543 82227 129528 144797 96558 91529 126683 74213 55033 31381 27228
27360 27228 29797 -5998 23283 27359 38338 13536 79178 78354 37418 79899 135474 99082
27348 99082 57496 20968 25440 16258 -4019 46048 79096 28849 53026 13884 24518 29999
27336 29999 55832 35663 27424 -24261 -52087 -55932 -60732 -37805 -28404 1010 58129 61835 71902
27323 71902 71105 75830 64856 81556 89196 57618 -48271 -10303 54949 31385 -22213 41610
27311 41610 53860 -5989 -37724 -35818 -25058 4665 71214 171172 153976 124206 116537 117851
27299 117851 110115 81766 57179 39301 25266 -23673 23967 16546 -33348 -18139 50442 84203
27287 84203 78721 -3175 -28098 11055 28483 36627 31457 49378 76311 86231 49083 69835
27275 69835 106612 129769 117148 105339 109534 118416 74538 72274 135912 108091 93277 90704
27263 90704 74165 100151 89155 21255 -21671 -43300 -60763 -15000 12819 7684 -19928 -51840
27251 -51840 32111 52580 43499 111788 100065 21430 6013 43679 27720 26085 58260 40262
27239 40262 60054 88807 94654 22203 -19641 -75183 -95071 -58723 -17644 1315 -2833 -32763
27227 -32763 -654 1180 7775 45397 10705 16402 12891 -19126 -41393 -17619 26640 13066
27215 13066 -19390 -51916 -19672 -53613 -45500 15098 85211 123981 94406 147540 132245 76836
27203 76836 94854 98386 76530 69688 87317 55584 20952 -16275 35662 74220 16798 32443
27191 32443 107108 131304 53295 20989 27527 5671 -5906 22667 19827 -1401 -16512 12221
27179 12221 14934 55851 57364 73152 60797 535 -32006 -36730 -677 10467 -26640 -49185
27167 -49185 50719 102353 101789 65899 24192 2145 -5262 -2493 19084 82744 97802 42443
27155 42443 5230 -46213 -17879 -3767 -53431 -44122 -1859 -39019 -71754 -52066 -3301 -27556
27143 -27556 31315 43719 48974 68997 117273 84549 -26396 -106048 -64923 -52842 -93193 -110073
27131 -110073 -93796 -80177 -54362 19518 38322 48893 57036 66634 83527 75976 7742 -11566
27119 -11566 45845 48205 61326 44598 -40168 -85806 -43147 -27120 -15753 -15137 -56214 -82185
27107 -82185 -34864 -18070 -46250 -59818 -132423 -121471 -38665 31490 -21487 -53894 -65769 -33225
27095 -33225 -56212 -86050 -85273 -109024 -126482 -79507 -39243 25729 53985 -11638 -148459 -169337
27083 -169337 -139481 -65256 5020 62820 49987 16689 -16606 10198 13201 3704 -35435 -9384
27071 -9384 -3454 -37502 -19419 30568 54693 43816 -4061 -58252 -21973 31686 33137 -15646
27059 -15646 3698 27809 -8095 -45556 -13115 -8791 -34320 -19440 3204 -6974 -38649 -58851
27047 -58851 -45966 -34958 -21603 -27102 45176 66918 22158 32291 65179 46993 21076 74253
27035 74253 120457 48171 8477 -32872 -29658 9520 4981 -29610 -29313 -59150 -31660 17501
27023 17501 -41879 -2765 70791 61117 57480 41283 21505 -22752 -33340 -15932 11128 5512
27011 5512 -14422 20752 38235 -39404 -94009 -96423 -99506 -64763 19528 59489 23028 -84985
26999 -84985 -73322 -32716 -20437 -71857 -92263 -112085 -94662 -78160 -54307 -61131 -48145 -105030
26987 -105030 -102259 -8909 32343 28930 105140 144403 102476 62301 9231 -53323 -74578 -60968
26975 -60968 -17394 -9428 -54762 -60542 -84484 -35873 22749 43460 26161 40543 54141 -8906
26963 -8906 5076 -7140 -2412 -12603 -23068 -25481 -14684 -37256 -29653 11561 69388 66025 16499
26950 16499 15569 -19674 11171 14095 -68126 -103245 -94999 -83900 -30734 24642 102827 171220
26938 171220 136462 110277 86584 31981 28199 26677 -10223 -16566 50166 67690 6160 37786
26926 37786 68686 -34325 -88932 -41676 -40840 -49496 3489 63189 38854 -8550 -35986 -7602
26914 -7602 -11635 45949 71860 73036 27931 -37544 -78993 -107012 -166327 -159792 -110184 -104963 -95990
26901 -95990 -102989 -65294 -76545 -84904 -22781 10194 -4189 -25520 -30839 -34543 -78952 -89453
26889 -89453 -30086 29820 64156 107721 150577 146439 43667 -10262 3159 -10119 3330 47941
26877 47941 64319 21958 69857 85236 105301 83525 8823 32440 42351 21502 -9990 12062
26865 12062 47905 3987 -46855 -73396 -59702 -12127 14726 70289 83890 58613 11446 -74292
26853 -74292 -105002 -90816 -29499 40264 -13772 -55265 -44917 13478 26426 -16820 -21544 23131
26841 23131 20674 28686 42509 14076 43554 44809 22163 -26119 -23927 -43059 15642 11294 -47788
26828 -47788 -54244 -30050 44441 18421 -44654 -77114 -44841 -81893 -115543 -57509 36270 -722
26816 -722 -64570 -93901 -80458 1199 20067 -41032 -50667 -34638 -29948 -66516 -69228 -73470 -50031
26803 -50031 -16246 -6516 33716 -708 -23263 6993 23987 -13497 -32292 -48484 102 19920
26791 19920 50667 97357 67585 101879 125527 110423 70210 50270 43065 13617 -48390 -108666
26779 -108666 -139692 -96373 -58747 -2434 18880 71126 68331 47311 71597 45108 25456 11026
26767 11026 -27751 -42779 14286 -12193 12760 91676 137330 121103 117789 121059 107065 -10032
26755 -10032 -51338 -25768 -7563 21107 7367 1829 -41262 -47354 -47218 -15521 27688 20462 7943
26742 7943 -22807 -44021 -6508 33871 5533 9647 8420 10967 -8385 -21943 -4449 -1509 -38447
26729 -38447 -23944 -67479 -62413 -13697 8127 -6525 -34206 -50041 -57778 -3716 -21588 37693
26717 37693 -190 -56410 -25755 18976 68389 86486 66872 52251 6702 -27613 -32210 -34924
26705 -34924 -45475 -49102 -23710 1672 13780 -19885 -62267 -94708 -52312 33299 14426 7859
26693 7859 4211 -24036 -17861 -15967 -22016 -27502 20836 15525 30689 19337 -19309 -25210 -40457
26680 -40457 -78535 -37428 -19312 -10677 -57338 -51778 30893 43920 31335 -130 -6760 -15787
26668 -15787 -59026 -58124 -61377 -78766 -80878 -77446 -34340 2614 37440 -21784 -15686 23192 20352
26655 20352 5836 70502 99287 60336 25813 4026 42280 50878 6083 -15773 -55746 9909
26643 9909 127165 108154 32981 42346 2168 32344 35153 -3515 -36197 -48304 -36578 18798
26631 18798 54951 29705 -4039 -32800 -1859 27461 18451 -37174 -57321 23542 40256 15363
26619 15363 63636 90027 37405 6620 6574 -25753 -71495 -80831 -18131 41336 55903 17998
26607 17998 -49023 -7956 2240 -126 -15931 -51476 -26504 -41724 -65923 -31481 -1107 -32795
26595 -32795 -27733 16099 -16824 18901 15086 48498 27436 63300 74183 80664 92960 130219
26583 130219 140999 96069 83433 80142 32005 -30593 -28023 -37286 -88172 -135805 -131218 -82924
26571 -82924 2138 -8963 -27406 6036 45349 10634 7928 24384 3850 -32123 -29923 17419
26559 17419 -2745 -30588 29467 73832 64844 106615 98717 89730 74417 70482 58182 121191
26547 121191 118318 111357 111243 55814 69902 65074 62472 78810 16032 -50845 -79743 -42598 6119
26534 6119 68176 107430 76195 60781 48924 32005 68091 27012 92665 104199 47055 41976
26522 41976 38520 2534 -85649 -64780 -54996 -25572 25778 77554 30627 11491 -52337 4267
26510 4267 107921 84096 16533 18685 17343 -9749 36768 71963 83022 110988 64542 78358
26498 78358 131104 107156 69648 47023 33428 69147 62782 53511 27325 -24823 -65216 -13965
26486 -13965 24457 27810 66818 16339 -76204 -125313 -23877 110536 131275 70762 27066
26475 27066 60476 49253 -12719 -18174 9632 14406 26910 14111 -38254 -56664 -7111 -23707
26463 -23707 7902 -20948 -7901 57708 67691 60313 71819 41364 19838 69448 99788 44919
26451 44919 55544 85507 12144 -41991 -40185 15507 71612 27776 13441 46026 -56910 -90164
26439 -90164 -70262 -45254 -20249 8819 -20228 -33798 10068 39825 59152 16463 -54120 -97198
26427 -97198 -39679 12473 -23863 -48031 -36333 -28445 -534 -3145 -29877 -62868 -75716 22094
26415 22094 151297 187486 152950 102591 56194 11324 -42745 -27078 -51192 -63857 -65527 -63918
26403 -63918 -65597 -30098 -46362 -40444 48887 86675 102393 88589 98213 62529 17371 -11838
26391 -11838 -33766 -66055 -96856 -66038 -58566 -69019 -62523 -64275 -22483 7832 64372 120255
26379 120255 62785 28369 -1358 25016 50131 10567 1012 7114 23445 16979 51145 113537
26367 113537 148363 114140 38805 71677 74267 62886 29075 19340 79177 127443 83034 41638
26355 41638 -32693 13015 59761 58789 24383 47649 88654 121097 97179 114913 92545 56940
26343 56940 -7076 -87681 -8185 44122 41913 -1855 -25922 -27646 -49170 -2301 39287 66281
26331 66281 15083 3039 -31876 -39320 -74606 -157970 -166113 -162544 -102864 -15295 14227 -28558
26319 -28558 -83977 -62083 -12128 -30067 -65212 -29668 -9332 -7377 -49 52814 84367 100199
26307 100199 82950 79350 51226 16647 18361 64735 78044 73836 75275 -15957 -27579 -43741
26295 -43741 -56838 -27654 -40015 -3327 20846 26252 -2917 9185 20794 -5377 -13685 -21662
26283 -21662 -9653 81702 134244 141046 111105 78041 22397 -14536 -10127 -23451 8034 -3099
26271 -3099 9866 14650 15388 40068 -24248 -79880 -49754 -35779 -30220 -52318 -22442 -25410 -68672
26258 -68672 -86546 -69425 33470 25053 24463 28390 -20576 1520 23343 -20538 -52370 9623
26246 9623 -903 -8856 -54361 -56069 -53627 -102929 -41992 17903 56981 29053 -36539 -11268
26234 -11268 -46434 -77387 -43551 9005 -12218 -13320 -12691 18033 29584 -18122 4796 34853
26222 34853 48568 15473 -1780 27758 87538 115198 84955 44162 -4120 -73614 -101338 -54986
26210 -54986 -48047 -34846 29088 24185 -25412 -7934 -63529 -85151 -11561 15784 30771 38790
26198 38790 -15733 -27460 16217 66261 39362 -11146 -24104 -12971 -35632 5396 -32014 -44768
26186 -44768 84111 157289 131153 46983 24530 -9640 7293 3387 -16988 -7747 -36286 -66393
26174 -66393 -14668 -12545 34219 13950 32343 -1782 -1291 -35173 -31737 12328 25034 -154
26162 -154 -58835 -106872 -129469 -86208 -18809 -9472 -30485 -37799 -19208 8971 6329 839 55195
26149 55195 59921 50183 81148 36435 37106 56831 85169 83699 79902 -24593 -57671 -16200 -2034
26136 -2034 -17050 18836 97078 83403 33020 -41182 -53690 -95698 -155613 -145360 -130114 -141466
26124 -141466 -87596 -54219 -73671 -5094 87729 93470 40435 88823 67853 59621 95165 90106
26112 90106 48912 39213 46674 63663 97444 104300 69988 84317 84516 -1999 -28396 4995 37245
26099 37245 12820 -37649 -33974 36935 79060 29639 73229 81922 55306 101473 71953 -2400
26087 -2400 -37116 -53576 -22722 -14012 -33179 -53586 -34673 4034 20385 27873 562 -15269
26075 -15269 -55277 -28518 38771 38415 -3400 -49017 -50663 -96227 -83036 -68171 -12115 -543
26063 -543 48014 66214 21971 -42195 -31883 -25589 26236 25503 13252 -31919 -30386 -22934 8850
26050 8850 -61498 -69072 -70295 -59588 19081 86581 92251 53289 3228 -68734 -52272 19666
26038 19666 11196 -6790 -57694 2509 24439 -10934 -67247 -70562 -132416 -132945 -104974 -111259 -95101
26025 -95101 -94637 -41729 -15340 9711 43814 51193 41343 43737 -4665 -58333 -98979 -41847 28205
26012 28205 61799 13132 -58581 -105148 -133378 -107616 -70774 5277 32929 26156 38034 13102
26000 13102 -88890 -85242 -82568 9413 1924 -13745 -27012 -23271 -10379 -49799 -103210 -33105
25988 -33105 -4047 17676 22659 32669 38489 -32766 -82408 -67745 -67194 1991 65707 38240
25976 38240 19582 -3847 9221 -18802 290 -36757 -104195 -84708 -91045 -48654 -27675 -76370
25964 -76370 -21905 18045 37644 -9061 -8802 -4018 -60259 -67909 -43320 23259 8464 -20615
25952 -20615 21191 32707 38225 50327 23019 -9434 37955 45964 21662 54710 85539 -16465
25940 -16465 -75936 -77260 -24245 -10660 -33792 -14058 54311 31413 -67022 -112887 -132696 -131790
25928 -131790 -96718 -57874 -42690 -25602 -67173 3696 34799 31855 55993 44689 91852 48214
25916 48214 61466 21672 -17937 -38417 -34224 -50355 -18444 -12978 -18346 313 9174 -7746
25904 -7746 -22410 -36891 -41747 -22191 -53461 -52958 -65724 -26595 14037 -34807 -75556 -53180
25892 -53180 -95161 -105998 -49452 -74304 -68119 -37613 -33951 70381 148395 97137 42164 17053
25880 17053 -9516 -39752 51723 113575 71312 62371 48071 -22047 -74002 -90515 -71183 -56082
25868 -56082 36063 56756 62164 44754 59079 95126 57302 47450 -9437 -35575 -26486 -41727
25856 -41727 -98270 -112815 -45737 -7542 3990 3378 -28344 -1111 28393 26472 90 -16181
25844 -16181 -30287 -11765 -23161 -12989 3216 70849 115106 33087 4662 39595 13852 4556
25832 4556 24403 -916 -21410 -26156 32241 41569 -53082 -27008 3179 9090 65106 131264
25820 131264 62115 -16089 -50224 -22342 -30453 -21210 -23793 -37581 -31686 1273 54506 82922
25808 82922 81046 44549 15975 19414 -2033 29243 35289 -25585 -83633 -37418 61958 62649 52403
25795 52403 -50261 -84762 -33645 13130 16300 1013 20811 101107 63414 -2182 36605 86340
25783 86340 144475 165574 157094 125632 64644 18432 73084 85469 54842 17673 -10433 20316
25771 20316 3703 38557 61027 93317 113784 108702 80779 50316 5948 -58819 4751 130316
25759 130316 177351 146514 95111 -19074 -2749 54019 68934 48143 98092 87179 76452
25748 76452 101016 79807 57354 25808 -39513 -39750 -24774 -28710 18078 -44916 -93439 -64577
25736 -64577 22303 17173 -12101 -58748 -83373 -42627 21202 40840 87702 33726 5755 56113
25724 56113 57386 38049 20825 48560 60887 45468 38400 2032 19828 60418 42358 22771
25712 22771 -9436 -23349 56876 55825 222 -40863 -9055 29761 19490 8437 51410 99842
25700 99842 146136 146699 89477 62596 -20261 -21319 35713 47928 -8978 -40451 1533 21011
25688 21011 -13909 -31895 -120542 -129016 -81294 -54424 -36655 -39033 -62209 11155 -1931 -20165
25676 -20165 2161 43150 -31026 -67460 -62110 -17953 2130 12410 -10072 9315 -4871 -582
25664 -582 37539 28510 13008 7147 32289 112915 97755 80005 110487 110514 108756 108278 107571 46576
25650 46576 -52084 -46051 6396 48812 68795 84361 66051 76052 80354 68999 23679 53742
25638 53742 26088 -7033 13424 58034 16818 -30338 -42404 -36070 -61232 -79310 -46777 -19521
25626 -19521 -37879 -54875 2823 48101 48648 12996 -6176 -33945 -7620 29166 25303 50904
25614 50904 57361 19559 41125 48429 43658 75776 101105 62291 22412 4204 32599 40014
25602 40014 26703 42670 37736 39480 71757 81489 54421 5308 42498 31965 -6110 60193
25590 60193 106100 17687 -17930 -10562 -17109 31410 45283 -25773 -76467 -60425 -35267 2359
25578 2359 -47318 -139738 -130922 -93206 -76977 -26046 -12773 14206 -19419 -73523 -58119 -80571
25566 -80571 -72399 -39960 -14047 6973 12940 -21627 49488 144992 125341 32164 -49707 -17702
25554 -17702 -21684 -66315 -53304 -13349 -22922 -41494 -21233 -11620 13444 63294 107582 138087
25542 138087 66244 6745 -40222 -54658 -29108 1005 -1444 22905 17200 37659 42372 19446
25530 19446 4829 -18537 33186 48105 71318 112230 81384 17013 31258 -2885 4845 26598
25518 26598 53130 70573 57538 49901 17917 43657 15670 43456 34008 81330 58122 36792
25506 36792 44914 -1772 -72937 -30732 34833 13528 -19858 -31360 -87264 -128271 -151698 -115163
25494 -115163 -50878 -2660 -1210 -59730 -86262 -34896 -28948 29377 57925 81523 60833 -4574
25482 -4574 -11962 -35815 -75100 -73998 -59140 -67027 -99259 -78313 -11840 -38788 -30889 -42406 -37885
25469 -37885 -6244 -61596 -18492 -21055 -25241 -45253 -106875 -110204 -139161 -118845 -89606 -22279
25457 -22279 49743 -732 4624 47068 100237 47776 12971 30981 95089 177811 169375 153720
25445 153720 155508 145075 89955 110150 109992 85517 44663 22706 7960 -6367 -21833 77728
25433 77728 86775 42064 -12223 -27088 -34223 -17079 -9641 64888 114790 47917 46891 28517
25421 28517 25826 -47 40161 29148 38839 39656 -44869 -55614 24438 877 -20356 15617
25409 15617 51146 82551 93039 79357 24907 -4274 -481 -5732 1822 62922 101864 58159
25397 58159 75386 79383 37954 7953 665 14931 -4546 21102 89564 58223 465 -15991
25385 -15991 -16678 -12820 27122 10376 -39953 -51530 -42773 -44894 -77901 -63928 -25874 -1839 -50108
25372 -50108 -4707 119674 110775 113482 74401 50833 39091 53152 20197 -9462 -53513 -44272
25360 -44272 -80730 -40395 -16742 1198 -26630 59563 67706 -1019 -8166 8760 -19814 -7249
25348 -7249 -44772 -49764 -33159 29793 91452 90192 80593 5531 15102 33152 43677 30260 11397
25335 11397 -15123 -16725 -46356 -75495 -41161 11909 36061 32968 -7378 -65537 -44871 -66517
25323 -66517 -61662 417 55255 33620 -2531 -38344 -24969 18995 48866 82292 47559 42563
25311 42563 46643 98411 92526 46199 19800 29053 27262 -2646 5553 -12971 -25701 -50309 17991
25298 17991 37774 36134 4524 -46072 -29411 14717 45702 2787 -32146 -77921 -76139 -62130
25286 -62130 -107827 -113290 -97481 -68726 -63393 -20634 -79531 -64644 -46420 -45755 11820 7505 24362
25273 24362 51981 73173 108062 110969 67018 -6178 -32452 -3364 85467 194465 187637 137519
25261 137519 126728 113025 95161 81480 91893 117394 150666 133000 89964 48010 7698
25250 7698 -14313 -66514 -79803 -16299 50197 66185 -19578 -44301 -6239 -10368 -21084 -58097
25238 -58097 -56631 -86966 -21127 34588 48192 15404 22210 10758 64533 37971 27793 46420
25226 46420 24091 -32795 -30536 -17397 -23466 -17875 -27789 -11702 -24144 34036 55522 38717
25214 38717 34164 27740 8774 -45284 -52850 -48360 -25930 -12097 -9493 -13117 -43366 -79221 -42048
25201 -42048 -57573 -26905 69582 111389 98783 98063 94028 58027 13657 21738 54672 46921 94244
25188 94244 132595 130926 157825 151277 75866 50858 19350 -27146 -43115 -7272 -30935 -34075
25176 -34075 -36521 -45672 -15625 -50308 -57291 -28652 -30633 26075 79482 98644 111361 121935
25164 121935 120059 37554 34260 104881 92447 10591 -30815 -48345 -5739 -3411 -46563 -43258
25152 -43258 -30159 -64737 -75219 -38225 -15838 -22114 -46095 -79014 30440 73410 11571 7126
25140 7126 -29134 -75953 -68858 -26653 -23060 -26024 -53009 -57888 -74302 -105886 -98050 -76944 -53899
25127 -53899 -33802 -28582 -69152 -45721 -55960 -72249 -75059 -111823 -83080 -75765 -20858 80539
25115 80539 99690 24439 -66183 -89839 -76803 -26507 10312 -18256 -82662 -37229 -47539 -61548
25103 -61548 -75031 -54084 -403 62597 88632 116571 174955 117456 10948 -48780 -38731
25092 -38731 61433 102508 78645 52211 10269 8616 22550 -16466 -6554 11827 16431 16789
25080 16789 2822 -12354 -13259 -2088 12600 -31358 -41876 -43663 -11790 28074 23619 -20375
25068 -20375 -26623 23527 65333 79105 69150 43748 31210 37969 -21532 -20603 -9373 -11536 -17520
25055 -17520 -64944 -104629 -125355 -89683 -62998 -13829 57098 39462 -16048 27690 77901 85166
25043 85166 62161 97405 114466 31218 9011 9877 -254 -19518 -19202 326 9026 23827 8320
25030 8320 -21939 3983 16812 2979 -43313 -79524 -16050 17202 43472 77394 50356 -4127
25018 -4127 -8217 31334 44235 49798 106522 108848 96412 51799 8490 26541 52216 109263
25006 109263 143092 99973 54513 36303 73508 61563 47180 -17167 363 11318 -19187
24995 -19187 -30962 -39828 -59869 2998 33144 -41381 -4385 91711 76796 106485 77968 69750
24983 69750 63063 51658 61404 1486 -11869 -58570 -23741 -11941 -65492 -64298 -5454 -26449
24971 -26449 -60945 -50874 8810 46981 79331 89934 137748 138871 89986 31972 -19320 -36933
24959 -36933 -38051 -24828 -8374 25974 79988 31530 -28594 -12749 34875 21219 -14070 -58333
24947 -58333 29184 45819 31611 54289 36212 36146 76498 99902 99390 115320 102104 78390 48742
24934 48742 58896 117301 98659 70845 34285 35569 35414 19139 -24017 -6925 2783 38382
24922 38382 42968 -3734 21229 26301 -23063 -28308 -19254 -20119 -49620 -20633 -4324 10489 -34896
24909 -34896 -63404 -45759 7911 34061 46556 58734 14306 -47320 -70071 -62730 50374 67492
24897 67492 51071 290 1336 -23256 -25859 -54198 -32293 -4029 -12957 -22043 -1612 6974 37659
24884 37659 94211 90439 32345 -19535 -31755 -43136 -79624 -62825 -46499 -32626 -98817 -81563
24872 -81563 -58320 -70115 -76751 -26349 -1334 2345 -34027 -35479 14484 9895 -66279 -123249
24860 -123249 -98972 -31712 44211 144391 139353 110488 120557 70779 80918 41300 -12758
24849 -12758 13436 -5714 18080 69038 14611 36931 36285 27204 538 -26326 15733 -3759
24837 -3759 -55590 -57014 -57956 -11248 27622 26520 42506 28614 -8088 -17993 7114 91024 158911
24824 158911 132502 68580 -29361 -81581 -53895 -27594 -34470 -45178 -6984 53768 27350 -31092
24812 -31092 12778 35493 24967 -50351 -30999 8375 30080 47341 50392 36093 5311 -4960
24800 -4960 5636 79510 84651 65480 75531 59489 7690 -15444 39964 113655 88018 18005
24788 18005 -65059 -91066 -27119 10065 13278 88311 60440 -18488 -42710 -369 11044 20820
24776 20820 75013 96086 93901 107587 76353 65516 102200 113141 100329 80630 53629 116858
24764 116858 141627 129003 79067 85304 40501 -25809 -16831 12252 -7760 -21954 67396 69427
24752 69427 -3535 -41002 -44716 -49301 -10973 30011 31950 33109 -21392 -4812 -8782 -18417 -34679
24739 -34679 7448 27938 60054 59659 64263 17978 -14419 -14143 19443 -7273 -16829 -35245 -89082
24726 -89082 -103547 -103393 -97594 -65574 -15034 48182 73162 73114 57930 84821 120885 164860 141381
24713 141381 110322 107044 146970 129030 72460 55616 83416 59157 63391 48196 35918 -14073
24701 -14073 -31230 -17864 -3814 7365 18979 62502 64921 94017 65387 43274 50050 86795
24689 86795 20381 -10235 26422 1753 -31120 -25025 -71165 -65626 -103509 -121947 -93026 -31423
24677 -31423 -47038 -56256 -30460 -26795 -6645 51156 40914 -2908 -17192 -13542 317 45081
24665 45081 73924 70094 49209 13620 -37282 -49133 7818 43707 72897 73734 84361 59988
24653 59988 61726 46343 35223 66228 38389 32969 41092 45427 39061 5322 -16855 -41001 -29085
24640 -29085 -8030 -66294 -131924 -155190 -91401 -12137 22950 62140 87359 110859 65208 -30995
24628 -30995 -44123 -4936 29706 -40137 -116502 -76292 -46201 -43882 84 48957 32154 -19243
24616 -19243 -19481 -50829 -46244 -56485 -51085 8578 28839 10262 -66414 -55175 -62548 -26290 -1937
24603 -1937 -24983 -17510 -14398 -6506 49703 -33427 -29666 -39939 -32624 -64944 -28197 9131 47394
24590 47394 5654 -40113 -64459 -35746 24080 29700 437 -29383 28050 50800 57043 31248
24578 31248 20062 14091 -12176 -4886 -28699 -59977 3192 61460 27279 -66568 -93649 -63437
24566 -63437 -59726 -114388 -110804 -54228 -1293 1737 28651 -534 -19561 -32093 -18059 -44488
24554 -44488 -16362 -10151 5704 21740 51479 14517 47071 28187 -26356 -86754 -92784 -62184
24542 -62184 -40793 -19887 -26517 -25319 -41922 -45419 -36878 -35699 -44511 -9999 9917 -36390 -79845
24529 -79845 10892 9214 -49761 12738 53958 52416 48386 22209 -5193 -25342 33247 40265
24517 40265 45012 8513 41606 20943 6373 -20112 -7497 37085 69500 95122 71120 61076
24505 61076 81371 15004 -51145 -73101 -49118 -6555 25479 9158 15571 -30308 25711 85683
24493 85683 97686 120926 61635 -25069 -12287 -18525 -29019 -96693 -61148 -39816 -57746 -58051
24481 -58051 -46543 -48300 -14199 16487 18175 -43771 -27241 13500 -47475 -94519 -54107 2000
24469 2000 -7491 -43566 -48958 -62229 -102066 -88719 -92379 -72700 -89083 -128031 -113190 -78566
24457 -78566 7499 97130 74640 48774 40644 -10435 -32961 -10118 -10071 -20579 8081 42473
24445 42473 55794 -3802 2169 9566 62311 123548 117359 98677 71716 85536 84351 76939 5146
24432 5146 -5289 -16684 -34221 -25059 -6155 -5477 20024 54350 81754 78483 43442 7184 -47361
24419 -47361 -99289 -53610 -25216 28151 53402 43416 18686 19654 21743 -24347 -36774 -54772
24407 -54772 -87279 -36699 -46733 -103437 -51002 32195 66434 46000 24092 11808 -3672 -3676
24395 -3676 -11912 36565 29104 -4755 -27697 -25562 31068 59844 -881 -90582 -117873 -96421
24383 -96421 -98696 -3146 65225 54532 43283 44584 32124 -21748 -61874 -45523 -36283 -91267
24371 -91267 -60429 -22971 -8915 -15709 31407 26129 -1986 75850 104898 55667 -545 -25637
24359 -25637 -30486 22059 16237 22202 -14714 -7260 -43140 -91204 -131384 -129788 -75109 -33403 14375
24346 14375 19984 -38618 -41174 -41812 -56149 -62258 -44990 -93069 -75921 -13281 56260 82279 70279
24333 70279 109152 5953 -90570 17736 99086 68172 59600 65954 103613 32203 -18775 -29224
24321 -29224 6586 50122 94408 126438 119215 85695 56067 45557 114438 142220 124548 9332
24309 9332 -51397 -36470 -74690 -63043 -74583 -79594 -86440 -61468 -43609 -77901 -27164 -29582
24297 -29582 -27286 -26445 -65108 -50424 -49645 -113382 -154902 -101407 -41469 -1684 47042 40566 62273
24284 62273 82636 95258 42145 10397 -68890 -51577 -46600 6425 -45629 -131895 -140215 -109257
24272 -109257 -102994 -62185 -49309 -67513 -9615 -21693 -102589 -177570 -193840 -202986 -225104 -209741
24260 -209741 -178712 -75380 -15784 -954 52745 57113 29271 48662 25158 -68090 -66019 -33993
24248 -33993 -29172 -72016 -36156 12965 36410 42835 36828 76098 83679 86822 93837 45931 67365
24235 67365 126314 124754 62265 23104 41873 93607 28029 6983 11575 36709 13883 -31603
24223 -31603 -11667 66973 54937 11749 -14767 46890 69472 16134 20285 45942 14493 9736
24211 9736 14844 -21616 10369 36216 43767 10507 -52920 -55719 18569 -9032 -28171 -24981 -62293
24198 -62293 -113446 -102048 -3469 35575 -7108 24576 18434 -46478 -3121 13877 6982 -37321
24186 -37321 -45896 -37957 -57665 -52019 -44208 -111257 -133839 -168666 -115039 -117133 -88816 -58143 -3049
24173 -3049 34609 68581 77153 61602 -5042 -30958 -25868 6991 11976 -22290 -4101 -45266
24161 -45266 -55317 -54804 -78543 -62988 -16742 -33843 -53715 -6715 6619 86568 73611 -5449
24149 -5449 -39986 32795 101755 69939 2923 -46218 -64626 -64193 7882 58395 22477 23377 37742
24136 37742 -7722 -65405 -93544 -57824 -51235 -41627 -91489 -114720 -25976 -1188 -9484 7644
24124 7644 -53681 -77643 -18123 -23155 -83625 -78473 8312 64130 45468 -41065 -91563 -41811
24112 -41811 30267 53251 55444 -63830 -66067 -60859 -81947 -70421 -4725 57679 29137 -34335
24100 -34335 -62952 -57126 25139 42735 39775 34393 -27669 -25755 -11409 21376 -26801 -26698 -17898
24087 -17898 -91505 -92097 -52311 -10604 24460 46133 37072 32129 84693 73968 -15113 -61504
24075 -61504 -4054 -42259 -100102 -73447 -39459 -38487 -116509 -137938 -119349 -78934 -36196 -2822
24063 -2822 -29500 -47267 12619 25968 36561 24487 -15190 16631 49331 87225 92635 52633
24051 52633 -50075 -26789 -19072 -40815 -77438 -120944 -88749 -17425 24731 -2856 -8660 36737
24039 36737 10047 -69005 -129144 -67389 -5924 -19926 -68994 -85111 -75967 -26531 -27672 -51875
24027 -51875 -26663 8984 13669 1101 -43444 -30841 22255 -28461 -41431 43151 137581 126391
24015 126391 70282 39207 20050 85150 54299 31914 41701 -8890 -48958 -70311 -20847 1688
24003 1688 -15589 -63629 -118 26517 -43884 -17523 -17297 -14802 -10527 -10936 36192 54797 54655
23990 54655 32947 28048 9124 -10547 25385 47793 69292 4990 33268 88368 43872 -18876
23978 -18876 -16042 -59178 -99663 -45722 -17330 -9668 -33301 -46585 -30581 -16688 -27960 8946
23966 8946 11406 -42978 -80940 -82073 -70729 46250 94765 46694 25576 38717 17896 -71461
23954 -71461 -134959 -124168 -124473 -117593 -75972 -63246 -83738 25426 67382 26404 -39619 -74034
23942 -74034 -42911 -81758 -97988 -78342 -64730 -72626 -58975 -5303 54382 14354 14308 -17871
23930 -17871 -22609 39882 43740 -17123 -42397 -87948 -48088 24708 16183 13354 69685 80443
23918 80443 80497 45207 -6531 -81782 -78028 -61866 -24392 5170 82143 60683 33401 74670
23906 74670 62382 7150 60733 111585 78927 28314 26105 84765 117643 100412 79600 6700
23894 6700 -42138 -34588 -68675 8961 19774 26028 83813 57478 39604 -31177 -54038 -13027
23882 -13027 75858 94865 44896 -17576 -49298 2059 -17396 20301 33651 19751 -13663 24977
23870 24977 53767 61834 72157 37786 -3212 -19633 -22338 -35802 -24741 -32184 -88923 -60993
23858 -60993 -24908 -45418 -73967 -14200 -36818 -90449 -51100 22447 32837 36588 40939 30755
23846 30755 -13739 -13552 13538 45296 18489 -58074 -55974 -50202 -29036 -42545 -51634 17358 62934
23833 62934 76166 51556 -3430 38156 32649 -19602 33957 108378 172023 142884 51870 15185
23821 15185 -30529 -11881 -56087 -15943 -23054 -21191 1297 -58173 -130371 -71867 -48368 -28323
23809 -28323 -29025 -4899 5761 3011 -6237 -10717 -44831 -47302 -51337 -53303 -73154 -53132 -15708
23796 -15708 8362 -27960 -79259 -69485 -45320 -4588 63948 66421 43484 41095 25572 33709
23784 33709 63082 75279 111930 82707 55801 72258 44915 -29346 -14251 -10580 -5364 36642
23772 36642 -7231 22184 -12781 -46244 -41474 7116 62639 52259 -1217 -23254 -20996 -9962
23760 -9962 -31373 -38431 -11323 -38529 -61473 -37584 -42902 -26822 9817 17066 34366 51056
23748 51056 49579 37528 34002 19260 33174 -5782 -14848 -27699 1954 -12256 -71667 -3903
23736 -3903 96095 104768 111840 77606 96755 91600 138179 92069 -36165 -57673 -1118 -16117
23724 -16117 -89938 -68272 5566 37218 14014 -5028 -9383 -20876 -52118 -34255 -19232 30430
23712 30430 25546 -22631 -17207 -6554 -34176 -67305 -21195 13650 -38375 -95468 -56922 21337
23700 21337 58905 115067 89043 5228 15596 9813 -13463 22289 56308 83446 95947 123710
23688 123710 109148 95085 85258 56194 10403 5038 -30342 -77556 -66959 -64535 5080 31575
23676 31575 79220 97295 42604 49228 72611 30826 -3996 -47490 -28194 12409 -3923 3088
23664 3088 68236 99039 92663 43872 20191 15313 -52546 -48778 -18438 -101310 -100002 -143914 -101996
23651 -101996 -6801 626 17104 41290 62063 -43265 -56395 -16179 9664 22809 74782
23640 74782 -9540 -18836 -2890 -1618 -13298 -26929 -36549 -77264 -82704 -97314 -60383 -39792
23628 -39792 -48700 27418 -9352 737 -33693 -3041 28053 36975 64660 50621 42145 30671
23616 30671 -17414 -22622 -33816 15152 96122 95162 35961 -8606 -4499 -25763 48561 45591 21765
23603 21765 5202 5121 8558 20544 41827 49919 36064 -10752 -64377 -72071 1921 21310 -31872
23590 -31872 -79415 -111168 -89849 -621 4668 53944 83370 53178 5604 8527 -30060 -53435
23578 -53435 -23190 -41792 2033 13855 -27505 13115 60199 48890 64617 101517 27555 62702
23566 62702 56809 63086 64828 111667 97190 61569 -11285 -50262 -54505 -2105 18596 42780
23554 42780 -3459 -71300 -49787 12291 -6661 -54098 -26989 -23010 -27053 345 87710 107000
23542 107000 37826 17472 29063 59946 82949 17104 14862 44977 20499 24741 -14464 -14657
23530 -14657 -5344 1139 30109 28603 -70392 -87659 -89921 -93723 -93861 -58487 -100 5887 -49450
23517 -49450 -47714 -38157 -20116 -28233 -104247 -73616 -30613 -29567 -2027 28300 10102 23715
23505 23715 52624 56443 31075 -10778 14787 98320 67657 49071 98105 101972 96260 60154
23493 60154 14556 -9072 -30570 -22193 43736 41650 30689 25264 -8328 -5105 34723 -44887
23481 -44887 -65546 -22054 -10277 -70278 -77938 -29106 -2103 82217 119681 80094 76837 36892
23469 36892 -18703 1921 -34628 -35630 -24276 22988 -13781 -23739 -40668 -30728 -1402 10801
23457 10801 52765 92383 61873 8838 -18159 -36304 -58691 -60873 -78949 -115365 -104895 -67909
23445 -67909 -55416 -29623 24916 83603 36690 17627 6243 11069 4787 8200 5536 -26312
23433 -26312 -17715 4546 76011 59529 -32397 -67152 -31710 -7989 -92856 -82893 -34740 -46055
23421 -46055 -91416 -113591 -66884 -55362 -12282 24723 64211 20577 20832 32279 31505 63455
23409 63455 77350 34213 28999 69554 122798 121503 51575 56396 48632 40482 18898 -28716 -92876
23396 -92876 -75739 -43983 20385 65878 4716 28475 9324 -20602 -3191 36405 48239 110983
23384 110983 98956 102789 51372 133 844 -7537 -34809 -29420 -70620 -96077 -54705 -5382
23372 -5382 -11262 -12043 2835 9391 -4417 18455 33654 16873 -8069 -22730 -59003 -37539 -24930
23359 -24930 -41888 -140621 -83516 15015 33355 -3293 -30050 -18327 -58691 -94481 -59163 -9997
23347 -9997 38251 63128 61246 66571 46047 12124 -29701 -14500 -9565 36717 11996 3056 76446
23334 76446 83749 4960 5567 47771 -8227 -76617 -125856 -151139 -89465 -17117 1068 -93144
23322 -93144 -130380 -71555 -4210 49428 -26051 -52338 -28470 -41020 -84746 -45881 54901
23311 54901 72348 18702 -72914 -72206 -45667 -3215 -46612 -34945 -61180 -59045 -39980 -10005
23299 -10005 16036 43660 -33583 -91959 -72180 -46892 -21650 30730 33799 -113 -24643 -6434
23287 -6434 53607 28834 -23889 -27951 -17763 33586 88174 55225 -4 6047 48131 38328
23275 38328 -10584 42748 77384 68927 -3315 -37985 8399 11578 -20850 -72550 -121291 -118469
23263 -118469 -66851 -57863 -15039 -12419 -62493 -119420 -116999 -38410 36138 62669 2072 -46115
23251 -46115 -35100 -52130 -66516 -81790 -67110 -35831 -72362 -20633 26130 -30733 -8431 1702
23239 1702 8403 -11537 -32460 -70597 -902 37021 -20752 -39480 -99620 -24376 90159 64005
23227 64005 35651 -10557 -8115 19383 13961 66404 94763 67307 25592 -52170 -49479 -1409
23215 -1409 -30420 -48349 -37073 12517 3124 5880 -55235 -37492 3649 8749 29873 24405 22032
23202 22032 31650 -9758 -23335 -87978 -41463 -20838 18870 73884 70471 57905 65351 -17438
23190 -17438 -66780 -51569 -82399 -109412 -60996 -103105 -115929 -111742 -109248 -96119 -44317 36840
23178 36840 117792 115362 60946 36092 56037 22784 1925 -8682 60534 91641 128447 109056
23166 109056 49471 9474 -21186 2182 -20187 6150 -4169 26970 21368 -16158 -16292 -32736
23154 -32736 -2776 69539 52364 49988 -2690 22725 60565 285 21294 -34893 -28056 -60116
23142 -60116 -52680 11509 35018 -24163 -84591 -90440 -63612 -68973 -39937 6804 14648 33450
23130 33450 80155 91382 51609 -76058 -79632 -45816 -36583 -44958 -34317 -49963 39252 81281
23118 81281 78460 64426 31883 -11039 -29457 -3142 17389 -2911 -26295 -63892 -51430 -59109
23106 -59109 -58016 -50100 -27119 -38768 -5811 -11827 31585 40850 36647 11018 -25655 23781 62291
23093 62291 36864 -28539 9316 -12173 -29517 -10644 39397 19543 -44722 -65061 -37365 -6169
23081 -6169 -39163 -67556 -11010 -34306 -94330 -114931 -114195 -101658 -96010 -148268 -116038 -1372
23069 -1372 38961 16931 4383 -11166 316 16072 -19111 -47497 -930 56702 59952 55339
23057 55339 18655 -23830 -23917 -30898 -102838 -132106 -48465 15614 26738 -16051 -41240 -61375
23045 -61375 -43051 -36614 -45288 -84245 -158389 -208890 -130297 -69779 -18599 76860 47971 -5730
23033 -5730 -17348 8450 38820 67787 20281 -2877 -19059 -22059 -10438 16310 36591 28365
23021 28365 57817 23933 -71405 -109077 -112268 -106044 -79331 -104913 -157231 -152231 -158501 -121076
23009 -121076 -2739 1241 -54942 -39334 12920 -1312 -10282 31941 4085 11449 12084 89998
22997 89998 130221 62172 8213 -20477 -47083 -96229 -109600 -154858 -145010 -150620 -128477 -73733
22985 -73733 -41694 32273 39560 12949 9931 18330 4714 22648 5802 -70914 -74354 -27547
22973 -27547 -9679 17101 4201 -1219 -30384 -39031 -45113 -47304 -21647 -76048 -127892 -107832
22961 -107832 -63320 -63658 -93048 -107628 -122138 -88276 -76515 -24904 30465 25839 -19963 -55970
22949 -55970 -18676 3165 83237 42656 53860 29094 12019 8272 -29728 -15337 -41325 -32955
22937 -32955 30451 70153 20851 1333 -14282 -70637 -74794 -37337 -32185 -17427 -22212 -23096 -15418
22924 -15418 36226 52262 52334 11159 -85288 -116790 -137951 -75284 -8565 -3561 -17802 -61980
22912 -61980 -43176 2802 -19299 -116820 -183667 -136289 -41729 -25481 12305 48373 13201 -18480
22900 -18480 -24599 -1012 37829 73861 49195 -23490 -65595 -118106 -135000 -126030 -98058 -82516
22888 -82516 -94912 -51755 -96572 -123270 -48822 -35432 -28953 -52741 -22178 1121 -90240 -86756
22876 -86756 -19345 11076 -22155 -41551 -29065 11651 -12573 -73814 -71472 -103475 -135130 -97276
22864 -97276 -39739 -32654 -37357 -9116 63428 73559 87582 26585 -28853 -44415 -83109 -115826
22852 -115826 -55982 12131 62390 51985 110145 47993 47089 87471 19390 -103311 -99874 -142933
22840 -142933 -120032 -101184 -70253 -2251 11197 -27513 -63051 -52085 -33709 8299 72562
22829 72562 130096 164565 125698 34731 -41919 -11809 -38420 -24482 44747 4545 33185 89930
22817 89930 85454 29523 35081 43438 16331 -32587 32135 39066 14613 -37504 33435 86104
22805 86104 54434 -22279 -47716 -28342 -47020 -101151 -78715 -42251 -59036 -78320 -42781 -86522
22793 -86522 -87344 -10793 52588 44162 46867 18325 18417 22616 96306 52227 -40724 -33496 40494
22780 40494 19804 -56351 -32437 1359 -60649 -20293 38046 9206 -22287 -79728 -70266 -1304
22768 -1304 1659 -40949 -50243 -61336 -52963 -57689 -109640 -129105 -143381 -134331 -63263 -49919 15795
22755 15795 -2302 -60992 -94689 -142117 -113437 -68545 -17214 69390 39717 3602 -12191 -42786
22743 -42786 -81323 -60946 -49359 -61943 -119538 -88084 -61033 -111895 -136981 -103957 -41536 -37562
22731 -37562 -49636 -30000 -42060 -51390 -80203 -81571 -4013 37263 40151 27279 41039 70238
22719 70238 55226 11626 -27911 -61429 -118140 -163782 -140880 -79770 11044 -6340 -14770 -56594
22707 -56594 -10041 14513 -10017 -37076 -49047 -70593 -30035 23177 -11543 -32050 19237 65579
22695 65579 24403 9260 10182 52516 50839 53812 40917 16273 28920 50660 16396 88130
22683 88130 144969 113855 26981 62725 96166 91483 114101 58267 13914 -31576 -38999 -38603
22671 -38603 -3722 -1817 -6833 23389 8305 -40071 -14558 16161 -10047 -26012 -7687 3752
22659 3752 -39311 -54100 -38472 -34393 -45156 -114244 -103679 -66730 17411 75717 10529 -25273
22647 -25273 -39576 -90138 -131397 -158598 -86084 -76815 -6725 19664 -12585 -7293 39357 7268
22635 7268 25245 39612 33870 6764 24157 7791 -31735 -11752 7685 -60849 -41300 -39513
22623 -39513 -43696 -52486 -38266 -50543 -77754 -78726 -42835 5593 19058 -23683 37883 45180 17024
22610 17024 -4183 41426 55814 61643 50461 27811 28092 47567 3952 34179 105490 122640
22598 122640 95664 25855 -25756 29677 23143 40160 21292 -29212 -59262 -92986 -57337 -30970
22586 -30970 17315 791 -2692 12547 4522 4235 -28049 -38496 -11748 -6325 -69537 -95358 505
22573 505 -34188 -121879 -99487 -58097 -24814 -36541 -24579 -15716 -35209 -11392 -24218 -33830
22561 -33830 -5165 -1357 21234 100 2545 22795 61037 58274 28056 9859 5940 -6005
22549 -6005 -52949 -60688 316 45987 68780 43149 -75 -87164 -64816 -3904 7004 28720
22537 28720 35874 27108 50381 9500 28622 29051 50849 41588 35867 31299 35653 34963 54159 27446
22523 27446 -1205 34670 23236 -19057 6565 47571 105152 170308 175978 129148 42984 24821
22511 24821 77123 58440 27324 31889 -23071 -9504 42358 27148 37897 67786 -15549 -44438
22499 -44438 -23626 -17184 -23191 -44915 -45202 -5178 -32059 -28483 5927 -2187 -31907 -22434 -22679
22486 -22679 -22776 -27561 -42300 -87207 33065 23239 -19857 -24501 14295 7217 2413 16112 -17061
22473 -17061 30307 -2220 -21813 34260 90781 51759 110300 135233 117065 67414 56404 -14297
22461 -14297 -41203 -17246 -7180 -4335 -8735 -24351 -78133 -49717 27189 18674 12505 -1007
22449 -1007 -2542 -81378 -86441 -64500 -15320 10612 10567 39180 57373 -1423 -51891 -73008 -80279
22436 -80279 -72648 -34742 -16534 -13414 17286 31353 51284 67470 -8548 -90715 -104039 -69839
22424 -69839 -17205 9474 -621 -54266 -81612 -59997 -33296 8758 10600 22152 55986 56358
22412 56358 72903 65648 -23451 -42231 -13445 -34131 20207 7438 3100 24263 22588 -14667
22400 -14667 -51118 3342 5719 -11423 -7510 18829 4232 21631 30424 85302 84129 80370 89771
22387 89771 78195 65016 62297 54878 31639 -11455 -38342 -60977 -93999 -133695 -81716 -32577
22375 -32577 -44008 -17328 -12781 -44815 -39267 -92986 -14727 9539 14895 -16283 -69029 -57725
22363 -57725 -53992 -47608 -33841 -34455 -14359 -23917 -17884 36814 61293 19223 3116 -20395 -19616
22350 -19616 -17857 -13038 92487 114849 97365 35077 42241 6343 -75082 -122589 -41074 48629
22338 48629 74772 32237 -4004 -8274 -23120 -34208 -5624 56571 53818 15386 -29920 -8340
22326 -8340 25648 15545 -2069 -22914 -59905 -57615 33011 49490 9322 11772 50177 76336
22314 76336 80288 35523 3129 -84918 -98193 -56897 -17403 -61462 -20559 28597 44015 46045
22302 46045 46571 51235 15058 -7110 -17164 -28248 17392 57398 18492 -12579 9085 -14766
22290 -14766 -25296 -38138 8624 34139 -41842 -73073 -84226 -65943 -81082 -95207 -133984 -84371
22278 -84371 -41117 -19673 -52493 -12484 13707 -37394 -111872 -133964 -48256 -8013 -15876 -31503
22266 -31503 20614 -16393 -52472 -46848 -56587 -32301 -91416 -129531 -140426 -98207 -22276 7627
22254 7627 43859 50742 63597 49706 16693 -1276 -15170 -29982 -75362 -143874 -67923 -47808
22242 -47808 11839 13376 21835 15189 64559 96046 85168 43627 -14889 -114592 -71127 14163
22230 14163 31241 4307 4090 -11575 19762 37185 47743 17243 -9384 62311 160178 222781
22218 222781 153719 66472 76350 33094 -8018 -42856 -45978 -42123 -106779 -104205 -82475 -78351
22206 -78351 -85630 -103543 -90772 15343 33844 37291 86651 87780 104753 109001 96610 118533
22194 118533 78479 67738 76288 75623 92010 131876 105918 25767 -12580 -51993 -65134 -64434
22182 -64434 -114979 -95406 13625 52831 106297 112179 96660 75091 98323 110739 92196 94406
22170 94406 25308 -16890 -3441 -10981 -39687 -17499 10223 63851 8351 -52196 -77166 -26130
22158 -26130 -77002 -106448 -77235 -17279 -40899 -88626 -71875 -16844 -15125 -43770 -69042 27354
22146 27354 118591 112213 127882 64897 13126 -22042 5855 52244 111485 84739 55728 65486
22134 65486 78890 77861 75824 59359 53872 112463 131224 88484 17182 -6551 -23728 31538
22122 31538 42798 -417 3883 -2891 63869 65125 68201 27036 -34108 -5523 5846 23623
22110 23623 -28493 -47784 -65976 -97650 -75019 -27939 -82702 -48569 -27226 -40650 -20246 -46179
22098 -46179 -44337 -22494 -15350 -12708 84711 87996 68454 51481 106576 87902 1372 15956
22086 15956 83164 55785 -20152 -31913 -14961 27528 -9085 32672 82030 35585 16398 -5543
22074 -5543 23978 51604 20070 6101 -5988 30137 1402 -54623 -52991 -8516 10286 -53254
22062 -53254 -87526 -55217 -35911 -18982 -977 -44131 -69810 -29675 3118 -80063 -97834 -31777
22050 -31777 -40469 -88067 -32465 -13862 -57748 -22171 -8307 -2655 -33704 -79713 -56886 -91700
22038 -91700 -128994 -87761 -73478 -46648 11131 16135 -26270 -46220 -54331 -24137 9702 -12112
22026 -12112 -37385 -57369 -62076 -50984 -74512 -66769 -9605 66469 115585 115632 96214 51725 44829
22013 44829 -21862 -12430 5203 -26407 -46714 -31302 40032 77436 68006 46744 95707 87341
22001 87341 13257 -33670 -43610 -613 12200 -37269 -88574 -65100 -17001 -44643 -90293 -50690
21989 -50690 -15283 22118 33584 36644 33229 48115 56883 59120 51265 57366 22965 -57180 -42087
21976 -42087 -26702 11689 9650 -55133 -84985 -91085 -71823 -25475 -11904 -35380 -57132 -46277
21964 -46277 -76250 -66740 -7813 6082 -8261 -36766 -58213 -69582 -111541 -141392 -138842 -134520
21952 -134520 -170883 -121861 -56256 8563 40040 56497 62604 36693 11778 -5759 7249 19466
21940 19466 38147 55103 59680 31676 30330 -8681 -20045 -7524 -15303 -24212 -8734 52185
21928 52185 108362 102192 31432 -42611 9417 60227 13419 -40451 39649 65382 -5150 -44198
21916 -44198 -1818 -14599 -67577 -95988 -125120 -122413 -100184 -116298 -40330 34039 56062 63618
21904 63618 88856 75353 -4375 -41044 -14628 30475 -18902 -10417 -56686 -74443 -24537 63619
21892 63619 63687 55240 45148 53467 70950 -10403 2972 32728 8544 -17264 12974 -13249 1288
21879 1288 -38441 -50183 -30307 -88652 -64933 -1664 9225 1112 8100 -9893 1408 -7587
21867 -7587 -85020 -134384 -47127 46382 61036 25695 53774 32506 -28411 -16876 -25918 -32012
21855 -32012 2717 32508 40475 -81840 -143092 -122088 -73770 -73767 -51456 -16111 -35036 -62267
21843 -62267 28839 27292 -20808 -66113 -46229 -6636 57386 113298 119598 127561 50419 -32156
21831 -32156 -79183 -84923 -38510 -60983 -13976 41043 7705 -21428 -12075 -42896 -24994 -44020
21819 -44020 -18536 -28791 1975 12950 -34222 -17902 4912 -41978 -34681 -40169 -56944 -5284
21807 -5284 77855 144351 99735 9102 -18835 7267 -15265 -56366 -50399 -52412 -4067 38369
21795 38369 27967 20670 80478 100754 116032 40308 6723 -28951 -3700 38023 84036 84367
21783 84367 63862 21987 -35433 -77190 -70634 -54190 -3800 -10955 -33444 -30785 -97849 -134383
21771 -134383 -135720 -73651 -30632 9897 -47348 -82174 -62614 -48375 -56806 -75254 -71931 -21359
21759 -21359 -44191 -93936 -83427 -54277 2003 41990 48059 -11145 -56610 -81168 -60325 -1314
21747 -1314 -21085 -31663 -10824 13600 26807 23673 -66726 -68256 35066 105828 148971 95677
21735 95677 -16818 -11542 54994 -5179 -8696 5100 -15745 -40102 -91529 -92193 -88823 -59767
21723 -59767 -49305 -88420 -83064 -105670 -72630 -72397 -79056 -48720 -68743 -42752 -47288 -43886 -308
21710 -308 10755 -47181 -21067 -31998 -68986 -79146 -18353 -62729 -49369 -24516 15668 -4529
21698 -4529 -27602 -33367 5837 45192 84886 117693 47510 20612 -33908 -14536 66957 91487
21686 91487 90762 45867 36804 48753 42815 -2226 6221 28368 -9475 -44414 -15002 -52480 -8988
21673 -8988 -22153 -115566 -160294 -82709 -22754 3363 -3930 -10893 -12255 -39472 -14997 46709
21661 46709 91953 51512 70074 56473 91599 139766 190413 157300 123926 98525 83377 92132
21649 92132 107987 107170 101213 83309 19764 -8750 -9449 31771 10754 -13854 7854 15810 44729
21636 44729 45253 23708 -6623 653 -11855 16482 22984 -18096 -30633 -25980 8703 18012 14269
21623 14269 21901 -12032 -138 37236 -21888 -93982 -104274 -103165 -65197 -85258 -87596 -40907
21611 -40907 -50821 -61094 -71852 -47661 -73814 -84721 -150671 -92736 41022 9490 -38391 -107928
21599 -107928 -109957 -95418 -114573 -94401 -64205 19462 82440 81563 41158 4658 -828 -23239
21587 -23239 -92175 -50059 -13270 -27588 -12220 -19172 -59777 -76455 -56531 -62394 3515 13131
21575 13131 -39348 -20745 -3262 51650 89787 89044 105672 102831 108176 100666 42965 3532 -36923
21562 -36923 -18674 -16982 -29564 -23221 6600 19393 38870 77232 53057 -18538 -40282 -63856
21550 -63856 -30821 -55256 -22325 -11686 -50104 -73457 -35247 27600 67051 75504 73948 39033
21538 39033 44643 78878 34630 -1423 -17081 -31043 -1936 69766 55803 4370 -14359 -46726
21526 -46726 -36000 -7777 -1914 -26903 -28912 -31872 -25965 19909 61249 22396 2474 -11222
21514 -11222 -2142 -37585 -12843 8714 -56221 11920 113808 28643 -45489 -36754 -25635 -18435
21502 -18435 -28696 -36959 62777 100132 43571 12549 -15784 -69936 -39444 -45432 -9901 -51329
21490 -51329 -37492 -84765 -127570 -95005 -24518 15109 -1842 6254 -15211 -40890 -52726 -13636
21478 -13636 19966 70128 24859 -47553 -50981 -10077 -12642 -8703 -25624 -11105 38311 13700
21466 13700 -33175 -38854 -58297 -50650 10839 21904 -61541 -99629 -87108 -91025 -57990 -47855
21454 -47855 7388 40405 -23565 -34092 -22632 -12227 -9725 28566 62113 45141 88922 117725
21442 117725 99846 36727 11145 5344 28735 -7568 -36724 -2814 -14610 6506 15784 -22058
21430 -22058 -22534 -64611 -48541 20913 35497 -21786 -11237 45520 79033 51416 -20125 -34896
21418 -34896 -35609 17445 104956 67759 -43339 -87345 -99681 -30677 32901 17030 41562 30718
21406 30718 15534 -19187 -57082 -93520 -38555 24069 34302 -8464 -67455 -118651 -75054 -35186
21394 -35186 -30813 -32608 10767 42399 19100 6081 17645 -25868 -62578 -36589 -43140 -91049
21382 -91049 -93481 -72819 -14450 40499 67288 38194 48920 39597 59631 15222 28976 67651
21370 67651 118162 132818 125033 19637 -4743 -50913 -77338 -52887 -18086 -666 -25691 -10656
21358 -10656 -11567 52249 93300 18348 -12552 13361 24135 -30049 -22197 23517 -12745 -66564
21346 -66564 -38893 -31818 -106743 -93182 -50770 -8571 51269 41772 14761 15852 -1368 -28858
21334 -28858 -32547 -61953 -20796 20936 27578 -6836 43711 -16667 -99823 -59163 -29206 -36688
21322 -36688 -26063 -15000 -17336 -49922 -52386 -1174 -36398 -37427 -47013 -48005 -36547 -9495 72120
21309 72120 74925 60855 31618 11108 -6723 -59047 -30479 -18294 -41927 -52366 -80852 -99560
21297 -99560 -40609 -14728 -31909 -61379 6618 59248 47623 -2211 -36021 -11035 55926 79724
21285 79724 48667 51973 43550 10401 -41870 -39567 -45513 -32110 -7640 -45058 -86657 -26842
21273 -26842 12239 -10362 11846 22191 37098 35907 28612 70382 100922 37503 57400 60917
21261 60917 10188 23376 -37169 -25158 -24703 -33631 -164 10426 -39797 -10295 -25690 -71702
21249 -71702 -87858 -58265 -83914 3423 34223 38616 5378 19862 64550 68887 72208 41143
21237 41143 91456 62846 -7131 -4413 34922 1607 -21209 -60360 -57335 -29375 13975 -32497
21225 -32497 -33590 -45929 -69656 -67309 -34390 -15191 8217 -30314 -46711 -76751 -37920 51192
21213 51192 122959 74671 33551 -5740 -34100 -99362 -114966 -86698 -68799 -3242 8267 28
21201 28 8037 47489 80938 55711 -2682 -59178 -94941 -81092 -98604 -65990 2158 14323
21189 14323 -25512 -50246 -85915 -69970 -70884 -49380 -28273 -15738 -30960 -78342 -38936 3047
21177 3047 721 -45919 -60658 -20485 -48903 -89811 -91633 -76425 -60372 -28593 -28520 -23568 -48559
21164 -48559 -80711 -73443 -87590 -55215 -16140 1448 -18742 -53489 -59580 -21318 10229 3879
21152 3879 -6969 -25061 -30394 -6740 59772 37320 8196 -9163 -44076 -39583 -7739 66281
21140 66281 62530 -16503 -72888 -46726 31602 32114 -82178 -81304 -2517 -16456 -65554 -75674
21128 -75674 -80978 -52837 -31903 -90934 -96054 -53994 -58377 -58951 -17816 47051 69531 97251 55340
21115 55340 48145 53850 63240 66911 57359 67678 97149 126460 153276 137954 104422 108307 75801
21102 75801 38966 37028 47450 36167 47826 35635 84150 63728 51643 94907 94610 70579
21090 70579 111324 171741 161057 105158 25369 -5381 -25424 17823 10942 -17269 -45075 -76707
21078 -76707 -67715 -44730 -25779 37698 62545 49783 -50378 -90417 -84878 -58900 -38836 7556
21066 7556 -13582 -26635 -21565 -36856 -11179 60062 121063 119193 61825 -7108 -10159 62301
21054 62301 69684 15812 45658 39157 50685 11839 20493 -10503 -45241 -36255 11492 46355
21042 46355 54518 8957 -2971 18229 25487 30902 46515 29110 6934 21795 71937 75941
21030 75941 38458 -12019 -15476 37195 81328 56186 35359 72659 30907 -93484 -129464 -88435
21018 -88435 -16518 40501 59377 64927 43966 17518 29186 33488 -23964 -12045 -33697 -49969
21006 -49969 -71105 -38445 -24859 79841 120531 75484 70887 40696 -24999 -57963 -39144 -51208
20994 -51208 -44514 -7112 -31128 -27714 -78130 -135549 -131537 -134160 -112084 -113217 -94463 -105111 -155074
20981 -155074 -148659 -85993 -45220 -62657 -64218 -13893 33120 29446 36252 6168 -84177 -87443
20969 -87443 -25522 -26866 -67968 -725 -775 -218 -15169 -15719 -40571 -120443 -164011 -82976 -6678
20956 -6678 21945 -590 19195 1439 21083 2577 -109613 -118268 -37273 39023 65307 33923
20944 33923 25330 27801 13780 -16559 -42145 -36939 -17475 -41595 -60021 -77312 -43449 -45899
20932 -45899 -17031 -35747 -39272 -27565 -28222 -56299 -27412 -10711 -33231 -68854 -71587 -50557
20920 -50557 -28844 -12024 22212 82448 115348 83915 37500 29515 80944 93255 34561 16825
20908 16825 -2350 -17355 -47831 -80952 -56580 -98381 -135656 -99066 -121410 -118889 -124160 -73379
20896 -73379 -26069 -43309 4194 -46325 -110043 -125589 -106279 -88281 -21958 -16927 -53178 -40677
20884 -40677 797 -25859 -62418 -51626 28290 69345 64692 45281 12639 -85095 -121279 -53771
20872 -53771 14563 -3832 -35086 -52331 -132306 -122102 -106303 -112326 -97300 -49164 -44657 -11855
20860 -11855 -12471 -2880 10040 37588 39817 -31845 -100554 -65038 -118252 -149902 -94388 -23327
20848 -23327 -53393 -14343 47429 95156 51077 31442 40730 47226 78194 63475 79742 58707
20836 58707 23228 -16377 -29735 -92451 -147844 -72133 18884 653 -77130 -70253 -16192 -58302
20824 -58302 -24316 -5144 -3762 -34562 -99106 -74270 -42181 -53956 -42482 -49641 -3236 43532
20812 43532 71293 34058 -2001 13708 -2288 41335 -23105 -91763 -74037 -82588 -115222 -53877
20800 -53877 -59899 -101170 -71301 -97513 -32573 3994 4361 21856 24135 75808 73698 3308 -25915
20787 -25915 -71728 -11464 -3798 -46507 -43837 -45301 -34200 12445 11711 -25888 -17401 4694 -34661
20774 -34661 -79916 -35318 -5945 21880 58026 50633 25103 -11790 -31403 -27537 -2301 -13625
20762 -13625 -60593 -39226 -32225 -34306 11961 52439 120750 55447 -18648 -22064 2239 -63573
20750 -63573 -94184 -65506 -27367 9506 -29785 -32878 -76474 -94106 -80562 -62661 -11070 -5495
20738 -5495 -20646 -23439 -52906 -93795 -103246 -34292 -32159 -65923 -14024 27758 101 -24678
20726 -24678 -83282 -48752 -18978 -20119 -43610 -8482 -16730 5202 44493 95613 80924 20985
20714 20985 -20142 -65549 -85019 -80230 -62918 11925 43414 59389 61595 4450 -14849 23886
20702 23886 85641 86048 89227 67154 61266 76829 52461 -74737 -91577 -71203 -44557 19295
20690 19295 24305 75 -63195 -57382 34277 32819 9213 -62326 -114708 -102689 -79184 -93126
20678 -93126 -99526 -41821 -17325 -37671 -43711 1475 44118 6737 16743 38856 86059 67648
20666 67648 60015 38262 42359 36106 -37233 -9159 69424 89314 83123 55295 1010 -3356 -5738
20653 -5738 -26544 -16600 -39633 -19391 -21806 -37934 33171 116565 115176 65015 -25022 -3802
20641 -3802 68655 53339 -14219 15338 70185 75741 41585 -12878 -45549 -62668 -95817 -44505
20629 -44505 19225 28346 -28095 -93773 -166056 -167276 -134071 -53625 -49641 -69128 -81637 -81098 -84076
20616 -84076 -107016 -109787 -76760 1980 11582 -32906 -45525 -68478 -40922 -22953 -46780 -21668
20604 -21668 82622 157897 183565 104347 42767 54553 71239 85571 45474 7778 11856 10605
20592 10605 17379 32347 -2090 -29259 -60448 -53849 -40100 5814 29220 -27662 -15348 68051
20580 68051 55312 44504 29580 49514 91787 120443 100099 62235 30874 692 16922 63576
20568 63576 34068 67019 42093 -12442 1779 60896 42513 -23640 -54725 -107403 -68445 -44670
20556 -44670 -77674 -83029 -76178 -61539 -106329 -69599 -109995 -102908 -45365 5352 56321 49929
20544 49929 34355 36510 10157 23271 19847 -34001 -9120 -16541 -24934 9721 13795 8414 2727
20531 2727 -66755 -70813 -70557 -59641 12783 66991 36484 13119 14437 -17271 2841 -86263 -101299
20518 -101299 -98566 -38704 3572 -31675 11516 51877 23901 4500 42943 30899 18835 6469
20506 6469 -14679 -16117 -16573 -38389 -125154 -166985 -132054 -96432 -115579 -114473 -60586 -21619 -1960
20493 -1960 13204 -33111 -55556 -68854 -25892 -25050 -7742 44056 17453 23367 15335 10529 34048
20480 34048 33274 37851 7886 -59596 -98590 -66454 -15989 34083 -9337 -18959 -119 -19862
20468 -19862 3337 27514 39096 49895 -22211 -78849 -53458 -59547 -87635 -82925 -63791 -7399
20456 -7399 6774 40987 14273 30146 8593 -33917 -27779 -27495 -47474 -14976 16173 26529
20444 26529 104141 59634 -15228 -15784 19059 -4867 3126 20213 -53991 -67292 -27626 -8237
20432 -8237 16859 -37154 -55077 -52380 -39437 -60373 -112352 -95552 -86109 -97658 -67623 -50153
20420 -50153 -16861 -32086 -76277 -94692 -75203 -61720 -16991 1053 -9861 -8501 24869 14780
20408 14780 44662 82340 68440 -2413 -104106 -115772 -91840 -121989 -75472 -31223 14925
20397 14925 32958 -24148 -53301 -13162 -5959 2499 -20228 -27564 -16013 5704 -59416 -84799
20385 -84799 7639 52319 1789 -60155 -102490 -100395 -49354 2163 31408 -20400 -31978 11531
20373 11531 85126 28631 41563 47303 42369 62591 137416 154049 105598 77910 45442 -15299
20361 -15299 -24739 -97886 -170096 -157804 -95077 -88992 -147264 -123328 -61858 -24451 -29423 -37539
20349 -37539 -64567 -31431 -60926 -139035 -130823 -129057 -107434 -59444 -35928 -16495 -55128 -86368
20337 -86368 -29677 14991 -21318 -34993 -29467 -30170 -50572 -31054 2026 36213 58860 66720
20325 66720 25372 25531 72985 85276 45970 12066 -25116 -20608 -69163 -69318 -20942 -2869 50266
20312 50266 62227 26546 -1309 779 1186 11010 11390 -26942 -22562 -14840 -26405 -51924 -38051
20299 -38051 -67359 -89655 -167805 -119591 -44636 -39931 -4120 -3660 -76917 -128726 -97536 -40787
20287 -40787 -48145 -33621 -23496 -1317 -8438 -37354 -39088 -41933 -13578 14969 14574 49356 16862
20274 16862 2761 -13615 53164 83834 105181 -4020 -28481 38426 75875 103725 57256
20263 57256 -14903 -50927 -50247 -5861 7041 -21082 -3310 48822 84314 26731 -13733 744
20251 744 -13215 -8157 1481 7417 -58815 -78038 -58033 -25994 -6344 -23377 -39087 -47226 1046
20238 1046 26862 -12231 -22726 1722 -17581 -43894 -75941 -64596 11260 58972 88938 74739
20226 74739 21947 -14365 6187 19989 -32562 -100901 -84355 -51551 -32209 -29831 -32815 -23206
20214 -23206 -10370 5967 40933 26776 -35667 -22267 15791 807 -16305 31354 14251 14695
20202 14695 49761 116447 130569 123619 82256 100038 102655 63546 32437 -296 -4266 20370
20190 20370 20265 4520 34699 -134 -21916 -3770 26986 62824 34923 33167 43301 44013 31804
20177 31804 27745 38469 46096 69591 87389 70403 48560 -34852 -76332 -52500 -19334 1230
20165 1230 34007 -1386 -476 14623 1985 46945 26084 -19988 -1810 36731 46070 28771
20153 28771 -21296 -71175 -78194 -120262 -128742 -90542 -85637 -16999 -21987 -44997 -93897 -131003
20141 -131003 -113978 -52129 -54250 -29038 35479 7802 6283 -7983 -7588 3006 6123 11656 -29933
20128 -29933 27118 42557 3988 29245 4226 -2249 4554 32892 -21501 -84121 -103643 -71312
20116 -71312 -12041 14506 5688 -31250 -15367 8666 64054 105831 80280 15678 -41036 -86779
20104 -86779 -9981 -17824 -12718 -50224 -56508 4417 46929 87508 80368 48917 9023 2900 53217
20091 53217 72227 -26253 -42820 -32066 -27532 17597 9530 8263 22276 -45040 -37652 -35078 -7417
20078 -7417 27098 -32777 1892 23003 35350 77782 71606 156861 161357 144452 183207 167010
20066 167010 108783 8866 9384 -672 47084 43939 14946 -65214 -44325 -1301 41144 890
20054 890 7127 80 -13949 15698 31036 13256 -38791 -55200 -24735 75635 21972 -8066
20042 -8066 -9865 47879 20310 -9919 16091 13385 -35856 -14560 -24574 -47923 22264 44494
20030 44494 66956 25115 8720 14634 -1959 42672 106886 95213 80436 90285 79280 66327
20018 66327 44581 46370 51431 80426 50345 109432 140046 208750 137874 -30966 -60117 -22646
20006 -22646 -79512 -34587 31403 114985 133343 115039 62284 84126 105490 94678 129180 166915
19994 166915 208818 225725 198968 167088 241465 372330 531166 744652 1029823 1319340
19984 1319340 1543490 1554601 1403190 1162550 931936 723307 628050 504182 399378 347373
19974 347373 281285 209345 185123 134393 114254 114839 102942 81715 63919 84210 72944 83809
19962 83809 61645 69885 72060 60836 110389 144419 163529 174813 160207 163630 121722 105315
19950 105315 101018 63981 79368 137768 138644 52453 -66628 -61055 -104122 -7611 30500 -10110
19938 -10110 -21523 -14667 10192 -66764 -81389 -15296 -17846 72122 120152 99690 37350 -35814
19926 -35814 -41518 8686 -15615 11825 -16173 -95535 -106438 -25663 -1132 16571 69123 95433
19914 95433 78652 55825 -38141 -67855 -105324 -73520 -90620 -97150 -86881 -77040 -64119 37684
19902 37684 84001 53587 73104 51955 63574 34279 15416 20439 10477 -20115 -5755 42619
19890 42619 66264 37786 43661 55638 107386 133750 119242 86367 94954 87817 36053 64980
19878 64980 73641 93318 137839 129628 99653 80923 25654 31716 69988 74518 88253 133637
19866 133637 174606 122219 43322 120176 89470 64285 70978 103473 42409 -16526 -24102 -12044
19854 -12044 28389 31352 8630 -40192 -4770 58904 37589 -26740 -34762 34576 26588 -49291
19842 -49291 -72212 -67631 -64694 -76434 -48977 -24137 -90591 -49846 -442 46628 43051 70617
19830 70617 52416 -2451 -52684 -58769 21323 76077 76751 63935 69682 21795 -17640 -4010
19818 -4010 35264 43740 27349 55534 98971 86585 50662 40532 8569 -46661 -8106 17253
19806 17253 27810 61471 64347 95878 66082 66855 95851 78753 50745 47688 343 325 -13320
19793 -13320 17449 -16553 5759 14894 -14866 668 77305 60419 53661 78739 4555 19494
19781 19494 13008 -27836 -7473 -23764 -8466 -34740 -83611 -48834 -39974 -45975 -48270 64240
19769 64240 79620 47881 71513 37136 18647 -11139 -10903 -20585 2252 -11216 -33583 -139857
19757 -139857 -121210 -46228 -9900 -26016 -13236 -34499 -80800 -86014 -105969 -97854 -71952 -12512
19745 -12512 -15226 -12126 -2047 -4176 17382 39072 28432 58887 64647 43072 39532 21701 5865
19732 5865 15 2710 14815 1710 75962 120544 104295 90321 116431 151119 169659 207192
19720 207192 235085 205707 153224 165945 155062 90270 45270 110341 117997 55090 -19561 -8472
19708 -8472 7596 55176 37240 49179 39681 92478 130014 147193 83289 6749 13962 -13174
19696 -13174 -503 -19028 28918 29883 -18476 12459 32860 18359 7069 50649 61090 35820
19684 35820 34610 13974 -30636 -102685 -108497 -106316 -30694 18947 50945 26036 35019 62046
19672 62046 9417 -57609 -44878 -12533 10937 7314 47949 79090 106089 151160 132804 87262
19660 87262 67804 37857 6099 34757 104765 121089 122297 127715 116965 121594 105761 39015
19648 39015 40913 114121 178770 198007 181651 76313 -4242 -49893 -65719 -56375 -57392 -29093
19636 -29093 10628 47721 51513 84295 103830 84400 20114 -35486 -2754 45223 39944 17219
19624 17219 30173 157900 145895 154098 255524 358694 328100 253248 204380 220691 260545
19613 260545 244285 298524 393740 421844 348356 278011 232664 213781 175988 155716 122793
19602 122793 111773 151912 200724 325770 482627 589414 780181 974294 1018135 931430
19592 931430 654855 419916 291884 260117 248760 242835 250264 203500 181163 118673 175735
19581 175735 180028 157685 159305 176689 197746 195895 182902 215062 282114 377988 506442 736829
19569 736829 963872 1007014 872911 648488 441554 236588 117975 82643 34594 7731
19559 7731 68516 107060 115313 130683 153015 208046 193178 154019 150495 104038 104364 110669 121696
19546 121696 151538 77747 104762 194556 223495 218455 171601 168774 177229 133570 70427 38325
19534 38325 30494 46769 28605 73860 69785 25068 52349 87604 61014 5383 27860 89840
19522 89840 66633 -56706 -110253 -45238 49483 62943 6596 4952 132333 186012 214224
19511 214224 163423 159810 136128 209260 249707 255811 281039 275050 249172 239421 224820 238818
19499 238818 220008 239749 277764 256497 244453 198181 155866 139615 132854 186663 193091 189388
19487 189388 146767 143784 207005 268700 265082 192594 181977 236583 241852 248996 258335 243934
19475 243934 257433 278124 279295 208504 159960 145581 211418 240677 200361 148532 132109 85140
19463 85140 14042 20715 143173 129325 114269 136718 161722 224467 273991 216070 228924 210084
19451 210084 159203 95821 73180 114545 97497 50264 71458 61830 6658 17940 10062 48978
19439 48978 93230 103301 114076 119047 106204 109756 158077 144195 119841 135509 223183 288568
19427 288568 207690 140928 179964 214484 183537 167548 148189 169872 236679 294055 334557
19416 334557 342369 386660 415770 426881 425434 396605 384486 460830 568137 577943 424931 250959
19404 250959 54837 -138665 -264295 -314899 -293263 -252245 -246221 -188366 -112951 -96782 -116557
19393 -116557 -85314 -67591 -108743 -127016 -102591 -108180 -65953 -12286 -14354 31056 13653 69900
19381 69900 157811 136108 101896 101834 79315 -2758 39303 75772 98066 99668 40276 28127
19369 28127 52295 38635 -8208 -59699 -14375 27012 66506 70861 89053 85445 134699 106992
19357 106992 70841 65394 105068 99012 117285 176707 167290 218204 160369 109514 148065 206962
19345 206962 208535 250636 328267 354135 377369 342663 309318 324385 320177 342714 320707 300458
19333 300458 318518 348236 314717 289644 333612 413414 402719 496218 532700 549518 560268
19322 560268 550022 517186 511993 420969 434386 466586 498532 456848 446321 528415 484168 384913
19310 384913 284037 298062 372111 449836 484132 494920 517003 502345 479408 565513 609022
19299 609022 677282 755173 793483 846555 934401 1029679 1198425 1425341 1612980 1777429 1836035
19288 1836035 1794015 1716343 1670253 1639089 1708385 1923011 2217486 2545337 2879263 3276057
19278 3276057 3713089 4080724 4302728 4291230 4166378 4131380 4226179 4442554 4813582 5304125
19268 5304125 5915846 6675278 7654258 8885262 10205144 11618897 13113012 14811756 16997250
19259 16997250 20102426 24526244 31095457 41038490 56405412 80550493 117617037 168798235
19251 168798235 227146461 277122154 300209974 286162370 243231591 189215748 141610398
19244 141610398 108715306 87976919 74662234 65652163 59010734 53456525 48269351
19237 48269351 43229010 38582491 34402248 30585225 27079777 23952490 21233442 18974001
19229 18974001 17037832 15344105 13950933 12860540 12004658 11354969 10730479 10110702 9389786
19220 9389786 8622981 7847622 7056006 6290839 5750679 5287710 4866631 4467130 4115663
19211 4115663 3895677 3698618 3488867 3462175 3364725 3257654 3111570 2877744 2656240 2492546
19201 2492546 2405486 2315506 2237786 2150894 2163385 2190860 2142306 2064405 1810901 1597867 1509313
19190 1509313 1514939 1427490 1298437 1256330 1212586 1142551 1107028 1069339 1034902 1033837 1025603 1046246
19178 1046246 1069843 1046803 992198 959379 984716 998243 1062585 1075444 1035920 973363 863211
19167 863211 620723 429848 386232 364255 343350 389704 481141 495264 540073 556193 547463
19156 547463 538505 529970 571012 674498 690405 728221 843886 1007015 1095011 1165532 1155268
19145 1155268 999909 839147 741330 712963 698177 674450 592950 493097 476547 512101 487730
19134 487730 515932 503870 511360 567257 650089 746545 749376 747340 816251 890487 951016 964624
19122 964624 948994 834455 775189 692772 679328 652599 732634 763593 726117 747771 735957
19111 735957 688763 690730 800023 850444 916140 966872 1002085 1030174 1011607 998891 1016224
19100 1016224 1099444 1102779 1142586 1162327 1176785 1056386 822327 642029 482778 434105 549550
19089 549550 762632 904443 1010137 1049674 1022366 1023993 1091122 1270140 1516742 1896479
19079 1896479 2268005 2701852 2997727 3125689 3065298 2781617 2324511 1941156 1792130 1745122
19069 1745122 1667587 1661249 1794122 1918038 2050024 2116761 2226914 2333118 2443944 2579474
19059 2579474 2736829 2857153 3010205 3281472 3751384 4350841 5145318 6111249 7221093
19050 7221093 8372477 9409728 10410669 11667520 13794944 17540584 23726782 34230354
19042 34230354 52455342 83130654 126034551 165952171 182909472 167236620 123484185
19035 123484185 83423622 60359538 47624991 40129089 35505649 32721983 31220442
19028 31220442 29984461 28465411 27035202 25723881 24484422 23376073 22645019 22465303
19020 22465303 23389991 25966402 31090401 40264379 56741075 85378007 128110473 172665586
19012 172665586 196842556 187727701 145147844 98093851 69307815 53506853 44210601
19005 44210601 38344650 34634906 32257957 30272213 27827131 25042903 22243563 19683394
18997 19683394 17343071 15282032 13562374 12087308 10842999 9649558 8559193 7613162
18989 7613162 6931193 6362780 5859846 5370246 4902787 4397084 4052391 3826578 3614354
18980 3614354 3443171 3297908 3258111 3272581 3233234 3085447 2773793 2407405 2075102 1806425
18970 1806425 1645542 1531450 1480845 1404573 1352733 1276775 1190286 1152318 1101476 1054375 1072405
18959 1072405 1048029 995712 961390 1001436 921425 818588 790057 760348 697989 685129 703548
18948 703548 658504 685651 663941 661794 640661 678346 695879 731921 732547 717167 781969 846582
18936 846582 848296 780422 696276 647172 640333 595208 665803 781726 898582 948598 997860
18925 997860 933243 777742 728315 734963 698527 716869 757944 745712 775831 753454 723587
18914 723587 676827 646957 662221 647137 602829 614871 595051 594712 625582 605752 612884 711060
18902 711060 745616 721375 683733 697231 677025 632812 616346 652421 626786 663103 690470
18891 690470 733553 714747 810606 893936 979167 1035669 989809 829670 651685 492996 353748
18880 353748 300545 380044 399443 377268 403684 421003 370744 390464 404810 450355 492807
18869 492807 528577 525677 568511 529710 506254 498481 548235 616329 627926 654759 731950 745258
18857 745258 588693 347812 217100 116418 103391 119614 171845 243039 305438 340487 314104
18846 314104 300625 280308 258743 290086 344411 427595 396814 293578 270059 229912 292883
18835 292883 371679 367106 356486 393913 388130 328710 346761 331117 265821 271106 273109 328098
18823 328098 358306 351839 275488 291203 354058 388844 356634 388689 407969 386564 351496 358586
18811 358586 362218 256797 200518 177950 189520 217443 228826 281890 290325 277295 263431 255144
18799 255144 277257 356285 471531 577822 662179 679953 702250 675493 664286 647760 785806
18788 785806 987153 1207043 1362156 1415182 1303728 1107806 903180 701727 619476 562710
18778 562710 510518 500342 417473 390898 397721 343859 284487 217893 190633 152333 137269 151549
18766 151549 333239 582224 803392 1011669 1159227 1193243 1165318 1131023 1038019 866714
18756 866714 672531 580855 564556 544023 527892 525196 506319 404769 339426 306536 298338
18745 298338 302256 277017 241489 245767 224972 239853 255318 241830 246644 218859 276474 315799
18733 315799 308165 259871 255220 268441 336073 344213 407241 436693 398926 361928 376317 330397
18721 330397 241610 202441 228535 265902 209795 204914 285690 342728 345801 246821 250630 320331
18709 320331 298999 256262 250326 220405 248552 356521 429428 422627 337919 325368 380957 338237
18697 338237 298595 286494 290732 278613 259856 256196 272079 242116 191159 215445 343844 447556
18685 447556 432837 365848 305763 302676 335705 360995 332102 308189 284549 313506 345343 373393
18673 373393 368465 337158 306920 228752 201178 205954 234558 207646 187132 242473 321850 282384
18661 282384 267262 316076 318681 231403 149460 128585 114404 86599 24367 -28843 9194 10448
18649 10448 23912 35291 46796 66997 146778 194247 192226 216170 283435 360778 334367 309553
18637 309553 335584 394551 383132 356888 373623 384064 351218 357475 384658 353101 396794 449334
18625 449334 421365 440456 467045 442173 471095 538416 578852 600772 654885 739942 705317
18614 705317 664837 513937 297371 85302 -25343 -104525 -214555 -254279 -161217 -51713
18604 -51713 2467 22055 17196 2685 -29279 -10474 55214 172035 229482 163660 199421 317242
18592 317242 297352 311176 279924 315642 402083 348474 289896 255420 202287 169385 143581
18581 143581 116679 126930 112423 143649 143056 112101 159964 183127 163036 130966 123555 169931
18569 169931 293801 338105 361556 373904 403823 402434 432055 450334 394920 378495 427586
18558 427586 445282 412833 395945 416761 431135 384614 397485 455955 485546 381801 360289
18547 360289 358206 405276 471304 555354 610876 680495 707817 680911 603257 600620 629463 613042
18535 613042 630196 625227 670420 683416 678916 635623 599995 518811 431764 420981 474414 575263
18523 575263 643649 717688 775805 888944 1055341 1212711 1386499 1637252 1975174 2362179
18513 2362179 2655453 2707422 2725655 2696023 2646854 2716958 2869630 2958101 2990964 2867730 2634686
18502 2634686 2441030 2185886 2043850 2022871 2095922 2279178 2539739 2941505 3282357 3449067
18492 3449067 3610503 3673323 3621410 3548915 3530358 3617034 3684424 3729714 3808518 3842213 3914003
18481 3914003 4068343 4297147 4643440 5078394 5675608 6285671 6813178 7300741 7994008
18472 7994008 8914398 10089766 11552381 13417074 15806995 19012703 23571742 30190729
18464 30190729 40261313 56111800 81199463 118722383 168330756 223386833 270528622
18457 270528622 294091270 287569234 252912319 203650878 155691723 117558167 92540954
18450 92540954 77035725 66855262 59402006 53209821 47523551 42166979 37195757 32694628
18442 32694628 28743598 25387314 22510676 20118045 18085401 16267399 14573255 13187316
18434 13187316 11934797 10837182 9890122 8975815 8222987 7657355 7124214 6734866 6417606
18425 6417606 6100800 5792569 5611348 5487612 5264486 4861242 4430548 4011138 3505509
18416 3505509 3035679 2727907 2589643 2471779 2321695 2163888 2044142 1944967 1841624 1792257
18406 1792257 1783705 1765859 1830714 1961213 2168748 2472711 2700107 2841515 2818584 2672686
18396 2672686 2387720 2127239 1914392 1626731 1360882 1172426 1055958 955500 905794 906466
18386 906466 863050 786585 807892 874025 921405 933280 929774 961429 964439 918775 889159 798908
18374 798908 729078 748480 802129 820182 817023 828309 771548 675271 549788 423627 257806
18363 257806 174553 248330 344981 362183 358625 336861 396628 551697 620313 600185 576009
18352 576009 571622 536264 540070 509504 466747 478816 486678 501079 416505 488024 567818 604867
18340 604867 581527 514912 472329 476228 540920 638126 688641 749313 787408 843632 828928 718944
18328 718944 662660 657055 665563 666252 677887 690734 647988 582335 606614 654280 756656 884588
18316 884588 960330 1094593 1227391 1224798 1183731 1145558 1094024 1093902 1115138 1109344 1108952 1130137
18304 1130137 1137658 1063002 889767 624789 398384 261108 224542 226174 311970 369193 422918
18293 422918 425716 460633 527892 520664 510509 524261 550280 517015 550215 595788 567855 622677
18281 622677 734642 849235 997397 1124299 1398910 1696153 1813257 1893044 1818425 1725945
18271 1725945 1576691 1450448 1419351 1519203 1664499 1737653 1858294 2050895 2163780 2259905
18261 2259905 2408773 2522817 2723752 3016072 3398476 3873232 4380391 4952622 5535872
18252 5535872 6131644 6828460 7699573 8694911 9765014 11092761 12782000 15209084 19145240
18243 19145240 25667581 36863163 55604785 83921895 118888815 151753411 170913220
18236 170913220 166880047 143407853 110913846 79993524 59404872 47823808 41287320
18229 41287320 37446520 34894505 32693875 30458788 28015146 25789005 24101066 23089387
18221 23089387 22814871 23228384 24474448 26946865 31523962 39785272 54520520 78267847
18213 78267847 109572175 140965392 161856625 162038884 142161190 112201276 81637164
18206 81637164 59547623 46576942 39064480 34451857 31319209 28758022 26279780 23569207
18198 23569207 20821384 18281291 15995404 14170527 12775483 11742599 10813141 9879667
18190 9879667 8937877 8039893 7153815 6372260 5681422 5110950 4605971 4204037 3912686
18181 3912686 3655923 3349555 3100412 2885528 2811956 2717954 2637194 2603770 2486266 2315802
18171 2315802 2154176 1986063 1779695 1575591 1486117 1421595 1294686 1163715 1062886 934980
18161 934980 881003 811851 722844 682619 738124 851111 922247 855665 764182 731963 727862
18150 727862 710376 723019 731721 769562 863506 881976 870985 896236 845862 757533 734457 732358
18138 732358 785129 820815 832296 787641 726657 800882 898950 945087 1052340 1090086 1105038
18127 1105038 1101650 1060665 1108441 1180352 1308100 1427286 1591433 1784059 2017240 2341112
18117 2341112 2755046 3194298 3700903 4331333 5324778 6852292 9219023 12957628 19273170
18108 19273170 30473754 48828639 71487296 87812634 89272516 73221468 48794550
18101 48794550 32669942 24181112 19498998 16649804 14806284 13575323 12585189 11402804
18093 11402804 10063803 8805684 7686984 6786775 6051986 5377013 4890977 4470782 4078924
18084 4078924 3750464 3357661 2914084 2512743 2197897 1949732 1680624 1521486 1431168 1317372
18074 1317372 1278691 1172451 1057232 959153 861133 808999 797850 718557 680081 712761 773717
18063 773717 754650 716369 682015 704358 637946 577247 520726 389221 228004 116447 -19156
18052 -19156 -95322 -31540 92758 159702 195982 238590 248423 188650 194062 176087 122002 90089
18040 90089 112004 119572 100044 96512 140462 149766 181567 182434 150564 111968 89430 86426 102891
18027 102891 113011 157475 111067 93425 129151 163691 143855 148929 140622 135621 183242 185166
18015 185166 153216 83155 90013 81335 7322 5560 52409 102748 115131 62236 48850 88549
18003 88549 108179 98832 165333 176180 136151 97863 54595 -7806 -43913 -23051 21427 9987
17991 9987 41624 86438 72253 33815 38113 49986 -13777 -1758 52394 98932 69717 72745
17979 72745 148590 136193 128288 111068 91631 54301 110689 132813 150197 83883 85712 177464
17967 177464 140699 146847 158572 158058 153138 159641 170597 156080 177180 188483 247836 262633
17955 262633 289598 289107 233077 213417 258398 279764 139850 45212 -65385 -39035 -10999
17944 -10999 29424 34886 84232 52380 45563 -17487 -75821 25188 80388 79731 81947 70859
17932 70859 130293 166447 163803 191071 268357 328122 292498 283460 221462 148463 137366 130675
17920 130675 83639 122602 128411 162699 197604 166459 147246 150940 174061 172445 133510 91463
17908 91463 29465 64084 48311 5138 -3608 26582 98123 155080 192368 184383 165551 157149
17896 157149 165374 167518 151595 144008 130687 214297 213519 122654 190406 204152 188865 230609
17884 230609 185532 129079 72370 44851 131744 217361 235087 203954 215405 141691 58785
17873 58785 65680 40295 -6724 -23245 -26632 -17310 19125 -5139 -56533 -36283 17249 65781
17861 65781 74195 50533 -4221 -23566 17399 93546 138044 88566 19046 -39034 -31840 79560
17849 79560 150997 90784 90814 167032 210178 197322 189544 193619 253114 283688 290787 328317 340049
17836 340049 388268 496198 657165 848889 1053856 1313754 1541893 1581948 1492317 1274494
17826 1274494 1002704 833692 662955 523313 450568 375837 386639 364771 311727 255759
17816 255759 179481 188813 243971 281503 268749 234670 225781 226820 214957 248799 165294 133261
17804 133261 118156 95489 96005 33654 5206 28867 90923 92688 114216 139622 141942 100928
17792 100928 132057 86105 43117 43553 50025 96250 132441 106153 73895 59688 8258 -11653
17780 -11653 28343 26084 60963 64970 146662 155260 168217 56475 -28977 -28153 -60331 -58462 -62531
17767 -62531 -92126 -21869 35117 55080 -26904 -34209 -21470 -52712 -68090 -19865 -17354 -51164
17755 -51164 -39242 -79119 -85415 -31088 -10442 -10475 5141 30463 48678 -9600 -12115 -39058 -83649
17742 -83649 -87502 -53489 -45185 3496 -5316 -29535 -72360 -7201 51063 87092 29767 -9025
17730 -9025 -28908 678 21746 30122 1778 -38859 -72611 -69870 -105810 -86824 -64024 -41278
17718 -41278 -26098 -47621 -3374 19560 26227 11851 2869 33100 59822 -18520 -39385 26991
17706 26991 78014 79715 83625 120720 121329 39297 33910 59046 52451 75333 90272 25137 55729
17693 55729 114660 122888 72818 62460 134008 174180 178000 238317 378286 543783 698652
17682 698652 756278 794118 784145 653196 457185 350963 245078 221680 195421 202669 161365
17671 161365 147060 121193 126039 99200 81943 61396 63499 77062 52619 63226 198712 292277
17659 292277 324473 433120 604919 787583 872095 775672 671902 537779 364620 286278
17649 286278 223039 164156 137877 136692 132774 101862 133524 143611 101693 75344 61953 40381
17637 40381 11683 50886 74560 59397 20361 28089 -6374 12178 -4127 -99871 -91866 -46223
17625 -46223 -50288 -14635 -23574 -44434 -84891 -61728 38990 72643 29582 31957 19141 32272
17613 32272 50119 84520 46756 -21793 -41838 -77656 -40073 66202 74875 59891 84861 141956
17601 141956 164924 172801 81532 23234 40354 50439 52972 43929 75674 113045 91424 72534
17589 72534 48941 27256 17525 -3681 -1296 -10859 26379 -4687 -7354 -49890 -29329 -28648 -76167
17576 -76167 -95976 -113366 -52518 -5279 38046 55626 60039 95753 75564 43 -3698 -21660
17564 -21660 -50966 -20700 3013 33997 25511 -35240 -72197 -105616 -77913 -1362 8535 -54691
17552 -54691 -94101 -105153 -94118 -82439 -90659 -92550 -134982 -141563 -82544 -48680 29864 43776
17540 43776 35469 6648 -15113 -14565 -60845 -22041 -11935 -27192 27063 40023 22882 -20003
17528 -20003 -32028 22925 68820 81321 87704 61912 55117 85596 86023 82309 162345 150460 107856
17515 107856 28974 8793 -33127 -35649 -33090 -42408 -7152 -38357 -81745 -67855 -15716 49455
17503 49455 -19459 -3982 5216 58795 70329 80197 71985 39049 -26388 -42703 -4757 -23191
17491 -23191 -6269 -23432 43834 81249 77728 103809 87385 34110 92206 109473 80860 8308
17479 8308 -15371 34023 74746 80107 71742 22941 21785 3453 58476 46039 28023 -31190
17467 -31190 -25135 -19809 -53561 -31919 -16750 -13557 -1929 -31602 -50301 -66866 -109887 -87446
17455 -87446 -78825 -62135 -24908 -16743 -51593 -74563 -65022 -62291 -52200 -12274 -21979 -40966 61363
17442 61363 174620 274164 403202 435571 415071 380602 293096 206169 171924 143341 60483
17431 60483 41363 60094 114891 122434 67080 50345 55563 19043 45605 79440 43924 -6130
17419 -6130 -40752 -74948 -8998 -8338 -63006 -45218 2428 39354 61913 9312 46911 85533
17407 85533 94797 48698 -19711 -59316 -52955 -88549 -87198 -57084 28011 67344 58284 42112
17395 42112 64247 69163 23995 -10649 -67318 -42823 -22535 -108376 -134961 -89855 -45608 -66778
17383 -66778 -131233 -109799 -70930 -41791 14903 -45936 14056 -30438 -67254 -89402 -105477 -108050
17371 -108050 -32183 28296 10393 26124 34815 10729 23653 7793 -14187 -80136 -76632 -51601
17359 -51601 -44801 -78148 -22299 27906 6258 25423 20509 2190 -40217 -37667 -8393 -19764
17347 -19764 -17289 -29130 -100547 -71438 -2128 8674 -51630 -87139 -89534 -88502 -71840 -70508
17335 -70508 -33057 -44379 -61666 -88644 -134979 -83073 -96849 -77091 -32813 27226 48059 -8167
17323 -8167 -18382 -25800 25158 43384 103033 71803 57793 69582 50157 34113 34733 5171
17311 5171 2436 404 16388 61452 35586 41686 12348 172 -2740 -48945 -75664 -22751 -40341
17298 -40341 -2705 62891 30695 -8090 17563 -27542 -67307 -49648 -24336 -16365 -2069 20032
17286 20032 -7362 -66816 -95487 -50863 -42250 -71509 -93954 -101797 -30395 12618 -30145 -35087
17274 -35087 -37790 -53560 -31603 3952 44080 45115 27972 51135 146205 162344 86516 -21138
17262 -21138 20411 4390 -32108 -31855 -35967 -77804 -110331 -62869 -51988 -80980 -96407 -151680
17250 -151680 -121469 -77807 -52927 1903 7358 5183 -26830 -28105 -40363 -98799 -105622 -28632
17238 -28632 53089 35116 -17178 -54005 9584 85964 128679 118543 82856 16314 -4499 29042
17226 29042 -17414 -34524 -16794 -6003 -31020 -70682 -89663 -71976 -69865 -39182 -52526 -38136
17214 -38136 -29488 -47227 -17901 24457 -48307 -110660 -129092 -71344 -1122 35552 28890 -36640
17202 -36640 -82049 -136246 -98069 -7218 -19143 -86229 -63577 -25833 -35285 -51821 -65749 -45229
17190 -45229 -44129 -25275 -5562 -10072 -18423 -32270 -23771 -12298 8938 -33608 -90861 -81991 -24133
17177 -24133 5425 23037 -74445 -54957 -46742 -78196 -126017 -159448 -162248 -148978 -75872 -2093
17165 -2093 -12528 -39321 -64685 -91403 -102403 -52549 -63517 -25247 6680 -28527 -110714 -76210
17153 -76210 -50709 -18098 36787 33261 8053 49150 33463 14654 -37256 -58789 -21629 3247
17141 3247 23708 10692 40271 39729 16251 38903 60224 53501 80116 102234 21086 10856
17129 10856 45029 24194 73633 70455 12225 28560 47201 7119 18997 14482 -30434 -42971
17117 -42971 -54693 -89334 -93899 -84175 -74685 -50853 -57523 -52456 23523 16510 -3728 54760 64169
17104 64169 18292 -52534 -89608 -101265 -102999 -34088 -63434 -88565 -60795 -43028 -67051 -2558
17092 -2558 50632 31064 34349 43279 -13072 -11021 -10151 -36023 -13902 -458 -4391 -4532 -51107
17079 -51107 -50498 -10689 47399 16401 -15883 -43588 -59276 -68847 -32957 -6131 -42268 -38380
17067 -38380 3705 60654 50963 58352 50351 4642 -42580 -64933 -51502 13368 32053 -21969
17055 -21969 10909 35741 3310 -67222 -106032 -67802 -79899 -94505 -86464 -49772 21885 58548
17043 58548 61828 51495 54821 50301 25841 55937 59973 65237 77490 31704 4397 58908 113164
17030 113164 71732 19257 6602 -4464 16075 41270 123515 132093 67704 18369 -71677 -80940
17018 -80940 -56809 -80945 -77544 -47270 -21383 70802 94072 59490 51526 50896 66348 25293
17006 25293 32280 -6687 -40806 -14727 -65328 -77388 -5634 91560 90834 54317 46154 -29342
16994 -29342 -46525 -65039 -22056 70074 151462 70096 39069 -11189 -39994 -87309 -59285 41121
16982 41121 74920 39645 -33202 -37648 -66101 -61315 -12566 -9595 30889 42349 115 -50674
16970 -50674 -35447 -59380 -70833 -71172 -53878 -63295 -40019 -27993 -31026 -99 -28663 -46980
16958 -46980 -110380 -148031 -179832 -136086 -122149 -75710 -104118 -127796 -93545 -30597 -62645 -58959
16946 -58959 -60352 -18585 37921 24975 -38817 -116826 -130294 -72387 -70475 -53666 -14540 -7561
16934 -7561 -23470 -26312 -5700 31239 3055 -21813 -59709 -57947 -21176 -47855 -74418 -625
16922 -625 -21872 -61266 -61424 -7040 -7115 18647 56971 51052 -6953 -42095 -32502 -16114 16769
16909 16769 27397 70069 56495 30179 33398 28512 14814 -3178 -36500 -13405 -35053 -63690
16897 -63690 -11616 1243 -33617 -42347 -18550 38446 20706 28393 52966 13938 24962 24360
16885 24360 -2306 -57186 -101947 -103073 -39906 -27851 -46381 -80670 -97948 -64158 -42015 -45686
16873 -45686 -51283 -28834 -9746 25064 57638 785 -6743 -2136 14922 61671 60159 76626
16861 76626 72672 82125 93391 74118 7318 -5560 -31236 -9251 10165 24321 12623 22462
16849 22462 13296 22113 75546 83565 54118 64988 40726 -1226 -25844 3379 -2989 -40585
16837 -40585 -58475 -31801 15955 39337 131300 176856 166842 118058 86122 105923 107614 88665
16825 88665 42098 283 -8518 17218 47244 4141 -33950 -11356 -23457 -73149 -107338 -90671
16813 -90671 -100559 -36129 17256 -2584 -22530 25870 47301 65046 74524 18264 17978 64962
16801 64962 48423 5283 17820 45847 43303 16840 -82644 -120185 -80273 -64899 -37873 -107521
16789 -107521 -93809 -15265 -31903 -44629 46464 27112 5368 -1595 5779 38011 80139 59999
16777 59999 37709 13337 5720 -5568 6949 -34467 -17596 3352 -50747 -67807 -76383 -39783
16765 -39783 694 23346 -5214 -5899 -32501 -39138 -60874 -95371 -3718 11011 -32246 -65089
16753 -65089 -64439 -33041 -11263 207 14773 -69993 -73753 -35576 -40215 -6623 39896 53538
16741 53538 75761 43191 -47803 -13973 -22349 -73096 -71082 -68704 -7772 -17380 -22765 -13518 -35701
16728 -35701 -11165 59937 90 -74852 -59023 -105803 -93079 -10017 9294 16776 -4048 49531
16716 49531 57382 27607 50807 17889 -5626 23607 73191 75649 44144 78593 57837 33662
16704 33662 17952 -26812 -35995 -5478 -36788 -66603 -28239 15634 -4660 -60791 -71283 -24120
16692 -24120 -70364 -45932 -37500 12577 -1419 29154 8739 -39708 -47840 16312 15372 35690
16680 35690 14675 -43383 -16115 -25919 -31914 11359 30871 31904 38766 6103 -22484 -6940
16668 -6940 -7666 19114 13543 26740 32928 90118 59524 19381 -9903 -60592 -83625 -60172 -10660
16655 -10660 -3427 -4256 11101 13803 -29124 -33312 -36783 -44766 -43792 -24525 -31203 -5884 21162 43592
16641 43592 75821 119438 80620 -5247 -5846 -4022 -44628 -5858 45139 34540 21149 21216 50843
16628 50843 62945 45000 34319 40124 33537 41046 5085 20554 130666 101274 83083 42993
16616 42993 -4399 -7952 -56878 -63169 5847 54249 8302 -17594 30841 43574 58216 71649
16604 71649 49081 38411 -23420 11691 16671 36205 64273 89792 95168 109290 16932 -42093
16592 -42093 -33587 -80668 -104076 -105464 -99172 -44318 -25534 -65302 -43309 -21348 -48035 -25772
16580 -25772 -86501 -101794 -44574 -44729 -65179 -77068 -74439 -118004 -140674 -59300 -33995 -67524
16568 -67524 -58693 -36571 4346 23416 22212 31162 50007 49411 -6899 -78867 -70022 -30737 -16660
16555 -16660 -60836 -28264 -26906 7086 -13665 -1095 18094 10093 -77692 -103193 -91634 -59798
16543 -59798 -27690 -21883 5835 22235 18147 50490 -1143 5327 26306 -3690 17286 22465
16531 22465 45583 -26187 -78183 -68344 -75186 -41208 -6930 -8221 -28813 -22655 15509 20942 -19316
16518 -19316 -35391 -26516 10150 16091 22055 40591 10197 -41789 -21463 -18340 -2244 63118
16506 63118 68604 5321 -29459 -81314 -112592 -51266 -15258 -52312 -65574 -78601 -69981 -6678
16494 -6678 41951 -3500 -96554 -122400 -57529 245 60112 36203 -40448 -30168 -49729 -84330
16482 -84330 -95429 -115882 -96317 -86391 -53177 -19202 17784 -48652 -141702 -122490 -35251 -4006
16470 -4006 15361 -1339 -29044 -66133 -119205 -109164 -50171 -29603 -95725 -66177 -7020 10199
16458 10199 21527 -7220 12900 -23157 -119594 -150070 -24708 -70394 -141240 -127807 -68235
16447 -68235 -19937 -15624 -4944 5037 -43338 -58812 -54738 5185 57554 69250 65260 87002
16435 87002 73588 35147 -35572 -67473 -46502 -29503 588 -32312 -78649 -25346 -55097 -99862
16423 -99862 -69598 14026 22776 -13207 -55140 -58634 -45673 -363 25 40613 61066 100882
16411 100882 76439 65588 43946 31917 46125 26005 54259 17053 28191 43008 50265 18975
16399 18975 -3122 30837 137339 101854 6350 -21620 -10725 -8218 -13732 11560 37134 32063
16387 32063 -18729 -18369 -61343 -99366 -70119 5053 52244 22285 -36748 -20820 -14666 -46791
16375 -46791 -42231 -68242 -64379 -53034 -34309 -45367 -53864 2340 55327 56629 2772 15380
16363 15380 60901 44712 21251 69747 14106 -53463 -103053 -82850 -74613 -23182 -43210 -52064
16351 -52064 -77326 -35050 -35759 23665 30537 38676 13878 40352 28645 -26454 -27888 -39760 -58566
16338 -58566 -78899 -18929 -6736 26576 94457 47694 28623 5780 -48967 -88147 -71217 -51048
16326 -51048 -60374 -41882 -28745 -92843 -59874 29295 47066 56143 47957 72526 60218 24257
16314 24257 -15717 -7583 -51226 -76579 -18252 10088 20317 39983 25184 8605 37705 55541
16302 55541 119520 156200 148188 152663 153286 130569 82427 59666 67892 50454 58733 76391 -2204
16289 -2204 89745 131438 106375 86994 28462 -26494 -14704 44342 59116 47121 -9492 38926
16277 38926 157425 168862 77815 62441 94666 79130 27409 14492 12373 20072 46262 81313
16265 81313 97573 28906 -2466 -19800 50955 57164 21142 35584 19677 -23104 -25446 9298
16253 9298 16995 161 -8751 -41325 -65860 -43158 12748 53765 -6575 -107964 -18818 77146
16241 77146 52890 -9994 -11511 3975 1246 18764 15878 -12854 4346 7492 13954 23921 -3425
16228 -3425 -12854 -13775 1129 -15674 7511 -11052 -7878 -34327 -13559 -45681 -36222 -35658 -48917
16215 -48917 -30459 30537 27086 24518 23372 -15943 -27713 -26142 -37013 45524 71295 52569
16203 52569 26492 -18302 13542 40618 28517 -46784 -56341 7056 58327 -13882 -83561 -87196
16191 -87196 -105665 -123238 -143128 -132956 -77224 -30185 -65970 -48181 -74453 -115995 -46060 17495
16179 17495 37666 34773 -2800 -14472 30290 104001 163240 180030 142380 102959 20363 -9080
16167 -9080 52633 28558 8132 16245 -6766 7341 -10455 -36616 1234 -18380 -12732 -36804
16155 -36804 -19503 -27550 -4493 -51918 -48601 -64719 -43387 -52914 -133482 -121281 -63542 -27992
16143 -27992 -28702 -15767 9101 6441 -12862 -7379 44475 94093 99368 129771 83643 19571 22421
16130 22421 19844 556 35257 48054 44027 31787 19881 35060 7528 43100 65910 78077
16118 78077 48830 -9719 17760 50262 31999 -76221 -100984 -32871 3014 44261 103862
16107 103862 89769 102147 106600 85097 67874 38955 20305 17090 17496 16708 51701 50652 549
16094 549 -17397 -1507 -28100 -71605 -57579 -43481 -74887 -89509 -46090 7938 -31045 -49448
16082 -49448 -13987 -24828 -30443 -55261 -82768 -89782 -83233 -15749 25891 34789 8920 6927 -8785
16069 -8785 -35971 -82836 -84215 -87775 -44235 -3427 22561 -22291 -23847 -11146 -56972 -114099
16057 -114099 -207623 -203881 -126726 -73586 -57241 -58993 -34304 39987 20150 22935 -12997 2032
16045 2032 5665 18065 15028 65907 48550 -37999 -61846 -62928 -60602 -19382 37456 54650 66169
16032 66169 -16022 -718 -37396 -109476 -99453 -93929 -59321 -44382 -24990 -13586 -28836 169
16020 169 -63992 -123751 -46169 -67004 -68017 -49617 7045 22322 76203 96970 73257 25822
16008 25822 27181 34341 56487 24991 -35535 -29256 -61461 -27663 61953 81551 36961 13664
15996 13664 -17619 -72006 -93805 -104137 -36686 45781 87023 41319 25431 23323 33220 19060
15984 19060 839 12920 -13386 -63058 -77803 -62888 -67583 -91906 -131807 -182166 -208818 -215038
15972 -215038 -184120 -113269 -17209 92708 87487 84115 112167 81299 24450 80072 92179 91561
15960 91561 136984 147747 104666 37175 -27725 -82153 -10420 -4214 -30800 -45337 -41519 58544
15948 58544 87669 50934 44863 20918 8389 -17466 -63271 -111803 -54204 461 27054 37045
15936 37045 101171 33029 12560 -16858 -4888 -6810 -66016 -8427 7437 33600 -14878 -18013
15924 -18013 7523 40374 12267 5912 66678 98120 77222 8576 -24084 -4729 -3158 -18186
15912 -18186 -53686 -81303 -92686 -105047 -111910 -58882 11275 19267 -35312 30274 86396 81541
15900 81541 31011 -33781 -45227 21187 18200 4351 -10314 -22854 8090 12550 49214 59829
15888 59829 37766 45608 71846 82860 83009 -6419 -41585 -47936 -33825 36088 51224 3219
15876 3219 -49422 -10866 38729 8295 13025 43835 179219 175778 77913 37032 41777 57796
15864 57796 84458 51422 15667 -9854 4191 -32531 -97519 -62345 -16117 -38683 -63613 -42285
15852 -42285 -61086 -150628 -150244 -121924 -60150 41939 67689 8064 -24647 -33529 -40193 -45218
15840 -45218 16220 92113 116217 131240 92680 14349 -31036 -25051 -6196 -13189 -45765 -93062
15828 -93062 -89323 -75772 -27339 -11334 41592 129292 80624 23604 -8480 16883 -21202 -20108
15816 -20108 8137 37014 45646 87191 112494 79309 -412 34549 120769 110214 77681 32101
15804 32101 43488 -454 -13175 2096 7883 -1265 -10457 15488 26596 -1303 13064 3320
15792 3320 18752 38821 -10559 -17379 -38462 -89888 -69863 -45810 -53679 -118351 -96062 -63571
15780 -63571 -52758 -75998 -79349 -120756 -67502 12320 11526 -58902 -54804 10672 7160 20994 19920
15767 19920 14370 49455 40622 47982 26903 -46687 -78598 -116239 -101513 -84896 -73602 -69324
15755 -69324 -12911 8236 23010 -19025 -30631 -33506 -6903 27798 36666 78790 100686 32905
15743 32905 -29765 11976 11397 5477 10043 -5847 -3672 60919 81827 94826 75167 25202 -39519
15730 -39519 -73373 -7697 -7211 40275 -13509 -25231 -18342 12087 52105 59964 106966 107117 103671
15717 103671 131349 105991 52680 55406 46635 79787 86217 123657 129941 95202 70830 78702
15705 78702 15089 22659 43389 45449 59801 27680 4872 3261 3756 45175 37392 14289 -70224
15692 -70224 -80562 -77582 -72952 -50144 -8277 -27675 -106531 -18289 63560 102351 92756 115908
15680 115908 67665 -15084 -34829 7510 27268 -235 -50046 -20138 -24426 4085 41724 94508
15668 94508 12026 -77556 -37222 -32660 -87594 -105378 -86450 -47367 31073 47547 43092 35341
15656 35341 68401 72832 86870 64974 14002 20110 -19175 54 15727 13639 6669 21229
15644 21229 -12966 -60639 -34693 -41842 -57138 -80907 -47742 -48596 26155 34681 -18096 -49056
15632 -49056 -22738 -33960 -43594 -53657 -89094 -102307 -140554 -170939 -139687 -57535 -13485 -7110
15620 -7110 29348 33834 -4212 -24362 -10357 -27540 -17587 62282 55893 55145 61492 31756 -20960
15607 -20960 -81521 -128271 -75121 -71200 -73116 -61483 -28700 -52104 -75938 -42910 31180 66157
15595 66157 73810 -613 81 -12282 4719 29372 -32415 -19462 24082 67531 37806 245
15583 245 -17635 -10235 21564 2491 22239 32567 52890 -36726 -47617 -8394 9343 14687
15571 14687 62162 67803 27780 17470 25447 40074 82453 64860 10798 -68783 -94876 -110346
15559 -110346 -87629 -51504 -18633 -34683 -44083 -99969 -89203 -74622 -57480 -30718 -48904 -118601
15547 -118601 -126675 -72403 26874 42351 53372 59471 4158 -62948 -346 -3914 39153 73155
15535 73155 139744 141439 99607 110397 59475 -29461 -38230 -86620 -107711 -77405 -28828 -41957
15523 -41957 -32912 -20688 -18841 38242 25841 22034 19171 25500 89044 135908 76949 -15695 35290
15510 35290 21709 -30365 -79634 -25338 45198 -1191 -6615 57502 77722 53461 31595 15965
15498 15965 -36452 -52908 -41428 -37755 -3175 -1983 -25348 -23275 -21237 -49569 -40514 -1720 33444
15485 33444 40869 14637 11250 43677 6295 -3770 27226 -24832 -39274 -32943 -40799 -57055
15473 -57055 -56509 -18443 -61145 -124580 -76120 -30457 -45117 -80463 -6450 61183 97395 70325
15461 70325 15991 20741 80590 111183 17762 1610 5391 -35393 -27532 -32763 29585 93310
15449 93310 91131 42106 9234 -29109 -42004 38550 24536 5344 16503 16999 -29684 -34962
15437 -34962 -66040 -56023 -53369 37259 94289 82685 41391 8565 -70025 -114005 -90993 -26786
15425 -26786 -73635 -76315 -43246 -67915 -58706 -58839 19738 30378 25102 -13919 -66450 -88630 -71980
15412 -71980 -71792 -16186 -22217 -28918 -23656 -28676 11104 -20946 -28056 -69947 -71711 -18359 -13626
15399 -13626 -7761 45102 76072 113974 104944 56308 -9481 -6894 -26564 -83311 -110723 -31013
15387 -31013 17886 27694 62906 75234 37793 57261 25806 33871 35451 47726 51409 86596
15375 86596 85196 63796 -31175 -84147 -15594 -8810 33479 143 9648 -22 -6013 5054 -4914
15362 -4914 -63448 -33217 10329 75752 47217 -8871 682 16514 17719 12785 66 -3425 -45521
15349 -45521 -67752 -37194 -49387 -16031 25332 -21152 -9405 -20166 -43085 -62821 -32025 -18121
15337 -18121 -20951 -2722 -20240 -32640 33930 35500 8205 -9225 -2126 -59552 -25834 1430
15325 1430 -24989 -61368 -79853 -98796 -56114 -19932 -8194 -70480 -147022 -103806 -18197 82522
15313 82522 88957 48782 19892 32682 133186 154750 143212 75254 30421 29656 24328 18095
15301 18095 -39084 -98848 -95629 -87569 -74931 -88731 -36290 31037 24473 61192 14518 -27718
15289 -27718 -39395 -36380 -6959 4110 8793 11639 -7192 -3623 -51706 -76461 -27577 29566
15277 29566 24455 -44830 -58829 -21427 -21087 19285 40258 51137 -10258 -44421 -52702 21221
15265 21221 65525 30147 -11006 -31043 -1579 -3333 23181 -6869 -3892 6022 6664 16546 -15087
15252 -15087 -57075 -75138 -12449 -24252 -32323 -107362 -77478 -51689 -70980 -75865 -38471 5050
15240 5050 -49740 -43420 -29515 -22106 6489 22296 16681 59866 95258 16314 -7450 6342
15228 6342 -20610 20832 -51606 -53329 -4948 21178 30717 22104 24081 -15698 -56020 -148824 -84055
15215 -84055 28530 71523 98600 74491 10874 -34727 14614 82154 68008 40909 65655
15204 65655 35455 -20236 -11950 -19221 -10834 5609 39283 25329 40254 68558 66365 54913
15192 54913 86080 86633 36803 22574 33095 58742 57036 -26604 -64481 -20173 2945 43959
15180 43959 71649 98614 29924 -863 12036 22417 86984 95125 52986 48771 72063 69979
15168 69979 72279 67006 25480 -20527 2787 13317 45005 91328 76317 -36439 -59254 -44316
15156 -44316 31579 130575 96713 23252 3433 48836 14605 -5847 78945 151028 183559 127691
15144 127691 86957 81188 71308 76207 78461 39009 11255 -43479 -19551 -15272 -83733 -121249
15132 -121249 -98148 -102836 -77404 -63068 -4633 15458 50588 11911 -2785 30369 99481 80152
15120 80152 19745 -24249 -1379 -22573 -55737 -24408 28089 28486 25007 33052 -14352 21089
15108 21089 50204 5199 27019 129022 101790 24748 -12874 -70416 -107963 -81338 -25197
15097 -25197 60100 96553 61330 55996 77185 90496 11150 -25580 -58990 -3413 61755 34278
15085 34278 13080 -35163 -52890 -11447 -3326 20573 64316 72639 71193 75854 58036 50489 59207
15072 59207 28507 -4812 35717 105491 81045 36937 36251 110239 92369 -10499 -67071 -58447
15060 -58447 33508 52962 -7173 2266 -18840 -24297 38182 60231 49208 35409 21076 36398
15048 36398 97803 162804 125051 82987 14901 -20851 47032 43382 37179 -12596 -89864 -86096
15036 -86096 -60135 -68132 -18944 11417 54512 85192 31630 -14179 -45181 -7476 59207 57852
15024 57852 53784 28241 -6011 -12819 14369 72048 109123 102042 125939 150275 139875 189022
15012 189022 173665 171600 207969 225704 218986 242183 247110 287881 301555 381164 498425 670776
15000 670776 1014850 1668771 2643832 3533029 3811557 3394914 2407386 1543590 1121699 945530
14990 945530 748825 706825 640965 540652 431264 428321 409537 331431 280198 264350 236666
14979 236666 209831 143899 168556 198350 141185 68666 96587 106735 57392 15714 44151
14968 44151 24854 13752 35625 28717 -5775 -46775 -16102 -3138 -29531 -54204 -39834 4850
14956 4850 44489 56299 75058 75429 95561 101366 76298 77815 46527 60869 74452 45618 4553
14943 4553 -59042 -58512 -12113 -86611 -84379 -60677 -53677 10419 4920 -31092 -27843 -59666 -89103
14930 -89103 -103037 -69977 -37066 15546 32636 15841 -37750 -54685 -14049 81546 84266 32902
14918 32902 4675 21806 46266 77545 80433 26236 -15718 -11156 55057 12831 -35568 -124972
14906 -124972 -105483 -47341 4215 65063 126409 106424 77555 27349 -13346 -8402 -40520 -80202
14894 -80202 -86070 -87604 -46866 27189 51265 64844 91483 49525 -3205 24149 31372 -9050
14882 -9050 -20769 6990 73598 85538 33484 -8230 -33310 -37915 -48699 14815 33906 42869
14870 42869 58612 64814 -2314 -87777 -71339 -60084 -52671 -25930 -33430 -153018 -171099 -106321
14858 -106321 -49939 -12089 6605 5309 100863 138492 75304 9599 -27738 -23780 -20585 7904
14846 7904 -9211 -52053 -77091 -5256 39384 103372 31024 10482 4028 -63994 -25250 84829
14834 84829 133251 137543 74244 38368 33035 37583 38325 -6485 18045 15791 31981 56609 70234
14821 70234 37639 45853 34317 -63301 -30643 -7637 27480 50186 24916 40963 36052 27143
14809 27143 -4516 -2946 13523 45219 31945 67335 123676 101543 -38993 -60509 45679
14798 45679 51760 33152 54803 119677 143516 60242 -7984 -1083 -42690 -10608 95816 147177
14786 147177 155076 84633 70839 51661 25642 11420 3393 6680 12480 43781 49401 8608
14774 8608 -21031 -16649 12704 68162 34395 1777 -3301 -66024 -93612 -54942 -21904 -12067
14762 -12067 9791 -11295 2724 48047 70801 48839 29903 12845 22111 35930 42860 5558
14750 5558 -37926 23118 14561 -19267 -90712 -89931 -22160 25262 21414 24245 78336 87838 41145
14737 41145 -17481 10688 12753 -18864 -21923 37680 57405 -9130 -4499 -14830 -48073 -57696
14725 -57696 -29485 -5829 -14935 -45595 1958 74239 76353 115793 111543 104538 126305 99234
14713 99234 104350 73051 73328 63072 101650 103451 59843 29841 -522 2938 -7675 -16819 65452
14700 65452 35386 -28599 3354 12693 22911 64458 68383 -54 -71425 -22929 598 -25960
14688 -25960 25506 55267 49157 42989 11455 1612 -54983 -89169 -47410 -45378 20926 50909
14676 50909 18210 -6789 -43968 -12580 2866 20876 -59915 -94194 -45035 -38261 -78627 -114371
14664 -114371 -84857 -108010 -98629 -48898 -31574 -58458 -95454 -45076 -15343 -61184 -29299 -8821
14652 -8821 -21227 -31228 -39932 -25291 50994 32047 -46640 3312 23875 20082 40230 71484
14640 71484 29850 -7210 -44551 -29063 -27256 -88572 -87736 -26960 45803 50670 37245 -11989
14628 -11989 -25577 -39522 -68139 274 51239 10970 -26674 -83230 -93833 -41602 -27032 -15726
14616 -15726 -30942 -22101 -32393 -63136 -62753 -37244 -64009 -89160 -92910 -48933 19528 58128
14604 58128 85260 48367 51349 106260 81504 76416 57270 49954 23951 9097 69351 70788
14592 70788 -16977 -30258 -28672 -21645 -11427 27644 62374 48095 37929 45364 76054 -1711
14580 -1711 -27002 -19690 -22488 -34005 -49292 9135 43690 48724 44850 35204 113198 126306 81543
14567 81543 104091 98946 144149 177784 223194 238121 240865 253453 183856 125896 76540 37667
14555 37667 10783 37477 38439 -6908 -23937 31880 23963 21721 4833 18594 47862 85853
14543 85853 40392 -28023 10665 58448 42480 -11730 -26676 33222 92199 80612 9598 -28579
14531 -28579 -31197 -91402 -93244 -23890 11692 17423 -19182 -15122 20066 42637 48326 45307 21882
14518 21882 -64228 -81096 -70660 -76100 -105118 -59640 -71422 -15944 43478 2004 -14345 -2692
14506 -2692 -27956 4846 63537 102529 78429 96877 57707 -10285 -14781 11367 10051 14684
14494 14684 8959 -12247 -73288 -116058 -81990 -43054 -51225 -49400 -12773 42548 74445 59523
14482 59523 107752 127135 107015 69727 43518 3650 3617 -13666 -20578 8405 -11439 -69783
14470 -69783 -26590 -12471 -7842 -49706 25790 84139 80926 119515 57698 -7608 -28993 -13992
14458 -13992 -28336 -69499 -18316 -20811 -53657 36970 62291 52598 17084 19096 -18124 7398
14446 7398 -20598 1346 43297 61553 108401 95636 76342 52379 61530 85076 29643 32176
14434 32176 3819 -41860 -47837 -31493 4126 13994 -11452 -33862 -37438 13421 14577 44484
14422 44484 71371 80186 50305 51640 7299 -3942 977 -896 12265 42762 34964 10326 6904
14409 6904 12328 29942 -28393 -6257 49568 49436 17555 34089 45133 -11308 -16102 -57420 -48703
14396 -48703 -57942 -16955 4105 49142 23316 285 -2819 -82261 -20050 -15785 -33927 -24751
14384 -24751 -16230 -52501 -38987 -3767 -44205 -61610 -73365 -44540 1164 39737 64627 39321
14372 39321 -25603 -60499 -69848 -64797 -59297 -57766 8420 42120 21131 -2268 -934 31729 13056
14359 13056 -26608 -93422 -31757 -25209 -17375 7846 -1321 -20601 -52255 -55810 -22943 76421
14347 76421 46332 -1373 32743 54939 79907 63333 -6689 -64672 -53214 -38314 5842 67117
14335 67117 7375 -93566 -80198 -64303 -70199 -69861 -44811 -21879 -17782 -7861 16119 4899
14323 4899 -14268 -3146 -28021 -3132 -4497 -3680 -6721 -5037 -52894 -59749 -73994 -25683 -48028
14310 -48028 -8656 -26463 -36553 -2127 3797 1368 -6379 11544 20955 8384 15083 2390 11999
14297 11999 -40657 -48097 -30511 -44511 -39962 -15854 -20313 25326 35466 14442 -4954 16471
14285 16471 20481 14020 42418 56665 -32293 -108517 -55068 -37198 -40706 -58324 -20232 12233
14273 12233 47565 49265 -31934 -23832 -11859 901 40649 37854 -1951 -35901 -102737 -90506
14261 -90506 -28102 -19984 -13208 -12993 -41505 -60879 -71128 -52961 -5082 52102 56502 78748 95160
14248 95160 112763 71095 2108 29097 -28152 -57616 -37206 -30943 -30497 -71799 -108286 -112091
14236 -112091 -97695 -75199 -18170 73109 6323 -60949 -29750 -11567 -39070 -14149 4846
14225 4846 5545 -42690 -74886 -71663 -27799 11791 51525 39778 15026 19846 -41240 -90827 -134318
14212 -134318 -144539 -107478 -29913 -44350 -31379 8621 33112 51282 70638 47564 51254 34811
14200 34811 8184 6187 20045 -18063 -40684 -74775 -50890 -65850 -120747 -106348 -66210 -51653
14188 -51653 8300 3805 -57775 -5428 79482 71276 12522 18631 29364 6005 -34180 785
14176 785 18970 -45911 -67672 -247 10711 -2587 -11577 -18285 -55819 -58410 -43154 36489 46352
14163 46352 33409 36191 2013 22095 2526 -58500 -112365 -163259 -137935 -96427 -76554 3008
14151 3008 42357 22821 69042 45085 108650 126676 89866 37856 19062 49302 113306 170221
14139 170221 127498 52164 30667 63356 27232 -47054 -79317 -57075 -70169 -88013 -110230
14128 -110230 -61068 -15437 -9610 -23177 -47845 -9017 -25942 -17727 -37157 -25171 -59036 -1694
14116 -1694 -2269 20030 7453 24316 -36983 -76897 -19518 5964 -60241 -30650 -47035 -111368
14104 -111368 -88193 -68102 -74889 -69858 -39873 30883 37883 -34298 -27549 18588 6242 -36793
14092 -36793 -74914 -106993 -92476 -32852 -68529 -149699 -88478 14253 11390 -13615 -86363 -128562
14080 -128562 -113523 -111816 -73722 -37439 -20855 -25323 -5712 -10826 -83347 -47605 -7175 -37474
14068 -37474 -54365 -92476 -145232 -130523 -57729 -62201 -3365 45862 81991 57559 5399 1390
14056 1390 -25584 -73793 -89058 -73498 -8942 7782 -7424 -1988 9799 45796 39814 21343
14044 21343 25805 35061 44338 20939 -16179 -29744 -13824 -522 52748 75921 28483 -13969
14032 -13969 17357 22177 -5740 -77880 -33140 -25483 -28332 -42902 -88161 -112378 -49642 -36618
14020 -36618 -67674 -20787 51813 65468 27615 -24480 10569 26081 25527 40782 58096 45703
14008 45703 -37951 -108435 -153362 -134224 -81350 -129169 -171073 -134190 -74048 -58977 -10959 36975
13996 36975 48390 30798 -14493 -62516 -36919 58603 70704 62894 28831 -10795 -11640 -8302
13984 -8302 -17752 -72470 -59140 -13378 -41082 -26892 -6301 -6072 21055 60275 96763 28523
13972 28523 -24996 -41020 -54599 -41357 34297 38583 -25413 -46078 -26141 51944 99822 62658
13960 62658 -16180 -41970 -32294 -9777 25764 71560 54913 -20136 -64244 -59700 1385 22967
13948 22967 -20953 -36561 47950 124125 86716 81098 9369 -32796 37729 93899 134404 161204
13936 161204 149928 87873 -8027 -57098 -76644 -81207 -43682 3274 -10145 -65107 -94845 -125176
13924 -125176 -88917 -47300 -65491 -64569 -76844 -119978 -188766 -150083 -76288 -3992 38351 -14052
13912 -14052 -72945 -95924 -71566 -97094 -51564 13420 -543 -80215 -118025 -111520 -107961 -84191
13900 -84191 -21873 -23354 695 -44937 -74668 -112713 -125320 -73111 -36899 -29064 5488 48296
13888 48296 990 -40177 14353 -8553 54558 85192 52702 55471 37183 -16523 -25235 649
13876 649 -26231 -10218 9441 -51767 -38787 -44312 -22645 -45887 4151 40180 45079 14176
13864 14176 -3840 -2748 -10352 -63740 -34563 -25102 -47231 -85604 -123265 -54914 4931 -10036
13852 -10036 10644 34852 60115 29037 35150 19981 -25213 -36227 9450 20789 -47183 -51623
13840 -51623 -52323 -108914 -108442 -79750 -79794 -45558 10235 1972 -86816 -89585 -57434 -46362 -22797
13827 -22797 -26 42314 50627 4274 -90686 -122429 -104569 4356 17568 -24183 -6900 5776
13815 5776 1986 -8320 -32357 -19657 -48848 -56816 -58225 -42604 -114338 -152615 -134687 -162838
13803 -162838 -173754 -164886 -59325 -55767 -30447 50374 92768 74509 53770 10075 10575 18285
13791 18285 12667 48872 54673 81312 61373 31085 -36479 -32845 -9057 1889 -6080 -788 -48440
13778 -48440 -20331 33736 15397 61260 57214 12650 -30116 -6671 2169 -9581 21614 28336
13766 28336 25914 -13292 -23874 -37429 -13793 4551 -2714 -14059 15883 15758 -17063 -51871
13754 -51871 -44362 -8307 -6559 34161 56241 6277 -45715 -31872 -11842 -50138 -16274 -40310
13742 -40310 -75067 -63336 -114116 -153522 -56844 -25413 -57352 -23725 -23901 2423 20563 -20869
13730 -20869 -43823 -60108 -108297 -133911 -105686 -50599 -31253 -45782 -47345 -90466 -108131 -171886
13718 -171886 -153965 -77867 -29976 -46145 -104696 -78853 -66998 -85947 -83088 -70131 -41702 3583
13706 3583 47472 116911 96696 13448 16394 7939 22001 79610 90092 99585 106301 26795 6704
13693 6704 49119 41496 -9675 -39743 -61021 -60461 20981 27392 28984 -21968 -46702 4860 44825
13680 44825 6685 -21670 -13948 44494 53968 37849 -3229 26881 49408 -15645 -8484 35675
13668 35675 28241 -21543 -30710 -49417 -77274 -91163 -89023 -78234 -20376 -53869 -67739 -76738
13656 -76738 -63292 -32357 -15403 -48117 273 2535 -33314 -64405 -37669 9598 24378 30703
13644 30703 77084 56006 47121 32098 18052 -16451 2352 38166 22382 15482 -16210 -8782
13632 -8782 -35106 -13390 -32965 -54302 17087 101105 54872 -7432 -42846 5006 47702 29505
13620 29505 19234 -40078 -81672 -60075 -29228 55249 88267 72569 44127 51853 24527 -17677
13608 -17677 -53436 -45426 -41208 -47003 -36373 -39360 -84669 -77579 -45182 1506 -5465 -43264 29163
13595 29163 84544 90027 37011 10110 -5013 14064 6818 26457 -1435 3021 65442 114221
13583 114221 123234 157935 114719 4873 -54764 -26791 26093 92723 120422 113780 104611 59182
13571 59182 3777 -10460 106 24778 10192 65477 73383 25258 -34394 863 38444 124634
13559 124634 99488 -14059 -73770 -15685 29261 -1855 -25197 -28041 -2873 57896 75981
13548 75981 84216 65241 39650 -53939 -48622 -25257 9313 -6960 -8257 -15434 19387 32543
13536 32543 -9745 -16580 31224 7764 -36098 -14240 5167 16276 8800 -25925 -29548 -39865
13524 -39865 -61767 -53983 -55549 -59348 -30888 8723 27025 1917 11523 -5524 30388 12859
13512 12859 23128 60401 50465 55140 101450 113182 134147 64870 -324 -62774 -111915 -49671
13500 -49671 -11209 -45274 -75494 -53870 -42423 -25667 -391 -39814 -75134 -73306 -61636 -47752
13488 -47752 -3695 23013 -32510 3361 43615 90000 55153 36977 24477 13069 -1724 -71711
13476 -71711 -58626 -57271 -113103 -79492 -14514 3590 -30554 -54311 -31374 -27049 -42404 -29092
13464 -29092 -42216 -75164 -31561 17721 29664 49305 53565 43660 61964 106178 81522 6973
13452 6973 4290 -61975 -113315 -122744 -126430 -28047 48063 -38323 -36384 49771 13283 -10411 23709
13439 23709 45802 8571 -65513 -103984 -36966 -51319 -65370 -47562 24898 -2869 -648 -52373
13427 -52373 -57925 -23577 48522 30950 15285 25517 35832 8101 -21905 47647 88239 88152
13415 88152 39802 -16462 -76854 -100904 -148713 -84970 -8467 11627 -31704 -44148 -29121 -27860
13403 -27860 -8234 -16217 2470 -69389 -97714 -42054 -9605 -17501 -3602 38355 48086 35780
13391 35780 28674 11747 32925 -11156 -49857 -48308 -21344 -41751 3421 15045 -68839 -51288
13379 -51288 -22554 -36228 -49898 -89295 -59915 -61742 -53050 -49795 -63306 -73724 -40013 26742
13367 26742 -4029 -56495 -50116 -25530 -52990 -33723 330 8746 -59259 -49496 5788 72747
13355 72747 75495 84008 21373 -48839 -50961 -54355 -31885 19024 91054 122161 82023 33558
13343 33558 3780 -67277 -103120 -54041 -55310 -64510 -43789 -64652 -106843 -78619 -75229 -73050
13331 -73050 -61625 -59450 7702 41104 10453 -68458 -80474 -20508 29091 23821 36210 19373
13319 19373 -32738 43090 2769 -91570 -95642 -56449 -7815 20019 49445 96600 32216 20581
13307 20581 12687 9573 77842 119754 116000 85687 40405 73924 89627 965 -15396 -27901
13295 -27901 -29466 -65908 -90197 -39124 4723 -15620 70720 137460 73344 63995 23260 -42199
13283 -42199 -4944 -11297 -36360 1801 47196 19719 -14484 13626 11857 -1862 10290 38705
13271 38705 77176 87826 66514 276 -60063 -39412 22877 27834 9070 49546 76492 111699
13259 111699 82088 43024 67922 28169 -39820 2926 74450 93451 71797 47194 104199
13248 104199 137137 202865 180043 111199 87898 106124 86655 58821 99268 140201 136971 95771
13236 95771 95918 44993 34601 33737 30323 38217 -29474 -81258 -92469 -64887 -61500 -31653 -35741
13223 -35741 -9635 -52756 -52383 -49146 -43136 32719 11637 8584 23045 29396 -17 -17747 -31390
13210 -31390 -19525 56851 100488 95902 114819 125673 133403 88122 23434 -78752 -98320 -49441
13198 -49441 -47437 -75141 -75374 -27258 78700 87338 61515 29123 86946 59090 110796 90327
13186 90327 76048 56283 71214 66139 16314 -173 -54307 562 84467 30387 11326 20459
13174 20459 21083 4690 84341 52642 -16823 -53874 -44466 -29033 -18558 -7221 39096 71666
13162 71666 33054 27410 -49884 -44524 -20481 -19138 -55487 -4048 2024 -20295 -16744 2735 20221
13149 20221 76919 134282 152902 82122 63688 9969 -6835 24801 54847 47398 -20277 -77233
13137 -77233 -54705 -68842 -116513 -81655 -37179 -14508 16213 27873 10928 23240 70184 60768
13125 60768 85090 91089 107985 71008 1439 -30066 689 31528 22210 25971 91130 94462
13113 94462 19639 -9662 -10201 -5376 32439 48430 51341 12473 33006 35161 36191 90312 8488
13100 8488 -43109 -7389 -17531 -39082 -58934 -45559 -32432 -44623 -51353 -45971 -29083 45370
13088 45370 57590 27758 -45780 -56710 -55300 -68197 -117318 -123847 -73717 -67943 -47043 -23363
13076 -23363 35905 24761 45084 86579 93247 89390 61136 71278 34935 -10150 -1149 30611
13064 30611 -35706 -17339 928 -16106 17743 131338 226787 180894 76375 30476 -13310
13053 -13310 -4968 38062 -15694 -35197 -58023 -112129 -106808 -84124 -17983 29075 -923 -31115
13041 -31115 20660 87605 64466 -29259 10709 75243 23440 -8368 11913 57287 13369 -32081
13029 -32081 -63588 -66674 -95694 -76022 -67759 -54835 -45570 -2932 -41183 -18817 -682 -18367
13017 -18367 -49625 -27494 17571 68332 42393 -19644 -54127 -43032 -27171 -13991 -11846 43344
13005 43344 40947 14521 -14751 510 42304 108786 92186 34757 34830 106534 153261 150039 105506
12992 105506 88050 59072 87664 -7134 -49155 6668 9733 -16687 -54672 -7577 16749 67654
12980 67654 60050 32050 -18724 -48317 -10458 53627 129770 147779 77465 68538 12407 7154
12968 7154 -31200 -13864 20278 38638 27686 5567 -46703 -24087 -47490 -43666 -43513 -50430 -13058
12955 -13058 5120 23490 89700 68230 46266 71257 39179 11382 19377 -12077 -50763 -66983
12943 -66983 -52917 -57089 -53936 -63946 -53130 -114344 -97703 -107137 -58865 3261 70660 81794
12931 81794 16531 7148 54645 84889 105255 86299 45709 54712 56427 9222 24174 54862
12919 54862 58172 1320 -18306 44703 47454 28178 12361 28501 56189 42170 75709 89896
12907 89896 97687 85670 111111 118250 89768 57335 102421 111471 93032 66934 45675 35800
12895 35800 75657 132108 143099 86738 102264 162498 230793 360247 602327 929951 1266548
12884 1266548 1541625 1553151 1334102 974734 620349 441489 354531 327301 314424 286738
12874 286738 257106 281454 295601 270219 234161 204316 90051 104751 135045 161358 150679
12863 150679 150011 77736 23595 12483 107693 191632 184888 161445 118881 104805 60201 32281
12851 32281 67700 134998 102276 57111 28840 85938 62299 49801 42366 -8618 23274 -17295
12839 -17295 -67225 -111640 -106155 14192 60063 100413 98100 67290 -20800 -84693 -96315 -59432
12827 -59432 -80748 -90990 -59567 -82131 -126209 -80447 -9189 21611 489 -35735 -84079 -134443
12815 -134443 -85179 2495 71294 73234 33089 12857 43840 55357 47888 67657 42074 58912
12803 58912 64265 13032 -66336 -30974 1282 17199 20783 -7396 -74500 -40512 -39473 -38918 51104
12790 51104 82342 52860 8443 -15728 -66066 -76365 23419 45284 -2726 -25283 13373 80990
12778 80990 78836 55252 34011 30534 53616 86822 146433 158252 138423 91483 29098 -4227
12766 -4227 18968 9551 -25931 -44773 -31714 -14604 17491 35297 -2326 -46579 -64265 -50952
12754 -50952 -38793 -28613 16395 11774 10109 29409 23728 5170 -17364 -15 22565 13695
12742 13695 1371 21181 -5789 -21917 9415 13029 33703 72262 33012 -18936 -51805 710
12730 710 37677 42510 86352 139275 121280 62241 38368 28374 93069 160774 116693 98867
12718 98867 91658 136616 140069 128508 90090 91669 206235 391484 580540 661235 662205 527657
12706 527657 355716 254112 216396 145716 105280 113967 141175 112264 94633 52170 41307
12695 41307 76709 98348 97080 117975 163941 178454 131465 79064 50667 51452 102254 125083
12683 125083 144271 95542 101138 103040 66208 7246 -18102 -3003 -40864 -100049 -101183 -109626
12671 -109626 -62878 -25129 1090 -1196 -2906 -3413 3024 31243 40867 84707 59925 56710 101462
12658 101462 155229 110030 102241 65443 64329 34873 -8384 -14328 -22125 224 48039 35907
12646 35907 55873 24008 -38326 -68243 -94612 -94623 -99830 -60083 -31616 14646 51016 23026
12634 23026 13905 -26186 -13881 84276 95875 4033 -23257 15339 52231 142983 175559 113196
12622 113196 47998 19497 31477 30239 26386 39999 27026 -6940 1103 49967 115049 151066
12610 151066 175608 125826 118509 85867 15787 420 -34553 -52537 -5158 31163 -22425 -10243
12598 -10243 7544 22585 4597 -24212 -16102 -56563 -80662 -55864 -40576 -84446 -75910 -6288
12586 -6288 7699 -16236 -35611 10527 -5100 25937 22331 12581 11800 2191 26624 38394 -26914
12573 -26914 -44639 31392 49060 21172 -39224 -24138 15018 37875 62091 57295 62007 87158
12561 87158 60200 28655 16439 25135 34320 80979 53241 11370 15434 41307 12302 -23147
12549 -23147 -37534 -21763 -13476 14829 56325 49944 10311 -10072 17833 25249 -533 -18001
12537 -18001 51971 61388 24359 35738 -16766 4344 56879 79073 97900 67921 36316 -22480
12525 -22480 -44027 -78461 -12852 41788 -8770 29687 115369 145233 150054 155602 116446 39176
12513 39176 -27521 -74836 -50820 23834 75494 84638 109471 85124 -37672 -71505 -45169 -7648
12501 -7648 48094 1523 23142 36981 60668 77429 15720 -37597 -4318 -19132 145 17112
12489 17112 -6654 6456 -6082 -865 21793 28449 55641 18342 -36359 -79966 -36222 1278
12477 1278 -79888 -123767 -52245 -62362 -83520 -64084 -38582 -30605 -59558 -18085 1898 24644
12465 24644 21884 -18306 -49046 -62593 -39540 -51715 -2115 37156 43691 81660 44530 -62197
12453 -62197 -65639 -42129 -46420 -99546 -169559 -177433 -197528 -231646 -223748 -172143 -126274 -36802
12441 -36802 29431 29575 14910 22512 42575 42929 75422 54944 -29420 -54600 -28148 -57804 -81762
12428 -81762 -43998 -73512 23409 71368 86627 63978 28355 12439 325 -1340 89295 114557
12416 114557 25562 -24803 -8850 5229 -23454 -19992 -15815 -12230 32382 50426 2755 24333
12404 24333 21889 -9226 -6591 14071 17446 67405 69854 73160 75996 -3012 -61479 22180 3536
12391 3536 4795 -9211 -41761 -49515 -25515 -41136 -52148 -74831 -68832 -40403 -60597 -28498
12379 -28498 18566 -21645 -24266 -9544 51264 95052 74056 97189 96407 64908 7460 -6207
12367 -6207 -37138 2019 47236 11994 -68522 -101980 -102983 -95222 -74927 -28018 -727 22865
12355 22865 20218 13935 -16860 -44503 28907 78416 83693 88870 77961 87767 48503 41859 42461
12342 42461 48193 -63679 -72732 -68508 -50066 -5141 -31583 -38166 -40510 -90357 -66073 -35420
12330 -35420 -20208 -13732 51193 60580 48616 1230 -13487 -1552 -52008 57967 142028 90155
12318 90155 38717 34089 54819 81449 29699 3932 -14390 -48890 51540 90326 58362 34542
12306 34542 40467 69150 90701 53408 15943 14159 6091 44406 75533 64601 88617 39226
12294 39226 -2456 -3503 59419 104462 39281 68210 90388 68415 50152 40127 24673 17541
12282 17541 15273 -4479 55137 70157 63226 60724 22791 -24285 -33968 -1232 -5241 -26042 13835
12269 13835 42014 91179 25618 -39020 -95383 -69190 -41802 7660 39827 -25689 -34384 -34576
12257 -34576 -55945 -33098 2164 42721 75621 77445 119344 125554 108838 91569 63576 -1803
12245 -1803 -70664 -65796 -65712 -102367 -67298 -60979 -51503 -29227 -37238 -68422 -55437 10704 67659
12232 67659 56279 33200 9977 16988 25765 13948 33435 24063 -22179 -4235 12809 -27193
12220 -27193 -32343 -33 1188 20038 -8092 -82891 -81292 -46766 -30725 -12783 -5344 -22168
12208 -22168 -56736 -79512 -80495 -63002 -100379 -49716 51797 58897 12957 25264 25282 -12250 -1823
12195 -1823 19781 60206 78375 59465 43120 -37220 -59552 -31937 -43572 -37743 -866 40348
12183 40348 -23625 -47083 -12766 -74529 -95672 -37005 -31588 -68692 -61201 16009 80552 89366
12171 89366 86004 97304 65247 9420 34402 29184 46600 21874 -23388 -63110 -41002 4093
12159 4093 -61304 -82516 -61349 -27590 26892 6318 15463 -18242 -64303 -77142 -58537 -40312
12147 -40312 -2235 2294 -9699 -59629 -63644 -15448 2935 -43714 -67971 -50027 -14151 -3888
12135 -3888 -3986 19441 18164 78019 81864 35386 52765 71961 94882 63665 39465 31148 54402
12122 54402 76235 4557 1018 6585 -1071 -29540 -72516 -59262 -70745 -81188 -40051 -5445
12110 -5445 17798 3397 -26512 -24390 -4879 -51048 -14715 48094 39475 23299 6402 -7499
12098 -7499 8259 15153 22319 34799 14102 40411 45227 31204 3091 -53218 -54801 -42591 -63709
12085 -63709 -88276 -82128 -28273 -25274 8530 22757 36948 -7127 -6820 23678 -2770 37081
12073 37081 14536 -11662 -534 -12763 -72312 -95568 -95538 -79325 -64575 -64800 -90881 -87900 -59952
12060 -59952 -61160 -99547 -107614 -65631 -59260 -26328 18790 7682 -19650 20414 12378 -21836
12048 -21836 -12521 -4303 -4321 -76250 -130204 -134198 -14737 29483 390 -18531 -80379 -95638 -62075
12035 -62075 -2241 13100 17410 15558 -64360 -125583 -138438 -82350 11575 43077 9079 28390
12023 28390 50774 72538 74858 108342 147878 148408 121392 106408 101616 74048 22329 -35329
12011 -35329 -52200 -43681 -32808 22357 45769 23947 -7251 -23674 17898 24777 31892 11079
11999 11079 8007 -7496 -58660 -116485 -105741 -83626 -82094 -48833 -59824 -88475 -67719 -44080
11987 -44080 -31575 -19025 -5937 34046 1130 -18765 -25004 -11530 4199 49559 63944 58293
11975 58293 30851 -21816 -22300 12886 70040 79846 89950 54471 -54193 -86662 -50542 -65963
11963 -65963 11901 20691 -52727 -77614 -4047 1793 10461 -15866 -43869 -46372 -35808 -11597
11951 -11597 18512 74769 19761 -35671 -66931 -127429 -90087 -24456 70654 78054 33252 -42273
11939 -42273 -23126 46228 42591 42173 38224 34006 53618 34008 72960 27632 -70494 -63129 -44276
11926 -44276 -19196 -27911 -49269 -11067 -4020 16386 42327 64771 73472 64247 67691 -11914 -4785
11913 -4785 44985 71872 74047 67684 56688 56864 75887 73811 166545 159663 89070 17447 4659
11900 4659 8526 28999 39328 36622 5703 -3473 22472 16307 -23335 -24335 -10408 -1733 -42237
11887 -42237 -44514 -9996 29238 -8980 -472 -55475 -126499 -123340 -32868 -15807 43434 40405
11875 40405 15337 13542 9627 -6618 -11547 52786 49306 44044 7064 -31962 -53556 -65354 -4306
11862 -4306 38644 -29540 -73389 -47352 8990 -29646 -15282 33295 68963 100523 41413 38749
11850 38749 111839 116723 73356 60606 68770 23969 54283 31124 32227 58728 139592 110293
11838 110293 91873 85824 16363 -69688 -39260 -15712 -23067 -38125 -86855 -162665 -138943 -101315
11826 -101315 -54314 -5915 -21779 -28599 -69602 -56280 20788 76489 76964 28273 -51560 -39711
11814 -39711 8932 77191 129994 54498 52167 12310 -36974 -75597 -16226 8110 -18751 -53634
11802 -53634 -60619 -13571 14542 -8972 4404 33692 37319 14993 14382 55277 80225 -1583
11790 -1583 -15053 14831 -6206 33850 52536 -3517 -687 33895 13162 22990 -49691 -73576
11778 -73576 -14000 57995 72650 -20715 6460 28821 38739 -1949 -56306 -65546 -34015 -7746
11766 -7746 -12915 10661 -1557 -60503 -67941 -61178 -91073 -149132 -97615 -40762 36793 74621
11754 74621 -5520 -16018 26616 83208 94445 130170 76892 15627 -44873 -13434 -4987 -4817
11742 -4817 34842 28319 -21258 -34440 -47632 -86642 -128382 -127433 -169931 -97821 -26082 -23043 -19323
11729 -19323 15597 17446 203 24651 7605 86774 95980 42797 -2121 -4671 -3378 -8039 99
11716 99 -14118 42072 18357 -38860 -13587 13137 -29289 -50689 -61550 -39784 -27166 -42166
11704 -42166 -60685 320 13954 -26421 -12429 -38540 -68647 -71067 -54307 -34006 -63085 -90758
11692 -90758 -67609 -20045 17991 53641 48424 40497 -11174 -18038 -32884 -49310 -49066 -64550 -19745
11679 -19745 -5879 -4949 13031 26550 54445 61291 -30852 -102765 -98075 -31901 -47123 -134277
11667 -134277 -105690 -55176 -42181 -2818 -28902 -70859 -63190 -23953 -55356 -29646 19396 -7729
11655 -7729 -54916 -73502 -69559 -56799 -68571 -78206 -104933 -119964 -83242 -77037 -63654 -121596
11643 -121596 -120737 -91274 -77016 -44455 18829 18270 16481 -9811 -38458 -93961 -41401 63160
11631 63160 71428 -20824 -69413 -82313 -12934 -20433 -41361 -50706 -17305 21735 20513 54465
11619 54465 35334 -43264 -45090 -2287 8067 14597 5015 -3909 9562 38343 66534 94283
11607 94283 95374 92420 -19442 -68942 -68244 -27240 -24284 -63770 -42689 17795 22881 48481 27864
11594 27864 -27742 -10689 -13588 -71954 -62788 19415 50335 77584 34436 -25314 -21978 30267
11582 30267 19343 10866 -55445 -61397 -11267 -35423 -47714 -72397 7251 16293 2301 4140
11570 4140 8218 31236 38655 64225 86281 163131 173670 93187 24712 -7819 -40748 -50041
11558 -50041 -51223 -14837 -23583 -56701 -14386 13879 19759 50737 60852 76502 106447 50399
11546 50399 -25746 -55577 -40244 -18202 42903 34281 50784 67566 110288 93816 62704 41436
11534 41436 55243 68241 58148 22125 3664 44305 80292 57554 68293 61186 45807 35222
11522 35222 43131 58511 53055 43686 16524 8663 20922 -37014 -73772 -16937 11623 16888 -38097
11509 -38097 -61795 -21591 17169 36466 81376 101142 95686 58061 8744 2513 14834 -51481
11497 -51481 -70580 -49992 -18577 -38034 -3953 -5414 3752 12907 82841 74417 9356 11797 26404
11484 26404 34284 1345 -68814 -89922 -116996 -127478 -99612 -94763 -40347 -46325 -92818 -51586
11472 -51586 28638 62890 46353 -4772 -72326 -80933 -92949 -56648 2109 -24903 -25732 -2169
11460 -2169 -23416 -62829 -52615 -37188 -75920 -140221 -116613 -80654 -70397 -13088 19484 20043
11448 20043 11281 -1454 -20722 -60133 4531 79262 75644 50814 25829 25398 74175 54686
11436 54686 72778 70531 39519 79924 129942 104895 38462 -29493 45354 126934 73559 33147
11424 33147 -22239 -25495 -9916 -18402 -48443 -41927 26863 55416 81769 65595 95871 186445
11412 186445 281826 268779 207275 202986 173935 142610 139014 128427 119512 154139 104163 4817
11400 4817 -77754 -61382 -40444 8795 38019 66977 107996 129182 118900 94069 56307 48046
11388 48046 31733 39499 24095 14286 16279 1392 -29918 -9898 38562 -33495 -78671 -41670
11376 -41670 -54157 -31115 66565 63370 39681 12536 -24899 -34523 -33079 13028 -22093 -81771
11364 -81771 -57030 -30788 -41067 -53453 -86880 -65366 16476 10414 -35398 -94970 -124275 -124595
11352 -124595 -115262 -109658 -59013 13817 22964 -65914 -67809 -73616 -79840 -38365 3334 -40880 -4739
11339 -4739 33842 -3560 -25764 -25842 -31559 -50289 -39008 -15097 -13459 -67456 -99157 -30407 14504
11326 14504 3693 -23898 -56230 -78068 -62975 -26489 30728 -964 -15471 13256 14018 9461
11314 9461 9395 5120 21228 2633 -12976 -1492 -12612 -20707 -5517 23489 19076 12670 11849 45675
11300 45675 43908 42160 57716 42362 34193 11926 736 -6499 -8600 -13314 -70659 -25270 -18639
11287 -18639 -25780 -73059 -67776 -6800 48066 50329 70815 103951 65968 57379 99174 114260
11275 114260 128655 98437 139521 157550 194230 171708 172335 159195 93570 35591 -2441 -60647
11263 -60647 -65894 -48386 -38719 -11483 3433 19585 44569 63758 50764 25159 -16844 -19647
11251 -19647 -30441 -60518 -78213 -80989 -84565 -30051 28188 76899 33590 79019 99592 75106
11239 75106 54865 21965 4682 -207 -23238 -50870 -66175 -62336 -41232 -13792 8168 545
11227 545 -44117 -65308 -14595 -13745 -11486 12704 -88799 -137654 -98770 -79812 -97223 -106037 -111559
11214 -111559 -71166 -98324 -54059 3762 -33208 25929 50961 24276 28492 235 -9948 -23722
11202 -23722 -66255 -28235 -35837 -49121 -75634 -106637 -65977 -19350 8546 62551 65804 61493
11190 61493 40279 30204 46236 69561 54836 44501 -1699 -14913 16692 7513 -12520 -38801
11178 -38801 -86767 -71558 -113509 -117195 -76611 -78229 -75361 -121363 -74151 -13592 -29680 -55873
11166 -55873 -29979 -60854 -73633 22984 31971 -27675 -31786 -6541 -72304 -83610 -13149 15317
11154 15317 7373 3120 -30042 -52302 12867 4859 26153 70531 108897 119106 78108 37840
11142 37840 52472 49305 23375 31530 -14001 -13770 30952 45405 -2480 -46235 -98176 -52602
11130 -52602 935 -3531 -84968 -124332 -90087 -39500 6205 56301 26336 -1904 -71741 -63771
11118 -63771 -86319 -57198 17248 33970 -46538 -32888 -31394 -38932 -70009 -49451 -98122 -73828
11106 -73828 -10750 4173 56595 -12054 -58892 -27944 -15161 13697 49908 46536 38611 36937
11094 36937 81658 33369 -16764 -3338 54239 6075 -10193 48963 88198 100025 85138 8107
11082 8107 10336 48114 29342 27672 32273 72584 50026 26082 2836 -39797 -69655 -86145
11070 -86145 -51007 3674 -16183 3063 -16772 32059 58703 30837 4406 4079 -4467 7659
11058 7659 10035 53011 68282 127906 111920 75621 11761 -26495 -10118 -49405 -81393 -68207
11046 -68207 -34207 -48806 -64128 -25136 13596 61892 55578 36454 40787 29975 38576 34299
11034 34299 195 -58758 -79026 -39469 -26676 -70453 -65658 -71602 -35030 24296 41767 -20946
11022 -20946 -76517 -42233 -66014 -57628 -5353 17953 4293 -35684 -118776 -128659 -65521 -52506
11010 -52506 -65309 -80011 -13699 10188 -22861 8885 -39357 -71659 -37299 -28479 -92435 -29869
10998 -29869 -10476 -3973 -4094 -24901 -74842 -111092 -125836 -90210 -75793 -43309 -25869 -8833
10986 -8833 -3334 -24413 -34699 -57572 -85494 -8172 -5304 -4221 -2728 32027 45214 31723 -56632
10973 -56632 -99907 -58461 -4664 12610 -18154 -36622 -105741 -51927 -24458 -12309 -51590 -90085
10961 -90085 -24659 15843 11895 24406 3121 -41869 -43219 5459 -27018 -30712 -19404 -1092
10949 -1092 109171 61215 7697 43 -76776 -77594 5603 17529 -6608 39442 29715 32407 60399
10936 60399 78864 117334 107798 129477 103414 114384 122360 113249 108892 80203 30691 2451
10924 2451 -110961 -158574 -155228 -95198 8020 52378 13702 -36637 -45222 -25360 7277 -64920
10912 -64920 -146572 -132916 -109464 -113066 -48772 13023 -28565 -105020 -66903 -35854 -46201 -57408
10900 -57408 -34232 18329 8115 -44823 -44641 1826 37740 72831 108678 105157 55178 8088
10888 8088 28169 17362 26229 876 22712 15142 47341 51375 39578 53087 11095 2144 15294
10875 15294 -15331 -33610 -40660 -40961 -63 14271 17721 -326 -7486 -38094 -45859 -44509 -98146
10862 -98146 -104265 -34485 5183 -25050 2547 27976 -3013 -11948 -1978 -33295 9520 46859
10850 46859 -8512 -43292 -23430 -30062 -7167 77866 71582 35325 50186 40814 71412 28327
10838 28327 -17918 -50414 -58095 894 56726 71745 4708 -22059 -21768 -96716 -31650 48995
10826 48995 32246 17384 50344 63215 3310 1631 -27125 -69530 -94045 -67973 -12467 38864
10814 38864 67194 53459 97437 85722 19413 -26424 23530 27361 58307 47948 8769 -61785
10802 -61785 -39400 -36050 -56243 -16423 21699 9408 -17956 -75006 -92584 -64826 -25363 30162
10790 30162 37291 -10124 -28756 -34550 22350 84178 83455 54139 33802 -31556 12423 88239
10778 88239 112765 55983 19187 43341 48497 11621 -42402 -92404 -61936 -75988 -120683 -54049
10766 -54049 1228 27541 25219 5684 -24411 -56476 -70025 -85771 -118515 -134295 -147813 -116569
10754 -116569 -59759 -69887 -152412 -132315 -87794 -87002 -55252 -43612 3931 -1742 -45697 5195
10742 5195 26049 23763 16022 5739 -14791 -35946 -19717 -70882 -73371 -18135 42407 21544
10730 21544 -20719 -8263 -36490 -69541 -63028 -31940 72927 66764 22505 16205 10229 41051
10718 41051 13947 -20366 2505 38722 -361 -53452 -52114 -83891 -121444 -88854 -85613 -48824
10706 -48824 -62253 -52776 -8326 27921 2566 -40804 -89844 -70729 -47223 -10121 19217 23087
10694 23087 35350 42468 -9304 -22453 -42112 -30287 -26283 -35306 -30404 -21678 12839 -20863 -39765
10681 -39765 -52889 -79664 -88132 -95082 -109689 -172589 -63792 -4057 21841 20214 29400 34773
10669 34773 -51383 -131010 -116325 -99084 -76668 -100366 -91234 -49607 -21714 -2181 -6403 24630
10657 24630 72980 83644 83750 101252 138785 92701 33692 63312 60809 7616 -61218 -91482
10645 -91482 -32777 1848 65092 74547 -13031 -70440 -41717 9557 -38274 -71545 -52511 -37467
10633 -37467 -11005 40898 12512 15748 -14718 -16734 -50474 -7323 3031 19115 29001 -60647
10621 -60647 -91416 -53734 -48044 -48089 -20136 -35061 -77845 -64967 -82629 -71044 30768 84285
10609 84285 8554 -48032 -42664 -47233 -5257 23028 65188 65389 75897 128651 150802 115159
10597 115159 43397 55396 79980 65031 45011 44962 74535 51669 30296 -4238 -2090 47942
10585 47942 72545 22189 -25718 4654 74915 78513 68644 62291 90291 87263 39934 87306
10573 87306 82404 58145 44635 57652 89884 52164 -19422 -78325 -56931 -32304 14806 36779
10561 36779 -6446 -63155 -26789 11169 -17874 -42299 -3696 82198 94789 34337 49515 96438
10549 96438 101053 47145 35840 21047 -8549 -6324 -46769 -89432 -84759 -49492 7295 30290
10537 30290 28027 8834 -36298 -34202 -27673 16590 73301 85756 19790 -8630 20476 44119
10525 44119 62602 11184 11614 -7040 7635 2592 37188 69813 112745 97240 103635 87883
10513 87883 37437 -26178 713 46834 58604 109337 143624 163955 139153 84958 90696 137785
10501 137785 157723 173689 131768 147705 173175 147992 182648 180945 239612 266474 260531 219296
10489 219296 212115 239240 216976 226218 247447 241854 117122 66556 31746 265 34838 66460
10477 66460 71677 45732 24108 43105 43405 22174 -85003 -66012 -5525 8639 2353 39925
10465 39925 38574 -3679 22473 24067 6697 13786 -1896 -18046 -5462 25457 61707 5185
10453 5185 -9694 18556 -5677 7114 -16926 -10733 -2293 24739 45160 13501 7139 -49717
10441 -49717 -11282 49690 64688 131393 158613 134705 103637 67140 43384 11013 43621 38251
10429 38251 21004 27880 74762 31664 38202 67510 62811 84626 75518 55441 108127 117103 63303
10416 63303 45162 72290 92844 78644 4861 -22202 15658 75807 73944 73501 48556 98559
10404 98559 148231 178447 177585 143203 90067 19753 16771 56092 48245 46735 -5510 11091 -15858
10391 -15858 -6142 51368 36751 -72464 -65143 -7834 -19958 -42758 3213 -18513 23135 -1367
10379 -1367 -34469 -16974 16874 -42588 -41944 -49975 -22644 -48963 -82510 -28803 31583 60491
10367 60491 61101 89451 79469 62585 59551 70916 29717 5730 40237 103939 103382 80374 69751
10354 69751 136917 66454 -39100 -74382 -117370 -82229 -59289 -16021 -22283 20291 21614 -5553
10342 -5553 -1044 78232 96895 8588 -72581 -48838 19953 83068 83403 115634 96796 104928 78802
10329 78802 7778 -75588 -53562 -13719 38396 102490 95388 43281 -2121 12664 23094 20018
10317 20018 20660 40108 37204 14568 65605 124538 109123 161116 181863 139296 83882 22201
10305 22201 3552 48934 69221 50816 32406 36709 29301 25160 58844 83116 89032 7891
10293 7891 1018 9772 81936 146796 153537 141045 142212 183785 205954 229946 225044 227310 269875
10280 269875 315311 357207 334995 290563 264117 229196 233076 206690 169770 148124 180781 169202
10268 169202 146811 101934 91730 66571 18930 30013 90673 99229 101758 112509 134384 97566
10256 97566 60079 65327 60493 42510 469 -78294 -40241 69260 74722 48771 7751 17831
10244 17831 28810 46385 57052 -177 23960 132700 99936 159124 150541 119595 96883 83773
10232 83773 62801 65093 22541 39005 -2934 -80861 -53154 -21774 16343 40758 73112 78858
10220 78858 22573 41739 -15475 -31711 2655 24735 -1055 -12414 25645 61304 75704 60761
10208 60761 1325 -37588 -50465 -2499 80261 88295 118616 121582 70505 39807 32111 17230
10196 17230 12760 20789 -15222 -31995 -29535 14172 64292 63708 10487 2460 18305 19437 -17322
10183 -17322 -91727 -44922 -21379 -7748 15297 42740 62147 84480 96727 47708 17982 -7577
10171 -7577 38501 52532 15014 13337 19823 6485 32849 -11737 -86843 -66255 -41902 -2853
10159 -2853 21540 26118 10465 67546 30988 -12477 23190 63093 51873 29664 11525 -36228
10147 -36228 -31057 21732 67296 46677 36529 104353 61029 -20786 -15091 -39931 -78415 -99378
10135 -99378 -78777 9118 95012 98042 58175 53985 37411 -27726 -78288 -9483 17504 39120
10123 39120 38159 58975 -29050 -88909 -70525 -15073 -4151 -8610 54192 35114 36533 49406
10111 49406 -26314 -49398 -24786 17159 53757 40619 41495 12939 -4642 49227 48093 7101
10099 7101 -30423 -63317 20350 66662 31121 -10504 1297 41416 110443 153195 218904 259174
10087 259174 310944 378679 420602 404535 390286 294632 221155 193814 147297 115754 174292
10076 174292 121909 79788 121133 84762 119400 119106 86475 127976 95082 78688 48783 21744
10064 21744 -8375 -20505 -4809 -291 20007 38772 58086 -837 -8511 25722 -12955 -1718
10052 -1718 -59545 -92422 -45673 -38872 -51282 -18997 24057 -16219 -65360 -75845 -14010 -61693
10040 -61693 -91025 -75130 -17078 64793 100422 127047 77464 28757 81949 114944 107259 87642
10028 87642 62931 73899 47637 56 -27389 12721 -101 48573 79002 51857 35431 -3086
10016 -3086 406 46843 50823 40298 -11970 -48111 -79209 -77807 -42272 -38745 -21320 -36732 -36477
10003 -36477 -64282 -23707 15956 -20088 -56698 -63733 56544 91642 31199 4530 -20351 -47187
9991 -47187 -24519 -14182 -27733 -29226 -2922 27816 -25753 -44715 2761 27602 31178 30986 23783
9978 23783 -43191 -99077 -103253 -59131 22347 45771 5172 -12212 -7791 17183 32303 49247
9966 49247 74328 34425 43901 20408 -13841 18358 22620 31148 -22403 -11805 73655 102663
9954 102663 82949 68182 95816 103236 71190 57655 70277 37295 -6104 30132 77922 99824
9942 99824 154653 127555 92792 43291 -6180 -10347 13806 25116 568 -1500 29533 86157
9930 86157 80376 71234 119882 191958 177605 57739 1482 -48217 -46932 -12750 24083 5686
9918 5686 -7067 -1929 -12026 27676 79520 78885 30642 23290 22584 40292 57257 7176 -74975
9905 -74975 -112125 -45642 24655 72246 52865 70261 91511 117909 87288 62923 34899 -38413
9893 -38413 -66234 -41516 -62064 -64767 -77794 -58214 -3789 11748 59940 90746 46093 -20840
9881 -20840 -45708 -64675 -44108 13241 -10957 -87056 -49325 23299 33375 -36102 -11524 30618
9869 30618 55879 88058 105712 111628 76493 -38907 -52356 -69496 -129193 -121968 -62675 10805
9857 10805 35560 60129 56094 1946 1278 11411 40518 103434 89090 102224 106064 78936 23368
9844 23368 58425 72140 20414 52594 82342 59422 26597 17113 -15932 1994 -23526 -24984
9832 -24984 -2204 65247 106644 40157 -66 75476 127867 117900 61027 41031 79379 106197
9820 106197 138479 87952 91029 125355 119308 81956 35136 19410 8742 -74517 -52676 -8302
9808 -8302 -19313 31800 63178 54111 47361 60813 82979 112263 108066 46933 67283 122835 80878
9795 80878 38970 30232 132029 98414 73502 21725 -21981 -18216 18504 32732 99408 68593
9783 68593 28075 9815 53604 27808 15930 8522 26440 14523 -14003 28308 30439 21675
9771 21675 43650 45845 74043 100099 21661 -41187 -41554 -17325 18759 58082 56508 20956 57909
9758 57909 20389 42466 76720 78368 80488 22093 38699 27521 -25286 -119833 -74758 -10912
9746 -10912 -18479 -13749 13554 -9310 -50984 -3482 15687 27847 2420 60825 118807 183321
9734 183321 175743 84431 -4135 -66647 -66769 21495 44061 67802 87541 51737 2481 -24575
9722 -24575 9422 61797 34107 30144 23551 -55492 -79916 -78679 -84190 -82540 -10230 -32904 -7958
9709 -7958 -49419 -87685 -54725 4561 85517 107344 58497 11499 19884 118647 162748 107985
9697 107985 108253 50397 19325 69480 39208 -16395 -60033 -56984 14039 45359 75999 94571
9685 94571 18225 11303 4379 11299 10697 10276 37100 44100 32235 46582 44211 18822 23262 8839
9671 8839 -3758 29294 42726 71150 -4027 -102122 -129595 4130 105945 108143 59046 47674
9659 47674 46863 26188 33032 -5552 -37893 -44420 43302 49215 61801 111050 37602 1848 17041
9646 17041 60944 20980 64568 22062 10869 25660 51381 52163 158621 169971 151331 80297
9634 80297 62203 44526 16649 31098 -564 -9715 -6415 -25129 -40981 -20825 9415 18940
9622 18940 67470 92758 55209 11153 24977 52760 62259 56942 93504 43535 17393 39051
9610 39051 79290 72812 68502 82500 102425 77874 -16105 -72431 -57690 -34799 -53457 -41170
9598 -41170 -59635 -57133 22851 64053 59300 32225 65456 46231 3343 -312 39792 2766
9586 2766 -35153 9163 48991 57696 49398 105809 138723 117945 97788 2081 -29998 -8924
9574 -8924 -10886 -39696 -1941 -42520 -73999 -39466 965 36346 57446 88116 101944 96984
9562 96984 54454 29709 -3804 12054 15659 63487 35037 26478 63943 93764 87050 63378
9550 63378 57487 63763 105307 98538 96148 44122 40765 79496 97876 109536 143287 117303 102226
9537 102226 49134 24793 77526 64560 45193 71458 113392 57233 2279 28261 32271 20438
9525 20438 49163 69528 73662 96482 26112 88661 123155 29150 -6674 6176 58598 94423
9513 94423 89345 69342 107412 140061 94028 32300 35250 -26035 -17183 -4280 -36709 -10013
9501 -10013 48300 68723 64236 63176 59217 112619 150316 91995 66020 103737 110269 82662 148510
9488 148510 142921 107312 91872 -35440 -35624 -67365 -102275 -39005 -57015 -75448 -62357 -47001
9476 -47001 -37112 13752 93588 101419 96359 95985 111650 151784 82250 53011 111319 147612 165522
9463 165522 115375 147983 121069 82571 89480 111448 60207 25895 45751 33796 39642 125433
9451 125433 154475 98746 73622 119471 132429 104580 52742 1161 33731 16917 66446 153649
9439 153649 152041 172622 203191 167591 185381 210459 230135 273377 201695 171912 222781 212413
9427 212413 175683 128980 122775 114542 146367 136826 127359 57364 37210 64161 32565 36996 59350
9414 59350 86486 78596 60430 100768 113322 153149 158736 146538 157399 206699 172707 131485
9402 131485 87982 133480 210802 203392 182769 223442 177263 184905 145368 117488 83175 49929
9390 49929 -3294 26533 74791 64386 42773 75751 38223 26424 48228 26926 99590 96243
9378 96243 43143 52669 71548 64470 43103 50655 100428 166122 177589 170442 129490 60724 31647
9365 31647 86569 173019 201311 267371 226892 149546 141563 182136 176038 153329 203006 234163
9353 234163 204843 203708 158096 121244 98847 186601 192266 123146 95263 119237 126095 145470
9341 145470 184111 155644 151428 189791 150288 135831 214529 224196 204032 244685 251501 184967
9329 184967 179392 178155 151349 192093 271143 343699 359099 262460 224452 260839 265731 302436
9317 302436 307674 293657 300807 226037 193757 164158 138929 156121 191153 206954 227506 276424
9305 276424 333716 352723 363330 289491 191103 173908 280064 338249 360568 358003 336821 271985
9293 271985 297722 326682 314185 289698 324055 357401 310303 304578 333426 323518 366615 378100
9281 378100 426939 409658 398820 399769 378469 406251 393825 432833 440882 420778 488420 495825
9269 495825 495343 504109 534890 605157 619268 642801 598802 523835 533937 553270 595532 586240
9257 586240 583087 648205 770884 791806 790666 770446 782945 911792 911819 961510 983811 1031634
9245 1031634 1053402 1076683 1058357 1056664 1107644 1168888 1247860 1311539 1263164 1226740 1298752 1389606
9233 1389606 1455027 1504828 1513743 1559551 1581575 1650549 1740595 1820659 1886189 1884692 1871104 1869663
9221 1869663 1886015 1936252 1933819 1954324 1968973 2037851 2086645 2097441 2102975 2034911 1975498 1950291
9209 1950291 1986580 1993950 1942367 1880751 1870633 1816528 1740872 1708888 1704518 1643837 1585341 1477924
9197 1477924 1431990 1334742 1339979 1414211 1298944 1136498 1079918 1065225 1064693 1076363 1001300 874391
9185 874391 793548 783446 736683 736294 764423 774819 785912 695956 636514 593964 615295 569509
9173 569509 532510 481891 499034 467421 432603 396156 400750 366789 316992 311077 355311 364991
9161 364991 336919 338879 366630 301968 269639 282972 330504 280444 254997 214286 207983 248446
9149 248446 283991 311011 287306 238495 237968 263130 206075 121023 130745 206201 210815 157545
9137 157545 187712 210465 173233 102509 129060 140196 160904 189904 216732 200342 130033 169236
9125 169236 192283 174522 150679 168832 203486 207049 186106 168316 151225 88572 49416 72537
9113 72537 96610 153831 175198 194297 139380 128724 154523 162922 182246 144597 98973 67424
9101 67424 73833 138448 97976 100885 106998 74252 82820 97727 94627 110138 59287 25811 96377
9088 96377 114470 94921 24082 31957 47788 59956 105021 74720 54596 31416 -21858 -21422
9076 -21422 -16792 -38079 -51052 35477 59183 57834 106525 117506 122348 70367 43145 55001
9064 55001 92372 111604 131568 104521 76124 94661 39295 28214 42782 21592 -20789 16985
9052 16985 92597 129287 132666 163562 80569 11232 96350 154971 145983 146304 94455 105769 49931
9039 49931 732 46008 819 -63433 -41386 -8089 42416 144134 165017 155239 155248 174934 141010
9026 141010 58267 87333 104745 92423 14707 -26574 -706 22134 9647 40144 126261 144736
9014 144736 98180 91001 132490 98164 79471 73814 59133 103692 138549 158485 116957 93789
9002 93789 81660 76335 115177 104178 127579 152980 152508 114075 48542 -40537 -9947 24452
8990 24452 8555 48835 11490 23698 -22866 -30035 37019 81586 76779 81405 105045 62541
8978 62541 29809 40685 28260 3874 28945 39191 5138 -55022 -72854 -53539 -26884 -75202
8966 -75202 -24942 -11268 -24019 -35635 -46888 -8990 52456 50272 15801 21892 23108 24542 68085
8953 68085 91588 76309 57829 92722 64531 73429 93913 81748 83904 30385 66398 57715
8941 57715 82826 87482 43712 14448 -30621 -58973 -45578 -13778 -14411 -6210 -5476 -10649 -5734
8928 -5734 -26642 6516 48887 33290 77518 104626 129797 105691 127749 64004 9675 28116
8916 28116 54514 100629 74288 4831 -27762 -14404 -6028 230 6702 48489 65141 91765
8904 91765 63636 91996 106182 123590 165912 118857 91746 87725 117545 60927 45111 75915
8892 75915 96495 104294 117144 142207 147275 140199 94862 104334 143840 124365 131733 139420 129829
8879 129829 114863 115532 134480 163243 187778 159963 155562 157859 147554 98384 38736 -674
8867 -674 3412 78623 134935 120789 67911 58185 40489 70739 74848 81611 115792 169823 172714
8854 172714 130547 123713 119214 80291 75708 121136 131633 111693 95093 112817 106223 87149
8842 87149 71269 70831 82939 62500 20245 39908 78492 49835 24903 28736 71852 107271
8830 107271 159934 162642 96359 79542 101022 148964 177073 191331 191405 137185 112836 99871
8818 99871 65510 30173 45693 53258 39490 58745 59821 85025 94612 110274 139333 156884
8806 156884 120980 186316 173244 124738 92042 74956 32250 71507 106665 72109 16600 68871
8794 68871 119339 115332 103491 92322 133900 208958 223394 158931 136489 136467 189776 166682 246417
8781 246417 284962 285675 228048 218238 194131 202153 168323 172325 185721 156124 146135 146300 173509
8768 173509 187495 204310 215260 194925 184801 156338 73315 49233 55428 104829 103702 67557
8756 67557 90844 170995 190082 138971 167968 137705 160780 126970 72569 36494 31045 17278
8744 17278 40443 51465 35743 61374 141135 119901 106444 143800 164405 194072 180482 210154
8732 210154 187433 213574 212901 170840 174270 187303 136513 98845 182059 225918 223625 189151
8720 189151 190574 118078 77226 93181 84131 124157 155984 143267 92997 116702 107381 158377
8708 158377 166140 126414 169980 202741 179995 162436 122443 154444 177212 236374 267227 266581
8696 266581 300355 300919 274775 249061 295772 395919 423047 334556 327708 294496 255542 305809
8684 305809 290631 247682 221291 212109 227297 265428 237533 239495 330143 325396 285294 320342
8672 320342 300205 283622 302108 276290 220878 233045 262817 259745 266139 263823 301152 282303
8660 282303 315680 298473 272450 277100 259497 259368 278481 208164 137641 132373 206279 233747
8648 233747 257035 246451 221530 244494 185396 257558 366722 388780 309057 326593 352237
8637 352237 341971 392938 470236 515878 460297 412872 400505 373003 363327 401418 473993 452263
8625 452263 514301 499669 473800 436590 408687 448411 506068 524766 529023 513587 501021 499288
8613 499288 511532 557578 568065 562849 612868 631066 699192 719015 677801 736880 783391 760948
8601 760948 790511 852535 892267 902263 986137 1003741 1064695 1155957 1205556 1265305 1356228 1529952
8589 1529952 1697549 1788059 1866439 1997643 2185646 2379585 2615561 2823942 2850024 2942489
8579 2942489 2990871 2915629 2698415 2419105 2178739 1930168 1691461 1494461 1366507 1257410
8569 1257410 1101691 1037661 1004188 869519 794585 716614 601414 534077 488102 536029 614786
8558 614786 604652 552187 487763 384202 327200 371065 361341 366656 391819 374172 353178 364309
8546 364309 322657 326786 380756 370315 392934 325139 314698 370149 410006 344448 332581 352446
8534 352446 280567 220519 226412 205784 167621 178132 203036 202086 177725 139113 155755 218196
8522 218196 256724 196159 141079 134718 194499 176434 191032 172449 110764 113011 163743 194936
8510 194936 167853 147450 165582 154882 163773 130252 46005 89636 119696 137926 139146 191942
8498 191942 201718 179643 91099 88336 91819 127387 137034 149483 140561 107682 118738 191645 203362
8485 203362 190908 104733 148253 153292 64750 -9742 -63631 -89795 -41495 -28392 51813 126702
8473 126702 136526 148395 189177 194603 167821 118431 33349 22076 8186 -17273 30340 52558
8461 52558 45668 44179 38011 84141 113176 90604 132262 140417 66527 43177 26527 21576 30180
8448 30180 26315 11289 23631 89165 65391 62334 40442 -2792 -15132 11934 93088 139039
8436 139039 129674 110413 79731 67606 99773 19695 -47245 -31383 -30724 -36558 -17725 15128
8424 15128 27669 53902 18575 74243 83817 53737 68626 60016 45577 -3312 -17611 574
8412 574 18873 60766 131958 155782 140197 95844 64001 62807 59383 62056 67478 104680 120424
8399 120424 121628 107423 65164 57857 39188 -38380 11662 78898 57051 79492 162999 172986
8387 172986 112280 94919 58265 86052 73125 -9467 7043 70406 62975 40930 44565 10867
8375 10867 20052 -6511 61178 96500 124257 70826 29718 -10265 5627 65111 10545 22897
8363 22897 71023 119283 122282 49724 -6172 28521 74747 36027 -20588 -62273 -78479 -78347
8351 -78347 -43380 -19512 9600 44501 113567 132860 83532 48328 19139 -31170 -97376 -23090
8339 -23090 -21143 21368 105898 139224 126602 132184 144451 109044 105354 54706 34695 33493 30431
8326 30431 123248 152697 83068 55694 137554 115126 17060 22327 119300 88153 47460 95538
8314 95538 98239 65048 22468 53890 130760 125003 71109 57923 66107 76450 83666 71072 105338
8301 105338 112525 107187 143631 96915 55774 65113 14129 -55096 -43038 9800 6019 52005
8289 52005 82614 67282 58932 64686 75265 125773 57609 -1910 -55754 -52175 -62059 -62856 -6576
$$ [...]
##END NTUPLES=NMR SPECTRUM
##END=
