##TITLE=Analysis number 319934
Compound Code jfd 00688
Project Code adrs
Chemist Name stores
##JCAMPDX= 6.0         $$ Bruker NMR JCAMP-DX V2.0
##DATA TYPE= NMR SPECTRUM
##DATA CLASS= NTUPLES
##ORIGIN= Bruker BioSpin GmbH
##OWNER= nmr
$$ XWIN-NMR		Version 3.5
$$ Fri Jun  2 12:48:42 2006 GMT Daylight Time (UT+1h)  MAYBRIDGE\nmr@NMR_250MHZ
##.OBSERVE FREQUENCY= 250.131544655141
##.OBSERVE NUCLEUS= ^1H
##.ACQUISITION MODE= SIMULTANEOUS (DQD)
##.ACQUISITION SCHEME= undefined
##.AVERAGES= 16
##.DIGITISER RES= 18
##SPECTROMETER/DATA SYSTEM= dpx250
##.PULSE SEQUENCE= zg30
##.SOLVENT NAME= DMSO
##.SHIFT REFERENCE= (INTERNAL, DMSO, 0, 16.522)
##AUDIT TRAIL= $$ (NUMBER, WHEN, WHO, WHERE, WHAT)
$$ ##TITLE= Audit trail, XWIN-NMR		Version 3.5
$$ ##JCAMPDX= 5.01
$$ ##ORIGIN= Bruker BioSpin GmbH
$$ ##OWNER= nmr
$$ C:\u/data/dgb/nmr/ADRS/240/pdata/1/auditp.txt
$$ ##AUDIT TRAIL=  $$ (NUMBER, WHEN, WHO, WHERE, WHAT)
(   1,<2006-06-02 12:48:03.88 +100>,<MAYBRIDGE\nmr>,<NMR_250MHZ>,
      <created by zg, POWCHK disabled, PULCHK disabled
       configuration hash MD5:
       E2 DF 36 D8 04 B2 41 60 5A D7 A3 38 5A 4B D0 FE
       data hash MD5: 64K
       0A 50 D7 F4 B3 9F B5 52 A0 3B C0 54 8D E4 DD 0B>)
(   2,<2006-06-02 12:48:22.05 +100>,<MAYBRIDGE\nmr>,<NMR_250MHZ>,
      <Start of raw data processing
       ef LB = 0.3 FT_mod = 6 PKNL = 1 SI = 32K 
       data hash MD5: 32K
       C4 CD 62 9C FD 20 7E DB C9 A0 7A 53 DC E8 E6 5D>)
(   3,<2006-06-02 12:48:27.18 +100>,<MAYBRIDGE\nmr>,<NMR_250MHZ>,
      <apk 
       data hash MD5: 32K
       7C FA 97 80 67 68 74 E6 A2 98 9B 82 F9 C0 B2 23>)
(   4,<2006-06-02 12:48:29.19 +100>,<MAYBRIDGE\nmr>,<NMR_250MHZ>,
      <abs ABSG = 5 
       data hash MD5: 32K
       1C 53 C0 F9 4B 74 14 8C F7 D0 24 4C 55 C5 66 A4>)
$$ ##END=
$$ 
$$ hash MD5
$$ 33 F8 67 E3 D3 63 5F 3E 8E B3 D6 7C 5B F2 09 56
##$RELAX= 
##$RELAX= 
##$RELAX= 
##$RELAX= 
##$RELAX= 
##$RELAX= 
##$RELAX= 
$$ Bruker specific parameters
$$ --------------------------
##$DU= <C:\u>
##$EXPNO= 240
##$NAME= <ADRS>
##$PROCNO= 1
##$TYPE= <nmr>
##$USER= <dgb>
##$AMP= (0..31)
100 100 100 100 100 100 100 100 100 100 100 100 100 100 100 100 100 100 
100 100 100 100 100 100 100 100 100 100 100 100 100 100 
##$AQSEQ= 0
##$AQ_mod= 3
##$AUNM= <au_zg>
##$AUTOPOS= <29 >
##$BF1= 250.13
##$BF2= 250.13
##$BF3= 250.13
##$BF4= 250.13
##$BF5= 500.13
##$BF6= 500.13
##$BF7= 500.13
##$BF8= 500.13
##$BYTORDA= 1
##$CFDGTYP= 0
##$CFRGTYP= 5
##$CHEMSTR= <none>
##$CNST= (0..31)
1 1 145 1 1 1 1 1 1 1 1 1 1 1 1 1 1 1 1 1 1 1 1 1 1 1 1 1 1 1 1 1 
##$CPDPRG= <>
##$CPDPRG1= <>
##$CPDPRG2= <>
##$CPDPRG3= <>
##$CPDPRG4= <mlev>
##$CPDPRG5= <mlev>
##$CPDPRG6= <mlev>
##$CPDPRG7= <mlev>
##$CPDPRG8= <mlev>
##$CPDPRGB= <>
##$CPDPRGT= <>
##$D= (0..31)
0 1 0 0 0 0 0 0 0 0.06 0 0 0 0 0 0 0.0002 0 0 0 0 0 0 0 0 0 0 0 0 0 0 
0 
##$DATE= 1149248881
##$DBL= (0..7)
120 120 120 120 120 120 120 120 
##$DBP= (0..7)
150 150 150 150 150 150 150 150 
##$DBP07= 0
##$DBPNAM0= <>
##$DBPNAM1= <>
##$DBPNAM2= <>
##$DBPNAM3= <>
$$ [...]
##$SUBNAM7= <"">
##$SUBNAM8= <"">
##$SUBNAM9= <"">
##$SW= 20.6930455092707
##$SWIBOX= (0..15)
0 0 3 0 0 0 0 0 0 0 0 0 0 0 0 0 
##$SW_h= 5175.983436853
##$TD= 65536
##$TD0= 1
##$TE= 295.16
##$TE2= 300
##$TE3= 300
##$TEG= 300
##$TL= (0..7)
0 120 120 120 120 120 120 120 
##$TP= (0..7)
150 150 150 150 150 150 150 150 
##$TP07= 0
##$TPNAME0= <>
##$TPNAME1= <>
##$TPNAME2= <>
##$TPNAME3= <>
##$TPNAME4= <>
##$TPNAME5= <>
##$TPNAME6= <>
##$TPNAME7= <>
##$TPOAL= (0..7)
0.5 0.5 0.5 0.5 0.5 0.5 0.5 0.5 
##$TPOFFS= (0..7)
0 0 0 0 0 0 0 0 
##$TUNHIN= 0
##$TUNHOUT= 0
##$TUNXOUT= 0
##$USERA1= <user>
##$USERA2= <user>
##$USERA3= <user>
##$USERA4= <user>
##$USERA5= <user>
##$V9= 5
##$VALIST= <valist>
##$VCLIST= <CCCCCCCCCCCCCCC>
##$VD= 0
##$VDLIST= <DDDDDDDDDDDDDDD>
##$VPLIST= <PPPPPPPPPPPPPPP>
##$VTLIST= <TTTTTTTTTTTTTTT>
##$WBST= 1024
##$WBSW= 4
##$XGAIN= (0..3)
0 0 0 0 
##$XL= 0
##$YL= 0
##$YMAX_a= 261894
##$YMIN_a= -437386
##$ZGOPTNS= <>
##$ZL1= 120
##$ZL2= 120
##$ZL3= 120
##$ZL4= 120
##$ABSF1= 16.522
##$ABSF2= -4.171173
##$ABSG= 5
##$ABSL= 3
##$ALPHA= 0
##$AQORDER= 0
##$ASSFAC= 0
##$ASSFACI= 0
##$ASSFACX= 0
##$ASSWID= 0
##$AUNMP= <proc_1d>
##$AZFE= 0.1
##$AZFW= 0.1
##$BCFW= 0
##$BC_mod= 0
##$BYTORDP= 0
##$COROFFS= 0
##$CY= 12.5
##$DATMOD= 1
##$DC= 0
##$DFILT= <>
##$DTYPP= 0
##$F1P= 14.0000005364418
##$F2P= -0.99999901652339
##$FCOR= 0.5
##$FTSIZE= 32768
##$FT_mod= 6
##$GAMMA= 0
##$GB= 0
##$INTBC= 1
##$INTSCL= 1
##$ISEN= 128
##$LB= 0.3
##$LEV0= 0
##$LPBIN= 0
##$MAXI= 10000
##$MC2= 0
##$MEAN= 0
##$ME_mod= 0
##$MI= 0
##$NCOEF= 0
##$NC_proc= -5
##$NLEV= 6
##$NOISF1= 0
##$NOISF2= 0
##$NSP= 0
##$NTH_PI= 0
##$NZP= 0
##$OFFSET= 16.522
##$PC= 1
##$PHC0= 161.1643
##$PHC1= 14.43124
##$PH_mod= 1
##$PKNL= yes
##$PPARMOD= 0
##$PSCAL= 4
##$PSIGN= 0
##$REVERSE= no
##$SF= 250.13
##$SI= 32768
##$SIGF1= 0
##$SIGF2= 0
##$SINO= 400
##$SIOLD= 32768
##$SREGLST= <1H.DMSO>
##$SSB= 0
##$STSI= 32768
##$STSR= 0
##$SW_p= 5175.98343685301
##$SYMM= 0
##$S_DEV= 0
##$TDeff= 65536
##$TDoff= 0
##$TI= <Analysis number 999999
Compound Code 99
Book Reference 9
Project Code 9>
##$TILT= no
##$TM1= 0
##$TM2= 0
##$TOPLEV= 0
##$USERP1= <user>
##$USERP2= <user>
##$USERP3= <user>
##$USERP4= <user>
##$USERP5= <user>
##$WDW= 1
##$XDIM= 32768
##$YMAX_p= 354743515
##$YMIN_p= -1498591
$$ End of Bruker specific parameters
$$ ---------------------------------
##NTUPLES= NMR SPECTRUM
##VAR_NAME=  FREQUENCY,     SPECTRUM/REAL,   SPECTRUM/IMAG
##SYMBOL=    X,             R,               I
##VAR_TYPE=  INDEPENDENT,   DEPENDENT,       DEPENDENT
##VAR_FORM=  AFFN,          ASDF,            ASDF
##VAR_DIM=   32768,         32768,           32768
##UNITS=     HZ,            ARBITRARY UNITS, ARBITRARY UNITS
##FACTOR=    0.157963299565203, 1,           1
##FIRST=     4132.6476996994, 0,             0
##LAST=      -1043.33573715361, 0,           0
##MIN=       -1043.33573715361, -1498591,    0
##MAX=       4132.6476996994, 354743515,     0
$$ Real data points
##PAGE= N=1
##DATA TABLE= (X++(R..R)), XYDATA
$$ [...]
15557B04538K42151l90432l84632r0486L14726N1718m4128J42442P8395J8666
15547A42958j52131r8414q1708P6760J11116K2999J43309j5504l25798j1849J22675
15536f5587O6838O2610J11881J66559l57932o9405l0829m0104j93714N8129J66763
15525a24791J3640O8537J15548J18000j01106k08546R4451r076k19364M9559k5433
15514b28581J65627K97986p454m00874l20370m2920J95383K55229J20274k0380
15504A3920j15560j63082r4745k06635J63695K89441J19766k25575Q0367Q2549
15494e5859K85253j36652r2018p0244j89737J72394Q3853j19658j29801o5457
15484c17926J44825J85325n3576l69337m09114j01252L54117L53683L68730Q2206
$$ y = [204538, 446689, 56257, -328375, -418861, -104135, -52417, -96545, 45897, 124292, 142958, -9173, -107587, -189295, -112535, -1419, 21580, 164889, 149385, -176413, -188262, -65587, 1251, 63861, 175742, 342301, -15631, -85036, -115865, -155969, -349683, -291554, -124791, -111151, -42614, 72934, 190934, 89828, -118718, -24267, -33343, -252707, -203148, -228581, -62954, 235032, 227578, -173296, -493666, -536586, -341203, -85974, 34300, 13920, -101640, -264722, -359467, -566102, -402407, -112966, 6800, -218775, -138408, -55859, 229394, 92742, 724, -69520, -259257, -86863, -3010, -122668, -252469, -317926, -173101, 12224, -41352, -410689, -819803, -921055, -566938, -213255, 155475, 237681]
15474B37681q0976K17312J20949j21227K5126k48522r1154n5172l7201J2115K13387
15463A92318j00565l38104j09037J38557j29562m5062J11521P2852j44205m6095
15453c97382l7393k22898K34312L44837n0174l65229L8651K68841N6145l8674
15443a68964m3542N8582K39944j54686k00002k2606J33591R3600n6978j25810
15433b46871o8277O464J9489K03513O6045L7712K61274M8925j73155l84885l86694
15422f16460P9348l9981K97953j19902r1491n7681J93738O9301J08862L1982o2533
15411b06864r2581L74614J54858j0192J12263J24696r3921j08031l6689p2545
15401A45608j99014k1127J38721K81716J8005n04247M7494R9587m1378j51777
$$ y = [237681, 156705, 374017, 494966, 373739, 398865, 150343, 59189, 4017, -33184, -21069, 192318, 91753, -246351, -355388, -216831, -346393, -391455, -279934, -207082, -351287, -397382, -434775, -657673, -423361, -78524, -128698, -493927, -455276, -186435, -130290, -168964, -212506, -153924, 86020, -68666, -268668, -291274, -157683, -64083, -121061, -246871, -315148, -308684, -289195, -85682, -19637, 18075, 279349, 328274, 155119, -229766, -616460, -537112, -577093, -279140, -399042, -490533, -548214, -354476, -285175, -176313, -144331, -206864, -299445, 75169, 230027, 219835, 332098, 456794, 362873, 254842, 218153, 145608, -53406, -74533, 64188, 345904, 363909, -140338, -92844, 6743, -34635, -186412]
15391a86412J15997K34230J8793j02679j46350m9341r1073J11037j59629p0427
15381c25854L90201P1680l88386r0827q1796P1037j3105J89207J21673j7253R4580
15370B1157k8999j91364J4333K3205K25812q9222m6755m2748J25484n5701k2192
15359f6990j1734j40532j85706J40833K64952J06370q0631k28887m4111M4508
15349b01928J72083j0846j11479j05602j11779N2282K14936J65401K18678J74272
15339D56018J11288j55587k81221k31870j32922J96618K04316l33750j74107l2161
15329c73378P9040K31081J13999j2748l22396j37358J72333J40568P0902P9543
15319D1586J31401j13675J87061j4931m10684K3161K96349o6709k21716j63805
$$ y = [-186412, -70415, 163815, 182608, 79929, -66421, -115762, -206835, -95798, -255427, -325854, 64347, 136027, -252359, -343186, -424982, -353945, -367050, -177843, -56170, -73423, 21157, -7842, -199206, -184873, -161668, 64144, -25078, -71833, -114581, 10903, -44798, -66990, -78724, -219256, -404962, -264129, 823, 107193, 26562, -202325, -246436, -201928, -29845, -40691, -152170, -257772, -369551, -317269, -102333, 63068, 281746, 456018, 567306, 411719, 130498, -101372, -234294, -37676, 166640, -167110, -341217, -373378, -294338, -63257, 50742, 37994, -284402, -421760, -249427, -108859, -37957, 41586, 172987, 59312, 246373, 231442, -179242, -156081, 140268, 73559, -148157, -311962]
15309c11962K11256K15365m8528L33289K596k44712k90261P7917O8713q3773K16422
15298A46322K32852k73942k45286l4894M1749J13760l06191N1849L96556j2436
15288A10339p389l3378K50020J03394M8436j10160m44520j48076Q9863q4504j98870
15277d24845K51550Q4938j38108J47153j10112k59532k3327J67133J59687P81
15267a44682L31294J75475j41481k34576j6901J45270j6823l32478k15495K62253
15257a88144J61260m9542j33594J51847L04103j02811k03881P4542N537k5963
15247f646J83946M082j02156k45292Q3487L89041R9443l50063l098r8809L2843
15236a3222J82938K3483L15364J94899J7163N6346k99408n85891m11392j85051
$$ y = [-311962, -100706, 114659, 66131, 399420, 402016, 157304, -132957, -55040, 13673, -70100, 146322, 379174, 105232, -140054, -174948, -133199, -19439, -325630, -273781, 122775, 110339, 102950, 69572, 319592, 422986, 471422, 361262, -83258, -231334, -141471, -225975, -424845, -173295, -88357, -226465, -79312, -189424, -448956, -472283, -305150, -145463, -144682, 186612, 362087, 220606, -13970, -30871, 114399, 97576, -234902, -450397, -188144, -26884, -76426, -210020, -58173, 245930, 143119, -60762, 13780, 19317, -6646, 177300, 181382, 79226, -166066, -82579, 306462, 405905, 55842, 52744, -46065, -13222, 169716, 193199, 508563, 703462, 720625, 776971, 477563, -108328, -519720, -704771]
15226g04771J69691L16530Q6927L80212j99688o2955K71372J32830k64385j36307
15216a0544R852R899J46710l64725o2567J29077j20351j08282j87144M6361J22553
15205c89161J51770m3293J02684J36327j94092k9647j26339K55751L50747j82090
15195C2657j28434K05551L6367J75804O2987M2071l25885k72480L5440j74055
15185c09977j01999Q5367N0503j43923q8706m855L62307R3571R1754m0130J54597
15174A48509N920n3887j02697P3297K42753m5801j03214k40065r5309j07004n0236
15163c27734J10372K24604J42064k9073N56J24565l58548K3675K39924j18143
15153C2262j82880L19758J50769J06648j24872j18851o29624l91964J77133M85868
$$ y = [-704771, -535080, -218550, -131623, 248589, 48901, -14054, 257318, 390148, 125763, -10544, -692, 9207, 155917, -208808, -271375, -142298, -262649, -370931, -558075, -511714, -389161, -237391, -280684, -178000, -41673, -235765, -265412, -391751, -136000, 214747, 32657, -95777, 109774, 146141, 321945, 384932, 427003, 101118, -171362, -135922, -309977, -411976, -326609, -276106, -420029, -508735, -513590, -151283, -57712, 34042, -6088, 148509, 154429, 100542, -2155, 71142, 313895, 268094, 164880, -75185, -170494, -277498, -327734, -217362, 7242, 149306, 120233, 120789, 245354, -113194, -89519, 150405, 32262, -150618, 169140, 319909, 426557, 301685, 182834, -446790, -838754, -661621, -175753]
15143a75753L36977K14959m3260J00993k41097k07434J8803j29311k06184J12065
15133b19242L45674p2723l37668j7695K98743M9457o3473R9290J63417n1336m31137
15122b36693k56176L56662J55074k20767M1234J04855R0206J8171m1008Q3580
15112I5138r5297k12231O7834R4854l136j63222k00510N3939j5941J05250j269
15101b74591N6748R7028J02767J86776J04570k48834j21175m1857J46578Q8796
15091I6806j89329j15082k821K9092o4937J59192o2189j65858j89444n0561J64263
15080c90868K54641m0490j28905o3958R8286k1190N6492k44823K22978J819J64410
15069i1608M649k43692l15344N8286J49132K46656j09397n39M9499J01059k6291
$$ y = [-175753, 161224, 376183, 332923, 433916, 192819, -14615, 4188, -125123, -331307, -219242, 126432, 53709, -283959, -301654, -2911, 46546, -16927, 82363, 245780, 194444, -236693, -492869, -136207, 18867, -201900, -160666, -55811, 34395, 52566, 11558, 95138, -159, -212390, -144556, -49702, -52838, -216060, -416570, -362631, -378572, -273322, -274591, -217843, -120815, -18048, 168728, 273298, 24464, -96711, -138568, 8010, 96806, -92523, -207605, -210426, -181334, -246271, -87079, -149268, -315126, -504570, -555131, -390868, -136227, -176717, -305622, -369580, -271294, -292484, -235992, -480815, -257837, -256018, -91608, -86959, -330651, -645995, -587709, -438577, -191921, -301318, -301857, -252358, -151299, -177590]
15058a77590j99072J13344N26281J37407l41743J50543K3541j75689j32360k05765
15048b81103J82062L58303K12805m75151j32331J6547K27286P3061q9553r6451
15038d525P5214N6204J03882R6754j83548J8359J8312j61508n1381j72826k6472
15027b31535J41416J73655P5997k02424q8187j02623j7068M6535M56878p7179
15017A75465j00930m18176J24550K77771L95490j65469j12545j61814p1303n7654
15007a14615l7093K25228J2656J11837L5506j83168j46436k47399j42208L2868
14997d52824j80528L68566M12918N424n8594k68837L6286J05221j41948j54090
14987c28406q9212R6058r302k7693L77911l1903R3479P7061J3392k77984k067
$$ y = [-177590, -376662, -263318, 262963, 400370, 58627, 209170, 232711, 57022, -75338, -281103, -99041, 259262, 472067, -3084, -135415, -118868, 108418, 181479, 91926, -4525, 70689, 126893, 230775, 327529, 143981, 162340, 180652, 19144, -32237, -205063, -231535, -90119, 83536, 159533, -42891, -131078, -233701, -250769, -204234, 252644, 175465, 74535, -343641, -219091, 58680, 454170, 288701, 176156, 14342, -56961, -114615, -151708, 73520, 86176, 198013, 233519, 50351, -96085, -343484, -485692, -452824, -633352, -264786, 148132, 153556, 94962, -173875, -137589, -32368, -174316, -328406, -417618, -321560, -330862, -358555, 19356, -12547, 80932, 157993, 171385, -106599, -108666]
14976a08666K44299n814j66184l25625K05252K76624Q1460l93700j84328L62170
14966a4512K09879r4750k50758q7635q1396j09207m9666P0797j16811M98728P2264
14955D6933j45446K19059j06684o0229j44932K1180P7223N7636O2164K01790j27032
14944A01662l34313K1456J30318P4741K06279K45572j45690j71089O2516K62043
14934D53495l5684k42538k16925k04169M29119J89000M4338R1023j54226p2435
14924B80998j45774n3009j05687m5657p8147k38973k08961q2218J16146J06351
14914d54931K42996J67458l40702l40922r5162r348j21531L09922N14433M4895
14904h2892l0643m2074k8381j62036Q0064N8213J62332k2697k24532J42447p0252
$$ y = [-108666, 135633, 129819, -36365, -361990, -156738, 119886, 201346, -192354, -376682, -14512, 195367, 100617, -150141, -237776, -319172, -428379, -478045, -407248, -524059, -25331, 46933, -98513, 120546, 13862, -46367, -191299, -170119, -92896, -35260, 26904, 228694, 101662, -232651, -211195, -80877, -6136, 200143, 445715, 300025, 128936, 191452, 453495, 417811, 175273, -41652, -245821, 183298, 372298, 416636, 507659, 353433, 280998, 135224, 82215, -23472, -69129, -147276, -386249, -595210, -677428, -561282, -454931, -211935, -44477, -385179, -726101, -821263, -830611, -952142, -642220, -127787, -82892, -113535, -155609, -183990, -346026, -265962, -207749, -45417, -68114, -292646, -150199, -220451]
14893b20451j82760n9222K18458o5447L3444o5948J14925n0765m4428J10148k48998
14882d61044N8745K50558l29268l07092M64441J77149J36592j85913j66699K89586
14872g2945M8745o7727k07881j16918J90105r0502P334P7226M73412k3030l90545
14861a72726o8261K80233J27004J93632K6129l16350P1247N5501L6315M3831j77599
14850I8956q1284N6374J88330Q714J09512j75467j81009j97892j1975K18471J30251
14839A62981l22239K24120K07048J36212l4979l41787Q8812K23109j19381j81985
14829D1911j32277J38721n0511n9801o5147P3205P913j36034l9554n0200m7859
14818c19633J13853J04889j18327J0109J55841L81232J87015k15593j66853q571
$$ y = [-220451, -403211, -462433, -243975, -309422, -275978, -341926, -227001, -277766, -322194, -212046, -461044, -402299, -151741, -481009, -788101, -323660, -146511, -9919, -195832, -362531, -72945, -24200, -91927, -299808, -416726, -226621, -317123, -309789, -232563, 240849, 217819, -172726, -240987, 39246, 166250, 359882, 386011, 69661, 140908, 196409, 232724, 276555, 98956, 17672, 74046, 262376, 271090, 380602, 205135, 24126, -173766, -185741, 32730, 162981, -159258, 64862, 271910, 408122, 373143, 31356, 120168, 343277, 223896, 41911, -90366, 48355, -2156, -61957, -127104, -53899, -45986, -182020, -221574, -271774, -319633, -205780, -100891, -219218, -209109, -53268, 327964, 514979, 299386, 132533, 123962]
14808A23962K15082K0276m8563j36413p1596J08661O7848P317K19439M8108k21557
14797C32564k0470K63700Q6370k51679m6478Q6243j16607k26922j28185K85280
14787B63816N6159k1546l9422O6522J17691m0949j23997k13629j15517k69264
14777c20136J70215J14909J60232n8543m3886J04395O5089j17313n4015m86010
14767d65063k98529J00144L10120K00907J55025l0139k52027K33246j22501j63906
14757c32723L0326J85954R8534J04089l6528k51818j8071j4631J47860j77449
14747b64457r9607J32855q9502M24501J45428m5276j47324j31656l0371N5787
14737d9622l8221K6911Q4395p2206k17992j37709n856K12J13883J06309k9807
$$ y = [123962, 339044, 359320, 310757, 174344, 102748, 211409, 279257, 286574, 506013, 554121, 332564, 312094, 575794, 662164, 410485, 364007, 450250, 333643, 106721, -21464, 263816, 319975, 298429, 259007, 325529, 443220, 402271, 278274, 64645, -50872, -320136, -149921, -35012, 125220, 66677, 22791, 127186, 192275, 74962, 20947, -465063, -763592, -663448, -353328, -152421, 2604, -27535, -279562, -46316, -168817, -332723, -302397, -116443, -17909, 86180, 49652, -202166, -220237, -234868, -87008, -264457, -364064, -231209, -320711, 103790, 249218, 203942, 56618, -75038, -105409, -49622, -87843, -60932, 23463, -48743, -266735, -404444, -410300, -410088, -296205, -189896, -219703]
14726b19703L47706k33j13168j09946J11939j41763J02070r5233P4910q4655j48752
14715b76828O000J1056K44835M491K1087j34483M8727J1425k88635j56586L49584
14704a59327J93360j37667K0329N6581k05488l08117k12383K30789J49636Q0160
14694b92127J3421j22110J48003j33007j2655L90645R5281K2378K22440j5541
14684C16728P7767q3692j41027J01696n784j1327O5153j11946j32936J25182J16351
14673C16165r015j26192l12313j0858j31637J75518N039l69363J34118K99162
14663b9376j31728j50528K26391J90486K03076K6964l09291j95974l411L49150
14653A75759J11891l81727k75685j35036K18751R6226J55898R14l4622J5082j49702
$$ y = [-219703, 128003, 127770, 14602, -95344, 16595, -125168, -23098, -118331, -43421, -128076, -276828, -270828, -259772, -14937, -10446, 10641, -123842, -75115, -63690, -352325, -508911, -159327, 34033, -103634, -83305, -26724, -232212, -540329, -752712, -521923, -372287, -292127, -278706, -400816, -252813, -385820, -398475, -7830, 87451, 109829, 332269, 316728, 394495, 310803, 169776, 271472, 265688, 254361, 319514, 207568, 74632, 199814, 316165, 307150, 180958, -131355, -142213, -273850, -98332, -93293, -462656, -328538, -29376, -161104, -311632, -85241, 105245, 308321, 335285, 25994, -169980, -173391, 175759, 287650, -94077, -369762, -504798, -286047, -189821, -33923, -33009, -67631, -52549, -202251]
14642b02251K52769L79531l75906m6062j3262J37967n5730R261J78916r6184O0306
14631B29355o9997p8156J20845P0480J41146r756m7377p8035k9472k28308J06482
14620A27207k90142j12651L26669K18103j9057k07409n5365R7106L04975m8250
14610C41186k59425m19313j07968J16486j83899J42832L91579L9804k9365J32813
14600A64730l1783j10913o1952j13231O8457j02928L7924k41974J14870L04722
14590B7922K93083J48k87106m3179L1983P9353r4704J24828m9135k79145J02792
14579i3160M8272j46349j963N0693K26292k01030j03862L66263K96158L9388r6295
14568C84407n6607K33640j32305l79484j53811J35814K7587l35293k2234J59129
$$ y = [-202251, 50518, 430049, 54143, 8081, -5181, 132786, 77056, 86317, 265233, 169049, 229355, 159358, 81202, 202047, 272527, 413673, 403917, 356540, 278505, 249033, 20725, 127207, -162935, -275586, 51083, 269186, 250129, 42720, -12645, 84461, 389436, 341186, 81761, -337552, -445520, -329034, -512933, -370101, 21478, 61282, 31917, 164730, 132947, 22034, -39918, -153149, -84692, -187620, -149696, -391670, -276800, 27922, 321005, 321153, 34047, -9132, 22851, 102204, 7500, 132328, 83193, -195952, -93160, -44888, -191237, -193200, -142507, 83785, -117245, -221107, 145156, 441314, 480702, 384407, 327800, 561440, 429135, 49651, -104160, 31654, 59241, -276052, -298286, -139157]
14558a39157K01354Q8597N1361K9796P4077l11542m04044N7539k9279J70722L66591
14547A56015N6699J01118K3936k9013J79480j5109j10711k11969k52535j01251
14537b03340K22678J15935n27695j23486j393m9277J84189K64075j60881j94501
14527d73696L05408p9124j4281j882j57969J65013J76466l7829J661J60634j05207
14516f0806L6845J13530J06333O128O1404j01466J14105J26520R6083q2678j13232
14505C02766j56846k4970J17682J80845M3608l83620O0508P091l40683p7597J96183
14494g5033L22720q7602j08874n3618j50437J91886L374M8184K90746q2661m30608
14483a31923j89112L52792L24159k43660k25017J6645P7631n2096K21647J80573
$$ y = [-139157, 62197, 150794, 202155, 231951, 306028, -5514, -409558, -352019, -381298, -210576, 156015, 212714, 313832, 337768, 308755, 488235, 473126, 362415, 150446, -102089, -203340, 19338, 135273, -392422, -515908, -517301, -566578, -382389, -118314, -279195, -473696, -168288, -247412, -261693, -263575, -421544, -256531, -80065, -117894, -116233, 44401, -60806, -23961, 89569, 195902, 202030, 263434, 161968, 276073, 402593, 498676, 415998, 302766, 145920, 120950, 238632, 419477, 463085, 79465, 139973, 147064, -193619, -271216, -75033, 247687, 160085, 51211, -2407, -152844, 39042, 42416, 90600, 381346, 298685, -131923, -321035, 31757, 355916, 112256, -112761, -96116, -18485, -70581, 151066, 331639]
14473C31639l53396p2592k0491p1417J05586j03766l4494J10770l0642K30059
14463I1256J95957r8332j4843k72630r5204j7364j57816L4722q6516J26377R7445
14452a96948j97850K43806p5872o3856J83438j0482N0146q3518k6026K14861J24679
14441A62378K0017l30282O8145K43278J07492j50536q3624Q7075k5729J13153
14431B11367n8281J7662O2396j18735j12866o1521j81660O5469K47513J39845
14421B11189J06793J041J0110k67822j50365K10044j35390k3240K13617p638k86180
14410a17841l3688J70628k07488L8579K27590J17682J70603k5732j16830M4956
14400B68459l20120k26052j67864n5727K0503K48036L32934N1067j20270J44927
$$ y = [331639, -21757, -94349, -114840, -186257, -80671, -184437, -218931, -108161, -138803, 91256, 287213, 188881, 174038, -98592, -193796, -211160, -368976, -334254, -420770, -294393, -196948, -394798, -150992, -226864, -290720, -107282, -117764, -67618, -151136, -177162, 37699, 162378, 182395, -147887, -79742, 163536, 271028, 120492, 36868, 123943, 98214, 211367, 153086, 170748, 233144, 114409, 1543, -59978, -241638, -176169, 71344, 211189, 317982, 319023, 329133, 61311, -89054, 120990, -14400, -37640, 175977, 168339, -117841, -151529, 19099, -188389, -149810, 77780, 195462, 366065, 340333, 223503, 268459, -51661, -277713, -445577, -501304, -480801, -232765, 100169, 151236, 30966, 175893]
14390A75893K14416K2535k65902p0333l1385k27442j0051J37547K79257l5818
14380A88717k8896J28264j66526j24453r9728k35417j11675k09051K42268J14794
14370c01703l2924k21605l262M3275J3406J61267K99963J44096j17229j89903
14360b04619O3610M6229k17480p2095J5616r9007R4015J43549K07171N7220j46488
14349a12279j24964q1730J46051J11933M3186L0605J7000J95918K55774l82943
14339I8551k09142J55151J3614j1715L14457N8859l41384R517J63962M636k45745
14328A0761k78475P6798k69950m2412J68352K4511j26176J43359l3493K0212K06916
14317i9597K44491R9105J09187P2444r1520q1664j60001n15366l07936L99162
$$ y = [175893, 390309, 412844, 146942, 76609, 45224, -182218, -192269, -54722, 224535, 188717, 159821, 288085, 121559, -2894, -102622, -338039, -449714, -658765, -416497, -301703, -334627, -556232, -559494, -516219, -502813, -341546, -41583, 102513, -14716, -204619, -141009, -94780, -312260, -384355, -368739, -467746, -373731, -230182, -23011, 34209, -112279, -237243, -318973, -172922, -60989, -17803, 12802, 29802, 225720, 481494, 98551, -110591, 44560, 58174, 46459, 360916, 419775, 78391, 87908, 251870, 256506, 10761, -267714, -190916, -460866, -503278, -334926, -310415, -436591, -293232, -326725, -306513, -99597, 144894, 243999, 353186, 425630, 334110, 252446, 92445, -422921, -730857, -331695]
14307c31695P3518P7472J11022M0386N1805J38894n33464l38431K69897M34390
14297f206J26769J54862j57677k8780j68272K8719L4416N8167O2326j68201p0048
14286a33925j4420K12247L5951j53873m50793l91300L7435R9883J81148K88695
14276b88952J66999K27617J44790j16048J03335Q4285k29386k2266j16977j16893
14266a63496j22928k45697o5765M13113M2804j17109K30722K59024R3125m57253
14256a33460O0024L45580J9314j9036J57604q3496j70963j7525j1810j76652j69413
14245a99833j63259k6071K20731Q8170K4763l2842P3886j43215J69495m4471m26597
14234d59243Q7899J7309r5339O4857M71433J33379k0820M1018N6038q5498q4635
$$ y = [-331695, -258177, -180705, -69683, -29297, 22508, 161402, -372062, -710493, -440596, -6206, 120563, 275425, 117748, 88968, -79304, -50585, -16169, 41998, 104324, -63877, -133925, -148345, 63902, 99853, -54020, -504813, -896113, -858678, -758795, -577647, -288952, -121953, 105664, 250454, 134406, 237741, 322026, 92640, 70374, -46603, -163496, -286424, -532121, -597886, -184773, -141969, -259078, -28356, 230668, 323793, -133460, -73436, 272144, 291458, 272422, 430026, 346530, 175567, 158042, 146232, -30420, -199833, -363092, -389163, -168432, -80262, -55499, -88341, -14455, -157670, 11825, -32646, -459243, -371344, -354035, -449374, -384517, 86916, 220295, 199475, 240493, 296531, 211033, 126398]
14223A26398j66996K2714k81328J26605J9060J9285J43678J84389J73381J05714
14213D72900k73067l92781r1347m2835R2321j58551k01769j60030J08205L98337
14203b48617k3770J47078J60481L8506j16726J3715k33281j96963M7277J58235
14193b54065Q9668L38770q6416m06434R3211L1680N8693K4339j65030K01086J27627
14182E3129K38352K98711j04784j14989k59951j29862j58688m2390K68743m8272
14172ao9548l5566R7691o4818J98515J8190l05118p4566n5079K28940M2713j2268
14160c0915o4948n3308j69j45195o2875K35266k051m16641K47918Q4859q3608
14149b91667K57499K17129J25280k0600j34667j24745j9750Q3011l22312J96013
$$ y = [126398, -40598, -17884, -299212, -172607, -153547, -134262, 9416, 193805, 367186, 472900, 199833, -192948, -284295, -327130, -234809, -393360, -595129, -755159, -646954, -248617, -272387, -125309, 35172, 73678, -43048, -29333, -262614, -459577, -412300, -254065, -164397, 174373, 87957, -318477, -225266, -193586, -134893, -110554, -275584, -74498, 53129, 291481, 590192, 485408, 370419, 110468, -19394, -178082, -220472, 48271, -1, -69549, -105115, -7424, -72242, 126273, 144463, -160655, -235221, -290300, -61360, -18647, -30915, -95863, -149171, -149340, -294535, -357410, -122144, -124195, -540836, -292918, -208059, -291667, -34168, 182961, 308241, 287641, 152974, 28229, 8479, 91490, -230822, -34809]
14139c4809J5222J06449j15243o2488J01622L6347J500J40007k31158L3451J07427
14128I8327j18982l77358o0449R5700j6893M5389j12766j7670J21756J90433j03897
14117b56410J80368K33678J72442r6787K6869j1000r6260r0589l10070k41841
14107d89600k9444J57243L62893K35899K9837j99054j90107j73288K35979J13773
14097E4131k01494j83184K00876K59736j65308j57347Q0986j66814l4676J45623
14087a67471L48400J34751O0313l26303P5308p0340k06465P6681K00870j5989
14077A09755j4802K10347j88839l94124l58772J05576K88110L8455k30567n8873
14067d93734P2530K97933J77058R6084r2943j10360o8103m2015K6215K11119k60251
$$ y = [-34809, -19587, 86862, -28381, -90869, 10753, 47100, 48600, 188607, -42551, -9100, 98327, -20655, -398013, -458462, -362762, -379655, -334266, -447032, -464702, -342946, -152513, -256410, -76042, 157636, 330078, 233291, 260160, 249160, 152900, 62311, -247759, -489600, -519044, -361801, 1092, 236991, 266828, 67774, -122333, -295621, -59642, 54131, -147363, -330547, -129671, 130065, -35243, -192590, -111604, -278418, -313094, -167471, 180929, 315680, 375993, 49690, 124998, 54658, -151807, -75126, 125744, 109755, 94953, 305300, 116461, -277663, -636435, -530859, -242749, -204294, -434861, -493734, -421204, -123271, 53787, 149871, 56928, -53432, -121535, -163550, -137335, 73784, -186467]
14056a86467q8481O2067o8306J08341Q950J76838J10739J53333j99398J78322
14046B55938K65085j62828k43374J01891N3646m25779j39102P8230M6412L4383
14036a35498J20682J28654n1646J17038Q0550l60387J42115J05392K31172J61392
14026E39464p4084l28235j39568k32421Q8698J43486M4183o6371j61131J96852
14016A0873J51584j83469q5340k34914l6511Q4854j9064J61193o6196P2155J74051
14005B9216L4695n3758j42498m7642J8354K13377R7385J36256j23885j68559j21665
13994a28724j53057J39787L7291O1142J66022K55288j28329j59973J72210m8559
13984B13098j50680L7340K18596k6133k95854j18977N4805J34566J83420K0872
$$ y = [-186467, -274948, -212881, -281187, -172846, -163896, 12942, 123681, 277014, 77616, 255938, 521023, 358195, 114821, 216712, 270358, -155421, -294523, -216293, -169881, -135498, -14816, 113838, 62192, 179230, 259780, -100607, 41508, 146900, 378072, 539464, 465380, 137145, -2423, -234844, -146146, -2660, 41523, -24848, -185979, 10873, 162457, -21012, -106352, -341266, -377777, -292923, -311987, -150794, -216990, -144835, 29216, 63911, 10153, -132345, -179987, -161633, 51744, 149129, 285385, 161500, -7059, -128724, -281781, -141994, -104703, -43561, 122461, 377749, 249420, 89447, 261657, 213098, 62418, 99758, 318354, 292221, -3633, -122610, -67805, 66761, 250181, 271053]
13974B71053k78004J928j735K5071N9389j78547k605L6465J51365K98812K1880
13963D05072m0872k47926l5124N6170j40k61028l8394j44988k8763L9744K38049
13952e8200P309l22237Q7790J97K0814L02225K92795L6899k45220n0921L2833
13941A04284J97341J2382J53504L08660k46499j3363N4562j58818l60335J14374
13931A66092J74773l12915n1168J68343j55781l21066K46357L29250k07029P8031
13921A14887J68108k26551n1189q0712n5366J77710k19494L8904k1562M7788l1291
13910a38768k7117J48391K48078k4741k32906J07701K06863k50466N6845K7688
13900A21568R8782m12k46025p9479K07420o3187K7879J33243R685l87739k15761
$$ y = [271053, -6951, -5023, -6758, 18313, 77702, -100845, -103450, -66985, 84380, 383192, 405072, 364200, 116274, 81150, 137320, 137180, -123848, -162242, -307230, -335993, -296249, -58200, -50891, -373128, -285338, -285141, -264327, 37898, 330693, 367592, 122372, 71451, 104284, 301625, 314007, 467511, 776171, 529672, 516309, 570871, 412053, 51718, 166092, 340865, 27950, -23218, 145125, -10656, -331722, -85365, 243885, 36856, 114887, 282995, 56444, 5255, -75457, -130823, 46887, -172607, -133703, -155265, -107477, -138768, -165885, -17494, 230584, 205843, -27063, 80638, 287501, 37035, 93880, 121568, 220350, 219938, -26087, -105566, 101854, 38667, 66546, 199789, 209474, -178265, -394026]
13889c94026J96556J47554j19278l1516J57939Q8856P3982j9143K06698k94510
13879A3112j11547k5747l1160P9698Q1461o3936m1320k6965Q6833P7842n52M21
13867C8140Q467J288k98482p5320L86816J92580j22403r7012n3477n4662j35713
13856b09778j99890L08877M12165o9795J25586J39597n3060j43277k0856l4518
13846B55051m25560l22332J44512P2176L45664K9076k74687m3376K10785J82434
13836A73743J15596j87458J15447J19546l36185j4560K36664J25903k10820J59662
13826B97538j22198j71266j50799O8876O7017O2401p0772j0151L14161j39389
13816A45418j1608J78473j77799k11496k1068o1050p6027O7671n7087q9989k3374
$$ y = [-394026, -197470, -49916, -169194, -200710, -42771, 46085, 120067, 100924, 307622, 13112, -98435, -124182, -155342, -75644, 5817, -58119, -99439, -126404, -39571, 38271, 37719, 38140, 46607, 47895, -250587, -325907, 60909, 253489, 131086, 34074, -19403, -74065, -209778, -409668, -100791, 311374, 241579, 367165, 506762, 453702, 310425, 289569, 255051, -170509, -492841, -348329, -276153, 69511, 98587, -176100, -219476, -8691, 173743, 289339, 101881, 217328, 336874, 689, -13871, 222793, 348696, 137876, 297538, 175340, 4074, -146725, -77849, -10832, 51569, -19203, -29354, 284807, 145418, 133810, 312283, 134484, -77012, -98080, -159130, -235157, -167486, -224573, -314562, -337936]
13805c37936j9943M47764q7337k43224R6532M5357j5433J05268J1469l06598k99291
13794f03372k33467Q4047K00303K9398K66813L14653r9312k08774j9803j90924
13784d60438J09015K25497R8133J5964K35210n2148j54073p1668O227k41582M3298
13773b46565J18671J61198J64211j60272l74835L28755J57567J28469j31731r4146
13763E1322j70901O6167J02762j52076R0859J71507n0251j74090K7752m6018J72796
13752H9829o0722J60297J39829K8745j05080k30057j48773J59673K04024J25438
13742C63203j02142j77498k36536N8560K75145J50177j67220N9697l6101j05154
13732H2131r4156o562k8787J86805K45500j2881n537j25195k56339O6244j98997
$$ y = [-337936, -357879, 89885, 2548, -240676, -144144, -98787, -114220, -8952, 2517, -304081, -603372, -836839, -752792, -552489, -523091, -256278, 58375, -40937, -249711, -269514, -460438, -351423, -125926, -27793, -11829, 223381, 171233, 17160, -54508, -48281, -289863, -246565, -127894, 33304, 197515, 37243, -337592, -8837, 148730, 277199, 145468, 51322, -119579, -53412, 49350, -102726, -11867, 159640, 109389, -64701, -36949, -82967, 89829, 29107, 189404, 329233, 357978, 252898, 22841, -125932, 33741, 237765, 363203, 261061, 83563, -152973, -94413, 180732, 330909, 163689, 223386, 187285, 82131, -12025, -18587, -47374, 139431, 384931, 372050, 366513, 241318, -15021, 51223, -147774]
13721a47774L32977J52435n9166j63263O1239N8890j17544K0381J14803K65949
13711E18927k5587r8682j55585l60577j44380R1217j07761J88467j95779O8776
13701b20964K41244J3880K31057R7665k29559l0362O2846J07279k02660j50057
13691g9631k71356o2136K31661M0532M6782L5943J06971J84380J80920J06905
13681E20971N293j66602k96409j57791j25852j35303K25445P5593L4165J4018
13671f472m7869K61509J19548k54538j91902j14661j82673p045L14980J06494
13661b629L0090J48833K57803Q2183Q1743m12667k09068p7046J8020k2894O7145
13650c8487K42272j84609k92584J04483L12896L85545K0271k83293j25875o2405
$$ y = [-147774, 185203, 337638, 278472, 115209, 176448, 235338, 117794, 138175, 252978, 518927, 493340, 394658, 239073, -121504, -265884, -174667, -282428, -93961, -289740, -220964, 20280, 34160, 265217, 362882, 133323, 102961, 165807, 273086, 70426, -79631, -350987, -413123, -181462, -140930, -94148, -58205, 48766, 233146, 414066, 520971, 526264, 359662, 63253, -94538, -220390, -355693, -130248, -54655, -20490, -6472, -54341, 207168, 326716, 72178, -119724, -234385, -417058, -424103, -109123, -2629, 27461, 176294, 434097, 516280, 598023, 185356, -23712, -100758, -82738, -105632, -38487, 203785, 19176, -273408, -168925, 143971, 529516, 549787, 266494, 140619, 78214]
13640G8214l56019o2319K13548K02307J54703J06402P4954j21767k05527j96895
13630a12399N201L0915J77453p0196M5217j06627k13331j54110K92431J21950
13620A6504J82304k07173n2184J00422j87712j65290l00794R8266O07302K72735
13610C64380j59923j84281L2752K08954r9689k67627k90243r0062L08265J99693
13600B2219P1887Q2626J18206L09944J19014l56571n2293Q9905k37642k81825
13590a14530j69915P5067M50786L30702j09072k12245k08586j46277n1209O0820
13580i4459J41668j91151J94577J61767k988l71575J56599j40025K6542o030K0653
13569a04422m0093k8360K82854j83312j22153P7213P238o7424r9886o9980J09866
$$ y = [78214, -277805, -340124, -126576, 75731, 230434, 336836, 411790, 290023, 84496, -112399, -107198, -76283, 101170, 30974, 76191, -30436, -243767, -397877, -105446, 16504, 198808, -8365, -60549, 39873, -147839, -313129, -613923, -515657, 91645, 364380, 204457, 20176, 52928, 261882, 162193, -105434, -395677, -485739, -177474, 22219, 94106, 176732, 294938, 604882, 723896, 367325, 315032, 404937, 167295, -114530, -284445, -209378, 241408, 572110, 463038, 250793, 42207, -104070, -155279, -94459, 47209, -143942, 50635, 212402, 209414, -162161, -5562, -145587, -119045, -125075, -104422, -144515, -172875, 109979, -73333, -195486, -118273, -111035, -178459, -278345, -348325, -238459]
13558b38459J04485M7481R3728K8101K48789l1870P0003j89126J60619L59253
13548F53004j38609m76691k66004k3126K77881N3305k62670j27749K90130N1109
13538C0580j808k11715j86550J11753J79383K09304L77115K38175K0907k38375
13528E28769k20072k19181J1868o2228j1802k03561K16963J64955P2666n1360
13518B27017k62630j12708o7440k08068j87864J79334L17575N30963J82954k03107
13508C96026J09271k7322k98535k28018o4840p38J00957O6744J16296P9322k8841
13497B20322k51071k63018n6187k2407l65634L5386K08007J32111L657r2844L3056
13486d18622j21127N8572K93005k7530P0955l82710K65875K60022J36517J14507
$$ y = [-238459, -133974, -86493, 7235, 35336, 284125, 252255, 322258, 133132, 293751, 653004, 514395, 37704, -228300, -251426, 26455, 79760, -182910, -310659, -20529, 30580, 28772, -182943, -369493, -257740, -78357, 130947, 508062, 746237, 767144, 528769, 308697, 89516, 101384, 39156, 27354, -176207, 40756, 205711, 278377, 227017, -35613, -148321, -215761, -423829, -611693, -432359, -114784, 416179, 599133, 396026, 505297, 477975, 179440, -48578, -113418, -114156, -13199, 53545, 169841, 249163, 220322, -30749, -293767, -349954, -372361, -737995, -702609, -494602, -362491, -358834, -451678, -418622, -539749, -481177, -188172, -215702, -144747, -527457, -261582, -1560, 134957, 249464]
13476B49464l09577k97895P9994K2633Q737J05241L42604J44912j88515q5043
13466G2555j31399J428j9259J47468K99319J72974j22591k45785m21221J5188
13456b31323q8817L423j15879n4604O0508J98416P5894l5051Q9891J76130J25458
13445B04046P1955k53975j41074L12172R6078r7759k73377j3618k88090J47337
13435b36305L4371K4100K0843J5499P7766J75391n36024J16361J74221r131k0975
13424a63883J01336p988j69637Q5122l07264m7372J42959N882J35292K18112M0808
13413C3367P1432J14697j01553j98032k07659J12069L77319J052j71970p2674
13403d1952j46218n0931j44147P2348J2139n5257J94350J55689j4492k30516j57144
$$ y = [249464, -60113, -358008, -278014, -255381, -246644, -141403, 201201, 346113, 157598, 72555, -58844, -57416, -76675, 70793, 370112, 543086, 420495, 174710, -246511, -231323, -320140, -316717, -432596, -487200, -426692, -228276, -152382, -187433, -97542, 78588, 204046, 276001, 22026, -119048, 193124, 289202, 191443, -81934, -95552, -383642, -236305, -201934, -177834, -156991, -141492, -63726, 111665, -424359, -307998, -133777, -142908, -163883, -62547, -70535, -240172, -155050, -462314, -509686, -366727, -360845, -225553, -7441, 33367, 104799, 219496, 117943, -80089, -287748, -175679, 201640, 202692, 30722, -41952, -188170, -239101, -383248, -310900, -298761, -354018, -159668, -3979, -18471, -248987, -406131]
13392d06131J43175J23275o5055j82694J80995K35823P0036n758l21610j46692
13382c74636K84790K11534J04158k26719J38587J2414O8397R8010j93536m9287
13372G3712N1897k5219N6624K7897K70306n1771j4474J6567j19701L2740k01643
13361A16935o55412K82933M02906J3147q0734j98290l20941q3943J51085j39599
13351e11913J60584J30414J27830n7243J92837p5669m1429k43483k40023M5054
13341e13041J12928P1100K76082N6334j21975j09091n0393N1999n2006R288J15062
13330a53713K84579J40426j62483q5849K31066j51665m9064P6781K31911K1053
13320C83042k22072j26449P59p2483j11829O6456J23867J45946J74280J61442
$$ y = [-406131, -262956, -139681, -204736, -387430, -206435, 29388, 99424, 93666, -227944, -374636, -89846, 121688, 225846, -873, 137714, 150128, 218525, 316535, 122999, 73712, 125609, 100390, 157014, 184911, 455217, 403446, 388972, 405539, 285838, 318578, 116935, -538477, -255544, 147362, 160509, 79775, -118515, -439456, -523399, -372314, -511913, -351329, -220915, -93085, -150328, 42509, -33160, -74589, -318072, -558095, -513041, -400113, -329013, -52931, 3403, -118572, -227663, -278056, -226057, -278063, -268775, -153713, 130866, 271292, 108809, 22960, 254026, 102361, 53297, 130078, 361989, 383042, 160970, 34521, 35280, -37203, -149032, -82576, 41291, 187237, 361517, 522959]
13310E22959m8826k7860J38202q2032k51811m2271O4044J17438j52373k13634
13300B3836j51088k20809O4812L73122n6516k85347m7097O4783O3957J38476J02202
13289G0331j4338K18751l9350j84672M3982J15314O7256n9404J9407n6341O3358
13278B44294Q116j4753j61991j98280j79036R825O7541p5860P3208J8911J12519
13267i5506O1407r072L2244k46031j66373J50012J37325J27525J287k722R6215
13256H6311l40284k8141J15232O9632K7569R1168R0282o6611k97567J44124N0706
13245e7579J00764J11041J46789k53028k05717j34958J55023j34902o1754J88804
13235a45517K20324J26815R7966J44291k69066k31648j04685K05566j12393l94588
$$ y = [522959, 474133, 446273, 584475, 502443, 250632, 208361, 272405, 389843, 237470, 23836, -127252, -348061, -283249, 89873, 33357, -251990, -299087, -234304, -170347, -31871, 70331, 55993, 274744, 235394, 50722, 94704, 210018, 277274, 217870, 237277, 180936, 244294, 252410, 237657, 75666, -122614, -301650, -291825, -224284, -300144, -226936, -208025, -95506, -34099, -43171, -10927, -256958, -423331, -273319, -135994, -8469, -7182, -9904, 86311, -253973, -282114, -166882, -97250, -69681, 21487, 111769, 45158, -252409, -108285, -57579, 43185, 154226, 301015, 47987, -157730, -292688, -137665, -272567, -334321, -145517, 74807, 201622, 299588, 443879, 174813, -56835, -161520, 44046, -68347, -462935]
13225d62935Q2084J72116J87662Q5437m7047k38002j92030k29951j5285K13229
13215d44722K51742k28586j14479K15529K681J22413n3585Q7204j43808J72307
13205a33304k92L5097k19830k0617M372L00540N219K15538R2626k94760m1715
13194e7126J03544K68503j745k45930k33289j51814J05299K35225j80486l2376
13184a90195n0990R7978J69984r6010j19717J64310K25855K6246K47326j36763
13174C38024M8822m1217j80627q2486l7403J9774K9084L51890J35823j14608J5716
13163D82792l1563J05979m2577k6835q0170k88184j56893J52900m4397M7366L36421
13152D54839Q452k39393l52350K41062J89728l88585l5803J65610R2803k22934
$$ y = [-462935, -380851, -208735, -21073, 64364, 17317, -220685, -412715, -642666, -657951, -444722, -192980, -421566, -536045, -320516, -317835, -195422, -249007, -161803, -305611, -133304, -133596, -98499, -318329, -338946, -334574, -34034, -28815, 186723, 279349, -15411, -57126, 46418, 314921, 313176, 67246, -166043, -317857, -212558, 22667, -157819, -190195, -241185, -143207, 26777, -69233, -188950, -24640, 201215, 227461, 474787, 338024, 386846, 345629, 165002, 82516, 45113, 64887, 93971, 445861, 581684, 467076, 482792, 451229, 557208, 514631, 487796, 407626, 119442, -37451, 115449, 71052, 118418, 454839, 463291, 223898, -128452, 112610, 302338, -86247, -122050, 43560, 136363, -86571]
13142h6571l16217j54280j30626L5337l0237M8359J85395K11978L63380n0758
13132G5760j82540j84353k16678j0272K34013M53271P578j25186J26249J32589
13122C10431J45788j21522j18733M3182O0550j41170k44753j92732j29999r7685
13112d86643K9049L77587K03264j35075j45861r9763j16202N5638J43596K62442
13102H8032J97973o4435J9278Q503n7019k58004p1144L51119J26609J73394m8599
13091D65707n9613n0510j78844m21335p0708M3904R5607J35517j50832j26320
13081c17427M16185M0781l1520j62832J33061K24959q0126l52519j113j41027
13071b71578j22762K2038J56767J61294N2167j30878k442J87423J78355r5720
$$ y = [-86571, -402788, -557068, -687694, -652357, -682594, -634235, -448840, -236862, 126518, 75760, -106780, -291133, -507811, -518083, -284070, 169201, 176779, 51593, 177842, 310431, 456219, 334697, 215964, 259146, 319696, 178526, -66227, -258959, -388958, -486643, -457594, -80007, 123257, -11818, -157679, -257442, -373644, -318006, -174410, 88032, 286005, 221570, 240848, 249351, 192332, -65672, -136816, 214303, 340912, 514306, 465707, 406094, 355584, 176740, -244595, -315303, -271399, -175792, -40275, -191107, -317427, 98758, 139539, 108019, -54813, 78248, 303207, 223081, -129438, -130551, -271578, -394340, -372302, -215535, -54241, -2074, -132952, -135394, 52029, 230384, 134664]
13061A34664j6999K22527K95767L7856k51888L6483j51409j33165m4159l3122
13051I6555J3065o6247N894k7388r0463k65165m96533P0159L54344L05897K02293
13040A02411k16085j15819M7654Q6662M64289J62175l01302k90916M2774j36626
13030a54783k21944L17051j21798j5433L12350Q9756k42317o5572m3293K77021
13020A31038q435j89257O4361k13172J98855K43337L39822R3964l9627l23320
13010B97566r8649J32540Q8765N7904j89686L539j8168j67958J57542k0418k03913
12999C9064k34270K93173J3359k54231J71498J1499p9081n5927j56172K36685
12989a4403K32302l2189Q9805K1665j50367j88055L38891J81192j65206j90104
$$ y = [134664, 117665, 340192, 635959, 673815, 421927, 458410, 307001, 173836, 129677, 96555, 109620, 43373, 49267, 21879, -68584, -333749, -830282, -760123, -405779, -99882, 102411, -113674, -229493, -181839, -95177, 369112, 531287, 229985, -60931, -18157, -154783, -376727, -59676, -181474, -196907, 115443, 205199, -37118, -102690, -145983, 131038, 122603, -66654, -2293, -215465, -16610, 226727, 566549, 660513, 620886, 297566, 198917, 331457, 420222, 478126, 288440, 291979, 273811, 105853, 263395, 242977, 39064, -195206, 97967, 111326, -142905, 28593, 40092, -38989, -94916, -251088, -14403, 217899, 185710, 275515, 297180, 146813, -41242, 297649, 478841, 313635, 123531]
12979A23531l2326K8599n8971J07423q0562l18282j8553M3456J52708J3915k9791
12968f8853O8242J0286K7152p1077k92771J57045K85299K836o8140p6295J61078
12957A34802k78301m3426K83917Q9034l56186l26102J57193L34288j61145L8195
12947a27731j266J5613o1067P4912J61241q4192j01461n5922J26109J69851K40226
12936C56313O5597l15939k44933j36753J1490K22540j09350R907Q8514M49192
12926C96578n037j80825k33380k7912J76754L9782r4561J8749K17068K79306q1656
12915E04866k89463k81035r5109K78907j05303k66520P2424L70009P847J84297
12905C80920P7744j26895l77590m538J43179J1077J22135K0210L6755j62685r4741
$$ y = [123531, 91205, 119804, 60833, 168256, 87694, -230588, -249141, -205685, -52977, -39062, -68853, -611, 9675, 36827, -34250, -327021, -169976, 115323, 118159, 50019, -26276, 134802, -143499, -186925, 96992, 186026, -170160, -496262, -339069, -4781, -165926, -127731, -128997, -113384, -174451, -99539, 61702, -22490, -123951, -179873, -53764, 116087, 356313, 421910, 105971, -138962, -275715, -264225, -41685, -151035, -141128, -52614, 396578, 391541, 210716, -22664, -50576, 126178, 165960, 71399, 90148, 307216, 586522, 504866, 215403, -65632, -160741, 118166, 12863, -253657, -181233, 188776, 196623, 380920, 458664, 331769, -45821, -50359, 92820, 103897, 226032, 246242, 282997, 120312, 25571]
12894B5571R3540l4122j30799j10280K52684L24157N8766j58740Q7467J05173
12884E13417R5303L2387J14252j76979j21526j65508l19460r3649p6100m9375
12874b47238J07446o4765O2365L7604j20862n0290K17189K14901j31038r339l8806
12863b2833J28083N7867j60130q4445j10068p3820j81047j1735K61619J09440
12853h7069k24783N05345J56617M3293m3418L5311j14169N3310P9196k98575J91385
12842B96443R3080k32524j14772J83591J66953n7790M14460l0074m54702l66962
12832a02297J0244J38397K50887K78465k76791j37382j23078M0093J89907o5701
12822B02744k25172Q15K4902L08413J94756k70087p7506l3338k2337k6910q8109
$$ y = [25571, 119111, 84989, -45810, -156090, 96594, 420751, 479517, 320777, 408244, 513417, 608720, 641107, 755359, 578380, 456854, 291346, -28114, -121763, -197863, -247238, -139792, -204557, -142192, -104588, -225450, -275740, -58551, 156350, 25312, 15973, -22833, 105250, 163117, 2987, -81458, -191526, -265346, -446393, -458128, -196509, -87069, -311852, 193493, 350110, 393403, 349985, 385296, 271127, 324437, 403633, 105058, 296443, 389523, 156999, 42227, 225818, 392771, 334981, 749441, 719367, 264665, -102297, -92053, 46344, 297231, 575696, 298905, 161523, 38445, 78538, 268445, 202744, -22428, -21613, 3289, 311702, 506458, 236371, 158865, 125527, 103190, 76280, -11829]
12811a1829k0084J75412J0142J7727k69217j50280L14272J61425j09793j88670
12801g0895J8734K75758K46699j25722l7730O7527K55757q3513k40627m770j43868
12790A57350j05749O8133m8936k72859N2665K16293J19274k44141r7666K15010
12780E9374Q2521j5693L61689K59495j62351j37141k7999L6532j4058j69501R4806
12769C67674J27472j23992j11572O7614j09466k03220k49577P6163O2716j6167
12759a12355N7611j11050j0401k46706n7693R3744N7923r3757r5828K45212j01380
12748c74680J29512K62858J58151l2916J29046K08971r1419l03283m79131L56133
12738c6758L40872j6758j79030r9129J54629L608j04188J98576n0374J64489p790
$$ y = [-11829, -31913, 143499, 153641, 171368, -97849, -248129, 66143, 227568, 117775, -70895, -52161, 223597, 470296, 344574, 306844, 374371, 630128, 546615, 305988, 301218, 157350, 51601, 119734, 70798, -202061, -149396, 66897, 186171, -57970, -155636, 59374, 141895, 126202, 487891, 747386, 585035, 447894, 419895, 456427, 442369, 272868, 367674, 495146, 371154, 259582, 327196, 217730, 14510, -235067, -158904, -96188, -112355, -54744, -165794, -176195, -422901, -480594, -386850, -328927, -422684, -518512, -273300, -374680, -245168, 17690, 175841, 142925, 271971, 480942, 389523, 86240, -392891, -36758, 304114, 287356, 108326, 9197, 163826, 167434, 63246, 261822, 211448, 375937, 368147]
12727C68147k60455j49570k8627J48192O7306k9757j54915Q9164J3454L37604
12717D00543N25859j4725m11040j95225l01565k3300K08721J45137m3778K1073
12707C11700q9095J22938j2408k66920j7021o1600J43600R2833j43242o8201j54191
12696a41607J86057J0807Q1861K65065J74480j13645j38172n4811j09704m1522
12686A18809O4818P6284j1830j35740p6962J01321j99084K32074N39743N3279
12676G62712k2394K443j20835m4435K38644J29590j10426j10919k1382k78488
12666D24510J27962k14004m09024K749J0909J24710L44562N1777k12174j82564
12656F9413L05728J40131O8714J7962j04436j75603L0662M1085Q2681p0737k83918
$$ y = [368147, 107692, -41878, -70505, 77687, 144993, 115236, -39679, 49485, 62939, 400543, 926402, 911677, 500637, 305412, 3847, -19453, 189268, 334405, 290627, 311700, 222605, 345543, 333135, 66215, 49194, -12406, 131194, 224027, 80785, 12584, -141607, 44450, 55257, 137118, 402183, 576663, 463018, 324846, 270035, 160331, 118809, 183627, 259911, 248081, 112341, 35379, 136700, -62384, 169690, 709433, 762712, 740318, 742761, 621926, 577491, 816135, 945725, 835299, 724380, 702998, 424510, 552472, 338468, -70556, -67807, -56898, 67812, 412374, 464151, 251977, 69413, 375141, 515272, 583986, 601948, 497512, 321909, 352571, 393656, 476337, 405600, 121682]
12645A21682j48882j85892K32230k4814O8600M8072J43872O4418m9808k7382R6835
12634C38931P3680K2794J05049J9069O5149Q6172J37013k84269l56224m1144p4741
12623I1479J22485Q1329Q3809k25561j58342p9587K80409J82122J2261k73458
12613A16946j8842n0248l7677K64878K6791q0328K19018Q3487r9579k03733k3418
12602A97295N1271o9803M8348m49000j17720J48213O0085J48082M07589m6002
12592C78358N2717r2285p7216J69077J49734q7307k19023K15167N06988K38531
12582A234741k89700l40184r013J69020J29894M7087m9274l93792k78504N0794
12572B71069J28793l0860l66700J31079n1879P7212P9494K14913k6637l4696K24597
$$ y = [121682, -27200, -213092, 19138, -5676, 62924, 110996, 254868, 319286, 269478, 242096, 338931, 412611, 435405, 540454, 559523, 624672, 710844, 847857, 563588, 207364, 166220, 91479, 213964, 295293, 379102, 153541, -4801, -84388, 196021, 378143, 390404, 116946, 98104, 47856, 10179, 275057, 301848, 221520, 440538, 524025, 424446, 220713, 197295, 248566, 178763, 227111, -221889, -339609, -191396, -131311, 16771, 424360, 378358, 431075, 338790, 261574, 430651, 580385, 493078, 274055, 489222, 996210, 1234741, 945041, 604857, 595844, 764864, 894758, 941845, 892571, 498779, 220275, 271069, 399862, 369002, 2302, 133381, 81502, 158714, 238208, 453121, 426484, 391788, 616385]
12561F16385J19983l97929M39J45625k6865k33020k18869j32553j93062O3724
12551b56142K46837K68158K15104j0884l41762k30370q226O4897J4681k779J30068
12540H9582J19776O0539J12192L07628R0257k74421l32532j01239M1255K98292
12530D11329M7983L6011K43589K2314j91882J17788p8844j02119l25229K44983
12520D25923j75385K7608J37245J32277m6585J59656J45022J76598o5876l43252
12510E73231l81230P430K71502M7159j6894K69442j44434k36411j66482J3004
12500B36317p9250L48814L5587o830j10452k9228L7985P7576o1490J17441J49780
12489G16250J14543q6820j97964j814N7117J2852J403o8472R3416J9683j91752
$$ y = [616385, 736368, 338439, 338878, 484503, 457638, 224618, 5749, -126804, -319866, -256142, -9305, 258853, 473957, 463073, 121311, -109059, -117285, -52388, -37707, -40486, 89582, 209358, 269897, 382089, 689717, 779974, 505553, 173021, 71782, 113037, 411329, 459312, 495323, 738912, 761226, 569344, 687132, 608288, 506169, 180940, 425923, 250538, 278146, 415391, 547668, 501083, 660739, 805761, 982359, 916483, 573231, 192001, 199431, 470933, 518092, 501198, 770640, 626206, 389795, 223313, 236317, 157067, 505881, 541468, 534638, 424186, 394958, 432943, 510519, 449029, 566470, 716250, 830793, 743973, 546009, 544195, 601312, 614164, 615567, 547095, 640511, 660194, 468442]
12478D68442J89027M57484j79464n40759k56015J00409J20342J40754P6852k97755
12468B79317j0575J61987L24318P5557o378K4509j7589l08822j22880j66344R0015
12457C23115j1464K50824J25782o5416J06143j45035j67336O7938N7601K30799
12447G72951J53613k59910k73840K65835J43406k00249j3695o465P6278J32653
12437G90577r0700q7755n5053J83603P9304N2314p8455j39050j50643K38806J43012
12426H85960J26213J43216J18193p0123l82733q6833J25977j44190N3773k3916
12416G45537o4315r9073o3298J01823J69580j47145j86002j4391j8995p4660J71339
12405E20400J65720k72237N6954J54180J61788o1317j53013K52622J33641l31661
$$ y = [468442, 657469, 1114953, 935489, 394730, 138715, 239124, 359466, 500220, 577072, 279317, 268742, 430729, 755047, 830604, 824226, 848735, 831146, 522324, 399444, 233100, 323115, 311651, 562475, 688257, 622841, 728984, 583949, 416613, 484551, 542152, 772951, 926564, 666654, 392814, 658649, 802055, 601806, 588111, 581646, 657924, 790577, 699877, 612122, 557069, 740672, 819976, 872290, 793835, 654785, 504142, 742948, 885960, 1012173, 1155389, 1273582, 1203459, 820726, 733893, 859870, 715680, 769453, 745537, 681222, 582149, 518851, 620674, 790254, 643109, 457107, 442716, 423721, 349061, 520400, 686120, 413883, 470837, 625017, 786805, 725488, 572475, 825097, 958738, 627077]
12395F27077j46092J26432M77694k00653L4849J79831k17507p9490j17896k8975
12385F55270p9961l5571j8636K80254K451M6831j98249M49262N4116k34037j29167
12374G92563j33134K07083J93831n2890m3447j36030J06206J58205O6124J54942
12364A313453K80926p635k66280j16197K30579j81805k13394j08178K07903r5421
12354A043951O0892M1356Q4507r7749k40000m9709k8971J38598j17226N5952j62204
12343G29397q3927L49871K61191q7567l26560j5109J1300k8675Q0209J98141J31077
12332A219348O2308o8698l276j82774P4792k8501j72025J79322Q4241n4198K3155
12321A133694j9459j04844p8657k59633k9617m7806L55996M07876K16916R0444
$$ y = [627077, 480985, 607417, 1085111, 884458, 919307, 1099138, 881631, 802141, 684245, 655270, 575309, 539738, 521102, 801356, 803807, 850638, 652389, 1101651, 1155767, 921730, 792563, 659429, 866512, 1060343, 1007453, 964006, 827976, 934182, 1092387, 1158511, 1313453, 1594379, 1586744, 1320464, 1204267, 1434846, 1253041, 1039647, 931469, 1139372, 1043951, 1104843, 1146199, 1230706, 1132957, 892957, 843248, 814277, 952875, 835649, 891601, 729397, 645470, 995341, 1256532, 1168965, 842405, 827296, 838596, 809921, 890130, 1088271, 1219348, 1281656, 1212958, 1209682, 1026908, 1101700, 1073199, 901174, 1080496, 1164737, 1110539, 1133694, 1114235, 1009391, 930734, 671101, 641484, 593678, 949674, 1357550, 1574466, 1664910]
12311A664910K748r0327j53376J16854L44240j79969j38855j05451j04003L659
12301A360430R619N0036K69043k4698j02425j7456m5151j34516j38522K17117
12291A443477r7769m4778j140R7459j4332J87534P7007j50324j78884j54545Q770
12280A172475K69022L49375l4538j03660p0231L68j17199J40069K74137n8008
12270A821810k22285k49769K25452J04944k12110j67892o5132M08375K37656N5751
12260A936800k60449o2025Q643R3142k9388j56582J28074J69900K33956k4130
12250B037941R073l66724j68537Q3847l0537J68314J08447m4244o5171o5397j99833
12239A467179J42839L5134K0528N0715J26253K44610K41275O590k72433j348L15053
$$ y = [1664910, 1667658, 1577331, 1423955, 1540809, 1885049, 1705080, 1566225, 1460774, 1356771, 1360430, 1370049, 1420085, 1689128, 1664430, 1562005, 1544549, 1499398, 1364882, 1226360, 1443477, 1345708, 1300930, 1299790, 1397249, 1382917, 1570451, 1647458, 1497134, 1318250, 1163705, 1172475, 1441497, 1790872, 1756334, 1652674, 1582443, 1582811, 1465612, 1605681, 1879818, 1821810, 1599525, 1349756, 1575208, 1680152, 1468042, 1300150, 1235018, 1643393, 1881049, 1936800, 1676351, 1614326, 1622969, 1716111, 1686723, 1530141, 1658215, 1828115, 2062071, 2037941, 2047014, 1680290, 1511753, 1595600, 1565063, 1733377, 1841824, 1797580, 1732409, 1667012, 1467179, 1610018, 1645152, 1665680, 1716395, 1842648, 2087258, 2328533, 2335123, 2062690, 2061342, 2376395]
12228B376395j18714k81134L16469J61518r4986l58833K6223J45473J47301m6099
12218B273613l1456P8767j4847J21800K84960m8474k25377J5641r0690j08393
12208B255544k7682K69201K07656N4922n1926n9985J10059k48285j35101k92047
12198B082356q3360K33307L65615J28083R6527J54618O6899l6666R1271j3646
12188C085004n5123K10828j23257j06628l5233N8861n8570P5231J93841n3762
12178C191192J2464J72535n8025k25959k72024K34755j0833l4888J35577j3718
12168C131076j30120K28513K93254k2515l51386l99730J39070L74291J04403j87898
12158C178958J02242m2543j13975K50708L40984j04398j61867M7830q0638K6586
$$ y = [2376395, 2257681, 1976547, 2293016, 2454534, 2359548, 2000715, 2026938, 2172411, 2319712, 2273613, 2242157, 2320924, 2306077, 2427877, 2712837, 2664363, 2438986, 2454627, 2363937, 2255544, 2227862, 2497063, 2704719, 2759641, 2707715, 2647730, 2757789, 2509504, 2374403, 2082356, 1998996, 2232303, 2597918, 2726001, 2822528, 2977146, 3044045, 3007379, 3098650, 3085004, 3029881, 3240709, 3117452, 3010824, 2975591, 3034452, 2975882, 3051113, 3244954, 3191192, 3203656, 3376191, 3318166, 3092207, 2820183, 3054938, 3044105, 3009217, 3144794, 3131076, 3000956, 3229469, 3522723, 3500208, 3148822, 2749092, 2888162, 3262453, 3366856, 3178958, 3281200, 3238657, 3124682, 3375390, 3716374, 3611976, 3450109, 3497939, 3417301, 3443887]
12148C443887O7664L0608p528J30467k5703j62676L249j33850R9184M74718J5663
12137C935683K01486M2518P3635J89439q7859L5357M2622P6129J12065J13669
12127D734744k40560j23612J4005j2187j82575O9771Q7145j03054K63561K00826
12117D708064L16193p427q0955O6338q4884k1392m2351K1488L13808P2933J31635
12106E393450M1673p3452J209k12471J71468K50724j39500p8948J78662J49555
12096E682370o7791K13961J75843k80827r6962P4711K85445K19542J79205r0255
12086F295242j87162J15192K26427j86135j29239J78164J7174N3576K44651N1895
12076F679785l6219K62269L13679L201j81002q4110K71157L49626n183j70372
$$ y = [3443887, 3511551, 3542159, 3534631, 3665098, 3639395, 3476719, 3479968, 3346118, 3445302, 3920020, 3935683, 4137169, 4179687, 4253322, 4442761, 4354902, 4390259, 4432881, 4509010, 4621075, 4734744, 4494184, 4370572, 4384577, 4372390, 4189815, 4259586, 4346731, 4243677, 4507238, 4708064, 5024257, 5016830, 4935875, 5002213, 4917329, 4895937, 4853586, 4875074, 5188882, 5261815, 5393450, 5435123, 5361671, 5362880, 5150409, 5321877, 5572601, 5433101, 5354153, 5532815, 5682370, 5614579, 5828540, 6004383, 5723556, 5626594, 5701305, 5986750, 6206292, 6385497, 6295242, 6108080, 6223272, 6449699, 6263564, 6134325, 6312489, 6329663, 6383239, 6627890, 6679785, 6643566, 6905835, 7219514, 7222715, 7041713, 6957603, 7228760, 7578386, 7573203, 7402831]
12066G402831J38109J59903J19595L43855J77753j5518J78233J59167K7265l14034
12056H377159k9704K53203L56266K28193m1327K01407J27594m2917J00226K04943
12046I735043J91628q3559j3439K25455J36782J36815j44238J99339L27990J55357
12036A0867173J97600M0766K46170K49077K372K15472J45808J9837J00507K33217
12026A2317999P2194K17994L31540K86233m0253K23305M0083L9586K84274K38057
12016A4011012M05867K73964N85867N04579k52892k60163J85507M8294j41072
12007A5360963K36442N21831J66860K37836M32091L53572J1738J15745M50025
11998A7887103N55237L54695K95319K56407K2377J65268K18422L40403M66923
$$ y = [7402831, 7540940, 7700843, 7820438, 8164293, 8342046, 8326528, 8504761, 8663928, 8691193, 8377159, 8347455, 8600658, 8956924, 9185117, 9143790, 9345197, 9472791, 9429874, 9530100, 9735043, 9926671, 9843112, 9829673, 10055128, 10191910, 10328725, 10184487, 10383826, 10711816, 10867173, 11064773, 11105539, 11351709, 11600786, 11603158, 11818630, 11964438, 11984275, 12084782, 12317999, 12390193, 12608187, 12939727, 13225960, 13185707, 13409012, 13449095, 13488681, 13772955, 14011012, 14416879, 14690843, 15276710, 15781289, 15528397, 15268234, 15453741, 15502035, 15360963, 15597405, 16119236, 16286096, 16523932, 16956023, 17309595, 17321333, 17437078, 17887103, 18442340, 18797035, 19092354, 19348761, 19371138, 19536406, 19754828, 20095231, 20562154]
11989B0562154M45629L86448L08159J15507N5681L59350N73355N158K47953K02525
11979B3261919M80033M27003L06457J29723N15049O01312L31609J78795L62698
11970B6594598J59739K28830M52543M47846L88386M77463L66872J09825M81353
11961B9707455Q09771L89911J9335J25786L63277P08286O17311L69074L47258
11952C3457464K30980J22915M44599L73883K18120L07042L73848L94234L56057
11943C6279142L40625L03327J69705K31323J78043M24341M63883L72137P60903
11934C9523429M64516J15773J59160R2655J60533J8727L7842J2657J45314J18330
11924D0848936j4947J49688K07140K29135J42426k81517n6222L1521J43087R4182
$$ y = [20562154, 21007783, 21394231, 21702390, 21817897, 21873578, 22232928, 22806283, 22811441, 23059394, 23261919, 23741952, 24168955, 24475412, 24605135, 25120184, 25721496, 26053105, 26231900, 26594598, 26754337, 26983167, 27435710, 27883556, 28271942, 28749405, 29116277, 29226102, 29707455, 30517226, 30907137, 30926472, 31052258, 31415535, 32123821, 32741132, 33110206, 33457464, 33688444, 33811359, 34255958, 34629841, 34847961, 35155003, 35528851, 35923085, 36279142, 36619767, 36923094, 37092799, 37324122, 37502165, 37926506, 38390389, 38762526, 39523429, 39987945, 40103718, 40262878, 40355533, 40516066, 40534793, 40572635, 40585292, 40730606, 40848936, 40833989, 40983677, 41190817, 41419952, 41562378, 41280861, 41224639, 41256160, 41399247, 41493429]
11914D1493429l01863k02784M84054J8068l8164j76847q3551j33662p9791j13152
11904D0865737k58521j20228m28007j30114k99564k60795p6980k80120j10274
11895C8901134j09815k47103j7136j91389m23745l32172k57836j52472j43028
11886C7026438m4575l03181l76943k95041m7226R1064o1043l36620k52154l27829
11876C5072890j61071k71294l13314l05859m62775l77416l88850m23748m42751
11867C1925812n06622m49878l90150o89080r8013m19477l44980n09239n56762
11858B7961611l77409j70006j72420l85108l1483j31609m14803p9865j77191m19865
11848B5601852K0850r5750k38841l65293n9968k41572j47818l42505L076J96798
$$ y = [41493429, 41191566, 40988782, 41472836, 41490904, 41452740, 41275893, 41192342, 41058680, 40978889, 40865737, 40607216, 40486988, 40058981, 39928867, 39629303, 39368508, 39291528, 39011408, 38901134, 38791319, 38544216, 38527080, 38335691, 37911946, 37579774, 37321938, 37169466, 37026438, 36981863, 36678682, 36301739, 36006698, 35959472, 36050536, 35989493, 35652873, 35400719, 35072890, 34911819, 34640525, 34327211, 34021352, 33558577, 33181161, 32792311, 32368563, 31925812, 31419190, 30969312, 30579162, 29890082, 29792069, 29372592, 29027612, 28518373, 27961611, 27584202, 27414196, 27241776, 26856668, 26825185, 26693576, 26278773, 26198908, 26021717, 25601852, 25622702, 25526952, 25288111, 24922818, 24862850, 24621278, 24473460, 24130955, 24134031, 24330829]
11838B4330829J00071m2468j18789P163J94527J34410K85277L27230J45124j77250
11828B5186124j75900q6779l8551m2350r036P4772K17235K11794j98169k08159
11818B4930981j82412l69081j15298K12577P8741L4079j34468k40287j41825k97142
11808B3775865k15071j88150n75937k97137l66059M4300J92029m53541o4181k23050
11798B1629068n57342K8884j17944j97514p4233j88009q3027q0086M15118p1156
11788B0703759l08978K50809L26697L9589j04938r5536L01015J53221O6604J50466
11778B1482708J30586L07614o7642J5464K32737L52429K66304K65567K52035J75551
11768B3413353J18713p9718J6459J13799L86524K25326K47313J48329K07805J97944
$$ y = [24330829, 24430900, 24388432, 24269643, 24276806, 24471333, 24605743, 24891020, 25218250, 25363374, 25186124, 25010224, 24923445, 24884894, 24842544, 24833508, 24908280, 25125515, 25337309, 25139140, 24930981, 24748569, 24379488, 24264190, 24476767, 24555508, 24589587, 24455119, 24214832, 24073007, 23775865, 23560794, 23372644, 22796707, 22499570, 22133511, 22177811, 22369840, 21916299, 21852118, 21629068, 21071726, 21100610, 20982666, 20785152, 20710919, 20522910, 20439883, 20359797, 20774915, 20703759, 20394781, 20645590, 20972287, 21011876, 20906938, 20811402, 21112417, 21265638, 21332242, 21482708, 21613294, 21920908, 21853266, 21868730, 22101467, 22453896, 22720200, 22985767, 23237802, 23413353, 23532066, 23452348, 23468807, 23582606, 23969130, 24194456, 24441769, 24590098, 24797903, 24995847]
11758B4995847m9491k3047k13642k51192o6072k40437l50482k64997n81371m09500
11748B2545616k63086q65310r76136o01667m81233m29395o58839n48489n64556
11739A7156905m63955m91847o63551k53782j59480m94352l36064n4930k04490
11730A4034454l02830k9292L0833p9830j17791j20238J71361J16136K13681L32144
11720A4248628N41777P01373K89647M50935P54516N84633N26464M65473N06476
11711A9069922L52073L3507K01248P54960Q5751r4875k72114l78042j81315J8161
11701A9589276k11103q32168m26245j82098o2575m69394o62256p09047n19877
11692A5514513o28525p57522q57272n18816p38264o35783p61724l46450k43324
$$ y = [24995847, 24946356, 24923309, 24709667, 24458475, 24392403, 24151966, 23801484, 23536487, 22955116, 22545616, 22282530, 21417220, 20441084, 19839417, 19358184, 18928789, 18269950, 17721461, 17156905, 16692950, 16201103, 15537552, 15283770, 15124290, 14629938, 14293874, 14238944, 14034454, 13731624, 13702332, 13733165, 13653335, 13535544, 13415306, 13586667, 13702803, 13916484, 14248628, 14790405, 15491778, 15781425, 16232360, 16986876, 17571509, 18097973, 18563446, 19069922, 19421995, 19455502, 19656750, 20411710, 20497461, 20402586, 20130472, 19752430, 19571115, 19589276, 19378173, 18546005, 18119760, 17937662, 17875087, 17405693, 16743437, 16034390, 15514513, 14885988, 14128466, 13271194, 12752378, 12014114, 11378331, 10616607, 10270157, 10026833]
11683A0026833l05165m89263m94605l93593j91430k24890k72514j51728O8379
11674G572024p9559k13611l21020k33771j78487O769o2253l2014L08003J83393
11664F949474K45145R7859p6485J74065J16600R2776L4206j24169M15815L42159
11654H267445n9404J68222K53165K75190N9543L29309L56377k67222j82856p8725
11644I121044m40174k48916j52861l86998k29330k19689n11712m71548k48898
11635F210918k08541r2291l79485l23728m19081j18466n5177k97469J41650o5529
11625D392801k18963j25766k22138P1904l8180N1070j8337l0803J20436l36495
11615C645529Q9455k47722l70065j21783K54285K27202J29448r1435p3075M1568
$$ y = [10026833, 9721668, 9232405, 8737800, 8344207, 8152777, 7927887, 7655373, 7503645, 7572024, 7492465, 7278854, 6957834, 6724063, 6545576, 6552345, 6490092, 6458078, 6766081, 6949474, 7194619, 7292478, 7215993, 7390058, 7506658, 7599434, 7633640, 7509471, 7925286, 8267445, 8208041, 8376263, 8629428, 8904618, 8964161, 9293470, 9649847, 9382625, 9199769, 9121044, 8680870, 8431954, 8279093, 7892095, 7662765, 7443076, 6931364, 6459816, 6210918, 6002377, 5910086, 5530601, 5206873, 4787792, 4669326, 4614149, 4316680, 4458330, 4392801, 4173838, 4048072, 3825934, 3897838, 3859658, 3910728, 3892391, 3861588, 3982024, 3645529, 3734984, 3487262, 3117197, 2995414, 3249699, 3476901, 3606349, 3514914, 3441839, 3483407]
11605C483407m8342k116R3124R5732M7101k60270j99235j90842r163j05055N9947
11594B964288L7164j80832K5801l1281K97453j43885l63044j90160J60857l1000
11584B545361q0508L31958P0955l83707j82516J46150j50116k429M5985K41143
11574B582276K17855R2766K0646n45332l31981J2619J57401K20215J66887k75967
11564B317385m22322J39468R2785l29432l33604k63867K02654M4641J25356Q6643
11554A659707M7237q1295j25923j70675M5327m6322M4782q542R4802l2061j1060
11543A415977N9684J16482O9547J77428m5135k41514k60947J61029K26391K49791
11533A928733Q4309k39850j83869J15906K23147j17766j89686r0783n5883j21322
$$ y = [3483407, 3435065, 3432949, 3526073, 3621805, 3668906, 3408636, 3209401, 3018559, 3009396, 2904341, 2964288, 3001452, 2820620, 2846421, 2815140, 3112593, 2968708, 2605664, 2415504, 2576361, 2545361, 2464853, 2796811, 2867766, 2484059, 2301543, 2447693, 2297577, 2295148, 2341133, 2582276, 2800131, 2892897, 2913543, 2368211, 2036230, 2048849, 2206250, 2426465, 2593352, 2317385, 1895063, 2034531, 2127316, 1797884, 1464280, 1200413, 1403067, 1447708, 1573064, 1659707, 1706944, 1625649, 1499726, 1329051, 1374378, 1328056, 1372838, 1364296, 1459098, 1427037, 1415977, 1475661, 1592143, 1661690, 1839118, 1793983, 1552469, 1291522, 1452551, 1678942, 1928733, 2013042, 1773192, 1589323, 1705229, 1928376, 1810610, 1620924, 1530141, 1474258, 1352936]
11523A352936J6243j65040k0579k09529j02918K67754J39428o453m2648J16087
11513A345281K185K53559k04899k10311o1131R5772r6130l50868k01453j03087
11503D68918L62732L15080N3218R5045J65952l529J00536J0313o3507k19383n7099
11492A228276k254K07728K30426p0886k9326j71035K8516P1340j24247j11562
11482A256976P4088N139L1754R4908k7115k72577L0092j08726j3875K33603P913
11471A312180j84333j69852Q9747j07394l8087k97876j87212J07220J50027K44263
11461I18683J29465j9709k8643L9571l0597L0171J64794j39580o1153P429o8016
11450I42415j45940k07931l22103k22377M45668N45355j16730q1425o5309j14061
$$ y = [1352936, 1369179, 1204139, 1183560, 974031, 871113, 1138867, 1278295, 1271842, 1229194, 1345281, 1347466, 1601025, 1396126, 1185815, 1124684, 1220456, 1124326, 773458, 572005, 468918, 831650, 1146730, 1199948, 1294993, 1460945, 1457416, 1557952, 1568265, 1504758, 1285375, 1228276, 1226022, 1433750, 1664176, 1593290, 1563964, 1392929, 1421445, 1492785, 1368538, 1256976, 1331064, 1336203, 1367957, 1462865, 1435750, 1163173, 1193265, 1084539, 1070664, 1304267, 1312180, 1127847, 957995, 1047742, 940348, 902261, 604385, 417173, 524393, 674420, 918683, 1048148, 1028439, 999796, 1039367, 1008770, 1038941, 1203735, 1064155, 1003002, 1010431, 942415, 796475, 588544, 266441, 44064, 489732, 1035087, 918357, 836932, 771623, 657562]
11440F57562K95507n3611M2660o6285p5835j4201J76495k57664m80292R1453K21803
11429E37592L06669j38658l0170J03726j24772l64073p9401J95575n0151J38177
11419D94514K64650L1942l37661l65576r3980R2516L25455K7348k16878R5134
11409C17464K87362M93332R8015m45700Q523j28303j06028L00334J92350k23606
11399G93743j55114j9661K49718K74556J08862j97340l24747j87744p1230k75428
11389A95615K26606K42065K0134K7281j83779J8798J3988k08320l18566N66J59567
11378A93955K58049K66085J09392m2886K3890j0369j80107J44690J40695Q6719
11368I90113L8094k31053L292O575j18187k02753j13235k3068K57357J18491j67945
$$ y = [657562, 953069, 899458, 942118, 875833, 799998, 785797, 962292, 704628, 224336, 315789, 537592, 844261, 705603, 675433, 779159, 654387, 290314, 210913, 406488, 356337, 494514, 759164, 791106, 453445, 87869, -6111, 86405, 411860, 439208, 222330, 317464, 604826, 1098158, 1196173, 750473, 758996, 630693, 524665, 824999, 1017349, 793743, 638629, 618968, 868686, 1143242, 1252104, 1054764, 730017, 542273, 471043, 195615, 422221, 664286, 684420, 711701, 527922, 546720, 560708, 352388, 33822, 34388, 193955, 452004, 718089, 827481, 784595, 808485, 798116, 618009, 762699, 903394, 990113, 1028207, 797154, 800446, 807021, 688834, 486081, 372846, 349778, 607135, 725626, 557681]
11357E57681m88104r908Q4268L6767j6564J07919L83376K89009J30489l30881
11347G44052j58206j26477j74940q3263J31987J09523J27296K3816R8131k9692
11337F62227J59645l2109j74640k21544N8892K39682N9913j56503j57592M6602
11327D84573P4635J34044K54773k07396k12828J16145M0947j1384M9841m1475
11317F81875L7260J1796j66550M4272k56602r8663L3787J29628N0707R0035O283
11306E63828j71921j23488k33671n9603O8127R8110K31627L67832J53769j31896
11296G62714j50697n5575k37737k5241j21730K9267k669j81551P619R9812k71078
11285a46866J30596N07625J13718K6622J2279j48699j78905J48531L31308J569
$$ y = [557681, 69577, 59669, 143937, 180704, 164140, 272059, 655435, 944444, 1074933, 744052, 585846, 459369, 284429, 201166, 333153, 442676, 569972, 593788, 691919, 662227, 821872, 789763, 615123, 393579, 452471, 692153, 752066, 595563, 437971, 484573, 559208, 693252, 948025, 740629, 527801, 643946, 684893, 673509, 723350, 681875, 719135, 730931, 564381, 608653, 352051, 253388, 287175, 416803, 467510, 557545, 563828, 391907, 268419, 34748, -24855, 43272, 141382, 373009, 740841, 894610, 762714, 612017, 556442, 318705, 293464, 171734, 201001, 198332, 16781, 24400, 124212, -146866, -16270, 491355, 605073, 631695, 643974, 495275, 316370, 464901, 796209, 797778]
11275G97778k83078k4359j60511j88892K5173M7715N6290l16098o827L02345K06361
11264D55897R7284J99712Q493J7016k48045k22592J30738N4902k2537k14060l08963
11253e2155j20159J64719r1691p333j15930J62584N5388P1331Q3673J09097J43217
11242D02741q8318J85181l4601J58945k00148p9173j12650J73798l941N7655J91335
11231F50824j49783j26798N7331K90153M782k71626m4819j66294j42754J26572
11221B27588J82155j21462J07770m6224l7924l0550m5688N3754N7087K37656k23631
11210C60531l17947m9549K58505j11182k66247r2693J91230K00437J99655J49044
11200E21784j13239L4816n6896p6259j75004N0244J5040n6258J45733j92138q3943
$$ y = [797778, 514700, 490341, 329830, 140938, 166111, 213826, 270116, -45982, -52809, 249536, 455897, 553181, 752893, 761386, 778402, 530357, 307765, 438503, 493405, 470868, 256808, -52155, -172314, -7595, -99286, -106619, -222549, -59965, -4577, 66754, 150427, 259524, 402741, 314423, 499604, 465003, 623948, 423800, 344627, 231977, 405775, 401834, 459489, 650824, 501041, 374243, 431574, 721727, 726509, 454883, 410064, 243770, 101016, 227588, 409743, 288281, 396051, 349827, 311903, 281353, 235665, 289419, 346506, 584162, 360531, 42584, -6965, 251540, 140358, -125889, -218582, -27352, 173085, 372740, 521784, 408545, 443361, 386465, 310206, 135202, 185446, 200486, 144228, 289961, 97823, 13880]
11189A3880l3002Q2360L07346k3836J02246K59967K2061j30719l61627m19126
11179a80450K773j5840k12509K52732M51979L9170j42529j23148j87972J53310
11169C7516K58133O3819J09931j98554m8834j35626k0420J69369j1149k29167
11159d982J41962o7280k84546m4027K741r4705n643L19491L72982M24112M5011
11148H05116l80348k28258l2944q3410l12987R6075M22879J01850l6276M0389
11138C92086j38566l2107k8392K27896J90720j40401j01137k41406k76737K5028
11128a23016J25319j22040J79577K30343J89867o329k40800M1402j6500j13062
11118A44761k67129m4783p179m2568l257J98284L26219K41057k12414j3172k7414
$$ y = [13880, -19122, 63238, 370584, 346748, 448994, 708961, 731022, 600303, 238676, -180450, -177677, -193517, -406026, -153294, 298685, 337855, 195326, 72178, -115794, 37516, 295649, 359468, 469399, 270845, 222011, 86385, 65965, 235334, 224185, -4982, 136980, 69700, -214846, -258873, -256132, -350837, -356480, -36989, 335993, 760105, 805116, 424768, 196510, 163566, 80156, -232831, -136756, 286123, 387973, 351697, 392086, 253520, 221413, 193021, 420917, 611637, 471236, 370099, 128693, -148044, -123016, 2303, -119737, 59840, 290183, 480050, 473721, 232921, 274323, 257823, 144761, -122368, -167151, -174330, -216898, -220155, -21871, 304348, 545405, 332991, 319819, 292405]
11107B92405k60325k36174m3452Q2297K98030r0264k42909J33200J15598J09324
11097A57730k15366j85108K5572K60261n72j11668J08496J00516m8394J9787p1308
11086C9946j2699R304j0428j68212N5294r173O0384j19132K58442K83472M8201
11075D35399j17292j89952k13901O6094M4264K91566K2652j15119j5130L7528
11065B46109o3340k63441k4805M39085J22387j63775N3866p1476k8978j16289
11055A29343q1414Q878M38494R4364n5357O629K31933K44792L7059J38525o3898
11044A129348M2484l1271q8113q6422J53059K01844n2729L4515l833j39945M2787
11033A201724M65160o5639j24782m3422m4496L22425K50189O6080J81362K23890
$$ y = [292405, 32080, -204094, -247546, -165249, 132781, 42517, -200392, -67192, 48406, 157730, -57636, -242744, -217172, 43089, 42517, -69151, 39345, 139861, 91467, 111254, 39946, 27247, 36551, 26123, -142089, -86795, -95968, -35584, -154716, 103726, 387198, 435399, 318107, 128155, -85746, -19652, 24612, 316178, 338830, 223711, 208581, 246109, 182769, -80672, -105477, 333608, 455995, 292220, 346086, 274610, 245632, 129343, 47929, 56807, 495301, 589665, 534308, 540937, 772870, 1017662, 1054721, 1193246, 1129348, 1171832, 1140561, 1052448, 966026, 1119085, 1320929, 1268200, 1302715, 1298882, 1158937, 1201724, 1666884, 1601245, 1476463, 1433041, 1388545, 1710970, 1961159, 2027239, 2208601, 2432491]
11023B432491L0235k22501j16278l88029l48355O1363P9353J63399J03934o5491
11013A730121l35152P5402j55056j78230K2295Q736k98534k12807P2708k1352
11003G08131j69197P8454m8687j64040n608N9070r2482K998J47506p6085j93404
10992B46656m48251L86061K15454j61244J11323M2574j59904m9566q2486K1760
10982A22377q0300m7040k1948K02014J90214k04668k78104k75171P895J20593
10972b64138o1564L2799k6635K11257L35192O5740j08951k87598k32426K83502
10962e2822L43955J16778L2155Q7164m48329k93047P6212M1063j27091k7414O595
10951b44781J80791k385r6774j69664k39078K77161K89024K10370K9528j77168
$$ y = [2432491, 2462726, 2240225, 2123947, 1735918, 1387563, 1448926, 1528279, 1691678, 1795612, 1730121, 1394969, 1470371, 1315315, 1137085, 1159380, 1168116, 869582, 656775, 729483, 708131, 538934, 617388, 568701, 404661, 399053, 458123, 365641, 368639, 516145, 440060, 246656, -201595, 184466, 399920, 238676, 349999, 392573, 232669, 183103, 100617, 122377, 42077, -4963, -26911, 175103, 365317, 160649, -117455, -392626, -384731, -264138, -325702, -292903, -319538, -108281, 226911, 292651, 183700, -103898, -336324, -52822, 291133, 407911, 440066, 527230, 78901, -214146, -137934, -96871, -223962, -251376, -244781, -63990, -66375, -163149, -332813, -571891, -294730, -5706, 204664, 234192, 57024]
10941E7024Q4797j76969r1137K55751J0933l3606Q8850n096k76005k5158K29004
10930A18388J02831k04746j6100k6949n9078J56789J85240K8999l22729j59504
10920a96859J17499k5816j22799P4960k84550j23299n9310L8376M3064Q8466L3
10909d50235L06281J12481k19544k2023L72129J02928J58272j11789k25882j81566
10899a58948N8428m8999r5946p1155J18578j23382n9702L42269L89382O1674l39156
10888G3043O9179K25223k0169k62087k35456m51610K26800Q4065j01594J30461
10878b62145L28323K23019J86303n5099k9691O3177k47313j25563j60992k56105
10868c36086J0621J19150J62516N9449J7720R8757j62156k804J80595L9582K90267
$$ y = [57024, 141821, -35148, -126285, 129466, 140399, 106793, 195643, 190547, -85458, -110616, 118388, 221219, 16473, 373, -26576, -85654, 71135, 256375, 285374, -37355, -196859, -79360, -105176, -227975, -153015, -437565, -560864, -620174, -581798, -538734, -450268, -450235, -143954, -31473, -251017, -273040, 99089, 202017, 360289, 248500, 22618, -158948, -100520, -149519, -245465, -316620, -198042, -321424, -381126, -38857, 350525, 412199, 73043, 142222, 367445, 347276, 85189, -150267, -601877, -375077, -291012, -392606, -262145, 66178, 289197, 475500, 420401, 390710, 453887, 206574, 81011, -79981, -336086, -325465, -206315, -43799, 15650, 33370, 132127, -30029, -32833, 147762, 187344, 477611]
10857D77611P4836n7051j10569r4547O1735L8718k03902k0729K15636O5820k38733
10846B08825P8783j86718q2011N2538J89804k33414j42058q7879J8130K16080
10836C2080K72273j80086k0886l5327k0990l4611j35521k35556J54427j8464J07006
10825a15655J79376r8664k01748k90791L8252M76560J38478l07946m21284J68358
10815d35064M71422q7198k56127j94570L1135R8930J99785O2999j9898P2770o9835
10804a25651k2609K29711j29667j9078j2852L4586Q1511M9355o4155j95990j17157
10793b91996j36462j6381k3104K3014k213L8722L24847k68810j89157J37654m8644
10782d52530j92340M3572K86751l4950K58416n8679k18309P8217J86415K46492
$$ y = [477611, 552447, 495396, 384827, 290280, 352015, 390733, 186831, 166102, 381738, 447558, 208825, 287608, 100890, 18879, 71417, 261221, 27807, -114251, -202130, -184000, 32080, 304353, 124267, 103381, 68054, 47064, 12453, -123068, -358624, -204197, -222661, -115655, 63721, -34943, -236691, -527482, -489230, -12670, 125808, -182138, -603422, -435064, 36358, -50840, -306967, -501537, -470402, -371472, -171687, -108688, -128586, -55816, -125651, -148260, 81451, -48216, -67294, -80146, -45560, 35951, 85306, 21151, -174839, -291996, -428458, -444839, -467943, -444929, -447142, -408420, -83573, -352383, -541540, -403886, -452530, -644870, -601298, -314547, -349497, -91081, -149760, -368069, -289852, -103437, 143055]
10772A43055j64278n9945n7265l0853j73760l8169J86008J08852M2804q5986K4921
10761a04616j08385o774K53964R0922l69125j47968k8881J65000J08089k6577
10751a74351k14928k06401N0734L2440R7069J78348l4917J52791J34168l31575
10741c16622o7878J87145N5357n510K01387J53956J21363p7617k34101o6374J95830
10730A46936P344k92967r211O1474j05232q7170K0837P6184j9410L48288k6894
10719A20179k66486J02290J80046k51618Q8438K67381l31141m0941J4076J32033
10709A4257j59450m20983O6850K5305N6155j3233J10939J13961R8801J72518r9291
10698c4171J11399L99184P1211l04189k99055M2917J0764j48533J85798K33767
$$ y = [143055, -21223, -81168, -138433, -169286, -343046, -381215, -195207, -86355, -43551, -129537, -104616, -213001, -219775, 34189, 125111, -244014, -391982, -420863, -255863, -147774, -174351, -389279, -595680, -544946, -512506, -415437, -237089, -272006, -119215, 14953, -316622, -384500, -197355, -141998, -147508, 53879, 207835, 329198, 251581, 17480, -48894, 146936, 154280, -138687, -147898, -86424, -191656, -278826, -257989, -181805, -201215, 147073, 120179, -146307, -44017, 136029, -115589, -27151, 240230, -90911, -131852, -117776, 14257, -145193, -566176, -499326, -474021, -417866, -431099, -320160, -206199, -107398, 65120, -34171, 77228, 476412, 547623, 243434, -55621, -12704, -1940, -150473, 35325, 269092]
10688B69092L9160R1385j02898P1208J45131j65396j76940L29807J39887j42234
10678D98202j66938N5130Q0108O7847k59431K58396K35497l5070k46472m0666
10668D46603J77481o3006L04333M00753K8012K79849L88994J24675p7113J9968
10658B030549q8829J89822K66154N4474P9121k3702Q3335J23254K31877m8706
10648B897349J68191K94748J21521O63942O75269N05057O93551R31482R13853
10639G864963P06105J116013J325602J467277J548809K436696K766690L407448
10631B2639603M280776N771998P268879R095374R774271R487326Q901358Q285427
10623H5505012Q295123Q801826R794626J1052544J1872446J2471736J2716994
$$ y = [269092, 308252, 399637, 296739, 367947, 513078, 347682, 170742, 500549, 640436, 498202, 331264, 386394, 466502, 534349, 274918, 533314, 768811, 733741, 487269, 446603, 624084, 561078, 865411, 1266164, 1294176, 1574025, 1963019, 2087694, 2010581, 2030549, 1941720, 2131542, 2397696, 2452170, 2531291, 2507589, 2590924, 2714178, 2946055, 2897349, 3065540, 3360288, 3481809, 4145751, 4821020, 5326077, 6019628, 6951110, 7864963, 8571068, 9687081, 11012683, 12479960, 14028769, 16465465, 19232155, 22639603, 26920379, 32692377, 39961256, 49056630, 58830901, 68318227, 77219585, 85505012, 93800135, 102601961, 112396587, 123449131, 135321577, 147793313, 160510307]
10616A60510307J2672404J1786790J0028522P785726O806341Q338520J0975100
10609B28903710J3689181J5415399J5782484J4741924J1599119P463232M226456
10602C11821505J883063L13145Q80242L355796O820995R624853J0466372P680856
10594C52846827J896688o446984j4367996j8091553j7039489j4531883j1201579
10587B73064031p003305l096291n89452m06273k665040p180085j3124084j8467297
10579B20532204j9476116j7334572j4362707j1053275q343134o157996n095067
10572A38709337n334873o427722q715701j1151140j2821697j2386918j0781081
10565G1090205q353494o793203n107723m036750l338233k806283k286908k337715
$$ y = [160510307, 173182711, 184969501, 194998023, 202783749, 209590090, 217928610, 228903710, 242592891, 258008290, 273790774, 288532698, 300131817, 307595049, 311821505, 313704568, 314017713, 314897955, 318253751, 325074746, 334699599, 345165971, 352846827, 354743515, 348296531, 333928535, 315836982, 298797493, 284265610, 273064031, 266060726, 262964435, 262374983, 261968710, 259303670, 252123585, 238999501, 220532204, 201056088, 183721516, 169358809, 158305534, 149962400, 143804404, 138709337, 133374464, 126946742, 118231041, 107079901, 94258204, 81871286, 71090205, 62736711, 55943508, 50835785, 46799035, 43460802, 40654519, 38367611, 36029896]
10557C6029896k102698j703760j653401j499329j360044j186229j140821r93037
10549B4390577q89141r50914r04203q10090n23538o51889p53207q04727m81622
10540A7621246m74102l78862p49223o37436l11592m60857n03626n47731k78186
10531A3279631k69834l13234n75550m43217l77240k66785k67773k22300n17333
10522A0026365l00732m45479l65967l21445j7833k03349L9214j75152l76844k56384
10512G602394o9875j86050J13175j8032j41509j72763n48272m50163k63092K5141
10502E890954J73259j29831l52086p0155M60974L96k81814j57347n48935k56820
10492D728595J57836J99052j71587j3353j18811j11822l9824l15609l84347K85103
$$ y = [36029896, 33927198, 32223438, 30570037, 29070708, 27710664, 26524435, 25383614, 24390577, 23501436, 22550522, 21646319, 20836229, 20312691, 19660802, 18907595, 18102868, 17621246, 17147144, 16768282, 16019059, 15381623, 15070031, 14609174, 14105548, 13557817, 13279631, 13009797, 12696563, 12121013, 11677796, 11300556, 11033771, 10765998, 10543698, 10026365, 9725633, 9280154, 8914187, 8592742, 8574909, 8371560, 8410774, 8235622, 7858778, 7602394, 7532519, 7346469, 7459644, 7441612, 7300103, 7127340, 6579068, 6128905, 5865813, 5890954, 6064213, 5934382, 5582296, 5512141, 5973115, 5973511, 5691697, 5534350, 4985415, 4728595, 4886431, 5085483, 4913896, 4900543, 4781732, 4669910, 4630086, 4314477, 3930130, 4215233]
10482D215233J47892q0563p2313r4777k62952l09815L0185O2453j88379O8438
10472C515402M7597j18532j23246j32234J04714q643k0083l70521p004j92152
10462B695298L7303L0426n696j73012j41743j17369j94177j64799J81859k9955
10452B118135j90289j67911k24059l4423J58802L18766O4742k88073Q2887P7527
10442A916104O0579l9999J46477K28094k53836J38034J65439p9107k66362k45555
10432A769868M6714Q1699j24215O43k5385J02994m3027l31762j459J9817J87558
10421A683445q1207J59810j7795J41896J15081k36635N9531O8089k09639k33678
10411A448898k36576L8233P8958p4320K84131R2291K34862k82022m29318j35659
$$ y = [4215233, 4363125, 4282562, 4210249, 4115472, 3852520, 3542705, 3572890, 3635343, 3446964, 3515402, 3562999, 3444467, 3321221, 3188987, 3293701, 3285058, 3264975, 2894454, 2887450, 2695298, 2732601, 2763027, 2757331, 2584319, 2442576, 2325207, 2131030, 1966231, 2148090, 2118135, 1927846, 1759935, 1535876, 1501453, 1660255, 1979021, 2043763, 1755690, 1838577, 1916104, 1976683, 1936684, 2083161, 2311255, 2057419, 2195453, 2360892, 2281785, 2015423, 1769868, 1816582, 1898281, 1774066, 1774709, 1749324, 1852318, 1809291, 1477529, 1476070, 1495887, 1683445, 1602238, 1762048, 1744253, 1886149, 2001230, 1764595, 1824126, 1892215, 1682576, 1448898, 1212322, 1250555, 1329513, 1255193, 1539324, 1631615, 1866477, 1584455, 1155137, 1019478]
10401A019478j39048j38485L10623J62110J29801n2096J83827n9356P3036j00531
10391A389359k81789J9741j89232j15396K05093K04160J83883j13744O6674n7342
10381A311407q4661j88072r0097J07348l98493o3394L57755K42051p567l42228
10371H44049l91198j31183L53825J32889k84725K11634K08046K9593j18969j09111
10361G44850j4891K27563N0824k41832j50593k59282j84253M54616L92376k1801
10351I97577m06292K19161J93201k5476k0621j032j98570J27045J9633k92220
10341F12406L3751M0456R5563J89946J12989p4656n49904k39436O6081J80293
10331D67489L76294M27289n5457l85987R408j76415K34740M50858K61049L1531
$$ y = [1019478, 880430, 741945, 1052568, 1214678, 1344479, 1292383, 1476210, 1416854, 1489890, 1389359, 1107570, 1127311, 938079, 822683, 1027776, 1231936, 1415819, 1302075, 1368749, 1311407, 1226746, 1038674, 948577, 1055925, 657432, 594038, 951793, 1193844, 1186277, 844049, 452851, 321668, 675493, 808382, 523657, 735291, 943337, 972930, 853961, 744850, 729959, 957522, 1008346, 766514, 615921, 356639, 172386, 627002, 1019378, 997577, 591285, 810446, 1003647, 978171, 957550, 956518, 757948, 884993, 904626, 612406, 646157, 686613, 782176, 972122, 1085111, 1010455, 460551, 221115, 287196, 467489, 843783, 1271072, 1215615, 829628, 839036, 662621, 897361, 1348219, 1609268, 1640799]
10321A640799K92549j30865J20469K07879n9423k88144o5098L40894K58614K493
10311B320167J55007M05349L95959L40575j34261J66380M95421K49013R0610k7966
10301D456254j1886J36735n46778k28594J63522j7219O1354J9634l22557l25926
10291C384539j10486m17968J04393o6093l37219k22111M255O4304k1619j52863
10281B229132J14402K13524J77193j20560j79840M0069k9220k13344K14245K61551
10271B707152J21767n7419O4105j50607J39432M22728K2171K92314L15754K63892
10261D141289M30361L08929q5854J84655J79687J85899M71300N57959M93450N51610
10251G419285M66202N81015N70901K08163K80384J98272J81594R9331J62845N07032
$$ y = [1640799, 1933348, 1802483, 1922952, 2130831, 2071408, 1783264, 1718166, 2059060, 2317674, 2320167, 2475174, 2880523, 3276482, 3617057, 3482796, 3649176, 4144597, 4393610, 4484220, 4456254, 4444368, 4581103, 4034325, 3805731, 3969253, 3952034, 4013388, 4033022, 3710465, 3384539, 3274053, 2856085, 2960478, 2894385, 2557166, 2335055, 2339310, 2403614, 2381995, 2229132, 2343534, 2557058, 2734251, 2613691, 2433851, 2473920, 2444700, 2231356, 2445601, 2707152, 2828919, 2771500, 2835605, 2684998, 2824430, 3247158, 3269329, 3561643, 3877397, 4141289, 4571650, 4880579, 4794725, 4979380, 5159067, 5344966, 5816266, 6374225, 6867675, 7419285, 7885487, 8466502, 9037403, 9245566, 9525950, 9724222, 9905816, 10005147, 10167992, 10675024]
10241A0675024q822K35324J98175n787L46593J16048k98144J15759l1988k68214
10231A1073968m99265m22413k07480j82731l97113l70990k70391m4921m61337
10222H217327l69813m6497R2108K5413j38364K3462R4060M4500L38977K93534
10212H574707K0871r5979L9527J83150J62528J87826K51930R8754K44819J46536
10202I814669K07584J52971J69969K81522O09745J05620K06911N05848J74338
10193A2229177K99489L88537M79405O41396M95813J90287J19313P8620P5912K45530
10183A5243479K61263K17189M79583O58718M51041N26044O17379O7643j37557
10174A8384782j785M35446J25159j99163k07010L709l19013m93695p20325k07494
$$ y = [10675024, 10666202, 10901526, 11099701, 11093914, 11440507, 11556555, 11258411, 11374170, 11342182, 11073968, 10574703, 10152290, 9944810, 9762079, 9364966, 8993976, 8723585, 8678664, 8217327, 7847514, 7801017, 7893125, 7918538, 7780174, 7803636, 7897696, 7942196, 8281173, 8574707, 8595578, 8499599, 8539126, 8722276, 8884804, 9072630, 9324560, 9423314, 9668133, 9814669, 10022253, 10175224, 10345193, 10626715, 11236460, 11342080, 11548991, 12054839, 12229177, 12528666, 12917203, 13396608, 14038004, 14533817, 14724104, 14843417, 14922037, 14997949, 15243479, 15504742, 15721931, 16201514, 16860232, 17311273, 17837317, 18454696, 18522339, 18384782, 18382997, 18818443, 18943602, 18744439, 18537429, 18541138, 18222125, 17728430, 17008105, 16800611]
10164A6800611k76597l08052k39727m70910n31788k46152j58975m64363p85937
10155A3318110p03649o84406j10870k58244q8562j13900j51243k7372l77638j73372
10145A0628854J9558j20961j01575Q6596l5452k60173j80828N4986L01517J40835
10135A0533357j25311J96093j2118k7290M25217L11366Q1268j11476O5510J20854
10125A1457470M6194K44723r2432j47118j93749L1184J72994j34575r8126k10075
10115A1076490J09666J11543n03024k86726j32646k45327k1316k31215p8150k97287
10105I502008m13102k85842N9478p4635m18460k39412P550j43612l39282l58820
10095G295871l05340j90526l67542p1511J09411j26733m60616m48324l20594j49631
$$ y = [16800611, 16524014, 16215962, 15976235, 15505325, 14973537, 14727385, 14568410, 14104047, 13318110, 12614461, 11930055, 11819185, 11560941, 11472379, 11358479, 11207236, 11179864, 10802226, 10628854, 10648412, 10527451, 10425876, 10512472, 10477020, 10216847, 10036019, 10091005, 10392522, 10533357, 10408046, 10604139, 10592021, 10564731, 10989948, 11301314, 11382582, 11271106, 11336616, 11457470, 11503664, 11748387, 11655955, 11508837, 11315088, 11346272, 11519266, 11384691, 11286565, 11076490, 11186156, 11297699, 10794675, 10507949, 10375303, 10129976, 10108660, 9877445, 9799295, 9502008, 9088906, 8803064, 8862542, 8787907, 8369447, 8130035, 8137585, 7993973, 7654691, 7295871, 6990531, 6800005, 6432463, 6360952, 6470363, 6343630, 5883014, 5434690, 5114096, 4964465]
10085D964465R7737M256Q9712p9023l62510m2731k96744k48196j88632j31279
10075C807055M5554N8705k59259J68783L31321l25805n53273m78848O4131J58962
10065C017326r7246j45552n3295o030k08741o8239K44405l850n3698j52461J30438
10054B603057J84968J85393Q9112J45289o9590k81827k0877K96930K89295L6842
10044C458592l87674L247J14938l73945j22518R1841p4712j04405J43485R7430
10034B846279j29221l5215p973r6103k63894q0296L8850M0037m03561R0774j87740
10023A811937k23307j75116K67142n9825j04769M0384j00471P2336J36998j02072
10013A563237L5695q3782j17535j12723j13981L52122J53427j5276r5668j73199
$$ y = [4964465, 5062202, 5066458, 5156170, 5077147, 4714637, 4671906, 4375162, 4126966, 3938334, 3807055, 3852609, 3911314, 3652055, 3820838, 4152159, 3826354, 3273081, 2794233, 2858364, 3017326, 2920080, 2774528, 2721233, 2715203, 2506462, 2438223, 2682628, 2678778, 2625080, 2472619, 2603057, 2788025, 2973418, 3062530, 3207819, 3138229, 2856402, 2835525, 3132455, 3421750, 3458592, 3070918, 3074165, 3189103, 2815158, 2692640, 2784481, 2709769, 2605364, 2748849, 2846279, 2717058, 2681843, 2673870, 2577767, 2313873, 2233577, 2272427, 2312464, 1908903, 1999677, 1811937, 1588630, 1413514, 1680656, 1620831, 1516062, 1556446, 1455975, 1528311, 1665309, 1563237, 1598932, 1515150, 1397615, 1284892, 1170911, 1523033, 1676460, 1661184, 1565516, 1392317]
10003A392317J19076j4137k00818j92134k00564M1069Q3520J18229j95887j68031
9993G82640M6830K91256p5998j41229k15401O0195K17206m16196N8449k6437K24498
9982H05813M6747j9702j54095o9517N0966l8750J69132j36691l37481r8565L76705
9971E94562L83537N0856l40693q2932l755K48606o2170k89505J47798J46857l53923
9960D39238p2181K76240J36779k78298j00103J96724Q2832n5910l6374q4136p8181
9949D26630P8605l6034j6773J62368n1392k568K97365Q2587k74567j52762O222
9938E19681K9466N533o9537o3790L17128k28097k54910J8142m4478J85159L91434
9927H05731j42722j48235k90019k22508R2481k22999K56271J56114J6897M4654
$$ y = [1392317, 1511393, 1497256, 1296438, 1104304, 903740, 944809, 1028329, 1146558, 950671, 782640, 829470, 1120726, 1044728, 903499, 688098, 748293, 965499, 549303, 607752, 581315, 805813, 852560, 832858, 678763, 609246, 660212, 621462, 790594, 653903, 316422, 217857, 594562, 978099, 1028955, 688262, 605330, 601575, 850181, 788011, 498506, 646304, 793161, 439238, 367057, 643297, 780076, 501778, 401675, 598399, 681231, 625321, 588947, 504811, 426630, 505235, 469201, 452428, 614796, 563404, 560836, 858201, 940788, 666221, 513459, 519681, 549147, 554680, 485143, 421353, 738481, 510384, 255474, 273616, 229138, 414297, 805731, 663009, 514774, 224755, 2247, 94728, -128271, 128000, 284114, 301011, 345665]
9917C45665J98723r0924m14536N6842P730l6733m4085O6360j97385P1003K06650
9906A69310m8142l2814n3917k76077m3255R4262K02218M33003o1900n7811j00455
9895B24422j02122K88826J45821k70166l11140M2849J17944P1040L7503P7219
9885C22196L8784j54175J44762j16991j38530j18827k13741L45819L12267O3191
9875D84755l3229l11767j41027N036j09084J37047J86148J26276o2083O6527j3883
9864C34716r7815m1044j06495l1133j45936J41996M5944m1185l9851K02573M13003
9853F34773K20512l18476k81863j54225J73929K54659R1292O5299m06834k24610
9843E4456J41661K21590K69101j31831j65639R2452L749l0920K05675O0149k0227
$$ y = [345665, 544388, 453464, 38928, 95770, 103500, 66767, 22682, 89042, -108343, -37340, 169310, 121168, 88354, 34437, -241640, -284895, -190633, 11585, 444588, 382688, 324877, 224422, 122300, 411126, 556947, 286781, -24359, 18490, 136434, 207474, 244977, 322196, 360980, 206805, 351567, 234576, 96046, -22781, -236522, 109297, 421564, 484755, 451526, 139759, -1268, 3768, -105316, 31731, 217879, 344155, 282072, 348599, 334716, 236901, 195857, 89362, 58229, -87707, 54289, 100233, 59048, 19197, 221770, 634773, 855285, 536809, 254946, 100721, 274650, 529309, 620601, 685900, 279066, 54456, 196117, 417707, 686808, 554977, 389338, 481790, 485539, 454619, 660294, 720443, 700216]
9832G00216J3899O0247m2874J23607P2192n4464j19870M6048j75675k25252j03569
9821B94505L7897j63656J37245K78387L18198K99261j12117j35334J34931j79307
9811I10010m50428J06182n1689l8119n724R1723l25454j58424M8063L26531J04412
9800E57083k92705M6338o5342J70946J83848N6933L24734J19886j48570l30181
9790F22970L5698L56744M31269p7062k88640j08948J32681p5366l0899J06712
9780A105159K68922J21416J8895J31269N5402j961k143O9096M30303J05190P9777
9769B381325Q2426k8302J3480J60507K30604M40471k6384k94201j92624k69509
9759B497793Q6772L33869k3429n6335j62060j57351k31750q2725J5926j02419
$$ y = [700216, 714115, 774362, 731488, 855095, 927287, 872823, 752953, 799001, 623326, 398074, 294505, 332402, 168746, 305991, 584378, 902576, 1201837, 1089720, 954386, 1089317, 910010, 459582, 565764, 514075, 475956, 470232, 561955, 236501, 78077, 126140, 452671, 557083, 264378, 310716, 245374, 416320, 600168, 657101, 981835, 1101721, 953151, 622970, 658668, 1015412, 1446681, 1369619, 1080979, 972031, 1104712, 1029346, 998447, 1105159, 1374081, 1495497, 1514392, 1645661, 1701063, 1699102, 1696959, 1766055, 2196358, 2301548, 2381325, 2463751, 2435449, 2448929, 2609436, 2840040, 3280511, 3254127, 2959926, 2767302, 2497793, 2584565, 2918434, 2895005, 2838670, 2676610, 2519259, 2287509, 2204784, 2220710, 2118291]
9749B118291L65233M6556k860P0909p3006l62865J38111L23448O9028j69636j6121
9738B507088P3753j57563l31652K08018M01131K23131K59658j02318r6449J24716
9728C109513K6297M7186k4669K53785J98901K01088j73775J68059M16911M29092
9718D652388L18852K24077L40020O81560N81638M16595L63525J10985L02549L04424
9708H296613J39606O29805M7074R5091J79171Q0921L6239r5293j61370K3828r5429
9697I176256k22414j39111k26791k12988j97705j82413N273k16972k67838k53383
9687G261914m61919l26254q9530K98199J48292j2136k1913o7944k801j01863j07402
9676F516643K20192M54306J22993Q3600l7383M3053K62113K94184L64462J96550
$$ y = [2118291, 2483524, 2530080, 2527220, 2598129, 2525123, 2162258, 2300369, 2623817, 2692845, 2523209, 2507088, 2580841, 2423278, 2091626, 2299644, 2700775, 2923906, 3183564, 3081246, 2984797, 3109513, 3135810, 3182996, 3158327, 3412112, 3611013, 3812101, 3638326, 3806385, 4223296, 4652388, 4971240, 5195317, 5535337, 6216897, 6798535, 7215130, 7578655, 7689640, 7992189, 8296613, 8436219, 9066024, 9113098, 9208189, 9387360, 9468281, 9504520, 9409227, 9247857, 9271685, 9176256, 8953842, 8814731, 8587940, 8374952, 8177247, 7994834, 8000107, 7783135, 7515297, 7261914, 6799995, 6473741, 6384211, 6682410, 6830702, 6818566, 6796653, 6728709, 6725908, 6624045, 6516643, 6736835, 7191141, 7314134, 7397734, 7360351, 7403404, 7665517, 7959701, 8324163, 8520713]
9666H520713L81828M88450P58858O00907O80143P66166N94215O05737O50426Q08838
9656A4856281P81544P62728O86912O04251M89859P4694J39067N51481J16224l03364
9646A8759677l07041l42772k74867p43341o38029o63891p15465l90574n67412
9637A4116285n22347o38848m63138j47410k64301l56574j75848p78945n17238
9628A0251636r6124K2720r9861J52575k72614k64467l59298K6820N32555N24823
9618A0418765P3461m6917j49476K44493L40794J86639O5212M04952M03533O0684
9608A2002140m21553j81249L9748L09664M03955K51291K21602J45595K86014L6922
9598A3094129j28121J72725K4852J34754K18403J28988k1418l4966J55869l2q1625
$$ y = [8520713, 8902541, 9390991, 10149849, 10750756, 11430899, 12197065, 12791280, 13397017, 14047443, 14856281, 15637825, 16400553, 17087465, 17691716, 18181575, 18256269, 18395336, 18946817, 19063041, 18759677, 18452636, 18109864, 17834997, 17091656, 16453627, 15789736, 15074271, 14683697, 14116285, 13593938, 12955090, 12491952, 12344542, 12080241, 11723667, 11547819, 10768874, 10251636, 10155512, 10178232, 10078371, 10230946, 9958332, 9693865, 9334567, 9361387, 9893942, 10418765, 10492226, 10445309, 10295833, 10540326, 10881120, 11067759, 11132971, 11537923, 11941456, 12002140, 11580587, 11399338, 11439086, 11748750, 12152705, 12403996, 12625598, 12771193, 13057207, 13094129, 12966008, 13138733, 13163585, 13298339, 13516742, 13645730, 13624312, 13589346, 13745215, 13745183, 13663558]
9587A3663558j41881l22512l66930l60231n35946l11011m86860m63915j63358
9578A0510914k36240o8132l54082l27771m50172l49080l51376r8346J62324P6426
9568H514465K72080J12052j72178j4174o4498P0794K91070M61018J72037k90171
9558I352495j32189J87585j6216j5920N308j70732j36923j85759J31699J00440
9548I119788j33146j25698k22975K38568Q7566j16136n7907J17380k9092J00002
9538H978350j31195m03041r1398m7288j01051P389j58044k8174j81721j33154
9528G710673L63751K92547J56725J09760J38715J32797K14546J56753j16069M3101
9518I203299J59088j9327J37630r4635P7095J34918J0765O0044j792j67886J32743
$$ y = [13663558, 13521677, 13199165, 12832235, 12472004, 11936058, 11625047, 11138187, 10674272, 10510914, 10274674, 10206542, 9852460, 9524689, 9074517, 8725437, 8374061, 8275715, 8438039, 8514465, 8786545, 8898597, 8726419, 8712245, 8647747, 8718541, 9009611, 9470629, 9642666, 9352495, 9220306, 9407891, 9391675, 9375755, 9381063, 9210331, 9073408, 8887649, 9019348, 9119788, 8986642, 8860944, 8637969, 8876537, 8964103, 8847967, 8790060, 8907440, 8878348, 8978350, 8847155, 8444114, 8352716, 8305428, 8204377, 8211766, 8053722, 8025548, 7843827, 7710673, 8074424, 8366971, 8523696, 8633456, 8772171, 8904968, 9119514, 9276267, 9160198, 9203299, 9362387, 9343060, 9480690, 9386055, 9463150, 9598068, 9608833, 9668877, 9667085, 9499199, 9631942]
9507I631942L40169K69557J88766j27722r3015K31626L20205K16454j02230J59185
9497A1034937K13992L07531M74545M01485J47732M11728K13170K67470M38379
9488A3910969K03433J16761P8346J46626J20947j53240K65592N48212l1717j83905
9478A5022024p2415K7410P4291L35409M37890J26822k86468m14965j09114O6237
9468A5207121k0437j36585k7564R2784l6184J79974K51907K58474L52193J30917
9458A6252600L33769L11642M22193J88185L07860M73301L63988Q2684J32877L01847
9448A9170946N53295N73257J24353O20882P86215R20293O97151N11932N38851
9439B4497175N57362O01663O47210K72427N26862P30319P79725O23464K91130
$$ y = [9631942, 9972111, 10241668, 10430434, 10302712, 10209697, 10441323, 10761528, 10977982, 10875752, 11034937, 11248929, 11556460, 12031005, 12432490, 12580222, 12991950, 13205120, 13472590, 13910969, 14114402, 14231163, 14309509, 14456135, 14577082, 14423842, 14689434, 15237646, 15205929, 15022024, 14949609, 14977019, 15051310, 15386719, 15824609, 15951431, 15664963, 15249998, 15140884, 15207121, 15186684, 15050099, 15022535, 15115319, 15079135, 15259109, 15511016, 15769490, 16121683, 16252600, 16586369, 16898011, 17320204, 17508389, 17816249, 18289550, 18653538, 18736222, 18869099, 19170946, 19724241, 20297498, 20421851, 21042733, 21828948, 22749241, 23446392, 23958324, 24497175, 25054537, 25656200, 26303410, 26575837, 27102699, 27833018, 28612743, 29236207, 29527337]
9430B9527337J98313P2527J34017k35139l71054j71164j43235J68707j98162l24552
9420B8657595k14440Q669l2995k26199k78396j70476M56919J65721P6218K73982
9410B8716598L13494M48721J74112N74508O92938P16190R77320J274998Q21019
9401C4709898Q92047R31982R16629P93630J045639J472306J294767J357777J179880
9392D4594555J187037R80756J406958J256047J012583J182120Q38502P14471P39800
9383E3912829Q06756O46422N15301K57163j00993r3017q9231n07472q11880r92012
9373E3543866j358797j406020r03935j076935j181232r93249p17599p75799j255627
9364D3874673q30934n24860k63296k83391m60679j98586p443J18235M34092M53433
$$ y = [29527337, 29725650, 29798177, 29932194, 29697055, 29326001, 29154837, 29011602, 29180309, 28982147, 28657595, 28443155, 28451824, 28418829, 28192630, 27914234, 27743758, 28200677, 28366398, 28442616, 28716598, 29030092, 29478813, 29652925, 30227433, 30920371, 31636561, 32613881, 33888879, 34709898, 35601945, 36533927, 37450556, 38244186, 39289825, 40762131, 42056898, 43414675, 44594555, 45781592, 46762348, 48169306, 49425353, 50437936, 51620056, 52458558, 53173029, 53912829, 54719585, 55366007, 55881308, 56138471, 56037478, 55944461, 55855230, 55347758, 54535878, 53543866, 52185069, 50779049, 49875114, 48798179, 47616947, 46623698, 45906099, 45130300, 43874673, 43043739, 42518879, 42255583, 41972192, 41511513, 41312927, 41305484, 41423719, 41857811, 42311244]
9354D2311244L89383O09529Q45674O36213N02262N80792M80366M94378k1748k5478
9344D6802615o4502k05134j15263o39447m34685m37292q00222p31803q52451q37509
9334D1684307r32404r31891q26656q99379j302008j585413j547072r54189j189293
9325C1516002j692524j462193j531128j523976j285419j329369j069126q66927
9317B0755340p75642n42849n36551n89367j92397k19998m22653r9447j17799p5653
9307A7182984l37p5951k41046j4397K98520L06889L38666K24218L07253N15912
9297A8842711K36358L14330K56858N64817O45834J14711q300J93321J17711k33392
9287B1044959k88870k32384n31793o19960n32465n33525p81966q02272l06550
$$ y = [42311244, 42700627, 43310156, 44155830, 44792043, 45294305, 45875097, 46355463, 46849841, 46828093, 46802615, 46738113, 46532979, 46417716, 45778269, 45343584, 44906292, 44106070, 43374267, 42521816, 41684307, 40751903, 39820012, 38993356, 38093977, 36791969, 35206556, 33659484, 32705295, 31516002, 29823478, 28361285, 26830157, 25306181, 24020762, 22691393, 21622267, 20755340, 19979698, 19436849, 18900298, 18310931, 18118534, 17898536, 17475883, 17376436, 17258637, 17182984, 17182647, 17106696, 16865650, 16851253, 17149773, 17456662, 17795328, 18019546, 18326799, 18842711, 19079069, 19393399, 19650257, 20215074, 20860908, 20975619, 20967319, 21160640, 21278351, 21044959, 20756089, 20523705, 19991912, 19371952, 18839487, 18305962, 17523996, 16721724, 16415174]
9278A6415174o84805q74518n77279q38610n89824l63497o51315p03152l59336
9269A0772838m83494q5734k71159j24778k15524m06715k32781o1035O9899l16172
9259H645345j3601k5679m50744k95985K78760M6235R0596K9202l55714l79301
9249G569114K34726M16229L25605L60984N40070K69944K03560K01842K33069K27474
9239A0582617J12324n7593Q9592P3100j08361l0942m24539j46761j96680m88210
9229I404547k60999j5912q0008p2982M929l56601o46915l31500k9164J01977j70468
9218G546904k70537j74609J00239P2865N4339j24838l04210j28178J55596O5234
9208F992805J15570J22008J55784L79517M32279j74733j44583M23878K74656K09754
$$ y = [16415174, 15730369, 14855851, 14278572, 13439962, 12850138, 12486641, 11835326, 11132174, 10772838, 10289344, 10203610, 9932451, 9807673, 9592149, 9185434, 8952653, 8891618, 8961517, 8645345, 8631744, 8606065, 8155321, 7859336, 8138096, 8184331, 8274927, 8304129, 7948415, 7569114, 7803840, 8220069, 8545674, 8906658, 9446728, 9716672, 9920232, 10122074, 10355143, 10582617, 10694941, 10637348, 10726940, 10800040, 10691679, 10660737, 10236198, 10089437, 9892757, 9404547, 9143548, 9127636, 9047628, 8974646, 8979575, 8622974, 7976059, 7644559, 7615395, 7717372, 7546904, 7276367, 7101758, 7201997, 7274862, 7329201, 7204363, 6900153, 6771975, 6927571, 6992805, 7108375, 7230383, 7386167, 7765684, 8197963, 8023230, 7878647, 8302525, 8577181, 8786935]
9198H786935J36296l9148L16321K87261L17068k7256N5926l7650j8475k02621
9188I574657o584K79068J77147M18903J81360K73121R3309k45978K47818J57774
9178A1150595j0l01242m7017L05042k44635q6198J46961o2016k52647l68678j54636
9167A0085519j35998k82249l34878p2482K8820j39521r3471K45585k01006j71044
9157H929275L19610L78822J38125q8320K41458M63250N13059L87642P8066J96591
9147A1557578K09953P67797P61685N77230K77884K43513L17587Q08091Q06886
9138A6328204O88459N62519J89798L52838N06055L68989L43171j54831m8184K96589
9128A9433607P0338j33901K04179J23297o5585l92610n84558k90865r4093n55636
$$ y = [8786935, 8923231, 8884083, 9200404, 9487665, 9804733, 9777477, 9833403, 9795753, 9777278, 9574657, 9568073, 9847141, 10024288, 10443191, 10624551, 10897672, 10990981, 10745003, 10992821, 11150595, 11150585, 10849343, 10802326, 11107368, 10862733, 10776535, 10923496, 10861480, 10608833, 10240155, 10085519, 9949521, 9667272, 9332394, 9259912, 9288732, 9149211, 9055740, 9301325, 9100319, 8929275, 9248885, 9627707, 9765832, 9677512, 9918970, 10382220, 10895279, 11282921, 11360987, 11557578, 11767531, 12535328, 13297013, 13874243, 14152127, 14395640, 14713227, 15521318, 16328204, 17016663, 17579182, 17768980, 18121818, 18627873, 18996862, 19340033, 19185202, 19137018, 19433607, 19503945, 19370044, 19574223, 19697520, 19631935, 19239325, 18654767, 18363902, 18269809, 17714173]
9118A7714173q55345l92201o33800p71980n84540m34832p82789n47575o21987
9109A2089124q3717K62848j67787n37354k28725k66269q4565K26955J98206P02818
9099A2111534O39066K08003J60137M03808M96068K91931j74133K74360M30949
9090A4841723L53001K82674Q6038L44498M19299j57892m41288J21241K70650J14840
9080A6234784j65386m15288K4951k40108l45139m37362k77999m54604j81362j18839
9070A3623648p04173q43370m34469k61826j58702l20924n33333m12906j07750
9061I846195q5432j80339j16181l20741j16022k67064m27442k60417k24909m31906
9051G415742k86012l18216j33734j44605j08480k15974k18874l76226j13013M5727
$$ y = [17714173, 16858828, 16466627, 15832827, 15060847, 14476307, 14041475, 13258686, 12711111, 12089124, 12005407, 12268255, 12100468, 11563114, 11334389, 11068120, 10983555, 11210510, 11408716, 12111534, 12750600, 12958603, 13118740, 13522548, 14018616, 14310547, 14136414, 14410774, 14841723, 15194724, 15477398, 15563436, 15907934, 16327233, 16169341, 15728053, 15849294, 16119944, 16234784, 16069398, 15654110, 15679061, 15438953, 15093814, 14656452, 14378453, 13923849, 13742487, 13623648, 12919475, 12076105, 11641636, 11379810, 11221108, 10900184, 10366851, 9953945, 9846195, 9760763, 9580424, 9464243, 9143502, 9027480, 8760416, 8332974, 8072557, 7847648, 7415742, 7129730, 6811514, 6677780, 6533175, 6424695, 6208721, 5989847, 5613621, 5500608, 5546335]
9041E546335P2102k51717J9604K38514m7629p9960k84287R0859K37009J42036
9031E682866l2129j70124K27293Q8272J52170J49108j88480m41233k82000L3994
9021E219737K93519o8972l42389j56409l26624j37545L18803J48243n3474j56686
9011D738203l01057j27043J11240m6170o0923N6370o5337k7224l05917K20644
9001D192786j0831k87593j44400j19260l60274j26825r3178j6191j97059N8786
8991B895961J18150j89357j19400q34o6169m4617m8182k59997j69601k3596j95890
8980A896468j32635n3647j88980n6793m1347n3032n9048p4444K11877K28551j88790
8969A488180l9566J94253l0576j82371M6215j1909k63452J28085P9297j80395
$$ y = [5546335, 5618437, 5366720, 5386324, 5624838, 5577209, 5497249, 5212962, 5303821, 5540830, 5682866, 5650737, 5480613, 5707906, 5796178, 5948348, 6097456, 5908976, 5467743, 5185743, 5219737, 5513256, 5444284, 5101895, 4945486, 4618862, 4481317, 4800120, 4948363, 4894889, 4738203, 4437146, 4310103, 4421343, 4375173, 4314250, 4370620, 4305283, 4278059, 3972142, 4192786, 4181955, 3894362, 3749962, 3630702, 3270428, 3143603, 3050425, 3034234, 2837175, 2895961, 3014111, 2824754, 2705354, 2704520, 2638351, 2593734, 2545552, 2285555, 2115954, 2092358, 1896468, 1763833, 1710186, 1521206, 1464413, 1423066, 1370034, 1310986, 1236542, 1448419, 1676970, 1488180, 1448614, 1642867, 1612291, 1429920, 1476135, 1464226, 1200774, 1328859, 1408156, 1227761]
8959A227761k07736J37873k8375R017M9218n8804P9868k06854o4250o1824k5860
8948H50034K29500L8204k81903j83699J28607J87696k7935K3137o1499J1011M6702
8937I59855k43281n1158K51196J50021r4462l11542k72520J98057J00625O7783
8927G54574l98392k2655K40918J04690m7068q2736J74079k08730j82118p6647
8917B55915Q5815K54873J1479k4793L0322j86229j18845p6607J13060J69858K57744
8906G72592j30778l11397r0732P6587J45480K96870o5239N2738q8039l34531J16559
8895D40110K83861P3288J56761l58771l85553P0518K61506M5167k27089j77794
8885A82004q0565N3407m8462j20450N85766K47536j12203J42812J54146j66284
$$ y = [1227761, 1020025, 1157898, 1129523, 1138540, 1187758, 1128954, 1208822, 1001968, 937718, 875894, 850034, 1079534, 1117738, 835835, 652136, 780743, 968439, 940504, 963641, 902142, 913153, 959855, 716574, 665416, 916612, 1066633, 972171, 660629, 388109, 586166, 686791, 754574, 356182, 333527, 574445, 679135, 632067, 549331, 723410, 514680, 332562, 255915, 341730, 596603, 608082, 583289, 613611, 427382, 308537, 231930, 344990, 514848, 772592, 641814, 330417, 239685, 316272, 461752, 758622, 693383, 746121, 658082, 323551, 440110, 723971, 797259, 954020, 595249, 209696, 280214, 541720, 586887, 359798, 182004, 101439, 154846, 106384, -14066, 571700, 819236, 707033, 849845, 1003991, 837707]
8875H37707j92095k17267K34065M7776j00270r9784k38756M3332j00974l07458
8865i3724J40545J79180L04103K30127o6626J19351N2822j97135J5058j35306
8855E48395J47490J52424o6604m46522l45887N2287J06681O1907R4962M3303J30364
8844D78800o8085r0565j17773Q2548K5993J929l0320k4854k56374K2080M5725
8833F9104l2358K8402N2598P5762J86712R3153J43827r2504m3664m8957o8751
8822C63324j14900k05138K9103M9655K6835L32131O1255j85729j28228j33465
8812I4843L99362J31703L3077P6116N3105j43772N089j83487k6855j44716m901
8801B89564o4156l7437n1190N9646P9389K1317J41370n3638j25550Q3008J33529
$$ y = [837707, 645612, 428345, 662410, 710186, 609916, 510132, 271376, 314708, 213734, -93724, 46821, 226001, 530104, 760231, 693605, 812956, 865778, 668643, 683701, 548395, 695885, 848309, 781705, 335183, -10704, 41583, 148264, 210171, 305133, 348436, 478800, 410715, 320150, 202377, 284925, 310918, 312847, 282527, 257673, 1299, 23379, 69104, 36746, 65148, 117746, 193508, 380220, 473373, 617200, 524696, 481032, 432075, 363324, 248424, 43286, 72389, 122044, 148879, 481010, 542265, 356536, 228308, 94843, 494205, 625908, 658985, 735101, 788206, 644434, 649523, 466036, 439181, 294465, 289564, 225408, 187971, 136781, 196427, 275816, 297133, 438503, 384865, 259315, 342323, 475852]
8790D75852J31909q9074J64562k9959j01306R860N7497j5598r0527R6772m4131
8779E65857k13283J63904J66650O6536k15476k18895J19750N9767k4063j53402
8769C17345k98818L38929J91022o7435j26996K23387j14162k90875l75950J48558
8759e4995J05366O8760J06011k48959j93751J42493j68635l8419J20398J42547
8749a9184M2943L13342L86116q0361j0096r7897j43098n0241j29540J1198k6381
8738A96801K00769K68801K27264j0189l2912R9791K4140J1982j13518j07585k22642
8727E42702m65021j30702L67286O4824j36527j06717p0501J84055J78665j44896
8717B83168L7720K20807j50134k37881l5822k83085J90052J10625J29029q7910
$$ y = [475852, 607761, 518687, 683249, 653290, 551984, 561844, 619341, 603743, 513216, 609988, 565857, 352574, 516478, 683128, 749664, 534188, 315293, 435043, 494810, 470747, 317345, 18527, 357456, 548478, 481043, 354047, 577434, 463272, 172397, -203553, -54995, 50371, 119131, 225142, -23817, -217568, -75075, -243710, -282129, -161731, -19184, 23759, 337101, 723217, 642856, 632760, 534863, 391765, 341524, 211984, 223182, 196801, 397570, 666371, 893635, 883446, 850534, 950325, 974465, 986447, 872929, 765344, 542702, 77681, -53021, 314265, 379089, 242562, 135845, 65344, 249399, 428064, 283168, 320888, 541695, 391561, 153680, 117858, -165227, 24825, 135450, 264479, 176569]
8707A76569j60036m5978j04958k18444J05452K68479L19403O273n5440k80456
8697A0864j95508J04199J31259Q6069n1332J51043j13824p1382j51017J83648
8687H4019L45014M9354L07458r547o6368j56222l77994K573Q0051l362j14280
8676A40696k58066n2317J23725L3224n8748J45800J93021J50068J44009R1987
8666F53399n2839k84140k91558j2982r5128k21138L12641J32219J82604J56241
8656D79319O0443o7086n2495m71427j59864N5008J31433K60359K18140L0274k99290
8645A84814K27969N4153m9564j03172r7662p3637L0302L4045J22401p0141o5830
8634A93678n2088j11776N9829J23337J33209J29977K67700l38714l38785l81780
$$ y = [176569, 16533, -29445, -134403, -352847, -247395, 21084, 340487, 346760, 291320, 10864, -184644, -80445, 50814, 136883, 85551, 236594, 122770, 51388, -99629, 84019, 429033, 478387, 785845, 776298, 709930, 553708, 175714, 178287, 258338, 254976, 140696, -117370, -169687, -45962, -12738, -71486, 74314, 267335, 417403, 561412, 653399, 600560, 316420, 24862, 11880, -83248, -304386, 8255, 140474, 323078, 479319, 539762, 472676, 420181, -51246, -211110, -156102, -24669, 235690, 453830, 484104, 184814, 412783, 466936, 417372, 314200, 216538, 142901, 173203, 207248, 329649, 259508, 193678, 141590, 29814, 89643, 212980, 346189, 476166, 743866, 405152, 66367, -315413]
8624c15413L6078L0325Q1526N9262J78805K23099P0655k743K85629l947k5294
8613F17982L1035j41775k74682k73498J29229o5911Q4680J39166K59267J35382
8603F40875l43900k78625K8467J81330n1527J37891K16022j08311j00884k21339
8593I9999K69246J46777k33300l0236O0586j7755q0613j50772L7579m8633r1334
8582c8456J03748K73217n656j82886k09233M1170Q2984j15912j55481J02383R884
8571i4238J35239R3717Q4571r1484j67897l7318j07354r33r3136j05958p0121
8560d54912L28434K91861j10961k6428l4706J0011p7087J74999j94836N8145O2420
8549B6940K17784p3846J71517J37479K39001P9927k42648r4591j38083l5406J26033
$$ y = [-315413, -279335, -249010, -167484, -108222, 70583, 293682, 364337, 361594, 647223, 643276, 617982, 649017, 507242, 232560, -40938, 88291, 22380, 107060, 246226, 505493, 640875, 296975, 18350, 46817, 228147, 176620, 314511, 530533, 422222, 321338, 99999, 369245, 516022, 282722, 252486, 313072, 295317, 214704, 63932, 101511, 52878, -38456, 65292, 338509, 332853, 149967, -59266, -18096, 64888, -51024, -206505, -104122, -94238, 41001, 134718, 219289, 127805, -40092, -77410, -184764, -185697, -278833, -384791, -454912, -126478, 165383, 54422, 27994, -6712, 3299, -73788, 101211, -93625, -35480, 26940, 244724, 170878, 342395, 479874, 718875, 798802, 556154, 461563, 323480, 288074, 414107]
8538D14107q5891k989j35773K32322J51934j74508l73812l46612J17134J01232
8528a02856k7903L706l0897O9524K31626L5263k1851j02765j42673K53546O6567
8517B31287k79501k80615K56582O4564k5723J44082K73901J08269j51568j60345
8507A80933J625J0586r3543j88373k06083Q0597K31531L47187K17807j65953n6248
8496C60066K33126O2260l68932l15938j02199j54487K48986J30922p2500k28867
8486b07563L12107R3680p7777K21497j36562l6345j08747P6579j42459m5201P7290
8475B6499o1100o0248K17683q9623j57748N7713L5213K77169J37034j04366j51886
8464A26340P8633j28377N1593n5911n4748L84444J27825o0893M0591j16227k23556
$$ y = [414107, 328216, 325227, 189454, 421776, 573710, 399202, 25390, -321222, -204088, -102856, -130759, -127053, -157950, -88426, 143200, 178463, 156612, 53847, -88826, 164720, 231287, -48214, -328829, -72247, -7683, -33406, 110676, 384577, 492846, 341278, 180933, 182558, 193144, 99601, -88772, -294855, -214258, 17273, 364460, 582267, 416314, 360066, 593192, 655452, 286520, -29418, -131617, -286104, -37118, 93804, 21304, -207563, 104544, 198224, 120447, 341944, 205382, 169037, 60290, 136869, -5590, -50791, 26499, -34601, -94849, 122834, 33211, -124537, -66824, -31611, 245558, 382592, 278226, 126340, 204973, 76596, 128189, 72278, 17530, 401974, 529799, 468906, 509497, 393270, 169714]
8453A69714Q5041J09231j23822p3801J39334L71283J07655J20843j7770K12261
8443A099969J0l47552k03638J77l24573o8918J11475M2097j62927J43825Q4918
8432C74863j55960q1727j10648K56442L9794j28954j38704R5033R6923q5913j13809
8421D7340l03701j64803Q1097K75934K07049j45229j15313J19134j09978k38782
8411c47252k30178M16375L97328j04978k70029k86543K15322J02705j12084K65774
8401D6440k1562j03224k77163J72590L56956P0584J61332r004j51141n706l3877
8390B06225p0389p8359n9196j44900k47514K49262l0593k66608J31033q6176J6502
8379c80713K27522J02485m9325J20055J25978K7719o8077j00593J195n2996N0645
$$ y = [169714, 254755, 363986, 240164, 166363, 305697, 676980, 784635, 905478, 887708, 1099969, 1099979, 752427, 548789, 548966, 224393, 155475, 266950, 309047, 146120, 289945, 374863, 218903, 137176, 26528, 282970, 322764, 193810, 55106, 150139, 247062, 161149, 47340, -256361, -421164, -340067, -64133, 142916, -2313, -117626, 1508, -108470, -347252, -577430, -161055, 236273, 131295, -138734, -425277, -209955, -107250, -219334, 46440, 24878, -78346, -355509, -182919, 174037, 244621, 405953, 396949, 245808, 240102, 206225, 135836, 57477, -1719, -146619, -394133, -144871, -175464, -442072, -311039, -397215, -380713, -153191, -50706, -100031, 20024, 146002, 173721, 105644, 5051, 6246, -46750, 3895]
8368C895O2448K5734Q0516J99051k3595q2438k57814M3885K70094q0253l39105
8357i7582p8940J49806J21958K25529o862j75125n3921L5987K06724n6361M321
8346B75534j20405J94548K45003j69442j32982l59606j51791J31176l2112M169
8336a15908N0602R6242R8440K08312L1480k43252k03969j52896k06199n8746J40988
8325c54906K48369L4332k9893J75661J23457k16394j58433m3661J9740M3509J23561
8314c4658K44342K86569k16428l8482J53389l56645k07078J35826M82235J51405
8304F00475p3782k0628j18368j69829m5240j08289M682N6329J97592k7614j2895
8293B82433P0074m5172R5668K25574j16526j33987l83042J51745J29574q8357
$$ y = [3895, 66343, 92077, 172593, 371644, 348049, 265611, 7797, 51682, 321776, 241523, -97582, -176522, -26716, 95242, 320771, 313909, 138784, 84863, 120850, 327574, 271213, 275534, 155129, 349677, 594680, 425238, 292256, -67350, -219141, -87965, -120077, -115908, -65306, 30936, 129376, 337688, 369168, 125916, -78053, -230949, -437148, -495894, -354906, -106537, -72205, -102098, 73563, 197020, -19374, -177807, -221468, -201728, -158219, -34658, 209684, 496253, 279825, 241343, 394732, 38087, -168991, -33165, 449070, 600475, 526693, 506065, 387697, 217868, 172628, 64339, 69021, 125350, 322942, 295328, 282433, 352507, 307335, 403003, 628577, 512051, 378064, -4978, 146767, 276341, 187984]
8283A87984m8474j4551J32293O7015J69911o1989m50094L6794K35349p2855J33887
8272C15270J9139j77507r61j81494J09021M7010p9647J43301l3494J14087k04566
8261G0159O5116O4663K00553M3759j1428k43156K80793K20945j41414j15164R4626
8250E29452n084k04408P9790j49178j44017L7064N2048j01165l57666k78972O1134
8239d81002K43989K28871m9075j3779M2794L25317Q2772K8257p4438q9645k1619
8228B22442L8252K94455J35683N3061r6782j51245j12407j11555L4791p4768J74146
8217D06073j7088K8253R0666p2178j72629J6287j33973j76787O0327J17943j3229
8206A33665J6985J15179k6519k31557J51387j19771J6631k46047K05111o3416
$$ y = [187984, 139510, 124959, 257252, 324267, 494178, 432189, -17905, 18889, 254238, 181383, 315270, 334409, 156902, 155941, -25553, 83468, 130478, 50831, 194132, 160638, 274725, 70159, 135275, 199938, 400491, 444250, 432822, 189666, 470459, 691404, 549990, 434826, 529452, 524368, 319960, 399750, 250572, 106555, 143619, 195667, 94502, -263164, -542136, -481002, -237013, -8142, -57217, -70996, -28202, 297115, 379887, 408144, 333706, 244061, 222442, 260694, 555149, 690832, 743893, 647111, 495866, 383459, 271904, 306695, 231927, 406073, 388985, 417238, 507904, 435726, 263097, 279384, 145411, -31376, 28951, 146894, 133665, 150650, 265829, 239310, 7753, 159140, 39369, 56000, -190047, 15064, -48352]
8196d8352J50552J87901k86777l37704p8870j01014m9867o1695J00313J55227
8186c70286j46419j0243L37225J08784P2530J08992n5482j9840J04187P7117r9983
8175A06582j47629L14026L4196j17759k91457J97416J86906j02673k83139k53642
8165c57173k07681m0626J20921K92662J30198k5627k17028N2529K62351o798r5854
8154i2126m169J63787L3775K74457M2683J30121j26806p2398L0099K97512j20729
8143E56206l13866J75108j16494p9249j84829k17997K59002J74880J17006p9917
8133B89850k97478j19432L66252L44428J18448k03549J65075L05787j35349l95540
8123D38492k42554j065j48039k2434n032J26401L17877k00951l37012k11623l83318
$$ y = [-48352, 102200, 290101, 3324, -334380, -413250, -514264, -564131, -625826, -525513, -370286, -516705, -526948, -189723, -80939, -8409, 100583, 45101, 25261, 129448, 206565, 106582, -41047, 272979, 307175, 189416, -102041, 95375, 282281, 179608, -103531, -357173, -564854, -605480, -484559, -191897, -61699, -87326, -304354, -251825, 10526, 3728, -92126, -96295, 67492, 101267, 375724, 418407, 548528, 421722, 349324, 379423, 676935, 556206, 242340, 417448, 300954, 221705, 36876, -181121, 77881, 252761, 369767, 289850, -7628, -127060, 239192, 583620, 702068, 498519, 663594, 969381, 834032, 438492, 195938, 194873, 46834, 24400, 19368, 145769, 463646, 262695, -74317, -285940, -669258]
8112f69258J07099M11459J29525r5443j32386O9761M8984M9637k41076j88386
8102e10084K7880J65492K71243k0919k1146K60865n1551p7597Q8930L10606m9781
8091C93938k13020j68868R3767p2412q638L07109k08132K4315K22421m20102k62198
8080c11820Q9751j17361K65215K34205L31310M58178L25603l33222l61541j99563
8070C80755l13352k91927k17409J85439L55000M8946j24386R0654R6173k05182
8060D711j52768P5593R8374Q1615j136L4335k56589M1153K44999O777L89j67043
8048A0410K27218O5957k50112m3771j21184K53951L955j22134j14344R9166q9555
8037h0443o3653J98860J55003j73955m9727J5817L67567J32362j69079j86987
$$ y = [-669258, -562159, -150700, -21175, -116618, -249004, -179243, -130259, -80622, -321698, -510084, -482204, -316712, -45469, -66388, -87534, 173331, 121780, 44183, 133113, 443719, 393938, 180918, 12050, 105817, 33405, 24767, 331876, 123744, 148059, 370480, -49622, -311820, -222069, -339430, -74215, 159990, 491300, 949478, 1275081, 941859, 580318, 380755, 67403, -224524, -441933, -256494, 98506, 147452, 23066, 113720, 209893, 4711, -148057, -72464, 25910, 107525, 106389, 140724, -115865, -74712, 170287, 177064, 177453, 10410, 237628, 303585, 53473, 9702, -111482, 142469, 146424, 24290, -90054, 9112, -80443, -144096, 54764, 209767, 35812, -13915, 1902, 369469, 501831, 332752, 145765]
8027A45765o7787j35359J11175j33282j60292J32381J03345M215m8191j41751
8017a89781J95239N38967J50251P039L0347l14213l1479l94301k88330p8976K06541
8006a68696J59589J7862J10451J6875J93576l5547l21649k5629J66896k9859j78004
7995i4135r9941K01390r1381J01870j3976R9678l6699k17942O0543O8366J67941
7984A45714J99857J76581N5112k90159q7884j36636j16945j1309o6660L9173q9873
7973a83029J64612J40408N5569J92404q7212L5605O7225l5269k60336l38254k82932
7962e31209L08952k9092J05861J78700K83528m2669l15240q3066p5615L19642
7952A19792J27856j73329K6354J1658p2545r8687j3578J14450k9846M472P6638
$$ y = [145765, 77978, -57381, 53794, -79488, -239780, -107399, -4054, 161, -48030, -189781, 5458, 544425, 694676, 701715, 732062, 417849, 386370, -7931, -296261, -375237, -168696, -9107, 8755, 119206, 136081, 329657, 294110, -27539, -53168, 113728, 83869, -94135, -194076, 7314, -84067, 17803, 3827, 103505, 66806, -151136, -90593, -22227, 145714, 345571, 522152, 577264, 287105, 199221, 62585, -54360, -65669, -132329, -93156, -183029, -18417, 121991, 177560, 369964, 282752, 318357, 385582, 350313, 89977, -248277, -531209, -222257, -251349, -145488, 33212, 316740, 274071, -41169, -124235, -199850, 119792, 247648, 74319, 100673, 112331, 39786, -58901, -72479, 41971, 12125, 16597, 93235]
7941I3235J79777L8286J9130n3047j67143K72806j63340l11786P6696J65683Q9029
7930B39326l6578Q2018n3620k6817M31396k10580j88277j01992j74037R2950q3745
7919b9956P4089n1344r6299N1911O024j30256j3581M8904J2020j50080p902j11721
7907c98191J02379M3820q4328j53843J85334J85206J05925k7369j89775r587J79014
7896f1415R098m1858O3333J7663J8581J85698j09k45836l368K92194K45601j26605
7884C52977l10444k8157j88139k65132J74229L57566J92027N193n4566K7160r8268
7873A64446k83890J22240p175j22290p0622N3060Q3255J93617M23338Q9837l37619
7862C08197k61977n2623J96363J87289N556n5628k23637j91122Q2846K16707L2010
$$ y = [93235, 273012, 311298, 330428, 277381, 110238, 383044, 219704, -92082, -15386, 150297, 239326, 202748, 284766, 231146, 204329, 635725, 425145, 236868, 134876, -39161, 53789, -29956, 44133, -7211, -103510, -51599, -45575, -175831, -189412, -140508, -128488, -278568, -286470, -398191, -295812, -251992, -336320, -490163, -304829, -119623, -13698, -41067, -230842, -240429, -61415, -52317, -94175, -30842, -13179, 5402, 191100, 190991, -54845, -58213, 233981, 479582, 352977, 42533, 14376, -173763, -438895, -264666, 92900, 284927, 290120, 235554, 262714, 164446, -119444, 2796, -4379, -126669, -197291, -144231, -60976, 132641, 555979, 645816, 308197, 46220, -6403, 189960, 377249, 382805, 327177, 103540, -87582, -4736, 211971, 243981]
7851B43981K19975o8505m42007M7846M9250J29486J78929j68917j57830j03788
7841g1580K18466j68713j25191P5279P8721j18141J71827M0272J50657K4164j65543
7830A10218j10845J6241J8234j4923L2818L56132j422k70694j62767N1573J88573
7819B13138m5o0031l06206j75745j39661R6189J11208J86123J73637R8867J12456
7808C09930k19936l22271j67874K28480K77026K5023J75342J79752o1768m6655
7798C77049j40061r0922m7513j79913J16066K7250K5754q3529j57195J7759o714
7787a41969j29455j0214J69073Q3989K04305J50089p0459M0092q440k74135j34383
7776a21507P9056N5700J67488j65230o2800k879j23315L07998K55780q6158k40165
$$ y = [243981, 463956, 395451, -46556, 1290, 50540, 180026, 358955, 190038, 32208, -71580, 146886, -21827, -147018, -71739, 6982, -111159, 60668, 100940, 251597, 275761, 110218, -627, 15614, 33848, 18925, 51743, 407875, 406453, 135759, -27008, 24565, 213138, 213093, 153062, -153144, -328889, -468550, -372361, -261153, -75030, 98607, 197474, 309930, 89994, -232277, -400151, -171671, 105355, 130378, 305720, 485472, 423704, 377049, 236988, 146066, 98553, -81360, 34706, 61956, 87710, 4181, -153014, -135255, -141969, -271424, -281638, -112565, -28576, 175729, 325818, 255359, 295451, 287011, 12876, -121507, -42451, 13249, 180737, 15507, -47293, -50172, -173487, 134511, 390291, 304133, 63968]
7765F3968K8253j68200L4852L972j63162j18006j39136J81822p1800J8799J92324
7754a36314n1565q8950P833p7321r5310l4905K21318J20235j69347m0023J91116
7743a53233q9512j54692K20894K86435q2080k09768j16714J57309n7467q4093
7733b82921J36987o4811j48158P6080j00072J4473j65587K16455K87509j34785
7723a64830k16995l55597L9134M06823K68835k9831k00198J45230J64391Q9578
7713A46540R1969r0319j14491K8133K0554p3140J5162L07659q6928p1496N4281
7702B27924J04434o6953j00886j09046J29866o0353p7449j38000Q3256J41958
7692A34751K26968l5186k48465l66928O5482J70194n2129N6556O7868j41203J02094
$$ y = [63968, 92221, -75979, -41127, -37155, -200317, -318323, -457459, -275637, -347437, -328638, -136314, -187879, -276829, -268996, -346317, -441627, -476532, -255214, -134979, -304326, -344349, -153233, -242745, -397437, -176543, 109892, 27812, -181956, -298670, -141361, -198828, -282921, -145934, -210745, -358903, -282823, -382895, -368422, -534009, -317554, -30045, -164830, -381825, -737422, -698288, -291465, -22630, -52461, -252659, -107429, 56962, 146540, 238509, 148190, 33699, 61832, 82386, 9246, 24408, 332067, 245139, 173643, 227924, 332358, 265405, 164519, 55473, 185339, 124986, 47537, -90463, -7207, 134751, 361719, 326533, 78068, -288860, -223378, -53184, -105313, -48757, 19111, -122092, -19998]
7681a9998j98671k14622K28347J40798o358J66889m7464k87249q161J68908L63294
7670B85713J78832m91906j16881j06224O1024j4055N9031n7814j22866K71081
7660e4065K07636j54765L7819l8215k11918K64520n974j44054R0260j41766k91733
7649d42255K62400J05411j40826R5435p1289k22047k64424J27416M65495J03614
7639A8930j29679m3188k63348O0680K92082J26553O7630n00521j24375O2344L280
7628d29612k5279J76775R2638J65897L50762O6638q1085k29555m6853J40636J36969
7617C17931J52222J76379k20879j89402k20317J64921k36927N3395j89624q0252
7607b72553K09896m051k00021J08968J50472p570P0945J15373j56675o5739Q6052
$$ y = [-19998, -218669, -433291, -204944, -64146, -70504, 96385, 48921, -238328, -246489, -77581, 285713, 464545, -27361, -144242, -250466, -189442, -203497, -144466, -202280, -325146, -54065, 153571, -1194, 36625, -1590, -213508, 51012, 45038, -99016, -8756, -150522, -442255, -179855, -74444, -215270, -119835, -191124, -413171, -677595, -550179, -84684, 18930, -110749, -153937, -417285, -356605, -64523, 62030, 129660, -370861, -495236, -432892, -429612, -454891, -278116, -185478, -19581, 331181, 397819, 316734, 87179, 40326, 180962, 317931, 470153, 646532, 425653, 236251, 15934, 180855, -56072, -2677, -192301, -272553, -62657, -66708, -266729, -157761, -7289, -14859, 56086, 171459, 14784, -50955, 35097]
7596C5097n0907l9971k02353p6479K43415N9148j56818k45635n8203J61312K62807
7585f8587M6398K2833J33673J38058r4624l78260j15834J18565K03359j65547
7575a59966j01690j70126m0482J88781L6020Q5554J44673L5630j19300J4145j20762
7564b07523n3565J73874j55030J03568j2107J45769J00016m0724j69209l3253
7554a48184J76411j74400m5069J28788R5442J82745j06279p6924l08689N4538
7544b21621K02275K85513J33863R8485J61002O9026k98108k68069k9967j09072
7534B3327L0252n7145j55089J30828K98391J2565j42891J34470J09147r0281k24322
7523F9252K1198k10015J08264J59506P2766P443K3968J40374K13048p51M0030
$$ y = [35097, -15810, -55781, -258134, -334613, -91198, -32050, -188868, -434503, -492706, -331394, -68587, -22189, 644, 134317, 272375, 177751, -200509, -316343, -197778, 5581, -159966, -261656, -431782, -472264, -283483, -247463, -161909, -17236, 18394, -100906, -86761, -207523, -261088, -87214, -242244, -138676, -150783, -5014, 95002, 54278, -114931, -148184, 28227, -146173, -191242, -62454, 32988, 215733, 109454, 32530, -276159, -221621, -19346, 266167, 400030, 498515, 659517, 728543, 430435, 162366, 132399, 23327, 53579, -3566, -158655, -27827, 270564, 283129, 140238, 274708, 383855, 293574, 69252, 90450, -119565, -11301, 148205, 220971, 228414, 252382, 392756, 605804, 605053, 645083]
7512F45083k08543k51408L61263L12939j94017m14533L1642j18402j0424j54665
7502a065J9323J08972K42046l70891n8314m0205J5784J70070j01807m1822R9491
7491D1582j51178j76372n0592J10193p4768p8827K26784J69260j74120J74521
7481A6483j01607k03820m8681Q9491O6959M7544N5868k2625m1847J2431M13107
7470B83303j9571l67553k23432k6346J70085J55305o4977r2290J78922j8465j70285
7459a95304J32399r5339K35509j62723J04303J01593j93928l23221M4630K3523
7449c28558j21156J17437Q4966m444J15545m7835J11021K93977K05823M0553m58452
7438H877l98725N1761n8516j45040K11907K50698k4698O7978J58604p4942r6572
$$ y = [645083, 436540, 185132, 546395, 859334, 665317, 250784, 282426, 164024, 153600, -1065, 18258, 127230, 369276, -1615, -59929, -100134, -84350, 85720, -16087, -57909, 41582, -109596, -285968, -336560, -226367, -301135, -379962, -153178, 16082, -158038, 16483, -85124, -288944, -337625, -248134, -181175, -133631, -77763, -100388, -142235, -129804, 283303, 263732, -103821, -327253, -353599, -183514, -28209, -93186, -185476, -6554, -25019, -195304, -62905, -158244, 77265, -85458, 18845, 120438, -73490, -396711, -352081, -328558, -449714, -332277, -247311, -251755, -136210, -184045, -73024, 220953, 426776, 467329, 8877, -389848, -338087, -396603, -541643, -329736, -79038, -103736, -35758, 122846, 47904, -48668]
7427d8668l12257j59850M35534J46644m4442k56047R7967J16819j68059L7894
7417a54465J23194J523o3774N6680j14458J32363K51196j12906L4007p5053k9083
7406D9224K2763p3431P5616J7069j30808J11021r3036j25286N2698Q247K30770
7395A44847j33542M9059J21464K29680J50604l15734r9619K1359J43843M6271
7385C58232k26493M279M9715q4201P7957j6005J92942k41598k07537k37379j66203
7374d96291K3679J09146J6283P1739J91656r0646j10379j18472K36214J98395
7364C1324J71647j13186j98859J70465J05076m2213k6286o7084j41068J19323
7354I139o7054J68591K96664n3725j49205r8690j28433l6722k73030k71174L78952
$$ y = [-48668, -360925, -520775, -85241, 61403, 16961, -239086, -141119, -24300, -192359, -154465, -31271, -29748, -93522, -36842, -151300, -18937, 232259, 119353, 153360, 78307, 49224, 71987, -1444, 74172, 91241, -39567, 71454, -21582, -146868, -94170, -85923, 144847, 11305, 60364, 181828, 411508, 562112, 246378, 146759, 168118, 311961, 358232, 131739, 136018, 185733, 101532, 179489, 163484, 356426, 114828, -92709, -330088, -496291, -472612, -363466, -347183, -275444, -83788, -174434, -284813, -403285, -167071, 31324, 202971, 89785, -109074, 61391, 166467, 124254, 97968, 30884, -110184, 9139, -57915, 110676, 407340, 353615, 204410, 105720, -22713, -59435, -332465, -603639, -224687]
7343b24687L47334j77130J82211J32613k43271j83046J77067Q2807j98958k61052
7333c66112P1707L72628J53805J46193J04447l29070l33490l712L03954k19038
7323i8688j54183o2837K19277J12190J38696p8485L1017j8926k22920k18262N117
7312c48004J46004K25649o7872N7699o8973k42718j00210J64488K0252l49431
7302e63116K1563j30950j51827k1720L67805K28792J26219L19400J28544o5801
7292B58909K1836J21386r6118p528m2635N5806l83410J46367R2311O1730J83141
7281D11795J87019l19k75176l81526k49671O5521L9526j8286O9968J40842j82896
7270a93203l2971M4646j24872j63459K88037J00342j24122n8865J39374K63115
$$ y = [-224687, 122647, -54483, 127728, 260341, 17070, -165976, 11091, 93898, -105060, -366112, -294405, 78223, 232028, 378221, 482668, 153598, -179892, -183604, 120350, -98688, -252871, -315708, -96431, 15759, 154455, 75970, 106987, 88061, -134859, -353121, -348004, -202000, 23649, -44223, 13476, -55497, -298215, -398425, -233937, -213685, -563116, -541553, -672503, -824330, -846050, -478245, -249453, -123234, 196166, 324710, 258909, 280745, 402131, 306013, 298485, 255850, 311656, -71754, 74613, 166924, 228654, 411795, 598814, 598495, 323319, -58207, -307878, -242357, -202831, -221117, -151149, -10307, -193203, -226174, -181528, -306400, -469859, -181822, -81480, -205602, -264467, -125093, 138022]
7260A38022j8101j78502J50633N1262j82450k61803j29378Q0046K11947Q8019
7250e0305L6334L2846Q7620M7749k4736M7186K784L39515K8402k85166j04945
7239A57284m7839j38711K62824K16611N5076j72366O5910k40906k63741r4342
7229b00200R8408K3048l52646k5900p1024J08749J07261K91257J65726l03531
7219a58852R7337P3182j76466o8729J27676j27834L6226j59498p8107J22737n0731
7208c63059N326J44222J95141L18184j3103l36361k38589J56645R8039R2847M06473
7197D65765r7540J02756j04732q8507j27372k77675k29434q4576J44155J73191
7187a23969J19451L19807J43342k55698j25053j86289j52073J55956k0034j77897
$$ y = [138022, 119921, -58581, 92052, 143314, -39136, -300939, -430317, -350271, -138324, -50305, -13971, 18875, 106495, 154244, 129508, 176694, 179478, 518993, 547395, 262229, 157284, 109445, -29266, 233558, 450169, 505245, 332879, 398789, 157883, -105858, -200200, -101792, -78744, -431390, -457290, -528314, -419565, -312304, -21047, 144679, -158852, -61515, 11667, -164799, -233528, -105852, -233686, -197460, -356958, -435065, -312328, -363059, -357733, -213511, -18370, 299814, 286711, -49650, -288239, -131594, -33555, 59292, 465765, 368225, 470981, 366249, 277742, 150370, -127305, -356739, -441315, -297160, -123969, -4518, 315289, 458631, 202933, 77880, -108409, -260482, -104526, -124560, -302457]
7177c02457O9059k0155j04071L05044J74003J34756j5038J07314j7804J10584
7167D41235J70700L0893j86124j94892p1806l0956q0166j29679k89952K86401
7157e4346M89783q1172M6233R8073j96062m35986J05933L90432j07320j47568
7147A08000k63351j14647J93839n6297K66764O128O082l29435J7506J38664K60301
7136B33554j03064j46079R9645j03257J08172n0332j27502R3565j6900q723K90232
7125B69311J6651l31126P6955J55350n4552m0014J43740l12717N9460J37891o7207
7114E3742l43613O3384L78727n3563j9974J26377j51522n7245K95919J15876l63702
7103D4406j65762n1902q7253k19912j8098J14930J60962N6335J65416J63728l959
$$ y = [-302457, -233398, -253553, -357624, -52580, 121423, 256179, 241141, 348455, 330651, 441235, 611935, 642828, 456704, 261812, 190006, 159050, 78884, -50795, -340747, -54346, 435437, 354265, 400498, 498571, 302509, -133477, -27544, 362888, 255568, 108000, -155351, -269998, -76159, -132456, 134308, 140436, 146518, -182917, -165411, -26747, 233554, 130490, -15589, 84056, -19201, 88971, 38639, -88863, 4702, -12198, -20921, 269311, 285962, -45164, 31791, 187141, 132589, 92575, 236315, -76402, -16942, 120949, 53742, -289871, -226487, 152240, 98677, 78703, 205080, 53558, -3687, 292232, 408108, 44406, -121356, -173258, -260511, -480423, -498521, -383591, -222629, -166294, -878, 162850, 158891]
7092A58891j77348J00510K13274L21877j18915k84628k00200j06871j02656O1970
7082a34096J15469J24418J2774M342k01504j29450K32224n1819j01234r9251j5725
7071b43852L4771J54015K1777J62116J87815O6252j85620j60480K9199Q5183J9517
7060A70693j77208j47080n5664J14580J5059M4883j06928j62142j14119J77486
7050b40440K91441J47860k58591r1496J56928J27202n6311j82521m7701P1740
7040h1889K53370o8994k57838j4757L9548K55561L14910j23341m43421N7864J29283
7029F0296M562k95765K20264K06875p0125P6523k47390q3195j0316J74881J5360
7018E1970R7838O4875M4130j6782m2636J40621j80960k60785o8659N6961J41145
$$ y = [158891, -18457, 82053, 295327, 617204, 498289, 213661, 13461, -93410, -196066, -134096, -18627, 105791, 118565, 122907, -78597, -208047, 24177, -27642, -128876, -228127, -243852, -209081, -55066, -33289, 128827, 316642, 382894, 197274, 36794, 65993, 151176, 170693, -6515, -153595, -209259, -94679, -79620, -34737, -141665, -303807, -417926, -240440, 51001, 198861, -59730, -151226, 5702, 132904, 76593, -105928, -153629, -81889, 171481, 102487, -155351, -170108, -130560, 125001, 439911, 316570, -126851, -68987, 60296, 64858, -230907, -10643, 196232, 126107, 202630, -44760, -127955, -138271, 36610, 51970, 149808, 214683, 258813, 242031, 199395, 340016, 159056, -101729, -170388, -113427, 27718]
7007B7718r1511O2565p0638k87576n1783J01974K54748L2323P0787R2245J19752
6996B60604j04531j60845K4955j05899j06099O9664L02888K7183O644j05099l40603
6985b31138K2211k2925J46727R6467L1199J67179l1433J01064J71468m60549j33777
6974a43507j5796J72411J70995J01589j05549j14775n0353J48597k72921l43687
6964d52996o2878K70514M0909R8737L8972l77297l2984l905J04233J17237J78625
6953h0833l2355K39317O1975l11577j12030J68526O0846q8755k53106K45371J22095
6942A9474K09804K67840k00639j26125Q7866J08227K7273q8062J99034j29520
6932C75172j33821p022J12028q3615j11600J0341j51996l58J03293J9312o3160
$$ y = [27718, -63793, -1228, -71866, -359442, -411225, -309251, -54503, -22180, 48607, 140852, 260604, 156073, -4772, 20183, -85716, -191815, -122151, 180737, 207920, 214564, 109465, -231138, -208927, -231852, -85125, 11342, 42541, 209720, 178287, 279351, 450819, -9730, -143507, -159303, 13108, 184103, 285692, 180143, 65368, 15015, 163612, -109309, -452996, -515874, -245360, -204451, -105714, -66742, -444039, -477023, -480928, -376695, -259458, -80833, -113188, 126129, 188104, -123473, -235503, -66977, -6131, -94886, -347992, -102621, 19474, 229278, 497118, 296479, 170354, 258220, 366447, 393720, 305658, 504692, 375172, 241351, 234329, 346357, 262742, 151142, 161483, 9487, 9129, 112422, 131734, 68574]
6921F8574j13111k39629N5155L58498K123k06940q9497K49070j9951k76237M9795
6910a62150K24330k03431j84346J01955M79437K22569J50704o9673j85044l89275
6900a4924Q1942J20668p6530n4924j90278j05064O4658K30677J33552O8886r8677
6889A59986j46520O5055r2208k61164j635J45517J76265m5672J4645K80309j00580
6878A93998k09007p4992l2816P3434j4049K07424k34226k01030J4771J14664J26704
6867c5125Q4800J79679P9774j33130M451j16393j40464m7353J70472n1696J12822
6856A07837L2665m1181K9909K8991P7814j28378l04873Q8696m4695n9715P7905
6845a35025K0964o1867j205L40437M8447o4263r4232L8529J8124J74899n9167
$$ y = [68574, -44537, -284166, -229011, 129487, 131610, -75330, -164827, 84243, 64292, -211945, -162150, 62180, -141251, -325597, -223642, 255795, 478364, 629068, 559395, 374351, -14924, 67018, 187686, 111156, 56232, -134046, -239110, -174452, 56225, 189777, 258663, 159986, 13466, 78521, -13687, -274851, -276486, -130969, 45296, -376, 14269, 294578, 193998, -15009, -90001, -122817, -49383, -63432, 143992, -90234, -291264, -276493, -161829, -35125, 49675, 229354, 309128, 175998, 180449, 64056, -76408, -123761, 46711, -4985, 107837, 140502, 99321, 129230, 158221, 236035, 107657, -197216, -108520, -153215, -212930, -135025, -114061, -175928, -177133, 163304, 211751, 147488, 53256, 91785, 109909, 284808, 225641]
6834B25641j46417r1711r9053L3964J06954k77532K1783K32017L36311q5155J09475
6823C66277l8357l71564j13318Q7564L7405R1019k20986j23590L6411K56996J49324
6812A57181J20284N5059n04948J46662J36757K32448p3920p6379K23679L07908
6802G24731J97340n01368m18835j50490J9114r1496j65374J54024L69449N4335
6792A91430M2550R811j0094M7460K4342j01328k13099k48519K68087J22222n8998
6781G3864l093r6091O8343m0020p519K5249J50423P9897l42763l39548p6403n5334
6769e62995K8144K13548N9594J34663K48494J20792p9595l01052K8431m1894l31453
6758d83323Q6877k5315k0407o607K54839j10824n7460J93283K18744P3662j07934
$$ y = [225641, 79224, -12487, -111540, -77576, 29378, -248154, -226371, 5646, 341957, 256802, 366277, 327920, -43644, -156962, -69398, -31993, 59026, -161960, -285550, -249139, 7857, 157181, 277465, 332524, -172424, -25762, 110995, 343443, 269523, 193144, 416823, 724731, 922071, 420703, 1868, -148622, -129508, -221004, -386378, -232354, 137095, 191430, 233980, 243791, 233697, 281157, 305499, 204171, -8928, -257447, 10640, 132862, 73864, 70771, -25320, 43023, 3003, -4516, 20733, 171156, 251053, -91710, -431258, -507661, -562995, -534851, -321303, -261709, -127046, 121448, 242240, 162645, -138407, -109976, -151870, -483323, -396446, -421761, -442168, -448775, -193936, -304760, -362220, -168937, 49807, 123469, 15535]
6747A5535j81053k15023L4367j08177J70619L28701r591K70330J9313o2155K0958
6736B83824k93548j99320N2887J19290O8734k1077M4608k2538n5183K83477K48259
6725E09413R3615L9821j39410m10856j4893K23335K6566k42522J78905J74316
6715D38290k13655k91451j43127K31406l5740m3467J783J40182j43390o7962J84560
6704E7429L32883J52760m0180j93140j64911P6107J82164k36839k47127r9502
6694a80356n5494J56078J33522q5919r045q0258P8738Q0785J7287O8266l33885
6683b10281j30356J2561m9675J00835J61798M8044j23516j55231K61341J07300
6673B2820L09155L3640L4324j31979j44215j22464j95597j83884P188j2294L0638
$$ y = [15535, -165518, -380541, -346174, -454351, -283732, 44969, 35378, 305708, 325021, 262866, 283824, -9724, -209044, -156157, -36867, 31867, 10790, 55398, 32860, -22323, 261154, 509413, 603028, 642849, 503439, 92583, 77690, 301025, 327591, 85069, 263974, 438290, 224635, -66816, -209943, 21463, -14277, -57744, -55961, 84221, -59169, -127131, 57429, 390312, 543072, 502892, 309752, 144841, 220948, 403112, 166273, -80854, -180356, -235850, -79772, 53750, -32169, -41214, -121472, -42734, 38051, 55338, 123604, -210281, -340637, -328076, -377751, -276916, -115118, -67074, -190590, -345821, -84480, 22820, 331975, 365615, 399939, 267960, 123745, 1281, -194316, -378200, -371012, -383306, -352668]
6662c52668J37564M46563K56396Q8885r1447k71637l27151k31851m5458l3398
6652d24202L57827J54060J04636J5918j42542J44040K6507k76091J11503L3063
6642A04719j65764j06568J48570J72819l6317l05752j97779K62358L10116L5490
6632B21892k43874j88115o2917J57232J01879J71208k9569j5222L2749J22481
6622B67744J23372M06J63650N3729k09867j36531j46888p7123j45184K931k74541
6611c78302k7495L09089J05925J02594q079q6845j16643k26266Q6757l2816J32578
6600a39503K93236p4640N8917M4593j26080l374n6521K94923J28293l7400l63992
6589A8452o20309n7979M03422L49295J03361k28972L22947k6226k1182j17460
$$ y = [-352668, -215104, 231459, 487855, 576740, 485293, 213656, -113495, -345346, -390804, -424202, -66375, 87685, 192321, 208239, 65697, 209737, 236244, -39847, 71656, 104719, -61045, -167613, -19043, 153776, 117459, -188293, -386072, -123714, 186402, 221892, -21982, -210097, -273014, -115782, -13903, 157305, 127736, 112514, 145263, 267744, 391116, 391522, 555172, 608901, 399034, 262503, 115615, 38492, -106692, -103761, -378302, -405797, -96708, 9217, 111811, 103732, 16887, -99756, -326022, -239265, -272081, -139503, 153733, 79093, 138010, 182603, 56523, 53149, -3372, 291551, 419844, 382444, 18452, -601857, -659836, -256414, 92881, 196242, -32730, 290217, 263991, 242809, 125349]
6579A25349q6549k79523j44380J99206m0017m8192n5413J40433L50500r0294j8727
6568E2393K77343q2189j53026l06861r2927K60409L17189K33673J45724M9774
6558G01502l59820m70050J37455J56630j20621k55970k06855j63018J99396J71747
6548b09604k5994J98948M98205l5014j94107j8251K6242R6569M9985m7490m50558
6537a11069l43772J85515Q5284K00275L4223p6337J44106K17645J62183M230j7021
6526D85262J27183o8765q3701j02143o1221J04765K096K52335l07872J3035L65216
6515G26190j88857j66677j24621l38248J27365J31141l3096N8397j14545k60926
6505a83877J82957K77913K12830J80256m37294m09827p1018l3106M74615L0970
$$ y = [125349, 38800, -240723, -385103, -185897, -225914, -274106, -329519, -189086, 161414, 71120, 52393, 329736, 247547, 94521, -212340, -305267, -44858, 272331, 506004, 651728, 701502, 341682, -128368, 9087, 165717, 45096, -210874, -417729, -580747, -381351, -209604, -235598, -36650, 461555, 426541, 232434, 214183, 240425, 336994, 386979, 339489, -111069, -454841, -269326, -184042, 16233, 50456, -25881, 118225, 335870, 498053, 502283, 485262, 612445, 543680, 459979, 357836, 296615, 401380, 403476, 655811, 347939, 360974, 726190, 537333, 370656, 246035, -92213, 35152, 166293, 133197, 191594, 77049, -183877, -920, 276993, 489823, 670079, 232785, -177042, -248060, -281166, 193449, 224419]
6495B24419J40526r1004r0653k50460P2496J39872J71140j5474L2704J59072l21655
6484A70983k25771j22724o0484K14520J06094r4122J85823q8128P3713J33827
6474B93731k89573k34151R4112r3930k4905j22499L17991M17916J11469l3371
6464D36790n2351j6486j01660j39405q9893K16152j34522j00512j45481J15981
6454a1387J03896j11423j07465J51927l0042m6350J37779J17466r2822k91416
6444a79837l0013K42522J75621k86248l70754q52K40343J03050L990p0710q2925
6433b55813J26338J54751m3011n286J64673k9629k41833L4222R9222l19570l02810
6422f18746M11233M39034K30327k37932l05285N2350L03426o769k59377l83786
$$ y = [224419, 364945, 273941, 183288, -67172, 5324, 145196, 316336, 300862, 333566, 492638, 170983, -54788, -177512, -237996, -23476, 82618, -11504, 174319, 86191, 159904, 293731, 4158, -229993, -135881, -229811, -254716, -377215, -59224, 358692, 470161, 436790, 384439, 367953, 266293, 126888, 36995, 253147, 118625, 18113, -127368, -11387, 92509, -18914, -126379, 25548, -4494, -50844, 86935, 204401, 111579, -179837, -209850, 32672, 208293, -77955, -448709, -449561, -209218, -106168, -102178, -172888, -255813, -129475, 25276, -17735, -23021, 141652, 112023, -129810, -95588, 3634, -315936, -618746, -207513, 231521, 461848, 223916, -81369, -29019, 274407, 267638, 8261, -375525]
6412c75525k83220L32862M78265J16269j83728J9781J8094k27267j81125k43778
6402e29372j11713K18342j06066K07333L22424p4442j62448J95426K6045J54557
6392A40086q7113j36025K30097j12053m9802p6116K2749j87098k20192l0622J28743
6381c77346J46067L5075l4642L0596J33565j18508q0902N8751Q726J87054K51279
6370B39715k21048m5179J21285K86078J40643L5205j24467j38053j73120K2213
6360A43272j24938j31551L35763K35618k8343l36896K6037J83076J61359q6845
6350C76552j88518P3200K07195j770k46625j94091o0015R2834j55909J6239n4917
6339a35825L7771J6343J9824j40339n14J73871J38595l24847q8269J28080K3481
$$ y = [-375525, -658745, -325883, 152382, 268651, 84923, 104704, 122798, -104469, -285594, -529372, -641085, -422743, -528809, -321476, 948, -73494, -235942, -40516, -14471, 140086, 52973, -83052, 147045, 34992, -14810, -90926, -68177, -255275, -475467, -506089, -377346, -231279, -196204, -230846, -200250, -66685, -185193, -266095, -207344, -198618, -11564, 239715, 18667, -26512, 94773, 380851, 521494, 556699, 432232, 294179, 121059, 143272, 18334, -113217, 222546, 458164, 429821, 92925, 118962, 302038, 463397, 376552, 188034, 261234, 468429, 466659, 220034, 25943, -34072, 58762, -97147, -80908, -135825, -98054, -81711, -61887, -202226, -202740, -28869, 109726, -215121, -303390, -175310, -151829]
6328a51829K18839J14790M478J03810n4637M83931n0137k63263O3227k10532k42454
6317A6223P97O7065k12153k58137K92036J95055j03107J05394o1902q3361j0821
6306e2911j9458k47512j2268p5583K85002J31872k52108M2784J89347K79030k268
6295B65927q6346j46839o3963R3533l172O1186m16893j23338L04573J18964n1833
6284d8201P5575N0597j49864L2435K30284q4809j34292k46855P9944J86728o0087
6273f8545J49510j02074k26754m6653o861J24237k1385N3088l715k02402p8926
6262d30480O5289N7443M36406M7638o3298j27375k15553J45881K36907L34901
6252D87759j80209k40179k79845j48436k4373j707P5242L64345K1524j09380J7907
$$ y = [-151829, 67010, 181800, 186278, 290088, 235451, 719382, 669245, 405982, 469209, 258677, 16223, 17020, 84085, -128068, -386205, -94169, 100886, -2221, 103173, 41271, -42090, -52911, -72369, -319881, -332149, -407732, -122730, 9142, -242966, -200182, -10835, 268195, 265927, 179581, 32742, -31221, 62312, 59140, 120326, -296567, -419905, -115332, 3632, -48201, 27374, 77971, -71893, -39458, 190826, 106017, -28275, -275130, -195186, -8458, -68545, 80965, -21109, -247863, -294516, -301377, -177140, -198525, -145437, -149152, -351554, -430480, -365191, -307748, 128658, 176296, 112998, -14377, -229930, -84049, 152858, 487759, 307550, 67371, -212474, -360910, -385283, -386990, -311748, 52597, 74121, -35259, -17352]
6241a7352k7944j5330L994o6375M17577M6808o6431J38124k35708j61004l76705
6230c60346k36476K45973J52092O6558K39873n9397O974K39942r6861j74622J91527
6219B15237k02178k23993m4736K3838K32785n8449j90704j81517J639J44700L2519
6208b50859q4942k09478j49352K75015L06388J27354p03o3475L6837k10840m3366
6197b67421J25056K76396J94933Q2399k70235n62304j7645M20170K63527j43488
6187A01388k3919j05751q7565J46918J46921j63075J60775l1931q1403m3595j6041
6176B722k91350O891K27221L36874M4868M5958k9889L9382p3545n5473k45531
6165H128j34285p4807J21889l1925k09392m9776q7484L69619L10368K81813p2716
$$ y = [-17352, -45296, -60626, -56632, -123007, 294570, 341378, 274947, 413071, 177363, 16359, -360346, -596822, -350849, -198757, -132199, 107674, 48277, 55251, 295193, 198332, 23710, 215237, 13059, -210934, -255670, -231832, 953, -57496, -248200, -429717, -428078, -283378, -250859, -335801, -545279, -694631, -419616, -113228, 14126, 13423, -50052, -13215, -224055, -267421, -142365, 134031, 328964, 411363, 141128, -421176, -438821, -18651, 244876, 101388, 77469, -28282, -115847, 31071, 177992, 14917, 175692, 143761, 62358, 18763, 2722, -288628, -281737, -54516, 282358, 327226, 373184, 343295, 382677, 309132, 253659, 8128, -126157, -200964, -79075, -111000, -320392, -370168, -457652, -88033, 222335, 504148, 431432]
6154D31432l16642J75983j1615k9675L89893j85848m97524m33999J1814J39590
6144c26591L3279N14468j15059p6802L47959n2826l64003j51305N1910l9869j89512
6133c68351k07419J18750J22916J77024l9993J27336l3733p8312Q4510N4819P5965
6122C3512J81999P9968J03166l6377j49996n11932J43569L37959J94806j19810
6112B56864j20886j73652j15720Q0067K00662J67854k30178q9968M6443o2850
6102d1364n4738J45636N9578J8310j1281R9162N2635J22325L1402k456k25484
6091A93725n25428p0669R7827J13715K89484L76062j5521J0043J79673j3649k37317
6080C97945p0002j57223J88768k01949k07160p9389k37550Q3997L35859j54221
$$ y = [431432, 114790, 290773, 279158, 249483, 639376, 453528, -43996, -477995, -466181, -326591, -293312, 221156, 106097, 29295, 377254, 324428, -39575, -190880, -138970, -178839, -368351, -575770, -457020, -334104, -157080, -197073, -69737, -103470, -181782, -97272, -42453, 33512, 215511, 295479, 398645, 362268, 212272, -299660, -156091, 181868, 376674, 256864, 135978, -37674, -153394, -73327, 127335, 295189, 65011, -24957, 21486, -41364, -96102, 49534, 109112, 127422, 116141, 215303, 267938, 390263, 421665, 419209, 193725, -331703, -402372, -304545, -190830, 98654, 474716, 459195, 469238, 648911, 635262, 397945, 327943, 170720, 359488, 157539, -49621, -129010, -366560, -282563, 53296, -100925]
6070a00925l40001k5946K94124K13880l7803k40675J95292K67454j28790J63411
6060B60021L8392j15163j22922p0469J58896K6608k54341L53032P4486l30185
6050A8355Q3682q006k22183Q199j28307K26720L08983n9346j1658q9391m97798
6039c70750O4207L02755J35617n2142J63376Q7727k06066j24480K98020P4960
6029C73224j43062j62798J57438k9978k50032j00562j2065L4211J23936R0410
6019H0722K34091L8908k65925M4044o7522k703O1567k39630P0368K07235R2888
6008B54043m147l51426K1725o9422k87082k083J62448R4906j03827M37J81753
5997a02675K47831O7856j17739J23504K00800P8242r3497j05814K35812L1875
$$ y = [-100925, -440926, -466872, -172748, 41132, 3329, -237346, -42054, 225400, 96610, 260021, 298413, 183250, 60328, -10141, 148755, 175363, -78978, 274054, 348540, 18355, 102037, 94031, -128152, -119953, -248260, -21540, 287443, 228097, 216439, 127048, -370750, -306543, -3788, 131829, 79687, 243063, 330790, 124724, 244, 298264, 373224, 230162, 67364, 224802, 194824, -55208, -155770, -167835, -133624, -9688, 80722, 314813, 353721, 87796, 131840, 64318, 61615, 123182, -116448, -46080, 161155, 254043, 249896, -101530, -79805, -149227, -436309, -438392, -275944, -181038, -284865, -284428, -102675, 145156, 213012, 95273, 218777, 419577, 497819, 404322, 298508, 534320, 566195]
5987E66195k06972l49602J03364L5856q9296k33247j58036j50223P6752K12493
5977a92716K08396n9267p9476j1397Q0119K52598J70870j87413P6793n6933J25408
5966C26982l52749k7587Q0154j19592l2490K98745J99463l26695j82407L5651
5956a00525j44458r1984o3820K98334K06285K76654J87852k80837k59182j81960
5946a53641j72080L6073J13476M00344j04365n3635m598Q2723J8740p5506l40263
5935b52732k3977j22236j8862L15844M9509K76743N1363k23558m6046J3862J93196
5924B13106k66156j20496K7081J2705J66314M3314J33615N196q6900Q1561m0880
5913A68460n15679j68340k8955L85080M11400O6615L6308j48589r4077k98639
$$ y = [566195, 359223, 9621, 112985, 148841, 59545, -173702, -331738, -481961, -405209, -192716, 15680, -43587, -123063, -134460, -54341, 198257, 369127, 181714, 258507, 201574, 326982, -25767, -53354, 26800, -92792, -125282, 173463, 372926, 46231, -136176, -100525, -244983, -336967, -400787, -102453, 103832, 380486, 568338, 287501, 28319, -153641, -325721, -289648, -176172, 224172, 119807, 66172, 61574, 144297, 163037, 87531, -252732, -276709, -398945, -417807, -101963, -52454, 224289, 275652, 52094, 6048, 19910, 213106, -53050, -173546, -146465, -133760, 32554, 75868, 209483, 214679, 127779, 209340, 168460, -347219, -515559, -544514, -159434, 251966, 318581, 354889, 206300, 112223, -186416]
5903a86416j41957Q3858J68691n4655r7342J60851J73303q0687j36445l4244l1126
5892a76169J62630O1666K16041R1900O0993l16453m86106j74773j02614O5502
5882e97383J78436m5692K3040K47921J44071J02603j36243j4861r8052Q4793K93554
5871A82187m981k89684J51646P2183K28900K48633j67801k99563p1614K32050
5861B81956j12300k78909p6069M8986K17013K47383k19012m32713k83950Q6517
5851e21098K42904P6453p7774m6029m2098L79507J62596m6381q4292j90986Q904
5840a38294O7095L83884J45662j78320k92218l5753M736J04065J33407p1248j21430
5829A586J11196N3398l4899j10983q4713J10008J86472j48804j87953k12750K38324
$$ y = [-186416, -328373, -244515, -75824, -130479, -227821, -66970, 106333, 25646, -110799, -145043, -176169, -13539, 48127, 264168, 356068, 417061, 100608, -385498, -560271, -662885, -597383, -418947, -464639, -441599, -193678, -49607, 52996, -83247, -98108, -196160, -111367, 182187, 177206, -112478, 39168, 111351, 340251, 588884, 421083, 121520, 49906, 281956, 169656, -109253, -185322, -136336, 80677, 328060, 109048, -323665, -607615, -521098, -278194, -201741, -279515, -325544, -367642, 11865, 174461, 128080, 43788, -147198, -138294, -71199, 312685, 458347, 280027, -12191, -47944, -43208, 60857, 194264, 123016, 1586, 112782, 166180, 131281, 20298, -64415, 45593, 232065, 83261, -104692, -317442, -79118]
5818g9118K59549N8564R4128j344j07907j43026k50436j47380K20727J86479j32903
5807d2667l7997O3834o2745l94181O2644K86725L27544j57942j10450P6865K03693
5796B15323j11288j97520J50439j10941Q2432k58008p81J70507J06354K8494k82669
5785b07658J07861j7457P7935R5077O5860o9685N1164K4368n1580k23616l3183
5774a80914J98060K63395r3111j43638L36442J70661n2869k84165k15282k18735
5764b20156r5527J27127k0998J00086o9535O2733r3045o8916Q0564K88195J59864
5753B50392O4597j07281q3517m7741j2238j63586J49971P1964k10003k61460M2800
5742c06102J30469K5717J8645j23886J26632j13515j7009Q1744J03808M0708K43136
$$ y = [-79118, 180431, 238995, 333123, 331779, 223872, 80846, -169590, -316970, -96243, 90236, -42667, -80664, -16830, -79575, -473756, -411112, -124387, 203157, 45215, -65235, 11630, 215323, 104035, -93485, 56954, -53987, 28445, -229563, -230344, -59837, 46517, 75011, -207658, -99797, -117254, -39319, 55758, 121618, 51933, 103097, 127465, 75885, -147731, -180914, 17146, 280541, 187430, 43792, 380234, 550895, 498026, 213861, -1421, -220156, -315683, -188556, -209554, -109468, -179003, -116270, -209315, -278231, -197667, 90528, 250392, 314989, 207708, 124191, 76450, 64212, -99374, 50597, 122561, -87442, -348902, -306102, -175633, -149916, -131271, -255157, -128525, -242040, -259049, -177305, -73497, -32789, 210347]
5731B10347J16263j05888l51910J6683J32099Q879L27807K44958j29566j90492
5721B79180k29966n8037J22826j8205k1172J63885R7937q8549j27152j41667L11460
5710B90540j49837K1653J49246n9065J44584J68649k39427j34686P0710j20714
5700A41653Q4911j45936J1329O4628J05j05251J13421j80564j10073k2582J37290
5689a1069j04016r4151J25527p9044J79486k30945k05604O1612l1498K36306K17456
5678F4060j76394l9898K49301n498j09736N6685M0657J11460J05395j3803k1951
5667B60278L19709L4774j25465k00695r3773P8110J07143r7258j16348m777J49523
5656C11221j40396j11205o9245l10804j48334P4031M3231j0988M729L31077J26858
$$ y = [210347, 326610, 220722, -131188, -114505, 17594, 26473, 354280, 599238, 469672, 279180, 49214, -8823, 114003, 95798, 74626, 238511, 336448, 247899, 120747, -20920, 290540, 140703, 162356, 311602, 252537, 397121, 565770, 326343, 191657, 262367, 141653, 226564, 80628, 91957, 156585, 156690, 51439, 164860, -15704, -125777, -148359, -11069, -115085, -209236, -83709, -162753, 16733, -214212, -419816, -358204, -389702, -153396, 64060, -112334, -152232, 97069, 91571, -18165, 38520, 79177, 190637, 296032, 282229, 260278, 579987, 614761, 489296, 288601, 194828, 272938, 380081, 282823, 166475, 161698, 311221, 170825, 59620, -9625, -320429, -468763, -394732, -351501, -362489, -357760, -26683, 100175]
5645A00175N25j02538k08331j83217n2280J19015K5566j69697o1414J70962J3536
5634c47698J24531q5767R0692P2002P6073j9345l8380j04434n4322J60118j22762
5623b49292j06825L25224j83647m8734R9366n8545k14245J51670K73306O4956
5613E3234Q5779P0223p4409m0003r2871n119k9095K4145L02658k0406n3609R2805
5601C13332J98499O8176m32587l61533n1081q1128L8817O931p4862q3671q9284
5590e48391J58005L1906J75861j6383J98931k2808j21164Q2051j99595o1440Q5638
5579b37389J30252m63k39231R3231L01637k12821j598j08297J4864N3645L62857
$$ y = [100175, 100700, -1838, -210169, -393386, -445666, -326651, -301085, -470782, -532196, -361234, -347698, -223167, -308934, -218242, -146240, -70167, -89512, -127892, -232326, -286648, -126530, -249292, -356117, -30893, -214540, -263274, -163908, -222453, -436698, -285028, -11722, 53234, 139013, 209236, 134827, 94824, 1953, -3166, -32261, -8116, 294542, 274136, 220527, 313332, 511831, 580007, 147420, -214113, -265194, -346322, -307505, -300574, -375436, -459107, -548391, -390386, -358480, -182619, -199002, -71, -22879, -144043, -61992, -261587, -323027, -237389, -107137, -107600, -346831, -253600, 48037, -164784, -166382, -274679, -259815, -206170, 156687]
$$ [...]
##END NTUPLES=NMR SPECTRUM
##END=
