##TITLE=Analysis number 316015
Compound Code cc 14503
Project Code adrs
Chemist Name af chempharm
##JCAMPDX= 6.0         $$ Bruker NMR JCAMP-DX V2.0
##DATA TYPE= NMR SPECTRUM
##DATA CLASS= NTUPLES
##ORIGIN= Bruker BioSpin GmbH
##OWNER= NMR
$$ XWIN-NMR		Version 3.5
$$ Tue Dec 13 14:16:13 2005 GMT Standard Time (UT+0h)  MAYBRIDGE\NMR@NMR_250MHZ
##.OBSERVE FREQUENCY= 250.131544655141
##.OBSERVE NUCLEUS= ^1H
##.ACQUISITION MODE= SIMULTANEOUS (DQD)
##.ACQUISITION SCHEME= undefined
##.AVERAGES= 16
##.DIGITISER RES= 18
##SPECTROMETER/DATA SYSTEM= dpx250
##.PULSE SEQUENCE= zg30
##.SOLVENT NAME= CDCl3
##.SHIFT REFERENCE= (INTERNAL, CDCl3, 0, 16.522)
##AUDIT TRAIL= $$ (NUMBER, WHEN, WHO, WHERE, WHAT)
$$ ##TITLE= Audit trail, XWIN-NMR		Version 3.5
$$ ##JCAMPDX= 5.01
$$ ##ORIGIN= Bruker BioSpin GmbH
$$ ##OWNER= NMR
$$ C:\u/data/dgb/nmr/ADRS/13790/pdata/1/auditp.txt
$$ ##AUDIT TRAIL=  $$ (NUMBER, WHEN, WHO, WHERE, WHAT)
(   1,<2005-12-13 14:15:39.41 +000>,<MAYBRIDGE\NMR>,<NMR_250MHZ>,
      <created by zg, POWCHK disabled, PULCHK disabled
       configuration hash MD5:
       62 19 C7 07 E1 42 D1 B7 37 6C 3D D0 77 39 F9 E6
       data hash MD5: 64K
       B6 DB 46 E8 DE 9D BD B8 15 6F 44 78 60 40 3A 78>)
(   2,<2005-12-13 14:16:02.49 +000>,<MAYBRIDGE\NMR>,<NMR_250MHZ>,
      <Start of raw data processing
       ef LB = 0.3 FT_mod = 6 PKNL = 1 SI = 32K 
       data hash MD5: 32K
       7A 4B 6A 52 7A 3B F6 D3 B2 93 78 DD 09 CD 23 0B>)
(   3,<2005-12-13 14:16:05.46 +000>,<MAYBRIDGE\NMR>,<NMR_250MHZ>,
      <apk 
       data hash MD5: 32K
       FA EC 15 93 56 DA 66 B0 C4 EB 35 5F 4D 6C 0E 08>)
(   4,<2005-12-13 14:16:06.21 +000>,<MAYBRIDGE\NMR>,<NMR_250MHZ>,
      <abs ABSG = 5 
       data hash MD5: 32K
       D4 08 49 11 D4 ED DF FC 4B F9 9C 0F F9 7E 79 F8>)
$$ ##END=
$$ 
$$ hash MD5
$$ 87 5F 0B 7A 42 58 01 E3 B2 1B CE D1 15 67 0B F6
##$RELAX= 
##$RELAX= 
##$RELAX= 
##$RELAX= 
##$RELAX= 
##$RELAX= 
##$RELAX= 
$$ Bruker specific parameters
$$ --------------------------
##$DU= <C:\u>
##$EXPNO= 13790
##$NAME= <ADRS>
##$PROCNO= 1
##$TYPE= <nmr>
##$USER= <dgb>
##$AMP= (0..31)
100 100 100 100 100 100 100 100 100 100 100 100 100 100 100 100 100 100 
100 100 100 100 100 100 100 100 100 100 100 100 100 100 
##$AQSEQ= 0
##$AQ_mod= 3
##$AUNM= <au_zg>
##$AUTOPOS= <44 >
##$BF1= 250.13
##$BF2= 250.13
##$BF3= 250.13
##$BF4= 250.13
##$BF5= 500.13
##$BF6= 500.13
##$BF7= 500.13
##$BF8= 500.13
##$BYTORDA= 1
##$CFDGTYP= 0
##$CFRGTYP= 5
##$CHEMSTR= <none>
##$CNST= (0..31)
1 1 145 1 1 1 1 1 1 1 1 1 1 1 1 1 1 1 1 1 1 1 1 1 1 1 1 1 1 1 1 1 
##$CPDPRG= <>
##$CPDPRG1= <>
##$CPDPRG2= <>
##$CPDPRG3= <>
##$CPDPRG4= <mlev>
##$CPDPRG5= <mlev>
##$CPDPRG6= <mlev>
##$CPDPRG7= <mlev>
##$CPDPRG8= <mlev>
##$CPDPRGB= <>
##$CPDPRGT= <>
##$D= (0..31)
0 1 0 0 0 0 0 0 0 0.06 0 0 0 0 0 0 0.0002 0 0 0 0 0 0 0 0 0 0 0 0 0 0 
0 
##$DATE= 1134483338
##$DBL= (0..7)
120 120 120 120 120 120 120 120 
##$DBP= (0..7)
150 150 150 150 150 150 150 150 
##$DBP07= 0
##$DBPNAM0= <>
##$DBPNAM1= <>
##$DBPNAM2= <>
$$ [...]
##$SUBNAM7= <"">
##$SUBNAM8= <"">
##$SUBNAM9= <"">
##$SW= 20.6930455092707
##$SWIBOX= (0..15)
0 0 3 0 0 0 0 0 0 0 0 0 0 0 0 0 
##$SW_h= 5175.983436853
##$TD= 65536
##$TD0= 1
##$TE= 294.16
##$TE2= 300
##$TE3= 300
##$TEG= 300
##$TL= (0..7)
0 120 120 120 120 120 120 120 
##$TP= (0..7)
150 150 150 150 150 150 150 150 
##$TP07= 0
##$TPNAME0= <>
##$TPNAME1= <>
##$TPNAME2= <>
##$TPNAME3= <>
##$TPNAME4= <>
##$TPNAME5= <>
##$TPNAME6= <>
##$TPNAME7= <>
##$TPOAL= (0..7)
0.5 0.5 0.5 0.5 0.5 0.5 0.5 0.5 
##$TPOFFS= (0..7)
0 0 0 0 0 0 0 0 
##$TUNHIN= 0
##$TUNHOUT= 0
##$TUNXOUT= 0
##$USERA1= <user>
##$USERA2= <user>
##$USERA3= <user>
##$USERA4= <user>
##$USERA5= <user>
##$V9= 5
##$VALIST= <valist>
##$VCLIST= <CCCCCCCCCCCCCCC>
##$VD= 0
##$VDLIST= <DDDDDDDDDDDDDDD>
##$VPLIST= <PPPPPPPPPPPPPPP>
##$VTLIST= <TTTTTTTTTTTTTTT>
##$WBST= 1024
##$WBSW= 4
##$XGAIN= (0..3)
0 0 0 0 
##$XL= 0
##$YL= 0
##$YMAX_a= 449207
##$YMIN_a= -476299
##$ZGOPTNS= <>
##$ZL1= 120
##$ZL2= 120
##$ZL3= 120
##$ZL4= 120
##$ABSF1= 16.522
##$ABSF2= -4.171173
##$ABSG= 5
##$ABSL= 3
##$ALPHA= 0
##$AQORDER= 0
##$ASSFAC= 0
##$ASSFACI= 0
##$ASSFACX= 0
##$ASSWID= 0
##$AUNMP= <proc_1d>
##$AZFE= 0.1
##$AZFW= 0.1
##$BCFW= 0
##$BC_mod= 0
##$BYTORDP= 0
##$COROFFS= 0
##$CY= 12.5
##$DATMOD= 1
##$DC= 0
##$DFILT= <>
##$DTYPP= 0
##$F1P= 14.0000005364418
##$F2P= -0.99999901652339
##$FCOR= 0.5
##$FTSIZE= 32768
##$FT_mod= 6
##$GAMMA= 0
##$GB= 0
##$INTBC= 1
##$INTSCL= 1
##$ISEN= 128
##$LB= 0.3
##$LEV0= 0
##$LPBIN= 0
##$MAXI= 10000
##$MC2= 0
##$MEAN= 0
##$ME_mod= 0
##$MI= 0
##$NCOEF= 0
##$NC_proc= -4
##$NLEV= 6
##$NOISF1= 0
##$NOISF2= 0
##$NSP= 0
##$NTH_PI= 0
##$NZP= 0
##$OFFSET= 16.522
##$PC= 1
##$PHC0= 77.91979
##$PHC1= 20.03345
##$PH_mod= 1
##$PKNL= yes
##$PPARMOD= 0
##$PSCAL= 4
##$PSIGN= 0
##$REVERSE= no
##$SF= 250.13
##$SI= 32768
##$SIGF1= 0
##$SIGF2= 0
##$SINO= 400
##$SIOLD= 32768
##$SREGLST= <1H.CDCl3>
##$SSB= 0
##$STSI= 32768
##$STSR= 0
##$SW_p= 5175.98343685301
##$SYMM= 0
##$S_DEV= 0
##$TDeff= 65536
##$TDoff= 0
##$TI= <Analysis number 999999
Compound Code 99
Book Reference 9
Project Code 9>
##$TILT= no
##$TM1= 0
##$TM2= 0
##$TOPLEV= 0
##$USERP1= <user>
##$USERP2= <user>
##$USERP3= <user>
##$USERP4= <user>
##$USERP5= <user>
##$WDW= 1
##$XDIM= 32768
##$YMAX_p= 428411405
##$YMIN_p= -302637
$$ End of Bruker specific parameters
$$ ---------------------------------
##NTUPLES= NMR SPECTRUM
##VAR_NAME=  FREQUENCY,     SPECTRUM/REAL,   SPECTRUM/IMAG
##SYMBOL=    X,             R,               I
##VAR_TYPE=  INDEPENDENT,   DEPENDENT,       DEPENDENT
##VAR_FORM=  AFFN,          ASDF,            ASDF
##VAR_DIM=   32768,         32768,           32768
##UNITS=     HZ,            ARBITRARY UNITS, ARBITRARY UNITS
##FACTOR=    0.157963299565203, 1,           1
##FIRST=     4132.6476996994, 0,             0
##LAST=      -1043.33573715361, 0,           0
##MIN=       -1043.33573715361, -302637,     0
##MAX=       4132.6476996994, 428411405,     0
$$ Real data points
##PAGE= N=1
##DATA TABLE= (X++(R..R)), XYDATA
$$ [...]
25040B2843l532L3332L9906Q8507q101o0105l5328r1822M0270n5068o5742K4061
$$ 22843 19311 52643 92549 181056 172955 112850 77522 -14300 25970 -29098 -94840 -70779
25028g0779K952P367L5446K6059J3288O463j0068j2241K651l0730n5212j3768
$$ -70779 -67827 -60460 -25014 1045 14333 20796 10728 -1513 1138 -29592 -84804 -98572
25016i8572M2995P0496J951K0116M966j56k0546Q158l1746J5379P0740k8927J5076
$$ -98572 -55577 14919 16870 36986 41952 41796 21250 29408 -2338 13041 83781 54854 69930
25003F9930J2805j6128K2413j5881n2880M8615O9639N6392o8775j29911j8981
$$ 69930 82735 66607 89020 73139 20259 68874 138513 194905 126130 -3781 -22762
24992b2762P816J82J0973m499j3800k1415l8145l3413J3255N0878J6927m249n710
$$ -22762 -14946 -14764 -3791 -8290 -22090 -43505 -81650 -115063 -101808 -50930 -34003 -38252 -43962
24979d3962L6796K6460J8881R843L6194j0917k4859j4917m5355n1668j0687Q549
$$ -43962 -7166 19294 38175 48018 84212 73295 48436 33519 -11836 -63504 -74191 -65642
24967f5642J816p673L012L653K5959K0723q477J2678J5420K5367l9825r4337L2221
$$ -65642 -63826 -71499 -68487 -64834 -38875 -18152 -26629 -13951 1469 26836 -12989 -107326 -75105
24954g5105L2879N7481n089l8826J6498l7061J2727J9527P2289L3646k0380l802
$$ -75105 -42226 15255 10166 -28660 -12162 -49223 -36496 -16969 55320 88966 68586 64784
24942F4784M2851N5625j6589p5404o7117k6931n428k3906k3533j72N2874M1953
$$ 64784 107635 163260 146671 71267 4150 -22781 -28209 -52115 -75648 -75820 -22946 19007
24930A9007M5400j7393q353o0897J713K1186j6107j2187J6836K929M2683K2038
$$ 19007 64407 47014 38661 -22236 -20523 663 -15444 -27631 -10795 -7866 34817 56855
24918E6855p2039n7671M7141J3355j8142j510K001j4296l0824k6916O1255K8868
$$ 56855 -15184 -72855 -25714 -12359 -30501 -32011 -30010 -44306 -75130 -102046 -40791 -11923
24906a1923l3418m5171P4366N6401m7267J7788N1762J780o8373j3144K3264N0001
$$ -11923 -45341 -90512 -16146 40255 -7012 10776 62538 64318 -4055 -17199 6065 56066
24894E6066l8461j3894l6394J8340j550J6212k5018L1830M1583j2539L6167J3836
$$ 56066 17605 3711 -32683 -14343 -15893 319 -24699 7131 48714 36175 72342 86178
24882H6178j21394o3423m5439N2081M0664Q3183k3232m1581M5642K149j0369L3937
$$ 86178 -35216 -98639 -144078 -91997 -51333 31850 8618 -32963 12679 14828 4459 38396
24870C8396n703k1654o3360l7431Q5940J1758m8237o5295L8889K6552R507J3664
$$ 38396 32693 11039 -52321 -89752 -3812 7946 -40291 -105586 -66697 -40145 -30638 -16974
24858a6974K4589J9372o1454J0605L4136j9668k5535m771k5678M1731p592p955
$$ -16974 7615 26987 -34467 -23862 10274 -9394 -34929 -39700 -65378 -23647 -31239 -39194
24846c9194J6138j6933J1356l7694M5503M6964J7698K0853j4949K1725J7690l4827
$$ -39194 -23056 -39989 -28633 -66327 -20824 26140 43838 64691 49742 71467 89157 54330
24834E4330K6483L468m2611r980M3225L1150l8443o4132o3296k7512L1820L0001
$$ 54330 80813 84281 41670 31690 74915 106065 67622 3490 -59806 -87318 -55498 -25497
24822b5497M3184M01j5879k070j3333P7713N7442m80o8231j2575J4769n6644m166
$$ -25497 17687 18088 2209 139 -13194 64519 121961 121481 53250 40675 55444 -1200 -5366
24809e366n195r56l121k3035L713R191L0346m1526J2976M0282j6234m0376l6102
$$ -5366 -10561 -11517 -14638 -37673 -33960 -24769 5577 -35949 -22973 17309 1075 -39301 -75403
24796g5403k9915L1820m65Q485L6711P485M5991L4274K4781K242l1290k8373m352
$$ -75403 -105318 -73498 -73963 -65478 -28767 -21282 24709 58983 83764 86006 54716 26343 21991
24783B1991J4890o1516l5607Q7460L0736O847J3915m3647L345J9440o4465j3139
$$ 21991 36881 -24635 -60242 27218 57954 64801 78716 35069 38414 57854 -6611 -19750
24771a9750O598o7664r413k574M950J8545o5351Q681O4115l2500L8541P9703J2028
$$ -19750 -13152 -80816 -90229 -92803 -87853 -69308 -134659 -125978 -61863 -94363 -55822 23881 35909
24758C5909j4113m9456l0823l0866j9735O358L2337J2860l1969N7332N3878l0673
$$ 35909 21796 -27660 -58483 -89349 -109084 -102726 -70389 -57529 -89498 -32166 21712 -8961
24746h961k2912M8068K1683K4109j8661n5289k5250k3458j0131K5P3973K9036
$$ -8961 -31873 16195 37878 61987 43326 -11963 -37213 -60671 -70802 -70777 3196 32232
24734C2232m3946o802p8456j3321l0969K9523M7395J1338O0012K3677k0533J0301
$$ 32232 -11714 -18516 -96972 -110293 -141262 -111739 -64344 -53006 7006 30683 10150 20451
24722B0451r970j0905K5863j52M8539O0229j24144j7959N5880n5456n4706L9027
$$ 20451 10481 -424 25439 25287 73826 134055 9911 -8048 47832 -7624 -62330 -23303
24710b3303L8159P8244m0482m1348k8336l3607l4480J4746P7343L7433j637n0710
$$ -23303 14856 93100 52618 11270 -17066 -50673 -85153 -70407 6936 44369 42732 -7978
24698g978p5115l0626J3941K0186L6447K2896j6063q090N5000p072k1838K1251
$$ -7978 -83093 -113719 -99778 -79592 -43145 -20249 -36312 -44402 10598 3526 -18312 2939
24686B939J0810k796N272j8360q9580M486q284O0287k8359K9609J3472N4915L5156
$$ 2939 13749 10953 16225 -2135 -91715 -87229 -95513 -35226 -63585 -33976 -20504 34411 69567
24673F9567N3849q566l1496j8959J02623j5886o6824l5080k1218k2158q221M5426
$$ 69567 123416 114850 83354 64395 167018 151132 84308 49228 28010 5852 -2369 43057
24661D3057K7752J3047p3886o7301k4639P817M5001J6959J6609M975R265M4476
$$ 43057 70809 83856 9970 -57331 -81970 -74153 -29152 -12193 4416 9391 18656 63132
24649F3132J1884j4958p0614M241M9855j8587n9730o4559k1133J7149L155j9883
$$ 63132 75016 60058 -10556 -6315 43540 24953 -34777 -99336 -120469 -103320 -100165 -120048
24637a20048P4599K4182k4339j5771q655L3899M5311j8204k5870K0735M4821j1631
$$ -120048 -45449 -21267 -45606 -61377 -70032 -36133 9178 -9026 -34896 -14161 30660 19029
24625A9029o4102k2572K2679M453K9934n605l2799o316n7655k5126j519M2451
$$ 19029 -45073 -67645 -44966 -40513 -10579 -16184 -48983 -55299 -112954 -138080 -139599 -97148
24613i7148N3198M37k2602M5551P4079l1937L324L9592n2369p2371j5121o594
$$ -97148 -43950 -43513 -66115 -20564 53515 21578 24902 64494 12125 -60246 -75367 -81961
24601h1961K647L0425K4038o2378j5343P6608k7905m0614K3366K4505K1226K2812
$$ -81961 -79314 -48889 -24851 -87229 -102572 -25964 -53869 -94483 -71117 -46612 -25386 -2574
24589b574k4533p404k8464L1768M8338L3108K0188k4391j1100M3195N941l9464
$$ -2574 -27107 -34511 -62975 -31207 17131 50239 70427 46036 34936 78131 84072 44608
24577D4608K7422k363l8525p846J2057L1289m7068n6815J2728l6459J0319m6008
$$ 44608 72030 69667 31142 23296 35353 66642 19574 -37241 -24513 -60972 -50653 -96661
24565i6661M6274M5046J4017r234j2879Q1896M1625P718o0847n2229k671L766
$$ -96661 -50387 -5341 8676 -558 -13437 68459 110084 117802 56955 4726 2055 5821
24553E821K5537N7234l4923n8066k892l7098J4083m0464K4891j3837l6393L2836
$$ 5821 31358 88592 53669 -4397 -7289 -44387 -30304 -70768 -45877 -59714 -96107 -63271
24541f3271N2526J2742k7620K9839M0786j1335j5324N5460J5834m2554k2942j2659
$$ -63271 -10745 1997 -25623 4216 45002 33667 18343 73803 89637 47083 24141 11482
24529A1482o429m564j0262P427k7919J3883M8593j9597l9338l5870L0595j1910
$$ 11482 5053 489 -9773 -2346 -30265 -16382 32211 12614 -26724 -62594 -31999 -43909
24517d3909K1835J1941l7713J3215L0760J1994K1945M9594j1068o6122k7489J3502
$$ -43909 -22074 -10133 -47846 -34631 -3871 8123 30068 79662 68594 2472 -25017 -11515
24505a1515K7158m6829m5780J9076N2436J5623j0390J0506k0175q794l6299m4589
$$ -11515 15643 -31186 -76966 -57890 -5454 10169 -221 10285 -9890 -18684 -54983 -99572
24493i9572L310j1651M0540J233J2031O1098j9017l2803r678M6300N1334K2340
$$ -99572 -96262 -107913 -67373 -66140 -54109 6989 -12028 -44831 -54509 -8209 43125 65465
24481F5465p421q7317J3712L4056n0416O560k301L1732p5147o1043M5591Q1995
$$ 65465 58044 -29273 -15561 18495 -31921 -25361 -27662 4070 -71077 -132120 -86529 -4534
24469d534O945m2491q533K7474L9161L3619q385k231k1568K3990m2593o872Q4590
$$ -4534 2411 -40080 -48613 -21139 18022 51641 43256 41025 19457 43447 854 -6018 78572
24456G8572P3173j7171n935q97J5667m7290p4521n9471Q773j5449K3857M8146
$$ 78572 151745 134574 128639 127742 143409 96119 21598 -37873 -29100 -44549 -20692 27454
24444B7454k2697j6543L626m6504K0988R98j6100l6385j8211O4985K7637P1053
$$ 27454 4757 -11786 -8160 -54664 -33676 -32678 -48778 -85163 -103374 -38389 -10752 60301
24432F0301J0598k4841N7260K9891o6133K2683k9539q5842n6207l137M2295K0734
$$ 60301 70899 46058 103318 133209 67076 89759 60220 -25622 -81829 -84966 -42671 -21937
24420b1937o141K9070k8393n2155k4749n152j9623L1421L9788K5636M685R360
$$ -21937 -28078 992 -27401 -79556 -104305 -109457 -129080 -97659 -57871 -32235 -27550 -18190
24408a8190N637J8873M1072j4394j5126J0204J246K1623k5103p8205L3762Q3714
$$ -18190 -12553 6320 47392 32998 17872 28076 29322 50945 25842 -52363 -18601 65113
24396F5113L3284l3920k4082J6168k0828m3242k7003K0380L2183k1178k3050N811
$$ 65113 98397 64477 40395 56563 35735 -7507 -34510 -14130 18053 -3125 -26175 -20364
24384b0364j6700r482K3343l6491K710L007n128m164j191p520p053O146l5606
$$ -20364 -37064 -46546 -23203 -59694 -56984 -53977 -59105 -63269 -64460 -71980 -79033 -72887 -108493
24371a08493j6782o2891k577P5227J2142P4443L9060p7916m5459L1574O609M3365
$$ -108493 -125275 -188166 -190743 -115516 -103374 -28931 10129 -67787 -113246 -81672 -75063 -31698
24359c1698N8098m7866o8172j058R5748N5572J6355r2282l9576Q2405K3261N5824
$$ -31698 26400 -21466 -89638 -90696 5052 60624 76979 -15303 -54879 27526 50787 106611
24347A06611l3473p3169l38J8744J6132l731k342k8356k6624J1552M0909K3415
$$ 106611 73138 -31 -369 18375 34507 30776 28434 78 -26546 -14994 25915 49330
24335D9330j9270j3961j1790q612N309K7060o825Q257p102N998M3157k9404J50
$$ 49330 30060 16099 4309 -4303 1006 28066 21241 29498 22396 28394 71551 42147 42297
24322D2297P822m9351M9114N397n9818j0774L4471j1732k6269L7198J9956j4192
$$ 42297 50119 768 49882 55279 -4539 -15313 19158 7426 -18843 18355 38311 24119
24310B4119l5823N115L0147N8875K1105l5463l1340j6577J0652Q289N0795j8109
$$ 24119 -11704 -6589 23558 82433 103538 68075 36735 20158 30810 39099 89894 71785
24298G1785K047l444k2978k4547k2346m9484K7006N287L9210K2339n3810m0175
$$ 71785 73832 70388 47410 22863 517 -48967 -21961 -16674 22536 44875 -8935 -49110
24286d9110N0277L9966j06601L2878M8723J8639n3491o883Q948r151k2349o093
$$ -49110 1167 41133 -65468 -32590 16133 34772 -18719 -25602 -16654 -25805 -48154 -54247
24274e4247P2148J983O000m0790l2596L5256K6529J2791j3948m8374j4882O2008
$$ -54247 17901 19884 25884 -14906 -47502 -12246 14283 27074 13126 -35248 -50130 11878
24262A1878K8748N543O10J892K7414k1882m9936J533L0400k3303l3782j9558k3296
$$ 11878 40626 46169 46779 48671 76085 54203 4267 5800 36200 12897 -20885 -40443 -63739
24249f3739n594j8215l3801o605J2464N9565O8470J2619l921M0923n9533l7931
$$ -63739 -69333 -87548 -121349 -127954 -115490 -55925 12545 25164 21243 62166 2633 -35298
24237c5298j2215p3587N235M7338J9800P9925K5903P653k0721m0317J2336l4720
$$ -35298 -47513 -121100 -115865 -68527 -48727 31198 57101 64754 44033 3716 16052 -18668
24225a8668l3750L9508J0032j7640o305k1858j863M5821P3179L8252j7211J7092
$$ -18668 -52418 -12910 -2878 -20518 -26823 -48681 -50544 -4723 68456 106708 89497 106589
24213A06589m8480m5967J0263m556J8987M874k8872K1810K499j6436n3786m3454
$$ 106589 58109 12142 22405 17849 36836 41710 12838 34648 37147 20711 -33075 -76529
24201g6529K9446J6628K6531p671P1810L4004l4641j5029k4228m3389J4716J364
$$ -76529 -47083 -30455 -3924 -11595 60215 94219 59578 44549 20321 -23068 -8352 -6988
24189f988M5224M5550o7918o7971k773L3739M2938j6283k9359q964O5537O318
$$ -6988 38236 83786 15868 -52103 -54876 -21137 21801 5518 -23841 -32805 32732 39050
24177C9050R968k2765m857r992K0156j6483p8956P9730O3119J8911l1859k9923
$$ 39050 49018 26253 21396 11404 31560 15077 -63879 15851 78970 97881 66022 36099
24165C6099R644N257J3190j0376k5223l8150J6661Q980p80m8623J1603P5643P439
$$ 36099 45743 51000 64190 53814 28591 -9559 7102 16082 15302 -33321 -21718 53925 61364
24152F1364o1230j0145O0712M476m2203m577j5879k5358K553Q99J5891J4831J0478
$$ 61364 134 -10011 50701 55177 12974 8397 -7482 -32840 -30287 -29388 -13497 1334 11812
24139A1812J5128M2123l8291q9167J6219n9510m1665O0153J07337M0812l228q558
$$ 11812 26940 69063 30772 -58395 -42176 -101686 -143351 -83198 24139 64951 61723 53165
24127E3165J9598p463k3351Q285j4831m4093R043n6889J2839N0129M316q293k5409
$$ 53165 72763 65300 41949 50234 35403 -8690 353 -56536 -43697 6432 10748 2455 -22954
24114b2954m1399J2220l044n7959j1447P7851k327n892M1412J9060M6426k0035
$$ -22954 -64353 -52133 -55177 -113136 -124583 -46732 -49059 -54951 -13539 5521 51947 31912
24102C1912J4376j0143J8205j6480j4598n2512M4429P3627J2150r5237p2327N6248
$$ 31912 46288 36145 54350 37870 23272 -29240 15189 88816 100966 5729 -66598 -10350
24090a0350J5429p560m3572n5575q015N8962Q37j4323J8046J0149n389Q0734J1878
$$ -10350 5079 -2481 -46053 -101628 -109643 -50681 -49844 -64167 -46121 -35972 -41361 39373 51251
24077E1251q4063l2055R180j3288L0782L2095K672r5692l5547L0537J9314O9711
$$ 51251 -32812 -64867 -55687 -68975 -38193 -6098 -3426 -99118 -134665 -104128 -84814 -15103
24065a5103L8036L6946k2994l1572k6171M0225K7640O161l1771l2543k9065J9438
$$ -15103 22933 59879 36885 5313 -20858 19367 47007 53168 21397 -11146 -40211 -20773
24053b0773q2196k6770K1373N4186l0662R3201L8610J7164P1513L783m6277j5778
$$ -20773 -102969 -129739 -108366 -54180 -84842 8359 46969 64133 135646 139429 93152 77374
24041G7374k6318j6601N94j3715J1826k1893j7780l5766l9733K0154J8672M9663
$$ 77374 51056 34455 35049 21334 33160 11267 -6513 -42279 -82012 -61858 -43186 6477
24029F477P3020k7354p5779m8421N662K0278L120K3521J9478j0943p3115J716
$$ 6477 79497 52143 -23636 -72057 -66395 -46117 -42997 -19476 2 -10941 -84056 -82340
24017h2340K4530m817K1083j4687M9093N3978K5335K9045n2618p169m5365k7772
$$ -82340 -57810 -62627 -41544 -56231 -7138 46840 72175 101220 48602 41433 -3932 -31704
24005c1704L153q397p382k4642K9657L3862P083R156M6657J7801k0377K4855L3644
$$ -31704 -28551 -36948 -44330 -68972 -39315 -5453 1630 10786 57443 75244 54867 79722 113366
23992A13366j6895m3099o3100q72N4229M3183k5392k0296j4939K6257k274l4880
$$ 113366 96471 53372 -9728 -10600 43629 86812 61420 41124 26185 52442 50168 15288
23980A5288k9749q88J0860J7942O1911q412j8622P459M6197l7649P233k6734r973
$$ 15288 -14461 -15349 -4489 13453 75364 66952 48330 55789 101986 64337 71570 44836 34863
23967C4863o842k9016M2272l9796m1478R135O6115q571m9182p3715j564P1003
$$ 34863 28021 -995 41277 1481 -39997 -30862 35253 26682 -22500 -96215 -97779 -26776
23955b6776k478M0338L7979R372J3151J4267J1890k3002m765l5258m2154j8699
$$ -26776 -29254 11084 49063 58435 71586 85853 97743 74741 69976 34718 -7436 -26135
23943b6135J7660N9988N7470j3933r2095j9699r118n8602K6320j0254L4575Q9934
$$ -26135 -8475 51513 108983 95050 2955 -16744 -25862 -84464 -58144 -68398 -33823 56111
23931E6111k8584n9136K6041K4613l6236l7593L5969M1393k634k2172m5734p8615
$$ 56111 27527 -31609 -5568 19045 -17191 -54784 -18815 22578 19944 -2228 -47962 -126577
23919a26577J6777L1780Q6917k515K2015p406J9928j9659O1127K627n0107o352
$$ -126577 -109800 -78020 8897 6382 28397 20991 40919 21260 82387 85014 34907 28555
23907B8555K231p2431l3491M2712O0938L0146j1760j1249q234j7470p1620m7246
$$ 28555 30786 -41645 -75136 -32424 28514 58660 46900 35651 27417 9947 -61673 -108919
23895a08919j0796K0417R4834m1620J7145K6268N3294p316o0446j5734J4114j7030
$$ -108919 -119715 -99298 -4464 -46084 -28939 -2671 50623 43307 -17139 -32873 -18759 -35789
23883c5789j8939J7300R33N7024j196p613j1298m7295j2469m7654j1508J0943
$$ -35789 -54728 -37428 -36495 20529 19333 11720 422 -46873 -59342 -106996 -118504 -107561
23871a07561M0346N6053k367K3448L082J9831m2550R832M8462k4902J5973o0817
$$ -107561 -67215 -11162 -13529 9919 13001 32832 -9718 114 48576 23674 39647 -21170
23859b1170k6810k1503J5601j4083P4015L0972m656m1963q654l3453l1550m0399
$$ -21170 -47980 -69483 -53882 -67965 6050 37022 32366 -9597 -18251 -51704 -83254 -123653
23847a23653M4058P542j281j2532P7962l2791n44L0771L1948n883k7092L6331
$$ -123653 -79595 -72053 -73334 -85866 -7904 -40695 -41239 -10468 21480 15597 -11495 24836
23835B4836N3991k6854m1570O4192q107k1048j9991M0540j2873p5643o2090M149
$$ 24836 78827 51973 10403 74595 66488 45440 25449 65989 53116 -22527 -84617 -80468
23823h0468L7377O8363j2790L177k4625j3289p3058J0528R7460L7576k5292m382
$$ -80468 -43091 25272 12482 15659 -8966 -22255 -95313 -84785 12675 50251 24959 20577
23811B0577n128m7141n6506K9318J1563L2481Q4384j1814J50J0185J229k0156
$$ 20577 15449 -31692 -88198 -58880 -47317 -14836 69548 57734 57884 68069 69298 49142
23799D9142j9406k5261m7639K9410L4378l7879l0768L0657K6982m123L0211K8372
$$ 49142 29736 4475 -43164 -13754 20624 -17255 -48023 -17366 9616 5493 35704 64076
23787F4076m0317Q859n7524o5008l0795r999M7117P6885K8495M938L4218k3211
$$ 64076 23759 32618 -24906 -89914 -120709 -130708 -83591 -6706 21789 26727 60945 37734
23775C7734q4953k7837l2247K4393L4214J5587l90K4221M1515p0270l6762M5292
$$ 37734 -47219 -75056 -107303 -82910 -48696 -33109 -33499 -9278 32237 -38033 -74795 -29503
23763b9503K8738J7647k2965o0465k0656L359J2894j0548M6328N870r4599m629
$$ -29503 -765 16882 -6083 -66548 -87204 -83845 -70951 -81499 -35171 -29301 -123900 -128529
23751a28529M9192L582J0208O0509R6536o5516M8849J2126l1816M173j009K2732
$$ -128529 -79337 -75755 -65547 -5038 91498 25982 74831 86957 55141 59314 58305 81037
23739H1037k065k8993m3690K4049m2743j4109J9258Q4794O9280o8745j26028K6467
$$ 81037 78972 49979 6289 30338 -12405 -26514 -7256 77538 146818 78073 -47955 -21488
23727b1488p882m9327k4446P2826N9042n2291l1054R3423J4282l4696L1887k6236
$$ -21488 -29370 -78697 -103143 -30317 28725 -23566 -54620 38803 53085 18389 50276 24040
23715B4040n3244j2932M0512j7125J07959K7405o5447o7725k1813M3891K8581
$$ 24040 -29204 -42136 -1624 -18749 89210 116615 51168 -16557 -38370 5521 34102
23704C4102p3938M611J2745K9096O5090K3699j3404K004J665L166N346o5199l1901
$$ 34102 -39836 -35225 -22480 6616 71706 95405 82001 84005 85670 88836 94182 28983 -2918
23691b918j5247k81K2816Q824L212n237j7827m7084K5855o2031n0494M6642P5509
$$ -2918 -18165 -18446 4370 13194 16406 11169 -6658 -53742 -27887 -89918 -140412 -93770 -18261
23678a8261O883J6932k597K4078L869J0394N201l9435k2927N2435J6672l9338
$$ -18261 -11378 5554 2957 27035 30904 41298 46499 7064 -15863 36572 53244 13906
23666A3906k5543J1498L1744N2727Q364k3850n0838q109p959k0904J8981K5117
$$ 13906 -11637 -139 31605 84332 92696 68846 18008 9899 1940 -18964 17 25134
23654B5134o15n1346J7619n4052j30N4144k2225J1752l0542J8284o05j0519J40
$$ 25134 24519 -26827 -9208 -63260 -63390 -9246 -31471 -19719 -50261 -31977 -32582 -43101 -42961
23641d2961J6435j7994m4491L2535O0167J5954j4909M26M4848j9338m487q523
$$ -42961 -26526 -44520 -89011 -56476 3691 19645 4736 5162 50010 30672 26185 17662
23629A7662k6366R328n0044N1439K3958l4218n2675M6151O5633m2509j05004M1284
$$ 17662 -8704 624 -49420 2019 25977 -8241 -60916 -14765 50868 8359 -96645 -55361
23617e5361K4725l12L6295j3205k47K9797M4739L2042j6773o1228R04R372j26581
$$ -55361 -30636 -30948 5347 -7858 -8105 21692 66431 98473 81700 20472 21376 30748 -95833
23604i5833J2463N294m6789N9057J6293j9211M0415L6501J5769n248j7068K1489
$$ -95833 -83370 -78076 -124865 -65808 -49515 -68726 -28311 8190 23959 18711 1643 23132
23592B3132L022M0983j112J4054o1332m1498L8187k6450q031k2028j8719j1995
$$ 23132 26154 67137 66025 80079 18747 -22751 15436 -11014 -19045 -41073 -59792 -71787
23580g1787K3666O9610L8733k3821J9030J1809l1106o7568j2862m0519m590L2380
$$ -71787 -48121 21489 60222 36401 55431 67240 36134 -31434 -44296 -84815 -89405 -57025
23568e7025J6453K8796l1794j3948K0350j7144k8080R419l504p187J6969j960
$$ -57025 -40572 -11776 -43570 -57518 -37168 -54312 -82392 -72973 -76477 -83664 -66695 -68655
23556f8655K236O0844Q3881k3713l9676l5766l6457N485N2734P6416j2580r4410
$$ -68655 -66419 -5575 78306 54593 14917 -20849 -57306 -51821 913 77329 64749 -29661
23544b9661j0195J8030m292j00407j4522N8998j2483K3303M6453l5784j00687
$$ -29661 -39856 -21826 -26118 -126525 -141047 -82049 -94532 -71229 -24776 -60560 -161247
23533a61247M6610J11428L5843J6516l3198L529r02r315J4036N335k2349K1821
$$ -161247 -114637 -3209 32634 49150 15952 19481 18579 9264 23300 28635 6286 28107
23521B8107R739O7804k13K5844M8362m2082q5822k186L6396M6600j6618k0488
$$ 28107 37846 105650 105437 131281 179643 137561 51739 49553 85949 132549 115931 95443
23509I5443J1228k9823l1132J7794m3556j6397k1677K3937m8376n2128k5122N0548
$$ 95443 106671 76848 45716 63510 19954 3557 -18120 5817 -42559 -94687 -119809 -69261
23497f9261O3666l1758k1113N9033N2304L1828K4472o4098m5057R147o508l2164
$$ -69261 -5595 -37353 -58466 567 52871 84699 109171 45073 16 9163 2655 -29509
23485b9509Q1851J4766J627m0868l9707n7099k4081L0628N6785O508J0168k7654
$$ -29509 52342 67108 68735 27867 -11840 -68939 -93020 -62392 -5607 901 11069 -16585
23473a6585k9293m5637j9524K8492m9351k795Q1498L667k1353q155M0840O902
$$ -16585 -45878 -91515 -111039 -82547 -131898 -134693 -53195 -49528 -70881 -79036 -38196 -31294
23461c1294J9407P174J5921Q143K0751n2817j6861m393O6438j6546k6515j638
$$ -31294 -11887 -4713 11208 19351 40102 -12715 -29576 -33969 32469 15923 -10592 -12230
23449a2230K284j6495L8651N376m1991J2732j9203m5085j158M1496o842m0514
$$ -12230 -9946 -26441 12210 17586 -24405 -11673 -30876 -75961 -77119 -35623 -42465 -82979
23437h2979M1049L3394l1904n2428M243L4689R2151P1794J2385o1926q7806k3004
$$ -82979 -41930 -8536 -40440 -92868 -88625 -53936 38215 110009 122394 60468 -27338 -50342
23425e0342L4377N2715m0646N6610K4543k0256L0009l1751l7947m8659K215M0195
$$ -50342 -15965 36750 -3896 52714 77257 57001 87010 55259 17312 -31347 -29132 11063
23413A1063N9973N2654l4701q3548o3826k0216Q7990M2571L9901Q186p2936n8288
$$ 11063 71036 123690 88989 5441 -58385 -78601 9389 51960 91861 100047 27111 -31177
23401c1177j7404j2112K4766L140N4215k2473k0719k0858J1659n337j2059q361
$$ -31177 -48581 -60693 -35927 -32787 21428 -1045 -21764 -42622 -30963 -36300 -48359 -56720
23389e6720j7564p068N4202q372K0213O3827l5659l7983l8403N477K4318l0558
$$ -56720 -74284 -81352 -27150 -35522 -15309 48518 12859 -25124 -63527 -58050 -33732 -64290
23377f4290K9112O5388K4048L9268j5837o7038M7827L1197N99l0832q0861j3352
$$ -64290 -35178 30210 54258 93526 77689 10651 58478 89675 90274 59442 -21419 -34771
23365c4771j0222N4223K4864k7943K093j6883m4929k3728L0258M3567k1108K7294
$$ -34771 -44993 9230 34094 6151 8244 -8639 -53568 -77296 -47038 -3471 -24579 2715
23353B715j8599k6858J7857Q891l0753k8830N8016R123Q686p838j3220J6857K728
$$ 2715 -15884 -42742 -24885 -15994 -46747 -75577 -17561 -8438 248 -7590 -20810 -3953 -1225
23340a225K0928p221J4534Q1583j9127p9874m2496o226j7942k928M2983K7194
$$ -1225 19703 12482 27016 108599 89472 9598 -32898 -39124 -57066 -59994 -17011 10183
23328A0183K3697j1915l9427K144L415j8932J2336P945o458M5764j7458L4366
$$ 10183 33880 21965 -17462 -15318 -11903 -30835 -18499 -10554 -17012 28752 11294 45660
23316D5660O6593q996l2734m5403R491M7833l0066k6607J4691m3729L6638L748
$$ 45660 112253 103257 70523 25120 34611 82444 52378 25771 40462 -3267 33371 37119
23304C7119j3832m8453k7767l0514k7956P327L1077j8880L5561Q2002K0835N814
$$ 37119 23287 -25166 -52933 -83447 -111403 -104076 -72999 -91879 -56318 25684 46519 52333
23292E2333L4259p9176j8965K0640j1470Q307Q72j9904j917Q023q065j8162m0989
$$ 52333 86592 7416 -11549 9091 -2379 5928 6800 -13104 -15021 -6998 -15063 -33225 -74214
23279g4214M6384j5806l9374M2846K9284M1771L6271l390k7164K7334j7658l7110
$$ -74214 -27830 -43636 -83010 -40164 -10880 30891 67162 63772 36608 63942 46284 9174
23267I174j5565l5497j5250O397M8740j9294k1012k7787P315N4454N0761j8445
$$ 9174 -6391 -41888 -57138 -50741 -2001 -21295 -42307 -70094 -62779 -8325 42436 23991
23255B3991m2444K3279k789m1977K0598K3042j2256L9513k0492Q561J8321k8517
$$ 23991 -18453 4826 2037 -39940 -19342 3700 -8556 30957 10465 19026 37347 8830
23243H830p0033j485j6653O1783N1818N2664J6740l0801m1977l0386K6459J4716
$$ 8830 -61203 -62688 -79341 -17558 34260 86924 103664 72863 30886 500 26959 41675
23231D1675M6273l509m0263k0911j7487k4399j4800J397L0939L0351k846m911
$$ 41675 87948 84439 44176 23265 5778 -18621 -33421 -32024 -1085 29266 26420 21509
23219B1509j0737J8706j7493o395k7508N954o8682j9960K2806Q5475L3336J7926
$$ 21509 10772 29478 11985 5590 -21918 -15964 -84646 -104606 -81800 3675 37011 54937
23207E4937l9184k4986Q0820L6200l5930n6318l597j0575P983k563L274N156o9477
$$ 54937 15753 -9233 71587 107787 71857 15539 11942 1367 9350 6787 10061 15217 -54260
23194e4260m4128R0132q819j7961l8431l7216O9982N1884j7251l6201R15k5396
$$ -54260 -98388 -8256 -17075 -35036 -73467 -110683 -40701 11183 -6068 -42269 -41354 -66750
23182f6750k3853k1859Q3447J2004p2753O9438J8795M1158N421L3204k7847j53
$$ -66750 -90603 -112462 -29015 -17011 -89764 -20326 -1531 39627 45048 78252 50405 50252
23170E0252J6156m686j8031j7827j407K7257J5226K38j1532j490l1082l4788K7057
$$ 50252 66408 61722 43691 25864 24457 51714 66940 67178 55646 54156 23074 -11714 15343
23157A5343L2014J2306J2784m0727Q464o2715o1880l7539P754L6148R8797K4069
$$ 15343 47357 59663 72447 31720 40184 -22531 -84411 -121950 -114196 -78048 20749 44818
23145D4818n1403m8833k3921l9174N6237Q900k876j6151L9734N6735M1566m6927
$$ 44818 -6585 -55418 -79339 -118513 -62276 -53376 -56252 -72403 -32669 24066 65632 18705
23133A8705n802J7023j377k9368m5165M854K6957o0566L8488L8789L5424J9078
$$ 18705 12903 29926 28549 -819 -45984 -41130 -14173 -74739 -36251 2538 37962 57040
23121E7040M503p0223n5776J8941N6338O7698L6776n3904m5324l2509p0236J1375
$$ 57040 61543 -8680 -64456 -45515 10823 78521 115297 61393 16069 -16440 -86676 -75301
23109g5301N6210L3437K6763J1213k9055k1120N223J0758o247O1001k7919p031
$$ -75301 -19091 14346 41109 52322 23267 2147 7370 18128 11881 72882 44963 37932
23097C7932K6257o9976k6166j889n0593N047M7540m8371o232K7390j4328J1622
$$ 37932 64189 -5787 -31953 -33842 -84435 -79388 -31848 -80219 -86451 -59061 -73389 -61767
23085f1767O6730j629j9939L0510j9739M1209n199r4548N3237J4045m1423L7278
$$ -61767 4963 3334 -16605 13905 -5834 35375 30176 -64372 -11135 2910 -38513 -1235
23073a235L4534N97J3632L0227l1330L7746P139k0318J208m4945J4573j2212l6923
$$ -1235 33299 33896 47528 77755 46425 84171 91310 70992 72200 27255 41828 29616 -7307
23060g307k31K5340J1296l5790p8933N3674K0639m8438k8775L4752N8803m1956
$$ -7307 -7538 17802 29098 -6692 -85625 -31951 -11312 -59750 -88525 -53773 5030 -36926
23048c6926k9994M7891L9205L2337O473j2469j5887k5035k5354l581k6179l7830
$$ -36926 -66920 -19029 20176 52513 58986 46517 30630 5595 -19759 -23340 -49519 -87349
23036h7349K7725J10767M2288l3065q8387o1426Q980J5284K0850l1798L4694j9081
$$ -87349 -59624 51143 93431 60366 -28021 -89447 -80467 -65183 -44333 -76131 -41437 -60518
23024f0518j2955j3763L9213l8392N5161N4030m7114j5576M2542J2055k9237j8366
$$ -60518 -73473 -87236 -48023 -86415 -31254 22776 -24338 -39914 2628 14683 -14554 -32920
23012c2920j2436R607O98j6084j6531j573O2714L4023L829m1453k1564N2350j0128
$$ -32920 -45356 -35749 -35051 -51135 -67666 -69239 -6525 27498 31327 -10126 -31690 20660 10532
22999A0532J0834L2M6440k538k8811K5491k6927r397L272O6755k4631j7113k1500
$$ 10532 21366 21398 67838 65300 36489 61980 35053 25656 28928 95683 71052 53939 32439
22986C2439L9538J6699n1341n0920N4711r992j7123p191K2450M5671p510o6513
$$ 32439 71977 88676 37335 -13585 41126 31134 14011 6820 29270 74941 67431 918
22974I18p4673K0730O6904M582M1178L3358k7968o0214k6949j889J4439J196l5712
$$ 918 -73755 -53025 13879 18461 59639 92997 65029 4815 -22134 -24023 -9584 -8388 -44100
22961d4100k3320M6373J6661P260K5281J4174l4404R523l9141r6434N975K8083
$$ -44100 -67420 -21047 -4386 2874 28155 42329 7925 17448 -21693 -118127 -112152 -84069
22949h4069P6720K0644j2261k8241J4717K8710L9089J859l7126j0572k9637J1949
$$ -84069 -7349 13295 1034 -27207 -12490 16220 55309 57168 20042 9470 -20167 -8218
22937h218n361M6422R018n7718l0367j6646O52L4814J19348O1309m7158Q501k2894
$$ -8218 -13579 32843 41861 -15857 -46224 -62870 -62218 -27404 91944 153253 106095 114596 91702
22924I1702p647p4943l5030J9093K1328j9216K4122K6878M1126N1692K981N781
$$ 91702 84055 9112 -25918 -6825 14503 -4713 19409 46287 87413 139105 142086 147867
22912A47867l0107l1294m2346J0096K2886J0842o1559J951M7829j16997m5820
$$ 147867 117760 86466 44120 54216 77102 87944 26385 28336 76165 -40832 -86652
22901h6652N9767Q074J643j8535O093M6316P6531k4359l8928j153J2360l1692
$$ -86652 -26885 -18811 -17168 -35703 -29610 16706 93237 68878 29950 28797 41157 9465
22889I465Q575m0304j36J6425K3653n8067q215J6678o25k8427l366Q906p130K0891
$$ 9465 18040 -22264 -22400 -5975 17678 -40389 -48604 -31926 -32551 -60978 -64344 -55438 -62568 -41677
22875d1677p558J8810L3439K225M9709k7939m1156J9466Q992m7540j6730k2789
$$ -41677 -49235 -30425 3014 5239 54948 27009 -14147 5319 14311 -33229 -49959 -72748
22863g2748M9190R3874l0634p7904L510j0643J0059K0451j9898j9169L1772J3866
$$ -72748 -23558 70316 39682 -38222 -34712 -45355 -35296 -14845 -34743 -53912 -22140 -8274
22851h274K5990k3029J4498j2475k1464o2980K1066L555K30k2676o0530K030O9254
$$ -8274 17716 -5313 9185 -3290 -24754 -87734 -66668 -63113 -62883 -85559 -146089 -144059 -74805
22838g4805O1234p815l9398K613n0843K7594M1010R287j1828l5573J3119O6820
$$ -74805 -13571 -21386 -60784 -58171 -109014 -81420 -40410 -31123 -42951 -78524 -65405 1415
22826A415k9613k7558N440P100M6598r8q3671Q521L4158N7137m9731m9259j2342
$$ 1415 -28198 -55756 -50316 -43216 3382 3284 -80387 -71866 -37708 19429 -30302 -79561 -91903
22813i1903O6859O9591l9844l0878N1759k474o4197m3609k9629O465L1120K1771
$$ -91903 -25044 44547 4703 -26175 25584 23110 -41087 -84696 -114325 -107860 -76740 -54969
22801e4969K0064R830L0933L52q627K279Q216n8049P82j4948P0666l3306J7601
$$ -54969 -34905 -25075 5858 6210 -2417 -138 8078 -49971 -49189 -64137 6529 -26777 -9176
22788i176K7934M3196q3585o6703M6150N3211J2963K7707K9024Q630k7818L2577
$$ -9176 18758 61954 -21631 -88334 -42184 11027 23990 51697 80721 89351 61533 94110
22776I4110l426Q17l8381n5486L2102j6838M0916j8116m2519l1162L4237l3899
$$ 94110 90684 91501 53120 -2366 29736 12898 53814 35698 -6821 -37983 -3746 -37645
22764c7645K616k7569K3704J8394N5342l8776J0785J9729R3143L0064j7256k8348
$$ -37645 -35029 -62598 -38894 -20500 34842 -3934 6851 26580 119723 149787 132531 104183
22752A04183o3514k6958O452K5490j9399J1514k0079M1075L6327J436j2334n5535
$$ 104183 40669 13711 20163 45653 26254 37768 17689 58764 95091 96527 84193 28658
22740B8658m6690K7974L7399q839m6128o0305Q0060O6601l9599m4133J8779n6470
$$ 28658 -18032 9942 47341 38502 -7626 -67931 12129 78730 39131 -5002 13777 -42693
22728d2693l4800O2038j2300m3270L636K4697N408n2860j0814p729L1912J526
$$ -42693 -77493 -15455 -27755 -71025 -67389 -42692 -37284 -90144 -100958 -108687 -76775 -75249
22716g5249m2483m9706N3856M9507J9571J7609M6393J3771P685K4674j0158O618
$$ -75249 -117732 -167438 -113582 -64075 -44504 -26895 19498 33269 40954 65628 55470 62088
22704F2088l1843l5965o1400l7011k5326j1678K1528q932N8795R1330m5167l1249
$$ 62088 30245 -5720 -67120 -104131 -129457 -141135 -119607 -128539 -69744 21586 -23581 -54830
22692e4830L9414l2937J604O9431k374n9173j5338K004m0267K785k4218J8787
$$ -54830 -15416 -48353 -46749 22682 20308 -38865 -54203 -52199 -92466 -89681 -113899 -95112
22680i5112L8828M214j4776M975m1225N4487M8518j7907P534L0598M502K077M585
$$ -95112 -56284 -52070 -66846 -61871 -103096 -48609 -91 -17998 -10464 20134 24636 26713 31298
22667C1298n292j19261o501J02691O215n0663M7023M740n0047j4581M260j2489
$$ 31298 26006 -93255 -99756 2935 9150 -41513 5510 10250 -39797 -54378 -50118 -62607
22655f2607Q3303J4389m9798P878R757K101K5346o5536L7214L3508o1297l3190
$$ -62607 20696 35085 -14713 -6835 2922 5023 30369 -35167 2047 35555 -25742 -58932
22643e8932p195n3490O271M7590L9187M069j1138J8381p0043k5320L9482P326
$$ -58932 -66127 -119617 -113346 -65756 -26569 -22500 -33638 -15257 -85300 -110620 -71138 -63812
22631f3812J5571r638K0121M258K2458j1544K0628l9206L059n0920J6210L5974
$$ -63812 -48241 -57879 -37758 -33500 -11042 -22586 -1958 -41164 -38105 -89025 -72815 -36841
22619c6841J5184K0508K2464l3865k728k8442K0034k480j215j5297J3288J9584
$$ -36841 -21657 -1149 21315 -12550 -15278 -43720 -23686 -26166 -27381 -42678 -29390 -9806
22607i806M0174k5029o1507l214J1320N7276L9525o013K931p5013K4485j4974
$$ -9806 30368 5339 -56168 -59382 -48062 9214 48739 42726 45657 -29356 -4871 -19845
22595a9845l8766J6856K2369M675m3272j5050R452j9330M31J4946J9336K601j3549
$$ -19845 -58611 -41755 -19386 -14711 -57983 -73033 -63581 -82911 -82480 -67534 -48198 -45597 -59146
22582e9146M2103O6130l7571l2916n666k453O1159O2155l2486j924l9896q419
$$ -59146 -17043 49087 11516 -21400 -27066 -29519 31640 93795 61309 59385 19489 11070
22570A1070m0743N700O7003K8913j5040Q559q982K7664k0354l0516m0552M7557
$$ 11070 -29673 -23973 43030 71943 56903 65462 56480 84144 63790 33274 -7278 40279
22558D0279R1828J1545j9091q4582q0165n6986L2964p254K3695r483j614j7840
$$ 40279 132107 143652 124561 39979 -40186 -97172 -64208 -71462 -47767 -57250 -58864 -76704
22546g6704N2914N2645l5111j8713L2310N0226K7562J0013l5374k5280J5259O3016
$$ -76704 -23790 28855 -6256 -24969 7341 57567 85129 95142 59768 34488 49747 112763
22534A12763K9735o3497n6747J0690K425n4456j7289N853J3408K2064L1875j6731
$$ 112763 142498 79001 22254 32944 35369 -19087 -36376 -30523 -17115 4949 36824 20093
22522B0093m1277l5644n1584K3428J27242O996r6839K8157N6267l1774k1291p523
$$ 20093 -21184 -56828 -108412 -84984 42258 49254 -47585 -19428 36839 5065 -16226 -23749
22510b3749l651P2107o00K263j3017l7087l6837k3184k3280M6886P8206n3942
$$ -23749 -27400 44707 44107 46370 33353 -3734 -40571 -63755 -87035 -40149 38057 -15885
22498a5885n5735K90L7225l0242k1363K2912J6934L4988n553L5956M6954L616
$$ -15885 -71620 -71330 -34105 -64347 -85710 -62798 -45864 -10876 -16429 19527 66481 70097
22486G0097j7734l8891k7479J7705k2266p9807r296M1086K1515J8825M230N0035
$$ 70097 52363 13472 -14007 3698 -18568 -98375 -107671 -66585 -45070 -26245 -22015 28020
22474B8020L6587K2526n2936o8291J0622J8604l9181O7956O5476k0177o8895k1500
$$ 28020 64607 87133 34197 -34094 -23472 -4868 -44049 23907 89383 69206 311 -21189
22462b1189O0980M7458M8494k6616j15825M3050O120l0305k7051M5868j6636j9134
$$ -21189 39791 87249 135743 109127 -6698 36352 42472 12167 -14884 30984 14348 -4786
22450d786O257J3974p187N4337N0246l4997p851K6944M523k0712N7139l514m3381
$$ -4786 1471 15445 8258 62595 112841 77844 69993 96937 101460 80748 137887 134373 90992
22437I0992n6723m5624K229R95N8838M4142K56n8125o7311K3189K6870j1642J3146
$$ 90992 34269 -11355 -9126 -8131 50707 94849 95105 36980 -30331 -7142 19728 8086 21232
22424B1232J7629j9843R396k4719n9140j714N2583P977M4786O4290N1772o1890
$$ 21232 38861 19018 28414 3695 -55445 -57159 -4576 3401 48187 112477 164249 102359
22412A02359j21397m2419l7274L6125L4201J59J2164j1084M6468K0098J2865r7
$$ 102359 -19038 -61457 -98731 -62606 -28405 -28246 -16082 -27166 19302 39400 52265 52168
22400E2168L3915R578p2410l5495j6294Q49j7062k1515K0900L9453o862l8731
$$ 52168 86083 95661 23251 -12244 -28538 -27689 -44751 -66266 -45366 -5913 -12775 -51506
22388e1506R522j6487Q801j513k838R2248L4177r207l8524m9270m664P423K1235
$$ -51506 -41984 -58471 -49670 -51183 -54021 38227 72404 63197 24673 -24597 -29261 -21838 -603
22375f03M6111N4514K0679m3896r0988L796p256k2515j4565j3152o92N7547N3195
$$ -603 45508 100022 120701 76805 -14183 -10387 -17643 -40158 -54723 -67875 -68567 -11020 42175
22362D2175P725n8526k9062R96o3406Q047J07145L7407p2625l7476p4426Q283
$$ 42175 49900 -8626 -37688 -36692 -100098 -92051 15094 52501 -20124 -57600 -132026 -123743
22350a23743L6049K8017J0409l7698O2683R7777l0418Q05j6885N0245O4518L3068
$$ -123743 -87694 -59677 -49268 -86966 -24283 73494 43076 43881 26996 77241 141759 174827
22338A74827q1361p5373l2140M210N1349p356J3227j2624J6970m1298n1728o4561
$$ 174827 93466 18093 -14047 -9837 41512 34156 47383 34759 51729 10431 -41297 -105858
22326a05858j229M1293Q6394k0924R711K0914j8988n5507j416k2886J9345l039
$$ -105858 -107087 -65794 20600 -324 9387 30301 11313 -44194 -45610 -68496 -49151 -52190
22314e2190j8736k2299J1063q464L832N0692L8239K0209l1369n3159M6669N3005
$$ -52190 -70926 -93225 -82162 -90626 -86794 -36102 2137 22346 -9023 -62182 -15513 37492
22302C7492K82J2744n2935k3538J2198L095m0996l6576K200M0532p964l1631J0876
$$ 37492 37774 50518 -2417 -25955 -13757 -10662 -51658 -88234 -86034 -45502 -53466 -85097 -74221
22289g4221K5473M41Q683J595N8401o642k9294J8027J0550k8992J4622n5592m8469
$$ -74221 -48748 -48307 -39624 -38029 20372 13730 -15564 2463 13013 -15979 -1357 -56949 -105418
22276a05418O1404Q1516J3118k9898p4011o384P8771M5598j9330m5108n3447J3349
$$ -105418 -44014 37502 50620 20722 -53289 -59673 19098 64696 45366 258 -53189 -39840
22264c9840N0137O2497Q833n5529L0607L6382m5066k1066N618K8664K3689R303
$$ -39840 10297 72794 81627 26098 56705 93087 48021 26955 32573 61237 84926 94229
22252I4229q339l3345k6192n4575K8028J6018q83j3221J9717O4794r465j5370
$$ 94229 85890 52545 26353 -28222 -194 15824 14941 1720 21437 86231 76766 61396
22240F1396k4691q492J2584K1798o739o9919m6158m3734L398M1171N5575J6150
$$ 61396 36705 28213 40797 62595 55856 -14063 -60221 -103955 -100557 -59386 -3811 12339
22228A2339k9022l9580J0736Q3873k219p3514L073M5384j7668j3635k732k3322
$$ 12339 -16683 -56263 -45527 38346 36127 -37387 -34314 11070 -6598 -20233 -22965 -46287
22216d6287l4563k2697P9257M0860j446k6725k5352m3322M455L0237k5825K896
$$ -46287 -80850 -103547 -24290 16570 15124 -11601 -36953 -80275 -75820 -45583 -71408 -68512
22204f8512j6587N552L2174M5172K8332m5399K5587M7176q83k7951p7405k8517
$$ -68512 -85099 -79547 -47373 -2201 26131 -19268 6319 53495 52612 24661 -52744 -81261
22192h1261L034m960o894K3598N7191M4329L9213L818r176P274j7321o708K1358
$$ -81261 -78227 -83187 -90081 -66483 -9292 35037 74250 78068 68892 76166 58845 52137 73495
22179G3495k5115j3397M7132j5841m0237J0750j424K3765k9719R931L7650n6329
$$ 73495 48380 34983 82115 66274 26037 36787 35363 59128 29409 39340 76990 20661
22167B0661l2078n1183m136K3091m972l4378l143L1076K4151o753J4517M3324
$$ 20661 -11417 -62600 -66736 -43645 -48617 -82995 -86138 -55062 -30911 -37664 -23147 20177
22155B0177k9529n3646M9277k3093m1051K8230L9849J4886N0913K135n4999n3561
$$ 20177 -9352 -62998 -13721 -36814 -77865 -49635 -9786 5100 56013 58148 3149 -50412
22143e0412N360J9785K7192m6693l497P1055M0077k2238P262L1847l7707l6636
$$ -50412 -45052 -25267 1925 -44768 -48265 22790 62867 40629 47891 79738 42031 5395
22131E395K6637L1872K1975M919N4469q2370l0479l1023l4842n7864J9091k4929
$$ 5395 32032 63904 85879 90798 145267 62897 32418 1395 -33447 -91311 -72220 -97149
22119i7149l4709L1200P8770j633n0213o5276n743K1264r470k6943N584N4176
$$ -97149 -131858 -100658 -21888 -23521 -73734 -139010 -144753 -123489 -132959 -159902 -154318 -100142
22107a00142M0910P903J0968j374l9042J9143q096N6337k7424k8969N2964K4254
$$ -100142 -59232 -51329 -40361 -41735 -80777 -61634 -69730 -13393 -40817 -69786 -16822 7432
22095G432j2390l8164n467r594j3540K8322K8273o6145j4276O371k0131J0501
$$ 7432 -4958 -43122 -48589 -58183 -71723 -43401 -15128 -81273 -95549 -89178 -109309 -98808
22083i8808N6257N2191L577N1435j8826J9472m5050r1783O7920j0229k4906L914
$$ -98808 -42551 9640 13217 64652 45826 65298 20248 -71535 -3615 -13844 -38750 -34836
22071c4836L7866p674K3565K4459q434J2447L7588k6261j03472k1445J17269K3931
$$ -34836 3030 -4644 18921 43380 34946 47393 84981 58720 -44752 -66197 51072 75003
22059G5003l6812n8149n1843j3784P3800O6005o7351m6630O5336M1490n920k6018
$$ 75003 38191 -19958 -71801 -85585 -11785 54220 -13131 -59761 5575 47065 41145 15127
22047A5127q9114k0612L9629O5612N9635L1486j9090j9977o7523k1244j4265J4972
$$ 15127 -73987 -94599 -54970 10642 70277 101763 82673 62696 -4827 -26071 -40336 -25364
22035b5364K524J4043l4417m9073m2292L0154M237N6686J0296k4203j988P0475
$$ -25364 -22840 -8797 -43214 -92287 -134579 -104425 -100188 -43502 -33206 -57409 -59397 11078
22023A1078K3571q5303m4851K0317k65l1491m3817o8180K1437M7841J7064K5236
$$ 11078 34649 -50654 -95505 -75188 -75453 -106944 -150761 -218941 -197504 -149663 -132599 -107363
22011a07363N3186j0311K5633n1970k6972N8579K3548L5223J1463M6252k6705
$$ -107363 -54177 -64488 -38855 -90825 -117797 -59218 -35670 -447 11016 57268 30563
22000C0563k1178k8776K868M4398j5097j7714m2981R016j2760J1468k7271J5197
$$ 30563 9385 -19391 -16523 27875 12778 -4936 -47917 -38901 -51661 -40193 -67464 -52267
21988e2267M0582K4924j6164m9438l5976J9370N2334m0062J6295J2098K0016Q020
$$ -52267 -11685 13239 -2925 -52363 -88339 -68969 -16635 -56697 -40402 -28304 -8288 -268
21976b68L544N0943j8093m7050o7511K4497q862j2128L5862K2684L2600L8420
$$ -268 3276 54219 36126 -10924 -78435 -53938 -62800 -74928 -39066 -16382 16218 54638
21964E4638L9953m278P727m6639p2743l6322n8591P051K0961J1118l0459N1041
$$ 54638 94591 90313 98040 51401 -21342 -57664 -116255 -109204 -88243 -77125 -107584 -56543
21952e6543j4240N6742N2158k9757J0711M673n3173n4747k3549N1148J02614l7645
$$ -56543 -70783 -14041 38117 8360 19071 23744 -29429 -84176 -107725 -56577 46037 8392
21940H392p873K9134q142q783n1478j1351J8408j1594M5799L2645L1026P936m2238
$$ 8392 519 29653 21511 12728 -38750 -50101 -31693 -43287 2512 35157 66183 74119 31881
21927C1881p4911j825J8653j5985K0111M9937K7300p0357n7171O876K3990M8557
$$ 31881 -43030 -44855 -26202 -42187 -22076 27861 55161 -15196 -72367 -65491 -41501 7056
21915G056k4948L4676l9586O824Q7964m0235m2998n0620J8600M6590j1076n8186
$$ 7056 -17892 16784 -22802 -15978 71986 31751 -11247 -61867 -43267 3323 -7753 -65939
21903f5939J4180L7582M4581K0164J8180k5802J2398J9440J5969L1495l6057J6942
$$ -65939 -51759 -14177 30404 50568 68748 42946 55344 74784 90753 122248 86191 103133
21891A03133l5967r1625k3016r02O3741O2681n7989o4122j3453J6904K4573o825
$$ 103133 67166 -24459 -47475 -48377 15364 78045 20056 -44066 -57519 -40615 -16042 -22867
21879b2867L3522L4110J0954j243j1855p166j6672L563K1745j6360q3790j6194
$$ -22867 10655 44765 55719 54476 42621 35455 18783 22346 44091 27731 -56059 -72253
21867g2253N0048r97J2897l2916l8278N5199K4267k5340l9555M3815M1190o318
$$ -72253 -22205 -23202 -10305 -43221 -81499 -26300 -2033 -27373 -66928 -23113 18077 11759
21855A1759r514l3521n449K8446L3250K3762l0448n4784M2408L7044K1593m5136
$$ 11759 2245 -31276 -36725 -8279 24971 48733 18285 -36499 5909 42953 64546 19410
21843A9410M657L6221n5042k6510p694k2974K8613N2341N172l9239L60j8803l8259
$$ 19410 24067 60288 5246 -21264 -28958 -51932 -23319 29022 34194 -5045 -4685 -23488 -61747
21830f1747q6k4307J0550O1579J5340n1874j5950K9222r062j5446L8536K9519
$$ -61747 -61833 -86140 -75590 -14011 1329 -50545 -66495 -37273 -46335 -61781 -23245 6274
21818F274k8241L8869J19o7857L0948N4884n4538m4185k4701M8842M9049j4254
$$ 6274 -21967 16902 17021 -50836 -19888 34996 -19542 -63727 -88428 -39586 9463 -4791
21806d791l4939k6115K461N4427L9330k3420n6899K5534k1063L4347j5211k0301
$$ -4791 -39730 -65845 -63384 -8957 30373 6953 -49946 -24412 -45475 -11128 -26339 -46640
21794d6640o755J2938L6439n9961J5922J3569l0176Q5063L869j5599J384m0964
$$ -46640 -53395 -40457 -4018 -63979 -48057 -34488 -64664 20399 24268 8669 10053 -30911
21782c0911m6637J5450J7511K1888K641M525L0022k466l9141K0072N4954L7005
$$ -30911 -77548 -62098 -44587 -22699 -20058 -15533 14489 12023 -27118 -7046 47908 84913
21770H4913k5148n724l3853m9662n110n146L9627j0084J3147J3650M0351l0644
$$ 84913 59765 54041 20188 -29474 -34584 -39730 -103 -10187 2960 16610 56961 26317
21758B6317q5776j8512j0546N2197L8066J4230L1755q6054j9971O0641R820m7106
$$ 26317 -59459 -77971 -88517 -36320 1746 15976 47731 -38323 -58294 2347 12167 -34939
21746c4939J1375R2531k3956o2900l3155Q5432L5929j7915J0195P2076l4394o2806
$$ -34939 -23564 68967 45011 -17889 -51044 34388 70317 52402 62597 134673 100279 37473
21734C7473m9387l257O9177j6269j3728Q041l0582K5091O5375J840n8174q6453
$$ 37473 -11914 -15171 54006 37737 24009 32050 1468 26559 91934 93774 35600 -50853
21722e0853j9779N1208n701N1969K6486k4933l0060l367L3685J8259K1378K0264
$$ -50853 -70632 -19424 -25125 26844 53330 28397 -1663 -5030 28655 46914 68292 88556
21710H8556l3510j400o1700k0369O01l5362k747l6720K1258Q5307L7688m1040
$$ 88556 55046 53646 -8054 -28423 -27822 -63184 -65931 -102651 -81393 3914 41602 562
21698E62j89J6844L3581k0142k8557N1744M578p367j6068r210J0135L576j8169
$$ 562 373 17217 50798 30656 2099 53843 58421 51054 34986 25776 35911 39487 21318
21685B1318n00R776m15m0134L59j8645J0151M4161n0324j4858j4144R696J6912
$$ 21318 20818 30594 30179 -9955 -9596 -28241 -18090 26071 -24253 -39111 -53255 -43559 -26647
21672b6647k6360k2378L1064K7792m9701o1662K9402L1864K1773N0445M9M1559
$$ -26647 -53007 -75385 -44321 -16529 -66230 -127892 -98490 -66626 -44853 5592 5641 47200
21660D7200j5448n5680l2634L9644k2918j2979r599Q322M840M4019M8835l3548
$$ 47200 31752 -23928 -56562 -16918 -39836 -52815 -62414 -54092 -49252 -5233 43602 10054
21648A0054l7407K9107R157o1418L8410N8956j4550n0143Q90j4766p690K0491
$$ 10054 -27353 1754 10911 -50507 -12097 46859 32309 -17834 -16944 -31710 -39400 -18909
21636a8909N0654K8806K1346n9329o93M859k8192O624L7160L1119k0500k816k4992
$$ -18909 31745 60551 81897 22568 21875 26734 -1458 5166 42326 73445 52945 50129 25137
21623B5137l8258K1N2397M8371q194o9435j2772K8203l8508p6168j4202O1438
$$ 25137 -13121 -13100 39297 87668 79474 10039 -2733 25470 -13038 -89206 -103408 -41970
21611d1970L4773J0600N328O320k0516q2692q88P5477J5219J9922M284k8251j817
$$ -41970 -7197 3403 8731 15051 -5465 -88157 -89045 -13568 1651 21573 25857 -2394 -4211
21598d211K0683J2663K9907J82k5211n6351l1658o368l270K6653N1019M2490L6527
$$ -4211 16472 29135 59042 59224 34013 -22338 -53996 -60364 -63634 -36981 14038 56528 93055
21585I3055j2668p969j06393o9373Q5028M7981J9742m6669l5410K1778J5921J6669
$$ 93055 80387 72418 -33975 -103348 -18320 29661 49403 2734 -32676 -10898 5023 21692
21573B1692K4358m4586l1057M4222p2629j8217K6212O8989J5909L0843K1152K8589
$$ 21692 46050 1464 -29593 14629 -58000 -76217 -50005 18984 34893 65736 86888 115477
21561A15477l3517l3271l8430k6003R528L7642l4242L480k9163l0697M809M3932
$$ 115477 81960 48689 10259 -15744 -6216 31426 -2816 664 -28499 -59196 -54387 -10455
21549a0455l1039M0420L8031m2202O1896l686o8477o844L5591j8787k1323K4575
$$ -10455 -41494 -1074 36957 -5245 56651 52965 -15512 -22356 13235 -5552 -26875 -2300
21537b300M6955J1229Q819P74Q2811R666k6069o9152m6668j8987M7007k6812l5458
$$ -2300 44655 55884 64703 65477 148288 157954 131885 62733 16065 -2922 44085 17273 -18185
21524a8185o495j6426Q811j5425K2902k3010l4571J4907M8728M5268L6516j8293
$$ -18185 -24680 -41106 -32295 -47720 -24818 -47828 -82399 -67492 -18764 26504 63020 44727
21512D4727K0588k0097K5522L5307R888j5939m4579k0409Q881j538j2267n5085
$$ 44727 65315 45218 70740 106047 115935 99996 55417 35008 43889 42351 30084 -25001
21500b5001K7984L4510m8019n3995n6113L5059k4150K4633J4185M3969L7268M3119
$$ -25001 2983 37493 -10526 -64521 -120634 -85575 -109725 -85092 -70907 -26938 10330 53449
21488E3449K1692n541N941l9094p1903k0365N347M7739Q2078K0880l1968r8548
$$ 53449 75141 69600 75541 36447 -35456 -55821 -50474 -2735 79343 100223 68255 -30293
21476c0293j6313o4992J0812M5680M4065K164m8170k1582k2976m767K5668M0436
$$ -30293 -46606 -111598 -100786 -55106 -11041 -8877 -57047 -78629 -101605 -106372 -80704 -40268
21464d0268K1366k9456M1532N2715j7773L898m702j8935k7893j4719j4902M8909
$$ -40268 -18902 -48358 -6826 45889 28116 32014 27312 8377 -19516 -34235 -49137 -228
21452b28L8706M4297j8095K520j4139l2866n3532o0292m613k1328O4006O9804
$$ -228 38478 82775 64680 67200 53061 20195 -33337 -93629 -98242 -119570 -55564 14240
21440A4240O5833Q244R858j8463j3755P158J5983L3687m3576p4183J5024j4714
$$ 14240 80073 88317 98175 79712 65957 73115 89098 122785 79209 5026 20050 5336
21428E336L6856P1214K1094l1183J1674R452l3374j4266j8287j7287K0247k6670
$$ 5336 42192 113406 134500 103317 114991 124443 91069 76803 58516 41229 61476 34806
21416C4806m9083l5559L6804J2372p457N8026l8471m1274J8920L5165j3022N0804
$$ 34806 -14277 -49836 -13032 -660 -8117 49909 11438 -29836 -10916 24249 11227 62031
21404F2031Q157n8247l4015M1280l4812l4245J2501N2185j1751m3645N1635L8203
$$ 62031 70188 11941 -22074 19206 -15606 -49851 -37350 14835 3084 -40561 11074 49277
21392D9277n442n3191j03170N645O4005m0503J3345P6406O1294Q877n2630m3697
$$ 49277 43835 -9356 -112526 -106881 -42876 -83379 -70034 6372 67666 76543 23913 -19784
21380a9784j0196k4792Q538P070J5868P45P8342M4897N3088m3984n8141l065j2745
$$ -19784 -29980 -54772 -46234 -39164 -23296 -22551 55791 100688 153776 109792 51651 48586 35841
21367C5841k6489o1360j6599l8149o2622m6735J17843Q2650m285m1231M9888L1456
$$ 35841 9352 -52008 -68607 -106756 -169378 -216113 -98270 -15620 -19905 -61136 -11248 20208
21355B0208L9213L6601k8904m1095n8002M2927K6525j4776J3766k1011j3866l9172
$$ 20208 59421 96022 67118 26023 -31979 10948 37473 22697 36463 15452 1586 -37586
21343c7586l2921K2256J9351O0280O6592m133l8534o725L4511K191j9587k7576
$$ -37586 -70507 -48251 -28900 31380 97972 93839 55305 48580 83091 85282 65695 38119
21331C8119j202l3824j2602m7749k9599P785M2053J6607J8175N8803L4576J1505
$$ 38119 36917 3093 -9509 -57258 -86857 -79072 -37019 -20412 -2237 56566 91142 102647
21319A02647L5747K3117r243m4510k1464Q6550M8034j13532o5763o7144J4665
$$ 102647 138394 161511 152268 107758 86294 172844 220878 107346 41583 -25561 -10896
21308a0896L8989K3839K496p227j7416K2195m1213K012n3786l1426N3780L9652
$$ -10896 28093 51932 54428 47201 29785 51980 10767 12779 -41007 -72433 -18653 20999
21296B0999l1591J2935N452k6993l4655L0370K1175K8717J0399m5325l0006J6196
$$ 20999 -10592 2343 7795 -19198 -53853 -23483 -2308 26409 36808 -8517 -38523 -22327
21284b2327l3659k2496P6841P4980l897k8449q8412Q930L7518k0752j9961l0810
$$ -22327 -55986 -78482 -1641 73339 69442 40993 -47419 -38489 -971 -21723 -41684 -72494
21272g2494J3100N487K8444L2091O7260k1798K11K5422o14l7300j9715p8156R546
$$ -72494 -59394 -53907 -25463 6628 73888 52090 52301 77723 77109 39809 20094 -58062 -48516
21259d8516R0136l1408J0037J1140J6088m5478l7381J975l0275P0548P315n9061
$$ -48516 41620 10212 20249 31389 47477 1999 -35382 -33407 -63682 6866 14181 -44880
21247d4880k4175Q3957K4965m9872j4652j3010k3710J7516J7078j0816l9147n6547
$$ -44880 -69055 14902 39867 -10005 -24657 -37667 -61377 -43861 -26783 -37599 -76746 -133293
21235a33293m8881M7622P2724M525l3472j8918O990K7926M1840N6442J4667O0617
$$ -133293 -182174 -134552 -61828 -57303 -90775 -109693 -102703 -74777 -32937 23505 38172 98789
21223I8789m3593o1876r341n098K3945K183J5597k7206K1340N288J1225k8658
$$ 98789 55196 -6680 -16021 -21119 2826 5009 20606 -6600 14740 20028 31253 2595
21211B595n4340m5119M9935J3520K3219J626N0623J0057L4470M7634l553l3058
$$ 2595 -51745 -96864 -46929 -33409 -10190 -8564 42059 52116 86586 134220 130667 97609
21199I7609o1543j1051m7273N867J1469l9059K5662L3800M0783M7307M0240j0418
$$ 97609 36066 25015 -22258 -16391 -4922 -43981 -18319 15481 56264 103571 143811 133393
21187A33393k6643m7298K743K8013j3661m3031n995M2425j4610k5103J5911K4967
$$ 133393 106750 59452 62195 90208 76547 33516 27521 69946 55336 30233 46144 71111
21175G1111l2932j4011n0111j9141P1682N5836J7610j6254J8711k418m481j1629
$$ 71111 38179 24168 -25943 -45084 26598 82434 100044 83790 102501 100083 95602 83973
21163H3973k8373n9022l4522j1979J9236O3818J9790J2249L6925j5951Q795j0568
$$ 83973 55600 -3422 -37944 -49923 -30687 33131 52921 65170 102095 86144 94939 84371
21151H4371j7883O734m1550j8766M8027k3015n1404O0300O7084j4955n8430o2689
$$ 84371 66488 73222 31672 12906 60933 37918 -13486 46814 113898 98943 40513 -22176
21139b2176L364k4138K0615L8920k7644K4606J6511K280J7687M1180K5927o33
$$ -22176 -18812 -42950 -22335 16585 -11059 13547 30058 32338 50025 91205 117132 116499
21127A16499L6786m4581o3501n3418q9992K4759K7651N6244k5648K3286O7298
$$ 116499 153285 108704 45203 -8215 -98207 -73448 -45797 10447 -15201 8085 75383
21116G5383J2967m5805j8257Q166o245k3300j5236k9663J1602P2045N1582n1336
$$ 75383 88350 42545 24288 32454 26209 2909 -12327 -41990 -30388 41657 93239 41903
21104D1903m88p5595j8927l3965r156P1221P4663k0993k4838p606L90J1999K6794
$$ 41903 41415 -34180 -53107 -87072 -96228 -25007 49656 28663 3825 -3781 -3391 8608 35402
21091C5402k6817m3235L3567P0145J5981N9597k4310o6001j9992j0250L486K4687
$$ 35402 8585 -34650 -1083 69062 85043 144640 120330 54329 34337 24087 27573 52260
21079E2260p9920p9180K1346L5558N0384j5290n5955P1830N1902N60n4399o3057
$$ 52260 -27660 -106840 -85494 -49936 448 -14842 -70797 1033 52935 53495 -904 -63961
21067f3961M1829k2933j576K9807J10095j609n7442n8763J4235L5807r823l060
$$ -63961 -22132 -45065 -46641 -16834 93261 91652 34210 -24553 -10318 25489 15666 12606
21055A2606R145j0322l6121Q2772j2717n6785l5010L825K2564K0248N1231K5436
$$ 12606 21751 11429 -24692 58080 45363 -11422 -46432 -42607 -20043 205 51436 76872
21043G6872m4218K3346j2940k2776k9157J3265N2446k5609j2652J1888k035n136
$$ 76872 32654 56000 43060 20284 -8873 4392 56838 31229 18577 30465 28430 23294
21031B3294M062l4148n696N612j76P5125K7221q0020k7317k0446J2203m1341L5410
$$ 23294 27356 -6792 -12488 -6876 -7052 68073 95294 15274 -12043 -32489 -20286 -61627 -26217
21018b6217N2405J5248l0371m6843j744m1252M554K57J7528l6059j3804J5417
$$ -26217 26188 41436 11065 -35778 -37522 -78774 -74220 -73963 -56435 -92494 -106298 -90881
21006i0881K0897J23144O8465k4795J6335p30l4057K7899P134j300J3902N2969
$$ -90881 -69984 53160 121625 96830 113165 112435 78378 106277 113411 112111 126013 178982
20994A78982p682J0104o6883j6997q93K559p453j2978l0497o513p680l2277O368
$$ 178982 171300 181404 114521 97524 96631 99190 91737 78759 48262 41749 34069 1792 8160
20981H160L0357P7552J2962n7165l1146j7650L839L7237M4710l3342q298l5079
$$ 8160 38517 116069 129031 71866 40720 23070 26909 64146 108856 75514 67216 32137
20969C2137k6056j4031k814O4244N9626l6537M4887O1597k4072o2911m1188J9320
$$ 32137 6081 -7950 -10764 53480 113106 76569 121456 183053 158981 96070 54882 74202
20957G4202j3350L5171j1074K2963j7962l3584r5872k3804P5548R8153K2897k8058
$$ 74202 60852 96023 84949 107912 89950 56366 -39506 -63310 12238 110391 133288 105230
20945A05230n2897k0207k5028l0302p744N984K183l979N7700l8669q8116k927
$$ 105230 52333 32126 7098 -23204 -30948 -24964 -22781 -26760 30940 -7729 -95845 -98772
20933i8772j5318O489O7920J2573P4138M3667r0956k9569N6008J8817K6036j1531
$$ -98772 -114090 -107601 -39681 -27108 47030 90697 -259 -29828 26180 44997 71033 59502
20921E9502k412M9113J8283k6459J520K256j6816j8940n8936j8772J01181O1731
$$ 59502 57090 106203 124486 98027 99547 101803 84987 66047 7111 -11661 89520 151251
20909A51251l2083k9256m8602J865l7o0076L2353O0868L8511l8258o6942m2913
$$ 151251 119168 89912 41310 43175 43138 -16938 15415 76283 114794 76536 9594 -33319
20897c3319k2091L4407l2948l0687M9933M5274N0474p759j8801L4427k4908L5902
$$ -33319 -55410 -21003 -53951 -84638 -34705 10569 61043 53284 34483 68910 44002 79904
20885G9904J1535M4303N242n6592n9011m10P492o9670k0864M3395m3221j2303
$$ 79904 91439 135742 140984 84392 25381 24971 32463 -37207 -58071 -14676 -57897 -70200
20873g0200m0326N1348N3024J941N2856J9824o0117m7615L3784l442N8851n744
$$ -70200 -110526 -59178 -6154 -4213 48643 68467 8350 -39265 -5481 -8923 49928 44184
20861D4184m7009n109R322J3279j1806o5496N168l3288J7587K6284L8695N2171
$$ 44184 -2825 -7934 1388 14667 2861 -62635 -57467 -90755 -73168 -46884 -8189 43982
20849D3982L6367m949J2672Q748J9709l4195m6751N442J9053K3053M4105K8375
$$ 43982 80349 75400 88072 96820 116529 82334 35583 41025 60078 83131 127236 155611
20837A55611l0138m3300R048j3319n1333n742K8223m140M8645J517k3477M012
$$ 155611 125473 82173 91221 77902 26569 20827 49050 44910 93555 95072 71595 75607
20825G5607K4434N1960L3649N510p2444n4907k9340k3367k7079P389q177k4637
$$ 75607 100041 152001 185650 191160 118716 63809 34469 11102 -15977 -8588 -16765 -41402
20813d1402L055K7916j3696l640p377J3300K9799L8109N8848j8389m4130m7532
$$ -41402 -38347 -10431 -24127 -27767 -35144 -21844 7955 46064 104912 86523 42393 -5139
20801e139j7052J9620q091j7116K3064K3577k1563j4545m0253J5308j992N4848
$$ -5139 -22191 -2571 -10662 -27778 -4714 18863 -2700 -17245 -57498 -42190 -44182 10666
20789A0666P2261J2380j894j2490m7569n1479K1774L2121m3966j247P1130P690
$$ 10666 82927 95307 93413 80923 33354 -18125 3649 35770 -8196 -9443 61687 69377
20777F9377M4807q162l0037l3098k5733K6386k7081L4557P2996K1105p428r991
$$ 69377 114184 106022 75985 42887 17154 43540 16459 51016 124012 145117 137689 127698
20765A27698j5086o5872k7116O9714L7978M4732K2181p1338o2280J1580N0793
$$ 127698 112612 46740 19624 89338 127316 172048 194229 122891 60611 72191 122984
20754A22984l4027m1876l3267J1118K2861K9209n118J3527n132K2170K8947o9640
$$ 122984 88957 47081 13814 24932 47793 77002 71884 85411 80279 102449 131396 61756
20742F1756R273K3062k752l1371n5463k7759J9089l2545j6427K3955O3280K7609
$$ 61756 71029 94091 91339 59968 4505 -23254 -4165 -36710 -53137 -29182 34098 61707
20730F1707o3062l6359k7675K3771L8996J5948L1533L9817M558J1267k3638m2760
$$ 61707 -1355 -37714 -65389 -41618 -2622 13326 44859 84676 89234 100501 76863 34103
20718C4103k3346K0419j0416K0476L1341J3544k9382n308K6311j437J9825M3586
$$ 34103 10757 31176 20760 41236 72577 86121 56739 51431 77742 76305 96130 139716
20706A39716m3931m6649j3362j7120J2975k765K6932P86m4496p2637m9051M2361
$$ 139716 95785 49136 35774 18654 31629 28864 55796 56582 12086 -60551 -109602 -67241
20694f7241K9015O8061M7590n8757m5635o067K752P458l4849r901P5434J8831
$$ -67241 -38226 29835 77425 18668 -26967 -33034 -30282 -22824 -57673 -67574 7860 26691
20682B6691J4631K3073K9809k5130J2782K0169n3336q5587o510K2549L0470N6774
$$ 26691 41322 64395 94204 69074 81856 102025 48689 -36898 -43408 -20859 9611 66385
20670F6385J0722l0891K5296N98O2118R591n8393K959p28M2792l8861q7035j5644
$$ 66385 77107 46216 71512 72110 134228 143819 85426 88385 87657 130449 91588 4553 -11091
20657a1091j0800J4446o8567l4045O4265L6283J03028M1086Q83O885j4785k168
$$ -11091 -21891 -7445 -76012 -110057 -45792 -9509 93519 134605 135488 142373 127588 125420
20645A25420l0626m6463k2748M407o2385J0116K1003k0918j3027o323L7229J7211
$$ 125420 94794 48331 25583 29990 -32395 -22279 -1276 -22194 -35221 -41544 -4315 12896
20633A2896M0969R80o60L3950M1278K9810p7125l268O901j3954q787j0382j6663
$$ 12896 53865 54845 54185 88135 129413 159223 82098 78830 85731 71777 62990 52608 35945
20620C5945K179n012k890j4219J9002P1297q2484p4879L7647J400q4961K34Q3055
$$ 35945 38124 33112 30222 16003 35005 106302 23818 -51061 -13414 -12014 -96975 -96741 -13686
20607a3686R732J667M6222L1402m1878n5932l7479q003m0616K5053L8084M4770
$$ -13686 -3954 -2287 43935 75337 33459 -22473 -59952 -67955 -108571 -83518 -45434 -664
20595f64P1086L4421o0746m6336J814m670M9819J9488m5379m9758k898K4870L1519
$$ -664 70422 104843 44097 -2239 -425 -5095 44724 64212 18833 -30925 -33823 -8953 22566
20582B2566K8485J9002k7470l0588k8859m12k4506N0449P2984p389R755p829j1325
$$ 22566 51051 70053 42583 11995 -16864 -17276 -41782 8667 81651 74262 84017 76188 64863
20569F4863j0569Q6895K7987k3639N980J9404j4291q4296p3981l643L4674J4702
$$ 64863 54294 141189 169176 145537 151517 170921 156630 72334 -1647 -5290 29384 44086
20557D4086J3884l0912K154J8376K9617R744k1381l292N891J0440k1503L6590
$$ 44086 57970 27058 29212 47588 77205 86949 65568 62276 68167 78607 57104 93694
20545I3694K5713k2213j4382O4265O9493j3768j4583j7139j377n9530m0057n45
$$ 93694 119407 97194 82812 147077 216570 202802 188219 171080 169703 110173 70116 69571
20533F9571K5313J0483j7093M9430k634p0635n585J2202l2283q2108L3255K3349
$$ 69571 94884 105367 88274 137704 135070 64435 58850 71052 38769 -43339 -10084 13265
20521A3265l4308k2699L660L8417M4148K6635K1013j7843p760q2281j174Q4510
$$ 13265 -21043 -43742 -40082 -1665 42483 69118 90131 72288 64528 -17753 -18927 65583
20509F5583K4371L4313l3180k1199N0187M4773j9115m9142k3540n442m2818J6530
$$ 65583 89954 124267 91087 69888 120075 164848 145733 96591 73051 67609 24791 41321
20497D1321R515n5294k2586J441k0773k1288L8826N8594j5091J414k560J6280
$$ 41321 50836 -4458 -27044 -25603 -46376 -67664 -28838 29756 14665 16079 13519 29799
20485B9799L6184J3110K3583j9029L3643O0079q536m160l0763l5471L4641J0216
$$ 29799 65983 79093 102676 83647 117290 177369 168833 164673 133910 98439 133080 143296
20473A43296j8372L3092L0526J3387j4262k7379J7805k4448q058K3537J5091j0941
$$ 143296 124924 158016 188542 201929 187667 160288 178093 153645 145587 169124 184215 173274
20461A73274j2525j36J7270n0597p9413J9855N6679k2115m846K8968j7258m9266
$$ 173274 160749 160613 177883 127286 47873 67728 124407 102292 97446 126414 109156 59890
20449E9890o521Q395N2813J1645R391m9171o4833j27259L3155J07937Q2777o5193
$$ 59890 53369 61764 114577 126222 135613 86442 21609 -105650 -72495 35442 118219 53026
20437E3026m2685M1587K0665J9337k0922J426Q927n3972k5061K7628L7270L1362
$$ 53026 10341 51928 72593 91930 71008 72434 81361 27389 2328 29956 67226 98588
20425I8588k424K9684k545m2101j9516M1406P0791l9662j58569M1459O6636M0091
$$ 98588 96164 125848 123303 81202 61686 103092 173883 134221 -24348 17111 83747 123838
20413A23838J1103l5706j9116M5147L8731L1873n2657N13m312q8068M9839O9187
$$ 123838 134941 99235 80119 125266 163997 195870 143213 143726 139414 51346 101185 170372
20401A70372K8563j972m3540j04776k8943L1480n910R823K5466L6153L0022Q980
$$ 170372 198935 196963 153423 48647 19704 51184 45274 55097 80563 116716 146738 155718
20389A55718L6393j1646k1400J4237n769j7622k1132m2094J223k7209M572J862
$$ 155718 192111 180465 159065 173302 167533 149911 128779 86685 87908 60699 65271 67133
20377F7133K0233l4684O024M0822k5556j6015K8356K9718K210J2440l3382j6457
$$ 67133 87366 52682 58706 99528 73972 57957 86313 116031 118241 130681 97299 80842
20365H0842L4236j8861L2123P250j0750j4459k9523R98K2611k3740n4019J0823
$$ 80842 115078 96217 128340 135590 124840 110381 80858 81856 104467 80727 26708 37531
20353C7531N2583j040o350M5173j8691n9013l8003K906k673J6796Q9303K4218
$$ 37531 90114 89074 82724 127897 109206 50193 12190 15096 12423 29219 118522 142740
20341A42740K1729K0982j5176j4283L4759k1106m0698m8989j7367J0606m886k7407
$$ 142740 164469 185451 170275 155992 190751 169645 128947 79958 62591 73197 68311 40904
20329D0904m5985N064N1992l1794o9466J4558N0812K7186J1660J1571m3810k2249
$$ 40904 -5081 -17 51975 20181 -49285 -34727 16085 43271 54931 66502 22692 443
20317D43K4526K0285J8758L7121J4458K5170N1422J9959m9961p2242m7735l9342
$$ 443 24969 45254 64012 101133 115591 140761 192183 212142 162181 89939 42204 2862
20305B862O971O8220L4365k7210K5932o768l1451j8196K4252j9710M264k1061
$$ 2862 9833 78053 112418 85208 111140 104372 72921 54725 78977 59267 63531 42470
20293D2470L6043M9729L2342J805l5390j9576K2280K3569p4653k5390k1544k707
$$ 42470 78513 128242 160584 162389 126999 107423 129703 153272 78619 53229 31685 28978
20281B8978M7996J3965K1645K9999k4817J2316j295k2632K645l1020J7766o3523
$$ 28978 76974 90939 112584 142583 117766 130082 128787 106155 108800 77780 95546 32023
20269C2023J3713L1727L0564k1131n044n709K529O431J3636N4091O3122l6057
$$ 32023 45736 77463 108027 86896 81852 76143 78672 85103 98739 152830 215952 179895
20257A79895q2070K570k1549O2931l0983n0907K4858K7130j1192j4375N8003J7362
$$ 179895 97825 100395 78846 141777 110794 59887 84745 111875 100683 86308 144311 161673
20245A61673K9473m5177m5138n8630l1606K1374K5814N5741k0769o9924K0815
$$ 161673 191146 145969 100831 42201 10595 31969 57783 113524 92755 22831 43646
20234D3646J7631r475L6376N6683K6278J6869m3199q2856K1584J1702j020l6465
$$ 43646 61277 51802 88178 144861 171139 188008 144809 61953 83537 95239 94219 57754
20222E7754l5140M5883L6167k3403O6244K9160J4740j16549p1579M1417N8114
$$ 57754 22614 68497 104664 81261 147505 176665 191405 74856 3277 44694 102808
20211A02808L6671J9518l4407J5999N2768k0772l6564m4338j9244J1436j501k6916
$$ 102808 139479 158997 124590 140589 193357 172585 136021 91683 72439 83875 82374 55458
20199E5458R964N4983l1700l4425M2665O637K1045J0763l1878O1084P3046n9330
$$ 55458 65422 120405 88705 54280 96945 103582 124627 135390 103512 164596 237642 178312
20187A78312o8336p2672j8852K7104N3926q667r749o434l3087L3426K0359L1344
$$ 178312 109976 37304 18452 45556 99482 90815 81066 74632 41545 74971 95330 126674
20175A26674j2842m1359m3923K5668r601j2577k4586l655l9852L6953O9443P2512
$$ 126674 113832 72473 28550 54218 44617 32040 7454 3799 -36053 900 70343 142855
20163A42855N464K1378J1114J3379P954j0160K5581M5219o6688l5086p4868k0538
$$ 142855 148319 169697 180811 194190 202144 191984 217565 262784 196096 161010 86142 65604
20151F5604j8495l237k0255K9193L2520l4355m1621O1081K4343J9214M940L8328
$$ 65604 47109 43872 23617 52810 85330 50975 9354 70435 94778 113992 118932 157260
20139A57260K3438k0688k9967j7299R614O317J0885l9612M1334o534m6694K10
$$ 157260 180698 160010 130043 112744 122358 128675 139560 99948 141282 134748 88054 88264
20127H8264r195k874J5509k803L9331O5231J6150p5295p6890N570K3390n2184
$$ 88264 79069 76195 91704 88901 128232 193463 209613 134318 57428 62998 86388 34204
20115C4204r405J1265J6706K6524M191l9892j2958L9270O5941o006j1319L3698
$$ 34204 24799 36064 52770 79294 83485 43593 30635 69905 135846 129840 118521 152219
20103A52219j7452J3314K2007N8304j6119m6865l4578j2595O704J1028j6689j2040
$$ 152219 134767 148081 170088 228392 212273 165408 130830 118235 124939 135967 119278 107238
20091A07238K1996M3619o327J7561O06K3656N279K2463L623K1130M4445M2234
$$ 107238 129234 172853 166526 184087 184693 208349 213628 236091 239714 260844 305289 347523
20079C47523o185L8529P0207P6143J40017K13738J65983J94881L09606M23365
$$ 347523 341338 379867 450074 526217 666234 879972 1045955 1240836 1550442 1973807
20069A973807K98552J27840j10720k01149k79326l07972k59840k27899k37810
$$ 1973807 2272359 2400199 2289479 2088330 1809004 1501032 1241192 1013293 775483
20060G75483j30944j17788p5737q7065j7386J0819K7473l420P946j670K4745o7796
$$ 775483 644539 526751 451014 363949 346563 357382 384855 381435 389381 387711 412456 344660
20048C44660j22977p507j53P6424l7805q954L0643K678J5269m1398o0141j0718
$$ 344660 221683 214176 214023 290447 252642 243688 274331 277009 292278 250880 190739 180021
20036A80021K422J3824j0852J3169J5992K3662L9436l9178k6273j1759L462K1307
$$ 180021 182443 196267 185415 198584 214576 238238 277674 238496 212223 200464 203926 225233
20024B25233J0713J8121k9907m1130m1895n806M3122K2104J4805Q462M4433J006
$$ 225233 235946 254067 224160 183030 141135 135329 178451 200555 215360 223822 268255 269261
20012B69261k2524n9299m4654k3181J9330P0710M4969J5165O2935J47810J60606
$$ 269261 246737 187438 142784 119603 138933 209643 254612 269777 332712 480522 641128
20001F41128J48062K26451J15348j2973L2711k586j01703j28941o5946r5380k2304
$$ 641128 789190 1015641 1130989 1118016 1150727 1148141 1046438 917497 851551 756171 733867
19990G33867l0537P0926R1700J44483J44858M8506M479p1597j0214k1137l3881
$$ 733867 703330 774256 865956 1010439 1155297 1203803 1208282 1136685 1126471 1105334 1071453
19979A071453m6797q3384j17391j50894q4428n4986K5711p3518n3063k4916M8633
$$ 1071453 1024656 941272 823881 672987 588559 533573 559284 485766 432703 407787 456420
19968D56420r462m5786n8316j8931P4040M105j1726j4433R716n0581J4935P1221
$$ 456420 446958 401172 342856 323925 397965 402070 390344 375911 385627 335046 349981 421202
19956D21202N3721M5813k2800l5164J904j1863k1580M9135J8436k3733M7073J76145
$$ 421202 474923 520736 497936 462772 464676 452813 431233 480368 498804 475071 522144 698289
19944F98289K75320K67673J36071m994q832j8108l1456j755N728J6425k822p5244
$$ 698289 973609 1241282 1377353 1372359 1363527 1345419 1313963 1312208 1317936 1334361 1331539 1256295
19932A256295l0206P3976K6780L8177j09358k03372o0189j9142r5433p8949j27333
$$ 1256295 1226089 1300065 1326845 1365022 1255664 1052292 992103 972961 877528 798579 671246
19921F71246j02172j0781J42l1219n4405l8741q6113J1644M8837k3222k4573J6509
$$ 671246 569074 558293 558435 527216 472811 434070 347957 359601 408438 385216 360643 377152
19909C77152J8810k675K9114J6884m5331l8840m6331J2542R010j3679L1397N2992
$$ 377152 395962 393287 422401 439285 393954 355114 308783 321325 330335 316656 348053 401045
19897D01045L8896l053o8846l8519N2636R8770n223k0592m2131m6336K7866K1266
$$ 401045 439941 436888 368042 329523 382159 480929 475706 455114 412983 366647 394513 415779
19885D15779n130p7333l964j016J6298k57j592o066O789J588K9228o9063n8914
$$ 415779 410649 333316 329352 328336 344634 344377 342785 336719 343508 345096 374324 305261 246347
19872B46347j4968l7012K4634O340j9869l7896j7595o941J3651Q4346Q629j5239
$$ 246347 231379 194367 219001 225341 205472 167576 149981 143040 156691 241037 249666 234427
19860B34427k8519k9937l5375j9516N0475P9119K9346k28j6352l8536o7828k3507
$$ 234427 205908 175971 140596 121080 171555 250674 280020 279792 263440 224904 157076 133569
19848A33569K2997O0333N2350O6508K4871M5292j4505m8830k9637J5446K2339
$$ 133569 156566 216899 269249 335757 360628 405920 391415 342585 312948 328394 350733
19837C50733K3457K1273L1248k6959j4795l6725l3822k4640M6339N0698P5124
$$ 350733 374190 395463 426711 399752 384957 348232 314410 289770 336109 386807 461931
19826D61931P5482L3148j52j6907Q453N0036q7107p423L1393l4799j3024m2682
$$ 461931 537413 570561 570409 553502 561955 611991 524884 517461 548854 514055 501031 458349
19814D58349n3643j6106M7408j554K443K4875m3673l3148l9249R529N8425L538
$$ 458349 404706 388600 436008 434454 436897 461772 418099 384951 345702 355231 413656 417194
19802D17194J8085n7596p6055j0506j1035L8621j8003M4144O3569J8467k0383
$$ 417194 435279 377683 301628 291122 280087 318708 300705 344849 408418 426885 406502
19791D06502N5533M7032o1815j1543q3138j8103j4935j4838P1606k746k2680L7233
$$ 406502 462035 509067 447252 435709 352571 334468 319533 304695 376301 373555 350875 388108
19779C88108K7955o825j2072j449L7488J1281P9356O4451K06P559M1q552L3952
$$ 388108 416063 409238 397166 395717 433205 444486 523842 588293 588499 596058 596099 587547 621499
19766F21499K1315m5142p6143k9596K788J2343j8972M934O1880p422p7989k325
$$ 621499 642814 597672 521529 491933 494721 507064 488092 493026 554906 547484 469495 467170
19754D67170l9920j1076J9767K4855l3518Q552N8467L1386j1775J7340k779J2613
$$ 467170 427250 416174 435941 460796 427278 435830 494297 525683 513908 531248 528469 541082
19742E41082K5396j5309l564n5032m9032J1803O9243K3952M8577J2723j2357r0197
$$ 541082 566478 551169 547605 492573 443541 455344 524587 548539 597116 609839 597482 507285
19730E07285q7998m3379m4158o194p65l7249L0233O5747O6343M823L8997J08471
$$ 507285 419287 375908 331750 325556 324791 287542 317775 383522 449865 454688 493685 602156
19718F02156j8414l6343L443o6145o5511R150j2329k5625n3287N7599O0762j6564
$$ 602156 583742 547399 550842 484697 419186 428336 416007 390382 337095 394694 455456 438892
19706D38892l0081o125K1673M9500k535m7183Q28k7999j4983N7528n804m8726
$$ 438892 408811 402686 424359 473859 471324 424141 424969 396970 381987 439515 433711 384985
19694C84985n957m223O3841k7952L0661j5901M7849q192K632K7888l3208j1158
$$ 384985 379028 374805 438646 410694 441355 425454 473303 465111 467743 495631 462423 451265
19682D51265K2143M4161N0442P0389J7609L3759o23l3885m2322M4595M6550k4020
$$ 451265 473408 517569 568011 638400 656009 689768 689145 655260 612938 657533 704083 680063
19670F80063j5454J0545J6942L9414P9770N7280j4500j8101O3386N6926k1855
$$ 680063 664609 675154 692096 731510 811280 868560 854060 835959 899345 956271 934416
19659I34416j0601O8050O7281J13890P5654P0241l550N1776O8848l2790j15540
$$ 934416 923815 991865 1059146 1173036 1248690 1318931 1315381 1367157 1436005 1403215 1287675
19648A287675R5330N7501N6049O3543J8858L5533m0062j01248q8390j06640m6583
$$ 1287675 1383005 1440506 1496555 1560098 1578956 1614489 1574427 1473179 1384789 1278149 1231566
19637A231566j5789o0427q0536l2128J04451p029o6996Q507m9317m0076J3948
$$ 1231566 1215777 1155350 1074814 1042686 1147137 1140108 1073112 1081619 1032302 992226 1006174
19626A006174l3085L3575K8267l2572P8652O6209m8766o4154k0767m1089r8339
$$ 1006174 973089 1006664 1034931 1002359 1081011 1147220 1098454 1034300 1013533 972444 874105
19615H74105j6505J2752L831n7250L0382Q047P2731J61398J56825J23596L9316
$$ 874105 857600 870352 874183 816933 847315 855362 928093 1089491 1246316 1369912 1409228
19604A409228M0896L3970P1856J17072K27944K17200J64037N6809k7615j55546
$$ 1409228 1450124 1484094 1555950 1673022 1900966 2118166 2282203 2339012 2311397 2155851
19594B155851j06490o8886l5136L3605K6581J11253J56822J27260P6293m3202
$$ 2155851 2049361 1980475 1945339 1978944 2005525 2116778 2273600 2400860 2477153 2433951
19584B433951j38014j22753j03086k49891k27547p7480m9053k1750q8417q1926
$$ 2433951 2295937 2173184 2070098 1820207 1592660 1515180 1466127 1444377 1355960 1274034
19574A274034o4825p9584m409o28K2284m0905l4909K4369J7037P5900k2300k0674
$$ 1274034 1209209 1129625 1125216 1124588 1146872 1105967 1071058 1095427 1112464 1188364 1166064 1145390
19562A145390k114n3722r1949p7540j13756n0610j54384j62600j3104O6112L6418
$$ 1145390 1143276 1089554 997605 920065 806309 755699 601315 438715 425611 491723 528141
19551E28141M3241O3794J0928Q2739R9667N6198L6618K4138l1575P9955J4311
$$ 528141 571382 635176 646104 728843 828510 884708 921326 945464 913889 993844 1008155
19540A008155n7449k1312J23946J74165J40047J73925J98478J26098O280p7104
$$ 1008155 950706 929394 1053340 1227505 1367552 1541477 1739955 1866053 1872333 1795229
19530A795229p8012j05897j56094m3658J3570L0216J02063R5696O0712N8681L7215
$$ 1795229 1717217 1611320 1455226 1411568 1425138 1455354 1557417 1653113 1713825 1772506 1809721
19519A809721j0546m3572J1532j8831n4974l1607n3320K5220N4146K8867J14404
$$ 1809721 1799175 1755603 1767135 1748304 1693330 1661723 1608403 1633623 1687769 1716636 1831040
19508A831040R8146R3638J10461L7099K3548J11920J16161J24116J27058J14669
$$ 1831040 1929186 2022824 2133285 2170384 2193932 2305852 2422013 2546129 2673187 2787856
19498B787856J81160J37814N6196M1097O945Q936M9263O4840J18842K99555M65798
$$ 2787856 2969016 3106830 3163026 3204123 3211068 3220004 3269267 3334107 3452949 3752504 4218302
19487D218302O52250P87818Q73789P25685N58040O03533P07970P11716Q63066
$$ 4218302 4870552 5658370 6532159 7257844 7815884 8419417 9127387 9839103 10702169
19478A0702169J298182K020938L152998N024723P002184O515787L320515J096650
$$ 10702169 12000351 14021289 17174287 22199010 29201194 35716981 39037496 40134146
19470D0134146M75666K44590K53726J896995N303854J0247375J7949571L1129968
$$ 40134146 40609812 40854402 41108128 43005123 48308977 58556352 76505923 107635891
19462A07635891M9973237N9325364L8157349J4549153L910292o071196k3419698
$$ 107635891 157609128 216934492 255091841 269640994 273551286 267480090 244060392
19455B44060392l6803460l5757568k9312260k2339631j5074349n561220L796480
$$ 244060392 207256932 171499364 142187104 119847473 104773124 99211904 103008384
19448A03008384O464118k28653p158185j0227707j1805328j3601789j3320452
$$ 103008384 109472502 109243849 102085664 91857957 80052629 66450840 53130388
19441E3130388j0468086p263770m808565l220117k178798j547664j169698q52808
$$ 53130388 42662302 35398532 30589967 27369850 25191052 23643388 22473690 21620882
19433B1620882n00209l39875j52939J33380L35159L84008L99562O19200J093486
$$ 21620882 21120673 20780798 20627859 20761239 21096398 21480406 21879968 22499168 23592654
19424B3592654J852925K918571M386525O669442J0467685J6096792K1115115J8375284
$$ 23592654 25445579 28364150 32750675 39420117 49887802 65984594 87099709 105474993
19416A05474993Q200852N70399k284374l661255l700403J407283J2028030K6399912
$$ 105474993 113675845 114246244 111961870 108300615 104600212 106007495 118035525 144435437
19408A44435437L9599850M7702364N6067440O3025765N1258103M933729l3643146
$$ 144435437 184035287 231737651 287805091 350830856 402088959 407022688 373379542
19401C73379542m8269438n2481086n8071025n4359784l9689261k4477206j3362257
$$ 373379542 325110104 272629018 214557993 160198209 120508948 96031742 82669485
19394H2669485n144067R23641K184662k300741o200773p470036q077859r144009
$$ 82669485 77525418 78449059 80633721 78332980 72132207 64662171 56584312 47440303
19386D7440303q592873o556921m547142l082638k094850j313046q25594q09114
$$ 47440303 38847430 32290509 27743367 24660729 22565879 21252833 20427239 19618125
19378A9618125r93827j090090j093864j193266j089811r05283o56437m30456k51190
$$ 19618125 18624298 17534208 16440344 15247078 14157267 13251984 12595547 12165091 11913901
19369A1913901l7072J54310K65722L20498J94122P9237p2163o9749J4469J16760
$$ 11913901 11876829 12031139 12296861 12617359 12811481 12890718 12818555 12748806 12763275 12880035
19359A2880035K99414N23457P75932J043832J400850J920666K325716K723771
$$ 12880035 13179449 13702906 14478838 15522670 16923520 18844186 21169902 23893673
19351B3893673L058458L606009M465136N683185P677452J0596687J5034666K1889565
$$ 23893673 26952131 30558140 35023276 40706461 48383913 58980600 74015266 95904831
19343I5904831L2757719M8790417O7173605P6891416O7174253L8763320R55844
$$ 95904831 128662550 177452967 244626572 321517988 388692241 427455561 428411405
19336D28411405l2757917n4574019o3950004o2510741n2659303l9405381k7566957
$$ 428411405 395653488 341079469 277129465 214618724 161959421 122554040 94987083
19329I4987083j8886387j3140447r309827o765094n154807m284927l693395l241795
$$ 94987083 76100696 62960249 53650422 46885328 41730521 37445594 33752199 30510404
19321C0510404k897275k601275k282702j972957j563515j214913j002439q25132
$$ 30510404 27613129 25011854 22729152 20756195 19192680 17977767 16975328 16150196
19313A6150196o44895n49279o27228p67058q11411r01201r51575q70821p95503
$$ 16150196 15505301 14956022 14328794 13561736 12750325 11849124 10897549 10026728 9231225
19304I231225p52642o31014m66523l13729l23801k41816j28192q5744p4483j90380
$$ 9231225 8478583 7847569 7381046 7067317 6743516 6501700 6373508 6287764 6213281 6022901
19294F022901l22940l01215k98124l00009l18723l01170k42004j75879j72440
$$ 6022901 5699961 5398746 5100622 4800613 4481890 4180720 3938716 3762837 3590397
19285C590397j62381j24237o8204n5866l2437m9005n1881j56480k39181k46184
$$ 3590397 3428016 3303779 3235575 3179709 3147272 3098267 3046386 2889906 2650725 2404541
19275B404541j74818j83944j49255n6650j6203J7976L0495J21663J77176J51277
$$ 2404541 2229723 2045779 1896524 1839874 1823671 1841647 1872142 1993805 2170981 2322258
19265B322258J17532R0045R4399K59274K52979L24298K93754K11527J09314n6312
$$ 2322258 2439790 2529835 2624234 2883508 3136487 3460785 3754539 3966066 4075380 4019068
19255D019068j44901j91579j08123n09q3982r3335j70850k72442l77192l40972
$$ 4019068 3874167 3682588 3574465 3573956 3489974 3396639 3225789 2953347 2576155 2235183
19245B235183k58266k00503j29831q5114o7618k0446N4406J7703j3311n5082p1105
$$ 2235183 1976917 1776414 1646583 1561469 1493851 1473405 1527811 1545514 1532203 1477121 1406016
19234A406016j19838q5946m7172q5587m0255k920o1800Q05L9152Q1373N5029R489
$$ 1406016 1286178 1200232 1153060 1067473 1027218 1024298 962498 963303 1002455 1083828 1138857 1148346
19222A148346l4217k9006l7852o6367j22262m9307l7479l8076K5575O5586k3461
$$ 1148346 1114129 1085123 1047271 980904 858642 809335 771856 733780 759355 824941 801480
19211H01480j2147K9039K9001j3078p6269q1277m8822L8972j9070L3487M6292
$$ 801480 789333 818372 847373 834295 758026 676749 627927 666899 647829 681316 727608
19200G27608R4944R0012J67401K02808J44340R8332P0753M1210l5760q1690l3125
$$ 727608 822552 912564 1079965 1282773 1427113 1525445 1596198 1637408 1601648 1519958 1486833
19189A486833P89L3834P092J10866K3990L9330m4195j61379j19844o8464j28592
$$ 1486833 1487622 1521456 1528548 1639414 1663404 1702734 1658539 1497160 1377316 1308852 1180260
19178A180260p5813K0983O8871M8341k5511K7934J10316L2365n2724P0304L6783
$$ 1180260 1104447 1125430 1194301 1242642 1217131 1245065 1355381 1387746 1335022 1405326 1442109
19167A442109N5219J59530J20591J68751J83885J98875J70503J47888J97843J64287
$$ 1442109 1497328 1656858 1777449 1946200 2130085 2328960 2499463 2647351 2845194 3009481
19157C009481J18251J89011L33182M14332N75916O55170P51426P89298O84336
$$ 3009481 3127732 3316743 3649925 4064257 4640173 5295343 6046769 6836067 7520403
19148G520403N85878L79373K69113J16570J48643L78582O83762R67780J404130
$$ 7520403 8106281 8485654 8754767 8871337 9019980 9398562 10082324 11050104 12454234
19139A2454234K093038L067968M294808O170173Q733226J0461383R199567M996802
$$ 12454234 14547272 17615240 21910048 28080221 36813447 47274830 56474397 61471199
19131F1471199J436984P9564R3931J014410M339141J0833643K1054265L6747812
$$ 61471199 62908183 62987747 63081678 64096088 68435229 79268872 100323137 137070949
19123A37070949N7830619P3319292O5241924L7367498J1266841q124025k8890494
$$ 137070949 194901568 268220860 333462784 370830282 382097123 373973098 345082604
19116C45082604m7862099n3792020m7490440l7307124k6797335j5183407l191752
$$ 345082604 297220505 243428485 195938045 158630921 131833586 116650179 113458427
19109A13458427N709733P028192R52784o568425j1227370j4003003j5769382j5399590
$$ 113458427 119168160 126196352 127149136 120580711 109353341 95350338 79580956 64181366
19101F4181366j2744380r242820o316862m335596l001825k040453j270618p04718
$$ 64181366 51436986 42194166 35877304 31541708 28539883 26499430 25228812 24524094
19093B4524094l91801l43329m25150n04898m19727m21134k41331K4084N41599
$$ 24524094 24132293 23788964 23363814 22858916 22439189 22018055 21776724 21800808 22342407
19084B2342407J151033K137599L724682O081462R785016J4220742J6801612J3870352
$$ 22342407 23493440 25631039 29355721 35437183 45222199 59442941 76244553 90114905
19076I0114905O744190P72420k029915k688700p89821N601460J5663787K4338176
$$ 90114905 96859095 97631515 95601600 92912900 92123079 97724539 113388326 137726502
19068A37726502K8849169L2442409L7667518L5802616J5271961j2695172k9817793
$$ 137726502 166575671 199018080 236685598 272488214 287760175 275065003 245247210
19061B45247210l6011010l9440270l9709812l3134897k2998151j3975034p470709
$$ 245247210 209236200 169795930 130086118 96951221 73953070 59978036 52507327
19054E2507327k618830L92954P72305j123979l136104m295404n079836n641983
$$ 52507327 49888497 50281451 51053756 49929777 46793673 42498269 37418433 31776450
19046C1776450n368280m403538l277241k381832j814641j351332r67594p23903
$$ 31776450 26408170 22004632 18727391 16345559 14530918 13179586 12211992 11488089
19038A1488089n12119m61644m11076m94532o12255o69663p45781o63686n68155
$$ 11488089 10975970 10514326 10103250 9608718 8996463 8326800 7581019 6917333 6349178
19029F349178n12666n44569m41056l79973k68223j49472k24989j64446j47496
$$ 6349178 5836512 5291943 4850887 4470914 4202691 4053219 3828230 3663784 3516288
19020C516288k12234j53403j34287j71977j58201j41585n1219n9398r2262j24919
$$ 3516288 3304054 3150651 3016364 2844387 2686186 2544601 2493382 2433984 2341722 2216803
19010B216803r0769j07130j33641p5279o7020q5677n8859m5643o6349o6854P6047
$$ 2216803 2126034 2018904 1885263 1809984 1742964 1657287 1598428 1552785 1486436 1419582 1495629
18999A495629M5473L1685L1661j6751k1871j2303K2112p1014r1596o9421j25176
$$ 1495629 1541102 1572787 1604448 1587697 1565826 1553523 1575635 1504621 1413025 1343604 1218428
18988A218428j26188l3783J9491M7556N4079J5398L4577L0973J4331R272k7710
$$ 1218428 1092240 1058457 1077948 1125504 1179583 1194981 1229558 1260531 1274862 1284134 1256424
18977A256424J3831n4314r9848o4239O078O9283Q2782P5830K3338J0458J2897
$$ 1256424 1270255 1215941 1116093 1051854 1057932 1127215 1209997 1285827 1309165 1319623 1332520
18966A332520m6747j31455j03981p8027q6726n5267q3986j53093r2623L9524M6242
$$ 1332520 1285773 1154318 1050337 972310 885584 830317 746331 593238 500615 540139 586381
18955E86381n7917k8753J1867m3984J7339j991j4735J1709l892l2469k8786l3187
$$ 586381 528464 499711 511578 467594 484933 482942 468207 479916 476024 443555 414769 381582
18943C81582L4176N5451K4184J4377Q7333R8175K9530m3922o2293n2719m5049
$$ 381582 415758 471209 495393 509770 597103 695278 724808 680886 618593 565874 520825
18932E20825n537k377N0107J43250J63086J00464M4024J02728J44643J82315J29150
$$ 520825 515288 512911 563018 706268 869354 969818 1013842 1116570 1261213 1443528 1572678
18921A572678l8956N386p4934q8849Q096J24413J32544M4325K3248J66490J53457
$$ 1572678 1533722 1539108 1464174 1375325 1383421 1507834 1640378 1684703 1707951 1874441 2027898
18910B027898N3585n9733j38361j64107k24463k51272k38013j39835j37456k8579
$$ 2027898 2081483 2021750 1883389 1719282 1494819 1243547 1005534 865699 728243 699664
18900F99664J3340K6605K7436l7692o9492p5198o6310Q836l7043j2630k6220j6435
$$ 699664 713004 739609 767045 729353 659861 584663 518353 527189 490146 477516 451296 434861
18888D34861m0828k738J0133J3931j3208k6829r1088m4319N3591L4747P0607Q0196
$$ 434861 394033 391295 401428 415359 402151 375322 284234 239915 293506 328253 398860 479056
18876D79056J8557l820M3911J23098M4806J8332N2638J7795N6489J44607Q7143
$$ 479056 497613 493793 537704 660802 705608 723940 776578 794373 850862 995469 1082612
18865A082612M1006L3399L4195P140o2623j01427j19741q9982n5264k8675l4593
$$ 1082612 1123618 1157017 1191212 1198352 1135729 1034302 914561 824579 769315 740640 706047
18854G06047L6637J01024J83428M2680L13m1275j01982j34777j16749j00608n7386
$$ 706047 742684 843708 1027136 1069816 1070129 1028854 926872 792095 675346 574738 517352
18843E17352j5977n2520P2341K4666k3387L3741r59Q654l3823n5813q0494p8544
$$ 517352 501375 448855 521196 545862 522475 556216 555257 563911 530088 474275 393781 315237
18831C15237Q0217M2172l7805J1761j8012l0570J2133M4941k2426R827M0224J3986
$$ 315237 395454 437626 399821 411582 393570 363000 375133 420074 397648 407475 447699 461685
18819D61685p0525L3452P6259k8686J6831J9053M3700J9937O1793Q6m4806M56
$$ 461685 391160 424612 500871 472185 489016 508069 551769 571706 633499 633585 588779 589235
18807E89235K4552J2022L3089M9139l6174j924m7851j81480j85251j68626j85735
$$ 589235 613787 625809 658898 708037 671863 669939 622088 440608 255357 86731 -99004
18796i9004j33910o9723P091N0445O6937O2641O8542O4885P3667O4094Q303j7702
$$ -99004 -232914 -302637 -295546 -245101 -178164 -115523 -46981 17904 91571 155665 163968 146266
18784A46266p943J3444n9721o954L5550N1794L7642J00148J01895J00692R1922
$$ 146266 138323 151767 92046 85092 120642 172436 210078 310226 412121 512813 604735
18773F04735J8236k0307j4901n0633n7622m4683M0156J04616J67288M3537o693
$$ 604735 622971 602664 587763 537130 479508 434825 474981 579597 746885 790422 783729
18762G83729j378l7233o6992l0194m8245n9098n2861n4752m3437m8351m0731o039
$$ 783729 782351 745118 678126 647932 599687 540589 487728 432976 389539 341188 300457 294418
18750B94418n3322K9057M5985j1618l7761J1994J2154n99l5563O221K7234O277
$$ 294418 241096 270153 316138 304520 266759 278753 290907 290308 254745 260966 288200 294477
18738B94477L5684Q076L9799O0644K2430j3484r273j7600q109J966L7877M4463
$$ 294477 330161 338237 378036 438680 461110 447626 438353 420753 412644 414610 452487 496950
18726D96950J4677J7819n9651Q925O080K5785O5376M3449J3187k4374M9178N3347
$$ 496950 511627 529446 469795 478720 484800 510585 575961 619410 632597 608223 657401 710748
18714G10748M3537R9578M8524j7282J9736J03202P2298J02991J33311J25593J45383
$$ 710748 754285 853863 902387 885105 904841 1008043 1080341 1183332 1316643 1442236 1587619
18703A587619J62782K63918L36813L27728L16987L08264J73122j5300j30130j80249
$$ 1587619 1750401 2014319 2351132 2678860 2995847 3304111 3477233 3461933 3331803 3151554
18693C151554k81497k70978k28188q2429q47L1478J50730J53930J42466K51722
$$ 3151554 2870057 2599079 2370891 2288462 2287615 2319093 2469823 2623753 2766219 3017941
18683C017941L13303M39625N34200M91859M55077K99216J44962O8375N0886J03597
$$ 3017941 3331244 3770869 4305069 4796928 5252005 5551221 5696183 5764558 5815444 5919041
18673E919041J23852K9916L0560R0981J34366K11301L34224M43720M87286O24093
$$ 5919041 6042893 6072809 6103369 6194350 6328716 6540017 6874241 7317961 7805247 8429340
18663H429340P49399Q29319J092131J369295J768878K120593K600420L239172
$$ 8429340 9178739 10008058 11100189 12469484 14238362 16358955 18959375 22198547
18655B2198547M079828N151343O794830R075311J2493680J7885201K6262492L8758733
$$ 22198547 26278375 31429718 38224548 47299859 59793539 77678740 103941232 142699965
18647A42699965N4384439O7379364O9117443N4458660K6391448o097034l3845849
$$ 142699965 197084404 264463768 333581211 388039871 414431319 408334285 374488436
18640C74488436n1675110n9070765n7438739m9016437l7622757k6919382j8792785
$$ 374488436 322813326 263742561 206303822 157287385 119664628 92745246 73952461
18633G3952461j3235357r528627p143992n656183m568103l789168l103623k651653
$$ 73952461 60717104 51188477 44044485 38388302 33820199 30031031 26927408 24275755
18625B4275755k292014k070880j782925j542597j393191j162816j036061q96534
$$ 24275755 21983741 19912861 18129936 16587339 15194148 14031332 12995271 12098737
18617A2098737p46341o49616n25612m69250l46223k32711k14384r2343n3506j19908
$$ 12098737 11352396 10702780 10177168 9707918 9361695 9128984 8914600 8822257 8768751 8648843
18607H648843j43579j88481k07639k96814k65117j5248M5409J40269j3932k05123
$$ 8648843 8505264 8316783 8109144 7812330 7547213 7531965 7577374 7717643 7703711 7498588
18597G498588l72183m43631l96321m05726l03254j72667k1449R4225K05993K07661
$$ 7498588 7126405 6682774 6286453 5880727 5577473 5404806 5383357 5477582 5683575 5891236
18587E891236J087k18082l74820n48510n92609n40715n16497m15325k49864j00584
$$ 5891236 5892323 5674241 5299421 4750911 4158302 3617587 3101090 2685765 2435901 2335317
18577B335317q3364o8653q5665j10317r4340j21965n1135p5685j15181j00623
$$ 2335317 2251953 2183300 2097635 1987318 1892978 1771013 1719878 1644193 1529012 1428389
18567A428389n5927l8791n4927M550P1633J1864K415J14756Q2270j0026m4408
$$ 1428389 1372462 1333671 1278744 1283294 1354927 1366791 1369206 1483962 1566232 1556206 1511798
18556A511798o2667n2853l7967m2087r500P9977M9025P9027M6282M7166M6676
$$ 1511798 1449131 1396278 1358311 1316224 1306724 1386701 1435726 1514753 1561035 1608201 1654877
18545A654877J9559M1555K4800p5835j14698j40840j37178j09850k9845o2261
$$ 1654877 1674436 1715991 1740791 1664956 1550258 1409418 1272240 1162390 1132545 1070284
18535A070284l5546Q5611J46639J48679J16135J1576j181l0269q7622k21309j62924
$$ 1070284 1034738 1120349 1266988 1415667 1531802 1543378 1542197 1511928 1424306 1202997 1040073
18524A040073j09994o8818k1974p2239k2024j8161k0671J4216J8076N2211n2176
$$ 1040073 930079 861261 839287 767048 745024 726863 706192 720408 738484 790695 738519
18513G38519o0461j6879o8517j01247n9977K5054L9552Q061j8920J8819M51Q093
$$ 738519 678058 661179 592662 491415 431438 456492 496044 504105 485185 504004 504455 512548
18501E12548P9651P8848O6660J0140J3268r2746M0018O3660L6j3065K0376L8352
$$ 512548 592199 671047 737707 747847 761115 668369 708387 772047 772083 759018 779394 817746
18489H17746o2248n7240k21546k47447j20250j17213p6763n083K7259J9345K5594
$$ 817746 755498 698258 476712 229265 109015 -8198 -84961 -90044 -62785 -43440 -17846
18478a7846P5109L6783J7020O307Q2870R0344N3784N5376p5262j00721o4134k4360
$$ -17846 57263 94046 111066 117373 200243 290587 344371 399747 324485 223764 159630 135270
18466A35270j2959r964j6625k6223k6256m5879Q9605P5131R227J8838m6952n0786
$$ 135270 122311 112347 95722 69499 43243 -2636 86969 162100 171327 190165 143213 92427
18454I2427J0920J199j3264k6834k3611j7229k0030R480K1743M4318l3069L2416
$$ 92427 103347 104546 91282 64448 40837 23608 3578 13058 34801 79119 46050 78466
18442G8466K6343r338m5227m8270M3725J28521K7926m6364j8786K6667N2944Q377
$$ 78466 104809 95471 50244 1974 45699 174220 202146 155782 136996 163663 216607 224984
18430B24984l3377r4419p0212K8725L0390j2756l1814n0641k5039J5556O9108
$$ 224984 191607 97188 26976 55701 86091 73335 41521 -9120 -34159 -18603 50505
18419E0505K4570o581q91j9588N5879O0194P788p8985k2325K1423j1310J0543
$$ 50505 75075 68494 67603 48015 103894 164088 171876 92891 70566 91989 80679 91222
18407I1222M9673L3029l1268o8389j5216M250J9783K2796K9279K929p2195n819
$$ 91222 140895 173924 142656 74267 59051 63301 83084 105880 135159 138088 65893 60074
18395F0074P5449J8717o285j4470Q787k405J9368P06o3735n7885J3130L7883p263
$$ 60074 135523 154240 147955 133485 142272 139867 159235 159941 96206 38321 51451 89334 82071
18382H2071J7209j3400l4351l0368L3511M3526Q995M330n7533n7329N9490N2748
$$ 82071 99280 85880 51529 21161 54672 98198 107193 111523 53990 -3339 56151 108899
18370A08899P56J3231l98K9718k6167j0514K790K4250N7970L4314J4020q6506
$$ 108899 109655 122886 122488 152206 126039 115525 118315 142565 200535 234849 248869 162363
18358A62363o8832j8623K4914P8608R712r2329j0834N2190J1284k8325l2764l6404
$$ 162363 93531 74908 99822 178430 188142 95813 84979 137169 148453 120128 87364 50960
18346E0960P1125J1629m4612O853K969o0620k105m4400L5878L1406K830j726k3968
$$ 50960 122085 133714 89102 95955 98924 38304 36199 -8201 27677 59083 61913 60187 36219
18333C6219O482k9883m9140J1343L849m187L8527J4218J1872J1848q822n4128
$$ 36219 42701 12818 -36322 -24979 -21130 -25317 13210 27428 39300 51148 42326 -11802
18321a1802j8157n7532k2392N1733M9453k8541p508J8334K8084m209L6844O188
$$ -11802 -29959 -87491 -109883 -58150 -8697 -37238 -44746 -26412 1672 -2537 34307 40495
18309D0495l0336K4618j9092L2135O470j3975n736j0832L5994m9721l9583L4996
$$ 40495 10159 34777 15685 47820 54290 40315 34579 23747 59741 10020 -29563 5433
18297E433J9648K7611k855J2102M8998J0853p3325j9408j0833m1035m2025L8683
$$ 5433 25081 52692 49837 61939 110937 121790 48465 29057 18224 -22811 -64836 -26153
18285b6153k0135O5884O2940M047j3065o9954k6417Q712K8200J3903M689L9866
$$ -26153 -46288 19596 82536 86583 73518 3564 -22853 -14141 14059 27962 32651 72517
18273G2517l707k5544j2202J3645J5058K5760k375j2528j0300J3380K7139k518
$$ 72517 68810 43266 31064 44709 59767 85527 83152 70624 60324 73704 100843 98325
18261I8325k4776l4814o6487n3022m6398k0342L5098K6851O3093K7699L5340O312
$$ 98325 73549 38735 -27752 -80774 -127172 -147514 -112416 -85565 -22472 5227 40567 46879
18249D6879L177m1234m9321K4651O3984O4986j4209o0335m5514J1717j6883P125
$$ 46879 50056 8822 -40499 -15848 48136 113122 98913 38578 -6936 4781 -12102 -4977
18237d977k7687o115R2327P0975O9568l2012r6476K461J8312j9871k47j930k2980
$$ -4977 -32664 -38779 53548 124523 194091 162079 65603 68064 86376 66505 66258 64328 41348
18224D1348k3616k983J3931L7138j2994L9150K364k4625l5168J3141J3067l5182
$$ 41348 17732 14749 28680 65818 52824 91974 94338 69713 34545 47686 60753 25571
18212B5571m3658r01L3698m729o572P5058k3339j6069n8816r3118L2250N5857
$$ 25571 -18087 -18988 14710 9981 3409 78467 55128 39059 -19757 -112875 -80625 -24768
18200b4768M1835p242J5965M7550L7394J2795j9934n7109k5568o45k386J7917
$$ -24768 17067 9825 25790 73340 110734 123529 103595 46486 20918 20273 17887 35804
18188C5804j1966k8502n8262L897M3950M1464K7170J2421k3223j6787K1583K8351
$$ 35804 23838 -4664 -62926 -59029 -15079 26385 53555 65976 42753 25966 47549 75900
18176G5900p32M0571j0082o7055k0329Q754k6490K4539N8325j8193k8094q270
$$ 75900 75168 115739 105657 38602 18273 27027 537 25076 83401 65208 37114 28844
18164B8844M3388M3007K424m305m4901J0287l7242o3460k0965j1555J6005M2291
$$ 28844 72232 115239 117663 113358 68457 78744 41502 -21958 -42923 -54478 -38473 3818
18152C818J4728O8716N0207j4423L1433M1019j0487J7141M771K1864k8860J4120
$$ 3818 18546 87262 137469 123046 154479 195498 185011 202152 206923 228787 199927 214047
18140B14047K8176q1110O2032M3147M2712M1381Q988R0296J9537R471J9425n371
$$ 214047 242223 161113 223145 266292 309004 350385 359373 449669 469206 478677 498102 492731
18128D92731K0232J17751J13756M8062J4290R8578R5838J34850J64675L53445
$$ 492731 512963 630714 744470 792532 806822 905400 1001238 1136088 1300763 1654208
18118A654208M31101M25084M99138O11859Q16669J054285J537014K421742L833918
$$ 1654208 2085309 2510393 3009531 3621390 4438059 5492344 7029358 9451100 13285018
18109A3285018O203640J1592870K0823577K6733692J0921467m584422q918246
$$ 13285018 19488658 31081528 51905105 78638797 89560264 84975842 76057596
18102G6057596r551062j4183812j6341320j2155715p287316m244930k626376j702076
$$ 76057596 66506534 52322722 35981402 23825687 16538371 12293441 9667065 7964989
18094G964989j133516q94823p29697n61058m79788m36470l70326k78640k25481
$$ 7964989 6831473 5936650 5206953 4645895 4166107 3729637 3359311 3080671 2855190
18085B855190l32436k82721k29879k05985j14084q8711j45903j29538j12525m8050
$$ 2855190 2522754 2240033 2010154 1804169 1690085 1601374 1455471 1325933 1213408 1165358
18075A165358q2708j13049r9308K2722K6443j20380m1686k8187m1748k6228j6589
$$ 1165358 1082650 969601 870293 893015 919458 799078 757392 729205 687457 661229 644640
18064F44640m3182o8133m1830K0849k4726j4379n7106p195N623Q0j2354q358M3479
$$ 644640 601458 533325 491495 512344 487618 473239 416133 408938 414561 414641 402287 393929 437408
18051D37408j2524m6082m9560k6826m3696k8007q932J0483m1038j9777o538J5221
$$ 437408 424884 378802 329242 302416 258720 230713 221781 232264 191226 171449 164911 180132
18039A80132O8543K0573n2783K1035O2177J0154P28M3048L676L1352O0220J12787
$$ 180132 248675 269248 216465 237500 299677 309831 310559 353607 357283 388635 448855 561642
18027E61642J83299K18244K90152M23007L47372J56938J50307n9578k64774l44584
$$ 561642 744941 963185 1253337 1676344 2023716 2180654 2330961 2271383 2006609 1662025
18017A662025l54583j88127j52601j76148j39609r3446j11068j05656p4411k1548
$$ 1662025 1307442 1119315 966714 790566 650957 557511 446443 340787 266376 244828
18007B44828k1346j5331M2373k9080p3193j10751k2186M0984K2143P579R4723
$$ 244828 223482 208151 250524 221444 148251 37500 15314 56298 78441 86020 180743
17996A80743J7369J4094q267o3531o4729k3644O0285M3233p3582k7327J9599k601
$$ 180743 198112 212206 203939 140408 75679 52035 112320 155553 81971 54644 74243 71642
17984G1642N60M9128J2973r315J3993K602k4400k6597l9804m7314k8069k6980
$$ 71642 72202 121330 134303 124988 138981 141583 117183 90586 50782 3468 -24601 -51581
17972e1581j2594n1767j033P9152O0233K295M2325k0596k4821o3725J8887J5123
$$ -51581 -64175 -115942 -116975 -37823 22410 24705 67030 46434 21613 -42112 -23225 -8102
17960h102N5795K7132j531k2643O7501J6519P425n7272m5670j2247Q858J219m887
$$ -8102 47693 74825 73294 50651 118152 134671 142096 84824 39154 26907 35765 36984 32097
17947C2097j8557K476l9453m4967k100P639L6159L5090L4597q7574q9270L6439
$$ 32097 13540 16016 -23437 -68404 -70504 -62865 -26706 8384 42981 -44593 -133863 -97424
17935i7424O0374k2285L435n6988n8680N983Q308K7226N9202K3229j8377j8918
$$ -97424 -37050 -59335 -55900 -112888 -171568 -165585 -157277 -130051 -70849 -47620 -65997 -84915
17923h4915L2621J4129j4082j4401O860M2706J2516j1382l5749r913j5857O4722
$$ -84915 -52294 -38165 -52247 -66648 -59788 -17082 -4566 -15948 -51697 -61610 -77467 -12745
17911a2745k73r123j8025q462k1779k4098J6608K3522K6149K3663j8122k3766
$$ -12745 -13018 -22141 -40166 -48628 -70407 -94505 -77897 -54375 -28226 -4563 -22685 -46451
17899d6451n8418m203N6589M3024M0972M7768j7779l4154j9900j8508M9687j6909
$$ -46451 -104869 -109072 -52483 -9459 31513 79281 61502 27348 7448 -11060 38627 21718
17887B1718n5455K628j8747q4315j433R9799Q0561K9672r401k9061m7787k1356
$$ 21718 -33737 -31109 -49856 -134171 -135604 -35805 44756 74428 65027 35966 -11821 -33177
17875c3177k9609J2078L0896K4994K5350L3536m0855q5598R2467O7317k5570r810
$$ -33177 -62786 -50708 -19812 5182 30532 64068 23213 -62385 30082 97399 71829 62019
17863F2019j5906n7275M7172O3613k3455m3766n6007o9424J9670M2123K5695K9571
$$ 62019 46113 -11162 36010 99623 76168 32402 -23605 -93029 -73359 -31236 -5541 24030
17851B4030K2462J6362p6381J3921O4963O3305K1943k6005o7615n6032K7625N4818
$$ 24030 46492 62854 -13527 394 65357 128662 150605 124600 56985 953 28578 83396
17839H3396j6724O6189n858l2253n6926Q632k6231m9901l5396n1248k3561R3598
$$ 83396 66672 132861 127003 94750 37824 46456 20225 -29676 -65072 -116320 -139881 -46283
17827d6283Q5739L1445L781l7592k2587J7274K3112q091l8673j6090M8113n1348
$$ -46283 39456 70901 74682 37090 14503 31777 54889 46798 8125 -7965 40148 -11200
17815a1200m0833k2726m207K5296J6002K0420K2224K549l5579K4569P305M777
$$ -11200 -52033 -74759 -78966 -53670 -37668 -17248 4976 7525 -28054 -3485 3820 8597
17803H597R680N96M360o569M453p7541n000L1410n621K0221M2664J0630p3703
$$ 8597 18277 18873 23233 16664 21117 -56424 -61424 -30014 -35635 -15414 27250 37880 -35823
17790c5823K5711L643l7765k3936L8807K7944J3371k2734m403j1724p574l962
$$ -35823 -10112 -6469 -44234 -68170 -29363 -1419 11952 -10782 -15185 -26909 -34483 -38445
17778c8445K037R0273k1241j00026O894J3860l9584k213O5103j3669M6538k3760
$$ -38445 -36408 53865 32624 -67402 -60508 -46648 -86232 -88445 -23342 -37011 9527 -14233
17766a4233j3351J4123K2457L3971l9484m0374l7917j7310k2787j3878J4103N8779
$$ -14233 -27584 -13461 8996 42967 3483 -36891 -74808 -92118 -114905 -128783 -114680 -55901
17754e5901N9746O736n2929o4266L6816J06046J1890p0862j1810P602K5913L7159
$$ -55901 3845 10581 -42348 -106614 -69798 36248 48138 -22724 -34534 -26932 -1019 36140
17742C6140m1131l0624M044m41K4393k8974n2104j5335J9354M7739O8967k3061
$$ 36140 -4991 -35615 -31571 -32012 -7619 -36593 -88697 -104032 -84678 -36939 32028 8967
17730H967o2534J1726K1225N4063j5007n4049l0136J5064M1504N6687K9296k3779
$$ 8967 -53567 -41841 -20616 33447 18440 -35609 -65745 -50681 -9177 47510 76806 53027
17718E3027L0379j8m8897m8858l5132k2500L594j1854N592N1918N3565M1635k9177
$$ 53027 83406 83388 34491 -14367 -49499 -71999 -68405 -80259 -74667 -22749 30816 72451 43274
17705D3274l7841l4486k9929K0949M2012O674J01710L2144M4088O515q7599k2113
$$ 43274 5433 -29053 -58982 -38033 3979 10653 112363 144507 188595 195110 107511 85398
17693H5398j1285o9411L881r236j7257K1917K1448J511m7259L6951J5672L6255
$$ 85398 74113 4702 8583 -653 -17910 4007 25455 26966 -20293 16658 32330 68585
17681F8585k1596m1644o2767J1684K9251L5241n1325l017K2997J6557o928N4089
$$ 68585 46989 5345 -57422 -45738 -16487 18754 -32571 -35588 -12591 3966 -2962 51127
17669E1127J0700l5186n4959J2906M8O000k5964k832O387q538j0045p636n0877
$$ 51127 61827 26641 -28318 -15412 -15364 -9364 -35328 -38160 -31773 -40311 -50356 -57992 -108869
17656a08869K0308o204M9545j5305j4534M6345L128K0092J5572K2476j8189J3620
$$ -108869 -88561 -94765 -45220 -60525 -75059 -28714 -25586 -5494 10078 32554 14365 27985
17644B7985o459k5100l9101K8155L884q569k2199k938j4001L8913M0255l3946
$$ 27985 21526 -3574 -42675 -14520 -10636 -19205 -41404 -44342 -58343 -19430 20825 -13121
17632a3121n1723O07L0944j6727o4392m7633O586Q9854Q3726j030m0988j019n486
$$ -13121 -64844 -64237 -33293 -50020 -114412 -162045 -155459 -65605 18121 17091 -23897 -24916 -30402
17619c0402J9295J3000o4647l0132o051Q3087N9585k7244m7085l206k3267o6952
$$ -30402 -11107 1893 -62754 -92886 -98937 -15850 43735 16491 -30594 -33800 -57067 -124019
17607a24019k8968K5727N7839q182l695N7819P8876j405n6222m8041r529o191
$$ -124019 -152987 -127260 -69421 -77603 -81298 -23479 55397 53992 -2230 -50271 -59800 -65991
17595f5991k6425N037M909M836k2084j8587K1635j8340K730J8254J4167M8559
$$ -65991 -92416 -87379 -82470 -77634 -99718 -118305 -96670 -115010 -112280 -94026 -79859 -31300
17583c1300M8168K9135k1995J998q627l0685k2141m141L5148m6955O494K3751
$$ -31300 16868 46003 24008 26006 17379 -13306 -35447 -39588 -4440 -51395 -44901 -21150
17571b1150j03509M3569K776J0008J8189J9131K5758j2439l6228K1101k961L7170
$$ -21150 -124659 -81090 -78314 -68306 -50117 -30986 -5228 -17667 -53895 -32794 -35755 1415
17559A415J402q4156l8578K1088L7161M168M2361Q801K7864L120L154j9623l6227
$$ 1415 2817 -81339 -119917 -98829 -61668 -57500 -15139 -6338 21526 24646 27800 8177 -28050
17546b8050l8518l9083k1965k6270Q561L5291P6541p275m7782O366j5567M6698
$$ -28050 -66568 -105651 -127616 -153886 -145325 -110034 -33493 -40768 -88550 -82184 -97751 -51053
17534e1053L0037J9544k304J8090M680K7549O0368n7839j4160l2610l9202K3123
$$ -51053 -21016 -1472 -3776 14314 18994 46543 106911 49072 34912 2302 -36900 -13777
17522a3777L8657p322K7609k0737m4767j8477M1484M856l4016L0106N8073j1040
$$ -13777 24880 17558 45167 24430 -20337 -38814 2670 7526 -26490 3616 61689 50649
17510E0649j4110j9551k7304m0415Q517K6404j7411m9213m324J8449J4164Q9085
$$ 50649 36539 16988 -10316 -50731 -42214 -15810 -33221 -82434 -86758 -68309 -54145 34940
17498C4940L2081j5394j4771L5339k6743m7403J6328j6109K7516q752m3177j5731
$$ 34940 67021 51627 36856 72195 45452 -1951 14377 -1732 25784 17032 -26145 -41876
17486d1876k9093J0712P7953N5494l6534k3956J4620n3645o2243p618j9855r656
$$ -41876 -70969 -60257 17696 73190 36656 12700 27320 -26325 -88568 -96186 -116041 -125697
17474a25697L5742j8759O1002J8139p612M4480k471m1745l7273j9941K6847M3996
$$ -125697 -89955 -108714 -47712 -29573 -37185 7295 4824 -36921 -74194 -94135 -67288 -23292
17462b3292o6077k6884L6783l8970L5804p554k4270Q8972M3461J0355n0138k2022
$$ -23292 -89369 -116253 -79470 -118440 -82636 -90190 -114460 -25488 17973 28328 -21810 -43832
17450d3832j3823l4585O329M9949L9632k2757N694P6144N3936N5216J18052J71302
$$ -43832 -57655 -92240 -85911 -35962 3670 -19087 -13393 62751 116687 171903 289955 461257
17438D61257k8329k9288J8303n9516o3132p7120m0863J9413o624l0196j9153o7545
$$ 461257 432928 403640 421943 362427 299295 222175 181312 200725 194101 163905 144752 77207
17426G7207n8927l554L832n3311k1114l3176P3176M3720J1897j5126L2081K6895
$$ 77207 18280 14726 18558 -34753 -55867 -89043 -15867 27853 39750 24624 56705 83600
17414H3600J1375M0840l3979K772K4636M337p0467l3507r857J5073K3788o0079
$$ 83600 94975 135815 101836 104608 129244 133581 63114 29607 19750 34823 58611 -1468
17402a468j09850p964O0314N8390n091n2204j2296K0068M1515N1580M0960l4496
$$ -1468 -111318 -119282 -58968 -578 -5669 -57873 -70169 -50101 -8586 42994 83954 49458
17390D9458k5755k0846k6099O9936Q541J9652K8670k9780m5035k6893k4097J7729
$$ 49458 23703 2857 -23242 46694 55235 74887 103557 73777 28742 1849 -22248 -4519
17378d519J0748k5002o099J088j7340L1594J0403m295o0926m7770Q246N8541L443
$$ -4519 6229 -18773 -24872 -23784 -41124 -9530 873 -3422 -64348 -112118 -103872 -45331 -41888
17365d1888q89j2116K2259j921J4810O3339L2883R298m0726m6886l7797M282Q602
$$ -41888 -42777 -54893 -32634 -34555 -19745 43594 76477 85775 45049 -1837 -39634 -35352 -26750
17352b6750L4922L8491o2045K7869k7051l0865P9372J27006m3529n6481l8673
$$ -26750 8172 46663 -15382 12487 -14564 -45429 33943 160949 117420 60939 22266
17341B2266K835k6682N046j3848l9453k99m8271J9019P3350o09j9858K009k0503
$$ 22266 25101 -1581 3465 -10383 -49836 -50135 -98406 -79387 -6037 -6646 -26504 -24495 -44998
17328d4998N150k2414m172o281N7138N1757k5819j6044L7561M1584R706m3387
$$ -44998 -39848 -62262 -66434 -72715 -15577 36180 10361 -5683 31878 73462 83168 39781
17316C9781j4655N8671j972j0139j3028J6l7766k6619n0M3738q845j0656k7277
$$ 39781 25126 83797 81825 71686 58658 58674 20908 -5711 -5761 37977 29132 18476 -8801
17303h801n0475l05K9587k147m7987k5351M3491L5896O0180N5309j0908n7540
$$ -8801 -59276 -59581 -29994 -32141 -80128 -105479 -61988 -26092 34088 89397 78489 20949
17291B0949r959o379n5477L3706N086j2415L3362m953m716J8984K1872k8915j8088
$$ 20949 10990 4611 -50866 -17160 -12074 -24489 8873 3920 -796 18188 40060 11145 -6943
17278f943N5409J8062n0882M7545J4602K3226P183m8021j12208P0173J3233j6068
$$ -6943 48466 66528 15646 63191 77793 101019 108202 60181 -52027 18146 31379 15311
17266A5311J8975j1623o016M3236o7077k5497N9538o6092q1385O4280M9521n2749
$$ 15311 34286 22663 16647 59883 -7194 -32691 26847 -39245 -120630 -56350 -6829 -59578
17254e9578J9162L385r889J5582K6026Q672l0261j3475K5131L0341l445Q234J8840
$$ -59578 -40416 -37031 -46920 -31338 -5312 3360 -26901 -40376 -15245 15096 11651 19885 38725
17241C8725p665j0912m9762j0678l0505k7338J9842L7224L3348J1587r043J0291
$$ 38725 31060 20148 -29614 -40292 -70797 -98135 -78293 -41069 -7721 3866 -5177 5114
17229E114K0526M179l1277n5986l8027K9351J7672J7796o33P3505O7235k1071
$$ 5114 25640 29819 -1458 -57444 -95471 -66120 -48448 -30652 -31285 42220 109455 88384
17217H8384m5622j9901j4220j2104K936K1718K5000j8041q5451p9338l5359n590
$$ 88384 42762 22861 8641 -3463 -527 21191 46191 28150 -57301 -136639 -171998 -177588
17205a77588J7679l7874M7551R3558N1373J9725L3176j6347L8629q075q787r3427
$$ -177588 -159909 -197783 -150232 -56674 -5301 14424 47600 31253 69882 61807 53020 -40407
17193d0407k8963K4653p160J2640M0544N114l1821K0741l4717l7770l7608m1L5652
$$ -40407 -69370 -44717 -51877 -39237 1307 6421 -25400 -4659 -39376 -77146 -114754 -114795 -79143
17180g9143K0173R8360J2382l920K6364n9071o4870N2540N2361m4156k6872N2499
$$ -79143 -58970 39390 51772 47852 74216 15145 -49725 2815 55176 11020 -15852 36647
17168C6647L8946o371L1115k6540r7638l8572j0905J3012J11052J2567j6071n2491
$$ 36647 75593 69222 100337 73797 -23841 -62413 -73318 -60306 50746 63313 47242 -5249
17156e249o8406j0767N2628k9260l5577Q5009r778M0238L2009q820k5871r507
$$ -5249 -73655 -84422 -31794 -61054 -96631 -11622 -21400 18838 50847 42027 16156 6649
17144F649k0529k9728l5237m5336J3712M3153K7821m566k5073M9198L5678q2655
$$ 6649 -13880 -43608 -78845 -124181 -110469 -67316 -39495 -44061 -69134 -19936 15742 -66913
17132f6913J992k319j5526k2211N2724J09553l8091l7658J1973L2526l4602m7079
$$ -66913 -64921 -67240 -82766 -104977 -52253 57300 19209 -18449 -6476 26050 -8552 -55631
17120e5631Q2101L4241m7928n6987N0636k3295k4064K9829j4095j3383J792p11
$$ -55631 26470 60711 12783 -44204 6432 -16863 -40927 -11098 -25193 -38576 -36784 -37495
17108c7495L2947P5355j2109J9075o67j9923q9647k0006J3505J5250J3040R020
$$ -37495 -4548 70807 58698 77773 77106 57183 -32464 -52470 -38965 -23715 -10675 -1655
17096a655J7451j2163n472k2681K9756R649J447L8768j9845o5071l5725J1250
$$ -1655 15796 3633 -1839 -24520 5236 14885 16332 55100 35255 -29816 -65541 -54291
17084e4291m3956j6339p658J888L0316Q9857N1226J5422K0443K5007K714p4869
$$ -54291 -98247 -114586 -122244 -120356 -90040 -183 51043 66465 86908 111915 114629 39760
17072C9760k5857J3199p4603M0194Q0449l6979j03889J8143N3270K3870j4875
$$ 39760 13903 27102 -47501 -7307 73142 36163 -67726 -49583 3687 27557 12682
17061A2682n1767n2678L9504j9204j01348J4856Q1845J21565R7971o2196n3905
$$ 12682 -39085 -91763 -52259 -71463 -172811 -157955 -76110 45455 143426 81230 27325
17050B7325l8344l0156N4023M2905q9435q896n4156j6513K9254K0502l1982L0173
$$ 27325 -11019 -41175 12848 55753 -33682 -42578 -96734 -113247 -83993 -63491 -95473 -65300
17038f5300N107K4148M0510j1209K3127Q5257K1161j8618K842j6869p1006o9398
$$ -65300 -60193 -36045 4465 -6744 16383 101640 122801 104183 107025 90156 19150 -50248
17026e0248j0130o461M5596K8187L713K0122j0155k2316k4563L999r952M5980
$$ -50248 -60378 -66839 -21243 6944 10657 30779 20624 -1692 -26255 -22256 -32208 13772
17014A3772j4367p0420K841l0405j5392r030J27078R4408j289r759n2454l4933
$$ 13772 -595 -71015 -68174 -98579 -113971 -123001 4077 98485 97196 87437 34983 50
17002E0J7746J6619p6448n1532J7036l9435o16L6516L7492J6999k3709k126O968
$$ 50 17796 34415 -42033 -93565 -76529 -115964 -116580 -80064 -42572 -25573 -49282 -51408 -44440
16989d4440J3455k4099l9015K5206L0783j8758J742L263j077J0852N0558q059
$$ -44440 -30985 -55084 -94099 -68893 -38110 -56868 -55126 -51863 -52940 -42088 8470 411
16977D11K4538K1840K0341l2527m0884L9201J4062m7803k711k7144k1255J5856
$$ 411 24949 46789 67130 34603 -6281 32920 46982 -821 -3532 -30676 -51931 -36075
16965c6075N3448K3870p845K2366l2332m9556J1778j0528l118l2535j9193J7390
$$ -36075 17373 41243 33398 55764 23432 -26124 -14346 -24874 -27992 -60527 -79720 -62330
16953f2330j0808j7717q005m342L7536n9468o3707L5076N2514K0530K0596P0742
$$ -62330 -73138 -90855 -98860 -103202 -65666 -125134 -188841 -153765 -101251 -80721 -60125 10617
16941A0617r827k1843N716j6568j2562L2200l800M4818K5759K4147J2887q6268
$$ 10617 790 -21053 -15337 -31905 -44467 -12267 -16067 28751 54510 78657 91544 5276
16929E276l6594l620l0462L4426N683p782j0071o289M8773L8625k3646j5084M0807
$$ 5276 -31318 -34938 -65400 -30974 -25291 -33073 -43144 -49433 -660 37965 14319 -765 40042
16916D0042J1750J590K1892k630Q873l2740l3874O517J3972k2096n5436j5164
$$ 40042 51792 53382 75274 72644 81517 48777 14903 21420 35392 13296 -42140 -57304
16904e7304K9304P749o280K0779P4448j8477m9932m158J8133n1070j3153J9698
$$ -57304 -28000 -20251 -26531 -5752 68696 50219 287 -3871 14262 -36808 -49961 -30263
16892c0263l254J2467M4590n548q234L4235Q091M0123J9872j4544r229j8059n9378
$$ -30263 -33517 -21050 23540 17992 9758 43993 52084 92207 112079 97535 88306 70247 10869
16879A0869p0747L5585J2633l2167j4871P8525M2889L6095m0548m4915n3821k0976
$$ 10869 -59878 -24293 -11660 -43827 -58698 19827 62716 98811 58263 13348 -40473 -61449
16867f1449O614N5736M2652n000n2107n144N1055j360p0271k2184L9008p061j3599
$$ -61449 -54835 901 43553 38553 -13554 -18698 32357 30997 -39274 -61458 -22450 -29511 -43110
16854d3110L8495r900Q5054L458j25345j598j4717K2014k8040q085J2409P8678
$$ -43110 -4615 -14515 70539 73997 -51348 -52946 -67663 -45649 -73689 -81774 -69365 9313
16842I313J7732K4114K596k5779k9046l8609l8740j9058q418M270j2986L2367
$$ 9313 27045 51159 53755 27976 -1070 -39679 -78419 -97477 -105895 -101625 -114611 -82244
16830h2244K1790o6104l0367R8029L2847K513N6010l6757m3503m568L3333p8280
$$ -82244 -60454 -126558 -156925 -58896 -26049 -23536 32474 -4283 -47786 -52354 -19021 -97301
16818i7301k4008K8681k7645J2033M1651K1620J6031o316K9206L0743j5342J4070
$$ -97301 -121309 -92628 -120273 -108240 -66589 -44969 -28938 -35254 -6048 24695 9353 23423
16806B3423J8444L2208q472k7109j8001M837o4836Q765J4570o745L6242L0531
$$ 23423 41867 74075 65603 38494 20493 25330 -39506 -30741 -16171 -22916 13326 43857
16794D3857k6652k366p389J5957K3952k7220p5147M496k0627j0231M1070P3328
$$ 43857 17205 14839 7450 23407 47359 20139 -55008 -50512 -71139 -81370 -40300 33028
16782C3028K2464R95Q072L5745l7229P543K9610K5862P2457o7038n1021j2503
$$ 33028 55492 56487 64559 100304 63075 70618 100228 126090 198547 131509 80488 67985
16770F7985m3606j6623k6613J8546N1719j553q7597R72L0228J7286M7120l0010
$$ 67985 24379 7756 -18857 -311 51408 49855 -37742 -36770 -6542 10744 57864 27854
16758B7854l1442K0465P3832L1345o0246J6444n6535o9785j4106P998r080o273
$$ 27854 -3588 16877 90709 122054 61808 78252 21717 -48068 -62174 -54176 -63256 -69529
16746f9529K145P0225O635L7669j0781k3041m6972Q765l7816k5676K2419P4812
$$ -69529 -67384 2841 9476 47145 36364 13323 -33649 -24884 -62700 -88376 -65957 8855
16734H855N77l7420o89k7532L5051M0049j1497k6201j0234o4323j7015K2694J8802
$$ 8855 9432 -27988 -28677 -56209 -21158 18891 7394 -18807 -29041 -93364 -110379 -87685 -68883
16721f8883J9169l4522N3771N2942l4710J3641L415L3545K4542n0225k3212o985
$$ -68883 -49714 -84236 -30465 22477 -12233 1408 4823 38368 62910 12685 -10527 -17512
16709a7512O293k7476L5701Q290k1284q7784j1869O4548M4617K4314L0586J902
$$ -17512 -11219 -38695 -2994 5296 -15988 -103772 -115641 -51093 -6476 17838 48424 50326
16697E0326r4430K91K6394l1307o5941M5107R6592J2796L1383Q783o1786k4428
$$ 50326 -44104 -43813 -17419 -48726 -114667 -69560 27032 39828 71211 79994 18208 -6220
16685f220L5938k279p1102L492Q9720J9884o9549p7298J7707K7475l2584j17120
$$ -6220 29718 27439 -43663 -40171 49549 69433 -116 -77414 -59707 -32232 -64816 -181936
16673a81936J6282O9738O6172K4702m3333k8395n694K5122K1170K9574r461j1304
$$ -181936 -165654 -95916 -29744 -5042 -48375 -76770 -82464 -57342 -36172 -6598 -16059 -27363
16661b7363K1239k4391k5416k60J759J7099M4152K9887n316l6736k1198J7432
$$ -27363 -6124 -30515 -55931 -56191 -54432 -37333 6819 36706 31390 -5346 -26544 -9112
16649i112j6851K0615J7088n1932J4969J5027k8330j0543K0664J4194l0890q23
$$ -9112 -25963 -5348 11740 -40192 -25223 -10196 -38526 -49069 -28405 -14211 -45101 -45924
16637d5924N9482L3760p4255Q007K0299k5157M5157K2622o7844o5520o067n3701
$$ -45924 13558 47318 -26937 -18930 1369 -23788 21369 43991 -23853 -89373 -95440 -149141
16625a49141j2813N3320O7106p394k4773O362j3761R7593K4747L3267m1413k0000
$$ -149141 -161954 -108634 -41528 -48922 -73695 -67333 -81094 16499 41246 74513 33100 13100
16613A3100J913q059M0117j1409l4265n2274K9526n1453m9372l0518J8685M2798
$$ 13100 15013 6954 47071 35662 1397 -50877 -21351 -72804 -122176 -152694 -134009 -91211
16601i1211L4396J9278Q6220k1279R728J3912R032R832n0050q9460N8768M6510
$$ -91211 -56815 -37537 48683 27404 37132 51044 60076 69908 19858 -69602 -10834 35676
16589C5676p495N949m0651O666j5342p0718L0101L8526K3686R684o409J5288j5522
$$ 35676 28181 34130 -6521 145 -15197 -85915 -55814 -17288 6398 16082 9673 24961 9439
16576I439q1235k7358J6996N3628L3184j3542j841K2543J5662L8276J5488m7688
$$ 9439 -71796 -99154 -82158 -28530 4654 -8888 -10729 11814 27476 65752 81240 33552
16564C3552R568J5682O0l9500k4827n8734m4914l2742L1164M7454N254O356o760
$$ 33552 43120 58802 58862 19362 -5465 -64199 -109113 -141855 -110691 -63237 -57983 -51627 -58387
16551e8387J5210l0306m0443k8321M3080L0464K3144O7942k9248m8833l0424l369
$$ -58387 -43177 -73483 -113926 -142247 -99167 -68703 -45559 22383 -6865 -55698 -86122 -89491
16539h9491M5880K1165M0266R847L8430K6807k5462k2930n939M010O7485k5683
$$ -89491 -43611 -22446 17820 27667 66097 92904 67442 44512 38573 42583 110068 84385
16527H4385J796K9331K6762K9025o2574m8299o0282l6106N269j352p4017P979
$$ 84385 86181 115512 142274 171299 108725 60426 144 -35962 -30693 -32045 -106062 -98083
16515i8083L3306L2056O4104N8945k1277q1517n130L440n3219J7143K2016k5146
$$ -98083 -64777 -32721 31383 90328 69051 -12466 -17596 -14156 -67375 -50232 -28216 -53362
16503e3362n483j801l7471j3571K1271l569J4931J5120M0313K4049k7931k3789
$$ -53362 -58845 -60646 -98117 -111688 -90417 -93986 -79055 -63935 -23622 427 -27504 -51293
16491e1293K238N3524K6415m521J6018N1278m9933r7182p1648L908K1995P9768
$$ -51293 -49055 4469 30884 26363 42381 93659 43726 -53456 -125104 -121196 -99201 -19433
16479a9433M7550m9468j5589l8476n4353k3834N4081K8145N8768M4891L3626k3003
$$ -19433 28117 -21351 -36940 -75416 -129769 -153603 -99522 -71377 -12609 32282 65908 42905
16467D2905J6748l599k2381j2998m2766k2869l9113M2063K7667n287l469J6619
$$ 42905 59653 56054 33673 20675 -22091 -44960 -84073 -42010 -14343 -19630 -23099 -6480
16455f480l3270l1781k3542O3221N6342p209K5243P177j7957j230l3387o8111
$$ -6480 -39750 -71531 -95073 -31852 24490 17281 42524 49701 31744 30514 -2873 -70984
16443g0984j5642O0717k0867n1795J2643j5513k9104j7273L1944K5390J135N6799
$$ -70984 -86626 -25909 -46776 -98571 -85928 -101441 -130545 -147818 -115874 -90484 -89349 -32550
16431c2550K020j3346j2859L009m09M6970L6560Q007l7192m8114K8559k364L3986
$$ -32550 -30530 -43876 -56735 -53726 -54135 -7165 29395 37402 210 -47904 -19345 -21709 12277
16418A2277O0180n501j09384L3463n785J2546J907j2155m762m1920n7726P311
$$ 12277 72457 66956 -42428 -8965 -14750 -2204 -297 -12452 -17214 -59134 -116860 -109549
16406a09549N0337L7776m1056j4618m039L3843K834N9939K4577m4899j1870k2382
$$ -109549 -59212 -21436 -62492 -77110 -81149 -47306 -44472 15467 40044 -4855 -16725 -39107
16394c9107r47Q1570k8993j03934K3645N9227K3606N4260k3064n7910l9547m2390
$$ -39107 -40054 41516 12523 -91411 -67766 -8539 15067 69327 46263 -11647 -51194 -93584
16382i3584l3479K1591Q8547L6900K5421L5527J1108l7082j31839j7602J0689
$$ -93584 -127063 -105472 -16925 19975 45396 80923 92031 54949 -76890 -94492 -83803
16371h3803L0195L2475O0968P210L7486j6635n9528k4636L0893K4531K9879R6
$$ -83803 -53608 -21133 39835 47045 84531 67896 8368 -16268 14625 39156 69035 69131
16359F9131p6413r003j8882O786j7685J5524M09n1782r66L2809k2586k4498L9804
$$ 69131 -7282 -16285 -35167 -28381 -46066 -30542 -30133 -81915 -82881 -50072 -72658 -97156 -57352
16346e7352K6175J4831J4019k9681k1156N00M1529L7772K8062n5220p321R082
$$ -57352 -31177 -16346 -2327 -32008 -53164 -52664 -11135 26637 54699 -521 -7842 1240
16334A240K7302J2663o1981l2226p546o0340M7704l7636j1708O7062k2559J8733
$$ 1240 28542 41205 -20776 -53002 -60548 -120888 -73184 -110820 -122528 -55466 -78025 -59292
16322e9292k346L3462K7307m6077r6911L1369Q7079L5664J0694m245J6696J4371
$$ -59292 -61638 -28176 -869 -46946 -143857 -112488 -25409 10255 20949 16704 33400 47771
16310D7771L162j7415j5221j3856K495j913L9808J4820n1168n1420K171J9000
$$ 47771 50933 33518 18297 4441 6936 5023 44831 59651 8483 -42937 -40766 -21766
16298b1766L922m9833j0731L6343j5561O682R725L0662L0297k5092j530M3626
$$ -21766 -17844 -67677 -78408 -42065 -57626 -50944 -41219 -10557 19740 -5352 -6882 36744
16286C6744q623k8454j446l6590j2153L3352J7520m3487N278K0940Q143J0808
$$ 36744 28121 -333 -1779 -38369 -50522 -17170 350 -43137 -37859 -16919 -8776 2032
16274B032j1257j86L1838o0057J5134P401j270Q888j7962J4814n1764m5947M8073
$$ 2032 -9225 -9411 22427 -37630 -22496 -15095 -16365 -7477 -25439 -10625 -62389 -108336 -60263
16261f0263M2000K9296j6223j4251Q626N391m5953L576J7407l3514l5350O4261
$$ -60263 -18263 11033 -5190 -19441 -10815 -5424 -51377 -47801 -30394 -63908 -99258 -34997
16249c4997M477J7888n515l4910J1029N1479j2769J0973M3609o1j1635n8334q0395
$$ -34997 -30520 -12632 -18147 -53057 -42028 9451 -3318 7655 51264 51203 39568 -18766 -99161
16236i9161j3933L5721m226O8078k8319O7N6121j0547l3008J1409m7492L7532
$$ -99161 -113094 -77373 -81599 -13521 -41840 -41773 14348 3801 -29207 -17798 -65290 -27758
16224b7758N6298p496M3927j5687k6322J9129J670L920J4583N991L307j31991
$$ -27758 28540 21044 64971 49284 22962 42091 43761 47681 62264 68255 71562 -60429
16212f0429J193J4532L0014J3455j4097m18n1301j4267J0090J1264L5005J4682
$$ -60429 -59236 -44704 -14690 -1235 -15332 -15750 -67051 -81318 -71228 -59964 -24959 -10277
16200a0277R194M4044j7180l4639n1541j3431J6630J3394n266J9695J7879k0715
$$ -10277 -1083 42961 25781 -8858 -60399 -73830 -57200 -43806 -49072 -29377 -11498 -32213
16188c2213m5183J3L4770N7505L0600j5785n663j3157p420n41J772N2730K0353
$$ -32213 -77396 -77383 -42613 14892 45492 29707 24044 10887 3467 2926 4698 57428 77781
16175G7781o6198p6438K4281k2019M470K6232j4963l962Q0900p205n8002m5819
$$ 77781 11583 -64855 -40574 -62593 -58123 -31891 -46854 -50816 30084 22879 -35123 -80942
16163h0942k624J3526P345m406K0965K3972o6458l5726K6735K9688R3904P0630
$$ -80942 -83566 -70040 -62695 -67101 -46136 -22164 -88622 -124348 -97613 -67925 25979 96609
16151I6609k4602l1284q787J5747J7457K2514l4313J4538p7152o0415L5460L1500
$$ 96609 72007 40723 31936 47683 65140 87654 53341 67879 -9273 -69688 -34228 -2728
16139b728L7011J3804J0326n460M414l8128l4096l607L391p602P073J7189J4267
$$ -2728 34283 48087 58413 52953 57367 19239 -14857 -18464 -15073 -22675 -15602 1587 15854
16126A5854M7759L6348j3342j3376n7034l9540j3044N1754q960M3883J7818J648
$$ 15854 63613 99961 86619 73243 16209 -23331 -36375 15379 6419 50302 68120 69768
16114F9768l8370n3440j7952J25l0740K0373O980P9185L2400r133M0791K0179
$$ 69768 31398 -22042 -39994 -39869 -70609 -50236 -43256 35929 68329 59196 99987 120166
16102A20166k7084o9073j5530L5162L8583m1822n4176n5353N6424K4232J870j2062
$$ 120166 93082 24009 8479 43641 82224 40402 -13774 -69127 -12703 11529 13399 1337
16090A337n811K5222M8508q899n5257k570O191k3218M4193J1113O40k3333k8880
$$ 1337 -4474 20748 69256 60357 5100 2530 8721 -14497 29696 40809 41449 18116 -10764
16077a0764r325j3474N335l060j5547P2997J9537k7440n6604R022n2253j6181
$$ -10764 -20089 -33563 -28228 -31288 -46835 26162 45699 18259 -38345 -29323 -81576 -97757
16065i7757K7030k3946m6814O5496M9644J3911L9349m7070m0922k3007K6737L9315
$$ -97757 -70727 -94673 -141487 -75991 -26347 -12436 26913 -20157 -61079 -84086 -57349 -18034
16053a8034O870j6728o0551l6926N9444L9282K112j6933n31O9523J4095N052l3169
$$ -18034 -11164 -27892 -88443 -125369 -65925 -26643 -24531 -41464 -41995 27528 41623 46675 13506
16040A3506j3166N199j520l8348k2048Q161k6248N5104L1782n6731O201O1160
$$ 13506 340 5539 4019 -34329 -56377 -48216 -74464 -19360 12422 -44309 -38108 23052
16028B3052k1321K065l858J1928k1905l705j5031l9415J7091j3273K3195m529
$$ 23052 1731 3796 -62 11866 -10039 -13744 -28775 -68190 -51099 -64372 -41177 -45706
16016d5706m5364N5552O7244l3182k6671K3124l6022R504r829Q246j9024K8372
$$ -45706 -91070 -35518 31726 -1456 -28127 -5003 -41025 -31521 -41350 -33104 -52128 -23756
16004b3756N859L1486N3800j841m2338k2359Q850l5566n148L7071O016J1371K8577
$$ -23756 -17897 13589 67389 65548 23210 851 9701 -25865 -31013 6058 12074 23445 52022
15991E2022n4930k5797P067O4590l7751p2754l023M4274m4079l5877K0358P1578
$$ 52022 -2908 -28705 -21638 42952 5201 -67553 -70576 -26302 -70381 -106258 -85900 -14322
15979a4322j740o7248j6871Q6495N9653j8601L3124j9238k2099l138J7766l092
$$ -14322 -16062 -83310 -100181 -13686 45967 27366 60490 41252 19153 16015 33781 30689
15967C0689j7431l3048J8091J9152l2625l3003k4576k8319K7044o406O0944K1347
$$ 30689 13258 -19790 -1699 17453 -15172 -48175 -72751 -101070 -74026 -80432 -19488 1859
15955A859o927K4804m473J7056n5682l9544m4726K3934O2843m6749M0963P2474
$$ 1859 -5068 19736 15263 32319 -23363 -62907 -107633 -83699 -20856 -67605 -26642 45832
15943D5832q918q2600j2699j0947K4368o059J3284L037p199m80O715k3791L621
$$ 45832 36914 -45686 -58385 -69332 -44964 -51023 -37739 -34702 -41901 -42381 -35666 -59457 -55836
15930e5836K7421K5162P980o0191K654K4879M9227K8528J9936J5661n4473n3596
$$ -55836 -28415 -3253 4727 -55464 -52810 -27931 21296 49824 69760 85421 30948 -22648
15918b2648J8300P716j3875j036K3634Q799n6960L643n500l4832Q577k2902J6329
$$ -22648 -4348 3368 -10507 -11543 12091 20890 -36070 -32427 -37927 -72759 -64182 -87084 -70755
15905g0755M1750K0299M2445k3420k0703N7280j504l08l5382O735J891m2158k3882
$$ -70755 -29005 -8706 33739 10319 -10384 46896 45392 45084 9702 16437 18328 -23830 -47712
15892d7712m207r394n5706r856L3436N3111m462k1096j9616O3604O7335j1598
$$ -47712 -51919 -61313 -117019 -126875 -93439 -40328 -44790 -65886 -85502 -21898 45437 33839
15880C3839o7836k3250k808K0334K6007j4355N5158l7304p1279L2573M2696K5048
$$ 33839 -33997 -57247 -60055 -39721 -13714 -28069 27089 -10215 -81494 -48921 -6225 18823
15868A8823j5967J0800K0529n3368n497L1835K82M3696j799k7133l8437J5620
$$ 18823 2856 13656 34185 -19183 -24680 7155 7437 51133 49334 22201 -16236 -616
15856f16J6336k3619J8527L3005R053M566m5195L4895N7169k3124k4350j3950
$$ -616 15720 -7899 10628 43633 52686 57252 12057 46952 104121 80997 56647 42697
15844D2697n628k2369L806L3299J6977j4306K2626m4816k8283L0786J999K3520
$$ 42697 37069 14700 18506 51805 68782 54476 77102 32286 4003 34789 36788 60308
15832F0308J6987l7890q179n645J8406p889r621j622k2254l9236K4408P653k467
$$ 60308 77295 39405 31226 25581 43987 36098 26477 24855 2601 -36635 -12227 -4574 -7041
15819g041P356M3783J1403r655K747N31k952l9173o536J8705l6150m4869J5259
$$ -7041 315 44098 55501 45846 48593 49124 46172 6999 463 19168 -16982 -61851 -46592
15806d6592L8553k5108Q348N9212p0774k1002M4242L4207j0199n5010k2042j8284
$$ -46592 -8039 -33147 -24799 34413 -36361 -57363 -13121 21086 10887 -44123 -66165 -84449
15794h4449P173n1329j7724R0898p716M2185L9293P5587J2509k5095j3573J6899
$$ -84449 -77276 -128605 -146329 -55431 -63147 -20962 18331 93918 106427 81332 67759 84658
15782H4658K0975L5191L004l8398o8419o2596K1850Q5680m7993o8185K2483K6250
$$ 84658 105633 140824 143828 105430 37011 -25585 -3735 81945 33952 -34233 -11750 14500
15770A4500l1815N1624K7896k8678l5100N4568n9139r0482q4002J9489R0925N1636
$$ 14500 -17315 34309 62205 33527 -1573 52995 -6144 -96626 -180628 -161139 -70214 -18578
15758a8578M3261k7200n3649O189n389K839l4925k9368L3956j3854K5062P9927
$$ -18578 24683 -2517 -56166 -49977 -55366 -52527 -87452 -116820 -82864 -96718 -71656 8271
15746H271R1006K4404p8432j445m3913l0982o1123N6997M7403L8339j09j3942
$$ 8271 99277 123681 45249 43804 -109 -31091 -92214 -35217 12186 50525 50416 36474
15734C6474l7896Q159N2726K889o0875n0763k3156K5553k9126M3175J00658N5996
$$ 36474 -1422 6737 59463 62352 1477 -49286 -72442 -46889 -76015 -32840 67818 123814
15722A23814L9124m751j02127m0942O0939j7668j771p2528j4611J5878K0103j5830
$$ 123814 162938 158187 56060 15118 76057 58389 56618 -15910 -30521 -14643 5460 -10370
15710a0370O5945k0332m0075j7060j3869o8992l0883O1738M1414j2900p8386l8050
$$ -10370 55575 35243 -4832 -21892 -35761 -104753 -135636 -73898 -32484 -45384 -123770 -161820
15698a61820J9831L9435p999j4552K3476O0682N8092J6796p9611j4699L5767N9503
$$ -161820 -141989 -102554 -110553 -125105 -101629 -40947 17145 33941 -45670 -60369 -24602 34901
15686C4901N743j29r313L0715M2603k7292o2968Q054K850n4095m3958R0791K6696
$$ 34901 40644 40515 31202 61917 104520 77228 14260 22314 25164 -28931 -72889 17902 44598
15673D4598m0321n1503l0974K4855n837L4046n9333k5898Q8528Q6928N437j2416
$$ 44598 4277 -47226 -78200 -53345 -59182 -25136 -84469 -110367 -21839 65089 70526 58110
15661E8110n3273l3606l1076M729k6675j1090L2556O312M4735j7777p673J4132
$$ 58110 4837 -28769 -59845 -55116 -81791 -92881 -60325 -54013 -9278 -27055 -34728 -20596
15649b0596K3143N5306M2770k1410R605m4213n2091l6437R1932Q9222n5997l3234
$$ -20596 2547 57853 100623 79213 88818 44605 -7486 -43923 48009 137231 81234 48000
15637D8000J9028J0046l5538j0202k3810m6614r6741M0016N7875M0728k0471J4096
$$ 48000 67028 77074 41536 31334 7524 -39090 -135831 -95815 -37940 2788 -17683 -3587
15625c587N3048j5863p703k2569K603l3170J4775L7060K8890n7669j9373R790
$$ -3587 49461 33598 25895 3326 5929 -27241 -12466 24594 53484 -4185 -23558 -13768
15613a3768k5617P578P901J1613j6976l4391M0691m0675K3512K8508j2628l9359
$$ -13768 -39385 -31807 -23906 -12293 -29269 -63660 -22969 -63644 -40132 -11624 -24252 -63611
15601f3611Q061j523l127Q523n17j0892L6087J9241K2691p492J6284L0506Q633
$$ -63611 -55550 -57073 -60200 -51677 -52194 -63086 -26999 -7758 14933 7441 23725 54231 62864
15588F2864m7832q5007j6290J9994L1012j0166o991N9543L5622l0486o3827N027
$$ 62864 15032 -69975 -86265 -66271 -35259 -45425 -52416 7127 42749 12263 -51564 -46537
15576d6537J8438j357q192J3929L5546l3057l0828L805M2440M3474P3175j7988
$$ -46537 -28099 -29456 -37648 -23719 11827 -21230 -52058 -48253 -5813 37661 110836 92848
15564I2848n4045J8224k3842m5682m3641K272j6323M0726J9604J7183P622r332
$$ 92848 38803 57027 33185 -12497 -56138 -53866 -70189 -29463 -9859 7324 14946 5614
15552E614j1997O8588K8882n0895L727K3961k2389l3330L854k4027n5257n2474
$$ 5614 -6383 62205 91087 40192 43919 67880 45491 12161 16015 -8012 -63269 -115743
15540a15743P8365N7321L2762p8741K0290J8255K1580K0216L5249m6099L6949
$$ -115743 -37378 19943 52705 -26036 -5746 12509 34089 54305 89554 43455 80404
15529H0404N396m0361n4928l3324M02j1006k310R5569L8242j6239m6150n9267
$$ 80404 85800 45439 -9489 -42813 -42411 -53417 -55727 39842 78084 61845 15695 -43572
15517d3572m6466J16900O7138m2209Q427k5774K3526K2517k2782n329J7649l5478
$$ -43572 -90038 26862 94000 51791 60218 34444 57970 80487 57705 52376 70025 34547
15505C4547q4350j9749N2498O1317l0091l9569l9075J0943K9073m8197k2864K7535
$$ 34547 -49803 -69552 -17054 44263 14172 -25397 -64472 -53529 -24456 -72653 -95517 -67982
15493f7982L5699L8507J9799K2115m7561p2968K7853P7858j6976k638N5244l6024
$$ -67982 -32283 6224 26023 48138 577 -72391 -44538 33320 16344 13706 68950 32926
15481C2926l4891L0897M0700K384l2593K811M358j8592q3668o846M9149J4081
$$ 32926 -1965 28932 69632 72016 39423 42234 46592 28000 -55668 -62514 -13365 716
15469G16p737L3693K0004o5069O067j4650k8187k1268k8803k2545M5270L7687
$$ 716 -7021 26672 46676 -18393 -12326 -26976 -55163 -76431 -105234 -127779 -82509 -44822
15457d4822j8283Q462k1039J6975k7341l9257p267N8432Q0852O187r165n586m914
$$ -44822 -63105 -54643 -75682 -58707 -86048 -125305 -132572 -74140 6712 12899 3734 -1852 -6766
15444f766j528J6178N00n5652K0582p781J0500L1599L4684K7252L9421k2287k7486
$$ -6766 -8294 7884 8384 -47268 -26686 -34467 -23967 7632 42316 69568 108989 86702 59216
15431E9216o1500o5994j5704k2603K1756K1090K9551K1969k4011q513N4318r8950
$$ 59216 -2284 -68278 -83982 -106585 -84829 -63739 -34188 -12219 -36230 -44743 9575 -89375
15419h9375K749Q5908j6550J1642L8276j39j9313k8618J1338k5748j6344K5258
$$ -89375 -86626 -718 -17268 -5626 32650 32511 13198 -15420 -4082 -29830 -46174 -20916
15407b0916K2122l7572p476m7809J442K5920l5425K310M9051Q2320k3634m1711
$$ -20916 1206 -36366 -43842 -91651 -90209 -64289 -99714 -97404 -48353 33967 10333 -31378
15395c1378J5730K2614J9084o3886J1330J9184J2145m1982k5580O628N3675M5121
$$ -31378 -15648 6966 26050 -37836 -26506 -7322 4823 -37159 -62739 -56111 -2436 42685
15383D2685L9681J3574L296j9537N3308l2025p5700r945Q540n937M1223n1843
$$ 42685 82366 95940 99236 79699 133007 100982 25282 15337 23877 17940 59163 7320
15371G320k0081m225P8176P4661l0371o9962p0228P8473j4060m1386M101M7676
$$ 7320 -12761 -16986 61190 135851 105480 35518 -34710 43763 29703 -11683 -7582 40094
15359D0094p3003j2183K8569L5869K6368k6881m4356n7133k8923N3785M1164n9999
$$ 40094 -32909 -45092 -16523 19346 45714 18833 -25523 -82656 -111579 -57794 -16630 -76629
15347g6629k585J10000M3541k4188L5452k0939o4609n9663n2887O64k4549Q215
$$ -76629 -79214 30786 74327 50139 85591 64652 43 -59620 -112507 -111843 -136392 -128177
15335a28177R532L9451L4428p363Q2202J00080l7741r5243o4844N2534K1629l8610
$$ -128177 -118645 -79194 -44766 -52129 30073 130153 92412 -2831 -67675 -15141 6488 -32122
15323c2122n4797K1707J1892Q278m3082j8581M0705P9008M0913j6441j3301K4616
$$ -32122 -86919 -65212 -53320 -45042 -88124 -106705 -66000 13008 53921 37480 24179 48795
15311D8795n6801j04131N9796L1343Q489K1140P430j896M9364M8568m6040k3973
$$ 48795 -8006 -112137 -52341 -20998 -12509 8631 16061 14165 63529 112097 66057 42084
15299D2084L3481L5946Q330q1534l2852l6434P3495M0582q7457j9931k076R0968
$$ 42084 75565 111511 119841 38307 5455 -30979 42516 83098 -4359 -24290 -26366 64602
15287F4602N7313L986m1069l4398J9391k8873k0479R724k966J4467m065n9219
$$ 64602 121915 125901 84832 50434 69825 40952 20473 30197 27231 41698 37633 -21586
15275b1586l7963k1252O8869k50J5112L3035J8358j3921l7915J3124k3931J4209
$$ -21586 -59549 -80801 -11932 -12182 2930 35965 54323 40402 2487 15611 -8320 5889
15263E889N154j1239k176m4944L9618P307l2543L2544P6221L0792k2788l6946
$$ 5889 11043 -196 -2372 -47316 -7698 -391 -32934 -390 75831 106623 83835 46889
15251D6889m1252L669L7165j5473k8513R084j593P0382O661p6337p4536L0244
$$ 46889 5637 9306 46471 30998 2485 11569 9976 80358 87019 10682 -63854 -33610
15239c3610k4383n9607K612N4249K8669L3530J549j5834k979K4646M5722L5321
$$ -33610 -57993 -117600 -114988 -60739 -32070 1460 3009 -12825 -15804 8842 54564 89885
15227H9885j203j7558m5249k2107J1630M547k5919o7983n9460q100N8842L3043
$$ 89885 88682 71124 25875 3768 15398 19945 -5974 -73957 -133417 -141517 -82675 -49632
15215d9632N1100P925K2171p3410m8982j4250l727P5042M3170p324m4831k4482
$$ -49632 1468 9393 31564 -41846 -90828 -105078 -108805 -33763 9407 2083 -42748 -67230
15203f7230L7505L5023N4262j5566o3113j6722l0996n9457P7378k046L6423M8880
$$ -67230 -29725 5298 59560 43994 -19119 -35841 -66837 -126294 -48916 -50962 -14539 34341
15191C4341K5654k0786j1571J2240K8298k3226m1778n5652R920J8615l228K9917
$$ 34341 59995 39209 27638 39878 68176 44950 3172 -52480 -42560 -23945 -27173 2744
15179B744k36K80n5870p05M2197J0310N4817L2303j1563p6370l4721p8227K4263
$$ 2744 2508 2788 -53082 -53787 -11590 -1280 53537 85840 74277 -2093 -36814 -115041 -90778
15166i0778M1765K618J4754J6239J4420m444k5626k6349n1546k929R23M5510L7727
$$ -90778 -49013 -46395 -31641 -15402 -982 -5426 -31052 -57401 -108947 -111876 -110953 -65443 -27716
15153b7716m3956R504Q9626M3212n1376k342j1684k7377j830N978k5945r994j1419
$$ -27716 -71672 -62168 27458 70670 19294 16952 5268 -22109 -23939 -17961 -43906 -53900 -65319
15140f5319J1117K0590L3963n5087k8046J3093L9813N1528m330M4665j3507j9559
$$ -65319 -54202 -33612 351 -54736 -82782 -69689 -29876 21652 17322 61987 48480 28921
15128B8921p18j8496j2801n089j8411J5977j6841n2289K9708M9284m3229l9640
$$ 28921 28203 9707 -3094 -8183 -26594 -10617 -27458 -79747 -50039 -755 -43984 -83624
15116h3624q350j3203L8473N9018L141k0499k7799R919N669o560R5359K9238k7489
$$ -83624 -91974 -105177 -66704 -7686 -4545 -25044 -52843 -42924 -37255 -43815 51544 80782 53293
15103E3293n5400k6459J4056J5101K5437j2966j9927l6422j7794J0185R290K2087
$$ 53293 -2107 -28566 -14510 591 26028 13062 -6865 -43287 -61081 -50896 -41606 -19519
15091a9519l8620j9553Q900n2154J3265N263R469M263N1496o269R202K5078n9294
$$ -19519 -58139 -77692 -68792 -120946 -107681 -102418 -92949 -88686 -37190 -43459 -34257 -9179 -68473
15078f8473o3614o3513O2109M5911L246j5413j8679L4284L2513K5618j960j6501
$$ -68473 -132087 -195600 -133491 -87580 -84334 -99747 -118426 -84142 -51629 -26011 -27971 -44472
15066d4472k2053J15530L1498j20351o7692j1376m205k1872O2390R244M7500M9224
$$ -44472 -66525 49005 80503 -39848 -107540 -118916 -123121 -144993 -82603 -73359 -25859 23365
15054B3365m643k1273O810K784N079p1582r647L0966J5889L2368L4824k6559l8083
$$ 23365 18722 -2551 4259 7043 12122 -59460 -69107 -38141 -22252 10116 44940 18381 -19702
15041a9702k6364m6785M938K8872K9676l4746K514N3291n654j3534o0637L5044
$$ -19702 -46066 -92851 -87913 -59041 -29365 -64111 -61597 -8306 -13960 -27494 -88131 -53087
15029e3087L1602l5390M168Q4903O9992p2798p0549K090K1892L2034M6782j2777
$$ -53087 -21485 -56875 -52707 32196 102188 29390 -41159 -39069 -17177 14857 61639 48862
15017D8862k1154n1075m1808n083L7675N4951O0148n739l4515N8110Q2232L0575
$$ 48862 27708 -23367 -65175 -70258 -32583 22368 82516 76777 42262 100372 182604 213179
15005B13179j8774J1599P4069N4258L5632J32508J49809K31144L48122O23481
$$ 213179 194405 206004 280073 334331 369963 502471 652280 883424 1231546 1855027
14995A855027J039591J997472L033847J949064j24961r05525r92063j347522j877670
$$ 1855027 2894618 4892090 7925937 9875001 9750040 8844515 7852452 6504930 4627260
14986D627260j563103r85344n18450l19572k51859j36370j09834j36786j10822
$$ 4627260 3064157 2078813 1560363 1240791 988932 852562 742728 605942 495120
14977D95120q5158k9891o577j6071J384l7655j5212q836j7249m1447j8342m990
$$ 495120 409962 380071 373494 357423 358807 321152 305940 297104 279855 238408 220066 215076
14965B15076l165L0754m3925n0293L1807m4438l9428L1505K1739K0505r1088j7242
$$ 215076 211911 242665 198740 148447 180254 135816 96388 127893 149632 170137 79049 61807
14953F1807O5433M2927k7639k3049K2669O806m3836L081k3764n5377j0059r956
$$ 61807 127240 170167 142528 119479 142148 148954 105118 108199 84435 29058 18999 9043
14941I043J7318j8695M9483k76j5031j448j2722j1430M4336k1595o1706m7099
$$ 9043 26361 7666 57149 56873 41842 40394 27672 16242 60578 38983 -22723 -69822
14929f9822K5912N2469k9814K6382J6416N804N7138R9801l86m1588m4315j8567
$$ -69822 -43910 8559 -21255 5127 21543 27347 84485 184286 183900 142312 97997 79430
14917G9430J7536j8435R115n2466J7364O342k8644k0402q895K4416k391P2775
$$ 79430 96966 78531 87646 35180 52544 58886 30242 9840 945 25361 22970 95745
14905I5745K9700l2624M057Q2951k8284m4208q6755n7593p0077j3810M0024m650
$$ 95745 125445 92821 96878 179829 151545 107337 20582 -37011 -107088 -120898 -80874 -85524
14893h5524K2923M3522R908L8340j1498j1964o5835R6702P0370q889P447o6033
$$ -85524 -62601 -19079 -9171 29169 17671 5707 -60128 36574 106944 98055 105502 39469
14881C9469j6606L8328M5434n2958o368N5537j8135l2077J9286L8222j2651k4102
$$ 39469 22863 61191 106625 53667 47299 102836 84701 52624 71910 110132 97481 73379
14869G3379k5263L5612j0354n278m027o5170k5821k1171N3789J2551o7919L0946
$$ 73379 48116 83728 73374 68096 64069 -1101 -26922 -48093 5696 18247 -49672 -18726
14857a8726R0904k8833m8197l0692K3467N1537o892J9237K1197k7714R539J574
$$ -18726 72178 43345 -4852 -35544 -12077 39460 32568 51805 73002 45288 54827 56401
14845E6401J0389J3327K2255q979j3649j3764j6036J1849j7205m4440J6473K5558
$$ 56401 66790 80117 102372 93393 79744 65980 49944 61793 44588 148 16621 42179
14833D2179L0367k4045J7042j6380J3892J9603m5780p1564j2727M3424J1355j0052
$$ 42179 72546 48501 65543 49163 63055 82658 36878 -34686 -47413 -3989 7366 -2686
14821b686J267m5841J5275J5535k1195J092L990j5N9158O306L1156l0573l5170
$$ -2686 -1419 -47260 -31985 -16450 -37645 -36553 -32563 -32578 26580 32886 64042 33469 -1701
14808a701k5076J9392N898k2847j4843l5770j2711k2710J9443j6729M4589K640
$$ -1701 -26777 -7385 -1487 -24334 -39177 -74947 -87658 -110368 -90925 -107654 -63065 -60425
14796f0425n3610k9222L6165k68M3677K6100l0943N9126j0095J1699j3095l0084
$$ -60425 -114035 -143257 -107092 -107360 -63683 -37583 -68526 -9400 -19495 -7796 -20891 -50975
14784e0975L0623l4521k3763P166J083p3885M3163M8302J18470L9775m3115m311
$$ -50975 -20352 -54873 -78636 -71470 -70387 -144272 -101109 -52807 65663 105438 62323 58012
14772E8012K4216n3906n2522m278O8289L6864k5565m6255q183J5532J1l8033k4334
$$ 58012 82228 28322 -24200 -28478 39811 76675 51110 4855 -3328 12204 12215 -25818 -50152
14759e0152m7700M6109P2376L5377l1451K7333P4290M4084j3581k181n5028m6646
$$ -50152 -97852 -51743 20633 56010 24559 51892 126182 170266 156685 154504 99476 52830
14747E2830q793q5432k1461J2395L8807L756L2406K5328r945j1214l4859l1998
$$ 52830 44037 -41395 -62856 -50461 -11654 -7898 24508 49836 39891 28677 -6182 -38180
14735c8180K5823J0128O281J0340J8804L1229m1591L395J9827J4187o6409l4407
$$ -38180 -12357 -2229 4052 14392 33196 64425 22834 26229 46056 60243 -6166 -40573
14723d0573K060N3639J02053J0237n2407k6690q426r378m0134j9280k845J7406
$$ -40573 -38513 15126 117179 127416 75009 48319 39893 30515 -9619 -28899 -31744 -14338
14711a4338J4036N7498M8520n1485j884K9609M246k4306n8272o2508K845O6028
$$ -14338 -302 57196 105716 54231 52347 81956 86202 61896 3624 -58884 -56039 9989
14699I989L8882K9594l2009k5624J7847L1713J3424j7044L6837N328k8838j4774
$$ 9989 48871 78465 46456 20832 38679 70392 83816 66772 103609 108937 80099 65325
14687F5325r064j1157j5808j2037o4405n9483L0879P94K3265M2944L9285j3700
$$ 65325 56261 45104 29296 17259 -47146 -106629 -75750 -74956 -51691 -8747 30538 16838
14675A6838n4274l9981k7606j2119L1370N4214M3965J4929r15m7020n504L076
$$ 16838 -37436 -77417 -105023 -117142 -85772 -31558 12407 27336 26421 -20599 -26103 -23027
14663b3027r726j6381n828j8886O2017N2446l6061L5821O0572j5727l4285m4157
$$ -23027 -32753 -49134 -54962 -73848 -11831 40615 4554 40375 100947 85220 50935 6778
14651F778P643J5648k1455j4453n6848k4224K2504M2913L8625L8556j6007k6414
$$ 6778 14421 30069 8614 -5839 -62687 -86911 -64407 -21494 17131 55687 39680 13266
14639A3266M8840M3343K2068P2102j1669o0658q958k792L345J835K4679j2059
$$ 13266 62106 105449 127517 199619 187950 127292 118334 115542 118887 120722 145401 133342
14627A33342j5966M0842q114l3167N0552l3526n5524j0189N5286P5112l4924l1097
$$ 133342 117376 158218 150104 116937 167489 133963 78439 68250 123536 198648 163724 132627
14615A32627n481j5619J5076N9617K8083k0324L197Q9434J3899J470N0693J7912
$$ 132627 127146 111527 126603 186220 214303 193979 197176 286610 300509 301979 352672 370584
14603C70584m5999m8486q5691j3129P873p1262l1147K6059J6321K9160K020m7716
$$ 370584 324585 276099 190408 177279 185152 113890 82743 108802 125123 154283 156303 108587
14591A08587j38955o6294L7732O892K1170O2568K2989k3572k1280k5544M4154
$$ 108587 -30368 -96662 -58930 -52038 -30868 31700 54689 31117 9837 -15707 28447
14580B8447K0237l8922J7811n5119o765l067j1966M3438K2552K8396N2263l7830
$$ 28447 48684 9762 27573 -27546 -34311 -37378 -49344 -5906 16646 45042 97305 59475
14568E9475n4086K1942l3861j8659K0721j5777L7474j8547M677M8083j143l3601
$$ 59475 5389 27331 -6530 -25189 -4468 -20245 17229 -1318 3359 51442 50299 16698
14556A6698l1858J4365J1044m5650k3374O6798O73o9892K6802L9754n1073J1768
$$ 16698 -15160 -795 10249 -35401 -58775 8023 8696 -61196 -34394 5360 -45713 -33945
14544c3945O055L3678l6273k5162N717L0543N7465q72L9515K1470n9656N8444
$$ -33945 -27890 5788 -30485 -55647 -49930 -19387 38078 37206 76721 98191 38535 96979
14532I6979o763L0702l7004j01355j314K3878Q405k7096n530J9089L6009J4580
$$ 96979 90216 120918 83914 -17441 -18755 5123 13528 -13568 -19098 -9 36000 50580
14520E0580l71N898M0017m7559p3670K794J6240q859J2599J3746j3680n8864k0381
$$ 50580 50209 56107 96124 48565 -25105 -22311 -6071 -14930 -2331 11415 -2265 -61129 -81510
14507h1510J281j1072j9275o699O5994J3211K1359R7722J7288l1948l1827m6296
$$ -81510 -80229 -91301 -110576 -117275 -51281 -38070 -16711 81011 98299 66351 34524 -11772
14495a1772L2572L2697l4662L572Q1279l1295p0207l966N8515L9756K0557n2137
$$ -11772 20800 53497 18835 22407 103686 72391 2184 -1782 56733 96489 117046 64909
14483F4909o2441J6448j9963o1802m6225M0953N7964M2112L3113j1886q230q521
$$ 64909 2468 18916 -1047 -62849 -109074 -68121 -10157 31955 65068 53182 44952 36431
14471C6431j7866l3933o669L1349r958j9474o056k0692M2184O992j686M6634J3776
$$ 36431 18565 -15368 -22037 9312 -646 -20120 -26176 -46868 -4684 2308 622 47256 61032
14458F1032m3094o2454l0645Q8130J08559n2399o4106j9332L0610r2519l930J2633
$$ 61032 17938 -44516 -75161 12969 121528 69129 5023 -14309 16301 -76218 -80148 -67515
14446f7515N714O1479q48n7057L379L0800M4962j02444k4236N6176J848k2309
$$ -67515 -61801 -322 -1170 -58227 -54848 -24048 20914 -81530 -105766 -49590 -47742 -70051
14434g0051J2321l0573P2888K1736K565J3686J14153L7795l8433j1305n4925L7651
$$ -70051 -57730 -88303 -15415 6321 8886 22572 136725 174520 136087 124782 69857 107508
14422A07508M8762n5405p3897m9485N944Q331M477K941j1396M3675N2742J2434
$$ 107508 156270 100865 26968 -22517 -16573 -8242 -3765 -824 -12220 31455 84197 96631
14410I6631k4648p651L812k0667k8714m9624n7747J4115L3763N380P1318M6220
$$ 96631 71983 64332 68144 47477 18763 -30861 -88608 -74493 -40730 -35350 35968 82188
14398H2188m2829n9589n8495M7100O3560m4116j7587o4579O5033O6895l1423l9753
$$ 82188 39359 -20230 -78725 -31625 31935 -12181 -29768 -94347 -29314 37581 6158 -33595
14386c3595j4511p457N9433J6533k2687j4407L5413m1005p7095L2233K0906O5877
$$ -33595 -48106 -55563 3870 20403 -2284 -16691 18722 -22283 -99378 -67145 -46239 19638
14374A9638O1992j0812k5144j9129L832Q828l4597j5763K9138j3181L9992J2719
$$ 19638 81630 70818 45674 26545 30377 39205 4608 -11155 17983 4802 44794 57513
14362E7513K691m5948j6464j3955J9628O0674N9623m8474J0190O403J6439K985
$$ 57513 60204 14256 -2208 -16163 3465 64139 123762 75288 85478 91881 108320 111305
14350A11305p1407k5062k2427m0596R066j045J7756N3228P264k598k5056p0465
$$ 111305 39898 14836 -7591 -48187 -39121 -40166 -22410 30818 38082 35484 10428 -60037
14338f0037K2596M3040j4263j0409j7557l2742M1566P9436L9345l5554o0595M4165
$$ -60037 -37441 5599 -8664 -19073 -36630 -69372 -27806 51630 90975 55421 -5174 38991
14326C8991K1048o3845L5174L4878m80J6224k6034L3020k0640m4000o605m1727
$$ 38991 60039 -3806 31368 66246 65766 81990 55956 88976 68336 24336 17731 -23996
14314b3996m5692K5230k5224K7605K2899M8723L1682M339k2996l4840J5619J0330
$$ -23996 -69688 -44458 -69682 -42077 -19178 29545 61227 65566 42570 7730 23349 33679
14302C3679L2381l0725m8057L4434o901J5707o6930o6263k6492K6510N2940j6021
$$ 33679 66060 35335 -12722 21712 14811 30518 -36412 -102675 -129167 -102657 -49717 -65738
14290f5738J8491J400k9083L4330j3720K2513M1112j5651l9444k2347J8836M0447
$$ -65738 -47247 -45847 -74930 -40600 -54320 -31807 9305 -6346 -45790 -68137 -49301 -8854
14278h854K2768J3822J0317L191J8498p2033o973j4682o7864M3163L6625P202
$$ -8854 13914 27736 38053 41244 59742 -12291 -19264 -33946 -101810 -58647 -22022 -14820
14266a4820L6887O9288L398n9789m1143j3355K677p890j2238L9788k0883k7964
$$ -14820 22067 91355 94753 34964 -6179 -19534 -16857 -24747 -36985 2803 -18080 -46044
14254d6044Q915M5241Q624j6404K8157k657k0240J4394j4919J3027R180k3137
$$ -46044 -37129 8112 16736 332 28489 25832 5592 19986 5067 18094 27274 4137
14242D137l170l5910J4092P2843K2456L0053k2312l6899J2955J4085p0788l1147
$$ 4137 967 -34943 -20851 51992 74448 104501 82189 45290 58245 72330 1542 -29605
14230b9605j7651k8720K5117O1234L4764J8724n9829m6553J9730k0852L1051N6513
$$ -29605 -47256 -75976 -50859 10375 45139 63863 4034 -42519 -22789 -43641 -12590 43923
14218D3923j3595l1915M3426K3056o33m8878k4j6324o3722J9782L0106J8804P197
$$ 43923 30328 -1587 41839 64895 64262 15384 15360 -964 -64686 -44904 -14798 4006 11203
14205A1203J1575j8841l4429K4484q462J0795K6350M5439k6727l3584m813l826
$$ 11203 22778 3937 -30492 -6008 -14470 -3675 22675 68114 41387 7803 2990 -836
14193h36R076J3761J1709l6220k5366j7764n0469l832k7953L7241P4846O7783
$$ -836 8240 22001 33710 -2510 -27876 -45640 -96109 -99941 -127894 -90653 -15807 51976
14181E1976l7222j3669Q8828j8324l6735j3200j8545J1689k4661m4507j4937O0417
$$ 51976 14754 1085 89913 71589 34854 21654 3109 14798 -9863 -54370 -69307 -8890
14169h890m1028l5635M1359O3309J236p793p1699j1272K5923L5239K6265L0774
$$ -8890 -49918 -85553 -44194 19115 20351 12558 -59141 -70413 -44490 -9251 17014 47788
14157D7788j1297n5539k8215k5729J1250L6947q692K5332j6754L7366N8890K5607
$$ 47788 36491 -19048 -47263 -72992 -61742 -24795 -33487 -8155 -24909 12457 71347 96954
14145I6954l9359p8292L815k1483J1671M8802L7588r118l6843k2387p718K225
$$ 96954 57595 -20697 -16882 -38365 -26694 22108 59696 50578 13735 -8652 -16370 -14145
14133a4145k5584l6987J1781J2037l287n1504L9792M3198Q240p6065j9751M1457
$$ -14145 -39729 -76716 -64935 -52898 -56185 -107689 -67897 -24699 -16459 -92524 -112275 -70818
14121g0818R209L6087K8479l8513K7428m112k7565q012p985M2105j8133j7920
$$ -70818 -61609 -25522 2957 -35556 -8128 -12240 -39805 -47817 -55802 -13697 -31830 -49750
14109d9750m188m425J2968K6648k7673Q969K3507J3504J3047k5614m4581L444
$$ -49750 -53938 -58363 -45395 -18747 -46420 -37451 -13944 -440 12607 -13007 -57588 -54144
14097e4144j403J0521J3208J6362N4222n856l2915L5425N849r4224J2191Q2119
$$ -54144 -55547 -45026 -31818 -15456 38766 32910 -5 35420 41269 -52955 -40764 41355
14085D1355m61J40l5704j2333j452l56K640Q123o92Q4642P3078M5151p5676k2379
$$ 41355 40894 41034 5330 -7003 -8455 -8811 -6171 1952 1260 85902 158980 204131 128455 106076
14071A06076k4720L167k4401Q306r841J0426n8775l7083o1377j783l7676N348
$$ 106076 81356 84523 60122 68428 58587 69013 10238 -26845 -88222 -90005 -127681 -122333
14059a22333O0581L7842R574l165j2416N6578l278j1530p2857m00R1667M4664
$$ -122333 -61752 -23910 -14336 -17501 -29917 26661 23383 11853 -61004 -61404 30263 74927
14047G4927J986l5566k0198l2022p9456L4462N8927Q1360M8559l2339j6654l4235
$$ 74927 76913 41347 21149 -10873 -90329 -55867 3060 84420 132979 100640 83986 49751
14035D9751l3547l7370k5456N712M8062j1333m9806K7205P8492K3355K4563k9164
$$ 49751 16204 -21166 -46622 -40910 7152 -4181 -53987 -26782 51710 75065 99628 70464
14023G0464m8880j2436J9025L5006j8140J8018k1028l4186m606n4669m0493K3845
$$ 70464 21584 9148 28173 63179 45039 63057 42029 7843 3237 -51432 -91925 -68080
14011f8080o885J61J4936P1215R782l8528J54l1458m038l8459j122P9489o05j096
$$ -68080 -74965 -74804 -59868 11347 21129 -17399 -17245 -48703 -52741 -91200 -92322 -12833 -13438 -14534
13997a4534m3199j8094m3081l5944m3933o589R6443P7931k4346J9449K8148j6078
$$ -14534 -57733 -75827 -118908 -154852 -198785 -205374 -108931 -31000 -55346 -35897 -7749 -23827
13985b3827k9820j328L2202L6925J0423L987m030n333k6749J2009j6173M3783
$$ -23827 -53647 -54975 -22773 14152 24575 28562 24532 19199 -7550 4459 -11714 32069
13973C2069O473n7241N199P4707o3809m4551l3324N8429J3489J1274o6824o2450
$$ 32069 38542 -18699 -13500 61207 -2602 -47153 -80477 -22048 -8559 2715 -64109 -126559
13961a26559N8158N6222R9196K2978q0828j2216n1242j9166l8614k4762m4703
$$ -126559 -68401 -12179 87017 109995 29167 16951 -34291 -53457 -92071 -116833 -161536
13950a61536L1565O7806N2042N4459k7K2106K9377M2630O870M7733L1255k2782
$$ -161536 -129971 -62165 -10123 44336 44309 66415 95792 138422 145292 193025 224280 201498
13938B01498n4985q7998p8382Q6403L3397l0429P104n2839l1479m8026Q088j6974
$$ 201498 146513 58515 -19867 66536 99933 69504 76608 23769 -7710 -55736 -47648 -64622
13926f4622l2415j7524L0479M7455M0194K8073K6090Q168K9609J9239o7240k3721
$$ -64622 -97037 -114561 -84082 -36627 3567 31640 57730 65898 95507 114746 47506 23785
13914B3785N5265L3680o4274o146M6845J0387K1699O9468Q8083O5349K4479n1540
$$ 23785 79050 112730 48456 42310 89155 99542 121241 190709 278792 344141 368620 317080
13902C17080k3797m6098m2832p546l0835M8907k3577m997o2129m0188p260L6404
$$ 317080 293283 247185 204353 196807 165972 214879 191302 186305 124176 83988 76728 113132
13890A13132J3703m9647k9613k1076o782k417l9450M4230N5214n722o2683J1688
$$ 113132 126835 77188 47575 26499 19717 17300 -22150 22080 77294 71572 8889 20577
13878B0577J09660J9217m3923L2985k4417p288j1876J3426J09964L8496r200L3116
$$ 20577 130237 149454 105531 138516 114099 106811 94935 108361 218325 256821 247621 280737
13866B80737J1243l4336J0856m8697p7391q4102O979m296M9711j4700m484M5512
$$ 280737 291980 257644 268500 219803 142412 58310 65289 60993 110704 96004 91520 137032
13854A37032L0000j0127j6566m2589k5645J5984J2829k5166M1759M239P689J3974
$$ 137032 167032 156905 140339 97750 72105 88089 100918 75752 117511 121750 129439 143413
13842A43413R884n9483m5143M7126k2184L8595M9607p0331l7882l2448N233K1762
$$ 143413 153297 93814 48671 95797 73613 112208 161815 91484 53602 21154 26387 48149
13830D8149J1537k1127l7373k5782q859M3232j3525N9848m0162L2732K0926q598
$$ 48149 59686 38559 1186 -24596 -33455 9777 -3748 56100 15938 48670 69596 60998
13818F0998k6530J5056l1647p7170j6006N3486K7772o525k0001N2782M7316O340
$$ 60998 34468 49524 17877 -59293 -75299 -21813 5959 -566 -20567 32215 79531 85871
13806H5871l9445l4209L3342q92k8139M962L3066R906Q14L892m5763n8760M3337
$$ 85871 46426 12217 45559 44667 16528 21490 54556 64462 65276 69168 23405 -35355 7982
13793G982j9600j6749M2411K2853K6791L3779p087k7274k1661o3682n2957J5823
$$ 7982 -11618 -28367 14044 36897 63688 97467 90380 63106 41445 -22237 -75194 -59371
13781e9371K7492K7992M1701l5233m0536n270k9069J4919K2394M3805J2593N243
$$ -59371 -31879 -3887 37814 2581 -37955 -43225 -72294 -57375 -34981 8824 21417 26660
13769B6660j6174K8886J9492J6079m7656j8027m039J3526l0243j6458L9141l3526
$$ 26660 10486 39372 58864 74943 27287 9260 5221 18747 -11496 -27954 11187 -22339
13757b2339j9696n704M0104M193l4803j2479N014j3078N659J6894O463l420L598
$$ -22339 -42035 -47739 -7635 -3442 -38245 -50724 -45710 -58788 -53129 -36235 -29772 -33192 -29594
13744b9594k1477J7427l6127j9373Q211N5463L5619p0411N3704K6403j4754m4120
$$ -29594 -51071 -33644 -69771 -89144 -80933 -25470 10149 -60262 -6558 19845 5091 -39029
13732c9029k4338K1212j0792L3446O362l9253J8385L6393m113k5319n9123j8976
$$ -39029 -63367 -42155 -52947 -19501 -13139 -52392 -34007 2386 -1727 -27046 -86169 -105145
$$ [...]
##END NTUPLES=NMR SPECTRUM
##END=
