##TITLE=Analysis number 320238
Compound Code km 05717
Project Code adrs
Chemist Name fudan
##JCAMPDX= 6.0         $$ Bruker NMR JCAMP-DX V2.0
##DATA TYPE= NMR SPECTRUM
##DATA CLASS= NTUPLES
##ORIGIN= Bruker BioSpin GmbH
##OWNER= nmr
$$ XWIN-NMR		Version 3.5
$$ Mon Jun 19 13:45:33 2006 GMT Daylight Time (UT+1h)  MAYBRIDGE\nmr@NMR_250MHZ
##.OBSERVE FREQUENCY= 250.131544655141
##.OBSERVE NUCLEUS= ^1H
##.ACQUISITION MODE= SIMULTANEOUS (DQD)
##.ACQUISITION SCHEME= undefined
##.AVERAGES= 16
##.DIGITISER RES= 18
##SPECTROMETER/DATA SYSTEM= dpx250
##.PULSE SEQUENCE= zg30
##.SOLVENT NAME= DMSO
##.SHIFT REFERENCE= (INTERNAL, DMSO, 0, 16.522)
##AUDIT TRAIL= $$ (NUMBER, WHEN, WHO, WHERE, WHAT)
$$ ##TITLE= Audit trail, XWIN-NMR		Version 3.5
$$ ##JCAMPDX= 5.01
$$ ##ORIGIN= Bruker BioSpin GmbH
$$ ##OWNER= nmr
$$ C:\u/data/dgb/nmr/ADRS/1030/pdata/1/auditp.txt
$$ ##AUDIT TRAIL=  $$ (NUMBER, WHEN, WHO, WHERE, WHAT)
(   1,<2006-06-19 13:45:11.25 +100>,<MAYBRIDGE\nmr>,<NMR_250MHZ>,
      <created by zg, POWCHK disabled, PULCHK disabled
       configuration hash MD5:
       E2 DF 36 D8 04 B2 41 60 5A D7 A3 38 5A 4B D0 FE
       data hash MD5: 64K
       FA BA 6D 95 66 06 16 FA C6 71 20 BA 27 0C 78 82>)
(   2,<2006-06-19 13:45:23.71 +100>,<MAYBRIDGE\nmr>,<NMR_250MHZ>,
      <Start of raw data processing
       ef LB = 0.3 FT_mod = 6 PKNL = 1 SI = 32K 
       data hash MD5: 32K
       05 2D 36 B0 FB CB A4 B9 BE 1E A3 D6 10 41 24 5E>)
(   3,<2006-06-19 13:45:25.31 +100>,<MAYBRIDGE\nmr>,<NMR_250MHZ>,
      <apk 
       data hash MD5: 32K
       80 DE 72 D2 7A BB 7E 18 BD BE E8 D6 2F F5 D3 12>)
(   4,<2006-06-19 13:45:26.09 +100>,<MAYBRIDGE\nmr>,<NMR_250MHZ>,
      <abs ABSG = 5 
       data hash MD5: 32K
       E9 12 5A 74 6C C4 92 5C EC 7D F5 A2 AA 8E 2A 32>)
$$ ##END=
$$ 
$$ hash MD5
$$ C3 C4 72 57 53 29 E0 69 D6 8D 69 D9 A0 2C 00 60
##$RELAX= 
##$RELAX= 
##$RELAX= 
##$RELAX= 
##$RELAX= 
##$RELAX= 
##$RELAX= 
$$ Bruker specific parameters
$$ --------------------------
##$DU= <C:\u>
##$EXPNO= 1030
##$NAME= <ADRS>
##$PROCNO= 1
##$TYPE= <nmr>
##$USER= <dgb>
##$AMP= (0..31)
100 100 100 100 100 100 100 100 100 100 100 100 100 100 100 100 100 100 
100 100 100 100 100 100 100 100 100 100 100 100 100 100 
##$AQSEQ= 0
##$AQ_mod= 3
##$AUNM= <au_zg>
##$AUTOPOS= <32 >
##$BF1= 250.13
##$BF2= 250.13
##$BF3= 250.13
##$BF4= 250.13
##$BF5= 500.13
##$BF6= 500.13
##$BF7= 500.13
##$BF8= 500.13
##$BYTORDA= 1
##$CFDGTYP= 0
##$CFRGTYP= 5
##$CHEMSTR= <none>
##$CNST= (0..31)
1 1 145 1 1 1 1 1 1 1 1 1 1 1 1 1 1 1 1 1 1 1 1 1 1 1 1 1 1 1 1 1 
##$CPDPRG= <>
##$CPDPRG1= <>
##$CPDPRG2= <>
##$CPDPRG3= <>
##$CPDPRG4= <mlev>
##$CPDPRG5= <mlev>
##$CPDPRG6= <mlev>
##$CPDPRG7= <mlev>
##$CPDPRG8= <mlev>
##$CPDPRGB= <>
##$CPDPRGT= <>
##$D= (0..31)
0 1 0 0 0 0 0 0 0 0.06 0 0 0 0 0 0 0.0002 0 0 0 0 0 0 0 0 0 0 0 0 0 0 
0 
##$DATE= 1150721110
##$DBL= (0..7)
120 120 120 120 120 120 120 120 
##$DBP= (0..7)
150 150 150 150 150 150 150 150 
##$DBP07= 0
##$DBPNAM0= <>
##$DBPNAM1= <>
##$DBPNAM2= <>
##$DBPNAM3= <>
$$ [...]
##$SUBNAM7= <"">
##$SUBNAM8= <"">
##$SUBNAM9= <"">
##$SW= 20.6930455092707
##$SWIBOX= (0..15)
0 0 3 0 0 0 0 0 0 0 0 0 0 0 0 0 
##$SW_h= 5175.983436853
##$TD= 65536
##$TD0= 1
##$TE= 294.16
##$TE2= 300
##$TE3= 300
##$TEG= 300
##$TL= (0..7)
0 120 120 120 120 120 120 120 
##$TP= (0..7)
150 150 150 150 150 150 150 150 
##$TP07= 0
##$TPNAME0= <>
##$TPNAME1= <>
##$TPNAME2= <>
##$TPNAME3= <>
##$TPNAME4= <>
##$TPNAME5= <>
##$TPNAME6= <>
##$TPNAME7= <>
##$TPOAL= (0..7)
0.5 0.5 0.5 0.5 0.5 0.5 0.5 0.5 
##$TPOFFS= (0..7)
0 0 0 0 0 0 0 0 
##$TUNHIN= 0
##$TUNHOUT= 0
##$TUNXOUT= 0
##$USERA1= <user>
##$USERA2= <user>
##$USERA3= <user>
##$USERA4= <user>
##$USERA5= <user>
##$V9= 5
##$VALIST= <valist>
##$VCLIST= <CCCCCCCCCCCCCCC>
##$VD= 0
##$VDLIST= <DDDDDDDDDDDDDDD>
##$VPLIST= <PPPPPPPPPPPPPPP>
##$VTLIST= <TTTTTTTTTTTTTTT>
##$WBST= 1024
##$WBSW= 4
##$XGAIN= (0..3)
0 0 0 0 
##$XL= 0
##$YL= 0
##$YMAX_a= 393522
##$YMIN_a= -375245
##$ZGOPTNS= <>
##$ZL1= 120
##$ZL2= 120
##$ZL3= 120
##$ZL4= 120
##$ABSF1= 16.522
##$ABSF2= -4.171173
##$ABSG= 5
##$ABSL= 3
##$ALPHA= 0
##$AQORDER= 0
##$ASSFAC= 0
##$ASSFACI= 0
##$ASSFACX= 0
##$ASSWID= 0
##$AUNMP= <proc_1d>
##$AZFE= 0.1
##$AZFW= 0.1
##$BCFW= 0
##$BC_mod= 0
##$BYTORDP= 0
##$COROFFS= 0
##$CY= 12.5
##$DATMOD= 1
##$DC= 0
##$DFILT= <>
##$DTYPP= 0
##$F1P= 14.0000005364418
##$F2P= -0.99999901652339
##$FCOR= 0.5
##$FTSIZE= 32768
##$FT_mod= 6
##$GAMMA= 0
##$GB= 0
##$INTBC= 1
##$INTSCL= 1
##$ISEN= 128
##$LB= 0.3
##$LEV0= 0
##$LPBIN= 0
##$MAXI= 10000
##$MC2= 0
##$MEAN= 0
##$ME_mod= 0
##$MI= 0
##$NCOEF= 0
##$NC_proc= -5
##$NLEV= 6
##$NOISF1= 0
##$NOISF2= 0
##$NSP= 0
##$NTH_PI= 0
##$NZP= 0
##$OFFSET= 16.522
##$PC= 1
##$PHC0= 167.0781
##$PHC1= 8.072927
##$PH_mod= 1
##$PKNL= yes
##$PPARMOD= 0
##$PSCAL= 4
##$PSIGN= 0
##$REVERSE= no
##$SF= 250.13
##$SI= 32768
##$SIGF1= 0
##$SIGF2= 0
##$SINO= 400
##$SIOLD= 32768
##$SREGLST= <1H.DMSO>
##$SSB= 0
##$STSI= 32768
##$STSR= 0
##$SW_p= 5175.98343685301
##$SYMM= 0
##$S_DEV= 0
##$TDeff= 65536
##$TDoff= 0
##$TI= <Analysis number 999999
Compound Code 99
Book Reference 9
Project Code 9>
##$TILT= no
##$TM1= 0
##$TM2= 0
##$TOPLEV= 0
##$USERP1= <user>
##$USERP2= <user>
##$USERP3= <user>
##$USERP4= <user>
##$USERP5= <user>
##$WDW= 1
##$XDIM= 32768
##$YMAX_p= 379175383
##$YMIN_p= -614299
$$ End of Bruker specific parameters
$$ ---------------------------------
##NTUPLES= NMR SPECTRUM
##VAR_NAME=  FREQUENCY,     SPECTRUM/REAL,   SPECTRUM/IMAG
##SYMBOL=    X,             R,               I
##VAR_TYPE=  INDEPENDENT,   DEPENDENT,       DEPENDENT
##VAR_FORM=  AFFN,          ASDF,            ASDF
##VAR_DIM=   32768,         32768,           32768
##UNITS=     HZ,            ARBITRARY UNITS, ARBITRARY UNITS
##FACTOR=    0.157963299565203, 1,           1
##FIRST=     4132.6476996994, 0,             0
##LAST=      -1043.33573715361, 0,           0
##MIN=       -1043.33573715361, -614299,     0
##MAX=       4132.6476996994, 379175383,     0
$$ Real data points
##PAGE= N=1
##DATA TABLE= (X++(R..R)), XYDATA
$$ [...]
27938 43121 64824 173565 119732 140338 170698 169176 93573 171470 209312 289741 320976 328981
27926 328981 234366 212094 231094 387535 357594 446811 449772 371071 312728 328571 390733
27915 390733 329354 372280 290048 301848 310520 387673 327423 322862 361121 381035 341658 246964
27903 246964 114576 51967 78760 110553 111347 61432 208331 245174 501840 571382 325296
27892 325296 195614 136897 157316 278390 466961 559334 609432 534822 319256 223038 349257
27881 349257 235668 130934 105529 51573 -10142 61784 131103 320354 377833 235994 170922
27870 170922 81220 141260 155078 127150 117001 179897 382981 387772 348840 410529 364383
27859 364383 215736 166517 92725 41613 149683 165379 120832 79111 140752 99292 150802
27848 150802 354600 379588 233162 225295 198681 91810 48213 81887 69134 87948 74578
27837 74578 155804 368362 393816 378594 274678 72690 -42207 -70323 69051 280198
27827 280198 282607 276948 163812 330761 546439 411520 261099 220667 274700 147835 184704
27816 184704 307088 240817 225112 239558 180301 78466 126145 164217 116525 156963 271507
27805 271507 170969 201052 336456 123468 -27508 -76301 -98134 -67126 100037 253301
27795 253301 356790 380545 241797 269022 325587 451697 516767 412135 266821 115781
27785 115781 -9216 -11067 20606 83679 -1231 38056 44044 -16353 -12170 79405 88018 54759
27773 54759 124841 101047 20586 119487 202421 24462 59436 411934 493806 388332 247202
27762 247202 8838 186645 276384 215771 333852 343584 135478 206149 181809 133035 -2854
27751 -2854 -126123 -62870 -94837 34727 160143 18467 34879 57092 106930 165213 127912
27740 127912 107018 184354 121045 89430 214663 237036 275934 139852 69540 109418 87085
27729 87085 -165881 -176912 -117134 -17391 101392 137712 163635 93510 92976 184073 157138 103715
27717 103715 224053 367016 321297 256871 209533 253235 200250 189077 263349 334936 446554
27706 446554 394790 243875 159232 194802 289257 313092 177986 114672 213585 306293 171149
27695 171149 -27681 -8073 75684 93540 125498 98686 224255 355416 178418 143151 209590
27684 209590 379083 302659 229185 104670 91876 221854 204477 8121 -155803 -76609
27674 -76609 -43853 61052 349811 263564 -79944 -199443 -149440 -87429 -21928 115892 60523
27663 60523 96034 45028 96565 -31618 -14080 -48021 -4708 -61381 -21200 60214 303249
27652 303249 290791 170961 44826 271832 344816 264701 166714 180581 258328 -20927 -126461
27641 -126461 -162014 72455 85483 52180 13932 -74597 -72155 35079 153357 303420 348005
27630 348005 244714 52665 -17925 123171 48228 -316 -85191 -109338 -46353 -9133 106291
27619 106291 167882 150062 99574 108218 152651 171432 224504 94105 4526 139417 125904
27608 125904 58423 -123877 -30934 172193 94639 -15906 206195 375810 392759 340666
27598 340666 304930 342096 151728 95366 -2744 -102579 12550 -178092 -273672 -350397 -206294
27587 -206294 17859 98270 83744 301689 225053 162118 96463 -58039 -24818 84092 163358
27576 163358 264740 334527 377218 402419 452905 262840 142841 -11644 -84932 -104156 4402
27565 4402 31472 105894 167274 162034 106442 252001 161023 37499 12840 -240017 -244503 -235970
27553 -235970 -72439 140216 188390 81385 100359 4950 85574 114889 44527 21069 -150064
27542 -150064 -107861 95947 177329 150793 197794 403871 491844 326919 334989 206873 96937
27531 96937 91143 73186 47541 -24208 68786 295905 389309 208590 -17876 -72427 -77558
27520 -77558 30450 141357 296383 247639 -13095 -31016 -12750 42525 47952 172970 337985
27509 337985 255656 318586 286582 100867 138009 189017 112537 35419 19288 98638 152678
27498 152678 -16632 -144262 -65493 -41470 -18701 42463 -41764 -136816 -149643 -377681 -409117
27487 -409117 -174563 -135505 -39835 -46760 100912 228588 249429 230908 51349 41507 107
27476 107 -67225 -105899 -53013 -39470 -17035 -47473 16057 95415 37702 106680 76962 32715
27464 32715 28620 -40289 -47035 -19724 46811 -13091 -208584 -224354 -173482 -134127 -270578 -238004
27452 -238004 81437 258842 186654 17785 -119689 -120723 -11729 -57256 -158640 -131015
27442 -131015 712 127774 170374 282064 106239 -64623 -117428 -60112 -26801 31311
27432 31311 96346 114697 150340 182804 181644 218433 181753 209597 285287 317596 284848 129363
27420 129363 265982 442324 357856 344427 316794 318488 199412 207049 252323 305417 175884
27409 175884 95732 175944 315430 234463 225394 259445 233405 237927 327779 197549 -4643
27398 -4643 39229 230278 352984 310132 173492 -102375 -28607 -57308 -2503 53 -39094
27387 -39094 -11915 41263 155747 170029 25697 -178403 88896 105632 -57360 -10732 -117219
27376 -117219 -112835 -115873 -81536 14147 212344 276990 317301 165091 37474 19594 39045
27365 39045 60947 75425 40479 84356 -22318 -99674 146251 157162 -16382 -110531 -224590
27354 -224590 -233267 -226372 -209879 -242458 -92934 135098 9797 59865 144898 145847 129116 199592
27342 199592 144599 86189 203621 343819 291312 243890 82512 -1137 110691 62336 -1800
27331 -1800 -119459 -20139 21401 63290 52855 21715 140700 118106 172834 260737 326046
27320 326046 175978 -40580 -14987 39898 63417 -13991 -7276 4804 33613 172006 9532
27309 9532 106027 5084 -86695 81291 133565 291092 234636 297803 117495 -63395 -57700
27298 -57700 -32155 -109425 -168609 -193918 -264631 -187557 24759 6192 16504 43962 112781
27287 112781 51877 82131 186939 263271 289185 305885 288206 204279 175899 30114 -113335
27276 -113335 -56507 -2358 83684 30985 -4451 -50920 -62466 16939 -31844 -161259 -361734
27265 -361734 -364116 -301316 -76358 79632 53218 -348309 -526085 -336594 -173576 -12667
27255 -12667 125404 212760 88208 106318 114374 -30367 -56101 39870 44876 25103 118577
27244 118577 252905 216557 148343 239915 337789 334099 232436 30058 -57196 -145690 -91936
27233 -91936 114422 166251 248898 242850 122991 13552 11477 -142993 -219776 -114591 98508
27222 98508 -114232 -191320 81917 254755 187313 72126 65319 186963 134048 30588 -16759
27211 -16759 -50972 6358 184188 187616 125298 146956 64691 42311 59478 32576 99795 228632
27199 228632 38775 39362 190124 112342 150798 123375 65366 -116958 -36137 -131679 -140335
27188 -140335 -75212 -50706 928 36564 87980 208565 158538 245936 102713 -68496 -195
27177 -195 160459 283240 178634 67156 117168 51087 9943 68011 82974 130727 275242
27166 275242 302105 210518 215493 174108 138782 165390 13926 143334 400113 223271 197856
27155 197856 103341 23306 41548 39578 143192 73226 24578 17205 36351 76904 489 -70392
27143 -70392 62043 178935 94424 -141124 -241483 -53441 176404 190919 24671 58404
27133 58404 90476 165094 24977 -27775 116679 261219 139536 144932 73709 67555 59731
27122 59731 -110009 -53577 180639 285856 263315 103093 58904 121887 99991 144251 115242
27111 115242 158762 169443 291955 289594 205719 230254 61442 -29853 -25760 -219709 -259211
27100 -259211 -51363 247874 399475 365625 203626 97262 -23806 -82995 -66788 -135215
27090 -135215 -278837 -271199 -45237 195391 333892 48109 -187631 -191878 -90708 2252
27080 2252 -86016 -25779 9676 -43679 -56297 69407 25667 40153 92750 166738 107269 -5838
27068 -5838 -25329 72802 187996 59296 53091 93513 117180 -116739 -177652 -134036 -165282
27057 -165282 -264577 -78574 -35679 -12201 10640 -22309 -182845 -102022 -73029 89832 41132
27046 41132 71218 92143 112211 171532 385458 259799 183656 323460 240742 67088 -72614
27035 -72614 46535 -90899 -16145 210275 81795 111716 96031 90418 43095 -93143 1075
27024 1075 7295 -39371 61752 150016 167381 35131 -129629 -145191 -199697 -145542 127267
27013 127267 152031 -30660 -32841 96664 33359 -110309 -105991 112798 184512 152509 128427
27002 128427 74359 159402 62378 137585 90904 69432 59371 10169 -12719 -23135 65365
26991 65365 86430 75641 62149 40606 48264 12300 93084 -9518 -10765 56159 -16263 86950
26979 86950 381812 347874 220101 100243 -42708 -19317 -805 -89112 5547 164524 15469
26968 15469 -86598 -122484 54481 108825 81771 156991 142321 2044 -62189 -20648 -66983
26957 -66983 -31517 -6684 -150837 -131036 -188659 -222633 -168917 -103592 -47847 61633 53962
26946 53962 -46348 -72567 -154727 -185570 -62814 -30417 -18512 -105892 -99057 243 -93956
26935 -93956 63878 79616 -59409 -204325 -305782 -182363 -141108 -68531 -224982 -311457
26925 -311457 -276717 -258449 -71964 -62328 -37108 91862 146743 -45605 -94110 -126114 38871
26914 38871 392 38005 117591 176562 143675 -35966 -202990 -233140 -139925 -109257 -67988
26903 -67988 -103138 -155510 -207861 -66670 50174 70412 -75166 -71244 -112196 -61378 9125
26892 9125 -98814 -228022 -166624 -292510 -390069 -174958 -106859 -138940 -94693 118967 173643
26881 173643 56661 98747 171762 35786 -35170 -21848 69109 78042 153768 143313 214975
26870 214975 253790 99265 152805 69658 -149653 -116190 -45285 123794 178203 377 -32085
26859 -32085 130226 174768 37287 23351 -77623 -99070 -2731 15739 -229944 -133449 -146127
26848 -146127 -63943 -32290 22431 -109335 -186741 -129503 -150742 -60452 66894 125948 57289
26837 57289 -24186 -3764 -899 -84832 -72693 -62377 -9723 -23459 -55983 54865 110581 3460
26825 3460 -7621 82706 -107706 -222998 -112992 -19755 -54563 18025 109281 93986 164904
26814 164904 98007 -59300 -29694 -10553 -6229 -157782 -202468 -81881 34283 -119349 -133003
26803 -133003 -218908 -221493 -95714 66345 99553 162076 211996 399464 488341 449449 300264
26792 300264 210734 49863 -72559 -101302 -108489 -116887 -129122 -130109 134231 168619 -36118
26781 -36118 -179160 -203282 -134229 -113119 50194 76329 18727 58276 75206 119945 79396
26770 79396 68293 113606 77704 63587 260646 194071 220923 80240 106433 184014 204031
26759 204031 369734 452974 414128 205729 166821 195235 274385 246210 89252 -52972 -161667
26748 -161667 -203126 -196887 -41506 -3520 -142593 -28458 125590 135167 43055 -29727 -138618
26737 -138618 -37349 54109 -88828 -94247 80445 208045 162857 55193 131716 83922 -15317
26726 -15317 -9557 135831 229684 152692 173072 99378 -4260 -15352 -23031 -52552 12719 64290
26714 64290 112793 186425 138903 72252 37715 -67126 -117726 59726 47388 37637 -30840
26703 -30840 -97410 -240155 -298034 -241113 -168651 -273964 -127059 -133392 -98161 16165 80779
26692 80779 165151 185000 -10825 -77241 -24651 -38133 154361 176178 78557 -16740 -156701
26681 -156701 -225015 -140830 -81285 -158665 -39191 13870 58186 146786 58310 -89693 71353
26670 71353 178803 41408 -31689 43271 -102028 -145208 -85477 -146967 -44673 100167 299107
26659 299107 360591 348368 160247 236421 143048 97945 42742 -67704 21700 68118 17360
26648 17360 128378 296065 290410 201099 141857 66432 17134 -85409 -24428 -125049 -149410
26637 -149410 -183746 -218932 -218940 -53167 -8081 14744 132220 205472 243831 98506 200557
26626 200557 182308 -5524 52614 169907 -3489 -45218 264804 438140 218210 33977
26616 33977 37207 -28459 -93155 -139458 -210152 -171630 -254040 -167567 24701 -36705 -103592 -178173
26604 -178173 -26345 63417 129945 167191 235558 274176 232747 376111 410446 206251 153316
26593 153316 83418 40285 82473 -88000 -210685 -271033 -265973 -177676 -48799 -36073 -159115
26582 -159115 -187700 -96623 56469 110905 73136 11674 -888 -29031 142748 17638 -4279
26571 -4279 3154 -15445 31908 196121 358024 275625 29433 6337 -5585 89624 104935
26560 104935 129606 70079 -93137 -14676 50351 79040 157786 107164 30497 102185 104287
26549 104287 89173 178313 144384 166060 181875 37887 -92435 -57561 10375 35848 31882
26538 31882 -95073 -77095 -30610 -180582 -135893 -48302 179126 313115 215464 223859 108834
26527 108834 90336 82043 -228752 -302718 -4826 -37144 53052 90350 -30873 -128766 -126424
26516 -126424 7084 -28484 -246562 -399176 -219811 125121 177921 86005 -58040 103369
26506 103369 281496 171222 66480 -31471 -68416 -22503 115073 64325 -118937 -279303
26496 -279303 -245150 -173726 -172545 -111756 -68960 14122 141296 342603 198007 143563 135321
26485 135321 391456 465183 422247 310282 258766 73408 -113380 88419 300676 329468
26475 329468 24165 57532 125442 129372 218892 234190 194939 118278 -15400 107124 78070
26464 78070 -101690 -140599 -193700 -191673 -48508 -122635 -279875 -329831 -288632 -220646 -245469
26453 -245469 -287096 -389070 -300340 -153926 -23635 185509 292200 115358 -57496 -80637
26443 -80637 -62546 -74909 -117177 -273120 -362125 -224847 -139317 -254538 -193178 -155136 -102745
26432 -102745 105020 20095 -222630 63961 189730 180653 321373 275194 8979 89453
26422 89453 245665 215524 259182 260993 303280 218296 195061 100177 -30225 -79183 -27908
26411 -27908 263407 161324 111907 68407 112286 249524 147624 -65390 -43818 -70193 -140808
26400 -140808 -25501 257677 249792 123512 -3309 -65230 -74653 -26284 123323 236731 18097
26389 18097 -147575 -102700 -31067 104858 56143 83565 463 41206 164963 245656 240155
26378 240155 310910 237466 108042 102608 107519 -25490 -154234 -107856 911 6943 -1575
26367 -1575 -24849 -203473 -107056 155230 200366 168733 53931 -201051 -256782 -234396 -167407
26356 -167407 -242843 -400741 -298584 -227863 -284125 -220288 -204956 -74988 23240 192464 41193
26345 41193 -47116 119441 348605 114130 -208395 -187726 -132530 -26098 -58070 -84104 18911
26334 18911 20233 -54078 36113 -32853 -195811 -280319 -254619 -177647 120563 277005 210947
26323 210947 59954 -27635 -82819 -13235 79841 86453 122712 -86332 -99114 -41258 1504
26312 1504 -164708 -159276 -203930 -278147 -164336 14007 -137970 -286902 -209717 -125140 26684
26301 26684 137038 152214 76601 -73357 -221178 -29658 102786 93617 123978 270412 193798
26290 193798 -51294 -149831 -176812 -221515 -160150 -74193 46938 7904 1417 139625 288387
26279 288387 181673 154526 87508 -74430 -111196 -51607 72916 116821 60360 -5135 -7370
26268 -7370 123608 267750 187588 163766 203574 290897 204942 60984 144949 79440 75496
26257 75496 41429 -1949 30307 206835 228585 133915 36822 34422 65174 53774 -84834
26246 -84834 -59930 -100869 -180565 -320784 -382726 -197526 -295647 -295488 -369663 -234431 -96427
26235 -96427 -29569 -115310 -19193 66620 145604 241709 121001 18303 39246 -109950 -179834
26224 -179834 -215522 -65296 52520 124092 282974 189920 -21585 -134259 -21819 116996
26214 116996 217237 26618 -174654 -129764 -97082 -172985 -153037 71466 310597 437824
26204 437824 360441 304277 173345 178336 83608 -53955 -38472 -39412 -146795 -119509 -64087
26193 -64087 -94993 -83065 -239738 -459711 -357332 -177071 -34594 -27801 35791 -48811 -19704
26182 -19704 7477 110005 119258 132155 83059 31559 -179459 -132391 37119 4269 -200397
26171 -200397 -155011 -167477 -173547 67425 19912 -78344 -179591 -130329 -141470 -184393 -300545
26160 -300545 -224304 -203389 -77198 202452 368644 235770 203472 81472 67896 -44198
26150 -44198 24360 58087 91024 -21417 -221630 -240724 -191214 -125888 -95020 -12453 45619
26139 45619 30072 60845 17506 -81993 21111 137917 151204 138616 51902 57034 -46032
26128 -46032 -240917 -210340 -27705 -147581 -289380 -174850 -96628 -122903 -224526 -116485
26118 -116485 -47187 -58368 -161933 -222599 -298759 -178128 -116601 -78938 -90324 -27669 -13400
26107 -13400 -164267 -313995 -268270 -35585 199352 416585 489783 280082 -25227 -122679
26097 -122679 -61127 -52352 -3415 141663 245831 195347 152753 -42155 -43748 -64903 -101725
26086 -101725 -106744 70888 137992 39861 -90359 -150840 -232214 -191743 -322219 -355373 -298817
26075 -298817 -198988 -169247 -155604 -193962 -11350 47280 -68227 -144067 -118319 -183365 -48749
26064 -48749 210287 159984 67433 82101 270405 322959 237481 197835 264463 250594 102424
26053 102424 54246 7629 -26486 28852 44040 -2144 -61639 43819 93080 165111 72203
26042 72203 19894 101920 -41727 -33930 119000 72197 135469 73362 26348 109755 117357 291676
26030 291676 254262 181822 -49025 -4094 -52443 -63449 -167636 -190378 -204718 -139407 -216856
26019 -216856 -184139 3817 -21734 -98791 -137964 -124206 -271550 -247641 -90133 -35762 -70013
26008 -70013 -1869 -184220 -139912 24916 41875 19491 -103582 -186751 -124176 26890 154931
25997 154931 224489 140068 -62414 -14387 97226 157385 65341 81368 -63424 -190647 -222474
25986 -222474 -248673 -127145 99937 97462 -127690 -180072 -104594 59962 -84384 -171842 -50648
25975 -50648 -180966 -272430 -214915 -112600 -88680 -45446 -5156 103108 151801 34391 38088
25964 38088 -14215 -164236 14683 62374 -65318 -137209 -125191 -116420 -120241 -110598 -94541 1007
25952 1007 39017 100902 62017 -84254 -115917 -31286 54516 75650 120694 85818 111406 83580
25940 83580 -9787 -79746 -70385 -64837 -6277 12078 -18132 -32627 -32712 -345994 -331959 -47252
25928 -47252 -80130 -66296 125999 125495 51908 -21362 -154889 -317945 -164166 -64435 -117067
25917 -117067 -192747 -256235 -122715 -33900 -38412 -75901 -47561 -31603 74493 72345 17158
25906 17158 -42793 47862 -89919 -38561 79880 61123 102775 -90692 -258217 -158606 -98916
25895 -98916 -34992 -81614 53816 181123 177767 136850 193315 194547 167854 20822 -38610
25884 -38610 -65791 2750 105676 116451 159159 225041 267184 183547 -44658 32766 125609
25873 125609 141116 260569 220746 300747 226943 144042 -70221 -200183 -115591 -27017 45417
25862 45417 50897 104065 204529 292351 297034 164090 -54984 -135577 -145186 -186324 -128811 41775
25850 41775 215085 179058 212150 207364 338476 338550 389545 418606 293380 233069 232030 183765
25838 183765 22846 -108660 -132665 -8831 120002 63714 -7407 100699 91802 -42564
25828 -42564 -150954 -110162 33718 -84375 -19422 -2668 -87736 -117213 -176357 -142628 -59785
25817 -59785 -48249 100968 133794 -42792 -99454 -172679 -140984 -38495 -78560 -168401 -172669
25806 -172669 -45886 -73920 -95870 -41030 -146821 -184298 -100579 34995 -89538 -106729 -256124
25795 -256124 -248049 -67823 -138236 -173495 -146487 -94980 -159697 4853 189927 155827 73772
25784 73772 -1723 -97435 15392 166882 163082 153534 -30302 -232516 -67523 -101902 -72851
25773 -72851 -39077 77891 -75760 -179295 -210611 -52785 44639 94487 -43068 -17171 108403
25762 108403 81212 40113 166404 218409 61354 98117 92247 -76376 -130129 -282874 -268619
25751 -268619 -196811 -43747 -34163 4905 -43374 -8803 -105040 18583 49777 -81126 -215968
25740 -215968 -178402 -125397 -104226 -223576 -212350 -127615 -604 117958 172167 68244 -186243
25729 -186243 -196806 -124371 -26824 22207 175493 36134 -95248 -104125 -82388 -21487 -44686
25718 -44686 -75972 -95368 -70400 -73047 -97219 -45620 -107847 -193566 -311586 -369559 -264127
25707 -264127 -184364 -149583 -361641 -343188 -128881 -93406 -127157 -12701 -52491 -183074 -186717
25696 -186717 -254496 -412942 -426853 -412978 -258715 -184657 -250659 -290479 -324534 -329352 -273691
25685 -273691 -117936 -1357 -70207 -191071 -144104 62514 202870 -941 -70702 -113060
25675 -113060 -115048 -36474 187621 186050 -15794 -93789 -129012 -187053 -72926 -2820 10898
25664 10898 -59145 12444 -81453 -122481 -77434 -55207 -34580 105651 311708 90935 15356
25653 15356 173140 143848 -8831 -33723 72604 23610 -108358 -67479 65456 114984 90979
25642 90979 145374 73943 -106870 -156380 -239915 -110848 80432 101394 21917 -52694 -74727
25631 -74727 -184529 -149801 -19087 58868 -13993 16867 67740 -20669 44340 101242 165168
25620 165168 31051 -73793 -51038 -9685 -73948 -158244 -265949 -190262 -223813 -95053 -18996
25609 -18996 7466 82308 247279 145794 126138 140712 122505 142964 -10294 -850 80388
25598 80388 -15813 -170232 -131272 -148342 -155987 -115095 -118900 -152342 -221495 -145243 -110086 -102582
25586 -102582 -243163 -268614 -74834 -29230 -38838 -152620 -18349 91695 188716 180230 188489
25575 188489 211508 111267 61889 -28645 -174351 -237953 -218429 -180551 -140669 -129975 -43805
25564 -43805 64452 -92753 -167603 -242044 -177727 86636 195547 59443 -152285 -195781
25554 -195781 45522 112124 104719 -16202 -113607 -100225 -129107 -172033 -260454 -272364 -290343
25543 -290343 -327415 -361734 -426820 -352508 -187703 -168417 -239710 -294151 -139349 19552 23254
25532 23254 2994 22361 64910 76672 6525 -46358 -140259 -49138 -62135 51774 275131
25521 275131 380697 212766 113085 86174 -12359 -91172 -163422 -108513 134710 341929 204501
25510 204501 -32514 -35224 -9623 34976 237830 389005 343105 226112 304074 317321 383530
25499 383530 262709 138864 36121 -130174 -106985 -32959 -91519 -19273 -621 -169791
25489 -169791 -46144 180006 174723 62483 -45712 -207829 -182604 -63827 51731 72969
25479 72969 -70394 -204035 -175433 -311812 -343586 -224468 -158117 -123345 -172677 -273508 -331584
25468 -331584 -136201 -82591 29885 115707 192286 165740 141407 7422 29277 26596 -166053
25457 -166053 -82910 71267 -11477 -23605 -39168 -19193 -69550 -177393 -219157 -174352 -64360
25446 -64360 -40261 -84312 -61188 -37947 -103493 -214930 -165303 -40877 4495 44718 45265 -107057
25434 -107057 -127430 -111570 -119431 138798 241644 178559 894 -77425 -105667 32511 200372
25423 200372 224447 326788 246236 20618 -63564 -52701 -104326 -135848 -43529 127282 202805
25412 202805 219079 208044 249488 373621 298062 176467 112357 12322 29047 2721 -113174
25401 -113174 -105891 -61474 281609 329252 325386 297003 138120 99460 170308 174509 240485 212363
25389 212363 80730 16319 36258 119690 -6243 -49287 -139030 -38510 66202 79742 117356
25378 117356 293636 401861 311665 -17586 -138432 -223987 -137659 -125592 -214393 -271266 -205105
25367 -205105 -83227 -105092 -102562 -54180 65305 290547 105840 -31105 125654 176203
25357 176203 -451 -71419 -57745 52406 15305 -86979 -152829 -102811 -55440 -212615 -249929
25346 -249929 -97241 52798 2299 -31682 -2196 -128882 -334042 -366381 -215235 -236699
25336 -236699 -318719 -118906 -59558 -53742 -164892 -352716 -363326 -277551 -191722 -133185 -44470
25325 -44470 -83076 -104953 -130121 -54268 -93642 -192464 -282717 -313328 -265940 -153329 -52871
25314 -52871 -8501 77647 18585 46277 -88316 6379 154952 162167 125685 94054 32475
25303 32475 52870 177409 128959 38237 136394 201790 104878 -89966 -24469 32862 51493
25292 51493 20499 76184 115367 126281 329611 259667 52288 2471 68782 119556 -63419
25281 -63419 -81369 -43466 -226566 -244565 -98546 -41929 -63307 -748 21882 -99788 -274592
25270 -274592 -327708 -377065 -258005 -170296 -198015 -169333 -149663 -64463 -130978 -91505 -95092
25259 -95092 -99353 89017 170314 10957 49712 -27058 -222666 -291828 -394250 -314901 -177522
25248 -177522 -134428 -364494 -273456 -93081 -118363 -132997 -10071 286632 178006 124901
25238 124901 121746 210725 128752 -82596 -156975 -188502 -137637 -136525 -101169 -149738 -319635
25227 -319635 -456287 -555215 -352725 -23512 70433 -23596 -130331 -67190 -5104 -30080 -193251
25216 -193251 -284504 -152537 -120073 -257599 -357493 -351437 -334419 -231022 215560 258285 57457
25205 57457 -64729 -246701 -109626 71696 36564 92670 100797 -10883 -21207 -59301 -22846
25194 -22846 45174 210477 282122 286279 288385 255702 92245 15191 40725 1774 -97715 -313225
25182 -313225 -265952 -214057 -220951 -183021 -286014 -366269 -271295 -306928 -222871 39694 176334
25171 176334 164131 53512 63422 33622 19255 111914 33300 -122579 -83449 -77807 72942
25160 72942 56015 -109898 -52028 -50809 -20007 -191516 -101929 161347 66178 -34880 23039
25149 23039 8325 -55680 -45343 -135361 -135494 -191984 -247554 50720 105699 -135851 -114777 -63607
25137 -63607 -100593 -118012 -168927 -187191 -169556 22334 93494 78285 37813 -72976 -200844
25126 -200844 -261389 -214797 -46812 -43064 -48477 -170872 -177908 -125761 -20171 -94636 69909
25115 69909 120213 10393 28662 -118335 -238343 -186428 -178290 -19592 -49400 -48216 87461
25104 87461 121308 82802 90431 133449 41738 59949 161837 24999 -108811 -45504 -176485
25093 -176485 -243014 -106488 13931 56371 -67059 -41465 -73391 13772 -26325 -186067 -44098
25082 -44098 14207 150016 129418 79285 5425 -150118 -41764 -32364 -18736 10610 9869 -160643
25070 -160643 -111662 -102998 -204308 -203265 -135973 64384 241121 183429 4783 33702 156744
25059 156744 126067 11559 -5846 135188 202235 268839 308670 205367 7383 40767 1165
25048 1165 -265251 -167731 -133230 18089 -30320 111807 226254 286254 387717 431583 372772
25037 372772 170445 84699 73692 127813 -8447 -78540 -242477 -328451 -152361 -106092 -140140
25026 -140140 -355734 -384169 -260955 -209850 -166088 -50441 46424 -16402 -50002 -29035 -135776
25015 -135776 -70316 -191782 -213630 -71549 52099 -5797 -132970 -131752 -77453 -79181 -37061
25004 -37061 -45122 241170 336030 198020 -37625 -109827 -280301 -199149 -147632 -144755 -67647
24993 -67647 -61982 -32016 -75133 -152996 -27019 122025 62932 -156623 -279204 -307509 -98709
24982 -98709 -79984 29328 -76678 -133111 -189473 26880 129009 94564 44569 -174385 -181598
24971 -181598 -110126 32936 -802 -7470 -67059 -186028 -165617 -205819 -258846 -97175 162237
24960 162237 243451 169675 37289 3961 -30820 -124815 -42138 -25273 58727 133960 45324
24949 45324 -60919 -35453 -62743 125146 127725 131145 10266 172723 250716 58624 49417
24938 49417 21188 -137948 -77536 18205 134070 205659 160727 -28957 -180221 -185009 -3553
24927 -3553 283480 268575 22965 -50986 136673 240306 285286 206535 147177 47582 48393
24916 48393 133280 92655 30603 77058 142487 68199 2584 -78981 40614 41881 -100961
24905 -100961 -222349 -190704 -151274 84784 67956 54412 21710 -47296 -122189 -243651 -339668
24894 -339668 -268819 -127369 -9111 30019 31997 32756 8736 73609 137905 76584 -79993
24883 -79993 -90379 -146183 -112529 -37559 49821 -80168 30334 92452 58584 -43463 22545
24872 22545 69122 52670 77311 184818 203921 201986 252295 96827 -42297 -21675 -34061
24861 -34061 191665 109902 -159819 -213941 -214957 -188429 -36058 120863 293972 241717 2641
24850 2641 -76124 121302 205311 50396 -51321 -80547 90822 307500 121472 -48771
24840 -48771 52850 -46358 57333 122916 86045 -78647 -193481 -112777 -15852 -36916 -55841
24829 -55841 -47106 -61171 -84684 69285 155121 176792 236478 184835 188830 117805 -9702 -79875
24817 -79875 12343 -1508 3732 52788 526 -20532 -88026 -22621 -9464 83771 17003 136225
24805 136225 166072 156312 279851 188639 63790 -91655 -135518 -169336 -166224 -57831 -74676
24794 -74676 -30969 189519 136566 135086 116738 58803 11435 -5681 134880 175776 203775
24783 203775 341014 343524 188657 112079 27956 -50008 -22387 -60064 21767 -40211 52273
24772 52273 185603 -18793 -125865 -5486 154393 71444 97153 205183 106650 -27462
24762 -27462 -198165 -102091 -58914 -30006 -51700 -69469 -20455 -70106 -190257 -127244 -12780
24751 -12780 140717 177221 283047 321806 366972 326061 112993 -77400 -90825 -52715 -111223
24740 -111223 -71786 -7514 176691 238043 14440 -97421 -100396 122483 112637 49946 -19475
24729 -19475 -191 93231 100330 -63422 -199047 -55245 178393 309111 293577 330636 344163
24718 344163 47410 -23735 46608 13913 -67405 -14494 73046 184594 202616 157762 -133563
24707 -133563 -42736 -133011 -35283 60959 139497 106662 197322 206819 226394 116512 -62992
24696 -62992 -144351 -142305 -177731 -165768 -118884 -252540 -197576 -128732 -159331 -199318 -90539
24685 -90539 120838 109711 54739 76569 -13942 25185 -27491 -91467 -107217 51644 -65774
24674 -65774 -146005 -126143 -182535 -68401 -102188 -188388 -121061 -241294 -199225 -218669 -178325
24663 -178325 20360 69091 42179 20329 94957 27486 -82835 -186332 -119369 -67220 -40942
24652 -40942 -127583 -266895 -298461 -149702 -158139 -344918 -293266 -304452 -277422 -151466 -23663
24641 -23663 58097 18941 -26194 -146165 -127744 -37460 -46465 45360 80389 -37659 -84690
24630 -84690 -168433 -5730 140280 148639 230985 197158 -11137 -234324 -170280 -165274 -161973
24619 -161973 -92341 -82361 -249118 -333075 -412482 -369069 -269531 -6500 -56828 -254344 -286417
24608 -286417 -401818 -269951 -186162 -155352 24655 3027 -41251 221 71893 15271 -62912
24597 -62912 -162436 -161444 -109667 70727 156737 -51801 -145191 -2750 11914 -56977 -86140
24586 -86140 -100795 -208975 -313497 -370598 -415677 -318025 -115209 -196045 -135793 -88913 -21420
24575 -21420 -11264 -149628 -246261 -247266 -304847 -151425 -40702 -105250 -183497 -207120 -126095
24564 -126095 29890 141287 295432 306529 68207 -168057 -143600 -70316 -58886 24028
24554 24028 21620 -40174 51299 279760 226075 40190 -11535 -151757 -213216 -141706 -45936
24543 -45936 -38878 -53857 -26301 -14180 -147238 -279924 -263851 -277041 -347385 -311768 -197275
24532 -197275 -176166 -146695 -142739 -23526 111366 47474 76524 186622 154816 204253 345324
24521 345324 340820 254860 283947 261092 96990 91700 137200 122901 -51809 -139053 -49200
24510 -49200 -98995 -83334 29191 111594 98222 -19686 -137892 -183105 -338525 -449419 -501208
24499 -501208 -424247 -416081 -316538 -255732 -235955 -24468 57836 -19400 -97968 -53182 -99351
24488 -99351 -103437 -61830 810 130248 273367 168598 79734 93154 -2550 -11641 -338852
24477 -338852 -267180 -114832 -152244 -145899 -79375 14789 -188529 -228517 43812 65545 108620
24466 108620 252188 230826 272038 172277 129092 35009 77322 81986 46642 204577 117419
24455 117419 -156391 -133439 100171 200901 127599 137936 121032 -1762 -39578 -123531 -115505
24444 -115505 -167991 -115769 -87566 -37567 -102132 -43045 34425 206781 193878 55987 14749
24433 14749 43218 126510 199102 217468 82341 25288 130982 -3420 -133878 -176274 -155395
24422 -155395 -102819 -90391 19917 -8184 5550 -29872 -21772 61633 -29524 -173577 -152559
24411 -152559 -72925 -28404 -202521 -186289 -86195 30499 148163 214422 23858 -204481
24401 -204481 -363259 -406615 -193954 39829 156438 106783 14662 206625 227155 59085
24391 59085 90269 129885 16698 -34783 -65975 96407 158731 100397 -27648 -124758 16472
24380 16472 148778 162247 67099 -77895 -27538 -98657 -222978 -207715 -278752 -120231 -35083
24369 -35083 -82844 -162464 -139299 -49397 -117756 -157290 -31404 40819 109269 63674 36355
24358 36355 54100 -82391 -230508 -183896 -67008 -186961 -237190 5392 202008 128594
24348 128594 34974 125500 -71632 -39035 -9179 70307 -22741 5512 -100040 -168975 -120117
24337 -120117 -70461 41122 119335 102330 -12102 -110752 35801 256783 303131 133143
24327 133143 -21534 31060 65309 129087 81128 -149008 -102630 -24709 -203408 -274804 -160137
24316 -160137 -113696 -122025 -233604 -195534 -69081 -88735 -127138 -54929 75632 92546 130373
24305 130373 177992 307005 311277 199101 76323 -62452 -87339 -69628 -121423 -190361 -107559
24294 -107559 122471 140077 50550 62057 352061 305897 170785 232784 193603 -40384 -102175
24283 -102175 -146131 -259794 -211705 -43614 -42225 -27543 -23283 -123209 -155723 -123069 31806
24272 31806 167794 70066 -173379 -46707 121129 109753 124397 161740 225987 174702 -49501
24261 -49501 -95366 -7677 -87612 -240922 -165591 -7706 14840 -144380 -212910 -70165 57290
24250 57290 201970 81244 -63583 -76077 -30862 99307 71420 167863 285880 318710 270697
24239 270697 35782 77445 69689 62354 9497 -61624 18128 65915 122452 81418 46737 68330
24227 68330 -87811 -253778 -77086 -52056 -107791 -109297 -77773 121141 147251 111152 120308
24216 120308 111969 90848 62510 141213 175372 148150 135100 27734 -6442 166012 217143
24205 217143 331687 31058 -133671 -87421 -70878 68099 -57940 -175831 -299451 -297222
24195 -297222 -126093 -61364 -125800 -276167 -402500 -440767 -346044 -123407 -179323 -246994 -307203
24184 -307203 -371333 -261272 26487 33626 51067 99793 26470 -83076 -175623 -207179 -219641
24173 -219641 -111034 -56204 -30275 18109 -19760 -2425 103693 73721 -102523 -330892 -330559
24162 -330559 -222918 -98636 -149689 -128638 8258 16409 8023 43384 12051 1483 -136369
24151 -136369 -171288 -268526 -222315 -24320 -6761 7738 56502 12700 -48100 44589 125844
24140 125844 255339 154232 130284 124835 271601 257479 119447 29221 -58579 -54674 -60115
24129 -60115 -116256 -112787 -92438 -35383 -101100 3426 43355 73262 215052 299283 256157
24118 256157 223517 -40735 -119682 -112593 -108038 -136015 -3572 27894 -103154 -178196 -30062
24107 -30062 37395 69273 27015 -44855 -43848 -122089 -224371 -70153 -168418 -192637 -47600
24096 -47600 -97100 -16440 -144638 -237865 -233528 -273043 -250966 -39746 62061 81081 -115819
24085 -115819 -145258 -122606 -214666 -224879 -263769 -83253 -49711 -342952 -195054 -168799 -218948
24074 -218948 -80726 132570 27875 -17025 123432 195144 132221 113792 110144 -53071 -65334
24063 -65334 -114838 42142 155425 92938 77436 77979 -16127 -219310 -253346 -303528 -248246
24052 -248246 -240110 -234133 -231438 -24911 -41372 -179842 -115547 110781 181750 189327 107724 88816
24040 88816 201176 210224 216741 230306 41284 64536 -43755 -79843 -164720 -146951 -98106
24029 -98106 -94651 -4888 23088 -19686 87863 45346 -33605 -77958 -11056 115760 93536
24018 93536 41148 26780 -169595 -191760 -161070 -171435 -146595 -122218 -114545 -147521 -267513
24007 -267513 -333179 -363105 -337912 -250355 -30915 135250 128916 -60723 -244372 -194361 -84465
23996 -84465 -124479 -131224 64462 71505 -14473 99765 133829 34770 -34175 73797 150817
23985 150817 67672 -35668 -51521 -65968 1914 23918 15919 145223 224061 7072 -41031
23974 -41031 -101018 -230398 -108485 731 -67303 -149480 -91631 27867 101137 118302 365853
23963 365853 383206 176559 75276 106592 174031 261782 327679 236718 190432 179454 161891
23952 161891 -19160 -211249 -17675 18428 -11418 14571 1808 60766 216793 193988 132689
23941 132689 112458 -12959 -151782 -239038 -145293 -39400 -163260 -210544 734 -60630
23931 -60630 -228408 -517498 -470436 -344898 -283891 -314316 -341938 -379640 -231933 27151 45162
23920 45162 121306 253707 176897 151587 -97213 -47658 112774 70154 -13331 96793 189549
23909 189549 151295 119514 295873 452204 316633 328351 242791 247080 252203 184179 35158
23898 35158 -122070 -193224 -89322 -44604 -128932 -147174 -190605 -304679 -210430 37398 173043
23887 173043 223649 227777 208459 97558 98291 129038 -22101 -230688 -245437 -185059 -176757 -263413
23875 -263413 -334264 -376014 -311870 -228409 -78861 5280 253476 342827 259882 232402 114939
23864 114939 40030 -58480 -75729 24952 -52216 10687 -86569 -26926 -17821 -159097 -173687
23853 -173687 -101899 35188 54484 93131 155532 49061 136044 195649 207944 109753 116176
23842 116176 -121026 -224213 -278771 -313200 -371034 -331953 -292041 -11286 212350 146782 192862
23831 192862 245026 175529 -8468 153396 243386 100255 168834 251973 118974 -11958
23821 -11958 16921 -163278 -266960 -189444 -236127 -98795 -74517 -41911 -17616 42586 -116710
23810 -116710 -148579 60736 116268 129274 150829 46737 -43669 -11688 -43439 118696 212444
23799 212444 140249 -16359 -121563 -235196 -356350 -246487 -187300 -153027 -68127 -25408
23789 -25408 136687 154380 209265 107842 16829 -178724 -233725 -173516 -207871 -245182 -193144
23778 -193144 -61534 66514 26872 -14189 80355 162146 354662 297645 181268 -62283
23768 -62283 -228698 -307945 -451382 -213833 -29455 -43056 241128 306699 58789 -18390
23758 -18390 -22743 -124943 -226652 -42947 102465 104591 20224 -98395 23959 76225 -141958
23747 -141958 -84979 -120989 -80103 -94116 -63186 -101489 -83277 -107074 -43382 85824 135373
23736 135373 55961 201777 18437 -224020 -274082 -73456 -43235 24008 -6052 -56313 -43157
23725 -43157 -33299 62221 26459 239624 407621 370172 315725 372744 267638 174206 144733
23714 144733 121784 167117 57969 -63527 -17711 29269 -17556 -50183 57976 93364 133465
23703 133465 -137931 -147371 -102657 -216544 -241484 -222688 -50957 69578 -14487 -129922 -121935
23692 -121935 -11649 78018 42121 34448 82842 -14053 -129834 -17967 -4152 33130 39789
23681 39789 -142683 -92181 19572 -50049 -41259 160555 197498 47472 -73849 -144058 -47589
23670 -47589 -165300 -277681 -89233 13749 -133222 -71533 -50996 -255518 -169828 -156828
23660 -156828 -51769 48466 5518 83218 171915 243713 204548 99844 -41221 -204269
23650 -204269 -142995 43236 22077 -32979 -58995 -57109 6907 139623 155920 184195 -59532
23639 -59532 -112913 -17489 58809 84560 48628 -30692 -3175 104735 123763 205986 112255
23628 112255 88002 22681 115950 120223 75257 79405 116449 120169 120451 -52527 -13275 34971
23616 34971 -3833 1606 -45723 -23877 148046 136632 132248 230714 99154 -54916 -69717
23605 -69717 -90023 -75599 4570 119741 203606 300154 375075 200399 -75771 -190306 -248632
23594 -248632 -211094 -51256 61603 16187 -39787 -47714 -13979 37719 -51517 81985 136255
23583 136255 28305 -12801 -65195 -246391 -312995 -199998 -10999 63733 -49839 -20976
23573 -20976 97100 151744 31976 -117690 -136773 -89359 4703 113414 -79889 -303022
23563 -303022 -247589 -174862 -56350 -86929 -52377 140576 221277 280422 287578 157503 233133
23552 233133 347697 344494 259389 146292 89992 -44272 -122820 -68480 -76323 -17529 -225674
23541 -225674 -287626 -291170 -64095 -15493 -172673 -184820 -235501 -225314 27937 -83463 -112447
23530 -112447 -166746 -151026 -62731 -31921 16763 14781 58240 -78633 -26922 83839 50492
23519 50492 -2175 -40345 -1163 -4804 92590 88451 27228 -33869 -220204 -190906 -105607 25375
23507 25375 -73824 -252488 -183797 -133679 -206471 -183080 -194502 -54410 -134482 -207978 -78708
23496 -78708 -22100 24777 -148862 -256020 -328205 -287981 -184152 -109759 -63880 4909 -147388
23485 -147388 -182477 -173343 -154108 -88924 -41059 93235 266074 374093 241786 268719 26900
23474 26900 -74619 -117081 -116122 42894 187021 147659 36529 97967 45138 -36529 33565
23463 33565 123883 227503 166249 132136 245547 297314 280611 69605 -17371 -188418 -326146
23452 -326146 -208671 -192448 -147520 -48277 -39517 91853 151011 164615 298369 248868 155046
23441 155046 107934 -78437 -178746 -170829 -156604 -150722 -49386 -128890 -95658 -101493 -161532
23430 -161532 -254256 -190199 -108605 -41587 -86670 -6838 37983 -100988 -177207 -100686 -189662
23419 -189662 -127890 -141140 -115969 -272459 -423602 -256655 -109777 -56240 16711 134231
23409 134231 80791 -39980 -226237 -261279 -190070 -236840 -342989 -299516 -244270 -143058 -149831
23398 -149831 -52407 117724 35380 34681 90991 125719 108663 151241 245724 377104 382700 457893
23386 457893 465360 413397 136366 17171 -67234 -90282 -126893 -113421 -157763 -271142 -321433
23375 -321433 -313106 -194616 130468 92515 221648 220518 206029 -74024 -132336 -150825 -334937
23364 -334937 -338059 -288305 -352530 -437304 -195588 95260 68907 31522 33657 -16155 -91500
23353 -91500 55004 -11241 -59005 -258916 -414920 -237771 20651 239285 97392 153408
23343 153408 187406 221332 287326 275769 144712 65535 -77972 -291384 -234504 56382 101264
23332 101264 223137 37454 51702 138356 -25763 -61906 53003 121830 65613 -9834 -40292
23321 -40292 83334 65469 -78062 -55087 -59446 -29830 33491 -72699 -83922 -62686 -44808
23310 -44808 -159568 -213445 -60173 -104184 -35958 8629 -56118 -62037 -55053 -109808 -103132 -210264
23298 -210264 -184297 -135729 -245748 -102564 -16860 -21532 -51954 -153044 -97357 -44374 -169432
23287 -169432 -227864 -155284 -120505 -136928 24175 65049 -101027 -121457 -84211 -45317 -88470
23276 -88470 -70851 -143079 -238634 -170182 -59109 4355 -64471 -115000 -13495 -66584 -108344
23265 -108344 -157608 -109378 31459 20560 -38372 104422 169392 12878 -255161 -377073
23255 -377073 -459611 -353652 -310378 -187494 -20429 29831 -29831 -12232 -68737 -280524 -247425
23244 -247425 -121159 -188027 -227901 -123942 -86009 -90312 -23132 -124069 -142894 -200468 -89736
23233 -89736 121496 220262 59401 -87140 32708 238867 191264 172459 34840 -186720
23223 -186720 -118403 -74212 -71236 105852 74526 46218 233464 289214 258994 89452 -36773
23212 -36773 -155443 -278255 -126967 -74928 -89599 -144057 -252906 -291793 -208850 -20191 131801
23201 131801 143530 31223 130827 414029 285634 104272 216943 100141 69071 140588
23191 140588 202189 276349 362052 504202 241228 -114956 -202491 -153473 37413 162402
23181 162402 76245 13539 39433 40249 376573 413043 326976 379012 48454 -49868 70191
23170 70191 46824 -77169 1664 -70337 -211462 -84883 -14117 -189299 -258891 -95499 -56254
23159 -56254 -109995 -59263 -44999 41379 71376 -331 -101041 19559 272618 83197 -60795
23148 -60795 -159502 -136707 -124442 -294990 -358766 -173867 -59745 204289 216716 140006 -21076
23137 -21076 53301 20516 117956 147740 279741 355433 375951 297572 167989 105697 47656
23126 47656 -67596 -77807 30200 66833 70631 144527 160103 148497 103935 -88727 -205696
23115 -205696 -283087 -209946 -93402 48097 246118 267323 106228 -48411 -243579 -172069
23105 -172069 -51236 35999 137820 28382 -73186 -216002 -47549 44676 19368 88427
23095 88427 131748 54016 144611 200269 28831 -67593 70652 -7780 -276824 -341561 -373507
23084 -373507 -275976 -116833 -228618 -353682 -291785 -242095 -174613 -33718 -40833 -125314 -125838
23073 -125838 -47855 -154797 -107377 23922 6429 -42092 -35582 -157143 -107681 -6743 18777
23062 18777 -16132 12321 100289 -27482 -28262 -97838 -159343 -117725 -179048 -245690 -89090 -37035
23050 -37035 -58309 -73985 -181568 -224276 -180143 -194860 -179026 -18920 -13050 -126413 -113861
23039 -113861 27765 25889 -211784 -430757 -478482 -471905 -598347 -469604 -348140 -233625
23029 -233625 -210027 -238380 -301730 -408416 -346608 -252420 -182918 -61937 29923 -137495 -297927
23018 -297927 -113972 -23438 -50107 -94348 -103084 -300481 -221281 -85590 -129232 -144050 -148221
23007 -148221 -300766 -416335 -439660 -344919 -103914 -30035 -90612 -113805 -171179 -145400 -175853
22996 -175853 -225087 -329831 -410024 -490390 -533340 -437002 -300255 -339258 -411728 -417115 -105207
22985 -105207 82357 38956 -31673 -93622 -108984 63928 132478 87102 64619 88275 41842
22974 41842 -43066 -95420 -104575 -157809 -79508 -162169 -340091 -439003 -402678 -221287 13443
22963 13443 13420 -13206 142630 96936 75083 76464 83489 178219 62432 -98120 -60954 174243
22951 174243 218859 12466 -96569 65139 87336 -24260 26945 -23678 -110030 -124173 -105349
22940 -105349 26244 195494 199021 140727 161641 139384 155101 187869 100123 114290 91121
22929 91121 -98639 -137294 -234117 -153419 43157 157725 88369 -38303 -162710 -217811 -308501
22918 -308501 -161341 -246173 -183501 -143359 -81859 -96028 -19226 -57252 -184921 -272926 -197927
22907 -197927 -227189 -264447 -87080 -55048 -73326 -65847 -41635 -11021 -83514 -15833 -3678
22896 -3678 -59797 -145116 -99837 -47915 91650 74387 53476 -186626 -65542 -10650 61649
22885 61649 154482 8252 -136759 -52744 40258 42402 -17992 -78012 -152230 -88328 -166443
22874 -166443 -85146 -10954 109265 84395 -23029 -203581 -403867 -345940 -334508 -364535 -209390
22863 -209390 -178588 -258172 -108806 -94684 23203 -49527 -274266 -493314 -441512 -313246
22853 -313246 -316781 -64172 180507 292530 164427 71370 114701 163143 44519 -7170 24193
22842 24193 47064 91590 83695 75134 66527 6023 60247 80426 -41790 -104269 -106850 -63542
22830 -63542 -132549 -157303 -142254 -166712 -116426 -101716 -149403 -13269 -119201 -41453 89026
22819 89026 173495 251415 161981 -26640 -87105 -41070 -6975 56339 -93043 -177088 -123383
22808 -123383 21291 210539 114206 91351 229398 311987 500204 418335 420414 342279 372080
22797 372080 301283 243101 452740 372345 158345 -12239 -149461 -85878 26756 -88640
22787 -88640 -3141 91878 155524 84305 97466 220692 127506 90720 -50916 -23365 -55783
22776 -55783 -111542 -12241 -113328 -174969 -262705 -253757 -231990 -69000 14346 -105111 -172051
22765 -172051 -312162 -128450 -23071 27914 130922 80698 99861 62548 116581 85665 -10527
22754 -10527 28588 -27500 -17218 32896 72382 -135356 -247054 -145647 -61979 -78476 -13452
22743 -13452 111031 80555 -68098 -44856 49298 51422 44412 82390 -36630 -157133 -205672
22732 -205672 -253358 -252673 -245723 -80011 52224 53204 34588 -78288 -56146 23546 -33034 -185067
22720 -185067 -8017 50369 72518 107839 178303 175347 120788 146544 -65012 -405310 -501770
22709 -501770 -389895 -389584 -375837 -258578 -352445 -435548 -332187 -203778 -235027 -195530 -172546
22698 -172546 -106634 -84315 -57367 -111906 -363781 -413680 -436874 -296137 -173647 -197043 -143903
22687 -143903 -116981 -126312 -119444 -3430 99702 100238 57319 105142 -56048 -226515 -181764
22676 -181764 -39777 177524 186800 73331 55695 30962 -43827 -54829 -56791 -4745 71871
22665 71871 -42606 12258 106844 113874 59581 -150081 -136095 -110129 -113089 -77409 56831
22654 56831 90988 90172 -66092 -251724 -280144 -68661 -31950 -73866 -10344 -21109 -151486
22643 -151486 -44072 119281 60939 -98986 26207 -85912 -252426 -191661 -282688 -170332
22633 -170332 93455 168050 59494 -66682 -183355 -135996 -297148 -265144 -33336 -25311
22623 -25311 9723 20432 21255 41165 -129547 -179475 -11954 -67599 -25759 40122 159282
22612 159282 77518 -63532 -46672 -81144 -172076 -141185 -91834 -98213 -197514 -111765 -65687
22601 -65687 -78760 -152844 -40391 178048 91184 -13136 -23643 -56688 -179580 -341305 -134119
22590 -134119 38815 67156 39020 70883 -47662 7214 136011 153395 96422 -118549 -320144
22579 -320144 -384547 -433978 -339870 -218328 -155098 -142395 -57054 6001 -27373 -53007 -255250
22568 -255250 -386152 -250239 -122912 -196803 -261069 -241900 -211217 -239313 -86443 -175892 -308863
22557 -308863 -180519 -107840 -10323 84235 -115644 -285165 -244642 -172829 -167408 -312375 -443474
22546 -443474 -445101 -498725 -501442 -467284 -271598 -60364 -45241 -213797 -254207 -236351 -209503
22535 -209503 -183522 -210457 -289951 -195049 -159626 -131847 -171401 -114279 -42259 90859 61598
22524 61598 21632 58933 157350 104653 -1835 4216 -100235 -166704 -161108 -71224 -11431 -101696
22512 -101696 -174759 -163081 -40578 -156428 -341773 -389220 -277380 -273508 -256507 -282442 -207721
22501 -207721 -179578 -122780 60286 213678 82167 -148772 -117886 -157402 -188036 -285673 -490425
22490 -490425 -277287 -98550 -133528 -161952 -64151 66847 144714 199995 150527 123938 131498
22479 131498 130813 199698 234845 3292 43124 187992 285730 84032 4578 -118757 -78956
22468 -78956 92050 43898 14421 93347 160224 150877 51216 65672 -39193 -3958 -95703
22457 -95703 -138889 -65567 -67914 -135763 -135311 30366 292787 277858 218860 175294 288542 87643
22445 87643 -186532 -255019 -369002 -127934 115915 78673 69585 -36176 -191661 -225334 18176
22434 18176 -35242 -45818 -32284 -137389 -161863 -100503 -171888 -166094 -94818 -161268 -70826 97685
22422 97685 29368 54759 268410 189159 25422 -49288 -135613 -186842 -58415 38494 43960
22411 43960 75197 -33147 -23501 -59259 12664 102847 176660 -19352 24552 -2400 -59102
22400 -59102 -118910 -125351 -262342 -304766 -277677 -127888 21092 -121137 -155508 124638 122237
22389 122237 -48375 -65609 77510 60825 192699 308240 203084 114647 28235 6298
22379 6298 -266 -157344 -197922 -55983 61607 117575 164680 219102 90590 56840 120637
22368 120637 185658 274678 151795 32294 -84594 -106757 -168525 -335951 -344115 -327838 -172736
22357 -172736 -87784 2254 26402 -35857 -89903 -82749 -3683 97230 75496 21106 43266
22346 43266 182997 224448 198297 249140 351129 416028 321281 226209 123038 88030 6341
22335 6341 5062 -102923 -33418 27486 -35164 77605 -41066 -268873 -205094 -193042 -107068
22324 -107068 -94701 -133816 -54783 -170012 -193716 -56223 -140689 -240609 -107453 -50715 58195
22313 58195 127238 -31157 11985 -68949 -195119 -182824 -129551 -160916 -143123 -44119 -1063
22302 -1063 25396 90085 191615 171005 82939 14358 125623 225019 42330 -127687 -216652
22291 -216652 -113106 17226 -40754 -109425 -26204 -45640 -24167 94913 116470 97655 84462
22280 84462 54276 -39444 -114319 -325041 -352043 -276071 -142941 -14293 -100443 -202714 -220404
22269 -220404 -111496 -81401 -66853 -156698 -342139 -493246 -416238 -442310 -152887 40635
22259 40635 86785 166341 102319 90631 101000 302767 341626 109607 -47378 -62260 47529
22248 47529 146291 102784 -27223 -171457 -150237 -48554 -28839 52025 141310 215579 330531
22237 330531 348068 42777 -196345 -318094 -260369 -128317 -82837 -36456 -12685 61909 25756
22226 25756 86444 178087 311880 235338 -17206 -58160 -131125 -93826 -60206 -234140 -179740
22215 -179740 -115364 -46830 -76620 -69858 -153751 -68298 -3291 59227 80973 37040 60711 -16365
22203 -16365 38185 78266 74852 28041 103127 64860 29940 151670 173723 92994 -71240
22192 -71240 -299417 -248363 -121716 -186083 -282343 -193763 -62865 -6993 -101475 -103352 -212587
22181 -212587 -215628 -41581 56221 53706 -87064 -119036 -25674 42304 -147120 -295627 -461156
22170 -461156 -411896 -419709 -322067 -203877 -151879 40354 -17975 -26732 -111408 -61719 -140071
22159 -140071 -91712 -78698 -24799 29250 95947 3267 -146346 -177386 -114898 42120 -44251
22148 -44251 -160169 -231750 -228613 -167309 -205299 -201736 -29943 -77771 -179356 -71911 -86448
22137 -86448 -177542 -84097 46195 146975 31412 25816 -16952 156596 75258 46657 136069
22126 136069 162063 134597 157671 204789 209042 175831 81291 49812 -22129 -127520 -190126
22115 -190126 -254501 -164940 -126639 64900 99710 59893 84987 25237 -120913 -327465 -268807
22104 -268807 -80525 -129587 -131294 -156846 -20099 -48723 -48086 -142145 -149767 -45084 53335 95826
22092 95826 31926 -25208 -61595 -226672 -153073 -39870 -43673 -164496 -208175 -182633 32791
22081 32791 62802 -37755 -165006 -234848 -141376 66981 -3949 -133494 -10446 91979
22071 91979 155979 -35123 -166281 -211856 -181484 -249246 -301736 -209165 -238042 27472 208876
22060 208876 164716 -95580 -239928 -265250 -262245 -194681 -186222 -275487 -241831 -213758 -166786
22049 -166786 -58126 -18138 20040 45770 6684 1067 -77922 -121838 -228611 -351681 -236135
22038 -236135 -31730 25651 123127 146263 113981 125230 102651 139121 94580 37507 11914
22027 11914 -99703 -235574 -211335 -53826 10518 -100248 -117615 -157420 -171611 -196667 -416527
22016 -416527 -434877 -327191 -286066 -174452 -183722 -133268 -211425 -90236 78061 105658 143716
22005 143716 98105 -42332 -16130 -81293 -99884 230 -72146 -96986 85325 173575 -38940
21994 -38940 -201928 -89700 14428 7265 154007 238082 194444 77117 -94060 -241823
21984 -241823 -177397 -168599 -230429 -200910 -262891 -202915 -80112 8844 62535 19534 72939
21973 72939 210039 200530 46294 -21649 -75340 -169940 -353522 -342747 -195295 -132401 -193879
21962 -193879 -85496 50270 200137 170274 -44891 -295535 -417456 -245388 -167080 -104872
21952 -104872 -207330 -340501 -218246 -173056 -182424 -155293 -115846 -88100 -206063 -332488 -278303
21941 -278303 -211385 -67004 -206823 -101543 61651 -7767 -162964 -74295 -192194 -209279
21931 -209279 -324888 -275746 -159779 -78324 -30315 -103776 6191 62321 35018 59605 109906
21920 109906 140505 115123 87354 -12465 -23417 -51979 -126604 -210482 -218439 -91367 -109658
21909 -109658 -141665 -31112 -50917 18859 3901 -129610 -102563 -76292 -101641 -83242 17205
21898 17205 62284 -74932 -64402 -85173 -229071 -130738 -139947 -74119 -112055 66178 230541
21887 230541 69445 -203835 -374331 -380597 -291486 -140064 -139874 -226649 -272252 -251683 -264333
21876 -264333 -169476 -101946 -103428 -79173 -113992 22820 179290 168679 16708 -207602 30662
21865 30662 82741 28592 -151000 -260065 -256358 -351492 -365080 -386191 -444073 -393014 -280003
21854 -280003 -255936 -198126 -228414 -264968 -176154 -107044 -187698 -346011 -397339 -418677 -331049
21843 -331049 -157160 -105959 -230263 -376341 -369029 -225580 -270745 -249583 -197052 -252295 -226038
21832 -226038 -122411 58678 236755 161594 24684 -76270 -122614 -144782 -168824 -99255
21822 -99255 -201546 -287066 -301551 -154869 89422 112963 23054 28844 21776 42815 -42443
21811 -42443 53038 107594 -93125 -161311 -94499 -32718 -162652 -203703 -268961 -361800 -228765
21800 -228765 -74854 11670 -47122 -12901 -17715 -295268 -441282 -489288 -332316 -80467 5344
21789 5344 13095 153755 213661 -11775 -206357 -108687 -37940 -153812 219339 162491 -48769
21778 -48769 -179031 -84710 7147 34207 65783 123706 72639 134666 139305 -123342 -193113
21767 -193113 -117728 -208596 330 130216 241238 226018 62072 -117602 -31500 23908
21757 23908 -44843 -94724 -86951 154659 185726 163125 49946 -87965 -199449 -113078 5633
21746 5633 -76928 -118619 -46787 14162 144956 274614 197402 95654 21924 7659 -107866
21735 -107866 -107683 -145560 -109971 -90211 -9062 -106836 -109740 -92673 -55484 -46635 91025 71681
21723 71681 36219 -17069 26754 82808 99678 -47669 -51358 -148016 -54922 48068 -108909
21712 -108909 -135390 -128094 -36390 -38598 -88636 4228 151127 -22979 -104037 -67204 3371
21701 3371 37732 118033 78179 -157648 -112186 -68507 -183219 -217830 -147118 -270438 -360147
21690 -360147 -336677 -139190 39231 123405 76247 -105960 -192373 25106 36047 39821 246489
21679 246489 213445 155820 76138 78552 73445 -3594 -99691 -102734 600 -11694 -94345 -113982
21667 -113982 -63548 200866 350699 114800 -38659 -34317 28250 -76438 11781 -16221 50276
21656 50276 -11106 -27347 43749 -91484 -205940 -105974 -56621 -156056 -98367 -17348 38807
21645 38807 23967 87872 15752 -100288 -123044 -114355 -40669 -121563 -104323 -32334 160472
21634 160472 184020 250786 289770 109084 101824 39697 99 -8164 -114556 -86096 -60760
21623 -60760 -101602 -210676 -133853 -127648 -107994 -9985 -238552 -270207 -190372 -147444 -157930
21612 -157930 -41450 -75232 -242970 -306888 -182362 -70629 -95905 47434 -21390 -49178
21602 -49178 34465 -29557 49049 301261 257168 252357 135055 -38566 -54843 41442 21904
21591 21904 175862 134365 130935 105028 118200 85487 22084 -1572 205503 223563 61492
21580 61492 -26775 -64672 -99087 -64107 25323 21002 156088 266648 215139 202122 228543
21569 228543 187874 202252 226595 348421 410490 257588 250703 246315 107916 58846 97558
21558 97558 95614 220678 226538 100241 117475 268713 320401 161608 6828 -97514 -142811
21547 -142811 -119520 -104831 -145095 -49884 -99650 -97868 8104 91974 153370 37239 4693
21536 4693 158688 -85838 -293345 -245291 -221611 65853 267059 189919 155046 159867 228376
21525 228376 372286 464809 294903 108423 25358 -134809 -200596 -112299 -37631 -101143 -168240
21514 -168240 -188212 -188270 -118601 -19856 48705 88075 94061 102188 39735 -26161 -69595 -139548
21502 -139548 -104953 55367 -70976 -69655 11864 -115490 -172731 -143377 -157035 -188792 -162017
21491 -162017 -120274 119628 196231 130537 -33104 -252788 -186048 -25826 -56828 -27744 64099
21480 64099 40138 -26628 -110259 -108213 109505 194452 210130 189112 219534 188196 179445 113463
21468 113463 -15653 -329274 -422209 -258995 -107561 31382 148585 265541 227104 119868
21458 119868 158957 157861 190403 42032 73468 2284 -129747 120370 92397 24333 -59838
21447 -59838 -202930 -253889 -149541 -6548 72361 -32138 -17899 19039 -125598 -35717 252967
21436 252967 215075 174644 59569 9080 -145276 -136132 -41345 -216095 -343616 -331344 -439546
21425 -439546 -393760 -351144 -97548 -139598 -161807 -131430 -57795 -71021 -54705 -102086 -120644
21414 -120644 -35070 -30030 98657 80924 129501 38768 31564 54026 35475 45360 -96415 29969
21402 29969 -73528 -187060 -85867 -144006 -8268 -30787 -55026 -10632 111579 200102 100322
21391 100322 3484 131278 216232 149568 106257 245610 211613 46334 147590 109320 -66772
21380 -66772 -24331 106675 259671 211561 55422 14915 86998 157755 19314 -67146 18401
21369 18401 -222457 -297499 -230648 -256329 -274039 -243610 -135413 -65559 -8646 -94830 -192285
21358 -192285 -101179 -9765 -216298 -528002 -474417 -292639 -266135 -400823 -339456 -324267 -304101
21347 -304101 -153209 62178 18884 24163 16933 -137545 -135654 -15411 83017 118877 -78405
21336 -78405 -182037 38090 42462 31417 36699 36084 44170 28804 1185 -107494 -90272 -117923
21324 -117923 -82734 -155671 -247498 -107942 -22699 -114728 10749 -44122 59456 144476 -58351
21313 -58351 -190389 -299925 -265436 48640 88958 12658 -69679 -50431 78415 228877 229918
21302 229918 70289 -161690 -228183 -333018 -119344 275866 240439 -10898 -95661 -68000
21292 -68000 -18637 66213 -17681 62320 105993 -58416 -50407 -8316 -13531 -89834 -56042 236471
21280 236471 239735 26945 -142986 -190993 81334 26033 -27952 211791 188718 62113 86366
21269 86366 88660 -137560 -263479 -258989 -167855 -143220 -129836 -46458 -37591 29105 152705 205737
21257 205737 163198 93871 87948 -24407 -155901 -115805 -70998 -68811 -138737 -285087 -361300
21246 -361300 -351578 -292389 -232755 -266925 -201741 -74086 -60618 -82999 -108875 -174456 -196549
21235 -196549 -135143 -249353 -182307 -179692 -177316 -16433 -9334 -120334 -126896 -154261 -39921
21224 -39921 23530 -92446 3136 -52672 -267273 -145550 19602 -24275 100451 51807 -165718
21213 -165718 -204323 -244313 -217796 -85541 -123754 -117506 -155117 -137701 -285362 -231959 -148691
21202 -148691 -177528 -144138 -267152 -332787 -188000 -237992 -252412 -204746 -259733 -277638 -33528
21191 -33528 55634 86559 180234 165453 -63127 -179556 -154406 -224920 -136926 -166730 -185321
21180 -185321 16582 45603 -74504 -70804 116915 55870 45557 41965 7108 138381 90178
21169 90178 -94444 -150919 -272805 -300236 -252423 -152098 -93169 -56439 -124386 -264551 -423627
21158 -423627 -380025 -317011 -436180 -454315 -353859 -40714 -67703 -83281 -101955 56355 179833
21147 179833 130440 -1907 -16974 -71704 -116087 -247081 -385878 -404505 -132113 -24166
21137 -24166 -123543 -209666 -300833 -90134 34369 -67189 17401 168758 -26402 -62094 70276
21126 70276 126161 -181291 -153198 -106156 -87684 -134467 -191947 -236443 -110658 -206125 -340116
21115 -340116 -349978 -233752 -129099 -173170 -191699 -247528 -136224 -201507 -340195 -326192 -303719
21104 -303719 -261861 -237939 -217683 -122208 -28448 -8967 -45260 -67513 57100 39904 81393
21093 81393 -19335 -213300 -445446 -315233 -156257 -47557 -102608 -196406 -181986 6736
21083 6736 129801 8343 -107349 -129523 198644 356082 316477 379344 268564 80693
21073 80693 -151214 -273772 -258405 -19086 15260 73881 -87993 -118120 -29727 126319 124786
21062 124786 77660 68378 -86401 -218409 -283422 -424235 -492495 -412110 -244998 -8662 -71492
21051 -71492 -191868 -195217 -115195 -97099 23847 50764 93528 -30920 -73132 -76450 -109911
21040 -109911 -86046 -35671 -132485 -15314 155817 80992 70201 -89344 -161822 -117149 -78750
21029 -78750 -20889 -39073 39181 135920 143987 -162653 -245515 -151634 -17202 24873 15510 19686
21017 19686 -112791 -125273 -116339 -257814 -297735 -199498 -54836 -146318 -79892 70770 7954
21006 7954 6755 -20207 -58652 -140554 -91388 3868 -153391 -310071 -302854 -198528 -270560 -257003
20994 -257003 -12799 -76906 18894 -45429 204 117436 107279 94879 163355 204935 295892
20983 295892 134649 -26946 199639 118320 -101351 -197843 -194875 -165744 20544 181296
20973 181296 187964 87702 134534 79766 139548 52407 -97449 -11322 -1040 73981 28145
20962 28145 -9975 118483 130397 -15410 -15188 -72397 -151154 -180295 -236540 -304123 -304643 -200446
20950 -200446 -71694 7662 -65394 -138847 -75522 -146485 -225225 -219287 -219084 -235573 -289087 -138026
20938 -138026 -50936 142237 192162 182608 144734 61419 35787 -45947 -17694 19390 13644 -36
20926 -36 -71096 -172170 -107729 -62514 -161468 -183113 -71380 -83699 36394 147032 -20188
20915 -20188 -120823 28775 237784 178950 -86745 -118119 25726 165727 149134 84386
20905 84386 -21394 47427 107131 -28945 6981 25076 15558 150124 373349 380044 210201
20894 210201 354 -82556 -91808 -192259 -55768 23096 -77255 -206744 -342185 -243780
20884 -243780 6859 -77574 22620 28357 -90945 -90280 -46481 -215380 -283152 -153239 -253025
20873 -253025 -221708 -145917 -113202 -91869 -117363 -38822 -33580 -29570 -4996 -8083 43565 134275
20861 134275 14249 -104498 -84309 -29754 31695 -37978 -27513 -189429 -275503 -120555 -128527
20850 -128527 -217588 -157610 -88797 -191317 -76451 16514 40279 -224455 -270965 -38027 14253
20839 14253 -129335 -50277 101683 124166 29591 14795 -65747 -176365 -184983 -219330 -209847
20828 -209847 -194082 -160370 -171810 -70548 -28394 -146338 -184682 -96254 -133723 -133519 -77056
20817 -77056 -46657 -49416 -148665 -187949 -122310 -126966 47225 -45497 -176711 -105030 -74132 -24891
20805 -24891 130419 134769 210445 128524 -19463 -97177 65066 239667 216796 309687 413488
20794 413488 393459 260832 186732 147487 -1371 -11613 56511 -82657 -109176 -20697 -35761
20783 -35761 -6428 -126468 -262916 -176767 -79519 -84850 -178344 -110919 -118470 83789 255297
20772 255297 313219 193550 -123889 -73656 4602 -246932 -148059 -5476 79278 15062 -101422
20761 -101422 -284218 -248064 -96111 88564 82822 42328 16526 -110353 -148842 -111784 -78138
20750 -78138 -48102 -3198 78428 54427 76647 167959 444628 438020 381308 431089 473358 387828
20738 387828 232180 44873 -51922 61149 20518 -149801 -96814 86032 -51047 -309900
20728 -309900 -211849 -181320 -85208 7200 55047 -57745 -203101 -346619 -314006 -535915 -514654
20717 -514654 -352185 -165903 -111006 -42786 183681 189210 95478 30567 -1891 4728 154903
20706 154903 133043 93567 110394 -55824 -119633 -85677 -5894 -10325 -167524 -35054 50853
20695 50853 89437 11258 156252 199338 184273 49952 -78965 -162303 -152329 -221188 -121036
20684 -121036 -29092 -23114 -57296 59596 137664 161007 228526 137963 210630 227709 15238
20673 15238 -202900 -200839 -153065 -69629 111574 -143196 -172271 -163114 -37792 -120998 -187798
20662 -187798 -57680 196152 316583 107740 -135162 -21574 120715 300263 292067 -39731
20652 -39731 -39801 76238 69128 7624 7548 -30531 -64146 -140797 -111101 17040 42224 -209012
20640 -209012 -147195 -810 59342 79342 127371 136650 147449 162677 195894 114902 70338
20629 70338 -17283 94 67419 134094 70551 -125466 -113026 -19433 4631 -175678 -282133
20618 -282133 -334962 -397934 -408146 -171177 -46314 -9649 -56669 -121471 -49326 -81779 -131540
20607 -131540 -184663 -104840 15794 114361 165069 43936 41720 107212 165743 128410 -4561
20596 -4561 -103614 -217859 -170160 -236835 -307816 -215890 -41218 13521 137100 119198 235415
20585 235415 107514 -40328 -70555 -3103 84849 162870 167621 -44381 -138412 -11423 -16413
20574 -16413 -63946 -109294 -79941 76361 123612 187490 341273 364196 256080 162836 180538
20563 180538 232206 158964 180662 347290 287304 161080 -97323 -214108 -129504 21255
20553 21255 99626 155006 189081 226385 57709 -163142 -234588 -243260 -167243 -21919 17249
20542 17249 -19433 -3875 -121060 -314691 -284536 -35479 -36589 -11413 134494 78524 -34387
20531 -34387 -4890 109418 179654 -20511 21832 721 -186980 -228135 6095 -82590 -78381
20520 -78381 -89711 -298571 -362784 -130729 91109 64440 142593 35333 -2890 93829 46850
20509 46850 42463 -15076 -66530 -158875 -34808 14072 4808 -72949 -76436 -155690 -142348 -162944
20497 -162944 -103958 9638 -26174 -70683 -2029 -218620 -341986 -350624 -275091 -33371 61052
20486 61052 272069 242959 4403 111472 213769 139709 -11195 -46902 69713 -148032
20476 -148032 -404679 -397255 -269791 -231604 -253408 -221152 -254221 -282111 -353725 -298024 -226217
20465 -226217 -47724 101807 161510 145353 184 -73027 70853 20821 13122 -101152 -203818
20454 -203818 -105272 -94393 -79319 -179090 -136477 -118234 -253856 -208414 -158307 4519 16229
20443 16229 29685 119494 75617 177614 200457 168149 -53881 43261 -4970 -132684 -263117
20432 -263117 -115182 -62189 -88353 -207765 -195930 -48604 -146095 -25814 18716 24130 -117870
20421 -117870 -265719 -111664 -36292 -45337 -53976 58975 191067 209571 146032 78249 -155127
20410 -155127 -211386 -125648 -133617 -68621 4559 19146 64482 56949 -72006 -149042 -143487 -132806
20398 -132806 -43496 -44842 22766 107208 200785 310107 206833 142095 213090 319483 507065
20387 507065 284638 82712 -38850 66563 251969 137184 122350 132597 13124 -91222
20377 -91222 -220811 -82129 83492 185089 231375 218850 188582 299168 274253 144588
20367 144588 101861 37159 158308 152985 160543 179675 69929 -93276 -130513 -117312 -64290
20356 -64290 -74444 -99968 -34532 8516 154270 244836 334381 322285 340669 301980 90085
20345 90085 -39487 10201 40443 27723 -60168 7058 -732 37357 196000 323455 186062
20334 186062 66091 252267 370554 296556 60577 -99047 472 138940 102525 -76271
20324 -76271 -129317 -52346 130599 223659 196225 162157 267958 180563 145703 138776 -17727
20313 -17727 -104984 -142290 -113900 -23756 62030 -10556 11371 121950 147864 -25438 -25158 102484
20301 102484 86103 -60848 -34803 -8648 -11497 -54364 15253 103102 190468 167990 6184
20290 6184 -60774 -28912 -136821 -96602 73981 143231 16888 -86405 -113652 -126423 -28834
20279 -28834 71358 -9 132884 163505 21636 11718 -8610 -7937 -43003 -37546 63804 196249
20267 196249 180503 119406 175151 15881 64225 106143 159814 -99564 -75244 24988 3120
20256 3120 60270 26083 -150894 -210539 -154182 -56013 98274 225295 128150 106658 112561
20245 112561 62384 88711 144331 137721 48406 4883 -50271 -136938 21031 -26269 16211
20234 16211 45630 252194 368810 231958 187698 179763 95662 -14683 20069 87941 89280
20223 89280 -66853 -52794 -50523 134858 275757 267826 413067 339599 362266 440819 433583
20212 433583 267039 188721 228174 225147 288844 229291 136640 -38790 -73913 -103791 -131715
20201 -131715 -147110 -85249 56940 100040 43228 32248 128324 242803 355529 268605 212982
20190 212982 284801 185376 44077 -59015 -171895 -207354 -23697 14022 101213 210840
20180 210840 301768 443978 386437 174349 155858 246845 236349 -89547 -55574 64200 -28171
20169 -28171 -1309 109656 240395 253232 395410 395393 395579 507886 458842 271204 231202 292564
20157 292564 473325 495241 600720 656752 739394 771786 833973 941692 712704 374824
20147 374824 425857 547572 655926 853988 1143829 1269132 1284891 1546970 1659092 1541188
20137 1541188 1373905 1221865 1047393 1015745 807052 739768 744709 857190 823468 791927
20127 791927 879720 740109 599024 464362 403602 474917 464273 502490 252760 219591 403353
20116 403353 318120 261668 260279 417994 447543 521366 590488 670466 799971 749631 605480
20105 605480 546978 594224 646468 904898 1140261 1192409 1299364 1314903 1442489 1575924
20095 1575924 1632380 1579344 1348451 1383931 1453348 1440600 1425427 1306926 1458808 1625290
20085 1625290 1631222 1502115 1499759 1659349 1765976 1735597 1675295 1630265 1590196 1299785 1179979
20074 1179979 1152555 1122171 834141 539039 641548 586168 504891 422045 283614 413675
20064 413675 654185 712488 765788 717724 618720 567907 620900 638230 539116 402704 326773
20053 326773 385412 531257 668102 737319 759031 854743 951339 898211 967645 1015848 1142508
20042 1142508 1220683 1086151 1195193 1243482 1202279 1147564 1113948 1044679 909303 803364
20032 803364 793070 614130 652336 583595 371525 360458 382373 323492 407929 435988 414039
20021 414039 388307 303078 229767 204821 150047 136557 265776 352220 330421 227347 261823
20010 261823 184789 122549 131260 83610 80178 147683 33826 104433 83768 -64641 -97592
19999 -97592 81650 -1985 81023 184281 133388 86492 204330 268838 297876 105641 6976
19988 6976 -10132 -161282 -162276 -8377 -72257 -71159 -23439 -103907 -92708 132839 131329 20913
19976 20913 95180 177311 150101 87564 -20007 -185944 -138652 -94321 223971 248180 267183
19965 267183 265384 201010 122527 123235 193543 106052 -42063 -58196 -45679 -72454 -51167 78705
19953 78705 129914 57583 6952 64928 315199 248781 77778 19965 -101760 -228090 -86558
19942 -86558 8647 24024 -32812 47149 156444 98282 95519 18742 -113229 -179509 -77516
19931 -77516 -46075 -15717 129367 277843 352978 341851 169248 12563 171111 226637 218609
19920 218609 244509 270194 196417 83741 -109759 -47881 149662 242439 357908 281195 121648
19909 121648 -54608 -124469 -4829 -49868 -194288 -193736 -16382 46873 111534 86886 116008
19898 116008 284379 262434 209966 81298 194758 263366 393253 298234 183256 1045
19888 1045 10334 156587 201939 179100 154694 169070 251464 292518 225847 300578 362184 468371
19876 468371 404466 287461 423366 490746 356590 281172 309162 286886 287158 360284 357588
19865 357588 327066 244882 313824 306071 131517 105427 9823 -19766 48863 187967 398652
19854 398652 381147 404610 428084 237487 158916 189942 223844 178425 323109 263110 200761
19843 200761 103844 281742 456239 449944 317056 133942 87114 91186 259248 358511 292764
19832 292764 351198 314217 391402 556807 476301 469101 482333 484620 458531 463893 374799 223463
19820 223463 65955 49132 15405 -146744 -197190 -53271 -42064 -165879 -24360 196821
19810 196821 311533 393290 278126 222592 111449 3500 64936 143082 257956 317581
19800 317581 384647 297217 357104 367244 458594 420388 443617 454104 447191 315206 217231
19789 217231 332084 348080 325717 245394 329713 418945 309259 429477 392617 279299 268924
19778 268924 265631 443509 552108 607795 649915 691229 577340 441794 367625 386504 584997
19767 584997 661065 660543 672343 605487 492998 612436 785087 828879 994518 1049960 986810
19756 986810 961157 897991 918435 936816 1046203 1198566 1324019 1478738 1331266 1312807
19746 1312807 1070881 1035337 938670 847543 892522 917017 983527 1098663 1204928 1095490
19736 1095490 983586 1042553 1168111 1241037 1203609 1441668 1402765 1362326 1291960 1204034 1064727
19725 1064727 1032458 1166807 1266831 1362000 1363466 1236007 1068873 1002555 1004409 1045596 1224940
19714 1224940 1337439 1403533 1398162 1304317 1284988 1472322 1684778 1850525 1961422 2024252
19704 2024252 1883000 1800926 1877779 2068224 2075005 2051005 2219485 2116730 1923838 1955692
19694 1955692 2075937 2252516 2394308 2331564 2243162 2168823 2085387 2160486 2283549 2510353
19684 2510353 2699467 2673266 2738339 2825646 2977505 3037433 3145620 3234090 3426390 3615963
19674 3615963 3781567 3939896 4272854 4457916 4857592 5302090 5695476 6098626 6572710
19665 6572710 6934353 7411283 7880879 8393546 8699236 9005359 9585941 9854910 10373984
19656 10373984 11231165 12191828 13500586 15241492 17500616 20720797 24565871 28631845
19648 28631845 32665707 36104104 39113234 41837518 44436112 47050227 49555989 51705988
19640 51705988 54010322 57071759 62470992 71503524 85287089 105684968 134344049 170466203
19632 170466203 208886790 243302834 270751548 290521623 303045601 310400387 311633510
19625 311633510 301098701 277909517 249108977 220045916 193646517 173178799 159993710
19618 159993710 151642922 145280679 139535898 134097610 129112245 123576661 116394453 106551702
19610 106551702 95053082 83943885 74549783 67295620 61855296 57807004 54623634 52335479
19602 52335479 50635995 49590858 48939798 48912830 49249760 50185548 51928946 54520138 58403986
19593 58403986 63785741 70958353 80106742 91140789 102260235 112016331 119901976 126727196
19585 126727196 133445709 140466392 148178218 156596694 166929326 182567332 206615724
19578 206615724 238556285 274623690 310082997 338600168 355529431 362380611 361805576
19571 361805576 353132787 335492698 308730190 270726977 225007351 182976946 150932268
19564 150932268 128651777 113944815 104529211 98719091 95222956 92974531 90412038 87425071
19556 87425071 84082340 80624762 77197763 73275976 68122111 62006282 56229057 51316983
19548 51316983 47367306 44180966 41574231 39560487 37677376 36125483 34853529 33872585
19540 33872585 32981350 32044027 31147018 30052237 28883945 27916867 26932820 25992868 25249730
19531 25249730 24568602 23845798 23212671 22599344 22285895 22104153 21959505 21741523 21456014
19522 21456014 21508858 21751492 22240660 22516626 22806581 23173287 23843905 24302580 24690041
19513 24690041 25302223 26505623 27872701 29458638 31320463 33839836 37331785 41729611
19505 41729611 47355089 55264482 65812020 80182118 99128931 121820855 145480569
19498 145480569 166059696 180678401 189044261 193017353 194122128 192361285 185191037 169305720
19490 169305720 146182606 122063268 101573519 85521630 73711526 65102880 58853696
19483 58853696 54156132 50531729 47514185 45358810 44001054 42740460 41712341 40872137
19475 40872137 40109092 39514054 39148608 38985104 39056197 39483690 40029973 40859291 42413787
19466 42413787 44808830 48054701 52579579 58818005 67395436 79075737 94743762 114966788
19458 114966788 139190384 164361445 185527554 199711028 207250750 210284527 210334087 207360043
19450 207360043 198316759 179769393 153783158 127091268 104728500 87619671 74862446
19443 74862446 65305040 58159742 52790215 48508037 45027311 41988020 39411501 37324735
19435 37324735 35383916 33692932 31988407 30532931 28985919 27503691 25994762 24568848
19427 24568848 23221693 22040423 20903625 19821161 19063055 18324157 17683800 17130908 16452940
19418 16452940 15930203 15365178 14851504 14376869 13861823 13408231 13046544 12544428 12038548
19409 12038548 11694628 11387339 11016694 10661114 10441081 10221644 9775426 9544467 9355584
19400 9355584 9184622 8944503 8537271 8207686 7909494 7886843 7776111 7552201 7366107 7233728
19390 7233728 6988932 6749727 6745162 6526813 6327773 6276508 6216261 6062503 5818830 5592700
19380 5592700 5461320 5336735 5018226 4909513 5027901 4802735 4488511 4363352 4324938 4167118
19370 4167118 4089206 3984586 3884864 3980812 3872827 3703868 3826692 3770210 3484607 3259874
19360 3259874 3217641 3235805 3176032 3073480 3133425 3089888 3068542 3070444 2968105 3071614 3146724
19349 3146724 3099126 2996336 2936498 2782319 2589613 2572371 2478824 2336615 2164217 2171632
19339 2171632 2307847 2285254 2354477 2339704 2235312 2254756 2311647 2339462 2287008 2143293 1989871
19328 1989871 1874276 1759244 1766213 1783337 1830567 1947901 1877489 1706218 1660349 1763450
19318 1763450 1761186 1697228 1739876 1778483 1702852 1590043 1520628 1688644 1781337 1666680 1542299
19307 1542299 1313126 1289838 1338076 1336613 1118829 1074767 1160631 1237345 1429850 1423742 1296278
19296 1296278 1309703 1206072 1167358 1131713 1201314 1312473 1292331 1263373 1117063 1251884
19286 1251884 1185471 1111276 1085539 1266931 1300417 1206593 1226867 1408831 1489738 1526850 1400595
19275 1400595 1566630 1916591 1971651 1963836 1997581 1937644 1933009 1947862 1882385 1824109 1947991
19264 1947991 1880400 1817971 1750548 1949881 2030172 2016652 2163808 2200856 2182880 2209412 2153155
19253 2153155 1977044 1656107 1616754 1731793 1528169 1466308 1485448 1414222 1415490 1206477
19243 1206477 1052523 989534 980448 1060329 1138893 1166978 1119376 1178886 1420786 1464793 1437044
19232 1437044 1498320 1453008 1525341 1820157 1983074 2002500 2048982 1835958 1715620 1651715
19222 1651715 1635085 1749951 1678660 1697902 1794069 1874184 1729405 1751142 1933050 2028131 1941747
19211 1941747 2076024 2030924 1914112 1787799 1661428 1506978 1445895 1527518 1630326 1718720
19201 1718720 1962997 1980481 1837225 1669775 1522665 1423851 1391059 1244972 1194711 1137901
19191 1137901 1069837 1154616 1175739 962084 900792 844047 756167 669488 517284 598302 713927
19180 713927 864269 851864 774328 711306 649191 584461 510142 463521 605981 424955 425679
19169 425679 484541 418389 432255 634975 633525 466866 341507 309846 424855 512364 693594
19158 693594 669361 568358 460196 316209 294203 329402 385085 474674 284164 310142 512731
19147 512731 591871 437878 465504 537091 561517 679789 786800 690265 579859 508926 476725
19136 476725 358993 301537 242263 192485 183462 238142 442636 504420 582473 538646 590203
19125 590203 462193 420799 464960 456200 600132 729592 692585 640503 722149 720096 690831
19114 690831 760241 973003 950453 974875 1102645 1062141 949085 1057451 1113752 1216442
19104 1216442 1262668 1118458 1013242 1079068 1083309 1109783 891383 831741 798806 673585 764197
19093 764197 858668 862496 832397 836836 954335 820284 761265 783251 846982 768819 869494
19082 869494 893183 864247 672140 574132 502973 360472 402529 384932 454215 542363 572840
19071 572840 514630 331826 430114 476294 608100 758301 859005 1002611 1148323 1370195
19061 1370195 1425346 1391980 1454935 1386140 1416959 1478450 1551192 1537930 1523701 1282207 1196444
19050 1196444 1228035 1393306 1525793 1645658 1641146 1630264 1482542 1494936 1508033 1486998 1494666
19039 1494666 1463391 1606601 1547440 1185065 1040839 897895 878599 929491 815156 775718
19029 775718 889676 962406 855624 930436 1016639 886888 922967 1035087 1013682 1167929
19019 1167929 1312838 1315272 1500497 1631951 1617401 1444862 1146734 1098525 1196732 1124523
19009 1124523 1028552 804273 762201 721085 525484 444405 514592 652724 689701 707298 771713
18998 771713 843562 682843 536452 643305 559425 401898 393408 402789 410255 483925 621311
18987 621311 607751 549303 520640 411771 450790 528462 638957 883492 1091937 1070428 955866
18976 955866 1106405 1027843 1073035 1202000 1290199 1178268 1042547 1091487 1271085 1273473 1077574
18965 1077574 928267 733231 728621 775283 797730 836865 767198 630637 680014 641759 758806
18954 758806 685409 643275 671946 597070 511227 446819 392923 295990 428589 610764 504102
18943 504102 409702 503200 460268 605923 609336 512004 449212 314683 268630 521388 758521
18932 758521 644326 596891 559739 454136 477838 530366 397638 229089 185261 255646 496466
18921 496466 390863 169327 138504 308555 401415 428976 449164 423229 497283 412490 385107
18910 385107 549656 559209 537785 602465 588503 728663 925223 977130 1011588 1096621 1054951
18899 1054951 1077969 1040523 891533 901548 914514 882721 756812 622634 532817 451172 502205
18888 502205 558440 635091 743744 788550 805738 748880 656744 623585 575575 488198 380090
18877 380090 361559 369265 325226 338200 454306 573303 664016 575959 832067 1007777 1067171
18866 1067171 1181273 1282242 1220900 1234265 1198122 1249766 1511653 1669496 1610624 1546669
18856 1546669 1498146 1428932 1361976 1204515 1353191 1278512 1086913 923537 926511 917164 902265
18845 902265 851369 735202 761004 889463 978975 912919 806611 733744 757150 684377 723372
18834 723372 794379 752678 821886 864361 896857 917876 878096 943948 1036741 940570 778005
18823 778005 931038 973965 938225 1056665 1076565 1067466 1196742 1258693 1226879 1250361 1317373
18812 1317373 1137193 1334029 1462930 1441915 1274005 1272337 1438199 1589004 1745048 1647308
18802 1647308 1468370 1330778 1202805 1287692 1484351 1546680 1464902 1484672 1484620 1658266 1692439
18791 1692439 1793819 1813805 1767327 1795127 1900424 2107019 2369492 2438783 2302924 2321188
18781 2321188 2463332 2566279 2521563 2635484 2897131 3314271 3610379 3607827 3700160 3959494
18771 3959494 4259249 4397863 4674586 5165098 5458480 5801118 6359157 7094831 7977414
18762 7977414 9300779 10782382 12357814 14180023 16404053 19261420 23613665 29003016
18754 29003016 34244886 38891432 42439359 44993599 47340805 50182214 53291414 55841622
18746 55841622 57078872 58396660 62037148 69476325 82162257 102563793 133898648 178610963
18738 178610963 232545548 282919229 321233503 347885958 363426002 372596611 379175383
18731 379175383 373953569 345282668 302864669 259669053 220171485 191070669 174280455
18724 174280455 165293802 159207532 153215710 146947909 141169111 135604343 128537107 117997731
18716 117997731 104202683 90227292 78761472 70218535 64036712 59390366 55962572
18709 55962572 53395910 51603747 50053694 48854167 48130850 47692765 47704072 48180815 49515139
18700 49515139 51901350 55472575 61006497 68860290 79067944 90718369 101452239 109857922
18692 109857922 116416934 122576116 129272354 137032388 144702542 152529435 164431942 185492760
18684 185492760 216123239 252555646 290877671 323519655 341441542 347208338 346631757
18677 346631757 338407633 321585166 298055473 260589992 209233185 162902936 130222779
18670 130222779 109281484 96066184 87802055 83264286 81141089 79824032 78294459 76011704
18662 76011704 72999270 69919361 67140731 64379981 60465603 55112399 49425853 44568441
18654 44568441 40751022 37892163 35668641 33467093 31518131 29833005 28197211 26711244
18646 26711244 25552968 24662909 23781704 22974168 22394383 21842396 21076396 20152500 19475829
18637 19475829 18738054 18159343 17541511 16906904 16226905 15730092 15276987 14967335 14582365
18628 14582365 14116443 13572655 13172816 12803904 12542746 12106551 11729491 11460214 11163613
18619 11163613 10797417 10633285 10523873 10252501 9877254 9390445 9200095 9043251 9000908
18610 9000908 8921380 8695875 8468693 8461080 8335002 7982705 7678252 7493662 7417560 7229598
18600 7229598 7010816 7055072 6966163 6893411 6742120 6451312 6205371 6169757 6108271 5886879
18590 5886879 5783065 5763295 5615618 5431712 5324629 5117798 5026901 4863809 4695008 4648166
18580 4648166 4456885 4404217 4478683 4571660 4577817 4295455 4240748 4473751 4526090 4455726 4203091
18569 4203091 4017485 3943550 3893203 3986730 4075163 3883578 3642101 3602672 3546897 3563820 3580771
18558 3580771 3421636 3424386 3514336 3344619 3312632 3295431 3229134 3213195 3235762 3268361 3364471
18547 3364471 3502815 3561527 3530657 3457885 3417332 3304839 3212960 3413323 3296499 3251449
18537 3251449 3161862 3096058 3125304 2917833 2799805 2704807 2576333 2569461 2739248 2690387 2657762
18526 2657762 2563857 2589332 2629164 2628043 2755187 2900615 2796369 2805195 2902532 2881026 2713467
18515 2713467 2668019 2724781 2503497 2569113 2715789 2775451 2994286 3230715 3335217 3238831
18505 3238831 3268078 3365830 3322125 3224433 3536349 3754108 3926398 4065357 4146792 4396935
18495 4396935 4618993 4931664 5172305 5709289 5982031 6141599 6509317 6885053 7311089
18486 7311089 7979797 8698253 9319725 10084421 10808353 11804066 13164711 14972681 17177839
18477 17177839 19669911 22517401 26219044 30762256 36448405 43920608 54181155 67992666
18469 67992666 86630923 111238429 140197138 168224466 189314422 202096316 208373154
18462 208373154 211000938 211460880 207646952 194193694 169463838 140375153 114134308
18455 114134308 93649461 78684715 67760820 59824705 53735623 49116719 45316715
18448 45316715 42178397 39555657 37462886 35577050 33906296 32538458 31582298 31071329
18440 31071329 30787220 30570805 30594403 31203416 32205658 33559837 35652273 38452238 41962618
18431 41962618 46886795 53549878 62473684 74853460 91739067 113597151 139711456
18424 139711456 165670673 185625564 196989684 202106437 203451735 202625545 198175816 185620964
18416 185620964 162601655 134304233 108512635 88512918 73953898 63558265 55904585
18409 55904585 50061296 45424618 41617416 38468139 35604053 33270745 31288679 29268471
18401 29268471 27415747 25803232 24358118 22895585 21729749 20723537 19800537 19060110
18393 19060110 18212634 17353120 16512157 15777612 15017190 14484541 14129659 13760353 13352709
18384 13352709 12843063 12243936 11768922 11371569 11242459 10938811 10488360 10156604 9871467
18375 9871467 9784534 9614667 9119128 8671585 8385980 8123724 7895746 7670210 7402977 7293231
18365 7293231 7161160 6965611 6741961 6618344 6341995 6260899 6163953 6025517 5665571 5313693
18355 5313693 5272649 5251925 4926493 4773997 4596936 4589703 4639249 4499756 4353614 4092657
18345 4092657 4132120 4155029 4006091 3747590 3499530 3480501 3508337 3494163 3453214 3342668
18335 3342668 3357638 3186931 3162070 3228706 3262406 3364645 3350294 3221206 3138451 3080291 2925318
18324 2925318 2834416 2730832 2581314 2606502 2488398 2435951 2405523 2403567 2380888 2374499 2327091
18313 2327091 2396966 2237558 2087472 2145380 2220090 2391831 2298113 2221966 2051369 2013920
18303 2013920 2115781 2027715 1943661 2026125 2068663 1944750 1828448 1953778 1980384 1787520
18293 1787520 1711406 1848747 1681038 1551463 1425345 1433823 1529567 1516581 1381592 1437395
18283 1437395 1526318 1474182 1495123 1504232 1598136 1538142 1454324 1329065 1229838 1256201 1136353
18272 1136353 1256421 1137723 1119801 978509 808550 836075 906198 1080205 1131444 972065
18262 972065 861346 941907 1000547 1057270 960552 870307 845103 776676 739437 782353 698133
18251 698133 799907 836484 826511 873290 728978 668178 719718 725407 967052 904748 767454
18240 767454 572880 476601 535843 468923 718447 973829 986377 963437 1002447 1168505 1274454
18229 1274454 1165166 1177471 1256698 1196615 1086736 985251 796629 704404 619067 643528
18219 643528 563727 430909 561807 764335 872030 902653 999319 1155838 1229401 1100208
18209 1100208 1246445 1416175 1478422 1500504 1606032 1622298 1668491 1869863 2001349 1797993
18199 1797993 1650109 1786722 1777906 1893527 1942210 1907038 1822825 1867659 1679464 1638719 1542278
18188 1542278 1307271 1161609 1080945 1048606 964228 817240 942032 995062 851423 766490
18178 766490 868329 906517 929230 790501 744765 726996 829826 850285 676247 567464
18168 567464 535215 610496 724743 913153 954822 1029505 869574 846156 924177 924992 925210 950863
18156 950863 1043467 1183566 1319597 1463717 1631525 1757679 1599911 1540709 1528776 1594905
18146 1594905 1504662 1437953 1419145 1244281 1253161 1323755 1417267 1267433 1214162 1384080 1380760
18135 1380760 1189985 1157963 1126231 1114581 1047538 1081582 1115198 1070262 981966 938949 879392
18124 879392 836981 634739 709270 665145 548426 391929 370859 421116 369793 382912 393989
18113 393989 359545 447292 367113 304036 207339 271028 301351 286192 272319 194543 167623
18102 167623 379022 401795 448041 310612 401056 270133 186897 123845 232418 119866
18092 119866 153375 326150 359923 330123 319877 422531 335306 303076 375659 479314 324201
18081 324201 159140 141218 159976 162529 234776 260810 265635 162022 237424 339662 326706
18070 326706 363464 384842 423904 300305 87830 248011 235147 300409 324329 455564 408206
18059 408206 359654 330797 283632 353398 364050 355234 382070 542714 331107 154735 108051
18048 108051 96788 176407 61835 144404 315445 335620 229017 284984 242595 320686 412703
18037 412703 448995 439984 451232 361451 310627 291229 316181 335826 317818 169061 119755
18026 119755 186697 370401 507329 398286 243724 252756 230426 290559 454342 362695 99599
18015 99599 -67425 38385 254290 521717 637503 470105 476517 474800 384397 330630 319620
18004 319620 315917 258248 171578 96270 100134 222883 378444 242099 83967 120984 97502
17993 97502 239835 201958 286157 255137 129831 130864 212747 212817 82672 35956 148542 108402
17981 108402 64476 128936 166535 335994 377138 415106 292516 172124 55049 94553 107614
17970 107614 30318 -1878 103237 280335 366365 470041 292423 120213 -48652 -14419
17960 -14419 -4069 46230 42976 174238 278531 154276 164782 273932 255873 152855 61186
17949 61186 2127 43940 -137 -44584 8559 180755 65120 28808 43063 100499 37950
17938 37950 -59166 -21410 208435 302380 145703 291549 120552 -50154 -13876 11360 63771
17927 63771 317641 334834 326646 286195 204764 296311 208470 285350 402486 327377 271006
17916 271006 147699 246374 303792 376043 480654 593626 764629 1070705 1161155 1062906
17906 1062906 1065714 1108413 860222 874928 970880 846428 810033 755200 637927 507096 469014
17895 469014 485178 510538 482564 509696 455680 562164 580058 567911 684757 543514 389047
17884 389047 296026 266861 305473 284931 206926 20055 216699 421398 423332 393086 334334
17873 334334 404323 488624 552845 628336 630236 561980 511158 653156 877591 996935 927136
17862 927136 825507 845034 929953 987587 917252 780076 451922 386840 376021 378336 573177
17851 573177 508021 607069 656182 587550 592613 516446 386532 311560 302496 401402 297786
17840 297786 421162 546837 381525 280805 159653 197674 224747 146487 132114 97230
17830 97230 -108147 -43733 36034 40454 164659 167461 108663 223753 181479 65464 4153
17819 4153 -87154 -63539 -31051 107041 281503 328695 240666 89509 217050 313988 397728
17808 397728 226741 37746 67204 89481 101088 47212 55911 -26839 -80791 21668 59602
17797 59602 136209 68179 91079 153836 211075 302591 185440 169738 126573 -44438 164823
17786 164823 340084 117459 -21901 52033 189295 145566 252516 476955 393239 229533
17776 229533 309207 308790 198204 56802 -4437 -112120 -25246 85225 259616 287924 185658
17765 185658 182030 102864 159221 231642 280734 256535 329498 414682 217756 62808 62293 -64426
17753 -64426 -2528 60514 168984 240812 244881 209990 293140 471848 463819 382519 290229 242618
17741 242618 391406 410920 123572 124751 139464 107066 248019 368561 280175 197018 6978
17730 6978 -245445 -74247 80971 130683 46405 -70880 -66843 25026 178244 169671 183892
17719 183892 112236 227946 206710 163831 237655 206371 246176 147462 -66335 5741 -62920
17708 -62920 -8437 147324 240347 71184 -32645 43767 155728 195242 276484 296301 327789
17697 327789 180023 -4397 53120 47315 129342 75709 133774 131658 127110 118021 173088 4381
17685 4381 -197325 -169478 -21294 39760 -59636 34996 359456 481390 498635 406033 329806
17674 329806 147964 100533 149896 126862 126217 121375 193324 272624 155516 6793 -119582
17663 -119582 -68318 4571 -26478 10832 -37537 -90404 69709 119013 120804 98962 75220
17652 75220 227332 192207 8323 -46026 -115840 -108960 19809 55260 41216 71185 198548
17641 198548 116875 74941 34292 195272 135789 138848 110318 82223 8001 209771 318929
17630 318929 167239 214613 116729 57331 3172 51615 147189 121390 58419 211469 318482
17619 318482 303180 249834 190437 87965 226410 269908 249254 240442 103977 203083 410073
17608 410073 419756 387245 440533 239174 121810 74680 -52237 -53183 -116251 -97777 -122902
17597 -122902 -82869 73023 238771 172606 32461 74732 -41714 -53021 -180802 -218655
17587 -218655 44733 139358 184009 240505 352387 255883 51432 10065 79927 65562 67981
17576 67981 103916 157809 163282 -11115 47755 274055 304990 337115 303594 264721 235025
17565 235025 312846 257580 131271 71050 136556 -10124 -320892 -287060 -177727 -52286
17555 -52286 -99445 27818 -100826 -263830 -158166 2142 182013 279348 258205 326966
17545 326966 523612 327636 262116 204273 116719 129173 26095 166424 156639 146866 131753
17534 131753 240654 258154 174486 72678 24770 149332 420081 417836 448951 330561 339887
17523 339887 407855 305575 107417 13441 8468 -20787 -58663 -164652 -154581 -193195 -129578
17512 -129578 -71992 -159363 -109392 -183959 -261056 -282262 -192736 -133834 -77884 85400 59372
17501 59372 -87271 -84369 -59538 -67184 -38055 34188 63824 -206106 -362151 -345345 -124824
17490 -124824 -68369 -137120 -281284 -208570 -245679 -423874 -308227 -155716 -9979 -8760 -11552
17479 -11552 11707 -50164 -27179 96740 84085 217892 305456 228393 136058 -11648 -91946
17468 -91946 -87310 -47986 -7736 -64196 -122619 -287759 -293415 -210200 18692 123914 2363
17457 2363 24306 -712 10788 -1818 -130479 -261693 -226960 -44024 45967 -58843 -86290
17446 -86290 39553 132119 92152 48554 53577 30996 -56352 -114529 -85076 -52357 -102893 15442
17434 15442 121184 264755 266145 207222 196025 157346 116436 -1274 -28443 -27860 -210088
17423 -210088 -261657 -397446 -387088 -202699 29494 280370 153455 86746 93013 150559 126332
17412 126332 69750 53078 23092 101361 -48869 -142742 12467 -53417 -157012 -93693 -69434
17401 -69434 -49195 9627 -8904 3340 -27188 -91534 -211973 -244522 -181291 -49461 -55639
17390 -55639 -36380 -121926 -67209 105093 131357 -111920 -59602 -67684 19198 126086 51602
17379 51602 24323 -154174 -339366 -252473 -105641 -23119 41064 22465 -124427 -59242 -45087
17368 -45087 -149094 -226757 -101219 31488 187835 200249 10788 -51465 37855 137977
17358 137977 267555 372384 402806 346700 335556 283944 290222 190355 58459 -85933 -165156
17347 -165156 -33394 21939 -66130 -79854 -59577 -74692 -45968 -12478 56290 96354 147736
17336 147736 248882 164541 9102 21416 170633 236433 165618 68709 35534 -73601 32229
17325 32229 -33564 -39968 97547 134523 -20908 -198703 -180974 87612 203549 -51471 -169064
17314 -169064 -62610 -6685 171002 181483 -28405 61698 181314 97035 81781 68015 45478
17303 45478 29964 89030 154579 121923 129312 234955 243701 153706 16871 -130351 -173180
17292 -173180 -154528 -364876 -384101 -241305 38631 179943 89280 47888 13446 42427 108833
17281 108833 225194 445960 367482 119552 21628 85744 56454 18085 148783 137634 82564
17270 82564 86703 66022 138336 222423 287312 123676 -5857 15544 56232 -2239 16132
17259 16132 77195 158533 276689 347205 157872 -50356 -14106 -54244 8640 31440 99140
17248 99140 22473 -18465 -28260 -69904 -47246 115066 126998 268206 371390 185446 -26057
17237 -26057 -12297 -28282 103489 49373 -122849 -25095 53998 -53955 -86534 -123912 -13738
17226 -13738 15843 23292 142540 183933 184701 174290 358867 241861 231742 245686 85624
17215 85624 55800 -50582 -205660 -83209 -87716 -59145 -22753 -26927 -104814 -24385 -26606 -3638
17203 -3638 1941 -51408 79325 116527 158490 149745 223776 193157 15432 -66660 -91436 -20405
17191 -20405 45597 94773 147065 184881 118863 206381 101547 93036 -14589 -159687 -212256
17180 -212256 -259760 -122327 -76614 -70180 92920 283230 204109 169670 121081 221965 266579
17169 266579 217867 116885 51783 32223 224923 357307 304573 163396 260321 383194
17159 383194 357551 273421 334641 451898 438968 299748 243743 203188 259043 334525 278524
17148 278524 150522 -20353 -278240 -276726 -95700 -52325 -59557 78046 76777 114421 130286
17137 130286 128229 -19310 -111118 -27300 -92354 -437471 -458656 -367536 -187623 -18435 47776
17126 47776 -127533 -158614 -171969 -151907 167 -36497 -67631 -82055 -102607 -207760 -146505
17115 -146505 -148033 -192368 -61951 -47638 -123966 -97057 -105134 -61294 23528 -25327 -105320 -54006
17103 -54006 -98145 -69464 12352 166265 25922 34833 185267 259459 225025 310683 332077
17092 332077 271399 235643 148975 241896 360938 303119 298163 77173 -122373 -239760 -240728
17081 -240728 -146074 -257905 -71380 130681 289765 309861 254165 42925 80364 88281 148667
17070 148667 179864 2888 -47379 24921 175895 150482 84080 5701 -28028 -47273 -80695
17059 -80695 72392 111332 131669 -21406 -38615 -118084 -61320 2367 12757 71869 73639
17048 73639 55145 92790 100036 -7997 -53957 -231481 -236702 17035 267662 172757 -27789
17037 -27789 -274636 -316497 -242977 -119751 -112966 -137284 -74547 116431 181379 118116 201260
17026 201260 290987 373413 350851 265650 222741 311497 429389 323053 122550 107653 86794
17015 86794 51506 -90819 -124206 -178321 -135983 -29904 10305 77145 -5024 -111646 -274748
17004 -274748 -273292 -103144 58767 122834 62868 -76793 -201428 -52082 38493 44030 -118005
16993 -118005 -69177 13357 -198053 -270531 -242476 -258824 -149796 -142482 -152608 -114743 -54790
16982 -54790 520 35034 38016 -86641 -284630 -337516 -242937 -242860 -230490 -253231 -246535 -158608
16970 -158608 -150681 8606 41937 -63347 48807 151678 167198 331086 310376 360401 332474
16959 332474 178131 44739 -154392 -280920 -264655 -273493 -240341 -177148 -66975 133770
16949 133770 309455 282839 261317 102374 53643 -15975 -47548 -137775 -164925 -16653 87137
16938 87137 91103 203106 165302 -17752 -20333 44986 47705 96972 140945 221286 243285 232281
16926 232281 37791 155769 130842 45510 187025 -28487 -161092 -128336 85156 171913
16916 171913 92699 -40820 -5674 -47728 -159853 -244421 -285322 -265543 -206988 -239161 -268266
16905 -268266 -223530 -174466 15670 163223 201150 148250 72214 28672 53337 54959 68894
16894 68894 -45437 -184603 -167825 -7793 271045 330288 172482 76570 30969 52943 -18866
16883 -18866 -140005 710 65833 -6981 -155813 -43665 233427 349169 191262 -58152
16873 -58152 -101171 -6329 -9049 96138 152381 136999 72122 243448 376758 329121 269705
16862 269705 227437 82145 73466 -48970 -81673 -116192 -737 113152 -26981 -313957
16852 -313957 -211861 -312927 -389290 -347479 -240243 -170621 -202287 -301396 -126521 36564
16842 36564 154334 107329 155288 101390 146022 -31681 -207494 -252723 -320817 -300398 -156197
16831 -156197 -71695 -95623 -82173 58615 184431 -62640 -108006 -68366 -32471 -29153 -16213
16820 -16213 -75079 -43245 -77791 -78165 -163529 -152050 -157032 -49446 -55004 -210799 -139882 -214870
16808 -214870 -224274 -190213 -182070 -279010 -373846 -310646 -208053 -88811 -123195 -97998 21788
16797 21788 55369 15386 89017 354983 297927 116190 -106904 -147358 -92068 -37178 -106363
16786 -106363 -127626 -69587 -118125 -163977 -348722 -257167 -92765 -37027 -9121 115762 100876
16775 100876 113860 126131 -10897 -81386 5273 19907 166474 72606 48427 129343 79903
16764 79903 -98930 -164075 38687 171489 55458 77618 -85550 -157913 -57636 -105165
16754 -105165 -245793 -224961 -214518 -93038 9006 -104051 -41452 -14197 -167598 -228233
16744 -228233 -210741 -208183 -77356 -70248 -14803 179541 202634 57438 90301 -15950 -20154
16733 -20154 26701 -1007 164504 263957 100237 -109525 -199899 -276831 -210367 -199151 -27188
16722 -27188 -81250 -171578 -256996 -203733 -142927 2366 88335 72824 111509 91821 137848
16711 137848 107514 232639 351698 399511 327606 337413 329819 281053 285125 213363 73855
16700 73855 65367 284023 316024 69856 -27606 -180833 -185429 22707 93603 -48977 -77122
16689 -77122 -57344 -143972 -154034 -106126 27306 -70337 -71140 28283 210690 188347 -104590
16678 -104590 -243909 -186588 -141204 14446 -24864 -107804 -284732 -272268 -190165 -240369 -166189
16667 -166189 -44739 -62535 -204430 -216473 -157980 -175830 -175695 15422 125258 92738 -50051
16656 -50051 -137527 -133108 -188209 -77881 19750 116548 121506 87615 -32071 -90299 -2603 -22664
16644 -22664 -116208 -141413 -261982 -81876 -30507 71870 33256 -20873 -55437 108965 175915
16633 175915 29358 29720 59437 151045 159426 168472 -33424 -202746 -170457 -217856 -289988 -307249
16621 -307249 -239920 -200078 -113126 195132 201749 12451 -150179 -236055 -286006 -227959 -215215
16610 -215215 -286051 -221551 -110653 -78683 -161982 -127520 -155045 -283127 -164918 79468 140897
16599 140897 194645 51613 -24653 89625 225292 292341 161426 30656 55565 -73425
16589 -73425 -10194 35338 77416 101707 -50449 -134963 -107287 -143076 -199455 -110468 -57877
16578 -57877 -14686 -54930 -113194 -81772 -40803 26250 72065 149824 139414 132121 14520 -205537
16566 -205537 -301294 -71787 -45790 -263171 -232101 -17730 -19192 -6638 60808 278383 146485
16555 146485 132362 168628 64228 -382 21640 91743 255452 122873 61191 34563 -152462
16544 -152462 -142116 -145992 162474 418565 196588 105514 84857 4507 -32495 -78029 -31696
16533 -31696 -67450 -164390 -104572 -68677 -185487 -283338 -325255 -171315 48322 280679 266648
16522 266648 98695 -10486 86359 79234 -1048 28974 65146 42123 -58849 -119429 -150279
16511 -150279 -92937 -45714 -148390 -190501 -123408 -12241 31473 60535 121941 212908 65038
16500 65038 143518 145259 -24897 105834 189948 35756 -199621 -372175 -299101 -8592 205952
16489 205952 200656 81211 2977 24226 -22937 -152171 -39929 142972 45266 -104694 -69467
16478 -69467 31740 294736 173215 50574 80042 188479 179050 168015 139863 29772 61395
16467 61395 111797 152873 3886 -217201 -289230 -173832 -79982 -52115 -42994 87710 144810
16456 144810 -46812 8878 205535 307197 250895 108151 4771 30996 -27738 -119204
16446 -119204 -76066 76657 138724 177332 117174 132277 127442 92260 112563 170924 316254
16435 316254 343417 305339 110085 138343 297448 214826 181780 186519 109359 220195 183116
16424 183116 147318 80997 184676 193639 18626 -68199 36484 -80256 -67194 -47440 -86
16413 -86 -32031 -115404 -113679 -218001 -157282 -152914 -271473 -308836 -338911 -286416 -65938 -32273
16401 -32273 67849 81792 101929 103242 136283 186007 -54781 -188000 -129425 -191203 -162408
16390 -162408 -137969 -132138 -167758 -333020 -288790 -201108 -122115 -229714 -239506 -185403 -187937 1434
16378 1434 113186 172031 101640 -13064 134394 209464 254650 29702 -38184 -50245 -88075
16367 -88075 -67802 6516 -126026 -177998 -41871 -89193 107635 65139 -44146 -97336 -241285
16356 -241285 -330515 -198163 12039 83629 82781 48946 58664 118444 59884 -10239 103104
16345 103104 128626 149677 119274 38581 93974 110508 124843 -26679 -10928 43702 151919
16334 151919 238230 74224 85898 182671 126902 267725 476474 368949 250614 185352
16324 185352 15974 -106797 102323 321429 397354 203841 43189 18486 -86104 -131278
16314 -131278 -168697 -319451 -352936 -367929 -240652 -60900 58138 288894 368315 293961
16304 293961 39700 -110941 -46072 -59626 -70797 -7235 -63839 -171251 -78616 52755 -14545
16293 -14545 -19945 -22219 47321 -101512 -170712 -95455 -287861 -370422 -310055 -132185 -54335
16282 -54335 -5284 -101098 -233404 -339788 -195711 -232316 -148807 9470 113582 69279 7010
16271 7010 124100 145603 24822 102874 240654 316012 210128 176269 166640 38977 -72382
16260 -72382 -157713 33788 6221 -24979 -171193 -38746 112262 65775 113835 -47015 -214254
16249 -214254 -200992 -15028 -15645 -56118 48319 190629 197087 92926 -37110 -90682 -149335
16238 -149335 -191694 -182462 -235044 -135093 -128844 -157739 -89631 -60623 -77964 78164 -75872
16227 -75872 -285971 -316624 -154176 -170112 -376277 -300972 -217623 -310939 -122347 122965 104548
16216 104548 247034 300930 416848 246369 -200885 -146813 226994 295715 232755 171921
16206 171921 112515 224937 135298 23303 -19352 6325 -20118 -9847 -81148 -108424 -151354
16195 -151354 -232711 -56853 -15283 -113772 -47188 -28835 -33777 17987 132613 219850 149093
16184 149093 5520 30242 161913 338971 177977 104760 -28329 -140663 -132179 -108364
16174 -108364 68664 97005 123985 45387 -207997 -243681 -227063 -96980 -16304 -36633 -6496
16163 -6496 -89679 34199 27976 74704 31017 47151 -12250 -217778 -145767 -116448 -165416 -196890
16151 -196890 -288041 -166807 -51153 150625 370436 346564 322937 36248 -27206 120311
16141 120311 152574 151619 141977 27127 -128618 -106939 -120900 -129241 22173 127694 160011
16130 160011 -1796 -221278 -117469 26840 2270 -166026 -139088 -64454 150767 157531
16120 157531 49289 126424 194602 253596 79086 -56553 -119973 930 113568 262473
16110 262473 333809 297282 215492 -121015 -296133 -161851 -28448 161589 225179 273308
16100 273308 199148 172437 200941 161946 -60578 -104061 -170999 -223402 -209855 -162987 -267441
16089 -267441 -213876 63213 103287 -32712 -204073 -112611 -53978 -128544 -139877 -273149 -241342
16078 -241342 -119496 -156402 -203078 -63405 7297 -133762 -142745 27056 30440 -30748 -148251
16067 -148251 -144635 95405 172558 3011 -86364 -116132 -10451 -18910 -223037 -70790 187065
16056 187065 180264 223803 277317 243680 227730 145366 162527 134087 -48173 3491 87870
16045 87870 -11889 6186 82130 133178 89080 -28051 -129635 9766 156535 238036 243588
16034 243588 150324 122836 56314 90291 47382 19603 72625 -12838 -71858 -17333 26085
16023 26085 -137164 -294763 -103920 -16157 -51724 -261690 -237145 14727 91152 257424
16013 257424 243476 282831 188608 179529 248365 193872 120275 155001 187484 222348 306773 267774
16001 267774 120236 -86099 -139762 -129225 -116662 -100746 -59837 118233 98345 -63045 -198607
15990 -198607 -211553 -247098 -184808 -371759 -425961 -345253 -381006 -360105 -422138 -430003 -330051
15979 -330051 -313727 -191566 -82181 -105705 -42285 75703 -78571 -159976 -252293 -126482
15969 -126482 76099 -63155 -191660 -156361 -137239 -74466 -34053 -74383 -75436 -141789 -21932
15958 -21932 23796 -32483 23439 -230677 -361549 -224363 -174940 -21614 128875 225436 351753
15947 351753 316015 223591 161515 2237 -190105 -308618 -313836 -207194 -94568 -299 110612
15936 110612 -189885 -140977 -20134 -82469 -168093 -160508 -228096 -455561 -428255 -391768 -178452
15925 -178452 -73122 -46209 -124235 -222727 -125422 66254 228025 142202 110313 111687 170646
15914 170646 162180 225303 210012 262505 321942 309237 351117 354738 381891 364198 234098 225588
15902 225588 -38528 -204980 -102131 34110 -128120 -254310 -190258 -48326 -103859 -53373
15892 -53373 50199 12304 -7807 -65612 -47493 -114945 -97203 77743 54490 -8814 38193
15881 38193 178983 180112 179002 158673 -94938 -235003 -135944 66316 194174 301825 204478
15870 204478 80031 -16873 -65655 -97497 -290170 -294163 -48476 97787 8505 -6472 -18265
15859 -18265 4489 -32116 -126181 -184952 -202446 -136786 -115913 -125497 -161175 -130130 -117618 -162284
15847 -162284 -55331 58225 40891 -26154 -23171 70284 58842 -73037 -292653 -415563 -311617
15836 -311617 -167815 -56553 18455 123066 253449 188579 -26762 -36814 109034 216217
15826 216217 192796 236857 89144 28873 8652 20681 -44765 -1351 142478 148408 182797
15815 182797 93371 70266 61328 -129125 -183989 -336406 -475281 -487576 -494542 -256848 62674
15804 62674 48464 39428 75907 -17280 -218850 -245947 -121880 -31586 -41697 -153320 -189395
15793 -189395 -190958 -193803 -127887 -85609 26203 164607 253704 362755 439889 210159 47785
15782 47785 -78669 -31705 44574 111008 146625 -79120 -213541 -156591 -227642 -250216 -217768
15771 -217768 -186948 -146977 -73400 -87666 -63060 -97434 -159014 -237743 -242588 -126573 19190
15760 19190 186801 78235 -151374 -303773 -508453 -439181 -391134 -264687 -110402 53784
15750 53784 -18379 -174875 -244678 -315111 -225113 -115281 -132425 -291811 -519970 -508327 -375782
15739 -375782 -268356 -250088 -68120 -53817 -83288 -5359 162994 36742 37760 38824 -67637
15728 -67637 -120177 -205504 -235020 -289301 -263098 -170941 -155016 -207993 -185284 -85165 -11940
15717 -11940 -55753 -212671 -84558 171438 258730 121407 133372 213842 303312 188211 36896
15706 36896 -147451 -145146 -10839 -192897 -236413 -10514 185412 295990 272310 11174
15696 11174 -148948 -1437 161549 1384 -70173 5720 -15081 -6848 6213 13061 43851
15685 43851 -11619 141491 63190 -39386 106533 302747 276346 100126 21796 38892 -84004
15674 -84004 -68496 -10332 -98008 -79204 -97067 -161562 -261013 -30574 -97261 -277853 -354475
15663 -354475 -442485 -607742 -410204 -83866 -131363 -147183 -296856 -343772 -295225 -252713 -98280
15652 -98280 -39140 -69794 -116972 -258465 -339372 -196244 -172405 10283 -11100 -135969 -105288
15641 -105288 25377 150836 -20015 -98448 -49550 6105 -86832 -29067 44016 28631 -81829
15630 -81829 -41520 94578 134861 126664 90704 58684 38077 -28578 -78023 129844 117036
15619 117036 -25 -31149 -16520 -123420 -275697 -312734 -188421 -126817 46806 156724
15609 156724 75214 231709 232230 114968 72464 96194 -36934 -209056 -238520 42730 129057
15598 129057 121013 129246 35522 -80047 -124662 -93807 -76550 -118249 -177541 -61614 46705
15587 46705 -45570 -207762 -228084 -117929 -144295 -244178 -212227 -186793 -71278 8092 -94986
15576 -94986 -242430 -159607 -48945 56667 91719 -4266 -15325 78647 74318 68092 40259
15565 40259 -59220 -196253 -190315 -166623 -128529 -6647 -12257 58370 114782 41550 143114
15554 143114 203647 177750 212859 175839 47513 -81641 60869 207492 149364 78686 117279
15543 117279 116326 -41776 50244 113088 51037 124051 267299 343006 418118 172741 90172
15532 90172 -31615 -119109 -183151 -208710 -25430 -100822 -25588 75075 167162 238122 281439
15521 281439 224412 128871 268686 264438 332117 305799 393152 258210 243097 139010 -144937
15510 -144937 -278883 -54203 124398 182963 187098 137036 98126 59349 8508 18119 -144975
15499 -144975 -86711 181585 243066 88336 -52961 -8695 22006 143995 233521 27767
15489 27767 -80397 -100246 89912 277772 268526 -16749 -189855 -141614 -64658 -30435 7367
15478 7367 -5394 -102627 -236279 -167504 -176400 -58025 175947 282137 147417 17890 72861
15467 72861 47221 -195770 -425076 -352981 -149085 -173287 -31042 113897 135235 -12026
15457 -12026 14158 -30442 5175 74453 -67842 51239 134774 192864 59094 -91414 -87732
15446 -87732 -143331 -183527 -125477 -75118 -95158 -214187 -192467 -105198 -132579 -199413 -61665
15435 -61665 118223 69327 -101591 -37310 75923 167144 90264 -40002 71045 12229 80110
15424 80110 182905 187406 116812 69735 34873 -65567 -189624 -121660 -46728 29301 65255
15413 65255 -42349 75378 140106 67613 -53120 76147 186262 -1923 -180254 -311266
15403 -311266 -454066 -373866 -294466 -296089 -244782 -100667 -210447 -200569 -165787 -157651 -266192
15392 -266192 -370387 -337500 -213183 -6797 64602 97565 56026 32808 -50405 82644 86572
15381 86572 -16510 -614 24789 -145809 -346516 -354393 -101771 197431 327387 274623 201864
15370 201864 184887 177401 29182 60957 70258 66408 130660 28232 -14093 185482 299979
15359 299979 118615 29075 222259 301170 119088 35738 -26674 -47354 -110718 -296001 -296176
15348 -296176 -191269 -50393 -78348 -83297 -60590 -11952 198119 211474 146872 91867 -14203
15337 -14203 6785 71194 212023 105309 57109 221439 410880 444067 202659 14432
15327 14432 163312 355623 271077 194246 279262 173385 82048 144787 139595 4263 -42969
15316 -42969 -47976 -218656 -268754 -50859 105794 -108688 -161695 -150080 -201519 -186739 -243021
15305 -243021 -233292 -203875 -156752 -36769 -25451 98988 167002 215169 322033 246398 -10245
15294 -10245 -47242 -98948 -167423 -126236 -160023 -56702 3739 -41494 -175720 -405009 -462160
15283 -462160 -533835 -472421 -377966 -142371 -77754 -9614 -14498 -51862 -22127 148151 270871
15272 270871 350911 224226 -3813 58318 6022 -68684 -84488 -314465 -527389 -439952 -277143
15261 -277143 -156980 -140855 -274149 -310073 -264973 -154523 -58716 -43411 96797 198991
15251 198991 170802 141833 97250 37417 -20849 -31146 -27561 22539 -213 -22400 -221240
15240 -221240 -335205 -447492 -360576 -112078 -45612 -102434 -56563 -45816 -168870 -349604
15230 -349604 -356766 -347512 -301352 -222288 -157537 -197231 -84473 47167 100137 -11887 -264637
15219 -264637 -161279 -74299 -29092 119469 56952 220113 232473 138143 26949 -153709
15209 -153709 -220320 -210176 -94364 -14173 114290 282788 210281 37587 -30188 -22900 -91195
15198 -91195 8247 -9185 -48037 -92772 -138269 -100353 9468 5100 21251 31829 33464 45278
15186 45278 -62774 -165787 46072 149379 32693 -29745 -51451 112727 -12361 -92210
15176 -92210 185195 244058 188755 254527 420606 362640 230178 -14945 -208889 -210052 -54419
15165 -54419 43875 174878 108402 -64925 -351045 -343175 -181384 -207664 -232845 -199415 -36303
15154 -36303 53087 -41802 96212 373712 383172 259992 111525 -115631 3869 -61492 -32364
15143 -32364 83031 52474 -55319 -81861 -26909 83720 49814 -67680 -219642 -198886 -107460
15132 -107460 -18734 -176295 -239121 -92574 -178979 -283981 -177728 -254085 -190066 -281083 -291577
15121 -291577 -310655 -161260 81277 315059 369742 237099 98695 -24458 -74030 -143223
15111 -143223 -79638 110436 16488 -68154 93615 45375 -17278 -104045 -76253 187674 133645
15100 133645 -50948 -350065 -365456 -138463 63987 -2837 -261783 -283817 -252238 -143731
15090 -143731 -145511 -252694 -224030 -257527 29433 184000 102376 4978 -107691 -88143 58785
15079 58785 -51697 -231011 -228635 80672 181244 90887 -49989 -35810 112674 -137613
15069 -137613 -174897 -52919 -164328 -89735 103665 224215 202738 241068 314244 339581 229470
15058 229470 -9117 -121522 -66595 17903 -100429 -264007 -297599 -354060 -163167 41251
15048 41251 -21853 17558 99296 100448 19007 -69404 -66564 407 42188 30701 -83174 -153415
15036 -153415 -108708 -92184 -49793 -98055 -110057 13720 100655 81391 54392 -36912 -58428
15025 -58428 45777 74022 122185 15835 -182026 -183706 -120880 -32282 111178 -80265 -243514
15014 -243514 -176046 -281832 -314440 -115831 -299513 -159236 -31409 -107973 -213542 -318296
15004 -318296 -261928 -70606 -34946 -23485 -33849 -67276 -114170 -186230 -417524 -481842 -412110
14993 -412110 -292886 -262197 -178283 -99359 -66604 -66171 77471 100807 163756 167354 229002 255398
14981 255398 129077 -81602 -126736 -196256 -55481 95826 276800 382150 313031 250802
14971 250802 113432 -40431 150709 250836 43442 -68256 -63648 -126675 -189280 -121343
14961 -121343 30393 -46247 -226768 -243762 -128616 13547 77573 -186 -135848 -249161
14951 -249161 -336222 -297349 -204972 -144886 -36870 43891 143085 96290 -101837 -224880 -245459
14940 -245459 -145531 -115742 -117482 -144410 -283292 -267235 -48423 102431 51818 -172888 -203489
14929 -203489 -111788 -33972 -132162 -96451 52013 -32253 -221934 -228020 136864 -23823 -268107
14918 -268107 -320950 -304354 -143886 -116491 26685 56169 -13508 -83286 -137497 -156383 -176714
14907 -176714 -119260 10750 61563 28038 -46297 29677 65727 121850 -14229 -91253 -127769
14896 -127769 -173328 -180790 -218712 -73898 -57188 -79290 115872 -35837 -168413 -276426 -308772
14885 -308772 -156194 -75595 62115 42666 -31432 11672 106866 39356 100455 -14695 -99043
14874 -99043 -197760 -71858 -21586 -53153 -13870 -123708 -95170 -157326 -174558 -213484 -261128
14863 -261128 -421231 -172052 -27736 87332 141989 192451 268635 25404 -192924 -232682
14853 -232682 -68844 -24851 -49190 -16805 65361 152917 12985 2010 -2845 85622 16467
14842 16467 -110261 -89924 -55751 66615 -656 -62974 154765 186223 -33047 -110276 -187754
14831 -187754 -347941 -324753 -72600 -53066 -107488 -77938 -16142 -91126 -208890 -135726 -124051
14820 -124051 -120571 -51764 85457 210239 226254 268313 201245 127627 196576 332937 292340
14809 292340 167281 182326 157215 161982 -2139 34740 110559 66441 195277 159410 32803
14798 32803 135751 183116 -13192 104433 161429 49510 -44098 31085 58039 150968 139327
14787 139327 12924 -12194 -33206 -49258 46976 170980 199915 118636 -37737 -10343 -174491
14776 -174491 -305504 -161327 61527 19375 133344 250894 256905 154958 147581 -96480
14766 -96480 -72712 -70780 19685 143129 97270 1738 -137629 -143778 -249755 -231450 -285506
14755 -285506 -242841 -265097 -24553 107461 -52238 -197160 -308309 -432186 -337054 -197605
14745 -197605 -56741 -17956 73231 79743 11621 8980 -110130 -107667 -150862 -213615 -61534
14734 -61534 113947 53859 -436 -16600 -121348 -281747 -321699 -204382 -316153 -227541 -25955
14723 -25955 3138 -75005 -92884 -8972 16654 -27860 185885 149531 -54197 -118159 -91754
14712 -91754 -88333 -158730 -158609 -147270 -317594 -277810 -106345 -78496 -71317 -173931 -53006 88406
14700 88406 212052 164421 137925 122025 152191 151726 154878 88674 -45890 -88607 -7577 71621
14688 71621 164917 206515 223060 174975 121967 -33141 -45281 -226791 -337196 -167285 -126605
14677 -126605 -182168 -64156 -68891 15104 38648 188949 261009 -13222 -279760 -271197 -12719
14666 -12719 106336 -21601 1475 122477 101514 120558 110105 6720 -82795 -258898 -272544
14655 -272544 -144159 74787 69713 82989 56974 203146 297569 282404 291510 190328 139670
14644 139670 129622 46676 -82379 -15409 -63092 -186618 -46364 10242 32984 14235 1729
14633 1729 -113385 -272839 -188117 -77245 9686 172624 76159 -147293 -237560 -119781 -52904
14622 -52904 10903 15202 123358 150904 21196 -114510 -151255 -27296 183175 246580 314128
14611 314128 176600 106381 163558 245534 353438 306694 174214 64665 -96637 -123043
14601 -123043 -63756 -150033 -206168 -315343 -221768 -40448 69085 105664 91314 22343 39207
14590 39207 101339 44261 90237 100056 64910 -57567 -20002 -47084 18517 148127 254234
14579 254234 146920 -111944 -202589 -191584 -329254 -321551 -236872 -264909 -272050 -202523 -237611
14568 -237611 -100847 79611 35327 81173 196366 232397 122073 -155758 -381777 -436971
14558 -436971 -350510 -248885 -221511 -65205 -10140 -45977 -31245 -12443 2678 -72865 -101487
14547 -101487 17280 119785 150290 246067 187622 76348 -44664 5251 -22568 -131791
14537 -131791 -106328 -88111 -260285 -284053 -190104 -92127 -115646 -269384 -441719 -459785 -431900
14526 -431900 -237949 -137907 23109 172124 144759 186306 108581 181252 299991 236636
14516 236636 36000 -29542 -110349 -102493 -243342 -424127 -488184 -563566 -502538 -477046 -259167
14505 -259167 -203274 -256777 -259063 -185693 23401 -25680 -35495 -201118 -271841 -267523 -217825 -205212
14493 -205212 -74855 31783 -107007 -186657 -116002 -175517 -167468 -146694 -62444 -90628 -68654
14482 -68654 161829 180559 146827 -37135 -86770 -132750 -276806 -196203 6142 71435 -200433
14471 -200433 -285913 -246017 -182581 -103001 -152782 26365 73616 202454 174087 247042 32343
14460 32343 -6940 62013 39456 98210 143554 148945 -41492 -130913 -42178 49732 18847 -148165
14448 -148165 -173298 12475 31177 -69139 -17558 112945 57472 187049 327504 263400
14438 263400 108354 -13924 -7345 -117112 -94920 11822 -127790 -286643 -152778 -47468
14428 -47468 -14594 84146 24713 -116592 10627 101226 97955 81331 116669 154333 145232 263125
14416 263125 246524 89980 203602 296315 135752 -8237 -122177 -165844 -150700 -110642
14406 -110642 -203551 -90900 284889 425167 232554 111091 175291 108235 -113585 -309565
14396 -309565 -377237 -229007 -188208 -155773 170784 259762 189372 134335 75514 88432 104771
14385 104771 55815 143790 209205 208390 263898 222455 212461 260727 165355 143967 205124 120810
14373 120810 -67871 -178634 -58267 106278 101447 91478 58941 -92771 -144460 -221198 -129419
14362 -129419 -30260 -74218 -134743 -43211 28034 -18957 -121553 -8887 88997 -47400 -141033
14351 -141033 -141562 -181406 -95666 244983 424755 456902 239674 188377 248447 188737 189958
14340 189958 89125 -36502 -88078 -134196 -211401 -157414 -166637 -42388 19389 -3621 -57316
14329 -57316 -251156 -340500 -264985 -92149 -64903 23243 -104930 -173475 -169218 -49843 -5229
14318 -5229 -9543 -367482 -413947 -350154 -304038 -135682 46778 120256 -34986 -162486 63708
14307 63708 264655 191226 -39436 -322972 -175169 16836 85232 22027 1286 41485 44753
14296 44753 110258 -24685 -4035 -20199 -116454 -196074 -86367 -114542 -19959 15330 19031
14285 19031 -69488 -33795 62174 -36204 -58553 21828 -58953 -121000 16304 111908 -29467
14274 -29467 -196574 -168087 -21185 152800 104607 54947 -34804 26375 59425 146818 101560
14263 101560 91344 112440 83217 202128 69255 -80017 -1826 -4829 -98463 -73803 8530
14252 8530 142132 176212 199539 261402 174697 -44690 -110606 -19598 -48388 -184567 -178297
14241 -178297 -134994 -49155 11251 212003 384353 252750 54618 12096 -1390 117043
14231 117043 120578 -92142 -205313 -270704 -142245 73034 151468 155751 197659 122226 -18703
14220 -18703 -35542 28001 -58914 -97969 4231 22750 102753 97987 35921 -60286 -176543
14209 -176543 17742 20514 161941 63882 -77832 -74961 -233822 -317342 -356962 -198886 -41077
14198 -41077 -22825 -222421 -167002 3982 51742 24949 -49159 -5062 -125778 44156 99399
14187 99399 129136 146827 175398 27141 -102947 -154088 -169746 -149771 -133098 132994 94444
14176 94444 15435 158067 184104 124576 108976 159072 75755 -167307 -100131 91717 260379
14165 260379 422803 445826 264780 272714 424844 510288 483890 270282 -2526 -101987 -81192
14154 -81192 -37438 -36560 51713 2017 36948 31304 -6541 -42123 37370 199707 257184 192082
14142 192082 108194 96808 173163 175620 -22571 -84788 -56630 41270 3949 40198 -28843
14131 -28843 -36078 43857 -2340 51328 3816 -79572 6304 -34826 -262739 -207639 -133730 -104920
14119 -104920 -71256 6907 -41295 -114492 -98029 -104284 -93114 -59240 89801 114261 271434
14108 271434 229859 5936 -8822 -57627 -20547 -18088 68160 203525 143485 34613 -36795
14097 -36795 97447 127558 21480 8451 -55140 -27136 -61537 -87319 -25549 -27687 -158721
14086 -158721 -88692 -107041 -138565 -235834 -26902 12056 54004 -4321 -46934 183967 218873
14075 218873 70619 13145 42037 79789 84720 51023 73051 216095 90916 4701 88639
14064 88639 472 51239 182369 376386 437446 207717 140493 -51811 67829 153683 -16513
14053 -16513 -131720 -328607 -312653 -79396 -5930 -17254 189626 237795 289155 270391 47078
14042 47078 -73406 -106211 -12640 -15253 98408 -20309 -9846 8638 4487 2244 95273 77567
14030 77567 -77048 -267241 -188883 -59378 -45761 -163407 -173895 75154 98296 -111462
14020 -111462 -183807 -165000 15674 56169 63487 -14702 -209706 -142338 31795 49010 109996
14009 109996 166928 -52313 -151237 -217970 -146461 -4195 67156 -145230 -180699 -55022 202877
13998 202877 189481 197831 289234 217700 69492 -59018 -26890 94390 56214 -102690 -240081
13987 -240081 -259464 -90406 -215379 -319345 -152263 -47853 -32837 64339 232141 273066
13977 273066 123376 51082 207875 130271 -77436 -186773 -81082 -132417 -48816 117197
13967 117197 168771 74908 -77156 -158411 -180147 -173822 -260223 -353827 -451363 -414359 -331536
13956 -331536 -354888 -197146 -48394 45312 -20636 -25298 6909 25453 -8883 -174338 -187662
13945 -187662 -34308 125728 169311 117197 79468 223768 236412 91527 41805 65865 77440
13934 77440 127889 -79232 -126795 -158850 -211564 -68878 -56145 -124327 -24958 81138 134670
13923 134670 330195 283574 128256 -129403 18206 150555 31480 -17047 26803 98558
13913 98558 129914 42601 128310 213368 139009 115775 18469 -23730 -90205 -83537 -150095 -188272
13901 -188272 -131392 -62980 -247275 -249251 -128663 150481 257169 319994 497049 347107
13891 347107 246200 179234 89969 30964 -121833 -78597 -229869 -212088 -249705 -242711 -332417
13880 -332417 -329029 -360233 -296732 -231483 -127833 -33780 128065 70281 -60346 -85100 -61071
13869 -61071 311 -62819 -161249 -64289 41808 -37824 -152509 -238085 -244352 -95672 -28616
13858 -28616 -114892 -151894 -352521 -281586 -32749 -96596 -14294 93930 -32856 -104801 -112296
13847 -112296 103324 196879 216943 127300 36327 -133305 -122839 -170832 -241998 -15830 68911
13836 68911 7581 -51008 62518 76061 -66593 -198592 -355188 -380498 -180120 -156581 -96607
13825 -96607 -169537 -243979 -171937 -32339 -28139 -125501 -254438 -260552 -165764 -88181 -227913
13814 -227913 -311274 -380134 -300998 -185389 -83375 4971 -154405 -239634 -143700 -111040 -106669
13803 -106669 -93004 -49502 42246 270407 300713 154913 83652 147705 85913 -117429 -202587
13792 -202587 -136765 -60588 11173 92694 208335 286391 215186 152914 -36612 -245349 -300848
13781 -300848 -202807 -65861 -3447 43773 48953 -103959 -104193 46906 204178 99287 -27173
13770 -27173 -69609 74138 18168 -70256 -27126 17322 132453 106793 143326 234473 233770 276882
13758 276882 234116 284636 256121 4663 -210548 -253240 -228462 -192338 -201053 -195531 -21672
13747 -21672 152226 311312 259309 117284 29118 -147277 -245198 -124072 -165482 -216166 -134560
13736 -134560 -209381 -257160 -286163 -239961 -115194 -82830 -193160 -120250 -133638 -70581 118902
13725 118902 34585 -26108 22858 74218 96454 32599 -94835 -222561 -252664 -268569 -333210
13714 -333210 -41584 105109 129805 84214 -18519 -125975 -131420 -60887 -20291 -92606 -270612
13703 -270612 -421413 -316830 -232021 -192566 -87131 -88736 166010 342153 336189 155503 138024
13692 138024 66479 48661 -18340 -102628 -17924 -19747 -132495 -3023 48116 279363 244461
13681 244461 121314 92769 -44684 -17774 -7938 -189567 -179185 -55647 -139878 -127420 -28971
13670 -28971 -84409 -131845 57655 327811 314277 319823 467645 346218 245122 92166 -41390
13659 -41390 167556 43152 38141 10207 -36161 -112787 -65914 88036 80655 90848 116513
13648 116513 12287 -155188 -269630 -225661 -116714 38551 145198 120534 42764 49313
13638 49313 75246 -6073 -130584 -159700 -333712 -319933 -233310 -123203 -85662 15796 -143910
13627 -143910 -254710 -209351 -264116 -329501 -248424 -165075 -139938 -58000 -109140 -220586 -193814
13616 -193814 -175766 -299157 -343092 -203757 -48340 82588 278140 254761 122199 96401
13606 96401 23235 -112409 -61088 -99115 -279286 -271303 -201006 -150884 -177210 -184262 -284819
13595 -284819 -609810 -572622 -297128 -186668 -127353 -94730 -23437 -42965 13101 30887 -182040
13584 -182040 -391128 -310839 -102775 -163713 -270700 -267945 -314892 -167248 -89282 -90616 -160015
13573 -160015 -113106 -44068 48337 99136 -3254 -120808 -32628 41894 15429 -40587 2968
13562 2968 -134607 -103932 -193106 -225589 -103975 30003 -2971 45713 94192 53189 40848
13551 40848 99631 257859 362951 297803 119313 -39905 -168186 -229786 -215722 -231167 -298422
13540 -298422 -272110 -215883 -51029 150082 72602 -179711 -287269 -53612 -113383 -203905
13530 -203905 -327801 -393346 -337489 -373703 -180142 -211219 21851 103615 -48849 -86126 78801
13519 78801 189809 68057 -61134 -132539 -38412 -142064 -14230 198995 162827 -9263
13509 -9263 110031 67253 160747 335874 68404 51482 106923 -110631 -185568 -234421 -202514
13498 -202514 -130317 -55449 -110512 -142072 17844 -74896 -86597 -128390 -185733 -243451 -241901
13487 -241901 -242467 -181251 -34078 -29981 -78318 -152298 -188653 -249791 -265091 -193623 -200907 -196594
13475 -196594 -237479 -231616 -177583 -299249 -191347 60377 184517 74116 15732 -135121
13465 -135121 -154991 -128248 -154498 -113059 -123870 -109420 -72440 -124453 -168003 -128830 -52032
13454 -52032 -78381 -50219 -113497 -164809 -148083 -50992 96049 117787 251312 211854 36200
13443 36200 -11102 165945 88689 104581 236748 268865 120765 -39703 -124646 -40421 -40245
13432 -40245 34946 189308 258725 354559 166605 65111 188131 78458 -124993 -196938
13422 -196938 -249916 -12358 118064 117424 -15453 -139843 -50208 54677 103105 248472 173673
13411 173673 115517 -163943 -326102 -246842 -185920 -208502 -164948 -95195 -43583 41632 -102716
13400 -102716 -271525 -179819 -47918 -57305 -113199 4231 -52535 57757 84144 120128 120143
13389 120143 80120 80218 -107349 -201680 -54839 -121219 -138520 -10712 -25986 -17751 123671
13378 123671 150498 66203 145526 290068 243990 137570 -52579 -110709 -103413 -256375 -76948
13367 -76948 80951 122358 -54497 -94410 -131455 -169988 -139740 -188854 -212337 -297586 -129512
13356 -129512 -82475 -73923 -49051 -36735 34519 -72647 24769 153014 129207 138745 150498
13345 150498 16175 -58939 53904 142785 14908 12369 -41311 -115116 -40456 -34630 -77070
13334 -77070 42877 13539 -36420 -1646 -29270 -248853 -319077 -339600 -388176 -214188 -167431
13323 -167431 -196616 -203218 -84420 -108991 -158200 -78298 -116216 -250280 -317625 -174459 -24391
13312 -24391 182494 185510 15897 -63917 -218288 -52715 86717 -201476 -334746 -236674
13302 -236674 27150 263382 191785 146256 196160 259746 196386 53679 -185020 -319030
13292 -319030 -340526 -218632 -254832 -147532 -97487 -18252 -27758 -14548 -51962 -37007 -53952
13281 -53952 -4839 3689 77008 13269 -43607 108654 -94619 -285356 -368051 -229585 -195913
13270 -195913 39282 100080 50187 54457 -31732 -65699 76799 56146 -106323 -60134 -91874
13259 -91874 -104556 11816 145218 110978 59243 41515 114569 100343 18612 -20063 88748
13248 88748 110996 33695 178031 209633 107286 -115939 -85997 -100564 -103589 47225 206631
13237 206631 321294 306032 163833 106627 284546 366264 299176 271442 104903 98850 -31210
13226 -31210 -147762 -12133 58653 236417 168465 78095 192212 337153 209847 109679
13216 109679 224272 246156 96313 -131805 -314116 -304129 -116206 -50129 -86471 -68066 -39841
13205 -39841 -70295 -56502 -115561 -157345 -141544 84810 80735 -12495 213599 312571 158993
13194 158993 29588 82645 86146 -36381 -23862 189878 355418 330724 60453 68372 126604
13183 126604 199835 168211 118710 -21755 -49844 -83861 -303083 -426926 -271384 -124634
13173 -124634 -87550 -67885 20831 37845 -64118 -140003 -347727 -347907 -226183 -114786 -106322
13162 -106322 -160171 -245972 -176701 -82938 43789 59006 -80694 -21224 -48032 -49305 113034
13151 113034 129959 -5064 -30542 518 89139 140285 287172 205679 27358 178173 187826
13140 187826 191803 75896 64815 191654 130486 45925 -72744 -206759 -225693 -240930 -201609
13129 -201609 -116418 -57116 -91344 -195397 -311179 -298571 -239133 -320196 -236138 -255961 -391119
13118 -391119 -312152 -109167 -73790 -95761 -162939 -211517 -89326 56281 53194 209406 262412
13107 262412 113434 64048 169908 53746 -91176 -20036 123971 147431 143928 273941
13097 273941 235882 107789 -661 61448 51200 95477 109617 -70818 -129756 -206284 -288214
13086 -288214 -120471 -5366 174269 388319 277634 294487 249716 178209 219196 227970 45308
13075 45308 -3520 -47380 -190106 -170717 -298291 -279320 -117305 75082 18458 106056 24801
13064 24801 7203 233937 410179 318318 175834 40849 -6096 -62262 -196806 -108394 -46529
13053 -46529 16066 59885 122712 146071 71892 -2747 -46705 -128728 -35577 39097 -77616
13042 -77616 -122516 401 136797 77889 75054 -6543 -107542 -149227 -299196 -343079 -206382
13031 -206382 567 -34733 -181300 -324784 -178166 -195212 -308916 -233278 -150554 -197171
13021 -197171 -231253 -115768 -78739 -22141 -88344 -139005 -23522 -62471 -66892 -97424 -31491
13010 -31491 -46405 -52119 -25667 -83758 -50342 -23781 -4479 20810 154451 332233 297484
12999 297484 290013 29588 -3875 21296 -21127 -64775 -34861 -89827 -51086 -24955 -89413
12988 -89413 -3586 93195 102153 72558 -30167 -44482 -34892 -175099 -84876 147561 302575
12977 302575 268521 197847 154499 99682 97397 154070 299629 328679 394119 289137 250299
12966 250299 54983 56723 102213 -83012 -139859 -176798 -96202 -175100 -280327 -201938 -7252
12955 -7252 33008 133028 107774 -87511 -78261 -221206 -124563 84983 604 -29171 31208
12944 31208 37909 -33175 -55748 2511 -133278 -83114 1857 -50863 -92996 76510 276967
12933 276967 217880 61364 -100310 48302 219095 64895 -120008 -110989 -32054 -51913
12923 -51913 22612 -19218 -107516 -31158 26838 7436 -144136 -272963 -86471 -36293 -8791
12912 -8791 40324 66538 163923 4315 -117008 -65372 -17197 150629 321804 342633 308512
12901 308512 284016 374045 142041 -89413 -27810 -143803 -128512 -193793 -208927 -113866 23407
12890 23407 138812 11161 -20482 -63065 -12334 -49069 -124387 -3839 42782 84109 34026
12879 34026 -86136 -197105 -297269 -113271 -65247 -16617 -26799 46938 146870 83809 236750
12868 236750 315653 243658 158023 112394 140855 32301 12422 108263 -113516 -109251 20191
12857 20191 51255 98434 201850 255453 333746 376259 562266 641691 408515 170195 27953
12846 27953 100624 45651 -30554 3967 106558 169155 137083 -78534 -144219 -82724 4301
12835 4301 56031 -47603 -199053 -125192 -59156 -39932 -19373 41433 -24347 37701 87235
12824 87235 13881 -39562 -96652 -25470 59752 -4263 -95169 -113985 -72058 -74824 -38996 55080
12812 55080 86764 156405 161989 179850 86162 37726 -105218 -38999 120422 115192 -39062
12801 -39062 -148981 -27632 27919 4314 -85676 -174318 33019 182275 228456 173589 98659
12790 98659 -103602 -180398 -68617 -64903 10479 77604 99477 132034 -37753 -291589 -242401
12779 -242401 -9342 -57462 -40221 46643 229971 363269 429516 298280 173578 272849
12769 272849 328443 327543 111731 -23996 131807 117416 126504 96807 -34048 18561 66356
12758 66356 147994 215208 105581 45490 102922 148310 241365 100333 -48790 -116544 -61614
12747 -61614 -35178 83187 68472 -49028 -109719 39835 172929 36194 -82469 -114229
12737 -114229 -159768 -156147 -179293 -153244 41308 -5234 -103006 -170026 -60221 108184 97175
12726 97175 240110 291992 300486 158252 105055 170089 141956 -13925 -176118 -122190 13270
12715 13270 145941 19041 165629 215669 114980 120935 187654 130526 -27716 -13026 112489
12704 112489 225951 160684 -11017 -79509 -115611 -128359 -15730 61974 38928 -125125 -193928
12693 -193928 -110965 -23989 68311 267048 266285 169686 147100 166149 -30927 -132119 23068
12682 23068 212401 168295 -51073 -182060 -112983 11346 -157606 -298165 -212649 -34025
12672 -34025 60133 -170157 -280523 -188501 -63330 107235 153657 194545 280609 244075 152075
12661 152075 14124 7927 172316 179307 76393 -98015 -150219 -335698 -314928 -155987 -45197
12650 -45197 71131 224494 432267 434799 261509 80551 67914 234524 301416 144400
12640 144400 120141 79618 -122488 -88893 139074 127080 20860 -24709 -49335 -48372 -6059
12629 -6059 14416 -36073 -70001 11512 185755 25250 -5959 -97983 73734 296708 351508
12618 351508 296006 209907 197942 123297 71617 28983 48674 113877 111718 3855 -134684
12607 -134684 -112239 -49664 -40300 -37644 23760 143598 224837 191446 199975 154710 104951 28655
12595 28655 84990 20388 -155918 -154552 -173069 -243191 -146125 -172044 -138821 -149143 -178135 -177931
12583 -177931 -43918 247546 256225 36213 -102933 -50416 109820 223584 32742 -78616
12573 -78616 82059 216476 209432 190095 66875 59323 155924 138049 80546 226613 116987
12562 116987 -44284 -144888 -157527 -36436 -24431 -8384 -199761 -191075 -147800 35687 102183
12551 102183 4064 98416 161301 121317 71728 73201 60281 110357 -3379 -18227 60965
12540 60965 171865 321390 169131 57581 15326 -118363 -198528 -264337 -132826 -55318
12530 -55318 -60852 -68200 -80331 -138040 -114883 -13911 -101559 -315270 -348553 20287 152668
12519 152668 68691 96252 66451 143686 227952 194148 215722 96788 40403 -34412 -49991
12508 -49991 -33445 -106841 -279585 -247835 -177278 -142647 -61928 35483 128584 131932 -31427
12497 -31427 -93040 13870 77262 82735 71298 96972 86518 76714 23186 45292 10956 21335
12485 21335 -56446 -101752 -194992 -360047 -235669 -344629 -371178 -235555 -157130 -58094 121315
12474 121315 184926 112069 139169 89678 57400 89608 -165409 -259005 -122749 -92510 -307918
12463 -307918 -371947 -336019 -263507 -242009 -303452 -105536 157335 150500 -101125 -279157 -225479
12452 -225479 -138946 27798 241275 236477 305998 253895 277893 188350 36714 -35068 12932
12441 12932 120730 220773 506718 502161 267285 157841 114990 -12777 -62519 89363
12431 89363 135292 85997 33843 28716 -114803 -97267 63439 82299 326966 467333 323288
12420 323288 269631 188588 97601 107760 257481 342499 253418 125259 21683 56580 41350
12409 41350 -93300 -125757 -244178 -401684 -269663 -64843 67418 34834 -49741 -196439
12399 -196439 -408840 -484704 -417713 -224260 -214955 -140614 -27109 -10119 6620 62329 6803
12388 6803 17315 -30642 36991 63387 -54218 -101307 -199325 -279678 -115372 89167 125813
12377 125813 15416 -82087 23508 147459 84713 192683 31514 -3255 33656 84005
12367 84005 120330 87773 184897 196200 187961 270648 225891 201065 189853 121495 10104 -115564
12355 -115564 -246535 -335128 -318061 -313655 -141262 14645 165612 175459 274726 294560 191250
12344 191250 154562 179326 172680 246384 196853 187811 177671 68429 32568 58884 24692 -212827
12332 -212827 -105015 152394 260192 150325 -87677 -63354 76096 111806 258322 127398
12322 127398 -43908 -86113 -95243 -109987 -7900 43676 239673 325012 179420 275004 388393
12311 388393 359188 211553 8349 -67939 -13677 55383 101959 113368 78691 174697 121485
12300 121485 -12750 -119626 -47195 95431 -34151 -62539 3152 102543 181456 58002
12290 58002 13953 290526 428631 322243 100265 -54595 -54772 -15385 132081 3737 -100764
12279 -100764 -120927 -258218 -282331 -227379 -56038 186505 236002 332770 215308 295648 221298
12268 221298 280653 450065 466215 391952 409686 339680 316207 309864 199861 149642 162976
12257 162976 305671 282830 242872 175537 146733 246102 115015 52049 235748 296494 213692
12246 213692 136649 57997 -1056 74684 180689 138229 98398 -6227 -96763 6403 -48876
12235 -48876 5764 31845 179659 252438 207368 201764 214420 300558 432587 263043 113458
12224 113458 87236 59363 38515 306689 374901 268979 430004 376893 455407 600547 537659
12213 537659 415660 195428 42107 -107104 -132105 -38498 127709 328812 315554 372561
12203 372561 403228 314980 431368 477823 478630 533323 558824 531798 474978 355518 322144
12192 322144 307257 259961 474451 616905 629274 578129 477863 464656 474238 412834 432573
12181 432573 536066 565141 608639 617436 617761 577386 699941 671229 808798 735291 752846
12170 752846 711160 666152 636756 738948 640681 639479 627059 665527 680932 633882 527869
12159 527869 478072 507208 565962 452260 413063 384804 429461 387744 589917 628482 535178
12148 535178 548668 726494 783638 850211 791252 703964 746008 882301 1116574 1040008 896733
12137 896733 851263 642934 475456 475417 485067 442998 507087 736562 839468 884888 752870
12126 752870 749636 834246 814876 714049 773182 673632 701175 687668 698181 797335 775317
12115 775317 714702 680243 683233 725570 797694 758562 814176 855663 890096 1023732 1223596
12104 1223596 1265483 1097510 893081 783917 837065 814233 775620 876743 946120 1046375
12094 1046375 1221408 1148499 991142 999667 1119248 1122342 1056139 1046016 1039705 1207875 1338989
12083 1338989 1236317 1094635 1039282 1015220 989549 943101 1013168 1180247 1308270 1279085
12073 1279085 1229430 1355785 1482086 1581281 1706776 1830290 1879548 1843032 1862090 1829722
12063 1829722 1749941 1640569 1709942 1694444 1688041 1892167 2014150 1932615 1871505 1809781 1728665
12052 1728665 1907268 2070945 2069716 1957804 2012847 2212067 2066162 2236478 2345580 2545248
12042 2545248 2474875 2516304 2657320 2525529 2343923 2336928 2299620 2278403 2294023 2467655 2425408
12031 2425408 2389372 2711937 2727147 2799182 2930506 3092771 2966280 3002583 2999297 3158837
12021 3158837 3287636 3256726 3350420 3491518 3526277 3581202 3795390 4031491 4042116 3902584
12011 3902584 3912283 4011666 4218443 4484139 4473904 4579013 4742124 4895330 4928826 4999178
12001 4999178 5251082 5490703 5669285 5786911 5915570 6187805 6423555 6502879 6691104 6796925
11991 6796925 7055588 7167931 7313216 7505650 7753013 8021767 8260592 8429197 8837176
11982 8837176 9064750 9180217 9396866 9846569 10213490 10609586 11095366 11564683 11898261
11973 11898261 12251576 12753019 13080820 13315733 13685181 14314875 14862606 15478494 15934017
11964 15934017 16641313 17397666 18064951 18829797 19679803 20594927 21286047 22074969 23003382
11955 23003382 23911198 24966635 25951422 27035116 28192098 29257694 30627423 31979893
11947 31979893 33304201 34649874 36106941 37644597 39064829 40568946 41956603 43232555
11939 43232555 44573970 45813536 47094440 48551275 49901539 51015280 51857623 52794161
11931 52794161 53697610 54242256 54662068 55120645 55170215 55203152 55142858 54669282 54025329 53435647
11921 53435647 52752202 51911495 50866489 49912558 48855456 47508122 46260592 45038798
11913 45038798 43771487 42498100 41157621 39920053 38741539 37480996 36359427 35208413
11905 35208413 34106045 33091296 32173030 31063949 30019866 29056599 28187956 27277989 26375761
11896 26375761 25539998 24599961 23751687 23044913 22245745 21571332 20973783 20438995 19819332
11887 19819332 19115162 18528425 17903076 17366834 17135423 16593255 15983769 15704635 15288734
11878 15288734 14637209 14107910 13940733 13648368 13279167 12999865 12722032 12404141 12041811
11869 12041811 11778102 11533591 11203907 10726269 10366549 10178487 9982972 9720734 9494854
11860 9494854 9175978 8973677 8786713 8637181 8357876 8201207 8081105 7862975 7621320
11851 7621320 7502379 7263489 7049237 6975511 6909052 6718645 6475370 6291354 6240491 6129338
11841 6129338 5837230 5835532 5793007 5546625 5527709 5424010 5347185 5098546 4985685 5009795
11831 5009795 4860647 4750118 4777371 4809938 4646909 4528148 4533995 4462531 4308384 4250578
11821 4250578 4228235 4082244 4011691 3925911 3737809 3680397 3666555 3610055 3499746 3416781 3337227
11810 3337227 3240545 3084067 3008499 3092419 2931098 2718668 2711997 2817052 2934301 2958217
11800 2958217 2799691 2730566 2933973 2950387 2699126 2818441 2849550 2768495 2711539 2607596
11790 2607596 2643795 2509874 2438317 2325525 2389363 2397971 2472214 2368016 2256645 2138015
11780 2138015 1956682 1956735 1998420 1868290 1655987 1716651 1938894 1984047 1792836 1505332 1610835
11769 1610835 1840159 1981968 1801748 1574511 1643936 1715507 1789217 1809405 1834077 1845580
11759 1845580 1952261 1904628 1828259 1817326 1735253 1711892 1686698 1544648 1348357 1290070 1334086
11748 1334086 1384137 1360104 1388914 1425048 1330894 1260222 1328245 1327068 1254547 1196317 1223080
11737 1223080 1253005 1317094 1237747 1208383 1355560 1494664 1391998 1166699 1026223 1197449
11727 1197449 1343546 1368195 1305047 1209888 1105866 1043320 844010 828687 953645 1092372
11717 1092372 1102623 1250601 1222249 947995 795743 835536 927006 1160700 1346211 1244056
11707 1244056 1157528 1098017 1119627 1043594 973137 853471 710622 766630 790019 832635 717276
11696 717276 900794 1056000 838056 640164 687015 688767 532237 533007 655380 743299 740090
11685 740090 866882 921432 1024778 1099589 978238 935410 834278 710193 722010 748094
11675 748094 763726 780364 590811 547730 569913 663181 633610 584781 606276 595872 527784
11664 527784 582843 660215 539070 614046 607889 536955 460241 380151 468784 469370 551460 567297
11652 567297 550374 628277 607008 430927 398167 454515 497264 560010 541292 743900 684385
11641 684385 561214 427137 346380 405638 394555 334699 260586 348934 554022 754112 908339
11630 908339 860309 587061 488586 621813 677789 625640 715650 632732 424486 341580 422895
11619 422895 622090 806075 679783 595242 428832 434029 473544 265591 81887 66520
11609 66520 125961 368367 328416 340869 159162 168261 171759 32160 106729 191969 381716
11598 381716 527917 484476 382173 234693 363496 370067 444093 358167 207066 264492 329960
11587 329960 325825 235285 451855 649282 474058 158848 159517 287110 322487 487784 418868
11576 418868 285215 183801 191745 219298 71399 90360 116587 -406 -118007 3163
11566 3163 189733 323090 351152 286811 335300 338504 378060 523434 633798 674768 532793
11555 532793 366474 229041 223350 142729 265705 339120 400304 309379 274213 183688 210976
11544 210976 371020 244615 261601 154363 139148 176337 326676 457545 399464 277419
11534 277419 215129 245674 281191 238383 136685 149073 130604 171645 137010 69834 144903
11523 144903 235144 192626 170419 434249 588952 455862 317980 159853 260464 372467
11513 372467 368266 515563 378223 204868 273997 318730 156088 57202 223623 366422
11503 366422 384108 425415 348763 177759 37067 -17265 -12370 10647 60912 -15089 -61558
11492 -61558 42309 -42152 -22812 50303 225373 257262 277836 382798 184553 94879 91653
11481 91653 12675 944 37722 26114 -83317 -113045 -155597 -191569 63595 387083 423869
11470 423869 233934 87677 162900 151731 -20133 -121209 -14528 -53703 -8439 10436
11460 10436 -57081 118882 265540 320108 290631 319387 211185 206472 120683 58220 8971
11449 8971 -8861 -29599 83198 296674 288558 5057 -72436 -190938 -202260 8414 76525
11438 76525 85672 -79630 -46304 64185 113412 75136 180317 101446 222095 305996 52529
11427 52529 24131 -22270 116755 264313 352585 314306 421578 511691 341091 314864 236871
11416 236871 124637 4387 109300 258826 316112 273635 172991 93351 105096 85920
11406 85920 164680 221454 65135 -25701 51841 121644 -101957 -185707 -208810 -129209 -28895
11395 -28895 64857 99616 79128 144820 108193 26728 135804 24498 -150115 -221707 -264208
11384 -264208 46033 250853 297737 334284 233607 200491 246155 81210 -75451 67848
11374 67848 5530 88419 184046 212639 118281 -14088 -65050 -231616 -258963 -186170 -57719
11363 -57719 45843 16702 6663 77939 64327 134567 -23984 65637 203425 268017 47038
11352 47038 -32097 9315 -78044 -55645 29370 9695 103394 95068 65686 -20088 -30908 -84735
11340 -84735 -82331 -141582 -95041 -206514 -228209 -38250 64626 227776 114533 23395 -16101
11329 -16101 86071 57000 6332 -78589 12925 80044 -92933 -50269 -1671 19941 -42918
11318 -42918 -118477 -31897 18354 -136977 -152405 -27709 136479 151927 128376 32378 99674
11307 99674 161274 130437 213066 258892 265640 138945 83212 194105 125618 69760 113796
11296 113796 70640 41235 69315 58855 50744 98793 -25372 -75533 -18715 -32497 -65428
11285 -65428 -8646 56481 -41132 -84266 -42406 -118034 -103620 -13377 1484 -22222 -78577 -194939
11273 -194939 -295698 -298751 -286138 -156789 -184111 -118700 -220116 -318822 -257909 -236591 38628
11262 38628 133067 -50038 -50862 18504 -44772 -68787 -20144 84097 33218 -56373 967 50134
11250 50134 270670 328483 266673 215545 56698 74927 133034 -21660 -14720 124089 144396
11239 144396 203047 152558 -19338 -51508 -22542 -66181 -166610 -126225 -281689 -107421 76810
11228 76810 168611 96755 124205 220115 161166 113332 22043 12096 -42245 -95417 -141655 -107032
11216 -107032 -47452 100407 247511 188390 334412 540398 592717 637151 835313 1032374
11206 1032374 1612106 2470254 3193825 3594050 3787216 3794364 3883184 3899330 3648294 3139315
11196 3139315 2796932 2277712 1627442 949984 697778 424592 248696 266695 359843 415284
11186 415284 348761 284843 164694 84041 169886 314695 431864 245720 -99264 -57261
11176 -57261 246179 285661 192196 76268 93833 236555 390607 214512 33587 8726
11166 8726 -11442 177451 309161 324545 180279 -18069 -127191 -109845 10632 -83622 -57113
11155 -57113 10842 7378 14461 -86958 5910 209242 269427 191203 -10932 -131590 -110649
11144 -110649 -87877 -22189 -86670 -49657 -1707 43787 10088 -137751 -268786 -138279 26083
11133 26083 123501 249902 225197 182048 73097 -24184 -55509 25439 61694 101856 99320
11122 99320 216836 210380 158186 70698 -85791 -206046 -75224 125489 150407 114726 -6304
11111 -6304 -125164 -250305 -268502 -177877 -102635 17713 183978 128087 -128101 -229116 -317011
11100 -317011 -365359 -341442 -161099 11493 157690 19328 -49395 -104636 -83771 88477
11090 88477 118439 39599 -226566 -221107 -152425 -104523 -98217 71814 51416 162615 284847
11079 284847 351631 351894 288695 425739 310170 92468 6718 18930 -14638 -78133 -72780
11068 -72780 726 -14502 57731 101259 51283 56867 175384 280034 237621 217166 277479
11057 277479 370524 402687 342584 499133 698804 601142 446006 405106 547510 551075 442685
11046 442685 446145 370867 457587 516296 451783 532592 583093 652796 746623 711004 691614 813673
11034 813673 813399 899845 988567 914984 831319 717362 817351 855388 1103095 1292536 1106831
11023 1106831 1009007 1058580 1135564 1273636 1200597 1022801 842835 610269 531214 694689
11013 694689 782422 757832 700732 643924 615223 585058 714440 746367 784718 760067 695830
11002 695830 620069 579862 489653 483025 435303 465663 429486 443195 363459 77466 -32672
10991 -32672 7017 180452 389074 439926 392698 143312 58744 116522 168519 201901 342503
10980 342503 370737 396432 242179 335932 395525 81177 65472 90595 191510 296950 291887
10969 291887 205335 187975 273158 264968 217676 127464 48451 -3533 21193 54619 80300 248985
10957 248985 570794 869694 1071612 1275989 1637856 2019438 2459495 2908455 3289999 3664558
10947 3664558 3944992 3865036 3469012 3019225 2601780 2304139 1755990 1135582 863622 798071
10937 798071 581921 443738 271715 188140 271329 312466 272172 292256 333343 267290 148060
10926 148060 80029 201889 139409 56296 164253 143372 109582 50988 -59713 -20223 270584
10915 270584 186607 100178 19674 -149556 -29551 258459 387873 359784 273897 252255 298889
10904 298889 307156 67367 -17650 -20725 59740 127753 165798 40524 -167960 -193584 -191006
10893 -191006 -258491 -235125 -112821 -93809 -243101 -304028 -318439 -285782 -151685 -90752 -77112
10882 -77112 -52832 -29990 -16535 18511 -236786 -410557 -249692 -172320 -126380 -257016 -156725
10871 -156725 50014 77783 121986 140610 47632 73686 -35986 -130363 -187604 -29694 128051
10860 128051 171640 76789 2420 66667 136468 263819 360821 375115 375638 302977 163847
10849 163847 91273 -50599 -58864 -75852 -47536 -68951 7648 -101491 -166294 -143620 -94863
10838 -94863 -80098 -41470 -55254 77882 -19815 -40332 -122036 -168088 28896 77832 -209115
10827 -209115 -301477 -379177 -328110 -208877 -40190 85900 5806 45517 51658 83706 186527
10816 186527 144512 196113 141337 78399 71669 -2393 -3626 -59113 -75367 -84404 -140115 -231535
10804 -231535 -182030 -54698 36735 -96328 -133958 -139254 -322965 -410472 -408628 -406999 -320786
10793 -320786 -217695 -270772 -430282 -387520 -270525 -306253 -363437 -379751 -377513 -180553 -216658
10782 -216658 -298677 -417745 -368163 -132993 -212013 -439913 -478698 -400813 -298582 -172775
10772 -172775 -86138 -19474 6879 -72902 -47372 -36937 75444 30576 33794 132748 229729
10761 229729 181766 -18879 -189846 -204216 -196949 -301218 -405721 -412283 -261283 -135878 -32908
10750 -32908 132508 36749 -18578 74414 86685 105939 8424 -59981 -2108 12073 -5260
10739 -5260 86235 259701 222729 425455 344458 71052 80655 71850 195218 140889 9453
10728 9453 -23601 246530 261061 178668 123468 188677 168166 142859 147697 249388 333571 375713
10716 375713 447020 456932 404370 581839 521318 352451 349023 306110 265610 190699 186510 201599
10704 201599 311772 440051 492147 413723 569990 583214 501352 463731 466525 366632 341340
10693 341340 258936 199360 173067 206610 165508 140827 129303 156555 257234 333059 333533 290669
10681 290669 278015 283847 284009 275358 219437 229842 251390 316669 481075 483621 523998 394413
10669 394413 323013 372147 349973 411983 497023 568157 526587 519387 562319 752754 1091971
10658 1091971 1285827 1428439 1736886 1820719 1672177 1500867 1523407 1711000 1586363 1463918
10648 1463918 1509530 1542636 1608821 1546144 1549558 1702406 1786528 1975302 2140041 2462328 2770045
10637 2770045 3218812 3736751 4163484 4603112 5006757 5392702 6016845 6772008 7616052
10628 7616052 8830531 10173426 11870161 14208328 17382828 21603972 26981441 33570612
10620 33570612 40570376 47301616 53055027 57869477 62268476 66325817 70685734 74882847
10612 74882847 78749968 83393743 90277129 99833122 110830152 120882915 128643994 134484660
10604 134484660 139168700 143728425 148180478 151265069 152419415 153364904 157368369 165670130
10596 165670130 176329701 185636039 191594695 194799984 196307595 197275703 196991387 193078020
10588 193078020 184264668 173500422 165615420 162276582 161880850 161711744 160115044 157579304
10580 157579304 154549190 151172192 146820307 139816897 129667283 118413039 108914500 102271624
10572 102271624 97794462 94216919 90589069 86927311 83039928 78828267 74137547 68379679
10564 68379679 61309581 53532951 46372775 40822837 36405165 33015789 30294359 28077374
10556 28077374 26278955 24730767 23498628 22353666 21242061 20365071 19601670 18880400
10548 18880400 18181793 17343294 16738448 16039747 15324002 14821516 14304577 14006493 13602546
10539 13602546 13151691 12717626 12198522 11704232 11324357 11050126 10735164 10185817 9862837
10530 9862837 9779273 9471311 9061424 8766435 8505165 8237515 8038220 7950995 7852578 7580556
10520 7580556 7292579 7042880 6787334 6657852 6533453 6508063 6305937 6082868 5945812 5836604
10510 5836604 5735947 5632643 5586260 5452184 5349992 5141676 4829849 4651514 4654192 4694999
10500 4694999 4566386 4447231 4313931 3958353 3827015 3897291 3850640 3922322 3840658 3656511
10490 3656511 3523976 3498377 3532616 3489521 3453370 3166106 2910905 2822962 2873043 2989547
10480 2989547 3216406 3131291 2954625 2857611 2865172 2981113 2959614 2668704 2622580 2683486 2695860
10469 2695860 2530676 2506380 2493252 2380336 2278361 2290875 2187070 2200642 2278602 2189609
10459 2189609 2118945 2004907 1950356 1917379 1800278 1715759 1667919 1468621 1677450 1745991
10449 1745991 1707682 1525839 1363838 1498953 1701638 1775878 1815770 1687982 1465920 1299409
10439 1299409 1182694 1091002 1164132 1132254 1268708 1262998 1059210 962895 1117139 1200908 1299892
10428 1299892 1208096 1291802 1318916 1292146 1112671 1056011 1083028 1032491 1010320 951864 1193447
10417 1193447 1336377 1076930 873536 959792 1005627 948881 757702 664684 578762 721929
10407 721929 863014 932076 918444 786192 676382 613072 660157 679508 789205 752323 745059
10396 745059 914853 839201 611257 461770 520878 618530 424484 300526 387293 465612
10386 465612 492003 365354 347193 311480 337958 473688 459236 314781 168845 226080 258481
10375 258481 184365 307810 451381 449531 588147 771583 551587 393962 236258 114704
10365 114704 144699 228579 237498 181997 112365 220101 444916 394160 440217 542290 570073
10354 570073 565583 553491 599211 610773 593126 595622 634514 632449 621711 597899 614208 608337
10342 608337 609506 599921 554082 400726 353839 206745 242686 311834 423716 566688 484274
10331 484274 449605 460686 394225 355403 307980 327560 361893 169173 81106 63171 160868
10320 160868 182398 156744 246620 175877 258326 380156 583998 646615 544622 560330 405358
10309 405358 337222 341607 275342 210958 177384 164844 201276 346031 350082 303873 259089 285715
10297 285715 494625 447155 330878 274869 266999 103848 -60849 -84586 -102180 18724 81580
10286 81580 107115 8893 48368 25711 139717 255541 218176 94535 -27031 -107221 -21173
10275 -21173 -24723 36312 176139 150763 116693 25027 81136 92701 67592 64061 138568 186079
10263 186079 240757 269289 269863 141549 65013 222805 294461 125754 201421 192150 -6753
10252 -6753 38710 276357 264347 201424 161587 140149 253723 263616 224585 153595 210015 209260
10240 209260 123984 59220 30799 -95004 -4255 101773 11236 -144354 -254289 -67325
10230 -67325 115019 286398 149111 -100418 -145004 -286794 -265930 -173790 -116553 -121225 -61485
10219 -61485 10174 276380 275942 167867 105264 110565 36336 -63601 -53676 -57452 -109787 -62272
10207 -62272 -21980 -59961 -58494 100649 182475 152656 94484 142249 213776 345473 320042
10196 320042 277852 255661 142757 191036 181092 259319 165075 138676 209436 310491 251487
10185 251487 299524 451104 577211 553722 608308 606800 614998 611538 625923 418882 365409
10174 365409 457167 634382 800019 775039 986033 1024192 1192176 1250589 1133510 1097464
10164 1097464 1023958 1100453 1044216 1066359 1377237 1484077 1482110 1552101 1560194 1544017 1422525
10153 1422525 1391506 1438518 1435894 1345194 1050335 1136673 1160493 1172303 1241580 1182135 1191336
10142 1191336 1038955 809789 642306 617204 513749 565394 666352 555438 341378 293287
10132 293287 491446 659941 644592 565770 350876 404393 455385 455705 462751 457770 495319 550566
10120 550566 575962 610587 488053 129635 28212 3062 -14451 55799 85588 55535 17350
10109 17350 36349 38782 -96889 -96070 -119275 -148709 -94987 -65436 176421 208950 233194 424964
10097 424964 305172 186464 193417 183150 336341 296657 188607 231673 262564 344117 98306
10086 98306 43740 -16072 -12190 19760 -67651 63141 178380 213598 264092 236392 293715
10075 293715 332054 279649 308104 341222 392683 182479 48079 92560 181037 124726 44265
10064 44265 34677 10653 -40497 -67159 -112981 -79411 65665 248974 207742 49020 -51359
10053 -51359 -58411 162225 51434 -159545 -24806 72210 8007 -103804 -207540 -9742
10043 -9742 145349 8073 -45814 -93047 -140521 59226 210712 241211 312010 296778 152240
10032 152240 -63732 -155556 -93046 -80255 12477 158914 176408 96663 26497 122257 371267
10021 371267 422798 368231 323813 137234 -31719 -124636 -182961 -63449 137207 103561 262071
10010 262071 223707 -124334 -107936 -83315 -4669 -19023 -35159 -36839 -62889 -2569 55066
9999 55066 379467 303325 117294 173048 130191 145927 234913 234161 231369 262921 226676 -25544
9987 -25544 -42182 135610 32721 86051 177474 90605 -64382 3616 102721 -23134 -41719
9976 -41719 -51589 -43621 99233 125193 81974 6640 -96522 -374707 -316333 -25637 141219
9965 141219 112159 -38636 -251816 -155911 215650 174742 25559 231648 217018 141162 107659
9954 107659 299681 303370 268180 175882 -4939 -19962 203604 298232 112214 139285 142032
9943 142032 187575 227065 210786 254158 297032 296442 302084 322390 418050 181900 28593 -5377
9931 -5377 91262 223787 224339 184787 211352 200355 211964 63094 88081 227345 185695 85719
9919 85719 237038 331947 442218 476324 314218 200330 155436 138725 121998 113042 159896
9908 159896 208449 255663 118846 85125 -13310 -24855 -86015 -7428 80913 22145 -150367
9897 -150367 -24902 190269 122898 12893 7298 85205 110086 211446 214238 -40961 -233773
9886 -233773 -57383 64372 -66726 -63660 132171 219597 130100 96715 134169 213383 235696
9875 235696 112534 162702 -33503 -44623 24958 37133 -53245 -78348 -108798 44234 166666
9864 166666 168695 112808 123696 1509 -199453 -234030 -289571 -91913 -3500 147004 356710
9853 356710 381834 285007 162121 193818 181664 375441 224501 -32006 -147708 179426
9843 179426 233798 108405 -4349 -67352 -122625 -166152 -47140 35317 -27351 -13697 -37365
9832 -37365 6274 141592 169827 128477 -95329 -109752 -6490 -16658 -189642 -66407 3246
9821 3246 -18 -28750 38927 -110320 -179419 -94543 41396 76769 25953 -88518 -43568 79609
9809 79609 12115 -144954 -118030 -165096 -49781 26109 -74287 -113722 -50994 42285 61851
9798 61851 66794 172110 115808 -2259 -182850 -78413 162819 264604 218861 91990 58251
9787 58251 157990 100610 -87330 -157978 -91353 67844 141133 38628 -99147 -108023 -29009
9776 -29009 -93092 -110168 -13406 97882 108705 145094 115234 78285 48466 196683 134784
9765 134784 152092 248118 233433 141615 -4659 175760 261670 254826 242699 296556 218580
9754 218580 90243 82836 118401 315616 369384 306298 152840 100004 48632 77136 110319
9743 110319 176272 39390 -26366 -86015 -103320 -239879 -311231 -177920 -156025 -257140 -151078
9732 -151078 -108508 -122163 10574 106491 -18601 -70735 -129342 94862 158893 -49749 -83188
9721 -83188 -38121 -136991 -104240 -105374 -70638 33217 -82621 -42361 178913 181535 97256 12881
9709 12881 -60130 -68907 -193456 -131926 -96636 -48867 81689 112057 -64176 54751 192030
9698 192030 227223 200643 68060 70657 144256 136454 -52569 -128365 -16130 33413 -47155
9687 -47155 26595 45844 -48358 -93786 -63673 -38789 -167163 -175297 -46062 107098 95363
9676 95363 157221 289728 280371 62083 13343 -18779 -48587 -163038 -218079 -190223 -119750
9665 -119750 -179956 -94988 -197695 -97463 28731 172505 204604 285441 422060 387776 307081
9654 307081 232223 358876 454828 556509 592846 466538 615591 616085 404007 238009 34459
9643 34459 24122 205589 236923 135877 -15253 -33103 114957 268386 2552 21849 134156
9632 134156 268676 389981 293998 250013 255474 84160 55463 23960 -40496 -45783 -22540
9621 -22540 -165186 -175312 84017 202954 2887 -41805 -115935 -70788 -55136 12926 5362
9610 5362 -51452 -75737 -84185 -108219 -226950 -229594 -5047 -93743 -122953 63092 146461 -59944
$$ [...]
##END NTUPLES=NMR SPECTRUM
##END=
