##TITLE=Analysis number 318809
Compound Code cc 14510
Project Code adrs
Chemist Name ugmt
##JCAMPDX= 6.0         $$ Bruker NMR JCAMP-DX V2.0
##DATA TYPE= NMR SPECTRUM
##DATA CLASS= NTUPLES
##ORIGIN= Bruker BioSpin GmbH
##OWNER= nmr
$$ XWIN-NMR		Version 3.5
$$ Tue Apr 18 15:11:43 2006 GMT Daylight Time (UT+1h)  MAYBRIDGE\nmr@NMR_250MHZ
##.OBSERVE FREQUENCY= 250.131544655141
##.OBSERVE NUCLEUS= ^1H
##.ACQUISITION MODE= SIMULTANEOUS (DQD)
##.ACQUISITION SCHEME= undefined
##.AVERAGES= 16
##.DIGITISER RES= 18
##SPECTROMETER/DATA SYSTEM= dpx250
##.PULSE SEQUENCE= zg30
##.SOLVENT NAME= CDCl3
##.SHIFT REFERENCE= (INTERNAL, CDCl3, 0, 16.4495)
##AUDIT TRAIL= $$ (NUMBER, WHEN, WHO, WHERE, WHAT)
$$ ##TITLE= Audit trail, XWIN-NMR		Version 3.5
$$ ##JCAMPDX= 5.01
$$ ##ORIGIN= Bruker BioSpin GmbH
$$ ##OWNER= nmr
$$ C:\u/data/dgb/nmr/ADRS/2740/pdata/1/auditp.txt
$$ ##AUDIT TRAIL=  $$ (NUMBER, WHEN, WHO, WHERE, WHAT)
(   1,<2006-04-18 15:11:07.30 +100>,<MAYBRIDGE\nmr>,<NMR_250MHZ>,
      <created by zg, POWCHK disabled, PULCHK disabled
       configuration hash MD5:
       84 BC 41 DB A1 6E 1D 46 DA 25 12 A5 C1 ED C5 3A
       data hash MD5: 64K
       9A AD 66 D7 12 10 8A DA E3 D8 53 E8 86 45 8D 71>)
(   2,<2006-04-18 15:11:23.00 +100>,<MAYBRIDGE\nmr>,<NMR_250MHZ>,
      <Start of raw data processing
       ef LB = 0.3 FT_mod = 6 PKNL = 1 SI = 32K 
       data hash MD5: 32K
       96 EF CF 79 9F B2 11 8D 14 4E C1 AE 91 ED D2 85>)
(   3,<2006-04-18 15:11:25.03 +100>,<MAYBRIDGE\nmr>,<NMR_250MHZ>,
      <apk 
       data hash MD5: 32K
       EC F5 84 82 3C 36 57 76 34 8C 87 18 F4 B4 CA EA>)
(   4,<2006-04-18 15:11:25.95 +100>,<MAYBRIDGE\nmr>,<NMR_250MHZ>,
      <abs ABSG = 5 
       data hash MD5: 32K
       CA 46 C0 F7 4A 50 E0 8B 21 B5 45 0F 1C 2D E3 50>)
$$ ##END=
$$ 
$$ hash MD5
$$ 06 9D 91 4E 44 10 2D 9B EE 55 4D E4 CE 22 65 0B
##$RELAX= 
##$RELAX= 
##$RELAX= 
##$RELAX= 
##$RELAX= 
##$RELAX= 
##$RELAX= 
$$ Bruker specific parameters
$$ --------------------------
##$DU= <C:\u>
##$EXPNO= 2740
##$NAME= <ADRS>
##$PROCNO= 1
##$TYPE= <nmr>
##$USER= <dgb>
##$AMP= (0..31)
100 100 100 100 100 100 100 100 100 100 100 100 100 100 100 100 100 100 
100 100 100 100 100 100 100 100 100 100 100 100 100 100 
##$AQSEQ= 0
##$AQ_mod= 3
##$AUNM= <au_zg>
##$AUTOPOS= <56 >
##$BF1= 250.13
##$BF2= 250.13
##$BF3= 250.13
##$BF4= 250.13
##$BF5= 500.13
##$BF6= 500.13
##$BF7= 500.13
##$BF8= 500.13
##$BYTORDA= 1
##$CFDGTYP= 0
##$CFRGTYP= 5
##$CHEMSTR= <none>
##$CNST= (0..31)
1 1 145 1 1 1 1 1 1 1 1 1 1 1 1 1 1 1 1 1 1 1 1 1 1 1 1 1 1 1 1 1 
##$CPDPRG= <>
##$CPDPRG1= <>
##$CPDPRG2= <>
##$CPDPRG3= <>
##$CPDPRG4= <mlev>
##$CPDPRG5= <mlev>
##$CPDPRG6= <mlev>
##$CPDPRG7= <mlev>
##$CPDPRG8= <mlev>
##$CPDPRGB= <>
##$CPDPRGT= <>
##$D= (0..31)
0 1 0 0 0 0 0 0 0 0.06 0 0 0 0 0 0 0.0002 0 0 0 0 0 0 0 0 0 0 0 0 0 0 
0 
##$DATE= 1145369465
##$DBL= (0..7)
120 120 120 120 120 120 120 120 
##$DBP= (0..7)
150 150 150 150 150 150 150 150 
##$DBP07= 0
##$DBPNAM0= <>
##$DBPNAM1= <>
##$DBPNAM2= <>
$$ [...]
##$SUBNAM7= <"">
##$SUBNAM8= <"">
##$SUBNAM9= <"">
##$SW= 20.6930455092707
##$SWIBOX= (0..15)
0 0 3 0 0 0 0 0 0 0 0 0 0 0 0 0 
##$SW_h= 5175.983436853
##$TD= 65536
##$TD0= 1
##$TE= 294.16
##$TE2= 300
##$TE3= 300
##$TEG= 300
##$TL= (0..7)
0 120 120 120 120 120 120 120 
##$TP= (0..7)
150 150 150 150 150 150 150 150 
##$TP07= 0
##$TPNAME0= <>
##$TPNAME1= <>
##$TPNAME2= <>
##$TPNAME3= <>
##$TPNAME4= <>
##$TPNAME5= <>
##$TPNAME6= <>
##$TPNAME7= <>
##$TPOAL= (0..7)
0.5 0.5 0.5 0.5 0.5 0.5 0.5 0.5 
##$TPOFFS= (0..7)
0 0 0 0 0 0 0 0 
##$TUNHIN= 0
##$TUNHOUT= 0
##$TUNXOUT= 0
##$USERA1= <user>
##$USERA2= <user>
##$USERA3= <user>
##$USERA4= <user>
##$USERA5= <user>
##$V9= 5
##$VALIST= <valist>
##$VCLIST= <CCCCCCCCCCCCCCC>
##$VD= 0
##$VDLIST= <DDDDDDDDDDDDDDD>
##$VPLIST= <PPPPPPPPPPPPPPP>
##$VTLIST= <TTTTTTTTTTTTTTT>
##$WBST= 1024
##$WBSW= 4
##$XGAIN= (0..3)
0 0 0 0 
##$XL= 0
##$YL= 0
##$YMAX_a= 466059
##$YMIN_a= -495974
##$ZGOPTNS= <>
##$ZL1= 120
##$ZL2= 120
##$ZL3= 120
##$ZL4= 120
##$ABSF1= 16.44949
##$ABSF2= -4.243683
##$ABSG= 5
##$ABSL= 3
##$ALPHA= 0
##$AQORDER= 0
##$ASSFAC= 0
##$ASSFACI= 0
##$ASSFACX= 0
##$ASSWID= 0
##$AUNMP= <proc_1d>
##$AZFE= 0.1
##$AZFW= 0.1
##$BCFW= 0
##$BC_mod= 0
##$BYTORDP= 0
##$COROFFS= 0
##$CY= 12.5
##$DATMOD= 1
##$DC= 0
##$DFILT= <>
##$DTYPP= 0
##$F1P= 14.0000005364418
##$F2P= -0.99999901652339
##$FCOR= 0.5
##$FTSIZE= 32768
##$FT_mod= 6
##$GAMMA= 0
##$GB= 0
##$INTBC= 1
##$INTSCL= 1
##$ISEN= 128
##$LB= 0.3
##$LEV0= 0
##$LPBIN= 0
##$MAXI= 10000
##$MC2= 0
##$MEAN= 0
##$ME_mod= 0
##$MI= 0
##$NCOEF= 0
##$NC_proc= -3
##$NLEV= 6
##$NOISF1= 0
##$NOISF2= 0
##$NSP= 0
##$NTH_PI= 0
##$NZP= 0
##$OFFSET= 16.44949
##$PC= 1
##$PHC0= 185.5254
##$PHC1= -21.64331
##$PH_mod= 1
##$PKNL= yes
##$PPARMOD= 0
##$PSCAL= 4
##$PSIGN= 0
##$REVERSE= no
##$SF= 250.130018136266
##$SI= 32768
##$SIGF1= 0
##$SIGF2= 0
##$SINO= 400
##$SIOLD= 32768
##$SREGLST= <1H.CDCl3>
##$SSB= 0
##$STSI= 32768
##$STSR= 0
##$SW_p= 5175.98343685301
##$SYMM= 0
##$S_DEV= 0
##$TDeff= 65536
##$TDoff= 0
##$TI= <Analysis number 999999
Compound Code 99
Book Reference 9
Project Code 9>
##$TILT= no
##$TM1= 0
##$TM2= 0
##$TOPLEV= 0
##$USERP1= <user>
##$USERP2= <user>
##$USERP3= <user>
##$USERP4= <user>
##$USERP5= <user>
##$WDW= 1
##$XDIM= 32768
##$YMAX_p= 294348521
##$YMIN_p= -175743
$$ End of Bruker specific parameters
$$ ---------------------------------
##NTUPLES= NMR SPECTRUM
##VAR_NAME=  FREQUENCY,     SPECTRUM/REAL,   SPECTRUM/IMAG
##SYMBOL=    X,             R,               I
##VAR_TYPE=  INDEPENDENT,   DEPENDENT,       DEPENDENT
##VAR_FORM=  AFFN,          ASDF,            ASDF
##VAR_DIM=   32768,         32768,           32768
##UNITS=     HZ,            ARBITRARY UNITS, ARBITRARY UNITS
##FACTOR=    0.157963299565203, 1,           1
##FIRST=     4114.51113035594, 0,            0
##LAST=      -1061.47230649707, 0,           0
##MIN=       -1061.47230649707, -175743,     0
##MAX=       4114.51113035594, 294348521,    0
$$ Real data points
##PAGE= N=1
##DATA TABLE= (X++(R..R)), XYDATA
$$ [...]
24355D9826m0284j5901L6972K7720j9145l9420j4593q971k6037J3609M2678J8214
$$ 49826 9542 -6359 30613 58333 39188 -232 -14825 -23796 -49833 -36224 6454 24668
24343B4668k732k7668K926p12n7744J8456K9303j735n730L6517J278j6380r746
$$ 24668 21936 -5732 -2806 -3518 -61262 -42806 -13503 -15238 -20968 15549 16827 447 -9299
24330i299k3736j6793K3496K2186o116K5894p116l4670L87J8035Q164k534K834
$$ -9299 -33035 -49828 -26332 -4146 -10262 15632 8516 -26154 -25767 -7732 432 -2102 732
24317G32j5546m0114N423M2379k2877p91k019M1747J7581j4037k0550J2893j5056
$$ 732 -14814 -54928 -49505 -7126 -30003 -30794 -32813 8934 26515 12478 -8072 4821 -10235
24304a0235m7898j4640L6293N5958L0427N742R889m3704k6515l9176j2502k6776
$$ -10235 -58133 -72773 -36480 19478 49905 55647 65536 21832 -4683 -43859 -56361 -83137
24292h3137k807L0896M902L588j7541K7833j793o231M7912j6176m3261R55M9646
$$ -83137 -85944 -55048 -50146 -46558 -64099 -36266 -38059 -44290 3622 -12554 -55815 -54860 -5214
24279e214k4924m184K7967M611J3412q824Q417N5516j4062o33j9314l3210J6364
$$ -5214 -30138 -34322 -6355 -1744 11668 2844 11261 66777 52715 52082 32768 -442 15922
24266A5922m044p149q674k1767o524r051L5297M2572k765n5464p140K5192K9274
$$ 15922 11878 4729 -3945 -25712 -32236 -41287 -5990 36582 33817 -21647 -28787 -3595 25679
24253B5679K4983p4531n4802J7205J3922J7279j0745n292m828N351l6316J8546
$$ 25679 50662 -23869 -78671 -61466 -47544 -30265 -41010 -46302 -51130 -45779 -82095 -63549
24241f3549K7427N1606k0882K8131K5M7285K5899l9666k1359q086j4576J8542
$$ -63549 -36122 15484 -5398 22733 22758 70043 95942 56276 34917 26831 12255 30797
24229C0797J1277K1252J1421q168J135l3372m6870j724K6689j0388m1019r108
$$ 30797 42074 63326 74747 66579 67714 34342 -12528 -14252 12437 2049 -38970 -48078
24217d8078N5617R77L3539J1461l8494R241l0521n1865J4547N0786M2945l3210
$$ -48078 7539 8516 42055 53516 15022 24263 -6258 -58123 -43576 7210 50155 16945
24205A6945j1213j8382n209o481l6689n275J4153L0667r881j0079K0348P1126
$$ 16945 5732 -12650 -17859 -24340 -61029 -66304 -52151 -21484 -31365 -41444 -21096 50030
24193E0030r730K20L2069l3890l2422P533M775r79Q070j9534l6349m2756K2898
$$ 50030 40300 40520 72589 38699 6277 13810 18585 17606 25676 6142 -30207 -72963 -50065
24180e0065P2363K0536r606n3032k3335L8096L0224J2028l7776k692K3842J9899
$$ -50065 22298 42834 33228 -19804 -43139 -5043 25181 37209 -567 -3259 20583 40482
24168D0482j839l8103J2516O32N055R827r893K0940k1189l5163j2219J6250K7911
$$ 40482 38643 540 13056 13688 18743 28570 18677 39617 18428 -16735 -28954 -12704 15207
24155A5207K2326k8905j4293L2845L0775l4253q252P633r359r484R26j1667n5581
$$ 15207 37533 8628 -5665 27180 57955 23702 15450 23083 13724 4240 5166 -6501 -62082
24142f2082K172J2349J8232K8910j7458K5700J4404k0995O582r837r128r11m1056
$$ -62082 -59910 -47561 -29329 -419 -17877 7823 22227 1232 7814 -2023 -11151 -12062 -53118
24129e3118J7646O0813P169j6723k2008m8174o403N7764J5628J0281k0113J1640
$$ -53118 -35472 25341 32510 15787 -6221 -54395 -60798 -3034 12594 22875 2762 14402
24117A4402j0299j3454k2605K1556J2092J3494L1948J7935K804o0504k7233m020
$$ 14402 4103 -9351 -31956 -10400 1692 15186 47134 65069 67873 7369 -19864 -23884
24105b3884Q469K2053N760m340J1038j7443j0752J2669j5686K2892L4463j5211
$$ -23884 -15415 6638 12398 8058 19096 1653 -9099 3570 -12116 10776 45239 30028
24093C0028L7631M649m3444l8678p770K8978j0285J532j3094P564L7182Q396J670
$$ 30028 67659 72308 28864 -9814 -17584 11394 1109 2641 -10453 -2889 34293 42689 44359
24080D4359l6918j3275k9405K1183M1554j4026J2635L0087M3980k3239j0575k8030
$$ 44359 7441 -5834 -35239 -14056 27498 13472 26107 56194 100174 76935 66360 38330
24068C8330P41J8975j5743k3245M340k5511O085J2930L0443J6862j1837j5285
$$ 38330 39071 58046 42303 19058 23398 -2113 3972 16902 47345 64207 52370 37085
24056C7085k0721l2311K0651p238m4092L8791N5694k7605l0631K0827k572k1813
$$ 37085 16364 -15947 4704 -2534 -46626 -7835 47859 20254 -10377 10450 7878 -13935
24044a3935j5408j6030J139J4890r700M8165J2854k2330l8575k4787o968K4902
$$ -13935 -29343 -45373 -44234 -29344 -39044 9121 21975 -355 -38930 -63717 -70685 -45783
24032d5783P814J9729j9264M2180k172k1509J5638l010m98k7415K5054L4887l3183
$$ -45783 -37969 -18240 -37504 4676 2504 -19005 -3367 -6377 -6875 -34290 -9236 25651 -7532
24019g532m0624M3077j2990m0754p739L7555r929M132k178k4867M459N480J6827
$$ -7532 -48156 -5079 -18069 -58823 -66562 -29007 -38936 -34804 -36982 -61849 -57390 -51910 -35083
24006c5083R456q081k0440L800m647M962k4563J5839j0146N175K2305M5193j0923
$$ -35083 -25627 -33708 -54148 -50348 -54995 -50033 -74596 -58757 -68903 -63728 -41423 3770 -7153
23993g153l1468J0649p27M819j4437J6269P4936K3144l2860n4267J4532J5264
$$ -7153 -38621 -27972 -28699 -23880 -38317 -22048 52888 76032 43172 -11095 3437 18701
23981A8701j9877K710k8965k0773M7880K9981Q982o796j8083k384k0123j7476
$$ 18701 -1176 1534 -27431 -48204 -324 29657 38639 31843 13760 11376 -8747 -26223
23969b6223K0768J1161n8089L185N6642K2316j0847L27q758K502N734o499k7921
$$ -26223 -5455 5706 -52383 -49198 7444 29760 18913 19240 10482 12984 18718 12219 -15702
23956a5702j4051l042J3567K2218p514K4753J8463j711j2704R943k221m7343m6481
$$ -15702 -29753 -32795 -19228 2990 -4524 20229 38692 36981 24277 34220 31999 -15344 -61825
23943f1825j8231N9060M4101l2262j0146j0862k0431K7713j1475Q067O527L2755
$$ -61825 -80056 -20996 23105 -9157 -19303 -30165 -50596 -22883 -34358 -26291 -19764 12991
23931A2991K5759m265o216j2141j6303O1084j590L4664k203m3423j8817l2727
$$ 12991 38750 34485 28269 16128 -175 60909 59319 93983 91780 48357 29540 -3187
23919c187k3913k5645N2962N6174P37j7230l5016n9422k7401M4950k140j3532
$$ -3187 -27100 -52745 217 56391 57128 39898 4882 -54540 -81941 -36991 -39131 -52663
23907e2663K5682j1394l2249K5958k622k7024j4595K2907M5205K4029L2030j349
$$ -52663 -26981 -38375 -70624 -44666 -47288 -74312 -88907 -66000 -20795 3234 35264 33915
23895C3915K2383L7270j9345k1151k4901l010J3029Q75J5538k4128l6246k9807
$$ 33915 56298 93568 74223 53072 28171 25161 38190 39065 54603 30475 -5771 -35578
23883c5578j8300j300J0050k2669M1870L4533k1015L0797K0412o0930l4810L3489
$$ -35578 -53878 -55178 -45128 -67797 -25927 8606 -12409 18388 38800 -22130 -56940 -23451
23871b3451M5756m356m2623k2059J8561J717L951m048j0107j5413K7493M7135
$$ -23451 22305 17949 -24674 -46733 -28172 -26455 -22504 -26552 -36659 -52072 -24579 22556
23859B2556j1445J6523m28J579q655j5819o5549K1326Q7717j1730j7768k6712
$$ 22556 11111 27634 27206 28785 20130 4311 -61238 -39912 47805 36075 18307 -8405
23847h405j5294J6740J7387j3708N894J4217J7676n264l1828k5548J2303K3221
$$ -8405 -23699 -6959 10428 -3280 2614 16831 34507 29243 -2585 -28133 -15830 7391
23835G391Q677M26m4518p065K5864J852j3251J1237K4387J3128j2161n6966K0864
$$ 7391 16068 16494 -28024 -35089 -9225 -7373 -20624 -9387 15000 28128 15967 -40999 -20135
23822b0135J5777L4834m57L5227R013j7704j6349k7730R290K2324l2198o7297
$$ -20135 -4358 30476 30019 65246 74259 56555 40206 12476 21766 44090 11892 -55405
23810e5405l5319N8695K7429j5142N041L1863l1193k686J6178J9848Q94j4532
$$ -55405 -90724 -32029 -4600 -19742 -14701 17162 -14031 -16717 -539 19309 20203 5671
23798E671O9405J0259n8438p2454M0943K0957k3429l4153j246j7671k964L0632
$$ 5671 75076 85335 26897 -45557 -4614 16343 -7086 -41239 -42485 -60156 -63120 -32488
23786c2488J6061j7156l4928J7493M4591k890J6199j2952l6148n899m556P067
$$ -32488 -16427 -33583 -68511 -51018 -6427 -9317 6882 -6070 -42218 -48117 -52673 -45606
23774d5606J9831L6717O986o4100l5240N65N1606q030L2044K1579K67j8065j4320
$$ -45606 -25775 10942 17928 -46172 -81412 -80847 -29241 -37271 -5227 16352 16619 -1446 -15766
23761a5766l3184n8006J8705J6763J6887M3688J3563r136K9414K1771k8917n474
$$ -15766 -48950 -106956 -88251 -71488 -54601 -10913 2650 -6486 22928 44699 15782 10308
23749A0308K6351j0334P326k4348J5129R297n2293p613r363Q165R44K3535k3700
$$ 10308 36659 26325 33651 9303 24432 33729 -18564 -26177 -35540 -27375 -26431 -2896 -26596
23736b6596r247L215K8881j4589J672j6358l703J6393P755j9455Q20m610l1955
$$ -26596 -35843 -32628 -3747 -18336 -16664 -33022 -36725 -20332 -12577 -32032 -31212 -35822 -67777
23723f7777j033J8538K3051l6064j9887P7052r07m4619l528N2074j1353j596o412
$$ -67777 -68810 -50272 -27221 -63285 -83172 -6120 -7027 -51646 -55174 -3100 -14453 -16049 -22461
23710b2461j6257k4197J6094k0235J4290M9704J9700Q823K6784k0604l118p07
$$ -22461 -38718 -62915 -46821 -67056 -52766 -3062 16638 25461 52245 31641 28523 27816
23698B7816J5892j195k2623j1229P534J243j2509j0400m730J453M1475N742j8357
$$ 27816 43708 42513 19890 8661 16195 17438 4929 -5471 -10201 -8748 32727 38469 20112
23685B0112j1306j3376j4949j6255J9636M3790K5168M5395l1565L874K259m0522
$$ 20112 8806 -4570 -19519 -35774 -16138 27652 52820 98215 66650 70524 72783 32261
23673C2261l3257k5997j0390r719L9318p159L7818j4290l2147J9216K1985J0779
$$ 32261 -996 -26993 -37383 -47102 -7784 -14943 22875 8585 -23562 -4346 17639 28418
23661B8418m2653m7998M1249J3488l986j5577j9028l3049J77N0898N0J268j2519
$$ 28418 -14235 -62233 -20984 -7496 -11482 -27059 -46087 -79136 -78959 -28061 -28011 -26743 -39262
23648c9262L9730L9612k7457n2480J601P713j2844r635J1351J490N720N1907K4191
$$ -39262 468 40080 12623 -39857 -38256 -30543 -43387 -53022 -41671 -40181 -34461 17446 41637
23635D1637J9433j6295n3756m3376M4766J5014l939J6581k1228m7505k5424N748
$$ 41637 61070 44775 -8981 -52357 -7591 7423 3484 20065 -1163 -48668 -74092 -68344
23623f8344K6075r859k4557j288L7030N9243M166m9950Q704K4674J4550m1798
$$ -68344 -42269 -52128 -76685 -77973 -40943 18300 22466 -27484 -18780 5894 20444 -21354
23611b1354q871l793K0025L0891O907k4774j8164L7450j4271j9360L010L379m6573
$$ -21354 -30225 -34018 -13993 16898 23805 -969 -19133 18317 4046 -15314 -12304 -8925 -55498
23598e5498J1803L0456Q921j5854j390r342l1328K1764J9604N0636O524k2185
$$ -55498 -43695 -13239 -4318 -20172 -21562 -30904 -62232 -40468 -20864 29772 36296 14111
23586A4111j0071k9753n800k686p717J446l418M745N4667K5497N1859m615o0790
$$ 14111 4040 -25713 -31513 -34199 -41916 -40470 -43888 -39143 15524 41021 92880 88265 27475
23573B7475m3039j0079q165j0647L1861L3472j9343k5754n002K6838J110k5698
$$ 27475 -15564 -25643 -33808 -44455 -12594 20878 1535 -24219 -29221 -2383 -1273 -26971
23561b6971L0701N9988J4836K7429j2764o4323j6852O922j7327K245O210N2527
$$ -26971 3730 63718 78554 105983 93219 28896 12044 18966 1639 3884 10094 62621
23549F2621L609j1748J3603j4023K4616k4770m2823k5653j6762k3521P143L7428
$$ 62621 66230 54482 68085 54062 78678 53908 11085 -14568 -31330 -54851 -47708 -10280
23537a0280J5447l9881l9220L9117K350J304M409J1256K2969L5002j3899m0506
$$ -10280 5167 -34714 -73934 -34817 -32467 -31163 -26754 -15498 7471 42473 28574 -11932
23525a1932m5439j4151M2804K8047J7128k558l0051k562N559J6128K1258P939
$$ -11932 -57371 -71522 -28718 -671 16457 13899 -16152 -18714 -13155 2973 24231 32170
23513C2170j6665k6491k1795K3349m291K1564Q74k3186k7098J7316k9902j5735
$$ 32170 15505 -10986 -32781 -9432 -13723 7841 8715 -14471 -41569 -24253 -54155 -69890
23501f9890K5897M2869K2131M6579k864r222j2178M1Q233K1895k6556p318M4563
$$ -69890 -43993 -1124 21007 67586 64722 55500 43322 43363 51596 73491 46935 39617 84180
23488H4180k2850j2164j1657K1523l697k743j3342n4215m8880J202k369l333M2301
$$ 84180 61330 49166 37509 59032 55335 52592 39250 -14965 -63845 -62643 -65012 -68345 -26044
23475b6044L3607k635r027M3844K877q506r286k3168K3463L189k5859j8328J1429
$$ -26044 7563 4928 -4099 39745 42622 34116 24830 1662 25125 28314 2455 -15873 -4444
23462d444k1559o9327o406P371p492O364O4762Q2562m3738n5061J1910K9007J6779
$$ -4444 -26003 -95330 -101736 -94365 -101857 -95493 -30731 51831 8093 -46968 -35058 -6051 10728
23449A0728j1478M087K7080k1330O6005l1055k7974J5682n192l8492j6520l0240
$$ 10728 -750 3337 30417 9087 75092 44037 16063 31745 26553 -11939 -28459 -58699
23437e8699K5690P361K2951J5618J3632L0484j087k4011m5480J4192k1436l455
$$ -58699 -33009 -25648 -2697 12921 26553 57037 55950 31939 -13541 651 -20785 -24240
23425b4240K6880J4829k2533Q299K5306m887Q242J1462j1222R243K2722l0157
$$ -24240 2640 17469 -5064 3235 28541 23654 31896 43358 32136 41379 64101 33944
23413C3944J5161j6848n568n154o997j2912J7023j9804J0363L4265k1626j7462
$$ 33944 49105 32257 26689 21535 14538 1626 18649 -1155 9208 43473 21847 4385
23401D385J0220q608O219j378J6315J7616j7780q478o878j3269K6739K7713N26
$$ 4385 14605 5997 12216 10838 27153 44769 26989 18511 11633 -1636 25103 52816 53342
23388E3342M266j1060o2441l5508l2918K0942L0661L270M059m1038L2341M1840
$$ 53342 57608 46548 -15893 -51401 -84319 -63377 -32716 -29446 -25387 -66425 -34084 7756
23376G756L2795o697l177L3807p614Q748N300l8164M829N88n065K8081j2945l1067
$$ 7756 40551 33854 30677 64484 56870 65618 70918 32754 37583 38171 33106 61187 48242 17175
23362A7175k357l208Q876k8382K1215q476m7245j1103j563K0294j2979r341k6544
$$ 17175 14818 11610 20486 -7896 13319 4843 -42402 -53505 -55068 -34774 -47753 -57094 -83638
23349h3638K0560L8981L0768m047k7191j570o462j1715J5017J0625J9549J9196
$$ -83638 -63078 -24097 6671 2624 -24567 -26137 -32599 -44314 -29297 -18672 877 20073
23337B0073k5137j3834J5361L445J4124k3971j0199k7885j723J5373M778j4841
$$ 20073 -5064 -18898 -3537 -92 14032 -9939 -20138 -48023 -49746 -34373 -29595 -44436
23325d4436J2136M0184J1465j579m38J0985p786L065J8682N513j0874q953m8072
$$ -44436 -32300 7884 19349 17770 17332 28317 20531 23596 42278 47791 36917 27964 -20108
23312b0108m7888L2310O3998q374l0782N897J4831R727K345o987l047j5008K017
$$ -20108 -67996 -35686 28312 19938 -10844 -4947 9884 19611 21956 14969 11922 -3086 -1069
23299a069K0195M36J8721k8214k5062k0806j4084N235K4383k1602J5506N5262
$$ -1069 19126 19562 38283 10069 -14993 -35799 -49883 -44648 -20265 -41867 -26361 28901
23287B8901K0528N004l988L198l4241q9021j4274P901L0115J5252P97J9688r786
$$ 28901 49429 54433 50445 53643 19402 -69619 -83893 -75992 -45877 -30625 -29828 -10140 -19926
23274a9926k7165r009L1323l1695j5743M6881j3499p3520K1718O5989O3320j3582
$$ -19926 -47091 -56100 -24777 -56472 -72215 -25334 -38833 -112353 -90635 -24646 38674 25092
23262B5092m8308N243O0105k0798n168Q713K0365l2762r661l0189m0653M3680
$$ 25092 -23216 -17973 42132 21334 16166 24879 45244 12482 2821 -27368 -68021 -24341
23250b4341O6108q476j0049N818P844l0232J5483j7404j5296q538O172J7208j8388
$$ -24341 41767 33291 23242 29060 36904 6672 22155 4751 -10545 -19083 -12911 4297 -14091
23237a4091j685r730j0513J8692l956J9962l720j5478L4218j4042r699K494l8717
$$ -14091 -15776 -25506 -36019 -17327 -21283 -1321 -5041 -20519 13699 -343 -10042 -7548 -46265
23224d6265J951N2381P3650M643o7085m65M5434mk1254j5608l0250j7661K847
$$ -46265 -44314 8067 81717 86360 19275 18810 64244 64240 42986 27378 -2872 -20533 -17686
23211a7686J4938p656j0175K1525L1391J5544j6j1751R818k4841O962J906O9217
$$ -17686 -2748 -10404 -20579 946 32337 47881 47865 36114 45932 21091 28053 29959 99176
23198I9176j5535o3742m888J5767m0371J2692K5312r025m0835l1033J7678K392
$$ 99176 83641 19899 15011 30778 -9593 3099 28411 19386 -21449 -52482 -34804 -32412
23186c2412m098M4630K625n5115J2180M2926m288K2695K3886l4653J226j0166
$$ -32412 -36510 8120 10745 -44370 -32190 10736 6448 29143 53029 18376 19602 9436
23174I436K3616M3187L0254k7573k7499k730l3163L6788L9661k9014l7948K4057
$$ 9436 33052 76239 106493 78920 51421 48691 15528 52316 91977 62963 25015 49072
23162D9072K6650m0050r414m5509j6369K6960O187j2777K0917k2232j0721J6322
$$ 49072 75722 35672 26258 -19251 -35620 -8660 -2473 -15250 5667 -16565 -27286 -10964
23150a0964O166M996L5503j6066m1840M884K7589J6772k7305j2007K7795n7085
$$ -10964 -4798 198 35701 19635 -22205 -17321 10268 27040 -265 -12272 15523 -41562
23138d1562j4449K7280j2341P394M5281O638j9746k8474j3232j2648J9943L1852
$$ -41562 -56011 -28731 -41072 -33678 11603 18241 -1505 -29979 -43211 -55859 -35916 -4064
23126d064J3388M245J3945J0565l4720k549J0335p890m1182k163l0102Q132L4476
$$ -4064 9324 13569 27514 38079 3359 810 11145 3255 -37927 -40090 -70192 -62060 -27584
23113b7584M1277K4626j6884k0190m807K6924r585n7496k7110K504M5938L5460
$$ -27584 13693 38319 21435 1245 -3562 23362 13777 -43719 -70829 -68325 -22387 13073
23101A3073j7976P21J5750j0598Q911N8677N868n5903j6674J4898J6944j4311
$$ 13073 -4903 -4182 11568 970 9881 68558 74426 18523 1849 16747 33691 19380
23089A9380l8054k4415K9460k0874m4817j6463L8369K9815k1786m843k6022K1103
$$ 19380 -18674 -43089 -13629 -34503 -79320 -95783 -57414 -27599 -49385 -54228 -80250 -59147
23077e9147L0273L7176j9935p632K6903L6615r068m3927O827J6169k3414O317
$$ -59147 -28874 8302 -11633 -19265 7638 44253 35185 -8742 -1915 14254 -9160 -2843
23065b843K7476J4670j885o9642j5211M6861L842q986k6722P054j6277l2069K8109
$$ -2843 24633 39303 37418 -32224 -47435 -574 3268 -5718 -32440 -25386 -41663 -73732 -45623
23052d5623M1076Q670J1491J3844m0364L5358L7042p440j8222l3638m5972K2292
$$ -45623 -4547 4123 15614 29458 -10906 24452 61494 54054 35832 2194 -43778 -21486
23040b1486N874k2351L6427L2450k3238j0713Q093l4963J0241L6025L7831j7330
$$ -21486 -15612 -37963 -1536 30914 7676 -3037 5056 -29907 -19666 16359 54190 36860
23028C6860R599L4452j7682l8285R412J3632k7756k5956L0080L770K252P33Q302
$$ 36860 46459 80911 63229 24944 34356 47988 20232 -5724 24356 28126 30378 31111 39413
23015C9413R510j1563k0631M970K2062j1711k1518k3957j5580j4489K0473J4013
$$ 39413 48923 37360 16729 21699 43761 32050 10532 -13425 -29005 -43494 -23021 -9008
23003i008J7454l4619j2989K6704J7804O595n7696m0411r981K3425L0896k6577
$$ -9008 8446 -26173 -39162 -12458 5346 11941 -45755 -86166 -96147 -72722 -41826 -68403
22991f8403j0732n314M406o349K7008J3010k3378K4796M5763J7589o7030k2439
$$ -68403 -79135 -84449 -80043 -86392 -59384 -46374 -69752 -44956 807 18396 -48634 -71073
22979g1073K3545N4272K3264l9837L3712J1579j3604r302j6483j5859p92j4644
$$ -71073 -47528 6744 30008 -9829 23883 35462 21858 12556 -3927 -19786 -20578 -35222
22967c5222j8085L7808L1122K0439k3575J7496J8383m026m490R318r049l3084
$$ -35222 -53307 -15499 15623 36062 12487 29983 48366 44340 39850 49168 40119 7035
22955G035j5170o817j1050J0117Q257l5027K0809P728r923k0544P028J7929r058
$$ 7035 -8135 -14952 -26002 -15885 -7628 -42655 -21846 -14118 -24041 -44585 -37557 -19628 -28686
22942b8686m1766j7661K3947L0131M339j6394p668k0401K4267L9341J0437J0788
$$ -28686 -70452 -88113 -64166 -34035 -29696 -46090 -53758 -74159 -49892 -10551 -114 10674
22930A0674j9562M9273J6957o7344l532K2144j0365J3656k2801K2226O1122l1028
$$ 10674 -8888 40385 57342 -10002 -13534 8610 -1755 11901 -10900 11326 72448 41420
22918D1420n4368k189q962L8493k0798l4505j2145m798M698j4939J0038n266k1359
$$ 41420 -12948 -15137 -24099 14394 -6404 -40909 -53054 -57852 -53154 -68093 -58055 -63321 -84680
22905h4680K8108L9229J4914N849k0052k3046l0368N211J9851K1857M216J9951
$$ -84680 -56572 -17343 -2429 3420 -16632 -39678 -70046 -64835 -44984 -23127 -18911 1040
22893A040j1140l3215J0354P8291r649j6635J1770j2048k6407l2068k0864K1972
$$ 1040 -10100 -43315 -32961 45330 35681 19046 30816 18768 -7639 -39707 -60571 -38599
22881c8599J4559J8647j006J0181n4945l3741M764K6084K9665J8613k8760k954
$$ -38599 -24040 -5393 -6399 3782 -51163 -84904 -80140 -54056 -24391 -5778 -34538 -37492
22869c7492K2093Q800K1557K8486p516l5388l1325k642J5082j1826k8396m5418
$$ -37492 -15399 -6599 14958 43444 35928 540 -30785 -33427 -18345 -30171 -58567 -103985
22857a03985L3178L078l0299M7465P5727L9283j2963N344l7020k8751l7126o819
$$ -103985 -70807 -67729 -98028 -50563 25164 64447 51484 56828 19808 -8943 -46069 -52888
22845e2888J2446P264J594K1449L2942K3201k5518m2709m1209l8031J7469O5235
$$ -52888 -40442 -33178 -31584 -10135 22807 46008 20490 -22219 -63428 -101459 -83990 -18755
22833a8755J1051J1914j7080J279J0308J4245m810k0071R340J7043o745q820O011
$$ -18755 -7704 4210 -12870 -11591 -1283 12962 8152 -11919 -2579 14464 7719 -1101 4910
22820D910m4132q709M183j6956j8681m876J3353N8618O1112o174J223m3006n8503
$$ 4910 -39222 -47931 -43748 -60704 -79385 -84261 -70908 -12290 48822 42648 43871 865 -57638
22807e7638l5167K2360J5711M7426M9841k9799k4412k8814M322J0106j4044J0332
$$ -57638 -92805 -70445 -54734 -7308 42533 12734 -11678 -40492 -36170 -26064 -40108 -29776
22795b9776o275m021M831L4979J4214R157J75q9368l4934L582K4094K8346M8052
$$ -29776 -36051 -40072 -35241 -262 13952 23109 23284 -66084 -101018 -97436 -73342 -44996 3056
22782C056M4354m0652k0575K8063L0465J7407n858l9655M210L3393n1583j9893
$$ 3056 47410 6758 -13817 14246 44711 62118 56260 16605 20815 54208 2625 -17268
22770a7268K6072k1664n3601o0240J6188K2379N0544M1425l210k4268O24m4167
$$ -17268 8804 -12860 -66461 -126701 -110513 -88134 -37590 3835 625 -23643 -23019 -67186
22758f7186M027N804J4590J6230J3357Q358K5523k2738L9052K3549K0601k6495
$$ -67186 -63159 -57355 -42765 -26535 -13178 -4820 20703 -2035 37017 60566 81167 54672
22746E4672l8076j2605L092J7355j4829k7675J0293m942l4148r96L9570J2357
$$ 54672 16596 3991 7083 24438 9609 -18066 -7773 -12715 -46863 -47859 -8289 4068
22734D068j7632M839j9879l735J1330k6873M882P260J5699K7467k3739l3393L1823
$$ 4068 -13564 -8725 -28604 -32339 -21009 -47882 -43000 -35740 -20041 7426 -16313 -49706 -17883
22721a7883L5502o709l7140N033j413j2255O381K5816J8432k2816m2621k1459
$$ -17883 17619 10910 -26230 -21197 -22610 -34865 -28484 -2668 15764 -7052 -49673 -71132
22709g1132K8293N2892M967j7572n2521j183N2520M568m1298K8356L4967m1920
$$ -71132 -42839 10053 15020 -2552 -55073 -56256 -3736 832 -40466 -12110 22857 -19063
22697a9063J137M207K5656j3258J068Q46K5301P321j4184k2963q134j1666K5468
$$ -19063 -17926 -13719 11937 -1321 -253 593 25894 33215 19031 -3932 -12066 -23732 1736
22684A736p042m0927K3188k7312j6686k136J0804k6119o158O6275L1817q381l2516
$$ 1736 -5306 -46233 -23045 -50357 -67043 -69179 -58375 -84494 -90652 -24377 7440 -941 -33457
22671c3457l0627J3177K3628K0049K726N759m6426n4695J2616J992K9266M3344
$$ -33457 -64084 -50907 -27279 -7230 -4504 1255 -45171 -99866 -87250 -85258 -55992 -12648
22659a2648J2300O22K5809J0510K2750q32l2714n3803k7452K7994N4659K0951
$$ -12648 -348 274 26083 36593 59343 58511 25797 -28006 -55458 -27464 27195 48146
22647D8146j4675n1617o666L5317P668j7582k1170k6621O142K3335k7710j7989
$$ 48146 33471 -18146 -24812 10505 18173 591 -20579 -47200 -41058 -17723 -45433 -63422
22635f3422L9727J7018l0628M9066L5751L011k9899k7168O31l393L8795J7637
$$ -63422 -23695 -6677 -37305 11761 47512 50523 20624 -6544 -5913 -9306 29489 47126
22623D7126J736k3960K5326j1526j1168j9128k7687M007K0012j062r469J0962
$$ 47126 48862 24902 50228 38702 27534 8406 -19281 -15274 4738 3676 -5793 5169
22611E169p890Q91K4168j1525K1823N196Q215j7117n0201l6378K7142k492j6932
$$ 5169 -2721 -1830 22338 10813 32636 37832 46047 28930 -21271 -57649 -30507 -32999 -49931
22598d9931J639n255k2530M7056M4525k900j6203l3314k3283k855N056J6032k6038
$$ -49931 -48292 -53547 -76077 -29021 15504 12604 -3599 -36913 -60196 -63051 -57995 -41963 -68001
22585f8001R184k466K8616M2641J2967q848L5864l5219l0193N1424L8488K0996
$$ -68001 -58817 -61283 -32667 9974 22941 14093 49957 14738 -15455 35969 74457 95453
22573I5453k6980p0058Q998N660j7632l0345j9840k576J4915J9323m7016j8751
$$ 95453 68473 -1585 7413 13073 -4559 -34904 -54744 -57320 -42405 -23082 -70098 -88849
22561h8849K3388M6501J3812k5612p24K8314m018l6184O128L672J8156L7026j4192
$$ -88849 -65461 -18960 -5148 -30760 -31484 -3170 -7188 -43372 -37244 -33572 -15416 21610 7418
22548G418k1984j7891L4679p475k2607J2449R858l8092q951K9282K7510J8879
$$ 7418 -14566 -32457 2222 -5253 -27860 -15411 -5553 -43645 -52596 -23314 4196 23075
22536B3075Q03o1252M470L6054K0563J3878Q1793k7867j1066n096n8182j1623
$$ 23075 23878 -37374 -32904 3150 23713 37591 119384 91517 80451 75355 17173 5550
22524E550L0402J2134l9302k1687k7819J9534K7938L5000L0719q033m1816k1843
$$ 5550 35952 48086 8784 -12903 -40722 -21188 6750 41750 72469 64436 22620 777
22512G77J0156q354n0414l3337K5553P903l1211K863L0966p588Q90K9126K768
$$ 777 10933 2579 -47835 -81172 -55619 -47716 -78927 -76064 -45098 -52686 -51796 -22670 -19902
22499a9902J2538p254K8073k983j810J1802m3163k2809J458n753j414j7538o9
$$ -19902 -7364 -14618 13455 10472 8662 20464 -22699 -45508 -44050 -49803 -51217 -68755 -68824
22486f8824J2346Q643R523M3283J326J8928j1469l0839J1428N881j1200P762J0566
$$ -68824 -56478 -47835 -38312 4971 6297 25225 13756 -17083 -5655 226 -10974 -3212 7354
22473G354m3041K0265J0326p405j6561k1787P594m710J4827J247L2809J0468J3345
$$ 7354 -35687 -15422 -5096 -12501 -29062 -50849 -43255 -47965 -33138 -31891 918 11386 24731
22460B4731k9295j722k0491j926K1670k7473k20l459J8317k458j1717L0975J4775
$$ 24731 -4564 -6286 -26777 -28703 -7033 -34506 -34726 -38185 -19868 -22326 -34043 -3068 11707
22447A1707l194l4184P727L975L4170j6202l3921l4253p125J0570J0991J5367
$$ 11707 8513 -25671 -17944 -13969 20201 3999 -29922 -64175 -71300 -60730 -49739 -34372
22435c4372J0365k5810R246L706k993Q430K9717n636m113M6125M949k1421j1650
$$ -34372 -24007 -49817 -40571 -36865 -39858 -31428 -1711 -7347 -11460 34665 39614 18193 6543
22422F543j9194j8637k8581O03K1642r872J2798K9279K2328J2169K8988J5716
$$ 6543 -12651 -31288 -59869 -59266 -37624 -47496 -34698 -5419 16909 29078 58066 73782
22410G3782k8558q235m3813k7032j8305l767j0507l6993r992L0561K0600L4141
$$ 73782 45224 36989 -6824 -33856 -52161 -55928 -66435 -103428 -113420 -82859 -62259 -28118
22398b8118j5352J553M0314n116K906K8638R666j4028N029k5873L9983n80J1918
$$ -28118 -43470 -41917 -1603 -6719 -3813 24825 34491 20463 25492 -381 39602 39022 50940
22385E0940j7905m3497j4966J5300j991Q159J1649k5238R055l9265j5024J6856
$$ 50940 33035 -10462 -25428 -10128 -12119 -3960 7689 -17549 -8494 -47759 -62783 -45927
22373d5927N3185p208m0624o058J6787K1438J1819k9526j1953m809J155k4902
$$ -45927 7258 50 -40574 -46632 -29845 -8407 3412 -26114 -38067 -42876 -41721 -66623
22361f6623l1397M4802L8695O0734p406j3891j6326k3508l0757J4798L1135q971
$$ -66623 -98020 -53218 -14523 46211 38805 24914 8588 -14920 -45677 -30879 256 -8715
22349h715m3693J5978J4418j3814O739n188Q054J2974K26q842n713k6333j9769
$$ -8715 -52408 -36430 -22012 -35826 -29087 -34275 -26221 -13247 -13021 -21863 -27576 -53909 -73678
22336g3678J6300L0893P85L8991K2520k1038k1000K5409q962j1981l3031K6698
$$ -73678 -57378 -26485 -25700 13291 35811 14773 -6227 19182 10220 -1761 -34792 -8094
22324h094q16Q156p736J2442O282n1281l3759K3864K4908r225j7537J6018Q292
$$ -8094 -8910 -754 -8490 3952 10234 -41047 -74806 -50942 -26034 -35259 -52796 -36778 -28486
22311b8486K6544Q815k6394j3484L0215k3494j0839J9446j2198J1743P616n9883
$$ -28486 -1942 6873 -19521 -33005 -2790 -26284 -37123 -17677 -29875 -18132 -10516 -70399
22299g0399R149N7313L8969n2204k5860L0216R372j6579L2131J8116k8771j5885
$$ -70399 -61250 -3937 35032 -17172 -43032 -12816 -3444 -20023 12108 30224 1453 -14432
22287a4432l2670j1014J9985K8215L9466k1023p7971L712M2146l9459J0280L910
$$ -14432 -47102 -58116 -38131 -9916 29550 8527 -69444 -65732 -23586 -63045 -52765 -48855
22275d8855l0652r092M2064M6906K2953r417k6929J127M353j9659j6647j3378
$$ -48855 -79507 -88599 -46535 371 23324 13907 -13022 -11895 -7542 -27201 -43848 -57226
22263e7226M0905J2748l1116j7150J5351M69K1831K8257m1785Q981N782q953J4498
$$ -57226 -16321 -3573 -34689 -51839 -36488 -36019 -14188 14069 -27716 -18735 -12953 -21906 -7408
22250g408M5058o342R17N6122m3322j8901L103k8038j7746r164L0044J9576K1230
$$ -7408 37650 31308 32225 88347 45025 26124 29227 1189 -16557 -25721 4323 23899 45129
22237D5129K0546K0433J3287k9356m6900k8520k773k255k7808Q186K7106J4912
$$ 45129 65675 86108 99395 70039 23139 -5381 -8154 -10409 -38217 -30031 -2925 11987
22225A1987L5246j7234j8091M796Q250k9610p216L6186O3130j3031n5937p0199
$$ 11987 47233 29999 11908 16704 24954 -4656 -11872 24314 87444 74413 18476 -51723
22213e1723k4246M5680j6169K1611M8092k5406k5753K3741K7508R911q909K27
$$ -51723 -75969 -30289 -46458 -24847 23245 -2161 -27914 -4173 23335 33246 24337 24564
22201B4564j6458n4038k7183J0124L3156N679j8630P027O503L6501N1936j5711
$$ 24564 8106 -45932 -73115 -62991 -29835 -24156 -42786 -35759 -29256 7245 59181 43470
22189D3470j3703m068l7065K1410M4248R121P303m601p016L6600n148k039m2146
$$ 43470 29767 25699 -11366 10044 54292 63413 70716 66115 59099 95699 90551 88512 46366
22176D6366o7133j8076Q721r469N252l444J8644k3834K407L6996R996k446l020
$$ 46366 -20767 -38843 -30122 -39591 -34339 -37783 -19139 -42973 -40566 -3570 6426 3980 960
22163I60j72K91l9924l900K7163P278J106m7552J401L6590k23m0136J3834L6789
$$ 960 788 1079 -38845 -42745 -15582 -8304 -7198 -54750 -53349 -16759 -16982 -57118 -43284 -6495
22149f495K6155J8516K386J4666l2566K1052R22n1825j4407P884J7265k8397j7122
$$ -6495 19660 38176 40562 55228 22662 43714 44636 -7189 -21596 -13712 3553 -24844 -41966
22136d1966J3005J4536L2159K1993j6378J3294p535n1853k5628j3983M215J5863
$$ -41966 -28961 -14425 17734 39727 23349 36643 29108 -22745 -48373 -62356 -58141 -42278
22124d2278N7288N5330p759k5194n1523p3345J9906J0171J3708L7834M1924j8795
$$ -42278 15010 70340 62581 37387 -14136 -87481 -67575 -57404 -43696 -5862 36062 17267
22112A7267n2604J5433J9243q277J2126O041r309n009J9398j4189J0601M4919
$$ 17267 -35337 -19904 -661 -8938 3188 9229 -80 -5089 14309 120 10721 55640
22100E5640m5997k7642J3085P140k3810j5357L4153K6789l3174J0676N423j7373
$$ 55640 9643 -17999 -4914 2226 -21584 -36941 -2788 24001 -9173 1503 6926 -10447
22088a0447l833q720m465P512J8611l990k7226j7884K0521M8115j6672R077J7337
$$ -10447 -14280 -23000 -27465 -19953 -1342 -5332 -32558 -50442 -29921 18194 1522 10599 27936
22075B7936j3911j2993j8589j6980k8263j9344O3142K6338L8121j2376n2223o059
$$ 27936 14025 1032 -17557 -34537 -62800 -82144 -19002 7336 45457 33081 -19142 -25201
22063b5201L6209j0963K8195q864M0875J4499l6355k0910l132N2076l4253q157
$$ -25201 11008 45 28240 19376 60251 74750 38395 17485 14353 66429 32176 24019
22051B4019J5346k7305N548K2868m860m5952m5873j559J0340j26r953J0741P534
$$ 24019 39365 12060 17608 40476 35616 -10336 -56209 -57768 -47428 -47554 -57507 -46766 -39232
22038c9232K6462q133Q562K3486l2644J1162M2925K356j7037o4373O412O1400
$$ -39232 -12770 -20903 -12341 11145 -21499 -10337 32588 34944 17907 -46466 -40054 21346
22026B1346J1433j3727m2942M512M2288Q638l5134m4980J176o136J0214J0800
$$ 21346 32779 19052 -23890 -19378 22910 31548 -3586 -48566 -47390 -53526 -43312 -32512
22014c2512J2521k7229J9625M4971M812l7017J0496L1772K7634l5750l9882J2293
$$ -32512 -19991 -47220 -27595 17376 22188 -14829 -4333 27439 55073 19323 -20559 -8266
22002h266L7557M2814l6355N078K2266j1131m23K2720n0221J121L420m500m1213
$$ -8266 29291 72105 35750 40828 63094 51963 51540 74260 24039 25160 28580 24080 -17133
21989a7133j8116k3088K2395M0180O3727K1617m7698j7684j7456L7780O202K218
$$ -17133 -35249 -58337 -35942 4238 67965 89582 41884 24200 6744 44524 50726 52944
21977E2944j6203M170J6206k3333j4686k148k8684J7819N2294L815q048l389R021
$$ 52944 36741 40911 57117 33784 19098 16950 -11734 6085 58379 62194 54146 50757 59778
21964E9778J5704p347P713q387n1849l351L1227K0641j4918l176p020P101j4316
$$ 59778 75482 68135 75848 67461 15612 12261 43488 64129 49211 46035 39015 46116 31800
21951C1800l9025p051m025K2999N646P443Q918M4246J0839n7533m0111K7932k329
$$ 31800 -7225 -14276 -18301 4698 10344 17787 26705 70951 81790 24257 -15854 12078 9749
21938I749m1338M792J6540J5487K8985k0615j4753q929J0158k9057j5508j0364
$$ 9749 -31589 -26797 -10257 5230 34215 13600 -1153 -10082 76 -28981 -44489 -54853
21926e4853J930J8811M755K554K0411l6741J7342L2044o221j8707j5482M8458
$$ -54853 -52923 -34112 -29357 -26803 -6392 -43133 -25791 6253 32 -18675 -34157 14301
21914A4301J4731L4459j1498m3444j4814J1174J2029J7611K6274j6286k0138j1177
$$ 14301 29032 63491 51993 8549 -6265 4909 16938 34549 60823 44537 24399 13222
21902A3222J59l0439l5099O224K6317K8583J4221k0206K1227j1547l135L125Q134
$$ 13222 13381 -17058 -52157 -45933 -19616 8967 23188 2982 24209 12662 9527 12652 20786
21889B0786L121J6818j721k3482k4120l187r844j5141R45j2874k7845N0988L1726
$$ 20786 23907 40725 39004 15522 -8598 -11785 -21629 -36770 -35825 -48699 -76544 -25556 6170
21876F170k089j5597J4816k7146q0517m088k0323L9937M8038L7149K2237l0093
$$ 6170 4081 -11516 3300 -23846 -104363 -108451 -128774 -88837 -40799 -3650 18587 -11506
21864a1506J2772M6605k936l0740j3760l1427k0541J6741K1474J1189M497K4884
$$ -11506 1266 47871 44935 14195 435 -30992 -51533 -34792 -13318 -2129 2368 27252
21852B7252l7747m0472J8678N3046k0991m647J2620P825K0555p314K9354K231
$$ 27252 -10495 -50967 -32289 20757 -234 -4881 7739 15564 36119 28805 58159 60390
21840F0390K4485l9175k6184K00k7977M060l6024M5405O2698j4476j1844J4095
$$ 60390 84875 45700 19516 19716 -8261 -4201 -40225 5180 67878 53402 41558 55653
21828E5653n505j5272K2350j5585j9137p7213j9480J2180p945N5967J5197j4819
$$ 55653 50148 34876 57226 41641 22504 -54709 -74189 -62009 -69954 -13987 1210 -13609
21816a3609j8746J0556L0743j9105k3163l3267j8707N4545N7940l1095l9250K9398
$$ -13609 -32355 -21799 8944 -10161 -33324 -66591 -85298 -30753 27187 -3908 -43158 -13760
21804a3760j003j3664l93j3258L3890L1502J2224m514j0912J134J6928K4450j7996
$$ -13760 -14763 -28427 -28820 -42078 -8188 23314 35538 31024 20112 21246 38174 62624 44628
21791D4628m9272M0507J090j3672J9335j5775k3879l8979M3030P1177n1475k5215
$$ 44628 -4644 35863 36953 23281 42616 26841 2962 -36017 7013 78190 26715 1500
21779A500m24M22N407l598k1170q286j1126j3542j5728M595q852J7859p201r267
$$ 1500 1076 1498 6905 3307 -17863 -26149 -37275 -50817 -66545 -61950 -70802 -52943 -60144 -69411
21765f9411J2843J660K7487K4359R26k5767j7211K8064K2362n522j9792k205R610
$$ -69411 -56568 -54908 -27421 -3062 -2136 -27903 -45114 -17050 5312 -210 -20002 -22207 -12597
21752a2597N0855L4775l1933l6932m3623K4493L1773r354m6066j110J120J4677
$$ -12597 38258 73033 41100 4168 -39455 -14962 16811 7457 -38609 -39719 -38599 -23922
21740b3922J4370P208O663K6136J0713n081q595J5098o27k0166k8698L5372J1046
$$ -23922 -9552 -2344 4319 30455 41168 36087 27492 42590 41963 21797 -6901 28471 39517
21727C9517k2630k1523l378l4396K3963L2611p890K7315M8062k1737n0613K089
$$ 39517 16887 -4636 -8014 -42410 -18447 14164 6274 33589 81651 59914 9301 11390
21715A1390Q772q0920k7718J8666J0969J3380K0046O388J0909M732k5169m364
$$ 11390 20162 -60758 -88476 -69810 -58841 -45461 -25415 -19027 -8118 -3386 -28555 -32919
21703c2919M097K779p040n06M0399j1144m0001j8030J5248L4481K2400l7890k8359
$$ -32919 -28822 -26043 -33083 -33589 6810 -4334 -44335 -62365 -47117 -12636 9764 -28126 -56485
21690e6485k3663N782j8400j7044M6022P2926K2779m6686J218J2380k4792j7282
$$ -56485 -80148 -74366 -92766 -109810 -63788 9138 31917 -14769 -13551 -1171 -25963 -43245
21678d3245J6201K508O0N0864L8340m6829p696P638K9022m115J2159k3523N587
$$ -43245 -27044 -24536 -24476 26388 64728 17899 10203 17841 46863 42748 54907 31384 36971
21665C6971q370m8251j0450j6422O844N7217j482m8422N92L5997J1021j3056l1457
$$ 36971 28601 -19650 -30100 -46522 -39678 17539 16057 -32365 -31773 4224 15245 2189 -29268
21652b9268m7074J6096K5904l3233N55K0641J5735M242J1932j0599o7720o3274
$$ -29268 -76342 -60246 -34342 -67575 -67020 -46379 -30644 -26402 -14470 -25069 -92789 -156063
21640a56063L3820N9182M2470o5613j3759N970M5678K7270L4853j258j259L4409
$$ -156063 -122243 -63061 -20591 -86204 -99963 -93993 -48315 -21045 13808 12550 11291 45700
21628D5700j1529o513k5582m4113l4226j7438j231N8578J8659k9747k7680L8432
$$ 45700 34171 27658 2076 -42037 -76263 -93701 -94932 -36354 -17695 -47442 -75122 -36690
21616c6690M7508K2176j9220k2992M5195n751j7094k8656j571K0864k0262m2167
$$ -36690 10818 32994 13774 -9218 35977 30226 13132 -15524 -17095 3769 -16493 -58660
21604e8660L0533K915k3983k720K4535j3897J9139N8571J1647Q514k2221n6701
$$ -58660 -28127 -25212 -49195 -51915 -27380 -41277 -22138 36433 48080 56594 34373 -22328
21592b2328n1173J6057j3934J48K5737R315J9595k1841J9020L3725J5887l7223
$$ -22328 -73501 -57444 -71378 -71230 -45493 -36178 -16583 -38424 -19404 14321 30208 -7015
21580g015n0879J9851L5425R194L3541j1114n303j9768P777L0956K0434k0983
$$ -7015 -57894 -38043 -2618 6576 40117 29003 23700 3932 11709 42665 63099 42116
21568D2116n1556j1791O403P360j7081K279O5880L4197P38j7663o5460j8941L1660
$$ 42116 -9440 -21231 -14828 -7468 -24549 -22270 43610 77807 78545 60882 -4578 -23519 8141
21555H141L4558j546J5834j113m9129K183L7985k6697L7656P460l9269l0182l3530
$$ 8141 42699 41153 56987 55874 6745 8928 46913 20216 57872 65332 26063 -4119 -37649
21542c7649K1442r149n7497k0429M5436L2577M5415J7043l9194j6063O631J5463
$$ -37649 -16207 -25356 -82853 -103282 -57846 -25269 20146 37189 -2005 -18068 -11437 4026
21530D026R841k7362j6941J6265j1401j8058m569L4697k7374m4947J9669m622
$$ 4026 13867 -13495 -30436 -14171 -25572 -43630 -48199 -13502 -40876 -85823 -66154 -70776
21518g0776P162K6662j1666k0477K1123l568L1880K3857K4969L447k881M0612
$$ -70776 -63614 -36952 -48618 -69095 -47972 -51540 -19660 4197 29166 32613 29732 70344
21506G0344m7774j4245M5824K0523k2846J7332q1l6085j0925L5063k0261l1660
$$ 70344 22570 8325 54149 74672 51826 69158 69077 32992 22067 57130 36869 5209
21494E209l0914o724R410O982K2425K8034k9936k9178L8322J7783k0327j0508
$$ 5209 -25705 -32429 -23019 -16037 6388 34422 4486 -24692 13630 31413 11086 578
21482E78L2311M9639J5754k0326p8091k1445K6645J3827J2642j6325m3210L625
$$ 578 32889 82528 98282 77956 -135 -21580 5065 18892 31534 15209 -28001 -24376
21470b4376n209k1265K0747M092K4682J0411o142j8393l3256j4280K9299O2087
$$ -24376 -29585 -50850 -30103 -26011 -1329 9082 2940 -15453 -48709 -62989 -33690 28397
21458B8397k2392n2585L0778M1496l8961J0995j6544L1536J7649j4155l2496m4583
$$ 28397 6005 -46580 -15802 25694 -13267 -2272 -18816 12720 30369 16214 -16282 -60865
21446f0865j6232J842l5936K3611N9040N821l3706j5794R727J3420k5545m16N9628
$$ -60865 -77097 -75255 -111191 -87580 -28540 -22719 -56425 -72219 -62492 -49072 -74617 -75033 -15405
21433a5405N1549L6323k0019k5541K065L2606L8896J3813l9274j1843p397j5614
$$ -15405 36144 72467 52448 26907 28972 61578 100474 114287 75013 63170 55773 40159
21421D0159p891j2067j0854L4013k5963Q965J7649j8742m8581p372l678L790K2778
$$ 40159 32268 20201 9347 43360 17397 26362 44011 25269 -23312 -30684 -34362 -30572 -7794
21408g794l101L1850j4604l4447L29M466L1812K0682r905l7868M97o1051N975
$$ -7794 -10895 20955 6351 -28096 -27767 -23301 8511 29193 19288 -18580 -18083 -79134 -73159
21395g3159K0874J9800K81J8289j818L7658j5919n3472K4103L4424J4381l5454
$$ -73159 -52285 -32485 -32204 -13915 -15733 21925 6006 -47466 -23363 11061 25442 -10012
21383a0012k1991j2344J7160K8783J2570K6719J4886j6900j9958L86Q264m6597
$$ -10012 -32003 -44347 -27187 1596 14166 40885 55771 38871 18913 19299 27563 -19034
21371a9034j1769O424l5038L533L1543R550O468j3372j6443J1983L5590N996Q845
$$ -19034 -30803 -24379 -59417 -55884 -24341 -14791 -8323 -21695 -38138 -26155 9435 15431 24276
21358B4276J108l9995m476O2019k3927j7320J6230j1805K8619K5342o5859m0894
$$ 24276 25384 -14611 -19087 42932 19005 1685 17915 6110 34729 60071 -5788 -46682
21346d6682M4907L4065j0597l694K8939j1269o0561O336L026O0768L2178r898
$$ -46682 -1775 32290 21693 17999 46938 35669 -24892 -18556 -15530 45238 77416 67518
21334F7518n1459k8337j3686O77J8307J2684K177j2573P405J7649P203L2896n7755
$$ 67518 16059 -12278 -25964 -25287 -6980 5704 7881 -4692 2713 20362 27565 60461 2706
21321B706J3984L2925M953m9285K0696j6113k9561q382K070J0876l5386m525l562
$$ 2706 16690 49615 54568 5283 25979 9866 -19695 -28077 -26007 -15131 -50517 -55042 -58604
21308e8604K1332K4574J2020k597N921O691J3263K0100p5m1705O763j0289j7820
$$ -58604 -37272 -12698 -678 -3275 2646 9337 22600 42700 42625 920 7683 -2606 -20426
21295b0426q98m3200j9682j3649K5658M2946L9581k2587K6580K6182p08K9412
$$ -20426 -21324 -64524 -84206 -97855 -72197 -29251 10330 -12257 14323 40505 39797 69209
21283F9209j2731J251j4860o1874K0014J2973J4362J2025l8081j1221j802q126
$$ 69209 56478 57729 42869 -19005 1009 13982 28344 40369 2288 -8933 -10735 -18861
21271a8861Q839K4664j1628j0560n9281l351J1382j4293P85M7486Q41q489K171
$$ -18861 -10022 14642 3014 -7546 -66827 -70178 -58796 -73089 -72304 -24818 -23977 -32466 -30295
21258c0295q930j9054q73L1743O941j028N775k0836J3994K6345N825k8691r916
$$ -30295 -39225 -58279 -59152 -27409 -20468 -21496 -15721 -36557 -22563 3782 9607 -19084 -29000
21245b9000K2282P4658j7936n8855l4345j1820l325j7785J5824L5767k7613k3977
$$ -29000 -6718 67940 50004 -8851 -43196 -55016 -58341 -76126 -60302 -24535 -52148 -76125
21233g6125N3168J7774M5068j8171L318n0233n6322L0891L3286j3285J6789P775
$$ -76125 -22957 -5183 39885 21714 25032 -25201 -81523 -50632 -17346 -30631 -13842 -6067
21221f067l9743L0597O2172K2649q327m1935o6123j9200N4826O2329K3218p942
$$ -6067 -45810 -15213 46959 69608 61281 19346 -46777 -65977 -11151 51178 74396 66454
21209F6454J1782k5835n6107K2312l265J0313L0533p193k6011J1653n074J8521
$$ 66454 78236 52401 -3706 18606 15341 25654 56187 48994 22983 34636 29562 48083
21197D8083N038m8143j8951r452K302j3327J2112J8172K5276K4812k5369j5292
$$ 48083 53121 4978 -13973 -23425 -21123 -34450 -22338 -4166 21110 45922 20553 5261
21185E261M334P446j4559k531j4753j8185J8890k1965l2560M1474L7294o8187
$$ 5261 9595 17041 2482 -49 -14802 -32987 -14097 -36062 -68622 -27148 10146 -58041
21173e8041j8843N4886L7382N691k7l4791k0966l292j5612N4968K0969K8377m2954
$$ -58041 -76884 -21998 15384 21075 21048 -13743 -34709 -38001 -53613 1355 22324 50701 7747
21160G747k1404J142r149l3577l698K0328K2821j3101k2763k4462l0760J1158
$$ 7747 -13657 -12515 -21664 -55241 -58939 -38611 -15790 -28891 -51654 -76116 -106876 -95718
21148i5718N3834j9217j2436R717J4940j5412L7368j7272k1233K1011J5384j355
$$ -95718 -41884 -61101 -73537 -63820 -48880 -64292 -26924 -44196 -65429 -44418 -29034 -30389
21136c0389R304n51P178N108Q944J4461k7408j5641k580Q102M0848R730r099n5853
$$ -30389 -21085 -21636 -14458 -9350 -406 14055 -13353 -28994 -31574 -23472 17376 27106 18007 -37846
21122c7846K3299M6589L1760O475o661J306L1825k2941o3156j6154M9320M9130
$$ -37846 -14547 32042 63802 70277 63616 64922 96747 73806 10650 -5504 43816 92946
21110I2946j7212k516l5862p7586k5389O3542L1591l9599J4916J3582l6321k0003
$$ 92946 75734 73218 37356 -40230 -65619 -2077 29514 -10085 4831 18413 -17908 -37911
21098c7911n257J6320L8199k737k7381L3048j3107K2970m44J3499J3869M489k6614
$$ -37911 -43168 -26848 11351 8614 -18767 14281 1174 24144 23700 37199 51068 55557 28943
21085B8943o6220j8431p152O449J2499K2808K324L72L4087O521k2119k8958l0105
$$ 28943 -37277 -55708 -62860 -56411 -43912 -21104 -18780 -18408 15679 22200 81 -28877 -58982
21072e8982J6162M7176l673k3415R237N544m8999n478K1345J3097j4547j212M5033
$$ -58982 -42820 4356 683 -22732 -13495 -7951 -56950 -62428 -41083 -27986 -42533 -43745 1288
21059A288j8070n6255L0824P7821J5111l0034l0365m3718K4306K2198o986K4290
$$ 1288 -16782 -73037 -42213 35608 50719 20685 -9680 -53398 -29092 -6894 -13880 10410
21047A0410K2483j3117l6963K3384j0990j1477p461o566K561n014q90O138J0914
$$ 10410 32893 19776 -17187 6197 -4793 -16270 -23731 -30297 -27736 -32750 -33640 -27502 -16588
21034a6588j3603K8022n4282J8222K551K310N4455J5447K7304K555m5195k1303
$$ -16588 -30191 -2169 -56451 -38229 -35678 -33368 21087 36534 63838 66393 21198 -105
21022a05k4264k2738j520L3433M7725r275k758n778J6661j3l9228l1304n968r348
$$ -105 -24369 -47107 -48627 -15194 32531 23256 20498 14720 31381 31368 -7860 -39164 -45132 -54480
21008e4480J2448q240k0916j4357j090Q978L5748M4626M6477l743J622k7310j3443
$$ -54480 -42032 -50272 -71188 -85545 -86635 -77657 -41909 2717 49194 45451 47073 19763 6320
20995F320J1277k0602j9374m137O024n030K7473j0484m2212J9505K0520k1202
$$ 6320 17597 -3005 -22379 -26516 -20492 -25522 1951 -8533 -50745 -31240 -10720 -31922
20983c1922l8655J2727N05J7731j4215k6084L7982J7734J1339K446L5957k2344
$$ -31922 -70577 -57850 -57345 -39614 -53829 -79913 -41931 -24197 -12858 -10412 25545 3201
20971C201k2813L4328L0660j4652m4990k7552n187r646O319J6616J9219n491J5941
$$ 3201 -19612 14716 45376 30724 -14266 -41818 -47005 -56651 -50332 -33716 -14497 -19988 -4047
20958d047p632J1424K3209K512J6880J4185n3065o514o691k1925P869L3167K4252
$$ -4047 -11679 -255 22954 25466 42346 56531 3466 -3048 -9739 -31664 -23795 9372 33624
20945C3624l828p738k6995k8225l348k2919L5281k6738m5682J1162P564M0622
$$ 33624 29796 22058 -4937 -33162 -36510 -59429 -24148 -50886 -96568 -85406 -77842 -37220
20933c7220K4445M68J8763J5055j5492j6448K5298j9983j8933K2871R890j6710
$$ -37220 -12775 -12307 6456 21511 6019 -10429 14869 -5114 -24047 -1176 8714 -7996
20921g996j4447j0306j2361K4448j1980j4242k4977n362L7935N0345K8665j2977
$$ -7996 -22443 -32749 -45110 -20662 -32642 -46884 -71861 -77223 -39288 11057 39722 26745
20909B6745r212n559n8299j8977j627J8865Q545K4099o812m5304j9009L9167N4149
$$ 26745 17533 11974 -46325 -65302 -66929 -48064 -39519 -15420 -22232 -67536 -86545 -47378 6771
20896F771M69K585M9029J8192j9489J0471k8487O780k7537j5205M353p097j4l4730
$$ 6771 7240 9825 58854 77046 57557 68028 39541 46321 18784 3579 7932 835 821 -33909
20882c3909k3954L1452L5915J0079j9317q947J0593M385J7298k4872k4542M83
$$ -33909 -57863 -26411 9504 19583 266 -8681 1912 6297 23595 -1277 -25819 -25336
20870b5336J3323j5016q931n6459l0883M7334l885J3269J6621l660J0165L3605
$$ -25336 -12013 -27029 -35960 -92419 -123302 -75968 -79853 -66584 -49963 -53623 -43458 -9853
20858i853J4905R083J901k8029l1150j1835m986l4718k4689j252J597N149Q339
$$ -9853 5052 14135 16036 -11993 -43143 -54978 -59964 -94682 -119371 -120623 -119026 -113877 -105538
20845a05538M627Q515L3249N6238L3056j0790m6441l5872Q709K843k6343k5079
$$ -105538 -100911 -92396 -59147 -2909 30147 19357 -27084 -62956 -54247 -51404 -77747 -102826
20833a02826J1128J9553K5607L8825J7430J309m9353k555p343P004O180M686j5052
$$ -102826 -91698 -72145 -46538 -7713 9717 11026 -38327 -40882 -48225 -41221 -35041 -30355 -45407
20820d5407k022O848J3137n518m126P929J9596O781o978j7625O74J5033o112r487
$$ -45407 -47429 -40581 -27444 -32962 -37088 -29159 -9563 -2782 -9760 -27385 -26711 -11678 -17790 -27277
20806b7277J2754q05J4078k331k6912R008K279k5502j8501k2729j8339J076L0147
$$ -27277 -14523 -15328 -1250 -3581 -30493 -21485 -19206 -44708 -63209 -85938 -104277 -103201 -73054
20793g3054O933K9352K0980J1688j7224K2306j4253J7248m287p343k5485L6817
$$ -73054 -66121 -36769 -15789 -4101 -21325 981 -13272 3976 -311 -7654 -33139 3678
20781C678L4112j6383P884O312J8485j3284L106j4747n6409k0217j447l694j4271
$$ 3678 37790 21407 29291 35603 54088 40804 43910 29163 -27246 -47463 -48910 -52604 -66875
20768f6875P133N960J4832K1529J5155k7637o052K467L6477L3497j5874L1393
$$ -66875 -59742 -53782 -38950 -17421 -2266 -29903 -35955 -33488 2989 36486 20612 52005
20756E2005P35k1633j4093J1349m2234k4665j1252P013j2969L2571N3683J4101
$$ 52005 52740 31107 17014 28363 -13871 -38536 -49788 -42775 -55744 -23173 30510 44611
20744D4611j7983l073o27o932j9772j9133R872J8344m6956l4351N987L693L3483
$$ 44611 26628 23555 22928 15996 -3776 -22909 -13037 5307 -41649 -76000 -70013 -66320 -32837
20731c2837J1510J2838K4792N1443m559m1564k8262R095K4929Q013j2935q510
$$ -32837 -21327 -8489 16303 67746 63187 21623 -6639 2456 27385 35398 22463 13953
20719A3953k2911j8746j0262O295K8548o884j2082N557K2711j2668m4875K1276
$$ 13953 -8958 -27704 -37966 -31671 -3123 -10007 -22089 -16532 6179 -6489 -51364 -30088
20707c0088L6110K1424R663k1512l6074k7412l4J9506J991m5906K8198L9340J3732
$$ -30088 6022 27446 37109 15597 -20477 -47889 -47923 -28417 -26426 -72332 -44134 -4794 8938
20694H938k0052N43J5019k4472j4662j7039j538L3961K4869J881J6854K5698L8977
$$ 8938 -11114 -10571 4448 -20024 -34686 -51725 -53263 -19302 5567 7448 24302 50000 88977
20681H8977j6063o5660o1866j7516j274O6526M3142N681k2905Q809j0942m0860
$$ 88977 72914 7254 -54612 -72128 -73402 -6876 36266 41947 19042 27851 16909 -23951
20669b3951k3803K5586j1152k9958j8746J3450L7694M3461L4698K6000k3865m4596
$$ -23951 -47754 -22168 -33320 -63278 -82024 -68574 -30880 12581 47279 73279 49414 4818
20657D818L613M3441L1897m9871r983J7903o8192j8059J4402N3171k4632k0701
$$ 4818 8431 51872 83769 33898 23915 41818 -26374 -44433 -30031 23140 -1492 -22193
20645b2193k784J2780j0091m5115j1289K7450j5214k7731L700M1715N5781K1268
$$ -22193 -24977 -12197 -22288 -67403 -78692 -51242 -66456 -94187 -90487 -48772 7009 28277
20633B8277J2177J0515L378k4617m1408j692K4419k0033j1187M3399m088M217
$$ 28277 40454 50969 54347 29730 -11678 -13370 11049 -8984 -20171 23228 19140 23357
20621B3357J5534m6234O353J2820k1846l0699o902K6043O4543J7459k9369L0962
$$ 23357 38891 -7343 -990 11830 -10016 -40715 -47617 -21574 42969 60428 31059 62021
20609F2021J645K8891j642p9884m9513p795j185j8979k8169K0966Q6116K2348
$$ 62021 63666 92557 90915 11031 -38482 -46277 -47462 -66441 -94610 -73644 12472 34820
20597C4820J4669r670q897o521j1906k8470L6052J0335J7876o229J6186R489j1578
$$ 34820 49489 39819 30922 24401 12495 -15975 20077 30412 48288 42059 58245 67734 56156
20584E6156k3024l58r28k9462n767j7305J5101J6779J1655n5816l2387J8204J5783
$$ 56156 33132 32774 31846 2384 -3383 -20688 -5587 11192 22847 -32969 -65356 -47152 -31369
20571c1369J8370J3682m140K9819M2666k9640o5903L1776R429j2666l5735K0956
$$ -31369 -12999 683 -3457 26362 69028 39388 -26515 5261 14690 2024 -33711 -12755
20559a2755L0786P162J9078L9844m8503m8708q183L8761m797j7755j4593M3586
$$ -12755 18031 25193 44271 84115 35612 -13096 -21279 17482 12685 -5070 -19663 23923
20547B3923K8245l6667m0529J112k6323K3572J3030K9408N261K9249m7439r822
$$ 23923 52168 15501 -25028 -23916 -50239 -26667 -13637 15771 21032 50281 2842 -6980
20535f980L9453L6398j4362j1234q2336k7342J5035K1839J5672l7686J3087P6195
$$ -6980 32473 68871 54509 43275 -39061 -66403 -51368 -29529 -13857 -51543 -38456 37739
20523C7739M5625j4593n6834J240k9999J5570l271n391J9291j8232j4j5930k3607
$$ 37739 83364 68771 11937 13177 -16822 -1252 -4523 -9914 9377 -8855 -8869 -24799 -48406
20510d8406J5162J4785K0955j6160k2521j6543l987J0703L5303Q4823L8600k3376
$$ -48406 -33244 -18459 2496 -13664 -36185 -52728 -56715 -46012 -10709 74114 112714 89338
20498H9338m8085m1619q721r652K7609o51j9609j8761L4449j3197m0278K4560
$$ 89338 41253 -366 -9087 -18739 8870 8219 -11390 -30151 4298 -8899 -49177 -24617
20486b4617K4622J1694j2795l2639K0959r857l567k5650k7088O1L2376J8800L757
$$ -24617 5 11699 -1096 -33735 -12776 -22633 -26200 -51850 -78938 -78877 -46501 -27701 -23944
20473b3944k1425l1390l1953K874M5066Q3932L4997j2949k7525k7453k33J1792
$$ -23944 -45369 -76759 -108712 -105838 -60772 23160 58157 45208 17683 -9770 -10003 1789
20461A789j2455j1221J1700l6681j1677k6039K224L6365K0466j8473p470J5935
$$ 1789 -10666 -21887 -10187 -46868 -58545 -84584 -82360 -45995 -25529 -44002 -51472 -35537
20449c5537K387k2634J7782l0957K1140K0343l7316K4429L9749K8K1252k030Q017
$$ -35537 -33150 -55784 -38002 -68959 -47819 -27476 -64792 -40363 -614 -586 20666 18636 26653
20436B6653j3871J7559J0579Q914M809j4125P619q901k3984j0556l6523L911m7319
$$ 26653 12782 30341 40920 49834 54643 40518 48137 39236 15252 4696 -31827 -27916 -75235
20423g5235p2068j4532Q4315J4633N3036J6019k929J5571j0772K3331K422k8145
$$ -75235 -147303 -161835 -77520 -62887 -9851 6168 3239 18810 8038 31369 33791 5646
20411E646n1189r467L0841j9040m0087K7484p406k147M2445J5173J4449n200P697
$$ 5646 -45543 -55010 -24169 -43209 -83296 -55812 -63218 -65365 -22920 -7747 6702 1502 9199
20398I199m0916j6157j3614M19K8184M1191J837p2673L4482K2011N429j389M4193
$$ 9199 -31717 -47874 -61488 -61069 -32885 8306 10143 -62530 -28048 -6037 -608 -1997 42196
20385D2196j9747k1491r958J1554L0870j0012m3078L477J062k7958N860L5067
$$ 42196 22449 958 -9000 2554 33424 23412 -19666 -16189 -15127 -43085 -37225 -2158
20373b158J5146k0927n005M050j4908J2704J6793l1090O72L3192j0451J823K6670
$$ -2158 12988 -7939 -12944 -8894 -23802 -11098 5695 -25395 -24723 8469 -1982 -159 26511
20360B6511k476L2152k572j9537j242k3802P762M3152M681j5916l3670l1001k0573
$$ 26511 24035 56187 53615 34078 32836 9034 16796 59948 64629 48713 15043 -15958 -36531
20347c6531K3922J7073q769K912N276j5041Q807L0375L0974K1990j1452j3434
$$ -36531 -12609 4464 -4305 -1393 3883 -11158 -2351 28024 58998 80988 69536 56102
20335E6102l4394j4201L0986k0444l1855l9m1443O465K3916L1357o507M0373J1828
$$ 56102 21708 7507 38493 18049 -13806 -13845 -55288 -48823 -24907 6450 -57 40316 52144
20322E2144j7713m3607K6667j711p853J7950q709J639K6606K6724k751l9661l3580
$$ 52144 34431 -9176 17491 15780 7927 25877 17168 18807 45413 72137 69386 29725 -3855
20309c855k157k4350K1476L2026p636j8063J7488J6601j545l5703R598L9710J4935
$$ -3855 -6012 -30362 -8886 23140 15504 -2559 14929 31530 29985 -5718 3880 43590 58525
20296E8525o4229l9357k2869k6028L8444K6525k0131m2740K9686M5213L076k4957
$$ 58525 -5704 -45061 -67930 -93958 -55514 -28989 -49120 -91860 -62174 -16961 -13885 -38842
20284c8842j5049N428M5703Q882k5615k4077J9739j2262p834p449M4994K2035
$$ -38842 -53891 -48463 -2760 6122 -19493 -43570 -23831 -36093 -43927 -51376 -6382 15653
20272A5653j2429n8345L363M4424K1760j0511k9202M7677j4547m4664j1840J795
$$ 15653 3224 -55121 -51758 -7334 14426 3915 -25287 22390 7843 -36821 -48661 -46866
20260d6866o012K4311L3391K2081q031j7903K6209K1056j4646l5423m9205K6416
$$ -46866 -52878 -28567 4824 26905 18874 971 27180 48236 33590 -1833 -51038 -24622
20248b4622j2161k3439r632p72L0247K2879p229K3410L2823k7563j3817O511M123
$$ -24622 -36783 -60222 -69854 -70626 -40379 -17500 -24729 -1319 31504 3941 -9876 -3365 758
20235G58k9740K412J9227j2607J351J0704K5334l760k2311l3247Q324J6858J3051
$$ 758 -28982 -26570 -7343 -19950 -18599 -7895 17439 13679 -8632 -41879 -33555 -16697 -3646
20222c646m7361l2232j2085J4947J5847L8528J5494l262J2214j6320L611L3905
$$ -3646 -51007 -83239 -95324 -80377 -64530 -26002 -10508 -13770 -1556 -17876 -14265 19640
20210A9640J1826l1298L575l523k0118l5750j9021O507J9073j3826j709N8142
$$ 19640 31466 168 3743 220 -19898 -55648 -74669 -68162 -49089 -62915 -64624 -6482
20198f482K9705l6720k3338Q408J6498n2209j4175L70l2755K7998M262K6927N9585
$$ -6482 23223 -13497 -36835 -28427 -11929 -64138 -78313 -77943 -110698 -82700 -78438 -51511 8074
20185H074N1563l2661N720l9744J9575L372J2389O367j4338j3497l645n129R845
$$ 8074 59637 26976 32696 -7048 12527 15899 28288 34655 20317 6820 3175 -1954 7891
20172G891K7172l3622l4758k9186L1797M2223m998j1377J438j6574m2425k484
$$ 7891 35063 1441 -33317 -62503 -30706 11517 6519 -4858 -3420 -19994 -62419 -64903
20160f4903n96J6032L2271J7335Q182m8851k4420K0488m690P607q207J9853j4845
$$ -64903 -65499 -49467 -17196 139 8321 -40530 -64950 -44462 -49152 -41545 -49752 -29899 -44744
20147d4744j1292L8116L3310r881o3238l9116N1123K4495J6671M1341K1048P215
$$ -44744 -56036 -17920 15390 5509 -57729 -96845 -45722 -21227 -4556 36785 57833 65048
20135F5048j1196M3148q986j4768k0548k5586l9345k2604l0034k7734N5743k1589
$$ 65048 53852 97000 88014 73246 52698 27112 -12233 -34837 -64871 -92605 -36862 -58451
20123e8451k7379o573Q1454M3297m4530j250N073l1401J1979J3517j6831K1862
$$ -58451 -85830 -92403 -10949 32348 -12182 -13432 -8359 -39760 -27781 -14264 -31095 -9233
20111i233J0084M832L6123L8727L5965r063k4255k7066j5653m0496j8737L077
$$ -9233 851 5683 41806 80533 116498 107435 83180 56114 40461 -35 -18772 -15695
20099a5695k7863N6528M9154j427j2632n7733K4193K9637m0577j8309L5460k3056
$$ -15695 -43558 12970 62124 60697 48065 -9668 14525 44162 3585 -14724 20736 -2320
20087b320k3469l5519J5752J6345L8772J4505Q92j8919O020p339p450k4077j7420
$$ -2320 -25789 -61308 -45556 -29211 9561 24066 24958 6039 12059 4720 -2730 -26807 -44227
20074d4227K569K3327K2833L1819q179n2591J5137N1864Q675J684l0631l6482
$$ -44227 -41658 -18331 4502 36321 28142 -24449 -9312 42552 51227 52911 22280 -14202
20062a4202j6562K9853O723j0079J7428o862K9295J5277K0100k0305l4485J831
$$ -14202 -30764 -911 5812 -4267 13161 6299 35594 50871 70971 50666 16181 18012
20050A8012K4675k2782r276J5343j0770k3593j7233P27l686n657R45K750J0342
$$ 18012 42687 19905 10629 25972 15202 -8391 -25624 -24897 -28583 -34240 -33295 -30545 -20203
20037b0203J069k3246L7179L6126J8922R099k2289l1626l3890n858M7428o685
$$ -20203 -19134 -42380 -5201 30925 49847 58946 36657 5031 -28859 -34717 12711 6026
20025F026j0636n523o49L568P138M669o918K757m3243J862N2125J7546n5798l1294
$$ 6026 -4610 -10133 -10782 -7214 -76 4593 -2325 432 -42811 -40949 11176 28722 -27076 -58370
20011e8370J6425j4322K2006M423J28k245N7653K4055J8383l7269k863L46L0386
$$ -58370 -41945 -56267 -34261 -29838 -29710 -31955 25698 49753 68136 30867 28004 28350 58736
19998E8736k0159l78n880j4512Q415P781k1458M576j1857o282l430L2736J9159
$$ 58736 38577 38199 32319 17807 26222 34003 12545 17121 5264 -1018 -4448 28288 47447
19985D7447J3472o928m7662K6697m931j2194k6869k2006j7347K9602m0229o901
$$ 47447 60919 53991 6329 33026 28095 15901 -10968 -32974 -50321 -20719 -60948 -67849
19973f7849M3254J9051j3716K18Q331k1248R257L4341l9081k0663j3365N1308
$$ -67849 -24595 -5544 -19260 -19042 -10711 -31959 -22702 11639 -27442 -48105 -61470 -10162
19961a0162L8390m737J873K1903o330n913m051M3152J8239P659l928k1706m2564
$$ -10162 28228 23491 25364 47267 40937 35024 30973 74125 92364 100023 96095 74389 31825
19948C1825p719m4496k4341J7783O5852J0967J0225K21k2316l4264k8184J543
$$ 31825 24106 -20390 -44731 -26948 38904 49871 60096 60317 38001 3737 -24447 -22904
19936b2904k0600m614O082j8507J4151K9165o471M2597M240k0751m0426n05K8743
$$ -22904 -43504 -48118 -42036 -60543 -46392 -17227 -23698 18899 23139 2388 -38038 -38543 -9800
19923i800P246j4419N5360L1910n5088L9936K262k8650l661j2713m4351j9602
$$ -9800 -2554 -16973 38387 70297 15209 55145 57407 28757 25096 12383 -31968 -51570
19911e1570R075K5777J8760j753L8763q272k8956j3433p191n94P4157L5026j9091
$$ -51570 -42495 -16718 2042 289 39052 30780 1824 -11609 -18800 -19394 54763 89789 70698
19898G0698m3527L280J4779l089k8439r047l318L6604M313L0j7881L2692M3585
$$ 70698 27171 30451 45230 42141 13702 4655 1337 37941 42254 42284 24403 57095 100680
19885A00680N4149L0644N9825J55354J75033K17643J52363K3175m4654j51924
$$ 100680 154829 185473 245298 400652 575685 793328 945691 968866 924212 772288
19875G72288j74776j48749r8206p2025o3632k5021m4463j8283p761k1380j7203
$$ 772288 597512 448763 350557 278532 214900 189879 145416 127133 119372 97992 80789
19864H0789k6313K7252o6L2047Q566j4251K869l7734j2806l342J5660J3341l13
$$ 80789 54476 81728 81662 113709 122275 108024 110893 73159 60353 57011 72671 86012 85699
19851H5699K6628K2685p282l0092j8680J227m164j5351l2502l0488K8092J6180
$$ 85699 112327 135012 127730 97638 78958 80185 76021 60670 28168 -2320 25772 41952
19839D1952L1828K375k0070K5962n26J222j0523k3023m7598K1434N6803J0463
$$ 41952 73780 76155 56085 82047 81521 82743 72220 49197 1599 23033 79836 90299
19827I0299k5698K6395l825k4235k1485o1437J9271j3613k8764L1513O8179p558
$$ 90299 64601 90996 87171 62936 41451 -19986 -715 -14328 -43092 -11579 56600 49042
19815D9042j2733j2205J4109j2524l2197K3611n231K1488K5336n9238k0974K0402
$$ 49042 36309 24104 38213 25689 -6508 17103 11872 33360 58696 -542 -21516 -1114
19803a114L9528J3246m1259O87K1494M2932q582j5599l4520j8528L5285r69o146
$$ -1114 38414 51660 10401 11088 32582 75514 66932 51333 16813 -1715 33570 32601 26455
19790B6455J1656j7001K7882J0020J5487j4840j11J1012l6990m086N10k0323J2106
$$ 26455 38111 21110 48992 59012 74499 59659 59548 70560 33570 29484 29994 9671 21777
19777B1777o055j3918K4731K1489j3622J2745K6702L6263j7314q377J6341j2876
$$ 21777 15722 1804 26535 48024 34402 47147 73849 110112 92798 84421 100762 87886
19765H7886j9357o166j3347j389J4442q898j0565k3836n951j127N370L2740K1291
$$ 87886 68529 62363 49016 47627 62069 53171 42606 18770 12819 11692 17062 49802 71093
19752G1093j2541K591L836k7584J234k1908j3402j5689J8903K8737J6668L742
$$ 71093 58552 61143 64979 37395 38629 16721 3319 -12370 6533 35270 51938 55680
19740E5680k4151m293K0550l1495K3832M0589o2572K434M2534J2671m0050l7614
$$ 55680 31529 27236 47786 16291 40123 80712 18140 20574 63108 75779 35729 -1885
19728a885j7512k959K8096J2361J2354k9388q190L650K0977K1239k0081R289j0965
$$ -1885 -19397 -22356 5740 18101 30455 1067 -7123 -3473 17504 38743 18662 27951 16986
19715A6986l5352K5054L6161k8337J0905J3399K3343J6663K5167M286l9257l9736
$$ 16986 -18366 6688 42849 14512 25417 38816 62159 78822 103989 108275 69018 29282
19703B9282n206J4677q079j3738q244k5897K2584l839j7782L1073J6976o2047
$$ 29282 24076 38753 30674 16936 8692 -17205 5379 1540 -16242 14831 31807 -30240
19691c0240J3622P923j1804J5038K1048m747J2715J6971Q609Q167k0244l8686
$$ -30240 -16618 -8695 -20499 -5461 15587 10840 23555 40526 49135 57302 37058 -1628
19679a628j3217k5323O153K1715L4375J6357j5082j1613m3943J9727O7904J6506
$$ -1628 -14845 -40168 -34015 -12300 22075 38432 23350 11737 -32206 -12479 55425 71931
19667G1931q869k2962p656J142q45J7374L0265L288l3712m2862M0142P6047k1417
$$ 71931 63062 40100 32444 33586 32741 50115 80380 83668 49956 7094 47236 123283 101866
19654A01866j3519N304j121j2412l7842n8665k2084L9122K9400j2406J4742l317
$$ 101866 88347 93651 92530 80118 42276 -16389 -38473 649 30049 17643 32385 29068
19642B9068L306j7721L8938K3445k3148o1Q849k5950j4969L9304J5481k6302K7121
$$ 29068 32374 14653 53591 77036 53888 53827 62676 36726 21757 61061 76542 50240 77361
19629G7361J1949m2926L910P720J3352R58J1876k3296m5855J7807j421m3385k4554
$$ 77361 89310 46384 50294 58014 71366 72324 84200 60904 15049 32856 31435 -11950 -36504
19616c6504J7420O3136J9829l1224j203o249k5337l7489l40K6722R81j80L2029
$$ -36504 -19084 44052 63881 32657 31454 25205 -132 -37621 -37961 -11239 -10258 -10438 21591
19603B1591k727K502J0362j6806J9667M407K0165k8893j5353J1607N721K8581
$$ 21591 18864 21366 31728 14922 34589 38996 59161 30268 14915 26522 32243 60824
19591F0824N5130K6218m8092m3801k9553J2671K6693K5411o959K2075j3398j8210
$$ 60824 115954 142172 94080 50279 20726 33397 60090 85501 78542 100617 87219 69009
19579F9009R476k1463l6728m0960l0979K3684P0373R066n468o631N487j6430L563
$$ 69009 78485 57022 20294 -20666 -51645 -27961 42412 51478 46010 39379 44866 28436 31999
19566C1999J9850j1376j0708L2346K3252P89K2496l1800p569j1514m876m202k2176
$$ 31999 51849 40473 29765 62111 85363 86152 108648 76848 69279 57765 52889 48687 26511
19553B6511K5017k8679n9443k1072l4532P6010N0568L154m3428K66o456l4205
$$ 26511 51528 22849 -36594 -57666 -92198 -16188 34380 37534 -5894 -5628 -12084 -46289
19541d6289N8038M7873J6921j0897M535J496O880j3731j477K8494L9279l534n3036
$$ -46289 11749 59622 76543 65646 70181 71677 78557 64826 63349 91843 131122 127588 74552
19528G4552l415o610l5477n7070J9334L0494o451J3192J6862m23kj1256K4191
$$ 74552 71137 64527 29050 -28020 -8686 21808 15357 28549 45411 44988 44986 33730 57921
19515E7921L1368l4055m3085Q786M7153M0302j5704k6569j7341p0341o19L6944
$$ 57921 89289 55234 12149 20935 68088 108390 92686 66117 48776 -21565 -22184 14760
19503A4760J2526L1567J3780K0579j8177j0241n1398J4133J0497m647l5062J4277
$$ 14760 27286 58853 72633 93212 75035 64794 13396 27529 38026 33379 -1683 12594
19491A2594N0559J9348l6665L8187L4965m5672m1248K0820L1499o455l8755J2795
$$ 12594 63153 82501 45836 84023 118988 73316 32068 52888 84387 77932 39177 51972
19479E1972J9808J3808J192K25k704R836n9341r775J2700k1459k6501m797K2741
$$ 51972 71780 85588 86780 87005 84301 94137 34796 25021 37721 16262 -10239 -15036 7705
19466G705J1289L583l16n013j1281M350m984Q357k8117O701J0326J2251K2998
$$ 7705 18994 22577 22261 17248 5967 10317 5333 13690 -14427 -7726 2600 14851 37849
19453C7849R804m667l2821L1006J4884J1870J5312J0056M0048K0888L851l4339
$$ 37849 47653 42986 10165 41171 56055 67925 83237 93293 133341 154229 158080 123741
19441A23741m8471l8074j8634k5882n0508k3539J6114N4819M8295L4179O0104
$$ 123741 75270 37196 18562 -7320 -57828 -81367 -65253 -10434 37861 72040 132144
19430A32144l4430m3772q980m7615r944K3745N3494K3225p343j2153j6604j6192
$$ 132144 97714 53942 44962 -2653 -12597 11148 64642 87867 80524 68371 51767 35575
19418C5575O725L9606n0996n6855J2251q62K2962p990L255M7509K9446J0737K4406
$$ 35575 42300 81906 30910 -25945 -13694 -14556 8406 416 3671 51180 80626 91363 115769
19405A15769R677K525j0555R799m4008j2030J2482r225r116j8684N962L5682r680
$$ 115769 125446 127971 117416 127215 83207 71177 83659 74434 65318 46634 52596 88278 78598
19392G8598k2577j6039L3580M0405m1189J1377m834J684J7804J6098j8130J18
$$ 78598 56021 39982 73562 113967 72778 84155 79321 81005 98809 114907 96777 96895
19380I6895q317n2108j5653L3937K3704l144P539q78L91j1738o721l7224l8128
$$ 96895 88578 36470 20817 54754 78458 75314 82853 81975 82366 70628 63907 26683 -11445
19367a1445m4571k177M0678L2662L637K8498K4895j113L332M8331J421p187j2635
$$ -11445 -56016 -58193 -17515 15147 18784 47282 72177 71064 74396 122727 124148 116961 104326
19354A04326k8440k3333q410N1525K2674K8008n3686r710L3954J2241k1424k242
$$ 104326 75886 52553 44143 95668 118342 146350 92664 82954 116908 129149 107725 105483
19342A05483l916m407O817J407Q128l2719n172k5624p14l1231r218K2824K2685
$$ 105483 101567 97160 103977 105384 113512 80793 75621 49997 49283 18052 8834 31658 54343
19329E4343J5466J3669J042K176L4871k0531m1783L2968l9692o070n249l4104
$$ 54343 69809 83478 84520 86696 121567 101036 59253 92221 52529 46459 41210 7106
19317G106l737L1658L1594J3432j1394N009R495k921N532j3831q439l0859K0232
$$ 7106 3369 35027 66621 80053 68659 73668 83163 80242 85774 71943 63504 32645 52877
19304E2877J0758j1867M2538M1834O753k5216o633K2814J3881J0887j3045l5727
$$ 52877 63635 51768 94306 136140 142893 117677 111044 133858 147739 158626 145581 109854
19292A09854M740O2276j6290r111J1511N7984L1086O7454J05696J22018J54071
$$ 109854 114594 176870 160580 151469 162980 220964 252050 319504 425200 547218 701289
19281G01289P6515O2932J08086K7218j8567m4733j18009p4050l9378n3378k2699
$$ 701289 777804 840736 948822 976040 957473 912740 794731 720681 681303 627925 605226
19270F05226J6783l1002p9546n9741l5809J1335o098R73J0701l8785l9005P111
$$ 605226 622009 591007 511461 451720 415911 427246 421148 422121 432822 394037 355032 362143
19258C62143K1130J141J3761Q428O132l5136k735K7935J6900j8723j0305J7843
$$ 362143 383273 384414 398175 406603 412735 377599 374864 402799 419699 400976 390671 408514
19246D08514m2389l5917L947L55J0485k355K6713L4502Q667j9501O0567J7373
$$ 408514 366125 330208 334155 334510 344995 342640 369353 403855 412522 393021 453588 470961
19234D70961k5288j04118k8361N7949L5095K7826P279l0207m4439L3091R839K1318
$$ 470961 445673 341555 313194 371143 406238 434064 441343 411136 366697 399788 409627 430945
19222D30945K5233K5455l007K136K125J593n01O941l4119J3441J0318L4325k3239
$$ 430945 456178 481633 478626 480762 482887 484480 483979 490920 456801 470242 480560 514885 491646
19209D91646p039L9431K9557J8880Q525j3632m1119K5647O1533J5846O710m379
$$ 491646 484607 524038 553595 572475 581000 567368 526249 551896 613429 629275 635985 631606
19197F31606O1073J13670Q4843J03817P1788K4375k6343r9015j4610L0863J8942
$$ 631606 692679 806349 891192 995009 1066797 1091172 1064829 965814 951204 982067 1001009
19186A001009L4159L8666J20159K13223K42172L16631K56796J26600Q8128l6872
$$ 1001009 1035168 1073834 1193993 1407216 1649388 1966019 2222815 2349415 2437543 2400671
19176B400671n1722n16Q1142J17269J72502K84881L90469M44946O13543P88687
$$ 2400671 2348949 2348433 2429575 2546844 2719346 3004227 3394696 3839642 4453185 5241872
19166E241872Q12690R16118J020635J188596J621040K470399L697676N519518
$$ 5241872 6054562 6970680 7991315 9179911 10800951 13271350 16969026 22488544
19158B2488544Q678494J4048174K2358417L2450425L9226477L2970388J1913134
$$ 22488544 31167038 45215212 67573629 100024054 139250531 172220919 184134053
19151A84134053q221862k7263419l6346491k9678930k0161252j3254009q713450
$$ 184134053 175912191 148648772 112302281 82623351 62462099 49208090 40494640
19144D0494640n813671l942226k778003k050864j631090j474121j439479j384467
$$ 40494640 34680969 30738743 27960740 25909876 24278786 22804665 21365186 19980719
19136A9980719j264830j125252r62157q19212o19906n09307m82832l77138k63851
$$ 19980719 18715889 17590637 16628480 15809268 15189362 14680055 14197223 13820085 13556234
19127A3556234k21310k81658l31528m34536m81704m50640m15446m09134m02835
$$ 13556234 13334924 13053266 12721738 12287202 11805498 11354858 10939412 10530278 10127443
19118A0127443m00171k82660k68932k75865k47530j57682j27067j13992j31149
$$ 10127443 9727272 9444612 9175680 8899815 8652285 8494603 8367536 8253544 8122395
19109H122395j95726k06164k81609k98727k46780j93713j36133r0845j49364j88594
$$ 8122395 7926669 7720505 7438896 7140169 6893389 6699676 6563543 6472698 6323334 6134740
19099F134740j56290j49909j23457j35580j19661j21107j53408j23222j03480
$$ 6134740 5978450 5828541 5705084 5569504 5449843 5328736 5175328 5052106 4948626
19090D948626p3058n9086j4867n5829l4676L6013K3790K6579k9813r9631j65222
$$ 4948626 4875568 4816482 4801615 4745786 4711110 4747123 4770913 4797492 4767679 4668048 4502826
19079D502826j40077p8726J827K609p3746j14862m5292K7668m76M691j43864k37664
$$ 4502826 4362749 4284023 4285850 4288459 4214713 4099851 4054559 4082227 4081751 4086442 3942578 3704914
19067C704914j17416n4635l8906n4126n8418o6840o7830l8915P991o756j5809
$$ 3704914 3587498 3532863 3493957 3439831 3381413 3314573 3246743 3207828 3215819 3209063 3193254
19056C193254o4406j63144j63347j24614r2243p8575l8256k1481o5992j0173j8382
$$ 3193254 3128848 2965704 2802357 2677743 2585500 2506925 2468669 2447188 2381196 2371023 2352641
19045B352641m2634l3257J2844J558l2761o052k1841n9643p3395l0628p154l0530
$$ 2352641 2310007 2276750 2289594 2291152 2258391 2252339 2230498 2170855 2097460 2066832 2059678 2029148
19033B029148Q573M3289N8756O2777N9758L1504J066j5879k8898K67j7250K1804
$$ 2029148 2037721 2081010 2139766 2202543 2262301 2293805 2294871 2278992 2250094 2250361 2233111 2254915
19021B254915j3322l4087n2043p9123q1052n5340n6650K4995O5010J2380M2006
$$ 2254915 2241593 2207506 2155463 2076340 1995288 1939948 1883298 1908293 1973303 1985683 2027689
19010B027689o3399j10164j21145l6994k4026j76R6507J14845K9977M473l7758
$$ 2027689 1964290 1854126 1732981 1695987 1671961 1671785 1768292 1883137 1913114 1917587 1879829
18999A879829q4660q5379j47382j21534n9232m5694l5108k0610j9921j0487m8950
$$ 1879829 1795169 1709790 1562408 1440874 1381642 1335948 1300840 1280230 1260309 1249822 1200872
18988A200872m1499j2558K9086J4343m5684j9164m4698o3306k1101l9846P563
$$ 1200872 1159373 1146815 1175901 1190244 1144560 1125396 1080698 1017392 996291 956445 964008
18977I64008L0689L704j1694J7624K898m1910k7106j3668l7284n2588l7180l141
$$ 964008 994697 998401 986707 1004331 1007229 965319 938213 924545 887261 834673 797493 794352
18965G94352j3073P301k3081n9092Q478k2763L864L3123j7354j5460R234J1743
$$ 794352 781279 788580 765499 706407 714885 692122 695986 729109 711755 696295 705529 717272
18953G17272K698K8739m2829p983l424j4341q478l3232K3768M864k8955j3618
$$ 717272 719970 748709 705880 697897 694473 680132 671654 638422 662190 667054 638099 624481
18941F24481J7113j520M1141k0960r885l4199l5350k7064j625L332j5279j6900
$$ 624481 641594 640074 681215 660255 650370 616171 580821 553757 552132 555464 540185 523285
18929E23285J3535J8347m3752p740J2590j0891j3431M6677j710n2481m6910N695
$$ 523285 536820 555167 511415 503675 516265 505374 491943 538620 536910 484429 437519 443214
18917D43214R509q34K3330O7562k468j4529l7163k2818J8758j8772j8004j0520
$$ 443214 452723 451889 475219 542781 540313 525784 488621 465803 484561 465789 447785 437265
18905D37265k737L0571o728j3680P97K466k6360r010L9450j9231l6281J7690K6177
$$ 437265 434528 465099 458371 444691 445488 447954 421594 412584 452034 432803 396522 414212 440389
18892D40389O324J0365k4971J8296L742K7949L7320Q5447J61192K03239K06140
$$ 440389 446713 457078 432107 450403 454145 482094 519414 604861 766053 969292 1175432
18881A175432J43994O4260o8091j64101k07604j56124p0318n8706p0631j9531
$$ 1175432 1319426 1383686 1315595 1151494 943890 787766 717448 658742 588111 568580
18871E68580k6387k7346j6669j4536l0206k3146k8957k3313K4100L2496r285j0934
$$ 568580 542193 514847 498178 483642 453436 430290 401333 378020 402120 434616 425331 414397
18859D14397n912R272J5382k4100n91k154k6090J1736L6747k0571k7780m8661
$$ 414397 408485 417757 433139 409039 408448 406294 380204 391940 428687 408116 380336 331675
18847C31675m93J3946L074m022m8409r109k3011J3952J8784o483j9811J959K0871
$$ 331675 331182 345128 348202 344180 295771 286662 263651 277603 296387 289904 270093 272052 292923
18834B92923N1424j490K422j0214J877q890n249k0908K1778M1993j1255o3712
$$ 292923 344347 342857 345279 335065 336942 328052 322803 301895 323673 365666 354411 290699
18822B90699j2407K8933K4822n817J876J5026L6189L8041j1787J5388J4550M1954
$$ 290699 278292 307225 332047 326230 328106 343132 379321 417362 405575 420963 435513 477467
18810D77467j3571P250K542k8306k9286O448j0793j9218J1144q608j7940m990
$$ 477467 463896 471146 473688 445382 416096 422544 411751 392533 403677 395069 377129 372139
18798C72139o863l2589n221M3613L8070J0636r2P233l2661m0865n8505j509K3159
$$ 372139 365276 332687 327466 371079 409149 419785 419693 426926 394265 353400 294895 293386 316545
18785C16545j3505j8265M2144R124m613l0909l2798l1482J4326K6538q547j5279
$$ 316545 303040 284775 326919 336043 331430 300521 267723 236241 250567 277105 268558 253279
18773B53279l5471K8356M0709L3605P7008J23555J42799N2496j18435j15156p0679
$$ 253279 217808 246164 286873 320478 397486 521041 663840 716336 597901 482745 412066
18762D12066r8924r7036J66L4012K7220J4457O712Q558M4391M0265J296K3471
$$ 412066 313142 216106 216272 250284 277504 291961 298673 307231 351622 391887 393183 416654
18750D16654j07L181q512L2954K9259M2790J8213j6997l3864j50j8016k8035k3351
$$ 416654 416547 419728 411216 444170 473429 516219 534432 517435 483571 483421 465405 437370 414019
18737D14019r644K0960p886N1322K2638N2049J695l6301K890J5286m4643n1379
$$ 414019 404375 425335 417449 468771 491409 543458 545153 508852 511742 527028 482385 431006
18725D31006l8481Q415O315L8820N2939L400m4105n1260l975P214M756K3403L5469
$$ 431006 392525 400940 407255 446075 499014 502414 458309 407049 403074 410288 415044 438447 473916
18712D73916m1073l5083L7549L4477K7740L9546J6687M7393J0128L665j9224K9217
$$ 473916 432843 397760 435309 469786 497526 537072 553759 601152 611280 614945 595721 624938
18700F24938j1282L0817P6285K0378M3807P7780J03014J02038J55082J79705J57510
$$ 624938 613656 644473 720758 741136 784943 862723 965737 1067775 1222857 1402562 1560072
18689A560072J04962P5479J11781J4906l2905m1244o3402m0441J4383m2235k7959
$$ 1560072 1665034 1740513 1852294 1867200 1834295 1793051 1729649 1689208 1703591 1661356 1633397
18678A633397r3192n7883L0590K5533O3372P1205R9638N2801R7027J36876J17620
$$ 1633397 1540205 1482322 1512912 1538445 1601817 1673022 1772660 1825461 1922488 2059364 2176984
18667B176984J39355K5320j3326J1337l6186j10763j12605q0753j23587j01025
$$ 2176984 2316339 2341659 2328333 2339670 2303484 2192721 2080116 1999363 1875776 1774751
18657A774751o5816l9122K1973j624j4736M4235N1253Q602j0134j911j8239j7028
$$ 1774751 1708935 1669813 1691786 1690162 1675426 1719661 1770914 1779516 1769382 1767471 1749232 1732204
18645A732204J96K7410O2245Q7820J48495K15239J72814L3747l4945j809R2081
$$ 1732204 1732400 1759810 1822055 1909875 2058370 2273609 2446423 2480170 2445225 2443416 2535497
18634B535497Q0631O1069J67699K18133K86526M72984R26514J420156J772484
$$ 2535497 2616128 2677197 2844896 3063029 3349555 3822539 4749053 6169209 7941693
18625G941693J580202M77633K14304J326645L422449O290307Q977049Q288210
$$ 7941693 9521895 9999528 10213832 11540477 14962926 21253233 30230282 38518492
18617C8518492M43934o001274m793439r4411K497581N18927n414081n870955l406222
$$ 38518492 38962426 32961152 28167713 28073302 30570883 31089810 25675729 19804774 16398552
18608A6398552j905620j273995o25292L27737J685358L212097M209569L260842
$$ 16398552 14492932 13218937 12593645 12921382 14606740 17818837 22028406 25289248
18600B5289248j648544m801587l563050k193387j486591j086046q38026o04231
$$ 25289248 23640704 18839117 15276067 13082680 11596089 10510043 9672017 9067786
18592I067786l42604k05779n8026J22558J97673L14773N57390P09119R04991J162996
$$ 9067786 8725182 8519403 8461377 8583935 8781608 9096381 9653771 10362890 11267881 12430877
18582A2430877J608253K476620L994481N925734O690287L362006l988632n639725
$$ 12430877 14039130 16515750 20510231 26435965 33126252 36488258 32499626 26859901
18574B6859901l365414j437121j7694J305513K421334L590439N216397Q284884
$$ 26859901 23494487 22057366 22039672 23345185 25766519 29356958 34573355 42858239
18566D2858239J4313268K5228694M2246337O0822131O5440845L4290686r219414
$$ 42858239 57171507 82400201 124646538 185468669 250909514 285200200 275980786
18559B75980786k2406531l6034897m9302507l3897377j4901421l085462j473393
$$ 275980786 253574255 217539358 168236851 134339474 119438053 116352591 114879198
18552A14879198j2417146j3336206n952650J025576P714913J1998708R482235
$$ 114879198 102462052 89125846 83173196 84198772 91913685 103912393 113394628
18545A13394628L270736R357790K5569460M1492406M7759692L6215601J7288208
$$ 113394628 116665364 126023154 151592614 193085020 240844712 277060313 294348521
18538B94348521m559723l7882169n7816665m9035840l2024446k0096430j2883877
$$ 294348521 289788798 251906629 194089964 145054124 113029678 92933248 80049371
18531H0049371q352151n488569l783723k566603j438914k13491J425250L107353
$$ 80049371 71697220 66208651 62424928 59858325 58419411 58205920 59631170 62738523
18523F2738523L591425N14518n390791p724748o108178m313981l094098k204184
$$ 62738523 66329948 66844466 61453675 53728927 47620749 43306768 40212670 38008486
18515C8008486j638838j235773j000275q95650p84502n68908n49053o17817n81443
$$ 38008486 36369648 35133875 34133600 33237950 32453448 31884540 31335487 30717670 30136227
18506C0136227n59829m21700m3310N43915J499896K632227L587371K985864k23856
$$ 30136227 29576398 29154698 29111388 29655303 31155199 33787426 37374797 40360661 40136805
18497D0136805l663526m174747k822443j630982p81237J08189J375404K949580
$$ 40136805 36473279 32298532 29476089 27845107 27063870 27172059 28547463 31497043
18489C1497043M564143N326895L284312o87134j113183K412305N295774L633647
$$ 31497043 36061186 41388081 44672393 43985259 42872076 45284381 50580155 54213802
18481E4213802k794724q415967p990977m899229k711424j232761o57362j007793
$$ 54213802 51419078 43003111 35012134 30112905 27401481 26168720 25511358 24503565
18473B4503565j671854j765196j326429r83112q06762o66555n38539n18591m79047
$$ 24503565 22831711 21066515 19740086 18756974 17950212 17283657 16745118 16226527 15747480
18464A5747480m16144l44003l66256l83309l28060l14280k58637k32701k86044
$$ 15747480 15331336 14987333 14621077 14237768 13909708 13595428 13336791 13104090 12818046
18455A2818046l04562k07270j96711k00892l10646l40041k72669k67811k15638
$$ 12818046 12513484 12306214 12109503 11908611 11597965 11257924 10985255 10717444 10501806
18446A0501806k56756k20620j62381j07239j32626j79035j32344m5845k8101l7722
$$ 10501806 10245050 10024430 9862049 9754810 9622184 9443149 9310805 9264960 9236859 9199137
18436I199137q146r8969j50392j59070k17953j45379j62842j92775j29712j41273
$$ 9199137 9190991 9092022 8941630 8782560 8564607 8419228 8256386 8063611 7933899 7792626
18426G792626j21670r6742j07678q1231j4550m459J7542J40077J80837J05730
$$ 7792626 7670956 7574214 7466536 7385305 7370755 7366296 7383838 7523915 7704752 7810482
18416G810482J7172j02171k06724k53739k20173k30692j67880k11105k01874j02700
$$ 7810482 7827654 7725483 7518759 7265020 7044847 6814155 6646275 6435170 6233296 6130596
18406F130596j12815j32821r7318o7363l6583Q59K6559j4972K8604K1815m7828
$$ 6130596 6017781 5884960 5787642 5720279 5683696 5684555 5711114 5696142 5724746 5746561 5698733
18395E698733p3674j50546j79404j55692j55681j27774j10901j09201q5782j62601
$$ 5698733 5625059 5474513 5295109 5139417 4983736 4855962 4745061 4635860 4550078 4387477
18385D387477j53932n6316M641l6809p1715o1052j9447k8566l1998p1617r4262
$$ 4387477 4233545 4177229 4181870 4145061 4073346 4012294 3992847 3964281 3932283 3860666 3766404
18374C766404r6890n5007p8709j19687p6460O561R696j00768q8131J400L7922
$$ 3766404 3669514 3614507 3535798 3416111 3339651 3346212 3355908 3255140 3167009 3168409 3206331
18363C206331k5680L0117q296m3105l3586r0022p2478m2178m3082k8084m2856
$$ 3206331 3180651 3210768 3202472 3159367 3125781 3035759 2963281 2921103 2878021 2849937 2807081
18352B807081n3808p8450l2516l5385l1878l6405k5551m7971j4466m2115n7181
$$ 2807081 2753273 2674823 2642307 2606922 2575044 2538639 2513088 2465117 2450651 2408536 2351355
18341B351355j7473K695K6422k8939n1523k8280n2199k4039J5549L4575L1009
$$ 2351355 2333882 2336577 2362999 2334060 2282537 2254257 2202058 2178019 2193568 2228143 2259152
18330B259152q337L3084P2176R2138J40183J89619J72561J10789n3862j41178
$$ 2259152 2250815 2283899 2356075 2448213 2588396 2778015 2950576 3061365 3007503 2866325
18320B866325j78765k20098j50948p8320l9158m7138j8104J071l0061L6249O9803
$$ 2866325 2687560 2467462 2316514 2238194 2199036 2151898 2133794 2134865 2104804 2141053 2210856
18309B210856J09224J31291J62465K12022J82369Q9198K0830n548m8212j5476
$$ 2210856 2320080 2451371 2613836 2825858 3008227 3097425 3118255 3112707 3064495 3049019
18299C049019m9785k2205o9432o1387m7289M7255P9443J00381R7658J67707K54017
$$ 3049019 2999234 2977029 2907597 2846210 2798921 2846176 2925619 3026000 3123658 3291365 3545382
18288C545382K11069K07257L26603M18049M62523O41404Q18973J046513J364381
$$ 3545382 3756451 3963708 4290311 4708360 5170883 5812287 6631260 7677773 9042154
18279I042154J854053K633529L882786O051551R811137J6243303K6093371L7299785
$$ 9042154 10896207 13529736 17412522 23464073 33275210 49518513 75611884 112911669
18271A12911669M2506828L1642940Q842197j4027987l2802357l9057452l0824432
$$ 112911669 155418497 187061437 195903634 181875647 149073290 110015838 79191406
18264G9191406k0096050j2786606q216477n418290l714243k765041k137140j733219
$$ 79191406 59095356 46308750 38092273 32673983 28959740 26194699 24057559 22324340
18256B2324340j451732j240303j068754r56007r08621q24800p15936o23567n28923
$$ 22324340 20872608 19632305 18563551 17607544 16698923 15874123 15158187 14534620 14005697
18247A4005697m77341m71401m31051m25058m06231k85615k39623j82028r7473
$$ 14005697 13528356 13056955 12625904 12200846 11794615 11509000 11269377 11087349 10989876
18238A0989876q7605j27720m4230p4634k05670l21700l74122m13959m83768m25992
$$ 10989876 10902271 10774551 10730321 10655687 10450017 10128317 9754195 9340236 8856468 8430476
18228H430476l24709l03578k59985j95670j60807j68427j91517j35505q9905j30638
$$ 8430476 8105767 7802189 7542204 7346534 7185727 7017300 6825783 6690278 6600373 6469735
18218F469735j16236m1062L397R0274P0726J5097j14883k67538l18893k97412
$$ 6469735 6353499 6312437 6315834 6406108 6476834 6491931 6377048 6109510 5790617 5493205
18208E493205k19177j86668r9429j02235j70832j20773j04552j04488p7760k6287
$$ 5493205 5274028 5087360 4987931 4885696 4714864 4594091 4489539 4385051 4307291 4281004
18198D281004o4893o7043q8529p3826q1405j05183j33618o1749q533r8719n1474
$$ 4281004 4216111 4149068 4060539 3986713 3905308 3800125 3666507 3604758 3596225 3497506 3446032
18187C446032l4658j19019j19974n6038n4758m9267l0571l4200j8777j9922j01965
$$ 3446032 3411374 3292355 3172381 3116343 3061585 3012318 2981747 2947547 2928770 2908848 2806883
18176B806883q1669l7608l1432m9091n9811o9915m7043m4352o7654o869l6889
$$ 2806883 2725214 2687606 2656174 2607083 2547272 2477357 2430314 2385962 2318308 2311439 2274550
18165B274550p3888L1326K7362j2354j7699k9105k4835o2291p0848q022R103o8167
$$ 2274550 2200662 2231988 2259350 2246996 2229297 2200192 2175357 2113066 2042218 2034196 2043299 1975132
18153A975132j6478k0323k0539K7387L7195O3628J01379P1459M5735l654M3913
$$ 1975132 1958654 1938331 1917792 1945179 1982374 2046002 2147381 2218840 2264575 2260921 2304834
18142B304834J5552o7322j06590r2561o9594n2399m8033m0526K917J4044k4565
$$ 2304834 2320386 2253064 2146474 2053913 1984319 1931920 1883887 1843361 1846278 1860322 1835757
18131A835757j8537J031k140m4750M356O0284L8174L3717Q2545J24653J01437
$$ 1835757 1817220 1818251 1816111 1771361 1775717 1836001 1874175 1907892 1990437 2115090 2216527
18120B216527J69919K23543K50575L81792O51038R47669J461032K482708M797583
$$ 2216527 2386446 2609989 2860564 3242356 3893394 4841063 6302095 8784803 13582386
18111A3582386R290710J5167834J8756694J0592953j7967008j8542235r951740
$$ 13582386 22873096 38040930 56797624 67390577 49423569 30881334 20929594
18104B0929594n798233l586630k173268j354575q27753o04266m76863m48575m00105
$$ 20929594 15131361 11544731 9371463 8016888 7189135 6584869 6108006 5659431 5259326
18095E259326k77172k24118j76745k07844k18492j82059j08980j45498j34321
$$ 5259326 4982154 4758036 4581291 4373447 4154955 3972896 3863916 3718418 3584097
18086C584097j05059m7009m0846n1658o7511l7308K9169M2319M420j50742j76548
$$ 3584097 3479038 3432029 3391183 3339525 3272014 3234706 3263875 3306194 3310614 3159872 2983324
18075B983324j40695o7745m2619m2459o3936j3865J5279j8669n8475j24296j13730
$$ 2983324 2842629 2774884 2732265 2689806 2625870 2612005 2627284 2608615 2550140 2425844 2312114
18064B312114m5431j0893N5113j2140o4297m9758o8775r8491q7856j14074o3933
$$ 2312114 2266683 2255790 2310903 2298763 2234466 2184708 2115933 2017442 1929586 1815512 1751579
18053A751579R538n0727q8551j9319p2077r9313j9194M138K1129K0415N335J2151
$$ 1751579 1761117 1710390 1621839 1602520 1530443 1431130 1411936 1416074 1437203 1457618 1462953 1475104
18041A475104N7896Q7002N3172N5141k9973l2519l7607l6566k9913l7880j05421
$$ 1475104 1533000 1620002 1673174 1728315 1698342 1665823 1628216 1591650 1561737 1523857 1418436
18030A418436k6366J3743J5540Q4590R0356N5891j0396r015J7119o487m3981j29314
$$ 1418436 1392070 1405813 1421353 1505943 1596299 1652190 1641794 1632779 1649898 1643411 1599430 1470116
18018A470116l5877j3250o6021j65318q7713l1784J950O9209N5535j85o5757k9442
$$ 1470116 1434239 1420989 1354968 1189650 1101937 1070153 1072103 1141312 1196847 1196662 1130905 1101463
18006A101463l0456m7216k4181m5016k5906n8482k3291m5568n5542L435o563l3084
$$ 1101463 1071007 1023791 999610 954594 928688 870206 846915 801347 745805 749240 742677 709593
17994G09593r141K7308O0290K7121K3709P0599O6957N6025k3670k6235M4472J8684
$$ 709593 700452 727760 788050 815171 838880 909479 976436 1032461 1008791 982556 1027028 1045712
17982A045712K1013n3380j11298q5164o4500n3956r525j0796k5619m585J1026
$$ 1045712 1066725 1013345 902047 816883 752383 698427 688902 678106 652487 647902 658928
17971F58928N8953J16945J17283P6080l4208j04875r3971r0216m5468l9166m8062
$$ 658928 717881 834826 952109 1028189 993981 889106 795135 704919 659451 620285 572223
17960E72223l1538p68k3804m8882k3601l4641j0596L5502K7462j3081J5964J0125
$$ 572223 540685 539917 516113 467231 443630 408989 398393 433895 461357 448276 464240 474365
17948D74365k9287k9080j7440P366k7777o7589m8934J0584M9257l1818m6889j5328
$$ 474365 445078 415998 398558 405924 378147 310558 261624 272208 321465 289647 242758 227430
17936B27430J75P412J0285N7875M4776Q03m5314j3330n849k7728l6486n002p238
$$ 227430 227605 235017 245302 303177 347953 348756 303442 290112 284263 256535 220049 215047 207809
17923B07809j7088m1805l451J7647j6807l0680n12L2524L0720J754j3925l175
$$ 207809 190721 148916 145465 163112 146305 115625 115113 147637 178357 180111 166186 163011
17911A63011J8490L652J3572K2063l3936k4421j2892j5161P593K904Q401j1515
$$ 163011 181501 185153 198725 220788 186852 162431 149539 134378 141971 144875 153276 141761
17899A41761j0961n306K0273j0077O635J532k4481l4017j062k945O006K0192k3679
$$ 141761 130800 125494 145767 135690 142325 143857 119376 85359 84297 81352 87358 107550 83871
17886H3871j8666L724N356K2587J7453k3178N234q5j5656J7577j0551j1431K5122
$$ 83871 65205 68929 74285 96872 114325 91147 96381 96296 80640 98217 87666 76235 101357
17873A01357K5213J9361N186m5009k2967J8131J373m0862J4297L3045L9929k2326
$$ 101357 126570 145931 151117 106108 83141 101272 102645 61783 76080 109125 149054 126728
17861A26728o3566M8j7355j4758Q708j4316L001M88r222K80l3755L5601J3228
$$ 126728 63162 63210 45855 31097 39805 25489 28490 28978 19756 20036 -13719 21882 35110
17848C5110L0793k5631k8714N6466j0533K6869P247L151J9634K1856k2782k1010
$$ 35110 65903 40272 11558 68024 57491 84360 91607 94758 114392 136248 113466 92456
17836I2456m5488j941K9443L8722j160m0878m402K2321l6168l7686m9555J4756
$$ 92456 46968 45027 74470 113192 112032 71154 66752 89073 52905 15219 -34336 -19580
17824a9580O4858K8996j5315J110k3792L6286N5477m075l5504m1805j374L5324
$$ -19580 45278 74274 58959 60069 36277 72563 128040 123965 88461 46656 45282 80606
17812H0606M457j2888J4886k3632r916k6378J4556P685k005J3354M94k1465J7774
$$ 80606 85063 72175 87061 63429 53513 27135 41691 49376 47371 60725 61219 39754 57528
17799E7528J7656l3085J2299j7314k6589L839j7534L090J1323l4213l3550l0746
$$ 57528 75184 42099 54398 37084 10495 14334 -3200 -110 11213 -23000 -56550 -87296
17787h7296K8483L5036K1994n942L0315n8l5074j1881L055K6421K2033J5232m387
$$ -87296 -58813 -23777 -1783 -7725 22590 22532 -12542 -24423 -21368 5053 27086 42318 37931
17774C7931l499k6561L1636K2556k2204J427k7670m5086k9692o189L4625M677
$$ 37931 34432 7871 39507 62063 39859 41286 13616 -31470 -61162 -67351 -32726 -28049
17762b8049p928L0591R657k681J0645M769n6411K5235K3727J324K0822K0666l1727
$$ -28049 -35977 -5386 4271 1590 12235 17004 -39407 -14172 9555 10879 31701 52367 20640
17749B0640R008k6446m849J2369O651r854J0626L9653J4928n1144J0906K8384
$$ 20640 29648 3202 -1647 10722 17373 7519 18145 57798 72726 21582 32488 60872
17737F0872j8525j4445J3347J3075j7275j9821k7797j5431K3161K8055K0772J0334
$$ 60872 42347 27902 41249 54324 37049 17228 -10569 -26000 -2839 25216 45988 56322
17725E6322J9702J0298k3998k7268k3731k585j2734n104j9508l50R731k7867j659
$$ 56322 76024 86322 62324 35056 11325 8740 -3994 -9098 -28606 -28956 -19225 -47092 -48751
17712d8751K9237o737j9999J2705N779r430j4653L9436J6218Q287K5841N865q267
$$ -48751 -19514 -26251 -46250 -33545 -27766 -37196 -51849 -12413 3805 12092 37933 43798 35531
17699C5531n7934p249k0611O358Q3636j4462l3161M884n533J5770o866k2183m3923
$$ 35531 -22403 -29652 -50263 -43905 39731 25269 -7892 -3008 -8541 7229 363 -21820 -65743
17686f5743K7699j0143k3390J0068M9544R684L1836K0010k112m5203J4559K9774
$$ -65743 -38044 -48187 -71577 -61509 -11965 -2281 29555 49565 47453 2250 16809 46583
17674D6583O967n3276k4867O667K5121K1985N224l6593k8136L729L4839R975k4740
$$ 46583 53550 274 -24593 -17926 7195 29180 34404 -2189 -30325 -26596 8243 18218 -6522
17661f522L147Q636L2821J02912Q2632M7951Q1149J61538J97051J87479R7573
$$ -6522 -3375 5261 38082 140994 223626 271577 352726 514264 711315 898794 996367
17650I96367k4194j06712j77860j72712j05262q4596o6079p5408n3134o804N279
$$ 996367 972173 865461 687601 514889 409627 325031 258952 183544 130410 123606 128885
17639A28885r800k6242R027J4687k5053j0683k1507q586L8255K7736j8967m5559
$$ 128885 119085 92843 101870 116557 91504 80821 59314 50728 88983 116719 97752 52193
17627E2193l013P566K6589j0682J25k3934l6035K4359K966K1896j2175m772K2944
$$ 52193 49180 56746 83335 72653 72778 48844 12809 37168 40134 62030 49855 45083 68027
17614F8027L8746O35l4146K2611k1288m673j9496j9732N874K1874p255l4482k0756
$$ 68027 106773 107408 73262 95873 74585 69912 50416 30684 36558 58432 51177 16695 -4061
17601d061J3448l5796K1750N2812l4967K5410J2436j9172p403J4777M0461j9170
$$ -4061 9387 -26409 -4659 48153 13186 38596 51032 31860 24457 39234 79695 60525
17589F0525O203K87k0866L5289J7051P724l1655j2659j9628k9484j2791K5388
$$ 60525 66728 67015 46149 81438 98489 106213 74558 61899 42271 12787 -4 25384
17577B5384N5171J3059j9326l0493j9523k5132j1508p055J8813J9322m7917j3197
$$ 25384 80555 93614 74288 43795 24272 -860 -12368 -19423 -610 18712 -29205 -42402
17565d2402J6787K7348K3729J0514J5934M2188l3297n5725J2685j3371j3258l393
$$ -42402 -25615 1733 25462 35976 51910 94098 60801 5076 17761 4390 -8868 -12261
17553a2261l3579J5876J0129j1553l7116j9238Q707M8505r270N565K1891J4864
$$ -12261 -45840 -29964 -19835 -31388 -68504 -87742 -79035 -30530 -39800 -34235 -12344 2520
17541B520N1328Q581J251k6850p059j5318r14m251N231N3286R29o8572l7099J5330
$$ 2520 53848 62429 63680 36830 29771 14453 13539 9288 14519 67805 68734 162 -36937 -21607
17527b1607L290J3710J2414L4387j7938k8235k0651k5562l3239N6247N6630K03
$$ -21607 -18317 -4607 7807 42194 24256 -3979 -24630 -50192 -83431 -27184 29446 29649
17515B9649k3941j1170N0692J8846j8643m5215r784R997J3373q3L5608j472j8092
$$ 29649 5708 -5462 45230 64076 45433 218 -9566 431 13804 13721 49329 47857 29765
17502B9765L953J6690J3181k6765m3946l1992J5379p885K7068j3060J7649K5968
$$ 29765 33718 50408 63589 36824 -7122 -39114 -23735 -31620 -4552 -17612 37 26005
17490B6005L1091o3618l6946R870l275M838J4441L9138J7942m0052N644R62l264
$$ 26005 57096 -6522 -43468 -33598 -36873 -32035 -17594 21544 39486 -566 5078 6040 2776
17477B776j7125j7430O021j7970K0167K7919K8960J599K076m393j4484k6903L0849
$$ 2776 -14349 -31779 -25758 -43728 -23561 4358 33318 34917 36993 32600 18116 -8787 22062
17464B2062r006n1531J0834M8764j1582q500N956M9935k4276j0229l235k9807
$$ 22062 13056 -38475 -27641 21123 9541 1041 6997 56932 32656 22427 19192 -10615
17452a0615K5206K5311J2205n4691j0256M1563K031L3764Q7112R9511O2479n0713
$$ -10615 14591 39902 52107 -2584 -12840 28723 30754 64518 151630 251141 313620 262907
17440B62907r5171k8222q1403k9687o797j9877O8070p655j7288p435k4742m1311
$$ 262907 167736 139514 58111 28424 21627 1750 69820 62165 44877 37442 12700 -28611
17428b8611K0703M0415J0408l13p31m6954K225L7296l8237j7431O510K7793j3304
$$ -28611 -7908 32507 42915 42602 41871 -5083 -2858 34438 -3799 -21230 -14720 13073 -231
17415b31j8700n384J7717L4204l1139m980p8080k0949N9434n581p566K842K1304
$$ -231 -18931 -24315 -6598 27606 -3533 -8513 -86593 -107542 -48108 -53689 -61255 -58413 -37109
17402c7109K1904j3553J2739J8124l5759j0674Q052K6782j4117m2979K600J2482
$$ -37109 -15205 -28758 -16019 2105 -33654 -44328 -36276 -9494 -23611 -66590 -63990 -51508
17390e1508j351K097J3604K7210q519n4369K1365K7889J6772p229K3083L745l2891
$$ -51508 -52859 -50762 -37158 -9948 -18467 -72836 -51471 -23582 -6810 -14039 9044 12789 -20102
17377b0102j8391j2313l1341K974L8296K2423J7838k7903j5169L5538J9374k6819
$$ -20102 -38493 -50806 -82147 -79173 -40877 -18454 -616 -28519 -43688 -8150 11224 -15595
17365a5595L4560M0835l8234l6795Q883K0896m8830J4323l4743p021J2088J1847
$$ -15595 18965 59800 21566 -15229 -6346 14550 -34280 -19957 -54700 -61721 -49633 -37786
17353c7786K4256K0232j9766j7898l3169N7794M4014N85J2396j6483J493r521
$$ -37786 -13530 6702 -13064 -30962 -64131 -6337 37677 38262 50658 34175 35668 26147
17341B6147n4219l3672p470k4502J6684R579j2735L2203L4047J0277R44l1138
$$ 26147 -28072 -61744 -69214 -93716 -77032 -67453 -80188 -47985 -13938 -3661 -2717 -33855
17329c3855k2547j7868K1853l195j0324m7m0857m1591K37K5465q900L203M7171
$$ -33855 -56402 -74270 -52417 -55612 -65936 -65983 -106840 -148431 -148194 -122729 -131629 -128426 -81255
17316h1255J06400K9857m0308l8479k0020O2548K3064j4975l3772j4151n6872
$$ -81255 25145 55002 14694 -23785 -43805 18743 41807 26832 -6940 -21091 -77963
17305g7963m59K0810K980M2304J1730n6261j8694K3135R982J9300n144L085J4261
$$ -77963 -78422 -57612 -54632 -12328 -598 -56859 -75553 -52418 -42436 -23136 -28280 -25195 -10934
17292a0934J4635j9989m1955p491M548J7874L1811o297O864J3105m789J4538m1926
$$ -10934 3701 -16288 -58243 -65734 -61186 -43312 -11501 -17798 -10934 2171 -2618 11920 -30006
17279c0006m289j4715k7566N442L5582K1480k0173J4670K5327K5796j8592Q602
$$ -30006 -34295 -49010 -76576 -71134 -35552 -14072 -34245 -19575 5752 31548 12956 21558
17267B1558j8602j280j9575k8155K5239Q325R025j7669r044j8853j0950m551K8519
$$ 21558 2956 1676 -17899 -46054 -20815 -12490 -3465 -21134 -30178 -49031 -59981 -64532 -36013
17254c6013j069N826L9103j0458j4233j6078J7875j9040l1081J765M0770O629
$$ -36013 -37082 -31256 7847 -2611 -16844 -32922 -15047 -34087 -65168 -63403 -22633 -16004
17242a6004l8498j5027j031m874m580M1988M1507K095m1581k1242n3584j3843
$$ -16004 -54502 -69529 -70560 -75434 -80014 -38026 3481 5576 -36005 -57247 -110831 -124674
17230a24674L3271O5777K4790P025l3382r103l4715L017M7921K4224J3873l7770
$$ -124674 -91403 -25626 -836 6189 -27193 -36296 -71011 -67994 -20073 4151 18024 -19746
17218a9746L6262j665k3023L4595M3088q309j6925K1008j6130n7816l922J7741
$$ -19746 16516 14851 -8172 26423 69511 61202 44277 65285 49155 -8661 -12583 5158
17206E158m9396J1194K237l127P37K8889J3117o786j8622j9836J5625q246j7457
$$ 5158 -44238 -33044 -30807 -33934 -33197 -4308 8809 2023 -16599 -36435 -20810 -29056 -46513
17193d6513p755j1352N5979J9671Q74R309o9913m8274J6314K7770K6984K7265
$$ -46513 -54268 -65620 -9641 10030 10904 20213 -49700 -97974 -81660 -53890 -26906 359
17181C59k002k6007p045L9320J8090J5198l0919j0254k0096K5221K7958k7804
$$ 359 -1643 -27650 -34695 4625 22715 37913 6994 -3260 -23356 1865 29823 2019
17169B019K4460K7286k1768m1035K6287L925K4867R386l6668o5825L4271K9062
$$ 2019 26479 53765 31997 -9038 17249 21174 46041 55427 18759 -47066 -12795 16267
17157A6267l1750R022j9903k237k3324K9026N6757K3734m4482p9761l4371M7812
$$ 16267 -15483 -6461 -26364 -28601 -51925 -22899 33858 57592 13110 -66651 -101022 -53210
17145e3210K5069J4568K5834N4278L7000l3952k2124L449M378j7251K7447J1306
$$ -53210 -28141 -13573 12261 66539 103539 69587 47463 50912 55290 38039 65486 76792
17133G6792l4372j3894k8683K3405k8928l3465N3507k0051m6897J466k6968k1873
$$ 76792 42420 28526 -157 23248 -5680 -39145 14362 -5689 -52586 -51120 -78088 -99961
17121i9961K9530j6201J2937N725j2827J6441K5556j5162l7210K1170J4814l620
$$ -99961 -70431 -86632 -73695 -67970 -80797 -64356 -38800 -53962 -91172 -70002 -55188 -58808
17109e8808M5378M6164j584L964m219k0660l4676l5021Q812K0334K8353r396K935
$$ -58808 -13430 32734 31150 35114 30895 10235 -24441 -59462 -50650 -30316 -1963 -11359 -8424
17096h424J0223j3955m8770J1856L4366k2892m9523M2211K6169K0825L3908k1207
$$ -8424 1799 -12156 -60926 -49070 -14704 -37596 -87119 -44908 -18739 2086 35994 14787
17084A4787k0259Q12Q251J3799J1619K9685o817J6742l4751l5074j6060M47K3000
$$ 14787 -5472 -4660 3591 17390 29009 58694 51877 68619 33868 -1206 -17266 -16819 6181
17071F181K5276l2692p945m1255j2846K524K9688q66J8157M631K1175J3586M1129
$$ 6181 31457 -1235 -9180 -50435 -63281 -60757 -31069 -31935 -13778 -9147 12028 25614 66743
17058F6743J0617q852j8652o1081j8831J6531l301J1840P181m8747L1172p234
$$ 66743 77360 68508 49856 -11225 -30056 -13525 -16826 -4986 2195 -46552 -15380 -22614
17046b2614j6722o344L0679K2438k6259k3382J140m873K4054J2762l1586q838
$$ -22614 -39336 -45680 -15001 7437 -18822 -42204 -41064 -45937 -21883 -9121 -40707 -49545
17034d9545K3771j3128J3878R4291P835J6683Q419k2758o879P346l0695l7104
$$ -49545 -25774 -38902 -25024 69267 77102 93785 102204 79446 72567 79913 49218 12114
17022A2114k8178j8292L1071L662J0842J1599k0992j0491o0248j3327L8217N1735
$$ 12114 -16064 -34356 -3285 377 11219 22818 1826 -8665 -68913 -82240 -44023 7712
17010G712l5998j9923r311j8144k7396P820M2408J7950l627J5494L8135J6520
$$ 7712 -28286 -48209 -57520 -75664 -103060 -95240 -52832 -34882 -38509 -23015 15120 31640
16998C1640l6500j8230j1838K2336L0784k8251j5129n002J3808l3851j0367L4772
$$ 31640 -4860 -23090 -34928 -12592 18192 -10059 -25188 -30190 -16382 -50233 -60600 -25828
16986b5828K9518j156J710J0924K3199j5292l7960L896l2270l3910M625K0833
$$ -25828 3690 2534 4244 15168 38367 23075 -14885 -10989 -43259 -77169 -72544 -51711
16974e1711L9582L5238Q433l4214j3952L9553O4698L868l6053K216r362o1286
$$ -51711 -12129 23109 31542 -2672 -16624 22929 87627 91495 55442 57658 48296 -12990
16962a2990J5600k0618p7490m3005L2018O5075K3631J1343K5044J2136m4587o038
$$ -12990 2610 -18008 -95498 -138503 -106485 -41410 -17779 -6436 18608 30744 -13843 -19881
16950a9881j9411Q075Q468K6591J32K824m4567k3247j3214K4680J9084J8852J6945
$$ -19881 -39292 -31217 -22749 3842 3974 6798 -37769 -61016 -74230 -49550 -30466 -11614 5331
16937E331l1593n3814k0097L5942L6188J6267N0726N999j8481K0744l342n6984
$$ 5331 -26262 -80076 -100173 -64231 -28043 -11776 38950 44949 26468 47212 43870 -13114
16925a3114k8050J5884l1869M628J0078J3385J7849j4917k8853L4138J9064K6737
$$ -13114 -41164 -25280 -57149 -52521 -42443 -29058 -11209 -26126 -54979 -20841 -1777 24960
16913B4960J4757m189m3492l6549L768K3593L4863o97l7010j1921O619r876l72
$$ 24960 39717 35528 -7964 -44513 -40745 -17152 17711 17014 -19996 -31917 -25298 -35174 -35546
16900c5546K8489l875k2759L6438k8558l3869K1072K5805J8250k7485j6626j9055
$$ -35546 -7057 -10932 -33691 2747 -25811 -59680 -38608 -12803 5447 -22038 -38664 -57719
16888e7719K7781J9783l9122J1646k716r389k397R614J6867J022J3528p721l050
$$ -57719 -29938 -10155 -49277 -37631 -40347 -49736 -52133 -42519 -25652 -24630 -11102 -18823 -21873
16875b1873L3187N357K9314j333j5271r539o535l6864R144r449j3958j4043M726
$$ -21873 11314 16671 45985 44652 29381 19842 13307 -23557 -14413 -23862 -37820 -51863 -47137
16862d7137N681O497J1561J2543L225q269J0757l622K8379Q6485L6908l9361o9446
$$ -47137 -41456 -34959 -23398 -10855 -7630 -15899 -5142 -8764 19615 106100 143008 103647 34201
16849C4201p110K7192k9609n0708M3880N9297Q230k5852k9777k3925j7376k8402
$$ 34201 27091 54283 24674 -26034 17846 77143 85373 59521 29744 5819 -11557 -39959
16837c9959j0751n317M6230K2837K1711L9604J7552m8543r1855j2663K9997K3339
$$ -39959 -50710 -56027 -9797 13040 34751 74355 91907 43364 -48491 -61154 -31157 -7818
16825g818M2269r364J1194P030J6286k3491j5198m4075J8989N675k7807j7302
$$ -7818 34451 25087 36281 43311 59597 36106 20908 -23167 -4178 1497 -26310 -43612
16813d3612J0277J7615m0897l1699m4441M715L7896M3606n081j8189J9445K479
$$ -43612 -33335 -15720 -56617 -88316 -132757 -128042 -90146 -46540 -51621 -69810 -50365 -47886
16801d7886j3596K742K8054L9466M6529j6285l9320R315l2683J067M905J9192
$$ -47886 -61482 -58740 -30686 8780 55309 39024 -296 9019 -23664 -22597 -17692 1500
16789A500J7635k8768o7577j7377O6970l6451j7169m072J6167J749J0901O20J7880
$$ 1500 19135 -9633 -77210 -94587 -27617 -64068 -81237 -85309 -69142 -67393 -56492 -55872 -37992
16776c7992J2224k4976l1757L3669L6014l3911n1589K3662N0042K4789K0544J1354
$$ -37992 -25768 -50744 -82501 -48832 -12818 -46729 -98318 -74656 -24614 175 20719 32073
16764C2073j5222n2326k7246K0119j6790k1460p723j0210M5814K2413M6752M52
$$ 32073 16851 -35475 -62721 -42602 -59392 -80852 -88575 -98785 -52971 -30558 16194 16646
16752A6646Q789K123k1757q75m020j2972j8111k5204q743K5042L3084m302Q010
$$ 16646 25435 27558 5801 4926 906 -12066 -30177 -55381 -64124 -39082 -5998 -10300 -2290
16739b290j7303l8703L737K2748K8902K5804M462l0395l1594J609k8327k1647
$$ -2290 -19593 -58296 -54559 -31811 -2909 22895 27357 -3038 -34632 -33023 -61350 -82997
16727h2997M7505J7479J1546K8032J5540o3912m3465K8639P867L3685L4730k8777
$$ -82997 -35492 -18013 -6467 21565 37105 -26807 -70272 -41633 -33766 -81 34649 5872
16715E872J0057L1209J4184k3680l76m3488l3927Q783k7809k0947k054M7197K6471
$$ 5872 15929 47138 61322 37642 37266 -6222 -40149 -31366 -59175 -80122 -82176 -34979 -8508
16702h508J5082L2707P992m5542k4428l1848L987P2236L0920k3688j0762k1795
$$ -8508 6574 39281 47273 1731 -22697 -54545 -50558 21678 52598 28910 18148 -3647
16690c647n915L883k053J8428j1904m4153m3382m1278J6961M3077L0339Q93l4199
$$ -3647 -9562 -5679 -7732 10696 -1208 -45361 -88743 -130021 -113060 -69983 -39644 -38751 -72950
16677g2950O053j1833k1577L7429R0071J6638r562m1009p0515p316L2079K9917
$$ -72950 -66897 -78730 -100307 -62878 27193 43831 34269 -6740 -77255 -84571 -52492 -22575
16665b2575K501k5026j7752K4890m4342l126k3038m0428K8561n076M913M2429
$$ -22575 -20074 -45100 -62852 -37962 -82304 -85430 -108468 -148896 -120335 -125411 -120498 -78069
16653g8069K5092l837L5203L5711j0939P701N0637N194j2307J5790m217l0875
$$ -78069 -52977 -56814 -21611 14100 3161 10862 61499 66693 54386 70176 65959 35084
16641C5084j6064l6264M830l3090K626L5873q749k2530K1538J2557k6973o813
$$ 35084 19020 -17244 -12414 -45504 -42878 -7005 -15754 -38284 -16746 -4189 -31162 -37975
16629c7975K1937L8404n540n231L043J8995L5144J2526l466l4875j6567l3173
$$ -37975 -16038 22366 16826 11595 14638 33633 68777 81303 77837 42962 26395 -6778
16617f778k7752k2990K0269k1126j81L0801j2513k3761l0084J2616K4734N052
$$ -6778 -34530 -57520 -37251 -58377 -58558 -27757 -40270 -64031 -94115 -81499 -56765 -51713
16605e1713r808K2818j1914K3110k4352J4105N5055k2233l2729J1481M084Q246
$$ -51713 -61521 -38703 -50617 -27507 -51859 -37754 17301 -4932 -37661 -26180 -22096 -13850
16593a3850N4270O162k3144L635k3578j2182k7178K0971M758l5106o053K7595
$$ -13850 40420 46582 23438 27073 3495 -8687 -35865 -14894 -10136 -45242 -51295 -23700
16581b3700M114L797M7351J9245r492J5368j831k4552o0906J2586K7640k2513
$$ -23700 -19586 -15789 31562 50807 41315 56683 54852 30300 -30606 -18020 9620 -12893
16569a2893M603J1504j0750J2307j0982K5146k8479R450j7274l3042k01M964O577
$$ -12893 -8290 3214 -7536 4771 -6211 18935 -9544 -94 -17368 -50410 -50611 -45647 -39070
16556c9070N9968O9342p888k4983j2994j4217M519n7914k6419m9315K0601J9475
$$ -39070 20898 90240 82352 57369 44375 30158 34677 -23237 -49656 -98971 -78370 -58895
16544e8895l6434M5146Q322k0255J5129q900K4096k1577O768L6675J1072k3416
$$ -58895 -95329 -50183 -41861 -62116 -46987 -55887 -31791 -53368 -46600 -9925 1147 -22269
16532b2269l0790N773j1954K4155K4453M0619J9325j942p663J27j7566o0314l6982
$$ -22269 -53059 -47286 -59240 -35085 -10632 29987 49312 47370 39707 39834 22268 -38046 -75028
16519g5028J4566L0780N562K3937L8314k1031M298p287m5751K4662K6465l0174
$$ -75028 -60462 -29682 -24120 -183 38131 17100 21398 14111 -31640 -6978 19487 -10687
16507a0687m3096Q905Q555J3588M5290j7780J3132m1612o514k1075m9937K05L4055
$$ -10687 -53783 -44878 -36323 -22735 22555 4775 17907 -23705 -30219 -51294 -101231 -101026 -66971
16494f6971k5489K3148J2574K871j9116L116j930j2143J2483P675K2247K6190
$$ -66971 -92460 -69312 -56738 -53867 -72983 -69867 -71797 -83940 -71457 -63782 -41535 -15345
16482a5345L3130K5412l4062j7134j2305n2481k774L3794j2419l1310J3563M6127
$$ -15345 17785 43197 9135 -7999 -20304 -72785 -75559 -41765 -54184 -85494 -71931 -25804
16470b5804M3869l9823J015J9297k2221P6k01L221J3849j2609L297J9267M4835
$$ -25804 18065 -21758 -20743 -1446 -23667 -23591 -23792 -20571 -6722 -19331 -16034 3233 48068
16457D8068M2535j7475o2657k9919P623j6052L950n0617J82K8295L6090K3784
$$ 48068 90603 73128 10471 -19448 -11825 -27877 -23927 -74544 -74362 -46067 -9977 13807
16445A3807k616k5034j0722k8968M109N0046N9336k1622l5099l3103J0336j7399
$$ 13807 11191 -13843 -24565 -53533 -49424 622 59958 38336 3237 -29866 -19530 -36929
16433c6929k3469M6000Q887M5035k8770M294K4720L2595j4652j4673l0227l0788
$$ -36929 -60398 -14398 -5511 39524 10754 15048 39768 72363 57711 43038 12811 -17977
16421a7977K7584J8428j9409m6494k967k608j5215P219N3282j6697K3576R66Q044
$$ -17977 9607 28035 8626 -37868 -40835 -43443 -58658 -51439 1843 -14854 8722 9688 17732
16408A7732J3036m2897j8720j7906Q864J5375K8701K5688q54k9528m0278k7211
$$ 17732 30768 -12129 -30849 -48755 -39891 -24516 4185 29873 29019 -509 -40787 -67998
16396f7998L8381O0037l3618l7286K962J5954Q520J3010L7239m5843J4338m507
$$ -67998 -29617 30420 -3198 -40484 -37522 -21568 -13048 -38 37201 -8642 5696 1189
16384A189n1376k7816J7747M4647k3568L3261l063l9472j7251r090n1427o861
$$ 1189 -50187 -78003 -60256 -15609 -39177 -5916 -8979 -48451 -65702 -74792 -126219 -133080
16372a33080J3540K7800K2862l318J3562N9385K6881l6306p0209R71M4860M7147
$$ -133080 -119540 -91740 -68878 -72196 -58634 751 27632 -8674 -78883 -77912 -33052 14095
16360A4095j2255O4735N1467L1571n4087k6970k8853J13j3446j9052k5135r969
$$ 14095 1840 66575 118042 149613 95526 68556 39703 39816 26370 7318 -17817 -27786
16348b7786k8387l265J1284k3988M1928L4189L6347J3272j4901j7845K214J5136
$$ -27786 -56173 -59438 -48154 -72142 -30214 3975 40322 53594 38693 20848 23062 38198
16336C8198j0254k1620j2232Q97j6526P613K7316J8206n070K968J1590k0641p628
$$ 38198 27944 6324 -5908 -5011 -21537 -13924 13392 31598 26528 29496 41086 20445 12817
16323A2817j9839R0906O1458n0987r1610k7623J5937L2951P764m6683o7592k153
$$ 12817 -7022 83884 145342 94355 2745 -24878 -8941 24010 31774 -14909 -82501 -84654
16311h4654O7796O539n38j8013K2385k5664l240L6569k444K9958J1325j6204k8242
$$ -84654 -16858 -10319 -10857 -28870 -6485 -32149 -35389 1180 -1264 28694 40019 23815 -4427
16298d427l0687j0358K8523M8366K2453k160J7294j6212n2005n3731K1436M8660
$$ -4427 -35114 -45472 -16949 31417 53870 51710 69004 52792 787 -52944 -31508 17152
16286A7152N1468j6918k1465n6142k9361M0696j1494j5000j6655J7257j1921J4570
$$ 17152 68620 51702 30237 -25905 -55266 -14570 -26064 -41064 -57719 -40462 -52383 -37813
16274c7813m5854J2556L0598o560n096K5455J3914J2952L902l1158n2956Q568
$$ -37813 -83667 -71111 -40513 -47073 -52169 -26714 -12800 152 4054 -27104 -80060 -71492
16262g1492j5676K4893K3163J6461L0140J3604l1565m3103J8746K2736K5824L6511
$$ -71492 -87168 -62275 -39112 -22651 7489 21093 -10472 -53575 -34829 -12093 13731 50242
16250E0242j727k3699j8817q538q085L0401O303J5422K3971l7194n7645o907K6634
$$ 50242 48515 24816 5999 -2539 -10624 19777 26080 41502 65473 28279 -29366 -36273 -9639
16237i639K5996l6873n987j6011k2614j712r943N7090M6947L1278m4166M547m3084
$$ -9639 16357 -20516 -26503 -42514 -65128 -66840 -76783 -19693 27254 58532 14366 18913 -24171
16224b4171L0107R342M0793q909R245j9702n9132j6037j3963M5960O125l327J5023
$$ -24171 5936 15278 56071 47162 56407 36705 -22427 -38464 -52427 -6467 -342 -3669 11354
16211A1354j9480J250K8460K721j5274o67J330K0314k0701k055j1028j490j4041
$$ 11354 -8126 -6876 21584 24305 9031 8364 9694 30008 9307 7252 -3776 -5266 -19307
16198a9307o1371l753J0394L0221J6829J6116Q31q213J039p223j7116P541l398
$$ -19307 -80678 -84431 -74037 -43816 -26987 -10871 -10040 -18253 -17214 -24437 -41553 -34012 -37410
16185c7410K1841l0832j0428N8944J0179K7624J0725m7934K1541j7309j8267l674
$$ -37410 -15569 -46401 -56829 2115 12294 39918 50643 2709 24250 6941 -11326 -15000
16173a5000j0252R3L5101R640j8298k7165k9951n249K9356M9865L033k4795p0190
$$ -15000 -25252 -25159 9942 19582 1284 -25881 -55832 -61081 -31725 18140 21173 -3622 -73812
16160g3812O709L4527J0506M3924m1935k7351J0558M9543K2576k7002j9081j1944
$$ -73812 -67103 -32576 -22070 21854 -20081 -47432 -36874 12669 35245 8243 -10838 -22782
16148b2782k465q9m335J0m562N077p40M7218J0358k6806l9095j4465L2376R773
$$ -22782 -25247 -25336 -29671 -29661 -34223 -29146 -29886 17332 27690 884 -38211 -52676 -20300 -10527
16134a0527R522K9007L6288J003n0981k6937K7113l282j3468L2205L0772k1207
$$ -10527 -1005 28002 64290 65293 14312 -12625 14488 11206 -2262 29943 60715 39508
16122C9508k8621M199l9240k4653l8536r923j3489K5163p68L5084M8110K1940
$$ 39508 10887 15086 -24154 -48807 -87343 -97266 -110755 -85592 -86360 -51276 -3166 18774
16110A8774l3162l2300L2295J3100L1761l6227m8788J4577J731J277K0846L8514
$$ 18774 -14388 -46688 -14393 -1293 30468 -5759 -54547 -39970 -38239 -36962 -16116 22398
16098B2398P1o2l8j9417m4872N32M1889q244k8515l7602K6998M3952P295P23j0262
$$ 22398 22469 22407 22369 2952 -41920 -41388 501 -7743 -36258 -73860 -46862 -2910 4385 5108 -5154
16083e154J3044l1152K5425j6052m1444j4165l621M5343L1536J2515K2507j32
$$ -5154 7890 -23262 2163 -13889 -55333 -69498 -73119 -27776 3760 16275 38782 38650
16071C8650j3161O530l321m7210k6835O1132K5135n3510m370J2128k876p551Q854
$$ 38650 25489 32019 28698 -18512 -45347 15785 40920 -12590 -16960 -4832 -7708 -15259 -6405
16058f405J0994L0755l1583l7017J5156K8457l1270k5086k0567M5000J07897Q509
$$ -6405 4589 35344 3761 -33256 -18100 10357 -20913 -45999 -66566 -21566 86331 94840
16046I4840l0227m9612l0086k5897n495k68O134k08N376L2143j6340j9506j5608
$$ 94840 64613 15001 -15085 -40982 -46477 -46745 -40611 -40819 -35443 -3300 -19640 -39146 -54754
16033e4754K2508L2236K9442m8161k2525K1188l3981O235j214J6441J8059K1519
$$ -54754 -32246 -10 29432 -18729 -41254 -20066 -54047 -47812 -49026 -32585 -14526 6993
16021F993L1788J5654M514j79k7201l2851J7164k701j0831J4811K4881l0991n446
$$ 6993 38781 54435 58949 58770 31569 -1282 15882 13181 2350 17161 42042 11051 5605
16008E605J6351k7540m2529k1840J2404J1605q956R422J7080K983J424O584j9693
$$ 5605 21956 -5584 -48113 -69953 -57549 -45944 -54900 -45478 -28398 -25415 -23991 -17407 -37100
15995c7100N340K7190k631Q226j828j8894k7129J0467J6934m310J2930k0134K8347
$$ -37100 -31760 -4570 -7201 1025 -803 -19697 -46826 -36359 -19425 -23735 -10805 -30939 -2592
15982b592j264m3072O1m6001l2427L0429N0064J6054J3034M324M4404q04m9017
$$ -2592 -3856 -46928 -46867 -92868 -125295 -94866 -44802 -28748 -15714 -11390 33014 32210 -16807
15969a6807k2140R682l494N472P889q199L3601L5081m1466l5480L0830J0343m3091
$$ -16807 -38947 -29265 -32759 -27287 -19398 -27597 6004 41085 -381 -35861 -5031 5312 -37779
15956c7779j1354m416K0672J2109l3941m3709J7082N2452N3603J101j4738m0541
$$ -37779 -49133 -53549 -32877 -20768 -54709 -98418 -81336 -28884 24719 25820 11082 -29459
15944b9459L3440m0998l891L3819Q283j1929J6466k0128j8195J1091J8099Q740
$$ -29459 3981 -37017 -40908 -7089 1194 -10735 5731 -14397 -32592 -21501 -3402 5338
15932E338L789j4179M9342L3738j5660n1187m4983R833k245O488K8990K0323k8760
$$ 5338 9127 -5052 44290 78028 62368 11181 -33802 -23969 -26214 -19726 9264 29587 827
15919H27m2866l637K6013K1336K6342J6415N796l5006j5506J1691P346j123J9492
$$ 827 -42039 -45676 -19663 1673 28015 44430 50226 15220 -286 11405 18751 17628 37120
15906C7120l0450j7794L0581l340O552l7042j2248K7333k3808K5199M3535p22
$$ 37120 6670 -11124 19457 16117 22669 -14373 -26621 712 -23096 2103 45638 44916
15894D4916n3483N883N0931J5750l5719j0084N889j6798j7743K7435k0403k4378
$$ 44916 -8567 -2684 48247 63997 28278 18194 24083 7285 -10458 16977 -3426 -27804
15882b7804p732k24K9731M4506j9429k9159p74J3646J7177r640L940j8436J7336
$$ -27804 -35536 -35760 -6029 38477 19048 -10111 -10885 2761 19938 10298 14238 -4198 13138
15869A3138J6738J8521j1416o241M7961O063m9906p553l7958k7687q447P479M9288
$$ 13138 29876 48397 36981 30740 78701 84764 34858 27305 -10653 -38340 -46787 -39308 9980
15856I980N075L597L8392J1154K0946l8446k6795L2859L8266j6311m1503n4185
$$ 9980 15055 18652 57044 68198 89144 50698 23903 56762 95028 78717 37214 -16971
15844a6971j913l053j1939J3106N71J2438K3596j3347K6967J7472J4507j8360
$$ -16971 -18884 -21937 -33876 -20770 -20199 -7761 15835 2488 29455 46927 61434 43074
15832D3074m0916m0539K0741J3221l6215L1094r183j7068l3088J5205L6816o838
$$ 43074 2158 -38381 -17640 -4419 -40634 -9540 -18723 -35791 -68879 -53674 -16858 -23696
15820b3696O961j8181k1710Jp662P632J2627O053m012k3922J615O5384O773K4874
$$ -23696 -16735 -34916 -56626 -56625 -64287 -56655 -44028 -37975 -41987 -65909 -64294 1090 7863 32737
15806C2737K7122m6864p1127J8105N5177J4218n3014o1099J9868O3120J3596j7598
$$ 32737 59859 12995 -58132 -40027 15150 29368 -23646 -84745 -64877 -1757 11839 -5759
15794e759j4777p933L4185K8892k9775J257J733o526J4054j0686k0300k8233K6470
$$ -5759 -20536 -28469 5716 34608 4833 6090 7823 1297 15351 4665 -15635 -43868 -17398
15781a7398R638K414K0711o294j6889L4919j2666p290J0610k3029j2044o538k7247
$$ -17398 -7760 -5346 15365 9071 -7818 27101 14435 7145 17755 -5274 -17318 -23856 -51103
15768e1103J1871l1337Q986M7929R982j1413m3878K8090O1071K0413l6177j6908
$$ -51103 -39232 -70569 -61583 -13654 -3672 -15085 -58963 -30873 30198 50611 14434 -2474
15756b474O737J2464L120L9679K1516k29O02k4996O610L199O954j9128m9119l5755
$$ -2474 4263 16727 19847 59526 81042 80813 81415 56419 63029 66228 73182 54054 4935 -30820
15742c0820K0056j4799j7984J9855K9005p183j0421k6328k026N1872K3117J0711
$$ -30820 -10764 -25563 -43547 -23692 5313 -1870 -12291 -38619 -40645 11227 34344 45055
15730D5055j0052k9695k5048K3035N5101r214m1807P279k1588n776l07J1943q083
$$ 45055 35003 5308 -19740 3295 58396 49182 7375 14654 -6934 -12710 -13017 -1074 -9157
15717i157m3319L0259J9065o038k1104J8438k3683k2959M034J3996O203K9833
$$ -9157 -52476 -22217 -3152 -9190 -30294 -11856 -35539 -58498 -54464 -40468 -34265 -4432
15705d432J8406M8015K2138l2533j0147L2931m1590m3112L291R738K6264J7937
$$ -4432 13974 61989 84127 51594 41447 74378 32788 -10324 -7033 2705 28969 46906
15693D6906l473l9198j1671K5139j551j0247O410K8409K5409J8780k9907l4977
$$ 46906 43433 4235 -7436 17703 16152 5905 12315 40724 66133 84913 55006 20029
15681B0029l5183J813j2181J59M7250J1717l6734o780J3989l6714O898K2802j7485
$$ 20029 -15154 -13341 -25522 -25363 21887 33604 -3130 -9910 4079 -32635 -25737 -2935 -20420
15668b0420K8045K8978P659k7570k4122K4292L6170K3389J6288k2684l0203l5734
$$ -20420 7625 36603 44262 16692 -7430 16862 53032 76421 92709 70025 39822 4088
15656D088m7630L8158M9051K7883j6625L38M839j6268j6357j5039m0891N130L3567
$$ 4088 -43542 -5384 43667 71550 54925 55263 60102 43834 27477 12438 -28453 -23323 10244
15643A0244k5964O964R48L9949k9352k4168l297K152J7910K7620l882p197j3717
$$ 10244 -15720 -8756 -7808 32141 2789 -21379 -24676 -22524 -4614 23006 19124 11927 -1790
15630a790j575M1137J0744p5166j5561J7699N9704l1806k1907p250P618m014m054
$$ -1790 -3365 37772 48516 -26650 -42211 -24512 35192 3386 -18521 -25771 -18153 -22167 -26221
15617b6221k8690j2372K3429J3023J4410Q813j0689P593K632J6968L451Q413k1314
$$ -26221 -54911 -67283 -43854 -30831 -16421 -7608 -18297 -10704 -8072 8896 12347 20760 -554
15604e54R959K7692L4809j0206m8680m3060j8817Q396j4785M9071K7556J6948
$$ -554 9405 37097 71906 61700 13020 -30040 -48857 -40461 -55246 -6175 21381 38329
15592C8329K569m385k2015p96M523n432m1696J2203J6573M350j7643M421L0610
$$ 38329 40898 36513 14498 13702 18225 12793 -28903 -16700 -127 4223 -13420 -8999 21611
15579B1611K5804k081j8466j879l4844k2755j8199j3800J4439J3737K3823l313
$$ 21611 47415 45334 26868 24989 -9855 -32610 -50809 -64609 -50170 -36433 -12610 -15923
15567a5923l8279J0033j6356N731L6092K1749J0050L6465m028n2901k4992K9876
$$ -15923 -54202 -44169 -60525 -54794 -18702 3047 13097 49562 45534 -7367 -32359 -2483
15555b483K2178j9390p665L3090P272J1041r593j9350k119K2301K1932o548o0282
$$ -2483 19695 305 -7360 25730 33002 44043 34450 15100 12981 35282 57214 50666 -9616
15542i616r237J5723j9608k4127N331J4267J1209K1732M681j8073P865O609K5477
$$ -9616 -18853 -3130 -22738 -46865 -41534 -27267 -16058 5674 10355 -7718 147 6756 32233
15529C2233j6142k7642J3714L8082K4941r420L074l875l2311l2890j6949K7555
$$ 32233 16091 -11551 2163 40245 65186 55766 58840 54965 22654 -10236 -27185 370
15517C70r05J7709j6834L1328p65k2566L652j5803j0804O803J249n7793P100K1199
$$ 370 -535 17174 340 31668 30903 8337 11989 -3814 -14618 -7815 -6566 -64359 -57259 -36060
15503c6060L8747K4887m4978k1483J4401k601N2365m563n9159m931L4667L4709
$$ -36060 2687 27574 -17404 -38887 -24486 -27087 25278 20715 -38444 -43375 -8708 26001
15491B6001K0034r759l7995l9454p55j1378J567L1246K8831m9429j5661k9460
$$ 26001 46035 36276 -1719 -41173 -41928 -53306 -51739 -20493 8338 -41091 -56752 -86212
15479h6212k8184K9332N5061k695J2039o312j1823Q024k2991O388M3897L4168
$$ -86212 -114396 -85064 -30003 -32698 -20659 -26971 -38794 -30770 -53761 -47373 -3476 30692
15467C0692o537j7731o152L1236K2460k5057n4288k263M8162o54l2102k9871k4047
$$ 30692 24155 6424 272 31508 53968 28911 -25377 -27640 20522 19868 -12234 -42105 -66152
15454f6152P208K9287P795j6230l207J884K4273R242K9903O457k255K0406m3807
$$ -66152 -58944 -29657 -21862 -38092 -41299 -39415 -15142 -5900 24003 30460 28205 48611 4804
15441D804M425Q959j3886q08o533M0632J5029l8490j8598J2172K3399O550l5254
$$ 4804 9229 18188 4302 3494 -3039 37593 52622 14132 -4466 7706 31105 37655 2401
15428B401k1539m14K8685j0140k0361m342J3328k4807M542K6329r260K0761L197
$$ 2401 -19138 -19552 9133 -1007 -21368 -25710 -12382 -37189 -32647 -6318 -15578 5183 8380
15415H380n9762K2720N941K2334O0117N916l6029l3699k0635J2861j020n6782
$$ 8380 -51382 -28662 -22721 -387 59730 65646 29617 -4082 -24717 -11856 -12876 -69658
15403f9658j401p149J3294L0540J5392K8351K113N515J308k3787Q619O2591J7067
$$ -69658 -71059 -78208 -64914 -34374 -18982 9369 11482 16997 18305 -5482 3137 65728 82795
15390H2795l5240o5217j7914J4510L3009k828J463Q800j6235J0517P71k7892j2779
$$ 82795 47555 -17662 -35576 -21066 11943 9115 10578 19378 3143 13660 14431 -13461 -26240
15377b6240m5396m9773M025J5989J2178r130J664l937M2590L2116m497m775m251
$$ -26240 -71636 -121409 -117384 -101395 -89217 -98347 -96683 -100620 -58030 -25914 -30411 -35186 -39437
15364c9437R1K7990K3538n959o462J5049j1932j1879J6598J0969K1057q411j9139
$$ -39437 -39346 -11356 12182 6223 -239 14810 2878 -9001 7597 18566 39623 31212 12073
15351A2073j1202k091l6106K3907j5205n462J4552K3776m446k8395J2346J1620
$$ 12073 871 -1220 -37326 -13419 -28624 -34086 -19534 4242 -204 -28599 -16253 -4633
15339d633N1583k5684J266K9254K3259l46k6943j5567K1340K4826m146l2779l5740
$$ -4633 46950 21266 22532 51786 75045 74699 47756 32189 53529 78355 74209 41430 5690
15326E690l6529p060L6230m438j227o053q881l6845J2088K0223J7366J9830k177
$$ 5690 -30839 -37899 -1669 -6107 -7334 -13387 -22268 -59113 -47025 -26802 -9436 10394 8217
15313H217k9137p33J9940j5325K8110K6903l8852m6956L0879M1664J1304L5631
$$ 8217 -20920 -21653 -1713 -17038 11072 37975 -877 -47833 -16954 24710 36014 71645
15301G1645P476j4862m1285l0311l1435j888K3780l607L1989R241L911l7561L8799
$$ 71645 79121 64259 22974 -7337 -38772 -40660 -16880 -20487 11502 20743 24654 -12907 25892
15288B5892k0274j1975k543n742k3679J3389M6538P841j3557n0945k5181K5569
$$ 25892 5618 -6357 -8900 -14642 -38321 -24932 21606 29447 15890 -35055 -60236 -34667
15276c4667L3764m932m1678j5700P140J1433M7888L5544N2932J342m2202N073
$$ -34667 -903 -5835 -47513 -63213 -56073 -44640 3248 38792 91724 93066 50864 55937
15264E5937K5068j5983k5802o7618o544M3101j6021m8621K0251o275j7134J8445
$$ 55937 81005 65022 39220 -28398 -34942 8159 -7862 -56483 -36232 -42507 -59641 -41196
15252d1196l371j2101j4264L3881K1796M4027r321n4103l5039N362k0249O485
$$ -41196 -44567 -56668 -70932 -37051 -15255 28772 19451 -34652 -69691 -64329 -84578 -78093
15240g8093K8792L4982L5544J3760J4436m0245j4316N3926K5557J7508k7898j1834
$$ -78093 -49301 -14319 21225 34985 49421 9176 -5140 48786 74343 91851 63953 52119
15228E2119p4779m0554L0411M5606J55j1842Q000l0480j4163J5309K9226k0551
$$ 52119 -22660 -63214 -32803 12803 12958 1116 9116 -21364 -35527 -20218 9008 -11543
15216a1543j8209K572N98o771k986K6432k1783l6486J2939J5570k148n6367q086
$$ -11543 -29752 -27180 -26582 -33353 -36339 -9907 -31690 -68176 -55237 -39667 -41815 -98182 -106268
15203a06268O4839O4745J138N319j4134P497j9847J2674j0477K679J318J0786
$$ -106268 -41429 23316 24454 29773 15639 23136 3289 15963 5486 8165 9483 20269
15191B0269M2907J9785l0335K198l9485j313m291l1447J5946J2132K2077k8P529
$$ 20269 63176 82961 52626 54824 15339 14026 9735 -21712 -5766 6366 28443 28415 35944
15178C5944L98L959m619m1839j9217J1785K6387N990j110L2327m34k1020l1284
$$ 35944 36342 40301 35682 -6157 -25374 -13589 12798 18788 17678 50005 49571 28551 -2733
15165b733l0160p818J8872m170k9293j894M5314j0804k84K8052J2129m971m1128
$$ -2733 -32893 -40711 -21839 -26009 -55302 -57196 -11882 -22686 -22970 5082 17211 12240 -28888
15152b8888j6709k4597Q350j3360K0452M7067j9421o176k3786K8800K8353l249
$$ -28888 -45597 -70194 -61844 -75204 -54752 -7685 -27106 -33282 -57068 -28268 85 -3164
15140c164m063m272J5248j4056L138J8549J2113N661k2205j1850P493m6043k2433
$$ -3164 -7227 -11499 3749 -10307 -7169 11380 23493 29154 6949 -4901 2592 -43451 -65884
15127f5884N6921O891M531M795l0633j8376n99J971M6661N7819J9902k7971J3548
$$ -65884 -8963 -2072 2459 7254 -23379 -41755 -42354 -40383 6278 64097 83999 56028 69576
15114F9576L5791m452k4019p2723o3298j9096J1519P407L6417N5156P808K0811
$$ 69576 105367 100915 76896 4173 -59125 -78221 -66702 -59295 -22878 32278 40086 60897
15102F0897l246J6018o7730k5915L3902Q102L987N3502O486m5016p7496N3901
$$ 60897 57651 73669 5939 -19976 13926 22028 26015 79517 86003 40987 -36509 17392
15090A7392N0221k049j5562q480J9240j4191l9173k3582M297K2628K0404J74j2892
$$ 17392 67613 65564 50002 41522 60762 46571 7398 -16184 -11887 10741 31145 31319 18427
15077A8427L5828l0264k7411j8382K1246J29J5796J1505J9582k635j0207J4762
$$ 18427 54255 23991 -3420 -21802 -556 -427 15369 26874 46456 43821 33614 48376
15065D8376j0380m1828j5110j7139K4639k0919O373j4018l592M5786j0724k9987
$$ 48376 37996 -3832 -18942 -36081 -11442 -32361 -25988 -40006 -43598 2188 -8536 -38523
15053c8523J0891N3394J7815p220J906R02J9490j9183j8353k2707m0220J0392
$$ -38523 -27632 25762 43577 36357 38263 39165 58655 39472 21119 -1588 -41808 -31416
15041c1416J8525K0967j5769j852M1604L8002M981k0578l5030q458k1071m4085
$$ -31416 -12891 8076 -7693 -9545 32059 70061 75042 54464 19434 10976 -10095 -54180
15029e4180J1510L6213L025j09l1021p549k1342q299M6643J0025J0127j5307J5516
$$ -54180 -42670 -6457 -3432 -3541 -34562 -42111 -63453 -71752 -25109 -15084 -4957 -20264 -4748
15016d748N9102J8450J5978l7870J0345n997K0278M321l9709m2746K737j3502
$$ -4748 54354 72804 88782 50912 61257 55260 75538 79859 40150 -2596 141 -13361
15004a3361j6697M9645L3619K883J9793K7676J111r995l8328Q664j786r465n2557
$$ -13361 -30058 19587 53206 56089 75882 103558 104669 94674 56346 65010 63224 53759 1202
14991A202n456l2440j1986J657L0336K5867n035J5197o554J3813j309N403n4740
$$ 1202 -4254 -36694 -48680 -47023 -16687 9180 4145 19342 12788 26601 25292 30695 -24045
14978b4045K3647m602n0400l9341R877q251L4662L9539Q640K7910k1161l254L1512
$$ -24045 -398 -5000 -55400 -94741 -84864 -93115 -58453 -18914 -10274 17636 -3525 -6779 24733
14965B4733k4406J1648l1k7393L5879L1538l5545k8708P935M6365j2897m928K6870
$$ 24733 327 11975 11944 -15449 20430 51968 16423 -12285 -4350 42015 29118 24190 51060
14952E1060j2323l0731M7340k399k4502k735n186m822J2152j1736m2590l8559
$$ 51060 38737 8006 55346 52947 28445 25710 20524 15702 27854 16118 -26472 -65031
14940f5031N8023J8329M298J4526r98k823j7989l0972K3796k737k8912k323N6614
$$ -65031 -7008 11321 15619 30145 29147 26324 8335 -22637 1159 -1578 -30490 -32813 23801
14927B3801N2283j8189J9642j1739r92m101n9572j4543L4054L7911J4683N470
$$ 23801 76084 57895 77537 65798 64806 60705 1133 -13410 20644 58555 73238 78708
14915G8708j6011q466J2982J3955k5862o0617K0224N5663K984k5650L513J5814
$$ 78708 62697 54231 67213 81168 55306 -5311 14913 70576 73560 47910 51423 67237
14903F7237j8965R048m4668k5817q805L1589N000L8307k8122j1395r907j1447
$$ 67237 48272 57320 12652 -13165 -21970 9619 14619 52926 24804 13409 3502 -7945
14891g945Q059k697j4636Q082q341O7931n423k0507l9746j3895K4778J1775k2827
$$ -7945 114 -2583 -17219 -9137 -17478 50453 45030 24523 -15223 -29118 -4340 7435 -15392
14878a5392o4074p444J3845J1894L1131N5627L516J3945l1783k4618j1184n80
$$ -15392 -79466 -86910 -73065 -61171 -30040 25587 29103 43048 11265 -13353 -24537 -25117
14866b5117K2610r232l7414J6120L3498k7627m1292K3420J2508R905R67j4528
$$ -25117 -2507 -11739 -49153 -33033 465 -27162 -68454 -45034 -32526 -22621 -21654 -36182
14854c6182K4454J4198k9392n622N024J1752l024j1974K5157L388q838n931L7366
$$ -36182 -11728 2470 -26922 -32544 -27520 -15768 -18792 -30766 -5609 -2221 -11059 -16990 20376
14841B0376K2953q824n197j0148J4010L1446m6353m8519O2600M4328j7144o766
$$ 20376 43329 34505 29308 19160 33170 64616 18263 -30256 32344 76672 59528 52762
14829E2762l5029L865J9684k4106k6611p287k5523K0268j032K6385M0454K7918
$$ 52762 17733 21598 41282 17176 -9435 -16722 -42245 -21977 -23009 3376 43830 71748
14817G1748k5765K5117Q28k379l4484J401L973N403J4780k6492r929m798P600
$$ 71748 45983 71100 71928 69549 35065 36466 40439 45842 60622 34130 24201 19403 27003
14804B7003j0883o5303j9515j2916j0812L2724K8242J4469K7220l5470l2955k234
$$ 27003 16120 -49183 -68698 -81614 -92426 -59702 -31460 -16991 10229 -25241 -58196 -60430
14792f0430L1249K5709J2030j2312K7567n585k9697M5365Q4609O052n2395m3499
$$ -60430 -29181 -3472 8558 -3754 23813 18228 -11469 33896 118505 124557 72162 28663
14780B8663n0027L259N3117J2708j6957q719O450k6941K735j7472m8983L8657
$$ 28663 -21364 -18105 35012 47720 30763 22044 28494 1553 4288 -13184 -62167 -23510
14768b3510L3095J7107j350j2393N866k4209j8776M290L792O638k2688j4593q086
$$ -23510 9585 26692 25342 12949 18815 -5394 -24170 -19880 -16088 -9450 -32138 -46731 -54817
14755e4817K8264L5006J945p2833l5965l126J6465J5914J7902K3767K7277l838
$$ -54817 -26553 8453 10398 -62435 -98400 -101526 -85061 -69147 -51245 -27478 -201 -4039
14743d039k5669k8720M5309j8815P814p755P675R159q79K991O62N02j456k6542
$$ -4039 -29708 -58428 -13119 -31934 -24120 -31875 -24200 -15041 -15920 -12929 -12267 -11765 -13221 -39763
14729c9763J143J5888j970L0674K7119P484j9125m053l5430q145K5845m6556K816
$$ -39763 -38620 -22732 -24702 5972 33091 40575 21450 17397 -18033 -26178 -333 -46889 -44073
14716d4073R164K0597L5285j0203l1653M8105j5786n6408q638Q662j040J3344
$$ -44073 -34909 -14312 20973 10770 -20883 27222 11436 -44972 -53610 -44948 -45988 -32644
14704c2644L2762J1498n276k2562L2050l905j0785J0303n459k7596j052K2839
$$ -32644 118 11616 6340 -16222 15828 11923 1138 11441 5982 -21614 -22666 173
14692A73j1852l4520k8021n476k3667J9211N4649K0578J1521K5803l6194m3137
$$ 173 -11679 -46199 -74220 -79696 -103363 -84152 -29503 -8925 2596 28399 -7795 -50932
14680e0932Q55J0373J2731K1774K6473k1186O484k737K6633k0145m5426l3388
$$ -50932 -50077 -39704 -26973 -5199 21274 88 6572 3835 30468 10323 -35103 -68491
14668f8491Q747k0672j0619L8990L4146J3036k3962J9183K3951K4238L9372p20
$$ -68491 -59744 -80416 -91035 -52045 -17899 -4863 -28825 -9642 14309 38547 77919 77199
14656G7199l8349l8226k0658k096j1277k8140N23M9104J6386k6893r312J3397
$$ 77199 38850 624 -20034 -22130 -33407 -61547 -61024 -11920 4466 -22427 -31739 -18342
14644a8342L2018m573o314O514J288k3057L0675L3169m7766r777k1557q298k851
$$ -18342 13676 9103 2789 9303 10591 -12466 18209 51378 3612 -6165 -27722 -36020 -38871
14631c8871Q999J0646J2089k2445M136l0582K156L5078l2866L2474j1179N210
$$ -38871 -29872 -19226 -7137 -29582 -25446 -56028 -53872 -18794 -51660 -19186 -30365 -25155
14619b5155J7835n644N473K4027L0422k2479J73j1211K5587j8068k887K3554j9855
$$ -25155 -7320 -12964 -7491 16536 46958 24479 24652 13441 39028 20960 18073 41627 21772
14606B1772j8569o473m6905m0297K6644O8575J6877l1431J4645N555K2351O744
$$ 21772 3203 -3270 -50175 -90472 -63828 4747 21624 -9807 4838 10393 32744 39488
14594C9488P198L3491m7168j8215L701M452p842l2086m401J2695K67j4964q86
$$ 39488 46686 80177 33009 14794 18495 22947 15105 -16981 -21382 -8687 -8420 -23384 -24270
14581b4270k3967k1756K9005J2286J9958O6624k807j3128J4780k3412j2350r411
$$ -24270 -48237 -69993 -40988 -28702 -8744 57880 55073 41945 56725 33313 20963 11552
14569A1552L4527M268k8535j1120m0603q918J792L1367N5138N254k6093k9103
$$ 11552 46079 50347 21812 10692 -29911 -38829 -37037 -5670 49468 54722 28629 -474
14557d74J0130M2910J069m1311j6264j6921m855O90K0679L6333J6443R358j7961
$$ -474 9656 52566 53635 12324 -3940 -20861 -25716 -25026 -4347 31986 48429 57787 39826
14544C9826K588j7952j1212L0017J7346q440m33r620l8316m2227K5056L4636l229
$$ 39826 42414 24462 13250 43267 60613 52173 51740 42120 3804 -38423 -13367 21269 18040
14531A8040j2907R958k1553N885L0354K1203m2956m0289l7522Q23Q728j3078K5434
$$ 18040 5133 15091 -6462 -577 29777 50980 8024 -32265 -69787 -68964 -60236 -73314 -47880
14518d7880K7524j2410k0739L7851J4026P898K2202k7086J4683J9080J8078n8334
$$ -47880 -20356 -32766 -53505 -15654 -1628 6270 28472 1386 16069 35149 53227 -5107
14506e107n0968j9919L0835L7108K2218l7974m539K7732j7475K3272J868l2579
$$ -5107 -56075 -75994 -45159 -8051 14167 -23807 -28346 -614 -18089 5183 7051 -25528
14494b5528l9571R421q946J7268L806j9928j2088J3663M6991k0628j6878k056
$$ -25528 -65099 -55678 -64624 -47356 -43550 -63478 -75566 -61903 -14912 -35540 -52418 -54474
14482e4474J4797L2117L3616L5014J5541k2394O61j4068j5095l9930R140l180
$$ -54474 -39677 -7560 26056 61070 76611 54217 54878 40810 25715 -14215 -5075 -8255
14470h255k1442J7834K1596l274J3814n2383k3607J464K3557j463M820j3033o24
$$ -8255 -29697 -11863 9733 6459 20273 -32110 -55717 -54253 -30696 -32159 -27339 -40372 -40996
14457d0996O605L6838m6562J603J5198J8713m704k7027J9588M1989L3960n7496
$$ -40996 -34391 2447 -44115 -42512 -27314 -8601 -13305 -40332 -20744 21245 55205 -2291
14445b291m8258K7948O34j116L2465J6150k3909j798L9007K6240K0957K29k7609
$$ -2291 -50549 -22601 -21967 -23083 9382 25532 1623 -175 38832 65072 86029 86258 58649
14432E8649m8306l3071k9044J5861L619J6656j4036K8453O509j9808O223K8100
$$ 58649 10343 -22728 -51772 -35911 -32292 -15636 -29672 -1219 5290 -14518 -8295 19805
14420A9805J2008j8145q229k4730o060j2232K1391K7260L3474L7764J1326k9491
$$ 19805 31813 13668 5439 -19291 -25351 -37583 -16192 11068 44542 82306 93632 64141
14408F4141l2021l1417M6451K8023l3139R13o088k1680J2223J9482L0383O022
$$ 64141 32120 703 47154 75177 42038 42951 36863 15183 27406 46888 77271 83293
14396H3293n9576n162J7141R683K7472J8175l6201j4931k3479j8206M2078j4846
$$ 83293 23717 18555 35696 45379 72851 91026 54825 39894 16415 -1791 40287 25441
14384B5441l2815k7985L461N2602K6685J2780K1628j0081l3593o97J6528J3151
$$ 25441 -7374 -35359 -31898 20704 47389 60169 81797 71716 38123 37426 53954 67105
14372F7105q270l270k8171n1099J6542j4708k7737M0508N2579K412m7335k5929
$$ 67105 58835 55565 27394 -23705 -7163 -21871 -49608 -9100 43479 45891 -1444 -27373
14360b7373j1085q547M8573O2123J0024j1212k0059k8436k1154L0210J5369k6022
$$ -27373 -38458 -47005 1568 63691 73715 62503 42444 14008 -7146 23064 38433 12411
14348A2411o606k3480k3792m0409q432J8521L8163P075j4367Q961M0028L2862
$$ 12411 5805 -17675 -41467 -81876 -90308 -71787 -33624 -26549 -40916 -31955 8073 40935
14336D0935J9849K4600l4272k9069N931L137m3319j2083o73Q644L9486k3525p244
$$ 40935 60784 85384 51112 22043 27974 31111 -12208 -24291 -24964 -16320 23166 -359 -7603
14323g603K4425l915l9772L2467K786n906L4370J3490l9590q481J1725K4885Q949
$$ -7603 16822 12907 -26865 5602 8388 2482 36852 50342 10752 2271 13996 38881 47830
14310D7830j1206k017n1204l7348L0265J2596o537k4485l8105M6976O3517l5451
$$ 47830 36624 34607 -16597 -53945 -23680 -11084 -17621 -42106 -80211 -33235 30282 -5169
14298e169j6627o791L3439M5612Q462m7822L330J1821J0477K5078k2629J3650
$$ -5169 -21796 -28587 4852 50464 58926 11104 14434 26255 36732 61810 39181 52831
14286E2831k1294m2842l4481j2507r432p444l2788K0432L5205M8345L7782l2338
$$ 52831 31537 -11305 -45786 -58293 -67725 -75169 -107957 -87525 -52320 -3975 33807 1469
14274A469o1593j4228J9865N651L9333J5998M0790K3076l4169p302j4565o810
$$ 1469 -60124 -74352 -54487 -48836 -9503 6495 47285 70361 36192 28890 14325 7515
14262G515K1122J2757j3102R023L018N741j4169j5276K0437p355K830j6289O141
$$ 7515 28637 41394 28292 37315 40333 46074 31905 16629 37066 29711 32541 16252 22393
14249B2393L1721k9856k3863n717M4497k8253L069K0360J9966J4138j0783J9743
$$ 22393 54114 24258 395 -5322 39175 10922 13991 34351 54317 68455 57672 77415
14237G7415l1612l9563L1684K447K3436r461R962N023k9178L947k7772j2964p71
$$ 77415 45803 6240 37924 40371 63807 54346 64308 69331 40153 44100 16328 3364 2593
14224B593J8633J4300l6525n6433q722l807J5067M8288L5040j5570k5406J0124
$$ 2593 21226 35526 -999 -57432 -66154 -69961 -54894 -6606 28434 12864 -12542 -2418
14212b418N629k9825l1521K8499K0906j5767N8587j7311K2614k0621l0491k3361
$$ -2418 3211 -26614 -58135 -29636 -8730 -24497 34090 16779 39393 18772 -11719 -35080
14200c5080j695K4312M4324O5313j2219j97m4088l7449m3679l9818L7002L5986
$$ -35080 -36775 -12463 31861 97174 84955 84758 40670 3221 -40458 -80276 -43274 -7288
14188g288L2456j8578j7463o4618o926M5539L3088L481J8064K1807O61J7417K3569
$$ -7288 25168 6590 -10873 -75491 -82417 -36878 -3790 -309 17755 39562 40223 57640 81209
14175H1209k7583k9357O358q362j5228j2676l5446j7454m0K9193L3761J482j2686
$$ 81209 53626 24269 30627 22265 7037 -5639 -41085 -58539 -58579 -29386 4375 5857 -6829
14162f829k114o3990k2057K8197L5608K4499R302l713O3509L2971k8204n4750
$$ -6829 -8943 -72933 -94990 -66793 -31185 -6686 2616 -1097 62412 95383 67179 12429
14150A2429J914l2134j8607M9003p574l8846j9430k4950p230j7027L5616l638
$$ 12429 14343 -17791 -36398 12605 5031 -33815 -53245 -78195 -85425 -102452 -66836 -70474
14138g0474P550R518m002k9904n727K4483O8771J9165q307r822j2880O1260l8747
$$ -70474 -62924 -53406 -57408 -87312 -93039 -68556 215 19380 11073 1251 -11629 49631 10884
14125A0884p1390j9632M8841m835R925M0448L4132r334l7251L1084L7274K203
$$ 10884 -60506 -80138 -31297 -36132 -26207 14241 48373 39039 1788 32872 70146 72349
14113G2349M817p512J007n2879L399j989k5398k5215K1043L2669j1742P704K3523
$$ 72349 77166 69654 70661 17782 21181 19192 -6206 -31421 -10378 22291 10549 18253 41776
14100D1776r727J558j558L0346j0902j8980j0593P102k8278o7450r755P9502n223
$$ 41776 32049 33607 32049 62395 51493 32513 21920 29022 744 -66706 -76461 3041 -2182
14087b182J8107L5489k5562l311q196P025j1617O18L8642K274L630k0720m3553
$$ -2182 15925 51414 25852 22541 14345 21370 9753 10371 49013 51287 54917 34197 -9356
14074i356J386K3759k524K0684J2670p1943K608J7139k8165K5394L6381k2782
$$ -9356 -7970 15789 13265 33949 46619 -25324 -22716 -5577 -33742 -8348 28033 5251
14062E251n7167K8651P7291j4115l2453j5287M118j9981K1362L219L64L388L849
$$ 5251 -51916 -23265 54026 39911 7458 -7829 -3711 -23692 -2330 889 1253 4641 8490
14049H490J7758M816L730j0411j4111n0336m2176n557K0503J7045O083K1604o101
$$ 8490 26248 31064 34794 24383 10272 -40064 -82240 -87797 -67294 -50249 -44166 -22562 -28663
14036b8663J2697J7944K3607K3226R568l4000J080J386j5758O697m7057o2270
$$ -28663 -15966 1978 25585 48811 58379 24379 25459 26845 11087 17784 -29273 -91543
14024i1543q479N8368K6107K2365j4934j4917J2217j9967Q912J5454K2627j0447
$$ -91543 -100022 -41654 -15547 6818 -8116 -23033 -10816 -30783 -21871 -6417 16210 5763
14012E763r751k2797k3174L469K2072N7608K5031k0780n1889k2530p809k0896
$$ 5763 -3988 -26785 -49959 -46490 -24418 33190 58221 37441 -14448 -36978 -44787 -65683
14000f5683J4375L8712N041k9977j633M7822M0516J8796n1968k1346j3207j204
$$ -65683 -51308 -12596 -7555 -37532 -39165 8657 49173 67969 16001 -5345 -18552 -19756
13988a9756J4075M8887l2787l625J6925j6695l1002k4601k1102J7352N1445N1123
$$ -19756 -5681 43206 10419 6794 23719 7024 -23978 -48579 -69681 -52329 -884 50239
13976E0239J4439k4288m8505j754L0262j0032j8374l595l4134L060J7077N0017
$$ 50239 64678 40390 -8115 -9869 20393 10361 -8013 -11608 -45742 -42682 -25605 24412
13964B4412L7707l0596l6441M792j9754L1537N2076J416m2015j6975J6420k1095
$$ 24412 62119 31523 -4918 -126 -19880 11657 63733 65149 23134 6159 22579 1484
13952A484p447K954R00M9138J6905j5950l1213k8633L4811N7359L1262J9345J9314
$$ 1484 -5963 -3009 -2109 47029 63934 47984 16771 -11862 22949 80308 111570 130915 150229
13939A50229l8198l7902k4663k9358J4249L7864j3374k586J4223K9510l2846k5280
$$ 150229 112031 74129 49466 20108 34357 72221 58847 56261 70484 99994 67148 41868
13927D1868k0431L8918K8500m2522l7519m5046k4219L517j5774K3401O7052j1825
$$ 41868 21437 60355 88855 46333 8814 -36232 -60451 -56934 -72708 -49307 17745 5920
13915E920j4023O633l0215L642k896P7330j0523k2973P400J319m7798l0057J5132
$$ 5920 -8103 -1470 -31685 -28043 -30939 46391 35868 12895 20295 21614 -26184 -56241 -41109
13902d1109j8177J4676L2470L1203k5983m0613J6090M4437q009l0921k4131m5238
$$ -41109 -59286 -44610 -12140 19063 -6920 -47533 -31443 12994 4985 -25936 -50067 -95305
13890i5305l2399J0153K9905P524p789K6977M8579j6349k3649K9793j8933l8327
$$ -95305 -127704 -117551 -87646 -80122 -87911 -60934 -12355 -28704 -52353 -22560 -41493 -79820
13878g9820K1121J3665K7908J8818R274j8373K0559L5366j6408k0432j81l71j0948
$$ -79820 -58699 -45034 -17126 1692 10966 -7407 13152 48518 32110 11678 11497 11126 178
13865A78L2114J9631K2406J0429m2185m3119L2236K9320K7052m7318l3380m3567
$$ 178 32292 51923 74329 84758 42573 -546 31690 61010 88062 40744 7364 -36203
13853c6203J4004j5265j9154J1141L9154M1536k9585l4431K0308k7346k9968L6357
$$ -36203 -22199 -37464 -56618 -45477 -6323 35213 5628 -28803 -8495 -35841 -65809 -29452
13841b9452K0332k0975J7840K6011l7580J6105L0402k934l1798K1110K924j6781
$$ -29452 -9120 -30095 -12255 13756 -23824 -7719 22683 19749 -12049 9061 11985 -4796
13829d796j6708l1787M019Q2345N452l1397N8617l4707l4335k7385J3806M5854
$$ -4796 -21504 -53291 -49272 33073 38525 7128 65745 31038 -3297 -30682 -16876 28978
13817B8978L3832k5336m5648j4245L641J7814K393M1021K9087j6428o1528J0866
$$ 28978 62810 37474 -8174 -22419 -18778 -964 1429 42450 71537 55109 -6419 4447
13805D447r376j128J7237L3619L0536J522j1615m2293k6697R145K8011j4744l5801
$$ 4447 -4929 -6057 11180 44799 75335 76857 65242 22949 -3748 5397 33408 18664 -17137
13792a7137J0187j0542m3046q536K2711M0477L0474M6518j8183k1814J962r744
$$ -17137 -6950 -17492 -60538 -69074 -46363 -5886 24588 71106 52923 31109 33071 23327
13780B3327n490K3184l0031o0148L6670K5098l7k5230K3371L9217K3529J0183
$$ 23327 17837 41021 10990 -49158 -12488 12610 12573 -12657 10714 49931 73460 83643
13768H3643J4721m9716m7281O727L140j1898N2192K9036J0008L386k793n8628
$$ 83643 98364 48648 1367 8094 11234 -664 51528 80564 90572 93958 91165 32537
13756C2537n2601J2266K9684p128l5342K832L7025L4772q395m2481r952j1488
$$ 32537 -20064 -7798 21886 14758 -20584 -17752 19273 54045 45650 3169 -6783 -18271
13744a8271l7371l3197L2439k357N362M7827L4230l1064m8752K9146N915P456
$$ -18271 -55642 -88839 -56400 -58757 -53395 -5568 28662 -2402 -51154 -22008 -16093 -8637
13732h637J0818q115L6692o2534l9187J4157k6917k0195O7228J0065q023N0409
$$ -8637 2181 -5934 30758 -31776 -70963 -56806 -83723 -103918 -36690 -26625 -34648 15761
13720A5761K2925j794n3776m4073m176N0995M7020l377n358k7100k9546L976M1487
$$ 15761 38686 36892 -16884 -60957 -65133 -14138 32882 29505 24147 -2953 -32499 -28523 12964
13707A2964p019l0305m681J2791J1235N6k3342K1792M4444k5249k8849K3637j5826
$$ 12964 5945 -24360 -29041 -16250 -5015 -4959 -28301 -6509 37935 12686 -16163 7474 -8352
13694h352J2178j4260k5389J3183k0740k2210K7950J8078j182K2782J9369k1454
$$ -8352 3826 -10434 -35823 -22640 -43380 -65590 -37640 -19562 -20744 2038 21407 -47
13682d7M502J7378m9713m6311j3839K8139O2014k6072J7744j3139j738l0979k379
$$ -47 4455 21833 -27880 -74191 -88030 -59891 2123 -23949 -6205 -19344 -21082 -52061 -54440
13669e4440L0927J5446K4286k767m0193l7207p140M8776N179n467M4688L3740
$$ -54440 -23513 -8067 16219 13452 -26741 -63948 -71088 -22312 -17133 -22600 22088 55828
13657E5828p698j5571N600n1k1256L4113M3265k5215o9324n432k8793m6305k2453
$$ 55828 48130 32559 38159 38108 16852 50965 94230 69015 -309 -5741 -34534 -80839 -103292
13644a03292P75M9805J2202L2933K0572k9295r388j6948L8074j8039n059j0166
$$ -103292 -102517 -52712 -40510 -7577 12995 -16300 -25688 -42636 -4562 -22601 -27660 -37826
13632c7826L9900L1931J5432q650J1203m1341r770N414J9139r900M684l2418j0737
$$ -37826 2074 34005 49437 40787 51990 10649 879 6293 25432 15532 20216 -12202 -22939
13619b2939K6658j6404k8696l2727K3899j4457k950K1316R240M6791J7537j3010
$$ -22939 3719 -12685 -41381 -74108 -50209 -64666 -67616 -46300 -37060 9731 27268 14258
13607A4258r515L5893j7457m016K7554Q490k1486o856J1779j1667l2043k673k067
$$ 14258 4743 40636 23179 19163 46717 55207 33721 26865 38644 26977 -5066 -7739 -9806
13594i806J5211O89J2176J1498j6920k7433j2018k4761K6778N5606J2508l987
$$ -9806 5405 6094 18270 29768 12848 -14585 -26603 -51364 -24586 31020 43528 39541
13582C9541K7016j0931k5030k0495K2118M130Q288L3087m9090n5647q608O7980
$$ 39541 66557 55626 30596 10101 32219 36349 44637 77724 28634 -27013 -35621 32359
13570C2359K5019q030o57K9886m9564n7220L0524K1701K9657J3767l0035J2958
$$ 32359 57378 49348 48691 78577 29013 -28207 2317 24018 53675 67442 37407 50365
13558E0365L4694m2944l9123L572j2652L694L4677j7722o6212q695O0507L6671
$$ 50365 85059 42115 2992 6564 -6088 -2394 32283 14561 -51651 -60346 161 36832
13546C6832m0526k1713n636p841K6238J7430J7020L694j9773m6800L5140J8986
$$ 36832 -3694 -25407 -31043 -38884 -12646 4784 21804 25498 5725 -41075 -5935 13051
13534A3051j9009L1006K970k1579l8112Q835J0250l6599k3623J8081N7200M9141
$$ 13051 -5958 25048 28018 6439 -31673 -22838 -12588 -49187 -72810 -54729 2471 51612
13522E1612k532j9693l400Q391K1546j2548n1209m5515M590O622l3790j3739M3238
$$ 51612 49080 29387 25987 34378 55924 43376 -7833 -53348 -48758 -42136 -75926 -89665 -46427
13509d6427N2889K8761N880k2686n8161l4415O6398N0334O109o9915m6429K5615
$$ -46427 6462 35223 41103 18417 -39744 -74159 -7761 42573 48682 -21233 -67662 -42047
13497d2047L2312K1350J3942n204j5266J0008m6221j6194j4163L4692L1562O4734
$$ -42047 -9735 11615 25557 20353 5087 15095 -31126 -47320 -61483 -26791 4771 69505
13485F9505n403n3766l8843J8088l0255l9841j4518l453J5020M3398L0297m891
$$ 69505 64102 10336 -28507 -10419 -40674 -80515 -95033 -98486 -83466 -40068 -9771 -14662
13473a4662M914K771L0926l3238j2280M6041J3957K492J2677m6777J8592O0016
$$ -14662 -9748 -6977 23949 -9289 -21569 24472 38429 40921 53598 6821 25413 85429
13461H5429L0414m1531n0295p60j27r870O596O055m1374j178K5208o277J0212
$$ 85429 115843 74312 24017 23257 23130 13260 19856 25911 -15463 -16641 8567 2290 12502
13448A2502K2889J9166K6125n1066k5191J0646J209L829p512J0937l4819l678
$$ 12502 35391 54557 80682 29616 4425 15071 16280 20109 12597 23534 -11285 -14963
13436a4963R346q976j4151l405J801k8368N0396K4698m2235k0621J4056l8003
$$ -14963 -5617 -14593 -28744 -32149 -30348 -58716 -8320 16378 -25857 -46478 -32422 -70425
13424g0425J6628N0196n91K6634N825p9562k0554N1985K9392j3400J0179K2752
$$ -70425 -53797 -3601 -4192 22442 28267 -51295 -71849 -19864 9528 -3872 6307 29059
13412B9059M0452O662o138k8047l3772R685q93j6930N30J1791N8804K3464m9686
$$ 29059 69511 76173 70035 41988 8216 17901 17008 78 608 12399 71203 94667 44981
13399D4981q6235j6910L6728J4447L615l337J6723J6019K9626k112l1446J370
$$ 44981 -41254 -58164 -21436 -6989 -3374 -6711 10012 26031 55657 53545 22099 23469
13387B3469k6028j9443L4896K2939k506j3104M9483l9837l7445R968J6196j9205
$$ 23469 -2559 -22002 12894 35833 33327 20223 69706 29869 -7576 2392 18588 -617
13375f17k7230K566j6589M489J6145K2655q073j7752K4618R402m5780m6115J8521
$$ -617 -27847 -25281 -41870 -37381 -21236 1419 -6654 -24406 212 9614 -36166 -82281 -63760
13362f3760L1917L1948l464k5033J7420L1862J6992J0893l597m4117k1406L5654
$$ -63760 -31843 105 -3359 -28392 -10972 20890 37882 48775 45178 1061 -20345 15309
13350A5309K5691k2213N772j9238j8683l8481k5140J1495j6250J0396L5082O945
$$ 15309 41000 18787 24559 5321 -13362 -51843 -76983 -65488 -81738 -71342 -36260 -29315
13338b9315j4128L36J6363m089J6882J2178L9783L1240k8996l0675l7358k1875
$$ -29315 -43443 -43107 -26744 -30833 -13951 -1773 38010 69250 40254 9579 -27779 -49654
13326d9654L3746K9465L7083n814o609j4947J0948k5573k3668n0350q419M7653
$$ -49654 -15908 13557 50640 44826 38217 23270 34218 8645 -15023 -65373 -73792 -26139
13314b6139J4019K8032j7388j7417L6686N796m1257l6017L3829J2567j4874j8948
$$ -26139 -12120 15912 -1476 -18893 17793 23589 -17668 -53685 -19856 -7289 -22163 -41111
13302d1111N374K3513K3746n543L2352K8854o402j2646n521j1157k8357J0500
$$ -41111 -35737 -12224 11522 5979 38331 67185 60783 48137 42616 31459 3102 13602
13290A3602N380k5581j675j1342L3057L0732K0571l5033m4436M818K5869L0638
$$ 13602 18982 -6599 -8274 -19616 13441 44173 64744 29711 -14725 -9907 15962 46600
13278D6600j1840l6939l3143N333j0420L1228r404J6325K5052j9878r363l7113
$$ 46600 34760 -2179 -35322 -29989 -40409 -9181 -18585 -2260 22792 2914 -6449 -43562
13266d3562k0145M5571M6838N323n7288r080K9231q142J9331L2830P167K0552
$$ -43562 -63707 -18136 28702 34025 -23263 -32343 -3112 -11254 8077 40907 48074 68626
13254F8626J7647m0660m4044m152K4923j9070K5884Q218L5297j9810N885j4395
$$ 68626 86273 45613 1569 -2583 22340 3270 29154 37372 72669 52859 58744 44349
13242D4349q3174k2283p541L5552K1247k2159J1621K325l8926j985K4227L424
$$ 44349 -38825 -61108 -68649 -33097 -11850 -34009 -22388 -20063 -58989 -60974 -36747 -33323
13230c3323j4275j8495n111P532K3095M2388J8725M07K3438l0038l591j5130J5109
$$ -33323 -47598 -66093 -71204 -63672 -40577 1811 20536 20943 44381 14343 10752 -4378 10731
13217A0731J7597J1129k8147k9052K2177J3536N161K3155j5333J216j7137j1722
$$ 10731 28328 39457 11310 -17742 4435 17971 23132 46287 30954 32170 15033 3311
13205C311o512k781j3439k0244l0263o2693O053J8335r445J4744L3945M3286J4658
$$ 3311 -3201 -5982 -19421 -39665 -69928 -132621 -126568 -108233 -117678 -102934 -68989 -25703 -11045
13192a1045M017l1940k2239j7333J9978M5396J809k5859J0379P404O291L2101
$$ -11045 -7028 -38968 -61207 -78540 -58562 -13166 -11357 -37216 -26837 -19433 -13142 18959
13180A8959N797n896J5376n375j8349J0465N4741j6116o3914j1173J7980K5793
$$ 18959 24756 18860 34236 28861 10512 20977 75718 59602 -4312 -15485 2495 28288
13168B8288j5762j3146M6251J4175k9675k9086q805R717k0687j3356q27K5122
$$ 28288 12526 -620 45631 59806 30131 1045 -7760 1957 -18730 -32086 -32913 -7791
13156g791L8910n199J6497j5645k0158l953k1924J779J9453m460m0059K7251K8424
$$ -7791 31119 25920 42417 26772 6614 2661 -19263 -17484 1969 -2491 -42550 -15299 13125
13143A3125k6197m7733q134K8045K7939M4485L363L237l0601j3346k771J5140
$$ 13125 -13072 -60805 -68939 -40894 -12955 31530 34893 38130 7529 -5817 -8588 6552
13131F552K8781J9112j2977k8039J1601O299j3882m9120j0719j047J1660P945
$$ 6552 35333 54445 41468 13429 25030 31329 17447 -31673 -42392 -43439 -31779 -23834
13119b3834K8607n5695M704M4081J5104M758j4531j2675k983j5359l0709M8723
$$ -23834 4773 -50922 -46218 -2137 12967 17725 3194 -9481 -12464 -27823 -58532 -9809
13107i809L8969m7792n0787M1653N0128L8951k6309n7624m2114j9757J4113j283
$$ -9809 29160 -18632 -69419 -27766 22362 61313 35004 -22620 -64734 -84491 -70378 -71661
13095g1661O446N021K5556M068M381K1929j5925J6778K5244L540q789L254L6384
$$ -71661 -65215 -60194 -34638 -30570 -26189 -4260 -20185 -3407 21837 25377 16588 19842 56226
13082E6226j3403m7391j5671l281l6606J960M1057j2424m4764Q883L3598j6698
$$ 56226 42823 -4568 -20239 -23520 -60126 -58166 -17109 -29533 -74297 -65414 -31816 -48514
13070d8514j4117K5353J3910l7339K2378M2132K2552l2767l8160L794J5720M2022
$$ -48514 -62631 -37278 -23368 -60707 -38329 3803 26355 -6412 -44572 -40778 -25058 16964
13058A6964K5234K571j6651n038m06k1781l2224m1816j8649r936M9843K4418J5761
$$ 16964 42198 44769 28118 23080 22674 893 -31331 -73147 -91796 -101732 -51889 -27471 -11710
13045a1710N5552j4619k9513k3885k7581K6151k190K5516L6752J3207K6535k6086
$$ -11710 43842 29223 -290 -24175 -51756 -25605 -27795 -2279 34473 47680 74215 48129
13033D8129r695K2334O2768L7298o2156l4804J9751l5224N157k5583N6407J0684
$$ 48129 38434 60768 123536 160834 98678 63874 83625 48401 53558 27975 84382 95066
13021I5066m9372J175J0107n842k4004j0797j1095M089L628O591K0040L0642o871
$$ 95066 45694 46869 56976 51134 27130 16333 5238 9327 12955 19546 39586 70228 63357
13008F3357p626J5620J994n595j6282p1729k4266j7563K9386K7686N6686j322
$$ 63357 55731 71351 73345 67750 51468 -20261 -44527 -62090 -32704 -5018 51668 50346
12996E0346J1134K1328J3881m182l3818J7521k3414l9736j8028K6344K0428k2175
$$ 50346 61480 82808 96689 92507 58689 76210 52796 13060 -4968 21376 41804 19629
12984A9629l7175o835K7918M3690l3480K769o970j1151P053l0026N657k4647J9325
$$ 19629 -17546 -24381 3537 47227 13747 16516 9546 -1605 5448 -24578 -18921 -43568 -24243
12971b4243k8860m426K595K7964J6872J4292q566j528l36k5618j2227N3153N3495
$$ -24243 -53103 -57529 -54934 -26970 -10098 4194 -4372 -5900 -6236 -31854 -44081 9072 62567
12958F2567k5500J1954l8555l6453J4913o051n7029m600N1903n422O560J0037
$$ 62567 37067 49021 10466 -25987 -11074 -17125 -74154 -78754 -26851 -32273 -25713 -15676
12946a5676M1568J5500K683j3670m5088j4989K6184r594L06n571l844o871J5030
$$ -15676 25892 41392 44075 30405 -14683 -29672 -3488 -13082 -12776 -18347 -22191 -29062 -14032
12933a4032M0674J0987j8127l1667r936j4888L201N5407k5730l3579J0836o674
$$ -14032 26642 37629 19502 -12165 -22101 -36989 -33788 21619 -4111 -37690 -26854 -33528
12921c3528p588L2824O8217m061l5709q361l5644j8854L7416J3388l0098l0075
$$ -33528 -41116 -8292 59925 55864 20155 11794 -23850 -42704 -5288 8100 -21998 -52073
12909e2073K2701K7866m6633m3153J9077K6447N1053q590l5477o645j4762K5747
$$ -52073 -29372 -1506 -48139 -91292 -72215 -45768 5285 -3305 -38782 -45427 -60189 -34442
12897c4442P1810J2604p803n1519k7811L2973M7912O8971M511o6904n5555k6287
$$ -34442 37368 49972 42169 -9350 -37161 -4188 43724 112695 117206 50302 -5253 -31540
12885c1540p474j7623K8273K3120L8529M391O562k4297j0242J2223p62j5118p109
$$ -31540 -39014 -56637 -28364 -5244 33285 37676 44238 19941 9699 21922 21160 6042 -1067
12872a067M1714L0009j7911n8804l0509K9043N3886J3230l5252m0974J1501l411
$$ -1067 40647 70656 52745 -6059 -36568 -7525 46361 59591 24339 -16635 -5134 -8545
12860h545j845N243J695l194J5259L293K014L6917L0925j3261j5104O476l3690
$$ -8545 -10390 -5147 -3452 -6646 8613 11906 13920 50837 81762 68501 53397 59873 26183
12847B6183J8407K0723k5988K6641J718j4634K2509m331r701l8870N24j1478j1609
$$ 26183 44590 65313 39325 65966 67684 53050 75559 71228 61527 22657 23181 11703 94
12834I4M1079O098L5848L0760n3099o6106m1627M4248K9629J823k7895M0444j872
$$ 94 41173 47271 83119 113879 60780 -5326 -46953 -2705 26924 28747 852 41296 39424
12821C9424o317O501O1516m1222m4630j2562R215n102K0348p107j2044l618J4346
$$ 39424 33107 39608 101124 59902 15272 2710 11925 6823 27171 20064 8020 4402 18748
12808A8748J3154L1871J0259M9201R0323J4418m2238p1984o2205j3699Q730r035
$$ 18748 31902 63773 74032 123233 213556 227974 185736 113752 51547 37848 46578 37543
12796C7543K8726j9929l7818k2425n237K7147L6940k8613l5382m27N1673K9283
$$ 37543 66269 46340 8522 -13903 -19140 8007 44947 16334 -19048 -19475 32198 61481
12784F1481k6929m5231o4057j0242o77K5535O4193j7604l5784J2642M7365L2820
$$ 61481 34552 -10679 -74736 -84978 -85655 -60120 4073 -13531 -49315 -36673 10692 43512
12772D3512P494j6542m7314m256K9058j6502j285K9562K0325n6084k5002M1585
$$ 43512 51006 34464 -12850 -17106 11952 -4550 -5835 23727 44052 -12032 -37034 4551
12760D551O243k1190J0148J9715K2373K1694m8802j3836Q817m9917J750k996Q224
$$ 4551 10794 -10396 -248 19467 41840 63534 14732 896 9713 -40204 -38454 -41450 -33226
12747c3226O937L2436M4058r083l491k5619J5454J4530j7163L2516O335j833j8058
$$ -33226 -26289 6147 50205 41122 37631 12012 27466 41996 24833 57349 63684 61851 43793
12734D3793O997j8903k3704o6127l4586M3884J3292l7674J0658P750j2766R211
$$ 43793 50790 31887 8183 -57944 -92530 -48646 -35354 -73028 -62370 -54620 -67386 -58175
$$ [...]
##END NTUPLES=NMR SPECTRUM
##END=
