##TITLE=Analysis number 315536
Compound Code cc 41509
Book Reference 456/80/3
Project Code adrs
Chemist Name anns
##JCAMPDX= 6.0         $$ Bruker NMR JCAMP-DX V2.0
##DATA TYPE= NMR SPECTRUM
##DATA CLASS= NTUPLES
##ORIGIN= Bruker BioSpin GmbH
##OWNER= NMR
$$ XWIN-NMR		Version 3.5
$$ Wed Nov 23 08:42:48 2005 GMT Standard Time (UT+0h)  MAYBRIDGE\NMR@NMR_250MHZ
##.OBSERVE FREQUENCY= 250.131544655141
##.OBSERVE NUCLEUS= ^1H
##.ACQUISITION MODE= SIMULTANEOUS (DQD)
##.ACQUISITION SCHEME= undefined
##.AVERAGES= 16
##.DIGITISER RES= 18
##SPECTROMETER/DATA SYSTEM= dpx250
##.PULSE SEQUENCE= zg30
##.SOLVENT NAME= CDCl3
##.SHIFT REFERENCE= (INTERNAL, CDCl3, 0, 16.4499)
##AUDIT TRAIL= $$ (NUMBER, WHEN, WHO, WHERE, WHAT)
$$ ##TITLE= Audit trail, XWIN-NMR		Version 3.5
$$ ##JCAMPDX= 5.01
$$ ##ORIGIN= Bruker BioSpin GmbH
$$ ##OWNER= NMR
$$ C:\u/data/dgb/nmr/ADRS/12870/pdata/1/auditp.txt
$$ ##AUDIT TRAIL=  $$ (NUMBER, WHEN, WHO, WHERE, WHAT)
(   1,<2005-11-23 08:41:55.13 +000>,<MAYBRIDGE\NMR>,<NMR_250MHZ>,
      <created by zg, POWCHK disabled, PULCHK disabled
       configuration hash MD5:
       62 19 C7 07 E1 42 D1 B7 37 6C 3D D0 77 39 F9 E6
       data hash MD5: 64K
       7C C2 06 B4 5D C9 0B C1 1C 57 40 84 35 C3 87 F1>)
(   2,<2005-11-23 08:42:15.77 +000>,<MAYBRIDGE\NMR>,<NMR_250MHZ>,
      <Start of raw data processing
       ef LB = 0.3 FT_mod = 6 PKNL = 1 SI = 32K 
       data hash MD5: 32K
       86 1E C3 81 99 FB CC 6B EA E8 ED F9 E0 F2 B5 68>)
(   3,<2005-11-23 08:42:20.06 +000>,<MAYBRIDGE\NMR>,<NMR_250MHZ>,
      <apk 
       data hash MD5: 32K
       5B 05 F3 34 A5 AF C5 C5 BC 8A A6 83 9B A5 C2 0A>)
(   4,<2005-11-23 08:42:22.53 +000>,<MAYBRIDGE\NMR>,<NMR_250MHZ>,
      <abs ABSG = 5 
       data hash MD5: 32K
       CF DC B5 D6 F8 DA 37 25 AE D9 70 2B A5 D4 EB 10>)
$$ ##END=
$$ 
$$ hash MD5
$$ 63 E4 EE D2 27 08 E2 43 B6 98 DB 3A AE 24 4B 69
##$RELAX= 
##$RELAX= 
##$RELAX= 
##$RELAX= 
##$RELAX= 
##$RELAX= 
##$RELAX= 
$$ Bruker specific parameters
$$ --------------------------
##$DU= <C:\u>
##$EXPNO= 12870
##$NAME= <ADRS>
##$PROCNO= 1
##$TYPE= <nmr>
##$USER= <dgb>
##$AMP= (0..31)
100 100 100 100 100 100 100 100 100 100 100 100 100 100 100 100 100 100 
100 100 100 100 100 100 100 100 100 100 100 100 100 100 
##$AQSEQ= 0
##$AQ_mod= 3
##$AUNM= <au_zg>
##$AUTOPOS= <3 >
##$BF1= 250.13
##$BF2= 250.13
##$BF3= 250.13
##$BF4= 250.13
##$BF5= 500.13
##$BF6= 500.13
##$BF7= 500.13
##$BF8= 500.13
##$BYTORDA= 1
##$CFDGTYP= 0
##$CFRGTYP= 5
##$CHEMSTR= <none>
##$CNST= (0..31)
1 1 145 1 1 1 1 1 1 1 1 1 1 1 1 1 1 1 1 1 1 1 1 1 1 1 1 1 1 1 1 1 
##$CPDPRG= <>
##$CPDPRG1= <>
##$CPDPRG2= <>
##$CPDPRG3= <>
##$CPDPRG4= <mlev>
##$CPDPRG5= <mlev>
##$CPDPRG6= <mlev>
##$CPDPRG7= <mlev>
##$CPDPRG8= <mlev>
##$CPDPRGB= <>
##$CPDPRGT= <>
##$D= (0..31)
0 1 0 0 0 0 0 0 0 0.06 0 0 0 0 0 0 0.0002 0 0 0 0 0 0 0 0 0 0 0 0 0 0 
0 
##$DATE= 1132735313
##$DBL= (0..7)
120 120 120 120 120 120 120 120 
##$DBP= (0..7)
150 150 150 150 150 150 150 150 
##$DBP07= 0
##$DBPNAM0= <>
##$DBPNAM1= <>
$$ [...]
##$SUBNAM7= <"">
##$SUBNAM8= <"">
##$SUBNAM9= <"">
##$SW= 20.6930455092707
##$SWIBOX= (0..15)
0 0 3 0 0 0 0 0 0 0 0 0 0 0 0 0 
##$SW_h= 5175.983436853
##$TD= 65536
##$TD0= 1
##$TE= 294.16
##$TE2= 300
##$TE3= 300
##$TEG= 300
##$TL= (0..7)
0 120 120 120 120 120 120 120 
##$TP= (0..7)
150 150 150 150 150 150 150 150 
##$TP07= 0
##$TPNAME0= <>
##$TPNAME1= <>
##$TPNAME2= <>
##$TPNAME3= <>
##$TPNAME4= <>
##$TPNAME5= <>
##$TPNAME6= <>
##$TPNAME7= <>
##$TPOAL= (0..7)
0.5 0.5 0.5 0.5 0.5 0.5 0.5 0.5 
##$TPOFFS= (0..7)
0 0 0 0 0 0 0 0 
##$TUNHIN= 0
##$TUNHOUT= 0
##$TUNXOUT= 0
##$USERA1= <user>
##$USERA2= <user>
##$USERA3= <user>
##$USERA4= <user>
##$USERA5= <user>
##$V9= 5
##$VALIST= <valist>
##$VCLIST= <CCCCCCCCCCCCCCC>
##$VD= 0
##$VDLIST= <DDDDDDDDDDDDDDD>
##$VPLIST= <PPPPPPPPPPPPPPP>
##$VTLIST= <TTTTTTTTTTTTTTT>
##$WBST= 1024
##$WBSW= 4
##$XGAIN= (0..3)
0 0 0 0 
##$XL= 0
##$YL= 0
##$YMAX_a= 446185
##$YMIN_a= -411729
##$ZGOPTNS= <>
##$ZL1= 120
##$ZL2= 120
##$ZL3= 120
##$ZL4= 120
##$ABSF1= 16.44991
##$ABSF2= -4.243263
##$ABSG= 5
##$ABSL= 3
##$ALPHA= 0
##$AQORDER= 0
##$ASSFAC= 0
##$ASSFACI= 0
##$ASSFACX= 0
##$ASSWID= 0
##$AUNMP= <proc_1d>
##$AZFE= 0.1
##$AZFW= 0.1
##$BCFW= 0
##$BC_mod= 0
##$BYTORDP= 0
##$COROFFS= 0
##$CY= 12.5
##$DATMOD= 1
##$DC= 0
##$DFILT= <>
##$DTYPP= 0
##$F1P= 14.0000005364418
##$F2P= -0.99999901652339
##$FCOR= 0.5
##$FTSIZE= 32768
##$FT_mod= 6
##$GAMMA= 0
##$GB= 0
##$INTBC= 1
##$INTSCL= 1
##$ISEN= 128
##$LB= 0.3
##$LEV0= 0
##$LPBIN= 0
##$MAXI= 10000
##$MC2= 0
##$MEAN= 0
##$ME_mod= 0
##$MI= 0
##$NCOEF= 0
##$NC_proc= -5
##$NLEV= 6
##$NOISF1= 0
##$NOISF2= 0
##$NSP= 0
##$NTH_PI= 0
##$NZP= 0
##$OFFSET= 16.44991
##$PC= 1
##$PHC0= 82.20229
##$PHC1= 6.379275
##$PH_mod= 1
##$PKNL= yes
##$PPARMOD= 0
##$PSCAL= 4
##$PSIGN= 0
##$REVERSE= no
##$SF= 250.130018029829
##$SI= 32768
##$SIGF1= 0
##$SIGF2= 0
##$SINO= 400
##$SIOLD= 32768
##$SREGLST= <1H.CDCl3>
##$SSB= 0
##$STSI= 32768
##$STSR= 0
##$SW_p= 5175.98343685301
##$SYMM= 0
##$S_DEV= 0
##$TDeff= 65536
##$TDoff= 0
##$TI= <Analysis number 999999
Compound Code 99
Book Reference 9
Project Code 9>
##$TILT= no
##$TM1= 0
##$TM2= 0
##$TOPLEV= 0
##$USERP1= <user>
##$USERP2= <user>
##$USERP3= <user>
##$USERP4= <user>
##$USERP5= <user>
##$WDW= 1
##$XDIM= 32768
##$YMAX_p= 410413989
##$YMIN_p= -539921
$$ End of Bruker specific parameters
$$ ---------------------------------
##NTUPLES= NMR SPECTRUM
##VAR_NAME=  FREQUENCY,     SPECTRUM/REAL,   SPECTRUM/IMAG
##SYMBOL=    X,             R,               I
##VAR_TYPE=  INDEPENDENT,   DEPENDENT,       DEPENDENT
##VAR_FORM=  AFFN,          ASDF,            ASDF
##VAR_DIM=   32768,         32768,           32768
##UNITS=     HZ,            ARBITRARY UNITS, ARBITRARY UNITS
##FACTOR=    0.157963299565203, 1,           1
##FIRST=     4114.61608733765, 0,            0
##LAST=      -1061.36734951536, 0,           0
##MIN=       -1061.36734951536, -539921,     0
##MAX=       4114.61608733765, 410413989,    0
$$ Real data points
##PAGE= N=1
##DATA TABLE= (X++(R..R)), XYDATA
$$ [...]
24092d7733K6658L4859N414n703l6158J69786j003j04481l1277j6900l5444L1609
24080a0373P8147p528M324p9617m72q7804N4765J32331M4402o1024q4310o9700
24068h6859m5726J76617P0791M9729r4796M2075r9521m9693N5187M0537L3660
24057I2001j25319J136j9428j37482R8773J1679J2002K2770m3751Q1584m1249
24046d7284l3675J17993L3402j18921J1223j9746n7153O1341J25880P4704p6745
24035G1019O673j4766Q1762J17402j23919m3212N0134K471p6623r5813L3763J1268
24023B0159j26593M1172n6687n155N5253r9120J24588J48610L608j23033o6066
24012h3264P6336n231j5789Q6275N1347k3965r5678o9389l1191J29679J31458
$$ y = [-47733, -21075, 13784, 19198, 13495, -22663, 147123, 146120, 41639, 10362, -6538, -41982, -10373, 67774, 60246, 64570, -15047, -15519, -103323, -48558, 83773, 128175, 67151, -17159, -86859, -132585, 44032, 114823, 164552, 69756, 111831, 12310, -37383, 17804, 58341, 92001, -33318, -32182, -51610, -189092, -90319, -78640, -66638, -43868, -87619, -6035, -47284, -80959, 37034, 70436, -48485, -37262, -57008, -114161, -52820, 73060, 147764, 71019, 77692, 62926, 144688, 262090, 138171, 94959, 145093, 147564, 70941, -24872, 8891, 20159, -106434, -65262, -121949, -127104, -71851, -170971, -46383, 102227, 105835, -17198, -83264, -6928, -12159, -27948, 58327, 109674, 85709, -9969, -79358, -110549, 19130, 150588]
24001A50588l8856m5652K6625j8044p3627p3133n9369M6410O6964Q9729k5457
23990D6178j16366Q5546J6771r9604l5884r3902P4753J57238J67215j9546r1252
23979I1147j25270j8038J06065K8197j20484j22168l7920q5344l5189R7158K6756
23968a95090k4910J53552m6839l4260N599k2730R5223M0332j32460j35217k799
23957b99599N2011R6036M2871n2946O5625J72643j6710N5251R9116p317o2148
23946A44833j90598n8544n3107J5106q6623j6150J12559O0832R7658R5448j754
23935A19660J01732J7571j26901r6644l3133j4344M0784k6868m8700J6953J10114
23924F0224N9405J1609r9534o4501n7498j43377R859j3940Q4941J83331j5651
$$ y = [150588, 111732, 66080, 92705, 74661, 1034, -72099, -131468, -85058, -18094, 71635, 46178, -70188, 15358, 32129, -67475, -103359, -197261, -122508, 34730, 201945, 182399, 91147, -34123, -52161, 53904, 82101, -38383, -160551, -198471, -283815, -319004, -221846, -195090, -220000, -66448, -113287, -147547, -141948, -164678, -69455, -29123, -161583, -296800, -299599, -247588, -151552, -108681, -161627, -96002, 76641, 59931, 115182, 214298, 206981, 144833, -45765, -104309, -157416, -142310, -228933, -245083, -132524, -71692, 25966, 121414, 119660, 221392, 238963, 112062, 15418, -17715, -32059, 8725, -18143, -66843, -49890, 60224, 119629, 131238, 31704, -32797, -90295, -233672, -223813, -237753, -152812, 30519, 14868]
23913A4868j3434q5424P7528k9168j18319N8291R5736o7538j40824l2984K21553
23902a9715M5599j02035J21287k8974j54332N3600J1940K340J09462l0017L3760
23891D2915L6726j7149m0810o146J0827m4931j8931M7723J8150n2886l7610j8992
23879h1114L7721R6421L3233j49456r6497O5364L5656j57239l4792R3881N1570
23868a05252m9113L9395M9722J04823q9128j2887J67542o5818l3108J12724j2200
23857A06700j57983L7349O6794J9901k8343r8894J5370k8545j15758m3411J17980
23846a08840R9933q3016n3584M7823J38599J59205o4821K8732n1427k69396o1460
23835b18252Q3693J44775P900j70304k9214J17213j35125m2295N0811M9122j1104
$$ y = [14868, 1434, -83990, -6462, -35630, -153949, -95658, 78, -67460, -208284, -241268, -19715, 25884, -76151, 45136, 16162, -138170, -84570, -72630, -70290, 39172, 9155, 42915, 79641, 62492, 21682, 15536, 26363, -18568, -37499, 10224, 28374, -24512, -62122, -81114, -43393, 53028, 86261, -63195, -159692, -94328, -58672, -215911, -250703, -156822, -105252, -154365, -114970, -65248, 39575, -49553, -62440, 105102, 39284, 6176, 118900, 106700, -51283, -13934, 52860, 72761, 44418, -54476, -39106, -67651, -183409, -226820, -108840, -8907, -91923, -145507, -97684, 40915, 200120, 135299, 164031, 112604, -156792, -218252, -134559, 10216, 18116, -152188, -181402, -64189, -199314, -241609, -190798, -141676, -152780]
23824a52780n3242N2974L2842O7509r638k1560K3882K2622j49580o9233J9448
23813b36756n764m9124J69780O5160J8730m9985O1435R8071K521m4925p7885m8505
23801i7247P3504k982j57639L9343J63290N4536o8087j33455q729Q8790J77143
23790A28467p9208O3671M1371J101k7325M737n4074j38625k4490l6643j9392L2853
23778a07557J32970M6663j16680q7043J01290N7640K205k9667P4201Q2724j9685
23767A37061j07953k0497m4075j95421n0343q357J58166J25025k4195m5571j37204
23756b13364K7563J38133N4957Q6579j9718n2555K5273Q8494p2021M7814Q3409
23745A94564j6660n3378k10587n8563J05891Q7065j17139j12555J42640J76194
$$ y = [-152780, -206022, -153048, -120206, -52697, -62335, -83895, -60013, -37391, -186971, -256204, -236756, -242520, -291644, -121864, -56704, -37974, -87959, -26524, 71547, 74068, 29143, -48742, -97247, -23743, -26725, -184364, -145021, 18269, 72805, 4718, -128737, -137466, -48676, 128467, 49259, 112930, 154301, 155402, 128077, 132814, 78740, -59885, -84375, -121018, -140410, -107557, 25413, 72076, -44604, -131647, -30357, 27283, 29488, -179, 74022, 156746, 137061, 29108, 8611, -35464, -230885, -281228, -289585, -131419, -6394, -30589, -76160, -213364, -185801, -47668, 7289, 93868, 74150, 21595, 46868, 135362, 63341, 111155, 194564, 177904, 124526, -86061, -144624, -38733, 48332, -68807, -181362, -38722, 137472]
23735A37472R9436j24593j84165l3408r2467J4454J2009p8238j0206L099O8294
23724a88313J15174R7760n8520M9730K5158m332K7465j1472j48664n9494j14K3095
23712a32527M5779O5010k3750j07818J4031M2560k852m0066o9458N3639J98685
23701D3233m624o4600M0073K9509o8937j3443J62780M965n9270p3504o4845N5880
23689a2783L9225o6611n2578Q8840N1787J37451m944j71607p4872R5802k6401
23678C309J19474k7448j0172M9120r5315Q0268N3916k2519j00495o549J71788
23667B15377n3624o0871R836m7700j24677m8215k2552J87203K35349j12216j15888
23656F2022L7036m2518N1346r1012q310K0039Q9636m1806j20698j33324k3896
$$ y = [137472, 236908, 112315, -71850, -105258, -197725, -183271, -171262, -249500, -259706, -256607, -188313, -73139, 24621, -33899, 15831, 40989, 36657, 64122, 52650, -96014, -155508, -155622, -132527, -86748, -21738, -45488, -153306, -139275, -96715, -99567, -139633, -209091, -155452, 43233, 38609, -25991, 14082, 43591, -25346, -38789, 123991, 128956, 69686, -3818, -68663, -12783, 26442, -40169, -92747, -3907, 47880, 185331, 180387, 8780, -66092, 29710, 3309, 122783, 95335, 85163, 134283, 38968, 119236, 173152, 150633, 50138, 43589, 215377, 161753, 100882, 110718, 63018, -61659, -109874, -132426, 54777, 290126, 177910, 62022, 99058, 56540, 107886, 16874, 8564, 28603, 118239, 76433, -44265, -177589, -201485]
23645b01485J05550J0685n026K8963K5411N0516L7774N1712k3246k4298l994n6019
23633c457m0126n6748J31670J25516K7671k7190m9356p587r9965l4145n7354q1410
23621a72481R7327J2574k8806p4852P2303M9192r1908o2545N2961K7957m7334
23610a65612J3790J87780M1001q4930m5083J43159J37286L4839p6698j29424j4791
23599D1317J00997j27133p0942R7986J00488P1297K579l3929k5268j42751K2676
23588C7317l5549l3007n6146j20414P5394J00277N9377k6090J6416j00387j57252
23577b40064J3241J02390J10520P4351P2078l6598O7225L7624r1714j77483l8835
23566a07265j6808L5521l6257L221L1618J01766M9069P5422L1713p6045l5582
$$ y = [-201485, -95935, -85250, -90276, -61313, -35902, 14614, 52388, 104100, 80854, 56556, 52562, -3457, -43583, -100331, 31339, 156855, 184526, 157336, 107980, 100393, 428, -33717, -91071, -172481, -75154, -62580, -91386, -166238, -93935, -44743, -136651, -199196, -146235, -118278, -165612, -151822, 35958, 76959, -7971, -53054, 90105, 227391, 262230, 185532, 56108, 41317, 142314, 15181, -55761, 42225, 142713, 214010, 216589, 182660, 157392, 14641, 37317, 1768, -31239, -87385, -207799, -132405, -32128, 27249, 1159, 17575, -82812, -240064, -226823, -124433, -13913, 60438, 132516, 95918, 163143, 200767, 109053, -68430, -107265, -124073, -88552, -124809, -121588, -89970, 11796, 60865, 136287, 168000, 91955, 56373]
23555E6373k7815M563m9541J269j3129k518N8503k9348r4262j00028J6666K26845
23543D7578k17343l2348J59154M4079L8871l2480J8751m4530j8381N3816J12667
23532A29834M1236P3478r3232p6963p3190m94N7915j33684K7841l7958q6970j5990
23520a88177P0290M6758p6842L981J2943q0934L2779J02366M0653J3980n0502
23509g2705j7839K2493P3972J44416n5615k05845j19268J48461J43698P0830K4823
23498A57421k49574j09506j50537n5525j11212K7479R6289J25560N121O6482J3514
23487a84488N7544K0852N730m8434q9427O9910J95176J375o1628j17624o2895
23476b13909M5824J26337J83038J44781M2105p3755j14454q8627q498K75j45543
$$ y = [56373, 28558, 33121, -16420, -15151, -28280, -30798, 27705, -1643, -95905, -195933, -179267, 47578, -169765, -202113, -42959, 1120, 39991, 7511, 26262, -18268, -36649, 17167, 129834, 171070, 244548, 151316, 74353, 1163, 669, 58584, -75100, -47259, -85217, -172187, -188177, -117887, -71129, -147971, -143990, -131047, -211981, -179202, -76836, -36183, -22203, -72705, -90544, -68051, 5921, 150337, 94722, -111123, -230391, -81930, 61768, 132598, 157421, -92153, -201659, -352196, -407721, -518933, -491454, -395165, -269605, -264484, -198002, -184488, -126944, -106092, -100362, -148796, -238223, -168313, 26863, 28238, -33390, -151014, -213909, -168085, -41748, 141290, 286071, 328176, 254421, 139967, 51340, 42842, 43117, -102426]
23465a02426k6691J31967j6211R448O1771j5926p844k5560n9073j1175J22743
23454F1023P640n5939o6499P928q175L2393o7582o6085L4812Q5487J69549R300
23442A43852l9609k07853j66163L9701R7317L8893J02423J08318j8973j44271
23432d6365j74095J7098R0980J07773Q120J16415j380o3403l8370j14703N1646
23421d6284M6669n6068j1824M2620O053j0498n234l3978l6086J18217k0119j79042
23409a85574j4829P0824p141j5254P797J5026m9965Q6099M6870l8494j87131j94171
23397d65943J67408K47646N6214MN6825K6737k5688o2373p525j7915o4058J19911
23385C1243J40195M264j1111l2870K8058J07494q716j42582j63762Q0702M7380
$$ y = [-102426, -129117, 2850, -13361, -3913, 57858, 41932, 34088, 8528, -50545, -61720, 61023, 68663, 12724, -53775, -45847, -54022, -21629, -89211, -155296, -120484, -34997, 134552, 143852, 104243, -103610, -269773, -230072, -132755, -93862, 8561, 116879, 97906, -46365, -220460, -203362, -112382, -4609, 3511, 119926, 118546, 55143, 16773, -97930, -46284, 385, -55683, -67507, -24887, -18834, -29332, -34566, -68544, -104630, 13587, -6532, -185574, -200403, -129579, -136720, -151974, -144177, -129151, -179116, -93017, -46147, -84641, -271772, -465943, -298535, -50889, 5325, 5329, 62154, 88891, 63203, 830, -6695, -24610, -88668, 31243, 171438, 175702, 164591, 131721, 159779, 267273, 258557, 115975, -47787, 32915, 80295]
23374H0295L9694n02j11443r1783K2738k8263O735N2728J36876p1088m1095L4224
23362B9116r4682O4378J8378j005J9022j2943m1821J451j48420R701M0396q2674
23350a99103J6586m0318L2628L8394M4611m3486O192J12503M5204r9251K6658
23339e9382J6848n5413m9124P0539l8769o6656l6764J01364m1339n3780J08165
23328a04311Q2931k1969n7182j37783J01812J05682K4794J5255J1004q2940k8471
23317i1178j11738j062R8846J3190l3122n3868r2322l4079J29534Q4339k307O7508
23305b6259p983p0378R6676P7520M4603q2835j01688j072L2209l2401J28668J6553
23293G3613j34318n0553k6419N9687k2137l9577j6916R9744Q600j15321j9956
$$ y = [80295, 119989, 119487, 8044, -83739, -61001, -89264, -82529, -29801, 107075, 35987, -5108, 29116, -65566, -1188, 17190, 16185, 35207, 22264, -19557, -18106, -166526, -156825, -116429, -199103, -182517, -222835, -190207, -151813, -107202, -150688, -144496, -31993, 13211, -86040, -59382, -42534, -97947, -147071, -76532, -115301, -181957, -218721, -117357, -158696, -212476, -104311, -21380, -43349, -100531, -238314, -136502, -30820, -6026, 9229, 20233, -62707, -91178, -202916, -203978, -105132, -91942, -125064, -178932, -271254, -305333, -175799, -91460, -93767, -26259, -34242, -104620, -7944, 69576, 114179, 31344, -70344, -71416, -39207, -71608, 57060, 73613, -60705, -111258, -137677, -77990, -100127, -139704, -156620, -56876, -48276, -163597, -183553]
23282a83553N237R6402O5742q6500o1201j57601J1242M9191J14683J98055P6041
23271A27738J8050L466N4519j13962o9395j09326o6785K5846N1076R919m0016
23260a08870J13223M8067M5017O934N4199M1245j17893p0169L8156M5739o1594
23249C4054j74786n0874J19068j5483P4941l0478k5590J11223O0006j91132j69333
23238b58384j3580J33937j5732n9644j45749L6039J57053l0986O2810J9520N2405
23227f2311o9703n9578m4247Q3859J17957P5670o7781j32836o9969R4979M2472
23216i1488l2722J07973O2193k8080j04649j98354j80561J3945j531N8985J15791
23205b78498n8960J8015J67308j0405l0798n4396O7000R5070J26276J04185n8805
$$ y = [-183553, -178316, -81914, -16172, -102672, -163873, -321474, -310232, -261041, -146358, 51697, 127738, 145788, 149254, 203773, 89811, 20416, -88910, -155695, -129849, -78773, -68854, -108870, 4353, 52420, 97437, 104371, 158570, 199815, 81922, 11753, 49909, 95648, 34054, -140732, -191606, -72538, -88021, -13080, -43558, -69148, 42075, 102081, -89051, -258384, -271964, -138027, -153759, -213403, -359152, -323113, -166060, -197046, -134236, -114716, -62311, -132014, -191592, -235839, -151980, -34023, 41647, -26134, -158970, -228939, -133960, -91488, -124210, -16237, 45956, 17876, -86773, -285127, -465688, -451743, -453274, -394289, -278498, -337458, -319443, -152135, -162540, -193338, -247734, -180734, -85664, 40612, 144797, 85992]
23194H5992r1667m5468p8059K0218R2893R6295k3901j13901j23664m4867J42472
23183h3657J45357j1775O8115N9397l5978q9414j19568j12125K8643P7240m9757
23172a23522n3827k0643J16794J45740K1880J7185N7082k1401k8736L464J01115
23161B15131m1107l7355j44038p8205N7697P0689L4710Q0541o6674K6969P1341
23150A89699j6136O528l8326O0836j02550j13406k4817O671o5241l5983P6043
23139e6682J9134j3239J2408k4176j65836n5304R4843n7331R9053J21622Q2597
23128E7089O0135p6135j09750K8927Q9151M3684m4865k19338n3912r8079J43876
23117a79217J67740N1074j27332P2904J441N2930M61l509l1381J4841j21998N4968
$$ y = [85992, -5675, -51143, -129202, -108984, -16091, 80204, 56303, -57598, -181262, -226129, -83657, 61700, 49925, 118040, 177437, 141459, 52045, -67523, -179648, -151005, -73765, -123522, -177349, -197992, -81198, 64542, 86422, 103607, 160689, 139288, 110552, 114016, 215131, 174024, 136669, -7369, -85574, -27877, 42812, 77522, 158063, 91389, 118358, 189699, 173563, 180091, 141765, 202601, 100051, -13355, -38172, -31501, -96742, -132725, -56682, -37548, -50787, -38379, -62555, -228391, -283695, -188852, -246183, -147130, -25508, 57089, 117224, 41089, -68661, -39734, 49417, 93101, 48236, -171102, -225014, -323093, -179217, -11477, 39597, -87735, -14831, -13390, 39540, 40001, 36492, 5111, 19952, -102046, -47078]
23105d7078J80186K23228o3010k87436l7700N065J4992P9388j3186q8470K2325
23094a1696M8779k4872r9740j20354L1620o2657n7925M3686M2419J84306L6074
23083I640Q9584R4020m1920p9873j66451o6657N720J44319J72271J5444l6187
23072A39910j25717o6889p8701Q2384j31206K9137M4231J74593J29504n2613j36632
23061H001p1814M2198m6429j15734J04294J90406Q0534j17278r0350j24707q2885
23050b23764J10213K5576j03368p5501N9291R1268R5733l6646N7431j4653J27150
23039A12730R2895P6655l2946j46814o8285j8197o3598k15P7570p7571L3143O0860
23027D6227J3865m7693o0910m0668j47357k7378J77700Q1833J8547j26092Q3813
$$ y = [-47078, 133108, 356336, 293326, 5890, -31810, -26745, -11753, 67635, 54449, -34021, -11696, 37083, 12211, -87529, -207883, -176263, -238920, -296845, -253159, -210740, -26434, 9640, 99224, 193244, 151324, 71451, -95000, -161657, -155937, -11618, 160653, 176097, 139910, 14193, -52696, -131397, -49013, -180219, -151082, -106851, 67742, 197246, 144633, 8001, -63813, -21615, -68044, -183778, -79484, 110922, 191456, 74178, -16172, -140879, -223764, -113551, -87975, -191343, -266844, -207553, -116285, -20552, -57198, 233, -14420, 112730, 205625, 282280, 249334, 102520, 34235, 16038, -47560, -47775, 29795, -47776, -14633, 46227, 60092, 12399, -48511, -89179, -236536, -263914, -86214, -4381, 14166, -111926, -28113]
23016b8113n492J14855P3620K9539J9470m0514k2879o488o5808p4038m3374o691
23004e5913L9641q1717p6319J93861K09406k9202j33667j48813K0868M3693N5535
22993C7373o1623j13464n592J18440k2689n949K3835j24745K5336M8604j32890
22982b13364m1679Q6681R4290j11168M6982k8870p0569Q9132J07420J1639j78864
22971b08370r1693P8590k7335o1557R4551R97J35614m7083J0955O3102J45003
22960I2774N4703j02511J12577O3815p7259n9374j42249m0027n9677J4995J80760
22949C8527O4469R860M4838J7867n1381j17479j06375q4451J19955J75401j14441
22938c210j82628j25719Q8920J27988q9474P3688R6469m0252L9708k2374j6467
$$ y = [-28113, -33605, 81250, 154870, 184409, 203879, 163365, 140486, 133998, 68190, -5848, -49222, -55913, -16272, -97989, -174308, 19553, 228959, 199757, 66090, -82723, -61855, -18162, 37373, -24250, -137714, -143306, -24866, -47555, -53504, -29669, -154414, -129078, -80474, -213364, -255043, -168362, -74072, -185240, -138258, -167128, -237697, -148565, -41145, -29506, -208370, -300063, -221473, -248808, -310365, -215814, -214817, -79203, -126286, -115331, -52229, 92774, 147477, 44966, 157543, 221358, 144099, 84725, -57524, -97551, -157228, -142233, 38527, 102996, 112856, 157694, 175561, 124180, 6701, -99674, -184125, -64170, 111231, -3210, -185838, -311557, -222637, -94649, -184123, -110435, -13966, -54218, -14510, -36884, -53351]
22927e3351Q9636l9531m1177p729J02265J72768j09011q1849o178N0741O5808
22916A42392m8829k2903o6676m6926O1306O4935M1406r755l0673M0222j66197
22905d1698K1763R7354O8863q5205n5663j85251P1402J33428L2715j0054P2811
22894A20465j3340j658k1964P0625J61778J5504k19647j39002k2976n7648j33121
22883b40984P0954R8752J18269M8390M342r4483o5650K4973K29586J3639j10011
22872I7777k67838j77001O1555K4137L6178Q547R3453J07233J6283K8944k9886
22861f18m4122l0721L3060N7718n0617j4072o0774n5918M2575k9973Q9133J00994
22849C6665j15206M2040J05656R0507j04511j66437O1992J56880J21899n2061
$$ y = [-53351, 36285, -3246, -44423, -52152, 50113, 222881, 113870, 32021, 25843, 76584, 142392, 93563, 70660, 3984, -42942, 18364, 83299, 124705, 114950, 84277, 124499, -41698, -19935, 77419, 146282, 61077, 5414, -179837, -108435, 24993, 57708, 47654, 120465, 107125, 105467, 83503, 154128, 315906, 331410, 111763, -27239, -50215, -107863, -240984, -170030, -71278, 46991, 95381, 99723, 5240, -60410, -35437, 194149, 207788, 97777, -170061, -347062, -285507, -261370, -225192, -216645, -123192, -15959, 324, 29268, -618, -44740, -75461, -42401, 15317, -35300, -49372, -110146, -166064, -123489, -153462, -64329, 36665, -78541, -36501, 69155, 159662, 55151, -111286, -49294, 107586, 229485, 177424]
22839A77424J07501O9814L0059J8923q1739K3862j66277j52476L0430M1940q9128
22828A0333K2685J4653k6062P8956P6726n5560M9217p1523k05246R129J41266
22817D4574O8642j12043m4112j6647k1093J07485Q1528M2580n2393j60571j58452
22806b20502n9116m0836m0273J61470J18824P3154O3639p5245j1799J08561Q1835
22795A59712k23006j08722P8436P5094P7732Q5401J11190r1548j71366l6274L0941
22784a2410P2831K8499P92j3355k8082J21092o306j48117j34587J1172J43934
22773C5463O1418N1412o7380N7978j01742l579J1157R2408K8265k16593j7462
22762f8655J41432J19905Q2687j33813j3245o2940o2041n4347m0370Q2272J95527
$$ y = [177424, 284925, 354739, 384798, 403721, 321982, 345844, 179567, 27091, 57521, 99461, 10333, 33018, 47671, 21609, 100565, 177291, 121731, 170948, 99425, -105821, -96692, 44574, 113216, 1173, -42939, -59586, -80679, 26806, 108334, 150914, 98521, -62050, -220502, -279618, -320454, -360727, -199257, -80433, -7279, 56360, -18885, -30684, 77877, 159712, -63294, -172016, -93580, -18486, 59246, 144647, 255837, 164289, -7077, -43351, -12410, 60421, 88920, 89712, 76357, 48275, 169367, 163061, 14944, -119643, -108471, 35463, 96881, 148293, 80913, 138891, 37149, 33570, 44727, 137135, 165400, -51193, -68655, 72777, 192682, 275369, 141556, 128311, 65371, 3330, -51017, -91387, -9115, 186412]
22751A86412M2260j11379p743m2237j2704p3423n0850J8374q326L6470J15283
22740I2137o6671J586P3666k3083q0045l7236P7078N1486j1200Q7868j11883j54727
22728a01024k4936m734L8064J17716O260k1888O2393m6650k2065J25459K6567
22717A55162l6807R2538o0920j65783j07979J5779P0539K8103o9999j05717K8389
22706a56695J74573Q7095M8179n9364o1216O0084J03726k5709n3630o4946j04187
22695e2090j29832R8226J61554l7710j23502n7018L8426m8691N9055Q6420j6694
22684b1856J5575L7299j26202j21081p2519J51267J4546J12254o6078J15116N3103
22673I1424J22193M7266k0438j08216k4819J41931j88171j69744M1186K56295
$$ y = [186412, 228672, 117293, 109550, 67313, 54609, -18814, -69664, -51290, -59616, -23146, 92137, 25466, 27052, 100718, 77635, -2410, -39646, 37432, 88918, 77718, 165586, 53703, -101024, -125960, -130694, -92630, 25086, 31346, 9458, 71851, 25201, 3136, 128595, 155162, 118355, 210893, 149973, -15810, -123789, -108010, -37471, -9368, -79367, -185084, -156695, 17878, 104973, 153152, 93788, 32572, 92656, 196382, 170673, 117043, 52097, -52090, -181922, -83696, 77858, 40148, -83354, -140372, -101946, -150637, -91582, -5162, -21856, -6281, 31018, -95184, -216265, -288784, -137517, -122971, -10717, -76795, 38321, 91424, 213617, 260883, 240445, 132229, 107410, 249341, 61170, -108574, -67388, 188907]
22663A88907J61263o6890j75528j99354p4862J10715K5682q9691J58574K19189
22653B58005l5121j78124n3092q3279o0323m307o9644L042m2959m2037P6382P0718
22641a60739J40791J02656k3910K7114o9237K0464O942j08830n8309M2344q1664
22630a62378L7658Q2509J1950P4752O9348j7979j06087L022n0834j28458j05017
22619b91514Q2723j312k0962O4596K26616K22767k5907j02567m4641r2409q2343
22608f4953k1495R7345R5459Q640r6665p2327r3313K5878l1695L218J07004q464
22596e1368o4056M5742J83065J15045R6675r4030n9974j29853l0323k5375j9896
22585c4348J7734P8929O85k8670o0788p7106J9929J18801j02486Q8008M0438m030
$$ y = [188907, 350170, 283280, 107752, -91602, -166464, -55749, -30067, -119758, 38816, 258005, 222884, 44760, -8332, -91611, -151934, -156241, -225885, -222843, -265802, -307839, -231457, -160739, -19948, 82708, 58798, 85912, 16675, 37139, 44081, -64749, -123058, -80714, -162378, -124720, -42211, -30261, 44491, 113839, 95860, -10227, -7205, -58039, -186497, -291514, -208791, -210103, -231065, -166469, 60147, 282914, 257007, 154440, 109799, 17390, -64953, -86448, 10897, 106356, 114996, 18331, -53996, -147309, -121431, -153126, -149908, -42904, -51368, -115424, -69682, 113383, 228428, 325103, 231073, 171099, 41246, 10923, -14452, -34348, -16614, 62315, 63000, 34330, -26458, -103564, -83635, 35166, -67320, 20688, 61126, 57096]
22573E7096j985k2502m5405l1350q5182n4034R1326R5207k1087j0821P0927k6143
22561A6047j8987Q1714J06674r5904j29252j04839J16336P7583j03692r361R9834
22550C6153N7495P8143L755L5119j48386j62781O3389N3212j04437r1557K6823
22539a53072j07809L7444M4045l5630J52923J03565K00998l5613j19714j12808
22529b5671k8583Q396O6398J09091r8192n1661n5642j02130j64605M5081J61906
22518a35612J61075l2113n4036J41246J41820j68924l7909p463J6633R6738n4334
22507F7121m0605R2835O7361j31231Q8902l179j51695p6905P259J0439n0856l0756
22495a51310l7513n2592M2851O2850M354M6119J1787r0140n3002M0440J14589
$$ y = [57096, 55111, 32609, -12796, -44146, -129328, -183362, -92036, 3171, -17916, -28737, 42190, 16047, -2940, 78774, 185448, 89544, -39708, -144547, -28211, 49372, -54320, -63681, 36153, 93648, 171791, 175546, 210665, 62279, -100502, -37113, 16099, -88338, -179895, -153072, -260881, -223437, -179392, -215022, -62099, 41466, 242464, 206851, 87137, -25671, -54254, -45858, 20540, 129631, 31439, -20222, -75864, -177994, -342599, -297518, -135612, 25463, -6650, -60686, 80560, 222380, 53456, 15547, 8084, 24717, 121455, 67121, 26516, 119351, 186712, 55481, 144383, 141204, -10491, -87396, -80137, -69698, -120554, -151310, -188823, -241415, -198564, -135714, -131360, -85241, -73454, -163594, -216596, -176156, -61567]
22484f1567M7891p7169J6546M1038j71176L2394K06292M7434l3917r0190n7188
22473i9612l8290n8386J42298L7787p6689n2575m5497L9225L2697k3676k6838
22462a69556J08341J29455o9534j44892O0730j10757K5923K248K7892j3512l8549
22451a92211n6325m239R7205j3853j85652n4402P322n6068J10661J47281R5036
22440a05245P5210L188N4610J5549o6754M7422N7157n8394M4162J37878k1416
22429A83367n6582m9588P636P4879J3559o1983n5024p0128P4648l7018l8111p1029
22417h5374J1368k464O8802Q3431R8041N882j37763n7280k1903K0834Q3338N7789
22405A24701j29611j97942M919J54020K1054k0534N9236j1857m3035K9897o6510
$$ y = [-61567, -13676, -90845, -74299, -33261, -204437, -172043, 34249, 81683, 47766, -42424, -99612, -137902, -196288, -53990, -16203, -92892, -145467, -190964, -151739, -119042, -142718, -169556, -61215, 68240, -1294, -146186, -85456, -196213, -170290, -168042, -140150, -153662, -192211, -248536, -252775, -155570, -169423, -355075, -409477, -402155, -458223, -347562, -200281, -105245, -30035, -26847, 27763, 43312, -23442, 23980, 81137, 22743, 66905, 204783, 183367, 126785, 77197, 84833, 159712, 173271, 111288, 56264, -13864, 60784, 23766, -14345, -85374, -74006, -76470, -7668, 75763, 173804, 179686, 41923, -15357, -37260, -16426, 66912, 124701, -4910, -202852, -197933, -43913, -22859, -43393, 15843, 3986, -39049, -9152, -75662]
22394g5662l114J40825M6010K9869n2487r7143p5807n3393j0577M5183J05314
22383i82R5412m2508r1060L8853m2431N4350j485R9687J35643p7291n6605j4178
22371I7405j31657n8725L9249j28039o4311r8144M4566K63341J27574l6282j7498
22360C7479j65366j52296Q3482P1909J10110J12408j163r6232k9253Q7646R753
22349F8477r4297M1811J2579K1545o3908R536R3315J09805P8108r8927j24319
22338E3725k01465R7517K01606N5191m4767q2569o6022Q6820o8056k7626O7430
22327G1784j30810j23980J31346Q3706R0686O9551j1045n6717r9237l5911k8791
22316c9418m2252L4293K5178J9743j9903k124j5325l9575j136L5170J3184K3846
$$ y = [-75662, -78776, 62049, 108059, 137928, 85441, -11702, -87509, -140902, -151479, -106296, -982, 94430, 51922, -39138, -285, -42716, 11634, 10149, 109836, 245479, 168188, 111583, 97405, -34252, -92977, -53728, -181767, -246078, -344222, -299656, -36315, 91259, 54977, 37479, -127887, -280183, -196701, -124792, -14682, 97726, 96563, 331, -28922, 58724, 68477, -25820, 15991, 28570, 50115, -13793, -4257, 89058, 198863, 276971, 178044, 53725, -147740, -50223, 151383, 206574, 161807, 79238, 13216, 100036, 31980, 4354, 71784, -59026, -183006, -51660, 32046, 122732, 192283, 181238, 124521, 25284, -10627, -39418, -81670, -47377, -22199, -2456, -22359, -24483, -39808, -79383, -80519, -45349, -32165, -8319]
22304h319O5911L4703k02305p8057M03q6993K5108K58786N8577l0716n9017j6463
22292c8382r7033q2845N4331K15320M8435o9872r2060N4155J1312o6534j16343
22281a79516j1114O2038Q1921o6738m9808Q3112J17366P0406K7304N1752K4550
22270B11273j08025k05315O4605m8406k435J75848k014n1381j58040K7929M2159
22259e3802J12681L0599L5870J5853q2976J43593l3647j3177l1628r4191J16057
22248A45232o5559p3311r704N6266n3253q5281j7454m3496L9798J10104J20024
22237A23366l2764K5180L022q7921J2540O9777l9345j8448n3138L3201J00331
22226A35801j01698l9432Q0756L3380N9491j2324p0611j28191O3466Q5627l3433
$$ y = [-8319, 57592, 92295, -110010, -188067, -187664, -274657, -249549, 9237, 67814, 37098, -21919, -38382, -135415, -218260, -163929, 51391, 99826, 29954, -62106, -7951, 3361, -63173, -179516, -190630, -128592, -46671, -113409, -163217, -80105, 37261, 107667, 134971, 186723, 211273, 103248, -102067, -37462, -85868, -88303, 87545, 85531, 34150, -123890, -95961, -53802, 58879, 89478, 125348, 141201, 58225, 201818, 168171, 154994, 123366, 29175, 145232, 79673, 6362, -3342, 52924, -329, -85610, -103064, -146560, -106762, 3342, 123366, 90602, 115782, 118804, 30883, 43423, 113200, 73855, 55407, 2269, 35470, 135801, 34103, -5329, 75427, 108807, 168298, 155974, 85363, -42828, 20638, 106265, 72832]
22215G2832j6106K5177N4739P1994p7505j60256j30151j56004J30225J43920m4816
22204h5951K02295M3590Q6211j71954j34864l1142j9993J9161m671J08388J20172
22193A31242Q1563m6825R7660o1628r9232N5356L6589q0731r7760l8948M2870
22182B0156J21019p2288j38557L187n0209K15888R2774o0518p8718m6929j070
22171D735J399r989L6455l2873n4923j9910L1290k7091O9481mO5110o1844n0096
22158d8260j6486P2545M2737j00211Q909k3066n760k554J2523R238j6767J41416
22146G4264j1021j34912o786K58233k2885j50549K8160k4717q4813J4591J36211
22135G5776J21447k8629J05719M939j09112n7221N4286k3896O5923M5925R776
$$ y = [72832, 56726, 81903, 136642, 208636, 131131, -29125, -159276, -315280, -185055, -41135, -85951, 116344, 159934, 246145, 74191, -60673, -91815, -111808, -92647, -97318, 11070, 131242, 212805, 165980, 263640, 202012, 102780, 158136, 194725, 113994, 16234, -22714, 20156, 141175, 68887, -69670, -66483, -116692, 99196, 191970, 131452, 52734, 5805, 4735, 6134, -3855, 32600, -273, -55196, -75106, -43816, -70907, -1426, -1430, 63680, 1836, -48260, -64746, 7799, 50536, -49675, -40766, -63832, -69592, -72146, -59623, -50385, -67152, 74264, 63243, -71669, -78455, 179778, 156893, 6344, 34504, 9787, -75026, -60435, 75776, 197223, 168594, 274313, 279252, 170140, 112919, 167205, 143309, 209232, 255157, 264933]
22124B64933k3298j90446l23085O490N7804M0586J03646K9300N2171n4591q361
22113d4851L2488j7946j02381r827O5979l199L0065Q435K8553J55464L4137q0466
22101I6451j0558n3512L4548R356j26386M8145J85343r0579m4642O5198J72484
22090B85848q4181k33010l8990L499K0660J03943q5571j42953J26943Q0973o4872
22079b7711m6554O5521R1986Q5403m4783j47326R7951N9130K96R0714Q0812j86629
22067A18810j5918J9272P233L3784R699j48531n8478J92857J51892n8657j90315
22056F1648n1188j7779J630m5934k5022M5340j8712o5038n5610K0801K9475q2718
22044b03107o4189P7822J88572m7922j65680J1446K10316R8752n0714m4987j02594
$$ y = [264933, 241635, 51189, -271896, -265406, -207602, -167016, -63370, -34070, 18101, -36490, -44851, -12363, -30309, -132690, -142517, -76538, -79737, -49672, -41237, -12684, 142780, 176917, 96451, 85893, 32381, 66929, 76285, -50101, -1956, 183387, 92808, 48166, 113364, 285848, 201667, -31343, -70333, -66834, -46174, 57769, -27802, -170755, -43812, 37161, -27711, -74265, -8744, 83242, 168645, 123862, -23464, 74487, 133617, 133913, 224627, 305439, 118810, 102892, 122164, 129397, 163181, 172880, 24349, -34129, 158728, 310620, 251963, 61648, 10460, -7319, -5689, -51623, -76645, -31305, -50017, -115055, -170665, -149864, -120389, -203107, -267296, -189474, -902, -48824, -214504, -203058, 7258, 106010, 55296, 10309, -92285]
22033i2285q2762o3637J7930n7306O1020P0069L8120P2093j20875K984j0915K3588
22021a41976J29028m2018p7059J05723L2065J37223J33069n4507n8820l8062o7778
22010E6888k8789m3544J13364Q9684j31987j14472J8k5202k1287p8789N2765m3385
21998a74736K692J34190L3940n1301O3731o2118j4432Q5902P5875p7440j4634
21987A669M2603k770j29622n8835L4188l6596N7982J32636o7748j00984k0415
21976a47892k7014J50289M1184q2183l8761J60580j20513N229J21845l6179L7719
21965F4304O8454R2536J20308K3007r5290j03011L8867n8128j14676m5512j2914
21954b2055j02448N4095p6192k8255j26461m7320J72889J10629J938m3525L4895
$$ y = [-92285, -175047, -238684, -220754, -278060, -217040, -146971, -108851, -36758, -157633, -154649, -165564, -141976, -12948, -54966, -132025, -26302, 5763, 142986, 276055, 221548, 162728, 124666, 56888, 28099, -15445, 97919, 187603, 55616, -58856, -58838, -84040, -105327, -184116, -131351, -174736, -172044, -37854, -3914, -55215, 8516, -53602, -68034, 17868, 93743, 16303, 1669, 44272, 41502, -88120, -146955, -112767, -149363, -91381, 41255, -26493, -127477, -147892, -174906, -24617, 16567, -65616, -104377, 56203, -64310, -59081, 62764, 26585, 64304, 132758, 225294, 345602, 368609, 273319, 170308, 209175, 151047, 36371, -9141, -22055, -124503, -70408, -146600, -174855, -301316, -348636, -175747, -65118, -63180, -106705, -71810]
21943g1810J25775J06769J961K3940J27843j13061j28407j67569l2319M6851q2485
21932a62512n5456j8091j07035N1971M7255R2514q642O9995J08580n7827l3543
21921g2791P7149J04591R6893r690r2873m5770J7362N3557r2531j16638K3644
21910e7097M0166k1556n1271K9461R8748j42708j60782J2847j8744n95J07113
21899a64418P1659l0426n4555M1704J92511J1550j22167M9169O6805m0361j31665
21888a10194r4378Q2973J47285Q154K6734j02943L4669K1428j65217N088M3542
21877a02859J09129Q2392j5473P3619K4839j08643j36790r2159J2000O0719N1718
21866d1508K9222o791Q6202J099l170J8049j4986O966K3273j58457r974n2041
$$ y = [-71810, 53965, 160734, 162695, 186635, 314478, 201417, 73010, -94559, -126878, -80027, -162512, -217968, -236059, -343094, -291123, -243868, -151354, -159996, -90001, 18579, -39248, -72791, 4358, 108949, 205842, 196152, 103279, 57509, 74871, 128428, 35897, -80741, -57097, -16931, -38487, -89758, -60297, 38451, -104257, -265039, -252192, -270936, -271531, -164418, -92759, -123185, -177740, -136036, 56475, 68025, -54142, -4973, 61832, 21471, -110194, -204572, -121599, 25686, 33840, 60574, -42369, -7700, 13728, -151489, -146401, -102859, 6270, 88662, 73189, 146808, 171647, 63004, -73786, -165945, -153945, -93226, -41508, -12286, -19077, 67125, 68224, 65054, 83103, 68117, 75083, 98356, -60101, -70075, -122116]
21854a22116n5l4205R1340J24621K3810j13019m8069l3119j24246q9996J26790
21843a98264R3526J7491j08008L873k4920J34121J32522M5582j51789j72200k01415
21832d29481J47558J85060q1683K8785J0614q1929m28o3527P3354R3315J24883
21821F521L6380J04397N7717j50426j71811O9261N3821L330j13134M8637K1142
21810c4165q3367n8040Q1591N7415Q5692n9783j56693P0995J80718m5885k30328
21799a91850p3142P3866M3672J12691o9551j66785R3757J98899N4116k2986j8224
21788C4463K3538l2913r4861k3558j5481j4616l450J708Q0579J42896J74059j2881
21776B59483j99363p5125Q4507J09650m4806j11084o405P4609J45650o9965j25909
$$ y = [-122116, -122171, -156376, -65036, 59585, 83395, -29624, -77693, -110812, -235058, -325054, -198264, -104738, -87247, -195255, -191382, -216302, -82181, 50341, 95923, -55866, -228066, -429481, -281923, -96863, -178546, -149761, -139147, -221076, -221504, -285031, -211677, -118362, 6521, 42901, 147298, 205015, 54589, -117222, -47961, 5860, 9190, -103944, -55307, -34165, -117532, -175572, -93981, -36566, 49126, -10657, -167350, -96355, 84363, 38478, -191850, -264992, -191126, -147454, -34763, -104314, -271099, -177342, 21557, 75673, 52687, 34463, 58001, 25088, -69773, -93331, -108812, -123428, -126878, -125170, -44591, 98305, 272364, 259483, 60120, -15005, 69502, 179152, 134346, 23262, 16857, 91466, 237116, 167151, 41242]
21765D1242j71659l1761M499p0235n4055j28079j05259k4614R2840K43121O8704
21754a35256R1721M2699l35l6054j19158j305M5629O6102L5837L2363l2097j4593
21742b4447J02286N2037j275J742L18j7188n8063Q3797P4232j90313j84324l4778
21730a95976J21337L676L6424J79703o8962k2704q7998L17R1015J14363N00r3255
21718G8440m7680M0937M2752M9550j19352q7016R5531R2351k55r9542J7990l3613
21706C0093L9577L1977L3061l0023P8396o6076j3690l919O7620k1932p8470j77495
21694a10881j3556j6563L3597p8226o7510O9444M066L2417L0677J70093O7167
21683A20725k11967l2752M0825j28444P7752o2774J6848P3588j5574Q102J35469
$$ y = [41242, -130417, -162178, -157679, -227914, -281969, -410048, -515307, -539921, -447081, -203960, -135256, -43535, -836, -1171, -37225, -156383, -157688, -112059, -45957, -10120, 22243, -9854, -24447, 77839, 129876, 128601, 130343, 130661, 113473, 55410, 139207, 213439, 23126, -161198, -195976, -74639, -70963, -34539, 145164, 76202, 53498, -34500, -34183, 56832, 171195, 171695, 78440, 30760, 71697, 114449, 163999, 44647, -42369, 53162, 145513, 145258, 45716, 63706, 30093, 69670, 101647, 134708, 104685, 183081, 117005, 103315, 99396, 167016, 145084, 66614, -110881, -124437, -141000, -107403, -185629, -253139, -183695, -179629, -147212, -116535, 53558, 120725, -91242, -123994, -83169, -211613, -133861, -196635, -179787, -106199, -121773, -113671, 21798]
21672B1798K77905O7293j12474j90877k4751n3360J23443K728j17731K7639j4478
21661G135l439R5475n1021m5301K5732J8524j78295j73034p1828Q5513J87279
21650a03260J8847K1251L2677O2509P1349J1064j00802p8095m765J43646m9577
21639B4844k5468j85810j68178K2470J42465R7120L5904K5417n791L0058O8978
21628F2009L4908R4608j26006q4093o5668q851k9230l7265o040j04327n7155m0987
21616c68097k5718n2546P0036Q2870L0947J34644K05949r956j37018l3285L6120
21605f6054M2202O8187J5154j31630M4909Q621j03907M4353L7000n891j44274
21594a91330j28087l0416J68701R8245N0986k643q7246l6395K2128R2390P8235
$$ y = [21798, 299703, 366996, 254522, 63645, 38894, -14466, 108977, 111705, -6026, 21613, 7135, 3696, 99171, 48150, 2849, 28581, 47105, -131190, -304224, -376052, -290539, -103260, -84413, -63162, -30485, 32024, 103373, 114437, 13635, -64460, -69225, 74421, 24844, -624, -186434, -354612, -332142, -189677, -92557, -56653, -31236, -37027, -6969, 62009, 96917, 191525, 65519, -18574, -84242, -93093, -122323, -159588, -165628, -269955, -327110, -368097, -393815, -446361, -376325, -293455, -262508, -127864, 78085, 68129, -68889, -102174, -66054, -23852, 44335, 59489, -72141, -27232, -18611, -122518, -78165, -41165, -47056, -191330, -319417, -349833, -181132, -82887, -31901, -34544, -121790, -158185, -136057, -43667, 34568]
21583C4568n9121M4722J02701k774p6213j3471p2346q5319O8137J05154Q208N7661
21571A11907J369l2734j60260l5763L8382Q3430J22400q5718l2279j3313l8170
21560d0749J32730P818m5918j64005m9217k0334P6342M8069j2093m2342j12186
21549b21885J04935L3079J0772R6222J3111M6616L2517l7883L2264l9913n846
21538F3989P204J23839L6706J8518N181j18017j39960n7111k7816P3602O2429
21527D8564j9939l6927K4527l4963J2128J8949J078n6760j5070k4112n2245r134
21515a43904R412Q7950q7068j78158k0004J38291N2315O773O2896J58734O6564
21504A53801j36276L1487j6387O6145o7274j1522j2129N4696M8432m1999p0439
$$ y = [34568, -24553, 20169, 122870, 120096, 43883, 30412, -41934, -127253, -59116, 46038, 54246, 111907, 113276, 80542, -79718, -115481, -77099, 6331, 128731, 43013, 10734, -2579, -40749, 91981, 99799, 53881, -110124, -159341, -179675, -103333, -55264, -67357, -109699, -221885, -116950, -83871, -73099, 23123, 36234, 82850, 115367, 77484, 109748, 69835, 63989, 71193, 195032, 231738, 250256, 255437, 137420, -2540, -59651, -87467, -13865, 48564, 28625, -8302, 16225, -18738, -6610, 12339, 13417, -43343, -58413, -82525, -134770, -143904, -134492, -46542, -133610, -311768, -331772, -193481, -141166, -134393, -71497, 87237, 153801, 17525, 49012, 32625, 98770, 31496, 19974, 7845, 62541, 110973, 68974, -1465]
21493a465n6480n6102R9929J04897q6347M5495m0659L9183r5258P1699j95210
21482a70318r3884J13064k4502m7552k6342q8225N465K8040J18495J23786O8026
21471F053n5070j1746n5383l8332J39010L2854M6610R5023j56645q4623L9343
21460d2906J31818l2524J33621k1823m1987K7345k5727J6890m5243O5352R1197
21449B56013j74601m7774J152J3829j30888r6936R9613P9438m1392p2507l5631
21438a49684q3400J9139R8374O8819M053r1045J4494P1203K8821P304Q6569L4571
21426A09218k5986Q3600J17837k0406j66412k1205m7702k4023p3653o1007L1120
21415i8619M3657K1156J05198q7786m7972k1531M1993R1434l4206l7321j27173
$$ y = [-1465, -57945, -114047, -14118, 90779, 4432, 49927, 9268, 48451, -46807, 24892, -170318, -264202, -151138, -175640, -223192, -249534, -337759, -332294, -304254, -185759, -61973, 6053, -49017, -60763, -116146, -154478, -15468, 17386, 63996, 159019, 2374, -82249, -42906, 88912, 56388, 190009, 168186, 126199, 153544, 127817, 144707, 99464, 164816, 256013, 81412, 33638, 34790, 48619, -82269, -179205, -79592, -154, -41546, -114053, -149684, -233084, -213945, -115571, -46752, -42699, -133744, -119250, -48047, -19226, -11922, 74647, 109218, 83232, 166832, 284669, 264263, 97851, 76646, 28944, 4921, -68732, -129739, -98619, -54962, -33806, 71392, -16394, -64366, -85897, -43904, 47530, 13324, -23997, -151170]
21404a51170n6297O5134N5249J86078O3796j10512p8429K7294Q6942R2255N9146
21393B39486j26875k9601m676n3538l2627n0846O8246P1182j38287j6827L2969
21382d1394P1282L8325L988J8751M4771N9933n4368n0637J8531M4959j7619o3185
21370G3337k05954k7483K4787J9154P0287o1475L3309K8845p1276j33777l6713
21359b86959J21240J30490L2384p3191P9024J54421R9059O4540o0845j20403j06324
21348C3436j05485j18520n4116l2465P5061r3925j0007K00096J56717k4563n1440
21337b5211M3122L471r9976l8884m6129o5437K6057m6919n5083J13619J18279
21326g3091K225K4129N0917J54536q1756j88358Q440J16967P0441K3970j7014
$$ y = [-151170, -207467, -142333, -87084, 98994, 162790, 52278, -26151, 1143, 88085, 180340, 239486, 112611, 83010, 78334, 24796, -7831, -58677, 9569, 80751, -57536, -74363, -41394, 29888, 68213, 72201, 90952, 135723, 195656, 141288, 90651, 109182, 154141, 136522, 73337, -132617, -160100, -135313, -116159, -45872, -107347, -74038, -45193, -116469, -250246, -286959, -165719, -35229, -2845, -76036, 2988, 157409, 256468, 321008, 260163, 139760, 33436, -72049, -190569, -244685, -277150, -202089, -296014, -306021, -105925, 50792, 26229, -25211, 17911, 21382, -78594, -117478, -163607, -229044, -202987, -249906, -304989, -191370, -73091, -70866, -46737, 4180, 158716, 76960, -111398, -102958, 14009, 84450, 108420, 91406]
21315I1406K2753J6277o1251j25105j24216K6168J19240N4892J47941K217l8269
21304A32053l4124o0646j8619j31089j18333N2114N0493J82639l6350o1306J66746
21293A23578m1122k00260J0278J01376J0542Q9331O8104j23654m2183j92495L5265
21282a61240K17049M2843m5857q6321M555J6759P1072n1916N7578N4786j31371
21271a2063Q5020L8208k1202j37164q5793J76159L9488N9934m0035j11118p0605
21260g9171o4389k0854k7930k2639N7927j0460L2696q6407l2554O9234k7728k0409
21248b32684N4306Q9120m2075l1901L5687o5278k9450N6648J1272m1648n032N104
21236a95931K314J16806J40297m8507j00434Q4314L3768k3549J1413J94628q2998
$$ y = [91406, 114159, 130436, 69185, -55920, -180136, -153968, -34728, 20164, 168105, 170322, 132053, 97929, 37283, 18664, -112425, -230758, -178644, -128151, 54488, 18138, -43168, 123578, 82456, -117804, -107526, -6150, 4392, 93723, 161827, 38173, -4010, -196505, -161240, 55809, 98652, 52795, -33526, -28971, -12212, 58860, 6944, 64522, 119308, -12063, 72957, 111165, 89963, -47201, -132994, 43165, 82653, 142587, 102552, -8566, -79171, -143560, -164414, -192344, -214983, -157056, -167516, -134820, -221227, -253781, -184547, -212275, -232684, -178378, -89258, -131333, -163234, -127547, -192825, -222275, -165627, -154355, -196003, -201035, -195931, -193617, -76811, 63486, 14979, -85455, -1141, 32627, 9078, 20491, 215119, 132121]
21225A32121j13603q2838M4979L8120r3659J7336M007n410j4071j04070l0757
21214b07845k8786O2429J26808L1476N8456j22246j9438j4012P463k3948J22378
21203g265q685m3885r2407m9425J01408J79829r0755J4978k022K0242J8475n7150
21191a6662j65474J45902j7360n9511R134p5582N878L2516M9532m3943j38711
21180b74281J11082J00783K9794O8842P3195j5540m7563j05377J646J87005K9714
21169A59300j64534J0058k8735o3719k7485O2288M274j38515N1900L0239k9606
21158a34535l8444R7214K0443P811j4888n29O9972o4169k4633Q9372J41137M4247
21146A92998m9351p8793Q0803j4818O1987l7131j23718J16748k4900j14813j16691
$$ y = [132121, 18518, -64320, -19341, 18779, -74880, -57544, -53537, -58947, -73018, -177088, -207845, -236631, -174202, -47394, -15918, 42538, -79708, -99146, -113158, -105695, -129643, -7265, -15950, -59835, -152242, -201667, -100259, 79570, -11185, 3793, 1771, 22013, 40488, -16662, -182136, -36234, -53594, -113105, -103971, -179553, -173675, -141159, -91627, -135570, -274281, -163199, -62416, -32622, 36220, 109415, 93875, 46312, -59065, -57419, 129586, 159300, -5234, 4824, -23911, -87630, -115115, -52827, -48553, -187068, -135168, -104929, -134535, -172979, -75765, -55322, -47511, -62399, -62928, 7044, -57125, -81758, 7614, 148751, 192998, 143647, 64854, 145657, 130839, 192826, 155695, 31977, 148725, 123825, 9012, -107679]
21135a07679p551Q7597k8534n9734L2933k0665O6445L2703l0894L6125n7662M7780
21123i136R7198n5p9465P7925O6321j25902q1435p635j04577o0853m461J52217
21111g9858k294j07718J02192j4911N1795n2544N9369k3236J5603O9543l4619
21100a6678o8394q1337O1481l2451K5205O4162J7741m874M5927J76144k0767j65171
21088I88k2837k5987M0309j22178m8737J84096j5322n8017L4569K3290j9791l1993
21076f1610n9015l0714P4965P4258q9235k3102j27965O0403N3773p227K11204
21065G5735Q1872r7816O0069R924j9354N5756r2029q8945O6681N0804l6009m1576
21053B5112J06269o1116j15088R4288J80098l8031l7950j54l2044j8691j05001
$$ y = [-107679, -115230, -27633, -56167, -115901, -82968, -103633, -37188, -4485, -35379, 746, -56916, -9136, 88062, 88007, 8542, 86467, 152788, 26886, -54549, -62184, -166761, -227614, -232075, -79858, -82152, -189870, -87678, -102589, -50794, -103338, -43969, -67205, -51602, 17941, -16678, -85072, -166409, -104928, -137379, -112174, -48012, -30271, -35145, 10782, 186926, 166159, 988, -21849, -47836, -7527, -129705, -178442, 5654, -9668, -67685, -33116, -9826, -29617, -61610, -120625, -151339, -76374, -2116, -91351, -114453, -242418, -182015, -128242, -135469, 75735, 157607, 59791, 119860, 129784, 110430, 166186, 74157, -14788, 51893, 102697, 66688, 25112, 131381, 70265, -44823, 49465, 229563, 191532, 153582, 153428, 121384, 102693, -2308]
21042b308O8334J28756n6742Q4439q22r5187p0369o4646p9080L7417O737L0619
21030a2852J6977R5746r1129q0470K2915L4351l7821j8864O8898J9135j62936
21019a46050Q5061J06223J9933r8717K9884J24693j15380J5692O6868l7015k858
21008D8334J5693M960M2943o8230j75249n1137N0429o5245J13570K24147P4814
20997B15029j16884r9935r142K4105j12333k6634j7763J23484j1747l2572J12244
20986D7852L9396r6671N0852k5626k9819K5535o4926p6302r802k8289o9643N3304
20974a84139J28085J52571J663O022p7880K3725N5915K0672r724n0667J56259
20963B22502J75992k3130r5859p8746j4493l5063N2387L217m2413p075j7918l1459
$$ y = [-2308, 66026, 194782, 138040, 222479, 221657, 126470, 56101, -8545, -87625, -50208, -43471, -12852, 4125, 99871, 8742, -71728, -48813, -14462, -52283, -71147, -2249, 16886, -146050, -60989, 45234, 65167, -33550, -3666, 121027, 5647, 21339, 88207, 51192, 48334, 64027, 68987, 111930, 43700, -131549, -182686, -132257, -197502, -83932, 140215, 215029, 98145, -1790, -10932, 13173, -99160, -125794, -143557, -20073, -31820, -64392, 47852, 87248, -9423, 41429, 15803, -14016, 11519, -53407, -129709, -139511, -167800, -237443, -184139, -56054, 96517, 98180, 104202, 26322, 50047, 105962, 126634, 116910, 66243, 222502, 398494, 375364, 279505, 200759, 186266, 151203, 203590, 206807, 164394, 157319, 139401, 107942]
20951A07942j62941m931O7764J77072L443p1298p3Q1514m163j6666N9634N7497
20939B94794J25332J38808m3565r094p2591Q9356K6930K14843J5303j22993K5885
20928F83008P9553J6827k07119k04487J02160j8118J9381N8976q7768m4359r1040
20917C07014n7168K3822J09340n4454L1404l5166j57718R1834J48081J36201L068
20906E46258j15052O7108P1127Q5281J23407P7104j75060j2424O22n9443L5917
20895F44845K8002r4412j5418J1972k9165j24895k03644j04100J32405j3256o7121
20884A65213K6673k9360j32828J849K787N911R1522o7286j7539K6139J8704q3147
20872H638j21678J50123Q7718l7408p0741l0844m06M2584K1850J09568J0057r7159
$$ y = [107942, -54999, -59930, 7834, 184906, 188349, 117051, 116978, 198492, 194329, 177663, 237297, 294794, 420126, 558934, 515369, 506275, 433684, 523040, 549970, 764813, 780116, 657123, 683008, 762561, 779388, 572269, 367782, 469942, 451824, 471205, 530181, 442413, 398054, 307014, 249846, 273668, 383008, 328554, 359958, 324792, 167074, 258908, 406989, 543190, 546258, 431206, 498314, 569441, 654722, 778129, 855233, 680173, 667749, 668371, 608928, 644845, 672847, 578435, 563017, 574989, 545824, 420929, 217285, 113185, 245590, 232334, 165213, 191886, 162526, 29698, 31547, 34334, 40245, 131767, 64481, 46942, 73081, 91785, 8638, -113040, 37083, 124801, 87393, 16652, -14192, -14598, 27986, 49836, 159404, 169461, 72302]
20860G2302j02995K9177R7217m9716j01931L0396J12518Q8364P4853k2317J4022
20849B41890j06053j14733l0392k2746j31294J6702k2219q1922L2008L2561L2456
20838a53742J47908K39382m4067k03927R6276K5064j36497m3283r484N4576N7258
20827B9464M1853K9078p4220K1426N7284p8070j91661M717J06813J29002J13718
20816A89404l5933q8073N6667j9465k4290R872P6723j7711k1718r3501o1510N5094
20804B5559J9085Q6616j52771j59191r4267O7291M6754M2161M2719j5451P0648
20793b0847Q283j12883Q2710O5702l4421J44455l8152r837l5874n1806J00385
20782I7715R9005l7701K324K9159O142j04077n9869R1014J14316R4705p3175k4316
$$ y = [72302, -30693, -1516, 95701, 45985, -55946, -25550, 86968, 175332, 250185, 227868, 241890, 135837, 21104, -9288, -32034, -163328, -146626, -168845, -250767, -218759, -186198, -153742, -5834, 233548, 189481, -14446, 81830, 106894, -29603, -72886, -82370, -27794, 29464, 71317, 100395, 26175, 47601, 104885, 26815, -164846, -160129, -53316, 75686, 189404, 153471, 65398, 122065, 102600, 78310, 88182, 164905, 147194, 125476, 31975, -29535, 25559, 44644, 131260, -21511, -180702, -274969, -207678, -160924, -118763, -76044, -91495, -20847, -12564, -125447, -42737, 22965, -11456, 132999, 94847, 85010, 49136, -2670, 97715, 196720, 159019, 161343, 190502, 196644, 92567, 32698, 123712, 238028, 332733, 259558, 235242]
20770B35242r7342p9816J54372M2467j63728l0702J29813L8388n3594K8111M5746
20759B48957j6306Q2620o9895P8194m2282j09337o328M3849J03422j97397k17509
20748a02012l290J29082j01903j51711Q2980O5668Q7733Q8588p061j07738q2300
20737a01964J1838J56475J26186j7931j2807j20670l7433Q8721M9355N3936j32207
20726F3499j46478k3008l1662N1488R3561J03796O7670N5130k29675j49373l0075
20715a75127k3846J49908m9914k0443L579J45888J45381p7679l986J4679Q5268
20704A93708J3574J49785L1011p2429P437J2230r0848j32644k422O8800r887M397
20692A72712q1470l1539O6315p5948o2693J03418J21104L6915l5550l1238n2673
$$ y = [235242, 137900, 58084, 212456, 254923, 91195, 60493, 190306, 228694, 175100, 203211, 248957, 232651, 315271, 245376, 323570, 281288, 171951, 165623, 209472, 312894, 115497, -102012, -105302, 23780, -78123, -229834, -146854, -81186, 6547, 95135, 88074, -19664, -101964, -90126, 66349, 192535, 174604, 161797, 41127, 3694, 92415, 141770, 195706, 63499, -82979, -105987, -137649, -86161, 7400, 111196, 178866, 233996, 4321, -145052, -175127, -198973, -49065, -98979, -119422, -115843, 30045, 175426, 97747, 93761, 108440, 193708, 207282, 357067, 388078, 315649, 323086, 335316, 244468, 111824, 109402, 178202, 168315, 172712, 91242, 59703, 126018, 50070, -12623, 90795, 211899, 248814, 213264, 182026, 129353]
20681A29353p8485K8177Q150n2824P3168L6937J44588J02611K422r1690o1891
20670B40516j20496K9R7448r730j5358N4010n7598p8233L7258L9648M2125L2257
20658B61876j13328o6178P4238p593j47087j6067l3596o5755j8982M0542L2183
20647e9747R7494P8487o2847o4620O3557p7204l3983K3880J00503J81653q6526
20636A60647j55984m1614Q1418J03642k6684j71776J130K5767P4970O9610j3799
20625A07327k2482N2002J58485m366o1183j32575r8398N3225n8929j3805J67646
20614A46947J34288o4667M343N7830n4843j98510j21798L5021J22129q3970l5895
20603e9125R4259L1929J077J9286J12417J51197m2070o7540Q8181q292j9684j76583
$$ y = [129353, 50868, 79045, 87195, 34371, 107539, 144476, 289064, 391675, 394097, 302407, 240516, 120020, 120049, 217497, 207767, 192409, 246419, 188821, 110588, 147846, 187494, 229619, 261876, 148548, 82370, 156608, 149015, 1928, -14139, -47735, -113490, -132472, -91930, -59747, 37747, 116234, 53387, -11233, 52324, -24880, -58863, -34983, 65520, 247173, 160647, 4663, -36951, 44467, 148109, 121425, -50351, -49221, -23454, 51516, 121126, 107327, 84845, 136847, 295332, 290966, 229783, 97208, -1190, 52035, -6894, -20699, 146947, 281235, 216568, 220911, 278741, 223898, 25388, -96410, -61389, 60740, -23230, -59125, 35134, 67063, 68140, 87426, 199843, 351040, 308970, 241430, 329611, 321319, 301635, 125052]
20591A25052N0952Q6959j5669j01291j69828P9524L7098K2002Q8005k2109j4073
20580A66622n0134k520J21798m1979j7631l112L2283P8531j4933n5957p809O9382
20568B74541L4537O6301l420o7258n844P1557j5955j16234m9294J01082k2752
20557B67261L0069j35878p8335N1403l7576R9603k8506m7374n7907n2560J22140
20546A32340n583K9036n7150k0105j01671J21963J1949Q4926J06612k7921j17642
20535A56754q3434R6654M6548L1152m1826j8616L1845Q8301M8937r5112j5035
20524B46168N7460j41628j51049N3050J03676p0778n8470m5612j03755O4303l9721
20513h6356j3195l2295M4900l6724N0884j7071q9355R9815K26783P8185L4266
$$ y = [125052, 176004, 262963, 247294, 146003, -23825, 55699, 92797, 114799, 202804, 180695, 166622, 116488, 113968, 235766, 193787, 176156, 173044, 205327, 283858, 268925, 212968, 205159, 274541, 309078, 375379, 371959, 304701, 298857, 370414, 354459, 238225, 188931, 290013, 267261, 297330, 161452, 83117, 134520, 96944, 196547, 168041, 120667, 62760, 10200, 132340, 126757, 155793, 98643, 78538, -23133, 98830, 110779, 195705, 302317, 274396, 156754, 73320, 169974, 216522, 247674, 205848, 187232, 219077, 307378, 356315, 261203, 246168, 303628, 162000, 10951, 64001, 167677, 96899, 38429, -7183, -110938, -46635, -86356, -99551, -131846, -86946, -123670, -72786, -89857, -179212, -79397, 147386, 225571, 259837]
20502B59837k0631j26433p6442Q3839J60694m7261m705O4141N0092P9827j6833
20491D06125l4809p3925J9504J4980R1287J19253o544L3794j70928o2167m7171
20480B89399j4205O0087j0723o4345K8645J76534R536m078q9070q9650J101N3181
20468C46412N6427J42569J19625p8267j0474K33821J2809m9225o1508k2459M6774
20457G36504j7004k2723J18573R010l4168q1213p4936p1362r0180o566J63815
20446F29750J01611L7348M1205J14531j01601M1136p2691j1426r9547j3801j0346
20435F56169o5130N477J40925R2908k67j05295J7353J95639J01926K1289M3626
20424A104620R0948M5601N6224N8394k3291Q4848R2200J52817J65518J84246K70292
$$ y = [259837, 239206, 112773, 36331, 120170, 280864, 233603, 228898, 293039, 343131, 422958, 406125, 371316, 297391, 316895, 331875, 423162, 542415, 535871, 569665, 398737, 336570, 289399, 275194, 335281, 324558, 260213, 288858, 465392, 474928, 470850, 381780, 292130, 293231, 346412, 402839, 545408, 665033, 586766, 576292, 810113, 822922, 773697, 712189, 689730, 736504, 719500, 696777, 815350, 824360, 790192, 708979, 634043, 562681, 472501, 465935, 629750, 731361, 768709, 809914, 924445, 822844, 863980, 791289, 779863, 680316, 666515, 656169, 591039, 596516, 737441, 830349, 830082, 724787, 742140, 937779, 1039705, 1060994, 1104620, 1195568, 1241169, 1297393, 1355787, 1332496, 1417344, 1509544, 1662361, 1827879, 2012125, 2282417]
20413B282417J86193R5100m9727j176J04555K34300K08845K03416K67344L77972
20403C909239K59737K60283L86653K28940L08124L48140L84013N18505N09411
20394G113045N81218O32420N83499O93510Q58474J090475J363617J746296K322553
20385A6985107L056127M206389O281900R712091J4930704J8819931J2732569J819792
20377H8544610j476506k07391K533270P384215J0123150M062729m32545L358131
20369A13889663Q395858L993051q038043j1165616p544881l804842J018199N754470
20361A02497859M62179q950423j0909530j0687157j1264562r941878o420987k568086
20353D2217415Q69007M463211R167784J5202640J7161119Q096543j548726l559595
$$ y = [2282417, 2468610, 2563710, 2513983, 2512807, 2617362, 2851662, 3060507, 3263923, 3531267, 3909239, 4168976, 4429259, 4815912, 5044852, 5352976, 5701116, 6085129, 6603634, 7113045, 7694263, 8326683, 8910182, 9603692, 10462166, 11552641, 12916258, 14662554, 16985107, 20041234, 24247623, 30529523, 40241614, 55172318, 73992249, 86724818, 88544610, 87068104, 86860713, 89393983, 96778198, 106901348, 110964077, 110531532, 113889663, 122285521, 126278572, 118240529, 107074913, 99530032, 95725190, 96743389, 102497859, 102960038, 94009615, 83100085, 72412928, 61148366, 51206488, 44785501, 42217415, 43086422, 47549633, 56717417, 71920057, 89081176, 97177719, 95628993, 92069398]
20345I2069398k497379k07797O005168J3701369J4027720R454587R576510L342061
20337A45471637j1446870j7100779j4584520j0683372n031648L604356O839934
20330I7068738k291319j0475185j1836961j2287935j2919550j1397811q032601
20323B7827376n242703l634514k641110k165396j643937j083865r67951p74637
20315I673263n39095n37698n27487m61542m64753m03431m65378m26336k24882
20306E622661j03935k11590l27083l04260l89661k90639k78704m55141j80370
20297C081278m1592j76922j65795o5869k38320k03447j98727j38276j52695k34565
20287A465070q3229J11316o4500o3836r257j2082L039j95752j28672L5253L2916
$$ y = [92069398, 89572019, 89364222, 95369390, 109070759, 123098479, 132553066, 142129576, 145471637, 134024767, 116923988, 102339468, 91656096, 86624448, 90228804, 97068738, 94777419, 84302234, 72465273, 60177338, 47257788, 35859977, 27827376, 22584673, 18950159, 16309049, 14143653, 12499716, 11415851, 10447900, 9673263, 9134168, 8596470, 8068983, 7607441, 7142688, 6739257, 6273879, 5847543, 5622661, 5518726, 5307136, 4980053, 4675793, 4286132, 3995493, 3716789, 3261648, 3081278, 3039686, 2862764, 2696969, 2631100, 2392780, 2189333, 1990606, 1852330, 1699635, 1465070, 1381841, 1493157, 1428657, 1364821, 1355564, 1343482, 1346521, 1150769, 1022097, 1057350, 1090266]
20276A090266j95309j74380J78786j6087j83029O3902n0515j3306r5891n233L7675
20265F36879n6810q788o0401K6173L0550k16297k09575o9044J33095J02452j41204
20254A67030j12357k3665P7449M5556J66619l638l6436m4859k7056l4560k2489
20243A51594J440J4471j4098M3749J16160O7711M600r4553o0364J9357k8907M0831
20231B61991O4252p1739j07230Q3094q903k2235K8870j4942p5430l9818L5604
20220A33514J6416o4146l0908m0944J4218n7377p1129n2558K1534J88575J94647
20209B51842N049l1632n8928n1861Q3806J9985N9670l4696j1860J26512K8754
20198C86641l2481m3496K1121p0283m187N3201N2349j24902k27257j08740O7539
$$ y = [1090266, 894957, 720577, 899363, 883276, 700247, 764149, 713634, 700328, 604437, 599204, 636879, 580069, 571281, 510880, 537053, 567603, 351306, 141731, 72687, 205782, 308234, 167030, 54673, 31008, 108457, 154013, 320632, 316994, 280558, 235699, 208643, 174083, 151594, 153034, 167505, 153407, 197156, 313316, 381027, 385627, 291074, 230710, 250067, 221160, 261991, 326243, 254504, 147274, 230368, 221465, 199230, 228100, 213158, 137728, 97910, 133514, 149930, 85784, 54876, 13932, 28150, -29227, -100356, -152914, -131380, 57195, 251842, 256891, 225259, 166331, 114470, 198276, 218261, 277931, 243235, 231375, 357887, 386641, 354160, 310664, 331785, 261502, 257315, 310516, 362865, 237963, 10706, -98034, -30495]
20187c0495J38056J76371l9374r5066N0700J21001m0799l2299j9902p5835m5122
20176A07236J6736K5520L4853j0003j14849M0353J00053K5825k5474j56329j0278
20165C3643L9288j08912M8490Q0186K7420K1381q5296p5024j640O9229m9916j17265
20153a18416n2496Q6455N027q2931q8473k2491j17440K7346O9865Q9728L0146
20142a73680O1280Q3124j65815j46298R2613J59570N999l2823q8025J5873J49863
20131c8319q2546p2771O6585P5078J62260L020j95861m2553J50651K33278O6259
20120C25081k06526j61079R7306J20872n4527j66603J31947K03456J45560l9996
20110C95491o6022q2911r7149n3246o4831n1723n2067m5767Q2529N0708K6335
$$ y = [-30495, 107561, 283932, 244558, 149492, 200192, 321193, 280394, 248095, 228193, 152358, 107236, 123972, 149492, 184345, 174342, 59493, 99846, 199899, 225724, 200250, 43921, 33643, 72931, -35981, 12509, 92695, 120115, 141496, 56200, -18824, -20464, 48765, -1151, -118416, -170912, -84457, -79430, -162361, -250834, -273325, -390765, -363419, -293554, -203826, -173680, -112400, -29276, -195091, -341389, -248776, -89206, -83207, -116030, -204055, -188182, -38319, -120865, -193636, -127051, -51973, 110287, 113307, -82554, -125107, 25544, 258822, 325081, 118555, -42524, 54782, 175654, 121127, -45476, 86471, 289927, 435487, 395491, 329469, 246558, 149409, 96163, 31332, -20391, -72458, -118225, -35696, 15012, 41347]
20099D1347p7985K3321j40100n4376M6468J72553n76J8714j16305O802N2365M8598
20087B0826m0567R0757J04666r528q4486l2842m8348j24717M9045J20043j3487
20076C1362n144K2468O615l6906l9968J2168M2450P4271L1760o1106K5329j15931
20064a2632R487J06233n3854j08289p6393j7397L9769J18554r4777K4938J52405
20053H8044J64079O6714l01j53855q6069j21046k8362l695j02025o9389J94059
20042e1846q0592k611K8906J09911N8582j6325n06L1867N6073q7857j14685n9712
20030a28795K1297O6279r760n3588K5126L2478N6789J135L7234k7685O4909j0714
20018G4705n4828p4016j0734J23635J11885M495J6478o8293r2374j08610J57469
$$ y = [41347, -36638, -13317, -153417, -207793, -161325, 11228, 10652, 29366, -86939, -80137, -27772, 20826, -19741, 71016, 175682, 166154, 81668, 48826, 478, -124239, -75194, 44849, 31362, 26218, 48686, 55301, 18395, -21573, -9405, 33045, 107316, 139076, 77970, 103299, -12632, -3145, 103088, 49234, -59055, -135448, -152845, -113076, 5478, -89299, -64361, 88044, 252123, 318837, 318536, 164681, 78612, -42434, -70796, -74491, -176516, -245905, -51846, -132438, -135049, -106143, 3768, 62350, 46025, 45519, 77386, 133459, 45602, -69083, -128795, -107498, -41219, -50979, -104567, -79441, -46963, 9826, 10961, 48195, 20510, 85419, 74705, 19877, -54139, -64873, 58762, 170647, 175142, 191620, 123327, 30953, -77657, 79812]
20007G9812n9488K5923q5676l6068j8344P7182M8091j9531J9152Q268p2835P1587
19995C8073J32902p132j11782j3676J7476M6711j66067p4853m4886O6327j1071
19984a27978J3324j29717N5745J89261R7118r2415p4947l1763N762j962R7138
19973d34M2494J00295O1702K5955J1912j03116l1501m2105J53765J49686q9588
19962B79065j29104k37023j18955K06817R7876L8018J63501j7609k10984p2693
19952a091O3115k7785m9295J38059K46399N897o7900j71981j24185J0134Q2842
19941A04209J0811O6131J01733o7577o7169j72412J0435R7135J56924Q1982L8017
19930C60219m6224n8691L377K7719k1757j32978j20391j6394k7600J38492J28978
$$ y = [79812, 20324, 46247, -39429, -75497, -93841, -16659, 31432, 11901, 31053, 39321, -33514, 38073, 170975, 163843, 52061, 38385, 55861, 102572, -63495, -138348, -183234, -116907, -127978, -114654, -244371, -188626, 635, 97753, 5338, -69609, -101372, -95610, -97572, -434, 42060, 142355, 204057, 230012, 241924, 138808, 107307, 65202, 218967, 368653, 279065, 149961, -87062, -206017, 800, 98676, 136694, 300195, 282586, 71602, -1091, 62024, 34239, -15056, 123003, 369402, 375299, 307399, 135418, 11233, 21367, 104209, 115020, 181151, 282884, 215307, 148138, -24274, -13839, 83296, 240220, 322202, 360219, 313995, 255304, 258681, 286400, 264643, 131665, 11274, -5120, -32720, 105772, 234750]
19919B34750j16461j03383Q962J79112K2948j0218n9553r2390l9271O6131J5184
19908A05811k11093k3142P5003R7074L8688J23234l1437R6778O0645N7974r9445
19897B90090k03200n4615R7583L343m244j3976k9322k9921J3021J2158K5272j90473
19885h4284j16396R9001J75842P5476O8545j49816o2691J53057L0612O2281p8911
19874A72716m9324k8429k3666r0421N988M1844k858k8212Q9573R5847q232q4055
19862I0771J2936K7927K162j54695l6244M1837n9169L0831M9867j9988L7899l0303
19850f169O1251J33619j41647j9101J52791j69126k02674j498J29386O045L5569
19839b1554M6470o803O2926J4047n7256O475K5274j4299j29482N0779Q1718K00146
$$ y = [234750, 118289, 14906, 23868, 202980, 225928, 215710, 156157, 63767, 24496, 90627, 105811, -105282, -128424, -53421, 43653, 82341, 205575, 174138, 270916, 331561, 389535, 290090, 86890, 32275, 129858, 133201, 128957, 114981, 85659, 55738, 68759, 80917, 106189, -84284, -200680, -101679, 74163, 149639, 218184, 68368, 5677, 158734, 189346, 251627, 172716, 123392, 94963, 71297, -19124, -13136, 28708, 25850, -2362, 87211, 183058, 174826, 90771, 103707, 131634, 133796, -20899, -57143, -15306, -74475, -43644, 6223, -13765, 24134, -6169, 55082, 188701, 47054, 27953, 180744, 11618, -191056, -192554, -63168, -57123, -21554, 24916, 18113, 81039, 95086, 37830, 44305, 69579, 55280, -74202, -23423, 58295, 258441]
19827B58441J3164J611n4195J3685N5950m3193j08911P1831K07360j4924k4546
19816C76273n0873n8667J12103J17730K21691J03399l763j3026J5796j76025j8479
19805F26159n0362q6277J39090Q4813m1952J1511O3646r2067r3857o4810N0362
19794E46256L7020r5941k24320o5495L2553q7860L1121R8552M8919M6273M6699
19783D13777J68760O2402K6385m9562J15994n7476O36k9966J17836J68086J00496
19772A037368L142k0759j13117q7581j34771k04066r5035J85843K32175j829j14261
19761F87109j41720J1092j45640k71341N5590R6517P1235R0545p7240k6919R1554
19750D40782J09155o17o0471O7083J85843J81006K13587Q9538M7813j3588o6403
$$ y = [258441, 271605, 273216, 219021, 232706, 288656, 245463, 136552, 208383, 415743, 400819, 376273, 325400, 266733, 378836, 496566, 718257, 821656, 817893, 804867, 820663, 644638, 626159, 575797, 489520, 628610, 713423, 671471, 682982, 746628, 654561, 560704, 495894, 546256, 583276, 487335, 263015, 197520, 230073, 142213, 173334, 271886, 320805, 367078, 413777, 582537, 644939, 671324, 621762, 737756, 680280, 680916, 650950, 768786, 936872, 1037368, 1040510, 1019751, 906634, 819053, 684282, 480216, 385181, 571024, 803199, 801370, 687109, 545389, 556481, 410841, 139500, 195090, 291607, 362842, 453387, 376147, 349228, 440782, 549937, 549320, 488849, 555932, 741775, 922781, 1136368, 1225906, 1273719, 1260131, 1193728]
19739A193728J54067R7548j00311k82493k60783j00236p5475O5331J13470K37211
19729A042057J49518K8784q8988l4948O3762O7657j6821m7390k93414j87667j57087
19718E25463k58269j22377L119J47177m8762j01350Q171o7517j85545r5517K68525
19707G3118J46724N3114m4458j3919N3589L5106P8273j5886M279M3108q813j34474
19695B69761N9547J79998K48162Q1143K7158J28207K19718O0530L9215L4390l8162
19684A309667k7037R3791K3752m8374j73403j52975j21880j00498J95107J5529
19674A013679M7589j45313j01610j44829j21897K679m5914l8349k53202l1798
19664A81035J17147m1891N9813O642m5266K4564r3207p1100l5748K5934r7201
$$ y = [1193728, 1347795, 1445343, 1345032, 1062539, 801756, 701520, 626045, 691376, 804846, 1042057, 1191575, 1220359, 1131371, 1096423, 1160185, 1227842, 1211021, 1163631, 870217, 682550, 525463, 267194, 144817, 147936, 295113, 246351, 145001, 153172, 85655, -99890, -195407, 73118, 219842, 272956, 228498, 214579, 268168, 303274, 381547, 365661, 369940, 413048, 404235, 269761, 329308, 509306, 757468, 838611, 865769, 993976, 1213694, 1274224, 1313439, 1347829, 1309667, 1282630, 1376421, 1400173, 1351799, 1178396, 1025421, 903541, 803043, 998150, 1013679, 1061268, 915955, 814345, 669516, 547619, 550298, 504384, 466035, 212833, 181035, 298182, 256291, 316104, 322746, 277480, 302044, 208837, 137737, 101989, 127923, 30722]
19653C0722P058O3312M5902n2523O0978J03923Q461O272m0054j6105k9902m92
19641A87552J5808j11684P8267j0141j6448M2504K2242Q7456O3210j60804j4515
19630A83447q7721j34854m608J40006P1751Q7181o8836m6845N2472J6506l7123
19619A71376j08428R097j4377j6042K0676N135L4791p2648N2126J21820R9898
19608C03424j12523o8510o6038o4884J52085j4900L6633q266L1553j73303J7385
19597C2656Q7415j2767Q3407J11713L7487q021J0791j9918k5116j35235j7947
19586A44465Q1256j74689M0388R5005l9324p9552N6315L1338o810J9445P1314
19575B39151m5712m741j14858p343K130K6609L1793m3500l1846M4954J297Q3103
$$ y = [30722, 37780, 101092, 146994, 94471, 155449, 259372, 267833, 274105, 234051, 217946, 188044, 187552, 203360, 91676, 169943, 159802, 143354, 185858, 208100, 295556, 358766, 197962, 183447, 95726, -39128, -43736, 96270, 168021, 255202, 186366, 139521, 191993, 208499, 171376, 62948, 72045, 57668, 41626, 62302, 67437, 102228, 29580, 81706, 203526, 303424, 190901, 122391, 56353, -8531, 143554, 128654, 165287, 157021, 188574, 15271, 32656, 120071, 107304, 190711, 302424, 339911, 331890, 342681, 322763, 297647, 162412, 144465, 225721, 51032, 91420, 186425, 147101, 67549, 123864, 155202, 148392, 167837, 239151, 193439, 188698, 73840, 66497, 68627, 95236, 127029, 83529, 51683, 96637, 97934, 181037]
19563A81037j3005j05144M8170l3574j26419j2665J94642K2174J71590J2928j65748
19552A73986j44578l4068J6125m0520j6675P8668J16147J00425J43783k6144o1470
19541C05679j9852o242o4459J40246L7673j22573j37933k5351J34627M5227j58677
19530A28365R0715L2980k8176O3779k9266q1427k3918r101m8887l2661m5224J17084
19518A34263J16235j02787K7062Q5954L6595n5533n0692n918k4484l8010j5699
19507A06986L9189M3676k8711P1913J730j09591r8422j4767K12289O5015q0898
19496B08409P5022R0783L8873k50512j27303O4244J70571J68311q4384l8279L2074
19485C47809n5636j2764M4458j15591j4521O1879j53k4880L4570n0104j42587
$$ y = [181037, 168032, 62888, 111058, 77484, -48935, -61600, 133042, 155216, 326806, 339734, 173986, 29408, -4660, 11465, -29055, -45730, 32938, 149085, 249510, 393293, 367149, 305679, 285827, 279585, 215126, 355372, 393045, 270472, 132539, 107188, 241815, 287042, 128365, 219080, 252060, 223884, 287663, 258397, 176970, 153052, 143951, 95064, 62403, 17179, 134263, 250498, 147711, 174773, 260727, 297322, 241789, 191097, 185179, 160695, 122685, 106986, 146175, 189851, 161140, 233053, 234783, 125192, 26770, 12003, 224292, 289307, 208409, 283431, 374214, 413087, 162575, 35272, 99516, 270087, 438398, 354014, 315735, 347809, 292173, 279409, 323867, 208276, 193755, 255634, 255481, 230601, 265171, 215067, 72480]
19474G2480N017M0210n437P0871m2801p5138p0791k950J51241J34681l3239m1599
19462B02545j6821R104J640J01809k2206l8452J6064J5973q3510N6959R8636p0926
19450B70815J11899M05315Q1946o3058r5679k86899N4782P9228J10462k4933Q7062
19439G30940r4352n1892J30803o0533o1481J9192P8066j484o2551q7242O7050
19428F06516J74737J31134j05971r9528Q8290l5491K5592r847r2244j22261q5315
19417D75612k5836q352l414l554l0348P0647L0646n6010K4636j5200m4163j14100
19405C00564R3469l5334n2900J06616K81746J18539J61511o2912l6647j54903
19395G19749o7400m5569j09731J3090R6108J90554m471O2920J46396j16143j14325
$$ y = [72480, 77497, 117707, 112270, 183141, 140340, 65202, -5589, -8539, 142702, 277383, 244144, 202545, 185724, 194828, 196468, 298277, 276071, 237619, 253683, 269656, 186146, 243105, 341741, 270815, 382714, 788029, 869975, 806917, 711238, 424339, 479121, 558349, 668811, 643878, 730940, 636588, 584696, 715499, 654966, 593485, 612677, 690743, 689259, 626708, 539466, 606516, 781253, 912387, 806416, 706888, 795178, 759687, 785279, 775432, 683188, 560927, 475612, 449776, 441424, 438010, 434456, 404108, 474755, 505401, 449391, 474027, 458827, 414664, 300564, 394033, 358699, 305799, 412415, 694161, 812700, 974211, 911299, 874652, 719749, 652349, 606780, 497049, 510139, 606247, 796801, 792330, 855250, 1001646, 885503, 771178]
19384G71178j55077k86106L6332J66957l6958q9016L4339M7607J16684N5787K19103
19373H80830K82239K37412J7156j06429L2910r0323q0694O4446l5704K0237j03630
19362A118450p5496J66014J14996R9025J77999K4781p0128j47072k41676K4420
19352A191313Q6642j7845l7242j3790j01733j2120j09790j46002k8204K0164N1530
19341H82923Q3484J84055J8973j25996j8110O9127j03879l3829L1871J3917K8183
19330A030719j08283m182j30089L4236K7120J7429r0590J6371J49205J71777K08393
19319A322106K1431J767K69207M24832J80074j11204j49389j87443m2940j0428
19309A718013P2531K25679J46716K00208M7526q4467q6901l5385m9365L4389n1172
$$ y = [771178, 616101, 329995, 366327, 533284, 496326, 407310, 441649, 489256, 605940, 661727, 880830, 1163069, 1400481, 1417637, 1311208, 1344118, 1253795, 1173101, 1237547, 1201843, 1222080, 1118450, 1042954, 1208968, 1323964, 1422989, 1600988, 1625769, 1555641, 1408569, 1166893, 1191313, 1277955, 1260110, 1222868, 1209078, 1107345, 1095225, 985435, 839433, 811229, 831393, 882923, 966407, 1150462, 1169435, 1043439, 1025329, 1094456, 990577, 956748, 988619, 1002536, 1030719, 922436, 918254, 788165, 822401, 849521, 866950, 776360, 792731, 941936, 1113713, 1322106, 1343537, 1345304, 1614511, 2039343, 2219417, 2108213, 1958824, 1771381, 1728441, 1718013, 1790544, 2016223, 2162939, 2363147, 2410673, 2326206, 2239305, 2203920, 2154555, 2188944, 2137772]
19298B137772l8149O570j0261j48740r5001N0105L6393l7440j04328l9915N3301
19287A810307J40333J36422j1020J01285J98907L08239J67037M0664j6607M4757
19277B920324j3335J21994J74875O7481O809N6963J97853L95733K86814J51953
19267D367464J48263M61798K87635K62164M50450N62776N78798O69083R59678
19258H748109R09000R47509J038593Q47863R07672J391947J733069K317034L553581
19249B2394377N281768P132403Q178138Q229638N556587K728540R34838K65374
19241F0701663J217948M001732R486953J8991969L3494421M8346002N6879216
19234B33119904N8740990L9169806J6385697j776893k0201772l6556135m3349298
$$ y = [2137772, 2099623, 2106193, 2095932, 1947192, 1852191, 1902296, 1938689, 1901249, 1796921, 1757006, 1810307, 1950640, 2087062, 2076042, 2177327, 2376234, 2684473, 2851510, 2892174, 2875567, 2920324, 2906989, 3028983, 3203858, 3271339, 3278148, 3335111, 3532964, 3928697, 4215511, 4367464, 4515727, 4977525, 5265160, 5527324, 5977774, 6540550, 7119348, 7788431, 8748109, 9657109, 10604618, 11643211, 12491074, 13398746, 14790693, 16523762, 18840796, 22394377, 27676145, 34808548, 42986686, 51216324, 56772911, 59501451, 60436289, 60701663, 61919611, 65921343, 75408296, 94400265, 127894686, 176240688, 233119904, 291860894, 331030700, 347416397, 345639504, 325437732, 288881597, 245532299]
19227B45532299m2664666l6240500k5597585j3451258l187916L189932L807866
19220A31388172k740690r393268j4147079j6595487j6442619j4121426j0966451
19213D6981152p742072n068999l245846j766983j059874n56239n9113J76001K39853
19204B7897880M03069N63298Q60344J110568J617396K758175M616250P188344
19196D7015324J1575004J6571174J9999861K0539026J5161424O010139r67225
19189A35904727n030401m275792J755280J3150190K6639130L9316202N0765512
19182B58224848N4017181M9193621L8499104J0479235k5344604m5881438n8989216
19175B80198731o0042103n2814364m0672684k8125526j6152131o782010j625117
$$ y = [245532299, 202867633, 166627133, 141029548, 127578290, 124390374, 127580306, 131388172, 128647482, 119254214, 105107135, 88511648, 72069029, 57947603, 46981152, 39239080, 34170081, 30924235, 29157252, 28097378, 27541139, 27482026, 27658027, 27897880, 28300949, 28864247, 29724591, 30835159, 32452555, 35210730, 39826980, 47015324, 58590328, 75161502, 95161363, 115700389, 130861813, 136871952, 135904727, 130874326, 126598534, 128353814, 141504004, 168143134, 207459336, 258224848, 312242029, 361435650, 399934754, 410413989, 385069385, 339187947, 280198731, 220156628, 167342264, 126669580, 98544054, 82391923, 75609913, 73984796]
19168G3984796J45236j972814m946758p234437q605397q525415p707809o237766
19160B8899636m465274l170525k057526j498244j376724j256924j118596j009056
19152A2946767j114843j076599j015744r20786r27557o61576o15984l60606l38632
19143E914440l91349m20148l46578l80912k83866k60952k88283m14551j45275
19134B982526j74368k17674j38194j17622p2608j01206r665j30144J2572p2923
19124A960694p5834r9853j25552m7590j25028K0461L2970l5218l7001J5121p7832
19113A405338q8256j42736j91727q5597r9705p7981j7527j01461J42673O9723
19103H12744j1369J06927J20661O7325j12114o6351k7194r2496N9725L5226p3029
$$ y = [73984796, 74130032, 72157218, 67210460, 59976023, 51370626, 42845211, 35137402, 28899636, 24434362, 21263837, 19206311, 17708067, 16331343, 15074419, 13955823, 12946767, 11831924, 10755325, 9739581, 8818795, 7891238, 7229662, 6613678, 6253072, 5914440, 5523091, 5102943, 4756365, 4375453, 4091587, 3830635, 3542352, 3127801, 2982526, 2808158, 2590484, 2452290, 2334668, 2262060, 2160854, 2151189, 2021045, 2033617, 1960694, 1884860, 1785007, 1659455, 1611865, 1486837, 1507298, 1540268, 1505050, 1468049, 1483170, 1405338, 1317082, 1174346, 982619, 897022, 797317, 719336, 701809, 600348, 743021, 812744, 801375, 908302, 1028963, 1096288, 984174, 917823, 890629, 798133, 857858, 893084, 820055]
19092H20055o6615K9587R9292k0348J299M2315L0069Q8716l5908r9908j37207
19081G51347j46945j3479j7293Q0415Q7880K42606K20462J6499j80524k21136
19071H19832j6884p2468M2649l3767l1100K6760L4560p1532Q6456l8366j8173
19060G27967j43133p7344j00331r2716p1103o0204P3362l9378J33334K23783O8037
19049F42274K4908P9548j9031N7346Q9434p6381l05856j01591r4864k0134m9773
19038B25880j30087J53152J45124P8089K69119K6649p4624k7094n7973j86652
19028D21583o0614K19111R8128q8125l8393P3887J95101K0141N843J9527j78431
19017F87758p0624M5805L2130j80697n4340k8894O495l2J58560R9592p399N0379
$$ y = [820055, 753440, 783027, 882319, 861971, 863270, 905585, 935654, 1024370, 988462, 888554, 751347, 604402, 590923, 573630, 654045, 741925, 984531, 1204993, 1221492, 1040968, 819832, 802948, 730480, 773129, 739362, 708262, 735022, 769582, 698050, 784506, 746140, 727967, 584834, 507490, 407159, 314443, 243340, 183136, 256498, 217120, 350454, 574237, 642274, 667182, 746730, 727699, 785045, 874479, 798098, 492242, 390651, 295787, 275653, 225880, 95793, 248945, 394069, 472158, 741277, 767926, 693302, 666208, 608235, 421583, 360969, 580080, 678208, 590083, 551690, 625577, 820678, 840819, 846662, 866189, 687758, 617134, 662939, 695069, 514372, 460032, 431138, 437633, 437601, 596161, 695753, 688354, 738733]
19005G38733P1116k2944j58806k015K6303m8108j20678j7784J14397j9181l8744
18994E22289o3467j26253j28496l9325o3103j70820R7474J26270K3465J02268
18984B80302J25772j7653J57835K36606K27120K71011Q5902M001P3793N5677k0842
18973A479524K8141k6154N6897J74781K59284L47541K40813J48273M5507O6998
18963B821605n0936R604Q0430J22693K69765K96577L82256M31021M33487L82339
18953E178841M59415O64395J252095J928439L403462O156561J0047154P819651
18945C6910013j290095m075795l779284m350778m666956l017461p58259J285754
18937A6257139L823625P513948P923617j15525m410104l994281m198875m923987
$$ y = [738733, 809849, 786905, 628099, 626084, 652387, 604279, 483601, 465817, 580214, 561033, 522289, 458822, 332569, 204073, 164748, 101645, -69175, 28299, 154569, 178034, 280302, 406074, 388421, 546256, 782862, 1009982, 1280993, 1366895, 1370896, 1444689, 1500366, 1479524, 1507665, 1481511, 1538408, 1713189, 1972473, 2320014, 2560827, 2709100, 2754607, 2821605, 2770669, 2780273, 2860703, 2983396, 3253161, 3549738, 3931994, 4363015, 4796502, 5178841, 5638256, 6302651, 7554746, 9483185, 12886647, 19043208, 29090362, 36910013, 35619918, 31544123, 27764839, 23414061, 18747105, 15729644, 14971385, 16257139, 20080764, 27594712, 35518329, 35402804, 30992700, 26998419, 22799544, 17875557]
18929A7875557m091229k508992j519068q98048n26519k14342l15464l77580k10144
18920G214171k4499J57311L18006N96167M90815L23257L09689L29742K92899L96598
18910A0404156Q31949J222553J653816K680884M596047O295114M366731N06607
18902C2557857M03151J823697L527447O329846J3633989K6051394L5442834J8235745
18894A38005960o396103j3125648j4875579j7351549j6487078r595465j547762
18887E8626776P009900J8682188L1436733K0878237q621699j6739088j5791980
18880I5481067j8138297j9334213j4175177q034848m317593k534167j703980r09560
18872B6333232n52446m67795J594L31144P83722J385504K064241K818707L482982
$$ y = [17875557, 13784328, 11275336, 9756268, 8858220, 8331701, 8117359, 7801895, 7424315, 7214171, 7189672, 7346983, 7664989, 8261156, 8751971, 9075228, 9384917, 9714659, 10007558, 10404156, 11236105, 12458658, 14112474, 16793358, 21389405, 27684519, 32051250, 32557857, 32961008, 34784705, 38312152, 44641998, 58275987, 84327381, 119770215, 138005960, 131609857, 118484209, 103608630, 86257081, 69770003, 60174538, 58626776, 65636676, 84318864, 115755597, 136633834, 128012135, 111273047, 95481067, 77342770, 58008557, 43833380, 35798532, 31480939, 28946772, 27242792, 26333232, 25780786, 25312991, 25314585, 25645729, 26429451, 27814955, 29879196, 32697903, 36180885]
18863C6180885M438630N560848O650581Q816640J3523105K2122572L6886426N6305350
18855A90485037O1789639M4829865P633665j7621728j5377254n295409P80648
18848B67224463j0749732j5944397j590948K1387178M9342421N1331988J37353
18841C61138326l6921768l8236172l6785440l5662658j9030378P799315J1165245
18834B13466470j6135257k7928690k6114692k6745226k7304776k2068318j4467177
18827E2702334r043299o137888m698661l814922l139463k673806k273821j631615
18819A9288859j306050j158574q49918p38646m55284l56853j19043J45452M58880
18810A4908823Q17850J313870K530035M809201Q672899J1172113M645717k672516
$$ y = [36180885, 40619515, 46180363, 52830944, 61647584, 75170689, 97293261, 134179687, 190485037, 252274676, 297104541, 304738206, 287116478, 271739224, 266443815, 267224463, 256474731, 240530334, 238939386, 260326564, 309668985, 361000973, 361138326, 324216558, 285980386, 249194946, 213532288, 194501910, 202301225, 213466470, 197331213, 169402523, 143287831, 116542605, 89237829, 67169511, 52702334, 43659035, 37521147, 32822486, 29007564, 25868101, 23194295, 20920474, 19288859, 17982809, 16824235, 15974317, 15235671, 14780387, 14423534, 14304491, 14449943, 14908823, 15726673, 17040543, 19570578, 24379779, 33052678, 44224791, 48870508, 46197992]
18802D6197992l081993j862230l06179L431841M596250k124757n482476m539063
18794C6829385l824186l032794j388920k435383l491898k663240k084588j776781
18786A6131595n89979J134462L45958j787991j981797j762297k053822j956787
18778G479342j398466j037288n73081m06065m31616k51020l28724l11484k08089
18769B533509j32162L6860m8976K9292L02799K99006l0162k71403l00111j91093
18759B227559k21537l82340l15212p3691M6021K2688n7292n2048k01430n6546
18749I36172L4701N257j3075K7875L7991j26958k06889m8607M5705N0400Q870
18738G51442l0446K33320K51602K15791Q7223L340M7868l8204j18659l04539n6607
$$ y = [46197992, 43115999, 41253769, 40947590, 44379431, 48975681, 46850924, 41368448, 36829385, 33005199, 29972405, 28583485, 26148102, 22656204, 19992964, 17908376, 16131595, 15541616, 16676078, 17022036, 15234045, 13252248, 11489951, 9436129, 7479342, 6080876, 5043588, 4470507, 4064442, 3632826, 3381806, 3053082, 2741598, 2533509, 2401347, 2438207, 2389231, 2418523, 2721322, 3020328, 2990166, 2718763, 2418652, 2227559, 2006022, 1623682, 1308470, 1234779, 1280800, 1303488, 1246196, 1194148, 992718, 936172, 970873, 976130, 963055, 990930, 1028921, 901963, 695074, 646467, 692172, 742572, 751442, 720996, 954316, 1205918, 1421709, 1508932, 1512272, 1560140, 1521936, 1403277, 1098738, 1042131]
18727A042131R1575J80590R2423j35003K9880J19350J02621j69359k67460k44147
18717H42601j25597L3109P1837P722j06532j32825K7121m7186j8407P5015J18067
18706G44925J2338n4363m6737j02127l302O347O6615J8520Q8385n5557o6172Q9601
18694F98473j0929j49712m2983K50506J14975J09552J92900K32317K98974N3276
18684A747349L7120J27805J48440K6443J14648p8605k74208k35929o5319n4185
18674A493559m8062j52035M5891J2756J99375K07154J36813J59465n9123j93182
18664A802611k63782m34326k45362j54978q1880j73597m8811m4245O3513q5915
18654C33228j60613p1106n5680n8907Q9911J54163j49374j51415K03047Q9439
$$ y = [1042131, 1133706, 1314296, 1406719, 1271716, 1301596, 1420946, 1523567, 1354208, 1086748, 842601, 717004, 750113, 821950, 829672, 723140, 590315, 617436, 570250, 551843, 626858, 744925, 757263, 702900, 656163, 554036, 550734, 557081, 623696, 642216, 730601, 675044, 608872, 698473, 687544, 537832, 494849, 745355, 860330, 969882, 1162782, 1395099, 1694073, 1747349, 1784469, 1912274, 2060714, 2087157, 2201805, 2123200, 1848992, 1613063, 1547744, 1493559, 1445497, 1293462, 1339353, 1352109, 1551484, 1758638, 1895451, 2054916, 1995793, 1802611, 1538829, 1104503, 859141, 704163, 622283, 448686, 399875, 355630, 419143, 333228, 172615, 101509, 45829, -13078, 76833, 230996, 81622, -69793, 133254, 222693]
18644B22693K3218k993o6527n2159q222J15700J18003j1504j9356p9053J5911
18633B55711K40116J00377P0944Q7190Q9946l2166j51999M3677K6265n1715J31671
18622H10017K15621J34160J39592J15817L1343n6679j33221j36034P5045P1596
18612A267257k24715r2175j27027l5153j24818j72980Q2657J45331P4580L6707
18602H29664n1140j79964j26059N1705k2044j06379q4478q5625l1728O630O6475
18591B67057P8820K21317J14139k6470r7821k9568j44972k3951J75447k3328O0024
18580E70694R5684m3706L9388k1537r9709j03284J2832R4624K86733N7103j8374
18569H70448l6238Q985J28916J0423K1509P6986K22791J4200k39535k38703j80227
$$ y = [222693, 245911, 242918, 176391, 124232, 116010, 231710, 349713, 338209, 318853, 239800, 255711, 495827, 596204, 667148, 754338, 844284, 812118, 660119, 703796, 730061, 678346, 810017, 1025638, 1159798, 1299390, 1415207, 1446550, 1389871, 1256650, 1120616, 1195661, 1267257, 1042542, 950367, 823340, 788187, 663369, 490389, 573046, 718377, 792957, 829664, 778524, 598560, 472501, 524206, 502162, 395783, 311305, 225680, 193952, 200582, 267057, 345877, 567194, 681333, 654863, 557042, 527474, 382502, 358551, 533998, 510670, 570694, 666378, 622672, 662060, 640523, 540814, 437530, 450362, 544986, 831719, 888822, 870448, 834210, 843195, 972111, 982534, 1004043, 1081029, 1303820, 1318020, 1078485, 839782, 659555]
18558F59555n7889M0398Q4186R2188J53471P3421M9242n241J3727J56026O549
18547A265633j64553j32092J2982N4293p2636r5949m0205O6991l2356O0861O5820
18536I88789q4126L6782P8246j14617m1512N1355l9784k34293p1068J7723R5847
18525F83342K25570q3947k05770q1252m9295J9421l1977J30189J82892n3629k11084
18514E24460n9926N9073M3328R5345J55160N9550M1174Q3669M3472L4350n2911
18503A026744P9637K48688J68541k632m0925R974R6724k7868N6984R8741j25619
18492A588989j97065k7442J22826L1548J61005J08271l8790j05343k4622J21005
18482A740382J09597K5829L6271j2257N4977J79439R1272o1080J43285J60961
$$ y = [659555, 601666, 642064, 726250, 818438, 971909, 1045330, 1094572, 1089331, 1103058, 1259084, 1265633, 1101080, 968988, 981970, 1036263, 963627, 867678, 827473, 894464, 862108, 922969, 988789, 904663, 941445, 1019691, 905074, 863562, 914917, 875133, 640840, 569772, 587495, 683342, 908912, 824965, 619195, 537943, 488648, 508069, 476092, 606281, 789173, 735544, 524460, 464534, 523607, 566935, 662280, 817440, 876990, 918164, 1001833, 1045305, 1079655, 1026744, 1106381, 1355069, 1523610, 1520978, 1480053, 1490027, 1586751, 1558883, 1615867, 1714608, 1588989, 1391924, 1364482, 1487308, 1518856, 1679861, 1788132, 1749342, 1643999, 1619377, 1740382, 1849979, 1875808, 1912079, 1899822, 1954799, 2134238, 2225510, 2164430, 2307715, 2468676]
18472B468676K79326J73394P3138o2592J52912K25877L60364O4322K41625J91294
18462D168336K0849O8502M04493N22049M53375N04505P07301Q00757O63235P17895
18452I031297J047917J118735J204010J037842J274878J597437K026841K817363
18444B1156320M028055N335890N101564M457737N823774P823959O589128L088249
18436F3404676L386244O370213R472565J4193575K3664707L0789053K5096818
18429A76377851K6120080M3314584N1801092K2026274l664268N666714P309514
18422C28951841j9170995l7264032k9542921k2118800k5196457k6771938j9570348
18415A49316350r785691m324489p666441j1790681r806012p769877r671087j2384342
$$ y = [2468676, 2748002, 2921396, 2994534, 2931942, 3084854, 3310731, 3671095, 3735417, 3977042, 4168336, 4189185, 4257687, 4662180, 5184229, 5637604, 6142109, 6849410, 7650167, 8313402, 9031297, 10079214, 11197949, 12401959, 13439801, 14714679, 16312116, 18338957, 21156320, 25184375, 30520265, 35621829, 40079566, 45903340, 53727299, 60316427, 63404676, 66790920, 73161133, 82633698, 96827273, 120491980, 151281033, 176377851, 202497931, 245812515, 297613607, 319639881, 315975613, 321642327, 328951841, 309780846, 272516814, 242973893, 220855093, 195658636, 168886698, 149316350, 139530659, 135206170, 127539729, 115749048, 105943036, 98173159, 88502072, 76117730]
18407G6117730j1518018r353569p878451o415676m676693l319189j898892p57815
18399C0299427m31044n40981o6409M53471O61305J236208K461583M008043O241533
18390D4323136Q881861R347478P967125R384296J2913129J2641428N638627L078422
18382A14175502P980801J2843708J1748884J0079864J9044018L3337372L0475177
18375B39685326J0751374J0612362K6610158J8158699j9990114l0138247j9969336
18368B35720222k0703458l4406242l5048747k5365001j9854090j7377591j2177641
18361G0787452o099347m432388n782095n149170l937505m092482n218973m957138
18353C1118354m201753l722722l229983k510888j633558j319215j161360j147523
$$ y = [76117730, 64599712, 55246143, 47367692, 40952016, 36275323, 32956134, 31057242, 30299427, 29868383, 29327402, 29260993, 29714464, 30375769, 31611977, 34073560, 38081603, 44323136, 53204997, 62552475, 70519600, 79903896, 92817025, 105458453, 111097080, 114175502, 122156303, 135000011, 146748895, 156828759, 175872777, 209210149, 239685326, 250436700, 261049062, 287659220, 305817919, 285827805, 255689558, 235720222, 215016764, 180610522, 145561775, 120196774, 100342684, 82965093, 70787452, 64688105, 60255717, 54473622, 49324452, 45386947, 41294465, 36075492, 31118354, 26916601, 23193879, 19963896, 17453008, 15819450, 14500235, 13338875, 12191352]
18345A2191352q96806p35506p56675p29119o02051n34968o22410n24460m83810
18336F305547n29700m17699l34762l72727k19336j66844k48322l12679k51630
18327C451848k46594j22677o7209n5823j15264l53564j37571J68039K4254j60721
18317B384718j72662o9669j71993L3709k5011o16p9290r3220j26867j46677k90084
18306A242338k05925r9107M273j43576j88739p6009K4050K64116L61277K45544
18296A428242R6550J27385L468p6859o1029J1003k0590m5516m3914n7264n0246
18285A311230j04131n1951J53502J7982p1463q6075j98760j78967p0325P3371
18275G94413J0996M0387n5541o4813k4124Q87J1157j491J9111J89287K24602m8242
$$ y = [12191352, 11294546, 10559040, 9802365, 9073246, 8471195, 7936227, 7313817, 6789357, 6305547, 5775847, 5358148, 5023386, 4650659, 4431323, 4264479, 4016157, 3703478, 3451848, 3205254, 3082577, 3015368, 2959545, 2844281, 2490717, 2353146, 2521185, 2545439, 2384718, 2212056, 2142387, 1970394, 2004103, 1979092, 1978476, 1899186, 1805966, 1679099, 1532422, 1242338, 1036413, 937306, 941579, 798003, 609264, 533255, 557305, 821421, 1182698, 1428242, 1524792, 1652177, 1655645, 1578786, 1517757, 1528760, 1508170, 1462654, 1418740, 1361476, 1311230, 1207099, 1155148, 1308650, 1326632, 1255169, 1169094, 970334, 791367, 721042, 794413, 805409, 845796, 790255, 725442, 701318, 702205, 713362, 711871, 730982, 920269, 1144871, 1096629]
18263A096629j23769m2525j21814j24738j9010P2580m3159L2213K1077K4435l0400
18252G41519j01126j22158j72567j76380j3311J692k292K62412J76455n6247Q0702
18241F18699k4304N3193L1721j30765j41783L6484m6480k07718K3525Q4342K94020
18230E90934L12847J1822R3697O2755n7127r1756r4615j59076K5995j4238J7628
18219F98866J50268j0632O6017l5104m9023j27037P7929j0928q6887J626M9875
18208G24970K322o1719P1131j4564L7192J05909k159J7558O6475J13417L0395
18197A090927j86994j59729o8392o834q5672l1810K0864K2877Q6717P9352K93
18186G61599K3947j27172j11477p5454j26019m5874N0186K0438M8837P9820L2825
$$ y = [1096629, 972860, 930335, 808521, 683783, 664773, 737353, 694194, 726407, 747484, 771919, 741519, 640393, 518235, 345668, 169288, 155977, 157669, 155377, 417789, 594244, 537997, 618699, 594395, 647588, 679309, 548544, 406761, 443245, 396765, 189047, 212572, 296914, 590934, 903781, 915603, 1009300, 1072055, 1014928, 923172, 828557, 669481, 695476, 681238, 698866, 849134, 838502, 904519, 869415, 820392, 693355, 771284, 760356, 673469, 675095, 724970, 727292, 665573, 736704, 722140, 759332, 865241, 863082, 880640, 947115, 1060532, 1090927, 903933, 744204, 675812, 668978, 583306, 551496, 572360, 595237, 681954, 761306, 761599, 785546, 658374, 546897, 471443, 345424, 299550, 349736, 370174, 419011, 498831, 531656]
18175E31656J38956J96363M9591N4234O8847O1008j3107r827P947J9865J81823
18164A287356P0420M4006l2283j07608L6657K23846Q4683L6054L95698P78362
18154B817191R10000Q26109N401m40618n12430n30181m83003j46323L9273M5300
18144B530719j8505j04308q2526j07149J78296J28910J42957Q5461Q6643J26443
18134B966941J30767R6853J69881K33140L67544L44378M36141O24155N31982N74339
18124F476121P12955Q77102J107501J456702K086450K344628K057455J523989
18116A8642903J564564J929724K191060K912051M139817O304173J0083743J6972651
18108F4740686L0599294O0438014J00860883O1503637j5519906l3003621l8749926
$$ y = [531656, 670612, 866975, 916566, 970800, 1039647, 1100655, 1087548, 1077721, 1085668, 1105533, 1287356, 1357776, 1401782, 1369499, 1261891, 1298548, 1522394, 1607077, 1643131, 2038829, 2817191, 3727191, 4553300, 4558701, 4118083, 3605653, 3075472, 2592469, 2446146, 2485419, 2530719, 2512214, 2407906, 2325380, 2218231, 2396527, 2525437, 2668394, 2753855, 2840498, 2966941, 3097708, 3194561, 3364442, 3597582, 3965126, 4309504, 4745645, 5369800, 5901782, 6476121, 7189076, 8066178, 9173679, 10630381, 12716831, 15061459, 17118914, 18642903, 20207467, 22137191, 24328251, 27240302, 31380119, 37684292, 47768035, 64740686, 95339980, 155777994, 256638877, 318142514, 302622608, 269618987, 230869061]
18101B30869061m8685866n2146974l8016787k3110641j2618800n910099q01806
18094D9578088M436555J1557021J7920814J1577886m163385j0557223j1137912
18087F9211844j2270637j2562232r519597n766459k958864j578171o20446L69915
18079B4305353J587334L010740N424026R418570J6338491K2400259J4128305k708707
18071I3904371q685467r083986j0302949j0143127o095309j55244O467645J5445575
18063G1351509K5974434K5470524J4183924Q090150m692042j8103204k1546643
18056A00728652j9022396j5673945j1025650m367428K861031J1095203J7004720
18049H1600187Q600449o168483j0565516j0526612j1819103j1680355q567258
$$ y = [230869061, 182183195, 130036221, 92019434, 68908793, 56289993, 50379894, 49578088, 54014643, 65571664, 83492478, 95070364, 90906979, 80349756, 69211844, 56941207, 44378975, 34859378, 29092919, 26134055, 24555884, 23935438, 24305353, 25892687, 28903427, 34327453, 43746023, 60084514, 82484773, 96613078, 93904371, 85218904, 76134918, 65831969, 55688842, 49593533, 49438289, 55905934, 71351509, 97325943, 122796467, 136980391, 145070541, 140378499, 122275295, 100728652, 81706256, 66032311, 55006661, 50639233, 53500264, 64595467, 81600187, 90200636, 84032153, 73466637, 62940025, 51120922, 39440567, 30873309]
18042C0873309n064217k623999j277591l72000N76995J752122L700903P351789
18034C4917311J3623769K0538566J3344032m001580r482094r112489j0431348
18027D9396167j1160227q010217m101542j163758J278021M174580Q889305J5796149
18019E5098478J8021017M893982p960796r947446j0371009j1852032j1158820
18012B6723374p575003m635378k917815j932367j246859r08346q16639m53996
18004F236971k35693q4661L2011L2635j40970k92310k87812m43123m91061m77518
17994C848469m55068m97189l96138k79022k68371j89210n4378O9640j33533l17204
17984A327996p9893j5355j11407j07106j60548N2968K60980L03229L58164P35368
$$ y = [30873309, 25809092, 23185093, 21907502, 21535502, 22112497, 23864619, 27565522, 34917311, 48541080, 69079646, 82423678, 78422098, 68940004, 59827515, 49396167, 38235940, 30225723, 26124181, 24960423, 26238444, 30413024, 39302329, 55098478, 73119495, 78013477, 70052681, 60105235, 49734226, 37882194, 26723374, 19148371, 14512993, 11595178, 9662811, 8415952, 7507606, 6690967, 6236971, 6001278, 5916617, 5948628, 5981263, 5840293, 5547983, 5260171, 4817048, 4325987, 3848469, 3393401, 2896212, 2500074, 2221052, 1952681, 1763471, 1709093, 1778733, 1645200, 1327996, 1248103, 1232748, 1121341, 1014235, 853687, 906655, 1167635, 1470864, 1829028, 2564396]
17974B564396Q76115M00740j90959m85708m24404m45079n34338k85691j29047
17965A346025k25107j24901O494j69883j73838q5211j17586L1915J40844P9850
17955G08602N9850R435k49180j51048L4228P8382m0664k38498Q2188J74457R9014
17944E66766M8838j32866o0869J0862m4959J96175O261l9330j00965j5679J84376
17933F18610K90246P834L5728J19531k2845J64427K65217R8007l9301j98739L1610
17922A370325J80983J21192o2474j71095Q2343P7529k18701l87626n8497j8094
17912I15885j86923j58082l2718J15945N5952j51856K9076J6900J04690p5446
17902F33423j92995j42122j08116N6152j6146l4953K2346l5618n084N2602Q2050
$$ y = [2564396, 3440511, 3841251, 3650292, 3164584, 2740180, 2295101, 1760763, 1475072, 1346025, 1120918, 996017, 1002511, 832628, 658790, 573579, 455993, 487908, 628752, 708602, 768452, 777887, 528707, 377659, 411887, 490269, 449605, 211107, 293295, 467752, 566766, 615604, 482738, 421869, 432731, 387772, 583947, 590208, 550878, 449913, 434234, 618610, 908856, 916690, 952418, 1071949, 1049104, 1213531, 1478748, 1576755, 1537454, 1338715, 1370325, 1551308, 1672500, 1610026, 1438931, 1521274, 1598803, 1380102, 992476, 933979, 915885, 728962, 570880, 538162, 654107, 710059, 558203, 587279, 604179, 708869, 633423, 440428, 298306, 190190, 246342, 230196, 195243, 217589, 181971, 176887, 229489, 311539]
17891C11539O4361o6623r8136J8341j1326J96758K10958L4127O8117R1282j5392
17880H04006P0197R9045q8551O8621J62786R9640Q9549k35672l16911j1379N4906
17869G96237j02026o6866j5661J43009M8512j7972L915J47785O6574j28081q4172
17858G91254L1126p5254j14162j78639L5912M0504q0323j82308K4607q7327j02404
17847A02986L1852k7985L3364J1474j8073j90504j75027n3236O1787J52200K6017
17836d5145p8237J40124M4144j206N7360N3054K7111q7231o0938p154M0428Q3688
17824A65998m3981l7047l8927K4479O2714j13522o5517j5241R5421J54708Q7810
17813B76895j22954j33865L5567k0596q9967q8844L4242K0091K8685J42601m1740
$$ y = [311539, 375900, 309277, 211141, 229482, 218156, 414914, 625872, 659999, 728116, 819398, 804006, 874203, 973248, 884697, 953318, 1116104, 1215744, 1305293, 1069621, 752710, 741331, 796237, 694211, 627345, 611684, 754693, 803205, 785233, 789148, 936933, 1003507, 875426, 791254, 822380, 747126, 632964, 454325, 490237, 530741, 450418, 268110, 292717, 205390, 102986, 134838, 106853, 140217, 151691, 133618, -56886, -231913, -285149, -223362, -71162, -45145, -123382, 16742, 60886, 59680, 117040, 170094, 197205, 109974, 49036, 41882, 82310, 165998, 122017, 84970, 46043, 70522, 133236, 19714, -45803, -61044, 34377, 189085, 276895, 153941, 20076, 55643, 35047, -54920, -143764, -109522, -89431, -60746, 81855, 40115]
17802D0115K5592k9638r6353k9922Q1742j33327p9999J30797J30933O1670N3126
17791A54736r2969k1347l9142j69377o612P3391J07078M0214M6957o1398m7998
17780a6467N9330q8285p5253J43840J08025j34209j97675j7779J16282L6189R4131
17769B8129J61386K4398j6482j57212M62K1843L7427J767n9540p8466j1491k2643
17757g0422o5439J2606L2376L5962k9634M6r3322k3251R0676O0265J94096L5488
17745A79447l2296K4883j20942m2170j417L2275r7075J11734J636j51352O1347
17734c3930o7552M3442M6764J60310j82942q0871q5978J68521p404M976k8900
17723f3564R784j121l7306L156p784J7552m3184J29034J31476j6534o5321j93737
$$ y = [40115, 65707, 36069, -60284, -90206, -8464, -141791, -221790, -90993, 39940, 101610, 154736, 61767, 40420, 1278, -168099, -174711, -101320, 5758, 45972, 92929, 31531, -16467, 42863, -45422, -120675, 23165, 131190, -3019, -200694, -218473, -102191, -66002, 28129, 189515, 213913, 197431, 40219, 40681, 62524, 99951, 101718, 42178, -36288, -47779, -70422, -135861, -123255, -90879, -54917, -84551, -84505, -177827, -201078, -110402, -50137, 143959, 179447, 147151, 172034, 51092, 8922, 7505, 39780, -57295, 54439, 56075, -95277, -33930, -101482, -58040, -11276, 149034, -33908, -114779, -200757, -32236, -39640, -34664, -63564, -53780, -54901, -92207, -89051, -96835, -79283, -122467, 6567, 138043, 121509, 56188, -137549]
17711a37549j09240M3274J29631P7195J59302P7260j82190M0122J66748q0861
17701A83692j50655j81969P7104P1297O3093K361q1242P771p1318M4018j9022
17690e4870R115J02141J2099j02833k0778L8471R614K0777J8241P5427q4635O2068
17678H4837K49380M2085k03571j91238n6473j9891P266l08P2881o8722L3973j06357
17666a56138j4915O5293K01071J52264n9120m2844L6716r1038K7845K4223r6450
17655D6907j9052o3389J28109J2744k4100P1171n2816j56333j25386R0033R9670
17644G558K6632m2533R5894n2003M3684P5809l4426k07673j85868J30516J27180
17633a5230R2541L0495o1176j17583n9305R0937J10768L5629O6646K5082r3850
$$ y = [-137549, -246789, -203515, -73884, 3311, 162613, 239873, 57683, 97805, 264553, 183692, 33037, -148932, -71828, -531, 62562, 64923, -16319, -8548, -79866, -35848, -54870, -45755, 56386, 68485, -34348, -55126, -16655, -7041, 13736, 31977, 107404, 22769, 84837, 334217, 376302, 172731, -18507, -74980, -94871, -87605, -87913, -15032, -83754, -49781, -156138, -171053, -105760, 95311, 247575, 188455, 145611, 182327, 91289, 119134, 143357, 46907, 27855, -35534, 92575, 105319, 81219, 152390, 99574, -56759, -182145, -92112, 7558, 34190, -8343, 87551, 35548, 79232, 155041, 120615, -87058, -272926, -142410, -15230, 77311, 107806, 46630, -70953, -130258, -39321, 71447, 107076, 173722, 198804, 104954]
17622A04954k84428n7781K5907J58703M0171K2269K5620J16465J07281M2931P053
17611C09145L5153j45508j03608J9892j68253j13914L9183J88334P1301j00621
17601C1104j7745N9819K9765l7125j21645o9517q5898o3794R5570J54853Q202
17590a6411J6945P2494M5693J4259k2807L7763p5394r936J19384L336O330J20025
17578C11681q0885r4889J3039P407p3817J742K28426J77220r3986k8580j21658
17567B45700k1357n5874m4280j27542M9769J1321R792j80467j05549R7727N3402
17556f7358L0959o1425L4116J62811J02838R2465J40491o2803M5138r4875j64494
17545A57863j87885L9996Q8557K4640J51257J69399P1195J26021R7527J27867
$$ y = [104954, -179474, -237255, -211348, -52645, -12474, 9795, 35415, 151880, 259161, 302092, 309145, 344298, 198790, 95182, 115074, -53179, -167093, -127910, 60424, 131725, 31104, 13359, 73178, 102943, 65818, -55827, -125344, -211242, -275036, -179466, -24613, -16411, 534, 73028, 118721, 132980, 110173, 147936, 72542, 62606, 181990, 185326, 191656, 311681, 230796, 135907, 148946, 156353, 82536, 84278, 312704, 489924, 395938, 367358, 245700, 224343, 168469, 124189, -3353, 46416, 57737, 67529, -112938, -218487, -120760, -67358, -36399, -97824, -63708, 99103, 201941, 294406, 434897, 372094, 417232, 322357, 157863, -30022, 9974, 98531, 123171, 274428, 443827, 515022, 641043, 738570, 866437]
17535H66437j89210m9698m6970p5302k5839q2781K7230Q7306q8065n0014J26686
17524D99780j89288m2163L1319l1633p9161o1873q6628P6255Q9265r6722L8635
17513A47786J20790J24202l8079m644p5030M4888R1198P0086j36420j08590l8550
17502A97637m7698R4134J24757m2196N4139J2579J56558P0362o4281j38528o9767
17491C47696j13488k63307k9163O6170j3847r2064q7665L166J35548J34730r3197
17480e421m2768n5073k677N1272P9647j3297j36995m3851J25396P7078r748o0576
17468c7013l7430Q312M261P0451j34080n956O1415J29901J56628j51914j90321
17457a25746K0484Q8934K2257K3412r0022j32023L3541m8585Q1137R5453K1387
$$ y = [866437, 677227, 627529, 580559, 505257, 479418, 396637, 423867, 511173, 423108, 373094, 499780, 310492, 268329, 299648, 268015, 188854, 126981, 40353, 116608, 205873, 109151, 147786, 268576, 392778, 354699, 350055, 275025, 319913, 411111, 481197, 344777, 236187, 197637, 149939, 244073, 368830, 326634, 380773, 393352, 549910, 620272, 555991, 417463, 347696, 234208, -29099, -58262, 7908, -5939, -98003, -185668, -182502, -46954, 87776, -5421, -48189, -103262, -105939, -54667, 24980, 11683, -125312, -169163, -43767, 33311, 23563, -37013, -74443, -66131, -61870, 8581, -125499, -131455, -70040, 59861, 216489, 64575, -125746, -105262, -16328, 5929, 29341, -60681, -192704, -159163, -207748, -126611, -31158, -9771]
17446i771Q5284l3279R7449j8993j0182L14952M73710M43119j56534l50609q1645
17435G53501k28150k32378j36967k0589k4928q9965o4577j3281l0791R5514j1861
17424d472j08746j04157O567K21075J11767n7984j03263r9338P0863k5429L9127
17413e3990P2254j16757j75368l2587J24764L264l6410n7302j11791Q9309K45735
17402d8879J49352o2424o9229p1481j3349J23224p0563J7227J0408j00445m9735
17391a85894K2793j9592q8903m3214J71243m697m5324m0610p3013J02418N7086
17380a47707r884j6053J29630R6188J7519j57545M9629O3998k9118r2629j4984
17369a10956l1054j38747J01242J84700J53878r6413j22003J745p7098L4589L0132
$$ y = [-9771, 75513, 42234, 139683, 120690, 110508, 425460, 899170, 1342289, 1185755, 835146, 753501, 525351, 292973, 156006, 135417, 110489, 20524, -44053, -57334, -88125, 7389, -4472, -113218, -217375, -210808, 10267, 122034, 64050, -39213, -138551, -67688, -93117, -53990, 18264, -98493, -273861, -306448, -181684, -178420, -214830, -272132, -383923, -294614, -48879, 100473, 38049, -31180, -102661, -116010, 7214, -63349, -46122, -35714, -136159, -185894, -163101, -182693, -271596, -314810, -143567, -148264, -193588, -234198, -307211, -204793, -147707, -157591, -173644, -44014, 52174, 69693, -87852, -38223, 25775, -3343, -95972, -110956, -142010, -280757, -179515, 5185, 159063, 62650, -59353, -57608, -134706, -100117, -69985]
17358f9985m0792N9050r9913K2270P2861J43730L5908o6088M2751L1784J7210
17347A48786m3243j89814q6610P5994J42890J01811j2315p2468j76842J6803M3574
17336e1434K0297l0309L5193M5961M4858P6334P4027j96148j04890j09661J02890
17325i2882K32761O1818j12893m2028o7393j41742J16249j26441o5892M6039N2514
17314a39890K7770M6437l5587J03557j53439j29218r9788n4754O4282J99117R3203
17303g8310L6291j61850q0600N7248J10951P247N9575J86022P5603p6667L8991
17292A74501O030r4953p1164o6844n1190J860Q3000K8388k23412p4014M2639o4473
17280c09632Q8976K1543M6555Q7550p4713n3011k54R6894Q5349L9346j44385r1663
$$ y = [-69985, -110777, -51727, -151640, -129370, -56509, 87221, 123129, 57041, 99792, 131576, 148786, 105543, -84271, -170881, -94887, 48003, 149814, 137499, 65031, -111811, -95008, -51434, -31137, -61446, -26253, 19708, 64566, 140900, 214927, 18779, -86111, -195772, -92882, 139879, 201697, 88804, 46776, -20617, -162359, -46110, -172551, -238443, -192404, -139890, -112120, -65683, -101270, 2287, -151152, -280370, -380158, -434912, -370630, -171513, -78310, -42019, -203869, -284469, -227221, -116270, -109023, -49448, 136574, 212177, 135510, 174501, 180531, 85578, 14414, -52430, -103620, -101760, -18760, 9628, -213784, -287798, -245159, -309632, -220656, -199113, -152558, -65008, -139721, -192732, -192986, -96092, -10743, 28603, -115782, -207445]
17268b07445J43641o5442j51279N5024J5856L3317O1827K7622n2967r6223j4501
17257b50570n998O5986J7164J21880j5173K0818K2059J08651j0365q9778j8099
17246c3425O8560j256J44463j9557q4515q5381q734p0016n3443o354J1448M2738
17234i5472J13800J5306L957n9306m4556j39141o9846M6573J60267l0575l0049
17223a29042p300q298n8071J55269J22897L7421M0556M8290p1984j30774l4920
17212c5956o4930K3362p4158j17566J21154Q5669K2211L6942k7871j58667k3443
17201b13253Q4329Q9853K2518j67310k5139J25289P9359N2624J00206L5574M5256
17190B29306j33871l9464M4779o6556N8753K4387k8314n8318j09426p3450M6356
$$ y = [-207445, -63804, -129246, -280525, -225501, -209645, -176328, -114501, -86879, -139846, -236069, -250570, -256568, -190582, -173418, -51538, -66711, -45893, -23834, 84817, 74452, -15326, -33425, 35135, 33879, 178342, 158785, 74270, -11111, -19845, -89861, -143304, -149658, -138210, -95472, 18328, 33634, 37591, -21715, -66271, -205412, -275258, -228685, -68418, -98993, -129042, -136342, -144640, -202711, -47442, 75455, 112876, 153432, 201722, 129738, -1036, -35956, -100886, -77524, -151682, -269248, -148094, -62425, -40214, -3272, -31143, -189810, -213253, -128924, -39071, -16553, -183863, -209002, -83713, -4354, 48270, 148476, 184050, 229306, 95435, 55971, 100750, 34194, 92947, 117334, 89020, 30702, -78724, -152174, -105818]
17179a05818K05337M345J1076n1560k425n7542j53326m9238J02420j5532N5394
17168e6869j8227j06456M4848J64436L0391o2258M4341l0482o983k9770p3507
17157a00536q7284M7276P636m5916j4640K8369K0029r4800N3847P3394J3208L314
17145i6103J81589J33439p1888r4783q3823L6954J04290j21992j02781p5495L73
17134a90220J1713K3923N1299J62500n0548O3792O7194p6175j62334o1934R2049
17123f8741p3100q337J3795P1544n8825M8193J4110l3330k0212J16086m0815l0098
17111f9730M6988R6694o4572r969M550L3398M0581o7460L1420J8883k8814N4121
17099H6090M4955r8703j18009k4863o9216k6796M6489M2139R561N1213K03787
$$ y = [-105818, 99519, 103864, 114940, 63380, 60955, 3413, -149913, -199151, -96731, -112263, -56869, -75096, -181552, -136704, 27732, 58123, -4135, 40206, 9724, 2741, -27029, -100536, -187820, -140544, -132908, -178824, -193464, -165095, -145066, -239866, -186019, -112625, -99417, -96103, 85486, 218925, 147037, 52254, -31569, 5385, 109675, -12317, -115098, -190593, -190220, -178507, -154584, -103285, 59215, 8667, 72459, 139653, 63478, -98856, -160790, -68741, -141841, -150178, -136383, -64839, -123664, -75471, -61361, -94691, -114903, 1183, -39632, -69730, -22742, 73952, 9380, -589, 3961, 37359, 77940, 10480, 41900, 60783, 31969, 86090, 131045, 32342, -85667, -110530, -179746, -206542, -160053, -117914, -108353, -57140, 146647]
17088A46647L1359r3975m0146r1897j8020l5940l516J48314m8716q9315j29911
17077b25116j11882J73471K16792N5785K4311k07072j60025O4412J17017j9153
17067g1460M8715J51579n9112j34836J5215R1278m8799j07372j0987Q9620l6619
17056g2778k9490n9109j50064Q088Q4171M1940J45187j34794j81341J57292K71890
17045H0992Q758m1646p7878j4489K9749o113j112m8018j40444j30513n3761O9384
17033c25091J01979M0744l9385M3855J66280J4176Q662R9965Q1563j55081q6747
17022d9080q6539N8809m7786o4840J2096j5211M4993P1594n591K7156O7870l8262
17010b4791Q414m003L1488j27289l0776q391K1873o8776J01631R2247k2939J40437
$$ y = [146647, 178006, 84031, 43885, -48012, -66032, -101972, -105488, 42826, -5890, -95205, -225116, -336998, -163527, 53265, 109050, 133361, -73711, -233736, -169324, -52307, -71460, -22745, 128834, 69722, -65114, -49899, 41379, -7420, -114792, -125779, -36159, -72778, -102268, -161377, -311441, -303353, -219182, -177242, -32055, -166849, -348190, -190898, 80992, 89750, 48104, -29774, -44263, -14514, -20627, -21739, -69757, -210201, -340714, -394475, -325091, -223112, -182368, -221753, -177898, -11618, 2558, 11220, 111185, 192748, 37667, -49080, -135619, -76810, -124596, -189436, -177340, -192551, -147558, -75964, -81555, -54399, 13471, -24791, -16377, -20380, 11108, -116181, -146957, -155348, -133475, -202251, -100620, -8373, -31312, 109125]
16998A09125k443p9801q2384m3071L0824j2021j28406m1907J76314J55884j15709
16987c3595j54002J33012N5860K4786n267L1915L7941k06145p8251J53573J94514
16976A54341O1813K8133j57111o8817R9k8228R65M1687P0161n9609j09324p2424
16964a38314R0620q8994N1760J44801j4437r1576R1317K776J39455N4682r1570
16953A50520j11821M218M8037p4225j50796K2279O8105k935L1930j7823J6974
16942a5537J27400J1057p5035L6341J2273q9863o6032Q4207M6502Q3199Q7833
16931B42345r7609j24824p7015N5141Q0074J2878m4249O3679L6989j59542j87739
16920a99872J20979N8043J38364l2942M7215l0964k00289L2880J03887j61179
$$ y = [109125, 106682, 26881, -55503, -98574, -67750, -79771, -208177, -250084, -73770, 82114, -33595, -187597, -54585, 1275, 26061, 20794, 52709, 90650, -115495, -193746, -40173, 154341, 216154, 244287, 87176, 18359, 18458, -9770, -8805, 32882, 103043, 43434, -65890, -138314, -47694, -136688, -84928, 59873, 45436, -46140, 45177, 47953, 187408, 242090, 150520, 38699, 42917, 90954, 16729, -134067, -111788, -43683, -46618, -14688, -32511, -15537, 111863, 122920, 47885, 84226, 96499, 6636, -59396, 24811, 71313, 154512, 242345, 144736, 19912, -57103, -1962, 78112, 90990, 46741, 110420, 147409, -12133, -199872, -78893, -20850, 117514, 84572, 131787, 100823, -99466, -66586, 37301, -123878]
16910a23878j08490J3199K11725J78174l8935j09762l7002J4604j38272j26235
16900b64872J07951O0443K6520o6670N4247J60278j9077r6447p4623j20688L7307
16889a95631J75234m0945q0004m2314R6865L6046N6133P132O0975K6492M1252
16878A41235q6864r0454P2397l1059r3738k15953k9308R0300L313J20629J7129
16867a02373L597j7172J6691R5718n6339k3410R5913K9929j38118j53096l7726
16856b86386J80236J13461j05744k6808o4614j6044M1996J34299R5658o249O535
16845F6340n9282j3909p7385j21472r152J36064J05355p2975n3704q8906J802
16834a87224P1985J05573N8102J03586m0733j57380q7293Q9511J05499k1741L8753
$$ y = [-123878, -232368, -219169, -7444, 170730, 131795, 22033, -14969, -365, -138637, -264872, -156921, -96478, -69958, -136628, -82381, 77897, 58820, -37627, -112250, -232938, -195631, -20397, -61342, -141346, -183660, -86795, -50749, 5384, 12516, 73491, 99983, 141235, 54371, -36083, 36314, 5255, -88483, -304436, -333744, -243444, -240131, -119502, -102373, -98776, -115948, -99257, -3539, -59878, -83288, 12625, 42554, -95564, -248660, -286386, -106150, 7311, -98433, -125241, -189855, -205899, -163903, -29604, 66054, 59805, 66340, 7058, -6851, -84236, -205708, -214860, -78796, 26559, -46416, -100120, -189026, -187224, -115239, -9666, 48436, 152022, 111289, -46091, -133384, -43873, 61626, 39885, 78638]
16823G8638m075L2551j2446p4472j924j00504K1156n8467o2827K2060J53321J64954
16811A57965r3229r5783j00727n1980o0408N3449P3255O8937q0585o5670J2972
16800a81804R9096m4875m900O4752m8432p4340K0990R7432M3961J6332N4298m3175
16788f65k022J3838n054k3085n2476j29902J50074J72955J00109k2562o9986j07486
16776B3738k8013j2226l1126k3915K3485K6283q231M6854L1127j44622m1254J0038
16764a27862j61L6956Q6529K14180R8817j19920k2190N968m455L2740j83485P3492
16752I0609L1328l4250O1445n5890m4210j11310k7648k2806J00379R9956M9268
16741A36871K2974o5893p0467L19j34486p4334J25036K208q9800K6317J8852P3679
$$ y = [78638, 74563, 107114, 94668, 20196, 18272, -82232, -61076, -119543, -182370, -160310, -6989, 157965, 64736, -31047, -131774, -183754, -244162, -190713, -117458, -48521, -129106, -194776, -181804, -82708, -127583, -132483, -67731, -116163, -190503, -169513, -72081, -28120, -11788, 42510, -665, -2687, 11151, 6097, -16988, -69464, -199366, -49292, 123663, 223772, 201210, 131224, 23738, -4275, -16501, -47627, -71542, -48057, -21774, -30005, 16849, 47976, -96646, -137900, -127862, -128023, -91067, -4538, 209642, 308459, 188539, 166349, 172317, 167862, 200602, 17117, 90609, 121937, 87687, 149132, 93242, 49032, -62278, -89926, -112732, -12353, 87603, 136871, 159845, 93952, 23485, 23804, -110682, -185016, -59980, -57772, -147572, -121255, -102403, -28724]
16729b8724P2970p5259l5177M2151M7411J4091P4923J8526j32818j15663k7136
16718a44705j2136K02096o582j43462k7081P0330R150q4992K8632J67709l5747
16707B3212o3751j31479Q1780L0288j00797j65995L1844J16596J43576J2044j7105
16696c9787J4969j19305m6976M0905R8513N3126j10286p7425J101q4085j33618
16685d02868l346J9267P6859n878R3225o2773l4362J25326P6223j6028J13662
16674b0693M1909m0797j2459j24405p4487Q5973J48825j3063l4123o5532r2365
16663b01217k782n762J12117K4741J59584K7277J9599j62834j27677m6768m2290
16652b46012J9967K04730J39623k7146j26156k4087r862l9708K9572o3705k8494
$$ y = [-28724, 44246, -31013, -66190, -24039, 23372, 37463, 112386, 130912, -1906, -117569, -144705, -156841, 45255, 38673, -104789, -131870, -61540, -52390, -137382, -108750, 58959, 23212, -40539, -172018, -90238, -59950, -160747, -326742, -294898, -178302, -34726, -22682, -39787, -24818, -144123, -191099, -150194, -51681, 1445, -108841, -186266, -185165, -269250, -402868, -406214, -386947, -310088, -315966, -222741, -285514, -319876, -194550, -118327, -134355, -20693, 21216, -19581, -32040, -156445, -230932, -144959, 3866, -9197, -43320, -108852, -201217, -203999, -209761, -97644, -72903, 86681, 113958, 133557, -29277, -156954, -203722, -246012, -226045, -21315, 118308, 91162, -34994, -59081, -68943, -108651, -79079, -142784, -171278]
16641a71278J71307J34562n9647j34723j5496Q0403m5904p6089J52633j5709j23997
16630a03938p3003K6800n9886O511Q9548R5790L9529k28023p7939J06180L2473
16619a45958M3592J13925j4145q0153j1393J73685j9771M403l6074o6420k0583
16608e8892P5738M7418k7744P3214P4129j74645k35682k278q0257N6928J85210
16597f6861N1510k4018m5046o4471r0597L6501J16277O7090R88n9834M3115q7589
16585a22935n8374P4212k8329r1437J45283J69240l3491j12461k5479m9698l2742
16574a66211m1972K8061J36523M5046M9982n4994J9498R5816l1979r2230m8745
16563f1205M1657K2609j2431k2788p4458m6045J41624Q8119o5603l915J17313
$$ y = [-171278, 29, 134591, 74944, -59779, -75275, 5128, -40776, -116865, 35768, 20059, -103938, -176941, -150141, -210027, -203516, -113968, -18178, 21351, -206672, -284611, -178431, -145958, -102366, 11559, -2586, -82739, -94132, 79553, 59782, 64185, 28111, -38309, -58892, 16846, 64264, 36520, 109734, 183863, 9218, -226464, -228742, -308999, -252071, -66861, -15351, -39369, -84415, -148886, -239483, -202982, -86705, -19615, -18627, -78461, -35346, -122935, -181309, -107097, -135426, -226863, -81580, 87660, 54169, -58292, -83771, -133469, -166211, -208183, -180122, -43599, 1447, 51429, -3565, 15933, 111749, 79770, -12460, -61205, -19548, 3061, -9370, -32158, -106616, -152661, -11037, 77082, 11479, 7564, 124877]
16552A24877q269j05705n1946j07512N483j29978L9002O9526O1259K33807J6637
16541A47181o0423p198J4771n3523j09757m4718J10552N8292r9435p6752K6091
16530i4919K7377q6212M939L4507l4189L782K6189P7131P2128j0849l1436M5347
16518C3795Q7588J8760o2816K0433K9029j06815j36183k7915o4012j11323M2856
16507b76603N4183k2266J19959K41199Q3779L6887j66368J0748o3953k9100j02840
16496a14375J055k9320Q876K8961J04032p3442m3896R5539j0297O98k6559Q912
16484d9816n8202J30712O2946M3002r9691k2599O127j48180P7636K13708O4328
16473B19971N7827k48944j32541J27721J194j36016m6917O0252O0172m6434J9067
$$ y = [124877, 116608, 10903, -41043, -148555, -143072, -273050, -234048, -164522, -103263, 130544, 147181, 86758, 79560, 94331, 40808, -68949, -113667, -3115, 55177, -44258, -121010, -94919, -67542, -153754, -148815, -114308, -148497, -144715, -118526, -41395, 30733, 19884, -11552, 33795, 121383, 140143, 77327, 97760, 126789, 19974, -116209, -144124, -208136, -319459, -276603, -222420, -244686, -124727, 116472, 200251, 237138, 70770, 81518, 17565, -11535, -114375, -113320, -142640, -133764, -104803, -771, -74213, -118109, -22570, -32867, -32169, -58728, -49816, -108018, 22694, 85640, 128642, 28951, 6352, 12479, -135701, -58065, 155643, 219971, 277798, 28854, -103687, 24034, 25228, -110788, -157705, -97453, -37281, -83715, -64648]
16462f4648K25801J2670q8807O9922J41106j5071j70755j99370o6664K1337j7149
16451a51628l4164K9449J01531p8822j67101m1309O2443O6619L4379L3764M4104
16440a00735l0310k4879o8165J8195J28732J14440L6571m3271q699N3292j44998
16429f9827J94r5043m7988J08365R2659m3510J03988o1688K0438O7455k1254j27238
16417g3449j07419Q8925J23022j2158m1772j4139o2776o1918k5256p003L6965
16406a56978N1417n189j7084k8105p5459P679k7537M6J8930L2565O6402N7167
16394g6146p5564R5878J6080J2021j0755q3063O308K0445N3316K1026R7822k4906
16382E2462L7001r9065L7884n4706n9477N4870K346o1563Q3559k3674m985M693
$$ y = [-64648, 161153, 173823, 85016, 154938, 296044, 280973, 110218, -89152, -155816, -134479, -151628, -185792, -156343, -54812, -133634, -300735, -342044, -279601, -212982, -178603, -144839, -100735, -131045, -155924, -224089, -205894, -77162, 37278, 73849, 30578, 21879, 75171, -69827, -69633, -164676, -212664, -104299, -11640, -55150, 48838, -12850, 7588, 75043, 53789, -73449, -180868, -91943, 31079, 18921, -22851, -36990, -99766, -161684, -186940, -193943, -156978, -105561, -110750, -127834, -155939, -231398, -223719, -251256, -251210, -232280, -199715, -133313, -76146, -151710, -55832, -39752, -27731, -38486, -121549, -115241, -94796, -41480, -20454, 77368, 52462, 89463, -9602, 28282, -26424, -85901, -31031, -28685, -90248, -6689, -30363, -35348, -30655]
16370c0655N5280j6725m3261p8445J3503M2186J17008m4104r0301k0368M4340
16359e1542p2030k5182J38504l32N0764J8604M3495o4086M1110J33193l0692l298
16347A78508J00442j12771k91103n3155M2046M6305R4731N3707o5862q0121r6972
16336a84245L3490q750J00980N5764N3662O3318J08180p3m8337j57897m3989l3826
16324f1723k599R440P1759n5290j997M5755Q7887k5594l8162n5223K3817R9262
16312I7332J38313J15955j11878j37464l690R1480N9938k9492j48649p5213M0844
16301C7476n244j15735j34448M3751J21597P8931M894J0242p3670j9515O5974
16290A4253o6220j04856M9998R3298m0449R5915P1644n2640O388m1099K0096O0150
$$ y = [-30655, 24625, 7900, -35361, -113806, -100303, -58117, 58891, 14787, -75514, -95882, -51542, -123572, -148754, -10250, -10582, 40182, 58786, 102281, 38195, 79305, 212498, 181806, 178508, 278950, 166179, -124924, -178079, -136033, -89728, 5003, 58710, -7152, -87273, -184245, -150755, -159505, -58525, -2761, 50901, 114219, 222399, 222326, 173989, 16092, -27897, -61723, -64322, -54882, 16877, -38413, -40410, 5345, 93232, 67638, 29476, -25747, -1930, 97332, 235645, 351600, 239722, 102258, 98568, 190048, 249986, 220494, 71845, -3368, 37476, 32232, -83503, -217951, -174200, -52603, 26328, 31222, 41464, -32206, -51721, 14253, -51967, -156823, -106825, -13527, -53976, 41939, 113583, 60943, 67331, 26232, 46328, 106478]
16278A06478N2995J7780j98149P7495K3871n7657p6111O675Q0214k19236j88583
16267c74228j745K20142P2062P4844O5100J998j39743J3151M8684N6373J13854
16256A50492j0802j71628R815J6721p0991n1761N5498J22744J38169m1671k6451
16245A20135j97575q3643K9120j05285l1491J27171M048J13739P5033j61967p5057
16234a85772l597K50449J83321P054q4873j8466K7541j18539k34185j6274Q6697
16223a06644J30573J4421l0017O2266j67418j13409J46318Q8211K5176j45789
16213i6312j66063J7890J77065R0173k27554m1149L4145Q8671K08355K03011q9030
16202A99202o2775k1600J1187J08952q225k7503J12758j42347j08609m8164L9208
$$ y = [106478, 159473, 177253, -20896, 56599, 80470, 22813, -53298, -46623, 33591, -185645, -374228, -375973, -155831, -83769, -8925, 56175, 58173, -81570, -68419, -19735, 36638, 150492, 139690, -31938, -22123, -5402, -76393, -128154, -72656, 50088, 188257, 146586, 120135, -77440, -161083, -131963, -237248, -268739, -141568, -137520, -23781, 51252, -110715, -185772, -189369, 61080, 244401, 251455, 166582, 148116, 175657, 57118, -177067, -193341, -106644, 23929, 38350, 8333, 70599, -96819, -210228, -63910, 24301, 49477, -96312, -262375, -244485, -67420, 22753, -204801, -245950, -211805, -123134, 85221, 288232, 199202, 136427, 114827, 126014, 234966, 226741, 199238, 311996, 169649, 61040, 12876, 52084]
16191E2084j07824M2801P9926M8008J0549J372m0042j11346M3776J03893M0683
16180A63880R7127L022m8204j79384k0171J25606l2335o5693m172J17874J71692
16169C29242o6298r9084j07200j7924O8341R3234O1372j357p1986j868j08939
16158G7533r7721o6516r123M4657O1187L5455j11478n0300N4901N1289l3779k676
16146d6571r1501N5527J3785L9855K8147o408p8279n9472j9891R7277J59466p8271
16134A3664j72446J13052J16580M6678j82367K4447J08350K5550K7459J9836o7170
16123G3633j32123j63531L3985J58329m2308n1073J2258o8302k4472J47791J04238
16112D8425n0131O839p9562q3629J12722O0212M1370P1784j8580l2184j67623
$$ y = [52084, -55740, -12939, 66987, 114995, 125544, 126916, 86874, -24472, 19304, 123197, 163880, 261007, 264029, 215825, 36441, 16270, 141876, 109541, 43848, 39676, 157550, 329242, 262944, 163860, 56660, 38736, 107077, 200311, 261683, 260326, 188340, 186472, 77533, -20188, -86704, -95827, -51170, 10017, 45472, -66006, -116306, -61405, -10116, -43895, -46571, -138072, -82545, -68760, -28905, -758, -7166, -85445, -144917, -164808, -67531, 91935, 13664, -158782, -45730, 70850, 117528, -64839, -40392, 67958, 93508, 120967, 140803, 73633, -58490, -222021, -188036, -29707, -72015, -123088, -110830, -179132, -203604, -55813, 48425, -1706, 5133, -74429, -158058, -45336, 14876, 56246, 128030, 109450, 77266, -90357]
16101i0357p7681J19404J51686o3695r866N7532K1195j4814J62432l691q7783
16090A64362j30479j6120j25918M625q4468l0611J06391L9507P7711Q6212j73816
16079h2604p9671J1274O2429k2143L4811L7079j53833j46467o5353J85071R2155
16068a27252J2868R5487K2923M6643l5837R2155m2107l9884R7471n6969o8698
16057c200K2783k1694J06128M6288J8098j15285j55529o3119P6173R1845o8151
16046f5663l424M7273o6926l4166L9154K3730O2036N0480q8389p4664J32071J07741
16034A29253k6991l5911J9997J4202m5921j38633M219j17942N7611l4841p856
16023a82813J00789N3664M4499O4743M7731r775k3781n3865j09894o4350M8633
$$ y = [-90357, -168038, -48634, 103052, 39357, 29491, 87023, 108218, 93404, 255836, 252145, 164362, 33883, 17763, -108155, -103530, -187998, -218609, -112218, -72711, 5000, 91212, -82604, -162275, -151001, -88572, -110715, -75904, -38825, -192658, -339125, -404478, -219407, -127252, -114384, -18897, 4026, 50669, 14832, 106987, 64880, 24996, 122467, 65498, -3200, 19583, -2111, 104017, 150305, 168403, 53118, -102411, -165530, -89357, 2488, -65663, -69087, -21814, -88740, -122906, -83752, -60022, 2014, 52494, -35895, -110559, 21512, 129253, 102262, 66351, 86348, 100550, 54629, -84004, -79785, -197727, -140116, -174957, -182813, -82024, -28360, 16139, 80882, 128613, 118838, 95057, 41192, -68702, -133052, -84419]
16012h4419k9307J0470R1617k4852o3395M1727j47937m1532k9171J3131R4491
16001a69177n1889k8439J4403J17672N6826J9394K7817J43804J50155m6309k57048
15990b2791O694J2475j32380k5046J36867l502n7055J37111J28878p0730R6159
15979B06680j1148j27687O1926r3575p5805O6685j04008n3156q0805l051O6901
15968a47043r2000Q8616J30569o9966j95091R7605J18319j46858m3765O4638J63828
15957c1148J51666J8537j09580J9029L4829m7781Q2622N9690M3217j75466l22110
15946b76495k805P7707P9918N7943Q0935j7343M493n014M0723L1083J1707j71416
15934h8564m4091J04025L8775o8782r8823P1955K8289n8463n7524k7904p6430
$$ y = [-84419, -113726, -103256, -11639, -36491, -99886, -58159, -206096, -247628, -276799, -263668, -169177, -221066, -249505, -235102, -117430, -60604, -41210, -13393, 130411, 280566, 234257, -22791, -16097, -3622, -136002, -161048, -24181, -27683, -84738, 52373, 181251, 110521, 206680, 195532, 67845, 129771, 36196, -39609, 27076, -76932, -130088, -210893, -213944, -147043, -239043, -150427, -19858, -89824, -284915, -187310, -68991, -215849, -259614, -194976, -31148, 120518, 139055, 29475, 48504, 83333, 35552, 118174, 177864, 221081, 45615, -276495, -279300, -201593, -121675, -63732, 17203, -140, 4353, -661, 40062, 71145, 82852, -88564, -132655, -28630, 10145, -58637, -157460, -85505, -57216, -115679, -173203, -201107, -277537]
15923b77537J9388Q9587J87311O9135m7998j60385n3720M1870J3160m5055M9895
15912a14349J40677J40402j9672k0808r299o5327l9536n5176q059N6091n2089
15901d7145p0026M7131j26794o9541J65774K9644P8195j01140q4981O3005Q5671
15890c0207r7647M9295J40413j1127k0556L9854p4742M2205J0781j32066p538
15879i1335J10271M9323P0216j33336q0046m8504L2329O950Q007j15205J04236
15868h7094P0313P5883k3407o441K6926O0825k9891j7764n2446q3381l5203K28215
15856A26535J27249p5438p3104L1745L2716q8190p2519J8375n0354j24575N0103
15845i7457Q2947n5663P8751J39341J85743L3118j43514o2406j1409j44709m6995
$$ y = [-277537, -258149, -168562, 18749, 87884, 39886, -120499, -174219, -132349, -119189, -164244, -114349, 26328, 166730, 147058, 126250, 116951, 51624, 12088, -43088, -51147, 4944, -47145, -117171, -70040, -196834, -266375, -100601, -70957, 7238, -93902, -178883, -115878, -30207, -127854, -78559, 61854, 50727, 30171, 70025, -4717, 37488, 48269, -83797, -91335, 18936, 68259, 138475, 5139, -74907, -123411, -91082, -84132, -76125, -191330, -87094, -16781, 59102, 35695, 29254, 56180, 117005, 87114, 69350, 16904, -66477, -101680, 126535, 253784, 178346, 105242, 136987, 169703, 81513, 8994, 27369, -22985, -147560, -97457, -14510, -70173, 8578, 147919, 333662, 366780, 223266, 160860, 149451, 4742, -42253]
15834d2253O8173k5170J14560M4685r270r3400r3229Q2368N2475Q1416m0648j13745
15822B5962p0365J63147J50458j36567o1744j73853j35921O5521J07442N9210
15812f710Q5343K4986K3016J120J1056r0768q0178J02503k6063r1994k353M1570
15800h472P0059J30361o027n8773r1382o3879O4201j3712k3808o5822L0027N9745
15788B2518l2351l6649K0029N3650J0973L8350l0149M2921q3046q8483k6614J92483
15776H3632J69868j3947o8745m6039J998q7763q3204p6632l9679N3780N7645o4663
15764a13749o5448J83947j2024r7596q2502K42095P1612j00835l6250O3023m6560
15753E713j51943n4276L4980O5692q0548j33066M4432M5436J23414K15672j09693
$$ y = [-42253, 25920, 750, 115310, 159995, 150725, 57325, -35904, 46464, 98939, 180355, 139707, 25962, -44403, 118744, 269202, 132635, 70891, -102962, -238883, -173362, -65920, -6710, 78633, 103619, 126635, 127755, 138811, 48043, -32135, 70368, 44305, -47689, -50042, -8472, 61587, 191948, 185921, 127148, 35766, -28113, 36088, 22376, -1432, -67254, -37227, 22518, -9833, -46482, -26453, 27197, 38170, 76520, 46371, 89292, 6246, -82237, -108851, 83632, 253500, 239553, 170808, 124769, 126767, 39004, -44200, -120832, -160511, -106731, -49086, -113749, -179197, 4750, -7274, -104870, -187372, 54723, 126335, 25500, -10750, 52273, 5713, -146230, -200506, -165526, -99834, -180382, -313448, -269016, -223580, -100166, 115506, 5813]
15742E813m9645n6273n3861N5637R4793K3800J88360k7830j90791Q0310L5294
15731A05607j94611j96426k8383J51791N4597M588L0195L0753J01567J36379n7191
15720A38866o7538O603p2714k2116k0073P0823L0945o043j29265P4456M9094j3030
15708D0008L2303M5615m6599J60779K1425m4990Q2049N8321k9376j50182n9822
15697A09531n8380r7668j46891r3812M2310M4088K9093K150J03786K1453o7787
15686a12127j45941Q3677m6430j39501J55606K04459j22167o8866Q4313m3555
15676a50532O4552Q0703j5197j1739q8761J05137M7030o0597k2614M1634j74j0522
15664b1080O0026n2327j1681J47797K8562j31075j25887Q8172l8731O0254J408
$$ y = [5813, -43832, -100105, -153966, -98329, -3536, 20264, 208624, 180794, -9997, 70313, 105607, -89004, -285430, -313813, -162022, -107425, -102837, -72642, -41889, 59678, 196057, 138866, 71328, 77931, 5217, -16899, -36972, 33851, 64796, 58753, -70512, 3944, 53038, 40008, 72311, 117926, 71327, 232106, 253531, 208541, 290590, 348911, 319535, 169353, 109531, 51151, -46517, -193408, -287220, -244910, -200822, -171729, -169579, -65793, -44340, -112127, -258068, -174391, -220821, -360322, -204716, -257, -122424, -191290, -106977, -150532, -85980, -5277, -20474, -32213, -120974, -15837, 31193, -29404, -52018, -10384, -10558, -21080, 38946, -13381, -25062, 122735, 151297, 20222, -105665, -17493, -56224, 4030, 5438]
15653E438J4252N812N9271N3898o4916m5121M2825J18071j18163j53994q3962
15642a66589N9479M1085j4837l5968l5014o9194j04381M0629N9796P6888M4930
15631a03176J07496Q6306L7900L2460M3399p9078j51735L9768o4019l5639L659
15620h2659n8062m8722k114M0840J11227R0855J48839L277r0502q3504j30749
15609a01274j05153J13260J82829N3343p7745m4639m3549J13482k2743r8369k6200
15598e6758P6687j29540p8101R880j19495j3143J52015j2412R6614r6896L6577
15587a34572O0428K4741J4755Q5756N6953j21127k7157M8855L3178j61839o2654
15576a82683j7633L9706n1026j9794L4881j9824o8973O3465Q9467J59711j8035
$$ y = [5438, 19690, 25502, 84773, 138671, 73755, 28634, 71459, 189530, 71367, -82627, -166589, -107110, -66025, -80862, -116830, -151844, -221038, -325419, -284790, -224994, -148106, -103176, 4320, 90626, 128526, 160986, 204385, 125307, -26428, 13340, -50679, -86318, -82659, -140721, -189443, -191557, -150717, -39490, 51365, 200204, 203481, 112979, 29475, -101274, -206427, -93167, 89662, 143005, 65260, 20621, -22928, 90554, 67811, -30558, -56758, 19929, -109611, -187712, -177832, -297327, -310470, -158455, -170867, -74253, -171149, -134572, -74144, -49403, -34648, 51108, 108061, -13066, -40223, 8632, 41810, -120029, -182683, -200316, -160610, -211636, -231430, -196549, -216373, -285346, -221881, -132414, 27297, 9262]
15565I262q8746j1073J25466k1918j3898K5111q4481P659M0022l6954o9130P0726
15553d7954J32362p3781j42177L3557J6560l919J60431M3616N1306o3438P5215
15542A81778j07656O5098J22539p7034j5321N4159l2877n403r8918j080j49792
15531f4507j65753L6799Q1036P5916K1529l0693O0964n2410r6069P3890J0785
15520d8513Q7624R457j3179N4596R3459r0691n4516n1382k0061N3615L7753o4081
15508e919R0945J1010k0896n5307o9207K8779n1858P892j05857M6092K6132J2719
15496h5475l1381r2279k1533M2567J39252L3554R8232j3394K7321q3815j788Q9223
15484A00484j21321j88997j27229J22115K29424P2297k1415l0871N11k7857r7867
$$ y = [9262, -79484, -90557, 34909, 12991, -907, 24204, -60277, -52618, -12596, -49550, -118680, -47954, 84408, 10627, -131550, -97993, -81433, -85352, 75079, 118695, 170001, 106563, 181778, 74122, 139220, 261759, 184725, 169404, 223563, 190686, 185283, 86365, 85285, -64507, -230260, -193461, -112425, -36509, -14980, -45673, 15291, -37119, -133188, -59298, -48513, 39111, 48568, 35389, 89985, 183444, 92753, 38237, -13145, -33206, 20409, 58162, -5919, 85026, 96036, 75140, 19833, -49374, -20595, -72453, -64561, -170418, -124326, -98194, -85475, -116856, -209135, -230668, -188101, -48849, -15295, 82937, 69543, 96864, 13049, 11261, 100484, -20837, -209834, -337063, -214948, 14476, 86773, 65358, 34487, 34998, 7141, -90726]
15473i0726L1115Q3591N8646j34541L5772N2516o1111Q2344m139l8504R4058r0126
15461A8895j36064J10764M2539o3159L8373L4160o5442l6122O6146P4069q9969
15450e810j7011o9722L0381J30297j03743j36129K6107J48853r6932j8269P6952
15439c5026J59618j1700m0781P473m667k037q855j3028r586j5636P9769p458p2534
15426B5552l7187q50J940M9089p2450r9039j19448J07306R6254J19380M630j8681
15414E6496m3766q2106r1304j9662O2913p6962O1500M562L3370J27487o1247n3845
15402h2564k4808N1373J4898N7249n0782J3480j18948r3379J3221L7130K6668
15391a56462K8014Q7366L6933r699p2248J9248J1233N1726j10958l5322k4977
$$ y = [-90726, -59611, 23980, 82626, -51915, -16143, 36373, -24738, 57606, 53467, 14963, 109021, 18895, -117169, -6405, 36134, -27025, 11348, 45508, -19934, -56056, 10090, 84159, -5810, -22821, -92543, -62162, 68135, -35608, -171737, -145630, 3223, -93709, -111978, -35026, 124592, 112892, 72111, 79584, 74917, 72880, 64025, 50997, 41411, 25775, 105544, 98086, 25552, -11635, -12485, -10545, 38544, -33906, -132945, -252393, -145087, -48833, 70547, 75177, 56496, 12730, -69376, -160680, -180342, -117429, -194391, -132891, -128329, -94959, 32528, -28719, -82564, -107372, -55999, -41101, 16148, -34634, -21154, -140102, -233481, -220260, -183130, -156462, -128448, -41082, -4149, -13848, -86096, -66848, -55615, -3889, -114847, -150169, -175146]
15380a75146J42976N3716q0648k60292j1622K15411J15457m7471n2262J0639J7121
15369g2121j2632R564J02935K645j5015J7842J42881m8701j64144m6281n4404
15358a37431r9530L4488K05409M8775p0593M0100L9100Q8361j08399o3845K3368
15347a97P6106L0704K0143l2542l2737j68590J5577O8002l5704K8229K0811o2220
15335g2418k0523M1239j9263J8783J02677O2427n5475K5894J1918m2224m0770
15324A2265M5064R2410p4739J4192N5705J0417j32828l3919Q9826j6751L6125
15313I7767k0568j19927j7185J56987Q3595K1704P085o3638j04662p9815N3521
15302A4864L631j8096n3047j53624m5067m3050m376J26590M4757L7364M9300J67113
$$ y = [-175146, -32170, 21546, -59102, -319394, -331016, -115605, -148, -47619, -99881, -89242, -72121, -84753, -75189, 27746, 30391, 15376, 33218, 176099, 127398, -36746, -83027, -137431, -236961, -202473, 2936, 51711, -18882, 21218, 60318, 148679, 40280, -23565, -197, 75909, 106613, 126756, 94214, 61477, -107113, -91536, -23534, -59238, -31009, -10198, -72418, -92941, -51702, -70965, -52182, 50495, 112922, 57447, 83341, 95259, 53035, 12265, 57329, 149739, 75000, 89192, 144897, 155314, 22486, -11433, 78393, 61642, 97767, 77199, -42728, -59913, 97074, 180669, 202373, 209458, 145820, 41158, -38657, 14864, 18495, 399, -52648, -206272, -251339, -294389, -298765, -172175, -127418, -90054, -40754, 126359]
15290A26359M5733r6371k4195N0738P7444l3921l4046k6046j31886k51158o4737
15279c62086J91776M8373J20825J29675m0646m5877l2336p3549N500K1360K01888
15268A64903m3231N8742M197m6739j2225r0543M2246J7573l2652j06125n0194
15257i4048k2315M0299P7376M0777j1556k6911o387o4291Q0441J5463N2162n3911
15245B7099o6237O2609M4229J09295K5824l9221l9666n1827o4350R535o4929m7537
15233i5176P4763P248j87378j13853k4619J06787J91138J78727p950j07564j1843
15222A0280N4868j60963M948K9866j4169J69383J10288n3107n6902l2236o9409
15211g153p6566R74J8280O4815m6021O453K7974n0282M9656K6028K5202m7783
$$ y = [126359, 172092, 75721, 51526, 102264, 179708, 145787, 111741, 85695, -46191, -297349, -362086, -170310, -121937, -1112, 128563, 87917, 42040, 9704, -63845, -58345, -36985, 164903, 121672, 180414, 184611, 137872, 125647, 35104, 77350, 94923, 62271, -43854, -94048, -116363, -76064, 1312, 42089, 30533, 3622, -2765, -67056, 13385, 28848, 81010, 27099, -39138, 23471, 67700, 176995, 202819, 163598, 123932, 72105, 7755, 17290, -47639, -95176, -20413, -13165, -200543, -314396, -339015, -232228, -41090, 137637, 129687, 22123, 10280, 65148, -95815, -90867, -61001, -75170, 94213, 204501, 151394, 94492, 62256, -7153, -83719, -82745, -64465, 350, -45671, -39218, -11244, -61526, -11870, 14158, 39360, -8423]
15199h423m0096j255P231m3315k1667j1534L1599Q9288m9027l4409O3066J25708
15187A07166n2276L0537k029j04123p9047l6969l8854Q9652M0413o9507o1969
15176a77006m9549J80712O428j63647j74863R0149K28622O9707k14m8532L4556
15165c637p3183M6159L8417m6378P0591P5346n5909n6893M9220q9399o2423K8720
15153g9369Q7780J35559K7601k4037q970k8421J4374O1057o2847o3815N4445q6579
15141B6778j9837j0990l1879Q4474n6637o3837j9292j7373k8287J1650L6750P9421
15129i059j1275Q0663N4150j19462q6850Q0128J14926K138m5497j30462R1336
15118B0736o5619j3857q0017m1677N2927M2464Q5642K9257P610j12981r5511n5442
$$ y = [-8423, -48519, -49774, -42543, -85858, -107525, -119059, -87460, 1828, -47199, -81608, -18542, 107166, 54890, 85427, 83398, -20725, -99772, -136741, -175595, -85943, -45530, -115037, -177006, -226555, -45843, -39415, -203062, -377925, -287776, -59154, 10553, 10339, -38193, -3637, -76820, -30661, 7756, -38622, 31969, 107315, 51406, -5487, 43733, -45666, -108089, -79369, 8411, 143970, 171571, 147534, 138564, 110143, 124517, 185574, 122727, 58912, 113357, 26778, 6941, -4049, -35928, 48546, -8091, -71928, -91220, -108593, -136880, -125230, -88480, -9059, -20334, 60329, 114479, -4983, -91833, -11705, 103221, 105359, 59862, -70600, 20736, -44883, -58740, -138757, -180434, -127507, -85043, 599, 29856, 37466, -75515, -171026, -226468]
15106b26468O0092j38007j6961J31377J31504r7001j59508j79661j452J91534
15096c04551J21960l3590J03728R514K4243q3870J03818K29773M7252k21986O4374
15085F0665O6802p2772j04616M0774j1020J85830K114p2307q9878q0987J9478
15074e5917k6023K1382O6158K5340R3969j947q1462j37860l8146N1896l4905M3874
15062g3641L1547k7591P4818O9q7357R758J05922j8525J19170P2081J4798P0484
15050B91533N5935j17548j14090O9532l542O15j22012r4129q4849J20734N7869
15039F0048M6913m4194L4870n7701k0231j34585J42485J7335j08466J68881L0550
15028A35905l0119O3231j3831j8488n9588j1657j12771p5536j01347M0479O0055
$$ y = [-226468, -166376, -304383, -321344, -189967, -58463, -155464, -314972, -494633, -496085, -304551, -182591, -216181, -112453, -102939, -78696, -162566, -58748, 171025, 218277, -3709, 60665, 127467, 54695, -49921, -9147, -20167, 165663, 167777, 95470, 5592, -75395, -55917, -81940, -60558, 5600, 30940, 124909, 122962, 41500, -96360, -134506, -82610, -117515, -73641, -42094, -69685, 5133, 5202, -82155, -72397, 33525, 15000, 134170, 206251, 221049, 291533, 347468, 229920, 115830, 185362, 181820, 182435, 60423, -33706, -118555, 2179, 60048, 106961, 62767, 97637, 39936, 19705, -114880, 27605, 44940, -63526, 105355, 135905, 105786, 169017, 155186, 136698, 77110, 65453, -47318, -122854, -224201, -183722, -123667]
15017a23667k5663q2947l1685K1383P5286L9357O489q3447q7257M5213J19912
15006a27026P6580j0438Q7587J16418k3806q1644j323Q021K11023Q5688p7725
14995B63355N3411O7937N9676j54419j15597K9867k01021j55117q2586m87J35483
14984i9498J34236N2272N636R4768Q0552o203j16461j46123p7049l6849k7375
14973a42094J00125J33192l696M3113M5187J1047J6099o3889p9905k3757l6116
14962f94J68985p9635j12184j42103n2030k91j047j35629q0588J46685J53862
14951a34669N1997L8838K007o4857o1128q123k8R6062J6348L652l602N7534P894
14938A925r6843m0345K7895j6815l3204N1085J33993p9260q0653J31202J59574
$$ y = [-123667, -149330, -232277, -263962, -242579, -167293, -127936, -121447, -204894, -292151, -246938, -127026, -50446, -60884, 26703, 143121, 119315, 37671, 36348, 44369, 255392, 341080, 263355, 316766, 384703, 444379, 289960, 174363, 204230, 3209, -151908, -234494, -234981, -99498, 34738, 87010, 92646, 187414, 267966, 261763, 145302, -821, -77870, -114719, -142094, -41969, 91223, 87527, 130640, 175827, 186874, 202973, 139084, 59179, 35422, -694, 168291, 88656, -23528, -165631, -217661, -217952, -218999, -354628, -435216, -288531, -134669, -82672, -43834, -41827, -106684, -167812, -175935, -175963, -79901, -63553, -59901, -63503, -5969, 1925, -94918, -135263, -107368, -124183, -157387, -106302, 27691, -51569, -132222, -1020, 158554]
14927A58554l0606K0583j06274o3645J26791J30251k65189n7911J18551M0697
14917G1802l3094q0001K2527P4198j6056J37019J5408p9860p4381j12615j3133
14906h8186q7599P3504J00397M4717j3923l6280l8077M0737l834l6486Q7974K8726
14894G1670q3324o7162L8199N1192J10039m8394n456l8401n4748l2316K3313k8027
14882f3415J36513L0160k2965J84017j4955m6587J37018k6572j63567k57497O6915
14871d0935J23027O1437K9184o7089l4915K4877M3910j07568l4262O7093J90466
14860B55225p5145j04874o439k4739L891j16902j2313j8361P7366K21605P6299
14849B75613O2334p4488n2219j00877R3865J26513k101m7281j2752r8989N2688
$$ y = [158554, 127948, 148531, 42257, -21388, 105403, 235654, -29535, -87446, 31105, 71802, 38708, -41293, -18766, 55432, 39376, 176395, 191803, 111943, 37562, -75053, -88186, -175785, -102281, -1884, 42833, 28910, -7370, -45447, -4710, -8544, -45030, 42944, 71670, -11654, -78816, -40617, 10575, 120614, 72220, 66764, 28363, -26385, -58701, -35388, -63415, 73098, 103258, 80293, 264310, 249355, 202768, 339786, 313214, 149647, -107850, -40935, 82092, 143529, 172713, 105624, 70709, 95586, 139496, 31928, -2334, 64759, 255225, 180080, 75206, 68767, 44028, 47919, -68983, -81296, -99657, -22291, 199314, 275613, 337947, 263459, 211240, 110363, 204228, 330741, 328640, 281359, 268607, 169618, 222306]
14838B22306J9031J8664J532j31967j10244O7758j10753P5217R2079l5060o6491
14827D2072j18007M0414j0701M0493k0073R7606J24902J3302j46542P5518K3724
14816A62708J02295K7975K130q7503j94954n3216J23236p2140M412K2813J543
14805C9299r7582M7470J4705l1736M8313Q5731j60124j14764j0884Q0345J22505
14794B3278l5216J3848J9363n3039M9536J73717R6448l0434J75029j1963J47219
14783E67786K72101O9970J05159R1933l6700J23525J13595j06689r2055j21770
14773I86855o3192p6205p9790j62949j94994j25992m1964l7171K3000J65807O2144
14762D55549j52371j13216l2612l9547j83749j55639M622R9625p1994J10110J11411
$$ y = [222306, 241337, 260001, 261533, 129566, 19322, 87080, -23673, 51544, 143623, 108563, 42072, -75935, -35521, -46222, -5729, -25802, 71804, 196706, 210008, 63466, 138984, 162708, 265003, 292978, 295108, 207605, 12651, -40565, 82671, 10531, 14943, 37756, 39299, -58283, -10813, 3892, -27844, 20469, 106200, -53924, -168688, -179572, -99227, 23278, -11938, 1910, 21273, -31766, 17770, 191487, 287935, 257501, 432530, 420567, 567786, 839887, 909857, 1015016, 1106949, 1070249, 1193774, 1307369, 1200680, 1108625, 986855, 923663, 847458, 767668, 604719, 409725, 283733, 241769, 204598, 227598, 393405, 455549, 303178, 189962, 157350, 117803, -65946, -221585, -216963, -117338, -189332, -79222, 32189]
14751C2189J13298R9804j39248j02505J4172N5541j05871q6447N9997L7146j1993
14740c3917K5124J02445O9017j0731N708l8077o5063M1902j2849n7645j54068
14729a28154O6082P7719k8172o5361K5263l4758j38017J7066J75891N6197j412
14718B2344j4624m7760j49809J20925J6577l6303J6440k7189j1328O8942M7372
14707E587p0646j64262n1846J27034R1675Q4609J6166j16238P0747J3790l2925
14696b6309j07470P0086N5561k518j32232j9602J71437l4620M8066K31607Q7347
14685C41353p7705M865j29640j23766O7158N3624k00573o8560K6112J33155Q5508
14674A11531M1719j38669j14654L3486J44925R8327j2121m4335j30122l1675J3482
$$ y = [32189, 145487, 245291, 106043, 3538, 17710, 73251, -32620, -119067, -59070, -21924, -33917, -8793, 93652, 162669, 151938, 157646, 119569, 54506, 96408, 83559, 25914, -128154, -62072, 15647, -12525, -77886, -52623, -87381, -225398, -208332, -32441, 23756, 22344, 7720, -40040, -189849, -68924, -52347, -88650, -72210, -99399, -110727, -41785, 5587, -65059, -229321, -281167, -154133, -62458, 22151, 38317, -77921, -7174, 6616, -26309, -133779, -63693, -8132, -10650, -142882, -162484, 8953, -25667, 22399, 254006, 341353, 263648, 268513, 138873, 15107, 82265, 135889, -64684, -133244, -107132, 26023, 111531, 153250, 14581, -100073, -66587, 78338, 176665, 164544, 120209, -9913, -41588, -28106]
14663b8106M5904J22219R651j38220p959L2957o7688l2989J00924R1928q5544
14652D3077j7741N6597K35J09227K2728N0129J3986j39738j75361K1610K1018
14641E767j28626j17663P7059R4477J28897Q1520q5679L7938Q9855P1974o4202
14630A91317o8655n0805l0145o1320J18149P1292j1952j47265l4036m4969K2537
14619d5852r4300P4919M7712p796J10214J60027k0371m0387p3106M2643k8724
14608A24979K1769K9727M0085l438L6265m5065l7383k912j5467n0610J07616O8327
14596B73893J54326J56619O3404N9534J26830J05352J50715K72671J12354K08657
14586A684355r756Q9533P4388L6024j45303k58210j08053k35818j65966j7899
$$ y = [-28106, 17798, 140017, 149668, 11448, 3489, 36446, -31242, -64231, 36693, 128621, 43077, 25336, 81933, 82168, 191395, 214123, 264252, 278238, 138500, -36861, -15251, 5767, -122859, -240522, -163463, -68986, 59911, 141431, 55752, 93690, 183545, 255519, 191317, 122662, 71857, 41712, -19608, 98541, 169833, 157881, 10616, -23420, -68389, -45852, -140152, -65233, -17521, -25317, 84897, 244924, 224553, 184166, 111060, 153703, 124979, 146748, 176475, 216560, 213122, 249387, 204322, 166939, 164027, 148560, 97950, 205566, 273893, 428219, 584838, 648242, 707776, 834606, 939958, 1090673, 1363344, 1475698, 1684355, 1674599, 1764132, 1838520, 1874544, 1729241, 1471031, 1362978, 1127160, 961194, 943295]
14576I43295n7438j71489n4930k7187j27519j79880q0255N5580J61198P8700k9885
14565E10190j99819j40913j10188J13058J99335O721j04376R993J74972J59510
14555F18483J7919O1942J61958J47921J39924J75414J98839L741k2942K1522j8610
14544A506111j04627j29600l3638p1778k29598k70191j80307j27818J8788j07369
14534B69973l392q4990j71890p0020J55476J55815k6991j57258m5971l84m0474
14523b0106l1361l589q241P7253M38K8381p4441N5957J20054L8189M0595k0004
14511B03125j64455J12124K3573j54414n0454J18655M6429J8987o810J5796l5332
14500A27224k2782q6046M2727J21498r5021q5756J5899M6772k00l4171L3196l4355
$$ y = [943295, 885857, 714368, 659438, 632251, 504732, 324852, 244597, 300177, 461375, 540075, 510190, 310371, 169458, 59270, 172328, 371663, 378384, 274008, 284001, 458973, 618483, 636402, 698344, 860302, 1008223, 1148147, 1323561, 1522400, 1526141, 1503199, 1524721, 1506111, 1401484, 1271884, 1238246, 1166468, 936870, 666679, 486372, 358554, 377342, 269973, 266581, 181591, 9701, -60319, 95157, 250972, 223981, 66723, 20752, 20368, -20106, -51467, -55056, -63297, 13956, 14394, 42775, -31666, 24291, 144345, 182534, 223129, 203125, 38670, 150794, 174367, 19953, -30501, 88154, 134583, 153570, 146760, 162556, 127224, 104442, 18396, 61123, 182621, 87600, 1844, 17743, 64515, 64315, 30144, 63340, 28985]
14488B8985K2771N1634J52989m3660R9760N28l5941j06357N6564M2169j39594
14477A29848m7816k8550N2484R2151J5242j51809R981o0350l4108J05834K322
14466H5229r5265j03103p8397n2888M2825J76262J54515J8251k8952R7174L4423
14455B50074R914j02461K3809M6899j24533j83179P3771J50746M4047n4246R534
14444A44375m6388n3145o2573M9935J1579J05630J03111r477m5100R8418o1106
14433B35259j33015l5846L8212K3922j15168m6064N3491l9066P084L1102J6877
14422C6788R9369m1632k2003O6680O2249r8554q533J3031j50349M7017J38565
14411A42628P9317p9181M1366Q1402Q31n7113L5174L7312M4961j60134k20315
$$ y = [28985, 51756, 103390, 256379, 212719, 312479, 313007, 277066, 170709, 227273, 269442, 129848, 82032, 53482, 105966, 198117, 213359, 61550, 71531, 11181, -22927, 82907, 85229, -10036, -113139, -191536, -244424, -201599, -25337, 129178, 147429, 118477, 215651, 250074, 259988, 157527, 181336, 228235, 103702, -79477, -5706, 145040, 189087, 134841, 144375, 97987, 44842, -17731, 32204, 43783, 149413, 252524, 243047, 197947, 296365, 235259, 102244, 66398, 104610, 128532, 13364, -32700, 20791, -18275, -11191, 19911, 36788, 136157, 94525, 72522, 139202, 201451, 102897, 94364, 107395, -42954, 4063, 142628, 221945, 142764, 184130, 265532, 266363, 209250, 244424, 281736, 326697, 166563, -53752]
14400e3752k5480J27145J08205J23087m0135o2011p159l7684l6344m3463J0263
14389F2672n2038K8722J09580m4031J08528J30131j4807m9063K8024L7043j5484
14378C29277j29848j88435l9066J84722O0393j25696j1112k9504P7991Q9919n4711
14367A63930n3741N8881P5023m6501n2717J27648J14728J8850L3228k0355P0535
14356D89509P6088r7034n7267j15373o4236J902J8357J500m0246j44350o6932
14345A918J40908K26882K7203M9061p1331j32468o4686L7155O9096R7833P7473
14334D59044Q9286O3792O1474k0915Q0462K2985k405J46614k81300j66339L7192
14323D89890j13712p9687l5543L772K6035P6074p2232o0127k5402J0850p0485
$$ y = [-53752, -79232, 47913, 156118, 279205, 239070, 177059, 169900, 132216, 95872, 52409, 62672, 10634, 39356, 148936, 104905, 213433, 343564, 328757, 279694, 307718, 344761, 329277, 199429, 10994, -28072, 156650, 217043, 91347, 80235, 50731, 128722, 218641, 163930, 110189, 169070, 244093, 197592, 144875, 272523, 387251, 406101, 439329, 418974, 489509, 565597, 468563, 411296, 295923, 231687, 233589, 251946, 253446, 213200, 68850, 1918, 142826, 369708, 396911, 445972, 374641, 242173, 177487, 214642, 283738, 381571, 459044, 548330, 612122, 673596, 652681, 733143, 756128, 753723, 900337, 619037, 452698, 489890, 376178, 296491, 260948, 264720, 290755, 366829, 294597, 234470, 209068, 219918, 149433]
14312A49433N0999P1805L4942K5213k5641m3047n8896L8011n0473q0396J21183
14301B33133J00242j8325J46043J45785o3585p5013n3325l428N2135k9282J20252
14290E54632J01535j40350k26659j37531r4051j1107J51858J50874j5702j21408
14280B12091j5125o9508r006r1502q4018p9518r1997p933J49160R1449P8282J42552
14268B24927r7916q639J62472J62552K21156J37816N4836J863p4039J8241p7170
14257G26099N4796j186o8477P4921m7259j61706L3368l6384m0965r0520J7902
14246D60589j3856J86410m4677q5173n7308R5430R4655L8772l8974J39158O8691
14235H43717k6160j85602o5057L961K2899N5348K68889J94637P7675J20675K15453
$$ y = [149433, 200432, 272237, 307179, 332392, 306751, 263704, 204808, 242819, 192346, 111950, 233133, 333375, 315050, 461093, 606878, 543293, 468280, 414955, 411527, 463662, 434380, 554632, 656167, 515817, 289158, 151627, 57576, 46469, 198327, 349201, 333499, 212091, 196966, 127458, 118452, 26950, -57068, -136586, -228583, -236516, -87356, 4093, 82375, 224927, 127011, 118372, 280844, 443396, 664552, 802368, 857204, 859067, 785028, 803269, 726099, 780895, 779709, 711232, 786153, 738894, 577188, 610556, 574172, 533207, 442687, 460589, 446733, 633143, 588466, 503293, 445985, 541415, 636070, 674842, 635868, 775026, 843717, 817557, 631955, 566898, 570859, 593758, 649106, 917995, 1112632, 1190307, 1310982, 1526435]
14224A526435N5331L86j878mJ49854L9190j65170r2939q478k2467K81103o5601
14212A695762p6916j60125m3856J46432K7706j9712K462N4806r5611J7425k00528
14201A347845j1473J34223n5544R3788K36237J79005J84829K2042M6851P4507
14191B252310M1909j20448l018J33253P0139L09788K53401J38157J50891J63169
14181C389551P4428R5659J34984J36608J14010J97150J77575R4248L75420J87903
14171D977536K41979L91347L67679M72406K74905M44284O65421N87186P14979
14162I137722R73841J064934J328979J652536J741017K136183K478143K852254
14154B3365609L279375L770972M529866N210069O392243P867946R902546J3413606
$$ y = [1526435, 1581766, 1582152, 1580274, 1580270, 1730124, 1769314, 1604144, 1511205, 1502727, 1480260, 1761363, 1695762, 1618846, 1458721, 1414865, 1561297, 1589003, 1569291, 1571753, 1626559, 1530948, 1548373, 1347845, 1336372, 1470595, 1415051, 1508839, 1745076, 1924081, 2108910, 2130952, 2177803, 2252310, 2294219, 2173771, 2170753, 2304006, 2374145, 2683933, 2937334, 3075491, 3226382, 3389551, 3463979, 3559638, 3694622, 3831230, 3945240, 4142390, 4319965, 4414213, 4789633, 4977536, 5219515, 5610862, 5978541, 6450947, 6725852, 7170136, 7835557, 8422743, 9137722, 10111563, 11176497, 12505476, 14158012, 15899029, 18035212, 20513355, 23365609, 26644984, 30415956, 34945822, 40155891, 46548134, 54416080, 64318626, 77732232]
14146G7732232J7881421K2873438K7508359L1255069L3812165L4287783L2509181
14139B77859648K7794986J9938939R917268q69980j1126196j9507803k6014134
14132B77992728l0196470l1677176l0712090k7848977k3534416j8950604j5053833
14125A00019162j1440622q474415o337647m631376l582890k414140j344196m67532
14117F1326344L85003J205858K150673L029469M128912N398783P174165R235097
14109I4034304J2485121J6770959K1620825K6337723L0124059L1868688L1932489
14102B65174168L0003966K5081000J7090093O676626m495894j4602931k3307669
14095C01619359k9768805l3718661l4926081l3757234l0353314k5699280k0885120
$$ y = [77732232, 95613653, 118487091, 145995450, 177250519, 211062684, 245350467, 277859648, 305654634, 325593573, 335510841, 334640861, 323514665, 304006862, 277992728, 247796258, 216119082, 185406992, 157558015, 134023599, 115072995, 100019162, 88578540, 80104125, 73766478, 69135102, 65552212, 63138072, 61793876, 61326344, 61711347, 62917205, 65067878, 68097347, 72226259, 77625042, 84799207, 94034304, 106519425, 123290384, 144911209, 171248932, 201372991, 233241679, 265174168, 295178134, 320259134, 337349227, 344025853, 339529959, 324927028, 301619359, 271850554, 238131893, 203205812, 169448578, 139095264, 113395984, 92510864]
14088I2510864j6556391j2781899r721574p508331n889667m881863m055657l494353
14080B7621129l002132k623712k268838j989052j730744j391716j158077j049253
14072A2407605r29348q49904r36940o00454n67062m33462m01135m58727m50513
14063F780060m20006l98622m93720n22637k60013l00846j60335k97046j87610
14054C739225k52457k35239k61619j45653q3632j96711l5933j01218n6360l4981
14044B335422j09074j08770N1199Q6348j11985j71478j17606r045q0778r0151
14034A674082k04905j21375j22495J4725Q723p0488j51316j20202J7009M68j21416
14023H02810Q1462R3974k37179l02904L9019J30061j58676k65532m7213q4221
$$ y = [92510864, 75954473, 63172574, 53451000, 45942669, 40053002, 35171139, 31115482, 27621129, 24618997, 21995285, 19726447, 17737395, 16006651, 14614935, 13456858, 12407605, 11478257, 10628353, 9691413, 9090959, 8523897, 8090435, 7689300, 7230573, 6780060, 6360054, 5961432, 5467712, 4945075, 4685062, 4384216, 4223881, 3926835, 3739225, 3486768, 3251529, 2989910, 2844257, 2760625, 2563914, 2527981, 2426763, 2370403, 2335422, 2226348, 2117578, 2168777, 2255125, 2143140, 1971662, 1854056, 1845011, 1764233, 1674082, 1469177, 1347802, 1225307, 1240032, 1248755, 1178267, 1026951, 906749, 923758, 924226, 802810, 884272, 978246, 741067, 438163, 477182, 607243, 448567, 183035, 135822, 51601]
14013E1601m2077n2133K00347P6187P3658J3118m5342R8796l442J28302J8755
14002E17770O6729J93001K2642M7864r4608n5992j1870K6319J38722j41982j15857
13991E92738n0342n9556K124l5131P8627N9675N6148J05699o8386j75223r3741
13980D12632L5484n7284j93652j18481Q667k9760N1211J66759M5261j5240O3207
13969C68804R5386J55672N9539m1455Q7396k5411J0931J4730j04389m7279M8441
13958F22365j12397j0978R7795n3840j17467j25317j06883o1827j42423k5120
13948c6092J5013p2043j2882J9630p1611J30191j50197J51830J73507l9697n8078
13937D9571R3341O4932R9553K06723j07448j19412K7877P9394m4796n3089Q274
$$ y = [51601, 9524, -42609, 157738, 233925, 307583, 320701, 275359, 374155, 370713, 499015, 517770, 584499, 777500, 800142, 848006, 753398, 697406, 685536, 711855, 850577, 708595, 592738, 542396, 482840, 484964, 449833, 528460, 588135, 644283, 749982, 681596, 506373, 412632, 448116, 390832, 197180, 78699, 87366, 57606, 108817, 275576, 320837, 305597, 368804, 464190, 619862, 679401, 637946, 725342, 699931, 710862, 725592, 621203, 573924, 622365, 509968, 498990, 596785, 542945, 425478, 300161, 193278, 131451, -10972, -36092, -21079, -93122, -106004, -86374, -157985, -27794, -177991, -26161, 147346, 107649, 49571, 142912, 207844, 307397, 514120, 406672, 287260, 315137, 394531, 349735, 296646, 304920]
13926C04920o1798k5944j38906r1057q2483n6155J14696J60504r2524j32160P2140
13915b8767R5788O2840L4508j29428k26897n5343N1386j16501j28797r5611J09072
13904d27750J23887N2158m4521K49162N2106m4972J02923K3380j03340J08526
13894I1559Q467l0488p9327j05755R2457L0219Q7020J21496K1052p2644k3744
13883A40312L3366J01756N7910j3697j1458j52753R380j0170p2034j91779K5773
13872h3394J08111j1094L6044M5804L0187J1855n4947O395k8437P4279O7520k06852
13860d529J6082J91576L1458l4804P3404k4291o5560N5734o4348N6811J21168
13849C52701P7340k2765j00908J3038K9782k8383L4241m3709J0380o9504r6241
$$ y = [304920, 243122, 217178, 78272, -12785, -95268, -151423, -36727, 123777, 31253, -100907, -28767, 67021, 129861, 164369, 34941, -191956, -247299, -195913, -312414, -441211, -536822, -427750, -303863, -251705, -296226, -47064, 5042, -39930, 62993, 86373, -16967, 91559, 100026, 69538, -9789, -115544, -23087, 7132, 94152, 215648, 236700, 164056, 140312, 173678, 275434, 333344, 319647, 308189, 155436, 164816, 154646, 82612, -109167, -83394, 24717, 13623, 49667, 95471, 125658, 137513, 82566, 88961, 60524, 134803, 202323, -4529, 11553, 203129, 234587, 199783, 273187, 248896, 183336, 239070, 174722, 231533, 352701, 430041, 407276, 306368, 319406, 349188, 320805, 355046, 311337, 321717, 252213, 155972]
13838A55972p6577p3052n5832O5098K4400O8709M3732n4892k06046o4733P8300
13827i4921L8528p806R0756k5238l9528p7893J42892J26911L6780N4800L6671
13816B81952J27332o3874j51882j26907M9191Q939R9284j9942q5083l4708o6193
13805A8109M3739P5645n5268J6409J1825l4138P028l6354R7640J23890l9586n2140
13793A76799q5250l9343j08075q2572R970M8368J318J10155k9965j3633o5980
13782g8208M6854l193P3700o248k6428l8540Q3319O8871K041q6664q3915r728
13770e8139P01l2059j41142R3836J8648J02952N5376J39046M6207l6543N4717
13759B43600M0005k09131n049M9879R6652m7735m2665j72004j46237r8774J9699
$$ y = [155972, 79395, 6343, -49489, 15609, 40009, 108718, 152450, 97558, -108488, -173221, -94921, -56393, -64199, 26557, 1319, -38209, -116102, 26790, 153701, 190481, 245281, 281952, 409284, 345410, 193528, 66621, 115812, 124751, 224035, 204093, 119010, 84302, 18109, 61848, 137493, 82225, 98634, 110459, 76321, 83349, 46995, 144635, 268525, 228939, 176799, 91549, 52206, -55869, -138441, -128471, -80103, -78785, 31370, 1405, -12228, -78208, -31354, -34547, 39153, 32905, 6477, -32063, 51256, 120127, 122168, 35504, -48411, -58139, -57438, -89497, -230639, -136803, -118155, -15203, 40173, 179219, 225426, 188883, 243600, 283605, 74474, 69425, 119304, 215956, 168221, 125556, -46448, -192685, -291459, -271760]
13748b71760J5053L5936J10004P5396P9099J8081J66287j4934j07720m8159R1529
13737A48812k2725L1841j02852n1887o1214j8971R2472r8445Q2217J5815P6287
13726I1350m061o1455Q1169K2614n1116m6626R4417L1966O8011n7544j22l989
13714A64614l2859O0982O9887M363j26166R8486j08148j76171m7064J7909k6979
13703a01146n4597N4975J41692O3623N8547M5938K0708K4000R7947Q5404j0190
13692D26901J29714K19124J52134M0953J35689r595J09053K41425L71283J86788
13682B003469M4394o8289k80881l66086j16609n5395k30506k51933l9354L646
$$ y = [-271760, -256707, -220771, -110767, -35371, 43728, 61809, 228096, 213162, 105442, 57283, 148812, 126087, 157928, 55076, 3189, -58025, -76996, 15476, -82969, -752, 15063, 91350, 87289, 25834, 107003, 129617, 78501, 31875, 126292, 158258, 226269, 168725, 168603, 164614, 131755, 192737, 262624, 266987, 140821, 239307, 131159, -45012, -92076, -74167, -101146, -155743, -100768, 40924, 104547, 163094, 209032, 229740, 253740, 351687, 437091, 426901, 556615, 775739, 927873, 968826, 1104515, 1094920, 1203973, 1445398, 1816681, 2003469, 2047863, 1979574, 1698693, 1332607, 1215998, 1160603, 930097, 678164, 638810, 642456]
$$ [...]
##END NTUPLES=NMR SPECTRUM
##END=
