##TITLE=Analysis number 315908
Compound Code cc 41546
Book Reference 456/88/3
Project Code adrs
Chemist Name anns
##JCAMPDX= 6.0         $$ Bruker NMR JCAMP-DX V2.0
##DATA TYPE= NMR SPECTRUM
##DATA CLASS= NTUPLES
##ORIGIN= Bruker BioSpin GmbH
##OWNER= NMR
$$ XWIN-NMR		Version 3.5
$$ Thu Dec  8 08:41:03 2005 GMT Standard Time (UT+0h)  MAYBRIDGE\NMR@NMR_250MHZ
##.OBSERVE FREQUENCY= 250.131544655141
##.OBSERVE NUCLEUS= ^1H
##.ACQUISITION MODE= SIMULTANEOUS (DQD)
##.ACQUISITION SCHEME= undefined
##.AVERAGES= 16
##.DIGITISER RES= 18
##SPECTROMETER/DATA SYSTEM= dpx250
##.PULSE SEQUENCE= zg30
##.SOLVENT NAME= CDCl3
##.SHIFT REFERENCE= (INTERNAL, CDCl3, 0, 16.522)
##AUDIT TRAIL= $$ (NUMBER, WHEN, WHO, WHERE, WHAT)
$$ ##TITLE= Audit trail, XWIN-NMR		Version 3.5
$$ ##JCAMPDX= 5.01
$$ ##ORIGIN= Bruker BioSpin GmbH
$$ ##OWNER= NMR
$$ C:\u/data/dgb/nmr/ADRS/13570/pdata/1/auditp.txt
$$ ##AUDIT TRAIL=  $$ (NUMBER, WHEN, WHO, WHERE, WHAT)
(   1,<2005-12-08 08:40:34.08 +000>,<MAYBRIDGE\NMR>,<NMR_250MHZ>,
      <created by zg, POWCHK disabled, PULCHK disabled
       configuration hash MD5:
       62 19 C7 07 E1 42 D1 B7 37 6C 3D D0 77 39 F9 E6
       data hash MD5: 64K
       10 83 58 84 57 F5 C8 86 35 4A 3B 5A 63 49 04 34>)
(   2,<2005-12-08 08:40:50.22 +000>,<MAYBRIDGE\NMR>,<NMR_250MHZ>,
      <Start of raw data processing
       ef LB = 0.3 FT_mod = 6 PKNL = 1 SI = 32K 
       data hash MD5: 32K
       B0 61 B1 09 3D AC 58 97 56 B2 21 80 1D 7E 55 7E>)
(   3,<2005-12-08 08:40:52.27 +000>,<MAYBRIDGE\NMR>,<NMR_250MHZ>,
      <apk 
       data hash MD5: 32K
       3A FF 62 A3 77 D0 03 5C 91 A9 B0 59 B4 F0 3F BF>)
(   4,<2005-12-08 08:40:53.06 +000>,<MAYBRIDGE\NMR>,<NMR_250MHZ>,
      <abs ABSG = 5 
       data hash MD5: 32K
       D1 44 2C CF 99 F8 A1 20 16 B6 03 41 7E A8 A4 CC>)
$$ ##END=
$$ 
$$ hash MD5
$$ 4F 12 63 A0 51 C4 39 C6 30 63 DD CF E8 EA 9D 07
##$RELAX= 
##$RELAX= 
##$RELAX= 
##$RELAX= 
##$RELAX= 
##$RELAX= 
##$RELAX= 
$$ Bruker specific parameters
$$ --------------------------
##$DU= <C:\u>
##$EXPNO= 13570
##$NAME= <ADRS>
##$PROCNO= 1
##$TYPE= <nmr>
##$USER= <dgb>
##$AMP= (0..31)
100 100 100 100 100 100 100 100 100 100 100 100 100 100 100 100 100 100 
100 100 100 100 100 100 100 100 100 100 100 100 100 100 
##$AQSEQ= 0
##$AQ_mod= 3
##$AUNM= <au_zg>
##$AUTOPOS= <1 >
##$BF1= 250.13
##$BF2= 250.13
##$BF3= 250.13
##$BF4= 250.13
##$BF5= 500.13
##$BF6= 500.13
##$BF7= 500.13
##$BF8= 500.13
##$BYTORDA= 1
##$CFDGTYP= 0
##$CFRGTYP= 5
##$CHEMSTR= <none>
##$CNST= (0..31)
1 1 145 1 1 1 1 1 1 1 1 1 1 1 1 1 1 1 1 1 1 1 1 1 1 1 1 1 1 1 1 1 
##$CPDPRG= <>
##$CPDPRG1= <>
##$CPDPRG2= <>
##$CPDPRG3= <>
##$CPDPRG4= <mlev>
##$CPDPRG5= <mlev>
##$CPDPRG6= <mlev>
##$CPDPRG7= <mlev>
##$CPDPRG8= <mlev>
##$CPDPRGB= <>
##$CPDPRGT= <>
##$D= (0..31)
0 1 0 0 0 0 0 0 0 0.06 0 0 0 0 0 0 0.0002 0 0 0 0 0 0 0 0 0 0 0 0 0 0 
0 
##$DATE= 1134031233
##$DBL= (0..7)
120 120 120 120 120 120 120 120 
##$DBP= (0..7)
150 150 150 150 150 150 150 150 
##$DBP07= 0
##$DBPNAM0= <>
##$DBPNAM1= <>
$$ [...]
##$SUBNAM7= <"">
##$SUBNAM8= <"">
##$SUBNAM9= <"">
##$SW= 20.6930455092707
##$SWIBOX= (0..15)
0 0 3 0 0 0 0 0 0 0 0 0 0 0 0 0 
##$SW_h= 5175.983436853
##$TD= 65536
##$TD0= 1
##$TE= 294.16
##$TE2= 300
##$TE3= 300
##$TEG= 300
##$TL= (0..7)
0 120 120 120 120 120 120 120 
##$TP= (0..7)
150 150 150 150 150 150 150 150 
##$TP07= 0
##$TPNAME0= <>
##$TPNAME1= <>
##$TPNAME2= <>
##$TPNAME3= <>
##$TPNAME4= <>
##$TPNAME5= <>
##$TPNAME6= <>
##$TPNAME7= <>
##$TPOAL= (0..7)
0.5 0.5 0.5 0.5 0.5 0.5 0.5 0.5 
##$TPOFFS= (0..7)
0 0 0 0 0 0 0 0 
##$TUNHIN= 0
##$TUNHOUT= 0
##$TUNXOUT= 0
##$USERA1= <user>
##$USERA2= <user>
##$USERA3= <user>
##$USERA4= <user>
##$USERA5= <user>
##$V9= 5
##$VALIST= <valist>
##$VCLIST= <CCCCCCCCCCCCCCC>
##$VD= 0
##$VDLIST= <DDDDDDDDDDDDDDD>
##$VPLIST= <PPPPPPPPPPPPPPP>
##$VTLIST= <TTTTTTTTTTTTTTT>
##$WBST= 1024
##$WBSW= 4
##$XGAIN= (0..3)
0 0 0 0 
##$XL= 0
##$YL= 0
##$YMAX_a= 578112
##$YMIN_a= -399562
##$ZGOPTNS= <>
##$ZL1= 120
##$ZL2= 120
##$ZL3= 120
##$ZL4= 120
##$ABSF1= 16.522
##$ABSF2= -4.171173
##$ABSG= 5
##$ABSL= 3
##$ALPHA= 0
##$AQORDER= 0
##$ASSFAC= 0
##$ASSFACI= 0
##$ASSFACX= 0
##$ASSWID= 0
##$AUNMP= <proc_1d>
##$AZFE= 0.1
##$AZFW= 0.1
##$BCFW= 0
##$BC_mod= 0
##$BYTORDP= 0
##$COROFFS= 0
##$CY= 12.5
##$DATMOD= 1
##$DC= 0
##$DFILT= <>
##$DTYPP= 0
##$F1P= 14.0000005364418
##$F2P= -0.99999901652339
##$FCOR= 0.5
##$FTSIZE= 32768
##$FT_mod= 6
##$GAMMA= 0
##$GB= 0
##$INTBC= 1
##$INTSCL= 1
##$ISEN= 128
##$LB= 0.3
##$LEV0= 0
##$LPBIN= 0
##$MAXI= 10000
##$MC2= 0
##$MEAN= 0
##$ME_mod= 0
##$MI= 0
##$NCOEF= 0
##$NC_proc= -3
##$NLEV= 6
##$NOISF1= 0
##$NOISF2= 0
##$NSP= 0
##$NTH_PI= 0
##$NZP= 0
##$OFFSET= 16.522
##$PC= 1
##$PHC0= 81.33508
##$PHC1= 5.488072
##$PH_mod= 1
##$PKNL= yes
##$PPARMOD= 0
##$PSCAL= 4
##$PSIGN= 0
##$REVERSE= no
##$SF= 250.13
##$SI= 32768
##$SIGF1= 0
##$SIGF2= 0
##$SINO= 400
##$SIOLD= 32768
##$SREGLST= <1H.CDCl3>
##$SSB= 0
##$STSI= 32768
##$STSR= 0
##$SW_p= 5175.98343685301
##$SYMM= 0
##$S_DEV= 0
##$TDeff= 65536
##$TDoff= 0
##$TI= <Analysis number 999999
Compound Code 99
Book Reference 9
Project Code 9>
##$TILT= no
##$TM1= 0
##$TM2= 0
##$TOPLEV= 0
##$USERP1= <user>
##$USERP2= <user>
##$USERP3= <user>
##$USERP4= <user>
##$USERP5= <user>
##$WDW= 1
##$XDIM= 32768
##$YMAX_p= 426231528
##$YMIN_p= -53105
$$ End of Bruker specific parameters
$$ ---------------------------------
##NTUPLES= NMR SPECTRUM
##VAR_NAME=  FREQUENCY,     SPECTRUM/REAL,   SPECTRUM/IMAG
##SYMBOL=    X,             R,               I
##VAR_TYPE=  INDEPENDENT,   DEPENDENT,       DEPENDENT
##VAR_FORM=  AFFN,          ASDF,            ASDF
##VAR_DIM=   32768,         32768,           32768
##UNITS=     HZ,            ARBITRARY UNITS, ARBITRARY UNITS
##FACTOR=    0.157963299565203, 1,           1
##FIRST=     4132.6476996994, 0,             0
##LAST=      -1043.33573715361, 0,           0
##MIN=       -1043.33573715361, -53105,      0
##MAX=       4132.6476996994, 426231528,     0
$$ Real data points
##PAGE= N=1
##DATA TABLE= (X++(R..R)), XYDATA
$$ [...]
20994 1661 11963 9232 -2553 -10781 -8927 -19575 -22144 -32674 -23435 -10056 -17396 -22624 -30159
20981 -30159 -35558 -15960 1688 -10649 -22336 -27186 -22018 -19714 -14429 -5465 -10246 -18759 -28081
20968 -28081 -25103 -6480 10670 1532 -6652 10081 20810 14429 7191 11007 17143 19886 14719
20955 14719 5947 1307 -5367 -5988 4383 -3633 -9697 -3404 -402 6269 8908 -1600 -11568 4281
20941 4281 13215 21647 16814 14303 29416 36386 41287 44383 52240 61244 58015 67261 85336 86912
20927 86912 104640 108117 127860 142100 146161 162180 161089 154853 171427 191936 202401 178460
20915 178460 143523 135395 129547 121114 121892 121916 126674 126189 99888 55920 37922 33603 51397 70179
20901 70179 79470 91694 105925 110317 119334 113772 109612 120476 154896 165316 178262 184270 196482
20888 196482 209776 218129 198595 171298 158991 151586 141870 151310 158587 135508 113437 100103
20876 100103 79107 57520 46418 42136 25932 25772 37879 36633 15449 15085 29961 45494 33411
20863 33411 17086 20334 19349 16960 -2635 -11341 -8413 -4311 2562 4425 -3307 -23722 -25935 -7729
20849 -7729 7227 9848 9603 -1003 -9515 -7759 -3969 13211 11961 -1651 7554 20338 15597 18414
20835 18414 22792 39873 42124 24831 10915 10312 18378 24380 22305 -1884 2832 16274 9718
20822 9718 -5569 -25899 -29022 -17291 -31779 -21525 -17995 -23574 -17116 -15233 -14426 -6796 3103 -6339
20808 -6339 -12436 -12195 -14378 10601 7011 2242 -3409 -9525 -4470 1046 -4424 565 11475 7819
20794 7819 -11086 -6681 -3893 7948 14651 24406 24785 23855 24269 16104 16825 3655 -7187 -13930 -22045
20779 -22045 -17386 -23188 -13953 -12294 -16860 -14140 -12897 -17137 -1357 870 2371 11249 3370 -6734
20765 -6734 -1854 1983 7822 6258 4847 -6251 -8820 -8398 -1808 10274 10812 -2498 -9035 -19670
20751 -19670 -18025 -20825 -5095 -3028 -11946 -23183 -21493 -21163 -18632 7772 14360 5597 5641 1213
20737 1213 -10117 -7251 -7570 -5896 -1118 -2357 10372 6199 -2738 -7690 -8314 -2721 5704 2527 4727
20722 4727 19366 17518 12756 -3844 5194 16023 10078 9059 8255 3949 -4589 -15541 -4177 -297
20708 -297 4106 8429 1552 -15199 -17709 -7388 -3092 -1669 -6224 -5559 -1785 -1283 -7664 -14182 -10291
20693 -10291 -9767 -4715 2747 1610 -6504 12539 15860 10736 4289 -2483 2560 9455 6753 7036 493
20678 493 3172 5815 2870 8489 20793 25597 29274 33687 18152 2902 -7120 -5791 -8920 -12482
20664 -12482 -14093 -4607 3306 7286 10250 18547 23622 22664 13059 11996 12583 360 -5804 816 16290
20649 16290 12861 13961 14333 15244 17159 3199 -2536 -988 7490 4187 1255 6313 3352 2084 19007
20634 19007 13100 -1018 1083 14508 14201 9908 5226 8738 8242 14358 19097 32235 26679 23216
20620 23216 43182 37472 20115 18963 38734 50199 47777 48479 50029 51123 54768 53079 49907 56988
20606 56988 61292 48123 39582 25229 14658 14195 25251 35867 31555 35844 32870 23070 23073 30814
20592 30814 30716 26816 27177 39934 32091 25343 16353 29622 48725 54762 56327 45705 34017 40228
20578 40228 24431 2876 11357 33974 26952 18835 15021 -94 -4879 -11896 -9163 -6904 3951
20565 3951 9817 15634 17774 22916 28882 25705 16611 21766 19621 9137 6947 15576 16291 16696 14029
20550 14029 21793 27106 14764 9931 5222 5737 8424 -259 388 1054 2733 -544 -1086 5350 11502
20535 11502 18306 468 -10897 -7461 6952 19545 13259 7460 15204 27681 42486 31092 26564
20522 26564 7894 -8340 -9081 -12949 -11204 -1280 16984 14742 1115 -1588 -3642 7954 21198
20509 21198 22043 28045 22201 19038 7446 3546 -2021 11420 13827 10462 18132 26625 22273 16465
20495 16465 18420 26041 32997 40027 46753 44157 43667 49362 54662 62698 67253 53828 51108 53981
20481 53981 52770 73266 76326 72429 80948 79513 71299 55886 51597 47273 55001 54695 61516 57531
20467 57531 49777 59900 73182 78495 83076 89336 91402 85932 76797 74799 81674 104880 112129 112413
20453 112413 111531 119278 128768 120429 100108 96154 106283 101569 93154 99424 112752 113951 105038 97973
20439 97973 103235 103700 105181 113058 115353 110631 101348 107464 114500 120253 126331 120913 133959 152829
20425 152829 153727 152086 157839 163096 162210 156585 143674 150913 133778 131669 137833 141945 155553 168324
20411 168324 181311 189529 208419 244943 267739 305364 353879 386778 418810 451894 472358 496865
20399 496865 532561 588336 649517 685990 736556 810074 860659 898883 950612 994414 1042877
20388 1042877 1119105 1195674 1303193 1396333 1487787 1581542 1685641 1822656 2006044 2257938
20378 2257938 2564644 2960314 3533914 4358710 5562966 7417650 10377447 14529980 18275962
20369 18275962 19942805 20449415 20866891 21543332 22529253 24291193 26709542 28708842 30983825
20360 30983825 33960887 35143621 33427578 30514154 27937066 26200313 25236940 25505678
20352 25505678 25840757 24679379 22828491 20944746 18927826 16400325 13730520 11834139
20344 11834139 11042922 11308474 12738177 15656168 19552148 22165010 22779682 22690172 22588796
20335 22588796 22517703 22612937 24218577 28993623 35858860 39647610 39222174 37324908 34991750
20326 34991750 31882528 27655811 24157831 23270941 24336295 24533679 23084200 21136367
20318 21136367 19046964 16531186 13370988 10286673 7971127 6431747 5401175 4657206
20310 4657206 4083733 3648905 3307004 3028903 2810555 2647130 2493033 2349226 2223691
20301 2223691 2077714 1941062 1813677 1712184 1642222 1574931 1511559 1457669 1383083 1287856
20291 1287856 1187235 1101271 1009515 944315 898885 859122 829655 780393 712622 659236 626954
20280 626954 598899 566145 543142 509789 471897 441972 416074 400253 393623 368630 335213 319119
20268 319119 308217 294765 284164 284865 256844 238584 237774 229210 213071 211733 194669 178896 177835
20255 177835 186727 184371 179468 173765 179634 177412 161983 144662 132918 130350 125058 127376 122272
20242 122272 121116 124440 114356 95926 99682 99366 100814 87417 83689 97148 88580 96809 106309
20229 106309 105164 90756 77514 84212 96771 70481 58367 73179 86203 98010 92447 89213
20217 89213 86633 83272 79318 81152 84189 82188 80958 71535 75280 61796 53870 65878 81022 82319
20203 82319 71543 68714 67630 76476 59668 53671 57588 54473 71502 81173 78618 59594 40248
20190 40248 44728 46219 45182 66010 70839 63513 56470 54090 49800 65093 60266 43662 38425 40069
20176 40069 35559 25304 18386 28965 35947 48816 48780 47621 47053 35412 25899 30637 24005 -9538
20162 -9538 -23930 -7785 -3251 -6724 -295 1689 4844 1346 1279 10819 14977 15270 18018 31828 34464
20147 34464 36236 37794 41335 26622 19540 17772 13015 9620 20948 28730 32305 35518 25238 15449
20133 15449 4282 10289 13999 17063 30399 34478 27858 32837 38721 15064 23623 23761 21381 10139
20119 10139 7927 10670 6352 2253 15047 36767 39082 33343 26475 15005 30152 25609 14866
20106 14866 27621 24092 19497 23476 23194 19216 13588 16377 13421 1172 -15508 -8671 3646 10245
20092 10245 11969 19855 16248 13155 19251 25932 22027 29015 25950 29781 38359 28565 34579 45611
20078 45611 39323 41749 38867 26905 27995 35762 42944 37447 35344 26461 30178 35388 20447 13333
20064 13333 15212 16928 26960 16971 11384 16914 12529 7451 18845 11338 6029 11629 9141 8685
20050 8685 2083 2082 12185 26650 24255 6218 2365 11617 15572 13337 4392 -3267 -272 1266 4013
20035 4013 10706 19193 21000 8166 10833 14746 18075 14195 11390 8828 9682 18715 18539 198 10560
20020 10560 18822 11185 244 -11742 -15888 -12422 -3792 9107 3897 6954 10484 7556 8733 206
20006 206 3924 -500 244 7893 18009 11722 -11188 -14550 -7993 -13009 -8280 15551 19097 10546
19992 10546 2366 -7461 6184 27964 33647 15472 12412 20092 15663 15420 15379 9957 5878 -2405
19978 -2405 -12286 -223 -2373 -11364 5228 9984 12367 13656 24908 26481 14221 -3147 -5799
19965 -5799 -2483 3669 -6154 9666 20571 23798 34145 39165 20573 11812 7248 3881 15627
19952 15627 9421 5496 9313 5583 -1704 1630 7747 2636 2875 -1972 -1678 9738 20973 34954
19938 34954 31856 15754 4063 10274 13669 12352 22797 17448 13443 12490 6236 -93 99 3231
19924 3231 4604 8552 27195 35691 37733 37388 32899 19372 20774 29517 18067 6546 11744 24321
19910 24321 25429 13021 14649 32094 30645 16574 17402 25885 15820 11085 15347 3921 9403
19897 9403 7784 -6830 -1708 5614 -336 5642 27929 32487 22316 7479 6708 10947 6271 17028
19883 17028 19444 11092 14850 11142 15804 29640 39511 32082 34767 28597 34673 29299 28811 27641
19869 27641 22638 31463 40845 28682 5811 6424 21068 25359 23429 15927 16346 23722 27546 25779
19855 25779 16545 1131 -1628 -12155 -3806 18865 9835 859 -597 -1228 3889 18029 17029 25937
19841 25937 37718 21431 4654 2072 4099 11701 17791 13445 22601 13575 12393 5952 16559
19828 16559 33414 33288 22298 13309 11223 2053 14893 26330 15574 6121 17614 30443 38212
19815 38212 40787 37887 37928 38925 31912 33331 49264 59368 66478 66781 83292 108957 128470 126929
19801 126929 115221 112997 127768 148208 162725 174480 194959 211486 208473 200559 191971 167833
19789 167833 144363 141579 143232 150010 143805 125326 109158 96866 101062 97898 91784 81940 79851
19776 79851 78736 93418 111612 125534 121124 127695 135720 138350 144537 164252 188330 206365 224072
19763 224072 234625 226193 201056 177562 156354 148774 155086 145117 138293 150315 153017 139219 114831
19750 114831 106259 100916 78189 61724 53827 66153 96034 112375 123278 141826 180840 237572
19738 237572 289446 302548 305175 300160 281046 260603 221904 185863 162156 167910 193153 222508
19726 222508 257271 284661 304554 306087 311253 322076 329816 327177 295125 256771 224671 207212
19714 207212 185261 159194 140496 104627 75013 56481 58034 62301 68588 67477 67855 64944 68569
19701 68569 84279 85234 66429 60417 84239 89796 99379 108403 102896 104696 83487 82287 90605 99264
19687 99264 123523 163401 204371 248827 297116 331846 338828 352984 355617 353884 345455 334042
19675 334042 320468 307954 306002 309412 297688 289199 288912 266143 241324 214209 178957 155654
19663 155654 130143 97685 74931 72485 86627 92204 79146 65953 67206 75712 54090 42186
19651 42186 42483 42748 31869 11954 10596 18003 21986 16327 17668 8124 -1819 6063 16284 18966
19637 18966 14008 23573 28959 19070 22817 21632 26229 33437 25375 15899 13043 13924 18760 18093 9979
19622 9979 9785 11756 19103 29675 41715 42837 23320 11485 9295 10415 15918 5767 3294 2249
19608 2249 -1609 8294 16071 18263 19927 9209 3326 1724 11463 13042 17491 11473 10102 6486
19594 6486 576 8059 18636 6864 8061 11697 14600 5416 5399 8898 17904 22363 33862 40423
19580 40423 48884 43200 41095 39595 27191 15973 20431 15800 13231 6137 8449 11157 12698 5525
19566 5525 15768 36726 41217 32639 21134 33112 33726 26360 23847 22647 19645 26342 16568 12137
19552 12137 14629 14553 4907 2424 11620 11199 18225 20573 20353 22812 19319 18174 30218 37652 35466
19537 35466 26218 17135 6847 5731 7638 8107 6416 11914 3250 -3848 13346 16275 16759 22352
19523 22352 23190 15396 20903 37273 36787 29435 29131 31297 27846 25432 13358 15275 12666 7993 12260
19508 12260 20298 18886 31685 41301 39421 38170 23846 26375 30492 22439 13326 21455 35632 32292
19494 32292 23013 23996 23715 34473 38258 56711 78394 75919 87210 86137 87031 92814 102308 99893
19480 99893 88031 69454 55301 47308 57029 70286 60527 52011 35947 43929 57302 66855 65198
19467 65198 59001 61090 52235 53136 61009 67635 59276 48699 39632 47609 44222 42961 44504 51173
19453 51173 44756 58930 56570 57722 59337 54030 50301 52607 58918 81722 93932 86270 79857 94058
19439 94058 83618 70887 62092 67006 63002 65975 63565 70301 86677 94509 99587 105517 114840 108437
19425 108437 85391 84143 76586 76351 66179 58404 47155 41348 36268 38132 60557 70291 71035 57427
19411 57427 58663 58358 57373 56526 54365 61043 84163 123429 137140 138947 128735 115534 115381 102645
19397 102645 81775 71331 73382 83863 104244 133772 150545 135496 128419 123294 112221 104063
19385 104063 90873 81984 87963 81981 78510 85112 81278 70680 70875 62728 61333 68059 69347 84495
19371 84495 101543 112202 119615 115229 109885 113824 105572 106939 133789 170012 206386 229248 248237
19358 248237 267628 307693 369580 435214 486488 523194 538703 523176 499707 463100 436407
19347 436407 398108 364704 357593 361300 351452 339818 332198 313507 300641 276163 244255 229290
19335 229290 201345 166081 153525 143496 151765 159893 163205 161785 170701 160983 153950 149966 139809
19322 139809 122098 114145 116227 122535 135839 160450 194108 207714 223927 245026 266086 299056
19310 299056 320488 332412 358893 393959 444366 513425 576344 604788 604913 614320 612951 579084
19298 579084 522271 489145 459710 441822 446508 469026 459058 431075 406843 393087 374121 358734
19286 358734 343476 332447 337211 329022 322626 322844 316646 316790 334056 348014 359303 377986 383997
19273 383997 393051 428470 482682 503513 512154 550133 594355 656853 710393 748964 789481 854815
19261 854815 928790 1013048 1125396 1243666 1388272 1561259 1753272 1954314 2140797 2338854
19251 2338854 2574993 2829998 3155532 3621543 4350669 5467993 7009314 8870177 10723304
19242 10723304 12062416 12849812 13244662 13479317 13806088 14537801 16292326 19981625 26822681
19233 26822681 37523051 51391243 66312320 77905494 85229494 88695686 87868646 82361456
19225 82361456 72959839 62074334 51941894 43759252 38092510 35164766 34459517 34647825
19217 34647825 34177196 32656648 30143452 26893348 23122938 19161985 15561501 12693508
19209 12693508 10639440 9294227 8432153 7865276 7505517 7301611 7160355 7044991 6969368
19200 6969368 6946813 6961832 7087198 7359417 7878015 8808274 10356489 12837272 16490961
19191 16490961 21127297 26044548 29875435 32003495 32718369 32558676 32281273 32713280 35121730
19182 35121730 40591635 49467375 61234734 74477824 87954973 99452196 104430729
19175 104430729 101785871 93522519 81741970 68499416 54634187 42015845 32187698
19168 32187698 25693553 22226873 20838813 20454110 20016747 19063190 17651611 15885606
19160 15885606 13917339 11844090 9889478 8275991 7060462 6204953 5611413 5154711
19152 5154711 4770059 4398919 4039838 3697266 3364356 3040843 2732887 2467586 2256276
19143 2256276 2073983 1925365 1806833 1708044 1613689 1527838 1439844 1347715 1263681 1182635 1115514
19132 1115514 1048696 996953 954846 906848 865425 838973 810234 786394 747838 716023 678079
19121 678079 631095 598369 569693 539729 535595 520817 493992 478161 461935 446770 424121 409680
19109 409680 404655 405904 394318 375856 361437 341205 316218 316341 324671 327621 327753 325244 338279
19096 338279 335614 337046 330639 304362 279617 269482 264187 265378 257727 256097 266755 282525 291534
19083 291534 307587 297688 272052 247450 236619 233713 234510 238414 257554 281774 291603 290659 282577
19070 282577 274932 269088 267632 262638 257669 260006 229993 209997 220099 228470 228831 226642 207043
19057 207043 190965 179670 165835 163377 157475 164007 155689 151088 157062 164201 169113 167064 171083
19044 171083 180116 170061 154520 159381 169062 145424 128015 129082 128806 137162 132233 137620 159274
19031 159274 170500 157292 148332 139468 123702 117940 119634 125685 117504 119024 114555 131597 140682
19018 140682 127820 129019 116937 118806 133779 132705 131058 139128 140517 125762 105604 107082 113056
19005 113056 123655 123395 119286 120924 116746 92422 78206 89419 115983 127150 134766 116490 116042
18992 116042 124231 129096 128912 128235 127165 121465 116438 108652 106748 107139 109792 116109 113290 112999 126485
18977 126485 128525 115503 105626 108187 107733 104771 111021 114785 125742 149526 156291 157776 167770 181608
18963 181608 191504 193348 167067 158491 171413 189389 185049 175404 174135 175513 169389 168230 175658
18950 175658 192076 204307 192315 198490 219531 225832 219439 222734 235693 231282 239662 247876 254578
18937 254578 267951 280418 294183 297952 296314 282659 272754 253421 234850 245533 256753 266021
18925 266021 297769 316924 321107 312061 304035 314970 326731 338152 361889 395302 431756 475713
18913 475713 537801 609424 689856 810440 1014651 1351513 1945437 2994305 4008030 4197330
18903 4197330 4016880 3804537 3579499 3153522 2573421 2193353 2168270 2569884 3370387 3895897
18893 3895897 3815478 3578892 3351869 3072878 2589777 2020322 1624050 1398371 1298107 1263921
18883 1263921 1276318 1289454 1300388 1342849 1414138 1494439 1561852 1620655 1717933 1835547 1888809
18872 1888809 1931719 1974000 2042757 2128794 2212128 2346558 2555746 2832667 3196084 3677625
18862 3677625 4252771 4954443 5872891 7236391 9355874 12857186 18962516 27813007 33964595
18853 33964595 34631991 33582341 32306273 30470599 27104963 23743994 22813484 25396240
18845 25396240 32386984 42235584 48586701 52583730 58520568 63429267 62247305 56596311
18837 56596311 51011737 47603533 45944879 46780987 49349861 48749890 45648898 42421271
18829 42421271 39302634 35384046 30536560 26891943 25807028 27489012 32492197 43049456
18821 43049456 62275648 82757763 88305629 85118551 81131965 77292236 71047715 62991184
18813 62991184 61923993 73009708 87213948 88784404 82760073 75982280 68728276 57964084
18805 57964084 43494407 31078438 23083701 18253242 15135196 13015944 11540949 10450192
18797 10450192 9590620 8918747 8407494 8022394 7751040 7696845 8033609 8814957 9239893
18788 9239893 8914495 8436507 8030165 7715559 7399860 7365852 7413783 6972644 6384591 5846089
18778 5846089 5302465 4578518 3721705 3034733 2589836 2302987 2094341 1912251 1778998
18769 1778998 1665150 1569157 1488647 1444588 1412605 1361901 1308264 1270610 1240728 1207142 1146187
18758 1146187 1066880 999125 944717 883525 808046 752547 700031 648446 631388 618865 604941
18747 604941 587725 570048 551995 547771 531494 517472 502587 485513 468920 458694 446968 453918
18735 453918 450510 467557 498267 531214 537279 537344 542081 554605 569093 561806 546847 525653 512250
18722 512250 507096 526508 543719 538279 518223 511662 490662 457328 415947 359585 326339 299835
18710 299835 282142 271247 260087 256184 261860 255806 240762 238398 248364 254958 255933 246105 239130
18697 239130 226825 219895 221379 195610 193171 195536 197078 198967 198828 207597 243924 281524 313056
18684 313056 355448 396833 436593 459174 475245 510747 515063 500157 466367 436095 393796 348835
18672 348835 316357 293209 297410 328292 371112 417307 471518 506261 517923 504513 478539 437615
18660 437615 391120 340867 284816 243094 220038 201154 195214 202828 197160 177103 180997 179084
18648 179084 157837 146158 150775 159431 163014 154828 145258 144501 149252 162870 158395 159846 162887 165876
18634 165876 171131 187039 192662 207008 199317 179192 166422 170372 152729 132232 126376 127593 136918
18621 136918 135415 112709 109342 116398 99093 75274 65548 77704 78253 87503 99753 104969 127522
18608 127522 128752 108281 88406 100993 109132 106375 94455 80647 66481 75372 77173 77552 98098
18595 98098 110972 106409 98394 112413 109283 104361 103236 117478 114695 111466 113387 117235 125186 121465
18581 121465 114467 125108 135615 149537 146895 154675 167012 174108 170923 167897 172245 173555 195009
18568 195009 219730 228196 219811 220998 208102 173858 141939 128734 115956 107791 107843 98228 88804
18555 88804 77873 79310 78188 84018 83679 83043 90053 102267 118989 129814 132415 146472 174955
18542 174955 208883 229801 254942 286458 301728 287651 267160 249380 217344 201613 172798
18531 172798 140416 125699 128113 126418 118423 122565 114876 110973 120123 117047 112744 100260 112833
18518 112833 122765 109926 127975 166952 206197 243635 266398 273607 280127 284088 280706 257452
18506 257452 232306 217358 206962 196825 191170 202836 200294 209123 201649 192951 174273 164961 161508
18493 161508 153287 159979 158797 158094 167312 160723 147349 159683 170385 171293 183087 167477 168992
18480 168992 171190 165140 152238 137185 130373 131670 144576 157319 151354 144198 145671 126507 105857
18467 105857 108385 114454 121442 139180 146217 149497 138169 147847 170682 201179 217883 211917 200034
18454 200034 200751 199681 219422 245528 251068 237557 234307 241922 249894 259860 258846 253995 250971 246834
18440 246834 237923 243239 244184 249165 261543 273242 286957 279951 270524 279413 280012 293633 309570
18427 309570 332741 337606 354217 369093 382183 402194 407439 424239 451927 478866 519115 565385
18415 565385 605715 653670 702310 774075 828160 886255 961928 1055853 1160601 1266260 1397734
18404 1397734 1541527 1692024 1876116 2112717 2335968 2583213 2879019 3226574 3706784
18395 3706784 4384230 5330954 6471040 7613320 8890849 10531560 12192332 13313062
18387 13313062 14163669 15260628 16793106 18854587 22182481 27746545 34861191 42120935
18379 42120935 51112281 63426452 74841238 80308359 83492221 86926498 87177786 81665962
18371 81665962 73466887 66109615 59512812 52470487 45767692 41087879 38601958 36784261
18363 36784261 34370236 31858113 29692572 27431577 24465276 21110330 18046883 15484329
18355 15484329 13299999 11489339 10088131 9074596 8423221 7983418 7655680 7443797 7349401
18346 7349401 7327296 7395480 7645684 8184683 9148760 10690090 12742953 14961440 17367254
18337 17367254 20331370 23623795 26050828 27546256 29207572 31579994 34304788 36927354
18329 36927354 40439031 46634493 54832386 61224939 65940123 72368106 78962526 79584352
18321 79584352 75249402 70317386 65282795 57817116 48201798 39480453 32893388 27612420
18313 27612420 23172578 20074169 18256551 16809352 15404577 14235421 13199794 11972154
18305 11972154 10509421 9131185 7982325 6989574 6112658 5389530 4828166 4376066 3990421
18296 3990421 3662814 3364010 3071690 2815195 2587126 2390039 2216190 2069663 1951486
18287 1951486 1835640 1731895 1641329 1557955 1497162 1451519 1433844 1414181 1376492 1332557 1277174
18276 1277174 1210996 1150601 1106515 1047060 985946 924629 871766 821516 792262 781297 764477
18265 764477 718072 669784 631978 601227 577584 559338 534616 524473 509960 484206 470423
18254 470423 465629 451535 424977 405167 386543 375209 374252 363496 350199 346923 340697 333095 325820
18241 325820 313255 305029 304565 294155 281974 262944 248542 253801 262740 269775 262471 247683 244069
18228 244069 247039 248433 232642 215757 207773 212031 208148 206647 208915 203765 200595 197948 189614 177348
18214 177348 179049 190944 180711 174557 170743 174582 164412 162130 163341 155250 156588 170243 175923
18201 175923 185213 171355 158324 154850 146805 136787 147741 172407 180980 176210 180364 186062 167713
18188 167713 152978 139924 133631 131149 126937 121071 128461 127918 131701 126968 133034 148318 155473 154021
18174 154021 147971 160459 165221 145896 133199 147044 151073 144116 147777 141478 142952 126406 118612
18161 118612 119726 139913 143278 145358 153274 151775 144992 142817 145806 163120 169671 173940 172587 175506
18147 175506 184297 197567 203246 214684 219608 217886 209945 194745 195211 208190 217120 221670 226851
18134 226851 217236 222829 233703 234461 237334 226398 233945 260288 296797 334892 369733 399299 422589
18121 422589 445848 487686 554322 625824 706508 801307 945255 1167875 1462635 1871494 2502418
18110 2502418 3584370 5562624 9681547 16842397 20781366 19652696 18095212 16656923
18102 16656923 14919855 11219118 7179547 4616365 3296103 2559714 2107941 1825658
18094 1825658 1625929 1478089 1373783 1297773 1264680 1289762 1372772 1548458 1892894 2455335
18084 2455335 2906453 2972215 2829007 2641212 2419244 2087115 1689800 1365577 1173306 1066670
18074 1066670 1002883 976519 972594 972111 987279 1020244 1066008 1104813 1169867 1258190 1392425 1546762
18062 1546762 1727902 2007521 2436616 3045557 3944302 5393627 7876994 12152568 17882952
18053 17882952 21735743 22346350 21462771 20027398 17933374 14671707 11043357 8209954
18045 8209954 6409456 5352256 4740670 4422349 4336423 4411704 4691388 5239992 6198664
18036 6198664 7869142 10737760 14765984 18007092 18827909 18335557 17554305 16528095 14960381
18027 14960381 13373225 12980803 14656815 18798605 23846000 26818434 28872958 32016268
18019 32016268 33984262 31979657 27714877 23518952 19992035 16305615 12585497 9819186
18011 9819186 8167263 7246179 6772180 6631818 6776031 7236969 8162908 9838500 12793284
18002 12793284 17632459 23836204 29639078 33534109 34018627 32280733 29577384 26130688
17994 26130688 22383474 19287644 18597393 20599802 21965866 20899941 19164983 17473632
17986 17473632 15523422 12661527 9556248 7268384 5883528 5046339 4516899 4198046
17978 4198046 4032570 3937887 3933615 4060051 4371685 4947814 5961211 7780012 11074231
17969 11074231 15888271 19391875 19645749 18499394 17044864 15164067 12251244 8879085
17961 8879085 6256052 4614114 3624410 2996097 2586741 2304276 2103061 1928538 1773686
17952 1773686 1647349 1521868 1401313 1315597 1251397 1199146 1167671 1135691 1125625 1196732 1336431
17941 1336431 1619576 2071318 2404224 2407271 2267468 2097866 1893524 1595027 1233226 938858
17931 938858 762587 642770 571797 517280 470629 432694 405465 379647 364015 344924 319222
17920 319222 300762 288438 277646 273015 264574 257354 245998 231252 224648 197144 194269 203408 198213
17907 198213 182152 176494 177613 178811 165390 162799 144271 149816 146918 152905 162659 152309 148265
17894 148265 153317 150943 141110 144606 161309 169023 169146 179886 202412 223227 243080 251323 268567
17881 268567 295569 326043 330622 334908 349397 384095 417868 441976 456670 450615 446702 452251
17869 452251 447258 435078 405726 372116 349368 316029 270079 232887 206162 199782 186493 169182
17857 169182 156274 152015 158348 161619 166382 168884 164653 146899 129289 119028 123322 118623 101079
17844 101079 88256 82014 89549 112827 136680 153240 172552 176538 185075 187352 211540 247073
17832 247073 269332 286340 319380 342124 337588 330409 315794 301183 282765 290815 287041 274024
17820 274024 264894 271551 272750 266564 281458 300052 311195 293025 282271 284917 263867 229832
17808 229832 204107 166698 139977 128757 106250 88686 81293 80104 69420 69257 53047 48497
17796 48497 48801 38859 35223 39274 46008 50007 49604 52903 61437 59450 67392 55331 30085 17832
17782 17832 13419 24059 45855 46044 31035 25198 19724 13802 12717 9656 12278 26967 28793 26196
17768 26196 40190 42968 30206 14621 18405 18153 27079 39956 42240 46956 47397 41971 32408 42039
17754 42039 49485 42179 32055 31327 34910 31792 24973 24244 17970 28705 25140 17941 22838 18874
17740 18874 13983 4709 7913 20171 21104 19488 15031 22041 17210 7446 17306 14077 8857 7381
17726 7381 12640 17603 24408 31055 14938 23735 23363 14454 6552 21112 29242 22739 24788 18995
17712 18995 24010 40567 47896 54966 46019 30459 30812 30512 23781 30437 32451 26180 28379 28666 12810
17697 12810 5331 809 5513 11052 10807 1412 4990 23652 16828 4792 15758 31475 48201
17684 48201 50258 54332 43762 18646 10476 12191 445 1381 9623 21541 18790 17415 27684
17671 27684 24542 26256 22189 10795 8149 12728 16717 16036 12505 11291 8862 -6151 -18291 -8700
17657 -8700 -11604 805 13842 13984 28597 35843 20340 6731 10821 15803 23785 23846 1684 -768
17643 -768 19235 16195 17522 35478 27014 15597 10067 -647 -10697 -8013 1554 -2136 5530 19146
17629 19146 23930 21513 12688 14546 25373 12011 -1503 -5247 277 7329 24536 26931 25670
17616 25670 9710 7171 6688 10313 14281 3090 5491 6294 11845 10040 -2903 -410 13780 30135
17602 30135 29592 21198 25771 25105 22544 22050 29879 36928 20281 -14 -7970 -9009 -6760 -4743 3520
17587 3520 -1585 5480 4949 2323 2249 -1114 13120 11040 2959 1178 1146 -1067 4653 21791 32325
17572 32325 34487 34186 29009 25444 14932 21244 25802 22020 11123 2829 -5129 -8583 1430 9575
17558 9575 16352 22583 24064 26785 26346 32097 22784 8978 -4414 -9932 -6364 -3636 -3323 3053 13323
17543 13323 16951 17101 -4489 -9844 17564 32913 30912 44633 41932 50323 58746 69467 86449
17530 86449 105726 96272 88841 85438 71319 71559 63096 53698 47956 35324 34820 47348 72970 80166
17516 80166 87093 90194 82654 78839 75194 81490 86140 65017 54513 38481 31291 34231 30941 38227
17502 38227 63301 87898 105358 103083 98784 106249 103176 105510 108017 118352 120715 101314 97139
17489 97139 106668 103070 103057 98128 95804 96421 106278 118156 123783 134706 128263 132414 148581 150722
17475 150722 147402 129282 117901 104376 94050 86079 79863 79671 84054 85355 84824 89091 112404
17462 112404 111768 114884 109993 98509 82910 65181 44623 39568 43231 44861 46994 44180 48536
17449 48536 54323 90009 108257 111281 128297 139751 127224 127351 140046 164422 142912 122725
17437 122725 123462 123578 93986 64598 50843 47172 49496 49239 42754 34269 7381 -128 787 -15044
17423 -15044 -8698 -8100 -17009 -9536 -3892 -5750 1671 -2914 -2864 8753 4156 3502 14337 22709 17140
17408 17140 -4397 -12844 -10232 -4336 -5589 -635 10414 7586 -8668 -9823 -7668 8541 21387
17395 21387 13270 21562 25305 10423 -6683 -19428 -9313 -4956 4315 5201 4551 11884 10419 5529
17381 5529 9842 11843 9986 3993 5788 -4941 -9005 181 6451 -92 13502 11361 15415 6631
17367 6631 -1100 -3167 5554 12579 16894 24111 13891 14494 12724 8623 6110 4055 4166 -7605 -17565
17352 -17565 -5476 -3936 4425 7772 -8273 -8961 -5481 -8497 -23278 -17347 11640 15179 1780
17339 1780 -14566 -12549 -10625 -13640 -22346 -34401 -38089 -32996 -20830 -20022 -23180 -17469 -4101 7233
17325 7233 13435 -1297 -7682 -18782 -18367 -10899 -10186 -13093 -3470 488 147 -12215 -8633 8574
17311 8574 9344 -10111 -11402 906 -1746 -1131 3590 -17744 -33755 -38529 -29938 -8474 4695 12756
17297 12756 12179 -77 -15452 -10396 -4307 3564 -3970 -2478 13764 4991 -4541 -1384 15742 12736
17283 12736 19169 22385 11061 9989 3160 776 -6878 5670 8169 9005 18158 -5536 -33816 -38062
17269 -38062 -23260 -24197 -23243 -13397 1484 -3661 -11364 -10108 -11792 -11874 -14938 -369 16949 7691
17255 7691 15314 23371 16711 13514 14327 11783 20294 14988 954 -11717 -6847 -3735 -2188 -185
17241 -185 12999 3256 -11822 -9909 -5508 -8378 2099 5677 11571 9908 8285 23315 39512 22770
17227 22770 -3363 -34 2242 6955 5384 892 8874 -211 -6973 -8893 -8754 -666 -6213 -6230 -15572
17212 -15572 -31872 -36842 -19188 -4945 -4120 -10776 -32595 -33424 -14123 -10220 -13843 -22351 -24518 -12260
17198 -12260 -4825 3495 16288 6197 -6279 -9172 7033 12440 -880 -3266 -8871 -11408 -1914
17185 -1914 886 -1370 2776 611 -5377 -8957 -10778 -10969 -6951 1457 11460 14443 12460 11756 14208
17170 14208 8398 14818 10274 300 -11128 -13587 -12336 -11777 -11232 -1221 -1524 599 911 -3260 -2860
17155 -2860 -3397 -7096 -9391 -14067 -6042 -13459 -11512 -7395 491 -5248 -5910 -75 -4753 -10471 10332
17140 10332 -4244 -27819 -28618 -13801 5737 16258 13161 7282 -2121 -8482 -14106 -12289 -190
17127 -190 11547 17562 7821 4498 -1708 4101 467 -499 6682 7592 10070 -3894 -3621 6266 8947
17112 8947 10515 558 1262 -2641 -979 187 12740 13248 18347 17208 14407 4276 5631 9282 2865
17097 2865 -6191 -9347 -1355 -12661 -29903 -27667 -9609 -8810 -14984 -29470 -41458 -26748 -20328
17084 -20328 -11871 -8593 -3081 -2883 -16686 -15419 -23091 -17778 -11376 -8979 -2980 -6110 -14841 -17041
17070 -17041 -15136 -8824 -1259 -7821 -5556 -11668 -9260 -12085 -16103 -4747 10385 9976 4735 -13323
17056 -13323 -20859 -13877 -8069 -4170 10947 -867 -11831 -1257 4214 2890 10956 14469 14924 11040
17042 11040 6841 -4166 1078 5399 10099 21608 5008 -9635 -21558 -23259 -16566 -8660 -1787
17029 -1787 816 4749 -4298 -15727 -10067 -12184 -7515 -3030 -9003 -7575 -17022 -11679 7109 3311
17015 3311 -10953 -18075 -23098 -15216 -9882 -1354 12661 21622 -4758 -19327 -6676 157 -7115
17002 -7115 -10660 -1893 9463 6269 4500 9893 10621 3446 -29719 -41130 -42191 -37799 -33187 -13015
16988 -13015 -3032 -6455 -6463 4084 4471 -130 7855 9812 6417 7682 -6591 -19334 -6250 -419
16974 -419 2509 9052 1615 -6396 -7200 -6340 -2915 -18071 -26838 -24809 -21330 -16936 -20335 -29267 -26133
16959 -26133 -21667 -17700 -6031 2543 4420 -17407 -22281 -16778 -5189 2591 3945 -7906 616
16946 616 7695 1871 3487 5929 312 -20398 -10942 6137 459 4579 10336 -1516 -9573 -4843
16932 -4843 -14691 -21512 -249 14395 20533 7829 3366 -6486 -7214 -4383 -5943 -10437 -1250 -2047
16918 -2047 -19201 -27745 -34609 -39168 -35670 -26263 -17119 -8479 -17799 -29373 -18901 -6720 3265 5715
16904 5715 2825 7080 14649 1707 -27919 -24001 -19460 -10186 -5583 -4129 363 76 -1322 767
16890 767 3919 -11403 -12029 -12420 -8382 -5462 -3221 -9684 -16905 -10216 5357 3403 -10782 -22072
16876 -22072 -7472 -447 936 -10724 -17756 -15433 -12041 -6123 2469 4915 13983 26919 18714 6698
16862 6698 3909 -12362 -11306 -10021 -5359 -21469 -29861 -19913 -14405 -8252 -5709 -7009 -1393 9576
16848 9576 -4698 -9413 2908 2460 -9681 -15299 -24963 -31683 -24480 -14050 -16258 -11281 -4628 -4533
16834 -4533 -9978 -7788 1900 377 3220 8286 -6007 -3248 -1176 -10053 -12952 738 3999 876
16820 876 -8344 -14773 -14600 -9706 -11596 -12127 -10695 -13364 -17871 -13888 -3142 -8027 -12621 -10703 -11099
16805 -11099 -479 5913 1050 9039 5827 3214 5520 6466 13811 28333 4085 -10415 -5116 -3331
16791 -3331 6444 10597 20308 26516 25143 14275 8594 814 -13640 -7012 -11018 -7049 -8487 2266
16777 2266 9512 7602 4027 4999 6213 1983 4503 12897 23860 32319 14181 -4514 5934 19950
16763 19950 12899 -5600 -11339 4310 6765 -303 1427 10820 1610 -11430 -26154 -23648 -8459
16750 -8459 -8583 -25090 -21881 -26217 -12593 -4248 -7737 -4313 1005 -2978 -10232 -6966 -6304 -2043 -14897
16735 -14897 -24855 -25916 -15632 -19608 -14496 -8919 -10686 57 7642 8972 5935 2115 8409 13669
16721 13669 17951 16616 3415 -10072 -9528 -15564 -17449 -29360 -21881 -20072 -12179 -3225 -9002 -877
16707 -877 9082 3936 -10571 -3858 -1223 -15906 -25184 -13331 -5661 -7699 -9905 -10772 -14861 -10884
16693 -10884 -9564 -9352 -1043 -8298 -13404 -7957 -15987 -22430 -23930 -27924 -46050 -36152 -16552 -5859
16679 -5859 -16982 -11231 -11009 -4415 3319 8593 -2129 -4316 -8992 -9258 -25122 -31156 -3032 14771
16665 14771 5192 -2167 -2108 9007 15144 10700 13981 19164 10654 -2987 -7123 -8368 1023 15925
16651 15925 30047 44000 45114 47045 43520 30349 16492 2473 2916 -18238 -26626 -26658 -26576 -23966
16637 -23966 -11848 -4209 -8789 -17466 -19973 -19885 -18460 -23945 -18966 -22295 -1507 -1206 921 -10820
16623 -10820 -18113 -9501 -19593 -17608 -5893 2868 -2075 3510 5730 10300 7119 -17328 -31678
16610 -31678 -21047 -21448 -11701 -9414 -9586 -1687 -3490 -7602 -16465 -19110 -14812 -2290 -10742 -14756
16596 -14756 -5354 1202 -4431 -6449 -13445 -14851 -19916 -22453 -25701 -12816 3351 7961 2155 -1028
16582 -1028 3292 -9948 -29730 -26519 -25963 -25030 -21973 -31873 -22057 -16173 -17219 -15838 -8658 -2420 2785
16567 2785 -10517 -20337 -22001 -28744 -21636 -4588 11095 5200 2103 8668 2619 -6500 -4368 2508
16553 2508 9544 4072 -5016 -14464 -14275 -15528 -4276 -9645 -14220 -10613 -5704 8396 10251 7482
16539 7482 12303 1853 4587 1538 -20379 -13721 3324 2402 -4312 -5090 -27743 -37869 -37465 -35304
16525 -35304 -33142 -31436 -30405 -24382 -15453 -9634 -11025 -11847 -8157 -8216 -11283 -17348 -6294 -7222 -4672
16510 -4672 16213 27989 19387 7126 14414 9146 6786 -2394 -10499 -13127 -13202 -12404 -19074 -24753 -17060
16495 -17060 -2220 11507 7973 -10336 -17668 -21128 -14226 -12419 -6244 -3776 715 -1243 6484 1527
16481 1527 3907 140 -959 -5847 -11005 -12384 -15321 -21544 -15628 -4214 -4733 -18289 -6951 8835
16467 8835 7278 -6348 -5927 -8802 -9372 -8676 1893 1877 16222 29044 23947 18312 19083 7318 -5425
16452 -5425 2526 26772 28221 18395 9154 -5625 -10185 -15238 -21365 -17039 -14186 -10173 -21179 -32456
16438 -32456 -29963 -22277 -9189 -4030 -5591 -10025 -15012 -7785 -4832 -15424 -10895 -127 -1089 -18072
16424 -18072 -24971 -27974 -19769 -19905 -12615 1670 6178 11969 14387 16998 6799 3529 7162 5251
16410 5251 7992 2300 -4839 -10116 -12092 -9193 6429 4532 -3317 -6228 -9817 -8101 -12852 -14199
16396 -14199 -9665 -3832 -1112 -12352 -34282 -30073 -17605 -8885 2040 -1873 -529 -5158 -13015
16383 -13015 -16296 -10227 -9973 -16383 -11438 -9743 -11388 -18969 -35136 -19634 -11773 2495 6518 3874
16369 3874 -11688 -10879 -18482 -21024 -25880 -10200 -5990 -4059 -6950 -7925 -8703 -5625 -9291 -10738 -3133
16354 -3133 2385 65 -12447 -20041 -16155 -27823 -23693 -17210 -17521 -21487 -21744 -754 -3538 -2083
16340 -2083 9374 6091 1272 -3347 -9195 -8486 -8123 -12832 -17110 -16311 -18169 -22584 -8000 4502 -5074
16325 -5074 -13954 -12119 6632 -796 -7607 -1735 15209 4459 -1480 -380 -88 -3766 -14594 -20470
16311 -20470 -5992 747 -1503 5436 18243 21872 15227 15047 19346 6903 -24895 -24361 -10672 -12856
16297 -12856 -12417 -8940 -10465 -13395 -16415 -16556 -25430 -27723 -13673 -8296 -12725 -25441 -7875 -5227
16283 -5227 9489 8347 -8609 756 8348 433 -3936 5318 1855 -4292 -6493 -4090 -2311 9435
16269 9435 14316 3422 547 5086 12754 14947 16821 15703 22302 21284 18241 8812 -5659 -9474
16255 -9474 -2809 163 -2138 -12185 -27882 -29471 -28213 -18943 6767 6488 15085 17892 19650 -4926
16241 -4926 -28800 -24412 -18597 -16007 -16148 -13213 -11103 -18925 -22510 -22691 -29541 -36183 -23220 -18697 -9236
16226 -9236 -1288 -6015 -4227 -8130 -6149 -16751 -9226 -5086 -25248 -26297 -15710 -13373 -8145 -10566
16212 -10566 -5109 2647 7849 8632 12822 21719 24751 19823 20339 12530 753 -3484 -6691 -13684 -10319
16197 -10319 -4571 -10440 2989 15649 12970 -10144 -1734 4584 5481 6636 9193 8220 -1934 -6060
16183 -6060 -7301 -126 2984 3225 -11675 -21935 -33050 -39083 -31130 4549 29943 29208 14060 616
16169 616 13709 16150 12234 -2872 -9687 -784 -11341 -9503 -5495 -16692 -15346 -6503 -16995 -35445
16155 -35445 -35332 -29108 -26542 -19880 -24370 -15143 -13520 -12114 -6170 -7604 -15952 -18967 -4631 4484
16141 4484 -8064 -11490 -10240 -9867 -4024 14625 21978 17780 3558 -9847 -14197 -8170 -15447 -20574
16127 -20574 -12444 -21652 -29910 -28396 -15164 -3925 -1230 -7225 -9405 -9583 -9758 -12587 -21958 -17370
16113 -17370 -847 -11300 -31277 -40610 -40445 -36109 -19590 -6203 2738 15083 6497 269 -2473
16100 -2473 2649 5457 -1488 -13436 -12457 -7296 -17191 -19005 -17418 -2715 -1279 -9070 -2505 6869
16086 6869 16 -3343 -12459 -19741 -12138 4689 7623 8430 12716 16851 9628 2312 -6204 -13074 -16808
16071 -16808 -17563 -30164 -28090 -21134 -12658 1938 15627 15952 9844 -5877 -1502 -10507 -13501 -16077
16057 -16077 -16000 -7767 -6507 -5164 5609 7132 2450 -7504 -24986 -29846 -16878 -11555 -23942 -21496
16043 -21496 -5478 -2301 387 -3595 -25701 -24568 -18653 -28589 -22471 -9030 6584 15680 6447
16030 6447 -1564 -5632 -13451 -6773 -4056 -966 -12548 -28135 -19000 -19171 -18390 -11995 3257 11667
16016 11667 -10270 -21624 -26033 -19171 -6051 -1164 -18125 -28478 -32890 -27383 -16002 -9938 -1162
16003 -1162 1580 -8074 -18509 -6919 -190 1633 -3020 -11756 -18692 -6964 8189 13582 11479 5650
15989 5650 -3961 -28851 -43617 -36865 -25987 -22841 -19451 -19885 -31893 -25770 -11978 -5811 -6892 -3715
15975 -3715 2367 3197 2022 4414 2216 10470 12671 3419 -10841 -12509 -16202 -18915 -11813 -504
15961 -504 6894 8188 880 -8523 -8251 -10963 -20072 -28745 -42499 -39847 -24073 -12573 -5556 -9895
15947 -9895 -12045 -9998 -5441 -6342 -10077 -5631 1361 12058 13854 6636 -1174 -12270 -18222 -9696
15933 -9696 -14099 -22500 -13083 4066 -6660 -15441 -20522 -15229 3578 12332 -63 -2267 -5313 -53
15919 -53 11820 9548 6197 -767 -5932 -17037 -20174 -17571 -23145 -22522 -13366 1967 6389 -4019
15905 -4019 -7510 -6857 -17119 -23765 -17649 -3317 7999 20958 10427 -3883 -7325 -6336 -6468 -8816
15891 -8816 -1697 14296 7918 -3548 -21268 -4514 12915 10787 7748 5624 1112 4209 17798
15878 17798 11492 12616 16930 26013 15548 -886 -6285 -12758 -7037 -604 -7297 -7657 -3803 8919
15864 8919 14538 -10949 -24290 -22911 -6102 -11107 -28132 -39287 -32858 -24651 -9331 -4884 -15159
15851 -15159 -163 7821 -2862 -3040 1209 -3283 -9190 -23571 -28340 -23008 -12140 -6198 -8862 -13587
15837 -13587 -10065 -16719 -5442 -18467 -23465 -23318 -19259 -11439 -14090 -24573 -22631 -23425 -5274 -1948
15823 -1948 -7970 -606 1901 -9406 -20367 -26709 -10004 9528 7687 -1694 4331 927 -10874
15810 -10874 -14453 -211 7682 2904 -6403 -5918 5607 8065 1605 -3644 -10956 -6265 -5742 -19937
15796 -19937 -19167 -5236 3386 -8319 -13561 -18998 -14873 -14295 -8272 -646 -18557 -27916 -24487 -19786
15782 -19786 -11531 -9742 -15518 -10447 -4025 -2103 -12322 -34611 -25997 -19968 -3656 -4431 -2252 6719
15768 6719 3103 -10809 -13878 -12020 -485 2319 -12052 -22627 -28309 -21123 -20000 -6712 -2351
15755 -2351 -8048 -6915 -6910 -9387 -2731 210 -6291 -14229 -12768 -14040 -11247 -1804 11265 -1448 -3506
15740 -3506 10664 13183 3399 4584 -6120 -3613 1963 13607 16837 14530 300 -6411 -18384
15727 -18384 -28259 -19133 4639 15523 3370 -14695 -13931 -10152 -12697 -10214 -1140 -8133 -23980
15714 -23980 -14318 7322 15902 13666 3611 7227 -2217 -13833 -9975 -2874 -1474 -4092 -14077 -15554
15700 -15554 -14341 -3760 6765 -6667 -21065 -17987 -13455 -799 -2270 -11115 -7650 -16515 -23638
15687 -23638 -7439 71 3070 6808 22174 18760 9839 1923 -13423 -10799 3119 -2039 -3500
15674 -3500 -4078 -8104 -3543 -973 -8965 -23466 -24882 -24870 -4957 4778 9721 10221 15245 7575 1300
15659 1300 5008 -6381 -12379 -14869 -4882 4175 -6842 -6509 -2498 -5453 -8207 -12331 -14767 1696
15645 1696 246 -8393 -20058 -15620 -5633 7258 -2511 -7886 -7695 -17175 2198 5049 -2716 -367
15631 -367 7715 1779 1897 -7116 -14469 -5396 8135 26505 28726 15911 939 12583 14630 -7957
15617 -7957 -22091 -34530 -21244 -6857 901 4874 6850 4934 118 -7576 -6455 -8612 -8243 -17416
15603 -17416 -18693 -11752 2141 15476 9391 1119 -20846 -24115 -18203 -24454 -16415 -5981 -6784 -11245
15589 -11245 -19387 -18689 -10716 -5105 -9906 -14615 -19844 -2748 -3513 -7505 -826 -6063 -9124 -15224 -18954
15574 -18954 -7793 -2168 -1275 -11788 -22326 -14678 -5607 -8476 -7684 -13823 -8763 -14254 -13985 -19319
15560 -19319 -17535 -18706 -6855 1098 831 2697 -2368 -4685 -3430 3122 2174 -9924 -23620 -12051
15546 -12051 -5826 17789 22839 18879 6224 957 -7584 -10686 -22557 -33663 -18383 -6939 -12447
15533 -12447 -30332 -40859 -32383 -22989 -23911 -31949 -32207 -8614 6615 8876 8007 -1744 3253 18829
15519 18829 19563 22234 17519 -3186 -4734 -13675 -20860 -16266 -11540 -6828 -4455 -13295 -8225 7756
15505 7756 4314 1529 578 -7974 -14743 -12801 -19695 -22227 -16693 -4454 -451 -6657 -8529 -16805 -29925
15490 -29925 -25959 -24759 -20527 -8022 -15984 -13071 -1550 -3050 1219 11817 2633 -2743 3540 -2146
15476 -2146 -14085 -20682 -18837 -13236 -15102 -9683 -2146 4955 -7488 -11131 -11471 -9015 -8214 -9634 -25119
15461 -25119 -3010 1489 -1492 1490 9432 2861 -7147 -4578 2023 -7653 -1499 -714 -17065 -15320
15447 -15320 -945 1464 -1404 -20150 -29371 -7946 8119 22853 25044 15362 3660 -11168 -23983
15434 -23983 -23525 -15457 -8943 2561 6111 3741 823 -561 -8161 -16237 -8607 -6902 -10027 -10508 -15442
15419 -15442 -18247 -34961 -31836 -26464 -19225 -23985 -9228 7300 355 811 -5115 -14305 -4733 8326
15405 8326 4648 -3370 -7032 -5013 -11072 3817 11483 6064 -4377 -13830 -8758 -9798 -12309 -10932
15391 -10932 -6114 -20401 -25938 -16241 -8420 -8110 -3094 5415 -10478 -25628 -18306 -4215 -4982 -8297
15377 -8297 -1847 13418 24313 26366 18383 2404 -2371 5180 -862 -4322 -6637 -9737 -14297 -10772
15363 -10772 -8772 -15464 -12248 -10352 -17837 -13779 4161 14211 3114 7875 7997 -61 -945 7009
15349 7009 15245 2418 -12492 -23976 -20911 -17998 -16857 2174 4409 4390 8039 6403 2719 3894
15335 3894 9139 -548 548 -426 2086 -3924 -15387 -12699 4743 6572 4635 7501 1842 -14240
15321 -14240 -28549 -28986 -34743 -29233 -20804 -9785 -2707 -8988 -8729 -15350 -19108 -5234 8336 -484
15307 -484 -8212 -4304 -8402 -4158 -7249 -1642 6339 271 -9836 -6850 4166 9668 3211 6225
15293 6225 9971 5 1429 2870 -148 -6763 -10967 -5085 -5331 -23283 -31655 -17927 -8029 2483
15279 2483 -221 -12820 -8955 -1558 -547 -13626 -9027 -9277 -7505 -13666 -11051 -11439 -10761 -13487 -18710
15264 -18710 -11846 -14318 -3574 2404 -764 6283 3407 -140 -4444 -4648 -19667 -18876 -9257 -20848
15250 -20848 -24421 -28023 -19108 -6040 -13465 -11599 -10826 -23036 -14559 5570 8657 -3581 -3920 4171
15236 4171 8446 -14531 -29279 -27325 -13768 -23015 -22473 -27767 -25852 -14343 7744 11412 -2145
15223 -2145 -1949 -912 1316 -2032 2489 -1161 -2571 -1379 -3360 -11078 -18121 -23457 -17498 -24122 -23293
15208 -23293 -26381 -23119 -15201 -6984 101 -4973 -12845 -19603 -19643 -10586 -22256 -25595 -12542 -14026
15194 -14026 -13345 -12184 -536 -6102 -15888 -8893 -9707 -7597 10142 20069 13211 -11809 -19425 -20353
15180 -20353 -10525 2776 4792 -793 -15652 -35585 -31775 -13419 -8938 5780 26236 33037 19817
15167 19817 2796 4105 7072 -4065 -5237 -16746 -29024 -21931 -18118 -16559 -35946 -45896 -41612
15154 -41612 -36324 -19287 -26273 -20264 -5514 -1909 -1032 -11595 -16965 -24077 -24436 -28460 -32160 -39683
15140 -39683 -37669 -36250 -28717 -9735 -17390 -9921 -16704 -33253 -36475 -30037 -15473 0 1462
15127 1462 -2634 1452 -1233 -9680 -15200 -7189 -3446 -1259 13423 6388 6410 -762 -4373 -7474 -13527
15112 -13527 -3503 4589 -3307 -14908 -9326 -7589 -11331 -16327 -18962 -28970 -24934 -28205 -25163 -24034
15098 -24034 -24029 -24093 -12786 -4949 5113 17648 573 -7675 1327 302 3906 6199 429 2848 5227
15083 5227 3964 -2816 -5431 4326 14203 6999 4346 4411 7939 18362 23891 11366 -8772 -13670
15069 -13670 -16633 -25078 -29058 -35655 -20454 -18680 -14600 3029 2466 -9146 -8644 -17990 -29933 -22428
15055 -22428 -5218 -12366 -20782 -10393 -5278 -15431 -11120 -4928 -14862 -13924 -708 3492 3341 16795
15041 16795 610 -3922 -9163 -11957 -4221 16604 15915 9644 13197 19305 5974 -2365 3782 -7573
15027 -7573 -26217 -21015 -12794 -10319 -11654 -26456 -18692 -4027 -10004 -10482 -8048 -18270 665 21136
15013 21136 17550 4540 -8084 -4474 -9456 -9846 -3548 -9599 -24522 -13251 519 349 -4409 -2558
14999 -2558 -1708 1838 -3923 -21566 -19609 -7798 -2989 -5694 -202 1283 -7763 -6256 5796 1416
14985 1416 -6552 -8416 -2822 8148 -11926 -24087 -9862 1848 14100 5463 -6099 -10701 -21595
14972 -21595 -22580 -16922 -12366 -10288 -7694 -13611 -23243 -16087 5525 16760 23157 13572 12173 28808
14958 28808 24352 6781 -2944 5080 -5949 -11591 -2063 -1898 -2530 3073 -1489 -6059 -7212 -10512
14944 -10512 -4387 -6105 -13259 -7343 3964 4783 -13112 -21803 -26715 -22154 -12733 -4007 -6673 -10119
14930 -10119 -42 854 5058 -361 -13552 -2691 4362 4890 898 993 6600 5626 9050 7123 9993
14915 9993 11618 2929 8606 20048 13748 -10611 -10468 5282 -2969 -5862 -1096 -11792 -5824 -4533
14901 -4533 -9502 -12071 -26978 -22139 -10423 -5648 -9947 -9473 -375 5338 7711 17269 19594 13111
14887 13111 7651 -10940 -2683 1484 -4217 13942 7097 -10540 -4903 4838 19772 12979 522
14874 522 -12493 -24040 -31279 -27725 -19292 -17670 -27076 -29347 -38204 -47809 -39219 -17934 -6877 -15695
14860 -15695 -32416 -30890 -10233 -12554 -20999 -17960 -20674 -17908 -15637 -15073 -8943 -4727 -4198 1083
14846 1083 3253 -2749 -7894 -15748 -16792 -20746 -21064 -28930 -23713 -15004 -7445 -11831 -8160 -5714 -6428
14831 -6428 -509 -553 259 4466 4839 4256 4562 794 4916 -7433 -9247 2191 4114 12624 15031 5200
14815 5200 -1141 -2615 -11664 -30544 -38003 -40849 -35263 -26740 -15154 -9939 -2613 3457 -1424 -6845
14801 -6845 -27965 -33448 -22708 -14851 -4566 1048 -4058 -9975 -22997 -23429 -21450 -16242 -12183 -13383
14787 -13383 -15344 1739 15119 29639 19736 12912 11736 7615 4990 -7957 -6798 1264 2247 4736
14773 4736 2542 5099 6133 6220 22282 30711 21955 6849 -5409 -11988 -4044 695 -6950 1700
14759 1700 16475 12165 5363 6229 1740 -18 1893 -12337 -22780 -13980 -9449 -4702 -7862 -8811
14745 -8811 -3402 -12096 -18092 -14510 -3916 -2898 -964 -5394 -6152 9992 26060 13650 8430 7714
14731 7714 8260 2895 -19375 -32056 -31679 -29676 -20934 -9040 -8416 318 12459 5322 2868 3399 -6670
14716 -6670 -22584 -23292 -17523 -9524 3123 6204 -2317 -9052 -16066 -11115 -6919 -3573 2470 -190
14702 -190 -8881 -12719 6093 3081 -2315 -16191 -26733 -15221 -25240 -30426 -20573 -19093 -15612 -7993
14688 -7993 2450 3155 -13999 -7967 6225 5077 -6774 -24125 -33299 -26790 -19284 -10535 -9757 -7613
14674 -7613 5721 5831 929 -2000 -4728 -502 1565 2621 10522 2246 -8973 -27103 -29891 -31361
14660 -31361 -36836 -40247 -24612 -22318 -20378 -20525 -24894 -17952 -7778 -21290 -26027 -16028 -8765 -3395
14646 -3395 -13888 -22953 -11628 1657 -334 15560 13220 517 -1707 -3214 -5948 839 -12669
14633 -12669 -20275 -15185 -2894 1740 -2138 -8602 -22389 -40303 -42603 -34980 -20321 -8970 -6914
14620 -6914 -15548 -17758 -19242 -7552 -6044 0 -4646 -1481 10931 6922 -497 -2410 -9911 -19019
14606 -19019 -19854 -13646 -7783 -5581 -1086 -1415 -8527 -19843 -16854 -18642 -24494 -28562 -24501 -20063 -14931
14591 -14931 -14741 -11922 -7244 1891 10823 -5228 -14952 -15972 -3509 3158 12424 -5701 -24500 -28250
14577 -28250 -30534 -34311 -26864 -21378 -21532 -17546 -16343 -4192 -262 5663 19973 19352 3950 -13434
14563 -13434 -5927 -3137 9674 4885 -4716 -5109 -10847 225 798 -2333 -13708 -16112 -17886 -7792
14549 -7792 -2792 -3324 -23075 -30770 -22909 -10821 1737 -3071 -2805 -4558 -1353 5064 -12572 -28180
14535 -28180 -24267 -9489 -2203 4341 1971 -13843 -26377 -19726 -27237 -15360 -859 1345 3067
14522 3067 3659 -346 -13305 -15406 -27944 -37445 -41574 -33745 -33109 -28620 -12504 -4236 -17395 -9339
14508 -9339 -2180 -11268 -9904 -7200 -5219 -5717 4020 10316 6867 -5992 -26738 -20715 -24300 -23645 -25583
14493 -25583 -24208 -9708 -10906 -19611 -8832 -3680 -11198 -29932 -35932 -30727 -29197 -18045 -1998
14480 -1998 971 -2740 -13540 -9482 -12986 -21328 -28551 -27925 -20607 -13718 -8672 -6089 -8338 -9797 -11994
14465 -11994 4012 2003 -14570 -21156 -20392 -22614 -22178 -19163 -18051 -10405 -13071 -12465 -2974 5043 17226
14450 17226 7013 -6418 -1331 3575 6553 16181 21319 14224 17868 27492 17541 4155 -4068 -5160
14436 -5160 -279 9280 21872 11960 12262 18015 11483 1313 -15601 -26505 -27869 -29948 -35353 -21696
14422 -21696 -8816 -2953 5847 -2385 -19961 -14850 -13255 643 -1205 -6181 -6027 7917 10326 11223
14408 11223 11616 10890 -3616 -1487 1457 4831 10620 4818 -13411 -8539 -646 -4878 -13648 -1291
14394 -1291 -6089 -15530 -19308 -13130 -13764 -17616 -14120 -4302 -3360 -176 -12293 -22191 -23748 -26307 -29073
14379 -29073 -33928 -30493 -17265 -6294 -9675 -12004 -17527 -17394 -14859 -16767 -15994 -3674 2176 -8709
14365 -8709 -8505 427 11730 6420 5422 -7107 -29974 -25052 -12004 -18392 -15753 -8967 4377 10422
14351 10422 10336 4317 3361 1418 -7565 -16962 -12993 -13856 -14954 -10287 -6784 -11261 -4385 -21674 -31261
14336 -31261 -27932 -29574 -18603 -20571 -33743 -29690 -24186 -19648 -5726 -19623 -32652 -24952 -9331
14323 -9331 6238 9158 606 4369 6808 -3885 3142 15542 17519 11329 5498 4908 -3088 -7239
14309 -7239 -7341 -10508 -19285 -18132 -28406 -42248 -42671 -45695 -35979 -37495 -27788 -23974 -18277 -23023 -23589
14294 -23589 -10129 -6808 -10987 -17632 -24500 -22281 -12044 -7356 -7043 -2422 -5198 906 2393 9348
14280 9348 8783 13967 4339 -2603 -3756 4882 2251 -4578 -534 -3145 -4495 -3911 -7023 -13170 -18499
14265 -18499 -9785 -8881 -6685 9460 8320 -997 -4810 -6279 -14059 -6072 7181 22789 28337 5678
14251 5678 -7419 -5962 7902 16519 7509 7003 -2636 -6429 -5564 -5671 -3066 -11340 -12455 -224 -15838
14236 -15838 -21064 -23869 -25958 -29005 -16085 -17575 -26947 -16353 -15703 -18850 -18591 -12396 -3854 110
14222 110 -15232 -24477 -14304 -3377 -12006 -5628 -4248 -9971 -21485 -17981 -6949 1966 -6875 -21259
14208 -21259 -12772 -14604 -12814 -16717 -12589 -8642 -7063 4379 10581 4205 457 18798 20331 7692
14194 7692 692 -5418 -6216 -9468 -8816 -16971 -8500 -6454 2049 11310 -182 981 -6320 -6221 1227
14179 1227 11434 8529 10070 8800 5155 4982 -165 -333 -3423 870 5763 7172 494 -387 0
14164 0 -252 -6238 5419 9191 -2571 872 -9227 -13096 -10919 -8521 -10150 -22058 -19976 -806
14150 -806 9502 -13102 -17280 -12158 -8157 -7612 -14114 -19975 -4581 4016 3853 5050 1956 -9817
14136 -9817 -25667 -25329 -20264 -10421 -12310 -21774 -41336 -35418 -17190 -2706 8022 23929 6489
14123 6489 -6341 518 4804 1612 9161 11532 16646 605 1 12381 14292 18087 19174 4356
14109 4356 -3624 -6033 -9603 -18062 -14648 -16271 -24451 -22917 -19984 -21289 -14567 -13163 -19617 -12574 -4636
14094 -4636 -2822 3766 -8516 -4517 12113 11950 10115 4149 802 -2511 -1108 12045 16971 25253
14080 25253 28225 24983 14715 6501 877 -707 3315 22223 38394 41568 45850 44271 29252
14067 29252 39191 44735 29147 32958 29754 15290 25529 23215 10595 4004 2151 -8587 305
14054 305 -2507 4948 12584 17788 11627 13727 18971 18439 -3738 -13671 -2190 7737 -593 -1191 3173
14039 3173 3858 2254 -821 2310 5027 -2006 6621 7800 2370 1282 -1942 4249 3550 -5606 -17210
14024 -17210 -21376 -6810 1815 -1922 -2341 9363 14505 -974 -17230 -14780 -3988 -8400 -14097
14011 -14097 -2920 5223 -7041 -13969 -2259 -9029 -16232 -22061 -27492 -19683 -6197 -8177 -3943
13998 -3943 1198 -7353 -16335 -12542 -589 11286 9107 -3792 -9068 -2541 2110 -4839 7624 16941
13984 16941 3321 8261 577 -10595 -13678 6530 11568 6791 13061 11409 3913 5749 12430 2874
13970 2874 -6548 -13966 -24225 -31872 -16006 7337 -914 -12075 -13644 -19649 -19013 -29954 -29719 -18146
13956 -18146 -8418 -3349 3849 2964 6865 7546 15274 23350 30563 27526 17657 12111 18608 23233 20373
13941 20373 14167 8657 8572 16262 12669 8220 1099 919 -11184 -16421 -13401 -19712 -13989 -4325 8950
13926 8950 10587 2362 -7144 -2942 -1565 4294 4388 -1084 -6627 -7582 -14795 2088 16988 8701 -6902
13911 -6902 -10441 -9138 -1600 -9009 -5385 -1576 -15646 -25477 -8928 -13370 -18489 -29744 -20461 464
13897 464 4351 331 -2537 -14277 -14994 -27597 -37473 -12113 9394 22442 28402 21681 2207 -9633
13883 -9633 -9940 1039 3778 -1878 -11 6719 3759 -8633 -32617 -31507 -22364 -18443 -19697 -12844
13869 -12844 -7292 3295 -3167 -861 674 5133 18099 12266 9208 -6145 -9011 -11602 -10137 -9635
13855 -9635 -12937 -6244 3577 9588 14084 7773 3612 615 9484 11997 571 -1945 -5178 8445
13841 8445 30412 32434 29154 33261 31769 35814 38433 38067 28470 21295 17820 22370 21433 18666 21895
13826 21895 3068 -668 -1153 4439 15589 9270 4203 20398 17906 16204 26594 32797 15012
13813 15012 18518 26506 17521 12306 18501 6680 1800 12912 19407 15640 13391 7672 11077 20835
13799 20835 18350 4976 -11690 -3127 9427 12939 20778 12282 17936 24897 14273 15330 17230
13786 17230 6786 12857 26159 25215 11897 3080 5845 11674 8248 -1187 9381 13954 12285 17684
13772 17684 12513 443 -8592 6544 -1541 -7795 -17863 -24452 -23449 -5497 9822 14042 3096
13759 3096 2478 -1124 -8273 -13541 -6698 1852 3138 -11099 -22917 -16606 -1193 7517 2555 -7238
13745 -7238 -2582 6252 7808 -1386 -24 2468 11121 1324 1840 10727 22178 20876 9309 -4642
13731 -4642 -15362 -13051 -18396 -28088 -32602 -13756 6550 6214 1462 3566 587 -6264 1310 2440
13717 2440 8305 18023 16084 2200 -254 18533 10184 -6084 -10077 4334 9198 13210 18553 2808
13703 2808 -7042 -2200 3439 5191 2403 -3558 -3070 -5460 -6219 -6416 -13385 -13489 -6166 -4857 -2184 -373
13687 -373 1914 5545 375 -13773 -15443 -4643 -7444 13093 11688 4315 12247 507 -2391 3268
13673 3268 10063 8967 11908 19743 6122 1636 6324 2761 6901 8134 8410 2930 10469 17084 21163
13658 21163 25815 24473 13869 4680 -1945 3395 -10406 -31084 -37485 -38255 -32858 -10758 7424
13645 7424 4413 3831 158 3786 12509 12087 1797 -5695 -11913 -4782 -10363 -8048 -4814 -6586 -15581
13630 -15581 -10826 4253 8342 -1807 -8817 -8795 -12122 -16290 -5475 -10375 -17276 -21860 -15132 -5496
13616 -5496 -20756 -12575 -9934 -13016 -26724 -23903 -21290 -15112 -9781 -8540 -13888 -3000 6428 1255
13602 1255 -9647 -10128 4566 -1458 -7327 -13033 -5548 6326 1248 -6945 -2046 15120 11037 10092
13588 10092 1820 -158 283 10564 5562 -2695 -3679 -11161 -9484 2131 9674 13532 20415 8645
13574 8645 -7117 -3914 3246 3757 -20712 -29374 -25751 -9485 2115 6433 -2399 -9145 1991 13882
13560 13882 4553 4458 5976 568 -13647 -6746 2768 -2536 -10384 -5488 2922 416 -12969 -10798
13546 -10798 -2518 -579 -5856 -15252 -11171 -2775 -9890 -2118 5181 802 1332 6714 1321 -3649 7391
13531 7391 -3434 -8421 -12715 -7491 7421 10555 -4144 -1005 -4083 -12458 -12348 -14895 -12708 -9105
13517 -9105 -2087 1431 -3434 -10422 -10807 -17717 -28724 -23767 -14245 -2485 7064 5472 6440 10478 5641
13502 5641 -2425 -6099 -3037 4542 10326 18633 3211 -9445 -12665 -12238 -8776 -19192 -17814 -14893
13488 -14893 -17437 -18057 -27975 -29743 -25288 -15608 -9331 -4569 -3630 -7628 -9808 -14766 -7806 -7344 3236
13473 3236 9427 4323 343 15444 25756 29929 22790 18892 15006 16677 5317 5718 4161 13031
13459 13031 8448 -1082 1606 -3576 -10182 6265 780 41 5949 5497 9064 4489 4002 -2580 15614
13444 15614 21659 15897 -4761 -16400 3062 8034 12175 13766 6123 4381 6600 7701 9129 3663
13430 3663 8193 10361 5139 3437 14069 14788 7095 5173 842 5830 -9900 -11972 -10002 -4488
13416 -4488 3884 12976 7484 7784 746 -9067 -7038 -8888 -12984 -9981 -4859 1259 -255 -14212 -12235
13401 -12235 -18253 -24151 -22369 -28537 -24221 -26312 -33712 -30559 -20159 1637 8453 5516 3 -6470
13387 -6470 7757 16140 18533 14646 1025 -4184 -12534 -30093 -21715 -8438 -216 -10217 -9937 -12922
13373 -12922 -11360 6221 7110 -4117 559 -1208 2760 10280 10058 11163 18826 23084 15429 -912
13359 -912 -11189 -12493 -1361 10028 20169 23088 21244 22522 17364 12325 3654 -3574 -16119 -17083
13345 -17083 -10313 9108 1620 621 5480 9144 3624 2256 12748 17563 13313 4992 -1008 1123
13331 1123 -4160 -5341 -15116 -7596 -5668 -12701 -17890 -19901 -6059 -2064 -212 11292 12647 4813
13317 4813 881 9734 16963 3034 5881 1953 -15247 -24171 -38380 -42656 -36971 -24212 -12926
13304 -12926 -6202 1139 7005 8384 2547 -10109 3153 5018 -15746 -21441 -18760 -15048 -4160
13291 -4160 -2064 -1919 -15681 -13470 -7982 -4996 -6114 -7900 7969 3671 -5969 -12035 -5893 -19080
13277 -19080 -18664 -18261 -13832 -16431 -21089 -9699 -6776 10630 20478 23386 14020 9550 2959 -5941
13263 -5941 -5227 -14181 -18849 -26855 -16937 -13464 -11372 -21035 -25099 -9582 6472 13635 5931 -4250
13249 -4250 -11726 -19350 -16996 -10200 -14934 -6928 -8643 -10677 -13225 -25506 -29836 -19101 -23731 -17791
13235 -17791 -13255 -9942 -2340 4362 6169 12658 3212 5770 1612 4996 12726 18270 -1761 -2375
13221 -2375 9124 13865 6618 4185 6196 -1098 -546 -5674 6918 19038 15079 10823 -2633 -11204
13207 -11204 -13833 -10514 -5641 4443 14695 25930 21458 12840 -4688 -12404 -4122 -2514 1756
13194 1756 -9059 -19837 -4520 4158 -1168 -7096 7285 24933 27881 24404 16616 16483 15782 13521
13180 13521 10162 9233 6712 -636 1516 11710 4800 5312 6678 -1362 6202 12200 -1409 -8018
13166 -8018 -5048 -5646 -21045 -17112 -2132 -5512 2424 11938 21897 23332 21027 21781 12809 4026 9024
13151 9024 7130 8995 303 -5943 -5836 -7804 -2671 -13776 -15797 15501 19342 13778 11066 139
13137 139 -7984 -106 13845 23856 34385 27560 8194 10552 9268 8760 -2768 -4229 -3212 -5345
13123 -5345 -10528 -2261 591 -421 -382 6561 17032 11589 1993 2402 -770 3732 872 5687 -12455
13108 -12455 -22379 -17343 -10826 -11673 -15996 -23642 -13995 3880 16896 6773 780 5902 -6669 -14147
13094 -14147 -8194 -4959 -6601 -11116 3379 23328 28798 12375 -2970 5141 2635 -4417 -25
13081 -25 4575 -452 -3638 -7609 -12639 -5614 8354 17487 30789 61066 51720 29572 30047 9928
13067 9928 1011 -3559 11959 24858 35622 49180 57491 56276 61721 85404 103692 132960 130947
13054 130947 148800 187983 209971 263235 337462 426147 534649 656727 765656 858638 950931
13043 950931 1029500 1054412 1033345 991994 920273 816486 698167 583982 485158 397049 321242
13032 321242 251240 227553 198684 162834 137968 127911 124983 122100 90643 74718 68645 68564 71627
13019 71627 58903 54119 50542 39761 33507 33901 44235 49367 38050 39377 40655 41363 39148 30282
13005 30282 28458 37469 52788 55044 40535 40125 36816 38231 40723 29504 19960 17936 10420 -167
12991 -167 9915 10827 9361 15847 17191 13905 11778 15811 13615 16166 14344 14796 10640 10611 21826
12976 21826 17373 7689 3128 -5509 -7013 -5419 -5423 -5757 -18466 -10184 2203 10642 10141 9676 -7727
12961 -7727 -12751 -3086 -2716 16847 19373 8843 8539 7692 7992 -1415 -6705 -3616 -396 4265 4874
12946 4874 7521 17867 17019 27353 31646 15873 100 11233 23834 22082 11043 8724 1828
12933 1828 -9014 3931 21504 46779 56576 42571 39255 23132 11923 9034 3957 1698 -5750
12920 -5750 -8184 -2093 8534 12649 5887 12749 16922 7500 10340 7827 9560 -2530 7232 16148
12906 16148 7038 14515 26488 15169 16554 15960 14376 22209 27929 28543 35378 46370 53546 55082
12892 55082 59417 57982 51985 61910 66449 58495 62724 78068 88786 97983 107514 124982 137939
12879 137939 156154 162702 166623 182017 182303 173159 149305 147841 150809 136753 117849 102803 104476
12866 104476 96960 82654 86622 75260 67093 67251 65117 61171 57502 57469 59403 64776 61284 59442
12852 59442 46950 45043 48496 51069 63136 69398 50893 32823 43521 48011 35436 30244 32856
12839 32856 30071 34642 38312 38859 40708 43577 45474 35035 30862 25497 30858 38138 59146 73677
12825 73677 79319 78942 83082 82245 79697 74705 89339 108496 105064 79309 58606 57875 52302 35263
12811 35263 19187 4188 -15359 -22599 -7277 -13559 -3492 4670 24392 24830 25797 22958 32372
12798 32372 49140 58153 48797 51611 50215 57848 56202 46513 26043 13366 33201 21406 26570
12785 26570 28465 16568 24414 26255 20433 26421 31150 43147 48902 36774 37914 52428 65730
12772 65730 60528 69492 70595 79951 78533 67214 59973 63462 66245 73775 97000 108814 103996 108321
12758 108321 124214 144385 150343 151900 164983 205609 233231 262302 287048 298827 306720 312307
12746 312307 303826 300681 293028 267970 232903 208800 203394 205175 197051 187940 188376 176000 167924
12733 167924 155593 141038 147017 152010 155381 161581 181890 199686 204912 205655 193577 192218 191480
12720 191480 178720 171359 168464 166545 157682 154984 158988 167987 173175 187532 200112 202574 218130
12707 218130 225140 228722 240628 243739 245982 239833 241132 246131 252071 256892 265613 275595 289334 305436
12693 305436 318569 330532 330455 332082 334596 336904 350655 364302 381982 413087 443105 462985 476217
12680 476217 495166 509713 525648 537754 563588 590434 601191 613028 643766 701468 745777
12669 745777 772720 818349 862570 943302 1002217 1042490 1096217 1166474 1247899 1320038 1405328
12658 1405328 1496247 1601901 1721224 1847725 1979476 2133389 2317569 2518514 2742090 2992309
12648 2992309 3284138 3632386 4083736 4637956 5327099 6162123 7132453 8272751 9562491
12639 9562491 10978386 12532739 14248270 16227224 18663128 21894492 26499531 33356937
12631 33356937 43522108 57575272 75360497 96277667 119294281 143051428 165462697
12624 165462697 183915853 195903085 200332056 197248869 187315312 171461317 151172023
12617 151172023 128602799 106190765 85879555 68542866 54470735 43617560 35690160
12610 35690160 30115754 26169640 23210223 20820999 18768272 16915850 15207817 13614373
12602 13614373 12152156 10824247 9657212 8656302 7775618 7026031 6405412 5883300 5414980
12593 5414980 4987809 4613221 4285385 3980172 3688342 3440064 3234783 3028464 2836272
12584 2836272 2658212 2505239 2371565 2248340 2119875 2011749 1929439 1847056 1764074 1694479
12574 1694479 1602267 1511652 1441366 1359982 1299904 1244868 1178518 1118388 1068680 1023147 973956
12563 973956 918096 897435 872556 833325 812675 802299 773536 743815 719036 683505 650611
12552 650611 640026 611518 591550 571794 557721 536562 507870 494471 481069 463480 445100
12541 445100 408160 389680 375169 365231 371745 366171 338911 320608 325677 327025 317103 318607 312382
12528 312382 300362 273096 241121 233032 229252 231499 218715 200029 198505 204419 211767 217874 232685
12515 232685 219836 205105 205893 196980 193626 190246 178836 156074 152271 156434 151629 152688 160175
12502 160175 167098 174929 172773 166187 170248 158346 140736 147633 160290 147380 139451 141302 146993
12489 146993 150297 132676 110359 101883 103951 106117 103117 95438 101866 108005 126659 132048 147002
12476 147002 149332 143807 141893 142405 139911 145368 147508 142157 140980 143329 136045 135377 136799 137709 150179
12461 150179 150607 126180 101973 95128 97155 102368 101488 104380 100428 92124 92775 105041 114971 100264
12447 100264 96854 108295 122977 138392 150069 152441 151587 144644 132201 119542 112847 104571 96287
12434 96287 98692 89034 67884 41352 21751 19681 30568 26919 31154 37283 34773 23638 41728
12421 41728 44558 36486 25740 25379 32746 33471 33480 40529 40101 25710 17672 15326 31020 41560 31919
12406 31919 27924 36747 55009 57389 52187 59329 50852 33927 31935 23835 13077 19114 21807 28115
12392 28115 15740 16727 23955 29620 31728 33047 46637 38639 31776 28112 25506 29002 26019 36711
12378 36711 25505 34699 53031 53956 43560 41418 41611 31417 41890 35871 16293 23921 33474
12365 33474 36770 27220 31170 47156 39203 28217 22508 33557 28443 20323 16946 9589 15981 1716
12351 1716 -1033 -6056 5387 12003 5575 756 19614 24570 27883 33250 29102 27222 35329 38782
12337 38782 31767 29482 30184 32232 20990 15095 17091 17616 21018 36087 46666 50004 42618 44019
12323 44019 26264 23571 28677 29397 24809 22919 10710 8137 13137 20278 15370 12688 13835 23897
12309 23897 29482 19712 16191 24512 29369 31532 29788 27464 19158 21474 21364 20744 20367 31289 26571
12294 26571 22367 18335 19221 21887 29920 43012 48977 30763 21605 8737 14320 15416 14372 40620
12280 40620 50357 31581 27562 28223 41080 45820 42117 30044 21365 13283 7610 3857 -1221 -8769
12266 -8769 -9425 -2053 6665 7807 9186 1785 3347 6711 21016 34559 36466 38259 35740 30449
12252 30449 12677 -5609 5261 16653 10402 -270 389 4243 22396 34256 26883 8556 -3698
12239 -3698 4575 16655 24184 27427 29244 28907 29445 48928 35529 24180 25998 35264 32229 18983
12225 18983 23135 31964 29601 46821 57658 70976 70954 61140 58845 65720 67219 83678 102017 93675
12211 93675 98540 116456 142348 167086 193704 235327 274823 327918 409193 521994 639239
12200 639239 746531 851752 962325 1040149 1061824 1032630 973842 905045 813979 710490 597145
12189 597145 498386 409520 344030 292454 245900 202031 183012 172526 157759 129138 118331
12178 118331 118373 95957 75265 65523 51952 54571 69227 44815 38556 38012 38579 42172 33220 17739
12164 17739 19602 31703 16362 16682 31783 28318 26469 23350 21944 9755 -6009 710 8892
12151 8892 7431 9785 4318 1806 13308 24396 30767 24163 11006 4059 15540 14540 3521
12138 3521 -4536 -7126 -2693 2745 6376 1458 979 4482 18908 25816 16196 19683 20321 24572 25781
12123 25781 6312 -4453 -2345 2088 1510 18132 9132 7555 5645 14539 20203 8773 1626 8810
12109 8810 14168 14277 9843 13890 34586 50068 57228 65196 77178 95925 100930 115853 132699
12096 132699 134377 129561 134075 121195 115033 82168 66823 73672 77594 70486 53873 35753 24247
12083 24247 28449 10530 8340 13971 21903 15806 13681 15187 11453 11450 -991 -8206 -11472 -18298 -9452
12068 -9452 -5928 -22737 -21053 -8156 -7978 3333 7340 6659 6642 -2931 -15900 -20986 -16951 -6643
12054 -6643 -4728 -1124 -15045 -9108 -5431 6383 15339 6874 4980 20776 28663 24194 19029 12411
12040 12411 -5654 -3725 -6924 5395 795 362 153 195 1117 13266 22128 22146 16786 18485 9615
12025 9615 7570 10934 10424 14318 13307 12311 26242 28570 23367 13941 2953 1314 13014 18252
12011 18252 20274 17006 6069 -153 -12386 -15900 -4130 -3412 -16130 -5490 7963 2057 4288
11998 4288 7457 -134 -1807 6200 9193 4951 11456 -2555 -2723 10777 12773 14016 6353 -4288
11984 -4288 5167 14970 11055 1242 -9184 -5168 9298 16202 25733 27071 21116 2661 248 1748
11970 1748 2115 -3844 7489 11729 12497 -5402 -3405 -6177 -5676 -6281 -12500 -16011 -11134 -16934 -21890
11955 -21890 -20356 -22147 -13608 -13409 -15124 -14984 -9185 -18872 -18183 -8861 6067 14490 9707 -1178 2063
11940 2063 4580 5687 7399 13103 6669 4695 -143 8922 8402 -6517 -2590 10065 7896 11672
11926 11672 14674 4070 3562 -4842 -10637 -7048 4994 6959 2096 331 1623 5659 -7900 -16803
11912 -16803 -6839 -5413 -13249 -22938 -20331 -30886 -29737 -19060 -16138 -3891 -7371 7621 22649
11899 22649 12120 8924 16038 15309 8312 4061 -12346 -8489 -2850 9243 15276 4356 1322 -6227
11885 -6227 -4142 6369 -905 -13051 -7526 -4807 232 4470 -12863 -13529 -6857 -14411 -21403 -25080
11871 -25080 -16309 -12704 -12582 -15009 -4923 -2878 -16217 -21783 -9882 -8346 -27263 -20654 -12857 -15669
11857 -15669 -12740 -2121 -2757 8236 11419 -1828 25394 38678 17868 13948 22956 17893 12117
11844 12117 743 -7939 -16682 -24220 -19471 -18263 -19332 -20466 -15493 -14561 -11703 -17871 -29428 -24097
11830 -24097 -2533 -8940 -15475 -8562 -6057 -7406 -7885 517 2106 -4340 -14542 -20165 -30259 -24171
11816 -24171 -20281 -7827 -8461 -15079 -17774 -23137 -19165 -12238 5538 -3586 -6241 4685 9817 5623
11802 5623 5553 14514 12164 -5360 -11274 -11904 -5978 -3304 -5964 -3883 -5863 -7602 -9311 -1183 -2922
11787 -2922 -19619 -20037 -7359 11432 25918 11088 4617 4398 -842 -2040 -11351 -12387 -12547 -10265
11773 -10265 -14893 -6702 10863 12937 9800 -4689 -16664 -7317 -523 -4908 -1559 -17518 -24076
11760 -24076 -15898 980 -5687 -20643 -16622 -5442 2360 2838 -4728 -17498 -11916 181 1501
11747 1501 9269 7509 -4219 -580 -3191 -10610 -17396 -19939 -18636 -28720 -18353 -7722 -10120 -9080
11733 -9080 -5884 1762 -3065 -1739 5271 4829 -1423 6617 8981 1308 -5671 -1366 -8403 -4065 -1430
11718 -1430 -18696 -19027 -8856 -7980 -2737 -8134 -325 791 -9473 -6550 4926 4268 4800 1230 3295
11703 3295 11765 5828 -1691 -12848 -3951 7985 8202 -1728 -4707 -10319 750 642 3039 3569 -7998
11688 -7998 -23662 -28722 -25501 -21929 -1290 4692 4018 -6845 -11971 -19461 -30781 -33110 -27592 -20204
11674 -20204 -17915 -8875 -1318 -4658 -2079 -2218 -2684 -3629 -17664 -19325 -23102 -18787 -6234 -6871 -11177
11659 -11177 -16204 -22027 -17362 4119 10066 -2563 436 7696 13361 11710 17032 10034 -9075 -6675
11645 -6675 446 1005 -1476 -10291 -2707 -2545 -12639 -16443 -18085 -1367 -6616 -588 10554 -10450
11631 -10450 -22831 -17098 -19414 -8389 -10581 -10038 -14400 -13618 -8933 9333 8673 12118 20220 19469 8900
11616 8900 2210 -3602 -1594 -4497 -9180 -11145 -10278 429 10869 9592 18580 16367 13295 7876
11602 7876 8710 -1153 8169 20338 18531 25137 22461 16610 5937 -9324 -16467 -7495 10503 13349
11588 13349 8238 1979 -13216 -11869 -13191 -14574 -4949 -16 -4384 4117 11704 2097 -7933 -2472
11574 -2472 743 22842 23169 6121 -6190 14989 18448 8804 -146 -4792 9019 6145 -3694 -17063
11560 -17063 -26234 -22179 -7807 -8304 -14220 2881 349 -3819 -16003 -15667 -22341 -26399 -23823 -5821
11546 -5821 -6199 -19017 -33882 -34782 -33815 -27320 -17391 -16840 -16607 -6523 -4638 -3497 -1292 -14876 -9134
11531 -9134 6819 9947 6228 4139 8068 14667 17038 8636 -270 5076 1685 -6047 4377 13127
11517 13127 11196 4960 -76 -5089 -14707 -8771 17905 7410 -10768 -13713 -18788 -28929 -19213
11504 -19213 -16690 -7420 -1756 -18757 -26277 -23606 -18015 -6269 2700 8280 8157 3641 -13275 -6040
11490 -6040 428 3595 -3632 1130 4185 3329 -1869 -71 -10983 -29329 -30829 -16579 -13385 -18293
11476 -18293 -24711 -2088 18562 11590 5013 -5008 -5609 -6273 -597 1342 3841 -3448 993 2472
11462 2472 -1553 -7466 -3395 -6604 -1756 6765 12916 14526 4181 -2725 -8935 -10609 -5056 1415
11448 1415 4775 -4474 -15499 -4826 15638 16196 971 -8152 -29697 -24376 -24911 -21235 -25657 -31230
11434 -31230 -30444 -24923 -22515 -21783 -11980 -2808 -16701 -5543 -399 -9940 -7449 -13058 -11292 -2845
11420 -2845 3945 -3353 -8064 -21058 -30578 -13473 9671 -704 -10217 -14714 -18266 -15159 -11551 -3711
11406 -3711 1030 5244 9750 14022 9437 15275 10915 -5939 -10317 2564 3303 7543 -5138 -12176
11392 -12176 -13449 -19497 -8232 -7360 -10602 -4892 -5485 -2427 -6121 -6370 -13883 -23088 -25111 -18690 -6797
11377 -6797 -7193 -7024 -1526 -6418 -14490 -14229 -8749 -6952 -5624 -12559 -19039 -16133 7004 10972 587
11362 587 -4748 -1622 16 -8725 -13339 -3098 6905 5356 -4845 -8659 7154 5025 -7444 -4548
11348 -4548 9979 10104 11546 7814 7536 11056 27221 34032 22635 24910 14202 -2207 -7852 3902
11334 3902 3455 -2034 -5759 -5301 -5163 -13959 -7985 -5315 13545 23742 22558 21379 16568 19815 16127
11319 16127 10109 10838 19016 13755 -4933 6522 -2516 -9790 -3915 -763 3978 4294 1352 6668
11305 6668 587 7658 9443 16352 23620 30189 42509 45854 61582 51213 50593 59146 47259 25861
11291 25861 10859 4406 -14291 -13492 7824 3814 -4441 -3952 -6168 -8205 7158 4704 -2255 -9272
11277 -9272 -4364 3832 6690 15181 13497 12950 8294 1921 -1591 433 -12314 -13618 -9191 -4249 5927
11262 5927 2073 5186 14199 24940 18183 4869 -7875 -81 254 -8866 -5273 4581 12782 19629
11248 19629 14988 7422 3723 4961 15635 11001 317 5444 13812 28711 44544 40657 32679
11235 32679 27034 17299 32579 57677 59343 67742 71557 70347 60418 51832 46341 34302 11208
11222 11208 -1759 -6293 -11375 2090 2231 11640 6802 5973 11398 10090 5160 25122 26095 31143
11208 31143 47386 42618 40570 26234 20879 27229 29329 36399 35470 36318 32826 23228 33610 34365
11194 34365 39596 36319 37918 25194 28339 38188 32312 18788 32590 39869 31086 22583 23347 30139
11180 30139 26806 17407 10484 29335 40489 37689 29558 22803 28915 48217 49239 43991 43135 42051
11166 42051 39781 30492 18045 10866 24795 36929 30256 19756 11807 1314 18388 43293 45616
11153 45616 49582 52666 44978 23869 7760 8408 18508 33351 27430 10214 13324 27150 37461
11140 37461 33776 25793 24436 34655 26467 15901 19632 12570 18833 12900 13389 8336 17090 18990
11126 18990 25702 29482 19541 28372 26414 13815 8785 9043 7126 16266 32630 41496 46568 44281
11112 44281 31686 20001 4841 -6544 -4990 2406 -3517 19666 23042 13696 19583 17717 8841
11099 8841 13097 6940 3790 14333 19573 16942 12388 11239 11199 12104 11198 5251 5129 -2931 1481 10220
11083 10220 4579 15003 9567 12678 20562 14170 5119 4857 3793 14273 9303 4529 8369 17554
11069 17554 14986 13953 13358 12452 13881 11062 15106 11912 2710 -1122 -14360 -21215 4831 13371
11055 13371 13177 16757 29336 20586 6180 8394 5108 3377 20959 12905 4606 13529 10896 13921
11041 13921 23131 22361 19825 3854 10483 22881 26156 23474 33225 28562 22154 21059 26583 32156
11027 32156 37737 27883 17487 29651 32190 37300 39538 30378 18738 11875 15636 4861 14011
11014 14011 19776 16221 22204 15530 25803 36511 32754 11755 13325 26395 36674 39569 37778
11001 37778 57301 75091 50435 32023 11537 14946 24327 33129 35982 50454 52003 52316 47190
10988 47190 35499 29780 26654 23453 15913 21988 29855 34812 41941 25446 7481 12845 22103 5890
10974 5890 -1851 2851 419 -6131 13923 40236 52643 59185 59142 48513 38389 36799 38159 41586
10960 41586 33574 28414 28964 39263 45396 62981 66944 40391 45657 61122 70800 64939 59929 65099
10946 65099 76833 91315 93994 97676 113396 149384 169511 187312 224984 291986 385246 521253
10934 521253 737946 1073798 1573883 2050222 2263244 2232691 2089761 1877830 1583031 1230414
10924 1230414 880699 619299 466796 369030 307554 256762 231397 206433 186508 177005 169069
10913 169069 153227 147626 135352 127011 122397 100230 80984 77288 77358 76073 63574 49481 30042
10900 30042 22296 32970 45720 38390 36698 32725 28067 29110 26146 28078 19265 28078 31705 28586
10886 28586 37998 36189 40205 35472 24152 26725 31699 45201 46542 38586 29384 21745 16140 18665
10872 18665 20409 23811 23432 27042 37039 52960 57411 56537 39133 19211 21640 31487 49648 46623
10858 46623 47023 34373 34045 30041 31841 22874 30416 28837 23104 29941 26815 26472 29004 30045 21189
10843 21189 18642 20296 22070 12332 7042 1085 4114 5818 15026 22947 19190 25683 40992 44016
10829 44016 40464 48058 58202 63799 73644 75559 69615 70609 77392 74521 67994 55843 48301 35441
10815 35441 27974 28807 23219 24534 35346 20428 17256 8139 5564 3583 -356 989 8840 30583
10801 30583 33702 28644 47388 60174 67517 53410 34066 24136 24058 21262 8653 13292 27095
10788 27095 34428 24119 25482 49563 60350 68920 74984 74564 83529 81132 67788 68956 70961 74017
10774 74017 60903 65566 76709 104609 143641 191163 237493 292464 343352 349920 359947 357972
10762 357972 312354 261130 207442 157842 136389 112258 91080 73808 76181 58537 51642 67636
10750 67636 74316 80778 81166 68533 55527 63324 79905 85360 93636 106072 91743 94148 95272
10737 95272 104049 103219 91739 84043 79124 73064 71752 72595 82426 76261 76070 69553 66706 59687 50342
10722 50342 39092 58503 76664 81151 89113 91071 96336 98225 106626 113535 117492 107524 105376 101926
10708 101926 107700 128155 144947 150471 141086 124145 81163 36504 -6283 -14461 -16841 -15989 -12070
10695 -12070 -11362 -26280 -27691 -22022 -3435 7722 39056 63200 77469 91273 87371 85786 93030
10682 93030 80724 55283 51226 48723 50220 48805 33506 48084 68306 54591 51239 42609 36497
10669 36497 20580 14401 31621 46201 60428 67915 88673 107740 102707 79253 41985 28891
10657 28891 40013 56667 56356 79809 97373 114975 127007 134986 138739 148263 159253 184342 195669
10644 195669 208712 231382 271595 298796 337774 407907 485411 544265 572146 576426 547150 480037
10632 480037 423480 371282 332558 306475 296710 298168 303777 302666 277222 249987 233332 225861
10620 225861 214653 209876 207382 208100 218843 247060 275737 305081 321506 327276 319895 326388 316313
10607 316313 291539 284064 268281 263143 271672 276002 277129 279960 310868 334283 352572 377412 381102
10594 381102 376339 385059 375942 351337 338449 320938 330578 332950 349474 384065 410363 443446
10582 443446 468401 475432 477122 487649 492416 485406 486903 498887 536214 567843 591596 610524
10570 610524 654009 697153 724026 746251 776652 781405 772315 790505 820353 843677 861567 899347
10558 899347 958124 1020594 1096042 1189905 1292121 1387220 1480921 1590942 1706606 1840664 1973513
10547 1973513 2090020 2221189 2356799 2523113 2719697 2928323 3140477 3365091 3619073
10538 3619073 3899989 4226970 4614969 5057193 5598751 6284342 7182865 8298840 9533015
10529 9533015 10653937 11701417 12859638 14194269 15786483 17718401 20138800 23320990
10521 23320990 27757091 34038119 42898873 55586694 74678775 104983250 155377412
10514 155377412 237808680 343959731 416922428 426231528 404527868 373535487 331493593
10507 331493593 268582745 196056021 137201462 98567173 74530987 59029481 48594412
10500 48594412 41241485 35717162 31382873 27988759 25434652 23453072 21652585 19837213
10492 19837213 18119174 16525001 14995667 13531902 12197181 11069214 10121065 9293081
10484 9293081 8565814 7884781 7253173 6694124 6218759 5799905 5413226 5039385 4722172
10475 4722172 4459422 4207954 3953214 3722312 3525071 3338904 3177742 3039265 2899553
10466 2899553 2780138 2667412 2547314 2422437 2326965 2230685 2128522 2009070 1910315 1804299
10456 1804299 1686248 1606711 1526481 1454545 1399999 1359051 1333961 1297962 1252615 1209615 1161531
10445 1161531 1133424 1100682 1058891 1016928 956133 913700 889758 869728 859732 827195 824744 812064
10433 812064 784691 739651 688172 641144 595214 559285 531210 514548 502266 495508 495391 508669
10421 508669 515551 521337 522978 492809 458589 431280 398946 374520 350266 327454 307770 314836
10409 314836 314544 329447 348348 354867 377136 383425 371248 362341 353997 335365 314242 287637 273196
10396 273196 272401 253878 234117 225941 247375 263000 252106 246936 241396 218365 197402 193132 201457
10383 201457 205097 215198 217715 196648 184506 175754 182763 185520 183413 173860 182217 186305 185853 179993
10369 179993 188578 186619 176300 187541 201515 207072 208180 209988 199197 174198 161923 164602 151061
10356 151061 158554 196921 236091 249328 249603 222746 194461 192061 187832 175860 160857 156483 166188
10343 166188 176442 158867 137834 136452 135742 118056 109297 108739 121998 130015 149309 172009 193125
10330 193125 218940 235351 239238 236558 225422 210806 203680 195912 167913 147711 135421 119935
10318 119935 76698 24995 -958 4487 17663 34945 47721 44825 36434 25635 21661 13888
10306 13888 13169 33750 37448 53774 70214 74151 87862 99856 101378 86563 83101 85725 80684
10293 80684 61695 52027 57577 62712 48708 52310 62089 55501 48015 36481 36666 33051 34072 49717
10279 49717 56327 47939 43190 62275 74690 52000 43051 47092 48288 60359 57375 50131 58907
10266 58907 73485 75031 73375 78038 79864 68535 49272 32837 21360 25976 37907 32127 28230
10253 28230 36856 40443 45399 42646 47763 53950 40069 23661 16442 13414 12344 11919 12950 1834
10239 1834 13926 25347 29004 35095 47297 48161 54625 66407 63536 53122 38736 36646 23981
10226 23981 26644 29076 44108 54308 45286 38452 43448 45785 50778 71051 81172 79303 81711
10213 81711 84572 79292 76261 68303 55258 42062 44859 45342 38631 29965 36808 38349 18476 11522
10199 11522 10285 19355 40487 44715 38727 39019 46216 49172 59235 63537 63376 66643 66879 80765
10185 80765 109803 131550 158237 199386 268283 364751 472446 575250 633971 628921 583848
10174 583848 513230 433681 345636 265321 199928 154033 140129 118041 89142 62412 60069 65242
10162 65242 63143 58393 57591 71816 67545 51420 46393 50741 44266 46222 64302 55195 40427 27129
10148 27129 13516 5826 14271 22132 31378 37298 39567 36339 40053 44751 47330 48964 50554 60465
10134 60465 56874 54889 46699 46609 43252 40582 31814 33112 21498 15172 27918 47145 53035 53222
10120 53222 39213 34589 41344 32970 45395 52750 51216 46318 30060 23752 37812 51107 61035
10107 61035 59725 65732 81247 90416 97790 113967 110171 107069 126298 146979 162794 184086 231638
10094 231638 290887 367145 484278 665013 929642 1352366 1861452 2211554 2270932 2166398
10084 2166398 1998608 1757797 1419373 1047574 748660 553955 423716 357462 294715 241958
10074 241958 206544 188233 183448 179904 188713 176214 157062 150638 123205 107382 87961 84342
10062 84342 88755 81772 61867 59738 60985 50152 40553 51293 53316 49336 40222 33195 34291 53942
10048 53942 64271 52268 34472 23951 26569 41099 36579 40833 53337 53117 77168 89661 109147
10035 109147 131922 120700 118391 122984 112849 91895 70028 51399 29988 25521 19315 1276
10023 1276 -300 10018 10693 1964 2841 5940 -1870 3242 21129 30255 29442 15368 17495 32004
10009 32004 24585 16248 29125 40528 44930 25207 8225 861 10809 23087 21795 13127 10920
9996 10920 3523 -1899 1853 16891 23283 24334 29713 25669 23571 17196 16823 657 3544 6210
9982 6210 9000 19204 10229 19316 18089 1855 -14282 -8319 -10577 -1910 588 -2072 -11429 -15388
9968 -15388 -4903 9172 10089 11757 10701 9325 25860 28193 24518 25320 43924 55623 56376 50337
9954 50337 52640 49989 46251 24638 6817 -758 2436 9398 21962 6134 -230 -2054 4917 -5943
9940 -5943 2177 17359 14189 15044 29220 40601 37047 23186 26983 20931 -312 -4126 4028 10038
9926 10038 10318 7222 1304 971 13872 2055 -127 2118 956 -16706 -9948 6671 8183 -4390
9912 -4390 -7479 -10920 -16611 -14662 -20301 -16534 -9900 8838 1352 -6088 -11040 -20451 -16068 -12604 -12566
9897 -12566 -14462 852 5051 -5255 -5527 2979 9300 12585 -4654 -11561 -14695 -17175 -17696 -15619
9883 -15619 -15386 -3102 14624 10787 6735 3257 -98 -8141 -22459 -14048 -2235 -5150 -6080 8331
9869 8331 26329 18469 12997 19775 15092 10713 18362 22138 14830 5809 -7001 -8744 2233 11179
9855 11179 17161 5899 -2758 9731 18092 31139 27151 20764 26263 23496 24907 11896 6991 3983
9841 3983 -4473 -1152 -3213 -1169 -17461 -14459 -15389 -700 11832 21605 23173 20060 6155 3314
9827 3314 -6520 -19967 -18090 -13858 -9962 -2605 16294 30887 17754 5709 1609 14260 31074
9814 31074 27111 22051 31306 43538 52783 47482 36024 75537 132147 163907 176337 164143 150192
9801 150192 144915 125215 94371 65858 45501 37907 30967 23951 8761 -19073 -26072 -19840 -23842
9788 -23842 -18584 -4227 6246 6177 1055 11989 4266 -1387 -789 -3371 -10046 -11699 -12004 -16718 -4822
9773 -4822 7302 6128 -3547 -13411 -8700 3009 1705 3415 16551 27178 21494 14458 8513 1514
9759 1514 3606 7267 5809 -751 -16298 -9658 -2404 -12535 -26496 -18690 -2531 2200 -4024 7606
9745 7606 12311 -5416 -17936 -14653 6819 1944 -9640 2595 9044 2342 10059 14595 14978 12080
9731 12080 13199 17826 11338 4610 -4177 -13362 -20147 -27037 -7802 323 514 10570 18250 25390
9717 25390 16623 490 -23490 -26088 -9465 9688 27905 27456 21439 19925 19152 10477 6860 3028
9703 3028 5574 10380 6429 -1176 -946 -2430 -8706 -7972 -6115 -8013 -782 3365 8114 9925 12325
9688 12325 8760 14233 20766 7749 -6522 7079 18848 30692 42153 50853 50594 49534 58948
9675 58948 55822 46422 35281 29390 19197 -610 -24656 -19814 8591 15925 3847 4813 374
9662 374 -11924 -16259 -8706 14977 22087 18873 10423 14742 18959 7408 7082 5939 6058 6585 20678
9647 20678 24038 23281 9083 -5090 -4197 -4516 -12588 -9516 -11687 280 15908 11741 6701 -6646
9633 -6646 -16008 -34239 -27586 -4250 2747 -1805 2049 -9207 -22000 -19802 -19792 -19319 -17077 -11481 -6090
9618 -6090 4431 4265 11482 10443 10828 13660 11493 -8240 -16117 -13096 -15675 -3242 11565 1778
9604 1778 -11331 -16529 -18443 -12783 -2621 -7161 -5081 -4999 -3017 -1225 -8507 1495 11313 20657 26056
9589 26056 17410 11683 8970 28 459 3507 -5889 -3862 -1062 3174 7842 8562 -1196 -5608 -1187
9574 -1187 -3393 4187 12467 15328 8741 11601 11968 16013 24118 24691 22076 29671 28011 22584 16181
9559 16181 11047 7105 11555 12869 6523 1117 8870 12015 13978 10231 10930 9407 11857 13992 7089
9544 7089 6450 12125 3627 -5741 4430 -4290 -11304 -10123 2323 -2064 -2686 5895 8855 7083 -3703
9529 -3703 -11703 -4769 -9739 -9233 -6404 -14869 -9061 8898 11145 14847 14191 21075 14577 2890 -8590
9514 -8590 -11655 -11581 -5594 -8071 -10152 -14168 -9085 -3362 -4473 -2340 -6617 3189 2379 17493 17362 14414
9498 14414 7429 -2447 -9157 4139 11424 10238 10128 4020 -194 5337 -2645 -18921 -22242 -21539 -15668
9483 -15668 -16151 -21088 -8756 -3627 -7003 -2787 11058 19625 14708 -3074 -5403 -7905 -7267 -1155
9469 -1155 8875 -2875 -15381 -10852 6907 20701 31142 21092 18941 23673 15245 21086 11619
9456 11619 -10820 -19425 -22774 -19946 -22542 -1625 13621 14382 8068 1009 6828 12919 20595 17951
9442 17951 22539 12477 8531 5779 -1994 -4473 3250 4492 6779 17375 15712 15956 5353 -4698
9428 -4698 -1505 -3993 -7826 -8816 -5382 -146 19195 26411 18263 21103 17226 25052 13129 1660
9414 1660 125 2616 1410 -2861 -17283 -8359 -12671 -1597 2054 -1244 -2771 1947 13549 29923
9400 29923 22014 14813 20111 15519 19864 23755 33143 25067 15044 27340 27552 18797 18091 2991
9386 2991 -10541 -11213 -10433 -1404 -4286 -12455 -13979 -8077 618 -2778 -4209 -9430 210 17156 11704
9371 11704 2363 5760 -3733 -10315 -8856 -10044 -1687 18572 16979 23489 28781 19821 26353 15522
9357 15522 -3206 -4992 -4402 -10418 -549 3709 5170 17000 24698 24485 18096 23108 22686 19258 20403
9342 20403 28217 26754 12158 1295 -1739 -7060 -16207 -5464 5682 17020 18243 9384 8632 -5942
9328 -5942 -9214 11737 10590 7308 4573 6435 -737 51 6154 16542 37510 32850 15137 2037
9314 2037 -4622 1451 7271 -12783 -18629 -25838 -18217 -13185 -5498 5635 14613 13942 16753 10984 9298
9299 9298 18786 24684 14209 2122 3090 -4298 -2732 4685 9229 13952 11469 21718 9156 -6058
9285 -6058 -1022 6586 25085 29868 21561 10794 7297 7498 12153 7420 2910 2123 -10067 -5268 7784
9270 7784 17763 32396 40459 30938 24099 29823 34932 24623 14279 4498 -6832 -1593 4401 18666
9256 18666 25301 32620 33967 11497 3575 5310 8990 6784 5129 15056 20053 14404 13727 17971 27547
9241 27547 16162 9779 7507 11680 -22 -132 -3440 4552 9363 18331 24539 18818 803 -1496
9227 -1496 -2993 -10605 -8758 5516 11185 13819 -2233 -2567 226 6483 7453 -5117 -6174 5184
9213 5184 1958 4642 13237 22093 28407 34525 30475 15550 31913 38162 21431 8416 10811 25727
9199 25727 28830 26282 28455 32557 38206 36563 27564 23995 22154 23810 21576 27178 37343 40220
9185 40220 34113 27902 33326 26117 14264 12811 1683 1785 19362 28008 16090 23606 32904 31070
9171 31070 35448 42544 45546 41630 30122 11565 6207 15345 22271 27727 28312 25195 20976 21080 10895
9156 10895 12234 15061 22401 23687 24576 25285 30591 29159 29371 22179 16277 32297 41499 31196 22368
9141 22368 24377 18872 18765 26549 40550 49473 58738 47049 39852 36330 37337 32505 35195 41996
9127 41996 44412 41740 42258 33011 35610 37449 41351 55361 60415 56136 53252 53227 44902 35698 31134
9112 31134 32490 30645 33339 30936 22197 28305 33739 36270 47891 51668 49760 45849 45693 46891 39297
9097 39297 37119 33158 36345 45087 39590 29672 41365 36851 42253 40801 42739 60100 61866 65476
9083 65476 76470 79142 63032 49836 37115 32344 42885 52777 58158 65774 73869 66897 71711
9070 71711 65183 61501 48288 46998 49803 44936 45791 42040 39596 34125 28872 25121 31039 39237 47933
9055 47933 54013 51601 42516 35997 39358 50119 57589 53017 49575 43420 42061 44781 33965 44525
9041 44525 48876 45835 43431 41874 54305 52589 52776 52523 63263 67780 57613 54230 54684 52065 55652
9026 55652 52573 51192 49558 49664 62590 62117 51520 48379 45359 53448 54184 52121 49801 53305 60135
9011 60135 62313 59919 58055 64215 59454 55291 52352 57854 61168 62492 62165 78492 71419 62250 55683
8996 55683 56182 58693 58252 56939 64868 70880 57150 57585 58880 66310 61453 65142 69546 66112 63703
8981 63703 75016 67870 58263 61215 74447 84699 99766 96476 89899 86154 81503 88178 94399 105626
8967 105626 110646 100971 106541 105157 96696 90793 81126 83850 100557 107341 100616 110434 116789 120998
8953 120998 122653 123856 130998 124377 112912 111802 108873 104990 102936 101331 111322 124297 127073 122619
8939 122619 119955 112193 110847 129225 127514 131356 131430 126241 116994 100499 102302 120979 124432 120766
8925 120766 119820 127857 128307 116208 107239 110132 121171 122782 121574 111395 126651 132667 116649 114112
8911 114112 124289 130464 145408 148034 146123 138361 130102 144105 156924 163626 156533 170624 165561
8898 165561 154440 162980 172459 176382 179562 165509 141743 152959 161736 148651 135749 138212 159072
8885 159072 167785 176462 190383 178199 173522 168248 169313 171009 179976 190813 189224 190272 183659 181164
8871 181164 174415 183831 199182 192760 200654 209447 211088 212239 209979 200002 196281 208082 216894 212324
8857 212324 206524 225634 240196 234104 246480 243141 248127 242074 243751 253785 255370 260060 262644
8844 262644 259270 256565 267655 271044 276171 287952 301561 309378 322188 327549 330363 335381 345820
8831 345820 343952 345553 354582 368068 379563 396261 419947 438557 430173 430623 436319 439899 439233 446499
8817 446499 442554 448887 451428 455071 464159 471979 476029 486382 492177 494224 498865 507751 519974 535575
8803 535575 540275 541758 543780 546313 556539 579581 607189 619425 617651 617829 634762 660581 666944
8790 666944 682457 707662 713809 720043 731670 744595 763751 784972 805979 842370 864026 877200
8778 877200 885699 886330 908615 949099 970569 985812 1020217 1048317 1063878 1086138 1112829 1154091
8766 1154091 1192256 1225247 1262863 1297405 1339214 1386665 1431254 1473096 1516534 1566515 1640992
8755 1640992 1697333 1740350 1800551 1864878 1923986 1990062 2057529 2132060 2212904 2295790 2399962
8744 2399962 2507955 2607566 2711325 2821015 2950800 3091266 3234957 3370928 3527937 3708786
8734 3708786 3892589 4085540 4304775 4558170 4824296 5078047 5362890 5673559 6019835 6387065
8724 6387065 6794071 7235393 7729914 8258535 8827450 9452676 10147149 10908671 11752800 12689461
8714 12689461 13721086 14851797 16092446 17458279 18970632 20623341 22411937 24339428
8706 24339428 26405184 28562528 30786023 33002348 35160821 37195047 38990766 40444967
8698 40444967 41482511 42058134 42149413 41739711 40869232 39596028 38015146 36184499 34183645
8689 34183645 32092312 30002600 27946549 25955433 24076952 22311427 20674804 19160721
8681 19160721 17754392 16469801 15305329 14250106 13281660 12390514 11566742 10822360 10128803
8672 10128803 9503168 8934026 8411905 7919916 7467299 7051332 6664719 6300425 5966932
8663 5966932 5659185 5384515 5140373 4896348 4670091 4450526 4234316 4034637 3861613 3687642
8653 3687642 3513379 3359405 3232941 3104521 2976179 2870359 2775265 2674422 2569238 2474041
8643 2474041 2375399 2301903 2246461 2164335 2079917 1995013 1918491 1842756 1789773 1738315 1670371
8632 1670371 1612070 1575947 1532719 1481901 1445884 1406245 1365767 1325448 1279816 1248679 1233761
8621 1233761 1194126 1159150 1122235 1089529 1063432 1038971 1030103 991300 961698 951661 930636 898733
8609 898733 872398 853965 835178 815412 794749 772868 761616 738574 723302 712797 682647 665400
8597 665400 640709 628397 635466 640599 638420 631948 621538 610299 591251 567837 549864 549349 559323
8584 559323 550807 543375 541802 535687 530831 501002 489498 476529 464987 456816 459455 448425 418402
8571 418402 412955 409784 409766 418705 419597 409457 395813 381470 388219 385372 370961 361167 349343 341381
8557 341381 348401 354727 343763 330341 337432 338059 325331 312963 316080 308810 297782 283771 278726
8544 278726 274641 282154 273631 268695 267025 269984 271053 263999 264073 261316 252577 261940 266264 266388 259254
8529 259254 259398 256921 243448 236790 239480 235403 233608 228567 215306 214818 222039 222189 219684 212714 220893
8514 220893 208635 191019 181139 181947 203596 204591 186373 171987 168449 180230 195754 189401 179768
8501 179768 164905 163118 171605 169409 166790 161634 156638 159876 163207 166438 154768 147158 153998 149384
8487 149384 143684 137364 129913 135240 133017 138182 153686 146408 127739 130490 140642 138319 128772 127853
8473 127853 129298 135327 133631 130804 123063 113751 115123 110614 112082 112407 117964 121539 119528 106954
8459 106954 99220 98448 108735 108740 109076 111867 109443 100792 98307 102077 94624 91176 101861 110819 112996
8444 112996 117042 116584 109870 99626 98513 97806 105741 112061 97642 91379 82386 70862 73281 83707
8430 83707 89806 82612 79580 90008 99577 100418 94321 84737 83579 82772 88559 83069 67959 64372 66738
8415 66738 63175 65233 70578 73669 63429 63821 65052 69050 70747 77753 86625 96334 109699 118210
8401 118210 128933 125564 130211 133937 139543 131293 106722 84897 68275 49368 48845 36941 22357
8388 22357 29692 52979 65892 62621 52362 47785 46435 46395 43512 49353 58779 52351 53430 49358
8374 49358 39709 36962 37365 51131 51523 55315 52213 59473 72357 70048 62286 61777 56292 49473 51391
8359 51391 59886 63609 63331 59847 62774 63075 47817 46622 43984 54840 55733 66169 62617 50178
8345 50178 36883 42484 45742 40318 44989 65289 78274 77190 59401 43459 44674 59629 65652
8332 65652 64120 53988 49913 43324 46282 46801 61457 60223 60355 72821 68454 66521 65746 70494 65326
8317 65326 59627 54713 55921 55230 47764 41247 52364 56287 46353 43815 40610 52598 56534 40501
8303 40501 42135 50580 55000 49857 26149 38415 43478 52734 44380 30672 31647 31363 43042 41458
8289 41458 37880 39640 27702 23028 33014 41281 35593 22811 21103 43488 46518 45288 40850 46710
8275 46710 46561 35606 38624 40231 44723 42440 49671 60340 40428 18388 25669 30024 28746 35820
8261 35820 39144 42548 32459 28209 18462 701 9204 28687 38606 46381 45940 42080 26700 8815
8247 8815 23587 47497 35839 30096 26349 34251 36654 28449 28458 28958 27837 33308 26642 13782 2960
8232 2960 5021 9008 6997 -2375 3044 15572 14467 7139 14430 15338 19401 27367 18812 26333 23416
8217 23416 6532 7222 12001 12170 10843 20893 27774 20029 19378 13978 9438 15430 20844 19317 6931
8202 6931 6247 21975 33888 27278 29093 27663 23635 2238 2659 -141 5343 2157 -524 433 8664
8187 8664 11445 12920 11777 8285 -467 1639 -9833 -7996 6348 5109 94 9852 20326 11135
8173 11135 15982 25710 28875 30021 33324 36727 28477 28506 26932 21143 12168 23854 33469 26563 14033
8158 14033 16945 22852 23851 20338 27340 35203 30289 20085 17479 20434 16985 17547 14706 8639 10353
8143 10353 14102 7063 5182 23295 36987 40319 31718 32409 18306 13116 7142 5768 6681 4445
8129 4445 5577 10556 18727 17527 20480 15415 15915 10077 18993 20514 25115 24109 25464 28930 26514
8114 26514 10087 -1202 -9604 -21875 -26924 -21615 -12138 8128 22060 23734 18282 20095 18701
8101 18701 7959 5457 -1264 -8341 -14146 -5835 12602 7517 9405 10403 19099 13309 8021 19778
8087 19778 5067 -5860 1387 13702 8877 15905 30121 18572 7387 7176 21977 33532 27080
8074 27080 10704 15544 24643 19217 17221 15345 14546 7733 12922 17436 21100 11515 4889 5821 11333
8059 11333 20010 26553 17142 20628 6801 9257 7601 11197 2751 5923 15496 12410 17394 11387
8045 11387 10006 14935 16711 15757 19875 19147 14696 2579 -3876 -5932 -3674 -10638 -9738 -643 -3762
8030 -3762 -13644 -7327 6271 11263 31309 31627 18347 22280 7068 8882 26886 27542 17631 10509
8016 10509 2314 -1000 3321 8552 7982 5406 24926 36667 13889 4263 588 8180 12513 7648
8002 7648 1635 671 9903 8862 15070 10371 8948 24744 40172 30968 21108 15381 16092 26240 21222
7987 21222 6652 -2328 5219 13562 14949 14320 13146 9767 11231 22094 13839 15170 20324 6616
7973 6616 8787 20492 19462 14330 13499 8914 10613 11307 1477 392 15209 17029 6557 6309 6067
7958 6067 11319 15050 4650 3152 2372 -13111 -6838 2710 10394 17763 12594 15665 18181 28771
7944 28771 43755 32725 30146 42617 32710 20884 20074 23846 25840 18032 6242 -2229 3158 2722
7930 2722 889 -4353 -9873 -10121 654 3687 462 -4255 -2550 10363 27685 21226 7793 11511
7916 11511 10376 7503 8384 8981 13933 13805 20648 33790 32060 20271 17570 18314 9731 9860 11885
7901 11885 13721 13283 24769 28492 31013 29840 22196 11462 -5485 -9500 -9054 -1666 1621 452
7887 452 -3384 -12842 -21169 -25286 -27663 -21827 -5715 4805 17767 19686 14738 19908 8684 -11624
7873 -11624 -18731 2926 8044 -4104 -8066 -9313 -7953 -5103 -1750 7653 13876 9422 -1051 -3478
7859 -3478 -7212 -10664 -4896 1728 6654 2910 6033 17823 27241 22734 23890 21105 25388 14250
7845 14250 7807 15643 14030 3295 -2551 1544 12507 10956 -1538 -16091 -11476 -15625 -25020 -14988
7831 -14988 -3523 16783 21305 11269 13177 25048 25306 22317 22388 30975 14499 11912 21249 26278
7817 26278 8152 15820 21599 19868 19652 15381 4573 5691 8603 10400 7096 -11 -1069 10011
7803 10011 7286 -7586 -5090 -6162 -22689 -23663 -16009 -11736 -15851 -14381 -9355 5488 9985 9285
7789 9285 5651 153 -12103 -11988 -2394 8732 13617 11828 -1107 -13455 -6243 10329 11711 573
7775 573 -7176 -10005 4100 20104 12155 -6016 -14467 -18112 -16662 -14200 -24665 -21455 -21185 -21319 -35725
7760 -35725 -28584 -17575 -15342 -27960 -19138 -14549 -6482 6203 6259 2267 -10673 -17659 -21593 -11310
7746 -11310 242 5204 2306 -2766 4834 15989 12697 7181 10220 -1125 -4872 -2459 8920 7132
7732 7132 -11 -12693 -12328 -5241 -12304 -13181 -20556 -25738 -21987 -13735 -20603 -17369 4164 11579 4402
7717 4402 -2636 -1032 -2522 655 -2841 -7390 -10942 -3743 6261 7290 3342 -6584 -2253 15695
7703 15695 10618 2464 -4528 -5199 -14705 -10442 -1415 4488 18590 14419 9540 -5532 -24932 -16210
7689 -16210 14089 20459 4691 -5178 -6173 10349 13677 5942 -5704 -12518 -8707 -11419 -3490 4277
7675 4277 16408 6735 1749 8047 3969 8761 16289 8775 -3793 -4630 -455 25290 31630 17650
7661 17650 8918 2606 6531 -3984 -2378 -7801 -2122 14283 26028 24786 7079 5500 18888
7648 18888 19653 8627 56 8826 27298 13966 1778 -6327 -7347 1297 123 -6810 8440 20198
7634 20198 23248 23279 909 -1415 17531 21900 30301 17494 -2275 -3372 -7431 1194 2542 435
7620 435 -9302 -20477 -25292 -28425 -29202 -28361 -27143 -16636 6932 10266 6309 3876 5938 8848 7424
7605 7424 5238 -6228 -24443 -35637 -32430 -21920 -33022 -44459 -37177 -24770 -22675 -13824 -10993
7592 -10993 -2496 -3173 -6536 1428 5568 -3302 -4061 -2304 -12439 -4911 1184 1518 3875 -2696 -11310
7577 -11310 -17234 -3577 -2229 9875 12617 7551 3776 -12570 -21425 -16752 -11919 -426 3014 1727
7563 1727 -3617 -3472 1318 3015 -468 -3790 10880 11618 9324 584 -7982 -672 -12379 -31995 -31374
7548 -31374 -15687 -9718 -10781 -12671 -596 -1442 -4226 5855 1987 1567 1867 6746 3815 3661 967
7533 967 8615 7342 -3337 -6972 -10266 -17885 -31339 -37955 -32696 -34885 -13386 3975 2878 7290
7519 7290 4743 -4728 8603 19442 13093 -8394 -20927 -16802 -8314 -12287 -7978 -4368 9837 2791
7505 2791 6119 113 -9324 -70 -2699 -14988 -8302 4543 11592 1261 2946 14658 12121 -1737
7491 -1737 -27726 -35285 -26223 -8597 -11649 -16372 -13975 -12867 -7569 -4809 -14996 -23065 -8796 -16586
7477 -16586 -19030 -13288 -18120 -3861 1623 -1260 -3015 -3846 6354 8608 -4774 -13419 -11014 -4626
7463 -4626 -1007 3239 3627 488 385 3021 5536 14634 4631 -1513 4983 6749 4103 1633 -11632
7448 -11632 -12181 -8314 -8669 -2599 7094 3026 5538 -9927 -13752 -10211 -6814 -17899 -24577 -26391 -28212
7433 -28212 -24211 -7056 -4266 -10523 -9466 -10441 -21004 -11720 -9121 -4538 6241 4874 3754 3874
7419 3874 -9185 -22387 -16218 -8283 3877 8955 5316 -1427 -5172 3377 -3957 -8601 -7682 -9871
7405 -9871 -6941 176 -858 -1178 4332 -393 -7594 -3860 -9557 -12479 -22934 -14994 -12420 -16728 -20261
7390 -20261 -16528 -27094 -36545 -32878 -6573 -3386 3907 15204 16535 2961 -11078 -12312 -602
7377 -602 10945 14031 5337 -3959 -5554 -24180 -27432 -17987 -7892 -1496 -285 -7964 -11239 -18241
7363 -18241 -1997 -9438 -13124 -24609 -19296 -6129 -17024 -4701 7220 15702 14678 3939 -336
7350 -336 10091 -1396 -3512 -15887 -27719 -13882 -328 -831 -10744 -27526 -25028 -10448 2231
7337 2231 6572 5588 1065 -1063 1052 -726 1257 3541 -9313 -10286 -710 -13323 -26669 -22617 -6841
7322 -6841 3530 -963 -17056 -22052 -28524 -28714 -7492 1872 -1391 -11202 -13591 4441 16645 -6814
7308 -6814 -8655 -1406 5566 1052 3097 4489 3735 5974 2450 1129 -5863 -6415 -12058 -28027 -8613
7293 -8613 -4516 -4914 -3617 -1934 -515 853 4925 9135 10707 11284 -3967 -13265 2305 -922 8164
7278 8164 1010 -18208 749 3594 -5314 3298 16361 9176 -35 1414 -3322 -3519 -15476 -13375
7264 -13375 885 5059 -6256 -24966 -19179 -22320 -14038 -19773 -14310 -12214 -23982 -20829 -10737
7251 -10737 -8144 -9034 -2065 -5541 2628 -306 -26865 -19395 -15971 -20275 -13432 -12331 -11477 -22528 -20090
7236 -20090 -15719 -22613 -18588 -7515 -15573 -17895 -2575 639 -3088 -5137 7397 13453 1243 -6113
7222 -6113 -15943 -31953 -29451 -18013 -17491 -21682 -28980 -33214 -36500 -30229 -11107 -2187 -6708 327
7208 327 -5893 -9048 10297 16056 -1177 -13588 -1842 2308 -14496 -17216 -20129 -31347 -30990 -19860
7194 -19860 -5050 -1498 -6463 -12326 -6568 819 12051 8501 4974 3890 -17564 -12632 364 13235
7180 13235 16673 4176 -10799 -19726 -30195 -13324 2468 826 -11923 -27568 -19674 -11426 719
7167 719 13433 10155 10965 10539 7089 -1249 -10785 -1004 8533 4206 6438 8083 -1383 -3311 -6126
7152 -6126 1421 12673 17505 20852 10634 -824 -3618 -8209 99 15736 16784 -908 4582 6297
7138 6297 -3557 -10699 -14949 -20545 -21608 -21584 -11234 -1251 7109 -3794 -18168 -18805 -12586 -11611 -5850
7123 -5850 -11948 -8979 3662 5505 -8245 -21319 -24433 -15603 -5615 1456 -1321 -5445 448 -2834
7109 -2834 -12517 -15357 -13281 -660 -4745 -9084 -6325 -4213 9388 22180 19854 12070 11688 883
7095 883 -7473 -14323 -11282 6649 16004 12094 -3724 3480 5752 3642 1362 1505 14624 5369 -14391
7080 -14391 -17263 -14418 -12704 -2782 5472 6114 6165 4118 -8644 -2107 9357 29376 16740 5293
7066 5293 3099 6090 7042 -10152 -16102 -19578 -26219 -27240 -21277 -11074 -595 -254 168 3568 9980
7051 9980 15572 6831 -3309 -7715 -18503 -12256 -7923 551 -2417 -8548 -12560 -8947 -20028 -31400
7037 -31400 -11950 -18220 -20168 -18574 -11211 -4619 -7498 -10012 -16595 -13957 -1854 14533 11335 3420
7023 3420 -8367 -6218 -1122 -2646 1801 798 -10872 -28152 -19436 -10944 -28431 -24678 -15471 -1657
7009 -1657 -14209 -19207 -11875 -13364 -14010 -5228 -940 -10896 -20164 -11036 -10746 1282 25843 30337 19108
6994 19108 2478 -7387 -8397 -5718 2516 6560 5588 4736 4077 -4985 -14019 -23974 -25349 -10049 -14525
6979 -14525 -19482 -27480 -23831 -15538 -20335 -13091 -7901 -11585 -10518 -9990 2030 12205 8259 -7173
6965 -7173 -5906 -3180 -2694 -1750 -5859 -20297 -28739 -21156 -25887 -26997 -25035 -23146 -28777 -25112 -12784
6950 -12784 -4765 3481 -4555 -17728 -21094 -19836 -21934 -13225 -394 -4769 -9255 -2967 -6025 -13875
6936 -13875 -6179 -5040 -12996 -16228 -9594 -15533 -14701 -7592 -1689 5712 3269 8907 6058 2038 906
6921 906 7259 3631 -15258 -26303 -20509 -8856 -9427 -985 5087 -522 -1542 -8162 -23888 -13255
6907 -13255 -13825 -22239 -19352 2108 7908 12350 20342 17308 9131 6911 12353 11907 2775 -4344 -2919
6892 -2919 2520 2000 -5144 -22614 -28888 -7456 -5754 -7637 7155 9367 2506 -9114 -1884 -14064
6878 -14064 -34365 -37866 -42331 -37741 -19893 -3756 -30 3111 -4611 -17794 -12920 -8455 -7901 -14506
6864 -14506 -8845 -7277 -11164 -18617 -22385 -24260 -30745 -21766 -15331 -722 -7070 -9214 -14427 -9577
6850 -9577 -5124 -7090 -25056 -33939 -33815 -41215 -34303 -18351 1023 -930 -11 2580 6529 8624 7437
6835 7437 5196 -5539 -9042 -21065 -19644 -12081 -11250 -7883 -783 -5699 -17178 -16824 -9626 11828
6821 11828 18370 20324 4415 -7842 -13380 -10409 -15884 -12791 -3400 7485 4612 -1116 7474 7308
6807 7308 5877 2305 3108 -13715 -18430 -27632 -22718 -16369 -12467 -9459 -10900 -14996 -12607 -12138 -17827
6792 -17827 -6237 2637 -10014 -26167 -18062 5547 3954 -10446 -15754 -1845 -4250 -7654 -7632 -8447
6778 -8447 -10376 -15205 -18244 -11896 -8715 -6144 -11735 -4949 -11126 -14443 -16865 -20479 -18949 -19941 -13771
6763 -13771 -15433 -25088 -22450 -10097 -16966 -21623 -23070 -28869 -25075 -13116 -9611 -24036 -19424 -13904
6749 -13904 -13469 -10279 -2984 -8817 -12744 -16779 -18213 -23325 -32959 -49281 -39642 -22004 -11135 -13725
6735 -13725 -13469 -11970 -23418 -31731 -30762 -34218 -24817 -6023 -1746 576 -3154 -9280 -8248 3172
6721 3172 10430 34861 32379 23122 16377 9327 18313 26965 11869 6240 -2706 262 -1350 -20208
6707 -20208 -15181 -9975 -11818 -19997 -24900 -32522 -23005 1846 5938 -17259 -33294 -31095 -14193 -519
6693 -519 -5149 -14408 -25475 -24141 -24707 -16840 -9012 1407 8034 12790 9625 4854 6289 8313 13672
6678 13672 7894 6764 7191 -629 -6219 -1483 -910 1444 -5352 -23757 -32071 -31300 -35816 -29443 -17085
6663 -17085 -1264 -5563 3276 194 -5657 3486 -5217 -16175 -6611 -11874 -14056 -6581 12751 23345
6649 23345 18855 10315 2 -2810 -14120 -10508 10741 9103 6088 -7998 -5734 -3704 -7807 -7419
6635 -7419 -8102 -700 -3371 -9843 -13311 -3940 -8560 -14227 -18060 -18693 -7638 -13972 -30175 -18881 -18947
6620 -18947 -8683 -13900 -10549 4441 6668 2147 -4889 -5383 -12672 -17036 -14853 -17042 -11052 -23550
6606 -23550 -28348 -19092 -17778 -21143 -8267 12079 14259 4558 4009 21892 30445 21628 7582 -1758
6592 -1758 67 2471 6328 14318 3010 -7790 -9861 8590 -1652 -6281 1313 -3750 -13004 -18876
6578 -18876 -6182 7136 9458 2272 -10930 25 1896 -16031 -16714 -8685 -1394 7730 10090 6337
6564 6337 2560 -2570 -11033 -11372 3170 4148 -3016 -2737 2168 2874 -1376 -7196 -12234 -24510 -26836
6549 -26836 -17690 -916 6457 1458 -7180 -6674 -7791 922 14567 19135 14932 7786 -3464 -11290
6535 -11290 -25333 -29214 -26887 -18484 -7471 16202 21766 19225 27787 31025 33845 26510 24074 18921
6521 18921 8946 1073 -11568 -9608 -280 10876 18436 8012 2938 -11578 -6438 -3912 -181 249
6507 249 -5234 -6077 -5592 -9309 -20199 -14477 -6878 3822 11830 13200 10706 3877 -1310 2660 -1143
6492 -1143 -14765 -24791 -7083 -3843 -3252 5251 252 -10130 -4515 -15498 -28690 -23683 -21564 -12740
6478 -12740 -6852 -7897 -9438 -6121 -790 3295 1920 4464 962 -6541 -6667 -7081 -3682 -7526 -12614
6463 -12614 -15925 -18728 -2805 14657 18272 14112 4318 -3287 1883 14417 7210 541 -12854 -6611
6449 -6611 -1055 555 -3100 -14913 -14780 -13399 -24903 -29528 -31422 -24664 -16759 -16413 -2514 -3815 -4790
6434 -4790 -5762 -7388 -2817 5669 4111 -12830 -14383 -8752 -14347 -14472 -992 17537 20852 15142 21804
6419 21804 17364 16666 22476 3036 -21593 -24894 -23879 -25882 -24123 -11170 -7602 -22767 -23536 -6568
6405 -6568 -8912 -16984 -15751 -20181 -26654 -25426 -21808 -23024 -25941 -15484 -13011 -6414 -25295 -17099
6391 -17099 -13370 -6849 9666 7795 1680 5924 7655 -5866 -13925 -9909 -5260 -4168 -6192 -6493
6377 -6493 -12773 -29819 -25220 -19822 -11317 -4472 -3620 -3686 -5064 -1009 -6132 -22859 -22038 -16751 -12496
6362 -12496 -7255 -27941 -26839 -13592 -1405 -2548 3180 2262 7863 151 -10759 983 11767
6349 11767 11029 8411 6379 10651 19180 10203 -4903 -8340 -11402 -9055 -9083 -10747 -17047 -12006 -8853
6334 -8853 -11376 -4429 5695 10813 16787 13632 10615 -44 -10463 -15651 -10762 -6293 -12340 -3942
6320 -3942 -13160 -19304 -19095 -16689 -17253 -16179 -9493 -13371 -17611 -18382 -6488 -12694 -30799 -34430 -24651
6305 -24651 -23284 -35006 -18914 -24963 -21264 -1505 8077 9160 -6089 -19152 -15331 -2322 3461
6292 3461 -12154 -11885 -15463 -13246 -12118 -19769 -18761 -10121 -12877 -12443 -23986 -18024 -9416 -129 -5245
6277 -5245 -5647 14078 25006 17211 16468 -1039 -18675 -13895 -13043 -16807 1930 15302 13504 -811
6263 -811 -7609 5802 17827 11653 5960 -13664 -29339 -34831 -35604 -14756 -8352 9268 14554 3142
6249 3142 -5244 767 -2137 6057 8636 6361 18072 13597 4258 -12422 -19397 -20134 -14357 -18063 -16397
6234 -16397 -18589 -21042 -29248 -29180 -36734 -35029 -34650 -33184 -33950 -36563 -40006 -38775 -28809 -13546 -20637
6219 -20637 -32503 -34401 -33217 -28769 -10534 -1270 -4404 -20343 -20925 -31460 -28652 -19819 -9558 -11735
6205 -11735 -3737 -1630 -7959 -10541 -11132 -13021 -20548 -17195 3202 23389 24230 18121 3284 -10281
6191 -10281 -7596 -20536 -20135 -11231 -14917 -18863 -14024 -19642 -17692 -267 7375 7346 -21681 -33165
6177 -33165 -14133 4312 2373 5456 13534 11932 2968 7834 7651 2323 3377 -1728 4505 10850
6163 10850 -5815 -4045 1163 -9929 -14070 -21267 -23422 -11581 -4222 -1500 -3269 3899 3389 -7295
6149 -7295 -12187 609 2935 -4506 -5802 5240 10019 2850 -5344 -14973 -13047 -7723 -10764 -18895
6135 -18895 -10572 -6489 -13583 -9176 2443 157 -13834 -18982 -3911 9482 1436 -10948 -17299
6122 -17299 -20616 -24404 -16441 -4048 8816 14056 8908 1345 4997 1951 2660 -112 10891 9560
6108 9560 6643 12389 9936 1327 -14123 -20197 -13389 -6035 726 12696 13535 16469 18212 9973 3063
6093 3063 -12821 -12696 -5601 2485 2601 -3796 -1244 1171 3395 10511 12662 18968 11291 4259 -7798
6078 -7798 -10102 -8778 663 -4538 -6058 -13759 -14281 -16684 -18792 -23198 -10489 -2361 -1401 6661 9441
6063 9441 15804 21622 34400 21688 104 -589 4186 -1121 -15360 -12883 -14237 -29905 -22539 -16747
6049 -16747 -12449 -8654 -19839 -28902 -17497 -11454 -7886 -10903 -3962 -2133 -17102 -18929 -18890 -16115
6035 -16115 -7712 -6507 -24111 -23232 -23896 -35027 -36431 -27974 -16343 -19382 -17368 -14627 -26094 -26690
6021 -26690 -23288 -12095 -5866 -6990 -17475 -17483 -9766 -4408 -18089 -33466 -29400 -19678 -12124 -1792
6007 -1792 -6211 -10518 -23500 -37454 -41841 -28919 -11969 219 -5155 -7233 -2386 -13204 -20988
5994 -20988 -22168 -26869 -26416 -25916 -23926 -17027 -5422 7806 15853 4684 576 -14645 -33593 -24449
5980 -24449 -15474 -14197 -15643 -8591 -5702 6056 -2521 -3390 12013 24940 12757 1833 14213
5967 14213 17542 -5463 -10392 -6029 -3724 -15878 -20693 -21342 -14881 -52 -6602 -2544 -8879 -10414
5953 -10414 8281 25532 28721 12640 6443 4137 -2701 -16002 -20264 -11799 -8543 -12239 -18949 -25423
5939 -25423 -25451 -23416 -13164 -9069 -12672 -12468 -2598 -6546 -28934 -26140 -13708 -16171 -23436 -17665 -7287
5924 -7287 -2454 -3611 4694 4672 -3935 -7634 7761 10523 -15282 -23636 -23044 -20209 -19484 -962 -9251
5909 -9251 -21067 -21371 -24278 -17437 -4541 -8024 -1050 6616 -7061 -33787 -34356 -30033 -23497 -16004
5895 -16004 -7151 -6837 -10511 -12076 -14359 -4048 9145 8293 4084 13872 22648 15828 4944 -8199
5881 -8199 -6260 8334 13731 15962 18646 5357 760 6170 6481 8363 -2182 -3494 2440 10102
5867 10102 10432 3376 1204 2081 650 -17114 -17125 -29400 -23473 -10426 -8863 -9888 7762 19271
5853 19271 20256 8355 17196 22119 15949 1858 -17708 -17688 -3618 5824 17584 11448 5605 10050
5839 10050 1585 -13931 -14149 -12537 -7209 -9623 -14499 -18209 -12261 -412 6405 1485 -451 -18941
5825 -18941 -21399 -17865 -22661 -3377 -13823 -22499 -15668 -10829 -4103 -3726 -11948 -19185 -7339 -4743
5811 -4743 -10943 -27132 -30458 -22443 -18567 -15856 -22082 -19451 -7928 -5325 -2170 -850 -2217 12518
5797 12518 13057 2048 2831 11076 20362 5744 -6583 8993 18050 6134 -4568 -2969 4940 15389
5783 15389 21009 17136 2340 -7035 -21401 -12978 -6971 -5119 -17924 -29756 -22250 -16813 -22399 -20383
5769 -20383 -16069 -9733 -13299 -19232 -26014 -38681 -49776 -43619 -16203 -2625 -243 -10148 -18109 -13169
5755 -13169 -12753 -16157 -26406 -33238 -28223 -5934 -4868 -16448 -9628 -7021 5297 1066 -21216 -19412
5741 -19412 -4462 3299 11311 4797 -1907 -1458 -3886 -11791 -14831 -21646 -8254 9817 17172 12475
5727 12475 12018 -2002 -12486 1998 13414 26857 19308 9018 15385 17369 23001 30929 26057
5714 26057 13183 6725 6971 5225 5842 3723 -371 -285 -8064 -24476 -35753 -36422 -39789 -22744 -7664
5699 -7664 2679 4007 -11733 -5059 -4159 2233 -7245 -12244 -18808 -21647 -17442 -10201 638 -1831
5685 -1831 -7367 -12157 -12620 -10746 -13953 -17199 -9554 -12800 -17651 -3584 4180 5820 8417 11151 273
5670 273 -4068 -10242 -9315 -5382 -1916 1394 5624 8949 17233 28889 38940 24443 9307 -5440
5656 -5440 -6656 3512 7398 11911 10231 5696 6276 8127 11082 8890 -35 928 844 133 2944 -11459
5640 -11459 -13248 3841 11391 16354 1780 -4093 -9929 -15155 -6638 -419 -2291 -2535 -9877 -20818
5626 -20818 -17388 -10031 -15455 -15262 -9904 -2124 -11212 -13548 -11954 -7113 -13756 -11162 -13253 -16146 -16580
5611 -16580 -13779 -9241 -3941 -1941 -428 -2286 -5789 -941 10319 6925 1683 2450 2547 -2157 -15984
5596 -15984 -31289 -16269 5432 621 3584 5827 10780 6948 -781 -8006 -7316 3047 16205 15618
5582 15618 -2700 -11354 4652 -6615 -23385 -21721 -13563 -282 18719 15189 285 -14869 -26431
5569 -26431 -35494 -34936 -14231 4853 -254 -12 8135 -4022 -11357 -21833 -24891 -19890 -24657 -26234
5555 -26234 -25223 -7901 -8653 -20481 -21445 1997 17207 8301 16392 -36 -1118 5226 -4814 -7874
5541 -7874 -9763 -2762 2516 6104 3580 -11248 -15582 -18473 -182 5251 18868 28372 28102 32019
5527 32019 23857 21260 22971 29967 21553 5865 -882 -2480 4667 2573 5002 10128 -4552 -16048
5513 -16048 -24726 -20897 -18021 -1089 -2084 -8374 -8002 -2131 4585 3363 -135 -4906 -423 -1510 -7171
5498 -7171 -11479 -1148 4173 -857 -11934 -14236 -11351 -10882 -20232 -16430 -10132 -8217 -14359 -17291 -5005
5483 -5005 -10214 -8780 2135 2889 8734 5023 5702 -2645 -2985 -3608 -9521 -2261 -4698 -923 5676 5258
5467 5258 -12269 -8313 7318 8605 2197 5080 8230 7141 21908 19391 19586 17703 24867 24446 9630
5452 9630 5768 7544 -5537 -7518 -5230 5095 -4334 -14471 -12665 2809 10928 2554 310 6996
5438 6996 1448 -4207 -2560 4960 8128 16409 10255 7233 12223 4382 13027 10357 8817 5577 1727
5423 1727 2588 12325 9186 -4027 -9218 -10299 -9957 -16040 -12114 -8195 -2186 1523 6080 -6861 -1978
5408 -1978 -2865 -10587 -17050 -14672 685 1478 8459 9044 483 14288 20368 19344 13197 9242 -3952
5393 -3952 1569 -278 4422 -6922 -14470 -15803 -14065 -12006 -27337 -23184 -9502 -9000 -6453 -7534
5379 -7534 -14062 -18351 -12054 -11496 -4976 -16859 -8106 4907 5371 11787 -2118 -23066 -9671 -2684
5365 -2684 -11398 -24327 -25256 -16089 -25760 -17014 -3806 -74 -7887 -8126 -1060 17807 22949 6885
5351 6885 1141 715 -13979 -19631 -10670 -2052 -525 -1275 -9820 -17718 -26068 -37322 -31577 -33358 -28498
5336 -28498 -14778 7761 9137 -7291 -12452 -1439 -3957 -7760 -20304 -18450 -10288 -11475 -18530
5323 -18530 -22164 -24545 -43272 -43288 -26711 -24519 -9359 -6045 -9413 -1615 5681 1775 -6149 -8501
5309 -8501 -8472 597 10209 13539 1504 -6057 -1717 -2866 -6871 -4309 -1784 14644 3855 -9010
5295 -9010 -8456 -2721 -6843 -18433 -27922 -23728 -10703 -8890 5269 19486 9122 9385 25240 21271
5281 21271 1255 15263 18844 20413 29969 22678 9814 3309 6241 -1527 -5740 -7083 -10497 -14086
5267 -14086 -23058 -19237 -15185 -16785 -33911 -39506 -31867 -17365 -11881 -13725 -5247 336 -11183 -23463
5253 -23463 -16343 -11778 -6683 -5720 -2211 12724 21854 17554 4333 1286 1220 7139 -325 1411 5132
5238 5132 8361 14689 5761 -4035 19332 19189 3787 -4420 -16266 -16013 -2525 9732 24959 26304
5224 26304 23591 19899 -1012 -15881 -16483 -14912 -9266 -4054 -9022 -453 8747 -18241 -24709 -1747
5210 -1747 -5302 -5761 29 -2905 -293 11111 15453 17785 15403 4559 11443 19171 5053 -8120
5196 -8120 -9809 -10657 -4988 891 14868 21350 16940 7656 6394 11917 15847 21038 23123 14453 17112
5181 17112 15719 18981 13087 -5256 -20379 -23375 -19931 -12190 1617 14044 589 -8308 -3495
5168 -3495 8311 5361 -9392 -1577 4726 -19061 -23867 -17483 -13627 -15033 -14764 -12872 -6817 -5404
5154 -5404 -8108 -16202 -10013 -15009 -28596 -25985 -4114 11209 18416 19993 11779 11715 12000 -8774 -9703
5139 -9703 6691 11156 12406 17849 19233 16609 1266 -14718 -16016 -11805 -11520 -13326 -11162 -1631
5125 -1631 5461 8026 9528 9299 -16923 -20990 -12146 -2563 4674 269 -8617 -13577 -18205 -9402 -5949
5110 -5949 4959 2578 -6604 -19092 -17930 -7681 -12249 -7135 -3211 852 1886 -6269 -1540 13171
5096 13171 18362 9519 -2177 -6347 -8047 -1450 6268 11 -5207 -19238 -33090 -27409 -8388 1188
5082 1188 1885 -3028 -5959 -9170 -4571 1836 5709 3653 -1395 8633 18109 -5436 -9417 -5156 3576
5067 3576 4682 -11353 -21289 -19654 -20865 -8710 -7641 -18891 -32356 -18064 -9010 -21651 -37817
5054 -37817 -28541 -14778 -25017 -24844 -31237 -26591 -19330 -21171 -20057 -15644 -16006 -5608 6253 25616
5040 25616 18344 16655 13473 -3998 -3286 484 -3258 -5022 -10664 -20124 -37630 -32846 -17066 -13565
5026 -13565 -17400 -13306 -5472 -680 -956 -3951 -1836 -7232 -16403 -17682 -25212 -22971 -30540 -34013 -36195
5011 -36195 -22375 -21109 -14519 -8774 808 12269 9697 1932 339 -9039 -9546 -7325 -4608 465
4997 465 4843 -3472 5569 -796 -10008 -7499 -6649 -13589 -4478 2033 5881 -1862 -13822 -13010 -10944
4982 -10944 2893 2127 4025 331 2885 4672 10291 -4629 1340 5679 -3770 -4955 -12124 -3623
4968 -3623 5396 -2644 4874 11898 8254 10610 5741 -6254 -7446 -7993 -3190 -4668 5304 7756 6452
4953 6452 -2784 -11533 2227 10491 7802 1192 4784 6842 12653 15427 6423 17508 25003 35407
4939 35407 16661 -3545 -14801 -1550 9183 24547 21227 145 -5415 9512 12438 18472 10377
4926 10377 19 -7370 -16833 -19102 -9204 -1053 7957 17452 10782 3922 -23018 -22260 -14626 6004
4912 6004 10140 4735 7430 5847 2944 -932 770 -1458 5329 16070 5574 -2402 7403 -1466
4898 -1466 -14759 -14383 -11837 -19442 -13685 -14027 -14213 -21681 -12865 -6344 -4434 772 3129 8388 6750
4883 6750 -8276 -14827 -19959 -7484 -3790 -10821 -23116 -16436 -9976 -9897 -20626 -38343 -38711 -22074
4869 -22074 8418 2547 -11225 -15685 -11928 -10305 -7429 242 -12061 -3308 13817 13892 -11113 -17282
4855 -17282 -10497 -5089 -4118 59 -12401 765 14749 8072 5611 12282 21513 3587 4405 14600
4841 14600 9630 -1133 -8430 -17224 -14463 -4138 -1448 13754 16972 4621 -14911 -27292 -29881
4828 -29881 -26643 -23527 -24375 -26745 -23730 -10723 -13847 -10851 -13983 -25205 -20585 -6919 -9331 -23523
4814 -23523 -16202 -14536 -29361 -18253 -12301 14439 19469 9171 21926 22833 26654 19449 18627 12458
4800 12458 1625 4946 1180 2101 10364 9643 -8477 -15727 -7894 -6406 -5659 -16285 -7220 3276
4786 3276 5601 6158 -3618 -12900 -1692 19574 6741 -2886 127 -10585 -21104 -8839 7167
4773 7167 -4582 -10258 -1926 7002 13220 11462 3687 2123 3936 4729 695 -1771 2366 17506 20927
4758 20927 13757 21604 11535 6439 12837 6416 -7843 -12468 -9361 -8727 -2755 952 -677 3496
4744 3496 12174 14903 16106 -10823 -21931 -18540 -13750 1175 5393 10473 7911 -697 -2226 -8993
4730 -8993 -30635 -33262 -24547 -15350 -5736 -130 -6750 -12388 -1650 5929 -9016 -11943 -3206 -718
4716 -718 270 -13921 -11415 -7339 -14272 3835 9862 4296 7579 13737 7302 13276 1292 -4507 -8206
4701 -8206 -5058 2727 -1331 -8824 -24617 -20665 -14481 -19473 -4438 5768 1646 -2148 -3518 -7301
4687 -7301 -2187 -3409 -1624 5304 -1387 -3019 -2371 -2271 -3772 9484 10094 -780 13618 15792 18654
4672 18654 4366 -11594 -11833 -13774 -2749 14870 21365 17702 16422 19772 15115 8648 6674 -657
4658 -657 -3497 -1355 -2187 -2851 -12494 -14204 -10700 -15034 -13214 -12307 -11032 -9607 -11551 4361 10586 5286
4642 5286 -13119 -25423 -23989 -7147 -5302 -11717 -9562 -5064 1151 11936 9351 246 -9643 -8177
4628 -8177 -1808 4135 8473 2824 -549 14120 15304 -3359 -23300 -25574 -24158 -22180 -12766 -7472
4614 -7472 -10793 316 7813 -4047 -20078 -9221 -796 -39 -9970 -4272 5682 -5151 -13036 -28113
4600 -28113 -27678 -14554 -2393 1833 6441 5851 -6590 -4014 -2442 4521 8888 9458 2326 -5954 -712
4585 -712 -864 -15363 -14729 -4943 5430 2615 -5751 -1949 -3524 -8768 -10191 -9092 -6947 7837 8246
4570 8246 -2565 -1369 6506 -1231 -13339 -928 2203 -8927 -5030 -5247 -6656 -8184 -4362 -718
4556 -718 -2971 1269 8566 194 -6140 -2626 -16641 -12717 -19188 -29826 -19692 -2914 -12041 -10647
4542 -10647 -4915 -5322 -17139 -26005 -33795 -35114 -25798 -18897 -14206 -16145 -22498 -28039 -35205 -25827 -10589
4527 -10589 -14492 1347 8083 4855 2381 5637 5164 -333 -1054 -5133 19815 24942 12181 3464
4513 3464 -3587 -122 8496 16356 20594 33011 30194 11083 -5446 -19760 -22650 -25486 -23957 -16086
4499 -16086 -2963 -12509 -19831 -17519 -7208 -2037 4568 15098 393 8572 18544 28386 23845 21270
4485 21270 11066 1797 1470 1273 -12112 -18290 -8268 3207 -8294 -11136 -2487 3140 -10359 -10376
4471 -10376 2156 6723 122 11054 8440 8921 10729 10869 -2499 -9669 -13159 -7562 -7091 3197
4457 3197 10633 12389 16561 11288 5170 2605 5405 -3777 -16337 -17541 -22455 -7091 -186 -15194
4443 -15194 -18914 -17109 -13419 -792 -9998 -28568 -20679 -12752 -6413 3448 5845 2229 5125 8242
4429 8242 9164 8555 5884 -1953 -7806 -15251 -18340 -12416 -7683 -11835 -13278 -9939 -6325 11883 22104
4414 22104 21373 19173 21318 13171 22940 24207 7553 3071 12591 27566 31156 21731 13687 22400
4400 22400 17245 11791 2369 -11445 -11459 -14616 -10248 -2539 6784 2548 -7934 -16937 -12358 -9365 -10413
4385 -10413 -6761 -5445 -13624 -12930 -7032 -9489 -8475 -6492 -7467 -6965 4678 16047 12456 9413 -1031
4370 -1031 -5500 -18736 -24771 -26824 -12277 1935 5505 8737 8435 3452 1239 -4816 -17269 -19012
4356 -19012 -20865 -19248 -12598 -20452 -14693 -13213 -14898 -6223 -4948 -11156 2046 8121 5569 -3585
4342 -3585 -10220 -4270 -12102 -32131 -40783 -28771 -13099 -4798 -3208 -3207 1053 13501 9851 2401 -4853
4327 -4853 -7604 -10932 -4926 4727 7880 13151 3838 -3168 -6925 -4436 6786 2831 -2286 -9571 2586
4312 2586 2065 -10138 4514 -356 -3962 -6183 12786 21147 29031 17208 7527 -661 -14946 -3011
4298 -3011 7927 2550 1981 2239 -3577 -4496 924 923 13419 23974 20685 1474 -15883 -6641 4395
4283 4395 10529 15949 26584 28953 35813 26171 21084 18039 -6933 -20429 -16505 -30501 -38417 -26180
4269 -26180 -6932 159 13616 31113 32724 16563 -646 -3639 2582 -1074 -755 3133 633 665
4255 665 7003 14710 3039 -7985 -7546 -16108 -10123 -113 2351 2112 9671 1679 -4107 -18010 -19481
4240 -19481 -22513 -20622 -8455 -3459 -8182 -18402 -6904 -8432 -8245 -2311 6642 3395 -140 1529
4226 1529 -16797 -28944 -23489 -13262 -9312 -11067 -19163 -13806 -5610 -9172 -5317 11462 13445 5885
4212 5885 5671 -1292 6007 24284 22876 22883 30667 35781 30427 20643 -2130 -906 12464 7365 -994
4197 -994 5143 10989 12847 14502 9496 1169 -10497 -20495 -27310 -26481 -18583 -19432 -2122 738 8175
4182 8175 9519 13219 -8231 -17105 -20878 -18797 -14503 -9029 -1547 6086 16942 20847 27824 21802
4168 21802 5665 3567 4648 7141 8674 5741 -2976 -2020 3825 14174 21053 27890 20630 16245
4154 16245 12463 4145 -4017 8305 170 -5177 212 12737 19953 11135 9263 6412 3222 -941
4140 -941 1816 3005 -3129 4597 1758 -126 2910 12696 25467 28251 18075 18848 3305 8998 10305
4125 10305 8657 8658 -5864 -10458 -4893 -2583 5031 17740 8360 7245 8713 -1473 4754 196 -115
4110 -115 -2697 -3003 2431 13795 21368 16568 9017 1095 -4208 1629 206 -3851 -8739 -1006 5104
4095 5104 -756 1632 9637 -5555 -17618 -7968 7385 4692 -7479 2527 12184 17851 12871 8547
4081 8547 2607 15992 16642 20587 12008 1794 4234 6175 -1235 -8935 -8371 -1698 -8640 -121 16286
4066 16286 15080 20574 16282 -3448 -15567 -11729 -15775 -9896 -5678 -9868 -5850 -19133 -15309 51
4052 51 1952 -5923 -11124 -19170 -13709 -1856 -2904 10547 8228 11293 8891 3826 21971 30278 12153
4037 12153 -5852 -4426 -6265 3091 4452 7042 -6789 -12743 -13210 -13442 -17597 -22569 -9033 16191
4023 16191 32065 17781 2150 -1193 -8524 -9208 -7467 -7436 -6038 3778 -1676 -7705 5012 2237
4009 2237 -8487 -15295 -8698 871 2434 -3626 -3236 -2277 -11322 -21686 -10361 4063 11296 3302
3995 3302 -12945 -22892 -16512 -10373 -7762 -1486 -8765 -8697 -10604 -14825 -6376 -6698 -733 4045 11113
3980 11113 16802 5279 -8715 -2459 -2396 -12884 -8207 -3628 -15668 -22113 -20166 -9327 -5661 8286
3966 8286 11694 11740 11025 16860 32902 27881 20360 20966 18535 26411 17825 -10190 -1385 -1787 -7620 -16574
3950 -16574 -19106 -27195 -18228 -10562 -6703 -7305 2131 11778 20752 3302 2169 10666 9610 7515 4323
3935 4323 -5244 -5877 476 5636 9274 27707 26538 4913 -7619 -7398 -18462 -10153 -5088 6365
3921 6365 5131 -7702 -10300 -10061 -1002 3140 4598 4367 987 -17384 -18629 -23391 -22376 13920 27506
3906 27506 24082 28721 32035 29415 31255 38957 36415 19190 20289 19669 6899 -11510 -1761 9186
3892 9186 6456 7346 275 -5973 -13568 -16213 -24880 -17504 -9440 -15423 -11180 -18179 -14087 -13235 -12418 -8666
3876 -8666 1412 -2163 -6928 -6482 -11471 -4985 -7380 13586 28480 22189 10640 -3852 -13467 -9010
3862 -9010 2296 6 254 -12529 -21500 -17166 -4778 -9490 -4637 529 -7328 -8088 -20463 -25571
3848 -25571 -14743 429 -8478 -24039 -27011 -20669 -25680 -10344 -5923 -11132 -13864 -13001 -8160 -6558
3834 -6558 -624 -4882 -11906 -17452 -7439 21597 26458 16950 16871 13772 9354 8508 8185 9005 19804
3819 19804 28861 22199 20746 10715 11302 11000 6391 237 -5662 -10409 -14471 -2757 3057 55 -7780
3804 -7780 -13488 -12553 11936 7777 -5230 -12000 -20250 -6957 3729 2249 6122 19878 9124 11328
3790 11328 5998 -8022 -16859 -10829 -6088 -2923 -6422 -248 832 969 9909 15911 5537 -6601
3776 -6601 -802 -2512 -3363 -14379 -12206 -11192 1045 -1456 10896 9835 -6180 -11039 -7321 -11117
3762 -11117 -17853 -7985 -3035 -6761 -2914 3167 -4541 -12955 -2784 -9654 -26739 -14757 930 8322
3748 8322 11362 10895 13514 4686 1206 6799 -1728 -9691 -7671 -7757 219 3433 -4152 -19348 -26879
3733 -26879 -17447 -11607 -4959 4541 12421 5722 13924 25923 28435 35086 23336 -3107 -7696 -984
3719 -984 -360 3883 9083 21249 12566 8913 4635 6697 -192 -393 1303 -9094 -14699 -16727 -17426
3704 -17426 -14941 -15883 2372 2403 -2208 -17475 -16145 3205 9593 12041 22195 13109 -6970 -5622
3690 -5622 -6987 -3039 -1328 -2417 -5164 -861 -1010 313 -1668 -1758 -13495 -9700 8746 23985 17292
3675 17292 13577 19617 25797 24559 13482 -1172 -4444 1431 5599 388 -8997 1659 -4231 -4525
3661 -4525 1480 -1848 3485 3613 5350 11976 2757 -3488 -1557 -6160 2854 7446 7984 11941 2960
3646 2960 -607 8368 -1980 -7310 -8421 -15438 -17929 -14143 2555 12624 7039 15 -7891 -11363
3632 -11363 -9778 -21878 -21660 -20368 -11672 -7182 -807 5789 510 -7309 -2779 14247 25577 21512
3618 21512 17922 -3004 -9295 -9933 7445 9545 16869 17553 -995 -3601 -8446 -3090 -5609 2052
3604 2052 -514 2881 11020 8124 4011 -3757 -10457 -10908 -7708 -14739 -15443 -1587 9772 661 -6192
3589 -6192 -1723 13267 21897 14095 -1775 -14886 -17859 -16671 -9090 -3243 -3685 -398 4097 11753
3575 11753 7907 3452 436 10877 12296 20752 5813 1764 -4565 6120 11613 8627 6207 7427
3561 7427 4126 -15094 -18505 -23238 -23955 -11207 8055 14322 17436 5560 2623 1147 357 -9166
3547 -9166 -4042 166 -5166 -9634 -8320 -7778 -11779 -14233 -16520 -14426 -13226 -8130 -8139 -842 -4493 -14870
3531 -14870 -39937 -39475 -20499 -16231 -13876 -10857 -13280 -8242 -8652 -4293 -6522 -13595 -12512 4875
3517 4875 13094 -662 -10844 -6682 -7946 -11416 260 -6222 -2124 6051 931 -1555 -9682 -20195
3503 -20195 -24682 -33693 -31276 -10542 3727 4861 4983 13760 17825 11951 18680 13147 880 -939
3489 -939 -14971 -15310 -10660 -13642 -19862 -28517 -20715 354 13282 10583 -3308 -6781 -8466 -4776
3475 -4776 7610 3612 -3012 13305 12064 13003 19 -18198 -23205 -16270 -18272 -15377 -14262 -9348
3461 -9348 -3272 15089 6247 -8454 -7648 6115 -342 -4312 -4409 -775 -16967 -27550 -20360 -16739
3447 -16739 -26711 -29986 -30619 -33206 -24113 -2279 7381 9604 13060 8291 8387 4861 6531 3855 2054
3432 2054 752 -204 77 -7103 878 3144 8498 5130 9426 21722 21681 8526 1004 1912 5181 -6320
3416 -6320 -15139 -19236 -17012 -5799 10034 6033 -553 5542 7370 12814 20479 19167 14638 6639
3402 6639 8284 4936 4464 6464 -1506 -15995 -19246 -18611 -9968 -10783 -15792 -10959 -6381 -1276 1605
3387 1605 -161 6847 -10194 -27244 -14181 1233 4949 180 -195 -3910 4030 8478 1378 3215
3373 3215 9099 14560 15708 6557 5865 4178 -7921 -16042 -1823 -2523 6508 2454 4013 6335 22272
3358 22272 27725 22094 9735 4218 6098 -8216 3369 22032 19901 1798 -1004 -2831 -4017
3345 -4017 -5709 -7370 -21259 -20061 -13992 -3153 806 3152 1908 -7283 -9635 -14588 2667 4573
3331 4573 5824 -661 2234 -3661 -6125 1074 -239 -441 4728 -1900 -5315 -16784 -17131 -12762 -16881
3316 -16881 -24973 -12212 1577 6759 6307 4141 -2125 -3993 -15799 -14286 -14469 681 8064 1188
3302 1188 1561 12763 10012 10553 11795 24545 10695 -9847 7081 10739 2876 2811 4560 11926 5030
3287 5030 -3460 -12846 -20136 -19936 -24308 -15599 -14355 -14258 -18537 -35041 -39335 -34048 -28402 -17517 -2167
3272 -2167 -7219 -8230 -6717 -14509 -9622 -4582 2145 2025 -912 -14766 -19705 -8580 2009 -7794
3258 -7794 -5601 -273 9990 2499 -217 -6930 -12172 -38 7475 3009 5599 19555 14284 2620
3244 2620 14808 20667 10920 -974 -1833 3372 1852 120 3828 3539 11891 9202 1768 15787 19608
3229 19608 12417 5172 5234 5264 13874 9736 5012 7808 7094 1163 -13151 -3026 -10410 -24885 -14441
3214 -14441 4630 12376 7969 -14096 -12778 12357 10894 3519 336 -11737 -9937 -8557 -15460 -7618
3200 -7618 4447 11166 19419 8224 11880 22026 19398 5861 1730 -14151 -17899 -8589 -3122 -18498
3186 -18498 -15560 -4806 -4143 -7843 -8336 -3328 8009 20030 21501 13116 11176 3521 13434 8638
3172 8638 2677 -13111 -13388 -11450 -7860 9576 11267 2059 -19538 -29867 -26455 -11120 1486 -5222
3158 -5222 -18263 -18701 -19595 -24226 -17374 -16706 -10416 -5298 -5847 -1386 4482 -2598 169 -547 663 -6859
3142 -6859 -7163 -3305 -1429 3243 4664 17520 6332 10006 14175 9193 6966 2293 3144 14234 -649
3127 -649 986 1213 2971 204 -2763 1648 12180 9750 2128 -627 732 -4103 -13855 -20681 -24475
3112 -24475 -13568 -3416 -4881 -10433 -21697 2334 14200 12470 6112 10347 14944 17237 12145
3099 12145 -4839 1861 2357 -1490 -2788 -3429 707 15887 18900 34313 29190 11844 -10441 -18888
3085 -18888 -16207 3575 16583 12624 4854 -3803 -8143 -16346 -16627 -18885 -5029 -18470 -17676 -4496
3071 -4496 -9917 -7258 9896 9782 -4641 -14623 -6900 -7534 -543 -6412 -13323 -13553 -2164 -507 46
3056 46 383 5050 -2554 -15175 -16831 -8986 -6357 -12517 -4147 10420 14247 13794 27120 27013 16643
3041 16643 6143 4094 13491 10265 6077 3532 -7878 -10867 -1996 12531 12420 4062 4386 5416
3027 5416 16337 12537 6918 4208 19765 20480 14032 -4028 -4234 -315 1735 4106 7784 8205 16582
3012 16582 13935 1281 -639 -5035 -13848 -7358 392 245 2065 -2337 -10442 -4475 12900 -4649
2998 -4649 -10323 -13637 -12867 -7911 1787 14091 18623 17315 16734 5794 -7261 -1395 6387 173 -21599
2983 -21599 -26989 -13161 -12 -11081 -14518 -15852 7576 12216 7595 14455 11214 8013 22365
2970 22365 27782 25875 23555 20413 7357 8754 -4218 -10905 -13449 -13595 -2963 4194 13292 12919
2956 12919 9615 11101 8531 1554 -6110 -5441 -837 -2862 -18081 -15785 -18425 -15217 -13460 -20034 -13299
2941 -13299 -14277 -18577 -15484 -8739 1959 15039 10283 8300 4933 5371 7047 5706 8635 8180 -2286
2926 -2286 -53 5490 5885 -5982 -11347 -2540 -269 -8436 -11343 -16301 -10138 -4091 8588 19503
2912 19503 13840 1329 -161 2665 429 -3631 -18376 -10040 -18599 -24264 -19011 -9842 -16643 -20667
2898 -20667 -27064 -11385 3128 -5332 -10090 -15858 -20263 -34566 -27652 -5710 3663 12378 3482 -5016
2884 -5016 -7746 -725 9809 27203 30214 19645 1978 -4724 -2451 -8121 -11898 -7347 2679 2095
2870 2095 -2160 -11784 6174 18944 20090 18201 4460 6741 -8718 -25892 -19880 -12275 -1967
2857 -1967 2393 15025 23634 9373 7173 11881 1875 -10861 -21069 -24696 -13585 -8044 -4586
2844 -4586 -1908 2822 -5841 -2544 -5310 -4806 4539 5180 9620 5924 -3433 -20032 -15328 -597 4310
2829 4310 1117 7146 22954 25484 25187 22393 -3369 -8767 -11276 -12678 -15224 -14621 -19612 -22204 -23850
2814 -23850 -19263 -12569 -4990 18048 21358 16682 15516 6210 -11740 -14202 4817 16744 21285 19638
2800 19638 15987 6418 8610 16974 22363 16455 13486 10394 11648 20000 11353 8570 15628 10268 -435
2785 -435 3761 13016 11867 -1551 -5664 5109 6195 5526 -3013 -10680 4536 21081 21524 11476
2771 11476 11353 19187 11091 -11276 -11093 -3779 -12403 -19826 -21874 -31499 -26666 -27526 -21582 -13055 -11204
2756 -11204 -288 1508 9023 13447 1143 -2943 8721 26139 33054 24977 17496 13685 -3229
2743 -3229 -11137 -12802 -500 -2136 -22665 -28803 -31889 -32098 -19295 -17317 -20654 -12713 -7527 -12067
2729 -12067 2138 10403 17267 31168 32153 22924 10139 -5657 -1216 4540 11116 14961 5813 8296
2715 8296 16882 12368 13721 3725 -3595 -8374 -5735 -10562 -29188 -32558 -25194 -8499 2557 8940
2701 8940 21838 18982 10897 -3399 3159 -920 -5125 9699 10887 -2396 -12116 -3405 -5060 -1209
2687 -1209 -52 12621 6442 12174 14668 9728 9682 4799 -7123 -22730 -14169 -6382 -10946 -11407 8384
2672 8384 15434 5774 5459 7437 8822 10122 16622 25616 15923 9290 10200 4817 3881 250 -6307 -6106
2656 -6106 -5160 -7347 -13954 -10239 8641 21202 16085 11846 631 -757 15486 21685 28195 22643
2642 22643 17796 -1827 -7751 -6598 -213 -869 -4204 10308 10020 -1098 -8011 -1941 7292 15709
2628 15709 7565 -2814 -786 -1183 -2958 -10407 -25785 -28115 -12818 -650 -9723 -22948 -18364 -10055
2614 -10055 -6355 3834 -899 -3697 5124 21055 23716 14156 712 -558 -7922 -12809 -5402 -13138
2600 -13138 -6678 -10057 -9420 12480 14612 4090 1787 -6358 -17674 -12445 10461 10938 2547 -2420
2586 -2420 -3798 368 18204 18705 15373 2872 -4579 -4690 -5950 8622 8263 9872 10022 9882 18649
2571 18649 11758 -5438 -7141 -3386 6162 10697 4232 7854 11577 3261 -4961 3883 11831 16872
2557 16872 6463 3867 9359 11682 4382 3280 10936 3142 -8769 -959 -765 -3997 -3008 5979 10284
2542 10284 21752 23100 804 -7960 -2253 12032 14357 -1069 -4712 -8549 -1893 12146 15288
2529 15288 1430 -5243 -2789 -2744 -8268 -10574 -22586 -17540 -12692 -11273 -3234 7358 2235 -10884
2515 -10884 -15423 -20009 -19173 -13430 -4996 -10771 -15049 -12695 -5154 9863 12063 -2424 -16014 -9472
2501 -9472 1335 -222 1300 -3333 3901 13608 4541 3120 3288 1937 11891 11560 18374 9985 4965
2486 4965 17750 15932 6051 6259 12772 20488 9054 1112 -4390 5288 6516 -1444 -5384 2991 10940
2471 10940 13980 15338 24295 23087 11137 102 -265 20428 18100 13903 14417 -3225 -7568 -2740
2457 -2740 3706 10933 19213 10561 -10950 -7779 -12139 -6632 -7394 -3834 -2009 -2822 291 10647 14665
2442 14665 11353 14120 19773 6393 1285 5086 16954 25536 17003 7810 -3700 -3460 4804 17771
2428 17771 25266 24555 8661 4078 2789 1438 2158 12142 8791 3879 -1815 -10668 -7732 2056 2229
2413 2229 -2483 -5008 3048 11396 5147 -2006 -7530 -13651 -15967 -16992 -14335 -9614 -5559 5776 19615
2398 19615 9150 -3580 9048 7606 4490 2858 -7462 -3541 18530 27295 24612 20584 14013
2385 14013 1165 -13492 -29727 -26661 -13007 -2664 -5444 -8228 -6542 -4360 -6628 -9929 -13290
2372 -13290 -20474 4163 10451 3746 12631 7217 12959 23602 19178 13502 3181 881 13887 12812
2358 12812 11313 18830 10666 7259 10295 5318 7217 7893 16703 21684 12030 -5362 -10506 556
2344 556 21141 5637 -3387 12004 31701 36576 32595 22977 2895 -441 -6089 -11807 -3734 1631
2330 1631 7193 5888 -2550 6721 14392 11686 -11063 -10091 8874 -1950 -10997 -8036 -4818 6928
2316 6928 5565 -2343 -819 -12456 -12228 -11462 -4429 -10185 -11486 -12341 -11352 -4533 10026 3014 -1242
2301 -1242 3964 1704 3062 11707 24927 3506 -9165 -8287 -4 -4367 76 5711 191 2394
2287 2394 -8440 -5790 -2564 -7553 -1142 10820 3903 -2701 -9237 -7403 -10100 -6290 -9872 -12282
2273 -12282 -2732 9154 20577 13928 -4149 -6381 1592 4438 3473 10139 18322 17615 13098 8462
2259 8462 -980 6808 8698 1478 -16920 -21312 -12650 9725 6073 -13750 -11311 -3263 -16473 -25625
2245 -25625 -26043 -23580 -9677 -7981 4990 2717 -4135 -7064 -4946 -8800 -13401 -20011 -22989 -9042
2231 -9042 -4249 -9657 -5817 -5926 -5740 -17167 -18250 -10352 -6569 -6833 -7675 -13891 -8010 -13138 -14599 -5718
2215 -5718 -3395 10570 14344 29755 30777 12380 -6479 -10153 -20743 -34377 -30340 336 16242
2202 16242 12298 11377 12158 -5226 -19627 -33882 -34459 -25171 -15724 -20106 -7160 2873 -1676 -2478
2188 -2478 -10174 -12214 -10992 -13722 3122 17199 16027 16849 31672 26738 10850 6158 -1998 3363
2174 3363 2729 -1852 2467 4191 -1276 -7784 -4203 16465 16800 8028 16883 9259 5954 -3713 -17673
2159 -17673 -14444 2869 3806 7041 7795 1124 -10503 -10563 -2907 -5404 -10002 1126 3879 -3757 -2060
2144 -2060 4223 631 -8611 -19520 -23162 -17160 -17976 -8425 7339 9486 7192 1819 -4743 174 14922
2129 14922 128 -8588 3315 15740 4876 -4077 8124 5645 6479 12153 23855 28162 16332
2116 16332 9593 1913 -136 7765 19924 13849 12673 10694 20768 12009 -2911 -16483 -17217 -8686
2102 -8686 -7105 719 3262 -11556 -25748 -22322 -736 12031 18240 34487 34523 28678 18840 -30
2088 -30 -1702 8531 3670 6565 5855 9868 4781 3010 10387 -350 -8869 -4318 -4175 -22747 -22427
2073 -22427 -11124 932 7698 14350 4522 2722 -6548 -22202 -18225 -3477 -3467 -11120 -10365 -120
2059 -120 -5633 -17504 -14270 -17201 -15846 -6388 -4437 -4637 251 12816 12165 662 -9506 -16881 -5331
2044 -5331 4767 9261 13967 12913 12104 22231 25601 39301 31709 14352 8821 3698 6395 17420
2030 17420 19970 15358 16397 19361 12838 18228 16732 13738 1047 -2746 -8175 -19707 -13574 1570
2016 1570 10878 11744 -2568 -1662 -7033 -10155 -14877 -13356 5557 10940 -4079 -7650 -8212 -18360 -30296
2001 -30296 -25251 -7476 -8504 -13791 -14733 -14591 -9251 -8916 -17632 -11395 1221 5128 14349 14448 13925 11180
1985 11180 2600 -3727 6759 -2349 -10339 -13922 3605 2362 665 4093 4056 12076 6280 1983 325
1970 325 5171 21104 20416 10782 -6210 -16769 -1775 13543 14656 8375 -217 4137 5254 17575
1956 17575 13742 -593 -10200 -26583 -20655 -6111 2847 -4947 -3300 -13874 -4942 -4167 -4120 3057
1942 3057 5318 7499 11167 11543 8677 5634 5107 3095 2224 -6736 2802 12735 5863 1833 6610 10150
1926 10150 -7376 -12331 -2662 -4268 -6169 1810 5849 4287 11624 -6363 -26738 -19078 -17738 -3235
1912 -3235 4102 350 -12101 -21126 -10315 1294 5216 14451 18965 24472 43181 31959 31170 29126
1898 29126 23344 18647 7651 1921 7290 21350 20812 9889 282 226 19138 15084 5292 -1578
1884 -1578 -4135 -1827 -1092 9478 6624 1403 17794 31375 27881 13552 373 -17160 -19571 -5456
1870 -5456 69 -3156 -10032 -5997 -3279 13620 20124 14290 11334 7202 9598 8963 -9202 -13180 -5557
1855 -5557 10985 10658 -3606 -259 10178 16663 21355 32242 28416 36734 31850 18091 7377 -7297
1841 -7297 -7349 -6207 -17698 -26844 -24173 -6747 7843 13792 16649 25528 20983 23493 19988 1913
1827 1913 -12261 -28706 -29798 -7346 13028 9572 16165 23123 11036 -1784 -8290 -1808 -3271
1814 -3271 -893 -3991 -12672 -6657 10119 16130 18926 7837 1477 134 -844 -6848 -11938 1868
1800 1868 3525 -3367 -5611 2945 21217 33565 29920 21972 22780 18218 13208 12378 11479 9616 -3295
1785 -3295 -5094 5524 10203 16053 4308 356 1494 -1729 -8925 -20767 -13374 -2196 -543 -7601
1771 -7601 -4482 1203 13307 15956 14971 9920 -727 -18921 -24252 -4596 -5439 414 -8276 -6995
1757 -6995 -1068 10533 22917 36940 29978 17208 14751 21102 20250 8823 5292 -1843 14 -8226
1743 -8226 -13289 -6600 8772 12775 12697 15291 8589 -4007 -140 3155 7752 28789 10419 -833
1729 -833 16801 21818 1906 -10970 -3679 6541 16738 22288 17143 6597 -4228 -4578 3114 3002
1715 3002 -3812 -5241 727 18029 26624 21817 14819 8523 11896 16681 15319 8076 8375 4852 971
1700 971 -7573 1951 14445 19741 29601 32032 18853 21713 24783 18004 3863 -1448 12301 21726
1686 21726 21965 12557 -5979 -20027 -3884 -851 -2114 -17840 -24423 -18884 -24861 -10286 -6297 -3422
1672 -3422 7262 13013 7339 -7724 -11051 -13043 -5544 493 -8009 -16202 -13307 -7147 8546 10312
1658 10312 5942 1663 -617 -16536 -26010 -13690 -10887 -15517 -13763 -2509 9270 14251 10559 -632
1644 -632 -2360 -4558 -14459 -19992 -18938 -13799 -13165 -1786 -4208 -5322 -5895 -24857 -20592 -15196 -2072
1629 -2072 -6279 -733 -600 -4371 -11056 -11193 -6686 1088 -3254 -8508 8061 25820 12143 132
1615 132 7626 13346 4289 3861 -2295 3431 8340 11671 3195 -6604 7819 15952 12935 9450 6971
1600 6971 -8271 -6150 2640 -4754 5426 10618 23848 11764 16346 26865 17992 17287 -2956 -12767
1586 -12767 -3847 11539 3683 -7761 -6470 -3650 -156 4183 10232 12077 7983 6741 1839 -9123
1572 -9123 3466 -1726 -2790 8956 12853 4854 -1384 7079 22650 17404 9178 14562 11185 10993
1558 10993 23475 31254 18841 8850 10532 7289 18626 23371 13542 9108 5473 10023 4933 -9727
1544 -9727 -10336 313 1749 1923 -4776 -2174 4301 813 -5359 -8499 183 -507 3665 6908 5924 -14531
1528 -14531 -15830 -10744 -19918 -17499 -15116 -9517 3796 -4400 2902 -3450 -17669 -20792 -9948 -10429
1514 -10429 -8882 -709 3363 8937 12164 3307 314 -9207 -10724 -4288 5113 8162 4726 11441 6372
1499 6372 -3421 -5566 7932 13586 5955 14931 28012 23324 22313 7933 6599 10377 20064 11728
1485 11728 -976 -3498 -20097 -35088 -22998 -1116 1012 -2095 78 16014 24607 21023 9087
1472 9087 8417 16999 8696 6227 7624 -3002 -25623 -14970 -7550 -7312 -15032 -25583 -32584 -18689
1458 -18689 -3168 -8807 -12563 -2886 -2129 10675 8625 801 -1194 -2035 15729 17209 7105 2235
1444 2235 4939 21256 20121 11560 6239 149 -5265 -6377 883 -2693 -7992 3092 3103 6746 9896
1429 9896 13973 11102 -8775 -18984 -15906 -7398 3308 1722 5745 13463 9285 1677 6312 1328
1415 1328 8500 251 -10995 -9760 -20844 -8533 -3546 -2172 5019 19855 16447 7673 7716 4098
1401 4098 -11802 -7440 -6647 1504 -2017 -3817 6724 13088 6112 -2871 -15849 -14598 -7475 -3067
1387 -3067 2195 2720 -903 -7975 -8428 -7267 -10274 2071 10532 21515 22283 21229 27344 9990 -9453
1372 -9453 -11656 -12541 -9338 -13276 -1121 -306 -4577 -6128 1317 22029 36410 20381 18305 14382
1358 14382 872 -7451 -9200 648 8432 -3664 -7784 -5522 -5044 -6855 -14529 -17278 -5688 -8945
1344 -8945 -20380 -4988 9761 11775 8533 11784 10124 -4425 -3734 8028 13370 16633 14971 3440
1330 3440 -6062 5257 5978 14608 29736 18786 11701 5018 12237 28502 23795 6282 -5690 -11928
1316 -11928 -13054 -3451 -8719 -11295 -8443 -10679 -12383 -7713 -7552 -13885 -3077 19203 34339 27660
1302 27660 3794 -6756 -4040 -6047 -9704 -7385 1937 -2041 -8178 -6513 -12333 -13244 -18639 -17056
1288 -17056 -13217 -7802 -586 2806 -784 -2862 3514 3388 -38 -6318 -614 -993 -2316 -8726 -8634 -4145
1272 -4145 9108 17026 16182 9285 5182 710 273 1170 -1846 4756 4801 8999 -4608 -25269 -30076
1257 -30076 -20251 -10984 3616 18121 22356 9794 -4094 -1520 16689 13060 1916 2876 9409
1244 9409 3889 1800 -7465 -10690 -16300 -6992 -8725 -5430 8149 6598 8944 8467 1588 -7752 13073
1229 13073 19001 21103 19741 17752 4947 5671 1604 -11231 -10688 5296 10455 3780 9808 16868
1215 16868 6110 -7652 -5755 -1290 -3970 -2902 12340 16710 1392 -8540 -6715 1892 7035 -2332
1201 -2332 -10359 5130 16036 6468 6350 19732 14661 15058 16682 14024 3556 -4679 -8899 -5551
1187 -5551 8252 -6086 -12946 -11455 -10840 -2275 13805 10427 -1530 2874 763 -6257 -13430 -8826
1173 -8826 -4974 -17390 -31475 -38689 -28515 -19868 -7740 -6345 -16662 -3200 877 12843 15669
1160 15669 15542 7182 7010 5898 5606 1101 -2262 5058 17604 11204 5257 5962 -1609 -12152 -2931
1145 -2931 -5300 -1754 -6979 10113 24788 23983 12781 9708 5807 5522 6050 -7907 -2308 975 7896
1130 7896 5189 -53 -4353 -4420 2790 -821 3410 8428 3741 10393 17479 14586 10800 2721 -9440
1115 -9440 -7796 788 12813 13146 4355 11603 11328 5205 12328 18442 22010 24764 21837 5868 7294
1100 7294 9263 6919 6484 1365 -7979 1729 15052 30085 19273 9444 22825 17548 10715 -2762
1086 -2762 -7514 -4899 -8038 -8455 -9059 -10925 -13244 -21586 -25930 -4510 6728 10461 23200 17655 -6070
1071 -6070 -6962 -15125 -7853 -4373 6713 13299 9145 9659 16830 35829 31807 13038 6785 -2426 -12617
1056 -12617 -7226 -6852 -237 1524 -5354 -6614 -17703 -19614 -10384 -6505 2109 17257 9951 16495
1042 16495 12983 12694 15934 14994 8175 -7254 -17514 -2157 -2203 -106 7170 9132 14043 13204 17802
1027 17802 9851 -2147 -5971 183 10290 14607 6701 -851 -3222 9981 9959 7029 9305 11499
1013 11499 26688 26418 20229 21255 19001 30412 28542 19215 2737 3739 2636 -7057 -10984 7586
999 7586 14493 15154 14128 7113 3924 5304 -6411 1574 629 2401 -4429 -14498 -22756 -13766 -9905
984 -9905 -22500 -32222 -24879 -19721 -3911 2658 6617 8855 13903 4230 12708 13779 7183 8328 -7337
969 -7337 -10160 -8120 9053 12275 9258 9890 19929 23272 2606 -5479 2469 11727 -3985 -1540
955 -1540 -6361 -263 4574 4356 4515 2679 1165 3651 831 1188 9126 17567 13276 6376 4243 -5224
939 -5224 -8901 5760 8323 -7774 -13442 -6949 -2409 1282 4210 4475 5983 12672 14976 7346 6308
924 6308 765 -16208 -19925 -9274 -5093 5033 24488 5600 -10553 -995 18845 35705 28418
911 28418 14171 4034 4039 10393 9700 -4739 -7692 -8677 -5712 -15502 -15361 -11745 -14788 -5671 -1311 6626
895 6626 -5512 -29691 -34179 -30635 -26576 -22644 -13557 -6581 -6656 -11000 -15405 -6009 -6387 4016 -621
880 -621 -2372 -1945 -8553 -6103 -7234 -9537 1519 12963 5644 -6698 8151 11904 18757 13403 617
865 617 -8652 -11367 784 3498 -129 -13130 -13994 -14676 -16083 5289 17503 14533 -1142 573 11455
850 11455 24743 10794 9447 18938 16555 18162 -1398 -13910 -10343 -7723 -16743 -14868 -6157 2615
836 2615 11595 27223 23156 14478 7983 5235 4385 2793 2148 6632 6138 -2327 -2391 5822 -4381 -12864
820 -12864 -5905 38 -9518 -13625 -10369 -5939 -3773 -9749 -12828 -14517 -7811 -7533 -6777 -17409 -9351
805 -9351 3852 -313 -13517 -22838 -16749 -12229 -16581 -14031 -2514 -5705 -8450 -1211 3427 -3013
791 -3013 -35 1495 596 14 7139 7366 12976 1799 2455 3133 -4858 -500 514 -10019 -10343 -7110
775 -7110 -741 -7397 -9286 -799 657 5786 9006 5287 504 -4637 -7539 -13146 -3570 12546 8011
760 8011 9362 12782 8185 9838 1500 -6810 -2822 13503 10163 733 -23780 -27590 -12398 -9394
746 -9394 -8509 -5560 560 -5825 -4141 1844 10694 4474 239 -19601 -29141 -25995 -28236 -26402 -8720
731 -8720 24506 20396 21932 16386 1815 -12608 -14915 -4690 -14235 -21701 -19895 -16399 -12216 4918
717 4918 11915 19568 26520 23297 5889 -5679 -12230 -7577 396 1767 7599 3174 8168 8520 13399
702 13399 20923 9461 -8522 -11581 -8566 -16010 -24641 -21937 -8743 7065 35 -17341 -28041
689 -28041 -14776 -13966 -20277 -23887 -13617 -7295 -7362 -2152 -2291 -8306 -4620 -5153 -12947 -22390 -16922 -20025
673 -20025 -23364 -27718 -16215 -16349 -1300 8918 6826 -5283 2208 6161 7722 8249 5050 6624
659 6624 12383 2917 -3786 -6595 -9812 -13257 9332 7093 -8878 -5316 1996 -3928 -8663 11294
645 11294 26513 8939 11275 21049 18714 12383 5594 8138 -5594 -24919 -22212 -16688 -11960 -11967 -14274
630 -14274 -10479 -2017 -10487 -22731 -24471 -33670 -43728 -53042 -37443 -24026 -16940 -11854 -3612 1920
616 1920 4593 -3248 -14221 -14743 -14774 -13157 -14910 -15789 -11405 -12967 -15911 -9781 -16378 -25501 -22169 -14604
600 -14604 -6522 -4098 419 -1735 9300 2742 2691 12022 4844 -16888 -13667 -7472 845 20406 12800
585 12800 6105 6830 13269 5332 -5189 -10210 -25247 -27522 -17414 3149 6041 -10022 -8594 4064
571 4064 1521 -3327 -5923 6508 8521 8844 2836 1385 8609 -3797 -5802 -1617 6764 15454 16404
556 16404 10602 4332 960 -4026 -2375 -1587 -9013 -7584 -4251 9442 18089 21062 15919 14495 16726
541 16726 14982 1817 4804 12193 12762 7989 -1407 -13579 -16964 -25622 -27629 -23556 -6596 3681
527 3681 -591 -7389 -7212 -3367 -10759 -19010 -18429 -10810 -9857 -223 9712 6468 550 3881 -2369 -3704
511 -3704 -9822 -10084 -4304 -476 4094 10288 9514 -2711 -6690 -5797 -12265 -10315 -4388 2765 -7111 -28670
495 -28670 -27832 -20662 -17325 -22074 -12000 -9608 -10094 -5419 9475 -4822 -18599 -15976 -14735 -12923
481 -12923 -7499 -1547 -7689 -6079 -9573 -19563 -26123 -17007 -9403 -2373 4013 7809 -84 2664 -2741
466 -2741 -5712 -6572 -5940 -12776 -17049 -19100 -22865 -12579 -213 19573 16145 1897 -585 4317 7627
451 7627 -1610 4729 2910 -764 13447 16867 18137 696 -5151 665 -9314 -19094 -11372 1518
437 1518 6902 7973 10580 6183 763 -1432 -9026 -14308 -14698 -16208 -8231 1672 146 -3048 1620
422 1620 7360 4760 -712 -4514 -11567 -16224 -28328 -25941 -16762 -13925 -9600 -7957 -8243 -13866 -20493
407 -20493 -30203 -29530 -29969 -20860 -12836 -9830 -4805 -5761 -11233 -7823 -5435 -11219 -20598 -25452 -20890 -11539
391 -11539 -8655 -6394 -5102 203 -10844 -13413 -3283 -1515 6097 -129 -18048 -27381 -32292 -19606
377 -19606 691 2058 -689 3186 14721 16030 13506 3826 6900 8017 2469 -8223 -8010 -4205
363 -4205 1107 6299 10657 1637 -8209 1835 -4632 -9742 -8454 -9154 -15487 -5796 8991 20804 25498
348 25498 13526 3881 -12141 -18534 -11901 -8519 5564 14478 16428 21899 16404 4321 -6286 -6429
334 -6429 -4468 1650 -4330 208 15346 18892 12525 6655 -7542 -20975 -16189 -8398 -5311 -7424
320 -7424 -8124 -8320 -1280 -5938 -14385 -12591 1701 10851 12965 7039 9832 3099 -6264 -9214 -6122
305 -6122 -18994 -10307 7944 2633 -7229 -25772 -25088 -21617 -11843 -2367 -23262 -25238 -19738 -23672
291 -23672 -22202 -7310 -3922 -6311 -4067 9346 6948 5043 5209 -2165 4137 5065 4482 -7630 -10114
276 -10114 -29 253 8775 10239 11802 15938 9697 -2445 -9197 -14193 -21189 -20916 -20788 -23368 -32914
261 -32914 -27820 -17045 -12733 -7208 -5896 -9911 -189 13829 11808 11887 1399 -16764 -22537 -35809
247 -35809 -34650 -17623 -15944 -21386 -24415 -19510 -7630 -13030 -24049 -21688 -9201 -7749 -11757 -16749
233 -16749 -12106 -6461 -3578 2273 4993 4300 5041 1472 -5383 -12372 -14502 -2264 -8863 -13997 288
218 288 -333 -3 6504 410 -9551 -11277 -4374 8650 9452 3062 -1603 6946 8843 11660 7544 1766
202 1766 4679 11710 3821 -9337 -11642 -5068 8480 10424 9505 7996 3488 5549 4560 6177 13790
187 13790 13981 7492 5346 9642 641 189 3504 10302 19419 22921 13830 1656 -13847 -17713 -7890
172 -7890 3833 7904 4727 7871 8172 3478 -8380 -607 -5904 -11492 -16579 -17620 -11543 -11852 -14251
157 -14251 -20155 -14918 -3440 -6003 -3829 5116 453 -3845 -5348 -5006 -10554 -19346 -10959 -563 -2708
142 -2708 -5147 -5645 -1916 75 -18703 -8992 -797 -1724 -5457 -853 11993 12978 12074 11000 10405 14171
126 14171 3825 -2796 -7700 -11598 -5395 -2382 -3246 6551 4668 -10188 -16927 -18537 -26594 -21170 -7175
111 -7175 4335 3280 -8064 -11775 -19833 -21804 -32165 -31985 -13089 -8474 -11668 -10053 -2296 -11404
97 -11404 -16552 -14649 -13875 -7654 -5647 -10192 -11327 -5432 -2700 -6490 -1880 12516 14317 8005 -8172
82 -8172 -14410 -13938 -14729 -8821 -2723 -3094 -6906 -11608 -20288 -24559 -28830 -18055 -12686 -1045 2724 159
66 159 -11050 -14432 -7759 -6580 -7240 -17152 -27720 -27059 -22710 -17188 -22063 -14343 -12798 -9330 -9274 -4761
50 -4761 566 2251 6 3991 1810 4931 16100 10678 -4094 -14015 -17215 -8813 -2673 -3662 -4612
35 -4612 1610 418 1143 -924 1743 -3762 -995 -1819 5904 9378 1697 -574 5171 1518 113 2499
19 2499 -12793 -8564 -5969 -2167 -548 -8858 -8130 -6530 -7941 499 1758 -3311 -5039 -449 -3567
4 -3567 -3100 -313 3287 14850
0 14850
$$ Imaginary data points
##PAGE= N=2
##DATA TABLE= (X++(I..I)), XYDATA
32767 115120 127770 131317 130220 131986 141633 141915 138257 136785 138477 144999 148553 152386 151602 169418
32753 169418 173513 169742 168166 146111 136255 144189 150934 156456 152969 148051 155442 159326 166551 167776
32739 167776 164753 160890 167306 169874 165287 155466 152179 158893 157624 171325 173224 179812 177170 169657
32725 169657 168344 175597 181316 176102 173508 189135 197954 196252 188120 189023 195374 192272 187399 189728
32711 189728 197550 197220 190222 195790 197435 188653 180575 176532 197669 214078 212380 209769 205726 200088
32697 200088 205152 210365 206715 201855 206640 212294 222630 226605 227954 221837 213593 207840 212530 214720
32683 214720 214269 217618 225323 219308 210132 210864 214503 223297 226842 226542 235624 236159 238676 230100 232033
32668 232033 236328 239108 238471 234072 229805 223871 231764 225151 230450 239689 243170 248415 252588 257482
32654 257482 254985 254323 249036 251153 251371 241484 239891 241870 241720 239532 248849 255793 253739 250441 246915
32639 246915 245460 240747 246866 263184 266459 270006 264558 258417 270667 273504 271367 261638 264718 277815
32625 277815 277259 274239 279259 283963 288087 290113 284578 277169 273815 259651 252851 262287 276164 284539
32611 284539 277284 274735 274693 278516 283789 283550 291010 293056 296679 311829 309632 294072 285732 284948 289287
32596 289287 297178 308280 309389 310196 316491 322525 310853 304637 305814 308260 313342 308041 307271 308857
32582 308857 314121 330787 329634 337380 343525 340873 345943 349020 335922 314793 314882 308736 305337 319181
32568 319181 324256 336570 344427 332691 332293 331341 324159 316770 320679 326127 322950 333189 329514 323881
32554 323881 333049 344067 345285 340548 340274 333053 324538 319894 332450 340587 332662 336748 355881 356774
32540 356774 350627 348960 346473 351083 358436 358027 346666 343938 346814 350250 341783 347169 345498 349736
32526 349736 351117 357862 361207 359603 348652 346121 340837 352463 356027 365551 377430 379426 370770
32513 370770 363396 364072 367831 369358 369094 382052 381926 364618 366551 365626 371695 385709 377360 366834
32499 366834 354067 359371 371829 374175 383184 382991 392378 394167 390981 388762 389797 390628 397261 400034
32485 400034 398225 388999 390543 383748 370648 379029 373955 373585 373341 365679 370095 366102 377227 379824
32471 379824 388611 394352 395931 394618 396745 405409 410452 404299 396152 396675 403350 404191 398665 387549
32457 387549 384548 391170 395190 403130 410477 395464 388357 386692 389175 391413 390760 395032 392308 398584
32443 398584 401721 412783 411390 406172 407096 403723 401280 414230 414231 410537 403414 399053 408562 416178 411864
32428 411864 410747 410112 405050 405372 401555 402357 405528 403705 402049 405922 397656 398644 402469 418865 437779
32413 437779 433006 427367 428821 426675 430088 424205 422861 420553 419991 418576 425403 428289 427726 442750
32399 442750 441160 440628 435795 425022 422818 441516 458452 458916 464038 467102 455864 431328 416556
32386 416556 416470 421297 420768 427907 430506 430240 426040 413333 415601 411965 413357 424413 431653 441179 442000
32371 442000 437435 441771 446240 430731 433516 446885 441448 441871 448268 454856 440115 434667 435876 433891
32357 433891 432283 436412 450167 458409 468747 462615 453833 446293 433880 432202 447011 451592 452826
32344 452826 444250 436592 430683 430938 430053 430381 440563 454320 454727 460100 461174 453404 452421 450615 453177
32329 453177 451636 451686 459710 459421 448473 447652 457236 456074 454646 457318 459657 465232 466349 465349 470625
32314 470625 464661 461269 459650 458623 446613 453896 468377 460264 447311 442658 441135 453322 456860
32301 456860 469486 461060 444198 447332 445449 442427 449598 450923 461071 462369 464868 458954 463857
32288 463857 475167 466258 466661 469745 466640 465346 459080 453084 445667 437035 441117 453222 469265 471778
32274 471778 481313 482828 479147 458261 451581 448410 456613 464566 479484 490199 485486 489931 472353
32261 472353 463691 465162 457868 450483 449684 441247 436504 431636 425376 436454 436800 449768 453030 451821
32247 451821 459295 468396 462673 464705 466911 472388 463113 457030 456217 467633 469944 463064 465400 472205
32233 472205 477660 481661 487721 492625 492081 490296 481300 456316 445299 455913 477378 478039 470503 470368
32219 470368 469080 467302 462188 460761 462552 476739 482378 489481 490227 481533 472164 456592 453131 454304
32205 454304 456124 459228 457215 452589 458694 463349 467070 473903 474940 471841 470982 466166 460462 462703
32191 462703 469188 478563 482583 477566 482092 477883 473474 459306 459233 472005 468139 476397 471373 457204
32177 457204 455711 467079 467436 473420 468831 463882 466104 479993 478509 478115 472764 469423 467953 463787
32163 463787 457421 473684 488001 484953 484094 489662 498828 503072 508435 503724 485494 480978 492919
32150 492919 494410 481632 475000 464777 465876 475346 485494 488965 489890 496452 489762 483448 475139 472022
32136 472022 477356 474027 478670 481296 479089 469186 459113 473714 480970 473614 459130 461554 468157
32123 468157 471674 479260 484982 473426 478761 492138 483169 473832 477943 477734 485615 490627 504628 497550
32109 497550 499156 497960 482363 475057 471080 470872 475216 476822 473060 481460 489400 478584 476554 480882
32095 480882 494787 493514 490448 485584 481958 481733 471682 480219 491104 494737 480514 475635 481459
32082 481459 474481 467814 463033 470034 484711 486289 490817 491084 475489 460930 453045 448785 443225 454471
32068 454471 471032 469447 461183 454161 454627 459290 463668 474564 480128 481310 493690 505038 507384
$$ [...]
##END NTUPLES=NMR SPECTRUM
##END=
