##TITLE=Analysis number 313481
Compound Code cc 41809
Book Reference 414/124/3
Project Code adrs
Chemist Name mattw
##JCAMPDX= 6.0         $$ Bruker NMR JCAMP-DX V2.0
##DATA TYPE= NMR SPECTRUM
##DATA CLASS= NTUPLES
##ORIGIN= Bruker BioSpin GmbH
##OWNER= NMR
$$ XWIN-NMR		Version 3.5
$$ Fri Sep  9 14:29:35 2005 GMT Daylight Time (UT+1h)  MAYBRIDGE\NMR@NMR_250MHZ
##.OBSERVE FREQUENCY= 250.131544655141
##.OBSERVE NUCLEUS= ^1H
##.ACQUISITION MODE= SIMULTANEOUS (DQD)
##.ACQUISITION SCHEME= undefined
##.AVERAGES= 16
##.DIGITISER RES= 18
##SPECTROMETER/DATA SYSTEM= dpx250
##.PULSE SEQUENCE= zg30
##.SOLVENT NAME= CDCl3
##.SHIFT REFERENCE= (INTERNAL, CDCl3, 0, 16.4467)
##AUDIT TRAIL= $$ (NUMBER, WHEN, WHO, WHERE, WHAT)
$$ ##TITLE= Audit trail, XWIN-NMR		Version 3.5
$$ ##JCAMPDX= 5.01
$$ ##ORIGIN= Bruker BioSpin GmbH
$$ ##OWNER= NMR
$$ C:\u/data/dgb/nmr/ADRS/9180/pdata/1/auditp.txt
$$ ##AUDIT TRAIL=  $$ (NUMBER, WHEN, WHO, WHERE, WHAT)
(   1,<2005-09-09 14:29:16.03 +100>,<MAYBRIDGE\NMR>,<NMR_250MHZ>,
      <created by zg, POWCHK disabled, PULCHK disabled
       configuration hash MD5:
       62 19 C7 07 E1 42 D1 B7 37 6C 3D D0 77 39 F9 E6
       data hash MD5: 64K
       AE 7F 24 6F 89 18 30 6F 3A FC 1E 37 59 81 9E 6F>)
(   2,<2005-09-09 14:29:27.77 +100>,<MAYBRIDGE\NMR>,<NMR_250MHZ>,
      <Start of raw data processing
       ef LB = 0.3 FT_mod = 6 PKNL = 1 SI = 32K 
       data hash MD5: 32K
       93 70 CE A8 F2 6B B4 EC BB CF C3 F6 7C FC C9 27>)
(   3,<2005-09-09 14:29:29.71 +100>,<MAYBRIDGE\NMR>,<NMR_250MHZ>,
      <apk 
       data hash MD5: 32K
       9C 0E 49 E4 53 A0 00 FE 52 0B 30 4F 46 E0 EB 79>)
(   4,<2005-09-09 14:29:30.36 +100>,<MAYBRIDGE\NMR>,<NMR_250MHZ>,
      <abs ABSG = 5 
       data hash MD5: 32K
       14 DE 9E 45 3B CB 86 85 2E 16 71 C7 2A 53 EB 5C>)
$$ ##END=
$$ 
$$ hash MD5
$$ 60 33 2A FA 17 A3 3A 2E 70 81 D3 20 06 34 78 A5
##$RELAX= 
##$RELAX= 
##$RELAX= 
##$RELAX= 
##$RELAX= 
##$RELAX= 
##$RELAX= 
$$ Bruker specific parameters
$$ --------------------------
##$DU= <C:\u>
##$EXPNO= 9180
##$NAME= <ADRS>
##$PROCNO= 1
##$TYPE= <nmr>
##$USER= <dgb>
##$AMP= (0..31)
100 100 100 100 100 100 100 100 100 100 100 100 100 100 100 100 100 100 
100 100 100 100 100 100 100 100 100 100 100 100 100 100 
##$AQSEQ= 0
##$AQ_mod= 3
##$AUNM= <au_zg>
##$AUTOPOS= <33 >
##$BF1= 250.13
##$BF2= 250.13
##$BF3= 250.13
##$BF4= 250.13
##$BF5= 500.13
##$BF6= 500.13
##$BF7= 500.13
##$BF8= 500.13
##$BYTORDA= 1
##$CFDGTYP= 0
##$CFRGTYP= 5
##$CHEMSTR= <none>
##$CNST= (0..31)
1 1 145 1 1 1 1 1 1 1 1 1 1 1 1 1 1 1 1 1 1 1 1 1 1 1 1 1 1 1 1 1 
##$CPDPRG= <>
##$CPDPRG1= <>
##$CPDPRG2= <>
##$CPDPRG3= <>
##$CPDPRG4= <mlev>
##$CPDPRG5= <mlev>
##$CPDPRG6= <mlev>
##$CPDPRG7= <mlev>
##$CPDPRG8= <mlev>
##$CPDPRGB= <>
##$CPDPRGT= <>
##$D= (0..31)
0 1 0 0 0 0 0 0 0 0.06 0 0 0 0 0 0 0.0002 0 0 0 0 0 0 0 0 0 0 0 0 0 0 
0 
##$DATE= 1126272554
##$DBL= (0..7)
120 120 120 120 120 120 120 120 
##$DBP= (0..7)
150 150 150 150 150 150 150 150 
##$DBP07= 0
##$DBPNAM0= <>
##$DBPNAM1= <>
$$ [...]
##$SUBNAM7= <"">
##$SUBNAM8= <"">
##$SUBNAM9= <"">
##$SW= 20.6930455092707
##$SWIBOX= (0..15)
0 0 3 0 0 0 0 0 0 0 0 0 0 0 0 0 
##$SW_h= 5175.983436853
##$TD= 65536
##$TD0= 1
##$TE= 295.16
##$TE2= 300
##$TE3= 300
##$TEG= 300
##$TL= (0..7)
0 120 120 120 120 120 120 120 
##$TP= (0..7)
150 150 150 150 150 150 150 150 
##$TP07= 0
##$TPNAME0= <>
##$TPNAME1= <>
##$TPNAME2= <>
##$TPNAME3= <>
##$TPNAME4= <>
##$TPNAME5= <>
##$TPNAME6= <>
##$TPNAME7= <>
##$TPOAL= (0..7)
0.5 0.5 0.5 0.5 0.5 0.5 0.5 0.5 
##$TPOFFS= (0..7)
0 0 0 0 0 0 0 0 
##$TUNHIN= 0
##$TUNHOUT= 0
##$TUNXOUT= 0
##$USERA1= <user>
##$USERA2= <user>
##$USERA3= <user>
##$USERA4= <user>
##$USERA5= <user>
##$V9= 5
##$VALIST= <valist>
##$VCLIST= <CCCCCCCCCCCCCCC>
##$VD= 0
##$VDLIST= <DDDDDDDDDDDDDDD>
##$VPLIST= <PPPPPPPPPPPPPPP>
##$VTLIST= <TTTTTTTTTTTTTTT>
##$WBST= 1024
##$WBSW= 4
##$XGAIN= (0..3)
0 0 0 0 
##$XL= 0
##$YL= 0
##$YMAX_a= 409075
##$YMIN_a= -372563
##$ZGOPTNS= <>
##$ZL1= 120
##$ZL2= 120
##$ZL3= 120
##$ZL4= 120
##$ABSF1= 16.44674
##$ABSF2= -4.246433
##$ABSG= 5
##$ABSL= 3
##$ALPHA= 0
##$AQORDER= 0
##$ASSFAC= 0
##$ASSFACI= 0
##$ASSFACX= 0
##$ASSWID= 0
##$AUNMP= <proc_1d>
##$AZFE= 0.1
##$AZFW= 0.1
##$BCFW= 0
##$BC_mod= 0
##$BYTORDP= 0
##$COROFFS= 0
##$CY= 12.5
##$DATMOD= 1
##$DC= 0
##$DFILT= <>
##$DTYPP= 0
##$F1P= 14.0000005364418
##$F2P= -0.99999901652339
##$FCOR= 0.5
##$FTSIZE= 32768
##$FT_mod= 6
##$GAMMA= 0
##$GB= 0
##$INTBC= 1
##$INTSCL= 1
##$ISEN= 128
##$LB= 0.3
##$LEV0= 0
##$LPBIN= 0
##$MAXI= 10000
##$MC2= 0
##$MEAN= 0
##$ME_mod= 0
##$MI= 0
##$NCOEF= 0
##$NC_proc= -4
##$NLEV= 6
##$NOISF1= 0
##$NOISF2= 0
##$NSP= 0
##$NTH_PI= 0
##$NZP= 0
##$OFFSET= 16.44674
##$PC= 1
##$PHC0= -79.57002
##$PHC1= 3.082899
##$PH_mod= 1
##$PKNL= yes
##$PPARMOD= 0
##$PSCAL= 4
##$PSIGN= 0
##$REVERSE= no
##$SF= 250.130018822398
##$SI= 32768
##$SIGF1= 0
##$SIGF2= 0
##$SINO= 400
##$SIOLD= 32768
##$SREGLST= <1H.CDCl3>
##$SSB= 0
##$STSI= 32768
##$STSR= 0
##$SW_p= 5175.98343685301
##$SYMM= 0
##$S_DEV= 0
##$TDeff= 65536
##$TDoff= 0
##$TI= <Analysis number 999999
Compound Code 99
Book Reference 9
Project Code 9>
##$TILT= no
##$TM1= 0
##$TM2= 0
##$TOPLEV= 0
##$USERP1= <user>
##$USERP2= <user>
##$USERP3= <user>
##$USERP4= <user>
##$USERP5= <user>
##$WDW= 1
##$XDIM= 32768
##$YMAX_p= 484318460
##$YMIN_p= -248007
$$ End of Bruker specific parameters
$$ ---------------------------------
##NTUPLES= NMR SPECTRUM
##VAR_NAME=  FREQUENCY,     SPECTRUM/REAL,   SPECTRUM/IMAG
##SYMBOL=    X,             R,               I
##VAR_TYPE=  INDEPENDENT,   DEPENDENT,       DEPENDENT
##VAR_FORM=  AFFN,          ASDF,            ASDF
##VAR_DIM=   32768,         32768,           32768
##UNITS=     HZ,            ARBITRARY UNITS, ARBITRARY UNITS
##FACTOR=    0.157963299565203, 1,           1
##FIRST=     4113.82318485699, 0,            0
##LAST=      -1062.16025199602, 0,           0
##MIN=       -1062.16025199602, -248007,     0
##MAX=       4113.82318485699, 484318460,    0
$$ Real data points
##PAGE= N=1
##DATA TABLE= (X++(R..R)), XYDATA
$$ [...]
19394B70757o7796P45L171o291J1962O416M5034M3123M948l4240r4784l5447o49
$$ 270757 202961 203706 206877 200586 212548 218964 263998 307121 312069 277829 183045 147598 146949
19381A46949R59O731l685j8211j3002q695O637m349n871J8998k6505m0306L516
$$ 146949 147908 154639 150954 132743 119741 111046 117683 113334 107463 126461 99956 59650 63166
19368F3166K9681L5261J4730K165O4740N5883M2775j6167o0423l5590k2971R577
$$ 63166 92847 128108 142838 145003 209743 265626 308401 292234 231811 196221 173250 182827
19356A82827K1568J9022K3121M3180O6830N4235o259j2013o889J656k1835o3676
$$ 182827 204395 223417 246538 289718 356548 410783 404524 392511 385622 387278 365443 301767
19344C01767m0948l0215O05l2042r291J7542M1332N1422n270m0884l6235j6802
$$ 301767 260819 230604 231209 199167 189876 207418 248750 300172 294902 254018 217783 200981
19332B00981l3767k6075m8377j1341J2451n773j0358j6622K076j7754P763J2230
$$ 200981 167214 141139 92762 81421 93872 88099 77741 61119 63195 45441 53204 65434
19320F5434J9631j6242l6071j4983q518O193l892j571J7958Q329M031K7275J597
$$ 65434 85065 68823 32752 17769 9251 15444 11552 9981 27939 36268 40299 67574 69171
19307F9171P363p18J5181j4328n298n778n925j0145K1766M1223J1990j7884m5421
$$ 69171 76534 75816 90997 76669 71371 65593 59668 49523 71289 112512 124502 106618 61197
19294F1197r105L470j5498l630K0908P486J0056q705l992k5418J342L5979q552
$$ 61197 52092 55562 40064 36434 57342 64828 74884 66179 62187 36769 38111 74090 65538
19281F5538j2465J102n703K0271J2795J0732m390k980j3280K6490O237N120j7024
$$ 65538 53073 54175 48472 68743 81538 92270 87880 84900 71620 98110 104347 109467 92443
19268I2443k3424j4070j6965j7772k2017J9275L2318J9071K44k386j4234j1513
$$ 92443 69019 54949 37984 20212 -1805 17470 49788 68859 69103 66717 52483 40970
19256D0970J2604l160j5221O354j2342p14K7685J8409J3242k0708l7992P888J4488
$$ 40970 53574 50414 35193 41547 29205 28491 56176 74585 87827 67119 29127 37015 51503
19243E1503O100Q236L139L450m975N321N374j2163J8962k427k2520J2379P605
$$ 51503 57603 65839 68978 72428 67453 72774 78148 65985 84947 82520 60000 72379 79984
19230G9984j8773j0990k3901r018J9521J2103N306k163M8184J3543k9721n0975
$$ 79984 61211 50221 26320 17302 36823 48926 54232 52069 100253 113796 84075 33100
19218C3100k404o906j0271K1549o452Q741o127K180l355R933J9362L767M02N260
$$ 33100 30696 23790 13519 35068 28616 37357 31230 33410 30055 39988 59350 63117 63519 68779
19204F8779J318j1290P959Q269j2643R069K4064J2658K4858o426l1799j1002l312
$$ 68779 70097 58807 66766 75035 62392 71461 95525 108183 133041 126615 94816 83814 80502
19191H0502J1020K8123L8368K1061M4173M8365J7305n272J5837P684j8453m0520
$$ 80502 91522 119645 158013 179074 223247 271612 288917 283645 299482 307166 288713 248193
19179B48193k0660j1383o868j075J6903M3288L8135M1100K6920L2332r729n8214
$$ 248193 227533 216150 209282 208207 225110 268398 306533 347633 374553 406885 397156 338942
19167C38942n4836o0813k5237j6613l8285J1486j0286p734k263k5570l0005J0586
$$ 338942 284106 223293 198056 181443 143158 154644 144358 136624 134361 108791 78786 89372
19155H9372L2462k8963o782P377J1950L2914K7614L2848P182J3677J2283J1555
$$ 89372 121834 92871 86089 93466 105416 138330 165944 198792 205974 219651 231934 243489
19143B43489J6886Q081J5954R965K4144J353q587J1989J8249l5737k907M2318
$$ 243489 260375 268456 284410 294375 318519 319872 311285 323274 341523 305786 302879 345197
19131C45197J7103l037M888K173K1542L3274k1354m0249m2779k8577l4433m9452
$$ 345197 362300 359263 364151 366324 387866 421140 399786 359537 316758 288181 253748 204296
19119B04296k4491l1559j4937j7536J3537j7520j2374K0948J0170j6045Q491n346
$$ 204296 179805 148246 133309 115773 129310 111790 99416 120364 130534 114489 122980 117634
19107A17634l0293P292K0665K56J5587J041j4980J5476r739k4406K3807j505j069
$$ 117634 87341 94633 115298 115554 131141 132182 117202 132678 122939 98533 122340 120835 119766
19094A19766P184J5955m450L23K1589J3243n117L217j4706o267J1895p287n611
$$ 119766 126950 142905 138455 138778 160367 173610 168493 171710 157004 150737 162632 155345 149734
19081A49734J801N914j2082k6681j968R959J6042K2348n45j7897q630j9717r152
$$ 149734 151535 157449 145367 118686 116718 126677 142719 165067 164522 146625 137995 118278 109126
19068A09126O305K7103J4255J1202p61k0165l9062l4106K3424L4256J9318l0908
$$ 109126 115431 142534 156789 167991 167230 147065 108003 73897 97321 131577 150895 119987
19056A19987j6057N1300K9814O289l6897j0262J5889j541r512K768K546n242o991
$$ 119987 103930 155230 185044 191333 154436 144174 160063 158522 149010 151778 154324 149082 142091
19043A42091n726m36r074M1109o737m733k602j877l711q323m628j0283j0568L5916
$$ 142091 136365 135929 126855 167964 161227 156494 153892 152015 148304 139981 135353 125070 114502 150418
19029A50418M5016K635N164P63K921j1233r327n41K6914K0175j465J6112K0997
$$ 150418 195434 198069 203233 203996 206917 195684 186357 185816 212730 232905 231440 247552 268549
19016B68549j3002j9292K3186k6606J2278Q786o040N922n090K176k6504p511K3625
$$ 268549 255547 236255 259441 232835 245113 253899 247859 253781 248691 250867 224363 216852 240477
19003B40477J858k1915j8264q080K0640L268j9464n111k818l1633N800M3015r654
$$ 240477 242335 220420 202156 194076 214716 217984 198520 193409 190591 158958 164758 207773 198119
18990A98119l6047j4567K4640J7429K6891N2364K632j8218j3096l47j9636k255
$$ 198119 162072 147505 172145 189574 216465 268829 271461 253243 240147 239800 220164 217909
18978B17909r969J6681K346r38L216J5426K6487m242k6605j6640L0729P967K7585
$$ 217909 207940 224621 226967 226029 229245 244671 271158 266916 240311 223671 254400 262367 289952
18965B89952N979J1889k8252J8357M3332J5103q71l023p159j5099n976R017J4104
$$ 289952 295931 307820 279568 297925 341257 356360 355489 352466 345307 330208 324232 333249 347353
18952C47353j5302r484Q32l338K3708L7419L3272j2818j1673O909J3672J8829
$$ 347353 332051 322567 323399 320061 343769 381188 414460 401642 389969 396878 410550 429379
18940D29379M6786L8992L6166M2970L3491J7546J8604O1058M5551M5199M8140
$$ 429379 476165 515157 551323 594293 627784 645330 663934 724992 770543 815742 863882
18929H63882R0788Q4286M1249L4654R0994J27230J54257J47766J28683J29013
$$ 863882 954670 1038956 1080205 1114859 1205853 1333083 1487340 1635106 1763789 1892802
18919A892802J34415R4145O9524J13773K08158L15422M53175M91980M76950M79472
$$ 1892802 2027217 2121362 2190886 2304659 2512817 2828239 3281414 3773394 4250344 4729816
18909D729816O23216P86960J021186J616448K726977M519244P363452J0830860
$$ 4729816 5353032 6139992 7161178 8777626 11504603 16023847 23387299 34218159
18901C4218159J1745345M900747o644898r906900p060794l991056j449633J083607
$$ 34218159 45963504 50864251 44219353 34312453 27251659 23260603 21810970 22894577
18893B2894577M152368Q223249J2385384J2644311N025463k011955M35880J171652
$$ 22894577 27046945 35270194 47655578 60299889 65325352 63313397 63749277 64920929
18885F4920929o518728j2930362j1043642p092428l892649j304359J331320M517574
$$ 64920929 58402201 45471839 34428197 27335769 23443120 22138761 23470081 27987655
18877B7987655Q125260R887848M702625o722790j1470644q909616n890062l865970
$$ 27987655 36112915 46000763 50703388 43980598 32509954 23600338 17710276 13844306
18869A3844306k572160j723117j155832p31002l87305r7968M4974J11563K23431
$$ 13844306 11272146 9549029 8393197 7662195 7274890 7176922 7221896 7333459 7556890
18860G556890L75012O15169R00066J380643K272267L793319O309128J0114334
$$ 7556890 7931902 8547071 9447137 10827780 13100047 16893366 23202494 33316828
18852C3316828J3759637J1779547k28146j1138545j0679348o749421l383210m56375
$$ 33316828 47076465 58856012 58627866 47489321 36809973 30060552 26677342 26220967
18844B6220967K659512O520198J1253578J4631647J1414930J666588j036037K757464
$$ 26220967 28880479 35400677 46654255 61285902 72700832 74367420 73331383 76088847
18836G6088847j014973j2419452j5607568j1210258o739147l359096l61789K872806
$$ 76088847 75073874 62654422 47046854 35836596 29097449 25738353 25376564 28249370
18828B8249370O737645J0429621R801683M380j1523560j2542415q924731n916587
$$ 28249370 34987015 45416636 55218319 55222699 43699139 31156724 22231993 16315406
18820A6315406l962585k665765j840867j332861r54205p25091n59840n01627m44839
$$ 16315406 12352821 9687056 7846189 6513328 5559123 4834032 4274192 3772565 3327726
18811C327726l57472k80163j77060j53295j52422j45570j56579j45742j19964
$$ 3327726 2970254 2690091 2513031 2359736 2207314 2061744 1905165 1759423 1639459
18802A639459j09434q8802n5347l6691j8966k3923j8876l5188j6178j8694k9892
$$ 1639459 1530025 1441223 1385876 1349185 1330219 1306296 1287420 1252232 1236054 1217360 1187468
18791A187468j9624n0773n4534l486K1793K1046K0782l1019n0648o3695o2049
$$ 1187468 1167844 1117071 1062537 1059051 1080844 1101890 1122672 1091653 1041005 977310 915261
18780I15261n0296o9005m4766m6886o7883J3552M5659M4878J3331R536K150L2006
$$ 915261 864965 795960 751194 704308 636425 649977 695636 740514 753845 763381 765531 797537
18768G97537P9424R6067N4785R05j6304K7783M2837L5582m328l3699m4941j9805
$$ 797537 876961 973028 1027813 1028718 1012414 1040197 1083034 1118616 1114288 1080589 1035648 1015843
18756A015843L4095J351p8907n3216m6814l5028j4212M2495R0186O7354p676j4129
$$ 1015843 1049938 1051289 972382 919166 872352 837324 823112 865607 955793 1023147 1015471 1001342
18744A001342j2796j6890K2787O1742O8881J21725J94361J37354j9828j60571
$$ 1001342 988546 971656 994443 1056185 1125066 1246791 1441152 1578506 1558678 1398107
18734A398107j15159m9573l1803j4112k13n2934p0741j9682J9680K4302J4588
$$ 1398107 1282948 1233375 1201572 1187460 1187247 1134313 1063572 1043890 1063570 1087872 1102460
18723A102460j1487l5490J1463L5563L6410M6436N7293Q1760J13939J46047J57902
$$ 1102460 1090973 1055483 1066946 1102509 1138919 1185355 1242648 1324408 1438347 1584394 1742296
18712A742296J49687J54061J34424R3677Q8405J72850K17447J76098J72379K24453
$$ 1742296 1891983 2046044 2180468 2274145 2362550 2535400 2752847 2928945 3101324 3325777
18702C325777K68902L45186M08558N15431O75240R14016J266274J810326K665608
$$ 3325777 3594679 3939865 4348423 4863854 5539094 6453110 7719384 9529710 12195318
18693A2195318L800904N019184N832189O449917P294409O730864L692805J450686
$$ 12195318 15996222 21015406 26847595 33297512 40591921 47322785 51015590 52466276
18685E2466276Q33033j512603m315173l973473j973319J06368K712063M971170
$$ 52466276 53299309 51786706 47471533 43498060 41524741 41631109 44343172 49314342
18677D9314342N685470N338411L360029j255833n926561q046638q380304q187040
$$ 49314342 54999812 60338223 63698252 62442419 56515858 48469220 40088916 31901876
18669C1901876p321804n677518l968758k731764j859343j237332q27670n95078
$$ 31901876 24580072 18902554 14933796 12202032 10342689 9105357 8277687 7682609
18661G682609l66823k22651j23000j5496J16223K74527L83401N11957P44865J064169
$$ 7682609 7315786 7093135 6970135 6954639 7070862 7345389 7728790 8240747 8985612 10049781
18651A0049781J528125K248516L344590M497016N078604M982044N488184P161454
$$ 10049781 11577906 13826422 17171012 21668028 26746632 31728676 37216860 44378314
18643D4378314P469722M724637K179101K041381K552453K093974j87179k375349
$$ 44378314 51848036 56572673 58751774 60793155 63345608 65439582 65252403 62877054
18635F2877054q59780J660595K265400L151613M996122L776605k96474j684091
$$ 62877054 62017274 63677869 65943269 69094882 74091004 77867609 77571135 75887044
18627G5887044k802169p356375j0564805r790859q752081q200548o849870n058688
$$ 75887044 73084875 65728500 55163695 45372836 36620755 28420207 21570337 16511649
18619A6511649l514246k505414j784141j286378r58722p18406n70358n13015m46895
$$ 16511649 12997403 10491989 8707848 7421470 6462748 5744342 5173984 4660969 4214074
18610D214074l10169l07277k95529k12809j76743j88688j99485j65385j43380
$$ 4214074 3903905 3596628 3301099 3088290 2911547 2722859 2523374 2357989 2214609
18601B214609j56517j54415j29911m8437m2127n8198l0888j0520n994J4728K3666
$$ 2214609 2058092 1903677 1773766 1725329 1683202 1625004 1594116 1583596 1577602 1592330 1615996
18590A615996K6756M9582O7359K104n3552m0917N9125J31840J39788K6630j87805
$$ 1615996 1642752 1692334 1759693 1761797 1708245 1667328 1726453 1858293 1998081 2024711 1836906
18579A836906k26891j38942j17952r0247l0579l7547r2785j12514q7087n1778
$$ 1836906 1610015 1471073 1353121 1262874 1232295 1194748 1101963 989449 902362 850584
18569H50584k6742k9698l9218m5982j8510k6895j445m896N449n704J5296P684
$$ 850584 823842 794144 754926 708944 690434 663539 662094 657198 662647 656943 672239 679923
18557F79923J4274K1762L0799M5771P9102Q0696Q4099P6972N6029J3431n821p651
$$ 679923 694197 715959 746758 792529 871631 952327 1036426 1113398 1169427 1182858 1177037 1169386
18545A169386l027l362l3119j00879m0260M0846O4984N6819j8143m2216p4726
$$ 1169386 1166359 1162997 1129878 1028999 988739 1029585 1094569 1151388 1133245 1091029 1016303
18534A016303j12754r8857p3609m8384m8260k9396j9222l827n3980j7601K2042
$$ 1016303 903549 804692 731083 682699 634439 605043 585821 581994 528014 510413 532455
18523E32455K7478j06P283o196j1562q615R528j1424k2571j4794K339O05K9048
$$ 532455 559933 559827 567110 560914 549352 540737 550265 538841 516270 501476 503815 504420 533468
18510E33468O37l4527O955L586j4064j0208k1173m0337l163N0119J2194m680K0224
$$ 533468 534105 499578 506533 510119 496055 485847 464674 424337 421174 471293 483487 478807 499031
18497D99031J1925K9096J0038j7555J3139j7306r477K0416l1901m0063p910l6416
$$ 499031 510956 540052 550090 532535 545674 528368 518891 539307 507406 467343 459433 423017
18485D23017j0316J341L0179J243J3354p710j9783L279J669l755J2265O275J8557
$$ 423017 412701 414042 444221 445464 458818 451108 431325 434604 436273 432518 444783 451058 469615
18472D69615L5206K6020J8074P883J2333m36J748J7390Q184J5964P860L826J5784
$$ 469615 504821 530841 548915 556798 569131 568695 570443 587833 596017 611981 619841 623667 639451
18459F39451J7835o118k3000J0695N9362O3771O0463L8504K1121N5571J07992
$$ 639451 657286 651168 628168 638863 698225 761996 822459 860963 882084 937655 1045647
18448A045647Q4461P6579O8361N7810J9242J4367N4787J05965J60637J67291J94623
$$ 1045647 1130108 1206687 1275048 1332858 1352100 1366467 1421254 1527219 1687856 1855147 2049770
18437B049770K59466K66840K95572L24878L61366N00205P32159J102636J744300
$$ 2049770 2309236 2576076 2871648 3196526 3557892 4058097 4790256 5892892 7637192
18428G637192K790105M195940N505092N613954L515538l83358l642052m406008
$$ 7637192 10427297 14623237 20128329 25742283 29257821 28874463 25232411 20826403
18420B0826403l414138j600799L86616K453090M458813N606815M683907J325749
$$ 20826403 17412265 15811466 16198082 18651172 23109985 28716800 33400707 34726456
18412C4726456l180020n829557o126139m931664l455961k296731j519423j034212
$$ 34726456 31546436 25716879 19590740 14659076 11203115 8906384 7386961 6352749
18404F352749p15073m72979k91838j74529j20020j11448j37207j37396l4638P2972
$$ 6352749 5637676 5164697 4872859 4698330 4578310 4466862 4329655 4192259 4157621 4230593
18394D230593K09782L61252N22076O44499P22724P46515P58001Q98028J204112
$$ 4230593 4440375 4801627 5323703 5968202 6690926 7437441 8195442 9093470 10297582
18385A0297582J659254K447378L875233O221746R612496J3372853J5261845J2671504
$$ 10297582 11956836 14404214 18279447 24501193 34113689 47486542 62748387 75419891
18377G5419891N064857m954792j1317550j1767645q339319l442665J631937O868816
$$ 75419891 80484748 75529956 64212406 52444761 44105442 40662777 42294714 49163530
18369D9163530J1620160J3740348J0518096J362959r453764j5145771j5296123
$$ 49163530 60783690 74524038 85042134 86405093 76951329 61805558 46509435
18362D6509435j2169555q552976n808060l919343k634430j742126j170231p98279
$$ 46509435 34339880 25786904 19978844 16059501 13425071 11682945 10512714 9714435
18354I714435n60820m38192m17371l92073k84245j40699J3819J72505M03410O51861
$$ 9714435 9153615 8715423 8298052 7905979 7621734 7481035 7494854 7667359 8070769 8722630
18344H722630Q00891R44390J079704J193300J500617K147764L367344N404923
$$ 8722630 9523521 10467911 11547615 12740915 14241532 16389296 19756640 25161563
18336B5161563Q681195J3486559J8976173K1813151J7189495N190706o088245
$$ 25161563 33842758 47329317 66305490 88118641 105308136 110498842 104410597
18329A04410597j2655797j4922818j3504482j0280910n700316n03597N097990
$$ 104410597 91754800 76831982 63327500 53046590 47346274 46842677 51940667
18322E1940667J1083188J6011385J7458933J3055003L068859q320137j7319289
$$ 51940667 63023855 79035240 96494173 109549176 112618035 104297898 86978609
18315H6978609j9988617j7533341j3042348q836481n897493m024803k756358j885015
$$ 86978609 66989992 49456651 36414303 27577822 21680329 17655526 14899168 13014153
18307A3014153j385972j065688r09134q17891o74126m55943j86880P1628K90924
$$ 13014153 11628181 10562493 9653359 8835468 8161342 7705399 7518519 7590147 7881071
18298G881071M84372N46014N53416N64577N74345P33398J048861J576109K485524
$$ 7881071 8365443 8911457 9464873 10029450 10603795 11337193 12386054 13962163 16447687
18289A6447687M038975O471024R878666J3390642J5122930J3198269P036982k671161
$$ 16447687 20486662 26957686 36836352 50226994 65349924 78548193 85585175 82914014
18281H2914014r715222j1621756j0040882n685092l33512N055437R453667J0947223
$$ 82914014 73198792 61577036 51536154 45851062 45517550 50572987 60026654 70973877
18273G0973877Q289882J231658p282224j2103716j3544516j1804430q636971n853552
$$ 70973877 79263759 80495417 73213193 61109477 47564961 35760531 27123560 21270008
18265B1270008l872162k524612j585190r17985m86988j77487O0861K59317N36647
$$ 21270008 17397846 14873234 13288044 12370059 11883071 11705584 11766445 12025762 12562409
18256A2562409R89569J744096K986993M916103P775895J1382349J3413894R240347
$$ 12562409 13551978 15296074 18283067 23199170 30975065 42357414 55771308 65011655
18248F5011655r14298n616781j681264M173803O501284R53306q338405j0034670
$$ 65011655 64097357 58480576 56799312 60973115 67474399 68427705 60089300 50054630
18240E0054630n710168j137544J599025J984027m9236l577357n559335n668532
$$ 50054630 44344462 43206918 44805943 46789970 46740734 43163377 37604042 31935510
18232C1935510m424337k307018J40259K487116M239945M599698L190076K32776
$$ 31935510 27511173 25204155 25344414 27831530 32071475 36671173 39861249 40094025
18224D0094025k154073k109972p8868L724933Q245359J0637318O514454k727649
$$ 40094025 37939952 35829980 35751112 39476045 47721404 58358722 64873176 62145527
18216F2145527n887810j520030L866011N229179j223013j0358878j2117739r055251
$$ 62145527 56257717 54737687 58603698 63832877 62609864 52250986 40133247 31077996
18208C1077996n853952l481984j681896p9790J667290L869412O867739R881947
$$ 31077996 25224044 21742060 20060164 19980374 21647664 25517076 32384815 42266762
18200D2266762J0075188L854470m136982m495294J01940M289051L590317m018357
$$ 42266762 52341950 56196420 52059438 47564144 47666084 51955135 55545452 51527095
18192E1527095j0821389j0438497p602896n210012l477953k350537j610301j100384
$$ 51527095 40705706 30267209 22664313 17454301 13976348 11625811 10015510 8915126
18184H915126p59448m65562k44423o0250J40430L28919M58045O03322Q83345J281511
$$ 8915126 8155678 7690116 7445693 7385443 7525873 7854792 8312837 8916159 9799504 11081015
18174A1081015J986139L123621M990860P698934J0434020J0009155L184553m415635
$$ 11081015 13067154 16190775 21181635 28880569 39314589 49323744 52508297 48092662
18166D8092662l969933Q25080M658379L128999m979264j1130619j0131302p185022
$$ 48092662 44122729 44947809 49606188 52735187 47755923 36625304 26494002 19308980
18158A9308980m812991l260935k261079j601773j178638q85492o66606n03123
$$ 19308980 14495989 11235054 8973975 7372202 6193564 5308072 4641466 4138343
18150D138343l84633k93650k00435j75236j66110j02761k2933O4509O6665r405
$$ 4138343 3753710 3460060 3259625 3084389 2918279 2815518 2792585 2857094 2923759 2914354
18140B914354l1949K0983J12154J50301L8103j13064j81515p8203Q283l2302o7400
$$ 2914354 2882405 2903388 3015542 3165843 3203946 3090882 2909367 2831164 2839447 2807145 2739745
18129B739745p6329q1238m7485o396P2417J16596J34098J44131K36447L24132
$$ 2739745 2663416 2582178 2534693 2528297 2600714 2717310 2851408 2995539 3231986 3556118
18119C556118L65901M35136N37633M79075N55179Q00992J315759K239334M043718
$$ 3556118 3922019 4357155 4894788 5373863 5929042 6730034 8045793 10285127 14328845
18110A4328845P434993J2925394J7437326J0126464j1682331j6616131r907824
$$ 14328845 21763838 34689232 52126558 62253022 50570691 33954560 24046736
18103B4046736n442687k970661j455133m20733M34389J392410K648388M548479
$$ 24046736 18604049 15633388 14178255 13757522 14191911 15584321 18232709 22781188
18095B2781188P340877J0989424J4417974J5494435J2754113P294822K269575
$$ 22781188 30122065 41111489 55529463 71023898 83778011 91072833 93342408
18088I3342408k594276q106449j1270825r436655m166688J881304N743402N438769
$$ 93342408 90748132 82641683 71370858 61934203 57767515 59648819 65392221 70830990
18080G0830990J342385k775472l067449j385513n99702k710831p243427r884977
$$ 70830990 72173375 69397903 66330454 64944941 64345239 61634408 54390981 44506004
18072D4506004r868088q369834o091486m162873k809405j965044j405343j018481
$$ 44506004 34637916 26268082 20176596 16013723 13204318 11239274 9833931 8815450
18064H815450p27404n05743l84760k87148j56839r207J51978L05199L64973M04645
$$ 8815450 8088046 7582303 7197543 6910395 6753556 6744349 6896327 7201526 7566499 7971144
18054G971144N20561O94240R95421J556638K531831M129783O640304J0141356
$$ 7971144 8491705 9185945 10181366 11738004 14269835 18399618 25039922 35181278
18046C5181278J3705854J4789574J0164787j17726j0055863j3437003j0706726
$$ 35181278 48887132 63676706 73841493 73723767 63667904 50230901 39524175
18039C9524175o230139k069278J776570N264092P343925O879777L982184O43983
$$ 39524175 33294036 31224758 33001328 38265420 45609345 52489122 56471306 57115289
18031E7115289k267227n718935q857740r545254q110025n927929m127692k837861
$$ 57115289 54848062 49129127 40271387 30726133 22616108 16688179 12560487 9722626
18023I722626j949690j370221r52960o54659m93824l86971l31678l04417k92901
$$ 9722626 7772936 6402715 5449755 4795096 4301272 3914301 3582623 3278206 2985305
18014B985305k25477k01832j68239j71363j55549j21623j04767r1501j19003j22957
$$ 2985305 2759828 2557996 2389757 2218394 2062845 1941222 1836455 1744954 1625951 1502994
18004A502994j36917j17436q8117q9592o3867n4170n5436n1907k2158j0940l5969
$$ 1502994 1366077 1248641 1160524 1070932 1007065 952895 897459 845552 823394 812454 776485
17993G76485l0250l7565k3319l6183q285K3990L3628L6207N0613O9739M8033K5478
$$ 776485 746235 708670 685351 649168 640883 664873 698501 734708 785321 855060 903093 928571
17981I28571o62o3766j17843j00994o6091m3219l9604k1707J334J5987m243m799
$$ 928571 927909 864143 746300 645306 579215 535996 496392 474685 476019 492006 487763 482964
17969D82964L334j488j9229J4688j3840k8872q470j5098j9279j8560l0580K054
$$ 482964 486298 484810 465581 480269 466429 437557 429087 413989 394710 376150 345570 347624
17957C47624J6887j3379j3905K0417L2675J6300m253k9017k7869l4248l581p412
$$ 347624 364511 351132 337227 357644 390319 406619 402366 373349 345480 311232 307651 300239
17945C00239j5919l4663m4811q458p568N411K8962L0781J6024N631k5973o5105
$$ 300239 284320 249657 204846 196388 188820 194231 223193 253974 269998 275629 249656 184551
17933A84551j4777J501N828J5718j3101m5388O32K8851P064J6150J2998j2532
$$ 184551 169774 171275 177103 192821 179720 134332 134964 163815 170879 187029 200027 187495
17921A87495P417n629n538j2702l722J4968J2379J5612R069L7020o61N896J6283
$$ 187495 194912 189283 183745 171043 167321 182289 194668 210280 219349 256369 255708 261604 277887
17908B77887J9487J5072Q713P0k1903k8628l4558J0006M486K2799J1972J7166
$$ 277887 297374 312446 321159 321229 299326 270698 236140 246146 250632 273431 285403 302569
17896C02569m8967l7492k9941l0983l3460J3305J0334j2085k5042q751o024K269
$$ 302569 253602 216110 186169 155186 121726 135031 145365 133280 108238 99487 93463 95732
17884I5732J5116j6737N549J3961j7909k1376J5030J0169J3156K285P371n1063
$$ 95732 110848 94111 99660 113621 95712 74336 89366 99535 112691 114976 122347 71284
17872G1284k1593L7120J2123P630K9608L7688r70Q952J1974O4675Q2541M8987
$$ 71284 49691 86811 98934 106564 136172 173860 172890 181842 193816 258491 341032 390019
17860C90019N1866L1538l928j1287k1443l5202m5073l7494M1699O5560K7765k2139
$$ 390019 441885 473423 469495 458208 436765 401563 356490 318996 360695 426255 454020 431881
17848D31881l0186n5739o3591l8889m7013k1483l5938j1324K5524j0174j5609
$$ 431881 401695 345956 282365 243476 196463 174980 139042 127718 153242 143068 127459
17837A27459k351J0788k9789j2996O332K2542Q042p519q902P295J9944j273J256
$$ 127459 125108 135896 106107 93111 99443 121985 130027 122508 113606 120901 140845 139572 140828
17824A40828J5577O4282M6958K8315L9789K7286n327j1799k1251J9415M6172K8661
$$ 140828 156405 220687 267645 295960 335749 363035 357708 345909 324658 344073 390245 418906
17812D18906L8780L6993K2894l1925p1712p3923j8719j2260j8020j1531J0017
$$ 418906 457686 494679 517573 485648 413936 340013 321294 309034 291014 279483 289500
17801B89500J19k8072l1686j6714k0924n4056j3306l205J198j5088M324R637m879
$$ 289500 289619 261547 229861 213147 192223 138167 124861 121656 122854 107766 112090 121727 116848
17788A16848n112J5829j0575j7722k2492O546m784K8756K4959K6220L3736L7440
$$ 116848 111736 127565 116990 99268 76776 83322 78538 107294 132253 158473 192209 229649
17776B29649K0518Q1519P3487N6302J8652J817l2586l2371n715L0906J7981M018
$$ 229649 250167 331686 405173 461475 480127 481944 449358 416987 411272 442178 460159 464177
17764D64177J943l9529k5470j7273o2839o5745p1224n2918k4975j9445J406k4172
$$ 464177 466120 426591 401121 383848 321009 255264 184040 131122 106147 86702 88108 63936
17752F3936j2995K458M525q9k0822q225j9038L158J8531k043j293Q958L538k182
$$ 63936 50941 53399 57924 57835 37013 28788 9750 12908 31439 29396 28103 37061 40599 38417
17738C8417J7784J0621j8890J4253J2223N8312M0152L0638L2855Q0303N5393M4604
$$ 38417 56201 66822 47932 62185 74408 132720 172872 203510 236365 316668 372061 416665
17726D16665R683K0507L7130K8988l087n1570n4094m7218m1742l4716j8186j739
$$ 416665 426348 446855 483985 512973 509886 458316 404222 357004 315262 280546 262360 260621
17714B60621m8414o3320m1442j6470j0544r987p030p332K8796K9589j2636j5904
$$ 260621 212207 148887 107445 90975 80431 70444 63414 56082 84878 114467 101831 85927
17702H5927K311J4349N0221O5139M2865K0284p396J7682K9747p000J1571j7236
$$ 85927 88238 102587 152808 217947 260812 281096 273700 291382 321129 314129 325700 308464
17690C08464n0386m7998m9899l3268K564P018q049j8733J1359L5029J4730O1981
$$ 308464 258078 210080 160181 126913 129477 136495 128446 109713 121072 156101 170831 232812
17678B32812M1845p189m0458m0344O118J4927K2282m1313m7082o064k6121l9624
$$ 232812 274657 267468 227010 186666 192784 207711 229993 188680 141598 135534 109413 69789
17666F9789k2933M239J1298J1848j1829l2988j112J0000k7630o475J1958j5172
$$ 69789 46856 51095 62393 74241 62412 29424 28312 38312 10682 4207 16165 993
17654I93J3768j1385J1497O5142N5630O0554N3656K477n339j0951l1835m74L2127
$$ 993 14761 3376 14873 80015 135645 196199 249855 252332 246993 236042 204207 203733 235860
17641B35860m82l5760l9212m3807M837j0741k3444r976m0376n904j0727o609K4670
$$ 235860 235378 199618 160406 116599 121436 110695 87251 77275 36899 30995 20268 13659 38329
17628C8329k2597l7150O637J1325j015k0344j9948K2324K7602O478o597J0608
$$ 38329 15732 -21418 -14781 -3456 -4471 -24815 -44763 -22439 5163 11641 5044 15652
17616A5652L499k2603J206J4484M449j678j5528j8268p006J4301j5570o420L6721
$$ 15652 19151 -3452 -2246 12238 16687 15009 -519 -18787 -25793 -11492 -27062 -33482 3239
17603C239M0147K2516l7090j2495K97Q400j583J7944J7334K7379p377k1290J1970
$$ 3239 43386 65902 28812 16317 16614 25014 23431 41375 58709 86088 78711 57421 69391
17590F9391N6169R7594N6364K2518L2461L5296J2214l3676n0011m0199j7782K0798
$$ 69391 125560 223154 279518 302036 334497 369793 382007 348331 298320 258121 240339 261137
17578B61137M938k2367Q054J1982k3407R260J7930Q568j8659l7947k0978m334
$$ 261137 266075 243708 251762 263744 240337 249597 267527 276095 257436 219489 198511 194177
17566A94177k6800l6648k1992j6861j0826l5231j5735M457N076j2675M670n155
$$ 194177 167377 130729 108737 91876 81050 45819 30084 34541 39617 26942 31612 26457
17554B6457R39j0443r127L8319L2686L969j075J6033L6166M1944N0375P4989N8336
$$ 26457 27396 16953 7826 46145 78831 82800 81725 97758 133924 175868 226243 301232 359568
17541C59568M9124l0385p0700p6228o4442m3343J4903K6137O059K5690O2252N5754
$$ 359568 408692 378307 307607 231379 166937 123594 138497 164634 170693 196383 258635 314389
17529C14389P545l2097j9990m2964k3271k2785k7434l4452o4933k5060q97k9400
$$ 314389 321934 289837 269847 226883 203612 180827 153393 118941 54008 28948 28051 -1349
17517a349k1216J4101R328J2231l8302k5421J1634J6344O492J6096r627J7155
$$ -1349 -22565 -8464 864 13095 -25207 -50628 -38994 -22650 -16158 -62 -9689 7466
17505G466o07k2335l650p457N053R720L0491J2546n596l5245j3315L977J7232
$$ 7466 6859 -15476 -19126 -26583 -21530 -11810 18681 31227 25631 -9614 -22929 -18952 -1720
17492a720J9879j3257q866P326r042j8905k9522p651J1106J7944J9856J4309j9223
$$ -1720 18159 4902 -3964 3362 -5680 -24585 -54107 -61758 -50652 -32708 -12852 1457 -17766
17479a7766r208J514J1282j3374q598k4162m483J4422K402j0443R217j8484R497
$$ -17766 -26974 -25460 -14178 -27552 -36150 -60312 -64795 -50373 -47971 -58414 -49197 -67681 -58184
17466e8184N5089L2280K221n446k7006j3450k4111p966J2948L6405K0662j1802
$$ -58184 -3095 29185 31406 25960 -1046 -14496 -38607 -46573 -33625 2780 23442 11640
17454A1640j9335p594N220j0669K521L7583J8014j9889j1367J5026N613L2167
$$ 11640 -7695 -15289 -10069 -20738 -18217 19366 37380 17491 6124 21150 26763 58930
17442E8930Q7401J20439L9164q9901o1321o2941n0226l3901j6248j2429K1491
$$ 58930 146331 266770 305934 216033 154712 91771 41545 7644 -8604 -21033 458
17431D58K4717J3802n272p119j1000j4908j6689j6782j1986L806M535L502p931
$$ 458 25175 38977 33705 26586 15586 678 -16011 -32793 -44779 -40973 -36438 -32936 -40867
17418d0867m46Q814K9694r974N651P610r426J8025J0180k1336j3195p600j0054
$$ -40867 -41313 -32499 -2805 -12779 -7128 482 -8944 9081 19261 -2075 -15270 -22870 -32924
17405c2924o319Q849J5407n419o771j2561m058J776K8129j889L86J8856J3472
$$ -32924 -39243 -30394 -14987 -20406 -27177 -39738 -43796 -42020 -13891 -15780 -15394 3462 16934
17392A6934K396l440O549m810n903j0869J161l639J0144j3597m2440k7536K4299
$$ 16934 19330 15890 22439 17629 11726 857 2018 -1621 8523 -5074 -47514 -75050 -50751
17379e0751l470p925l996J2936M7028j9202k8101J7363J8265M263J0895J2046
$$ -50751 -54221 -62146 -66142 -53206 -6178 -25380 -53481 -36118 -17853 -13590 -2695 9351
17367I351k7467j3825P453J0320J9665j4965k8459M133J0591l33N757J3277K6463
$$ 9351 -18116 -31941 -24488 -14168 5497 -9468 -37927 -33794 -23203 -23536 -17779 -4502 21961
17354B1961l3321k6441k884k898J8235j2137O974R855K444o784J1260J0088Q246
$$ 21961 -11360 -37801 -40685 -43583 -25348 -37485 -30511 -20656 -18212 -24996 -13736 -3648 4598
17341D598l1202r872N630l703k9806j1762L027J3741J1060k6965j593L372N254
$$ 4598 -26604 -36476 -30846 -34549 -64355 -76117 -73090 -59349 -48289 -75254 -76847 -73475 -68221
17328f8221J111J7439K8227j239j5734j3985q568P763J489J4304o84m784J5944
$$ -68221 -67110 -49671 -21444 -22683 -38417 -52402 -60970 -53207 -51718 -37414 -38098 -42882 -26938
17315b6938l1408m1237Q404L4732M0102K759J9660j5219l2763J4278Q50n268L6792
$$ -26938 -58346 -99583 -91179 -56447 -16345 -13586 6074 -9145 -41908 -27630 -26780 -32048 4744
17302D744r491k8772r812l1822K4704J8592K3103J3021k2087N399j4925r305j3143
$$ 4744 -4747 -33519 -43331 -75153 -50449 -31857 -8754 4267 -17820 -12421 -27346 -36651 -49794
17289d9794J3236J8599J3328K3061m785o979K1364j0828k6410l287N685J3833
$$ -49794 -36558 -17959 -4631 18430 13645 6666 28030 17202 -9208 -12495 -6810 7023
17277G023m1079m5280o519m046M3032K0622j153n802k5515M200J5374j6199p240
$$ 7023 -34056 -79336 -85855 -89901 -46869 -26247 -27400 -33202 -58717 -54517 -39143 -55342 -62582
17264f2582J8581j2710N203r156k0798o925K6219J3746J0185J3552L8981j1162
$$ -62582 -44001 -56711 -51508 -60664 -81462 -88387 -62168 -48422 -38237 -24685 14296 3134
17252C134j1373o427o215j3558P103J462j1002O34J5943Q150m3128k3181m986
$$ 3134 -8239 -14666 -20881 -34439 -27336 -25874 -36876 -36242 -20299 -12149 -55277 -78458 -83444
17239h3444P267L6054J0013j4262J2191J8907K994j6931l4227j420J4468L0064
$$ -83444 -76177 -40123 -30110 -44372 -32181 -13274 -10280 -27211 -61438 -62858 -48390 -18326
17227a8326K1616j0958M287J0491o319j6932N101k5501o189J2531J9800M113j6198
$$ -18326 3290 -7668 -3381 7110 791 -16141 -11040 -36541 -42730 -30199 -10399 -6286 -22484
17214b2484j2499q009j369L1590K2050J3623l6460j7279Q354o780k9409l202j766
$$ -22484 -34983 -42992 -44361 -12771 9279 22902 -13558 -30837 -22483 -29263 -58672 -61874 -63640
17201f3640r8K5106M88j0501j7514j863K0668K677k0849r467k28L9856k606q093
$$ -63640 -63738 -38632 -38144 -48645 -66159 -68022 -47354 -44677 -65526 -74993 -75221 -35365 -37971 -46064
17187d6064J4594J7734q159k75K144q256q985k3810j0863J1229J1401l940O336
$$ -46064 -31470 -13736 -21895 -22170 -20026 -28282 -37267 -61077 -71940 -60711 -49310 -53250 -46914
17174d6914R762J1867L619j8420R878J6291O611j6380q971k830K731K3339r421
$$ -46914 -37152 -25285 -21666 -40086 -30208 -13917 -7306 -23686 -32657 -35487 -32756 -9417 -18838
17161a8838N387J8267k9691L003J4411j2637J2345l2581m653l796o509P758n853
$$ -18838 -13451 4816 -24875 -21872 -7461 -20098 -7753 -40334 -44987 -48783 -55292 -47534 -53387
17148e3387J8277O084j4124r55K3018L3051J2316l2226o722K1767l879k5517n227
$$ -53387 -35110 -29026 -43150 -44105 -21087 11964 24280 -7946 -14668 7099 3220 -22297 -27524
17135b7524J2669J0230K7937k1150j9804R791m041k0154K748j2436p382K4397
$$ -27524 -14855 -4625 23312 2162 -17642 -7851 -11892 -32046 -29298 -41734 -49116 -24719
17123b4719J2735j4427J4742M0088J9260n217j5281k9325l8516R508k851k4260
$$ -24719 -11984 -26411 -11669 28419 47679 42462 27181 -2144 -40660 -31152 -34003 -58263
17111e8263L377j22Q707J1458j2965j9038N967J0148N841K3012K9568n353k4948
$$ -58263 -54886 -55008 -46301 -34843 -47808 -66846 -60879 -50731 -44890 -21878 7690 2337 -22611
17098b2611k5989L014l0728j5286q67J2948o546O530J8326J9481J9295n073J8220
$$ -22611 -48600 -45586 -76314 -91600 -92467 -79519 -86065 -79535 -61209 -41728 -22433 -27506 -9286
17085i286o784J0565J2253n4604l350J7196j2041k5851k3255J3129M4358M721
$$ -9286 -16070 -5505 6748 -47856 -51206 -34010 -46051 -71902 -95157 -82028 -37670 -32949
17073c2949k0745j2567J2637J4676r458K5792J0205L073k9840K299J6099o226
$$ -32949 -53694 -66261 -53624 -38948 -48406 -22614 -12409 -9336 -39176 -36877 -20778 -27004
17061b7004J162n25J0861K424j2575R771J2578n22j6099j9544l300J3702j1528
$$ -27004 -25842 -26367 -15506 -13082 -25657 -15886 -3308 -3830 -19929 -39473 -42773 -29071 -40599
17048d0599k0067J5213m961J3817q90O714K0179j6247N23l2225j2223j8888M7410
$$ -40599 -60666 -45453 -50414 -36597 -37487 -30773 -10594 -26841 -26318 -58543 -70766 -89654 -42244
17035d2244L0576J2303N394P635N406l0385j3874L87j925K7415Q903n315q929
$$ -42244 -11668 635 6029 13664 19070 -11315 -25189 -24802 -26727 688 9591 4276 -4653
17022d653k5962M053J0744p434j1195l722k4318L445Q810j295M984J9360M913
$$ -4653 -30615 -26562 -15818 -23252 -34447 -38169 -62487 -59042 -50232 -51527 -46543 -27183 -22270
17009b2270J1561m323p325L381Q927J2456r41k2431L684P346l3550k3804k297
$$ -22270 -10709 -15032 -22357 -18976 -10049 2407 1466 -20965 -17281 -9935 -43485 -67289 -69586
16996f9586M0781L5954j0793j6582J0835N892K1671j2305l2609j8112P946n506
$$ -69586 -28805 7149 -3644 -20226 -9391 -3499 18172 5867 -26742 -44854 -36908 -42414
16984d2414K453p601O473P673j5779K61J0350m86K131j1125p854K1001J6164R318
$$ -42414 -39961 -47562 -41089 -33416 -49195 -48934 -38584 -39070 -36939 -48064 -55918 -34917 -18753 -9435
16970i435O654M737K205K992o17k2275k9253k6595J7141K9762K4519R287J77l7888
$$ -9435 -2781 1956 4161 7153 6536 -15739 -44992 -71587 -54446 -24684 -165 9122 9299 -28589
16956b8589m328O347O496j7000r410K0532J4492j7639j3751K7498L0346K6928
$$ -28589 -32917 -26570 -20074 -37074 -46484 -25952 -11460 -29099 -42850 -15352 14994 41922
16944D1922r268l7796k6931J1873N8901n524k0883k7293n674O638k002K1941J7670
$$ 41922 32654 -5142 -32073 -20200 38701 33177 12294 -14999 -20673 -14035 -16037 5904 23574
16931B3574q187j2848k1723J012k741m727J0259j3643m741j2305k4352l2707L3698
$$ 23574 15387 2539 -19184 -18172 -20913 -25640 -15381 -29024 -33765 -46070 -70422 -103129 -69431
16918f9431O0646J4022p493M646K4058j0923k3638p258j3415J2402K5949K2161
$$ -69431 -8785 5237 -2256 2390 26448 15525 -8113 -15371 -28786 -16384 9565 31726
16906C1726O783k9360l3369j4402k0962O854L2141J595k0628J5150j8610k400
$$ 31726 38509 9149 -24220 -38622 -59584 -52730 -20589 -18994 -39622 -24472 -43082 -45482
16894d5482K2274J7627O401k9352O704J493j0508k410p289l307j57j5266q864
$$ -45482 -23208 -5581 820 -28532 -21828 -20335 -30843 -33253 -40542 -43849 -44006 -59272 -68136
16881f8136j4903J4305L420J5710L204j2775P587J6065K40j3057L183K0197L9321
$$ -68136 -83039 -68734 -65314 -49604 -46400 -59175 -51588 -35523 -35283 -48340 -45157 -24960 14361
16868A4361q918q432j1942M49R456N302j6003l776J9113L693K6003j7631k0850
$$ 14361 5443 -2989 -14931 -14482 -5026 276 -15727 -19503 -390 3303 29306 11675 -9175
16855i175j6988k0625k3130K0920J2077j9002J491J5956M379p585n279j7216L96
$$ -9175 -26163 -46788 -69918 -48998 -36921 -55923 -54432 -38476 -34097 -41682 -46961 -64177 -63781
16842f3781J2787j3133J960k2846j9311q916M5428L1509m893j0773K437J3195
$$ -63781 -50994 -64127 -62167 -85013 -104324 -113240 -67812 -36303 -41196 -51969 -49532 -36337
16830c6337j9145k4041R027J1235K9802n013j4424J3747J5137K4682j0180j0692
$$ -36337 -55482 -79523 -70496 -59261 -29459 -34472 -48896 -35149 -20012 4670 -5510 -16202
16818a6202j054k5226k5850k208J2925J5649j8935J5665Q466m142L366P661j0910
$$ -16202 -17256 -42482 -68332 -70540 -57615 -41966 -60901 -45236 -36770 -40912 -37546 -29885 -40795
16805d0795O326K398l0528J7138N7904j5477J281P664j6377J6384K0153j5120
$$ -40795 -34469 -32071 -62599 -45461 12443 -3034 -1753 5911 -10466 5918 26071 10951
16793A0951k1600l254j5362j8726J8539R002q631n227n883n607j1333L917j6166
$$ 10951 -10649 -13903 -29265 -47991 -29452 -20450 -29081 -34308 -40191 -45798 -57131 -53214 -69380
16780f9380J8788K0230M479j5089O373J7075j9966m558k023k4503K7133K6960
$$ -69380 -50592 -30362 -25883 -40972 -34599 -17524 -37490 -42048 -44071 -68574 -41441 -14481
16768a4481n036k577R336j5010n199K1440P030L151o536l811l008J2255r728k2104
$$ -14481 -19517 -22094 -12758 -27768 -32967 -11527 -4497 -1346 -7882 -11693 -14701 -2446 -12174 -34278
16754c4278p29J5843K9099j0492k9910J7106l305o648j3279r744K3543J5703m075
$$ -34278 -35007 -19164 9935 -557 -30467 -13361 -16666 -23314 -36593 -46337 -22794 -7091 -11166
16741a1166k2010j1611K1837k168L4788J0892j2599J822j4376p127j5069j0597
$$ -11166 -33176 -44787 -22950 -25118 9670 20562 7963 9785 -4591 -11718 -26787 -37384
16729c7384j5737l2602J1676J5959m445K0397K2935P246J2186O806k6265j8409
$$ -37384 -53121 -85723 -74047 -58088 -62533 -42136 -19201 -11955 231 7037 -19228 -37637
16717c7637K6439j3807K2662J283k0589j5662k601R200J6310p202K2848J9780
$$ -37637 -11198 -25005 -2343 -1060 -21649 -37311 -39912 -30712 -14402 -21604 1244 21024
16705B1024p380j9374M926j3709p922j0110l790J9777K574o283q60j3700M899
$$ 21024 13644 -5730 -804 -14513 -22435 -32545 -36335 -16558 -13984 -20267 -21127 -34827 -29928
16692b9928L1089n049k7712j1162Q805K0117Q971J3694K3788o680k5654l0900
$$ -29928 1161 -3888 -31600 -42762 -33957 -13840 -4869 8825 32613 25933 279 -30621
16680c0621r67J6573J1684j062Q994k787J3562p4j8961m4110l425K7730M0994
$$ -30621 -31588 -15015 -3331 -4393 4601 1814 15376 15302 -3659 -47769 -51194 -23464 17530
16667A7530j7128k4563l81J6154j6833p579K5338J1052Q26J2585P066J6753L636
$$ 17530 402 -24161 -24542 -8388 -25221 -32800 -7462 3590 4416 17001 24067 40820 44456
16654D4456l1965k4760L900k6642j6849j4062n57L332K4028K526J0817K9977N773
$$ 44456 12491 -12269 -8369 -35011 -51860 -65922 -66479 -63147 -39119 -36593 -25776 4201 9974
16641I974O80l2538k7019k3023m249L3130k740l147K2473p082k677J1297j2063
$$ 9974 10654 -21884 -48903 -71926 -76175 -43045 -45785 -48932 -26459 -33541 -36218 -24921 -36984
16628c6984k7698J5984j0744R142K7329L835Q994K728J6672k184k2848l784O887
$$ -36984 -64682 -48698 -59442 -50300 -22971 -19136 -10142 -7414 9258 7074 -15774 -19558 -12671
16615a2671j1043m9270K4797L5918R844j7130N014J2485Q799N425j0747k4784
$$ -12671 -23714 -72984 -48187 -12269 -2425 -19555 -14541 -2056 6743 12168 1421 -23363
16603b3363j6656m45M878k1k20N279j1478j3915L8580L383j1815L582J8853M718
$$ -23363 -40019 -40464 -35586 -35607 -35827 -30548 -42026 -55941 -17361 -13978 -25793 -22211 -3358 1360
16589A360l0626L1569J0159J1231o329k4869l9684j058J7026J3411o798k547J9858
$$ 1360 -29266 2303 12462 23693 17364 -7505 -47189 -48247 -31221 -17810 -24608 -27155 -7297
16576g297l246N289j6834N31L6400k3528j4248J9229j2361j3158N944R878M69
$$ -7297 -10543 -5254 -22088 -21557 14843 -8685 -22933 -3704 -16065 -29223 -23279 -13401 -12932
16563a2932j3163l4887o540K5512j9055J1994N263k1182L682J935J0266N772J119
$$ -12932 -26095 -60982 -67522 -42010 -61065 -49071 -43808 -64990 -61308 -59373 -49107 -43335 -42216
16550d2216j4469L7369L4422j5481k0243O652j8928r366j5669K7916L3980o863
$$ -42216 -56685 -19316 15106 -375 -20618 -13966 -32894 -42260 -57929 -30013 3967 -2896
16538b896p741K297j1356L756N612J090k786K93n519j0677j5442K3685j0081J5914
$$ -2896 -10637 -8340 -19696 -15940 -10328 -9238 -12024 -11731 -17250 -27927 -43369 -19684 -29765 -13851
16524a3851K6957p77k5980j3643O603J5048J0873l4607l5038K198K943K5828M3524
$$ -13851 13106 12329 -13651 -27294 -20691 -5643 5230 -29377 -64415 -62217 -59274 -33446 10078
16511A0078l075j3004j8573j2811N858o364j3130J6067K5517J7558J5462k3657
$$ 10078 7003 -6001 -24574 -37385 -31527 -37891 -51021 -34954 -9437 8121 23583 -74
16499g4n374p564k769j5010j9215L591K4495J6834o068j2624Q910q429j4737Q84
$$ -74 -5448 -13012 -15781 -30791 -50006 -46415 -21920 -5086 -11154 -23778 -14868 -23297 -38034 -37150
16485c7150j5513k4710K7433N5061j0051k2173j4375l925j729K98R418R788J3755
$$ -37150 -52663 -77373 -49940 5121 -4930 -27103 -41478 -45403 -47132 -46834 -37416 -27628 -13873
16472a3873j4377k9038J0166k424J5386J7078p490J0044m813N578l183R20J5019
$$ -13873 -28250 -57288 -47122 -49546 -34160 -17082 -24572 -14528 -19341 -13763 -16946 -16026 -1007
16459a007L1421J3099l9109q302r204O986p400o127L512J6752j3721q756J1910
$$ -1007 30414 43513 4404 -3898 -13102 -6116 -13516 -19643 -16131 621 -13100 -21856 -9946
16446i946R250r129k961O364q768K563M120j8785n883L3600m405o721l846J0451
$$ -9946 -696 -9825 -12786 -6422 -15190 -12627 -8507 -27292 -33175 425 -3980 -10701 -14547 -4096
16432d096j520j9683J803m10M5504K570O574p478k1516j286j1343j9280L642o062
$$ -4096 -5616 -25299 -23496 -23906 21598 24168 30742 23264 1748 462 -10881 -30161 -26519 -32581
16418c2581O499j6855m123p907L756N939O864k2499m14K1969J7269J625J0326
$$ -32581 -26082 -42937 -47060 -54967 -51211 -45272 -38408 -60907 -61321 -39352 -22083 -20458 -10132
16405a0132K2624m643k3270k4002n164J5181L511k9612J569O187K9674n812j214
$$ -10132 12492 7849 -15421 -39423 -44587 -29406 -25895 -55507 -53938 -47751 -18077 -23889 -25103
16392b5103J5886M337R004Q195j2360j7754k1318k0784J0741Q579J0921J7134
$$ -25103 -9217 -4880 4124 12319 -41 -17795 -39113 -59897 -49156 -40577 -29656 -12522
16380a2522L125j901k0735j1398j2769n056o261P638Q479R843J3064P543j041
$$ -12522 -9397 -11298 -32033 -43431 -56200 -61256 -67517 -59879 -51400 -41557 -28493 -20950 -21991
16367b1991P926L123J0706q307K802k1346j9881n098J1284J13M840K1296J8420
$$ -21991 -14065 -10942 -236 -8543 -5741 -27087 -46968 -52066 -40782 -40669 -35829 -14533 3887
16354C887J17J856o554k8888J5920M598J4365l4983J234K0554l230k62l007j2247
$$ 3887 4004 5860 -694 -29582 -13662 -9064 5301 -29682 -28448 -7894 -11124 -11386 -14393 -26640
16340b6640Q518K6531l187l5301o000j4092k702o985j6252O287M3776K9296j6524
$$ -26640 -18122 8409 5222 -30079 -36079 -50171 -52873 -59858 -76110 -69823 -26047 3249 -13275
16327a3275k0707l695J6667K1202j3649n895R380q041k5135n349J4370R867J8628
$$ -13275 -33982 -37677 -21010 192 -13457 -19352 -9972 -18013 -43148 -48497 -34127 -24260 -5632
16314e632j4673k3664j8574N1886J982j7810l708o403j1318j5502r479K4408J0388
$$ -5632 -20305 -43969 -62543 -10657 -8675 -26485 -30193 -36596 -47914 -63416 -72895 -48487 -38099
16301c8099n346J1864J9220j9253j6347K6687K7039R79k7854j9135j6959n714
$$ -38099 -43445 -31581 -12361 -31614 -47961 -21274 5765 6744 -21110 -40245 -57204 -62918
16289f2918n358J2178l293l277K5227J1824J3692k1267K877M102l0295R742J2821
$$ -62918 -68276 -56098 -59391 -62668 -37441 -25617 -11925 -33192 -30315 -26213 -56508 -46766 -33945
16276c3945K1665J3402o087j6642k0444K798M65j1440m170M506J1141l120R37
$$ -33945 -12280 1122 -4965 -21607 -42051 -39253 -38788 -50228 -54398 -49892 -38751 -41871 -40934
16263d0934J2151J2966P759j8392j8090j6778m23J3297K0677j2914J9823p449
$$ -40934 -28783 -15817 -8058 -26450 -44540 -61318 -61741 -48444 -27767 -40681 -20858 -28307
16251b8307m287J2416M84Q377L868j3760n09l00j5496j466M148L0101J8049j6866
$$ -28307 -32594 -20178 -19694 -11317 -7449 -21209 -21718 -22018 -37514 -38980 -34832 -4731 13318 -3548
16237c548k831J3764K5664j6465j0039m779j2923q463O776O010R799j7874o922
$$ -3548 -6379 7385 33049 16584 6545 1766 -11157 -19620 -12844 -6834 2965 -14909 -21831
16224b1831l461R253P505j3159j680O589m984j2118k0284k0055K960K2826N774
$$ -21831 -25292 -16039 -8534 -21693 -23373 -16784 -21768 -33886 -54170 -74225 -71265 -48439 -42665
16211d2665K4981J1123J8022k5857m6593j9161K6817K7346K1833J8740j1646j3815
$$ -42665 -17684 -6561 11461 -14396 -60989 -80150 -53333 -25987 -4154 14586 2940 -10875
16199a0875m664m171p588n618O786J5677J8524k301J008o649J9556j8241k0295
$$ -10875 -15539 -19710 -27298 -32916 -26130 -10453 8071 5770 6778 129 19685 1444 -18851
16186a8851m910r047J3237m985l0002q802j4518j5580L4181L5349j952L646o888
$$ -18851 -23761 -32808 -19571 -24556 -54558 -63360 -77878 -93458 -59277 -23928 -25880 -22234 -29122
16173b9122K566j5847Q763j4406j3065J4941j0106j8733K3111r605j853J7461
$$ -29122 -26556 -42403 -33640 -48046 -61111 -46170 -56276 -75009 -51898 -61503 -63356 -45895
16161d5895J2941J4748J6371n50j1926j2098j5196J104J7671K9671k90l1055j8214
$$ -45895 -32954 -18206 -1835 -2385 -14311 -26409 -41605 -40501 -22830 6841 6551 -24504 -42718
16148d2718l601R42J5523J730k5435j7310L32K2780L126j9226K3134J1547R641
$$ -42718 -46319 -45377 -29854 -28124 -53559 -70869 -70537 -47757 -44631 -63857 -40723 -29176 -19535
16135a9535K08q089o43J5799k8035j0183L9175R212J305K4470k0766k1960k819
$$ -19535 -19327 -27416 -28059 -12260 -40295 -50478 -11303 -2091 -786 23684 2918 -19042 -21861
16122b1861R122r700p296Q363P377K131J9347J1834J0076L004q394K0134L356
$$ -21861 -12739 -22439 -29735 -21372 -13995 -11864 7483 19317 29393 32397 24003 44137 47493
16109D7493k9863m7909j676K0515K0916o253J3p948r927J6727n623j7793m006
$$ 47493 17630 -30279 -31955 -11440 9476 3223 3236 -4712 -14639 2088 -3535 -21328 -25334
16096b5334K9006L605j851L246l0564J0230m282l4873j3902n305J2664L3939K7201
$$ -25334 3672 7277 5426 8672 -21892 -11662 -15944 -50817 -64719 -70024 -57360 -23421 3780
16083C780k185P911J4365J299j7642k8619O425K2118R583m531J4111p319j4426
$$ 3780 1595 9506 23871 25170 7528 -21091 -14666 7452 17035 12504 26615 19296 4870
16070D870j7639p812M927J574J1069l942j2368k2866j186L679K3064J060n966
$$ 4870 -12769 -20581 -15654 -14080 -3011 -6953 -19321 -42187 -43373 -39694 -16630 -15570 -21536
16057b1536P782k036j375Q544L259j8501L10K3737L105p454L3040j1229j6027
$$ -21536 -13754 -15790 -17165 -8621 -5362 -23863 -23553 184 3289 -4165 28875 17646 1619
16044A619j1618K4733q840j626k5119j4972L5689J5067q322J1822j9496j7136
$$ 1619 -9999 14734 5894 4268 -20851 -35823 -134 14933 6611 18433 -1063 -18199
16032a8199J5178j0695k0552k1356p057K5776J5257J2409j3136q345J5261P243
$$ -18199 -3021 -13716 -34268 -55624 -62681 -36905 -21648 -9239 -22375 -30720 -15459 -8216
16020h216J3444j0728L529q111l139q699j4988J4007K4875q177k30j7901L196
$$ -8216 5228 -5500 -1971 -10082 -13221 -21920 -36908 -22901 1974 -6203 -6433 -24334 -21138
16007b1138n199J9873K8058j3304N51R988n971k496R553O96q484j9642m2611j3495
$$ -21138 -26337 -6464 21594 8290 8841 18829 12858 10362 19915 20611 12127 -7515 -50126 -63621
15993f3621J2842K0455R12j2396p130J9705K8980K2257K1039j7636l0279k7694
$$ -63621 -50779 -30324 -29412 -41808 -48938 -29233 -253 22004 43043 25407 -4872 -32566
15981c2566j6418K1942M2728J653q45J197p008p744l3148j3870j1413N434K3123
$$ -32566 -48984 -27042 15686 17339 16494 17691 10683 2939 -30209 -44079 -55492 -50058 -26935
15968b6935J4242J7668k986j8551j3350l250o368J8397j1129j1k435J573r477
$$ -26935 -12693 4975 1989 -16562 -29912 -33162 -39530 -21133 -32262 -32273 -34708 -33135 -42612
15955d2612L837K5671J9273p20l413O627q825j3887p901N333M987o851l77R058
$$ -42612 -38775 -13104 6169 5449 2036 8663 -162 -14049 -21950 -16617 -11630 -18481 -18858 -9800
15941i800K0135M226k690k1872n827Q292J4008k0807k8902L496r40m304j5153
$$ -9800 10335 14561 11871 -10001 -15828 -7536 6472 -14335 -43237 -39741 -40681 -44985 -60138
15928f0138K8658K0174q043j1810J8270J7404j3282j8276J7550K0281j5221p490
$$ -60138 -31480 -11306 -19349 -31159 -12889 4515 -8767 -27043 -9493 10788 -4433 -11923
15916a1923M362l6697J4487J9303K9082n730k0942k333m717j5428J5501p83R926
$$ -11923 -7561 -44258 -29771 -10468 18614 12884 -8058 -10391 -15108 -30536 -15035 -15818 -5892
15903e892Q45J4017j6109r357J0571k6772k4016J1259K1196q707J5470P873l3984
$$ -5892 -5047 8970 -7139 -16496 -5925 -32697 -56713 -45454 -24258 -32965 -17495 -9622 -43606
15890d3606j718J7069q982J4067O567J2748q096n089k0560K307R678K3934n373
$$ -43606 -45324 -28255 -37237 -23170 -16603 -3855 -11951 -17040 -37600 -35293 -25615 -1681 -7054
15877g054j0790l464q637O868n158k4664j422Q186K383J7758m888r520j2123R122
$$ -7054 -17844 -21308 -29945 -23077 -28235 -52899 -54321 -46135 -43752 -25994 -30882 -40402 -52525 -43403
15863d3403L3355J5318r110l399k4049j4912J571J4854K7400J6375l888k9794
$$ -43403 -10048 5270 -3840 -7239 -31288 -46200 -44629 -29775 -2375 14000 10112 -19682
15851a9682j483J9875k2070j57J3185l027J6675r33j6143K609j2264j582l378
$$ -19682 -21165 -1290 -23360 -23517 -10332 -13359 3316 2383 -13760 -11151 -23415 -24997 -28375
15838b8375J5284O82m762j5602l284j2054J2237R669j3960j4647J6126J6277M259
$$ -28375 -13091 -12409 -17171 -32773 -36057 -48111 -35874 -26205 -40165 -54812 -38686 -22409 -18150
15825a8150o502N917L7213J1713l3563j1556l736k1621k0964J693L9652Q282Q076
$$ -18150 -24652 -18735 18478 30191 -3372 -14928 -18664 -40285 -61249 -59556 -19904 -11622 -3546
15812c546R487l0834q788o556O306l677j3453K3950K2271j5752j5068N191J6087
$$ -3546 5941 -24893 -33681 -40237 -33931 -37608 -51061 -27111 -4840 -20592 -35660 -30469 -14382
15799a4382J24m48N46L941j5015n68J1594j902K0805J6347L343q231j2810k2657
$$ -14382 -14258 -14706 -14160 -10219 -25234 -25802 -14208 -16110 4695 21042 24385 16154 3344 -19313
15785a9313o373j6411L346J7405N594R769M205o530n76m645J9909K5656j3632
$$ -19313 -25686 -42097 -38751 -21346 -15752 -5983 -1778 -8308 -8884 -13529 6380 32036 18404
15772A8404j6306q406q655l911Q186j3368K567K178R972Q877K2488J3201k627
$$ 18404 2098 -6308 -14963 -18874 -10688 -24056 -21489 -19311 -9339 -462 22026 35227 32600
15759C2600j5474o062j9811j0586J801m649J0268L3401j7857j7021j7116r141
$$ 32600 17126 11064 -8747 -19333 -17532 -22181 -11913 21488 3631 -13390 -30506 -39647
15747c9647j0380K4606q512m218O003p167R003k6774K058J6030p062J1110M672
$$ -39647 -50027 -25421 -33933 -38151 -32148 -39315 -30312 -57086 -55028 -38998 -46060 -34950 -30278
15734c0278J999k3773N28J711k652k978R428J5751Q020j0187k16j6882j233J1848
$$ -30278 -28279 -52052 -51524 -49813 -52465 -55443 -46015 -30264 -22244 -32431 -32647 -49529 -50762 -38914
15720c8914Q003l919L099m807J6878K8200j75Q528Q49o686N74k1665L69N131j6337
$$ -38914 -30911 -34830 -31731 -36538 -19660 8540 8365 16893 17742 11056 11630 -10035 -9666 -4535 -20872
15705b0872o833j4016R48J0861J2054k0022m778N249o137K4615l169q218M804
$$ -20872 -27705 -41721 -40773 -29912 -17858 -37880 -42658 -37409 -43546 -18931 -22100 -30318 -25514
15692b5514j9200M122J0129r853n314o726K0416K6535J7898j1617q035k6319k0760
$$ -25514 -44714 -40592 -30463 -40316 -45630 -52356 -31940 -5405 12493 876 -7159 -33478 -54238
15679e4238K266J9720J2461P745m392k00K6865K4341K3554j0985O883J7r962j5502
$$ -54238 -51972 -32252 -19791 -12046 -16438 -16638 10227 34568 58122 47137 54020 54037 44075 28573
15665B8573l6974L320K5192J0127k6190m289r230K4302K1471J0388Q009j0583
$$ 28573 -8401 -5081 20111 30238 4048 -241 -9471 14831 36302 46690 54699 44116
15653D4116l1269k1101r850J4102j4535k8805j2995N541J7573M851J958m225q203
$$ 44116 12847 -8254 -18104 -4002 -18537 -47342 -60337 -54796 -37223 -32372 -30414 -34639 -42842
15640d2842o259J4316O335M3945L020j0034j8796k2694O011J8984Q426k4719J3029
$$ -42842 -49101 -34785 -28450 15495 18515 8481 -10315 -33009 -26998 -8014 412 -24307 -11278
15627a1278k909j3097j12p512K7606L1403m833j7154r84J4777p583j8326k2011
$$ -11278 -14187 -27284 -27396 -34908 -7302 24101 19268 2114 1130 15907 8324 -10002 -32013
15614c2013K9946J1887k5756N029J0797J885q591J0754M598K025j2239O300q300
$$ -32013 -2067 9820 -15936 -10907 -110 1775 -6816 3938 8536 10561 -1678 4622 -3678
15601c678o269j2384R724J724L2967J6246l0195L953K921l1026k5080K447J6060
$$ -3678 -9947 -22331 -12607 -10883 22084 38330 8135 12088 15009 -16017 -41097 -38650 -22590
15588b2590J9917K2674l320j0446J0077k2769j7665m013r145m12K3466K9129L0258
$$ -22590 -2673 20001 16681 6235 16312 -6457 -24122 -28135 -37280 -37692 -14226 14903 45161
15575D5161L1101k0174j0047Q071j8237l065j6623j8592Q323K3235J2182j1398
$$ 45161 76262 56088 46041 54112 35875 32810 16187 -2405 5918 29153 41335 29937
15563B9937J262r347k8327j0808o528N400l283Q353K5574M480r323j8182j7257
$$ 29937 31199 21852 -6475 -17283 -23811 -18411 -21694 -13341 12233 16713 7390 -10792 -28049
15550b8049J123J3873r046q459j4424l477O449r986K6692J9862J8708j3157k0377
$$ -28049 -26926 -13053 -22099 -30558 -44982 -48459 -42010 -51996 -25304 -5442 13266 109 -20268
15537b0268J231J5831J0720k6391j7530j4768J1768j0427J1523Q98K6743K2579
$$ -20268 -19037 -3206 7514 -18877 -36407 -51175 -39407 -49834 -38311 -37413 -10670 11909
15525A1909j0929l0827q061K4908K206l0494p034m137j2023J9321J3336K4307
$$ 11909 980 -29847 -37908 -13000 -10794 -41288 -48322 -52459 -64482 -45161 -31825 -7518
15513g518r243j5384J0677o425k163K0040J7859l1584K044J5725J2870J1042N415
$$ -7518 -16761 -32145 -21468 -27893 -30056 -10016 7843 -23741 -21697 -5972 6898 17940 23355
15500B3355k1767r595Q255j6692k1716p690k959M831K9270p204l5587r319L5907
$$ 23355 1588 -8007 248 -16444 -38160 -45850 -48809 -43978 -14708 -21912 -57499 -66818 -30911
15487c0911K6262J1191J5794o224j0187P752J677l3475j1174Q126K0144O299j4582
$$ -30911 -4649 6542 22336 16112 5925 13677 15354 -18121 -29295 -21169 -1025 5274 -9308
15474i308O895K433J5494K3898Q308k1148j5205N672k8056j3948M390J2065n680
$$ -9308 -2413 20 15514 39412 47720 26572 11367 17039 -11017 -24965 -20575 -8510 -14190
15461a4190O9J2212M681P744o735j350K2230O691J549k0515r341J2415j3405j668
$$ -14190 -14121 -1909 2772 10516 3781 2431 24661 31352 32901 12386 3045 15460 2055 387
15447C87l0550J2860j3018O034o60k0240R621J2781J8791j6236o915J390j3038
$$ 387 -30163 -17303 -30321 -24287 -24947 -45187 -35566 -22785 -3994 -20230 -27145 -25755 -38793
15434c8793J4438r482J4775J7419M762O934j0510k6613O638O030j7284J8604J3987
$$ -38793 -24355 -33837 -19062 -1643 3119 10053 -457 -27070 -20432 -14402 -31686 -13082 905
15421I05K224r485j7018K483J2405J9753L889p110j2016j6701M371J0123O80K1876
$$ 905 3129 -6356 -23374 -20891 -8486 11267 15156 8046 -3970 -20671 -16300 -6177 -5497 16379
15407A6379j5353j196L036j3062k6344m991L468J2654N430p822n906J1430n879
$$ 16379 1026 -170 2866 -10196 -36540 -41531 -38063 -25409 -19979 -27801 -33707 -22277 -28156
15394b8156K0368K9726m189l2674j2475J810q067K7210M5145j8691J3855J5783
$$ -28156 -7788 21938 17749 -14925 -27400 -25590 -33657 -6447 38698 20007 33862 49645
15382D9645l6180j1987K016J170J1588p447l0259o267O614J824P618j9313k4951
$$ 49645 13465 1478 3494 4664 16252 8805 -21454 -27721 -21107 -19283 -11665 -30978 -55929
15369e5929K237J8693M737R809k6016j125J0185K8984J731j7399k045k760k9399
$$ -55929 -53692 -34999 -30262 -20453 -46469 -47594 -37409 -8425 -6694 -24093 -26138 -28898 -58297
15356e8297l578K3425J8029l351p870m263M050j3390k4564J3485L7192Q859j7389
$$ -58297 -61875 -38450 -20421 -23772 -31642 -35905 -31855 -45245 -69809 -56324 -19132 -10273 -27662
15343b7662m506J3656K8183l218k2712M8j1831J1331J3960M962J8989j8742p937
$$ -27662 -32168 -18512 9671 6453 -16259 -16211 -28042 -16711 -2751 2211 21200 2458 -5479
15330e479j820o061j1198j4770K2902J2738q779n403m654j7444J1554J9526R157
$$ -5479 -7299 -13360 -24558 -39328 -16426 -3688 -12467 -17870 -22524 -39968 -28414 -8888 269
15317B69k4458j0470r482k07O407K3065M574j2718Q238L0182K6507L0980k4068
$$ 269 -24189 -34659 -44141 -44348 -37941 -14876 -10302 -23020 -14782 15400 41907 72887 48819
15304D8819j6541l4002m573N262r564J2255K437R229k0375j9529O335K7232J0844
$$ 48819 32278 -1724 -6297 -1035 -10599 1656 4093 13322 -7053 -26582 -20247 6985 17829
15291A7829O411k7404l2376J2092O079J8176l789p936J933j674k7295N551Q963
$$ 17829 24240 -3164 -35540 -23448 -17369 807 -2982 -10918 -8985 -10659 -37954 -32403 -23440
15278b3440j1607R418K3863J5405j9879j4977k119M855j59j5762k4968J4827J9048
$$ -23440 -35047 -25629 -1766 13639 -6240 -21217 -23336 -18481 -18640 -34402 -59370 -44543 -25495
15265b5495K9141k2695j2086K6841k6296j7016K8454L2006Q75j4387K526j4238
$$ -25495 3646 -19049 -31135 -4294 -30590 -47606 -19152 12854 13729 -658 1868 -12370
15253a2370m942K4399o606k8814q945J0443K2041r663j9465J1377J365k538J856
$$ -12370 -17312 7087 481 -28333 -37278 -26835 -4794 -14457 -33922 -22545 -21180 -23718 -21862
15240b1862j9979J0021L715k1012k2755j7319m974J2192L8569M8551k8024k5619
$$ -21862 -41841 -31820 -28105 -49117 -71872 -89191 -94165 -81973 -43404 5147 -22877 -48496
15228d8496l296J4558J5359R711o29J3073j2173m742M928N738p792J4056P910
$$ -48496 -51792 -37234 -21875 -12164 -12793 280 -11893 -16635 -11707 -5969 -13761 295 8205
15215H205k627P698O935o042k0027k6047j4316K0777L003K2778J1498q796j7476
$$ 8205 5578 13276 20211 14169 -5858 -31905 -46221 -25444 -22441 337 11835 3039 -14437
15202a4437j4089o774j1499P432Q745J2350l301j2859J1350J6151L712r038J1410
$$ -14437 -28526 -35300 -46799 -39367 -30622 -18272 -21573 -34432 -23082 -6931 -3219 -12257 -847
15189h47P443K511J828p005k2926l736m462K261K667J3084J7813J8950j1491k8585
$$ -847 6596 9107 10935 3930 -18996 -22732 -27194 -24933 -22266 -9182 8631 27581 16090 -12495
15175a2495l2666M815J0671K7247K3224J5021L145j4768j1951j518j3719k9794
$$ -12495 -45161 -40346 -29675 -2428 20796 35817 38962 24194 12243 10725 -2994 -32788
15163c2788j0868K45K2949K7903L9j7109K7681M605k3998j9986o820K6733N014
$$ -32788 -43656 -43411 -20462 7441 7480 -9629 18052 22657 -1341 -21327 -28147 -1414 3600
15150C600Q618K065K0242J4981n521o293k1699k3995o967m550j320j4748k98K8452
$$ 3600 12218 14283 34525 49506 43985 37692 15993 -8002 -14969 -19519 -20839 -35587 -35885 -7433
15136g433n333k7267m2939m847J3345L8620J7338r567j2944q718K67l768J2086
$$ -7433 -12766 -40033 -82972 -87819 -74474 -35854 -18516 -28083 -41027 -49745 -49478 -53246 -41160
15123d1160N187J285K1183N966K0150J6791J813P981m1284M189M5139k8424n310
$$ -41160 -35973 -34688 -13505 -7539 12611 29402 31215 39196 -2088 2101 47240 18816 13506
15110A3506N954k7520j1723P341j7106j0596O835k31L0266J9152p314J310K0691
$$ 13506 19460 -8060 -19783 -12442 -29548 -40144 -33309 -33540 -3274 15878 8564 9874 30565
15097C0565L082j1918q344K309r079j7838j8694Q664J8847j8978n0968L4987L9570
$$ 30565 33647 21729 13385 15694 6615 -11223 -29917 -21253 -2406 -21384 -72352 -37365 2205
15084B205O165O387M4260N832Q880K51k2659l8353k2969L498j5293j8242j2397
$$ 2205 8370 14757 59017 64849 73729 73980 51321 12968 -10001 -6503 -21796 -40038 -52435
15071e2435K2308J1980P188l644J2616K612J2399J598n757K5476P889r721k1498
$$ -52435 -30127 -18147 -10959 -14603 -1987 625 13024 14622 8865 34341 42230 32509 11011
15058A1011j4882O65L1589L1101p905n815l9960k9935J2169Q498j3664k680J6298
$$ 11011 -3871 -3206 28383 59484 51579 45764 5804 -24131 -11962 -3464 -17128 -19808 -3510
15045c510J0083R404Q386L57m060K336r408j3134Q393k299j8947k084J2956J3417
$$ -3510 6573 15977 24363 24720 20660 22996 13588 454 8847 6548 -12399 -14483 -1527 11890
15031A1890Q007j1108l6994k2238J9561J8155o370R009l773l2690L7987K8881
$$ 11890 19897 8789 -28205 -50443 -30882 -12727 -19097 -10088 -13861 -46551 -8564 20317
15019B0317Q786k907j2475o900j3578o699j2969J2373K8594L5266J4642k7236
$$ 20317 29103 26196 13721 6821 -6757 -13456 -26425 -14052 14542 49808 64450 37214
15007C7214j2531j0901M381m481j3781l088l615P613l554R848j6228q170L617
$$ 37214 24683 13782 18163 13682 -99 -3187 -6802 811 -2743 7105 -9123 -17293 -13676
14994a3676j4823Q482J659R425J0150J8601J388l770j8541O730j971j8998k1059
$$ -13676 -28499 -20017 -18358 -8933 1217 19818 21206 17436 -1105 5625 3654 -15344 -36403
14981c6403j2005J9472j9017j5868J1230M2774Q807J417k2069O534J2117L639
$$ -36403 -48408 -28936 -47953 -63821 -52591 -9817 -1010 407 -21662 -15128 -3011 628
14969F28J3273L162q155K043J820o272l7045m135K2383Q167l8903J5302L302M
$$ 628 13901 17063 8908 10951 12771 6499 -30546 -34681 -12298 -4131 -43034 -27732 -24430 -24426
14955b4426l568K320q64L823K9070J7128j1434j1781j9082k4283J3512K168j3712
$$ -24426 -27994 -25674 -26538 -22715 6355 23483 12049 268 -18814 -43097 -29585 -27417 -41129
14942d1129J0949L528k0630Q221K3607K7385M62k1359O222R131j2244j0433N323
$$ -41129 -30180 -26652 -47282 -39061 -15454 11931 12393 -8966 -2744 6387 -5857 -16290 -10967
14929a0967j8285p616P581r292P982j6669M197o597J2391J4926J1978N283K1814
$$ -10967 -29252 -36868 -29287 -38579 -30597 -47266 -43069 -49666 -37275 -22349 -10371 -5088 16726
14916A6726j1031k6907O91K666Q33N075K1204J776j4227K2695J4711L660n380
$$ 16726 5695 -21212 -20521 -17855 -17022 -11947 9257 11033 -3194 19501 34212 37872 32492
14903C2492k2379j4197K8870m273j938k2191k3202K0867M0015K3770l8035M508
$$ 32492 10113 -4084 24786 20513 18575 -3616 -26818 -5951 34064 57834 19799 24307
14891B4307k618m026j9728m367K6577K0132p92k344m4425k7165M950M653M903
$$ 24307 21689 17663 -2065 -6432 20145 40277 39485 37141 -7284 -34449 -29499 -24846 -19943
14878a9943L166J6379K7783o589m470r817j4570o259J9333N202m582j0027K9545
$$ -19943 -16777 -398 27385 20796 16326 6509 -8061 -14320 5013 10215 5633 -4394 25151
14865B5151R050J6247j1105m581J2971l1201o154K1437K7216j0611l3692k7165
$$ 25151 34201 50448 39343 34762 47733 16532 10378 31815 59031 48420 14728 -12437
14853a2437j245j2736L6112j1596k3339J6010m89J4016O125j2725m612l544L057
$$ -12437 -13682 -26418 9694 -1902 -25241 -9231 -9720 4296 10421 -2304 -6916 -10460 -7403
14840g403K063j4727j1106J2140j0905k0357J2093L7607j0599j7045J0949L2419
$$ -7403 -5340 -20067 -31173 -19033 -29938 -50295 -38202 -595 -11194 -28239 -17290 15129
14828A5129J0195J7063o531j7077M03J4304j5001J7100O644q30k0029k8716k382
$$ 15129 25324 42387 35856 18779 19182 33486 18485 35585 42229 41399 21370 -7346 -9728
14815i728J9096O266K9784k0358l3854J987K6331J9318l6670m959P929q318l1817
$$ -9728 9368 15634 45418 25060 -8794 -6807 19524 38842 2172 -2787 5142 -3176 -34993
14802c4993K7827K4784N43l9217K534J2945J6905P654r342k422k846K5710J4015
$$ -34993 -7166 17618 18161 -21056 -18522 -5577 11328 18982 9640 7218 4372 30082 44097
14789D4097k9714J5612J1848L195n523j6523j9428J484l077K303K3449L537r596
$$ 44097 14383 29995 41843 45038 39515 22992 3564 5048 1971 4274 27723 31260 21664
14776B1664o866L2983M661j1034k3803m173K80k871j121j952j8664o383J4684
$$ 21664 14798 47781 52442 41408 17605 13432 13712 10841 9720 7768 -10896 -17279 -2595
14763b595J8757K4313p884m961j246j7457K2543k319N088j2068K226k8705J4773
$$ -2595 16162 40475 32591 27630 26384 8927 31470 29151 34239 22171 24397 -4308 10465
14750A0465J0529j241j3480l1063Q661L6699K1809j2577j4054R944j2129j5403
$$ 10465 20994 19753 6273 -24790 -16129 20570 42379 29802 15748 25692 13563 -1840
14738a840Q708Q268J3040J6080L3463q070M922q642l6250k0482o292K4149L00
$$ -1840 6868 15136 28176 44256 77719 69649 74571 65929 29679 9197 2905 27054 27354
14725B7354k2779j4961j006K4901M43j2110m952Q53q782j0022J2324K5327R231
$$ 27354 4575 -10386 -11392 13509 13952 1842 -3110 -2257 -11039 -21061 -8737 16590 25821
14712B5821r329j8406n241J6489K5506K446L987J3062k454k2040k9832J843j0761
$$ 25821 16492 -1914 -7155 9334 34840 37286 41273 54335 51881 29841 9 1852 -8909
14699h909K5462M042o238j8016L17o742N999j0647j130K6941J0608J0511j6299
$$ -8909 16553 20595 14357 -3659 -3342 -10084 -4085 -14732 -15862 11079 21687 32198 15899
14686A5899J1230l066j524k267K225J3076J750j2073O046o383j7075Q201J624
$$ 15899 27129 24063 22539 20272 22497 35573 37323 25250 31296 24913 7838 16039 17663
14673A7663k0890n110R305L2378l2327j3676K1113M443J0197J6519j1291l4031
$$ 17663 -3227 -8337 968 33346 1019 -12657 8456 12899 23096 39615 28324 -5707
14661e707k8627n978J6855J3555K725K0533J3374j0103j8114K3548l345J165J2835
$$ -5707 -34334 -40312 -23457 -9902 -7177 13356 26730 16627 -1487 22061 18716 19881 32716
14648C2716k8161l8266j9711M5791L7806j0880J2799J0729q217n262L3277L963
$$ 32716 4555 -33711 -53422 -7631 30175 19295 32094 42823 34606 29344 62621 66584
14636F6584L741M321j5008n5130J6206K7025j7743j4448q833Q905O702R163J5278
$$ 66584 70325 74646 59638 4508 20714 47739 29996 15548 6715 15620 22322 31485 46763
14623D6763l3294P496J0998O686O357j0803K0391K5288m676l5378j6254p621J6893
$$ 46763 13469 20965 31963 38649 45006 34203 54594 79882 75206 39828 23574 15953 32846
14610C2846O003j9580p273p074o77P299J8267k8840j9716J9226K4604J6373k051
$$ 32846 38849 19269 11996 4922 4245 11544 29811 971 -18745 481 25085 41458 39407
14597C9407J433n771J87l6305j173k239J2133l856M483l805J6341m029j6739j0839
$$ 39407 40840 35069 35256 -1049 -2222 -4461 7672 3816 8299 4494 20835 16806 67 -10772
14583a0772J6961K1672j8552k4180n902L0198n605R155R814N230M955q865P688
$$ -10772 6189 27861 9309 -14871 -20773 9425 3820 12975 22789 28019 32974 24109 31797
14570C1797J4587n290j6572k1958K0616R029N935K7101j1927k8638k2434Q748
$$ 31797 46384 41094 24522 2564 23180 32209 38144 65245 53318 24680 2246 10994
14558A0994J1376J6572N747j925J0455k792j4106p261q744j0273J088L2143J1994
$$ 10994 22370 38942 44689 42764 53219 50427 36321 29060 20316 10043 11131 43274 55268
14545E5268r334Q597P136j1593k0969k3528Q61J814j6134j2395M162p221J2062
$$ 55268 45934 54531 61667 50074 29105 5577 6438 8252 -7882 -20277 -16115 -23336 -11274
14532a1274q757K7001N4204l944k6689j5581q925k814J4530J2286L1442J3996
$$ -11274 -20031 6970 61174 57230 30541 14960 6035 3221 17751 30037 61479 75475
14520G5475m003j8518L646J8490j543l0252L302J7809L5053k1671K1379L7894
$$ 75475 71472 52954 56600 75090 73547 43295 46597 64406 99459 77788 99167 137061
14508A37061N1474M6579L7109P4319J67022J75709J45681Q4492L5727l6776j16980
$$ 137061 188535 235114 272223 346542 513564 689273 834954 919446 955173 918397 801417
14497H01417j44812j34645j18912p8568n5499o1289l4256q809o674k9063K087
$$ 801417 656605 521960 403048 324480 268981 207692 173436 164627 157953 128890 130977
14486A30977k5305l7562r040o05q348r036p526K392q350J8017K959j599P023K1403
$$ 130977 105672 68110 59070 58465 50117 41081 33555 35947 27597 45614 48573 46974 53997 75400
14472G5400J2201j8544k1470j3157o554k7844M302R027K1337r695j5101J8660
$$ 75400 87601 69057 47587 34430 27876 32 4334 13361 34698 25003 9902 28562
14460B8562R745j0343n891N06J485l8058L833K1551M1785J0527k9298R928J8970
$$ 28562 38307 27964 22073 22579 24064 -13994 -10161 11390 53175 63702 34404 44332 63302
14447F3302k5058n107J0472J0738J1030p463J051m814n631j3787j7041k1023R308
$$ 63302 38244 33137 43609 54347 65377 57914 58965 54151 48520 34733 17692 -3331 5977
14434E977L0197L3368N977j1558o190m267j1032j0532j5312j470R120j0620J1561
$$ 5977 36174 69542 75519 63961 57771 53504 42472 31940 16628 15158 24278 13658 25219
14421B5219J7167j3064j3537L261J2957K3749K1163k7749k1072m794J3798p923
$$ 25219 42386 29322 15785 19046 32003 55752 76915 49166 28094 23300 37098 29175
14409B9175q228L0389K0746j1037q071J0308k9165J6310J3841K557P519k6400
$$ 29175 20947 51336 72082 61045 52974 63282 34117 50427 64268 66825 74344 47944
14397D7944j0199p766o712n452J2433j939K5659N979J4053J754J6538J807j9447
$$ 47944 37745 29979 23267 17815 30248 28309 53968 59947 74000 75754 92292 94099 74652
14384G4652j2225j0938J4698j1453j4398j7850O866R542o79j0753j0983L3786
$$ 74652 62427 51489 66187 54734 40336 22486 29352 38894 38215 27462 16479 50265
14372E0265N50p223J9719j2534j4973l052j5707K033P507K601N393K1342J6690
$$ 50265 50815 43592 63311 50777 35804 32752 17045 19078 26585 29186 34579 55921 72611
14359G2611Q8J5554j6146j566K5834J4666J2259j0358J0738J896j6986k6820p74
$$ 72611 72699 88253 72107 70541 96375 111041 123300 112942 123680 125576 108590 81770 80996
14346H0996O648K8506j4788j1048j5736j0400J2711M2666J3084j4193m3390J3104
$$ 80996 87644 116150 101362 90314 74578 64178 76889 119555 132639 118446 75056 88160
14334H8160J2371j1024L92Q048q760j0971j6862k3582J9744P611N253l130j1708
$$ 88160 100531 89507 89899 97947 89187 78216 61354 37772 57516 65127 70380 67250 55542
14321E5542j2997J9568K2210J4969R523j754j4933J573J593j9873j3905L566l67
$$ 55542 42545 62113 84323 99292 108815 107061 92128 93701 95294 75421 61516 65082 64715
14308F4715Q214J1501J9887K2047N632J6273J0417p97O751K6872K4816L5501P984
$$ 64715 72929 84430 104317 126364 131996 148269 158686 157889 164640 191512 216328 251829 259813
14295B59813K0043L5171M3023M8487L4407P0181Q8546J40648J98058K61884L29792
$$ 259813 279856 315027 358050 406537 440944 511125 599671 740319 938377 1200261 1530053
14284A530053L63695L37704K26762R3829j2493j47710k52521l23057l28504l23349
$$ 1530053 1893748 2231452 2458214 2552043 2539550 2391840 2139319 1816262 1487758 1164409
14274A164409k58824k13329j19642q3145n7850n3246p0269j8717o080l2871k3407
$$ 1164409 905585 692256 572614 489469 431619 378373 308104 289387 283307 250436 227029
14263B27029k0281m3390j0815n277p249j9625l659J0129l135l982R180l932m2776
$$ 227029 206748 163358 152543 147266 140017 120392 116733 126862 123727 119745 128925 124993 82217
14250H2217K0746L8550k2480p292j7381j0150q713J9886O528o138k4273j9962
$$ 82217 102963 141513 119033 111741 94360 84210 75497 95383 101911 95773 71500 51538
14238E1538R039J5211L5612M088m06j6636N081k992K130N567l572K0136l824k5986
$$ 51538 60577 75788 111400 115488 115082 98446 103527 100535 102665 108232 104660 124796 120972 94986
14224I4986J5416L1371N037L826r683j0301m361L888j9739j1783K109K1322P400
$$ 94986 110402 141773 146810 150636 140953 130652 126291 130179 110440 98657 100766 122088 129488
14211A29488r442m993k9418M235R175P110j4782j0914j3856j705K5257J3145L357
$$ 129488 120046 115053 85635 89870 99045 106155 91373 80459 66603 64898 90155 103300 106657
14198A06657k9093l24J2395J1023K4382J8549J2159j1596k6893o146K7438J4852
$$ 106657 77564 77240 89635 100658 125040 143589 155748 144152 117259 111113 138551 153403
14186A53403j5528k8271Q626q747J4368J9158R249J3620L106L8220K8660k4944
$$ 153403 137875 109604 118230 109483 123851 143009 152258 165878 168984 207204 235864 210920
14174B10920n6274K1600K9325k270N202k213K1768j2680j3088k2533q790l678
$$ 210920 154646 176246 205571 203301 208503 206290 228058 215378 202290 179757 170967 167289
14162A67289N344J6968j0755K0163L1204J0630K992j5147j27j7867l2195k8442
$$ 167289 172633 189601 178846 199009 230213 240843 243835 228688 228561 210694 178499 150057
14150A50057p5266n9160m6581l0813r365j2229K1551o097N036J8804J9421J7825
$$ 150057 74791 15631 -30950 -61763 -71128 -83357 -61806 -67903 -62867 -44063 -24642 -6817
14138f817J8486J1842l237K1142J5578J9545K0502J2595L6680R06n169j4395j2806
$$ -6817 11669 23511 20274 41416 56994 76539 97041 109636 146316 147222 142053 127658 114852
14125A14852J5580L268k1333j1529L7532P615j5385k860o598k599p683n856k4291
$$ 114852 130432 133700 112367 100838 138370 145985 130600 127740 121142 118543 110860 105004 80713
14112H0713J4255K3704K3743k346L0450R836Q211K9879J7949p569j1150n530M364
$$ 80713 94968 118672 142415 140069 170519 180355 188566 218445 236394 228825 217675 212145 216509
14099B16509o113J2865M7528M9851L1184M2117p687l2359l0633m1742j2538m491
$$ 216509 210396 223261 270789 320640 351824 393941 386254 353895 323262 281520 268982 264491
14087B64491p227R410j8062k7595K2696J5410j6083j0101L0071M0530J1925J2035
$$ 264491 257264 266674 248612 221017 243713 259123 243040 232939 263010 303540 315465 327500
14075C27500j4319J0840K2313J3352O392O325Q876J1768L2949L8257J8410J8204
$$ 327500 313181 324021 346334 359686 366078 372403 381279 393047 425996 464253 482663 500867
14063E00867j075j0102J0575L1264k4145k0500K345k9957j2905k927k7565j0757
$$ 500867 499792 489690 500265 531529 507384 486884 489229 459272 446367 443440 415875 405118
14051D05118L4451K3569j8907j8306k2636k5603M920Q706O199k2901l3263k9765
$$ 405118 439569 463138 444231 425925 403289 377686 382606 391312 397511 374610 341347 311582
14039C11582R242J8119N214J1938O59M824q306k4031n749L88M321J6939L4453
$$ 311582 320824 338943 344157 356095 356754 361578 353272 329241 323492 323880 328201 345140 379593
14026C79593O0843N1570N1117L9350K1325j1157o619k7270l0551p368K1551k5166
$$ 379593 440436 492006 543123 582473 603798 592641 586022 558752 528201 520833 542384 517218
14014E17218j2063L981j8651l2178j9310N821l4021l3119j2604K3543K0045J4765
$$ 517218 505155 509136 490485 458307 438997 444818 410797 377678 365074 388617 408662 423427
14002D23427m805j5237q238L0707J034o32l897l235k4030k1226k9587l4740m0856
$$ 423427 418622 403385 395147 425854 426888 426256 422359 419124 395094 373868 344281 309541 268685
13989B68685j7866J3883q699J5204L1370K3158J6632N4027K2508m302p375J287
$$ 268685 250819 264702 256003 271207 302577 325735 342367 396394 418902 414600 407225 408512
13977D08512k6245l5297Q340n20K1858L7195M9753J7915R22k2235k087M1853N861
$$ 408512 382267 346970 355310 354790 376648 413843 463596 481511 482433 460198 458111 499964 505825
13964E05825L661J4181J2381j1955l111L0287K4967k2466k8675q281J3301M4427
$$ 505825 509486 523667 536048 524093 520982 551269 576236 553770 525095 516814 530115 574542
13952E74542L6162J5898L2124L1812J3386Q912J1284L8726M901j2210m9626k4468
$$ 574542 610704 626602 658726 690538 703924 712836 724120 762846 767747 755537 705911 681443
13940F81443j8027J6154l944k4286J7910K929k7851j1707j6047m95K0560K1952
$$ 681443 663416 679570 675626 651340 669250 672179 644328 632621 616574 616079 636639 658591
13928F58591J4570L0374K250J6283K1323k6044j0565L8679L6761K9792J1868L4157
$$ 658591 673161 703535 705785 722068 743391 717347 706782 745461 782222 812014 823882 858039
13916H58039J7734k0193J167L8104J4801K7077N1711M9139M3445k944K269M4489
$$ 858039 875773 855580 856747 894851 909652 936729 988440 1037579 1081024 1078080 1080349 1124838
13904A124838N3756K6421K8640J3495K5670K5769J7594K8475N4344N7101N0168
$$ 1124838 1178594 1205015 1233655 1247150 1272820 1298589 1316183 1344658 1399002 1456103 1506271
13893A506271N9885N4689M2996N5011P6462P2441J00586O1545N7936J00680J05265
$$ 1506271 1566156 1620845 1663841 1718852 1795314 1867755 1968341 2029886 2087822 2188502 2293767
13882B293767R3974Q0422J09917J38674J14681R2353R0612J30664J64335J57477
$$ 2293767 2387741 2468163 2578080 2716754 2831435 2923788 3014400 3145064 3309399 3466876
13872C466876J53753J87993K08808K56315K79417L05869L05137L10946L61177
$$ 3466876 3620629 3808622 4017430 4273745 4553162 4859031 5164168 5475114 5836291
13863E836291L88943M27055N11688N78234O54773P34060Q49827J019007J248060
$$ 5836291 6225234 6652289 7163977 7742211 8396984 9131044 9980871 10999878 12247938
13854A2247938J539230J850786K253614K713818L204965L809530M419873M968460
$$ 12247938 13787168 15637954 17891568 20605386 23810351 27619881 32039754 37008214
13846C7008214N474986O146721P272213R289633J2743033J8618124K8175725M2312040
$$ 37008214 42483200 48629921 55902134 65191767 77934800 96552924 124728649 167040689
13838A67040689N9414963P3191347P4958596O1387341L7758198J0567326j5699482
$$ 167040689 226455652 299646999 374605595 435992936 473751134 484318460 468618978
13831D68618978l9630058n8009611o7351433o5841217n7036770m4647173l2228551
$$ 468618978 428988920 370979309 303627876 237786659 180749889 136102716 103874165
13824A03874165k2498493j5731117j1275447q397056o552109n386606m602634
$$ 103874165 81375672 65644555 54369108 45972052 39419943 34033337 29430703
13817B9430703m028761l521782l076087k664536k191571j774596j442370j184202
$$ 29430703 25401942 21880160 18804073 16139537 13947966 12173370 10731000 9546798
13809I546798r88607q54334p15366o19608n21866m85674m04720l27138l33633
$$ 9546798 8558191 7703857 6988491 6368883 5847017 5361343 4956623 4629485 4295852
13800D295852k80357k12244k00606k10034j86767j80050j57023j64169j69062
$$ 4295852 4015495 3803251 3602645 3392611 3205844 3025794 2868771 2704602 2535540
13791B535540j71099j33274j14614j16427j00189r3597p4234n9085p2449o7070
$$ 2535540 2364441 2231167 2116553 2000126 1899937 1806340 1732106 1673021 1600572 1533502
13781A533502n5710l7936k3413n3464l7445n578j2410m9856m6204j9096n4544
$$ 1533502 1477792 1439856 1416443 1362979 1325534 1319956 1307546 1257690 1211486 1192390 1137846
13770A137846o5204p1510l4837l0301m8275n0025m6532l3784j5015n0927j9129
$$ 1137846 1072642 1001132 966295 935994 887719 837694 791162 757378 742363 691436 672307
13759F72307k1628k4067J3372L1169j124k7650j7617k5100j6994l3290j2356l7126
$$ 672307 650679 626612 639984 671153 670029 642379 624762 599662 582668 549378 537022 499896
13747D99896j4264m866l6233K4035J4456j4108M275J2704K443k5479k0569k4153
$$ 499896 485632 480766 444533 468568 483024 468916 473191 485895 488338 462859 442290 418137
13735D18137l7103l6067n284k885j779J8374j4532j9200k5196P529l923l0120
$$ 418137 381034 344967 339683 336798 335019 353393 338861 319661 294465 301994 298071 267951
13723B67951l3904k6011j4592M562K7573M648J8419K8403M1209J6652K410O420
$$ 267951 234047 208036 193444 198006 225579 230227 248646 277049 318258 334910 337320 343740
13711C43740k8827l247j150j3034j5906N113J537k2336m2356p315J890j070j2179
$$ 343740 314913 311666 310516 297482 281576 286689 288226 265890 223534 216219 218109 217039 204860
13698B04860l975j9430j9826J3852K8752R144J4472M558k9986j9583j0474j9674
$$ 204860 200885 181455 161629 175481 204233 213377 227849 232407 202421 182838 172364 152690
13686A52690j0598n336k0N232K6678L3140M3077m718K948J2725r223n9750o2779
$$ 152690 142092 136756 136736 141968 168646 201786 244863 240145 243093 255818 246595 186845 124066
13673A24066m0506J672m1856k3527l8175Q498K4844j9773j1640j2629k9607j2059
$$ 124066 83560 85232 43376 19849 -18326 -9828 15016 -4757 -16397 -29026 -58633 -70692
13661g0692J7029J7939m433m65q339k3736k2707J7816k609k0909r032l4062n0639
$$ -70692 -53663 -35724 -40157 -40622 -48961 -72697 -95404 -77588 -80197 -101106 -110138 -144200 -194839
13648a94839l4632m347p56j2473r60L3664J8343M1901R4004P4673N5796M5878
$$ -194839 -229471 -233818 -234574 -247047 -248007 -214343 -196000 -154099 -60095 14578 70374 116252
13636A16252K2793P906k3404J966o878k9718M891J4172K6984J050j9071L027K3365
$$ 116252 139045 146951 123547 125513 118635 88917 93808 107980 134964 136014 116943 119970 143335
13623A43335l499j3643j0451j6833R349l7848l2821Q81Q706K9839O063k3619m110
$$ 143335 139836 126193 115742 98909 108258 70410 37589 38470 47176 77015 83078 59459 55349
13610E5349L0085K6254k3710l3361n34O093o77O093P363j8951R807K1361j7113
$$ 55349 85434 111688 87978 54617 54083 60176 59499 65592 72955 54004 63811 85172 68059
13597F8059j3355L571M1277J0748r655J8016j114j2122k913j1953r88J0939k9556
$$ 68059 54704 58275 99552 110300 100645 118661 117547 105425 102512 90559 89571 100510 70954
13584G0954j8281K3781J0590m464j0004r106J532K8906j0837k8009Q410M586l3498
$$ 70954 52673 76454 87044 82580 72576 63470 65002 93908 83071 55062 63472 68058 34560
13571C4560P812J5106J5745K0895l4806j6710J9867J3936o045j9752Q186k5702
$$ 34560 42372 57478 73223 94118 59312 42602 62469 76405 70360 50608 58794 33092
13559C3092R387M3033j923j0536n005j8568J6097j2028K136j6770q30J5078J2011
$$ 33092 42479 85512 83589 73053 68048 49480 65577 53549 55685 38915 38085 53163 65174
13546F5174k401K0015O556k6963k1042Q413p988j2534L2064L3194K7051J8946
$$ 65174 62773 82788 89344 62381 41339 49752 41764 29230 61294 94488 121539 140485
13534A40485L3056R684p861o397O38K5460j832O749L1066J8349K591J7133L6713
$$ 140485 173541 183225 175364 168967 169605 195065 193233 199982 231048 249397 251988 269121 305834
13521C05834R535l3728j8513n5626n9456l7236j5846l5982l8110k8591k3846m533
$$ 305834 315369 281641 263128 207502 148046 110810 94964 58982 20872 -7719 -31565 -36098
13509c6098k1390P824M038n200j4542j9815o29j0616K4736K6089K4311j3567j0489
$$ -36098 -57488 -49664 -45626 -50826 -65368 -85183 -85812 -96428 -71692 -45603 -21292 -34859 -45348
13496d5348K3950o603j8261p894j4783l7745L8374K2967J1370q022l100j4248
$$ -45348 -21398 -28001 -46262 -54156 -68939 -106684 -68310 -45343 -33973 -41995 -45095 -59343
13484e9343j1465K3176J9816K5177j4194P066R751J843j215j1767J4871N439m713
$$ -59343 -70808 -47632 -27816 -2639 -16833 -9767 -16 1827 612 -11155 3716 9155 4442
13471D442j9340J5414j775k4078j6528K0720R597l370p113K8092J7464j962J3310
$$ 4442 -14898 516 -1259 -25337 -41865 -21145 -11548 -14918 -22031 6061 23525 21563 34873
13458C4873m2074k3425Q720K0085Q054L2324M750P531K389k3912r083q470k920
$$ 34873 -7201 -30626 -21906 -1821 6233 38557 43307 50838 53227 29315 20232 11762 8842
13445H842J0823J9416J5303j9709j5693l6346j5128M835o69m472K6623L4694j2218
$$ 8842 19665 39081 54384 34675 18982 -17364 -32492 -27657 -28326 -32798 -6175 28519 16301
13432A6301M83l865k7903k370J3590J6960R482n227j1883P852p060Q044j4312
$$ 16301 16784 12919 -14984 -17354 -3764 13196 22678 17451 5568 13420 6360 14404 92
13419I2o093p188J9937j1731l0488j259K9793J9288j6137J586K5966j3177N336
$$ 92 -6001 -13189 6748 -4983 -35471 -36730 -6937 12351 -3786 -2200 23766 10589 15925
13406A5925J489j7781J0794K4777K5465J0895N201J8600J3189L4197K5852O893
$$ 15925 17414 -367 10427 35204 60669 71564 76765 95365 108554 142751 168603 175496
13394A75496J9900J1675K5485K4970K6399O8623Q9653J05893J09988J73284K55403
$$ 175496 195396 207071 232556 257526 283925 352548 442201 548094 658082 831366 1086769
13383A086769K94843L54810L41743K83886J22004k8063j27239k59086k90412k89236
$$ 1086769 1381612 1736422 2078165 2362051 2484055 2455992 2328753 2069667 1779255 1490019
13373A490019l23799k71869k02249j75295j02011p1144o7807m7865l4787r225
$$ 1490019 1166220 894351 692102 516807 414796 343652 275845 227980 193193 183968
13363A83968J5383J1806k7003m7944j0777L319r886o763k4286j108j2512N68j6016
$$ 183968 199351 211157 184154 136210 125433 128752 118866 112103 87817 86709 74197 74765 58749
13350E8749m6332j1229J032j3757K4318K480j2975Q412J5953r22q569p446L277
$$ 58749 12417 1188 2220 -11537 12781 15261 2286 10698 26651 25729 17160 9714 12991
13337A2991Q97m469n081N521l1080j1612K4370J8626k0182L0255K7563M067j9474
$$ 12991 13888 9419 4338 9859 -21221 -32833 -8463 10163 -10019 20236 47799 51866 32392
13324C2392J268k206O91J3845p578Q18j8875L6423K2945k8597l8435j2571o473
$$ 32392 33660 31454 32145 45990 38412 39230 20355 56778 79723 51126 12691 120 -6353
13311f353M148J3067k3362p633j898Q190M9961l271r343k5442j3170J67L959J1071
$$ -6353 -2205 10862 -12500 -20133 -22031 -13841 36120 32849 23506 -1936 -15106 -14939 -10980 91
13297I1N126J3184J22j2229j4693K3011L6978j2331j6919k1000K909R904j5817
$$ 91 5217 18401 18523 6294 -8399 14612 51590 39259 22340 1340 4249 14153 -1664
13284a664l720R549j6585J1275K3866J5278J7301j2631j4344J5938n97k0418m219
$$ -1664 -5384 4165 -12420 -1145 22721 37999 55300 42669 28325 44263 43666 23248 19029
13271A9029J4268J9129J4603k7450q431J8224K711j3777j4053l5549J9669q703
$$ 19029 33297 52426 67029 39579 31148 49372 52083 38306 24253 -11296 8373 -330
13259c30o380k1151j8863J4758L4451K3674K476J3752J4081O948m084k6276j1303
$$ -330 -6710 -27861 -46724 -31966 2485 26159 28635 42387 56468 63416 59332 33056 21753
13246B1753j56J1780K5935p838k8607j0517k119J6203J0999R372o104K792o291
$$ 21753 21597 33377 59312 51474 22867 12350 10231 26434 37433 46805 40701 43493 37202
13233C7202K3511k7327m7263J5130O973Q170Q767k6534j5701J5224k68n204K5599
$$ 37202 60713 33386 -13877 1253 8226 16396 25163 -1371 -17072 -1848 -2116 -7320 18279
13220A8279N96j4258l2861N156K3350J8200j4151Q520J210j7676l242j1568L994
$$ 18279 18875 4617 -28244 -23088 262 18462 4311 12831 14041 -3635 -6877 -18445 -14451
13207a4451L5914J6734J3088K1123J1811j548J36j2439r823l5676l0736K202J0126
$$ -14451 21463 38197 51285 72408 84219 82671 82807 70368 60545 24869 -5867 -3665 6461
13194F461N688K1412k73P477J4264k5843n277L6354O6215Q5325R2837O9641K7149
$$ 6461 12149 33561 33288 40765 55029 29186 23909 60263 126478 211803 304640 374281 401430
13181D01430j6879p5876q8701p0357N728k0020l3616k8204j7946J678j1481j4056
$$ 401430 384551 308675 219974 149617 155345 135325 101709 73505 55559 57237 45756 31700
13169C1700n041n579M788J7023k4770o350O292K469L261L850J4829j3877r597
$$ 31700 26659 21080 25868 42891 18121 11771 18063 20532 23793 27643 42472 28595 18998
13156A8998P389o969P776L0164J0743Q221J3093j324J5338J4914K0734J9233J5582
$$ 18998 26387 19418 27194 57358 68101 76322 89415 88091 103429 118343 139077 158310 173892
13143A73892K3372Q6206J15379J65702K59641K64564J23576p6318k30702k49612
$$ 173892 197264 283470 398849 564551 824192 1088756 1212332 1136014 905312 655700
13133F55700k19584j45068p9952l7297j2926l3680j8162r368m262m576k2587j5136
$$ 655700 436116 291048 211096 173799 160873 127193 109031 99663 95401 90825 68238 53102
13121E3102l4073Q165J7799q000m763P68k612R657q688P022K4753j3049L518j3585
$$ 53102 19029 27194 44993 36993 32230 32998 30386 40043 31355 38377 63130 50081 53599 40014
13107D0014p228J2228L0952J1151K8170J5216m679K9857K6869K9867N3607P9900
$$ 40014 32786 45014 75966 87117 115287 130503 125824 155681 182550 212417 266024 345924
13095C45924J80313K47735K53894J91972R14k08408k54305k04597j48295r7512
$$ 345924 526237 773972 1027866 1219838 1220752 1012344 758039 553442 405147 307635
13085C07635o3692n6691m2134o2571k5736K0139j3156j2070j435J0007k789J3413
$$ 307635 243943 187252 145118 82547 56811 76950 63794 51724 50289 60296 57507 70920
13073G0920J615j8402l2754p74K2869J496q988J0522p499M064M6030p76m436o61
$$ 70920 72535 54133 21379 20605 43474 44970 35982 46504 39005 43069 89099 88323 83887 83226
13059H3226J4167m040k1793j2075J4203K2453J1407P936K8122R3679R7498Q5478
$$ 83226 97393 93353 71560 59485 73688 96141 107548 115484 143606 237285 334783 420261
13047D20261N7762n813o3535p1709o6654p9406p2374k5444r259j1125l1933k688
$$ 420261 478023 472210 408675 336966 270312 190906 118532 93088 83829 72704 40771 38083
13035C8083j9382N786j37j4176J2616J8926M0689K4929k5035l1756M872J6552
$$ 38083 18701 24487 24350 10174 22790 41716 82405 107334 82299 50543 55415 71967
13023G1967J636j796O018l793N756K3047k3373l5750j2594o631m696n425o891
$$ 71967 73603 71807 77825 74032 79788 102835 79462 43712 31118 24487 19791 14366 7475
13010G475J0448J3859L98K0262L2855q551j0236r974m671N750k1697O367K0132
$$ 7475 17923 31782 32180 52442 85297 76746 66510 56536 51865 57615 35918 42285 62417
12997F2417M531k9772p434Q218J7830k6707M938L1521K4689l68l0319q566o609
$$ 62417 66948 37176 29742 37960 55790 29083 34021 65542 90231 89863 59544 50978 44369
12984D4369q541K269k142J8691p656m379K990q309o50J5658L611k8862n867N704
$$ 44369 35828 38097 35955 54646 46990 42611 45601 37292 36642 52300 55911 27049 21182 26886
12970B6886m52J3153J4889K407R208l326m300J0028j139J3991O449N523j5375
$$ 26886 26434 39587 54476 56883 66091 62765 58465 68493 67354 81345 87794 93317 77942
12957G7942N741q037J395j8253j734K1528k9162j8820K0827P839r429k415l798
$$ 77942 83683 75646 77041 58788 57054 78582 49420 30600 51427 59266 49837 47422 43624
12944D3624k775j5606J91M164J1498J6862o653r06K229p653p407j1423J7010k285
$$ 43624 40849 25243 25434 29598 41096 57958 51305 50399 52628 44975 37568 26145 43155 40870
12930D0870k3552M534K1227J9443M4993L515m0036O742k3542j5731J6258k7068
$$ 40870 17318 21852 43079 62522 107515 111030 70994 77736 54194 38463 54721 27653
12918B7653n753J7272q104J148K988J6652j8100k1372q72K2685J4126n890O120
$$ 27653 21900 39172 31068 32216 35204 51856 33756 12384 11512 34197 48323 42433 48553
12905D8553J0689M660K7826j5260N954J1466j2796j3281o637N419R566K3302k9170
$$ 48553 59242 63902 91728 76468 82422 93888 81092 67811 61174 66593 76159 99461 70291
12892G0291j5642Q549j778n991J1238j686K2684K7095J1755m6129l0131N070K5303
$$ 70291 54649 63198 61420 55429 66667 64981 87665 114760 126515 80386 50255 55325 80628
12879H0628l156j4915M121k0438j8356R78L0590J692P748J1430M578J653j0361
$$ 80628 77472 62557 66678 46240 27884 28862 59452 61144 68892 80322 84900 86553 76192
12866G6192j3284p841j8172J9217J8160J8508j4857M032j1547j9973k313J6710
$$ 76192 62908 55067 36895 56112 74272 92780 77923 81955 70408 50435 48122 64832
12854F4832l342L998j8987J7747K623n175J4485J4534l242l4382j9811J4096P496
$$ 64832 61490 65488 46501 64248 66871 61696 76181 90715 87473 53091 33280 47376 54872
12841E4872j5986J1776K485l51Q706K4944J5929j502k1917k442J9252r903j5261
$$ 54872 38886 50662 53147 52796 61502 86446 102375 100873 78956 76514 95766 85863 70602
12828G0602r408l590j1515N011j948q711J0152K7611J0878M152p208l4192Q662
$$ 70602 61194 57604 46089 51100 49152 40441 50593 78204 89082 93234 86026 51834 60496
12815F0496r615K1243R920p772j9709J2107J6136J780j3497o438j877l56j8202
$$ 60496 50881 72124 82044 74272 54563 66670 82806 84586 71089 64651 62774 62418 44216
12802D4216K729L2678J1654k9788j2519K1589j635q857r981l2383J9392M147j8138
$$ 44216 46945 79623 91277 61489 48970 70559 68924 60067 50086 17703 37095 41242 23104
12789B3104K0397J6495K8229J6053j401q748J850n640j3076j691o447L0639K3575
$$ 23104 43501 59996 88225 104278 102877 94129 95979 90339 77263 75572 69125 99764 123339
12776A23339L3640J0434j8376m2193j7575n089n965j340P768J1746J8396p627
$$ 123339 156979 167413 149037 106844 89269 84180 78215 76875 84643 96389 114785 107158
12764A07158m924M78L3567j0453l3874K905K6180K8019K530l0436m887k282R933
$$ 107158 102234 102712 136279 125826 91952 94857 121037 149056 151586 121150 116263 113981 123914
12751A23914M1065j5395l2114k2315P120l594L952j6176r036K4191j3613r881
$$ 123914 164979 149584 117470 95155 102275 98681 102633 86457 77421 101612 87999 78118
12739G8118J2556J7202R491j6384K4317R709J4325n675p367M29j8135j9527J900
$$ 78118 90674 107876 117367 100983 125300 135009 149334 143659 136292 136721 118586 99059 100959
12726A00959l3034L770L8267J4543K5256J0738j1574l0643k1180j340L506K4176
$$ 100959 67925 71695 109962 124505 149761 160499 148925 118282 97102 95762 99268 123444
12714A23444j7497j3834J0250K4531J7571k4186m347Q738l915q239Q966k0284
$$ 123444 105947 92113 102363 126894 144465 120279 115932 124670 120755 112516 121482 101198
12702A01198J0315K0988j1012N297m138q76J6996j3668m5080l886L8005O085l233
$$ 101198 111513 132501 121489 126786 122648 121772 138768 125100 80020 76134 114139 120224 116991
12689A16991p283k2119J3732J31m408Q291J750m562j518Q949J6045K0354P505
$$ 116991 109708 87589 101321 101452 97044 105335 107085 102523 101005 109954 125999 146353 153858
12676A53858n417n121J5691J444n184M0R766L746P459k1175M013J4239k866k2841
$$ 153858 148441 143320 159011 160455 155271 155311 165077 168823 176282 155107 159120 173359 170493 147652
12662A47652j400K8975j3730k9914j3775K1856p60K234k4689J835J7153J5190
$$ 147652 146252 175227 161497 131583 117808 139664 138904 141138 116449 118284 135437 150627
12650A50627N785M6o679j790J9447j8185l596j1188j5553l3J4857O892J664Q911
$$ 150627 156412 156458 149779 147989 167436 149251 145655 134467 118914 118881 133738 140630 142294 151205
12636A51205K1542K6320p935j7773O427j1443k2915o36j2101R480J1984J613n531
$$ 151205 172747 199067 191132 173359 179786 168343 145428 144792 132691 142171 154155 155768 150237
12623A50237J760l244N647P650N523J9622l055n063M078l033N841L189j0177n782
$$ 150237 151997 148753 154400 162050 167573 187195 184140 179077 183155 180122 185963 189152 178975 173193
12609A73193j621M699k3889N325K0240J0801j8216j243K606n004p958k1931l5022
$$ 173193 171572 176271 152382 157707 177947 188748 170532 169289 171895 166891 158933 137002 101980
12596A01980q615K0928J7811K9830K4509K6669k01j7700o978J796J7625n921k0537
$$ 101980 93365 114293 132104 161934 186443 213112 212911 195211 188233 190029 207654 201733 181196
12583A81196j1451r916J0495P089m057j4746J4778J2853J4757p611j0887R254
$$ 181196 169745 159829 170324 177413 173356 158610 173388 186241 200998 193387 182500 191754
12571A91754L4795L2670J650j4038k1669j3638J9615L2411j6356j8750j1346k491
$$ 191754 226549 259219 260869 246831 225162 211524 231139 263550 247194 228444 217098 214607
12559B14607j586J2603J3794L717n672M009m561r543m0446Q992m913j2305J1654
$$ 214607 213021 225624 239418 243135 237463 241472 236911 227368 186922 195914 191001 178696 190350
12546A90350j5193q610L127J0729R017L221R150K6753j2232J8800P687k1787k8674
$$ 190350 175157 166547 169674 180403 189420 192641 201791 228544 216312 235112 242799 221012 192338
12533A92338P97K026J053J9638K0230k0816l2047K7427K3194m68N553j560k3715
$$ 192338 193135 195161 196214 215852 236082 215266 183219 210646 233840 233372 238925 237365 213650
12520B13650k2692j4156j1680J4557L4277R80j1292P141L0321J5548K1512P268
$$ 213650 190958 176802 165122 179679 213956 214936 203644 210785 241106 256654 278166 285434
12508B85434k143J0530N854j2135k0199q808J888l750j5242J5399K0008j6192
$$ 285434 283291 293821 299675 287540 267341 258533 260421 256671 241429 256828 276836 260644
12496B60644j5676K4658K1347Q154l2410r747O544J1743K4766l286K4064L6464
$$ 260644 244968 269626 290973 299127 266717 256970 263514 275257 300023 296737 320801 357265
12484C57265p216k4640k2570o421k1795j6102L3304J2384k5595M810o302j960
$$ 357265 350049 325409 302839 296418 274623 258521 291825 304209 278614 283424 277122 275162
12472B75162j7369K1883Q458k349N592l110K048J796J7105J3877j3596q885q475
$$ 275162 257793 279676 288134 285785 291377 288267 290315 292111 309216 323093 309497 300612 292137
12459B92137j2639j1865J4453J0263j5068J3532L031L181L5488L7690o384j9016
$$ 292137 279498 267633 282086 292349 277281 290813 293844 297025 332513 370203 363819 344803
12447C44803j7908p932N814j0040j4795Q344j097l094j946n409l629N091k6621
$$ 344803 326895 318963 324777 314737 299942 308286 307189 304095 302149 296740 293111 298202 271581
12434B71581L817J0557l135n967J7654J7623o254j7885J5409R824q113k787Q341
$$ 271581 275398 285955 282820 276853 294507 312130 305876 287991 303400 313224 305111 302324 310665
12421C10665R696l063J4374K7692P49k7410m918K4359J1829L063k4809q33K833
$$ 310665 320361 317298 331672 359364 360113 332703 327785 352144 363973 367036 342227 341394 344227
12408C44227J1520K174J1490K6344j5486M499j1060j0015K783K2423K2279K7925
$$ 344227 355747 357921 369411 395755 380269 384768 373708 363693 366476 388899 411178 439103
12396D39103J3571J7612J8915K355l234o818j6787r218J1588p225j935M153J2489
$$ 439103 452674 470286 489201 491556 488322 481504 464717 455499 467087 459862 457927 462080 474569
12383D74569o666k8690M292Q419j0718O589J5775N684o482r708n910j176K4128
$$ 474569 467903 439213 443505 451924 441206 447795 463570 469254 462772 453064 447154 445978 470106
12370D70106K87k7781k9315J1637J1787J529j3621n310M443K97L5239M4337J3330
$$ 470106 470393 442612 413297 424934 436721 438250 424629 419319 423762 424059 459298 503635 516965
12357E16965k7046k9101j2099J6663K0240m906k0168k5263k2625J7202K6695j736
$$ 516965 489919 460818 448719 465382 485622 480716 460548 435285 412660 429862 456557 454821
12345D54821j6360J0370K9667l051q226J2788J4315r668j0184p056K829M280K2214
$$ 454821 438461 448831 478498 475447 467221 480009 494324 484656 474472 467416 470245 474525 496739
12332D96739L2575j0619l3220Q9j3472l639R323K0744M2827J3582O080j5942n372
$$ 496739 529314 518695 485475 485564 472092 468453 477776 498520 541347 554929 561009 545067 539695
12319E39695l138j6901O19K2668p123n0278j7661p477L2958M2197j9030K6774
$$ 539695 536557 519656 520275 542943 535820 485542 467881 460404 493362 535559 516529 543303
12307E43303j71M031J0082p768M067J489L973J9775P553P308Q250k592l0684q735
$$ 543303 543132 547163 557245 549477 553544 555033 559006 578781 586334 593642 601892 599300 568616 559881
12293E59881J8127k0213j3062L6806J6349P220r979k389J0852N17m566Q16Q904
$$ 559881 578008 557795 544733 581539 597888 605108 595129 592740 603592 604109 599543 600359 609263
12280F09263J908r116P812J1060Q255p194J0502k727J8455J8575N59K153q604
$$ 609263 611171 602055 609867 620927 629182 621988 632490 629763 648218 666793 667352 669505 660901
12267F60901j0906r940P48n877J5058L8743r796l3234k8698k2223J6478K8760
$$ 660901 649995 640055 640803 634926 649984 688727 678931 645697 616999 594776 611254 640014
12255F40014M5216m280j7022J691Q310j0018j0593J5678K8736j2243q564m468
$$ 640014 685230 680950 663928 665619 673929 663911 653318 668996 697732 685489 676925 672457
12243F72457j3531p716J9486K7273K6464L0349J1180k1682k6921l223P113J493
$$ 672457 658926 651210 670696 697969 724433 754782 765962 744280 717359 714136 721249 722742
12231G22742J0007j51j1598K037o119P12J9845L1942J3807p022j2162l929P58
$$ 722742 732749 732598 721000 723037 716918 717630 737475 769417 783224 776202 764040 760111 760869
12218G60869M2687K5323k5226j1869J3146M977O847K4828J3100k3063j2755J9841
$$ 760869 803556 828879 803653 791784 804930 809907 816754 841582 854682 831619 818864 838705
12206H38705J4059P379l0526j1499J7732J9906J7335J1539j928j958K238J0979
$$ 838705 852764 860143 829617 818118 835850 855756 873091 884630 882702 880744 882982 893961
12194H93961R885L3281J9018l937n794q121k2695P994J1374J1950k855K142J1807
$$ 893961 903846 937127 956145 952208 946414 938293 915598 923592 934966 946916 944061 946203 958010
12181I58010L3491L3241K0123j1951k3146O220K1118j0700J4622L629J2278q611
$$ 958010 991501 1024742 1044865 1032914 1009768 1015988 1037106 1026406 1041028 1044657 1056935 1048324
12169A048324K1689J0221L0036K746j2065K0648k563m2899p309O609P714J0410
$$ 1048324 1070013 1080234 1110270 1113016 1100951 1121599 1119036 1076137 1068828 1075437 1083151 1093561
12157A093561J6268O147l21J3511j4922K9162K5443M076o924K949K6408K8718
$$ 1093561 1109829 1115976 1115655 1129166 1114244 1143406 1168849 1172925 1166001 1168950 1195358 1224076
12145A224076j958Q068o982M391L2779J4609Q428L711J629R34N5640j309K475
$$ 1224076 1222118 1230186 1223204 1227595 1260374 1274983 1283411 1287122 1288751 1289685 1345325 1344016 1346491
12132A346491J4930R592L524K7048J2020K776J2900M772n603j7710k2794K9803
$$ 1346491 1361421 1371013 1374537 1401585 1413605 1416381 1429281 1434053 1428450 1410740 1387946 1417749
12120A417749K3550j446J4335J6565J0231L9393K6951l4o50O652J3R712L1705
$$ 1417749 1441299 1439853 1454188 1470753 1480984 1520377 1547328 1547294 1546644 1553296 1553309 1563021 1594726
12107A594726K3477L703k5049j965M020L759M2033K0532J1254j7996K0302L2766
$$ 1594726 1618203 1621906 1596857 1594892 1598912 1602671 1644704 1665236 1676490 1658494 1678796 1711562
12095A711562M2676L1109J7086J5318J0825J796N994q577l901j1687p751K3464
$$ 1711562 1754238 1785347 1802433 1817751 1828576 1830372 1836366 1827789 1823888 1812201 1804450 1827914
12083A827914M1305M8148M0049L708J1901K2660L631J3776j4219J8860k657L6722
$$ 1827914 1869219 1917367 1957416 1961124 1973025 1995685 1999316 2013092 1998873 2017733 2015076 2051798
12071B051798M2899M2925J5344K1119K3161K4613L0264n363k2500o126L2937M2620
$$ 2051798 2094697 2137622 2152966 2174085 2197246 2221859 2252123 2246760 2224260 2218134 2251071 2293691
12059B293691J5505J7568L0229K6863L9380J6990j235L4140M2617L082L0732K6507
$$ 2293691 2309196 2326764 2356993 2383856 2423236 2440226 2438991 2473131 2515748 2518830 2549562 2576069
12047B576069k681K2305J2628K7678N2388J9265J3945K6414J8733K2724J0000
$$ 2576069 2573388 2595693 2608321 2635999 2688387 2707652 2721597 2748011 2766744 2789468 2799468
12036B799468J9564M0772K2907K7394J8927K0610O5334J6631j1714M2068L2139
$$ 2799468 2819032 2859804 2882711 2910105 2929032 2949642 3014976 3031607 3019893 3061961 3094100
12025C094100K1485L0789M6544M5467K4479L8638J7331L4259M0411M1907M1398
$$ 3094100 3115585 3146374 3192918 3238385 3262864 3301502 3318833 3353092 3393503 3435410 3476808
12014C476808K7254J4062L2638L6292L4409J7258J1707M3596M1769M9479L1578
$$ 3476808 3504062 3518124 3550762 3587054 3621463 3638721 3650428 3694024 3735793 3785272 3816850
12003C816850L6482M4126K7005M2158N9276L3134L0916M7548M8044N0189M9439
$$ 3816850 3853332 3897458 3924463 3966621 4025897 4059031 4089947 4137495 4185539 4235728 4285167
11992D285167L7711O2025L345N8154J02963Q8066L6195M0588P9379O0059M4358
$$ 4285167 4322878 4384903 4388248 4446402 4549365 4637431 4673626 4714214 4793593 4853652 4898010
11981D898010M6198N7495M9223M6398O532N0795P3725M2162L8698O6757M4980
$$ 4898010 4944208 5001703 5050926 5097324 5103856 5154651 5228376 5270538 5309236 5375993 5420973
11970E420973O1800O7723Q1196O6660M8220N7249P2405P5405O3467R0864P4081
$$ 5420973 5482773 5550496 5631692 5698352 5746572 5803821 5876226 5951631 6015098 6105962 6180043
11959F180043M4278M1092O2099N7365R1465N1651Q6903P0022M8102O9935J01634
$$ 6180043 6224321 6265413 6327512 6384877 6476342 6527993 6614896 6684918 6733020 6802955 6904589
11948F904589P3174M7550Q7882J00563P2973Q3186Q3742O7386R4020R3926J08602
$$ 6904589 6977763 7025313 7113195 7213758 7286731 7369917 7453659 7521045 7615065 7708991 7817593
11937G817593J02970J01892Q7951R0084P7075P2983P2118O8159P6942R7828R5930
$$ 7817593 7920563 8022455 8110406 8200490 8277565 8350548 8422666 8490825 8567767 8665595 8761525
11926H761525Q8284Q6191P6083J13550J32036J23988J08483Q4601Q1044P3472
$$ 8761525 8849809 8936000 9012083 9125633 9257669 9381657 9490140 9574741 9655785 9729257
11916I729257N7391Q8268Q3634J06773R1815P5138M7484O4938J15477J00802J03647
$$ 9729257 9786648 9874916 9958550 10065323 10157138 10232276 10279760 10344698 10460175 10560977 10664624
11905A0664624J13280Q9769R9325J11155R2706Q4756P5638P1577Q4967Q5251Q1241
$$ 10664624 10777904 10867673 10966998 11078153 11170859 11255615 11331253 11402830 11487797 11573048 11654289
11894A1654289R3507J00065P7484N8727N8103P5264O1247O5410P1198L1564L8468
$$ 11654289 11747796 11847861 11925345 11984072 12042175 12117439 12178686 12244096 12315294 12346858 12385326
11883A2385326N2643M6568N4959L9109N2359P3161N5088P4792M3266K7375J7307
$$ 12385326 12437969 12484537 12539496 12578605 12630964 12704125 12759213 12834005 12877271 12904646 12921953
11872A2921953J9023L2706K4822K4457J1093J7495J5515J1158n48K2166q267q331
$$ 12921953 12940976 12973682 12998504 13022961 13034054 13051549 13067064 13078222 13077674 13099840 13091573 13083242
11860A3083242j793q772j9803k8303j3536m2585l0604q647l2389n2749o1340k5355
$$ 13083242 13081449 13072677 13052874 13024571 13011035 12968450 12937846 12929199 12896810 12844061 12782721 12757366
11848A2757366k6927l7810q8415q4629l9033m2541l3952q2789o0023o0224o1015
$$ 12757366 12730439 12692629 12604214 12519585 12480552 12438011 12404059 12321270 12261247 12201023 12140008
11837A2140008p9065q0058q4401q3509o0780r2727p6975p6929o9002j06465q7820
$$ 12140008 12060943 11980885 11896484 11812975 11752195 11659468 11582493 11505564 11436562 11330097 11242277
11826A1242277p3451p9533q8416q6146p6722j29012j09987r4035j04283r0980
$$ 11242277 11168826 11089293 11000877 10914731 10838009 10708997 10599010 10504975 10400692 10309712
11816A0309712q1573q0748p0968r1644r9447j04222r9456j03598p4716m6617r6684
$$ 10309712 10228139 10147391 10076423 9984779 9885332 9781110 9681654 9578056 9503340 9456723 9360039
11805I360039j02508q8870q6516j08360j18599j09517q1103p9622j03374j00544
$$ 9360039 9257531 9168661 9082145 8973785 8855186 8745669 8664566 8584944 8481570 8381026
11795H381026p1382q3882q6300j26506r3725n0992p4812r3997q5084n4408k9275
$$ 8381026 8309644 8225762 8139462 8012956 7919231 7868239 7793427 7699430 7614346 7559938 7530663
11784G530663j01500j17229r5228o0467p4262j11230q5801m9940o7440q8293p0770
$$ 7530663 7429163 7311934 7216706 7156239 7081977 6970747 6884946 6835006 6767566 6679273 6608503
11773F608503o0853q8836q0277m1465m7139o2572q9336o7825n5039o7722q7551
$$ 6608503 6547650 6458814 6378537 6337072 6289933 6227361 6138025 6070200 6015161 5947439 5859888
11762E859888n3562o3074n5608p4110n9115m8424q5423q7996o3399n3710n1456
$$ 5859888 5806326 5743252 5687644 5613534 5554419 5505995 5420572 5332576 5269177 5215467 5164011
11751E164011o2591m1665n4477o6529p0298n9918n6203n2452m3245k5192m0681
$$ 5164011 5101420 5059755 5005278 4938749 4868451 4808533 4752330 4699878 4656633 4631441 4590760
11740D590760o4577o1759o9900j4238q236k8389n4678o5150n8689p0333k3693
$$ 4590760 4526183 4464424 4394524 4380286 4372050 4343661 4288983 4223833 4165144 4094811 4071118
11729D071118l8702n9705k1603m3805m0601m6692n1798r282j6892l7688m1185
$$ 4071118 4032416 3972711 3951108 3907303 3866702 3820010 3768212 3758930 3742038 3704350 3663165
11718C663165l1860l4193o2155l2313m2811j3872j711m0070p3442j2624l5n2664
$$ 3663165 3631305 3597112 3534957 3502644 3459833 3445961 3444250 3404180 3330738 3318114 3318079 3265415
11706C265415n3881m3792l7152n1193n0114j582j2068m0481q049k1075l4749m0957
$$ 3265415 3211534 3167742 3130590 3079397 3029283 3027701 3015633 2975152 2967103 2946028 2911279 2870322
11694B870322k0150k4004j8163l1958m6847k3734k922l1396m4850l0331j3963
$$ 2870322 2850172 2826168 2808005 2776047 2729200 2705466 2702544 2671148 2626298 2595967 2582004
11683B582004l1408l517o070l3307l4717p5j0354j9200l0781k9118k9512l36r503
$$ 2582004 2550596 2547079 2541009 2507702 2472985 2472910 2462556 2443356 2412575 2383457 2353945 2353609 2344106
11670B344106n9673m0639j0089j6824j5212k9171k878k3023k5304L286k7350j6882
$$ 2344106 2284433 2243794 2233705 2216881 2201669 2172498 2169620 2146597 2121293 2124579 2097229 2080347
11658B080347J6278K2623p549k3626m3340k0715p274j6844m5198l133j4818k1193
$$ 2080347 2096625 2119248 2111699 2088073 2044733 2024018 2016744 1999900 1954702 1951569 1936751 1915558
11646A915558q533J3026k0842L571j4570m6202m1895j7199M175r225j5395J4991
$$ 1915558 1907025 1920051 1899209 1902780 1888210 1842008 1800113 1782914 1787089 1777864 1762469 1777460
11634A777460J8506m7326o1332j2880m033J7737r498k0854K18l4699k2099j3174
$$ 1777460 1795966 1748640 1687308 1674428 1670395 1688132 1678634 1657780 1657998 1623299 1601200 1588026
11622A588026J0352j1449k0077k5066p403k6652j4987j0320M603Q529j7173j7561
$$ 1588026 1598378 1586929 1566852 1541786 1534383 1507731 1492744 1482424 1487027 1495556 1478383 1460822
11610A460822m0159k1593j6967j0071k9384j8891K065K056J0310o385J2602m552
$$ 1460822 1420663 1399070 1382103 1372032 1342648 1323757 1325822 1327878 1338188 1331803 1344405 1339853
11598A339853p810j1216J2504J2841k0543l7843r998q501j0005j8625k5364K492
$$ 1339853 1332043 1320827 1333331 1346172 1325629 1287786 1277788 1269287 1259282 1240657 1215293 1217785
11586A217785M477k8044k4390p398J7346n04k8437J5504L45j2979k6456j1450
$$ 1217785 1222262 1194218 1169828 1162430 1179776 1179272 1150835 1166339 1166684 1153705 1127249 1115799
11574A115799J2408j4415j604J862L1k2456m341l031k160j0203k8106r219Q337
$$ 1115799 1128207 1113792 1112188 1114050 1114081 1091625 1087284 1084253 1082093 1071890 1043784 1034565 1042902
11561A042902J6093J9401j2876l1707j8061r1M524k4170j2487J3012l3828k7805
$$ 1042902 1058995 1078396 1065520 1033813 1015752 1015661 1020185 996015 983528 996540 962712 934907
11549I34907k9969J3017J9317K059p283J7252J0569j3513k1554k0009k2667M26
$$ 934907 904938 917955 937272 939331 932048 949300 959869 946356 924802 904793 882126 882552
11537H82552j3356j7469o188N419j127J9726L4700o113k4138r745k1574n539j9525
$$ 882552 869196 851727 845539 850958 849831 869557 904257 898144 874006 864261 842687 837148 817623
11524H17623j4277p34J8728J8025M558l5783l4244r756J3293R76L432m698K2766
$$ 817623 803346 802612 821340 839365 843923 808140 773896 764140 777433 778409 781841 777143 799909
11511G99909K244j485Q014j2083R249j4583j7587L245k658j4444J8522j8792j5383
$$ 799909 802153 800668 808682 796599 805848 791265 773678 776923 774265 759821 778343 759551 744168
11498G44168o035j6850k8266L419j9654k2550J5736K3032r573k3974R037q012
$$ 744168 738133 721283 693017 696436 676782 654232 669968 693000 683427 659453 668490 660478
11486F60478k266j895O746K2078n575j2116j4193l0061k0804j4612K4112J5956
$$ 660478 658212 656317 663063 685141 679566 667450 653257 623196 602392 587780 611892 627848
11474F27848m824r262j0977k299Q77j7294j8606O752n836L4334K7358l4234m484
$$ 627848 623024 613762 602785 600486 601363 584069 565463 572215 566379 600713 628071 593837 589353
11461E89353p711m066m949J6493J0187l2300j2163L590L9917K9004m9214k7462
$$ 589353 581642 577576 572627 589120 599307 567007 554844 558434 598351 627355 578141 550679
11449E50679N423N273Q796k182j2861j7213l5171j8240J1835Q831N699K305n213
$$ 550679 556102 561375 570171 567989 555128 537915 502744 484504 496339 505170 510869 513174 507961
11436E07961q5K7906j7206k3195K493j1856j4682N54K3000Q302J1277m386k262
$$ 507961 507876 535782 518576 495381 497874 486018 471336 471890 494890 503192 514469 510083 507821
11423E07821j4791j4456k420l1j1221q221J4687J0626q894L105j810j8224K2398
$$ 507821 493030 478574 476154 476123 464902 456681 471368 481994 473100 476205 474395 456171 478569
11410D78569J422j5624p058r396j1871p957q47K3414P896J1222j1709k1983q356
$$ 478569 479991 464367 457309 447913 436042 428085 427238 450652 458548 469770 458061 436078 427722
11397D27722Q393j9347k352l997K2558j974J5205O495O917L701P459j2061l5177
$$ 427722 436115 416768 414416 410419 432977 431003 446208 452703 459620 463321 470780 458719 423542
11384D23542k2652J3228P52l064j6750l5350j8555M469J9424J8905J5914l914
$$ 423542 400890 414118 414870 411806 395056 359706 341151 345620 365044 383949 399863 395949
11372C95949L5824J5691l2617k482N516Q692R963R947J764k8621k9501k7475j5943
$$ 395949 431773 447464 414847 412365 417881 426573 436536 446483 448247 419626 390125 362650 346707
11359C46707J164p314j4705J9577k681j3044p875J3606L0095j9733k1771Q364
$$ 346707 347871 340557 325852 345429 342748 329704 321829 335435 365530 345797 324026 332390
11347C32390r988J487j0582j2564N86J1188J6379K9096M9249K1794k0404n8794
$$ 332390 322402 323889 313307 300743 301329 312517 328896 357992 407241 429035 408631 349837
11335C49837j9606K5503k1496l4403j6119J2855J3883P629J904l4548j0930j3242
$$ 349837 330231 355734 334238 299835 283716 296571 310454 318083 319987 285439 274509 261267
11323B61267J5588K2792N0872J4833k6629k4711k1342l5899o13L0489P350r790
$$ 261267 276855 299647 350519 365352 338723 314012 292670 256771 256158 286647 293997 284207
11311B84207j1320O628K0215K707N982k2742k0742L0899J0464k2309k6639J5133
$$ 284207 272887 279515 299730 302437 308419 285677 264935 295834 306298 283989 257350 272483
11299B72483O283j697j2242N092N162k630K904N157K7228n45N386m144P037l799
$$ 272483 278766 277069 264827 269919 275081 272451 275355 280512 307740 307195 312581 308437 315474 311675
11285C11675K918j8137l142J2574M733k9513k9965j5139K597J7893K5739l823
$$ 311675 314593 296456 293314 305888 310621 281108 251143 236004 238601 256494 282233 278410
11273B78410J986l274l6276q777n831L955K0857J1245K7475L0064j7737K25L150
$$ 278410 280396 277122 240846 232069 226238 230193 251050 262295 289770 319834 302097 302322 305472
11260C05472k8138l0820j7738P010K0778K8212p594k7281k8739q982K2406P482
$$ 305472 277334 246514 228776 235786 256564 284776 277182 249901 221162 212180 234586 242068
11248B42068l3634L587J7135Q784q810J8214J9601l8617k4633J4827J6533J6285
$$ 242068 208434 212021 229156 237940 229130 247344 266945 228328 203695 218522 235055 251340
11236B51340R364J0243k1798k6341q208j1005J925k439J9097N686m2362Q15K8538
$$ 251340 260704 270947 249149 222808 214600 203595 205520 203081 222178 227864 185502 186317 214855
11223B14855P384j3327K952J0348L7756M926j62k361j7901n708o08M236j6065
$$ 214855 222239 208912 211864 222212 259968 264894 264732 262371 244470 238762 238154 242390 226325
11210B26325k8721j0544M317L250o120k034J5079M588k7945p976Q026j668J6616
$$ 226325 197604 187060 191377 194627 188507 186473 201552 206140 178195 170219 178245 176577 193193
11197A93193P093j1968k2734P318J3772j536j1244l5407K4166k248J2398J5354
$$ 193193 200286 188318 165584 172902 186674 185138 173894 138487 162653 160405 172803 188157
11185A88157j8815k5539J3508J415R932J535n46L704J3719j0325r212j2422J2850
$$ 188157 169342 143803 157311 158726 168658 170193 169647 173351 187070 176745 167533 155111 167961
11172A67961M677j4256J5629J4306p206k4557k4171R80K050q0Q660J9310j0535
$$ 167961 172638 158382 174011 188317 181111 156554 132383 133363 135413 135333 143993 163303 152768
11159A52768Q9J03J8772J5081l134m922j7360j3572k8583Q714M846J2474L8428
$$ 152768 152857 152960 171732 186813 183679 178757 161397 147825 119242 127956 132802 145276 183704
11146A83704J1190m92k2802k6136J1951q17J2749J259J2279j5790j6212P921M032
$$ 183704 194894 194402 171600 145464 157415 156598 169347 170606 182885 167095 150883 158804 162836
11133A62836l5482m4896j3780J1056j0456L568R542J6330L6770K4390l1474q799
$$ 162836 127354 82458 68678 79734 69278 72846 82388 98718 135488 159878 128404 119605
11121A19605J4322k702k4581k4105l013J9270K1361L6246k0391k0440L3358J0646
$$ 119605 133927 131225 106644 82539 79526 98796 120157 156403 136012 115572 148930 159576
11109A59576r983o638J0329k2430j1854r18K2831j2451k407L168J777l893n618
$$ 159576 149593 142955 153284 130854 119000 118082 140913 128462 126055 129223 131000 127107 121489
11096A21489l743J2480j1550p183K008m434J0811r473K0181o332J0588j389N467
$$ 121489 117746 130226 118676 111493 113501 109067 119878 110405 130586 124254 134842 133453 138920
11083A38920j6565J2544l539Q779L910K5906k4902l215K813K1995l97L510K40
$$ 138920 122355 134899 131360 140139 144049 169955 145053 141838 144651 166646 166249 169759 169999
11070A69999P796J2517L948J1930J5796p267J3993k0173k1424j6078k6858j4680
$$ 169999 177795 190312 194260 206190 221986 214719 228712 208539 187115 171037 144179 129499
11058A29499m422Q261O793m13j9259j7411l223k4078K7068Q089j6239K4751J9425
$$ 129499 125077 133338 140131 139718 120459 103048 99825 75747 102815 110904 94665 119416 138841
11045A38841j0165L333q018N641K613p499k1244j9788J4180J8982l091K218L3111
$$ 138841 128676 132009 123991 129632 132245 124746 103502 83714 97894 116876 113785 116003 149114
11032A49114o718l5239K0471k468k8884l96J432l588q080P86J2612K3449k845
$$ 149114 142396 107157 127628 125160 96276 95880 97312 93724 85644 86430 99042 122491 119646
11019A19646O596J98q654j8686j0577m2592p11K1104J5411K8010j7594j6959j789
$$ 119646 126242 126440 117786 99100 88523 45931 45220 66324 81735 109745 92151 75192 73403
11006G3403j1089J9302K5293r18n391j2396J3210J5455M4593j8819l0684j3364
$$ 73403 62314 81616 106909 105991 100600 88204 101414 116869 161462 142643 111959 98595
10994I8595K471Q713K4333K30k8090o678l087J7608n15J4204O514n508J2662J2121
$$ 98595 101066 109779 134112 134342 106252 99574 96487 114095 113580 127784 134298 128790 141452 153573
10980A53573J1601j8788j5907j6413j1300K7109J0558j2912j1222k1126k7793
$$ 153573 165174 146386 130479 114066 102766 129875 140433 127521 116299 95173 67380
10969F7380J2092K7887J3529j4148L1815k1356l5063j4963J6009P172l7372K2330
$$ 67380 79472 107359 120888 106740 138555 117199 82136 67173 83182 90354 52982 75312
10957G5312M821r021K3890L2804q52j2364L3898l072k0846j6970j9492M702N369
$$ 75312 80133 71112 95002 127806 126954 114590 148488 145416 124570 107600 88108 92810 98179
10944I8179k3422k8333j0078J8247q135k398n102p302K4148M2207K9782M101q558
$$ 98179 74757 46424 36346 54593 46458 44060 38958 31656 55804 98011 127793 131894 123336
10931A23336k1116q38r83J5127J2384j5363j1918R705j3447j4665N16m881j5950
$$ 123336 102220 101382 100399 115526 127910 112547 100629 110334 96887 82222 82738 77857 61907
10918F1907J0574J0161K7688J2369k0451j1054j7467O385L576K7905L492k5114
$$ 61907 72481 82642 110330 122699 102248 91194 73727 80112 83688 111593 115085 89971
10906H9971J428J7669r27j1158j5698o604Q116M682J0693J1859l7252k0255J7063
$$ 89971 91399 109068 108141 96983 81285 74681 82797 87479 98172 110031 72779 52524 69587
10893F9587J8172J2567j7327j4288j3798o09L0499K0937k9918j2826J0248j0530
$$ 69587 87759 100326 82999 68711 54913 54304 84803 105740 75822 62996 73244 62714
10881F2714m494J0746Q614k8456j1874J7945l973Q524k0576k8631R580J9412M286
$$ 62714 58220 68966 77580 49124 37250 55195 51222 59746 39170 10539 20119 39531 43817
10868D3817k182J1727K597L165L495K8487P744j7635j5372M134L2664K659O528
$$ 43817 41635 53362 55959 59124 62619 91106 98850 81215 65843 69977 102641 105300 111828
10855A11828l43j7414R364l134q903k6611p025J9573R971o407k6075j4097j138
$$ 111828 111485 94071 103435 100301 91398 64787 57762 77335 87306 80899 54824 40727 39589
10842C9589j0264M687m618K9716M3965J449l5298k8095J0220R766p551j49J6204
$$ 39589 29325 34012 29394 59110 103075 104524 69226 41131 51351 61117 53566 53417 69621
10829F9621l0167j6493m47J3098l223J3415R953J4470k066o902O936J4023R067
$$ 69621 39454 22961 22514 35612 32389 45804 55757 70227 68161 61259 68195 82218 91285
10816I1285l0691j8891k564J351L776J7661R606j4882J1609K5073p160p187q969
$$ 91285 60594 41703 39139 40490 44266 61927 71533 56651 68260 93333 86173 78986 70017
10803G0017J0992J0466N78J4447j4496k0668j3782n510R685M51Q596J7275k6306
$$ 70017 81009 91475 92053 106500 92004 71336 57554 52044 61729 62180 70776 88051 61745
10790F1745L110K6350l9868q160K3427J7564P588O781L182l3188k6914J7774J951
$$ 61745 64855 91205 51337 43177 66604 84168 91756 98537 101719 68531 41617 59391 61342
10777F1342k4983N832K4395K1713r521j1207J27j9926m930r102P383L191L3423
$$ 61342 36359 42191 66586 88299 78778 67571 67698 47772 42842 33740 41123 44314 77737
10764G7737J9096k950j6885J2842l427l2055m3562j3533K4522K8894J9220L9815
$$ 77737 96833 93883 76998 89840 86413 54358 10796 -2737 21785 50679 69899 109714
10752A09714k1838k7806L683J5967R756j872K886l39j9699J0485j8919j0458k7749
$$ 109714 87876 60070 63753 79720 89476 87604 90490 90151 70452 80937 62018 51560 23811
10739B3811J0933J5660N847j1663n643J573k5384O88Q787o560J1960M389J3986
$$ 23811 34744 50404 56251 44588 38945 40518 15134 15822 24609 18049 30009 34398 48384
10726D8384p967k9706j670J0965j3695N14M2824L9836q197k1203J3823K3833k4677
$$ 48384 40417 10711 9041 20006 6311 6825 49649 89485 81288 60085 73908 97741 73064
10713G3064k1073k3830q99j3997K9770P714j8843k3386J2190K4287r355k1493
$$ 73064 51991 28161 27262 13265 43035 50749 31906 8520 20710 44997 35642 14149
10701A4149j8801L4329J6935j0639K910p729k0333k703K9019J3632j6863j0430
$$ 14149 -4652 29677 46612 35973 38883 31154 10821 8118 37137 50769 33906 23476
10689B3476r845j406N474J2110j5975n154O133Q652j1134j0993k3934k4224M1660
$$ 23476 13631 12225 17699 29809 13834 8680 14813 23465 12331 1338 -22596 -46820 -5160
10676e160L7488q155k5393K59o707j0604K9590j3732K601K7322k0379k5519p700
$$ -5160 32328 24173 -1220 -961 -7668 -18272 11318 -2414 187 27509 7130 -18389 -26089
10663b6089K8036J4376K7827J132j2976N11J708M914J086j2623L568K7228O397
$$ -26089 1947 16323 44150 45282 32306 32817 34525 39439 40525 27902 31470 58698 65095
10650F5095J8597p045l0528k838j1181m507q066K0682Q948j22j7156K038M336
$$ 65095 83692 76647 46119 43281 32100 27593 19527 40209 49157 49035 31879 33917 38253
10637C8253J0115J3539L125j6144k8232l6986J0474J6198K202k7976J9833M1777
$$ 38253 48368 61907 65032 48888 20656 -16330 -5856 10342 12544 -15432 4401 46178
10625D6178K6125J4135k7700k1055j8178R570j3449k950L076r470K3659r881r30
$$ 46178 72303 86438 58738 37683 19505 29075 15626 12676 15752 6282 29941 20060 19130
10612A9130J4696O648o062J7724N080J132j5731o708M859J6088r045Q959R35j0313
$$ 19130 33826 40474 34412 52136 57216 58348 42617 35909 40768 56856 47811 56770 57705 47392
10598D7392q293M479p67K3280j7228k583j6801o153M769k0259k795K3551K0289
$$ 47392 39099 43578 42811 66091 48863 46280 29479 23326 28095 7836 5041 28592 48881
10585D8881J6324Q354k8478j038Q933j7799l363K695n268K2305P386j6895p424
$$ 48881 65205 73559 45081 44043 52976 35177 31814 34509 29241 51546 58932 42037 34613
10572C4613p478n811N771l0109j209M600M428n197K739L9185K4588k6170l7415
$$ 34613 27135 21324 27095 -3014 -4223 377 4805 -392 2347 41532 66120 39950 2535
10559B535R205Q511o713K0501r595l0572J0841q936O384N706K4006J6420J5868
$$ 2535 11740 20251 13538 34039 24444 -6128 4713 -4223 2161 7867 31873 48293 64161
10546F4161K2977n314l1002q637O892p991o409K3685J685J35R548J324p521m630
$$ 64161 87138 81824 50822 42185 49077 41086 34677 58362 60047 60182 69730 71054 63533 58903
10532E8903j6513j4391M0492M5152N88N385j0995l344J0084R336J5001j736j0623
$$ 58903 42390 27999 68491 113643 114231 119616 108621 105277 115361 124697 139698 137962 127339
10519A27339l0855l4029p503m473j6345k500J8295K1648j8382j2634L0290J9286
$$ 127339 96484 62455 54952 50479 34134 31634 49929 71577 53195 40561 70851 90137
10507I0137l9054m0519j6180L4715K9138K39P795n726j61J2282k8710K261K4392
$$ 90137 51083 10564 -5616 29099 58237 58476 66271 60545 60384 72666 43956 46217 70609
10494G0609O231k6303k8059Q804O972J3036N444j0170o607K1123J1729J9755p816
$$ 70609 76840 50537 22478 31282 38254 51290 56734 46564 39957 61080 72809 92564 84748
10481H4748l8502j3169q82k3781J3345K249p482k2635L301k820o634n1K961N353
$$ 84748 46246 33077 32195 8414 21759 24008 16526 -6109 -2808 -5628 -12262 -12313 -9352 -3999
10467c999j1735o675J9491j7089K0655L824l0733k3709J9342K7460l654K2352
$$ -3999 -15734 -22409 -2918 -20007 648 4472 -26261 -49970 -30628 -3168 -6822 15530
10455A5530K9677q471k4174O614k139J7451N966N063r354k2269j0537K4433p835
$$ 15530 45207 36736 12562 19176 17037 34488 40454 45517 36163 13894 3357 27790 19955
10442A9955j1349K1426K330O491j3037p813J2190J9036j3108k2984j9291j8183
$$ 19955 8606 30032 32362 38853 25816 18003 30193 49229 36121 13137 -6154 -24337
10430b4337O691L5783K3838N836j315k1569l6785l6440L602J6335k1094K4203
$$ -24337 -17646 18137 41975 47811 46496 24927 -11858 -48298 -44696 -28361 -49455 -25252
10418b5252J0359J1738J2550L812J0245J0100q900p608k4117l8N074L2602J1491
$$ -25252 -14893 -3155 9395 13207 23452 33552 24652 17044 -7073 -7111 -2037 30565 42056
10405D2056j2237P203R907k7842k4744J3587J8108K2596K517k1233j631J7005
$$ 42056 29819 37022 46929 19087 -5657 7930 26038 48634 51151 29918 28287 45292
10393D5292l070k6097j8214J1964j1427J375J5867j1008j6907J0557j2465K2542
$$ 45292 42222 16125 -2089 9875 -1552 -177 15690 4682 -12225 -1668 -14133 8409
10381H409K8381K1643l687J3902o032q393K830r337j8297L590j8375J415L946
$$ 8409 36790 58433 54746 68648 62616 54223 57053 47716 29419 33009 14634 16049 19995
10368A9995K3223j135k0932k4197M835j1205K7039M221j2722m335j9960P606L5219
$$ 19995 43218 42083 21151 -3046 1789 -9416 17623 21844 9122 4787 -15173 -7567 27652
10355B7652L102J4603K7681j4670l5619r689K5110j1684j4494j3095m831K8843
$$ 27652 30754 45357 73038 58368 22749 13060 38170 26486 11992 -1103 -5934 22909
10343B2909K2551Q849m236k0887j1754L3685k306j0551j6906J5735j64Q125K2246
$$ 22909 45460 54309 50073 29186 17432 51117 48811 38260 21354 37089 36925 45050 67296
10330F7296o123j8332j036j2025q331J8202J4944m0652j2653K589K018j4767L795
$$ 67296 61173 42841 41805 29780 21449 39651 54595 13943 1290 3879 5897 -8870 -5075
10317e075N856J7806K4550N519K1006P983l318j8293J769P912q091n364l4131
$$ -5075 781 18587 43137 48656 69662 77645 74327 56034 57803 65715 57624 52260 18129
10304A8129r874j7327L2878K4170k3459q522n285l896J8202l275k5834J1367o99
$$ 18129 8255 -9072 23806 47976 24517 15995 10710 6814 25016 21741 -4093 7274 6575
10291F575Q112Q486K1882K7842j2364K7216k647J2648K1921r696k0216j640k544
$$ 6575 14687 23173 45055 72897 60533 87749 85102 97750 119671 109975 89759 88119 85575
10278H5575l8049k0715P38l533K7848m569j8136j2189j0973r338p663K9967N836
$$ 85575 47526 26811 27549 24016 51864 47295 29159 16970 5997 -3341 -11004 18963 24799
10265B4799N645l393P33M906k6933j864L322j0461o218R238L536j5187o416J000
$$ 24799 30444 27051 27784 32690 5757 3893 7215 -3246 -9464 -226 3310 -11877 -18293 -17293
10251a7293K6436J1065J2869j1139k2127k55l181j8038l568J6203K5079J4806
$$ -17293 9143 20208 33077 21938 -189 -444 -3625 -21663 -25231 -9028 16051 30857
10239C0857p23J4442k2439j2688K8698K2580l3407j0901K1253N01j5131m491j0045
$$ 30857 30134 44576 22137 9449 38147 60727 27320 16419 37672 38173 23042 18551 8506
10226H506L368M191M454J0375j4820L362j7046N932p739j5418q673K1842j766
$$ 8506 11874 16065 20519 30894 16074 19436 2390 8322 583 -14835 -23508 -1666 -3432
10213c432j6520J5283r314j7613J8879k913K684P297J6301j2633j5839j2735J0722
$$ -3432 -19952 -4669 -13983 -31596 -12717 -15630 -12946 -5649 10652 -1981 -17820 -30555 -19833
10200a9833l927j567M975K6346K8321K8268j5578r264j0929P932j7815n568J9630
$$ -19833 -23760 -25327 -20352 5994 34315 62583 47005 37741 26812 34744 16929 11361 30991
10187C0991j853k7805j1930J4450K7991Q826j9176l508M1499j8579k6518k4910
$$ 30991 29138 1333 -10597 3853 31844 40670 21494 17986 59485 40906 14388 -10522
10175a0522K419L6333K2293n636L3879L0572K738o898J6317K710m644j9772j7806
$$ -10522 -8103 28230 50523 44887 78766 109338 112076 105178 121495 124205 119561 99789 81983
10162H1983p109p813j1084j2673j6809j8791j5903L711J9055L7326r810k5329
$$ 81983 74874 67061 55977 43304 26495 7704 -8199 -4488 14567 51893 42083 16754
10150A6754j5281j4574K1704J0706J5963k4500j0984J1604j2258J9357R635J5742
$$ 16754 1473 -13101 8603 19309 35272 10772 -212 11392 -866 18491 28126 43868
10138D3868j2530j6170p195O612J3129R917P798m772j8104p652k5888K4782J4963
$$ 43868 31338 15168 7973 14585 27714 37631 45429 40657 22553 14901 -10987 13795 28758
10125B8758r101j5421J4543P821J4472j944j1469l4879K185r47N751J7798K3043
$$ 28758 19657 4236 18779 26600 41072 39128 27659 -7220 -5035 -5982 -231 17567 40610
10112D0610j1577m955J895j1393p317k1628L814j3833m887N010M610J9131J833
$$ 40610 29033 24078 25973 14580 7263 -14365 -10551 -24384 -29271 -24261 -19651 -520 1313
10099A313Q603q60k4510o957M423j3376Q966M0359l66j9908J4568m169m905j3042
$$ 1313 9916 9056 -15454 -22411 -17988 -31364 -22398 17961 17595 -2313 12255 8086 3181 -9861
10085i861k581J5573M156J94P218o61l933j4606m102L9167J472j1883L748k9473
$$ -9861 -12442 3131 7287 7481 14699 14038 10105 -4501 -8603 30564 32036 20153 23901 -5572
10071e572J961p727j5779m720L514J935N430K2367k901L152p694n703J9492J1626
$$ -5572 -3611 -11338 -27117 -31837 -28323 -26388 -20958 1409 -1492 1660 -6034 -11737 7755 19381
10057A9381k6914j3083L7260J5907k7094P649J4425M419m571K122n126k8190J406
$$ 19381 -7533 -20616 16644 32551 5457 13106 27531 31950 27379 29501 24375 -3815 -2409
10044b409R138R890O492J5437N675l1351l638K238P084p680P51k4034j7032l182
$$ -2409 6729 16619 23111 38548 44223 12872 9234 11472 18556 10876 11627 -12407 -29439 -32621
10030c2621L453J7132K3566L490q273m1915q421J3216J3383L3421K2523l102q306
$$ -32621 -29168 -12036 11530 15020 6747 -35168 -43589 -30373 -16990 16431 38954 35852 27546
10017B7546K536q785j9805p195N909k2700k901P207J7585J6463J9306M727j880
$$ 27546 30082 21297 1492 -5703 206 -22494 -25395 -18188 -603 15860 35166 39893 38013
10004C8013j2123M97j8829j0983m65J6907J6010J6267j1672k1788k058R377k2346
$$ 38013 25890 26387 7558 -3425 -3890 13017 29027 45294 33622 11834 9776 19153 -3193
9991c193l5454J884J6564l622N36K2640j4056j2988O108K3530L142J88P949j0940
$$ -3193 -38647 -36763 -20199 -23821 -23285 -645 -14701 -27689 -21581 1949 5091 5279 13228 2288
9977B288K830J1561n713l992L039L2753O283j356o810k9655j9871J5653J5677
$$ 2288 5118 16679 10966 6974 10013 42766 49049 47693 40883 11228 -8643 7010 22687
9964B2687K7379J1650l748q253j887l7614j8406J7885J500J1665J663N662m751
$$ 22687 50066 61716 57968 49715 47828 10214 -8192 9693 11193 22858 24521 30183 25432
9951B5432J7934k528q45p256J4310k196K4913J3415k1829l4918r645J7249K6995
$$ 25432 43366 40838 39993 32737 47047 44851 69764 83179 61350 26432 16787 34036 61031
9938F1031r257l2652k1259j0935K9352L4411n131r323j9101j503k872K1274q175
$$ 61031 51774 19122 -2137 -13072 16280 50691 45560 36237 17136 15633 12761 34035 25860
9925B5860J4084M317j8580N537Q830M310P324j7808j290L92n755P0P893J068L333
$$ 25860 39944 44261 25681 31218 40048 44358 51682 33874 32584 32976 27221 27291 35184 36252 39585
9910C9585P022M909O082P501j3937j8285K0843K5577J098N791K2738J6765k4161
$$ 39585 46607 51516 57598 65099 51162 32877 53720 79297 80395 86186 108924 125689 101528
9897A01528l2769J0163J4160k9086j7474M3470N0422J2087q811L3477J6342q207
$$ 101528 68759 78922 93082 63996 46522 89992 140414 152501 143690 177167 193509 185302
9885A85302O448j4343P887N2648O3656L1342M8086R3613N2159O9578O8331J17458
$$ 185302 191750 177407 185294 237942 301598 332940 381026 474639 526798 596376 664707 782165
9873G82165J68004K56986M02297N86771Q54827J055710Q92673P0178q66928j030297
$$ 782165 950169 1207155 1609452 2196223 3051050 4106760 4999433 5069611 4202683 3172386
9863C172386q09095o04375m15071k78155k28975j52710j08314q4010n5765o3309
$$ 3172386 2363291 1758916 1343845 1065690 836715 684005 575691 491681 435916 372607
9853C72607m5426l4768l2005k3542j5572j8436J074M552J1282J4943K0905R581
$$ 372607 327181 292413 260408 236866 221294 202858 203932 208484 219766 234709 255614 265195
9841B65195K6664P0902O8814J6790L378N8624J00307J18034K27250M18682P04097
$$ 265195 291859 362761 431575 448365 451743 510367 610674 728708 955958 1374640 2078737
9830B078737J184740J672424J480981M61361p32903j338655j385073j104165p74334
$$ 2078737 3263477 4935901 6416882 6878243 6145340 4806685 3421612 2317447 1543113
9821A543113m70349k77324j74529j06440r9172p7209m5001n5672l7673l3618l0164
$$ 1543113 1072764 795440 620911 514471 415299 338090 293089 237417 199744 166126 135962
9810A35962j8068Q666J8988j3754j3927k3242n584l0986l4226M884J5430p480
$$ 135962 117894 126560 145548 131794 117867 94625 89041 58055 23829 28713 44143 36663
9798C6663J3098M177k0933J799m567O985N283l5721k0292K0030j881p068J7333
$$ 36663 49761 53938 33005 34804 30237 37222 42505 6784 -13508 6522 4641 -2427 14906
9785A4906L36J5733R508k8951r163k95n397K3819j626q695Q318J1017M320J8349
$$ 14906 15242 30975 40483 11532 2369 2074 -3323 20496 18870 10175 18493 29510 33830 52179
9771E2179k3650o556J3581K443L033P990L235j7539j3499L333k3060o147j034
$$ 52179 28529 21973 35554 37997 41030 49020 52255 34716 21217 24550 1490 -4657 -5691
9758e691K0512J0497j331l5174L049K4917L4351J561j187O334p435m2018k6583
$$ -5691 14821 25318 23987 -11187 -8138 16779 51130 52691 51504 57838 50403 8385 -18198
9745a8198J5463j7007k0622J1702J4057K560J8608n550J7825j4592j8099J7076
$$ -18198 -2735 -19742 -40364 -28662 -14605 -12045 6563 1013 18838 4246 -13853 3223
9733C223r056k3462o944K9806J8992j7723q738J8054J2191Q768j3881J577j4526
$$ 3223 -5833 -29295 -36239 -6433 12559 -5164 -13902 4152 16343 25111 11230 12807 -1719
9720a719j3011J0349L580j1574M730L2436j1391l0150k272O474o502j4950O71
$$ -1719 -14730 -4381 -801 -12375 -7645 24791 13400 -16750 -19022 -12548 -19050 -34000 -33329
9707c3329O616Q848M228K2Q726J0534J2026r433l1622j6859R687j390L627J3523
$$ -33329 -26713 -17865 -13637 -13615 -4889 5645 17671 8238 -23384 -40243 -30556 -31946 -28319 -14796
9693a4796J0848L1510j2998l7028J5493L9264j6454j4268R188K6926k5158l1034
$$ -14796 -3948 27562 14564 -22464 -6971 32293 15839 1571 10759 37685 12527 -18507
9681a8507j6383K102P253j4892J5511N597R339K1952J071q128l291l12m863m77
$$ -18507 -34890 -32788 -25535 -40427 -24916 -19319 -9980 11972 13043 4915 1624 1312 -3551 -4028
9667d028R185j2194j4283j3029R154m138k161r10J9336K1621O993o293j3507m644
$$ -4028 5157 -7037 -21320 -34349 -25195 -29333 -31494 -32404 -13068 8553 15546 9253 -4254 -8898
9653h898M993n441K879k586j7094k2577j3834l774k5462p731k253j1383q295J1634
$$ -8898 -3905 -9346 -6467 -9053 -26147 -48724 -62558 -66332 -91794 -99525 -101778 -113161 -121456 -109822
9639a09822M0041K3387P714m837J2880J4093Q353k0477j5664L049J1977K7051
$$ -109822 -69781 -46394 -38680 -43517 -30637 -16544 -8191 -28668 -44332 -41283 -29306 -2255
9627b255P720j9K767J3383Q305K2985k5940l787N056l8004p995k486K2351r924
$$ -2255 5465 5446 8213 21596 29901 52886 26946 23159 28215 -9789 -17784 -20270 2081 -7843
9613g843o333K410j6432M739K0562K3165j8512l9231N43L5049K5785j7120m0263
$$ -7843 -14176 -11766 -28198 -23459 -2897 20268 1756 -37475 -36932 -1883 23902 6782 -33481
9600c3481J0410J2361J9640n254L710j6121J2399p552O14J8864n641m541P475
$$ -33481 -23071 -10710 8930 3676 7386 -8735 3664 -3888 -3274 15590 9949 5408 12883
9587A2883j6179J1109J3243O012N318J1877K3197J2533M915j6985j8276j7531
$$ 12883 -3296 7813 21056 27068 32386 44263 67460 79993 84908 67923 49647 32116
9575C2116j0016j0354l5219j6199l143K2413J8319p433j3775J8047Q791M929j5710
$$ 32116 22100 11746 -23473 -39672 -42815 -20402 -2083 -9516 -23291 -5244 3547 8476 -7234
9562g234k8174l017J7142J90K2141K4218j1039j4587j8546m594J4484k4807p805
$$ -7234 -35408 -38425 -21283 -21093 1048 25266 14227 -360 -18906 -23500 -9016 -33823 -41628
9549d1628n63J0033Q316n524N523k2263j3920J0587j8572j3951J2230J1872L2294
$$ -41628 -42191 -32158 -23842 -29366 -23843 -46106 -60026 -49439 -68011 -81962 -69732 -57860 -25566
9536b5566J6860M800N929R588p362m209k8606O804K466J3288J788L1280P251j7917
$$ -25566 -8706 -3906 2023 11611 4249 40 -28566 -21762 -19296 -6008 -4220 27060 34311 16394
9522A6394j9027m696k2273l474K6554j5571k715J4503J551j1143k6508k6663K0709
$$ 16394 -2633 -7329 -29602 -33076 -6522 -22093 -24808 -10305 -8754 -19897 -46405 -73068 -52359
9509e2359K6619n227M090K9983Q057N528j0512j5793M75P722p253k9214M599K9308
$$ -52359 -25740 -30967 -26877 3106 11163 16691 6179 -9614 -9139 -1417 -8670 -37884 -33285 -3977
9495c977J5747O838m5j2391j0702p91o949r255P86J854j0844K763R364q631j6269
$$ -3977 11770 18608 18563 6172 -4530 -5321 -12270 -21525 -20739 -18885 -29729 -26966 -17602 -26233 -42502
9480d2502J4980O18o93q993j0714M9691J4647N804L001k1664j2040K5233j5784
$$ -42502 -27522 -26904 -27597 -36590 -47304 2387 17034 22838 25839 4175 -7865 17368 1584
9467A584m564N856p043q175j6855J40J4030J2910M410J8378R590K788R563J5593
$$ 1584 -2980 2876 -4167 -12342 -29197 -29057 -15027 -2117 2293 20671 30261 33049 42612 58205
9453E8205k5470k0499L256J7527m169J7070j1981j4649k9578l2049j6469P581
$$ 58205 32735 12236 15492 33019 28850 45920 33939 19290 -10288 -42337 -58806 -51225
9441e1225O342K4417J7921K770L5237j7248l6963k0652k550j0472K1738J7255
$$ -51225 -44883 -20466 -2545 225 35462 18214 -18749 -39401 -41951 -52423 -30685 -13430
9429a3430L0497j6790j1936K4490L378j5318J0704L888l874m6j824J0059L5657
$$ -13430 17067 277 -11659 12831 16209 891 11595 15483 11609 11563 9739 19798 55455
9416E5455J9338l4495k8117p944k0224K7333Q794j1640j3811j8270J5787o531
$$ 55455 74793 40298 12181 4237 -15987 11346 20140 8500 -5311 -23581 -7794 -14325
9404a4325j3910J5672n751j1434k2248K0682K6052L4106K0355J7585l2518j4680
$$ -14325 -28235 -12563 -18314 -29748 -51996 -31314 -5262 28844 49199 66784 34266 19586
9392A9586K0716j4000j7817J1622O20P767r877J1646J595r272j807r6k6986o827
$$ 19586 40302 26302 8485 20107 20727 28494 18617 30263 31858 22586 20779 20683 -6303 -13130
9378a3130K4140K2316J669k2477k3706j527k680j0703J3701j6139j9959K3246
$$ -13130 11010 33326 34995 12518 -11188 -12715 -15395 -26098 -12397 -28536 -48495 -25249
9366b5249l521J3403L808n983P223P136K9241L381k6505l6259J4140Q184Q567
$$ -25249 -28770 -15367 -11559 -17542 -10319 -3183 26058 29439 2934 -33325 -19185 -11001 -2434
9353b434N938k6067L359J3244N606n99J0598K821j4557J2374n217j099j0616j3734
$$ -2434 3504 -22563 -19204 -5960 -354 -953 9645 12466 -2091 10283 5066 3967 -6649 -20383
9339b0383j0271K2707J637M2K7957l54l2218j0953N953k2421P28K6725l23M583
$$ -20383 -30654 -7947 -6310 -6268 21689 21335 -10883 -21836 -15883 -38304 -37576 -10851 -11174 -6591
9325f591O084p287K977j2561j8412j4114Q987J024k1559K1836O756P887p807m020
$$ -6591 -507 -7794 -4817 -17378 -35790 -49904 -40917 -39893 -61452 -39616 -32860 -24973 -32780 -36800
9311c6800O081P689o496K3894K2900m8271l0347K2532Q718K3596P818k8439N705
$$ -36800 -30719 -23030 -29526 -5632 17268 -31003 -61350 -38818 -30100 -6504 1314 -27125 -21420
9298b1420K1592J8735j3255n5707l906L1513J8472J3901J0320j6072m201j292
$$ -21420 172 18907 5652 -50055 -53961 -22448 -3976 9925 20245 4173 -28 -1320
9286a320j240Q161R201j276o236m765j0162k7817n579J1181J1968j285J6649j0293
$$ -1320 -2560 5601 14802 13526 7290 2525 -7637 -35454 -41033 -29852 -17884 -19169 -2520 -12813
9272a2813j1741P654N432R334J5581R294j8125l5465l2128j2030N3888M6116J1045
$$ -12813 -24554 -16900 -11468 -2134 13447 22741 4616 -30849 -62977 -75007 -21119 24997 36042
9259C6042l109M12j1926N45J2437k3841j5702P566M406r660k883J8431o377r361
$$ 36042 32933 33345 21419 21964 34401 10560 -5142 2424 6830 -2830 -5713 12718 6341 -3020
9245c020n414K2928P02k474K0697J598n743j2071k5385L263j5398J246O081n376
$$ -3020 -8434 14494 15196 12722 33419 35017 29274 17203 -8182 -4919 -20317 -19071 -12990 -18366
9231a8366j3066M715Q677j563n22J8096J5162m267p515j8309n91L1262N985K0565
$$ -18366 -31432 -26717 -18040 -19603 -20125 -2029 13133 8866 1351 -16958 -17549 13713 19698 40263
9217D0263k5780k0060p914o428Q272M22M593L823j545p52K5119J5515L271r342
$$ 40263 14483 -5577 -13491 -19919 -11647 -11225 -6632 -2809 -4354 -5106 20013 35528 38799 29457
9203B9457o163O234K44k0555k0491m401j9264J2096J3155j882m551L3728J2565
$$ 29457 23294 29528 29772 9217 -11274 -15675 -34939 -22843 -9688 -11570 -16121 17607 30172
9190C0172J117k6712q069L101K1365L296k1556k5470p705J4937J6462m270K0336
$$ 30172 31289 4577 -3492 -391 20974 24270 2714 -22756 -30461 -15524 938 -3332 17004
9177A7004n840k906J3000K1088K782k6456j6965l490j7671K1253L3528n831n5302
$$ 17004 11164 8258 21258 42346 45128 18672 1707 -1783 -19454 1799 35327 29496 -25806
9164b5806j1795K3832L6266L9916K870o349q249j8210k9460j9865L9027j0425
$$ -25806 -37601 -13769 22497 62413 65283 58934 50685 32475 3015 -16850 22177 11752
9152A1752k6096j2866n019j9539K2861N531L415Q095l035J3749P908M038l990
$$ 11752 -14344 -27210 -32229 -51768 -28907 -23376 -19961 -11866 -14901 -1152 6756 10794 6804
9139F804k755L842j7688R789K4324O202k537k2906L850j8490j0788q491J1490
$$ 6804 4049 7891 -9797 -8 24316 30518 27981 5075 8925 -9565 -20353 -28844 -17354
9126a7354L9015K2163k9022j384p794m838o53j5378j2625J7759J7663r168N884
$$ -17354 21661 43824 14802 13418 5624 786 133 -15245 -27870 -10111 7552 -1616 4268
9113D268k0680j3036o326J5725J5044L632J2053P564k0490r455K3327J50k0767
$$ 4268 -16412 -29448 -35774 -20049 -5005 -1373 10680 18244 -2246 -11701 11626 11776 -8991
9100h991L99N167J6473L750p853q303K6891M682k3765j6146J774K0518L9121J0569
$$ -8991 -8592 -3425 13048 16798 8945 642 27533 32215 8450 -7696 -5922 14596 53717 64286
9086F4286l3928k3383j2686L4226Q469j5505j16l830j6198K3499j2674l0816m829
$$ 64286 30358 6975 -5711 28515 36984 21479 21363 17533 1335 24834 12160 -18656 -23485
9073b3485R739j1450j5323j2852o666J8375K5260L1614o049j5527k790J2743K0270
$$ -23485 -13746 -25196 -40519 -53371 -60037 -41662 -16402 15212 9163 -6364 -9154 3589 23859
9060B3859J1596j7238j5375l3227P464J5470k845k2820k1228K091K4064j2507
$$ 23859 35455 18217 2842 -30385 -22921 -7451 -10296 -33116 -54344 -52253 -28189 -40696
9048d0696q715J2983L3960K4044J62P566j2870M919O344K2663R326l750j0660
$$ -40696 -49411 -36428 -2468 21576 21738 29304 16434 21353 27697 50360 59686 55936 45276
9035D5276l0952q949k0432K3142K7012P219o90k0638k3606l945l43J575Q973o100
$$ 45276 14324 5375 -15057 8085 35097 42316 41626 20988 -2618 -6563 -6906 -5331 3642 -2458
9021b458L5965M516k7661j5326M037p78J8661l2095j4202j1695K2795K7381p723
$$ -2458 33507 38023 10362 -4964 -927 -1705 16956 -15139 -29341 -41036 -18241 9140 1417
9008A417R373J2210l1627l8505J4136K8215j1764J0209R028j946p573j3208J0922
$$ 1417 10790 23000 -8627 -47132 -32996 -4781 -16545 -6336 2692 746 -6827 -20035 -9113
8995i113L4905k27J640r815j588J6914J394j2766o187L8909K2680j8264l2390
$$ -9113 25792 25565 27205 17390 15802 32716 34110 21344 15157 54066 76746 58482 26092
8982B6092j2738r999K59l6696k5881K6967O466N151J4466q246m775L801J22j0028
$$ 26092 13354 3355 3614 -33082 -58963 -31996 -25530 -20379 -5913 -14159 -18934 -15133 -15011 -25039
8968b5039j7046m829J5497J1469q139j427Q216J8696O555R683k1806j540j6862
$$ -25039 -42085 -46914 -31417 -19948 -28087 -29514 -21298 -2602 3953 13636 -8170 -9710 -26572
8955b6572L538R372L7647k4422j2488K1533L224k1901n273j7687j4525J7538K128
$$ -26572 -23034 -13662 23985 -437 -12925 8608 11832 -10069 -15342 -33029 -47554 -30016 -27888
8942b7888J9149M7279l906j1304n804k5985K7973k4500J884k5532j7320J1534
$$ -27888 -8739 38540 34634 23330 17526 -8459 19514 -4986 -3102 -28634 -45954 -34420
8930c4420L369Q967j76Q777N813j3596r053K3418Q383K751r954K350j659r433
$$ -34420 -31051 -22084 -22260 -13483 -7670 -21266 -30319 -6901 1482 4233 -5721 -3371 -5030 -14463
8916a4463k944k832M239m906R87K5046j6110r027J9870O236J876j5556k5334K2374
$$ -14463 -17407 -20239 -16000 -20906 -19919 5127 -10983 -20010 -140 6096 7972 -7584 -32918 -10544
8902a0544K0405P070m293J1695j8083k3379J129J1049l891J0749J1249p796J4987
$$ -10544 9861 16931 12638 24333 6250 -17129 -16000 -4951 -8842 1907 13156 5360 20347
8889B0347k5809k994J4909P944j5323q937J6368L5174R972k1946j7314k9117N465
$$ 20347 -5462 -8456 6453 14397 -926 -9863 6505 41679 51651 29705 12391 -16726 -11261
8876a1261L1728K344j3259m850r939O227j6183l863L816K2613M572j8889J5896
$$ -11261 20467 22811 9552 4702 -5237 990 -15193 -19056 -15240 7373 11945 -6944 8952
8863H952Q800K0284j9699l89n516k0589J1232o301K7404j0060j9098J6263K2153
$$ 8952 17752 38036 18337 17948 12432 -8157 3075 -3226 24178 14118 -4980 11283 33436
8850C3436J423J161O22j5616j0321Q548K6092N153j4075k6856m0752l534K6537
$$ 33436 34859 36020 36642 21026 10705 19253 45345 50498 36423 9567 -31185 -34719 -8182
8837h182K092j0768L2389O127K440j0729k020n402j6933O377M403Q600L4498p928
$$ -8182 -6090 -16858 15531 21658 24098 13369 11349 5947 -10986 -4609 -206 8394 42892 34964
8823C4964j3214r093j359r865k450L623L424k9223J6876J6221m698l606j5774
$$ 34964 21750 12657 11298 1433 -1017 2606 6030 -23193 -6317 9904 5206 1600 -14174
8810a4174K7960L1480l815l0057k013j7115k4684j3515l862p02r501K1124L2690
$$ -14174 13786 45266 41451 11394 9381 -7734 -32418 -45933 -49795 -50497 -59998 -38874 -6184
8797f184o618m401L0177P155J2393J1839j0209p209r428P667O445k3167l9164
$$ -6184 -12802 -17203 12974 20129 32522 44361 34152 26943 17515 25182 31627 8460 -30704
8784c0704l6851K5104K8755J0582J0303Q733K0277M0171O960j6857k1502j5202
$$ -30704 -67555 -42451 -13696 -3114 7189 15922 36199 76370 83330 66473 44971 29769
8772B9769J3434J375j7192k5831J6860L4386L1263O874l3887k5542l6903k5933
$$ 29769 43203 44578 27386 1555 18415 52801 84064 90938 57051 31509 -5394 -31327
8760c1327J551p569P805K9987q720L4470L6765k409j9323O287k980r398j4110
$$ -31327 -29776 -37345 -29540 447 -8273 26197 62962 60553 41230 47517 44537 35139 21029
8747B1029m0861j3736p028Q612K2673K7848N216P841P026J27j0552l383J1147
$$ 21029 -19832 -33568 -40596 -31984 -9311 18537 23753 31594 38620 38747 28195 24812 35959
8734C5959K867J66R217K9042o724k4512j4530O578O703q486J3074M1874p178l7343
$$ 35959 38826 38992 48209 77251 70527 46015 31485 38063 44766 36280 49354 91228 84050 46707
8720D6707j580K0234N596j0837j5763j2555k1935J6153L7262P797q450j0779Q077
$$ 46707 45127 65361 70957 60120 44357 31802 9867 26020 63282 71079 62629 51850 59927
8707E9927m22k5681j4559J9136l377j749j5839j2429N424K1101j2687k1415P673
$$ 59927 59505 33824 19265 38401 35024 33275 17436 5007 10431 31532 18845 -2570 5103
8694E103K7255J4243J836k937k4739J9647M9270J3517l422n777j9799j9006o453
$$ 5103 32358 46601 48437 45500 20761 40408 89678 103195 99773 93996 74197 55191 48738
8681D8738K900L477K6086m587k3928l1549O293K1606l956M280k1963O186M3220
$$ 48738 51638 55115 81201 76614 52686 21137 27430 49036 45080 49360 27397 33583 76803
8668G6803k8455k1514J8692Q594R206J4763J3101j6684N727K162j8877j2247M620
$$ 76803 48348 26834 45526 54120 63326 78089 91190 74506 80233 82395 63518 51271 55891
8655E5891j4098J6801J8319k8158J7649J8215L3384l223J0556J8161J8264K5865
$$ 55891 41793 58594 76913 48755 66404 84619 118003 114780 125336 143497 161761 187626
8643A87626j0213J2017K1173J2770J9766P506N0609J42159K05101K88978M10206
$$ 187626 177413 189430 210603 223373 243139 250645 301254 443413 648514 937492 1347698
8632A347698K30574k00686l95934k85766j79039j29490p4888n9875k4910m669
$$ 1347698 1578272 1377586 981652 695886 516847 387357 312469 252594 227684 223015
8622B23015n1385m9117J0325M1591R220n356L785l9554k0982K8700J8328j5096
$$ 223015 171630 122513 132838 174429 183649 178293 182078 142524 121542 150242 168570 153474
8610A53474k1013R768J8488l586J0443J7990j9334L3089K2088K1805j2159J4830
$$ 153474 132461 142229 160717 157131 167574 185564 166230 199319 221407 243212 231053 245883
8598B45883K4604M0965O8612P4702N2018O4495J24569J98897L00972N56719Q00819
$$ 245883 270487 311452 380064 454766 506784 571279 695848 894745 1195717 1752436 2553255
8587B553255O17975k64442q33279o78274m45383k71909j57557j14183p4192n3306
$$ 2553255 3171230 2906788 2073509 1395235 949852 677943 520386 406203 332011 278705
8577B78705n7385m2166j9189q510k0624l8948L007M521j8261j9547j978j540q395
$$ 278705 221320 179154 159965 151455 130831 91883 94890 99411 81150 61603 59625 58085 49690
8564D9690O174j7724l0405J6749K0617J7141N024j832M089L0551j779J8905J6529
$$ 49690 55864 38140 7735 24484 45101 62242 67266 65434 69523 100074 98295 117200 133729
8551A33729K497K098P654K5332O0467P0771J05689K43836L72163L77041L2593
$$ 133729 136226 138324 145978 171310 231777 302548 408237 652073 1024236 1401277 1433870
8540A433870l84720l61923k46818j56605p1050l1905o2972l1291j3793J4358j4165
$$ 1433870 1049150 687227 440409 283804 212754 180849 117877 86586 72793 87151 72986
8529G2986k6846q767k150l656j6019j0815L1150j5743k0482j1866k3403Q05R148
$$ 72986 46140 37373 35223 31567 15548 4733 35883 20140 -342 -12208 -35611 -34806 -25658
8516b5658K5915j029j8027k545K012J6116L972K4687J2400k8062q058j39k833
$$ -25658 257 -772 -18799 -21344 -19332 -3216 756 25443 37843 9781 1723 1584 -1249
8503a249K6073N992j9012l6306j7447K7965M8101J4808J1385J07l1742j9369J2363
$$ -1249 24824 30816 11804 -24502 -41949 -13984 34117 48925 60310 60417 28675 9306 21669
8490B1669J589n1682o128Q590J6265L9984K7870j9853j0976L189q656m650n138
$$ 21669 23258 -28424 -34552 -25962 -9697 30287 58157 38304 27328 30517 21861 17211 12073
8477A2073j5194Q79j5834j404k1287k883L8329m72J809J6337R299j1458k3851
$$ 12073 -3121 -2242 -18076 -19480 -40767 -43650 -5321 -5793 -3984 12353 21652 10194 -13657
8464a3657N647R078J7928P232K1706o540R384j3869l4245l0524J726J7625J1577
$$ -13657 -8010 1068 18996 26228 47934 41394 50778 36909 2664 -27860 -26134 -8509 3068
8451C068j5490k5155P946K8498j4902n179J3444R742O257J8515Q813J1579n575
$$ 3068 -12422 -37577 -29631 -1133 -16035 -21214 -7770 1972 8229 26744 35557 47136 41561
8438D1561q43J7548l7253j2328J8045p827q750m204l971J120p401j7989J8996
$$ 41561 40718 58266 21013 8685 26730 18903 10153 5949 1978 3098 -4303 -22292 -3296
8425c296J1844K2707K2845j2238j3039k5232n675J2085Q999j731r41K2971j8997
$$ -3296 8548 31255 54100 41862 28823 3591 -2084 10001 19000 17269 16328 39299 20302
8412B0302k3176P530J760L936L126j1955j2838K0126j0297k9317q053k3839j6179
$$ 20302 -2874 4656 6416 10352 13478 1523 -11315 8811 -1486 -30803 -38856 -62695 -78874
8399g8874p35L2228K5346j5594n289R272K1661L886l69N554r76K343L1274q21
$$ -78874 -79609 -47381 -22035 -37629 -42918 -33646 -11985 -8099 -8468 -2914 -3890 -1547 29727 28906
8385B8906k0160K379K870K1508k2867r444p847j772J6244K9655R909o614J3608
$$ 28906 8746 11125 13995 35503 12636 3192 -4655 -6427 9817 39472 49381 42767 56375
8372E6375R836k0942p152J999N116j5022j9150k1909k1894j519j4142R99K2282
$$ 56375 66211 45269 38117 40116 45232 30210 11060 -10849 -32743 -34262 -48404 -47405 -25123
8359b5123J2473K505K4636K5282p437j6806k3149j0291N301p048Q095l658k5444
$$ -25123 -12650 -10145 14491 39773 32336 15530 -7619 -17910 -12609 -19657 -11562 -15220 -40664
8346d0664K717l414J1714n29R295K7603J6321P677n469N423K2521R470j9499o034
$$ -40664 -37947 -41361 -29647 -30176 -20881 6722 23043 30720 25251 30674 53195 62665 43166 37132
8332C7132j1909O270q813j345o421j0369R597k6243l0639L2152j3614p755k3196
$$ 37132 25223 31493 22680 21335 14914 4545 14142 -12101 -42740 -10588 -24202 -31957 -55153
8319e5153N542J4722p991M873o85L3231P939j1123o566q310P44J2676L0534L0544
$$ -55153 -49611 -34889 -42880 -38007 -38692 -5461 2478 -8645 -15211 -23521 -22777 -10101 20433 50977
8305E0977k1347l4458O483J9118n950J1389j328l3308J1931M0463J0834l3831
$$ 50977 29630 -4828 1655 20773 14823 26212 24884 -8424 3507 43970 54804 20973
8293B0973k7306m908r875M345m465J5365l601n177J8833j5906j1141M253O391
$$ 20973 -6333 -11241 -21116 -16771 -21236 -5871 -9472 -14649 4184 -11722 -22863 -18610 -12219
8280a2219j123l271j043K2652Q200r810o852l6447J8461J3710o841J1043j9291
$$ -12219 -13342 -16613 -17656 4996 13196 3386 -3466 -39913 -21452 -7742 -14583 -3540 -22831
8267b2831j9410J8845J0480r12J2243J7875k222j9380O782j3640k0669K7966P385
$$ -22831 -42241 -23396 -12916 -13828 -1585 16290 14068 -5312 1470 -12170 -32839 -4873 2512
8254B512j7048L086J3422k00J818o045J8187o527p505j1189o051J4495j2022j9422
$$ 2512 -14536 -11450 1972 1772 3590 -2455 15732 9205 1700 -9489 -15540 -1045 -13067 -32489
8240c2489k5673l986J534O624l936K962J8940K9636K7327J4615N687r013Q430
$$ -32489 -58162 -62148 -60614 -53990 -57926 -54964 -36024 -6388 20939 35554 41241 32228 40658
8227D0658k1508l9140j2402J0170L1736J6946j4691j6552K2318J9447l778k7635
$$ 40658 19150 -19990 -32392 -22222 9514 26460 11769 -4783 17535 36982 33204 5569
8215E569n455J721J04o653j7706J7314K48j2175m960L0741J5967J815N245J2316
$$ 5569 114 1835 1939 -4714 -22420 -5106 -4858 -17033 -21993 8748 24715 26530 31775 44091
8201D4091r343j7830j3811J4572m322J545j132l6734r82R59j0705J9521J9172
$$ 44091 34748 16918 3107 17679 13357 14902 13770 -22964 -23946 -22987 -33692 -14171 5001
8188E001M399l8737J439K330L7861M3586j3543k8157l4278j9365r036q060j0061
$$ 5001 9400 -29337 -27898 -25568 12293 55879 42336 14179 -20099 -39464 -48500 -56560 -66621
8175f6621J2508k651Q298K1879J9230M663q698l0833o617J8778J5635J2919L754
$$ -66621 -54113 -56764 -48466 -26587 -7357 -2694 -11392 -42225 -48842 -30064 -14429 -1510 2244
8162B244J733j7426j4534k3761n562K1194K2029K3820K464l3065j5017r235J1097
$$ 2244 3977 -13449 -27983 -51744 -57306 -36112 -14083 9737 12201 -20864 -35881 -45116 -34019
8149c4019k2443j397R352J6450j5467k2783J6468L0321O21J5610J2576j350r582
$$ -34019 -56462 -57859 -48507 -32057 -47524 -70307 -53839 -23518 -22897 -7287 5289 3939 -5643
8136e643j7401k5193p835j0902k714L3899K0625l060r207m161J880q499l482j6735
$$ -5643 -23044 -48237 -56072 -66974 -69688 -35789 -15164 -18224 -27431 -31592 -29712 -38211 -41693 -58428
8122e8428J3580N184J6678J5695j1545k0927J7421K9983P975j3424q739J8762
$$ -58428 -44848 -39664 -22986 -7291 -18836 -39763 -22342 7641 15616 2192 -6547 12215
8110A2215Q145n223p769n962K325K153L8144l892l9922l3202n995L1183J4339
$$ 12215 20360 15137 7368 1406 3731 5884 44028 40136 214 -32988 -38983 -7800 6539
8097F539m339J0982J1661Q629j213J14K0324J4349l0120l2622j0712j3457J1303
$$ 6539 2200 13182 24843 33472 32259 32373 52697 67046 36926 4304 -6408 -19865 -8562
8084h562m869o908K2564L592k0846L2737R490o788L854Q015N339J5546l0339j2967
$$ -8562 -13431 -20339 2225 5817 -15029 17708 27198 20410 24264 32279 37618 53164 22825 9858
8070I858J3491K0302p619j5576N1M1773N1782K910j736j6071J1951j5017K083
$$ 9858 23349 43651 36032 20456 20507 62280 114062 116972 115236 99165 111116 96099 98182
8057I8182l858k7852J0153J3345m786k7692j2008q474P282K483J3533o594r269
$$ 98182 94324 66472 76625 89970 85184 57492 45484 37010 44292 46775 60308 53714 44445
8044D4445p015k6746q580o421j5620L1012J9661j2324J4611K8526M5599J4967
$$ 44445 37430 10684 2104 -4317 -19937 11075 30736 18412 33023 61549 107148 122115
8032A22115j9688j4727R035k672j5819k5429R168J1075q715j8104j5883j0389
$$ 122115 102427 87700 96735 94063 78244 52815 61983 73058 64343 46239 30356 19967
8020A9967O598L4148J8945Q444J5442K2678j2987J7629j6224l6361O903J5202
$$ 19967 26565 60713 79658 88102 103544 126222 113235 130864 114640 78279 85182 100384
8008A00384m519j8972K2272j568k590j3350p443q088k702J4717P582N888J9318
$$ 100384 95865 76893 99165 97597 95007 81657 74214 66126 63424 78141 85723 91611 110929
7995A10929k306l9592n982k4989R021K6255m779p155J0202J1564j6926j9785j8490
$$ 110929 108623 69031 63049 38060 47081 73336 68557 61402 71604 83168 66242 46457 27967
7982B7967O876J1765k2680j442M766J0762J7924L0795K431k1333l8232o296L0522
$$ 27967 34843 46608 23928 22486 27252 38014 55938 86733 89164 67831 29599 23303 53825
7969E3825p603j229J3088J3171p321q237M644J0407j5215j7874j9375j1179o046
$$ 53825 46222 44993 58081 71252 63931 55694 60338 70745 55530 37656 18281 7102 1056
7956A056M1099J2613j4275k304J6672r039k997K513k2730K2276K4327m88Q285
$$ 1056 42155 54768 40493 38189 54861 45822 42825 45338 22608 44884 69211 68723 77008
7943G7008j6085k5768J2946K494m631P790p300k0630q819K2608N796j2383K0483
$$ 77008 60923 35155 48101 50595 45964 53754 46454 25824 17005 39613 45409 33026 53509
7930E3509O188k359P314m041o110P742j8689l3392K3082J7416j0438R816k76p188
$$ 53509 59697 57338 64652 60611 54501 62243 43554 10162 33244 50660 40222 50038 49762 42574
$$ [...]
##END NTUPLES=NMR SPECTRUM
##END=
