##TITLE=Analysis number 314137
Compound Code cc 41863
Book Reference 414/134/3
Project Code adrs
Chemist Name mattw
##JCAMPDX= 6.0         $$ Bruker NMR JCAMP-DX V2.0
##DATA TYPE= NMR SPECTRUM
##DATA CLASS= NTUPLES
##ORIGIN= Bruker BioSpin GmbH
##OWNER= NMR
$$ XWIN-NMR		Version 3.5
$$ Thu Oct  6 12:21:03 2005 GMT Daylight Time (UT+1h)  MAYBRIDGE\NMR@NMR_250MHZ
##.OBSERVE FREQUENCY= 250.131544655141
##.OBSERVE NUCLEUS= ^1H
##.ACQUISITION MODE= SIMULTANEOUS (DQD)
##.ACQUISITION SCHEME= undefined
##.AVERAGES= 16
##.DIGITISER RES= 18
##SPECTROMETER/DATA SYSTEM= dpx250
##.PULSE SEQUENCE= zg30
##.SOLVENT NAME= DMSO
##.SHIFT REFERENCE= (INTERNAL, DMSO, 0, 16.519)
##AUDIT TRAIL= $$ (NUMBER, WHEN, WHO, WHERE, WHAT)
$$ ##TITLE= Audit trail, XWIN-NMR		Version 3.5
$$ ##JCAMPDX= 5.01
$$ ##ORIGIN= Bruker BioSpin GmbH
$$ ##OWNER= NMR
$$ C:\u/data/dgb/nmr/ADRS/10570/pdata/1/auditp.txt
$$ ##AUDIT TRAIL=  $$ (NUMBER, WHEN, WHO, WHERE, WHAT)
(   1,<2005-10-06 12:20:42.21 +100>,<MAYBRIDGE\NMR>,<NMR_250MHZ>,
      <created by zg, POWCHK disabled, PULCHK disabled
       configuration hash MD5:
       62 19 C7 07 E1 42 D1 B7 37 6C 3D D0 77 39 F9 E6
       data hash MD5: 64K
       0A 8E 3B 67 D8 93 E5 D4 42 80 75 39 53 5B 82 CB>)
(   2,<2005-10-06 12:20:54.43 +100>,<MAYBRIDGE\NMR>,<NMR_250MHZ>,
      <Start of raw data processing
       ef LB = 0.3 FT_mod = 6 PKNL = 1 SI = 32K 
       data hash MD5: 32K
       6D 21 CE 66 8B F8 13 3E B1 7D 5D 78 9B 96 92 D0>)
(   3,<2005-10-06 12:20:56.46 +100>,<MAYBRIDGE\NMR>,<NMR_250MHZ>,
      <apk 
       data hash MD5: 32K
       5D E0 0A 4D 52 12 62 16 CC CB A8 B9 15 59 ED 0E>)
(   4,<2005-10-06 12:20:57.26 +100>,<MAYBRIDGE\NMR>,<NMR_250MHZ>,
      <abs ABSG = 5 
       data hash MD5: 32K
       F9 BA E5 D9 B6 5A 6B D6 C7 27 16 CA 61 4B A7 0B>)
$$ ##END=
$$ 
$$ hash MD5
$$ 5B 7B B7 40 D4 53 65 F1 D9 3D BD 46 AD 3F F7 DE
##$RELAX= 
##$RELAX= 
##$RELAX= 
##$RELAX= 
##$RELAX= 
##$RELAX= 
##$RELAX= 
$$ Bruker specific parameters
$$ --------------------------
##$DU= <C:\u>
##$EXPNO= 10570
##$NAME= <ADRS>
##$PROCNO= 1
##$TYPE= <nmr>
##$USER= <dgb>
##$AMP= (0..31)
100 100 100 100 100 100 100 100 100 100 100 100 100 100 100 100 100 100 
100 100 100 100 100 100 100 100 100 100 100 100 100 100 
##$AQSEQ= 0
##$AQ_mod= 3
##$AUNM= <au_zg>
##$AUTOPOS= <26 >
##$BF1= 250.13
##$BF2= 250.13
##$BF3= 250.13
##$BF4= 250.13
##$BF5= 500.13
##$BF6= 500.13
##$BF7= 500.13
##$BF8= 500.13
##$BYTORDA= 1
##$CFDGTYP= 0
##$CFRGTYP= 5
##$CHEMSTR= <none>
##$CNST= (0..31)
1 1 145 1 1 1 1 1 1 1 1 1 1 1 1 1 1 1 1 1 1 1 1 1 1 1 1 1 1 1 1 1 
##$CPDPRG= <>
##$CPDPRG1= <>
##$CPDPRG2= <>
##$CPDPRG3= <>
##$CPDPRG4= <mlev>
##$CPDPRG5= <mlev>
##$CPDPRG6= <mlev>
##$CPDPRG7= <mlev>
##$CPDPRG8= <mlev>
##$CPDPRGB= <>
##$CPDPRGT= <>
##$D= (0..31)
0 1 0 0 0 0 0 0 0 0.06 0 0 0 0 0 0 0.0002 0 0 0 0 0 0 0 0 0 0 0 0 0 0 
0 
##$DATE= 1128597641
##$DBL= (0..7)
120 120 120 120 120 120 120 120 
##$DBP= (0..7)
150 150 150 150 150 150 150 150 
##$DBP07= 0
##$DBPNAM0= <>
##$DBPNAM1= <>
$$ [...]
##$SUBNAM7= <"">
##$SUBNAM8= <"">
##$SUBNAM9= <"">
##$SW= 20.6930455092707
##$SWIBOX= (0..15)
0 0 3 0 0 0 0 0 0 0 0 0 0 0 0 0 
##$SW_h= 5175.983436853
##$TD= 65536
##$TD0= 1
##$TE= 295.16
##$TE2= 300
##$TE3= 300
##$TEG= 300
##$TL= (0..7)
0 120 120 120 120 120 120 120 
##$TP= (0..7)
150 150 150 150 150 150 150 150 
##$TP07= 0
##$TPNAME0= <>
##$TPNAME1= <>
##$TPNAME2= <>
##$TPNAME3= <>
##$TPNAME4= <>
##$TPNAME5= <>
##$TPNAME6= <>
##$TPNAME7= <>
##$TPOAL= (0..7)
0.5 0.5 0.5 0.5 0.5 0.5 0.5 0.5 
##$TPOFFS= (0..7)
0 0 0 0 0 0 0 0 
##$TUNHIN= 0
##$TUNHOUT= 0
##$TUNXOUT= 0
##$USERA1= <user>
##$USERA2= <user>
##$USERA3= <user>
##$USERA4= <user>
##$USERA5= <user>
##$V9= 5
##$VALIST= <valist>
##$VCLIST= <CCCCCCCCCCCCCCC>
##$VD= 0
##$VDLIST= <DDDDDDDDDDDDDDD>
##$VPLIST= <PPPPPPPPPPPPPPP>
##$VTLIST= <TTTTTTTTTTTTTTT>
##$WBST= 1024
##$WBSW= 4
##$XGAIN= (0..3)
0 0 0 0 
##$XL= 0
##$YL= 0
##$YMAX_a= 479836
##$YMIN_a= -206306
##$ZGOPTNS= <>
##$ZL1= 120
##$ZL2= 120
##$ZL3= 120
##$ZL4= 120
##$ABSF1= 16.51896
##$ABSF2= -4.174212
##$ABSG= 5
##$ABSL= 3
##$ALPHA= 0
##$AQORDER= 0
##$ASSFAC= 0
##$ASSFACI= 0
##$ASSFACX= 0
##$ASSWID= 0
##$AUNMP= <proc_1d>
##$AZFE= 0.1
##$AZFW= 0.1
##$BCFW= 0
##$BC_mod= 0
##$BYTORDP= 0
##$COROFFS= 0
##$CY= 12.5
##$DATMOD= 1
##$DC= 0
##$DFILT= <>
##$DTYPP= 0
##$F1P= 14.0000005364418
##$F2P= -0.99999901652339
##$FCOR= 0.5
##$FTSIZE= 32768
##$FT_mod= 6
##$GAMMA= 0
##$GB= 0
##$INTBC= 1
##$INTSCL= 1
##$ISEN= 128
##$LB= 0.3
##$LEV0= 0
##$LPBIN= 0
##$MAXI= 10000
##$MC2= 0
##$MEAN= 0
##$ME_mod= 0
##$MI= 0
##$NCOEF= 0
##$NC_proc= -6
##$NLEV= 6
##$NOISF1= 0
##$NOISF2= 0
##$NSP= 0
##$NTH_PI= 0
##$NZP= 0
##$OFFSET= 16.51896
##$PC= 1
##$PHC0= -78.14685
##$PHC1= 23.96891
##$PH_mod= 1
##$PKNL= yes
##$PPARMOD= 0
##$PSCAL= 4
##$PSIGN= 0
##$REVERSE= no
##$SF= 250.130000760216
##$SI= 32768
##$SIGF1= 0
##$SIGF2= 0
##$SINO= 400
##$SIOLD= 32768
##$SREGLST= <1H.DMSO>
##$SSB= 0
##$STSI= 32768
##$STSR= 0
##$SW_p= 5175.98343685301
##$SYMM= 0
##$S_DEV= 0
##$TDeff= 65536
##$TDoff= 0
##$TI= <Analysis number 999999
Compound Code 99
Book Reference 9
Project Code 9>
##$TILT= no
##$TM1= 0
##$TM2= 0
##$TOPLEV= 0
##$USERP1= <user>
##$USERP2= <user>
##$USERP3= <user>
##$USERP4= <user>
##$USERP5= <user>
##$WDW= 1
##$XDIM= 32768
##$YMAX_p= 309950541
##$YMIN_p= -1440164
$$ End of Bruker specific parameters
$$ ---------------------------------
##NTUPLES= NMR SPECTRUM
##VAR_NAME=  FREQUENCY,     SPECTRUM/REAL,   SPECTRUM/IMAG
##SYMBOL=    X,             R,               I
##VAR_TYPE=  INDEPENDENT,   DEPENDENT,       DEPENDENT
##VAR_FORM=  AFFN,          ASDF,            ASDF
##VAR_DIM=   32768,         32768,           32768
##UNITS=     HZ,            ARBITRARY UNITS, ARBITRARY UNITS
##FACTOR=    0.157963299565203, 1,           1
##FIRST=     4131.88771567153, 0,            0
##LAST=      -1044.09572118148, 0,           0
##MIN=       -1044.09572118148, -1440164,    0
##MAX=       4131.88771567153, 309950541,    0
$$ Real data points
##PAGE= N=1
##DATA TABLE= (X++(R..R)), XYDATA
$$ [...]
15609c59444R4719J4450j88146j00955L6166J97722K1017j2259M4929J02476k4937
15598a74262q7624l9241J01199j22518K1810Q2528P1401m3495K6718p779j21459
15587b92722k5937O7990L6565q9035j22647k596J34299K23839P9309n7581J39006
15576I0490N7904j33535m2481J65451l8307o3773p7486K4472k2363k306j4153
15565e6087q8016p266j0090n1984o0252q5902n9569m2356j54250r2284O2263Q2336
15553e63457J70186J90174L16838J7261k441j52448j55402Q0879j9376n8442M4562
15542a31666n1994j66593J16316K16874J15452q1783j55244j71196n628K39431
15532g6031O0710q3281P1422j67944k28241J51268K73883j9828r7102L1719R3881
$$ y = [-359444, -264725, -250275, -438421, -539376, -503210, -305488, -284471, -296730, -251801, -149325, -174262, -261886, -301127, -199928, -322446, -300636, -218108, -146707, -190202, -163484, -171263, -292722, -318659, -250669, -214104, -303139, -425786, -428382, -294083, -70244, 9065, -48516, 90490, 148394, 14859, -27622, 137829, 99522, 35749, -41737, -17265, -39628, -41934, -56087, -144103, -151369, -161459, -213443, -273695, -359597, -419166, -461522, -615772, -708056, -645793, -563457, -393271, -203097, 113741, 131002, 128561, -23887, -179289, -98410, -117786, -176228, -131666, -183660, -350253, -233937, -17063, 98389, 16606, -138638, -309834, -315462, -76031, -15321, -98602, -27180, -195124, -423365, -272097, 1786, -18042, -115144, -83425, 10456]
15521A0456r0529r7379j09224k1215l9940j7758K50927m9230q2482K27611L4706
15510A5943j50463J67957L0600l17304m8296J80553J78293l07921r1033J85656
15500a56015M9894j15384k3386j41051O0793K31853j39656J65203J16188j48115
15490i9676j35939m5323N9792J65789j92906m1019J90205k8357k50814j84309
15480e62557n589K01014L5702J20030O0315M9138K6906m5466J16624Q4943k37778
15469a56718j99436J77377M1823O430n5549l6876j9430j59232L7549P4243J29312
15458a60507N2535R5207j5479k37070p4531J20912P5519k19342q6433K40129K79238
15447G0178M8772j47728j00548Q2675j5812M3366m3259j44672j64492J7923J63924
$$ y = [10456, -80073, -177452, -286676, -307891, -347831, -365589, -114662, -163892, -246374, -18763, 15943, -134520, 33437, 64037, -253267, -301563, -121010, 57283, -250638, -341671, -156015, -106121, -221505, -244891, -385942, -325149, -93296, -232952, -67749, 48439, -99676, -235615, -280938, -221146, -55357, -248263, -289282, -99077, -127434, -378248, -562557, -568146, -367132, -331430, -211400, -151085, -101947, -75041, -120507, -3883, 81060, -156718, -356154, -178777, -136954, -130524, -186073, -222949, -242379, -401611, -364062, -289819, -160507, -107972, -12765, -28244, -265314, -339845, -218933, -143414, -362756, -449189, -209060, 70178, 118950, -28778, -129326, -46651, -62463, -19097, -62356, -207028, -371520, -353597, -189673]
15436a89673l4463J5985K4216N5818J19465l335J35943M4956k83759l50217J96385
15425b68679K78559k19631j43524J9468m1168R1607O8696J9231J27017j09880
15415a78304p4621J41034m326R0124Q5191l30592r8103J979P6798j07013J57049
15404b40784K82321K65623k7936q6846l639p2380J24203l4430q2155j13586J53518
15393A63909k7039k5955o9174n3905M5073k60906r4906J33210J38620O3638j08525
15382i5960k07431p6516j0405J99848J74517j06782m59220K0816L00190K96608
15372C5665M9126J00402L4354j68992L1191J20376p9700j62118p0957R8625K88318
15361B76290j55317k29349p224j74120j83568N9313M4318p789R3369Q0970l3211
$$ y = [-189673, -224136, -208151, -183935, -128117, -8652, -11987, 123956, 168912, -114847, -465064, -268679, 9880, -209751, -353275, -333807, -374975, -283368, -214672, -195441, -68424, -178304, -252925, -111891, -116217, -26093, 59098, -271494, -369597, -367618, -290820, -397833, -240784, 41537, 307160, 279224, 192378, 188739, 116359, 240562, 206132, 123977, 10391, 163909, 136870, 110915, 41741, -12164, 32909, -227997, -322903, -189693, -51073, 12565, -95960, -303391, -379907, -390312, -190464, -15947, -122729, -581949, -561133, -260943, 35665, 84791, 185193, 219547, 50555, 81746, 202122, 122422, -39696, -110653, -12028, 276290, 120973, -108376, -115600, -289720, -473288, -413975, -369657, -377446, -284077, -203107, -236318]
15350b36318k4005M8545P2941J42528k75370J1760n3387j45900P1428J10773O4061
15339b12944K49563l6163k7907k26526P455l7898J45760K44734K8436p4770O1351
15328A21091j04944L984J83868n70m583n2336r9276K0010J33043O0876k37781
15317B3382j62533r0575k75222K0097J25547J47878K58937J5249l41773o4983
15307c43996j9997K18744J96180J42256J08905j41302j86556j5758O67j75698
15297b16555j7518J00294q4881R5773n9023j21252O1587J19052P9036l3035M1748
15286c4774O9137j41414N9702j00888N0237J47079J90030l4319j80504l9832J66357
15275A50811J14510p9638j09560k47848r5721n411n9178J60036K78404J47186
$$ y = [-236318, -260323, -211778, -138837, 3691, -271679, -259919, -313306, -459206, -387778, -277005, -212944, 36619, 456, -27451, -253977, -246522, -284420, -138660, 106074, 134510, 59740, 121091, 16147, 20131, 203999, 203429, 198846, 146510, 47234, 67244, 200287, 261163, 23382, -139151, -229726, -504948, -484851, -359304, -211426, 47511, 62760, -279013, -343996, -363993, -145249, 50931, 193187, 302092, 160790, -25766, -41524, -40857, -216555, -234073, -133779, -218660, -122887, -181910, -303162, -241575, -122523, -43487, -76522, -34774, 34363, -107051, -47349, -148237, -98000, 49079, 239109, 204790, 24286, -15546, 150811, 265321, 185683, 76123, -171725, -267446, -272857, -332035, -171999, 106405, 253591]
15265B53591k81717J15881J40405o1135l50269j41046R7852l3074L4132K4480
15255b00900J30089R3944n0280l0638J27823j7068J40477j1442q6509o6101k31769
15244b02374k5562L33057J6609j4324M5095j14777l25832n6971R9065J25831O1016
15233e9167L41874j24620k45596q9293j36134j9759J53798J76033J60196p8946
15223G8386J05883j36433k43862l16070m9996K8992J68815L77513J17985j66807
15213c5594k29580J32435J17747N7804j58687j56131J60597K04236r0438j97494
15203a95105P7621N5398j6909k14766k60033K9891J38446p5205l42693N7692p3124
15192h18787J11511K02292J1686r4821J93122K07361Q5896N6438m7802l10711
$$ y = [253591, -28126, 87755, 228160, 167025, -183244, -324290, -226438, -259512, -225380, -200900, -70811, 23133, -27147, -57785, 70038, 52970, 193447, 182005, 95496, 29395, -202374, -227936, 105121, 121730, 107406, 152501, 37724, -288108, -345079, -246014, -120183, -59167, 282707, 158087, -87509, -176802, -312936, -332695, -178897, -2864, 157332, 78386, 184269, 47836, -196026, -512096, -562092, -533100, -364285, 13228, 131213, -35594, -265174, -132739, -14992, 42812, -115875, -272006, -111409, 92827, 2389, -195105, -117484, -62086, -78995, -293761, -553794, -523903, -385457, -460662, -803355, -745663, -818787, -707276, -504984, -493298, -588119, -394997, -187636, -101740, -45302, -93104, -403815]
15182d03815k82032R0740O8444J53680J5243m9956K9820j4152j44662o570K99560
15171b43700K52029J01540n1096j50625M0949L37571K1042k6997j2683r9896j83181
15160a5047o0944k13176l9575n3127L8053J44931Q5685k425N2650K58984m0723
15149A55286k58462r9792q5760K00681J3936J4240M2221j31934M3118k9961j4390
15138a50817k173j10304J30700j798l4567Q2330j12357K1644j8456J78357N7860
15127D0419k00256j5625K8692J11289J11244J35539j83722k30229j41790P2226
15117b72213R7985N8163J26543m7382P374M5873o5095o9723j28866R3481K02951
15106D9091J61953k3470r3955k54278j66067J91718R3146j44010K0544p2333M5696
$$ y = [-403815, -685847, -595107, -526663, -372983, -357740, -407696, -377876, -392028, -536690, -543260, -243700, 8329, 109869, 58773, -91852, -50903, 286668, 307710, 280713, 268030, 168134, -15047, -75991, -289167, -328742, -381869, -343816, -198885, -113200, -115625, -62975, 196009, 155286, -103176, -202968, -288728, -88047, -74111, -59871, -17650, -149584, -106466, -136427, -150817, -152990, -263294, -132594, -134392, -168959, -86629, -198986, -177342, -195798, -17441, 40419, -159837, -175462, -146770, -35481, 75763, 211302, 27580, -202649, -344439, -272213, -174228, -116065, 10478, -36904, -29530, 16343, -48752, -118475, -247341, -153860, 49091, 211044, 187574, 93619, -160659, -326726, -135008, -41862, -185872, -165328, -237661, -191965]
15095a91965O6365j44341j61819j56864q4112M02565L64214j18928r1723Q7108
15085b9500j99984l68597k06331P836K86638K0068k37066R5945L76874J70318
15075h3799O5940K8872l21294l15513N0376L23023P2675j49801j55852J00282
15065c85091O9689N4508k4630j17185j76486J11769J09627J56464J58294M0208
15055b833j92724l21506O3425K79402j25233j23041j00934k02285J34817O3387
15045e27525J05713K65128K84651J0589r4304j39717j98128k1849Q4987J05034
15035a25421J47623j09803j56885l6214K9712P5744j11109k12191J40892K12929
15025a44723J79873J7864k37568j38864L3650R8116J46531K13177J63793k7478
$$ y = [-191965, -125600, -269941, -431760, -588624, -672736, -270171, 94043, -24885, -116608, -29500, -229484, -598081, -804412, -796576, -509938, -489870, -726936, -630991, -254117, -83799, -17859, 11013, -310281, -625794, -575418, -252395, -179720, -329521, -485373, -385091, -315402, -260894, -285524, -402709, -579195, -467426, -357799, -201335, -43041, -2833, -195557, -517063, -453638, -174236, -299469, -422510, -523444, -725729, -590912, -527525, -421812, -156684, 127967, 138556, 44252, -95465, -293593, -315442, -230455, -125421, 22202, -87601, -244486, -280700, -250988, -175244, -286353, -498544, -357652, -144723, 35150, 53014, -184554, -323418, -289768, -191652, -45121, 168056, 331849, 304371]
15015C04371j24416o6662j34493k21849k5028J20870J38831J53798j43775q2922
15005h1275k57269k71085O4880q6358L43214J71408p1345p677m2526M4754K03243
14994I964J51090m5971Q0366j77921j04624R6211J84062j3093k1055j21232O94
14983C8491n0504k36048M4744q4758k33637J0711J33291K74516L36332j26155
14973A06983q1851j86463P8015J33499p6406o4758Q463n1772m0677J04798J83779
14962A13610j03598M5301M3166j59601L0954M49l8234l6760J01497M0052k9943
14951F893m2141J11885J46834l6583o8246k06167n5102Q3837Q260j7894K5966
14940d2458k10437P665L02771j13207k03470J98784J21493J51172N3918N8485
$$ y = [304371, 179955, 113293, -21200, -243049, -268077, -147207, -8376, 145422, 1647, -81275, -338544, -609629, -544749, -631107, -287893, -116485, -187830, -195507, -238033, -193279, 9964, 161054, 115083, 195449, 17528, -87096, 9115, 193177, 180084, 159029, 37797, 38491, -12013, -248061, -203317, -288075, -521712, -511001, -377710, -103194, 233138, 106983, 25132, -161331, -83316, 50183, -26223, -90981, -82518, -134290, -174967, -70169, 113610, 10012, 55313, 98479, -61122, -30168, -29719, -67953, -104713, -3216, 36836, 6893, -35248, 76637, 223471, 186888, 118642, -87525, -142627, -58790, -50530, -68424, -42458, -252895, -245230, 57541, -55666, -259136, -60352, 61141, 212313, 266231, 324716]
14930C24716k69093j96036J12620J7214M2172p191J40147J51837o2481k12351
14920D1554r6183q2687j29192P1746N5339R6730J44352j39263k04647r719J81379
14909g0591J64615k17988J0972L0045Q8475R6768l24970p70m5200q6646J51246
14898b04044J10793J40759Q3440j11940j8274l7366k34387j81190J45787M0612
14888b65810J5215J62456K35360Q5610j71641j66774j82134j49961J4047L4503
14878c89129L9388J68288j58559j61689j03535J41070J21824r6551J10747j41731
14868d69877j14457J66865J56336j92219k09663j45605j8546J61338K89205M4137
14858c32486N1739m1513j62573O0362K86813m807j8671K19883p5283M5594J2660
$$ y = [324716, 55623, -140413, -27793, -10579, 31593, 24402, 164549, 316386, 253905, 41554, -54629, -137316, -266508, -194762, -139423, -42693, 101659, -37604, -242251, -251970, -70591, 94024, -123964, -112992, -82947, 5528, 102296, -222674, -223444, -268644, -355290, -204044, -93251, 47508, 130948, 19008, 734, -36632, -271019, -452209, -306422, -265810, -250595, -88139, 147221, 232831, 61190, -105584, -287718, -437679, -423632, -389129, -349741, -181453, -340012, -501701, -605236, -464166, -342342, -438893, -328146, -469877, -584334, -417469, -261133, -453352, -663015, -808620, -827166, -665828, -376623, -332486, -280747, -322260, -484833, -424471, -137658, -142465, -161136, 58747, -16536, 29058, 41718]
14847D1718k41539O54j63013J65491M4389j64635j86298r8992J18281K0829K9975
14836d33140J14984K29615j92555j34656J73247J05233M2158P9009p6532o4182
14826a56819J00837n2016k31716j26091l2707L23042J65654j42659K6229j44395
14816b70641J732K35024l6386m5711j27375N4363Q6777J0938M2140J68842j26790
14805g087q7110J29298J14011q5330k35269R4777J12501j54400l2591j8936J80522
14794A0386r8822j06511j09683Q7061K9895l2175J19619r2176l7325J91846K41921
14783B04036l9792j60570k31487P0964P5575k34160l4124P1227J6377N6779R8867
14772a06308k63242L2294J57553j09940J27680K35912K3380j81210q0159J81594
$$ y = [41718, -199821, -199167, -362180, -196689, -152300, -316935, -503233, -602225, -483944, -463115, -433140, -318156, -88541, -281096, -415752, -242505, -137272, -95114, -16105, -92637, -156819, -55982, -107998, -339714, -465805, -498512, -175470, -9816, -152475, -126246, -270641, -268909, -33885, -70271, -115982, -243357, -188994, -102217, -91279, -49139, 119703, -7087, -94197, 35101, 149112, 63782, -171487, -76710, 35791, -118609, -151200, -170136, 10386, -88436, -194947, -304630, -217569, -187674, -219849, -100230, -192406, -229731, -37885, 204036, 164244, 3674, -227813, -156849, -81274, -315434, -349558, -278331, -261954, -205175, -106308, -369550, -337256, -179703, -289643, -161963, 73949, 97329, -83881, -164040, 17554]
14762A7554j00910j01714q5694o9793m0329j06517R7879n6258j8316n0084M3340
14751d70842R2679L8370J26231n3674k79393j50414K64355R1001j2385J62067
14741a92005j38872k33300N0544J66594r466j5988J06172L12104K63036m8015
14731B60804l45794k62872K74089J44881m3482K3227j57359j40076K0084J0105
14721b16393J20090m6830j43306l5621J30791r5510k7813j71037J9791K35955
14711b29883K20122P3999J00667J2724L5658k24931j57644L9003j18161l4639
14701b83085j8039J20082K29547K6445k94739j88808J53902P9228j41582j79029
14691d96078J77051J21402P1760O7536O0389j57878j08881J5508j93978L0242
$$ y = [17554, -83356, -185070, -270764, -340557, -380886, -487403, -389524, -445782, -464098, -514182, -470842, -378163, -339793, -213562, -267236, -546629, -697043, -432688, -341687, -354072, -192005, -330877, -564177, -513633, -347039, -356505, -372493, -266321, 45783, 308819, 260804, -84990, -347862, -73773, 71108, 27626, 50853, -106506, -246582, -226498, -216393, -96303, -143133, -286439, -322060, -191269, -286779, -314592, -485629, -465838, -229883, -9761, 64238, 164905, 177629, 213287, -11644, -169288, -130285, -248446, -283085, -301124, -181042, 48505, 74950, -219789, -408597, -254695, -175467, -317049, -496078, -319027, -197625, -125865, -58329, 2060, -155818, -264699, -249191, -443169, -412927]
14681d12927N5744m768k09602l4189M7541L22461N4829J85654J2178q4897k40612
14670c08588j51224L6998J42816O1046j76075j1255R5591k0990Q2685l1388p5153
14659c55537o3321n6012J83418l1797o1231J51744r9915O951j38296k9014J45433
14648c47577J42323R6617o3899P5762j3313j08641p9076j06780M9652J28975Q8681
14637a37276r1636j32601k639O7466p76J958m580J6085m9943r8797Q2045p8626
14625d29320J55820L48125O9165j36927r1287k27565j32886K15456J13523r2812
14615b08708j397J3582k7166l2682k8215O1836J0016R4848j16994k13091j35401
14604e83372M3220k9477J86945L2126l9236J47019L42070R6428j75253R1609O678
$$ y = [-412927, -357183, -361951, -571553, -605742, -558201, -235740, -180911, 4743, 16921, -67976, -308588, -459812, -422814, -279998, -218952, -395027, -406282, -310691, -331681, -248996, -280384, -355537, -418858, -474870, -291452, -323249, -384480, -232736, -332651, -325700, -463996, -493010, -347577, -205254, -108637, -172536, -96774, -110087, -218728, -297804, -404584, -354932, -225957, -137276, -228912, -361513, -364152, -296686, -297462, -295504, -300084, -283999, -333942, -432739, -350694, -429320, -273500, 74625, 143790, 6863, -84424, -311989, -444875, -229419, -115896, -208708, -210105, -196523, -223689, -256371, -284586, -222750, -212734, -117886, -234880, -447971, -583372, -540152, -569629, -382684, -350558, -389794, -242775, 99295, 195723, 20470, 112079, 118757]
14593A18757k51550j23002J87646n0999j00168m7739k8557K3617j2709k59915
14583e44619P8055Q9597L95756j3293k01772j36522k3323J14619j28010q5168
14573d54680l7383J32592j254j09189n5119J65968J00134K05804O1193J91750
14563A99816j0641l03772j43873J97876J70512n6435j1607j70153q5964k16196
14553d30437J2967M2047J17353l1038j62457K8996J49149j3142j07716J82799
14543b11479R0500l1502K3970k26092j65612J22512J39234J98670R3679o1889
14533b8009m4475j10576j70734j23064j76070K42866J51092k21099L3475M8159
14523c98435J08949J03248R094J872Q234M7871r7517j26343K2034o7910o9600
$$ y = [118757, -132793, -255795, -68149, -119148, -219316, -267055, -295612, -271995, -284704, -544619, -466564, -376967, 18789, 5496, -196276, -332798, -356121, -241502, -369512, -454680, -492063, -359471, -360725, -469914, -525033, -359065, -258931, -53127, 8066, 199816, 189175, -114597, -258470, -60594, 109918, 53483, 41876, -128277, -214241, -430437, -417470, -375423, -258070, -289108, -451565, -422569, -273420, -286562, -394278, -211479, -120979, -152481, -128511, -354603, -520215, -397703, -258469, -59799, 33880, -28009, -72484, -183060, -353794, -476858, -652928, -410062, -258970, -480069, -446594, -398435, -289486, -186238, -177144, -175272, -167038, -119167, -216684, -343027, -320993, -388903, -458503]
14512d58503K4908J4612O4444M0143k7310l2028N5952r4462M5420O1372j15806
14501d21258j24974k9575J33893K33724J50361M6145r9386n2999R7850J24640
14491E8421j60221r5218l7401J1112j15518o786J39031K0377r6201l03502n2575
14480f38481J93410K41518J90883J4716p5068j10145j68493L3779j07164J01696
14470c23349J71049N9074J64578J9606n6106o4985j60368m4697p7561P9337R5837
14459a37585k63723k8826J53523r4421j34711L1055J76505Q3867K4466P2022K4304
14448i3524l4042m5664M2142l354j03107L6077k9878K4833N3249k26573j04066
14437d83907K65521J53823p9762O2343j8613j58570j41126j7718J29601J96436
$$ y = [-458503, -433595, -418983, -354539, -314396, -341706, -373734, -317782, -412244, -366824, -305452, -421258, -546232, -575807, -441914, -208190, -57829, -11684, -111070, -164069, -66219, 58421, -101800, -197018, -234419, -223307, -338825, -345611, -206580, -186203, -282404, -585906, -638481, -445071, -203553, -12670, 2046, -73022, -183167, -351660, -317881, -425045, -323349, -152300, -93226, 71352, 90958, 34852, -30133, -190501, -235198, -312759, -233422, -137585, -401308, -430134, -276611, -371032, -505743, -474688, -298183, -214316, -189850, -117828, -93524, -127566, -173230, -131088, -134442, -237549, -201472, -231350, -206517, -153268, -379841, -483907, -218386, -64563, -144325, -81982, -100595, -259165, -400291, -418009, -288408, -91972]
14427i1972J12679k29140j69492r1710J17442Q1084K3024L0393j19422J61083
14417a76031O9618M1864q5152m2821J47231p3642n968K8724J99253O8565j24022
14406D7619l64615j92461K11529J73045K1077j23498k85021j0548J00666J54253
14396b67954J33062P5319N3676N0269j28501j6807P5722K84166J1919r6208l14533
14385a39870j52114J70384K7438j61523L3268p5667k8153M2827n2227j314R5294
14374b41657L8279J13108K14963N0636o9683j07652j01338j9374K2076n0181j81138
14363c31961j9387J9832J79258J21594Q4280m2312L1591j884m3375j98276o6674
14352b67314J28456n695J4853K5253J6196o9983r4388q0441J48341J02128j04623
$$ y = [-91972, 20707, -208433, -377925, -469635, -352193, -271109, -248085, -217692, -337114, -176031, -106413, -64549, -149701, -192522, -45291, -118933, -124901, -96177, 103076, 171641, 47619, -316996, -509457, -297928, -124883, -103806, -227304, -512325, -522873, -422207, -267954, -134892, -59573, -5897, 44372, -84129, -100936, -25214, 258952, 270871, 174663, -139870, -291984, -121600, -94162, -255685, -222417, -298084, -326237, -283410, -335637, -336951, -241657, -203378, -90270, 124693, 175329, 105646, -2006, -103344, -122718, -100642, -150823, -331961, -351348, -331516, -152258, -30664, 53616, 11304, 42895, 41011, -2364, -200640, -267314, -138858, -144553, -129700, -104447, -88251, -158234, -252622, -333063, -184722, -82594, -187217]
14341a87217L5638j9302P3919R3697j70422j38004k8966J22940J2119k73644n0119
14330e29361Q7913p8934J35458N6104P8239J66186J93666j95996P0508L26253
14320C10036j5614j22453o1773l12821j1434K39359n9743J9760k10038j44148
14310c68869K92919K19229j70379L4463n6400l04034j85512j0052J69021J0783
14300c68831k4462O2789j92583j9348J49317M0398K45728J33435o3587k79927
14290c17071M6958J71424k09502L1959N4540J18110o860j95080k72148j83262
14280g60932k0497J80696M4989j16527K27549J05822L7253P8515N1378j19474
14270b91228n8922P4725P0381K9907j18947k11086L5847m9770j4600l5543j41873
$$ y = [-187217, -151579, -170881, -96962, -3265, -173687, -311691, -340657, -217717, -205598, -479242, -529361, -441448, -520382, -384924, -328820, -250581, -84395, 109271, -86725, -16217, 310036, 294422, 171969, 110196, -202625, -214059, 25300, -34443, -14683, -224721, -368869, -75950, 143279, -27100, 7363, -49037, -353071, -538583, -548635, -379614, -368831, -393293, -330504, -523087, -542435, -393118, -352720, -106992, 26443, -37144, -317071, -270113, -98689, -308191, -276232, -221692, -103582, -110442, -305522, -577670, -760932, -781429, -600733, -555744, -672271, -444722, -338900, -301647, -223132, -171754, -291228, -350150, -275425, -205044, -175137, -294084, -505170, -469323, -519093, -533693, -569236, -711109]
14259g11109O6072K16960j1412J33328R3013N1608J80824p1156j73182j6944J65777
14248g6221Q2341n0406k72921j19414K18763O7947M983k34488n9713J08973k8717
14237c58873K45372J91637k08506n7962j11128J89085K0534l1181J34960K3509
14227C7447q645J07778J4579l59549J04009J26913m3453k16876j8188J767O6082
14216a88136O9446j00954j19920j55852j51057q1765K4337M22399K93825r4460
14206h2137Q4290j3874l02333m3162K52461M375J5739K05314P7200j18498j95885
14195a16510l24294J2715J21205p9484k25117p8898K15888M0539M5662j81387
14185e69681O0528N0214O7185J3214j66J0793j66749L1245K26762K26730r7076
$$ y = [-711109, -645037, -428077, -439489, -306161, -213148, -161540, 19284, -51872, -225054, -241998, -76221, 6120, -44286, -317207, -436621, -217858, -149911, -144928, -379416, -439129, -330156, -358873, -113501, 78136, -130370, -188332, -299460, -110375, -89841, -121022, 13938, 37447, 28802, 136580, 151159, -208390, -104381, 22532, -20921, -237797, -255985, -254218, -188136, -118690, -219644, -339564, -495416, -646473, -728238, -703901, -281502, 12323, -82137, 2153, -11721, -314054, -357216, -104755, -100380, -84641, 120673, 197873, 79375, -116510, -440804, -428089, -306884, -386368, -611485, -690383, -474495, -433956, -388294, -569681, -509153, -458939, -391754, -378540, -378706, -367913, -534662, -503417, -276655, -49925, -147001]
14174a47001j5234j68056p8884K42947K11697J02824O5367k9012j93058j05286
14164a13696p9328l0170J56953N7881k34406n5960K0881m7829J58192J62182o5886
14153g1186n7880O3374L624J0729m3156M3594K0349m5891l4340N8327p6348O5028
14141f3776k05015j21052o8576j11118P8526L38128Q8712o1635l4696j30180o5416
14130c56098J13712p5905o3639k9353j03043J17532L89436J06779l8584L3989
14120I4826n372r8516k36424j89049o7924m8092l534l6521J37371J11049q0776
14109d22962J16011N8325j76945J17029Q0000K2567j44054p6850J0799J61641
14099b54439J93699k0770l8419o164q931n9231L7359j28624k11043p5346J28196
$$ y = [-147001, -162235, -330291, -409175, -166228, 45469, 148293, 213660, 184648, -8410, -113696, -193024, -223194, -66241, -8360, -242766, -298726, -277845, -325674, -167482, -5300, -71186, -129066, -65692, -62068, -51339, -94495, -50901, -30552, -76443, -110783, -52456, -128804, -63776, -268791, -389843, -458419, -569537, -491011, -152883, -64171, -125806, -160502, -290682, -356098, -242386, -318291, -381930, -411283, -514326, -396794, -7358, 99421, 60837, 94826, 89454, -9062, -245486, -434535, -502459, -550551, -554085, -590606, -453235, -342186, -422962, -306951, -248626, -425571, -308542, -228542, -205975, -350029, -426879, -416080, -254439, -60740, -81510, -119929, -126093, -135024, -194255, -156896, -285520, -496563, -571909, -443713]
14088d43713K31841J63758J38624j86701k45734M3884l1336L5313L5345J08952
14078a49767J652q5237k38570J39197K16185p9819k57876p9704n5675J67697P9614
14067c42303o0010P5328p2941Q9252N1693J2091K9461j07020N8851j03716j5622
14056c84936r7238J97059J80004n156j53053j882J15869L9527p3321O7459J54334
14045C8666J3409q0607q7165j37676r5199o869K8887P731P4843j04959J9486Q1303
14033b48150M6413N5650K56051K3463j25752l10251j23307o0128K08588j3191
14023b90614M8271J5182k40115j3755M7417j03025J63533K97662R9986p7897l8051
14012i1406r5913K7265O9297o0226M8563l27112k0588J72227P0872K1228J2067
$$ y = [-443713, -211872, -48114, 90510, -96191, -341925, -298041, -329377, -294064, -258719, -149767, -148115, -233352, -471922, -332725, -116540, -196359, -454235, -533939, -589614, -421917, -342303, -402313, -326985, -399926, -310674, -258981, -246890, -217429, -324449, -265598, -369314, -384936, -482174, -285115, -105111, -110267, -263320, -265202, -149333, -109806, -183127, -115668, 38666, 52075, -28532, -115697, -253373, -348572, -355441, -326554, -318823, -243980, -348939, -329453, -248150, -201737, -146087, 109964, 133427, 7675, -302576, -425883, -486011, -277423, -290614, -242343, -227161, -467276, -481031, -433614, -536639, -373106, -75444, 24542, -53355, -91406, -187319, -160054, -90757, -150983, -102420, -429532, -450120, -277893, -207021, -185793, -173726]
14001a73726K25214J23928j6466l81746j85143L57632J5329j75074j36035P9517
13991b66570J78308r5190N4807J16109j01250j08281K6276O9287j17065j36569
13981c80138q8563J36424P0451K83334J68308O9146k9640p6275j1536K7082k22045
13970e3452j19387m0154J41423L8518P5211J3774o0723j1463k08594k03000o3818
13959d91665j23024P1558M8348L3692R635r329j00789K405J11520L8508j54671
13948e63812J78372m214j05879J73864R8661N4831P5695O4574J46150P0637l16859
13937a27980l21558o3443M3486K67412J64312r9438L8731m3797j45240k27549
13927e15064M9724P5329j4212j13602K20062K59865L7903q3933r6179k8095R3130
$$ y = [-173726, 51488, 175416, 158950, -222796, -407939, -50307, -34978, -210052, -346087, -266570, -88262, -183452, -128645, -12536, -113786, -222067, -195791, -126504, -243569, -380138, -468701, -332277, -261826, 21508, 189816, 258962, 229322, 153047, 141511, 168593, -53452, -172839, -212993, -71570, -33052, 42159, 55933, -4790, -16253, -224847, -427847, -491665, -614689, -543131, -494783, -461091, -451456, -460785, -561574, -559169, -447649, -409141, -563812, -385440, -389654, -495533, -321669, -223008, -168177, -92482, -27908, 118242, 188879, -127980, -449538, -512981, -469495, -202083, -37771, -137209, -98478, -142275, -287515, -515064, -465340, -390011, -404223, -517825, -297763, -37898, 5, -83928, -180107, -208202, -115072]
13916a15072m7515j24678j13302n0980j21118N2437O4522J05076j0306p4990O8170
13905c67756J8576j40466k6865J5720O8219L2202J47178M9340P6620q7132J60787
13894e3577j16154q5349j70117j88009J43813R4347R2691K56432j01369j08864
13884b36156j48950k1446K34292J20829K2441j8751j13330o7241j59022L9410
13874c47924l8574r1854J15848M05303K96498j37063l76581n890N7723j76694
13864b99208K2180l4875q3584J0514J45321J1123j66220p280q414K01203J92342
13853a6898q3712j26492r0703n4057j18547l05193K44940K82326N7430k4096Q2719
13842a52283r7223k31636n8195q9003K4054J81040P5163p8788J1602J93749j894
$$ y = [-115072, -162587, -287265, -400567, -451547, -572665, -520228, -455706, -350630, -360936, -435926, -367756, -349180, -489646, -516511, -500791, -432572, -400370, -253192, -203852, -127232, -214364, -53577, -169731, -255080, -425197, -613206, -469393, -375046, -282355, -25923, -127292, -236156, -385106, -406552, -172260, -51431, -28990, -47741, -161071, -228312, -387334, -347924, -386498, -478352, -362504, 42799, 339297, 202234, -174347, -180237, -122514, -299208, -277028, -311903, -395487, -384973, -239652, -228529, -394749, -402029, -410443, -209240, -16898, -100610, -227102, -317805, -371862, -490409, -795602, -550662, -268336, -210906, -235002, -152283, -249506, -481142, -539337, -628340, -604286, -423246, -348083, -426871, -415269, -221520, -223414]
13831b23414N7095j08037j7229J55085j1044q3941K9195k7992k00845M3013J81140
13820b06974M1878R0659j7360p9135P5801K24781r6517k16184j83758r3677K43486
13809b17000J95680J2734K5721k14741j40945J73205k8120j50996j00825L7436
13799d07851M6797J45588R7249k3344m5654m23874j00165J85525Q4548J00124
13789c41057J52112j73710J17852R9790J10670l9000l7155r4066K0181L3775J97852
13778D7244k17134k65912J5773J47738N1865q2450r3872p8363J48111Q3971j4170
13767b57199L09531j47724j11245Q5609j72306n0619p8646J53848J08097j39931
13757c00585q7826m6933k20776j1246J89861j0326O2747R9498M4629J22397j87604
$$ y = [-223414, -166319, -274356, -291585, -136500, -147544, -231485, -202290, -230282, -431127, -388114, -206974, -165096, -74437, -91797, -170932, -95131, 129650, 33133, -183051, -366809, -460486, -217000, -21320, -8586, 17135, -197606, -338551, -165346, -193466, -344462, -445287, -407851, -361054, -215466, -118217, -141561, -187215, -611089, -711254, -525729, -441181, -341057, -188945, -362655, -244803, -145013, -34343, -73343, -110498, -204564, -184383, -150608, 47244, -169890, -435802, -420029, -272291, -220426, -302876, -396748, -475111, -327000, -243029, -257199, 52332, -95392, -206637, -121028, -293334, -343953, -422599, -268751, -160654, -300585, -388411, -435344, -656120, -667366, -477505, -487831, -425084, -325586, -280957, -158560, -346164]
13746c46164J92689K69349j22458k42860l4706J29149l8196j16392L4078K59431
13736a6080J12702O7549l04188l71379L6267j8825N3579R7102m1630m7383k50859
13725f83145M2039K81556J11347J67857r5532r4286l404J04944L10765M0541r3428
13714H9254r6189j08083j26780n8727l58882N7239J69134J75737m1824P7466k0336
13703b41991J49685J12540n781n2672k5998R4122K85466J52799k24828l71076
13693a27734o5057J49236p6220j86450j45467j08771J39572N4215m4323L05275
13683a05724L4548k07231j76169Q4494J75500j61917n8420P0834O4678n0979R1561
13672b38825j14488j53157n9459K55533J76367j3584K1836k33644R6782J55500
$$ y = [-346164, -153475, 115874, -6584, -249444, -284150, -155001, -193197, -309589, -275511, -16080, 96622, 164171, -140017, -511396, -475129, -493954, -440375, -343273, -384903, -432286, -683145, -641106, -359550, -248203, -80346, -175878, -270164, -273568, -168624, 142141, 182682, 89254, -6935, -115018, -241798, -300525, -659407, -602168, -433034, -257297, -299121, -221655, -241991, -92306, 20234, 14453, -38219, -64217, 29905, 315371, 468170, 243342, -127734, -192791, -43555, -119775, -306225, -451692, -560463, -420891, -366676, -410999, -105724, -71176, -278407, -454576, -370082, -194582, -356499, -414919, -344085, -279407, -330386, -238825, -353313, -506470, -565929, -310396, -134029, -147613, -125777, -359421, -262639, -107139]
13662a07139K05769n0636j91623q9043j7784N8886j76097j13906J95003J9309
13652b67261n8619o855n8871M5204J03557r7105J8112m4775j22734N850Q2900
13641d00597K43300L09885P7019L9603J34130O6603k40553q4600Q8842M1568j14705
13630A60495M5861j6794r8211l29625k6588K60279M5401n6315r0161L547j15025
13619b17136j66828j20280j24958O1102K15745K3593N5613j41993L8818l9289
13609d15613J38259K33448O1437j69119k318J6899j13065m7823L4978J41635L783
13598a17499j42634j07851J77888j4043N495j56069k04920M0436K86017n8619
13588b91799M6778P1128K454j11963k36617j79412J39151K80277K53433N3856
$$ y = [-107139, 98630, 47994, -143629, -232672, -250456, -191570, -367667, -481573, -286570, -267261, -325880, -332735, -391606, -346402, -242845, -339950, -321838, -366613, -489347, -483497, -400597, -157297, 152588, 229607, 269210, 403340, 469943, 229390, 144790, 233632, 275200, 160495, 206356, 189562, 91351, -238274, -264862, -4583, 40818, -15497, -105658, -102111, -217136, -383964, -504244, -629202, -568100, -352355, -328762, -273149, -415142, -376324, -415613, -277354, -43906, 17531, -151588, -153906, -137007, -250072, -297895, -262917, -121282, -117499, -260133, -367984, -190096, -204139, -198644, -354713, -559633, -519197, -233180, -291799, -245021, -173893, -171439, -283402, -520019, -699431, -560280, -280003, -26570, 27286]
13578B7286j72559j65000J06342N1507K29374j0678j19290j36370k43707j08369
13568e41464k3423k00601J12724J71470K71235P1043j41638k0178J45483J36586
13558a8763k367j70353k11187M9576J26144j01329l9118J46J57632M4830K6334
13547a38455j1756o3400P6582K34014r7133j3258O9274j9671N362M1092j09762
13536b7111j35490k29673l6594K30589l240l3601q7383J88892J02375J58230j46881
13525a9887j08237J31196J96465k57523k06941q3624M6120J3732J36522J28226
13515b3951q8484k08678J04505K9232p2451J07052M4528K0651L896k62986j77353
13504e24039j76766N0416M8681J15917j6833Q1961J72837O048n0877L7837m2443
$$ y = [27286, -145273, -310273, -203931, -152424, 76950, 66272, -53018, -189388, -433095, -541464, -564887, -765488, -652764, -481294, -210059, -139016, -280654, -300832, -155349, -18763, -21130, -191483, -402670, -353094, -226950, -328279, -367397, -367251, -209619, -164789, -138455, -150211, -213611, -137029, 96985, -148, -13406, 55868, 36197, 41559, 82651, -27111, -162601, -392274, -428868, -198279, -201519, -235120, -322503, -133611, -31236, 126994, -19887, -128124, 3072, 199537, -57986, -264927, -348551, -302431, -288699, -152177, -23951, -112435, -321113, -216608, -187376, -259827, -152775, -108247, -87596, -83700, -346686, -524039, -700805, -650389, -601708, -485791, -502624, -420663, -247826, -241778, -292655, -254818, -297261]
13493b97261K4748J25529k25714j05948P7126J55047m8918J03153L40754J04388
13483B52904L8488k37604j82970J01038p9040J1536j95388N8452M70131L1170
13473B68717j89645j94840j09807M3588K3257J58262M0998p1418j21869J27259
13463b5498M99p790j65992J81195J29159k6649j40344M4712L6919l3346j12448
13452a19583m386J74450j06403p3518l0792O1954q6511k9837J4862R7786L7269
13441f4709k59666q698J05283J39756k5793l5798J01696J03793L0592N6400l13818
13430a70962p4126P4568j20029q2512L8389L8935K577O6346L09272L6203q5859
13419C2802N8947q5744j20646O8586J5135j45313J84355J15776l548J1477L2877
$$ y = [-297261, -272513, -146984, -372698, -478646, -401520, -246473, -295391, -192238, 148516, 252904, 291392, 53788, -129182, -28144, -107184, -95648, -291036, -232584, 237547, 268717, 79072, -115768, -225575, -181987, -158730, -468, 40530, -30888, -152757, -25498, -24999, -32789, -198781, -17586, 111573, 84924, -55420, -10708, 26211, -7135, -119583, -123969, 50481, -55922, -129440, -160232, -98278, -184789, -214626, -199764, -101978, -64709, -324375, -333073, -227790, -88034, -113827, -149625, -47929, 55864, 86456, 142856, -170962, -245088, -170520, -290549, -373061, -334672, -295737, -293160, -226814, 82458, 118661, 32802, 91749, 6005, -114641, -46055, -30920, -176233, 8122, 123898, 120350, 131827, 164704]
13408A64704j18001J07642q7533j68234J62598O1246J5810l6563m0649n8842J49551
13397A51729R0682P285K2909k10150l71045j34647J55568P5031O3180j50985R4423
13386b06020K15583p3028O4075J5663j97993o5866K50510J61652k15900k40848
13376b92172q9689k9268J86405K09697J44737k67761J13304K50261L2539M9605
13366C07658P6730P3876Q0934k4935j70174j81261K7966Q6271n427q355J49425
13355D12708j3934m0315O4999k7400J82950j08694j99063K4085j2397n0178o3449
13344A69312K44095M4369Q4022M14604K08676o5415j45226k6907O3654r6077m4500
13333H50607j15995j6049o4267j02915N8534J37460k2505o1163n5766r9l21153
$$ y = [164704, 46703, 154345, 66812, -101422, 61176, 122422, 138232, 101669, 61020, 2178, 151729, 242411, 249696, 272605, 62455, -308590, -443237, -287669, -212638, -149458, -300443, -206020, 9563, -63465, 610, 16273, -181720, -247586, 2924, 164576, -51324, -292172, -381861, -411129, -224724, -15027, 129710, -138051, -24747, 225514, 258053, 307658, 384388, 458264, 539198, 514263, 344089, 162828, 190794, 277065, 271638, 263283, 412708, 398774, 358459, 423458, 396058, 579008, 470314, 271251, 295336, 282939, 232761, 169312, 413407, 457776, 541798, 956402, 1165078, 1099663, 954437, 927530, 991184, 895107, 850607, 734612, 718563, 654296, 551381, 609915, 747375, 724870, 663707, 607941, 607842, 286689]
13322B86689K9984J13083J95799J02245q2410k25703K0615L4O9394J76954J21747
13311H08431j00003j1697n9685m0097j56169q7906M1851K24438K55988K83187
13301A158338k1804n9742J10023K31855j29639k38236l97361j15446J01552k1778
13291F17762k05797M5228J51178N8431J9890J09782j65243k18566j45984L5767
13281C02448J83743P2399j27755q9004J4187J51345j3608J0962m3769J9645J02704
13270E83297J5056j20851Q3752j21114j39005l5071K7574Q6282k5042k5706M1779
13259C70951O9478j04857J10929J47933O1149k80650k86838j29242J3208J25565
13249I7626k0680j47845j61974K1752K18880J42296K8885j1469j56l0413J26352
$$ y = [286689, 316673, 429756, 625555, 727800, 645390, 419687, 440302, 440336, 509730, 686684, 808431, 708428, 696731, 637046, 596949, 440780, 352874, 394725, 619163, 875151, 1158338, 1136534, 1076792, 1186815, 1418670, 1289031, 1050795, 653434, 537988, 639540, 617762, 411965, 457193, 608371, 666802, 686692, 796474, 631231, 412665, 266681, 302448, 486191, 558590, 430835, 341831, 356018, 507363, 493755, 504717, 460948, 480593, 583297, 598353, 477502, 561254, 440140, 301135, 266064, 293638, 379920, 354878, 329172, 370951, 440429, 335572, 446501, 594434, 655583, 374933, 88095, -41147, -27939, 97626, 76946, -70899, -232873, -211121, 7759, 150055, 178940, 167471, 167315, 136902, 263254]
13238B63254K0151k3272K8135p6829o5449j11808r5333l577J74849Q8643j4601
13227A84163j95602R8415k1506J04045J70576k44468l51814n2177K90620J53000
13217A35252j38728R8919p7940O6563N8872J0602j10978j85462j43784R4282p2266
13206b64668P7851p5982L0688Q0067O7730j08631m0060j57022q506M3789l8684
13195c93428j69174Q8039J74749O1861J4181J01469j4966j08483J17957K28564
13185A00769n7090K2257l9438J16959k9592J112N833j47908o7465J14879K97720
13174C18036l2247o2325N7109J15666O1533O1998r3699k52440R8560M6470j74626
13163A44035J39021L6937j48776p6132J44591j25996j34687o4550J61708r7487
$$ y = [263254, 283405, 260133, 288268, 211439, 145990, 34182, -61151, -64728, 110121, 198764, 184163, -11439, 86976, 65470, 169515, 340091, 95623, -256191, -308368, -17748, 135252, -3476, 95443, 17503, 84066, 142938, 153540, 42562, -142900, -286684, -192402, -264668, -186817, -262799, -232111, -152044, -84314, -192945, -233005, -390027, -398533, -354744, -393428, -562602, -474563, -299814, -237953, -223772, -122303, -137269, -245752, -127795, 100769, 43679, 65936, 26498, 143457, 113865, 114977, 120810, -27098, -94563, 20316, 318036, 285789, 223464, 280573, 396239, 457772, 519770, 426071, 173631, 272191, 318661, 144035, 283056, 319993, 171217, 95085, 239676, 113680, -21007, -85557, 76151, -21336]
13153b1336j11234L4285l8901P1633Q596Q4607j06962k45478J3991K33921K48602
13142A71724p4346N1619O3104J00744o8246j92683p0649j04387p3808L5655j30350
13131b91623J33952L0684J04168J78064r4780m3620J8191M2296p1463j9313O3022
13120D9578j7321o142J03804K20725j17456j71194J67771L10583N9782k06841
13110C93289n7480j12775j90357j13721R1260J27871K76628R2936N1113m1590
13100E17174j61671r7828R3878p5K47719R6556J02062k59956R9070K29169j52280
13089G13818j69957R6411J65777n6130j92235m0575j68599k8846J60451N1279
13079E31394Q352r8149l4820k8245K2975J2663j15163K7151Q2682L3007q739M018
$$ y = [-21336, -132570, -98285, -137186, -65553, -56957, 27650, -79312, -324790, -310799, -76878, 171724, 97378, 148997, 212101, 312845, 244599, 51916, -18733, -123120, -196928, -161273, -291623, -157671, -126987, -22819, 155245, 60465, 16845, 35036, 77332, 5869, -13444, 49578, 32257, 26115, 129919, 350644, 233188, 61994, 229765, 540348, 600130, 393289, 335809, 223034, 32677, -81044, 10216, 138087, 414715, 507651, 558764, 517174, 355503, 257675, 351553, 351478, 599197, 695753, 797815, 537859, 636929, 866098, 713818, 543861, 640272, 806049, 749919, 557684, 517109, 348510, 319664, 480115, 531394, 539746, 441597, 406777, 378532, 401507, 414170, 299007, 326158, 408840, 441847, 433108, 437126]
13067D37126J24939O962P673k08659j16544p0574O6746Q829l06583j95184J54043
13056i1226J37602o8787K32824J74802J17741l8952l0646K33351J15343n2799
13046G29253J02196P1176O0086j47899l29512m3115m60J28182K65816K09672J51369
13035A196764q5177k44855j83311n1305J02386Q9498J32680J97214j89859p6539
13025H87496j20679P7623K91866Q4354p784N6426J41317q5596M632O3810j78613
13014A214852n2509j02299J32505J846R4850J04457k6433m9595K04483J37567
13004A659724J90959M6067r0671k24553j24527P7512L8021j3543n9881J08902
12994A608010L87933J73540J10475j33045R9441Q3763K6666l798J34261j5213
$$ y = [437126, 562065, 569027, 576700, 368041, 251497, 180923, 247669, 256498, -50085, -245269, -91226, 46376, -22411, 210413, 385215, 502956, 464004, 433358, 666709, 782052, 729253, 831449, 902625, 962711, 814812, 485300, 442185, 441725, 569907, 835723, 1045395, 1196764, 1111587, 866732, 683421, 632116, 734502, 824000, 956680, 1153894, 964035, 887496, 766817, 844440, 1136306, 1220660, 1212876, 1269302, 1410619, 1325023, 1329655, 1393465, 1214852, 1162343, 1060044, 1192549, 1194395, 1289245, 1393702, 1367269, 1317674, 1522157, 1659724, 1850683, 1896750, 1806079, 1581526, 1456999, 1534511, 1572532, 1558989, 1499108, 1608010, 1995943, 2169483, 2279958, 2146913, 2246354, 2330117, 2356783, 2352985, 2487246, 2472033]
12984B472033p6450J98501M8284O9616K13860J43941L73396Q813J3225Q891L2413
12973C506523J19431J92269K55530K99190m4004n8550J25011K26433J38474J39044
12963D899351K32987K16346L73515L91315K78409K24502L06156M59598L62261
12954G744440K25243K54064O66385N07929M89224O89289Q92602P32030Q05918
12945A3007124Q17228J156669J129239J202809J458038J596503J431939K136583
12937B3936132K306149K196201K465045K724854K917706L196824L092847L058407
12929D5894165L144787L430020L428158K956425K525736K243117J682657J400476
12921F6705541P50452L47460J45217k18600m17739o70512o88085k15080j2199
$$ y = [2472033, 2395583, 2594084, 2642368, 2711984, 2925844, 3069785, 3443181, 3451994, 3465219, 3474110, 3506523, 3625954, 3818223, 4073753, 4372943, 4328939, 4270389, 4395400, 4621833, 4760307, 4899351, 5132338, 5348684, 5722199, 6113514, 6391923, 6616425, 6922581, 7382179, 7744440, 7969683, 8223747, 8890132, 9398061, 9887285, 10576574, 11469176, 12201206, 13007124, 13824352, 14981021, 16110260, 17313069, 18771107, 20367610, 21799549, 23936132, 26242281, 28438482, 30903527, 33628381, 36546087, 39742911, 42835758, 45894165, 49038952, 52468972, 55897130, 58853555, 61379291, 63622408, 65305065, 66705541, 67455993, 67803453, 67948670, 67730070, 67312331, 66641819, 65953734, 65738654, 65726455]
12912F5726455k00260Q0458N58877R70603Q98700J266515J873810K488559K912053
12903G6575770L311177L750741M621455N571811O540295P258422Q305930R414329
12895A25349930J0436145J1437311J2029483J2308603J2011272J1333237R891489
12888B04797470P891356N559197K761060k49134k899834n138085p169278q422520
12880A97130232r522695r700902r197260q601650p965748p232282o189166n208078
12872A33512451m054477l187869k650786j717293r32853l15555O60044J452447
12864A22766109K265526L165673M278741N170901N982895P377391Q464934R321772
12856A68793942J0150706J0382221J0098080R038181P474182N439745K830160
$$ y = [65726455, 65526195, 65606653, 66165530, 67136133, 68034833, 69301348, 71175158, 73663717, 76575770, 79886947, 83637688, 88259143, 93830954, 100371249, 107629671, 115935601, 125349930, 135786075, 147223386, 159252869, 171561472, 183572744, 194905981, 204797470, 212688826, 218248023, 221009083, 220759949, 217860115, 212722030, 205552752, 197130232, 187607537, 177906635, 168709375, 160107725, 152141977, 144909695, 138720529, 133512451, 129457974, 126270105, 123619319, 121902026, 120969173, 120653618, 121313662, 122766109, 125031635, 128197308, 132476049, 137646950, 143629845, 151007236, 159472170, 168793942, 178944648, 189326869, 199424949, 208463130, 215937312, 221377057, 224207217]
12849B24207217j72532l417560o210798q659927j0509409j1796244j2285623j2359274
12841A58795850j2002723j1368391j0215139r039910q186094p395316o691632
12834I3896645n496566m707435l977555l397709k922848k392215j818895j618094
12826F7565328j243056q59468k91975j5395K30685O27384O82469Q04992Q30857
12817F8331821O54720O10885M57543j3805m24592j000517j634842k197281k606504
12808F2177428k658535k929212l289559l456616l365966l362837l343501l083145
12800C6688057k940480k725952k356991k046925k088696j743427j685228j423691
12792A9676667j455879j209704j088619r37936q19868p58893q40878o30046o07011
$$ y = [224207217, 224034685, 220617125, 214406327, 205746400, 195236991, 183440747, 171155124, 158795850, 146793127, 135424736, 125209597, 116169687, 107983593, 100588277, 93896645, 88400079, 83692644, 79715089, 76317380, 73394532, 71002317, 69183422, 67565328, 66322272, 65462804, 65170829, 65155434, 65386119, 66013503, 66695972, 67500964, 68331821, 68986541, 69597426, 70054969, 70041164, 69616572, 68616055, 66981213, 64783932, 62177428, 59518893, 56589681, 53300122, 49843506, 46477540, 43114703, 39771202, 36688057, 33747577, 31021625, 28664634, 26617709, 24529013, 22785586, 21100358, 19676667, 18220788, 17011084, 15922465, 14984529, 14164661, 13405768, 12564890, 11934844, 11327833]
12783A1327833p00678l05307m92169n58284n71707l92783k28174k97901k28606
12774G552224k89604k37600k68581m07054m41991P0012o0686k46333j07047J4835
12764E578175k47921k41779k51991n22525m02633k55582p8193J15717j26389n5047
12754C511832p9502j88337K32272N4547l6504k64860j68040j02012j64990M1598
12744B836004r7951q7648Q6935K5440j39452j49927j25600Q8604P872r9726j6666
12733B327885j68965K50331J00191o0992j52449l4680j9803k14241r9130Q0561
12723B008708P1798j40982k42252l13831j42497O3552p460K37527O8789o6135
12713A537217K6446R2732P5499K13554q0000j86663j10905j37545j41540j82680
$$ y = [11327833, 10627155, 10321848, 9829679, 9271395, 8699688, 8306905, 8078731, 7780830, 7552224, 7262620, 7025020, 6756439, 6349385, 5907394, 5977406, 5916720, 5670387, 5563340, 5578175, 5330254, 5088475, 4836484, 4313959, 3911326, 3655744, 3577551, 3693268, 3566879, 3511832, 3432330, 3243993, 3476265, 3530812, 3494308, 3229448, 3061408, 2959396, 2794406, 2836004, 2738053, 2650405, 2737340, 2762780, 2623328, 2473401, 2347801, 2436405, 2444277, 2344551, 2327885, 2158920, 2409251, 2509442, 2448450, 2296001, 2261321, 2241518, 2027277, 1928147, 2008708, 2080506, 1939524, 1697272, 1383441, 1240944, 1304496, 1297036, 1534563, 1603352, 1537217, 1563663, 1656395, 1731894, 1945448, 1865448, 1678785, 1567880, 1430335, 1288795, 1106115]
12703A106115J05167J42682k3036J19907J15210j54709n9420K5364Q9837K9214
12693A496331k42747k24957j26990P0047L01818q0231O0637j41120k19385j07774
12683G85629o3096O9838n7189J08003J91085N3285K9746O2895N0490j89295J71146
12672A212537j64984M1623K11247M6485p9934q1228R0431j04684p3430j52023
12662I46040k7592j2107J27033j24278j30545k2297n3254J0357R3197L8374L7620
12651H82548j35573j19161p8540O6342J56874R4950k6038m3527j48671m0355J07920
12640G16769J12094L5136k313L5731k076k32222j35870L00643J50856k25496l6208
12629G17044M0141j31841p729l4745k31404j42527O2103J19733K47563P3978j23675
$$ y = [1106115, 1211282, 1353964, 1330928, 1450835, 1566045, 1411336, 1351916, 1377280, 1467117, 1496331, 1253584, 1028627, 901637, 971684, 1273502, 1193271, 1253908, 1112788, 893403, 785629, 722533, 792371, 735182, 843185, 1034270, 1087555, 1117301, 1180196, 1230686, 1041391, 1212537, 1047553, 1089176, 1300423, 1346908, 1266974, 1185746, 1276177, 1171493, 1098063, 946040, 918448, 906341, 1033374, 909096, 778551, 756254, 703000, 713357, 806554, 844928, 882548, 746975, 627814, 549274, 615616, 772490, 867440, 841402, 797875, 649204, 608849, 716769, 828863, 863999, 861686, 897417, 895341, 663119, 527249, 827892, 978748, 753252, 717044, 757185, 625344, 617615, 582870, 351466, 208939, 271042, 390775, 638338, 712316, 588641]
12618E88641o9164j00910K48N4987r010O9743r4220j36326J1249Q5981K5267J97738
12606F24224K9937p1545P7259K5627n6863K1513o4715L4552Q2758n0791m30843
12595B21113j61056R3809J57694k9938j45515P3842J32578j54281J5899K33523
12585D37668J18207j25841n7311O4481N4260K39129R9482l28220l08095j53000
12575D0760l6073J37373J45632n4919K4017L14948J16425Q2575O1511o0203l13874
12564D58172j13394j800J27612k46026q7363K50443r3205p4929j7745j54247K90542
12553C38060K33814j91016l91833j7262K27411l9282J9658L20156J93895q8484
12543F05117j2528j66605j12060m0141l567o3851J40603k6161j14501m8539j2788
$$ y = [588641, 519477, 418567, 418815, 473802, 464792, 534535, 440315, 303989, 315238, 401219, 426486, 624224, 654161, 582616, 659875, 685502, 628639, 650152, 585437, 619989, 702747, 651956, 221113, 60057, 153866, 311560, 281622, 136107, 209949, 342527, 188246, 204145, 437668, 555875, 430034, 372723, 437204, 491464, 730593, 830075, 501855, 193760, 40760, 4687, 142060, 287692, 232773, 256790, 571738, 688163, 770738, 832249, 772046, 458172, 344778, 342978, 470590, 224564, 137201, 387644, 294439, 219510, 201765, 47518, 338060, 571874, 380858, -10975, -28237, 199174, 159892, 179550, 499706, 693601, 605117, 592589, 425984, 313924, 273783, 270216, 206365, 346968, 320807, 206306, 157767, 144979]
12532A44979K8492q5270J16365K07097l4040j95134N78L0002J1306p4793O908
12521A56490p4433k35591L2688K50089k6464l749j14334J10856M58241N4460l28198
12510B80055j78094r518J26831m3785J11749J91445q2228k85199k4267J4119J71170
12499B72278r6294J8594J07566p2900N8919j59505J559M9986j22585M8855J80358
12488B86831P4636j05849j9855J17561j63935k03817K416L37660j01139o077K47839
12477D66271J91881n1696j40657k52406j9494J87881L3442m3579r375Q496j3261
12466C57503J3477J0724j84516J05126k0934m934K01314j36804K390L02919J03356
12455G49621j47044j14813j39340k28236J02104J63634J73214j23182j77118J20136
$$ y = [144979, 173471, 88201, 204566, 411663, 377623, 182489, 183067, 213069, 224375, 149582, 156490, 82057, -153534, -120846, 129243, 102779, 99030, -15304, 95552, 553793, 608253, 280055, 101961, 92443, 219274, 175489, 287238, 478683, 396455, 111256, 86989, 101108, 272278, 175984, 194578, 302144, 229244, 288163, 128658, 130217, 180203, 57618, 106473, 286831, 361467, 255618, 235763, 353324, 189389, -14428, -12012, 325648, 224509, 218432, 466271, 658152, 606456, 465799, 213393, 193899, 381780, 415222, 371643, 362268, 370764, 357503, 370980, 381704, 197188, 302314, 281380, 276446, 477760, 340956, 343346, 646265, 749621, 602577, 487764, 348424, 120188, 222292, 385926, 559140, 435958, 258840, 378976]
12445C78976J0753o4195m1143K16062L88177R1385j33387J06154O4096j98209
12435H18669k8916J53509J22447K808M0657K3870n8685Q2173J16604j08033o6129
12424A098974M6406J180J64767L1347p448J32444J4807k42660j1543j83381j74670
12413H70223j06069r6970J46181N6785j45723k7587N0911O3598J85982j40745
12403H56586n5873J06476k762j38769J15515N9581J46240J68877o8648n5069L1202
12392A163356o5547j58336M0285J16307M831n5897j86414O9854j81885l13252
12382D33302n395j077j00063L3491j0912q9828k2354K24064J43823J03908k3901
12371F85058o3027j36991q4828J30010m2899j60371l03070k5745P6560k6152p155
$$ y = [378976, 389729, 325534, 284391, 500453, 888630, 980015, 846628, 952782, 1016878, 818669, 789753, 943262, 1065709, 1068517, 1109174, 1133044, 1074359, 1156532, 1273136, 1165103, 1098974, 1145380, 1146560, 1311327, 1342674, 1335226, 1467670, 1482477, 1239817, 1228274, 1044893, 870223, 764154, 667184, 813365, 870150, 724427, 696840, 747751, 811349, 997331, 856586, 800713, 907189, 904427, 765658, 881173, 940754, 1086994, 1255871, 1187223, 1132154, 1163356, 1097809, 939473, 979758, 1096065, 1100896, 1044999, 858585, 928439, 746554, 433302, 427907, 426830, 326767, 360258, 349346, 259518, 237164, 461228, 605051, 708959, 685058, 622031, 485040, 400212, 530222, 487323, 326952, 23882, -1863, 74697, 48545, 41390]
12360D1390M3251L01341L21817M882j85674O3648R6429j33279l3572q4985O9273
12349E04521N141k01479k15022n7900R7307M6880j01274l3375J57428J706p8656
12338A25277n2448J92317J5168j16739m1843m169j71462m0836L29236o7222j12297
12327E4982N3424l09911j87390q9094J04842K07510K85743O1932o1898j06992
12317A3148j2974Q9957J549L5949n69O3550J5579N8276l01925j13566J25810J09768
12305H4552K8783j44606J61716J51673k08007j80171j85954p2212J6234p9501
12295d27493P6771L5436J96661j1490q7894j4279K0926J54830l6765l07665R654
12284c91308K4751K66496J54785j79893k49974R1639K28402J71559M0335J66965
$$ y = [41390, 84641, 385982, 707799, 712681, 527007, 590655, 687084, 553805, 520233, 435248, 504521, 509662, 308183, 93161, 35261, 132568, 179448, 78174, 44799, 202227, 203933, 125277, 72829, 265146, 280314, 163575, 121732, 117563, -53899, -94735, 234501, 167279, 54982, 108406, -201505, -388895, -477989, -373147, -165637, 120106, 182038, 120140, 13148, 174, 90131, 91680, 127629, 127060, 190610, 206189, 264465, -37460, -151026, -25216, 84552, 113335, -31271, 130445, 282118, 74111, -106060, -292014, -364226, -347992, -427493, -350722, -315286, -118625, -130115, -218009, -232288, -211362, -56532, -93297, -400962, -391308, -366557, -100061, 54724, -125169, -375143, -283504, -55102, 116457, 156792, 323757]
12274C23757N627J54529J7328j28850j25377j59389q0970P7522J62198k08960
12264C7415k03070k8420j06013L8667L86149J16765j10324K33157k59689k22902
12254a18265l64328j50609K7581J54674K17012M8225k7922j2469O6739q120J6609
12243a50873M1511n835J03750o0950k6785k2032K1564J92865J67200p8008j25046
12232E7361j86716p3301M881J60169j6204n9299Q6223j2924J76626J249k29497
12221i1432j03555O0933Q7107L3249K03108o3302l1524N1838j38420j86223j252
12210a79473L4713M1938Q5624N38R2262j69345k74113j90784Q2391J2757Q9090
12199c74402K18618L42827J49206j21050j47826j13784k8509Q6045l6932p514
$$ y = [323757, 329384, 483913, 501241, 372391, 247014, 87625, 6655, 84177, 246375, 37415, -165655, -194075, -300088, -261421, 124728, 241493, 131169, 364326, 104637, -118265, -482593, -633202, -605621, -450947, -233935, -185710, -213632, -226101, -159362, -167482, -150873, -109362, -115197, -11447, -72397, -99182, -121214, -99650, 93215, 260415, 182407, 57361, -129355, -202656, -197775, -37606, -53810, -113109, -26886, -39810, 136816, 138065, -91432, -194987, -134054, -46947, -13698, 189410, 126108, 94584, 146422, 8002, -178221, -179473, -144760, -102822, -17198, -16660, 75602, -93743, -367856, -558640, -476249, -463492, -374402, -155784, 187043, 336249, 215199, 67373, -46411, -74920, 11125, -25807, -33321]
12189c3321k1170J41508L5415j55780J25587n6318j89734L6638P0195O1629J20739
12178A35388o9839q8525j64017j02335L7994J02859O1055q8505J47924j00565
12168a28566M9341J82813O6761l7191j01178R3596P5477m4966n1414J1923O7559
12157A84155k2594j04878K48596j01938L5505Q7629k10219j66626J73912N3023
12147A76565q1638j458n0621M1632N9346P6050L4009k25624N206O690N6543o3615
12135C3085o8735Q0314j46191j06567j38738j0064J28070q6587m6696P3703K26096
12124f2310P3906k7084j88126K9586j208R8738J14669p4950J05995o6576q2171
12113g9531j7877L9799l8090J42605M4169J17566K2939j79985k19090p1366j4024
$$ y = [-33321, -54491, 87017, 122432, -33348, 92239, 35921, -153813, -117175, -46980, 14649, 135388, 65549, -22976, -186993, -289328, -251334, -148475, -87420, -175925, -28001, -128566, -79225, 103588, 170349, 133158, 31980, 125576, 201053, 156087, 104673, 116596, 184155, 161561, 56683, 305279, 203341, 238846, 326475, 116256, -50370, 123542, 176565, 94927, 93469, 42848, 84480, 143826, 219876, 253885, 28261, 33467, 40157, 96700, 33085, -35650, 44664, -101527, -208094, -346832, -356896, -228826, -315413, -362109, -288406, -62310, 11596, -15488, -203614, -174028, -175236, -76498, 38171, -36779, 69216, 2640, -79531, -97408, -57609, -95699, 46906, 91075, 208641, 231580, 51595, -167495, -238861, -252885]
12102b52885M7823r4531K3240J481j25268q422l000Q2900J39478Q3345N7542K692
12090d5605q6495n7031J4384N1578r6982N3462J49012K89662O8711q0653l1224
12079B28819j05461J9194k01873J47739J21505M1988j79961m8234J83181O0581
12069B67478j24785j62924M0373p6639j53748O0943J14944Q1912j2240l6164p8755
12058g9605o0858j39486N4987j5305m8036P9267K06678m5431k58586j53692K61859
12047a98208J22749j17980L3655j16757j22166Q4510L6365K1072P0625K8383N0975
12036a06777K14240j17411l8006l1926l40919O405Q0941P4824J76271J68420P8392
12025A64454J80325L9169l28388k40953K00769l4186J0807r8719l4583M8697N7106
$$ y = [-252885, -205062, -299593, -276353, -274872, -400140, -408562, -411562, -328662, -189184, -105839, -48297, -45605, -132100, -189131, -174747, -123169, -220151, -166689, -17677, 271985, 340696, 260043, 228819, 123358, 142552, -59321, 88418, 209923, 251911, 71950, 23716, 206897, 267478, 142693, -20231, 20142, -56497, -210245, -149302, -34358, 47554, 35314, -850, -79605, -140463, -279949, -224962, -240267, -288303, -209036, -2358, -47789, -306375, -460067, -198208, -75459, -193439, -159784, -276541, -398707, -314197, -277832, -256760, -186135, -157752, -106777, 107463, -9948, -47954, -79880, -420799, -414394, -333453, -258629, -82358, 86062, 164454, 344779, 383948, 55560, -185393, 15376, -18810, -8003, -106722, -141305, -92608, -35502]
12014c5502J00807j33503j37375N0396o1057m6950K4591K12510J86775l24136
12004a63444j7334L3540j05609J0264L9085M0034k8222j19206l948J64796O5673
11993h4371N9532P0560L3493r8811k03291P7842K54830P1135j01087q7545q6662
11982i4375J24770k2130j77353N084m0212j04921J17800J41867m0374l033O5265
11971b7612j07347k78478M3159L5187J10677N8804P8449l9231k78998k54115o9282
11960g28787J62810q1229J35175o602L1704Q9838l9436r6181R7006O4493J1523
11949c59686k27937l5259J51389R9216O3421L3277J21404J22478J65428r8526
11939C5205R5127J049p4444k01606m4896N1408R1228J9079J61851m3302p0958
$$ y = [-35502, 65305, -68198, -205573, -155177, -216234, -263184, -238593, -26083, 160692, -163444, -180778, -147238, -252847, -242583, -203498, -163464, -191686, -310892, -314840, -150044, -84371, -24839, 45721, 79214, -19597, -222888, -145046, 109784, 180919, 79832, -7713, -94375, 30395, 8265, -169088, -164004, -204216, -309137, -191337, -49470, -89844, -92877, -27612, -134959, -413437, -370278, -335091, -224414, -165610, -87161, -126392, -405390, -659505, -728787, -565977, -647206, -512031, -518633, -486929, -397091, -436527, -532708, -435702, -371209, -359686, -587623, -622882, -471493, -372277, -308856, -275579, -154175, -31697, 133731, 35205, 130332, 131381, 56937, -144669, -189565, -138157, -46929, -27850, 134001, 90699, 19741]
11928A9741J37553k1877r6538L3339J23031j82756N3703P2388j67116k22785j52545
11917d03862J17104L37117K64473M3397l7834k61299J09392o7177M2775n1379
11907I2707o2234L3210n7526j08203j1170n2560k04682j54415M1203K40913j8766
11896b61523M3878J21646K3379j18887j08396l4321L677R0304r8358J20384k9119
11885b47336j82668j37144K18517K14430J01330j18365o5666O5665l9917J59288
11875c1866j4075j62044n1014J50383P8992k96443k7193J55102j88045l2040k1416
11864d39659K01752j50651j64737q541P8917K86638J82782l2162L2115j83296
11854a96842j48548J99205K7163m2774J45812J25775j3466J96958r9140l51561
$$ y = [19741, 157294, 135417, 38879, 72218, 195249, 12493, 66196, 138584, -28532, -251317, -403862, -286758, 50359, 314832, 358229, 320395, 59096, 168488, 101311, 144086, 92707, 30473, 63683, 6157, -102046, -113216, -165776, -370458, -524873, -483670, -242757, -261523, -217645, -95999, -72620, -191507, -299903, -334224, -330547, -240243, -338601, -218217, -247336, -430004, -567148, -348631, -134201, -32871, -151236, -216902, -151237, -191154, -31866, -45941, -207985, -258999, -108616, -29624, -326067, -353260, -198158, -386203, -418243, -439659, -237907, -388558, -553295, -561836, -482919, -196281, -13499, -45661, -13546, -196842, -345390, -146185, -119022, -161796, -15984, 109791, 96325, 293283, 194143, -157418]
11844a57418j64944k20180l1389N3068K79926M1931o3586k30926L5768J44970
11834c12780K30289j10969k74815J08670r9844j31281K49135J27666M3732J56031
11824a4166J36792r4467o9749j34817M3208J21734Q0205J6205j90812j6560p5023
11813a97450J40612k5148j23617O7376M9418k04681j49449P5446j2102M0901P8320
11802b60374n3648J799M7104J6349O5345K49889K0945j40790j67782k6638M8773
11791a99028n5995r3586m6161K6302L26582K9358j87774N7362P366n8691n5528
11780b49793j30682K17785K22488K8846M4157q8712p1724l11310J6296r120O865
11769c24904K13024N6413K20355l763k35587j18843p1402J358j34296J14514K67546
$$ y = [-157418, -322362, -542542, -573931, -520863, -240937, -199006, -262592, -493518, -457750, -312780, -82491, -193460, -468275, -359605, -459449, -590730, -341595, -213929, -170197, -14166, 122626, 28159, -41590, -176407, -133199, -11465, 68740, 84945, -105867, -122427, -197450, -56838, -81986, -205603, -138227, -88809, -293490, -442939, -367493, -379595, -338694, -260374, -314022, -312223, -265119, -248770, -183425, 66464, 87409, -53381, -221163, -247801, -199028, -255023, -348609, -394770, -368468, -41886, -12528, -200302, -142940, -135574, -194265, -249793, -380475, -162690, 59798, 88644, 132801, 44089, -27635, -338945, -322649, -331769, -324904, -111880, -55467, 164888, 161125, -74462, -193305, -264707, -263349, -397645, -283131, -15585]
11758a5585R3162J43244Q2821p5403k31252j1003o0244j11988J464n7083J30840
11747a11027r0966o6352j81822k2437L02878L1147k97556k0777L2317L48208J87656
11736A11269j80738N6241K85210J25334k09381j47484j62160M8773K28665J04280
11726B60009n2319o8580q9589n1311k3658O9812P9660J5848n8505k39362l1993
11715a89988K53765p6208j88171j97712J27613J10228L3918K8812M2327j2683
11705f8099o6506k7198j11437j72305J36407R1326J76112J48974j59468l8639
11695i0833q2158j6170j28660n4358J4908K00793R1953N5263k5155o4886M6233
11684e3070K57794m5006k04718k93518j20840j06248K00021j5137J6296M7139
$$ y = [-15585, 77577, 220821, 303642, 228239, -3013, -14016, -74260, -186248, -184784, -241867, -111027, -201993, -268345, -450167, -472604, -169726, -138579, -436135, -456912, -424595, -76387, 111269, -69469, -13228, 271982, 397316, 187935, 40451, -121709, -72936, 155729, 260009, 207690, 139110, 49521, -1790, -25448, 44364, 124024, 139872, 81367, -157995, -189988, 63777, -12431, -200602, -398314, -270701, -160473, -126555, -97743, -55416, -68099, -134605, -161803, -273240, -445545, -309138, -217812, -41700, 107274, -52194, -90833, -172991, -189161, -317821, -372179, -357271, -156478, -64525, -9262, -34417, -99303, -53070, 204724, 159718, -45000, -338518, -459358, -565606, -365585, -380722, -364426, -317287]
11674c17287J61192Q8467o1387k9155K64039K6395J1388M14026J06758j87212
11664D77224j39648n3869M9194k33827j58945K00449j5959p1801J5359O9467j88837
11653e1193j8746j43279J0575J98632l5686J1053j01086j67722k11537K36065
11643b72924J38417N6759r4685R1300K2654N8125r866r9534j55982q1217J6431
11632c30522Q6983L20344K6058j5785M573K0780q934J20404L41883P07127J100167
11621B373078J633665K025642J306240K00269o96826j447297j580220j434940
11613B379611r37782n27159k16349j10410l18003j21135O0115P8541J0879k98375
11603f7R6784K8107l1823J47496j70575l17596M3263r4564k20293R8360J76060
$$ y = [-317287, -156095, -67628, -129015, -158170, 105869, 132264, 143652, 557678, 664436, 477224, 337576, 283707, 332901, 99074, -59871, 140578, 124619, 52818, 68177, 137644, -51193, -69939, -213218, -202643, -4011, -39697, -28644, -129730, -297452, -508989, -272924, -134507, -77748, -172433, -81133, -58479, -354, -10220, -109754, -265736, -346953, -330522, -243539, 76805, 102863, 87078, 91651, 112431, 103497, 223901, 565784, 1272911, 2373078, 4006743, 6032385, 7338625, 7538894, 6842068, 5394771, 3814551, 2379611, 1441829, 914670, 698321, 587911, 269908, 148773, 208888, 287429, 298308, -67, 96717, 124824, 93001, 240497, 69922, -247674, -204411, -298975, -519268, -420908, -244848]
11592b44848J75325J8333J32415J8518j04694k08407j99595j18081J05248K56385
11582a69401n4422k19409J63473J51605M9976j68649R7294M2585j65657j55047
11572d27652k041O4748L00957J49142j84440k41059k94352J7056J22864J57764
11562c37013q1560k7241J67393J23003p8223j65918J99812J47469k22412J31667
11552a43023K10830J06589q778k42472J56668M3090k05202j09853j529J0017J04468
11541g9195J75997j43529k81760n228J42423K2839k916N3598j7355L3455j33353
11530b35024P1688P8351O5729q438J8667O9885j4763j44329r0941K06970K2558
11519D0353k03948J14102L99832P2551j12429j39452l5800M9472k01772q6247
$$ y = [-244848, -69523, -51190, 81225, 99743, -4951, -213358, -412953, -531034, -425786, -169401, -223823, -443232, -279759, -128154, -78178, -246827, -149533, -106948, -272605, -427652, -429693, -364945, -63988, 85154, -99286, -340345, -634697, -617641, -494777, -337013, -418573, -445814, -278421, -155418, -233641, -399559, -199747, -52278, -274690, -143023, 67807, 174396, 165618, -76854, 79814, 122904, -82298, -192151, -193680, -183663, -79195, 96802, -46727, -328487, -333715, -191292, -168453, -171369, -117771, -135126, -101671, -235024, -163336, -84985, -19256, -27694, -9027, 60858, 46095, -98234, -189175, 17795, 40353, -163595, -49493, 350339, 422890, 310461, 171009, 135209, 184681, -17091, -103338]
11509a03338r7596O0286o9067j42872o1432J71044J65284p3761r7473n3036j45427
11498d47388K01299M18073J93690j16780k54462j5345J12964q8798r4630J21851
11488C0474J04374k29732k54856M5167k2124J28650J62709m0992J84120O307k86417
11477a72320j49578r145r4419l9758M8202K6297o168K871J86517K58443L5756
11466H6698J2246K45390K67768J79775K19756P9353l5017L8935o0997k38750j99746
11455E95411k26422M9236n0394k65576k48978K7072J38117j11770j35963j92102
11445d21369k6073J46845K34154J66240j1411j15190N0576n4549l4410k3764k71225
11434c60176l6513K17896J54294k7866k7906M1826P132M5865o1004M0295n1761
$$ y = [-103338, -200934, -140648, -209715, -352587, -414019, -242975, -77691, -151452, -248925, -301961, -447388, -246089, 171984, 365674, 248894, -5568, -20913, 92051, 3253, -91377, 30474, 134848, -94884, -349740, -304573, -326697, -198047, -35338, -76330, 107790, 114097, -172320, -321898, -331043, -425462, -465220, -417018, -390721, -396889, -394018, -207501, 50942, 86698, 98944, 344334, 612102, 791877, 1011633, 1090986, 1055969, 1094904, 1033907, 795157, 595411, 368989, 418225, 367831, 102255, -146723, -119651, 18466, -93304, -229267, -421369, -447442, -300597, -66443, 99797, 88386, -26804, 23772, -30777, -65187, -88951, -360176, -396689, -178793, -24499, -52365, -80271, -38445, -31313, 14552, -46452, -6157, -57918]
11423e7918O6154l0589k14444J26708j73539j66587n228J89953J18070J9360j39215
11412b67275j41308k2603R1684O1347j38328o7105k9948J80518J91980J19801
11402b1237J41839n5572k81487p4133r498L15K39614J90379o4416j93698j35771
11391b63665o2065M4505l5633k0445J09232j9889p2869m9953m8133R3180p9223
11380d04958p0464m8836k4555J84647K39471l2871Q846M5563K9137j20200P9694
11369a14526j3509O7717l1505J35328k49959K7148K10272l5071p7327J33058j0274
11358D1352j11586m3746n0100p1474R9341J01438J27517L6333l7346q9334j42671
11347a40276k13931N9835Q2587n0271K42656J13371j6308P3576q0032r2493j26191
$$ y = [-57918, 8236, -22353, -236797, -110089, -283628, -450215, -455443, -265490, -147420, -128060, -267275, -408583, -431186, -339502, -278155, -416483, -483588, -513536, -333018, -141038, -21237, 120602, 65030, -216457, -290590, -300088, -299773, -60159, 130220, 65804, -127894, -263665, -325730, -281225, -316858, -337303, -228071, -247960, -320829, -370782, -418915, -325735, -404958, -475422, -524258, -548813, -364166, -124695, -157566, -148720, -103157, -74020, -194220, -114526, -128035, -60318, -91823, 43505, -206454, -179306, 30966, -4105, -81432, 51626, 41352, -70234, -113980, -164080, -235554, -136213, -34775, 92742, 129075, 91729, 2395, -140276, -354207, -294372, -211785, -262056, -19400, 93971, 77663, 151239, 71207, -21286, -147477]
11336a47477J03850R8510j34055j64216p1744J5468n598q0138p2966M351k2723
11325d76738Q9917R8883K04970Q7422k60791j76121q5996j9822N7244P9750l1622
11314d32904J32437l2868k1985R5049J25743O1685j09438o2820J30634K07245
11304I2778J9816R4368j74877k64282j73108j24447J7580p4604J5052O6404M3480
11293d61840M96M262Q8532j24160J86186j39093q5617K87437J08555j48026J71342
11282a11926P3529P5501M2386O9451o3545j95263R6007K7028J52183J21158k85182
11271A327r6470q0884j91839n8572R1296J28803J0157k5746J82329R2943r6826
11260d3482O1301K3533j04479o9237k1068J9965J21551J3748N7371k3388K1661
$$ y = [-147477, -43627, 54883, -79172, -243388, -315132, -299664, -305262, -385400, -458366, -454015, -476738, -386821, -287938, -82968, 4454, -256337, -432458, -518454, -538276, -481032, -401282, -432904, -300467, -333335, -355320, -260271, -134528, -72843, -182281, -245101, -114467, 92778, 112594, 206962, 32085, -232197, -405305, -529752, -512172, -586776, -571724, -505320, -461840, -461344, -457082, -368550, -492710, -306524, -445617, -531234, -243797, -135242, -283268, -111926, -38397, 37104, 79490, 148941, 85396, -109867, -13860, 13168, 165351, 286509, 1327, -95143, -176027, -367866, -426438, -335142, -206339, -196182, -221928, -39599, 53344, -43482, 17819, 41352, -63127, -132364, -153432, -133467, -11916, 1832, 59203, 35815, 57476]
11249E7476k66416k2569K63438L0169N3270p6476n7481j0890j46523K7093K47968
11238I9059M7951k27246j90437j2683k8162J8616K81359R5916k88269j81073j34346
11227e19315J38346L00524L3637R2484m1059L2091L3026l5879P7337R9778j90434
11216B0536j88300L1654J32720k17350q7572K30759k2001Q8739j09338j74377
11206b94530J8734m5869J9691n1282J33212P6394l64400p2963Q0972N5051Q6391
11195c58599L3114J66927N6698j04874L7978o2285j8477q2340p7628l2870K4817
11184d17539l2833M2260L69409J0114K1703n4057j90872n9144J40799J39328k79164
11173c09996k28984L3802J14285M2218K8398J13342M5126k99912l205K88186p8457
$$ y = [57476, -208940, -231509, 31929, 62098, 115368, 38892, -18589, -29479, -176002, -148909, 99059, 147010, -80236, -270673, -283356, -311518, -292902, -11543, 84373, -203896, -384969, -519315, -380969, -80445, -46808, 45676, 4617, 36708, 69734, 33855, 111192, 210970, 20536, -167764, -136110, -3390, -220740, -308312, -77553, -99554, -10815, -120153, -294530, -275796, -321665, -301974, -353256, -220044, -143650, -508050, -581013, -500041, -444990, -358599, -325485, -158558, -101860, -206734, -168756, -231041, -249518, -331858, -409486, -442356, -417539, -450372, -408112, -38703, -28589, -6886, -60943, -251815, -310959, -170160, -30832, -309996, -538980, -505178, -390893, -348675, -320277, -206935, -161809, -461721, -464926, -176740, -255197]
11162b55197q8048J06047J74966m6751j26104J60341j42380n7223k943k6945Q4113
11151b20124j35267r9171q3596k14792M2160K44519M595L1996J87488J1350j21799
11140c52641j8812J36358m7831k3434r2287J29074K76661M4727k16990k37411
11130d02586j05336N2184J26202K8645n901N8049j35299o9925J64168N0235p4359
11119c13923J38424Q6925k50045N1996K04188J78182N8883k10371j53854j77510
11109c87105j66035Q0403J48602J21224P2867r9800j02369l07261k01404J16655
11099g24223K20395J79279k39766o3819q0382q8827L5451J61423k7478M2823K68452
11088c16672J05376j49010k14828R7210K25994M6437n2037o8291Q2192J29990
$$ y = [-255197, -343245, -237198, -62232, -108983, -235087, -74746, -217126, -274349, -277292, -304237, -220124, -355391, -454562, -538158, -752950, -710790, -466271, -461676, -429680, -242192, -230842, -352641, -371453, -235095, -282926, -306360, -398647, -269573, 7088, 51815, -165175, -402586, -507922, -455738, -329536, -300891, -306792, -248743, -384042, -453967, -289799, -239564, -313923, -175499, -88574, -338619, -286623, -82435, 95747, 154630, -55741, -209595, -387105, -553140, -472737, -324135, -202911, -130044, -229844, -332213, -639474, -840878, -724223, -503828, -324549, -564315, -628134, -708516, -797343, -761892, -600469, -627947, -585124, -316672, -211296, -360306, -575134, -477924, -251930, -205493, -257530, -325821, -243629, -113639]
11078a13639O5733j7324o9819J89546L6862j64961q030k02992k4698J23878r790
11067a95234P46J44888j17179q1650q1606M4096J65359l3666L7710J28631n4168
11056d2073r1178j0866Q1557m691L2907r812Q6685j37014J083j90466j40056J87754
11044b36170N3968p4110M06464k8102k03899J25906Q6973J74806N7063J3299o9252
11033C06946R6940M0449M4006R8535j13817k7535J78026P2026Q3937Q7906J19206
11022I86625m527k96826k76256R9006K94617j02032q4378M65930K42937K41340
11012A566436j38028l58888J3214k03395j92187l7373q4588k4136k0715l191K94071
11001H11220M0232K15773J04346L376m63217m24757j38493l6791J25492j06765
$$ y = [-113639, -47906, -65230, -135049, 54497, 91359, -73602, -81632, -284624, -309322, -185444, -195234, -194488, -49600, -166779, -248429, -330035, -285939, -120580, -154246, -116536, 12095, -42073, -133251, -144117, -62560, -67251, -34344, -44156, 42529, -94485, -93402, -283868, -423924, -236170, -182202, -256312, 150152, 122050, -81849, 44057, 131030, 305836, 362899, 376198, 306946, 403886, 444335, 488341, 586876, 473059, 445524, 623550, 695576, 779513, 867419, 986625, 982098, 685272, 409016, 508022, 802639, 700607, 616229, 1082159, 1325096, 1566436, 1428408, 1069520, 1082734, 879339, 687152, 649779, 565191, 541055, 520340, 517149, 811220, 851452, 1067225, 1171571, 1174947, 711730, 286973, 148480, 111689, 237181, 130416]
10991A30416K4027M0084K1018K3794J20890O4827Q6900k96860k81867M1504J03731
10980G8464l57404q0450O9209J17279J62661J02216M9307K1951Q2838K9001k10158
10969F4914j93722r6464m403K48863M22185j6242j49819P3289J55086j41654j02027
10958B60006l519O6190J87158J39577J34813K75893L25173J84327J813K13376
10948A784807K83664L47835M06334O29033Q06131N79595R64166J488939J847270
10939I137774K577810L246837M116883N086267N759405N548212M671751L247564
10931D3392503J333630n21489k419337l752295n264819o123414n734155m756517
10923A6154107l846361k783084j921952j309112q86027r08239o46123n49086m21538
$$ y = [130416, 154443, 194527, 215545, 239339, 360229, 425056, 511956, 215096, -66771, -25267, 78464, -278940, -359390, -290181, -172902, -10241, 91975, 141282, 163233, 246071, 275072, 64914, -128808, -225272, -229675, 19188, 441373, 425131, 275312, 348601, 503687, 362033, 260006, 256487, 322677, 509835, 649412, 784225, 1060118, 1385291, 1569618, 1571431, 1784807, 2068471, 2416306, 2822640, 3451673, 4257804, 4837399, 5801565, 7290504, 9137774, 11715584, 14962421, 19079304, 24165571, 29924976, 35473188, 40144939, 43392503, 44726133, 44204644, 41785307, 38033012, 32768193, 26644779, 20910624, 16154107, 12307746, 9524662, 7602710, 6293598, 5407571, 4499332, 3853209, 3304123, 2882585]
10914B882585j99819k03281l45430m48755q3777k54131p6573j80762n677j07505
10904I76875k00880j31036j8420N8383j88499j43669J35689o984j56827k42355
10894H2277m0885m6995O884R3616K1100J31504j21498K9974J17871j33754k47417
10883a07323q8241J7970j0278L7502K27173J76150o2085j35487Q44j2877o1483
10872a8135R0528m8314j10494r4401K3237K1327k02221m5896J2610J15463K1157
10861b35139m1777J15889Q9560O7849k16736k04717j20019k7990J6244J30606
10851d26230K24114l1136J8206K73065J19766M758n0599Q9676o9244k2227L8601
10840A68750j106j60661r8678o2769K31111p3287k52874q3676P7366R0576n7921
$$ y = [2882585, 2682766, 2479485, 2134055, 1685300, 1601523, 1347392, 1270819, 1090057, 1084380, 976875, 775995, 644959, 626539, 684922, 496423, 352754, 488443, 481459, 324632, 82277, 41392, -5603, 1281, 94897, 115997, 247501, 126003, 155977, 273848, 140094, -107323, -195564, -177594, -187872, -150370, 76803, 252953, 190868, 55381, 56225, 43348, -18135, 72393, 24079, -86415, -180816, -157579, -136252, -338473, -384369, -371759, -256296, -235139, -276916, -161027, -71467, -3618, -220354, -425071, -545090, -573080, -556836, -426230, -202116, -233252, -215046, 58019, 177785, 182543, 131944, 221620, 152376, 130149, 168750, 167644, 6983, -91695, -154464, 76647, 3360, -249514, -333190, -255824, -165248, -223169]
10829b23169J32049m2760l5658J12803j31386j57561J01842J0952N1821k9408
10819b10475j47324L2792N3516Q976j34942p144J12395j02601J58294L21j04378
10808c40570J13749P8645P3289M0874k48669o0334l5537P837j35607k6859p8113
10797f11295L0860j16551R8266K97452P2959K40906K0971n3919k35480j99812
10787d55643r9054o979N2958j43720p7160M7371N9795N9604M6297j90769k10491
10776i17791m8335J61102J00460m2162r1772k22005P8696J35388J56520J79462
10766e10437J6256n0845p2862J19112R4390J76869n2626o0532k26563j35896r4579
10755g97713P9035m090r67j05917l6505Q2233J59373N6367K24770P1966k2327
$$ y = [-223169, -91120, -133880, -169538, -56735, -188121, -345682, -243840, -232888, -181067, -210475, -357799, -325007, -271491, -262515, -397457, -404601, -292206, -394807, -236513, -236192, -340570, -226821, -148176, -74887, -34013, -282682, -343016, -378553, -370716, -506323, -533182, -611295, -580435, -696986, -598720, -301268, -228309, 12597, 33568, -20351, -255831, -455643, -554697, -561676, -508718, -652438, -729598, -682227, -622432, -562828, -516531, -707300, -917791, -966126, -805024, -704564, -746726, -838498, -1060503, -981807, -846419, -689899, -510437, -494181, -545026, -617888, -498776, -404386, -227517, -280143, -340675, -567238, -703134, -797713, -718678, -722768, -723735, -829652, -866157, -783924, -624551, -568184, -343414, -271448, -293775]
10744b93775n1990r0794j05394J07816J15273J03841M7019j37688l56587J13006
10734e49273l4104L7489J47436J61325J01467L2451k46183l65846J17674J58397
10724d39167P3452M6075J80343J23878J45243j00356j41979P8119m8146m7738
10714a30276o3724L8529J72975q5109j58396j02188K4223J66627j99701k77512
10704f14552j11767J83768J23051m356J63942J44871j17577k92629O0244K7713
10694d37292L2678j00081J37786P4833Q451j29508O476J43685N52k03058J51786
10683c13692J51215k07533j19125J04896j0288j1383m0429M8284J628j19103L9557
10672d75973J49942K41235K45899j09992j61927k2448o0483k76455j77014L770
$$ y = [-293775, -345765, -436559, -541953, -434137, -318864, -215023, -168004, -305692, -662279, -549273, -583377, -545888, -398452, -237127, -135660, -103209, -349392, -715238, -597564, -439167, -365715, -319640, -139297, -15419, 129824, 29468, -112511, -34392, -82538, -130276, -194000, -155471, 17504, -67605, -226001, -328189, -303966, -137339, -337040, -614552, -726319, -542551, -419500, -423856, -259914, -115043, -232620, -525249, -465005, -437292, -404614, -504695, -366909, -292076, -283625, -413133, -406657, -262972, -262420, -465478, -313692, -162477, -370010, -489135, -384239, -394527, -405910, -446339, -398055, -396427, -515530, -475973, -326031, -84796, 161103, 51111, -110816, -133264, -193747, -470202, -647216, -643446]
10662f43446K12456M4979K19194j2173q2225K00642J08314R1977l7819r9940j1863
10651i904r8284m1570R2331m7356j4343P5004L3370k4799k5423L7068K64402K66785
10639E07281k1113r6370j19654K17469p7323j42132K02062K06087L15612J34576
10629A126495J51250K46752J37898J08764J54475N71379O08897P04368M95524
10620D305802M84276P37217R48862J349757J633774K132416K807341L909503N517363
10611B3826311P326156R545268J2054935J3795423J3584048J1002427O510185
10604I7644753J734851j724951k570545o52634L408691Q991600J5748062K2480731
10596A45060558K6909420K5885362J7989924O269610n651682j3569737j4608039
$$ y = [-643446, -430990, -386011, -166817, -178990, -261215, -60573, 47741, 139718, 101899, 1959, -9904, -108188, -149758, -57427, -104783, -119126, -44122, -10752, -35551, -60974, -23906, 240496, 507281, 486168, 389798, 270144, 487613, 410290, 268158, 470220, 676307, 991919, 1126495, 1277745, 1524497, 1662395, 1771159, 1925634, 2497013, 3105910, 3810278, 4305802, 4790078, 5527295, 6476157, 7825914, 9459688, 11592104, 14399445, 18308948, 23826311, 31152467, 40697735, 52752670, 66548093, 80132141, 91134568, 97644753, 99379604, 97654653, 95084108, 94431474, 97840165, 106831765, 122579827, 145060558, 171969978, 197855340, 215845264, 222114874, 216463192, 202893455, 188285416]
10589A88285416r883359j817677Q017250J8701793K8158498L3367496K9575836
10582B94405253J5545288k993996j9516256k9935166l1155800k4560239j5087601
10575A86701483n086689M703206J2278704J5743629J2390270K503037r757936
10568B19475704k0607912k6310365k5387348k0206728j3318431o932237k080909
10561A04631774J403444K533127J070357l100774q228982j2036538j3918357j3379604
10553E8974447j1402567q920237o914763n077972l888805l150014k434261k070499
10545A5115329j158892j263719j183162j125014p52993n48534p82659m27255j64431
10536G708670l11798m57528l29790j41277k92040l29002l74211k41204l04977
$$ y = [188285416, 178402057, 176584380, 184601630, 203303423, 231461921, 264829417, 294405253, 309950541, 306956545, 287440289, 257505123, 226349323, 201789084, 186701483, 181614794, 186318000, 198596704, 214340333, 226730603, 229233640, 219475704, 198867792, 172557427, 147170079, 126963351, 113644920, 106712683, 104631774, 106035218, 108568345, 109638702, 106537928, 98308946, 86272408, 72354051, 58974447, 47571880, 38651643, 31736880, 26658908, 22770103, 19620089, 17185828, 15115329, 13956437, 12692718, 11509556, 10384542, 9631549, 9083015, 8300356, 7873101, 7708670, 7396872, 6939344, 6609554, 6468277, 6176237, 5847235, 5473024, 5231820, 4926843]
10527D926843p1602l33220j29692K17723k54733j58848J85423K5947l02718j25727
10517C979396k5945j23255k60180k20100n519L4564k78278k08277O0714L8156
10507B991276K9938l562p5479k21809r601p0065j13334j2031j16613k61482k57575
10496A879663P6613O5264M8017o3654r4443K5460j58239n3565R0902L6584o0882
10485A791720N4404j84119r8794J25944K73148K06478k41630j84382k42851p1422
10475A428496R4705j14438j8785j78371q3731L3204l1860m8541J24724J41841
10465A347244J3861L1771J1854M4309j24538k12399J8774m529m5029j72350k00436
10454G08532j6719j10969J16321J40031k1865j10532J57254J81850k01475j66015
$$ y = [4926843, 4855241, 4522021, 4392329, 4610052, 4355319, 4196471, 4381894, 4407841, 4105123, 3979396, 3953451, 3830196, 3570016, 3349916, 3344397, 3378961, 3100683, 2892406, 2953120, 2991276, 3021214, 3017652, 2942173, 2720364, 2710763, 2640698, 2527364, 2515333, 2398720, 2137238, 1879663, 1956276, 2021540, 2069557, 2005903, 1911460, 1936920, 1778681, 1725116, 1816018, 1852602, 1791720, 1846124, 1662005, 1563211, 1689155, 1962303, 2168781, 1927151, 1742769, 1499918, 1428496, 1523201, 1408763, 1389978, 1211607, 1127876, 1161080, 1129220, 1080679, 1205403, 1347244, 1361105, 1392876, 1404730, 1449039, 1324501, 1112102, 1130876, 1126347, 1081318, 908968, 708532, 691813, 580844, 697165, 837196, 815331, 704799, 862053, 1043903, 842428, 676413]
10444F76413O5735J91066m2538k49975L2630K79713J48175j0495j77822j84021
10434G28881m0018L1833J18380o8442r8173J8741p3585k10951N6743K7699J61555
10423F52663R9004l2425j44046J29519j6746j47076m2816Q8408Q2024J99395j4462
10412H53442j24502J19977J59108k4871O9860j30448k87687L5515J98867k6095
10402H43166q1204j0958p9948J42323M1606j04116j46052L2123M6247J4352L78330
10391A075869N6252r2082j62443j24978n1761k44773M1726P5830J57997K10975
10381I42612R0193m7497k33214k1715J26789j44751k98682j61813n7158P1767
10371B66531J76089M611k402k6142R7955J23694K5555j44520j172j6829J6217
$$ y = [676413, 742148, 933214, 890676, 640701, 673331, 953044, 1101219, 1090724, 912902, 728881, 688863, 720696, 839076, 770634, 672461, 691202, 617617, 406666, 463409, 491108, 652663, 751667, 719242, 575196, 704715, 687969, 540893, 498077, 586485, 668509, 867904, 853442, 728940, 848917, 1008025, 983154, 1053014, 922566, 634879, 670394, 869261, 843166, 761962, 751004, 671056, 813379, 854985, 750869, 604817, 636940, 683187, 697539, 1075869, 1132121, 1040039, 877596, 752618, 700857, 456084, 497810, 573640, 731637, 942612, 1032805, 985308, 752094, 730379, 857168, 712417, 413735, 251922, 194764, 266531, 442620, 447231, 444829, 418687, 516642, 640336, 665891, 521371, 520199, 503370, 519587]
10360E19587p4677M5269k1984m3517K0120K164j42562n0476M4369j9465k6071
10349B52757J08436L40332L0091l43145N0599r9816j85020R3655L1993r6288J95062
10338C78656O9312j37052J7005Q9572j9201m6307O5511j20021M9269J22680J64009
10327F33433p3617j95505n7499r538p8219R0438K4432R55o3616J59190j35381
10316B95073j29668m3021j69646r25K86012O4907O6844J44594j9800j475N7311
10305E50206l2655j98826R4090m7272J6699j29888q1871o895J27939l9345m757
10294B47425k3582J6087L1838J25513o3200K8071k8052J27189K9021J70016O9940
10283G30266j91770P8722q1221l30366l0554J73014o5251J4946R1741N1423j01219
$$ y = [519587, 444910, 490179, 468195, 424678, 444798, 446962, 304400, 253924, 298293, 278828, 252757, 361193, 701525, 731616, 388471, 439070, 339254, 154234, 247889, 279882, 183594, 378656, 447968, 310916, 327921, 417493, 398292, 351985, 417496, 297475, 346744, 469424, 633433, 559816, 364311, 306812, 297274, 219055, 309493, 333925, 334880, 271264, 430454, 295073, 165405, 122384, -47262, -48187, 237825, 302732, 369576, 514170, 494370, 492895, 550206, 517551, 318725, 412815, 365543, 382242, 252354, 170483, 163588, 291527, 252182, 247425, 223843, 239930, 271768, 397281, 334081, 362152, 334100, 461289, 490310, 660326, 730266, 538496, 617218, 535997, 205631, 175077, 348091, 282840, 297786, 389527, 440950, 339731]
10272C39731R545j07005j21738L05521j61445O620L9188M3946K9355J72751L9164
10261E95633l49104j19972r8625M2794J62038K04497L4304k0328l6297j1064N945
10250D09821J34533J94107J03905j54826k32582J566j41037j49451L5889K43007
10240D44932j99211j37037Q1802o229p4400j30977L4189R7355r7430m2179J79986
10229A50801M662j47425J677O9334k3545M07531K17470j37489J10332j83285k53010
10218B17053j14767J2713q3848L21328n1924j29632N498J89230J41127J4000j95353
10207C25425J52745J44833j20648r7027l81823Q3536J07656J03205j12377l46114
10197a40589j04449J19014J69776n9127K00651J75031p9717k4479l3899J26062
$$ y = [339731, 349276, 242271, 120533, 426054, 264609, 271229, 310417, 354363, 383718, 556469, 595633, 246529, 126557, 27932, 70726, 232764, 437261, 471565, 451237, 414940, 403876, 409821, 544354, 738461, 842366, 687540, 454958, 456524, 315487, 166036, 201925, 444932, 245721, 108684, 190486, 184257, 109857, -21120, 13069, 110424, 12994, -29185, 150801, 155463, 8038, 9715, 79049, 55504, 463035, 680505, 543016, 653348, 470063, 217053, 102286, 114999, 31151, 352479, 300555, 170923, 176421, 365651, 506778, 520778, 325425, 478170, 623003, 502355, 405328, 23505, 107041, 214697, 317902, 205525, -140589, -245038, -126024, 43752, -15375, 185276, 360307, 280590, 256111, 222212, 348274]
10187C48274j01294l5769j019j16207M035O1939J39568m7559j04841j09200L9454
10176G7381J80865O5368J04838J06835J75644J87778Q8751J04344N305o388R7379
10165A188100j39553j55654m2191P5119K09459O2068j9069p5962J4730J21527
10155A238574J84056m8470j02044l42156J92070J30152K70598K69527J25883J07734
10145B025924j44661k55559P1027k29003J5109r2873l8746o0739j86310l0983
10135A073186N4114O5231M7194L3183j20484k70731j46028R3714J9050M5531j64982
10124G28978m3282l464q7524Q6022Q3751o2372j17018k3674n574O0293q1391l4513
10112E00232N1203j06077K5168o6856j52397m6090J05548j43697j37690M460m4582
$$ y = [348274, 246980, 211211, 210192, 93985, 98020, 159959, 299527, 251968, 147127, 37927, 77381, 258246, 323614, 428452, 535287, 710931, 898709, 987460, 1091804, 1097109, 1090721, 1188100, 1048547, 892893, 850702, 925821, 1135280, 1197348, 1178279, 1102317, 1117047, 1238574, 1422630, 1374160, 1272116, 929960, 1122030, 1252182, 1522780, 1792307, 1918190, 2025924, 1881263, 1625704, 1696731, 1467728, 1482837, 1389964, 1351218, 1290479, 1104169, 1073186, 1127300, 1192531, 1239725, 1272908, 1152424, 881693, 735665, 829379, 848429, 893960, 728978, 685696, 682232, 594708, 680730, 764481, 702109, 585091, 561417, 555843, 616136, 534745, 500232, 551435, 445358, 470526, 403670, 251273, 205183, 310731, 167034, 29344, 33804, -10778]
10101a0778J37539J26687K02036O7739k5734j4421j17799p3391P3696M4070k86840
10090A22804M9871o2101L0807o7622j02992k67802P526K77112J95948J31027p2671
10079B41907k11498k20943j37454J68663J30455O9011J34406j6779k58875k1681
10069a22788m0910n7884q3918O7562K02087J40536j28J16545k3656j99478J01313
10058I9281K48262J03212j13835k64511j54410J72935j04842j34054J80164L86373
10048D18575p1353k34033l52845k53496L6006P0530L61623J93841N7706j41283
10038H5271j57804j71910J6187J43585K30382q9609j17176n395J21113j08260
10028e3616l6538J48671N2181J14522m5875l5248J7992n2011o7106N0170J32234
$$ y = [-10778, 126761, 253448, 455484, 523223, 497489, 483068, 365269, 291878, 365574, 409644, 122804, 172675, 110574, 141381, 73759, -29233, -297035, -289509, -12397, 183551, 314578, 241907, 30409, -190534, -327988, -159325, -28870, 40141, 174547, 157768, -101107, -122788, -163698, -221582, -305500, -237938, -35851, 104685, 104557, 221102, 197446, -2032, 99281, 347543, 450755, 336920, 72409, -82001, 90934, -13908, -147962, 32202, 418575, 347222, 113189, -239656, -493152, -457146, -386616, -24993, 168848, 226554, 85271, -72533, -244443, -228256, -84671, 145711, 56102, -61074, -66469, 54644, -53616, -90154, 58517, 110698, 225220, 179345, 144097, 162089, 110078, 42972, 93142, 225376]
10017B25376L3194l55203J13766K11862O965o3655j27116l07162J38204K73371
10007A49602R9696k24237r1711L17704J63250m9181l5055J1159j0127p9952J9412
9996B70560O6383N5936J07494L4003j87857k07567P5230k0937j34468K91316L80920
9985G31013q7632n6246p1004n5522q0774j48676J1698r4721j28011m4682J31598
9974A07041R4273k0582N9348l6825q8404N0206J26586K06267J6640k27559k229
9963B84762M4811j06145j4680K9154J22107N9361j28480J99883N3726q8301l21553
9952A34645r8119J9129N6224p1118J57170j84267j99149k5726Q9980o4379J75271
9941a0339P7234O2928K24581O3362j37641k78100r9133k16182J49638M8941L10159
$$ y = [225376, 258570, -96633, 17133, 228995, 235960, 172305, 45189, -261973, -123769, 149602, 249298, 25061, -66650, 251054, 414304, 365123, 330068, 341227, 331100, 251148, 270560, 336943, 392879, 500373, 534376, 346519, 138952, 214182, 193245, 58777, 350093, 731013, 643381, 587135, 516131, 460609, 379835, 231159, 242857, 148136, 20125, -24557, 107041, 201314, 180732, 240080, 203255, 114851, 165057, 291643, 497910, 514550, 286991, 284762, 329573, 223428, 208748, 237902, 360009, 419370, 290890, 490773, 544499, 456198, 134645, 36526, 55655, 111879, 40761, 197931, 13664, -185485, -211211, -121231, -185610, -10339, 66895, 129823, 354404, 417766, 280125, 2025, -97108, -313290, -163652, -114711, 195448]
9930A95448K35958L9379j75749k80264j83489L1236M2220K23036p6387Q7794J0623
9919A49805J01351Q8650j31597J57328o08j55415r2384j81838j92538n0524j8169
9908c25939J0691J485J57986J42824p2711k9309o2774J1620l5173Q690j15343
9897c07953K6017K68155K8188O5926n5991o897L93542J17583m3166n709k83104
9886A96591j30407L3012j42605p3483N0206J01019J34379M6427j17569q4905j40506
9875a27841J6204k2136j5440J79815J49573p203L7685l2117K2076L1178j57719
9864G4075J51897j14902j48866J4736p3038K26032L42478J26302j6429j41826
9854D40459l53696j53494J94878j02870P1184J06784r0735o9398j44384J33677
$$ y = [195448, 431406, 470785, 295036, 14772, -168717, -137481, -95261, 127775, 51388, 139182, 149805, 251156, 339806, 208209, 365537, 364929, 209514, 117130, -64708, -257246, -307770, -325939, -315248, -313763, -155777, -12953, -85664, -114973, -177747, -166127, -201300, -192610, -307953, -281936, -13781, 14407, 80333, 24342, 17445, 410987, 528570, 485404, 479695, 196591, 66184, 99196, -43409, -116892, -66686, 34333, 168712, 215139, 97570, 12665, -127841, -111637, -133773, -149213, 30602, 180175, 172972, 210657, 178540, 200616, 231794, 74075, 225972, 111070, -37796, -23060, -96098, 129934, 472412, 598714, 582285, 440459, 86763, -66731, 128147, 25277, 96461, 203245, 112510, 43112, -101272, 32405]
9844C2405J29415J88009j72753k49958k14845J02411J36140L2084K19398q8012
9834A14294J65726P5920k26511k31533n7631N1942J88642O1596j25657j4395j519
9823H74K5266q6424L5681J23762J50550q8604j61304J76032K08993P600k7184
9812C65242j33568n5430k88374O0412J93588J35547r1266J5249o6219j13813j39216
9801a17848l5128P1239l5496R8659R5274O9620K58839o215m4956k18278J17846
9790B53556j49690p6127J64779J59866k099J24680R680k26795o1359P4790j33165
9779A38116R1769R2454j27718j01233q3937k9119r4065r6324j772P5271K38838
9768A02280J94796p9977k8730j02050J14626n0115j65546k74842o1309J04572
$$ y = [32405, 161820, 349829, 177076, -72882, -287727, -185316, -49176, -17092, 202306, 114294, 280020, 355940, 129429, -102104, -159735, -107793, 80849, 142445, 16788, 2393, 874, 26140, -60284, -24603, 99159, 249709, 161105, -199, 175833, 384826, 392426, 365242, 231674, 176244, -112130, -51718, 141870, 277417, 186151, 201400, 135181, 21368, -117848, -152976, -81737, -117233, -18574, 76700, 146320, 405159, 398944, 353988, 135710, 253556, 103866, 27739, 192518, 352384, 350285, 474965, 484645, 257850, 196491, 271281, 138116, 229885, 322339, 194621, 93388, 9451, -19668, -113733, -210057, -211829, -136558, 102280, 297076, 217099, 188369, 86319, 200945, 150830, -14716, -289558, -350867, -246295]
9758b46295q0469j3548R042L20074J68408j54012o1373N3470K12884J59223j15301
9747B52103l36679p9720J46123n8112j4442J5125M8546N1005O3695J56903M7214
9736B91761j07149n3610r2543J51536R7571l3047n059r7952j30421o3279k05237
9725b47429M8325K15356Q4980J66839N4606N3193Q3338j5605k13776j65463m0642
9714B3722K4792Q0916P7707P1722k09857n1599P7927o5617j34421l0287J71144
9703C6149J51544P5126j85983j74994o0689j07632j32240N6297l4673K35175K41191
9692I9271P8287j56991j03812o7137K72684J8099J8225j29529Q1694K1193p179
9681A24805l02179K6614K55093j1271j9023K0282J07663J46897k18729l6233J9964
$$ y = [-246295, -326764, -340312, -331270, -11196, 157212, 3200, -58173, -4703, 208181, 367404, 252103, -84576, -164296, -18173, -76285, -90727, -75602, -27056, 23949, 87644, 244547, 291761, 184612, 131002, 38459, 189995, 287566, 254519, 249460, 151508, 21087, -42192, -247429, -199104, 16252, 101232, 268071, 322677, 375870, 459208, 443603, 229827, 64364, 23722, 48514, 129430, 207137, 278859, 69002, 17403, 95330, 29713, -104708, -134995, 36149, 187693, 262819, 76836, -98158, -158847, -266479, -398719, -342422, -377095, -141920, 99271, 177558, 20567, -83245, -150382, 122302, 140401, 158626, 29097, 110791, 131984, 124805, -177374, -150760, 104333, 93062, 74039, 94321, 201984, 348881, 130152, 93919, 113883]
9670A13883M3701P5856K5907j01134j32418K7226l3899R4325P8983l38798k9089
9659a75457J66137l6306k23991R6432R0949P7406M3988r493J01343P9100Q4934
9648B95042o95k29155k13771J19209L19361J73795L22801N04046R5041J61981
9638A547655k6934l89206m79494l20840r7490j35611j46326J45801P1505P327
9628A76387R6837J054k4750L7668O3318J07661o4679j16075l8446M4592j7362
9617B66205k3079j71326l7721K18168O7545q5038n6994j04262p7886L4310j0855
9606A9067J58374J80670p2200N2205k3104j3618q0202k09175j43104M3606K56975
9595A69494o6637J43346P8863p8914j85767l9671M2387J25496r4661k01206n908
$$ y = [113883, 157584, 233440, 259347, 158213, 25795, 53021, 19122, 113447, 192430, -146368, -175457, -9320, -45626, -269617, -173185, -82236, -4830, 39158, 29665, 131008, 210108, 295042, 294347, 65192, -148579, -29370, 289991, 463786, 786587, 1290633, 1385674, 1547655, 1520721, 1131515, 652021, 331181, 233691, 98080, -48246, 97555, 169060, 176387, 273224, 274278, 249528, 287196, 350514, 458175, 393496, 277421, 238975, 283567, 266205, 243126, 71800, 34079, 252247, 319792, 234754, 177760, 73498, -4388, 29922, 19067, 177441, 358111, 285911, 338116, 315012, 301394, 221192, 12017, -131087, -87481, 169494, 102857, 246203, 325066, 246152, 60385, 20714, 63101, 188597, 93936, -107270, -113178]
9584a13178R0866J57083J62764M979k80288j15166l5972o4001K7819o2943j55212
9573c83249q0882P5322K94927L5375R7933n9919K6981J03390j83108r2813n796
9562a71839j7064J26263K12755o3001j21133R4446O5824j3146N7227p7215q5258
9551G859n6107j78686o8199J78698o5077j55547J24971J20301R6192J35405q2797
9540E7013m359N5816Q3960J23449r8055k55391N3105R7819J11533N050o4659J0665
9528A75946k14717k53283K1942o417K15919K39516l9029K4741j62326j6566j06258
9517a20532k4844J3755K33289J28950k11718l3508J15139j6585j769K3628k31497
9506a25692j25002j24003K55452J56356R0858n6126P7878J40495r5739j68052
$$ y = [-113178, -22312, 134771, 297535, 302514, 22226, -92940, -128912, -192913, -165094, -228037, -383249, -464131, -388809, -93882, -58507, 39426, -20493, 6488, 109878, -73230, -166043, -171839, -188903, -62640, 150115, 87114, -34019, 60427, 126251, 113105, 170332, 93117, 7859, -48248, -226934, -295133, -116435, -181512, -337059, -212088, -91787, 4405, 139810, 57013, 52654, 108470, 192430, 315879, 217824, -37567, 15538, 113357, 224890, 229940, 165281, 175946, -38771, -292054, -270112, -276529, -60610, 178906, 139877, 164618, 2292, -14274, -120532, -145376, -131621, 101668, 230618, 18900, -14608, 100531, 83946, 82177, 105805, -125692, -250694, -374697, -119245, 37111, 127969, 71843, 149721, 290216, 194477, 26425]
9496B6425j1073q2967k6008J3267m5982Q1090J40636j5701L3602Q8563P6891j07406
9484A71337j42265k15678J04105J59636J89486o9774J8213K01546j89015l16036
9474h8445j22045K20423L47477j44540k41279M7753O6134j72667Q2629J91249
9464A86689j10276P9973l3697o3546m7496k14855m0396O2416P2232j70836N5034
9453b24758M5475R120K7627J04884N9742J910j38378O3017J43360q0630j91884
9442a80515j9581j05917J46636J54157J06976K50698J63027k6039j68010k32680
9432H8752n5280P9366M6303J39869K9646j10650j41857n1909o0992k05566n0744
9421b93062J92321J58740P8499J11599o0944k05651J80665J62521j04553R9375
$$ y = [26425, 15352, -67615, -93623, -80356, -126338, -45248, 95388, 79687, 113289, 201852, 278743, 171337, 29072, -186606, -82501, 77135, 266621, 196847, 215060, 416606, 227591, -88445, -210490, 9933, 357410, 212870, -28409, 19344, 85478, -87189, -4560, 186689, 76413, 156386, 122689, 59143, 11647, -203208, -243604, -181188, -108956, -279792, -224758, -179283, -170163, -142536, -37652, 22090, 24000, -114378, -51361, 91999, 11369, -180515, -200096, -306013, -159377, -5220, 101756, 352454, 515481, 489442, 321432, 88752, 33472, 112838, 159141, 299010, 328656, 218006, 76149, 24240, -36752, -242318, -293062, -100741, 57999, 136498, 248097, 187153, -18498, 162167, 324688, 220135, 319510]
9411C19510o4460j13281K11359L2170j84657k37734r0329J1096P6817J38310J97481
9400B96282J05636j40299j15607j62221R3229j29321O2842K1385j96938Q3166
9390h1846j11168o99m3032K32678J70710k2981K40969o9809j68858j26590l7430
9379a8056J91822J27688k17278n7599j09295J23203L3093Q8780r6131l41141k36027
9368e10941P0234K17039J27628m1330J70614l556j97980r115Q4145P8657n6465
9357g1070q8217J76429L6107m7080m8550j23283l9089K78153L50922l1907j54378
9346B38037r7850m6519N3435j93626k76277L1224J25937j5143k5528L51171R4470
9335B39331m119j16116j90050k8083L05642L6353l26776o5197J15111n5568j64660
$$ y = [319510, 255050, 141769, 353128, 385298, 200641, -37093, -127422, -116326, -39509, 98801, 296282, 401918, 261619, 146012, -16209, 77020, -52301, 10541, 31926, -165012, -81846, -193014, -193713, -236745, -4067, 166643, 143662, 384631, 314822, 145964, 19374, -18056, 173766, 301454, 84176, 26577, -82718, 40485, 73578, 162358, 66227, -274914, -510941, -440707, -223668, -96040, -137370, 33244, 29688, -168292, -177407, -93262, -14605, -71070, -159287, 17142, 53249, 6169, -42381, -165664, -204753, 73400, 424322, 392415, 238037, 140187, 93668, 147103, -46523, -322800, -291576, -165639, -180782, -206310, 144861, 239331, 235212, 119096, -70954, -99037, 206605, 242958, -83818, -149015, -33904, -89472, -254132]
9324b54132K5280J44130J59274M0756j7013l4660n0725j26854m3198q3952j97977
9313d39071K8201O296J02299K05306J06509j23311j50558K97559N2489j46910
9303f1191m4216O9943J55010O7676o6590l04565l8295L8937N4809J72304J5096
9292E8918k1064q9750j4978n6024n313K55309J00533k75444j39224R9274j09683
9281a97446L4715M33438l4293k13671j25550J947J78788j8602J05259J87145O7514
9270D19244m00323j74858M997p6569J15135R311L4970O9906q9098J13724P9082
9259A05521J18895P6704k54049m9480N3994j8149j03800o2212k3189m5849N0780
9248a50834L6175Q4529l4704p8763M4202K57519J12750k57955j5860J70584k28636
$$ y = [-254132, -228852, -84722, 74552, 115308, 98295, 63635, 12910, -113944, -157142, -241094, -439071, -410870, -404574, -302275, -96969, 9540, -113771, -264329, 33230, 85719, -61191, -105407, -35464, 119546, 187222, 120632, -183933, -222228, -183291, -128482, 43822, 58918, 37854, -51896, -66874, -122898, -128211, 127098, 227631, -47813, -187037, -87763, -197446, -162731, 270707, 236414, 22743, -102807, -100860, 77928, 59326, 164585, 351730, 419244, 18921, -155937, -150940, -227509, -112374, -103063, -68093, 1813, -87285, 26439, 105521, 224416, 301120, 47071, -2409, 51585, 33436, -70364, -132576, -155765, -201614, -150834, -114659, -30130, -64834, -143597, -99395, 158124, 270874, 12919, -2941, 167643, -60993]
9237f0993j76408Q0006L74395J0164k62923k4032q3887q4626J19101K7364K8679
9226e3160J95313q3451j13099k10615J20995K93140O444J2151J77888k7280o7231
9215B51095j68233m6536N8787P606k6879p7232j29674J75995j25730j64914P7598
9204a68117K78704J7661K5878O721L7588K61604o3837o0563j2619m9484j1177
9193B62359j96420m8108J39569R7357P8618J01687m220n5548j21721r2185p3605
9182H7783k01989l09650J47456J71580J08166O3183j24771J49324k04611k1993
9172a35522K05456J5838K9255l4162j43880k2358k1102Q1708p4715p2252K19707
9161D7973R4195k86264k30669l5354J55078K39150P4231j75052J04553o9395O6298
$$ y = [-60993, -237401, -157395, 217000, 227164, -35759, -59791, -143678, -228304, -109203, -81839, -53160, 142153, 58702, -54397, -265012, -144017, 149123, 155567, 167718, 345606, 318326, 251095, 82862, 36326, 95113, 102719, 75840, -1392, -131066, 44929, -80801, -245715, -168117, 110587, 128248, 154126, 160847, 198435, 460039, 396202, 335639, 323020, 273536, 262359, 65939, 17831, 157400, 254757, 333375, 435062, 430842, 375294, 253573, 161388, 87783, -114206, -423856, -276400, -104820, 3346, 66529, -58242, 91082, -113529, -135522, 69934, 85772, 115027, 80865, -63015, -85373, -106475, -24767, -99482, -171734, 47973, 142168, -144096, -374765, -410119, -255041, -15891, 58340, -116712, -12159, -81554, -15256]
9150a5256n7550J33222M7451J51956j41773m3493J24720j18008K9954m3296m3679
9139B4248K9452J69196K15957k651k24487k43020j58632N0196K17072J96584J2749
9128B86664k24606j01862M6498Q3431L1694K3928J2734n3692M7890k1504N7126
9117A88301p9006r4713r296L0437j38908R7110O9319j12311j09421O6888J4148
9106g7452N0901o6950m891L5853j52785j14548k24007K5479J19389J45868J69492
9095i3651P6954Q6159O1931k5844o5341m4438o1709l8644j29287J66869O0303
9084f698M1049J52826k17221j00187N8161J5438k10883K5470j13293j45187q8201
9073e88726j05537K25211J77049J25809j11800M885K24613J097l7456j14075K6971
$$ y = [-15256, -72806, 60416, 107867, 259823, 118050, 74557, 199277, 81269, 111223, 67927, 24248, 53700, 222896, 438853, 436202, 211715, -31305, -189937, -139741, 77331, 273915, 286664, 62058, -39804, 6694, 90125, 121819, 145747, 158481, 104789, 152679, 131175, 188301, 109295, 14582, 5286, 35723, -103185, -6075, 63244, -49067, -158488, -91600, -77452, -26551, -93501, -98392, -62539, -215324, -329872, -553879, -528400, -409011, -263143, -93651, -16697, 69462, 131393, 105549, 40208, -4230, -65939, -104583, -233870, -67001, -6698, 34351, 187177, -30044, -130231, -72070, -56632, -267515, -242045, -355338, -500525, -588726, -694263, -469052, -292003, -166194, -277994, -273109, -48496, -47399, -84855, -198930, -171959]
9062a71959L8094M2559M174M0128Q8221o1883p7863N6202J17258N6766r294J52213
9050B74616P361l8475l1566n553q4559j15632j0862N3169o1398k7136m1038N2757
9038b8316l4316J24365j18595J25137k6858j63271k08560j3513K89994J87808
9028A33875j81952L6306j70259l15357k33955R8419K96405J19599o6742l1583
9018c15244K62048J63758n4245o5348j4072k1887k1680J42144J84420r3965M2489
9007B08418R2600p7593M2003n5277j29182m6394Q6537J13464l0841K4371j40563
8996H7543k9835K3000L1406P9514O4586n0497p1489k49257M6264o383L0799K03153
8984A58804o5873k16413q6224N1840R7170K14358N4165r0787q4079K67506M3069
$$ y = [-171959, -133865, -91306, -87132, -47004, 41217, -20666, -98529, -42327, 74931, 131697, 122403, 274616, 281977, 243502, 211936, 206383, 121824, 6192, -4670, 48499, -12899, -40035, -81073, -28316, -62632, 61733, -56862, 68275, 41417, -121854, -330414, -343927, -53933, 133875, -48077, -11771, -182030, -497387, -731342, -632923, -336518, -216919, -283661, -315244, -53196, 110562, 56317, -9031, -23103, -44990, -66670, 75474, 259894, 165929, 208418, 301018, 223425, 265428, 210151, 80969, 34575, 121112, 234576, 203735, 228106, 87543, 57708, 80708, 112114, 191628, 256214, 205717, 134228, -115029, -68765, -75148, -44349, 158804, 92931, -123482, -209706, -157866, -60696, 153662, 207827, 117040, 32961, 300467, 343536]
8973C43536m4966j48290o5599P25L2675j01487J2962P6464j4094j10976j26628
8962a45678J6507K14811o2765j69525k21943J26522J98842n2979k5800N7690N5134
8951i184j3818Q8528N386J7284K97045P3665l13294k82663J31646P2069k6979
8940C9685o0891j83380K8252J97909O6376l7329k4301r2139o7622J63990L4745
8929F5295o6144j09912J19431m8283K7488L96638J63295l66062j1425P0449K8007
8918B68777M7809N2810J778k7321L0118j92612q1262J77031J43955l2700k63670
8907A24713j57554k06299O6433N0248l875J28150J02541J324k22684p2000o4843
8896b53846J71806R2858k3149O947k2310r6310m700Q0230J10785o237r3343j75522
$$ y = [343536, 298570, 150280, 84681, 85406, 118081, 16594, 29556, 106020, 91926, -19050, -145678, -129171, 85640, 22875, -146650, -368593, -242071, -43229, -96208, -122008, -64318, -9184, -23002, 65526, 70912, 88196, 385241, 458906, 145612, -137051, -5405, 66664, 39685, -21206, -204586, -176334, 21575, 87951, 50622, 26321, -65818, -133440, 30550, 65295, -849, -110761, 8670, -39613, -12125, 384513, 547808, 181746, 170321, 240770, 268777, 316586, 369396, 371174, 343853, 373971, 181359, 100097, 277128, 421083, 388383, 124713, -32841, -239140, -172707, -122459, -126334, 1816, 104357, 105681, -117003, -189003, -253846, -82040, 10818, -12331, -5384, -27694, -124004, -128704, -48474, 62311, 56074, -37269, -212791]
8884b12791k01663M07J38149K1342P3790N9534R1158J21115n8041j8323p9832
8873f5155M398J86395J22943j09607j09940J09345P6084j89780Q4469M9714p764
8862A51102k34513q0139K67850j90463J26957j4000k2120J01887p1143j85277
8852a49859j91311K47170R8190k0906L1228l445n5326j55313j48789K80311l0735
8841i8785j0414j00070J6718j59767j83004J35315M47J63080M9902J44212P612
8830c4754K02970N2264j2464r8811j47197p2058P9428K04309j15536j29313R5020
8819B3858n1731j08621j34335m5078J04348J32401j097O446J70282j58432J02377
8808D0418l7536j7352J77898J93174j8293k29766k17753J41902j5385n508J0739
$$ y = [-212791, -414454, -414047, -275898, -254556, -180766, -121232, -30074, 91041, 33000, 14677, -65155, -60757, 125638, 248581, 138974, 29034, 138379, 214463, 24683, 109152, 158866, 151102, -83411, -163550, 104300, -86163, 40794, 26794, 4674, 106561, 35418, -149859, -341170, -94000, 4190, -16716, 14512, 11067, -44259, -199572, -348361, -68050, -98785, -109199, -209269, -192551, -352318, -535322, -400007, -399560, -236480, -186578, -42366, -34754, 168216, 220480, 208016, 109205, -37992, -110050, -30622, 173687, 58151, -71162, 23858, -27873, -136494, -270829, -315907, -211559, -79158, -80255, -73809, 96473, -61959, 40418, 2882, -14470, 163428, 356602, 338309, 108543, -109210, 32692, 17307, 11799, 22538]
8797B2538K7527k5671m0577J57294k7077j44723J25248M3594l9083p212j60075
8786f8217J32808j6728O7757J83519m7180k52032j73289n7051J79522j34236q1569
8775b66696J50266J92636L859N0137j86544j98749M9151p9414J3705l0268K8824
8764b73093j35831O1000K31427K19713K03456j83277k45145P6474J12915k1577
8754D6062q3553l2800l230l7706K93041L45839l0084r9434k10081p8181j39612
8743b9739M9949j1663j60180N2243j7896N2000J11979j81294j88716o7530L3057
8732c57790R5693J04544l6403R0633O2740K81839P8536j34015p7813k10629m1883
8721a44548M6589j91342j21632J97682R8062J2044n1241j01546j15739Q8990K23029
$$ y = [22538, 50065, 24394, -16183, 141111, 114034, -30689, 94559, 138153, 99070, 91858, -68217, 64591, 47863, 115620, 299139, 251959, -73, -173362, -230413, -50891, -185127, -266696, -116430, 76206, 80065, 130202, -56342, -255091, -205940, -285354, -271649, -301917, -273093, -408924, -347924, -116497, 103216, 306672, 123395, -121750, -45276, 67639, 46062, -37491, -70291, -73521, -111227, 181814, 527653, 497569, 398135, 188054, 109873, -29739, 20210, 8547, -151633, -99390, -117286, -65286, 46693, -134601, -323317, -390847, -357790, -262097, -157553, -193956, -103323, -40583, 241256, 319792, 185777, 107964, -102665, -144548, -97959, -289301, -410933, -213251, -115189, -103145, -154386, -255932, -371671, -282681, -59652]
8710e9652L171j04988J63247j768r2469n9785p6496o5770J78370K04114p282k15942
8698a35250j7175n014J74813L9275k66373P0336J28289j97722R545M6337J39387
8687a3552J55231Q0132j59107l510l83k32057j622J19970K30116K22662j94913
8676B02967j08638J94447k26011o1831q1740k9372j62723j16507j4833J62133
8666b42108K65416J66062q9729k7600j41150K1249K65807j43943k63188K1261
8656a67923J23772M0177J39953o6442Q1662J44830J90773j03339l71418j08706
8646i6661l1189R5958K66676Q0487j30893j64741j39220J99053l0925Q7315k7773
8635A08087Q240O0307k1195m8951k6668J28231O0270k21375j459j67209r908J10219
$$ y = [-59652, -56481, -161469, 1778, 10, -92459, -152244, -228740, -294510, -116140, 87974, 80692, -135250, -152425, -157439, 17374, 56649, -209724, -139388, -11099, -208821, -199276, -152939, -13552, 141679, 221811, 62704, 59194, 58811, -173246, -174868, -54898, 175218, 397880, 202967, 94329, 288776, 62765, 934, -80806, -110178, -272901, -389408, -404241, -242108, 23308, 189370, 99641, 72041, -69109, -47860, 217947, 74004, -189184, -167923, -44151, -3974, 135979, 69537, 151199, 296029, 486802, 383463, 12045, -96661, -127850, -31892, 234784, 315271, 184378, 19637, -119583, 79470, 48545, 135860, 108087, 116327, 176634, 155439, 106488, 79820, 208051, 268321, 46946, 45487, -121722, -131630, -21411]
8623b1411M4772j54325j44710J05290J54068N1466j3614J22245j425J29901J9336
8612B91593j860n903k19002j42882M1711J38476Q4528k808l0847J79134N9431
8601C91571j43394l66313k3130J59813K19090K67143k09346l9887m3116K32204
8591D44635p6575j60212m9216N3970K20930J40818j76098j93924o9950K41182
8581C75560m6164m4983K5936J9284o6692R0878q3875k6803o1450J21304J22984
8570D25979k6394O9114j21597k05242L8355J34092P8325l0452N9480j7504l7759
8559C66397p2917j92701q4276l6136J75266M3383J14970J14539O2257j5208j4286
8548D61288k82671M9806m2967k08104r8276j00980J4390K87091M0393j9686O1938
$$ y = [-21411, 23361, -130964, -275674, -170384, -16316, 35150, 21536, 143781, 142356, 272257, 291593, 289733, 283830, 64828, -78054, -36343, 102133, 186661, 183853, 153006, 332140, 391571, 248177, -118136, -141266, 18547, 237637, 504780, 295434, 255547, 212431, 444635, 368060, 207848, 158632, 212602, 433532, 574350, 398252, 204328, 134378, 375560, 329396, 284413, 310349, 329633, 262941, 353819, 269944, 243141, 181691, 302995, 425979, 399585, 468699, 347102, 141860, 180215, 314307, 392632, 362180, 421660, 404156, 366397, 293480, 100779, 16503, -19633, 155633, 199016, 313986, 428525, 490782, 475574, 461288, 178617, 228423, 185456, -22648, -120924, -221904, -207514, 79577, 119970, 100284, 162222]
8537A62222m5326m7178l8940K55000L4992K8160J32067l47296P3213j53926o1222
8526h234L8874m5077M9227l9496p9288k45871J22009K66047k0459q8033j51346
8515b01647O6934K07557j1334O8430K1688n3207L7783l6147p7811j39241o7388
8504a84383J62824J27275p6925M1281J3573J1323N8854M1383J4752p6970m0743
8493I2244K5990R5559J50041j84729j32134j90728J9739j11854Q737p497p8587
8482c13219K3869L81605P1320J27738r8894j28071k43710l33918R500L23438L1712
8471a48630k8211J11186L02707M0522l18734k05364Q2001L241j08653M2359j25563
8460c53139n4463J45619J41911L0465K20941O6756K01367p2016p0814J38724j56017
$$ y = [162222, 116896, 69718, 30778, 285778, 320770, 348930, 480997, 133701, 206914, 52988, -8234, 30640, -14437, 34790, -4706, -83994, -329865, -207856, 58191, 37732, -50301, -201647, -134713, 72844, 61510, 129940, 151628, 98421, 136204, 100057, 22246, -116995, -184383, -21559, 105716, 28791, 70072, 83645, 94968, 153822, 195205, 209957, 132987, 92244, 118234, 213793, 363834, 179105, 46971, -143757, -124018, -235872, -227135, -234632, -313219, -289350, 92255, 163575, 291313, 192419, 64348, -179362, -513280, -503780, -180342, -148630, -176841, -65655, 237052, 277574, -41160, -246524, -164523, -161282, -269935, -227576, -353139, -407602, -261983, -120072, -89607, 131334, 198090, 399457, 327441, 256627, 395351, 239334]
8449B39334k861J8466O885J4294J7043j91567j39143M7238J45699K13954K27686
8438E97028j55272R7913o7049p0491J59279k22713o1658K26472N7611O6846K93274
8427I21240q5049l28734k18117j25672k6323J4830L2205o5738M1003m1963K1905
8416A39587L7453L6355r6309p9009M6945J345L308k7788r9649l3295j9435J20423
8404B9931M6695m9847M4628N5767O2646K05506L2384j42092k84406k22837K94019
8393G2394J73712k42061p540p0335O71m1827J87759N7600k20414M3355K01988
8382A55302L85443m7542j21118k15646k47231J85884J24730k13629J1354K74871
8372B92418J44008j405j23098p8058p01J83361p505l1285q915j82036M045p6667
$$ y = [239334, 236473, 254939, 261824, 276118, 293161, 101594, -37549, 9689, 155388, 369342, 597028, 441756, 539669, 472620, 402129, 561408, 338695, 277037, 503509, 561120, 627966, 921240, 836191, 507457, 289340, 163668, 137345, 152175, 184380, 118642, 159645, 117682, 139587, 177040, 213395, 117086, 38077, 85022, 86367, 89675, 61887, -37762, -71057, -90492, 29931, 76626, 26779, 71407, 127174, 189820, 395326, 427710, 285618, 1212, -221625, 72394, 246106, 4045, -3495, -73830, -73159, -114986, 72773, 130373, -90041, -46686, 155302, 540745, 493203, 372085, 156439, -90792, 95092, 219822, 6193, 17547, 292418, 436426, 435021, 311923, 233865, 233164, 416525, 409020, 377735, 368820, 186784, 190829, 114162]
8360A14162l41445j05198K44578J38375j1694l4097J09811o5897Q4222M8011o1584
8349A19244k9977Q8523M9696n7641K00183J5146k7853J9806k60376l2847P0866
8338A54770J42318K02592j60925p103K57956j6834l80453j55604p3748J02977
8328F5946K0487J37594P2040r9510K9646N6480K7664q5324k2700l8832J00192
8317B63683J48041j87393j04160J1110k7360O5586j25648J45328K2075j46819
8307F4443j68945M6847Q8932O0675K25563j93206k34659R3264J14937j25190M1187
8296A3848K31502j27410N7384J99458j85649k40292K5408J84664j20865J07623
8286A45671K62755k9420k59344j50988M4921O929Q8768Q5970N7360J58514O4908
$$ y = [114162, -227283, -332481, -87903, 50472, 38778, 4681, 114492, 48595, 132817, 180828, 119244, 89267, 177790, 227486, 169845, 370028, 385174, 357321, 377127, 116751, 83904, 154770, 297088, 499680, 338755, 331652, 589608, 572774, 192321, 36717, -37031, 65946, 86433, 224027, 296067, 196557, 226203, 282683, 310347, 225023, 202323, 163491, 263683, 411724, 224331, 120171, 131281, 103921, 169507, 43859, 189187, 211262, 64443, -104502, -57655, 31277, 91952, 317515, 124309, -110350, -17086, 97851, -27339, 13848, 245350, 117940, 175324, 374782, 189133, -51159, -25751, 158913, 38048, 145671, 408426, 379006, 119662, -31326, 13595, 20524, 109292, 195262, 252622, 411136, 476044]
8275D76044k73023j11103o0234j27393p3779L6832K66003N4872j45218Q5709J97836
8264C26546j48128l6140p254l9176j13559L9978P6463N4524L3774L7208q5526
8253A38710j43461J5918J02143N0851K5386j93037j57416j30630k36097Q0434
8243d47199J56748q3676l1312L22275J26008J47216j026N5042Q320j69069J77719
8232B61046P79k5237J51354k97004k59799j6029J58102J16331j57672J08476K2782
8221F3129l3405j13349K0321j55395j39553J47037O0031R6299L8619j0868j3318
8210d0452m6085K14895M648j50315j24180J07382J83180K7495K2297K3903k2729
8199B00039j66408j95287J53966K05105j48673n4944n4737K888n3104J77456Q521
$$ y = [476044, 203021, 91918, 31684, -95709, -169488, -132656, 133347, 188219, 43001, 128710, 326546, 178418, 142278, 135024, 95848, -17711, 22267, 98730, 153254, 187028, 224236, 138710, -4751, 11167, 113310, 164161, 189547, -3490, -160906, -291536, -527633, -447199, -290451, -374127, -405439, -83164, 42844, 190060, 189034, 244076, 252396, 83327, 261046, 261825, 236588, 387942, 90938, -168861, -184890, -26788, 89543, -68129, 40347, 63129, 29724, -83625, -63304, -218699, -358252, -211215, -151184, -54885, -16266, -27134, -40452, -86537, 128358, 133006, -17309, -141489, -34107, 149073, 176568, 198865, 222768, 200039, 33631, -161656, -7690, 197415, 48742, -6202, -60939, -58051, -111155, 66301, 74822]
8188G4822J32754J12759j1774j40019k93530l9096J79697K21385j08637m00957
8178b72596o8760L08936J47838k5383l05197O8495J47883J54382j12877r1400
8168d8679J12927R7232J7852J6917J500k1945j22838J14517j7409n9252j28605
8157c7783j64634p4356J4122J40042J25908P4848K1768q2852K04052N1080j85536
8146H6659j22689j03686j56377J06501J10471P4232k7842K8468r6089k6259j11756
8135b38367M6986n9739R4496k0887K8626R3127p1807P1806J07693J0255r2258
8124c0069J11130M0066K08446n3451j31729J0670l1632j59287o4718J04565O3725
8113F7716Q1645J52089J24159m4277J12773j03765j46475k10068Q7015J34672
$$ y = [74822, 207576, 320335, 308561, 168542, -124988, -164084, 15613, 236998, 128361, -272596, -341356, -32420, 115418, 90035, -215162, -146667, 1216, 155598, 42721, -48679, 64248, 161480, 179332, 196249, 197749, 175804, 52966, 167483, 150074, 90822, -37783, -202417, -276773, -262651, -122609, 3299, 78147, 99915, 17063, 221115, 272195, 86659, -36030, -139716, -296093, -189592, -79121, -4889, -32731, -4263, -100352, -126611, -238367, -191381, -251120, -156624, -177511, -148885, -55758, -127565, -55759, 51934, 62189, -30069, 81061, 121127, 329573, 276122, 144393, 155063, 123431, -35856, -100574, 3991, 67716, 149361, 301450, 425609, 381332, 494105, 390340, 243865, 33797, 120812, 255484]
8103B55484J32745J10306j13725L0707j61888l0627P8756M6513O34k00980O5475
8092B13400O2640o4363O9538q5516o1367n6395K07184k5014p7590J09631J06303
8081C98451j53344k7880j62348L3787m5858o9595K20004K48294r1110l3183L56365
8070F73583k4154l27191j11859l3045J1655o4628n5758j8706J25525L0377k39436
8059c3637Q7045L6684r2944j10168J80534J07828L6926L6120J27901J5054k44319
8048A47024k0206P0953j3673L9654p523Q8422J99100O4431j83028j56721k64956
8037c6523j48324J11659J32003r0660O7346o4385r7602k7982P0241J70286J57532
8026B43591O2315J10374o0812k1451J4216j30903p8415k7636n4678j69152J17309
$$ y = [255484, 388229, 498535, 384810, 415517, 253629, 223002, 301758, 348271, 348905, 147925, 213400, 276040, 211677, 281215, 195699, 134332, 77937, 285121, 260107, 182517, 292148, 398451, 245107, 217227, 54879, 88666, 42808, -26787, 193217, 441511, 350401, 317218, 673583, 649429, 322238, 210379, 177334, 188989, 124361, 68603, 49897, 175422, 205799, -33637, 53408, 90092, -2852, -113020, 67514, 175342, 212268, 248388, 376289, 391343, 147024, 126818, 197771, 184098, 223752, 216229, 304651, 503751, 568182, 385154, 228433, -36523, -184847, -73188, 58815, -31845, 35501, -28884, -126486, -154468, -84227, 86059, 243591, 305906, 416280, 355468, 334017, 348233, 217330, 138915, 111279, 56601, -112551, 4758]
8015D758K61483J3290p4130j4215K5206j05647m9657K31085J06423J88712J01427
8004F88735j33277j77054k19775j13832o8315j74252m0904J29369K88851o2708
7994A16838k488m4255j06795O0320j01919p7794Q5376J27642r2260j78431J46763
7983f7003j3901n9014k0644m0113M0151n576J23017R9734m5106O0444Q0262O4178
7971B16429j73103j09630m2929Q8878R3238J36490M0407Q7974N8262r781k60691
7960A25544j4829Q2798J1354K13480N3114j38838k15406k1618M1838l9046R6893
7949A95284K02490L3727k23416j19489J7183O7582n8024m9356r7538M2330L06545
7938C17318R5974l5188N7118k08426k11686J12136j476j92149m1084R7776K18105
$$ y = [4758, 266241, 279531, 205401, 191186, 216392, 110745, 61088, 292173, 398596, 587308, 688735, 555458, 378404, 158629, 44797, -23518, -197770, -238674, -109305, 179546, 116838, 114350, 70095, -36700, 23620, -78299, -156093, -70717, 56925, -35335, -213766, -67003, -80904, -139918, -160562, -200675, -160524, -166100, -43083, 56651, 11545, 71989, 152251, 216429, 43326, -66304, -109233, -20355, 72883, 209373, 249780, 337754, 396016, 386235, 125544, 110715, 193513, 204867, 418347, 471461, 332623, 117217, 95599, 137437, 98391, 195284, 397774, 431501, 208085, 88596, 105779, 173361, 115337, 65981, -31557, 10773, 317318, 413292, 378104, 435222, 226796, 15110, 127246, 125770, -66379, -107463, -9687, 208418]
7927B08418L8619k87835j51877j33367j02165J92903K31353L11546N1663Q727
7917C67985j10556j99406p7982n6743m4195J28624K12014k5385K2316j07133p6197
7906C3342R2220J32541p2706k0697J17546n3346m3549o6152p5897P2784k54722
7895a38636n3343j25498p0957J60705J35449J74252K0440P0430p6704j81004J38356
7884E3490J04576J24812J8979J38427o2794j09161j79653n2317O3760j70096j51034
7873b21011J27123q0040P0109k1066k09795J6806p3766n9792J13640l1795p4822
7862d44409K1836m3462K6764R9921K57115P5791k31520K8443j7170k7375n0091
7851c04157o3380j55622l499K9592M3579L01652M11955l8105r4010o6019J23906
$$ y = [208418, 247037, -40798, -192675, -326042, -428207, -235304, -3951, 307595, 359258, 367985, 257429, 58023, -19959, -76702, -120897, 7727, 219741, 194356, 216672, 109539, 33342, 125562, 258103, 185397, 164700, 282246, 228900, 185351, 119199, 43302, 116086, -138636, -191979, -317477, -388434, -227729, -92280, 81972, 102412, 172842, 96138, -84866, 53490, 158066, 282878, 301857, 440284, 377490, 268329, 88676, 36359, 100119, -69977, -221011, -93888, -173928, -103819, -124885, -334680, -317874, -391640, -451432, -337792, -369587, -444409, -422573, -466035, -439271, -339350, -82235, -6444, -237964, -209521, -226691, -254066, -304157, -367537, -523159, -526658, -497066, -453487, -151835, 260120, 222015, 128005, 61986, 185892]
7840A85892K16841j99926l16074k1761L35116k12640p1719O8264P5625m5187p3555
7829e9124j74561Q602Q4645K11418q395j06348l3521J0790p0980j4158j8245m7426
7817b17303J77513J63694Q1720k7669r7225o3581l05271n2442K74753J66094J5394
7806A15677N664P1568P7036j5142m5350n9372k9571k61112p5981J85522L34137
7795C03076J35511n7615j96632Q6580Q1380l73364j56643K7856j33531K34820
7785d8562K29879k34637R153K1969R1382J40124K1085J29421J8654k14107j77818
7774a3457R9254L2691J8514k50736J48368j6091j12810J23567J44276q4713q1108
7763G755J935j18903o5164k4250J37743l7368p726J02481Q0746J94168m2305m4436
$$ y = [185892, 402733, 202807, -113267, -135028, 200088, -12552, -84271, -16007, 59618, 14431, -59124, -233685, -225083, -140438, 70980, 62585, -43763, -77284, -66494, -137474, -151632, -169877, -217303, -39790, 123904, 205624, 177955, 80730, 17149, -288122, -340564, -65811, 100283, 115677, 121341, 192909, 269945, 254803, 209453, 150081, 120510, -140602, -216583, -31061, 303076, 438587, 380972, 184340, 270920, 352300, -21064, -177707, -149851, -283382, -48562, 181317, -53320, -44167, -22198, 69184, 209308, 230393, 359814, 378468, 164361, -13457, 85797, 118488, 137002, -113734, 34634, 18543, -94267, 29300, 173576, 88863, 7755, 9690, -109213, -174377, -198627, -60884, -98252, -105978, -3497, 77249, 271417, 229112, 184676]
7751A84676j90220K4059r393k5805J12484K0466j36164j53963Q2662J50498Q3514
7740A42814j12939M6235J0996j76229p2705n8212q5897l3854L40685M0680k50528
7729b08954K5308J35900Qj31247P0808O0652R1831K4105j03147J69135K5858J25690
7717B85947M3483k17044l0664r2699p1546O2003J598k8210r556L5668N4887o9274
7705c5407p3229L320Q0852Q3562j32079j80251J98111q248N4704J69084J36421
7694B96840n194K599j13678l90395p9999K43605J44108Q0596R4683O2132n5581
7683B79716L171O0693l7691j01439j7055K68322l3544p7648N0927Q417j81102
7672B22767k32996j07849q480l7766m699Q2467K8910R411J03575R405k60913n611
$$ y = [184676, -5544, 18515, 9122, -16683, 95801, 116267, -19897, -173860, -91198, 59300, 142814, 29875, 76110, 87106, -89123, -161828, -220040, -305937, -339791, 894, 41574, -208954, -183646, -47746, -47738, -178985, -108177, -47525, 44306, 68411, -34736, 134399, 160257, 285947, 329430, 112386, 81722, -10977, -82523, -20520, -18922, -47132, -56688, -21020, 33867, -35407, -108636, -105316, -24464, 59098, -72981, -253232, -55121, -63369, -8665, 160419, 296840, 291646, 294245, 180567, -209828, -289827, -46222, 97886, 178482, 273165, 335297, 279716, 282887, 343580, 305889, 204450, 187395, 455717, 422173, 344525, 395452, 403869, 222767, -10229, -118078, -126558, -164324, -169023, -86556, -57646, -48235, 55340, 64745, -196168, -201779]
7660b01779N1953r3629j0073J38117J87437o6985p5927j98192j37410K57456J2695
7649a36337m4945k06098K9360J07683O4413j3861j07383R898J44133J30579O3465
7638D0907j80280K2016P6317j85345j45930L18210J88759j20273q1066K4652r4055
7627a36088p6985J66467J37643j7638J75316l53732l32767L1046J06765O8117
7617b31856K8783J01881n8486J79938q4263l9738J70669L7549j49190l08708Q566
7606c44855J91808M4320J84748K36148o3859k28221j01256O7174J14119N8007
7596A58133p5166o7351L3584j58069J9770J37862L8694N6926j41915k27338N1907
7585a72963J26093L8207n7674O6836O3304r1260J3025K4240j13695k71705n8939
$$ y = [-201779, -149826, -243455, -253528, -115411, 72026, 5041, -70886, -269078, -406488, -149032, -136337, -181282, -387380, -358020, -250337, -185924, -199785, -307168, -297270, -153137, -22558, 40907, -139373, -117357, -41040, -226385, -372315, -54105, 134654, 14381, -66685, -42033, -136088, -213073, -46606, 91037, 73399, 248715, -105017, -437784, -406738, -299973, -231856, -203073, -101192, -159678, 20260, -64003, -103741, 66928, 104477, -44713, -353421, -344855, -153047, -108727, 76021, 312169, 248310, 20089, -81167, -13993, 100126, 158133, 82967, 15616, 49200, -108869, -89099, 48763, 87457, 144383, 2468, -224870, -172963, -46870, -8663, -66337, 499, 63803, -27457, -14432, 9808, -103887, -375592, -434531]
7574d34531r3460N1798J66606J21148J9360K5197J72864M7134O23N9758L7893
7563A74390l17788j74333O2590N0367Q6163j1277K24907L34122Q433k61020k28061
7552e1507l5491j23931R0602j5386k5990J37656K16204q1338k3701j35590J638
7541d6834j23515M6304J4368j21257L9753K9152p3777k52726N5703L08548K58595
7530A34314j17644k47877J15748K07776k1214j08540K19683j23495n9148J5274
7520A4877K54717q6305K9715j49367n4410n0769j7003Q6409O2090P6435M9277
7509B15666O3476j15600j16018J05130J28315k2432j37600j28732M4119L1626
7499F7950j57176j16452N3074L0642P9711J11946p4972k3545K74337J4862j17516
$$ y = [-434531, -527991, -476193, -309587, -188439, -169079, -143882, 28982, 76116, 76739, 136497, 174390, -143398, -317731, -255141, -204774, -118611, -129888, 95019, 429141, 437574, 176554, -51507, -86998, -210929, -120327, -135713, -161703, -24047, 192157, 110819, 87118, -48472, -46834, -170349, -124045, -109677, -230934, -191181, -162029, -235806, -488532, -432829, -124281, 134314, 16670, -231207, -115459, 92317, 71103, -37437, 182246, 58751, -397, 14877, 269594, 183289, 213004, 63637, 9227, -41542, -58545, 27864, 89954, 166389, 215666, 279142, 163542, 47524, 152654, 280969, 258537, 120937, -7795, 36324, 67950, -89226, -205678, -152604, -121962, -42251, 69695, -5277, -28822, 245515, 260377, 142861]
7488A42861N2626j33109l4897P7678m8861J66795q7714j14977l0688J66182j74593
7477a8697O2531R1273o098J075J06715J73951j91897j44810J61196N4153M5389
7466C34781o264L6079j04081k8507k85294P2018L6293m8791J02770P934j63224
7455d6286k0249M3018k4259K2482N7252j39918o2005N2419J03997J11834j04729
7444f444o5785J29389J29174o8885J32263J84900q4058j14102r1726n8925M5958
7433A31759L0935J60861R3638j02405q0052J30488R8804r3969j874r9866j01736
7422A66583j20528q7466o0785o2610n8277P0532R7729J03679M8145j87806o2522
7411a53326J26461J52695J17115k28828k09069J5502j97166O6310J40628K15937
$$ y = [142861, 195487, 62378, 27481, 105159, 56298, 223093, 135379, 20402, -10286, 155896, -18697, 43834, 135107, 129009, 130084, 236799, 410750, 218853, 74043, 235239, 289392, 334781, 328517, 364596, 260515, 232008, -53286, 18732, 55025, 6234, 109004, 116938, -46286, -66535, -23517, -47776, -25294, 31958, -107960, -169965, -117546, -13549, 98285, -6444, -72229, 57160, 186334, 117449, 249712, 434612, 350554, 236452, 144726, 85801, 131759, 162694, 323555, 417193, 314788, 234736, 365224, 464028, 370059, 368185, 268319, 166583, 46055, -41411, -102196, -164806, -223083, -152551, -54822, 48857, 97002, -90804, -153326, -26865, 125830, 242945, 14117, -194952, -179450, -376616, -310306, -169678, 46259]
7401D6259L4028n9371J255L2355n3922J10276L6839r0177j32622J3705j11976
7390a73351N4930J96541L0797j33827k41979M619Q0806j00139j35847J22607J99537
7379i5306j30754O3075Q4641P0141q7616J66113l0289r5043m313M7479l3953l8762
7367h4587p3861j22074K18535J15484J05369K00401m5161k91832n3872M5622J66320
7356A80344O6496j06898j60319j88246k28574Q7430k3898j46927l4535L21361
7346b33766Q9033R6296J04064j49868k73943L4163M5325j09829j33367j32139
7336f64031J86578K58890J50472L48179J54833r9703p4400p5018k09964k60265
7326b84429p9992P3530K73154n0170k51315j10636m1293Q6321J73543j98089k5619
$$ y = [46259, 80287, 20916, 22171, 54526, 604, 110880, 147719, 57542, -75080, -61375, -173351, -118421, 78120, 108917, -24910, -266889, -262270, -181464, -281603, -417450, -294843, -95306, -226060, -162985, -78344, -8203, -95819, 70294, 40005, -55038, -59351, -11872, -45825, -84587, -158448, -280522, -61987, 53497, 158866, 359267, 314106, 22274, -31598, 14024, 180344, 246840, 139942, -20377, -208623, -437197, -349767, -373665, -520592, -555127, -233766, -144733, -48437, 55627, -94241, -368184, -334021, -288696, -398525, -531892, -664031, -477453, -218563, -68091, 280088, 434921, 335218, 260818, 185800, -24164, -284429, -364421, -290891, -17737, -67907, -319222, -429858, -471151, -384830, -211287, -409376, -434995]
7315d34995N7969j6100M1426L06813K9170q9982r3503j72753J95642O2753j72541
7304b86101L2964o5217K02047K10510n8780j04141j91157o7201Q8792J20983p9098
7293a96399M0587J16171m5046j2321M5154J33765J12793l345P9012J63333K6372
7282D60076J61309j87008j31689k1007k7539l1213q5974q3538J23554J08477m7294
7271B38154k2885k5399k0505Q2882j58462j94625J8172J7975J64871r481Q8029
7260A78726r9472k9646Q2188N4908N6355O8615J5296j39332o979j31080l50116
7249c00537O4072K14543l4699N731N1662R0279m4597j44575K15213N7806n6278
7238A18620J5613k35893j95495P5622J20066q8324j0385J67404R066J59140p7070
$$ y = [-434995, -377026, -393126, -351700, -44887, -15717, -105699, -199202, -371955, -176313, -113560, -286101, -253137, -318354, -116307, 94203, 35423, -68718, -259875, -327076, -238284, -117301, -196399, -155812, -39641, -84687, -97008, -51854, 81911, 194704, 191359, 270371, 433704, 460076, 621385, 434377, 302688, 281681, 254142, 222929, 136955, 53417, 176971, 285448, 238154, 215269, 189870, 169365, 252247, 93785, -100840, -82668, -64693, 100178, 90697, 178726, 79254, 49608, 131796, 186704, 243059, 311674, 326970, 187638, 180659, 49579, -300537, -236465, -21922, -56621, -50890, 772, 91051, 46454, -98121, 117092, 174898, 118620, 134233, -101660, -297155, -221533, -101467, -189791, -200176, -32772, -23706, 135434, 58364]
7227E8364j79899K45901R5694j7379p4986j00647J98225q4802j62506j00831j8534
7216a41400o1402K4852P6050J20602j00145J42925J06383l30114j53534J81584
7206a34199J71971k30014j55631L04968L75608J23768J92078j9892k07068k93662
7196A27927j34342p6984j03148J06407Q0348k12004j94020J57082L57073J21097
7186B29436r5000l40233r3678O5728J34697p6466m2731R6221J74969K7032K9347
7175A09322N589q2021J43274L36286k01388q8471k64057j28231Q7354K11786J07209
7164B36652o5012k08900j16366Q0494J35013K06010k7841k62122m1564r2483j44594
7153c00713l9108o3418N5109J47075O9537p1624K17315k4280K928J53154j44738
$$ y = [58364, -121535, 124366, 220060, 202681, 127695, 27048, 225273, 140471, -22035, -122866, -141400, -202802, -177950, -101900, 18702, -81443, 61482, 167865, -162249, -315783, -134199, 37772, -192242, -347873, -42905, 332703, 456471, 648549, 628657, 421589, 127927, -6415, -83399, -186547, -80140, 208, -211796, -405816, -248734, 108339, 229436, 134436, -205797, -299475, -233747, -99050, -175516, -218247, -122026, 52943, 79975, 109322, 114911, 32890, 176164, 512450, 311062, 222591, -41466, -169697, -82343, 129443, 236652, 171640, -37260, -153626, -73132, 61881, 267891, 240050, -22072, -63636, -156119, -300713, -339821, -403239, -348130, -201055, -131518, -203142, 14173, -10107, -7179, 145975, 1237]
7142A237k70649j1775j6709R9454j7177r5837q4624j4265L11021K62089J92869
7131C55634p5104k03686k27651Q1209l4517J86204R5181p3709k8574J7479J86432
7120B78898J04606M355L0002k9114j47580j2907P7958k37981J38584r838j92134
7109D849j57065O9696J70073J59036P3352M8030n9743k57701k70196J33543K43079
7098A56953M7052J29524l26476j5339J51662l0634k13390k17422J19155J39000
7088e9915N4015N9391j64255L6849J43913n9028q6829J294K49665j06950M1003
7077A09153j4163j79224r6894q8746K97850j16264j98104P6419P6449p3699R5249
7066a11974R6555j09667l5338P2027J6620J5660R7546J10038p6638J34113J53235
$$ y = [1237, -269412, -281187, -297896, -198442, -215619, -311456, -396080, -410345, -99324, 162765, 355634, 280530, 76844, -150807, -69598, -104115, 82089, 177270, 103561, 74987, 92466, 278898, 383504, 387859, 417861, 388747, 241167, 228260, 306218, 68237, 206821, 196983, 4849, -152216, -82520, 87553, 246589, 319941, 367971, 308228, 50527, -219669, -86126, 156953, 204005, 333529, 7053, -8286, 143376, 112742, -100648, -318070, -198915, -59915, -5900, 53491, -110764, -73915, 69998, 10970, -75859, -74565, 175100, 68150, 109153, 94990, -84234, -181128, -269874, 27976, -88288, -286392, -209973, -133524, -207223, -111974, -15419, -125086, -160424, -88397, -71777, -56117, 41429, 151467, 74829, 208942, 362177]
7055C62177J0924j35828j43987K11484m8680r3528J03855j21166m6977j73746
7045g5472j859j05933k30510K11845L62895K37145p7385q5933j96534J57565J64586
7034C60410j61515j71480j98319q5871J44651L1294K91269J0822j38745J23030
7024B05546M8638j7861K6614p786j09355j33908j0241q8134k77502J4224K08222
7013a41543K82273M9947k05564j12750J06597J68427J18336r5582J03579j29278
7003A44442k53297p10k5843j35389J96025K64266J06034j05446M8129Q514p9509
6992A67216M7432q4123O9030j33315n5893J30320Q3908j32030k17816J69843M27649
6981D72221j01567l92698j60859P4954p9034l63454J6971J47957L9644J74347
$$ y = [362177, 373101, 237273, 93286, 304770, 256090, 162562, 266417, 145251, 98274, -75472, -77331, -183264, -413774, -201929, 160966, 398111, 320726, 234793, 38259, 195824, 360410, 198895, 27415, -170904, -256775, -112124, -80830, 210439, 221261, 82516, 205546, 254184, 236323, 262937, 255151, 145796, 11888, 1647, -86487, -363989, -349765, -141543, 140730, 190677, -14887, -127637, -21040, 147387, 265723, 170141, 273720, 144442, -108855, -109565, -135408, -270797, -74772, 189494, 295528, 190082, 238211, 246725, 167216, 214648, 130525, 199555, 66240, 10347, 140667, 224575, 92545, -125271, 44572, 472221, 370654, -22044, -182903, -107949, -186983, -550437, -533466, -385509, -345865, -171518]
6971a71518J99481Q2852J64075J15525j25635k33965m4138J6152n7820J26100
6961G1109k12319l1729J70019k3410o061q4866l3633Q5761j31701r0067R1839
6950a95058J24121O8449O9004p7230j58429q275Q7232m5100k4483R5315j76093
6939b40547j78331M8466L20913o5906J12673r518j02099j24217P4685J61950o9581
6928g1512l3673J10675K44702R5737N7632j72222j86798p1844N384J40315N0925
6917A69321K4010l4912k60949J28J47438j10557q4554k026O1122m6657K454J23489
6905a1693m4201R6091k7591j04691j7487k4724J39136j46619m7514j751K687M4785
6893a43572j82830J01598K43039j89724j21228M6942M8438J83623l9012m5479
$$ y = [-171518, 27963, 110815, 274890, 390415, 264780, 30815, -13323, 2829, -54991, 71109, -141210, -172939, -2920, -26330, -32391, -117257, -150890, -65129, -196830, -286897, -195058, -70937, -2488, 66516, -10714, -169143, -177418, -90186, -135286, -159769, -64454, -240547, -418878, -370412, -49499, -115405, -2732, -12250, -114349, -238566, -163881, -1931, -71512, -105185, 5490, 250192, 345929, 403561, 231339, 44541, -27303, -21919, 118396, 169321, 193331, 158419, -102530, -102402, 45036, -65521, -150075, -152101, -90979, -137636, -135182, -11693, -55894, 40197, 12606, -92085, -109572, -134296, 4840, -141779, -189293, -191044, -188357, -143572, -326402, -224804, 18235, -171489, -292717, -245775, -197337, -13714, -52726, -98205]
6883i8205R4201j80578J27502N769J23094L09865R6255Q0746j64727l03926L4008
6872A24004J93993J84405j85013k06223l56595J47166R8701J06278r3991r0831
6862g8106l45170j02545K83575N5761K06254J56912j33346j54659o721K10031
6852I1986o9237Q9082l5626J33331J27462n6004J05290M5326l6358j4302L4195
6841D15145Q4198j92054r4077R2022k29542o5845j04980R675o8147P1739K58536
6830A76670p296R613L5078N6897r432l1936n1554P705m0404j9542k7900Q0363
6818A78262J46932N9413J52167Q774j5003r2311j83512l33o4562j24444J00623
6807A66006K15360P3128j13285K0338P5218Q2782Q5580j57104m1843M8153J36386
$$ y = [-98205, -4004, -184582, -57080, -51311, 71783, 381648, 477903, 558649, 393922, 89996, 124004, 317997, 502402, 317389, 111166, -245429, -98263, 438, 106716, 12725, -78106, -423276, -525821, -242246, -186485, 19769, 176681, 43335, -111324, -118045, 91986, 22749, 111831, 76205, 209536, 336998, 280994, 386284, 431610, 395252, 380950, 415145, 499343, 307289, 213212, 305234, 75692, 9847, -95133, -85458, -153605, -81866, 176670, 169374, 178987, 214065, 270962, 261530, 229594, 178040, 185745, 145341, 125799, 97899, 178262, 325194, 384607, 536774, 545548, 530545, 438234, 254722, 254389, 189827, 65383, 166006, 381366, 454494, 341209, 361547, 436765, 519547, 605127, 448023, 406180, 454333, 590719]
6796E90719O7217r9371L22447l5233J46485n4470k60816j7264Q3625O1639L4926
6785H39904m189j24375k242o245j88700K6199P8035k885j81093k3861Q0860r6317
6773C95091r3626r9879J27427J67380j57430m0645k540Q2230o5195o0997K2802
6762B74618j71880j17274k2921K9472K5440J92975L364p2979K55239P2893k5215
6751D43732j83756L1913j05488m497J0833L6720J65202m9177l0134K73168j506
6740E87010r5852j75521j31239r9421k01634P7947p746j10182J19405J67782M6101
6729A76650n8562P9296J57402l3501k96855j65213L824L16671o3845j433k5864
6718H8570J9528J96016K3376k25366o3563q9997j57225l2269k1060L35400J02292
$$ y = [590719, 657936, 558565, 881012, 845779, 992264, 937794, 676978, 659714, 743339, 804978, 839904, 835715, 711340, 709098, 702853, 514153, 540352, 618387, 615502, 434409, 410548, 491408, 395091, 301465, 201586, 329013, 496393, 338963, 298318, 295778, 378008, 312813, 251816, 274618, 102738, -14536, -37457, -7985, 17455, 210430, 213794, 140815, 396054, 468947, 443732, 259976, 291889, 186401, 181904, 192737, 229457, 394659, 345482, 315348, 588516, 587010, 491158, 315637, 184398, 84977, -116657, -38710, -46456, -156638, -37233, 130549, 176650, 118088, 197384, 354786, 321285, 24430, -140783, -136959, 179712, 115867, 114434, 88570, 108098, 304114, 327490, 102124, 38561, -51436, -208661, -240930, -261990, 73410, 175702]
6707A75702Q3526k04806j97469j34752L9359L2975K41188R8298L3194J16494j50676
6696A33033p0637O0539o970j20248j03911n4613R6607j05070J47668K05961R1731
6685B74090n3303M3227l7117r9698J17256n5996r7307J52301l5474J02416J0142
6674C20537j4712Q4903r4346j13593k0755j16940k5371P9344o938J15328J31570
6663C39027k06107N4495L5672l0546p1884j56415j47338P9487J13277j3565m7351
6652e1248m7227K2417J94598P8340P7608J86515N0555j15545j08177k48143j64712
6641a25019o8366J24696N5767j48699P2723J39867j85455K32158R5929K9686J73896
6630C97183N5268j79353k12492J5590J58773J269k72359j28387M2627J95404M6548
$$ y = [175702, 259228, 54422, -143047, -277799, -238440, -205465, 35723, 134021, 167215, 283709, 133033, 62396, 122935, 115965, -4283, -108194, -162807, -66200, -171270, -23602, 182359, 274090, 220787, 264014, 226897, 127199, 244455, 188459, 91152, 243453, 207979, 310395, 320537, 305825, 390728, 296382, 182789, 162034, 45094, 19723, 99067, 92129, 207457, 339027, 132920, 187415, 223087, 192541, 120657, -35758, -183096, -103609, 9668, -3897, -51248, -98475, -76058, 118540, 196880, 274488, 461003, 511558, 396013, 287836, 39693, -125019, -193385, -68689, -12922, -161621, -88898, 50969, -134486, 97672, 193601, 223287, 397183, 452451, 273098, 60606, 76196, 234969, 236238, -36121, -164508, -121881, 73523, 120071]
6619A20071R6963N050K26211L05964K93562O22675J354398J778517J426419M27148
6609F656978l41594j316630j402789j151031q26719p11327m10771l3534K04899
6600F67482R3103j68534J50453j17908r7375j49930j76245O9438j11273N0559
6590B09770J91364j7019R1256L0909k4317j05138n5079M9921j09182k30471n8233
6579b6219J13159M8259J72240J31456r5761j80854L0015N8799l2527p607j79181
6568C1779K48259K7170O0004j80915J67293Q9736k4675k80860r5379n0017k36773
6557b44378J9292p4123R4676L7719J09298L35639P2782j05103k11009Q7776o113
6546A16456K45017K416j57327j62973O1159L33983J45922l70540k60168j83071
$$ y = [120071, 217034, 222084, 448295, 754259, 1047821, 1670496, 3024894, 4803411, 6229830, 6656978, 6315384, 4998754, 3595965, 2444934, 1618215, 906888, 496117, 462583, 667482, 760585, 592051, 742504, 624596, 527221, 377291, 201046, 270484, 159211, 209770, 401134, 384115, 475371, 506280, 481963, 376825, 321746, 371667, 262485, 32014, -26219, 86940, 135199, 307439, 438895, 343134, 162280, 192295, 251094, 218567, 210960, 31779, 280038, 307208, 367212, 186297, 353590, 443326, 418651, 137791, 42412, -7605, -244378, -225086, -299209, -204533, -166814, -57516, 278123, 350905, 245802, 34793, 122569, 116456, 361473, 363889, 206562, 43589, 104748, 438731, 584653, 214113, -46055, -229126]
6536b29126p7203M0978J03725L6209l0885K34322O7765j43579J06395k9323L3878
6525A13156J1597L1610Q9780p4636k19066m0565n2858J64096Q50r2939K90655
6514B21680p7734n7978J3335O7101j26067P4763J01536n577j1170O005J49557
6503C55451J6769p3226j44661l69184r5804K50476K601j89891O3783k6916K3791
6492a86811l8030O5391J44250P6962J38153n7254L5414J40087k72254L6457J2973
6481I5338m147k0204j40175M7543J72330o8043k20580k8630K2758P2236L09002
6470B37428K46904m7658k27368p5280k58584q1452K71101r947K58J50178o6128
6459A39452j10837j31167K3243p879m9538O6647k3432j29738j45391J45098O9008
$$ y = [-229126, -306329, -265351, -161626, -125417, -156302, 78020, 145785, 2206, 108601, 79278, 113156, 124753, 156363, 246143, 171507, -47559, -88124, -140982, 23114, 23964, -68975, 221680, 143946, 85968, 99303, 166404, 40337, 115100, 216636, 211059, 199889, 205894, 355451, 372220, 298994, 154333, -214851, -310655, -60179, -57578, -247469, -183686, -210602, -186811, -224841, -159450, -15200, 61762, 199915, 142661, 178075, 318162, 45908, 82365, 95338, 91191, 70987, -69188, -21645, 150685, 82642, -137938, -166568, -143810, -71574, 237428, 484332, 436674, 209306, 134026, -124558, -206010, 65091, 55144, 55402, 205580, 139452, 28615, -102552, -79309, -87188, -136726, -70079, -93511, -223249, -368640, -223542, -154534]
6448a54534M5921j26326O8689K3212j0257k9520R7054J42713N3222l918q1949
6437B4307J70054N1245n2688j10340n7170j78514p0545J25873J93991k6054l2101
6426C8058J40831j45261j14861q4209j81422L27877M05357l2250o9773k07263
6416G7084j33973R9710J8118J0383J32548J24500J50565k08762j44437J06015
6406B31751J2670K518j05695o7817n2959N037J57779N8278k07738j86354N2624
6395i9906P9029J34187j9232l2886j12314K847Q2891N9492j06283q3277J3899
6384h1553Q1029K15528R3829k13769l19344k02266K73m1923L0126p2483P7706
6373d32847L65000L4353m9641O5610P5187J5079J0439L4092l24636j32909J6793
$$ y = [-154534, -108613, -234939, -166250, -143038, -153295, -182815, -85761, 56952, 110174, 106256, 24307, 194361, 245606, 192918, 82578, 25408, -153106, -223651, -97778, 96213, 70159, 38058, 178889, 33628, -81233, -165442, -346864, -18987, 386370, 354120, 284347, 77084, -56889, 42821, 60939, 71322, 203870, 328370, 478935, 270173, 125736, 231751, 244421, 246939, 141244, 73427, 20468, 25505, 183284, 241562, 33824, -152530, -99906, -20877, 113310, 94078, 61192, -51122, -48275, 34616, 94108, -12175, -95452, -81553, -524, 215004, 308833, 95064, -224280, -426546, -426273, -468196, -438070, -510553, -432847, -67847, -33494, -83135, -17525, 57662, 72741, 83180, 117272, -207364, -340273, -323480]
6362c23480K1693j7487J09244K02137R993j28595M4178j95455n8162K36895N5691
6351d3348n1088j7958L9254K2579j85203P959R6743j8735J48313J46753J75556
6340C20825L5788k84683k63054l6775J96352l723j820J63867J61934j21191k0334
6329A47186k912p5986k87686j7430p6494r739K01706J04911j70047n9694j02504
6318c48689j04771J27646J84538K60177O2075J06439j68685j89857J67186P7713
6308A73772N7656j23403r6768j01983J01794l3292j04515j17345p7159Q4395m1872
6297b78720M6266J38202m0710O0637J15314j19979o7456l9557N2583j99445k34634
6286e67499K18423J62299j6738J3198J17039J43789o8997J496O4702k5738J27909
$$ y = [-323480, -301787, -319274, -210030, -7893, 2100, -126495, -82317, -277772, -335934, -99039, -43348, -94436, -112394, -73140, -50561, -235764, -227805, -131062, -149797, -1484, 145269, 320825, 356613, 71930, -191124, -227899, -31547, -35270, -37090, 126777, 288711, 167520, 147186, 144274, 68288, -219398, -236828, -313322, -323061, -121355, -16444, -186491, -246185, -348689, -453460, -325814, -141276, 118901, 180976, 287415, 118730, -71127, 96059, 173772, 231428, 108025, 11257, -90726, 11068, -22224, -126739, -244084, -321243, -236848, -278720, -232454, -94252, -134962, -74325, 40989, -78990, -146446, -186003, -133420, -332865, -567499, -349076, -186777, -203515, -190317, -73278, 70511, 1514, 3010, 67712, 41974, 169883]
6275A69883m1797j39619m8114P8757M6371J61737k3499m4230j71075j36032Q1680
6264f5938R6918K14717J32312j11220j70711q557M4598q9344K4529j50438j8259
6253a01393J03174J96448L5015j51872j35548r3378j69976N7176N5899K67671
6243F3216J19802j91030j68837j8627o5750J75795K64303n2854r5953L6371J41446
6232B07882j83237j08655k8975J13795N2144p8701p7204O6801K09938j44587j17212
6221h8011J4294m7532J64552n833j23778J8755k1323j2057J77250O8551n9807
6210H5061j90154m0695P578J02050L46906J83977n8602m2733J10918J24384r9372
6199E29318j52838P1525p7768j06864O6049N2063J6338l66320l10472K814J94367
$$ y = [169883, 128086, -11533, -59647, 19110, 65481, 227218, 203719, 159489, -11586, -147618, -65938, 30980, 245697, 378009, 266789, 96078, 87521, 132119, 42775, 67304, -83134, -101393, 1781, 198229, 233244, 81372, -54176, -147554, -317530, -260354, -204455, 63216, 183018, -8012, -176849, -195476, -261226, -85431, 178872, 126018, 30065, 66436, 207882, 24645, -84010, -112985, 810, 52954, -25747, -102951, -36150, 173788, 29201, -88011, -73717, -121249, 43303, 37470, -86308, -67553, -88876, -100933, 76317, 144868, 85061, -105093, -145788, -138210, -36160, 310746, 494723, 436121, 393388, 504306, 628690, 529318, 376480, 448005, 370237, 263373, 329422, 381485, 397823, 31503, -278969, -276155, -81788]
6188h1788P2575j97995q2968J90497m8301k44447M6315Q9268j97040j560K87545
6177a67899J13664O2284K8030q7397K8004o3684J56438K5492j02559k4859N8959
6166B6473K4974J61748J55077J33764J17607l55170k30334n7351L0883M6216k09422
6155a55535J82358J56396J33416j66066j01497p8990N5489O3316N5651L8387J2382
6144A95307j58209p6138K83868J59477l39436O7896J82634J05059K13514j60202
6134D73770k57499j55692L6288J17321k04676K9383k1245l4290j59141j47759
6124c23540P4657K19130L12496L2272k34260L5412R6490j0541j31608k40185M1542
6113a28135R9427l2874J83679J9104j17000r5097J77027J76288o8448P2270n2686
$$ y = [-81788, -9213, -207208, -290176, -99679, -147980, -392427, -346112, -256844, -453884, -455444, -167899, -54235, 8049, 36079, -51318, -23314, -86998, 69440, 94932, -7627, -32486, 26473, 51447, 213195, 368272, 502036, 619643, 264473, 34139, -23212, 7671, 53887, -155535, 26823, 183219, 316635, 150569, 49072, -29918, 25571, 88887, 144538, 182925, 195307, 37098, -39040, 244828, 404305, 64869, 132765, 315399, 420458, 633972, 473770, 216271, 60579, 96867, 214188, 9512, 38895, 17650, -16640, -175781, -323540, -248883, -29753, 282743, 315015, 80755, 116167, 212657, 202116, 70508, -169677, -128135, -28708, -61582, 122097, 141201, 24201, -70896, 106131, 282419, 213971, 286241, 233555]
6102B33555K2031P431j46131j79805j4049N5485j54443J3706j14382k9912q021
6091c14535J18045J45401j6837k80432j53964P4942L9196O9438J04840O5562J93508
6080D5164Q2778O6042N0702r8579q0424R5891j4960J64182J17607k69727k3363
6069A35313J09601q9286M5281l3887p219P2934q452J6282j27024p1940m3157o6729
6057f8283q5727P4610q2074M952p193L311R7776J85211Q3062J22698M1244q2627
6045B86960j79825m6089j27166J95640J2113j51844J7005l390p6448K93538N5756
6034B76250k49483k63354Q0669m046L7714J27960o5163j86643l4585O5523N4024
6023a61134N5556R3297j9291q4749J1099J09124M239o5952j58135k13591N2343
$$ y = [233555, 255586, 263017, 116886, -62919, -76968, -21483, -175926, -162220, -276602, -306514, -314535, -196490, -51089, -67926, -348358, -502322, -427380, -388184, -318746, -213906, -148344, 45164, 127942, 193984, 244686, 146107, 65683, 161574, 146614, 310796, 428403, 158676, 135313, 244914, 155628, 200909, 167022, 159803, 232737, 224285, 240567, 113543, 41603, -1554, -68283, -154010, -79400, -161474, -156522, -163715, -160404, -62628, 122583, 205645, 328343, 369587, 286960, 107135, 61046, -66120, 129520, 141633, -10211, 6794, 3404, -73044, 220494, 276250, 26767, -236587, -155918, -159964, -122250, 5710, -59453, -246096, -280681, -215158, -161134, -105578, -12281, -31572, -116321, -105222, 3902, 8141, -57811, -215946, -429537, -377194]
6012c77194R4779J57436M0648l3945K38897l0968j76367j09551K16726K23546
6002B44007R8682o3362k73125M6043j70459k71843o7l5918q7331M4441K22737
5991b46195J78966l2075K1664o6194K1475J21339k8494N972J12000j84183k69162
5980c64887l18037m7226Q8407K23969J63288r2269L6598k1086l8694J07900J40553
5969a21484k8441l02160j24394K86574M584j03128K99162L05016J63190k7647
5959C51272j60611o6428J74278n2184P9183K3423q4767k15963m42250j63502J60955
5948c96594J32303J29610j3295m3834j9709L9959J29687m2697N7856j55409j2176
5937a94299N0326m162K225O0479J05074J33107q5804p7057Q48J06701Q2128P4235
$$ y = [-377194, -282415, -124979, -84331, -118276, 120621, 89653, -86714, -196265, 20461, 244007, 342689, 279327, 6202, 52245, -118214, -390057, -390124, -426042, -513373, -468932, -246195, -67229, -99304, -77640, -143834, -122359, -1020, -29514, -23542, 88458, -95725, -364887, -682924, -730150, -641743, -417774, -254486, -346755, -310157, -331243, -369937, -262037, -121484, -149925, -452085, -576479, -289905, -285321, -388449, -89287, 215729, 378919, 351272, 190661, 124233, 298511, 246327, 325510, 348933, 264166, 48203, -394047, -557549, -396594, -264291, -134681, -147976, -191810, -211519, -171560, -41873, -84570, -26714, -182123, -194299, -143973, -148135, -145910, -85431, 19643, 152750, 66946, -10111, -9263, 97438, 179566, 253801]
5925B53801j82359p7426j23970p051J7084j46824L8644K06251O6532J05928R052
5914A59662j31520K7778K3572j97798k00911l1555J11382j71429P973Q8173J30361
5903a84312j98706j43246P6182q1876L1508L53261j1240O4599R4862j5122k39822
5892b53912k41925N0489K64460J53263m017l6900l0759j18652P3650L45274K49810
5881D50781L115j95750j08830j5198J93692J49994j11697j82038N1110j02404
5871A32775N9303K1649j75686j39815N2525K02573m4332l64238q7337l7868J82703
5860a97748L31858j09868j34314J68781J06607Q6314j37002j16960j8642P6423
5850E5449L7194J01015L11776k7918j31617j73385j93062L1388J97259J21252
$$ y = [253801, 71442, -5984, -129954, -137005, -119921, -266745, -228101, -21850, 44682, 150610, 159662, 28142, 55920, 79492, -118306, -319217, -350772, -239390, -410819, -402846, -314673, -184312, -383018, -526264, -450082, -531958, -500450, -147189, -158429, -93830, 1032, -14090, -253912, -495837, -445348, -180888, -27625, -31642, -68542, -99301, -217953, -144303, 200971, 450781, 453896, 258146, 149316, 134118, 327810, 477804, 366107, 184069, 235179, 132775, 192078, 213727, 38041, -101774, -49249, 153324, 108992, -255246, -342583, -380451, -197748, 134110, 24242, -110072, 58709, 165316, 251630, 114628, -2332, -20974, 55449, 92643, 193658, 505434, 477516, 345899, 172514, -20548, 10840, 208099, 329351]
5840C29351r3692Q8716j10647K0667q9587k08172l0041J05422N8555K02609O947
5829B80128O1859q7864n8896j83053k31871P925L44346P3475L0233P8913j6622
5818B98573k58129k76802j83814J61035K32299L4029K8339L5447O4618k07814
5808g2219n5392K2884J27702K26349J07729J40522R7735j32540k50025k21462
5798h717j20906j8804p2792m9490r738J07848K59933r333j10829L429q3561N3809
5786e9151K1977J73265K24309M0583m54900l08368K90735J25799l3635J12538
5776A33152o3161j04803M0689L3589N3679N6377J8815l8071j709j15417L980J40333
5764A57453o548j19820Q881K06426J13996k55011n0220l15761j19980K39009J35092
$$ y = [329351, 235659, 324375, 213728, 234395, 144808, -63364, -93405, 12017, 70572, 273181, 280128, 341987, 254123, 195227, 12174, -219697, -211772, 132574, 206049, 236282, 315195, 298573, 40444, -236358, -420172, -259137, -26838, 7191, 35530, 70977, 135595, -72219, -127611, -104727, 22975, 249324, 357053, 497575, 595310, 462770, 212745, -8717, -129623, -148427, -221219, -270709, -280447, -172599, 87334, 78001, -32828, -29399, -112960, -59151, -37174, 136091, 360400, 400983, -53917, -362285, -71550, 54249, 20614, 133152, 69991, -34812, 5877, 39466, 93145, 149522, 168337, 130266, 128557, 13140, 17120, 157453, 150905, 31085, 39966, 246392, 360388, 105377, 55157, -260604, -380584, -141575, -6483]
5753f483p8164k95236J53833O2821q7804o7341J0595j54872K23826M9450K8889
5742a60486K09911J3329j31237n5417q8267Q0499R6988l4187q3260m2394K02905
5731H384j60633o5331J11621k2263J89948M9743J8849J58925o3249q5275j15124
5720B5595n2596J97775J13902O0890M4825p2939n4437J46890j0059K4087J5522
5709D39455j36657p9217k08987o8069J59674R231o1043K56446J5720j24824j51320
5698E0409J08612K7880o6891j78311k19287L867k608r9257L09433o0039J35083
5687H891j32887J75149J25103O2920j71581o1907J11544N3340O351q4789l17457
5676b25323Q8438J04138l5721k4227l3684q5224j15891J96125O5554J49427n8444
$$ y = [-6483, -84647, -379883, -226050, -163229, -251033, -318374, -307779, -462651, -238825, -189375, -160486, 49425, 62754, -68483, -123900, -212167, -131668, -34680, -68867, -152127, -194521, 8384, -152249, -217580, -105959, -128222, 61726, 111469, 130318, 289243, 225994, 140719, 25595, -27001, 170774, 284676, 345566, 390391, 317452, 263015, 409905, 399846, 423933, 439455, 302798, 223581, 14594, -53475, 106199, 115430, 54387, 310833, 326553, 201729, 50409, 159021, 186901, 120010, -58301, -277588, -273721, -276329, -375586, -66153, -126192, 8891, -123996, 51153, 176256, 239176, 67595, 5688, 117232, 170572, 176923, 92134, -225323, -136885, -32747, -68468, -92695, -126379, -211603, -327494, -131369, -65815, 83612, 25168]
5665B5168j41973k4169k990J68292M6316K8830k2240p9807J06227j01730j28533
5654a26609k4312j90908R518L00540J49613r2405m8947J23551K57936L1214k22280
5643A66911k59114j84135j09319R2020R1819O7628Q8976J05861k22809K8471l9297
5632a72988j55596n4684J79646K03089o549K5384J02594J20484J16197k32413
5622A25164L7290n1325j71728J59452K6440n4854k9574M3355J00031j26172l74039
5611c15960l09304L12139K45528J18055k09160Q868P4484K8758J04955M3670J37882
5600B39915j47594j04557l2961l1987j9096J10991J02973j2475O9680j38563j37505
5589a01179j61678n8219J88095N7688J05942O7081K85691N433K8164M8929n0629
$$ y = [25168, -116805, -140974, -143964, 24328, 70644, 99474, 77234, -2573, 103654, 1924, -126609, -150921, -341829, -332311, -31771, 117842, 25437, -23510, 100041, 357977, 389191, 166911, -92203, -276338, -385657, -293637, -201818, -134190, -45214, 60647, -162162, -133691, -172988, -328584, -383268, -203622, -533, -7082, 18302, 120896, 241380, 357577, 125164, 162454, 111129, -60599, 98853, 125293, 70439, 40865, 84220, 184251, 58079, -315960, -625264, -313125, -67597, 50458, -158702, -149834, -75350, -46592, 58363, 102033, 239915, 92321, -12236, -45197, -77184, -96280, 14711, 117684, 105209, 174889, 36326, -101179, -262857, -321076, -132981, -75293, 30649, 97730, 383421, 388854, 417018, 465947, 415318]
5578D15318j47631M5036Q6410k51087l28940M1671J46652J65724j06696l7795
5568B8662K5244q7986j18267j12067L5846O6483j28730n2280K18585K5359n8572
5557a57723J80591J04990k22239j99399J05340K71380j14173n2952J44702J30625
5547A91142J28610J5039n4530j14547k382R6408J86156k18918k01671o8040J86308
5536A43575K3733m7394Q6334N4939l5521J13259l6392n2419j872J7407o6502p0559
5524A28588p1607J316p401k04502o6420J86718r8657P6920M5727J05123N482o3192
5512C8095l774J02693j39299j1884J12238O4724J27400o1792l33350j24568K09813
5501a9704M5566J19720J18901J0480j03066j49730M0523J54698P6823L4554j38775
$$ y = [415318, 267687, 312723, 399133, 148046, -180894, -139223, 7429, 173153, 66457, 28662, 53906, -34080, -152347, -264414, -228568, -162085, -290815, -343095, -124510, -99151, -157723, 22868, 127858, -94381, -293780, -188440, 82940, -31233, -84185, 60517, 191142, 319752, 334791, 280261, 165714, 163332, 259740, 445896, 226978, 25307, -42733, 143575, 167308, 119914, 206248, 261187, 225666, 338925, 302533, 250114, 248242, 265649, 199147, 128588, 56981, 58297, 50896, -153606, -220026, -33308, -131965, -55045, -9318, 95805, 101287, 38095, 34321, 137014, -2285, -14169, 98069, 162793, 290193, 228401, -104949, -229517, -19704, 25862, 145582, 264483, 274963, 171897, 22167, 62690, 217388, 294211, 328765, 189990]
5490A89990j24268J55751j42804l63011j17855J32376L27137L87021o6127j38696
5480B39514q5399o7701q3758m3284o2558n8561j01578j6810R5532O4776J33662
5469A3835j54719k0987Q6265J1617J41231N0257j36777j31802K19598p193j24222
5458e2897j80875M3211J27188J7433k742q3297O3451Q7J06781o735l449M6357
5446G4513j55594p8749J10545N4908n2855J35585J09976j36167k08354o0185K46735
5435D0358J34025k40941j59328N2325J29885K48486N5480K3142K7159n1689k74320
5424a5418p2670k1771J05059J31241O8992n8783q4808J70845J18346k69465l09173
5413b37605o6245J01037L7232J13928j22092k95801k74710K58898K28274l4614
$$ y = [189990, 65722, 221473, 78669, -284342, -402197, -269821, 57316, 444337, 378210, 239514, 154115, 86414, 2656, -40628, -103186, -161747, -263325, -280135, -184603, -119827, 13835, -140884, -161871, -75606, -63989, 77242, 127499, -9278, -141080, 78518, 71325, -52897, -233772, -190561, -63373, -45940, -48682, -131979, -68528, -68441, 38340, 31605, 28156, 74513, -81081, -159830, -49285, 5623, -47232, 88353, 198329, 62162, -146192, -206377, 40358, 174383, -66558, -225886, -173561, -43676, 204810, 260290, 283432, 310591, 258902, -15418, -88088, -109859, -4800, 126441, 195433, 136650, 51842, 222687, 341033, 71568, -237605, -303850, -202813, -165581, -51653, -173745, -469546, -744256, -485358, -257084, -291698]
5403b91698K76293J68987n414k0812j52413n5093J37575K18675j1372r0921n5034
5392A18773p888k4832J72672K22496j07866j49627M1877j10316O3187k46635J24445
5381I6286K21662k3879k03054l02922o4674J58954J4349j9888k0139o9255j63002
5370c75562Q0558M9404m2664J05425J61964J23202p488m5591K8975K26822J15973
$$ y = [-291698, -15405, 153582, 148168, 127356, -25057, -80150, 57425, 276100, 264728, 173807, 118773, 110885, 86053, 258725, 481221, 373355, 223728, 265605, 155289, 218476, -28159, 96286, 317948, 294069, 91015, -211907, -276581, -117627, -103278, -123166, -143305, -212560, -375562, -295004, -245600, -288264, -182839, -20875, 102327, 94839, 49248, 78223, 305045, 421018]
$$ [...]
##END NTUPLES=NMR SPECTRUM
##END=
